##TITLE=Analysis number 321785
Compound Code cc 36513
Book Reference 468/149/6
Project Code adrs
Chemist Name colinb
##JCAMPDX= 6.0         $$ Bruker NMR JCAMP-DX V2.0
##DATA TYPE= NMR SPECTRUM
##DATA CLASS= NTUPLES
##ORIGIN= Bruker BioSpin GmbH
##OWNER= nmr
$$ XWIN-NMR		Version 3.5
$$ Fri Aug 25 13:26:08 2006 GMT Daylight Time (UT+1h)  MAYBRIDGE\nmr@NMR_250MHZ
##.OBSERVE FREQUENCY= 250.131544655141
##.OBSERVE NUCLEUS= ^1H
##.ACQUISITION MODE= SIMULTANEOUS (DQD)
##.ACQUISITION SCHEME= undefined
##.AVERAGES= 16
##.DIGITISER RES= 18
##SPECTROMETER/DATA SYSTEM= dpx250
##.PULSE SEQUENCE= zg30
##.SOLVENT NAME= CDCl3
##.SHIFT REFERENCE= (INTERNAL, CDCl3, 0, 16.522)
##AUDIT TRAIL= $$ (NUMBER, WHEN, WHO, WHERE, WHAT)
$$ ##TITLE= Audit trail, XWIN-NMR		Version 3.5
$$ ##JCAMPDX= 5.01
$$ ##ORIGIN= Bruker BioSpin GmbH
$$ ##OWNER= nmr
$$ C:\u/data/dgb/nmr/ADRS/1680/pdata/1/auditp.txt
$$ ##AUDIT TRAIL=  $$ (NUMBER, WHEN, WHO, WHERE, WHAT)
(   1,<2006-08-25 13:25:49.81 +100>,<MAYBRIDGE\nmr>,<NMR_250MHZ>,
      <created by zg, POWCHK disabled, PULCHK disabled
       configuration hash MD5:
       E2 DF 36 D8 04 B2 41 60 5A D7 A3 38 5A 4B D0 FE
       data hash MD5: 64K
       26 26 2F 9A AA AB C4 40 86 EB 2C 0F 4D AF C7 05>)
(   2,<2006-08-25 13:25:57.84 +100>,<MAYBRIDGE\nmr>,<NMR_250MHZ>,
      <Start of raw data processing
       ef LB = 0.3 FT_mod = 6 PKNL = 1 SI = 32K 
       data hash MD5: 32K
       9A 2F 79 13 D0 23 84 77 3B 82 14 6C 1D 53 0B C7>)
(   3,<2006-08-25 13:25:59.79 +100>,<MAYBRIDGE\nmr>,<NMR_250MHZ>,
      <apk 
       data hash MD5: 32K
       23 3E 17 22 FD BF C0 55 BB 88 D6 59 59 4A A8 CC>)
(   4,<2006-08-25 13:26:01.08 +100>,<MAYBRIDGE\nmr>,<NMR_250MHZ>,
      <abs ABSG = 5 
       data hash MD5: 32K
       50 C3 7C FC A5 FF 87 8B 19 73 9F F4 14 27 B3 3F>)
$$ ##END=
$$ 
$$ hash MD5
$$ AE 60 23 06 9F A6 C4 04 EA 8A EC 63 75 5C 3F 6A
##$RELAX= 
##$RELAX= 
##$RELAX= 
##$RELAX= 
##$RELAX= 
##$RELAX= 
##$RELAX= 
$$ Bruker specific parameters
$$ --------------------------
##$DU= <C:\u>
##$EXPNO= 1680
##$NAME= <ADRS>
##$PROCNO= 1
##$TYPE= <nmr>
##$USER= <dgb>
##$AMP= (0..31)
100 100 100 100 100 100 100 100 100 100 100 100 100 100 100 100 100 100 
100 100 100 100 100 100 100 100 100 100 100 100 100 100 
##$AQSEQ= 0
##$AQ_mod= 3
##$AUNM= <au_zg>
##$AUTOPOS= <26 >
##$BF1= 250.13
##$BF2= 250.13
##$BF3= 250.13
##$BF4= 250.13
##$BF5= 500.13
##$BF6= 500.13
##$BF7= 500.13
##$BF8= 500.13
##$BYTORDA= 1
##$CFDGTYP= 0
##$CFRGTYP= 5
##$CHEMSTR= <none>
##$CNST= (0..31)
1 1 145 1 1 1 1 1 1 1 1 1 1 1 1 1 1 1 1 1 1 1 1 1 1 1 1 1 1 1 1 1 
##$CPDPRG= <>
##$CPDPRG1= <>
##$CPDPRG2= <>
##$CPDPRG3= <>
##$CPDPRG4= <mlev>
##$CPDPRG5= <mlev>
##$CPDPRG6= <mlev>
##$CPDPRG7= <mlev>
##$CPDPRG8= <mlev>
##$CPDPRGB= <>
##$CPDPRGT= <>
##$D= (0..31)
0 1 0 0 0 0 0 0 0 0.06 0 0 0 0 0 0 0.0002 0 0 0 0 0 0 0 0 0 0 0 0 0 0 
0 
##$DATE= 1156508675
##$DBL= (0..7)
120 120 120 120 120 120 120 120 
##$DBP= (0..7)
150 150 150 150 150 150 150 150 
##$DBP07= 0
##$DBPNAM0= <>
##$DBPNAM1= <>
$$ [...]
##$SUBNAM7= <"">
##$SUBNAM8= <"">
##$SUBNAM9= <"">
##$SW= 20.6930455092707
##$SWIBOX= (0..15)
0 0 3 0 0 0 0 0 0 0 0 0 0 0 0 0 
##$SW_h= 5175.983436853
##$TD= 65536
##$TD0= 1
##$TE= 295.16
##$TE2= 300
##$TE3= 300
##$TEG= 300
##$TL= (0..7)
0 120 120 120 120 120 120 120 
##$TP= (0..7)
150 150 150 150 150 150 150 150 
##$TP07= 0
##$TPNAME0= <>
##$TPNAME1= <>
##$TPNAME2= <>
##$TPNAME3= <>
##$TPNAME4= <>
##$TPNAME5= <>
##$TPNAME6= <>
##$TPNAME7= <>
##$TPOAL= (0..7)
0.5 0.5 0.5 0.5 0.5 0.5 0.5 0.5 
##$TPOFFS= (0..7)
0 0 0 0 0 0 0 0 
##$TUNHIN= 0
##$TUNHOUT= 0
##$TUNXOUT= 0
##$USERA1= <user>
##$USERA2= <user>
##$USERA3= <user>
##$USERA4= <user>
##$USERA5= <user>
##$V9= 5
##$VALIST= <valist>
##$VCLIST= <CCCCCCCCCCCCCCC>
##$VD= 0
##$VDLIST= <DDDDDDDDDDDDDDD>
##$VPLIST= <PPPPPPPPPPPPPPP>
##$VTLIST= <TTTTTTTTTTTTTTT>
##$WBST= 1024
##$WBSW= 4
##$XGAIN= (0..3)
0 0 0 0 
##$XL= 0
##$YL= 0
##$YMAX_a= 419741
##$YMIN_a= -505198
##$ZGOPTNS= <>
##$ZL1= 120
##$ZL2= 120
##$ZL3= 120
##$ZL4= 120
##$ABSF1= 16.522
##$ABSF2= -4.171173
##$ABSG= 5
##$ABSL= 3
##$ALPHA= 0
##$AQORDER= 0
##$ASSFAC= 0
##$ASSFACI= 0
##$ASSFACX= 0
##$ASSWID= 0
##$AUNMP= <proc_1d>
##$AZFE= 0.1
##$AZFW= 0.1
##$BCFW= 0
##$BC_mod= 0
##$BYTORDP= 0
##$COROFFS= 0
##$CY= 12.5
##$DATMOD= 1
##$DC= 0
##$DFILT= <>
##$DTYPP= 0
##$F1P= 14.0000005364418
##$F2P= -0.99999901652339
##$FCOR= 0.5
##$FTSIZE= 32768
##$FT_mod= 6
##$GAMMA= 0
##$GB= 0
##$INTBC= 1
##$INTSCL= 1
##$ISEN= 128
##$LB= 0.3
##$LEV0= 0
##$LPBIN= 0
##$MAXI= 10000
##$MC2= 0
##$MEAN= 0
##$ME_mod= 0
##$MI= 0
##$NCOEF= 0
##$NC_proc= -4
##$NLEV= 6
##$NOISF1= 0
##$NOISF2= 0
##$NSP= 0
##$NTH_PI= 0
##$NZP= 0
##$OFFSET= 16.522
##$PC= 1
##$PHC0= 150.1019
##$PHC1= 4.913317
##$PH_mod= 1
##$PKNL= yes
##$PPARMOD= 0
##$PSCAL= 4
##$PSIGN= 0
##$REVERSE= no
##$SF= 250.13
##$SI= 32768
##$SIGF1= 0
##$SIGF2= 0
##$SINO= 400
##$SIOLD= 32768
##$SREGLST= <1H.CDCl3>
##$SSB= 0
##$STSI= 32768
##$STSR= 0
##$SW_p= 5175.98343685301
##$SYMM= 0
##$S_DEV= 0
##$TDeff= 65536
##$TDoff= 0
##$TI= <Analysis number 999999
Compound Code 99
Book Reference 9
Project Code 9>
##$TILT= no
##$TM1= 0
##$TM2= 0
##$TOPLEV= 0
##$USERP1= <user>
##$USERP2= <user>
##$USERP3= <user>
##$USERP4= <user>
##$USERP5= <user>
##$WDW= 1
##$XDIM= 32768
##$YMAX_p= 338814453
##$YMIN_p= -229721
$$ End of Bruker specific parameters
$$ ---------------------------------
##NTUPLES= NMR SPECTRUM
##VAR_NAME=  FREQUENCY,     SPECTRUM/REAL,   SPECTRUM/IMAG
##SYMBOL=    X,             R,               I
##VAR_TYPE=  INDEPENDENT,   DEPENDENT,       DEPENDENT
##VAR_FORM=  AFFN,          ASDF,            ASDF
##VAR_DIM=   32768,         32768,           32768
##UNITS=     HZ,            ARBITRARY UNITS, ARBITRARY UNITS
##FACTOR=    0.157963299565203, 1,           1
##FIRST=     4132.6476996994, 0,             0
##LAST=      -1043.33573715361, 0,           0
##MIN=       -1043.33573715361, -229721,     0
##MAX=       4132.6476996994, 338814453,     0
$$ Real data points
##PAGE= N=1
##DATA TABLE= (X++(R..R)), XYDATA
$$ [...]
22652 -44330 -29745 -57772 -79182 -1272 55178 39243 -21732 -42706 -26602 -15309 14345 48236
22640 48236 -3596 -35522 -46172 -7548 14375 75127 86366 78766 39775 -2274 3707 -33659
22628 -33659 -16455 40616 53166 27890 35135 21947 -13985 31488 43114 82784 97370 54791
22616 54791 18425 46053 20741 33180 16273 6630 -24368 -36457 -74145 -65071 -81797 -111254
22604 -111254 -117434 -103622 -56885 -10067 -32595 -61091 -43573 -13974 15284 -22975 -30919 -30224
22592 -30224 -9154 1700 13265 -8670 42980 103733 142457 95896 27721 2390 40661 9792
22580 9792 -37172 -17962 5367 5838 -51687 -67547 -45286 -9169 -4823 24938 -2570 -50577
22568 -50577 -73038 -19500 12403 -47664 -80064 -54589 -77539 -91906 -12884 69102 89783 62618
22556 62618 97648 68712 66290 50944 26985 5389 36523 35705 43765 79879 106289 40375
22544 40375 30007 19348 -34095 -71778 -32457 42994 49518 59145 68294 33032 -33129 -61415
22532 -61415 -64734 -53605 -90036 -82955 3776 50857 55525 107662 92527 -8873 -84395 -37630
22520 -37630 -21127 -22398 -10635 -27676 -49622 -56370 -33669 15020 37567 59932 61738 65401
22508 65401 62762 38300 -18202 -68654 -61950 -29406 4528 46584 88458 51851 -5750 1467
22496 1467 4591 -17510 -5057 50275 37621 10997 63122 82284 66840 64717 77336 56184
22484 56184 31612 13174 -19404 -58152 -54130 -78008 -92155 -48473 -73659 -110135 -11101 -55
22472 -55 28861 84078 93962 43305 35316 46289 73639 64316 38534 65518 -1864 -77646 -74476
22459 -74476 -4981 35746 44371 37154 12305 -2286 18662 -19839 -43350 -24037 8803 -19234
22447 -19234 -23142 -55686 -82478 -105274 -101649 -108711 -96065 -82244 -43611 17617 82438 106685
22435 106685 82754 71287 73244 48542 47007 24391 9213 -27337 -47536 -75156 -98263 -18380
22423 -18380 -35745 -37096 -10284 34534 56846 1476 -46443 -68128 -68266 -58674 31632 41459 48423
22410 48423 54706 25502 50550 61165 32904 28254 34615 35588 -23691 -36235 -2267 21757 -14629
22397 -14629 -64312 -16663 8159 24345 -16235 -19150 -40998 -116213 -121126 -84471 -4399 35645
22385 35645 39438 5358 21420 52391 21883 5800 -86280 -195515 -229721 -169193 -80331 17874
22373 17874 84449 106672 61305 21707 -23480 -49905 -4985 35923 -11363 15984 23445 12688
22361 12688 -7517 19837 61279 43401 52813 29892 28396 9269 -26435 -13737 -4578 29377
22349 29377 6888 48750 25143 -35595 -54935 -77770 -91170 -53580 -2580 49288 90903 69944
22337 69944 30387 487 -64991 -37587 -2217 19699 23769 69081 107417 62585 25697 46015
22325 46015 22860 -33285 -46497 -33893 -67073 -70423 -39305 39745 85702 12439 11998 60149
22313 60149 18223 -20217 -63988 -51777 -36060 -73506 -36387 -6638 -65410 -137094 -139610 -94486
22301 -94486 -60678 -61175 14917 47963 36874 12917 -28902 -54520 -2992 26639 37105 29332
22289 29332 76232 19314 4442 -20059 -48563 -40493 2823 27296 34068 40084 19949 61758
22277 61758 54128 38051 41222 40582 40827 73557 98905 134289 130460 70368 23212 17427 -9861
22264 -9861 -5561 -10487 -11504 -13975 -1284 -22535 -37587 -36053 -76115 -66655 -7103 9163 -34470
22251 -34470 3757 53916 20124 -12991 -34533 -52716 -33417 20789 33422 1042 -58401 -54443
22239 -54443 -12344 -15519 -46665 -17726 -3358 -47276 -135060 -148394 -82666 -8536 5406 69514
22227 69514 85386 7053 -83200 -92957 -40086 -69829 -53166 -25995 7509 -60506 -56328 -41439
22215 -41439 -75923 -55220 -11892 4094 4348 1648 -39306 -52409 -26204 2738 23303 49414
22203 49414 53628 63241 90560 17280 -30768 -74939 -100883 -96021 -56608 -42073 -67602 -27282
22191 -27282 -8224 -25066 30225 90152 15186 -46766 -67490 -18672 -38664 -33835 -74005 -146301
22179 -146301 -96940 -19234 6857 -23953 16365 -111 -27501 18222 26836 -3659 39945 54140
22167 54140 10255 6589 10160 23276 24035 -5599 -48204 -39989 1223 -10779 -77626 -69757 -43447
22154 -43447 40577 71875 75001 51157 28600 -45043 -106180 -72981 -12274 4982 -33290 -62252
22142 -62252 -44175 -3001 46756 402 -343 64141 93091 36774 15053 -44293 -77402 -54747
22130 -54747 -37054 -85494 -101355 -99543 -129750 -107172 -24088 64828 41195 36079 80215 56511
22118 56511 30489 -7862 -10640 50257 27548 -4993 -1218 -38710 -35532 6967 1568 11609
22106 11609 10623 44225 13815 10079 17818 10415 55096 63645 58189 20679 -42952 -95654 -95387
22093 -95387 -101335 -30053 1723 -25012 -212 35588 11250 32177 31103 5527 -30854 16069
22081 16069 58084 34293 -15509 -31424 -67987 -30203 -15498 10278 -16959 70193 144978 131975
22069 131975 33933 -46862 -109389 -133117 -71635 -11429 -66454 -53754 -80100 -82926 -90269 -117986
22057 -117986 -49440 -13443 5954 -11789 -15040 -26064 -63841 -71529 -127195 -124757 -117061 -153963
22045 -153963 -164150 -185827 -137225 -88424 -85730 -58227 -26785 10539 36744 54051 63578 57764
22033 57764 45426 12973 44146 37542 5097 -41397 -34713 21681 33225 12810 68190 58993
22021 58993 52343 45967 22829 22269 13089 62116 115930 127517 93551 114970 108569 97305 86794
22008 86794 82372 87137 91530 86776 95941 32118 -55003 -99770 -95148 -134271 -89308 -54643 -48208
21995 -48208 -104841 -72844 -48791 -121102 -82578 -47255 -11238 8215 -27292 11518 47597 45730
21983 45730 107727 105286 99614 58411 -4328 -63185 -76083 -54392 -31758 -35089 -25833 -25064 -46187
21970 -46187 -50464 -60407 -9465 -2653 -59411 -24939 -4952 2653 27370 39148 3453 -12973
21958 -12973 -21562 -92 28962 36845 5114 9947 -40911 -63504 -27564 -63180 -65601 -29555
21946 -29555 -11155 -39268 -9865 -15702 -35283 -130689 -134663 -57546 19621 12958 1040 -11580
21934 -11580 -29355 -82252 -27185 -58537 -101536 -87906 -35340 -14917 6472 -50872 -92166 -107099
21922 -107099 -88824 -73801 -31173 -9617 -83151 -76958 -26800 -38479 -75110 -102654 -72933 -83007
21910 -83007 -72567 -58152 -50499 -34009 36877 43940 24369 -28491 -83767 -2048 62429 7313
21898 7313 -37970 -35831 -25608 -67879 -102311 -119026 -36978 -32387 -27662 22984 68898 47185
21886 47185 25061 51582 68465 35306 48680 47043 -6725 -27963 -68794 -146799 -109692 -81625
21874 -81625 -78094 -91282 -90886 -16689 4059 -6043 -53410 -84023 -38564 -14180 -40420 -55630
21862 -55630 -54615 -34642 -15533 -53817 -39747 -66195 -76056 -79447 -64733 -30861 -37185 -47674
21850 -47674 -29529 35819 41016 20393 -7367 -10967 -92400 -102864 -38425 -53438 -61085 -35661
21838 -35661 -54823 -78914 -129176 -95771 -35373 -48880 -14133 7415 -17425 -78155 -44711 -28934
21826 -28934 -700 -13646 -4468 43558 124034 88013 37623 21199 28098 48386 20104 31416
21814 31416 65117 53527 -44254 -121378 -74256 -55319 -72582 -66364 -68866 -51649 -21886 -31923
21802 -31923 -13526 -5328 22470 24164 43500 16710 -2048 -21852 -35567 46753 69855 36690
21790 36690 -10129 -35600 -41257 -3905 71018 83668 45050 -22834 -83124 -124926 -64047 -42533
21778 -42533 -58441 -36785 -47996 -10701 15255 16896 -26547 -41332 -36279 -70333 -76655 -103788
21766 -103788 -90886 -52715 -54031 -61270 -72665 -68947 -15388 -16540 26561 40187 21069 54683
21754 54683 22649 15079 8887 -21842 -16390 46832 13835 -14620 17418 63961 56491 -7199
21742 -7199 -37600 -66893 -67299 -35137 -34873 -70438 -114435 -39483 6608 25783 -3869 -37912 -42571
21729 -42571 -75896 -39447 -33397 -47659 -67549 -137803 -113775 -88365 9388 -33121 -37393 -22352
21717 -22352 -6463 -3417 18714 -12921 -10467 -15336 33342 68672 30431 -14905 -46497 7157
21705 7157 -17467 -53708 -30173 13382 -21462 -128084 -129777 -48294 1041 4145 39061 4751
21693 4751 -45828 -39523 -73924 -87964 -55003 -16638 -23610 42614 76669 56692 33997 52310
21681 52310 17106 -41644 -67326 -42738 -14249 -4549 -1520 52826 38728 -5883 -60633 -61847
21669 -61847 -112042 -89943 -35975 4320 58365 41198 -24041 13099 34358 50918 60894 114031
21657 114031 120412 72837 43180 23068 18482 -21485 -45917 -74668 -40572 12301 -18338 -3246
21645 -3246 -12199 -5791 -35770 -45940 -19409 -72033 -95428 -100332 -136467 -86940 -77252 -87201 -96758
21632 -96758 -97764 -104618 -135317 -159111 -141163 -95073 -97025 -71074 -72747 -65613 -17541 53426 62737
21619 62737 5186 -3288 6966 -48308 -79272 -23401 11586 5227 -93473 -118542 -49552 -26328
21607 -26328 -43413 -31090 -21222 -81800 -83431 -66209 -54242 -23180 40945 55118 18240 13275
21595 13275 63631 5667 -48416 -10842 -24990 -46839 -50807 -15094 27932 3960 -62397 -64990
21583 -64990 -65769 -44677 -29513 -5659 -5417 -34284 -104503 -125436 -102869 -47203 -54415 -20051 37410
21570 37410 22482 78406 50512 25585 39124 5014 15669 32437 20655 -10392 -24114 -5899
21558 -5899 -17809 -69612 -104557 -89854 -663 1182 34170 59080 95755 67249 44361 1249
21546 1249 -25072 -50489 -26461 -6912 3153 27366 19311 8849 -50997 38687 37778 56051
21534 56051 22728 67697 109355 61373 -10277 -38535 -79675 -66553 -33322 -27093 -45207 -22135
21522 -22135 -34467 -81657 -40238 -32690 -39917 -2822 -40981 -97342 -40948 -33607 -75041 -114034
21510 -114034 893 24308 18953 32673 36365 19423 -11408 24719 46377 99075 75963 31082
21498 31082 63373 131494 125012 33979 -7994 21947 6798 11275 15869 31716 2555 -2728
21486 -2728 -62038 -91259 -67936 -66878 -64764 -80455 -76109 -67603 -64954 -58592 -42372 -17162 18591
21473 18591 36582 112540 98099 46385 56085 35707 14517 -36657 -37791 -68725 -46074 11467
21461 11467 28933 39398 20239 3399 -50165 -50563 -56932 -29528 14641 62565 44912 4757
21449 4757 1830 -34142 -52984 -95692 -123404 -143130 -126421 -71050 -61391 -69369 -53683 -8497
21437 -8497 57457 81295 60934 -5689 -44599 -17307 11460 58476 60902 42712 28491 69237
21425 69237 72278 68116 42315 63956 -13207 -59276 -23582 34856 14780 -36384 -43604 -100657
21413 -100657 -127204 -150582 -106113 -39472 -81065 -126994 -82762 -54386 -40017 38829 11709
21402 11709 -91324 -112657 -70394 -712 15152 39045 150948 174470 96456 2049 -43670
21391 -43670 -50423 -63264 -13437 68266 105447 35201 -39968 -46272 -10471 -12835 30011 27065
21379 27065 45715 15517 31116 101140 80145 27115 -22411 -30158 -48000 -45101 -348 7970
21367 7970 5443 -49905 -48540 -32924 -31481 27196 97905 118503 94766 44762 33049 49511
21355 49511 41575 -18291 -74143 -38085 -21618 -30934 -46252 -54563 -6035 44070 34781 479
21343 479 -15800 -53065 -81126 -92495 -105658 -82188 -93249 -78463 -87502 -33296 -44539 -109180
21331 -109180 -117192 -112893 -44153 2980 -82237 -80423 -17603 -52135 -106984 -108463 -88829 -74360
21319 -74360 -117635 -114154 -36906 -23030 -31628 -1927 8364 -5717 -27439 -16056 -6297 -10483
21307 -10483 28167 11037 -12706 42890 101523 113265 107843 98821 -3550 -13733 -40168 -99788
21295 -99788 -74984 -44798 -87307 -113559 -116035 -116742 -98085 -62451 -67267 -72661 -28795 17880 -8763
21282 -8763 -37599 -38642 -72765 -69448 -79926 -100435 -88816 9034 53420 14881 7014 21586
21270 21586 51005 52087 -2007 -25115 -43666 -55362 -8563 65004 6186 -11430 31212 -6195
21258 -6195 -21171 -46687 -45134 -9328 -25783 -10384 7257 14121 7450 -4608 19939 -2917
21246 -2917 -13051 -54092 -169767 -142133 -88357 -68997 -83452 -51230 51660 55869 9604 -10657
21234 -10657 4371 14504 14557 29739 -43370 -56325 -71783 -57722 -25208 -24853 -19294 4357 32234
21221 32234 26339 5827 -33692 -120226 -143018 -100245 -49410 -39797 -31262 17727 4189 -26947
21209 -26947 -22177 -9173 -44372 -11670 11028 -3614 -18307 -66271 -49285 -48237 -5236 66482
21197 66482 13879 -50716 -25247 -2751 -7982 -34079 -34825 -42552 -86599 -29483 54008 26145
21185 26145 20421 -5326 -46379 -40502 16845 59936 50895 -37756 -69822 -54526 -41594 -29198
21173 -29198 -26382 -39044 -42774 -18419 69742 86875 88036 61618 52912 13658 -21956 -48755
21161 -48755 13427 18099 31308 23660 15288 43872 44405 4495 -7602 -47043 -89116 -60623 -4098
21148 -4098 -23752 -39980 -12357 -30399 -87849 -71088 -63003 -84035 -42858 33492 83684 25715
21136 25715 -19063 -7426 -45525 -72904 -38759 -18150 3773 16931 -9592 -56684 -69801 -53285
21124 -53285 -31672 -82420 -59209 -53643 -63564 -59795 -18364 -45514 -114043 -105940 -80859 -29227
21112 -29227 6455 -29376 -95821 -60066 -34677 -21365 16862 -5850 -64551 -106610 -106574 -56571
21100 -56571 -29525 -25160 -52186 -51659 -31131 -41217 -74143 -39699 -47152 -11158 23255 32915 33890
21087 33890 45645 -16178 -45822 -13915 12230 -15166 -2946 2070 -46734 -76317 -43830 -25895
21075 -25895 -56019 -41795 -32542 3148 70575 89734 62969 43395 63950 38841 -8490 -25870
21063 -25870 -98275 -186083 -101163 3193 52441 41257 -4022 -9542 23546 49549 69375 84285
21051 84285 86923 62872 8369 -59690 -45160 -36640 -62620 -4956 56470 105876 77172 44224
21039 44224 41295 28106 2217 -7314 -31047 -51489 -78558 -49753 -21643 -11971 -78218 -109399
21027 -109399 -105840 -97388 -118822 -79869 -37980 21533 75314 120087 112840 93038 64507 -14177
21015 -14177 -41688 -47012 -101355 -87778 -75249 -60854 -58766 -84783 -96563 15646 14837 31797
21003 31797 61143 10128 -23993 -47342 7163 6866 -58738 -59186 -56198 -21428 -11133 -49963 -20321
20990 -20321 -21378 -81560 -55031 24342 97879 45575 -15771 -28806 -13687 -56265 -3950 58799
20978 58799 97450 59584 36721 19963 4185 -40688 -27351 -53870 -67011 -65398 -92008 -70342
20966 -70342 -8177 45328 83144 60721 11000 -3672 -11289 -51957 -68492 -77296 -148369 -168614
20954 -168614 -123131 -120298 -63159 -19004 10810 15421 -13881 -36290 -34434 13909 42002 18412
20942 18412 2913 -1166 65073 42966 674 -8297 -37100 -29966 -23202 -53481 -70543 -81807
20930 -81807 -41697 14697 6646 -33375 -87516 -91124 -66120 -54257 -65867 -46434 -5953 32845
20918 32845 87818 91869 27458 -20399 44899 53204 -2885 -98311 -179909 -154948 -77436 -45134
20906 -45134 -24699 -14139 -21280 -18507 -33805 -29040 25071 31926 59535 -5578 -85800 -66983
20894 -66983 -61069 -43727 -12399 -11416 3908 -6739 -50447 -81399 -40038 -46896 -77494 -56576
20882 -56576 -12910 -6890 -45079 -60079 -74705 -42586 -7040 77975 47840 -10074 -37707 14927
20870 14927 70990 71235 92702 58436 -14559 -78730 -144465 -147164 -125761 -52513 -100850 -150463
20858 -150463 -139813 -100706 -76267 -101773 -60654 -29078 -79447 -59088 -41245 -89520 -76987
20847 -76987 -86700 -86486 -108303 -105634 -56311 -53800 -91656 -84460 -21826 71662 44171 -11976 25751
20834 25751 40878 67931 101507 89294 85914 91951 62423 -6719 -71321 -56638 -29518 -24643
20822 -24643 24118 73510 40146 20867 16038 -27904 -65786 -49869 -67404 -59399 -31442 -63083
20810 -63083 -73969 -48260 31640 38074 16724 22314 37063 16930 -5355 393 48255 49196 29819
20797 29819 -35056 -44521 -17648 20491 84632 65126 10583 34191 -15664 -119042 -133708 -104767
20785 -104767 -43584 -23925 -15976 -49446 -73273 -60099 -75797 -55806 -23037 32800 2177 -48895
20773 -48895 -47963 -54540 -42849 -32465 -60927 -39127 54278 124827 75716 59247 22889 -62012
20761 -62012 -104454 -152193 -153535 -107091 -84977 -28823 -23745 -10091 -8057 -69926 -71236 -6849
20749 -6849 61518 3935 -27681 28643 58899 82368 103678 97012 114387 36702 -40533 -17901
20737 -17901 24837 35925 27265 12955 1073 -6131 -46403 -58452 -64990 -97680 -96273 -94378 -123527
20724 -123527 -127088 -39151 -19800 -52722 -19812 40162 74788 105730 103734 4127 -41471 -40216
20712 -40216 -69070 -15434 -2136 -6874 -21766 -11555 -47194 -70735 -45075 -21467 52782 67197
20700 67197 63955 39239 -10379 -9717 41370 -25073 -37867 -36634 -90071 -92005 -53482 -59695 -17896
20687 -17896 -16455 -659 -17469 -86035 -91039 -8730 42694 63649 19913 -29064 -58392 -76614
20675 -76614 -83794 -114043 -77780 -59798 -59683 -11362 4469 -22954 -54775 -52099 -57226 -61468 -49371
20662 -49371 -62542 -96105 -80869 -35750 10516 12964 37383 25934 -34438 -121407 -94278 -74572
20650 -74572 -62304 -55935 -59354 -26619 -65703 -58710 -50859 -71921 -59300 -27350 -32693 -1890 -5447
20637 -5447 -24066 -51125 -47925 -38941 -30068 -34589 -70179 -90397 -68121 -77488 -74487 -39268 21941
20624 21941 -4211 -38033 -57944 -85586 -65492 -59447 -62823 -37562 -100501 -99460 -104625 -78801
20612 -78801 -44779 -62403 -116065 -64954 -34124 -110550 -107384 -14704 16590 -19514 -16424 16384
20600 16384 24515 20418 35116 55216 51754 -16768 -15249 -20528 6027 -39248 -11808 -27629 -41653
20587 -41653 -38902 -19054 -29533 -52873 -97387 -86104 -39690 31106 68854 63878 64297 19479
20575 19479 -51959 -735 4644 -90443 -128327 -62009 42036 20497 15165 65284 43381 23834
20563 23834 -23865 -2983 52176 36839 -33205 -86694 -117287 -80011 -80336 -35059 -33484 -31383
20551 -31383 -49575 -49969 -22339 -17237 -46627 -86951 -56288 -64514 -101934 -21356 -12469 -36896 -47292
20538 -47292 -25100 -13687 7721 44726 40847 31898 39422 46071 73533 112766 107244 77927 49205
20525 49205 -3588 13270 12674 15195 20261 -17698 -2773 -2843 -25017 -35884 13816 13351 -26964
20512 -26964 -59649 -46817 -70595 -76353 -32498 -27352 -75522 -58934 -13784 9665 85587 125838
20500 125838 149387 160377 114507 20911 -20009 -21541 -47357 -85854 -84962 -105632 -103485 -91154
20488 -91154 -84384 -40370 5763 38793 11398 -35053 -17803 -21641 -24784 -36206 21907 43263
20476 43263 89279 43964 -16346 -29196 -20780 -95508 -98999 -29268 36784 59002 45404 84393
20464 84393 73265 71757 93804 35549 -55387 -95526 -14020 70977 13786 -82191 -135661 -172911
20452 -172911 -137644 -104036 -48777 -97851 -92207 -61525 -19956 34699 9092 28946 600 -58391
20440 -58391 -53334 -52726 -26561 -33644 -51382 -76088 -120058 -173196 -183085 -110088 -35510 -32263 -21899
20427 -21899 -77127 -22311 32810 31491 16648 -37544 -74459 -69497 -56617 -41676 -5802 29434
20415 29434 -2301 31625 73634 95844 28707 -27072 -73894 -53620 -13793 29779 2562 66919
20403 66919 1237 -36712 -46245 -29796 18590 68036 33778 -5184 7076 -4020 -25846 -54851
20391 -54851 -86071 -93816 -70495 -49205 -36854 -25082 -54729 -84282 -85321 -84302 -86197 -130162
20379 -130162 -111197 -48408 -50265 -49902 -40791 -25255 -6487 16499 15739 -22719 5912 -10608 -21720
20366 -21720 -26272 -44557 14605 22703 -60653 -75983 -50919 50429 90706 56195 19860 9093
20354 9093 -1055 47314 20926 11099 72431 58080 85013 89178 91063 71396 76988 59645 87651
20341 87651 58524 25398 2223 -63283 -117000 -46878 1428 42849 62976 75194 87352 94847
20329 94847 73950 13995 16174 13283 -5709 21160 39459 -12668 -2206 -28789 -46790 33399
20317 33399 18011 -38974 -57534 -94779 -92438 -87495 -90524 -105887 -49111 53094 80423 11340
20305 11340 1623 14978 -30623 -58164 -3644 43201 -429 37836 51608 54292 9927 -49408
20293 -49408 -92836 -104220 -71222 -41567 7276 1415 -63868 -51545 -47419 -39280 -1869 28547
20281 28547 50334 82452 93814 60196 -37533 -30760 18065 29602 29082 46142 -6769 -55977
20269 -55977 -39204 9648 14158 39309 32382 10172 39025 15066 -8660 -57240 -42383 -104309
20257 -104309 -150880 -132052 -96924 -56802 11745 111167 30859 24392 20276 -10287 -18544 -20658
20245 -20658 -2588 33745 26497 50488 27276 21178 41139 22047 68956 93755 -692 -85699
20233 -85699 -92883 -50269 -60994 -101068 -55570 -3019 -8077 -36741 -4877 -25462 -88929 -125567
20221 -125567 -96956 -26814 17209 -54579 -127873 -108251 -85719 -79923 -140990 -135048 -56351 71571
20209 71571 77108 48731 67975 19335 -37131 -23577 -43671 -36228 -27960 205 46362 72003
20197 72003 49338 -46774 -72763 -65570 -100913 -23315 4297 14636 -15410 -6615 65319 86368
20185 86368 21784 557 -5314 13678 16676 -37159 -53165 -93524 -131894 -92455 -84976 -101100
20173 -101100 -102215 -61966 -13033 38441 2160 -31739 -73232 -34 23298 30667 48814 56305
20161 56305 24708 -4775 -46602 -52033 -51504 -52316 -27080 -5969 2922 8202 -9434 -73807 -6364
20148 -6364 73658 90859 74497 -7672 -52265 -4301 9950 5457 -14241 -4532 14233 68533
20136 68533 45450 18061 -52509 -91393 -40861 5175 21392 59667 40236 35150 39155 27171
20124 27171 -2949 -38926 -43021 -34606 -18425 23922 46983 44765 78618 16840 -15107 -81651
20112 -81651 -126405 -105048 -103094 -1367 58394 81687 -13870 -44772 -8377 43043 37414 16766
20100 16766 42276 57041 48744 -21050 -23726 -9928 18056 79983 87293 67531 2609 -48202
20088 -48202 -28838 -47419 -19267 -28316 -13939 226 -62598 -80078 -61789 -45647 -30784 8929
20076 8929 -52074 -94994 -93526 -25491 -35949 -84662 -69206 -13639 48389 24563 19246 -18683
20064 -18683 -74105 -53197 -51423 -49021 -63721 -89690 -93294 -65177 -33587 20764 23271 1089
20052 1089 -40405 -55649 -100113 -74326 21249 25720 28871 22752 -4065 -55319 -75813 -89626
20040 -89626 -35817 -34881 9536 80633 71241 84604 21794 -10247 -42723 -42603 -63596 -64875 -45742
20027 -45742 -50924 -67436 -96840 -57263 13723 -16627 -48116 -78512 -53598 -20723 26972 22153
20015 22153 -25824 -105733 -107912 -91523 -44557 34658 79621 84359 84133 93664 111126 55102 15664
20002 15664 -57672 -83902 -43013 -49224 -25217 2092 -3451 -4770 -25260 -73679 -94306 -108454
19990 -108454 -88351 -82249 -85190 -48044 20107 -16590 -85754 -79501 -72530 -60116 -48155 -38545
19978 -38545 -59967 -26561 4141 27139 39998 -9421 -1981 28117 49629 81282 59136 14871
19966 14871 -54651 -102881 -49616 -46817 -35291 20398 428 -58271 -10777 40074 37985 3099
19954 3099 36703 19154 15865 4346 -8101 -39211 -20576 -12032 -11343 -16859 -52670 -88979 -62008
19941 -62008 -13392 32044 49652 41046 1792 -8300 -76892 -131982 -92340 -80470 -53839 -46762
19929 -46762 -15540 -3352 21006 14591 12381 -22238 -15090 15109 17462 5626 -35166 -12951
19917 -12951 19937 41122 16776 41274 -9242 -24792 -25666 -46907 -75981 -69471 -46666 -34820
19905 -34820 -31175 22492 9020 -44142 -46254 -67565 -51774 -35603 -56897 -33925 -48400 -49166
19893 -49166 -83954 -92738 -77597 -99942 -43144 -332 -19490 -37445 -75569 -27506 19146 11664
19881 11664 -10422 -45266 -21344 29956 32879 -35272 -12790 16727 16244 -7675 -32865 -30365
19869 -30365 -49958 -17924 -34017 -34068 30093 6244 28594 -1889 -56927 -35254 30173 6980
19857 6980 14785 30473 56951 58727 50636 27941 6438 15206 16005 21193 47291 30405 28145
19844 28145 12155 -45198 -101650 -146569 -142868 -60232 -30502 -34429 -88162 -90987 -53524 -62664
19832 -62664 -11270 -18855 -42076 -58071 -22973 -10732 28499 53355 52182 36977 13965 -18110
19820 -18110 -58734 3867 66931 41267 8577 -3718 5400 -21812 -25757 -21905 11069 64915
19808 64915 47119 60476 61412 98959 106414 82118 40660 8646 -43620 -36257 -36320 -45404 -48283
19795 -48283 -31188 -15944 43832 74872 62431 69063 89024 53058 60110 105951 125775 96814
19783 96814 -19814 -79698 -66090 -81684 -46497 -71712 -2264 37044 46287 51953 32138 28098
19771 28098 46233 24701 -1898 -20749 46851 110785 125376 97106 56351 3469 -20098 -55018
19759 -55018 -81838 -81638 -13695 58139 34302 68285 80526 116237 151057 115075 63615 33375
19747 33375 -1520 -57755 -70743 -52743 -55042 -61747 11445 89335 69982 69426 44234 3994
19735 3994 5445 5151 8898 618 41649 42683 32554 20318 618 -57761 -85044 -54101 -55847
19722 -55847 -9374 64890 112513 56552 62997 86752 128488 117488 118426 68443 38378 10540
19710 10540 -13697 -31590 -33233 29057 83131 35402 -9960 35454 28770 -9171 49749 92371
19698 92371 109989 101825 83823 85918 80693 52451 80665 130744 158260 176122 155676 170502
19686 170502 147854 196783 231811 255494 250367 250496 285939 333154 370130 421490 425291 427395
19674 427395 464276 509386 540041 528571 550027 556547 599687 654650 641318 599677 568623 599601
19662 599601 565060 518602 486243 450333 469811 565453 598064 687303 736045 807965 732705
19651 732705 626766 460212 372509 352920 331259 240444 236685 214658 193989 179150 227535
19640 227535 327301 344229 381414 438456 522245 610213 624139 643338 686128 624555 520944
19629 520944 460642 452887 364972 288409 262077 251113 250987 179906 132122 81336 112734 115605
19617 115605 81774 65119 37207 24517 36989 50829 13958 5005 -8381 14811 4506 39537
19605 39537 60433 114983 130962 94679 82437 47055 61774 152752 86736 95539 69343 48622
19593 48622 111729 150160 139372 108617 77794 115608 159336 148189 77860 125756 149823 95243
19581 95243 94514 87550 63282 55241 19168 79868 92936 93066 94926 59164 15166 42645 42522
19568 42522 26284 2325 28876 53362 86620 84473 37618 68564 66 -26497 -15409 -60214
19556 -60214 -9699 83022 82649 58385 57208 -9457 11423 63500 65771 50048 62223 73076
19544 73076 45229 66383 34878 -12803 42096 97187 108275 54853 42544 76376 12401 13423
19532 13423 13246 58445 107061 141912 130067 116074 145026 186673 173115 123587 127891 192874
19520 192874 252889 223377 212187 213259 243550 261050 299799 326079 293701 245320 233737 310253
19508 310253 304642 278806 235207 220842 247404 262607 234044 180432 132357 99752 101420 145375
19496 145375 151895 143422 171522 229532 257092 269149 280511 299373 236825 206234 296792 336232
19484 336232 331977 321475 289671 268036 184774 136595 147415 175601 157922 140210 179024 226715
19472 226715 266576 222740 102823 78634 81945 134109 119769 114501 121234 108607 133042 166882
19460 166882 143835 100755 64633 18263 38752 73571 47051 45297 85691 79233 106451 81876
19448 81876 114329 148438 153752 160939 178860 106269 98171 80516 15030 20325 48188 17487
19436 17487 6366 4565 48905 91684 49420 63970 62266 47358 151 -11938 -10048 35204
19424 35204 95632 135086 154572 152716 155620 133064 95545 91421 52335 32822 9488 7927
19412 7927 -4197 30818 72955 98257 75425 101305 106645 100126 66130 28498 20661 37118
19400 37118 18578 21281 26892 28308 -59844 -65347 31744 20316 26841 21857 -60261 -53555 -37956
19387 -37956 3762 5884 18799 31515 31551 -18860 21635 25528 -3722 -83 22927 -3374 -31532
19374 -31532 -56672 -33327 5821 -35783 -49937 -74682 -89017 -109385 -89931 -72547 11706 51353
19362 51353 93456 60665 104877 145218 150241 104284 77409 98056 112252 164626 201628 220693
19350 220693 172825 192552 174168 162534 100535 113329 130886 142519 158387 128905 108404
19339 108404 96678 97697 113496 162664 216014 251154 257830 223210 182184 198299 185197 104911
19327 104911 115049 161725 183391 232708 244405 251822 235779 275211 305570 284780 295089 279705
19315 279705 245667 218724 232604 310689 270890 265714 278851 307118 315325 345042 365414 458697
19303 458697 487158 499119 551128 549862 562194 619021 586002 570244 559236 561089 476350 425097
19291 425097 442770 502690 532792 553170 556312 535366 526688 522113 526537 490134 504013 517306
19279 517306 544762 548570 519379 527049 544418 514338 530287 556533 538665 437834 411592 440685
19267 440685 505753 499807 483619 473763 481237 492351 476962 463492 500056 555270 620050 670961
19255 670961 761254 888803 965231 1016541 996858 1015169 1008152 1003124 986886 964557 951526 888531
19243 888531 857325 807636 813210 872330 970685 1059714 1129756 1186848 1290488 1360880 1358303 1400240
19231 1400240 1408542 1375715 1351818 1361033 1378631 1414296 1526424 1569966 1551962 1569082 1613086
19220 1613086 1656928 1699006 1660396 1617781 1626220 1656246 1740344 1876651 2034778 2159958 2238488
19209 2238488 2347830 2538681 2794580 3022425 3344066 3749383 4198830 4654168 5117906
19200 5117906 5670832 6368143 7163948 8291812 9948939 12200178 14945984 18162903 21918324
19191 21918324 26468741 31363024 35975663 40393508 44825536 48840995 52576710 56426884
19183 56426884 60608272 64428737 68175884 72775363 77876378 82801160 87594739 92145098
19175 92145098 95712194 98178438 100049835 100604989 99515290 97692280 95303038 91986455
19167 91986455 88143873 84058496 79949607 75900770 71853754 67636133 63080726 58083396
19159 58083396 52752713 47759711 43252863 39041636 35077929 31560378 28576263 26141051
19151 26141051 24024303 22196206 20603468 19175378 17906168 16819224 15908294 15058223
19143 15058223 14290284 13635416 12985192 12363909 11819874 11243575 10729312 10325643 9959089
19134 9959089 9635651 9236402 8887222 8593675 8312753 8082170 7829660 7651979 7539740
19125 7539740 7428608 7263477 7079199 6956795 6865948 6796588 6781982 6810305 6831715 6936490
19115 6936490 7020652 6993140 6937990 6846232 6691442 6433612 6176361 6009965 5843664 5701257
19105 5701257 5583273 5515240 5583023 5630258 5584345 5589925 5665982 5742213 5884004 6035834 6215097
19094 6215097 6363032 6431702 6433130 6445264 6415230 6356880 6350014 6365394 6481684 6587491 6810751
19083 6810751 7184563 7698904 8284317 9030915 9964380 11096195 12502138 14484193 17292164
19074 17292164 21404216 27612220 37274297 51912395 71584961 92046610 106615033
19067 106615033 112845779 110081288 97996558 82974702 70787144 62102765 55501169
19060 55501169 49809531 44791866 40818717 38006220 36335678 35865548 36905131 39799425
19052 39799425 45371834 55109415 70649098 91041176 110428210 122413643 125780158
19045 125780158 119183757 104175389 88402249 76483999 68449926 62879637 58797473
19038 58797473 56094818 54786699 54488764 54249010 53468752 52155313 49825084 46829552
19030 46829552 43996414 41865509 40599875 40518904 41648753 43833494 46774042 49952915
19022 49952915 53362196 56909715 59405711 60228719 59239034 56261728 51741221 47153723
19014 47153723 43597319 41660221 41408503 42429280 43930202 44928857 44732380 43058282
19006 43058282 40080811 36643611 33515378 31256094 29911687 29365495 29578838 30274579
18998 30274579 31321259 32737189 34416064 36097155 37306256 38032049 38212499 37456197
18990 37456197 36090026 34934339 34218232 33906299 34228044 35460287 37816947 41653519
18982 41653519 46401485 51195172 55732594 59267050 60541031 59763483 57266504 53297346
18974 53297346 48879328 44860465 41948408 40515058 40371570 41220955 42517976 43330948
18966 43330948 43137623 42038233 39682949 36313379 32758716 29313849 26144980 23429079
18958 23429079 21222249 19414693 17878147 16584518 15386935 14378105 13656606 13090451
18950 13090451 12695850 12198368 11730328 11427326 11114458 10818604 10556066 10259601 9974922
18941 9974922 9670517 9268230 8873088 8567014 8307204 8019380 7793971 7545406 7339788
18932 7339788 7173544 7004256 6829936 6689666 6646920 6510921 6269852 6021224 5773857 5522230
18922 5522230 5372883 5221381 5013338 4842963 4696563 4477296 4301747 4187405 4020705
18913 4020705 3903292 3827877 3719997 3580675 3419561 3293505 3202030 3170150 3088832 3015361
18903 3015361 2928959 2841854 2732174 2622460 2585561 2528804 2489324 2488264 2455421 2383028 2401892
18892 2401892 2411057 2381659 2377779 2356271 2275457 2161071 2087502 2053598 2055054 1921313 1823603
18881 1823603 1720775 1630003 1572741 1503600 1457867 1450057 1444619 1427997 1460450 1440302 1461240
18870 1461240 1434994 1366611 1341533 1318634 1282594 1217456 1134568 994041 932446 925718 881145
18859 881145 861179 846381 884413 883417 891947 925937 918141 885688 929733 891394 921962 1015248
18847 1015248 1073407 1150176 1205653 1319751 1354118 1331228 1277575 1229430 1173563 1200053 1188003
18836 1188003 1085375 998607 976828 932373 921419 1013022 1005979 905458 875365 956944 1003300
18825 1003300 1017241 991408 981901 983498 1117909 1289264 1468697 1620329 1712911 1650465 1487647
18814 1487647 1369698 1236806 1137858 1097488 990559 955123 931379 892974 852554 870962 857273
18803 857273 825956 892175 911955 1000453 1165074 1273253 1311594 1320329 1333400 1262145 1149479
18792 1149479 1047743 986945 919454 829543 739947 730544 734166 790184 799032 742184 683897 668767
18780 668767 704702 769810 775419 791669 808227 816738 826145 825606 840675 852724 876467 871019 866605
18767 866605 888642 936387 1043982 1024446 976039 942294 879821 795123 700731 661452 673759
18756 673759 648165 621183 606161 580412 574629 585575 557718 560214 514322 503866 493563 526904
18744 526904 502558 448478 397217 398650 391172 338456 289566 284024 272605 291766 308282 276618
18732 276618 314882 310626 288111 223887 191585 206346 249395 263996 198075 192279 244535 269723
18720 269723 328527 324747 292482 246033 281608 323914 296353 260989 281258 247524 215923 193794
18708 193794 211705 292406 307301 259879 233605 281473 300090 300006 280995 282165 276793 258167
18696 258167 260922 236577 269095 286717 280311 355400 457961 497538 517138 528287 537623 539724
18684 539724 517529 452551 484335 585088 695782 699610 708315 684870 701947 694968 728477 764349
18672 764349 739596 756495 728673 718756 719520 684062 655675 635671 656089 648522 585204 601424
18660 601424 495838 468581 493136 451295 348750 316928 347221 315408 264358 245121 289778
18649 289778 266246 239918 265914 278565 309830 283239 309897 346458 293414 230857 183538
18638 183538 187915 228406 168790 140449 173872 148093 108571 157024 151893 98204 112673 142763
18626 142763 145455 161299 152782 211748 269180 274403 256864 254398 197365 247284 276951 221124
18614 221124 148492 68917 61858 107909 167643 218573 259447 233657 199694 189679 208238 275661
18602 275661 314970 246749 210263 227362 201760 188769 179744 194275 202035 182207 112992 31179
18590 31179 3062 28758 90262 155504 136531 130137 160782 220690 242847 213005 176601 161638
18578 161638 96806 117417 182024 164462 180712 200481 194062 160537 125081 80448 124308 167084
18566 167084 196344 240590 223811 227355 231802 249192 328355 369145 341382 357258 356772 337825
18554 337825 330242 310848 307670 268215 233014 212144 242698 314696 341833 259634 178755 222441
18542 222441 279301 264957 271695 235794 229274 279945 358798 413361 357205 355196 367585 358871
18530 358871 357588 353815 361260 398790 445910 419174 388530 365914 385249 354047 400814 398133
18518 398133 412817 419470 444548 470303 453622 475813 437498 420274 437435 384426 349840 354213
18506 354213 343624 285518 311283 375354 353335 374236 351470 388874 447009 493766 481142
18495 481142 454805 457825 501244 571380 584826 563540 604001 652924 687740 716774 697184 762899
18483 762899 779647 813517 871198 899791 982412 1109782 1207052 1295271 1424994 1597274 1670564
18472 1670564 1648209 1629156 1585918 1508638 1442452 1388714 1376071 1328131 1289299 1355516 1437753
18461 1437753 1560093 1665092 1766076 1836195 1987841 2171216 2333699 2518108 2650130 2666177
18451 2666177 2745288 2796692 2796643 2825078 2835595 2858090 2901368 2814438 2687155 2590137 2561295 2582727
18439 2582727 2576075 2576723 2629134 2667488 2706198 2728153 2688664 2690933 2615024 2507446 2380599 2239313
18427 2239313 2173086 2108926 2067144 2022788 2023364 1967871 1954214 1972064 1958754 1907771 1877321 1920426
18415 1920426 1977287 2017764 2062431 2129369 2188758 2372392 2635789 2880614 3146181 3561744
18405 3561744 4099437 4842905 6029779 7884082 10493670 13403596 16070528 18453356
18397 18453356 20426111 21593827 21964985 21741584 20895288 19215982 16914045 14742342
18389 14742342 13058025 11705082 10449296 9363811 8454267 7673167 7109282 6677642 6330109
18380 6330109 6014901 5730455 5566092 5565461 5687338 5760563 5897969 6122559 6330630 6524038
18370 6524038 6686717 6772812 6766772 6707994 6660154 6700074 6864827 7082410 7493542 8294389
18360 8294389 9433942 10754659 12388547 14471685 17296329 21476412 28202414 37917764
18352 37917764 49737895 61373197 71010847 78513405 83312100 84801969 83642512 80217097
18344 80217097 74041465 65197934 55836812 48082033 42225827 37685458 33988873 30863354
18336 30863354 28261920 26362331 24986314 24154148 23894577 24277266 25429584 27669920
18328 27669920 31161120 35539877 40668292 46448539 52039692 56147380 58834998 60529743
18320 60529743 60760934 60511694 61343818 63359399 66582889 71893280 79943858 90947170
18312 90947170 106100216 124603546 141158544 153339822 161468973 163255002 162494204 161537153
18304 161537153 158164839 153160105 146846305 137436223 128605252 121976258 115656814 108531525
18296 108531525 99394117 88912327 78865822 69824415 62102248 55806264 50548333 46235365
18288 46235365 42524788 39125795 36188771 33762218 31728754 29962899 28553497 27472209
18280 27472209 26798314 26490033 26520943 26748096 27087922 27317055 27238589 27010122 26492696 25659410
18270 25659410 24942379 24512801 24242404 24210847 24528340 24872601 25001378 24913155 24599054 23909363
18260 23909363 23040942 22050422 20931421 19824978 18724803 17814868 17127365 16685058 16497544
18251 16497544 16473295 16421249 16259236 15907612 15381241 14770000 14245810 13873415 13696910 13511875
18241 13511875 13354529 13165536 12985429 12888486 12877342 12949169 13246883 13712686 14294862 15265436
18231 15265436 16790468 19005247 22369394 27965965 37659191 54405384 79642830 107181358
18223 107181358 126053137 133988771 130344779 112478130 91398622 76093599 66304141
18216 66304141 59289466 53068594 47481024 42978487 39730327 37677692 36764366 37181197
18208 37181197 39339435 44228250 53840472 71209993 96089079 120008337 133819053
18201 133819053 137561155 128800763 108250871 88168919 74314426 65115183 57855328
18194 57855328 51102365 44803093 39444071 34956637 31306821 28397834 25981186 24010707
18186 24010707 22359333 20987586 19978998 19191113 18572302 17927345 17228979 16414733 15498740
18177 15498740 14621091 13870830 13251123 12710364 12228400 11736047 11245745 10822737 10461526
18168 10461526 10087604 9770262 9597268 9372832 9041305 8656425 8381360 8133675 7894920
18159 7894920 7678119 7491770 7299965 7162220 6997135 6907047 6711846 6404003 6186202 6113582
18149 6113582 6047038 5938692 5803497 5666526 5485897 5340595 5230782 5154517 5029558 4883926
18139 4883926 4753511 4559756 4431967 4363094 4255896 4182371 4124544 4024593 3981971 3910810
18129 3910810 3859116 3815190 3771057 3746940 3826744 3866160 3879562 3799465 3734240 3818592 4037762
18118 4037762 4184019 4370899 4749479 5253853 5902632 6845700 8282289 10496408 14346044
18109 14346044 21338992 32655712 45401458 53504436 56551239 54998277 45696593 35704927
18101 35704927 29137725 25160217 22259486 19432651 16652662 14299320 12456797 11040100
18093 11040100 9906086 9003022 8252362 7607725 7146140 6784260 6504771 6185927 5821696
18084 5821696 5510693 5259650 5005521 4783596 4615687 4377879 4185948 4045869 3827627
18075 3827627 3676002 3568745 3521436 3474935 3409574 3269351 3089733 2953359 2864224 2806881
18065 2806881 2700346 2638497 2559649 2523266 2470672 2406014 2371823 2339290 2343428 2331967 2355945
18054 2355945 2372194 2389073 2397364 2415104 2538644 2666531 2681334 2680203 2685731 2697497 2651367
18043 2651367 2674756 2712095 2829140 2943076 2959354 3057748 3082225 3009164 2968137 3075903 3207672
18032 3207672 3383425 3590663 3806531 3943052 3968016 3845461 3711710 3569592 3298796 2933494
18022 2933494 2667403 2506331 2283358 2103916 1968863 1796882 1617216 1495023 1414229 1391720
18012 1391720 1369865 1386800 1375786 1325440 1273186 1250762 1234111 1152952 1107681 1091817 1057769
18001 1057769 1058052 1013003 979444 978304 974154 956932 1009007 990767 929070 944983 983826 1070932
17989 1070932 1228552 1341239 1513828 1609172 1754005 1890020 1934336 1884923 1794646 1640002
17979 1640002 1529275 1430757 1337801 1184860 1049045 984585 963175 857394 802752 772626
17969 772626 738173 643032 587208 597768 594199 604057 574816 553226 572876 576482 571474 605503
17957 605503 601460 580044 533612 468456 481280 487232 481050 458219 473846 510294 562462 544708
17945 544708 512154 483419 523944 534351 558532 622795 638619 675940 722253 720146 724782 757092
17933 757092 779175 757179 639307 540793 519547 516193 454108 437054 379143 329074 271462
17922 271462 246015 171945 158655 94202 128907 117743 145216 226136 325848 323580 300708 284443
17910 284443 306925 262540 231517 281080 253774 242663 287231 293850 318777 283985 228507 227932
17898 227932 243601 204874 153837 231885 322681 317918 263110 164282 156647 162749 208813 276342
17886 276342 247885 250328 259616 262097 256417 310422 354152 427728 446333 404609 388369 401104
17874 401104 428000 470145 446161 389223 293368 227101 259127 250616 228368 193095 187460 174787
17862 174787 182110 132704 143099 240868 223700 236054 234493 200143 153570 114612 167458 241511
17850 241511 235152 215189 226813 314571 320438 284357 240623 217122 162962 124910 188853 177264
17838 177264 208280 252139 212514 194416 294627 373594 403466 468319 551909 657473 729631
17827 729631 848305 927165 979263 943499 894963 831412 760755 674749 626039 578176 515353
17816 515353 441435 468573 509648 482343 450346 451546 499614 576628 597247 565669 518084 457238
17804 457238 446287 451877 389149 369011 332504 269471 249195 276703 346532 361801 321033 257747
17792 257747 218263 268549 243064 288383 322175 314454 355172 295079 214885 213737 244970 301500
17780 301500 370470 501120 597623 591810 619427 583150 501581 446448 454901 440944 454092 455022
17768 455022 401499 428153 452343 513341 569955 483704 400827 345248 340162 344543 281799 204662
17756 204662 175590 198416 240497 214627 203292 198805 202804 242728 170457 108157 117352 129148
17744 129148 188675 228620 209615 128608 139125 111555 102590 97388 91169 86249 110286 88273
17732 88273 74482 109313 89783 81779 116282 148286 193556 211357 170038 141489 98530 34704
17720 34704 40241 96768 178270 173354 175602 152039 121051 129769 134249 168881 113189 48202 84531
17707 84531 151807 132776 47159 -5940 29154 26797 22456 71968 132032 106322 111541 120387
17695 120387 66960 -15334 4083 79124 103449 27322 -22510 29873 36958 12277 -1680 20224
17683 20224 45030 92383 155975 114279 69871 71491 50890 49682 54510 106881 146773 83490
17671 83490 35095 30597 66922 43480 -46185 -64544 16143 31668 33322 -33387 -57524 -14010
17659 -14010 12888 6974 44997 59729 96148 113414 67121 23253 29463 -18292 -15024 22377
17647 22377 97543 142270 132282 113475 108947 102807 82241 55007 8053 -53112 -98065 -14293
17635 -14293 59816 95012 115095 128445 117403 144794 128800 46537 70817 102608 171945 215092
17623 215092 308502 426792 611757 718926 757985 721512 675846 580366 503851 460228 380795
17612 380795 368328 394028 404760 338224 301626 251145 271722 291124 321404 373461 455541
17601 455541 588233 705514 776025 775169 691627 583826 448962 406712 412284 327334 221147
17590 221147 185350 210448 254697 267761 230621 216088 205244 175328 163799 107474 87122
17579 87122 115326 131818 122948 121636 142614 157036 99609 64779 84941 74554 50607 28228
17567 28228 78130 112039 88916 39525 63864 79197 85950 125549 109116 141147 137573 83330
17555 83330 25713 -11379 -31638 8186 -11493 2598 -19294 -13717 25524 59249 60815 20398
17543 20398 10118 29657 45220 42146 55453 68831 86439 62187 60549 69306 64772 101583
17531 101583 97243 84876 97116 94338 143245 210277 216575 155830 89831 32575 42909 28053
17519 28053 -7116 2134 24719 37232 41979 39150 32367 36626 22475 51071 127575 125336 93572
17506 93572 53867 53429 62395 34850 70134 108724 98942 92334 59076 24479 -5222 -40778 -36067
17493 -36067 32582 140899 112816 63060 -38876 -32479 -19430 -10456 1243 10767 26254 63509
17481 63509 38040 31619 -44485 1250 48871 21777 -38264 -46741 -69321 -93534 -89941 -30509
17469 -30509 -42726 -3128 32482 25703 193 63464 48378 -34166 -31610 6236 16435 18297
17457 18297 3016 -14471 -1592 -4647 28068 30622 -9758 -34450 -47545 -73105 -30568 -29312
17445 -29312 -35996 12316 68019 178153 281582 322386 323063 312466 287239 291877 280625 231763
17433 231763 145725 79433 17578 39717 55036 -9444 -18307 -14347 -29110 -51632 -6203 61661
17421 61661 104913 129625 100415 22477 58051 102789 87229 116975 103868 33208 30933 2571
17409 2571 -15362 -23007 -52084 -65576 -19533 10680 1726 91646 82198 25973 -63467 -62545 16346
17396 16346 59438 42349 -9182 -162 -38163 -12416 16025 12786 54884 63159 6829 -36905
17384 -36905 -21759 25515 49201 110061 120199 111944 107843 53244 57036 88331 65326 28127
17372 28127 62015 57945 36675 8615 2152 -18839 -980 21457 -36994 -74785 -86255 -99022
17360 -99022 -101616 -78186 -19434 -24492 29156 98980 25152 -64959 -43538 -43010 -8688 -4497 -45572
17347 -45572 -20704 35949 32496 15516 47667 20782 33589 54465 97739 69023 8372 -27860
17335 -27860 -8375 -27283 8821 -23097 -92570 -47312 -4730 -20761 -71682 -83839 -59938 -72255
17323 -72255 -3755 -11910 -24488 -4358 -190 -13777 -3242 36906 37705 14189 -46299 -66417
17311 -66417 -11674 -8568 -19034 -18373 -4650 58712 76474 46625 -1949 188 48280 108168
17299 108168 79213 38048 12331 33924 100634 109470 97174 76778 30795 400 17385 36737
17287 36737 -7692 -80406 -53619 -1747 -19877 -49583 -23718 -44701 -25755 69193 71880 5753
17275 5753 6657 1118 7035 -1522 2940 29055 49904 43542 37647 53789 58361 19698 -3373 4016
17261 4016 -4424 53875 64515 77254 37849 23487 3993 -30434 -18484 34290 51608 75507
17249 75507 114282 105523 47432 11761 -22556 -50080 -69413 -31820 1917 -14913 -102316 -135207
17237 -135207 -47986 -20047 -38907 -38841 -66749 -5177 17038 11408 -12632 -53707 -62098 -66634 -45289
17224 -45289 -13601 60766 148899 116552 32215 -22301 35280 36048 49232 -8495 -15181 26692
17212 26692 64963 63231 72127 19933 -4428 25226 38545 26326 18223 73603 54480 80082
17200 80082 79691 24447 42403 70313 39197 -39187 -70439 -43188 -3248 16831 -19970 -41524
17188 -41524 -25837 -56985 -42017 -2822 59199 91792 55550 16861 -3893 -34675 -64865 -48101
17176 -48101 -24831 -93556 -92637 -34808 -26397 -7305 65294 90166 27972 4682 15787 45550
17164 45550 22009 25433 33383 46415 50219 38813 -24427 -66630 -59476 38590 31996 31309 40381
17151 40381 43276 -24883 -74541 -66560 -33717 -8855 3151 1543 36452 44185 -45397 -69206
17139 -69206 -99451 -106067 -35640 25631 -20902 -4570 40078 24245 33364 74493 56861 60840
17127 60840 53390 -15970 -16400 -13567 -22428 -15232 -53089 -105482 -115715 -125677 -107271 -43168 -35921
17114 -35921 -64982 -39893 -28477 -3397 7818 -6661 1037 2679 -23385 -38816 -5189 -10855
17102 -10855 -515 -46345 -39628 15675 -10917 -12283 48009 15460 -26201 -28062 -4551 -33705
17090 -33705 17100 50575 60121 -8076 -36527 -35988 -49435 3234 84078 97586 -5774 -76579
17078 -76579 -18001 32639 20520 -30110 -19797 -4916 33008 51656 -4727 -96130 -128658 -142780
17066 -142780 -115891 -113420 -67031 -17850 -11058 -18020 12320 22537 80282 68592 39955 24532
17054 24532 7769 8208 -12961 42212 70547 87091 74859 39266 71841 25509 -31171 -72478
17042 -72478 -96485 -36709 35740 53208 101159 127726 97633 53146 8371 -10028 -66425 -83152
17030 -83152 -46115 -34846 29303 -21668 -100564 -105911 -49429 15317 24631 51134 59453 77275
17018 77275 67615 69132 51815 48006 -42655 -5443 43534 36461 73566 80493 88055 79467 42743
17005 42743 71044 50090 8921 -13041 23372 8184 53601 71092 58018 22737 21428 18974
16993 18974 14086 3954 23808 -1060 -33514 -25272 34020 45016 50425 50280 47559 35156 -10256
16980 -10256 -11943 -28070 -32316 14557 35521 -29714 -84074 -126755 -91339 -74924 -136987 -114918
16968 -114918 -28295 372 -23000 -1909 -484 -36111 -14325 13373 77106 84779 56552 42254
16956 42254 -27265 -12813 34830 88173 83778 59676 95037 135327 186018 178453 137086 120165
16944 120165 56814 33187 27531 35535 9505 -19478 -9339 -6255 4551 -68468 -79671 -26055
16932 -26055 -7888 16697 7970 -13287 -48612 -69438 -18713 21403 -8198 -10051 30903 46800
16920 46800 61254 48355 15511 -3 -38697 -60142 -90196 -50065 -31719 -438 12957 5451
16908 5451 26605 -10469 -3772 36990 79200 72235 78130 90145 96743 73070 57273 100840 56907
16895 56907 -21526 -74771 -62339 5817 58806 88404 87973 75284 53745 1068 -29831 -31559
16883 -31559 -45933 -70306 -78454 -12824 71765 35298 6538 -135 -6010 -18535 -90811 -82067
16871 -82067 -74161 -30925 17897 25965 37210 19037 7832 -28884 7993 70295 95306 125795
16859 125795 140207 90070 46496 72492 143570 180151 135395 78678 72668 77406 71256 122198
16847 122198 153248 118881 59372 56028 77461 76412 12940 -31999 50044 39217 24218 15798
16835 15798 3807 50869 92116 79944 72533 51072 94374 90297 25847 36551 52915 50919
16823 50919 78356 72299 107772 65115 20397 103014 114841 76375 75937 33843 1206 -12173
16811 -12173 -27309 -8473 33669 3606 -44088 -40014 -85432 -114029 -57792 -26539 -13267 -45603
16799 -45603 -102890 -67203 -61549 -98712 -105901 -88780 -75681 -89666 -114691 -90199 -111143 -112458
16787 -112458 -120926 -105256 -68939 -53550 18600 81726 59348 43427 32147 48774 41787 13350
16775 13350 -24478 -61653 -4860 -3805 -41604 -46651 -56847 -44082 -36384 -55544 -6451 6927
16763 6927 -13168 -13625 -18179 3835 -15887 -43806 12140 82627 28558 9839 -14067 -33031
16751 -33031 -30290 -38162 -51317 -70363 -85242 -54976 -4423 59511 78901 55821 5469 19419
16739 19419 16334 -2572 -44496 -22259 -60400 -34466 -15500 -81274 -161669 -159503 -127833 -79307
16727 -79307 -15055 36025 55763 39872 4698 18485 7779 -5517 -38303 -22300 33540 107051
16715 107051 74103 -9198 34997 56796 4668 -41046 -36159 -5130 -64820 -92912 -74689 -27260
16703 -27260 28277 48090 21166 3640 5487 -54503 -71437 -50138 -13148 570 37579 107832
16691 107832 70915 -26317 -86698 2542 49744 63620 37284 -20256 -35133 -42485 -13753 22358
16679 22358 16379 15793 7746 28916 1265 -36863 -58863 -44676 -37433 -57031 -83437 -73131 -71250
16666 -71250 -21850 -9216 -74057 -111886 -56924 -26795 -19251 -25926 -34849 -59633 -66801 -69397 -73239
16653 -73239 -71623 -97769 -82329 -54239 -80806 -2968 -475 20178 32120 -23439 -71835 -92678
16641 -92678 -44077 -44932 -32449 -16416 -18861 -31303 -14495 26080 15894 12364 57746 64409 91341
16628 91341 40593 22557 78829 16962 -29233 -39052 -27546 19601 24718 36364 40368 11185
16616 11185 21370 59374 110368 31730 -5873 -68393 -119796 -75244 -28591 15026 14042 28685
16604 28685 24577 -27779 -74097 -51968 -26366 -37879 -57969 -38159 -21901 -27272 -22454 18472
16592 18472 50549 17094 -24071 -38380 -52826 -75272 -23915 44650 -633 -3240 17627 -4183
16580 -4183 -20458 -9218 -13884 -21035 -65776 -92797 -53883 10399 -15199 -34686 -22480 -30410
16568 -30410 -55803 -123311 -85899 -49980 -10320 22861 47699 109825 83472 40742 -16091 -34079
16556 -34079 97 58769 130848 79361 10799 -24766 -43343 -43001 -18079 13722 219 17849
16544 17849 1234 -57754 -55778 -49972 -87893 -84485 -68687 -30426 39121 44172 29875 37977 25319
16531 25319 -13742 -47258 -27884 -39571 -75125 -59679 19499 91553 125752 105142 50186 9138
16519 9138 46224 53221 77884 67115 55962 64375 51536 28716 46444 34321 -26862 -52673
16507 -52673 12196 36980 23110 -77433 -123278 -64864 17568 48549 49309 25591 44462 16954
16495 16954 38288 21386 26424 64044 58656 87077 110436 52135 36985 -9967 -67161 -74240
16483 -74240 -26713 -12652 -13079 -47907 -108210 -134199 -100013 -96312 -35585 55689 54971 87583 75248
16470 75248 -16656 -61665 -68229 -89068 -38482 53659 37298 -5751 -81401 -75783 -14345 5674
16458 5674 -18173 16865 42078 74495 66972 52772 24682 35257 43109 13355 29471 44534
16446 44534 -48818 -69689 -27519 22748 89665 106636 82382 -4435 -14669 -38163 -41838 -27826
16434 -27826 1373 5699 7349 11941 -1533 74691 67844 15469 -13637 -20766 -71767 -80793 16519
16421 16519 16631 -35830 -68932 -63957 -33354 -41799 -57806 -67254 1500 26190 26312 10809 31603
16408 31603 54420 22362 36464 53573 68295 12638 15627 64938 70851 -10290 -94240 -65508
16396 -65508 6104 5786 29554 17596 21611 41069 43207 35192 52333 87223 105270 83295 52847
16383 52847 68464 57439 11880 -11209 -23128 -42335 -25794 -6725 -24198 -59762 -38437 -43405
16371 -43405 -35202 -6997 2666 4227 -1263 4833 8379 31527 12764 7597 25284 -13370 -13861
16358 -13861 -6227 1418 11456 -51997 -28275 -50141 -40266 -31257 -57698 14208 12642 35209 35305
16345 35305 20321 95 53591 60065 25963 33348 -19690 -82704 -86784 -157422 -116042 -32884
16333 -32884 -27615 42771 55533 39612 66849 54406 57161 -3781 -84918 -105864 -113685 -84156
16321 -84156 -60869 -40542 -37056 -27624 46734 77645 70507 48720 55840 38596 57992 36910
16309 36910 859 -5716 29982 12588 67609 46910 -12108 -33814 -57951 8078 106413 99766
16297 99766 88243 32214 -2705 -41415 -97559 -113971 -106676 -1406 43316 -39086 -43779 -36755
16285 -36755 -662 -23988 -83678 -106089 -99268 -85214 -85861 -45919 -2242 -71137 -95947 -71778
16273 -71778 -34305 -63037 -9293 52390 26858 77080 68115 54619 34261 619 16164 52178
16261 52178 16334 36431 55830 54175 40576 15972 21719 30142 -33 -24324 -58721 -25684
16249 -25684 43880 61979 51475 46182 38010 30999 24100 24452 -18313 -54376 -60698 -75098 -63891
16236 -63891 -1695 15225 -16361 -62256 -87043 -107968 -47861 25928 -12498 -23396 14383 1553
16224 1553 -26637 -24872 -16259 47109 1877 -24155 47372 81116 67299 74433 53878 -18067
16212 -18067 -70288 -77608 -33302 -54900 -44498 -28496 57 -15648 -2905 27738 -2651 -53890
16200 -53890 -8985 4383 -39665 -92370 -45936 17376 750 -43105 -44868 -46516 -20578 3522
16188 3522 10705 -8189 3941 66631 95494 80784 15125 775 64352 73804 58264 22899
16176 22899 -43414 -30696 33170 29770 3829 43508 48452 -25890 -8504 54855 105129 112200
16164 112200 67793 25180 38300 89547 80860 21670 -3370 13594 17163 23098 19483 37855
16152 37855 1876 -29216 25926 82348 78768 14942 30739 -15568 -60466 -37011 -48788 -66829
16140 -66829 -50614 20489 10968 7711 22569 198 -10838 -23274 21532 -13783 -12061 16960
16128 16960 37665 12375 -8234 17607 51065 56186 95964 100327 51340 -1634 -9755 -11961
16116 -11961 -102168 -137941 -62006 2986 15444 -37343 -31067 -15151 -43427 -14157 11003 238
16104 238 -2226 36149 42613 34358 -3946 -11399 13619 764 -17237 -20151 -1603 2062 40245
16091 40245 62967 96413 43469 -84570 -61768 20567 -12781 -21544 -68650 -41931 26996 46465
16079 46465 -22909 -31870 9590 -1941 9517 38333 39080 1253 -22795 -45440 -22000 13810
16067 13810 81688 58366 24782 -9662 -8291 20222 19267 20939 -27304 -62832 -81941 -62186
16055 -62186 9420 51495 31489 25830 12387 -68535 -78224 -69932 -50592 2390 27876 82505
16043 82505 183937 159968 145162 135556 56868 27033 -37119 -145175 -161514 -35110 13751
16032 13751 30719 76597 61025 79979 90563 93644 65909 20700 39335 65892 66005 17069
16020 17069 -27492 11767 3589 -29171 -35439 11585 23489 31075 -12803 -19120 49385 42368 16559
16007 16559 7712 -11251 -4190 43185 33751 91232 108026 123273 107694 68484 54540 7770
15995 7770 -11863 26521 73297 33534 -41952 -47544 -78459 -73470 -31792 -31279 -3104 -8627 -30289
15982 -30289 -27218 -2866 47789 94652 110715 37055 18112 11507 7617 -11804 -5801 31737
15970 31737 44076 69751 21109 -11636 -35799 -17685 -32808 -21547 2449 -24853 -61957 -17909
15958 -17909 25917 68621 87755 68658 81270 67025 58635 44095 40810 63262 93781 -21690
15946 -21690 -46746 -92430 -58324 -34608 7443 20513 30393 -33874 -21963 32316 57033 111414
15934 111414 114222 87948 9975 -20428 -22522 -5313 -676 27278 -6990 -39367 -64420 -53810
15922 -53810 11133 93074 115966 107900 133158 114712 49669 53818 30290 -6657 11608 -63914
15910 -63914 -108004 -65605 -27623 -21198 -13124 -45823 -62482 -60966 -20346 14296 -1656 71354
15898 71354 70099 67070 29796 27344 93979 161431 99323 48112 31104 44192 63785 123041
15886 123041 118122 52183 9408 -13344 20742 -14690 -76517 -63992 -33444 -12191 -24163 -43531
15874 -43531 -24345 29198 8688 -28864 -66122 -60776 -75719 -104257 -25808 49208 50020 57245
15862 57245 15049 -16340 37346 63508 58137 50612 35552 570 9618 -32385 11342 45890
15850 45890 40419 31710 -13969 3226 42061 45411 14707 18618 -8740 -34905 -18387 34778
15838 34778 44825 70156 133907 126098 82694 24486 -12595 -45437 -54786 -59778 -67643 -73943 -88580
15825 -88580 -83461 -78969 -75616 -118797 -95137 -31676 -5801 -33297 -19914 -29090 -25894 -13306 -47288
15812 -47288 -110322 -161142 -68805 -1871 -15713 -15869 28095 13487 19325 32926 -32621 -77046
15800 -77046 -69024 -53913 -25191 19415 48943 17079 -6708 -23075 14856 -22083 -38633 7084
15788 7084 66511 55268 99396 71716 -797 -14528 32518 23556 -7077 -36478 -53260 -82273
15776 -82273 -78442 -86286 -42187 24084 62820 100158 78609 61167 72874 60787 -1947 -56534
15764 -56534 -49600 -4657 -4331 -62855 -51684 13847 34007 58848 44935 52891 10779 -31681
15752 -31681 -27815 -70535 -155634 -119487 -23430 -14158 8105 15772 -13 9775 17738 -30285 -60548
15739 -60548 -40286 -59805 -54305 -61498 -61747 -16267 -29389 -6548 23365 7503 -29868 -42451
15727 -42451 -28547 -18673 -31693 -48323 -46077 -35856 -23336 16423 -19128 -6602 39671 18892
15715 18892 7162 -32193 -38224 -59809 -31952 11409 54733 66217 37024 -3525 -6064 56887
15703 56887 74620 96495 109644 209249 179110 103501 86431 85195 42406 17735 83220 116107
15691 116107 120481 150856 80208 53156 9526 -31158 -16963 23049 11901 -64895 -102729 -89651
15679 -89651 -49374 -26901 -39512 -81890 -116160 -114853 -89675 -54917 -2890 -53820 9448 47694
15667 47694 -2563 -23585 -29653 -23465 -10253 13694 32536 49217 24515 9694 20731 29265
15655 29265 -14482 -52759 -27775 -19292 -55602 -57097 -19220 4001 -48233 -80104 -73174 -37719
15643 -37719 -26761 -53426 -60876 -34196 -13689 -14344 -43114 -48677 -51275 4482 -24287 -46385 1463
15630 1463 -7859 -8315 2108 -28739 -79032 -10950 21273 50011 65577 99682 116249 55945
15618 55945 62382 39121 15164 62680 92598 65636 67666 60307 55322 48789 -31057 -42905 -13258
15605 -13258 13755 -39866 -68539 -88477 -82208 -91822 -36988 3618 -37350 -18809 -6739 -34937
15593 -34937 -56647 -36256 -58206 -78768 -57017 -6293 -13146 -56810 -70389 -52172 -71576 -1257
15581 -1257 10128 45237 38449 -25359 -52853 -4836 -39641 -70082 -57196 3888 41709 35504
15569 35504 15655 -3850 -7385 -13388 -59894 -38614 -46388 -52564 -42948 -43117 36098 103187 91827
15556 91827 27801 12971 9899 45690 97055 91618 -20352 -35010 -9092 -22437 -39999 -30458
15544 -30458 -9838 21563 -9183 -28644 -14932 -32097 -7297 -38278 -35001 23651 45234 24203
15532 24203 -30999 -97290 -132901 -98584 -96732 -39614 -30989 -66877 -79566 -31608 50380 34551
15520 34551 -45710 -70043 -40191 -32601 -16162 8735 -10193 -107829 -168914 -182157 -116097 -82470
15508 -82470 -41908 16892 90746 64105 53637 34771 22395 33670 6858 -74335 -85408 -107825
15496 -107825 -87137 -90474 -38137 33604 9831 78209 97081 41024 40291 36851 6690 -887
15484 -887 15612 27251 54725 5148 -45324 -45829 -61132 -111071 -107156 -27181 44236 90417 36444
15471 36444 31444 24014 31143 50679 26003 26715 128478 165305 145372 152386 190268 169416 79399
15458 79399 89864 98446 67174 63534 39823 2311 -6695 23521 49047 26649 21762 -14405
15446 -14405 -33277 -10149 45913 78469 53210 25330 40420 -22042 -120501 -165069 -99474 -35345
15434 -35345 -14324 -24860 9340 26824 31364 45402 17752 -46557 -77222 -43348 29687 44302
15422 44302 26454 63426 -1862 -13069 23346 65348 33479 5795 11771 -11008 -19403 -16257
15410 -16257 -29182 -49150 -44448 -48179 -7829 6395 -8908 -4399 40716 48542 86165 57710
15398 57710 80250 149500 116005 42918 25863 -41077 -93989 -68781 -51506 23141 -6737 37893
15386 37893 87295 101033 71346 -1619 -8999 -47576 -45973 -35480 6561 19079 -15546 -59382
15374 -59382 -50387 3371 13664 49751 21196 43352 28250 13143 2210 -39970 -64349 -92700
15362 -92700 -46941 48738 59458 48796 -984 -25870 -15096 16241 -58581 -69564 -33945 8051
15350 8051 15669 49251 77790 17956 6331 61222 8437 -52677 -89239 -77004 -92290 -68722
15338 -68722 -93431 -96696 -117908 -153209 -77807 -36637 -72106 -103125 -140763 -144232 -93859 -67055
15326 -67055 -44567 -8322 -6670 8305 6060 20665 6083 345 -734 6523 5257 8868 15236
15313 15236 27738 -2517 -33923 -90651 -69883 -26854 -23759 -20227 -43072 -44801 -36263 -21945
15301 -21945 11983 -7883 -45863 -37045 44330 67045 48170 63035 128824 118875 105080 89792
15289 89792 60594 62172 45741 32910 24489 -33466 -7325 8516 1184 -19686 -34495 -87995
15277 -87995 -76164 -105163 -103306 -45464 27297 34826 52234 46733 26986 21015 26283 -557 -51811
15264 -51811 -6510 16963 -21623 -79472 -7780 16812 -27909 -78122 -91464 -46718 -38311 -21657
15252 -21657 1591 -27651 -47215 -35702 -3682 64284 91466 20592 32989 1956 -5214 -10661
15240 -10661 16277 119814 161324 97832 28499 -571 -32638 -75499 -104383 -54815 -39490
15229 -39490 -2447 27727 -25523 -18461 18708 -30236 -54134 -54598 -38095 -2610 57775 19630
15217 19630 1364 -25719 -38769 -68886 -58738 -110912 -131688 -89883 -76265 -27945 -29413 7043
15205 7043 19513 -66824 -100355 -116502 -69670 -54093 -13309 15054 -13501 -52139 -17199 37448
15193 37448 118992 104544 50079 59903 2641 207 -39609 -108853 -128916 -125555 -87830 -51739
15181 -51739 -19350 12512 -46242 -111040 -101152 -57349 -37524 -5291 -28292 -69979 -54855 -88605
15169 -88605 -68413 -21858 -31880 -38317 -5964 23924 1528 -37622 34462 49465 34431 51167
15157 51167 60440 -23887 -30547 -16611 702 32377 53944 38285 -24385 -79071 -55760 -32927
15145 -32927 409 33524 50819 66745 65573 81817 15687 -40404 -46786 -18991 -5795 32883
15133 32883 51157 35693 5173 -25385 -66031 -101049 -42186 18074 59654 21774 -49938 -49667
15121 -49667 1795 28332 -26635 -16207 -25263 -2129 4503 -4892 48297 3723 -3963 37088
15109 37088 42525 41437 33580 24985 29190 67650 126424 81188 -29647 -38346 41511 56317 22022
15096 22022 13958 -35439 -58483 -36526 45454 97998 85146 27520 13637 23209 36428 49668
15084 49668 -13993 -41040 -11133 -39927 -69312 -33701 -28947 -16055 -50918 -68640 -66576 -93944
15072 -93944 -51515 -10778 -30733 -45058 10794 70679 64375 63566 62107 5802 -49462 -23576
15060 -23576 -5346 8209 30247 50420 14457 -62862 -66425 -11488 9058 -14486 -48467 -14460
15048 -14460 -59342 -78219 -19773 29700 79077 66997 28984 -39419 -10200 42911 72767 14887
15036 14887 12173 8591 -26492 5584 66165 80604 78477 35532 17484 -94252 -170514 -179738
15024 -179738 -86681 5299 -11368 28739 44345 -8790 10027 13252 4103 -7783 5477 13330
15012 13330 90745 85458 30634 73556 122518 122242 122900 95459 57279 10291 9132 -32101 -115839
14999 -115839 -82866 -61290 -85252 -110680 -60350 -55920 -51516 -38200 -42966 -70953 -63036 -25772
14987 -25772 7874 6463 -64670 -91261 -75013 -58418 -113816 -192368 -164439 -154404 -154600 -79246
14975 -79246 -27565 -32210 -18065 -23188 270 18242 -19741 -77280 -101597 -61544 -32781 -7619
14963 -7619 -18281 -4020 -21536 -21740 4035 21266 -16454 -55697 24884 2627 -98052 -85894
14951 -85894 1189 2950 36923 47230 4249 -47340 2538 32991 55228 45747 27404 -4213
14939 -4213 -44217 -82938 -5816 -12465 -5841 65144 49678 -48668 -47266 -12108 -20747 36245 32431
14926 32431 -26834 -32600 -13129 47783 41257 33342 -5983 11498 5325 44321 3315 -19799
14914 -19799 -46821 -4475 -47524 -45149 -25467 -50917 -27954 17108 7413 -34814 -75830 -87731
14902 -87731 -58984 10433 31989 -4675 2101 19501 48063 95227 95578 128029 132845 34837
14890 34837 -46467 -80541 -82474 -29467 -4972 -52985 -79522 -97582 -33239 4324 19031 8942
14878 8942 48991 104432 44616 43947 22521 -37959 -15171 -20510 -55719 -45671 -74020 -122817
14866 -122817 -115909 -98753 -76929 -52613 3538 -16470 -37044 -2639 53651 28751 315 -17782
14854 -17782 -37071 -44432 -25954 47348 22023 10117 29539 77045 62537 51610 78746 -15682
14842 -15682 -23372 -1157 10612 -36605 -26525 35002 34305 13601 42908 91124 114614 50010
14830 50010 27002 37029 1194 34473 43904 -1895 26858 64729 22491 -16376 1221 -65397
14818 -65397 -90954 -86855 -86671 -47338 -26285 -19528 23607 38316 -7548 -5160 54793 52805 47678
14805 47678 59439 77278 67235 86741 106219 61982 39617 40238 40049 85683 123226 57772
14793 57772 12147 5474 9316 -32147 -59151 -19989 57171 57657 6869 -11745 -10353 46530 84683
14780 84683 57313 34728 -3154 15293 34812 50851 -31310 -66831 -57059 -54582 -61527 -74213
14768 -74213 -123190 -85202 -48660 -65266 -131625 -151884 -81203 -43634 -54559 -32975 -7978 13562
14756 13562 -8413 -31190 -41746 11499 31259 38151 28958 36940 -15363 -77042 -52167 -71188
14744 -71188 -32578 -72549 -85725 -94110 -92217 -153090 -141970 -82902 -55316 -27125 -4204 -49399
14732 -49399 -53595 -77473 -24531 17072 -9754 -28673 -15440 31436 28986 10992 17471 58855
14720 58855 72936 -25276 28695 43661 39901 132 -19517 -43223 -9997 -43240 -24694 4941
14708 4941 1871 -38649 -23185 16662 -800 -39916 -69113 -65515 -63494 -41370 -11139 -17188 16092
14695 16092 -24160 -71451 -64776 -53312 -43123 -68041 -62394 -48907 -52307 -57088 -24761 -3310
14683 -3310 59462 103158 58920 38237 -426 -59403 -18683 -10426 -12569 -23044 32730 62638
14671 62638 42229 26919 17261 8895 -73662 -88344 -50070 -55257 -82617 -79894 -111348 -39826
14659 -39826 61761 77025 -17588 -71910 -75529 -89222 -35350 -19248 24885 89463 98794 111327
14647 111327 93790 74556 46672 6651 28770 -11147 -18435 33481 39669 74151 94423 49141
14635 49141 -25026 -31750 -29032 -6699 12794 -30278 -18435 55215 107313 79987 4647 -7148
14623 -7148 33989 77819 85376 75022 65749 12159 15590 54476 20590 -33285 -52214 -27770
14611 -27770 -38208 -24083 35347 27541 -60414 -71289 -27695 58555 121689 100030 24921 -33026
14599 -33026 -42150 -32327 -88603 -99532 -106455 -49468 4092 24627 19363 -7708 29000 45672
14587 45672 -19608 -95218 -71646 12251 32768 -27070 -26339 -58684 -107313 -101811 -47853 14170
14575 14170 71597 87544 75407 64828 49010 35182 27509 -7407 -48388 -12147 -16990 -53210
14563 -53210 -66371 -21070 -2644 6901 -27168 -46162 -33447 4725 26535 -8985 -59768 -77721
14551 -77721 -60100 -79779 -73379 -12188 19942 43757 49004 57232 85790 77078 133774 171885
14539 171885 60522 53000 23174 -15843 60227 99325 79299 -2761 -38757 -18191 -19252 -67724
14527 -67724 -84755 -73412 -23811 46286 98070 21762 -3 697 -4310 1446 -22227 -6100
14515 -6100 -5459 -17826 -60653 -87132 -8408 33435 6225 -15058 -25559 23604 32315 62636
14503 62636 33674 15128 37889 38531 -69059 -112721 -85806 -86812 -119930 -117337 -48080 9741
14491 9741 6900 93837 113577 117459 103721 53283 -40272 -61404 -61428 23789 25788 -2932 1525
14478 1525 13844 68244 118734 82042 30374 776 -11127 31398 54343 36916 -8197 15799
14466 15799 20465 -35197 -40989 3641 43973 59804 21302 -11271 27035 66163 116401 120323
14454 120323 68075 -1082 -71579 -69590 36819 83620 53633 50237 -11968 -15899 17247 35090
14442 35090 -730 -85124 -95883 -81222 -80653 -67737 -38870 7300 64513 47918 23112 -10461
14430 -10461 -31292 -5796 28047 426 -46452 -76704 -101530 -85060 -8208 -29259 -57644 -110050
14418 -110050 -65711 18234 20014 -14713 -7436 -33851 -5468 36028 96337 75226 -7155 -10309
14406 -10309 12939 62900 27855 -19386 23028 -3556 -41311 -50009 -24997 -54627 151 72525
14394 72525 34064 22470 8317 25155 40290 34745 9808 54323 40842 38924 55442 121058
14382 121058 142833 145189 154127 96666 54792 40270 34908 62142 90347 40345 37437 36288
14370 36288 -62015 -49606 4642 66403 36326 9181 26438 9482 -15662 14489 49497 22327
14358 22327 31075 50967 66056 40902 23421 73095 68613 36901 840 31749 16592 -5408
14346 -5408 -61491 -109605 -54212 17722 53786 62275 50531 77468 70678 7071 -56647 -22965
14334 -22965 -2840 -9815 57320 57833 29417 27455 6414 164 11573 13702 12580 39123 60366
14321 60366 51052 10994 3339 -3123 -1498 -36769 -37544 56628 80659 56471 15888 31538 39599
14308 39599 -5364 4514 -2918 -44615 -19868 -14572 -76770 -61109 -73571 -48721 -37204 15083
14296 15083 8236 -24941 -16084 -100649 -139101 -131944 -172062 -130480 -74739 -9726 1097 3412
14284 3412 12172 -37990 -20247 -36041 -39847 -3901 -32983 -5198 4871 9092 -17637 -54393
14272 -54393 -97566 -91956 -109129 -137948 -98285 -28275 -52809 -100756 -98041 -118719 -66088 13811
14260 13811 88136 95367 -10115 -38530 -19579 -48220 -45661 -59434 -88775 -116258 -65006 -72365
14248 -72365 -89887 -155616 -86233 -18264 -93587 -87512 -69962 -70415 -128988 -159331 -94252 -36787
14236 -36787 15222 16319 26769 34558 25922 -23070 -34775 -14431 -22645 2690 20935 52019
14224 52019 46972 69198 90244 128282 140319 82407 -1106 -73926 -96906 -52886 -13224 -34660
14212 -34660 -43929 -27716 -55770 -84508 -10478 20260 8701 3595 6536 -12207 -42460 -54583
14200 -54583 -13426 18335 14172 15405 38643 50962 109052 90448 119315 92658 85723 98953
14188 98953 78907 -7258 -9131 -49506 -52066 -35201 -78347 -133098 -104483 -58143 -3128 -2683
14176 -2683 -42722 -46199 -49582 -42565 -63781 -89173 -26778 -23030 -9029 44007 84970 91082 36744
14163 36744 6968 -14936 -36629 -50915 -7160 68706 65188 114 -66044 -63172 2208 -22063
14151 -22063 -82450 -23772 38294 753 -76664 -25967 15924 18677 27445 50921 72097 56508
14139 56508 11855 -51998 -25536 17775 49444 76042 57255 16153 -8422 42997 103748 83903
14127 83903 61783 -53648 -75961 -87405 -58070 -37240 -25585 2450 12241 -22888 -11311 -16881
14115 -16881 -43065 -66159 -50705 -6139 3983 -26551 -73752 -19211 72381 90097 61757 -8984
14103 -8984 -9379 -6845 -16894 28633 45150 74817 117168 108689 95807 34675 24808 64017 86361
14090 86361 119084 139163 -13315 -61376 -45423 -83843 -48865 -38654 -28652 3511 16228
14079 16228 38793 20562 -19577 -38675 32976 73245 18695 -78154 -40199 -14529 8124 -16114
14067 -16114 -5354 -5973 33919 36470 -15303 -51527 -9207 -25199 -116932 -142535 -121813 -139895
14055 -139895 -43220 -51746 -126397 -151279 -136251 -40877 19180 1829 -31992 -46222 -30878 -66218
14043 -66218 -41819 -41180 -61987 -60676 -12432 16169 -26328 -37923 -3067 9455 -48347 -105744
14031 -105744 -101843 -70337 25377 31641 -3875 -59695 -90012 -25642 -1545 -10630 -3662 -51983
14019 -51983 -75443 -19617 6074 3241 -25884 -22882 -71862 -129584 -79565 -72324 -40066 24586
14007 24586 -36785 -78712 -44857 20052 46125 -26022 -28706 8752 30581 -6883 34575 9488
13995 9488 -34747 18570 31398 51268 33111 -20484 -10311 12013 6591 -21454 -42677 -1543
13983 -1543 -10808 -44737 -23287 -32583 -30157 39871 121317 118934 104191 71454 42570 11633 -5854
13970 -5854 29464 16671 -30389 -34684 -41020 3293 -13514 -7220 16017 4133 2799 -9379 -18778
13957 -18778 -48883 -70558 -24747 9957 46759 88911 86280 74191 58813 32550 -2948 -52740
13945 -52740 -72806 -36452 -213 24952 -37477 -19932 17441 -32029 -49458 14062 94646 121833
13933 121833 133574 82872 139699 195820 134692 51501 65505 67239 58761 143995 167469 105590
13921 105590 64511 87419 105409 86541 68814 61710 63506 92331 150713 184540 183860 209935
13909 209935 193294 177616 167953 166673 130508 114126 105681 140856 148825 99784 132554 162044
13897 162044 141891 65305 15818 -32791 -11703 4235 -23130 -13089 12606 16746 21340 314
13885 314 -8962 8984 69875 64263 81872 103013 50864 72111 27303 63069 37471 -33591
13873 -33591 -54175 -99122 -95051 -64494 -32545 4538 13339 -18972 -25921 -34037 -118639 -104737
13861 -104737 1340 -9596 -49631 -26911 7395 29439 59274 63589 125190 81247 22935
13850 22935 -13227 -47911 -44784 -13218 28218 41847 76835 59471 -17889 -106272 -110696 -35409
13838 -35409 36692 -44259 -132160 -111284 -60761 -57507 3692 45961 40003 -8925 32781 -9400
13826 -9400 -59871 -101715 -84652 -99163 -47240 -34471 -37450 -5517 35277 14347 35536 1534
13814 1534 -19368 -32235 21744 87886 2838 -24141 30087 33135 -18331 -82917 -109347 -81041
13802 -81041 -43507 28003 -14880 -7441 -22546 -45182 -56506 -13804 9789 -55789 -90054 -89668
13790 -89668 -37772 -24800 -21240 -36961 -25235 -1852 34366 -26554 -57363 -17348 53891 48824
13778 48824 45269 7024 -13186 -15914 -64746 -99618 -74368 -44403 -41357 -24137 7000 54789
13766 54789 47402 38130 40538 24795 -23288 -12689 24298 48783 60600 40346 21982 50572
13754 50572 -4156 -84348 -72159 -64379 -25437 21402 18313 -5409 -17962 16791 49376 -104
13742 -104 -92524 -93401 -58706 10453 57946 47514 29392 68991 89396 45393 29059 51253
13730 51253 -21029 -61365 -86459 -39308 27117 74145 92469 87031 37378 45688 93451 110026
13718 110026 29581 26551 86416 71888 54952 27121 73228 163873 148338 97163 100770 84392
13706 84392 93472 77223 75563 89519 112055 107666 91007 65345 88737 48897 29042 75385
13694 75385 74268 84465 79421 55967 11087 19824 43696 87192 55723 34071 -82326 -146398
13682 -146398 -83514 -45580 -5019 85296 90706 64143 53665 64401 57000 45649 -12910 17724
13670 17724 8615 -29986 21962 97013 82255 49561 -14906 -37093 -66497 -23324 14948 3820
13658 3820 -20762 -24622 -54663 -21596 3136 37850 97625 95191 41758 42856 -773 -15705
13646 -15705 -14555 -97273 -78499 -40837 -16054 22454 72606 90456 76667 15272 -15666 -47486
13634 -47486 -54994 -51379 -14429 -33571 -36495 -79363 -66915 -45947 -73838 -83402 -56063 -27452
13622 -27452 -44536 -71607 -11280 42472 15193 83268 139788 100500 59290 3761 -36909 -4491
13610 -4491 -40497 -58829 5052 67974 45993 27233 43608 103132 35695 -10547 51903 71552
13598 71552 41455 -57589 -47438 -80570 -97269 -62052 3246 -26805 -70096 -150191 -112273 -77597
13586 -77597 -42763 47155 69642 47471 76737 85281 57565 74196 45422 46667 24172 3865
13574 3865 -50507 -109281 -38146 56093 59548 36471 96901 102513 32044 -16988 38791 75035
13562 75035 23671 12814 -4752 51097 95872 81858 22310 37839 30043 30682 56046 97149
13550 97149 81735 63316 85586 88548 47020 88262 88448 121154 100055 133249 106661 83164
13538 83164 59660 68472 81065 31106 45826 6377 -9989 1381 45278 39355 87767 83039
13526 83039 40576 -15436 748 59629 104751 70868 7672 -48867 -55396 -50145 6667 67587
13514 67587 94744 81866 60456 57612 67321 73483 4537 23567 79955 53910 -3332 27112
13502 27112 75430 77295 -15479 -51389 -85322 -86733 -10358 -3660 -22118 34628 46660 13571
13490 13571 -27725 -64868 -61352 23513 -13675 -19206 21768 34444 51084 42717 28511 10602
13478 10602 -16957 -31353 5008 -57310 -85910 -51828 -23832 -61946 -72062 -28098 -34278 -60710
13466 -60710 -57326 -79486 -27213 13258 41899 15147 -9422 -60026 -115746 -95046 -62855 -55239
13454 -55239 -45870 4672 20462 24013 59534 108536 114433 98700 55838 -6871 -22734 -20034
13442 -20034 7223 61993 101251 75510 32482 30920 34144 -5236 54664 67555 63525 99393
13430 99393 122334 91144 59783 83076 17839 -20481 -8548 13416 44752 26782 52688 69849
13418 69849 75432 53096 25156 37815 18668 -13081 -30135 33919 53253 44268 63472 124391
13406 124391 102938 46376 28073 59577 -2773 -114937 -111471 -102303 -30613 -22465 9510 58719
13394 58719 51075 27031 7067 -8952 -24945 2937 -19556 -27471 -21912 -32919 -78018 -90008
13382 -90008 -48839 14602 49981 10605 -19300 -4905 -5220 -58351 -75539 -71819 74926 167832
13370 167832 146987 56479 -42223 -66990 -29728 32677 9961 -45492 -67816 -62844 -49104 -77743
13358 -77743 -41817 42679 37100 75132 119450 90355 60504 119 5008 -32297 -57833 32092
13346 32092 42106 42829 48635 73002 60204 46577 36163 54144 56118 27927 -22644 -45316
13334 -45316 -18692 -9237 -28369 -33926 -12713 25336 35778 71731 58341 -31067 -89773 -58055
13322 -58055 -44837 19072 20803 -10307 31456 28653 -11671 8952 67710 45812 57025 78520
13310 78520 36197 -12696 15771 -10328 -83 14135 3324 16712 17282 12674 8248 13789 11893
13297 11893 -5882 53728 81545 75890 26663 34358 23134 47627 77243 82607 48866 49888
13285 49888 77461 183104 258780 260025 292541 332863 317446 311288 364662 482335 512791 598918
13273 598918 778645 1007026 1241434 1419928 1618314 1814552 1891257 1853916 1802572 1711833
13263 1711833 1541593 1409613 1279654 1136042 1025363 964884 869011 773699 652114 508513
13253 508513 473608 451080 437812 421636 395166 377689 329062 276030 296964 295651 227597 157291
13241 157291 157723 147647 190838 179353 198825 199675 156717 147829 152157 174094 154937 184889 222047
13228 222047 180028 121151 69292 44134 89183 48648 31676 25734 50481 37807 38846 112597
13216 112597 97995 45035 55429 64024 52930 62087 74617 32620 47319 93140 34809 22324
13204 22324 14611 9081 11359 -560 -2999 -17321 11975 13936 24697 40184 52391 93618 114443
13191 114443 78168 68989 71910 73102 21218 -20131 -71176 -92594 -58112 -35736 -30185 35797
13179 35797 60192 50684 35378 73808 94700 99509 88539 70739 72775 83137 86648 96678
13167 96678 86272 69551 80058 29532 1977 4894 -45444 -45547 -25883 -67622 -92811 -78330
13155 -78330 11288 97944 157532 156179 141694 60941 39047 22017 3659 24373 15072 -27176
13143 -27176 -67504 3903 83166 69956 66306 74362 107188 131372 130672 113531 54831 34273
13131 34273 54456 46139 6948 36255 82006 90133 35707 46404 84974 63682 48261 58965
13119 58965 92053 112520 119050 165979 88832 9410 33106 74231 123471 128440 62147 54490
13107 54490 33799 31394 101574 121957 197055 275588 250145 308343 383347 354987 309782 303220
13095 303220 326407 342933 302200 296239 285709 248874 284353 291400 274463 204921 178956 201959
13083 201959 138870 141988 118418 172229 198602 165324 167884 136094 118425 96956 106169 134225
13071 134225 157009 136720 199569 185538 169806 165503 69186 -5573 32950 92828 45003 35865
13059 35865 18254 -71084 -90233 -137050 -85494 -25878 -37605 -34124 -52197 -118627 -82252 -98235
13047 -98235 -61741 -25994 -47594 -121690 -162367 -154803 -164391 -204835 -172030 -154425 -160718 -141602
13035 -141602 -26171 71569 206277 257140 336593 382781 396967 360685 410470 400557 332614
13024 332614 406335 459789 463057 499424 479015 446042 371908 375250 410580 415830 456109 483617
13012 483617 463092 379125 397397 423214 398038 382724 390817 418090 384060 366508 354285 340041
13000 340041 316544 348779 363268 346962 337346 338125 362461 361648 349522 409296 413532 369350 359635
12987 359635 360552 359038 362343 409968 407875 458697 456302 448191 417629 417978 481097 542600 642158
12974 642158 681047 742456 904024 1067331 1169053 1202042 1241458 1207746 1164945 1094637 1033725
12963 1033725 1000770 1030819 1051959 1026472 969999 935773 930341 914034 905399 889453 913072 952564
12951 952564 986557 996116 945565 921560 945532 924808 884084 835912 822100 838366 863367 910322
12939 910322 905710 885476 912655 980820 1023975 999664 998082 1050862 1071103 1077293 1094716 1076586
12927 1076586 1099503 1113510 1136068 1144143 1154302 1174221 1217593 1275983 1260650 1212223 1172400
12916 1172400 1150221 1103443 1102499 1168146 1185335 1165572 1210827 1259402 1302035 1309543 1313988 1341625
12904 1341625 1402514 1429536 1450494 1514042 1579963 1668155 1727957 1721470 1771047 1794079 1847184
12893 1847184 1843077 1837119 1799708 1837488 1916872 2025257 2086666 2119256 2238703 2379037 2511464
12882 2511464 2605495 2718159 2867335 3014060 3245297 3429601 3567450 3798814 4049420 4312915
12872 4312915 4577638 4886737 5235010 5641318 6127088 6676418 7342844 8172670 9220940
12863 9220940 10482995 11960547 13605437 15560260 17825299 20368822 23299922 26701157
12855 26701157 30887784 36439593 44141245 55358468 71952716 95626858 126416058
12848 126416058 162824723 202639592 241586695 276549674 306917300 328812458 338814453
12841 338814453 336256338 322878622 299650235 269748264 239427277 211217619 184562700
12834 184562700 159880275 138486971 120972970 106788200 95066640 85199336 76917277
12827 76917277 69912721 63923717 58760860 54292785 50392816 46888691 43720639 40897516
12819 40897516 38221736 35741685 33594695 31652734 29845246 28161866 26648991 25315743
12811 25315743 24115138 23001043 22021419 21157626 20295119 19519546 18779231 18084353 17418954
12802 17418954 16842276 16242771 15674551 15174054 14723915 14324766 13941588 13535983 13137070
12793 13137070 12796015 12478663 12172131 11857634 11451117 11062418 10669863 10316691 10054336
12784 10054336 9800436 9515340 9225477 8998389 8737826 8476489 8242272 7951738 7720085
12775 7720085 7547415 7408878 7256022 7047680 6833863 6649631 6493394 6325008 6170859
12766 6170859 6024526 5883236 5692639 5481799 5369687 5228708 5057963 4920711 4861043 4749557
12756 4749557 4639860 4491922 4369125 4261280 4178897 4057538 3928105 3866891 3713464 3599287
12746 3599287 3537982 3492371 3445538 3341240 3245413 3186141 3126103 3055184 3010208 2945750 2863696
12735 2863696 2769473 2637226 2563587 2483165 2443999 2345253 2263112 2155391 2050103 1957209 1900044
12724 1900044 1842333 1881434 1798715 1710030 1640173 1558711 1546165 1507211 1544732 1571394 1541276
12713 1541276 1535785 1549453 1605162 1657785 1727050 1798982 1867379 1981113 2097778 2196110 2406455
12702 2406455 2728706 3119809 3548373 4078361 4730132 5292104 5853390 6413047 6788112
12693 6788112 6946608 6869811 6646068 6314942 5872890 5378815 4817590 4322447 3830821 3390109
12683 3390109 3046605 2798769 2603533 2384867 2186089 2020547 1880632 1719750 1677816 1626398
12673 1626398 1551552 1455030 1333168 1252033 1153462 1066572 1075860 1076928 912961 824623 772098
12662 772098 731508 726522 638510 547821 495390 492503 521891 535312 515613 550661 598518 633351
12650 633351 686546 791694 870924 941653 1032960 1027417 1038290 1027936 1027353 983844 938436 959446
12638 959446 977924 916741 840602 788806 735708 666266 637080 579890 565264 547588 527126
12627 527126 533357 510136 453603 423552 417016 433737 399064 352291 340081 371823 395300 410438
12615 410438 421248 359437 283790 231104 268947 315215 377286 434138 365030 345937 322421
12604 322421 290794 319425 319563 247236 219134 258062 255857 263337 264478 323141 366592 318816
12592 318816 265217 324925 357849 366232 332511 285325 222349 272133 325077 318277 294211 304240
12580 304240 282929 269764 325851 347119 327120 281585 266526 260345 254590 258636 301342 325259
12568 325259 298108 309387 296583 271181 218090 174331 171919 191212 206538 156258 80573 90850
12556 90850 63604 132336 204521 243871 247639 233685 189357 112210 87143 115167 169595 211114
12544 211114 258859 252801 183662 173918 156995 227315 266098 256982 221982 205856 182804 161481
12532 161481 144233 103616 92185 106420 119038 127297 139833 87437 58602 64157 42937 56797
12520 56797 108609 72348 41208 89903 89078 57422 32471 8218 6576 32674 43796 111006
12508 111006 116893 99500 93796 73905 50321 90929 112832 114409 90269 82093 59633 1380
12496 1380 -11031 10059 -455 -3718 35236 11666 28592 112592 73244 3914 30001 50634
12484 50634 78567 135174 191082 128784 37538 45365 95204 76617 11023 -22228 43863 110284
12472 110284 157372 134421 78644 50111 45995 72040 69472 42556 33002 63784 52556 49483
12460 49483 128667 125029 89320 23961 31988 126459 150990 113728 6104 -50543 -9140 41766
12448 41766 44699 9708 3254 22494 48961 34566 32033 82297 83870 64088 95176 135094
12436 135094 117194 154670 95322 71839 98521 122519 96997 111707 151310 220084 230217
12425 230217 237586 261585 305692 322915 346198 437801 549411 705966 963573 1194473 1353572
12414 1353572 1453078 1612800 1819718 1864546 1779426 1710205 1549011 1390081 1263277 1220157
12404 1220157 1122594 940713 806402 656262 570613 494417 424695 394520 359574 438181 486763
12393 486763 451090 371393 334443 299606 278546 271730 298756 270983 210543 184349 168528 204883
12381 204883 191067 129355 110445 154735 211650 205830 114678 88313 56397 103022 129921 180499
12369 180499 135818 78206 62972 17679 228 34350 72823 77257 51361 47340 56609 -19959
12357 -19959 -58419 -11548 10625 6818 14253 27907 49392 50015 21871 35254 61983 48577
12345 48577 38489 87037 83965 11568 -22902 29828 113194 179763 142665 49679 55937 47926
12333 47926 57498 81708 88053 50469 1867 2474 58947 45287 19043 8250 14431 28978 43576
12320 43576 68421 78908 117765 114822 65781 60141 9322 -37897 -17901 44765 87178 83354
12308 83354 147750 152141 127764 71788 48065 19600 -7353 -49225 -7623 15458 -34299 -22963
12296 -22963 48103 64393 37815 20371 -17415 -7313 -223 54783 26906 -14049 -47266 -48923
12284 -48923 -69520 -62950 21958 75325 93054 33007 12949 16982 38351 91841 73476 15301
12272 15301 -7718 9866 17493 76491 98804 64409 48694 78890 62686 -3767 -21805 8368
12260 8368 -2447 25943 2145 -13800 14962 72004 74123 40118 -34675 10399 39317 30886
12248 30886 19569 42229 63481 95410 76013 -10243 -50329 -60778 -74125 -28629 -34878 -28588
12236 -28588 -1404 34632 81409 31935 7398 50953 100554 124601 84826 -10929 3742 13500
12224 13500 -26976 -20351 16319 36582 35891 -22347 -83171 -119268 -131655 -113411 -92753 -78696
12212 -78696 -18796 -2 17284 -1602 6030 -15383 13421 -10185 -110938 -132268 -119970 -53321
12200 -53321 66364 84102 39991 29948 29310 -2157 18470 60433 27893 -3240 13610 -47478
12188 -47478 -70193 10989 49862 49674 55875 74398 31248 -16495 -61753 -111582 -82891 -27042
12176 -27042 -22069 -31953 -40173 -27857 13470 -8916 -59324 -10549 -15072 -16989 -9482 42092 71258
12163 71258 92396 13326 -18494 -73083 -57327 -65233 -41244 13124 40351 86331 65314 7701
12151 7701 -67563 -95925 -55448 -51325 -62049 -47309 -54656 -74875 -53592 -2431 41549 58504
12139 58504 58048 51596 21536 56438 123983 150008 84812 41650 72920 31528 -76783 -89146
12127 -89146 -64246 -60236 -100209 -117292 -78832 -8522 -31032 -25046 17029 34781 52230 8854
12115 8854 -65761 -119012 -110021 -77540 -39593 -38693 -39984 -110038 -123358 -65876 7372 24152 59537
12102 59537 19690 -6476 83041 72944 50845 2656 -16320 28610 15180 -58873 -69064 -45193
12090 -45193 -1684 -40900 -6314 12097 73004 78910 79346 85472 15292 4370 29572 91165
12078 91165 112250 92217 108617 100964 95304 38778 55123 57822 26187 -15358 -39037 -78924
12066 -78924 -71703 -49811 -58047 -46731 -49404 -69305 -86273 2877 141066 160383 48583 -10124
12054 -10124 -16933 -4720 44192 51470 -15158 -2092 43370 97851 134743 45598 -46013 -40256
12042 -40256 -79712 -73511 -14554 -12332 -24998 -25971 38282 79643 46129 562 -23987 5152
12030 5152 43898 36372 65305 15854 -34564 47961 73332 41423 63073 75901 37733 73356
12018 73356 98228 68031 80714 62764 66015 31651 -3526 -41008 -9774 28320 30652 69282
12006 69282 66477 -7175 10702 36786 55897 -26930 -33267 -18727 -32200 -35826 -5728 -8156
11994 -8156 -78777 -49197 -76035 -128231 -157664 -146302 -95659 -73914 -44457 16836 27759 -50885
11982 -50885 -66603 -95190 -69799 -61441 -31375 -48405 -79486 -23060 26509 30979 24909 -40134
11970 -40134 -43767 -30596 -33140 14534 83106 144899 171149 100870 56262 73295 20462 -77792
11958 -77792 -33769 -12975 29511 78674 46604 12327 -20874 -57707 -48125 -61914 -44609 -14481
11946 -14481 3587 -60206 -50821 -36012 -28113 20922 -10114 -18482 -10122 -27653 -78959 30495
11934 30495 63004 17605 -25968 -88084 -82748 -46010 -25576 6927 56675 31483 32804 -22500
11922 -22500 -73628 -89323 -123563 -92116 -69679 -72642 9489 26819 -65275 -107185 -51975 -7679
11910 -7679 -72408 -100958 -36677 81309 184574 161495 94196 61776 23611 28628 26404 -20570
11898 -20570 -48717 -59550 -37397 -54322 35458 50749 58926 29749 23992 21960 28259 85633
11886 85633 113830 99528 61444 66945 83466 72881 -26598 -38068 -37598 -11959 45605 24113
11874 24113 44566 45383 31634 27607 19173 -18870 15979 303 -1086 39335 40603 -9917 -27983
11861 -27983 -68420 -82439 -73046 -85157 -38776 -132 -4030 -21391 -89204 -88046 -95330 -37020
11849 -37020 -44739 -23498 -65426 -80185 -81620 4383 65020 40011 16851 -16522 -54229 -37055
11837 -37055 -87453 -91159 -103969 -55136 7948 -8404 -51358 -37202 2423 -23371 -55919 -50120
11825 -50120 -63152 -23428 -7299 -41087 -79912 -42900 53555 92358 70133 9751 -41032 -67565
11813 -67565 -15781 -1407 37102 42525 -58095 -130040 -108347 -40751 -63136 -99961 -135607 -100211
11801 -100211 -33375 1187 -42745 -87872 -74188 -59020 -47828 -66523 -53851 -60206 -67033 8759
11789 8759 37614 -21600 -102031 -110879 -53215 8847 19928 33883 24911 6401 -10398 -27729
11777 -27729 -38470 -361 4170 32242 28719 13120 -16951 -1991 -36520 -33959 -69993 -126799
11765 -126799 -132614 -179095 -160201 -49496 4670 9374 38067 -10416 -19535 -29857 -58360 -99378
11753 -99378 -108648 -79485 -26727 -29523 4672 7246 27926 64009 18351 -34370 -56944 -132508
11741 -132508 -191628 -204982 -219562 -157572 -60983 -87057 -127452 -101363 -62542 -9752 13546
11730 13546 2967 4850 -14951 -43874 -93600 -117134 -113346 -105887 -61072 -55613 -69604 12559
11718 12559 18306 -11075 -24190 -37374 -62286 -62580 -36946 -18892 -684 43743 51760 19510
11706 19510 -11948 -3789 7781 53815 43232 50640 83175 43899 -9391 -24515 38856 104621
11694 104621 120441 100263 73158 11456 30114 52815 2195 -30007 -50972 -48024 -41696 14843
11682 14843 24850 51181 -42366 -108024 -60568 -25393 -40804 -43103 -11693 -35395 -56913 -34574
11670 -34574 -32836 -30336 -4899 -31387 -73054 -87394 -66296 -26080 10436 -5976 -35206 -25895
11658 -25895 -46463 -69940 -42114 -45461 -15995 -26347 -1944 6532 -16693 22117 34818 -663
11646 -663 -18797 -12563 -23458 -33296 15299 -9382 -15944 -608 11103 16138 -51817 -90257 11153
11633 11153 74901 94702 65856 23182 26287 34920 -41 -23334 -54276 -55940 -13592 -27497
11621 -27497 -106318 -65248 -10517 -22821 -81263 -93306 -22925 27724 38118 24640 15263 -12893
11609 -12893 -34042 -55219 -15624 -46835 395 29637 55394 53430 61751 112613 96757 42594
11597 42594 6802 -26159 -60987 -86312 -84700 -90429 -64256 -44746 -34746 -12415 -74481 -144848
11585 -144848 -92063 -74179 -79462 -73658 -85364 -103427 -75386 -40263 -42507 -99874 -110631 -53009
11573 -53009 -42845 -8782 15176 1652 -3005 -33953 -94832 -68112 -31824 -13643 24142 46938
11561 46938 48474 23864 17534 48503 44100 28133 26200 3036 20854 77109 17463 -59053
11549 -59053 -45727 -13112 -36791 -7159 24152 43673 43415 -29097 -24013 16391 12353 -11237
11537 -11237 8034 98230 119922 73414 45197 57873 36578 -13822 -82440 -81378 -23143 62700
11525 62700 91510 122358 49472 71270 86841 20370 1889 -15490 11671 -26622 -87417 -101997
11513 -101997 -54958 -39065 406 -8291 26325 -2212 5292 26781 5854 -9485 -18660 -49451
11501 -49451 -69738 -105276 -112249 -33969 25678 54555 67015 58200 -28399 -56801 -63940 -28632
11489 -28632 -8305 -11094 -25354 37179 13427 -66793 -6326 54923 30553 -17969 -17532 47834
11477 47834 100816 71180 41641 28800 20370 -18375 -40590 -81787 -121406 -125753 -95719 -9442
11465 -9442 21295 19906 28634 16575 63143 111097 89104 81250 88982 47583 13537 4373 -25402
11452 -25402 -42233 -88660 -101587 -105871 -132571 -111788 -123517 -116621 -105727 -97696 -94146 -44225
11440 -44225 20400 -2697 -59101 -102370 -123075 -152491 -58658 22636 21193 -66317 -55048 -11707
11428 -11707 28186 63918 88860 32086 25858 39389 -14970 -59111 -51460 -51951 -80800 -50147
11416 -50147 -44390 -58507 -1816 69206 59593 8604 2262 -4696 -31387 -9056 19282 -4801
11404 -4801 -22947 33408 41655 -41658 -50187 8263 -39895 -75488 -56989 -18911 -32095 -22051
11392 -22051 -18023 -38341 -20953 -11368 13623 25463 -23485 23747 32126 62553 46664 15150
11380 15150 -16029 -40526 -27143 -35869 -64984 -34086 -43083 -84517 -87783 -37913 17012 -6517
11368 -6517 34170 66900 25192 -28230 -26049 -8670 -42399 -70170 -109951 -94923 -109530 -95583
11356 -95583 -48350 -69122 -56690 -36990 -38100 -114061 -71941 -15723 18819 16048 11638 -80527
11344 -80527 -78731 -78968 -50551 -26159 -10641 16467 -4683 -61905 -60081 -53516 -85597 -102622 -37186
11331 -37186 7986 -17170 -73190 -120183 -114520 -84244 -49920 -78005 -88552 -75271 -91257 -98832
11319 -98832 -124199 -97446 -70841 -77221 -124321 -158451 -183266 -116726 -63017 -44035 -114907 -81633
11307 -81633 -4700 4166 -14688 12686 10901 9704 1423 29989 39845 -17308 -33324 -4624 -12426
11294 -12426 31153 25464 -5179 2925 -44136 -51957 -66397 -57405 -43842 9187 -15221 -30570
11282 -30570 8551 -39630 -106241 -115471 -114683 -99004 -65679 -41764 -2049 12493 -79403 -75083
11270 -75083 -49231 -75084 -61169 -2692 -6591 -1821 42458 56246 -24386 -18988 -41002 -85840
11258 -85840 -65827 -61636 -59836 -16350 -19645 27505 14799 -24823 -25401 -29545 32438 23658 -40927
11245 -40927 -49177 -10010 -11283 6625 31241 -12329 856 35429 53005 108251 63808 32098
11233 32098 -21588 -40198 13522 -2443 -21541 -32609 -24522 -50764 -74703 -62326 -13221 -1951
11221 -1951 4920 33485 45790 15913 -27299 -54153 -7528 37452 37706 28519 3206 -34295 -53226
11208 -53226 -26831 -25735 -36074 -38790 -46964 -38843 -3219 46970 119149 99519 28370 -19463
11196 -19463 -56947 -57269 -87986 -38734 50896 34730 -15414 4057 -12710 -79446 -42991 -41061
11184 -41061 -2424 35242 14593 -7790 13046 44540 26359 -10687 12126 81597 122312 142341
11172 142341 136720 91681 39459 32484 74584 85436 37280 -44649 -96438 -24214 57791 119630
11160 119630 86133 -7627 -9059 23700 59907 85645 134830 101976 72619 86678 85323 72954
11148 72954 76005 37551 -6475 27206 -6862 3610 46571 60754 34433 -46328 -89439 -45890
11136 -45890 -72672 -89769 -76986 -20675 -20876 -19384 44887 53831 -8878 -12475 -14910 -21902 -17656
11123 -17656 -52872 -83674 -86173 -22065 24094 4812 -9784 -3839 -925 56326 37472 -3969
11111 -3969 -50842 -50411 -72417 -67717 -58782 -37302 34548 56481 12584 6070 -26938 16555 20390
11098 20390 -34367 -25355 11017 36022 14273 50763 18317 32067 -37312 -91289 -77207 -22792
11086 -22792 13783 46615 2917 -29135 -26900 -19377 -88760 -80392 -2502 1963 3127 8535 23526
11073 23526 54552 67701 8124 -62727 -58334 -39827 -81681 -92457 -80111 -25999 29905 95228
11061 95228 78207 33544 50906 69791 103470 53501 9716 4904 -13694 -27732 -6317 28795
11049 28795 -6393 -64952 -154466 -177574 -139202 -107297 -93245 -65070 -8797 51822 58319 32685
11037 32685 39350 -7785 -5871 24311 56665 44972 28980 30618 -35120 -60818 -58698 -32512
11025 -32512 -336 -17253 -9189 -21572 -66108 -65562 -47797 -130080 -191804 -156507 -93665 -44953
11013 -44953 -14187 -7018 -25479 6975 45774 11702 -35477 -43370 -10049 -24664 -68314 -81595
11001 -81595 -80559 -85203 -57002 -37903 29928 38082 -9094 -43904 -54894 1336 3947 -1432 18056
10988 18056 32281 53464 2630 14836 52191 41892 -3485 -43251 -2858 -5344 13578 -30815
10976 -30815 -64586 44608 63558 3097 3690 48610 36914 54310 44634 5873 21660 31409
10964 31409 66953 -189 22341 58454 -4320 -44072 -9474 -40576 -72632 -80794 -56542 -7705
10952 -7705 17054 47055 53298 73377 49986 14317 28224 65153 31641 58 -53029 -57703
10940 -57703 -108712 -113066 -77981 -70555 -54271 -72110 -106094 -72548 -37297 -22732 -60462 -65046
10928 -65046 -42855 -26310 -44141 -66963 -67722 -88537 -4263 66448 44187 -32775 -66183 -118656
10916 -118656 -116413 -61882 -63210 -13047 25317 61412 21640 -32053 -18256 12835 19349 -15601
10904 -15601 27813 37946 16253 14123 15682 35688 16290 -61908 -76179 -91552 -49875 33812
10892 33812 13908 -5985 -27354 -46497 -16562 45288 63057 27825 -34722 -54097 -83801 -95231
10880 -95231 -76186 -16257 -37262 -6995 -7399 15329 27390 -2993 -58508 -58719 -45905 -60849
10868 -60849 -3767 4139 -13715 5592 16350 -9081 -70172 -80274 -16186 -7418 4425 -40038
10856 -40038 -16647 -17929 -1874 -5627 25852 17114 5133 -31360 -47227 -41438 -342 3210 -11424
10843 -11424 -51139 -49563 834 36722 15384 35635 81802 23122 -21189 -7022 20993 9358
10831 9358 -1834 -7433 35654 11 -12470 43424 52071 66238 63975 54427 42160 22781 -64
10818 -64 50957 44258 -10608 -964 44870 3384 7039 46 -15607 -34925 -15912 10510 74785
10805 74785 113150 114303 97477 67127 10502 32528 64421 100615 87328 64979 11479 -25826
10793 -25826 -9248 -12788 32366 81670 59415 6883 -11972 -41317 -36859 2572 32199 116706
10781 116706 123314 72025 13385 35779 59483 11813 10535 27822 13845 5370 26966 23058
10769 23058 37711 -165 3306 46248 31774 26869 30671 4719 24140 113397 107376 98022 121235
10756 121235 74071 24874 8875 17150 7373 -43200 -91986 -53043 -63229 -5832 38620 12189
10744 12189 -6399 -14604 -101528 -145746 -95690 -35015 -19413 436 56832 -1465 1197 -15226
10732 -15226 -41147 -49020 -70431 -74807 7155 61141 60478 83077 100822 57489 48155 54410 26712
10719 26712 33871 16150 -13903 -21261 -31170 -6732 3872 7977 -11212 7060 13461 -31372 6236
10706 6236 50541 78109 37267 18015 -2629 -4089 63230 94660 94494 62123 32844 49602
10694 49602 45200 31506 39869 64185 96246 72719 10451 9954 6045 -39363 -118747 -113267 -97811
10681 -97811 -50744 -71041 -41149 20410 94121 85806 29225 -20589 -76427 -132000 -96639 -44643
10669 -44643 -29774 -1810 -50579 -66860 -35028 11313 30315 7086 -87128 -110109 -104937 -73090
10657 -73090 -32680 9371 112452 105736 105457 148893 86017 10269 -1677 -653 -57463 -88394
10645 -88394 -109567 -64239 -41251 -43766 -56343 -66072 -28284 47493 67434 85803 46320 -10853
10633 -10853 -21862 -4463 -51943 -39927 811 38930 104018 73150 18206 -21579 -47457 -18478
10621 -18478 -54671 -34325 17304 -7270 -69828 -92112 -64015 -55733 -32940 -15476 -7001 -5275
10609 -5275 -13392 9985 84473 133299 99833 34344 4781 36559 46865 27266 -34361 -100929
10597 -100929 -27316 25871 12537 63129 72478 33203 -16662 21528 42186 -22928 -35313 -13526
10585 -13526 -7466 1549 -3420 5515 3521 35771 55163 109556 84506 47382 28372 25997 18523
10572 18523 9526 -3980 25490 57848 81391 56913 12124 -72140 -14756 87814 78527 68477
10560 68477 104833 35162 21571 11356 8389 -25659 -13133 6504 19407 -785 9130 8876
10548 8876 39694 22689 -16029 -61 39486 50920 15046 -46242 -54825 -104940 -78912 -75305
10536 -75305 -62831 -106656 -150662 -124704 -100750 -127511 -103053 -1473 79687 108205 97458
10525 97458 132764 152315 173568 240035 270191 278214 284363 343670 352093 303928 243632 155833
10513 155833 161492 125358 77610 42915 44949 41214 48513 43108 21178 66942 75595 31553 37175
10500 37175 23772 -16516 -4988 23580 9043 -61392 -78956 -44519 -23544 15739 24966 73815
10488 73815 88843 81669 41726 61516 85355 80563 119001 71466 15421 35049 101207 144446
10476 144446 107503 45684 -41720 -19526 10212 9594 -76948 -98255 -65881 -62413 -45454 -98651
10464 -98651 -46559 -41197 -118094 -100850 -142674 -106436 -55701 -61513 -69632 -112737 -102021 -93470
10452 -93470 -82564 -66767 -44597 12027 43764 84745 83297 107535 119089 62211 24517 20374
10440 20374 17527 -68541 -69797 2817 46305 75704 15497 -44768 -78420 -74747 -35406 -35152 -36675
10427 -36675 -90878 -59333 328 6620 -11052 -36234 -51000 -52375 18532 45658 57113 -4740
10415 -4740 -32142 -9361 34447 39802 -5318 38266 48097 56614 95524 91134 31940 -26822 -46589
10402 -46589 -66608 -21415 5972 16870 9495 50192 22860 -50096 7210 8683 41019 28940
10390 28940 29317 58576 75587 57879 38134 39946 74880 34649 -27639 -54293 -67482 -54569
10378 -54569 10986 23687 -28614 -67970 -10537 -18002 -51439 27661 31422 40930 30149 -38704
10366 -38704 670 27961 29198 49561 55915 44916 68419 103897 128354 139955 167432 157371
10354 157371 121783 96518 92537 24707 7155 73972 79633 81144 96216 117600 15489 -85745
10342 -85745 -67206 -39141 -16288 -15821 -4011 -63044 -100157 -120974 -92720 -33504 -22134 -82997
10330 -82997 -64511 -43403 -62509 -53723 -44079 -17527 45902 68646 84471 63060 -10347 -20268
10318 -20268 14283 32726 13050 8732 28891 48951 18820 47020 59880 88076 29374 -37511
10306 -37511 -53964 -11204 -17489 -7777 16432 -9172 -2655 22983 48042 21655 29643 62223
10294 62223 134140 164809 151362 91853 7671 -25542 -13104 19134 35727 100914 149039 55541
10282 55541 64497 36875 -4723 52521 72139 21270 3166 -31572 -66046 3745 50416 -5104
10270 -5104 -46056 -7201 62142 93284 60220 27736 5536 -71128 -71312 -71271 -91791 -48708 -55590
10257 -55590 -4406 42677 29295 76766 102050 58087 2113 -6485 -44687 -42130 15782 81097
10245 81097 109101 110865 103200 50976 53984 52320 4838 -13247 -17401 -23491 17586 76710 88979
10232 88979 89807 82236 29137 37224 40079 13333 -30615 -67116 -23897 24554 42659 42618 85325
10219 85325 119320 77020 120793 154626 159133 86822 5283 -9680 16390 13553 -11951 43200
10207 43200 37780 30292 60906 41825 52389 80765 100371 80680 50262 20618 9741 22538
10195 22538 21637 19635 53701 138712 132994 102329 55034 35592 64012 11016 -9875 34828
10183 34828 41627 6803 6212 51526 43059 71803 115804 109162 41989 -5298 4449 106340 177816
10170 177816 154912 44455 38062 69596 7132 -8447 17316 33562 59539 41900 43024 28170
10158 28170 39425 82643 80678 36460 25016 11063 64 43931 108667 99453 77760 -4736
10146 -4736 -42475 -62911 -100514 -112918 -75441 -95198 -54400 16896 80612 51847 51181 82423
10134 82423 106462 65660 4686 -59251 -16855 85695 108658 120097 161360 117834 17676
10123 17676 33098 26794 11762 16420 -23669 -85963 -37087 -24240 -45883 29263 49910 28153
10111 28153 44546 60207 47534 61096 20856 29196 71579 53315 18465 68729 99321 77767
10099 77767 119551 152232 89787 47887 36775 43798 41105 41913 62039 120200 68695 -4103
10087 -4103 -47857 -21283 73490 81653 54751 95082 92523 45145 15881 83830 149485 148870 183038
10074 183038 195044 140844 103787 156432 167881 152274 114306 59759 56894 127355 149279 143939
10062 143939 116058 130890 154499 107180 68590 45754 6216 -32432 17540 69896 102304
10051 102304 60806 18558 5153 27282 49573 58005 38690 31301 81864 120450 89561 39174
10039 39174 65507 52575 62108 83153 89471 79195 69722 47372 39977 74564 45918 39238 -18003
10026 -18003 1075 64168 59711 51651 29576 52634 51444 44052 52467 76951 106997 102614 19688
10013 19688 2162 58860 69147 4036 10179 -19017 -5340 27892 18938 -45250 -31347 27545
10001 27545 66639 107034 100977 73390 21019 -16923 -372 -47762 -120334 -77880 -38503 -1756
9989 -1756 19510 979 28316 9191 -14939 52903 83224 76245 36540 -7684 -33021 -16565
9977 -16565 4627 29410 31089 67912 32757 -21084 -39189 -5947 43628 78297 86118 170035
9965 170035 116280 24914 27748 72754 94782 108585 129900 125739 89158 5815 -7950 13395
9953 13395 20139 41567 32054 36328 100700 121478 184094 214809 155209 117346 129145 25480
9941 25480 -13108 -38175 -43746 -16641 23229 64629 67735 30223 -6285 -8891 10509 64237
9929 64237 96727 74943 36527 78986 158396 166146 141578 111788 87206 88016 66211 84734
9917 84734 52377 17880 45650 34352 8275 -20034 -65707 -71946 -60024 5782 63410 123872
9905 123872 117125 70807 55590 27580 26965 132820 173724 77250 37160 59112 48475 80212
9893 80212 120639 166682 163043 72654 68554 80223 95949 93713 39648 13343 -7340 3670
9881 3670 23227 -10837 29082 81468 125736 156491 82595 77992 78062 123823 96890 102339 119608
9868 119608 153105 200481 236775 282083 221730 130503 19710 34876 31345 49977 117326 167196
9856 167196 145234 112421 121583 164798 165591 101211 82278 155223 205284 223170 232301 264750
9844 264750 297977 318337 444164 558165 512521 484889 458741 476790 498571 425465 356962
9833 356962 330183 288017 248586 217978 170830 51448 35723 111386 242099 313805 387618
9822 387618 311672 229591 280898 353572 389750 393231 370288 362495 274479 252303 286710 274885
9810 274885 302989 354852 323085 278314 295737 255729 237500 244158 227208 196803 139327 137469
9798 137469 135351 122514 122226 155373 177371 192285 217378 209809 185043 121047 85095 119702
9786 119702 139574 94548 129177 152719 190209 209531 136733 76256 75075 51024 -11313 -4800
9774 -4800 48253 118330 116090 86162 95140 97766 101449 154806 209816 154847 144706 129911 83165
9761 83165 68598 128692 175375 196167 177794 117130 110560 108099 117032 108980 127884 102923 151114
9748 151114 147438 147711 93720 103325 133106 162893 180873 203840 174595 201365 196649 167212 147388
9735 147388 90928 97679 146382 140242 163048 154918 165078 173498 141801 133385 122692 147491 144071
9722 144071 139411 133753 105841 107086 118941 104478 140836 173323 222009 220591 221621 205673 186364
9709 186364 231748 266029 229174 161153 160840 163968 126511 99862 172875 157621 77974 66125
9697 66125 86609 174783 222906 192762 107299 67938 58156 103983 128916 131437 119944 129245
9685 129245 102128 114487 120181 102649 131871 153398 114456 174495 206983 174627 142259 153847
9673 153847 153139 127057 107665 151038 119353 71422 91705 100570 124914 147825 123680 176444
9661 176444 179805 201035 131942 167123 171793 164319 177994 126769 147203 93969 130897 192623
9649 192623 192706 115148 58658 82783 146988 162408 181078 204344 200403 209320 154552 128688 147576
9636 147576 149816 101662 126442 193126 227913 229556 167325 141244 148464 127886 178374 207337
9624 207337 220419 240067 250223 222362 163598 103034 100083 157623 170229 149285 109076 124430
9612 124430 130977 123752 98455 58939 97179 159065 176837 211315 143558 109434 98651 55850
9600 55850 98683 184954 179994 185426 202112 199661 169341 152212 147176 125853 105200 111492 105800
9587 105800 118424 154176 146568 172081 179157 128247 106596 107816 138837 170805 168048 126766
9575 126766 132980 190793 262400 244168 197040 163418 158909 125173 149656 270921 315490 225113
9563 225113 214366 185570 203015 189457 225875 253205 287773 308911 281370 237365 208822 157595
9551 157595 171669 222053 259955 246307 208127 212651 159290 174121 230511 291746 282864 254206
9539 254206 219511 151716 180676 145604 140534 229658 244355 234626 231944 171382 188432 248767
9527 248767 270820 291286 181907 199416 255603 216582 165597 155196 152118 175052 236196 271897
9515 271897 264672 206927 199852 240491 198423 187268 182158 193868 221116 224462 256905 285342
9503 285342 279455 266150 254738 257838 263758 255558 302700 326210 252450 182718 201753 219161
9491 219161 219616 179079 167499 156404 158852 181626 194105 214623 246938 219722 214066 207055 235338
9478 235338 280588 320327 264669 266511 295294 295857 292782 240986 217933 197257 199414 163204 203567
9465 203567 260167 310184 291982 214797 197033 236564 250773 274798 255010 286106 251889 231722
9453 231722 248017 239639 245606 271963 258711 248996 256270 307097 344761 301621 277125 264014
9441 264014 240499 244404 237100 261437 270634 323227 333344 328269 331670 295206 265898 325254 343634
9428 343634 268356 253980 263968 288102 287679 276013 258351 302643 322199 336051 334230 322766
9416 322766 318201 282728 296615 318615 341874 374219 300386 251460 241038 287858 368823 385055
9404 385055 379295 398226 385497 379739 375721 375519 382627 375015 385496 339157 352875 376504 357416
9391 357416 323449 311183 324291 367943 377101 327533 293864 338186 373505 390468 391224 353856
9379 353856 352512 352799 379686 379576 410962 405837 373211 317103 313446 294240 327270 421070 457143
9366 457143 459947 445054 450328 423350 425935 421481 420312 487588 410579 349160 305382 335306 402341
9353 402341 418824 395098 382515 393739 463695 497070 461999 409778 403913 457139 541159 505231
9341 505231 432012 421807 472101 487761 472793 469929 428092 439752 482907 526275 540717 532513
9329 532513 472684 479157 482828 471296 473476 463866 449403 467154 484464 480512 481595 515244 510196
9316 510196 525772 524680 509815 520381 547461 602875 614971 626931 642708 674981 637082 626456
9304 626456 652941 617724 648528 639077 615300 613281 585241 591678 622257 662277 645265 710512
9292 710512 743634 720723 682968 632471 616493 687405 682578 654803 605672 593961 549778 531580
9280 531580 577937 585811 573958 583787 595318 602598 658521 747044 738424 663048 593241 604789
9268 604789 698939 716190 691352 736274 693597 629737 670644 695996 736836 751167 804302 794766
9256 794766 784584 749754 733034 769209 746241 689552 736678 811162 855090 838613 810227 831217
9244 831217 879776 912379 895979 874491 856438 872234 865525 804812 800911 805178 793429 760088
9232 760088 788759 808562 850365 857702 931620 1008719 1022111 1013468 967768 887066 890090 991742
9220 991742 997862 1019997 1030772 1124814 1196432 1158448 1102929 1068983 1053647 1048901 1095827 1065177
9208 1065177 1033395 1072190 1110910 1123453 1106371 1117003 1142187 1174852 1123295 1123694 1150348 1151572
9196 1151572 1183821 1134933 1099947 1118450 1149603 1235082 1256308 1218753 1228426 1241909 1226663 1278298
9184 1278298 1341276 1319939 1311663 1350544 1362520 1328546 1341003 1361518 1401279 1371829 1376403 1415897
9172 1415897 1384012 1397343 1446532 1495207 1536268 1524066 1527723 1532135 1534811 1595790 1541696 1472638
9160 1472638 1439581 1495610 1584519 1634677 1650822 1654473 1670273 1691873 1698550 1657649 1630525 1644136
9148 1644136 1711867 1778782 1841033 1873985 1826173 1777617 1829050 1840719 1833253 1867247 1913934 1954486
9136 1954486 2004370 1965818 1958100 2008472 2053725 2097412 2139464 2167379 2128225 2147207 2184660 2193215
9124 2193215 2264174 2312388 2366057 2410728 2439682 2458516 2485696 2459035 2490915 2500047 2557345 2671840
9112 2671840 2695815 2745607 2765120 2739995 2773312 2815091 2863966 2870771 2879008 2898127 2983434 3090639
9100 3090639 3102336 3150464 3157182 3143794 3170326 3271916 3313018 3379185 3460970 3516835 3520568 3554391
9088 3554391 3586325 3595182 3621514 3685383 3756187 3825056 3887045 4022934 4073324 4133633 4202714
9077 4202714 4258116 4340985 4357648 4373430 4397576 4472658 4584996 4634981 4672989 4763957 4792109
9066 4792109 4787855 4853325 4967739 5104642 5131806 5164061 5274407 5371189 5451494 5525456 5586582
9055 5586582 5692083 5792555 5934844 6038761 6141157 6216414 6333367 6453695 6570995 6691080
9045 6691080 6844650 6945134 7062001 7206011 7297457 7426306 7566554 7772789 7981142 8173737
9035 8173737 8290876 8373759 8460932 8646468 8826951 9035778 9224849 9381299 9563290 9810900
9025 9810900 10056800 10297147 10536069 10737815 10988323 11262621 11546860 11875178 12187896 12463055
9015 12463055 12733282 13001861 13321238 13727717 14081765 14408485 14788005 15180612 15605185
9006 15605185 16015871 16467835 16918385 17396681 17958843 18519426 18994864 19511904 20116201
8997 20116201 20795752 21400002 22050455 22729772 23482431 24227624 24921009 25754221 26650083
8988 26650083 27563844 28589568 29579840 30564650 31677739 32770441 33849627 35054909 36311561
8979 36311561 37550708 38853073 40190143 41564094 42993591 44518697 46038354 47635886
8971 47635886 49275710 50885937 52537743 54239331 55957701 57678386 59364364 61037380
8963 61037380 62707388 64301016 65792632 67249269 68573318 69904060 71174980 72317931
8955 72317931 73242961 74069310 74781554 75338219 75673187 75835304 75866670 75744934 75495047 75102059
8945 75102059 74535261 73836856 73038547 72110416 71139857 70026934 68908059 67653798 66359405
8936 66359405 65006707 63637735 62201964 60757092 59324842 57993180 56572855 55127195
8928 55127195 53761244 52384346 51014284 49675969 48352665 46996183 45687914 44495743
8920 44495743 43318282 42152326 41049126 39940243 38818435 37757505 36760887 35822379
8912 35822379 34898817 34025985 33139862 32236057 31367693 30547980 29768252 29010079 28235181
8903 28235181 27499496 26811070 26112057 25491905 24880020 24258941 23651643 23127531 22624196
8894 22624196 22071427 21575266 21097710 20616111 20130243 19651747 19180644 18733114 18290056
8885 18290056 17849705 17450401 17140146 16799374 16426550 16046789 15769729 15484646 15139206
8876 15139206 14882107 14545861 14184355 13888264 13593596 13280428 12980536 12695975 12391358
8867 12391358 12097938 11864875 11681969 11440803 11183301 10940223 10771569 10496078 10288535
8858 10288535 10120746 9912335 9763673 9635609 9469004 9287607 9070183 8860915 8657269
8849 8657269 8466692 8340813 8210392 8038966 7876340 7696107 7530954 7432634 7314144 7181058
8839 7181058 7027211 6890448 6794524 6729975 6660013 6535942 6390840 6306514 6199254 6079695
8829 6079695 5949232 5798012 5677249 5555137 5544281 5483750 5382483 5278180 5246410 5250959
8819 5250959 5151865 5031146 4924636 4884726 4826053 4738742 4683684 4636579 4576265 4466283 4390622
8808 4390622 4283097 4196200 4145539 4111109 4004008 3887955 3811677 3781375 3734548 3718710 3660201
8797 3660201 3607921 3587807 3499043 3427449 3409160 3386177 3288571 3239174 3183146 3144213 3058957
8786 3058957 2984018 3013419 3070050 3043211 3011111 2939335 2846369 2780544 2762515 2749737 2715867
8775 2715867 2680857 2605576 2504523 2485226 2466406 2462814 2510864 2517499 2482669 2463131 2380466 2347886
8763 2347886 2346611 2337064 2333906 2339719 2272270 2228310 2248577 2224562 2170420 2185374 2100907 2049666
8751 2049666 2018597 1954461 1899282 1882707 1898421 1914028 1889749 1923340 1899857 1847061 1854633 1886595
8739 1886595 1898862 1799852 1690144 1689589 1712127 1717730 1726783 1760391 1767335 1796163 1734905 1714868
8727 1714868 1684283 1655533 1647535 1602263 1525697 1525793 1482649 1432509 1462619 1442319 1476336 1495723
8715 1495723 1473417 1508300 1516430 1485600 1453905 1430200 1409874 1374354 1353055 1380246 1360057 1261219
8703 1261219 1255143 1288777 1233372 1195492 1219975 1225737 1241326 1231847 1183369 1154159 1096903 1125792
8691 1125792 1158116 1195539 1190626 1163865 1112974 1122856 1151348 1130160 1095227 1117030 1140171 1074562
8679 1074562 1004684 1012468 978148 981255 1008788 1003532 997175 994811 1003614 1043123 1056697 1049889 1049680
8666 1049680 1066561 998476 987929 979070 967003 978008 944711 876029 854637 885301 906565 841372
8654 841372 865561 902814 872538 820968 779847 838386 869890 872434 838539 759669 722485 743901
8642 743901 824527 855131 848406 791652 763406 780501 748803 721617 709293 661949 665468 715673
8630 715673 763954 783877 766638 750573 761990 775165 810581 830918 806239 713980 707723 728159
8618 728159 734465 751850 720470 680775 731908 755445 742250 702393 654517 633682 611976 615564
8606 615564 596120 537940 555584 584964 578794 611453 661663 652021 689831 732474 652725 605497
8594 605497 642160 704244 735894 720677 755915 779800 828289 836091 895366 943676 899857 859034
8582 859034 900434 819391 817508 797549 778061 737684 666884 680979 662404 649490 692120 660990
8570 660990 601735 613599 651750 617608 615439 629423 611447 556724 493369 555406 605880 585678
8558 585678 537588 452530 460565 523943 539579 555029 597518 556039 542137 557151 514062 473790
8546 473790 464079 436014 409841 371619 415956 406637 377547 326185 368817 477724 439566 401588
8534 401588 416417 428583 415111 387936 411711 422633 421050 404961 439627 492064 469261 386433
8522 386433 388928 408195 375740 351615 327559 311816 339291 350938 333917 327211 340375 327593
8510 327593 327360 401661 418353 364601 303984 325499 320282 341124 333798 309751 297472 273817
8498 273817 298911 313069 350422 389662 378909 368225 375362 346510 382831 419954 375045 340316
8486 340316 324576 300591 234450 231238 266209 268614 277981 314297 323329 380446 377692 373478 426199
8473 426199 423441 368042 328479 291280 291732 231793 232056 262919 246126 240165 235826 268700 280736
8460 280736 289907 263915 222811 251109 227052 178157 198584 225151 261785 261739 297470 322670
8448 322670 275904 227801 224189 225838 204377 174039 185602 225497 238741 230487 256515 250990
8436 250990 241580 271091 288312 320035 312130 304934 344479 367764 357165 279568 273160 224348
8424 224348 234328 278008 330054 297574 234467 243850 263805 277434 226345 201501 223445 261327
8412 261327 245949 167778 115931 133119 165106 198717 170168 80350 92475 122541 162389 142228
8400 142228 151380 159104 173327 168985 173535 209537 200161 160253 231709 279338 274059 249340 254358
8387 254358 249794 231549 170543 161264 191218 289965 440586 588903 678910 678021 551824 425228
8375 425228 382350 387908 306267 258923 302014 305547 302067 236249 226916 287340 275835 260608
8363 260608 249892 242474 256231 259502 258681 231836 205023 241985 303679 285519 270768 260064
8351 260064 251899 261704 359745 359252 309966 309492 309375 341580 355443 424782 548743 617688 612422
8338 612422 541758 455318 374418 313500 279194 276198 230272 225400 278547 266225 290583 291604
8326 291604 253606 229862 232294 251627 193186 162781 193309 235395 248743 214533 203429 203056
8314 203056 255204 229087 229934 227183 245846 213392 162920 123412 167857 218736 247924 206449
8302 206449 158252 152131 127871 174647 161818 190174 247798 272028 258954 157326 150831 179380
8290 179380 203218 197776 144144 117812 119875 145460 138677 167962 133754 113682 129996 130794 140681
8277 140681 153099 152184 243362 244337 160175 147490 167119 154850 116578 113275 142618 120303 57145
8264 57145 9055 2958 56709 114256 82547 102652 123079 133253 49359 38465 21708 42184
8252 42184 45419 101602 178442 177413 110689 75530 86763 110402 133703 175966 174818 132635
8240 132635 116857 95165 103854 155059 122569 138059 161933 112045 102744 145459 170575 179846
8228 179846 153646 163368 156839 105440 65209 32604 25756 36600 23053 62490 127842 148613
8216 148613 136089 98663 89178 101392 142790 152397 71289 47638 25058 41209 115834 143517
8204 143517 145024 136066 104634 77497 47035 59363 128244 214978 253297 233093 149322 72227
8192 72227 60608 102429 92206 97989 107932 69446 -15145 14322 63490 69386 94648 121583
8180 121583 166877 174080 116545 73811 12141 -11057 4480 73342 156465 171084 154535 111524
8168 111524 79134 90994 132815 135379 140259 142286 143418 165778 137857 154001 128972 108690
8156 108690 137317 110157 68706 -73 -3778 36277 24052 63880 98463 69913 31556 101480
8144 101480 194486 228194 203008 167633 124540 73260 14599 17755 76458 165657 160742 117699
8132 117699 43817 -9592 -1534 25327 2282 -15008 28494 91082 104874 96999 95095 114847
8120 114847 88694 91585 38096 36410 38278 108940 107584 143515 123926 110673 154605 122565
8108 122565 96844 83892 22648 9013 18402 10620 7812 33540 15660 47512 73878 29230
8096 29230 26822 13735 30647 64075 97041 128489 159868 104947 34482 57642 40548 91451
8084 91451 116758 110016 139547 179418 114769 127462 168049 173054 141971 130697 127301 39195
8072 39195 38165 -5722 26537 41589 38887 87559 75500 46680 -8687 55893 77332 55515
8060 55515 62301 96082 126006 159245 139290 55788 6063 90482 146903 122956 151302 182934
8048 182934 139301 132752 116575 87226 53862 66656 77325 87599 132623 147740 96035 89044
8036 89044 56799 40107 50527 119772 154596 126997 105695 65202 96970 115410 91658 85523
8024 85523 111691 69990 38139 10720 85767 111161 76174 79213 121315 114171 78641 66963
8012 66963 66665 119662 125115 95392 87216 91741 127363 129776 99341 71956 79131 60791 65989
7999 65989 97833 120168 104048 158769 197286 195040 179716 189636 183512 167519 171347 136273 62126
7986 62126 41448 70251 100315 72678 33540 26263 67563 130260 159437 152126 195288 245115
7974 245115 197681 144502 102564 111043 135043 141105 168481 149155 155635 160102 177723 139176
7962 139176 127975 196726 202678 195633 163767 114552 142642 164657 179497 125774 46533 25247
7950 25247 76829 194371 221398 176637 114706 115461 186829 218993 170398 157517 227261 246540
7938 246540 225573 152424 146254 122060 67738 109790 109252 143670 137998 63399 22651 49394
7926 49394 95052 66944 -463 8208 33027 119897 116761 111911 92183 40810 -9884 43838
7914 43838 34778 39238 75707 103724 132990 134858 111403 72715 78484 72577 84918 90460 186717
7901 186717 156576 159752 150133 111664 90900 98357 138628 109538 104211 118928 67822 43226
7889 43226 35861 18835 -9422 -34595 28914 45788 45983 97428 104920 112189 77463 87715 91981
7876 91981 58736 51649 18850 16132 21346 61567 71491 63578 66951 54389 7106 9623 49232
7863 49232 63295 80842 65966 75758 62710 105307 119262 45250 37129 56154 42271 60467
7851 60467 81890 53163 76401 115758 147395 124039 102714 112464 79176 79126 93041 143386 72923
7838 72923 -21710 -49015 -2988 102995 165933 169231 130422 62529 -5259 12345 -27574 -37623
7826 -37623 -39330 9749 2927 -28020 -3178 17892 27921 9123 23851 4175 21247 59478
7814 59478 42975 54529 112833 94201 44218 36477 31065 35472 14783 32101 27204 -49219 -52453
7801 -52453 14466 13734 -41003 -70279 -9377 -2439 -11924 11142 69797 51021 35973 6791 20984
7788 20984 11641 -11054 -32946 -55149 -27274 7485 42214 22401 26943 1065 -3516 30409
7776 30409 -16523 -43448 17748 49301 29279 39364 47013 48619 7919 -10709 24721 65404
7764 65404 69317 92111 86467 73319 83485 73572 11516 -57131 -48228 -45437 -6408 33720 82904
7751 82904 48331 2942 -18743 19981 33773 36404 13670 -19725 -42541 -783 39065 82469
7739 82469 97067 112158 83282 42044 -12377 11020 29944 -25371 30554 101503 82108 45901
7727 45901 34779 -26693 -47548 -38924 -28039 13999 9553 23443 54223 58609 56607 69149 26493
7714 26493 28304 7601 25959 65608 126142 77547 10152 -227 21945 -29145 -14468 18115
7702 18115 37814 19303 -7233 22453 61227 84554 55436 29780 7130 7722 -5065 11539
7690 11539 11970 28450 32177 35810 28401 -22950 -50512 -34700 -74516 -47995 -10355 7318 8467
7677 8467 -2967 -30780 -53103 -75946 -62518 -41708 48659 91679 92790 94539 96109 43211 -139
7664 -139 -7063 -12426 -28547 -64480 -31735 43434 102492 99417 56243 68875 49614 -1312 -35289
7651 -35289 -13372 -21802 -106666 -83872 -6591 80352 60841 9456 43412 35735 52039 68322
7639 68322 75706 71806 23688 -39549 -29406 -68678 -62057 -26544 -30951 -25855 -74168 -79533 -29392
7626 -29392 25815 44084 53037 94686 106774 50507 37541 95558 134816 79777 38400 51763
7614 51763 86667 89810 88363 69391 102653 131749 96386 -824 16042 90849 138665 30928
7602 30928 -99555 -14535 41827 8305 23883 77044 49752 38228 12564 -29857 -43352 -115196
7590 -115196 -110804 -31765 58625 93884 54489 26999 12914 45367 28166 41712 24447 29287
7578 29287 57810 3171 -34944 -11226 -2015 -43576 -63818 -51954 -33254 -41974 -54722 -51740
7566 -51740 -54960 11162 -508 -32685 -50236 -65829 -48806 33144 55448 66835 -27146 -73978
7554 -73978 -37583 18267 12236 -5825 15640 6316 -7417 19191 67857 41526 -9731 -5617
7542 -5617 17992 5255 -40289 -17878 -38430 -21957 32540 16331 51377 43204 26197 5605
7530 5605 -4308 -18909 -44929 -31252 42804 2830 -40960 -15594 -15280 8563 5921 -19937 -4499
7517 -4499 27964 22626 -12912 -19745 -47704 8800 23666 24797 -6811 -17152 -25213 -11380 -51853
7504 -51853 -88486 -109837 -104465 -90407 -79504 -96297 -24212 3948 50318 64208 58652 98814
7492 98814 141596 79320 25703 49600 78191 28989 -37339 2812 -1327 -71405 -96907 -379
7480 -379 -29339 -22499 -12381 -17159 -10341 -37180 -17825 -71406 -101327 -79979 -30169 -7203 15597
7467 15597 31560 -12033 -32418 -33852 35468 84939 59325 -20321 -21719 -6788 -11016 7244
7455 7244 -2562 -69345 -61071 -95730 -75221 -48118 -51839 -75228 -50766 -43720 -66910 -50834 -2445
7442 -2445 6484 9103 19996 20951 2464 -13823 -10186 33069 42724 75576 2875 -20413 -23248
7429 -23248 -51984 -102821 -57783 -54630 -16352 5486 -36016 -64509 -41270 -40265 -81466 -94865
7417 -94865 -61159 -92046 -87040 -107867 -66334 -61876 -75197 -95155 -84794 -57507 -55446 -99446
7405 -99446 -78481 -15358 31581 54821 92646 75887 62828 115999 120806 5985 -57097 -35227
7393 -35227 26181 53726 52669 31708 -26524 -23156 14078 -14732 19713 63524 38401 -31524
7381 -31524 -37437 -38963 -44390 872 72617 93266 65002 100178 95166 4907 25284 84015 68771
7368 68771 52907 52067 22369 3190 -18243 6524 -14900 -63084 -65797 -41470 -20983 -22193 11693
7355 11693 20494 -33084 -90843 -51772 20335 11581 -18590 -3203 -3584 -20351 -3622 18166 36319
7342 36319 86254 75562 55125 67436 42452 7216 -12325 -58218 -130305 -90797 -16386 -60248
7330 -60248 -126050 -82397 -72203 -117199 -131866 -103417 -61944 -24429 10536 44856 43273 1796
7318 1796 -7943 62210 60224 35824 73389 13942 -53231 -112811 -99793 -93215 -57118 -46946 -20760
7305 -20760 -43646 -48623 -70016 -58496 -65633 -110485 -148778 -123154 -89480 -60846 -21898 1147
7293 1147 -12771 -16664 -39430 -28764 -21491 -16677 41129 53935 61508 27919 -81475 -114529 -137912
7280 -137912 -129530 -70822 -51508 -38361 -3041 -29722 882 55084 84175 48048 39382 74507
7268 74507 26106 -26579 -20661 -24207 -28369 -73005 -86094 -69259 -55863 34727 40843 8161 395
7255 395 -20890 -48601 -16504 -69149 -75840 11760 14068 25809 -6746 -371 41321 16120 -35396
7242 -35396 -65535 -36644 19068 -2840 -44766 -24792 21152 4487 -57580 -74406 -43487 -5079
7230 -5079 14253 -12550 -33724 -36977 -45932 -31210 68057 89023 62282 66250 57038 -9034 -46409
7217 -46409 -50440 -34806 -40607 -59789 -24491 50654 104307 57145 2351 -8123 -21574 -13683
7205 -13683 -13739 21720 44720 54687 469 -265 -30627 -16762 16920 48250 -41129 -47749 -36219
7192 -36219 -42899 34077 28621 16611 17760 -21462 -12079 41380 38001 11928 35143 10508 -44385
7179 -44385 -45210 -89884 -89677 -67913 -43292 -48009 -13108 -5509 8184 25996 25245 -37750 -103667
7166 -103667 -97611 -111676 -101921 -36940 -40806 -2237 13481 47693 37266 104734 111359 30878
7154 30878 55929 93932 -6323 -19910 -22469 -5725 5067 -13443 50893 53816 10470 635
7142 635 -7790 -45759 -26854 33005 23278 10121 -37059 -21408 -64935 -56899 -67306 -90815 -45209
7129 -45209 -36578 -56891 -53284 -7310 -4351 -13054 57537 68139 76749 14218 -30347 -8751 10542
7116 10542 25485 -186 46346 43652 -27414 -66467 -45647 5576 -16430 -97392 -120317 -98858
7104 -98858 -33538 10936 31520 85287 96885 123441 89762 58276 24302 -3270 9521 -577
7092 -577 6834 -27773 -96030 -71993 -43387 -32572 -60500 -53819 -14453 -6191 11136 -635 30173
7079 30173 -34181 13671 49002 38650 -3200 -30172 32376 30947 35713 32245 -24565 -38523
7067 -38523 7794 36010 37031 64344 51066 14970 3436 18983 12878 18407 -11399 -4478 -39683
7054 -39683 -16531 -30974 23001 -9464 -46067 -11606 4738 32120 19959 11946 -1856 5066
7042 5066 -2673 1022 21756 52645 76466 37602 15402 -8314 -44976 -43104 -31846 -52387 -52946
7029 -52946 -94988 -72213 -54123 -12194 -15690 -56256 -60047 -17837 -25959 -64053 -42798 -22768
7017 -22768 27818 50349 -36413 -90798 -95065 -91779 -119288 -92318 -59562 -32599 -30126 -11855
7005 -11855 -16354 -62529 -55142 14825 115898 108597 52233 49797 22699 -13998 11930 14836 -145
6992 -145 -20275 -36832 -2698 38218 -2544 -21451 -46568 -72208 -65870 23104 86133 52929
6980 52929 9940 81765 111941 89619 76015 11377 -36713 -50531 -27832 22828 31442 42616
6968 42616 8385 -55031 -66422 -91955 -76070 -100611 -68651 -68286 -96122 -108888 -88005 -53013
6956 -53013 32124 50105 75467 55007 19111 -38047 -41887 -38149 -81787 -101385 -116517 -88868
6944 -88868 -45387 9675 -34130 -35542 -34848 -53949 29975 39381 37860 23609 1634 13590 62397
6931 62397 51958 13003 15709 5854 -10650 8833 31388 60165 53738 73205 93107 114274
6919 114274 112508 58206 41422 61092 39400 32426 10733 -40224 -33680 -72197 -92677 -40665
6907 -40665 -1003 3588 42936 29631 50973 12917 -5656 -33727 -57144 -58150 -70787 -44650
6895 -44650 -27574 -66694 -28022 -6366 -43169 -77407 -41836 -10402 -26907 -1320 -24165 -31058
6883 -31058 32842 61768 13641 -7152 18590 3416 -9738 -5828 37846 12977 -3241 -23878
6871 -23878 9510 34041 44182 51164 42166 -25518 -57808 -76613 -3574 56661 65313 78289
6859 78289 66179 52408 53926 4953 27134 36952 -43363 -37145 8714 -17042 -50804 -56564 -99920
6846 -99920 -95463 -110105 -140665 -105271 -53035 -51022 -12075 26811 28198 36488 4405 22764 4967
6833 4967 -33643 -11281 -2717 30959 35113 11988 15144 34113 20207 16533 36787 58795 31476
6820 31476 21816 12031 -26694 -40105 -41584 -55883 -47704 -5311 23233 24131 29602 -23376 -24425
6807 -24425 -18316 -12671 32105 8891 -58263 -51151 -4039 -13562 -58964 -75502 -49674 -80636 -126837
6794 -126837 -77321 -58200 -95483 -141722 -106537 -84253 -9271 53925 59562 61510 59728 30320
6782 30320 -40293 -53669 -7438 -13150 -25920 -32072 -3315 31384 19529 32000 62489 68233
6770 68233 89120 14933 -42372 -23120 -23557 24222 22803 -33926 -11882 -48657 -65554 -81580
6758 -81580 -147179 -91559 -22758 -6901 -26873 -325 56653 57632 49333 38518 -21673 -16317 -48546
6745 -48546 -63635 -56771 -88498 -82439 -40550 8852 -11778 -29196 -40095 -69120 -94809 -52640
6733 -52640 2180 38486 -16734 -50632 -81189 -124252 -67546 -4958 64633 36537 20724 40964
6721 40964 50676 107898 106284 78657 2734 -44225 16674 -3643 -78691 -63912 -49020 -24793
6709 -24793 46565 64096 37460 50246 58575 3737 -84383 -99677 -66103 -33690 -38163 -56038
6697 -56038 -47596 -55583 -28133 -18458 -10186 19968 44061 27230 4156 7247 28747 52538 34042
6684 34042 44773 31025 15161 19977 2993 33850 57830 -26369 -38248 9327 15624 -36165
6672 -36165 -84611 -39956 -13659 -32351 -30010 4333 78219 62580 59317 54827 91984 64478
6660 64478 -8421 -22756 -55880 -72334 -33469 -49322 -53554 -19219 24390 61398 -5742 -44127
6648 -44127 9476 4117 -16426 -38518 -2354 30796 53091 35778 51776 39132 24123 34789
6636 34789 52494 -17414 -28642 18596 81795 46513 -5673 -12407 -25535 -92031 -38258 -57833
6624 -57833 -77721 -93256 -82677 -68433 -31176 -27783 -46914 -28540 52464 100322 45598 -44626
6612 -44626 -33177 -38878 -52294 -78373 -94588 -70166 -51782 -111810 -89529 -57131 -39974 -26256
6600 -26256 -2018 1758 1870 7479 -19291 6392 35411 332 -33769 -45834 -108515 -69741 12069
6587 12069 5673 -33806 -72322 -26300 18404 65422 -30749 -15209 4772 -5316 -41672 -64972
6575 -64972 -35094 -33132 -12275 -6849 -61443 25627 89025 18626 51011 22313 -19460 -96248
6563 -96248 -121250 -27533 4321 10647 -11600 -31487 -36377 3005 36625 49235 -7888 -11083
6551 -11083 -8103 10263 2402 12925 18608 17881 -2948 -35007 -68226 -97696 -119576 -133379 -115923
6538 -115923 -127864 -104592 -71592 -43570 -55219 -72729 -38765 -59067 -33663 -72518 -38426 -48338
6526 -48338 -19286 1678 -42503 5500 12279 24520 -30817 -35433 -17457 37645 28379 10394
6514 10394 24560 9122 -45594 -35981 9136 -66 -57642 -38085 -63706 -108347 -85315 -45998
6502 -45998 -41217 -98995 -166317 -152939 -65741 -8035 -26032 -53062 -36480 -38754 -48332 -33967
6490 -33967 -35174 -31208 -82316 -113117 -124269 -111318 -81058 -50408 -34689 -17267 -12865 11539
6478 11539 -6250 2210 10804 6616 3248 -7015 7865 5974 -53905 -116345 -103232 -86414 -66536
6465 -66536 -64782 -76561 -84139 -43823 -57612 -49259 -45391 -67111 1438 54317 79292 63426 16239
6452 16239 -15979 57275 42394 58165 -1663 -16498 13918 -42605 -62529 -54166 -65075 -56890
6440 -56890 -10698 58264 47732 43045 20376 -60232 -95345 -7721 63232 52587 -7773 -56003
6428 -56003 -81220 -21497 22558 51495 4476 -20600 -24270 -34145 -33744 -20091 -12313 -62926 -70301
6415 -70301 -67292 -37868 -21550 22289 -1935 22357 32337 36538 14549 -23566 -21962 33491 21244
6402 21244 20904 28768 52452 70083 96676 88811 20571 -85637 -56452 -43300 -28192 42536
6390 42536 28611 45914 27030 -35258 -89905 -37080 26877 105337 116595 89824 30246 14901
6378 14901 -21770 -25786 5726 25356 67544 104197 24892 -6672 15321 32795 24999 547
6366 547 -56384 -83662 -43879 -7572 4797 -60591 -55217 -29485 -19026 -12115 -2251 1757 11720
6353 11720 27719 24786 -1294 -46459 -3223 70996 78231 98568 61270 25216 51583 40733
6341 40733 41887 -29684 -38548 3856 25995 12962 51306 42377 37863 50421 20382 49076 19829
6328 19829 22084 24911 26704 -27438 -15052 -4609 -8065 -59187 -11576 18066 13942 -22961 -37823
6315 -37823 -17696 22488 37657 -7357 -33866 -8023 -8720 -31217 -1414 -1973 -35007 -64079 -81509
6302 -81509 -94093 -67122 -18341 17747 27140 50955 53782 5366 -29746 -20723 -5447 14086
6290 14086 36360 25784 37390 23917 -42053 -69616 -61068 -44334 -67058 -50496 -28185 -37212
6278 -37212 -18764 -21539 -61284 -94826 -87482 -20558 20486 -13394 -24281 -25836 -63127 -102811
6266 -102811 -132562 -64158 -44565 -87731 -95588 -38358 -10038 -7282 676 -18024 -62661 -76061
6254 -76061 -25172 -20640 2583 10678 11102 -5962 23125 -31943 -44149 -14846 27266 -1422 -27930
6241 -27930 -29237 -22015 -27022 -8871 -31426 -26728 18430 56632 70977 75936 101175 25696 -51152
6228 -51152 -52180 -46889 3189 56026 123444 92338 37498 63714 30540 45192 41589 19878
6216 19878 -5318 71810 85204 70559 71039 77225 83578 6543 56872 168811 117690 57176
6204 57176 31847 -17299 -45127 -19812 -50008 -79684 12312 86469 77533 33373 -45679 -46236
6192 -46236 -46815 -122673 -100879 -98546 -71312 -72482 -91359 -89714 -40873 -34621 -13767 20914 -2736
6179 -2736 -18594 -58052 -62667 -32556 -27695 -71031 -83248 -121888 -79893 -32215 -32939 -82992 -67538
6166 -67538 -52800 -92150 -76372 -70491 -43849 -10990 -10761 -25806 -53823 -5030 60312 40248
6154 40248 -9106 -45578 -73474 -12590 42854 24887 26829 13927 10329 -42683 -1380 4388
6142 4388 16258 -7441 5885 -6753 -13172 -12417 -13051 16525 40832 -41060 -56029 -29274 -30424
6129 -30424 -38966 -72966 -59638 -51630 -31485 -52364 -50746 -23804 -31215 -28378 -78406 -99593 -36949
6116 -36949 4376 25066 5799 -12441 -6779 -20773 -26843 13443 34281 48274 25611 -32352
6104 -32352 -27888 -4708 -7660 -26578 -22103 -16603 -2558 57427 57687 -526 -72648 -68888 -70252
6091 -70252 -38330 -24366 -26141 -22263 -57293 -27885 -2518 8780 -12271 -53705 -22009 19108
6079 19108 -44117 -107632 -112347 -96613 -82990 -81664 -71060 -40509 -80711 -54849 -2586 -27352
6067 -27352 -45012 -87066 -106687 -16335 28335 48710 28038 -20190 -33965 20279 8830 -14740
6055 -14740 -55423 -89171 -111940 -56569 -2875 -187 -29512 -40147 -42649 -67339 -44113 -11354
6043 -11354 -58206 -114513 -107068 -50343 26226 21200 -3725 -23267 17177 -62713 -53767 -68488
6031 -68488 -55062 3329 1205 -5697 -5963 -45611 -89716 -121690 -114771 -86038 -51003 -14607 -9386
6018 -9386 6302 4564 60772 41575 -2723 11117 40753 32850 51116 87112 37783 -31088
6006 -31088 -57694 -30529 18445 23970 -14229 12834 -347 -38945 -48827 -48158 -76810 -67393 -48205
5993 -48205 -86939 -128997 -86530 -59201 -13180 -2942 -56931 -74440 -53897 9040 -3873 -26049
5981 -26049 -53484 -38276 -33735 -10922 -59342 -86153 -105319 -74673 -7629 53482 52180 29842
5969 29842 -25622 -59094 -6383 -8120 7093 29161 14529 8853 -12735 -14754 36712 50025
5957 50025 15064 48412 66842 84726 16324 27798 55183 51186 -12377 -70796 -90173 -52097
5945 -52097 -23682 -38767 -50195 -24790 18700 65654 108059 106393 38822 19610 71576 85885
5933 85885 102316 58586 80195 99050 68159 48068 -14568 -4295 7483 49171 46809 25203
5921 25203 32585 38861 85054 149027 79337 6676 -21466 -40832 -23248 -78795 -149994 -99403
5909 -99403 -68618 -25915 7140 -14072 -1643 22073 5897 2170 12032 22307 64209 113513
5897 113513 62048 30507 2060 -4816 32977 -14451 -28203 18231 36863 30503 -2778 -8000
5885 -8000 -4451 19035 28735 23914 -27518 -27895 11032 61201 55169 -46519 -122224 -76047 -42043
5872 -42043 -46636 -49623 -32358 -11440 -16042 52519 21951 -26430 -67264 -80688 -21912 -50893
5860 -50893 -107851 -115207 -113590 -115075 -104549 -40199 -26704 -9111 -7888 -26341 -69705 -87986 -45095
5847 -45095 -8495 48786 80740 68864 106786 53241 -18579 -46829 -71416 -24247 51267 17994
5835 17994 -8108 -34979 -64892 -68453 -99655 -100909 -103109 -89982 -63605 -52173 -69548 -31936
5823 -31936 -275 38160 12083 -38558 -77861 -61528 -38236 17756 72295 -7838 -73698 -47129
5811 -47129 17012 12290 -188 -37606 -70166 -74624 -29901 -51353 -20720 -16722 -50275 -174509
5799 -174509 -207005 -83973 -5569 -8269 -25472 -6296 18289 -43810 -12725 1890 -15571 -30476
5787 -30476 -13736 4322 53694 58756 31455 -28841 -22946 -46328 -64993 -26920 -8172 -38129
5775 -38129 -35626 -22705 -27076 -47703 -4415 -21804 6774 -2148 -74331 -160878 -148397 -78763
5763 -78763 -31546 -50252 -62991 -79288 -107053 -135305 -137928 -90758 -24334 14734 -7432 -26139
5751 -26139 -29321 -22150 16544 -31162 -62678 -94706 -138006 -135579 -114312 -66074 -14508 -9923 -28992
5738 -28992 -7700 -30654 -50399 9778 40597 18940 24321 34619 39523 68089 1084 -34860
5726 -34860 11238 60449 -19086 -42824 17731 -5965 -13941 -18657 -30943 -73571 -103542 -116407
5714 -116407 -94742 -37541 -36113 -94210 -89739 -82108 -64017 -20637 31494 93548 78344 51730
5702 51730 21499 -22823 -15737 12002 -2605 1212 30425 25916 11058 21128 -25743 -55216
5690 -55216 -107361 -135734 -83599 -2000 23962 85912 56438 69823 57087 14455 -51076 -69697
5678 -69697 -108618 -153434 -147024 -65800 -17310 -27917 9358 34325 -21043 -120253 -133646 -96270
5666 -96270 -71310 -119202 -91420 -59684 -9798 -11025 -18843 -11983 509 -24012 -63246 -71641 -7268
5653 -7268 10200 -2077 -26179 24338 25533 -4977 -14085 -20087 -7418 28934 16743 1628 -56753
5640 -56753 -72368 -92673 -70968 -63167 -115852 -91141 -84209 -58616 -27789 -43429 -64125 -52935
5628 -52935 -47740 21112 23019 27310 13661 950 -7214 -85011 -87838 -59418 -14141 18735 -51299
5615 -51299 -72339 -117742 -129417 -55864 35643 63039 41319 -17006 44211 63112 3866 -19152
5603 -19152 -24625 40508 93723 87876 50857 -25570 -108469 -108600 -94214 -35793 -21229 -31339 -43317
5590 -43317 -32952 -20202 -102491 -130327 -42818 -13807 20307 47547 67992 33430 16399 -7824
5578 -7824 -31582 -41106 -37347 -30780 -26513 46203 59379 11260 -45187 -87099 -82870 -65071 -82877
5565 -82877 -99188 -7150 -2953 -41041 -47754 -50577 -26715 -69322 -91713 -51545 -56121 -124574 -149068
5552 -149068 -104185 -97486 -94301 -57088 8223 48684 90161 66175 50533 -5233 2243 51693
5540 51693 91092 87186 25988 16005 -21305 -34500 53959 66524 60987 33304 18460 25553 -2000
5527 -2000 -73339 -77528 -56348 44674 64232 30289 12272 25393 -14609 -34674 16106 28723
5515 28723 26995 -4248 -43894 -31876 -29687 6742 -1539 -50234 -21317 17201 76744 59854
5503 59854 -9499 -39122 -100681 -114724 -92213 -12306 47701 54456 78581 70641 28400 -31124
5491 -31124 -20170 -51310 -43850 -15156 -46059 -29612 15072 -3176 -17102 -3392 -5248 22798
5479 22798 -27737 -59362 -72374 -89349 -61672 42071 91259 53784 -18278 -25545 -25841 6226
5467 6226 72529 34828 4648 -29958 -120911 -119077 -68193 -20370 -21604 -29139 -23906 10908 5526
5454 5526 3743 1829 10926 -15914 -48698 -65894 -54535 -63221 -61475 -85629 -69115 33615 51576
5441 51576 15895 40445 43884 -249 -9712 42288 9506 13377 32273 31263 -5095 5639 4247
5428 4247 -5355 -8117 -35698 -72743 -104858 -97030 -114196 -80857 -22694 13832 34134 -9279 -33855
5415 -33855 -48050 -89687 -70484 -58493 -52999 -74711 -81075 -61341 -39404 -68188 -80089 -46423
5403 -46423 -41961 -29296 -21375 14806 31064 56364 69225 -1262 -30245 -29103 -58638 -137438
5391 -137438 -160059 -154851 -48771 -15376 -75011 -103143 -54139 37400 93664 83073 37277 -14503
5379 -14503 -67830 -67836 -23191 -11453 -16947 -42316 -80826 -65002 -3128 71037 58384 16131 -24024
5366 -24024 -52368 -10840 83737 216121 186645 125694 31678 14882 -9844 -18130 -22880 3544
5354 3544 -16580 -36884 -22927 -72694 -50442 -59399 -46751 14880 28036 14018 -1894 -53013
5342 -53013 -55073 -47359 -72440 -62147 -20338 -49216 -59516 -3431 58792 59560 20278 24721 66261
5329 66261 25823 -41103 -48942 -25362 1110 -17422 2620 3608 -4152 44261 57965 49114 28169
5316 28169 11144 13276 8174 -7106 10670 67703 62977 56634 32511 45332 65689 36863 14755
5303 14755 1467 -2966 -21300 -60016 -27336 28282 34180 25816 46236 52168 17709 25152 -4177
5290 -4177 -33276 31095 34274 16813 -83871 -79746 -23556 12463 30651 906 9531 26016
5278 26016 15478 -3268 -41802 -92050 -125204 -89896 35285 36272 92737 111756 103059 30503
5266 30503 -19752 -85795 -119006 -74478 -63810 8584 11225 -47479 -32066 -7592 26250 4445
5254 4445 -13668 -3683 3502 53485 52974 -10609 -64618 -60811 15107 56000 81470 70319 10158
5241 10158 -20547 10945 52991 3505 21368 77367 52016 26672 -10038 -33005 -68559 -42804
5229 -42804 -13762 -6198 -14644 15173 -9899 -140509 -183251 -140610 -95661 -102953 -111678 -101821 -68874
5216 -68874 -92090 -55844 -13669 -27756 -64933 -80348 -41169 39204 17986 3787 -10076 4909
5204 4909 34699 28209 56152 40485 -14579 -18961 -75068 -79409 35915 97424 48500 11274
5192 11274 -3964 -19881 -44111 -62696 12744 19718 23670 -27793 -54400 -60903 -49895 -52264 6781
5179 6781 39677 55046 79135 31340 -17135 -31593 486 -5685 -27055 -50408 -112057 -107474
5167 -107474 -88151 -27905 22389 13769 25635 2784 5176 8105 25496 -7832 -68870 -83375
5155 -83375 -63551 -60520 -37104 -62880 -55582 -54975 -81715 -75942 -17282 29234 63087 53172 35002
5142 35002 6489 10221 53040 88338 114734 148781 100624 109230 103163 21691 -40202 -103651
5130 -103651 -57286 -6212 29341 51244 37688 36140 27342 -22272 -48818 -61424 -54700 -112852
5118 -112852 -60913 7241 71976 53623 65684 36735 -16976 -45367 -51263 -72056 -27031 -1034
5106 -1034 37075 77064 84075 98446 76357 8445 42945 28081 31980 31291 21471 32725 10606
5093 10606 42722 -1650 59657 100866 156160 122372 -22203 -82495 -12032 15333 -11172 -42624
5081 -42624 -29055 22656 56636 12148 14386 48318 39429 -66098 -122783 -98562 -5763 49197
5069 49197 60676 46991 14147 6343 -9094 2908 -17225 -21474 -18664 -13290 -9009 44493 55242
5056 55242 74900 -3096 -64181 -88694 -74730 -5090 8475 26394 78010 125101 113957 67322
5044 67322 37466 57126 7878 13613 1814 -48138 -46089 -1972 -4423 26805 2077 -72890
5032 -72890 -17504 31958 66607 37222 62195 67501 59163 103293 72623 -1774 -515 -20325
5020 -20325 -17820 -32421 -65200 21309 12219 -38745 -61197 50160 30206 -7657 5746 -36919
5008 -36919 -70244 -24666 10226 15080 5146 23938 -22256 -90427 -116684 -122393 -59660 36302
4996 36302 -469 -29991 -45616 -54077 -42273 -60481 -82989 -57033 -21041 18669 42551 15211
4984 15211 -22262 17053 76835 72854 18461 -18611 14675 -24276 -43624 -31372 -1977 -11090
4972 -11090 -17979 -49151 -86219 -47900 17874 16421 -10359 -15987 23722 45398 16639 9248 12304
4959 12304 35682 57658 -8903 -57296 -6965 -17168 -34473 20062 78696 59237 54361 17823
4947 17823 -24503 -69422 -26274 -28251 -25116 31192 45340 -3661 -16035 31887 28733 38548 -17783
4934 -17783 4404 2151 2377 32906 26382 15925 16523 38869 60760 42347 9149 51741 101786
4921 101786 58231 45778 87267 74067 66150 30504 46470 48333 54508 40664 55602 45903
4909 45903 -6972 -44511 -64870 -45888 -43315 9294 -20342 -36115 -22726 -38184 -16351 28752
4897 28752 125063 141274 150125 108650 97662 47763 59885 88132 64158 76028 35263 30652
4885 30652 31417 -21116 -21255 -1315 26545 8773 3956 -59925 -121360 -190225 -132591 -93492 -98488
4872 -98488 -83811 -41522 -58567 -4009 43108 19823 -15581 -3232 -22335 -19289 -37978 -40508
4860 -40508 -46381 -41774 -45588 -34443 -25900 -10379 6517 -32797 -32256 -48272 -85645 -45981 -52563
4847 -52563 -16246 69781 118083 100519 47198 -12735 21251 35042 -7674 -35752 -32331 1109
4835 1109 17738 -7339 -51701 -34648 -56324 -38244 58658 112091 57692 60485 35941 -29806
4823 -29806 791 10937 90912 52341 2983 -57705 -43709 11678 -8329 16238 23428 50818
4811 50818 41550 -11643 -39461 16147 35618 -19208 -85628 -148458 -133836 -102486 -68864 -16218
4799 -16218 -15390 -15086 -24493 1774 14814 37764 58700 75912 116102 95950 34741 73238 63261
4786 63261 3536 11924 -24161 -52806 -24330 2131 -26007 -79229 -117735 -31066 7604 36057
4774 36057 9729 -48415 -51640 -65531 -55089 -44998 -33141 7541 -27985 -40402 -45414 -35207
4762 -35207 -20279 -88566 -121028 -83071 -38291 -41584 -49515 -20534 -27191 -38881 -66494 -63443 -31349
4749 -31349 10678 -4799 -1500 -9875 52808 27894 -18858 -24248 -1457 23525 -770 -58440
4737 -58440 -58631 -19463 -36597 -56379 -40612 -62228 -88310 -100785 -49719 -33268 -4612 24834
4725 24834 11541 -38876 -90461 -72706 6504 62565 21452 16682 37701 96273 113096 68347
4713 68347 9466 14113 25659 -25812 5665 20517 20157 9595 -45001 -67032 -67260 -53889 -2728
4700 -2728 10668 48322 67489 8830 -10502 85153 111407 43186 -12554 745 24691 -53982
4688 -53982 -63458 -77875 -44121 -23719 -25615 -50466 -73601 -56785 -76123 -93990 5535 79055
4676 79055 37938 34229 1232 -3949 39543 65062 77852 52752 12253 -13200 -55137 -41094
4664 -41094 -28276 -32089 -25072 -5944 2591 34867 -29962 -66692 -23885 27326 37815 43838 8592
4651 8592 -4190 56461 51404 -5507 -36565 -19236 31272 43883 -5902 10442 -32836 -87652
4639 -87652 -118621 -112014 -31488 37154 56660 84421 85244 41836 18124 -5720 -27276 -80559
4627 -80559 -89735 -65917 -16818 -45212 -51433 -48470 -47888 -50527 -57717 -51746 -55797 -19032 14726 2533
4613 2533 -74085 -135851 -137561 -85688 -17086 26083 -6610 38043 -11562 -55939 -84426 -44240
4601 -44240 -7638 30965 94667 80206 62967 23097 43204 19693 34612 26934 -8220 -34744
4589 -34744 -49963 -24559 -42106 -13324 20529 3859 23006 21223 39067 28090 19412 7720
4577 7720 21548 43779 -26434 5384 8985 45217 46938 12796 246 27865 1724 -20294
4565 -20294 -24976 -31180 -49279 -45454 -23455 -34292 -58111 -37447 -16730 -29082 -80372 -129683
4553 -129683 -105633 -59615 -39562 -55965 -78882 -33610 25903 58068 70214 6779 -91366 -80343
4541 -80343 2635 -3476 -29237 -73208 -70281 -20044 33027 26980 2723 -28814 -44394 370
4529 370 -24051 -44533 -67012 -93812 -111908 -64247 -25448 -1316 10350 -36056 -75906 -87678
4517 -87678 -57890 -39221 21316 8790 -24803 -43826 -32055 11847 59505 13619 -7700 -19694
4505 -19694 -31818 -6164 21047 -2481 -54541 -73402 -55352 -75616 -89084 -41351 -86297 -114880
4493 -114880 -82217 -23447 12473 44690 41240 98090 95739 87521 47825 -74047 -122127 -125421
4481 -125421 -84537 -11394 3406 -20599 5673 44572 35615 79377 92186 45725 1026 -3619
4469 -3619 39197 46173 46578 60921 -23200 -28959 31238 56767 92011 74233 47607 -1450 -53296
4456 -53296 -35588 -29289 -78407 -64175 -71975 -46953 -53710 -12975 3617 -22887 -29055 -7312 34209
4443 34209 40553 65444 77476 115076 59908 -70286 -87077 -47670 7577 33479 46391 65260
4431 65260 -34363 -93039 -83000 -62695 -12888 31237 20083 51905 35857 -6888 -100522 -90877
4419 -90877 -88653 -70762 -59163 -11698 18149 13613 7901 -37622 -42586 -12005 51746 86990 54961
4406 54961 -653 -50100 -54895 -24347 -29380 25357 36537 16112 27745 48028 53276 47086 -13648
4393 -13648 -58477 -52475 -123066 -127511 -71450 -51103 -36437 -19364 -37480 -44692 -63275 -39378
4381 -39378 -54855 -89363 -77042 -56746 -7093 -18463 -24157 41800 -13783 -8247 19530 12937
4369 12937 -21929 -15259 16412 50098 54263 56221 84505 42865 -20135 -15819 -44502 15725 70315
4356 70315 94156 87559 82453 58976 62360 59472 50385 18163 7503 7501 30080 35629 100007 128448
4342 128448 103600 29954 19038 7381 21949 27525 57883 50384 50276 38736 19794 63422
4330 63422 92639 95609 54310 -28882 -99201 -143941 -73677 14273 9554 5798 -70598 -140158
4318 -140158 -187616 -118130 10817 32957 -39403 -120744 -111045 -82726 -48755 -29415 -54259 -99683
4306 -99683 -74813 -96750 -99710 -55714 -691 14647 13681 31982 44967 47419 60153 25119 19947
4293 19947 6515 23957 56350 48782 32841 70791 41201 20293 -3865 -12165 58011 90469
4281 90469 44100 41417 6469 29856 13204 3596 31926 -38539 -66717 -50287 -21720 10449
4269 10449 18884 -66428 -41867 -57942 -85315 -84654 -20834 10288 7241 -73807 -136740 -116338 -118079
4256 -118079 -64169 -78904 -91647 -93570 -35135 -2690 14207 -8686 -3717 24290 16455 34571
4244 34571 34871 -7755 -30223 14860 21568 -14595 24878 17074 1 -25537 -58600 -59638 -28907
4231 -28907 4260 -8444 -27772 -38428 -13052 -7997 -60769 -64076 -70457 -65964 -7725 -2973 -1371
4218 -1371 4343 -17675 -36750 -34642 20357 58347 44025 44244 47157 31047 28664 -27569 -29828
4205 -29828 16914 28278 43032 9120 -22487 -53035 -63999 -68461 -41394 -62974 -30138 -5806
4193 -5806 -4987 38946 105412 160597 119249 53469 68093 9037 -6983 -48193 -50744 -67359 -59557
4180 -59557 -109117 -101551 -42303 -25235 -45776 -9573 9085 -33194 -37979 -67055 -51477 -31429
4168 -31429 13402 -38358 -95229 -147102 -109113 17890 30843 -10026 -67910 -36924 -1879 -4486
4156 -4486 18982 61840 69590 78591 84748 53940 34116 57725 79913 34053 15293 -64089 -71691
4143 -71691 12922 -12482 -38654 -34799 -15229 5769 -14777 24184 -9636 -20627 1673 -20000
4131 -20000 -27869 -10529 16624 47358 64337 1533 -86654 -60915 11736 21390 -10031 -25121
4119 -25121 -72092 -24887 -10416 -62516 -47734 -38335 14806 31548 15512 -16553 -72095 -41776
4107 -41776 -21452 30212 49355 40330 11552 -6338 -24649 -25902 -17470 11652 2766 -3085 -23041
4094 -23041 -3320 23857 -26631 -86499 -51527 -50997 -83779 -113675 -88980 12253 29662 -21752
4082 -21752 -81738 -69142 -5916 14183 -28115 -57816 -39722 48109 21815 10872 -21785 -81009
4070 -81009 -78423 -18874 11387 5166 7870 -12584 -86820 -65405 43652 36446 56059 38872
4058 38872 34798 110014 132459 96017 109723 129145 54261 29788 20001 6784 5401 -9318
4046 -9318 -4617 29885 69854 40196 41703 29462 -15643 -54430 -22620 52008 74428 45045
4034 45045 38678 59102 17003 11562 12419 -48137 -81141 -83330 -89267 -1383 39926 29264 40088
4021 40088 -5661 -40082 -9807 34194 -28769 -10325 6490 26089 -1155 -22745 -88718 -109185
4009 -109185 -43740 -30035 -77283 -93386 -13110 52200 43973 -9350 -11630 -4133 -41596 -17975
3997 -17975 -9579 10647 -1121 -50846 -30627 49976 46923 41243 -15150 14306 55429 39276
3985 39276 -896 -100807 -79106 -10452 62661 63214 93753 117190 65369 36556 101301 133145
3973 133145 77536 104541 50768 -30307 -40251 -42610 -55381 -55367 -41154 -31511 -19374 30963 99308
3960 99308 81593 34245 -4933 -1976 32846 62529 49919 39161 -9613 -7285 -41060 -67428
3948 -67428 -32014 -23423 -26287 -25334 35557 47587 59442 17854 -65727 -20860 46401 24161 -23322
3935 -23322 -31302 38670 78445 44418 9708 38983 29715 8819 12444 1675 31393 62732
3923 62732 78804 -14410 -130011 -117647 -18567 -3559 -25989 -25539 -22647 -24127 -70086 -142702
3911 -142702 -138562 -107473 -46182 10029 -933 -32960 -20698 15516 49347 63889 29809 7896
3899 7896 37134 85352 89184 77000 103650 65586 -7868 -62957 -47050 -35072 -47469 -9274
3887 -9274 82534 87583 -45704 -92636 23298 22022 -44721 24177 86845 88052 36383 15440
3875 15440 8516 53932 84562 69446 2240 -31574 -5644 50955 51202 13293 34400 44240 17956
3862 17956 49748 98181 111498 58678 80832 85248 31649 -60501 -22781 6761 42452 71392
3850 71392 750 -83583 -119002 -105007 -146498 -138398 -84666 -19945 -56122 -87252 -17890 32154
3838 32154 47492 57372 36840 -21812 -22666 -1660 33534 45133 -19337 -71466 -84957 -47672
3826 -47672 -43276 -51050 -27202 -55015 -39173 29189 44771 16453 -49804 -24506 -32018 -24031 -3327
3813 -3327 1432 19502 17415 37074 9436 24237 21712 13719 -12280 -790 6766 10955 -30464
3800 -30464 -21333 28297 82516 80669 74841 85047 56721 8914 -11928 -15498 17622 24909 24396
3787 24396 -25507 -39385 -16809 11110 45507 41814 37548 59951 35478 42913 15886 6370 5452
3774 5452 10092 -5186 -10244 13634 77731 84533 97137 74898 39120 15982 11686 -23670 -59637
3761 -59637 -67055 -57262 -39350 -82492 -150892 -129449 -44552 -68400 -83773 -31925 34097 58407
3749 58407 108910 134605 128189 47266 -60223 -60445 27009 13323 15991 48655 67421 2390
3737 2390 -14608 34745 56693 1925 -19063 -28131 -65430 -57253 -63944 -99195 -72001 22751 38083
3724 38083 30539 11323 -43301 -89087 -79304 -51894 -94216 -120558 -101313 -10916 20944 -2271
3712 -2271 -9017 -33420 -38055 -10426 41404 58071 65008 -695 -27274 -2883 16241 31545 74598
3699 74598 92820 91509 42008 -4486 69003 82828 75467 51245 -2216 -20366 -11012 -52430
3687 -52430 -68640 -101089 -81963 -17586 6448 7327 12676 2242 14247 47009 82607 31252
3675 31252 7077 -8480 358 -43201 -53575 -67914 -78172 -28125 -31411 -68515 -118646 -81582
3663 -81582 -5041 -60175 -57573 -6984 18820 18420 94665 106118 65806 76884 28222 -48205
3651 -48205 -62532 -30987 -19221 -18292 -4637 -19599 -52329 -66077 -80432 -131377 -126228 -54289
3639 -54289 36876 50372 74599 113021 76176 71313 56777 -9394 -33139 -27394 -58332 -28662
3627 -28662 30541 2777 8294 4773 -24552 35495 47459 35111 51207 9232 -16805 25418
3615 25418 22518 -26043 -26243 -27313 5468 -26563 -65382 -61890 -76343 -144724 -183178 -154428 -78363
3602 -78363 -92390 -69907 -56032 -74516 -43883 -14606 -16050 -49065 -39280 -41186 -3982 38078
3590 38078 51537 29828 2568 4654 14336 5659 21858 79596 97158 61113 46013 72448
3578 72448 44149 -1484 -7418 -25990 -43140 533 51892 60503 25574 -5746 -11874 -42864
3566 -42864 -51673 -54138 -57041 -4504 8266 -69503 -108849 -22086 63376 83026 58404 82458
3554 82458 95288 46784 22803 2426 -91793 -64192 2425 -7456 52914 99344 82633 70605
3542 70605 32177 10547 64654 61740 46739 52960 -31493 -23766 -24127 275 25467 18634 31506
3529 31506 54291 65512 -67191 -85832 -82837 -82621 -89803 -7578 -53197 -32185 -2031 -33100
3517 -33100 -10991 20623 -13675 -15906 26659 22506 -4315 -51323 -17364 -748 35249 66660
3505 66660 59507 7221 7772 35091 22653 29923 72775 87737 73378 30514 17683 9527 19907
3492 19907 -911 18473 36332 24906 12393 73266 52556 13784 16518 27997 38310 45362
3480 45362 90130 110907 25638 -25562 -45295 -5383 11890 16927 29582 39323 13807 -46253
3468 -46253 -43014 22299 11369 -16958 -15117 -43011 -10108 -14622 -41381 -68423 -64140 -95742 -115035
3455 -115035 -69043 13280 -32580 -45969 -19963 7805 13504 -4238 -27650 -55989 -11012 -45061
3443 -45061 -74364 -54372 -35142 -53111 -89705 -82261 -73082 -3193 27952 9212 -89 -25137
3431 -25137 -25520 6066 -37978 -41581 -11884 -24796 -58744 -52236 3241 -17023 -15887 -9595 -18811
3418 -18811 -886 -13578 -22345 -14648 -44315 -12840 -11468 -20849 2584 69026 58493 -10229 -72928
3405 -72928 -61184 -81155 -88601 -73824 -29866 -17286 4355 18451 22274 -32051 -21177 -46817
3393 -46817 -24808 78702 91425 -3444 -10276 21898 1221 -13253 12392 8051 24852 45508
3381 45508 32356 15082 -4567 -11590 -14424 -21441 65643 105969 100746 97966 111951 71659 65856
3368 65856 79748 77860 1732 -6344 -1889 -3250 -37927 -28839 -27243 -80434 -91841 -108769 -67344
3355 -67344 -32815 -99991 -75839 -64851 -105870 -142916 -168932 -144835 -83139 -36719 44159 104966
3343 104966 63235 51924 43489 47429 74252 111547 84709 83993 116751 74616 48970 26507
3331 26507 19898 -14354 -15985 15722 81083 124132 73596 22257 1117 -74471 -113934 -87308
3319 -87308 -48449 -66237 -72822 -64433 -44607 28843 77217 56989 12275 -17806 -27099 -66642
3307 -66642 -87892 -73647 -80064 -46800 30168 38509 -13849 -42387 -9081 -2764 -5752 -42773 -84220
3294 -84220 -96694 -79376 -57159 -43254 -92433 -134429 -184443 -142187 -53680 20588 20950 -25826
3282 -25826 -86249 -65799 -44704 -61346 -75654 -13494 -19242 -23456 -21315 17146 26184 -3551 3641
3269 3641 -2929 -74426 -69414 1279 -2699 -42189 -33471 37588 74252 89729 64720 33075 2288
3256 2288 -13165 -22208 1521 -7040 4865 43025 56606 92291 57142 2492 -23459 -60731
3244 -60731 -55837 -17091 -13561 -60811 -60857 -5218 21312 2521 35346 70823 58055 10712 -13409
3231 -13409 -26001 -63166 -68132 -10831 -14161 -9201 20615 -21329 -69603 -89224 -48640 3487
3219 3487 14396 -26685 -39950 4665 -50651 -62341 -65211 -53956 -23348 -37187 -44284 -62871
3207 -62871 -56957 -28713 -17379 -25853 -70411 -29350 34899 54423 38820 -972 6022 -22521
3195 -22521 -26915 -77566 -16360 29706 -13339 -43209 -55634 -26006 17549 64442 31475 -48557
3183 -48557 -65265 -39933 -37608 -76469 -89874 -72313 -48224 -16788 8763 28533 50367 86563
3171 86563 75475 62630 -23552 -73705 -1263 3129 43765 44482 23134 11966 -1536 -7512 14142
3158 14142 8411 -32449 14957 2538 -32435 -36048 -56320 -44296 -2738 -7891 -49523 -65169
3146 -65169 -66985 -79984 -37024 -24136 -42873 -59765 -92130 -100572 -41155 13150 64222 72743
3134 72743 -20970 4094 66533 94259 63256 -6784 -37186 -53874 19332 16521 -2887 31118
3122 31118 99739 59293 11007 -30427 -34744 -32876 -30178 -27366 -17840 -35465 -42907 -34716 -51165
3109 -51165 -75946 -76613 -69012 -98206 -69802 -55775 -58504 -33487 -27958 -65752 -70803 -61613 -11562
3096 -11562 10273 48261 59113 84319 164634 150257 79034 48107 27467 9447 42905 -1873
3084 -1873 -30423 -55641 -35014 3978 4674 -25701 -37495 -34892 -14289 -8835 7628 36187 12556
3071 12556 -62418 -25920 8273 77323 117435 101322 43003 -25008 -5236 57993 100973 68803
3059 68803 90340 89903 82408 39095 14201 -21406 -51778 -56353 -30502 17873 44925 19074 37778
3046 37778 37035 -26992 -44265 -10116 345 60229 89831 78664 56498 29167 16756 30308
3034 30308 14225 -5850 -25444 -13537 -41357 -47567 -60655 -16442 -28542 -60797 -66276 -97063
3022 -97063 -163589 -118033 -69014 -57236 -77379 -82412 -66160 -20357 14005 71136 77865 59094
3010 59094 101846 115616 51940 -23818 -3992 56331 62136 7290 27073 78064 63463 17993
2998 17993 -18086 13384 40899 24229 5944 853 -54262 -70077 -28192 4585 -11612 -39966
2986 -39966 -30079 -38702 -30262 -3703 -42927 -50880 -34370 -85137 -48516 -18034 53616 88909 81595
2973 81595 47559 36668 -15271 -71724 -48686 -951 28999 -23929 -32499 -4452 35930 9600
2961 9600 -39844 5346 18313 -51434 -87740 -46003 18447 19421 -15285 -41873 -40392 -41782 -48030
2948 -48030 -44142 -11421 21119 -8711 -29610 78301 82288 68161 14240 -24366 6451 23986
2936 23986 21702 -12278 -90520 -45338 -28110 -33176 -34504 3838 19717 37301 66664 88043
2924 88043 70146 12917 -47571 -76844 -95779 -89701 -33588 12222 -71794 -117660 -23354 2244
2912 2244 -36650 43022 72592 98699 78046 53039 74779 20798 16284 -5069 -6812 -12572 7199
2899 7199 59845 74734 38611 65209 87533 54162 -43624 -51573 -73988 -56465 -37658 -65211
2887 -65211 -30492 29006 47622 13410 -55695 -64212 -55248 -15575 28871 57381 66552 116988
2875 116988 77147 17523 8347 26126 49933 53104 45900 86317 72306 93804 131538 112822
2863 112822 78678 -992 -45876 -108905 -55459 39972 27779 8479 75960 25264 -13189 -18013
2851 -18013 -16431 -56364 -73903 -66212 -60344 -24047 491 4228 13602 19354 12390 48564 71027
2838 71027 39781 -42985 -106662 -157510 -93497 -35155 -66278 -45553 -20874 -33948 -66440 -72587
2826 -72587 5787 80394 68754 9648 6816 45411 72220 24770 -25362 -21353 -36381 -73460
2814 -73460 -87162 -57166 -76319 -103109 -85509 -49404 -37665 1149 3813 -23215 -14338 -8274
2802 -8274 2388 -38165 -30735 1236 -21878 -27312 -27739 -86337 -28895 -15311 4714 37423 -21072
2789 -21072 -29582 21889 15281 -741 -29546 -39508 26689 141405 161011 161990 139498 76678 16687
2776 16687 44661 44732 33582 8899 2669 97996 103112 77648 27604 26942 64452 30379 -5342
2763 -5342 8762 -1349 -71066 -76122 -55605 -6955 -5035 -59413 -100634 -91821 -78072 -148332 -164077
2750 -164077 -99601 -62440 -38641 -27734 -64053 -47101 -30691 -35764 -10604 -16258 9027 -28947
2738 -28947 6832 78701 51837 -23712 -68503 -44550 -52463 -80044 -63102 -23785 -14358 -28613
$$ [...]
##END NTUPLES=NMR SPECTRUM
##END=
