##TITLE=317047
cc 37110
439/101/19, but sample label is 439/101/30
adrs
ronp
##JCAMPDX= 6.0         $$ Bruker NMR JCAMP-DX V2.0
##DATA TYPE= NMR SPECTRUM
##DATA CLASS= NTUPLES
##ORIGIN= Bruker BioSpin GmbH
##OWNER= nmr
$$ XWIN-NMR		Version 3.5
$$ Wed Jul 12 08:53:55 2006 GMT Daylight Time (UT+1h)  MAYBRIDGE\nmr@NMR_250MHZ
##.OBSERVE FREQUENCY= 250.131544655141
##.OBSERVE NUCLEUS= ^1H
##.ACQUISITION MODE= SIMULTANEOUS (DQD)
##.ACQUISITION SCHEME= undefined
##.AVERAGES= 16
##.DIGITISER RES= 18
##SPECTROMETER/DATA SYSTEM= dpx250
##.PULSE SEQUENCE= zg30
##.SOLVENT NAME= CDCl3
##.SHIFT REFERENCE= (INTERNAL, CDCl3, 0, 16.522)
##AUDIT TRAIL= $$ (NUMBER, WHEN, WHO, WHERE, WHAT)
$$ ##TITLE= Audit trail, XWIN-NMR		Version 3.5
$$ ##JCAMPDX= 5.01
$$ ##ORIGIN= Bruker BioSpin GmbH
$$ ##OWNER= nmr
$$ C:/u/data/dgb/nmr/ADRS/15620/pdata/1/auditp.txt
$$ ##AUDIT TRAIL=  $$ (NUMBER, WHEN, WHO, WHERE, WHAT)
(   1,<2006-02-06 12:28:31.70 +000>,<MAYBRIDGE\nmr>,<NMR_250MHZ>,
      <created by zg, POWCHK disabled, PULCHK disabled
       configuration hash MD5:
       84 BC 41 DB A1 6E 1D 46 DA 25 12 A5 C1 ED C5 3A
       data hash MD5: 64K
       1B FD C8 38 F9 B7 03 4E C5 9E F2 D1 81 46 AE FF>)
(   2,<2006-02-06 12:28:37.18 +000>,<MAYBRIDGE\nmr>,<NMR_250MHZ>,
      <Start of raw data processing
       ef LB = 0.3 FT_mod = 6 PKNL = 1 SI = 32K 
       data hash MD5: 32K
       B8 C8 4D 1B 41 BD EF C0 40 5F A2 1D DA 52 D8 67>)
(   3,<2006-02-06 12:28:39.26 +000>,<MAYBRIDGE\nmr>,<NMR_250MHZ>,
      <apk 
       data hash MD5: 32K
       5D 3B 04 BB F0 29 26 D2 EF FC EC 61 45 1D F0 95>)
(   4,<2006-02-06 12:28:40.32 +000>,<MAYBRIDGE\nmr>,<NMR_250MHZ>,
      <abs ABSG = 5 
       data hash MD5: 32K
       7D A8 F0 CD 10 5F 8B D4 A3 10 86 51 57 43 87 A8>)
$$ ##END=
$$ 
$$ hash MD5
$$ 70 C2 55 0B 30 DA 76 81 83 B4 7E 48 89 1A 2F 77
##$RELAX= 
##$RELAX= 
##$RELAX= 
##$RELAX= 
##$RELAX= 
##$RELAX= 
##$RELAX= 
$$ Bruker specific parameters
$$ --------------------------
##$DU= <C:\Restored>
##$EXPNO= 15620
##$NAME= <ADRS>
##$PROCNO= 1
##$TYPE= <nmr>
##$USER= <dgb>
##$AMP= (0..31)
100 100 100 100 100 100 100 100 100 100 100 100 100 100 100 100 100 100 
100 100 100 100 100 100 100 100 100 100 100 100 100 100 
##$AQSEQ= 0
##$AQ_mod= 3
##$AUNM= <au_zg>
##$AUTOPOS= <9 >
##$BF1= 250.13
##$BF2= 250.13
##$BF3= 250.13
##$BF4= 250.13
##$BF5= 500.13
##$BF6= 500.13
##$BF7= 500.13
##$BF8= 500.13
##$BYTORDA= 1
##$CFDGTYP= 0
##$CFRGTYP= 5
##$CHEMSTR= <none>
##$CNST= (0..31)
1 1 145 1 1 1 1 1 1 1 1 1 1 1 1 1 1 1 1 1 1 1 1 1 1 1 1 1 1 1 1 1 
##$CPDPRG= <>
##$CPDPRG1= <>
##$CPDPRG2= <>
##$CPDPRG3= <>
##$CPDPRG4= <mlev>
##$CPDPRG5= <mlev>
##$CPDPRG6= <mlev>
##$CPDPRG7= <mlev>
##$CPDPRG8= <mlev>
##$CPDPRGB= <>
##$CPDPRGT= <>
##$D= (0..31)
0 1 0 0 0 0 0 0 0 0.06 0 0 0 0 0 0 0.0002 0 0 0 0 0 0 0 0 0 0 0 0 0 0 
0 
##$DATE= 1139228910
##$DBL= (0..7)
120 120 120 120 120 120 120 120 
##$DBP= (0..7)
150 150 150 150 150 150 150 150 
##$DBP07= 0
##$DBPNAM0= <>
##$DBPNAM1= <>
##$DBPNAM2= <>
##$DBPNAM3= <>
$$ [...]
##$SUBNAM7= <"">
##$SUBNAM8= <"">
##$SUBNAM9= <"">
##$SW= 20.6930455092707
##$SWIBOX= (0..15)
0 0 3 0 0 0 0 0 0 0 0 0 0 0 0 0 
##$SW_h= 5175.983436853
##$TD= 65536
##$TD0= 1
##$TE= 293.16
##$TE2= 300
##$TE3= 300
##$TEG= 300
##$TL= (0..7)
0 120 120 120 120 120 120 120 
##$TP= (0..7)
150 150 150 150 150 150 150 150 
##$TP07= 0
##$TPNAME0= <>
##$TPNAME1= <>
##$TPNAME2= <>
##$TPNAME3= <>
##$TPNAME4= <>
##$TPNAME5= <>
##$TPNAME6= <>
##$TPNAME7= <>
##$TPOAL= (0..7)
0.5 0.5 0.5 0.5 0.5 0.5 0.5 0.5 
##$TPOFFS= (0..7)
0 0 0 0 0 0 0 0 
##$TUNHIN= 0
##$TUNHOUT= 0
##$TUNXOUT= 0
##$USERA1= <user>
##$USERA2= <user>
##$USERA3= <user>
##$USERA4= <user>
##$USERA5= <user>
##$V9= 5
##$VALIST= <valist>
##$VCLIST= <CCCCCCCCCCCCCCC>
##$VD= 0
##$VDLIST= <DDDDDDDDDDDDDDD>
##$VPLIST= <PPPPPPPPPPPPPPP>
##$VTLIST= <TTTTTTTTTTTTTTT>
##$WBST= 1024
##$WBSW= 4
##$XGAIN= (0..3)
0 0 0 0 
##$XL= 0
##$YL= 0
##$YMAX_a= 476037
##$YMIN_a= -420152
##$ZGOPTNS= <>
##$ZL1= 120
##$ZL2= 120
##$ZL3= 120
##$ZL4= 120
##$ABSF1= 16.522
##$ABSF2= -4.171173
##$ABSG= 5
##$ABSL= 3
##$ALPHA= 0
##$AQORDER= 0
##$ASSFAC= 0
##$ASSFACI= 0
##$ASSFACX= 0
##$ASSWID= 0
##$AUNMP= <proc_1d>
##$AZFE= 0.1
##$AZFW= 0.1
##$BCFW= 0
##$BC_mod= 0
##$BYTORDP= 0
##$COROFFS= 0
##$CY= 12.5
##$DATMOD= 1
##$DC= 0
##$DFILT= <>
##$DTYPP= 0
##$F1P= 14.0000005364418
##$F2P= -0.99999901652339
##$FCOR= 0.5
##$FTSIZE= 32768
##$FT_mod= 6
##$GAMMA= 0
##$GB= 0
##$INTBC= 1
##$INTSCL= 1
##$ISEN= 128
##$LB= 0.3
##$LEV0= 0
##$LPBIN= 0
##$MAXI= 10000
##$MC2= 0
##$MEAN= 0
##$ME_mod= 0
##$MI= 0
##$NCOEF= 0
##$NC_proc= -5
##$NLEV= 6
##$NOISF1= 0
##$NOISF2= 0
##$NSP= 0
##$NTH_PI= 0
##$NZP= 0
##$OFFSET= 16.522
##$PC= 1
##$PHC0= 103.5583
##$PHC1= 8.260205
##$PH_mod= 1
##$PKNL= yes
##$PPARMOD= 0
##$PSCAL= 4
##$PSIGN= 0
##$REVERSE= no
##$SF= 250.13
##$SI= 32768
##$SIGF1= 0
##$SIGF2= 0
##$SINO= 400
##$SIOLD= 32768
##$SREGLST= <1H.CDCl3>
##$SSB= 0
##$STSI= 32768
##$STSR= 0
##$SW_p= 5175.98343685301
##$SYMM= 0
##$S_DEV= 0
##$TDeff= 65536
##$TDoff= 0
##$TI= <Analysis number 999999
Compound Code 99
Book Reference 9
Project Code 9>
##$TILT= no
##$TM1= 0
##$TM2= 0
##$TOPLEV= 0
##$USERP1= <user>
##$USERP2= <user>
##$USERP3= <user>
##$USERP4= <user>
##$USERP5= <user>
##$WDW= 1
##$XDIM= 32768
##$YMAX_p= 389995477
##$YMIN_p= -709240
$$ End of Bruker specific parameters
$$ ---------------------------------
##NTUPLES= NMR SPECTRUM
##VAR_NAME=  FREQUENCY,     SPECTRUM/REAL,   SPECTRUM/IMAG
##SYMBOL=    X,             R,               I
##VAR_TYPE=  INDEPENDENT,   DEPENDENT,       DEPENDENT
##VAR_FORM=  AFFN,          ASDF,            ASDF
##VAR_DIM=   32768,         32768,           32768
##UNITS=     HZ,            ARBITRARY UNITS, ARBITRARY UNITS
##FACTOR=    0.157963299565203, 1,           1
##FIRST=     4132.6476996994, 0,             0
##LAST=      -1043.33573715361, 0,           0
##MIN=       -1043.33573715361, -709240,     0
##MAX=       4132.6476996994, 389995477,     0
$$ Real data points
##PAGE= N=1
##DATA TABLE= (X++(R..R)), XYDATA
$$ [...]
16213a27004k57379p2618J39519j2181R0510P3785J16253K06559J42988k9990
$$ -127004 -384383 -457001 -317482 -329663 -239153 -165368 -49115 157444 300432 270442
16203B70442p2222k08190J1435N3824p0110l5385j46527n772N8913J3187q5045
$$ 270442 198220 -9970 1465 55289 -14821 -50206 -196733 -202505 -143592 -130405 -215450
16192b15450J8949J49251O9022k4971n4878M9098N052m814N5277k2317p9577Q0518
$$ -215450 -196501 -47250 21772 -3199 -58077 -8979 -3927 -8741 46536 24219 -55358 25160
16180B5160K75268J24114o5163N459O2506J38047P4371j552N7280Q1616j53894
$$ 25160 300428 424542 359379 364838 427344 565391 639762 638210 695490 777106 623212
16169F23212j19546m3217j22941q9771j01367n7137L5078o8953q6175j62855O5202
$$ 623212 503666 460449 337508 247737 146370 89233 124311 55358 -30817 -193672 -128470
16158a28470J77715K81368j62822k95323j24888k75165R4176J71613K7667J03142
$$ -128470 49245 330613 167791 -127532 -252420 -527585 -433409 -261796 -234129 -130987
16148a30987J4651j39927j01286J790R5682J35927J51087K34784Q9240q7021k58475
$$ -130987 -116336 -256263 -357549 -355759 -260077 -124150 26937 261721 350961 263940 5465
16137E465k16898P8713J16820K05713k2292k0217j83598j90006m975K62740J66385
$$ 5465 -211433 -132720 -15900 189813 167521 147304 -36294 -226300 -231275 31465 197850
16126A97850M2918l2976l617k8811M3236J62940L9737J17368Q5617J323q5715
$$ 197850 240768 207792 204175 175364 218600 381540 421277 538645 624262 625585 539870
16115E39870m2994k66777j46671q9003L0077Q7981k2588l5989K6966Q375J32800
$$ 539870 496876 230099 83428 -5575 24502 112483 89895 53906 80872 89247 222047
16104B22047M7193Q2807m1408k6408j16409j21214k15235O0604L6426m613j94946
$$ 222047 269240 352047 310639 284231 167822 46608 -168627 -108023 -71597 -76210 -271156
16093b71156q1189J33339J9701r2827K13452J34553j2144p8192M7264Q0868j1492
$$ -271156 -352345 -219006 -199305 -292132 -78680 55873 43729 -34463 12801 93669 82177
16082H2177j22921k4911j13011R0543K4077q2076m1186R3074j03425r6179Q3659
$$ 82177 -40744 -65655 -178666 -88123 -64046 -146122 -187308 -94234 -197659 -293838 -210179
16071b10179n5342J5646K72933R5262J00351q8331j17724j17064r7932Q2203j79927
$$ -210179 -265521 -249875 23058 118320 218671 130340 12616 -104448 -202380 -120177 -300104
16060c00104j84162j37682K6557K22135J38616j4169L2483N5933Q5932o9867p1702
$$ -300104 -484266 -621948 -595391 -373256 -234640 -248809 -216326 -160393 -74461 -144328 -216030
16049b16030J87633J13047p5954j21334N3082K6091p3960J11502Q9185M5553O3976
$$ -216030 -28397 84650 8696 -112638 -59556 -33465 -107425 4077 93262 138815 202791
16038B02791J02807k11468k76667J2690N115J65559l3981o5118J5575K3414n6367
$$ 202791 305598 94130 -182537 -169847 -164732 827 -33154 -98272 -82697 -59283 -115650
16027a15650L7822o953J1793j66151Q6715J4938N8942N9749J27355l7261q3525
$$ -115650 -77828 -84781 -72988 -239139 -152424 -137486 -78544 -18795 108560 71299 -12226
16016a2226j28150l2817N5130Q3975j5921L8120P002P2253k39870j0264j3692
$$ -12226 -140376 -173193 -118063 -34088 -50009 -11889 -4887 67366 -172504 -182768 -196460
16005a96460j57598l0597J76256P5196o3848J17978K8928j94054n0901J59387
$$ -196460 -354058 -384655 -208399 -133203 -197051 -79073 -50145 -244199 -295100 -135713
15995a35713N7506q3755P1533J20492p3126l5521r0300j06974o3895r292R4845
$$ -135713 -78207 -161962 -90429 30063 -43063 -78584 -168884 -275858 -339753 -349045 -254200
15984b54200O7769l5287j23587P1698j8875n3747p3568k4945P874J22624J89773
$$ -254200 -186431 -221718 -345305 -273607 -292482 -346229 -419797 -444742 -436868 -314244 -124471
15973a24471J73998J30618p204j01585P8293r9657j44044j58201q4075J17628
$$ -124471 49527 180145 172941 71356 149649 49992 -94052 -252253 -336328 -218700
15963b18700P1355j41896j16466Q9918J18642Q7836J28677J9410j8007m6447r7548
$$ -218700 -147345 -289241 -405707 -315789 -197147 -109311 19366 38776 20769 -25678 -123226
15952a23226M4354J6550N3627J38091j36010p757P9604K006j20235O4668P0808
$$ -123226 -78872 -62322 -8695 129396 -6614 -14371 65233 67239 -52996 11672 82480
15941H2480n149j52097q080N4089R1879j054J15559J77750o6k07917k34618J08355
$$ 82480 77331 -74766 -82846 -28757 63122 62068 177627 355377 355311 147394 -87224 21131
15929B1131O4351l1515j53559l7722J74755k472R5958J13307j3198j00674r786
$$ 21131 85482 53967 -99592 -137314 37441 34969 130927 244234 231036 130362 120576
15918A20576p5132j0581k0364j9007Q5790l9065M4727J95798R9058j19900j84402
$$ 120576 45444 34863 14499 -4508 81282 42217 86944 282742 381800 261900 77498
15907G7498j90312M4082k15339j19225L89L3830n3952K26312J30288J5308k0614
$$ 77498 -112814 -68732 -284071 -403296 -402907 -369077 -423029 -196717 -66429 -51121 -71735
15896g1735M6048n9512J63208J53040l6365j1387j62264J2632O3596P8483j13710
$$ -71735 -25687 -85199 78009 231049 194684 183297 21033 33665 97261 175744 62034
15885F2034o0887p7765R2869p1764n1524k7645j39848J198L3456J09383J29942
$$ 62034 1147 -76618 16251 -55513 -107037 -134682 -274530 -273332 -239876 -130493 -551
15874e51M7588l6705j33816p1033J32670P1473k4648o7374j83979J89198J8383
$$ -551 47037 10332 -123484 -194517 -61847 9626 -15022 -82396 -266375 -77177 -58794
15863e8794q6927L5389L0919R104k5399j10476K49151K14240p511j17803k33145
$$ -58794 -145721 -110332 -79413 -70309 -95708 -206184 42967 257207 249696 131893 -101252
15852a01252n1512j17190n8753N9764j6353J4672J37543J85020N5794J05731M361
$$ -101252 -152764 -269954 -328707 -268943 -285296 -270624 -133081 51939 107733 213464 217825
15841B17825n0536l845q3572M5910p4322o6434J14767O0393j0447o0368j37998
$$ 217825 167289 163444 79872 125782 51460 -14974 99793 160186 149739 89371 -48627
15830d8627m9345O8054L0517K1263N6986j36681o4866J5529p7252j06114j820
$$ -48627 -97972 -29918 599 21862 78848 -57833 -122699 -107170 -184422 -290536 -292356
15819b92356J09732J15756J10125N3650j8802l9408L223l7559j13262J988J11205
$$ -292356 -182624 -66868 43257 96907 78105 38697 41920 4361 -108901 -106913 4292
15808D292k1358k34041j23686K73608Q5744O2119J51218l2031p8066O0340j14714
$$ 4292 -17066 -251107 -374793 -101185 -15441 46678 197896 165865 87799 148139 33425
15797C3425q1368J3207P3228r7277M4597k9754j49354Q4464k7614j21080M1907
$$ 33425 -47943 -34736 38492 -58785 -14188 -43942 -193296 -108832 -136446 -257526 -215619
15786b15619M5589J39950K553j27943J10254P5536M006K36830N6173r5797m3529
$$ -215619 -170030 -30080 -27527 -155470 -45216 30320 34326 271156 327329 231532 188003
15775A88003q5448j41149j52398J0744j07507j40844l7926J42707J43568j4564
$$ 188003 102555 -38594 -190992 -180248 -287755 -428599 -466525 -323818 -180250 -194814
15765a94814n2121k6009J46100K8434q3183l8857K41733J8243j29509J572J84869
$$ -194814 -246935 -272944 -126844 -98410 -181593 -220450 21283 39526 -89983 -88411 96458
15754I6458j66001j52065J35760j3417j25920M2457l7095M2109N6141j5102J8423
$$ 96458 -69543 -221608 -85848 -99265 -225185 -182728 -219823 -177714 -121573 -136675 -118252
15743a18252m3969L9258K64183L87456o3379j93162j59528r9414p5192l5491n4323
$$ -118252 -162221 -122963 141220 528676 465297 272135 112607 13193 -61999 -97490 -151813
15732a51813o0676l9676q6257J22963J31208O0655m7830q0833m7192j22580j01460
$$ -151813 -212489 -252165 -338422 -215459 -84251 -23596 -71426 -152259 -199451 -322031 -423491
15721d23491O9166J7370J61776J67630O6749r5723q9352q9323K766R8095j25393
$$ -423491 -354325 -336955 -175179 -7549 59200 -36523 -125875 -215198 -212432 -114337 -239730
15710b39730j15851J31771J95802J13151j57160j51024m7407J05154j44084k8222
$$ -239730 -355581 -223810 -28008 85143 -72017 -223041 -270448 -165294 -309378 -337600
15700c37600P6727K41482J27959j05659j53613J4347J10556j975p0097l2413J0229
$$ -337600 -260873 -19391 108568 2909 -150704 -136357 -25801 -27776 -97873 -130286 -120057
15689a20057L9599l6712J02270r9510J0762K17833m6363j14633p0752r0091l4376
$$ -120057 -80458 -117170 -14900 -114410 -103648 114185 67822 -46811 -117563 -207654 -242030
15678b42030J01823K2362R7967M6603p4744j35538r9842O3095L1189J25437O4787
$$ -242030 -140207 -117845 -19878 26725 -48019 -183557 -283399 -220304 -189115 -63678 1109
15667A109j06694j54551J09021L3230j7445j4902n3766J0658M2752j05041L7550
$$ 1109 -105585 -260136 -151115 -117885 -135330 -150232 -203998 -193340 -150588 -255629 -218079
15656b18079J9350l3203r3657p060K20663P8376L0189J46204l6795j2435l6958
$$ -218079 -198729 -231932 -325589 -332649 -111986 -33610 -3421 142783 105988 93553 56595
15645E6595j13272l7711j69495j66851n7282J31138J38397j46534J81552M696
$$ 56595 -56677 -94388 -263883 -430734 -488016 -356878 -218481 -365015 -183463 -178767
15635a78767J34142N9571l4073j8373j93066j53443M254m9047l277J22336O6762
$$ -178767 -44625 14946 -19127 -37500 -230566 -384009 -379755 -428802 -432079 -309743 -242981
15624b42981J80145J38954j22100j54718R6007P4941J15813O5115L5351p4970
$$ -242981 -62836 76118 -45982 -200700 -104693 -29752 86061 151176 186527 111557
15614A11557k03067m6928J71096M3718q6409k07583M0094M9097J75654l0931k35444
$$ 111557 -91510 -138438 32658 76376 -10033 -217616 -177522 -128425 47229 16298 -219146
15603b19146j5844L14254J54298n8586j57261j0047M6400j98540j7444J55028
$$ -219146 -234990 79264 233562 174976 17715 7668 54068 -144472 -161916 -6888
15593f888Q7504Q5952M7550p7350j99154k5767N011r5067m9478j5792J08670O6806
$$ -6888 80616 166568 214118 136768 -62386 -88153 -83142 -178209 -227687 -243479 -134809 -68003
15581f8003J18998r0958k06780O0382Q9385j28335K02072O2800j89376j32301
$$ -68003 50995 -39963 -246743 -186361 -96976 -225311 -23239 39561 -149815 -282116
15571b82116k1004J86235R7362R3831P9864M5960o5390M9879q7937j86582L1622
$$ -282116 -303120 -116885 -19523 74308 154172 200132 134742 184621 96684 -89898 -58276
15560e8276J24411N3999M3283n7231m8171k457m4946j71138m6365j12720L9798
$$ -58276 66135 120134 163417 106186 58015 55558 10612 -160526 -206891 -319611 -279813
15549b79813J47994N9444j89708p0998J05986J21776n4136J97082P1605K0586
$$ -279813 -131819 -72375 -262083 -333081 -227095 -105319 -159455 37627 109232 129818
15539A29818r7666j19472j80402l0222j15256L7419R366O1893M562P2207L9981
$$ 129818 32152 -87320 -267722 -297944 -413200 -375781 -366415 -304522 -299960 -227753 -187772
15528a87772J17738Q9001n3618J067n7019n9058j40820J6044o654k4207K3822
$$ -187772 -70034 18967 -34651 -33584 -90603 -149661 -290481 -274437 -281091 -305298 -281476
15517b81476J15309P8948J078n0017K23045J65357p3450o7436K0929J35123r3884
$$ -281476 -166167 -87219 -86141 -136158 86887 252244 178794 111358 132287 267410 173526
15506A73526j22741J4912N9206k11763J48434R0621L9948j16382r3536J0660J18916
$$ 173526 50785 65697 124903 -86860 61574 152195 192143 75761 -17775 -7115 111801
15495A11801o929j64240p0737p8143Q3227p6033n3648j467l5026q9252N4923J26677
$$ 111801 104872 -59368 -130105 -208248 -125021 -201054 -254702 -256169 -291195 -380447 -325524 -198847
15483a98847M5356k7065l9429j44608J8180O8247J45878K3957j0816j5054Q600
$$ -198847 -153491 -180556 -219985 -364593 -346413 -278166 -132288 -108331 -119147 -134201 -125601
15472a25601N3424j9903p0012K0200K5452J7263J79412O4776J0336J60888j14278
$$ -125601 -72177 -92080 -162092 -141892 -116440 -99177 80235 145011 155347 316235 201957
15461B01957j49672J4969l2735K7743P2937j4029o754j30951J3344j3579J49415
$$ 201957 52285 67254 34519 62262 135199 121170 114416 -16535 -3191 -16770 132645
15450A32645J25k5384j43771k21655J4590p2006m2095K03775K92620M6884j6831
$$ 132645 132770 107386 -36385 -258040 -243450 -315456 -357551 -153776 138844 185728 168897
15439A68897j10413j37732j16904M8006m5243L0460R5222J5400J10350r1809K2678
$$ 168897 58484 -79248 -196152 -148146 -193389 -162929 -67707 -52307 58043 -33766 -11088
15428a1088n866k5274N6709o3548j53056m2046J64218j03306j70073q1769M5250
$$ -11088 -16954 -42228 14481 -49067 -202123 -244169 -79951 -183257 -353330 -435099 -389849
15417c89849J40772J54653J84500N9286n900j12886O706j65967n7907j1913l6642
$$ -389849 -249077 -94424 90076 149362 143462 30576 37282 -128685 -186592 -198505 -235147
15406b35147q2625L7144J95704J96755N5228j60061j38599O0553l299L0229N2013
$$ -235147 -317772 -280628 -84924 111831 167059 6998 -131601 -71048 -74347 -44118 7895
15395G895K9106R1018j52214l9995o3389Q378K09952L5447k01031l7655M9421
$$ 7895 37001 128019 -24195 -64190 -127579 -119201 90751 126198 -74833 -112488 -63067
15384f3067K4623J21278N8422K0430q8148k3425l0484k54020j31595J15090J24485
$$ -63067 -38444 82834 141256 161686 73538 50113 19629 -234391 -365986 -250896 -126411
15373a26411j06950j35526n5190J3729K15343j6501J44505M5262r7536J7317j57539
$$ -126411 -233361 -368887 -424077 -410348 -195005 -211506 -67001 -21739 -119275 -101958 -259497
15362b59497P8030O0363J16474M8599J09839q2781j15094p0808j43271J7910J83815
$$ -259497 -181467 -121104 -4630 43969 153808 71027 -44067 -114875 -258146 -240236 -56421
15351e6421O2777j70355R720P1577j24203j42512J65783L37265Q6102j37099o4666
$$ -56421 6356 -163999 -154279 -82702 -206905 -349417 -183634 153631 239733 102634 37968
15340C7968J2103m0943l6262K3332l0422k6808k3448k15153J03581J95124k9820
$$ 37968 50071 9128 -27134 -3802 -34224 -61032 -84480 -299633 -196052 -928 -30748
15329c0748p5541J00081J7595J48692m3958k01571L3973l2534j77368k3284J8232
$$ -30748 -106289 -6208 11387 160079 116121 -85450 -51477 -84011 -261379 -284663 -266431
15318b66431L5290j5579P3186J50959j51635J23470P7579O7206j32221j02338
$$ -266431 -231141 -246720 -173534 -22575 -174210 -50740 26839 94045 -38176 -140514
15308a40514Q4155L0183j12230J41452P2072N8031j8672r0165r4811j38892m4451
$$ -140514 -56359 -26176 -138406 3046 75118 133149 114477 24312 -70499 -209391 -253842
15297b53842K52028J09450L1176n8873q4616L1904L7159o075J62558O015k27180
$$ -253842 -1814 107636 138812 79939 -4677 27227 64386 58311 220869 226884 -296
15286b96j75802J12614J49064k02755m576j713Q4313J44432O1675j23011J01385
$$ -296 -176098 -63484 85580 -117175 -121751 -123464 -39151 105281 166956 43945 145330
15275A45330N8336R0225J7336q7387n6446k4797j77300Q6130J23874K0565M0302
$$ 145330 203666 293891 311227 223840 167394 142597 -34703 51427 175301 195866 236168
15264B36168j4138k2331R579p3889l7924k06615k0006J54292O4256K47465K8228
$$ 236168 222030 199699 209278 135389 97465 -109150 -129156 25136 89392 336857 365085
15253C65085q5797k09723o2567o8286j01614m76J54634J5157j66448O8775O9505
$$ 365085 279288 69565 6998 -61288 -162902 -163378 -8744 6413 -160035 -91260 -21755
15242b1755J0073N902J46258M7673o3994k2488j93771k73330k2296L17662M6868
$$ -21755 -11682 -5780 140478 188151 124157 101669 -92102 -365432 -387728 -70066 -23198
15231b3198k01454j08799J48272P1315K33933R2477j4474m9961q917k7231p1752
$$ -23198 -224652 -333451 -185179 -113864 120069 212546 198072 148111 139194 111963 40211
15220D0211m3138j30742O1567J23733J66459j60445k32663P061J39920N5710j26141
$$ 40211 -2927 -133669 -72102 51631 218090 57645 -175018 -167957 -28037 27673 -98468
15209i8468q7184J07319J9823M4907n8636j86001P9479J56991j649n4511P6374
$$ -98468 -185652 -78333 -58510 -13603 -72239 -258240 -178761 -21770 -23419 -77930 -1556
15198a556k0163l4751n1787j0960k0132J2184j51695J36587L01640k9399q9738
$$ -1556 -21719 -56470 -108257 -119217 -139349 -127165 -278860 -142273 159367 129968 40230
15187D0230k913m7792J46545M479j6118Q0998j0915j04948j27817m1287m8538
$$ 40230 37317 -10475 136070 140549 124431 205429 194514 89566 -38251 -79538 -128076
15176a28076r7652J11190p6500J79109K6361j39530j51327P2739O3474K7503M4688
$$ -128076 -225728 -114538 -191038 -11929 14432 -125098 -276425 -203686 -140212 -112709 -68021
15165f8021N4247L9396P0775j24377n5960K6977j86957j7790L148O9429J47312
$$ -68021 -13774 25622 96397 -27980 -83940 -56963 -243920 -261710 -258562 -189133 -41821
15154d1821q5975R2180R9420J80477R0507j75631j63245L2126j40581K8682j08984
$$ -41821 -127796 -35616 63804 244281 334788 159157 -4088 28038 -112543 -83861 -192845
15143a92845j32964J48030N9525k7235O9019J45087J19827J31200k8042j96518
$$ -192845 -325809 -177779 -118254 -145489 -76470 68617 188444 319644 291602 95084
15133I5084j33390m5121J03069r627q1295l336k1756Q4144J14378p5561p0347
$$ 95084 -38306 -83427 19642 10015 -71280 -74616 -96372 -12228 102150 26589 -43758
15122d3758J50881l6973o519p3811j72238J4875K35081Q2648q181l11468j247
$$ -43758 107123 70150 63631 -10180 -182418 -167543 67538 150186 142005 -169463 -170710
15111a70710J11890N3144K40578k7224r7484k03509j35898K6169P6720O6311k8980
$$ -170710 -58820 -5676 234902 207678 110194 -93315 -229213 -203044 -126324 -60013 -88993
15100h8993R2538p0303L588K11747O2184R5496k5104k58982l07886n0995k6491
$$ -88993 3545 -66758 -63170 148577 210761 306257 281153 22171 -285715 -336710 -363201
15089c63201R5071K68195J27353J66279n1976k6001r2548J2971n3013r615j10790
$$ -363201 -268130 65 127418 293697 241721 215720 123172 136143 83130 73515 -37275
15078c7275o5917P1729l9150K8672l0686N820M9366J22926J45358p1008p3712
$$ -37275 -103192 -31463 -70613 -41941 -72627 -66807 -17441 105485 250843 179835 106123
15067A06123j86738j80041n0985j00894J22741J28872R0494J4377J0368n5590
$$ 106123 -80615 -260656 -311641 -412535 -289794 -160922 -70428 -56051 -45683 -101273
15057a01273n3823k7346P7032M4693J19831R8349J43302R8723p602l0757k31579
$$ -101273 -155096 -182442 -105410 -60717 59114 157463 300765 399488 391886 361129 129550
15046A29550l01647j31955n780J43319J05053J78994J01800j31632R5471j2497
$$ 129550 -172097 -304052 -309832 -166513 -61460 117534 219334 87702 183173 170676
15036A70676j08036p9605m5383J5084R7106N057j7192j40342l4449j4406P0245
$$ 170676 62640 -16965 -62348 -47264 49842 54899 37707 -102635 -137084 -151490 -81245
15025h1245K12122j1597M6828K9475j00959k8762j05976J8338J9171o3311j10990
$$ -81245 130877 119280 166108 195583 94624 65862 -40114 -21776 -2605 -65916 -176906
15014a76906l1405o7396L0645R1888R7155N5962P168j2139O7845Q7145o6050j10463
$$ -176906 -208311 -275707 -245062 -153174 -56019 -57 7111 -5028 62817 149962 83912 -26551
15002b6551j83085k49J62308K4351J3530j40476J25876K801j14099m6617J43690
$$ -26551 -209636 -209885 -47577 -23226 -9696 -150172 -24296 -21495 -135594 -182211 -38521
14991c8521R6378K282j39687O1991r7973l0040O4560m6518J67655L11852L2626
$$ -38521 57857 60139 -79548 -17557 -115530 -145570 -81010 -127528 40127 351979 384605
14980C84605k13447J6985J40907j9899j09236k30770m8815m5862J10429J4469
$$ 384605 171158 188143 329050 309151 199915 -30855 -79670 -125532 -15103 -634
14970f34M8860l8093j21264J54315J793J1348N4266K3799n2348j919L9858L1471
$$ -634 48226 10133 -111131 43184 44977 56325 110591 134390 82042 80123 119981 151452
14958A51452L2127P4435m2206j7156o5326j64410k0459K3320q3593k7478j09383
$$ 151452 183579 258014 215808 198652 133326 -31084 -51543 -28223 -111816 -139294 -248677
14947b48677j27286K8785Q4833Q3719j0561M4794Q0535J71555J099K6988M1180
$$ -248677 -375963 -347178 -262345 -178626 -189187 -144393 -63858 107697 108796 135784 176964
14936A76964Q7292q5754j106M4107j67972r4928L7033K74J29918M5o5740O7067
$$ 176964 264256 178502 177396 221503 53531 -41397 -4364 -4090 125828 125873 60133 127200
14924A27200r2537j07308M1804J60000R107k3247Q0574N4733j2883n2186J5083
$$ 127200 34663 -72645 -30841 129159 138266 115019 195593 250326 237443 185257 200340
14913B00340O3696J07015l8507m6070j29327k18384n4700k205L6926J05852N7102
$$ 200340 264036 371051 332544 286474 157147 -61237 -115937 -118142 -81216 24636 81738
14902H1738L9045l2793k9406J42641O1424m0356q5913r3966q9878l8201j4450
$$ 81738 120783 87990 58584 201225 262649 222293 136380 42414 -47464 -85665 -100115
14891a00115o7573R1935J44265J94705j58656j2842k7114o931j78654k01876L3095
$$ -100115 -167688 -75753 68512 263217 104561 91719 64605 57674 -120980 -322856 -289761
14880b89761l7185j03620n1560R6997K10618K16225J79431j28636M3715k774o0755
$$ -289761 -326946 -430566 -482126 -385129 -174511 41714 221145 92509 136224 133450 72695
14869G2695j30508p4517j51438J2747J55217J14868M7595j06253k43701j33550
$$ 72695 -57813 -132330 -283768 -271021 -115804 -936 46659 -59594 -303295 -436845
14859d36845J09359R6387o3529o855J4866j15978Q0987R8713J90166j02891o1258
$$ -436845 -327486 -231099 -294628 -301483 -286617 -402595 -321608 -222895 -32729 -135620 -196878
14848a96878J1528o9238Q0766r6210Q232o3425M4759J47325K2237n5878K5297
$$ -196878 -185350 -254588 -173822 -270032 -261800 -325225 -280466 -133141 -110904 -166782 -141485
14837a41485J03217R1019j14845J914R0591q4426J86847P5835K4080l3821j11346
$$ -141485 -38268 52751 -62094 -60180 30411 -54015 132832 208667 232747 198926 87580
14826H7580r9937j03959J06871j7465j49812J48038L5637j36366N4098l2459O7991
$$ 87580 -12357 -116316 -9445 -26910 -176722 -28684 6953 -129413 -75315 -107774 -39783
14815c9783J29749q3083q3301j01137J03916J87931r8541J5672J49488Q0931l17323
$$ -39783 89966 6883 -76418 -177555 -73639 114292 15751 31423 180911 261842 -55481
14804e5481j30581n1253P0694M1148m1865j60002P2307J69281j25163P3240P5343
$$ -55481 -186062 -237315 -166621 -125473 -167338 -327340 -255033 -85752 -210915 -137675 -62332
14793f2332N2056r1867K0338L08J4238k7927j4674J8050J42474J6744l3471n7111
$$ -62332 -10276 -102143 -81805 -81497 -67259 -95186 -109860 -91810 50664 67408 33937 -23174
14781b3174k96084n0564K37499J23510L6489o2814p8840N1053P5603P2533q8455
$$ -23174 -319258 -369822 -132323 -8813 27676 -35138 -113978 -62925 12678 85211 -3244
14770c244O5066Q5462q3006n9812R0733L650M6391L2247q3954j16434j08975K70613
$$ -3244 61822 147284 64278 4466 95199 98849 145240 177487 93533 -22901 -131876 138737
14758A38737J25907j28766r8092j1540r6293j36564M4151J25747Q7791r4587M5041
$$ 138737 264644 135878 37786 26246 -70047 -206611 -162460 -36713 51078 -43509 1532
14747A532J19929J79182j46857k36865j94615j4201J86489Q4178j1875J21382
$$ 1532 121461 300643 153786 -83079 -277694 -291895 -105406 -21228 -33103 88279
14737H8279O8805K510k21017K3830J98922j0561k15248r9328P688P2913p0243
$$ 88279 157084 159594 -61423 -37593 161329 150768 -64480 -163808 -156120 -83207 -153450
14726a53450j48633N1190K41220O1006O448n6149K0280P2715J28652K0522j2919
$$ -153450 -302083 -250893 -9673 51333 57781 1632 21912 94627 223279 243801 230882
14715B30882k09350q1897M8986J05427o2001Q5771N1008K6688n8759l9176k8930
$$ 230882 21532 -60365 -11379 94048 32047 117818 168826 195514 136755 97579 68649
14704F8649n6434p3343j00355p6209Q9739j1045k4606k5143m5571N0939m310J28331
$$ 68649 12215 -61128 -161483 -237692 -147953 -158998 -183604 -208747 -254318 -203379 -207689 -79358
14692g9358k2102j50036O9224J21766J78499O0263o0931k48577l07448J0609M5800
$$ -79358 -101460 -251496 -182272 -60506 117993 178256 117325 -131252 -438700 -428091 -382291
14681c82291J73688J34926M8346k6817O2929n98R2258P6331K27508l0413k04740
$$ -382291 -208603 -73677 -25331 -52148 10781 10183 102441 178772 406280 375867 171127
14670A71127k14359j60797K0644J43668J8225j1360J87625R768j66743j34277
$$ 171127 -43232 -204029 -183385 -39717 -21492 -32852 154773 164541 -2202 -136479
14660a36479J14957P7374o5883o7392J05625J12039M2909j61521q6983j39050
$$ -136479 -21522 55852 -10031 -77423 28202 140241 183150 21629 -65354 -204404
14650b04404N5339J30774K2682P5642N6163j01651j01873n8009o3404p122O7265
$$ -204404 -149065 -18291 4391 80033 136196 34545 -67328 -125337 -188741 -195863 -128598
14639a28598J07196J57178n7324n3835j43567q4342O2773O33P6231p9827j71862
$$ -128598 -21402 135776 78452 24617 -118950 -203292 -140519 -139886 -63655 -143482 -315344
14628c15344O6303o623Q4989P2381j49225R7458L6281O2895J70719k4249K4950
$$ -315344 -249041 -255664 -170675 -98294 -247519 -150061 -113780 -50885 119834 95585 120535
14617A20535M7142n0852l2605p9405j03336j54622J16855K8707Q3207K03374j15433
$$ 120535 167677 116825 84220 4815 -98521 -253143 -136288 -107581 -24374 179000 63567
14606F3567j31950P8440m7867K3567J28055l2598k35439j75813L8428K1828j0293
$$ 63567 -68383 10057 -37810 -14243 113812 81214 -154225 -330038 -291610 -269782 -280075
14595b80075K17730J64677Q6488m6689j58327j0000M2622j5410r3098K8259m3957
$$ -280075 -62345 102332 188820 142131 -16196 -26196 16426 1016 -92082 -63823 -107780
14584a07780O7866L4784P0422n8285K1118n9506J1785j51744j56867J73610J19942
$$ -107780 -39914 -5130 65292 7007 28125 -31381 -19596 -171340 -328207 -154597 -34655
14573c4655j45742j01063k18164Q9071Q0263p7592l0287r1368J20945L07654J66722
$$ -34655 -180397 -281460 -499624 -410553 -330290 -407882 -438169 -529537 -408592 -100938 65784
14562F5784j20115k1345R1925j8207O3750l3157k540J01887P9142J8183p0853
$$ 65784 -54331 -75676 16249 -1958 61792 28635 26095 127982 207124 225307 154454
14551A54454p2047j71566r0912J27235J53579k7306p6401q9957j5691Q410M8667
$$ 154454 82407 -89159 -180071 -52836 100743 73437 -2964 -92921 -108612 -100202 -51535
14540e1535P8303m9217P7562j66311r4154R6661k7746k83006j17896P9173J33185
$$ -51535 26768 -22449 55113 -111198 -205352 -108691 -136437 -419443 -537339 -458166 -324981
14529c24981M2365j12887J953J25772J1857R5056K13444M2067j62243j50269j3369
$$ -324981 -282616 -395503 -393550 -267778 -255921 -160865 52579 94646 -67597 -217866 -231235
14518b31235J14329J86255m1292j67334O582n7845j26131O0770J44328J9150M1771
$$ -231235 -116906 69349 28057 -139277 -132695 -190540 -316671 -255901 -111573 -92423 -50652
14507e0652J4661j82468p1372J00141K4143J44292k6501O4903O6689k6038J06581
$$ -50652 -35991 -218459 -289831 -189690 -165547 -21255 -47756 17147 83836 57798 164379
14496A64379r9509q8752j2625N2102Q4814J53198p8277m4285P6541M6584k82549
$$ 164379 64870 -23882 -36507 15595 100409 253607 175330 131045 207586 254170 -28379
14485b8379j15367p9709n561J49561J30289M7730L6752J72561J33306l2236k10333
$$ -28379 -143746 -223455 -229016 -79455 50834 98564 135316 307877 441183 408947 198614
14474A98614j43182o6693K6410j9390R9023O8113o0529j4833r8878j25294M9418
$$ 198614 55432 -11261 15149 -4241 94782 162895 102366 87533 -11345 -136639 -87221
14463h7221R055Q5474M0459J3667j40405j4676R8568O5999N0657m8406j44387
$$ -87221 -78166 7308 47767 61434 -78971 -93647 4921 70920 121577 73171 -71216
14452g1216M9449J62192n520j57846j20775P2536k5590j21399J50972J6300P376
$$ -71216 -21767 140425 134905 -22941 -143716 -71180 -96770 -218169 -67197 -50897 -43521
14441d3521N9605N5441J28804M2191j42646k86116L6152L7767k6879J23182j9993
$$ -43521 16084 71525 200329 242520 99874 -186242 -150090 -112323 -139202 -16020 -36013
14430c6013m1734M5523l6693l8536J12989J59961j24216j60871l9427J9694J69322
$$ -36013 -77747 -32224 -68917 -107453 5536 165497 41281 -119590 -159017 -139323 29999
14419B9999L05031K25977p9701k60735k81267K8299o8958m1440J24328K97687
$$ 29999 335030 561007 481306 220571 -60696 -32397 -101355 -142795 -18467 279220
14409B79220K6098j87757j11741l2177J50933j0959j54752n3460R3430K8613r776
$$ 279220 305318 117561 5820 -26357 124576 113617 -41135 -94595 -1165 27448 17672
14398A7672j01209j17671k7429P4828M7936N3819K24787k6822o4355j16060m2467
$$ 17672 -83537 -201208 -228637 -153809 -105873 -52054 172733 145911 81556 -34504 -76971
14387g6971m0508q0184K7120K33962l1376k09306L9913L9204J54743P4369n8860
$$ -76971 -117479 -197663 -170543 63419 32043 -177263 -137350 -98146 56597 130966 72106
14376G2106P3448O1158j66969J22138j7725L0476K3548k01034m2486J2768J0750
$$ 72106 145554 206712 39743 161881 144156 174632 198180 -2854 -45340 -32572 -21822
14365b1822k7384n1773K9845P3736k2593L1640l2634R0464J39134j8155j1285
$$ -21822 -49206 -100979 -71134 2602 -19991 11649 -20985 69479 208613 190458 179173
14354A79173j58330k4211j29032p2879M7942J6811J9015K2833P2083J80114N2443
$$ 179173 20843 -3368 -132400 -205279 -157337 -140526 -121511 -98678 -26595 153519 205962
14343B05962q2469j37392n2924N29J21192K1434j10314N8647k0630R9889K250
$$ 205962 123493 -13899 -66823 -66294 54898 76332 -33982 24665 4035 103924 106174
14332A06174k77286j88821J3502J35046J12271R5738M2839j55365p9171L1739
$$ 106174 -171112 -359933 -346431 -211385 -99114 -3376 39463 -115902 -195073 -163334
14322a63334J80060J75645J03884j66848j21091k20880n5307N6695J08342P6318
$$ -163334 16726 192371 296255 129407 8316 -212564 -267871 -211176 -102834 -26516
14312b6516j45701j10967m3502J08918Q9945R9448p5442O7511J81142j74877k05566
$$ -26516 -172217 -283184 -326686 -217768 -127823 -28375 -103817 -36306 144836 -30041 -235607
14301b35607j01817R7887J40882J0126P1557Q2248j5734Q7810j0520j55039N800
$$ -235607 -337424 -239537 -98655 -88529 -16972 65276 49542 137352 126832 -28207 -22407
14290b2407l0485l6391m351p9442p1799J75738k6446p9335N2075J2915N5557O3025
$$ -22407 -52892 -89283 -93634 -173076 -244875 -69137 -95583 -174918 -122843 -109928 -54371 8654
14278H654r8460m8491j61926J71947J32513Q1440N9283k48966r0264j0742J04005
$$ 8654 -89806 -138297 -300223 -128276 4237 85677 144960 -104006 -194270 -205012 -101007
14267a01007P1132O4708r2600J9050J50349k30133k18043K44812R9679K737j49957
$$ -101007 -29875 34833 -57767 -38717 111632 -118501 -336544 -91732 7947 10684 -139273
14256a39273l6983k917J75214r220k1857m9954p9789r9088m37J87848Q9943J8018
$$ -139273 -176256 -179173 -3959 -13179 -35036 -84990 -164779 -263867 -264304 -76456 13487 31505
14244C1505O6721J67837j09309j73813j35407l8537r6807j36781N8757K96318
$$ 31505 98226 266063 156754 -17059 -152466 -191003 -287810 -424591 -365834 -69516
14234f9516J20549J65987j0629j60418m3439J5484O4004J2899o8796m5461j7403
$$ -69516 51033 217020 206391 45973 2534 18018 82022 94921 26125 -19336 -36739
14223c6739p8080O6415O3538K46005k03656j20619J20135R4188J22226l4120J8547
$$ -36739 -114819 -48404 15134 261139 57483 -63136 56999 151187 273413 239293 257840
14212B57840J3966K3324p6463N4737r6069k27443k7619J30740P3695R1943R6346
$$ 257840 271806 295130 218667 273404 177335 -50108 -77727 53013 126708 218651 314997
14201C14997r5838k18596q2889P7535J9284k4470Q9523K1796P6991j08745j08319
$$ 314997 219159 563 -82326 -4791 14493 -9977 79546 101342 178333 69588 -38731
14190c8731r4379J18226J83594J85387r2008j0117j3385q3246j29755q281R1978
$$ -38731 -133110 -14884 168710 354097 262089 251972 238587 155341 25586 17305 109283
14179A09283N4380L0622P615l8516k38740j47136J02416J10970Q7023n1832m1709
$$ 109283 163663 194285 201900 163384 -75356 -222492 -120076 -9106 77917 26085 -15624
14168a5624k6386j11440J64471o2176J27813P8661p8851j26634R8498P9927j36401
$$ -15624 -42010 -153450 11021 -51155 76658 155319 76468 -50166 48332 128259 -8142
14157h142j41376k4504J05753L5638J96300j07926j48165n9723J3931O5528m8657
$$ -8142 -149518 -174022 -68269 -32631 163669 55743 -92422 -152145 -138214 -72686 -121343
14146a21343n1636K77954J50545p3685j04454O5403j7835j45139K6451K6541K4097
$$ -121343 -172979 104975 255520 181835 77381 142784 124949 -20190 6261 32802 56899
14135E6899J39794q6111k23134j3339J05695j16347p0991L1423J26891J17027
$$ 56899 196693 110582 -112552 -125891 -20196 -136543 -207534 -176111 -49220 67807
14125F7807Q5963k09256j0860J08162j2998r699j02328P466j2782K3315k4610
$$ 67807 153770 -55486 -66346 41816 28818 19119 -83209 -75743 -88525 -65210 -89820
14114h9820p0847o4927L2864J35702m4701j03452j26231R4195Q5720O9834K3200
$$ -89820 -160667 -225594 -192730 -57028 -101729 -205181 -331412 -237217 -151497 -81663 -58463
14103e8463q0525n4663n3293J22973P3416r592l3638m7401k00078K12047L72436
$$ -58463 -138988 -193651 -246944 -123971 -50555 -60147 -93785 -141186 -341264 -129217 243219
14092B43219k7392j08050m9997j4165N2156J48659j21212j13943j6659j804n5952
$$ 243219 215827 107777 57780 43615 95771 244430 123218 9275 -7384 -9188 -65140
14081f5140j32577m4333J82507P1239m0527r2990k02275K7592J44533N3690j33378
$$ -65140 -197717 -242050 -59543 11696 -28831 -121821 -324096 -296504 -151971 -98281 -231659
14070b31659O8094J56700J85913P1995Q269p3520o1666q3476r0493j45750N5501
$$ -231659 -163565 -6865 179048 251043 259312 185792 124126 40650 -49843 -195593 -140092
14059a40092N8630J37627k9495j30810P1507Q9635N6750J02453p1382m4697j60716
$$ -140092 -81462 56165 26670 -104140 -32633 57002 113752 216205 144823 100126 -60590
14048f0590o6656J24391p322L1737k16065m7751R7128J12860j4748n0517n1419
$$ -60590 -127246 -2855 -10177 21560 -194505 -242256 -145128 -32268 -47016 -97533 -148952
14037a48952n187J61729L1003j99623K0689j25674j32590k1972J56J93145J16209
$$ -148952 -154139 7590 38593 -161030 -140341 -266015 -398605 -420577 -420421 -227276 -111067
14026a11067J27997J15380l7494P4173o8638m8753L9642j0472R0924P1120k7808
$$ -111067 16930 132310 94816 168989 100351 51598 91240 80768 171692 242812 215004
14015B15004o4615P1579k5445j4968j05296m6295N2728K4515R0101Q0499L3170
$$ 215004 150389 221968 196523 181555 76259 29964 82692 107207 197308 277807 310977
14004C10977J37019k15733j46196M0031M7544k5397j35702k4124R1345J88032
$$ 310977 447996 232263 86067 126098 173642 148245 12543 -11581 79764 267796
13994B67796J4741j70729K3000J53812M0837j19166j18727r328J54616P7476j20953
$$ 267796 282537 111808 134808 288620 329457 210291 91564 82236 236852 314328 193375
13983A93375j13363r3177p5751n4175n9484o022P9151o0158R347K3888k2869J48033
$$ 193375 80012 -13165 -88916 -143091 -202575 -208597 -129446 -189604 -180257 -156369 -179238 -31205
13971c1205R4039J32632p5753j57535o804N9979N1837R9918j47701K17294K7736
$$ -31205 62834 195466 119713 -37822 -44626 15353 67190 167108 19407 236701 264437
13960B64437l45963j29604J14952L7560j00561j03616j08479M8250Q9497K53181
$$ 264437 -81526 -211130 -96178 -58618 -159179 -262795 -371274 -323024 -233527 19654
13950A9654L33396P2397k03821j74715p143p032N7783K10334j11974k02309P9659
$$ 19654 353050 425447 221626 46911 39768 32736 90519 300853 188879 -13430 66229
13939F6229k38791j14487J62766J24527P9869l8690m3243j9215o009k3563L3880
$$ 66229 -172562 -287049 -124283 244 80113 41423 -1820 -21035 -27044 -50607 -16727
13928a6727J65306J16415o5346N5264j96738k52343J15287O4075j09531J06922
$$ -16727 148579 264994 199648 254912 58174 -194169 -78882 -14807 -124338 -17416
13918a7416J0531n8012J1532O5450m9315r235o1246n7790m3937J06751J73290
$$ -17416 -6885 -64897 -53365 12085 -37230 -46465 -107711 -165501 -209438 -102687 70603
13907G0603l0670m7332k4465R485Q0730O0554j81883j25605n1523K73445K60974
$$ 70603 39933 -7399 -31864 -22379 58351 118905 -62978 -188583 -240106 33339 294313
13896B94313j07610j70271O3521O8728l8761j77296o9629l036J4782J09634J6599
$$ 294313 186703 16432 79953 148681 109920 -67376 -137005 -140041 -125259 -15625 974
13885I74j40970N8821L9599j29237J01742J9886R185j547j712J24312K19440J65678
$$ 974 -139996 -81175 -41576 -170813 -69071 -49185 -40000 -41547 -43259 81053 300493 466171
13873D66171j49798r5862j4443n8502M4058o7395j15941k3375n4132J3006o9071
$$ 466171 316373 220511 206068 147566 191624 124229 8288 -15087 -69219 -56213 -125284
13862a25284R773p6572r2647J20722J2047m2131p8310J54720J56949J10184l9851
$$ -125284 -115511 -192083 -284730 -164008 -151961 -194092 -272402 -117682 39267 149451 109600
13851A09600j55205k5795m664N2369P9086n1128l4456n9687M8853J4199R9126
$$ 109600 -45605 -71400 -76064 -23695 55391 4263 -30193 -89880 -41027 -26828 72298
13840G2298n6591k4354p6266p8151n3109J8095N8875J46228l8774L782n8438j50721
$$ 72298 15707 -8647 -84913 -163064 -216173 -198078 -139203 7025 -31749 -27967 -86405 -237126
13828b37126O6651J27077j06724n1697N8556J52061j84947k12795J01307P9466
$$ -237126 -170475 -43398 -150122 -201819 -143263 8798 -176149 -388944 -287637 -208171
13818b08171M3924J19545j4062q9820P1218J51116m9256M6398N6677j32383K251
$$ -208171 -164247 -44702 -58764 -148584 -77366 73750 24494 70892 127569 -4814 -2563
13807b563K09186m394n0425p8603L4756N603j6095q6049r2051K4342N7856N8993
$$ -2563 206623 202229 151804 73201 107957 113560 97465 11416 -80635 -56293 1563 60556
13795F0556J48273j968l5961R9152J02961j21847k364J00225J26600j44635j2421
$$ 60556 208829 206861 170900 270052 373013 251166 248802 349027 475627 330992 318571
13784C18571p6555n5651P244r33K65539m6042j32580k87094j0582k2632j18291
$$ 318571 242016 186365 193609 192676 458215 412173 279593 -7501 -18083 -40715 -159006
13773a59006k9647J3257m9649J37081P3163o7067n6306j4896J15908j06705L7053
$$ -159006 -188653 -175396 -225045 -87964 -14801 -81868 -138174 -153070 -37162 -143867 -106814
13762a06814k8875M4225j0700q2090J06544J35183k5390K933K41077J38105j72148
$$ -106814 -135689 -91464 -102164 -184254 -77710 57473 32083 35016 276093 414198 242050
13751B42050k33495j32480O2929J70619J33044P3418J16283j65445j30917Q3461
$$ 242050 8555 -123925 -60996 109623 242667 316085 432368 266923 136006 219467
13741B19467j35361p8384Q8537o5326q2745N197M1259p2766J8813k5995J04496
$$ 219467 84106 5722 94259 28933 -53812 -48615 -7356 -80122 -61309 -87304 17192
13730A7192o3342N4695J41863J02585q2378k82429j98504k5104M8994J65522r4315
$$ 17192 -46150 8545 150408 252993 170615 -111814 -310318 -335422 -286428 -120906 -215221
13719b15221J7451J42416J46027M7499j02592j65956J30106N5596Q267J75159
$$ -215221 -197770 -55354 90673 138172 35580 -130376 -270 55326 63593 238752
13709B38752j46738j51518m3073K8265P1349O7587L0414o8762j19808j03095j1531
$$ 238752 92014 -59504 -102577 -74312 -2963 64624 95038 26276 -93532 -196627 -208158
13698b08158q2961m9537L3341J24018K11916K27041P0596P9401k88790j89349
$$ -208158 -291119 -340656 -307315 -183297 28619 255660 326256 405657 116867 -72482
13688g2482n9013M1008L3909m6970J5968N6783l3231J02453N5679K9751n6056
$$ -72482 -131495 -90487 -56578 -103548 -87580 -30797 -64028 38425 94104 123855 67799
13677F7799J18519J7818j23995m9760j31830o7140L6215p5492P684p5543J51037
$$ 67799 186318 204136 80141 30381 -101449 -168589 -132374 -207866 -200182 -275725 -124688
13666a24688K20017J30114q2125j58974J2894J28572R4572k8691r3966r6557n8000
$$ -124688 95329 225443 143318 -15656 -2762 125810 220382 191691 97725 1168 -56832
13655e6832j33330k13937L405J19064J41461M4890L1124L0416q702j19828k3387
$$ -56832 -190162 -404099 -400694 -281630 -140169 -95279 -64155 -33739 -42441 -162269 -185656
13644a85656J34083O3839p6715L797Q5528k2636J456R5516j62533k1243O0195
$$ -185656 -51573 12266 -64449 -60652 24876 2240 3696 99212 -63321 -84564 -24369
13633b4369P2013P5350l1566L8562J02536m0338k3094o206j66406o0051n7923
$$ -24369 47644 122994 91428 129990 232526 192188 169094 162888 -3518 -63569 -121492
13622a21492N3242n535m3180M3237J50820M6377J66577q1245r9226N066Q380J79768
$$ -121492 -68250 -73785 -116965 -73728 77092 123469 290046 208801 109575 114641 123021 302789
13610C02789J30480j16598P5604j66337L9839J10751m0128o509q6019J15761o9903
$$ 302789 433269 316671 392275 225938 265777 376528 336400 329891 243872 359633 289730
13599B89730k01967j83907o4808J66006J82490Q454N1472k7898k39091k6794O749
$$ 289730 87763 -96144 -160952 5054 187544 195998 247470 219572 -19519 -46313 -39564
13588c9564k1299O7609J05269K5005m9613o2064J442r6289m4265L09188J25505
$$ -39564 -60863 6746 112015 137020 87407 25343 26785 -69504 -113769 195419 320924
13577C20924j67686j28350N7698N887j4502l3387M4804j28384J0j8429q7877k5860
$$ 320924 153238 24888 82586 88473 73971 40584 85388 -42996 -42986 -61415 -149292 -175152
13565a75152K05626r162n9888l6853J06417K0039p2328k5135m7702R74J41779
$$ -175152 30474 21312 -38576 -75429 30988 51027 -21301 -46436 -94138 -93164 48615
13554D8615P288J49969r7518j12539q3340q5666k0751M1310R3658m0002o111j01091
$$ 48615 55903 205872 108354 -4185 -87525 -173191 -193942 -152632 -58974 -98976 -105087 -206178
13542b06178j6670J30901o580o6703j36235N0863J93007k9427j5096p5855q0986
$$ -206178 -222848 -91947 -98527 -165230 -301465 -250602 -57595 -87022 -102118 -177973 -258959
13531b58959o2814l4406J4055J05677m5000p4431J21573L6006q817J01122J71932
$$ -258959 -321773 -356179 -342124 -236447 -281447 -355878 -234305 -198299 -207116 -105994 65938
13520F5938K6992j25305p8932P5067o2366j32180r2017J47022j3477L3035L2681
$$ 65938 92930 -32375 -111307 -36240 -98606 -230786 -322803 -175781 -189258 -156223 -123542
13509a23542O1087P4698R7354P3837K08027P8901R3213P7127j54018r0156r9155
$$ -123542 -62455 12243 109597 183434 391461 470362 563575 640702 486684 396528 297373
13498B97373L1572K0072m0420j57925j65968n6342K8650L797q1269R036J89031
$$ 297373 328945 349017 308597 150672 -15296 -71638 -42988 -39191 -120460 -111424 77607
13487G7607J20859J9895o6933k0659K9905M4590k07753j11485o153J83333Q2133
$$ 77607 198466 218361 151428 130769 160674 205264 -2489 -113974 -120127 63206 145339
13476A45339k0311o1590P2686j20910m4080M3758j22822m8095j15713j50760n8398
$$ 145339 125028 63438 136124 15214 -28866 14892 -107930 -156025 -271738 -422498 -480896
13465d80896K23313j4268N8524J83359J57304l2947k45496p7375M6243n6730O2245
$$ -480896 -257583 -271851 -213327 -29968 127336 94389 -151107 -228482 -182239 -238969 -176724
13454a76724q12J74201J54212m3164J00275j7228P57K3536K3934K5446p083q7976
$$ -176724 -177536 -3335 150877 107713 207988 190760 191517 215053 238987 264433 257350 169374
13442A69374k05520M4258j85768k06K36285J1703P8214k8829l6947J04584K2953
$$ 169374 -36146 8112 -177656 -177862 58423 70126 148340 119511 82564 187148 210101
13431B10101k78m3763o3781M8061K3027j06611j47739n644O0916J35525J1622
$$ 210101 209823 166060 102279 150340 173367 66756 -80983 -86627 -25711 109814 121436
13420A21436j08804p4773j6127r9226J03742N4377L9779N6892q8945M6856o2942
$$ 121436 12632 -62141 -78268 -177494 -73752 -19375 20404 77296 -11649 35207 -27735
13409b7735o81J40893j05994n8080Q0588J2627r1868Q912J01469N4773m035K9696
$$ -27735 -28416 112477 6483 -51597 28991 41618 -50250 -41338 60131 114904 110869 140565
13397A40565o391r7671j96304N5391J77795J61166l3073P2010k5633k6067j26980
$$ 140565 134174 36503 -159801 -104410 73385 234551 201478 273488 247855 221788 94808
13386I4808j26310k87l2786j52574O7696J59032l0803k541m0010J27417M0769
$$ 94808 -31502 -31789 -64575 -217149 -149453 9579 -21224 -23765 -63775 63642 104411
13375A04411j7231j154K5145k2013j00381j2132r5760J37591J32367j07512r1150
$$ 104411 87180 86026 111171 89158 -11223 -23355 -119115 18476 150843 43331 -47819
13364d7819J5764n9042j52404m5418J49744K61455P7636n2275m679l3141J30439
$$ -47819 -32055 -91097 -243501 -288919 -139175 122280 199916 147641 142962 109821 240260
13353B40260j11805k35862J5818J43174M6983q4679K5584o8605L794J82605M6377
$$ 240260 128455 -107407 -91589 51585 98568 13889 39473 -29132 -25338 157267 203644
13342B03644j74487r5436j00563J41739K50258K9434p7217m9579j02058n5516
$$ 203644 29157 -66279 -166842 -25103 225155 254589 177372 127793 25735 -29781
13332b9781m9923l8666O9766J8262j31555P4490J62617K0159Q0699j80884p3580
$$ -29781 -79704 -118370 -48604 -30342 -161897 -87407 75210 95369 176068 -4816 -78396
13321g8396J23294q0098n6127O713K007N4601o7805p4727n8264K1735J14607k2722
$$ -78396 44898 -35200 -91327 -84614 -82607 -28006 -95811 -170538 -228802 -207067 -92460 -115182
13309a15182J5434K5477k3338k4686O5034L637l4479K0637Q1824M2813j4086J98994
$$ -115182 -99748 -74271 -97609 -122295 -57261 -53624 -88103 -67466 14358 57171 43085 242079
13297B42079K0382j8883r9298k59319J52142J17751N67L2290M7503j81424j07398
$$ 242079 262461 243578 144280 -115039 37103 154854 155421 187711 235214 53790 -53608
13286e3608j08302P7169p2825R4351J03129P1506J95592j36312j90166J23100
$$ -53608 -161910 -84741 -157566 -63215 39914 111420 307012 170700 -19466 103634
13276A03634P6048P9765o2086k3423o9859n4222J67114J09879l9939j62734j78439
$$ 103634 179682 259447 197361 173938 104079 49857 216971 326850 286911 124177 -54262
13265e4262j56669P8618O5678P7749j06269Q5783K58239N8346j72203r2302l3912
$$ -54262 -210931 -132313 -66635 11114 -95155 -9372 248867 307213 135010 42708 8796
13254H796K8747q71p2602O901J6605K6506n3673Q465p9068p9363J41876J7538
$$ 8796 37543 36672 -35930 -29029 -12424 14082 -39591 -31126 -110194 -189557 -47681 -30143
13242c0143N8850M0550J1084O69R006p8614j0967k47804k13974j5310J69081J44140
$$ -30143 28707 69257 80341 81010 90016 11402 435 -247369 -461343 -476653 -307572 -163432
13230a63432R5181Q4429L6664k9887R4467k184P4401J89948P0347j29431j07570
$$ -163432 -68251 16178 52842 22955 117422 115238 189639 379587 449934 320503 212933
13219B12933M4195J72793j77262j77379l4092J11030L0097j0384j59631k8214
$$ 212933 257128 429921 252659 75280 41188 152218 182315 171931 12300 -15914
13209a5914J69159q0944j62309J25248J57208j08192j50571k7104j4215J1207
$$ -15914 153245 72301 -90008 35240 192448 84256 -66315 -93419 -107634 -96427
13199i6427j3053j09820P8050J89714M1569k02682j26672n7284K8475J28229L9120
$$ -96427 -109480 -219300 -141250 48464 90033 -112649 -239321 -296605 -268130 -139901 -100781
13188a00781J75321M9206r1893o5825J69074J75120j17608j6600o6718k33036
$$ -100781 74540 123746 31853 -33972 135102 310222 192614 176014 109296 -123740
13178a23740m6442R0587R9046M9857N8987p454L949j19134j72263j34732J919
$$ -123740 -170182 -79595 19451 69308 128295 120841 124790 5656 -166607 -301339 -299420
13167b99420J08901K19402J44064o5805N112J43833j0868j08526r7681m3183Q1791
$$ -299420 -190519 28883 172947 107142 112254 256087 245219 136693 39012 -4171 77620
13156G7620M5983j13651m3117l089K6610O9116J7216J49754n0620j97519J00561
$$ 77620 123603 9952 -33165 -36254 -9644 59472 76688 226442 175822 -21697 78864
13145G8864J79951r7810q0380j6889K330k21845j53177K3590K26703O4892p9967
$$ 78864 258815 161005 80625 63736 66066 -155779 -308956 -285366 -58663 6229 -73738
13134g3738p277M4605j19758j7094o639J22663L8217J12819J22753J8541r9706
$$ -73738 -81015 -36410 -156168 -173262 -179901 -57238 -19021 93798 216551 235092 135386
13123A35386n5629Q6834J29953J20442k6822k56045j46779r5527J9473J01155
$$ 135386 79757 166591 296544 416986 390164 134119 -12660 -108187 -88714 12441
13113A2441Q1812M3481j5988n3134J2000l9070r5465O7504J61271k9702j29348
$$ 12441 94253 137734 121746 68612 80612 41542 -53923 13581 174852 145150 15802
13102A5802J10270p3567p1000k6921J653j3898J62900J77603Q0021K0257r9844
$$ 15802 126072 52505 -18495 -45416 -43763 -57661 105239 282842 362863 383120 283276
13091B83276j24113m0844P5337M3890O099q8755N7677m6095n8524P1231J7477
$$ 283276 159163 118319 193656 237546 243645 154890 212567 166472 107948 179179 196656
13080A96656q4730J7281L7339k97019j26982K538J11789K74083R5287j71062k62725
$$ 196656 111926 129207 166546 -130473 -257455 -254917 -143128 130955 226242 55180 -207545
13069b07545m2600J08533m2554Q9698k3201j9197J13973K10617Q3286R132J14434
$$ -207545 -250145 -141612 -184166 -94468 -117669 -136866 -22893 187724 271010 280142 394576
13058C94576q3525p0126j2265K8352j4693m0710M5129J01792K8293J1384k3751
$$ 394576 311051 240925 228660 257012 242319 201609 246738 348530 376823 388207 364456
13047C64456j0486j35897j58608k38573j9481L1259J41529J60161l2368l3637
$$ 364456 353970 218073 59465 -179108 -198589 -167330 -25801 134360 101992 68355
13037F8355p7034M13K20554R7803k30559j31090J3615M4206J75767n3118l3233
$$ 68355 -8679 -8266 212288 310091 79532 -51558 -37943 6263 182030 128912 95679
13026I5679j4136k67779M608J08888L7810J68903l3686O4853j57171j09798M3201
$$ 95679 81543 -186236 -181628 -72740 -34930 133973 100287 165140 7969 -101829 -58628
13015e8628M7909k6875p2853J06370R6900r5699k18065j07069J00748J72139O9280
$$ -58628 -10719 -37594 -110447 -4077 92823 -2876 -220941 -328010 -227262 -55123 14157
13004A4157p2331j19807q4643N2036J04854Q1281R4095m0348J20736Q5917l386
$$ 14157 -58174 -177981 -262624 -210588 -105734 -24453 69642 29294 150030 235947 232561
12993B32561N6224k8269k52580j18695L8057N5780N118P0557J12872P9248K1474
$$ 232561 288785 260516 7936 -110759 -72702 -16922 -11804 58753 171625 250873 272347
12982B72347L7455j62721O3075J02237j97649J2781k8669L4654o8107r529j90253
$$ 272347 309802 147081 210156 312393 114744 127525 98856 133510 65403 55874 -134379
12971a34379m5807K37787L4480o4449l9149j25313Q5307J16702n5767L2791O4428
$$ -134379 -180186 57601 92081 27632 -11517 -136830 -51523 65179 9412 42203 106631
12960A06631l9770J3923J52369J47229J9205k0069o4452j22048M2118j94737J86711
$$ 106631 66861 80784 233153 380382 399587 379518 315066 193018 235136 40399 227110
12949B27110N9247j9164k36970m6699R7247L6606K6380O5884Q1105k9774m4416
$$ 227110 286357 267193 30223 -16476 80771 117377 143757 209641 290746 260972 216556
12938B16556J8752l5004Q08o3180j52063N9323j48735R2240R3807J73021l9681
$$ 216556 235308 200304 201112 137932 -14131 45192 -103543 -11303 82504 255525 215844
12927B15844l7452J0j98269P1196J46214k5316o3792J29114J08409q266q5681
$$ 215844 178392 178402 -19867 51329 197543 172227 108435 237549 345958 337692 252011
12916B52011j26439j07026J01566M5405r6648j7706k05740j57930K17533J18246
$$ 252011 125572 18546 120112 165517 68869 51163 -154577 -312507 -94974 23272
12906B3272j04383P769J21977J34889m7336j98497o2300J81545J28513K0638N4739
$$ 23272 -81111 -73342 48635 183524 136188 -62309 -124609 56936 185449 206087 260826
12895B60826l6672P6397j02950p1901J6059P5272m5016J7932j8293O0064J4467
$$ 260826 224154 300551 197601 125700 141759 217031 172015 189947 171654 231718 246185
12884B46185j14509j12374m1543k2736N8180n0449J9182O1429J10946m4597o7809
$$ 246185 131676 19302 -22241 -44977 13203 -37246 -18064 43365 154311 109714 41905
12873D1905J5041J27650R5839K8469l7535j06980j28302J537M0079K0562Q4434
$$ 41905 56946 184596 280435 308904 271369 164389 36087 37624 77703 98265 182699
12862A82699o6468j50210p1770j78285K0546J90588L0102L9503J41917R3055l8971
$$ 182699 116231 -33979 -105749 -284034 -263488 -72900 -42798 -3295 138622 231677 192706
12851A92706j3277j20122j34371P8483K0987j91015j47418k4492K64177P2039
$$ 192706 179429 59307 -75064 3419 24406 -166609 -314027 -338519 -74342 -2303
12841b303l365K8098l0746J04013J82192M9471J00989o2335j07970r4501R542
$$ -2303 -5668 22430 -8316 95697 277889 327360 428349 366014 258044 163543 173085
12830A73085o0685k3546J4439P787J69946j4186m1224p8969k5591l8128P5447
$$ 173085 112400 88854 103293 111080 281026 266840 225616 146647 121056 82928 158375
12819A58375J10951J12824q5909j10776k0995J7119N6460N5836L3161J08038M0025
$$ 158375 269326 382150 296241 185465 164470 181589 238049 293885 327046 435084 475109
12808D75109n9777r4631j36371m7215n6606n5708j25242n0625K41462J1681k1964
$$ 475109 415332 320701 184330 137115 80509 24801 -100441 -151066 90396 102077 80113
12797H0113M7199q5116L0292P5229J10463J0915Q967j98695J12931N4562q8645
$$ 80113 127312 42196 72488 147717 258180 269095 278062 79367 192298 246860 158215
12786A58215j3820J15540k2179j37450k62883j49527R7459J45254J19232J76281
$$ 158215 144395 259935 237756 100306 -162577 -312104 -214645 -69391 49841 226122
12776B26122n1424r367q7855j86174m2109O8586Q4044J14544N8572j86666o7837
$$ 226122 174698 165331 77476 -108698 -150807 -82221 1823 116367 174939 -11727 -79564
12765g9564J23223p716j88306J4173P4802R6612P745Q0050M0296N6735O4580J26181
$$ -79564 43659 35943 -152363 -138190 -63388 33224 40969 121019 161315 218050 282630 408811
12753D08811o7047j07607n0830k8371o069p1453J19026R9276m3049q5985L1835
$$ 408811 341764 234157 183327 154956 148887 77434 196460 295736 252687 166702 198537
12742A98537J41482j22327j07874N2575L989O3136J6795p5979o5408m5684k32373
$$ 198537 340019 217692 109818 162393 166382 229518 246313 170334 104926 59242 -173131
12731a73131O0023K70652P3516n5687M8778n2952j64708l9582J35876K67419O723
$$ -173131 -113108 157544 231060 175373 224151 171199 6491 -33091 102785 370204 376927
12720C76927q1825k00412m2857J5621R8080K42547M4262O5036l4223k36353k58844
$$ 376927 295102 94690 51833 67454 165534 408081 452343 517379 483156 246803 -12041
12709a2041n6686J29873J65208j31679k8146l6500j02157L4964q6712O7503j2791
$$ -12041 -68727 61146 226354 94675 66529 30029 -72128 -37164 -123876 -56373 -69164
12698f9164J5104n1912L4631L00931L1023j19114l6522R0494J42579j3427j28963
$$ -69164 -54060 -105972 -71341 229590 260613 141499 104977 195471 338050 324623 195660
12687A95660j7116q962p0806J48997O4113j28071Q5982J03464k4267p9698L0904
$$ 195660 178544 169582 98776 247773 311886 183815 269797 373261 348994 269296 300200
12676C00200p4741j00305P4642O9587p1872N2898k7489j2789k5577j41833k3073
$$ 300200 225459 125154 199796 269383 197511 250409 222920 210131 184554 42721 19648
12665A9648J91902L1980o2554q3457P6012R4700P6627l8496L2764p2756j13467
$$ 19648 211550 243530 180976 97519 173531 268231 344858 306362 339126 266370 152903
12654A52903n294Q2736L5063o3978J46806j69430j44011J45508o3878J3999n2034
$$ 152903 147609 230345 265408 201430 348236 178806 34795 180303 116425 130424 78390
12643G8390j3728Q5439R8958J70924J09574j39798j27194j4227j04555m0243J10279
$$ 78390 64662 150101 249059 419983 529557 389759 262565 248338 143783 103540 213819
12632B13819N2117R4757L2526J54040q942k8306j28663P2585M2861j55292o0213
$$ 213819 265936 360693 393219 547259 538317 510011 381348 453933 496794 341502 281289
12621B81289j12789m0708R6716Q1148j29269n3536p2648J14257L64496K7955J86303
$$ 281289 168500 127792 224508 305656 176387 122851 50203 164460 528956 556911 743214
12610G43214o9277j63724p8770k1594l5812P9268J04029l525r3460M8419j52587
$$ 743214 673937 510213 431443 409849 374037 453305 557334 553809 460349 508768 356181
12599C56181K2521K553j61687j68657J23141K66630L3475m4087j19719j86948
$$ 356181 378702 381255 219568 50911 174052 440682 474157 430070 310351 123403
12589A23403j27675n8368Q1936K69550J10174j19963o6224K5436K46149O1095
$$ 123403 -4272 -62640 19296 288846 399020 279057 212833 238269 484418 545513
12579E45513j79119j28697M5619N1373l7372N548O5525M7920n1212q5423N2558
$$ 545513 366394 237697 283316 334689 297317 302865 368390 416310 365098 279675 332233
12568C32233q3327j90733M4814K2708J22679n8710j45814P535J83598M0639j00701
$$ 332233 248906 58173 102987 125695 248374 189664 43850 51385 234983 275622 174921
12557A74921J04260J84213J09597J38124o6453j32647j01171N11q1387P7467n7911
$$ 174921 279181 463394 572991 711115 644662 512015 410844 411355 329968 407435 349524
12546C49524J5963R6571k9035r7350R685J10590M711p1963R6333m194o6639j73473
$$ 349524 365487 462058 433023 335673 345358 455948 460659 388696 485029 480835 414196 240723
12534B40723m0293K6699m7233l471J36654K4888n2602J05955K0139J04843J30745
$$ 240723 200430 227129 179896 176425 313079 337967 285365 391320 411459 516302 647047
12523F47047p1917k20448N3811J61646R3518j56039j41423n8046k01508k1198
$$ 647047 575130 354682 408493 570139 663657 507618 366195 308149 106641 85443
12513H5443J68974j6305L1177m9356n2144l0434J11275Q2771j01491J24505L6821
$$ 85443 254417 238112 269289 219933 167789 137355 248630 331401 229910 354415 391236
12502C91236k69743J395R1624N0983R6859j16958Q2133M3060J4860k3095l1014
$$ 391236 121493 122888 214512 265495 362354 245396 327529 370589 385449 362354 331340
12491C31340j90347j80047R3278O5156j8044j45562J4261J15589J77064J47116
$$ 331340 140993 -39054 54224 119380 101336 -44226 -29965 85624 262688 409804
12481D09804L8605J21147M9684l6109k33640L9842J08762j9706r3575o971K21122
$$ 409804 448409 569556 619240 583131 349491 389333 498095 478389 384814 377843 598965
12470E98965M8971q4226L886j04540l5175j58861p4889j3131k2763P6219P2767
$$ 598965 647936 563710 567596 463056 427881 269020 194131 181000 158237 234456 307223
12459C07223K23423L4668j12706k06964n1355j6645K41299J69715M4064q9758
$$ 307223 530646 565314 452608 245644 194289 177644 418943 588658 632722 542964
12449E42964k63939o9390l6326l3080L5145M4897J47989K10431Q9468P4076n3804
$$ 542964 279025 209635 173309 140229 175374 220271 368260 578691 668159 742235 688431
12438F88431j70015R047p7174r2197J42184M2116j96182R3974K9763K9577O9412
$$ 688431 518416 527463 450289 358092 500276 542392 346210 440184 469947 499524 568936
12427E68936R1276J16954j1529k11938j02254L2468P8184j7848Q3726N2572j46749
$$ 568936 660212 777166 765637 553699 451445 483913 562097 544249 627975 680547 533798
12416E33798J0076j3994k38365r422Q4114J25980M189p7270l5972R2959r5052
$$ 533798 543874 529880 291515 282093 366207 492187 496376 419106 383134 476093 381041
12405C81041J17782n2485j608l320l1546k8486j15435r9685m197J48624J29357
$$ 381041 498823 446338 444730 441410 409864 381378 265943 166258 162061 310685 440042
12394D40042M1586J00728Q6523J38422J47652q1006J4495L7769P4219j08504r8951
$$ 440042 481628 582356 668879 807301 954953 873947 888442 926211 1000430 891926 792975
12383G92975N258j01775Q2358J47620o7012r0229j02193j23R6390P9499K8495
$$ 792975 798233 696458 778816 926436 859424 769195 667002 666879 763269 842768 871263
12372H71263J30531j2332j23573K3526p971j71154j04655R206N3898Q2719K8187
$$ 871263 1001794 989462 865889 889415 881444 710290 605635 614841 668739 751458 779645
12361G79645J08961J55807N7471J14882j25330r6804Q8799O7089J30772p5086
$$ 779645 888606 1044413 1101884 1216766 1091436 994632 1083431 1150520 1281292 1206206
12351A206206k4185r6537j53530K9303J12227l7468o8831Q3445J2076j16924n5166
$$ 1206206 1182021 1085484 931954 961257 1073484 1036016 967185 1050630 1062706 945782 890616
12340H90616J04605Q1934L1840Q3995R9411J7666j7673J2074n8053j03868j21043
$$ 890616 995221 1077155 1108995 1192990 1292401 1310067 1292394 1304468 1246415 1142547 1021504
12329A021504K5848o749J26432J65593q9117j50829j13221j1465J7367k4510o7197
$$ 1021504 1047352 1040603 1167035 1332628 1243511 1092682 979461 967996 985363 960853 893656
12318H93656J37127K5128p7995R7757J39779j96725P0334J23163K0320l1377q568
$$ 893656 1030783 1055911 977916 1075673 1215452 1018727 1089061 1212224 1232544 1201167 1192599
12307A192599j09816l5748N100K8521k5848J72894M9728n0883p4951O9345K05918
$$ 1192599 1082783 1047035 1052135 1080656 1054808 1227702 1277430 1226547 1151596 1220941 1426859
12296A426859p0572o0110K1523l113r6918j32201j70023Q4154P7110O4686M5392
$$ 1426859 1356287 1296177 1317700 1314587 1217669 1085468 915445 999599 1076709 1141395 1186787
12285A186787j14494m7047j04351N4981P9652K78671Q9109j59223p9533J42195
$$ 1186787 1072293 1025246 920895 975876 1055528 1334199 1423308 1264085 1184552 1326747
12275A326747j1271j41329p2354Q1791J71861Q3126l3356j53336r8696K5903q6585
$$ 1326747 1315476 1174147 1101793 1183584 1355445 1438571 1405215 1251879 1153183 1179086 1092501
12264A092501N4154J9995L4465O2149m1085o842L15699J4224l4743k1716j27822
$$ 1092501 1146655 1166650 1201115 1263264 1222179 1215337 1531036 1545260 1510517 1488801 1360979
12253A360979Q0059N1631K6035q4702j28708j17082J19841K33103P9323n2300
$$ 1360979 1441038 1492669 1518704 1434002 1305294 1188212 1308053 1541156 1620479 1568179
12243A568179k3643j68129L6951J47285K5780k7115N2922Q8727L4780j10705j26679
$$ 1568179 1544536 1376407 1413358 1560643 1586423 1559308 1612230 1700957 1735737 1625032 1498353
12232A498353o9330k14371L9436J90263N0601N2284l7097m6296j11740Q7430p778
$$ 1498353 1429023 1214652 1254088 1444351 1494952 1547236 1510139 1463843 1352103 1439533 1431755
12221A431755Q1801J22210o6912M8089k4708n2075J39101p1183k84812j588O6645
$$ 1431755 1513556 1635766 1568854 1616943 1592235 1540160 1679261 1608078 1323266 1321678 1388323
12210A388323p0508j7126J07552J02946q3831J11944p3130l6266J23901L6308
$$ 1388323 1317815 1300689 1408241 1511187 1427356 1539300 1466170 1429904 1553805 1590113
12200A590113j22533j81891k445j6242J71076J23238q8396j10432j33900O2576
$$ 1590113 1467580 1285689 1283244 1267002 1438078 1561316 1472920 1362488 1228588 1291164
12190A291164L0437O5584M166q3338L7466l8226J09530N2492R2883L6264K2993
$$ 1291164 1321601 1387185 1391351 1308013 1345479 1307253 1416783 1469275 1562158 1598422 1621415
12179A621415q6181j13833j7980M0691J17670k9040J35926P8542o6833R2493l8999
$$ 1621415 1535234 1421401 1403421 1444112 1561782 1532742 1668668 1747210 1680377 1772870 1733871
12168A733871l9262k849J36547m1166k90443l5356J32228J3386j52645k8348k944
$$ 1733871 1694609 1691760 1828307 1787141 1496698 1461342 1593570 1606956 1454311 1425963 1423019
12157A423019J09575L8269j12183o5160q4561Q3130J64273K13053L2030n0472
$$ 1423019 1532594 1570863 1458680 1393520 1308959 1392089 1556362 1769415 1801445 1750973
12147A750973l0616m6705j05830L322K17877L2960Q5235n2445o2975M9442J29345
$$ 1750973 1720357 1673652 1567822 1571144 1789021 1821981 1907216 1854771 1791796 1841238 1970583
12136A970583n554m039Q8206K32647K0842j54620j59500j10369k6903O7995J75749
$$ 1970583 1965029 1960990 2049196 2281843 2302685 2148065 1988565 1878196 1851293 1919288 2095037
12125B095037N9563J37086J3759o2405j00689k5212N1165j43049J8803L8211L6403
$$ 2095037 2154600 2291686 2305445 2243040 2142351 2117139 2168304 2025255 2044058 2082269 2118672
12114B118672O0309p00M5610q1321N1583J29976p9721j19186J1617K44878K03032
$$ 2118672 2178981 2178281 2223891 2142570 2194153 2324129 2244408 2125222 2136839 2381717 2584749
12103B584749L4944L0950k28488q8031j3938R8397n9829l1430L2898j1948M4775
$$ 2584749 2619693 2650643 2422155 2334124 2320186 2418583 2358754 2327324 2360222 2348274 2393049
12092B393049J60349O7574j38195Q0286M3038Q8O1484n2378M2825J27407R6211
$$ 2393049 2553398 2620972 2482777 2563063 2606101 2606189 2667673 2615295 2658120 2785527 2881738
12081B881738K7230l15993n9441j05361R1463L77742R1204p4345M7904m2518l7018
$$ 2881738 2908968 2592975 2533534 2428173 2519636 2897378 2988582 2914237 2962141 2919623 2882605
12070B882605j6718P031J71469M8176o7838J20790J48088j00656O0210M6672Q48
$$ 2882605 2865887 2872918 3044387 3092563 3024725 3145515 3293603 3192947 3253157 3299829 3300677
12059C300677q5310O6964M4339R9478L4854j331O5378P6801J27690k691J50298
$$ 3300677 3215367 3282331 3326670 3426148 3461002 3459671 3525049 3601850 3729540 3726849 3877147
12048C877147J66222p2883n8145P39P2689M8024J34682J58092J51502J06656p2958
$$ 3877147 4043369 3970486 3912341 3913080 3985769 4033793 4168475 4326567 4478069 4584725 4511767
12037D511767r3243j3139K2582R701Q6024J63972o4951k7924P5524R3671O9R6170
$$ 4511767 4418524 4405385 4427967 4437668 4523692 4687664 4622713 4594789 4670313 4763984 4764053 4860223
12025D860223J72371J94678J15170R1288j73919R1540J96735J15316j47984N3705
$$ 4860223 5032594 5227272 5342442 5433730 5259811 5351351 5548086 5663402 5515418 5569123
12015E569123K55078l170J41656l4234N7757K12701K14774Q1620J21286J55518
$$ 5569123 5824201 5821031 5962687 5928453 5986210 6198911 6413685 6495305 6616591 6772109
12005F772109r9861k38809K61467K16093K55411K47340R8368J24770J36243J2172
$$ 6772109 6672248 6433439 6694906 6910999 7166410 7413750 7512118 7636888 7773131 7785303
11995G785303K00394O7619L04780L34439K8275J02931J62656K03537J54152J51768
$$ 7785303 7985697 8053316 8358096 8692535 8720810 8823741 8986397 9189934 9344086 9495854
11985I495854J71372K50725L10562R7847J50282K35823K31493L67872L51750K44146
$$ 9495854 9667226 9917951 10228513 10326360 10476642 10712465 10943958 11311830 11663580 11907726
11975A1907726K96925J75705K91767M45549L52585L74405L62095M61615M68496
$$ 11907726 12204651 12380356 12672123 13117672 13470257 13844662 14206757 14668372 15136868
11966A5136868L50518M93875N03996L86345O95727N31613N86048N42700O54726
$$ 15136868 15487386 15981261 16485257 16871602 17567329 18098942 18684990 19227690 19882416
11957A9882416Q53989P64720P60183P89233N85248Q32037R62177R83929J085954
$$ 19882416 20736405 21501125 22261308 23050541 23635789 24467826 25430003 26413932 27499886
11948B7499886J076457J040210J190023J318712J083346J117041J230111J289945
$$ 27499886 28576343 29616553 30806576 32125288 33208634 34325675 35555786 36845731
11940C6845731J140687J127748J187651J218187J277638J043092J199131J319336
$$ 36845731 37986418 39114166 40301817 41520004 42797642 43840734 45039865 46359201
11932D6359201J444941J536638J333922J179857J408509J487222J289373J125295
$$ 46359201 47804142 49340780 50674702 51854559 53263068 54750290 56039663 57164958
11924E7164958J213158J395343J571747J549026J586112J688258J495428J363970
$$ 57164958 58378116 59773459 61345206 62894232 64480344 66168602 67664030 69028000
11916F9028000J580002J710817J796017J719336J479927J436160J768355J905555
$$ 69028000 70608002 72318819 74114836 75834172 77314099 78750259 80518614 82424169
11908H2424169J578099J447676J629797J512131J412316J402894J359463J327912
$$ 82424169 84002268 85449944 87079741 88591872 90004188 91407082 92766545 94094457
11900I4094457J396132J544692J416715J274662J151363J062345J103016J153920
$$ 94094457 95490589 97035281 98451996 99726658 100878021 101940366 103043382 104197302
11892A04197302J210613J387529J351213J235644J069503J171557J205562J274043
$$ 104197302 105407915 106795444 108146657 109382301 110451804 111623361 112828923 114102966
11884A14102966J131897J096399R98921R47137J085232Q15388P20055O14815M00856
$$ 114102966 115234863 116331262 117330183 118277320 119362552 120177940 120897995 121512810 121913666
11875A21913666J62291l8218j66414m57044p24336q67242j087913j351455j532263
$$ 121913666 122075957 122037739 121871325 121414281 120689945 119822703 118734790 117383335 115851072
11866A15851072j561507j571211j617441j424602j394864j356073j124419q95873
$$ 115851072 114289565 112718354 111100913 109676311 108281447 106925374 105800955 104905082
11858A04905082o36058m60812l61345j77942L057K62315N15115O28239Q79399
$$ 104905082 104269024 103808212 103446867 103268925 103271982 103534297 104049412 104677651 105557050
11849A05557050J032131J171000J158120R66311J387981J396592J249450J294523
$$ 105557050 106589181 107760181 108918301 109884612 111272593 112669185 113918635 115213158
11841A15213158J575154J704466J039521K43609l60502m91555n07454o17442q53920
$$ 115213158 116788312 118492778 119532299 119775908 119415406 118923851 118416397 117798955 116945035
11832A16945035o05922p23381q92738r30908r19757j042538j171386j074346j115736
$$ 116945035 116339113 115615732 114722994 113792086 112872329 111829791 110658405 109584059 108468323
11823A08468323j081740j295832j196334q61826j112934j179844j145025j176456
$$ 108468323 107386583 106090751 104894417 104032591 102919657 101739813 100594788 99418332
11815I9418332j257989j206647j014731j359031j255130j155684j274674j302329
$$ 99418332 98160343 96953696 95938965 94579934 93324804 92169120 90894446 89592117
11807H9592117j444869j268452j113644j357659j346835j366224j537119j707468
$$ 89592117 88147248 86878796 85765152 84407493 83060658 81694434 80157315 78449847
11799G8449847j571976j313820j622454j544171j497695j350297j285524j541539
$$ 78449847 76877871 75564051 73941597 72397426 70899731 69549434 68263910 66722371
11791F6722371j448583j348170j323030j375800j436894j591480j452584j344834
$$ 66722371 65273788 63925618 62602588 61226788 59789894 58198414 56745830 55400996
11783E5400996j301131j195166j137798j335234j334989j268119j222647j301457
$$ 55400996 54099865 52904699 51766901 50431667 49096678 47828559 46605912 45304455
11775D5304455j348838j279568j286033j210934j129091j113963j044214j090415
$$ 45304455 43955617 42676049 41390016 40179082 39049991 37936028 36891814 35801399
11767C5801399j029284j101931j238446j136262j075908j115804j137420r70665
$$ 35801399 34772115 33670184 32431738 31295476 30219568 29103764 27966344 26995679
11759B6995679p74038o87795p93973r26086q56868q04978o12203o08084n76349
$$ 26995679 26221641 25533846 24739873 23813787 22956919 22151941 21539738 20931654 20355305
11750B0355305p20078o94415n91337o66989n14626l36831l94032n24553l00245
$$ 20355305 19635227 18940812 18349475 17682486 17167860 16831029 16436997 15912444 15612199
11741A5612199k18492n84153l61338k87682l91361m77164m13202l74759k94783
$$ 15612199 15393707 14809554 14448216 14160534 13769173 13292009 12878807 12504048 12209265
11732A2209265l41763l23998l66193j99105N473j21947j68090k97478k73518k1817
$$ 12209265 11867502 11543504 11177311 10978206 10983679 10861732 10693642 10396164 10122646 10100829
11722A0100829p7732k14670j84769k74293k63942k22842l89318k46158j68060
$$ 10100829 10023097 9808427 9623658 9349365 9085423 8862581 8473263 8227105 8059045
11713H059045j96021q9179p5119j13527j25512o5909j85815k28392j97163o8384
$$ 8059045 7863024 7773845 7698726 7585199 7459687 7393778 7207963 6979571 6782408 6714024
11703F714024Q5089M6593P7859j68451k95068k39435J00179m9671k36261r2127
$$ 6714024 6799113 6845706 6923565 6755114 6460046 6220611 6320790 6271119 6034858 5942731
11693E942731q3559r6317K24875M571l65992j91018k13894n1344l0420J10575
$$ 5942731 5859172 5762855 5987730 5992301 5626309 5435291 5221397 5170053 5139633 5250208
11683E250208J29912N350Q2715l19112j22007J20646r3917k82436n5084p3707
$$ 5250208 5380120 5385470 5468185 5149073 5027066 5147712 5053795 4771359 4716275 4642568
11673D642568j03118j92038p1171M5354P0147N8714J11977o8703j5330Q1049j24484
$$ 4642568 4539450 4347412 4276241 4321595 4391742 4450456 4562433 4493730 4478400 4559449 4434965
11662D434965j13294q0511j24048j63203j71820k90162K3427N7197J1709P2129
$$ 4434965 4321671 4241160 4117112 3953909 3782089 3491927 3515354 3572551 3584260 3656389
11652C656389P364n6100o412k2804r4566j21584j3830L0846m5168N4020q1878
$$ 3656389 3663753 3607653 3601241 3578437 3483871 3362287 3348457 3379303 3334135 3388155 3306277
11641C306277q3036k09014J21718K50757k8827q0511q1595o1319n1250p1087j5997
$$ 3306277 3223241 3014227 3135945 3386702 3357875 3277364 3195769 3134450 3083200 3012113 2996116
11630B996116J44960J82335j16378k9166l8538j48595n9236J15210r240N1110
$$ 2996116 3141076 3323411 3207033 3177867 3139329 2990734 2931498 3046708 3037468 3088578
11620C088578l5341k57232m1525J70423K00439j48281j6743r957j00360J13462
$$ 3088578 3053237 2796005 2754480 2924903 3125342 2977061 2960318 2950361 2850001 2963463
11610B963463P4554j37654q3035q6381j8232l3332l1525o2318p6590K1534N6067
$$ 2963463 3038017 2900363 2817328 2730947 2712715 2679383 2647858 2585540 2508950 2530484 2586551
11599B586551J770M4990j59442n7460R193J47640K9289Q6810J7838m1864j14838
$$ 2586551 2588321 2633311 2473869 2416409 2425602 2573242 2602531 2689341 2707179 2665315 2550477
11588B550477M5814P7411O7850j58816R4513J03986j11639k6072Q5023O3088m3192
$$ 2550477 2596291 2673702 2741552 2582736 2677249 2781235 2669596 2643524 2728547 2791635 2748443
11577B748443j5928M1151J73430j53300j66103p5226k2943J05706J19748J8506
$$ 2748443 2732515 2773666 2947096 2793796 2627693 2552467 2529524 2635230 2754978 2773484
11567B773484j01440m8407O0861J24693O5992K48842j4289L3499J10316l3334
$$ 2773484 2672044 2623637 2684498 2809191 2875183 3124025 3109736 3143235 3253551 3220217
11557C220217j10730R0743K0956J35165J07473q3519P3736R0957K10950J44090
$$ 3220217 3109487 3200230 3221186 3356351 3463824 3380305 3454041 3544998 3755948 3900038
11547C900038M2996L4294N1674k7080P6584j66125Q0622J31200q0765j579l0391
$$ 3900038 3943034 3977328 4029002 4001922 4078506 3912381 3993003 4124203 4043438 4041859 4011468
11536D011468K0196J83202J13406m0429p8086l9351L6768J0872k51789k24282
$$ 4011468 4031664 4214866 4328272 4287843 4209757 4170406 4207174 4218046 3966257 3741975
11526C741975J21500J59021j47066o5016M1384J15485K7852K6324N0734j59504
$$ 3741975 3863475 4022496 3875430 3810414 3851798 3967283 3995135 4021459 4072193 3912689
11516C912689k12073R5098J15373J85528J07670j81493n7138N6272l5901j32152
$$ 3912689 3700616 3795714 3911087 4096615 4204285 4022792 3965654 4021926 3986025 3853873
11506C853873n6209k3040L1689j5236j55397j43139k4135O6187K95176J0050j60907
$$ 3853873 3797664 3774624 3806313 3791077 3635680 3492541 3468406 3534593 3829769 3839819 3678912
11495C678912j25608k710L8550j3380j99170m9533k5805k14551j64888J8900J69040
$$ 3678912 3553304 3550594 3589144 3575764 3376594 3327061 3301256 3086705 2921817 2940717 3109757
11484C109757l9841j98361O7753O1103J9503o3686m1070o8301N6320j1955o9365
$$ 3109757 3069916 2871555 2939308 3000411 3019914 2956228 2915158 2846857 2903177 2891222 2821857
11473B821857R8481P2211L246j72053j64156m9651j2494J70118L5842L8185O2564
$$ 2821857 2920338 2992549 2995795 2823742 2659586 2609935 2597441 2767559 2803401 2841586 2904150
11462B904150K5446O7129N8436P108k33576N0914K44807L571N7398m41j57824
$$ 2904150 2929596 2996725 3055161 3062269 2828693 2879607 3124414 3127985 3185383 3184942 3027118
11451C027118j78781J3207j09430j83396M9290j6304J7749p841Q7457J585M2669
$$ 3027118 2848337 2861544 2752114 2568718 2618008 2601704 2619453 2611612 2699069 2700654 2743323
11440B743323j31062K9732M1922J08366k3169r3556L5618p0764l6183K59M9153
$$ 2743323 2612261 2641993 2683915 2792281 2769112 2675556 2711174 2640410 2604227 2604486 2653639
11429B653639L3980J31497j3742p571Q2363l1983k87193k03942Q1486J27713J48820
$$ 2653639 2687619 2819116 2805374 2797803 2880166 2848183 2560990 2357048 2438534 2566247 2715067
11418B715067J18841J13664k7790p8091j28625j8951J08978l1113n6256l22O5969
$$ 2715067 2833908 2947572 2919782 2841691 2713066 2694115 2803093 2771980 2715724 2715402 2781371
11407B781371m4642L5716J13429J12624O5277l0998j3807j9121L2587O4025j84178
$$ 2781371 2736729 2772445 2885874 2998498 3063775 3032777 3018970 2999849 3032436 3096461 2912283
11396B912283j29086q4442L3247R9283P3222Q0224K1947J2840J13393J90623j8852
$$ 2912283 2783197 2698755 2732002 2831285 2904507 2984731 3006678 3019518 3132911 3323534 3304682
11385C304682j47171p8327O2625J05785R3545L0312k7239O7964o5325q4703J81067
$$ 3304682 3157511 3079184 3141809 3247594 3341139 3371451 3344212 3412176 3346851 3262148 3443215
11374C443215J27855P4733j90769j41949J68521j7253m3249l8639R9704j4842
$$ 3443215 3571070 3645803 3455034 3313085 3481606 3464353 3421104 3382465 3482169 3467327
11364C467327j27631l5798K56543K07905M6028Q0645k44609r050J23000l9756
$$ 3467327 3339696 3303898 3560441 3768346 3814374 3895019 3650410 3641360 3764360 3724604
11354C724604j23673J14842N2793p2401j27310N2876P438q9562J8344j371p4543
$$ 3724604 3600931 3715773 3768566 3696165 3568855 3621731 3629169 3539607 3557951 3556580 3482037
11343C482037R9818K23227p807n5595K3472J01703l1074J30379P5725O1573k9420
$$ 3482037 3581855 3805082 3797275 3741680 3765152 3866855 3835781 3966160 4041885 4103458 4074038
11332D074038o8105q287K577J81481K375o8255Q253P4881R6087n0988n073j61312
$$ 4074038 4005933 3997646 4000223 4181704 4184079 4115824 4124077 4198958 4295045 4244057 4238984 4077672
11320D077672o1301J60012n146j32385O0495J11763M10M9299J16523J07443l0637
$$ 4077672 4016371 4176383 4171237 4038852 4099347 4211110 4211520 4260819 4377342 4484785 4454148
11309D454148j24068j46339J2505J24795O2946L6351M1845J64190O5017j17533
$$ 4454148 4330080 4183741 4196246 4321041 4383987 4420338 4462183 4626373 4691390 4573857
11299D573857J0767J83317K9799j17046p2076r0987L923J26294K57245J44424
$$ 4573857 4584624 4767941 4797740 4680694 4608618 4517631 4521554 4647848 4905093 5049517
11289E049517Q1466J57096m314K5648j7283r1932J301R6553J12478J42613J22736
$$ 5049517 5130983 5288079 5283765 5309413 5292130 5200198 5201499 5298052 5410530 5553143 5675879
11278E675879O8274j09311j5485M1500q6993k0395J3328P0242Q2888R6052K19997
$$ 5675879 5744153 5634842 5619357 5660857 5573864 5553469 5566797 5637039 5719927 5815979 6035976
11267F035976O986K8424J03560M3135P8441Q0724J49963Q1853L0715Q984L06827
$$ 6035976 6042962 6071386 6174946 6218081 6296522 6377246 6527209 6609062 6639777 6648761 6955588
11256F955588K76548p8783Q3906k4273P2878J75117K11529J55711J92388L112
$$ 6955588 7232136 7153353 7237259 7212986 7285864 7460981 7672510 7828221 8020609 8023721
11246H023721l25P1895J84153K22604K34628J11396p4640l379K91929J95174P8311
$$ 8023721 8023396 8095291 8279444 8502048 8736676 8848072 8773432 8770053 9061982 9257156 9335467
11235I335467J31316R4842J10146J87515P3210R8096J23942K55696J76080P6919
$$ 9335467 9466783 9561625 9671771 9859286 9932496 10030592 10154534 10410230 10586310 10663229
11225A0663229J64328J16288J45541n1273L13464K35379J27428J34978J62171
$$ 10663229 10827557 10943845 11089386 11038113 11351577 11586956 11714384 11849362 12011533
11216A2011533L15146K01835J34371L80284K64785K31696L44409J12435K85625
$$ 12011533 12326679 12528514 12662885 13043169 13307954 13539650 13884059 13996494 14282119
11207A4282119J69981K88211K32942L24207L39071K39761L90466K44822K16400
$$ 14282119 14452100 14740311 14973253 15297460 15636531 15876292 16266758 16511580 16727980
11198A6727980K96754M37286N03997K31854K66793M76140M69672L01567M39811
$$ 16727980 17024734 17462020 17966017 18197871 18464664 18940804 19410476 19712043 20151854
11189B0151854O69356L89645L47617N66781N83638N19209N13806O67716O97068
$$ 20151854 20821210 21210855 21558472 22125253 22708891 23228100 23741906 24409622 25106690
11180B5106690O32170P26488P10139P16927R08036O01368O92770R78492Q01575
$$ 25106690 25738860 26465348 27175487 27892414 28800450 29401818 30094588 31073080 31874655
11171C1874655Q71834J019621J144156R50056J077000J231975J356927J252328
$$ 31874655 32746489 33766110 34910266 35860322 36937322 38169297 39526224 40778552
11163D0778552J060096J157036J521722J430330J489677J813341J904758J801985
$$ 40778552 41838648 42995684 44517406 45947736 47437413 49250754 51155512 52957497
11155E2957497K138303K085600K295600K295888K482105K625786L030835L211970
$$ 52957497 55095800 57181400 59477000 61772888 64254993 66880779 69911614 73123584
11147G3123584L105061L274243L712551L962998L955650M297384M693921N031039
$$ 73123584 76228645 79502888 83215439 87178437 91134087 95431471 100125392 105156431
11139A05156431N062184N524926N845596O226557O775452P273498P820159Q249277
$$ 105156431 110218615 115743541 121589137 127815694 134591146 141864644 149684803 157934080
11131A57934080Q456334R077004R624305R920445J0607163J0862898J0979793
$$ 157934080 166390414 175467418 185091723 195012168 205619331 216482229 227462022
11124B27462022J1055787J1207372J1007243J0616201J0213228R831329Q924665
$$ 227462022 238517809 249725181 260732424 271348625 281561853 291393182 300317847
11117C00317847P968421O953899N996717M848707L460815K105506J054753J14638
$$ 300317847 308286268 315240167 321236884 326085591 329546406 331651912 332706665 332821303
11109C32821303p13775j394056j568877j865763k015051k015208j795513j363662
$$ 332821303 332107528 330713472 329144595 327278832 325263781 323248573 321453060 320089398
11101C20089398q53387o38102k60952K29670P01008Q76509J051233Q26719P38886
$$ 320089398 319236011 318597909 318336957 318566627 319267635 320144144 321195377 322022096 322760982
11092C22760982K78047j74435p09589j460936k323218k852305l670179m527069
$$ 322760982 323039029 322864594 322155005 320694069 318370851 315518546 311848367 307321298
11084C07321298n687604o827806q022870r291239j0089173j0395119j0469499
$$ 307321298 301633694 294805888 286783018 277491779 267402606 257007487 246537988
11077B46537988j0222365j0064837j0014954r689431r403310r165639q817168
$$ 246537988 236315623 226250786 216235832 206546401 197143091 187977452 179160284
11070A79160284q653812q133647p558647p196216o859067o440408o268281o029204
$$ 179160284 170506472 162372825 154814178 147617962 140758895 134318487 128050206 122021002
11062A22021002n573793n214894m801275m490022m510268m314838l854931l668564
$$ 122021002 116447209 111232315 106431040 101941018 97430750 93115912 89260981 85592417
11054H5592417l561046l487156l139774k890534k866939k723936k582486k507703
$$ 85592417 82031371 78544215 75404441 72513907 69646968 66923032 64340546 61832843
11046F1832843k181813k122477k065562k028864j952983j774543j968539j472579
$$ 61832843 59651030 57528553 55462991 53434127 51481144 49706601 47738062 46265483
11038D6265483j257344j365667j345323j269397j027042j149555j263906j163266
$$ 46265483 45008139 43642472 42297149 41027752 40000710 38851155 37587249 36423983
11030C6423983j110725j048401r66510r53980j052076j038076q09809o76184n81480
$$ 36423983 35313258 34264857 33298347 32344367 31292291 30254215 29444406 28768222 28186742
11021B8186742p88754r30688q00836n32443l80601n14009n90646n43113l59707
$$ 28186742 27397988 26467300 25666464 25134021 24753420 24239411 23648765 23105652 22745945
11012B2745945p32942n51990n39233m30985k62101m88401o13257m82591l76597
$$ 22745945 22013003 21461013 20921780 20490795 20228694 19740293 19127036 18644445 18267848
11003A8267848m38895l92372j94028k32647l65959l38684k56390l47506l88477
$$ 18267848 17828953 17436581 17242553 17009906 16643947 16305263 16048873 15701367 15312890
10994A5312890l00882l37846k86870r9359k10940j91579k59434k07186k95171
$$ 15312890 15012008 14674162 14387292 14287933 14076993 13885414 13625980 13418794 13123623
10985A3123623l01444l04507k88553k01423o7994j65849k69040j34196k51877
$$ 13123623 12822179 12517672 12229119 12027696 11959702 11793853 11524813 11390617 11138740
10976A1138740j12263k76028j96311j11684r9764j16320p888k60053j94189j3053
$$ 11138740 11026477 10750449 10554138 10442454 10342690 10226370 10218482 9958429 9764240 9751187
10966I751187j22595k34006j66687j55670l054j02168n1837j93736q6077j6740
$$ 9751187 9628592 9394586 9227899 9072229 9069175 8967007 8915170 8721434 8635357 8618617
10956H618617l3012p6807o3235j1446p5565Q2532P6944O4288l3731j70866o6065
$$ 8618617 8585605 8508798 8445563 8434117 8358552 8441084 8518028 8582316 8548585 8377719 8311654
10945H311654j03398j54487p3295k32805l30756j28826j34193j17223k43383j35331
$$ 8311654 8208256 8053769 7980474 7747669 7416913 7288087 7153894 7036671 6793288 6657957
10935F657957K9885O746q5576j61145q5281q2264j23574r4600m2229m9983k52690
$$ 6657957 6687842 6694588 6609012 6447867 6362586 6280322 6156748 6062148 6019919 5969936 5717246
10924E717246l20795m0964l1433r0871O0351k3256n6867q7030r5798R3912J8729
$$ 5717246 5396451 5355487 5324054 5233183 5293534 5270278 5213411 5126381 5030583 5124495 5143224
10913E143224J10323j74816k05804p7456j31487r6464p9312J15180O3055L4444
$$ 5143224 5253547 5078731 4872927 4795471 4663984 4567520 4488208 4603388 4666443 4700887
10903D700887j04576j74288j88217j46224p1136M7459n098j3905k20303j72664
$$ 4700887 4596311 4422023 4233806 4087582 4016446 4063905 4058807 4044902 3824599 3651935
10893C651935j261J79752O3624k15874L1600j46970j32906N8840R4156q2371j29728
$$ 3651935 3650674 3830426 3894050 3678176 3709776 3562806 3429900 3488740 3582896 3500525 3370797
10882C370797j63814j38508O6900K41608k6944m2605R5297O4955j76080n148O567
$$ 3370797 3206983 3068475 3135375 3376983 3350039 3307434 3402731 3467686 3291606 3286458 3293025
10871C293025P312n2683j5478J30622M2557O906k73694k52714n5215Q5319R2243
$$ 3293025 3300337 3247654 3232176 3362798 3405355 3412261 3138567 2885853 2830638 2915957 3008200
10860C008200J23794r3283j46814N3041Q0396O9809K0569k48504j28105O2127
$$ 3008200 3131994 3038711 2891897 2944938 3025334 3095143 3115712 2867208 2739103 2801230
10850B801230j31590J4303N1187J81438O376l24140k58516J36431J15318J23685
$$ 2801230 2669640 2683943 2735130 2916568 2922944 2598804 2340288 2476719 2592037 2715722
10840B715722J62943k05506k33133l167k0032P9811p6240p1899K3506J43960j13409
$$ 2715722 2878665 2673159 2440026 2436859 2416827 2496638 2420398 2348499 2372005 2515965 2402556
10829B402556q4210J36793p4084j79643j83599J34935K11215r1236j91658O6375
$$ 2402556 2318346 2455139 2381055 2201412 2017813 2152748 2363963 2272727 2081069 2147444
10819B147444J18862j92811J94128K5206j00682R044p9815r0089k25152j8442
$$ 2147444 2266306 2073495 2267623 2292829 2192147 2201191 2121376 2031287 1806135 1787693
10809A787693L473n8275J35881J22935k19218M4717R4776L7711m5926j19132j15559
$$ 1787693 1791166 1732891 1868772 1991707 1772489 1817206 1911982 1949693 1903767 1784635 1669076
10798A669076l7445M8528J2454M295K6116p2752j22264O8049q277p2349P2692
$$ 1669076 1631631 1680159 1692613 1696908 1723024 1650272 1528008 1596057 1587780 1515431 1588123
10787A588123o3852J5658J87032J21128L7238j8369n743J0740m9491q0637j53459
$$ 1588123 1524271 1539929 1726961 1848089 1885327 1866958 1861215 1871955 1822464 1741827 1588368
10776A588368P5502J12746k27950j01075l1976l3443Q794L5297j0327J31579q1629
$$ 1588368 1663870 1776616 1548666 1447591 1415615 1382172 1390966 1426263 1415936 1547515 1465886
10765A465886l0357K2899J703n4963R5215P1321q1633P2580J84570l9908m3999
$$ 1465886 1435529 1458428 1460131 1405168 1500383 1571704 1490071 1562651 1747221 1707313 1663314
10754A663314k41114l0900p2087N8754m1528j51201M2976k0347Q6545K2283n6947
$$ 1663314 1422200 1391300 1319213 1377967 1336439 1185238 1228214 1207867 1294412 1316695 1259748
10743A259748J65993J731o4911J22265K6149L7626O5544J42794N110j42863r2471
$$ 1259748 1425741 1427472 1362561 1484826 1510975 1548601 1614145 1756939 1762049 1619186 1526715
10732A526715J2824K7309m2345j14124j61459M0408J59783m4223q7212J8338R3250
$$ 1526715 1539539 1566848 1524503 1410379 1248920 1289328 1449111 1404888 1317676 1336014 1429264
10721A429264k26896O5328L16664P7813o4097o7955j14191N2371J18583L3237
$$ 1429264 1202368 1267696 1584360 1662173 1598076 1530121 1415930 1468301 1586884 1620121
10711A620121j05961J47928J55162J21701j07981Q500j05832N9064J27001r8823
$$ 1620121 1514160 1662088 1817250 1938951 1830970 1839470 1733638 1792702 1919703 1820880
10701A820880j15722j4396J01693l5935q7605P4174K26766J23654J7149J86008
$$ 1820880 1705158 1690762 1792455 1756520 1668915 1743089 1969855 2093509 2110658 2296666
10691B296666J37696n498m7009p681r0754l1832O1686O6042r1926J53753J42664
$$ 2296666 2434362 2428864 2381855 2374174 2283420 2251588 2313274 2379316 2287390 2441143 2583807
10680B583807L8323O386o5066l5223R7408P3226K9180k10345j09308j5017L0177
$$ 2583807 2622130 2628516 2563450 2528227 2625635 2698861 2728041 2517696 2408388 2393371 2423548
10669B423548n6318R1945Q7915l1398P4796K07596q121o2253J76663J1865P573
$$ 2423548 2367230 2459175 2547090 2515692 2590488 2798084 2789963 2727710 2904373 2916238 2923811
10658B923811k07893p0263J01848m8414j11394R3732j08093o9495J0548l0411
$$ 2923811 2715918 2645655 2747503 2699089 2587695 2681427 2573334 2503839 2514387 2483976
10648B483976k0767j00226k64017j33704j01136o5349r2855n2303M459J44589
$$ 2483976 2463209 2362983 2098966 1965262 1864126 1798777 1705922 1653619 1658078 1802667
10638A802667J0157j31904n1381o5334k04933j09661N5644R1696J60369J43539
$$ 1802667 1812824 1680920 1629539 1564205 1359272 1249611 1305255 1396951 1557320 1700859
10628A700859j04089p0312o6339j14203j47900n6752j90522N888j37745j2729
$$ 1700859 1596770 1526458 1460119 1345916 1198016 1141264 950742 956630 818885 806156
10618H06156N4255N3694l6974o6808p905m7706J2016K11138J52143N3660j48416
$$ 806156 860411 914105 877131 810323 802418 754712 766728 977866 1130009 1183669 1035253
10607A035253k91856k8883n4233j01480m5697L564J15692K43743J40209L1410
$$ 1035253 743397 714514 660281 558801 513104 516668 632360 876103 1016312 1047722
10597A047722J5281n0572k05339j61336r3801N0460j09934L4135J4657K26754
$$ 1047722 1063003 1012431 807092 645756 551955 602415 492481 526616 541273 768027
10587G68027J61781N9924J54154j10451j71934n7653K11557N3719j05380o5895
$$ 768027 929808 989732 1143886 1033435 861501 803848 1015405 1069124 963744 897849
10577H97849j26452q6530L2050m0515k27688r0441l9801L4897J67017J77171q9185
$$ 897849 771397 684867 716917 676402 448714 358273 318472 353369 520386 697557 608372
10566F08372L1498K4203p098J5660q6992m0524J11597P9481j36241M0936j34010
$$ 608372 639870 664073 656975 672635 585643 545119 656716 736197 599956 640892 506882
10555E06882M503K22224N5076j71135M1780J95678k8196j57777q0086P3739J12173
$$ 506882 511385 733609 788685 617550 659330 855008 826812 669035 588949 662688 774861
10544G74861M0250M0524j04511o7844R5730l6699o6143j39246K4580m4973r4115
$$ 774861 815111 855635 751124 683280 779010 742311 676168 536922 561502 516529 422414
10533D22414P7444J13019n758Q4544m7544r0586Q2621k51554k38249J42265L24965
$$ 422414 499858 612877 607119 691663 644119 553533 636154 384600 146351 288616 613581
10522F13581J71248o9251n1853q5273K8584J35658m4991K5934Q9984p6276r9184
$$ 613581 784829 715578 663725 578452 607036 742694 697703 723637 813621 737345 638161
10511F38161l4569J1241l8619K0916M8791l4219l6244m7051J4244j36317P2958
$$ 638161 603592 614833 576214 597130 645921 611702 575458 528407 542651 406334 479292
10500D79292J73993K565j63510p5760N1319P1748K06887l693p8546n7921o7159
$$ 479292 653285 655850 492340 416580 467899 539647 746534 742841 664295 606374 539215
10489E39215M424l3767j19267J03597J06790j95225J4958M050J2644q8526j23368
$$ 539215 543639 509872 390605 494202 600992 405767 420725 424775 437419 348893 225525
10478B25525M2617j04186N2391P3848o7668n2632J96690k9187q5431L36P3988
$$ 225525 268142 163956 216347 290195 222527 169895 366585 337398 251967 252303 326291
10467C26291k2871N1078M1856L5675k8749k36453Q076K1036J05577J6401p0106
$$ 326291 303420 354498 396354 432029 403280 166827 174903 195939 301516 317917 247811
10456B47811j27642Q5285J83673k2820l2250j06576j19088J9790J07714K57395
$$ 247811 120169 205454 389127 366307 334057 227481 108393 128183 235897 493292
10446D93292l8495P6229J32056j17904o2794n7351O9851Q1756P0539J10500j68608
$$ 493292 454797 531026 663082 545178 482384 425033 494884 576640 647179 757679 589071
10435E89071O9722p358j63039R8502o32j7925j32376k1691k2808k1999P6945L626
$$ 589071 658793 651435 488396 586898 586266 568341 435965 414274 391466 369467 446412 450038
10423D50038j08941p7071j24183J12261J60540r007O0286K04438j42063k06960
$$ 450038 341097 264026 139843 252104 412644 403637 463923 668361 526298 319338
10413C19338R4589q1070k8759Q5086m8439n2713O1488J12218L3793p6456q8184
$$ 319338 413927 332857 304098 389184 340745 288032 349520 461738 495531 419075 330891
10402C30891k7817j26565K2497N2978k425J90687L6552k04586J776j11235j1207
$$ 330891 303074 176509 199006 251984 249559 440246 476798 272212 273988 162753 151546
10391A51546Q6805J34139m127k19382J54756j75018j87452J77524J80130O4999
$$ 151546 238351 372490 368363 148981 303737 128719 -58733 118791 298921 363920
10381C63920o9889j62252P9344P0369N9392P7402j352l3225j4368J26888K6369
$$ 363920 294031 131779 211123 281492 340884 418286 416934 383709 369341 496229 522598
10370E22598j1220j68155j34743l6091J35253N2636k1432J05455m2247n4175m9394
$$ 522598 511378 343223 208480 172389 307642 360278 338846 444301 402054 347879 298485
10359B98485J9929k848k4962P3440Q3435L8505R412p4977j47241l6552j57049
$$ 298485 318414 315566 290604 364044 447479 485984 495396 420419 273178 236626 79577
10348G9577R2528L4550k5240l3931J1350N5638N9836o3724K0122L4574o7268j57071
$$ 79577 172105 206655 181415 147484 158834 214472 274308 210584 230706 265280 198012 40941
10336D0941J012J9903P6839q7724J7740J24563K56416j92488q4569J05069o3294
$$ 40941 41953 61856 138695 50971 68711 193274 449690 257202 172633 277702 214408
10325B14408n5171J40583J19276L1078O7928R892p0870q702j44225J2624M574
$$ 214408 159237 299820 419096 450174 518102 527994 457124 448422 304197 316821 321395
10314C21395Q2580j59441j28455L8663j25292J14354N3374q2785l0110M6816J39734
$$ 321395 403975 244534 116079 154742 29450 143804 197178 114393 84283 131099 270833
10303B70833L7285l0111m2661O049J11742l7800j40782j21169K124J5705N0575
$$ 270833 308118 278007 235346 241395 353137 315337 174555 53386 55510 71215 121790
10292A21790R8050R2610k4770j600P2486j6680l3954m7732L5788j11282j6086
$$ 121790 219840 312450 287680 286080 358566 341886 307932 260200 295988 184706 168620
10281A68620L1387J9724K371M0005J73618n5290j01052J3278q6566j11162K0425
$$ 168620 200007 219731 222102 262107 435725 380435 279383 292661 206095 94933 115358
10270A15358L3409N4003Q0427J00017q9922o5912j38011O8639Q9482J42100j7495
$$ 115358 148767 202770 283197 383214 293292 227380 89369 158008 247490 389590 372095
10259C72095K9207j37838j25647l4404K6871N4493K08894J7224j37335j10360
$$ 372095 401302 263464 137817 103413 130284 184777 393671 410895 273560 163200
10249A63200N7493M4830q0318J4901K9980Q0858j4844j20392n3413J65008J81725
$$ 163200 220693 265523 185205 200106 230086 310944 296100 175708 122295 287303 469028
10238D69028m6038k26574k60345l8983m685J8962J34775J46150k6988l4029k9500
$$ 469028 422990 196416 -63929 -102912 -107597 -88635 46140 192290 165302 131273 101773
10227A01773L6445k5115r2530m6708L1237J47758K9252p1740n5337J7661J23987
$$ 101773 138218 113103 20573 -26135 5102 152860 182112 110372 55035 72696 196683
10216A96683J35553J14753r2295j73329q9630J24686L9241j31440N3122m1898
$$ 196683 332236 446989 354694 181365 91735 216421 255662 124222 177344 135446
10206A35446J09863j43020J38112J94059M1644r8277j95485j97507J84653J10762
$$ 135446 245309 102289 240401 434460 476104 377827 182342 -15165 169488 280250
10196B80250J35895P9353j20646j35710n6455r3755j78269L3052L548N3915j830
$$ 280250 416145 495498 374852 239142 182687 88932 -89337 -56285 -52737 1178 -652
10185f52J6865J76182k243k62163Q4948J29893K8830J58738P6920k91514p9693
$$ -652 16213 192395 190152 -72011 12937 142830 171660 330398 407318 115804 36111
10174C6111n3872J30370L6459J08200J1707j16196K9949m6203o921J29264j07353
$$ 36111 -17761 112609 149068 257268 268975 152779 182728 136525 129604 258868 151515
10163A51515l6333n1363r2958j36516J1594J19364K59260O2416j26559K3030o5678
$$ 151515 115182 63819 -29139 -165655 -154061 -34697 224563 286979 160420 183450 117772
10152A17772J12011j10577k02883K02055J22278K198M8529r0328q899m6936k53069
$$ 117772 229783 119206 -83677 118378 240656 242854 291383 201055 192156 145220 -107849
10141a07849j87751K53108L62504O8994j07111K7492j9561P569K3839P5820l2299
$$ -107849 -295600 -42492 320012 389006 281895 309387 289826 297395 321234 397054 364755
10130C64755q7255k02748m4953O8296Q3144j58621p0003M4316J36395M7260K2125
$$ 364755 277500 74752 29799 98095 181239 22618 -47385 -3069 133326 180586 202711
10119B02711J5411M1295n8573j9825j45026n6987J08778M0509M009j02881j86616
$$ 202711 218122 259417 200844 181019 35993 -20994 87784 128293 132302 29421 -157195
10108a57195O9687J70449o6657j50069J4699R2695O3736J37153M742j06663J14729
$$ -157195 -87508 82941 16284 -133785 -119086 -26391 37345 174498 179240 72577 187306
10097A87306Q5554L8993p168o6277J438j27950j38373j8540l9754K24970P1730
$$ 187306 272860 311853 304685 238408 239846 111896 -26477 -45017 -84771 140199 211929
10086B11929n4136o1890O410J08795k9718k21654j02842j2291J35491J47611O2575
$$ 211929 157793 95903 102313 211108 181390 -40264 -143106 -155397 -19906 127705 190280
10075A90280N0084j26288R2256R3695K9338j92191R878p4004J36140N9563k13467
$$ 190280 240364 114076 206332 300027 329365 137174 147052 73048 209188 268751 55284
10064E5284L8545k610p3266k1447m2872J36330N7638L9705O3742k21005q294K99206
$$ 55284 93829 91219 17953 -3494 -46366 89964 147602 187307 251049 30044 21750 320956
10052C20956r1353j89041k02191j01396N1347J1245J11071K32604p891j3315m216
$$ 320956 229603 40562 -161629 -263025 -211678 -200433 -89362 143242 135351 122036 117820
10041A17820J05184o1069J1027k4547o630K6154O5308R9206j71051r0066N8189
$$ 117820 223004 161935 172962 148415 141785 167939 233247 332453 161402 71336 129525
10030A29525J19124j60905j54890J63261L134n7995N3726M4487k8852L4805O0362
$$ 129525 248649 87744 -67146 96115 99249 41254 94980 139467 110615 145420 205782
10019B05782J09959M0515j75553N5817O6742o1510k31511j73377J1852j0169O3472
$$ 205782 315741 356256 180703 236520 303262 241752 10241 -163136 -151284 -161453 -97981
10008i7981J32345N0824n5345p5018k6206P2328Q4206L3783J43844L1771j8310
$$ -97981 34364 85188 29843 -45175 -71381 947 85153 118936 262780 294551 276241
9997B76241n2912J22704J40354j00438j90474M7951m3801j17890J25507l6958
$$ 276241 223329 346033 486387 385949 195475 243426 199625 81735 207242 170284
9987A70284N6026J7680r4935j49313N0968P6966O6261m6288K20759r2888j99603
$$ 170284 226310 243990 149055 -258 50710 127676 193937 147649 368408 275520 75917
9976G5917k21253l7733K85696l7666R0366j6473p6096Q3357j65923n7546K05723
$$ 75917 -145336 -183069 102627 64961 155327 138854 62758 146115 -19808 -77354 128369
9965A28369R0999L8900l9211J8658o2234k4650r7341j64984P2392m5170L8996
$$ 128369 219368 258268 219057 237715 175481 150831 53490 -111494 -39102 -84272 -45276
9954d5276O4530J03903N7974r3011N7046k14626j36082J16397J01381R4541Q5329
$$ -45276 19254 123157 181131 88120 145166 -69460 -205542 -89145 12236 106777 192106
9943A92106R6642R1589R1967j10770j61258N0153M6471j05335l6408k9087m9699
$$ 192106 288748 380337 472304 361534 200276 250429 296900 191565 155157 126070 76371
9932G6371o5838j49556L3666J2102K66395J59195r0011J24226J005l3778r1768
$$ 76371 10533 -139023 -105357 -93255 173140 332335 242324 366550 367555 333777 242009
9921B42009o3248r6039l3695L1631j90864k8019L7116l6968K0938l1747p524m0882
$$ 242009 178761 82722 49027 80658 -110206 -138225 -101109 -138077 -117139 -148886 -156410 -197292
9909a97292O3597o9535Q9918J33324J6212K5694J47070P2893m4582j72816m7672
$$ -197292 -133695 -203230 -113312 20012 36224 61918 208988 281881 237299 64483 16811
9898A6811j67178p2015M9106J09269J48200M7444p0959K01480M7387j02713n3723
$$ 16811 -150367 -222382 -173276 -64007 84193 131637 60678 262158 309545 206832 153109
9887A53109K762m9628j00105L484J03880Q6338J08910k6647j10247j07049M834
$$ 153109 155871 106243 6138 9622 113502 199840 308750 282103 171856 64807 69641
9876F9641j42139j42849P5446K28530N7322r6205m5943L5252r4376K8419J19254
$$ 69641 -72498 -215347 -139901 88629 145951 49746 3803 39055 -55321 -26902 92352
9865I2352l5456j777o8362J12529J07409K03165J9141q9664M3393k403q7152j5573
$$ 92352 56896 55119 -13243 99286 206695 409860 429001 339337 382730 380327 293175 277602
9853B77602k8255r2071j08755o9778J00505Q3565p007j41768Q627o8721j31302
$$ 277602 249347 157276 48521 -21257 79248 162813 155806 14038 22665 -46056 -177358
9842a77358m3563j6007J68692J01611O6431j1465j37785j12707J38613M1201Q8846
$$ -177358 -220921 -236928 -68236 33375 99806 88341 -49444 -162151 -23538 17663 106509
9831A06509J42417P7573j2925j13889j00459p5382J01858K09824K6441j28900
$$ 106509 248926 326499 313574 199685 99226 23844 125702 335526 361967 233067
9821B33067j28214R32J05592j29243k79946j70951O1978J2621P7211J57491Q9033
$$ 233067 104853 105785 211377 82134 -197812 -368763 -306785 -294164 -216953 -59462 29571
9810B9571L6307n1351l3835J50453L6091n5065q4311N010J1621J24972K9795k13201
$$ 29571 65878 14527 -19308 131145 167236 112171 27860 32870 44491 169463 199258 -13943
9798a3943j06174N8628p3561j04608J18764K28837J76443P5216J31314j696j21846
$$ -13943 -120117 -61489 -135050 -239658 -120894 107943 284386 359602 490916 489220 367374
9787C67374o6841m3484j40873m9352m2262k0050J96539K25984K5339r7426K6803
$$ 367374 300533 257049 116176 66824 24562 4512 201051 427035 452374 354948 381751
9776C81751p3583j23266j95044j1255L3494N2726M8770P8570J10968o0231k23587
$$ 381751 308168 184902 -10142 -21397 12097 64823 113593 192163 303131 242900 19313
9765A9313j38694L880L0306M4966j35977M1417J96660L1960l16218k85117J10303
$$ 19313 -119381 -115501 -85195 -40229 -176206 -134789 61871 93831 -222387 -507504 -397201
9754c97201K25756J22161N8167j9548M2482n4256p4534j14023L8831p990J93754
$$ -397201 -171445 -49284 8883 -10665 31817 -22439 -96973 -210996 -172165 -180155 13599
9743A3599K49164M99l5586K3684k267l9201m1033N3285O589O8678J0812k09558
$$ 13599 262763 263262 227676 251360 249093 209892 168859 222144 228733 297411 308223 98665
9731I8665j71763k893P13M3394J57519j81385l3514R2096J02416J00167l724j87509
$$ 98665 -73098 -75991 -75278 -31884 125635 -55750 -89264 2832 105248 205415 201691 14182
9719A4182L6355J27540q0916j1109l728k0758k2593o6400j26818k304R1048R9208
$$ 14182 50537 178077 97161 86052 82324 61566 38973 -27427 -154245 -156549 -65501 33707
9707C3707J27276n859J65324k0680q3805M1865L0651j57227k7141J49233p1283
$$ 33707 160983 155124 320448 299768 215963 257828 288479 131252 104111 253344 182061
9696A82061q0084K1765j8403j72908n5847J23646P2620j1286r4378j1504Q01Q0386
$$ 182061 101977 123742 105339 -67569 -123416 230 72850 61564 -32814 -44318 -43517 36869
9684C6869j02n0869J49316N046j31880j99500j50802J10438J79328P0898k4356
$$ 36869 36767 -14102 135214 140260 8380 -191120 -341922 -231484 -52156 18742 -5614
9673e614L0109m9419j07829j85345l4900M8226J06078O0338K4351o8626r1784
$$ -5614 24495 -24924 -132753 -318098 -352998 -304772 -198694 -138356 -114005 -182631 -274415
9662b74415J29136K88288O8289n937P6618J32688p5785p171j87896R657j43014
$$ -274415 -145279 143009 211298 205361 281979 414667 338882 331711 143815 153472 10458
9651A0458N7180q8129k8618M4364M9071p2030j05954j19950K4088M3986J4778
$$ 10458 67638 -20491 -49109 -4745 44326 -27704 -133658 -253608 -229520 -185534 -170756
9640a70756K88801R5792n0070P5191q9966K7256J8691k2533Q8563n1523j02658
$$ -170756 118045 213837 163767 238958 148992 176248 194939 172406 260969 209446 106788
9629A06788J12104j37508p0355k1278p4132R1790J8177q2178J27698J88328J0268
$$ 106788 218892 81384 11029 -10249 -84381 7409 25586 -56592 71106 259434 269702
9618B69702j4285p9648j30615Q6715Q4763o0761k90609o2669Q200J16114J13426
$$ 269702 255417 175769 45154 131869 216632 155871 -134738 -197407 -189207 -73093 40333
9607D0333J1001l5452k5489q4894m3088J19209P4655k8723l6737k31820j42820
$$ 40333 51334 15882 -9607 -94501 -137589 -18380 56275 27552 -9185 -241005 -383825
9596c83825n771L0890J76600M3298R2034L6105j6533j59461k9078O1195K6767
$$ -383825 -389596 -358706 -182106 -138808 -46774 -10669 -27202 -186663 -215741 -154546 -127779
9585a27779K0705m31J68112R3697m88m2584P379m4431j17185j5171N6389m7751
$$ -127779 -107074 -107505 60607 154304 153816 111232 118611 74180 -43005 -58176 -1787 -49538
9573d9538N4320N6893J8139n696P9454k1090j85425L0215O1794L6102M5088p0416
$$ -49538 4782 61675 79814 74118 153572 132482 -52943 -22728 39066 75168 120256 49840
9561D9840q1766j08091j38110J08761J62268N7791k83857m4459J30926p1112j68934
$$ 49840 -31926 -140017 -278127 -169366 -7098 50693 -233164 -277623 -146697 -217809 -386743
9550c86743K3172M5760K36829j0561J71440K7769O6169o0260Q9402N4135K2507
$$ -386743 -363571 -317811 -80982 -91543 79897 107666 173835 113575 202977 257112 279619
9539B79619n6827l36905l4535K6931r1177k6752J08269p652J21754R5247k9282
$$ 279619 222792 -114113 -148648 -121717 -212894 -239646 -131377 -139029 -17275 77972 48690
9528D8690J7837J76517N3316j08871j54894l8434p7946n3476r4505j03113m4988
$$ 48690 66527 243044 296360 187489 32595 -5839 -83785 -137261 -231766 -334879 -379867
9517c79867R6785R9894o9021Q0423J93838j9763j04261k1217j4297q115K39865
$$ -379867 -283082 -183188 -252209 -171786 22052 2289 -101972 -123189 -137486 -145601 94264
9506I4264J85770j07938j50868j4429j06667j3763j8485N8821M8772O42J07954
$$ 94264 280034 172096 21228 6799 -99868 -113631 -132116 -73295 -24523 -23881 84073
9495H4073j30109j57099j23799M3838J13128m1983j53991J41843K30983P7907
$$ 84073 -46036 -203135 -326934 -283096 -169968 -211951 -365942 -224099 6884 84791
9485H4791n4137j12026Q2258J39658N5365j0804k3776P605j66607J11367K22201
$$ 84791 30654 -81372 886 140544 195909 185105 161329 168934 2327 113694 335895
9474C35895k04793K1937J4699J0619l297j15810M7921j4643Q4756j37316j9960
$$ 335895 131102 153039 167738 178357 175060 59250 107171 92528 177284 39968 20008
9463B0008P4923O1765M8511M2156K8698O9555P3717L9668l9352l9362j06844j20698
$$ 20008 94931 156696 205207 247363 276061 345616 419333 459001 419649 380287 273443 152745
9451A52745j3782J03381k9809j01205l1973k1967j57557k4295M2177J30695l5572
$$ 152745 138963 242344 212535 111330 79357 57390 -100167 -124462 -82285 48410 12838
9440A2838l8511J29084m7153l2748q7578k413J45912P5010m4352J4717O2945j01008
$$ 12838 -25673 103411 56258 23510 -64068 -66481 79431 154441 110089 124806 187751 86743
9428H6743o942K2321J39018Q199j12824K3420Q5218K2510o3857q8249k0048q0917
$$ 86743 79801 102122 241140 249339 136515 159935 245153 267663 203806 115557 95509 14592
9416A4592J78395J13553j76081j45248O5977O2704j59698l0099R2451m3136O6153
$$ 14592 192987 306540 130459 -14789 51188 113892 -45806 -75905 16546 -26590 39563
9405C9563J12718N3502J1619n0598j68425o8579J5906J43126r74j45258O5377
$$ 39563 152281 205783 217402 166804 -1621 -70200 -54294 88832 87858 -57400 7977
9394G977P7558P3213J06032L5046q5260Q608q1650n1024j19065o0719r8267l8036
$$ 7977 85535 158748 264780 299826 214566 223174 141524 90500 -28565 -89284 -187551 -225587
9382b25587M3138J08550J22113J76395o2348m5153k4938l9392o6069M460K6581
$$ -225587 -182449 -73899 48214 224609 162261 117108 92170 52778 -13291 -8831 17750
9371A7750R0517n6785p8492k2756N9655M3031K7735M7089k49502k11302j75913
$$ 17750 108267 51482 -27010 -49766 9889 52920 80655 127744 -121758 -333060 -508973
9360e08973R2231K94471J00363J46815j76031j86020M7541N5934J71305K8554
$$ -508973 -416742 -122271 -21908 124907 -51124 -237144 -189603 -133669 37636 66190
9350F6190P2890j02982p9809R1774R0233j3176n3172k6210n5741J63532J25198
$$ 66190 139080 36098 -43711 48063 138296 125120 71948 45738 -10003 153529 278727
9339B78727j6937j49528Q3249l8840j37773k8891N9861p647J6826Q3664q45J38130
$$ 278727 261790 112262 195511 156671 18898 -9993 49868 42221 59047 142711 141866 279996
9327B79996m5568k50776P1682J35602r2400l74766R068J18511J6856L2559J00277
$$ 279996 234428 -16348 55334 190936 98536 -276230 -267162 -148651 -131795 -99236 1041
9316A041L8620J14196L169j09388j7580o5749r0503P7073n3747J78337N3837j4368
$$ 1041 39661 153857 157026 47638 30058 -35691 -126194 -49121 -102868 75469 129306 114938
9304A14938L3352P01L3275J16322J41039r8041j19945N7597l3177k8581j81208
$$ 114938 148290 148991 182266 298588 439627 341586 221641 279238 246061 217480 36272
9293C6272n3773j19067p6392L3319J41136J8240J05739L6577p1650p3213L3550
$$ 36272 -17501 -136568 -212960 -179641 -38505 -20265 85474 122051 50401 -22812 10738
9282A0738o172N4479J36861j61291O2246N8767R8691j70913m0079P8889r2028
$$ 10738 4566 59045 195906 34615 96861 155628 254319 83406 43327 122216 30188
9271C0188J08834o0050n0933R259n5495m8069j6661P6418K8330o5489r8181l9021
$$ 30188 139022 78972 28039 37298 -18197 -66266 -82927 -6509 21821 -43668 -141849 -180870
9259a80870n49J62639J74513j69556r7957r8437N7335P9834K7250J61808R5095
$$ -180870 -181419 -18780 155733 -13823 -111780 -210217 -152882 -73048 -45798 116010 211105
9248B11105l221m8098k1342m5588K243n437O0391J30532o0120n1921j59973j942
$$ 211105 207884 159786 138444 92856 95099 89662 150053 280585 220465 168544 8571 6629
9236F629J44721M5675Q7879j18082j42381R5418N4894P5170J34321J30388p2515
$$ 6629 151350 197025 284904 166822 24441 119859 174753 249923 384244 514632 442117
9225D42117p8432M0107J31454Q3765p9961n7725j01915L9511j9069J21395O037
$$ 442117 363685 403792 535246 619011 539050 481325 379410 418921 399852 521247 527284
9214E27284j06223q2872o6898n6156J20131n5226j10321j59388J4619P7296K59890
$$ 527284 421061 338189 271291 215135 335266 280040 169719 10331 24950 102246 362136
9203C62136J06465l6200o5231J25474l9598k1347N5982P5460l7653k24273N5264
$$ 362136 468601 432401 367170 492644 453046 431699 487681 563141 525488 301215 356479
9192C56479J12995O1797M7995j2369K7387j12896J28081r2859k44921j70704r5964
$$ 356479 469474 531271 579266 566897 594284 481388 609469 516610 271689 100985 5021
9181E021J38545J81948J16277q9386J35260N3930m8780m9619m1007Q3828K8624
$$ 5021 143566 325514 441791 352405 487665 541595 492815 443196 402189 486017 514641
9170E14641M7615M4182J9315k2747K4514l4421k04776M6202K3426K3700R5116
$$ 514641 562256 606438 625753 603006 627520 593099 388323 434525 457951 481651 576767
9159E76767K6290j30752P2308Q3050J08757Q799R2471j21970j23081k6548J57658
$$ 576767 603057 472305 544613 627663 736420 745219 837690 715720 592639 566091 723749
9148G23749J10514l5973j1698m6128J94065P4369j99684r2905J49803J50929O5458
$$ 723749 834263 798290 786592 740464 934529 1008898 809214 716309 866112 1017041 1082499
9137A082499o0091K8590j6821n3014J35168J15841P9774j41604k14043N9809J67551
$$ 1082499 1022408 1050998 1034177 981163 1116331 1232172 1311946 1170342 956299 1016108 1183659
9126A183659Q3862J17999J18657M7545O2150K59199J54088j67195j78376O4305
$$ 1183659 1267521 1385520 1504177 1551722 1613872 1873071 2027159 1859964 1681588 1745893
9116A745893J36760N3846L48062K39969J49105J55976L26927O6838j9314J47414
$$ 1745893 1882653 1936499 2284561 2524530 2673635 2829611 3156538 3223376 3204062 3351476
9106C351476K31962J15805L03798L20587K46117J99930J37531M26854N83296L09996
$$ 3351476 3583438 3699243 4003041 4323628 4569745 4769675 4907206 5334060 5917356 6227352
9096F227352L94503N77191N57669N18531N76979O62753O80439Q42714R11890R06357
$$ 6227352 6621855 7199046 7756715 8275246 8852225 9514978 10195417 11038131 11950021 12856378
9086A2856378Q99420R23306J017022R08895R66606P88480P83689P69859L67795
$$ 12856378 13755798 14679104 15696126 16605021 17571627 18360107 19143796 19913655 20281450
9077B0281450J48031J7102j12457n09877o25834o85507o28930p35364q32667q72728
$$ 20281450 20429481 20446583 20334126 19824249 19198415 18512908 17883978 17148614 16315947 15443219
9067A5443219r81113q08189q05540r58143q23239p76052q15831n48432m99598
$$ 15443219 14462106 13653917 12848377 11890234 11066995 10290943 9475112 8926680 8427082
9058H427082m36679m83630n11190n08223l98194l80058n15195l47503j96980k2512
$$ 8427082 7990403 7506773 6995583 6487360 6089166 5709108 5193913 4846410 4649430 4626918
9048D626918k50439l48779j10675j47476j61451j30442m3236j92466k34405k00579
$$ 4626918 4376479 4027700 3917025 3769549 3608098 3477656 3434420 3241954 3007549 2806970
9038B806970q0077J16536L6516k38732k94546j95230j30457j63032J78431o3740
$$ 2806970 2726893 2843429 2879945 2641213 2346667 2151437 2020980 1857948 2036379 1972639
9028A972639j86894j49421j99407J5966p5908m0758j47969j17879j40309j07837
$$ 1972639 1785745 1636324 1436917 1452883 1376975 1336217 1188248 1070369 930060 822223
9018H22223L4298J72059L1148k3200K8483Q1055n4478j0011o4847K8410M0486
$$ 822223 856521 1028580 1059728 1036528 1065011 1146066 1091588 1081577 1016730 1045140 1085626
9007A085626o4638j29404r8080m0517j23347m4239m9719R2313R3463P1326k13205
$$ 1085626 1020988 891584 793504 752987 629640 585401 535682 627995 721458 792784 579579
8996E79579j99080J22032J70388p2806l7318j7412J96293j85901j79389K6187
$$ 579579 380499 502531 672919 600113 562795 545383 741676 555775 376386 402573
8986D02573J74710J12701o5074q3799j02022j28227j30574j49923J4178K11354
$$ 402573 577283 689984 624910 541111 439089 310862 180288 30365 44543 255897
8976B55897K52279O8142o9467k2997J631r6289n3482J19736M4099j4863p5823
$$ 255897 508176 576318 506851 483854 485485 389196 335714 455450 499549 484686 408863
8965D08863j46028j14771K434R8644J38880J12445j25298r0624l1234J53988K3716
$$ 408863 262835 148064 150498 249142 388022 500467 375169 284545 253311 407299 431015
8954D31015l4915m2544k5983r4847M744M5220J81104j32910j58640K33037K8600
$$ 431015 396100 353556 327573 232726 237470 282690 463794 330884 172244 405281 433881
8943D33881j84726K1917r6000j64944K82505j02665q5062O7165R543j07181l4732
$$ 433881 249155 271072 175072 10128 292633 189968 104906 172071 181614 74433 39701
8932C9701K6682L6883K6521Q2398k7002J6211k0629n2755j7354O1581j17703p8640
$$ 39701 66383 103266 129787 212185 185183 201394 180765 128010 110656 172237 54534 -24106
8920b4106Q7369Q1232L7747j7595j12563N849L7228l007q3397R7485J65599M7938
$$ -24106 63263 144495 182242 164647 52084 57933 95161 92154 8757 106242 271841 319779
8908C19779j30360j50109r3141P7644J22339J19863o4930Q6494l9317p3879l8990
$$ 319779 189419 39310 -53831 23813 146152 266015 201085 287579 248262 174383 135393
8897A35393L7759J4281L1826p2614m4454M6686O1157K6855j31147j43606J62959
$$ 135393 173152 187433 219259 146645 102191 148877 210034 236889 105742 -37864 125095
8886A25095J81412J8742j62503j7072J79995l0391j14581j20493L5809N8222N0982
$$ 125095 306507 325249 162746 145674 325669 295278 180697 60204 96013 154235 205217
8875B05217o0342j68035Q2152R44O1908q5425O9144J87511M8589o4317p8990l8485
$$ 205217 144875 -23160 58992 59936 121844 36419 105563 293074 341663 277346 198356 159871
8863A59871l3924m3564L5084M9712K9324k36339P7807K0219k45360K6807J79541
$$ 159871 125947 82383 117467 167179 196503 -39836 37971 58190 -187170 -160363 19178
8852A9178K58105k8972j32414J11720J53315P777j28117k43955J1240k1112l0580
$$ 19178 277283 248311 115897 227617 380932 388709 260592 16637 27877 6765 -23815
8841b3815J07603j4637p995J30177R8057n8459o5711P2474j23323J5838J2925
$$ -23815 83788 69151 61156 191333 289390 230931 165220 237694 114371 130209 143134
8830A43134j81272j76456R0064K77323K4007r5569j32885j04526L4149J22705
$$ 143134 -38138 -214594 -124530 152793 176800 81231 -51654 -156180 -122031 674
8820F74J08225j19482j0408o3088j32966r196J00339J23261R1567L8809P3931
$$ 674 108899 -10583 -20991 -84079 -217045 -226241 -125902 -2641 88926 127735 201666
8809B01666j72480k3213M0333m581P0197o4956m8179o4502O3521R9176n8107p1087
$$ 201666 29186 5973 46306 41725 111922 46966 -1213 -65715 -2194 96982 38875 -32212
8797c2212L8897O3869N8419j9127J0161l802j78953j57294M0126J09528k1209
$$ -32212 6685 70554 128973 109846 120007 116205 -62748 -220042 -179916 -70388 -91597
8786i1597o5690J87980K23117K6566o34k35883o9737J48004k191j01490J04040
$$ -91597 -157287 30693 253810 280376 279742 43859 -25878 122126 119935 18445 122485
8775A22485J36722p5249K6021q5705j07493j06290l4242N2770m4077o483j91397
$$ 122485 259207 183958 209979 124274 16781 -89509 -123751 -70981 -115058 -121541 -312938
8764c12938J40046K69937L500O938N7711r2494K9944J27499L0787R7257k54496
$$ -312938 -172892 97045 100545 107483 165194 72700 102644 230143 260930 358187 103691
8753A03691j23074R2906O8970n7879j70387O0419K02888j01178k08523j6274J99422
$$ 103691 -19383 73523 142493 84614 -85773 -25354 177534 76356 -132167 -148441 50981
8742E0981q3581n2612M1630M6728J43987O0339J22531Q1157R1814J1824k78036
$$ 50981 -32600 -85212 -43582 3146 147133 207472 330003 411160 502974 514798 236762
8731B36762q6406k28412m1282K07677J41973k9961k08769j13724N4626j47952
$$ 236762 150356 -78056 -119338 88339 230312 200351 -8418 -122142 -67516 -215468
8721b15468j35859K2372J51570l3012M8557J15231M8811m4787r8653j8797N5395
$$ -215468 -351327 -328955 -177385 -210397 -161840 -46609 2202 -42585 -141238 -160035 -104640
8710a04640q5540n557J52794L1521o1515P903P673k6924o697J28626K53595J25501
$$ -104640 -190180 -195737 -42943 -11422 -72937 -65034 -57361 -84285 -90982 37644 291239 416740
8698D16740j01034l48504M95p8567M3951J48314K0391r8587M6087k0415j67959
$$ 416740 315706 -32798 -32303 -110870 -66919 81395 101786 3199 49286 28871 -139088
8687a39088q7187L4027O5105m6500K44219J44636J38631J64421j96570k39513
$$ -139088 -226275 -192248 -127143 -173643 70576 215212 353843 518264 321694 82181
8677H2181r2344J4246N5485j4957R214j2738p0208k9122m6466J71762Q2318R548
$$ 82181 -10163 4083 59568 44611 53825 41087 -29121 -58243 -104709 67053 149371 158919
8665A58919j61408r9733J13747m094k9681r6435j29346J19787J85261J23593J6411
$$ 158919 -2489 -102222 11525 7431 -22250 -118685 -248031 -128244 57017 180610 197021
8654A97021K0863q1034j8647L0787j28571n8961J04510m2456J16103K51499j80367
$$ 197021 217884 136850 118203 148990 20419 -38542 65968 23512 139615 391114 210747
8643B10747j57267R1491k3961L8585J96158J03574j53564p6569R8476J50218n1477
$$ 210747 53480 144971 121010 159595 355753 459327 305763 229194 327670 477888 426411
8632D26411L2886k0123j3757j35279M4495J11469m2044o6490m0648J13283M4507
$$ 426411 459297 439174 425417 290138 334633 446102 404058 337568 296920 410203 454710
8621D54710r2978m9220r5031j0036R8578p8578K5130J81443j4332j14023P1576
$$ 454710 361732 312512 217481 207445 306023 227445 252575 434018 419686 305663 377239
8610C77239J56590K14220Q2363M4396j12288N9876K32072j1835R1109K40110J46968
$$ 377239 533829 748049 830412 874808 762520 822396 1054468 1042633 1133742 1373852 1520820
8599A520820J36305j11609j20886j92649l31723k70386j96805k6826P1489j52868
$$ 1520820 1657125 1545516 1424630 1231981 900258 629872 433067 406241 477730 324862
8589C24862k18927M7509m2585j7545Q406j71323j14920Q5167o93O3788R8152N8525
$$ 324862 105935 153444 110859 93314 101720 -69603 -184523 -99356 -100049 -36261 61891 120416
8577A20416K38772L2399k08723q0178l7273N9825q7611j2936J9874k8173L9187
$$ 120416 359188 391587 182864 102686 65413 125238 37627 24691 44565 16392 55579
8566E5579R1498r8335j04109P581j01504n5301J7777J13043j00030o7948K6544
$$ 55579 147077 48742 -55367 -47786 -149290 -204591 -186814 -73771 -173801 -241749 -215205
8555b15205K0976k9495k6440J13348L2852p4922k21527o6823J85375Q7680J04641
$$ -215205 -194229 -223724 -250164 -136816 -103964 -178886 -400413 -467236 -281861 -194181 -89540
8544h9540Q5064n725j03467j00903N4121K8298j27355J34167K24810J07241k06438
$$ -89540 -4476 -10201 -113668 -214571 -160450 -132152 -259507 -125340 99470 206711 273
8533B73j42066K3922J77629K18050N6906j36835l5515J16032P0309p3823K4508
$$ 273 -141793 -117871 59758 277808 334714 197879 162364 278396 348705 274882 299390
8522B99390j88617j42484J812J02567J5351N7209j48874p0566L0352R4891L1312
$$ 299390 110773 -31711 -29899 72668 88019 145228 -3646 -74212 -43860 51031 82343
8511H2343q2683j0318J48770J16464j9758j56426j37068p8582q6544O4744K80458
$$ 82343 -340 -10658 138112 254576 234818 78392 -58676 -137258 -223802 -159058 121400
8500A21400K05911r9355m1480m1505o6939k22230J01184J23121k9962J6093p4898
$$ 121400 327311 227956 186476 144971 78032 -144198 -43014 80107 50145 66238 -8660
8489h660j22523j9453l7807j7206q0275J51388J12883j29264K2609N7058m0742
$$ -8660 -131183 -150636 -188443 -205649 -285924 -134536 -21653 -150917 -128308 -71250 -111992
8478a11992K09281J19603l8980j85168J19344r079K304j43821J4547J25592J25501
$$ -111992 97289 216892 177912 -7256 112088 103009 105313 -38508 -23961 101631 227132
8467B27132O9277O6551j67305m0875p2173J12378J13380P1903n8290o1843j7255
$$ 227132 296409 362960 195655 154780 82607 194985 308365 380268 321978 260135 242880
8456B42880k0816N2367o0520m3029p6826j13848l7506J25062J15027j49553r7883
$$ 242880 222064 274431 213911 170882 94056 -19792 -57298 67764 182791 33238 -64645
8445f4645p3199N3441J05250n9110Q8451J25517m3803n7877j8702J5245P4866
$$ -64645 -137844 -84403 20847 -38263 50188 175705 131902 74025 55323 70568 145434
8434A45434p6882j88773j66764J31607J71140J2523J30522N2187j17096P345N0516
$$ 145434 68552 -120221 -286985 -155378 15762 28285 158807 210994 93898 101243 151759
8423A51759K5907Q2918q1749q7803j1827j24424j18215K621R1876N3979k0162
$$ 151759 177666 260584 178835 91032 79205 -45219 -163434 -160813 -68937 -14958 -35120
8412c5120j08577K00781K92555P9235Q539j00775q8828j69463j00096K7858j39908
$$ -35120 -143697 57084 349639 428874 437413 336638 247810 78347 -21749 6109 -133799
8401a33799J02738K2200o9187J1681o137j6918J04862l3080O9315n9179n7613
$$ -133799 -31061 -8861 -78048 -66367 -72504 -89422 15440 -17640 51675 -7504 -65117
8390f5117k4628Q1601j6687j9783O332r6123J16170M5373M8242r9815m4775j45499
$$ -65117 -89745 -8144 -24831 -44614 -38282 -134405 -18235 27138 75380 -24435 -69210 -214709
8378b14709l1970J17567j02635J06884K24413j48548k38774L9414J12412J18287
$$ -214709 -246679 -129112 -231747 -124863 99550 -48998 -287772 -248358 -135946 -17659
8368a7659l994J66006K11981n7336j65751o0053j05893m8513M6825q2216J35327
$$ -17659 -21653 144353 356334 298998 133247 73194 -32699 -81212 -34387 -116603 18724
8357A8724Q3294n1781L4688J7588j47745j51747k6694p3456J934J34959J19937
$$ 18724 102018 50237 84925 102513 -45232 -196979 -223673 -297129 -295195 -160236 -40299
8346d0299j56744j20466Q7828J054J00375K24230R1859k6634n6712J2716j36069
$$ -40299 -197043 -317509 -229681 -228627 -128252 95978 187837 161203 104491 117207 -18862
8335a8862n7126M5500L6412J4887l4535n5695K8053j51460n1022J22366J73162
$$ -18862 -75988 -30488 5924 20811 -13724 -69419 -41366 -192826 -243848 -121482 51680
8324E1680M7678o2506k6054K11795R1190L2920j85843j16085k1169L74M3388l7023
$$ 51680 99358 36852 10798 222593 313783 346703 160860 44775 23606 23980 67368 30345
8312C0345j10210n137K22157J8114r0030o5918K1761L7187K57161j4005q8174
$$ 30345 -79865 -85002 137155 155269 65239 -679 21082 58269 315430 301425 213251
8301B13251M5561L7000l6N8380M7655k77130p0888m9021M2543K4414J830P9367
$$ 213251 258812 295812 295776 354156 401811 124681 53793 4772 47315 71729 73559 152926
8289A52926K08708N1874j42392j950j9114p711K9957J54733l7269k42547K7103
$$ 152926 361634 413508 271116 269166 250052 242341 272298 427031 389762 147215 174318
8278A74318M6066m6224j64233J19985l948p3933j4937M0248l2406k9303m0800
$$ 174318 220384 174160 9927 129912 125964 52031 37094 77342 44936 15633 -25167
8267b5167O943R497p3802p5881J08444J13402m8932j28870j28784L3345P8017
$$ -25167 -18224 -8727 -82529 -158410 -49966 63436 14504 -114366 -243150 -209805 -131788
8256a31788J71076r133j28860m0282p6946O7745J90207n2552J7312l566J363m2695
$$ -131788 39288 30155 -98705 -138987 -215933 -148188 42019 -10533 6779 3213 4576 -38119
8244c8119o6990J41007J09958M8384j36106j97240J016o296K31517J14237l17503
$$ -38119 -105109 35898 145856 194240 58134 -139106 -138090 -144386 87131 201368 -116135
8233a16135j23677L2067J13166R0335k8822k387L1781J16905N2266m0248k20470
$$ -116135 -239812 -207745 -94579 -4244 -33066 -35453 -3672 113233 165499 125251 -95219
8222i5219l1116k5246K7892N1898J5644j4905j63102o718J47953O1711K00300
$$ -95219 -126335 -151581 -123689 -71791 -56147 -71052 -234154 -240872 -92919 -31208 169092
8211A69092o1314j74927J06513P473j98141K823L0230K9268J78022J36031n9432
$$ 169092 107778 -67149 39364 46837 -151304 -148481 -118251 -88983 89039 225070 165638
8200A65638P9195j07681j46184o3465J12031J79084J33518N2163j57895j39648
$$ 165638 244833 137152 -9032 -72497 39534 218618 352136 404299 246404 106756
8190A06756P892j13535p0820l9828K17188J47960j06713l2002r3849r356Q490
$$ 106756 114648 1113 -69707 -109535 107653 255613 148900 116898 23049 13693 22183
8179B2183O7215n6551K4350j19651j27005L783N9173o2422J4981j13422r0560
$$ 22183 89398 32847 57197 -62454 -189459 -185676 -126503 -188925 -173944 -287366 -377926
8168c77926J1525L02878K00669L2796L0616j00788l8454K0716o6115L9180j9753
$$ -377926 -366401 -63523 137146 169942 200558 99770 61316 82032 15917 55097 35344
8157C5344J10035N5703p2073Q251l8743j95497j13184O5453J87907J17364l3805
$$ 35344 145379 201082 129009 137260 98517 -96980 -210164 -144711 43196 160560 126755
8146A26755k0961J3907M7124l6050k19675R2207j0182o7606l5447k0971j2957
$$ 126755 105794 119701 166825 130775 -88900 3307 -6875 -74481 -109928 -130899 -143856
8135a43856j19182n9836M2317J67527Q4543l2568K6975n0556o8036m6851R5863
$$ -143856 -263038 -322874 -280557 -113030 -28487 -61055 -34080 -84636 -152672 -199523 -103660
8124a03660k0278J36525J56061n4830R854j39439n9406N5936K33425K8955j72021
$$ -103660 -123938 12587 168648 113818 123672 -15767 -75173 -19237 214188 243143 71122
8113G1122m6446j40492j40278K37229J70213o5507J5179J56484K1274j99463k30446
$$ 71122 24676 -115816 -256094 -18865 151348 85841 101020 257504 278778 79315 -151131
8102a51131J57264J02794k10837j29401R4807L7292J1570N0030K80005K6370p6389
$$ -151131 6133 108927 -101910 -231311 -136504 -99212 -87642 -37612 242393 268763 192374
8091A92374p1778J37421j00509r6081Q3369j07279q1619j10122M5818O3771J29170
$$ 192374 120596 258017 157508 61427 144796 37517 -44102 -154224 -108406 -44635 84535
8080H4535N3299j73467r7325N5431O8507n8638q3602Q6462n6847j1895L007k1478
$$ 84535 137834 -35633 -132958 -77527 -9020 -67658 -151260 -64798 -121645 -133540 -130533 -152011
8068a52011j2176m7801j5883o0372K79348K86147L2321M9194n1488j51370m9425
$$ -152011 -164187 -211988 -227871 -288243 -8895 277252 309573 358767 307279 155909 106484
8057A06484K1369N1054j65682l13361J5755K23493J91836J22735J3074N1860q2458
$$ 106484 127853 178907 13225 -300136 -284381 -60888 130948 253683 266757 318617 236159
8046B36159j01524L3968M596L6437N564q1082l5954R5619K9609O7341l9500j3514
$$ 236159 134635 168603 173199 209636 215200 134118 98164 193783 223392 290733 251233 237719
8034B37719q9518j14210j79237K5607J0542r8266j33430J790J61900J00757K67
$$ 237719 148201 33991 -145246 -119639 -109097 -207363 -340793 -339003 -177103 -76346 -76079
8023g6079N2589p4917J56767K6330J41277J23093j83752K9680L04837J33938Q7172
$$ -76079 -23490 -98407 58360 84690 225967 349060 165308 194988 499825 633763 720935
8012G20935o0118J1318p8104j73079l0292K457P2624J72128j0094q6558q8018
$$ 720935 660817 672135 594031 420952 390660 393117 465741 637869 627775 541217 453199
8001D53199k6011R3816j30622j20011l07126N79J84663M8260O0098L5435k4499
$$ 453199 427188 521004 390382 270371 -36755 -36176 148487 196747 256845 292280 267781
7990B67781o5570j24282L3629K7355O3933o8254J6508j34303l4213k4159J04879
$$ 267781 202211 77929 111558 138913 202846 134592 151100 16797 -17416 -41575 63304
7979F3304o6511o8975m6300R3781J13099J21436J16031l0361j85368P0288J38640
$$ 63304 -3207 -72182 -118482 -24701 88398 209834 325865 295504 110136 180424 319064
7968C19064l6080r7823j68952n0231J22913J1999j09180N1896L4043P54q1259
$$ 319064 282984 185161 16209 -34022 88891 100890 -8290 43606 77649 78403 -2856
7957b856l7104j06713J37014P0343L9910J6166J23153R7695j36363k80391j19332
$$ -2856 -39960 -146673 -9659 60684 100594 116760 239913 337608 201245 -79146 -198478
7946a98478j52399N9093K46409K34096o0763o8967K2426J2145m3191p0954j06132
$$ -198478 -350877 -291784 -45375 188721 127958 58991 81417 93562 50371 -20583 -126715
7935a26715K5109M3793J37863Q5166m4161p8748K2177K48182r3598J5341O5521
$$ -126715 -101606 -57813 80050 165216 121055 42307 64484 312666 219068 234409 299930
7924B99930j21683r6526Q7621l2466n0110N7682P5967p4340N0714N357K62P2899
$$ 299930 178247 81721 169342 136876 86766 144448 220415 146075 196789 202146 202408 275307
7912B75307k10270q8028m1457r5234k5262k6891k9649q4718Q3730j120J24994
$$ 275307 65037 -22991 -64448 -159682 -184944 -211835 -241484 -326202 -242472 -243592 -118598
7901a18598J47810M1593O4072q3861n3263M8481M9866J44862K8782R7699j5414
$$ -118598 29212 70805 134877 51016 -2247 46234 96100 240962 269744 367443 352029
7890C52029j67008j31085p150j16259J4891J90630q178q0370K3160j02062j05674
$$ 352029 185021 53936 46786 -69473 -54582 136048 127870 47500 70660 -31402 -137076
7879a37076k6527o8571Q322J48956L6703j5347l9895q2747M3595J57192J39502
$$ -137076 -163603 -232174 -223852 -74896 -38193 -53540 -93435 -176182 -132587 24605 164107
7868A64107j4668n7125j20260K9969N4042L1037r574o9549j08769O0329M3714
$$ 164107 149439 92314 -27946 2023 56065 87102 77528 7979 -100790 -40461 3253
7857C253J9916J7404r253R223m1568j07483J33400K61728q2355j29693j0435m1097
$$ 3253 23169 40573 31320 40543 -1025 -108508 24892 286620 204265 74572 64137 23040
7845B3040j51111O870K8814j06686n8706J3448J6736P9851J46058O097K73037
$$ 23040 -128071 -121201 -92387 -199073 -257779 -244331 -227595 -147744 -1686 4411 277448
7834B77448q4491l51472n6051J85581J9065j43271l6552J42783N8019L2112j88749
$$ 277448 192957 -158515 -214566 -28985 -9920 -153191 -189743 -46960 11059 43171 -145578
7823a45578j88890K54513j0748J05221j045j10435n1464j30867j61671M2509K58183
$$ -145578 -334468 -79955 -90703 14518 13473 -96962 -148426 -279293 -440964 -398455 -140272
7812a40272J04626J19497j349k5181o7008r3622J60647l085n4375R5036R7973
$$ -140272 -35646 83851 82502 57321 -9687 -103309 57338 54253 -122 94914 192887
7801A92887j2787l0977j31809M023L110O5971p8668p2247J4951j53243j05602
$$ 192887 180100 149123 17314 21337 24447 90418 11750 -60497 -45546 -198789 -304391
7790c04391J37991R8091K0198j5236o03j18643p1444L9098M9048J62998j1840
$$ -304391 -166400 -68309 -48111 -63347 -63950 -182593 -254037 -214939 -165891 -2893 -14733
7779a4733J8711K8652o2344j96965j91674O6577J98434J18527n8169j41797P4234
$$ -14733 3978 32630 -29714 -226679 -418353 -351776 -153342 -34815 -92984 -234781 -160547
7768a60547Q353l0109m2859j03763Q0685N0004l8280R1438J80388M4373O6786
$$ -160547 -152194 -182303 -225162 -328925 -248240 -198236 -236516 -145078 35310 79683 146469
7757A46469O2404o5478k10902k0979j4985J5281J0044J5332N9760O6278N1424
$$ 146469 208873 143395 -67507 -88486 -103471 -88190 -78146 -62814 -3054 63224 114648
7746A14648k84411j20287P0533R227j5464l003J34504J19187O8268K5765L0952
$$ 114648 -169763 -290050 -219517 -210290 -225754 -228757 -94253 24934 93202 118967 149919
7735A49919M2260m3154j66395k875Q9874J63656n2735o9547j4543o5542j10270
$$ 149919 192179 149025 -17370 -20245 69629 233285 180550 111003 96460 30918 -79352
7724g9352Q1491J16770j09778N91N264J33914n4742l5446j62968M083J91905L62485
$$ -79352 2139 118909 9131 9722 14986 148900 94158 58712 -104256 -100173 91732 454217
7712D54217Q4454j18339j81586L9180j8332K7527j24219j11984J6432J41972J75853
$$ 454217 538671 420332 238746 277926 259594 287121 162902 50918 67350 209322 385175
7701C85175k51542p7652J80604n6282j88088L7403p4562k9804J70758k2334j42472
$$ 385175 133633 55981 236585 180303 -7785 29618 -44944 -74748 96010 73676 -68796
7690f8796o718L1200j8360J8627o6867K3370R3861Q9798P0059O68j17107n385
$$ -68796 -75514 -44314 -62674 -44047 -110914 -87544 6317 96115 166174 166842 49735 44350
7678D4350O7614j86119o8924O4109K12726k4975j41553k0072J11897j99096K9483
$$ 44350 111964 -74155 -143079 -78970 133756 108781 -32772 -52844 59053 -140043 -110560
7667a10560J13640J54393P7637j10683j16908o6594K0540O872M3100K0280k78267
$$ -110560 3080 157473 235110 124427 7519 -59075 -38535 -31663 11437 31717 -246550
7656b46550j66402K86822K04701q5146r1840r8158r7448j2532Q1817J24638J17817
$$ -246550 -412952 -126130 78571 -6575 -98415 -196573 -294021 -306553 -224736 -100098 17719
7645A7719j74216j04288Q6998J58076J18492J04513j9367j72349j0750j41298
$$ 17719 -156497 -260785 -173787 -15711 102781 207294 187927 15578 4828 -136470
7635a36470n1222k180L0848M0955J00671j98483L36j7401O1377J13535p5446J08888
$$ -136470 -187692 -189872 -159024 -118069 -17398 -215881 -215545 -232946 -171569 -58034 -133480 -24592
7623b4592o6686Q3692R0639L9947j5308N4477m9715k6540k30107J36996M04713
$$ -24592 -91278 -7586 83053 123000 107692 162169 112454 85914 -144193 -7197 397516
7612C97516L1080j92158j56451j75391K3639l2955k2042J3968L1678o2911j56043
$$ 397516 428596 236438 79987 -95404 -71765 -104720 -126762 -112794 -81116 -144027 -300070
7601c00070o027K07M4898Q4831j03412L5602J97970K5665K656M6087q1248K6339
$$ -300070 -306097 -305890 -260992 -176161 -279573 -243971 -46001 -20336 -17680 28407 -52841 -26502
7589b6502l2014J2881j08623j0093r0070J51318J51716J5649j28566j04890j3568
$$ -26502 -58516 -45635 -154258 -164351 -254421 -103103 48613 64262 -64304 -169194 -182762
7578a82762K87863j2165j71536M3481J4968O1642J5238K6837M5946L3148j06401
$$ -182762 105101 92936 -78600 -35119 -20151 41491 56729 83566 129512 162660 56259
7567E6259k09284J0176K0642J62343J00874j22932N5925J484o3191L519j8841
$$ 56259 -153025 -142849 -122207 40136 141010 18078 74003 75487 12296 15815 -3026
7556c026l1643o7551L6679j28986l771o2377K103l0385J01081N3069K2101J60845
$$ -3026 -34669 -102220 -65541 -194527 -198298 -260675 -258572 -288957 -187876 -134807 -112706 48139
7544D8139j69063k3874m7658j43526J87887R2282N8394P7101o4770n8599R635
$$ 48139 -120924 -144798 -192456 -335982 -148095 -55813 2581 79682 14912 -43687 -34052
7533c4052j28163P9270J3542m6279J02529J66240o3313j66971j17493k19008k0857
$$ -34052 -162215 -82945 -69403 -115682 -13153 153087 89774 -77197 -194690 -413698 -434555
7522d34555J69533J56817n5470q6897N3743L0916P3800M220M2519L6137L6228
$$ -434555 -265022 -108205 -163675 -250572 -196829 -165913 -92113 -87893 -45374 -9237 26991
7511B6991j09732j57291K9480N9920L3971j8359Q3939O9277r0906P878p80j49308
$$ 26991 -82741 -240032 -210552 -150632 -116661 -135020 -51081 18196 -72710 -64832 -65612 -214920
7499b14920q643J56049P8822N967l2933n3532j656o5033J48904J05573n910n0661
$$ -214920 -223563 -67514 11308 17275 -15658 -69190 -70846 -135879 13025 118598 112688 62027
7487F2027J76983J08125q7630o3485j05809j11461j19144J6046r8234p7882N071
$$ 62027 239010 347135 259505 196020 90211 -21250 -140394 -124348 -222582 -300464 -295393
7476b95393j60453P675J26313J24780J41746j0103j23454j5470K81367K7091j63731
$$ -295393 -455846 -448171 -321858 -197078 -55332 -65435 -188889 -204359 77008 104099 -59632
7465e9632Q528N9343j3288o104l2669o5681r1907N678L156p394K0786Q0791J97615
$$ -59632 -51104 8239 -5049 -11153 -43822 -109503 -201410 -195732 -192576 -199970 -179184 -98393 99222
7452I9222J74430P0149r0852n3502J33731P9345R3293j15775j66409p0894l4226
$$ 99222 273652 343801 252949 199447 333178 412523 505816 390041 223632 152738 118512
7441A18512j96404K5070J25808K4127O9877J25735o6632k24909j1420K51619Q5369
$$ 118512 -77892 -52822 72986 97113 166990 292725 226093 1184 -10236 241383 326752
7430C26752l49988M3859O8343j80260q6413n6862L0811L17776M6997j31222r1189
$$ 326752 -23236 20623 88966 -91294 -177707 -234569 -203758 114018 161015 29793 -61396
7419f1396P9050j0192R7277m3208m7393j68664K242j415j4567J14687L11016L9039
$$ -61396 17654 7462 104739 61531 14138 -154526 -152284 -153699 -168266 -53579 257437 296476
7407B96476m2367N0884n0053j35457j42746P4869Q3607k9935M3895J0112m5066
$$ 296476 254109 304993 254940 119483 -23263 51606 135213 105278 149173 159285 114219
7396A14219j11718l125J37582M7960j27434k0723N036K7660L5246O1113j0827
$$ 114219 2501 -624 136958 184918 57484 36761 41797 69457 104703 165816 154989
7385A54989K8744p3106j25752p8579q1771j36794r3856J8011j14617J91372J13708
$$ 154989 183733 110627 -15125 -93704 -175475 -312269 -406125 -388114 -502731 -311359 -197651
7374a97651L3928K2672M7234M4152M2231L1541j71603Q215J50221N2958n3143
$$ -197651 -163723 -141051 -93817 -49665 -7434 24107 -147496 -139281 10940 63898 10755
7363A0755l4663J88459K19254j2232Q738L119m9960j93082j29677n1609k00187
$$ 10755 -23908 164551 383805 371573 380311 383430 333470 140388 10711 -40898 -241085
7352b41085O8662J16441O2538m7181L773j95483O6284J83973M0503j15756j73595
$$ -241085 -172423 -55982 6556 -40625 -36852 -232335 -166051 17922 58425 -57331 -230926
7341b30926L0923O9887N533p1109N3459n0114K11063Q9304j58066L0324l9175
$$ -230926 -200003 -130116 -124583 -195692 -142233 -192347 18716 108020 -50046 -19722 -58897
7330e8897j06016R1567n6288l8041J43523M8583q8100j09132J06549P0714j04105
$$ -58897 -164913 -73346 -129634 -167675 -24152 24431 -63669 -172801 -66252 4462 -99643
7319i9643J04805n624o9557J46196J04302J2362N0431J19086q2100j86229j25372
$$ -99643 5162 -462 -70019 76177 180479 192841 243272 362358 280258 94029 -31343
7308c1343j59735K12915M7102m5609Q5347P7462k7289j43873j0023K6548r2808
$$ -31343 -191078 21837 68939 23330 108677 186139 158850 14977 4954 31502 -61306
7297f1306p443L1873O5372N7484R584m2920J22107J71921p3781j83264O288l6604
$$ -61306 -68749 -36876 28496 85980 95564 52644 174751 346672 272891 89627 95915 59311
7285E9311o7227o7870R9168l1665r9046M0076m3759L1074o0573J54216j130p1812
$$ 59311 -7916 -75786 23382 -8283 -107329 -67253 -111012 -79938 -140511 13705 12575 -59237
7273e9237J9774p2642K1905P7096O2593k9994k09555n4465P5186P2043L1462o2627
$$ -59237 -39463 -112105 -90200 -13104 49489 19495 -190060 -244525 -169339 -97296 -65834 -128461
7261a28461N7413N0116K17801J4954l6009k14898k73528j61711K13994P0456K19740
$$ -128461 -71048 -20932 196869 211823 175814 -39084 -312612 -474323 -260329 -189873 29867
7250B9867J74974L6000n3048p318k4693j21178k34198K9471J793J58209j23885
$$ 29867 204841 240841 187793 180475 155782 34604 -199594 -170123 -168330 -10121 -134006
7239a34006k70807j3624P9780J82041P6326J41348J23099j47964o5998q7475Q2177
$$ -134006 -404813 -418437 -338657 -156616 -80290 61058 184157 36193 -29805 -117280 -35103
7228c5103n0205j6750o9494o4407M0674n574o4548m2736J95537J62435N2130k28696
$$ -35103 -85308 -102058 -171552 -235959 -195285 -200859 -265407 -308143 -112606 49829 101959 -126737
7216a26737J68809K11597J2126k2599r8094L7985K7427k21170k11534P7754K42635
$$ -126737 42072 253669 265795 243196 145102 183087 210514 -10656 -222190 -144436 98199
7205I8199M8617l6033J36436j2966j31192j08828m5335r7800L3115j08292J16034
$$ 98199 146816 110783 247219 234253 103061 -5767 -51102 -148902 -115787 -224079 -108045
7194a08045K13071L1811M3217j05398q4392L4930M6190j17670m2984n3319Q4150
$$ -108045 105026 136837 180054 74656 -9736 25194 71384 -46286 -89270 -142589 -58439
7183e8439m5757j11385J87217m4231n0174l0955K7878o5601N5425q9036j12330
$$ -58439 -104196 -215581 -28364 -72595 -122769 -153724 -125846 -191447 -136022 -225058 -337388
7172c37388J22392K29712J68415J1859o1856m8168p3492m206R3978J13100o8033
$$ -337388 -214996 14716 183131 194990 133134 84966 11474 7268 101246 214346 146313
7161A46313M3593P144j18757p4437j08605q7438J67337O7035o0258m6134j26280
$$ 146313 189906 197050 78293 3856 -104749 -192187 -24850 42185 -18073 -64207 -190487
7150a90487Q4470K32914j42516j78219J43490J75999j15004M1404j69898p974
$$ -190487 -106017 126897 -15619 -193838 -50348 125651 10647 52051 -117847 -125821
7140a25821K0277k06203j20577k8754K22160K88426O4079j70583j9900Q5452M0833
$$ -125821 -105544 -311747 -432324 -461078 -238918 49508 113587 -56996 -76896 8556 49389
7129D9389n8458j63032o6431M9665J92325O7939M988Q5093l7376k1471o0460j46583
$$ 49389 -9069 -172101 -238532 -188867 3458 71397 76385 161478 124102 102631 42171 -104412
7117a04412m1889J37976Q2656j27712n0811J00512p3905j45473j88703K39957
$$ -104412 -146301 -8325 74331 -53381 -104192 -3680 -77585 -223058 -411761 -171804
7107a71804K15252J10503j37843o6734R9092R3487O8889J1764k9116k62563q6851
$$ -171804 43448 153951 16108 -50626 48466 141953 210842 222606 193490 -69073 -155924
7096a55924J57897Q1204j07453m8689k4600j01428K5084J22239J5452K7301M1057
$$ -155924 1973 83177 -24276 -72965 -97565 -198993 -173909 -51670 -36218 -8917 32140
7085C2140j09584j37591J64612J08225n2780j59251o4994j10495Q944J42201O8005
$$ 32140 -77444 -215035 -50423 57802 5022 -154229 -219223 -329718 -320774 -178573 -110568
7074a10568J03660j4095r053O1772N6337l9523j52965J8685O9563l7371K0031
$$ -110568 -6908 -21003 -30056 31716 88053 48530 -104435 -85750 -16187 -53558 -33527
7063c3527o3233J8631O221r7886n9876n2673O4535P1972j61715M9306J51616N7755
$$ -33527 -96760 -78129 -71908 -169794 -229670 -282343 -217808 -145836 -307551 -258245 -106629 -48874
7051d8874O8129j21630j29668k1307l5992m384J02985L7481J1030N0990K3456
$$ -48874 19255 -102375 -232043 -253350 -289342 -293726 -190741 -153260 -142230 -91240 -67784
7040f7784n6625K8790n9335r9682o1115J9590l7877n2956r9464J52005L6101P4447
$$ -67784 -124409 -95619 -154954 -254636 -315751 -296161 -334038 -386994 -486458 -334453 -298352 -223905
7028b23905j9465R6662J02262J8054o882M0289J8880O0183K55515J19616k34069
$$ -223905 -243370 -146708 -44446 -26392 -33274 7015 25895 86078 341593 461209 227140
7017B27140j53984j20451j07425q9566l3854J81358J5079Q2426L4564j15742j21862
$$ 227140 73156 -47295 -154720 -244286 -278140 -96782 -81703 723 35287 -80455 -202317
7006b02317N0583L417J14654O9573p4036P705m4893J4241l6875r0893k6914O5289
$$ -202317 -151734 -148317 -33663 35910 -38126 -30421 -75314 -61073 -97948 -188841 -215755 -150466
6994a50466J446L9963j16074R4443K03787N0496O8734j8688n1395O5324J2888
$$ -150466 -149020 -109057 -225131 -130688 73099 123595 192329 173641 122246 187570 200458
6983B00458k03102M6609J09695j7969j01451r9861P2686J85487J17487j93448
$$ 200458 -2644 43965 153660 135691 34240 -65621 7065 192552 310039 116591
6973A16591j37063j36237l6542J84368J21994R0448O0841k3154j55098j22107
$$ 116591 -20472 -156709 -193251 -8883 113111 203559 264400 241246 86148 -35959
6963c5959l6897j36643K0308J98541J22888p7491j61865j39603M3917k4332K9547
$$ -35959 -72856 -209499 -189191 9350 132238 54747 -107118 -246721 -202804 -227136 -197589
6952a97589M2969J64074Q1036n533o7371J18062r3204j89813p5575j2326L902
$$ -197589 -154620 9454 90490 84957 17586 135648 42444 -147369 -222944 -235270 -231368
6941b31368K15L887j1936R0244N5016p0117J4275Q4562q4171l5321J14129O2995
$$ -231368 -231153 -227266 -239202 -148958 -93942 -164059 -149784 -65222 -149393 -184714 -70585 -7590
6929g590P0584k2002j05717N2342j50564p0623Q1811q0474Q8763J19182k1177
$$ -7590 62994 40992 -64725 -12383 -162947 -233570 -151759 -232233 -143470 -24288 -45465
6918d5465o927J7703p1579L9188L3506l2710M3741L6650j97818q5852K7703R2161
$$ -45465 -52392 -34689 -106268 -67080 -33574 -66284 -22543 14107 -183711 -269563 -241860 -149699
6906a49699P3623K5862r7454q6908O3526J22644J78954n9278j94163l4051p608
$$ -149699 -76076 -50214 -147668 -234576 -171050 -48406 130548 71270 -122893 -156944 -164552
6895a64552J09490Q8863j49922k83179n0853P3283K00829J49224j4313j45201
$$ -164552 -55062 33801 -116121 -399300 -450153 -376870 -176041 -26817 -41130 -186331
6885a86331j92384N5053J37218M3730M212k6961J8830J63561N1632M3229n1460
$$ -186331 -378715 -323662 -186444 -142714 -138502 -165463 -146633 16928 68560 111789 60329
6874F0329N8814J8724j03279L4907p426j0714J33670L9819r0023P072j39787N1429
$$ 60329 119143 137867 34588 69495 62069 51355 185025 224844 134821 141893 2106 53535
6862E3535O2306N0691o9860j01166m5757O4990p4142k48626p1872K20152O8202
$$ 53535 115841 166532 96672 -4494 -50251 14739 -59403 -308029 -379901 -159749 -91547
6851i1547j24387n4541N0934J14540R8722O4684r9399k27891M4355N6615R3239
$$ -91547 -215934 -270475 -219541 -105001 -6279 58405 -40994 -268885 -224530 -167915 -74676
6840g4676O4987K3375j49383j34251N0262l100k5306m7946K59207N9964j16660
$$ -74676 -9689 13686 -135697 -269948 -219686 -222786 -248092 -296038 -36831 23133 -93527
6829i3527j48219o0849M5370K04064Q7568j08185M623K32377j56892L0480m4200
$$ -93527 -241746 -302595 -257225 -53161 34407 -73778 -69155 163222 6330 36810 -7390
6818g390j51768m2752l2604O8600K65248J6902p728q5504M545J05213M8721j08640
$$ -7390 -159158 -201910 -234514 -165914 99334 116236 108508 23004 27549 132762 181483 72843
6806G2843M3639n4875J05249j3295l362k78120j66685Q1810K15036O1312o336
$$ 72843 116482 61607 166856 153561 150199 -127921 -294606 -212796 2240 63552 57216
6795E7216j53265K56769K59728j62822l45056j55384J02056J49573J45629j23128
$$ 57216 -96049 160720 420448 257626 -87430 -242814 -140758 8815 154444 31316
6785C1316j15365J74341L3495r1793k29334O2271J79597N9251l5445p9887o2581
$$ 31316 -84049 90292 123787 31994 -197340 -135069 44528 103779 68334 -11553 -74134
6774g4134M5161J4822O2729N7030J5948r122p6926m1311J967j90514O9457Q6852
$$ -74134 -28973 -14151 48578 105608 121556 112434 35508 -5803 -3836 -194350 -124893 -38041
6762c8041o8242R5380J53628N9431j40727L8114P904j74011k6025j32925k14777
$$ -38041 -106283 -10903 142725 202156 61429 99543 107447 -66564 -92589 -225514 -440291
6751d40291j52176K62518K71315Q0938P3020j44087j36716j9200J35748P6631
$$ -440291 -592467 -329949 -58634 22304 95324 -48763 -185479 -204679 -68931 7700
6741G700j30337k5170J2654K4965J03785j37137k1653J478p2032R968Q7062R9001
$$ 7700 -122637 -147807 -135153 -110188 -6403 -143540 -165193 -163715 -235747 -225779 -138717 -39716
6729c9716p1580m8169R9131o5467K9240l3625n7766r0177L1025R8171R0284R7959
$$ -39716 -111296 -159465 -60334 -125801 -96561 -130186 -187952 -278129 -247104 -148933 -58649 39310
6717C9310J4800k2391o1513m9222P6977m9708o0364N4568k5864j20807j0839J27728
$$ 39310 54110 31719 -29794 -79016 -2039 -51747 -112111 -57543 -83407 -204214 -215053 -87325
6705h7325P9872j16174k34541K3302J23745O8337j4772j232J2447K9517m1287
$$ -87325 -7453 -123627 -358168 -334866 -211121 -142784 -157556 -158788 -146341 -116824 -158111
6694a58111j89918l1531K26488Q6043Q7841K6076j03083m2050m8842P7658J571
$$ -158111 -348029 -379560 -153072 -67029 20812 46888 -56195 -98245 -147087 -69429 -67858
6683f7858l035J35363L2900P7459Q5980k7211k9783j80034j28326J86986J72560
$$ -67858 -70893 64470 97370 174829 260809 233598 203815 23781 -104545 82441 255001
6672B55001R0938L340n5787j59011k00333j5228j7617R498N0339l9233M190p221
$$ 255001 345939 349279 293492 134481 -65852 -81080 -98697 -89199 -38860 -78093 -73903 -81124
6660h1124J8105J4520J094K3907p9320r5149j07958j1361q0918k320K27121J45832
$$ -81124 -63019 -48499 -47405 -23498 -102818 -197967 -305925 -317286 -398204 -400524 -173403 -27571
6648b7571p8329j741o4011J14229J53484Q851j33632j80683J3499L5415L9741
$$ -27571 -105900 -107641 -171652 -57423 96061 104912 -28720 -209403 -195904 -160489 -120748
6637a20748J42680k16574j55681J32018O0232j5915q0147n8433m1075q4841M8452
$$ -120748 21932 -194642 -350323 -218305 -158073 -173988 -254135 -312568 -353643 -438484 -390032
6626c90032N8631J23663Q0259P6601R120l2908n1038R9317J8777j09696j04966
$$ -390032 -331401 -207738 -127479 -50878 -41758 -74666 -125704 -26387 -7610 -117306 -222272
6615b22272R6508q4538J32420J60903k4209o7706j07433J71832J06785O6971J17331
$$ -222272 -125764 -210302 -77882 83021 58812 -8894 -116327 55505 162290 229261 346592
6604C46592l3530j13637j59263J47459J01216j28812J0116l5122q8279k12612
$$ 346592 313062 199425 40162 187621 288837 160025 170141 135019 46740 -165872
6594a65872k8677j0785J44163p4551q7580p0978k1437J35046R0838K4652L6082
$$ -165872 -194549 -205334 -61171 -135722 -223302 -294280 -315717 -180671 -89833 -65181 -29099
6583b9099m3052Q7230J7060J1322q9677p982J18737J12087O5174N8286j41691
$$ -29099 -72151 15079 32139 43461 -46216 -54198 64539 176626 241800 300086 158395
6572A58395j39796o8662K3816q7505j02872j30166M9007J74724j19940m06J64705
$$ 158395 18599 -50063 -26247 -113752 -216624 -346790 -297783 -123059 -242999 -243405 -78700
6561g8700o9907K7089K20676l9724n3841o872p2799n9656K4563n1960J43938J06440
$$ -78700 -148607 -121518 99158 59434 5593 -1279 -74078 -133734 -109171 -161131 -17193 89247
6549H9247L1528p9922K5505N8028K9557k0371J1104M8545r9153q6967Q4001j04307
$$ 89247 120775 40853 66358 124386 153943 133572 144676 193221 94068 7101 91102 -13205
6537a3205m3600K2581J3702K2740J01829o5142n0943j72447m4543K2728K45736
$$ -13205 -56805 -34224 -20522 2218 104047 38905 -12038 -184485 -229028 -206300 39436
6526C9436J17068K0208j07233j04915j39283j48377K2908J49235O3980O9854J3112
$$ 39436 156504 176712 69479 -35436 -174719 -323096 -300188 -150953 -86973 -17119 -4007
6515d007o0538j01443m9394k9553m8469J43860q6231M7904J08326k9701n8426
$$ -4007 -64545 -165988 -215382 -244935 -293404 -149544 -235775 -187871 -79545 -109246 -167672
6504a67672J09526O4134L042R420J31338M1522l7837j50948k46650J75925R1921
$$ -167672 -58146 5988 9030 18450 149788 191310 153473 2525 -244125 -68200 23721
6493B3721j02252r5120J03242J01677j02068N3924M7691r4617R5610j40290j37618
$$ 23721 -78531 -173651 -70409 31268 -70800 -16876 30815 -63802 31808 -108482 -246100
6482b46100M3789J45615J23795K1019l1900M1586n2801r4086j24874K245J51210
$$ -246100 -202311 -56696 67099 88118 56218 97804 45003 -49083 -173957 -171712 -20502
6471b0502J14529n7022j04631J64444P1058j05304M4026m6142Q812k1517P9026
$$ -20502 94027 37005 -67626 96818 167876 62572 106598 60456 69268 47751 126777
6460A26777L4967j7608n5873Q1584K0736j14127r6857j60215Q2084J24907K16942
$$ 126777 161744 144136 88263 169847 190583 76456 -20401 -180616 -98532 26375 243317
6449B43317j7906n8969M2189p351j32653L6931j36813m4749R5871o325r1752P0412
$$ 243317 225411 166442 208631 201280 68627 105558 -31255 -76004 19867 13542 -78210 -7798
6437g798J85886j06778j33552k5370K32529J88119j19788j61332j1680m6600n9604
$$ -7798 178088 71310 -62242 -87612 144917 333036 213248 51916 40236 -6364 -65968
6426f5968j33307j5593J6106j991J06953J04801l93l1946J47645O7751j30115
$$ -65968 -199275 -214868 -198762 -200753 -93800 11001 10608 -21338 126307 194058 63943
6415F3943j11500j2617O1696K4567J42043J37781j77425j65020l7039o6521l2679
$$ 63943 -47557 -60174 1522 26089 168132 305913 128488 -36532 -73571 -140092 -172771
6404a72771K6469m2753K2305R0259M2954o3084n9760j1732J61992K0747j18647
$$ -172771 -146302 -189055 -166750 -76491 -33537 -96621 -156381 -168113 -6121 14626 -104021
6393a04021q6109M3917J96382p2076m5195j01519l1158L2967K7623n170R6415
$$ -104021 -190130 -146213 50169 -21907 -67102 -168621 -199779 -166812 -139189 -144359 -47944
6382d7944M8569J10599l256Q2425j76689n6977R7448J02056M6067n5386o9136
$$ -47944 625 111224 107968 190393 13704 -43273 54175 156231 202298 146912 77776
6371G7776O0622j42444j27625J43820j4755j75636P301q1510j15817K16856O2555
$$ 77776 138398 -4046 -131671 12149 -2606 -178242 -170941 -252451 -368268 -151412 -88857
6360h8857k1074P6218o6577j70136L9147N2169n5344n0516J92362K17144l4249
$$ -88857 -109931 -33713 -100290 -270426 -231279 -179110 -234454 -284970 -92608 124536 90287
6349I0287j15401L4658j28883k03672k1812K41625N4410p6186J04063J13492n3060
$$ 90287 -25114 9544 -119339 -323011 -344823 -103198 -48788 -124974 -20911 92581 39521
6338C9521o4451K2982k1349L1452J42480j5383k25887N7830o7563p0959N4864
$$ 39521 -24930 -1948 -23297 8155 150635 135252 -90635 -32805 -100368 -171327 -116463
6327a16463M0291m3168P4358J20754J221l6453j75417o2911k1418O4454P2863
$$ -116463 -76172 -119340 -44982 75772 76993 40540 -134877 -197788 -219206 -154752 -81889
6316h1889o181Q94l7492n0027Q2974J5295Q505j21653l4131J6919j99081J39817
$$ -81889 -88070 -87176 -124668 -174695 -91721 -76426 -67921 -189574 -223705 -206786 -405867 -266050
6304b66050J25964P1648j44917r0067o7624o17K3677J6113J32278J71690Q8016
$$ -266050 -140086 -68438 -213355 -303422 -371046 -371663 -347986 -331873 -199595 -27905 60111
6293F0111n9732j31737m9425J9411r837l3019J7223p0748J8974J91123l1312N4506
$$ 60111 379 -131358 -180783 -161372 -171209 -204228 -187005 -257753 -238779 -47656 -78968 -24462
6281b4462K82022P3775k20939k65871O8012K2705L3943n6109n5947J96029j47313
$$ -24462 257560 331335 110396 -155475 -87463 -64758 -30815 -86924 -142871 53158 -94155
6270i4155j8976J45397k5571J36939J02187j78552k22153q5175K5740K699J95982
$$ -94155 -113131 32266 6695 143634 245821 67269 -154884 -240059 -214319 -211620 -15638
6259a5638N9149o8005L7005k20124j80356K6693J30167J49082J21231O7230j64675
$$ -15638 43511 -24494 12511 -207613 -387969 -361276 -231109 -82027 39204 106434 -58241
6248e8241O6910K0731j97347k16332J5240Q8839Q3686k9842J07724r383j18755
$$ -58241 8669 29400 -167947 -384279 -369039 -280200 -196514 -226356 -118632 -128015 -246770
6237b46770j3707J59497J6307O6409m8421P6510q0604o703R7448N9528k64721
$$ -246770 -260477 -100980 -84673 -18264 -66685 9825 -70779 -77482 19966 79494 -185227
6226a85227j88537L05003J52316o6210m761j35572j57915P477j37776m5682L05128
$$ -185227 -373764 -68761 83555 17345 12584 -122988 -280903 -273426 -411202 -456884 -151756
6215a51756J44833j40702q8317Q013r3031M1243k6840m1493m0367R4011K05194
$$ -151756 -6923 -147625 -235942 -227929 -320960 -279717 -306557 -348050 -388417 -294406 -89212
6204h9212M300n9828J4308Q3138O7772J32586j59347P0522p4049j4538O3298J7805
$$ -89212 -84912 -144740 -130432 -47294 20478 153064 -6283 64239 -9810 -24348 38950 56755
6192E6755j08330P4629J07522L0753j06600k11019j91704l1675R1461J34379O1878
$$ 56755 -51575 23054 130576 161329 54729 -156290 -347994 -379669 -288208 -153829 -91951
6181i1951k1436j3279o730R2984q004r5878R4951Q3828j33996q5050J20696K16657
$$ -91951 -113387 -126666 -133396 -40412 -48416 -144294 -49343 34485 -99511 -184561 -63865 152792
6169A52792p1899M4758Q7184l4621J9677k3968O5974p1690j22831o3572r7249
$$ 152792 80893 125651 212835 178214 197891 173923 239897 168207 45376 -18196 -115445
6158a15445k00608R8369J17798p2356R0102J94308J06071p9392K4510j3791K01885
$$ -115445 -316053 -217684 -99886 -172242 -82140 112168 218239 138847 163357 149566 351451
6147C51451j09657l75171m5743N3289L666P549K54134J2553R142k3221r6180J11255
$$ 351451 241794 -133377 -179120 -125831 -122165 -114616 139518 152071 161213 137992 41812 153067
6135A53067L9643n4033j51965r1061j11265K5902J22776m3583M4817j32126o2382
$$ 153067 192710 138677 -13288 -104349 -215614 -189712 -66936 -110519 -65702 -197828 -260210
6124b60210J75140K0238j40997l2010K36134M4263j41504j10597J74722j63466
$$ -260210 -85070 -64832 -205829 -237839 -1705 42558 -98946 -209543 -34821 -198287
6114a98287p525K51037J93454q7847r4018r7132j66303j12244J76001J13971K9066
$$ -198287 -205812 45225 238679 150832 56814 -40318 -206621 -318865 -142864 -28893 173
6103A73q5611j67600J72905K18026m7660n6016p3862m7950k15525J35821K55733
$$ 173 -85438 -253038 -80133 137893 90233 34217 -39645 -87595 -303120 -167299 88434
6092H8434O0005j00492l128j03626q6548l1931M3574q7185q7187M2667J11850
$$ 88434 148439 47947 44819 -58807 -145355 -177286 -133712 -220897 -308084 -265417 -153567
6081a53567K15444L6450L5421n78m9261j58889r0395J4132Q4214o8193o5307J18905
$$ -153567 61877 98327 133748 133170 83909 -74980 -165375 -151243 -67029 -135222 -200529 -81624
6069h1624j65768K585j6952P1783N9408J21394Q823M106N8580m3983p9595o8093
$$ -81624 -247392 -244807 -261759 -189976 -130568 -9174 -351 3755 62335 18352 -61243 -129336
6057a29336j01918K3512j06593J51822K40407j45417q1800O9909N5412j8817k185
$$ -129336 -231254 -207742 -314335 -162513 77894 -67523 -149323 -79414 -24002 -42819 -45004
6046d5004K3848j3989j5741O355p0518m6902L3472o4288K1497M2080J02906r2528
$$ -45004 -21156 -35145 -50886 -44531 -115049 -161951 -128479 -192767 -171270 -129190 -26284 -118812
6034a18812J25682K0509N3572K9156p523R6443j39585k34956j3109n5969L9420
$$ -118812 6870 27379 80951 110107 102584 199027 59442 -175514 -188623 -244592 -205172
6023b05172Q1595R6223q3149j0173M0563K0971j9164p9045k20099J3412J64714
$$ -205172 -123577 -27354 -110503 -120676 -80113 -59142 -78306 -157351 -377450 -364038 -199324
6012a99324Q5650N3348Q7965J7777r9772M1532J11004j36535K4148O6138L4237
$$ -199324 -113674 -60326 27639 45416 -54356 -12824 98180 -38355 -14207 51931 86168
6001H6168K5059N102j58558q88J18816L7556j70053o6940q1412j4184J24511J40985
$$ 86168 111227 116329 -42229 -43117 75699 113255 -56798 -123738 -205150 -219334 -94823 46162
5989D6162O4559Q4044l3364q0536L3602J64478j48580j41660J01568O1626p4047
$$ 46162 110721 194765 161401 80865 114467 278945 130365 -11295 90273 151899 77852
5978G7852l2121j77812j62990L4994J35147N2126J84L21J14597j57204k23429
$$ 77852 45731 -132081 -295071 -260077 -124930 -72804 -72620 -72299 42298 -114906 -338335
5967c38335k1854J87977J14298L8010J18898Q6813o2305k8110k8551l7164N763
$$ -338335 -360189 -172212 -57914 -19904 98994 185807 123502 95392 66841 29677 35440
5956C5440o3406M8480Q4542k13811q9086J34300J18732k03781k89763R1625N7159
$$ 35440 -27966 20514 105056 -108755 -197841 -63541 55191 -148590 -438353 -346728 -289569
5945b89569k20831K23988K46476J46031j4299r0531j30294k1218K2092j5608L3237
$$ -289569 -510400 -286412 -39936 106095 91796 1265 -129029 -150247 -128155 -143763 -110526
5934a10526N5317r0264r9323J06844M5558N5315l6936K3692M9687r2368p2384
$$ -110526 -55209 -145473 -244796 -137952 -92394 -37079 -74015 -50323 -636 -93004 -165388
5923a65388k8162j53263L8021Q8217J00250j8028J21098k3049J2858O4303J12891
$$ -165388 -193550 -346813 -308792 -220575 -120325 -138353 -17255 -40304 -27446 36857 149748
5912A49748r7020p3567j26953j81765k7837j1461Q0832J23918J68571Q5641q3310
$$ 149748 52728 -20839 -147792 -329557 -357394 -368855 -288023 -164105 4466 90107 6797
5901F797M4138J184M0058L3259L8622q6300r09M4086m4358m7894L3391M4780j05050
$$ 6797 50935 52119 92177 125436 164058 77758 76849 120935 76577 28683 62074 106854 1804
5888A804r4791J52824j2286o4226Q1249p8265l1163R645l2891R0713K1645o3904
$$ 1804 -92987 59837 47551 -16675 64574 -13691 -44854 -35209 -68100 22613 44258 -19646
5876a9646J63849j01358j48010J45667M1748p86q30j1446L495k4744j9216j3059
$$ -19646 144203 42845 -105165 40502 82250 81464 80634 69188 72683 47939 28723 15664
5864A5664l9804J3823k41935K3549O817j9932J33788N9804J5863q3624j02328
$$ 15664 -24140 -10317 -252252 -228703 -221886 -241818 -108030 -48226 -32363 -115987 -218315
$$ [...]
##END NTUPLES=NMR SPECTRUM
##END=
