##TITLE=Analysis number 320744
Compound Code cc 38113
Book Reference 468/109
Project Code adrs
Chemist Name colinb
##JCAMPDX= 6.0         $$ Bruker NMR JCAMP-DX V2.0
##DATA TYPE= NMR SPECTRUM
##DATA CLASS= NTUPLES
##ORIGIN= Bruker BioSpin GmbH
##OWNER= nmr
$$ XWIN-NMR		Version 3.5
$$ Fri Jul  7 09:17:18 2006 GMT Daylight Time (UT+1h)  MAYBRIDGE\nmr@NMR_250MHZ
##.OBSERVE FREQUENCY= 250.131544655141
##.OBSERVE NUCLEUS= ^1H
##.ACQUISITION MODE= SIMULTANEOUS (DQD)
##.ACQUISITION SCHEME= undefined
##.AVERAGES= 16
##.DIGITISER RES= 18
##SPECTROMETER/DATA SYSTEM= dpx250
##.PULSE SEQUENCE= zg30
##.SOLVENT NAME= CDCl3
##.SHIFT REFERENCE= (INTERNAL, CDCl3, 0, 16.522)
##AUDIT TRAIL= $$ (NUMBER, WHEN, WHO, WHERE, WHAT)
$$ ##TITLE= Audit trail, XWIN-NMR		Version 3.5
$$ ##JCAMPDX= 5.01
$$ ##ORIGIN= Bruker BioSpin GmbH
$$ ##OWNER= nmr
$$ C:\u/data/dgb/nmr/ADRS/2480/pdata/1/auditp.txt
$$ ##AUDIT TRAIL=  $$ (NUMBER, WHEN, WHO, WHERE, WHAT)
(   1,<2006-07-07 09:16:57.35 +100>,<MAYBRIDGE\nmr>,<NMR_250MHZ>,
      <created by zg, POWCHK disabled, PULCHK disabled
       configuration hash MD5:
       E2 DF 36 D8 04 B2 41 60 5A D7 A3 38 5A 4B D0 FE
       data hash MD5: 64K
       EF 5E FF 8F 36 A9 28 98 4B 0A 91 3A E8 F3 80 7E>)
(   2,<2006-07-07 09:17:09.02 +100>,<MAYBRIDGE\nmr>,<NMR_250MHZ>,
      <Start of raw data processing
       ef LB = 0.3 FT_mod = 6 PKNL = 1 SI = 32K 
       data hash MD5: 32K
       58 52 1C F0 17 D3 57 4C E2 08 55 BF 73 FC 81 D9>)
(   3,<2006-07-07 09:17:10.69 +100>,<MAYBRIDGE\nmr>,<NMR_250MHZ>,
      <apk 
       data hash MD5: 32K
       0A BE E6 74 EB 5F F7 4F C6 69 CC 86 E3 9F AA D7>)
(   4,<2006-07-07 09:17:11.49 +100>,<MAYBRIDGE\nmr>,<NMR_250MHZ>,
      <abs ABSG = 5 
       data hash MD5: 32K
       64 D0 7F 96 4F 92 61 D1 14 28 8E 99 99 79 85 45>)
$$ ##END=
$$ 
$$ hash MD5
$$ D6 55 17 A4 9B 9A 7A E2 F2 C6 9F 71 CB 6B D1 12
##$RELAX= 
##$RELAX= 
##$RELAX= 
##$RELAX= 
##$RELAX= 
##$RELAX= 
##$RELAX= 
$$ Bruker specific parameters
$$ --------------------------
##$DU= <C:\u>
##$EXPNO= 2480
##$NAME= <ADRS>
##$PROCNO= 1
##$TYPE= <nmr>
##$USER= <dgb>
##$AMP= (0..31)
100 100 100 100 100 100 100 100 100 100 100 100 100 100 100 100 100 100 
100 100 100 100 100 100 100 100 100 100 100 100 100 100 
##$AQSEQ= 0
##$AQ_mod= 3
##$AUNM= <au_zg>
##$AUTOPOS= <34 >
##$BF1= 250.13
##$BF2= 250.13
##$BF3= 250.13
##$BF4= 250.13
##$BF5= 500.13
##$BF6= 500.13
##$BF7= 500.13
##$BF8= 500.13
##$BYTORDA= 1
##$CFDGTYP= 0
##$CFRGTYP= 5
##$CHEMSTR= <none>
##$CNST= (0..31)
1 1 145 1 1 1 1 1 1 1 1 1 1 1 1 1 1 1 1 1 1 1 1 1 1 1 1 1 1 1 1 1 
##$CPDPRG= <>
##$CPDPRG1= <>
##$CPDPRG2= <>
##$CPDPRG3= <>
##$CPDPRG4= <mlev>
##$CPDPRG5= <mlev>
##$CPDPRG6= <mlev>
##$CPDPRG7= <mlev>
##$CPDPRG8= <mlev>
##$CPDPRGB= <>
##$CPDPRGT= <>
##$D= (0..31)
0 1 0 0 0 0 0 0 0 0.06 0 0 0 0 0 0 0.0002 0 0 0 0 0 0 0 0 0 0 0 0 0 0 
0 
##$DATE= 1152260216
##$DBL= (0..7)
120 120 120 120 120 120 120 120 
##$DBP= (0..7)
150 150 150 150 150 150 150 150 
##$DBP07= 0
##$DBPNAM0= <>
##$DBPNAM1= <>
$$ [...]
##$SUBNAM7= <"">
##$SUBNAM8= <"">
##$SUBNAM9= <"">
##$SW= 20.6930455092707
##$SWIBOX= (0..15)
0 0 3 0 0 0 0 0 0 0 0 0 0 0 0 0 
##$SW_h= 5175.983436853
##$TD= 65536
##$TD0= 1
##$TE= 295.16
##$TE2= 300
##$TE3= 300
##$TEG= 300
##$TL= (0..7)
0 120 120 120 120 120 120 120 
##$TP= (0..7)
150 150 150 150 150 150 150 150 
##$TP07= 0
##$TPNAME0= <>
##$TPNAME1= <>
##$TPNAME2= <>
##$TPNAME3= <>
##$TPNAME4= <>
##$TPNAME5= <>
##$TPNAME6= <>
##$TPNAME7= <>
##$TPOAL= (0..7)
0.5 0.5 0.5 0.5 0.5 0.5 0.5 0.5 
##$TPOFFS= (0..7)
0 0 0 0 0 0 0 0 
##$TUNHIN= 0
##$TUNHOUT= 0
##$TUNXOUT= 0
##$USERA1= <user>
##$USERA2= <user>
##$USERA3= <user>
##$USERA4= <user>
##$USERA5= <user>
##$V9= 5
##$VALIST= <valist>
##$VCLIST= <CCCCCCCCCCCCCCC>
##$VD= 0
##$VDLIST= <DDDDDDDDDDDDDDD>
##$VPLIST= <PPPPPPPPPPPPPPP>
##$VTLIST= <TTTTTTTTTTTTTTT>
##$WBST= 1024
##$WBSW= 4
##$XGAIN= (0..3)
0 0 0 0 
##$XL= 0
##$YL= 0
##$YMAX_a= 593257
##$YMIN_a= -700911
##$ZGOPTNS= <>
##$ZL1= 120
##$ZL2= 120
##$ZL3= 120
##$ZL4= 120
##$ABSF1= 16.522
##$ABSF2= -4.171173
##$ABSG= 5
##$ABSL= 3
##$ALPHA= 0
##$AQORDER= 0
##$ASSFAC= 0
##$ASSFACI= 0
##$ASSFACX= 0
##$ASSWID= 0
##$AUNMP= <proc_1d>
##$AZFE= 0.1
##$AZFW= 0.1
##$BCFW= 0
##$BC_mod= 0
##$BYTORDP= 0
##$COROFFS= 0
##$CY= 12.5
##$DATMOD= 1
##$DC= 0
##$DFILT= <>
##$DTYPP= 0
##$F1P= 14.0000005364418
##$F2P= -0.99999901652339
##$FCOR= 0.5
##$FTSIZE= 32768
##$FT_mod= 6
##$GAMMA= 0
##$GB= 0
##$INTBC= 1
##$INTSCL= 1
##$ISEN= 128
##$LB= 0.3
##$LEV0= 0
##$LPBIN= 0
##$MAXI= 10000
##$MC2= 0
##$MEAN= 0
##$ME_mod= 0
##$MI= 0
##$NCOEF= 0
##$NC_proc= -4
##$NLEV= 6
##$NOISF1= 0
##$NOISF2= 0
##$NSP= 0
##$NTH_PI= 0
##$NZP= 0
##$OFFSET= 16.522
##$PC= 1
##$PHC0= 163.6297
##$PHC1= 5.724757
##$PH_mod= 1
##$PKNL= yes
##$PPARMOD= 0
##$PSCAL= 4
##$PSIGN= 0
##$REVERSE= no
##$SF= 250.13
##$SI= 32768
##$SIGF1= 0
##$SIGF2= 0
##$SINO= 400
##$SIOLD= 32768
##$SREGLST= <1H.CDCl3>
##$SSB= 0
##$STSI= 32768
##$STSR= 0
##$SW_p= 5175.98343685301
##$SYMM= 0
##$S_DEV= 0
##$TDeff= 65536
##$TDoff= 0
##$TI= <Analysis number 999999
Compound Code 99
Book Reference 9
Project Code 9>
##$TILT= no
##$TM1= 0
##$TM2= 0
##$TOPLEV= 0
##$USERP1= <user>
##$USERP2= <user>
##$USERP3= <user>
##$USERP4= <user>
##$USERP5= <user>
##$WDW= 1
##$XDIM= 32768
##$YMAX_p= 400275755
##$YMIN_p= -123471
$$ End of Bruker specific parameters
$$ ---------------------------------
##NTUPLES= NMR SPECTRUM
##VAR_NAME=  FREQUENCY,     SPECTRUM/REAL,   SPECTRUM/IMAG
##SYMBOL=    X,             R,               I
##VAR_TYPE=  INDEPENDENT,   DEPENDENT,       DEPENDENT
##VAR_FORM=  AFFN,          ASDF,            ASDF
##VAR_DIM=   32768,         32768,           32768
##UNITS=     HZ,            ARBITRARY UNITS, ARBITRARY UNITS
##FACTOR=    0.157963299565203, 1,           1
##FIRST=     4132.6476996994, 0,             0
##LAST=      -1043.33573715361, 0,           0
##MIN=       -1043.33573715361, -123471,     0
##MAX=       4132.6476996994, 400275755,     0
$$ Real data points
##PAGE= N=1
##DATA TABLE= (X++(R..R)), XYDATA
$$ [...]
14794h084j5759K8338J5866K680J7718K7847k0444m9356j4772J7354l814o21J6444
$$ -8084 -23843 4495 20361 23041 40759 68606 48162 -1194 -15966 1388 -2426 -3047 13397
14781A3397o239p32j1204j6138M667J3191o290k6879O170k0544k5571L169N910
$$ 13397 7158 6426 -4778 -20916 -16249 -3058 -9348 -36227 -30057 -50601 -76172 -73003 -67093
14768f7093J1269J1709N971R136K7325j1979J5632j2921l869j5052j5007j8516
$$ -67093 -55824 -44115 -38144 -29008 -1683 -13662 1970 -10951 -14820 -29872 -44879 -63395
14756f3395J6208N977R137M062j063k2916j6931k086K1851J1802J4803n316n0248
$$ -63395 -47187 -41210 -32073 -28011 -29074 -51990 -68921 -71007 -49156 -37354 -22551 -27867 -78115
14743g8115j6020K1649L6077N660K2133k990M79J720n175J5680L816k1877m489
$$ -78115 -94135 -72486 -36409 -30749 -8616 -11606 -11127 -9407 -14582 1098 4914 -16963 -21452
14730b1452J0730L5460K1529k9993m7002l959j040n572O554O646K5318j7006j8361
$$ -21452 -10722 24738 46267 16274 -30728 -34687 -35727 -41299 -34745 -28099 -2781 -19787 -38148
14717c8148p21K5650L0142o983j7392j3183k0572J3622J6516K798j7379K0096
$$ -38148 -38869 -13219 16923 9940 -7452 -20635 -41207 -27585 -11069 -8271 -25650 -5554
14705e554Q692j5323j47L86K7768L3920K0875m6252n8933j7816q481M166K317
$$ -5554 3138 -12185 -12332 -11946 15822 49742 70617 24365 -34568 -52384 -60865 -56699 -54382
14692e4382J5681O467m377j934q98K2539j9633l5420P383O011R796M5541N0870
$$ -54382 -38701 -32234 -36611 -38545 -39443 -16904 -36537 -71957 -64574 -58563 -48767 -3226 47644
14679D7644k083j2311n3698j031K3822k0028l4871L009Q325J4019M210l324L8918
$$ 47644 45561 33250 -20448 -21479 2343 -17685 -52556 -49547 -41222 -27203 -22993 -26317 12601
14666A2601O575O32l5063r378N382J7917M436K0621j0405j8029j7886O226K664
$$ 12601 19176 19808 -15255 -24633 -19251 -1334 3102 23723 13318 -4711 -22597 -16371 -13707
14653a3707M322p05j3441J5189J3598m316m0647j0463J073k6462J1882O607J7130
$$ -13707 -9385 -10090 -23531 -8342 5256 940 -39707 -50170 -49097 -75559 -63677 -57070 -39940
14640c9940p404J7517J2523N0584j6311j367n482k5736k6591P015o196K014K6664
$$ -39940 -47344 -29827 -17304 33280 16969 15602 10120 -15616 -42207 -35192 -41388 -39374 -12710
14627a2710J8407j6058j2296J1318P228N719p816K31N129p77j5974P853j7567
$$ -12710 5697 -10361 -22657 -11339 -4111 1608 -6208 -5977 -848 -1625 -17599 -9746 -27313
14614b7313k205O621K542r532J672J896j2940K0224J0584M045j6194k065M2988
$$ -27313 -29518 -22897 -20355 -29887 -28215 -26319 -39259 -19035 -8451 -4406 -20600 -22665 20323
14601B0323J4909q908O186l0845l5949n908j3244J2619J0686J0864k7019O210
$$ 20323 35232 26324 32510 1665 -34284 -40192 -53436 -40817 -30131 -19267 -46286 -40076
14589d0076N008p219K7565q663q2j1131J1248R578J5715J2521k1491m726N892
$$ -40076 -35068 -42287 -14722 -23385 -23467 -34598 -23350 -13772 1943 14464 -7027 -11753 -5861
14576e861K6608o951n570l702J4333R089j8706k7315k8120m896K1283k520J8818
$$ -5861 20747 13796 8226 4524 18857 27946 9240 -18075 -46195 -51091 -29808 -32328 -13510
14563a3510j4797J0453K6106P290l165n910O329K1683N389j8850j4874j2009J5415
$$ -13510 -28307 -17854 8252 15542 12377 6467 12796 34479 39868 21018 6144 -5865 9550
14550I550j646k0441j1900q416m669m43r52k0178L954K2950J5753j770j7851j0422
$$ 9550 7904 -12537 -24437 -32853 -37522 -37965 -38917 -59095 -55141 -32191 -16438 -18208 -36059 -46481
14536d6481R927K4857J1608O691M108j0862k2051R443K985n810K3542p322o670
$$ -46481 -36554 -11697 -89 6602 10710 -152 -22203 -12760 -9775 -15585 7957 635 -6035
14523f035j6325K474J8074K733k1457m1391j2009K977J2425N721P048J0193j471
$$ -6035 -22360 -19886 -1812 921 -20536 -61927 -73936 -70959 -58534 -52813 -45765 -35572 -37043
14510c7043q480J8839K675L255N434m7479L948N461K8567n838n834Q360j4813
$$ -37043 -45523 -26684 -24009 -20754 -15320 -62799 -58851 -53390 -24823 -30661 -36495 -28135 -42948
14497d2948R660p682j0596l4515J796L3502L0093o816j1580K492J3808R796n071
$$ -42948 -33288 -40970 -51566 -86081 -84285 -50783 -20690 -27506 -39086 -36594 -22786 -12990 -18061
14484a8061j9823O862J272J0832L0148O411j070J3266K1919k8154l848m833k2225
$$ -18061 -37884 -31022 -29750 -18918 11230 17641 16571 29837 51756 23602 19754 14921 -7304
14471g304l9828J0676K4782l223j6455j7435P938P500R304k3L218l9979N190K1655
$$ -7304 -47132 -36456 -11674 -14897 -31352 -48787 -40849 -33349 -24045 -24068 -20850 -60829 -55639 -33984
14457c3984M53K9036K3309J62n384j3005K0884K6011j1749l2049l3567n327j1469
$$ -33984 -33531 -4495 18814 18976 13592 587 21471 47482 35733 3684 -29883 -35210 -46679
14444d6679J1425l864L5291j3239r904M265p343o10N935j8820J0095m373K0218
$$ -46679 -35254 -39118 -3827 -17066 -26970 -22705 -30048 -30658 -24723 -43543 -33448 -37821 -17603
14431a7603R619o780q091r947k914n301K405M71J717n214L276R068j0146j3077
$$ -17603 -7984 -14764 -22855 -32802 -35716 -41017 -38612 -38141 -36424 -41638 -38362 -29294 -39440 -52517
14417e2517p724p86L170K026k9869k7904J6594M2249J3824j883J8881J4944l1210
$$ -52517 -60241 -61027 -57857 -55831 -85700 -113604 -97010 -54761 -40937 -42820 -23939 -8995 -40205
14404d0205l7584P39L1923M705j6160N810N107J0668R189k408J7322K3423K4039
$$ -40205 -77789 -77050 -45127 -40422 -56582 -50772 -45665 -34997 -25808 -28216 -10894 12529 36568
14391C6568n088Q637M30r953l9492k7342J9067K8227l2228l3386k1765o152Q359
$$ 36568 31480 40117 40547 30594 -8898 -36240 -17173 11054 -21174 -54560 -76325 -82477 -74118
14378g4118L3996J1780k2104Q154p2Q648q114j0537R429J7007q437j8957R848
$$ -74118 -40122 -28342 -50446 -42292 -42364 -33716 -41830 -52367 -42938 -25931 -34368 -53325 -43477
14365d3477J3555n241j6578Q665K5517O911K749R453J492P068m835q452j5994
$$ -43477 -29922 -35163 -51741 -43076 -17559 -10648 -7899 1554 3046 10114 5279 -3173 -19167
14352a9167k4316J2333l017j0033K2790J3920k4275j442j002Q028L4631K0326
$$ -19167 -43483 -31150 -34167 -44200 -21410 -7490 -31765 -33207 -34209 -26181 8450 28776
14340B8776k653k367k9256m075j2914k3613L38L055K4573j688P761J7792j8047
$$ 28776 26123 23756 -5500 -9575 -22489 -46102 -45764 -42709 -18136 -19824 -12063 5729 -12318
14327a2318J0136M328P343J0350p257j3064q827n185J8044L0397j8780p385R822
$$ -12318 -2182 2146 9489 19839 12582 -482 -9309 -14494 3550 33947 15167 7782 17604
14314A7604K951m151n165p018p250j6023l418P320K7182O074J217j429j0889j0891
$$ 17604 20555 16404 11239 4221 -3029 -19052 -22470 -15150 12032 18106 19323 17894 7005 -3886
14300c886J4559n153K9900o801l5470j6166N931K1930J9389r350j308p118j2793
$$ -3886 10673 5520 35420 28619 -6851 -23017 -17086 4844 24233 14883 13575 6457 -6336
14287f336j6047R684J6752K3322M458k5797J8692J8422J4866n2114l5297Q524
$$ -6336 -22383 -12699 4053 27375 31833 6036 24728 43150 58016 5902 -29395 -20871
14275b0871p161R237L1591k5345j8924k8066J9998K3392K3954j2486j7837j3619
$$ -20871 -28032 -18795 12796 -12549 -31473 -59539 -39541 -16149 7805 -4681 -22518 -36137
14263c6137K8326J6107l944k1910l5415J6426L9401K6271q956k2935N092K6432
$$ -36137 -7811 8296 4352 -17558 -52973 -36547 2854 29125 20169 -2766 2326 28758
14251B8758J3006j0737m496j6079k0830k4215K4957M3118l018l4344k5390j6658
$$ 28758 41764 31027 26531 10452 -10378 -34593 -9636 33482 30464 -3880 -29270 -45928
14239d5928j1653j628K4538M8713k0594j0055J4799l6153j3783J8787J8692R841
$$ -45928 -57581 -59209 -34671 14042 -6552 -16607 -1808 -37961 -51744 -32957 -14265 -4424
14227d424J837j567j824n514j6963l973K2118K5267r594j1450L4442K0971r936
$$ -4424 -2587 -4154 -5978 -11492 -28455 -32428 -10310 14957 5363 -6087 28355 49326 39390
14214C9390j4782P945k826N508R446M830M7383r883L719J595J8628K3730j9795
$$ 39390 24608 32553 29727 35235 44681 49511 96894 87011 90730 92325 110953 134683 114888
14201A14888L116J0088R714j032q299O660k2779l3655k5042j2555L200M411k333
$$ 114888 118004 128092 137806 136774 128475 135135 112356 78701 53659 41104 44304 48715 46382
14188D6382K623J4010r980j1791j778L506l3969j1198l1810K342j762P696n988
$$ 46382 49005 63015 53035 41244 39466 42972 9003 -2195 -34005 -31663 -33425 -25729 -31717
14175c1717j6480Q791q511J3270K1566n913j3126K0100J3201m297j012o609j3795
$$ -31717 -48197 -39406 -47917 -34647 -13081 -18994 -32120 -12020 1181 -3116 -4128 -10737 -24532
14162b4532k67J276Q722J7060O21Q665l161j8842k7395k381P969P509K5166Q151
$$ -24532 -24799 -23523 -14801 2259 2880 11545 8384 -10458 -37853 -40234 -32265 -24756 410 8561
14148H561l6948j0313J314m549q719J4371J0192k0993k4560Q914J2367j3431j290
$$ 8561 -28387 -38700 -37386 -41935 -50654 -36283 -26091 -47084 -71644 -62730 -50363 -63794 -65084
14135f5084K6686K786L575j3528j9178j2729j2059J8403L9996o487m369o166L4060
$$ -65084 -38398 -35612 -32037 -45565 -64743 -77472 -89531 -71128 -31132 -37619 -41988 -48154 -14094
14122a4094J5300o925m686m109R113k3550J4030m775k4689J2326L5798m642j2401
$$ -14094 1206 -5719 -10405 -14514 -5401 -28951 -14921 -19696 -44385 -32059 3739 -903 -13304
14109a3304k6685j0927K1462R531k2855l478j1149M52J0755J7245J5897J3824
$$ -13304 -39989 -50916 -29454 -19923 -42778 -46256 -57405 -56953 -46198 -28953 -13056 768
14097G68Q89O474l0795j4182J5413j0481J799q137k2694j06K0430K5165L8562
$$ 768 1657 8131 -22664 -36846 -21433 -31914 -30115 -38252 -60946 -61052 -40622 -15457 23105
14084B3105j9494k4945L0592J4224j2971p286j4374k4100k4174J9959M1738J5789
$$ 23105 3611 -21334 9258 23482 10511 3225 -11149 -35249 -59423 -39464 2274 18063
14072A8063k8552k7299P559R759j5350p791P073Q61j8575j4210O1126Q807j9843
$$ 18063 -10489 -37788 -30229 -20470 -35820 -43611 -36538 -35677 -54252 -68462 -7336 1471 -18372
14059a8372k3622j5613K7038l430L737k063L070J577J0992M7467Q754j7983j4703
$$ -18372 -41994 -57607 -30569 -33999 -30262 -32325 -29255 -27678 -16686 30781 39535 21552 6849
14046F849j6856l0432j6308N594R261M44k166j1680j3739j1945N957O947J5516
$$ 6849 -10007 -40439 -56747 -51153 -41892 -41448 -43614 -55294 -69033 -80978 -75021 -68074 -52558
14033e2558K8484J5304k5232N962P392L4133O224l625K5098O843Q950M745O103
$$ -52558 -24074 -8770 -34002 -28040 -20648 13485 19709 16084 41182 48025 56975 61720 67823
14020F7823j6876J1643j6525l8990k798J2135J936j2643k2274k5094j0682j0884
$$ 67823 50947 62590 46065 7075 4277 16412 18348 5705 -16569 -41663 -52345 -63229
14008f3229J899J3083L101K5998K5279M734J415J5770m161q493o692O72K8649
$$ -63229 -61330 -48247 -45146 -19148 6131 10865 12280 28050 23889 15396 8704 9376 38025
13995C8025L592q380n4293k4986j0023l9200k8206K1385M8888K4763j3560m1409
$$ 38025 41617 33237 -21056 -46042 -56065 -95265 -123471 -102086 -53198 -28435 -41995 -83404
13983h3404q253K5350N6232K4478j7534j6925P543O394j0892P696q635q440p27
$$ -83404 -91657 -66307 -10075 14403 -3131 -20056 -12513 -6119 -17011 -9315 -17950 -26390 -27117
13970b7117m754K3240k3546j2559k0494n97O93K512J2504L2326m525o770k3309
$$ -27117 -31871 -8631 -32177 -44736 -65230 -65827 -65134 -62622 -50118 -17792 -22317 -29087 -52396
13957e2396j5573L6567j674J1880J2306J8889j0833K145J1423K2978j0374j0276
$$ -52396 -67969 -31402 -33076 -21196 -8890 9999 -834 1311 12734 35712 25338 15062
13945A5062l1626O132K7839J3303j4796j4161k8996k8167M885L4372K3795l321
$$ 15062 -16564 -10432 17407 30710 15914 1753 -27243 -55410 -50525 -16153 7642 4321
13933D321k0665j7409j8648k0998J0718L3622L133J6501J9596o408j5840l3469
$$ 4321 -16344 -33753 -52401 -73399 -62681 -29059 -25926 -9425 10171 3763 -12077 -45546
13921d5546m133J1886K2225m695j5746n036N001P418j1268R332J316m061j9495
$$ -45546 -49679 -37793 -15568 -20263 -36009 -41045 -36044 -28626 -39894 -30562 -29246 -33307 -52802
13908e2802j6847p18J2664L1114K1772J0738n337J7992K565k958j1444K384q592
$$ -52802 -69649 -70367 -57703 -26589 -4817 5921 584 18576 21141 18183 6739 9123 531
13895E31j6039j0725J1316j104L493J1281K0600l471l3151Q916K1308J3204j8368
$$ 531 -15508 -26233 -14917 -16021 -12528 -1247 19353 15882 -17269 -8353 12955 26159 7791
13882G791j4811L723K8507K0003J8663J4580k56O935L0791p626J2803J761k2342
$$ 7791 -7020 -3297 25210 45213 63876 78456 78200 85135 115926 108300 121103 122864 100522
13869A00522k1935j5068j0q274J1796j1747M061k8173m71j7074p735k0625p202
$$ 100522 78587 63519 63509 55235 67031 55284 59345 31172 30701 13627 5892 -14733 -21935
13856b1935M3104K0444j6614j2760J1084k2344Q254k16K21j0883L519P162l7772
$$ -21935 21169 41613 24999 12239 23323 979 9233 9017 9238 -1645 1874 9036 -28736
13843b8736j7749L9150K4096l4058m3M7831Q26q028r749l252r455l3262J9733
$$ -28736 -46485 -7335 16761 -17297 -17340 30491 31317 23289 13540 10288 833 -32429 -12696
13830a2696O269j2418k7590Q807J5018O273J1733j3883l2630k6413J9878N8470
$$ -12696 -6427 -18845 -46435 -37628 -22610 -16337 -4604 -18487 -51117 -77530 -57652 818
13818H18k4378j9543N841Q547m245k1862m005K1842O717L1434n817L362q360j7681
$$ 818 -23560 -43103 -37262 -28715 -32960 -54822 -58827 -36985 -30268 1166 -4651 -1289 -9649 -27330
13804b7330k1979j1958J9664J6828o599O61j75J1822M295j1125k198Q787K5312
$$ -27330 -49309 -61267 -41603 -24775 -31374 -30713 -30888 -19066 -14771 -25896 -28094 -19307 6005
13791F005J3159q749j4576k1546k383J9066J089n012r349p576L2025L785j439
$$ 6005 19164 10415 -4161 -25707 -28090 -9024 -7935 -12947 -22296 -29872 2153 5938 4499
13778D499N293k1422r686K8260J4730k8357L499n683J8772j4487R288J5033j3057
$$ 4499 9792 -11630 -21316 6944 21674 -6683 -3184 -8867 9905 -4582 4706 19739 6682
13765F682j0383K2963j895n229q957j9960n011K2968P672j4449p856k0886j0568
$$ 6682 -3701 19262 17367 12138 3181 -16779 -21790 1178 8850 -5599 -13455 -34341 -44909
13752d4909K727N214p751p585K6151N41n085K5173j761l6363j7545J0292J9550
$$ -44909 -42182 -36968 -44719 -52304 -26153 -25612 -30697 -5524 -7285 -43648 -61193 -50901 -31351
13739c1351M2100J9135J0421o664k6895k7624K881M279P842j1191k36L6315n179
$$ -31351 10749 29884 40305 33641 6746 -20878 -17997 -13718 -5876 -17067 -17303 19012 13833
13726A3833j7942k1524p354J4521K1795o528j7468R38J8671o30Q531J1129l098
$$ 13833 -4109 -25633 -32987 -18466 3329 -3199 -20667 -19729 -1058 -1688 6843 17972 14874
13713A4874j5552j6443J1695J483n570P831J6843K503l6105n131L6535L6474j9933
$$ 14874 -678 -17121 -5426 -3943 -9513 -1682 15161 17664 -18441 -23572 12963 49437 29504
13700B9504k7391l0272J1745K7390j1260K546J0141j5597k2871l4894n558j0413
$$ 29504 2113 -28159 -16414 10976 -284 2262 12403 -3194 -26065 -60959 -66517 -76930
13688g6930n434J8942j38j2041O596l833l221N883j909J3859K3881O769L5004
$$ -76930 -82364 -63422 -63560 -75601 -69005 -72838 -76059 -70176 -72085 -58226 -34345 -27576 7428
13675G428j376j4838O917J0722J1847J628R007m0084k2099l112j7488j3383J3139
$$ 7428 6052 -8786 -1869 8853 20700 22328 31335 -8749 -30848 -33960 -51448 -64831 -51692
13662e1692R273N4076r982k1349r133Q684K6029Q994p184j8780j4348q340o0N492
$$ -51692 -42419 11657 1675 -19674 -28807 -20123 5906 14900 7716 -11064 -25412 -33752 -33812 -28320
13648b8320R844L786J3260J2053j4243N604M777P218J569J5342k8306n351k427
$$ -28320 -18476 -14690 -1430 10623 -3620 1984 6761 13979 15548 30890 2584 -2767 -5194
13635e194p685P684j0514L787L1984m946l8422k938K571P954M158K0256o444j8599
$$ -5194 -12879 -5195 -15709 -11922 20062 15116 -23306 -26244 -23673 -15719 -11561 8695 2251 -16348
13621a6348J6144J8128L630j184k383j6807j0251n1915j255M5011M7k5205Q179
$$ -16348 -204 17924 21554 20370 17987 1180 -9071 -60986 -62241 -17230 -17183 -42388 -34209
13608c4209K9076J1431J5770J6973j2998k4585p291J6812k039J6258k7155j1261
$$ -34209 -5133 6298 22068 39041 26043 1458 -5833 10979 8940 25198 -1957 -13218
13596a3218J0959k179L39M2316J5804k5385J0444J2476m153k5352j9258j4917
$$ -13218 -2259 -4438 -4099 38217 54021 28636 39080 51556 47403 22051 2793 -12124
13584a2124J7347K8288r178j1381J8808m2291r329J3598N996N799j4929q285q019
$$ -12124 5223 33511 24333 12952 31760 -10531 -19860 -6262 -266 5533 -9396 -17681 -25700
13571b5700R091J4530K3742J5111j8726k6129j6283j2773j750n04K1586J0876
$$ -25700 -16609 -2079 21663 36774 18048 -8081 -24364 -37137 -38887 -39391 -17805 -6929
13559f929J7577j798j5254r122J4551J2507L065L08k2434q965j33J2031m776O118
$$ -6929 10648 8850 -6404 -15526 -975 11532 14597 14905 -7529 -16494 -16627 -4596 -9372 -3254
13545c254J7049n07J1906L662j9713J7506K1349o629J0920m822J582k669O952
$$ -3254 13795 13288 25194 28856 9143 26649 47998 41369 52289 47467 49049 46380 53332
13532E3332J1503L99k4253j0570N014J449J3643j0405n05O21k7784J8735K6955
$$ 53332 64835 65234 40981 30411 35425 36874 50517 40112 39607 40228 12444 31179 58134
13519E8134k0175j2614Q525J5280J3984J8710j0921n4675m8092j2779Q771O149
$$ 58134 37959 25345 33870 49150 63134 81844 70923 16248 -31844 -44623 -35852 -29703
13507b9703K8198M0705K1630N664m080j1307J1750O57J0553M807l193M045j9251
$$ -29703 -1505 39200 60830 66494 62414 51107 62857 63514 74067 78874 75681 79726 60475
13494F0475l511j2889L588K9424J9787K195J927J8553k1134k4448K61M8783r241
$$ 60475 56964 44075 47663 77087 96874 99069 100996 119549 98415 73967 74228 123011 113770
13481A13770k1459p485J8523J4373J4674j1477L793q89k6541k9664J6446L0759
$$ 113770 92311 84826 103349 117722 132396 120919 124712 123823 97282 67618 84064 114823
13469A14823O04k0168j6125q069k0533m524j2909j2319k3656K2089K3485N256
$$ 114823 115427 95259 79134 71065 50532 46008 33099 20780 -2876 19213 42698 47954
13457D7954j5143l6608J583K9094L7292J3392O594n621k1673k9253p281m40j8536
$$ 47954 32811 -3797 -2214 26880 64172 77564 84158 78537 56864 27611 20330 19890 1354
13444A354J6697j1018j4503q847j156K8419N512J5986k134k2527K528K2138j6253
$$ 1354 18051 7033 -7470 -16317 -17473 10946 16458 32444 30310 7783 10311 32449 16196
13431A6196l0627O8Q684K6969r17j801J0495L328m4146q63J7561p672r049Q681
$$ 16196 -14431 -14363 -5679 21290 20373 18572 29067 32395 -11751 -12614 4947 -2725 -11774 -3093
13417c093J07j9266k768K4141Q43P931K1645j8326O537l959l3274j9511N2486
$$ -3093 -2986 -22252 -25020 -879 -36 7895 29540 11214 17751 13792 -19482 -38993 13493
13404A3493R758p791p359O254P656J9704j2733k1460J4713J2635k0037j5190M35
$$ 13493 23251 15460 8101 14355 22011 41715 28982 7522 22235 34870 14833 -357 78
13391G8N383J9423K2355L633j398n562O95k59M983k7555j1301K2093L0965r743
$$ 78 5461 24884 47239 50872 49474 43912 44607 44348 49331 21776 10475 32568 63533 53790
13377E3790k3943j959k7221n942K0201J4636j4798O507J1030m671m5911k5402
$$ 53790 29847 27888 667 -5275 14926 29562 14764 21271 32301 27630 -18281 -43683
13365d3683j1430L6692L6786J3329j4669o394n042m094k057m842L034Q414j157
$$ -43683 -55113 -18421 18365 31694 17025 10631 5589 1495 -562 -5404 -2370 6044 4887
13352D887l100K295M365j2466j6235J7292l1544k5071J5977J2455L4934J4669
$$ 4887 1787 4082 8447 -4019 -20254 -2962 -34506 -59577 -43600 -31145 3789 18458
13340A8458L353R144J3801k6790l2240j6496J6646O315K2119J5597l148j4278
$$ 18458 21811 30955 44756 17966 -14274 -30770 -14124 -7809 14310 29907 26759 12481
13328A2481j20k9558p129J8070j502j1720N968J0744J4471J3237q519l4449m383
$$ 12481 12361 -17197 -24326 -6256 -7758 -19478 -13510 -2766 11705 24942 16423 -18026 -22409
13315b2409L4794N33k4565J0063M5005K2831k173l9572m9619l1388L7120L1588
$$ -22409 12385 12918 -11647 -1584 43421 66252 64079 24507 -25112 -56500 -19380 12208
13303A2208j4607P360J2339l731j0796M17j62L1913l080j3879j1548P354L679
$$ 12208 -2399 4961 17300 13569 2773 3190 3028 34941 31861 17982 6434 13788 17467
13290A7467l0274J740n165o642J6969M293J7815j3763K708K3384k3655J1157q27
$$ 17467 -12807 -11067 -16232 -22874 -5905 -1612 16203 2440 5148 28532 4877 16034 15207
13277A5207P206j495l035o190l356R582K6443k139k7541p14K1915o537k9187K2955
$$ 15207 22413 20918 17883 11693 8337 17919 44362 42223 14682 13968 35883 29346 159 23114
13263B3114J6613k5501j9327J1026J7591k0289j0764R579K7791M980l4645l3720
$$ 23114 39727 14226 -5101 5925 23516 3227 -7537 2042 29833 34813 168 -33552
13251c3552L8526K5949J2225q287j4002l999k823J3415k603j2449L4888M825k2494
$$ -33552 4974 30923 43148 34861 20859 16860 14037 27452 24849 12400 47288 52113 29619
13238B9619K669M624N447l788j5373j5120L315N770J5289j9695j1810L1681J6051
$$ 29619 32288 36912 42359 38571 23198 8078 11393 17163 32452 12757 947 32628 48679
13225D8679J46o978j6179o752Q068J055j7339J6593J8503j8371j4838P482K2880
$$ 48679 48825 41847 25668 18916 26984 28039 10700 27293 45796 27425 12587 20069 42949
13212D2949J420k0438j1800J6236K4136K2891K028k0669j8196P669J1646K4899
$$ 42949 44369 23931 12131 28367 52503 75394 77422 56753 38557 46226 57872 82771
13200H2771j1461Q620J1033r083M854J653p499m611j0817j7019j8615j0426L0299
$$ 82771 71310 79930 90963 81880 86734 88387 80888 76277 65460 48441 29826 19400 49699
13187D9699J8504J9620R990j263j3035J4038j4445k3148k3390j358J7321K1506
$$ 49699 68203 87823 97813 96550 83515 97553 83108 59960 36570 35212 52533 74039
13175G4039j4855J0190Q814j1412j8937J4744M2042m979l5987k3877K099O516
$$ 74039 59184 69374 78188 66776 47839 62583 104625 99646 63659 39782 41881 48397
13163D8397o513l2768P187n279m58N180J0711J2840K5927J4161k439n555r683
$$ 48397 41884 9116 16303 11024 10566 15746 26457 39297 65224 79385 76946 71391 61708
13150F1708j1737l593j0852j5832J3509K6662j31o910n372J040J2836r320k4313
$$ 61708 49971 46378 35526 19694 33203 59865 59734 52824 47452 48492 61328 52008 27695
13137B7695k6376O617J7887k9522K1990M0736M786q249J0636j0952O92p043M011
$$ 27695 1319 7936 25823 -3699 18291 59027 63813 55564 66200 55248 55940 48897 52908
13124E2908j1151j1573J0517j0794k4924k807K3340L8413L1434j4232k5447j6433
$$ 52908 41757 30184 40701 29907 4983 2176 25516 63929 95363 81131 55684 39251
13112C9251p068o167j4045p7K452J6791O210P100N189K134K0619J158J8462j3318
$$ 39251 32183 26016 11971 11894 14346 31137 37347 44447 49636 51770 72389 73547 92009 78691
13098G8691N878n470k6937K713j0174r445P883N759K7701k580j4663J2922k3748
$$ 78691 84569 79099 52162 54875 44701 35256 43139 48898 76599 74019 59356 72278 48530
13085D8530j1458R079K3738P028J200k4449O166J6167J747k828J5478J8938N4035
$$ 48530 37072 46151 69889 76917 78117 53668 59834 76001 77748 74920 90398 109336 163371
13072A63371k373n299j3495J3225j475l430L0119N885Q394o642J325r262K1918
$$ 163371 160998 155699 142204 155429 153954 150524 180643 186528 194922 188280 189605 180343 202261
13059B02261J9994j0814n431N756P712L9101J2704J2526J666k9753M3352L8824
$$ 202261 222255 211441 206010 211766 219478 258579 271283 283809 285475 255722 299074 337898
13047C37898k319Q662j2684k3919j4713j0965l753L0914K1910K588j4846j9657
$$ 337898 335579 344241 331557 307638 292925 281960 278207 309121 331031 333619 318773 299116
13035B99116m499O162K2667j8290j1461N04q063O140j5979j3562J625j0069Q928
$$ 299116 294617 300779 323446 305156 293695 294199 286136 292276 276297 262735 264360 254291 263219
13022B63219J0893K170n063J0033r84j4634K1202L2979L9930L0021J7636P6765
$$ 263219 274112 276282 271219 281252 280268 265634 286836 319815 359745 389766 407402 484167
13010D84167P8012Q6796J60647J85384K09033K43636K14805J50013Q9434Q732
$$ 484167 562179 648975 809622 995006 1204039 1447675 1662480 1812493 1901927 1910659
13000A910659o3282j50592k12780k30550k04971j85454j69346j20214p6132m4398
$$ 1910659 1847377 1696785 1484005 1253455 1048484 863030 693684 573470 497338 452940
12990D52940l8273o6953m4266O820j3635k632j397o947O803l3289j8814j6106
$$ 452940 414667 347714 303448 310268 296633 294001 292604 285657 292460 259171 240357 224251
12978B24251J1983l757n438j1472l0047n32K3117J73K736m879J0503j1706k2336
$$ 224251 236234 232477 227039 215567 185520 184988 208105 208278 211014 206135 216638 204932 182596
12965A82596J4185l3392j1329q571j4586N665J5100k3143j8487J5783J9551k555
$$ 182596 196781 163389 152060 143489 128903 134568 149668 126525 108038 123821 143372 140817
12953A40817R966J5843n981q829n5824j8516J2074p836J0832K8009o825K5268
$$ 140817 150783 166626 160645 151816 95992 77476 89550 81714 92546 120555 113730 138998
12941A38998J8689k1775k5424j5876j491K3848L346j0119l0174Q311J2861k3412
$$ 138998 157687 135912 110488 94612 93121 116969 120315 110196 80022 88333 101194 77782
12929G7782j4642K5246M066J0918K5240N73m4406k826k8846k4843K4269M0761
$$ 77782 63140 88386 92452 103370 128610 129183 84777 81951 53105 28262 52531 93292
12917I3292P854j3840Q267o548K3344L0702j9506J734k526q375J3970J7397m449
$$ 93292 101146 87306 95573 89025 112369 143071 123565 125299 122773 114398 128368 145765 141316
12904A41316M537J4645J6664P654L924L3061K2527j2994l8598Q910j1827k8758
$$ 141316 145853 160498 177162 184816 188740 221801 244328 231334 192736 201646 189819 161061
12892A61061j0355m719k0160j8608K4903Q339K9403R564l6526l3126l0918r059
$$ 161061 150706 145987 125827 107219 132122 140461 169864 179428 142902 109776 78858 69799
12880F9799M0933Q616j6917q044N817K7206J0267q467L181j0943k8084l713K9680
$$ 69799 110732 119348 102431 94387 100204 127410 137677 129210 132391 121448 93364 89651 119331
12867A19331N927J6823J3698k1181j8229O481Q765L0451r18k2715j0322q639J1620
$$ 119331 125258 142081 155779 134598 116369 122850 131615 162066 161148 138433 128111 119472 131092
12854A31092Q285k6557J1316j378n226m629J046L4390K1201j2550P87K0361J7500
$$ 131092 139377 112820 124136 122758 117532 112903 113949 148339 169540 156990 157777 178138 195638
12841A95638K0768J2566J9889K2195M3452K2613O2950K9819K1314J6681P385j4158
$$ 195638 216406 228972 248861 271056 314508 337121 400071 429890 451204 467885 475270 461112
12829D61112k1708j8352k3870j527l1978m7444k1709j9041j7075l54k4414j5215
$$ 461112 439404 421052 397182 395655 363677 316233 294524 275483 258408 258054 233640 218425
12817B18425J4726q997Q141L962K5039k3101r511K69L273r680K492Q746K4157
$$ 218425 233151 224154 232295 236257 261296 238195 228684 228953 232226 222546 225038 233784 257941
12804B57941R017j7446N054J8043o993k234j91l0596L4498l347j7591p597M015
$$ 257941 266958 249512 254566 272609 265616 263382 263191 232595 267093 263746 246155 238558 242573
12791B42573J647K2283j460m5788L0616Q343j0437k3494J267J598l2945k3032
$$ 242573 244220 266503 265043 219255 249871 258214 247777 224283 225550 227148 194203 171171
12779A71171K2344L723M5088J1357m8193j1885L7470M0955J2248L920K019P627
$$ 171171 193515 197238 242326 253683 205490 193605 231075 272030 284278 288198 290217 297844
12767B97844m6410k8736q433j4785N455m339K1180K9871K6202K4908J8718J1534
$$ 297844 251434 222698 214265 199480 204935 200596 221776 251647 277849 302757 321475 333009
12755C33009j7855k1903p907m378P424K3245J8674P984q958L740J9155K4509n088
$$ 333009 315154 293251 285344 280966 288390 311635 330309 338293 329335 333075 352230 376739 371651
12742C71651m6308O328K0054l4819l0215k5148l754K2713J0812K4764J9134P145
$$ 371651 325343 331671 351725 316906 286691 261543 257789 280502 291314 316078 335212 342357
12730C42357j923L4172O9058M23r509n131l118M419O260j4239o476j14j6337K056
$$ 342357 340434 374606 443664 444087 434578 429447 426329 430748 437008 422769 416293 416179 399842 401898
12716D01898o750j500q806k3942q588k503j8929K3085K9236Q883j799n107J1006
$$ 401898 395148 393648 384842 360900 352312 349809 330880 353965 383201 392084 390285 385178 396184
12703C96184J7010L076r794K334j4673P987J779l207L8793K9243K6742O740J3852
$$ 396184 413194 416270 406476 408810 394137 402124 403903 400696 439489 468732 495474 502214 516066
12690E16066K2293K0160J0776M5563L5520J0579L3519J6965J714L0540K5695j3679
$$ 516066 538359 558519 569295 614858 650378 660957 694476 711441 713155 743695 769390 755711
12678G55711J164J2921K6894L5685P616k3496j2120N662M4924O6386P0931P8236
$$ 755711 756875 769796 796690 832375 839991 816495 804375 810037 854961 921347 992278 1070514
12666A070514M8546J9323L5788O4577L3678L3112O9889L2497L0629M514J1285
$$ 1070514 1119060 1138383 1174171 1238748 1272426 1305538 1375427 1407924 1438553 1443067 1454352
12655A454352L1173K1285J7096K4381j2595j3661m2143j3868L3681L3306L526
$$ 1454352 1485525 1506810 1523906 1548287 1535692 1522031 1479888 1466020 1499701 1533007 1536533
12644A536533K3982M9962J4287K3066K6598N1542P4025R2303J18924R3308N5625
$$ 1536533 1560515 1610477 1624764 1647830 1674428 1725970 1799995 1892298 2011222 2104530 2160155
12633B160155R1032J15260J20845J05530J01462R0401O9272L3461K0540N835N2597
$$ 2160155 2251187 2366447 2487292 2592822 2694284 2784685 2853957 2887418 2907958 2913793 2966390
12622B966390Q0708P7529R4967J50935J89497J85449J51468J27049R5570O7205
$$ 2966390 3047098 3124627 3219594 3370529 3560026 3745475 3896943 4023992 4119562 4186767
12612D186767J04876J18229J00142J19405J55753J91711K55154L26678L99076
$$ 4186767 4291643 4409872 4510014 4629419 4785172 4976883 5232037 5558715 5957791
12603E957791M50720M96568O06692P03833Q65005R91781J169547J399855J666310
$$ 5957791 6408511 6905079 7511771 8215604 9080609 10072390 11241937 12641792 14308102
12594A4308102J974280K334447K759668L326351M208697N403702P214669J0161791
$$ 14308102 16282382 18616829 21376497 24702848 28911545 34315247 41529916 51691707
12586E1691707J4770168K1394526K8978131L5611858M1369330M5802004M3818052
$$ 51691707 66461875 87856401 116834532 152446390 193815720 239617724 283435776
12579B83435776L3031827J9868775Q022464p826571k6675097l8576831m0254954
$$ 283435776 316467603 336336378 344358842 336532271 309857174 271280343 231025389
12572B31025389l9393185l7825161l2130554k3263414j5825224j0933714p934834
$$ 231025389 191632204 153807043 121676489 98413075 82587851 71654137 63719303
12565F3719303o017618m751268l902629l271437k796160k486007k211050j973320
$$ 63719303 57701685 52950417 49047788 45776351 42980191 40494184 38283134 36309814
12557C6309814j777879j635649j470352j361985j245392j217262j161854j077159
$$ 36309814 34531935 32896286 31425934 30063949 28818557 27601295 26439441 25362282
12549B5362282j047825j011468r74946r47069r15707q86114q56722p94862p00303
$$ 25362282 24314457 23302989 22328043 21380974 20465267 19579153 18722431 17927569 17227266
12540A7227266o91487o65051n86241n12952m66598m42779m41222m21896l98444
$$ 17227266 16535779 15870728 15284487 14771535 14304937 13862158 13420936 12999040 12600596
12531A2600596m09615l88948l97790l97204l72015l32243l69650l50755l18248
$$ 12600596 12190981 11802033 11404243 11007039 10635024 10302781 9933131 9582376 9264128
12522I264128k45924k24117k58318k62856k47841k42354k28838k19914j91789
$$ 9264128 9018204 8794087 8535769 8272913 8025072 7782718 7553880 7333966 7142177
12513G142177j97074j83735j88295j95796j68628j38498j38178j60214j94157
$$ 7142177 6945103 6761368 6573073 6377277 6208649 6070151 5931973 5771759 5577602
12504E577602k16028j64024j56628j43229j50255j67442j45141j37778j23531
$$ 5577602 5361574 5197550 5040922 4897693 4747438 4579996 4434855 4297077 4173546
12495D173546j21813r9498j06822q6855j01873r5946r0972p2964k4566l8472n3057
$$ 4173546 4051733 3952235 3845413 3758558 3656685 3560739 3469767 3396803 3372237 3333765 3280708
12484C280708o4788n6548o1211l7181n7556r6869q7549o0023n3319n5613k6982
$$ 3280708 3215920 3159372 3098161 3060980 3003424 2906555 2819006 2758983 2705664 2650051 2623069
12473B623069k2493k3682l4595n6458q4241o5725l4000l5737o5841o4335m7327
$$ 2623069 2600576 2576894 2542299 2485841 2401600 2335875 2301875 2266138 2200297 2135962 2088635
12462B088635p9436r3280n6104p2047l4853l2450n7205j7987j3710k1124o459
$$ 2088635 2009199 1915919 1859815 1787768 1752915 1720465 1663260 1645273 1631563 1610439 1603980
12451A603980l1188o5228o5650p0625n8581k1009k2012o0536m4711p4779n2123
$$ 1603980 1572792 1507564 1441914 1371289 1312708 1291699 1269687 1209151 1164440 1089661 1037538
12440A037538r274l7646m4708m1622k1687j4882l2850k7476l917J3115Q754j1610
$$ 1037538 1028264 990618 945910 904288 882601 867719 834869 807393 803476 816591 825345 813735
12428H13735n438l213L090J4337J6474Q590J0121R60o84j4082k8778l069k183
$$ 813735 808297 805084 808174 822511 838985 847575 857696 858656 857972 843890 815112 812043 809860
12415H09860j8502N521J4711r362q383m473P091k5470j1460K765j6228Q840J3030
$$ 809860 791358 796879 811590 802228 793845 789372 796463 770993 759533 762298 746070 754910 767940
12402G67940K995j0626j0083J5851K6184M2109K5537J2972J1882L792L0714K2334
$$ 767940 770935 760309 750226 766077 792261 834370 859907 872879 884761 888553 919267 941601
12390I41601r20K633R904l0244J2650J6331J4706P1164J01219J13591Q5234M9413
$$ 941601 940681 943314 953218 922974 935624 951955 966661 1037825 1139044 1252635 1337869 1387282
12378A387282M0734k2633p1923m7156m8213j6376J6313K4319K4742J9433J2579
$$ 1387282 1428016 1405383 1333460 1286304 1238091 1221715 1238028 1262347 1287089 1306522 1319101
12367A319101J1785L1147K6208P849k113k194P602j616M8131L8653L8012j779
$$ 1319101 1330886 1362033 1388241 1396090 1393977 1391783 1399385 1397769 1445900 1484553 1522565 1520786
12355A520786J9779j445l566l444K265N4916J03125P2989R9573J43922J70052
$$ 1520786 1540565 1539120 1535554 1532110 1534375 1589291 1692416 1765405 1864978 2008900 2178952
12344B178952J75808J26721P0436j1257j20409j62209j51438j26354r2104n3163
$$ 2178952 2354760 2481481 2551917 2540660 2420251 2258042 2106604 1980250 1888146 1834983
12334A834983l6992l8995j2868L9866K7301J4514j2742l1658k3515k9665k1352
$$ 1834983 1797991 1758996 1746128 1785994 1813295 1827809 1815067 1783409 1759894 1730229 1708877
12323A708877j4042J3842r731L6883L3864j0921k7589j3972j0948k541O338J9636
$$ 1708877 1694835 1708677 1698946 1735829 1769693 1758772 1731183 1717211 1706263 1703722 1710060 1729696
12311A729696L9681P5569Q7457R5109J02811Q5764N5392l105n0481r5887n3463
$$ 1729696 1769377 1844946 1932403 2027512 2130323 2216087 2271479 2268374 2217893 2122006 2068543
12300B068543j0945O2085M8868K5903M1105N1599M9214M5133N5361Q2281Q2995
$$ 2068543 2057598 2119683 2168551 2194454 2235559 2287158 2336372 2381505 2436866 2519147 2602142
12289B602142O3374P2755R0135J20844J04302J10918Q8677R2450J33455J29794
$$ 2602142 2665516 2738271 2828406 2949250 3053552 3164470 3253147 3345597 3479052 3608846
12279C608846J30454J89398J76927J80548K09617K57073K74161K81612L28303
$$ 3608846 3739300 3928698 4105625 4286173 4495790 4752863 5027024 5308636 5636939
12270E636939L36093L22819L18353K97555L03948K91375L15936M10706M80490
$$ 5636939 5973032 6295851 6614204 6911759 7215707 7507082 7823018 8233724 8714214
12261H714214N77462O83485Q12508R45997J090067J178524J236287J270679J297742
$$ 8714214 9291676 9975161 10787669 11733666 12823733 14002257 15238544 16509223 17806965
12252A7806965J258701J248917J252413J276649J359990J475607J704964J940888
$$ 17806965 19065666 20314583 21566996 22843645 24203635 25679242 27384206 29325094
12244B9325094K283206K804558L478533M267430N046653N594139N824802N682335
$$ 29325094 31608300 34412858 37891391 42158821 47205474 52799613 58624415 64306750
12236F4306750N213174M428022L690031L212465K856641K423665J896974J382135
$$ 64306750 69519924 73947946 77637977 80850442 83707083 86130748 88027722 89409857
12228H9409857R62590Q53535J035295J308784J487495J551078J586374J740119
$$ 89409857 90372447 91225982 92261277 93570061 95057556 96608634 98195008 99935127
12220I9935127J995835K418231K963320L535780M054527M370285M542465M598544
$$ 99935127 101930962 104349193 107312513 110848293 114902820 119273105 123815570 128414114
12212A28414114M528367M396424M193453L955601L630448L149166K622509K292732
$$ 128414114 132942481 137338905 141532358 145487959 149118407 152267573 154890082 157182814
12204A57182814K053568J709128J365759J111791Q88528N16223J00833k37165
$$ 157182814 159236382 160945510 162311269 163423060 164311588 164827811 164928644 164691479
12196A64691479m88171r93227j612344k184211k703068l131577l528765l731589
$$ 164691479 164203308 163210081 161597737 159413526 156710458 153578881 150050116 146318527
12188A46318527l769894l726235l670391l478161l066913k550629k056023j644177
$$ 146318527 142548633 138822398 135152007 131673846 128606933 126056304 124000281 122356104
12180A22356104j317224j119406r76096q57159p50396o40712n45734n89659r42749
$$ 122356104 121038880 119919474 118943378 118086219 117335823 116695111 116149377 115559718 114616969
12171A14616969j462527k044443k568938l003089l369705l898598m514105n186402
$$ 114616969 113154442 111109999 108541061 105537972 102168267 98269669 93755564 88569162
12163H8569162n792163o047179n646103m813493l917253l199355k617575k293460
$$ 88569162 82776999 76729820 71083717 66270224 62352971 59153616 56536041 54242581
12155E4242581k012259j779072j687471j658094j587049j528371j535676j629289
$$ 54242581 52230322 50451250 48763779 47105685 45518636 43990265 42454589 40825300
12147D0825300j743584j782437j793608j780554j688961j570236j435228j280118
$$ 40825300 39081716 37299279 35505671 33725117 32036156 30465920 29030692 27750574
12139B7750574j164986j023368q88759q15670p88199p83187p57711p58355p62992
$$ 27750574 26585588 25562220 24673461 23857791 23069592 22286405 21528694 20770339 20007347
12130B0007347p84292p67253p19511o47645n90385o01626n20154m53163m60095
$$ 20007347 19223055 18455802 17736291 17088646 16498261 15896635 15376481 14923318 14463223
12121A4463223m75397m52745m28286m06763l72402l77607l79783l66921l22342
$$ 14463223 13987826 13535081 13106795 12700032 12327630 11950023 11570240 11203319 10880977
12112A0880977l39544l42535l12461k98879k91589k77994k37343k41556k35413
$$ 10880977 10541433 10198898 9886437 9587558 9295969 9017975 8780632 8539076 8303663
12103H303663k56048k38271k32940k59006k38393k23750k07222j91422j64224
$$ 8303663 8047615 7809344 7576404 7317398 7079005 6855255 6648033 6456611 6292387
12094F292387j98350j94117j98008j71114j89635j59460j37431j44917j55852
$$ 6292387 6094037 5899920 5701912 5530798 5341163 5181703 5044272 4899355 4743503
12085D743503j25289j17921j20267j10620j42186j09989j12590j06701r8900q7849
$$ 4743503 4618214 4500293 4380026 4269406 4127220 4017231 3904641 3797940 3699040 3611191
12075C611191j30511r8851r0596r5020j08809r8017q7753q0021q8845j00016r1295
$$ 3611191 3480680 3381829 3291233 3196213 3087404 2989387 2901634 2821613 2732768 2632752 2541457
12064B541457p0574n0591n8474o7869n4855l9853q3905o8229l6189q8120q0018
$$ 2541457 2470883 2420292 2361818 2293949 2239094 2199241 2115336 2047107 2010918 1922798 1842780
12053A842780m8799l5503l1195m1233n2896l2160m8654p3212o4437j7882j2746
$$ 1842780 1793981 1758478 1727283 1686050 1633154 1600994 1552340 1479128 1414691 1396809 1384063
12042A384063l3342k8410l4541l1770l6987k3831l4550j8948K98m145j0119j7354
$$ 1384063 1350721 1322311 1287770 1256000 1219013 1195182 1160632 1141684 1141982 1137837 1127718 1110364
12030A110364m297p210m1687l4503K2183k8650n0581l2000o451m8093n5400J4818
$$ 1110364 1106067 1098857 1057170 1022667 1044850 1016200 965619 933619 927168 879075 823675 838493
12018H38493L5692j0507n5988m7104p820p340m1789R631k1875j3618K4492j0768
$$ 838493 874185 863678 807690 760586 752766 745426 703637 713268 691393 677775 702267 691499
12006F91499l9223l8608j3867J4120q442L597L0520j2068n254J1199K565p620
$$ 691499 652276 613668 599801 613921 605479 609076 639596 627528 622274 633473 636038 628418
11994F28418l6299k2020m566K1800p527n131m316m1408l6295L870J1605q780m428
$$ 628418 592119 570099 565533 587333 579806 574675 570359 528951 492656 496526 508131 499351 494923
11981D94923N057j199L0330L391l3185k0462j9488j1907j1014k3533j6579j9792
$$ 494923 499980 498781 529111 532502 499317 478855 459367 447460 436446 412913 396334 376542
11969C76542L3967j1044L867j0917q704K164J4030J612L765j1192k7167n8l9999
$$ 376542 410509 399465 403332 392415 383711 385875 399905 401517 405282 394090 366923 366865 326866
11956C26866J6210J5873j6082J5718J21j0813j6376j0191o030m818k898l7691
$$ 326866 343076 358949 342867 358585 358706 347893 331517 321326 315296 310478 307580 269889
11944B69889k2743j5581J8025K5149k7705J4439K4327P236l5287R244j6124O248
$$ 269889 247146 231565 249590 274739 247034 261473 285800 293036 257749 266993 250869 257117
11932B57117K2150J5600Q707n1765j3237J0704N404r606l1075j9243m627j1934
$$ 257117 279267 294867 303574 251809 238572 249276 254680 245074 213999 194756 190129 178195
11920A78195k399m388R81K421r186j4481r527K7576j0932r838N820M298K3164
$$ 178195 175796 171408 172389 174810 165624 151143 141616 169192 158260 148422 154242 158540 181704
11907A81704K1306Q438j304l5620j9948K4337L0718K4376l4631k0268K0134L653
$$ 181704 203010 211448 210144 174524 154576 178913 209631 234007 199376 179108 199242 202895
11895B02895L7439k357k3210L75J5659l0003J4518Q022J0212k4049l620J6408
$$ 202895 240334 237977 214767 215142 230801 200798 215316 223338 233550 209501 205881 222289
11883B22289K0092N587Q377J836m426n133p199j690j2102l681n309l643K0971
$$ 222289 242381 247968 256345 258181 253755 248622 241423 239733 227631 223950 218641 214998 235969
11870B35969R623L9841J9447J4924j9548j4752n891M928n390j109l679J1286q930
$$ 235969 245592 285433 304880 319804 300256 285504 279613 284541 279151 278042 274363 285649 276719
11857B76719J2774J0841n032k5423J5357R106R336j132q050n345J4891K2095R953
$$ 276719 289493 300334 295302 269879 285236 294342 303678 302546 294496 289151 304042 326137 336090
11844C36090r555J4189P474J0659K9630M017K023M365N258J8093O599n074j9499
$$ 336090 326535 340724 348198 358857 388487 392504 394527 398892 404150 422243 428842 423768 404269
11831D04269p164J2054K1293R273r008k0960K1695O151r418O726k406q646k4241
$$ 404269 397105 409159 430452 439725 430717 409757 431452 437603 428185 434911 432505 423859 399618
11818C99618J4454M564K1284L7811L5044l099k0645N319M6677K9636J7605N900
$$ 399618 414072 418636 439920 477731 512775 509676 489031 494350 541027 570663 588268 594168
11806E94168J2387M0237L8507K8502K5099q768k279J5698M1155K9053R999M918
$$ 594168 606555 646792 685299 713801 738900 730132 727853 743551 784706 813759 823758 828676
11794H28676j0410j3568P414O463K2943K825M835L901J5255J341j089K0898M2648
$$ 828676 818266 804698 812112 818575 841518 844343 849178 853079 868334 869675 868586 889484 932132
11781I32132K3095J7259J5920M1330M5048L3877K5518K415K69n760Q322J4052
$$ 932132 955227 972486 988406 1029736 1074784 1108661 1134179 1136594 1136863 1131103 1139425 1153477
11769A153477K3371L1012K4602n946J702J615J4009N687J7472L9041O4868L5194
$$ 1153477 1176848 1207860 1232462 1226516 1228218 1229833 1243842 1249529 1267001 1306042 1370910 1406104
11757A406104J1412r966l1295o3013k7479j8178l4348l9486l4984k3877k8545
$$ 1406104 1417516 1407550 1376255 1313242 1285763 1267585 1233237 1193751 1158767 1134890 1106345
11746A106345l5667j6172k1346q057J0872J4287N6355L9812j1544o5456J2295
$$ 1106345 1070678 1054506 1033160 1025103 1035975 1050262 1106617 1146429 1134885 1069429 1081724
11735A081724J2782K1776J6417M652J6756K9024k2844j8942L017p527j6548P50
$$ 1081724 1094506 1116282 1132699 1137351 1154107 1183131 1160287 1141345 1144362 1136835 1120287 1121037
11723A121037K702J6266R155r442n0898m9622R218j5068k3365k7503k185k2194
$$ 1121037 1123739 1140005 1149160 1139718 1088820 1039198 1048416 1033348 1009983 982480 980295 958101
11711I58101k3419l6351n8012n6309j4604K0602q495m5188k8758j7965J107k301
$$ 958101 934682 898331 840319 784010 769406 790008 781513 736325 707567 689602 690709 688408
11699F88408j2366k55Q466J5635K208j0146j6967J9917m935K14l4543k6699l1460
$$ 688408 676042 675787 684253 699888 702096 691950 674983 694900 689965 690179 655636 628937 597477
11686E97477l9251m6725K088j7402l5932k5678m1838j9649k4382j7182j2163O135
$$ 597477 558226 511501 513589 496187 460255 434577 392739 373090 348708 331526 319363 325498
11674C25498j3981m0985k6424l5808J1586J110m6297k130L0880j0573j4482o766
$$ 325498 311517 270532 244108 208300 219886 220996 174699 172569 203449 192876 178394 171628
11662A71628L615K3354J5738j0791m5855m7716k4076J0176J5744L5368O114j4283
$$ 171628 175243 198597 214335 203544 157689 109973 85897 96073 111817 147185 153299 139016
11650A39016j9376J0757j7089j5472k0336J4086k720r071p7n811N610q855l6012
$$ 139016 119640 130397 113308 97836 77500 91586 88866 79795 79718 73907 79517 70662 34650
11637C4650N576K7901J493k1297l4176J179L6184J3750k361k0005L768K3355N44
$$ 34650 40226 68127 69620 48323 14147 15326 51510 65260 62899 42894 46662 70017 70561
11624G0561R13P239K0280L097j0647m2456j2327J8649R152r548k3916j418l703
$$ 70561 71474 78713 98993 102090 91443 48987 36660 55309 64461 54913 30997 29579 25876
11611B5876r603j1631k0276j4977J6050N9152J9489j3701j7572m825l0003j0928
$$ 25876 16273 4642 -15634 -30611 -14561 44591 64080 50379 32807 27982 -2021 -12949
11599a2949q158M9237J4955j9506Q227J9062J6919k6081k5939P595K3684L1252
$$ -12949 -21107 28130 43085 23579 31806 50868 67787 41706 15767 23362 47046 78298
11587G8298k151m4867j839J0139K878J4979q572j3035m3982k222K5434p137J1698
$$ 78298 76147 31280 29441 39580 42458 57437 48865 35830 -8152 -10374 15060 7923 19621
11574A9621N839j1185P066N738O542J3023J9199J9095J6793L6573j0876k2609
$$ 19621 25460 14275 21341 27079 33621 46644 65843 84938 101731 138304 127428 104819
11562A04819k0738J2416J253J5381L8282L451k0174j0713j3067j3958j8492o566
$$ 104819 84081 96497 97750 113131 151413 154864 134690 123977 110910 96952 78460 71894
11550G1894R097m092J5679K2114k3894l2439j6167M7343j412j6971j4252k9109
$$ 71894 80991 76899 92578 114692 90798 58359 42192 89535 88123 71152 56900 27791
11538B7791j2362k507M952J3833J5768Q170K6625j0132N535J9865j0752R719J369
$$ 27791 15429 12922 17874 31707 47475 55645 82270 72138 77673 97538 86786 96505 97874
11525I7874j2285m388j7547R334K9931q451k0471m1248j4230l683J1960L8863
$$ 97874 85589 81201 63654 72988 102919 94468 73997 32749 18519 14836 26796 65659
11513F5659J5871N481K9916l546K451j3833p505J3251L4153J8277K2758M0065
$$ 65659 81530 87011 116927 113381 115832 101999 94494 107745 141898 160175 182933 222998
11501B22998M0098L0813M0210O2923O7093K3974J9492O960j8419J117l2493j212
$$ 222998 263096 293909 334119 397042 464135 488109 507601 514561 496142 497259 464766 463554
11489D63554K7322j2582j8636j2980l0164l2928l3321j9997l2780n1356l9270
$$ 463554 490876 478294 459658 446678 416514 383586 350265 330268 297488 246132 206862
11478B06862j1927J3099j3111j0832q011r31K3442l1441j1100Q85K3445J9117
$$ 206862 194935 208034 194923 184091 176080 175149 198591 167150 156050 156935 180380 199497
11466A99497k3711k406l9725j4211M9196M2630M8604L4224J0697L3990L5632M1908
$$ 199497 175786 173380 133655 119444 168640 211270 259874 294098 304795 338785 374417 416325
11454D16325J9032r666l8811m3511k6941j3098k8735l1918k0157j8593k8195l3801
$$ 416325 435357 425691 386880 343369 316428 303330 274595 242677 222520 203927 175732 141931
11442A41931L883J1417K6363K1342L6300J0553K6441P954R157J9232L3399N4666
$$ 141931 145814 157231 183594 204936 241236 251789 278230 286184 295341 314573 347972 402638
11430D02638Q025j8048k5866m4123m0141n1400m1819l0606r814p093M705Q183
$$ 402638 410663 392615 366749 322626 282485 231085 189266 158660 148846 141753 146458 154641
11418A54641k7095j4374j0391q888l2142m646K8307j0801K3239L1277P489k7243
$$ 154641 127546 113172 102781 93893 61751 57105 85412 74611 97850 129127 136616 109373
11406A09373r209j2646j5539J2557L4663J8447r745J988l409M85J5181L8890k0625
$$ 109373 100164 87518 71979 84536 119199 137646 127901 129889 126480 126965 142146 181036 160411
11393A60411j6938k5860m178J1025Q449K1227J8433p478k7664k3539p435k341
$$ 160411 143473 117613 113435 124460 132909 154136 172569 165091 137427 113888 106453 104112
11381A04112m08L131r898j411J2373n309m408K877J5013j564R692n50m90J8320
$$ 104112 103704 106835 96937 95526 107899 102590 98182 101059 116072 114508 124200 123650 123160 141480
11367A41480K0239L629j9556J7885J1757l9208j5749l0822m0781j1891K8359K3658
$$ 141480 161719 165348 145792 163677 175434 136226 120477 89655 48874 36983 65342 89000
11355H9000J5242j9736l6069N164M3921J4799j8471j2950J1517o478j1050M405
$$ 89000 104242 84506 48437 53601 97522 112321 93850 80900 92417 85939 74889 79294
11343G9294j4866m3700j1102J5062K5759j9549J6997K5575M47o849m179j4362
$$ 79294 64428 20728 9626 24688 50447 30898 47895 73470 73917 67068 62889 48527
11331D8527n125j2450j8262j7262j1713j5109K5949J4468L135J7336K0854N360
$$ 48527 43402 30952 12690 -4572 -16285 -31394 -5445 9023 12158 29494 50348 55708
11319E5708j8522r568j0794j0990r594J4537L5847K0587p782j4386k448k8448
$$ 55708 37186 27618 16824 5834 -3760 10777 46624 67211 59429 45043 42595 14147
11307A4147J5581j364k7245M236n971J6717Q012k5387k431R199K2698J8819R582
$$ 14147 29728 28364 1119 5355 -616 16101 24113 -1274 -3705 5494 28192 47011 56593
11294E6593P413n210l3478P304k0161Q167K2906R492j0750k4353q901m315J1693
$$ 56593 64006 58796 25318 32622 12461 20628 43534 53026 42276 17923 9022 4707 16400
11281A6400P012k8061n219r90k1536q239M4261J2637k5793k2461L683N350J0995
$$ 16400 23412 -4649 -9868 -10858 -32394 -40633 3628 16265 -9528 -31989 -28306 -22956 -11961
11268a1961J6773J1296L5200P960l3204j137k134k1727k2305l4634Q256L0943
$$ -11961 4812 16108 51308 59268 26064 24927 22793 1066 -21239 -55873 -47617 -16674
11256a6674K0335N345N720J3478K1034K4946j5768k5375j472j0671J3053p535
$$ -16674 3661 9006 14726 28204 49238 74184 58416 33041 31569 20898 33951 26416
11244B6416o11q702Q533K8833J5925j3246r121k3336k4022n99J0610o937j5330
$$ 26416 25805 17103 25636 54469 70394 57148 48027 24691 669 70 10680 3743 -11587
11231a1587J6585j2583M0870K5457j3320l1394k5113J7377K3231K93J2408j8342
$$ -11587 4998 -7585 33285 58742 45422 14028 -11085 6292 29523 29816 42224 23882
11219B3882Q443J3578k197n054j8539R865j1626l117J6115L151Q736J1379p868
$$ 23882 32325 45903 43706 38652 20113 29978 18352 15235 31350 34501 43237 54616 46748
11206D6748k5912k4216M126J6532o968j9192J5390J0061j1916L798k0395K4456
$$ 46748 20836 -3380 746 17278 10310 -8882 6508 16569 4653 8451 -11944 12512
11194A2512K1225j0560p951j0123J4601r057r618J2933l894k036J8289J6700J7434
$$ 12512 33737 23177 15226 5103 19704 10647 1029 13962 10068 8032 26321 43021 60455
11181F0455K156l266o827l7065j9472L468k650J6917J1532K891p518K0075J8335
$$ 60455 62611 59345 52518 15453 -4019 -551 -3201 13716 25248 28139 20621 40696 59031
11168E9031j7070P978L2808k2303k5531K3415r993J611q098o037K853J6099J2185
$$ 59031 41961 49939 82747 60444 34913 58328 48335 49946 41848 35811 38664 54763 66948
11155F6948k3674l5426O65J524j936L901J7909j4709j3025J3006L6218J353j5616
$$ 66948 43274 7848 8513 10037 8101 12002 29911 15202 2177 15183 51401 52754 37138
11142C7138j1937r896J7692j7756L062J9361K1598M411j5137o388j9590K483L8211
$$ 37138 25201 15305 32997 15241 18303 37664 59262 63673 48536 42148 22558 25041 63252
11129F3252J5616m177j541k8115l4969l4437L644K6292L4675P415k073J2074j1562
$$ 63252 78868 74691 73150 45035 10066 -24371 -20727 5565 40240 47655 45582 57656 46094
11116D6094k2773l642p269m538J9720J3255J7309q343j7534j8486m22J7650P749
$$ 46094 23321 19679 12410 7872 27592 40847 58156 49813 32279 13793 13371 31021 38770
11103C8770O371R18J3032K1818n017J9160K274k4738r484j803n366j2263J1305
$$ 38770 45141 46059 59091 80909 75892 95052 97326 72588 63104 61301 55935 43672 54977
11090E4977N056o154P117p902J221j8767L593m415P018M2905j6677j3090j1565
$$ 54977 60033 53879 60996 53094 54315 35548 39141 34726 41744 84649 67972 54882 43317
11077D3317J3592N852K4826J72j2250J3890j7751j2219K0621J2636P615P657k5903
$$ 43317 56909 62761 87587 87759 75509 89399 71648 59429 80050 92686 100301 107958 82055
11064H2055j2839j9485N317J0088j5687m800r746m8984k0210J5924L0185K9188
$$ 82055 69216 49731 55048 65136 49449 44649 34903 -14081 -34291 -18367 11818 41006
11052D1006L6845J3141J6718l1o907k3002k4337k1731j305n418L879q428L7034
$$ 41006 77851 90992 107710 107679 100772 77770 53433 31702 30397 24979 28858 20430 57464
11039E7464L7014j2148O382L7456p042m0089o713K4165J2472P920m262j2494J6069
$$ 57464 94478 82330 88712 126168 119126 79037 72324 96489 108961 116881 112619 100125 116194
11026A16194K4816p957k5585J1329K6908m419k721K6436k3324r654J112j6296
$$ 116194 141010 133053 107468 118797 145705 141286 138565 165001 141677 132023 133135 116839
11014A16839n865p343m795q589L7K2614M3495P073k9194J668j6100j315j0135
$$ 116839 110974 103631 98836 90247 90284 112898 156393 163466 134272 135940 119840 118525 108390
11001A08390j6502o486K1720J9505p098J8438q557o888L800R396j328j9405P226
$$ 108390 91888 85402 107122 126627 119529 137967 129410 122522 126322 135718 134390 114985 122211
10988A22211l0686k1595O283K0312q037J1625j80j2420r028M923L465k6352l1154
$$ 122211 91525 69930 76213 96525 88488 100113 99933 87513 78485 83408 86873 60521 29367
10975B9367l376K1220N3460K198k9963m6961M949Q390K5415K5049l649m909j1102
$$ 29367 25991 47211 100671 102869 72906 25945 30894 39284 64699 89748 86099 81190 70088
10962G0088j5886q87M709j8839q165m94l796n703J2685J1277J4653K0344N132
$$ 70088 54202 53315 58024 39185 31020 30526 26730 21027 33712 44989 59642 79986 85118
10949H5118j2208p267N649r432J121M783P415j5565J6543j3779K6180j1538K339
$$ 85118 72910 65643 71292 61860 62981 67764 75179 59614 76157 62378 88558 77020 79359
10936G9359j3457o620k169j4262K9768K6507j752k0509k5207J5400O1585L4977
$$ 79359 65902 59282 57113 42851 72619 99126 97374 76865 51658 67058 128643 163620
10924A63620l1480l6394j8513o842K0869l5720J4242L997l2511j2427O647j390
$$ 163620 132140 95746 77233 70391 91260 55540 69782 73779 41268 28841 35488 34098
10912C4098n361K2909M0138K780j1208J7850O83J133k0494n683k726N447j8835
$$ 34098 28737 51646 91784 94564 83356 101206 101889 103022 82528 76845 74119 79566 60731
10899F0731l8110l5596Q399R371M90M123K0029O182L758j9303L4843J7895n644
$$ 60731 22621 -12975 -4576 4795 5285 9408 29437 35619 39377 20074 54917 72812 67168
10886F7168O816l864j6284k6014j6901k462j0587j903j7987N0830K5591l922J8121
$$ 67168 73984 70120 53836 27822 10921 8459 -2128 -4031 -22018 28812 54403 50481 68602
10873F8602K9402j3497k2027m300k4823L536J7604J0734Q068K4133L7201L525
$$ 68602 98004 84507 62480 58180 33357 36893 54497 65231 73299 97432 134633 138158
10861A38158k1993o719j344r713l196j7364P125J8831L35o8415k6755L8339K0487
$$ 138158 116165 109446 108102 98389 95193 77829 84954 103785 104120 35705 8950 47289 67776
10848F7776M440m558J3654J049k7765q852J5686K1285R603J1937j1409j7397k787
$$ 67776 72216 67658 81312 82361 54596 45744 61430 82715 92318 104255 92846 75449 72662
10835G2662J6211O201j197Q819J9898l15k5802J3033K5888k3113j2241o822m40
$$ 72662 88873 95074 93877 102696 122594 122279 96477 109510 135398 112285 100044 93222 92782
10822I2782j729N125n332k0432j0421O034O9p312m666m132M370P803o109o040
$$ 92782 91053 96178 90846 70414 59993 66027 66096 58784 54118 49986 54356 62159 56050 50010
10808E0010J7569K1896J6761L194q447K4428J1745j2848m5509R166j0824k1608
$$ 50010 67579 89475 106236 109430 100983 125411 137156 124308 78799 87965 77141 55533
10796E5533L559k431Q861j6659L877J0314j5147j4877L494K6502J0323N786k0119
$$ 55533 59092 56661 65522 48863 52740 63054 47907 33030 36524 63026 73349 79135 59016
10783E9016m2759Q867L0943K8801K8995j1392l5509j447K6455k3655n99k4407
$$ 59016 16257 25124 56067 84868 113863 102471 66962 65515 91970 68315 67716 43309
10771D3309j0432O002n53k0094K9034n134j3873L5707J8382q833k4101J2585k176
$$ 43309 32877 38879 38326 18232 47266 42132 28259 63966 82348 73515 49414 61999 59823
10758E9823J9748J372n649k3874j3749j790P322K1583M303J975L9599K7986j4045
$$ 59823 79571 80943 75294 51420 37671 35881 43203 64786 69089 71064 110663 138649 124604
10745A24604j3204L3239K8415m24k8489K8840L0537J1899l204O924L1536j166
$$ 124604 111400 144639 173054 172630 144141 172981 203518 215417 212213 219137 250673 249507
10733B49507j5991k5491q610l9394l182N384j9j8337J4181R500k3537j9481K8086
$$ 249507 233516 208025 199415 160021 156839 162223 162204 143867 158048 167548 144011 124530 152616
10720A52616J5460k7971j0408M9666N0935K3438P835j4001J9721N828q157j9334
$$ 152616 168076 140105 129697 179363 230298 253736 261571 247570 267291 273119 264962 245628
10708B45628j9182k5267j1959j2715r746M080j2742k216j5211m0066k1514N722
$$ 245628 226446 201179 189220 176505 166759 170839 158097 155881 140670 100604 79090 84812
10696H4812K9433k609j1764o957j2624j1528K4528K0757k8745k2084M388J8472
$$ 84812 114245 111636 99872 92915 80291 68763 93291 114048 85303 63219 67607 86079
10684H6079J0582r52O567N874l6321o220j5442K4505j1416p934L883L1234L3105
$$ 86079 96661 95709 102276 108150 71829 65609 50167 74672 63256 55322 59205 90439 123544
10671A23544r108j3885m789j938j7649K6833K7839J9038J7053L085L389Q736q171
$$ 123544 114436 100551 95762 93824 76175 103008 130847 149885 166938 170023 173412 182148 173977
10658A73977L971K2672r231m2085l1392k0606J1378J8561J8522j2094j5039O058
$$ 173977 177948 200620 191389 149304 117912 97306 108684 127245 145767 133673 118634 124692
10646A24692k4183r19J4463J0889J2267K0670O269J9354j2142k1961J0663L6107
$$ 124692 100509 99590 114053 124942 137209 157879 164148 183502 171360 149399 160062 196169
10634A96169K6443K0842K5122M0679J2429M960j6615j2067l1758m4325j4257j0226
$$ 196169 222612 243454 268576 309255 321684 326644 310029 297962 266204 221879 207622 197396
10622A97396l1885k2884l7406K536N9139J5833P179K3898K4871L7243J7483L3331
$$ 197396 165511 142627 105221 107757 166896 182729 189908 213806 238677 275920 293403 326734
10610C26734L2226L0502J9974l226l8361m4979n7424l4660r12k881j4151p836
$$ 326734 358960 389462 409436 406210 367849 322870 265446 230786 229874 226993 212842 205006
10598B05006o080k2532k9556k1378J552L101L0963J8059q141L381J554O204k3265
$$ 205006 198926 176394 146838 125460 127012 130113 161076 179135 170994 174375 175929 182133 158868
10585A58868j2979O054L0178O006R035q751J3559J6527l66K7432Q492J8122K5599
$$ 158868 145889 151943 182121 188127 197162 188411 201970 218497 218131 245563 254055 272177 297776
10572B97776M5256R6785J23123N7524K7320J9574q4298j56383r8416n2498m2189
$$ 297776 343032 439817 562940 620464 647784 667358 583060 426677 328261 275763 233574
10561B33574l3825j3807K1200K8452o653m4234l5301k1450l3729M948J7689q322
$$ 233574 199749 185942 207142 235594 228941 184707 149406 127956 94227 99175 116864 108542
10549A08542k6260j4699K3274J9743j5511q638L8520o46J7071j453k2349q430
$$ 108542 82282 67583 90857 110600 95089 86451 124971 124325 141396 139943 117594 109164
10537A09164J6656N736n915L3316O961o171l1462j5316p018Q377K0834n505m367
$$ 109164 125820 131556 125641 158957 165918 159747 128285 112969 105951 114328 135162 129657 125290
10524A25290l975R315J65J5239Q423k0007k593M6169L2677m218m059l8567j2557
$$ 125290 121315 130630 130795 146034 154457 134450 131857 178026 210703 206485 202426 163859 151302
10511A51302Q778O197p011k3628N762j1692M250O091N577k3531n510q976k5661
$$ 151302 160080 166277 159266 135638 141400 129708 133958 140049 145626 122095 116585 107609 81948
10498H1948J2283J6867L0374K7754J7483L4584j6685o811Q884k2047j5188j0576
$$ 81948 94231 111098 141472 169226 186709 221293 204608 197797 206681 184634 169446 158870
10486A58870K1380j1445j3604j966p880j0526n09J7890R163K185k5623j9287n179
$$ 158870 180250 168805 155201 153235 145355 134829 134320 152210 161373 163558 137935 118648 113469
10473A13469L7430p980O119p850j9256o028m018J6305K5351M624M178j3963l1247
$$ 113469 150899 142919 149038 141188 121932 115904 111886 128191 153542 158166 162344 148381 117134
10460A17134j4916l925p93N191p700j1194Q216J1745M343j6428o911J5233Q635
$$ 117134 102218 98293 97500 102691 94991 83797 92013 103758 108101 91673 84762 99995 108630
10447A08630j5427K6160J5222j2003m082o577j1046k3765j8410J9984L4520n794
$$ 108630 93203 119363 134585 122582 118500 111923 100877 77112 58702 78686 113206 107412
10435A07412J5344M956J4556j197n192k917k2889O480J7590j0430M22O168k2182
$$ 107412 122756 127712 142268 141071 135879 132962 110073 116553 134143 123713 124135 130303 108121
10422A08121k2880k0828R987M2692L2962p215j2508J740j700J1052J0613J5723
$$ 108121 85241 64413 74400 117092 150054 142839 130331 132071 130371 141423 152036 167759
10410A67759j6100j970k269o79r949j3253n697R177j2872l0098p002J9154M8321
$$ 167759 151659 149689 147420 146741 136792 123539 117842 127019 114147 84049 77047 96201 144522
10397A44522K7278j252r005j8274k9433L557M418J8225o185K04P403J0353J827
$$ 144522 171800 170548 161543 143269 113836 117393 121811 140036 133851 134055 141458 151811 153638
10384A53638J4444J1420k2608j8772k0807J3029L1997J0017M273q447M758m959
$$ 153638 168082 179502 156894 138122 117315 130344 162341 172358 176631 168184 172942 167983
10372A67983N728J2879Q153j2429j5318m857K1787q463j3765K145j3755p201K88
$$ 167983 173711 186590 194743 182314 166996 162139 183926 175463 161698 163843 150088 142887 143175
10359A43175o795M407n693K913k1633k8626K5381K3005J1108j0750K1147l782
$$ 143175 136380 140787 135094 138007 116374 87748 113129 136134 147242 136492 157639 153857
10347A53857k3196k8471O461J0879P331L7214j3204j302j3988l7868J0619J0317
$$ 153857 130661 102190 108651 119530 126861 164075 150871 149569 135581 97713 108332 118649
10335A18649j7603J9489K7010j400J9291l93l5000m1390j0551N39K2015J1138
$$ 118649 101046 120535 147545 146145 165436 165043 130043 88653 78102 78641 100656 111794
10323A11794J4572J3361J9456r194L511n994J5134K2460r895j1653j8613L4580
$$ 111794 126366 139727 159183 149989 153500 147506 162640 185100 175205 163552 144939 179519
10311A79519k023j1380l665l016m4566j7297K569K3563Q803R84Q241K4196L398
$$ 179519 177496 166116 162451 159435 114869 97572 100141 123704 132507 133491 141732 165928 169326
10298A69326m677j2037j3064n229J4166N344r966K2589J0509J469j3424k4557
$$ 169326 164649 152612 139548 134319 148485 153829 143863 166452 176961 178430 165006 140449
10286A40449j4891M474n357j0867j4708J9330P274J9771j121R044K1135P726J2895
$$ 140449 125558 130032 124675 113808 99100 118430 125704 145475 144354 153398 174533 182259 195154
10273A95154j5902l0030O247k1885R259P709l2679p453J9470K9441J3654j541
$$ 195154 179252 149222 155469 133584 142843 150552 117873 110420 129890 159331 172985 171444
10261A71444l3484k8997K2114J1130J51K1745o941j0945J3543J9812q528j1695
$$ 171444 137960 108963 131077 142207 142358 164103 157162 146217 159760 179572 171044 159349
10249A59349L1547j6369j6775O962k180o767l3352j5660J7671J6650M058L6760
$$ 159349 190896 174527 157752 164714 162534 155767 122415 106755 124426 141076 145134 181894
10237A81894R101J1938k7024r619j5454p619L068N93K6460M7298L0032k617M078
$$ 181894 190995 202933 175909 166290 150836 143217 146285 146878 173338 220636 250668 248051 252129
10224B52129J3447n768J0315M4436L2889J8957j4755J7125J2759j0625o628J667
$$ 252129 265576 259808 270123 314559 347448 366405 351650 368775 381534 370909 364281 365948
10212C65948K8184M2070K1323J9335R733P534j0200J3683L6424P9423R7767J21589
$$ 365948 394132 436202 457525 476860 486593 494127 483927 497610 534034 613457 711224 832813
10200H32813J84160K19240K12778K59823K83295K16992J21238R1049N9659j51642
$$ 832813 1016973 1236213 1448991 1708814 1992109 2209101 2330339 2421388 2481047 2329405
10190B329405k98373k54491j87615k27664l00614k07510j30254j04521o5966k0315
$$ 2329405 2031032 1776541 1588926 1361262 1060648 853138 722884 618363 552397 532082
10180E32082R753k8925j5336r427j328j0600n0287k3900K4185j8637l0791l6267
$$ 532082 541835 512910 497574 488147 486819 476219 425932 402032 426217 407580 376789 340522
10168C40522k5530k4367L2140O610Q614j607k1836m3688j3699R754K709j3597
$$ 340522 314992 290625 322765 329375 337989 336382 314546 270858 257159 266913 269622 256025
10156B56025k7158j2049J2481K1443K117J7573N475j6097o3j2852J8675K9327
$$ 256025 228867 216818 229299 250742 252859 270432 275907 259810 259747 246895 265570 294897
10144B94897m759j2771k597K1286J494j5896j2471j7105O778p939K7156O289m5127
$$ 294897 290138 277367 274770 296056 297550 281654 269183 252078 258856 250917 278073 284362 239235
10131B39235M179j685R388J7906l9644L786M70l002K979J5670l4119p942k534
$$ 239235 243414 241729 251117 269023 229379 233165 233635 230633 233612 249282 215163 207221 204687
10118B04687n78K5489O3364J2770j4024k9627J6465R475l367j7047J4189J4271
$$ 204687 204109 229598 292962 305732 291708 262081 278546 288021 284654 267607 281796 296067
10106B96067j7828J2509K7287q65j0539l9377K1137L1124O197N918J9728R440
$$ 296067 278239 290748 318035 317170 306631 267254 288391 319515 325712 331630 351358 360798
10094C60798m751j7162k0595n390k3928k1082q425Q800j9384k0507j3219K6157
$$ 360798 356047 338885 318290 312900 288972 267890 259465 268265 248881 228374 215155 241312
10082B41312J0480p314j0502J8281J9815k1280l2954K1606N59m919J2396J529
$$ 241312 251792 244478 233976 252257 272072 250792 217838 239444 240003 235084 247480 249009
10070B49009l0437k3002L729j311p143k83j3044L4859J8282k350P101j2744m2009
$$ 249009 218572 195570 199299 197988 190845 190562 177518 212377 230659 228309 235410 222666 180657
10057A80657n520K2528J7076J0377O063J9495p279J7529R413q141o529l0743k5524
$$ 180657 175137 197665 214741 225118 231181 250676 243397 260926 270339 262198 255669 224926 199402
10044A99402k0711L059K1518K4652L1411K4848L3249L7754P6138Q3962J54338
$$ 199402 178691 181750 203268 227920 259331 284179 317428 355182 431320 515282 669620
10033F69620K86482M16877L18691J98784K09802L1725n25383n38787k84939j32519
$$ 669620 956102 1372979 1691670 1890454 2100256 2131981 1606598 1067811 782872 650353
10023F50353r7441p1122k2606j9394j6545k1085l0927j8915K2173J8516P326O195
$$ 650353 552912 481790 459184 439790 423245 402160 371233 352318 374491 393007 400333 406528
10011D06528Q55n894j384P36j265j6257n691l386l232q201P714j6224m214J1758
$$ 406528 407383 401489 400105 400841 399576 383319 377628 374242 371010 362809 370523 354299 350085 361843
9997C61843J3712J772q302n508j4091m886R036l2351j572K4311k9001N772L7686
$$ 361843 375555 377327 369025 363517 349426 344540 353576 321225 319653 343964 314963 320735 358421
9984C58421o513k6187r268J697J7135k2179J5002J9871L531k6568k5936J2815
$$ 358421 351908 325721 316453 318150 335285 313106 328108 347979 351510 324942 299006 311821
9972C11821J8330J8938J1742o778j785j4780k4316j2358J6317p467J5397O105
$$ 311821 330151 349089 360831 354053 352268 337488 313172 300814 317131 309664 325061 331166
9960C31166p013K8235K870k3500n699Q109j167J0843J651n987J4784k2972j7003
$$ 331166 324153 352388 355258 331758 326059 334168 333001 343844 345495 339508 354292 331320 314317
9947C14317J4995j4201O064P649o606o377J7269j634l3962K3J082J0075P917j201
$$ 314317 329312 315111 321175 328824 322218 315841 333110 331476 297514 297537 298619 308694 316611 315410
9933C15410k5498M451O638J4601j0063o571J9380J2483K0133R078J1307j1023
$$ 315410 289912 294363 301001 315602 305539 298968 318348 330831 350964 360042 371349 360326
9921C60326P198N662J5756K6227J1914k06k6932k3685j0443J2579J0458j2889
$$ 360326 367524 373186 388942 415169 427083 426877 399945 376260 365817 378396 388854 375965
9909C75965j2832K382J3469J0594O023j3596K754j1103j1125j6745J2658P219
$$ 375965 363133 365515 378984 389578 395601 382005 384759 373656 362531 345786 358444 365663
9897C65663k8381O575p125k2062R68j124K0871K7885k806n4747o023L9925L6013
$$ 365663 337282 343857 336732 314670 315638 314514 335385 363270 360464 305717 299694 339619 375632
9884C75632R30j3002l577P244M3169L1305r589m50J0073O346J4045p07p00q763
$$ 375632 376562 363560 359983 367227 410396 441701 432112 431662 441735 448081 462126 461419 460719 451956
9870D51956j2950k0274k7007n690K302j3571K4557M1041K9022o161k2196k6609
$$ 451956 439006 418732 391725 386035 388337 374766 399323 440364 469386 463225 441029 414420
9858D14420j7436K1302J3777R70L3158p81j612j66J5574p829k6865j2011j4942
$$ 414420 396984 418286 432063 433033 466191 465410 463798 463632 479206 471377 444512 432501 417559
9845D17559J0854P486J5865J5955K2092k911J1118K5178j1733N184q687j5065
$$ 417559 428413 435899 451764 467719 489811 486900 498018 523196 511463 516647 507960 492895
9833D92895k3792K4524J5730J4872M013n018j6306o823P552K4361J9431k5398
$$ 492895 469103 493627 509357 524229 528242 523224 506918 500095 507647 532008 551439 526041
9821E26041j0121J5526J0417J0500j6094l3755P50J7364j7040L989P616k2619
$$ 526041 515920 531446 541863 552363 536269 502514 503264 520628 503588 507577 515193 492574
9809D92574L851o578j9639r722r999K1608K7853j3398J3856J8704K250K3304M231
$$ 492574 496425 489847 470208 460486 450487 472095 499948 486550 500406 519110 521360 544664 548895
9796E48895J5761N673j3693K797O968j1305K4029J7799r196j1853K2613R713P461
$$ 548895 564656 570329 556636 559433 566401 555096 579125 596924 587728 575875 598488 608201 615662
9783F15662J5420K0346l390k6619k5810m804k9393r289N5173L3133j3726k8277
$$ 615662 631082 651428 648038 621419 595609 590805 561412 552123 607296 640429 626703 598426
9771E98426k0444k660j4222P966K3043o067L353k353O732k6536k030L7198K4744
$$ 598426 577982 575322 561100 569066 592109 586042 589395 587042 593774 567238 565208 602406 627150
9758F27150j9584K9396J2349j3844l52j6255L232K9000J6746J2010J0272j1511
$$ 627150 607566 636962 649311 635467 635115 618860 622092 651092 667838 679848 690120 678609
9746F78609M8918P906J5018O050j1711Q808K0418j1380J4914q358j0246l6583
$$ 678609 727527 735433 750451 756501 744790 753598 774016 762636 777550 769192 758946 722363
9734G22363j8373J7711j700k092k2365k4633J1517K1223j2748M376M6043J8970
$$ 722363 703990 721701 720001 717909 695544 670911 682428 703651 690903 695279 741322 760292
9722G60292m1844J2047N8724J8064k0657j5300N736j2856k889J3262J4833j0882
$$ 760292 718448 730495 789219 807283 786626 771326 777062 764206 761317 774579 789412 778530
9710G78530j0114L476K1824J3128l563K6546p210P214j4030J614J0729k6132M402
$$ 778530 768416 771892 793716 806844 803281 829827 822617 829831 815801 817415 828144 802012 806414
9697H06414L1616N984j6714l22K3180R345j6508J6694N3557n314l9137J5671N824
$$ 806414 838030 844014 827300 826978 850158 859503 842995 859689 913246 907932 868795 884466 890290
9684H90290k5116L601j4368K224Q421P759K612J1594J2381J7522L1637J0797m102
$$ 890290 865174 868775 854407 856631 865052 872811 875423 887017 899398 916920 948557 959354 955252
9671I55252m849J9802K2890o615j3832L38j461J0987K3598M091J7285J344L409
$$ 955252 950403 970205 993095 986480 972648 972986 971525 982512 1006110 1010201 1027486 1028830 1032239
9658A032239K1707L6075J4250L069k5829j570J7417J2818K6796J6526Q904L4106
$$ 1032239 1053946 1090021 1104271 1107340 1081511 1079941 1097358 1110176 1136972 1153498 1162402 1196508
9646A196508J3978K5839n645L4471J2909L5832L2923K4903l988J2601Q513M880
$$ 1196508 1210486 1236325 1230680 1265151 1278060 1313892 1346815 1371718 1367730 1380331 1388844 1393724
9634A393724K2394L7891L6626K9820J7594K4092j278P167L5547N516j6075k58
$$ 1393724 1416118 1454009 1490635 1520455 1538049 1562141 1560863 1568030 1603577 1609093 1593018 1592760
9622A592760N959J1966M778K4613L3186p523j3613j6838J2401R388j7135L1935
$$ 1592760 1598719 1610685 1615463 1640076 1673262 1665739 1652126 1635288 1647689 1657077 1639942 1671877
9610A671877k727r526R624K0015L2952K9285K9017K3330L9769K2000J0106N0717
$$ 1671877 1669150 1659624 1669248 1689263 1722215 1751500 1780517 1803847 1843616 1865616 1875722 1926439
9598A926439P1339K5781L1528L6794K6565K4255J104j855l4753k3086l2091r097
$$ 1926439 1997778 2023559 2055087 2091881 2118446 2142701 2143805 2141950 2107197 2084111 2052020 2042923
9586B042923l6398k6027L1921j279J3384j0928l787j1432j7813j901J0386Q453
$$ 2042923 2006525 1980498 2012419 2011140 2024524 2013596 2009809 1998377 1980564 1978663 1989049 1997502
9574A997502M962j0350k05M1965J3019O377J2801R941N139P082m774K5983J8787
$$ 1997502 2002464 1992114 1991909 2033874 2046893 2053270 2066071 2076012 2081151 2088233 2083459 2109442 2128229
9561B128229L8119j9190J4095J3132O313j7584K560j5371k6170p325p914l8759
$$ 2128229 2166348 2147158 2161253 2174385 2180698 2163114 2165674 2150303 2124133 2116808 2108894 2070135
9549B070135r864l1446n923K1927k7107O349K1168K710Q907k0140k7102k551J112
$$ 2070135 2060271 2028825 2022902 2044829 2017722 2024071 2045239 2047949 2056856 2036716 2009614 2007063 2008175
9536B008175r310k3537m1695n574K0644Q161Q845M1330L7703O091L146j616R648
$$ 2008175 1998865 1975328 1933633 1928059 1948703 1956864 1965709 2007039 2044742 2050833 2053979 2052363 2062011
9523B062011R806J3251J0249K7251J7936M237k9438p583j9381j1230J3359K8165
$$ 2062011 2071817 2085068 2095317 2122568 2140504 2144741 2115303 2107720 2088339 2077109 2090468 2118633
9511B118633k1506m2890l6137k647n292n275N887L6792K5635r848L698M3813k774
$$ 2118633 2097127 2054237 2018100 2015453 2010161 2004886 2010773 2047565 2073200 2063352 2067050 2110863 2108089
9498B108089r78j0702M6937L9545p063j0108L5764j0341K3520K1116J3348j2104
$$ 2108089 2107111 2096409 2143346 2182891 2175828 2165720 2201484 2191143 2214663 2235779 2249127 2237023
9486B237023K1643J8946J0916M4704J2949p045J7359K3715M5660M7057K0822o029
$$ 2237023 2258666 2277612 2288528 2333232 2346181 2339136 2356495 2380210 2425870 2472927 2493749 2487720
9474B487720K294K9463M0539N4862l836J3377K8002P171K7628K5813M5423M2031
$$ 2487720 2490014 2519477 2560016 2614878 2611042 2624419 2652421 2659592 2687220 2713033 2758456 2800487
9462B800487K1647L6856J0905J0377K6766K8377L3117K5746M3778N4101N4516
$$ 2800487 2822134 2858990 2869895 2880272 2907038 2935415 2968532 2994278 3038056 3092157 3146673
9451C146673O0173K8131J2284N0396N0233k23J4026N0485M9203M4912M3509K4965
$$ 3146673 3206846 3234977 3247261 3297657 3347890 3347667 3361693 3412178 3461381 3506293 3549802 3574767
9439C574767K9904O9408L6176P002K8470N0862K8140j9417J014M0653J3264j096
$$ 3574767 3604671 3674079 3710255 3717257 3745727 3796589 3824729 3805312 3806326 3846979 3860243 3859147
9427C859147J2486K9270K7182J9499M6548O8576K9230R561K2105M6039M8887K7810
$$ 3859147 3871633 3900903 3928085 3947584 3994132 4062708 4091938 4101499 4123604 4169643 4218530 4246340
9415D246340N1855L6787N0202K1153K0671P0937Q7669M8418J9878K7983O4851
$$ 4246340 4298195 4334982 4385184 4406337 4427008 4497945 4585614 4634032 4653910 4681893 4746744
9404D746744M5542N6201L2301N4009O6038Q9884O1276M7526N7981P1690O0384
$$ 4746744 4792286 4848487 4880788 4934797 5000835 5090719 5151995 5199521 5257502 5329192 5389576
9393E389576M5344N2256M6912N9925R0644L0110L9382O8767N5273O5900O7450
$$ 5389576 5434920 5487176 5534088 5594013 5684657 5714767 5754149 5822916 5878189 5944089 6011539
9382F011539R6800R0580R7551O7210Q7369J22747J03612R2314Q5551R8264J11818
$$ 6011539 6108339 6198919 6296470 6363680 6451049 6573796 6677408 6769722 6855273 6953537 7065355
9371G065355J16107J04622J26545J05825J04767J17146J39908J24213Q8460J21960
$$ 7065355 7181462 7286084 7412629 7518454 7623221 7740367 7880275 8004488 8092948 8214908
9361H214908J51070J55634J21164J24137J37813J19679J19130J44533J33226J33705
$$ 8214908 8365978 8521612 8642776 8766913 8904726 9024405 9143535 9288068 9421294 9554999
9351I554999J34596J60269J67728J47213J62243J57747J54062J88732K14588K11301
$$ 9554999 9689595 9849864 10017592 10164805 10327048 10484795 10638857 10827589 11042177 11253478
9341A1253478J94554J69920J79677J95724K52214K31045K15332K24019K24889
$$ 11253478 11448032 11617952 11797629 11993353 12245567 12476612 12691944 12915963 13140852
9332A3140852K19899K85592K72549K04621K33975K67270K54389K66334K88603
$$ 13140852 13360751 13646343 13918892 14123513 14357488 14624758 14879147 15145481 15434084
9323A5434084K89309L20400L22937L18105L11284L28361L28475L32653L31136
$$ 15434084 15723393 16043793 16366730 16684835 16996119 17324480 17652955 17985608 18316744
9314A8316744L74879L74753M02360L78008L77247L71046M07834M33798M39512
$$ 18316744 18691623 19066376 19468736 19846744 20223991 20595037 21002871 21436669 21876181
9305B1876181M37472M32385M79131N00308M89067M94632N07254N24524N36582
$$ 21876181 22313653 22746038 23225169 23725477 24214544 24709176 25216430 25740954 26277536
9296B6277536N39289N92128N78054N78549N91060O15988O08059N45501N37348
$$ 26277536 26816825 27408953 27987007 28565556 29156616 29772604 30380663 30926164 31463512
9287C1463512N85719O02415N89088O13046N92433O09031N84293N67295N72977
$$ 31463512 32049231 32651646 33240734 33853780 34446213 35055244 35639537 36206832 36779809
9278C6779809N67632N89060N87382N67197N50933N30428N18991M61119M86032
$$ 36779809 37347441 37936501 38523883 39091080 39642013 40172441 40691432 41152551 41638583
9269D1638583N33059N21566N40026N38282N29353N50896M67620M25104M57593
$$ 41638583 42171642 42693208 43233234 43771516 44300869 44851765 45319385 45744489 46202082
9260D6202082M81954M84615M35837M38286M10803M25518M61810N26977O20674
$$ 46202082 46684036 47168651 47604488 48042774 48453577 48879095 49340905 49867882 50488556
9251E0488556O98458P27533P65032Q12121Q51208P92027P07435O45137N88367
$$ 50488556 51187014 51914547 52679579 53491700 54342908 55134935 55842370 56487507 57075874
9242E7075874N57117N22765N73414O13072P41955R16731J036860J130520J282991
$$ 57075874 57632991 58155756 58729170 59342242 60084197 61000928 62037788 63168308 64451299
9233F4451299J461681J721550K224145K876877L654035M368506M828692N000577
$$ 64451299 65912980 67634530 69858675 72735552 76389587 80758093 85586785 90587362
9225I0587362M774513M214106L664539L391143L447483L887016M678573N647489
$$ 90587362 95361875 99575981 103240520 106631663 110079146 113966162 118644735 124292224
9217A24292224O593011P334630P633147P442130O953959O358273N796793N593598
$$ 124292224 130885235 138219865 145853012 153295142 160249101 166607374 172404167 177997765
9209A77997765N902194O540034P288637Q137079R155086J0111708J0679339J1024346
$$ 177997765 183899959 190439993 197728630 205865709 215020795 225132503 235811842 246836188
9201B46836188J1191883J1014637J0698128J1067407J2791092J5567137J8376224
$$ 246836188 258028071 269042708 279740836 290808243 303599335 319166472 337542696
9194C37542696J9975378J9017722J4970614Q546938K22407r031173j6066147j8492492
$$ 337542696 357518074 376535796 391506410 400053348 400275755 391244582 375178435 356685943
9186C56685943j7422495j4840518j2136493j0286588r326306r074383r605156
$$ 356685943 339263448 324422930 312286437 301999849 292673543 283599160 273994004
9179B73994004j0511769j0660687r936124q881038p951691p157565o387000n888127
$$ 273994004 263482235 252821548 242885424 234004386 226052695 218895130 212508130 206620003
9171B06620003n669128n680235n938246o505964p274151p920592q021907p630227
$$ 206620003 200950875 195270640 189332394 182826430 175552279 167631687 159609780 151979553
9163A51979553o916234n925711m869156m109685l793930l882240m299792m956911
$$ 151979553 145063319 139137608 134268452 130158767 126364837 122482597 118182805 113225894
9155A13225894n510503n824386n839071n448375m765890l959845l304890k884883
$$ 113225894 107715391 101891005 96051934 90603559 85837669 81877824 78572934 75688051
9147G5688051k672633k514823k421181k299551k144319j982129j852190j753972
$$ 75688051 73015418 70500595 68079414 65779863 63635544 61653415 59801225 58047253
9139E8047253j704723j740861j763086j795410j857066j869362j795308j692296
$$ 58047253 56342530 54601669 52838583 51043173 49186107 47316745 45521437 43829141
9131D3829141j580408j483659j373404j230328j171512j107525j060578j027766
$$ 43829141 42248733 40765074 39391670 38161342 36989830 35882305 34821727 33793961
9123C3793961j012306j035300r82146r62180r30758q90491q48921q29501q17215
$$ 33793961 32781655 31746355 30764209 29802029 28871271 27980780 27131859 26302358 25485143
9114B5485143p51642p14403o75404o27660n88993n64317n17923n21375n32015
$$ 25485143 24733501 24019098 23343694 22716034 22127041 21562724 21044801 20523426 19991411
9105A9991411n16191n40912n16761m37239m44500m01487m41720m37512l99910
$$ 19991411 19475220 18934308 18417547 17980308 17535808 17134321 16692601 16255089 15855179
9096A5855179l96920l75603l22115l31585l18308l07250l41105l17731k94969
$$ 15855179 15458259 15082656 14760541 14428956 14110648 13803398 13462293 13144562 12849593
9087A2849593k81149k76437l04790k57544k76771k99365k56286k40754k40702
$$ 12849593 12568444 12292007 11987217 11729673 11452902 11153537 10897251 10656497 10415795
9078A0415795k57285k74286k34311k32262k04588j65099j61826j92354j96802
$$ 10415795 10158510 9884224 9649913 9417651 9213063 9047964 8886138 8693784 8496982
9069H496982j55351j54423j88957j95234j51414j37058j50358j60696j94846j77266
$$ 8496982 8341631 8187208 7998251 7803017 7651603 7514545 7364187 7203491 7008645 6831379
9059F831379j65130j53214j50315j37204j46496r4924o7615j10390q5874n4178
$$ 6831379 6666249 6513035 6362720 6225516 6079020 5984096 5916481 5806091 5720217 5666039
9049E666039q0287r6114q8034p9222q8314n4537k7759m3848n0210k9137n4700
$$ 5666039 5585752 5489638 5401604 5322382 5234068 5179531 5151772 5107924 5057714 5028577 4973877
9038D973877q4803m7469l052m771k1482m6003l9190n3473k4556l0949j6257l5317
$$ 4973877 4889074 4841605 4838553 4833782 4812300 4766297 4727107 4673634 4649078 4618129 4601872 4566555
9026D566555o4999m2269n6131m0644j8543o1783o9427n0970n7858n9034j7851
$$ 4566555 4501556 4459287 4403156 4362512 4343969 4282186 4212759 4161789 4103931 4044897 4027046
9015D027046l7173n9988l9843l3543k3479k1901k9507j1503k3305n1815l9940
$$ 4027046 3989873 3929885 3890042 3856499 3833020 3811119 3781612 3770109 3746804 3694989 3655049
9004C655049j2269k5897k9452k5877k7393m3297n0639k4512l7595n3192m0355
$$ 3655049 3642780 3616883 3587431 3561554 3534161 3490864 3440225 3415713 3378118 3324926 3284571
8993C284571n5893n1160m8363l0586k0632j548j4391j8033k2962k3746k5518j4859
$$ 3284571 3228678 3177518 3129155 3098569 3077937 3076389 3061998 3043965 3021003 2997257 2971739 2956880
8981B956880j6680l7272l0888k4165J489j2060J7300j3963l6683k3683l8187l2348
$$ 2956880 2940200 2902928 2872040 2847875 2849364 2837304 2854604 2840641 2803958 2780275 2742088 2709740
8969B709740m1083m0516k4831l2218l2469l6939k7415k3367k7733l4771k4037
$$ 2709740 2668657 2628141 2603310 2571092 2538623 2501684 2474269 2450902 2423169 2388398 2364361
8958B364361k8084k4664j6742j7231j2819k9972l0674k9869j3526J7637p97m7868
$$ 2364361 2336277 2311613 2294871 2277640 2264821 2234849 2204175 2174306 2160780 2178417 2177620 2129752
8946B129752m7567n1158l1832j7383n3032n4631j0364J848k9061j8091q2m2081
$$ 2129752 2082185 2031027 1999195 1981812 1928780 1874149 1863785 1865633 1836572 1818481 1818399 1776318
8934A776318n8650j0163L26j1205k8071k9949m8480k0530j6866m274l4499j7481
$$ 1776318 1717668 1707505 1707831 1696626 1668555 1638606 1590126 1569596 1552730 1548456 1513957 1496476
8922A496476j3664p0268k4568j5747j1569o909n502k0908j7334J518M841l5019
$$ 1496476 1482812 1412544 1387976 1372229 1360660 1353751 1348249 1327341 1310007 1311525 1316366 1281347
8910A281347k3984L132K5911Q799r955q174j7478j7646M704j3671j4815P858k2259
$$ 1281347 1257363 1260495 1286406 1295205 1285250 1277076 1259598 1241952 1246656 1232985 1218170 1226028 1203769
8897A203769k9907j5352K545j4215M971K2385J6105K5055O877j9100p728J9734
$$ 1203769 1173862 1158510 1161055 1146840 1151811 1174196 1190301 1215356 1222233 1203133 1195405 1215139
8885A215139L952O3645L0805M0275J9484J3705L2024P2851R1781J07762J16218
$$ 1215139 1219091 1282736 1313541 1353816 1373300 1387005 1419029 1491880 1583661 1691423 1807641
8874A807641J11176J39492J55614J83873K54246L47375N40111Q51381J318331
$$ 1807641 1918817 2058309 2213923 2397796 2652042 2999417 3539528 4390909 5709240
8865E709240K142335L045382L121127K305612J592427L72039k250310l985706
$$ 5709240 7851575 10896957 14018084 16323696 17916123 18288162 16037852 12052146
8857A2052146l306219k060697j228665p90111n31050l70103k81795j65767j33659
$$ 12052146 8745927 6685230 5456565 4666454 4135404 3765301 3483506 3317739 3184080
8848C184080j22702j17886j24911j21171r0205r8842r5808q8092n8409j6109n9560
$$ 3184080 3061378 2943492 2818581 2697410 2607205 2508363 2412555 2324463 2266054 2249945 2190385
8837B190385l3384k3041k0821l3584j8024l8302l7210j5781m6255l0982j4502
$$ 2190385 2157001 2133960 2113139 2079555 2061531 2023229 1986019 1970238 1923983 1893001 1878499
8826A878499j3438L629m363M9049L1256J600j5663l896k6662m3168l121m1463
$$ 1878499 1865061 1868690 1864327 1913376 1944632 1946232 1930569 1926673 1900011 1856843 1853722 1812259
8814A812259m5620j3574K6265O047m8760l6029k4221m4134j5864P400o633l899
$$ 1812259 1766639 1753065 1779330 1785377 1736617 1700588 1676367 1632233 1616369 1623769 1617136 1613237
8802A613237J4346j1517j7230P001l0902n7452k3895Q471j3818K2700L0996K0550
$$ 1613237 1627583 1616066 1598836 1605837 1574935 1517483 1493588 1502059 1488241 1510941 1541937 1562487
8790A562487M209M0304L8780J4752q840J4560M713j9891K6474k2319q3432o5447
$$ 1562487 1566696 1607000 1645780 1660532 1651692 1666252 1670965 1651074 1677548 1655229 1571797 1506350
8778A506350l2152k7493j6854l6191k9796l0487j6658l1505k9782j524P984l581
$$ 1506350 1474198 1446705 1429851 1393660 1363864 1333377 1316719 1285214 1255432 1253908 1261892 1258311
8766A258311K412L2362K122J4414l2324m1801j5941l367k0063k3952j7770P578
$$ 1258311 1260723 1293085 1295207 1309621 1277297 1235496 1219555 1216188 1196125 1172173 1154403 1161981
8754A161981o007k3920j70J0938k2764l761k1843O990j7753k8724k9185j8842
$$ 1161981 1155974 1132054 1131884 1142822 1120058 1116297 1094454 1101444 1083691 1054967 1025782 1006940
8742A006940l9215r656l4390n2335q630P001J537J4627k3544m2308N33R154m1567
$$ 1006940 967725 958069 923679 871344 862714 869715 871252 885879 862335 820027 820560 829714 788147
8729G88147m9296l2515j5339k7984L277o317j1134k764P399J7574p874j0285k127
$$ 788147 738851 706336 690997 663013 666290 659973 648839 646075 653474 671048 663174 652889 650762
8716F50762q259j8609j737k7458k4001j2081M4889M675n073k6491p831j1005j3857
$$ 650762 642503 623894 622157 594699 570698 558617 603506 608181 603108 576617 568786 557781 543924
8703E43924k1642o849k7943n911k0941J6027o199j3248j7959L451R042n616m823
$$ 543924 522282 515433 487490 481579 460638 476665 470466 457218 439259 442710 451752 446136 441313
8690D41313R829J5739J1411k0383k4406J0833L257j145k5243m776K1n3261r66
$$ 441313 451142 466881 478292 457909 433503 444336 447593 446448 421205 416429 416450 363189 362223
8677C62223K4587j0932j4414l4564J5884P143J0138j582K022J1614P302P615j3703
$$ 362223 386810 375878 361464 326900 342784 349927 360065 358483 360505 372119 379421 387036 373333
8664C73333l8958j5056K4620J1081o511K5077L3303J8353k1816l5181j4487J41
$$ 373333 334375 319319 343939 355020 348509 373586 406889 425242 403426 368245 353758 353899
8652C53899j6079K444M2181J1372k8621j2170j240k660Q831m692q209J8874K433
$$ 353899 337820 340264 382445 393817 365196 353026 351786 349126 357957 353265 345056 363930 366363
8639C66363k9254k9311m004J5265L9849O860M928k3154l0128k6108J1562L2071
$$ 366363 337109 307798 303794 319059 358908 365768 370696 347542 317414 291306 302868 334939
8627C34939J1652k7015K708J566P435K7772K7130k1293j8750l5405J1014q489
$$ 334939 346591 319576 322284 323850 331285 359057 386187 364894 346144 310739 321753 313264
8615C13264J287n361R120J9733J5743L3876J4877R4P701m0904k3863j1272L2880
$$ 313264 314551 309190 318310 338043 353786 387662 402539 402633 410334 369430 345567 334295 367175
8602C67175L0343M055k0319k5157j2669K8786J3544K364K5564J6224J3251J6078
$$ 367175 397518 401573 381254 356097 343428 372214 385758 388122 413686 429910 443161 459239
8590D59239J7800k822K3095K4522L5867K1839N184k4596p899K814K076l2775k0133
$$ 459239 477039 474217 497312 521834 557701 579540 584724 560128 552229 555043 557119 524344 504211
8577E04211j2470k6207n1216m6993m3279l452M4817J1400j4350j3606k126R697
$$ 504211 491741 465534 414318 367325 324046 320594 365411 376811 362461 348855 346729 356426
8565C56426k126l0985L944J0545j9595j9683q921K8941l37o26N086j963K2164
$$ 356426 354300 323315 327259 337804 318209 298526 289605 318546 318209 317583 322669 320706 342870
8552C42870j234j1237k3174l2495n8208j8507L0747P931Q482L0072K1173L847
$$ 342870 341636 330399 307225 274730 216522 198015 228762 236693 245175 275247 296420 300267
8540C00267j3068N067j013o769k899j1166N271M6025K2947l33j6669l8601j5531
$$ 300267 287199 292266 291253 284484 281585 270419 275690 321715 344662 344329 327660 289059 273528
8527B73528J8423J0729K4660J9748J6956P533k9235m376N971j6726k6375J1673
$$ 273528 291951 302680 327340 347088 364044 371577 342342 337966 343937 327211 300836 312509
8515C12509M792o114k2283j937r417j2373j3762K0332J3587m692j7012j5343o233
$$ 312509 317301 311187 288904 286967 277550 265177 251415 271747 285334 280642 263630 248287 242054
8502B42054k6351n1657j0489n392p725O005R345K9786j813k7040Q384J0277J3365
$$ 242054 215703 164046 153557 148165 140440 146445 155790 185576 183763 156723 165107 175384 188749
8489A88749J8412p159j4322n025j2062J6527n764k656M696N211r279k830j2996
$$ 188749 207161 200002 185680 180655 168593 185120 179356 176700 181396 186607 177328 174498 161502
8476A61502j841m138o207J2062j4258j0439J4735P32j2021J1754L9433Q026R168
$$ 161502 159661 155523 149316 161378 147120 136681 151416 152148 140127 151881 191314 199340 208508
8463B08508p368k933K6447J9374P661l1456j8974l98k202J762p324J458J4617
$$ 208508 201140 198207 224654 244028 251689 220233 201259 200861 198659 200421 193097 194555 209172
8450B09172P261j3993K486j7014l8411k3089J8479L9101K0377K52J8066j893k3556
$$ 209172 216433 202440 204926 187912 149501 126412 144891 183992 204369 204621 222687 220794 197238
8437A97238j9974L480j5696k6730R480L3366m156n146j5105J1051L747j6077J4750
$$ 197238 177264 180744 165048 138318 147798 181164 177008 171862 156757 167808 171555 155478 170228
8424A70228l54M888K3019j8755L539r056j8569Q666m987j3715k830J38k0657N999
$$ 170228 169874 174762 197781 179026 182565 173509 154940 163606 158619 144904 142074 142212 121555 127554
8410A27554R058O887j155J9371j5217l1216l15M1912J1696m923L1297K4361j8693
$$ 127554 136612 143499 142344 161715 146498 115282 114967 156879 168575 163652 194949 219310 200617
8397B00617K757k094k7723p692j6372l1594K1121K7363l0207j4404j4749q170
$$ 200617 203374 201280 173557 165865 149493 117899 139020 166383 136176 121772 107023 98853
8385I8853Q374n566r753N115J0147R733J1966K280k5383j2284K8378M9011M206
$$ 98853 107227 101661 91908 97023 107170 116903 128869 131149 105766 93482 121860 170871 175077
8372A75077j051j459N603K8316n031l2149K456R268k0498o623j0068O126J5705
$$ 175077 174026 172567 178170 206486 201455 169306 171762 181030 160532 153909 143841 149967 165672
8359A65672J4365J8694N03p4J888k4955j044N284j3198j6488R776J5780j2805
$$ 165672 180037 198731 199234 199160 201048 176093 175049 180333 167135 150647 160423 176203 163398
8346A63398l3660m647J86J2905p841l5223J3708J7594j0269O954J6218K896l1849
$$ 163398 129738 125091 125277 138182 130341 95118 108826 126420 116151 123105 139323 142219 110370
8333A10370j8802J6751P108j0129j4679j360J3599j900m047k3362M084K5379O453
$$ 110370 91568 108319 115427 105298 90619 89259 102858 100958 96911 73549 77633 103012 109465
8320A09465K2800R820o469Q233m520k8659k5999N835j246o409j9735n194K469
$$ 109465 132265 142085 135616 143849 139329 110670 84671 90506 89260 82851 63116 57922 60391
8307F0391K8337L9474K0534k6115J3088J0451l285l736J576R85j3668j6664j0352
$$ 60391 88728 128202 148736 122621 135709 146160 142875 139139 140715 141700 128032 111368 101016
8294A01016k8667K4100J3451j1904k0396N015O177j0289l128Q952J7928Q151j3069
$$ 101016 72349 96449 109900 97996 77600 82615 88792 78503 75375 84327 102255 110406 97337
8281I7337N651K2392j1841j9955k1085j3151K0796N896J5904J2271K0439j7073
$$ 97337 102988 125380 113539 93584 72499 59348 80144 86040 101944 114215 134654 117581
8269A17581q080J7597K349M856k3490n1105Q735K9052j0336j6584l486j9057l6362
$$ 117581 109501 127098 129447 134303 110813 59708 68443 97495 87159 70575 67089 48032 11670
8256A1670p417K8437J5817K1176j1794N655L0382J9276J2854r660k2094j7604
$$ 11670 4253 32690 48507 69683 57889 63544 93926 113202 126056 116396 94302 76698
8244G6698j4983R430J2697o088O802L692k0192p465J5630K5288m236k0881Q576
$$ 76698 61715 71145 83842 77754 84556 88248 68056 60591 76221 101509 97273 76392 84968
8231H4968J6078L684q084j6842J3851J8377K4990n424J412J9323K8237L0759k3012
$$ 84968 101046 104730 96646 79804 93655 112032 137022 131598 133010 152333 180570 211329 188317
8218A88317l8692j8840M197k2471k1525L625N632O790n064q162Q700K2944j4171
$$ 188317 149625 130785 134982 112511 90986 94611 100243 107033 101969 93807 102507 125451 111280
8205A11280j8098K745j008p370k838k822m946K1030J349l3303K8601K9098L156
$$ 111280 93182 95927 94919 87549 84711 81889 76943 97973 99322 66019 94620 123718 126874
8192A26874J4922o311j7394j5758Q307P927L105R701j6630k251k6517j0476n24
$$ 126874 141796 135485 118091 102333 110640 118567 121672 131373 114743 112492 85975 75499 74975
8179G4975P330Q29j7364j7362M003K5551n548p491l4680m5094J8670J6420J6041
$$ 74975 82305 83134 65770 48408 52411 77962 72414 64923 30243 -14851 3819 20239 36280
8166C6280N312l4295r987q94K1142J6838l376L1049L0263p278q492L0635K282
$$ 36280 41592 7297 -2690 -3584 17558 34396 31020 62069 92332 85054 76562 107197 109479
8153A09479k6584l7230J3156J0759l0944P170K8160j2176L4692N3886K113l0009
$$ 109479 82895 45665 58821 69580 38636 45806 73966 61790 96482 150368 152481 122472
8141A22472j7592O778K2800k225j7111R406J7589K6982M0721L8550j194k2455
$$ 122472 104880 111658 134458 132233 115122 124528 142117 169099 209820 248370 247176 224721
8129B24721j9802k6563k5749K3926r651j508K1915k4287k2052l718O28k40j8543
$$ 224721 204919 178356 152607 176533 166882 165374 187289 163002 140950 137232 137860 137620 119077
8116A19077J6770j6504k5576Q278o614j6941J519k479j3586o338j6816J7370J2634
$$ 119077 135847 119343 93767 102045 95431 78490 80009 77530 63944 57606 40790 58160 70794
8103G0794J7450N538k4637o261j835j0727Q615p47r043j4593p457K4377j901M101
$$ 70794 88244 93782 69145 62884 61049 50322 58937 58190 49147 34554 27097 51474 49573 53674
8089E3674O21J0812M0538K591k7586j3513j2018N637K7926o545l2392p987J7144
$$ 53674 54295 65107 105645 108236 80650 67137 55119 60756 88682 82137 49745 41758 58902
8076E8902L5119n298j4726Q451N771p512M33J0285M76j5807K3946N875R153J7388
$$ 58902 94021 88723 73997 82448 88219 80707 81140 91425 91901 76094 100040 105915 115068 132456
8062A32456j6506l4257k5040J3487l848l858Q964n09K5861J7123M098J0223L267
$$ 132456 115950 81693 56653 70140 66292 62434 71398 70889 96750 113873 117971 128194 131461
8049A31461R064j5049l3188q98J706j293K08k0623L271J4630J3119L454P784j162
$$ 131461 140525 125476 92288 91390 93096 91803 92011 71388 74659 89289 102408 105862 113646 112484
8035A12484j1218j6055k0492j556M1464K1892k0566o379J6314j992k9675k1373
$$ 112484 101266 85211 64719 63163 104627 126519 105953 99574 115888 113896 84221 62848
8023F2848J7722K3745R801j5410l867j783r984K877J9477r406K414J9982J525
$$ 62848 80570 104315 114116 98706 94839 93056 83072 85949 105426 96020 98434 118416 119941
8010A19941J9019J5503L4734j1513n5820j5193R269J9039r636j7365j9484j1184
$$ 119941 138960 154463 189197 177684 121864 106671 115940 134979 125343 107978 88494 77310
7998G7310J4073J1924P604J9636o817K932P401j1234L144l3512j8640j1461L0353
$$ 77310 91383 103307 110911 130547 123730 126662 134063 122829 125973 92461 73821 62360 92713
7985I2713J7198Q139J5047m221K60J6569l3296m7186J4659O605P828J863l8482
$$ 92713 109911 118050 133097 128876 129136 145705 112409 65223 79882 86487 94315 96178 57696
7972E7696j8340j1592j0600J6495l522K8616K4084j8666j2582Q695L9236K8792
$$ 57696 39356 27764 17164 33659 30137 58753 82837 64171 51589 60284 99520 128312
7960A28312j4287l524k4542r712J033O414l762P691K4902K788j5749m426r10R705
$$ 128312 114025 110501 85959 76247 77280 83694 79932 87623 112525 115313 99564 95138 94228 103933
7946A03933J7948L6183j3529k1644o576o916r105J5288o801R183j3981J5548K700
$$ 103933 121881 158064 144535 122891 116315 109399 100294 115582 108781 117964 103983 119531 122231
7933A22231m9965j2954J8223p110j6924K399p481K1598R732R322j394j5580l1556
$$ 122231 72266 59312 77535 70425 53501 55900 48419 70017 79749 89071 87677 72097 40541
7920D0541k0586K9662M7269J9950n2464m7109J5034J6139M4248L9725j1035J277
$$ 40541 19955 49617 96886 116836 64372 17263 32297 48436 92684 132409 121374 122651
7908A22651k6995l543j0640j3365J127l2055N993J5141p677j5794j0205J7407
$$ 122651 95656 92113 81473 68108 69235 37180 43173 58314 50637 34843 24638 42045
7896D2045J3161p633j2502J3299k3715k6546j2324J0396n415Q404K2559J8778
$$ 42045 55206 47573 35071 48370 24655 -1891 -14215 -3819 -9234 -830 21729 40507
7884D0507j684j3533K348J422N405K167P751L0241m991l8751l73M2974n790l65
$$ 40507 38823 25290 27638 29060 34465 36632 44383 74624 69633 30882 30509 73483 67693 67328
7870F7328q43J5453j4308j9750J087k8517J3296m958n505K9105R709q532j2182
$$ 67328 66485 81938 67630 47880 48967 20450 33746 28788 23283 52388 62097 53565 41383
7857D1383j3812j4877L54j1529j7849K2704K3826j461M06j7176k2216K3014M916
$$ 41383 27571 12694 13048 1519 -16330 6374 30200 28739 29145 11969 -10247 12767 17683
7844A7683j1065r250O903P473L038Q737k513K0044J7705J4362l7123o173q832
$$ 17683 6618 -2632 4271 11744 14782 23519 21006 41050 58755 73117 35994 29821 20989
7831B0989l6569L9551L9746o414r78r445j9410k4444n195L2600K2559j5834j0604
$$ 20989 -15580 23971 63717 57303 56325 46880 27470 3026 -2169 30431 52990 37156 26552
7818B6552J2424nj5569j6212K2473P421p080n776j1503P726j8230K4071M8408
$$ 26552 38976 38971 23402 7190 29663 37084 30004 24228 12725 20451 2221 26292 74700
7805G4700L998k1043k9790K948J6888j559m043j1394j3486K0291l44l0155o850
$$ 74700 78698 57655 27865 30813 47701 46142 42099 30705 17219 37510 37166 7011 161
7792A61L6332j723j7999n066K9146l0045r109L1447M498l113M03J2984o023m3687
$$ 161 36493 34770 16771 11705 40851 10806 1697 33144 37642 34529 34932 47916 41893 -1794
7778a794p14n080J0069M036k5928o583L0688J7293o750J9583L404k3317J5071
$$ -1794 -2508 -7588 2481 6517 -19411 -25994 4694 21987 15237 34820 38224 14907 29978
7765B9978m530J828K5151k4548l9171J8228M14k2808N096K9950L241j3006j2918
$$ 29978 25448 27276 52427 27879 -11292 6936 7350 -15458 -10362 19588 22829 9823 -3095
7752c095j0955K470K9787r71M627l90j4752P739j3999J0415m714j8418q274K5616
$$ -3095 -14050 -11580 18207 17236 21863 21473 6721 14460 461 10876 6162 -12256 -20530 5086
7738E086J9568j3396J9297K0221l1854n452K5055R796m0346j5259M497J0720J1074
$$ 5086 24654 11258 30555 50776 18922 13470 38525 48321 7975 -7284 -2787 7933 19007
7725A9007j4504r694K0134J1722J736j3589k3679J1708J1038p618m229K7672m774
$$ 19007 4503 -5191 14943 26665 28401 14812 -8867 2841 13879 6261 2032 29704 24930
7712B4930m477J9147j2774j4917j2749n125j5263m959L6578K7894k8395j6520
$$ 24930 20453 39600 26826 11909 -840 -5965 -21228 -26187 10391 38285 9890 -6630
7700f630K6895k048k1073K722J1421M16m392P463K9594j4440k4935j9027K3738
$$ -6630 20265 18217 -2856 -134 11287 11703 7311 14774 44368 29928 4993 -14034 9704
7687I704J3747N119K5141K3457j8827j9302k2972j7216j2725J2256J9641q797
$$ 9704 23451 28570 53711 77168 58341 39039 16067 -1149 -13874 -1618 18023 9226
7675I226p494k496O50J130j8790J9813J5416j6542n258J5814R557Q236j8433j2708
$$ 9226 1732 -764 -114 1016 -17774 2039 17455 913 -4345 11469 21026 29262 10829 -1879
7661a879j4285J6279J7382j6126o222N369j2919K520r48K4843N398r5m19L000
$$ -1879 -16164 115 17497 1371 -4851 518 -12401 -9881 -10829 14014 19412 19317 18898 21898
7647B1898k5010j6165J8177N58M999K038J8820q547k2888L2030J3419l8187k1702
$$ 21898 -3112 -19277 -1100 -542 4457 6495 25315 16768 -6120 25910 39329 1142 -20560
7634b0560k559J7727q898R041J9120K2832q642O933k4666r248j8017m928J0405
$$ -20560 -23119 -5392 -14290 -5249 13871 36703 28061 34994 10328 1080 -16937 -21865 -11460
7621a1460J2116J5882l1135j2379N515J0861L059J0238j0488k682R054M169o596
$$ -11460 656 16538 -14597 -26976 -21461 -10600 -7541 2697 -7791 -10473 -1419 2750 -3846
7608c846J7375J1175J4746k1477k5120k4078K55k426O896J0822R302P43n05L3811
$$ -3846 13529 24704 39450 17973 -7147 -31225 -30970 -33396 -26500 -15678 -6376 -5633 -6138 27673
7594B7673L456j3202J4946K1927j2285m9619j9474L9170J6736K516q394k0473
$$ 27673 31129 17927 32873 54800 42515 -7104 -26578 12592 29328 31844 23450 2977
7582B977J1152L8589J1700j2501j9801j0484j5007p829j4911K2220M301J2835
$$ 2977 14129 52718 64418 51917 32116 21632 6625 -1204 -16115 6105 10406 23241
7570B3241L74l4530j9664J349K4228j5624j4892P235K2058J1141j6039M032N264
$$ 23241 23615 -10915 -30579 -29230 -5002 -20626 -35518 -28283 -6225 4916 -11123 -7091 -1827
7557a827j7212M129M971J2366k107j2163k1421L443L3866J0268k4403l9052K6677
$$ -1827 -19039 -14910 -9939 2427 320 -11843 -33264 -29821 4045 14313 -10090 -49142 -22465
7544b2465L2334J0065J4756j3661k0824j0423j4455j8023J8037K3508r85J2010
$$ -22465 9869 19934 34690 21029 205 -10218 -24673 -42696 -24659 -1151 -2136 9874
7532I874K163O203J3008k8377k3217J0179K316K4181J1317k2434p98k771K4475
$$ 9874 12037 18240 31248 2871 -20346 -10167 -7851 16330 27647 5213 4415 1644 26119
7519B6119J6316k9972k1479J8705K8259j4729l6055j8845J7697L6112Q932j4370
$$ 26119 42435 12463 -9016 9689 37948 23219 -12836 -31681 -13984 22128 31060 16690
7507A6690r373J1526R017n514o137o127j3298r635j6q460o108J5432j2836J7372
$$ 16690 7317 18843 27860 22346 16209 10082 -3216 -12851 -12867 -21327 -27435 -12003 -24839 -7467
7493g467L3864n471l0739o485N630K8471K6231J0591k4341L466r163O273j41k7553
$$ -7467 26397 20926 -9813 -16298 -10668 17803 44034 54625 30284 33750 24587 30860 30719 3166
7479C166P280K6115K474o214k1182n366p840J2998J0319j0218k2031J9199k843
$$ 3166 10446 36561 39035 32821 11639 6273 -1567 11431 21750 11532 -10499 8700 5857
7466E857j9610J741K9371K0160J066k3558L377j0326l433K2406Q361J5486j2135
$$ 5857 -13753 -12012 17359 37519 38585 15027 18404 8078 4645 27051 35412 50898 38763
7453C8763j6723P339j6443l4644r509J3998k706l800O179Q782K9806L1243R602
$$ 38763 22040 29379 12936 -21708 -31217 -17219 -19925 -23725 -17546 -8764 21042 52285 61887
7440F1887r147k6597j1132k321q614j006J567K94J5582l058k5825j7101Q957M2
$$ 61887 52740 26143 15011 12690 4076 3070 4637 4931 20513 17455 -8370 -25471 -16514 -16472
7426a6472J868J40R085Q823J1801M632J2581j7074j1696p962j7485j5434J079
$$ -16472 -14604 -14464 -5379 3444 15245 19877 32458 15384 3688 -4274 -21759 -37193 -36114
7413c6114j5183O658J5241J5424M578n266k7037k3876K143K8720Q590o735R396
$$ -36114 -51297 -44639 -29398 -13974 -9396 -14662 -41699 -65575 -63432 -34712 -26122 -32857 -23461
7400b3461M4003J3048l0329j0389K5847J851p545j3148j8312j6863k3428l942
$$ -23461 20542 33590 3261 -7128 18719 20570 13025 -123 -18435 -35298 -58726 -62668
7388f2668K0531J5179K4234P25j899J8448n471j740P018r248l5756j6220P033
$$ -62668 -42137 -26958 -2724 -1999 -3898 14550 9079 7339 14357 5109 -30647 -46867 -39834
7375c9834j3515m567L9222J1707j325M117j6008K7227J8814n473J4021m060j4327
$$ -39834 -53349 -57916 -18694 -6987 -8312 -4195 -20203 7024 25838 20365 34386 30326 15999
7362A5999j4022n53r727n844k129k24j3055k3311J0845L4087j1256k7743j7051
$$ 15999 1977 1424 -8303 -14147 -16276 -16500 -29555 -52866 -42021 -7934 -19190 -46933 -63984
7349f3984J3916K7925n371j663J3917j0115J9438O021k1919R00K5852p698K869
$$ -63984 -50068 -22143 -27514 -29177 -15260 -25375 -5937 84 -21835 -20935 4917 -2781 88
7336H8k8075k5038J7705K2801q854n130m147m465K4142L092K3212N130q575j818
$$ 88 -27987 -53025 -35320 -12519 -21373 -26503 -30650 -35115 -10973 -7881 15331 20461 11886 10068
7322A0068m659J3151J6237N788J628J4085J1823j1442q524j150q615k0357j7127
$$ 10068 5409 18560 34797 40585 42213 56298 68121 56679 48155 47005 38390 18033 906
7309I06m946J9668J076l9975J0567M027n844J9460P163N793l5519L3136K6035
$$ 906 -4040 15628 16704 -23271 -12704 -8677 -14521 4939 12102 17895 -17624 15512 41547
7296D1547n152j0148k3354M145L8108l6310l5452p896L7205M0026J3485q397l5494
$$ 41547 36395 26247 2893 7038 45146 8836 -26616 -34512 2693 42719 56204 47807 12313
7283A2313j0072J3107j0293k457N21N591J9598J9002j1777o999q886k3575R580
$$ 12313 2241 15348 5055 2598 3119 8710 28308 47310 35533 28534 19648 -3927 5653
7270E653J8184l6226o889q728K046J5966J2520n211K1603j122l7797J1364Q224
$$ 5653 23837 -12389 -19278 -28006 -25960 -9994 2526 -2685 18918 17796 -20001 -8637 -413
7257d13J0409R733k3521j3579K1759L8243J8673k4001k3031j627k222J8101O339
$$ -413 9996 19729 -3792 -17371 4388 42631 61304 37303 14272 12645 10423 28524 34863
7244C4863J20K1977J1265m6406j6329J6410K283n806q872n588o171l4505j6718
$$ 34863 34983 56960 68225 21819 5490 21900 24183 18377 9505 3917 -2254 -36759 -53477
7231e3477J1253L288O701K8984P743l6364K0621J0453j5374k4982j7184K6708
$$ -53477 -42224 -38936 -32235 -3251 4492 -31872 -11251 -798 -16172 -41154 -58338 -31630
7219c1630J7586J0280K0464J5067q082k0603M493O153j6492l2224K4893K9622
$$ -31630 -14044 -3764 16700 31767 23685 3082 7575 13728 -2764 -34988 -10095 19527
7207A9527R416j6625j8408n932q888Q914L682j6658n947L6292J4883j7581j7278
$$ 19527 28943 12318 -6090 -12022 -20910 -11996 -8314 -24972 -30919 5373 20256 2675 -14603
7194a4603j2988k816j4408k8229n50L5168K3246J5902O676J5977n298o958o67
$$ -14603 -27591 -30407 -44815 -73044 -73594 -38426 -15180 722 7398 23375 18077 11119 10452
7181A0452k5416k0617k7667K6382l136j6526J4683L7396J1187r217k4387k9288
$$ 10452 -14964 -35581 -63248 -36866 -40002 -56528 -41845 -4449 6738 -2479 -26866 -56154
7169e6154K6887L0701o597k2092J3879K8080k3134j2343J2385p290K141L536l356
$$ -56154 -29267 1434 -5163 -27255 -13376 14704 -8430 -20773 -8388 -15678 -13537 -10001 -13357
7156a3357j2558j4618K488J246l589P889q797O70L1324N229l269j3942N785K0382
$$ -13357 -25915 -40533 -38045 -36799 -40388 -32499 -41296 -40626 -9302 -4073 -7342 -21284 -15499 4883
7142D883J2306q264k9321O518o486o981q94R064M994q97J720J4410j137k0133
$$ 4883 17189 8925 -20396 -13878 -20364 -27345 -28239 -19175 -14181 -15078 -13358 1052 -85 -20218
7128b0218m345N536P601J822j7427K0580o766j2276j8524R922M3754n848j9212
$$ -20218 -24563 -19027 -11426 -9604 -27031 -6451 -13217 -25493 -44017 -34095 9659 3811 -15401
7115a5401J5654J9806J8205j4659j4584J1114l834j7246k4857q691n25J5448k330
$$ -15401 253 20059 38264 23605 9021 20135 16301 -945 -25802 -34493 -35018 -19570 -21900
7102b1900J0145J2437j579n474J1160k9999N728L523J1629J2169j6046j709l913
$$ -21900 -11755 682 -897 -6371 4789 -25210 -19482 -15959 -4330 7839 -8207 -9916 -13829
7089a3829q222P327j4467j2844k0137P484K6637j661L172p834m710J7946J2576
$$ -13829 -22051 -14724 -29191 -42035 -62172 -54688 -28051 -29712 -26540 -34374 -39084 -21138 -8562
7076h562q753J3641K715J0002n914j1856j1056q087J1534J3771j9091L983K9100
$$ -8562 -17315 -3674 -959 9043 3129 -8727 -19783 -27870 -16336 -2565 -21656 -17673 11427
7063A1427K4152K937j1009k9887k9437j1171k266M904J3038J4971J718n692R82
$$ 11427 35579 38516 27507 -2380 -31817 -42988 -45254 -40350 -27312 -12341 -10623 -16315 -15333
7050a5333n168J9496O02K380J4577Q963J769k0405r525n2j7073L1145j3761j1068
$$ -15333 -20501 -1005 -403 1977 16554 25517 27286 6881 -2644 -2696 -19769 11376 -2385 -13453
7036a3453P565L752j459L743K0848J916j4830j0912R797q57J905j3198k4691J0817
$$ -13453 -5888 -2136 -3595 148 20996 22912 8082 -2830 6967 6110 8015 -5183 -29874 -19057
7022a9057O65j8635R222K9237r356l9461Q593p386P717p896j9768J1433J1748
$$ -19057 -18392 -37027 -27805 1432 -7924 -47385 -38792 -46178 -38461 -46357 -66125 -54692 -42944
7009d2944j19J0970q26K2915M126r794l9600j2356J5206K2741K2998J9196J2046
$$ -42944 -43063 -32093 -32919 -10004 -5878 -15672 -55272 -67628 -52422 -29681 -6683 12513 24559
6996B4559j8197j5399k3768n960j056K1911Q19P672L5937k7878l505l1800k1206
$$ 24559 6362 -9037 -32805 -38765 -39821 -17910 -17091 -9419 26518 -1360 -4865 -36665 -57871
6983e7871K0876L9483R136k2434k8790J1222K832P63p071K6856l366m323J3416
$$ -57871 -36995 2488 11624 -10810 -39600 -28378 -25546 -24783 -31854 -4998 -8364 -12687 729
6970G29J2128j5515k3121k6198L0434K8673R858J4957j9001m6326K298N977k8704
$$ 729 12857 -2658 -25779 -51977 -21543 7130 16988 31945 12944 -33382 -31084 -25107 -53811
6957e3811j9492J1594L8558J3405l8555O37K1841M0170p869j9233J5275L4267
$$ -53811 -73303 -61709 -23151 -9746 -48301 -47664 -25823 14347 6478 -12755 2520 36787
6945C6787L391r8j6676Q173p213q267j811Q202p406r895J6183J6107j3940j9659
$$ 36787 40178 40080 23404 31577 24364 16097 14286 22488 15082 5187 21370 37477 23537 3878
6931C878m855o123m290o663J7729N213j0568J8219L066o563j246K742j3436L157
$$ 3878 -977 -7100 -11390 -18053 -324 4889 -5679 12540 15606 9043 7797 10539 -2897 260
6917B60J4991L572R842m7491j7076J612j168k2691K5243L6519j0553J9676K343
$$ 260 15251 18823 28665 -18826 -35902 -34290 -35458 -58149 -32906 3613 -6940 12736 15079
6904A5079J2897J9726m2711k4584K5895L0980J1050m1458n4391o470K0109L201
$$ 15079 27976 47702 4991 -19593 6302 37282 48332 6874 -47517 -53987 -33878 -30677
6892c0677J6558J9284j0705j2005r156m982J6515J2904q865j1124J4243J2249
$$ -30677 -14119 5165 -5540 -17545 -26701 -31683 -15168 -2264 -11129 -22253 -8010 4239
6880D239j1100l0986J1143K6268K9626P211k0518k7560o299K8682M591k9791o509
$$ 4239 -6861 -37847 -26704 -436 29190 36401 15883 -11677 -17976 10706 15297 -14494 -21003
6867b1003O573K8915p705j3008j3918K4652P440j537j8625o560l2639k0217K680
$$ -21003 -14430 14485 6780 -6228 -20146 4506 11946 10409 -8216 -14776 -47415 -67632 -64952
6854f4952J2291K3429K3506J5967m342j0047j9140k1438L7562J4279m0070j4997
$$ -64952 -52661 -29232 -5726 10241 5899 -4148 -23288 -44726 -7164 7115 -32955 -47952
6842d7952L659K6042J7378l8974k1313P097J1173J6059L1580j5422J9093J2348
$$ -47952 -44293 -18251 -873 -39847 -61160 -54063 -42890 -26831 4749 -10673 8420 20768
6830B0768l125r649j4078k7791J9366l666r96J1868j1796J6403K2755k4160l648
$$ 20768 17643 7994 -6084 -33875 -14509 -18175 -19171 -7303 -19099 -2696 20059 -4101 -7749
6817g749p137k3302k862J3716J0590n977j4016L0190J0860k3949J0485o021M5808
$$ -7749 -14886 -38188 -41050 -27334 -16744 -22721 -36737 -6547 4313 -19636 -9151 -15172 30636
6804C0636m753j3308K0163k0781k9571k514o071J284j3093R191K6928j9203m354
$$ 30636 25883 12575 32738 11957 -17614 -20128 -26199 -24915 -38008 -28817 -1889 -21092 -25446
6791b5446J9009J7184l0085k9847Q623Q736L1219K0474k780j0064j4546K044M5365
$$ -25446 -6437 10747 -19338 -49185 -40562 -31826 -607 19867 17087 7023 -7523 -5479 39886
6778C9886L953o674l2502j9887J9577J0745Q205k2719r803M301L2721q932K53
$$ 39886 43839 37165 4663 -15224 4353 15098 23303 584 -9219 -4918 27803 18871 19124
6765A9124j031q302r499r965k9787k3444k647K9197M0205J3621r595j665j7695
$$ 19124 18093 9791 292 -9673 -39460 -62904 -65551 -36354 3851 17472 7877 6212 -11483
6752a1483J0204m391j0945k6592J9417J1672r448P415r875q431L3292J5547j6420
$$ -11483 -1279 -5670 -16615 -43207 -23790 -12118 -21566 -14151 -24026 -32457 835 16382 -38
6739c8r225j6743m950J23j1732J8164J0460O262K792J0255J5434q400N871j624
$$ -38 -9263 -26006 -30956 -30833 -42565 -24401 -13941 -7679 -4887 5368 20802 12402 18273 16649
6725A6649J3770j1260m647k2735j146K5072J0600o094k5105p726j0852N22J9668
$$ 16649 30419 19159 14512 -8223 -9369 15703 26303 20209 -4896 -12622 -23474 -22952 -3284
6712c284k6249k6925K7488O005K339o119N507J4262P949j1706j675j1796q260
$$ -3284 -29533 -56458 -28970 -22965 -20626 -26745 -21238 -6976 973 -10733 -12408 -24204 -32464
6699c2464K8709l3870j0856K6297K2903L6394L6229k2411P53k4841j2673J5868
$$ -32464 -3755 -37625 -48481 -22184 719 37113 73342 50931 51684 26843 14170 30038
6687C0038K8508j7553l3724k6862o400j0440m715l373k0271J1906K0688L8672
$$ 30038 58546 40993 7269 -19593 -25993 -36433 -41148 -44521 -64792 -52886 -32198 6474
6675F474J7205n5290o686L131K6754j1772J220k6029K8K0095J8017k873k2693
$$ 6474 23679 -31611 -38297 -35166 -8412 -20184 -18964 -44993 -44965 -24870 -6853 -9726 -32419
6662c2419k2229k8394L780M809L764J9583J3281J8642M943m077K1502j3901k0660
$$ -32419 -54648 -83042 -79262 -74453 -70689 -51106 -37825 -19183 -14240 -18317 3185 -10716 -31376
6649c1376j7760K3132J2984j4009k0701J8156P769k4j4586J3078R968K455j7056
$$ -31376 -49136 -26004 -13020 -27029 -47730 -29574 -21805 -21829 -36415 -23337 -13369 -10914 -27970
6636b7970K151j704j2412p30J1199K868K0044J0817k5041j1222o379k2838K0858
$$ -27970 -25819 -27523 -39935 -40665 -29466 -26598 -6554 4263 -20778 -32000 -38379 -61217 -40359
6623d0359J1802j407j4916K7757J9265j3874J417m557n208k081j0116p178m020
$$ -40359 -28557 -29964 -44880 -17123 2142 -11732 -10315 -14872 -20080 -22161 -32277 -39455 -43475
6610d3475o683m363j4892J6288L4576J3647O384r191l1968m1417m190K5974l959
$$ -43475 -50158 -54521 -69413 -53125 -18549 -4902 1482 -7709 -39677 -81094 -85284 -59310 -63269
6597f3269l0809J2659L0986P362K6856L1783J3321j5324k9093l0172M351R854
$$ -63269 -94078 -81419 -50433 -43071 -16215 15568 28889 13565 -15528 -45700 -41349 -31495
6585c1495K6898l016j7775L0996l0624k5869o47L533m713O93L4046J3386m610
$$ -31495 -4597 -7613 -25388 5608 -25016 -50885 -51532 -47999 -52712 -52019 -17973 -4587 -9197
6572i197P370J9270K589m503Q141L696J731k8730K307M845j2362j8389P036J3050
$$ -9197 -1827 17443 20032 15529 23670 27366 29097 367 2674 7519 -4843 -23232 -16196 -3146
6558c146N169j5072k725r345j327J7504J3400n401l3477K609L1477j510J577L88
$$ -3146 2023 -13049 -15774 -25119 -26446 -8942 4458 -943 -34420 -31811 -334 -1844 -267 121
6544A21k1824q08J7573q295K816Q434O040j8199J33K1956j3249m33k1865j533
$$ 121 -21703 -22511 -4938 -13233 -10417 -1983 4057 -14142 -14009 7947 -5302 -5735 -27600 -29133
6530b9133J2530j8466J8073L8846P797l5785k5640L399L8960K3248K040J4417
$$ -29133 -16603 -35069 -16996 21850 29647 -6138 -31778 -28379 10581 33829 35869 50286
6518E0286l0582o337J7411r797j9962j4662n356k94K3365j036j8155j1967r925
$$ 50286 19704 13367 30778 20981 1019 -13643 -18999 -19293 4072 3036 -15119 -27086 -37011
6505c7011J0139R680j2120r705L736o212O456j0351J2014J0541M056J5138K2452
$$ -37011 -26872 -17192 -29312 -39017 -35281 -41493 -35037 -45388 -33374 -22833 -18777 -3639 18813
6492A8813Q800j7419N951l3446j9772K6062K4318J2302k7570l3159k1943K9025
$$ 18813 27613 10194 16145 -17301 -37073 -11011 13307 25609 -1961 -35120 -57063 -28038
6480b8038J9333m515j082R573J565n234J1759J5449K4793n940k0577n460j4209
$$ -28038 -8705 -13220 -14302 -4729 -3164 -8398 3361 18810 43603 37663 17086 11626 -2583
6467b583K884k4175k674J6504J1774j0901l270j2893l513J067L859Q290L4094
$$ -2583 301 -23874 -26548 -10044 1730 -9171 -12441 -25334 -28847 -27780 -23921 -15631 18463
6454A8463Q816K438q549J6951k4091j8797J315K22k1178j5263R34J4521l81O228
$$ 18463 27279 29717 21168 38119 14028 -4769 -3454 -3232 -24410 -39673 -38739 -24218 -24599 -18371
6440a8371k327j6630j31L8540J2056m286n323N130n711o837J7883K1265K948k3402
$$ -18371 -20698 -37328 -37459 1081 13137 8851 3528 8658 2947 -3890 13993 35258 38206 14804
6426A4804k110k268j3886j6961j4866P271L3164J0776k5281Q809q650l4799j2010
$$ 14804 12694 10426 -3460 -20421 -35287 -28016 5148 15924 -9357 -548 -9198 -43997 -56007
6413e6007L1706R498K948J9533r402j7906k5498k9373J7477L5233M4749m111k7499
$$ -56007 -24301 -14803 -11855 7678 -1724 -19630 -45128 -74501 -57024 -21791 22958 18847 -8652
6400h652k7467j5696j3075J4579K331K8138j2242p999K1997J3937j0105K025J897
$$ -8652 -36119 -51815 -64890 -50311 -47980 -19842 -32084 -40083 -18086 -4149 -14254 -12229 -10332
6387a0332j5620m799K409o77j7423j1992J1452P2L6090j4820p852J2959Q66K9225
$$ -10332 -25952 -30751 -28342 -29019 -46442 -58434 -46982 -46910 -10820 -25640 -33492 -20533 -19667 9558
6373I558R036j7256K670Q787r077n480j3736p669J5574M821K1512L6722k2300
$$ 9558 18594 1338 4008 12795 3718 -1762 -15498 -23167 -7593 -2772 18740 55462 33162
6360C3162l0928k5028Q839K8438p576l1039l593J1824r109J2469R81Q829l947
$$ 33162 2234 -22794 -13955 14483 6907 -24132 -27725 -15901 -25010 -12541 -11560 -2731 -6678
6347f678j2700K4385L222p438o370O62P171K703q009J7848J8311K945q918Q27
$$ -6678 -19378 5007 8229 791 -5579 -4917 2254 4957 -3052 14796 33107 36052 27134 27961
6333B7961k0414j3039j7867M978N873N201K2402O786j5980k1070J4124J55J4435
$$ 27961 7547 -5492 -23359 -18381 -12508 -7307 15095 21881 5901 -15169 -1045 -890 13545
6320A3545k5041j1882O641L1081j1917k9265j0283M040L795K396K4390j4447P910
$$ 13545 -11496 -23378 -16737 14344 2427 -26838 -37121 -33081 -29286 -26890 -2500 -16947 -9037
6307i037O748q013O440Q546j366j6795J1501K5882j8596p028J61K2212j2075k995
$$ -9037 -2289 -10302 -3862 4684 3318 -13477 -1976 23906 5310 -1718 -1557 20655 8580 5585
6293E585M124K0626j2788j7181O106o398M790p894J7405J117r402R670J1549n450
$$ 5585 9709 30335 17547 366 6472 74 4864 -3030 14375 15492 6090 15760 27309 21859
6279B1859k4570J505L874l526R838R988j1682K3942J659k6797k7742j4055K7754
$$ 21859 -2711 -1206 2668 -858 8980 18968 7286 31228 32887 6090 -21652 -35707 -7953
6266g953k291J292K2567O936q633j9432J2753L6318r790k8361j9616k223P331
$$ -7953 -10244 -8952 13615 20551 11918 -7514 5239 41557 31767 3406 -16210 -18433 -11102
6253a1102j178j3856L017l609k3099j4814K2148M819m2J2781J0070M343k2016
$$ -11102 -12280 -26136 -23119 -26728 -49827 -64641 -42493 -37674 -37716 -24935 -14865 -10522 -32538
6240c2538N571J4619q783m278o89J2897K3255j6654o309j3367j3575o874K3516
$$ -32538 -26967 -12348 -21131 -25409 -26098 -13201 10054 -6600 -12909 -26276 -39851 -46725 -23209
6227b3209L2442N49j5569j9000L743L7454k6100l3348l736J9515j8532O29j671
$$ -23209 9233 9782 -5787 -24787 -21044 16410 -9690 -43038 -46774 -27259 -45791 -45162 -46833
6214d6833J3282O085J4614K2184Q037k0962j3748K2006J0113J8580K4041j0200
$$ -46833 -33551 -27466 -12852 9332 17369 -3593 -17341 4665 14778 33358 57399 47199
6202D7199m779k1761m540n035R507j11P936r518R963l521m675l632K1355K3439
$$ 47199 42420 20659 16119 11084 20591 20480 28416 18898 28861 25340 20665 17033 38388 61827
6188F1827l7187j8818m790l0324P351J0955j335M327J0972J2551k0912N790k381
$$ 61827 24640 5822 1032 -29292 -21941 -10986 -12321 -7994 2978 15529 -5383 407 -1974
6175a974q301P460O986J3066N929Q397K6704L959l3575j0547J0683Q988m394p381
$$ -1974 -10275 -2815 4171 17237 23166 31563 58267 62226 28651 18104 28787 37775 33381 26000
6161B6000j9325P117Q620j022p07J0368j6509k6189j0168k376k3724K1806K9929
$$ 26000 6675 13792 22412 21390 20683 31051 14542 -11647 -21815 -24191 -47915 -26109 3820
6148C820Q255k1926q100m60J2731l1120j8190j1426m026K5023L7687M267J4008
$$ 3820 12075 -9851 -17951 -18411 -5680 -36800 -54990 -66416 -70442 -45419 -7732 -3465 10543
6135A0543J3951K6309L404L021j7479l9396j2284K5474l0461j9740J8402M3494
$$ 10543 24494 50803 54207 57228 39749 353 -11931 13543 -16918 -36658 -18256 25238
6123B5238j4325K950k9504k3781p037j6939N719L7026J1774k6145j5809J1757
$$ 25238 10913 13863 -15641 -39422 -46459 -63398 -57679 -20653 -8879 -35024 -50833 -39076
6111c9076L7228L3997J2591j414Q439j4691m3200l1510m030K8376L0613K181k0599
$$ -39076 -1848 32149 44740 43326 51765 37074 -6126 -37636 -41666 -13290 17323 19504 -1095
6098a095K0507J3239k4849o4394j7607P922O484k843k278J0844n9L4497l033j263
$$ -1095 19412 32651 7802 -56592 -74199 -66277 -59793 -62636 -64914 -54070 -54129 -19632 -22665 -23928
6084b3928j95J706J300J9866k3185J0281K0661K9778O926l6411l4881j4826k1647
$$ -23928 -24123 -22417 -21117 -1251 -24436 -14155 6506 36284 43210 6799 -28082 -42908 -64555
6071f4555J2329K7693q785K4700J1j0638j1772j0800J612J977L0487J0280l771
$$ -64555 -52226 -24533 -33318 -8618 -8607 -19245 -31017 -41817 -40205 -38228 -7741 2539 -1232
6058a232q081L2277J7254l9565j7418O850O329r533j7088k713R663N167k235j1598
$$ -1232 -9313 22964 40218 653 -16765 -9915 -3586 -13119 -30207 -32920 -23257 -18090 -20325 -31923
6044c1923l1047p53L4125m571K7657J944q175j514J0925k3078j1941k5292o947
$$ -31923 -62970 -63723 -29598 -34169 -6512 -4568 -12743 -14257 -3332 -26410 -38351 -63643 -70590
6031g0590R597K0573j1931p103m344K1225J3784j6125j9143M181J1506M1420P315
$$ -70590 -60993 -40420 -52351 -59454 -63798 -42573 -28789 -44914 -64057 -59876 -48370 -6950 365
6018C65J665J4775j8314j8039N152K815l6033J441L1634L742k4480O582M3465
$$ 365 2030 16805 -1509 -19548 -14396 -11581 -47614 -46173 -14539 -10797 -35277 -28695 14770
6005A4770O699m0685j4279J5403M4909J110Q985k3532N841N996l4661o8862j3893
$$ 14770 21469 -19216 -33495 -18092 26817 27927 36912 13380 19221 25217 -9444 -78306 -92199
5992i2199K9350J6424K2912J240j1757K4697k377j7911n953l41q475K483k439
$$ -92199 -62849 -46425 -23513 -22273 -34030 -9333 -11710 -29621 -35574 -35915 -44390 -41907 -44346
5979d4346P259J4641o415K2196J0935j3735M170k477j3697j8633K2262j4457l7947
$$ -44346 -37087 -22446 -28861 -6665 4270 -9465 -5295 -7772 -21469 -40102 -17840 -32297 -70244
5966g0244J2065K4075L1072K2647n974j803O220J1558O148j8442k2540k0904k3805
$$ -70244 -58179 -34104 -3032 19615 13641 11838 18058 29616 35764 17322 -5218 -26122 -49927
5953d9927O689L2181o043N0855J8486j8701J722k9021k0942j8974q373m16j7421
$$ -49927 -43238 -11057 -17100 33755 52241 33540 35262 6241 -14701 -33675 -42048 -42464 -59885
5940e9885L868M505K3562M939r831m338J4303L6260j4333l7677j8001M6133N0690
$$ -59885 -56017 -51512 -27950 -23011 -32842 -37180 -22877 13383 -950 -38627 -56628 -10495 40195
5927D0195L697n028j757j0824N471j3109k3694j500L333j9395J6704k0807j937
$$ 40195 43892 38864 37107 26283 31754 18645 -5049 -6549 -3216 -22611 -5907 -26714 -28651
5914b8651M988k8508j301M6048K4237M02l773l0684Q72m353l1681O492J9742q626
$$ -28651 -23663 -52171 -53472 -7424 16813 17215 13442 -17242 -16370 -20723 -52404 -45912 -26170 -34796
5900c4796M335n758j0831L3842K7373k6155j4420K675k4093k4191j5647K6094
$$ -34796 -30461 -36219 -47050 -13208 14165 -11990 -26410 -23735 -47828 -72019 -87666 -61572
5888f1572J3824j7736R098J4999L845M879k991J2091L7002J623k1233m909k6419
$$ -61572 -47748 -65484 -56386 -41387 -37542 -32663 -35654 -23563 13439 15062 -6171 -11080 -37499
5875c7499K3818l469j2419L0988k2317k0963L720k822n673K674L6404n299M745
$$ -37499 -13681 -17150 -29569 1419 -20898 -41861 -38141 -40963 -46636 -43962 -7558 -12857 -8112
5862h112K464k8827K084o714j9631L5123M4178j8018k7962j965j5065l950K402
$$ -8112 -5648 -34475 -32391 -39105 -58736 -23613 20565 2547 -25415 -27380 -42445 -46395 -43993
5849d3993K3613K2037q068k847J1729k2297J917J5244J3984J320k6636l6394q439
$$ -43993 -20380 1657 -6411 -9258 2471 -19826 -17909 -2665 11319 12639 -13997 -50391 -58830
5836e8830m896n304K8649K5399O433j2311J4364J779j1280Q998J0787Q921o609
$$ -58830 -63726 -69030 -40381 -14982 -8549 -20860 -6496 -4717 -15997 -6999 3788 12709 6100
5823F100k1078j9364q702l933k928K0161N495p08Q544q118K1484Q533J1633L286
$$ 6100 -14978 -34342 -43044 -46977 -49905 -29744 -24249 -24957 -16413 -24531 -3047 5486 17119 20405
5809B0405j6092J689j6712m016L8835l291J7810J1120M152j4494j9066k775J463
$$ 20405 4313 6002 -10710 -14726 24109 20818 38628 49748 53900 39406 20340 17565 19028
5796A9028k6711j544J238P116J3534J925Q519j1980k5575O307L5709m80l0805
$$ 19028 -7683 -9227 -7989 -873 12661 14586 23105 11125 -14450 -8143 27566 27086 -3719
5783c719j4865J1625j8419R629k684k2924m2449j020N5191q067K074J0862j2540
$$ -3719 -18584 -6959 -25378 -15749 -18433 -41357 -83806 -84826 -29635 -37702 -35628 -24766 -37306
5770c7306j3681K1704o714k141J2015L5957K8111M545j2183j0032n958J5142j5165
$$ -37306 -50987 -29283 -35997 -38138 -26123 9834 37945 42490 30307 20275 14317 29459 14294
5757A4294j1749K4658j8021p20P207k284r758k5361K030j70k437l525O500j967
$$ 14294 2545 27203 9182 8462 15669 13385 3627 -21734 -19704 -19874 -22311 -25836 -19336 -21303
5743b1303n611j2957N571j639K6631O865j2641j3717J1967O057R838o87n814J1276
$$ -21303 -26914 -39871 -34300 -35939 -9308 -2443 -15084 -28801 -16834 -10777 -939 -1626 -7440 3836
5729C836K3316q629l3076k7875L62K6302J0437Q603k3558j9984l155J9562K3790
$$ 3836 27152 18523 -14553 -42428 -42066 -15764 -5327 3276 -20282 -40266 -43421 -23859 -69
5716f9L0947Q775k1275k334J8352j3449k9154j1442j8541O602K509j9328L664
$$ -69 30878 39653 18378 16044 34396 20947 -8207 -19649 -38190 -31588 -29079 -48407 -44743
5703d4743J2118J9352o943J7727l260j0907o58k2883o639l269J1201P356l3364
$$ -44743 -32625 -13273 -20216 -2489 -5749 -16656 -17314 -40197 -46836 -50105 -38904 -31548 -64912
5690f4912J4094K1276K3537J2119n726J6193K331j703k7680k4379j8125j030k568
$$ -64912 -50818 -29542 -6005 6114 388 16581 18912 17209 -10471 -34850 -52975 -54005 -56573
5677e6573L6502k120j3605L142J3082J0952k8459J0314K6877o921K6191L5363
$$ -56573 -20071 -22191 -35796 -32654 -19572 -8620 -37079 -26765 112 -6809 19382 54745
5665E4745j9995k0362j8733J2150k3843l0721n759M1679K0931m680j0153J038
$$ 54745 34750 14388 -4345 7805 -16038 -46759 -52518 -10839 10092 5412 -4741 -3703
5653c703K1133M182m28j8235r477O438m513K1512n157J3068m991j2075j1282J1604
$$ -3703 17430 21612 21184 2949 -6528 -90 -4603 16909 11752 24820 19829 7754 -3528 8076
5639H076J2959k8848M367R242M092K1214j1401n1k0053j4243j4171k5203k5915
$$ 8076 21035 -7813 -3446 5796 9888 31102 19701 19650 -403 -14646 -28817 -54020 -79935
5626g9935J7723L1089J90K333J5771R003j5328K3615K6323K5079k5356j4941p070
$$ -79935 -62212 -31123 -30933 -28600 -12829 -3826 -19154 4461 30784 55863 30507 15566 8496
5613H496J4599r339r952J6633n207j6369L590k7315J9338J7743j7226l6492N350
$$ 8496 23095 13756 3804 20437 15230 -1139 2451 -24864 -5526 12217 -5009 -41501 -36151
5600c6151L0193Q537J302K0066m480j7351L316j2860O63J5581o241N929K6468
$$ -36151 -5958 2579 3881 23947 19467 2116 5432 -7428 -6765 8816 2575 8504 34972
5587C4972n349m0033j6882J0014K9916J2914o608n563J4694k347j5204l000J802
$$ 34972 29623 -10410 -27292 -17278 12638 25552 18944 13381 28075 25728 10524 7524 9326
5574I326K833o987l4062J4253K011K601p917O633q577L165n516j8021j0416P99
$$ 9326 12159 5172 -28890 -14637 -12626 -10025 -17942 -11309 -19886 -16721 -22237 -40258 -50674 -49875
5560d9875Q914j1594N586J5401K6124J7104K2635k3744j6467J1766K1295O11j3372
$$ -49875 -40961 -52555 -46969 -31568 -5444 11660 34295 10551 -5916 5850 27145 27756 14384
5547A4384q317j4125k4533n946O505L167N278J191l691L013K0774P654l043k6387
$$ 14384 6067 -8058 -32591 -38537 -32032 -28865 -23587 -22396 -26087 -23074 -2300 5354 2311 -24076
5533b4076k2933K6346J1551l2192m501K519M0433K0566J5825m155j6104k3512
$$ -24076 -47009 -20663 -9112 -41304 -45805 -43286 -2853 17713 33538 29383 13279 -10233
5521a0233j2843L7390J9451j0562k6830Q096j0691j1689k4809J99j4494j5483
$$ -10233 -23076 14314 33765 23203 -3627 4469 -6222 -17911 -42720 -42521 -57015 -72498
5509g2498J6473J3630K7412K243J4386O490k2795R31K751J4221J090k2665n8024
$$ -72498 -56025 -42395 -14983 -12740 1646 8136 -14659 -13728 -10977 3244 4334 -18331 -76355
5496g6355r606K1661L2306J5311K8971K3009j369n246j3431k4243r825K5249L1825
$$ -76355 -85961 -64300 -31994 -16683 12288 35297 33928 28682 15251 -8992 -18817 6432 38257
5483C8257k0440l7052J2889J8713J1935k0442k1651P467N061j8548q203J2451
$$ 38257 17817 -19235 -6346 12367 24302 3860 -17791 -10324 -5263 -23811 -32014 -19563
5471a9563J2774l5884K4794J7402q034k2865L612M2131k737J6094K381k945L199
$$ -19563 -6789 -42673 -17879 -477 -8511 -31376 -27764 14367 11630 27724 30105 27160 30359
5458C0359j0806J2343k085o848j4270Q291o067j6681K584m779P100J467K0132
$$ 30359 19553 31896 29811 22963 8693 16984 10917 -5764 -3180 -7959 -859 608 20740
5445B0740K8119q403m6517j4770n912j6120k095K3608L498L746k841o209r279
$$ 20740 48859 40456 -6061 -20831 -26743 -42863 -44958 -21350 -17852 -14106 -16947 -23156 -32435
5432c2435L0083J3001k2255j5902m728J944q082J3147p672j1323O491P547m34
$$ -32435 -2352 10649 -11606 -27508 -32236 -30292 -38374 -25227 -32899 -44222 -37731 -30184 -30618
5419c0618j1126Q023J1504J0149J070M947j098j8462L0350P906k3784o248k1304
$$ -30618 -41744 -33721 -22217 -12068 -10998 -6051 -7149 -25611 4739 12645 -11139 -17387 -38691
5406c8691m071K6940K9039J4099m0377l352J2661p837K0787K5874Q605r266k7775
$$ -38691 -42762 -15822 13217 27316 -13061 -16413 -3752 -11589 9198 35072 43677 34411 6636
5393F636n441Q735J1468p931k331k6204q369J2691P356j2958J3384l904j1927
$$ 6636 1195 9930 21398 13467 11136 -15068 -23437 -10746 -3390 -16348 -2964 -6868 -18795
5380a8795K887K8701J0041K905n814l2631j4990R052j0410j8302N704M218K7678
$$ -18795 -15908 12793 22834 25739 19925 -12706 -27696 -18644 -29054 -47356 -41652 -37434 -9756
5367i756J6431n604r497l482j3875R555Q254Q2P629r561j3066r249j3508p718
$$ -9756 6675 1071 -8426 -11908 -25783 -16228 -7974 -7892 -263 -9824 -22890 -32139 -45647 -53365
5353e3365j0099K336N361K7316j4138m145R139J3485J9512R728j6950k1178j3160
$$ -53365 -63464 -61128 -55767 -28451 -42589 -46734 -37595 -24110 -4598 5130 -11820 -32998 -46158
5340d6158J7874R300j850J4093J2394l4918O776m384K0889R590j2475p044J2159
$$ -46158 -28284 -18984 -20834 -6741 5653 -29265 -22489 -26873 -5984 3606 -8869 -15913 -3754
5327c754o717P120n024j9806J8829K7508J6795j3665j8170P932n18j9915l403
$$ -3754 -10471 -3351 -8375 -28181 -9352 18156 34951 21286 3116 11048 10530 -9385 -12788
5314a2788R22r808J7516L751k9434q787R556J9055J6339r311k9979J0805L0261
$$ -12788 -11866 -21674 -4158 -407 -29841 -38628 -29072 -10017 6322 -2989 -32968 -22163 8098
5301H098L548j2168j7211k7538n260j9649m771L6116M4304P745M439k2918l7366
$$ 8098 11646 -522 -17733 -45271 -50531 -70180 -74951 -38835 5469 13214 17653 -5265 -42631
5288d2631k5637J9095K803Q648J6634L0067J8557J9313J515N233j1484m601m9501
$$ -42631 -68268 -49173 -46370 -37722 -21088 8979 27536 46849 48364 53597 42113 37512 -11989
5275a1989j1971k044j1503j7894K2133J2861L470P27j1731K6305J5443k5213n2
$$ -11989 -23960 -26004 -37507 -55401 -33268 -20407 -16937 -16210 -27941 -1636 13807 -11406 -11458
5262a1458L1313p647r865J0940l7598k5347J5799J2064K880J495J9948k733l150
$$ -11458 19855 12208 2343 13283 -24315 -49662 -33863 -21799 -18919 -17424 2524 -209 -3359
5249c359O36j9759j2624M621M320k4527j346L6507M3347O430l1027k0189p281
$$ -3359 -2723 -22482 -35106 -30485 -26165 -50692 -52038 -15531 27816 34246 3219 -16970 -24251
5236b4251k0545J5497q814Q995R358k4784O189k545J530r722O697J4325m586J3533
$$ -24251 -44796 -29299 -38113 -29118 -19760 -44544 -38355 -40900 -39370 -49092 -42395 -28070 -32656 -19123
5222a9123K908K647j2461P353J8490L021o336J1813j7780j4122K1579j4191j9065
$$ -19123 -16215 -13568 -26029 -18676 -186 2835 -3501 8312 -9468 -23590 -2011 -16202 -35267
5209c5267K2755J0843j7398k9875J6916N029M916j2127K6563k499j8857J3313
$$ -35267 -12512 -1669 -19067 -48942 -32026 -26997 -22081 -34208 -7645 -10144 -29001 -15688
5197a5688N741j556R119j33Q118j3208l0846p055O1094K575k4102j4335J6575
$$ -15688 -9947 -11503 -2384 -2517 5601 -7607 -38453 -45508 15586 18161 -5941 -20276 -3701
5184c701J9829L369J7936J0253k9960j9677r159l420j1115j635K2436N743P841
$$ -3701 16128 19497 37433 47686 17726 -1951 -11110 -14530 -25645 -27280 -4844 899 8740
5171H740j6553P860o69j9942K616j4912k9877j3324K2522J3312K0824j2749R124
$$ 8740 -7813 47 -622 -20564 -17948 -32860 -62737 -76061 -53539 -40227 -19403 -32152 -23028
5158b3028r807o211j5670J4886J7152J8102L2518j0270k5826n537j0473j8446
$$ -23028 -32835 -39046 -54716 -39830 -22678 -4576 27942 17672 -8154 -13691 -24164 -42610
5146d2610j5248L213L9201O98J2389J8440O527j1292k9275k8833J6455j9308J2501
$$ -42610 -57858 -54645 -15444 -14746 -2357 16083 22610 11318 -17957 -46790 -30335 -49643 -37142
5133c7142L558k8123j7496J422P144o671k7163K0056L0227J1910L529J7155k5968
$$ -37142 -33584 -61707 -79203 -77781 -70637 -77308 -104471 -84415 -54188 -42278 -38749 -21594 -47562
5120d7562j7180J384J8961K5118N569P050j0970N552K3123l771k3944J6125J0331
$$ -47562 -64742 -63358 -44397 -19279 -13710 -6660 -17630 -12078 11045 7274 -16670 -545 9786
5107I786J0122k127o380j4848K4118N258j9600j0481o765Q977K4148Q009k3722
$$ 9786 19908 17781 11401 -3447 20671 25929 6329 -4152 -10917 -1940 22208 30217 6495
5094F495N155k9826j5048J6980J5952K9234mk8905l3254J943J1512J083O051N171
$$ 6495 11650 -18176 -33224 -16244 -292 28942 28938 33 -33221 -31278 -19766 -18683 -12632 -7461
5080g461n841j6410j7665j1591K5028l285M73J29Q690j212n280J1842L6546m692
$$ -7461 -13302 -29712 -47377 -58968 -33940 -37225 -36752 -36623 -27933 -29145 -34425 -22583 13963 9271
5066I271J6174K5519p957k1644m8356R615M4248l591l32m676N134J0101k612j7537
$$ 9271 25445 50964 43007 21363 -26993 -17378 26870 23279 22947 18271 23405 33506 30894 13357
5052A3357J806p041j0181m861j4757r183O042j3497P943j2791n23P68J005K7652
$$ 13357 15163 8122 -2059 -6920 -21677 -30860 -24818 -38315 -30372 -43163 -43686 -42918 -41913 -14261
5038a4261J4682J920j2023P44K1997J4160P22j1204N881k8615j4167L261n878
$$ -14261 421 2341 -9682 -8938 13059 27219 27941 16737 22618 -5997 -20164 -16903 -22781
5025b2781m0246j2589K1502M2718J6522k3711m584J0812J765k5420K048N24k130
$$ -22781 -63027 -75616 -54114 -11396 5126 -18585 -23169 -12357 -10592 -36012 -33964 -33440 -35570
5012c5570j372m578M3425L1518r428k3129n136J027j527M913L086n450j5723J9759
$$ -35570 -36942 -41520 1905 33423 23995 866 -4270 -3243 -4770 143 3229 -2221 -17944 1815
4998A815k7279j8132R228M654j440k3667J9019L6006q997k5165n15M2610K2000
$$ 1815 -25464 -43596 -34368 -29714 -31154 -54821 -35802 204 -8793 -33958 -34473 8137 30137
4985C0137k3405k1230j9300J96L0719J7161n960k3520j4953P260N412M722k7703
$$ 30137 6732 -14498 -33798 -33602 -2883 14278 8318 -15202 -30155 -22895 -17483 -12761 -40464
4972d0464R873K3483N786j5559j9799J6812j8733j275L3421J2835j3032k9960
$$ -40464 -30591 -7108 -1322 -16881 -36680 -19868 -38601 -39876 -6455 6380 -6652 -36612
4960c6612L800J1446O639O073J1924j1894K435K0708J6718o114k9765j994j329
$$ -36612 -32812 -21366 -14727 -8654 3270 -8624 -6189 14519 31237 25123 -4642 -6636 -7965
4947g965j5619o52J4233J6410o460J423K869J6446M605k1621o894J857N403M445
$$ -7965 -23584 -24236 -10003 6407 -53 1370 4239 20685 25290 3669 -3225 -1368 4035 8480
4933H480N276k0066L293J7538k8656k1950j9391J8051J8914L758Q469l801J755
$$ 8480 13756 -6310 -3017 14521 -14135 -36085 -55476 -37425 -18511 -14753 -6284 -10085 -8330
4920h330k6436K2096L3005l68m191J5257J8998j008m2879J464n980j7674K114
$$ -8330 -34766 -12670 20335 19967 15776 31033 50031 49023 6144 7608 1628 -16046 -13932
4907a3932k1140q339J5006Q293J1739J1937n466M246R952j8482J6971K188J587
$$ -13932 -35072 -43411 -28405 -20112 -8373 3564 -1902 2344 12296 -6186 10785 12973 14560
4894A4560l64j6097J1799K8482j6602j2891k307J2909K1139l439k3558k9899Q366
$$ 14560 14196 -1901 9898 38380 21778 8887 6580 19489 40628 37189 13631 -16268 -7902
4881g902J6957J8065j7989j3671l316K340N120j55L376k2112o200o42k0894o21
$$ -7902 9055 27120 9131 -4540 -7856 -5516 -396 -551 2825 -19287 -25487 -26129 -47023 -47644
4867d7644L5820J3021J1282J73J5685k2055k9547j487K1257J6468J6005K830k2215
$$ -47644 -11824 1197 12479 12652 28337 6282 -23265 -24752 -3495 12973 28978 31808 9593
4854I593J2444m196N362N003k2642j5366J6622l2948j0427m95Q676k1952J9849
$$ 9593 22037 17841 23203 28206 5564 -9802 6820 -26128 -36555 -37050 -28374 -50326 -30477
4841c0477n557q798J5496J5170K788r452l4804j728J6099J1986o139J8558J4194
$$ -30477 -36034 -44832 -29336 -14166 -11378 -20830 -55634 -57362 -41263 -29277 -35416 -16858 -2664
4828b664q032j4475r31p683k1009J4228J8415R995r22k6837j9195J9945R365j9788
$$ -2664 -10696 -25171 -26102 -33785 -54794 -40566 -22151 -12156 -13078 -39915 -59110 -39165 -29800 -49588
4814d9588R004K0096k4947J5776L6910l368j5134K608J1194O833J5113k3620K384
$$ -49588 -40584 -20488 -45435 -29659 7251 3883 -11251 -8643 2551 9384 24497 877 3261
4801C261Q821J7190J2050j9316j1084l78K5172j362j8086K0987R509j8861j4778
$$ 3261 12082 29272 41322 22006 10922 10544 35716 34354 16268 37255 46764 27903 13125
4788A3125k0836J4195J8057J9111J4694k7145k9968j9045J84q7j8516q305J2509
$$ 13125 -7711 6484 24541 43652 58346 31201 1233 -17812 -17628 -17715 -36231 -44536 -32027
4775c2027J216O311K3019J3440o95k1959k0031k2793M244M0136J5991j7107j234
$$ -32027 -30811 -24500 -1481 11959 11264 -10695 -30726 -53519 -49275 -9139 6852 -10255 -11489
4762a1489J7048J3775J7164j597l2696m6060J6108M0575O649J7099n275l239K3474
$$ -11489 5559 19334 36498 34901 2205 -43855 -27747 12828 19477 36576 31301 28062 51536
4749E1536k0633k4595K5686j3522l4198k0015j5156J0900L759j4876J3447M572
$$ 51536 30903 6308 31994 18472 -15726 -35741 -50897 -39997 -36238 -51114 -37667 -33095
4737c3095J8185j403r303J7341R383j4402J110L0491J8009l6726k2941Q518P173
$$ -33095 -14910 -16313 -25616 -8275 1108 -13294 -12184 18307 36316 -410 -23351 -14833 -7660
4724g660j9298m831j067J9176K6948m396j0631j2888N700K092O631K0940p24r587
$$ -7660 -26958 -31789 -32856 -13680 13268 8872 -1759 -14647 -8947 -6855 -224 20716 19992 10405
4710A0405j2132K9992J2900k550O968j0821j7723l6354k4167J372N452Q199q644
$$ 10405 -1727 28265 41165 38615 45583 34762 17039 -19315 -43482 -42110 -36658 -28459 -37103
4697c7103m670J9630J0189j0880J1286J3671L007L761k8669m359K9128l346K1237
$$ -37103 -41773 -22143 -11954 -22834 -11548 2123 5130 8891 -19778 -24137 4991 1645 22882
4684B2882j8052k0559N618k792k5813j3912J8173J3639J6103j381O391l601M695
$$ 22882 4830 -15729 -10111 -12903 -38716 -52628 -34455 -20816 -4713 -6094 297 -3304 1391
4671A391K64Q556o696r361p72k732P04J1066N638k7247r017o004r280k7927R168
$$ 1391 1655 10211 3515 -5846 -6618 -9350 -8646 2420 8058 -19189 -28206 -34210 -43490 -71417 -62249
4656f2249j272K4192m434q148l359J0852L3467k458j3156R627O752Q339O327R930
$$ -62249 -63521 -39329 -43763 -51911 -55270 -44418 -10951 -13409 -26565 -16938 -10186 -1847 4480 14410
4642A4410k5683q781r614M0143K758j0363r211P9K5113j1153P21J8664l6815M926
$$ 14410 -11273 -20054 -29668 10475 13233 2870 -6341 -6262 18851 7698 8419 27083 -9732 -4806
4628d806L4127J5928k4030j3142L544j1575q335J2566L0237l4020p781K0916Q134
$$ -4806 29321 45249 21219 8077 11621 46 -8289 4277 34514 494 -7287 13629 21763
4615B1763j7403k7786J8289J1285p863k5077q699K8345M9130L98j7180k7826J3770
$$ 21763 4360 -23426 -5137 6148 -1715 -26792 -35491 -7146 41984 42382 25202 -2624 11146
4602A1146K9416k5944k8590r109j9728J4806Q3N259M418p697K1968P408k4038
$$ 11146 40562 14618 -13972 -23081 -42809 -28003 -27920 -22661 -18243 -25940 -3972 3436 -20602
4589b0602j0379Q182J5121M548o644q172k281l846L997o213j6379q142n87J3484
$$ -20602 -30981 -22799 -7678 -3130 -9774 -17946 -20227 -24073 -20076 -26289 -42668 -50810 -51397 -37913
4575c7913n657J9141J900k145o793o505R343J2667K200l4822k8328m247Q088K92
$$ -37913 -43570 -24429 -22529 -24674 -31467 -37972 -28629 -15962 -13762 -48584 -76912 -81159 -73071 -72779
4561g2779J4386K2123J0513k3723J1900L450J2652K6914K5186o878k623M071O497
$$ -72779 -58393 -36270 -25757 -49480 -37580 -34130 -21478 5436 30622 23744 21121 25192 31689
4548C1689j3517l2992J0053Q91Q325Q543o796j7775j1424K4996L273j7083l741
$$ 31689 18172 -14820 -4767 -3876 4449 12992 6196 -11579 -23003 1993 5266 -11817 -15558
4535a5558J1621n072j6240j7286O17K40o597o856j2375p59J0600j3862p403J4544
$$ -15558 -3937 -9009 -25249 -42535 -41918 -41678 -48275 -55131 -67506 -68265 -57665 -71527 -78930 -64386
4521f4386J1185K2809L7520J1767K604k2890m7493K170J8889J7860K0039N948
$$ -64386 -53201 -30392 7128 18895 21499 -1391 -48884 -46714 -27825 -9965 10074 16022
4509A6022k135p191k009j9926J948Q411J7708J0798r875o13j939K6235K2906l3669
$$ 16022 13887 6696 4687 -15239 -13291 -4880 12828 23626 13751 13138 11199 37434 60340 26671
4495B6671k7379j5021R660j3816p431m162P580J7530J6778j0410k1609k440j2494
$$ 26671 -708 -15729 -6069 -19885 -27316 -31478 -23898 -6368 10410 0 -21609 -24049 -36543
4482c6543l6104J6403K7168J9744K9107N899l442L764p636k8811j7489N615q250
$$ -36543 -72647 -56244 -29076 -9332 19775 25674 22232 25996 18360 -10451 -27940 -22325 -30575
4469c0575J868J3332O540j4011k0274L4430K4482J1116k9555l1997j8121o404
$$ -30575 -28707 -15375 -8835 -22846 -43120 -8690 15792 26908 -2647 -34644 -52765 -59169
4457e9169k632L9693K5770J4834j2742J6939O988j4360j3344K3880k298j8543
$$ -59169 -61801 -22108 3662 18496 5754 22693 29681 15321 1977 25857 23559 5016
4445E016j8008K034j3277k0037q925MK5683J8564j0555r577J8607K282K9863K3125
$$ 5016 -12992 -10958 -24235 -44272 -53197 -53193 -27510 -8946 -19501 -29078 -10471 -8189 21674 44799
4431D4799j1638K117J3133o649J4429J7683k959j7780j4604m154K0552O194l4843
$$ 44799 33161 35278 48411 41762 56191 73874 70915 53135 38531 34377 54929 61123 26280
4418B6280k6527p891k182j760l75p462M064K6740J9227j9591j1949l707J2144
$$ 26280 -247 -8138 -10320 -12080 -12455 -19917 -15853 10887 30114 10523 -1426 -5133 7011
4405G011l200l290o933J7936L3316l0353m261P134j4421m460j8362J2345K7511
$$ 7011 3811 521 -6412 11524 44840 14487 10226 17360 2939 -1521 -19883 -7538 19973
4392A9973p779K675O160k2965m405K6330J5910k2825n429K604q121m48m279j0937
$$ 19973 12194 14869 21029 -1936 -6341 19989 35899 13074 7645 10249 2128 1680 -2599 -13536
4378a3536k3775j501J8789L2681j7115r663j0757J2093J8127J1703n412k0495
$$ -13536 -37311 -38812 -20023 12658 -4457 -14120 -24877 -12784 5343 17046 11634 -8861
4366h861o962r687j1329J8241Q383L2429M408k044j3908j3041l1M899j757J7464
$$ -8861 -15823 -25510 -36839 -18598 -10215 22214 26622 24578 10670 -2371 -2402 2497 740 18204
4352A8204K847k5252l0820J8403L3513O100k0268m264K1325k0088j0647l9146
$$ 18204 21051 -4201 -35021 -16618 16895 22995 2727 -1537 19788 -300 -10947 -50093
4340e0093r560n982M821O100J6329R030L459J7217O100j0133r583O289J7332J6516
$$ -50093 -59653 -65635 -60814 -54714 -38385 -29355 -25896 -8679 -2579 -12712 -22295 -16006 1326 17842
4326A7842K03j3446l7491j8260l079K4235J3591J832k5264r017J6523L8454K212
$$ 17842 18045 4599 -32892 -51152 -54231 -29996 -16405 -14573 -39837 -48854 -32331 6123 8335
4313H335r476j9779j8615Q054Q76J8640l256j5850J9284M954j795L284N551j2912
$$ 8335 -1141 -20920 -39535 -31481 -30605 -11965 -15221 -31071 -11787 -6833 -8628 -5344 207 -12705
4299a2705k052K6354K7930j3712k1003j4908o19j3469J288k4190J0840J7637J4336
$$ -12705 -14757 11597 39527 25815 4812 -10096 -10715 -24184 -22896 -47086 -36246 -18609 -4273
4286d273j6498J3119L7345K9529J8626k1210m8339j4965q443l749o333J279k4454
$$ -4273 -20771 -7652 29693 59222 77848 56638 8299 -6666 -15109 -18858 -25191 -23912 -48366
4273d8366j2651M472K1105J1673q243J1815l888J4664n43K2264J5048l4077p514
$$ -48366 -61017 -56545 -35440 -23767 -32010 -20195 -24083 -9419 -9962 12302 27350 -6727 -14241
4260a4241J8099p411j4612J904Q715K2667K1701J5185J4517l6804j8123k0858
$$ -14241 3858 -3553 -18165 -16261 -7546 15121 36822 52007 66524 29720 11597 -9261
4248i261m008J704j5539m601P655K3845Q446m484J9022j574M45M716J722K655
$$ -9261 -13269 -11565 -27104 -31705 -24050 -205 8241 3757 22779 21205 21650 26366 28088 30743
4234C0743K1919k6186j9792O538Q508k4344j5905O970K3684o304o737j1621L0490
$$ 30743 52662 26476 6684 13222 21730 -2614 -18519 -11549 12135 5831 -906 -12527 17963
4221A7963K3249M105l687P59l437N017l37l3872j3351m251P446K803K6662M1100
$$ 17963 41212 45317 41630 42389 38952 43969 43632 9760 -3591 -7842 -396 2407 29069 70169
4207G0169M37l676k3937J0619K933J6100k2214k3946j6481O081K2602K340k6065
$$ 70169 70606 66930 42993 53612 56545 72645 50431 26485 10004 16085 38687 41027 14962
4194A4962k1038j2158J1212l312k0626p219J119j5050O67M9734R263j3920M197
$$ 14962 -6076 -18234 -7022 -10334 -30960 -38179 -37060 -52110 -51443 -1709 7554 -6366 -2169
4181b169l314q053j0318K5845K8345j1027r358j342L7k2547M141l618j0530m007
$$ -2169 -5483 -13536 -23854 1991 30336 19309 9951 8609 8646 -13901 -9760 -13378 -23908 -27915
4167b7915j946J6342J9611q296p684m399k461j0755J5273M31j1664l869j3132
$$ -27915 -29861 -13519 6092 -2204 -9888 -14287 -16748 -27503 -12230 -11799 -23463 -27332 -40464
4154d0464J3443J4221M604k773K997K0821L156j3994j0969L542j5098K21J6307
$$ -40464 -27021 -12800 -8196 -10969 -7972 12849 16005 2011 -8958 -5416 -20514 -20293 -3986
4141c986J5817J3082j3442l3677q678K8070J3236j3796n197l030Q076k434J817
$$ -3986 11831 24913 11471 -22206 -30884 -2814 10422 -3374 -8571 -11601 -3525 -5959 -4142
4128d142l1698l717J6770K8073N46M544k225j7889j6484j3802M4916Q654k4034
$$ -4142 -35840 -39557 -22787 5286 5832 10376 8151 -9738 -26222 -40024 4892 13546 -10488
4115a0488l4501P98K8528L2942J4035k2471o945m987p66j0622P083l906J4235
$$ -10488 -44989 -44191 -15663 17279 31314 8843 1898 -3089 -3855 -14477 -7394 -11300 2935
4102B935m340l1315p710n509J3013L337K150p479K2910K0146j0224k621J2943
$$ 2935 -1405 -32720 -40430 -45939 -32926 -29589 -27439 -34918 -12008 8138 -2086 -4707 8236
4089H236o559P744r708q887L082k1331M884J0776O827q972j2559O9l6247r304
$$ 8236 1677 9421 -287 -9174 -6092 -27423 -22539 -11763 -4936 -13908 -26467 -26398 -62645 -71949
4075g1949J6628k676m560k242m795K8553J6133k0551j1836J8429Q700k2141O602
$$ -71949 -55321 -57997 -62557 -64799 -69594 -41041 -24908 -45459 -57295 -38866 -30166 -52307 -45705
4062d5705J1237P739L9472N626l829J5035L0597J5821J4664j1502j3431k105J926
$$ -45705 -34468 -26729 12743 18369 14540 29575 60172 75993 90657 79155 65724 63619 65545
4049F5545N927J47k1097k9211k8924k1374j3586j0781N90R101L823J8530n361
$$ 65545 71472 71619 50522 21311 -7613 -28987 -42573 -53354 -52764 -43663 -39840 -21310 -26671
4036b6671p254P652J6011l837p874j1509O01L3678J1071L454k7970k304N798J3019
$$ -26671 -33925 -26273 -10262 -14099 -21973 -33482 -32881 797 11868 15322 -12648 -14952 -9154 3865
4022C865J0320J2124j9049l5484j188J41j5641J7060J7389J2246J5968J0824N785
$$ 3865 14185 26309 7260 -28224 -29412 -29271 -44912 -27852 -10463 1783 17751 28575 34360
4009C4360k2280k7162o840P502J859p795Q127M090J571m5504r318L3726J6630
$$ 34360 12080 -15082 -21922 -14420 -12561 -20356 -12229 -8139 -6568 -52072 -61390 -27664 -11034
3996a1034n879P339p556o052R694J2702O653p175n392J1181J388N028j8514j8079
$$ -11034 -16913 -9574 -17130 -23182 -13488 -786 5867 -1308 -6700 4481 5869 10897 -7617 -25696
3982b5696j6204M503N551M5129J6068m673o851j0757n3030P757J8592j006q99
$$ -25696 -41900 -37397 -31846 13283 29351 24678 17827 7070 -45960 -38203 -19611 -20617 -21516
3969b1516J4661k62n334j5904M121O229j0299j543q17m146J3233N742J3973M325
$$ -21516 -6855 -7117 -12451 -28355 -24234 -18005 -28304 -29847 -30664 -34810 -21577 -15835 -1862 2463
3955B463j4410o481j4347J1081J6170P008Q940L2981L005k7406l1237K8368j418
$$ 2463 -11947 -18428 -32775 -21694 -5524 1484 10424 43405 46410 19004 -12233 16135 14717
3942A4717l3767j6542K0767J2865J7261k81k3109j658j726k4696k2962J2367J2601
$$ 14717 -19050 -35592 -14825 -1960 15301 15020 -8089 -9747 -11473 -36169 -59131 -46764 -34163
3929c4163K8068M1439k5708l2198o587J8191K0835o363m506j7150O189j4688j0423
$$ -34163 -6095 35344 9636 -22562 -29149 -10958 9877 3514 -992 -18142 -11953 -26641 -37064
3916c7064o2K0615j3297j0062K8058J2846j6666j5732J0602L054R203R687J1724
$$ -37064 -37126 -16511 -29808 -39870 -11812 1034 -15632 -31364 -20762 -17708 -8505 1182 12906
3903A2906k7256m930K3211J5096k0081j2914L543j1627p644M881k948j1842j4348
$$ 12906 -14350 -19280 3931 19027 -1054 -13968 -10425 -22052 -29696 -24815 -27763 -39605 -53953
3890e3953o898K3834J7192O184N630O190R451j0471k0584j7283o321J0757o49
$$ -53953 -60851 -37017 -19825 -13641 -8011 -1821 7630 -2841 -23425 -40708 -47029 -36272 -36921
3877c6921R861l249N430j9571P206J8317J0358M376j1196p79J0952J3803m973
$$ -36921 -27060 -30309 -24879 -44450 -37244 -18927 -8569 -4193 -15389 -16168 -5216 8587 3614
3864C614p099K0881J9962p308k5110j3764K0205J7281k238m766K416j942M85j908
$$ 3614 -3485 17396 37358 30050 4940 -8824 11381 28662 26424 21658 24074 22132 22617 20709
3850B0709O113o05n96o155J224m690k351J6492r778K796J4550m3466j3275L1350
$$ 20709 26822 26217 25621 19466 20690 16000 13649 30141 20363 23159 37709 -5757 -19032 12318
3836A2318K7945o740L769k959j882M0611j1580m555J7975k079l3440k5008j0645
$$ 12318 40263 33523 37292 34333 32451 73062 61482 56927 74902 72823 39383 14375 3730
3823C730k1085J6490J1028Q349n546k6502j4331r679K1724K5500k7471j1828M192
$$ 3730 -17355 -865 10163 18512 12966 -13536 -27867 -37546 -15822 9678 -17793 -29621 -25429
3810b5429K792M254j11Q639J0369Q372N552j4409m1057K0360m07J4488K824J6487
$$ -25429 -22637 -18383 -18494 -9855 514 8886 14438 29 -41028 -20668 -21075 -6587 -3763 12724
3796A2724k1920q69n715j3129l2798P861r348L021J5899J2988l431J8366J5758
$$ 12724 -9196 -10065 -15780 -28909 -61707 -53846 -63194 -60173 -44274 -31286 -34717 -16351 -593
3783e93j82j1251K22k59j8296O100n380K0412K0089j6380j922j2581m068k8114
$$ -593 -775 -12026 -11804 -12063 -30359 -24259 -29639 -9227 10862 -5518 -7440 -20021 -24089 -52203
3769e2203j5681M776L4524K128J8195K0437M935O802R756n414k5784p174k67n750
$$ -52203 -67884 -63108 -28584 -26456 -8261 12176 17111 23913 33669 28255 2471 -4703 -4970 -10720
3755a0720j3175O039J5627j5015J1488K8935J5236m710j9980j2478N430o683k4567
$$ -10720 -23895 -17856 -2229 -17244 -5756 23179 38415 33705 13725 1247 6677 -6 -24573
3742b4573l0562R255J4776J4204k2030j2749K2757J2323m233k040K5705j275l593
$$ -24573 -55135 -45880 -31104 -16900 -38930 -51679 -28922 -16599 -20832 -22872 2833 1558 -2035
3729b035O317j999K8583L9283O109k1336k3902L999P346k0798j1748m54r388q857
$$ -2035 4282 2283 30866 70149 76258 54922 31020 35019 42365 21567 9819 9365 -23 -8880
3715h880J6380j5468j798L5899j2081l1873M544j1843K8813L1660Q856j2107m2743
$$ -8880 7500 -7968 -9766 26133 14052 -17821 -13277 -25120 3693 35353 44209 32102 -10641
3702a0641k8185l2695L416K5317K8452K0910J0187l1074k6921J0267J8023J372
$$ -10641 -38826 -71521 -68105 -42788 -14336 6574 16761 -14313 -41234 -30967 -12944 -11572
3690a1572j1601q051R690K8189K0758K1534l135j9527k0837q508p489J663J2042
$$ -11572 -23173 -31224 -21534 6655 27413 48947 45812 26285 5448 -3060 -10549 -8886 3156
3677C156j4001k790O131j2608j4339r82J9538q145j8833J8747J381N396k5182
$$ 3156 -10845 -13635 -7504 -20112 -34451 -35433 -15895 -24040 -42873 -24126 -22745 -17349 -42531
3664d2531M849J2958K1735l754k0985K7153J9820K3492J6220k6926j4928j2872
$$ -42531 -37682 -24724 -2989 -6743 -27728 -575 19245 42737 58957 32031 17103 4231
3652D231J101l716j1024l843j1889k732J2751O96k935k0761Q870K8559K4352J5942
$$ 4231 5332 1616 -9408 -13251 -25140 -27872 -15121 -14425 -17360 -38121 -29251 -692 23660 39602
3638C9602M774J3904o202l0628m430P163n181j5528P165q245Q326J7876j1694
$$ 39602 44376 58280 52078 21450 17020 24183 19002 3474 10639 2394 10720 28596 16902
3625A6902l3611O297J2336o504Q54L6871k3396l2949k848j3526L0103K5878K0404
$$ 16902 -16709 -10412 1924 -4580 -3726 33145 9749 -23200 -26048 -39574 -9471 16407 36811
3612C6811L006j9182r09j1873o619k982j9079L6543M7Q558J835o012j276m497
$$ 36811 39817 20635 19726 7853 1234 -1748 -20827 15716 15763 24321 26156 20144 18868 14371
3598A4371o525M223K15n450o579l952k9550k1661K8728J781l1690K7234J0604
$$ 14371 7846 12069 12284 6834 255 -3697 -33247 -54908 -26180 -24399 -56089 -28855 -18251
3585a8251j367j4907L8047k93l1612J7191j935N489l096n113J6954N132L552Q359
$$ -18251 -19618 -34525 3522 3229 -28383 -11192 -13127 -7638 -10734 -15847 1107 6239 9791 18150
3571A8150J408k5542j6414q423j685K461J3434M611l509R091J0549j6307R092
$$ 18150 19558 -5984 -22398 -30821 -32506 -30045 -16611 -12000 -15509 -6418 4131 -12176 -3084
3558c084j9726j1507J9848O957r347P488O400j448K085j7263J0635K4085Q392
$$ -3084 -22810 -34317 -14469 -7512 -16859 -9371 -2971 -4419 -2334 -19597 -8962 15123 23515
3545B3515M209n488J9533p202j6508l0923K504k8728J2179J2800R49k6444l0164
$$ 23515 27724 22236 41769 34567 18059 -12864 -10360 -39088 -26909 -14109 -13160 -39604 -69768
3532f9768r491M8406K0228Q89j1071j1309J1870L0223J2021J8773q078j9927n455
$$ -69768 -79259 -30853 -10625 -9736 -20807 -32116 -20246 9977 21998 40771 32693 12766 7311
3519G311q309p104L6470k326k2638M000M4879m741M364l5235l9004N412L5115
$$ 7311 -998 -8102 28368 26042 3404 7404 52283 47542 51906 16671 -22333 -16921 18194
3506A8194k8464j7430J3733J1079q232R968L4974k1915k5898R523L5932j2466
$$ 18194 -10270 -27700 -13967 -2888 -11120 -1152 33822 11907 -13991 -4468 31464 18998
3494A8998O98k1923l4978Q826K628K031R363k1553R538J9460k224r660j937J2529
$$ 18998 19696 -2227 -37205 -28379 -25751 -23720 -14357 -35910 -26372 -6912 -9136 -18796 -20733 -8204
3480h204k415k239J9096L3147J9435k3764m2837L587n757R21r53o820Q68J9857
$$ -8204 -10619 -12858 6238 39385 58820 35056 -7781 -4194 -9951 -9030 -9983 -16803 -15935 3922
3466C922K5124J4398M48k2462m1813L084r236J2784M229p593l1156J7057K8435
$$ 3922 29046 43444 43892 21430 -20383 -17299 -26535 -13751 -9522 -17115 -48271 -31214 -2779
3453b779L1089M976j2900j3951Q804k2495L309j77j637J5052J1564o651J4794
$$ -2779 28310 33286 20386 6435 15239 -7256 -3947 -4124 -5761 9291 20855 14204 28998
3440B8998j4856j3875R637K3120j646o2337j9923L4556R532k070L6199N724l997
$$ 28998 14142 267 9904 33024 31378 -30959 -50882 -16326 -6794 -8864 27335 33059 29062
3427B9062L498k8795j0747j314k555k2064L130K0151L0206J1999k020l780k8496
$$ 29062 32560 3765 -6982 -8296 -10851 -32915 -29785 -9634 20572 32571 30551 26771 -1725
3414a725k141K0308P686k8835L817R011n977K835J2228Q731k4510o150Q83J4661
$$ -1725 -3866 16442 24128 -4707 -890 8121 2144 4979 17207 25938 1428 -4722 -3839 10822
3400A0822K8564J049l2735j0754l6709J5019j0290O396K0312L079k591k8336j0659
$$ 10822 39386 40435 7700 -3054 -39763 -24744 -35034 -28638 -8326 -5247 -7838 -36174 -46833
3387d6833L9586J4026l644j8941m524K2715J142j1325P838K2965j2970p178o751
$$ -46833 -7247 6779 3135 -15806 -20330 2385 3527 -7798 40 23005 10035 2857 -3894
3374c894k0938j5430j1025j2508k4942K285L5872J2084K518l0j5803K5408M7809
$$ -3894 -24832 -40262 -51287 -63795 -88737 -86452 -50580 -38496 -35978 -36008 -51811 -26403 21406
3361B1406j1507j8890m763J1735O758J4097L588k6938j7352J6694j7047k5963
$$ 21406 9899 -8991 -13754 -2019 4739 18836 22424 -4514 -21866 -5172 -22219 -48182
3349d8182J6145K9999J026O93J7720n085J2959q940l7651J0751L8271K5931J6660
$$ -48182 -32037 -2038 -1012 -319 17401 12316 25275 16335 -21316 -10565 27706 53637 70297
3336G0297j3140j1447k8710k1411K2271L2479j5806l354q291o773j4305j8481
$$ 70297 57157 45710 17000 -4411 17860 50339 34533 31179 22888 16115 1810 -16671
3324a6671j384k488n735J566J5079j3757N754R791j1323j9602p104L4609j47J6861
$$ -16671 -18055 -20543 -26278 -24712 -9633 -23390 -17636 -7845 -19168 -38770 -45874 -11265 -11412 5449
3310E449n704j7018J3093L0555l2179k1577J993k644K8086M714N23n665o684P339
$$ 5449 -255 -17273 -4180 26375 -5804 -27381 -25388 -28032 54 4768 5291 -374 -7058 281
3296B81J4433R656j7154k4383J1515p306P617j400Q996j7056J5561J8574j4812
$$ 281 14714 24370 7216 -17167 -5652 -12958 -5341 -6741 2255 -14801 760 19334 4522
3283D522j1825J1515L1435J5365r74n953J275j6267j5250j9458q042R744J3340
$$ 4522 -7303 4212 35647 51012 50038 44085 45360 29093 13843 -5615 -13657 -3913 9427
3270I427K0310m5121l4526J8281n465j3654J2161K5051K3468n170l083L459j6730
$$ 9427 29737 -15384 -49910 -31629 -37094 -50748 -38587 -13536 9932 4762 1679 5138 -11592
3257a1592j7833k2256P105j6968K153L3254R345Q973K7567J5280k2277n3866J0553
$$ -11592 -29425 -51681 -44576 -61544 -59391 -26137 -16792 -7819 19748 35028 12751 -41115 -30562
3244c0562K6321j2561l6636p23L9307P024J9700O520J4077k478j8784k8127k1970
$$ -30562 -4241 -16802 -53438 -54161 -14854 -7830 11870 18390 32467 29989 11205 -16922 -38892
3231c8892j1676j1527k643n536j593N199J9471K3804k426J896K2110r79k8209
$$ -38892 -50568 -62095 -64738 -70274 -71867 -66668 -47197 -23393 -25819 -23923 -1813 -2792 -31001
3218c1001J2843J6529J5217P127m152J5056r496l1181q697J3090m775k9998J4720
$$ -31001 -18158 -1629 13588 20715 16563 31619 22123 -9058 -17755 -4665 -9440 -39438 -24718
3205b4718L7810J0705j2514j5483M662o703J6314j2524J6613j931k2738j4907
$$ -24718 13092 23797 11283 -4200 462 -6241 10073 -2451 14162 12231 -10507 -25414
3193b5414R277j5255r529K1317l200j9837K1204m275J6645K0737j5350q123p552
$$ -25414 -16137 -31392 -40921 -19604 -22804 -42641 -21437 -25712 -9067 11670 -3680 -11803 -19355
3180a9355j2175J1119K4162n299m60j0070k0384m362M0805l036k941O800J3600
$$ -19355 -31530 -20411 3751 -1548 -2008 -12078 -32462 -36824 3981 945 -1996 4804 18404
$$ [...]
##END NTUPLES=NMR SPECTRUM
##END=
