##TITLE=316682	jw 00059	adrs	ugmt
##JCAMPDX= 6.0         $$ Bruker NMR JCAMP-DX V2.0
##DATA TYPE= NMR SPECTRUM
##DATA CLASS= NTUPLES
##ORIGIN= Bruker BioSpin GmbH
##OWNER= nmr
$$ XWIN-NMR		Version 3.5
$$ Tue Jul 11 13:44:26 2006 GMT Daylight Time (UT+1h)  MAYBRIDGE\nmr@NMR_250MHZ
##.OBSERVE FREQUENCY= 250.131544655141
##.OBSERVE NUCLEUS= ^1H
##.ACQUISITION MODE= SIMULTANEOUS (DQD)
##.ACQUISITION SCHEME= undefined
##.AVERAGES= 16
##.DIGITISER RES= 18
##SPECTROMETER/DATA SYSTEM= dpx250
##.PULSE SEQUENCE= zg30
##.SOLVENT NAME= CDCl3
##.SHIFT REFERENCE= (INTERNAL, CDCl3, 0, 16.522)
##AUDIT TRAIL= $$ (NUMBER, WHEN, WHO, WHERE, WHAT)
$$ ##TITLE= Audit trail, XWIN-NMR		Version 3.5
$$ ##JCAMPDX= 5.01
$$ ##ORIGIN= Bruker BioSpin GmbH
$$ ##OWNER= nmr
$$ C:/u/data/dgb/nmr/ADRS/15151/pdata/1/auditp.txt
$$ ##AUDIT TRAIL=  $$ (NUMBER, WHEN, WHO, WHERE, WHAT)
(   1,<2006-01-24 11:39:38.97 +000>,<MAYBRIDGE\nmr>,<NMR_250MHZ>,
      <created by zg, POWCHK disabled, PULCHK disabled
       configuration hash MD5:
       62 19 C7 07 E1 42 D1 B7 37 6C 3D D0 77 39 F9 E6
       data hash MD5: 64K
       C6 45 11 A0 AC B3 D5 52 DF 62 61 19 BA 0C 99 DD>)
(   2,<2006-01-24 11:39:47.41 +000>,<MAYBRIDGE\nmr>,<NMR_250MHZ>,
      <Start of raw data processing
       ef LB = 0.3 FT_mod = 6 PKNL = 1 SI = 32K 
       data hash MD5: 32K
       EA 5B 0C 11 12 5F 85 DC BE CF CC 79 4B D3 6D 7B>)
(   3,<2006-01-24 11:39:51.68 +000>,<MAYBRIDGE\nmr>,<NMR_250MHZ>,
      <apk 
       data hash MD5: 32K
       AD B4 00 14 CE EB 64 DF 48 43 3C B1 9F 5F DB 34>)
(   4,<2006-01-24 11:39:53.11 +000>,<MAYBRIDGE\nmr>,<NMR_250MHZ>,
      <abs ABSG = 5 
       data hash MD5: 32K
       3C B8 D2 76 A5 F6 F6 6E 98 B6 F7 0D A6 9C F4 04>)
$$ ##END=
$$ 
$$ hash MD5
$$ 61 4D D0 E8 9B 23 C2 DC 32 BE 2F 69 6C 8C 59 1B
##$RELAX= 
##$RELAX= 
##$RELAX= 
##$RELAX= 
##$RELAX= 
##$RELAX= 
##$RELAX= 
$$ Bruker specific parameters
$$ --------------------------
##$DU= <C:\Restored>
##$EXPNO= 15151
##$NAME= <ADRS>
##$PROCNO= 1
##$TYPE= <nmr>
##$USER= <dgb>
##$AMP= (0..31)
100 100 100 100 100 100 100 100 100 100 100 100 100 100 100 100 100 100 
100 100 100 100 100 100 100 100 100 100 100 100 100 100 
##$AQSEQ= 0
##$AQ_mod= 3
##$AUNM= <au_zg>
##$AUTOPOS= <9 >
##$BF1= 250.13
##$BF2= 250.13
##$BF3= 250.13
##$BF4= 250.13
##$BF5= 500.13
##$BF6= 500.13
##$BF7= 500.13
##$BF8= 500.13
##$BYTORDA= 1
##$CFDGTYP= 0
##$CFRGTYP= 5
##$CHEMSTR= <none>
##$CNST= (0..31)
1 1 145 1 1 1 1 1 1 1 1 1 1 1 1 1 1 1 1 1 1 1 1 1 1 1 1 1 1 1 1 1 
##$CPDPRG= <>
##$CPDPRG1= <>
##$CPDPRG2= <>
##$CPDPRG3= <>
##$CPDPRG4= <mlev>
##$CPDPRG5= <mlev>
##$CPDPRG6= <mlev>
##$CPDPRG7= <mlev>
##$CPDPRG8= <mlev>
##$CPDPRGB= <>
##$CPDPRGT= <>
##$D= (0..31)
0 1 0 0 0 0 0 0 0 0.06 0 0 0 0 0 0 0.0002 0 0 0 0 0 0 0 0 0 0 0 0 0 0 
0 
##$DATE= 1138102776
##$DBL= (0..7)
120 120 120 120 120 120 120 120 
##$DBP= (0..7)
150 150 150 150 150 150 150 150 
##$DBP07= 0
##$DBPNAM0= <>
##$DBPNAM1= <>
##$DBPNAM2= <>
##$DBPNAM3= <>
##$DBPNAM4= <>
##$DBPNAM5= <>
##$DBPNAM6= <>
$$ [...]
##$SUBNAM7= <"">
##$SUBNAM8= <"">
##$SUBNAM9= <"">
##$SW= 20.6930455092707
##$SWIBOX= (0..15)
0 0 3 0 0 0 0 0 0 0 0 0 0 0 0 0 
##$SW_h= 5175.983436853
##$TD= 65536
##$TD0= 1
##$TE= 294.16
##$TE2= 300
##$TE3= 300
##$TEG= 300
##$TL= (0..7)
0 120 120 120 120 120 120 120 
##$TP= (0..7)
150 150 150 150 150 150 150 150 
##$TP07= 0
##$TPNAME0= <>
##$TPNAME1= <>
##$TPNAME2= <>
##$TPNAME3= <>
##$TPNAME4= <>
##$TPNAME5= <>
##$TPNAME6= <>
##$TPNAME7= <>
##$TPOAL= (0..7)
0.5 0.5 0.5 0.5 0.5 0.5 0.5 0.5 
##$TPOFFS= (0..7)
0 0 0 0 0 0 0 0 
##$TUNHIN= 0
##$TUNHOUT= 0
##$TUNXOUT= 0
##$USERA1= <user>
##$USERA2= <user>
##$USERA3= <user>
##$USERA4= <user>
##$USERA5= <user>
##$V9= 5
##$VALIST= <valist>
##$VCLIST= <CCCCCCCCCCCCCCC>
##$VD= 0
##$VDLIST= <DDDDDDDDDDDDDDD>
##$VPLIST= <PPPPPPPPPPPPPPP>
##$VTLIST= <TTTTTTTTTTTTTTT>
##$WBST= 1024
##$WBSW= 4
##$XGAIN= (0..3)
0 0 0 0 
##$XL= 0
##$YL= 0
##$YMAX_a= 516451
##$YMIN_a= -557738
##$ZGOPTNS= <>
##$ZL1= 120
##$ZL2= 120
##$ZL3= 120
##$ZL4= 120
##$ABSF1= 16.522
##$ABSF2= -4.171173
##$ABSG= 5
##$ABSL= 3
##$ALPHA= 0
##$AQORDER= 0
##$ASSFAC= 0
##$ASSFACI= 0
##$ASSFACX= 0
##$ASSWID= 0
##$AUNMP= <proc_1d>
##$AZFE= 0.1
##$AZFW= 0.1
##$BCFW= 0
##$BC_mod= 0
##$BYTORDP= 0
##$COROFFS= 0
##$CY= 12.5
##$DATMOD= 1
##$DC= 0
##$DFILT= <>
##$DTYPP= 0
##$F1P= 14.0000005364418
##$F2P= -0.99999901652339
##$FCOR= 0.5
##$FTSIZE= 32768
##$FT_mod= 6
##$GAMMA= 0
##$GB= 0
##$INTBC= 1
##$INTSCL= 1
##$ISEN= 128
##$LB= 0.3
##$LEV0= 0
##$LPBIN= 0
##$MAXI= 10000
##$MC2= 0
##$MEAN= 0
##$ME_mod= 0
##$MI= 0
##$NCOEF= 0
##$NC_proc= -2
##$NLEV= 6
##$NOISF1= 0
##$NOISF2= 0
##$NSP= 0
##$NTH_PI= 0
##$NZP= 0
##$OFFSET= 16.522
##$PC= 1
##$PHC0= 247.9039
##$PHC1= 2.044471
##$PH_mod= 1
##$PKNL= yes
##$PPARMOD= 0
##$PSCAL= 4
##$PSIGN= 0
##$REVERSE= no
##$SF= 250.13
##$SI= 32768
##$SIGF1= 0
##$SIGF2= 0
##$SINO= 400
##$SIOLD= 32768
##$SREGLST= <1H.CDCl3>
##$SSB= 0
##$STSI= 32768
##$STSR= 0
##$SW_p= 5175.98343685301
##$SYMM= 0
##$S_DEV= 0
##$TDeff= 65536
##$TDoff= 0
##$TI= <Analysis number 999999
Compound Code 99
Book Reference 9
Project Code 9>
##$TILT= no
##$TM1= 0
##$TM2= 0
##$TOPLEV= 0
##$USERP1= <user>
##$USERP2= <user>
##$USERP3= <user>
##$USERP4= <user>
##$USERP5= <user>
##$WDW= 1
##$XDIM= 32768
##$YMAX_p= 282247708
##$YMIN_p= -363390
$$ End of Bruker specific parameters
$$ ---------------------------------
##NTUPLES= NMR SPECTRUM
##VAR_NAME=  FREQUENCY,     SPECTRUM/REAL,   SPECTRUM/IMAG
##SYMBOL=    X,             R,               I
##VAR_TYPE=  INDEPENDENT,   DEPENDENT,       DEPENDENT
##VAR_FORM=  AFFN,          ASDF,            ASDF
##VAR_DIM=   32768,         32768,           32768
##UNITS=     HZ,            ARBITRARY UNITS, ARBITRARY UNITS
##FACTOR=    0.157963299565203, 1,           1
##FIRST=     4132.6476996994, 0,             0
##LAST=      -1043.33573715361, 0,           0
##MIN=       -1043.33573715361, -363390,     0
##MAX=       4132.6476996994, 282247708,     0
$$ Real data points
##PAGE= N=1
##DATA TABLE= (X++(R..R)), XYDATA
$$ [...]
$$ plain form
24934 -9493 -19290 -43314 -35326 -29112 -39780 -19381 -335 -2934 -5333 13299 5530 2582 8631
24921 8631 35983 17062 -7789 27592 41232 52107 44917 14181 -18141 -19876 -4503 -11224
24909 -11224 -24428 -37974 -36432 -48948 -51629 -32154 -29326 -11161 13569 16015 17509 18116 1528
24896 1528 9493 4058 -21478 4935 36339 9122 -11457 465 -7592 1327 4251 3242 -6664
24883 -6664 -5340 -21739 -11077 11382 -985 -27808 -31598 10795 28638 13553 13280 20655 36197
24870 36197 33661 17851 238 3362 15383 10602 21876 34975 41439 -576 -18899 -18675 -10206
24857 -10206 2626 -12620 -3988 16296 5379 6505 5138 -26467 -7445 33404 19364 15575
24845 15575 4909 17307 18506 12612 30001 55530 53959 11611 4923 2601 21460 25972 36288
$$ packed form
24934i493r797k4024P988O214j0668K0399J9046k599k399J8632p769k948O049
24921H631K7352j8921k4851L5381J3640J0875p190l0736l2322j735J5373o721
24909a1224j3204j3546J542j2516k681J9475K828J8165K4730K446J494O07j6588
24896A528P965n435k5536K6413L1404k7217k0579J1922q057Q919K924j009r906
24883f664J324j6399J0662K2459j2367k6823l790M2393J7843j5085k73P375J5542
24870C6197k536j5810j7613L124J2021m781J1274J3099O464m2015j8323K24Q469
24857a0206J2832j5246Q632K0284j0917J126j367l1605J9022M0849j4040l789
24845A5575j0666J2398J199n894J7389K5529j571m2348o688k322J8859M512J0316
$$ plain form
24832 36288 33926 39486 37214 32109 13464 -15589 -33703 -14701 2111 -15023 -9132 -2431 -1830
24819 -1830 7754 -6238 -40567 -53678 -49295 -40843 -7975 -6026 -10722 -18179 -5286 -1618 17228
24806 17228 33626 41701 30192 -9730 -43077 -44558 -15539 9553 -2168 -15915 -5476 18580
24794 18580 28934 42840 10220 -8105 -16145 -13438 5686 18964 16337 -3566 -17372 -30434
24782 -30434 -22435 -27168 -29371 -32923 -42772 -42033 -48833 -32799 -23735 -29109 -29094 -26369 -16133 -7912 622
24767 622 -6039 18591 38429 47329 39219 8478 15214 36578 48150 26918 -13692 -35817 -25449
24754 -25449 -22135 -31372 -40757 -28207 -7805 -6367 -14220 -42362 -54950 -45892 -26363 5568 13368
24741 13368 -4557 -5680 -7281 -28357 6398 33544 15681 -7458 -13302 -10699 4423 26576
$$ packed form
24832C6288k362N560k272n105j8645k9053j8114J9002J6812j7134N891O701O01
24819a830R584j3992l4329j3111M383Q452L2868J949m696p457J2893L668J8846
24806A7228J6398Q075j1509l9922l3347j481K9019K5092j1721j3747J0439K4056
24794A8580J0354J3906l2620j8325q040K707J9124J3278k627j9903j3806j3062
24782c0434P999m733k203l552r849P39o800J6034R064n374J5K725J0236Q221Q534
24767F22o661K4630J9838Q900q110l0741O736K1364J1572k1232m0610k2125J0368
24754b5449L314r237r385J2550K0402J438p853k8142j2588R058J9529L1931P800
24741A3368j7925j123j601k1076L4755K7146j7863k3139n844K603J5122K2153
$$ plain form
24729 26576 15938 25920 18966 25154 -8946 -31398 -12238 6947 -22622 -39125 -30673 -21751 -24663
24716 -24663 -27107 -28513 -22467 -22265 -4373 -23949 -34020 -38969 -54242 -42165 -21607 -22214 -4510
24703 -4510 17721 41045 23324 7372 24935 30286 34433 24246 6663 -407 92 -3887 7306
24690 7306 26618 29460 6069 -5645 8702 2630 -15027 -36035 -53123 -40026 -11020 -21534
24678 -21534 -26541 -18224 -8107 12364 20573 3300 5370 -3288 3190 5450 10186 8217 -10001
24665 -10001 -34024 -12170 -1997 5751 -4674 -15167 12932 18805 -3529 -9159 -15159 -28067
24653 -28067 -16572 -22975 -24606 -22134 -15270 -20608 -15666 19304 3747 -32129 -36293 -24128 -24867
24640 -24867 -31719 -15228 -6694 -5866 3753 3937 28334 17910 1622 -6923 -2169 19631 32927
$$ packed form
24729B6576j0638R982o954O188l4100k2452J9160J9185k9569j6503Q452Q922k912
24716b4663k444j406O046K02J7892j9576j0071m949j5273J2077K0558o07J7704
24703d510K2231K3324j7721j5952J7563N351M147j0187j7583p070M99l979J1193
24690G306J9312K842k3391j1714J4347o072j7657k1008j7088J3097K9006j0514
24678b1534n007Q317J0117K0471Q209j7273K070q658O478K260M736j969j8218
24665a0001k4023K1854J0173P748j0425j0493K8099N873k2334n630o000j2908
24653b8067J1495o403j631K472O864n338M942L4970j5557l5876m164J2165p39
24640b4867o852J6491Q534Q28R619J84K4397j0424j6288q545M754K1800J3296
$$ plain form
24627 32927 16842 18175 42885 29275 19470 3626 -21363 -20596 -11619 -8393 559 12141 -6895
24614 -6895 -9883 -7602 2189 -9405 -5990 21730 8425 -7879 -8266 8510 10409 -4889 4232
24601 4232 10866 -8473 -22210 5443 7961 7611 599 -8628 -2691 8779 15619 21915 20148 -4071
24587 -4071 -14438 -19685 -162 5478 5959 -5242 -9681 -33689 -43254 -27092 -26477 -5809 -1751 544
24573 544 -438 6425 -2021 8495 37010 30057 -4615 -5700 7650 -18908 -40753 -27175 -18601
24560 -18601 -21373 -22033 -16938 -3952 960 -15148 -1483 -15783 -20609 -3246 6589 -18458 -15215
24547 -15215 -5172 3081 -17800 -54865 -53014 -32772 -25705 7534 13108 26572 15241 7209 18558
24534 18558 27077 21911 41563 19766 7553 18943 13114 3049 2005 -16471 -18726 -28115 -11022
$$ packed form
24627C2927j6085J333K4710j3610r805j5844k4989P67Q977L226Q952J1582j9036
24614f895k988K281R791j1594L415K7720j3305j6304l87J6776J899j5298R121
24601D232O634j9339j3737K7653K518l50p012r227N937J1470O840O296j767k4219
24587d071j0367n247J9523N640M81j1201m439k4008r565J6162O15K0668M058K295
24573E44r82O863q446J0516K8515o953l4672j085J3350k6558k1845J3578Q574
24560a8601k772o60N095J2986M912j6108J3665j4300m826J7363R835k5047L243
24547a5215J0043Q253k0881l7065J851K0242P067L3239N574J3464j1331q032J1349
24534A8558Q519n166J9652k1797j2213J1390n829j0065j044j8476k255r389J7093
$$ plain form
24521 -11022 2868 -3572 5824 32956 30993 17605 9457 -25 -12472 1418 22403 32060 10023
24508 10023 -19664 -12769 -5799 -34838 -18864 -1628 7186 36246 38733 39850 41103 46625 24784
24495 24784 22023 26804 27192 11630 14495 -7454 -9854 5863 35959 18319 -3046 -4184 -14418
24482 -14418 -2203 5247 -3684 32102 62308 25595 -12571 -23882 -30979 -36104 -6257 24541
24470 24541 11764 26526 30703 24766 14725 -6865 -37217 -38038 -22241 -368 21295 13132 12983
24457 12983 23285 8230 8844 -14330 -18325 -25606 -20280 -19355 2393 26049 26811 20891 34365 25798
24443 25798 -8710 -16547 4858 -4736 7985 9623 -34828 -62917 -39185 10253 18328 33538
24431 33538 39978 33372 37302 20344 -18987 -29711 -20432 -12183 -10747 -40510 -25052 -21073 -18209
$$ packed form
24521a1022J3890o440R396K7132j963j3388q148r482j2447J3890K0985R657k2037
24508A0023k9687O895O970k9039J5974J7236Q814K9060K487J117J253N522k1841
24495B4784k761M781L88j5562K865k1949k400J5717L0096j7640k1365j138j0234
24482a4418J2215P450q931L5786L0206l6713l8166j1311p097n125K9847L0798
24470B4541j2777J4762M177n937j0041k1590l0352q21J5797K1873K1663q163j49
24457A2983J0302j5055O14k3174l995p281N326R25K1748K3656P62n920J3474q567
24443B5798l4508p837K1405r594J2721J638m4451k8089K3732M9438Q075J5210
24431C3538O440o606L930j6958l9331j0724R279Q249J436k9763J5458L979K864
$$ plain form
24418 -18209 -6484 9293 13159 4397 -3428 -395 -9675 -20427 -4817 -10478 -20907 -43013 -51073
24405 -51073 -34390 3818 8182 -24547 -21329 -17149 6784 23583 7335 14079 14438 -1242 -28637
24392 -28637 -41453 -21437 -11926 -13794 -5442 -16241 -21158 -1759 18436 24292 -17170 -52915 -54533
24379 -54533 -22800 -7160 -5921 2896 -9055 19578 31968 15139 -3810 21920 43458 27223
24367 27223 -1530 -11437 -6548 306 18392 29398 24842 15260 38567 36153 17273 24446 12360
24354 12360 -4321 -13330 -25785 -29058 -22042 -2326 5445 10980 18651 21063 -27844 -48479 -9774
24341 -9774 505 4171 1458 -13625 -4633 639 -9074 -17932 -15627 -7756 4717 7051 -10281 -25466
24327 -25466 -22331 -1542 -12912 -28474 -18114 -11172 16000 21124 -8006 -17417 -7735 -10527 -23516
$$ packed form
24418a8209J1725J5777L866q762p825L033r280j0752J5610n661j0429k2106q060
24405e1073J6683L8208M364l2729L218M180K3933J6799j6248O744L59j5680k7395
24392b8637j2816K0016R511j868Q352j0799m917J9399K0195N856m1462l5745j618
24379e4533L1733J5640J239Q817j1951K8633J2390j6829j8949K5730K1538j6235
24367B7223k8753r907M889O854J8086J1006m556r582K3307k414j8880P173j2086
24354A2360j6681r009j2455l273P016J9716P771N535P671K412m8907k0635L8705
24341i774J0279L666k713j5083Q992N272r713q858K305P871J2473K334j7332j5185
24327b5466L135K0789j1370j5562J0360O942K7172N124k9130r411R682k792j2989
$$ plain form
24314 -23516 -1119 13510 -7094 -24720 -42540 -43530 -12561 9223 -5517 -41273 -27964 -28793
24302 -28793 -37710 -47681 -40990 -8014 6284 6013 11638 -4996 -22078 -35690 -33702 -11880 3840
24289 3840 11154 8618 13096 29262 30005 20646 5625 -6792 -1160 8872 -23464 -35963 -23656
24276 -23656 -46718 -46219 -36313 -30344 -29159 -8439 -782 3445 6106 12955 1182 -23235 -24047 -30868
24262 -30868 -38365 -33418 -45473 -22954 -11366 -265 -3390 -13924 -9539 -19795 -23010 -27887 -5684
24249 -5684 4146 8883 -509 16355 45456 53171 15752 -146 8353 4916 -5465 -24187 -27374
24236 -27374 -21453 -21587 16457 13438 3703 14401 -12499 -33247 -21985 -15876 -23759 -20172 -13325
24223 -13325 -4296 -19039 -27459 -34846 -22315 -18233 -30596 -20005 -17614 -27724 -48542 -48245 -34224
$$ packed form
24314b3516K2397J4629k0604j7626j7820r90L0969K1784j4740l5756J3309q29
24302b8793q917r971O691L2976J4298k71N625j6634j7082j3612J988K1822J5720
24289C840P314k536M478J6166P43r359j5021j2417N632J0032l2336j2499J2307
24276b3656k3062M99R906N969J185K0720P657M227K661O849j1773k4417q12o821
24262c0868p497M947j2055K2519J1588J1101l125j0534M385j0256l215m877K2203
24249e684R830M737r392J6864K9101P715l7419j5898Q499l437j0381j8722l187
24236b7374N921j34L8044l019r735J0698k6900k0748J1262O109p883L587O847
24223a3325R029j4743q420p387J2531M082j2363J0591K391j0110k0818K97J4021
$$ plain form
24210 -34224 -48354 -24091 -12920 -46409 -24907 17997 13081 -15442 -10405 27834 25253 -6256
24198 -6256 -15332 -13870 2998 30752 42429 27558 4176 -11055 6261 7896 -4151 -2253 -36165
24185 -36165 -49705 -41110 -33739 -38195 -58089 -53966 -23065 -8743 -7492 -7411 8064 -25074 -70889
24172 -70889 -41047 8520 6753 9839 7510 -16580 -4876 9249 -575 14951 14330 -576 -5953
24159 -5953 -14549 -11362 10378 20766 16545 -3246 -21416 -33466 -41870 -37710 -27555 -11872 6519
24146 6519 47373 14178 -8805 -7620 4869 32738 48051 49796 40127 39216 27562 25887 34996
24133 34996 40804 40988 47598 29416 6584 -830 6826 24131 18408 -1706 -9205 -7834 17666
24120 17666 21910 -9896 27021 45147 52015 41945 -3791 -18874 -15035 8674 32161 50323
$$ packed form
24210c4224j4130K4263J1171l3489K1502M2904m916k8523N037L8239k581l1509
24198f256r076J462J6868K7754J1677j4871k3382j5231J7316J635j2047J898l3912
24185c6165j3540Q595P371m456j9894M123L0901J4322J251Q1J5475l3138m5815
24172g0889K9842M9567j767L086k329k4090J1704J4125r824J5526o21j4906n377
24159e953q596L187K1740J0388m221j9791j8170j2050q404M160J0155J5683J8391
24146F519M0854l3195k2983J185J2489K7869J5313J745r669r11j1654j675R109
24133C4996N808J84O610j8182k2832p414P656J7305n723k0114p499J371K5500
24120A7666M244l1806L6917J8126O868j0070m5736j5083L839K3709K3487J8162
$$ plain form
24108 50323 21307 -11295 -14292 806 9046 18253 41542 59209 31668 -4926 -9365 18297
24096 18297 20787 12399 -1417 -9598 -10052 9119 30501 18929 12427 3874 1080 15328 36767
24083 36767 25974 230 -11923 -22632 -12550 -8241 -22576 -34556 -17077 -16756 -31720 -16152
24071 -16152 13977 35285 20972 14335 20134 20172 -17583 7195 10344 5141 24578 22855 18913
24058 18913 1873 -611 -14443 -18578 -15592 18970 8437 7202 9563 24606 9116 -19684 -18739
24045 -18739 -24623 -14840 -13208 -4119 6211 -6543 -18803 -14361 -7803 -21287 -23997 -3927 25561
24032 25561 46113 52730 62768 50416 43400 37084 22740 16282 1605 7300 -3064 -6221 -3098
24019 -3098 -5114 -13791 -5340 23122 26182 9089 6246 13359 -11821 -13599 -9035 3651 -17981
$$ packed form
24108E0323k9016l2602k997J5098Q240R207K3289J7667k7541l6594m439K7662
24096A8297K490q388j3816q181m54J9171K1382j1572o502q553k794J4248K1439
24083C6767j0793k5744j2153j0709J0082M309j4335j1980J7479L21j4964J5568
24071a6152L0129K1308j4313o637N799L8l7755K4778L149n203J9437j723l942
24058A8913j7040k484j3832m135K986L4562j0533j235K361J5043j5490k8800R45
24045a8739n884R783J632R089J0330j2754j2260M442O558j3484k710K0070K9488
24032B5561K0552O617J0038j2352p016o316j4344o458j4677N695j0364l157L123
24019c098k016q677Q451K8462L060j7093k843P113k5180j778M564J2686k1632
$$ plain form
24006 -17981 -24120 -19183 1289 16171 19117 20582 -5747 -24790 2120 6995 16183 46351 22685
23993 22685 9964 -5252 -26367 -20036 -17403 -4624 2069 -23854 -13922 -6953 9053 4134 4462
23980 4462 12913 1145 -21730 -23155 -12507 -17014 -20079 2185 16430 13885 5885 -14915 -6015
23967 -6015 21242 19804 -4424 9875 31271 45696 57995 63068 40442 13987 5946 15993
23955 15993 3454 684 3799 6015 -2101 -19079 -22462 -16878 -38048 -37615 -7904 -12439 1442
23942 1442 11703 8057 9861 752 2772 21606 54651 41086 9474 22384 30681 32044 32947
23929 32947 34637 33626 25733 4793 -18392 -23210 2192 -8343 -35094 -45215 -28344 -2347
23917 -2347 13890 29498 23901 -1242 4707 24097 2954 -26783 -47419 -29389 -21841 -3131
$$ packed form
24006a7981o139M937K0472J4882K946J465k6329j9043K6910M875R188L0168k3666
23993B2685j2721j5216k1115O331K633J2779O693k5923R932O969J6006m919L28
23980D462Q451j1768k2875j425J0648m507l065K2264J4245k545q000k0800Q900
23967f015K7257j438k4228J4299K1396J4425J2299N073k2626k6455q041J0047
23955A5993j2539k770L115K216q116j6978l383N584k1170M33K9711m535J3881
23942A442J0261l646J804r109K020J8834L3045j3565l1612J2910Q297J363R03
23929C2947J690j011p893k0940k3185m818K5402j0535k6751j0121J6871K5997
23917b347J6237J5608n597k5143N949J9390k1143k9737k0636J8030P548J8710
$$ plain form
23905 -3131 11322 432 20411 45715 19962 28646 37157 16457 -17575 -34569 -37432 -47040 -66606
23892 -66606 -63312 -39985 -15527 11960 12728 3069 -31971 -4143 16509 8918 11316 19066 22275
23879 22275 109 -8589 -25684 -25937 -5861 -1016 -6371 -28325 -23108 -32897 -46884 -4765 18365
23866 18365 38835 40905 40656 16447 6433 1216 15387 7389 5426 -16125 -48644 -22848 19968
23853 19968 -3190 -28584 -22851 -22027 12305 35674 14240 -21206 -27116 -20968 -27192 -19994 -23068
23840 -23068 -25952 -18048 -3569 8591 15387 7523 12663 -9838 -17701 -14464 -27065 -23184 -12873
23827 -12873 -676 10498 -1308 -19536 -15467 -4682 1472 10858 4406 16179 30183 18641
23815 18641 6731 1560 -6879 12343 11869 3610 1991 -9478 -6558 -15714 -17223 -20805 -21383 -29504
$$ packed form
23905c131J4453j0890J9979K5304k5753Q684Q511k0700l4032j6994k863r608j9566
23892f6606L294K3327K4458K7487P68r659l5040K7828K0652p591K398P750L209
23879B2275k2166q698j7095k53K0076M845n355k1954N217r789j3987M2119K3130
23866A8365K0470K070k49k4209j0014n217J4171p998j963k1551l2519K5796M2816
23853A9968k3158k5394N733Q24L4332K3369k1434l5446n910O148o224P198l074
23840b3068k884P904J4479J2160O796p864N140k2501p863L237j2601L881J0311
23827a2873J2197J1174j1806j8228M069J0785O154R386o452J1773J4004j1542
23815A8641j1910n171q439J9222m74q259j619j1469K920r156j509l582n78q121
$$ plain form
23801 -29504 -43955 -54130 -59045 -38170 -17515 -3593 10226 32952 18834 31833 57298 60667
23789 60667 44246 30095 2740 -17036 2640 -8124 -18086 -20511 -9151 6927 19982 18342
23777 18342 -610 -5712 -793 -182 -19173 3094 12448 41660 21019 9273 14613 20533 -2528
23764 -2528 12519 23146 1097 -8312 21041 40108 11777 37047 23061 11624 12916 -5183
23752 -5183 -5119 -5885 -7617 -15815 12533 19920 -8734 -18743 -32566 -21574 -15709 6251 16330 29765
23738 29765 16065 11511 27193 41265 32542 26817 22471 10705 15390 21793 8573 -116 -5803
23725 -5803 -174 6630 4265 14232 3819 -11339 2458 2639 4326 -14333 -14776 1631 14392 17975
23711 17975 -279 -22423 -46463 -49231 -22281 -26788 -18042 -4092 -6853 -8853 -716 2211 10804
$$ packed form
23801b9504j4451j0175m915K0875K0655J3922J3819K2726j4118J2999K5465L369
23789F0667j6421j4151k7355j9776J9676j0764r962k425J1360J6078J3055j640
23777A8342j8952n102M919O11j8991K2267R354K9212k0641j1746N340N920k3061
23764b528J5047J0627k2049r409K9353J9067k8331K5270j3986j1437J292j8099
23752e183O4p66j732q198K8348P387k8654j0009j3823J0992N865K1960J0079J3435
23738B9765j3700m554J5682J4072q723n725m346j1766M685O403j3220q689n687
23725e803N629O804k365R967j0413j5158J3797J81J687j8659m43J6407J2761L583
23711A7975j8254k2144k4040k768K6950m507Q746J3950k761k000Q137K927Q593
$$ plain form
23698 10804 29156 20976 -10388 -19703 -30518 -33138 -15719 -26825 -9285 -5741 8402 7111 12119
23685 12119 25431 30030 30143 -5261 -12169 -20849 -1202 4769 -4132 -15916 -10426 7314 8072 -614
23671 -614 -3651 -89 9860 11750 -338 -27693 -31357 -33890 -45315 -20862 -10999 7794 14825 12371
23657 12371 6553 38853 30762 22227 15371 16508 31278 46605 44840 61455 41138 12380 12546
23644 12546 -14881 -1607 3273 1554 11595 6503 -7926 -10494 46895 77429 40761 28169
23632 28169 21478 15475 25007 15678 23669 18320 -9373 -9490 1260 3586 11462 -12350 -7479 2694
23618 2694 5083 5931 -1807 7930 44465 54194 40968 15633 -5630 -11519 -5436 -8376 -1032 5156
23604 5156 2686 11617 7880 -10809 -8022 12619 28952 25383 20821 -3192 -25546 -27787 -15904
$$ packed form
23698A0804J8352q180l1364r315j0815k620J7419j1106J7540L544J4143j291N008
23685A2119J3312M599J13l5404o908q680J9647N971q901j1784N490J7740P58q686
23671f14l037L562R949J890j2088k7355l664k533j1425K4453R863J8793P031k454
23657A2371n818L2300q091q535o856J137J4770J5327j765J6615k0317k8758J66
23644A2546k7427J3274M880j719J0041n092j4429k568N7389L0534l6668j2592
23632B8169o691o003R532r329P991n349k7693j17J0750K326P876k3812M871J0173
23618B694K389Q48p738R737L6535R729j3226k5335k1263n889O083k940P344O188
23604E156k470Q931l737j8689K787K0641J6333l569m562k4013k2354k241J1883
$$ plain form
23591 -15904 -12097 -10228 -20255 -52616 -48400 -40421 -61035 -52811 -6019 -14847 -13908 -27576 -29845
23578 -29845 -44569 -33658 -4996 -15162 -33156 -42128 -41858 -49301 -57342 -74830 -51459 -35781 -11126
23565 -11126 -5102 -16976 -6424 3760 -7666 -5200 -4670 -19904 -24782 -26177 -36687 -26702 -18998
23552 -18998 -21510 -9593 26602 18680 1098 5079 79 -6385 -1056 16974 4563 -12442 -7665
23539 -7665 9877 10925 16236 4037 10715 -8796 -21308 112 -12609 5779 25913 28999 33940
23526 33940 14186 24029 34315 29516 16282 22163 12912 -7285 -21832 -17353 -741 11531 -9418
23513 -9418 9992 27189 -8591 -20591 -14403 -7569 -4145 29008 24621 1405 -30242 -26757 4888
23500 4888 16406 18886 17552 17307 -12503 -27861 -17153 -21166 -6442 10489 17072 1475 1441 -16588
$$ packed form
23591a5904L807J869j0027l2361M216P979k0614Q224M6792q828R39j3668k269
23578b9845j4724J0911K8662j0166j7994q972K70p443q041j7488K3371J5678K4655
23565a1126O024j1874J0552J0184j1426K466N30j5234m878j395j0510R985P704
23552a8998k512J1917L6195p922j7582L981n000o464N329J8030j2411j7005M777
23539g665J7542J048N311j2199O678j9511j2512K1420j2721J8388K0134L086M941
23526C3940j9754R843J0286m799j3234N881r251k0197j4547M479J6612J2272k0949
23513i418J9410J7197l5780j2000O188O834L424L3153m387k3216l1647L485L1645
23500D888J1518K480j334k45k9810j5358J0708m013J4724J6931O583j5597l4j8029
$$ plain form
23486 -16588 -36056 -39817 -60721 -53688 -29472 13184 22545 18437 17177 2622 -7421 -1262 -9205
23473 -9205 -29932 -33636 -24169 -28129 -2983 8479 16482 22465 20564 5286 -12563 -15028 -16381
23460 -16381 38673 22035 -18577 -11745 -10549 -29233 -15695 -28206 -15158 -12734 -38616 -31304
23448 -31304 -22565 3779 2327 -12037 -12371 -7049 -1372 -2856 28446 24529 11844 22512 32050
23435 32050 14970 31259 20412 1813 20144 23429 20704 22535 14221 16345 32371 34459 9364
23422 9364 13743 3097 5937 2359 30414 31904 26416 17803 4149 9512 8895 -4103 3067 -11862
23408 -11862 -31361 -64036 -70699 -61950 -72187 -71520 -36891 -16866 -14267 8157 10956 -25846 -29870
23395 -29870 -20350 -18907 -14033 -29195 -33642 -14482 4898 -5261 -14155 -16329 -8716 -1469 -12655
$$ packed form
23486a6588j9468l761k0904P033K4216M2656R361m108j260j4555j0043O159p943
23473i205k0727l704R467l960K5146J1462Q003N983j901j5278j7849k465j353
23460a6381N5054j6638m0612O832J196j8684J3538j2511J3048K424k5882P312
23448c1304Q739K6344j452j4364l34N322N677j484L1302l917j2685J0668R538
23435C2050j7080J6289j0847j8599J8331L285k725J831q314K124J6026K088k5095
23422I364M379j0646K840l578K8055J490n488q613j3654N363o17j2998P170j4929
23408a1862j9499l2675o663Q749j0237O67L4629K0025K599K2424K799l6802m024
23395b9870R520J443M874j5162m447J9160J9380j0159q894k174P613P247j1186
$$ plain form
23382 -12655 -14825 -3814 -10599 -9380 17431 43504 -492 -58287 -69541 -37875 -21986 -49957
23370 -49957 -48578 -36225 -37611 -16347 -173 -10468 -19496 -17200 -22422 -8570 25373 6790 -32892
23357 -32892 -495 10762 617 14982 36905 18188 -12214 -24937 -26845 -15612 -20880 -27648
23345 -27648 -36369 -29557 -11624 -3515 2202 26798 24243 16550 10860 33497 23731 3481 -6353
23332 -6353 -16077 -9321 3179 -18283 -16899 4740 -1875 9322 22459 21157 34159 38322 38605
23319 38605 45134 29418 26485 8199 -11237 -15768 -10945 7544 20247 50141 56211 30429 21240
23306 21240 -10395 -36866 -32593 -39516 -26089 -171 1863 -18235 -15334 -17227 -7470 -8467 -7409
23293 -7409 21631 31639 45473 27309 22859 1269 -17683 -38136 -49087 -24248 6682 26675
$$ packed form
23382a2655k170J1011o785J219K6811K6073m3996n7795j1254L1666J5889k7971
23370d9957J379J2353j386K1264J6174j0295r028K296n222J3852L3943j8583l9682
23357c2892L2397J1257j0145J4365K1923j8717l0402j2723j908J1233n268o768
23345b7648q721O812J7933Q109N717K4596k555p693n690K2637r766k0250r834
23332f353r724O756J2500k1462J384K1639o615J1197J3137j302J3002M163K83
23319C8605O529j5716k933j8286j9436m531M823J8489J2703K9894O070k5782r189
23306B1240l1635k6471M273o923J3427K5918K034k0098K901j893R757r97J058
23293g409K9040J0008J3834j8164m450k1590j8952k0453j0951K4839L0930J9993
$$ plain form
23281 26675 10838 13179 -20934 -36161 -11115 9636 2478 4602 7757 -134 -5383 3289 16172
23268 16172 11052 5730 808 17178 27734 18482 10821 3574 -5824 -1166 223 25055 37596
23255 37596 29151 5856 32673 42932 41826 23291 16314 8894 5173 -15108 -23030 -21880 2605
23242 2605 7315 -6251 13723 24411 11896 34021 41139 18254 16528 9089 -14452 -22866 -29414
23229 -29414 -16374 10327 16693 19077 8489 -12919 -16939 -4293 12441 5414 8212 -12085 -33082
23216 -33082 -29523 -2039 11139 -3563 6646 11302 30825 28213 17887 13146 597 -20391
23204 -20391 -12879 -6972 -1964 -764 4221 -14990 -32066 -37196 -13559 -24137 -24337 -14707 -605
23191 -605 5134 1353 -16114 -16818 -15796 -7623 -11844 -11289 -15127 10601 24481 32918 3597 -20130
$$ packed form
23281B6675j5837K341l4113j5227K5046K0751p158K124L155p891n249Q672J2883
23268A6172n120n322m922J6370J0556r252p661p247r398M658J389K4832J2541
23255C7596q445k3295K6817J0259j106j8535o977p420l721k0281p922J150K4485
23242B605M710j3566J9974J0688j2515K2125P118k2885j726p439k3541q414o548
23229b9414J3040K6701O366K384j0588k1408m020J2646J6734p027K798k0297k0997
23216c3082L559K7484J3178j4702J0209M656J9523k612j0326m741j2549k0988
23204b0391P512N907N008J200M985j9211j7076n130K3637j0578k00R630J4102
23191f05N739l781j7467p04J022Q173m221N55l838K5728J3880Q437k9321k3727
$$ plain form
23177 -20130 -15808 -15952 3370 257 -727 13804 15377 -13308 -26130 -22546 -15672 -16238 -31972 -24682
23163 -24682 -4038 -6997 -165 13157 -1399 -31838 -22735 -9809 -16294 -13979 -3021 -15895 -10776
23150 -10776 -20089 -39087 -43144 -31695 -19377 -19251 -20677 13405 39330 18922 -2937 9356 -5489
23137 -5489 12720 19929 -5546 -32656 -42663 -19217 -17021 7199 24061 10109 1404 12 14750
23124 14750 28517 -8804 -3532 32889 49400 26973 12875 11803 -9145 -1274 8426 3156 -8299
23111 -8299 -4960 10311 15001 6987 -1299 7789 10854 7302 12109 26901 44964 62503 61729 28914
23097 28914 19221 549 -15647 -10382 17183 28396 11497 7127 2016 12601 9358 -6811 -10472
23084 -10472 -16192 -32274 -30059 -37599 -58474 -21779 15976 -5275 6505 3478 15643 32142
$$ packed form
23177b0130M322j44J9322l113r84J4531J573k8685j2822L584O874n66j5734P290
23163b4682K0644k959O832J3322j4556l0439R103J2926o485K315J0958j2874N119
23150a0776r313j8998m057J1449J2318J26j426L4082K5925k0408k1859J2293j4845
23137e489J8209P209k5475k7110j0007K3446K196K4220J6862j3952q705j392J4738
23124A4750J3767l7321N272L6421J6511k2427j4098j072k0948P871R700n270j1455
23111h299L339J5271M690q014q286R088L065l552M807J4792J8063J7539p74l2815
23097B8914r693j8672j6196N265K7565J1213j6899m370n111J0585l243j6169l661
23084a0472n720j6082K215p540k0875L6695L7755k1251J1780l027J2165J6499
$$ plain form
23072 32142 17057 -14008 -32674 -14049 -1309 -16160 -25949 3392 13133 18684 18262 11633 -9141
23059 -9141 -33498 -34491 -8259 14788 -6006 -23429 -24820 -7213 -14454 -19957 -20150 -11412 -6039 -12972
23045 -12972 -3549 -8379 -20398 -34526 -25028 -12823 -13216 -21309 -31181 -26043 -11431 6722 -10823
23032 -10823 -22913 -35397 3913 40662 27474 12267 -9735 -16496 -27021 -10680 -17968 -18275
23020 -18275 -2019 -3721 -11569 9236 941 -31729 -12553 -24147 -25958 -27618 -25513 -18114 4806
23007 4806 22357 5949 18549 4522 7803 18661 17930 13108 9924 26423 38494 44016 21328
22994 21328 3230 -27810 -35684 -34193 -36223 -25445 -2936 -2805 -28914 -29630 -25547 -27621 -22763 -9085
22980 -9085 -13902 -3186 6402 -9063 -28494 -22452 -9865 -3062 -1890 6714 9394 8246 6854 6090
$$ packed form
23072C2142j5085l1065j8666J8625J2740j4851r789K9341R741N551m22o629k0774
23059i141k4357r93K6232K3047k0794j7423j391J7607p241n503j93Q738N373o933
23045a2972R423m830j2019j4128R498J2205l93q093r872N138J4612J8153j7545
23032a0823j2090j2484L9310L6749j3188j5207k2002o761j0525J6341p288l07
23020a8275J6256j702p848K0805q295l2670J9176j1594j811j660K105P399K2920
23007D806J7551j6408J2600j4027L281J0858p31m822l184J6499J2071N522k2688
22994B1328j8098l1040p874J491k030J0778K2509J31k6109p16M083k074M858J3678
22980i085m817J0716R588j5465j9431O042J2587O803J172Q604K680j148j392p64
$$ plain form
22966 6090 -8352 -26358 -26943 3023 11191 -1371 11319 13827 12775 4830 856 -7431 -6072 -19357
22952 -19357 -23180 -23619 -17141 -33608 -39534 -5064 25754 -3114 -3532 -1103 -18359 -14642 -23035 18158
22938 18158 26389 9929 -15975 5679 16828 19249 463 -16705 3625 4591 -8091 -9360 6916
22925 6916 20511 34723 42367 59791 50757 54829 25932 -13960 -21329 -35151 -37193 -38359 -6451
22912 -6451 1957 -18452 4406 30445 7427 15819 12801 12448 10504 -5338 -3462 -16240 -41774
22899 -41774 -46470 -819 37062 27210 16364 33527 35955 35700 24491 23957 12623 30770 14288
22886 14288 5616 19711 17359 12990 14641 13902 17519 21690 41401 35242 5543 -8561 -11935 -21186
22872 -21186 -27102 -18867 -20360 -11396 -47883 -53228 -34681 1445 -17155 -21860 -28112 -16586 -10330
$$ packed form
22966F090j4442j8006n85K9966Q168j2562J2690K508j052p945l974q287J359j3285
22952a9357l823m39O478j6467n926L4470L0818k8868m18K429j7256L717q393M1193
22938A8158Q231j6460k5904K1654J1149K421j8786j7168K0330R66j2682j269J6276
22925F916J3595J4212P644J7424r034M072k8897l9892p369j3822k042j166L1908
22912f451Q408k0409K2858K6039k3018Q392l018l53j944j5842J876j2778k5534
22899d1774m696M5651L7881r852j0846J7163K428k55j1209n34j1334J8147j6482
22886A4288q672J4095k352m369J651p39L617M171J9711o159k9699j4104l374r251
22872b1186n916Q235j493Q964l6487n345J8547L6126j8600m705o252J1526O256
$$ plain form
22859 -10330 334 -14348 -23981 -45426 -30248 -5450 29582 11279 -17657 1311 1875 -8743
22847 -8743 -12893 -3053 11855 -15655 -35157 -21456 -13537 -21444 -24781 -16521 4753 -1519 -680 21840
22833 21840 40683 19066 8669 7845 4639 2588 7952 -8741 -30750 -32808 -10210 10881 21528
22820 21528 15609 3545 6863 9234 -11565 -36492 -60780 -63855 -46094 -36380 -35199 -18255 -12450
22807 -12450 -55098 -45707 -36639 -26176 -4780 -12279 -35354 -26225 -19852 8754 21624 31149 5592
22794 5592 10701 3056 -17383 -26611 -22958 11446 30738 32278 41952 38265 27027 8799 -2341
22781 -2341 2868 2696 -4548 -9136 -165 18183 1242 -14654 -23780 -26080 -25541 -11341 -2376 20652
22767 20652 39969 39527 27154 16192 12808 -923 6825 3025 16377 6801 -8562 9220 21555
$$ packed form
22859a0330J0664j4682r633k1445J5178K4798L5032j8303k8936J8968N64j0618
22847h743m150R840J4908k7510j9502J3701P919p907l337Q260K1274o272Q39K2520
22833B1840J8843k1617j0397q24l206k051N364j6693k2009k058K2598K1091J0647
22820B1528n919j2064L318K371k0799k4927k4288l075J7761R714J181J6944N805
22807a2450m2648R391R068J0463K1396p499k3075R129O373K8606J2870R525k5557
22794E592N109p645k0439r228L653L4404J9292J540R674l687j1238j8228j1140
22781b341N209j72p244m588Q971J8348j6941j5896r126k300N39J4200Q965K3028
22767B0652J9317m42j2373j0962l384j3731P748l800J3352r576j5363J7782J2335
$$ plain form
22754 21555 23026 31114 38296 30605 18898 14999 23973 27041 -18506 -32468 9007 23390 30252
22741 30252 47449 49605 13567 677 113 548 -4718 -12731 -10072 -24730 -29439 -486 -15202
22728 -15202 -7809 17619 10631 -9955 -21400 -3337 25097 16243 5541 6502 -11064 -8025 -16985
22715 -16985 -39697 -22984 -19400 -11672 -569 -14584 -26678 -26391 -27739 -18848 14273 31092 27033
22702 27033 6508 -4423 -149 -863 17670 37968 16496 -19025 -34657 -44929 -47535 -13674
22690 -13674 16122 20762 3226 4855 38636 44033 40573 38113 17744 -3717 9892 6646 -5113
22677 -5113 24653 38586 28164 34924 17167 19835 13543 -11188 5192 24154 10411 544 -31619
22664 -31619 -37662 2107 6570 -6718 12414 6335 24150 42229 40546 15137 624 -3743 23937
$$ packed form
22754B1555J471Q088P182p691j1707l899Q974L068m5547j3962M1475J4383O862
22741C0252J7197K156l6038j2890n64M35n266q013K659j4658m709K8953j4716
22728a5202P393K5428o988k0586j1445J8063K8434q854j0702R61j7566L039q960
22715a6985k2712J6713L584P728J1103j4015j2094K87j348Q891L3121J6819m059
22702B7033k0525j0931M274p14J8533K0298k1472l5521j5632j0272k606L3861
22690a3674K9796M640j7536J629L3781N397l460k460k0369k1461J3609l246j1759
22677e113K9766J3933j0422O760j7757K668o292k4731J6380J8962j3743r867l2163
22664c1619o043L9769M463j3288J9132o079J7815J8079j683k5409j4513m367K7680
$$ plain form
22651 23937 46799 34984 41672 41495 17570 3398 -20279 -13452 -17684 10238 14562 22566 30819
22638 30819 13246 4230 40389 15183 -5249 6617 -3661 -4479 -7789 -18634 -21848 -29113 -34794
22625 -34794 -33128 -17379 -13722 -11303 9642 9702 5626 4697 8694 1596 -10429 7946 4215 -24667
22611 -24667 -33978 -24961 3877 22719 9041 3693 16475 10486 20258 38247 12436 7194 36316
22598 36316 35216 26872 17079 -8349 -27378 -27101 4626 2373 -14551 -31504 -25584 -9108 6965
22585 6965 -4937 -10443 18355 13329 5765 8391 -3118 -970 6665 -10926 -19695 4271 10706
22572 10706 -8983 -2691 -41 1189 11208 1313 2248 -17889 -13665 4211 16748 14006 18334
22559 18334 -20420 -43316 -14751 -2423 -17637 -20316 5900 -12400 -32395 -22036 -7656 -11206
$$ packed form
22651B3937K2862j1815O688j77k3925j4172k3677O827m232K7922M324Q004Q253
22638C0819j7573r016L6159k5206k0432J1866j0278q18l310j0845l214p265n681
22625c4794J666J5749L657K419K0945O0m076r29L997p098j2025J8375l731k8882
22611b4667r311R017K8838J8842j3678n348J2782n989R772J7989k5811n242K9122
22598C6316j100q344r793k5428j9029K77L1727k253j6924j6953N920J6476J6073
22585F965j1902n506K8798n026p564K626j1509K148P635j7591q769K3966O435
22572A0706j9689O292K650J230J0019r895R35k0137M224J7876J2537k742M328
22559A8334l8754k2896K8565J2328j5214k679K6216j8300j9995J0359J4380l550
$$ plain form
22547 -11206 -30760 -15088 -16138 -36397 3308 27025 31632 17443 11935 18911 28419 11031 -13100
22534 -13100 -33553 -19555 -4776 5374 -6038 -29742 -4636 3021 -3489 4624 -20556 -40263
22522 -40263 -16926 -4034 18433 24942 21669 -4769 -14211 12065 27667 7507 -1649 -22100
22510 -22100 -12681 36707 42933 17594 18575 38317 34452 31057 46399 23213 3989 14162 5342
22497 5342 9354 12950 9740 -5532 -37192 -16587 26881 1792 -3138 12592 6661 -3008 3926
22484 3926 -2887 -16145 -34894 -4725 18605 1290 1576 31911 35933 24819 24132 16929 -2067
22471 -2067 4947 24376 38661 12805 -5958 -19595 -1730 -695 -21090 -34074 -57909 -34855
22459 -34855 -2643 10138 -3587 -23370 -7760 -11282 12439 19397 13475 11434 33950 34526 20802
$$ packed form
22547a1206j9554J5672j050k0259L9705K3717M607j4189n508O976R508j7388k4131
22534a3100k0453J3998J4779J0150j1412k3704K5106P657o510Q113k5180j9707
22522d0263K3337J2892K2467O509l273k6438r442K6276J5602k0160r156k0451
22510b2100R419M9388O226k5339R81J9742l865l395J5342k3186j9224J0173q820
22497E342M012L596l210j5272l1660K0605M3468k5089m930J5730n931r669O934
22484C926o813j3258j8749L0169K3330j7315K86L0335M022j1114o87p203j8996
22471b067P014J9429J4285k5856j8763j3637J7865J035k0395j2984k3835K3054
22459c4855L2212J2781j3725j9783J5610l522K3721O958n922k041K2516N76j3724
$$ plain form
22446 20802 -16558 -38981 -76462 -73656 -31441 -14377 -30073 -26209 -24300 -35798 -18235 -17092
22434 -17092 -23318 -33760 -23075 -9169 -27413 -34578 -46131 -17330 22254 25230 1608 -5795
22422 -5795 -10892 -9863 -52741 -70794 -55979 -40557 -11389 508 14755 3658 -35841 -31964
22410 -31964 10758 16176 3282 162 -14473 3045 26079 23346 17005 8652 2285 6580 7600
22397 7600 -6974 -36311 -34434 -34035 -30321 -33405 -53351 -59543 -42115 -38529 -46086 -33653 15213
22384 15213 55399 18836 -12339 -33512 -43052 -26735 -27919 -14418 -1662 1232 3847 -4215 3536
22371 3536 11308 26763 5407 -24615 -13919 -16671 -46041 -12021 -1077 16960 17878 -14930 -16190
22358 -16190 -12351 -2766 -25242 -16664 12401 -2685 -11323 -23864 -27763 -25781 -35220 -32177 -42431
$$ packed form
22446B0802l7360k2423l7481K806M2215J7064j5696L864J909j1498J7563J143
22434a7092o226j0442J0685J3906j8244p165j1553K8801L9584K976k3622p403
22422e795n097J029m2878j8053J4815J5422K9168J1897J4247j1097l9499L877
22410c1964M2722N418j2894l120j4635J7518K3034k733o341q353o367M295J020
22397G600j4574k9337J877L99L714l084j9946o192J7428L586p557J2433M8866
22384A5213M0186l6563l1175k1173r540J6317j184J3501J2756K894K615q062P751
22371C536P772J5455k1356l0022J0696k752k9370L4020J0944J8037R18l2808j260
22358a6190L839R585k2476Q578K9065j5086q638j2541l899J982r439L043j0254
$$ plain form
22345 -42431 -39889 -27336 -22545 -38271 -51849 -44030 -26383 -14351 23928 45034 45171 42290 43329
22332 43329 21240 6522 6057 13090 20588 19764 25990 4172 -16844 2433 2005 -2241 6351 4243
22318 4243 -32687 -26752 -25215 -23771 -3423 1580 -7659 -8223 6747 33459 36166 14113 -14877
22305 -14877 -13806 -8085 7478 18187 12174 21693 25046 11603 11435 4535 -3983 -25408 -36990
22292 -36990 -37240 -37361 -44448 -73239 -86236 -60263 -31981 -21788 -6395 3034 21145 24560 28273
22279 28273 46830 32932 8431 9562 22144 26018 28676 40147 35929 33168 17097 -2266 -13173
22266 -13173 -19500 -17601 -20048 -27360 -35905 -19513 -10165 -6103 -16067 -27864 -16493 -15708 -4016 -9989
22252 -9989 3646 15372 9620 -5910 2793 23557 15196 1913 24477 10487 -4750 -27938
$$ packed form
22345d2431K542J2553M791j5726j3578P819J7647J2032L8279K1106J37k881J039
22332D3329k2089j4718m65P033P498q24O226k1818k1016J9277m28m246Q592k108
22318D243l6930N935J537J444K0348N003r239n64J4970K6712K707k2053k8990
22305a4877J071N721J5563J0709o013R519L353j3443j68o900q518k1425j1582
22292c6990k50j21p087k8791j2997K5973K8282J0193J5393R429J8111L415L713
22279B8273J8557j3898k4501J131J2582L874K658J1471m218k761j6071j9363j0907
22266a3173o327J899k447p312q545J6392R348M062r964j1797J1371P85J1692n973
22252i989J3635J1726n752j5530Q703K0764q361j3283K2564j3990j5237k3188
$$ plain form
22240 -27938 -49640 -51577 -30807 -10310 -11181 -11556 -13483 -11797 28579 28534 20045 12168 9169 8528 12932
22225 12932 42340 46120 38258 27851 13646 -8343 -40162 -16289 -5601 -5141 -3998 -970 -20518
22212 -20518 -40567 -16662 13603 -25679 -58796 -58087 -19779 -6325 3048 14553 20501 601
22200 601 4828 -634 13164 -896 -8486 -5421 14422 43229 36273 19880 -25604 -41671 -56918
22187 -56918 -43427 -35568 -23049 3030 32842 38779 25873 3219 19049 25263 6956 2628
22175 2628 2115 -70 -21304 -30542 -16144 -26887 -41201 -44521 -42220 -28153 -12369 -16061 -2249
22162 -2249 -3610 13470 3952 -742 3726 -15449 -10948 -24239 -26280 -33366 -21148 -25000 -25012 -28807
22148 -28807 -38981 -52192 -53548 -28017 -12920 -19128 12779 40938 32038 31241 17258 16828 31169
$$ packed form
22240b7938k1702j937K0770K0497q71l75j927J686M0376m5q489p877k999o41M404
22225A2932K9408L780p862j0407j4205k1989l1819K3873J0688M60J143L028j9548
22212b0518k0049K3905L0265l9282l3117P09L8308J3454R373J1505N948j9900
22200F01M227n462J3798j4060p590L065J9843K8807o956j6393m5484j6067j5247
22187e6918J3491P859J2519K6079K9812N937j2906k2654J5830O214j8307m328
22175B628n13k185k1234r238J4398j0743j4314l320K301J4067J5784l692J3812
22162b249j361J7080r518m694M468j9175M501j3291k041p086J2218l852j2l795
22148b8807j0174j3211j356K5531J5097o208L1907K8159q900p97j3983m30J4341
$$ plain form
22135 31169 28479 24121 18123 -4783 1832 424 -3507 -15900 -9529 20065 2335 -17096 -28783
22122 -28783 -2918 -2892 -26694 -38652 -44607 -31558 -24107 -4537 -21019 -3073 1858 -27280 -31153
22109 -31153 -32709 -30804 -22298 5804 2274 5443 -3717 -4404 -18441 -30781 -4496 26992 18132
22096 18132 7775 11831 9195 11372 4349 16230 2242 -16352 -18637 -42416 -30875 -33476 -21773
22083 -21773 -702 1254 -13317 -14190 15049 46165 44511 26824 26279 -9982 -7312 21792 33110
22070 33110 34077 18762 8617 33531 57858 81723 86905 71861 59395 39815 18542 4881
22058 4881 9331 4783 -4142 5767 10342 -5026 -21571 -24329 -28853 -27551 -18689 15526 48819 55014
22044 55014 58755 38916 21744 29625 31253 26150 7884 466 -13119 -18851 -26020 -39984 -30596
$$ packed form
22135C1169k690m358n998k2906O615j408l931j2393O371K9594j7730j9431j1687
22122b8783K5865K6k3802j1958n955J3049P451J9570j6482J7946M931k9138l873
22109c1153j556J905Q506K8102l530L169r160o87j4037j2340K6285L1488q860
22096A8132j0357M056k636K177p023J1881j3988j8594k285k3779J1541k601J1703
22083b1773K1071J956j4571q73K9239L1116j654j7687n45l6261K670K9104J1318
22070C3110R67j5315j0145K4914K4327K3865N182j5044j2466j9580k1273j3661
22058D881M450m548q925R909M575j5368j6545k758m524J302Q862L4215L3293O195
22044E5014L741j9839j7172P881J628n103j8266p418j3585n732p169j3964R388
$$ plain form
22031 -30596 -32111 -47974 -21130 -3739 10130 -446 -2975 27679 20965 18160 7673 4811 -3371
22018 -3371 -28728 -39694 -33042 -58101 -40539 -13595 -14752 -9142 -29668 -50929 -43016 -40774 -41206
22005 -41206 -22433 8879 520 -14645 -28205 -46993 -42492 -34959 -22629 -30711 -52053 -55948 -51774
21992 -51774 -22085 -19726 -23431 -17051 -26538 -9593 -1578 7561 12618 24483 36322 20907 -9170
21979 -9170 -23579 -38590 -42598 -37058 -25164 -5874 -1593 -26178 -36839 -22715 -19810 -23806 -33280
21966 -33280 -19888 -1576 -6795 -3407 5727 5482 10003 21907 19909 -32920 -44757 -32373 -11120
21953 -11120 9950 22100 19786 28107 43362 19300 241 28046 63515 37090 27444 17642
21941 17642 29060 21966 24118 43114 41091 33900 37948 23531 19119 18181 6857 742 -6487 -19712
$$ packed form
22031c0596j515j5863K6844J7391J3869j0576k529L0654o714k805j0487k862q182
22018c371k5357j0966O652k5059J7562K6944j157N610k0526k1261P913K242m32
22005d1206J8773L1312q359j5165j3560j8788M501P533J2330q082k1342l895M174
21992e1774K9689K359l705O380r487J6945Q015R139N057J1865J1839j5415l0077
21979i170j4409j5011m008N540J1894J9290M281k4585j0661J4124K905l996r474
21966c3280J3392J8312n219L388R134k45M521J1904j998n2829j1837J2384K1253
21953a1120K1070J2150k314Q321J5255k4062j9059K7805L5469k6425r646r802
21941A7642J1418p094K152J8996k023p191M048j4417m412r38j1324o115p229j3225
$$ plain form
21927 -19712 -28278 -28967 -10460 -1801 22132 5332 -16519 5251 22414 40985 46441 31452 22843
21914 22843 24465 3420 -11378 -27296 -20908 -2023 1766 20443 39794 43496 34578 28667 26786
21901 26786 13650 8245 10741 2257 2922 2127 -19604 -3318 -13091 -22958 7286 13164 -7293 -19004
21887 -19004 -15162 -15817 -3758 6905 -9760 -24482 -35577 -9782 -7058 -6227 -20225 -13049 10325
21874 10325 -5917 -6666 17420 35366 54056 14312 -14266 -10484 -12645 -22927 -20095 -855 29981
21861 29981 13176 -8850 -46386 -44097 -13647 -8280 -6548 4204 16840 13076 -15013 -13185 -9211
21848 -9211 -10405 -24551 -44247 -18264 5062 -730 -9157 -4609 23284 36599 21926 12409 15450
21835 15450 2650 10505 4491 18081 4170 -22004 -36972 -29106 -29802 -23043 -15747 -10650 21381
$$ packed form
21927a9712q566o89J8507Q659K3933j6800k1851K1770J7163J8571N456j4989q609
21914B2843J622k1045j4798j5918O388J8885L789J8677J9351L702q918n911j881
21901B6786j3136n405K496q484O65p95k1731J6286r773r867L0244N878k0457j1711
21887a9004L842o55J2059J0663j6665j4722j1095K5795K724Q31j3998P176K3374
21874A0325j6242p49K4086J7946J8690l9744k8578L782k161j0282K832J9240L0836
21861B9981j6805k2026l7536K289L0450N367J732J0752J2636l764k8089J828L974
21848i211j194j4146j9696K5983K3326n792q427M548K7893J3315j4673r517L041
21835A5450j2800P855o014J3590j3911k6174j4968P866o96O759P296N097L2031
$$ plain form
21822 21381 26392 30494 27525 3683 838 686 12960 14239 30853 27701 -6237 -14731 -36058
21809 -36058 -45758 -28070 -7254 4889 -9365 -12867 -27499 -13389 -9016 -2735 -25007 -25697 -20520
21796 -20520 -23511 -35348 9710 5368 -29720 -17236 -9931 628 7510 17374 23936 17680 10487
21783 10487 3027 6100 6146 1922 714 -10175 -20292 -22985 -32225 -40488 -17482 5372 13722 29789
21769 29789 35806 45008 54923 44007 28880 28956 46046 40221 17854 1178 -10545 -12828 -13974
21756 -13974 17620 26891 13090 -5937 -16371 -28161 -3794 -10231 -5448 -11281 -18025 9179 20833
21743 20833 12939 22682 46631 26037 -11452 -18487 -12625 -13960 1662 8232 -6864 -11368 -9984
21730 -9984 -23568 -33298 -16181 7449 23061 28914 41605 32507 20574 16091 19476 12363 12732
$$ packed form
21822B1381N011M102k969k3842k845j52J2274J279J6614l152l3938q494k1327
21809c6058r700J7688K0816J2143j4254l502j4632J4110M373O281k2272o90N177
21796b0520k991j1837M5058m342l5088J2484P305J0559O882R864O562o256p193
21783A0487p460L073M6m224j208j0889j0117k693r240q263K3006K2854Q350J6067
21769B9789O017R202R915j0916j5127P6J7090n825k2367j6676j1723k283j146
21756a3974L1594R271j3801j9027j0434j1790K4367o437M783n833o744K7204J1654
21743B0833p894R743K3949k0594l7489p035N862j335J5622O570j5096m504J384
21730i984j3584r730J7117K3630J5612N853J2691r098j1933m483L385p113L69
$$ plain form
21717 12732 23092 10438 -3142 -27773 -43911 -60021 -43387 -20027 -4668 -8349 -27644 -21137
21705 -21137 10316 25230 4178 -8364 13790 42007 43490 41285 23795 16731 16074 18704 28401
21692 28401 33479 18259 12488 17238 -4724 -8902 29524 41100 26668 33050 21497 6104 -20537
21679 -20537 -14205 -9078 -4662 7051 22788 37279 10129 -18606 -853 9506 -17329 1884
21667 1884 1755 -15191 -8515 9294 13921 -4732 2892 22626 31794 23084 1232 -11073 9067
21654 9067 41089 25073 4278 -18953 -41944 -38270 -36001 -41193 -21380 -13132 -6139 -12792 -26742
21641 -26742 -16542 -12169 -17218 -22577 -3956 19050 4340 -2116 32592 66265 65341 37188 -17357
21628 -17357 -33151 -21411 -8660 -783 -3450 -27971 -18683 -5522 12334 3496 -7397 -30544
$$ packed form
21717A2732J0360j2654j3580k4631j6138j6110J6634K3360J5359l681j9295O507
21705b1137L1453J4914k1052j2542K2154K8217J483k205j7490p064o57K630R697
21692B8401N078j5220n771M750k1962m178L8426J1576j4432O382j1553j5393k6641
21679b0537O332N127M416J1713J5737J4491k7150k8735J7753J0359k6835J9213
21667A884j29j6946O676J7809M627j8653P624J9734R168q710k1852j2305K0140
21654I067L2022j6016k0795k3231k2991L674K269n192J9813Q248O993o653j3950
21641b6742J0200M373n049n359J8621K3006j4710o456L4708L3673r24k8153n4545
21628a7357j5794J1740J2751P877k667k4521R288J3161J7856q838j0893k3147
$$ plain form
21616 -30544 -33212 -17601 18727 11583 16083 15054 22534 23501 15242 14207 24958 27605 10210 -7208
21602 -7208 -4595 -6589 -15031 -2436 -1016 -12873 -11725 1839 12709 -18094 -39066 -22266 -26269
21589 -26269 -24332 -23062 -16328 2468 26506 31704 33055 34786 24914 28928 5609 -3458 -17652
21576 -17652 -7568 771 5539 9879 36316 31580 16066 28538 32908 22789 -1155 13264 32603
21563 32603 38199 22313 25141 10235 -11702 -30306 -31986 -25575 -21591 -33418 -28376 -22115 -31640
21550 -31640 -22552 -8818 -8981 16459 6396 2677 -4428 -16989 -25981 -1032 -779 -24033 -34696
21537 -34696 -40493 -36829 -24701 -3445 -20249 -41701 -62822 -37482 -3862 18387 51736 55395
21525 55395 39642 17992 19155 29444 29321 35913 35398 690 -17603 11043 23934 30601 50009
$$ packed form
21616c0544k668J5611L6328p144M500j029P480R67q259j035J0751K647j7395j7418
21602g208K613j994q442J2595J420j1857J148J3564J0870l0803k0972J6800m003
21589b6269J937J270O734J8796K4038N198J351J731r872M014k3319r067j4194
21576a7652J0084Q339M768M340K6437m736j5514J2472M370j0119k3944J4419J9339
21563C2603N596j5886K828j4906k1937j8604j680O411L984j1827N042O261r525
21550c1640R088J3734j63K5440j0063l719p105j2561q992K4949K53k3254j0663
21537c4696n797L664J2128K1256j6804k1452k1121K5340L3620K2249L3349L659
21525E5395j5753k1650J163J0289j23O592n15l4708j8293K8646J2891O667J9408
$$ plain form
21512 50009 32381 16009 23515 23747 15757 20110 48818 57483 58177 54844 44527 41255 14069 9967
21498 9967 19721 10804 9798 11243 -12324 -26710 -12247 1136 -23428 -40249 -39158 -21820 -14302
21485 -14302 -21746 -13457 -1292 -8430 -31781 -27377 -10355 -7578 9566 11416 39894 8268 -18217
21472 -18217 -29741 -24686 -30477 -33527 -15089 -10162 16599 35090 29894 5336 20605 15225 13266
21459 13266 28380 32003 31057 19337 20316 32232 32276 28029 -27451 -67197 -69779 -54096 -29333 -11290
21445 -11290 2116 7749 2368 -11432 -4214 -5640 20061 43146 56744 33375 36324 26190 12296
21432 12296 16354 10960 37297 19095 13047 4444 -20923 -5366 8809 321 -926 -21399 -23161
21419 -23161 -4210 -1763 5153 14989 19033 22323 31912 40167 35263 4751 -17238 -18318 10540
$$ packed form
21512E0009j7628j6372P506K32p990M353K8708Q665O94l333j0317l272k7186m102
21498I967R754q917j006J445k3567j4386J4463J3383k4564j6821J091J7338P518
21485a4302p444Q289J2165p138k3351M404J7022K777J7144J850K8478l1626k6485
21472a8217j1524N055n791l050J8438M927K6761J8491n196k4558J5269n380j959
21459A3266J5114L623r46j1720R79J1916M4m247n5480l9746k582J5683K4763J8043
21445a1290J3406N633n381j3800P218j426K5701K3085J3598k3369K949j0134j3894
21432A2296M058n394K6337j8202o048q603k5367J5557J4175q488j247k0473j762
21419b3161J8951K447O916R836M044L290R589Q255m904l0512k1989j080K8858
$$ plain form
21406 10540 33307 13206 -10923 -5499 16653 33633 36011 25570 23864 24319 31240 39148 15598
21393 15598 -11061 -3318 29447 23669 27378 4511 -15653 -5301 24277 18784 21890 3557 7764
21380 7764 -4509 -1088 262 -4208 4159 -10944 -19468 -7008 -8824 13765 29525 27826 29081
21367 29081 -946 -17309 -3250 -2146 -3684 10437 23580 50070 68958 61180 50430 25628
21355 25628 21970 14286 3269 -5782 -6390 10038 20437 9454 9028 30072 33729 30812 6293
21342 6293 -6680 -11478 -35152 -26038 -8507 -401 11375 -13672 -16201 14077 33207 46674 28155
21329 28155 855 -3345 -12850 22649 55228 47940 23622 18922 11708 30739 58674 50564 23915
21316 23915 18293 24148 13861 26261 26351 10070 28399 33362 31141 37599 28885 23368 21660 9586
$$ packed form
21406A0540K2767k0101k4129N424K2152J6980K378j0441j706M55O921P908k3550
21393A5598k6659P743L2765n778L709k2867k0164J0352K9578n493L106j8333M207
21380G764j2273L421J350m470Q367j5103q524J2460j816K2589J5760j699J255
21367B9081l0027j6363J4059J104j538J4121J3143K6490J8888p778j0750k4802
21355B5628l658p684j1017r051o08J6428J0399j0983m26K1044L657k917k4519
21342F293j2973m798k3674R114J7531Q106J1776k5047k529L0278J9130J3467j8519
21329B8155k7300m200r505L5499L2579p288k4318m700p214J9031K7935q110k6649
21316B3915n622N855j0287J2400R0j6281J8329M963k221O458q714n517j708j2074
$$ plain form
21302 9586 12106 -673 16195 9990 4497 -6735 7118 811 -2089 -9292 -29767 -43092 -35272
21289 -35272 -32873 -23499 -28159 -46103 -40467 -18947 -35786 -40884 -26250 -17886 -22281 -14123 -23395
21276 -23395 -3575 20022 15946 10352 -3430 -9826 2018 43551 59341 42879 15695 9502
21264 9502 40334 30698 24658 36941 14901 -9762 -21902 -30706 -33055 -24073 -22911 -24470 -13671
21251 -13671 -20291 -19543 -26798 -55188 -46933 -26174 -23814 -24539 -34681 -39330 -37065 -30978 -32173 -28372
21237 -28372 -23013 -14819 16208 45486 12549 -7463 -5639 -1268 2779 -7947 -8791 2163 14924
21224 14924 9554 11886 15943 10604 11023 -5482 33405 41801 20533 37802 11063 -11681 -4856
21211 -4856 14773 31269 11434 21340 12694 4413 9844 -14757 -27479 -26367 -2738 7395 8713
$$ packed form
21302I586K520j2779J6868o205n493j1232J3853o307k900p203k0475j3325P820
21289c5272K399R374m660j7944N636K1520j6839n098J4634Q364m395Q158r272
21276b3395J9820K3597m076n594j3782o396J1844M1533J5790j6462k7184o193
21264I502L0832r636o040J2283k2040k4663j2140q804k349Q982J162j559J0799
21251a3671o620P48p255k8390Q255K0759K360p25j0142m649K265O087j195L801
21237b8372N359Q194L1027K9278l2937k0012J824M371M047j0726q44J0954J2761
21224A4924n370K332M057n339M19j6505L8887Q396k1268J7269k6739k2744O825
21211d856J9629J6496j9835R906q646q281N431k4601j2722J112K3629J0133J318
$$ plain form
21198 8713 -5628 12246 3930 -21886 -24685 20394 9052 -17989 -16626 -26843 -20115 -12666 -18630
21185 -18630 -37655 -34014 -17266 12444 34878 35158 24983 35700 34778 38415 35994 13037 7944
21172 7944 -7931 -9981 27776 52987 61384 56438 46413 37169 31218 3526 -4389 -8613 -5910
21159 -5910 -22363 -13357 -17167 9446 48255 48804 3750 -8136 8 6289 33779 30503 8753
21146 8753 13650 33977 33725 29762 24866 25915 17473 27286 33869 15560 13024 -868 4927 9830
21132 9830 16531 18302 13172 16884 37409 38671 14330 -15366 -34006 -49364 -30031 -13606 -2341
21119 -2341 9817 23614 11443 3546 -9477 -5937 -3892 7635 26267 17735 21299 33191 57100
21106 57100 44119 36735 38630 27673 25223 46957 57591 43879 33465 56229 72447 47486
$$ packed form
21198H713j4341J7874q316k5816k799M5079j1342k7041J363j0217O728P449n964
21185a8630j9025L641J6748K9710K2434K80j0175J0717r22L637k421k2957n093
21172G944j5875k050L7757K5211Q397m946j0025r244n951k7692p915m224K703
21159e910j6453R006l810K6613L8809N49m5054j1886Q144O281K7490l276k1750
21146H753M897K0327k52l963m896J049q442R813O583j8309k536j3892N795M903
21132I830O701J771n130L712K0525J262k4341k9696j8640j5358J9333J6425J1265
21119b341J2158J3797j2171p897j3023L540K045J1527J8632q532L564J1892K3909
21106E7100j2981p384J895j0957k450K1734J0634j3712j0414K2764J6218k4961
$$ plain form
21094 47486 40237 27382 15053 31722 32310 16858 5089 13241 12958 -12983 1983 14519 14335
21081 14335 33417 44451 12646 6484 24726 47786 78532 52250 29284 25865 18381 12783
21069 12783 5721 -4673 -9594 -14976 -26626 -22948 -20496 -25383 2949 27866 17675 18487 15944
21056 15944 8804 17267 6664 18364 19993 18904 -6620 -44954 -50108 -6850 -3145 -14881 -2510
21043 -2510 -13248 -6451 17635 22696 20168 -19513 -8065 10523 14660 -540 -6433 11103 -2016
21030 -2016 -18697 -29024 -24407 18189 45993 31307 11912 4982 -11248 10670 56818 62325
21018 62325 26186 4548 -7584 -13815 2070 5829 1949 7672 52556 77220 77896 61134 63781
21005 63781 40963 17790 16368 18569 29715 35533 26225 11925 4442 -26225 -22075 -14260 -16726
$$ packed form
21094D7486p249j2855j2329J6669N88j5452j1769Q152k83k5941J4966J2536j84
21081A4335J9082J1034l1805o162J8242K3060L0746k6282k2966l419p484n598
21069A2783p062j0394m921n382j1650L678K452m887K8332K4917j0191Q12k543
21056A5944p140Q463j0603J1700J629j089k5524l8334n154M3258L705j1736J2371
21043b510j0738O797K4086N061k528l9681J1448J8588M137j5200n893J7536j3119
21030b016j6681j0327M617M2596K7804j4686j9395o930j6230K1918M6148N507
21018F2325l6139k1638j2132o231J5885L759l880N723M4884K4664O76j6762K647
21005F3781k2818k3173j422K201J1146N818r308j4300p483l0667M150P815k466
$$ plain form
20992 -16726 -24419 888 13044 24062 31927 17105 -12218 11958 37155 41650 32110 15872
20980 15872 11198 4078 3040 -4115 -4414 -13970 -28156 -55374 -43210 -15607 -27534 -29446 6198
20967 6198 -19046 -39862 -39223 -23194 -19426 -27558 -26805 -35748 -28139 -25414 -8978 -8508 8913 34116
20953 34116 45217 34687 26383 13672 18538 8921 20639 -1225 21441 32427 33217 49155 47167
20940 47167 56236 64261 70377 60308 26535 14346 12293 18447 41519 40264 36023 24 -10949
20927 -10949 -41356 -13935 16624 14040 49416 45859 35678 18604 8503 30334 43536 46343
20915 46343 34590 13413 19045 8103 -9143 -5881 4576 -293 -5100 -12354 604 10148 -12888
20902 -12888 -19702 -24324 -38506 -36482 -30670 -13379 -27 -12836 -7945 5413 7715 -3026 2740
$$ packed form
20992a6726p693K5307J2156J1018P865j4822k9323K4176K5197M495r540j6238
20980A5872m674p120j038p155k99r556j4186k7218J2164K7603j1927j912L5644
20967F198k5244k0816O39J6029L768q132P53q943P609K725J6436M70J7421K5203
20953C4116J1101j0530q304j2711M866r617J1718k1864K2666J0986P90J5938j988
20940D7167R069Q025O116j0069l3773j2189k053O154K3072j255m241l5999j0973
20927a0949l0407K7421L0559k584L5376l557j0181j7074j0101K1831J3202K807
20915D6343j1753k1177N632j0942j7246L262J0457m869m807p254J2958R544k3036
20902a2888o814m622j4182K024N812J7291J3352j2809M891J3358K302j0741N766
$$ plain form
20889 2740 -511 -20472 2895 26508 13516 -28480 -67295 -62428 -41656 -30583 -17413 -32136
20877 -32136 -33550 -19222 -10323 -23777 -20112 23554 34820 50509 36487 30901 30978 7690 12611
20864 12611 13588 40849 34102 15053 -9354 -7365 -10670 869 20931 25735 9785 -10355 -7679
20851 -7679 -12994 -5546 33137 46549 19143 -8478 -18107 -8103 9494 33968 24112 12281 2391
20838 2391 9147 14552 11261 16194 45797 60186 43866 21214 3057 11494 -6968 -32410 -37242
20825 -37242 -13464 1796 -12077 -18776 -10026 -19903 4829 24198 12569 -1296 -5220 11605
20813 11605 33641 25558 19023 3942 27131 46167 66223 59167 49172 31850 24593 39066 67615
20800 67615 68415 31397 10897 -11492 9519 53002 64977 38906 25555 27200 40671 41790
$$ packed form
20889B740l251j9961K3367K3613j2992m1996l8815M867K0772J1073J3170j4723
20877c2136j414J4328Q899j3454L665M3666J1266J5689j4022n586P7k3288M921
20864A2611R77K7261o747j9049k4407J989l305J1539K0062M804j5950k0140K676
20851g679n315P448L8683J3412k7406k7621r629J0004J7597K4474r856j1831r890
20838B391O756N405l291M933K9603J4389j6320k2652j8157Q437j8462k5442m832
20825c7242K3778J5260j3873o699Q750r877K4732J9369j1629j3865l924J6825
20813A1605K2036q083o535j5081K3189J9036K0056p056r995j7322p257J4473K8549
20800F7615Q00l7018k0500k2389K1011M3483J1975k6071j3351J645J3471J119
$$ plain form
20788 41790 14475 9964 23050 30296 11318 28816 47801 51770 38079 15765 81 -7372
20776 -7372 -6209 10553 10085 36207 24066 -4393 -4505 -10142 -34308 -39660 -35571 -25182 -28668 -45729
20762 -45729 -36517 -36288 -13552 -631 -20387 -30070 -6613 22169 53021 13016 -29746 -47830
20750 -47830 -26133 -17475 -22964 -519 7017 11621 -618 -14834 -32740 -5608 11808 7743 -839
20737 -839 7066 24077 30798 32578 28062 2807 -14068 -16322 -15096 -30618 -33099 -27657 -7460 1289
20723 1289 1301 -26203 -29792 -29412 1510 29577 59546 76864 74039 40615 21462 22986 19688 16059
20709 16059 24632 25819 32878 36278 51337 30427 -3513 -11397 18973 56266 69132 41067 21517
20696 21517 -669 7004 14701 1250 9946 8353 2614 9082 -2229 8955 25058 27344 33042
$$ packed form
20788D1790k7315m511J3086P246j8978J7498J8985L969j3691k2314j5684p453
20776g372J163J6762m68K6122j2141k8459j12n637k4166n352M089J0389l486j7061
20762d5729R212K29K2736J2921j9756r683K3457K8782L0852m0005m2762j8084
20750d7830K1697Q658n489K2445P536M604j2239j4216j7906K7132J7416m065q582
20737h39P905J7011O721J780m516k5255j6875k254J226j5522k481N442K0197Q749
20723A289J2k7504l589L80L0922K8067K9969J7318k825l3424j9153J524l298l629
20709A6059Q573J187P059L400J5059k0910l3940p884L0370L7293J2866k8065j9550
20696B1517k2186P673P697j3451Q696j593n739O468j1311J1184J6103K286N698
$$ plain form
20683 33042 49805 22611 22972 12035 8114 16226 26945 13546 1846 18997 29694 17766
20671 17766 23030 36120 25217 33482 60260 57782 42871 33685 51418 50285 38833 40744 37136
20658 37136 29115 45392 54857 34728 21713 52686 47748 29478 29099 -5359 -4822 4565 10596
20645 10596 5061 22516 33760 6913 -6772 -7082 13775 27130 28345 26966 17852 11747 14676
20632 14676 4076 22206 57127 60049 56118 51527 42577 37674 26646 18639 10293 -11187 -7647
20619 -7647 -26218 -53561 -48442 -12542 -5028 -20311 -19222 -16392 -8416 -9779 -18353 -50475 -61530
20606 -61530 -35854 5438 21069 24346 -7549 -24595 -13290 -9376 -5574 23008 18975 -14419
20594 -14419 -23004 -39205 -52387 -31536 -26598 -45278 -21388 -6056 2741 -169 1385 5381 21078
$$ packed form
20683C3042J6763k7194L61j0937l921Q112J0719j3399j1700J7151J0697j1928
20671A7766N264J3090j0903Q265K6778k478j4911r186J7733j133j1452J911l608
20658C7136q021J6277R465k0129j3015L0973m938j8270l79l4458N37R387O031
20645A0596n535J7455J1244k6847j3685l10K0857J3355J215j379r114o105K929
20632A4676j0600J8130L4921K922l931m591q950m903j1028q007q346k1480L540
20619g647j8571k7343N119L5900P514j5283J089K830P976j363q574l2122j1055
20606f1530K5676M1292J5631L277l1895j7046J1305L914L802K8582m033l3394
20594a4419q585j6201j3182K0851M938j8680K3890J5332Q797k910J554L996J5697
$$ plain form
20581 21078 2422 -8725 19766 21017 12563 11953 -3740 -35132 -40865 -15876 -2983 -11595 3341
20568 3341 11406 -11169 69 -2987 -6542 -5705 13739 40750 42763 19805 8165 9056 -1126
20555 -1126 -603 9222 4514 -17223 -31266 -14928 10463 30768 35191 5694 -35278 -46250 -48018
20542 -48018 -35777 -13148 -23437 15103 45790 28446 17712 24359 15225 1956 -31177 -43764
20530 -43764 -48382 -6289 20462 19862 10380 -1772 4334 27535 38258 46538 40023 17357 15152
20517 15152 6914 -13378 -21120 -16725 -26433 -51143 -53678 -22477 -8750 -8086 -1476 -31164 -21555
20504 -21555 11616 10329 10169 18116 -12216 -41670 -38473 -36535 -25745 -17804 -11333 -11668 3420 8494
20490 8494 6507 -13542 -8245 8925 25145 30992 3294 -15413 -29330 -24320 -2106 3499 -7344
$$ packed form
20581B1078j8656j1147K8491J251q454o10j5693l1392n733K4989J2893q612J4936
20568C341Q065k2575J1238l056l555Q37J9444K7011K013k2958j1640Q91j0182
20555a126N23R825m708k1737j4043J6338K5391K0305M423k9497m0972j0972j768
20542d8018J2241K2629j0289L8540L0687j7344j0734O647r134j3269l3133j2587
20530d3764m618M2093K6751o00r482j2152O106K3201J0723Q280o515k2666k205
20517A5152q238k0292p742M395r708k4710k535L1201J3727O64O610k9688R609
20504b1555L3171j287j60P947l0332k9454L197J938J0790P941O471l35J5088N074
20490H494j987k0049N297J7170J6220N847k7698j8707j3917N010K2214N605j0843
$$ plain form
20477 -7344 -15769 -8404 16937 21792 33973 28673 13255 -5593 -1878 33891 13648 4659 3500
20464 3500 15324 24001 17208 14343 14436 44127 74275 50748 5013 -9949 1974 1630 17689
20451 17689 -1504 -37258 -31724 -37421 -37182 -34348 6368 35571 29324 34758 25147 27741 -1820
20438 -1820 -20586 -6004 1296 5411 34918 13902 -15026 -26980 -10377 2436 27740 35707
20426 35707 32811 48473 45586 37522 48955 57429 29099 24750 18977 4062 -6061 4460 -14888
20413 -14888 -25263 -23443 -1186 18051 38055 51130 9882 382 22505 2188 -3254 1973
20401 1973 11897 6510 6206 24196 21127 15865 -3386 -26883 -10893 1915 -6236 -15430 -29738
20388 -29738 -16957 2197 8081 24744 5106 -17387 -12356 7144 -882 321 -116 4203 -4001
$$ packed form
20477g344q425P365K5341M855J2181n300j5418j8848L715L5769k0243q989j159
20464C500J1824Q677o793k865R3K9691L0148k3527m5735j4962J1923l44J6059
20451A7689j9193l5754N534n697K39K834M0716K9203o247N434r611K594k9561
20438a820j8766J4582P300M115K9507k1016k8928j1954J6603J2813K5304P967
20426C5707k896J5662k887q064J1433Q474k8330m349n773j4915j0123J0521j9348
20413a4888j0375J820K2257J9237K0004J3075m1248r500K2123k0317n442N227
20401A973R924n387l04J7990l069n262j9251k3497J5990J2808q151r194j4308
20388b9738J2781J9154N884J6663j9638k2493N031J9500q026J203m37M319q204
$$ plain form
20375 -4001 -13553 -34055 -27936 -2413 -1253 -20541 -27273 -34703 -35907 -43224 -36466 -6703 14167
20362 14167 15513 30185 27222 14255 -729 -21784 -22622 2952 44934 48476 20039 10925 -23761
20349 -23761 -25830 -32565 -48509 -48368 -23440 -18107 -19936 -16138 16611 23529 22006 -3358 -26082
20336 -26082 -20551 -17204 -11107 -32261 -27765 -6130 8831 15721 39847 49509 26294 -23233 20138
20323 20138 67037 48085 13042 1185 -64 2668 -3493 2201 25172 14788 -18010 -8974 19609
20310 19609 19364 14662 23571 12440 15443 4695 -39430 -45109 -60745 -52373 -1766 37734 23266
20297 23266 9554 30326 31682 7043 -10834 -10457 14108 16751 23723 11900 21309 24525 35666
20284 35666 18705 -13565 -6013 -5931 27026 40487 32638 30933 16972 15178 37723 34328 28560
$$ packed form
20375d001r552k0502O119K5523J160j9288o732p430j204p317O758K9763K0870
20362A4167J346J4672k963j2967j4984k1055q38K5574M1982L542k8437r114l4686
20349b3761k069o735j5944J41K4928N333j829L798L2749O918j523k5364k2724
20336b6082N531L347O097k1154M496K1635J4961O890K4126R662k3215m9527M3371
20323B0138M6899j8952l5043j1857j249K732o161N694K2971j0384l2798R036K8583
20310A9609k45m702Q909j1131L003j0748m4125n679j5636Q372N0607L9500j4468
20297B3266j3712K0772J356k4639j7877L77K4565K643O972j1823R409L216J1141
20284C5666j6961l2270P552Q2L2957J3461p849j705j3961j794K2545l395n768
$$ plain form
20271 28560 25718 7247 6320 25017 30491 45689 50473 31857 -2170 -24403 -1517 -1930 13631
20258 13631 11025 -6644 -4815 3513 37 -17137 -8818 25196 28449 29509 26194 33124 55774
20245 55774 72417 68560 38262 23221 4185 8768 19503 28840 51279 45441 24710 11983
20233 11983 25822 16756 6006 15381 22438 29430 24445 -14953 -29511 -26766 -22809 -10445 -6004
20220 -6004 -20493 -25261 -20588 -18689 13363 2323 -18503 1325 -1275 -21864 953 24796 39206
20207 39206 29261 13131 11336 20429 34846 18711 10341 21841 35175 28678 -5276 -26112 -18983
20194 -18983 -7793 10432 11006 3423 15447 20409 28373 39116 54773 49294 46508 41056 33378
20181 33378 23629 147 -16397 -18768 -18589 -12057 95 -2009 6553 -14625 -6900 -9749 -26049
$$ packed form
20271B8560k842j8471r27J8697N474J5198M784j8616l4027k2233K2886m13J5561
20258A3631k606j7669J829Q328l476j7174Q319L4014L253J060l315O930K2650
20245E5774J6643l857l0298j5041j9036M583J0735R337K2439n838k0731j2727
20233A1983J3839r066j0750R375P057O992m985l9398j4558K745L957J2364M441
20220f004j4489m768M673J899L2052j1040k0826J9828k600k0589K2817K3843J4410
20207C9206r945j6130j795R093J4417j6135q370J1500J3334o497l3954k0836P129
20194a8983J1190J8225N74p583J2024M962P964J0743J5657n479k786n452p678
20181C3378r749k3482j6544k371J79O532J2152k104Q562k1178P725k849j6300
$$ plain form
20168 -26049 -26937 -6710 31336 45837 34460 7497 -14349 -21792 -21285 -9799 -24442 -19049 6202
20155 6202 19755 23441 46671 72688 66430 68713 80123 61222 44782 45093 70542 77755 53021
20142 53021 21135 23169 37263 25503 35540 52815 65718 54593 44914 51033 55661 44080
20130 44080 23348 -4853 -1281 15327 10942 22607 12228 10710 7337 -4758 14390 23749 15333
20117 15333 22913 44808 32009 42308 29355 26980 52773 37103 27029 52644 81647 44437
20105 44437 15766 21740 36483 17250 13182 16263 13607 -6705 -13515 11712 20342 19228 34738
20092 34738 9812 24779 12799 -23278 -12189 -17206 -16802 -26902 -19790 -2224 9683 5069 29890
20079 29890 24012 3764 -3674 -3659 10005 -5938 -47085 -58319 -56951 -34224 -13204 -4701 -20503
$$ packed form
20168b6049q88K0227L8046J4501j1377k6963k1846p443N07J1486j4643N393K5251
20155F202J3553L686K3230K6017o258K283J1410j8901j6440L11K5449P213k4734
20142E3021l1886K034J4094j1760J0037J7275J2903j1125r679O119M628j1581
20130D4080k0732k8201L572J6608m385J1665j0379j518l373j2095J9148R359q416
20117A5333P580K1895j2799J0299j2953k375K5793j5670j0074K5615K9003l7210
20105D4437k8671N974J4743j9233m068L081k656k0312o810K5227Q630j114J5510
20092C4738k4926J4967j1980l6077J1089n017M04j0100P112J7566J1907m614K4821
20079B9890n878k0248p438J5J3664j5943m1147j1234J368K2727K1020Q503j5802
$$ plain form
20066 -20503 -24536 -22583 -24366 -34625 -7093 25701 23584 19855 52057 51899 26404 23164 32463
20053 32463 3873 7070 11155 24937 22198 19247 3066 9645 3617 11218 20826 11422 -6603
20040 -6603 -11447 131 -11869 4790 20268 19698 18612 8882 -10516 3594 16012 2318 -3844
20027 -3844 2916 14838 16227 23159 29266 31058 28025 23600 -7515 13120 22780 24021 26385 5393
20013 5393 7445 27586 32884 39775 36802 9436 -6068 1122 -5562 -10676 10377 9321 30962
20000 30962 19320 -9254 -1657 11644 1364 12335 25798 5758 -4645 -7583 -7451 5804
19988 5804 16436 5866 15431 32846 33186 29160 27236 7166 18614 16632 15030 14052 20277 28540
19974 28540 47336 56791 54075 55079 35022 6081 -8863 -238 8556 -8793 -27351 4687 15538
$$ packed form
20066b0503m033J953j783j0259K7532L2794k117l729L2202j58k5495l240R299
20053C2463k8590L197M085J3782k739k951j6181O579o028P601R608r404j8025
20040f603m844J1578j2000J6659J5478n70j086r730j9398J4110J2418j3694o162
20027c844O760J1922J389O932O107J792l033m425l1115K0635R660J241K364k0992
20013E393K052K0141N298O891k973k7366j5504P190o684n114K1053j056K1641
20000C0962j1642k8574P597J3301j0280J0971J3463k0040j0403k938J32J3255
19988E804J0632j0570R565J7415L40m026j924k0070J1448j982j602r78O225Q263
19974B8540J8796R455k716J004k0057k8941j4944Q625Q794j7349j8558L2038J0851
$$ plain form
19961 15538 24671 21015 26232 2978 8364 22495 22507 17835 18809 17628 171 -8465 598 7010
19947 7010 25297 10000 12049 19031 17744 19184 25614 47321 29534 13982 32013 30355 16812
19934 16812 28915 42013 33190 28742 33926 36222 38917 42870 40212 38219 27935 31955 19059
19921 19059 18716 31682 48208 56002 19124 21496 30804 20684 32652 29144 -4343 -670 16067
19908 16067 14267 11540 34736 43711 47367 38930 76909 79464 50037 17891 17986 21332 37973 45349
19894 45349 29131 14653 13626 25698 32926 14056 7609 5557 -5193 -11302 -6 -6706 -12740
19881 -12740 -32897 -14784 8378 20972 17638 32284 33630 14015 -10196 4348 1792 17485
19869 17485 27880 18703 9385 1702 -3172 -4255 -19711 -5017 18037 33640 21707 24624 22239
$$ packed form
19961A5538R133l656N217k3254N386J4131J2m672R74j181j7457q636R063O412
19947G010J8287j5297K049O982j287J440O430K1707j7787j5552J8031j658j3543
19934A6812J2103J3098q823m448N184K296K695L953k658j993j0284M020j2896
19921A9059l43J2966J6526P794l6878K372R308j0120J1968l508l3487L673J6737
19908A6067j800k727K3196Q975L656q437L7979K555k9427l2146R5L346J6641P376
19894D5349j6218j4478j027J2072P228j8870o447k052j0750o109J1296o700o034
19881a2740k0157J8113K3162J2594l334J4646J346j9615k4211J4544k556J5693
19869A7485J0395r177r318p683m874j083j5456J4694K3054J5603j1933K917k385
$$ plain form
19856 22239 34501 27376 56002 67785 60544 52052 44059 39005 14256 -15897 -24942 -17549 5460
19843 5460 34887 26097 8924 20443 -4807 -19117 -19753 -31631 1723 41198 36033 34587 54110
19830 54110 28427 5621 29171 48166 22986 38179 46801 47466 80890 94196 43078 19985
19818 19985 19539 6726 -2034 11714 3064 4917 10974 3454 -11965 -3696 -236 704 -2339 -173
19804 -173 -3887 -9126 -9672 -22948 -37753 -18246 -9970 26389 53841 58147 43047 31193 47064
19791 47064 47669 57315 50843 53981 65872 47263 33217 17341 12880 9523 11126 13347 24420
19778 24420 6654 22253 49390 50567 18031 -24349 -11973 -6464 6832 30345 32469 28114
19766 28114 1478 14319 52113 53765 21507 23207 8427 -2862 10001 51276 52288 38127
$$ packed form
19856B2239J2262p125K8626J1783p241q492p993n054k4749l0153r045P393K3009
19843E460K9427q790j7173J1519k5250j4310o36j1878L3354L9475n165j446J9523
19830E4110k5683k2806K3550J8995k5180J5193Q622O65L3424J3306n1118k3093
19818A9985m46j2813q760J3748q650J853O057p520j5419Q269L460R40l043K166
19804a73l714n239n46j3276j4805J9507Q276L6359K7452M306j5100j1854J5871
19791D7064O05R646o472L138J1891j8609j4046j5876m461l357J603K221J1073
19778B4420j7766J5599K7137J177l2536m2380J2376N509J3296K3513K124m355
19766B8114k6636J2841L7794J652l2258J700j4780j1289J2863M1275J012j4161
$$ plain form
19754 38127 24089 14683 -4275 -11974 12952 11367 -7709 15025 9194 -652 11791 15857 -10490
19741 -10490 -25898 -24191 -9808 -2860 12899 26006 22845 46019 50319 42823 53468 20041 -622
19728 -622 3607 21229 8167 -1224 34785 47681 29830 26415 30061 53741 56408 40844 27748
19715 27748 16037 -6054 -1893 4773 14421 30274 16862 24944 -4362 -26864 -40140 -48578 -39412
19702 -39412 -37813 -12839 6710 4259 18407 34770 25293 11966 -10389 -11392 -2665 2101 12800
19689 12800 27083 56756 57937 15634 10307 50189 61601 9257 17056 11407 15274 6187 -3305
19676 -3305 -5666 12608 19477 20566 30023 32949 35550 35759 16859 2878 15130 13220 19151 33463
19662 33463 10109 10030 26828 20783 41223 46390 42493 50586 49725 66513 73809 103277 101490 63704
$$ packed form
19754C8127j4038r406j8958p699K4926j585j9076K2734n831r846J2443M066k6347
19741a0490j5408J707J4383O948J5759J3107l161K3174M300p496J0645l3427k0663
19728f22M229J7622j3062r391L6009J2896j7851l415L646K3680K667j5564j3096
19715B7748j1711k2091M161O666R648J5853j3412Q082k9306k2502j3276q438R166
19702c9412J599K4974J9549k451J4148J6363r477j3327k2355j003Q727M766J0699
19689A2800J4283K9673J181m2303n327L9882J1412n2344P799n649L867r087r492
19676c305k361J8274O869J089R457K926K601K09j8900j3981J2252j910N931J4312
19662C3463k3354p9J6798o045K0440N167l897Q093q61J6788P296K9468j787l7786
$$ plain form
19648 63704 48900 66613 87098 75964 85232 100821 95203 79848 67532 63350 62867 5459 -7995
19635 -7995 28384 49275 57905 80083 89091 91093 85207 74754 64369 55923 45931 51346 64686
19622 64686 40081 -2916 -5802 5304 6445 -4551 -18806 -11037 -26082 -17464 -4785 13294
19610 13294 19806 23086 28079 20047 6541 12491 20552 29445 12043 9607 19420 12461 -10529 7495
19596 7495 -6277 -19072 -794 9971 17251 7021 -2540 -16292 -15662 16869 28189 33004 37010
19583 37010 42144 42181 53158 61917 59324 31153 37749 45130 39788 46535 41998 28931 31769 18476
19569 18476 10540 13194 26086 5743 -659 22361 56621 50024 46310 37089 33632 33730 36500 31410
19555 31410 23467 31737 41399 40366 40651 35441 26926 40343 45093 30757 14918 3581 2479 27261
$$ packed form
19648F3704j4804J7713K0485j1134R268J5589n618j5355j2316m182m83n7408j3454
19635g995L6379K0891Q630K2178R008K002n886j0453j0385q446r992N415J3340
19622F4686k4605m2997k886J1106J141j0996j4255P769j5045Q618J2679J8079
19610A3294O512L280M993q032j3506N950Q061Q893j7402k436R813o959k2990J8024
19596G495j3772j2795J8278J0765P280j0230r561j3752O30L2531J1320M815M006
19583C7010N134L7J0977Q759k593k8171O596P381n342O747m537j3067K838j3293
19569A8476p936K654J2892k0343o402K3020L4260o597l714r221l457R8K770n090
19555C1410p943Q270R662j033K85n210q515J3417M750j4336j5839j1337j102K4782
$$ plain form
19541 27261 44526 45867 42745 15840 -14926 21606 59291 56408 60443 45823 36866 32599 37618
19528 37618 45842 29308 33577 26045 37306 14896 13559 41294 20458 -397 17712 29632
19516 29632 64357 76090 66475 36063 31896 27289 35248 18181 23685 28831 22515 29177 43392
19503 43392 27500 17940 29598 50828 51655 39850 32816 32677 47387 34871 31297 21406 44357
19490 44357 68610 70685 62564 64123 55064 28454 53555 80959 69081 55525 59863 76027 83321
19477 83321 74225 80374 87439 72526 52688 24663 29394 29283 30274 56725 69207 62515 59223 43103
19463 43103 16640 34013 49607 42894 43614 51234 48629 54350 41597 34989 39194 50498 55067
19450 55067 53167 42086 26142 26794 67374 63386 41637 35865 4825 5642 31516 57884 71444
$$ packed form
19541B7261J7265J341l122k6905l0766L6532L7685k883M035j4620q957m267N019
19528C7618Q224j6534M269p532J1261k2410j337K7735k0836k0855J8109J1920
19516B9632L4725J1733r615l0412m167m607P959j7067N504N146o316O662J4215
19503D3392j5892r560J1658K1230Q27j1805p034j39J4710j2516l574r891K2951
19490D4357K4253K075q121J559r059k6610K5101K7404j1878j3556M338J6164P294
19477H3321r096O149P065j4913j9838k8025M731j11R91K6451J2482o692l292j6120
19463D3103k6463J7373J5594o713P20P620k605N721j2753o608M205J1304M569
19450E5067j900j1081j5944O52M0580l988k1749n772l1040Q17K5874K6368J3560
$$ plain form
19437 71444 91032 102532 71309 35593 60688 45258 6353 -28136 -22492 -10358 10547 37804
19425 37804 65250 47732 39955 38927 12165 20643 23256 34325 78673 76613 43830 40851 68346
19412 68346 68688 66258 55270 53323 62017 61488 60921 92841 92622 84917 99259 104492 85577 53591
19398 53591 48838 46062 34523 35179 30126 46501 58784 65458 80636 86853 78186 75934 55031
19385 55031 45491 53569 54466 78422 88780 99413 120068 127521 159024 165902 175432 169466 182065
19372 182065 229163 279332 385890 591389 967351 1410683 1434344 1257894 1000479 718241
19362 718241 496005 372278 301212 244625 220944 201588 177415 171993 190005 201433 197343
19351 197343 202774 208283 185224 191459 209507 231595 301892 382642 526446 775340 1185317
$$ packed form
19437G1444J9588J1500l1223l5716K5095j5430l8905l4489N644J2134K0905K7257
19425C7804K7446j7518p777j028k6762Q478K613J1069M4348k060l2783k979K7495
19412F8346L42k430j0988j947Q694n29n67L1920k19p705J4342N233j8915l1986
19398E3591m753k776j1539O56n053J6375J2283O674J5178O217q667k252k0903
19385E5031r540Q078Q97K3956J0358J0633K0655P453L1503O878R530n966J2599
19372A82065M7098N0169J06558K05499L75962M43332K3661j76450k57415k82238
19362G18241k22236j23727p1066n6587k3681j9356k4173n422J8012J1428m090
19351A97343N431N509k3059O235J8048K2088P0297Q0750J43804K48894M09977
$$ plain form
19340 1185317 1501206 1429103 1244279 954664 678165 499164 371397 295439 251905 231562
19330 231562 194591 186601 210349 238084 260837 363361 557568 725348 699906 624351 476869
19319 476869 338923 283012 243418 239931 301515 423499 607730 759309 696696 596836 450287
19308 450287 318629 250067 194911 160752 152295 147576 159423 136201 108248 114144 99012 96490
19296 96490 113433 118567 117602 102795 97602 102478 99545 108511 83020 75419 78181 73619 69125 90606
19282 90606 123203 138550 118863 96463 77963 64248 65688 47181 38263 19786 2111 27172
19270 27172 43136 27492 7720 -1490 13398 45533 68806 63405 45261 30305 61659 54579
19258 54579 56855 58122 52153 36609 38878 26463 26016 41516 35876 45058 50099 18691 7305
$$ packed form
19340A185317L15889p2103j84824k89615k76499j79001j27767p5958m3534k0343
19330B31562l6971p990K3748K7735K2753J02524J94207J67780k5442p5555j47482
19319D76869j37946n5911l9594l487O1584J21984J84231J51579o2613r9860j46549
19308D50287j31658o8562n5156l4159q457m719J1847k3222k7953N896j5132k522
19296I6490J6943N134r65j4807n193M876k933Q966k5491p601K762m562m494K1481
19282I0606L2597J5347j9687k2400j8500j3715J440j8507q918j8477j7675K5061
19270B7172J5964j5644j9772r210J4888L2135K3273n401j8144j4956L1354p080
19258E4579K276J267n969j5544K269j2415m47J5500n640R182N041l1408j1386
$$ plain form
19245 7305 15955 36041 71910 68526 55885 67696 96573 88169 92418 69981 49855 38474 35932
19232 35932 51219 72121 82545 90809 79380 65146 41732 16563 41469 57981 42999 38592
19220 38592 49808 36336 45784 37664 37942 48834 49933 57039 72159 63170 52064 46926 44524
19207 44524 35803 36228 63602 84891 100348 102841 87426 71113 50707 60036 90821 117193 111656
19194 111656 103758 59218 82180 105197 100860 91383 81694 78443 102966 127248 150747 170031
19182 170031 203267 204414 179574 150152 140625 138634 139613 130247 99098 110839 120554 127277 125915
19169 125915 141526 111857 114310 114930 121945 121532 104950 99961 123062 112819 115771 107336 136869
19156 136869 148626 147587 133574 143054 155304 172615 151628 148116 145587 126366 119991 129079 144198
$$ packed form
19245G305Q650K0086L5869l384j2641J1811K8877q404M249k2437k0126j1381k542
19232C5932J5287K0902J0424Q264j1429j4234k3414k5169K4906J6512j4982m407
19220C8592J1216j3472R448q120K78J0892J099P106J5120q989j1106n138k402
19207D4524q721M25K7374K1289J5457K493j5415j6313k0406R329L0785K6372n537
19194A11656p898m4540K2962K3017m337r477r689l251K4523K4282K3499J9284
19182A70031L3236J147k4840k9422r527j991R79r366l1149J1741R715O723j362
19169A25915J5611k9669K453O20P015m13j6582m989K3101j0243K952q435K9533
19156A36869J1757j039j4013R480J2250J7311k0987l512k529j9221o375R088J5119
$$ plain form
19143 144198 185893 212916 229397 259574 288186 308292 372032 494762 694785 793859 744974
19132 744974 678946 582068 521961 519210 580679 710289 887546 961211 885852 760926 608051
19121 608051 464827 363415 271872 263893 249001 200594 193451 264689 326065 409431 532638
19110 532638 745176 846141 802234 710486 564510 455633 422643 468396 572234 783828
19100 783828 877123 780453 635677 449180 334933 271569 191040 137233 113915 96440 80608
19089 80608 57024 68679 96280 112846 105091 109597 149016 140312 108623 90439 86471 117238
19077 117238 123016 105107 99037 114746 138820 142561 162868 190176 183523 171087 166548 201881
19065 201881 197451 175204 171993 152815 171631 174498 156834 162697 189130 195872 216478 233076
$$ packed form
19143A44198M1695K7023J6481L0177K8612K0106O3740J22730K00023R9074m8885
19132G44974o6028r6878o0107k751O1469J29610J77257P3665p5359j24926j52875
19121F08051j43224j01412r1543p979j4892m8407p143P1238O1376Q3366J23207
19110E32638K12538J00965m3907r1748j45976j08877l2990M5753J03838K11594
19100G83828R3295r6670j44776j86497j14247o3364q0529n3807k3318j7475j5832
19089H0608k3584J1655K7601J6566p755M506L9419q704l1689j8184l968L0767
19077A17238N778j7909o070J5709K4074L741K0307K7308o653j2436m539L5333
19065B01881m430k2247l211j9178J8816K867j7664N863K6433O742K0606J6598
$$ plain form
19053 233076 245425 250930 238649 233583 248479 240289 244215 224014 222243 264777 338800 420414
19041 420414 517496 742512 917511 872272 778199 664690 544369 487333 500407 584866 744104
19030 744104 859317 794823 697943 548001 424562 353197 307677 271909 232244 203113 199319
19019 199319 209945 190756 199168 187893 194324 228684 262582 304462 330558 364874 503431 762575
19007 762575 914083 860455 745190 589790 464005 395021 418541 495593 660380 778533
18997 778533 701229 564081 433581 370913 276763 237023 242860 258856 246895 222621 200576
18986 200576 196114 208574 221675 201010 193908 196801 160617 162430 189016 214898 230254 230700 211271
18973 211271 157598 134888 161021 189724 171855 171463 240471 292307 389351 491424 522462 415113
$$ packed form
19053B33076J2349N505j2281n066J4896q190L926k0201j771M2534P4023Q1614
19041D20414R7082K25016J74999m5239r4073j13509j20321n7036J3074Q4459J59238
19030G44104J15213o4494r6880j49942j23439p1365m5520l5768l9665k9131l794
19019A99319J0626j9189Q412j1275O431L4360L3898M1880K6096L4316J38557K59144
19007G62575J51508n3628j15265j55400j25785o8984K3520P7052J64787J18153
18997G78533p7304j37148j30500o2668r4150l9740N837J5996j1961k4274k2045
18986B00576m462J2460J3101k0665p102K893l6184J813K6586K5882J5356M46j9429
18973B11271n3673k2710K6133K8703j7869l92O9008N1836R7044J02073L1038j07349
$$ plain form
18961 415113 319309 208272 111554 90609 88973 77345 79515 77005 77008 89789 85737 120204 152625
18948 152625 190734 197538 224312 233172 245769 237490 271054 315786 350714 390703 486927 614266
18936 614266 577068 492821 446836 337636 273177 250175 236806 221438 189282 161357 163158
18925 163158 121335 97761 148805 195599 214494 231090 247983 226636 200801 227601 242008
18914 242008 278133 313612 334015 375332 420599 415243 444850 478639 487410 498603 519485 545516
18902 545516 579248 526534 463131 432345 405036 390788 387310 389945 400815 405317 424800 421569
18890 421569 411496 360044 346910 366816 388571 381183 348939 348849 394741 438064 467910 491867
18878 491867 540931 582503 586564 608382 624339 637961 690517 729299 737408 756161 781871 777088
$$ packed form
18961D15113r5804j11037r6718k0945j636j1628K170k510LJ2781m052L4467L2421
18948A52625L8109O804K6774Q860J2597q279L3564M4732L4928L9989R6224J27339
18936F14266l7198q4247m5985j09200o4459k3002j3369j5368l2156k7925J801
18925A63158m1823k3574N1044M6794J8895J6596J6893k1347k5835K6800J4407
18914B42008L6125L5479K0403M1317M5267n356K9607L3789Q771J1193K0882K6031
18902E45516L3732n2714o3403l0786k7309j4248l478K635J0870M502J9483l231
18890D21569j0073n1452j3134J9906K1755p388l2244r0M5892M3323K9846K3957
18878D91867M9064M1572M061K1818J5957J3622N2556L8782Q109J8753K5710m783
$$ plain form
18866 777088 780125 772616 785495 789756 785728 831545 944659 1103669 1386963 1866095 2274353
18855 2274353 2218628 2001835 1689304 1419271 1279539 1238554 1227564 1260946 1327710 1377289
18845 1377289 1427677 1441910 1429171 1475072 1565932 1630917 1743440 1833363 1926056 2046477 2197048
18834 2197048 2384786 2637039 3051544 3617417 4389109 4864340 5020112 5128337 5123099 5175742
18824 5175742 5465505 5997262 6807018 8047871 9517596 10907323 12383242 14143480 16698607
18815 16698607 20170460 24296414 30154919 39250270 53871315 79989888 131631023 222470217
18807 222470217 270818706 245253865 201246244 142136905 91654222 61102694 44192635
18800 44192635 33781269 26924433 22238779 18715528 16605383 15773041 16138418 17053137
$$ packed form
18866G77088L037p509J2879M261m028M5817J13114J59010K83294M79132M08258
18855B274353n5725k16793l12531k70033j39732m0985j0990L3382O6764M9579
18845A377289N0388J4233j2739M5901R0860O4985J12523Q9923R2693J20421J50571
18834B197048J87738K52253M14505N65873P71692M75231J55772J08225n238N2643
18824E175742K89763N31757Q09756J240853J469725J389727J475919J760238K555127
18815A6698607L471853M125954N858505R095351J4621045K6118573N1641135R0839194
18807B22470217M8348489k5564841m4007621n9109339n0482683l0551528j6910059
18800D4192635j0411366o856836m685654l523251k110145q32342L65377R14719
$$ plain form
18792 17053137 17769424 18588624 19801035 21960608 25102946 29353479 36116795 46934561
18784 46934561 65076032 98929143 166424388 262987016 278412812 244194604 189742721
18777 189742721 127977342 81091314 54402749 39027892 29156346 22496928 17523157
18770 17523157 13621671 10962862 9257758 8263557 7671278 6987668 6280568 5512339 4731781
18761 4731781 4130240 3929130 4048336 3860951 3455028 3030168 2646865 2331925 2092238
18752 2092238 1898698 1726914 1560510 1410128 1288699 1205407 1142488 1086448 986741 920263
18742 920263 843206 802331 794672 803429 812707 842994 923249 1038345 1213920 1582283 2028735
18731 2028735 1987884 1796623 1498949 1131091 859916 728816 649262 589071 530817 486976
$$ packed form
18792A7053137P16287Q19200J212411K159573L142338M250533O763316J0817766
18784D6934561J8141471L3853111O7495245R6562628J5425796l4218208n4451883
18777A89742721o1765379m6886028k6688565j5374857r871546o659418m973771
18770A7523157l901486k658809j705104r94201n92279o83610p07100p68229p80558
18761D731781o01541k01110J19206j87385m05923m24860l83303l14940k39687
18752B092238j93540j71784j66404j50382j21429q3292o2919n6040r9707o6478
18742I20263p7057m0875p659Q757R278L0287Q0255J15096J75575L68363M46452
18731B028735m0851j91261k97674l67858k71175j31100p9554o0191n8254m3841
$$ plain form
18721 486976 444130 414106 375948 353709 321239 308637 276109 261978 267288 265228 212047 232043
18709 232043 250926 227217 230912 270004 281153 270246 265038 282292 288226 288401 301785 246197
18697 246197 212291 189124 171605 149793 96837 76473 99830 117756 111728 119629 176180 209289
18685 209289 204581 174412 130680 84829 13228 -7499 11694 12805 59702 125318 155348 166940
18673 166940 230510 244859 207867 168646 142902 139056 137710 156208 199097 234922 223249 222617
18661 222617 249978 253673 241293 235314 210053 161104 98551 38993 -12567 -173138 -301449
18650 -301449 -281434 -175460 -100441 -32708 26005 50711 35615 25657 49293 74241 77575 75605
18638 75605 96616 132045 135977 135615 165681 165637 159583 165328 156902 152418 157012 113540 6000 -177685
$$ packed form
18721D86976m2846l0024l8158k2239l2470j2602l2528j4131N310k060n3181J9996
18709B32043J8883k3709L695L9092J1149j0907n208J7254N934J75J3384n5588
18697B46197l3906k3167j7519k1812n2956k0364K3357J7926o028P901N6551L3109
18685B09289m708l0169m3732m5851p1601k0727J9193J111M6897O5616L0030J1592
18673A66940O3570J4349l6992l9221k5744l846j346J8498M2889L5825j1673o32
18661B22617K7361L695j2380n979k5261m8949o2553n9558n1560j60571j28311
18650c01449K0015J05974P5019O7733N8713K4706j5096r958K3636K4948L334j970
18638G5605K1011L5429L932l62L0066m4o054N745q426m484M594m3472j07540j83685
$$ plain form
18624 -177685 -278849 -254412 -195038 -142073 -92709 -42004 -14812 23819 58947 30273 9668
18613 9668 33380 42695 36642 37719 36489 48247 67988 60289 24335 25849 33844 38524 54772
18600 54772 46034 28754 6947 292 7237 18910 36453 73920 87326 111182 131802 120841
18588 120841 87531 96766 92949 58947 35025 50922 61235 46302 36208 17284 13667 -1754
18576 -1754 -33654 -12003 11404 4581 26189 24786 18959 14177 19031 51320 60076 45415 29911
18563 29911 28364 -4770 18089 48487 86280 75891 50320 36968 31383 33065 49064 81667
18551 81667 81691 43456 48003 79260 71145 51849 15746 9809 24292 26044 20515 34570 28861
18538 28861 28880 10262 5536 4605 22321 24337 -2177 -4555 18975 27756 -19933 -30463 -12754
$$ packed form
18624a77685j01164K4437N9374N2965M9364N0705K7192L8631L5128k8674k0605
18613I668K3712R315o053J077j230J1758J9741p699l5954J514P995M680J6248
18600E4772q738j7280k1807o655O945J1673J7543L7467J3406K3856K0620j0961
18588A20841l3310R235l817l4002k3922J5897J0313j4933j0094j8924l617j5421
18576a754l1900K1651K3407o823K1608j403n827m782M854L2289Q756j4661j5504
18563B9911j547l3134K2859L0398L7793j0389k5571j3352n585J682J5999L2603
18551H1667K4l8235M547L1257q115j9296l6103n937J4483J752n529J4055n709
18538B8861J9j8618m726r31J7716K016k6514k378K3530Q781m7689j0530J7709
$$ plain form
18525 -12754 31082 47297 34757 31199 31880 61422 60534 49827 45669 51633 73996 78702 58287
18512 58287 43576 36953 25432 13687 2626 -17155 -6549 -1396 25307 53773 62700 83908
18500 83908 99548 86316 61066 54705 71371 35647 11232 51584 39596 35144 44240 42813
18488 42813 61712 66479 36821 28047 28368 20779 1273 -4696 -14500 -45352 -28875 -1771 1559
18475 1559 -4903 24357 36889 54829 75678 57079 14131 -16788 -24909 -10532 9143 2251
18463 2251 -17909 -5315 2324 -4943 342 16525 45732 76873 56607 57787 21338 -8020 -19470
18450 -19470 27146 29320 10547 33487 25304 14240 63829 85109 87648 58742 11726 4498
18438 4498 23362 44262 70028 45171 -5144 -43450 -54739 -26054 4848 20987 21357 17022
$$ packed form
18525a2754M3836J6215j2540l558O81K9542q88j0707m158N964K2363M706k0415
18512E8287j4711o623j1521j1745j1061j9781J0606N153K6703K8466Q927K1208
18500H3908J5640j3232k5250o361J6666l5724k4415M0352j1988m452R096j427
18488D2813J8899M767k9658q774L21p589j9506n969r804l0852J6477K7104L330
18475A559o462K9260J2532J7940K0849j8599m2948l0919q121J4377J9675o892
18463B251k0160J2594P639p267N285J6183K9207L1141k0266J180l6449k9358j1450
18450a9470M6616K174j8773K2940q183j1064M9589K1280K539k8906m7016p228
18438D498J8864K0900K5766k4857n0315l8306j1289K8685L0902J6139L70m335
$$ plain form
18426 17022 17339 -39600 -45297 -20941 -12761 13778 26031 19250 36348 40373 28802 35681 28540
18413 28540 19273 14859 -18821 -32452 -13157 7775 24432 29525 27923 46142 68171 85370
18401 85370 76988 76837 72853 46630 63553 81253 71414 46313 49379 35217 43732 64327 60945
18388 60945 58809 42296 44749 34342 29329 22287 32515 47933 76668 111365 131878 143030
18376 143030 125585 120104 128278 127635 100046 101550 105838 106062 99031 122171 121818 110943 112851 99789
18362 99789 101548 118643 118677 140067 127696 113669 125858 119211 107152 99032 82763 80831 106491
18349 106491 127980 132894 127515 117703 87101 76393 105045 122477 127952 138306 112878 99347
18337 99347 100140 88064 76731 107248 116717 116586 123552 161227 184021 198309 228043 298937 393241
$$ packed form
18426A7022L17n6939n697K4356Q180K6539J2253o781J7098M025j1571O879p141
18413B8540r267m414l3680j3631J9295K0932J6657N093j602J8219K2029J7199
18401H5370q382j51l984k6223J6923J7700r839k5101L066j4162Q515K0595l382
18388F0945k136j6513K453j0407n013p042J0228J5418K8735L4697K0513J1152
18376A43030j7445n481Q174o43k7589J504M288K24p031K3140l53j0875J908j3062
18362I9789J759J7095L4K1390j2371j4027J2189o647j2059q120j6269j932K5660
18349A06491K1489M914n379r812l0602j0708K8652J7432N475J0354k5428j3531
18337I9347P93j2076j1333L0517R469j31O966L7675K2794J4288K9734P0894R4304
$$ plain form
18324 393241 574956 924488 1408564 1602364 1468063 1198839 864881 603652 462219 407662
18314 407662 342221 255735 215351 172524 163952 178435 162143 179249 180555 189670 189411 198547 233106
18301 233106 287889 333533 402236 518257 732632 1144982 1738395 1996898 1852985 1535074
18291 1535074 1145898 802603 564492 438574 390423 367181 402996 537478 727059 754664
18281 754664 678524 532790 395568 280170 204913 167589 173210 139843 112132 113894 90823
18270 90823 91555 96361 103280 92025 86205 95271 97222 105379 120806 116759 113999 108087 95088 107083
18256 107083 107930 114017 106743 98076 92392 107338 125225 163942 185310 212864 255151 333166 484270
18243 484270 765957 1226442 1438202 1305457 1085378 789374 538508 395280 323005 272376
$$ packed form
18324C93241J81715L49532M84076J93800j34301k69224l33958k61229j41433n4557
18314D07662o5441q6486m0384m2827q572J4483j6292J7106J306R115k59R136L4559
18301B33106N4783M5644O8703J16021K14375M12350N93413K58503j43913l17911
18291A535074l89176l43295k38111j25918m8151k3242L5815J34482J89581K7605
18281G54664p6140j45734j37222j15398p5257l7324N621l3367k7711J762k3071
18270I0823P32M806O919j1255n820R066J951Q157J5427m047k760n912j2999J1995
18256A07083Q47O087p274q667n684J4946J7887L8717K1368K7554M2287P8015J51104
18243D84270K81687M60485K11760j32745k20079k96004k50866j43228p2275n0629
$$ plain form
18233 272376 249225 215826 221292 218030 201837 185858 161669 159468 160761 181684 189987 233263
18221 233263 248605 253158 327828 454071 675747 1068887 1522033 1610089 1441658 1155973
18211 1155973 850519 581331 402017 301434 273493 233995 230713 216572 184371 172130 152820
18200 152820 94865 57343 73605 110141 117298 102769 85333 62244 63710 68561 77393 95029
18188 95029 107476 79085 69354 64280 73824 85549 89050 63314 52256 55837 52342 62491 70347
18175 70347 105244 141938 140846 145270 135581 116214 105909 112694 114154 123073 122910 144405 128964
18162 128964 138680 144516 142096 123210 96888 108771 109072 117685 121792 162814 179297 146482 153426
18149 153426 175253 166402 174826 173545 173308 184952 208443 213552 203179 204083 215765 226794 238315
$$ packed form
18233B72376k3151l3399N466l262j6193j5979k4189k201J293K0923Q303M3276
18221B33263J5342M553P4670J26243K21676L93140M53146Q8056j68431k85685
18211A155973l05454k69188j79314j00583k7941l9498l282j4141l2201j2241j9310
18200A52820n7955l7522J6262L6536P157j4529j7436k3089J466M851Q832J7636
18188I5029J2447k8391r731n074R544J1725L501k5736j1058L581l495J0149P856
18175G0347L4897L6694j092M424r689j9367j0305O785J460Q919j63K1495j5441
18162A28964R716N836k420j8886k6322J1883L01Q613M107M1022J6483l2815O944
18149A53426K1827q851Q424j281k37J1644K3491N109j0373R04J1682J1029J1521
$$ plain form
18136 238315 266905 291129 312010 357447 384340 397643 393669 425717 440108 477944 510967 561050
18124 561050 607712 650532 727470 797589 884606 990190 1163260 1390844 1649941 1926776
18114 1926776 2276569 2750017 3349473 4213251 5534861 7587996 10999111 17464552 30258242
18105 30258242 44924959 44432051 38218152 28596890 18776713 11892871 8033166 5726424
18097 5726424 4163744 3069267 2266270 1711197 1373662 1172487 1016146 909890 825214
18088 825214 736798 657608 572458 515624 489026 434348 371964 341643 317716 313720 318555 311419
18076 311419 293251 293374 278912 257938 219393 240808 221928 193779 197599 205465 196639 219966
18064 219966 230443 228901 226954 261471 284128 276124 248794 212284 169137 171774 191711 203700
$$ packed form
18136B38315K8590K4224K0881M5437K6893J3303l974L2048J4391L7836L3023N0083
18124E61050M6662M2820P6938P0119Q7017J05584J73070K27584K59097K76835
18114A926776L49793M73448N99456Q63778J321610K053135L411115O465441J2793690
18105C0258242J4666717m92908o213899r621262r820177o883842l859705k306742
18097E726424j562680j094477q02997n55073l37535k01175j56341j06256q4676
18088H25214q8416p9190q5150n6834k6598n4678o2384l0321k3927l996M835p136
18076C11419j8168J23j4462k0974l8545K1415j8880k8149L820P866q826K3327
18064B19966J0477j542j947L4517K2657q004k7330l6510m3147K637J9937J1989
$$ plain form
18052 203700 211046 220961 198073 174433 173062 157398 146179 131349 107214 92076 86170 82987
18040 82987 104718 150337 159235 166453 161334 182034 189426 185704 199835 249299 312110 363316 450488
18027 450488 624205 862441 1014332 956004 832437 657435 521921 485478 435305 354027
18017 354027 319355 292001 257825 242993 249381 270164 285130 249952 244774 231258 225774 273812
18005 273812 330991 357010 393380 509333 725605 900871 872804 805054 697114 624275 621497
17994 621497 784731 947562 872545 745182 574393 428196 339621 280455 262186 241355
17984 241355 225290 205955 185206 181093 191614 210162 250391 243244 225572 204976 203556 211032
17972 211032 242556 315968 462873 679662 866739 824596 716360 566322 405833 336820
$$ packed form
18052B03700P346R915k2888k3640j371j5664j1219j4830k4135j5138n906l183
18040H2987K1731M5619Q898P218n119K0700P392l722J4131M9464O2811N1206Q7172
18027D50488J73717K38236J51891n8328j23567j75002j35514l6443n0173q1278
18017C54027l4672k7354l4176j4832O388K0783J4966l5178n178j3516n484M8038
18005B73812N7179K6019L6370J15953K16272J75266k8067o7750j07940p2839k778
17994F21497J63234J62831p5017j27363j70789j46197q8575n9166j8269k0831
17984B41355j6065j9335k0749m113J0521J8548M0229p147j7672k0596j420P476
17972B11032L1524P3412J46905K16789J87077m2143j08236j50038j60489o9013
$$ plain form
17962 336820 281212 224282 201102 179761 151729 152785 136527 87353 90844 93442 112937 118527
17950 118527 92416 35882 35048 76954 127329 154464 214234 276495 318187 304672 269199 237087
17938 237087 189136 171339 148079 147203 154087 150758 134556 144983 156695 157714 156515 144988 129504
17925 129504 121528 157206 164229 168217 242728 332666 412225 516950 571948 491479 411419 269732
17913 269732 156936 151182 183376 186731 199377 192934 161196 160889 138906 130555 125267 135980 169175
17900 169175 201798 214426 209953 211843 227848 269689 308205 329408 392350 517693 553257 474344
17888 474344 451379 355499 290854 283844 292265 276956 234488 192404 177007 163686 148307 138595
17876 138595 157673 193482 212854 212480 245651 273741 261740 231500 231661 308007 337323 360128
$$ packed form
17962C36820n5608n6930k3180k1341k8032J056j6258m9174L491K598J9495N590
17950A18527k6111n6534q34M1906N0375K7135N9770O2261M1692j3515l5473l2112
17938B37087m7951j7797k3260q76O884l329j6202J0427J1712J019j199j1527j5484
17925A29504p976L5678P023L988P4511Q9938P9559J04725N4998q0469q0060j41687
17913B69732j12796n754L2194L355J2646o443l1738l07k1983q351n288J0713L3195
17900A69175L2623J2628m473J890J6005M1841L8516K1203O2942J25343L5564p8913
17888D74344k2965r5880o4645p010Q421j5309m2468m2084j5397j3321j5379r712
17876A38595J9078L5809J9372l74L3171K8090j2001l0240J61P6346K9316K2805
$$ plain form
17864 360128 404360 407897 395365 429659 486488 530345 556387 587268 569132 523090 451015 408288
17852 408288 375668 395537 432626 490102 507113 489606 473276 457658 440952 407848 395571
17841 395571 391192 392981 387564 370471 413486 450551 518704 600200 639361 666423 676002 691037
17829 691037 694644 691312 727800 767554 800275 800284 770008 747708 685779 640055 646177 660814 660878
17816 660878 675157 718190 728432 756553 811033 839512 890935 938536 1007960 1044602 1063024
17805 1063024 1118001 1224715 1367149 1579294 1949545 2578965 2974834 2893414 2658513 2311836
17795 2311836 2060016 1955808 1957183 1995629 2051286 2136603 2234295 2362973 2508568 2731093
17785 2731093 3017190 3261950 3513542 3820867 4221913 4602060 4973103 5572561 6439977
$$ packed form
17864C60128M4232L537j2532L4294N6829M3857K6042L0881j8136m6042p2075m2727
17852D08288l2620J9869L7089N7476J7011j7507j6330j5618j6706l3104j2277
17841C95571m379J789n417j7093M3015L7065O8153Q1496L9161K7062R579J5035
17829F91037L607l332L6488L9754L2721Rl0276k2300o1929m5724O122J4637O4
17816F60878J4279M3033J0242K8121N4480K8479N1423M7601O9424L6642J8422
17805A063024N4977J06714J42434K12145L70251O29420L95869q1420k34901l46677
17795B311836k51820j04208J375L8446N5657Q5317R7692J28678J45595K22525
17785B731093K86097K44760K51592L07325M01046L80147L71043N99458Q67416
$$ plain form
17776 6439977 7646271 8890368 10224150 11887908 13342676 14817256 16806880 19592691
17768 19592691 23493570 29408023 38523306 52095066 74908549 118455921 202209787
17761 202209787 282247708 269289743 229638612 169585593 111546749 72743767 51461474
17754 51461474 39016647 30625144 24461202 20090470 17361029 16105496 15553830 15522496
17746 15522496 16109112 17288128 18553960 20294268 22715597 26346434 32363265 41810798
17738 41810798 56598906 82839724 134517238 224693556 271530055 245056701 200026916
17731 200026916 140384713 89591310 58828106 41782211 31336685 23945298 18525839
17724 18525839 14597013 12037186 10129270 8710578 7618279 6938675 6471706 5712694
$$ packed form
17776F439977J206294J244097J333782J663758J454768J474580J989624K785811
17768A9592691L900879N914453R115283J3571760K2813483M3547372Q3753866
17761B02209787Q0037921j2957965l9651131o0053019n8038844l8802982k1282293
17754E1461474j2444827q391503o163942m370732k729441j255533n51666l1334
17746A5522496N86616J179016J265832J740308K421329L630837O016831R447533
17738D1810798J4788108K6240818N1677514R0176318M6836499k6473354m5029785
17731B00026916n9642203n0793403l0763204j7045895j0445526p391387n419459
17724A8525839l928826k559827j907916j418692j092299o79604m66969p59012
$$ plain form
17716 5712694 4903651 4071851 3409019 2930519 2556492 2296823 2131840 1981300 1876378
17707 1876378 1777361 1665701 1575641 1479754 1411939 1422791 1450099 1446910 1489976 1626516 1910901
17696 1910901 2198711 2081302 1876179 1580740 1325476 1128798 984178 888029 764907 672974
17686 672974 614101 583038 535937 537816 542771 513798 478178 470950 454850 444440 418928 384687
17674 384687 360072 333262 313696 295026 303683 324104 304922 262754 234050 218735 184535 191058
17662 191058 215468 228341 251672 212358 193215 192716 172472 182461 206902 208897 200960 179835
17650 179835 128004 108297 114267 93292 70153 55209 59713 60305 54174 105111 114840 109779 90764
17637 90764 53673 24061 -33408 -79651 -87576 -96143 -69255 5006 53729 80623 129856 136334
$$ packed form
17716E712694q09043q31800o62832m78500l74027k59669j64983j50540j04922
17707A876378r9017j11660r0060r5887o7815J0852K7308l189M3066J36540K84385
17696A910901K87810j17409k05123k95439k55264j96678j44620r6149j23122r1933
17686F72974n8873l1063m7101J879M955k8973l5620p228j6100j0410k5512l4241
17674C84687k4615k6810j9566j8670Q657K0421j9182m2168k8704j5315l4200O523
17662A91058K4410J2873K3331l9314j9143m99k0244R989K4441J995p937k1125
17650A79835n1831j9707N970k0975k3139j4944M504N92o131N0937R729n061j9015
17637I0764l7091k9612n7469m6243p925q567K6888P4261M8723K6894M9233O478
$$ plain form
17625 136334 121745 102785 107933 127382 145972 141683 157827 186650 202704 221834 238555 228117
17613 228117 242175 210575 168755 114161 87313 43317 -27746 -168609 -328598 -333376 -218656
17602 -218656 -147201 -87691 -23187 -31022 -22596 9711 44021 79323 86127 100647 109359 83392
17590 83392 110414 128792 171827 209076 258147 280559 242541 236510 196701 115024 32141 -157529
17578 -157529 -319267 -363390 -316475 -257047 -184842 -110063 -75372 -36789 9226 7397 -28940
17567 -28940 -23771 677 26793 66928 120108 183417 240587 232460 179760 139594 81182 26186
17555 26186 -30824 -62160 -48281 -42023 -19454 -24417 -24864 -14164 -20852 -6205 13496 61126 78297
17542 78297 41451 47259 62620 43207 41297 24551 8380 11592 5455 -7505 -22417 -24131 -40578
$$ packed form
17625A36334j4589j8960N148J9449J8590m289J6144K8823J6054J9130J6721j0438
17613B28117J4058l1600m1820n4594k6848m3996p1063j40863j59989m778J14720
17602b18656P1455N9510O4504p835Q426L2307L4310L5302O804J4520Q712k5967
17590H3392K7022J8378M3035L7249M9071K2412l8018o031l9809q1677q2883j89670
17578a57529j61738m4123M6915N9428P2205P4779L4691L8583M6015j829l6337
17567b8940N169K4448K6116M0135N3180O3309N7170q127n2700m0166n8412n4996
17555B6186n7010l1336J3879O258K2569m963m47J0700o688J4647J9701M7630J7171
17542G8297l6846N808J5361j9413j910j6746j6171L212o137j2960j4912j714j6447
$$ plain form
17529 -40578 -28455 -51426 -45503 -20716 3438 36914 46447 43766 20197 4223 -12485 -14785
17517 -14785 -2481 22265 31854 34066 47256 52566 39607 39531 53186 63807 78251 62817 35774
17504 35774 -2091 1684 6983 -11340 4645 22735 5429 -18290 -14842 11670 9890 10526 11013
17491 11013 -5624 -19669 -22099 -19332 -7546 -18072 -22337 -3301 14397 29004 21098 8258
17479 8258 1241 -5083 12779 -2324 -301 -10018 -7227 -620 384 16794 12913 15659 17464 16123
17465 16123 -11590 -58714 -51971 -22351 -28732 -56788 -55163 -43956 -28194 3497 36179 62852
17453 62852 73185 76251 78380 55025 40385 26493 17297 28505 43312 39028 24909 43080
17441 43080 86817 139411 227958 270920 241771 193892 129962 78195 50103 31113 21962 36926
$$ packed form
17529d0578J2123k2971N923K4787K4154L3476R533k681k3569j5974j6708k300
17517a4785J2304K4746R589K212J3190N310j2959p6J3655J0621J4444j5434k7043
17504C5774l7865L775N299j8323J5985J8090j7306k3719L448K6512j780O36M87
17491A1013j6637j4045k430K767J1786j0526m265J9036J7698J4607p906j2840
17479H258p017o324J7862j5103K023r717K791O607J004J6410l881K746J805j341
17465A6123k7713m7124O743K9620o381k8056J625J1207J5762L1691L2682K6673
17453F2852J0333L066K129k3355j4640j3892r196J1208J4807m284j4119J8171
17441D3080M3737N2594Q8547M2962k9149m7879o3930n1767k8092j8990r151J4964
$$ plain form
17429 36926 103431 204840 327732 364375 336397 268623 187325 93164 26003 4835 6900
17418 6900 -6097 -18276 -11193 -12574 -3654 6735 -15377 -38773 -25494 -7420 6083 1262 -13591
17405 -13591 11544 40035 118598 158529 134180 109985 43964 -6023 -19057 1726 -7140 -15638
17393 -15638 -12831 -8384 -22077 -47160 -51787 -43850 -46546 -46686 -29293 -23860 -10454 -16561 -18653 -31609
17379 -31609 -38520 -47190 -36543 -30575 -37264 -31401 -21081 -35660 -2869 28078 18005 -8000 -28787
17366 -28787 -23949 750 12949 10840 4783 -6927 -31147 -44234 -25448 -2410 -8998 -36203
17354 -36203 -60017 -47662 -25138 -35770 -71988 -75354 -67409 -59347 -32695 -21554 -49699 -54189
17342 -54189 -83534 -65167 -27563 -24637 -32412 -2589 2453 16499 -14380 -39617 -33687 -4837
$$ packed form
17429C6926O6505J01409J22892L6643k7978o7774q1298r4161o7161k1168K065
17418F900j2997j2179P083j381Q920J0389k2112k3396J3279J8074J3503m821j4853
17405a3591K5135K8491P8563L9931k4349k4195o6021m9987j3034K0783q866q498
17393a5638K807M447j3693k5083m627P937k696j40J7393N433J3406o107k092j2956
17379c1609o911q670J0647N968o689N863J0320j4579L2791L0947j0073k6005k0787
17366b8787M838K4699J2199k109o057j1710k4220j3087J8786K3038o588k7205
17354c6203k3814J2355K2524j0632l6218l366P945Q062K6652J1141k8145m490
17342e4189k9345J8367L7604K926p775K9823N042J4046l0879k5237N930K8850
$$ plain form
17330 -4837 1385 -15443 -33470 -42622 -56574 -54543 -44858 -39806 -33422 -22281 -1625 2260 -11883
17317 -11883 -25700 -37567 -30704 -8860 -8364 -21389 -5564 -10478 -27831 -49663 -67898 -47131
17305 -47131 -46403 -53684 -48824 -50981 -16125 -22467 -41233 -35068 -28595 -12977 18745 15961 2463
17292 2463 677 -9098 -1066 -10681 3543 5053 -11373 -58979 -61750 -53320 -48585 -48920 -25078 -22498
17278 -22498 -16404 8954 29471 16283 19753 -21735 -51007 -31935 -19608 -1573 -8757 -25596
17266 -25596 3326 -4603 -37230 -53018 -72493 -73630 -49631 -63930 -88549 -70197 -49427 -41024
17254 -41024 -22212 5829 24832 24840 6816 -6111 -22817 -41774 -26729 -21392 -11555 4753 -10965
17241 -10965 -20123 -6268 -430 -6733 10794 25280 31300 29646 41218 45054 66152 48445 14603
$$ packed form
17330d837O222j6828j8027r152j3952K031R685N052O384J1141K0656L885j4143
17317a1883j3817j1867O863K1844M96j3025J5825m914j7353k1832j8235K0767
17305d7131P28p281M860k157L4856o342j8766O165O473J5618L1722k784j3498
17292B463j786r775Q032r615J4224J510j6426m7606k771Q430M735l35K3842K580
17278b2498O094K5358K0517j3188L470m1488k9272J9072J2327J8035p184j6839
17266b5596K8922p929l2627j5788j9475j137K3999j4299k4619J8352K0770Q403
17254d1024J8812K8041J9003Qj8024j2927j6706j8957J5045N337R837J6308j5718
17241a0965r158J3855N838o303J7527J4486O020j654J1572L836K1098j7707l3842
$$ plain form
17228 14603 -7502 -15330 4179 16216 7535 -6701 -22433 -31521 -470 -3955 -11951 1819 25812
17215 25812 9112 24156 24192 20039 14153 15330 2830 -2173 33687 47864 53198 51900 78322
17202 78322 92966 86857 90790 128155 200732 316627 543160 943679 1364464 1408960 1230377
17191 1230377 919843 620943 403590 271113 183026 137964 123552 100349 77676 46639
17181 46639 49650 48406 41341 58387 68575 78192 113949 145560 187296 224136 267187 391816
17169 391816 654946 1066453 1361924 1292313 1086871 795956 535272 361100 260171 175581
17159 175581 88621 78011 69134 42971 35614 23083 35378 31942 15170 -19532 -48143 -44574
17147 -44574 -15076 -12023 -18655 -26294 -34933 -52186 -40556 -26219 17788 28636 6306 -2524 -13587
$$ packed form
17228A4603k2105p828J9509J2037q681j4236j5732r088L1051l485p996J3770K3993
17215B5812j6700J5044L6m153n886J177j2500n003L5860J4177N334j298K6422
17202G8322J4644o109L933L7365P2577J15895K26533M00519M20785M4496j78583
17191A230377l10534k98900k17353j32477q8087m5062j4412k3203k2673l1037
17181D6639L011j244p065J7046J0188R617L5757L1611M1736L6840M3051J24629
17169C91816K63130M11507K95471o9611k05442k90915k60684j74172j00929q4590
17159A75581q6960j0610q877k6163p357j2531J2295l436j6772l4702k8611L569
17147d4574K9498L053o632p639q639j7253J1630J4337M4007J0848k2330q830j1063
$$ plain form
17134 -13587 -25286 -50955 -59252 -53148 -25203 -4420 -19073 -40783 -37104 -22008 -16643 -38627
17122 -38627 -57450 -51637 -66038 -56561 -34891 4362 -8363 -34075 -37631 -42578 -47706 -37333 -26862
17109 -26862 -37958 -45219 -21883 9916 17882 30283 -4997 -45827 -76718 -71143 -39664 -19295
17097 -19295 -2635 13887 23490 14673 25912 31172 7366 -41057 -53060 -41461 -34105 -47355
17085 -47355 -63350 -62636 -58456 -35676 -43935 -38398 4476 19267 2416 -10888 -13289 -5412 36776
17072 36776 17588 1938 -9231 -26367 -29617 -3136 9489 10401 -767 -1010 -11190 -31854 -20164
17059 -20164 -20625 1499 -5085 -12239 -24736 -59442 -55701 -21522 -15500 -17650 -18100 -48360 -61323
17046 -61323 -24532 506 -9432 -8020 -5265 -19116 -12380 -21657 -9117 -16499 -32258 -33499 -34431
$$ packed form
17134a3587j1699k5669q297O104K7945K0783j4653k1710L679J5096N365k1984
17122c8627j8823N813j4401R477K1670L9253j2725k5712l556m947n128J0373J0471
17109b6862j1096p261K3336L1799P966J2401l5280m0830l0891N575L1479K0369
17097a9295J6660J6522R603q817J1239N260k3806m8423j2003J1599P356j3250
17085d7355j5995P14M180K2780q259N537M2874J4791j6851j3304k401P877M2188
17072C6776j9188j5650j1169j7136l250K6481J2625R12j1168k43j0180k0664J1690
17059b0164m61K2124o584p154j2497l4706L741L4179O022k150m50l0260j2963
17046f1323L6791K5038r938J412K755j3851O736r277J2540p382j5759j241r32
$$ plain form
17033 -34431 -9545 2521 -19795 -31347 -4599 -7021 -18075 -39528 -39921 -38130 -45246 -41254 -28840
17020 -28840 -1029 15468 8072 -12132 19226 2929 -20049 -32022 -38025 -57286 -60602 -36413
17008 -36413 -14114 -24740 -37886 -23994 -11282 -27788 -23103 -39401 -41990 -35431 -28100 -37767 -42872
16995 -42872 -36078 -38401 -26333 -9777 28868 28250 20394 1544 -18549 -44536 -58059 -84832 -75381
16982 -75381 -50390 -46668 -34182 -17432 6188 4021 -16518 -7598 -2138 -2197 -5501 -12146 -29872
16969 -29872 -35275 -39207 -54276 -53880 -37515 -32481 -57655 -68146 -63520 -73234 -62913 -28686 -18543
16956 -18543 -7288 -23766 -24417 8945 1947 -21016 -24455 -19983 -26981 -55664 -27205 691 283
16943 283 -23926 -47038 -53959 -51825 -53388 -26658 -596 22319 30731 -391 -2704 -6464 -4463
$$ packed form
17033c4431K4886J2066k2316j1552K6748k422j1054k1453l93J791p116L992J2414
17020b8840K7811J6497p396k0204L1358j6297k2978j1973o003j9261l316K4189
17008c6413K2299j0626j3146J3892J2712j6506M685j6298k589O559P331r667n105
16995d2872O794k323J2068J6556L8645o18p856j8850k0093k5987j3523k6773R451
16982g5381K4991L722J2486J6750K3620k167k0539Q920N460n9l304o645j7726
16969b9872n403l932j5069L96J6365N034k5174j0491M626r714J0321L4227J0143
16956a8543J1255j6478o51L3362o998k2963l439M472o998k8683K8459K7896m08
16943B83k4209k3112o921K134j563K6730K6062K2915Q412l1122k313l760K001
$$ plain form
16930 -4463 -9057 -25071 -37912 -29337 -4871 5206 26909 16756 3851 -1380 20040 336
16918 336 -38145 -52667 -26475 -583 -8161 -20562 -26220 -12608 10412 7542 -12980 23170 15377
16905 15377 -6551 -16973 -5561 -24689 -14594 17117 13511 -8357 -34041 -43400 -29168 -780
16893 -780 3493 -2123 10587 5468 35403 48989 38885 27423 8202 7184 7566 -7680 -29186
16880 -29186 -41572 -57547 -58902 -29567 -23675 -44166 -44401 -43933 -46040 -71192 -45128 -21274 -40636
16867 -40636 -46449 -24089 -17211 -21119 -37445 -44546 -36812 -21675 -26433 -7907 -1055 14841 -1950
16854 -1950 -13861 -27015 -61309 -80846 -75511 -45239 -6287 4537 -3403 -7995 -5064 -12705 -23099
16841 -23099 -21634 -16985 -15227 -24226 -36176 -32563 1286 1766 -4876 19079 13610 -6564 -5485 -37278
$$ packed form
16930d463m594j6014j2841Q575K4466J0077K1703j0153j2905n231K1420j9704
16918C36l8481j4522K6192K5892p578j2401n658J3612K3020k870k0522L6150p793
16905A5377k1928j0422J1412j9128J0095L1711l606k1868k5684r359J4232K8388
16893g80M273n616J2710n119K9935J3586j0104j1462j9221j018L82j5246k1506
16880b9186j2386j5975j355K9335N892k0491k35M68k107k5152K6064K3854j9362
16867d0636n813K2360O878l908j6326p101P734J5137m758J8526O852J5896j6791
16854a950j1911j3154l4294j9537N335L0272L8952J0824p940m592K931p641j0394
16841b3099J465M649J758q999j1950L613L3849M80o642K3955n469k0174J079l1793
$$ plain form
16827 -37278 -43286 -20981 -6905 -18220 -10964 -14669 -18768 -4772 7829 -2022 -13096 -3949 -4810
16814 -4810 -12191 -21058 14924 36526 29768 32122 32309 25659 12936 -18435 3650 22306 -10858
16801 -10858 -37937 -32417 -38902 -61503 -66053 -75131 -54328 -17073 -24756 -26907 -37266 -40453 -28022
16788 -28022 -10031 3114 10877 -7708 -35620 -18294 -4692 2324 -19682 -36644 -46716 -32271
16776 -32271 -8181 29142 18659 -826 -4162 -5875 -3087 -16761 -33142 -17592 -10766 5459
16764 5459 26998 39222 14185 -14506 -7028 -22862 -35474 -47452 -46451 -47355 -28502 -29381 -31685
16751 -31685 -30190 -23992 6076 28 -6712 -16100 -21362 -14922 -29448 -33889 -69714 -87850 -56330
16738 -56330 -54509 -47792 -23150 -30191 -51273 -47506 -37941 -17652 -20064 -16836 393 -8596 -11253
$$ packed form
16827c7278o008K2305J4076j1315P256l705m099J3996J2601r851j1074R147q61
16814d810p381q867L5982K1602o758K354J87o650j2723l1371K2085J8656l3164
16801a0858k7079N520o485k2601m550r078K0803L7255p683k151j0359l187J2431
16788b8022J7991J3145P763j8585k7912J7326J3602P016k2006j6962j0072J4445
16776c2271K4090L7323j0483j9485l336j713K788j3674j6381J5550O826J6225
16764E459K1539J2224k5037k8691P478j5834j2612j1978J001r04J8853q79k304
16751c1685J495O198L0068o048o740r388n262O440j4526m441l5825j8136L1520
16738e6330J821O717K4642p041k1082L767R565K0289k412L228J7229q989k657
$$ plain form
16725 -11253 -7131 -13908 5067 17391 12113 -19615 -39849 -36774 -10346 17163 33047 7639
16713 7639 -1214 -28047 -49722 -37409 -12843 -96 33138 50944 26915 21146 30243 29332 15124
16700 15124 6735 4933 -14909 -37360 -58355 -81364 -48967 -31124 -32678 -22259 -30716 7594
16688 7594 28681 18890 10501 2158 -7265 -6811 -10545 -11519 6573 16673 30030 28346 19481 5604
16674 5604 -2834 -5345 8490 10063 -2538 -193 -22600 -35608 -27598 -25464 -31496 -25394 -44360
16661 -44360 -57946 -65249 -37226 -34274 -37518 -29494 -19667 -23419 -6299 -6835 -4261 -4694 -23275 2020
16647 2020 -60 -17190 -6812 22570 9118 -21582 -33957 -23226 -7087 -8655 10585 14454
16635 14454 23252 22053 27285 13589 -4749 -13480 -34584 -15866 6348 14481 11879 4919 -2706
$$ packed form
16725a1253M122o777J8975J2324n278l1728k0234L075K6428K7509J5884k5408
16713G639q853k6833k1675J2313K4566J2747L3234J7806k4029n769R097r11j4208
16700A5124q389j802j9842k2451k0995k3009L2397J7843j554J0419q457L8310
16688G594K1087r791q389q343r423M54l734r74J8092J0100J3357j684q865j3877
16674E604q438k511J3835J573j2601K345k2407j3008Q010K134o032O102j8966
16661d4360j3586p303K8023K952l244Q024R827l752J7120n36K574m33j8581K5295
16647B020k080j7130J0378K9382j3452l0700j2375J0731J6139j568J9240L869
16635A4454Q798j199N232j3696j8338q731k1104J8718K2214Q133k602o960p625
$$ plain form
16622 -2706 -8058 -9370 -1877 -24564 -39445 -32577 -41893 -46696 -25173 1831 16245 13084 -13086
16609 -13086 -24971 -37102 -19059 -6221 7272 16146 35535 44147 11815 1780 4300 -10398
16597 -10398 -13131 -10228 -26283 -30583 -33968 -46774 -32629 -34705 -15182 14167 36747 17568 9291
16584 9291 14926 8907 10458 22249 50807 49177 55385 36594 12651 -13156 -37626 -18617 13236
16571 13236 35744 40731 8061 -16490 -16783 -274 -7407 5256 -8747 -14170 -2121 -4544 4256
16558 4256 19117 13894 -11708 4836 26831 14394 -22152 630 22906 11370 13880 15243
16546 15243 9219 14172 -11675 -31228 -20575 -13502 -23901 -30949 -36239 -35861 -26497 -7374 -2453
16533 -2453 -9264 -5932 15014 3308 -10887 -13687 -13860 -14333 6396 -15386 -31881 -46269 -47466
$$ packed form
16622b706n352j312P493k2687j4881O868r316m803K1523K7004J4414l161k6170
16609a3086j1885j2131J8043J2838J3493Q874J9389Q612l2332j0035K520j4698
16597a0398k733K903j6055m300l385j2806J4145k076J9523K9349K2580j9179q277
16584I291N635o019J551J1791K8558j630O208j8791k3943k5807k4470J9009L1853
16571A3236K2508M987l2670k4551k93J6509p133J2663j4003n423J2049k423Q800
16558D256J4861n223k5602J6544K1995j2437l6546K2782K2276j1536K510J363
16546A5243o024M953k5847j9553J0653P073j0399p048n290L78R364J9123M921
16533b453o811L332K0946j1706j4195k800j73m73K0729k1782j6495j4388j197
$$ plain form
16520 -47466 -43365 -28093 -38471 -26260 -12479 -10514 -43009 -33314 -21459 -10496 -5594 13802
16508 13802 763 -27507 -30245 -20686 -22102 -17168 -23151 -35139 -42549 -50131 -35809 -61194 -53675
16495 -53675 -49464 -52808 -56643 -43115 -52613 -58809 -47991 -4084 21585 40139 26339 4981 -5528
16482 -5528 -4603 1223 -106 -21096 -23623 -34242 -45985 -52845 -64124 -50798 -51173 -54711 -31074 -42636
16468 -42636 -40592 -36732 -45140 -42335 -51552 -50589 -48728 -33322 -37060 -7184 5076 11669 -2793 -2572
16454 -2572 -15652 -3332 22544 38512 28820 13872 -2621 -15140 9594 9648 19040 21081 17831
16441 17831 40701 24941 8494 24593 21118 -9502 -17939 15489 38280 13166 -12050 670
16429 670 -23401 -26464 -24910 -3880 -560 -5100 908 22846 13867 -15095 -44827 -59549 -64375
$$ packed form
16520d7466M101J5272j0378J2211J3781J965l2495R695J1855J0963M902J9396
16508A3802j3039k8270k738R559j416M934n983j1988p410p582J4322k5385P519
16495e3675M211l344l835J3528r498o196J0818M3907K5669J8554j3800k1358j0509
16482e528R25N826j329k0990k527j0619j1743o860j1279J3326l75l538K3637j1562
16468d2636K044L860q408K805r217R63J861J5406l738K9876J2260O593j4462K21
16454b572j3080J2320K5876J5968r692j4948j6493j2519K4734N4R392K041l250
16441A7831K2870j5760j6447J6099l475l0620q437L3428K2791k5114k5216J2720
16429F70k4071l063J554K1030L320m540O008K1938q979k8962k9732j4722m826
$$ plain form
16416 -64375 -58197 -20723 736 -13733 -14664 -20961 -28023 -1985 85 -26637 -43152 -50584 -52040
16403 -52040 -49186 -37368 -16174 -19892 -39565 -31011 -4327 4725 -6197 -19309 -37363 -22842
16391 -22842 -12747 -27535 -29939 -21481 14773 8399 -26626 -22002 -19168 -33548 -21257 -21112 -35423
16378 -35423 -31610 -1105 26023 50 -14275 -8473 11583 33168 7787 -30601 -19941 -2141
16366 -2141 4443 367 -37615 -62949 -44073 -36339 -47993 -46887 -41891 -40625 -15524 9478 -12791
16353 -12791 -43523 -36484 -23016 -612 16216 4545 -14915 -17033 -2944 6732 5012 -25553
16341 -25553 -34439 -23143 -17503 -28192 -4678 7232 -9496 -16919 198 3675 -27870 -44427
16329 -44427 -27273 -20665 -19598 -28681 -26370 -8829 18073 28013 16169 5114 -8254 -5909 -15002
$$ packed form
16416f4375O178L7474K1459j4469r31o297p062K6038K070k6722j6515p432j456
16403e2040K854J1818K1194l718j9673Q554K6684R052j0922j3112j8054J4521
16391b2842J0095j4788k404Q458L6254o374l5025M624K834j4380J2291J45j4311
16378c5423L813L0505K7128k5973j4325N802K0056K1585k5381l8388J0660J7800
16366b141O584m076l7982k5334J8876P734j1654J106M996J266K5101K5002k2269
16353a2791l0732P039J3468K2404J6828j1671j9460k118J4089R676j720l0565
16341b5553q886J1296N640j0689K3514J1910j6728p423J7117L477l1545j6557
16329d4427J7154O608J067r083K311J7541K6902R940j1844j1055j3368K345r093
$$ plain form
16316 -15002 -16971 -8561 -6415 6983 -13575 -31757 -26546 -11427 -14591 -33140 -38715 -64295 -77743
16303 -77743 -60030 -47463 -47396 -31663 -6934 1898 -5913 -24865 -30211 -9672 8433 19858 6145
16290 6145 -17277 -37668 -19943 -16112 -12613 -13953 -25911 -17347 -14062 -28050 -21171 -3306 -10373
16277 -10373 -16208 8575 13781 17917 6477 5511 5628 818 -19599 -24784 -39222 -22223 -4728
16264 -4728 -4014 2400 -2612 -43263 -40656 -26879 -543 -9517 -15900 2273 -11765 -14971 -18700 -37647
16250 -37647 -36545 -30866 -20343 -15034 -8419 1523 1628 -9411 -37544 -51197 -16229 1131 -11960
16237 -11960 -4331 31582 19603 15422 21037 13807 -14557 -25840 -18766 17057 20241 25380 29123
16224 29123 14935 -17030 -16558 -4525 -7338 -9812 -15351 -8931 -4932 15393 30851 2496 -11228
$$ packed form
16316a5002j969Q410K146J3398k0558j8182N211J5119l164j8549n575k5580j3448
16303g7743J7713J2567O7J5733K4729Q832p811j8952n346K0539J8105J1425j3713
16290F145k3422k0391J7725L831L499j340j1958Q564L285j3988O879J7865p067
16277a0373n835K4783N206M136j1440r66J17m810k0417n185j4438J6999J7495
16264d728P14O414n012m0651K607J3777K6336q974o383J8173j4038l206l729j8947
16250c7647J102N679J0523N309O615R942J05j1039k8133j3653L4968J7360j3091
16237a1960P629L5913j1979m181N615p230k8364j1283P074L5823L184N139L743
16224B9123j4188l1965M72J2033k813k474n539O420L999K0325J5458k8355j3724
$$ plain form
16211 -11228 -6091 -7092 -6140 -6479 -25035 -44923 -34840 -23137 -18108 -46168 -48832 -40680 -24924
16198 -24924 -24636 -25180 -35878 -17609 -2895 -10782 -555 -16230 -9421 -16843 -14584 -18806 -22904 -19560
16184 -19560 -4704 28880 34703 16721 124 15553 24000 24217 25350 15085 10948 2628 5098
16171 5098 -5258 -5393 -2095 -2153 -8045 3289 9178 24622 16724 -2500 -37422 -27963 -7549 1850
16157 1850 10160 2256 1757 -1049 -157 -7243 -9779 -23413 -17937 17468 13229 -2028 -35049 -43630
16143 -43630 -54679 -63584 -44457 -65291 -58233 -31121 -5639 -17261 -24208 -35939 -40221 -29082
16131 -29082 -39830 -52272 -43376 -29078 -11903 2046 15080 -7764 -15711 -24464 -45988 -35331
16119 -35331 -7990 -31789 -29749 -16749 -15212 -27391 -19554 -28863 -26875 -17198 -51195 -77362 -75047
$$ packed form
16211a1228N137j001R52l39j8556j9888J0083J1703N029k8060k664Q152J5756
16198b4924K88n44j0698J8269J4714p887J0227j5675O809p422K259m222m098L344
16184a9560J4856L3584N823j7982j6597J5429Q447K17J133j0265m137q320K470
16171E098j0356j35L298n8n892J1334N889J5444p898j9224l4922R459K0414R399
16157A850Q310p904m99k806Q92p086k536j3634N476L5405m239j5257l3021q581
16143d3630j1049q905J9127k0834P058K7112K5482j1622o947j1731m282J1139
16131b9082j0748j2442Q896J4298J7175J3949J3034k2844p947q753k1524J0657
16119c5331K7341k3799K040J3000J537j2179P837r309J988R677l3997k6167K315
$$ plain form
16106 -75047 -64037 -68982 -58843 -43362 -29516 -37382 -60849 -47191 -26948 -25005 -28521 -22062 -6749
16093 -6749 3586 10280 22035 15628 21609 6438 -16883 -11328 -6816 1489 24766 30778 631
16080 631 -17742 4588 16779 -1127 13339 36129 21559 -14156 -29954 -42634 -19001 -24680
16068 -24680 -1245 9758 -3392 -36494 -24033 -13303 -30851 -40448 -35134 -23565 -10694 -6792
16056 -6792 -683 -3371 -6553 -28646 -58052 -38946 -23045 -11762 24187 46932 11304 5233 -12086
16043 -12086 10771 27048 20303 12105 -13877 -8378 -14235 -45282 -27407 -3154 -5216 -26492 -25591
16030 -25591 -23923 -16586 -9696 -18564 -1587 28518 25971 13513 6138 8374 -9929 -7989 -21571
16017 -21571 -28299 -23497 -15753 -18172 -7166 -11344 -32433 -23917 4252 30273 31755 20552 20725
$$ packed form
16106g5047J1010m945J0139J5481J3846p866k3467J3658K0243J943l516O459J5313
16093f749J0335O694J1755o407N981j5171k3321N555M512Q305K3277O012l0147
16080F31j8373K2330J2191j7906J4466K2790j4570l5715j5798j2680K3633n679
16068b4680K3435J1003j3150l3102J2461J0730j7548r597N314J1569J2871L902
16056f792O109k688l182k2093k9406J9106J5901J1283L5949K2745l5628o071j7319
16043a2086K2857J6277o745q198k5982N499n857l1047J7875K4253k062k1276R01
16030b5591J668P337O890q868J6977L0105k547j2458p375K236j8303J940j3582
16017b1571o728M802P744k419J1006m178k1089Q516K8169K6021J482j1203J73
$$ plain form
16004 20725 27630 34152 25352 26434 21297 16427 19126 34874 31965 -1148 -30302 -17032 -17765 -1137
15990 -1137 23896 24723 24155 22637 -10353 -30241 -29045 -22126 -22026 -29177 -23470 -29121 -9383 -7107
15976 -7107 -1342 3292 7974 26421 33410 7799 12444 34534 33159 21311 7728 6371 13775
15963 13775 8508 -8455 -8513 -13886 -30126 -18831 -8349 -25972 -25230 4077 9316 15041 24024 27720
15949 27720 19088 9272 -15703 -25267 -15635 -29487 -27101 -36605 -42134 -20939 16568 49780 28279
15936 28279 20668 29683 20909 32409 18421 -3858 16129 7055 -3767 5868 20010 8649 -5920
15923 -5920 766 3546 17994 1863 -9270 -36048 -28576 -13768 6543 31231 10012 20087
15911 20087 43130 6730 4938 17417 9515 -10081 2884 12793 10421 7503 -11193 -6069 16526
$$ packed form
16004B0725O905O522q800J082n137m870K699J5748k909l3113k9154J3270p33J6628
15990a137K5033Q27n68j518l2990j9888J196O919J00p151N707n651J9738K276
15976g107N765M634M682J8447O989k5611M645K2090j375j1848j3583j357P404
15963A3775n267j6963n8n373j6240J1295J0482j7623P42K9307N239N725Q983L696
15949B7720q632r816k4975r564R632j3852K386r504n529K1195L7507L3212k1501
15936B8279p611R015q774J1500j3988k2279J9987r074j0822R635J4142j1361j4569
15923e920O686K780J4448j6131j1133k6778P472J4808K0311K4688k1219J0075
15911B0087K3043l6400j792J2479p902j9596J2965R909k372k918j8696N124K2595
$$ plain form
15898 16526 8439 -22969 -42639 -7780 -10920 -9920 -1123 -4570 -20423 -17372 -17803 -20180 -45007
15885 -45007 -46395 -39102 -34180 4388 15427 25471 33299 14389 9902 -1102 -33611 -24456 -27092
15872 -27092 -29126 -22681 -5266 -3226 -7895 5051 10686 4000 -16961 -3916 16616 22501 5494
15859 5494 15796 5930 -20968 -3206 -17456 -14769 -7306 -15082 -25514 -9692 -17890 197 12239
15846 12239 14210 32474 22767 -8240 -3870 13736 16852 1830 1300 -3888 3771 7649 3852 -13331
15832 -13331 2694 8314 5813 -26388 -42072 -26477 -28028 -49798 -58126 -26447 -22440 -20531 -23081
15819 -23081 -16446 -13314 -7341 2797 -19271 -26978 -36854 -41149 -24499 20377 30298 26799 35343
15806 35343 15230 -20375 -1732 14264 12925 2183 8467 14343 33304 45424 49221 36541
$$ packed form
15898A6526q087l1408j9670L4859l140J000Q797l447j5853L051m31k377k4827
15885d5007j388P293M922L8568J1039J0044P828j8910m487j1004l2509R155k636
15872b7092k034O445J7415K040m669J2946N635o686k0961J3045K0532N885j7007
15859E494J0302r866k6898J7762j4250K687P463p776j0432J5822q198J8087J2042
15846A2239J971J8264r707l1007M370J7606L116j5022n30n188P659L878l797j7183
15832a3331J6025N620k501l2201j5684J5595j551k1770q328L1679M007J909k550
15819b3081O635L132N973J0138k2068p707r876m295J6650M4876R921l499Q544
15806C5343k0113l5605J8643J5996j339j0742O284N876J8961J2120L797j2680
$$ plain form
15794 36541 10488 -5459 24664 20886 6613 19920 20817 22593 15723 26678 18308 8962 7574
15781 7574 42276 60881 110012 86485 30795 -10600 20911 40694 48176 43260 25534 25949 22874
15768 22874 16632 41529 51932 30846 31520 27307 1389 2327 -3338 -21330 -36416 -40326 -34435
15755 -34435 -22788 -21377 -17034 -22129 -3084 4704 3180 16911 14951 27763 28738 14040 -5965
15742 -5965 5607 21266 7413 -13434 -27380 -51377 -36084 -1459 11582 -5976 -15006 -10161
15730 -10161 -8031 4414 12752 7870 -28814 -55051 -44236 -7347 2479 -4186 -14552 -13187 -19248
15717 -19248 -34490 -35572 -37276 -45136 -17487 8411 -11995 -43671 -34385 -30871 -2976 -10516 -31762
15704 -31762 -20204 -5724 -11245 -26525 -60732 -58618 -60430 -78196 -70688 -60379 -15252 -5945 5417
$$ packed form
15794C6541k6053j5947L0123l778j4273J3307Q97J776o870J0955q370r346j388
15781G574L4702J8605M9131k3527n5690m1395L1511J9783P482m916j7726M15l075
15768B2874o242K4897J0403k1086O74m213k5918R38n665j7992j5086l910N891
15755c4435J1647J411M343n095J9045P788j524J3731j960J2812R75j4698k0005
15742e965J1572J5659j3853k0847j3946k3997J5293L4625J3041j7558r030M845
15730a0161K130J2445Q338m882l6684k6237J0815L6889R826o665j0366J365o061
15717a9248j5242j082j704p860K7649K5898k0406l1676R286L514K7895p540k1246
15704c1762J1558J4480n521j5280l4207K114j812j7766P508J0309M5127R307J1362
$$ plain form
15691 5417 38443 25757 22687 16287 10342 -8691 -25879 -40720 -37120 -18090 -1816 -923 4541
15678 4541 16039 25085 30422 19232 1707 15380 38110 32238 13850 -17664 -33710 -43427 -26044
15665 -26044 -25456 -36878 -14674 722 6191 17959 6631 -24131 6466 29146 51489 39488
15653 39488 -5590 -18151 -6255 66 15411 20979 7999 4483 31362 44463 11603 -9918
15641 -9918 -21878 -12902 -3696 1295 -6698 1273 -2503 14227 30816 29621 29946 11801 -1060 11346
15627 11346 -1503 -10528 -8741 -4711 -12973 5611 9538 10488 4058 -31502 -45059 -13513 10390
15614 10390 23089 -7409 -9839 -4720 -12362 -16797 -15245 3176 38205 24512 9827 -13749 -31618
15601 -31618 -24754 -175 14453 8421 -3323 -9046 -35943 -47347 -29267 8944 17471 -11566
$$ packed form
15691E417L3026j2686l070o400n945j9033j7188j4841L600J9030J6274Q93N464
15678D541J1498R046N337j1190j7525J3673K2730n872j8388l1514j6046r717J7383
15665b6044N88j1422K2204J5396N469J1768j1328l0762L0597K2680K2343j2001
15653C9488m5078j2561J1896O321J5345N568j2980l516K6879J3101l2860k1521
15641i918j1960Q976R206M991p993P971l776J6730J6589j195L25j8145j2861J2406
15627A1346j2849r025J787M030q262J8584L927R50o430l5560j3557L1546K3903
15614A0390J2699l0498k430N119p642m435J552J8421L5029j3693j4685k3576j7869
15601c1618O864K4579J4628o032j1744n723k6897j1404J8080L8211Q527k9037
$$ plain form
15589 -11566 -19818 -23699 -31023 -34239 -35714 -23075 653 11849 -1447 -952 13727 21152 7162
15576 7162 21444 48975 15502 14425 24512 -403 -31653 -10727 15730 46738 34457 22101
15564 22101 568 -20057 1954 9174 11336 16692 15265 2638 12107 11724 8222 8078 12200 34777
15550 34777 35921 43693 21167 -7622 -28061 -62783 -55636 -35448 -36324 -29097 -35600 -30003 -3411
15537 -3411 1998 -4284 -7346 7909 -29823 -52140 -54564 -61314 -33193 -26446 -37267 -26232 -28236
15524 -28236 -16350 -7473 -15029 -2436 8783 27487 16674 2374 1281 -12944 -17706 -10030 -15714
15511 -15714 -39023 -21399 -20739 -11559 20711 49446 52950 40961 40187 22367 18225 -5450 -9722
15498 -9722 9288 23878 48764 42568 21210 -9400 -20807 4830 17800 -12690 -28543 -1311
$$ packed form
15589a1566q252l881p324l216j475J2639K3728J1196j3296M95J4679P425j3990
15576G162J4282K7531l3473j077J0087k4915l1250K0926K6457L1008j2281j2356
15564B2101k1533k0625K2011P220K162N356j427j2627R469l83l502j44M122K2577
15550C4777J144P772k2526k8789k0439l4722P147K0188q76P227o503N597K6592
15537c411N409o282l062J5255l7732k2317k424o750K8121O747j0821J1035k004
15524b8236J1886Q877p556J2593J1219J8704j0813j4300j093j4225m762P676n684
15511a5714k3309J7624O60R180L2270K8735L504j1989p74j7820m142k3675m272
15498i722J9010J4590K4886o196k1358l0610j1407K5637J2970l0490j5853K7232
$$ plain form
15486 -1311 17389 19783 24605 43863 21574 4646 14502 21765 27058 4299 -3771 9834 29750
15473 29750 36248 35002 36599 30957 -4202 -15052 -11646 -13192 -2728 33327 16394 7808 18800
15460 18800 -2545 -20601 -31889 -34872 -46924 -59310 -43436 -45393 -44933 -42132 -36534 -37528 -28259
15447 -28259 -13222 -6930 5421 8725 300 -6286 -19656 -9018 -24913 -29324 -27197 -28977 -22718
15434 -22718 -26054 -31485 -28968 -22342 -17632 -23358 -2358 34567 24535 15854 31112 54959 68745
15421 68745 73506 42538 1040 -7084 -26632 -19868 9111 34081 35727 18884 15272 11843 -7275
15408 -7275 6846 20905 15358 -20657 -25686 -3307 3288 -13496 -11828 -14992 -2351 3083 1268
15395 1268 13602 6235 -22822 -70744 -76820 -49110 -47198 -52036 -25322 -27024 -37829 -29876 1810
$$ packed form
15486a311J8700K394M822J9258k2289j6928R856P263N293k2759q070J3605J9916
15473B9750O498j246J597n642l5159j0850L406j546J0464L6055j6933q586J0992
15460A8800k1345j8056j1288k983j2052j2386J5874j957M60K801N598r94R269
15447b8259J5037O292J2351L304q425o586j3370J0638j5895m411K127j780O259
15434b2718l336n431K517O626M710n726K1000L6925j0032q681J5258K3847J3786
15421F8745M761l0968m1498q124j9548O764K8979K4970J646j6843l612l429j9118
15408g275J4121J4059n547l6015n029K2379O595j6784J668l164J2641N434j815
15395A268J2334p367k9057m7922o076K7710J912m838K6714j702j0805P953L1686
$$ plain form
15382 1810 4645 -10633 -19205 -4762 -7941 -14708 -15879 -9511 -3121 5626 5093 13868 21477 32556
15368 32556 34298 35406 62896 38257 -4264 -3860 1953 2491 19318 14135 2601 -5242 -6401 -1122
15354 -1122 -14805 -21691 1786 1040 -25057 -26340 -12703 -10881 -995 2477 9094 3334 24980 40588
15340 40588 28778 9794 -881 5954 -5942 -8305 1938 11961 -14440 -35742 -18946 -2833
15328 -2833 16142 10712 19166 41798 23229 -24514 -28115 -47405 -55194 -28423 -15470 -18484 3353
15315 3353 23432 -7703 -1838 15753 30278 -759 -12485 -9507 -21944 -24649 -35854 -15356
15303 -15356 -12160 9605 10622 -5965 -17909 -26445 -28887 -12443 -28240 -30600 -34244 -31068 -28407
15290 -28407 -43904 -20061 1494 9612 -9793 -34755 -28639 -26921 -35496 -22005 -19097 -29794 -40139
$$ packed form
15382A810K835j5278q572J4443l179o767j171O368O390Q747n33Q775P609J1079
15368C2556J742J108K7490k4639m2521M04N813N38J6827n183j1534p843j159N279
15354a122j3683o886K3477p46k6097j283J3637J822R886L472O617n760K1646J5608
15340D0588j1810j8984j0675O835j1896k363J0243J0023k6401k1302J6796J6113
15328b833J8975n430Q454K2632j8569m7743l601j9290p789K6771J2953l014K1837
15315C353K0079l1135N865J7591J4525l1037j1726K978j2437k705j1205K0498
15303a5356L196K1765J017j6587j1944q536k442J6444j5797k360l644L176K661
15290b8407j5497K3843K1555Q118j9405k4962O116J718q575J3491K908j0697j0345
$$ plain form
15277 -40139 -54079 -47982 -28418 -24196 -3102 17651 5153 7423 -5336 -10521 -36136 -43925 -22071
15264 -22071 -26332 -1892 -19790 -24158 -5357 19734 37285 12298 -355 3361 12894 -421
15252 -421 1049 27217 20741 -9025 -21303 -22298 -16466 -23018 -10779 -22189 -47587 -43425 -33776 -26401
15238 -26401 3178 4199 -2531 -5239 -15825 5056 14296 2022 -3378 3569 51703 51680 32957
15225 32957 22979 16669 8900 -23468 -13381 9257 14670 -3571 -10097 -29692 -42101 -18745 -11793
15212 -11793 -17236 -17672 995 1253 -71 -7167 -23866 -3599 164 7173 -1421 -26920 -31690 -6081
15198 -6081 336 -15893 -19070 6699 15682 17258 9681 -9441 -10178 7208 1111 -23308 -39930
15185 -39930 -11212 29625 42891 49378 21537 17887 29488 27046 9238 13513 30886 47889
$$ packed form
15277d0139j3940O097J9564M222K1094K0753j2498K270j2759n185k5615p789K1854
15264b2071m261K4440j7898m368J8801K5091J7551k4987j2653L716R533j3315
15252d21J470K6168o476k9766j2278r95N832o552J2239j1410k5398M162R649P375
15238b6401K9579J021o730k708j0586K0881R240j2274n400O947M8134k3j8723
15225C2957r978o310p769l2368J0087K2638N413j8241o526j9595j2409K3356O952
15212a1793n443m36J8667K58j324p096j6699K0267L763P009q594k5499m770K5609
15198f081O417j6229l177K5769Q983J576p577j9122p37J7386o097k4419j6622
15185c9930K8718M0837J3266O487k7841l650J1601k442j7808M275J7373J7003
$$ plain form
15173 47889 29057 12469 -7815 -17980 -9915 -11914 -14050 -30872 -29187 -25037 -2199 -177 16401
15160 16401 28023 17516 20789 9493 -1691 -11266 -29287 -3516 -7718 28419 56438 54943
15148 54943 37584 14232 3 302 -8248 -17420 -29101 -1006 20836 21958 18632 22935 34212
15135 34212 31985 54121 29749 26614 34818 29592 9964 24393 9169 -12983 -20441 -40980 -22513
15122 -22513 -17279 -26396 -16825 -4803 -14761 -16804 -23390 -43721 -27811 -2838 6444 18493 5122
15109 5122 -9019 -26166 -9203 9346 6850 18544 19949 23464 37755 20327 1160 -22253
15097 -22253 -23758 -10676 -1175 695 -330 -2078 -3434 13942 2404 -4314 -45455 -30784 -12891
15084 -12891 -1296 -3946 155 257 8657 18009 13889 -21819 -33587 -29741 -20971 -32831 -37510 -6608
$$ packed form
15173D7889j8832j6588k0284j0165Q065j999k136j6822J685M150K2838K022J6578
15160A6401J1622j0507L273j1296j1184r575j8021K5771m202L6137K8019j495
15148E4943j7359k3352j4229K99q550r172j1681K8095K1842J122l326M303J1277
15135C4212k227K2136k4372l135Q204n226j9628J4429j5224k2152p458k0539J8467
15122b2513N234r117R571J2022r958k043o586k0331J5910K4973R282J2049j3371
15109E122j4141j7147J6963J8549k496J1694J405L515J4291j7428j9167k3413
15097b2253j505J3082R501J870j025j748j356J7376j1538o718m1141J4671J7893
15084a2891J1595k650M101J02Q400R352m120l5708j1768L846Q770j1860m679L0902
$$ plain form
15070 -6608 8817 33393 60715 57247 63750 71488 51227 50868 34998 23034 14508 31189 17877
15057 17877 15147 35176 54091 40105 43408 56178 79310 84759 65567 41153 28128 47143
15045 47143 65229 44524 31893 69652 90910 80484 51320 40767 25316 4322 22757 31188
15033 31188 24133 2831 -14922 -11293 -33963 -27667 7834 5262 -10798 -13874 -40459 -47317 -12301
15020 -12301 23055 28248 37401 47456 49369 10171 -15976 -26330 -55654 -57966 -36921 -20620
15008 -20620 -12473 -24981 -9774 19256 29131 13110 5621 -9549 17062 24670 20737 538 -464
14995 -464 -7332 -21541 -2585 6148 31613 30234 30204 30242 22613 14875 -480 -6931 -19173 -32
14981 -32 -3147 -11142 -10600 7184 12648 2149 -7768 220 11107 3919 19422 52937 40650 42982
$$ packed form
15070f608J5425K4576K7322l468O503P738k0261l59j5870j1964q526J6681j3312
15057A7877k730K0029J8915j3986L303J2770K3132N449j9192k4414j3025J9015
15045D7143J8086k0705j2631L7759K1258j0426k9164j0553j5451k0994J8435Q431
15033C1188p055k1302j7753L629k2670O296L5501k572j6060l076k6585o858L5016
15020a2301L5356N193R153J0055J913l9198k6147j0354k9324k312K1045J6301
15008b0620Q147j2508J5207K9030R875j6021p489j5170K6611P608l933k0199j002
14995d64o868j4209J8956Q733K5465j379l0L8p629p738j5355o451j2242J9141
14981c2l115p995N42J7784N464j0499r917P988J0887p188J5503L3515j2287K332
$$ plain form
14967 42982 53180 83712 73170 62110 12980 -6119 5884 13455 11061 5455 2324 3552 12431
14954 12431 2765 6441 1701 2654 -4644 -20649 1063 2 28447 22753 32940 27882 26767 20121
14940 20121 16045 2964 17518 23932 11330 8744 11237 -10985 -1548 29179 -1905 -61128 -53477
14927 -53477 -18661 -2446 -18421 -41300 -53383 -17734 -7318 -10857 4052 98 -19968 -7973
14915 -7973 -18021 -20313 -32657 -31408 -15465 -5363 -4844 -2324 -30 4176 -7064 -16007 -38495
14902 -38495 -23231 17672 3694 -16893 -10733 -29351 -20548 -24560 -40404 -38139 -39413 -32000 -9321
14889 -9321 -11360 -24344 -28724 -25094 -29082 -28213 -36505 -5038 7980 7231 21312 23591 24384 21940
14875 21940 34849 24899 24203 4570 3973 3421 8784 -7897 3126 1602 -12431 -48333 -36021
$$ packed form
14967D2982J0198L0532j0542j1060m9130j9099J2003P571k394n606l131J228Q879
14954A2431r666L676m740R53p298j6005K1712j061K8445n694J0187n058j115o646
14940B0121m076j3081J4554O414j2602k586K493k2222R437L0727l1084n9223P651
14927e3477L4816J6215j5975k2879j2083L5649J0416l539J4909l954k0066J1995
14915g973j0048k292j2344J249J5943J0102N19K520K294M206j1240q943k2488
14902c8495J5264M0903j3978k0587O160j8618Q803m012j5844K265j274P413K2679
14889i321k039j2984m380L630l988Q69q292L1467J3018p49J4081K279P93k444
14875B1940J2909r950o96j9633n97n52N363j6681J1023j524j4033l5902J2312
$$ plain form
14862 -36021 -39949 -34693 -25145 -4969 -6773 -36373 -35175 -13036 -17718 -14507 3365 28779 23944
14849 23944 17095 6535 -21611 -18179 -9072 -1446 5994 17204 51544 59237 65910 41468 30875
14836 30875 28267 39066 30849 9833 -12935 -38039 -30594 -22566 -5358 3817 14245 847 10403
14823 10403 32524 21832 41988 39456 -104 -9969 -10571 -16831 2927 24141 22939 9029 24007
14810 24007 28227 36434 31440 4649 5699 8784 -6734 12255 37306 50194 39138 13351 30684
14797 30684 62911 61156 54268 20714 6989 11879 8470 -19770 -39757 -36094 -40817 -28280 -18864
14784 -18864 -42862 -50358 -51846 -27978 -1610 10187 -15537 -20245 -12296 -8305 591 -5232 -25698
14771 -25698 -36123 -23790 -11568 6451 46422 45472 6770 -41120 -38848 -3459 -14318 -20874
$$ packed form
14862c6021l928N256R548K0176j804k9600J198K2139m682L211J7872K5414m835
14849B3944o849j0560k8146L432R107P626P440J1210L4340P693O673k4442j0593
14836C0875k608J0799q217k1016k2768k5104P445Q028J7208R175J0428j3398R556
14823A0403K2121j0692K0156k532l9560r865o02o260J9758K1214j202j3910J4978
14810B4007M220Q207m994k6791J050L085j5518J8989K5051J2888j1056k5787J7333
14797C0684L2227j755o888l3554j3725M890l409k8240j9987L663m723J2537R416
14784a8864k3998p496j488K3868K6368J1797k5724m708P949L991Q896n823k0466
14771b5698j0425J2333J2222J8019L9971r50l8702m7890K272L5389j0859o556
$$ plain form
14759 -20874 -15420 6128 25553 19000 10186 2776 6974 -23609 -14932 10100 1360 -22715 -5457
14746 -5457 -405 13162 6022 -9807 5699 1375 -2657 -7531 -257 23330 43330 29018 4392
14733 4392 7649 5651 22485 37152 7899 -3726 4907 8064 -9108 -41436 -19207 -23028 -33868
14720 -33868 -27887 -232 1269 9367 10038 -16320 -34607 -17474 -4823 -9630 6243 14413 28534
14707 28534 28484 21665 10897 11201 2567 -19463 2199 -15424 -14219 -1416 -21169 -24389 -16110 -17993
14693 -17993 10943 13815 -5863 -10946 -4898 -6838 802 -16587 -29647 -24889 -10304 14819 36919
14680 36919 31655 17103 4529 25785 40599 50654 26515 19520 18448 23456 12055 7292 15484
14667 15484 15001 13315 -14592 -23027 -10282 -5536 10190 8009 4899 -9875 -18688 -4771 1151
$$ packed form
14759b0874N454K1548J9425o553q814p410M198l0583Q677K5032q740k4075J7258
14746e457N052J3567p140j5829J5506m324m032m874P274K3587K0000j4312k4626
14733D392L257j998J6834J4667k9253j1625Q633L157j7172l2328K2229l821j0840
14720c3868N981K7655J501Q098O71k6358j8287J7133J2651m807J5873Q170J4121
14707B8534n0o819j0768L04q634k2030K1662j7623J205J2803j9753l220Q279j883
14693a7993K8936K872j9678n083O048j940P640j7389j3060M758J4585K5123K2100
14680C6919n264j4552j2574K1256J4814J0055k4139o995j072N008j1401m763Q192
14667A5484m83j686k7907q435J2745M746J5726k181l110j4774q813J3917N922
$$ plain form
14654 1151 -3288 33569 48092 65115 38804 12852 10733 -7410 -5452 8857 19938 -3044
14642 -3044 320 6745 -11993 -26273 -21820 -16017 -20270 -10755 14973 11910 -17304 4322 8473
14629 8473 -5867 -31928 -16481 10098 32716 63238 38550 27220 21532 16417 22134 42429
14617 42429 51400 40477 29127 35765 43664 41754 43492 25460 30380 33746 10268 634 9327
14604 9327 16035 6267 305 12456 -1746 -24812 -13124 15071 31440 14441 -2917 -4975 1980
14591 1980 -3047 1094 1046 1666 2069 17050 10111 3818 9682 -10714 -12786 -4187 991 130 -14433
14576 -14433 -21478 -180 32153 26275 10745 6944 12888 16494 12529 2813 -6162 -20616 -37777
14563 -37777 -42328 -26849 -14734 -13182 -11919 12895 14172 22216 28968 47153 27446 23645 58579
$$ packed form
14654A151m439L6857J4523J7023k6311k5952k119j8143J958J4309J1081k2982
14642c044L364O425j8738j4280M453N803m253R515K5728l063k9214K1626M151
14629H473j4340k6061J5447K6579K2618L0522k4688j1330n688n115N717K0295
14617D2429Q971j0923j1350O638P899j910J738j8032M920L366k3478r634Q693
14604I327O708r768n962J2151j4202k3066J1688K8195J6369j6999j7358k058O955
14591A980n027M141m8O20M03J4981o939o293N864k0396k072Q599N178q61j4563
14576a4433p045K1298L2333n878j5530l801N944L606l965r716q975j4454j7161
14563c7777m551J5479J2115J552J263K4814J277Q044O752J8185j9707l801L4934
$$ plain form
14550 58579 50019 42902 17864 -3698 -15234 13991 36975 32935 10311 -9532 -12284 -17134 5857
14537 5857 28735 37991 4776 -18720 -9693 5681 7660 10116 11364 1757 27668 27571 18193 23628
14523 23628 19672 15064 21513 21597 831 7397 8117 3277 8791 34990 43770 71737 66069 43319
14509 43319 29126 2966 1628 2768 14437 7835 39526 51879 27985 24169 19951 -1632 -8114
14496 -8114 2774 2534 11677 12708 -9082 -31905 -41470 -35675 -37418 -29275 -21462 -5131 -3600 2873
14482 2873 -18829 -10260 -1216 -5760 -26045 -15504 -18736 -19514 -2130 4488 7547 -9664 -15289 -1215
14468 -1215 2236 -9959 5732 -184 -6720 -8632 10240 23161 34498 26923 22280 32224 18046
14455 18046 16499 37631 49203 34339 57021 41629 29100 4281 -5604 -21859 -42622 -28372
$$ packed form
14550E8579q560p117k5038k1562j1536K9225K2984m040k2624j9843k752m850K2991
14537E857K2878R256l3215k3496R027J5374J979K456J248r607K5911r7r378N435
14523B3628l956m608O449Q4k0766O566P20m840N514K6199Q780K7967n668k2750
14509D3319j4193k6160j338J140J1669o602L1691J2353k3894l816m218k1583o482
14496h114J0888k40R143J031k1790k2823r565N795j743Q143P813J6331J531O473
14482B873k1702Q569R044m544k0285J0541l232p78J7384O618L059j7211n625J4074
14468a215L451j2195J5691n916o536j912J8872J2921J1337p575m643R944j4178
14455A8046j547K1132J1572j4864K2682j5392j2529k4819r885j6255k0763J4250
$$ plain form
14443 -28372 -10029 -4642 3232 10280 4040 378 -14716 -27748 -18645 4929 35081 21682 21925
14430 21925 40274 6848 -21566 -46879 -54638 -35822 -30569 -22370 1579 5415 -13476 105
14418 105 -5057 -19949 -31389 -9570 3647 13916 13025 1127 -20884 -36383 -31819 -31982 -38885
14405 -38885 -26569 -21367 -11045 -6029 3088 -21145 -29827 -1298 34312 36947 -8611 -41249 -51114
14392 -51114 -29556 -2598 24800 34274 40191 25231 5468 -26135 -14345 23131 -1260 -27115
14380 -27115 -18553 6588 -3235 -13763 -34498 -32116 -26474 -20864 -28402 -25532 3826 368 553 -566
14366 -566 -17416 -29292 -22545 -13827 2062 14264 12026 5122 -5235 -41977 -58034 -38938 -23611
14353 -23611 -11298 6448 6365 2900 14378 23031 8976 -5910 -121 11060 15413 9092 13877
$$ packed form
14443b8372J8343N387P874P048o240l662j5094j3032R103K3574L0152j3399K43
14430B1925J8349l3426k8414k5313p759J8816N253Q199K3949L836j8891J3581
14418A05n162j4892j1440K1819J3217J0269q91j1898k2011j5499M564j63o903
14405c8885J2316N202J0322N016R117k4233q682K8529L5610K635m5558l2638r865
14392e1114K1558K6958K7398R474N917j4960j9763l1603J1790L7476k4391k5855
14380b7115Q562K5141r823j0528k0735K382N642N610p538K870K9358l458J85j119
14366e66j6850j1876O747Q718J5889J2202k238o904j0357l6742j6057J9096J5327
14353b3611J2313J7746q3l465J1478Q653j4055j4886N789J1181M353o321M785
$$ plain form
14340 13877 2858 -5123 6957 20333 31671 6879 -9569 9790 11355 -9728 -34671 -36909
14328 -36909 -40036 -52618 -48575 -40256 -29842 8237 21959 6269 -3065 21621 41969 54455
14316 54455 45214 37993 17307 40195 50574 45641 44654 43181 8782 -25956 -31886 -24501 2257
14303 2257 -1707 9154 33344 42070 15781 -19697 -24776 -51063 -50482 -44380 -23750 6248 4075
14290 4075 -12951 -27975 -9064 17592 15992 576 -21150 -23142 1936 34921 43548 55214
14278 55214 8243 11297 37010 17319 31947 58990 64806 52773 51643 31974 20212 23686
14266 23686 25802 11353 6247 -1948 -17395 -13334 -1186 -59566 -74087 -43493 -10065 -6541 -15936
14253 -15936 -8049 5833 -9992 -15102 -13418 7394 34974 36669 28359 18610 31163 46368 28430
$$ packed form
14340A3877j1019p981J2080J3376J1338k4792j6448J9359J565k1083k4943k238
14328c6909l127j2582M043Q319J0414L8079J3722j5690r334K4686K0348J2486
14316E4455r241p221k0686K2888J0379m933r87j473l4399l4738n930P385K6758
14303B257l964J0861K4190Q726k6289l5478n079k6287N81O102K0630K9998k173
14290D075j7026j5024J8911K6656j600j5416k1726j992K5078L2985Q627J1666
14278E5214m6971L054K5713j9691J4628K7043N816j2033j130j9669j1762L474
14266B3686K116j4449n106q195j5447M061J2148n8380j4521L0594L3428L524r395
14253a5936P887J3882j5825n110J684K0812K7580J695q310r749J2553J5205j7938
$$ plain form
14240 28430 22044 11873 7694 25957 51803 39474 23330 26345 40178 40371 34388 36386 26507
14227 26507 36407 9648 -29055 -48373 -51891 -61091 -50437 -40274 -24720 -20373 -8304 3917
14215 3917 -1236 7705 6196 -4462 -1726 465 15124 4951 -3495 -22312 -23149 -9053 -7562 -33091
14201 -33091 -41923 -16431 9293 -6604 -22713 -24740 -10673 6555 15765 -3618 10776 17957
14189 17957 7463 25175 67348 53420 40812 48520 48465 16317 -12095 -19556 -1752 -209 10034
14176 10034 54045 49420 28674 12953 19993 11525 3057 -19013 -4562 21708 66092 60525 67136
14163 67136 33399 9872 15092 42764 56869 40979 38179 33461 342 -26441 -7353 -12675
14151 -12675 -6239 -9608 6251 24139 29761 11225 -12105 -19715 -37176 -37655 -2242 8494 -5649
$$ packed form
14240B8430o386j0171m179J8263K5846j2329j6144L015J3833J93n983J998r879
14227B6507R900k6759l8703j9318l518r200J0654J0163J5554M347J2069J2221
14215C917n153Q941j509j0658K736K191J4659j0173q446j8817q37J4096J491k5529
14201c3091q832K5492K5724j5897j6109k027J4067J7228R210j9383J4394P181
14189A7957j0494J7712M2173j3928j2608P708n5l2148k8412p461J7804J543J0243
14176A0034M4011m625k0746j5721P040q468q468k2070J4451K6270M4384n567O611
14163F7136l3737k3527N220K7672J4105j5890k800m718l3119k6783J9088n322
14151a2675O436l369J5859J7888N622j8536k3330p610j7461m79L5413J0736j4143
$$ plain form
14138 -5649 16638 -2411 -38698 -34025 -14601 5648 5432 -5931 -4479 -526 -20431 -9291 -2561
14125 -2561 -2877 23589 20675 290 12756 8727 2697 -727 15511 23596 3414 -1275 11194
14112 11194 -13286 -32772 -54154 -49167 -46352 -42120 -15087 12060 -14394 -10970 -10217 -22380 101
14099 101 14679 13764 8334 -22271 -43775 -39774 -44042 -51316 -39012 -34820 2624 19888 9088
14086 9088 12070 14882 2668 -20860 -34834 -33785 -44923 -34340 -25179 -2393 -4701 2750 32793
14073 32793 5213 -23540 -19120 781 -532 11047 21768 6859 -15671 -27405 -8334 -13810
14061 -13810 -21863 -14391 -12670 -3622 -19483 -25114 -7460 -16992 -27252 958 21070 -22527 -14884
14048 -14884 3258 -14993 -47843 -36801 -10359 -18302 -25841 -53135 -24106 19627 13147 -23302
$$ packed form
14138e649K2287j9049l6287M673J9424K0249k16j1363J452L953j9905J1140O730
14125b561l16K6466k914k0385J2466m029o030l424J6238Q085k0182m689J2469
14112A1194k4480j9486k1382M987K815M232K7033K7147k6454L424P53j2163K2481
14099A01J4578r15n430l0605k1504M001m268p274J2304M192L7444J7264j0800
14086I088K982K812j2214k3528j3974J049j1138J0583R161K2786k308P451L0043
14073C2793k7580k8753M420J9901j313J1579J0721j4909k2530j1734J9071n476
14061a3810q053P472J721R048j5861n631J7654r532j0260K8210K0112m3597P643
14048a4884J8142j8251l2850J1042K6442p943p539k7294K9029M3733o480l6449
$$ plain form
14036 -23302 -26277 -263 -959 7758 -448 -16456 -6310 18615 20177 174 -31545 -7012 -12838
14023 -12838 96 -190 -21578 -33109 -28623 -9969 -8348 -26440 -7457 21628 51010 32009
14011 32009 -3939 14153 27928 11095 26563 32301 20563 9011 5687 2988 21032 5095
13999 5095 -13760 -3867 -15548 -30746 -26715 -46835 -24015 -3610 -12836 -36271 -40570 -45050 -11780
13986 -11780 2373 -16375 -1023 -22737 -12355 -9380 -13728 -7092 -16962 -21965 -38657 -42539 -32314
13973 -32314 -9237 -4804 3409 -4876 -10310 -26504 -18684 801 913 9966 23854 17636 14554 9542
13959 9542 -2791 -14136 -25484 -53659 -47184 -29573 -22734 -9429 -10908 -13821 -18765 -19266 -10663
13946 -10663 -19535 -16247 -16379 -27208 -38967 -11348 -450 26976 23010 24198 30196 45812 36082
$$ packed form
14036b3302k975K6014o96Q717q206j6008J0146K4925J562k0003l1719K4533n826
14023a2838J2934k86k1388j1531M486J8654J621j8092J8983K9085K9382j9001
14011C2009l5948J8092J3775j6833J5468N738j1738j1552l324k699J8044j5937
13999E095j8855R893j1681j5198M031k0120K2820K0405r226k3435m299m480L3270
13986a1780J4153j8748J5352k1714J0382K975m348O636r870n003j6692l882J0225
13973c2314K3077M433Q213q285n434j6194P820J9485J12R053J3888o218l082n012
13959I542j2333j1345j1348k8175O475J7611O839J3305j479k913m944n01Q603
13946a0663q872L288j32j0829j1759K7619J0898K7426l966J188N998J5616r730
$$ plain form
13933 36082 21527 -11615 -10300 -11678 -28890 -48242 -57654 -53836 -23477 -15346 -4108 27415 47965
13920 47965 50447 24768 17666 27647 28596 45332 51605 39949 29375 16038 13778 26568 10950
13907 10950 -11038 -4168 -27118 -30487 -11364 4801 4923 3803 -9203 -20204 -42756 -40020 -169
13894 -169 -1088 -3649 -3224 -7451 -36339 -24101 -30374 -41581 -10146 -9569 -6470 -6231 -19517 -4139
13880 -4139 -16200 -7807 -8502 -13401 -31259 -40636 -44549 -51735 -42601 -12784 -12599 -14118 -28383 -48595
13866 -48595 -36416 -21060 5345 22662 21409 3064 13929 19956 1252 -11924 -7048 -2129
13854 -2129 10838 13735 14691 19404 13819 -5259 -47063 -49496 -50889 -48169 -29130 -26839 -65580 -63980
13840 -63980 -50190 -54832 -54707 -40863 -29287 -25508 -18348 9156 -15714 -42645 -33200 -19924 -17287
$$ packed form
13933C6082j4555l3142J315j378j7212j9352r412L818L0359Q131J1238L1523K0550
13920D7965K482k5679p102R981R49J6736O273j1656j0574j3337k260J2790j5618
13907A0950k1988O870k2950l369J9123J6165J22j120j3006j1001k2552K736L9851
13894a69r19k561M25m227k8888J2238o273j1207L1435N77L099K39j3286J5378
13880d139j2061Q393o95m899j7858r377l913p186R134K9817J85j519j4265k0212
13866d8595J2179J5356K6405J7317j253j8345J0865O027j8704j3176M876M919
13854b129J2967K897R56M713n585j9078m1804k433j393K720J9039K291l8741J600
13840f3980J3790m642J25J3844J1576L779P160K7504k4870k6931R445J3276K637
$$ plain form
13827 -17287 -41066 -34450 -21770 -5531 1663 -16518 -7123 5203 -2131 -17684 -23229 583 3348
13814 3348 9709 34541 25738 13702 29065 38855 42657 15975 -8500 -34894 -34757 -50129 -31302
13801 -31302 -8545 -2515 17974 62452 38035 34963 38037 39819 47584 29616 35383 17197 -10172
13788 -10172 4400 19330 7281 3949 1956 38881 21927 4512 20375 9350 -4076 527
13776 527 -10628 5222 -11282 -20636 -14310 -8257 -6032 2392 2684 -35911 -44389 -12201 17739 -431
13762 -431 -4421 23014 22417 13311 43413 47520 35027 8450 -25116 -2848 22904 32082 8126
13749 8126 -1892 -2783 2192 10712 24472 28620 38975 32262 8688 -7449 -1090 -10185 -10479 -17662
13735 -17662 -27437 -26518 -5824 -6183 -8065 24793 44918 28485 8904 10862 522 -34052 -36395
$$ packed form
13827a7287k3779O616J2680J6239P194j8181R395J2326p334j5553n545K3812K765
13814C348O361K4832q803j2036J5363R790L802k6682k4475k6394J37j5372J8827
13801c1302K2757O030K0489M4478k4417l072L074J782P765j7968N767j8186k7369
13788a0172J4572J4930j2049l332j993L6925j6954j7415J5863j1025j3426M603
13776E27j1155J5850j6504r354O326O053K225Q424K92l8595q478L2188K9940j8170
13762d31l990K7435n97r106L0102M107j2493k6577l3566K2268K5752R178k3956
13749H126j0018q91M975Q520J3760M148J0355o713k3574j6137O359r095k94p183
13735a7662r775R19K0694l59j882L2858K0125j6433j9581J958j0340l4574k343
$$ plain form
13722 -36395 -28963 -12127 6275 1473 -2393 17006 21102 41868 30265 4238 12094 22882 14188
13709 14188 27292 8511 -24848 -13991 11129 10995 -13528 3553 3303 8597 27788 25062 3298
13696 3298 -8945 -15522 -25016 -26080 -17185 -27160 -45429 -51066 -47784 -50899 -63170 -51406 -56811 -53814
13682 -53814 -51542 -39746 -38816 -25341 5317 29187 24133 30803 17798 17963 17475 12382 5592 -15484
13668 -15484 -8963 -13797 -7594 4611 2685 21381 572 3919 16869 19568 37053 29648 11673
13655 11673 26572 47142 29949 9787 15894 33016 27725 9757 4866 6817 -3875 -12629 -21711
13642 -21711 -22498 -18824 1219 -6553 -22859 -34629 -25332 -1441 13842 16480 25082 22353 14589
13629 14589 26618 30484 23028 11654 15530 13582 10781 7767 -2811 -7155 2833 3741 -11608 7656
$$ packed form
13722c6395P432J6836J8402m802l866J9399M096K0766j1603k6027P856J0788q694
13709A4188J3104j8781l3359J0857K5120j34k4523J7081k50N294J9191k726k1764
13696C298j2243o577r494j064Q895r975j8269n637L282l115j2271J1764n405K997
13682e3814K272J1796R30J3475L0658K3870n054O670j3005J65m88n093o790k1076
13668a5484O521m834O203J2205j926J8696k0809L347J2950K699J7485p405j7975
13655A1673J4899K0570j7193k0162O107J7122n291j7968m891J951j0692q754r082
13642b1711p87L674K0043p772j6306j1770R297K3891J5283K638Q602k729p764
13629A4589J2029L866p456j1374L876j948k801l014j0578m344R988R08j5349J9264
$$ plain form
13615 7656 -6080 -13004 16679 38419 27869 24392 43726 15140 -13223 -7805 -11137 -35909 -29456
13602 -29456 -12337 -5829 9499 -26701 -47900 -42855 -22455 -13242 -14467 3658 36176 51333
13590 51333 45656 27263 19078 16158 -6162 -11438 -19643 -35149 -47957 -31298 8685 26531 -4212
13577 -4212 -34896 -30879 8681 21319 18342 29779 14521 -437 -9895 -8186 -9295 -8934 -13333
13564 -13333 -14456 9033 21334 41101 65568 50178 33547 12390 -9121 -18484 -29467 -48725
13552 -48725 -30242 -17046 10404 30067 30878 23045 18085 26625 24514 18081 10615 -4781 -11931
13539 -11931 5279 34090 24820 14628 -14620 -32840 -49098 -32665 -32936 -26697 -15415 -6981 12805
13526 12805 15873 -13167 -14768 26066 23171 26718 5346 -6153 -9748 -2474 -2842 -6612 -6727 2321
$$ packed form
13615G656j3736o924K9683K1740j0550l477J9334k8586k8363N418l332k4772O453
13602b9456J7119O508J5328l6200k1199N045K0400R213j225J8125L2518J5157
13590E1333n677j8393q185k920k2320n276q205j5506j2808J6659L9983J7846l0743
13577d212l0684M017L9560J2638k977J1437j5258j4958r458J709j109L61m399
13564a3333j123K3489J2301J9767K4467j5390j6631k1157k1511r363j0983j9258
13552d8725J8483J3196K7450J9663Q11p833m960Q540k111o433p466j5396p150
13539a1931J7210K8811r270j0192k9248j8220j6258J6433k71O239J1282Q434J9786
13526A2805L068k9040j601M0834k895L547k1372j1499l595P274l68l770j15R048
$$ plain form
13512 2321 5183 9188 2542 -14812 -8240 15166 14646 27779 45166 34927 19549 14586 -10115
13499 -10115 -18106 -19062 -11637 142 8233 -4378 -1170 4704 -19470 -28952 5418 7916 -3916
13486 -3916 -9554 -7175 -14236 -18659 -45306 -22224 4763 -213 23919 33386 17071 -5164 -25071
13473 -25071 3599 23475 29250 13500 15920 10030 11821 -8025 -15314 -32000 -14394 -2416 26444
13460 26444 40641 20038 -5156 -354 30384 39852 17510 -3281 8852 10854 -21553 -31287
13448 -31287 11042 40608 31054 14714 10053 11506 24775 20531 28151 25145 22638 26215 28536
13435 28536 43290 42613 31827 19588 -5775 2961 4029 1594 3914 -1930 -5245 -1269 17532
13422 17532 25783 35580 30468 30022 37505 21734 4328 13576 24132 23911 1170 -1912 3540 -4628
$$ packed form
13512B321K862M005o646j7354O572K3406n20J3133J7387j0239j5378m963k4701
13499a0115p991r56P425J1779Q091j2611L208N874k4174r482L4370K498j1832
13486c916n638K379p061m423k6647K3082K6987m976K4132R467j6315k2235j9907
13473b5071K8670J9876N775j5750K420n890J791j9846p289j6686J7606J1978K8860
13460B6444J4197k0603k5194M802L0738R468k2342k0791J2133K002l2407r734
13448c1287M2329K9566r554j6340m661J453J3269m244P620l006k507L577K321
13435B8536J4754o77j0786j2239k5363Q736J068k435K320n844l315L976J8801
13422A7532Q251R797n112m46P483j5771j7406R248J0556k21k2741l082N452q168
$$ plain form
13408 -4628 18283 32669 38938 43858 42178 61497 48627 20537 15524 42432 41019 15770 9840
13395 9840 11121 24690 27816 21569 19256 623 8913 42937 53345 45531 40747 35919 5616
13382 5616 -23337 -30766 -29526 -21286 -29294 1505 18048 9307 40874 43499 24297 14153 20287
13369 20287 36829 44097 13260 -16917 -25115 -22436 -8912 15673 21772 5529 -5785 -4634 -18919
13356 -18919 -23094 -5186 -2659 11583 22614 37992 23027 -4518 -8442 3921 -6774 -16774
13344 -16774 -24195 2511 -17329 15743 23958 13977 -6027 4947 14805 15711 -2181 -7142 -7987
13331 -7987 4993 32939 33961 -15820 -30455 -903 28574 35561 32124 38138 37722 5457 10190
13318 10190 16287 6644 -21666 -32565 -437 -53 -16437 -20894 -21190 -23204 -9914 4129 10243
$$ packed form
13408d628K2911J4386O269M920j680J9319j2870k8090n013K6908j413k5249n930
13395I840J281J3569L126o247k313j8633Q290L4024J0408p814m784m828l0303
13382E616k8953p429J240Q240q008L0799J6543q741L1567K625j9202j0144O134
13369B0287J6542P268l0837l0177q198K679J3524K4585O099j6243j1314J151j4285
13356a8919m175J7908K527J4242J1031J5378j4965k7545l924J2363j0695j0000
13344a6774p421K6706j9840L3072Q215r981k0004J0974R858R06j7892m961q45
13331g987J2980K7946J022m9781j4635K9552K9477O987l437O014m16l2265M733
13318A0190O097r643k8310j0899L2128L84j6384m457k96k014J3290J4043O114
$$ plain form
13305 10243 11432 18116 14778 35402 29379 20147 35096 14728 1032 -19319 -19185 -22895 -14671
13292 -14671 -12826 -13522 -4784 2320 -8665 -2951 -5708 10795 9331 10889 24578 32507 4370 -24339
13278 -24339 -30481 -10080 8263 -1715 10822 24307 14493 -9834 -26264 -18672 -20178 -26085 -14703
13265 -14703 -7459 18453 17176 6820 2143 -645 1949 27267 56696 47025 24847 18031 40978
13252 40978 37030 10060 15350 28786 17572 29388 16113 -11502 -30743 -19865 14295 43695
13240 43695 45182 31607 3046 1506 -15216 -37230 -15421 -11466 -19449 -26367 -21849 -32576 -8289
13227 -8289 10963 15250 10762 -14874 -20188 -28448 -37934 -25075 -13030 -835 -4508 17280 5583
13214 5583 748 12547 -12861 -13511 8071 19853 23291 16348 9791 -11797 -12359 7324 9896 18330
$$ packed form
13305A0243J189O684l338K0624o023r232J4949k0368j3696k0351J34l710Q224
13292a4671J845o96Q738P104j0985N714k757J6503j464J558J3689P929k8137k8709
13278b4339o142K0401J8343r978J2537J3485r814k4327j6430P592j506n907J1382
13265a4703P244K5912j277j0356m677k788K594K5318K9429r671k2178o816K2947
13252D0978l948k6970N290J3436j1214J1816j3275k7615j9241J0878L4160K9400
13240D3695J487j3575k8561j540j6722k2014K1809L955p983o918M518j0727K4287
13227h289J9252M287m488k5636n314q260r486J2859J2045J2195l673K1788j1697
13214E583m835J1799k5408o50K1582J1782L438o943o557k1588n62J9683K572Q434
$$ plain form
13200 18330 35311 4853 -4202 -1268 9225 10423 -6761 -31987 -3304 18088 13870 2442
13188 2442 14603 4632 -25492 -11764 246 -16966 -32006 -28803 -22937 -19120 -30393 -24004 -20824
13175 -20824 1131 27819 39386 20584 -1063 -23802 -53832 -18494 6957 4801 9878 21421
13163 21421 13682 -22299 -40005 -22506 -24183 -26256 -40946 -57207 -33107 -8218 -1509 -16546
13151 -16546 -18655 -12431 13013 7043 520 -8925 -24995 -26532 872 7012 -20698 -30618 -6197
13138 -6197 -6433 1096 9341 13007 10729 -14807 -24658 -21888 -22413 -3083 1110 22183 4207 3306
13124 3306 40511 37761 28397 18959 25828 40980 32746 27013 29331 11738 9598 22634 -2463
13111 -2463 -19381 -4792 -3701 6934 -11626 5729 19813 30939 39871 36114 22429 14070 36850
$$ packed form
13200A8330J6981l0458r055K934J0493J198j7184k5226K8683K1392m218j1428
13188B442J2161r971l0124J3728J2010j7212j5040L203N866L817j1273O389L180
13175b0824K1955K6688J1567j8802k1647k2739l0030L5338K5451k156N077J1543
13163B1421p739l5981j7706J7499j677k073j4690j6261K4100K4889O709j5037
13151a6546k109O224K5444n970o523r445j6070j537K7404O140k7710r920K4421
13138f197k36P529Q245L666k278k5536r851K770n25J9330M193K1073j7976r01
13124C306L7205k750r364r438O869J5152q234n733K318j7593k140J3036k5097
13111b463j6918J4589J091J0635j8560J7355J4084J1126Q932l757j3685q359K2780
$$ plain form
13098 36850 66038 40565 -15514 -33622 -18320 28106 34899 42013 28058 -940 -8223 -12247
13086 -12247 -18284 -38829 -35834 5461 10803 -4000 7594 6567 -5030 -13014 26355 36188 36228
13073 36228 48119 31827 21680 24060 28554 25545 1967 -22274 -36701 -48604 -18599 -34336
13061 -34336 -49698 -34755 -28611 -7391 -8593 -27741 -55522 -55141 -39111 -48719 -25310 -11475 -21356
13048 -21356 -26977 -7272 12784 21103 2465 -4674 -7758 -8179 21779 8748 9988 31673 1414
13035 1414 -30676 -28146 -14738 11106 32994 27430 8584 -6766 -3215 -4711 -5921 13595 3769
13022 3769 12349 -2553 2315 19641 18644 -9051 -16499 -1612 2244 8388 7632 -424 12100 46228
13008 46228 21632 -10614 -21181 -3409 14751 23449 13654 5997 -9391 -6960 21858 18281 10592
$$ packed form
13098C6850K9188k5473n6079j8108J5302M6426O793P114j3955k8998p283m024
13086a2247o037k0545K995M1295N342j4803J1594j027j1597p984L9369R833M0
13073C6228J1891j6292j0147K380M494l009k3578k4241j4427j1903L0005j5737
13061c4336j5362J4943O144K1220j202j9148k7781L81J6030r608K3409J3835r881
13048b1356n621J9705K0056Q319j8638p139l084m21K9958j3031J240K1685l0259
13035A414l2090K530J3408K5844K1888n564j8846j5350L551j496j210J9516r826
13022C769Q580j4902M868J7326r97k7695p448J4887L856O144p56q056J2524L4128
13008D6228k4596l2246j0567J7772J8160Q698r795p657j5388K431K8818l577p689
$$ plain form
12995 10592 9714 -2220 2121 -2341 -13345 -44996 -40302 -26473 -19978 -19603 -19333 -20636 -17076 -20853
12981 -20853 -9100 35108 46829 49062 34312 34601 11578 -9320 -21959 -8075 8559 19310
12969 19310 21839 17060 -11876 -3887 6424 -15633 -28073 -29161 -29773 -4489 7689 -6413 10399
12956 10399 -3266 -30448 2553 23411 4623 -12641 -11753 -3496 -7813 -7546 -3530 -3692 -8733 -14626
12942 -14626 -8351 -14670 -24945 -26910 -40288 -36883 -29860 -31922 -40531 -29764 -32041 -58965 -59117 -68869
12928 -68869 -43080 -24535 -17242 -254 15622 33463 34035 34214 36900 25064 2152 -974 886
12915 886 22041 17880 14068 154 1480 -19110 -44935 -40069 -24348 -5693 -2743 -8065 868
12902 868 17523 24495 37316 36009 24609 14091 3188 12206 28586 39079 28231 12469 21756
$$ packed form
12995A0592q78j1934M341m462j1004l1651M694J3829O495L75K70j303L560l777
12981b0853J1753M4208J1721K233j4750K89k3023k0898j2639J3884J6634J0751
12969A9310K529m779k8936P989J0311k2057j2440j088o12K5284J2178j4102J6812
12956A0399j3665k7182L3001K0858j8788j7264Q88Q257m317K67M016j62n041n893
12942a4626O275o319j0275j965j3378L405P023k062q609J0767k277k6924j52r752
12928f8869K5789J8545P293J6988J5876J7841N72J79K686j1836k2912l126J860
12915H86K1155m161l812j3914J326k0590k5825M866J5721J8655K950n322Q933
12902H68J6655O972J2821j307j1400j0518j0903R018J6380J0493j0848j5762R287
$$ plain form
12889 21756 33448 21514 26054 1201 4353 7498 13141 -849 -10612 -30110 -16292 -2539 5262
12876 5262 12908 36801 24614 42227 53301 33685 14173 13094 38516 38158 12251 -4024 -13407
12863 -13407 -6999 26233 27418 42781 42599 36561 33399 -6366 -14862 2390 -8385 -20119 5618
12850 5618 25814 46737 48334 55972 48111 12758 -5581 25515 33784 33417 28069 15009 14065 18171
12836 18171 1042 2502 38589 30945 1088 -7563 -5179 -16988 -17639 3514 -1009 -26255 -2917
12823 -2917 10093 2708 10685 36367 23563 -10323 696 6133 11107 -2512 7895 23112 -2222
$$ packed form
12889B1756J1692j1934M540k4853L152L145N643j3990r763j9498J3818J3753P801
12876E262P646K3893j2187J7613J1074j9616j9512j079K5422l58k5907j6275r383
12863a3407O408L3232J185J5363j82o038l162l9765q496J7252j0775j1734K5737
12850E618K0196K0923J597P638p861l5353j8339L1096Q269l67n348j3060r44M106
12836A8171j7129J460L6087p644k9857q651K384j1809o51K1153m523k5246K3338
12823b917J3010p385P977K5682j2804l3886J1019N437M974j3619J0407J5217k5334
$$ [...]
##END NTUPLES=NMR SPECTRUM
##END=
