##TITLE=cc 47123	437/44/6	wendyb	EtAc?Analysis number 316680
Compound Code km 00121
Project Code adrs
Chemist Name ugmt
##JCAMPDX= 6.0         $$ Bruker NMR JCAMP-DX V2.0
##DATA TYPE= NMR SPECTRUM
##DATA CLASS= NTUPLES
##ORIGIN= Bruker BioSpin GmbH
##OWNER= nmr
$$ XWIN-NMR		Version 3.5
$$ Tue Jul 11 13:37:25 2006 GMT Daylight Time (UT+1h)  MAYBRIDGE\nmr@NMR_250MHZ
##.OBSERVE FREQUENCY= 250.131544655141
##.OBSERVE NUCLEUS= ^1H
##.ACQUISITION MODE= SIMULTANEOUS (DQD)
##.ACQUISITION SCHEME= undefined
##.AVERAGES= 16
##.DIGITISER RES= 18
##SPECTROMETER/DATA SYSTEM= dpx250
##.PULSE SEQUENCE= zg30
##.SOLVENT NAME= CDCl3
##.SHIFT REFERENCE= (INTERNAL, CDCl3, 0, 16.522)
##AUDIT TRAIL= $$ (NUMBER, WHEN, WHO, WHERE, WHAT)
$$ ##TITLE= Audit trail, XWIN-NMR		Version 3.5
$$ ##JCAMPDX= 5.01
$$ ##ORIGIN= Bruker BioSpin GmbH
$$ ##OWNER= nmr
$$ C:/u/data/dgb/nmr/ADRS/15130/pdata/1/auditp.txt
$$ ##AUDIT TRAIL=  $$ (NUMBER, WHEN, WHO, WHERE, WHAT)
(   1,<2006-01-24 11:19:47.47 +000>,<MAYBRIDGE\nmr>,<NMR_250MHZ>,
      <created by zg, POWCHK disabled, PULCHK disabled
       configuration hash MD5:
       62 19 C7 07 E1 42 D1 B7 37 6C 3D D0 77 39 F9 E6
       data hash MD5: 64K
       AD 71 76 6E B7 D1 02 70 FD 0A 10 CB 2B 9B 82 D7>)
(   2,<2006-01-24 11:19:53.06 +000>,<MAYBRIDGE\nmr>,<NMR_250MHZ>,
      <Start of raw data processing
       ef LB = 0.3 FT_mod = 6 PKNL = 1 SI = 32K 
       data hash MD5: 32K
       26 2D 9D DA 19 CC 79 B4 C0 0D B7 5D 9D 77 21 C5>)
(   3,<2006-01-24 11:19:55.37 +000>,<MAYBRIDGE\nmr>,<NMR_250MHZ>,
      <apk 
       data hash MD5: 32K
       E1 FC 1B 86 45 98 05 A5 99 92 A2 3D EE 7A 67 82>)
(   4,<2006-01-24 11:19:56.43 +000>,<MAYBRIDGE\nmr>,<NMR_250MHZ>,
      <abs ABSG = 5 
       data hash MD5: 32K
       6A 1B 68 FF 6C 21 5B CC 98 49 90 73 BE A4 EA 89>)
$$ ##END=
$$ 
$$ hash MD5
$$ F0 3D BE BA A7 AD D7 41 DD A2 55 5A A5 10 48 60
##$RELAX= 
##$RELAX= 
##$RELAX= 
##$RELAX= 
##$RELAX= 
##$RELAX= 
##$RELAX= 
$$ Bruker specific parameters
$$ --------------------------
##$DU= <C:\Restored>
##$EXPNO= 15130
##$NAME= <ADRS>
##$PROCNO= 1
##$TYPE= <nmr>
##$USER= <dgb>
##$AMP= (0..31)
100 100 100 100 100 100 100 100 100 100 100 100 100 100 100 100 100 100 
100 100 100 100 100 100 100 100 100 100 100 100 100 100 
##$AQSEQ= 0
##$AQ_mod= 3
##$AUNM= <au_zg>
##$AUTOPOS= <9 >
##$BF1= 250.13
##$BF2= 250.13
##$BF3= 250.13
##$BF4= 250.13
##$BF5= 500.13
##$BF6= 500.13
##$BF7= 500.13
##$BF8= 500.13
##$BYTORDA= 1
##$CFDGTYP= 0
##$CFRGTYP= 5
##$CHEMSTR= <none>
##$CNST= (0..31)
1 1 145 1 1 1 1 1 1 1 1 1 1 1 1 1 1 1 1 1 1 1 1 1 1 1 1 1 1 1 1 1 
##$CPDPRG= <>
##$CPDPRG1= <>
##$CPDPRG2= <>
##$CPDPRG3= <>
##$CPDPRG4= <mlev>
##$CPDPRG5= <mlev>
##$CPDPRG6= <mlev>
##$CPDPRG7= <mlev>
##$CPDPRG8= <mlev>
##$CPDPRGB= <>
##$CPDPRGT= <>
##$D= (0..31)
0 1 0 0 0 0 0 0 0 0.06 0 0 0 0 0 0 0.0002 0 0 0 0 0 0 0 0 0 0 0 0 0 0 
0 
##$DATE= 1138101585
##$DBL= (0..7)
120 120 120 120 120 120 120 120 
##$DBP= (0..7)
150 150 150 150 150 150 150 150 
##$DBP07= 0
##$DBPNAM0= <>
$$ [...]
##$SUBNAM7= <"">
##$SUBNAM8= <"">
##$SUBNAM9= <"">
##$SW= 20.6930455092707
##$SWIBOX= (0..15)
0 0 3 0 0 0 0 0 0 0 0 0 0 0 0 0 
##$SW_h= 5175.983436853
##$TD= 65536
##$TD0= 1
##$TE= 294.16
##$TE2= 300
##$TE3= 300
##$TEG= 300
##$TL= (0..7)
0 120 120 120 120 120 120 120 
##$TP= (0..7)
150 150 150 150 150 150 150 150 
##$TP07= 0
##$TPNAME0= <>
##$TPNAME1= <>
##$TPNAME2= <>
##$TPNAME3= <>
##$TPNAME4= <>
##$TPNAME5= <>
##$TPNAME6= <>
##$TPNAME7= <>
##$TPOAL= (0..7)
0.5 0.5 0.5 0.5 0.5 0.5 0.5 0.5 
##$TPOFFS= (0..7)
0 0 0 0 0 0 0 0 
##$TUNHIN= 0
##$TUNHOUT= 0
##$TUNXOUT= 0
##$USERA1= <user>
##$USERA2= <user>
##$USERA3= <user>
##$USERA4= <user>
##$USERA5= <user>
##$V9= 5
##$VALIST= <valist>
##$VCLIST= <CCCCCCCCCCCCCCC>
##$VD= 0
##$VDLIST= <DDDDDDDDDDDDDDD>
##$VPLIST= <PPPPPPPPPPPPPPP>
##$VTLIST= <TTTTTTTTTTTTTTT>
##$WBST= 1024
##$WBSW= 4
##$XGAIN= (0..3)
0 0 0 0 
##$XL= 0
##$YL= 0
##$YMAX_a= 518310
##$YMIN_a= -523440
##$ZGOPTNS= <>
##$ZL1= 120
##$ZL2= 120
##$ZL3= 120
##$ZL4= 120
##$ABSF1= 16.522
##$ABSF2= -4.171173
##$ABSG= 5
##$ABSL= 3
##$ALPHA= 0
##$AQORDER= 0
##$ASSFAC= 0
##$ASSFACI= 0
##$ASSFACX= 0
##$ASSWID= 0
##$AUNMP= <proc_1d>
##$AZFE= 0.1
##$AZFW= 0.1
##$BCFW= 0
##$BC_mod= 0
##$BYTORDP= 0
##$COROFFS= 0
##$CY= 12.5
##$DATMOD= 1
##$DC= 0
##$DFILT= <>
##$DTYPP= 0
##$F1P= 14.0000005364418
##$F2P= -0.99999901652339
##$FCOR= 0.5
##$FTSIZE= 32768
##$FT_mod= 6
##$GAMMA= 0
##$GB= 0
##$INTBC= 1
##$INTSCL= 1
##$ISEN= 128
##$LB= 0.3
##$LEV0= 0
##$LPBIN= 0
##$MAXI= 10000
##$MC2= 0
##$MEAN= 0
##$ME_mod= 0
##$MI= 0
##$NCOEF= 0
##$NC_proc= -2
##$NLEV= 6
##$NOISF1= 0
##$NOISF2= 0
##$NSP= 0
##$NTH_PI= 0
##$NZP= 0
##$OFFSET= 16.522
##$PC= 1
##$PHC0= 239.9237
##$PHC1= 8.737095
##$PH_mod= 1
##$PKNL= yes
##$PPARMOD= 0
##$PSCAL= 4
##$PSIGN= 0
##$REVERSE= no
##$SF= 250.13
##$SI= 32768
##$SIGF1= 0
##$SIGF2= 0
##$SINO= 400
##$SIOLD= 32768
##$SREGLST= <1H.CDCl3>
##$SSB= 0
##$STSI= 32768
##$STSR= 0
##$SW_p= 5175.98343685301
##$SYMM= 0
##$S_DEV= 0
##$TDeff= 65536
##$TDoff= 0
##$TI= <Analysis number 999999
Compound Code 99
Book Reference 9
Project Code 9>
##$TILT= no
##$TM1= 0
##$TM2= 0
##$TOPLEV= 0
##$USERP1= <user>
##$USERP2= <user>
##$USERP3= <user>
##$USERP4= <user>
##$USERP5= <user>
##$WDW= 1
##$XDIM= 32768
##$YMAX_p= 528727096
##$YMIN_p= -79247
$$ End of Bruker specific parameters
$$ ---------------------------------
##NTUPLES= NMR SPECTRUM
##VAR_NAME=  FREQUENCY,     SPECTRUM/REAL,   SPECTRUM/IMAG
##SYMBOL=    X,             R,               I
##VAR_TYPE=  INDEPENDENT,   DEPENDENT,       DEPENDENT
##VAR_FORM=  AFFN,          ASDF,            ASDF
##VAR_DIM=   32768,         32768,           32768
##UNITS=     HZ,            ARBITRARY UNITS, ARBITRARY UNITS
##FACTOR=    0.157963299565203, 1,           1
##FIRST=     4132.6476996994, 0,             0
##LAST=      -1043.33573715361, 0,           0
##MIN=       -1043.33573715361, -79247,      0
##MAX=       4132.6476996994, 528727096,     0
$$ Real data points
##PAGE= N=1
##DATA TABLE= (X++(R..R)), XYDATA
$$ [...]
$$ plain form
16123 -907 15543 3202 7422 5369 8235 16621 -2670 -21535 -29442 -20293 -11980 -3047 63 -1685
16109 -1685 4018 6761 22953 14360 7370 2821 4305 11221 874 -330 -2881 -10621 -12730 838
16095 838 -7191 -22847 -21368 -24305 -18035 -6808 -11800 -19609 -12388 1005 20805 8017 6004 6900
16081 6900 2392 278 -4431 -5748 -2255 5582 10801 13230 7851 673 4031 9414 10393 -6768 1932
16066 1932 20421 24099 13555 11717 9850 13106 22624 21199 15789 6747 -4546 -14642 -9310 1037
16052 1037 11587 21395 21279 8553 11245 11641 -9765 -16333 -10570 -1395 -3177 2283 7955 3097
16038 3097 3971 -1220 -143 10350 15560 11521 -6592 -15631 -15187 -6835 -2867 2492 1277 -7721 -4198
16023 -4198 -3134 -5474 4405 466 -2045 -5352 -10701 -13031 -15935 -2137 10365 1116 -7644 -2809
$$ packed form
16123i07J6450j2341M220k053K866Q386j9291j8865p907R149Q313Q933L110j748
16109a685N703K743J6192q593o990m549J484O916j0347j204k551p740k109J3568
16095H38q029j5656J479k937O270J1227m992p809P221J3393J9800j2788k013Q96
16081F900m508k114m709j317L493P837N219K429n379p178L358N383R79j7161Q700
16066A932J8489L678j0544j838j867L256R518j425n410r042j1293j0096N332J0347
16052A037J0550R808j16j2726K692L96k1406o568N763R175j782N460N672m858
16038C097Q74n191J077J0493N210m039j8113r039M44Q352L968N359j215q998L523
16023d198J064k340R879l939k511l307n349k330k904J3798J2502r249q760M835
$$ plain form
16009 -2809 -18960 -14259 -4699 -1126 5450 5723 8463 13690 6615 2209 -5454 -11417 964 27974
15995 27974 35875 29541 34761 51668 51139 29395 8629 -1669 -1318 14766 26189 19060 13442
15982 13442 11496 2911 -2477 5743 17506 7697 6569 16107 10430 11574 9466 10557 10743 11916
15968 11916 10613 7900 -4782 -19338 -20219 -7916 -7937 -4094 -2766 -15 838 2613 6045 16943
15954 16943 17053 10750 7455 9981 12641 130 -2431 -4095 3096 6745 -6019 -10856 6531 1850
15940 1850 -14885 -18668 -28998 -31793 -17356 -2002 8477 5136 -5619 12508 28256 11522
15928 11522 10791 4148 2437 3600 -12448 -15799 -24170 -21485 -15264 -1703 3662 -1085 -9948 -11082
15914 -11082 -9822 20875 31685 28 -2862 2547 -4344 278 6309 24539 36514 28146 20966
$$ packed form
16009b809j6151M701R560L573O576K73K740N227p075m406p663n963J2381K7010
15995B7974P901o334N220J6907n29k1744k0766j0298L51J6084J1423p129n618
15982A3442j946q585n388Q220J1763r809j128R538n677J144k108J091J86J173
15968A1916j303k713j2682j4556q81J2303k1L843J328K751Q53J775L432J0898
15954A6943J10o303l295K526K660j2511k561j664P191L649j2764m837J7387m681
15940A850j6735l783j0330k795J4437J5354J0479l341j0755J8127J5748j6734
15928A1522p31o643j711J163j6048l351q371K685O221J3561N365m747q863j134
15914a1082J260L0697J0810l1657k890N409o891M622O031J8230J1975q368p180
$$ plain form
15901 20966 -1987 -15391 -12256 -11802 -18230 -11927 3150 22124 25658 12721 2534 6423 10473
15888 10473 11655 24941 44977 37222 10689 1855 -6038 -13280 -11768 -11423 -3706 -5440 -3532 11406
15874 11406 10293 7040 12779 19241 6418 5837 22206 28200 19508 21308 28240 22146 3513 1624
15860 1624 11159 8906 7380 1414 14179 22274 23786 19417 33049 54192 63077 46014 30083
15847 30083 22446 10525 18629 23021 20165 19503 16768 -6283 -7590 3323 8696 11102 4279 -6497
15833 -6497 -7735 1293 12962 9213 3522 -569 -5361 3075 7772 19770 20053 34048 44103 38735
15819 38735 45853 28791 12593 17570 14348 19180 39007 40529 32456 6929 438 1742 15656
15806 15656 12241 878 -3854 12448 23726 25085 17588 19740 -280 -10797 -9313 341 5478
$$ packed form
15901B0966k2953j3404L135M54o428O303J5077J8974L534j2937j0187L889M050
15888A0473J182J3286K0036p755k6533q834p893p242J512L45P717j734J908J4938
15874A1406j113l253N739O462j2823n81J6369N994q692J800O932o094j8633j889
15860A624R535k253j526n966J2765Q095J512m369J3632K1143Q885j7063j5931
15847C0083p637j1921Q104M392k856o62k735k3051j307J0913N373K406o823j0776
15833f497j238R028J1669l749n691m091m792Q436M697J1998K83J3995J0055n368
15819C8735P118j7062j6198M977l222M832J9827J522q073k5527o491J304J3914
15806A5656l415j1363m732J6302J1278J359p497K152k0020j0517J484R654N137
$$ plain form
15793 5478 11062 6550 6686 -4577 -4091 -4934 -5955 5859 9872 12870 19850 29486 27507 20479 17451
15778 17451 12910 11996 7270 12568 6012 9962 18493 18329 21018 11107 73 5043 17664 19650
15764 19650 23025 28067 21581 4105 1738 -12805 -169 11692 7914 10385 17223 23941 14201
15751 14201 14108 14030 11165 9301 3423 -7643 -2113 13703 16076 15004 11418 4235 3825 8209 2161
15736 2161 17448 17826 6046 -3330 1163 -1829 -11447 -1818 -1598 -1133 -4447 -10755 -8539 -15007 -2826
15721 -2826 23752 25830 10067 25615 32103 25679 20672 17207 15745 11135 5662 -4630 -11671 -10130
15707 -10130 -5151 5953 2845 8295 11503 7210 -2785 1994 2259 6383 12708 -3376 -2871 -5382
15693 -5382 6672 5111 9826 13353 12377 14512 3852 18894 23178 3794 -1616 8516 10420 6257
$$ packed form
15793E478N584m512J36j1263M86q43j021J1814M013K998O980R636j979p028l028
15778A7451m541r14m726N298o556L950Q531j64K689r911j1034M970J2621J986
15764A9650L375N042o486j7476k367j4543J2636J1861l778K471O838O718r740
15751A4201r3p8k865j864n878j1066N530J5816K373j072l586p183m10M384o048
15736B161J5287L78j1780r376M493k992r618R629K20M65l314o308K216o468J2181
15721b826K6578K078j5763J5548O488o424n007l465j462m610n473j0292p041J541
15707a0130M979J1104l108N450L208m293r995M779K65M124O325j6084N05k511
15693e382J2054j561M715L527r76K135j0660J5042M284j9384n410J0132J904m163
$$ plain form
15679 6257 14282 12955 19318 16821 -5377 -18343 -4062 -573 -1675 3364 18015 12393 6454 22187
15665 22187 20417 22845 20427 10335 -4713 -13886 1360 4286 -959 10325 19082 12200 15332
15652 15332 12123 1677 -9255 581 4418 -2063 669 -2581 -7462 -5082 7234 11840 20499 19752
15638 19752 9081 -5575 -20943 -19398 -5882 257 1576 -3287 -7821 -2264 8727 18512 15340
15625 15340 19780 15959 21723 20790 20479 13238 333 -7 -3228 1696 27493 33541 23866 7311
15611 7311 7611 9745 10146 8408 7381 7114 13493 21998 17459 1605 -3003 9001 13305 17122 23004
15596 23004 24350 24531 27119 28958 24233 14670 14276 13909 17967 9782 17897 22057 4975 -9593 -9679
15581 -9679 1915 14676 10329 1749 -1194 1759 -7605 -10819 -1137 -6359 -10312 -2530 5926 5873 14649
$$ packed form
15679F257Q025j327O363k497k2198j2966J4281L489j102N039J4651n622n939J5733
15665B2187j770K428k418j0092j5048r173J5246K926n245J1284Q757o882L132
15652A5332l209j0446j0932R836L837o481K732l250m881K380J2316M606Q659p47
15638A9752j0671j4656j5368J545J3516O139J319m863m534N557J0991R785l172
15625A5340M440l821N764r33l11p241j2905l40l221M924K5797O048r675j6555
15611G311L00K134M01j738j027k67O379Q505m539j5854m608J2004M304L817N882
15596B3004J346J81K588J839m725r563l94l67M058q185Q115M160j7082j4568q6
15581i679J1594J2761m347q580k943K953r364l214R682n222l953P782Q456n3Q776
$$ plain form
15566 14649 19044 19678 26415 12408 -7933 5910 29857 30309 -5472 -31398 -20958 -10775 5285
15553 5285 8386 23828 36463 27175 16311 -519 8306 21472 18955 13310 23794 21556 26520
15540 26520 36015 28917 32531 32692 30133 38615 42542 44323 42234 34897 20359 6820 6254 690
15526 690 -1472 -4904 -2473 11097 15397 13511 10948 11816 3684 19982 17744 20234 15993 7003 383
15511 383 -5128 -4661 927 5423 -1765 -2891 -4571 -1232 2782 2209 -13635 -4648 126 11991 31039
15496 31039 31493 7805 -1126 2103 -5337 10024 30815 34400 22875 17654 4100 8523 19272
15483 19272 21724 15435 22386 30727 27811 19232 14886 15306 23778 27517 39620 32997 33034 17299 2568
15468 2568 9144 3672 -7412 387 9692 1352 -7893 -13643 -1037 11995 33723 40550 30322
$$ packed form
15566A4649M395O34O737j4007k0341J3843K3947M52l5781k5926J0440J0183J6060
15553E285L101J5442J2635r288j0864j6830Q825J3166k517n645J0484k238M964
15540B6520R495p098L614J61k559Q482L927J781k089p337j4538j3539n66n564
15526F90k162l432K431J3570M300j886k563Q68q132J6298k238K490m241q990o620
15511C83n511M67N588M496p188j126j680L339M014n73j5844Q987M774J1865J9048
15496C1039M54k3688q931L229p440J5361K0791L585j1525n221j3554M423J0749
15483A9272K452o289O951Q341k916q579m346M20Q472L739J2103o623L7j5735j4731
15468B568O576n472j1084P799R305q340r245n750J2606J3032K1728O827j0228
$$ plain form
15455 30322 33434 23636 13943 7966 8813 13754 15920 21337 31620 40644 31508 26627 27735 17228
15441 17228 19857 13782 16070 24209 12310 -2313 -4369 9867 22290 8500 13699 26833 34513
15428 34513 27156 32312 44103 37981 27256 16103 31693 44127 40004 26501 13056 -1352
15416 -1352 -1563 4178 12347 25264 34120 48176 47567 28308 17279 5751 21881 26158 27836 30006
15402 30006 27220 29657 36772 15034 -6679 -17650 -20665 -12769 995 13428 32114 38264 45721
15389 45721 63019 41625 25001 6381 -5808 2980 24567 22557 10616 14020 24419 22720
15377 22720 21312 25673 26712 26878 22134 24843 34434 39432 36926 28563 26650 15665 17170 11754
15363 11754 8024 8141 22598 49294 58494 54709 44685 44234 63269 56487 41413 41468 46640 54781
$$ packed form
15455C0322L112r798r693n977Q47M941K166N417J0283R024r136m881J108j0507
15441A7228K629o075K288Q139j1899j4623k056J4236J2423j3790N199J3134P680
15428C4513p357N156J1791o122j0725j1153J5590J2434m123j3503j3445j4408
15416a352k11N741Q169J2917Q856J4056o09j9259j1029j1528J6130M277J678K170
15402C0006k786K437P115k1738k1713j0971l015P896J3764J2433J8686O150P457
15389D5721J7298k1394j6624j8620j2189Q788K1587k010j1941L404J0399j699
15377B2720j408M361J039J66m744K709R591M998k506q363j913j0985J505n416
15363A1754l730J17J4457K6696R200l785j0024m51J9035o782j5074N5N172Q141
$$ plain form
15349 54781 40679 41953 29672 26424 25117 24510 4069 3264 12036 13733 21641 34602 15568 23127
15335 23127 32771 33709 36727 27491 11963 14071 25980 28932 33314 35745 36957 29080 37511 35438
15321 35438 32260 40615 40598 27017 24137 21725 20408 14485 33522 30182 28159 46689 49023 56689
15307 56689 49389 46373 32497 6878 17017 27614 34477 28317 24955 26218 26805 16892 21659 22601
15293 22601 20801 32821 35860 23468 30212 35143 36185 33731 16113 16563 32683 30919 34421 28567
15279 28567 27988 19469 13235 13398 16173 18541 13504 16327 8523 6398 1668 6222 -302 10207 13233
15264 13233 14328 23456 28839 28122 25455 25426 19679 7488 -3193 -5576 676 6831 18173 24636
15250 24636 35899 45006 46068 48244 41520 47045 45737 20012 21757 40965 43998 27940 8996
$$ packed form
15349E4781j4102J274j2281l248j307o07k0441q05Q772J697P908J2961j9034P559
15335B3127R644R38L018r236j5528K108J1909K952M382K431J212p877Q431k073
15321C5438l178Q355j7j3581k880k412j317n923J9037l340k023J8530K334P666
15307E6689p300l016j3876k5619J0139J0597O863o160l362J263N87r913M767R42
15293B2601j800J2020L039j2392O744M931J042k454j7618M50J6120j764L502n854
15279B8567n79q519o234J63K775K368n037K823p804k125m730M554o524J0509L026
15264A3233J095R128N383p17k667k9n747j2191j0681k383O252O155J1342O463
15250B4636J1263R107J062K176o724N525j308k5725J745J9208L033j6058j8944
$$ plain form
15237 8996 367 12518 24814 34756 42854 42357 40470 28912 9447 24265 27337 29301 43556
15224 43556 43603 33040 31916 43119 55257 63386 55710 49262 47384 35180 19960 16802 20967 22803
15210 22803 37725 40969 40784 35963 34168 36903 42904 33090 38759 48935 41661 35414 17728 13819
15196 13819 14067 6006 11722 26642 30125 25322 28596 28421 42342 39840 33585 33005 17377 14617
15182 14617 15017 23367 12569 -1118 -1706 9633 20700 39984 39579 34397 23430 14334 15659 20634
15168 20634 24321 29392 33045 29939 27324 31632 43237 37069 38263 47946 57546 63107 43536 41676
15154 41676 50644 57628 50726 29841 20413 24996 20676 9806 9784 14986 32669 22436 26683 31589
15140 31589 31047 24472 6489 -908 17585 30355 31559 22541 19667 20508 23058 37273 37661 25721
$$ packed form
15237H996q629J2151J2296R942Q098m97j887j1558j9465J4818L072J964J4255
15224D3556M7j0563j124J1203J2138Q129p676o448j878j2204j5220l158M165J836
15210B2803J4922L244j85m821j795K735O001r814N669J0176p274o247j7686l909
15196A3819K48q061N716J4920L483m803L274j75J3921k502o255n80j5628k760
15182A4617M00Q350j0798j3687n88J1339J1067J9284m05n182j0967r096J325M975
15168B0634L687N071L653l106k615M308J1605o168J194R683R600N561j9571j860
15154D1676Q968O984o902k0885r428M583m320j0870k2N202J7683j0233M247M906
15140C1589n42o575j7983p397J8493J2770J204r018k874Q41K550J4215L88j1940
$$ plain form
15126 25721 31095 24514 10395 3978 10508 7975 8050 29063 52611 42538 41941 39675 36903 36844 23639
15111 23639 23819 32472 41396 43387 44811 29367 30384 38822 38912 40852 40051 35324 28256 28320 24072 37500
15095 37500 31525 36729 41670 45335 38552 26009 22482 28416 31665 28940 12316 -99 -4210 1329
15081 1329 22013 24880 16440 21926 49034 47971 52955 58622 48370 28117 34448 47886 42176
15068 42176 35640 41563 39707 35361 37641 56195 53352 56270 66828 55339 51387 51144 60489 63961
15054 63961 69386 92256 89984 76209 65032 64469 59615 57600 72639 79405 71752 81302 113194
15041 113194 134951 184855 270120 382348 511209 639533 746407 803195 805422 738165 633061
15030 633061 502863 373866 258747 199213 157747 120364 78050 43863 31632 33390 48598
$$ packed form
15126B5721N374o581j4119o417O530k533P5K1013K3548j0073n97k266k772n9j3205
15111B3639J80Q653Q924J991J424j5444J017Q438R0J940q01m727p068O4m248J3428
15095C7500n975N204M941L665o783j2543l527N934L249k725j6624j2415m111N539
15081A329K0684K867q440N486K7108j063M984N667j0252k0253O331J3438n710
15068D2176o536N923j856m346K280J8554k843K918J0558j1489l952k43R345L472
15054F3961N425K2870k272j3775j1177n63m854k015J5039O766p653R550L1892
15041A13194K1757M9904Q5265J12228J28861J28324J06874N6788K227o7257j05104
15030F33061j30198j28997j15119n9534m1466l7383m2314l4187j2231J758J5208
$$ plain form
15019 48598 47581 52629 55630 52989 48035 56700 61738 44024 40452 35959 42137 31103 30188 40002
15005 40002 50478 40630 40856 51954 60340 41094 37443 29400 28349 25897 31028 36013 36496 36185
14991 36185 30101 36667 31998 27615 33617 28793 25690 48422 58208 50857 30030 31257 48280 49357
14977 49357 34065 28132 41660 54119 51992 42798 42959 46371 43803 42955 46594 45993 43387 36319
14963 36319 31782 33045 36988 46815 57333 69554 59321 45306 43651 43999 48224 41837 28916
14950 28916 30125 38909 41123 16391 -1355 4197 26240 36603 30645 27471 43238 43449 49466
14937 49466 60827 45962 49699 51711 55995 57076 62207 56426 55446 44503 51255 43696 47947 48290
14923 48290 44755 52262 70535 74152 70011 56402 51549 41111 43146 42319 46561 45042 40077 43309
$$ packed form
15019D8598j017N048L001k641m954Q665N038j7714l572m493O178j1034r15R814
15005D0002J0476r848K26J1098Q386j9246l651q043j051k452N131M985M83l11
14991C6185o084O566m669m383O002m824l103K2732R786p351k0827J227J7023J077
14977D9357j5292n933J3528J2459k127r194J61L412k568q48L639o01k606p068
14963C6319m537J263L943R827J0518J2221j0233j4015j655L48M225o387j2921
14950B8916J209Q784K214k4732j7746N552K2043J0363n958l174J5767K11O017
14937D9466J1361j4865L737K012M284J081N131n781r80j0943O752p559M251L43
14923D8290l535P507J8273L617m141j3609m853j0438K035q27M242j519m965L232
$$ plain form
14909 43309 61278 65525 55289 50126 57233 48796 40866 50495 66662 69857 83965 89155 73225
14896 73225 53729 38000 36503 40926 53451 58529 66040 63263 50443 40790 39732 39388 39953 32715
14882 32715 45906 55110 50188 48473 56372 60694 53297 46363 42325 48744 43975 40102 37557 36978
14868 36978 52199 67041 69939 56874 37456 25458 19129 29751 33864 47743 61857 51224
14856 51224 51542 52455 40615 39721 38957 34163 44289 50305 39103 29004 36407 45829 58939 61098
14842 61098 51468 43873 44357 47393 41788 41546 56949 59218 57746 51774 53109 58752 64493 68659 52722
14827 52722 42551 58309 64164 74536 76648 72090 67813 74031 83124 90979 79950 61567 70437
14814 70437 81702 79727 64180 66656 64027 67363 65102 53672 55275 59825 61814 82930 102921
$$ packed form
14909D3309J7969M247j0236n163P107q437p930R629J6167L195J4108N190j5930
14896G3225j9496j5729j497M423J2525N078P511k777j2820r653j058l44N65p238
14882C2715J3191R204m922j715P899M322p397o934m038O419m769l873k545n79
14868C6978J5221J4842K898j3065j9418j1998o329J0622M113J3879J4114j0633
14856E1224L18R13j1840q94p64m794J0126O016j1202j0099P403R422J3110K159
14842F1098r630p595M84L036n605k42J5403K269j472n972J335N643N741M166j5937
14827E2722j0171J5758N855J0372K112m558m277O218R093P855j1029j8383Q870
14814G0437J1265j975j5547K476k629L336k261j1430J603M550J989K1116J9991
$$ plain form
14801 102921 98159 79744 66032 60674 62504 67037 56175 58493 78393 92195 92902 105578 96190
14788 96190 84455 73633 77966 70085 59083 69324 62249 43276 30018 48771 52550 58128 62649
14775 62649 51578 53576 52656 47828 35417 37854 56521 77056 83496 87105 95550 110170 118326
14762 118326 102271 80814 61295 59430 59719 66637 69621 60155 75107 88791 85213 73565 80649
14749 80649 95206 93707 83980 81725 71991 60149 65037 83688 90049 91497 96907 98616 92419 87037
14735 87037 76269 84015 104130 113338 112459 101421 99011 108822 110047 104596 107008 133787 154281
14722 154281 149372 140431 130292 121835 110074 93765 93739 113765 117650 129244 134135 118639 117804
14709 117804 119797 109628 105938 112522 116687 104903 89287 79046 89441 105961 105563 97320 97076
$$ packed form
14801A02921m762j8415j3712n358J830M533j0862K318J9900J3802P07J2676r388
14788I6190j1735j0822M333p881j1002J0241p075j8973j3258J8753L779N578M521
14775F2649j1071J998r20m828j2411K437J8667K0535O440L609Q445J4620Q156
14762A18326j6055k1457j9519j865K89O918K984r466J4952J3684l578j1648P084
14749H0649J4557j499r727k255r734j1842M888J8651O361J448N410J709o197n382
14735H7037j0768P746K0115R208q79j1038k410R811J225n451K412K6779K0494
14722A54281m909q941j0139q457j1761j6309k6K0026L885J1594M891j5496q35
14709A17804J993j0169l690O584M165j1784j5616j0241J0395J6520l98q243k44
$$ plain form
14696 97076 103615 120991 131093 130220 98344 88053 89501 101756 105387 109316 98859 83330 70222
14683 70222 65263 51955 66242 88496 100842 108231 104083 85983 81930 73652 57771 41030 43102
14670 43102 44591 42975 41157 40910 50455 69729 93691 113187 107421 106623 104057 84351 69147 63123
14656 63123 65994 89376 100888 103239 102611 111636 112299 113072 111771 100356 105421 99667 97884 103511
14642 103511 112736 125822 115903 87716 89013 92587 102865 126649 131302 132574 117272 99504 96943
14629 96943 100130 113680 109717 103921 111129 119955 125965 122587 115909 111465 107116 112747 102642 80015
14615 80015 86657 112201 115075 108095 109709 125564 120182 116949 129521 133707 121652 109697 104423
14602 104423 122236 152890 169620 170819 179047 197739 218998 240524 270788 278987 273749 275376
$$ packed form
14696I7076O539J7376J0102q73l1876j0291J448J2255L631L929j0457j5529j3108
14683G0222m959j3308J4287K2254J2346P389m148j8100m053q278j5881j6741K072
14670D3102J489j616j818k47R545J9274K3962J9496n766p98k566j9706j5204o024
14656F3123K871K3382J1512K351o28R025O63P73j301j1415N065n754j783N627
14642A03511R225J3086r919k8187J297L574J0278K3784M653J272j5302j7768k561
14629I6943L187J3550l963n796P208Q826O010l378o678m444m349N631j0105k2627
14615H0015O642K5544K874o980J614J5855n382l233J2572M186j2055j1955n274
14602A04423J7813L0654J6730J199Q228J8692K1259K1526L0264Q199n238J627
$$ plain form
14590 275376 291057 293473 284959 276548 263507 225068 190629 180127 178353 183141 181214 182826 199343
14577 199343 198108 204173 213662 212976 208994 191551 184641 179415 177689 165018 164261 169598 178197 190641
14563 190641 191845 191645 193485 193254 208437 226380 226849 214902 229503 229552 213983 204244 199415 219348
14549 219348 236943 257513 258847 271073 281102 283820 282819 286881 296248 296781 274445 270023 283764
14536 283764 305430 314387 320245 337891 338338 347442 367354 368948 380228 381071 372051 393498 425174
14523 425174 443502 450511 453053 442813 453274 476556 491898 517810 546882 569958 594156 610552
14511 610552 616632 627202 652947 674007 738077 785859 821883 877156 933844 1008256 1097690 1218580
14499 1218580 1372785 1546996 1746082 1923952 2041898 2105255 2126527 2127795 2128331 2193287 2324416
$$ packed form
14590B75376J5681K416q514q411j3041l8439l4439j0502j774M788j927J612J6517
14577A99343j235O065R489o86l982j7443o910n226j726j2671p57N337Q599J2444
14563A90641J204k00J840k31J5183J7943M69j1947J4601M9j5569r739m829J9933
14549B19348J7595K0570J334J2226J0029K718j001M062R367N33k2336m422J3741
14536B83764K1666Q957N858J7646M47R104J9912J594J1280Q43r020K1447L1676
14523D25174J8328P009K542j0240J0461K3282J5342K5912K9072K3076K4198J6396
14511F10552O080J0570K5745K1060O4070M7782L6024N5273N6688P4412Q9434J20890
14499A218580J54205J74211J99086J77870J17946O3357K1272J268N36O4956J31129
$$ plain form
14488 2324416 2547645 2885731 3318416 3800285 4355280 4952730 5570876 6263650 7148262
14479 7148262 8356597 10129763 12902284 17345465 24602863 36047197 53024569 75177990
14471 75177990 100570653 124211359 141076461 146318689 139442243 121467681 98249618
14464 98249618 73604327 52398297 35824320 24275636 16687084 11856392 8788282
14457 8788282 6803173 5495819 4637323 4063712 3662516 3350632 3068217 2812012 2534272
14448 2534272 2255697 2000912 1793642 1628533 1517543 1458235 1461300 1494302 1543962 1571301
14438 1571301 1572159 1497198 1370514 1209374 1036464 887434 760367 652932 575925 532469
14428 532469 491625 466906 446034 413617 409157 396576 360151 341528 352097 350420 328855 320822
$$ packed form
14488B324416K23229L38086M32685M81869N54995N97450O18146O92774Q84612
14479G148262J208335J773166K772521M443181P257398J1444334J6977372K2153421
14471G5177990K5392663K3640706J6865102N242228o876446j7974562k3218063
14464I8249618k4645291k1206030j6573977j1548684p588552m830692l068110
14457H788282j985109j307354q58496n73611m01196l11884k82415k56205k77740
14448B534272k78575k54785k07270j65109j10990n9308L065L3002M9660K7339
14438A571301Q58p4961j26684j61140j72910j49030j27067j07435p7007m3456
14428E32469m0844k4719k0872l2417m460j2581l6425j8623J0569j677k1565q033
$$ plain form
14416 320822 317050 308521 289135 262925 252845 248167 243339 244520 245858 239031 233211 228312 223374
14403 223374 210924 211739 232682 245058 236480 225750 228704 216419 204007 210117 204729 207732 217709
14390 217709 205294 208064 201513 196585 193918 195315 192470 184021 182777 179781 174643 177693 176774 178821
14376 178821 182194 201891 200965 198532 198899 200051 220204 225075 218893 211167 201875 187809 161525 169403
14362 169403 163735 159932 171392 174183 176249 171134 158198 156399 152057 128907 117200 105562 79111
14349 79111 82100 83167 95800 115002 126994 131024 127159 141722 160628 164626 182644 181659 196548
14336 196548 196797 193314 190435 178667 187027 200479 208323 208992 204397 202141 208367 214068 209755 211584
14322 211584 213840 228318 245399 229989 212251 202030 195785 187059 190151 200038 201709 209176 199696
$$ packed form
14416C20822l772q529j9386k6210j0080m678m828J181J338o827n820m899m938
14403B23374j2450Q15K0943J2376q578j0730K954j2285j2412O110n388L003R977
14390B17709j2415K770o551m928k667J397k845q449j244k996n138L050r19K047
14376A78821L373J9697r26k433L67J152K0153M871o182p726r292j4066k6284P878
14362A69403n668l803J1460K791K066n115j2936j799m342k3150j1707j1638k6451
14349G9111K989J067J2633J9202J1992M030l865J4563J8906L998J8018r85J4889
14336A96548K49l483k879j1768Q360J3452P844O69m595k256O226N701m313J829
14322B11584K256J4478J7081j5410j7738j0221o245q726L092R887J671P467r480
$$ plain form
14309 199696 197030 197705 191831 187706 200378 202587 190646 185024 180866 201284 206881 231063 245799
14296 245799 237522 223038 201134 185958 184989 189557 200144 208145 196925 179109 189174 200131
14284 200131 199812 202623 224135 237827 240301 240125 245642 232900 214408 204527 199148 200733 206356 206349
14270 206349 216447 221703 226767 238153 251679 240596 237135 236918 224508 231779 234411 228111 234096
14257 234096 251179 264382 254582 236965 233565 237108 225270 228760 237259 244043 242463 227542 228844
14244 228844 207439 193382 187103 193948 208959 226004 240364 242135 242962 255692 263483 245491 228815
14231 228815 224081 242590 240227 245803 261214 272418 255437 263179 273280 284391 288004 280708 277259
14218 277259 262472 268216 290732 291872 291069 289831 286191 264247 263782 266133 281736 279331 279192 283407
$$ packed form
14309A99696k666O75n874m125J2672K209j1941n622m158K0418N597K4182J4736
14296B45799q277j4484k1904j5176r69M568J0587Q001j1220j7816J0065J0957
14284B00131l19K811K1512J3692K474j76N517j2742j8492r881n379J585N623p
14270B06349J0098N256N064J1386J3526j1083l461k17j2410P271K632o300N985
14257B34096J7083J3203r800j7617l400L543j1838L490Q499O784j580j4921J302
14244B28844k1405j4057o279O845J5011J7045J4360J771Q27J2730P791j7992j6676
14231B28815m734J8509k363N576J5411J1204j6981P742J0101J1111L613p296l449
14218B77259j4787N744K2516J140q03j238l640k1944m65K351J5603k405j39M215
$$ plain form
14204 283407 281267 276007 269838 264287 258225 252461 257233 270073 282290 274371 268949 272462 264002 258253
14190 258253 271669 272618 277611 299418 304804 304018 289153 265824 275357 287638 282211 283373 281853
14177 281853 278129 266881 263176 264547 276630 280777 281864 288258 288685 285968 299966 304772 302178 291075
14163 291075 294527 299226 306371 315831 320871 320352 303583 297846 288349 276428 281116 299575 303901 303688
14149 303688 288181 278259 286047 301422 304326 307770 311440 288148 277641 300371 322184 325149 326013
14136 326013 334410 348008 345655 349228 336157 333696 342543 339683 320701 321570 333754 340718 335163
14123 335163 306408 306515 319716 319463 334241 342517 363472 357547 350432 352462 357840 365620 384124
14110 384124 383074 363242 355204 347109 360632 370093 369000 381273 388303 385878 393146 384235 373392
$$ packed form
14204B83407k140n260o169n551o062n764M772J2840J2217p919n422L513q460n749
14190B58253J3416R49M993K1807N386p86j4865k3329R533J2281n427J162j520
14177B81853l724j1248l705J371J2083M147J087O394M27k717J3998M806k594j1103
14163B91075L452M699P145R460N040n19j6769n737r497j1921M688J8459M326k13
14149C03688j5507r922P788J5375K904L444L670k3292j0507K2730K1813K965Q64
14136C26013Q397J3598k353L573j3071k461Q847k860j8982Q69J2184O964n555
14123C35163k8755J07J3201k53J4778Q276K0955n925p115K030N378P780J8504
14110C84124j050j9832q038q095J3523R461j093J2273P030k425P268q911j0843
$$ plain form
14097 373392 364030 369306 369586 369707 383753 405386 414538 413061 413512 411455 408510 406365 396066 411598
14083 411598 420145 420265 430025 431919 433893 438720 441732 442384 441604 424014 415083 431049 444449 448424
14069 448424 424373 405956 418968 433783 443912 450854 450889 463526 471875 469489 469624 475876 494847
14056 494847 501713 510487 508475 503678 499052 478572 471480 469503 483430 500462 509839 504579 497262
14043 497262 507641 506078 496466 487910 480485 492721 509591 508572 503488 505306 508872 518646 525801
14030 525801 523785 519127 520540 530196 538505 548839 561232 568026 570188 562572 564405 569192 577865 580460
14016 580460 573892 577718 600026 601478 603200 617349 635887 648872 630024 626732 624330 624382 625419
14003 625419 643882 669082 666138 658566 640836 642582 656092 679330 687829 678488 693441 697133 687323
$$ packed form
14097C73392r362N276K80J21J4046K1633R152j477M51k057k945k145j0299J5532
14083D11598Q547J20R760J894J974M827L012O52p80j7590q931J5966J3400L975
14069D48424k4051j8417J3012J4815J0129O942L5J2637Q349k386J35O252J8971
14056D94847O866Q774k012m797m626k0480p092j977J3927J7032R377n260p317
14043D97262J0379j563r612q556p425J2236J6870j019n084J818L566R774P155
14030E25801k016m658J413R656Q309J0334J2393O794K162p616J833M787Q673K595
14016E80460o568L826K2308J452J722J4149J8538J2985j8848l292k402N2J037
14003F25419J8463K5200k944p572j7730J746J3510K3238Q499r341J4953L692r810
$$ plain form
13990 687323 697829 703062 710930 707980 708020 735252 737054 713837 714013 729633 744646 738060 736585 748436
13976 748436 751985 762203 761761 763438 765284 772292 795617 791493 781759 789094 798388 805307 799494 802226
13962 802226 815429 829551 832372 847586 855658 860566 862964 868045 880036 886943 889514 885888 875726
13949 875726 866500 866937 866973 885935 925199 954555 962069 967833 963827 961103 955379 953325 974900 997734
13935 997734 989218 996593 1015503 1019673 1023474 1039250 1074955 1085187 1102603 1128048 1178895 1259122
13923 1259122 1375508 1514385 1659209 1736102 1699860 1587477 1477288 1367099 1286090 1238663
13913 1238663 1214247 1198144 1182733 1185268 1191347 1207523 1227641 1253179 1269514 1303474 1354175 1421579
13901 1421579 1533644 1672600 1817017 1954041 2044490 2053367 1990057 1888820 1756906 1633925
$$ packed form
13990F87323J0506N233P868k950M0K7232J802k3217J76J5620J5013o586j475J1851
13976G48436L549J0218m42J677J846P008K3325m124r734P335R294O919n813K732
13962H02226J3203J4122K821J5214Q072M908K398N081J1991O907K571l626j0162
13949H75726r226M37L6J8962L9264K9356P514N764m006k724n724k054K1575K2834
13935I97734q516P375J8910M170L801J5776L5705J0232J7416K5445N0847Q0227
13923A259122J16386J38877J44824P6893l6242j12383j10189j10189q1009m7427
13913A238663k4416j6103j5411K535O079J6176K0118K5538J6335L3960N0701O7404
13901A421579J12065J38956J44417J37024R0449Q877o3310j01237j31914j22981
$$ plain form
13891 1633925 1537403 1457937 1423354 1386470 1352010 1348671 1357335 1375131 1383046 1389442 1399769 1394774
13879 1394774 1413771 1441932 1455664 1459149 1468923 1496942 1506170 1519853 1531056 1547054 1547472 1541844
13867 1541844 1552459 1573526 1585730 1613570 1623984 1634297 1643092 1645230 1656988 1679520 1694874 1696489
13855 1696489 1717908 1739801 1753241 1742892 1761005 1796334 1818729 1818979 1829883 1846991 1874011 1885427
13843 1885427 1901433 1932601 1945645 1962678 1978362 1993273 2020104 2016194 2031172 2066877 2086234
13832 2086234 2096007 2112533 2108759 2123792 2152064 2187527 2212342 2245372 2278570 2291769 2308345 2344720
13820 2344720 2380552 2405442 2396782 2420575 2453625 2481938 2527810 2557187 2577012 2595845 2629826
13809 2629826 2665429 2709371 2740029 2748781 2775124 2795328 2828013 2873624 2913084 2945172 2982270
$$ packed form
13891A633925r6522p9466l4583l6884l4460l339Q664J7796P915O396J0327m995
13879A394774J8997K8161J3732L485R774K8019R228J3683J1203J5998M18n628
13867A541844J0615K1067J2204K7840J0414J0313Q795K138J1758K2532J5354J615
13855A696489K1419K1893J3440j0349J8113L5329K2395K50J0904J7108K7020J1416
13843A885427J6006L1168J3044J7033J5684J4911K6831l910J4978L5705J9357
13832B086234R773J6526l774J5033K8272L5463K4815L3030L3198J3199J6576L6375
13820B344720L5832K4890q660K3793L3050K8313M5872K9377J9825J8833L3981
13809B629826L5603M3942L0658Q752K6343K0204L2685M5611L9460L2088L7098
$$ plain form
13798 2982270 2996962 3022992 3047439 3086941 3137097 3186463 3218751 3254119 3289983 3336453 3374693
13787 3374693 3415153 3446439 3475777 3515282 3545564 3590367 3626889 3686732 3744693 3782289 3818635
13776 3818635 3859397 3899020 3956475 4027352 4080262 4107913 4132807 4183611 4231699 4284748 4341588
13765 4341588 4382113 4437592 4508085 4560986 4624709 4684018 4742517 4796532 4857186 4933968 4986756
13754 4986756 5052411 5114421 5180507 5249181 5324041 5390663 5463785 5541133 5604134 5669825 5754340
13743 5754340 5827853 5905157 5982306 6049842 6128131 6207759 6284470 6390830 6484708 6561826 6663177
13732 6663177 6756418 6836419 6936328 7022291 7111020 7210820 7311617 7419816 7519885 7605096 7694425
13721 7694425 7806391 7913253 8016121 8114506 8221623 8347266 8466234 8562634 8674056 8776435
$$ packed form
13798B982270J4692K6030K4447L9502N0156M9366L2288L5368L5864M6470L8240
13787C374693M0460L1286K9338L9505L0282M4803L6522N9843N7961L7596L6346
13776C818635M0762L9623N7455P0877N2910K7651K4894N0804M8088N3049N6840
13765D341588M0525N5479P0493N2901O3723N9309N8499N4015O0654P6782N2788
13754D986756O5655O2010O6086O8674P4860O6622P3122P7348O3001O5691Q4515
13743E754340P3513P7304P7149O7536P8289P9628P6711J06360R3878P7118J01351
13732F663177R3241Q0001R9909Q5963Q8729R9800J00797J08199J00069Q5211Q9329
13721G694425J11966J06862J02868R8385J07117J25643J18968R6400J11422J02379
$$ plain form
13711 8776435 8871277 8993286 9107523 9224283 9356649 9483216 9602978 9718143 9835612 9953049
13701 9953049 10070284 10178073 10287677 10397930 10509361 10636672 10752581 10881185 11014459
13692 11014459 11138419 11266193 11384094 11503485 11620705 11733273 11851508 11964459 12066361
13683 12066361 12178102 12296606 12405552 12503267 12597309 12690202 12781249 12866077 12962591 13062665
13673 13062665 13141654 13214109 13285763 13346690 13413366 13487956 13536187 13561207 13610936 13676293 13724370
13662 13724370 13765048 13803216 13831571 13849146 13878064 13895144 13911539 13920238 13907871 13882012 13857325
13651 13857325 13846669 13845962 13823064 13783951 13744664 13695514 13641596 13591994 13537731 13479152 13404452
13640 13404452 13341223 13272357 13194669 13123215 13058669 12983648 12892100 12790626 12696613 12590498 12477453
$$ packed form
13711H776435R4842J22009J14237J16760J32366J26567J19762J15165J17469J17437
13701I953049J17235J07789J09604J10253J11431J27311J15909J28604J33274
13692A1014459J23960J27774J17901J19391J17220J12568J18235J12951J01902
13683A2066361J11741J18504J08946R7715R4042R2893R1047Q4828R6514J00074
13673A3062665P8989P2455P1654O0927O6676P4590M8231K5020M9729O5357M8077
13662A3724370M0678L8168K8355J7575K8918J7080J6395Q699j2367k5859k4687
13651A3857325j0656p07k2898l9113l9287m9150n3918m9602n4263n8579p4700
13640A3404452o3229o8866p7688p1454o4546p5021r1548j01474r4013j06115j13045
$$ plain form
13629 12477453 12380924 12291728 12182847 12063022 11958159 11850086 11722365 11599586 11488038 11380739
13619 11380739 11258713 11136663 11033465 10916425 10792169 10670246 10539361 10427031 10317004
13610 10317004 10188100 10060673 9933843 9783345 9685863 9585701 9465688 9349822 9231733
13601 9231733 9103408 8979476 8860027 8745540 8641890 8548925 8460711 8356900 8239518 8110242
13591 8110242 7991681 7886071 7769963 7669006 7580437 7467913 7358986 7256660 7147316 7051145
13581 7051145 6959122 6869703 6782251 6697467 6599545 6502753 6411096 6327238 6234841 6151961 6087232
13570 6087232 6018962 5928087 5849255 5777828 5701011 5617417 5542253 5465176 5394083 5331446 5268630
13559 5268630 5193961 5111842 5043718 5007618 4938521 4859566 4785365 4741303 4685448 4613917 4559607
$$ packed form
13629A2477453r6529q9196j08881j19825j04863j08073j27721j22779j11548j07299
13619A1380739j22026j22050j03198j17040j24256j21923j30885j12330j10027
13610A0317004j28904j27427j26830j50498r7482j00162j20013j15866j18089
13601I231733j28325j23932j19449j14487j03650r2965q8214j03811j17382j29276
13591H110242j18561j05610j16108j00957q8569j12524j08927j02326j09344r6171
13581G051145r2023q9419q7452q4784r7922r6792r1657q3858r2397q2880o4729
13570F087232o8270r0875p8832p1427p6817q3594p5164p7077p1093o2637o2816
13559E268630p4669q2119o8124l6100o9097p8955p4201m4062n5855p1531n4310
$$ plain form
13548 4559607 4499375 4430184 4378161 4336456 4272808 4218215 4162330 4086169 4032269 3982537 3947544
13537 3947544 3907854 3854837 3815053 3773839 3737807 3689059 3651352 3604349 3548165 3498236 3469172
13526 3469172 3433784 3397681 3355617 3311041 3260003 3225115 3193207 3162009 3125896 3079235 3054808
13515 3054808 3016961 2980569 2944440 2916481 2901009 2870246 2837065 2813885 2789845 2755840 2724511
13504 2724511 2698156 2667097 2608545 2565446 2524978 2508706 2491336 2475376 2465363 2445512 2426751
13493 2426751 2399773 2375818 2340730 2305185 2294379 2269366 2235773 2210962 2195204 2169899 2148205
13482 2148205 2138649 2121590 2109133 2078528 2055486 2029111 2006216 1991336 1960778 1935705 1930466 1928475
13470 1928475 1929585 1902538 1875034 1847653 1822950 1794933 1783002 1782938 1780061 1771580 1749706 1728244
$$ packed form
13548D559607o0232o9191n2023m1705o3648n4593n5885p6161n3900m9732l4993
13537C947544l9690n3017l9784m1214l6032m8748l7707m7003n6184m9929k9064
13526C469172l5388l6103m2064m4576n1038l4888l1908l1198l6113m6661k4427
13515C054808l7847l6392l6129k7959j5472l0763l3181k3180k4040l4005l1329
13504B724511k6355l1059n8552m3099m0468j6272j7370j5960j0013j9851j8761
13493B426751k6978k3955l5088l5545j0806k5013l3593k4811j5758k5305k1694
13482B148205r556j7059j2457l0605k3042k6375k2895j4880l0558k5073n239j991
13470A928475J110k7047k7504k7381k4703k8017j1931o4k877q481k1874k1462
$$ plain form
13458 1728244 1708195 1688605 1661580 1651295 1641824 1642049 1619764 1592135 1568690 1551485 1539007 1526083
13446 1526083 1512600 1500322 1511252 1497190 1470457 1459399 1449744 1437582 1412855 1400033 1392210 1368108
13434 1368108 1354866 1352267 1341891 1330016 1312312 1306321 1290825 1286265 1265777 1250672 1255353 1263634
13422 1263634 1268488 1249694 1206159 1189936 1190900 1166599 1167224 1163701 1168695 1172485 1157439 1137332 1119137
13409 1119137 1103235 1100147 1106499 1095884 1089963 1092869 1089016 1082237 1085441 1077667 1079457 1075325 1056715
13396 1056715 1060926 1067032 1080575 1100792 1152749 1240409 1362052 1492749 1596216 1603679 1526053
13385 1526053 1381745 1259047 1151961 1062948 993548 952412 930138 915027 907419 912721 903231
13374 903231 896919 897046 871923 854743 830871 827667 835703 834156 821728 812469 803768 798874 803750
$$ packed form
13458A728244k0049j9590k7025j0285r471K25k2285k7629k3445j7205j2478j2924
13446A526083j3483j2278J0930j4062k6733j1058r655j2162k4727j2822p823k4102
13434A368108j3242k599j0376j1875j7704n991j5496m560k0488j5105M681Q281
13422A263634M854j8794m3535j6223R64k4301O25l523M994L790j5046k0107j8195
13409A119137j5902l088O352j0615n921K906l853o779L204p774J790m132j8610
13396A056715M211O106J3543K0217N1957Q7660J21643J30697J03467P463p7626
13385A526053j44308j22698j07086q9013o9400m1136k2274j5111p608N302r490
13374I03231o312J27k5123j7180k3872l204Q036j547j2428r259q701m894M876
$$ plain form
13361 803750 790164 769653 765352 764302 755591 758529 755245 746850 742286 736902 732988 722140 711585
13348 711585 705712 699851 687332 700181 718027 735245 741986 726626 707192 701301 685750 671763
13336 671763 651031 641925 655785 654104 655449 646203 644840 637526 641579 640471 647206 622367 603773
13323 603773 600572 615464 620316 610365 606242 595537 608761 597502 585331 580317 582364 571458 556138
13310 556138 559639 550709 547766 561390 583925 580416 561745 535726 522529 510330 502600 510909 518385
13297 518385 528132 542648 544007 535614 536913 536287 512421 513024 511984 520604 514996 496411 502220 506950
13283 506950 479494 464617 469350 473124 461298 453921 443392 451603 464197 469946 464528 464273 476599
13270 476599 476175 476626 476360 477214 459376 436531 432201 444758 436688 422373 422116 418642 413432 402036
$$ packed form
13361H03750j3586k0511m301j050q711K938l284q395m564n384l914j0848j0555
13348G11585n873n861j2519J2849J7846J7218O741j5360j9434n891j5551j3987
13336F71763k0732r106J3860j681J345r246j363p314M053j108O735k4839j8594
13323F03773l201J4892M852r951m123j0705J3224j1259j2171n014K047j0906j5320
13310E56138L501q930k943J3624K2535l509j8671k6019j3197j2199p730Q309P476
13297E18385R747J4516J359q393J299o26k3866O03j040Q620n608j8585N809M730
13283E06950k7456j4877M733L774j1826p377j0529Q211J2594N749n418k55J2326
13270D76599m24M51k66Q54j7838k2845m330J2557q070j4315k57l474n210j1396
$$ plain form
13256 402036 396284 405086 405092 400982 394109 387723 388839 389004 395830 393105 388615 383658 387587 376266 368683
13241 368683 370487 373108 374347 382008 404196 415378 384753 354371 357550 353320 352089 354587 346141
13228 346141 334334 331956 346846 340992 323842 315682 313441 325915 319708 327143 337975 331043 337432
13215 337432 350734 347403 339309 342683 343111 327922 325969 328373 317094 302357 304202 322718 329655
13202 329655 309929 307907 314478 322382 322307 305122 302975 310780 307709 302255 308167 300482 296091 283891
13188 283891 264926 258438 263385 280001 277013 268142 279859 272953 266499 283639 287817 294678 292591
13175 292591 290570 293375 287649 295691 281164 274452 253553 249375 254381 249264 252651 256289 251721 237715
13161 237715 229594 228356 233778 251895 253187 255278 240469 238829 251484 265026 252489 231211 227749
$$ packed form
13256D02036n752Q802Om110o873o386J116J65O826k725m490m957L929j1321p583
13241C68683J804K621J239P661K2188J1182l0625l0382L179m230j231K498q446
13228C46141j1807k378J4890n854j7150q160k241J2474o207P435J0832o932O389
13215C37432J3302l331q094L374M28j5189j953K404j1279j4737J845J8516O937
13202C29655j9726k022O571P904p5j7185k147P805l071n454N912p685m391j2200
13188B83891j8965o488M947J6616k988q871J1717o906o454J7140M178O861k087
13175B92591k021K805n726Q042j4527o712k0899m178N006n117L387L638m568j4006
13161B37715q121j238N422J8117J292K091j4809j640J2655J3542j2537k1278l462
$$ plain form
13148 227749 233684 257227 264173 242108 217149 212706 230126 238279 222978 207472 219213 234470
13136 234470 235105 223531 233836 234139 234016 231522 235489 223378 219521 223296 226891 230062 232591 240145
13122 240145 231024 206229 210489 215099 227006 224347 209410 210062 199914 199975 204803 190165 175828
13109 175828 186084 196875 197430 188377 186447 176384 177219 172500 173351 181243 193045 184848 171462 163050
13095 163050 165925 178456 179522 167212 174459 180850 184767 174379 173893 163700 158942 160040 148294
13082 148294 151985 175925 175299 158011 155095 155777 166743 157003 156025 150254 169845 181071 182400 184340
13068 184340 190908 187633 188438 185169 172096 164473 163307 166150 173782 171283 166112 155341 150334 160725
13054 160725 179460 164008 140348 147921 157380 145285 154573 155388 155065 160242 166501 164688 154675
$$ packed form
13148B27749N935K3543O946k2065k4959m443J7420Q153j5301j5506J1741J5257
13136B34470O35j1574J0305L03j23k494L967j2111l857L775L595L171K529P554
13122B40145r121k4795M260M610J1907k659j4937O52j0148O1M828j4638j4337
13109A75828J0256J0791N55r053j930j0063Q35m719Q51P892J1802q197j3386q412
13095A63050K875J2531J066j2310P247O391L917j0388m86j0193m758J098j1746
13082A48294L691K3940o26j7288k916O82J0966r740r78n771J9591J1226J329J940
13068A84340O568l275Q05l269j3073p623j166K843P632k499n171j0771n007J0391
13054A60725J8735j5452k3660P573R459j2095R288Q15l23N177O259j813j0013
$$ plain form
13041 154675 135833 140078 156864 160067 152485 142535 164551 169357 159802 160826 185037 175256 170313
13028 170313 161958 155412 142601 122575 122128 128015 138214 145913 146504 136606 127886 147535 153767 155746
13014 155746 144189 135034 140274 118632 118715 143264 158569 161203 151826 133449 128862 128583 132098 119723
13000 119723 116139 127374 134908 122919 111177 120690 123436 124974 118267 106391 109723 112594 126163
12987 126163 136802 136089 136986 136198 121204 111438 100350 97711 98437 99950 89268 105510 111000 118919
12973 118919 118234 108312 95530 75409 73247 90904 94109 94523 101038 106522 112113 118073 132428 144705
12959 144705 121844 101596 104179 111931 107870 112118 112731 114200 108830 91612 82334 94829 99313
12946 99313 103009 96983 106442 114560 104423 105876 109195 112530 104883 104129 107932 106595 106495 107816 119847
$$ packed form
13041A54675j8842M245J6786L203p582r950K2016M806r555J024K4211r781m943
13028A70313q355o546j2811k0026m47N887J0199P699N91r898q720J9649O232J979
13014A55746j1557r155N240k1642Q3K4549J5305K634r377j8377m587k79L515j2375
13000A19723l584J1235P534j1989j1742R513K746J538o707j1876L332K871J3569
12987A26163J0639p13Q97p88j4994r766j1088k639P26J513j0682J6242N490P919
12973A18919o85r922j2782k0121k162J7657L205M14O515N484N591N960J4355J2277
12959A44705k2861k0248K583P752m061M248O13J469n370j7218r278J2495M484
12946I9313L696o026R459Q118j0137J453L319L335p647p54L803j337j00J321J2031
$$ plain form
12931 119847 123851 112742 106157 104730 107079 107826 98227 87961 86491 95285 99708 92791 99030 114021
12917 114021 104999 101598 83195 88981 88785 86584 91800 85469 79759 91336 103115 91505 79911
12904 79911 75555 79209 89063 91767 99582 91314 92263 83485 82190 93610 84499 82150 73381 73116 69240
12889 69240 76298 75154 86840 86717 66261 52081 61642 81402 88937 89845 91833 107071 94124
12876 94124 78112 86266 89905 68531 64939 65911 75336 67947 45563 40337 44537 41842 55625 68742
12862 68742 66913 77010 66773 53486 52460 62835 66765 87489 87033 86485 78147 67682 64177
12849 64177 73154 68698 68572 71531 64048 82026 95051 92761 80677 82251 75097 81957 67905 45249
12835 45249 51065 73570 72425 69731 72633 61399 53898 44275 57107 56451 61484 64154 63696 51736
$$ packed form
12931A19847M004j1109o585j427K349P47r599j0266j470Q794M423o917O239J4991
12917A14021r022l401j8403N786j96k201N216o331n710J1577J1779j1610j1594
12904G9911m356L654R854K704P815q268R49q778j295J1420r111k349q769k65l876
12889F9240P058j144J1686j23k0456j4180R561J9760P535R08J988J5238j2947
12876I4124j6012Q154L639k1374l592R72R425p389k2384n226M200k695J3783J3117
12862F8742j829J0097j0237j3287j026J0375L930K0724m56n48q338j0465l505
12849F4177Q977m456j26K959p483J7978J3025k290j2084J574p154O860j4052k2656
12835D5249N816K2505j145k694K902j1234p501r623J2832o56N033K670m58j1960
$$ plain form
12821 51736 54452 68255 75703 74570 75277 73981 70860 76467 61720 35867 28478 33273 35476 37688
12807 37688 37353 44872 52533 63894 64446 71842 72534 64995 59739 49996 57015 52643 60878 63598 74196
12792 74196 78830 76345 86633 80226 78335 83740 68679 61282 55316 60501 62098 70060 74731 73012
12778 73012 71744 65593 55116 60285 63103 64449 76780 54082 48368 64419 70134 72095 67985
12765 67985 72355 61522 36693 42552 53165 50880 57379 47753 35628 40979 31399 27381 42200
12752 42200 65333 73887 63204 51776 40753 42161 36614 22616 33565 47362 62341 50082
12740 50082 37126 21803 25915 41049 52768 46133 47887 40882 24428 32980 38982 42158 43654
12727 43654 55530 64505 65746 50909 47172 49432 45657 37572 42775 41058 38841 50361 50455 48336
$$ packed form
12821E1736K716J3803P448j133P07j296l121N607j4747k5853p389M795K203K212
12807C7688l35P519P661J1361N52P396O92p539n256r743P019m372Q235K720J0598
12792G4196M634k485J0288o407j891N405j5061p397n966N185J597P962M671j719
12778G3012j268o151j0477N169K818J346J2331k2698n714J6051N715J961m110
12765F7985M370j0833k4829N859J0613k285O499r626j2125N351r580m018J4819
12752D2200K3133Q554j0683j1428j1023J408n547j3998J0949J3797J4979j2259
12740E0082j2956j5323M112J5134J1719o635J754p005j6454Q552O002L176J496
12727D3654J1876Q975J241j4837l737K260l775q085N203j717k217J1520R4k119
$$ plain form
12713 48336 54910 43580 34298 29518 37957 26735 27540 40994 36340 34358 26848 18097 21301 19370
12699 19370 25385 25102 21285 26994 14214 15613 40574 40283 24879 19621 32256 43695 51178 42789
12685 42789 51994 46105 24326 19809 19329 32646 34287 40112 46618 34161 27764 19299 17960 35652
12671 35652 43056 39662 32788 42161 45153 40903 37848 31411 45918 46518 50790 47780 37857 21529
12657 21529 26869 31624 34091 26989 31311 36700 30760 31075 11112 20702 36970 44323 42694 38922
12643 38922 34730 32222 27871 24064 27788 42233 47013 43939 46513 49180 47142 40577 37104 46568
12629 46568 52555 44693 52719 50663 39837 32029 31578 34396 48293 40862 38135 45408 50884 44507
12615 44507 48790 58277 54197 47371 42056 35322 35979 41033 25767 6541 6459 20960 25752 20116
$$ packed form
12713D8336O574j1330r282m780Q439j1222Q05J3454m654j982p510q751L204j931
12699A9370O015k83l817N709j2780J399K4961k91j5404n258J2635J1439P483q389
12685D2789R205n889k1779m517m80J3317J641N825O506j2457o397q465j339J7692
12671C5652P404l394o874R373K992m250l055o437J4507O00M272l010r923j6328
12657B1529N340M755K467p102M322N389n940L15j9963R590J6268P353j629l772
12643C8922m192k508m351l807L724J4445M780l074K574K667k038o565l473R464
12629D6568N987p862Q026k056j0826p808m51K818J3897p431k727P273N476o377
12615D4507M283R487m080o826n315o734O57N054j5266j9226q2J4501M792n636
$$ plain form
12601 20116 1367 4068 22378 28569 32919 33864 30830 26425 20687 8925 21126 42332 29077
12588 29077 42529 48705 46424 35957 30345 34213 38181 28562 36009 49063 59461 60074 39487
12575 39487 30085 19806 27149 18900 20091 16607 9984 -2712 3502 27276 29011 17070 20434
12562 20434 10654 6221 6466 -5839 4263 26002 20283 17231 23243 11470 12256 31523 21029
12549 21029 10967 11398 3854 6415 22699 25986 32856 44406 56650 53602 32535 29662 24185
12536 24185 30796 24422 1805 -850 18807 23745 4876 7843 26062 33860 30792 41020 31120
12523 31120 27831 33568 34325 18837 6107 14299 27519 41200 41433 26504 1365 -9345 4935
12510 4935 16510 17276 28390 16775 14237 22203 17266 14240 17363 9952 7984 -9569 -858 -2596
$$ packed form
12601B0116j8749K701J8310O191M350R45l034m405n738j1762J2201K1206j3255
12588B9077J3452O176k281j0467n612L868L968r619P447J3054J0398O13k0587
12575C9487r402j0279P343q249J191l484o623j2696O214K3774J735j1941L364
12562B0434r780m433K45j2305J0102K1739n719l052O012j1773P86J9267j0494
12549B1029j0062M31p544K561J6284L287O870J1550J2244l048k1067k873n477
12536B4185O611o374k2617k655J9657M938j8869K967J8219P798l068J0228r900
12523C1120l289N737P57j5488j2730Q192J3220J3681K33j4929k5139j0710J4280
12510D935J1575P66J1114j1615k538P966m937l026L123p411j968j7553Q711j738
$$ plain form
12496 -2596 256 17322 12564 11668 20344 26113 18855 20991 26290 18589 12067 11012 17978 6675
12482 6675 6763 13331 25755 28050 31588 26280 30407 25531 31043 35966 36779 36356 39653 30115 32554
12467 32554 32563 25635 37619 48784 58191 58283 54472 40185 35090 37759 33832 35405 35653 25910 20580
12452 20580 12918 -9850 -4995 -9573 -3986 8283 2266 -2699 -746 -7219 -2888 -360 10787 17997
12438 17997 20008 -1176 7084 29002 16762 7856 10562 25227 38282 34175 23883 4582 5837
12425 5837 12506 12752 6970 14182 23567 17421 19694 9243 17404 34295 28231 25549 35057 34220 36712
12410 36712 37032 25314 10343 4880 9622 6218 17202 30995 34008 24826 16168 7538 8761 24204
12396 24204 25196 6348 -4448 -668 11371 8310 14468 15512 11089 4585 6195 9913 11046 9483
$$ packed form
12496b596K852J7066m758q96Q676N769p258K136N299p701o522j055O966j1303
12482F675Q8O568J2424K295L538n308M127m876N512M923Q13m23L297r538K439
12467C2554Ro928J1984J1165R407R2l811j4287n095K669l927J573K48r743n330
12452B0580p662k2768M855m578N587J2269o017m965J953o473M331K528J1147P210
12438A7997K011k1184Q260K1918j2240q906K706J4665J3055m107j0292j9301J255
12425E837O669K46n782P212R385o146K273j0451Q161J6891o064k682R508q37K492
12410C6712L20j1718j4971n463M742l404J0984J3793L013r182q658q630J223J5443
12396B4204R92j8848j0796L780J2039l061O158J044m423o504J610L718J133j563
$$ plain form
12382 9483 14932 2313 -5815 -1216 -1127 -1495 2319 -7691 -3705 159 11332 8930 4429 -7690
12368 -7690 -2804 14337 16953 4711 11973 10030 5136 14355 20586 14361 18979 22163 26220 30385
12354 30385 36210 56642 47502 29549 18285 15273 21560 21498 25769 25528 17717 20153 21978 28882
12340 28882 15461 14432 35300 40813 40360 30562 10590 -7234 -2288 -4219 -12506 -11216 -2337 6779
12326 6779 2325 -7473 -3282 -15152 -17697 -18353 -13236 -5560 6283 16420 23606 12029 17511 12276
12312 12276 -4 9728 13665 13701 20770 26008 12763 -1587 -2937 -5554 -11132 -8366 11533 26951
12298 26951 20693 6238 19362 17157 21058 18394 79 7498 6802 -4666 771 16031 22766
12285 22766 15155 9506 23684 33368 27787 25350 14505 9269 6308 8179 -3059 3535 8808 2763
$$ packed form
12382I483N449j2619q128M599Q9l68L814j0010L986L864J1173k402m501j2119
12368g690M886J7141K616j2242P262j943m894R219O231o225M618L184M057M165
12354C0385N825K0432r140j7953j1264l012O287o2M271k41p811K436J825O904
12340B8882j3421j029K0868N513m53r798j9972j7824M946j931q287J290Q879R116
12326F779m454r798M191j1870k545o56N117P676J1843J0137P186j1577N482n235
12312A2276j2280R732L937L6P069N238j3245j4350j350k617n578K766J9899J5418
12298B6951o258j4455J3124k205L901k664j8315P419o96j1468N437J5260O735
12285B2766p611n649J4178R684n581k437j0845n236k961J871j1238O594N273o045
$$ plain form
12271 2763 -7526 -3177 16384 18847 8123 11612 17208 21539 19220 16548 4402 8759 17379 24838
12257 24838 24317 14556 6355 17595 21533 4494 12844 22934 18476 22296 17842 5581 6672 7985
12243 7985 22054 21880 13529 20778 14577 11274 -150 -5893 -9709 -2672 4182 -978 16692 16387
12229 16387 11771 4294 2725 4850 2651 -12532 5471 1599 5499 9091 9647 10433 -2255 -8204
12215 -8204 -2382 -5073 -11013 -7483 -2763 -9023 -26503 -34460 -45009 -43786 -32577 -8132 12143
12202 12143 14652 13631 -2787 -3858 -4660 769 19227 14241 10619 5635 -6555 -2825 5815 4220
12188 4220 -812 -2686 -6439 -5770 -5240 3820 -10331 -16041 -11726 -16557 -6084 -11300 4109 -677
12174 -677 1308 10705 24771 19521 4886 11179 3886 15685 25798 23705 17825 17203 17517 15229
$$ packed form
12271B763j0289M349J9561K463j0724L489N596M331k319k672j2146M357Q620P459
12257B4838n21r761q201J1240L938j7039Q350J0090m458L820m454j2261J091J313
12243G985J4069j74q351P249o201l303j1424n743l816P037O854n160J7670l05
12229A6387m616p477j569K125k199j5183J8003l872L900L592N56P86j2688n949
12215h204N822k691n940L530M720o260j7480p957j0549J223J1209K4445K0275
12202A2143K509j021j6418j071q02N429J8458m986l622m984j2190L730Q640j595
12188D220n032j874l753O69N30R060j4151n710M315m831J0473n216J5409m786
12174f77J985R397J4066n250j4635O293p293J1799J0113k093n880o22L14k288
$$ plain form
12160 15229 -6314 -3578 3682 4206 10651 9201 17743 29317 19725 1700 2164 18188 26071 29132
12146 29132 19217 8969 3186 5108 4528 -4936 4795 3444 26292 44726 42096 41604 42816 42848 35308
12131 35308 25222 1672 1816 14602 19107 21574 22228 30183 29296 17082 19623 22729 8593 4783
12117 4783 11906 3572 -3083 11217 39747 49274 47004 43964 36666 44309 48187 32603 15732 1234
12103 1234 -21421 -2118 12389 -124 -13266 8969 9208 3987 -637 8896 7577 -10999 -10811
12090 -10811 -6414 -3831 -1834 992 -2661 -3852 -11798 -11698 -6749 5953 3079 -3493 -9388 -1213
12076 -1213 -10073 -15426 -6638 -1541 2178 15195 19549 6373 7944 6060 -3136 13690 24408 29165
12062 29165 28621 32342 30313 5627 -4059 1616 337 6667 13758 6381 10785 18383 29265 16054
$$ packed form
12160A5229k1543K736P260N24O445j450Q542J1574r592j8025M64J6024P883L061
12146B9132r915j0248n783J922n80r464R731j351K2848J8434k630m92J212L2p540
12131C5308j0086k3550J44J2786M505K467O54P955q87j2214K541L106j4136l810
12117D783P123q334o655J4300K8530R527k270l040p298P643L878j5584j6871j4498
12103A234k2655J9303J4507j2513j3142K2235K39n221m624R533j319j8576J88
12090a0811M397K583J997K826l653j191p946J00M949J2702k874o572n895Q175
12076a213q860n353Q788N097L719J3017M354j3176J571j884r196J6826J0718M757
12062B9165n44L721k029k4686r686N675j279O330P091p377M404P598J0882j3211
$$ plain form
12048 16054 6979 6847 4513 16924 25335 13539 3199 13516 18555 -3924 -16047 -10963 9632
12035 9632 15409 7474 8753 8834 6342 -2531 -7835 -23157 -26996 -19057 -6842 -13681 -9866 10275
12021 10275 21953 30238 5207 -6372 -5995 -2129 -19157 -36709 -26977 -15605 -22871 -25596 -13089
12008 -13089 -17202 -11778 -7557 -6109 -6015 -13367 -5411 -9298 -12566 -11037 -8628 -2282 -1404 -5418 6903
11993 6903 9288 -2554 -3887 -14762 -230 5425 -8819 -4979 -1059 10137 16612 15255 13462
11980 13462 9060 17851 25418 6493 -17696 -29774 -22991 -13002 -18173 543 9902 9569 1584 -3795
11966 -3795 -2275 -1558 14651 6620 883 7303 7586 10431 13817 24245 19349 8588 -7673 -7124
11952 -7124 -11682 462 -942 2528 5857 809 4714 -1933 -8965 3503 16650 20479 5771 -873
$$ packed form
12048A6054r075j32k334J2411Q411j1796j0340J0317N039k2479j2123N084K0595
12035I632N777p935J279Q1k492q873n304j5322l839P939J2215o839L815K0141
12021A0275J1678Q285k5031j1579L77L866j7028j7552R732J1372p266k725J2507
12008a3089m113N424M221J448R4p352P956l887l268J529K409O346Q78m014J2321
11993F903K385j1842j333j0875J4532N655j4244L840L920J1196O475j357j793
11980A3462m402Q791P567j8925k4189j2078O783R989n171J8716R359l33p985n379
11966c795J520P17J6209q031n737O420K83K845L386J0428m896j0761j6261N49
11952g124m558J2144j404L470L329n048L905o647p032J2468J3147L829j4708o644
$$ plain form
11938 -873 3409 3203 -4089 2346 12987 1139 -8438 1765 8174 3289 -2257 2324 1446 3740 9847
11923 9847 13943 -5711 -25124 -19268 -21056 -5308 13032 7800 13995 16393 23419 24466 25580 22117
11909 22117 12304 25228 33267 19574 4826 -5335 -10330 -13114 -14821 2002 9793 7406 -114
11896 -114 -8357 -17061 -4213 9900 -7992 -18933 -11688 -9461 -20942 -19049 -12610 -17948 -16669 -13012
11882 -13012 -10699 -11487 -5626 -6932 -15420 -14076 -5069 -21933 -16521 8984 14595 10871 -1610 1409
11868 1409 586 2491 8486 13896 7499 7585 -3847 7431 25004 25652 28104 25792 22913 7266 18888
11853 18888 29183 12463 -9525 -11985 -11364 -7212 -5058 -2932 -1120 -11351 -17720 -2462 -824
11840 -824 -723 142 -14452 -16638 -20627 -22748 -24067 -19411 -13216 -3697 3741 6213 -2050 -18531 -25065
$$ packed form
11938h73M282k06p292O435J0641j1848r577J0203O409m885n546M581q78K294O107
11923I847M096j9654j9413N856j788J5748J8340n232O195K398P026J047J114l463
11909B2117r813J2924Q039j3693j4748j0161m995k784j707J6823P791k387p520
11896a14q243q704J2848J4113j7892j0941P245K227j1481J893O439n338J279L657
11882a3012K313p88N861j306q488J344R007j6864N412K5505N611l724j2481L019
11868A409q23J905N995N410o397Q6j1432J1278J7573O48K452k312k879j5647J1622
11853A8888J0295j6720k1988k460O21M152K154K126J812j0231o369J5258J638
11840h24J01Q65j4594k186l989k121j319M656O195R519P438K472q263j6481o534
$$ plain form
11825 -25065 -14687 -5906 466 1956 433 2011 -3659 39 11385 8215 5334 -4292 -4094 11245
11811 11245 23846 18428 4594 2375 2759 84 -7916 -16803 -11202 -15486 -31642 -29863 -21490 -13488
11797 -13488 -11659 -3733 -6774 -1656 -8026 -18676 -18827 437 12754 18144 11118 10168 15693 9931
11783 9931 22865 32309 35625 27528 14247 13883 20714 24581 19825 1376 9164 12165 12535 11336
11769 11336 6815 -6188 2768 10791 5996 15307 14238 6517 -1632 -4365 9713 4388 -10720 -15229
11755 -15229 -6459 12929 23248 22930 16283 26434 21855 5915 -3042 -11978 -2835 -2150 11694 35077
11741 35077 28307 12720 20386 16818 9934 5435 -6663 -13752 -12195 8957 12965 10524 5647 -12702
11727 -12702 -5442 12095 27834 16293 8112 9714 19265 10760 7606 6520 8162 -9608 -12513
$$ packed form
11825b5065J0378Q781O372J490j523J578n670L698J1346l170k881r626J98J5339
11811A1245J2601n418j3834k219L84k675q000q887N601m284j6156J779Q373Q002
11797a3488J829P926l041N118o370j0650j51J9264J2317N390p026r50N525n762
11783I931J2934R444L316q097j3281l64O831L867m756j8449P788L001L70j199
11769A1336m521j3003Q956Q023m795R311j069p721q149k733J4078n325j5108m509
11755a5229Q770J9388J0319l18o647J0151m579j5940q957q936R143O85J3844K3383
11741C5077o770j5587P666l568o884m499j2098p089J557K1152M008k441m877j8349
11727a2702P260J7537J5739j1541q181J602R551q505l154j086J642j7770k905
$$ plain form
11714 -12513 -13085 -18236 -24942 -15916 -3125 -1741 3394 43 9439 9402 192 -4831 14542 32644
11700 32644 50871 73613 88335 87323 91672 100060 86033 63024 32897 5588 -3275 3548 -6925
11687 -6925 -25629 -25929 -16797 784 4785 8443 13432 5951 2686 -12906 -21531 -4224 16992 17536
11673 17536 7596 1477 -1435 -8466 -1013 1643 17806 25948 24235 16236 1499 -6303 -18501 -19237
11659 -19237 -8008 -14739 -16734 -23880 -15023 -2423 -4292 -5901 -13361 -605 3521 10947 -7550
11646 -7550 -23680 -9473 17086 19079 14305 13964 10687 11627 16282 8655 -956 4668 6665 -2069
11632 -2069 -1810 226 -9099 -12737 -15328 -14859 -16879 5402 17863 1716 -4743 -5026 -10125 -5833 -568
11617 -568 13340 16111 1422 -1253 15699 20471 18938 16373 9332 4745 -5814 5303 2030 273
$$ packed form
11714a2513n72n151o706R026J2791J384N135l351R396l7r210n023J9373J8102
11700C2644J8227K2742J4722j012M349Q388j4027k3009l0127k7309q863O823j0473
11687f925j8704l00R132J7581M001L658M989p481l265j5592q625J7307K1216N44
11673A7536r940o119k912p031P453K656J6163Q142j713p999j4737p802j2198p36
11659a9237J1229o731j995p146Q857J2600j869j609p460J2756M126P426j8497
11646g550j6130J4207K6559J993m774l41l277R40M655p627r611N624J997q734
11632b069K59K036r325l638k591M69k020K2281J2461j6147o459k83n099M292N265
11617e68J3908K771j4689k675J6952M772j533k565p041m587j0559J1117l273j757
$$ plain form
11603 273 -10959 -18247 -17540 -19383 -29869 -34033 -16868 -12464 -826 10133 16843 17548 24704 25814
11589 25814 27466 32565 22762 21894 9615 6274 11299 9148 8243 -6741 -3987 -3451 -5361 -7120 3194
11574 3194 4801 -1884 -13216 -9752 -16553 -33574 -44258 -38816 -21187 -13390 -7613 12550 23573
11561 23573 27662 18047 6541 1106 -2772 -8807 -7872 -3500 11474 3878 753 6229 8827 17651
11547 17651 14341 1686 -13070 1263 1547 -2277 -87 8415 21014 34874 32560 18400 -4155
11534 -4155 3558 17214 7481 -7647 -4391 -5511 2665 11685 -3958 -11666 -8733 -16842 -14137 -8442
11520 -8442 9483 7844 -4390 -13582 -13327 -8395 -18405 -29433 -23334 -27859 -21428 -6607 8245
11507 8245 14133 13759 -2056 -3794 15833 18540 4713 1662 -861 4865 -3102 -16710 -8889 -12992
$$ packed form
11603B73j1232p288P07j843j0486m164J7165M404J1638J0959O710P05P156J110
11589B5814J652N099r803q68j2279l341N025k151r05j4984K754N36j910j759J0314
11574C194J607o685j1332L464o801j7021j0684N442J7629P797N777K0163J1023
11561B3573M089r615j1506n435l878o035R35M372J4974p596l125N476K598Q824
11547A7651l310j2655j4756J4333K84l824K190Q502J2599J3860k314j4160k2555
11534d155P713J3656r733j5128L256j120Q176R020j5643p708K933q109K705N695
11520h442J7925j639j2234r192K55M932j0010j1028O099m525O431J4821J4852
11507H245N888l74j5815j738J9627K707j3827l051k523N726p967j3608P821m103
$$ plain form
11493 -12992 -22584 -23556 -8838 6901 15139 10937 -6123 4009 14965 9009 -1624 18648 19724
11480 19724 24762 26533 28000 24552 28183 37563 27385 20582 21052 15011 9427 6025 4772 1842
11466 1842 943 5680 13551 10047 -12555 -22296 -14146 -8081 -7856 -6984 -4642 -12003 -9544 -14859 -20607
11451 -20607 -28441 -41958 -35318 -44662 -37187 -28008 -8403 -7032 -7294 2265 -1777 -13596 -18218 -16611
11437 -16611 -12515 -11336 -9699 -7954 -12003 -17423 -15759 -3540 -10392 -10212 -1394 -8813 -19462 -19992
11423 -19992 4971 16492 3058 1803 16527 16966 15169 25353 32333 26534 19722 16243 7818
11410 7818 -1642 7372 1706 9887 7973 9407 14134 16707 9788 22432 27657 8670 -1568 -5160
11396 -5160 5268 14699 10795 -896 -1493 -17028 -13829 -17282 -29240 -22329 -6753 -14935 -15387 -16855
$$ packed form
11493a2992r592r72J4718J5739Q238m202j7060J0132J0956n956j0633K0272J076
11480A9724N038J771J467l448L631R380j0178o803M70o041n584l402j253k930
11466A842q99M737P871l504k2602r741Q150O065K25Q72K342p361K459n315n748
11451b0607p834j3517O640r344P475R179J9605J371k62R559m042j1819m622J607
11437a6611M096J179J637J745m049n420J664J2219o852J80Q818p419j0649n30
11423a9992K4963J1521j3434j255J4724M39j797J0184O980n799o812l479q425
11410G818r460R014n666Q181j914J434M727K573o919J2644N225j8987j0238l592
11396e160J0428R431l904j1691n97j5535L199l453j1958O911J5576q182m52j468
$$ plain form
11382 -16855 -11736 6523 13716 7018 2427 -7706 -6756 2923 1626 172 -10531 -10169 -5115 5007
11368 5007 6575 1088 -12102 -21472 -24257 -33417 -39550 -37862 -30062 -21660 -30853 -21650 -6921 -2456
11354 -2456 15085 11080 10576 3835 20550 30565 39073 48114 55232 45368 25283 20875 35408 46219
11340 46219 59234 77565 107331 132370 183865 249596 330706 437275 566748 684710 724645
11329 724645 700548 614262 514807 413530 299976 226294 173243 132633 99846 65652 54145
11318 54145 42527 19224 8975 15161 20453 11227 9376 23185 40489 29178 25497 5215 -2297
11305 -2297 1711 13800 22096 24041 29213 11192 12893 17671 23379 30897 34651 26339 8575 -14955
11291 -14955 -11186 -16808 -3306 18428 34188 34455 23026 20567 6730 -1838 1297 -7941 -16199
$$ packed form
11382a6855N119J8259P193o698m591j0133R50R679j297j454j0703L62N054J0122
11368E007J568n487j3190r370k785r160o133J688P800Q402r193R203J4729M465
11354b456J7541m005n04o741J6715J0015Q508R041P118r864k0085m408J4533J0811
11340D6219J3015J8331K9766K5039N1495O5731Q1110J06569J29473J17962L9935
11329G24645k4097q6286r9455j01277j13554p3682n3051m0610l2787l4194j1507
11318E4145j1618k3303j0249O186N292r226j851J3809J7304j1311l681k0282p512
11305b297M008J2089Q296J945N172j8021J701M778N708P518L754q312j7764k3530
11291a4955L769n622J3502K1734J5760K67j1429k459j3837q568L135r238q258
$$ plain form
11278 -16199 -14524 -3161 2340 -2520 -17550 -13510 -9638 -21194 -7249 4832 -4162 -15731 -14404
11265 -14404 -10001 -4856 -6726 -18636 -13270 1838 21862 29715 26909 10186 -103 4572 -5199
11252 -5199 -4128 2967 14586 13541 -5262 -3480 7016 1556 -5714 -17079 -15025 -12359 -9075 836
11238 836 6881 814 6130 4150 -4755 -1403 -10906 -16204 -11443 -7108 -9183 -5666 9894 12363 418
11223 418 -7939 -6601 -15622 -19986 -15300 -13321 -12610 -2114 -13270 -17027 -7312 -4195 -16 2304 -1465
11208 -1465 -6185 -3169 1265 -5262 19399 21032 12262 10104 21571 13027 8709 -3987 -9998 -18246
11194 -18246 -27984 -27092 -4817 35 9237 13704 18226 21668 15440 14318 25584 23721 16119 2829
11180 2829 2706 11662 15544 23320 10483 -4334 -11183 13792 25917 4634 4873 381 -9993 -9377
$$ packed form
11278a6199J675J1363N501m860j5030M040L872j1556J3945J2081q994j1569J327
11265a4404M403N145j870j1910N366J5108K0024P853k806j6723j0289M675r771
11252e199J071P095J1619j045j8803J782J0496n460p270j1365K054K666L284R911
11238H36O045o067N316j980q905L352r503n298M761M335k075L517J5560K469j1945
11223D18q357J338r021m364M686J979P11J0496j1156l757R715L117M179K320l769
11208a465m720L016M434o527K4661J633q770k158J1467q544m318j2696o011q248
11194a8246r738Q92K2275M852R202M467M522L442o228j122J1266j863p602j3290
11180B829j23Q956L882P776j2837j4817o849K4975J2125k1283K39m492j0374O16
$$ plain form
11166 -9377 -3684 2593 7082 -1624 -16525 -13439 -9641 -12856 -3284 5661 4030 9058 704 708 -2909
11151 -2909 -2345 5896 13636 18923 1003 -15512 -14678 -13366 -36836 -28588 -5679 -5571 -16652 -16113
11137 -16113 -11662 -3668 1773 10500 15604 1551 -5928 -8963 2950 11204 24724 26823 19602 8757
11123 8757 -2772 -19525 -26186 -16082 -9361 -5823 -3793 20432 22481 18434 16805 2418 -3490
11110 -3490 512 4691 4289 9222 20807 25715 14921 1422 -7477 -2087 4304 16746 16937 18711
11096 18711 11682 10952 11395 7996 -3877 -13908 -6333 -1467 12612 4471 -1667 -6502 -2882 3809
11082 3809 4256 13107 17721 6331 9055 16815 12096 -9629 -31638 -28297 -28487 -33280 -30600 -32907
11068 -32907 -30592 -30623 -24330 9558 21324 13795 23702 20674 2500 2653 -1248 -2678 8373 -7896
$$ packed form
11166i377N693O277M489q706j4901L086L798l215R572Q945j631N028q354Ml617
11151b909N64Q241P740N287j7920j6515Q34J312k3470Q248K2909J08j1081N39
11137a6113M451P994N441Q727N104j4053p479l035J1913Q254J3520K099p221j0845
11123H757j1529j6753o661J0104O721L538K030K4225K049m047j629j4387n908
11110c490M002M179m02M933J1585M908j0794j3499q899N390O391J2442J91J774
11096A8711p029p30M43l399j1873j0031P575M866J4079q141o138m835L620O691
11082C809M47Q851M614j1390K724P760m719k1725k2009L341j90m793K680k307
11068c2907K315l1O293L3888J1766p529R907l028j8174J53l901j430J1051j6269
$$ plain form
11054 -7896 -2573 7881 -1423 -6267 -12833 -10156 -3889 -268 -17336 -14426 19279 20673 3262 17989
11040 17989 7543 6133 7269 8264 -12386 -24741 -28984 -18615 1513 5603 845 -15524 -25750
11027 -25750 -18298 -5477 2844 5462 18324 21438 23300 12829 13387 24284 23210 8168 -6182
11014 -6182 -140 -1462 -27622 -19802 -17935 -15616 7447 25436 26298 20827 -88 -5455 -28032 -23309
11000 -23309 -18972 -4442 -11278 -25724 -30753 -22286 -3495 2298 1715 -32 -2077 -8527 -9703 -26794
10986 -26794 -32299 -19738 1977 24773 27707 -566 1527 -6807 -8447 -8526 2999 1608 4239 20705
10972 20705 15901 13457 8478 14662 15218 5593 10879 15302 9883 6009 511 3656 -1876 2132 2557
10957 2557 -15756 -24213 -16006 -9590 12490 36558 29537 16594 8070 -1005 12030 21495 33457
$$ packed form
11054g896N323J0454r304m844o566K677O267L621j7068K910L3705J394j7411J4727
11040A7989j0446j410J136R95k0650j2355m243J0369K0128M090m758j6369j0226
11027b5750P452J2821Q321K618J2862L114J862j0471N58J0897j074j5042j4350
11014f182O042j322k6160P820J867K319K3063J7989Q62n471k0915n367k2577M723
11000b3309M337J4530o836j4446n029Q467J8791N793n83j747k045o450j176j7091
10986b6794n505J2561K1715K2796K934k8273K093q334j640p9J1525j391K631J6466
10972B0705m804k444m979O184N56r625N286M423n419l874n498L145n532M008M25
10957B557j8313q457Q207O416K2080K4068p021j2943q524r075J3035R465J1962
$$ plain form
10944 33457 21851 28135 35437 14014 10319 2414 -10539 -15588 -8053 -1997 2480 11876 18292 14888
10930 14888 20766 26800 28829 37117 28305 17705 10083 17409 29862 44938 39270 44432 26538
10917 26538 24708 20179 27520 21805 17337 5707 238 2264 -5489 -6269 -803 16186 18913 9953
10903 9953 17119 18566 12896 16530 21970 13552 22981 25767 14034 11500 13018 15461 13758 5172
10889 5172 -1810 13419 9029 5829 8464 -15695 -13160 14661 18225 14802 7707 -984 -2318 -4469
10875 -4469 -5376 -6977 -12151 727 23067 15050 -15750 -16603 -370 9706 20869 20934 2614 -26637
10861 -26637 -27889 -19368 -19452 -14215 1979 18827 29600 27708 21178 24430 24721 30975 39790 53585
10847 53585 67999 62245 58163 54686 38327 26229 40735 35597 18736 22008 21996 9916 7052
$$ packed form
10944C3457j1606O284P302k1423l695p905j2953n049P535O056M477R396O416l404
10930A4888N878O034K029Q288q812j0600p622P326J2453J5076n668N162j7894
10917B6538j830m529P341n715m468j1630n469K026p753p80N466J6989K727q960
10903I953P166J447n670L634N440q418R429K786j1733k534J518K443j703q586
10889E172o982J5229m390l200K635k4159K535K7821L564l423p095q691j334k151
10875d469r07j601n174J2878K2340q017l0800q53J6233J0076J1163O5j8320k9251
10861b6637j252Q521q4N237J6194J6848J0773j892o530L252K91O254Q815J3795
10847E3585J4414n754m082l477j6359j2098J4506n138j6861L272j2j2080k864
$$ plain form
10834 7052 16166 10709 6001 -7693 -2330 -2529 -1423 -12241 -14302 1841 18927 24766 21270 44804
10820 44804 48427 34865 17075 10895 10686 7627 10227 7651 -16162 -30238 -37306 -1510 27178
10807 27178 31396 32343 37621 17827 16018 36159 47463 47809 31669 2634 -9101 -12741 10171
10794 10171 20521 14528 16341 22380 16215 8560 15564 10447 -6728 -4393 5026 4548 11162 6251
10780 6251 -3053 -5887 8111 18218 21124 10696 8767 13768 7712 14599 30948 19829 5619
10767 5619 3184 9294 289 -2819 1144 8279 9290 7609 17340 25889 29004 25612 19255 12318 7902
10752 7902 9403 10240 8294 -3013 -616 7178 27527 46800 46359 48512 50715 47161 26538 15957
10738 15957 3527 -6026 1169 2490 10542 22743 39989 45302 31536 33051 45422 46642 44706
$$ packed form
10834G052R114n457m708j3694N363j99J106j0818k061J6143J7086N839l496K3534
10820D4804L623j3562j7790o180k09l059K600k576k3813j4076p068L5796K8688
10807B7178M218R47N278j9794j809K0141J1304L46j6140k9035j1735l640K2912
10794A0171J0350n993J813O039o165p655P004n117j7175K335R419m78O614m911
10780F251r304k834J3998J0107K906j0428j929N001o056O887J6349j1119j4210
10767E619k435O110r005l108L963P135J011j681R731Q549L115l392o357o937m416
10752G902J501Q37j946j1307K397P794K0349J9273m41K153K203l554k0623j0581
10738A5957j2430r553P195J321Q052J2201J7246N313j3766J515J2371J220j936
$$ plain form
10725 44706 41088 25894 10424 2854 -3783 6259 6780 12080 30555 34595 37677 25113 9886
10712 9886 5565 22072 26405 29458 34327 29131 29305 26562 31277 28387 31068 31322 38943 39869 54337
10697 54337 51520 44426 29453 26136 32456 35126 39660 41058 31005 35314 35232 24121 15853 4766
10683 4766 2906 10253 21533 23726 28666 26848 28997 23896 21269 9501 1552 -691 -1301 1739
10669 1739 1636 -3516 -4990 3508 -1389 5095 23283 17963 5222 -4896 -6219 8274 16841 20638
10655 20638 18211 18308 14430 15444 20204 20290 24791 28260 31543 38348 30940 27689 37329 23295 27699
10640 27699 30103 32776 36742 45080 54305 52647 47920 67142 96077 116801 137891 167718 196752
10627 196752 192619 163696 139089 98992 65046 55328 47053 42174 30847 33662 42851 45307 54151
$$ packed form
10725D4706l618j5194j5470p570o637J0042N21N300J8475M040L082j2564j5227
10712I886m321J6507M333L053M869n196J74k743M715k890K681K54P621R26J4468
10697E4337k817p094j4973l317O320K670M534J398j0053M309q2j1111q268j1087
10683D766j860P347J1280K193M940j818K149n101k627j1768p949k243o10L040
10669A739j03n152j474Q498m897O484J8188n320j2741j0118j323J4493Q567L797
10655B0638k427R7l878J014M760Q6M501L469L283O805p408l251R640j4034M404
10640B7699K404K673L966Q338R225j658m727J9222K8935K0724K1090K9827K9034
10627A96752m133k8923k4607m0097l3946r718q275m879j1327K815R189K456Q844
$$ plain form
10614 54151 63994 60657 56019 48842 37248 34395 37364 20666 8734 18037 16197 24773 34507 31659
10600 31659 24120 30934 47650 54680 51818 38848 21675 21348 22307 12232 16092 31702 38981 44447
10586 44447 47198 41374 40033 56787 39322 37087 55238 56317 57400 60671 63673 77647 93486
10573 93486 105597 127152 142115 164188 181690 230570 312402 391655 515011 680877 842037
10562 842037 960477 987505 914581 776589 644246 512275 388038 290791 234619 192028
10552 192028 159896 136616 126700 98876 77553 78721 78250 81650 80885 71406 71084 76180 65009 58174
10538 58174 70505 77292 82663 84912 99205 117097 125497 151231 185213 247890 353965 502792
10526 502792 687025 851168 957292 1010956 989752 880814 720960 557242 412805 285552
$$ packed form
10614E4151R843l337m638p177j1594k853K969j6698j1932R303j840Q576R734k848
10600C1659p539O814J6716P030k862j2970j7173l27R59j0075L860J5610P279N466
10586D4447K751n824j341J6754j7465k235J8151J079J083L271L002J3974J5839
10573I3486J2111K1555J4963K2073J7502M8880Q1832P9253J23356J65866J61160
10562H42037J18440K7028p2924j37992j32343j31971j24237r7247n6172m2591
10552A92028l2132k3280r916k7824k1323J168m71L400p65r479l22N096j1171o835
10538E8174J2331O787N371K249J4293J7892Q400K5734L3982O2677J06075J48827
10526E02792J84233J64143J06124N3664k1204j08938j59854j63718j44437j27253
$$ plain form
10516 285552 195746 151237 115460 79415 75161 67534 56141 62264 54768 58702 52098 51526 53062
10503 53062 53799 49667 50694 64169 67520 65709 59384 52055 38350 43501 49040 46074 30447 17314
10489 17314 22499 28813 26461 28762 41861 42202 26207 19748 12879 11460 24016 42249 48695 38498
10475 38498 31641 19289 5106 6174 10377 14039 41885 59084 62050 78973 82671 67411 61368
10462 61368 52011 47267 44038 34729 32247 40826 53209 65902 64181 62164 56572 37389 19560
10449 19560 11975 28500 57066 69476 63697 66367 76894 85469 87237 106315 128794 136952 144188
10436 144188 157553 188810 215178 241093 225489 209428 190360 167770 154626 149623 145855 145150
10424 145150 165865 182397 211755 244315 268269 315353 395624 536860 784726 1224751 1870609
$$ packed form
10516B85552q9806m4509l5777l6045m254p627j1393O123p496L934o604n72J536
10503E3062P37m132J027J3475L351j811o325p329j3705N151N539k966j5627j3133
10489A7314N185O314k352K301J3099L41j5995o459o869j419J2556J8233O446j0197
10475C8498o857j2352j4183J068M203L662K7846J7199K966J6923L698j5260o043
10462F1368r357m744l229r309k482Q579J2383J2693j721k017n592j9183j7829
10449A9560p585J6525K8566J2410n779K670J0527Q575J768J9078K2479Q158P236
10436A44188J3365L1257K6368K5915j5604j6061j9068k2590j3144n003l768p05
10424A45150K0715J6532K9358L2560K3954M7084Q0271J41236K47866M40025O45858
$$ plain form
10413 1870609 2510363 2925919 2958349 2573769 1981601 1427722 960236 657527 471618 361326
10403 361326 283285 242029 215628 190254 164105 145485 140021 135048 135425 132200 105247 113218 136233
10390 136233 134348 120280 117380 102311 90875 81407 75816 64679 61541 53587 64970 77415 79866
10377 79866 76245 72101 67693 54043 52658 68064 76345 72026 74472 61047 48014 56218 76774
10364 76774 77784 72314 68723 83017 90115 91286 83500 82089 89520 93771 102284 90688 79844 67737
10350 67737 71716 77780 73786 97563 142711 175415 191930 206954 202497 209578 216978 214241 209632
10337 209632 176230 144461 109715 90530 90212 99352 102672 95729 80926 79884 88919 105879 110937
10324 110937 108752 106675 100426 98880 100596 106323 110475 113399 103597 86916 91358 85505 85173 89951
$$ packed form
10413A870609O39754M15556L2430l84580n92168n53879m67486l02709j85909j10292
10403C61326p8041m1256k6401k5374k6149j8620n464m973L77l225k6953P971K3015
10390A36233j885j4068k900j5069j1436r468n591j1137l138p954J1383J2445K451
10377G9866l621m144m408j3650j385J5406Q281m319K446j3425j3033Q204K0556
10364G6774J010n470l591J4294P098J171p786j411P431M251Q513j1596j0844j2107
10350F7737L979O064l994K3777M5148L2704J6515J5024m457P081P400k737m609
10337B09632l3402l1769l4746j9185l18R140L320o943j4803j042R035J6960N058
10324A10937k185k077o249j546J716N727M152K924r802j6681M442n853l32M778
$$ plain form
10310 89951 84566 74173 68925 62791 72759 100120 113690 102173 108850 122007 123056 123534 110837
10297 110837 113297 106360 87897 74267 79194 80671 66734 69752 89242 94129 84659 88649 106272
10284 106272 104396 111120 127106 133109 127213 127188 143732 166283 181371 194257 223730 251521 292911
10271 292911 363476 458014 613338 783705 888851 943143 990364 1021821 1009340 923506 804080
10260 804080 658081 515261 400730 325759 294045 290613 293141 289232 274937 272276 244861 216751
10248 216751 216796 221077 224881 222313 208105 196490 161878 124960 115301 98835 94232 95354 104011
10235 104011 113819 138819 145705 145453 139137 139422 129779 107185 85943 77157 74563 64487 64524 58438
10221 58438 51017 46265 49473 54293 77033 72807 48136 20058 3663 7794 10082 -729 -20172
$$ packed form
10310H9951n385j0393n248o134R968K7361J3570j1517O677J3157J049M78j2697
10297A10837K460o937j8463j3630M927J477j3937L018J9490M887r470L990J7623
10284A06272j876O724J5986O003n896k5J6544K2551J5088J2886K9473K7791M1390
10271B92911P0565R4538J55324J70367J05146N4292M7221L1457j2481q5834j19426
10260H04080j45999j42820j14531p4971l1714l432K528l909j4295k661k7415k8110
10248B16751M5M281L804k568j4208j1615l4612l6918r659j6466m603J122Q657
10235A04011R808K5000O886k52o316K85r643k2594k1242q786k594j0076L7o086
10221E8438p421m752L208M820K2740m226k4671k8078j6395M131K288j0811j9443
$$ plain form
10208 -20172 -29099 -6017 17726 45212 74324 99094 125056 136108 135813 102847 48765 12749
10196 12749 4112 21487 56002 103999 136014 148112 155465 166604 161230 145224 144896 135671 120778
10183 120778 121339 109222 104658 100491 88858 87295 84101 84002 90789 93181 83484 88488 94088 80227
10169 80227 77639 69170 76791 91448 66189 61088 76638 89068 103880 123623 129237 110450 82128
10156 82128 67318 44158 39701 52399 60237 73042 89304 109886 137034 130662 129038 140162
10144 140162 141751 129858 118189 125297 139967 174177 228250 302885 383582 469825 507089 575225
10132 575225 636000 652198 683344 704334 719456 743367 739776 694452 572768 432467 315822
10121 315822 269497 265438 269474 273775 289648 319227 327342 342349 351764 356834 357387 336545 303040
$$ packed form
10208b0172q927K3082K3743K7486K9112K4770K5962J1052k95l2966n4082l6016
10196A2749q637J7375L4515M7997L2015J2098P353J1139n374j6006l28r225j4893
10183A20778N61j2117m564m167j1633j563l194r9O787K392r697N004N600j3861
10169H0227k588q469P621J4657k5259n101J5550J2430J4812J9743N614j8787k8322
10156H2128j4810k3160m457J2698P838J2805J6262K0582K7148o372j624J1124
10144A40162J589j1893j1669P108J4670L4210N4073P4635Q0697Q6243L7264O8136
10132E75225O0775J6198L1146K0990J5122K3911l591m5324j21684j40301j16645
10121C15822m6325m059M036M301J5873K9579Q115J5007R415N070N53k0842l3505
$$ plain form
10108 303040 271983 259843 252294 226054 222646 232900 246994 258958 283213 309307 345101 381018
10096 381018 408864 422272 419290 412091 410979 414902 414002 417419 413840 415951 423511 426880 454850 492045
10082 492045 531361 557663 573364 585472 605008 612612 613818 631477 650637 692856 753939 808213
10070 808213 843385 866557 880832 912248 946275 977863 999888 1012915 1048486 1089714 1113362
10059 1113362 1139061 1170829 1228117 1299473 1379754 1473462 1591493 1675532 1773497 1864841 1948437
10048 1948437 2057509 2169066 2328882 2569777 2882370 3287368 3853340 4601692 5713286
10039 5713286 7503231 10577057 15261351 18565732 18328779 15966739 13222930 10140482
10031 10140482 8469768 8032535 8438185 9199966 9965530 10528606 10876467 11264901 11983836
$$ packed form
10108C03040l1057j2140p549k6240l408J0254J4094J1964K4255K6094L5794L5917
10096C81018K7846J3408k982p199j112L923r00L417l579K111P560L369K7970L7195
10082D92045L9316K6302J5701J2108J9536P604J206J7659J9160M2219O1083N4274
10070H08213L5172K3172J4275L1416L4027L1588K2025J3027L5571M1228K3648
10059A113362K5699L1768N7288P1356Q0281R3708J18031Q4039R7965R1344Q3596
10048A948437J09072J11557J59816K40895L12593M04998N65972P48352J111594
10039E713286J789945L073826M684294L304381k36953k362040k743809l082448
10031A0140482j670714m37233M05650P61781P65564N63076L47861L88434P18935
$$ plain form
10022 11983836 13073778 14712680 17015610 20010347 23611531 27764573 32774388 39486299
10014 39486299 49378732 64812689 90070381 134470376 215239878 335007702 449266982
10007 449266982 521503038 528727096 462062699 356592358 256345874 168014094 110168073
10000 110168073 75351757 54655361 42054701 33811779 27836440 22976116 18788557
9993 18788557 15436443 12759206 10855947 9614320 8837792 8503080 8514042 8583429 8491944
9984 8491944 8072012 7249169 6303950 5410597 4631249 4049968 3590481 3224003 2931128 2648744
9974 2648744 2406651 2204292 2030694 1916011 1842801 1772462 1693102 1615559 1518713 1422184 1325339
9963 1325339 1256053 1190639 1147558 1139363 1118916 1076109 1040439 992543 948466 897976 842594 801557
$$ packed form
10022A1983836J089942J638902K302930K994737L601184M153042N009815O711911
10014C9486299R892433J5433957K5257692M4399995Q0769502J19767824J14259280
10007D49266982P2236056P224058o6664397j05470341j00246484q8331780n7846021
10000A10168073l4816316k0696396j2600660q242922n975339m860324m187559
9993A8788557l352114k677237j903259j241627p76528l34712J0962O9387r1485
9984H491944m19932q22843r45219q93353p79348n81281m59487l66478k92875k82384
9974B648744k42093k02359j73598j14683p3210p0339p9360p7543r6846r6529r6845
9963A325339o9286o5414m3081q195k0447m2807l5670m7896m4077n0490n5382m1037
$$ plain form
9951 801557 749041 702251 684537 673371 669457 652242 622403 598343 589767 576268 581043 590232
9939 590232 588754 565743 544030 529009 524198 527391 509342 496197 491350 496346 503554 515249 507935
9926 507935 475786 458578 448139 426584 405385 373778 347534 330724 318487 322850 307555 323523
9914 323523 335755 346483 374203 402705 412059 423026 406211 393923 385167 365422 313622 265294
9902 265294 214609 197836 195726 197270 204892 226461 232758 253436 278002 249350 210472 145735
9890 145735 65201 -14773 -73913 -79247 -38124 41575 92167 109236 111878 114548 129438 161929
9878 161929 191927 227074 261419 293941 292941 298815 305126 301064 285007 290748 274238 242965 220250
9865 220250 215817 234197 280658 311192 335273 347147 339993 328421 306698 275989 245220 219246
$$ packed form
9951H01557n2516m6790j7714j1166l914j7215k9839k4060q576j3499M775R189
9939E90232j478k3011k1713j5021m811L193j8049j3145m847M996P208J1695p314
9926E07935l2149j7208j0439k1555k1199l1607k6244j6810j2237M363j5295J5968
9914C23523J2232J0728K7720K8502R354J0967j6815j2288q756j9745n1800m8328
9902B65294n0685j6773k110J544P622K1569O297K0678K4566k8652l8878o4737
9890A45735q0534p9974n9140n334M1123P9699N0592J7069K642K670J4890L2491
9878A61929K9998L5147L4345L2522j000N874O311m062j6057N741j6510l1273k2715
9865B20250m433J8380M6461L0534K4081J1874p154j1572k1723l0709l0769k5974
$$ plain form
9853 219246 225100 255934 283692 287189 262848 236615 220300 225271 209308 179536 173631 159675
9841 159675 166354 182745 184820 212826 226355 211986 191792 187126 170791 155002 152010 146019 136994
9828 136994 135116 130539 129664 127379 121782 112275 103244 113264 132484 168599 205706 224434 236500
9815 236500 216246 177098 145132 122963 113574 127573 162547 211347 247003 256946 259432 255114
9803 255114 246920 236495 217842 207244 219176 229618 263203 308247 347457 372511 375422 366290
9791 366290 326162 268486 222014 183425 166563 158675 136823 118044 98239 75327 64994 66235
9779 66235 74640 92946 83853 79477 93120 102161 104766 96454 108387 113069 99584 96449 110605
9766 110605 117423 118039 125124 132520 131900 119166 119601 122418 135168 137929 142229 155344 167113 157605
$$ packed form
9853B19246N854L0834K7758L497k4341k6233j6315M971j5963k9772n905j3956
9841A59675O679J6391K075K8006J3529j4369k0194m666j6335j5789k992n991r025
9828A36994j878m577q75k285n597r507r031J0020J9220L6115L7107J8728J2066
9815B36500k0254l9148l1966k2169r389J3999L4974M8800L5656R943K486m318
9803B55114q194j0425j8653j0598J1932J0442L3585M5044L9210K5054K911r132
9791C66290m0128n7676m6472l8589j6862p888k1852j8779j9805k2912j0333J241
9779F6235Q405J8306r093m376J3643R041K605q312J1933M682j3485l135J4156
9766A10605O818O16P085P396o20j2734M35K817J2750K761M300J3115J1769r508
$$ plain form
9752 157605 134215 127292 143492 136425 121472 107867 108957 108936 112796 108413 107613 115910 131958 145669
9738 145669 151286 139784 133708 121895 134736 152488 157926 141992 105832 104324 119028 115017 120458
9725 120458 121183 122661 141188 163537 153494 147285 154008 158197 150957 134277 135082 115515 104571
9712 104571 112101 101984 105970 128944 148229 145528 142216 133972 131069 124172 130981 145479 143418
9699 143418 153523 163502 156389 157569 132391 117765 113631 106358 105390 120480 113166 99111 101421
9686 101421 117374 129136 122790 137332 149576 140139 135184 142713 161204 170032 151598 139321 136273
9673 136273 141967 144405 146876 145918 150215 164333 178204 193334 200656 195002 191049 194117 189200 210084
9659 210084 256933 317327 368204 389400 383789 339854 287578 261393 235369 202193 194962 210524
$$ packed form
9752A57605k3390o923J6200p067j4953j3605J090k1L860m383q00Q297J6048J3711
9738A45669N617j1502o076j1813J2841J7752N438j5934l6160j508J4704m011N441
9725A20458P25J478J8527K2349j0043o209O723M189p240j6680Q05j9567j0944
9712A04571P530j0117L986K2974J9285k701l312q244k903o897O809J4498k061
9699A43418J0105R979p113J180k5178j4626m134p273r68J5090p314j4055K310
9686A01421J5953J1762o346J4542J2244r437m955P529J8491Q828j8434j2277l048
9673A36273N694K438K471r58M297J4118J3871J5130P322n654l953L068m917K0884
9659B10084M6849O0394N0877K1196n611m3935n2276k6185k6024l3176p231J5562
$$ plain form
9647 210524 218028 207022 201191 204616 217404 255309 305159 348250 418644 559809 822757 1188951
9635 1188951 1507308 1604495 1484179 1239131 952774 707705 533216 414788 338716 276543
9625 276543 240526 219171 207123 204787 209578 207375 194705 201401 199132 207205 210867 214207 228091
9612 228091 235094 244173 256357 260500 265114 294302 330736 370657 418971 478687 564264 731521
9600 731521 1017663 1525112 2206969 2832630 3153179 3053629 2544034 1945306 1394516 991062
9590 991062 737326 546226 438372 381264 341673 308103 287200 276195 263034 249703 236622
9579 236622 217386 200275 202980 204480 208309 207158 211361 224503 245066 244608 232178 226935 223543
9566 223543 210519 199900 200416 199113 188609 188484 179407 181298 174062 169753 176947 177829 180396 194243
$$ packed form
9647B10524P504j1006n831L425J2788L7905M9850M3091P0394J41165K62948L66194
9635A188951L18357R7187j20316k45048k86357k45069j74489j18428p6072o2173
9625B76543l6017k1355j2048k336M791k203j2670O696k269Q073L662L340J3884
9612B28091P003R079J2184M143M614K9188L6434L9921M8314N9716Q5577J67257
9600G31521K86142N07449O81857O25661L20549r9550n09595n98728n50790m03454
9590I91062k53736j91100j07854n7108l9591l3570k0903j1005j3161j3331j3081
9579B36622j9236j7111K705J500L829j151M203J3142K0563m58j2430n243l392
9566B23543j3024j0619N16j303j0504j25r077J891p236m309P194Q82K567J3847
$$ plain form
9552 194243 184518 171991 179626 192890 209366 214858 203607 199668 192148 181986 180985 192231 202741
9539 202741 191536 191181 192355 191828 179987 162275 161658 182640 194925 199694 207751 203553 205152 213987
9525 213987 216214 235731 238649 215911 208910 198166 194741 213873 225499 215368 212133 224259 228645
9512 228645 217793 198585 191454 199758 201502 208891 201451 192030 169591 172938 194136 210265 198543
9499 198543 186715 176430 181353 172711 178119 187196 201300 212880 203554 196719 183071 184096 190698
9486 190698 180919 187603 196323 194979 194675 183720 176462 190261 192130 183341 199029 197211 177395 168624
9472 168624 166494 157472 178102 171933 167336 184186 175236 152299 151865 164990 165351 170947 168593 174572
9458 174572 172488 162747 170325 174211 177603 178114 182128 188190 182858 178326 175403 164055 150124 147501
$$ packed form
9552A94243r725j2527P635J3264J6476N492j1251l939p520j0162j001J1246J0510
9539B02741j1205l55J174n27j1841j7712o17K0982J2285M769Q057m198J599Q835
9525B13987K227J9517K918k2738p001j0744l425J9132J1626j0131l235J2126M386
9512B28645j0852j9208p131Q304J744P389p440r421k2439L347K1198J6129j1722
9499A98543j1828j0285M923q642N408R077J4104J1580r326o835j3648J025O602
9486A90698r779O684Q720j344l04j0955p258J3799J869q789J5688j818j9816q771
9472A68624k130r022K0630o169m597J6850q950k2937m34J3125L61N596k354N979
9458A74572k084r741P578L886L392N11M014O062n332m532k923j1348j3931k623
$$ plain form
9444 147501 153757 144792 137125 134402 130519 132589 151066 162288 164915 158456 158793 167766 159254 164584
9430 164584 172034 168554 169802 176331 170748 164810 155015 155821 176044 185381 191473 183398 170422 153059
9416 153059 145839 146704 152117 151484 138080 133458 150271 162485 149727 135732 125613 134151 150777
9403 150777 167573 153320 134387 143938 151442 157836 152600 146995 142032 144385 144998 147288 158395 166952
9389 166952 160476 152980 146020 143095 150362 154885 132129 113819 107385 100062 98203 111284 117241 127365
9375 127365 127837 122891 114220 114637 111167 117738 135194 132414 143543 137842 118279 120507 119457 113205
9361 113205 120449 111756 120342 115948 108985 109650 104724 117122 133241 137986 143932 145534 151466 146405
9347 146405 147955 140312 145066 130788 112869 113180 114232 116077 119372 114276 117104 128850 118194 104145
$$ packed form
9444A47501O256q965p667k723l883K070J8477J1222K627o459L37Q973q512N330
9430A64584P450l480J248O529n583n938r795Q06K0223R337O092q075j2976j7363
9416A53059p220Q65N413o33j3404m622J6813J2214j2758j3995j0119Q538J6626
9403A50777J6796j4253j8933R551P504O394n236n605m963K353O13K290J1107Q557
9389A66952o476p496o960k925P267M523k2756j8310o434p323j859J3081N957J0124
9375A27365M72m946q671M17l470O571J7456k780J1129n701j9563K228j050o252
9361A13205P244q693Q586m394o963O65m926J2398J6119M745N946J602N932n061
9347A46405J550p643M754j4278j7919L11J052J845L295n096K828J1746j0656j4049
$$ plain form
9333 104145 110410 120968 111324 113958 119363 103548 90943 98734 101731 86652 84732 78001 84976
9320 84976 86714 83356 85352 102893 101911 114655 103272 92340 93862 87417 77891 77262 67436 65651
9306 65651 59592 59715 74597 91274 87780 89785 72030 69279 89597 102300 104772 89565 80226
9293 80226 78095 67436 66092 53050 54809 78433 80332 68783 74675 98231 104464 99270 108528
9280 108528 107241 100111 79674 59564 59053 77547 87994 100575 111310 112319 91097 86130 86862
9267 86862 82638 73517 55494 54532 40366 22641 37083 52687 72361 72730 68635 58190 72049
9254 72049 71288 72888 77179 68591 75536 89169 90919 78704 82265 97559 99438 84758 92697 102448
9240 102448 88537 75457 70275 76220 61574 73659 71109 71422 74176 70981 80157 69808 63953
$$ packed form
9333A04145O265J0558r644K634N405j5815j2605P791K997j5079j920o731O975
9320H4976J738l358J996J7541r82J2744j1383j0932J522o445r526o29r826j785
9306F5651o059J23J4882J6677l494K005j7755k751K0318J2703K472j5207r339
9293H0226k131j0659j344j3042J759K3624J899j1549N892K3556O233n194R258
9280A08528j287p130k0437k0110n11J8494J0447J2581J0735J009k1222m967P32
9267H6862m224r121j8023r62j4166j7725J4442J5604J9674L69m095j0445J3859
9254G2049p61J600M291q588O945J3633J750j2215L561J5294J879j4680P939R751
9240A02448j3911j3080n182N945j4646J2085k550L13K754l195R176j0349n855
$$ plain form
9227 63953 70619 63450 47331 54586 61919 63729 54958 53510 37878 30246 37826 48000 52497 53101
9213 53101 42264 32966 54243 62158 54855 44213 47422 62049 62969 46900 45818 58702 62857
9200 62857 64955 68763 56718 49735 43761 45451 46515 55656 72744 74427 73954 62795 64962 53745
9186 53745 51128 50523 61500 67691 62989 44304 45659 46080 51994 60430 59204 52506 44867 44646 46216
9171 46216 58624 57899 56577 54949 57977 48925 29206 27668 31644 36270 35952 25050 27169 38078
9157 38078 33674 47742 53599 55120 58022 60201 42188 39235 29875 32990 38675 51574 50950 49222
9143 49222 51435 51082 45819 40442 32643 39631 44336 49913 40518 37108 34785 36862 41905 49056 43890
9128 43890 37091 32155 37403 54223 51083 41489 35255 45567 70356 80693 83826 75227 56432
$$ packed form
9227F3953O666p169j6119P255P333J810q771j448j5632p632P580J0174M497O04
9213E3101j0837r298K1277P915p303j0642L209J4627R20j6069j082J2884M155
9200F2857K098L808j2045o983n974J690J064R141J7088J683m73j1159K167j1217
9186E3745k617o05J0977O191m702j8685J355M21N914Q436j226o698p639k21J570
9171D6216J2408p25j322j628L028r052j9719j538L976M626l18j0902K119J0909
9157C8078m404J4068N857J521K902K179j8013k953r360L115N685J2899o24j728
9143D9222K213l53n263n377p799O988M705N577r395l410k323K077N043P151n166
9128D3890o799m936N248J6820l140r594o234J0312K4789J0337L133q599j8795
$$ plain form
9115 56432 49137 60266 58136 61376 52594 26846 28171 40477 56209 69299 65665 48536 31221
9102 31221 23732 28792 22282 26269 48557 53692 42566 41355 25997 4315 1395 6943 5740 3350
9088 3350 -2156 18999 31231 15927 3890 16122 42782 44286 43135 39431 42914 42135 34452 42145
9074 42145 42884 39225 40600 47514 42715 35156 33835 30718 24302 29581 32944 26602 34775 42751 28041
9059 28041 32867 43994 49155 69484 66573 54900 38664 28940 29518 30679 31463 35569 33475 36333
9045 36333 37590 35134 35595 34807 37903 43134 32718 15777 29139 52983 53740 33660 24709 19053
9031 19053 21602 24472 21789 24247 12669 20056 19360 18511 32597 32382 31570 21725 16748 18537 18569 28011
9015 28011 30525 40678 45227 49865 28785 14749 10513 11035 -2053 -15989 -3034 10331 25959
$$ packed form
9115E6432p295J1129k130L240q782k5748J325J2306J5732J3090l634j7129j7315
9102C1221p489N060o510L987K2288N135j1126j211j5358k1682k920N548j203k390
9088C350n506K1155J2232j5304j2037J2232K6660J504j151l704L483p79p683P693
9074D2145P39l659J375O914m799p559j321l117o416N279L363o342Q173P976j4710
9059B8041M826J1127N161K0329k911j1673j6236r724N78J161P84M106k094K858
9045C6333J257k456M61p88L096N231j0416j6941J3362K3844P57k0080q951n656
9031A9053K549K870k683K458j1578P387o96q49J4086k15q12r845m977J789L2R442
9015B8011K514J0153M549M638k1080j4036m236N22j3088j3936J2955J3365J5628
$$ plain form
9002 25959 43082 36229 34358 25160 36144 45183 44083 44191 28969 22119 29668 23232 18703 -463
8988 -463 -425 14301 20868 25061 21930 14713 1958 6855 14794 16726 17501 4751 -12245 -2444 2524
8973 2524 20906 24956 9781 29288 42326 36039 20586 13556 24336 37099 43158 38698 32041
8960 32041 27680 15352 14033 6981 9005 16815 30680 22274 10727 3854 -3313 -3637 1227 8683
8946 8683 4660 12745 30945 26462 15410 14753 7930 -5154 5202 17683 16783 7581 13774 9659
8932 9659 10866 14619 20527 16720 7507 4381 -4434 7686 19567 19387 23264 30185 25676 29412 14817
8917 14817 688 1369 8771 15519 18066 21525 3431 4780 17189 20207 22469 26061 35881 33264
8903 33264 24824 8117 14971 18327 8715 3198 12513 18219 14355 15573 11189 8487 10689 11691
$$ packed form
9002B5959J7123o853j871r198J0984R039j100J08j5222o850P549o436m529j9166
8988d63L8J4726O567M193l131p217j2755M897P939J932P75j2750j6996R801M968
8973B524J8382M050j5175J9507J3038o287j5453p030J0780J2763O059m460o657
8960C2041m361j2328j319p052K024P810J3865q406j1547o873p167l24M864P456
8946H683m023Q085J8200m483j1052o57o823j3084J0356J2481r00r202O193m115
8932I659J207L753N908l807r213l126q815J2120J1881j80L877O921m509L736j4595
8917A4817j4129O81P402O748K547L459j8094J349J2409L018K262L592R820k617
8903C3264q440j6707O854L356r612n517R315N706l864J218m384k702K202J002
$$ plain form
8889 11691 17271 11623 5860 12425 14795 18848 21786 26793 28006 29780 28415 22035 26643 29667 24903
8874 24903 22339 18001 -6068 -9159 -5607 16902 18624 30317 39942 38238 27678 17863 13903 -4719
8860 -4719 -9631 2616 8093 17532 10657 5633 13020 3163 2479 13833 21302 20850 12721 4906 -640
8845 -640 8266 6155 5523 -18904 -21648 -9573 7900 23245 35827 24354 11389 12215 15627 15647
8831 15647 11793 30988 34813 23105 11260 5837 10415 18721 16450 317 447 3055 3249 8305
8817 8305 12541 15580 12515 22120 16371 9913 22535 15123 9704 21674 13443 15350 26660 31468
8803 31468 9913 1749 -15324 -24811 -25757 -14206 -12036 -5773 9794 9510 17240 23426 21398 23079
8789 23079 11932 10299 6217 12720 5218 -8370 -3307 10445 15459 22622 24727 15520 14852 19704
$$ packed form
8889A1691N580n648n763O565K370M053K938N007J213J774j365o380M608L024m764
8874B4903k564m338k4069l091L552K2509J722J1693R625j704j0560r815l960j8622
8860d719m912J2247N477R439o875n024P387r857o84J1354P469m52q129p815n546
8845f40Q906k111o32k4427k744J2075J7473J5345J2582j1473j2965Q26L412K0
8831A5647l854J9195L825j1708j1845n423M578Q306k271j6133J30K608J94N056
8817H305M236L039l065R605n749o458J2622p412n419J1970q231J907J1310M808
8803C1468k1555q164j7073r487r46J1551K170O263J5567k84P730O186k028J681
8789B3079j1147j633m082O503p502j3588N063J3752N014P163K105r207o68M852
$$ plain form
8775 19704 10567 19573 29632 23658 21885 26737 528 3405 23186 29490 32878 27559 21379 14424
8761 14424 14986 9224 3973 8967 9579 4153 17121 16916 4831 -8051 18733 39888 41035 16475
8747 16475 2328 -16074 -21932 -19337 -2987 2089 755 -1439 -1689 10826 25796 23725 30793 29740
8733 29740 21520 20333 12301 13959 23792 25973 25988 29270 30136 6266 -9973 4028 4028 23646 23672 21329
8717 21329 24855 15704 10222 15470 40835 43429 33315 34869 39074 22244 7323 13715 12806 6966
8703 6966 25487 34604 27461 19766 19452 16742 15306 9475 14668 20736 10513 6731 -1326 -1206 5223
8688 5223 6621 2729 18261 26181 26463 28946 19795 8467 3408 -519 -5147 13952 13182 12994 26881
8673 26881 30944 31549 19958 19414 27058 31364 21763 23417 26534 26302 23015 28665 18722 20605 20976
$$ packed form
8775A9704r137R006J0059n974j773M852k6209K877J9781O304L388n319o180o955
8761A4424N62n762n251M994O12n426J2968k05j2085j2882K6784K1155J147k4560
8747A6475j4147j8402n858K595J6350N076j334k194k50J2515J4970k071P068j053
8733B9740q220j187q032J658R833K181J5L282Q66k3870j6239J4001%J9618K6k343
8717B1329L526r151n482N248K5365K594j0114J554M205j6830j4921O392r09n840
8703F966J8521R117p143p695l14k710j436n831N193O068j0223l782q057J20O429
8688E223J398l892J5532P920K82K483r151j1328n059l927m628J9099p70j88J3887
8673B6881M063O05j1591n44P644M306r601J654L117k32l287N650r943J883L71
$$ plain form
8658 20976 20723 19226 23835 32912 41966 37032 38205 78374 121415 162838 201222 248796 266151
8645 266151 262182 233168 173732 122839 71175 52198 45604 33530 21391 12061 -2755 197
8633 197 15471 25168 30755 25393 16983 4805 5090 10675 9473 24944 28915 40106 37561 31945
8619 31945 29362 25093 22477 17109 27721 42004 37313 37028 46385 53511 41450 24998 18477 17241
8605 17241 10220 4914 19859 29745 24027 21444 34363 31121 34399 26544 -971 3498 6786 12740
8591 12740 1831 -2821 3609 3839 3397 20620 37677 31576 44231 43474 44138 41484 35488 36596 49699
8576 49699 56273 75826 85233 95847 105182 119180 116662 142654 170598 182732 184319 202649 186974
8563 186974 152325 125127 94356 65514 40678 31904 26630 22352 40347 35807 29133 24843 32434
$$ packed form
8658B0976k53j497M609R077R054m934J173M0169M3041M1423L8384M7574J7355
8645B66151l969k9014n9436n0893n1664j8977o594j2074j2139r330j4816K952
8633A97J5274R697N587n362q410j2178K85N585j202J5471L971J1191k545n616
8619C1945k583m269k616n368J0612J4283m691k85R357P126j2061j6452o521j236
8605A7241p021n306J4945R886n718k583J2919l242L278p855k7515M469L288N954
8591A2740j0909m652O430K30m42J7223J7057o101J2655p57O64k654n996J108J3103
8576D9699O574J9553R407J0614R335J3998k518K5992K7944J2134J587J8330j5675
8563A86974l4649k7198l0771k8842k4836q774n274m278J7995m540o674m290P591
$$ plain form
8550 32434 43267 52897 46625 45873 30185 21697 28034 22158 19144 26243 21108 15232 19677 19698 20107
8535 20107 12369 14389 24334 22088 3625 -11866 3161 3190 5721 -2181 6515 18098 17473 6792
8521 6792 -1061 2469 -1080 24279 37640 32103 29865 31896 22665 17477 14766 16758 19452 25258
8507 25258 30782 19178 15432 1577 13184 15308 -44 15816 27751 9080 -667 7479 101
8494 101 4291 8002 16631 11151 -2316 -6135 -9664 364 10396 29570 44208 33310 37825 45176
8480 45176 40202 40436 43364 28814 17435 8724 26231 42415 47721 56488 39536 29832 35998 26600
8466 26600 18194 19023 33371 41293 34789 19927 17886 23314 27008 32732 26469 2394 -8257 4560
8452 4560 11897 -313 -10040 -18316 -14851 -4429 -6435 -8359 7854 19586 16360 15471 21886 18015
$$ packed form
8550C2434J0833R630o272p52j5688q488O337n876l014P099n135n876M445K1M09
8535B0107p738K020R945k246j8463j5491J5027K9K531p902Q696J1583o25j0681
8521F792p853L530l549K5359J3361n537k238K031r231n188k711J992K694N806
8507B5258N524j1604l746j3855J1607K124j5352J5860J1935j8671r747Q146p378
8494A01M190L711Q629n480j3467l819l529J0028J0032J9174J4638j0898M515P351
8480D5176m974K34K928j4550j1379q711J7507J6184N306Q767j6952r704O166r398
8466B6600q406Q29J4348P922o504j4862k041N428L694N724o263k4075j0651J2817
8452D560P337j2210r727q276L465J0422k006j924J6213J1732l226q89O415l871
$$ plain form
8438 18015 16689 3637 -6540 -372 18033 15587 -1365 -12709 -16896 -27775 -33469 -21544 -5937
8425 -5937 -4431 -2126 5906 5732 1446 16248 21997 23105 8188 1925 -3388 2772 6449 -5123
8411 -5123 1817 30011 40078 22809 3455 -2124 -9159 -15171 -17641 -20632 -6814 -5760 -12573 873
8397 873 -515 5304 12408 17688 22159 -1246 5860 16054 -3350 -6533 -9415 -14723 -8779 -3961
8383 -3961 -6165 -1035 9023 12389 10681 12891 19395 11142 1010 8017 18732 20606 12655 6498
8369 6498 -2457 -4 985 2739 25608 29274 20276 7167 6402 15648 9528 -8482 -16668 -8579 -3850
8354 -3850 610 5168 12019 7059 9509 9727 -4726 -8196 -13428 -20873 -17925 -6469 9201 18025
8340 18025 7182 -5491 -5630 -1451 -6425 -6752 -2899 5413 1181 860 1558 -2185 -4654 -3342 -2602
$$ packed form
8438A8015j326j3052j0177O168J8405k446j6952j1344m187j0879n694J1925J5607
8425e937J506K305Q032j74m286J4802N749J108j4917o263n313O160L677j1572
8411e123O940K8194J0067j7269j9354n579p035o012k470k991J3818J054o813J3446
8397H73j388N819P104N280M471k3405P106J0194j9404l183k882n308N944M818
8383c961k204N130J0058L366j708K210O504q253j0132P007J0715J874p951o157
8369F498q955K453R89J754K2869L666q998j3109p65R246o120j8010q186Q089M729
8354c850M460M558O851m960K450K18j4453l470n232p445K948J1456J5670Q824
8340A8025j0843j2673j39M179m974l27L853Q312m232l21O98l743k469J312P40
$$ plain form
8325 -2602 -17290 -15078 -1701 3796 7495 7225 960 1981 1182 704 -4542 -19651 -14660 -6354 -5372
8310 -5372 -15379 -21121 -6587 9068 21360 24870 14459 -7287 -26193 -37733 -33321 -30275 -20131
8297 -20131 -8266 4232 8557 1072 -3465 4092 7594 4952 13943 20460 5867 6903 -12835 -18455
8283 -18455 -12686 -5508 -2057 -425 2163 6746 806 -1541 6453 4395 -1607 -4628 -17799 -11820
8269 -11820 -1031 7691 2807 -17376 -18378 -3304 4331 6269 -7480 -17240 -10037 -15683 -8046 -13890
8255 -13890 -14843 -12515 -5536 -2704 -19182 -24271 -10854 -11071 -16115 -30818 -32565 -19699 -13033 4663
8241 4663 14469 21175 13639 7117 3916 5472 170 -4639 -5464 8083 7485 -640 -1211 12424 -1375
8226 -1375 -16780 -17114 -22606 -11608 -5277 -12274 -23202 -21580 -18672 -12430 -3582 9026 10775 -5285
$$ packed form
8325b602j4688K212J3377N497L699k70o265J021p99m78n246j5109M991Q306R82
8310e372j0007n742J4534J5655J2292L510j0411k1746j8906j1540M412L046J0144
8297b0131J1865J2498M325p485m537P557L502k642Q991O517j4593J036j9738n620
8283a8455N769P178L451J632K588M583n940k347P994k058o002l021j3171N979
8269a1820J0789Q722m884k0183j002J5074P635J938j3749r760P203n646P637n844
8255a3890r53K328O979K832j6478n089J3417k17n044j4703j747J2866O666J7696
8241D663R806O706p536o522l201J556n302m809q25J3547n98q125n71J3635j3799
8226a375j5405l34n492J0998O331o997j0928J622K908O242Q848J2608J749j6060
$$ plain form
8212 -5285 -5871 -8868 -5497 5544 -6828 -17219 -30148 -40669 -38308 -28428 -19694 -16328 -27206 -23215
8198 -23215 -8158 9275 19644 20846 11912 -14030 -22511 -11863 4461 13317 16563 -6051 -21511
8185 -21511 -23537 -21091 -15722 -5026 525 -14965 -14546 -14236 -5174 3260 -7073 -5726 -4472 -2507
8171 -2507 4661 7365 4320 13329 26021 28380 22251 3131 -767 18593 13503 4661 -1228 9207
8157 9207 17089 -929 2812 -3247 -12788 -17907 -21099 -19494 426 10160 11648 11382 785 5127
8143 5127 11552 8186 19228 27244 26540 33211 7532 -2789 3693 13757 17975 -8373 -5892 -7574
8129 -7574 2119 14397 12716 2884 5699 4708 -3864 -15923 -10962 229 -2282 -11520 -28495 -29056
8115 -29056 -27792 -11456 -11051 -7915 768 15712 22530 1176 -4767 2484 -174 9555 25093 26005
$$ packed form
8212e285n86k997L371J1041j2372j0391j2929j0521K361R880Q734L366j0878L991
8198b3215J5057J7433J0369J202q934k5942q481J0648J6324Q856L246k2614j5460
8185b1511k026K446N369J0696N551j5490M19L10R062Q434j0333J347J254J965
8171b507P168K704l045R009J2692K359o129j9120l898J9360n090q842n889J0435
8157I207P882j8018L741o059r541n119l192J605J9920R734J488k66j0597M342
8143E127O425l366J1042Q016p04O671k5679j0321O482J0064M218k6348K481j682
8129g574R693J2278j681r832K815r91q572j2059M961J1191k511r238j6975n61
8115b9056J264J6336M05L136Q683J4944O818k1354n943P251k658R729J5538R12
$$ plain form
8101 26005 20275 14466 20303 25438 12026 7741 2967 -8781 -14473 -18635 -6931 -3515 5411 1027
8087 1027 -3972 -5194 -8552 2525 10328 13702 22006 24272 21728 10887 12887 17639 19062 21840
8073 21840 17226 5137 -2910 -6747 6906 7362 3153 6848 16921 24646 16780 7680 6658 8795
8059 8795 -995 -11746 -8818 -2202 5315 8328 1609 6445 -12421 -19548 -15112 -17914 -16315 -26272
8045 -26272 -38454 -46176 -33742 -6918 -7358 -15299 -19701 -21291 -22554 -16050 -4869 4860 19903 10765
8031 10765 -6342 -6581 1198 14137 18139 15573 21947 11244 6581 22174 20848 12616 12340 -2031
8017 -2031 -16799 -39437 -33306 -8982 2912 -3096 -22565 -13969 -4667 -14703 -11907 -6930 -1888
8004 -1888 8675 8872 13905 20721 8942 5641 -2825 -5334 -6625 -6754 6256 11450 -256 -3730
$$ packed form
8101B6005n730n809N837N135j3412m285m774j1748n692m162J1704L416Q926m384
8087A027m999j222l358J1077P803L374Q304K266k544j0841K000M752J423K778
8073B1840m614j2089q047l837J3653M56m209L695J0073P725p866r100j022K137
8059H795r790j0751K928O616P517L013o719M836j8866p127M436k802J599r957
8045b6272j2182p722J2434K6824m40p941m402j590j263O504J1181R729J5043r138
8031A0765j7107k39P779J2939M002k566O374j0703m663J5593j326q232k76j4371
8017b031j4768k2638O131K4324J1894o008j9469Q596R302j0036K796M977N042
8004a888J0563J97N033O816j1779l301q466k509j291j29J3010N194j1706l474
$$ plain form
7990 -3730 -12150 -22363 -24437 -20644 -5708 6249 7744 15075 18355 8888 8850 6145 -8263 2316
7976 2316 15946 5528 -2019 -4014 1001 2912 8733 2373 -8566 -5808 -5313 -3872 -3473 -2293 -29359
7961 -29359 -24074 -24389 -16638 -17849 -14524 -2237 -9034 -24548 -18156 -5470 5177 5819 4942 -8021
7947 -8021 -25745 -34118 -18286 823 13316 30073 25855 10511 4232 11758 14694 1892 -5361
7934 -5361 -1414 -7770 -13076 -10601 -6185 3446 12180 6181 -13799 -19652 -15108 -17339 -24441 -24387 -26398
7919 -26398 -19413 -12013 -2841 4126 10764 10641 1073 -1823 -2634 -18096 -13432 -15430 -21082 -17793 -5564
7904 -5564 -4279 -142 10696 -1945 7661 -1879 -12636 -5939 8273 -5708 -12899 -7940 -2099 12752
7890 12752 10930 -3741 -7049 -11619 -16382 -24163 -11331 -5987 9857 8350 1142 -7760 -7135 2471
$$ packed form
7990c730q420j0213k074L793J4936J1957J495P331L280r467l8k705j4408J0579
7976B316J3630j0418p547j995N015J911N821o360j0939K758M95J441L99J180k7066
7961b9359N285l15P751j211L325J2287o797j5514O392J2686J0647O42q77j2963
7947h021j7724q373J5832J9109J2493J6757m218j5344o279P526K936j2802p253
7934e361L947o356n306K475M416R631Q734n999j9980n853M544k231p102N4k011
7919b6398O985P400R172O967O638j23r568k896q11j5462M664j998n652L289J2229
7904e564J285M137J0838j2641R606r540j0757O697J4212j3981p191M959N841J4851
7890A2752j822j4671l308m570m763p781J2832N344J5844j507p208q902O25R606
$$ plain form
7876 2471 5454 13387 13179 2228 3400 4488 1355 4487 15804 22461 21646 14023 10668 -1774 -5380
7861 -5380 -21879 -29957 -36063 -35694 -20448 -11687 -3197 -15439 -8625 -14507 -16881 -11539 4301 16566
7847 16566 -2569 -11927 -11720 -11888 -9809 -16902 -7737 1430 4560 1274 -14785 -15461 -18760 -14017 -11378
7832 -11378 -17355 -4942 2546 5997 13616 5315 -6841 -10004 -2124 -4879 -4086 -2857 -4971 -7593
7818 -7593 -11462 -3974 6785 3545 7715 10552 9844 8705 12194 5503 -10600 -18031 -16525 -3220
7804 -3220 -8093 -3902 2896 2351 -4147 -5303 -8264 -24080 -30070 -35152 -36311 -29307 -27139 -19174 6195
7789 6195 12913 -305 -9333 -16186 -4516 -6905 -5413 -2106 1261 -4510 -23179 -18429 -15024 -7668
7775 -7668 -7200 -8481 10042 18394 5354 2583 -2736 1250 45 9328 4903 6652 13885 22719 16544
$$ packed form
7876B471K983P933k08j0951J172J088l133L132J1317O657q15p623l355j2442l606
7861e380j6499q078o106L69J5246Q761Q490j2242O814n882k374N342J5840J2265
7847A6566j9135r358K07j68K079p093R165R167L130l286j6059o76l299M743K639
7832a1378n977J2413P488L451P619q301j2156l163P880k755P93J229k114k622
7818g593l869P488J0759l240M170K837p08j139L489o691j6103p431J506J3305
7804c220m873M191O798n45o498j156k961j5816n990n082j159P004K168P965K5369
7789F195O718j3218r028o853J1670k389J492L307L367n771j8669M750L405P356
7775g668M68j281J8523Q352j3040k771n319L986j205R283m425J749P233Q834o175
$$ plain form
7760 16544 9819 9759 14989 6213 12224 14409 -15337 -30111 -22837 -14683 -9077 3504 1771 -5234
7746 -5234 12449 8016 -5718 4247 9636 13122 7672 3848 3479 7182 2712 3571 2210 -12612 -11100
7731 -11100 -12436 -2828 2898 -4972 -10507 7739 11018 -6564 -1194 5515 -2 -5201 -6395 -2806
7717 -2806 -5879 -20125 -33906 -13289 10583 10172 7471 19938 18532 -2062 -27298 -43375 -44821
7704 -44821 -15295 3604 -1023 -16338 -19148 -6160 8729 3879 -10335 -7117 8574 4472 -2025
7691 -2025 6113 927 -2434 826 -8469 -13536 -21890 -28526 -25335 -21717 -23097 -28874 -21819 -19001 -16466
7676 -16466 -133 5905 2707 11562 9648 1249 4586 5244 -8195 -12211 -8558 -17682 -12653 -12678 -12216
7661 -12216 -24474 -37003 -47985 -41508 -34585 -23804 -5899 -10476 -14396 -7572 15503 17683 2627
$$ packed form
7760A6544o725o0N230q776O011K185k9746j4774P274Q154N606J2581j733p005
7746e234J7683m433j3734R965N389L486n450l824l69L703m470Q59j361j4822J512
7731a1100j336R608N726p870n535J8246L279j7582N370O709n517n199j194L589
7717b806l073j4246j3781K0617K3872m11k701J2467j406k0594k5236j6077j446
7704d4821K9526J8899m627j5315k810J2988J4889m850j4214L218J5691m102o497
7691b025Q138n186l361L260r295n067q354o636L191L618j380n777P055K818K535
7676a6466J6333O038l198Q855j914q399L337O58j3439m016L653r124N029k5M62
7661a2216j2258j2529j0982O477O923J0781J7905m577l920O824K3075K180j5056
$$ plain form
7648 2627 -7061 -17559 -18999 -7168 -8073 -18479 -21791 -22634 -28564 -34596 -32081 -35884 -42667 -23951
7634 -23951 -14762 -11706 -9843 8510 10896 4772 8871 -5768 -11152 -7416 -19757 -21257 -21850 -17630
7620 -17630 -3119 -4782 -8934 -5557 -7397 -23817 -47274 -49138 -43131 -41229 -38918 -21218 -8471
7607 -8471 11650 14044 12854 6294 1404 1881 10917 1094 -8928 -10948 3082 7765 4130 6064
7593 6064 5510 5253 -5695 -19183 -19981 -16759 -12604 2659 -741 10287 4597 -11477 -9660 -9237 6741
7578 6741 10438 -3078 -6297 -1425 -2602 5181 12089 17306 11599 704 -8476 -7307 7539 -513
7564 -513 -979 -11254 -8323 -9783 -14031 -2953 -12460 -14798 -22613 -22675 -23376 -44291 -44566 -28622 -21940
7549 -21940 -7328 10658 30733 34351 22006 14062 4944 15345 21872 32421 33179 34749 19880
$$ packed form
7648B627r688j0498j440J1831r05j0406l312q43n930o032K515l803o783J8716
7634b3951R189L056J863J8353K386o124M099j4639n384L736j2341j500n93M220
7620a7630J4511j663m152L377j840j6420k3457j864O007J902K311J7700J2747
7607h471K0121K394j190o560m890M77R036r823j0022k020J4030M683l635J934
7593F064n54k57j0948j3488p98L222M155J5263l400J1028n690j6074J817M23J5978
7578F741L697j3516l219M872j177P783O908N217n707j0895r180J169J4846q052
7564e13m66j0275K931j460m248J1078r507k338p815o2p01k0915k75J5944O682
7549b1940J4612J7986K0075L618j2345p944r118J0401O527J0549P58J570j4869
$$ plain form
7536 19880 -6443 -14405 2751 13587 276 -13028 2533 16228 1289 -24663 -29404 -14243
7524 -14243 -8063 -2060 14883 20639 13831 -5725 -21417 -33856 -44174 -27423 -19432 -11272 -16381
7511 -16381 -15345 -16774 -5843 -4066 -9607 9523 18278 8623 19195 24034 15542 18541 7347 -2996
7497 -2996 685 18869 12284 2748 -7885 -23412 -12359 7397 16723 -1316 -19411 -19742 -12293
7484 -12293 -20932 -32931 -13069 7903 11812 -10567 -26774 -5744 -4601 -16297 -17710 -8665 17615
7471 17615 9079 -3893 -4265 -6785 -8548 -14048 554 9813 3783 -3369 -5303 8277 15993 20803
7457 20803 25057 13252 998 -8676 -9353 -9657 -17997 -15434 -16566 -21235 -18232 -21494 -5754 8633
7443 8633 17081 29057 19927 1914 -7207 4408 7804 1153 -341 -3475 -1741 -10299 -7585 -4818
$$ packed form
7536A9880k6323p962J7156J0836j3311j3304J5561J3695j4939k5952m741J5161
7524a4243O180O003J6943N756o808j9556j5692j2439j0318J6751P991Q160n109
7511a6381J036j429J0931J777n541J9130Q755r655J0572M839q492K999j1194j0343
7497b996L681J8184o585r536j0633j5527J1053J9756R326j8039j8095l31P449
7484a2293q639j1999J9862K0972L909k2379j6207K1030J143j1696j413R045K6280
7471A7615q536j2972l72k520j763n500J4602R259o030p152j934J3580P716M810
7457B0803M254j1805j2254r674o77l04q340K563j132m669L003l262J5740J4387
7443H633Q448J1976r130j8013r121J1615L396o651j494l134J734q558K714K767
$$ plain form
7429 -4818 -7722 -9139 -7477 1503 8664 -2778 4861 6320 12043 12060 17504 12540 3178 -5330 -16141
7414 -16141 -20233 -21619 -23697 -33131 -42587 -24364 10082 13871 8163 -10966 -23055 -30397 -23551 -3963
7400 -3963 -754 -5693 -4983 2952 8758 -1976 -5023 -1464 -12714 -11023 604 653 6992 16496 18369
7385 18369 -2384 -4451 -974 1928 -3130 -7390 -23173 -18963 -14416 -10410 -18020 -32218 -22068 -14778
7371 -14778 -16438 -11995 -15077 -22187 -23875 902 22439 11583 -218 2633 8310 6923 -1140 -17823
7357 -17823 -26244 -20543 -7838 1383 -12083 -17626 -21703 -15904 -13172 -6986 -1688 -8519 -8720 7973
7343 7973 12112 5842 -32 -17169 -18652 -1513 20088 1020 -11573 -3250 -701 27 -3374 -8777
7329 -8777 -12239 -16409 -28408 -30168 -25369 -20085 -16587 -12953 -21227 -25029 -23917 -24155 -22941 -25383 -30986
$$ packed form
7429d818k904j417J662Q980P161j1442P639J459N723J7N444m964r362q508j0811
7414a6141m092j386k078r434r456J8223L4446L789n708j9129j2089p342O846J9588
7400c963L209m939P10P935N806j0734l047L559j1250J691J1627M9O339R504J873
7385A8369k0753k067L477K902n058m260j5783M210M547M006p610j4198J0150P290
7371a4778j660M443l082p110j688K4777K1537j0856j1801K851N677j387q063j6683
7357a7823q421N701J2705R221j3466n543m077N799K732O186N298o831k01J6693
7343G973M139o270n874j7137j483J7139K1601j9068j2593Q323K549P28l401n403
7329h777l462m170j1999j760M799N284L498L634q274l802J112k38J214k442n603
$$ plain form
7314 -30986 -25504 -20060 -21982 -9074 -8908 -15147 -13623 -12308 5408 -1852 367 8506 10834 -12230
7300 -12230 -16730 -15100 -21315 -9503 -16226 -12280 1542 3451 -1502 4864 178 -7188 -2374 -3223
7286 -3223 -6866 -2671 2866 6942 13530 13738 -4904 -7253 -2972 -227 6685 15656 11438 4516 -6083
7271 -6083 -12296 -15679 -30541 -22429 -16507 -26718 -19860 -23181 -17721 -15545 -3359 -214 -4762 -1381
7257 -1381 4662 5613 4361 -3544 -11482 -17844 -18136 -6894 3079 3078 -1714 -9765 -17088 -12631 6987 5283
7241 5283 -5925 742 -8214 -13675 -2742 -11984 -20732 -21258 -30199 -22735 -2910 1425 6793 17545
7227 17545 -1330 -25038 -11397 -883 -3999 -5147 -11438 -14295 -22097 -16299 2638 12121 1385
7214 1385 -5861 -2970 -16111 -10027 1551 10879 12493 20251 24812 26693 754 -10118 -13860 -10162
$$ packed form
7314c0986N482N444j922J2908J66o239J524J315J7716p260K219Q139K328k3064
7300a2230m500J630o215J1812o723L946J3822J909m953O366m686p366M814q49
7286c223l643M195N537M076O588K08j8642k349M281K745O912Q971m218o922j0599
7271f083o213l383j4862Q112N922j0211O858l321N460K176J2186L145m548L381
7257a381O043R51j252p905p938o362k92J1242R973jm792q051p323M457J9618j704
7241E283j1208O667q956n461J0933r242q748n26q941P464J9825M335N368J0752
7227A7545j8875k3708J3641J0514l116j148o291k857p802N798J8937R483j0736
7214A385p246K891j3141O084J1578R328J614P758M561J881k5939j0872l742L698
$$ plain form
7200 -10162 1126 -2371 -2124 2652 2232 6634 6153 -6006 -18368 -17829 -14109 -10984 -13193 -15771 -8303
7185 -8303 -12445 -24786 -25733 -15234 -11466 6871 13614 -1680 -20992 -23264 -17178 -3884 1464 6916
7171 6916 -11272 -26773 -31294 -31025 -17369 -7022 3651 11257 12560 11745 11493 -595 5013 6783
7157 6783 -2170 1409 -356 -2112 -2026 -6416 -243 -8424 -27471 -25220 -10685 -6028 -22182 -15444 -11353
7142 -11353 -8283 -7608 -9397 -6525 1330 -7375 -12036 -19294 -10517 -2744 -1930 6629 1356 1603 1722 -6211
7126 -6211 -19308 -31626 -30860 -28865 -31710 -17990 -11756 -10308 -936 -239 9911 4498 2462 5631
7112 5631 -10159 -24368 -29109 -21278 3120 10652 13141 2234 -5835 -162 -3509 -8876 -6252 -3832
7098 -3832 -10965 -17699 -10117 3026 11820 14370 8027 5947 -2909 -5674 -17833 -24321 -11325 2032
$$ packed form
7200a0162J1288l497K47M776m20M402m81j2159j2362N39L720L125k209k578P468
7185h303m142j2341r47J0499L768J8337O743j5294j9312k272O086J3294N348N452
7171F916j8188j5501m521K69J3656J0347J0673P606J303q15k52j2088N608J770
7157F783q953L579j765j756Q6m390O173q181j9047K251J4535M657j6154O738M091
7142a1353L070O75j789K872P855q705m661p258Q777P773Q14Q559n273K47J19p933
7126f211j3097j2318P66J995k845J3720O234J448R372O97J0150n413k036L169
7112E631j5790j4209m741P831K4398P532K489j0907q069N673l347n367K624K420
7098c832p133o734P582J3143Q794K550o343k080q856k765j2159o488J2996J3357
$$ plain form
7084 2032 7483 4210 4249 8428 1978 -4696 -8444 -10333 -1181 4500 11596 69 -10426 -8773 -4254
7069 -4254 -2804 -14404 -31772 -45385 -34692 -18404 1003 17904 9947 2620 10776 24784 33379
7056 33379 22890 2345 -10188 -14883 -21677 -36857 -47734 -51972 -46013 -34180 -28235 -16888 -12600
7043 -12600 -4736 -6340 673 8818 18391 10456 7844 9052 10245 13425 8614 2594 -4764 -11809 -5905
7028 -5905 -1058 -6722 -2696 9352 13392 -2247 -1547 9229 3420 -10429 -3746 14429 8075 2038
7014 2038 -8935 -5877 -7062 -6425 -13889 -22668 -25000 -15283 -6706 -9710 -8049 5342 14980 10612 16155
6999 16155 18419 22802 28635 18417 4680 16030 26912 15184 13109 13643 -530 -1784 -7462
6986 -7462 -14063 -19252 -33266 -34169 -30362 -28093 -14492 -8721 -9856 -9786 -4782 -1565 14512 17661 10043
$$ packed form
7084B032N451l273L9M179o450o674l748j889R152N681P096j1527j0495J653M519
7069d254J450j1600j7368j3613J0693J6288J9407J6901p957p327Q156J4008Q595
7056C3379j0489k0545j2533m695o794j5180j0877m238N959J1833N945J1347M288
7043a2600P864j604P013Q145R573p935k612J208J193L180m811o020p358p045N904
7028e905M847n664M026J2048M040j5639P00J0776n809j3849O683J8175o354o037
7014B038j0973L058j185O37p464q779k332R717Q577l004J661J3391R638m368N543
6999A6155K264M383N833j0218j3737J1350J0882j1728k075N34j4173j254n678
6986g462o601n189j4014r03L807K269J3601N771j135P0N004L217J6077L149p618
$$ plain form
6971 10043 -15830 -16385 -7702 -10296 -6001 11941 15139 9929 5125 -1059 -15118 -15975 -9606 3281
6957 3281 19286 8664 1297 9662 19388 7119 -408 -7834 -141 6696 -2962 -9777 -769 -1564
6943 -1564 2947 11355 3781 1561 19634 15416 9846 3723 -1475 -3477 2905 5086 7241 -799 -4222
6928 -4222 -13318 -10873 -16597 -12838 -2475 -1952 -5762 -3986 -15477 -23435 -10500 10230 19072 30731
6914 30731 34453 14772 8365 16740 29707 9290 -8773 -10471 -13485 -12239 3963 10180 6672
6901 6672 5040 1769 -2434 2566 9533 -11235 -40891 -48239 -26430 -15338 -4927 -647 -4102 7345
6887 7345 -1124 -24200 -42784 -24941 -5789 -10257 -15321 -12084 -20830 -18889 -15001 -9280 -20225 -20618
6873 -20618 -10899 4209 3068 -1244 -10099 -11815 -11268 12302 14266 7349 3774 -10381 -12104 -4009
$$ packed form
6971A0043k5873n55Q683k594M295J7942L198n210m804o184j4059q57O369J2887
6957C281J6005j0622p367Q365R726j2269p527p426P693O837r658o815R008p95
6943a564M511Q408p574k220J8073m218n570o123n198k002O382K181K155q040l423
6928d222r096K445n724L759J0363N23l810J776j1491p958J2935K0730Q842J1659
6914C0731L722j9681o407Q375J2967k0417j8063j698l014J246J6202O217l508
6901F672j632l271m203N000O967k0768k9656p348K1809J1092J0411M280l455J1447
6887G345q469k3076j8584J7843J9152m468n064L237q746J941L888N721j0945l93
6873b0618R719J5108j141m312q855j716N47K3570J964o917l575j4155j723Q095
$$ plain form
6859 -4009 -8884 -13424 995 13766 -1121 -16204 -9222 6334 -966 -2004 -11232 -18534 -25121 -14870
6845 -14870 -17168 -13739 -12477 -10866 -12067 46 10371 696 -2304 -19001 -32616 -22997 -9980
6832 -9980 -755 12923 11864 12679 9925 8223 3876 16569 21952 12735 3547 -10252 -20635 -26751
6818 -26751 -37167 -33178 -12370 -17560 -37637 -35935 -23461 -4452 2924 5080 -2025 -13232 -8482
6805 -8482 -10538 6454 9162 13792 9649 11516 8173 -2114 2099 978 19905 28422 25643 19118
6791 19118 7748 7141 16967 19945 11145 2946 1055 -18008 -36528 -21221 -20899 -13237 3124 4677
6777 4677 -2885 -2836 4139 6701 -11567 -21711 -23165 -20971 -14660 -10080 904 9605 16815 11687 715
6762 715 -5952 -10804 -4294 -11228 -20841 -14166 -25655 -17993 -4858 -2043 479 7206 -13710 -37813
$$ packed form
6859d009m875m540J4419J2771j4887j5083O982J5556p300j038r228p302o587J0251
6845a4870k298L429J262J611j201J2113J0325r675l000j6697j3615R619J3017
6832i980R225J3678j059Q15k754j702m347J2693N383r217r188j3799j0383o116
6818b6751j0416L989K0808n190k0077J702J2474J9009P376K156p105j1207M750
6805h482k056J6992K708M630m143J867l343j0287M213j121J8927Q517k779o525
6791A9118j1370o07R826K978q800q199j891j9063j8520J5307L22P662J6361J553
6777D677p562M9O975K562j8268j0144j454K194O311M580J0984Q701P210n128j0972
6762G15o667m852O510o934r613O675j1489P662J3135K815K522O727k0916k4103
$$ plain form
6748 -37813 -50502 -31854 4585 14193 848 -257 4157 -436 -3627 3373 4584 13247 21580 18461
6734 18461 7212 -3148 -12791 387 -3891 -13682 -21059 -5741 12217 19854 5369 -4916 -4710
6721 -4710 -2470 -9411 -25917 -23407 -3968 14508 6549 538 -12120 -17475 -23287 -17724 10815 16297
6707 16297 15221 3015 1374 20542 41592 44035 43167 43875 31170 21042 11291 15424 14746 10541
6693 10541 5691 7724 20015 5246 -148 -6284 6779 8980 15597 10984 2532 -5478 -22215 -33578
6679 -33578 -37053 -31348 -21102 -22280 -19099 3691 -2494 -9282 -4468 4922 1277 -1450 2369 1734
6665 1734 4370 -2135 -10813 -11900 7030 12254 -3663 4085 -8156 -14108 -27364 -26762 3243 6791
6651 6791 -16359 -19546 -3395 2048 -19269 -26187 -17738 -2520 6319 8830 4516 -6968 808 -3187
$$ packed form
6748c7813j2689J8648L6439R608j3345j105M414m593l191P000J211Q663Q333l119
6734A8461j1249j0360r643J3178m278r791p377J5318J7958P637j4485j0285K06
6721d710K240o941j6506K510J9439J8476p959o011j2658n355n812N563K8539N482
6707A6297j076j2206j641J9168K1050K443q68P08j2705j0128r751M133o78m205
6693A0541m850K033J2291j4769n394o136J3063K201O617m613q452q010j6737j1363
6679c3578l475N705J0246j178L181K2790o185o788M814R390l645k727L819o35
6665A734K636o505q678j087J8930N224j5917P748j2241n952j3256O02L0005L548
6651F791k3150l187J6151N443k1317o918Q449J5218Q839K511m314j1484P776l995
$$ plain form
6637 -3187 -8393 -10745 -8137 -1157 -5160 8035 12235 9488 19972 12619 -4151 255 8286 10814
6623 10814 4903 2737 477 5396 12426 16392 6910 -2344 -9094 -13142 1093 -3004 -13442 -6960
6609 -6960 -17873 -21379 -13945 -10335 -6202 -9055 -9486 -12528 -13252 -20795 -18739 -5384 -5389 3312 13758
6594 13758 7196 378 -14301 -19347 -3208 17046 23287 30739 29049 17286 -120 -16600 -15739
6581 -15739 -4548 7989 453 -1645 13725 23180 19146 8358 2148 -1275 10937 12616 9127
6568 9127 4583 -1092 4439 30017 36328 31205 17767 17675 4580 6574 -4848 -10456 -1896 -3506
6554 -3506 -13796 1521 -7122 -4124 -6959 -2522 -6000 -14560 -10912 -3115 -4161 -4188 672 3973 -7228
6539 -7228 -15406 463 12176 -4502 -22818 -17995 -11634 -4967 -783 5508 8238 -119 -3092 -2446
$$ packed form
6637c187n206k352K608O980m003J3195M200k747J0484p353j6770M406Q031K528
6623A0814n911k166k260M919P030L966r482r254o750m048J4235m097j0438O482
6609f960j0913l506P434L610M133k853m31l042p24p543K056J3355nQ701J0446
6594A3758o562o818j4679n046J6139K0254O241P452j690j1763j7406j6480Q61
6581a5739J1191J2537p536k098J5370R455m034j0788o210l423J2212J679l489
6568I127m544n675N531K5578O311n123j3438r2j3095J994j1422n608Q560j610
6554c506j0290J5317q643K998k835M437l478q560L648P797j046k7M860L301j1201
6539g228q178J5869J1713j6678j8316M823O361O667M184O291K730q357k973O46
$$ plain form
6525 -2446 -5501 -21044 -26012 -27179 -18930 -871 1760 -4251 1444 2763 -8315 -21609 -22450 -9487
6511 -9487 -5419 -4343 -4987 -4678 -7202 -15415 -25306 -26797 -25142 -27308 -18840 -13516 -2862 -16195 -1531
6496 -1531 10047 -2650 8931 24553 28209 20070 -5383 -9044 -14042 -12943 -13094 -25705 -26924 -21818
6482 -21818 -11600 -4412 3166 20806 11081 14251 22773 8396 3966 4794 -3404 8708 22751 25116
6468 25116 11949 -5647 -20314 -34704 -37049 -32252 570 16233 21968 18726 21387 35500 20911
6455 20911 18993 23783 10327 -6781 -22461 -22655 -9019 16817 28152 17096 8795 473 -12301
6442 -12301 -710 9611 8336 204 -3870 -9179 8430 9866 -5146 -7440 -22520 -12601 -9508
6429 -9508 -17411 -16624 -17463 -24507 -32783 -40983 -18006 2577 8454 22927 20951 3897 3934 11949 14638
$$ packed form
6525b446l055j5543m968j167Q249J8059K631o011N695J319j1078j3294q41J2963
6511i487M068J076o44L09k524q213r891j491J655k166Q468N324J0654j3333J4664
6496a531J1578j2697J1581J5622L656q139k5453l661m998J099j51j2611j219N106
6482b1818J0218P188P578J7640r725L170Q522j4377m430Q28q198J2112J4043K365
6468B5116j3167j7596j4667j4390k345M797L2822J5663N735l242K661J4113j4589
6455B0911j918M790j3456j7108j5680j94J3636K5836J1335j1056q301q322j2774
6442a2301J1591J0321j275q132m074n309J7609J436j5012k294j5080R919L093
6429i508p903P87q39p044q276q200K2977K0583N877J4473j976j7054L7Q015K689
$$ plain form
6414 14638 19582 13358 7357 6364 -1261 11616 13375 16808 28419 24827 26419 -139 -28292 -34298
6400 -34298 -18389 -3714 -1491 -7977 -10236 -4948 -8004 -22293 -32401 -32869 -32574 -24996 -18106 -4416
6386 -4416 -6104 -1558 86 -2603 -4008 -10542 -18357 -17261 -6778 -2272 -6943 -9845 -4835 -13469 -29640
6371 -29640 -31791 -30857 -19662 -7535 6231 -9108 -12547 -4339 4425 11642 15196 13460 15436 12294
6357 12294 13757 17553 4298 -6044 8478 986 -14949 -18724 -10573 3309 3262 -929 -8867 936
6343 936 -6319 4456 9961 11334 8898 5921 2866 -6562 -5922 -1089 560 -734 5932 6057 -9204
6328 -9204 -21662 -909 -5556 -10454 -6402 2669 -1802 -16208 -31170 -29777 -13376 14036 17418
6315 17418 8669 -2282 6211 26697 18922 8836 2047 -12992 -20976 -18395 661 -13155 -30642
$$ packed form
6414A4638M944o224o001r93p625J2877J759L433J1611l592J592k6558k8153o006
6400c4298J5909J4675K223o486k259N288l056j4289j0108m68K95P578O890J3690
6386d416j688M546J644k689j405o534p815J096J0483M506m671k902N010q634j6171
6371b9640k151R34J1195J2127J3766j5339l439Q208Q764P217L554j736J976l142
6357A2294J463L796j3255j0342J4522p492j5935l775Q151J3882m7m191p938R803
6343I36p255J0775N505J373k436k977l055r428O40M833J649j294O666J25j5261
6328i204j2458K0753m647m898M052R071m471j4406j4962J393J6401K7412L382
6315A7418q749j0951Q493K0486p775j0086o789j5039p984K581J9056j3816j7487
$$ plain form
6302 -30642 -19252 -9237 -3862 -10198 -15878 -6228 -5690 -11140 -21391 -25088 -15007 -6335 -4663 -5343
6288 -5343 1558 13897 12135 9516 3311 1923 3066 -780 -6861 -12011 -7632 -439 8008 6172 795
6273 795 9281 8991 -17861 -23867 -23047 -18022 -17502 -23581 -24254 -18927 -21705 -21950 -30633 -24280 -14793 -10160
6257 -10160 -15864 -24450 -10978 -11065 -16918 -17295 -24948 -24613 -8053 -5677 -14113 -15209 -7598 -3028 -440
6242 -440 -16240 -16171 5663 28848 16848 -5119 -3374 -9876 -1911 -2917 -17698 -19547 -16112 -13662
6228 -13662 -6535 3767 2740 -11935 -17595 -3490 10393 3846 -24799 -29878 -18540 -17288 -18085
6215 -18085 -15091 772 120 9579 -2651 -19251 -4777 -1367 -4884 -14615 -41524 -39554 -21814
6202 -21814 -25264 -10758 6081 12308 16984 18830 7551 -303 10594 19722 13134 -369 12807
$$ packed form
6302c0642J1390J0015N375o336n680R650N38n450j0251l697J0081Q672J672o80
6288e343O901J2339j762k619o205j388J143l846o081n150M379P193Q447j836n377
6273G95Q486k90k6852o006Q20N025N20o079o73N327k778k45q683O353R487M633
6257a0160n704q586J3472q7n853l77p653L35J6560K376q436j096P611M570K588
6242d40j5800O9K1834K3185j2000k1967J745o502P965j006j4781j849L435K450
6228a3662P127J0302j027j4675n660J4105J3883o547k8645n079J1338J252p97
6215a8085K994J5863o52R459j2230j6600J4474L410l517r731k6909J970J7740
6202b1814l450J4506J6839O227M676J846j1279p854J0897R128o588j3503J3176
$$ plain form
6189 12807 14615 -1086 -11145 -2174 -7108 -13732 -9708 4143 2788 10172 9093 834 -5266 -19391
6175 -19391 -25758 -13162 -7317 -6397 6 4390 -6407 -23792 -15223 9204 1881 -854 2263 960
6161 960 699 -968 -298 -5156 -17990 -7670 -5452 -12135 2594 -1047 7950 11681 -11555 -24794
6147 -24794 -36614 -45769 -29393 -12153 -10606 -12965 -19535 -5647 -1140 4427 1189 2780 14088
6134 14088 30 -20565 -19319 -6085 -11584 -11737 -10427 3511 31743 18930 13314 5127 -3836
6121 -3836 3030 16191 13644 13230 21084 16281 22304 14271 -3654 -4854 -6449 -4739 409 -11354
6107 -11354 -22597 -7861 9660 20602 16194 5928 500 -6172 -8152 -7219 -24627 -25711 -13517
6094 -13517 -7081 -1579 2545 11529 7952 134 -186 4068 8846 33508 20273 -10742 -27069 -6130
$$ packed form
6189A2807J808j5701j0059Q971m934o624M024J3851j355P384j079q259o100j4125
6175a9391o367J2596N845R20O403M384j0797j7385Q569K4427p323k735L117j303
6161I60k61j667O70m858j2834J0320K218o683J4729l641Q997L731k3236j3239
6147b4794j1820r155J6376J7240J547k359o570J3888M507N567l238J591J1308
6134A4088j4058k0595J246J3234n499j53J310J3938K8232j2813n616q187q963
6121c836O866J3161k547m14P854m803O023q033j7925j200j595J710N148j1763
6107a1354j1243J4736J7521J0942m408j0266n428o672j980R33j7408j084J2194
6094a3517O436N502M124Q984l577p818l20M254M778K4662j3235l1015j6327K0939
$$ plain form
6080 -6130 464 -2399 -4169 -6111 -13646 -17595 -9697 9002 7441 4081 11367 7411 6926 10438 15307
6065 15307 11353 5292 9809 15457 15530 10415 10413 2820 9464 9440 14723 18866 9448 11351 14420 -6868
6049 -6868 -9244 -15651 -17081 -18766 -20706 -6653 7037 9441 552 -2929 -21413 -22249 -4358 -4362 -9770
6034 -9770 -9250 -12038 -4401 -10865 -17785 -13031 -1 -4082 -6919 -1977 -9978 -11868 -9149 -9208 -6552
6019 -6552 -4167 -6028 -10533 -14737 -14734 -3739 5355 -17361 -26772 -18507 -11917 -23387 -18192 -4378 8186
6004 8186 3401 -6900 -7707 -3702 -3047 -9791 -4657 90 4559 9802 9520 -5865 -582 -3290 -7840
5989 -7840 -2387 -8551 6681 2393 -2597 -16779 -10480 -11564 -3809 -14069 -20696 -23069 -19881 -9169
5975 -9169 1476 21276 8866 -8014 -30190 -38287 -40962 -16066 -15757 -37441 -46343 -28943 -11579
$$ packed form
6080f130O594k863j770j942p535l949P898J8699j561l360P286l956m85L512M869
6065A5307l954o061M517N648P3n115kp593O644k4N283M143r418J903L069k1288
6049f868k376o407j430j685j940J4053J3690K404q889l481j8484q36J7891mn408
6034i770N20k788P637o464o920M754J3030m081k837M942q001j890K719n9K656
6019f552K385j861m505m204LJ0995R094k2716r411Q265O590j1470N195J3814J2564
6004H186m785j0301q07M005O55o744N134M747M469N243k82j5385N283k708m550
5989g840N453o164J5232m288m990j4182O299j084P755j0260o627k373L188J0712
5975i169J0645J9800j2410j6880k2176q097k675K4896L09k1684q902J7400J7364
$$ plain form
5962 -11579 14045 9903 -2442 -14363 -22722 -11711 8612 -3938 -3472 8358 11119 1787 -1437
5949 -1437 2141 -3797 899 4314 10056 178 -5969 -16689 -17679 -11868 -16337 -14988 -784 8244 4592
5934 4592 4086 -2925 -7352 4585 7129 1739 1975 -4268 -17391 -8048 3816 9975 -6298 -1263
5920 -1263 -6772 -1137 3067 4722 9966 32723 20915 10460 2296 899 3572 7654 5501 -2770
5906 -2770 -8408 -10129 -16657 -7205 2090 -14059 -21867 -6007 715 -1027 -22604 -17320 -6234 -10269
5892 -10269 -23091 -15086 -8468 -15250 -22278 -14754 -5124 2890 12082 199 -6547 -7026 -8592 -9775
5878 -9775 -4892 1948 -8188 -14394 -18789 -20678 -15667 -1049 3624 5930 -9657 -14932 -18721 -12088
5864 -12088 -13432 -22186 -17024 -2950 -790 -6156 -15572 -22187 -21158 -22288 -19337 -12856 -5691 -8457
$$ packed form
5962a1579K5624m142j2345j1921q359J1011K0323j2550M66J1830K761r332l224
5949a437L578n938M696L415N742r878o147j0720r90N811m469J349J4204R028l652
5934D592n06p011m427J1937K544n390K36o243j3123R343J1864O159j6273N035
5920a263n509N635M204J655N244K2757j1808j0455q164j397K673M082k153q271
5906b770n638j721o528R452R295j6149p808J5860O722j742k1577N284J1086m035
5892a0269j2822Q005O618o782p028P524R630Q014R192j1883o746m79j566j183
5878i775M883O840j0136o206m395j889N011J4618M673K306j5587n275l789O633
5864a2088j344q754N162J4074K160n366r416o615J029j130K951O481P165k766
$$ plain form
5850 -8457 -16063 -14622 -9630 -23342 -24011 -22424 -19540 -1698 11544 9741 13823 9585 -266 -6025
5836 -6025 -8037 -7953 -6292 -368 11237 24735 32859 14990 6785 935 11795 8555 -14730 -17585
5822 -17585 -11489 -1632 7732 10961 4173 732 -3664 -7273 -927 13434 13131 12185 20514 610 -20588
5807 -20588 -25614 -24391 -19103 -10679 -5033 4811 20018 18699 3352 -6813 -12484 -5455 6174 16565
5793 16565 17659 -4493 -16531 -9271 20701 30349 27242 17363 12620 19200 18784 15682 -2925 -8163
5779 -8163 -11013 -4595 -5336 -3519 7792 11474 19074 17221 3424 -2688 356 -98 4368 20578 17211
5764 17211 -3058 -7972 3273 -984 -5824 -10175 -22026 -30279 -34323 -43872 -34701 -30102 -26574 -26248
5750 -26248 -17500 -15988 -6348 -8917 -3487 1019 -10555 -11456 -3598 11714 -8763 -18948 -23215 -19373
$$ packed form
5850h457p606J441M992j3712o69J587K884J7842J3242j803M082m238r851n759
5836f025k012Q4J661N924J1605J3498Q124j7869q205n850J0860l240k3285k855
5822a7585O096R857R364L229o788l441m396l609O346J4361l03r46Q329j9904k1198
5807b0588n026J223N288Q424N646R844J5207j319j5347j0165n671P029J1629J0391
5793A6565J094k2152j2038P260K9972R648l107r879m743O580m16l102j8607n238
5779h163k850O418p41J817J1311L682P600j853j3797o112L044m54M466J6210l367
5764A7211k0269m914J1245m257m840m351j1851q253m044r549R171M599L528L26
5750b6248Q748J512R640k569N430M506j1574r01P858J5312k0477j0185m267L842
$$ plain form
5736 -19373 -12447 -10824 2063 14550 19786 15777 4400 10382 12231 9994 3728 -9294 -13576 -25452
5722 -25452 -22073 -3783 -16842 -21885 -32684 -20104 -16959 -19652 -9908 -7303 -23290 -40250 -37184
5709 -37184 -17789 -665 21688 5459 -15404 -21590 -9746 4722 9778 5586 17844 28512
5697 28512 23846 9465 16938 7663 2968 -2776 13021 24834 18564 8039 4870 -492 -7321 -3718
5683 -3718 7588 10152 3420 -7720 -18367 -17484 -24111 -17254 -7039 1270 -11987 -22776 -8591
5670 -8591 3482 2965 2328 8131 10189 -6471 -2126 -7286 7007 16598 15382 12206 17504 4693
5656 4693 -4153 -2380 -5770 2479 -911 -222 -15478 -8416 8865 5707 -8843 -2784 469 20526
5642 20526 8387 -28496 -25784 7247 5526 7297 3439 -1926 -9080 -9211 -1332 13890 19147 8238
$$ packed form
5736a9373O926J623J2887J2487N236m009j1377N982J849k237o266j3022m282j1876
5722b5452L379J8290j3059n043j0799J2580L145k693R744K605j5987j6960L066
5709c7184J9395J7124K2353j6229k0863o186J1844J4468N056m192J2258J0668
5697B8512m666j4381P473r275m695n744J5797J1813o270j0525l169n362o829L603
5683c718J1306K564o732j1140j0647Q83o627O857J0215Q309j3257j0789J4185
5670h591J2073n17o37N803K058j6660M345n160J4293R591j216l176N298j2811
5656D693q846J773l390Q249l390O89j5256P062J7281l158j4550O059L253K0057
5642B0526j2139l6883K712L3031j721J771l858n365p154j31P879J5222N257j0909
$$ plain form
5628 8238 -2046 -13533 -26142 -25934 -23554 -21280 -14415 -636 -5454 -26926 -30491 -24625 -6879 2840
5614 2840 2657 13852 11111 2389 -6516 -16026 -13241 -15812 -17943 -8775 3554 14269 6596 -14939
5600 -14939 -8785 -9698 4727 996 -10696 -13765 -7382 -3710 -7626 -5158 2588 -8855 -22120 -26539
5586 -26539 -21634 -27207 -19144 -11127 -18767 -14781 -6629 -5787 -14829 -7550 -4471 -1960 -5414 -17320 -19397
5571 -19397 -8555 2977 7434 16090 11840 15551 17080 12447 -9380 -32326 -25058 -10709 -14793
5558 -14793 -16871 -3938 20778 12165 3905 4313 3187 -201 -5120 -6084 4762 25124 32510 26428
5544 26428 23079 6345 -4171 -8160 -17657 -16918 -8427 -1472 -10712 -2392 -6633 -9213 -9199 4132 10850
5529 10850 16211 7262 -6990 -1201 14094 24130 21724 5795 -2393 -14138 -12213 -2046 -16390
$$ packed form
5628H238j0284j1487j2609K08K380K274O865J3779m818k1472l565N866J7746R719
5614B840j83J1195k741q722q905r510K785k571k131R168J2329J0715p673k1535
5600a4939O154r13J4425l731j1692l069O383L672l916K468P746j1443j3265m419
5586b6539M905n573Q063Q017p640L986Q152Q42r042P279L079K511l454j1906k077
5571a9397J0842J1532M457Q656m250L711J529m633k1827k2946P268J4349m084
5558a4793k078J2933K4716q613q260M08j126l388m919r64J0846K0362P386o082
5544B6428l349j6734j0516l989r497P39Q491O955r240Q320m241k580J4J3331O718
5529A0850N361q949j4252N789J5295J0036k406j5929q188j1745J925J0167j4344
$$ plain form
5516 -16390 -10951 56 8404 -1527 -12789 -9406 507 4586 2694 3628 15015 15845 1661 -22733
5502 -22733 -24528 -21804 -22176 -17164 -14192 -26391 -37009 -23715 -19766 -19182 -19230 -4390 6085 12073
5488 12073 20809 20750 10804 14557 8133 1158 647 -2567 -4423 -3471 -3391 -9896 -14039 -6014 -666 4508
5472 4508 3124 -5136 14176 15626 15755 9101 3466 14464 7190 9659 10371 1576 11681 6136 -12488
5457 -12488 2459 3577 1583 -3571 -10619 -16290 -28505 -30310 -21072 -15030 -9485 -1363 12914 1131
5443 1131 -18430 -17746 -16206 -20324 -11555 -20536 -34698 -18041 2507 5616 5737 16118 31547 13281
5429 13281 -5486 8160 10304 -2173 -14495 -16761 -13293 -10766 -5897 2833 12086 17590 14305 17962
5415 17962 15443 -4062 -4924 -3866 -8671 1221 3946 111 -12830 -19135 -12289 -6657 -13999 -29879
$$ packed form
5516a6390N439J1007Q348r931j1262L383R913M079j892R34J1387Q30j4184k4394
5502b2733j795K724l72N012K972j2199j0618J3294L949N84m8J4840J0475N988
5488A2073Q736n9r946L753o424o975n11l214j856R52Q0o505m143Q025N348N174
5472D508j384q260J9312J450J29o654n635J0998p274K469P12q795J0105n545j8624
5457a2488J4947J118j994n154p048n671j2215j805R238O042N545Q122J4277j1783
5443A131j9561O84J540m118Q769q981j4162J6657K0548L109J21J0381J5429j8266
5429A3281j8767J3646K144j2477j2322k266L468K527M869Q730R253N504l285L657
5415A7962k519j9505q62J058m805R892K725l835j2941o305O846N632p342j5880
$$ plain form
5401 -29879 -14136 3273 1660 -3553 -3833 3419 7763 15056 6333 8894 8698 15633 10000 1249 471
5386 471 -8705 5444 1634 -25765 -24893 -17514 -18685 -8311 2291 -4389 -519 4514 5971 8809
5372 8809 5320 8145 23007 19485 13161 19401 14955 14009 3334 -11059 3385 5753 8907 9842
5358 9842 110 -3785 2776 9959 -6823 -6689 -14177 -17751 -4607 16138 19180 1478 -20987 -15703
5344 -15703 -6529 -9105 -1413 -1889 -3601 3705 -166 102 2722 1936 -5463 -5432 10319 14007 4010 2304
5328 2304 2384 -9561 -18177 -5413 790 10800 8130 -4785 -1152 5688 -462 -4697 -11180 -21181
5314 -21181 -16484 -15623 -15063 -16377 -2445 -5213 -5361 -20495 -14009 2243 -3038 -10403 -15258 -4645
5300 -4645 -2619 10315 23555 26433 28619 34904 13839 -219 -152 4491 -477 -3941 1500 -1921
$$ packed form
5401b9879J5743J7409j613n213k80P252M344P293q723K561j96O935n633q751p78
5386D71r176J4149l810k7399Q72P379j171J0374J0602o680L870N033J457K838
5372H809l489K825J4862l522o324O240m446r46j0675j4393J4444K368L154R35
5358I842r732l895O561P183j6782J34p488l574J3144K0745L042j7702k2465N284
5344a5703R174k576P692m76j712P306l871K68K620p86p399L1J5751L688r997j706
5328B304Q0j1945q616J2764O203J0010k670j2915L633O840o150m235o483j0001
5314b1181M697Q61N60j314J3932k768j48j5134O486J6252n281p365m855J0613
5300d645K026J2934J3240K878K186O285k1065j4058O7M643m968l464N441l421
$$ plain form
5286 -1921 -1668 11155 7904 4749 9021 32776 31058 17231 2893 -4338 -12077 -4419 -32834 -36112
5272 -36112 -19353 -9857 -71 -5127 -16788 -8477 -3353 -21617 -27188 -21603 -44420 -31507 -2100
5259 -2100 6465 12692 34966 32993 13144 11376 4319 -9250 -26359 -20472 -24236 -26896 -33810 -29251
5245 -29251 -32311 -33625 -25818 -16474 -17272 -18241 -8527 -6976 -1409 -16677 -40454 -41625 -31883 -19641
5231 -19641 -18468 -24898 -14129 6035 5756 -11743 -5218 -2193 8573 20955 6127 -6238 -12294
5218 -12294 -6126 -1549 -17509 -14304 -9170 -7492 5289 6659 -7047 -4998 -9364 -18124 -33815 -27790
5204 -27790 -26576 -20749 -26102 -20539 -16506 -21239 -32807 -27025 -5884 -9808 -21616 -3623 25671
5191 25671 31722 27408 25287 29536 22924 9757 -721 -9275 -5129 -8759 -7690 -23311 -13440 13546
$$ packed form
5286a921K53J2823l251l155M272K3755j718j3827j4338p231p739P658k8415l278
5272c6112J6759R496R786n056j1661Q311N124j8264n571N585k2817J2913K9407
5259b100Q565O227K2274j973j9849j768p057j3569j7109N887l764k660o914M559
5245b9251l060j314P807R344p98r69R714J551N567j5268k3777j171R742J2242
5231a9641J173o430J0769K0164k79j7499O525L025J0766J2382j4828j2365o056
5218a2294O168M577j5960L205N134J678J2781J370j3706K049m366q760j5691O025
5204b7790J214N827n353N563M033m733j1568N782K1141l924j1808J7993K9294
5191B5671O051m314k121M249o612j3167j0478q554M146l630J069j5621R871K6986
$$ plain form
5177 13546 6710 6109 10060 22196 30672 15297 5419 6680 9868 5179 -7749 -14578 -11453 -15551
5163 -15551 -9930 3088 10229 -1476 3416 75 -8025 -27894 -25287 -1685 11504 17090 10142
5150 10142 7587 3791 -20720 -20716 1095 -3510 -21433 -10479 -3078 -6211 -14749 -24177 -19655 -4396
5136 -4396 3367 10633 26799 26365 7934 3307 6227 11441 2736 -10668 -10247 -5358 -5899 -10954 -26777
5121 -26777 -28651 -33898 -35382 -9430 8121 -957 -3813 -2708 -10685 -4831 2379 4380 7138 5561
5107 5561 3652 5382 3280 -6363 -5009 -5720 -19583 -28610 -27430 -39348 -39517 -24320 -29019 -15534
5093 -15534 1820 14323 10351 -4378 -22158 -29038 -13016 -8244 -1419 8762 16013 20205 10615
5080 10615 1505 1659 -4851 -2638 -2809 -2989 -7403 -9259 -10191 -16153 -18599 -11772 -5552 -11435 -14787 -21771
$$ packed form
5177A3546o836o01L951J2136Q476j5375r878J261L188m689j2928o829L125m098
5163a5551N621J3018P141j1705M892l341q100j9869K607K3602J3189N586o948
5150A0142k555l796k4511MK1811m605j7923J0954P401l133q538r428M522J5259
5136d396P763P266J6166m34j8431m627K920N214q705j3404M21M889n41n055j5823
5121b6777j874n247j484K5952J7551r078k856J105p977N854P210K001K758j577
5107E561j909J730k102r643J354p11j3863r027J180j1918j69J5197m699J3485
5093a5534J7354J2503l972j4729j7780o880J6022M772O825J0181P251M192r590
5080A0615r110J54o510K213j71j80m414j856r32n962k446O827O220n883l352o984
$$ plain form
5064 -21771 -8348 3237 -5021 -15497 48 4389 1826 -6032 -3503 2038 319 6494 12179 2203
5050 2203 -8523 -10458 687 15857 1617 -19402 -6303 -1829 4249 -955 -11481 -16465 -15826
5037 -15826 1156 18576 7582 -9372 -16288 -17296 -11151 -3064 -6745 -6067 -2984 -16983 -20371 -2698
5023 -2698 -3306 -11806 583 26665 33345 14939 5918 7945 -1836 -12469 -19010 -22357 -28906 -22333
5009 -22333 -2874 15056 17518 6705 6556 17036 8317 -2046 -10788 -6873 -1581 4499 5927 16998
4995 16998 18641 14739 7156 -2455 -806 2854 822 -12654 -14665 -11229 -4010 -2770 -14008 -11948
4981 -11948 -116 -2263 -7487 -6643 -9936 -7538 -2594 1356 -1619 -14919 -27784 -30846 -28054 -20679
4967 -20679 -20256 -36233 -32007 -38050 -31269 -33295 -17938 -7312 -1864 -19239 -26936 -24639 -2144 10475
$$ packed form
5064b1771J3423J1585q258j0476J5545M341k563p858K529N541j719O175N685r976
5050B203j0726j935J1145J5170j4240k1019J3099M474O078n204j0526m984O39
5037a5826J6982J7420j0994j6954o916j008O145Q087l681O78L083j3999l388J7673
5023b698o08q500J2389K6082O680j8406r021K027r781j0633o541l347o549O573
5009b2333J9459J7930K462j0813j49J0480q719j0363q742L915N292O080J428J1071
4995A6998J643l902p583r611J649L660k032j3476k011L436P219J240j1238K060
4981a1948J1832k147n224Q44l293K398M944L950k975j3300j2865l062K792P375
4967b0679M23j5977M226o043O781k026J5357J0626N448j7375p697K297K2495J2619
$$ plain form
4953 10475 2762 -9459 -5502 -12764 -20756 -4068 13676 22808 28109 27771 16087 12214 2148 878
4939 878 5592 12573 20330 17558 11560 1782 -11047 -15072 -4605 -10054 -14199 -10252 -10042 -13022 -19471
4924 -19471 -10780 -13943 -14288 -20459 -23596 -18694 -33664 -44012 -50443 -39000 -15725 -7430 -10292 -6567
4910 -6567 -4888 6821 -3165 -14705 -24802 -26054 -14711 -5138 -8996 4276 15400 13745 -3972
4897 -3972 -6292 6090 4595 4865 -12929 -14542 5750 13512 23507 24487 9710 2946 12545 21777
4883 21777 37691 16854 -2455 234 -10191 -15339 -20956 -29569 -19202 -132 -930 -13679 -8339
4870 -8339 -6043 -23782 -26339 -29580 -23778 -25053 -12875 8155 -3035 341 8427 -7131 -26543
4857 -26543 -39175 -31935 -12953 4014 -4254 -12175 -20029 -27902 -20059 -12277 -8798 -11107 -1019 9840
$$ packed form
4953A0475p713j2221L957p262p992J6688J7744R132N301l38j1684l873j0066j270
4939H78M714O981P757k772n998r778j2829m025J0467n449m145L947K10k980o449
4924a9471Q691l163l45o171l137M902j4970j0348o431J1443K3275Q295k862L725
4910f567J679J1709r986j1540j0097j252J1343R573l858J3272J1124j655j7717
4897c972k320J2382j495K70j7794j613K0292P762R995R80j4777o764R599R232
4883B1777J5914k0837j9309K689j0425n148n617q613J0367J9070p98j2749N340
4870h339K296j7739k557l241N802j275J2178K1030j1190L376Q086j5558j9412
4857b6543j2632P240J8982J6967q268p921p854p873P843P782L479k309J0088J0859
$$ plain form
4843 9840 12979 9221 7791 11454 8975 -12771 -18525 -16083 -5471 -2648 -10504 -7619 4839 9429
4829 9429 9259 2947 -5422 -6253 -1964 2491 -154 -4954 1021 -1526 -24180 -15682 -9730 -16228 -4687
4814 -4687 4911 1564 -5563 -3276 -4136 2827 10790 10739 2194 -4460 -7216 17088 15180 -1172 -14985
4799 -14985 -8280 -2665 9711 8909 9146 12121 -2129 -995 11622 -5275 -6725 -1091 2998 4009
4785 4009 -3034 -7335 -6486 -1742 6774 4941 -12458 -9774 -2723 -992 1295 -5112 -4419 4980 10648
4770 10648 -4714 -10734 -68 -4275 -13919 -16067 -9851 -4071 -5965 -2454 -5039 -3500 2527 4303
4756 4303 4847 -31 -9441 -18667 -14277 -13682 -11028 -19336 -11118 6385 7346 5166 -4205 -7996 -4596
4741 -4596 -3104 40 -14526 -16099 -7445 1267 6743 1438 -1977 466 6438 4754 5520 5429 10397
$$ packed form
4843I840L139l758j430L663k479k1746n754K442J0612K823p856K885J2458M590
4829I429j70o312q369q31M289M455k645m800N975k547k2654Q498N952o498J1541
4814d687R598l347p127K287q60O963P963n1q545o654k756K4304j908j6352j3813
4799a4985O705N615J2376q02K37K975j4250J134J2617j6897j450N634M089J011
4785D009p043m301Q49M744Q516j833j7399K684P051J731K287o407O93R399N668
4770A0648j5362o020J0666m207r644k148O216N780j894L511k585J539O027J776
4756D303N44m878r410r226M390N95K654q308Q218J7503R61k180r371l791L400
4741d596J492L144j4566j573Q654Q712N476n305l415K443N972j684P66r1M968
$$ plain form
4726 10397 25758 19107 12976 4529 7860 11864 16628 14688 6524 5724 2871 1474 -3264 -7386 2286
4711 2286 6391 8417 2989 -7357 3561 11718 789 -5519 -9818 -19933 -11009 1090 -385 -15841
4697 -15841 -20634 -19194 -14911 799 2612 -3589 6267 -2342 -8570 -7742 1615 5875 17636 9962
4683 9962 -4938 -13606 -8567 -8594 507 15321 13815 9005 -457 -5433 -11431 -31941 -49592 -45146
4669 -45146 -37824 -15161 -6017 -3476 3470 15770 4152 8810 17100 13642 -344 -24967 -29920
4656 -29920 -24959 -4803 -2997 -13404 -3328 -1045 -2296 -4923 -6119 -13076 -7936 -849 10161 17863
4642 17863 13159 13232 15823 -712 9388 16002 18038 20484 16233 9295 8251 14551 -2411 -22029
4628 -22029 -25697 -11193 -16125 -6578 1888 3813 11837 16388 6097 8600 14053 -3856 3222 8025
$$ packed form
4726A0397J5361o651o131q447L331M004M764j940q164q00k853j397m738m122R672
4711B286M105K026n428j0346J0918Q157j0929o308m299j0115Q924J2099j475j5456
4697a5841m793J440M283J5710J813o201R856q609o228Q28R357M260J1761p674
4683I962j4900q668N039k7R101J4814j506m810r462m976n998k0510j7651M446
4669d5146P322K2663R144K541O946J2300j1618M658Q290l458j3986k4623m953
4656b9920M961K0156J806j0407J0076K283j251k627j196o957N140P087J1010P702
4642A7863m704P3K591j6535J0100O614K036K446m251o938j044O300j6962j9618
4628b2029l668J4504m932R547Q466J925Q024M551j0291K503N453j7909P078M803
$$ plain form
4614 8025 -12717 5828 9378 10135 9305 -551 -10785 -1246 -98 -11710 -19151 -17290 -1386 15359
4600 15359 27584 13925 5543 511 3730 639 -5425 -16798 -27948 -24273 -9550 367 -8803
4587 -8803 -10929 -14467 -24465 -9857 -2985 5964 7587 14315 3062 -2320 8386 16121 11473 -573
4573 -573 8009 -3889 -15340 -18649 -11893 393 -1113 -8549 -8807 -10794 -33584 -28458 -17392 -2446
4559 -2446 8684 16409 15045 13847 4911 -2859 4971 11410 -5013 -25462 -13375 -7619 -9710 -9579
4545 -9579 -144 -4850 -8159 -11095 -15798 -1763 1609 -18775 -16110 -3529 3642 13388 16550 11353
4531 11353 1899 -4046 -13033 -8471 2476 -4239 -3644 -14526 -31425 -32930 -19050 -7259 9397
4518 9397 3762 11923 24021 13535 -5265 -2908 -4140 -6474 -833 6660 9787 -5119 1643 13592
$$ packed form
4614H025k0742J8545L550P57q30r856j0234R539J148j1612p441J861J5904J6745
4600A5359J2225j3659q382n032L219l091o064j1373j1150L675J4723R917r170
4587h803k126l538r998J4608O872Q949J623O728j1253n382J0706P735m648j2046
4573e73Q582j1898j1451l309O756J2286j506p436k58j987k2790N126J1066J4946
4559b446J1130P725j364j198q936p770P830O439j6423k0449J2087N756k091J31
4545i579R435m706l309k936m703J4035L372k0384K665J2581P171R746L162n197
4531A1353r454n945q987M562J0947o715N95j0882j6899j505J3880J1791J6656
4518I397n635Q161J2098j0486j8800K357j232k334N641P493L127j4906O762J1949
$$ plain form
4504 13592 14276 1049 6117 8496 -14951 -29620 -33951 -34493 -26691 -10627 2147 2247 3419 8057
4490 8057 3825 -18751 -17185 -15651 -15134 -21811 -36198 -35011 -7624 3681 10147 2305 -3327 -11330
4476 -11330 256 5118 -702 -7227 -1413 5947 2950 7901 2842 322 120 6845 14377 4733 -8306
4461 -8306 -7623 -5733 3364 -8193 -8469 -4058 1817 14241 2450 -4051 20946 29563 10750 19381
4447 19381 22760 18258 23591 14589 4487 -6778 9577 25807 26771 25776 26776 -7294 -12306 -5987
4433 -5987 -746 -1846 12420 12314 3225 -446 -1708 2205 319 -10427 -17606 -18155 -25451 -33392 -17406
4418 -17406 4075 12623 8392 2629 -7980 -13007 -3498 4682 6266 -4307 -6086 -1988 13932 27962
4404 27962 8526 1460 12732 6191 9765 1632 -11150 72 -7674 -23158 -18271 -4540 9142
$$ packed form
4504A3592O84j3227N068K379k3447j4669m331n42P802J6064J2774J00J172M638
4490H057m232k2576J566J534N17o677j4387J187K7387J1305O466p842n632q003
4476a1330J1586M862n820o525N814P360k997M951n059k520k02O725P532r644j3039
4461h306O83J890R097j1557k76M411N875J2424j1791o501K4997Q617j8813Q631
4447A9381L379m502N333r002j0102j1265J6355J6230R64r95J000l4070n012O319
4433e987N241j100J4266j06r089l671j262L913j886j0746p179n49p296p941J5986
4418a7406K1481Q548m231n763j0609n027R509Q180J584j0573j779M098J5920J4030
4404B7962j9436p066J1272o541L574q133j2782J1222p746j5484M887J3731J3682
$$ plain form
4391 9142 2568 -10746 -26343 -30684 -25538 -11416 -16312 -8518 -2834 -19845 -18336 -28535 -34405 -29986
4377 -29986 -8957 15834 20003 36898 48273 37421 6605 -8681 -18240 -6302 -7750 -5448 4409
4364 4409 8182 -5765 -5543 7635 21346 16889 22488 11869 -16899 -10522 5033 2208 12175 23593
4350 23593 24046 21053 14243 1166 2306 13720 4500 4515 14221 6941 -973 -2738 -4208 -12591 -2516
4335 -2516 968 -6459 -12039 -11669 -20603 -25484 -21155 -4910 4859 13214 10375 3379 4675 1852 -8370
4320 -8370 -12018 220 2590 544 6527 5722 -3703 -19732 -21916 -7657 1045 -8661 -8286 -2439 1875
4305 1875 10117 6217 8515 1514 -4599 1725 4513 6885 -493 -6778 -12448 -11044 -11800 8936 -956
4290 -956 -9092 -14291 -824 -9984 -11209 -16597 -25915 -43783 -26241 -803 11109 13598 3959 -8956
$$ packed form
4391I142o574j3314j5597m341N146J4122m896P794N684j7011J509j0199n870M419
4377b9986K1029K4791M169J6895J1375j0852l0816j5286r559J1938j448K302R857
4364D409L773j3947K22J3178J3711m457N599j0619k8768O377J5555k825R967J1418
4350B3593M53k993o810j3077J140J1414r220J5R706p280p914j765j470q383J0075
4335b516L484p427n580L70q934m881M329J6245R769Q355k839o996J296k823j0222
4320h370l648J2238K370k046N983q05r425j6029k184J4259Q702r706L75N847M314
4305A875Q242l900K298p001o113O324K788K372p378o285n670J404p56K0736r892
4290i56q136n199J3467r160j225n388r318j7868J7542K5438J1912K489r639j2915
$$ plain form
4276 -8956 -21223 -29103 -9824 -3106 -17058 -25734 -13467 -16669 -5100 3472 10993 17826 21459 14000
4262 14000 3707 -3985 -12373 -20331 -24114 -17499 -762 -5257 -16133 -6019 -23581 -32817 -13845
4249 -13845 -10681 -2463 7129 -512 -5197 -2051 -1270 -3641 -7479 -523 10324 16677 26461 20327 10083
4234 10083 8925 3373 4160 1776 -8071 -6795 -7083 -13310 -24501 -26929 -15929 -7581 -3883 -21415
4220 -21415 -12258 1150 6646 12022 19984 7794 3844 4141 1620 11638 18720 21627 3736 -5048
4206 -5048 9626 10914 -9841 -8966 5087 24297 25213 17426 13076 -6321 -17977 -16964 -6926 -5781
4192 -5781 3090 16206 24326 27687 15367 6034 -5844 -8899 -1685 552 8481 360 12781 9655
4178 9655 -3649 -22171 -25012 -21411 -20925 -43414 -32711 -11858 -15274 -23962 -18534 -9874 -10645 -7205
$$ packed form
4276h956j2267p880J9279O718j3952q676J2267l202J1569Q572P521O833L633p459
4262A4000j0293p692q388p958l783O615J6737m495j0876J0114j7562r236J8972
4249a3845L164Q218R592p641m685L146P81k371l838O956J0847O353R784o134j0244
4234A0083j158n552P87k384r847J276k88o227j1191k428J1000Q348L698j7532
4220b1415R157J3408N496N376P962j2190l950K97k521J0018P082K907j7891q784
4206e048J4674J288k0755Q75J4053J9210R16p787m350j9397j1656J013J0038J145
4192e781Q871J3116Q120L361j2320r333j1878l055P214K237P929q121J2421l126
4178I655j3304j8522k841L601M86k2489J0703K0853l416q688N428Q660p71L440
$$ plain form
4164 -7205 8494 19062 16621 14329 -9399 -2823 840 778 17957 24061 35389 42053 40473 40308
4150 40308 9659 -8804 -19494 -19861 -23151 -9286 2629 16681 17844 20306 25955 16911 7869
4137 7869 3890 -17146 -25811 -1774 12110 20078 14231 9158 1217 -2081 -9898 -1496 18729 22979
4123 22979 19801 -871 -8048 -7403 4001 5420 10755 7914 10294 23220 24378 10207 14419 40198
4109 40198 40139 30465 21431 12941 17018 9005 609 6226 16680 10449 19202 15530 19173 10052 7311
4094 7311 -566 -3809 -2904 -827 9424 20013 10459 4670 -10335 -30428 -21358 -11478 -3416 -8921
4080 -8921 -12965 7904 9556 -6380 -10085 -753 -8475 -12247 -2490 1556 1745 10928 17893 7088
4066 7088 -16093 -24228 -14542 -11419 -8082 -1715 13360 20693 11758 16625 8063 634 2939 2702 -15230
$$ packed form
4164g205J5699J0568k441k292k3728O576L663o2J7179O104J1328O664j580j65
4150D0308l0649j8463j0690l67l290J3865J1915J4052J163K462N649r044r042
4137G869l979k1036q665K4037J3884P968n847n073p941l298p817Q402K0225M250
4123B2979l178k0672p177O45J1404J419N335k841K380J2926J158j4171M212K5779
4109D0198n9r674r034q490M077q013q396N617J0454o231Q753l672L643r121k741
4094G311p877l243R05K077J0251J0589r554n789j5005k0093R070R880Q062n505
4080h921m044K0869J652j5936l705R332p722l772R757M046J89R183O965j0805
4066G088k3181q135R686L123L337O367J5075P333q935M867q562p429K305k37j7932
$$ plain form
4051 -15230 -24332 -17934 -5498 3455 9076 12658 3188 -2545 -1734 -7482 -12902 -6296 -16637 -14274
4037 -14274 -2469 4433 14211 5892 -3384 7525 9931 5857 -3837 -9065 -2950 -5565 986 7189
4023 7189 17688 17724 26092 28330 4910 -10538 -1146 4218 -12300 -13229 -13453 -8477 -8469 -28154 -28504 -18787
4007 -18787 -3048 -8332 276 9547 4368 -1832 -1418 -8498 -15508 -22256 -7618 1543 -6826 -11945
3993 -11945 6365 22015 18871 12331 716 -984 3778 448 -117 -2867 -813 -6292 -27948 -39188
3979 -39188 -35415 -39489 -6282 -1152 -10917 -24735 -20048 -15261 -7971 1134 -934 -368 4883 13416
3965 13416 16460 18834 12188 -341 -4234 -16988 -25120 -21845 -9468 -17407 -36188 -37130 -22369 -19903
3951 -19903 -12758 -7096 -11977 -15642 -11087 -2700 -8109 -2590 3533 -4482 -15716 -14572 62 5162
$$ packed form
4051a5230r102O398J2436Q953N621L582r470n733Q11n748n420O606j0341K363
4037a4274J1805O902R778q319r276J0909K406m074r694n228O115k615O551O203
4023G189J0499L6Q368K238k3420j5448R392N364j6518r29k24M976Qj9685l50R717
4007a8787J5739n284Q608R271n179o200M14p080p010o748J4638R161q369n119
3993a1945J8310J5650l144o540j1615j700M762l330n65k750K054n479k1656j1240
3979c9188L773m074L3207N130r765j3818M687M787P290R105k068N66N251Q533
3965A3416L044K374o646j2529l893j2754q132L275J2377p939j8781r42J4761K466
3951a9903P145N662m881l665M555Q387n409N519O123q015j1234J144J4634N100
$$ plain form
3937 5162 -4074 -4011 8835 5162 3242 1947 -2178 543 -5223 -9795 -17762 -16453 -9107 -8009 -7234
3922 -7234 -7796 -3554 -16387 -11097 -2726 -1945 -4152 404 4218 -8699 -2170 -8721 -4656 3330 11335
3907 11335 15280 16776 12947 1656 -13122 -19181 -12557 -24236 -11777 -8022 -7198 -8147 -362 -8464
3893 -8464 -18808 -14488 -9475 -6825 -16560 -10541 -6078 15297 25771 13947 15894 9026 2441 -5952
3879 -5952 2217 -2257 2224 -2177 -1223 19333 13795 10252 -922 -9057 -15630 -12736 -16172 -23506 -13060
3864 -13060 -19872 -26277 -25449 -4476 -2379 -14918 -8246 -10757 -31458 -27589 -27898 -12423 8725 11686
3850 11686 1258 -10696 -24653 -44051 -26466 8970 25871 28012 19671 25125 29945 27595 26156
3837 26156 27797 13334 2027 -8450 -3368 -5874 10038 15267 17270 22530 25815 33864 23656
$$ packed form
3937E162r236O3J2846l673j920j295m125K721n766m572p967J309P346J098P75
3922g234n62M242j2833N290Q371P81k207M556L814j2917O529o551M065P986Q005
3907A1335L945J496l829j1291j4778o059O624j1679J2459L755Q24r49P785q102
3893h464j0344M320N013K650r735O019M463K1375J0474j1824J947o868o585q393
3879e952Q169m474M481m401R54K0556n538l543j1174q135o573K894l436p334J0446
3864a3060o812o405Q28K0973K097j2539O672k511k0701L869l09J5475K1148K961
3850A1686j0428j1954j3957j9398J7585L5436J6901K141q341N454M820k350j439
3837B6156J641j4463j1307j0477N082k506J5912N229K003N260L285Q049j0208
$$ plain form
3824 23656 12174 1679 1928 190 1241 12859 10389 12880 5675 -2692 -9156 -2848 -5937 -20361
3810 -20361 -29512 -7568 2015 8542 -2460 -14465 -14544 -18576 -24608 -20077 -17288 -22241 -8458 8775
3796 8775 10764 -10809 -6220 377 -5683 -24204 -32262 -31044 -16175 17715 32709 33089 33929 28194
3782 28194 30126 17404 22870 35230 32474 17509 -5059 -7602 3520 2947 9169 30074 28490
3769 28490 21963 25786 13528 -71 -14251 -9960 13568 20794 22993 10929 2090 -2754 -6151
3756 -6151 -6756 -11937 2718 21680 14417 -2961 -8040 -26883 -39414 -41352 -30379 -22792 -24237 -25408
3742 -25408 -655 -3564 -19018 -22383 -34410 -24364 -10642 -8964 -13382 -12178 -1108 -155 -20065
3729 -20065 -29966 -12172 -1733 -3405 1358 10650 11697 5412 -12672 -17976 -7503 -23530 -22432
$$ packed form
3824B3656j1482j0495K49j738J051J1618k470K491p205q367o464O308l089j4424
3810b0361r151K1944R583O527j1002j2005p9m032o032M531K789m953J3783J7233
3796H775J989k1573M589O597o060j8521q058J218J4869L3890J4994L80Q40n735
3782B8194J932j2722N466J2360k756j4965k2568k543J1122n73O222K0905j584
3769B8490o527L823j2258j3599j4180M291K3528P226K199j2064q839m844l397
3756f151o05n181J4655J8962p263j7378n079j8843j2531j938J0973P587j445j171
3742b5408K4753k909j5454l365j2027J0046J3722J678m418J204J1070R53j9910
3729b0065r901J7794J0439j672M763R292J047o285j8084n304J0473j6027J098
$$ plain form
3716 -22432 -8447 -571 -13125 -24218 -38880 -29380 -15735 -15376 -11364 -5343 5463 -728 -3077
3703 -3077 2701 19450 18465 2969 -7690 -14894 -18894 -17627 -14264 -14659 -23382 -25510 1800 21737
3689 21737 28479 25380 23402 18921 14447 8276 5936 8799 11373 8366 8442 -8793 -7645 3210 -5457
3674 -5457 -4244 -10799 -21089 -17986 -15682 2267 -3820 -18692 -10226 -14573 -93 15064 4892
3661 4892 -17899 -17794 -19674 -11940 -8575 -5938 4275 17407 36853 30607 27239 20619 16512 27217
3647 27217 17497 14238 7835 6152 7065 10712 19344 16178 21567 17425 22057 21399 26589 16910 7981
3632 7981 3846 -1576 -11115 -25212 -34746 -22522 -11520 8860 12563 15323 10778 3892 -3811 -8385
3618 -8385 -10715 2088 8923 -1768 -943 11840 11017 4238 -1800 -5613 -7716 -8772 -15785 -16094 -3703
$$ packed form
3716b2432J3985P876j2554j1093j4662R500J3645L59M012O021J0806o191k349
3703c077N778J6749r85j5496j0659p204m000J267L363l95q723k128K7310J9937
3689B1737O742l099j978m481m474o171k340K863K574l007P6j7235J148J0855q667
3674e457J213o555j0290L103K304J7949o087j4872Q466m347J4480J5157j0172
3661D892k2791J05j880P734L365K637J0213J3132J9446o246l368o620m107J0705
3647B7217r720l259o403j683R13L647Q632l166N389m142M632o58N190r679q929
3632G981m135n422r539j4097r534J2224J1002K0380L703K760m545o886p703m574
3618h385k330J2803O835j0691Q25J2783q23o779o038l813k103j056p013l09J2391
$$ plain form
3603 -3703 1615 8288 -9464 -12004 747 -2915 -4768 -5488 274 15717 12334 3784 5242 9458
3589 9458 7658 -6019 -3773 -8384 -1000 5419 818 -9138 -12856 -6054 -19987 -29394 -27832 -22346
3575 -22346 -10677 -8959 -4064 -12988 -631 16538 2355 -7243 -10723 -15094 -1614 5580 6192 3551
3561 3551 14995 8488 -1796 -848 10116 20285 22959 29567 30920 20658 7130 -7245 -7048 7544
3547 7544 20755 17279 21686 25246 20181 31756 30072 10162 4151 -14757 -25424 -20035 -10262 -11026
3533 -11026 -2683 -8757 -11655 -9903 -12005 1821 32120 26898 22440 23701 27363 23910 10652 -2403
$$ packed form
3603c703N318O673j7752k540J2751l662j853p20N762J5443l383q550J458M216
3589I458j800j3677K246m611P384O419m601r956l718O802j3933r407J562N486
3575b2346J1669J718M895q924J2357J7169j4183r598l480m371J3480P194O12k641
3561C551J1444o507j0284R48J0964J0169K674O608J353j0262j3528j4375J97J4592
3547G544J3211l476M407L560n065J1575j684j9910o011j8908j0667N389R773p64
3533a1026Q343o074k898J752k102J3826L0299n222m458J261L662l453j3258j3055
$$ [...]
##END NTUPLES=NMR SPECTRUM
##END=
