##TITLE=Analysis number 319693
Compound Code km 00409
Project Code adrs
Chemist Name endeavour
##JCAMPDX= 6.0         $$ Bruker NMR JCAMP-DX V2.0
##DATA TYPE= NMR SPECTRUM
##DATA CLASS= NTUPLES
##ORIGIN= Bruker BioSpin GmbH
##OWNER= nmr
$$ XWIN-NMR		Version 3.5
$$ Wed May 24 13:16:00 2006 GMT Daylight Time (UT+1h)  MAYBRIDGE\nmr@NMR_250MHZ
##.OBSERVE FREQUENCY= 250.131544655141
##.OBSERVE NUCLEUS= ^1H
##.ACQUISITION MODE= SIMULTANEOUS (DQD)
##.ACQUISITION SCHEME= undefined
##.AVERAGES= 16
##.DIGITISER RES= 18
##SPECTROMETER/DATA SYSTEM= dpx250
##.PULSE SEQUENCE= zg30
##.SOLVENT NAME= CDCl3
##.SHIFT REFERENCE= (INTERNAL, CDCl3, 0, 16.522)
##AUDIT TRAIL= $$ (NUMBER, WHEN, WHO, WHERE, WHAT)
$$ ##TITLE= Audit trail, XWIN-NMR		Version 3.5
$$ ##JCAMPDX= 5.01
$$ ##ORIGIN= Bruker BioSpin GmbH
$$ ##OWNER= nmr
$$ C:\u/data/dgb/nmr/ADRS/5090/pdata/1/auditp.txt
$$ ##AUDIT TRAIL=  $$ (NUMBER, WHEN, WHO, WHERE, WHAT)
(   1,<2006-05-24 13:15:38.97 +100>,<MAYBRIDGE\nmr>,<NMR_250MHZ>,
      <created by zg, POWCHK disabled, PULCHK disabled
       configuration hash MD5:
       84 BC 41 DB A1 6E 1D 46 DA 25 12 A5 C1 ED C5 3A
       data hash MD5: 64K
       03 1B A8 4E 40 E6 A9 6E 11 54 63 37 BE B9 F6 93>)
(   2,<2006-05-24 13:15:50.91 +100>,<MAYBRIDGE\nmr>,<NMR_250MHZ>,
      <Start of raw data processing
       ef LB = 0.3 FT_mod = 6 PKNL = 1 SI = 32K 
       data hash MD5: 32K
       77 E5 92 87 B0 F4 4E C6 BB 44 D6 39 5D DF 62 2C>)
(   3,<2006-05-24 13:15:53.01 +100>,<MAYBRIDGE\nmr>,<NMR_250MHZ>,
      <apk 
       data hash MD5: 32K
       34 09 82 1C A9 D8 CB 79 41 3E E0 5D 25 CC 3E 6F>)
(   4,<2006-05-24 13:15:53.97 +100>,<MAYBRIDGE\nmr>,<NMR_250MHZ>,
      <abs ABSG = 5 
       data hash MD5: 32K
       45 CF 82 EC 5E 69 DC 70 AC C9 37 43 AF 19 F2 BF>)
$$ ##END=
$$ 
$$ hash MD5
$$ 6E 97 D9 10 36 74 FD 8E 59 C2 A6 0F C1 CC 6F 67
##$RELAX= 
##$RELAX= 
##$RELAX= 
##$RELAX= 
##$RELAX= 
##$RELAX= 
##$RELAX= 
$$ Bruker specific parameters
$$ --------------------------
##$DU= <C:\u>
##$EXPNO= 5090
##$NAME= <ADRS>
##$PROCNO= 1
##$TYPE= <nmr>
##$USER= <dgb>
##$AMP= (0..31)
100 100 100 100 100 100 100 100 100 100 100 100 100 100 100 100 100 100 
100 100 100 100 100 100 100 100 100 100 100 100 100 100 
##$AQSEQ= 0
##$AQ_mod= 3
##$AUNM= <au_zg>
##$AUTOPOS= <31 >
##$BF1= 250.13
##$BF2= 250.13
##$BF3= 250.13
##$BF4= 250.13
##$BF5= 500.13
##$BF6= 500.13
##$BF7= 500.13
##$BF8= 500.13
##$BYTORDA= 1
##$CFDGTYP= 0
##$CFRGTYP= 5
##$CHEMSTR= <none>
##$CNST= (0..31)
1 1 145 1 1 1 1 1 1 1 1 1 1 1 1 1 1 1 1 1 1 1 1 1 1 1 1 1 1 1 1 1 
##$CPDPRG= <>
##$CPDPRG1= <>
##$CPDPRG2= <>
##$CPDPRG3= <>
##$CPDPRG4= <mlev>
##$CPDPRG5= <mlev>
##$CPDPRG6= <mlev>
##$CPDPRG7= <mlev>
##$CPDPRG8= <mlev>
##$CPDPRGB= <>
##$CPDPRGT= <>
##$D= (0..31)
0 1 0 0 0 0 0 0 0 0.06 0 0 0 0 0 0 0.0002 0 0 0 0 0 0 0 0 0 0 0 0 0 0 
0 
##$DATE= 1148472937
##$DBL= (0..7)
120 120 120 120 120 120 120 120 
##$DBP= (0..7)
150 150 150 150 150 150 150 150 
##$DBP07= 0
##$DBPNAM0= <>
##$DBPNAM1= <>
##$DBPNAM2= <>
$$ [...]
##$SUBNAM7= <"">
##$SUBNAM8= <"">
##$SUBNAM9= <"">
##$SW= 20.6930455092707
##$SWIBOX= (0..15)
0 0 3 0 0 0 0 0 0 0 0 0 0 0 0 0 
##$SW_h= 5175.983436853
##$TD= 65536
##$TD0= 1
##$TE= 294.16
##$TE2= 300
##$TE3= 300
##$TEG= 300
##$TL= (0..7)
0 120 120 120 120 120 120 120 
##$TP= (0..7)
150 150 150 150 150 150 150 150 
##$TP07= 0
##$TPNAME0= <>
##$TPNAME1= <>
##$TPNAME2= <>
##$TPNAME3= <>
##$TPNAME4= <>
##$TPNAME5= <>
##$TPNAME6= <>
##$TPNAME7= <>
##$TPOAL= (0..7)
0.5 0.5 0.5 0.5 0.5 0.5 0.5 0.5 
##$TPOFFS= (0..7)
0 0 0 0 0 0 0 0 
##$TUNHIN= 0
##$TUNHOUT= 0
##$TUNXOUT= 0
##$USERA1= <user>
##$USERA2= <user>
##$USERA3= <user>
##$USERA4= <user>
##$USERA5= <user>
##$V9= 5
##$VALIST= <valist>
##$VCLIST= <CCCCCCCCCCCCCCC>
##$VD= 0
##$VDLIST= <DDDDDDDDDDDDDDD>
##$VPLIST= <PPPPPPPPPPPPPPP>
##$VTLIST= <TTTTTTTTTTTTTTT>
##$WBST= 1024
##$WBSW= 4
##$XGAIN= (0..3)
0 0 0 0 
##$XL= 0
##$YL= 0
##$YMAX_a= 704113
##$YMIN_a= -812735
##$ZGOPTNS= <>
##$ZL1= 120
##$ZL2= 120
##$ZL3= 120
##$ZL4= 120
##$ABSF1= 16.522
##$ABSF2= -4.171173
##$ABSG= 5
##$ABSL= 3
##$ALPHA= 0
##$AQORDER= 0
##$ASSFAC= 0
##$ASSFACI= 0
##$ASSFACX= 0
##$ASSWID= 0
##$AUNMP= <proc_1d>
##$AZFE= 0.1
##$AZFW= 0.1
##$BCFW= 0
##$BC_mod= 0
##$BYTORDP= 0
##$COROFFS= 0
##$CY= 12.5
##$DATMOD= 1
##$DC= 0
##$DFILT= <>
##$DTYPP= 0
##$F1P= 14.0000005364418
##$F2P= -0.99999901652339
##$FCOR= 0.5
##$FTSIZE= 32768
##$FT_mod= 6
##$GAMMA= 0
##$GB= 0
##$INTBC= 1
##$INTSCL= 1
##$ISEN= 128
##$LB= 0.3
##$LEV0= 0
##$LPBIN= 0
##$MAXI= 10000
##$MC2= 0
##$MEAN= 0
##$ME_mod= 0
##$MI= 0
##$NCOEF= 0
##$NC_proc= -4
##$NLEV= 6
##$NOISF1= 0
##$NOISF2= 0
##$NSP= 0
##$NTH_PI= 0
##$NZP= 0
##$OFFSET= 16.522
##$PC= 1
##$PHC0= 167.849
##$PHC1= 5.719737
##$PH_mod= 1
##$PKNL= yes
##$PPARMOD= 0
##$PSCAL= 4
##$PSIGN= 0
##$REVERSE= no
##$SF= 250.13
##$SI= 32768
##$SIGF1= 0
##$SIGF2= 0
##$SINO= 400
##$SIOLD= 32768
##$SREGLST= <1H.CDCl3>
##$SSB= 0
##$STSI= 32768
##$STSR= 0
##$SW_p= 5175.98343685301
##$SYMM= 0
##$S_DEV= 0
##$TDeff= 65536
##$TDoff= 0
##$TI= <Analysis number 999999
Compound Code 99
Book Reference 9
Project Code 9>
##$TILT= no
##$TM1= 0
##$TM2= 0
##$TOPLEV= 0
##$USERP1= <user>
##$USERP2= <user>
##$USERP3= <user>
##$USERP4= <user>
##$USERP5= <user>
##$WDW= 1
##$XDIM= 32768
##$YMAX_p= 486403930
##$YMIN_p= -106631
$$ End of Bruker specific parameters
$$ ---------------------------------
##NTUPLES= NMR SPECTRUM
##VAR_NAME=  FREQUENCY,     SPECTRUM/REAL,   SPECTRUM/IMAG
##SYMBOL=    X,             R,               I
##VAR_TYPE=  INDEPENDENT,   DEPENDENT,       DEPENDENT
##VAR_FORM=  AFFN,          ASDF,            ASDF
##VAR_DIM=   32768,         32768,           32768
##UNITS=     HZ,            ARBITRARY UNITS, ARBITRARY UNITS
##FACTOR=    0.157963299565203, 1,           1
##FIRST=     4132.6476996994, 0,             0
##LAST=      -1043.33573715361, 0,           0
##MIN=       -1043.33573715361, -106631,     0
##MAX=       4132.6476996994, 486403930,     0
$$ Real data points
##PAGE= N=1
##DATA TABLE= (X++(R..R)), XYDATA
$$ [...]
18395c0384J562K2590Q549k869O608l471k728J4155j4084j4817K8008J7745K021
18382C2885j5616j0967n225j6992J9124P224k6595p576k4059J839J2579j2429
18370d5808q083J9709L5068R763q456P099J038K796j5133k8457K5536K9474J6991
18357D1537K6887k3712p703K3527k0020L797J2278J755J2150N981j8381k5911
18345C2185k9009k7197r796q91J4076J0850q405M657k3179N610K0381k1263q8
18332c2069J4040J8566j5814R678J0985K2748M479J0633P146J2950p499J5395
18320G1238l6799n569j7419k5005J3318K7142K4953j5119l5964k4363J1478L2458
18308B0349m126m244J2418k6632m710Q264J3058r396L3319J4802L451j5385k7776
$$ y = [-30384, -28822, -6232, 2317, -552, 6056, 2585, -143, 14012, -72, -14889, 13119, 30864, 32885, 17269, 6302, 1077, -15915, 3209, 10433, -16162, -23738, -47797, -45958, -33379, -45808, -53891, -34182, 886, 10649, 2193, 9292, 10330, 13126, -2007, -30464, -4928, 24546, 41537, 68424, 44712, 37009, 60536, 40516, 44313, 56591, 58346, 70496, 76477, 58096, 32185, 3176, -24021, -33817, -34708, -20632, -9782, -18187, -13530, -36709, -31099, -10718, -31981, -32069, -18029, 537, -15277, -5599, 5386, 28134, 32613, 43246, 50392, 63342, 55843, 71238, 34439, 28870, 11451, -13554, -236, 26906, 51859, 36740, 776, -23587, -12109, 20349, 16223, 11979, 24397, -2235, -6945, 1319, 14377, 4981, 38300, 53102, 56553, 41168, 13392]
18295A3392J1688L1244K5487L9549N3688O5159L5685L967J5416K6059j9472r8910
18283B02952j07308l6324q111J5239o048j5016N165p369l3806J2357O758J0798
18271C9287k5570j1350K5449N876k8551j2437J169M754K3203K0032n500k7701
18259H661j0372l847P65k5930Q894J7390J0686O542j8650N029N364j1083L15J1464
18245E228J8612J2659r956l1127K054J896k253o051K8543L1137L8475J7368j4841
18232I1744k0847L1332Q1955K2834J9041N9251M3479K2698j0807J0173R5M0395
18220C91343K8992l3244o3531l3202J055m6229o6824j8983K648R56l0544m4074
18208H8363j1900P460j360j7434J2701j3579k0554N815k762J6676J9762j7650
$$ y = [13392, 25080, 56324, 81811, 121360, 175048, 240207, 275892, 279859, 295275, 321334, 301862, 202952, 95644, 59320, 51209, 66448, 60400, 45384, 50549, 43180, 9374, 21731, 28489, 39287, 13717, 2367, 27816, 33692, 5141, -7296, -6127, -1373, 21830, 41862, 36362, 8661, -1711, -5558, -4793, -30723, -21829, -4439, 6247, 12789, -5861, -832, 4532, -6551, -6236, 5228, 23840, 36499, 26543, -4584, -2530, -634, -2887, -8938, 19605, 50742, 89217, 106585, 91744, 70897, 102229, 184184, 207018, 226059, 285310, 328789, 351487, 340680, 350853, 350948, 391343, 420335, 387091, 323560, 290358, 291413, 245184, 178360, 159377, 162025, 162981, 132437, 88363, 76463, 83923, 82563, 65129, 77830, 64251, 43697, 49512, 46750, 63426, 83188, 65538]
18196F5538N255k792K0673K6943J6949k6941J7158J6237l2852k7142Q606J1695
18184I9327k5640j1216J1086P779J2128k7999j3211q166J9262K5913j624l2673
18172E4966J1306J3599j2469K386L355j5162j2377p043L1703K8511j4463m3870
18160D0442k9307J6555J4520p952r058k3952l2315L2708M9623J992p468J3535
18148E9323P557P573J6529K587K1678J6181k3372k4651J2761K835Q518j984P878
18135A13413j433J2048P602j986j7174J347L2027J0515J8340N5135K8318O8725
18123C26877O9572M4748P4309L9043N2175Q3811J12045J28235J20023K03351L32673
18112A586862M73346P40856J170473K111831M039319N922830M833005J921194
$$ y = [65538, 70793, 68001, 88674, 115617, 132566, 105625, 122783, 139020, 106168, 79026, 87632, 99327, 73687, 62471, 73557, 81336, 93464, 65465, 52254, 44088, 63350, 89263, 87639, 54966, 66272, 79871, 67402, 69788, 73143, 57981, 45604, 38561, 70264, 98775, 84312, 40442, 11135, 27690, 42210, 34258, 25200, 1248, -31067, 1641, 51264, 53256, 45788, 59323, 66880, 74453, 90982, 93569, 115247, 131428, 108056, 83405, 96166, 99001, 107519, 105535, 113413, 111980, 124028, 131630, 129644, 112470, 113817, 145844, 156359, 174699, 229834, 258152, 326877, 396449, 441197, 515506, 554549, 606724, 690535, 802580, 930815, 1050838, 1254189, 1586862, 2060208, 2801064, 3971537, 6083368, 10122687, 16045517, 20878522, 22799716]
18104B2799716K29719l34434J111962j66920o836557o468250l250954j626529
18096E457753r39964o35516m30477l27857l00864k73847j92137j60346j38617
18087B058128j31576j17585j17080p2360o6679q4121p5013n5838n7796m2345o2551
18076A175184o3569o3571o1214o2579k3611m1703k9911k4207j3069o504j3011
18065G72235J3160k5402o2282m8628k1861n735j8245j6710j8205m1578k6122m403
18053D96224N4l485l7184m0504L29N0732J2395l5196j6951j9379m0282m7861k2932
18040B95960K119N902K9114K0243m749m9621l0626L470K387M573R386q458Q371
18027B88071p618N188j2695m3882k7094n896O829K2767N48n029l2015N53J4038
$$ y = [22799716, 23029435, 22695001, 23806963, 23640043, 16803486, 10335236, 7084282, 5457753, 4517789, 3882273, 3451796, 3123939, 2823075, 2549228, 2357091, 2196745, 2058128, 1926552, 1808967, 1691887, 1619527, 1552848, 1468727, 1393714, 1337876, 1280080, 1237735, 1175184, 1111615, 1048044, 986830, 924251, 900640, 858937, 829026, 804819, 791750, 785246, 772235, 785395, 759993, 697711, 649083, 627222, 621487, 603242, 586532, 568327, 526749, 500627, 496224, 496278, 492793, 455609, 415105, 415434, 466166, 478561, 443365, 426414, 407035, 366753, 318892, 295960, 298079, 303981, 333095, 353338, 348589, 298968, 268342, 271812, 274199, 278772, 288158, 279700, 288071, 280453, 285641, 272946, 229064, 201970, 196074, 202903, 225670, 226218, 221189, 189174, 189727, 203765]
18014B03765K3066J292Q98k8143k1107j5907p429r503m728J6030J9021k0686o597
18001A49972k878k4212r459J9662r861l1015l718J2180K4029N813l4500k6265
17989F9748r128k6832m960L4962L6665j5418l5889q03k816N709r233M895o487
17976D0413m590J1109N640K884N169J4841P546j7442j8935p736J858O376q367
17963C8766J0943K96J3061K3189j877L4269j3586j3378O547j6581r970J0913m098
17950G8494l0759k8060J2424M0072L6261M568K092o620k5644R636l015o491J3
17937H2971j9751n256n261J7702j1904r343P602O584j7991l9065m563R223n754
17924E194k701j6753r379M083J3374K7137k063J6824N141p13j6248j1335N755
$$ y = [203765, 226831, 228123, 229021, 200878, 179771, 163864, 156435, 146932, 142204, 158234, 177255, 156569, 149972, 147094, 122882, 113423, 133085, 123224, 92209, 88491, 100671, 124700, 130513, 96013, 69748, 60620, 33788, 28828, 63790, 100455, 85037, 49148, 48345, 45529, 51238, 42005, 46900, 40413, 35823, 46932, 52572, 55456, 60625, 75466, 83012, 65570, 46635, 38899, 40757, 47133, 38766, 49709, 50005, 63066, 86255, 84378, 118647, 105061, 91683, 98230, 81649, 71679, 82592, 78494, 47735, 19675, 32099, 72171, 108432, 113000, 115092, 108472, 82828, 92464, 89449, 82958, 82971, 63220, 57964, 52703, 70405, 58501, 49158, 56760, 63344, 45353, 6288, 1725, 10948, 5194, 2493, -14260, -23639, -19556, -6182, 20955, 18892, 35716, 40857, 40144, 23896, 12561, 18316]
17911A8316j4038J5239R026o773l974K4466J0684J021J9646m0000n945j133J1140
17898C7675K681m993k2514M075p751Q420J4521J0815l272J1559j8962q254j764
17885B2236M702J8435J1755o540l7874l8798R858K4428J9980n32L958j3396o814
17872A1398Q442r054r653L2774P798k1496j2815k307k8349l3873J7647J8928R291
17859a1269J943L530k7239Q395J4818J6988l325j8189k4918K0032O2527Q700M097
17846E6090k5192k0385M404l399R109J0746J4599k5091l1260j8355K4960L9789
17834C6015k0034j9504N584j162N412j8058j2444L2319J7160J4119r552r236j9692
17821I27J1826R647M345L3273o371q218K981P355J8645j4994r625j7566o584j675
$$ y = [18316, 4278, 19517, 28543, 21770, 17796, 42262, 52946, 53967, 73613, 33613, 27668, 26535, 37675, 40356, 35363, 12849, 16924, 9173, 17593, 32114, 42929, 39657, 51216, 32254, 24000, 22236, 26938, 45373, 57128, 50588, 12714, -26084, -16226, 8202, 28182, 27650, 31608, 18212, 11398, 19840, 10786, 1133, 33907, 41705, 20209, 7394, 5087, -23262, -57135, -39488, -20560, -11269, -9326, -5796, -33035, -24640, -9822, 7166, 3841, -14348, -39266, -19234, 43293, 51993, 56090, 30898, 10513, 14917, 11518, 20627, 31373, 45972, 20881, -10379, -28734, -3774, 36015, 15981, -3523, 2061, 899, 6311, -11747, -24191, 8128, 25288, 39407, 29855, 20619, 927, 12753, 22400, 26745, 60018, 53647, 45429, 48410, 55765, 74410, 59416, 49791, 32225, 25641, 23966]
17807B3966J2731k0908o949K4807K1247j0270j146j8020o680j5603N829K2636
17795C1640M135J1605j9816l0980J7544J2867j282j0130m200m426J2271j5075
17783D153L724J9018M680J8392K932K3949p763k7436n78j2248l364K3654l178
17770D5935J008p588j2491k7927j7993n345j9160J9879J1480L170P965o626K5981
17757A8288K3811O880L8170o281l1492j4292K169j834q264l1748n081l333K2241
17744I234J0752O107Q848r281j1424K2855J3633m766R225n483M345p803J2510
17731E8752N031k3161r260l494K915k615l1769qP275L269K7274p767j4388M877
17717A6931j9249J3854J1096k235j9588o40J5820n568j5615N955L336l788o590
$$ y = [23966, 36697, 15789, 8840, 33647, 54894, 44624, 43478, 25458, 18778, 3175, 9004, 31640, 35775, 47380, 27564, -3416, 14128, 26995, 25713, 15583, 11383, 6957, 19228, 4153, 7877, 26895, 31575, 49967, 52899, 76848, 69085, 41649, 41071, 28823, 25459, 49113, 45935, 46943, 39355, 26864, -1063, -19056, -24401, -43561, -23682, -12202, -9032, -1067, -7693, 18288, 42099, 48979, 87149, 80868, 49376, 35084, 37253, 35419, 27155, -4593, -9674, -13007, 9234, 19986, 26093, 34941, 25660, 14236, 37091, 50724, 45958, 55183, 49700, 54045, 46242, 58752, 63783, 40622, 31362, 27868, 30783, 28168, -3601, -3609, 3666, 6935, 34209, 26442, 12054, 16931, -2318, 11536, 22632, 20397, 809, 169, 15989, 10421, -5194, 761, 4097, 309, -6281]
17704f281m490J6771J7643J166J8540K4191N596k8248N268j775l3487p975J195
17691H114o314K5244J9524j0248k0000J336p45J6818K801j8544r428O707k164
17678A3101J5851J2132R980j6094l0080j0162K9224J820j2485r98P234J8371j1655
17665B6239o533r7j320j3478j5517j3198L5024J7762j6112j9723j5725j1539k4780
17652e8997k1777M3632K4438P153L63j0739k069K6971O827j1283n491K416K676
17639D120j1469J3416K9254m319l534n14J4111K790J38j4877j8629j2069K2692
17626B1110K3421o635k6936n582J7826j9953N223l974j8397j9732L082K0499J7520
17613G472O439K681J6854k2409l7108q429K6429N3206l367j3183k0442j2083p873
$$ y = [-6281, -10771, 6000, 23643, 24809, 43349, 67540, 73136, 44888, 50156, 48381, 14894, 6919, 8114, 1800, 27044, 46568, 36320, 16320, 17656, 16911, 33729, 36530, 17986, 8558, 15265, 13101, 28952, 41084, 51064, 34970, 4890, -5272, 23952, 25772, 13287, 12289, 19523, 37894, 26239, 19706, 19609, 18289, 4811, -10706, -23904, 11120, 28882, 12770, -6953, -22678, -34217, -58997, -80774, -37142, -12704, -5551, -5188, -15927, -17996, 8975, 15802, 4519, -972, 1444, 4120, -7349, 6067, 35321, 31002, 27468, 26954, 41065, 43855, 43993, 29116, 10487, -1582, 21110, 44531, 37896, 10960, 5378, 23204, 3251, 8474, 4500, -13897, -33629, -30547, -10048, 7472, 13911, 16592, 33446, 11037, -26071, -34500, -8071, 45135, 41768, 28585, 8143, -3940, -11813]
17600a1813K3697m718k9212l2915O175L1138J1530N855J9090j9353j8762J8969
17588c19M1888J1372k6791l6909l3507m405M3996J5927l0376k7192Q265J6848
17576b1203P331P59n975j8557M697L0690O71P297l014k769j4425K827R168j3292
17562a5795N9m083k9229j4024k6010J1465M3245K269q053l6322j3674K99J8779
17549g1074N0418J1269l5808r05J2656L820J1436j311n643k2618N286L1061J20
17536a1293j6875K143J4463j2792k5604j095L2896o217j7705j78R763k5575J2230
17523d5839R529j9550J7932p061o801R571K992L3140j7843j4875R567P570j7109
17510c8777n348o922K1578n088m001L8550j245j7899J2857o212k9303l4140J7722
$$ y = [-11813, 11884, 7166, -22046, -54961, -48786, -17648, -6118, -263, 18827, -526, -19288, -319, 41569, 52941, 26150, -10759, -44266, -48671, -4675, 11252, -19124, -46316, -38051, -21203, -13872, -13113, -19088, -37645, -32948, -2258, -1587, 5710, 2696, -73, -14498, -11671, -2503, -15795, -15736, -19819, -49048, -63072, -89082, -77617, -34372, -32103, -40156, -76478, -90152, -89853, -71074, -20656, -9387, -45195, -46100, -33444, -29624, -18188, -19499, -25142, -47760, -42474, -11413, -11293, -28168, -26025, -11562, -24354, -49958, -51053, -18157, -24374, -42079, -42257, -32494, -58069, -45839, -36310, -55860, -37928, -44989, -51790, -42219, -39227, -6087, -23930, -38805, -29238, -21668, -38777, -44125, -51047, -29469, -34557, -38558, -8, -1253, -19152, -6295, -12507, -41810, -75950, -58228]
17497e8228K2945K5039l414j3063K3428K7425p085q025j1300k1408l436L1831
17485D709P757j8094l4205K062P991M151L0540J8151k6976j4349M10o034J9630
17472d257M5103J1038j3826j6417O807R942o096r802m42j7765K1187K3420k6650
17459B2242j9338R190K104N495j6557N040J8363j1370L87P762R02j6836K3000
17446C0384J2067p091k5630l5597q97M8808O7061L5178n348l664K1138J4059m642
17433A45826n5528n4402k4686J1677K1972R69k1477l5247L238J3324p84J3336
17421A8218n235j0732K1445K7662m218K0534n729n7689J832J0940j8348k0767
17409b2087J7550k4946Q332L5842J0538J776r405j4328M3882K274m5653j4874
$$ y = [-58228, -35283, -10244, -13658, -26721, -3293, 24132, 17047, 9022, -2278, -23686, -27122, 4709, 12466, -5628, -39833, -37771, -29780, -25629, 4911, 23062, -3914, -18263, -17853, -23887, -4257, 40846, 51884, 38058, 21641, 28448, 38390, 32294, 22492, 22050, 4285, 25472, 48892, 22242, 2904, 12094, 14198, 19693, 3136, 8176, 26539, 15169, 15556, 23318, 24220, 7384, 30384, 42451, 35360, 9730, -25867, -26764, 22044, 89105, 124283, 118935, 115271, 136409, 150468, 145826, 90298, 35896, 11210, 22887, 44859, 45828, 24351, -10896, -7658, 5666, 4882, 18218, 12983, 2251, 23696, 51358, 47140, 67674, 61945, 4256, 6088, 17028, -1320, -22087, -4537, -29483, -21151, 14691, 25229, 27005, 17600, 3272, 47154, 49428, 3775, -11099]
17397a1099J3860j5741O053K520j2013k2129L654J904j0649N579J3803J0889r240
17384b2609r222K8954j7693l1421J7016J8831R200J4584L4849J3170j9459j0436
17372B5764L943J242m790N815j3181j6185m545J4772j1431j9706J0223K6359K7259
17359D5539j3887r000m7933j5381M67K5354J3466K4672p066m2596O342J2172k2397
17346c0248Q588j0330l282j1762J3042J0924R552K4437r303j8398r638k617J9324
17333i711k861j868J6124l5823j496J6273M998k6118j0420J5640J8971N267J0562
17320d62j3802J7858J5184o096R219j0825j5600K865L9503L790l5729O74P48m75
17306F852J4643p65k72j0703j4246m480K308j8538K5358M2890k4153p560M231
$$ y = [-11099, 2761, -12980, -6927, -4407, -16420, -38549, -34895, -32991, -43640, -38061, -24258, -13369, -22609, -31831, -2877, -20570, -51991, -34975, -16144, -6944, 7640, 42489, 55659, 36200, 25764, 29707, 30949, 26159, 31974, 18793, 2608, -1937, 12835, 1404, -18302, -8079, 18280, 45539, 31652, 22652, -25281, -40662, -40195, -14841, -1375, 23297, 16231, -26365, -20023, -7851, -30248, -21660, -31990, -35272, -47034, -33992, -23068, -13516, 10921, 1618, -16780, -26418, -29035, -9711, -12572, -14440, 1684, -34139, -35635, -19362, -14364, -40482, -50902, -35262, -16291, -11024, -462, -14264, 3594, 18778, 12682, 21901, 11076, -4524, -1659, 37844, 41634, 5905, 6579, 7327, 6852, 21495, 20730, 20458, 9755, -4491, -8971, -6663, -25201, 157, 43047, 18894, 11334, 15565]
17293A5565K4821j6787k7387M845m171j6080K4034J6232J6410k0582j9208j2457
17281a4765j0480J0564J6842L5534K8126k2280k5314k2374J6813R977J5552k076
17269C6119l2174M122J0398J010j7347j8667k2764j4596r409M201K4377K5094
17257i636q53O72j7762K3080J8619J3816n575j9273j1732J6143K1574L740R144
17244D1957n201j2744q975L920j9722J554J6517J0066k2593l838L72o810K430
17231c067Q119j6175J4596J1234J1920k325j1481J204K887j0382M049L5194n499
17218D0274l9141k8712j5868q607N778M7461L2839k5458N718P553m51o616k7983
17205a3213K1465J4743r743k9717j22J5624J6075N463j9277J2237j2970j4690
$$ y = [15565, 40386, 23599, -3788, 1057, -3114, -19194, 4840, 21072, 37482, 16900, -2308, -14765, -25245, -14681, 2161, 37695, 65821, 43541, 18227, -4147, 12666, 22643, 38195, 36119, 3945, 8067, 18465, 19475, 2128, -16539, -39303, -53899, -63308, -59107, -34730, -9636, -10489, -9817, -27579, -4499, 14120, 27936, 22361, 3088, -8644, 7499, 29073, 32813, 41957, 36756, 24012, 15037, 18957, -765, 789, 17306, 27372, 4779, 941, 1313, -5497, -3067, 5052, -11123, 3473, 14707, 26627, 24302, 12821, 14025, 16912, 6530, 10579, 45773, 40274, 1133, -27579, -43447, -52054, -46276, 1185, 34024, 8566, 14284, 21837, 21386, 14770, -13213, 8252, 22995, 13252, -16465, -16587, -963, 15112, 20575, 1298, 13535, 565, -14125]
17193a4125j986k3064L9932J5469J6614J6083j1820n399M835j67j2790k7989k1655
17180b6062o545J9034L7567J4643L923k2726k1650P92k549l150L0657K0426R66
17167D5326O223k9408Q371j6352j4336K259l74O001K3428J494k9557j2350O775
17154b500K8916k2328k9807K004N127k1343k6042K2321p379K0495L3736Q600k6481
17141a4681o000j2370k013N673M0370L1767p823q436m209k2091J6273M6912L84
17128F3756n0062k9810k0709Q220J5559J8381q093J4458j1841k6561l1806J1790
17116d6718J5396j228P373K9672L669j4279l935L763l5566p331M876j320K7461
17103a8167N806l5944j1429J0492L9340K00J1516j7491P493K6206k5245N677J6252
$$ y = [-14125, -16111, -39175, 757, 16226, 32840, 48923, 37103, 31704, 36539, 36372, 23582, -4407, -26062, -32607, -13573, 23994, 38637, 42560, 19834, -1816, -1024, -3573, -6723, 23934, 44360, 45326, 51549, 22141, 30512, 14160, -176, 2083, 1709, 7710, 31138, 32632, 3075, -9275, -2500, 26416, 4088, -25719, -23715, -18588, -39931, -65973, -43652, -51031, -30536, 3200, 11800, -14681, -20681, -33051, -35064, -29391, 10979, 42746, 34923, 26487, 22278, 187, 16460, 63372, 63756, 13694, -16116, -36825, -28605, -13046, 5335, -2758, 11700, -141, -26702, -58508, -46718, -31322, -32550, -25177, 4495, 8164, -6115, -10050, -6287, -41853, -49184, -44308, -45628, -18167, -12361, -48305, -59734, -49242, -9902, -9702, 1814, -15677, -8184, 18022, -7223, -1546, 14706]
17090A4706l905j7977k060L1975l692o346j5084j0181j5848j7690K1506L9633
17078A5037j5048j1606M667q080k234R929J3304p543J5833Q411J8821j2057l1023
17065a589j2926P5j3440L4909N8282k655k9157k1043K3403O56l3068j0525J6623
17052I545K7734k1577k5580j0380J1152N398p967j0659J6885K5691M504r419J979
17039A7306o896n997K8798j261j2514j7450j7832l231J5404K966m238J1458k5849
17026a9336j5144K8657J3162J2362K166o618k2635J589n94N598R225j985R480
17013A5927j1132n609j8233J4211j1413j3549J745K7357J2169k4675J1536k743
17001d409k9521q088K8492o649o509M633J7016j063M513J7081l343k680j5596
$$ y = [14706, 10801, -7176, -9236, 22739, 19047, 12701, -2383, -12564, -28412, -46102, -24596, 15037, -11, -11617, -6950, -15030, -17264, -7335, 5969, -1574, 14259, 22670, 41491, 29434, -1589, -14515, -14440, -27880, 7029, 65311, 62656, 33499, 12456, 35859, 36515, 3447, -7078, 9545, 37279, 15702, -9878, -20258, -9106, -3708, -11675, -22334, -5449, 20242, 24746, 15327, 17306, 10410, 4413, 33211, 31950, 19436, 1986, -15846, -19077, -3673, -707, -4945, 6513, -19336, -34480, -5823, 7339, 19701, 21867, 15249, -7386, -5797, -6391, -793, 8432, 6447, 15927, 4795, -814, -19047, -4836, -16249, -29798, -28053, -696, 11473, -13202, -1666, -4409, -33930, -42018, -13526, -20175, -26684, -22051, -5035, -6098, -1585, 15496, 12153, 9473, -6123]
16988f123j2867J8345J9531k1839p784Q286K206r653M144k160m1739n347L6895
16975a8105L0302k4903l0533J5090N753O532L8412J8072j1966j8032m0539j0085
16963d0002R079j5432q352L953J0379J4105J1771J2667J4471J8948K7081r24J130
16950E8874j3149j7318j0510o465J2545k3221m072k38p763L1275J2309L732l5584
16937D15k7071j2112L778Q847J5529K5467k2190j4520J1156K0776l2337k0967
16925d3229N852N932L2069N6024r53j2042k6584l3062J2256j324n7649j6021J9729
16912e9002J1726l466n30J0193j2853J2816L5933K6632L944k9618j9728J859J4073
16899h021K4508q198l8889K350N802J6177j8911m1787J4409J2218R801j6745K1123
$$ y = [-6123, -18990, -645, 18886, -2953, -10737, -2451, -245, -9898, -5754, -7914, -49653, -55000, -18105, 12197, -12706, -43239, -28149, -22396, -15864, 22548, 40620, 28654, 10622, -29917, -40002, -30923, -46355, -54707, -50754, -40375, -26270, -14499, -1832, 12639, 31587, 58668, 57744, 58874, 45725, 28407, 17897, 11432, 23977, 756, -3316, -3554, -11317, 19958, 32267, 35999, 415, -26656, -38768, -34990, -26143, -10614, 14853, -7337, -21857, -10701, 10075, -22262, -43229, -37377, -31445, 624, 56648, 55695, 43653, 17069, -15993, -3737, -5061, -62710, -78731, -59002, -47276, -50742, -51272, -41079, -53932, -41116, -5183, 21449, 25393, -4225, -23953, -22094, -8021, 16487, 8289, -30600, -28250, -22448, -6271, -25182, -66969, -52560, -40342, -30541, -47286, -26163]
16886b6163L1189L6527M917l4075r817Q896M042J1973R836o517M007O836K867
16873D4518l0476j2079L077N357p032k9768j6021l917J5077K0984o895Q299L3940
16860B5064Q036n1791k7307K0378j4097Q752J3973q749m462M477J3346K557k0888
16847c0711J6622K6831j9232J0132J9888l1390p573K7393j7357P23n568k5190
16835c5432J6491m042J8362J0138p032o221q553o147j1706J3345K0232k0742j7130
16822c8437L891L022k2550J0586K1431p130j858j1872J6009K4717K0824O516J201
16809B6350o22L69K819M723r046k8871j6190K023K2884L4685j0141m573O965m899
16795B6476j8676k5462n266L257L2591J4709J116N40m2097l6728j110n923K8852
$$ y = [-26163, 5026, 41553, 46470, 12395, 2578, 11474, 15516, 27489, 37325, 30808, 34815, 41651, 44518, 14042, 1963, 5040, 10397, 3365, -26403, -42424, -46341, -31264, -10280, -17175, -8876, 25064, 33100, -18691, -45998, -25620, -39717, -30965, -16992, -25741, -30203, -25726, -12380, -9823, -30711, -14089, 12742, -6490, 3642, 23530, -7860, -15433, 11960, -5397, -4674, -10242, -35432, -18941, -22983, -4621, 5517, -1515, -7736, -16289, -22436, -34142, -20797, -565, -21307, -38437, -34546, -31524, -54074, -43488, -22057, -29187, -31045, -42917, -26908, -2191, 18633, 25149, 26350, 25728, 26097, 28916, 33639, 24593, -4278, -20468, -18445, 4439, 39124, 28983, 24410, 31375, 26476, 7800, -17662, -22928, -19671, 12920, 27629, 28745, 29285, -12812, -49540, -50650, -56573, -27721]
16782b7721K6938k0802j6679K324j1911J621M8888J30K368J3603j0281k799j0716
16769e037j0152R676J7321k2683l4393J2821K4830j002j2092K0967J6979j980
16757A5255m455r82l4406N914N887L2168j8284o992J4127J0435k8170M644L1898
16744B7039K82n047P900j859m0889k9972J0052J9470J0124j4167n472L540j2418
16731c1417O714m304L534M0979L0618q492k4921N467P896P335r477J0088J1394
16718D5414P41N501J2671j9670L5332M580j6542o727j814k310K6478L4325J8051
16705A36030l0781O195J4711K5606P76Q252k505j029k0266k7876n5367j4534j3128
16692B6084j4102J3598L0605L870J4142J4651l6951n800J5771Q278J2997J9826
$$ y = [-27721, -783, -21585, -38264, -35940, -47851, -46230, 2658, 2788, 5156, 18759, 8478, 5679, -5037, -15189, -5513, 11808, -10875, -45268, -32447, -7617, -8619, -20711, 256, 17235, 15255, 10800, 9818, -24588, -18674, -12787, 19381, 1097, -5895, 8232, 18667, -9503, -4859, 27039, 27321, 22274, 30174, 28315, -12574, -42546, -32494, -13024, -2900, -17067, -22539, -18999, -31417, -24703, -29007, -25473, 15506, 46124, 37632, 12711, 18178, 26074, 33409, 23932, 34020, 45414, 46155, 51656, 64327, 44657, 79989, 84569, 68027, 61300, 59486, 57176, 83654, 117979, 136030, 105249, 111444, 126155, 151761, 152537, 160789, 158284, 157255, 136989, 109113, 53746, 39212, 26084, 11982, 25580, 56185, 60055, 74197, 88848, 51897, 46097, 61868, 70146, 83143, 102969]
16680A02969K2973J2987k615Q070P142J5723j9857l9235m0509j2916M036j5478
16668D3290j6889j6815o357j3260K3898K446j2785k7812k6994K4031K3090j7545
16656b1702J1702J7160Q611J8332J4452q20Q424k159j0568j6895j0858j5574j8243
16643a8138k933K108K1218M0823J5143j5637O829n140m379k2039l0731j6020o71
16630b9567N770J7085j6379j8907p074l625N528K0727J1665L459l931n694K7812
16617F869J657K3309L6720j7084l0956l7809q744K375p6R442K919J6259K016q753
16603a856j8755O068j389j4327q112J2169R224j8094J9067j4479k656L9237K0723
16590B6820R252k7716Q002O428p436K274m968K262K9335m047P486K4354j386k3625
$$ y = [102969, 125942, 138929, 136314, 144384, 151526, 167249, 147392, 108157, 67648, 54732, 58768, 43290, 26401, 9586, 3229, -10031, 13867, 16313, 3528, -24284, -51278, -27247, -4157, -21702, -10000, 7160, 15771, 34103, 48555, 47735, 56159, 54000, 43432, 26537, 15679, 105, -18138, -21071, -18963, 2255, 43078, 58221, 42584, 49413, 44273, 39894, 17855, -12876, -28896, -29567, -23797, -6712, -23091, -41998, -49072, -52697, -47169, -26442, -14777, -11318, -15249, -20943, 6869, 8526, 31835, 68555, 51471, 20515, -17294, -26038, -23663, -23739, -14297, -11378, 4881, 6897, -1856, -20611, -14543, -15932, -30259, -38371, -26202, -16978, -35072, -16005, -30484, -33140, 6097, 26820, 36072, 8356, 16358, 22786, 15350, 17624, 12656, 14918, 44253, 40206, 47692, 72046, 70660, 47035]
16576D7035j9015L9122J4453l8150j8493j8596k8082J5562k558o711J2617r281
16564a2097j2177L2948M2146O027q979l0090o962j9500k39J9967J5076Q251m905
16551B9466k3791J0515k8096J3721j669j5642O672K8624K5487j1431q884L500
16539B8472j2280q291P743O60j3489J1820K638M131m664j4822j5678j2787k2453
16526d9000k3491J4258K8219m273K3252K1840M634l3057J9945R861J8757p838
16514B3107j0123k256o924P850k6998P349K2079L361j5429J4985M2314m878j8465
16501C5972j665N29O313n6613m594J2711p827N687K6218M438N611j716Q577o317
16487B7324j9135P32J4604K9320j6725j4010J1590k3103l6435J2957J0625l2054
$$ y = [47035, 28020, 67142, 81595, 43445, 24952, 6356, -21726, -6164, -8722, -15433, -2816, -12097, -24274, 8674, 50820, 56847, 47868, 17778, 10816, -8684, -8923, 11044, 26120, 34371, 29466, 5675, 16190, -11906, 1815, 146, -15496, -8824, 19800, 45287, 33856, 24972, 28472, 16192, 7901, 15644, 16304, 2815, 14635, 17273, 21404, 16740, 1918, -13760, -26547, -49000, -72491, -58233, -30014, -34287, -11035, 10805, 15439, -17618, 2327, 12188, 30945, 23107, 12984, 10728, 3804, 11654, -15344, -7995, 14084, 17445, 2016, 17001, 59315, 54437, 35972, 34307, 34836, 41149, -15464, -20058, -7347, -15174, -9487, 16731, 21169, 26780, 25064, 33641, 27324, 8189, 8921, 23525, 52845, 36120, 22110, 33700, 10597, -25838, -12881, -2256, -34310]
16475c4310j4423K3898O55K8686J6794O712j0848l4999J118O099j8186L0030J7811
16462A9037J8964K2971O066j5853N450j6492k5414M190j0446o30J6217K6316K855
16449E3231q507j8138k5189j0309J0940L3071j644j6812O681k62k945O527j5073
16436A1571l907N880J4343j6561o911J0378j2405k2471Q349J9257M820j7384J5944
16423A0903J6443j8753L45J2436O323J2394j4031k8141m760J7277K1008m263j5125
16410A2056J7533m159N664l1211k905K3316L6854K3382k3637o395N496O382j9896
16397D2480k0728j0226O724k877O357k845k1583j4656J468M557K4946N6679J2505
16384H2801J90q03k1114k4796l0419j9700p360j3122J6951K2979j1357J1448N826
$$ y = [-34310, -48733, -24835, -24180, 4506, 21300, 28012, 17164, -17835, -16717, -10618, -28804, 1226, 19037, 38001, 60972, 67038, 51185, 56635, 40143, 14729, 18919, 8473, 7843, 24060, 50376, 53231, 44724, 26586, 1397, -8912, 2028, 35099, 33455, 16643, 23324, 23062, 20117, 26644, 11571, 7664, 13544, 27887, 11326, 4415, 14793, 2388, -20083, -11734, 7523, 12343, -5041, 10903, 27346, 8593, 8938, 21374, 27697, 40091, 26060, -2081, -6841, 10436, 31444, 27181, 12056, 29589, 25430, 31094, -117, -3022, 20294, 57148, 80530, 56893, 50498, 55994, 62376, 42480, 21752, 11526, 18250, 15373, 21730, 18885, -2698, -17354, -15886, -11329, 13617, 70296, 82801, 82991, 82188, 61074, 36278, 5859, -13841, -21201, -34323, -17372, 5607, -5750, 5698, 11524]
16371A1524J4566j0704k686j0913j4120P829K1970M676j9632o904j4809j5168
16359c4371k2960K1342L8199o798M616j7751J0686K3190r883j470L555m153l101
16346A101K1684J4335k2841j7719P515O506J5365J1997j6352q340j3007N236N788
16333A1268j5740J0328L7441R59P53o648j6696n41k512J5937K8775J442l4604
16320C0162j1036K7033J1906j2837j8945o432j673L920l593j7942l0584J7890
16308a2131K0860q726l004k418j2512J0077J1672J0826n556j3585j4990n59J1851
16295h195K840R251k3189j5897k0737j6269J9926L5001M4452q976j3419j0172
16283e384j5879q85K9826P628l811K3389L646k1178j7774J4630K9910K446N150
$$ y = [11524, 26090, 15386, 12700, 1787, -12333, -4504, 17466, 22142, 2510, -4394, -19203, -34371, -57331, -35989, 2210, -4588, 28, -17723, -7037, 16153, 6270, 4800, 8355, 4202, 1101, 22785, 37120, 14279, -3440, 4075, 10581, 25946, 37943, 21591, 13251, 244, 5480, 11268, -4472, 5856, 43297, 44256, 45009, 38361, 21665, 21124, 18612, 34549, 63324, 64766, 30162, 19126, 46159, 58065, 45228, 26283, 19851, 18178, 22098, 18505, 563, -30021, -12131, 8729, 3, -3001, -5419, -17931, -7854, 3818, 14644, 9088, -4497, -19487, -20046, -8195, -5355, 3896, -19293, -35190, -55927, -72196, -52270, -17269, 27183, 18207, 4788, -5384, -21263, -22148, 7678, 15306, 11495, 34884, 38530, 17352, -422, 14208, 44118, 46564, 51714]
16270E1714o595m861J2730N899J4629Q83K002r78o970o555j424o740m922k1986
16256B6826K399l0935k2659K4197J1448L808r542k0846j701J2479K1014j7874
16244a386k0151K0555N99l912K7548J50l9449l3243j2981M946M1264J9038K296
16231E274Q251l7474l3789J1271P278J0326J6538Q913K176R508J2434O289j5643
16218A1352j7679j0952J5848M471l219J7243k3889q714K1415j9580J4270K2469
16206B3035K1508N770r1J005R645j1504j7787k8730o659n815O353j105N70j556
16192e361k2432Q10k244m623L7464P817l007j5109k869J0266o073J3224n160M512
16178G215J1302n543k5627N22L4l958r912j4673j8412P829L9219L4760L4210J0823
$$ y = [51714, 45119, 40258, 52988, 58887, 73516, 74399, 76401, 75423, 68453, 61898, 60474, 53734, 48812, 26826, 29225, -1710, -24369, -172, 11276, 15084, 5542, -15304, -17005, -4526, 16488, -1386, -21537, -982, -383, -4295, 23253, 23403, -16046, -49289, -62270, -57324, -16060, 2978, 5274, 13525, -23949, -57738, -46467, -39189, -28863, -12325, -3412, -1236, 8272, 20706, 26995, 11352, -6327, -17279, -1431, 3040, -179, 17064, -6825, -15539, 5876, -13704, 566, 23035, 44543, 50313, 50222, 51227, 60872, 49368, 31581, 2851, -3808, -9623, -3270, -4375, -3805, -5361, -27793, -26983, -29227, -33850, 3614, 11431, 8424, -6685, -9554, 712, -5361, 7863, 2703, 7215, 18517, 12974, -12653, -12131, -12097, -16055, -25967, -40640, -59052, -51223, -12004, 22756, 56966, 67789]
16164F7789j4405j3161l1985n575n87j3748q078k401j3738l0042K8198L3859j3817
16151a7691j2206O452n043J1676p535J3358L6462j8417o2333j5317L5178J9329
16139a6087K2737k5606k8946K6128M090j8389N533r333K969K7957L6379O379k730
16126C1081j1002P775n084j6295k5505k5665Q601k4112k276J5506j2340J0159
16114d9157L375J6397J3698m230J0130J5076j900L3042j2363k9318M0969k0675
16102A5044k8556J5127k0348k4646r389k69K8183M4544N11k5128O052J3264k1788
16089g399m271l141j802J1022K2673J6408J0542Q609k7123j2187J7773K2045j8133
16076C5016k9009l1902K0029k543J295r807k6119k579J7902O191P231N858n781
$$ y = [67789, 53384, 40223, 8238, 2663, 2076, -11672, -19750, -22151, -35889, -65931, -37733, -3874, -17691, -29897, -23445, -28488, -16812, -24347, -10989, 25473, 7056, -55277, -70594, -35416, -16087, 6650, -18956, -47902, -21774, -17684, -36073, -30540, -39873, -36904, -8947, 27432, 33811, 31081, 20079, 27854, 22770, 6475, -19030, -44695, -36094, -60206, -62482, -46976, -59316, -49157, -45782, -29385, -15687, -19917, -9787, 5289, 3389, 36431, 24068, -5250, 35719, 15044, -13512, 1615, -18733, -43379, -52768, -53037, -24854, 19690, 20201, -4927, 1125, 14389, -7399, -11670, -14811, -16613, -5591, 17082, 33490, 44032, 52641, 25518, 13331, 31104, 53149, 35016, 6007, -25895, -5866, -8409, -7114, -16921, -43040, -45619, -27717, -21526, -14295, -8437, -14218]
16063a4218J8736j1072k4769M388L5690J8259p572P933K3245O053j8116k9037
16051I520k677J9888l975p642j5640n857k3276K4012L6590j2347m0136Q537r216
16038b2219n962J392K5943J5350N84k2808j8582k2160J9767J324K465J9562J1763
16025F419J3212p027j4059J4411j0566l2954L29J0397p181j336m465J4275J4201
16012d344L5571j5141n2177l604P764K911j8892j1644k0063J6468K133p382R437
15999e8963L4616O327J4772P936l014j1707j5373k5845J3265J5942p610J1237
15987a8417P811L8141j5585k8022O286j130k926L664K721P703J1314Q198k598
15974A7160p129j575k3080q182K037P464l987K4222m318m4405k3271K3299K5999
$$ y = [-14218, 4518, -6554, -31323, -26935, 8755, 27014, 19442, 27375, 50620, 56673, 38557, 9520, 6843, 26731, 22756, 15114, -526, -6383, -29659, -5647, 30943, 18596, -21540, -13003, -22219, -28181, -26789, -846, 14504, 15088, -7720, -26302, -48462, -28695, -27371, -24906, -5344, 6419, 19631, 12604, -1455, 12956, 2390, -30564, -30235, -19838, -27019, -28355, -32820, -18545, -4344, 31227, 16086, -36091, -39695, -31931, -29020, -47912, -59556, -79619, -63151, -61018, -68400, -58963, -24347, -18020, -3248, 4688, 1674, -10033, -25406, -51251, -37986, -22044, -29654, -18417, -10606, 27535, 11950, -16072, -9786, -10916, -13842, -10178, -7457, 246, 11560, 19758, 17160, 10031, 8456, -14624, -22806, -20769, -13305, -17292, 6930, 2612, -41793, -65064, -41765, -15766]
15961a5766Q592R733j5605j793J2440K7097R246J1861p650j8066j5818m137q371
15948h237J3571J2443p494k4572O326J0003j7400q298K807J0586M2093M808k3874
15935A2762j3068j236k8814J9590J7329J2890k789j7375q56L6526J1683j7939
15923B8703k2359J5164L330k597j730K760j4553j6660K3715M528k0383k7899R439
15910a8542L2511J1663K600q977k8635j6016J7094J6055J0526L889k9979k8374
15898c6185k927J2241K0240L206j5816J566j5137q349J241K0735J9166k3536k8767
15885e2322M0944J8916k2916J1900K031q763k8306J9309j1775q925l5282l875
15873g9064J1977L655J8477K4120p208k316n076L059j805J2437L4046P864L034
$$ y = [-15766, -7174, 2559, -13046, -14839, -2399, 24698, 33944, 45805, 38155, 20089, 4271, 134, -8237, 5334, 17777, 10283, -14289, -7963, 2040, -15360, -23658, -20851, -10265, 31828, 36636, 12762, -306, -1542, -30356, -10766, 6563, 19453, 16664, -711, -1567, 34959, 46642, 28703, 6344, 21508, 24838, 22241, 20511, 23271, 8718, -7942, 15773, 20301, -82, -27981, -18542, 13969, 25632, 28232, 19255, -9380, -25396, -8302, 7753, 18279, 22168, -7811, -36185, -39112, -26871, -6631, -3425, -19241, -17675, -32812, -41161, -39920, -19185, -19, -23555, -52322, -11378, 7538, -15378, -3478, -1447, -10210, -38516, -19207, -30982, -39907, -75189, -79064, -67087, -63432, -44955, -20835, -28043, -30359, -35435, -32376, -34181, -21744, 12302, 20166, 23200]
15860B3200J5579r724l4593P119J4401k389k4809l7359J7168L1004l113l522k7614
15847c4652k3087m411Q518R725q782J4593K8350k934o925k7374K0007J6915P828
15834b229k983O048k684n109o890r764k6557P643M6325J4232j7409j0968k966
15821a3311J3313Q414j0984J9257J090j3978o106N378l458M791q663l35k2968
15808b7560j3232O992K7145L9385J7592J255k5589k2207k2313L4648L0480l2661
15796A3935P233j0107P261J8299j358J411j3344O93j7156K7550p003q749l7147
15783a8482j2466o816J0854K8817k633J0278l23P274q192k6860J7286N106K0259
15770B4102J1457m945n441J0195K8822k7387l2273j8817j3426J1967M689j6592
$$ y = [23200, 38779, 29055, -5538, 1581, 15982, 13593, -11216, -48575, -31407, -403, -3516, -7038, -34652, -57739, -62150, -53632, -43907, -52689, -38096, -9746, -12680, -19605, -46979, -26972, -10057, -2229, -5212, 836, -1848, -6957, -13847, -23611, -50168, -42525, 3800, 18032, 623, -10345, -13311, 2, 8416, -2568, 16689, 17779, 3801, -2305, 3073, -385, 4406, -4257, -4592, -27560, -40792, -33800, -6655, 32730, 50322, 51577, 25988, 3781, -18532, 16116, 46596, 13935, 21168, 11061, 18322, 36621, 35263, 36674, 23330, 24023, 6867, 34417, 27414, 18665, -18482, -30948, -37764, -26910, 1907, -726, 9552, 9229, 16503, 8311, -18549, -1263, 3843, 24102, 35559, 30614, 25173, 35368, 64190, 36803, 4530, -14287, -27713, -15746, -11057, -27649]
15758b7649q471j1368L453N1934K6572j7548k5361q383O372J4243l168l824K3362
15745B0164J285l1356k2554J4313J4644J8156K4412Q008k7105K2636r292p469
15733B5842m415L063m018O761N055k0371p341J2485k395K3181J5319m32j3229
15720C9505k2469j6975L965K806l946J5772J484n016K6372j1955p039k0569K252
15707D187P444j2963k352K949J4988k109k737Q642J3711j4129k3303J5373M5344
15694E5045r771k5984j5289j3721l1315k1254J4893K2787K0761P159P962o312
15682D961L39K9784j4970k7892k8043J7362J9114J2908J4171O531j565k3452m6361
15669c7113o942M1958M7467l406j0711k630q207q757j3807r174J5806P389O215
$$ y = [-27649, -36120, -47488, -44035, 7899, 34471, 16923, -8438, -16821, -10449, 3794, 626, -3198, 20164, 21449, -9907, -32461, -18148, -3504, 14652, 39064, 47072, 19967, 42603, 33311, 25842, 21427, 24490, 20472, 27233, 32288, 11917, 4576, 17061, 14666, 37847, 53166, 52734, 39505, 17036, 61, 4026, 6832, 2886, 18658, 20142, 15126, 41498, 29543, 22504, 1935, 4187, 11631, -1332, -3684, -735, 14253, 12144, 9407, 18049, 31760, 17631, -5672, 9701, 55045, 45274, 19290, 4001, -9720, -41035, -62289, -47396, -24609, -3848, 3311, 11273, 4961, 5300, 35084, 20114, -7778, -35821, -18459, 655, 13563, 27734, 34265, 32700, 9248, -37113, -44055, -2097, 45370, 41964, 31253, 28623, 20416, 11659, -2148, -11322, 4484, 11873, 18088]
15656A8088o816l713j5196L1191L5194j3754n02K702J3367M958O911l0969m8002
15643f541J3018j1649p517J0983J450J6502K8061r341l1685J69Q28L266N597K5120
15629C8261j2293m2601k2451P757Q740K2378k007j4681J2289J8995K086L086q044
15616A1515K619J548p840n621j7143K7104n061p163j6555L1541L5558j5569J0712
15603D5645Q779j5772k2380p93l27p428r291j3316O795j7046p096O575J9123j4765
15589b1297J0296K6206N119J8971J2002l2978k2082O068J1858m100l5914j9320
15577d5171j1329N193J8086K89J4503l628M922K220L1831L6405k1966m5707k1163
15564c5515K6199m866j6541o547k1797L586L3023M4926j0003j2363l768k5003
$$ y = [18088, 11272, 7559, -7637, 23554, 58748, 44994, 44492, 47194, 60561, 65519, 72430, 41461, -6541, 6477, -5172, -12689, -1706, -256, 16246, 44307, 34966, 3281, 3450, 4278, 7544, 13141, 38261, 25968, -16633, -39084, -31327, -22587, -209, -2216, -16897, -4608, 14387, 16473, 19559, 11515, 14134, 15682, 7842, 2221, -14922, 12182, 7121, -42, -16597, 14944, 50502, 34933, 45645, 54424, 38652, 16272, 15479, 15152, 7724, -1567, -14883, -8088, -25134, -32230, -25655, -6532, -21297, -11001, 15205, 20324, 39295, 51297, 18319, -3763, 2305, 14163, 10063, -25851, -45171, -56500, -51307, -33221, -32932, -18429, -22057, -17135, -14915, 16916, 53321, 31355, -14352, -35515, -9316, -14182, -30723, -37270, -59067, -55481, -22458, 22468, 12465, 102, -3666, -28669]
15552b8669J1343J1901r504r690O948K4863J1787J773M420m887P502j766j9036
15539F985P077K4217l8339j5835P889J3091J1996J5900k3367j3490k295Q095K3314
15526B5238k897j5718K2541M91j3372p879K0550o23J135o800k9083j3087O182
15513a3322n358j2210L901K7582J0072k1631k1067K0149K2962p155j0534J571
15501e040J7726K668m365k219m801J7858K1067J2584j482j7486k1979o809P735
15488A5457k2321Q790p136r005k1300M7730K0153r470k2519N926J5932J3837j73
15475C5901j8465K201l88k0916j0739j0513k5492K4604L3357R927K2419j2031
15463B9865j268k242K2347K4534m862m0702J3059K1370J0244P831J1842p961l2739
$$ y = [-28669, -17326, -5425, -14929, -24619, -17671, 7192, 18979, 20752, 25172, 20285, 27787, 26021, 6985, 14062, 38279, -60, -15895, -8006, 5085, 17081, 32981, 9614, -3876, -6171, 1924, 25238, 22341, 6623, 29164, 29655, 16283, 8404, 28954, 28331, 29466, 22666, -6417, -19504, -13322, -18680, -30890, -26989, 593, 10665, -10966, -32033, -11884, 11078, 3923, -6611, -5040, 12686, 15354, 10989, 8770, 3969, 21827, 42894, 55478, 53996, 36510, 14531, 7722, 15457, -6864, 1926, -5210, -14215, -35515, 12215, 32368, 22898, 379, 6305, 22237, 36074, 35901, 17436, 19637, 19249, -1667, -12406, -22919, -48411, -23807, 9550, 19477, 41896, 29865, 28597, 26355, 48702, 73236, 68374, 27672, 40731, 62101, 72345, 80176, 92018, 84057, 51318]
15450E1318r708M058K103J480o317P170Q618M844L009l1538j0406N824j5272K847
15436A8030j9824J1475m8222j9185L364n172K6078K8817K562R237J6361k2192
15424A329K0063m663j9068n719R553K329j0229j6126k3815K6972L1110J8716M6622
15411G7074J5007m6649l2763j517r463J0998j2954j6538J4713J1433k7994J1642
15399g011L40j7782n174Q000L1037j4361j5482L8458J1971K3339o986j8260p468
15386B0621r891K12J0572K9562q664j7175J2869O587k0979j6222o683J2728p558
15373E979j2523R204r287K0627K0466k8762j1208J5851J8238j1528l3962J755
15361a5150K0021j4847J1029j5782O645J0401j641o504K2078Q801N400R794P456
$$ y = [51318, 41610, 45668, 47771, 49251, 42934, 50104, 58722, 63566, 66575, 35037, 24631, 30455, 15183, 18030, -1794, 9681, -38541, -57726, -54362, -59534, -33456, -4639, -2077, 7160, 23521, 1329, 21392, 16729, -2339, -8058, 1495, 3824, -6405, -22531, -46346, -19374, 11736, 30452, 77074, 92081, 45432, 12669, 11152, 1689, 12687, -267, -16805, -2092, 9341, -18653, -7011, -6671, -24453, -29627, -21627, 9410, -4951, -20433, 18025, 29996, 53335, 46349, 28089, 20621, 10730, 10942, 21514, 51076, 42412, 25237, 38106, 44693, 23714, 7492, 809, 13537, 5979, -6544, 2660, -6627, 14000, 34466, 5704, -5504, 10347, 28585, 17057, -16905, -15150, 4871, -9976, 1053, -14729, -8084, 2317, 676, -5828, 16250, 25051, 30451, 40245, 47701]
15348D7701l9239k8727k3719R656L7940k2373K859K9584j1529j1992L0473J5454
15336C6088M81j0078r657M488j7756j1211L0461K1440J0417p552k8257k2369l128
15323f633J5244r151o140J0015j7467o865K2756N27n036n8K5547j0665k0915j9089
15309b7930J7297j5861j8132K1997k5096p774K4705L1249j061O788p62J862j8148
15296a0866N657J4191l0980N609L9376L421L503J7537j1858r844l403K1250J4714
15283E8307k8911k7933J2975l212m142r818j3163j8873k271n252N915M4857j2198
15270c719p143J6462J510j716n575J3618q764N065j2522J1297K4395M199o819
15257C0288m826r565k0644N197R830j727J4168m765r10J0088J0959l225R685P747
$$ y = [47701, 8462, -20265, -43984, -34328, 3612, -18761, -15902, 13682, 2153, -9839, 20634, 36088, 36569, 26491, 16834, 21322, 3566, -7645, 22816, 44256, 54673, 47121, 18864, -3505, -6633, 8611, -540, -6680, 3335, -14132, -20997, 1759, 2286, -2750, -2808, 22739, 12074, -8841, -27930, -10633, -26494, -44626, -22629, -47725, -55499, -30794, 455, -606, 6182, 5420, 7282, -10866, -5209, 8982, -21998, -16389, 22987, 26408, 29911, 47448, 35590, 25746, 22343, 43593, 58307, 29396, 1463, 14438, 11226, 7084, -2734, -15897, -34770, -37041, -42293, -36378, 8479, -3719, -10862, 5600, 7110, 5394, -181, 13437, 4673, 9738, -2784, 8513, 32908, 37107, 30288, 25462, 15897, -4747, 450, 10280, 8553, 22721, 17956, 17046, 27134, 38093, 34868, 44553, 52300]
15243E2300k5615j725j3007j9622j078K5399J2359L018O196p439j5410J6776R9
15230C2251k5360l5353J0582J5383j0835N71K7902K6892Q638l0680j0043k6780
15218a6832q558J5987L3035J493Q339N464j7060l7145j1339n408O175K5159r357
15205a0047L610Q864M545n24M802l6242j5880R973K1122O477O695o431R550p917
15191a403k713J426J5943j6215L155k321K2342j4670j1756m17m133j3817L2611
15178H032P865j378K061O220k1778k4719K3437J1804k5813q786K3633K2242N244
15165B8064K651p803n878R767L020m844l3243J0157J2876j5081K0495r781n112
15152E288N5j2242k983j986J4163J773O606k908P007o4n216Q640R136j1951j1300
$$ y = [52300, 26685, 24960, 11953, -7669, -8747, 16652, 29011, 32029, 38225, 30786, 15376, 32152, 32251, 6891, -28462, -17880, -2497, -13332, -12761, 15141, 42033, 50671, 19991, 9948, -16832, -25390, -9403, 23632, 25125, 33464, 38928, 21868, -15277, -26616, -32024, -25849, -690, -10047, -6437, 2427, 6972, 6448, 11250, -24992, -40872, -30899, -9777, -3300, 3395, -3036, 6514, -1403, -4116, -2690, 13253, -2962, 193, -2128, 20214, 5544, -6212, -6629, -10762, -24579, 8032, 15897, 14519, 16580, 22800, 1022, -23697, -260, 11544, -14269, -23055, 578, 22820, 28064, 30715, 22912, 17034, 26801, 29821, 24977, -8266, 1891, 14767, -314, 20181, 10400, 5288, 5343, -6899, -9882, -11868, 2295, 4068, 10674, 7766, 14773, 14709, 9493, 18133, 27269, 15318, 4018]
15137D018R937p648k0500R07J8047L3882R876O530R952R614J0639j1702K414K886
15123G8852j8802j0479K5532O476j0207k3366k6991K86j9044L3417M2203j4537
15111F3340k7795J146l376J0307j909R989j1186J991K949J9715L481J5539J2566
15098I6757m057K3214q842p298K9018L4681R651J2096J753J4461M7517O7020O8178
15085C84149N0928P9541J06584J17087P5639M7681N7404L4337p7j8238k7796n4581
15073H52658p4061q0006r1365q4373q6502m6541m6995l2228l4608r857m039l0080
15061B32003m4192j9624j6549j1569p194j2024p308J0533K7396k4876O233K5784
15049A58613k4713m1195O96k247k2829q38P965K142p970j006J375K2079N555j199
$$ y = [4018, 13955, 6307, -14193, -13286, 4761, 38643, 48519, 55049, 65001, 74615, 85254, 73552, 75966, 78852, 60050, 49571, 75103, 81579, 71372, 48006, 21015, 21301, 2257, 35674, 77877, 63340, 35545, 36691, 33315, 43622, 41713, 51702, 40516, 42507, 45456, 65171, 68652, 84191, 96757, 92700, 115914, 107072, 99774, 128792, 163473, 173124, 185220, 186973, 201434, 248951, 315971, 384149, 435077, 514618, 621202, 738289, 813928, 861609, 919013, 953350, 953273, 935035, 907239, 852658, 778597, 698591, 607226, 522853, 436351, 389810, 342815, 310587, 275979, 266122, 262083, 232003, 187811, 168187, 151638, 140069, 132875, 120851, 113543, 124076, 151472, 126596, 132829, 158613, 133900, 92705, 93401, 91154, 68325, 67487, 75452, 77594, 69624, 68618, 69993, 92072, 97627, 96428]
15035I6428O485j5313k2952o983j0986j4870k1474K9517K0893P776k249j4910
15023E1362J6441K645L366P520j9809J5572J4803k2202l1359j2056K19K0554P784
15010E4840k7293r056j0949J3167J8231j5951j824K0495L75K223N50l5034k4598
14997a4824M532L5694J8155K5463O335k1216k0848q331Q944J5523j2682r028j0071
14984A7646J1800L837N24J1806N34k5684q794j639P927k6809q344L6857L921j8705
14970D877K4673k800q946m101J9343j3375J1523K1081J1689k642j0404k0036r588
14957B1294Q486k5157k282J4100M298J1768J4357k0481j8268l3162J3052j9675
14945c1670P90M3252K0286k5075k7013j1133Q211K487O600J8084P322o646P358
$$ y = [96428, 102913, 87600, 64648, 57665, 46679, 31809, 10335, 39852, 60745, 68521, 66272, 51362, 67803, 70448, 73814, 81334, 61525, 77097, 91900, 69698, 38339, 26283, 26502, 47056, 54840, 27547, 18491, 7542, 20709, 38940, 22989, 21165, 41660, 42035, 44258, 44808, 9774, -14824, -10292, 25402, 43557, 69020, 75355, 54139, 33291, 24960, 33904, 49427, 36745, 27717, 17646, 29446, 33283, 33807, 45613, 46147, 20463, 11669, 10030, 17957, -8852, -17196, 19661, 23582, 4877, 29550, 26750, 17804, 13703, 33046, 19671, 31194, 52275, 63964, 61322, 50918, 30882, 21294, 29780, 4623, 2341, 16441, 20739, 32507, 46864, 26383, 8115, -25047, -11995, -31670, -30880, 12372, 32658, 7583, -19430, -30563, -22352, -19865, -13265, 4819, 12141, 5495, 12853]
14932A2853K2303o961J1350k1276j3218k0644j8444j8396J4677L9056L8161m718
14920C4743k2096R765K1069k850j9999j3882j9563k808K3341N90J4390L0600k719
14907E0581p850K821L543k4496n544j283k2540K42J1085L205j3417j6222K1173
14894A298J9899k6889R672J2007R611J8368k7115j3490J756p581j3654j506L2301
14881A4677K0807J1229K5652k2929l4377n81k3333J7360K1236k5299N48M536R054
14868A8580k182j9385N628k1032q607K9424K3569k4569l1851Q776K4819p276l1521
14855c5627J0742J1143J7780Q681j2232M662R198k722J2254q094k193k657J770
14842A2705o232J1614J4932j0912j4094J418L9874L0668J4415n423k6835r452
$$ y = [12853, 35156, 28195, 39545, 18269, 5051, -15593, -34037, -52433, -37756, 1300, 39461, 34743, 12647, 22412, 43481, 40631, 20632, 6750, -12813, -15621, 7720, 8310, 22700, 53300, 50581, 42731, 45552, 49095, 24599, 19055, 17772, -4768, -4526, 6559, 9764, -3653, -19875, 1298, 21197, -5692, 3980, 15987, 25598, 43966, 16851, 3361, 5117, -2464, -16118, -17624, 14677, 35484, 46713, 72365, 49436, 15059, 14478, -8855, 8505, 29741, 4442, 4990, 9526, 18580, 16398, -2987, 2641, -18391, -26998, 2426, 25995, 1426, -30425, -21649, 3170, -4106, -35627, -24885, -13742, 4038, 12719, 487, 5149, 14347, 11625, 23879, 15785, 13592, 10935, 12705, 6473, 18087, 33019, 22107, 8013, 9431, 49305, 79973, 94388, 88965, 62130, 52678]
14830E2678J2805j0810k0741o138j5695l7577j9409J6573Q301J2746J5570J961
14818A0264k7905N068P769o26j8115j5803M990N577L254J6357R18L2387J5641
14805C9776l2993K353p610k4454p920J4610k739K1786j1373J6223K3850M086j3404
14792B2191M181q064l0924l397J4173J1787j5227l1696q296K1161M4096j085k3778
14779d878o623k0563K955Q649J3219R178J3703K2781K7875K5786K128l6208j4343
14766D3659k662j0067J327J4188k0507j0642J7935R138l8060j3021j5299K920
14754b1091K9662J8487k263m9498L649J8145K3274M3173k28l3260j6323j0480
14742C247n76K335J0608m350J571p333J304J856J3421J2335N356l567L358l867
$$ y = [52678, 65483, 54673, 33932, 27794, 12099, -25478, -44887, -28314, -20013, -7267, 8303, 10264, -17641, -12573, -4804, -5430, -23545, -39348, -34358, -28781, -25527, -9170, -8252, 24135, 39776, 6783, 9136, 1526, -22928, -30848, -16238, -18977, 2809, -8564, 7659, 31509, 35595, 22191, 26372, 18308, -12616, -16013, -1840, 9947, -5280, -36976, -45272, -24111, 19985, 18900, -4878, -11501, -32064, -29109, -20460, -7241, 1937, 15640, 38421, 66296, 92082, 94210, 58002, 43659, 40997, 30930, 32257, 46445, 25938, 15296, 33231, 42369, 4309, -8712, -24011, -21091, 8571, 27058, 24795, -24703, -21054, -2909, 20365, 63538, 63310, 30050, 13727, 3247, 2671, 5006, 15614, 11264, 12835, 5502, 6806, 8662, 22083, 34418, 39774, 36207, 39565, 35698]
14728C5698n00k8637m2029j431L0450K7477L4201r984k3364J5879q127o59J573
14715C0547n928K4100n982k5709j7398N71j0285J0406J29k2110J6347l947j1674
14702b0933O09J2488r4M6487K5436k047k9570mj8388l4914J0236K7625Q170k3977
14688A124j4895j0054m029K253J9736R760k743j7813k658R519k6127k624K3605
14675a4946Q739J956L534J8829J4403J1872k1114j3195m452j3669k2977j1241
14663d2261J2516K9022K9127j205j7722j6612J8644J4306j7622N251J1198K387
14651B7029q637K2333J9051j0633J9510R459J2194j8605l6636M679P366j1684
14639C5426j2215K476J9629j2583k4163p373K875M8607J5917l154j1058l3094
$$ y = [35698, 35198, 6561, -35468, -36899, -6449, 21028, 55229, 45245, 21881, 37760, 29633, 28974, 30547, 24619, 48719, 42737, 17028, -370, 201, -10084, 322, 451, -21659, -5312, -9259, -20933, -20324, -7836, -7930, 38557, 63993, 61946, 32376, 32372, 13984, -20930, -10694, 16931, 25101, 1124, -13771, -23825, -27854, -25601, -5865, 3895, 1152, -16661, -19319, -9800, -35927, -38551, -14946, -6207, -4251, -717, 18112, 32515, 44387, 23273, 10078, 5626, -8043, -31020, -42261, -29745, -723, 28404, 27199, 9477, -7135, 11509, 25815, 8193, 13444, 24642, 27029, 18392, 40725, 59776, 49143, 68653, 78112, 90306, 71701, 35065, 39744, 47110, 35426, 23211, 25687, 45316, 32733, 8570, 1197, 4072, 52679, 68596, 65442, 54384, 21290]
14627B1290k8554J2515K1165j4468O87j0950K6673M0842J5140J5756q661J1480
14615A02915p13l0040j7492L42j3859L836N458m056p090J9903J4017o797k9071
14602C7353K4628L27k781J562j8037n754J7532J8788J2062L4925L3027M560k4171
14589A34021k0169k098R307J2825J6187J4623k9375k3630p020J218Q002l4680
14577G9211l7834o119j354k4726j296k4286l658P572K3090L1786K9899j2024k0931
14564C9330M726j3235l3163m676J9689J5783M202J1769N57O715J1977l651r520
14551E0503J4877j5926j9188j1788l866j777J6264K0204m705Q531N718n325j5521
14538C8001j8555J51l032j6884J9620K18j6412k1275N81q631K619J1126k956J4388
$$ y = [21290, -7264, 5251, 26416, 11948, 12635, 1685, 28358, 69200, 84340, 100096, 91435, 102915, 102202, 72162, 54670, 55012, 41153, 44989, 50447, 46391, 39301, 59204, 73221, 66424, 37353, 61981, 62308, 59527, 61089, 43052, 37298, 54830, 73618, 85680, 120605, 153632, 158192, 134021, 113852, 111754, 121061, 133886, 150073, 164696, 135321, 111691, 104671, 105889, 113891, 79211, 41377, 35258, 33904, 9178, 7882, -16404, -20062, -12490, 10600, 42386, 72285, 60261, 39330, 44056, 30821, -2342, -7018, 12671, 28454, 32656, 44425, 44982, 51697, 63674, 60023, 50503, 65380, 49454, 30266, 18478, 14612, 12835, 29099, 49303, 44598, 53129, 58847, 53522, 38001, 19446, 19597, 16565, -319, 19301, 19519, 3107, -18168, -17587, -26218, -23599, -12473, -15429, -1041]
14524a041J9396P466n01k4676J0885J4948J052r646j7281J2335j0399J772O091
14511A0401j4149j9553j8813o289L1810M6126J2159k2193p890L3588L5617n246
14499G5568j4138r90N893L684k3914m7662Q019P811q108P350K7487O598l6338
14486A1260j7619J0948q8K1877q969p767J9306P906J0034l5836j2743J7245j0442
14473E112m751R754j856K4218O843p159J961p762J4405R930o83l604j6856m039
14459B5513j6783l916J131J4794q592O350J7824j7522j0209m35N900M995K417
14446B1467M844K4643k151k6314j4601O825q970k524K101K841J3612J2359K4458
14433E8590M5347p53j8102k2624k1021N019j5801L190K6846j9499r03L722l956
$$ y = [-1041, 18355, 25821, 25320, 644, 11529, 26477, 27529, 17883, 602, 12937, 2538, 4310, 10401, -3748, -23301, -42114, -48403, -16593, 29533, 41692, 19499, 11609, 45197, 80814, 75568, 61430, 60440, 66333, 70017, 46103, -1559, 6460, 14271, 6163, 13513, 41000, 47598, 11260, -6359, 4589, 4501, 26378, 17409, 9642, 28948, 36854, 46888, 11052, -1691, 15554, 5112, 361, 10115, 8259, 32477, 39320, 32161, 34122, 26360, 40765, 50695, 50012, 46408, 29552, 25513, 8730, 4814, 5945, 20739, 12147, 18497, 36321, 18799, 8590, 8155, 14055, 19050, 21467, 26311, 50954, 48803, 22489, 7888, 14713, 5743, 3219, 5320, 8161, 21773, 34132, 58590, 103937, 103184, 85082, 62458, 41437, 46456, 30655, 33845, 60691, 41192, 40289, 44011, 40055]
14420D0055l754j0262o121J4362Q991j0221j4174J9257k743J1671L768l396P324
14407E4757j4235j5752L857j0320P23J7297M64k0894k3285O729J5195K375P942
14394B4853N645K5074L2671R147k7208j6975Q054j5825J4611k8798n789Q704n429
14381B8735j4733R481n489o776j0871M416K5109N954q181J849J2667N484l1439
14368A6206J1962P493j0514J1816m63p73k104k1971j2818m309l276J2524L8711
14355D2484j1467j8965K492j4581O577K7501k0791j2572j221p821o96K3637p981
14342F596m660J6700J4341M581K4558J4614k1440l1628q638l174l628p46K271
14329I747k278%N514K265O710q04J5897J5610J2404j9502q786l094K7670J9339
$$ y = [40055, 36301, 26039, 19918, 34280, 43271, 33050, 18876, 38133, 35390, 47061, 50829, 47433, 54757, 40522, 24770, 28627, 18307, 19030, 36327, 36791, 15897, -7388, -659, 14536, 16911, 24853, 30498, 55572, 88243, 97390, 70182, 53207, 61261, 45436, 60047, 31249, 25460, 34164, 28735, 14002, 23483, 17994, 11218, 347, 4763, 29872, 35826, 27645, 29494, 42161, 47645, 16206, 28168, 35661, 25147, 36963, 36500, 35727, 33623, 11652, -1166, -5475, -8751, 3773, 42484, 31017, 12052, 14544, -37, 6540, 34041, 13250, 678, -543, -8364, -9060, 14577, 6596, 1936, 18636, 32977, 37558, 62116, 76730, 55290, 23662, 15024, 11850, 8222, 7476, 9747, 7469, 7469, 12983, 15248, 21958, 21154, 37051, 52661, 65065, 45563, 36777, 33683, 61353, 80692]
14315H0692k542j6740n7305k2869L1770n162k0751k3174K4568K9920K3712j9841
14303B2278q453O263k757J7141K4257j0565l2090p288P294K3635r17o133k6918
14290E747j0823l1698J7269M5419L3576L1748j7408k1465J1166k1014J3449J145
14278E7111j7400K8128J2661j7233j6749j8985J3139O430K2765j5208k6820m154
14266B3685j1971k1257j2562j6464M106l909J2968K7713L782L177j2382R547L278
14253I711k3576Q465M8535Q355j1204J1588l180K452K4501j735k0224k812J7529
14240F8405l919l0668j1629n799K2016l365N494J3389l4032k0726j2548k3786
14228c7168M118K186L2843M1303K5222k2903l0888N482P998j7627j2361l052k563
$$ y = [80692, 78150, 61410, 4105, -18764, 13006, 7844, -12907, -36081, -11513, 18407, 42119, 22278, 13825, 20088, 17331, 34472, 58729, 48164, 16074, 8786, 16080, 39715, 38798, 32665, 5747, -5076, -36774, -19505, 25914, 59490, 91238, 73830, 52365, 63531, 42517, 55966, 57111, 39711, 67839, 80500, 63267, 46518, 27533, 40672, 47102, 69867, 54659, 27839, 23685, 11714, -9543, -22105, -38569, -34463, -38372, -25404, 2309, 6091, 9268, -3114, 6433, 9711, -13865, -5400, 43135, 51490, 40286, 51874, 48694, 51146, 75647, 73912, 53688, 50876, 68405, 64486, 33818, 22189, 16390, 38406, 35041, 40535, 53924, 19892, -834, -13382, -37168, -33050, -30864, 1979, 43282, 68504, 45601, 14713, 20195, 28193, 10566, -1795, -4847, -7410]
14215g410J7471R214N147M198p723J2382K4048J4749k9715l4606j3693J4223J2333
14202B0618K8851J0707J54M777J041J0058j11k4388J1305K0546K877k2554k517
14189F1364K839k6886r978J4437J0754n900k909J1415l663q769k1954j0538j3382
14176c170K1495P636J4228J9903N213k6348p856p966o753M8156j1751k6573P503
14163C3717O525Q64N658k5476l141K2348j391j6859j917N897J3590K0161K0742
14150H0718p699j5573j9920j6119K5056Q131l7252j5459p821N502J4999J5701
14138C0264N533J2956r325j0261p925j1695R162J2577j4385J7369K8996Q434j6451
14125E5249q36Q689n904j0170l27J4760j13j0308O990j4851n819j456K1793o307
$$ y = [-7410, 10061, 19275, 24422, 28620, 20897, 33279, 57327, 72076, 42361, 7755, -5938, 8285, 20618, 49469, 60176, 60330, 65107, 66148, 76206, 76095, 51707, 63012, 83558, 86435, 63881, 61364, 64203, 37317, 27339, 41776, 52530, 46630, 43721, 55136, 51473, 42704, 20750, 10212, -3170, 18325, 25961, 40189, 60092, 65305, 38957, 31101, 23135, 16382, 64538, 52787, 26214, 33717, 40242, 41106, 46764, 21288, 18147, 40495, 39104, 22245, 20328, 26225, 39815, 59976, 80718, 73019, 57446, 37526, 21407, 46463, 54594, 17342, 1883, -5938, -436, 14563, 30264, 35797, 48753, 39428, 29167, 21242, 9547, 18709, 31286, 16901, 34270, 63266, 71700, 55249, 54413, 63102, 57198, 47028, 46701, 61461, 61348, 51040, 58030, 43179, 37360, 35904, 57697, 51390]
14111E1390q88R383j5816m018R62J315J0995Q932k111k0768K736o559K521K2556
14097F0630K269J1087q903k6158k5731K839q06Q124L2486J1365l849k3031J422
14084D1744J9372K7384k7878j5271L5487J790k0234l0140j5717K5117K3628P708
14072G2990l274M037R985j6580j1708r307j2333l4128l5490M689L8301M3769J3399
14059F4350q158n457Q113o266k4563j760M150J1580m48L027J7547Q307J7568r641
14045G8349Q191k106M408j3332j2320m267j4181p825M60K5924N030M681q368k4018
14031D0626j5149k1648J604J1114K8779K4149J4477j4391l2811m1412R019M5492
14019D9849q69J0217J3745k7216l2609M699L9616K5170l0203l1114K75m326M0423
$$ y = [51390, 50502, 59885, 44069, 40051, 41013, 42328, 53323, 62255, 60144, 39376, 42112, 35553, 38074, 60630, 62899, 73986, 65083, 38925, 13194, 16033, 15227, 23351, 55837, 67202, 63353, 40322, 41744, 61116, 88500, 60622, 45351, 80838, 82628, 62394, 32254, 16537, 41654, 65282, 72990, 69716, 73753, 83738, 67158, 55450, 46143, 33810, -318, -35808, -31119, 7182, 50951, 64350, 56192, 50735, 58848, 52582, 28019, 26259, 30409, 41989, 41541, 44568, 62115, 70422, 87990, 78349, 86540, 84434, 88842, 75510, 63190, 58923, 44742, 36917, 37377, 63301, 68331, 73012, 64644, 40626, 25477, 3829, 5433, 16547, 45326, 69475, 83952, 69561, 36750, -4662, 4357, 49849, 48980, 59197, 72942, 45726, 13117, 17816, 57432, 82602, 52399, 21285, 21560, 17234, 57657]
14006E7657q107L94J2804J2555p403K01o357m612k740K8294R514o270J6066j313
13992A00683j4767K5107N300l4238j1725q512P811K2510k0035l0975M377K836
13980D8372K6773J3032j3857k333Q102j1916m340M070K498j0785J3111J5960j3810
13967G4877j5863m483Q140q109J3203P611j2208l272K1006P614k902j6112j0167
13954E9335l47j413L246K1927J0987J1004q523l522N864R542j0951r709n507j4712
13940F7221l0589J6063J2021R583J2313j8786J1407m528M8295k3267l7867P31
13928F2597K0204K1940M024P657J0956j7971n16k450j4209o704j962q964k4202
13915E0400j4108j2042m539o745L3117K469j7474K5676K7209j5664J6240j5119
$$ y = [57657, 49550, 49944, 62748, 75303, 67900, 68101, 61744, 57132, 54392, 82686, 92200, 85930, 101996, 100683, 85916, 111023, 116323, 82085, 70360, 61848, 69659, 92169, 72134, 41159, 45536, 48372, 75145, 88177, 74320, 71987, 80089, 68173, 63833, 67903, 70401, 59616, 72727, 88687, 74877, 59014, 54531, 62671, 54562, 67765, 75376, 63168, 59896, 80902, 88516, 85614, 69502, 59335, 58988, 57575, 60821, 82748, 93735, 104739, 96216, 92694, 98558, 108100, 97149, 87440, 81933, 67221, 36632, 52695, 64716, 74299, 86612, 67826, 79233, 74705, 123000, 99733, 61866, 62597, 82801, 104741, 108765, 116422, 127378, 109407, 108891, 106441, 92232, 85528, 83566, 74602, 50400, 36292, 24250, 19711, 12966, 46083, 48552, 31078, 56754, 83963, 68299, 84539, 69420]
13903F9420J1427K1124n591O602J18j6932j4741k1031m850Q400O750M07J8473
13890G9576j0001q763O147k319P439J7963J1959k1962p199j2145n105j2779l1706
13877A1105j8960L7513M8144r245l1175j1760J1957M666J7419O726j0595q968
13865D6827K2592n762K2792J1199k5087k5865Q048M5631m032j5750J6883L4968
13853A32444j431j2287k491p376j0310j6001p571o419j4896O331K2741J6046J3853
13840A12633k0729m0070j8755J7250k9837m718K2047J5140J843j5084J8814l885
13828E4649o06K8543P238r444L5408j0223k0624l9043k5471q525M0278J6783k9321
13815C9642J7594K6521l14j4R500j7775m1462j6640K8074J5911n156L1470J5445
$$ y = [69420, 80847, 101971, 96380, 102982, 103100, 86168, 71427, 50396, 45546, 53946, 60696, 61103, 79576, 69575, 60812, 66959, 64640, 72079, 90042, 102001, 80039, 72840, 60695, 55590, 42811, 11105, -7855, 29658, 77802, 68557, 37382, 25622, 37579, 42245, 59664, 66390, 55795, 46827, 69419, 63657, 86449, 97648, 72561, 46696, 54744, 100375, 96343, 80593, 97476, 132444, 131013, 118726, 116235, 108859, 98549, 82548, 74977, 68558, 53662, 59993, 82734, 98780, 112633, 91904, 51834, 33079, 50329, 20492, 15774, 37821, 52961, 54804, 39720, 58534, 54649, 54043, 82586, 89824, 80380, 115788, 105565, 84941, 45898, 20427, 11902, 52180, 68963, 39642, 57236, 83757, 83443, 83429, 92929, 75154, 33692, 17052, 45126, 61037, 55881, 87351, 102796]
13802A02796l4157O837j6861K7726K9281J6767j045j0078l7358k8081K279Q20
13790E8926K6033K8798N74k2149j1706l0925J4207J4797J1754J4760n11K8302
13778A32860j3915k0078j017j4827K0011J4526j1293J1264K8587P708J880L0487
13766A86193j2360m0746k9728J4506P96J2623j4729l9967m276L282R459K514k2277
13753F5290j3523P293J3761R888P624j2901r262q161M510J9388M9043K6638r910
13740A49678J3274k1340l0442M430P821N982R338L044O608j7256k6914j5864K6793
13727A15152K0166j0551r863Q157R244J3491J5700K0270J9415k8807k6796J6315
13715A61893J2269m890J7375O0420Q3389P7972Q4238M4709L4669k873j1716k9635
$$ y = [102796, 68639, 75476, 58615, 86341, 115622, 132389, 131344, 121266, 83908, 55827, 58106, 58926, 84959, 113757, 114331, 92182, 80476, 49551, 63758, 78555, 90309, 105069, 104558, 132860, 118945, 98867, 97850, 83023, 103034, 117560, 106267, 117531, 146118, 153826, 155706, 186193, 173833, 133087, 103359, 117865, 118661, 131284, 116555, 76588, 72312, 75594, 85053, 87567, 65290, 51767, 59060, 72821, 82709, 90333, 77432, 68170, 60009, 64519, 83907, 132950, 159588, 149678, 162952, 141612, 111170, 115600, 123421, 129403, 138741, 141785, 148393, 131137, 104223, 88359, 115152, 135318, 124767, 114904, 123061, 132305, 145796, 161496, 181766, 201181, 172374, 145578, 161893, 174162, 169272, 186647, 247067, 330456, 408428, 492666, 537375, 572044, 569171, 557455, 527820]
13703E27820m3710k7454l0862l7140j8900o762M09l6341n0378l5902k8129j06
13691B12545K7811K4762j7345m4115j7964M4490L7278N5160N7093N5653P9846
13680E15214O0725M7066K4513K7043K4222L1007L7236J1021N7714J03998J66445
13669A106204K24426K08799J64480J47737R6121K8366o5062r4149j63414k03798
13659A449710k05919j73137j25520j10821j13248q1501o1579m2186j8796j8774
13649D98229j4618M571K937J8092L0518L2220N8434R2255J24886K03592K81800
13638A332916K78241K06644J48662Q5858N4481J0964q4618j42128j16615k2989
13628A751416J3397Q7099P0270O3652M5626K3935p3213j22724j77693k22851k38962
$$ y = [527820, 484110, 456656, 425794, 388654, 369754, 362992, 363401, 327060, 276682, 240780, 212651, 212545, 240356, 265118, 247773, 203658, 185694, 230184, 267462, 322622, 379715, 435368, 515214, 575939, 623005, 647518, 674561, 698783, 729790, 767026, 778047, 835761, 939759, 1106204, 1330630, 1539429, 1703909, 1851646, 1947767, 1976133, 1911071, 1816922, 1653508, 1449710, 1243791, 1070654, 945134, 834313, 721065, 639564, 577985, 535799, 517003, 498229, 483611, 488182, 491119, 509211, 539729, 571949, 630383, 722638, 847524, 1051116, 1332916, 1611157, 1817801, 1966463, 2052321, 2106802, 2117766, 2033148, 1891020, 1774405, 1751416, 1764813, 1851912, 1922182, 1985834, 2031460, 2055395, 1982182, 1859458, 1681765, 1458914, 1219952]
13617A219952k00370j62712j09320l8786p2512m1110k768J5225K942k1742m9855
13606E38944j8625K7714k2743j7575K6915M8313M9949R4797J59169K22949J84053
13595A293860J69881J31736R5405K9007m1117j32363j50220j73992j60784j38332
13585I23081j26852j14331r9967m5629l7751l0506k1446n809r901j0726J2419
13574D32582k6779k3248P340K6250O879K8347j966j2056q376n631j6585j1701
13562C95056l2139O092K6395n107k5934l9329J0142N227j7921L70k2216k2273
13550B78363J9259j1465k8074L373k748R329k2606K2669J8937j9675L096l296
13538B67162J9107L2350k3929j7448k9956m314J1330K410J8392n213l239N572
$$ y = [1219952, 1019582, 856870, 747550, 708764, 636252, 595142, 592374, 607599, 610541, 588799, 538944, 520319, 548033, 525290, 507715, 534630, 582943, 632892, 727689, 886858, 1109807, 1293860, 1463741, 1595477, 1690882, 1719889, 1678772, 1546409, 1396189, 1222197, 1061413, 923081, 796229, 681898, 581931, 536302, 498551, 468045, 446599, 440790, 430889, 420163, 432582, 405803, 382555, 389895, 416145, 423024, 451371, 449405, 437349, 428973, 423342, 406757, 395056, 362917, 369009, 395404, 390297, 364363, 325034, 335176, 340403, 322482, 322852, 300636, 278363, 297622, 286157, 258083, 261456, 258708, 268037, 245431, 268100, 287037, 267362, 270458, 267162, 286269, 318619, 294690, 277242, 247286, 242972, 254302, 256712, 275104, 269891, 266652, 272224]
13526B72224j519O234j6851k593J9451k153p429k3107M617l0568j6761M2479J5757
13513B59781l2934k6909r403q928j7180k087R885Q993R775O501J9886p855Q593
13500B18118L0787J3901j2519j0848l7130k0732R012J1476q200k8444L4446K1601
13488B21468K3205R868J273k2254j288M397K8808J8259j286J7740L24j1689Q516
13475B97341o763l6689Q983J871j0410J8440J8173K4817J632k3152j4172j6511
13463B63560j485K8752J8101q028J65M366m495j2239k791J3786P231J519J6260
13450C24702K068j151J0963K3379L744J6803J440k3928l2282K918L0610J2729
13438C71995J0492j7517Q401L8240K3890k4752k2753l2657n850L3148J4611j1582
$$ y = [272224, 270705, 276939, 260088, 257495, 276946, 274793, 267364, 244257, 248874, 218306, 201545, 244024, 259781, 226847, 199938, 190535, 181607, 164427, 162340, 172225, 181218, 190993, 197494, 217380, 209525, 218118, 248905, 262806, 250287, 239439, 202309, 181577, 190589, 202065, 193865, 165421, 199867, 221468, 244673, 254541, 255814, 233560, 232272, 236669, 265477, 283736, 282450, 300190, 300514, 288825, 297341, 290578, 253889, 262872, 264743, 254333, 272773, 290946, 315763, 317395, 294243, 280071, 263560, 262075, 290827, 308928, 300900, 301065, 305431, 300936, 288697, 285906, 299692, 306923, 308442, 324702, 326770, 325619, 336582, 359961, 363705, 380508, 381948, 358020, 325738, 328656, 359266, 371995, 382487, 364970, 373371, 411611, 435501, 410749, 387996, 355339, 349489, 382637, 397248, 385666]
13426C85666l458K1482M1330J4928j2287M703l402K7806j2089k4838l175J2223
13414D48889N427O471l451O891J9912j0261j9737P313J1789J6796J6301L5782
13402E42122O16L0800L8145L1915M0417M9218L6820L2743M6084L4720Q5009J06617
13390A075226J62943J93245K50927K69966K37491J42917N3437K1719l7487j36124
13380B234260j91783j63778q3247j6512J02003J81348K15831K53426K22658J65287
13370B919493O5217j4375r4526j61183j41208r0425L1033J98064L84032M40397
13360C536519M23563L49100L02273J90087K6094j86286k71398l42194l57991k25751
13350C444016k5091J68134L35727M44046N10342M56947L89833K59849J61640M0444
$$ y = [385666, 382208, 403690, 445020, 459948, 447661, 452364, 448962, 476768, 464679, 439841, 436666, 448889, 454316, 460787, 457336, 464227, 484139, 473878, 454141, 461454, 473243, 490039, 506340, 542122, 542738, 573538, 611683, 643598, 684015, 733233, 770053, 802796, 848880, 883600, 968609, 1075226, 1238169, 1431414, 1682341, 1952307, 2189798, 2332715, 2386152, 2407871, 2370384, 2234260, 2042477, 1878699, 1795452, 1778940, 1880943, 2062291, 2278122, 2531548, 2754206, 2919493, 2984710, 2970335, 2875809, 2714626, 2573418, 2482993, 2514026, 2712090, 3096122, 3536519, 3960082, 4309182, 4611455, 4801542, 4827636, 4641350, 4369952, 4027758, 3669767, 3444016, 3418925, 3587059, 3922786, 4366832, 4877174, 5334121, 5723954, 5983803, 6145443, 6185887]
13340F185887j38162l27305l54028k78985k27395j53269m8563l7490k2694L8836
13330D636832R0442J26584J53186O4195L623o1947q6401n0544j0345M1996N6809
13319D964430O1460J60530K64731L84617M20472L10340J35512r4068k41557k97262
13309F069205l61399m84030n78610m89686k87987p0779J57110L24064M42750M42491
13299E163129L01674J03784l0536j48061k57271m67870o01933m74728l08485j24090
13289C155613O2762J59872J74068P7511n511p7688q9807j54318k51658k84541
13279B766303j99907p9673p468R0776J77948K22718J73902N8087m6240q1943j22453
13268B952050k05594l54782l45301k67541k08004j36746p2633q2006o8045o2882
$$ y = [6185887, 6047725, 5720420, 5366392, 5087407, 4860012, 4706743, 4658180, 4620690, 4597996, 4636832, 4727274, 4853858, 5007044, 5071239, 5074862, 5012915, 4926514, 4875970, 4865625, 4907621, 4964430, 5025890, 5186420, 5451151, 5835768, 6256240, 6566580, 6702092, 6608024, 6366467, 6069205, 5707806, 5223776, 4645166, 4155480, 3867493, 3796714, 3953824, 4277888, 4720638, 5163129, 5464803, 5568587, 5538051, 5389990, 5132719, 4664849, 4062916, 3588188, 3279703, 3155613, 3218375, 3378247, 3552315, 3629826, 3624315, 3546627, 3456820, 3302502, 3050844, 2766303, 2566396, 2486723, 2479255, 2570031, 2747979, 2970697, 3144599, 3202686, 3156446, 3074503, 2952050, 2746456, 2391674, 2046373, 1778832, 1570828, 1434082, 1361449, 1279443, 1211398, 1148516]
13258A148516n6689m5985j7682m0975m1118m3817n0912j6691k2091j0386j1530
13247G90640k9213q775J4581j3836k5886j9528j7302l5074M777M8511P752l8908
13235F77739k2439j4485K920K2725l393j4516j7829j6907j4493j6316j6767j7586
13223E48653O473J4962j2245j4243k4645k6270J7554J37Q364j1677O79O693o666
13210E07769n710J4588J1153L552k3070j1408k5108P612J7449k1970l8650R625
13198D45832J7413J2035l6947m525J4732K035k0139K8672J3680k2043m395K788
13186D49138j3661J0323J4550k759q82j607J0114n278K4355j2711K118L3556j7797
13173D89459l2051J0774j1562J7438m300j2579p290K2606J8155j0717J4364P565
$$ y = [1148516, 1091827, 1045842, 1028160, 987185, 946067, 902250, 851338, 834647, 812556, 802170, 790640, 761427, 752652, 767233, 753397, 727511, 707983, 690681, 655607, 660384, 708895, 716647, 677739, 655300, 640815, 643735, 666460, 663067, 648551, 630722, 613815, 599322, 583006, 566239, 548653, 555126, 570088, 557843, 543600, 518955, 492685, 510239, 510376, 518740, 507063, 507742, 514435, 507769, 502059, 516647, 527800, 531352, 508282, 496874, 471766, 479378, 496827, 474857, 436207, 445832, 463245, 475280, 438333, 433808, 448540, 450575, 430436, 459108, 472788, 450745, 446350, 449138, 435477, 445800, 460350, 457591, 456709, 455102, 465216, 459938, 484293, 471582, 473700, 507256, 489459, 457408, 468182, 456620, 474058, 469758, 457179, 449889, 472495, 490650, 479933, 494297, 501862]
13161E01862J2349k6084j1084N158n088J6604J5602n64p737k5198k8894l288K5217
13148D68855P583K7711r14j2738j0713q71j285j402J7581J4933K0888J384k3946
13135E07066M924j131J4665j7976j3285j1098q981K715J210M0105P4885N4315
13123F47414L8922M6589M6038K2452M5168R0684J07556R1462J08942J09231J28056
13112A482514J30764J54021J66838K27769L07949M34078O42603R92826J544569
13103F083931K100176K427024K594023K593860K510915K426928J673297O35300
13095B3045454n1443j134922j955461k259475k359180k177996k358672k380740
13087H367565j701733r85877n83190l57710k58582j37575k1994Q9192J70774K95211
$$ y = [501862, 514211, 488127, 477043, 482201, 477113, 493717, 509319, 508755, 501018, 475820, 446926, 443638, 468855, 476438, 504149, 503235, 490497, 479784, 478913, 477628, 476226, 493807, 508740, 529628, 531012, 507066, 511990, 510859, 525524, 507548, 494263, 483165, 474184, 476899, 478109, 518214, 593099, 647414, 686336, 732925, 778963, 801415, 846583, 937267, 1044823, 1136285, 1245227, 1354458, 1482514, 1613278, 1767299, 1934137, 2161906, 2469855, 2903933, 3546536, 4539362, 6083931, 8184107, 10611131, 13205154, 15799014, 18309929, 20736857, 22410154, 23045454, 22994011, 21859089, 19903628, 17644153, 15284973, 13106977, 10748305, 8367565, 6665832, 5679955, 5096765, 4739055, 4480473, 4342898, 4320904, 4410096, 4580870, 4876081]
13077D876081N09097Q29572J258409J702460J974295K010135J687823J210676
13069A6058548O45942j22416q47619j610154k179138k094042j791506j442875
13061F616740j011372o43769l78656k48531j25329j07558j24568o7543P6513K20035
13051D205962L08633L09118J32339l7501j35370j78945j54592l66533n31927l58964
13041C192220o6473J11387J08807p983o9144o0779l0851q2397l06826l50301k41113
13030B196547j42940r2560p8950m8805o1091o2942m6116k986J3394M1826L9309
13019A754686L3248P2333N1016K6284J4028J6518l6745o1578m4920k1266k0720
13008A782884l8732m5925n0643l2916K992j8085n1781k4048n576J7313N4130R0121
$$ y = [4876081, 5385178, 6214750, 7473159, 9175619, 11149914, 13160049, 14847872, 16058548, 16704490, 16582074, 15734455, 14124301, 11945163, 9851121, 8059615, 6616740, 5605368, 4961599, 4582943, 4334412, 4209083, 4101525, 3976957, 3909414, 3985927, 4205962, 4514595, 4823713, 4956052, 4918551, 4783181, 4604236, 4449644, 4083111, 3551184, 3192220, 3125747, 3237134, 3345941, 3337958, 3268814, 3208035, 3177184, 3094787, 2787961, 2437660, 2196547, 2053607, 1961047, 1882097, 1833292, 1772201, 1709259, 1663143, 1660157, 1673551, 1715377, 1754686, 1787934, 1860267, 1911283, 1937567, 1951595, 1968113, 1931368, 1869790, 1824870, 1803604, 1782884, 1744152, 1698227, 1647584, 1614668, 1617660, 1599575, 1547794, 1523746, 1518170, 1535483, 1589613, 1679734]
12996A679734L1502j3739K7118k5292l4038R450J7968K7134Q1068J12484K7300
12985A940689j3165M45M6969Q7565l3300m9721L8704J74529L24318M68270O62511
12974C647814Q00861Q32429R08135J062353J108479Q40395M31333R8488J3021
12965I743308j06155m62116q82196j011113q64328o44803n94156o42617o01755
12956C934069m66105l08855k00925k36334k50999k19686j60891j08814j12995
12947A868465m4982l8526l2942m7199k6983l1103j4580m6488m0979r498m5406
12936A489779m7508Q943J9875R763K3790O325k8898J1960k6606n5162o404K9819
12924A435676K0086K7857K3098J7833J3176L481o835J4556J6696M710M6942Q6479
$$ y = [1679734, 1711236, 1697497, 1724615, 1699323, 1665285, 1674735, 1692703, 1719837, 1800905, 1913389, 1940689, 1927524, 1927969, 1974938, 2062503, 2029203, 1979482, 2018186, 2192715, 2517033, 2985303, 3647814, 4448675, 5281104, 6189239, 7251592, 8360071, 9200466, 9631799, 9730287, 9743308, 9637153, 9175037, 8292841, 7281728, 6417400, 5772597, 5178441, 4535824, 3934069, 3467964, 3159109, 2958184, 2721850, 2470851, 2251165, 2090274, 1981460, 1868465, 1823483, 1784957, 1752015, 1704816, 1677833, 1646730, 1632150, 1585662, 1544683, 1535185, 1489779, 1442271, 1451214, 1471089, 1480852, 1504642, 1510967, 1482069, 1494029, 1467423, 1412261, 1405857, 1435676, 1455762, 1483619, 1506717, 1524550, 1537726, 1541207, 1534372, 1548928, 1565624, 1570334, 1617276, 1703755]
12912A703755J09135R3907J21487R1845K1747M0094L3269L9739j7633j62387j35137
12901A939821r1591o2849p6704o9200l2509J9848O2224R9602J24833J59635J44617
12890B217727J03728J32284J04681P7236j0726j22718j21582j25410j12813j65048
12880A977359j67162p2817k5597j0173M3632N2553R8092J06811J00267Q8696O0975
12869B252636O5058L4837J4085o7398n9301k586K2936O8981J42316J90071J88788
12858B850423J43174J11117J43753R3045j01722k31505k24240k03779k09195k02608
12848B168463j90779j44177r8330m5002K8657P9848M8666M3021P6611P1206O7796
12837B105980M5481n3240m4115k2648m3336j0596J4335o600k958J0599K7648j0684
$$ y = [1703755, 1812890, 1906797, 2028284, 2120129, 2141876, 2181970, 2215239, 2254978, 2237345, 2074958, 1939821, 1848230, 1785381, 1708677, 1639477, 1606968, 1626816, 1689040, 1788642, 1913475, 2073110, 2217727, 2321455, 2453739, 2558420, 2635656, 2624930, 2502212, 2380630, 2255220, 2142407, 1977359, 1810197, 1737380, 1711783, 1701610, 1745242, 1797795, 1895887, 2002698, 2102965, 2191661, 2252636, 2317694, 2352531, 2366616, 2299218, 2239917, 2237331, 2260267, 2329248, 2471564, 2661635, 2850423, 2993597, 3104714, 3248467, 3341512, 3239790, 3008285, 2784045, 2580266, 2371071, 2168463, 1977684, 1833507, 1735177, 1690175, 1718832, 1798680, 1847346, 1890367, 1966978, 2038184, 2105980, 2151461, 2098221, 2054106, 2031458, 1988122, 1977526, 1991861, 1985261, 1982303, 1992902, 2020550, 2009866]
12825B009866j6791Q161j6783r3481r5032l2977q906o3532q0551k7341j111J8217
12813A599739K5210N0909M0259M5758R8281J13477J20723R7382O1315M7724K0379
12802B321156Q507l0810j61479j35388m2396o223L6067K6399q562m1009j3124
12791A953138p9062j17883j01935j01514m5290J5489J7494r547K5470M4981M6558
12780A647899P1248R7142J62396Q3712l1560l5650K3203Q2803m3601k19674j36962
12769A700956m1681l9559j8229j6013K3156P2599J63582J97629K02751J40319
12759B385510J00682J06736P5290M6160k0294j29998j41726j00698n3678p291
12749B260693j1705q8936j4987O5915J60586L14908L67879K80850J32789K1495
$$ y = [2009866, 1993075, 2001236, 1984453, 1890972, 1795940, 1762963, 1754057, 1690525, 1609974, 1582633, 1581522, 1599739, 1624949, 1675858, 1716117, 1761875, 1860156, 1973633, 2094356, 2191738, 2253053, 2300777, 2321156, 2329663, 2298853, 2137374, 2001986, 1959590, 1953367, 1989434, 2015833, 2007271, 1966262, 1953138, 1874076, 1756193, 1654258, 1552744, 1507454, 1522943, 1540437, 1530890, 1556360, 1601341, 1647899, 1719147, 1816289, 1978685, 2062397, 2030837, 1995187, 2018390, 2101193, 2057592, 1837918, 1700956, 1659275, 1619716, 1601487, 1585474, 1608630, 1681229, 1844811, 2042440, 2245191, 2385510, 2486192, 2592928, 2668218, 2714378, 2694084, 2564086, 2422360, 2321662, 2267984, 2260693, 2248988, 2160052, 2145065, 2210980, 2371566, 2686474, 3054353, 3335203, 3467992, 3489487]
12739C489487M196L0955j29728l99353m04663k06007p0370r0255j20540m9182
12729B054540K1261N5035N0844O868j6327k7000J2698o32K1343p062r246K3198
12717B185520O0786P0315J21741J70246J58600J14126O6815N1030L2241j0279
12707C021141j22960j21178n5108n5604m4161J5668M2445K2621K6075M7242M3413
12696B819594J2731J3562M6677M9201M3819M1976M2604M2264o30k1272N035J8405
12684C113966K5566Q48J9499Q4632N0598Q665p580N0605N9087K7327J6170N0966
12672C500349R3802J35038J76951K15220K47816K58412K76959K39229K16666K48504
12662E608946L00694K53273K53991L83873O06585Q93338J285767K034268K973637
$$ y = [3489487, 3493683, 3524638, 3394910, 2995557, 2590894, 2384887, 2314517, 2224262, 2103722, 2054540, 2075801, 2130836, 2181680, 2188548, 2172221, 2145221, 2157919, 2157287, 2178630, 2171568, 2162322, 2185520, 2246306, 2316621, 2438362, 2608608, 2767208, 2881334, 2948149, 2999179, 3031420, 3021141, 2898181, 2777003, 2721895, 2666291, 2622130, 2637798, 2680243, 2702864, 2728939, 2776181, 2819594, 2832325, 2845887, 2892564, 2941765, 2985584, 3027560, 3070164, 3112428, 3111798, 3090526, 3095561, 3113966, 3139532, 3140380, 3159879, 3244511, 3295109, 3303774, 3296194, 3346799, 3405886, 3433213, 3449383, 3500349, 3594151, 3729189, 3906140, 4121360, 4369176, 4627588, 4904547, 5143776, 5360442, 5608946, 5909640, 6162913, 6416904, 6800777, 7407362, 8300700, 9586467, 11620735, 14594372]
12653A4594372L785654L691914K850063K289120K352005L054390K928301P03182
12645C6249001j292041j519605j099819o18908j206217l050918l395705j965305
12637B2100483l40686J180024K744911M307240N240257N295436N643956O672295
12629E2843916P278540O343810L843761J515284J353393J378726j14745k24902
12621G4217783q81770m210787n868226m351263k408690l843139o949929o084764
12613C9619215l090622o95859J139715L297099O175724R263213J0811209J0547769
12605G7067463J0569956J1747902J2472601R877994K549972l223254k473490j108039
12597A17481105l637480o330053n582525p22293N520966J2848746K4056281M0622049
$$ y = [14594372, 18380026, 22071940, 24922003, 27211123, 29563128, 32617518, 35545819, 36249001, 34956960, 33437355, 32337536, 31718628, 30512411, 27461493, 24065788, 22100483, 21759797, 22939821, 25684732, 29991972, 35232229, 40527665, 46171621, 52843916, 60122456, 66466266, 70310027, 71825311, 73178704, 74557430, 74442685, 74217783, 73336013, 69125226, 63257000, 58905737, 56497047, 52653908, 45703979, 39619215, 36528593, 35832734, 36972449, 40269548, 46445272, 55708485, 66519694, 77067463, 87637419, 99385321, 111857922, 121735916, 124285888, 121062634, 118589144, 117481105, 113843625, 107513572, 101931047, 101208754, 106729720, 119578466, 143634747, 184256796]
12589A84256796N9762350P8390117Q2967832N5324573K2926208K776054j3386485
12582D73017445j3363286m7968663r8122058p3701901k6717369J1620410L9470541
12575B64235119M1597722K1413735M161415j462200O420100q38917m7165537o4323269
12567B24038168m0940953k1962913j4974880j1748674o921600n278640n818451
12560A16392057k736689L330795R425868J2205393J0955614R255578Q697702Q635692
12552A76162010Q839743L868034o575325j0953173q585328q664683n882910o05240
12544A47603128m401776o229721l359987N77176O166911Q596968o22168q400280
12536A39930251n338567M76360L848303J081063m428827l862454m34552J693591
$$ y = [184256796, 244019146, 322409263, 405377095, 460701668, 483627876, 486403930, 473017445, 459654159, 411685496, 313563438, 239861537, 213144168, 224764578, 264235119, 305832841, 327246576, 331407991, 329945791, 336365891, 335526974, 288361437, 224038168, 183097215, 161134302, 146159422, 134410748, 127489148, 122210508, 116392057, 113655368, 116986163, 126412031, 138617424, 149573038, 158828616, 167526318, 176162010, 185001753, 188869787, 182294462, 171341289, 162755961, 154091278, 148208368, 147603128, 143201352, 136971631, 133611644, 134188820, 140355731, 148952699, 148330531, 139930251, 134591684, 135068044, 138916347, 139997410, 135568583, 131706129, 131271577, 132965168]
12528A32965168R24099j274733J48089K207833N880860J1826859R500407J794259
12520A63972841j744791j2366K885539p064205k1654987j5219883o105595o803188
12512A08253365p688523m639966j923759k82549j598741m361222m274881l580047
12504G9903677l859211l989250m756280n746943n023104m516792m121811l257460
12496D4632826k508793k145425k016900j693322j614564j866690j647232j179157
12488B9960743r15333q54832q83732q72430p31881o55709q12989r48665q58667
12479B2426505p03100o08428m45011l93729k35581O4322M43075M54395J27042
12470B1129490j85634l29080k79538l96450j060565j349715r05167n51681k95957
$$ y = [132965168, 133889267, 132614534, 132762623, 134970456, 140851316, 152678175, 162178582, 163972841, 162228050, 162215684, 165101223, 158037018, 136382031, 121162148, 115056553, 108253365, 100564842, 95924876, 94001117, 93718568, 92119827, 87758605, 83483724, 79903677, 76044466, 72055216, 67298936, 61551993, 56528889, 52012097, 47890286, 44632826, 42124033, 39978608, 37961708, 36268386, 34653822, 32787132, 31139900, 29960743, 29045410, 28190578, 27306846, 26434416, 25702535, 25046826, 24233837, 23285172, 22426505, 21723405, 21114977, 20669966, 20276237, 20040656, 20104978, 20548053, 21002448, 21129490, 20943856, 20614776, 20335238, 19938788, 18878223, 17528508, 16623341, 16071660, 15775703]
12461A5775703j39749j3593K7976K7419Q8289L14954L83121J86037L1500J30616
12451A6812273K39453J47366j62594n9873M29205Q98474J209444J362309J489568
12442B2365625J651081K019511K568417K895005K961791K316749Q75381K462n07872
12433C7148150r23363j819322l600237m104147k873566j609463p28358j45583
12425B1344111K48094O23040R75582J360859J781599K415583L572173N335408
12417C7656449P766481J0815305J4570268J9789236K6241268L0352918K7910767
12410A75102692K0297676J3423741J0114174O333280m099902j8454051k2433719
12403A80283891j6230009r521235o398336k510572M762315J0798401J0751995
$$ y = [15775703, 15635954, 15622361, 15650337, 15677756, 15766045, 16080999, 16464120, 16650157, 16681657, 16812273, 17051726, 17199092, 17036498, 16976625, 17405830, 18304304, 19513748, 20876057, 22365625, 24016706, 26036217, 28604634, 31499639, 34461430, 36778179, 37653560, 37656022, 37148150, 36224787, 34405465, 30805228, 26701081, 23827515, 22218052, 21489694, 21344111, 21592205, 22215245, 23190827, 24551686, 26333285, 28748868, 32321041, 37656449, 45422930, 56238235, 70808503, 90597739, 116839007, 147191925, 175102692, 195400368, 208824109, 218938283, 225271563, 221171661, 202717610, 180283891, 164053882, 154532647, 148134311, 145623739, 150386054, 161184455, 171936450]
12396A71936450N151681l78459l156503n501545j2048727k1266562k3160981j8253048
12388I3322306j2939118j0640847q679271o314260m695394l864460l494481l263887
12380C9430588k929528k573526k214544j893540j637129j415138j255088j131041
12372B4381054j011799r68956q95159q39713p93036p41703o99161o14063o06573
12363A7210891n43213m94060m38939l46192k77211k71128l13443l48800l43700
12354A3834205l60940l82919m27818m82326m44761m08131l11838k42267k75622
12345A0497583k69864j93493j40208m3402J0408N0692J63677K08430J96239J02837
12335A0582899L3682J8791Q9271J24965J68096K10464J29544m6006j64849q0198
$$ y = [171936450, 177088131, 176709672, 173553169, 168051624, 156002897, 134736335, 111575354, 93322306, 80383188, 69742341, 61063070, 54748810, 50053416, 46188956, 42694475, 39430588, 36501060, 33927534, 31712990, 29819450, 28182321, 26767183, 25512095, 24381054, 23369255, 22400299, 21505140, 20665427, 19872391, 19130688, 18431527, 17817464, 17210891, 16667678, 16173618, 15734679, 15388487, 15111276, 14840148, 14526705, 14177905, 13834205, 13473265, 13090346, 12662528, 12180202, 11735441, 11327310, 11015472, 10773205, 10497583, 10227719, 10034226, 9894018, 9850616, 9861024, 9911716, 10075393, 10283823, 10480062, 10582899, 10616581, 10635372, 10724643, 10849608, 11017704, 11228168, 11357712, 11311706, 11146857, 11066659]
12325A1066659o0015m65037p55709o31442m37665l50114l04310j61939M7124J91747
12315H139299R5827l3236j33591j15993j35073m00378n17315m60322l71417k65815
12305E801986j16650p4066k2023j4175j9195o445L3355K0915J2292j1295J3059
12294E617758K9819O0161M7015R917l952L0139O0292J79206K38402K08511J82742
12283F660010K17866K26408K56496J67440Q3513J13936J58475J78134K22101L10996
12273H595375M89275Q69921J506555K204702K529389K187623J816827J818069
12265B2017736J991566J618148O255j607347j893321j635109j734060k201653
12257A6562215k449440k284799j834393j251016p52832m49850k94286j90575j52586
$$ y = [11066659, 11006644, 10541607, 9785898, 9154456, 8716791, 8366677, 8062367, 7900428, 7947552, 8139299, 8235126, 8201890, 8068299, 7952306, 7817233, 7416855, 6899540, 6439218, 6067801, 5801986, 5685336, 5611270, 5589247, 5575072, 5555877, 5549432, 5582787, 5603702, 5615994, 5604699, 5617758, 5647577, 5707738, 5754753, 5764670, 5760718, 5790857, 5851149, 6030355, 6268757, 6477268, 6660010, 6877876, 7104284, 7360780, 7528220, 7611733, 7725669, 7884144, 8062278, 8284379, 8595375, 9084650, 9954571, 11461126, 13665828, 16195217, 18382840, 20199667, 22017736, 24009302, 25627450, 25633705, 24026358, 22133037, 20497928, 18763868, 16562215, 14112775, 11827976, 9993583, 8742567, 7989735, 7539885, 7245599, 7055024, 6902438]
12248F902438j11854m7831j1541m089k9572m8383r7593j91738k24166k37149k90460
12237E608062k72547j84680j09200m3454L9520J06143J86144K60950K81842L21617
12227F194397K87110K75403K62624K26596K78137J88342K04641L47680N55043
12218H819973R73178J614671K091202K169280J789573J271724Q62287O43291L83906
12209B0619085R4292M24009J154254J499464J434207R80286M44925k20602j291656
12200B5138264k581839l366091l430284k889654j984301j195488p71206n58346
12192H361055m74333m71214m80174m51105l73316l09221k61066k24384j90366
12183E125876j74843j18240m2560m4942p2498n0474k8403l1825o2328k2802L1704
$$ y = [6902438, 6790584, 6742753, 6731212, 6727123, 6697551, 6649168, 6551575, 6359837, 6135671, 5898522, 5608062, 5335515, 5150835, 5041635, 4998181, 5037701, 5143844, 5329988, 5590938, 5872780, 6194397, 6481507, 6756910, 7019534, 7246130, 7524267, 7712609, 7917250, 8264930, 8819973, 9793151, 11407822, 13499024, 15668304, 17457877, 18729601, 19591888, 20235179, 20619085, 20713377, 21137386, 22291640, 23791104, 25225311, 26205597, 26650522, 26429920, 25138264, 22556425, 19190334, 15760050, 12870396, 10886095, 9690607, 8919401, 8361055, 7886722, 7415508, 6935334, 6484229, 6110913, 5801692, 5540626, 5316242, 5125876, 4951033, 4832793, 4790233, 4745291, 4672793, 4622319, 4593916, 4562091, 4499763, 4476961, 4508665]
12172D508665R3614J91345L09929L88517M38765L88466L37150L50390L54045L44822
12162G705708M78905Q71720J567478K675759L681668M053728L579117K666425
12154B7280508J713386P16383o57540k441987l787196l936804l551116k943557
12146A2392077j983532j141246o89834m34436k87508j60942j40094k47820k67796
12137G038869k48934k52453k57122l20447l69672l59679k83003k18607k45751
12128D483201k09896j66227j64705j54410j10537p6151l8496N3445J24534K54600
12118C995358M06360N36170N47674L82665J59322l2885j03377j40638l01753o01259
12108D847637n40764l04733j29122M0088K08930K39135P7453l7171n6413j1109
$$ y = [4508665, 4602279, 4793624, 5103553, 5492070, 5930835, 6319301, 6656451, 7006841, 7360886, 7705708, 8184613, 9056333, 10623811, 13299570, 16981238, 21034966, 24614083, 27280508, 28993894, 29710277, 29052737, 26610750, 22823554, 18886750, 15335634, 12392077, 10408545, 9267299, 8577465, 8143029, 7855521, 7694579, 7554485, 7306665, 7038869, 6789935, 6537482, 6280360, 5959913, 5590241, 5230562, 4947559, 4728952, 4483201, 4273305, 4107078, 3942373, 3787963, 3677426, 3601275, 3562779, 3616224, 3740758, 3995358, 4401718, 4937888, 5485562, 5868227, 6027549, 5994664, 5891287, 5750649, 5448896, 4847637, 4306873, 4002140, 3873018, 3913106, 4122036, 4361171, 4438624, 4401453, 4345040, 4333931]
12098D333931K1511j20329j80374l0235J27828J28700P8646L2242o5483j17021
12088D209416j80957l00820k77292j45822j01450m7159k4761j8487j2226K9233
12078C129675O0031P016L0025L8581J04417J92342J93228K19470K98988L82739
12068D656512L72689L85819M39676M90963O98251J109713J949057L233940M104987
12059A7441607L728180K242283P22859K82209R9933j461846l496129m683278l422841
12050A1452977j777167q37490l83507j77373p9278j29855k66308l26501l90793
12041G084705m20224m42434m14968l96483l24338k18229o2673L3372Q2364P4474
12031D995566K4040l4788l6700j06584j51336j79560j47675j19615n0901L5101
$$ y = [4333931, 4355442, 4235113, 4054739, 4024504, 4152332, 4281032, 4359678, 4391920, 4326437, 4209416, 4028459, 3727639, 3450347, 3304525, 3203075, 3155916, 3131155, 3112668, 3100442, 3129675, 3189706, 3196722, 3226747, 3265328, 3369745, 3562087, 3755315, 3974785, 4273773, 4656512, 5029201, 5415020, 5854696, 6345659, 7043910, 8153623, 10102680, 13336620, 17441607, 21169787, 23412070, 24134929, 24417138, 24517071, 23055225, 19559096, 14875818, 11452977, 9675810, 8838320, 8454813, 8277440, 8198162, 8068307, 7801999, 7475498, 7084705, 6664481, 6222047, 5807079, 5410596, 5086258, 4868029, 4805356, 4838728, 4921092, 4995566, 5019606, 4984818, 4948118, 4841534, 4690198, 4510638, 4362963, 4243348, 4192447, 4227548]
12021D227548K8549P0964J44255K03659K73317L24955M28402N77945Q07625J101426
12011H188645J197012R14437M64378J21395N8525o5406k22887m18346o1224R31478
12001A1108007J474131J118145M65209O0974J08199p1804j186400k103218j612553
11992I360690n59643K31434R22734J893107L411443N058526N678550M519535K308784
11983C2825160O48517K70456n02577l081945n831045o205064m093821k372797
11975A1656884j488191j028966p85677o40302n63600m94570m44276l68708l01759
11966E540835k92256j96044j48267m1187J7565K0646J0396k6174p4096n9284j26970
11955D625164j88353k08116k29294j87815j42093o4449M0123N0967J15286J84636
$$ y = [4227548, 4256097, 4327061, 4471316, 4674975, 4948292, 5273247, 5701649, 6279594, 7087219, 8188645, 9385657, 10300094, 10764472, 10885867, 10944392, 10878986, 10656099, 10237753, 10176529, 11108007, 12582138, 13700283, 14165492, 14226466, 14334665, 14262861, 13076461, 10973243, 9360690, 8801047, 9032481, 9955215, 11848322, 15259765, 20318291, 25996841, 30516376, 32825160, 33473677, 33744133, 33241556, 30159611, 24328566, 18123502, 14029681, 11656884, 10168693, 9139727, 8354050, 7713748, 7150148, 6655578, 6211302, 5842594, 5540835, 5248579, 5052535, 4904268, 4863081, 4880646, 4901292, 4911688, 4885514, 4811418, 4752134, 4625164, 4436811, 4228695, 3999401, 3811586, 3669493, 3605044, 3645167, 3696134, 3811420, 3996056]
11945C996056K49000L79647N36924O45675P21393O04288M87148M31693M24861
11936H476685M22186O36308J042782J114556R66282J190023K044676L433311M044509
11927B3371318K354457M01667l42370k21289l76177j843164l638245m283262k936807
11918A2486128j594564q53706m50602k94838k95851k72192p3728J69442L56962
11909I177051M22441N00806O64858R54803J547449K339127L609082O133347J0099138
11900C5448102J3661946J4167094J0710654N705028K304691O15089k694334r229178
11892G0689092j4495270j3875655r290785n114762k625845j059917J23415J348968
11884B5699241L000994N148736P320216Q834336R139349Q494548P013720M140904
$$ y = [3996056, 4245056, 4624703, 5161627, 5807302, 6528695, 7132983, 7620131, 8051824, 8476685, 8898871, 9535179, 10577961, 11692517, 12658799, 13848822, 15893498, 19326809, 23371318, 25725775, 26127442, 25785072, 25563783, 25187606, 23344442, 19706197, 15422935, 12486128, 10891564, 10037858, 9587256, 9292418, 8996567, 8724375, 8650647, 8820089, 9177051, 9599492, 10100298, 10765156, 11719959, 13267408, 15606535, 19215617, 25348964, 35448102, 49110048, 63277142, 73987796, 79692824, 81997515, 82612604, 79918270, 70689092, 56193822, 42318167, 33027382, 27912620, 25286775, 24226858, 24350273, 25699241, 28700235, 33848971, 41169187, 50003523, 59142872, 67637420, 74651140, 78792044]
11876G8792044K73247l513177o610891q414955r609537r873110q575162n969027
11868B6499432l706025k432508j658309j160990r54635q35340p43037o36248o12937
11859A3759403p41366p63080o36191m52187k63523j7853K73443N92502Q10466
11850A2561614Q48888P98683O16839L55408P0655m07367o95201p07548p12986
11841A2728985o86088o81333n76362m25353j63255L5883l7702j892K21577L19311
11831A0733771L31423L41393K68181j29675o34265p35545o40069n71371o24320
11822H339523n28800l16105o9042R9423K15538K11223J18755L6517m3716j28370
11812G934946k70356m10903n17590m89406l76715k62216j67440r5714O230J29172
$$ y = [78792044, 79065291, 75552114, 68941223, 60526268, 50916731, 41043621, 32468459, 26499432, 22793407, 20360899, 18702590, 17541600, 16586965, 15751625, 15008588, 14372340, 13759403, 13018037, 12254957, 11618766, 11166579, 10903056, 10885203, 11158646, 11751148, 12561614, 13410502, 14209185, 14826024, 15181432, 15252087, 14844720, 14149519, 13441971, 12728985, 12042897, 11361564, 10785202, 10359849, 10196594, 10232477, 10194775, 10192883, 10414460, 10733771, 11065194, 11406587, 11674768, 11545093, 10910828, 10175283, 9535214, 8963843, 8339523, 7810723, 7494618, 7425576, 7524999, 7740537, 7951760, 8070515, 8107032, 8063316, 7934946, 7664590, 7253687, 6736097, 6246691, 5869976, 5607760, 5440320, 5344606, 5350836, 5480008]
11802E480008K46184K48763K06094J47153J82107K69325L01715K61628L46984
11793G689961M77359N00680N84477P29595P78828N15424P5230k52670k52995J9526
11783A0865415j64668o37096o78598m51803k86816j57596l3962q545p8268k03141
11773H164922k21160Q112L05862L64983K17689L20375N03308N70890N94250M94443
11763A1323674K86694J9758k07975k83061k89434k99202l60619n93393o86552
11754H909890n47137m00192m72145n25130l57064m6547J34697L14457L72259L36167
11744G719255M44721N84851N57108L53210k9053l40856l10433j90112m78552q26997
11734G483142q20281n22001k79590k44616j96636j31229o1072m0735N1603K37084
$$ y = [5480008, 5726192, 5974955, 6181049, 6328202, 6510309, 6779634, 7081349, 7342977, 7689961, 8167320, 8668000, 9252477, 9982072, 10760900, 11276324, 11351554, 11098884, 10845889, 10865415, 10700747, 10063651, 9385053, 8933250, 8646434, 8488838, 8454876, 8446331, 8368063, 8164922, 7943762, 7951874, 8257736, 8622719, 8840408, 9160783, 9664091, 10234981, 10829231, 11323674, 11610368, 11630126, 11422151, 11139090, 10849656, 10550454, 10189835, 9596442, 8909890, 8362753, 7962561, 7490416, 6965286, 6608222, 6561675, 6696372, 7010829, 7383088, 7719255, 8163976, 8748827, 9305935, 9659145, 9630092, 9289236, 8978803, 8788691, 8310139, 7483142, 6662861, 6140860, 5861270, 5616654, 5420018, 5288789, 5227717, 5186982, 5238585, 5475669]
11724E475669M83133P93666J320262K149571L151090L735346L639299L151882
11716B3899918K467908J618503L21526j557923k918081l087503l244010l509263
11708A3991075k634100j370453n20620q9546R7762K53281L73501M26068L29883
11699A0856851J3293l37882l81180k39280k35252m15139n02031l44768j08628
11690H305984O4889J91851K87003K79779O9355o2999q0827M8247J39755n97735
11680H645302j038995n75305k31143j64662p0269J44419M30825Q83627J643405
11671I667204K548996L205267L242633K870699K341719J870651J053341o78255
11663B6122255k393849l033206k970536k754020k850073k157845j285329p88001
$$ y = [5475669, 5958802, 6752468, 8072730, 10222301, 13373391, 17108737, 20748036, 23899918, 26367826, 27986329, 28307855, 26749932, 23831851, 20744348, 17500338, 13991075, 11356975, 9986522, 9465902, 9376356, 9474118, 9727399, 10100900, 10526968, 10856851, 10870144, 10532262, 10151082, 9911802, 9676550, 9261411, 8759380, 8414612, 8305984, 8370873, 8562724, 8849727, 9129506, 9198861, 9135862, 9055035, 9103282, 9243037, 8645302, 7606307, 7031002, 6799859, 6635197, 6564928, 6709347, 7140172, 8023799, 9667204, 12216200, 15421467, 18664100, 21534799, 23876518, 25747169, 26800510, 26122255, 23728406, 20695200, 17724664, 14970644, 12120571, 9962726, 8677397, 7889396]
11655G889396n48814l91701k20303p7719O4126K56643N35900J026827J781950
11646A0316305K431688K681372K516407K195326J738921J055332j78050j625212
11638B1132089k195855k185997k539551k678774j931456j158030p36956n65137
11630G140333m88508l93923k33018m4671P0395J62076J96919J42200J46529J66834
11620F865166J95130J39792J00819J26787J07859Q9274K5908p3860k36876l78569
11610F961430m25800m60148m04771k59160j06191L1114J82790L82940O02563R15362
11600G420129J342170J832970K356691K880080L087267K796048K111069J287946
11592B5114370N18931m48007j686220k669859k900810k625909k556911k146430
$$ y = [7889396, 7340582, 6948881, 6728578, 6650859, 6714985, 6971628, 7507528, 8534355, 10316305, 12747993, 15429365, 17945772, 20141098, 21880019, 22935351, 22757301, 21132089, 18936234, 16750237, 14210686, 11531912, 9600456, 8442426, 7705470, 7140333, 6651825, 6257902, 6024884, 5980213, 6050608, 6212684, 6409603, 6551803, 6698332, 6865166, 7060296, 7200088, 7300907, 7427694, 7535553, 7624827, 7650735, 7576875, 7339999, 6961430, 6535630, 6075482, 5670711, 5411551, 5305360, 5336474, 5519264, 5902204, 6504767, 7420129, 8762299, 10595269, 12951960, 15832040, 18919307, 21715355, 23826424, 25114370, 25633301, 25185294, 23499074, 20829215, 17928405, 15302496, 12745585, 10599155]
11584A0599155j463228j027213q08296o04213m41712l39751k92378k40073j29022
11575E253269k1162J76331K39165K60724K45005J71446J80115J17513l7267j47490
11565F437649l07331m06157l68134l23472k99064k65949k30240j25709Q178R9889
11555D219660J85845K35623L04686L39019M57196N95080P28563R25327J151143
11546I142142J236370J265113J063382O81486K41823j12434n13030q02988r41210
11537A1260654j006201q54822m34342J88505Q02740J057887R50586N73684K04105
11528A2742796p6869l95430r15691j521687j703829j380653r75851o07491l57556
11519D807739j90707r8935q4918o6580n2149k3164q1033j19630j42766j56747
$$ y = [10599155, 9135927, 8108714, 7300418, 6696205, 6254493, 5914742, 5622364, 5382291, 5253269, 5232107, 5408438, 5647603, 5908327, 6153332, 6324778, 6504893, 6622406, 6585139, 6437649, 6130318, 5724161, 5356027, 5032555, 4733491, 4467542, 4237302, 4111593, 4119771, 4219660, 4405505, 4641128, 4945814, 5284833, 5742029, 6337109, 7065672, 7990999, 9142142, 10378512, 11643625, 12707007, 13388493, 13630316, 13517882, 13004852, 12201864, 11260654, 10254453, 9399631, 8965289, 9153794, 9956534, 11014421, 11965007, 12538691, 12742796, 12665927, 12270497, 11354806, 9833119, 8129290, 6748637, 5772786, 5165295, 4807739, 4617032, 4518097, 4433179, 4366599, 4314450, 4291286, 4210253, 4090623, 3947857, 3791110]
11509C791110j35608j36828j46220j21320o0178r09K6434L1755P1090P8164J61205
11498C558695J24544P8698J1764k9665q4461j12001j27529j31840j58739p6554
11488C052912J4687M9551P1501J35163K19701K35487J65055N0948K6474P567p058
11477D021988j15999j72536k61075k62463j40027L8773J90240K91534N30678Q44065
11467D965178J271462J610623J696141J435664J036394P48460O20903K56412m48237
11458A3193000j167784j385877j163505q50180q50841r56686j000368r03026o46848
11449D267885m49514l42154k87000k09207j37366q2674l3432P8468J31424J42649
11439C079079J22031N4380N0651N1924o0932q9110m1745J9696Q7424J51243J34779
$$ y = [3791110, 3655502, 3518674, 3372454, 3251134, 3190956, 3190047, 3216481, 3248236, 3319326, 3397490, 3558695, 3683239, 3761937, 3773701, 3744036, 3659575, 3547574, 3420045, 3288205, 3129466, 3052912, 3067599, 3117150, 3188651, 3323814, 3543515, 3779002, 3944057, 3995005, 4021479, 4029046, 4021988, 3905989, 3733453, 3472378, 3209915, 3069888, 3108661, 3298901, 3590435, 4121113, 4965178, 6236640, 7847263, 9543404, 10979068, 12015462, 12763922, 13384825, 13641237, 13193000, 12025216, 10639339, 9475834, 8625654, 7774813, 6818127, 5817759, 4914733, 4267885, 3818371, 3476217, 3189217, 2980010, 2842644, 2759970, 2726538, 2805006, 2936430, 3079079, 3201110, 3255490, 3306141, 3358065, 3297133, 3208023, 3166278, 3185974, 3273398, 3424641, 3559420]
11428C559420M518k8126m1389k14149l00227l52621k76169j77720m7177K4533
11418B150893k343K8160N6938J0844J9530P5221J19702J73657K55185L02238L29919
11407C519944K96890K36363P7546n0560j27387k15902k76322k82419k50433M527
11397B932247K84310N50507P95956R28699Q82969O29764L23187P8686q2029k75267
11387G049029o04515r25900q73935o11948l70320k50496k72976l18731l48577
11378B471631k52368j52204q9612l6410l8005l2081l6906m8244o8846o3857m5520
11367A607578k9055j8170n321K0990m663J7797O4371J34067J78005J66955J62479
11356B295033J12100O1911O9296K170k7324l4334m5025K1437P6211M2803L1080
$$ y = [3559420, 3563938, 3535812, 3494423, 3280274, 2980047, 2627426, 2351257, 2173537, 2126360, 2150893, 2148550, 2176710, 2233648, 2244492, 2264022, 2339243, 2458945, 2632602, 2887787, 3190025, 3519944, 3816834, 4053197, 4130743, 4080183, 3952796, 3736894, 3460572, 3178153, 2927720, 2932247, 3216557, 3767064, 4563020, 5491719, 6374688, 7004452, 7327639, 7406325, 7324296, 7049029, 6444514, 5518614, 4644679, 4032731, 3662411, 3411915, 3138939, 2820208, 2471631, 2219263, 2067059, 1977447, 1941037, 1903032, 1870951, 1834045, 1785801, 1716955, 1653098, 1607578, 1578523, 1560353, 1555032, 1576022, 1571359, 1589156, 1653527, 1787594, 1965599, 2132554, 2295033, 2407133, 2469044, 2538340, 2540510, 2513186, 2478852, 2433827, 2455264, 2531475, 2574278, 2605358]
11345B605358l7969j23778q7284q3374p7974j2648N1310J06198J10489J86118
11335B636446K06418J74201N5568p146O5048M3743j33701k08379k35892k24795
11325B371511j86252j82188k01386j10453l9127l9772l9586p1566m7825n7345
11315A396011n4042m6209j9360p392L7876N0123O7356R8478Q0221L9382q008J7697
11303A652133Q8382R2574Q6939Q3245J36440J29777P4203N2863j9134o1020j07477
11292B208925j22998l2085J40908K69879K81823K39442J96043K16039J35853J7108
11282C550937j44865k36122k17510k39816k17502j73986j39407j75251j19671
11273A886807j15293j14213r1633j07635j05655o4890q1787m2220m1J5053K2758
$$ y = [2605358, 2567389, 2443611, 2356327, 2272953, 2194979, 2182331, 2233641, 2339839, 2450328, 2636446, 2842864, 3017065, 3072633, 3065487, 3130535, 3174278, 3040577, 2832198, 2596306, 2371511, 2185259, 2003071, 1801685, 1691232, 1652105, 1612333, 1572747, 1501181, 1453356, 1396011, 1341969, 1295760, 1276400, 1269008, 1306884, 1357007, 1424363, 1522841, 1603062, 1642444, 1634436, 1652133, 1740515, 1833089, 1920028, 2003273, 2139713, 2269490, 2343693, 2396556, 2377422, 2316402, 2208925, 2085927, 2053842, 2194750, 2464629, 2746452, 2985894, 3181937, 3397976, 3533829, 3550937, 3406072, 3169950, 2952440, 2712624, 2495122, 2321136, 2181729, 2006478, 1886807, 1771514, 1657301, 1565668, 1458033, 1352378, 1287488, 1205701, 1163481, 1163440, 1178493, 1201251]
11262A201251J1110K1997L7407Q2344J22767J62861J48290J16087J11586P3842
11252B089542N6545P9827Q6664O3603J23967J48723J79866J95228K42334K18897
11242C485196J80456N5552M1674N4484J40487N6006j35523j72905n2283Q7501
11232C740645L8682j24741k43982k64363j89201j38661k81659l77740k97678j75570
11222A685732j06649r5670m3611l8780j4335L099K3774K9887L3166L7277L887
11211A517777J8953k7438j7620K8963M3826O3622O4861N8920O1673J07665J27823
11200B049025J22555J57829J73221J81208K15045L00881L97354L99481K95080
11191D291679K32897J68624J56934J03078o7182k24470l66795m32939k95065k07159
$$ y = [1201251, 1212361, 1234358, 1271765, 1354109, 1476876, 1639737, 1788027, 1904114, 2015700, 2089542, 2146087, 2225914, 2312578, 2376181, 2500148, 2648871, 2828737, 3023965, 3266299, 3485196, 3665652, 3721204, 3762878, 3817362, 3957849, 4013855, 3878332, 3705427, 3653144, 3740645, 3779327, 3654586, 3410604, 3146241, 2957040, 2818379, 2536720, 2158980, 1861302, 1685732, 1579083, 1483413, 1439802, 1401022, 1386687, 1389786, 1413560, 1443447, 1476613, 1513890, 1517777, 1536730, 1509292, 1491672, 1520635, 1564461, 1628083, 1692944, 1751864, 1813537, 1921202, 2049025, 2171580, 2329409, 2502630, 2683838, 2898883, 3199764, 3597118, 3996599, 4291679, 4524576, 4693200, 4850134, 4953212, 4886030, 4661560, 4294765, 3861826, 3566761, 3359602]
11181C359602l09179m20114l53251j62054j3790L8476N7015N3255N4894O7723
11171B372577N7387j7352q1527o8023J5587L7089l0800k8445J7807M7200N1412
11160B372912O2566M2592K7735p064K7297Q1524J03124P4127O6389O0739O1319
11149B973260O0333R9352M1940L734J6124O5759R2111Q6296L8129k1782m7104
11138C408152R37J3041j02704j62677j32299j65280j83669j06426L5777Q0419
11128B685271O1248R5655J45436J82240J19093k3849p7856j29278n5812m469Q328
11117C006007L7331J67552K30541J66557R3661j5849o1071j57411k53205k85332
11107B928781k24583j50819j01321o9543j8930P6750J19036N2595J405M6301J62240
$$ y = [3359602, 3050423, 2630309, 2277058, 2115004, 2101214, 2139690, 2196705, 2249960, 2304854, 2372577, 2429964, 2412612, 2331085, 2263062, 2278649, 2315738, 2284938, 2256493, 2274300, 2321500, 2372912, 2435478, 2478070, 2505805, 2498741, 2526038, 2607562, 2710686, 2784813, 2851202, 2911941, 2973260, 3033593, 3132945, 3174885, 3178619, 3194743, 3260502, 3352613, 3438909, 3477038, 3455256, 3408152, 3409089, 3422130, 3319426, 3156749, 3024450, 2859170, 2675501, 2569075, 2604852, 2685271, 2746519, 2842174, 2987610, 3169850, 3288943, 3265094, 3187238, 3057960, 3002148, 2997679, 3006007, 3043338, 3210890, 3441431, 3607988, 3701649, 3685800, 3624729, 3467318, 3214113, 2928781, 2704198, 2553379, 2452058, 2382515, 2363585, 2440335, 2559371, 2611966, 2613371, 2659672, 2821912]
11096B821912K22546K52080K37786J71011N6547R604J3526P782k10229l63183
11086C219382k94702j78280p6738J7159J30475K21163L02179L62100L16278K57511
11076D276527J64772L6403o6264j79966k51268j94137j13508P073J04438J74612
11066C958682K15212J92594K16723K00135J53900l0851j35184j79199j07061m4984
11056D439967j68013l28104k71441j57363j7653j63909k10056j26318P6261J84450
11046C257821J23371P7651O7271q34K8483K5708K8810L5957R3972J32700J32183
11035D003093K50520M59955M41797K47351K44994L50791M19156L37488R0273m6392
11025F799026j56992k74851l29728l26798k86990k32008j55914o5874j825O5303
$$ y = [2821912, 3044458, 3296538, 3534324, 3705335, 3761882, 3771486, 3785012, 3792794, 3582565, 3219382, 2924680, 2746400, 2669662, 2686821, 2817296, 3038459, 3340638, 3702738, 4019016, 4276527, 4441299, 4477702, 4411438, 4231472, 3980204, 3786067, 3672559, 3679632, 3784070, 3958682, 4173894, 4366488, 4583211, 4783346, 4937246, 4906395, 4771211, 4592012, 4484951, 4439967, 4271954, 3943850, 3672409, 3515046, 3497393, 3333484, 3123428, 2997110, 3073371, 3257821, 3381192, 3458843, 3526114, 3525280, 3553763, 3579471, 3608281, 3644238, 3738210, 3870910, 4003093, 4253613, 4713568, 5155365, 5402716, 5647710, 5998501, 6417657, 6755145, 6845418, 6799026, 6642034, 6367183, 6037455, 5710657, 5423667, 5191659, 5035745, 4969871, 4968046, 5033349]
11015E033349P4480q41j06720j29823n3119n1933j87345l07560k28240j16296
11005C925952j54390k81434l22225k17872j47260j37582j08337n1968k2207m293
10995B478384N5074J33552J75696K16135K22067J66775J55261J96604K64750J98156
10985D262454L0356K2473N5907R1044N9276m5938p2406j21444j64936k29601j68964
10974C718221j45855j96608l05838k42065j37115o5251p530L0337J09871K57217
10964C015384N42436Q58084R74671Q60336N93228L41823J53076k5994m51662q67952
10954E993430r45957q32292o18661l60490k07006j53958j33991j29699r0314p4231
10944B446831n8158m2561o8955n9182n8054n6078k4293k0943o4663M983l906o597
$$ y = [5033349, 5107829, 5106988, 5000268, 4870445, 4817326, 4765393, 4578048, 4270488, 4042248, 3925952, 3771562, 3490128, 3167903, 2950031, 2802771, 2665189, 2556852, 2504884, 2482677, 2478384, 2533458, 2667010, 2842706, 3058841, 3280908, 3447683, 3602944, 3799548, 4064298, 4262454, 4292810, 4315283, 4371190, 4462234, 4521510, 4475572, 4403166, 4281722, 4116786, 3887185, 3718221, 3572366, 3375758, 3069920, 2827855, 2690740, 2625489, 2617959, 2648296, 2758167, 3015384, 3557820, 4415904, 5390575, 6250911, 6844139, 7185962, 7339038, 7313044, 6861382, 5993430, 5047473, 4215181, 3596520, 3236030, 3029024, 2875066, 2741075, 2611376, 2521062, 2446831, 2388673, 2346112, 2277157, 2217975, 2159921, 2103843, 2079550, 2058607, 1993944, 1998927, 1995021, 1988424]
10932A988424M6989N9117M7087N4159M8871L5072K2861m763m3592o3334o6294
10921B124597k8874m662K0239N9841J04693J91910K96251L78695L91857L64958
10911C899505K81732J92773J54173M5454r6707k06081k12305j52059m210K20487
10901D122762L92265M93906M57664N39376P49755R54098R13055M95715L8276j61935
10891H994937j62890l98493q85840j176321j123771q36400n62841l97815k82523
10882C168043j96462j64040j44289r6490p8806n6165k8796m7741l0625q117J3201
10871B329713J3205N9647J30509K38952L33636L61366L03183K50608K56747K89039
10861D566605K66987J55503N0993m600m632k9799m3855r460M0254J05039K21852
$$ y = [1988424, 2035413, 2094530, 2141617, 2195776, 2244647, 2279719, 2302580, 2297817, 2254225, 2190891, 2124597, 2095723, 2091061, 2111300, 2171141, 2275834, 2467744, 2763995, 3142690, 3534547, 3899505, 4181237, 4374010, 4528183, 4573637, 4476930, 4270849, 4058544, 3906485, 3902275, 4122762, 4515027, 5008933, 5466597, 6005973, 6755728, 7709826, 8622881, 9118596, 9156872, 8994937, 8832047, 8433554, 7547714, 6371393, 5247622, 4411222, 3848381, 3450566, 3168043, 2971581, 2807541, 2663252, 2566762, 2487956, 2431791, 2402995, 2355254, 2324629, 2316512, 2329713, 2342918, 2402565, 2533074, 2772026, 3105662, 3467028, 3770211, 4020819, 4277566, 4566605, 4833592, 4989095, 5040088, 5035488, 5030856, 5001057, 4957202, 4947742, 4987996, 5093035, 5314887]
10850E314887M53223O85236Q54639R13757R15091Q35043O49028L06931j41192
10841A0786643m02556n57525p38624r72994j011327p25524m00246l10196l13263
10832E354388j22418J8184J31598J83809J20725P0479L0316k3664j42575k40690
10822E380152k65079k54002k07000j34114p9320P5179J95385K45012K50861L08302
10812E515376L68176L76018M26266L48255J81862N7746n9771j37211k21771k79974
10802F574972k63802k73978j82587o0330K8947M9750J23062J95797K17473K19787
10792F629091K50352K18266K04158K39572L41811L69342K49171R4514P5696J49854
10782H821827J28680N200r6565k78477l59807l91320m20777m95007m91430m75963
$$ y = [5314887, 5768110, 6453346, 7307985, 8221742, 9136833, 9971876, 10620904, 10927835, 10786643, 10384087, 9826562, 9087938, 8114944, 7103617, 6378093, 5977847, 5667651, 5354388, 5231970, 5250154, 5381752, 5565561, 5686286, 5756765, 5787081, 5763417, 5620842, 5380152, 5115073, 4861071, 4654071, 4519957, 4440637, 4515816, 4711201, 4956213, 5207074, 5515376, 5883552, 6259570, 6685836, 7034091, 7215953, 7273699, 7213928, 7076717, 6854946, 6574972, 6311170, 6037192, 5854605, 5794275, 5823222, 5872972, 5996034, 6191831, 6409304, 6629091, 6879443, 7097709, 7301867, 7541439, 7883250, 8252592, 8501763, 8596277, 8671973, 8821827, 8950507, 8955707, 8859142, 8580665, 8220858, 7829538, 7408761, 6913754, 6422324, 5946361]
10772E946361m60859l97597l11390k13160j13119k3060J08726K03489K71405L28773
10762E339569L26374L07032L45521K92722J21000o7209j83417j93019j29599n3278
10752F105696J4592J5251L3010J19823K24060K99059K13092K7521L0247O3136
10742G145487N0032K4485j21136k43438l08314l04687l40970k50033j32185p6610
10732E442631m38J10779K26790K81030K33373J44279J11340O3125j21142l74864
10722F116903l86161l33361l51486m21932l43873j84471N59K43113M52957N28837
10712E321085M94761L43416J64313K6414j48371l83784n07190n69076m54260k80222
10702D007086j49582k8104J19932K68530L55555L80174L42172K49677J88951J42582
$$ y = [5946361, 5485502, 5087905, 4776515, 4563355, 4450236, 4427176, 4535902, 4739391, 5010796, 5339569, 5665943, 5972975, 6318496, 6611218, 6732218, 6665009, 6481592, 6288573, 6158974, 6105696, 6120288, 6135539, 6168549, 6288372, 6512432, 6811491, 7024583, 7052104, 7082351, 7145487, 7195519, 7220004, 7098868, 6855430, 6547116, 6242429, 5901459, 5651426, 5519241, 5442631, 5442193, 5552972, 5779762, 6060792, 6294165, 6438444, 6549784, 6612909, 6491767, 6116903, 5730742, 5397381, 5045895, 4623963, 4280090, 4095619, 4096178, 4339291, 4792248, 5321085, 5815846, 6159262, 6323575, 6349989, 6201618, 5817834, 5310644, 4741568, 4287308, 4007086, 3857504, 3829400, 3949332, 4217862, 4573417, 4953591, 5295763, 5545440, 5734391, 5876973]
10692E876973j2100k53784m19238l78117l80357l88531k99301k64647j75035p5999
10682C229864m35J12279K13563K61756K91244K70588K66524K98373K81363J91624
10672E416743J56601L3511m1185l2101o6584k30251l36682l93201l37478l25220
10662C844153l50663k95423j64753r0957m8529L2227K2917Q3934J71511K45912
10652C450329L59128M37096M19159L28860K36567J80871O0143j04602k56090l66243
10642D745218l86237l29013k69733j91682j39073n8838n7035q3177m0339P166
10632C197257N3176N6309O071L0040N7378R5011J20387J19122J06929J61821J36149
10621D139650J38822J68914J44043J50700J51733K15145L41521M86911O79830
$$ y = [5876973, 5864873, 5611089, 5191851, 4813734, 4433377, 4044846, 3745545, 3480898, 3305863, 3229864, 3229429, 3341708, 3555271, 3817027, 4108271, 4378859, 4645383, 4943756, 5225119, 5416743, 5573344, 5606855, 5565670, 5533569, 5466985, 5236734, 4900052, 4506851, 4169373, 3844153, 3493490, 3198067, 3033314, 2942357, 2893828, 2926055, 2948972, 3032906, 3204417, 3450329, 3809457, 4246553, 4665712, 4994572, 5231139, 5412010, 5472153, 5367551, 5111461, 4745218, 4358981, 4029968, 3760235, 3568553, 3429480, 3370642, 3313607, 3230430, 3190091, 3197257, 3250433, 3306742, 3312813, 3342853, 3400231, 3495242, 3615629, 3734751, 3841680, 4003501, 4139650, 4278472, 4447386, 4591429, 4742129, 4893862, 5109007, 5450528, 5937439, 6617269]
10612F617269Q94581R84573R07508O87354L71073O625l35087o29438q89721r77666
10602G637071p85459n36709l35009j87595j44127j10821j39014k02338k47531
10593D948468k40887k40508j79952j14232m3628N68O6855J45605J77678K88153
10583D808120M08399M50996M39789M00645L62040L60449M06291L41147L01386
10574H279262M02989N92485P44354Q73835Q65064O44557L41921L9004k42357m89771
10564A2051343p08817q57810q20204n48455k88907l2876J08870K77311L70285
10555I550740M02117M66314N85536O50445O39850O20181M75193K51216J45536
10546A3787128O7194P2271J06126K14815L22209M67263N49456N94992O61852O49331
$$ y = [6617269, 7511850, 8496423, 9403931, 10091285, 10462358, 10468983, 10133896, 9504458, 8614737, 7637071, 6851612, 6314903, 5979894, 5792299, 5648172, 5537351, 5398337, 5195999, 4948468, 4707581, 4467073, 4287121, 4172889, 4129261, 4129829, 4196684, 4342289, 4519967, 4808120, 5216519, 5667515, 6107304, 6507949, 6869989, 7230438, 7636729, 7977876, 8279262, 8682251, 9274736, 10019090, 10892925, 11757989, 12402546, 12744467, 12783471, 12541114, 12051343, 11342526, 10484716, 9664512, 9116057, 8827150, 8794274, 8903144, 9180455, 9550740, 9952857, 10419171, 11004707, 11655152, 12295002, 12915183, 13390376, 13641592, 13787128, 13854322, 13926593, 14032719, 14247534, 14569743, 15037006, 15586462, 16181454, 16843306, 17492637]
10536A7492637N66776M93561M48316L81120L09871J27637O2418M586j42457k91683
10526A9452782l57491l53087l89188l98107n92907q61900r96479r57927q07436
10517A3738260n20556j36879L36741Q45373J227886J403581J332298J107922Q22686
10508B0157312N44664J37317l92838q42175j039338j007160q46905n52043k12675
10499A5946159J34158M76661P79779J067200J453929J834853K278870K595255
10491B6566864K818972K963019K958101K734768K174642J421457N24763l99971
10483D1762615j243410j879227k231811k384719k475824k587673k487911k299577
10475B4172463k118966k041500j896361j611814j234535q51317m52247j71165
$$ y = [17492637, 18059413, 18552974, 19001290, 19382410, 19692281, 19819918, 19882336, 19886922, 19744465, 19452782, 19095291, 18742204, 18353016, 17954909, 17362002, 16500102, 15503623, 14545696, 13738260, 13217704, 13080825, 13417566, 14262939, 15490825, 16894406, 18226704, 19334626, 20157312, 20701976, 20839293, 20446455, 19604280, 18564942, 17557782, 16710877, 16158834, 15946159, 16080317, 16556978, 17336757, 18403957, 19857886, 21692739, 23971609, 26566864, 29385836, 32348855, 35306956, 38041724, 40216366, 41637823, 42162586, 41762615, 40519205, 38639978, 36408167, 34023448, 31547624, 28959951, 26472040, 24172463, 22053497, 20011997, 18115636, 16503822, 15269287, 14417970, 13965723, 13794558]
10467A3794558K2447J62269K19692J47304N4717n1993j60228k72926k88372l07558
10457A3319910l59338l04653j91153j17731K908K47054N49581Q10298J122881
10448A5079757J444553J729446K047479K325440K376547K154174J704175J113707
10440B9975278M84834k17578r87107j711009k165429k340717k246850k034596
10432A8756826j723150j292013q41954m98563j96533K3601J23769J42671O4741
10423A4559395j35343l75054o16731q12724r65748r62645q68039q04224o99018
10414H319869n65646m74307m06669l32447l23394l30699k92464k44013j83295
10405E166935j20961j08875p3245j9689P758L3311J09686J58712K36040K88989
$$ y = [13794558, 13817005, 13979274, 14198966, 14346270, 14400987, 14348994, 14188766, 13915840, 13627468, 13319910, 12960572, 12655919, 12464766, 12347035, 12349943, 12596997, 13146578, 13956876, 15079757, 16524310, 18253756, 20301235, 22626675, 25003222, 27157396, 28861571, 29975278, 30460112, 30242534, 29255427, 27544418, 25378989, 23038272, 20791422, 18756826, 17033676, 15741663, 14899709, 14401146, 14204613, 14228214, 14351983, 14494654, 14559395, 14424052, 14048998, 13432267, 12619543, 11653795, 10691150, 9823111, 9018887, 8319869, 7754223, 7279916, 6873247, 6540800, 6217406, 5886707, 5594243, 5350230, 5166935, 5045974, 4937099, 4863854, 4844165, 4851923, 4885234, 4994920, 5153632, 5389672, 5678661]
10395E678661L71767N43056O72861Q64365Q71000O94023M42283K76168N3691j82969
10385A0284906m33815o14950p14212o58487n55142m51329l71717l76345l58004
10376E750905l61228l10416k42355j97498j43391r1172p1508r2512j18984j10780
10366D011061n6098J7215r636k2373o6467m7890r7907j55374j47527j19163j12858
10355C192983q8417n9497j7287M8103N7874R9482P0933J5448j5924m2363m8665
10344C212670p1657r8326n8432J3914L8772N9817J21383J64171J55730R9881L6620
10333C674543l412Q983j8183Q602M6799J46845K87012M19176M76170M32235L22348
10322E801118J61575r73q9283k54867m57585m80309m33593l26535k51592j53615
$$ y = [5678661, 6050428, 6593484, 7266345, 8130710, 9001710, 9695733, 10138016, 10414184, 10467875, 10284906, 9851091, 9236141, 8521929, 7863442, 7308300, 6856971, 6485254, 6108909, 5750905, 5389677, 5079261, 4836906, 4639408, 4496017, 4404845, 4333337, 4240825, 4121841, 4011061, 3954963, 3972178, 3962542, 3940169, 3873702, 3825812, 3727905, 3572531, 3425004, 3305841, 3192983, 3104566, 3045069, 3027782, 3075885, 3133759, 3233241, 3304174, 3319622, 3303698, 3261335, 3212670, 3141013, 3042687, 2984255, 2998169, 3036941, 3096758, 3218141, 3382312, 3538042, 3637923, 3674543, 3671131, 3680114, 3661931, 3670533, 3717332, 3864177, 4151189, 4570365, 5046535, 5478770, 5801118, 5962693, 5961720, 5872437, 5617570, 5159985, 4679676, 4246083, 3919548, 3667956, 3514341]
10312C514341j06818p1583p2915l0860j1772l9370n9473p0059q0677p0642p1347
10301B828825k5541k7487j7679O1670J01549J90556L57951M99552O17159O31241
10291E217796M72171L11947J36525j680j99933l94668n55694n81002m09543k33674
10281C762245r9801q775J7391M2131Q388k5217l4868l0192o3731k0213J3138P9824
10269C640320J55157K82502L73522L63893K65931Q7261j2822n5143j38676l02491
10259D659454n63089n42165l84767k75114j68881p1629j9851j4001M4658J21844
10249B786459J53286J62557J79306J35493J70092J73460J45346J62283K26461
10240D294743K81072K70051Q3736K4172P4655Q4741o0996k90885l09869j54381
$$ y = [3514341, 3407523, 3335940, 3263025, 3232165, 3220393, 3181023, 3121550, 3051491, 2970814, 2900172, 2828825, 2803284, 2775797, 2758118, 2819788, 2921337, 3111893, 3469844, 3969396, 4586555, 5217796, 5689967, 6001914, 6138439, 6136759, 5936826, 5542158, 4986464, 4405462, 3995919, 3762245, 3662444, 3653669, 3671060, 3713191, 3721579, 3696362, 3661494, 3631302, 3567571, 3547358, 3560496, 3640320, 3795477, 4077979, 4451501, 4815394, 5081325, 5168586, 5155764, 5100621, 4961945, 4659454, 4096365, 3554200, 3169433, 2894319, 2725438, 2653809, 2633958, 2619957, 2664615, 2786459, 2939745, 3102302, 3281608, 3417101, 3587193, 3760653, 3905999, 4068282, 4294743, 4575815, 4845866, 4929602, 4953774, 5028429, 5113170, 5052174, 4761289, 4451420, 4297039]
10230D297039j5683O9134P0691K0619k0460p6769q9681r9773k49520m11763m06956
10219C086878k88064j72537j31108n4994K909L5567J03562R6353Q7236J21300
10209B887102J41150J25879R5938R6124J65760K75775L61604L97051L90074L38100
10199E274557K20311R3718K1552k0052j92092m39537m75182l43370j84442j25137
10189C830326j48753j56636n3756J11732K22793L04531N32162P38153P61865N41038
10179F683455K93397J36458J3491j43183n70058p51143n34447k56207L9179K24232
10169E135174K45406J16094M8918K0304o2852k26163l70336l60331k41794o6877
10159D237543O9401K25288L91966N20164O44885O74250N74362M05693K09027j3950
$$ y = [4297039, 4281356, 4350490, 4421181, 4441800, 4421340, 4344571, 4254890, 4155117, 3905597, 3493834, 3086878, 2798814, 2626277, 2495169, 2440175, 2443084, 2478651, 2582213, 2678566, 2765802, 2887102, 3028252, 3154131, 3250069, 3346193, 3511953, 3787728, 4149332, 4546383, 4936457, 5274557, 5494868, 5588586, 5610138, 5590086, 5397994, 4958457, 4483275, 4139905, 3955463, 3830326, 3681573, 3524937, 3471181, 3582913, 3805706, 4110237, 4642399, 5380552, 6142417, 6683455, 6976852, 7113310, 7126801, 6983618, 6413560, 5662417, 5127970, 4871763, 4910942, 5135174, 5380580, 5496674, 5545592, 5565896, 5503044, 5276881, 4906545, 4546214, 4304420, 4237543, 4306944, 4532232, 4924198, 5444362, 6089247, 6763497, 7337859, 7743552, 7952579, 7938629]
10149G938629j59697k96499m76962n80284m16277j50658J49575M02085M95482
10140F905394L91585K32369J23632J37776O9513j91583m69760m80329k98217j83098
10130F237282j08154m7177O0353K91335O06322R98363J470117J720569J392231
10121A2621241P25562K33894R0217L9234n06425j262288j090953l85291J29705
10112A0594896L23588J68776j1406j81973k75951n39328q34773r79309q61441
10103G403079o17484m49850m07242l30982j81913j2539J22842L32978M84889M05333
10093F749111K30603J79184K03479K04460l8090l51283l27328j22116N5968K34179
10083G018167L98927N30307O12979N92646M51305K96364R0672j96693m28181n03067
$$ y = [7938629, 7778932, 7482433, 7005471, 6425187, 6008910, 5858252, 6007827, 6409912, 6905394, 7296979, 7529348, 7652980, 7790756, 7860269, 7668686, 7198926, 6718597, 6420380, 6237282, 6129128, 6081951, 6142304, 6433639, 7039961, 8038324, 9508441, 11229010, 12621241, 13346803, 13580697, 13670914, 13710148, 13203723, 11941435, 10850482, 10465191, 10594896, 10918484, 11087260, 11075854, 10893881, 10617930, 10078602, 9243829, 8264520, 7403079, 6785595, 6335745, 5928503, 5597521, 5415608, 5403069, 5525911, 5858889, 6343778, 6749111, 6979714, 7158898, 7362377, 7566837, 7528747, 7177464, 6850136, 6728020, 6783988, 7018167, 7417094, 7947401, 8560380, 9153026, 9604331, 9900695, 9991367, 9794674, 9366493, 8863426]
10073H863426n23139n40169m11194k71108j90911l7091Q0456O6944P6402J03360
10063G216976J29477Q6440q1234k41326k24393j94934k99089k36837q8294N3060
10053F119846O8458p8645j10546l4163K5623n7640j23164n9338M0382O2268O1531
10042E914612N4238J5760j0529l1644K8616J24660K19113K61533K22624J51033
10032F950016J05623J13724K05956J64856J23795P8840Q1367J02324J19905P6503
10022H122909n7684m0895K95953J014198J403719P87410P7345j84042K6944O78098
10012A2123955k63938j855060j376006p60332m72980k05207k61260p20617p30668
10003E477887l59778o1594J06812J51906J55507J47247J24547R8749P5160K4913
$$ y = [8863426, 8340287, 7800118, 7388924, 7117816, 6926905, 6889814, 6970270, 7037214, 7113616, 7216976, 7346453, 7432893, 7351659, 7110333, 6885940, 6691006, 6391917, 6155080, 6066786, 6119846, 6188304, 6109659, 5999113, 5964950, 5990573, 5932933, 5809769, 5750431, 5790813, 5853081, 5914612, 5968850, 5984610, 5974081, 5942437, 5971053, 6095713, 6314826, 6576359, 6798983, 6950016, 7055639, 7169363, 7375319, 7540175, 7663970, 7742810, 7824177, 7926501, 8046406, 8122909, 8065225, 8024330, 8320283, 9334481, 10738200, 11525610, 11602955, 11418913, 11445857, 12123955, 11860017, 10004957, 8628951, 7868619, 7395639, 7190432, 6929172, 6208555, 5477887, 5118109, 5056515, 5163327, 5315233, 5470740, 5617987, 5742534, 5841283, 5916443, 5941356]
9993E941356m0441p7429q1659j4732J8980O817k596k6672N868P7943J91563K56199
9981F255197K33858J42339J48048K77944L85631M56540L96194J75613o1923j97171
9971H212270l37939n23328q10194r64388q16963n78515l65772k26344j32433q8775
9961C367619j5433m851n8964n2042l1969o204L7816M7567N4300J03043K15550
9950C656432K93713L44738L22410L35220L75066M37889N32372O18472N42452M31641
9940G890405L91155M22086N13657M42123m103l26048l02317k61577q6228n2376
9930H626777m21928n19553l26702j50217j47880l02605m80153n51584n24220l92643
9920D809292k21265k8444J67882K77186K00673Q4250L6591J5714l7566k08437
$$ y = [5941356, 5900915, 5823486, 5741827, 5727095, 5746075, 5752892, 5750296, 5723624, 5729492, 5807435, 5998998, 6255197, 6489055, 6631394, 6779442, 7057386, 7443017, 7899557, 8295751, 8471364, 8409441, 8212270, 7874331, 7351003, 6540809, 5576421, 4759458, 4180943, 3815171, 3588827, 3456394, 3367619, 3352186, 3347335, 3288371, 3236329, 3204360, 3198156, 3235972, 3283539, 3337839, 3440882, 3656432, 3950145, 4294883, 4617293, 4952513, 5327579, 5765468, 6297840, 6916312, 7458764, 7890405, 8281560, 8703646, 9217303, 9659426, 9655323, 9329275, 9026958, 8765381, 8679153, 8626777, 8204849, 7685296, 7358594, 7208377, 7060497, 6757892, 6277739, 5726155, 5201935, 4809292, 4588027, 4559583, 4727465, 5004651, 5205324, 5289574, 5326165, 5341879, 5304313, 5095876]
9910E095876l32135k67190j14579n3492n6445m5381m1272n8375j07282j41396
9900C878329p9069J15013L65864M51674L66549K58208K04397K10177L36045K59477
9890F366664j03128k54946j88998j51548r3604q2675j89356j47227K0768J43833
9880E319783J36534P0187N2836L6733q0145k46784k47876m7203J22075J34507
9870E250647P7144k793j7924N8451K767k44105l70661k20508j1657J64889J25551
9859D811801O4033J70478J86992Q2579p5152k09216k48830k38465k64495k96508
9849C983217j89158K5486K77213N94060J028455J178630Q03406L36657O8445J01883
9839H208294K02141m38751j069372p27313k83766p7297n6214o932O7097m1112
$$ y = [5095876, 4763741, 4496551, 4381972, 4328480, 4272035, 4226654, 4185382, 4127007, 4019725, 3878329, 3799260, 3914273, 4280137, 4731811, 5098360, 5356568, 5560965, 5771142, 6107187, 6366664, 6263536, 6008590, 5819592, 5668044, 5574440, 5491765, 5302409, 5155182, 5175950, 5319783, 5456317, 5526504, 5579340, 5616073, 5535928, 5289144, 5041268, 4994065, 5116140, 5250647, 5327791, 5324998, 5307074, 5365525, 5368292, 5124187, 4753526, 4533018, 4521361, 4686250, 4811801, 4875834, 5046312, 5233304, 5315883, 5240731, 5031515, 4782685, 4544220, 4279725, 3983217, 3794059, 3819545, 4096758, 4690818, 5719273, 6897903, 7701309, 8037966, 8106411, 8208294, 8410435, 7971684, 6902312, 6174999, 5891233, 5813936, 5757722, 5750790, 5817887, 5776775]
9829E776775k92719l43358k73531k55459k29395k62214l30263k41773r7430K2053
9819C472686Q2795J62211J63814J04890O6992M153n93J14302J11217K2729j5242
9808D289954K451m4595m5151o6465j95707k83468k26458j14676l1177l1324j1070
9797C242314K0016J10405J11038M7665L5072M9896K4274N8524Q6883K1988J1985
9786C820060J79990M47580Q52220J031632P58010L36812R2777k423L1452l99179
9776G148931j155922j049041o07956l53199j55737m1539j7758j9007M9518N3309
9766C851599n1541j34673j39270j30910j57349j87503j86816j42233n5819L188
9756B668673P0684Q5722O9152K3104M6974J1303N2475J09432J46151J12276J06236
$$ y = [5776775, 5484056, 5140698, 4867167, 4611708, 4382313, 4120099, 3789836, 3548063, 3450633, 3472686, 3555481, 3717692, 3881506, 3986396, 4053388, 4057541, 4056948, 4171250, 4282467, 4305196, 4289954, 4292405, 4247810, 4202659, 4136194, 3940487, 3657019, 3430561, 3315885, 3284708, 3253384, 3242314, 3262330, 3372735, 3483773, 3531438, 3566510, 3616406, 3640680, 3699204, 3786087, 3808075, 3820060, 4000050, 4447630, 5299850, 6331482, 7089492, 7426304, 7519081, 7516658, 7548110, 7148931, 5993009, 4943968, 4336012, 3982813, 3827076, 3785537, 3767779, 3748772, 3798290, 3851599, 3800058, 3665385, 3526115, 3395205, 3237856, 3050353, 2863537, 2721304, 2665485, 2668673, 2739357, 2825079, 2894231, 2917335, 2964309, 2975612, 3028087, 3137519, 3283670, 3395946, 3502182]
9745C502182J00224R0909P7529l444j48159k19223j91828j58439j02883r0122
9735B856746r9901m0761k803L3095Q1336O7911O4997O1069J7124K4112j1115l0838
9723C020972o1r006l1944o4948o8472l1139k8769p0949m0401k4888k5706M874
9711B629563L4247O2626l825n6330n9801q3830j20891r4533j01123o5313K5635
9700B166425P5655J01052J21121J13462J07175J21872Q4952L1009K2970J5644
9690B961337m739l3637q5704j42534j27822q2939q9578q2266m1345J0202M8451
9679B329426J10039R7988M8067M6159L0807L1941o767K5571L1526n6088l6281
9668B652388Q16P1801P2274J8204k839m3358r4446r5143j46413j65459j07177
$$ y = [3502182, 3602406, 3693315, 3770844, 3767400, 3619241, 3400018, 3208190, 3049751, 2946868, 2856746, 2756845, 2716084, 2713281, 2746376, 2827712, 2895623, 2960620, 3021689, 3038813, 3062925, 3051810, 3020972, 3020911, 3011905, 2979961, 2915013, 2846541, 2815402, 2786633, 2715684, 2675283, 2650395, 2624689, 2629563, 2663810, 2726436, 2722611, 2666281, 2606480, 2522650, 2401759, 2307226, 2206103, 2140790, 2166425, 2242080, 2343132, 2464253, 2577715, 2684890, 2806762, 2891714, 2922723, 2945693, 2961337, 2956598, 2922961, 2837257, 2694723, 2566901, 2483962, 2394384, 2312118, 2270773, 2280975, 2329426, 2439465, 2537453, 2585520, 2631679, 2662486, 2694427, 2687660, 2713231, 2744757, 2688669, 2652388, 2653204, 2725005, 2797279, 2815483, 2812644, 2769286, 2674840, 2579697, 2433284, 2267825, 2160648]
9657B160648m7708K1015P5335J00764J02144J10951O3885Q077j3135o4786n5138
9646B462052o1508j45214o6332m420K8210J8311q444j5669l3241p2318j19038
9635A982389j26092j05946p3566P44L6600L0599K5816O9625R2465J13395J28885
9624B174914J18032J08027J17770R2510M0312P174J02l3257j04346j54255j48654
9613B218329r5964n0915l0105o538J5904Q757J7513K596j7185n7668r4768n6733
9601A853223K5535M6516Q3150K6622l6030m6189l9257m1489j15281j34291j28487
9590A494022r3973l0373q392j4882J2783Q1438J15856P0426N4967m337K7812P9013
9578A784360K8088P2260J00276J03361R8689P9007N3759J6764k1623m1990O586
$$ y = [2160648, 2112940, 2133955, 2209290, 2310054, 2412198, 2523149, 2587034, 2595111, 2581976, 2517190, 2462052, 2400544, 2255330, 2188998, 2184578, 2212788, 2231099, 2222655, 2206986, 2173745, 2101427, 1982389, 1856297, 1750351, 1676785, 1677529, 1714129, 1744728, 1770544, 1840169, 1932634, 2046029, 2174914, 2292946, 2400973, 2518743, 2611253, 2651565, 2658739, 2658841, 2625584, 2521238, 2366983, 2218329, 2122365, 2071450, 2041345, 2034807, 2050711, 2059468, 2076981, 2079577, 2062392, 2004724, 1909956, 1853223, 1878758, 1925274, 2008424, 2035046, 1999016, 1952827, 1913570, 1872081, 1756800, 1622509, 1494022, 1400049, 1369676, 1361284, 1346402, 1359185, 1440623, 1556479, 1626905, 1681872, 1677535, 1705347, 1784360, 1812448, 1884708, 1984984, 2088345, 2187034, 2266041, 2319800, 2336564, 2314941, 2272951, 2279537]
9567B279537M0446Q4315J98374K41852K13335J48022O2049N232p9647j76783k42956
9556B773776k29198k13101o9317K4851O1875P8182J33800N8956P197l8673j31363
9545B456985j95522j83682j71006j21253j10561q5705j6578M5706M5693R1263
9535A755340J01216J03868J16854J02798P1335N2562O553j3858j9871l1163l7290
9524B208344k8966K440P1731K16647L43688M61083N63706N90839N25807M59332
9514E414651L48164K14711K2780k39358l87807l75409k68774j91436j52706p9670
9504D305146l1482O0407P3183l6277j53914k03520k54437k63180k82858l04248
9494B908820k98773k60035j78247j36662n6535J6139M4773P5134R3559Q4863M0005
$$ y = [2279537, 2319983, 2404298, 2602672, 2844524, 3057859, 3205881, 3267930, 3273162, 3193515, 3016732, 2773776, 2544578, 2331477, 2262160, 2287011, 2348886, 2427068, 2560868, 2619824, 2627021, 2588348, 2456985, 2261463, 2077781, 1906775, 1785522, 1674961, 1589256, 1572678, 1618384, 1664077, 1755340, 1856556, 1960424, 2077278, 2180076, 2251411, 2303973, 2310526, 2296668, 2276797, 2245634, 2208344, 2179378, 2181818, 2253549, 2470196, 2813884, 3274967, 3838673, 4429512, 4955319, 5414651, 5762815, 5977526, 6000306, 5760948, 5373141, 4997732, 4728958, 4537522, 4384816, 4305146, 4273664, 4334071, 4407254, 4370977, 4217063, 4013543, 3759106, 3495926, 3213068, 2908820, 2610047, 2350012, 2171765, 2035103, 1978568, 1994707, 2039480, 2114614, 2208173, 2293036, 2333041]
9483B333041L6177P892J4873k8707o1184m1846N1850J95114L20721L82074M28101
9472C638106M36441M71693M76169M46815L97548L07331J95213K9599n4501r2793
9462F251621j03397j93900k86306l05941j91346j19533j14508j66222j39660j60312
9452D470496k78936l22914l60766l49620l14444k40110k19974j86843j19799j22862
9442A954228o1630m3742k1761k785j4080J6748L4794M2332M2332Q9078J13020
9431B148534J84900K93077L65731M10318M18245M14552L94821L69924K92809J67505
9421E460416P2319k0824r6316r6565j01633q7894j23589r0894j21905q7729j13931
9410D591455j78945k28773k46160k91358l60735l16680k92665k85909k78314k19520
$$ y = [2333041, 2369218, 2377110, 2391983, 2363276, 2302092, 2260246, 2312096, 2507210, 2827931, 3210005, 3638106, 4074547, 4546240, 5022409, 5469224, 5866772, 6174103, 6369316, 6398915, 6344414, 6251621, 6148224, 5954324, 5668018, 5362077, 5170731, 5051198, 4936690, 4770468, 4630808, 4470496, 4191560, 3868646, 3507880, 3158260, 2843816, 2603706, 2383732, 2196889, 2077090, 1954228, 1892598, 1848856, 1827095, 1824310, 1810230, 1826978, 1861772, 1904104, 1946436, 2035514, 2148534, 2333434, 2626511, 2992242, 3402560, 3820805, 4235357, 4630178, 5000102, 5292911, 5460416, 5532735, 5511911, 5415595, 5319030, 5217397, 5129503, 5005914, 4915020, 4793115, 4705386, 4591455, 4412510, 4183737, 3937577, 3646219, 3285484, 2968804, 2676139, 2390230, 2111916, 1892396]
9400A892396j31859p5921j34901m8493j686o3117m3246m8193m2964k5229j2151
9389A264636J9769K3470O9607Q9913N4737J55155K41107K84087L08714L45165
9379B856360L74694M07949L68484K44813R7828l8617j40039j61736j84674j69842
9369C655220j46107j03326o4288l5381J1916j6785j10807k35158k81928l17622
9359B355734k70174k22722k19534k05351j34775j03734p8561m0223j9197k3267
9349A038196l2550n2906l0291k3870k5538R35l0823n5209j3737k7426k4985M6848
9337G68644N2429N2949Q0668J00364J39771J92956J84023J71174J20592P7380
9327A940950L6743k131o7908j39386j21943q7768p2432m3280j4966K405R03m6852
$$ y = [1892396, 1760537, 1684616, 1549715, 1501222, 1499536, 1436419, 1393173, 1344980, 1302016, 1276787, 1264636, 1284405, 1307875, 1377482, 1467395, 1522132, 1677287, 1918394, 2202481, 2511195, 2856360, 3231054, 3639003, 4007487, 4252300, 4350128, 4311511, 4171472, 4009736, 3825062, 3655220, 3509113, 3405787, 3341499, 3306118, 3318034, 3301249, 3190442, 2955284, 2673356, 2355734, 2085560, 1862838, 1643304, 1437953, 1303178, 1199444, 1120883, 1080660, 1061463, 1038196, 1005646, 952740, 922449, 898579, 873041, 873976, 843153, 787944, 774207, 746781, 721796, 768644, 821073, 874022, 954690, 1055054, 1194825, 1387781, 1571804, 1742978, 1863570, 1940950, 1977693, 1975562, 1907654, 1768268, 1646325, 1558557, 1486125, 1442845, 1427879, 1430284, 1431187, 1384335]
9315A384335o6658j14781j15363j22187j05408n6670o0091p1057q3338l1255j5205
9304E42322r874q861j1669l0370k8910J2240q485j3869m655L528R419r544j0565
9291D30707j3514J6518j1103k9053O986M7112N1210M1966K9499J8920J5825L1991
9279F37064J3603j581l6464m5366k4582n7571m4591l6257j4159k4521o275n0987
9267C08313j6780K509J5483j3876k2656j5668J2917K297R820J4596j1199m322
9255B81434m081l122J7943n952R083P353J5560N881k663J9781J0466N119J1666
9242C68468k1766j5566L5213K6652K1919K194K5630k0824r496p3P568Q307j7042
9229D11184k6962l8564k7293j1033l349j1746k8876K8838K0282l1149l3122k051
$$ y = [1384335, 1317677, 1202896, 1087533, 965346, 859938, 803268, 743177, 672120, 588782, 557527, 542322, 532448, 523587, 511918, 481548, 452638, 464878, 456393, 442524, 437869, 441397, 450816, 441272, 430707, 417193, 433711, 422608, 393555, 400541, 447653, 498863, 540829, 570328, 589248, 605073, 637064, 650667, 649086, 612622, 567256, 542674, 485103, 440512, 404255, 390096, 365575, 359300, 308313, 291533, 294042, 309525, 295649, 272993, 257325, 270242, 272539, 282359, 296955, 285756, 281434, 277353, 274231, 292174, 286222, 295305, 302658, 318218, 324099, 321436, 341217, 351683, 356802, 368468, 346702, 331136, 366349, 393001, 414920, 417114, 442744, 421920, 412424, 412351, 419919, 428226, 411184, 384222, 345658, 318365, 307332, 303983, 292237, 263361, 292199, 312481, 281332, 248210, 246159]
9217B46159j5160l2524M9238L387l277j788k1509k498q549k2183j0280J685J4008
9204A96709J1410K8604M301k2079j589J7760J141L896j2584P749K258K4900J1807
9191B74283L7099M5889L2175K8037J2617L6671k0547j8691j7056l8619k2410J757
9179C51205j2157j8926j3902k6105k864j7858J2973K1008n655R3j5047r363J3907
9166B77309K1187q58P695k1971K438L703M868L65m7874k6815K2175J3880L9461
9153B95563J1893K359J6880M677l971j3685m3374J3363K8120l1500l2968J0005
9141B57362J6956o421k3739R705l487j325L6723l343k5667P64m55M120k4260k8219
9127B08714l637k7155K669J3688R016j9811j4786L0249J3993M595k0763j0705
$$ y = [246159, 230999, 198475, 247713, 251100, 247823, 246035, 224526, 222028, 213479, 191296, 181016, 182701, 196709, 208119, 236723, 241024, 218945, 217356, 235116, 236257, 240153, 227569, 235318, 237576, 262476, 274283, 311382, 357271, 389446, 417483, 430100, 466771, 446224, 427533, 410477, 371858, 349448, 351205, 339048, 320122, 306220, 280115, 277251, 259393, 272366, 293374, 287719, 287812, 272765, 263402, 277309, 298496, 297638, 305333, 283362, 285800, 289503, 294371, 294736, 246862, 220047, 242222, 256102, 295563, 307456, 309815, 326695, 331372, 327401, 313716, 270342, 283705, 311825, 280325, 247357, 257362, 274318, 267897, 244158, 253863, 250376, 249051, 285774, 282431, 256764, 257528, 257073, 261193, 236933, 208714, 205077, 177922, 180591, 194279, 203295, 183484, 168698, 198947, 212940, 217535, 196772, 186067]
9115A86067J3459J3659J836r904j1484j3319l15o093P045L0186J497r818K5359
9102B28175J7026n5125m4919j895L1940K4767K03N163J1362J3383J31j2207r481
9089B08523l337j4258M556m62L2246J1380o241o267P706j4686j9339j8454j2007
9076A69360J6381L480P399m77J3366j15J4318p445m1423J7363N566j1114K9828
9063B16487l985J0019K689K8630P523j410l2811k1951P347J5100j1728M437J6426
9050B36773j3971M355l7725n711K1404N155k5343k708M534l1747J1775R600J285
9037A77676N1007J1110J1289n91K0622L491l062j8012l9068P295j1697m657J1388
9024B16791j064P047l186m559j3683R736k6430O109K1973R040l18j4720K8084
$$ y = [186067, 199526, 213185, 215021, 205117, 193633, 180314, 179999, 173906, 180951, 211137, 212634, 202816, 228175, 245201, 190076, 145157, 143262, 175202, 199969, 200172, 205335, 216697, 230080, 230211, 218004, 208523, 205186, 190928, 195484, 195022, 227268, 238648, 232407, 226140, 233846, 219160, 199821, 181367, 169360, 185741, 189221, 196620, 196143, 209509, 209394, 223712, 216267, 174844, 192207, 197773, 186659, 216487, 212502, 222521, 225210, 253840, 261363, 259953, 227142, 205191, 212538, 227638, 215910, 220347, 236773, 222802, 227157, 189432, 183721, 205125, 210280, 184937, 182229, 186763, 155016, 166791, 176391, 177676, 228683, 239793, 251082, 250491, 271113, 274604, 271542, 253530, 214462, 221757, 210060, 205403, 216791, 215727, 222774, 219588, 215029, 201346, 211082, 184652, 190761, 212734, 221774, 221456, 206736, 234820]
9011B34820K9844J8082K5122N520K4011L3636L3205N441J4322J756J3739p477
8999D32021J5176j488p241K1108L3201j6034n4409l7807j7515m977J09k5570k9163
8986C07411k6787k6053j5943k3897k4813k1847K2792M7384K0741J951k291j1918
8974B46730j1752m635k842j8797j7324m330k8047O05K8989J6825J6139L7873L1942
8961B91376K7126J8554J9176K2555K439J324N7448O1508O3389P8630N5353J2950
8949G11828L5137J4386m6858r1685p6117m3749m5948n6870o5408m7006k6899m870
8937B55941k8813k7994j2438r480l5529j7041J0196j2476k5407J263M7053o706
8925A38569r516l5296J9452K6422R653k883j7671Q926r14r160j770k7058j796
$$ y = [234820, 264664, 282746, 307868, 313388, 337399, 371035, 404240, 409681, 424003, 425759, 439498, 432021, 447197, 445709, 438468, 459576, 492777, 476743, 422334, 384527, 367012, 362035, 362144, 336574, 307411, 280624, 254571, 238628, 214731, 189918, 168071, 190863, 238247, 258988, 260939, 258648, 246730, 234978, 230343, 227501, 208704, 191380, 187050, 159003, 159608, 188597, 205422, 221561, 259434, 291376, 318502, 337056, 356232, 378787, 381226, 382550, 439998, 501506, 564895, 643525, 698878, 711828, 746965, 761351, 714493, 622808, 546691, 502942, 456994, 400124, 334716, 287710, 260811, 255941, 227128, 199134, 186696, 177216, 141687, 124646, 134842, 122366, 96959, 98222, 145275, 138569, 129053, 93757, 113209, 139631, 149284, 146401, 128730, 137656, 136742, 127582, 125812, 98754, 96958]
8912I6958j301k4647J1576J1599J7017J9576Q818j074k768J2714J7003L3023N2542
8899B51036L9969L7843j696l572L0302o104J8528k5166n8866q0391k4377Q811
8887A86317J3701j444j4217m2890k1501J3671q748l8716J0144M397l0622l2956
8875C7136P479R980J0318P811J8900k2714J028J6059n987j2036J8025p074k7937
8862E0988j9377J0444q676P904l42j1950j478P497Q067l3953M178L3674m817R141
8848E1300L5354J1542j6194j3843j5710J0611L0112k748j9806k104R045j5734
8836F1825k9347J7162J335j5825K698j9281k1604m2727L4529K6163J034k1914
8824e952kN153L419J1983j84k9217q021J8695K5078P918p014r322j4111P880j1015
$$ y = [96958, 95657, 71010, 82586, 94185, 111202, 130778, 139596, 138522, 135754, 148468, 165471, 198494, 251036, 291005, 328848, 327152, 323580, 353882, 347778, 366306, 341140, 282274, 201883, 177506, 186317, 200018, 198574, 184357, 141467, 119966, 133637, 124889, 86173, 96317, 100714, 70092, 37136, 44615, 54595, 64913, 72724, 91624, 68910, 69938, 85997, 80010, 67974, 85999, 78925, 50988, 31611, 42055, 33379, 41283, 40941, 28991, 27513, 35010, 43077, 9124, 13302, 46976, 42159, 51300, 86654, 98196, 82002, 68159, 52449, 63060, 93172, 90424, 70618, 68514, 77559, 61825, 32478, 49640, 50975, 35150, 37848, 18567, -3037, -45764, -11235, 14928, 15962, -5952, -5954, -801, 2618, 14601, 14417, -14800, -22821, -4126, 20952, 28870, 21856, 12534, -1577, 6303, -4712]
8809d712O469J1126K6728j3106Q505J1124k5288N091p282J2852N5083l7120o4660
8796a5190L77L2349J5602L3288k955p920j1575J6048m07l5112m0198Q90K0326
8783E523K3916K1639j5692l4210Q182L63J0679j1321Q718R406j9438o871l3265
8770c2371k409K3898L299j937J4504j9396k6579M1589J4300R448R468j9640L169
8757A7343J181k3795J3703N5287K5873K0265r022r209N619K3330j5584j823k5657
8744G7511m5258P843k364j5509m740K1952L217j3091Q377J2427r250J6470r669
8731D7916m607J5155J321L690j0882R593J4714q744k0115j3334j5335j7221O82
8718B833Q339j8034K454q701K3383K0486q506K4069M108J5450L8944k5873N939
$$ y = [-4712, 1757, 12883, 39611, 26505, 35010, 46134, 20846, 25937, 18655, 31507, 86590, 49470, -15190, -14813, 17536, 33138, 66426, 63471, 55551, 43976, 60024, 59617, 24505, -15693, -14803, 5523, 29439, 51078, 35386, 1176, 9358, 9721, 20400, 9079, 17797, 27203, 7765, 894, -32371, -34780, -10882, -7583, -9520, 4984, -14412, -40991, 598, 14898, 24346, 33814, 14174, 17343, 18524, -5271, 8432, 63719, 89592, 109857, 100835, 91626, 97245, 120575, 104991, 103168, 77511, 32253, 40096, 37732, 22223, 17483, 39435, 42652, 29561, 37938, 50365, 41115, 57585, 47916, 43309, 58464, 59785, 63475, 52593, 62186, 76900, 68156, 48041, 34707, 19372, 2151, 2833, 11172, -6862, -4408, -13109, 10274, 30760, 22254, 46323, 50431, 65881, 104825, 78952, 84891]
8705H4891J6853J0476K9770k6257l0430j4964j2517K4298l8306j6068j628L756
8693B9874K0752J8824J3116k1258R070N467k6776l2874j025J6843K7862J5907
8681G5782N525n300j6095m020M783k9292k17j4005J2107J0885K842j6739k227
8668B4029O1m485L1712J0478j2020k7288L531k4564J2722K5550J3590J1647p233
8655E7730p77O715O366j2940P422J248p517J5743J4141k8381k1217j6572K2652
8642D4613J1116j0185J3185P68o428Q818J4573r294J8707O168N501K71j8754k4971
8628E4088n930j459l098q99j3430j0162J401J0009M3J5036M3559k6911k7221K1287
8614E6313k27k1430K2934J4665M0367K0220l8068l6932M900k852o269j9022j4643
$$ y = [84891, 101744, 112220, 141990, 115733, 85303, 70339, 57822, 82120, 43814, 27746, 26118, 29874, 50626, 69450, 82566, 61308, 70378, 75845, 49069, 16195, 15170, 32013, 59875, 75782, 81307, 76007, 59912, 55892, 60675, 31383, 31166, 17161, 29268, 40153, 42995, 26256, 24029, 24090, 19605, 51317, 61795, 49775, 22487, 26018, 1454, 14176, 39726, 53316, 64963, 57730, 56953, 63668, 70034, 57094, 64516, 65764, 58247, 73990, 88131, 59750, 38533, 21961, 44613, 55729, 45544, 58729, 59497, 53069, 61887, 76460, 67166, 85873, 92041, 97542, 97813, 79059, 54088, 48158, 46699, 43601, 42702, 29272, 19110, 20511, 30520, 30563, 45599, 89158, 62247, 35026, 56313, 56086, 34656, 57590, 72255, 112622, 132842, 94774, 57842, 62742, 59890, 53621, 34599, 19956]
8601A9956N8668J4071o257L791M651R932Q702j1613l8266k2781J1456R112j1703
8588D9719J2528n430J077M360J3064J7274k650k6625P28k1000L588O377K1322
8575G4332o316J9532J6851j1453r41R828L1914m53j8129k5991j165O588q80J8435
8561A12152M3959L2758J005J0783K632L9466N5298L8173O589j4541l3706q369
8549B86199j7879j6470l5395k9434j9083k0727l7157j5931l67j5375r675k0404
8537D8302L1502K7288j7359k2200j8813q86p166K7201l672k0621L866q412J64
8524C9194K8838j3625j8642j0231o880M26M540J7249J2593L658J9485M6411K1707
8511A44723J6640J1106O441J0506r892k5672l7310k5235k0466n839j4455k7478
$$ y = [19956, 78624, 92695, 86438, 90229, 94880, 104812, 113514, 101901, 63635, 40854, 52310, 61422, 49719, 62247, 56817, 57894, 62254, 75318, 92592, 89942, 63317, 64045, 43045, 46633, 53010, 74332, 68016, 87548, 104399, 92946, 92005, 101833, 133747, 133294, 115165, 89174, 88009, 94597, 93717, 112152, 156111, 188869, 189874, 200657, 203289, 242755, 298053, 336226, 342815, 328274, 294568, 286199, 268320, 251850, 216455, 187021, 167938, 147211, 110054, 94123, 93756, 78381, 68706, 48302, 79804, 107092, 89733, 67533, 48720, 47834, 40668, 67869, 64197, 43576, 47442, 39030, 39194, 68032, 54407, 35765, 25534, 18654, 19080, 23620, 40869, 53462, 57120, 76605, 123016, 144723, 161363, 172469, 178910, 189416, 179524, 153852, 116542, 91307, 70841, 65002, 50547, 23069]
8499B3069k951M653o349P219L830J1101O931k213q167K632k4562k2672L9227K4868
8485E6616m1585l0116J0917k938q484j6371J4590O210j0106J624L3019L799J5297
8472C2472j1204n336k401m635k1159j9262L961J2503J3190o932l5207p618M6508
8459e120J2745K8377L651l8355j514O361j9387K113p739K8633N195j7327j6736
8446a9103J0224J1027J5084Q352K3309L258m5391o174q413l818L992j792J3081
8433C636j9725j477p58J4478N127K580l2280j8430J40O81K0154J9806K2177R541
8419B5650k047m406k5779j2948m423m2601j5242J5631J5203K0060k874J1721L9962
8406A7907k7978k2777L6694J7995j9173o923l293k3494k0069o286K8854q80J0859
$$ y = [23069, 20118, 24771, 18422, 25641, 29471, 40572, 47503, 45290, 37123, 39755, 15193, -7479, 31748, 56616, 15031, -15085, -4168, -7106, -15590, -31961, -17371, -11161, -21267, -19643, 13376, 17175, 32472, 21268, 15932, 13531, 8896, -12263, -31525, -27564, -15061, -1871, -8803, -44010, -51628, -5120, 7625, 36002, 39653, 1298, -216, 6145, -13242, -11129, -18868, 9765, 14960, -2367, -19103, -8879, 2148, 17232, 25584, 48893, 52151, 6760, 586, -7827, -11645, -7653, -9445, 3636, -16089, -17566, -18324, -3846, 1281, 3861, -28419, -46849, -46709, -46028, -25874, -6068, 16109, 25650, 23603, 19197, -6582, -19530, -23953, -66554, -81796, -66165, -50962, -30902, -33776, -22055, 17907, -10071, -32848, 3846, 21841, 2668, -4255, -7548, -31042, -51111, -57397, -28543, -29423, -18564]
8393a8564L2793K9053q355k1705k5619j7471l1679J0011J1665J3167n955j711
8381c4370J1047K0149K1528m150k6969N150Q303J1159R262n392l2878J0305L2098
8368B5242j9763k8983N79J5435r516J8756J1128j4214m362J3464n065l154K0455
8355B0002r522k2765n265P043p099J9864N388p442M752L878p930j2165K0152K118
8341A1009O626L281j8521k5427q604K002m214j5121Q32J7276N320J597r133l849
8327c6926KJ9252J3026n814m863J090l4168M878P765j0527j8705L1585K4567J1953
8313C115l475j0434k2569M827j5441L151K5445J272k3882k9205J1910J1349L6222
8300g715N7171q185m7221k5525k8019K891p243j1141j3737K0620K0280J5357K2272
$$ y = [-18564, 14229, 43282, 34927, 13222, -12397, -29868, -61547, -51536, -39871, -26704, -32659, -34370, -23323, -3174, 18354, 14204, -12765, -7615, 688, 11847, 21109, 15717, -17161, -6856, 25242, 5479, -23504, -22925, -7490, -17006, 1750, 12878, -1336, -5698, 7766, 2701, -453, 20002, 10480, -12285, -17550, -10507, -17606, 2258, 7646, 204, 4956, 8834, 904, -11261, 8891, 11009, 17635, 20916, 2395, -23032, -31636, -29634, -33848, -48969, -48137, -30861, -25541, -23944, -33077, -36926, -36924, -17672, -4646, -10460, -15323, -14233, -48401, -43523, -35758, -46285, -64990, -33405, -8838, 3115, -360, -10794, -33363, -28536, -43977, -40826, -15381, -14109, -37991, -67196, -55286, -43937, -7715, 49456, 41271, -5950, -31475, -59494, -56603, -63846, -74987, -88724, -68104, -47824, -32467, -10195]
8287a0195j1558K414J8924k9623m946M2530K1617Q852O587j1797M041K276L054
8274D2176j5844l9890R31j248o894P667Q463J6555j7049k8560L868N0873J8177
8261C9225j0373j1867m9083l8260p500K6682L65p746j0516K5418N032J6270K8727
8248F374J1088j3772J539N839l4743n491J3426J3358l378n796J336P627j0860
8235a3453m199k575J1508J03J6228L46m59n46J416p611J3045l3181k9848p529
8221e6755J9670L4059L857Q151k124j6524r152r597Q090N136R840n69q700K6135
8207A1517J322m294m167k9319j5325p37j0635L572P845k1606k9344J4124K2509
8194e4538r925j933J8019L0085k1138k2224J5292K7114O837Q878j2369p662J2471
$$ y = [-10195, -21753, -19339, -415, -30038, -34984, 7546, 29163, 38015, 44602, 32805, 36846, 39122, 42176, 26332, -13558, -12627, -13875, -20769, -13102, -4639, 11916, -5133, -33693, -29825, 21048, 39225, 28852, 16985, -32098, -70358, -77858, -51176, -50811, -58557, -69073, -43655, -38623, -22353, 6374, 17462, 3690, 5229, 11068, -23675, -29166, -15740, -2382, -5760, -11556, -10220, -2593, -13453, -17652, -20227, -8719, -8616, 7612, 7958, 7499, 6953, 8369, 758, 13803, -19378, -49226, -56755, -37085, -3026, 831, 8982, 6858, -9666, -18818, -28415, -20325, -15189, -5349, -5918, -14618, 11517, 12839, 8545, 4378, -24941, -40266, -41003, -51638, -48066, -40221, -61827, -91171, -77047, -54538, -64463, -66396, -48377, -18292, -39430, -61654, -46362, -19248, -12411, -3533, -15902, -23564, -11093]
8181a1093j0220k1856j1896m754K27L0864O915P104L385j2187p5N839r751j4518
8167d2016L3115J5688n127r142J3254L197j5369j8869m877J0086n019j7156J0942
8154c1293K5309N763k1190j0402q070Q709J0418L0166j1959L640l3873l5656P196
8141f1242L7973K7657Q24q328n25K1354J2773k1234j6640j6674j2118J373j0218
8128d5025J5030K0071J6542M815l1274k8349K1273K5979l742q364Q281J1851j1121
8115d033k4845r150j7313r988n46L1426K8553J9556k0619k9666r373k2981K53
8102f8726M716J0469J7003J9901R246M525l375k174k5100J5356J7460r50k9042
8089c0691j1162n321J8321J4657r526k4611k157R1N814P992k1156m454J9860L264
$$ y = [-11093, -21313, -43169, -55065, -59819, -59592, -28728, -21813, -14709, -11324, -23511, -23586, -17747, -27498, -42016, -8901, 6787, 1660, -7482, 5772, 8969, -6400, -25269, -30146, -20060, -25079, -42235, -31293, -5984, -221, -21411, -31813, -39883, -31174, -20756, 9410, -2549, 1091, -32782, -68438, -61242, -23269, 4388, 5212, -3116, -3641, 17713, 30486, 9252, -7388, -24062, -36180, -34807, -45025, -29995, -9924, 6618, 11433, -19841, -48190, -26917, -938, -4680, -13044, -4763, 7088, -4033, -28878, -38028, -55341, -65329, -65875, -34449, -5896, 13660, -6959, -36625, -45998, -68979, -68726, -64010, -53541, -36538, -16637, -7391, -2866, -6241, -8415, -33515, -18159, -699, -1649, -30691, -41853, -47174, -28853, -14196, -23722, -48333, -50490, -50399, -44585, -36593, -57749, -62203, -42343, -39079]
8075c9079K784n809J9283J5315J1881k4076l1133L0726K764R369L848m476J4396
8062E793k3396n204M89k8148L641R462K6798J4819j8792j5967k2168L2551K1781
8049A659k3009m1319O972K6198m864J7740J9903j5740j0927j2054M344K3443J965
8036e689p940K795p81K6593j2028k865L876K1542k960K6500L3199k4507n940L857
8022E5652j1020k3481Q182N718p387J2494m97l9238l6474J644J0405p709K794
8009b8917J0628K0164L2148J3114m114j1512N683q327p079O610j8183j858l6643
7996b8286L8250K9674j210j3457J0700l3193k028l126J291K0022K1660J0748j4083
7983C6962q942j3488Q178j957J3845j9506k7212Q550K4325J5098j2119Q149N284
$$ y = [-39079, -36295, -42104, -22821, -7506, 4375, -19701, -50834, -20108, -17344, -7975, -4127, -8603, 5793, -17603, -22807, -22318, -50466, -46825, -37363, -10565, 4254, -14538, -30505, -52673, -20122, 1659, -21350, -62669, -55697, -29499, -34363, -16623, 3280, -12460, -23387, -35441, -31097, -7654, -5689, -13629, -10834, -11615, 14978, 2950, 85, 3961, 25503, 22543, 49043, 82242, 57735, 51795, 55652, 44632, 21151, 29333, 35051, 27664, 40158, 39661, 423, -36051, -34407, -24002, -31711, -28917, -18289, 1875, 34023, 47137, 43023, 31511, 37194, 28867, 21788, 28398, 10215, 8357, -28286, 9964, 39638, 38428, 24971, 35671, 2478, 450, -2676, -1385, 18637, 40297, 51045, 36962, 28020, 14532, 22710, 20753, 34598, 15092, -12120, -3570, 20755, 35853, 23734, 31883, 37167]
7970C7167n671J595n18p169J0119k1149M525K784m682L1438J6113L129K0274o851
7956H1104P012k1198j6776q666k4389j2846K1412k86k6117Q482j881J4174L8221
7943E8246l809k6271L311j0353J3453J4393l2331m708j4845J5442K6017k7456
7931A1089k602J842J007K988Q506K0000J4621j150o4j6175l158j4994M739K8927
7917E5576J2640K9731j1670l0881k597j438l768k7368J2962R404j431M918j7289
7904B8789Q580J6385j4053k9003o937K0569j1684O011R233k089k9175p301J2679
7891B004k8514j3442J1214N676J2791J6159M360J5147R332k0837L606J2036l0810
7878a278k7863K53K5145K0397K3533K6007j3750j5987m1014j4127K7107K0715
$$ y = [37167, 31496, 33091, 32573, 25404, 35523, 14374, 18899, 21683, 17001, 48439, 64552, 67681, 87955, 81104, 88116, 66918, 50142, 41476, 17087, 4241, 25653, 25367, -750, 7732, 5851, 20025, 58246, 54437, 28166, 31477, 21124, 34577, 48970, 16639, 11931, -2914, 12528, 38545, 11089, 8487, 10329, 11336, 14324, 22830, 42830, 57451, 56301, 56237, 40062, 36904, 21910, 26649, 55576, 68216, 97947, 86277, 55396, 52799, 51361, 47593, 20225, 33187, 42591, 41160, 46078, 28789, 37369, 53754, 39701, 10698, 3761, 24330, 12646, 18657, 27890, 25801, -3374, -10675, 2004, -26510, -39952, -28738, -23062, -10271, 5888, 10248, 25395, 34727, 13890, 17496, 29532, -1278, -29141, -28888, -3743, 16654, 40187, 66194, 52444, 36457, -4557, -18684, 8423, 29138]
7866B9138l288O697q938j9385O016M651j0054l5150k5098j0077J606L0014J0024
7853b3844r005J978o911R495N698k099j3624j2231k000K3488J0392j0700j612
7840c0975R22N703P534J156o751j0418J0734O717K1228k640k2167K0186o587J70
7826e188J3055Q659N746j1069j7062Q385j3069K481m831M378r331o334K7750m772
7812a202j7111N582O728J6210k0779j7925O282J1630k2972k3765L2253M1270J6270
7799C2471l821l2281p641q791j2673r847j3208J0094L5049J7229j5932k9909l387
7786d2647L2339M164k8018J1506K2627m14l6409j7788J3505K9528j4846r967L100
7773c3320J7778j4672M85j8032l281J0060J5928J4207K5291J5238j874j6443k2093
$$ y = [29138, 25850, 32547, 23609, 4224, 10240, 14891, 4837, -30313, -55411, -65488, -63882, -33868, -23844, -32849, -30871, -37782, -28287, -22589, -24688, -38312, -50543, -52543, -29055, -18663, -29363, -30975, -30053, -24350, -16816, -15660, -22411, -32829, -22095, -15378, 5850, 3210, -18957, 1229, -5358, -5188, 7867, 16526, 22272, 11203, -5859, 2526, -10543, -8062, -12893, -8515, -17846, -24180, 3570, -1202, -18313, -12731, -6003, 10207, -10572, -28497, -22215, -10585, -33557, -57322, -25069, 16201, 32471, 28650, -3631, -11272, -20063, -32736, -42583, -55791, -45697, -10648, 6581, -9351, -39260, -42647, -10308, -6144, -34162, -22656, -29, -443, -36852, -54640, -41135, -11607, -26453, -36420, -33320, -15542, -30214, -29729, -47761, -51042, -40982, -25054, -10847, 14444, 29682, 27808, 11365, -10728]
7760a0728K241j3217k024N159M3821J2799l6457J1914J1858n188l3117j7505K54
7747c0190R603Q698r823O475J6917J8899N222n491j2556L396j7598l955R926J4269
7733A3792L324L1483M422k3686l274n2412k9171P43n497J2239Q072J4116P946
7720a7903n016k2389K437P801j188Q247J036j8704q007L8083K2124n368j0554
7707i401j4283k7817J5426M9570J214k0681l929k1060J044p657k8111l797N97
7694f8885J5939j5201O41J0537K0002m284k2094Q787o929J6167K7572L366l546
7681a7928J9855Q529J1055K132j2028j5430j3924j0811J0518R855P613j1769J2089
7668b44J6763n37l9203n2146J610K2186K21r00K3756k865k4963N743K9232J5733
$$ y = [-10728, -8487, -21704, -23728, -18569, 25252, 38051, 1594, 13508, 25366, 20178, -12939, -30444, -30190, -20587, -11889, -21712, -15237, 1680, 20579, 25801, 20310, 7754, 11150, -6448, -10403, -477, 13792, 17116, 48599, 53021, 29335, 26061, -26351, -55522, -54779, -60276, -48037, -39965, -25849, -17903, -22919, -45308, -42871, -35070, -36258, -28011, -26975, -45679, -53686, -15603, 6521, 1153, -9401, -23684, -51501, -36075, 13495, 14709, -5972, -9901, -30961, -29917, -37574, -65685, -69482, -68885, -52946, -68147, -67506, -56969, -36967, -41251, -63345, -54558, -61487, -45320, -17748, -14382, -17928, 1927, 10456, 21511, 23643, 11615, -3815, -17739, -28550, -18032, -8177, -564, -12333, -244, 16519, 15982, -23221, -75367, -73757, -51571, -51350, -52250, -28494, -31359, -56322, -50579, -21347, -5614]
7654e614J3079k3326l2888m441K0664J3163Q109j9407P662L8383j86k3578n887
7641a4267k079J1168J9641J4738j8403j8837K9299L181k0580n0358J2695L4902
7629A100O397k4871j4087K057L415L335K713J6940l81l4063k4066J0469J0920
7616d0122l987j0158J8858J4680Q613p15J1817K2751P583N705j7349k4801j1757
7603a8882K272n2783j8510J3549L0915K4149K4804r022l4803R701J4532o011J6762
7590c327K6002r65K9L743j7105k5693J4518R403J326j0038j5597j4946p938J1608
7576b8980J569n581P245J2775k649K017R150j2657m0714M066L6854K2271r313
7563c947m316n209l994O405J571r473j0254k9337J2297J234k3780J0075K3659
$$ y = [-5614, 7465, -15861, -48749, -53190, -32526, -19363, -11254, -30661, -22999, 15384, 15198, -8380, -14267, -16346, -5178, 14463, 29201, 10798, -8039, 21260, 24441, 3861, -46497, -33802, 1100, 7497, -17374, -31461, -29404, -25989, -22654, -19941, -3001, -3382, -37445, -61511, -51042, -40122, -44109, -54267, -35409, -20729, -12116, -12831, -1014, 21737, 29320, 35025, 17676, -7125, -18882, -16610, -69393, -87903, -74354, -43439, -19290, 5514, -3508, -38311, -28610, -14078, -20089, -3327, 22675, 21710, 21739, 25482, 8377, -17316, -2798, 6605, 7931, -2107, -17704, -32650, -40588, -28980, -27411, -32992, -25747, -12972, -15621, -13604, -4454, -17111, -57825, -53759, -16905, 5366, -3947, -8263, -13472, -17466, -11061, -9490, -18963, -29217, -58554, -46257, -45023, -68803, -58728, -35069]
7550c5069N710J7145k6153k4048J8314J7419J8875J4523J2475p839m8304k5484
7538f2436n126L3535J0206K9059p947l5159k820P326n707m166J1990j690r019
7525d1954J999J6194J0104p643r422n982p567P122qk8292j937M9676j2401k2929
7511e3040K8256n175K966P156j6328j2748K381J3751K9062J1274k3951j9111Q342
$$ y = [-35069, -29359, -12214, -38367, -62415, -44101, -26682, -7807, 6716, 19191, 11352, -36952, -62436, -67562, -34027, -23821, 5238, -2709, -37868, -40688, -33362, -39069, -43235, -31245, -32935, -41954, -39955, -23761, -13657, -21300, -30722, -36704, -44271, -37149, -37157, -65449, -67386, -17710, -30111, -53040, -24784, -29959, -26993, -19837, -36165, -48913, -46532, -32781, -3719, 7555, -16396, -35507, -27165]
$$ [...]
##END NTUPLES=NMR SPECTRUM
##END=
