##TITLE=Analysis number 314097
Compound Code km 00452
Project Code adrs
Chemist Name fudan
##JCAMPDX= 6.0         $$ Bruker NMR JCAMP-DX V2.0
##DATA TYPE= NMR SPECTRUM
##DATA CLASS= NTUPLES
##ORIGIN= Bruker BioSpin GmbH
##OWNER= NMR
$$ XWIN-NMR		Version 3.5
$$ Wed Oct  5 14:35:42 2005 GMT Daylight Time (UT+1h)  MAYBRIDGE\NMR@NMR_250MHZ
##.OBSERVE FREQUENCY= 250.131544655141
##.OBSERVE NUCLEUS= ^1H
##.ACQUISITION MODE= SIMULTANEOUS (DQD)
##.ACQUISITION SCHEME= undefined
##.AVERAGES= 16
##.DIGITISER RES= 18
##SPECTROMETER/DATA SYSTEM= dpx250
##.PULSE SEQUENCE= zg30
##.SOLVENT NAME= DMSO
##.SHIFT REFERENCE= (INTERNAL, DMSO, 0, 16.5154)
##AUDIT TRAIL= $$ (NUMBER, WHEN, WHO, WHERE, WHAT)
$$ ##TITLE= Audit trail, XWIN-NMR		Version 3.5
$$ ##JCAMPDX= 5.01
$$ ##ORIGIN= Bruker BioSpin GmbH
$$ ##OWNER= NMR
$$ C:\u/data/dgb/nmr/ADRS/10490/pdata/1/auditp.txt
$$ ##AUDIT TRAIL=  $$ (NUMBER, WHEN, WHO, WHERE, WHAT)
(   1,<2005-10-05 14:35:24.48 +100>,<MAYBRIDGE\NMR>,<NMR_250MHZ>,
      <created by zg, POWCHK disabled, PULCHK disabled
       configuration hash MD5:
       62 19 C7 07 E1 42 D1 B7 37 6C 3D D0 77 39 F9 E6
       data hash MD5: 64K
       74 51 5A 70 62 3B A8 B0 06 91 02 E9 0C 20 63 F8>)
(   2,<2005-10-05 14:35:34.95 +100>,<MAYBRIDGE\NMR>,<NMR_250MHZ>,
      <Start of raw data processing
       ef LB = 0.3 FT_mod = 6 PKNL = 1 SI = 32K 
       data hash MD5: 32K
       B0 46 B0 82 04 4B F5 85 0A 9D 17 D8 11 2D 94 8E>)
(   3,<2005-10-05 14:35:36.66 +100>,<MAYBRIDGE\NMR>,<NMR_250MHZ>,
      <apk 
       data hash MD5: 32K
       34 CC C6 31 B9 37 C4 3C 1A BF E5 6F 96 50 7A CD>)
(   4,<2005-10-05 14:35:37.32 +100>,<MAYBRIDGE\NMR>,<NMR_250MHZ>,
      <abs ABSG = 5 
       data hash MD5: 32K
       58 C2 F6 F4 AF DA D7 18 6B 70 DE 4C F7 1A 9B 68>)
$$ ##END=
$$ 
$$ hash MD5
$$ 68 89 B4 E4 85 D8 34 69 D5 06 64 84 17 07 59 D0
##$RELAX= 
##$RELAX= 
##$RELAX= 
##$RELAX= 
##$RELAX= 
##$RELAX= 
##$RELAX= 
$$ Bruker specific parameters
$$ --------------------------
##$DU= <C:\u>
##$EXPNO= 10490
##$NAME= <ADRS>
##$PROCNO= 1
##$TYPE= <nmr>
##$USER= <dgb>
##$AMP= (0..31)
100 100 100 100 100 100 100 100 100 100 100 100 100 100 100 100 100 100 
100 100 100 100 100 100 100 100 100 100 100 100 100 100 
##$AQSEQ= 0
##$AQ_mod= 3
##$AUNM= <au_zg>
##$AUTOPOS= <40 >
##$BF1= 250.13
##$BF2= 250.13
##$BF3= 250.13
##$BF4= 250.13
##$BF5= 500.13
##$BF6= 500.13
##$BF7= 500.13
##$BF8= 500.13
##$BYTORDA= 1
##$CFDGTYP= 0
##$CFRGTYP= 5
##$CHEMSTR= <none>
##$CNST= (0..31)
1 1 145 1 1 1 1 1 1 1 1 1 1 1 1 1 1 1 1 1 1 1 1 1 1 1 1 1 1 1 1 1 
##$CPDPRG= <>
##$CPDPRG1= <>
##$CPDPRG2= <>
##$CPDPRG3= <>
##$CPDPRG4= <mlev>
##$CPDPRG5= <mlev>
##$CPDPRG6= <mlev>
##$CPDPRG7= <mlev>
##$CPDPRG8= <mlev>
##$CPDPRGB= <>
##$CPDPRGT= <>
##$D= (0..31)
0 1 0 0 0 0 0 0 0 0.06 0 0 0 0 0 0 0.0002 0 0 0 0 0 0 0 0 0 0 0 0 0 0 
0 
##$DATE= 1128519323
##$DBL= (0..7)
120 120 120 120 120 120 120 120 
##$DBP= (0..7)
150 150 150 150 150 150 150 150 
##$DBP07= 0
##$DBPNAM0= <>
##$DBPNAM1= <>
##$DBPNAM2= <>
$$ [...]
##$SUBNAM7= <"">
##$SUBNAM8= <"">
##$SUBNAM9= <"">
##$SW= 20.6930455092707
##$SWIBOX= (0..15)
0 0 3 0 0 0 0 0 0 0 0 0 0 0 0 0 
##$SW_h= 5175.983436853
##$TD= 65536
##$TD0= 1
##$TE= 294.16
##$TE2= 300
##$TE3= 300
##$TEG= 300
##$TL= (0..7)
0 120 120 120 120 120 120 120 
##$TP= (0..7)
150 150 150 150 150 150 150 150 
##$TP07= 0
##$TPNAME0= <>
##$TPNAME1= <>
##$TPNAME2= <>
##$TPNAME3= <>
##$TPNAME4= <>
##$TPNAME5= <>
##$TPNAME6= <>
##$TPNAME7= <>
##$TPOAL= (0..7)
0.5 0.5 0.5 0.5 0.5 0.5 0.5 0.5 
##$TPOFFS= (0..7)
0 0 0 0 0 0 0 0 
##$TUNHIN= 0
##$TUNHOUT= 0
##$TUNXOUT= 0
##$USERA1= <user>
##$USERA2= <user>
##$USERA3= <user>
##$USERA4= <user>
##$USERA5= <user>
##$V9= 5
##$VALIST= <valist>
##$VCLIST= <CCCCCCCCCCCCCCC>
##$VD= 0
##$VDLIST= <DDDDDDDDDDDDDDD>
##$VPLIST= <PPPPPPPPPPPPPPP>
##$VTLIST= <TTTTTTTTTTTTTTT>
##$WBST= 1024
##$WBSW= 4
##$XGAIN= (0..3)
0 0 0 0 
##$XL= 0
##$YL= 0
##$YMAX_a= 251731
##$YMIN_a= -264653
##$ZGOPTNS= <>
##$ZL1= 120
##$ZL2= 120
##$ZL3= 120
##$ZL4= 120
##$ABSF1= 16.51535
##$ABSF2= -4.177822
##$ABSG= 5
##$ABSL= 3
##$ALPHA= 0
##$AQORDER= 0
##$ASSFAC= 0
##$ASSFACI= 0
##$ASSFACX= 0
##$ASSWID= 0
##$AUNMP= <proc_1d>
##$AZFE= 0.1
##$AZFW= 0.1
##$BCFW= 0
##$BC_mod= 0
##$BYTORDP= 0
##$COROFFS= 0
##$CY= 12.5
##$DATMOD= 1
##$DC= 0
##$DFILT= <>
##$DTYPP= 0
##$F1P= 14.0000005364418
##$F2P= -0.99999901652339
##$FCOR= 0.5
##$FTSIZE= 32768
##$FT_mod= 6
##$GAMMA= 0
##$GB= 0
##$INTBC= 1
##$INTSCL= 1
##$ISEN= 128
##$LB= 0.3
##$LEV0= 0
##$LPBIN= 0
##$MAXI= 10000
##$MC2= 0
##$MEAN= 0
##$ME_mod= 0
##$MI= 0
##$NCOEF= 0
##$NC_proc= -2
##$NLEV= 6
##$NOISF1= 0
##$NOISF2= 0
##$NSP= 0
##$NTH_PI= 0
##$NZP= 0
##$OFFSET= 16.51535
##$PC= 1
##$PHC0= -69.58474
##$PHC1= 19.37428
##$PH_mod= 1
##$PKNL= yes
##$PPARMOD= 0
##$PSCAL= 4
##$PSIGN= 0
##$REVERSE= no
##$SF= 250.130001662307
##$SI= 32768
##$SIGF1= 0
##$SIGF2= 0
##$SINO= 400
##$SIOLD= 32768
##$SREGLST= <1H.DMSO>
##$SSB= 0
##$STSI= 32768
##$STSR= 0
##$SW_p= 5175.98343685301
##$SYMM= 0
##$S_DEV= 0
##$TDeff= 65536
##$TDoff= 0
##$TI= <Analysis number 999999
Compound Code 99
Book Reference 9
Project Code 9>
##$TILT= no
##$TM1= 0
##$TM2= 0
##$TOPLEV= 0
##$USERP1= <user>
##$USERP2= <user>
##$USERP3= <user>
##$USERP4= <user>
##$USERP5= <user>
##$WDW= 1
##$XDIM= 32768
##$YMAX_p= 295994474
##$YMIN_p= -205664
$$ End of Bruker specific parameters
$$ ---------------------------------
##NTUPLES= NMR SPECTRUM
##VAR_NAME=  FREQUENCY,     SPECTRUM/REAL,   SPECTRUM/IMAG
##SYMBOL=    X,             R,               I
##VAR_TYPE=  INDEPENDENT,   DEPENDENT,       DEPENDENT
##VAR_FORM=  AFFN,          ASDF,            ASDF
##VAR_DIM=   32768,         32768,           32768
##UNITS=     HZ,            ARBITRARY UNITS, ARBITRARY UNITS
##FACTOR=    0.157963299565203, 1,           1
##FIRST=     4130.98460844723, 0,            0
##LAST=      -1044.99882840578, 0,           0
##MIN=       -1044.99882840578, -205664,     0
##MAX=       4130.98460844723, 295994474,    0
$$ Real data points
##PAGE= N=1
##DATA TABLE= (X++(R..R)), XYDATA
$$ [...]
18609g7022j9830P1521L4375k3762j7663j6346j957J3028j4988J718K9084R596
$$ -77022 -96852 -25331 9044 -14718 -32381 -48727 -50684 -37656 -52644 -50926 -21842 -12246
18597a2246q971j9614o630K6066N932J6928K4115j522j0912m1684n428J2256J0235
$$ -12246 -21217 -40831 -47461 -21395 -15463 1465 25580 24058 13146 -28538 -33966 -21710 -11475
18584a1475K9677q757j4489q227O372J6173J982k5414j0839j0909N636k3006l3301
$$ -11475 18202 9445 -5044 -13271 -6899 9274 11256 -14158 -24997 -35906 -30270 -53276 -86577
18571h6577J2167P5048L7570j0610k0576J304l358j0729p70R013Q977j2907l154
$$ -86577 -74410 638 38208 27598 7022 8326 4968 -5761 -6531 2482 11459 -1448 -4602
18558d602l125q575p844Q576j6839K2855K4382j406l7093j3687J4527L7130J6719
$$ -4602 -7727 -16302 -24146 -15570 -32409 -9554 14828 13422 -23671 -37358 -22831 14299 31018
18545C1018j980j9217j0643K0602J0241j4851k8457Q827l1671j9957J2038Q828
$$ 31018 29038 9821 -822 19780 30021 15170 -13287 -4460 -36131 -56088 -44050 -35222
18533c5222n771P935K5431j0576j2573L5921R972j3159k7200K24K8223J7637M560
$$ -35222 -40993 -33058 -7627 -18203 -30776 5145 15117 1958 -25242 -25018 3205 20842 25402
18520B5402k5328k2311L843j4346q221j3674J561k5786J3363L3739L512k5435
$$ 25402 74 -22237 -18394 -32740 -40961 -54635 -53074 -78860 -65497 -31758 -28246 -53681
18508e3681n068J2505M5103J8801J954M757k6960k7472K682K7336N278j3501m153
$$ -53681 -58749 -46244 -1141 17660 19614 24371 -2589 -30061 -27379 -43 5235 -8266 -12419
18495a2419j4734J2366J7506k4637n1005j3843J0568L921N379J5236K6399M5896
$$ -12419 -27153 -14787 2719 -21918 -72923 -86766 -76198 -72277 -66898 -51662 -25263 20633
18483B0633L0238j9426m3170J9125L2819r392k4981k9335k0856k6983N196J344
$$ 20633 50871 31445 -11725 7400 40219 30827 5846 -23489 -44345 -71328 -66132 -64788
18471f4788r109R572K7437J0032m401L8801K6751m176k0283j1446j2633j2992
$$ -64788 -73897 -64325 -36888 -26856 -31257 7544 34295 30119 9836 -1610 -14243 -27235
18459b7235k1385L110j1397J3921n010K1375j2727k8895J5742K8151L576O59L353
$$ -27235 -48620 -45510 -56907 -42986 -47996 -26621 -39348 -68243 -52501 -24350 -20774 -20115 -16762
18446a6762J7292K7535m048k7410J4730L0823j6038O699j0635m884k1068k4214
$$ -16762 530 28065 24017 -3393 11337 42160 26122 32821 22186 17302 -3766 -27980
18434b7980P728L1386o291j6511J2736j5404j1859k766j4870j9996l24Q368M2219
$$ -27980 -20252 11134 4843 -11668 1068 -14336 -26195 -28961 -43831 -63827 -64151 -55783 -13564
18421a3564J3817l5925k2268R640J0685J3805J2095J2455k6095O289K777N833
$$ -13564 253 -35672 -57940 -48300 -37615 -23810 -11715 740 -25355 -19066 -16289 -10456
18409a0456q989j0908K0091M6996K386l6026j8113K1568n394K3717j2868j7741
$$ -10456 -19445 -30353 -10262 36734 39120 3094 -15019 6549 1155 24872 12004 -5737
18397e737J0919L2554m079J323j7795j9180j7833J45N669P969j1788M974J683
$$ -5737 5182 37736 33657 34980 17185 -1995 -19828 -19683 -14014 -6045 -17833 -12859 -11176
18384a1176M504j260o50k6757j0626K2815K1944j8696L068O348l2262Q894J3100
$$ -11176 -6672 -7932 -8582 -35339 -45965 -23150 -1206 -19902 -16834 -10486 -42748 -33854 -20754
18371b0754r904J8691N5741J7182j348m0382r426J290j2672j7668J3884J0875
$$ -20754 -30658 -11967 43774 60956 59608 19226 9800 11090 -1582 -19250 -5366 5509
18359E509p06j1766Q945O511N349j6656j1165P975j7260k6444P287K5566L0190
$$ 5509 4803 -6963 1982 8493 13842 -2814 -13979 -6004 -23264 -49708 -42421 -16855 13335
18346A3335n00l412L3112O987R32m385l003J610O442l1341j7029p89j4516j0514
$$ 13335 12835 9423 42535 49522 50454 46069 43066 44676 51118 19777 2748 1959 -12557 -23071
18332b3071J3142J3333j3474j9252Q363K7231J1059l335k0867J7751K756j642
$$ -23071 -9929 3404 -10070 -29322 -20959 6272 17331 13996 -6871 10880 13636 11994
18320A1994n628k0027K505K2325M883J3585J1996j6618k7917k1889k143k3174
$$ 11994 6366 -13661 -11156 11169 16052 29637 41633 25015 -2902 -24791 -26934 -50108
18308e0108j2644j4626O621J6987K73m56J4138R405J3663O788p602J9183N183
$$ -50108 -62752 -77378 -70757 -53770 -53497 -53953 -39815 -30410 -16747 -9959 -17561 1622 6805
18295F805q829j7846j6186j0722J7070L776j8412j5612M691j5048m752j5916J5220
$$ 6805 -2024 -19870 -36056 -46778 -29708 -25932 -44344 -59956 -55265 -70313 -75065 -90981 -75761
18282g5761L1690N6534K043P269R595j7217n103o1454l4705J5083L3173J1045
$$ -75761 -44071 12463 14506 21775 31370 14153 9050 -52404 -87109 -72026 -38853 -27808
18270b7808R968l245m626J312o523m477J1547p749j411J7059k7572K3156P711
$$ -27808 -17840 -21085 -25711 -24399 -30922 -35399 -23852 -31601 -33012 -15953 -43525 -20369 -12658
18257a2658Q415J7952k7701k657Q99j5278K6052l741O80L9654j9946l2812j2076
$$ -12658 -4243 13709 -13992 -16649 -15750 -31028 -4976 -8717 -8037 31617 11671 -21141 -33217
18244c3217P688K963p086J5344K4395p434M980j7788j2109K2003J9446R566k6110
$$ -33217 -25529 -22566 -29652 -14308 10087 2653 7633 -10155 -22264 -261 19185 28751 2641
18231B641k0312r654J0763l267J5607N043j3034J7749L2439m8116j0905K685m747
$$ 2641 -17671 -27325 -16562 -19829 -4222 821 -12213 5536 37975 -10141 -21046 -18361 -23108
18218b3108r592L190L33q247k8760m724L6265L150j4817j4619K4597L3454k5842
$$ -23108 -32700 -29510 -29177 -37424 -66184 -70908 -34643 -31493 -46310 -60929 -36332 -2878 -28720
18205b8720M360j3162J9671J8205o798l4521l6025n890L655J8208L4180K1734
$$ -28720 -24360 -37522 -17851 354 -6444 -40965 -76990 -82880 -79225 -61017 -26837 -5103
18193e103n338l3559m7781n518K9135O655k99J2240J110j8340J5541M868j036
$$ -5103 -10441 -44000 -91781 -97299 -68164 -61509 -61808 -49568 -48458 -66798 -51257 -46389 -47425
18180d7425J8256R038R173K1551j8907j2629j3395k1861J2025J4818K4230n710
$$ -47425 -29169 -20131 -10958 10593 -8314 -20943 -34338 -56199 -44174 -29356 -5126 -10836
18168a0836J2446M3035O986j6375k7625m054m2286J98K5142J463O380j5559k698
$$ -10836 1610 44645 51631 35256 7631 3577 -38709 -38511 -13369 -11906 -5526 -21085 -23783
18155b3783J1413K1126J1822n988N203p936k7119Q092q326P237K769P739J2111
$$ -23783 -12370 8756 20578 14590 19793 11857 -15262 -7170 -15496 -8259 -5490 2249 14360
18142A4360j5333k2362j844O949J6956J9529k4200q952q652n268J1298K3754k4660
$$ 14360 -973 -23335 -25179 -18230 -1274 18255 -5945 -14897 -23549 -28817 -17519 6235 -18425
18129a8425n755M2046k3617r796K1954J1389j6095l9203k0102L3536L5577m129
$$ -18425 -24180 17866 -5751 -15547 6407 17796 1701 -37502 -57604 -24068 11509 7380
18117G380J427J2504J4925l1024l952o308n903l71k16r607K6705L662k1560J0772
$$ 7380 8807 21311 36236 5212 1260 -5048 -10951 -11322 -11538 -21145 5560 9222 -12338 -1566
18103a566j5325Q676k7948j680J0962K7212k560m699N787K0123j2831M860J4838
$$ -1566 -16891 -8215 -36163 -37843 -26881 331 -2229 -6928 -1141 18982 6151 11011 25849
18090B5849n3774l2364L1725q432k1784M370r620J8675N835j0142k8492K0095
$$ 25849 -27925 -60289 -28564 -36996 -58780 -54410 -64030 -45355 -39520 -49662 -78154 -58059
18078e8059M653M513j239j0371r516j1948o705K7857N6196L7210J2298k1307l9008
$$ -58059 -53406 -48893 -50132 -60503 -70019 -81967 -88672 -60815 -4619 32591 44889 23582 -15426
18065a5426l671L7641K2131l4083j6884m484p88j5090k2201K0151J7294j0271
$$ -15426 -19097 18544 40675 6592 -10292 -14776 -15564 -30654 -52855 -32704 -15410 -25681
18053b5681p418J6032m167k3058m674m886K1250J5542K7580L635k4506M243Q690
$$ -25681 -33099 -17067 -21234 -44292 -48966 -53852 -32602 -17060 10520 14155 -10351 -6108 2582
18040B582l270J1524l0017k9288J4071L2361J5670q798r900o542J3165l262l1599
$$ 2582 -688 10836 -19181 -48469 -34398 -2037 13633 4835 -5065 -11607 1558 -1704 -33303
18027c3303R57n635J162J8570R488j0379M473n972o174j1257l2256k4519P099
$$ -33303 -32346 -37981 -36819 -18249 -8761 -19140 -14667 -20639 -26813 -38070 -70326 -94845 -87746
18014h7746J1025K7084Q125K348J9819K5725K978j5998N288Q843l0950k8863l586
$$ -87746 -76721 -49637 -41512 -39164 -19345 6380 9358 -6640 -1352 7491 -23459 -52322 -55908
18001e5908J5777J7044k0073j2947N808M127p249R043J2836K8815K3989j972k6997
$$ -55908 -40131 -23087 -43160 -56107 -50299 -46172 -53421 -44378 -31542 -2727 21262 19290 -7707
17988g707j8721K711J7925N783j9144j2087m923r837o057K2659J0173J261L495
$$ -7707 -26428 -23717 -5792 -9 -19153 -31240 -36163 -46000 -52057 -29398 -19225 -17964 -14469
17975a4469j3395R216R926J7572J9820r942k7863m2170j4062L2476M1449K905
$$ -14469 -27864 -18648 -8722 8850 28670 18728 -9135 -51305 -65367 -32891 8558 11463
17963A1463r159k9050p984Q768k5374K16L8804p103k4008L648J2281R943N344
$$ 11463 2304 -26746 -34730 -25962 -51336 -51120 -12316 -19419 -43427 -39779 -27498 -17555 -12211
17950a2211K8110J63k1640r262k0216Q082J0438j3386L829M243N133Q020p45q833
$$ -12211 15899 16062 -5578 -14840 -35056 -26974 -16536 -29922 -26093 -21850 -16717 -8697 -9442 -18275
17936a8275Q807J1967l4757m678o400J5325K351k2711J3940n029J6736K3541J7959
$$ -18275 -9468 2499 -32258 -36936 -43336 -28011 -25660 -48371 -34431 -39460 -22724 817 18776
17923A8776j923k5244k6611m401J2680J9011O765N093J4336l300K004J7445j7823
$$ 18776 16853 -8391 -35002 -39403 -26723 -7712 -947 4146 18482 15182 17186 34631 16808
17910A6808l9135L0998K5990m6847m2550J7744K4595k081R140j2006J7794J8472
$$ 16808 -22327 8671 34661 -12186 -54736 -36992 -12397 -14478 -5338 -17344 450 18922
17898A8922p199j7413K920j184j3824k8330k6943j6445P004K0214J2002K8699
$$ 18922 11723 -5690 -2770 -3954 -17778 -46108 -73051 -89496 -82492 -62278 -50276 -21577
17886b1577K5291P123j7988m810L0612n647k1579J789J0460q419p995n622n805
$$ -21577 3714 10837 -7151 -11961 18651 13004 -8575 -6786 3674 -4745 -12740 -18362 -24167
17873b4167l7714J3754N1611K1312o041j6839j3061k4449L62n780j8123Q747K5413
$$ -24167 -61881 -48127 3484 24796 18755 1916 -11145 -35594 -35232 -41012 -59135 -50388 -24975
17860b4975j6969j9326J1124J9249o000j6668J6641N0639j4415l4927J6923k325
$$ -24975 -41944 -61270 -50146 -30897 -36897 -53565 -36924 13715 -700 -35627 -18704 -21029
17848b1029n141l0117L950j5132o046J6782K2005L0423k107k6267J9169J1956
$$ -21029 -26170 -56287 -52337 -67469 -73515 -56733 -34728 -4305 -6412 -32679 -13510 -1554
17836a554j2543l9978k784O55M2214M3530l114k8314k9547M779L6382j7697J0583
$$ -1554 -14097 -54075 -56859 -56204 -13990 29540 26426 -1888 -31435 -26656 9726 -7971 2612
17823B612l492j4102p110l2912l2443r615L7387P186j917L3058J1312J336j4185
$$ 2612 -880 -14982 -22092 -55004 -87447 -97062 -59675 -52489 -54406 -21348 -10036 -8700 -22885
17810b2885J3220R463k3188k4404k848J1791K7242j9787k5849j6458K9788n503
$$ -22885 -9665 -202 -23390 -47794 -50642 -38851 -11609 -31396 -57245 -73703 -43915 -49418
17798d9418k642J1668L45K1531K3749O510l0156R610n613m742J0063j157o307
$$ -49418 -52060 -40392 -40047 -18516 5233 11743 -18413 -8803 -14416 -19158 -9095 -10252 -16559
17785a6559l936k5542J0858N0350n153l6304N759j8913l913O856j839Q108P663
$$ -16559 -20495 -46037 -35179 15171 10018 -26286 -20527 -39440 -43353 -36497 -38336 -30228 -22565
17772b2565K6633J0950K776k5819J6539n339l5118N575J4072l719k4240j0809
$$ -22565 4068 15018 17794 -8025 8514 3175 -31943 -26368 -12296 -16015 -40255 -51064
17760e1064K2412j5319J5993o256j734J6460k646Q234P612L764o667j5286r679
$$ -51064 -28652 -43971 -27978 -34234 -35968 -19508 -22154 -13920 -6308 -2544 -9211 -24497 -34176
17747c4176J5942Q090l6772k0827K2205K1072o098k7510q005K4824K5093L8046
$$ -34176 -18234 -10144 -46916 -67743 -45538 -24466 -30564 -58074 -66079 -41255 -16162 21884
17735B1884J8084J0456l4445k9584K9189r518j6251P149K0737k3689k3785N003
$$ 21884 39968 50424 15979 -13605 15584 6066 -10185 -3036 17701 -5988 -29773 -24770
17723b4770L708J8855N172q132J475J7943p967q792J9539k1868j1672o079K6967
$$ -24770 -21062 -2207 2965 -5167 -3692 14251 6284 -2508 17031 -4837 -16509 -22588 4379
17710D379j5781p809J329K995j3213j0310k8070R061J7880n488J7713L7164J770
$$ 4379 -11402 -19211 -17882 -14887 -28100 -38410 -66480 -57419 -39539 -45027 -27314 9850 11620
17697A1620J0375j1748k2136k1864L589N563K8671P614j3575p008j728j4277Q44
$$ 11620 21995 10247 -11889 -33753 -30164 -24601 4070 11684 -1891 -8899 -10627 -24904 -24060
17684b4060K0620j9646l9636P78M0779J2244R342L2539j5647m0889m8441J8199
$$ -24060 -3440 -23086 -62722 -61944 -21165 -8921 421 32960 17313 -23576 -72017 -53818
17672e3818q013J7622L2909J8000L770k3420k2128M6304L6011k2123l6519K5420
$$ -53818 -61831 -44209 -11300 6700 10470 -12950 -35078 11226 47237 25114 -11405 14015
17660A4015l4784j0507J0733J0399j0064j2046J1435l240l0933N48K9587J3748
$$ 14015 -20769 -31276 -20543 -10144 -20208 -32254 -20819 -24059 -54992 -54444 -24857 -11109
17648a1109k8434j0302L2707L9273K2256j2140j0599j7348n024J1906j2749J2586
$$ -11109 -39543 -49845 -17138 22135 44391 32251 21652 4304 -720 11186 -1563 11023
17636A1023J950R544k0343j4572J0033J6999J9863k6527m2473R849L2487j7319
$$ 11023 12973 22517 2174 -12398 -2365 14634 34497 7970 -34503 -24654 7833 -9486
17624i486L09n345q938r663j6696J2405J493o47k616L1064j6867j7193n837J3485
$$ -9486 -9177 -14522 -23460 -33123 -49819 -37414 -35921 -36568 -39184 -8120 -24987 -42180 -48017 -34532
17610c4532L3674M0751J8829p223k3431l0605n283J0040j7873k414J6644L612
$$ -34532 -858 39893 58722 51499 28068 -2537 -7820 2220 -15653 -18067 -1423 2189
17598B189K769j4298j8266M332o854n806J2586j706K5552J1983k9111J1558K33
$$ 2189 4958 -9340 -27606 -23274 -30128 -35934 -23348 -25054 498 12481 -16630 -5072 -4839
17585d839J1319J0899m0113l4914L7995K9944J9539j1870j5245k1998P185r295
$$ -4839 6480 17379 -22734 -57648 -19653 10291 29830 17960 2715 -19283 -12098 -21393
17573b1393J7134p685m2207j7386J064J8676r550J2456K4914L1379L633j2647
$$ -21393 -4259 -11944 -54151 -71537 -70473 -51797 -61347 -48891 -23977 7402 11035 -1612
17561a612j8071Q815p641M485M247k9920k7117o736k840j5953J5527K9478J3191
$$ -1612 -19683 -10868 -18509 -14024 -9777 -39697 -66814 -73550 -76390 -92343 -76816 -47338 -34147
17548c4147M98r634j583K6322R442j186j4051J2931J6998o26j7230j3400o366
$$ -34147 -33649 -43283 -44866 -18544 -9102 -10288 -24339 -11408 5590 4964 -12266 -25666 -32032
17535c2032K8069K6551j8680l8057j3218R484k169r737K8423L7119K2041J4746
$$ -32032 -3963 22588 3908 -34149 -47367 -37883 -40052 -49789 -21366 15753 37794 52540
17523E2540m0287L555K5902k5223l3091j9631N76N726P027L4833N968L795n6M671
$$ 52540 12253 15808 41710 16487 -16604 -36235 -35659 -29933 -22906 11927 17895 21690 21634 26305
17509B6305j0669L20n909j7094j0944O942J4273j0027j6646j3445K0567j1359
$$ 26305 15636 15956 10047 -7047 -17991 -11049 3224 -6803 -23449 -36894 -16327 -27686
17497b7686J3122J5280O697p529k0858j3631P992J850J5236j6983k4276J3938
$$ -27686 -14564 716 7413 -116 -20974 -34605 -26613 -24763 -9527 -26510 -50786 -36848
17485c6848J9771j1390o45j2534J4632J0622j8518m962N205r876J8436j6647j0398
$$ -36848 -17077 -28467 -29112 -41646 -27014 -16392 -34910 -39872 -34667 -44543 -26107 -42754 -53152
17472e3152K1243j3233k32L356L7765M0699M61k988j3675k0180O800K0298k7268
$$ -53152 -31909 -45142 -45374 -42018 -4253 36446 36907 33919 20244 64 6864 27162 -106
17459a06k3956K7608K2500k0333l4355l3360n790J3830J527K1435O159J5862m013
$$ -106 -24062 3546 26046 5713 -28642 -62002 -67792 -53962 -52435 -31000 -24841 -8979 -12992
17446a2992k5347k4888L57N361J5612j439J9348L7149n859j4624Q911L13L008
$$ -12992 -38339 -63227 -62870 -57509 -41897 -43336 -23988 13161 7302 -7322 1589 1902 4910
17433D910L109l436Q608O136j1793J1290K4274r714j3543R597j3877J538j4689
$$ 4910 8019 4583 13191 19327 7534 18824 43098 33384 19841 29438 15561 17099 2410
17420B410K4840J9827j5545r286o896k4432o96J064M640Q620j4375j2914j0825
$$ 2410 27250 47077 31532 22246 15350 -9082 -9778 -8714 -4074 4546 -9829 -22743 -33568
17407c3568K7492J079Q521K621j2162k2041j3714j3935k0191L6132M1842L1982
$$ -33568 -6076 -4997 3524 6145 -6017 -28058 -41772 -55707 -75898 -39766 2076 34058
17395C4058k0278Q410j1636j5257o791J6071K804J1066R81n352j6630q333j9373
$$ 34058 13780 22190 10554 -4703 -11494 4577 7381 18447 19428 14076 -2554 -10887 -30260
17382c0260j4814N132l4542N191K2168R002j6858k603J9721L534J8410L5048K895
$$ -30260 -45074 -39942 -74484 -69293 -47125 -38123 -54981 -57584 -37863 -34329 -15919 19129 22024
17369B2024j6922O636j1451J299j8555j6727j0468j4547K4269P106J5637M554
$$ 22024 5102 11738 287 1586 -16969 -33696 -44164 -58711 -34442 -27336 -11699 -7145
17357g145j7235J4239J0564J0047K2626K119L2k7798j5375J0788P231K1126l5524
$$ -7145 -24380 -10141 423 10470 33096 35215 35247 7449 -7926 2862 10093 31219 -4305
17344d305k0778j3551R560K8689l529j7785j583j8639J8174J8738J7834K0195
$$ -4305 -25083 -38634 -29074 -385 -3914 -21699 -23282 -41921 -23747 -5009 12825 33020
17332C3020j8146l2128m839P957k0764j9370K2680K6158p138J4862l029j2805
$$ 33020 14874 -17254 -22093 -14136 -34900 -54270 -31590 -5432 -12570 2292 -737 -13542
17320a3542j1893K3392P135k9012j7129o969K1747J4856L077j1173P363j2235
$$ -13542 -25435 -2043 5092 -23920 -41049 -48018 -26271 -11415 -8338 -19511 -12148 -24383
17308b4383k3127K8160O487k3532N730j0201R926L049k7482P806K4209K3167L6658
$$ -24383 -47510 -19350 -12863 -36395 -30665 -40866 -30940 -27891 -55373 -47567 -23358 -191 36467
17295C6467j2232m8672j3649K6282J3744m498p446j580k36J4106j8358k4748P473
$$ 36467 24235 -24437 -38086 -11804 1940 -2558 -10004 -11584 -11820 2286 -16072 -40820 -33347
17282c3347J3506o784L747Q610k7985j0216j6244K0233J0442J1084j0973k705
$$ -33347 -19841 -26625 -22878 -14268 -42253 -52469 -68713 -48480 -38038 -26954 -37927 -40632
17270d0632K0776k1050l2048K2223K1460J7643P235J3993j5334J2843m435k7487
$$ -40632 -19856 -40906 -72954 -50731 -29271 -11628 -4393 9600 -5734 7109 2674 -24813
17258b4813j3988K5156l4M776N516L971j1431M041j6274N513K2158j7572k2450
$$ -24813 -38801 -13645 -13679 -8903 -3387 584 -10847 -6806 -23080 -17567 4591 -12981 -35431
17245c5431j0721K5545L7361M090n0352P468J1039k123j7233n792O62P735L0553
$$ -35431 -46152 -20607 16754 20844 -29508 -22040 -11001 -13124 -30357 -36149 -35487 -27752 2801
17232B801M0968K0578K668o902k9630m0809j2406Q222K3637j5434k8110K9297
$$ 2801 43769 64347 67015 60113 30483 -10326 -22732 -14510 9127 -6307 -34417 -5120
17220e120n590L094J7827M185J8741K8906P60k7608j9421m607j6160J5968M093
$$ -5120 -10710 -7616 10211 14396 33137 62043 62803 35195 15774 11167 -4993 10975 15068
17207A5068J1619n773j7975l2611p214p871j7515J009K7842K0970j1643r480K4419
$$ 15068 26687 20914 2939 -29672 -36886 -44757 -62272 -61263 -33421 -12451 -24094 -33574 -9155
17194i155K1528p253J5207M925j2999j5472J5969k4213q947n34K4034J7391L5439
$$ -9155 12373 5120 20327 25252 12253 -3219 12750 -11463 -20410 -20944 3090 20481 55920
17181E5920K4989j7908m0235l0949J762J071m203l0973l737n249j4347J1461J7677
$$ 55920 80909 63001 22766 -8183 -6421 -5350 -9553 -40526 -44263 -49512 -63859 -52398 -34721
17168c4721l803o782j2783r567o787K3408L8609J1082K734j0592k7536L450q53
$$ -34721 -38524 -45306 -58089 -67656 -74443 -51035 -12426 -1344 1390 -9202 -36738 -33288 -34141
17155c4141l484J3856J9904n253J7238J0524k7010J605J2361J5405j1655j7648
$$ -34141 -37625 -23769 -3865 -9118 8120 18644 -8366 -6761 5600 21005 9350 -8298
17143h298L92M4405L8256j7316m6560k4363j8093J3802K1245j1878j192O037Q544
$$ -8298 -7906 36499 74755 57439 10879 -13484 -31577 -17775 3470 -8408 -9600 -3563 4981
17130D981j5023j2945l8672N399N170L9054p502m986j0131o371M098P072J5566
$$ 4981 -10042 -22987 -61659 -56260 -51090 -12036 -19538 -24524 -34655 -41026 -36928 -29856 -14290
17117a4290k120R296J7644M9419J7493l5324j6358N465J2286K1654l6572k9084
$$ -14290 -16410 -7114 10530 59949 77442 42118 25760 31225 43511 65165 28593 -491
17105d91J341n859L769m142l9469l4999K0145M4114M299m634K1235J4801j3685
$$ -491 850 -5009 -1240 -5382 -44851 -79850 -59705 -15591 -11292 -15926 5309 20110 6425
17092F425J1821K3045j0394k5873l5653r972L4256J4920j4883m5514j6133J9239
$$ 6425 18246 41291 30897 5024 -30629 -40601 -6345 8575 -6308 -51822 -67955 -48716
17080d8716R392K147o333j9168K5541n963P356J1877L9789J7817l0658k7327l971
$$ -48716 -39324 -37177 -43510 -62678 -37137 -43100 -35744 -23867 15922 33739 3081 -24246 -28217
17067b8217K4405L1964N486k7099J5555K5223o16N705n196l2390k3095R717p947
$$ -28217 -3812 28152 33638 6539 22094 47317 46701 52406 47210 14820 -8275 1442 -6505
17054f505j2528r495p876J8465n357j3516j0823j7484K8412L8352O979l3263n420
$$ -6505 -19033 -28528 -36404 -17939 -23296 -36812 -47635 -65119 -36707 1645 8624 -24639 -30059
17041c0059l137J3550j1671K24j2670J0761n722L5519J7798q395Q094K2987j3250
$$ -30059 -33196 -19646 -31317 -31093 -43763 -33002 -38724 -3205 14593 6198 14292 37279 24029
17028B4029j9977K3268j5262j2459Q005m363K5256j9275o159j0776j7335j0157
$$ 24029 4052 27320 12058 -401 7604 3241 28497 9222 3063 -7713 -25048 -35205
17016c5205L920j5310k2035j4782O2265L2785L3922M75k8170k4927J698k50O398
$$ -35205 -31285 -46595 -68630 -83412 -21147 11638 45560 46035 17865 -7062 -5364 -5614 784
17003G84k824k1636j3572K3526J7063L5887k419l6584j4688K6118L0062o994j1619
$$ 784 -2040 -23676 -37248 -13722 3341 39228 36809 225 -14463 11655 41717 34723 23104
16990B3104j3548l4495P632J5417L2184q759n478k8208J1627J4049j462K320K5904
$$ 23104 9556 -24939 -17307 -1890 30294 21535 16057 -12151 -524 13525 12063 14383 40287
16977D0287k835j7811k477j8514J1240O206j1963j7529l7578J0314R177j434l459
$$ 40287 37452 19641 17164 -1350 9890 16096 4133 -13396 -50974 -40660 -31483 -32917 -36376
16964c6376m22J0720O640J082j6530J0396M278J9227L3681j0624j5067n578k0069
$$ -36376 -36798 -26078 -19438 -18356 -34886 -24490 -20212 -985 32696 22072 7005 1427 -18642
16951a8642j1563M6936O446l2085j3149n786N978k554K3707M5809j7027l4361
$$ -18642 -30205 16731 23177 -8908 -22057 -27843 -21865 -24419 -712 45097 28070 -6291
16939f291J9352p45P093q364L813n472J2858q632j6596J63j4048j6415p948n484
$$ -6291 13061 12316 19409 11045 14858 9386 22244 13612 -2984 -2821 -16869 -33284 -41232 -46716
16925d6716O873J9434k1979k3982J6999J1120K1538m499m348K8595K8240j5998
$$ -46716 -39843 -20409 -42388 -66370 -49371 -38251 -16713 -21212 -25560 3035 31275 15277
16913A5277j2932K7084k5049j6159j1723j1613r275J4449K1429n47j5623o027
$$ 15277 2345 29429 4380 -11779 -23502 -35115 -44390 -29941 -8512 -9059 -24682 -30709
16901c0709q26J9383k2749l061p48K3402P560o511j2892j376K1443P918j5710
$$ -30709 -31535 -12152 -34901 -37962 -38710 -15308 -7748 -14259 -27151 -28527 -7084 834 -14876
16888a4876J7010l377j2621k7973J3462K1904j158j7090j7229K1966K3952J5583
$$ -14876 2134 -1243 -13864 -41837 -28375 -6471 -7629 -24719 -41948 -19982 3970 19553
16876A9553m6782J322P726K974L352p823M258m764M378L0901j6720P505m697l1260
$$ 19553 -27229 -25907 -18181 -15207 -11855 -19678 -15420 -20184 -15806 15095 -1625 5880 1183 -30077
16862c0077p594j7497j4688K1072L0886J3647N000J370J1355p258J6545K3024
$$ -30077 -37671 -55168 -69856 -48784 -17898 -4251 749 2119 13474 6216 22761 45785
16850D5785P839r51J861j9950k4593J534q43j9405j8791k2054J1493J0116j0010
$$ 45785 53624 52673 54534 34584 9991 11525 10682 -8723 -27514 -49568 -38075 -27959 -37969
16837c7969q086R55k865J7217K2753n355r112K2594J4092q896Q235L169L568k5693
$$ -37969 -46055 -45100 -47965 -30748 -7995 -13350 -22462 132 14224 5328 13563 16732 20300 -5393
16823e393k8345K271k346k9816L9190K4986M176l974J927j2343j7774Q675j5553
$$ -5393 -33738 -31467 -33813 -63629 -24439 547 4723 749 2676 -9667 -27441 -18766 -34319
16810c4319j5654L2573M158P962K2580K015m5918k7012J8551N8022K0951O128
$$ -34319 -49973 -17400 -13242 -5280 17300 19315 -26603 -53615 -35064 22958 43909 50037
16798E0037q168k9025j9562J5592k3790R67J3008M9743J1554k9135m1362j7041
$$ 50037 41869 12844 -6718 8874 -14916 -13949 -941 48802 60356 31221 -10141 -27182
16786b7182j1286p357j8272L1427M2799L5415r190m5719R501J4662o826m0786
$$ -27182 -38468 -45825 -64097 -32670 10129 45544 36354 -9365 136 14798 7972 -32814
16774c2814p626j2971r196J2755Q834k57q901L8788L932m61r936k9855l10L91
$$ -32814 -40440 -53411 -62607 -49852 -41018 -41275 -50176 -11388 -7456 -7917 -17853 -47708 -48018 -47627
16760d7627k3444J2525O398J5626K684K3084r85k88j1410k947K2891J9811L0848
$$ -47627 -71071 -58546 -52148 -36522 -33838 -10754 -11739 -12027 -23437 -26384 -3493 16318 47166
16747D7166k6148J8405k682m3754l4799J2875P766J3241L266p766q337K7527K0884
$$ 47166 21018 39423 36741 -7013 -41812 -28937 -21171 -7930 -4664 -12430 -20767 6760 27644
16734B7644J1108j4208j6666q600p21k89R512P461L3510n355j5211p601r539J2094
$$ 27644 38752 24544 7878 -722 -1443 -1732 7780 15241 48751 43396 28185 20584 11045 23139
16720B3139L7043j28j2484k2832k7534j4555j4677J7072K5708L8088J4931k7754
$$ 23139 60182 60054 47570 24738 -2796 -17351 -32028 -14956 10752 48840 63771 36017
16708C6017n186j9046l547j2549k0980j5135k892J1385L9138Q999j4756m006J3334
$$ 36017 30831 11785 8238 -4311 -25291 -40426 -43318 -31933 7205 16204 1448 -2558 10776
16695A0776J054r75m446J9504r045k4046Q292J1036N226M677j5547j4129L916
$$ 10776 11830 10855 6409 25913 16868 -7178 1114 12150 17376 22053 6506 -7623 -3707
16682c707j3001k8680Q460L8254J4815k0748k3936L6518L1009j4873k4268j8899
$$ -3707 -16708 -45388 -36928 1326 16141 -4607 -28543 7975 38984 24111 -157 -19056
16670a9056O500K9209q959k0402k0764K3300R173l8178j1628J5163K9882K7789
$$ -19056 -12556 16653 7694 -12708 -33472 -10172 -999 -39177 -50805 -35642 -5760 22029
16658B2029j3345j5458O657r415Q549n164Q541L922R196J5333J295Q932N382k6826
$$ 22029 8684 -6774 -117 -9532 -983 -6147 2394 6316 15512 30845 32140 41072 46454 19628
16644A9628l1713k6534k1937K0555J2988O861K772l660j5930m965L7861J1406
$$ 19628 -12085 -38619 -60556 -40001 -27013 -20152 -17380 -21040 -36970 -41935 -4074 7332
16632G332r775N898m002N790K1489J43k0486M404j7447n302q461J5478j4173j6401
$$ 7332 -2443 3455 -547 5243 26732 26875 6389 10793 -6654 -11956 -20417 -4939 -19112 -35513
16618c5513O436Q835M842m991J1345K2079r529k6327p62l409J3333k307j7620
$$ -35513 -29077 -20242 -15400 -20391 -9046 13033 3504 -22823 -23585 -26994 -13661 -15968 -33588
16605c3588j7881j1601J6236J9995p852L7486L211j3914k9441j3878J5657J2078
$$ -33588 -51469 -63070 -46834 -26839 -34691 2795 6006 -7908 -37349 -51227 -35570 -23492
16593b3492j7256j1751J2124N874K2113K0798l6744q658M405j4732M443J8999
$$ -23492 -40748 -52499 -40375 -34501 -12388 8410 -28334 -36992 -32587 -47319 -42876 -23877
16581b3877J8692j1348j9519O126j477n89K7890M2933k4210k3320L843P601K3851
$$ -23877 -5185 -16533 -36052 -29926 -31403 -31992 -4102 38831 14621 -8699 -4856 2745 26596
16568B6596n617l127K1932J2058q209k3488j4994j5386J738k1072K1887J8268
$$ 26596 20979 17852 39784 51842 43633 20145 5151 -10235 -8497 -29569 -7682 10586
16556A0586J6757k2085l3860L6441L8816o502r553K2405K1450m0342m6433j9228
$$ 10586 27343 5258 -28602 7839 46655 40153 30600 53005 74455 34113 -12320 -31548
16544c1548J2126L556j1488j4591P818P565R219j1132J3151N664K790j9280L251
$$ -31548 -19422 -15866 -27354 -41945 -34127 -26562 -17343 -28475 -15324 -9660 -6870 -26150 -22899
16531b2899J7348J5837L826k1800M383J4389P758K682k5846n824J660J9380O573
$$ -22899 -5551 10286 14112 -7688 -3305 11084 18842 21524 -4322 -10146 -8486 10894 17467
16518A7467j8531r489R715J2741J5323J9854Q7p749j8798J223R513m511k5063
$$ 17467 -1064 -10553 -838 11903 27226 47080 47167 39418 20620 21843 31356 26845 1782
16505A782P641m810P451R274R195k143p166j6137l6042j3971j5095M2357L0085
$$ 1782 9423 4613 12064 21338 30533 28390 21224 5087 -30955 -44926 -60021 -17664 12421
16492A2421m711L323M922k9840K675m296J6210r790o5264J7583L2550o31J944
$$ 12421 7710 11033 15955 -13885 -11210 -15506 704 -9086 -74350 -56767 -24217 -24848 -22904
16479b2904J2955q768r582m106R454L0745J2232N208J2320K943j5211j5956J063
$$ -22904 -9949 -18717 -28299 -32405 -22951 7794 20026 25234 37554 40497 25286 9330 10393
16466A0393K8123Q896k5350L709j5364j1073Q30k904O61j9987n119J0439K7868
$$ 10393 38516 47412 22062 25771 10407 -666 164 -2740 -2079 -22066 -27185 -16746 11122
16453A1122P919M822J2243R491j0360k6833j9824p05Q516l5856k3351L0855J7195
$$ 11122 19041 23863 36106 45597 35237 8404 -11420 -12125 -3609 -39465 -62816 -31961 -14766
16440a4766J7799P099m8930k0413L6612J4111o531L4785j109k9121j207R863J0624
$$ -14766 3033 10132 -38798 -59211 -22599 -8488 -15019 19766 18657 -10464 -11671 -1808 8816
16427H816N427K301J1749m9072j9681L1358L2881p275j8599p45j9887k229J2277
$$ 8816 14243 16544 28293 -20779 -40460 -9102 23779 16504 -2095 -2840 -22727 -24956 -12679
16414a2679J4435K0440K434R784J9755k0319l3978j3838j9863J6353j1733K324
$$ -12679 1756 22196 24630 34414 54169 33850 -128 -13966 -33829 -17476 -29209 -26885
16402b6885K3868J4589R925p20P281J1592J3601j9877k0013j2348L7602j924m91
$$ -26885 -3017 11572 21497 20777 28058 39650 53251 33374 13361 1013 38615 36691 36200
16389C6200l4073l5344o806N089L3246J9453L204O081k9236K470J5319j2475l6460
$$ 36200 2127 -33217 -40023 -34934 -1688 17765 20969 27050 -2186 284 15603 3128 -33332
16376c3332l680K0236l157j954J6900j0245j5701j1527o684J4597P262K0728L753
$$ -33332 -37012 -16776 -19933 -21887 -4987 -15232 -30933 -42460 -49144 -34547 -27285 -6557 -2804
16363b804L8589K2061P926p316K1648l001j3497k4147Q946L2341l8458n1852k3734
$$ -2804 35785 57846 65772 58456 80104 77103 63606 39459 48405 80746 42288 -9564 -33298
16350c3298K439J2690K4179k4809j6887P365J5718K1634p011q191J6324L584r670
$$ -33298 -30859 -18169 6010 -18799 -35686 -28321 -12603 9031 2020 -6171 10153 13737 4067
16337D067N82K086P126q041J4599k6784l4419j1819J7174J7412m184K3608R447
$$ 4067 4649 6735 13861 5820 20419 -6365 -40784 -52603 -35429 -18017 -22201 1407 10854
16324A0854j887J5313L655k0099l677J4651o308K852N22O704k8174o535K8691
$$ 10854 8967 24280 27935 7836 4159 18810 12502 15354 15876 22580 -5594 -12129 16562
16311A6562J5836k0581k6618r436p012K1969P149K518j4441R85N546l896p618
$$ 16562 32398 11817 -14801 -24237 -31249 -9280 -2131 387 -14054 -13069 -7523 -11419 -19037
16298a9037J0576j3528P213j8728K183Q391J3532J0778j6130O094K2675l189j2556
$$ -19037 -8461 -21989 -14776 -33504 -31321 -22930 -9398 1380 -14750 -8656 14019 10830 -1726
16285a726N935J203k3700j3782k0947j6878k729M7023M5835P167N536n835K094
$$ -1726 4209 5412 -18288 -32070 -53017 -69895 -72624 -25601 20234 27401 32937 27102 29196
16272B9196j1141j0412j4297k5722j03K6555J9318l2085K720J9971Q87m1983k0491
$$ 29196 18055 7643 -6654 -32376 -32479 -5924 13394 -18691 -15971 4000 4887 -37096 -57587
16259e7587P757J3987r356R727R068K2075J4044o894O458J546N151n595k6947
$$ -57587 -49830 -35843 -45199 -35472 -26404 -4329 9715 2821 9279 10825 15976 10381 -16566
16246a6566l8450L6376M2890L7066P388k1201l9759r206r402j1520m290j203J7016
$$ -16566 -55016 -18640 24250 61316 68704 47503 7744 -1462 -10864 -22384 -26674 -27877 -10861
16233a0861P450J2644J8543n07o042m375k6848n886l0396R95L85j88K4289L3366
$$ -10861 -3411 9233 27776 27269 21227 16852 -9996 -15882 -46278 -45283 -44898 -45086 -20797 12569
16219A2569k6615m2312r487M1082J5515j0723J2979K2911M59N669j127j1064q961
$$ 12569 -14046 -56358 -65845 -24763 -9248 -19971 -6992 15919 16378 22047 20920 9856 895
16206H95q686j3688J7001M819k0687N97k079J4641K8521j3144j2794k2822j9889
$$ 895 -7791 -21479 -4478 341 -20346 -19749 -21828 -7187 21334 8190 -4604 -27426 -47315
16193d7315J3988k1931n296J2339L5519M563J7837k2933l177L7217M677j769l8982
$$ -47315 -33327 -55258 -60554 -48215 -12696 -8133 9704 -13229 -16406 20811 25488 23719 -15263
16180a5263r11K8687J2211j6743k0738J1911j2242q011j4587j0477O232o69j5234
$$ -15263 -16174 12513 24724 7981 -12757 -846 -13088 -21099 -35686 -46163 -39931 -40600 -55834
16167e5834j1506K9154L8996m825M674k1214j5310j1187l846J1235M3006L6183
$$ -55834 -67340 -38186 810 -4015 659 -20555 -35865 -47052 -50898 -39663 3343 39526
16155C9526K9690j0894l4152l9400J72J4459l3501L4861M6255j1226k7752l3673
$$ 39526 69216 58322 24170 -15230 -15058 -599 -34100 761 47016 35790 8038 -25635
16143b5635j5981N798m764j056J4430K0206P985j4985j5506P024J1330O167n277
$$ -25635 -41616 -35818 -40582 -41638 -27208 -7002 983 -14002 -29508 -22484 -11154 -4987 -10264
16130a0264M739O750L094m0456m589L1780K145K369j126m370j0888j8993J1115
$$ -10264 -5525 1225 4319 -36137 -40726 -8946 -6801 -4432 -5558 -9928 -20816 -39809 -28694
16117b8694M0414K0820q226k2961p447k4097k2289J3132J9337K8657J6337k1771
$$ -28694 11720 32540 24314 1353 -6094 -30191 -52480 -39348 -20011 8646 24983 3212
16105C212j9566Q366J664J109j980J5030k9581k7065k4825J4928k404J3748L1506
$$ 3212 -16354 -7988 -6324 -5215 -7195 7835 -21746 -48811 -73636 -58708 -61112 -47364 -15858
16092a5858o102N707J448J0911J0409m633m150O47K3946L0863j2581J965r243
$$ -15858 -21960 -16253 -14805 -3894 6515 1882 -2268 -1621 22325 53188 40607 42572 33329
16079C3329Q44k420j0271j4496q641M655k749M379J4282O269p918j4992j3107
$$ 33329 34173 31753 21482 6986 -1655 3000 251 4630 18912 25181 17263 2271 -10836
16066a0836J7242K821J9484Q437k0413J3181M761j215m854o592L9942L0768k7922
$$ -10836 6406 9227 28711 37148 16735 29916 34677 33462 28608 22016 61958 92726 64804
16053F4804l1324N453n794R914j2321j4899k5961j3175J4945j452l960K7499L6213
$$ 64804 33480 38933 33139 43053 30732 15833 -10128 -23303 -8358 -9810 -13770 13729 49942
16040D9942n510n3504k6196L940K8145o060n6255n473N3705O372k6636o223K6893
$$ 49942 44432 -9072 -35268 -31328 -3183 -9243 -65498 -70971 -17266 -10894 -37530 -43753 -16860
16027a6860M1883J8396j0106j6347m3148j235M7974K8878o610k0145j2475k4684
$$ -16860 25023 43419 33313 16966 -26182 -27417 20557 49435 42825 22680 10205 -14479
16015a4479l0526N575L2979J4875q660m237k675P629P670J5427L2355j2766j1205
$$ -14479 -45005 -39430 -6451 8424 -236 -4473 -7148 481 8151 23578 55933 43167 31962
16002C1962r307l9078K526N06j8287J4011J9457K6145k1483l8369j6467L2008
$$ 31962 22655 -16423 -13897 -13391 -31678 -17667 1790 27935 6452 -31917 -48384 -16376
15990a6376J4785K0508K0116L3014j211k5996m9289j1505K526O65K6935K8692
$$ -16376 -1591 18917 39033 72047 70836 44840 -4449 -15954 -13428 -12763 14172 42864
15978D2864p779j520j5111q796M5j4194j2887j749O188J4809q280J459M541j0266
$$ 42864 35085 33565 18454 9658 9703 -4491 -17378 -19127 -12939 1870 -6410 -4951 -410 -10676
15964a0676J2397J2181P334j7911J9395J3352j249k4004q988O413K1097P191l1525
$$ -10676 1721 13902 21236 3325 22720 36072 34823 10819 1831 8244 29341 36532 5007
15951E007O684j5088k4623o888J1891m13J7014J5032l0242j1235K4010L9473N466
$$ 5007 11691 -3397 -28020 -34908 -23017 -23430 -6416 8616 -21626 -32861 -8851 30622 36088
15938C6088m335K6948J85l0727k0213k3363J5208L0087k4175k9437J082Q766K7409
$$ 36088 31753 58701 58886 28159 7946 -15417 -209 29878 5703 -23734 -22652 -13886 13523
15925A3523L4055L738k8467M047K9652J6557k0163k5092k8270K449J9111k676
$$ 13523 47578 51316 22849 26896 56548 73105 52942 27850 -420 2029 21140 18464
15913A8464j3807M328J1646K758K4775K2386j4047m0686j9113Q286P541L864N876
$$ 18464 4657 8985 20631 23389 48164 70550 56503 15817 -3296 4990 12531 16395 22271
15900B2271o661O043m8648k3086K5479L692P521q264O672R884L1622K6100r253
$$ 22271 15610 21653 -26995 -50081 -24602 -20910 -13389 -21653 -14981 -5097 26525 52625 43372
15887D3372N582m3465k2169l342J4470J7041r258j0067o907J168l442o864J0296
$$ 43372 48954 5489 -16680 -20022 -5552 11489 2231 -7836 -14743 -13575 -17017 -23881 -13585
15874a3585p100L2628m576j5973j1892j9630O566K226O228J8101J6574K2108m2129
$$ -13585 -20685 11943 7367 -8606 -20498 -40128 -33562 -31336 -25108 -7007 9567 31675 -10454
15861a0454j4911l0790q215K0465J0433J2690P278j6455k2266N022J6954J7319
$$ -10454 -25365 -56155 -64370 -43905 -33472 -20782 -13504 -29959 -52225 -47203 -30249 -12930
15849a2930J2276j8910j2534J5394j2842k1537r248M316K3756Q792K865j208m0018
$$ -12930 -654 -19564 -32098 -16704 -29546 -51083 -60331 -56015 -32259 -23467 -20602 -21810 -61828
15836f1828r399K792L6606O94J0090M837J3525L524o777j2081L31K429j7773q124
$$ -61828 -71227 -68435 -31829 -31135 -21045 -16208 -2683 841 -5936 -18017 -17686 -15257 -33030 -41154
15822d1154j296L924K1740L3711n452r657k3780q070M36L501K4401K0988k4856
$$ -41154 -42450 -38526 -16786 16925 11473 1816 -21964 -30034 -29598 -26097 -1696 19292 -5564
15809e564j7930p509q080J6557K9624J0822j4028m645j8262L990l160q287P273
$$ -5564 -23494 -31003 -39083 -22526 7098 17920 3892 -753 -19015 -15025 -18185 -26472 -19199
15796a9199N743j0705o104k739j2276j745M4048P629O372j2640j7723k1565L6644
$$ -19199 -13456 -24161 -30265 -33004 -45280 -47025 -2977 4652 11024 -1616 -19339 -40904 -4260
15783d260L7831K2627k6993j8493Q930L1665N36j1173Q723k4241k9619r512n395
$$ -4260 33571 56198 29205 10712 19642 51307 51843 40670 49393 25152 -4467 -13979 -19374
15770a9374L7714O518m630j5752o146L289J2694K3815O753j4465j1805K4139K6119
$$ -19374 18340 24858 20228 4476 -1670 1619 14313 38128 44881 30416 18611 42750 68869
15757F8869j32k1510j0127j9911k3464j9212J3225r980j748j239m569L58K790
$$ 68869 68737 47227 37100 17189 -6275 -25487 -12262 -22242 -23990 -25229 -29798 -29440 -26650
15744b6650j8398K5800K1029k0237l1078P670M8666J6518r352p85k7100P039L93
$$ -26650 -45048 -19248 1781 -18456 -49534 -41864 6802 23320 13968 13183 -13917 -6878 -6485
15731f485k7055j531m582K5577J7044j4182Q838J678M988O584l3940j7388J1113
$$ -6485 -33540 -35071 -39653 -14076 2968 -11214 -2376 -698 4290 10874 -23066 -40454 -29341
15718b9341L8854K6765p924k2555R458q890j9735R136J7645k033k130m752n222
$$ -29341 9513 36278 28354 5799 15257 6367 -13368 -4232 13413 11380 9250 4498 -724
15705g24J432l69J5332K0168k0576k6653J3214K3771j1039o684J5511r240j653
$$ -724 708 339 15671 35839 15263 -11390 1824 25595 14556 7872 23383 14143 12490
15692A2490r068P429m636N480N754M245J1086j3231l0870R04J8374R139j2456
$$ 12490 3422 10851 6215 11695 17449 21694 32780 19549 -11321 -10417 7957 17096 4640
15679D640N481J5994K813k30j4689J5185J0788k6000r020j0157J469P778L1812
$$ 4640 10121 26115 28928 28698 14009 29194 39982 13982 4962 -5195 -3726 4052 35864
15666C5864l6547k0270k6400P98K1421K6096J696k7897n697P350K5879J3636n581
$$ 35864 -683 -20953 -47353 -46555 -25134 962 2658 -25239 -30936 -23586 2293 15929 10348
15653A0348j3389K0026O626O490j3773n865k0620j7978j5878J4248o117J1445
$$ 10348 -3041 16985 23611 30101 16328 10463 -10157 -28135 -44013 -29765 -35882 -24437
15641b4437L4839K8350k2989R524Q867j8523k963N415j3774J1500N969k7131j9117
$$ -24437 10402 38752 15763 25287 34154 15631 12668 18083 4309 15809 21778 -5353 -24470
15628b4470R209O271n568N196R738p413R801l092p211r035P965O2423r482j1393
$$ -24470 -15261 -8990 -14558 -9362 376 -7037 2764 -328 -7539 -16574 -8609 53814 44332 32939
15614C2939j0155j0776J0580j1315l029k7234N770Q515k387m993r363Q707K3591
$$ 32939 22784 12008 22588 11273 8244 -18990 -13220 -4705 -7092 -12085 -21448 -12741 10850
15601A0850o273q81K4729Q814m1158K950Q775l036l504J6232L0918J5508k5161
$$ 10850 4577 3696 28425 37239 -3919 -969 7806 4770 1266 17498 48416 63924 38763
15588C8763j2095j2513j4740J0019J1727o531j1457J1576j823J9631K384l099
$$ 38763 26668 14155 -585 9434 21161 14630 3173 14749 12926 32557 34941 31842
15576C1842r141q145k6278K6791m973k0572K1939J5021Q052j4107j9828m600L8861
$$ 31842 22701 14556 -11722 15069 10096 -10476 11463 26484 34536 20429 601 -3999 34862
15563C4862N798m4634j1840J9490J14J1863J7109K6163j5222j9439k8769O588
$$ 34862 40660 -3974 -15814 3676 3790 15653 32762 58925 43703 24264 -4505 2083
15551B083P892j0097J5831r692Q481j5466J7479M5929O678j0279l6215j5693n589
$$ 2083 9975 -122 15709 6017 14498 -968 16511 62440 69118 58839 22624 6931 1342
15538A342p806j6900l2784O419N6804J6827m252k6180L0584j4859k0443m540J3288
$$ 1342 -6464 -23364 -56148 -49729 7075 23902 19650 -6530 24054 9195 -11248 -15788 -2500
15525b500l0331j5826K0957L5393K8882j613j1190q123j6471k0052k0559K8549
$$ -2500 -32831 -48657 -27700 7693 36575 34962 23772 15649 -822 -20874 -41433 -12884
15513a2884N5081j2584j6230K044K8633R024J4156o991j3660K974j1153k8403
$$ -12884 42197 29613 13383 15427 44060 53084 67240 60249 46589 49563 38410 10007
15501A0007L4241J7173k8778j1498L0883j0408j5549Q318o134j8667K387K52J500
$$ 10007 44248 61421 32643 21145 52028 41620 26071 34389 28255 9588 11975 12227 13727
15488A3727J5708Q48Q261k9707p037K0341m430m530L3926J5015l5620k9385P444
$$ 13727 29435 30283 38544 8837 1800 22141 17711 13181 47107 62122 26502 -2883 4561
15475D561n502j8424J7411R333J2819O805r868j9229j6715J7866J3094o900J8767
$$ 4561 -941 -19365 -1954 7379 20198 27003 17135 -2094 -18809 -943 12151 5251 24018
15462B4018j3147J6885O839k5402R942J2544K0629L30K089J752K267N41m3062
$$ 24018 10871 27756 34595 9193 19135 31679 52308 52638 54727 56479 58746 59287 16225
15449A6225j6110K452j9605J2556L0454P34j7606j9231Q031J0875R977R393l5614
$$ 16225 115 2567 -17038 -4482 25972 26706 9100 -10131 -2100 8775 18752 28145 -7469
15436g469j7199K9469n226p829k043K848J9776Q523p254J2555K4272n7802n1464
$$ -7469 -24668 4801 -425 -8254 -10297 -7449 12327 20850 13596 26151 50423 -7379 -58843
15423e8843J4895J1891K120J7668o095j3885k545J9559K4086K9165l216r895k3671
$$ -58843 -43948 -32057 -29937 -12269 -18364 -32249 -34794 -15235 8851 38016 34800 24905 1234
15410A234j1347K8664L115q513l614J3301J1658o899l973j6679j7993o277K9701
$$ 1234 -10113 18551 21666 13153 9539 22840 34498 27599 23626 6947 -11046 -17323 12378
15397A2378p81k6979J5299q657r551P202J954P063J2723j3063j9946J3851n874
$$ 12378 11597 -15382 -83 -8740 -18291 -11089 -9135 -2072 10651 -2412 -22358 -8507 -14381
15384a4381J279K4225O386J1887K1937L631k0496k0755r20O459r746m741J115
$$ -14381 -13102 11123 17509 29396 51333 54964 34468 13713 12793 19252 9506 4765 5880
15371E880l8017j7834J5256R664J4059M682r349J4688L421R375j5485J2982n206
$$ 5880 -32137 -49971 -34715 -25051 -10992 -6310 -15659 -971 2450 11825 -3660 9322 4116
15358D116p600Q795q384J4491J0338L1400Q328j8896j0534j7569n382j54j1564
$$ 4116 -3484 5311 -3073 11418 21756 53156 61484 42588 32054 14485 9103 8949 -2615
15345b615J2518L783l932O161J250K83J8547k0290k8547K1419O016O358N893l5002
$$ -2615 9903 13686 9754 15915 17165 17448 35995 15705 -12842 8577 14593 20951 26844 -8158
15331h158j5638J8037j3483J3272J0412J684j4394N559J7978K2520l080k2753
$$ -8158 -23796 -5759 -19242 -5970 4442 6126 -8268 -2709 15269 37789 34709 11956
15319A1956p954j1853k828L9752K9770j0858q61Q769J1936k5843j6917K4063j0206
$$ 11956 4002 -7851 -10679 29073 58843 47985 47124 55893 67829 41986 25069 49132 38926
15306C8926j7093k2962r411p45K16M236r595L886l16j3231J9954K8635K9051o018
$$ 38926 21833 -1129 -10540 -11285 -11069 -6833 -16428 -12542 -12858 -26089 -6135 22500 51551 45533
15292D5533l2984k4259J7604J9256l0214k4240p485p288J0329o42M590M0842J8288
$$ 45533 12549 -11710 5894 25150 -5064 -29304 -36789 -44077 -33748 -34390 -29800 11042 29330
15279B9330k0123j817k0631k6730l0575K8141K1600Q720k8383K1230J3459j143
$$ 29330 9207 7390 -13241 -39971 -70546 -42405 -20805 -12085 -40468 -19238 -5779 -6922
15267f922j0655J0892J0536R025J0636M000j8654l1056J4322L7641J3067j1102
$$ -6922 -17577 -6685 3851 12876 23512 27512 8858 -22198 -7876 29765 42832 31730
15255C1730r461r62P667k8958j9474K3506K039Q293K2172q084j6010j6332k6625
$$ 31730 22269 21307 28974 16 -19458 4048 6087 14380 36552 28468 12458 -3874 -30499
15242c0499K5207p23r581p254J852M190N796J9536m874L0364j1705q368Q273L116
$$ -30499 -5292 -6015 -15596 -22850 -20998 -16808 -11012 8524 3650 34014 22309 13941 22214 25330
15228B5330j5470K701K6533K1846m2715r510J0147p853O106P868k6171Q83J648
$$ 25330 9860 12561 39094 60940 18225 8715 18862 11009 17115 24983 -1188 -305 1343
15215A343N489n36j125l90k6330J6931K1025j5243L2955K5590m759j8061J5659
$$ 1343 6832 6296 5171 4781 -21549 -4618 16407 1164 34119 59709 54950 36889 52548
15202E2548R867K1754p391r943j459r467k6800N692J1762q415Q142K058p304j0176
$$ 52548 62415 84169 76778 66835 65376 55909 29109 34801 46563 38148 46290 48348 41044 30868
15188C0868j0083k2099l1528J9386J1489R40M2829j4156n0127J320R441K4212
$$ 30868 20785 -1314 -32842 -13456 -1967 -1027 41802 27646 -22481 -21161 -11720 12492
15176A2492Q201K362j2984J339l398K598l364Q072J2232J6953j8512Q182l762
$$ 12492 20693 23055 10071 11410 8012 10610 7246 15318 27550 44503 25991 34173 30411
15163C0411k3425j6559n835N03M224k6716O374N3836O922j9512k0309k1821j1153
$$ 30411 6986 -9573 -15408 -14905 -10681 -37397 -31023 22813 29735 10223 -10086 -31907 -43060
15150d3060K9390L1036K5645n529N698L969r259k7696j1639o180j2613j148J1835
$$ -43060 -13670 17366 43011 37482 43180 47149 37890 10194 -1445 -7625 -20238 -21386 -9551
15137i551L6091K9550k9179k3546k5705J3079J6176j9662J3336N2585m09j6287
$$ -9551 26540 56090 26911 3365 -22340 -9261 6915 -12747 589 53174 52765 36478
15125C6478m0791K3559j9259l4865K3516L2245J9123j5627j9217j896J4779p753
$$ 36478 -4313 19246 -13 -34878 -11362 20883 40006 24379 5162 3266 18045 10292
15113A0292k0733r984R768r584j03J606k0540k5266J6340M0443L6076J6829j475
$$ 10292 -10441 -20425 -10657 -20241 -20344 -18738 -39278 -64544 -48204 -7761 28315 45144 43669
15100D3669l991o958l7271j5886k0648j4190n424J7615N6440N2105k005l1139
$$ 43669 39678 32720 -4551 -20437 -41085 -55275 -60699 -43084 13356 65461 63456 32317
15088C2317m1429n478l1784j3256K3673M5991O901k3787j0840j3808m022J7266
$$ 32317 -9112 -14590 -46374 -59630 -35957 10034 16935 -6852 -17692 -31500 -35522 -18256
15076a8256J4884L5022N493P871R410j2521l2965J0672J5414J4217j1728l2758
$$ -18256 -3372 31650 37143 45014 54424 41903 8938 19610 35024 49241 37513 4755
15064D755M676J3708P637k5587l651K3108J4546J3851o524l248j5870j4247j989
$$ 4755 9431 23139 30776 5189 1538 24646 39192 53043 46519 43271 27401 13154 11165
15051A1165j8700M0107J2491j790q725P866q578j2070j4708l651L4559l147j66
$$ 11165 -7535 32572 45063 43273 34548 42414 33836 21766 7058 3407 37966 34819 34653
15038C4653J0355k1800o217M758l3991r59N610J8713L2994K9053q127l2017j6298
$$ 34653 45008 23208 16991 21749 -12242 -13201 -7591 11122 44116 73169 65042 33025 16727
15025A6727r707J03L4594J3666l7981r084L3386J8071j3050k2026j6550N214J2436
$$ 16727 7020 7123 41717 55383 17402 8318 41704 59775 46725 24699 8149 13363 25799
15012B5799K011l157k0795l3437K371k881j1039J2688L8656L8021P621r204p281
$$ 25799 27810 24653 3858 -29579 -27208 -30089 -41128 -28440 10216 48237 55858 46654 39373
14999C9373k3932J2009J7320J2084J7189j7616j707K148R078j523k2626j6395
$$ 39373 15441 27450 44770 56854 74043 56427 54720 56868 65946 64423 41797 25402
14987B5402m0404k3187R243J1286k2418J8584L5621L6375L390N384o526R623j8002
$$ 25402 -15002 -38189 -28946 -17660 -40078 -21494 14127 50502 53892 59276 52750 62373 44371
14974D4371j0485J862r67k4277r843j340o398q675j3746K292N0954K1117k1714
$$ 44371 33886 35748 34781 10504 661 -679 -7077 -15752 -29498 -27206 23748 44865 23151
14961B3151k6397j4592j1946o690K9407J6268j8529j1522K3463J6589k8066k5233
$$ 23151 -3246 -17838 -29784 -36474 -7067 9201 -9328 -20850 2613 19202 -8864 -34097
14949c4097q51K5887J9233j164j1290J5768K3034J1883J1875m956R72j3432l4492
$$ -34097 -34948 -9061 10172 9008 -2282 13486 36520 48403 60278 55322 56294 42862 8370
14936H370R46M891M848j6287j6484n743r496K619L0272K9371l4354k8760K2795
$$ 8370 9316 14207 19055 2768 -13716 -19459 -28955 -26336 3936 33307 -1047 -29807 -7012
14923g012L6051J5618k0932m707n337p031M2L0697L2437j8850j8012q618J3652
$$ -7012 29039 44657 23725 19018 13681 6650 6692 37389 69826 50976 32964 24346 37998
14910C7998L5254L291j0700n308l2682M540L822k0960j7706J4128K6883p993l8260
$$ 37998 73252 76543 65843 60535 27853 32393 36215 15255 -2451 11677 38560 30567 -7693
14897g693k7214K1214L4592J1957r25l0313j478J0396K5673K8199K6924j5865
$$ -7693 -34907 -13693 20899 32856 31931 1618 140 10536 36209 64408 91332 75467
14885G5467n0493j4538J0932P762j681K6532o571j4144K1580J6750l7217r691
$$ 75467 24974 10436 21368 29130 27449 53981 47410 33266 54846 71596 34379 24688
14873B4688R95Q166k0772M976k3891l504r96L0411J7739j1004m566K278j7341
$$ 24688 25683 33849 13077 18053 -5838 -9342 -10338 20073 37812 26808 22242 24520 7179
14860G179n92L9493J7955j1730k0251j9728K3604n059j9522J73r029K4188k573
$$ 7179 6587 46080 64035 52305 32054 12326 35930 30871 11349 11522 2493 26681 24108
14847B4108j5756M0478j1511j4425j8686Q443K8254J8561q253k8924j9898l1845
$$ 24108 8352 48830 37319 22894 4208 12651 40905 59466 51213 22289 2391 -29454
14835b9454j6226l415P831k6001N329m6J341L1068M0310J6377J05J3090K7786
$$ -29454 -45680 -49095 -41264 -67265 -61936 -61982 -60641 -29573 10737 27114 27219 40309 68095
14822F8095R64M893K8981k4729k9384k0773J9092K4136J5593J2486q138m3186
$$ 68095 69059 73952 102933 78204 48820 28047 47139 71275 86868 99354 91216 48030
14810D8030j8928j3483n42n036l4625k3678R678O780J4442L1712j995k634J4557
$$ 48030 29102 15619 15077 10041 -24584 -48262 -38584 -31804 -17362 14350 12355 9721 24278
14797B4278J7750k7573m450q726M130J8449r396m648K7943J3408J6777q222j3667
$$ 24278 42028 14455 10005 1279 5409 23858 14462 9814 37757 51165 67942 59720 46053
14784D6053q88j1678j9362j0065J153M487n166j3001J8162J4070L910J9272K0105
$$ 46053 45165 33487 14125 4060 5213 9700 4534 -8467 9695 23765 27675 46947 67052
14771F7052K1929j0087j0276j470R824K5693O698j6672k3519j0830k9796k4450
$$ 67052 88981 78894 68618 67148 76972 102665 109363 92691 69172 58342 28546 4096
14759D096j1384P745j1105L838J4234J2274M2161J4779j601j624j2758j2262j1241
$$ 4096 -7288 457 -10648 -6810 7424 19698 61859 76638 75037 73413 60655 48393 37152
14746C7152K6411l3921k6603K5962N462o060k0883J1754L3183K1905L823n039
$$ 37152 63563 29642 3039 29001 34463 28403 7520 19274 52457 74362 78185 73146
14734G3146k8632m1831K645R048j1422Q158L5069R837k5362j7244J1816J1493
$$ 73146 44514 2683 5328 14376 2954 11112 46181 56018 30656 13412 25228 36721
14722C6721N436O365Q106N198k1460j0129J3357j150K4651m441k6722j1635K3870
$$ 36721 42157 48522 56628 61826 40366 30237 43594 42444 67095 62654 35932 24297 48167
14709D8167R365k4085l3722m19O042J2643K0632P904q875j0475j1466J3255j8360
$$ 48167 57532 33447 -275 -694 5348 17991 38623 46527 37652 27177 15711 28966 10606
14696A0606p897K0516J135j3319Q667L6882J2904K66j7238j3799K0059n528j2836
$$ 10606 2709 23225 24360 11041 19708 56590 69494 69760 52522 38723 58782 53254 40418
14683D0418n190L1138L075k5364j8336j727K4383j7082k2457J3111O683K4837
$$ 40418 35228 66366 69441 44077 25741 24014 48397 31315 8858 21969 28652 53489
14671E3489J6063J0012j4021k4903q905l704N256j2478j9358k2589M9946Q090
$$ 53489 69552 79564 65543 40640 31735 28031 33287 20809 1451 -21138 28808 36898
14659C6898K497m57j6120j1362j7407P880J3816j1190J654O969o186M2001K3807
$$ 36898 39395 38938 22818 11456 -5951 1929 15745 4555 6209 13178 6992 48993 72800
14646G2800j7454j0563J2693k8851j4270l4098L4842N4368R244K482k3427k4125
$$ 72800 55346 44783 57476 28625 14355 -19743 15099 69467 78711 81193 57766 33641
14634C3641p716p2K837j282n897j077j879J2965K1260j5932k040J1872P355j1920
$$ 33641 25925 25853 28690 27408 21511 20434 18555 31520 52780 36848 34808 46680 54035 42115
14620D2115J9703j6739J575J6610o382k2227k1438M895j3525J1507K643q008J4158
$$ 42115 61818 45079 46654 63264 56882 34655 13217 18112 4587 16094 18737 10729 24887
14607B4887J418P792J5225M227k5140k5160L4675K22k9586m417K2350O074J7207
$$ 24887 26305 34097 49322 53549 28409 3249 37924 38146 8560 4143 26493 32567 49774
14594D9774K586K1679l477l862Q44J3301p931j1237j9371p717L6941P663J9712
$$ 49774 52360 74039 70562 66700 67544 80845 72914 61677 42306 34589 71530 79193 98905
14581I8905P491l0467N760k4763k9302j3435L1193J853j1815J3547N368o839J5686
$$ 98905 106396 75929 81689 56926 27624 14189 45382 47235 35420 48967 54335 47496 63182
14568F3182M192P506J0742L534l1329l8858N326L2154M6763j2862p172k418K128
$$ 63182 67374 74880 85622 89156 57827 18969 24295 56449 103212 90350 83178 80760 82888
14555H2888l8329l4716r981J4334J3864K0313J835j6290J1552J505l3033L457
$$ 82888 44559 9843 -138 14196 28060 48373 50208 33918 45470 46975 13942 17399
14543A7399m352j0251L0747L7993J2503Q17N101k4881j1350K4687m672k2539m031
$$ 17399 13047 2796 33543 71536 84039 84856 89957 65076 53726 78413 73741 51202 47171
14530D7171K2926R844j0156M342l3328j7651K2590J5112J0774j8794K3944k909
$$ 47171 70097 79941 69785 74127 40799 23148 45738 60850 71624 52830 76774 73865
14518G3865j016j3384k3479j4652j3151J2237Q135j3794j4824J1900K7621R539
$$ 73865 72849 59465 35986 21334 8183 20420 28555 14761 -63 11837 39458 48997
14506D8997j4407l4710p841K7373J3007j699J0656J2525P424M402l85j0741Q529
$$ 48997 34590 -120 -7961 19412 32419 30720 41376 53901 61325 65727 65342 54601 63130
14493F3130p334j9187o095J6447k7649m017L0045J5265j5058l9583J134J281q620
$$ 63130 55796 36609 30514 46961 19312 15295 45340 60605 45547 5964 7098 8379 -241
14480b41o955J9976L3745J2857m664r128j2813j95L1267J3837k564o043n0206
$$ -241 -7196 12780 46525 59382 54718 45590 32777 32582 63849 77686 75122 69079 18873
14467A8873k6649J5727J9860J0301j0212M382o662J595R684L4629p190l8414q272
$$ 18873 -7776 7951 27811 38112 27900 32282 25620 27215 36899 71528 64338 25924 17652
14454A7652N145O336K5752P181J3176m34J1104K7266l0073j3576M527k6867j5677
$$ 17652 22797 29133 54885 62066 75242 74808 85912 113178 83105 69529 74056 47189 31512
14441C1512P371Q092j0757j1979J0867k588k521L1887M0894m896j8246n251j978
$$ 31512 38883 46975 36218 24239 35106 32518 29997 61884 102778 97882 79636 74385 72407
14428G2407O305L258j5223p295N501O645j1636o413M136M769j8231k8250J020
$$ 72407 78712 81970 66747 59452 64953 71598 59962 53549 57685 62454 44223 15973 16993
14415A6993j4644L3055K4613k153j2937k8069P160L27o243M691K8602J4163K0902
$$ 16993 2349 35404 60017 57864 44927 16858 24018 24345 18102 22793 51395 65558 86460
14402H6460r22l5463m125Q850j254o083P632N4560M3219j4338o2186j4965k020
$$ 86460 85538 50075 45950 54800 53546 47463 55095 109655 152874 138536 76350 61385 59365
14389E9365n938O412J632J0301q821k4684Q175K31K9636j3083J5487N421q894
$$ 59365 53427 59839 61471 71772 62951 38267 46442 46673 76309 63226 78713 84134 75240
14376G5240k504l6121Q753k475o874J757l823L524n643n563j3655K0192K6075
$$ 75240 72736 36615 45368 42893 36019 37776 33953 37477 31834 26271 12616 32808 58883
14363E8883J0156l2060k0905n371l278L0637K7956j288j1985r135L7453J4608
$$ 58883 69039 36979 16074 10703 7425 38062 66018 64730 52745 43610 81063 95671
14351I5671J2325k7326j4111r752j5029j2657K372j0226P175j4179M712J4870
$$ 95671 107996 80670 66559 56807 41778 29121 31493 21267 28442 14263 18975 33845
14339C3845J9436M168l8739J166k1558l788K4765J1630p012J0778p853J9678O13
$$ 33845 53281 57449 18710 19876 -1682 -5470 19295 30925 23913 34691 26838 46516 47129
14326D7129j2393k8659j284J2007K0765k6116j2966o075J345M296K66n672Q766
$$ 47129 34736 6077 4793 16800 37565 11449 -1517 -7592 -6247 -1951 -1685 -7357 1409
14313A409K7997K7950p65j1151L168K5241J3397j3238j6200l394j3933j3608k26
$$ 1409 29406 57356 56591 45440 48608 73849 87246 74008 57808 54414 40481 26873 26647
14300B6647j765j2763o845J6189L3716L5225R057k6549L973J7334l078o945P769
$$ 26647 24882 12119 5274 21463 55179 90404 99461 72912 76885 94219 91141 84196 91965
14287I1965k3072L454j7314K183J1491K67k2900Q544J0824k493J820q606J310
$$ 91965 68893 72347 55033 57216 68707 68974 46074 54618 65442 62949 64769 56163 57473
14274E7473L5422K921n072j2139k6701k6345k7122l1921J2084K8410L7702L3317
$$ 57473 92895 95816 90744 78605 51904 25559 -1563 -33484 -21400 7010 44712 78029
14262G8029Q917l9095l8929j1409Q736M8337M677j5201K548j7299K0302J7258
$$ 78029 86946 47851 8922 -2487 6249 54586 59263 44062 46610 29311 49613 66871
14250F6871J258j6656j4102j657J126J4886l116j9014j195r057J799K2478L3579
$$ 66871 68129 51473 37371 35714 36840 51726 48610 29596 28401 19344 21143 43621 77200
14237G7200J2875j247k9994L95j7210L1139J6054l797j7674J3470K5621r443k0137
$$ 77200 90075 88828 58834 59229 42019 73158 89212 85415 67741 81211 106832 97389 77252
14224G7252p796j503J552m027J8433K1438j6696r965k616j4044j9145J4835o953
$$ 77252 69456 67953 69505 65478 83911 105349 88653 78688 76072 62028 42883 57718 50765
14211E0765k8502k0368l321J4240L6411M4579r207j2571M769R574k3167k8716
$$ 50765 22263 1895 -1426 12814 49225 93804 84597 72026 76795 86369 63202 34486
14199C4486K9842M6293N164k2927j8086j0194k5241p87J1514K7054Q805k3897
$$ 34486 64328 110621 115785 92858 74772 64578 39337 38550 50064 77118 85923 62026
14187F2026J1803J1519L9696L625k2516j160o634k8133P464P631j680O328L29
$$ 62026 73829 85348 125044 128669 106153 104993 98359 70226 77690 85321 83641 89969 90298
14174I0298q389j2737k3869N41R970K0805J1159n398k7076P299J0827k0889j0641
$$ 90298 81909 69172 45303 45844 55814 76619 87778 82380 55304 62603 73430 52541 41900
14161D1900j6996j309M3378L3993j1816m3091q612L8380q185j0895P065L60o583
$$ 41900 24904 23595 66973 100966 89150 46059 37447 75827 67642 56747 63812 64172 57589
14148E7589k861m420L1484J727j8094k5940j9427L8864J3675k5339j3167K6914
$$ 57589 54728 50308 81792 83519 65425 39485 20058 58922 72597 47258 34091 61005
14136F1005n09L875j1395k406J0377Q518J0391p02l9623m7582K8554l627L1832
$$ 61005 60496 64371 52976 50570 60947 69465 79856 79154 39531 -8051 20503 16876 48708
14123D8708M0030J2099o162Q012k4449k133M771J6203J8211J5415l9158l7566
$$ 48708 88738 100837 94675 102687 78238 76105 80876 97079 115290 130705 91547 53981
14111E3981K5507O422k027n751J0985j267l3616j6676j156R452J2547k7583j240
$$ 53981 79488 85910 83883 78132 89117 87850 54234 37558 36402 45854 58401 30818 29578
14098B9578K2175J4665O654O224J032K220J4405o078q231N316j2839J6129K534
$$ 29578 51753 66418 73072 79296 80328 82548 96953 90875 82644 87960 75121 91250 93784
14085I3784N555p274j6250m708J8384j2608J0685J1013r069K2693L088j4169K711
$$ 93784 99339 92065 75815 71107 89491 76883 87568 98581 89512 112205 115293 101124 103835
14072A03835R875P668r927k7348j4118q397O408J9174l406O953p659n0185k9376
$$ 103835 113710 121378 111451 84103 69985 61588 67996 87170 83764 90717 83058 32873 3497
14059C497r056o737K0138L7993L2577p474p305j325j0016l1775K0326L9070J3280
$$ 3497 -5559 -12296 7842 45835 78412 70938 63633 62308 52292 20517 40843 79913 93193
14046I3193J524m172k3769O170J7547k3384j9401j2461k026J018R526J0165k3595
$$ 93193 94717 90545 66776 72946 90493 67109 47708 35247 33221 34239 43765 53930 30335
14033C0335j1078M315M1094J7979L905O38J6756q58q469j8559k360K7061M166
$$ 30335 19257 23572 64666 82645 86550 87188 103944 103086 94617 76058 73698 100759 104925
14020A04925r838k0601q845J0168O548k0034j051K531q459k4272k1514l494L5989
$$ 104925 95087 74486 65641 75809 82357 62323 61272 63803 55344 31072 9558 6064 42053
14007D2053N2751J7664k3176l3699m848p073j9043J5182K4126j9304m93m295K1707
$$ 42053 94804 112468 89292 55593 50745 43672 24629 39811 63937 44633 44140 39845 61552
13994F1552M86J6118J0754j7789j5943Q099J3806j2539j4424K5221K3796j7299
$$ 61552 62038 78156 88910 71121 55178 63277 77083 64544 50120 75341 99137 81838
13982H1838j5479j083J5828K1003K5553j1890l1204O965j7715l5060J8546r107
$$ 81838 66359 65276 81104 102107 127660 115770 84566 91531 73816 38756 57302 48195
13970D8195j971K1446L8436Q963p480l1052N518K786k0082J7265J6099j646j4963
$$ 48195 46224 67670 106106 115069 107589 76537 82055 84841 64759 82024 98123 96477 81514
13957H1514K717k369J3766K2861J319q002N093J698J7434N886k3328j6987k5676
$$ 81514 84231 81862 95628 118489 119808 111806 116899 118597 136031 141917 118589 101602 75926
13944G5926m3117K4865L1036m642o571K766K295J078M9772K5075k7751n246j6379
$$ 75926 32809 57674 88710 84068 77497 80263 82558 83636 133408 158483 130732 125486 109107
13931A09107k8668j3068J1291K891o739J723J1393K469O028Q022N749J4949K3203
$$ 109107 80439 67371 78662 81553 74814 76537 87930 90399 96427 104449 110198 125147 148350
13918A48350K484l0698j5097O406q408k4796L296J9622k5757r23J0870J0425j1141
$$ 148350 150834 120136 105039 111445 103037 78241 81537 101159 75402 74479 85349 95774 84633
13905H4633l6551K865L023J4333j2272J5460J1602k2837L239n583J4531K4753
$$ 84633 48082 50947 53970 68303 56031 71491 83093 60256 63495 57912 72443 97196
13893I7196j5451k3359M0828J8095j0757j1336K3680k201k149Q071l977j893L085
$$ 97196 81745 58386 99214 117309 106552 95216 118896 116695 114546 122617 118640 116747 119832
13880A19832J2431J6159q083j3659j8007r169J1614j6012k2677j5804J9196R492
$$ 119832 132263 148422 140339 126680 108673 99504 111118 95106 72429 56625 75821 85313
13868H5313j854k1726J7252O130K4993J5448j1066j5593k7101K4871K3037l476
$$ 85313 83459 61733 78985 85115 110108 125556 114490 98897 71796 96667 119704 116228
13856A16228K831J146l11O994r624P11J337p572j7917K003r427q675L252K3302
$$ 116228 119059 120205 119894 126888 117264 117975 119312 111740 93823 95826 86399 77724 80976 104278
13842A04278j3475p9p870K4378L4245n405k2016j9404K7884J4593k5846J7751
$$ 104278 90803 90724 82854 107232 141477 136072 114056 94652 122536 137129 111283 129034
13830A29034j3788k3848p163L6621j1139j9102J3024k116M280k6477l0140j2609
$$ 129034 115246 91398 84235 120856 109717 90615 103639 101523 105803 79326 49186 36577
13818C6577K1669K9599l432j4497K7247K4207o987k038L944M0600J2870j3001
$$ 36577 58246 87845 84413 69916 97163 121370 114383 112345 116289 156889 169759 156758
13806A56758l4383j0456O041R055P153k5236O303m545n994K1028N70n1019k8170
$$ 156758 122375 111919 117960 127015 134168 108932 115235 110690 104696 125724 126294 75275 47105
13793D7105K5647K2173j5442K2107K7336k4698M194J443N431K5456K5126l9371
$$ 47105 72752 94925 79483 101590 128926 104228 108422 109865 115296 140752 165878 126507
13781A26507m9713L92K4139J8195N401j4481R293O718J595K2191p227m340P126
$$ 126507 76794 77186 101325 119520 124921 110440 119733 126451 128046 150237 143010 138670 145796
13768A45796k279k7808m881L345Q995J7194j4672j022P917K2232k1201k7455R14
$$ 145796 143517 115709 110828 114173 123168 140362 125690 124668 132585 154817 133616 106161 107075
13755A07075K188Q524j3710j2311P568J572o385j4521K7244J7180j4052l4894
$$ 107075 109263 117787 104077 91766 99334 100906 94521 80000 107244 124424 110372 75478
13743G5478k5500K4307J889J0602J2002l5250R698P171j333K3778L5846J1047
$$ 75478 49978 74285 76174 86776 98778 63528 73226 80397 79064 102842 138688 149735
13731A49735j1846J1517p911l796l8171j4623k1400K2242J9419j4326R29K4564
$$ 149735 137889 149406 141495 137699 99528 84905 63505 85747 105166 90840 91769 116333
13719A16333Q776M247k1150j3032M956K1439J1733j2019k1185J628L4274k561
$$ 116333 125109 129356 108206 95174 100130 121569 133302 121283 100098 101726 136000 133439
13707A33439j8136r061K4198j8620j4393K5873j352k0180M055N317O357K7529
$$ 133439 115303 106242 130440 111820 97427 123300 121948 101768 105823 111140 117497 145026
13695A45026o003l8339j4814n976M0829j1229j5823K7817J3395j1142j8039j986
$$ 145026 139023 100684 85870 79894 120723 109494 93671 121488 134883 123741 105702 103716
13683A03716K550L20J6970J2713j6929k6824J0155k3507j0059P815o158K1851
$$ 103716 106266 106586 123556 136269 119340 92516 102671 79164 69105 76920 70762 92613
13671I2613K6256Q332K078l1490p43J0186L0424J9313j590l9876k6251j32j9832
$$ 92613 118869 127201 129279 97789 97046 107232 137656 156969 155379 115503 89252 89120 69288
13658F9288k2525Q082J9218M1023K5067o666O832R815j9901k7835Q713J9569l614
$$ 69288 46763 54845 74063 115086 140153 133487 140319 150134 130233 102398 111111 130680 127066
13645A27066K1559K3540j9791j1732K436q746J3414J2888m308J0599k8612p300
$$ 127066 148625 172165 152374 140642 143078 134332 147746 160634 156326 166925 138313 131013
13633A31013K9809j797J222j4524j5503M063l132l604n102q922l549K6609L5785
$$ 131013 160822 159025 160247 145723 130220 134283 131151 127547 122445 113523 109974 136583 172368
13620A72368j5534k1789J3120p927k662k380Q002r150r021J5853J8929l309k035
$$ 172368 156834 135045 148165 140238 137576 135196 143198 134048 125027 140880 159809 156500 154465
13607A54465j7223l047P133j092Q266J4174q786J0401j179k5925R616j6758k0978
$$ 154465 137242 134195 141328 140236 148502 162676 153890 164291 163112 137187 146803 130045 109067
13594A09067j1374J6412n596m522J7893J8605M800K5392k3542l0197J0193K7633
$$ 109067 97693 114105 108509 103987 121880 140485 145285 170677 147135 116938 127131 154764
13582A54764Q649l2732p164J980m053K2164K5808j6284q183r319j012M91k8223
$$ 154764 163413 130681 123517 125497 121444 143608 169416 153132 144949 135630 134618 135109 106886
13569A06886m501Q75L746p656n883Q125j4988Q183J6327J9789M438K1015L6750
$$ 106886 102385 103260 107006 99350 93467 101592 86604 94787 111114 130903 135341 156356 193106
13556A93106j5490j9173l2363k3331L3569K1115j1377O8r594j8473m511j3075
$$ 193106 177616 158443 126080 102749 136318 157433 146056 146124 136530 118057 113546 100471
13544A00471l3323K6288M6669O853R181J3672k3285j1627J4164j834j9678j8525
$$ 100471 67148 93436 140105 146958 156139 169811 146526 134899 149063 147229 127551 109026
13532A09026J0416j868j7547Q733j982J3226J6063P112L0768L2606j7101l8447
$$ 109026 119442 117574 100027 108760 106778 120004 136067 143179 173947 206553 189452 151005
13520A51005l8935m118k208j7008m731J2091L5416N7719k606j6818M010j9618
$$ 151005 112070 107952 105744 88736 84005 96096 131512 189231 186625 169807 173817 154199
13508A54199o501J1689J4692L3768o009m4281k9201m270K4996M0020r633m9412
$$ 154199 147698 159387 174079 207847 201838 157557 128356 124086 149082 189102 179469 130057
13496A30057l824K3983J237K8801k2993k2287J3015r548j7454K928J0470K1758
$$ 130057 126233 150216 151453 180254 157261 134974 147989 138441 120987 123915 134385 156143
13484A56143J7326J0827q452m366j560k3316j6040L3166K4462j6579N795J2402
$$ 156143 173469 184296 175844 171478 169918 146602 130562 163728 188190 171611 177406 189808
13472A89808J411j1405j4187p228J373P037O266j1153K0982q623m6655m2578J0969
$$ 189808 191219 179814 165627 158399 159772 166809 173075 161922 182904 174281 127626 85048 96017
13459I6017J9086k602J2371K7570K4905l323J4315K22m2083N569K586L797k0402
$$ 96017 115103 112501 124872 152442 177347 174024 188339 188561 146478 152047 154633 158430 138028
13446A38028n090n584N616J5448N42j0398o225R166l040L0259J4584l6638k2212
$$ 138028 132938 127354 132970 148418 148960 138562 132337 141503 138463 168722 183306 146668 124456
13433A24456J4753J8090L8310L1720k4920L469l5078j6928l294k2729k4800K6396
$$ 124456 139209 157299 195609 227329 202409 205878 170800 153872 150578 127849 103049 129445
13421A29445K1714j3166k9539K271J1559j9565J7258J4735l964o335M3120M6946
$$ 129445 151159 137993 108454 110725 122284 102719 119977 134712 130748 124413 167533 214479
13409B14479N530j9149k1284r312j3170n915l7054M65o65L4578J2571k8462j4102
$$ 214479 220009 200860 179576 170264 157094 151179 114125 114590 113925 148503 161074 132612 118510
13396A18510J1545K0998J9905K1849m330j1447K071j5211K2579J6069j6358k0608
$$ 118510 130055 151053 170958 192807 188477 177030 179101 163890 186469 202538 186180 165572
13384A65572J5578p001o733k2994r718j4035J2504K8032J6075Q04O274K292Q87
$$ 165572 181150 174149 167416 144422 134704 120669 133173 161205 177280 178084 184358 186650 187537
13371A87537P473J1094p708k5071l3729K954J348N19J5524L3098K6949j6446k7843
$$ 187537 195010 206104 198396 173325 139596 142550 143898 144417 159941 193039 219988 203542 175699
13358A75699k584L3359K6989P900m3904j018j893K4813n489N390J9310l0697m8999
$$ 175699 173115 206474 233463 241363 197459 196441 194548 219361 213872 219262 238572 207875 158876
13345A58876j500l0898k4078J2244J7364P624P472p98q23L7714L0678Q385P883
$$ 158876 157376 126478 102400 114644 132008 139632 147104 146306 145483 183197 213875 222260 230143
13332B30143J45N215o469o999j2478k0720J0854J6937O911j1941k9669N600P456
$$ 230143 230288 235503 229034 222035 209557 188837 199691 216628 223539 211598 181929 187529 194985
13319A94985L8205K535J4538m346o100j3807l5730l5071K6820J0796J0774k2547
$$ 194985 233190 235725 250263 245917 239817 226010 190280 155209 182029 192825 203599 181052
13307A81052J4590K973Q091j980l0618o829M1696J5267j522k4332k3723J0331
$$ 181052 195642 198615 206706 204726 174108 167279 208975 224242 222720 198388 174665 184996
13295A84996j1048j0684j571K0162K1998r791N377K2010R941J0528J245m119j9144
$$ 184996 173948 163264 161693 181855 203853 194062 199439 221449 231390 241918 243163 239044 219900
13282B19900k7147M926K6844L0184r919j495l4145j5157L8809l2885N881J7725
$$ 219900 192753 197679 224523 254707 244788 243293 209148 193991 232800 199915 205796 223521
13270B23521J1825j1189j9203J3026Q219o150r04O590L663l265J0926k4068j0234
$$ 223521 235346 224157 204954 217980 226199 220049 219145 225735 229398 226133 237059 212991 202757
13257B02757j1519j2280J7551L349l1364k1537J4910J7273L7062r558p543K0264
$$ 202757 191238 178958 196509 199858 168494 146957 161867 179140 216202 206644 199101 219365
13245B19365K948O55K4372J5310j6335J1311J7062k0865k2554q905J9746o901
$$ 219365 222313 222968 247340 262650 246315 257626 274688 253823 231269 222364 242110 235209
13233B35209J2854J679j7023p24k2253J009K0863j5973K9697J8128j4382o827
$$ 235209 248063 249742 232719 231995 209742 210751 231614 215641 245338 263466 249084 242257
13221B42257l107o687K849K8310n875m0557q768p33q84K7977L6012k2878k5479
$$ 242257 239150 232463 235312 263622 257747 217190 208422 207689 206805 234782 270794 247916 222437
13208B22437p476K12j1999K2534m886J7066J6834J5977q494M110K420j6127k0352
$$ 222437 214961 215173 203174 225708 220822 237888 254722 270699 262205 266315 268735 252608 232256
13195B32256O557R608k5327K861N3717J1590k7049q018O232o998j3199J350J0842
$$ 232256 238813 248421 223094 225955 279672 291262 264213 256195 262427 255429 242230 243580 254422
13182B54422j3111m2469P223J4969J5419k7536r258J5586k3502J6559J6328m275
$$ 254422 241311 198842 206065 221034 236453 208917 199659 215245 191743 208302 224630 220355
13170B20355r897M650Q460k1558K6925L4989O594j0688J3440J2666j3674J54Q275
$$ 220355 210458 215108 223568 202010 228935 263924 270518 259830 273270 285936 272262 272416 280691
13157B80691L727o280j5838L175j5046k7627m962M639k0406K6612K6950q067k980
$$ 280691 284418 278138 262300 265475 250429 222802 217840 222479 202073 228685 255635 247568 244588
13144B44588J3157N221j894K9581o660J3530J7723l3479k8898p339l9004O116
$$ 244588 257745 262966 261072 290653 283993 297523 315246 281767 252869 245530 206526 212642
13132B12642K1122N073k8891o172J2501N970J1761K5836n415j8630J943L5351
$$ 212642 233764 238837 209946 203774 216275 222245 234006 259842 254427 235797 237740 273091
13120B73091J1940k0009N894j5958O777j4418M420L3543j4509k3848j909M0204
$$ 273091 285031 265022 270916 254958 261735 247317 251737 285280 270771 246923 245014 285218
13108B85218J0083j8672j7812L7146L2781K273m1305J190M881L7446N339Q944
$$ 285218 295301 276629 258817 295963 328744 331017 289712 290902 295783 333229 338568 347512
13096C47512P2458O8744R7360J85110K54642L80214L21306N2577k02903m05842
$$ 347512 419970 488714 586074 771184 1025826 1406040 1727346 1779923 1577020 1171178
13086A171178l29242j97877j19897p3628o5887j7734k2444k0927k3806k0694j3035
$$ 1171178 841936 644059 524162 450534 384647 366913 344469 323542 299736 279042 266007
13075B66007J6050J6258K3941j2891R192K3751k7042j7732j7880K3170P756n909
$$ 266007 282057 298315 322256 309365 318557 342308 315266 297534 279654 302824 310580 304671
13063C04671J3548N948l6125l4227o241k924l2340j394R980j6119m79J0122j4654
$$ 304671 318219 324167 288042 253815 247574 244650 212310 210916 220896 204777 204298 214420 199766
13050A99766J9910o487r400K9455L3410K5916L2376l411k9739l4425Q084J291
$$ 199766 219676 213189 203789 233244 266654 292570 324946 321535 291796 257371 265455 266746
13038B66746K2533R430j9065O591P078J1418j1598n485q776L5004K9540k1322
$$ 266746 289279 298709 279644 286235 293313 304731 293133 287648 278872 313876 343416 322094
13026C22094k1031q570L375k567L3214J848k1963q652k1409J3976K6669J6661
$$ 322094 301063 292493 295868 293301 326515 328363 306400 297748 276339 290315 316984 333645
13014C33645J7604j7478j2186R882k3850k3748j3915J477L4442L317q377p495
$$ 333645 351249 333771 321585 331467 307617 283869 269954 271431 305873 309190 300813 293318
13002B93318R002j96k1344J1293Q314J8658r108o530K409r277K618n09J0191Q992
$$ 293318 302320 302124 280780 292073 300387 319045 309937 303407 305816 296539 299157 298648 308839 317831
12988C17831l3949l525N3557J2871K842J4310m157m0375J4603p094o232M0q928
$$ 317831 283882 280357 333914 346785 349627 363937 359780 319405 334008 326914 320682 320722 311794
12975C11794L358j7829m326p912o452n565K4417L3254r913k1847Q075K3570O255
$$ 311794 315152 297323 292997 285085 278633 273068 297485 330739 320826 298979 307054 330624 336879
12962C36879p278k6733n632K2p661J0860K7707K3879k491L431k9542o658q019
$$ 336879 329601 302868 297236 297258 289597 300457 328164 352043 349552 352983 323441 316783 308764
12949C08764q545J0165J6601j981k1907R033K4765J6085O095j2997m256K3412
$$ 308764 300219 310384 326985 325004 303097 312130 336895 352980 359075 346078 341822 365234
12937C65234J52k45k8104j6632P090n396J085L8833L058q267k1121j2716J6297
$$ 365234 365386 365141 337037 320405 327495 322099 323184 362017 365075 356808 335687 322971 339268
12924C39268l3099J7958J2211q801j3946J6212O52K5237K3082q231l779M330J4894
$$ 339268 306169 324127 336338 327537 313591 329803 330455 355692 378774 370543 366764 371094 385988
12911C85988J3031n521m4270m295n895j2153P35K9784P935K347K0565J8100J1485
$$ 385988 399019 393498 349228 344933 339038 326885 327620 357404 365339 367686 388251 406351 417836
12898D17836o026j4987l4193j907J1192J4095J9028j7432j2873J9498N3031J2969
$$ 417836 411810 396823 362630 360723 371915 386010 405038 387606 374733 394231 447262 460231
12886D60231K0874K6921M451l3052m8219k3056k9072J4268J9961J5111k5724l0509
$$ 460231 481105 508026 512477 479425 431206 408150 379078 393346 413307 428418 402694 372185
12874C72185J4053K7826P204k4586m672j495r145m829j3878K0024P229J7430J5702
$$ 372185 386238 414064 421268 396682 392010 390515 381370 376541 362663 382687 389916 407346 423048
12861D23048K5769K344k9051k6782J3495L0639j5219k6243j1382J2615J2906l609
$$ 423048 448817 451161 422110 395328 408823 439462 424243 398000 386618 399233 412139 408530
12849D08530K6201k7888k1974K7539K9933J4591j6773o391N204J051k537J5702
$$ 408530 434731 406843 384869 412408 442341 456932 440159 433768 438972 440023 437486 453188
12837D53188j0267k5256q342L574L0696J9108J8389J5720K732L25l978q118k1364
$$ 453188 442921 417665 409323 412897 443593 462701 481090 496810 499542 499867 495889 487771 466407
12824D66407K6713R733m1066q5478o7641r801L4224M3869N067J5366J5384J9484
$$ 466407 493120 502853 461787 376309 308668 298867 333091 376960 382027 397393 412777 432261
12812D32261J2889k432n4042n2438k3964K7407P696K5620O391j853k24K5731m634
$$ 432261 445150 442718 388676 336238 312274 339681 347377 372997 379388 377535 377311 403042 398408
12799C98408J478k0691j0022J7215J6168O115n544J6279K9924J8132n040j6994
$$ 398408 399886 379195 369173 386388 402556 408671 403127 419406 449330 467462 462422 445428
12787D45428l0316j7860k687M95q620j928K5902Q334o096o984J1707O956J2614
$$ 445428 415112 397252 394565 395060 386440 384512 410414 418748 412652 405668 417375 424331 436945
12774D36945K9546N222j4424K784l987n887J3734j5101o942M8142N2765L7084
$$ 436945 466491 471713 457289 460073 456086 450199 463933 448832 441890 490032 542797 579881
12762E79881K2239K4031L5078P3931J45437J14356N8202m3257q8735r1456r2230
$$ 579881 602120 626151 661229 735160 880597 994953 1053155 1009898 921163 829707 737477
12751G37477k4288j610q260Q586q678R708j4258l649j2538K277J6421m0732m1516
$$ 737477 713189 711579 703319 711905 703227 712935 698677 695028 682490 684767 701188 660456 618940
12738F18940j1223L0239O770j5046J635k5189j3194J5698k3546k4137K0351J6198
$$ 618940 607717 637956 644726 629680 631315 606126 592932 608630 585084 560947 581298 597496
12726E97496j474O341m322j0123P283O397K7381k5588k4650L3312K3909L6378
$$ 597496 596022 602363 598041 587918 595201 601598 628979 603391 578741 612053 635962 672340
12714F72340J3350l5614J441K2207J3811L6224J6579k194j4864k9165q34J9641
$$ 672340 685690 650076 651517 673724 687535 723759 740338 738144 723280 694115 693281 712922
12702G12922J4865K3507K4095p317N467L1835O586q038n409q180n967K2556J6022
$$ 712922 727787 751294 775389 768072 773539 805374 811960 803922 798513 790333 784366 806922 822944
12689H22944K4520k853q173K8502M6965j7397J3552J8501L2053M8152J0472J4679
$$ 822944 847464 844611 836438 864940 911905 894508 908060 926561 958614 1006766 1017238 1031917
12677A031917K7439O9973K7129N438j3633R302R4603P9807M4516J5966O1533J16218
$$ 1031917 1059356 1129329 1156458 1161896 1148263 1157565 1252168 1331975 1376491 1392457 1453990 1570208
12665A570208J23856J15461M4700M7559M2798J9333N0766J50251J23143J16432
$$ 1570208 1694064 1809525 1854225 1901784 1944582 1963915 2014681 2164932 2288075 2404507
12655B404507J49008J68851K22345K83768L61716M76509O28654Q31571J032514
$$ 2404507 2553515 2722366 2944711 3228479 3590195 4066704 4695358 5526929 6559443
12646F559443J182497J146058J047488J180384J810581K853890M194245O398371
$$ 6559443 7741940 8887998 9935486 11115870 12926451 15780341 19974586 26372957
12638B6372957J0355625J7662102L1721337N6765236Q2162157O3259558P695502
$$ 26372957 36728582 54390684 86112021 142877257 225039414 288298972 295994474
12631B95994474n7228471q4781558n9953305l3113281j8684999j1394285p351036
$$ 295994474 238766003 153984445 94031140 60917859 42232860 30838575 23487539
12624B3487539m909433l392807k329800j587733j168395j056827j124755j182579
$$ 23487539 18578106 15185299 12855499 11267766 10099371 9042544 7917789 6735210
12616F735210r81740o87811n20166l88876l28733l28820k87844k26855k22040
$$ 6735210 5753470 5065659 4545493 4156617 3827884 3499064 3211220 2984365 2762325
12607B762325k11014j78873j48603j27569r6640o6383l5798l3423m5138j02081
$$ 2762325 2551311 2372438 2223835 2096266 1999626 1933243 1897445 1864022 1818884 1716803
12597A716803j40893r6485p8128l4145k6151m1524n6688m0424l4362k5594m085
$$ 1716803 1575910 1479425 1401297 1367152 1341001 1299477 1242789 1202365 1168003 1142409 1138324
12586A138324l3056j9943J1933L6513J3748K7972K1731m1415m4584o2775n2876
$$ 1138324 1105268 1085325 1097258 1133771 1147519 1175491 1197222 1155807 1111223 1048448 995572
12575I95572j6775l885k2225m1145m924l0717l5419j7112l7753K6726M6243J3234
$$ 995572 978797 974912 952687 911542 906618 875901 840482 823370 785617 812343 858586 871820
12563H71820k2557k4039k3298l4336l1006j3713J5230J021k7260k0201M3623j0315
$$ 871820 849263 825224 801926 767590 736584 722871 738101 739122 711862 691661 735284 724969
12551G24969j5038l1927j7362L0324L1514Q119k3308J2521l286m3942j0822m517
$$ 724969 709931 678004 660642 690966 722480 730599 707291 719812 716526 672584 661762 657245
12539F57245k1412L1918J6866p223m8249J201J698n243j8883l1771m628J2545
$$ 657245 635833 667751 684617 677394 629145 630346 632044 626801 607918 576147 571519 584064
12527E84064Q803K8307j855k0121j1707K011L8412r521n2593m1118k2212L2518
$$ 584064 592867 621174 619319 599198 587491 589502 627914 618393 565800 524682 502470 534988
12515E34988J0650l4854o2926l6968m2121l5645k3607K1648O4357O6029J6249
$$ 534988 545638 510784 447858 410890 368769 333124 309517 331165 395522 461551 477800
12504D77800l1245J1015N641N6089M4472L1639J9746J4822j3151o791J0868m835
$$ 477800 446555 457570 463211 519300 563772 595411 615157 629979 616828 610037 620905 616070
12492F16070j6351q730o88k0979Q606J8424K0915l429q666L3201r538j3987p000
$$ 616070 599719 590989 590301 569322 577928 596352 617267 613838 605172 638373 628835 614848 607848
12479F07848n769r120m984j802P030L967J6139n209r043J5385k091p119j3031
$$ 607848 602079 592959 587975 586173 593203 597170 613309 608100 599057 614442 612351 605232 592201
12466E92201M3836K0495k9255l9071k077J0016J132k056l898J5146k7189o778
$$ 592201 636037 656532 627277 588206 586129 596145 597277 595221 591323 606469 579280 572502
12454E72502n689K5316q781M844K6270O201K0475N7277J7975j2022n7779q7344
$$ 572502 566813 592129 583348 588192 614462 620663 641138 698415 716390 704368 646589 559245
12442E59245m9710l7565j1481j0587O455j554N2272N8710J2406L1487R055j6077
$$ 559245 509535 471970 460489 449902 456357 454803 507075 565785 578191 609678 618733 602656
12430F02656l5390j6766j6047l3799j857J5038j2527J7985L1028L8188k1023j2287
$$ 602656 567266 550500 534453 500654 498797 513835 501308 519293 550321 588509 567486 555199
12418E55199K7474J4729j5835N468k030Q677j858k7196r061j3107K0607J4596
$$ 555199 582673 597402 581567 587035 585005 593682 591824 564628 555567 542460 563067 577663
12406E77663j2560k5754j5937J476N099M344N879J8134M558n292o705Q66M516
$$ 577663 565103 539349 523412 524888 529987 534331 540210 558344 562902 557610 550905 551771 556287
12393E56287m11m276Q558k8947j3593J7338J8275J1312Q205O034O81K6941j3252
$$ 556287 555876 551600 560158 531211 517618 534956 553231 564543 572748 578782 579463 606404 593152
12380E93152j4560k2420j660N867L4614l933n6573N591M0722J9410r316l5445
$$ 593152 578592 556172 554512 560379 594993 591060 534487 540078 580800 600210 590894 555449
12368E55449k2312o26K976J0281k2063P869K2352J788j9741j4533L014J2780o262
$$ 555449 533137 532511 535487 545768 523705 531574 553926 555714 535973 521440 524454 537234 530972
12355E30972k2527O540M302L653K4719J9900o906P398J4671l5710j2827K7679
$$ 530972 508445 514985 519287 522940 547659 567559 560653 568051 582722 547012 534185 561864
12343E61864L899k2197J0396K0791j4081j7827l5641K47q762R736L4543J5296
$$ 561864 565763 543566 553962 574753 560672 542845 507204 507451 498689 508425 542968 558264
12331E58264j5057j4686o539J0306j0952k2311o304j5865K7143K9995K4155j0742
$$ 558264 543207 528521 521982 532288 521336 499025 492721 476856 503999 533994 558149 547407
12319E47407j4914j8529j1898O384L2604Q057j3847j5222n101m278R976L0014
$$ 547407 532493 513964 502066 508450 541054 549111 535264 520042 514941 510663 520639 550653
12307E50653J1931k2544r145k5186L437Q610J3626l6431k6438K2053P722j756
$$ 550653 562584 540040 530895 505709 509146 517756 531382 494951 468513 490566 498288 496532
12295D96532K0583K4736P322k3266j90k5546P130K1494l883J6625l2159j6087
$$ 496532 517115 541851 549173 525907 525717 500171 507301 528795 524912 541537 509378 493291
12283D93291K9611L790r049M222q89j3517j3997j2060J6172R449j1220q445K1036
$$ 493291 522902 526692 517643 521865 520976 507459 493462 481402 497574 507023 495803 487358 508394
12270E08394k0210j01N434l763K6529l490J5791j4879n321J5671J1123j3652k0350
$$ 508394 488184 488083 493517 489754 516283 512793 528584 513705 508384 524055 535178 521526 501176
12257E01176j6683q919l3794k4436q992K9560N4490R863L0908j7742k005N213
$$ 501176 484493 475574 441780 417344 408352 437912 492402 502265 533173 515431 513426 518639
12245E18639L483k6918p951k6895r280K5580l59m6383n847J9186J3266J8384J2003
$$ 518639 522122 495204 487253 460358 451078 476658 476299 429916 424069 443255 456521 474905 486908
12232D86908n921k4970r601R003K8161J8482J7376k2735l7198j5035J3167N3509
$$ 486908 480987 456017 446416 455419 483580 502062 519438 496703 459505 444470 457637 511146
12220E11146q49n080j3658l8942L863L4245K2228r863k0065K196J7433j1677r764
$$ 511146 510297 505217 491559 452617 456480 490725 512953 503090 483025 485221 502654 490977 481213
12207D81213J5872L879p227k1966K458K221j7988P129p012J05J6328J1867k0327
$$ 481213 497085 500964 493737 471771 474229 476450 458462 465591 458579 458684 475012 486879 466552
12194D66552J4814L4347L136j2794j4023n737O169l2539q928J5466K9829J5265
$$ 466552 481366 515713 518849 506055 492032 486295 492464 459925 450997 466463 496292 511557
12182E11557m091k1762k2191K2475L4113L3535Q108P420K5125P5367J42251J86422
$$ 511557 507466 485704 463513 485988 520101 553636 561744 569164 594289 669656 811907 998329
12170I98329K64251L77283K90576K7181k84944m20565l10815j73758q6984n4120
$$ 998329 1262580 1639863 1930439 1957620 1672676 1252111 941296 767538 680554 626434
12160F26434l7787k1969q350l4210K711P951j3284m2135J2393j477j6238j214
$$ 626434 588647 566678 558328 524118 526829 534780 521496 479361 491754 490277 474039 472825
12148D72825m182p575j9771M069j1250k29j3982k3670M3962J4313j9518Q782M238
$$ 472825 468643 461068 441297 445366 434116 433887 419905 396235 440197 454510 434992 443774 448012
12135D48012k0157j0893j4624J3964R386K1820K3653j8734j5691K870o155k6335
$$ 448012 427855 416962 402338 416302 425688 447508 471161 452427 436736 439606 433451 407116
12123D07116j0920J5334M8776o660J5983k0491l5764J4753K9786k3301k3892r984
$$ 407116 396196 411530 460306 453646 469629 449138 413374 428127 457913 434612 410720 400736
12111D00736n755J6279O093R898j1960O739J4340l095J4171L1611j309j5868n917
$$ 400736 394981 411260 417353 427251 415291 422030 436370 433275 447446 479057 477748 461880 455963
12098D55963l1218N597r328k1629n780J748p834K6897J2591J3081L2446J6k5081
$$ 455963 424745 430342 421014 399385 393605 395353 387519 414416 427007 440088 472534 472550 447469
12085D47469r528o990j9935J4188m17j1307r595N346J2302J427j5004j5923K3189
$$ 447469 437941 430951 411016 425204 424787 413480 403885 409231 421533 422960 407956 392033 415222
12072D15222J2538N209j6671M95l1519j7887n839R32k416Q664J2984R450J6901
$$ 415222 427760 432969 416298 416793 385274 367387 361548 362480 360064 368728 381712 391162 408063
12059D08063k244J1422J8397k3307R343j4722P825J9705l880j6535n065l6513
$$ 408063 405819 417241 435638 412331 421674 406952 414777 434482 430602 414067 409002 372489
12047C72489n183m610j4528J1644N967K7960N348j6579o424J5925R507L715R51
$$ 372489 367306 362696 348168 359812 365779 393739 399087 382508 376084 392009 401516 405231 406182
12034D06182J4089J1465J4037L466J51m8764l8541L022J7797K198k8813N649K4401
$$ 406182 420271 431736 445773 449239 449390 400626 362085 365107 382904 385102 356289 361938 386339
12021C86339J9684L7268k844l1619j8772J8726o998k4228j0256J5499J3895o581
$$ 386339 406023 443291 440447 408828 390056 408782 401784 377556 367300 382799 396694 390113
12009C90113p567q00q846j5607N787j4916o103q260k4891j5666J9395K1157K3802
$$ 390113 382546 381746 372900 357293 363080 348164 342061 333801 308910 293244 312639 333796 357598
11996C57598j9657j9869l326L1093K6218J2738j8334j269l363J392k909J6188
$$ 357598 337941 318072 314746 345839 372057 384795 366461 365192 361829 363221 360312 376500
11984C76500j6421j5577K3700K2429K428j7144j7662P809o005Q621J5652j8399
$$ 376500 360079 344502 368202 390631 393059 375915 358253 366062 360057 368678 384330 365931
11972C65931k0326R441n504n528l484J3380J8079N29q499l4181Q064L95p446j1449
$$ 365931 345605 355046 349542 344014 340530 353910 371989 372518 364019 329838 337902 338297 330851 319402
11958C19402j4757M814N6071N9609K7302m389m0027k9075j0687o653J5135R8r890
$$ 319402 304645 309459 365530 425139 452441 448052 408025 378950 368263 361610 376745 376843 366953
11945C66953J576o724L1928K0882j1331m4071J7218K741k0354m6533k8294K2021
$$ 366953 368529 361805 393733 414615 403284 359213 376431 379172 358818 312285 283991 306012
11933C06012M329M4358L9155j3774m784J1775m72k0149k4387j1034K4545Q058
$$ 306012 310341 354699 393854 380080 375296 387071 386599 366450 342063 331029 355574 363632
11921C63632j4218j8510M10k8588J0674L6686L4122J3037k9290k6009j6199J1870
$$ 363632 349414 330904 331314 302726 313400 350086 384208 397245 367955 341946 325747 337617
11909C37617L530k5016r570J2946L1383R920k451J7173l7608l1755p838J9054
$$ 337617 341147 316131 306561 319507 350890 360810 358359 375532 337924 306169 298331 317385
11897C17385k0377J838J1014J0874K238O764l0650o412K5059j4543J0474J5968
$$ 317385 297008 298846 309860 320734 322972 329736 299086 292674 317733 303190 313664 329632
11885C29632J6569k2734J0155J009l883j819N715J4837n3249j7058K0172K5559
$$ 329632 346201 323467 333622 334631 330748 328929 334644 349481 296232 279174 299346 324905
11873C24905j708j8164j0547k1581K5757J61m827j1079L7728R104o315q218J9433
$$ 324905 323197 305033 294486 272905 298662 298823 293996 282917 320645 329749 323434 315216 334649
11860C34649k68k6218l1233J5765K9788M594k2297j0326R032j4971j3830k2678
$$ 334649 334381 308163 276930 292695 322483 327077 304780 294454 303486 288515 274685 252007
11848B52007K4784Q651Q382Q171j8938o91K2131j969q929J1141j2225j6612n202
$$ 252007 276791 285442 293824 301995 283057 282366 304497 302528 293599 304740 292515 275903 270701
11835B70701Q768K8218n420k9691j241K2818j6953k1623q593L4381j9j548J0500
$$ 270701 279469 307687 302267 272576 271335 294153 277200 255577 246984 281365 281346 279798 290298
11822B90298K7141J9861j7733j3149j4221q859J1516j1530k9089J0281K3890O798
$$ 290298 317439 337300 319567 306418 292197 283338 294854 283324 254235 264516 288406 295204
11810B95204L4020l919k7021p014l868m5825j5349J6628J9808R283l2333q261
$$ 295204 329224 325305 298284 291270 287402 241577 226228 242856 262664 271947 239614 231353
11798B31353m912Q074r063R969K2142J0686j1465j2252k349J3603k0215k7951
$$ 231353 226441 234515 225452 235421 257563 268249 256784 244532 242183 255786 235571 207620
11786B07620K878M1602K3741O695p555j3631l1471J310J1243J776o067M549J2923
$$ 207620 210498 252100 275841 282536 274981 261350 229879 231189 242432 244208 238141 242690 255613
11773B55613j4508J8749K3044P831l7153k4460k781n415L057K1229K2823M268
$$ 255613 241105 259854 282898 290729 253576 229116 226335 220920 223977 245206 268029 272297
11761B72297k066r279l4237m9158j831l230l096O345L7959R927j1766r328J2489
$$ 272297 270231 260952 226715 177557 175726 172496 169400 175745 213704 223631 211865 202537 215026
11748B15026K8274m701J9731K1655j7564j9462j5913j3567O638r28N883Q494J9786
$$ 215026 243300 238599 258330 279985 262421 242959 227046 213479 220117 219189 225072 233566 253352
11735B53352K313j9955m645P814O83j4185M782J4920M707J4374J104J3222O078
$$ 253352 255665 235710 231065 238879 239562 225377 230159 245079 249786 264160 265264 278486 284564
11722B84564k726J9979k5378n0734N688J997j0101j3089K930P757K111L089J7018
$$ 284564 281838 301817 276439 225705 231393 233390 223289 210200 213130 220887 222998 226087 243105
11709B43105J5627k9280O270Q336o428n887J7543L2294r761r64j507n898k7919
$$ 243105 258732 229452 235722 244058 237630 231743 249286 281580 271819 270855 269348 263450 235531
11696B35531n962j5719j3467J6264L7158j7447m4787J2088K4471K7214j5347j8821
$$ 235531 229569 213850 200383 216647 253805 236358 191571 203659 228130 255344 239997 221176
11684B21176k914P184J0313p906K8909K3839k4175k0408L156J3822j6528k1265
$$ 221176 218262 225446 235759 227853 256762 280601 256426 236018 239174 252996 236468 215203
11672B15203k7320k0098K4450J7703K5333J6994j193k4486j5955p095J3013J4546
$$ 215203 187883 167785 192235 209938 235271 252265 251072 226586 210631 203536 216549 231095
11660B31095jj6561j0181M782k0806j5857K0404L3897j3331M907J0058k4553k3389
$$ 231095 231094 214533 204352 209134 188328 172471 192875 226772 213441 218348 228406 203853 180464
11647A80464K481n988J3178K2724K7038K686k0762q243j999Q412N3196L7950J9902
$$ 180464 182945 176957 190135 212859 239897 242583 221821 213578 211579 219991 273187 311137 331039
11634C31039Q037l4924j8425o778l6054k4825q906k045j0061J0220j487m952N380
$$ 331039 339076 304152 285727 278949 242895 218070 209164 207119 197058 207278 205791 200839 206219
11621B06219j0839j3300J99J4488J6029o234r144p385r552m812o179L2300L897
$$ 206219 195380 182080 182279 196767 212796 206562 197418 190033 180481 175669 169490 201790 205687
11608B05687M901J3546r582J1241K0810l999m143p39j6218M11k6351j8371k8607
$$ 205687 210588 224134 214552 225793 246603 242604 238461 237722 221504 221915 195564 177193 148586
11595A48586n479J6479k1507P100O0258K4902N920j512m353l4382o736j6802k202
$$ 148586 143107 159586 138079 145179 205437 230339 236259 234747 230394 196012 189276 172474 170272
11582A70272n863j1174j9960l460l936Q216K4163L348L582q272J0609L7117l790
$$ 170272 164409 153235 133275 129815 125879 134095 158258 161606 165188 156916 167525 204642 200852
11569B00852o49J3886N775m353q732n599j7604J9447J990j8674l3189j870L2163
$$ 200852 200203 214089 219864 215511 206779 201180 183576 203023 205013 186339 153150 151280 183443
11556A83443N993P682k596j0020J0403p124j1262j7971R238N050j4014j7477j3360
$$ 183443 189436 197118 194522 184502 194905 187781 176519 158548 167786 172836 158822 141345 127985
11543A27985L3834K3912j8385r309O469J0945O174R470K6835m700j8374l0151
$$ 127985 161819 185731 167346 158037 164506 175451 181625 191095 217930 213230 194856 164705
11531A64705j8763J6582K3421l891n75K4198P426k9592j1329p846l538O786K4264
$$ 164705 145942 162524 185945 182054 181479 205677 213103 183511 172182 164336 160798 167584 191848
11518A91848N862j8347k4066J5085K3248j1594r106j87J7374r353k9937J1663
$$ 191848 197710 179363 155297 170382 193630 182036 172930 172743 190117 180764 150827 162490
11506A62490J6065M143m409J610k1034k2314k4494j8927M11M0078j4946j1885
$$ 162490 178555 182698 178289 179899 158865 136551 112057 93130 93541 133619 118673 106788
11494A06788m528K2397K8574m002k813k0853q032K2010q365M351M802J7599k1209
$$ 106788 102260 124657 153231 149229 146416 125563 117531 139541 131176 135527 140329 157928 136719
11481A36719M382j6774k9538K1982M4261j122O471J0640J2740k087j5589r925
$$ 136719 141101 124327 94789 116771 161032 159910 166381 177021 189761 187674 172085 162160
11469A62160m145L6335K3025k4244l0899j9370j4305K3766J408l819L5167l8250
$$ 162160 158015 194350 217375 193131 162232 142862 128557 152323 153731 149912 185079 146829
11457A46829q601M324l070Q117P269L264K452Q302j6513Q11K0914k6j5760k996
$$ 146829 138228 142552 139482 147599 154868 158132 160584 168886 152373 153184 174098 174072 158312 155316
11443A55316o663K4543O252J5090K050j3364j8208k1948m561L9720L2099j4184
$$ 155316 148653 173196 179448 194538 196588 183224 165016 143068 138507 178227 210326 196142
11431A96142k7041J424K7668k2909k3120K1814k3854j2910L128K323J639P619
$$ 196142 169101 170525 198193 175284 152164 173978 150124 137214 140342 142665 144304 151923
11419A51923J2561j4099j6239n796J143p098m275J1467Q752k6996o393N120J4592
$$ 151923 164484 150385 134146 128350 129493 122395 118120 129587 138339 111343 104950 110070 124662
11406A24662K3100O711k4579j9319j983k1059N575J3343J95J0795J0971o429j6882
$$ 124662 147762 154473 129894 110575 108592 87533 93108 106451 106646 117441 128412 121983 105101
11393A05101L824J9399L2424J0320n223M395K9049o133k0792k8111m314J4387
$$ 105101 108925 128324 160748 171068 165845 170240 199289 193156 172364 144253 139939 154326
11381A54326l257r210P895j1625J0855j256k4946o180J6024K9044L265J912j992
$$ 154326 151069 141859 149754 138129 148984 147728 122782 116602 132626 161670 164935 166847 164855
11368A64855m745k1672L546J7850R733k5664K1289n268l3685P434P257m572j4568
$$ 164855 160110 138438 141984 159834 169567 143903 165192 159924 126239 133673 140930 136358 121790
11355A21790K3856K7392m418k5834n082j1980J3319J5308m4755l9420j2882K9756
$$ 121790 145646 173038 168620 142786 137704 125724 139043 154351 109596 70176 57294 87050
11343H7050J4953n204n329n170j3790J568K5771R256p079J742r19J6168q4o738
$$ 87050 102003 96799 91470 86300 72510 74078 99849 109105 102026 103768 102849 119017 118933 112195
11329A12195m551j3154K6778o269j4237q81p185j3897J320J3509p633J9122K0727
$$ 112195 107644 94490 121268 114999 100762 99881 92696 78799 80119 93628 85995 105117 125844
11316A25844r275k7010n996M887J6739J1207m51k4457Q066K9955m250M464n134
$$ 125844 116569 89559 83563 88450 105189 116396 115945 91488 99554 129509 125259 129723 124589
11303A24589r162N542L6051m908j0250j553j0475J714K2098J3365k5340r886m229
$$ 124589 115427 120969 157020 152112 141862 140309 129834 131548 153646 167011 141671 131785 127556
11290A27556j4660K2233M135J435n709J8952L3179k8907k8532q994j6863q601
$$ 127556 112896 135129 139264 140699 134990 153942 187121 158214 129682 120688 103825 95224
11278I5224J4286L847L7421q211k9659M850J3589K993L413r502J1919J0418l9720
$$ 95224 109510 113357 150778 142567 112908 117758 131347 134340 137753 128251 140170 150588 110868
11265A10868M750J9751n544m181k523Q508j6879j5733o8O46K15M679L2j2272k0041
$$ 110868 115618 135369 129825 125644 123121 131629 114750 99017 98949 99595 99810 104489 104521 92249 72208
11250G2208m702N193j7111J7933J3639L7419j910j7382J7688N96J158k977m5763
$$ 72208 67506 72699 55588 73521 87160 124579 122669 105287 122975 123571 124729 121752 75989
11237G5989n0902K494K6087L2251K1735N931p457j1768K391J7638J687j6363N840
$$ 75989 25087 27581 53668 85919 107654 113585 106128 94360 96751 114389 116076 99713 105553
11224A05553j754R576L364j2779p421j9753l3659N112P900J7085O553P112J0426
$$ 105553 103799 113375 116739 103960 96539 76786 43127 48239 56139 73224 79777 86889 97315
11211I7315l487p22p329n553l395K354k3210M126K1353R766R250j8532k4137M7763
$$ 97315 93828 93106 85777 80224 76829 79183 55973 60099 81452 91218 100468 81936 57799 105562
11197A05562L2324l493o005j575j6214j8976J7222K2201r660j7451M604q78J1044
$$ 105562 137886 134393 128388 126813 110599 91623 108845 131046 121386 103935 108539 107661 118705
11184A18705L210N528J0473J5281j9858n0569n183Q924J4048J2010R665k607k1987
$$ 118705 121915 127443 137916 153197 133339 82770 77587 86511 100559 112569 122234 119627 97640
11171I7640r488J87L2627K4678r94j3593k1825o1917o241J2566j5001J5860L5498
$$ 97640 88152 88339 120966 145644 144650 131057 109232 47315 41074 53640 38639 54499 89997
11158H9997J5707J7828m6597l5965j1718m283j0593K9801K0990J3137J28k8893
$$ 89997 105704 123532 76935 40970 29252 24969 14376 44177 65167 78304 78432 49539
11146D9539k5130K1355M3573J0138L085J5730j3595k2811j0399K7090m263k6850
$$ 49539 24409 45764 89337 99475 102560 118290 104695 81884 71485 98575 94312 67462
11134F7462l84L0654j5889m2763J931L2240p796J33N238N621M900J745K6541r29
$$ 67462 67078 97732 81843 39080 41011 73251 65455 65588 70826 76447 81347 83092 109633 108704
11120A08704j5569j6271j8151J5303M376j4301j8361q834M430j9973J8131K5163
$$ 108704 93135 76864 58713 74016 78392 64091 45730 36896 41326 21353 39484 64647
11108F4647J7268o139K1305L5952m720j5815o518k4511k0743r708j4627m3709
$$ 64647 81915 75776 97081 133033 128313 112498 105980 81469 60726 51018 36391 -7318
11096g318L4171L2334M8238k6821j6762p145K384L4058J1714k7551n574j4347
$$ -7318 26853 59187 107425 80604 63842 56697 59081 93139 104853 77302 71728 57381
11084E7381J2310K7086q820K937J7116N354p041J1842k1041q574J2602q405j5430
$$ 57381 69691 96777 87957 90894 108010 113364 106323 118165 97124 88550 101152 92747 77317
11071G7317o562k3205n374Q656L112N395J6361p765M054K3023k146n952J5981
$$ 77317 70755 47550 42176 50832 53944 59339 75700 67935 71989 95012 92866 86914 102895
11058A02895j835j0639K9762j7409k4088r979k459J1497r818j3758k1050l1769
$$ 102895 101060 90421 120183 102774 78686 68707 66248 77745 67927 54169 33119 1350
11046A350K8615L0671J6705J3722j0991o518M0848L3783J8900n374J2798p191
$$ 1350 29965 60636 77341 91063 80072 73554 114402 148185 167085 161711 174509 167318
11034A67318j2586q129q139m08J1378K356J5267N313J343J4301M5077J0341R161
$$ 167318 154732 146603 138464 138056 149434 151790 167057 172370 173713 188014 233091 243432 252593
11021B52593k1693k8794l1440j455N3605L7202L8926K2352J0797J4838l1946k3736
$$ 252593 230900 202106 170666 169211 222816 260018 298944 321296 332093 346931 314985 291249
11009B91249m5244k6837l8312l8028K8704L4224q166K3125j119j8656l4077m0197
$$ 291249 246005 219168 180856 142828 171532 205756 197590 220715 219596 200940 166863 126666
10997A26666j9794j0551j220R015J371J3373M9164l742j5322K157k0115n037l28
$$ 126666 106872 96321 95101 104116 105487 118860 168024 164282 148960 151117 131002 125965 125637
10984A25637K358J128j360o589l8934q052j6540r903j2695J2245K4731J1090n096
$$ 125637 127995 129123 127763 121174 82240 74188 57648 47745 35050 47295 72026 83116 78020
10971G8020O327J3789r733m446K1517j371k0444j4864m6044l4898m724M5427O506
$$ 78020 84347 98136 88403 83957 105474 104103 83659 68795 22751 -12147 -16871 28556 35062
10958C5062K2711R73k5562m854J5130M2452N992k3656J0661k0006j4238K7232
$$ 35062 57773 58746 33184 28330 43460 85912 91904 68248 78909 58903 44665 71897
10946G1897J4525J7229L5694j0935J4497J7672L99k3808n5596j9172j8770J4504
$$ 71897 86422 103651 139345 128410 142907 160579 160978 137170 81574 62402 43632 58136
10934E8136Q510j5633J7056R817j5356j0948J0463J7309j639k7995o656J1365
$$ 58136 66646 51013 68069 77886 62530 51582 62045 79354 77715 49720 43064 54429
10922E4429o500p875k4387K1370L210J5519M984K2361J3521j7958j7828j6775
$$ 54429 47929 40054 15667 37037 40247 55766 60750 83111 96632 78674 60846 44071
10910D4071J4085R365j4627k2301k3096K867l60K6677J2263O669J3029K5417L964
$$ 44071 58156 67521 52894 30593 7497 10364 10004 36681 48944 55613 68642 94059 98023
10897I8023j9609l3993j2479N189j2654J1700j3476K316J0296R074j9613N313
$$ 98023 78414 44421 31942 37131 24477 36177 22701 25017 35313 44387 24774 30087
10885C0087K0457L1390P547J2531j6729j2585L796l0338m4360K7907Q948L462
$$ 30087 50544 81934 89481 102012 85283 72698 76494 46156 1796 29703 38651 42113
10873D2113P057L000m641J426J5460J1004J7867j4163j948J2973J8249j2371l071
$$ 42113 49170 52170 47529 48955 64415 75419 93286 79123 77175 90148 108397 96026 92955
10860I2955P928p53m515o438J193k9246m298J3027J4687J4028n05Q760k0739j1656
$$ 92955 100883 100130 95615 89177 90370 61124 56826 69853 84540 98568 98063 106823 86084 74428
10846G4428N100k2705o280o146O803J1171J8653J4878n057j8556k7682j7428J7906
$$ 74428 79528 56823 50543 44397 51200 62371 81024 95902 90845 72289 44607 27179 45085
10833D5085K8273P435k4666j7628o909j3624K5728J5576P56k5447j2784K1023
$$ 45085 73358 80793 56127 38499 31590 17966 43694 59270 60026 34579 21795 42818
10821D2818R118l009j0593k533l9001J8173K0031K1289j0584k2020R19M448j0645
$$ 42818 51936 48927 38334 35801 -3200 14973 35004 56293 45709 23689 24608 29056 18411
10808A8411m556n021o556P90j234L6400K8121J6630j9974j1149l4550J4085L5673
$$ 18411 13855 8834 2278 3068 1834 38234 66355 82985 63011 51862 17312 31397 67070
10795F7070j2229k0974j57r38J0331J8697L48K719L285k2398j7962j7428K7643
$$ 67070 54841 33867 33710 32772 43103 61800 62148 64867 68152 45754 27792 10364 38007
10782C8007K5984N460K768j3805m070K2587o887j779o346Q909J5108j7720j8105
$$ 38007 63991 69451 72219 58414 54344 76931 70044 68265 61919 70828 85936 68216 50111
10769E0111j5772M305K0393N598K177k1020k7946j2701j5035k482J7136Q725K4481
$$ 50111 34339 38644 59037 64635 66812 45792 17846 5145 -9890 -12372 4764 13489 37970
10756C7970j0383l6155k1119J4871L6855P001j434O529l4871p707j086K4816j9998
$$ 37970 27587 -8568 -29687 -14816 22039 29040 27606 34135 -736 -8443 -9529 15287 -4711
10743d711j8186n579L384l3036k4177k1241M3148N2172M6283K2980k233k89k5646
$$ -4711 -22897 -28476 -25092 -58128 -82305 -103546 -60398 -8226 38057 61037 58804 58515 32869
10730C2869k6290J3171j2682K510L2019K0911j0670l6850J2772L1452j4819J5571
$$ 32869 6579 19750 7068 9578 41597 62508 51838 14988 27760 59212 44393 59964
10718E9964J1234Q166l935J9600J3394j7684q955j0190j0153R281L3030J2159
$$ 59964 71198 79364 75429 95029 108423 90739 81784 71594 61441 70722 103752 115911
10706A15911Q723j3396J7371J0937l812m48k3813n33r419J7274l013J5633J5800
$$ 115911 124634 111238 128609 139546 135734 135286 111473 110940 101521 118795 115782 131415 147215
10693A47215R294k5833l7306N215M002J7065N699j4272k6229J7189p962l4705
$$ 147215 156509 130676 93370 98585 102587 119652 125351 111079 84850 102039 94077 59372
10681E9372l5739n649p455J4812K0942O635M250j1160P912Q0M7519L3142j4169
$$ 59372 23633 17984 10529 25341 46283 52918 57168 46008 53920 54000 101519 134661 120492
10668A20492m0962r381j6590%M868l7857J926K9852L102J2373R931l519J858q37
$$ 120492 79530 70149 53559 53559 58427 20570 22496 52348 55450 67823 77754 74235 76093 75256
10654G5256p032j8652k665Q375K0845M2426K3510k8656n437J5863K4143m645J3998
$$ 75256 68224 49572 46907 55282 76127 118553 142063 113407 107970 123833 147976 143331 157329
10641A57329K2212J8690j1465j8635L292J1432R51K8952J5725P400J8452L4396
$$ 157329 179541 198231 186766 168131 171423 182855 183806 212758 228483 235883 254335 288731
10629B88731N5156M1509J0064M0373J00697J04811Q7641Q7393L6204O2726J04487
$$ 288731 343887 385396 395460 435833 536530 641341 728982 816375 852579 915305 1019792
10618A019792J69273J83377K52241L41749M52237O70355R48901J300381J782654
$$ 1019792 1189065 1372442 1624683 1966432 2418669 3089024 4037925 5338306 7120960
10609G120960K293324K519257K197776J232014P2995p62177r70898o34805K6708
$$ 7120960 9414284 11933541 14131317 15363331 15436326 14674149 13703251 13068446 13095154
10600A3095154R29246K013635L297072M613196N181905M252972J656025j368066
$$ 13095154 14024400 16038035 19335107 23948303 29130208 33383180 35039205 33671139
10592C3671139l288952l459413k442121q82682P30029K489083M421377O115941
$$ 33671139 30382187 26922774 24480653 23597971 24328000 26817083 31238460 37354401
10584C7354401O591459M581867M66761l842475o327897o221124m657321k785273
$$ 37354401 43945860 48527727 48994488 45152013 38824116 32602992 27945671 25160398
10576B5160398j039204O27605K179723L368359L446738J864740j011692l817554
$$ 25160398 24121194 24748799 26928522 30296881 33743619 35608359 34596667 30779113
10568C0779113n134557m761170l500746k177279j137652k36823N36092R46765
$$ 30779113 25644556 20883386 17382640 15205361 14067709 13830886 14366978 15313743
10560A5313743Q60759J28363j038930k090578k525453k373284j903807j415952
$$ 15313743 16174502 16302865 15263935 13173357 10647904 8274620 6370813 4954861
10552D954861j002821p06121n19571m11986l25531k30257j90905j80251j41140
$$ 4954861 3952040 3245919 2726348 2314362 1988831 1758574 1567669 1387418 1246278
10543A246278j02148r8639o3515m5771o0829m7758m5992n6576n7708n2120m7251
$$ 1246278 1144130 1045491 981976 936205 875376 827618 781626 725050 667342 615222 567971
10532E67971k8160l2392l3233n608N036j3568j5961j5968q687j2391k2086r113
$$ 567971 539811 507419 474186 468578 473614 460046 444085 428117 419430 407039 384953 375840
10520C75840n324l6020p843k2045l314q709J687K1546j0879n3757j4105O703m838
$$ 375840 370516 334496 326653 304608 301294 292585 294272 315818 304939 251182 237077 243780 238942
10507B38942k904J0888J2853k6010j5553o097Q262j8587q935J4687o948N376k1198
$$ 238942 236038 246926 259779 233769 218216 212119 220381 201794 192859 207546 200598 205974 184776
10494A84776K1519k395l3117j1238J9014j2749l4632q417J0673J6626k370J3706
$$ 184776 206295 203900 170783 159545 178559 165810 131178 122761 133434 150060 147690 161396
10482A61396j5665k1807k655J6238L608j2149l1111j1652J6887j0333l2951k0735
$$ 161396 145731 123924 121269 137507 141115 128966 97855 86203 103090 92757 59806 39071
10470C9071K0959K7299L4980j9989l895O691M622l2791k7616k090K7034Q027n465
$$ 39071 60030 87329 122309 102320 98425 105116 109738 76947 49331 47241 74275 82302 76837
10457G6837J0681k072j6086O234J765J883M806k0296K0103n972M54M212j3797
$$ 76837 87518 85446 69360 75594 77359 79242 84048 63752 83855 77883 78337 82549 68752
10444F8752N377k0440J6874j501R71O826j1215O44R829l407K9605L3639M381J9992
$$ 68752 74129 53689 70563 69062 70033 76859 65644 66288 76117 72710 102315 135954 140335 160327
10430A60327j684l6318l6302J6125m423M1188K2563j3335j219K1307k7107j670
$$ 160327 158643 122325 86023 102148 97725 138913 161476 148141 146922 168229 141122 139452
10418A39452k1395m616q774j4720K1840J2196m920J6804k9149j3102q75Q225j1320
$$ 139452 118057 113441 104667 89947 111787 123983 119063 135867 106718 93616 92741 100966 89646
10405H9646j5309J4989q2o180J5661k2957n051K8222j5528k5691J6569M4850O121
$$ 89646 74337 89326 89244 83064 98725 75768 70717 98939 83411 57720 74289 119139 125260
10392A25260r373l7793m4467j856K6167J5790j5012j6933j6413j0311R084J5994
$$ 125260 115887 78094 33627 31771 57938 73728 58716 41783 25370 15059 24143 40137
10380D0137L9296K4659k4566j1327k5152J6576J5508k3460p728j1956O884J1618
$$ 40137 79433 104092 79526 68199 43047 59623 75131 51671 43943 31987 38871 50489
10368E0489Q257L3716j2667j5387r856n090O425K3493O19l447J0336r44J933j8089
$$ 50489 58746 92462 79795 64408 54552 49462 55887 79380 79999 76552 86888 85944 87877 69788
10354F9788j6116J3929j3069j5962K830k745K9531K4234J3854J5053j0147k1891
$$ 69788 53672 67601 54532 38570 41400 38655 68186 92420 106274 121327 111180 89289
10342H9289J6051J2879M691l5917k3079j6797K5341L9439P11r645N243m181k4463
$$ 89289 105340 118219 122910 86993 63914 47117 72458 111897 112608 102963 108206 104025 79562
10329G9562k2510l304P42j981j4275j4864K7660J9094R204N539M852R022K6474
$$ 79562 57052 53748 54490 52509 38234 23370 51030 70124 79328 84867 89719 98741 125215
10316A25215J8797k8056k656k0718k5912j8543M417j2926l660K634L931J7115
$$ 125215 144012 115956 113300 92582 66670 48127 52544 39618 35958 38592 42523 59638
10304E9638j6105R98J0623K525j9032J039J4390K3166L3435k2320j8064R52J0438
$$ 59638 43533 44531 55154 57679 38647 39686 54076 77242 110677 88357 70293 71245 81683
10291H1683j6428k8472k1263Q775K1887K2606K1510l365j5584l5722N674k157
$$ 81683 65255 36783 15520 24295 46182 68788 90298 86933 71349 35627 41301 39144
10279C9144o82j255J0070K084j3571K604J1598K7563o320J9090k548j4293p509
$$ 39144 38462 37207 47277 49361 35790 38394 49992 77555 71235 90325 87777 73484 65975
10266F5975N840K5507j0178N877P427m993k0509L2531j1027l1999j0939P392n629
$$ 65975 71815 97322 87144 93021 100448 95455 74946 107477 96450 64451 53512 60904 55275
10253E5275L870m424O676l529J3193j4241j0271n79N38l06j2744l77k5486j0102
$$ 55275 59145 54721 61397 57868 71061 56820 46549 45970 46508 46202 33458 33081 7595 -2507
10239b507J1759R530J4216Q376Q16K2619L241j9382J7995l264p129K988N586R457
$$ -2507 9252 18782 32998 41374 42190 64809 68050 48668 66663 63399 56270 59258 64844 74301
10225G4301o827j8201K871K6159K605l4101N615J7945k127n22k8402q743L701
$$ 74301 67474 49273 52144 78303 80908 46807 52422 70367 68240 67718 39316 30573 34274
10212C4274m644J5459J6084K700j4008R606j654o986O909q143j3950N009j7028
$$ 34274 29630 45089 61173 63873 49865 59471 57817 50831 57740 49597 35647 40656 23628
10199B3628N987n251R989m112k5584J5351J6083k0151r576k999R509M0590K6535
$$ 23628 29615 24364 34353 30241 4657 20008 36091 15940 6364 3365 12874 53464 79999
10186G9999j1278j6770o784K1215k2714j7609L971L0879o170o279N865L2638j7489
$$ 79999 68721 51951 45167 66382 43668 26059 30030 60909 54739 48460 54325 86963 69474
10173F9474j7920Q846J453K1828N700p799r534J6458J6176p725n634L5236M8398
$$ 69474 51554 60400 61853 83681 89381 81582 72048 88506 104682 96957 91323 126559 174957
10160A74957K5363P328K263Q211j7212k5432k5917l2591K3298L5707J0251K3450
$$ 174957 200320 207648 209911 218122 200910 175478 149561 116970 140268 175975 186226 209676
10148B09676O108K6364O0940P830j602n3227m9575j3894j4395o200J0986L4994
$$ 209676 215784 242148 303088 310918 309316 256089 206514 192620 178225 172025 183011 218005
10136B18005L9154J5195k4457k0507l1318k7233l0186m407J2800j3466j8775J0215
$$ 218005 257159 272354 247897 227390 196072 168839 138653 134246 147046 133580 114805 125020
10124A25020J6189n960j4454l6920j0253o26N973L340o071j2378j0146K0349J032
$$ 125020 141209 135249 120795 83875 73622 72996 78969 82309 76238 63860 53714 74063 75095
10111G5095K038k0907k3316J3275R805n448k742J1336O184O499o101K548j4150
$$ 75095 77133 56226 32910 46185 55990 50542 47800 59136 65320 71819 65718 68266 54116
10098E4116J114M994k7838l571j2060J461J6466K906K615J8189L63P326k4715
$$ 54116 55230 60224 32386 28815 16755 18216 34682 37588 40203 58392 58755 66081 41366
10085D1366m6819J2544J3759K4887J6641m41m1690j5674K8920K3764k2356j6501
$$ 41366 -5453 7091 20850 45737 62378 61937 20247 4573 33493 57257 34901 18400
10073A8400l9298J411L5658r109j5776J2433R846r898k180j2186L0837k1272l1691
$$ 18400 -20898 -19487 16171 7062 -8714 3719 13565 3667 1487 -10699 20138 -1134 -32825
10060c2825J0599L0318n293P524K3939o354r093J8780L828J9826J6320r68k5954
$$ -32825 -22226 8092 2799 10323 34262 27908 18815 37595 41423 61249 77569 76601 50647
10047E0647l6704J3880L1597J1705l7483l1629Q327n104l9528j5640L2066K0825
$$ 50647 13943 27823 59420 71125 33642 2013 10340 5236 -34292 -49932 -17866 2959
10035B959L3414J4007n286J0771J3225J5334r983k9761q795K0538J642l8117j3777
$$ 2959 36373 50380 45094 55865 69090 84424 74441 44680 35885 56423 58065 19948 6171
10022F171J2156J1428J1776N523N684n412J7108K995l2349p136J0954k4307l9397
$$ 6171 18327 29755 41531 47054 52738 47326 64434 67429 35080 27944 38898 14591 -24806
10009b4806k1268M7805L1696P99J1341j4228K9837j073k9584M904m886k0026j0549
$$ -24806 -46074 1731 33427 34226 45567 31339 61176 60103 30519 35423 30537 10511 -38
9996c8J600J442K3848q119l6471j3228L472K2389L5592L9040n164k5555R698n624
$$ -38 1562 3004 26852 18733 -17738 -30966 -27494 -5105 30487 69527 64363 38808 48506 42882
9982D2882m1198j9974q07K7735M6628L9034l4165l2004N235l880l327k3492l659
$$ 42882 1684 -18290 -19097 8638 55266 94300 60135 28131 33366 29486 26159 2667 -992
9969i92J4459J2345J4181j7478J0865l1510j8499J5780J588j6869J1085k7712
$$ -992 13467 25812 39993 22515 33380 1870 -16629 -849 739 -16130 -5045 -32757
9957c2757K2304M5992o604j6429j3880j0197K7356k867k85l429k4062j7561q841
$$ -32757 -10453 35539 28935 12506 -1374 -11571 15785 12918 12633 9204 -14858 -32419 -41260
9944d1260P229L7354N837l373Q562k623j2369j3813J7252J1833J4612p929k061
$$ -41260 -34031 3323 9160 5787 14349 11726 -643 -14456 2796 14629 29241 21312 19251
9931A9251O345k4343j5452Q13J3815j287J1253M1724j481p952k0894l6776j3626
$$ 19251 25596 1253 -14199 -13386 429 -858 10395 52119 50638 42686 21792 -14984 -28610
9918b8610P350R131j4591O72Q943l985K2176L1493k0686l0961R230k800K9680
$$ -28610 -21260 -12129 -26720 -26048 -17105 -21090 1086 32579 11893 -19068 -9838 -12638 17042
9905A7042L0074j1428j4090P556j584l835k845j156j5157J5755J6787J7405j2125
$$ 17042 47116 35688 21598 29154 27570 23735 20890 19734 4577 20332 37119 54524 42399
9892D2399Q127k8212j4158J2983M1372p356j232m114k8487n2849J5557K7073q587
$$ 42399 50526 22314 8156 21139 62511 55155 53923 49809 21322 -31527 -15970 11103 2516
9879B516k4697J3057j12J9501L115J8257l54R698K131l753J6339J3010Q250n7752
$$ 2516 -22181 -9124 -9236 10265 13380 31637 31283 40981 43112 39359 55698 68708 76958 19206
9865A9206j5073J0069J767l655R62J608j665J2332L3200r42J6918k095k0045N995
$$ 19206 4133 14202 15969 12314 13276 14884 13219 25551 58751 57809 74727 72632 52587 58582
9851E8582q599j3332k6139J5638Q345k8156J4968L4253p165k5184j1528J8406
$$ 58582 49983 36651 10512 26150 34495 6339 21307 55560 48395 23211 11683 30089
9839C0089j167P959k273j3445l586J9491M615k8856Q033j75J8523j772k2724J4371
$$ 30089 28922 36881 34608 21163 17577 37068 41683 12827 20860 20685 39208 37436 14712 29083
9825B9083j9949L650K2699J8108k0595O322L657l1341k8058j8947M941K3968j0634
$$ 29083 9134 12784 35483 53591 32996 39318 42975 11634 -16424 -35371 -30430 -6462 -17096
9812a7096l4662J8997J7373J2943j1291K845J9716J5027k1220l0865K267K741
$$ -17096 -51758 -32761 -15388 -2445 -13736 -10891 8825 23852 2632 -28233 -25966 -23225
9800b3225J5027K9633J7072j8151j9088j4657J5364l134j6402j4911L101j2022
$$ -23225 -8198 21435 38507 20356 1268 -13389 1975 -1159 -17561 -32472 -29371 -41393
9788d1393j8514J2226L2725L2578O288P483P61k14O947N503r048k4698j5317j2867
$$ -41393 -59907 -47681 -14956 17622 23910 31393 32154 31940 38887 44390 35342 10644 -4673 -17540
9774a7540J1874J1522k732p58J4364j0732j111N367R602j7729m483M030k2696
$$ -17540 -5666 5856 3124 2366 16730 5998 4887 10254 19856 2127 -2356 1674 -21022
9761b1022K2963J5651p386O481L856J0528l096n830J7543J0384k4786j0034j4585
$$ -21022 1941 17592 10206 16687 20543 31071 27975 22145 39688 50072 25286 15252 667
9748F67k232J1922J6237R997j9318j4392m801j278r696J2250J8555J8434j8469
$$ 667 -1565 10357 26594 36591 17273 2881 -1920 -3198 -12894 -644 17911 36345 17876
9735A7876l9543k569Q829L568L123P041O056n405J335L293k4559j6935K1679J6269
$$ 17876 -21667 -24236 -15407 -11839 -8716 -1675 4381 -1024 311 3604 -20955 -37890 -16211 58
9721E8N083K6882k3617l588q92j6769j890j1842j778J2836l867K5404J3279k6376
$$ 58 5141 32023 8406 4818 3926 -12843 -14733 -26575 -28353 -15517 -19384 6020 19299 -7077
9707g077j1468r984J9316P287K3314J7873k6618j8431K205P792K5528L275j9946
$$ -7077 -18545 -28529 -9213 -1926 21388 39261 12643 -5788 -3583 4209 29737 33012 13066
9694A3066m5123J5338J0028j3368Q244J1826j5154J3585j8586k7372L5748J0214
$$ 13066 -32057 -16719 -6691 -20059 -11815 11 -15143 -1558 -20144 -47516 -11768 -1554
9682a554j6292j218K4422L8472J8281j8159j2875m574p135R741K0349k3972k440
$$ -1554 -17846 -19064 5358 43830 62111 43952 31077 26503 19368 29109 49458 25486 23046
9669B3046r600K1775L5333L433o1948l662J3095M341K1114k195l602j6814L791
$$ 23046 13446 35221 70554 73987 12039 8377 21472 25813 46927 44732 41130 24316 28107
9656B8107O00n613P040l2526Q166M7413L3601L078J7762J7885K3625O5352J70989
$$ 28107 28707 23094 30134 -2392 5774 53187 86788 89866 107628 125513 149138 214490 385479
9643C85479J56634M8908r3117j56677r5007p5360p0377j2909j1487O82L971k7382
$$ 385479 542113 591021 497904 341227 246220 170860 100483 87574 76087 76769 80740 53358
9631E3358l9341l9526r758J6948k4341j8060J0599J1380P763J2798r029N600L8121
$$ 53358 14017 -25509 -35267 -18319 -42660 -60720 -50121 -38741 -30978 -18180 -27209 -21609 16512
9618A6512l889q951J007n988k1853P000L1081Q446n983K2348J213l809L0507k3768
$$ 16512 12623 3672 4679 -1309 -23162 -16162 14919 23365 17382 39730 40943 37134 67641 43873
9604D3873m2146Q684j8411k6385K0369J6620J0228K3921L244j4629l1947O514
$$ 43873 1727 10411 -8000 -34385 -14016 2604 12832 36753 39997 25368 -6579 -65
9592f5K2239k3273K1897K0564j9082p545j884l3920P79K7872J0648Q787K9470
$$ -65 22174 -1099 20798 41362 22280 14735 12851 -21069 -20290 7582 18230 27017 56487
9579E6487Q177k4982j6758j7361K8833N386j7622j7509Pk0854k2111L6752M0700
$$ 56487 64664 39682 22924 5563 34396 39782 22160 4651 4658 -16196 -38307 -1555 39145
9566C9145J5034l900l7954r110J5951K1957J4428j0455j3801j3116p013J0924
$$ 39145 54179 50279 12325 3215 19166 41123 55551 45096 31295 18179 11166 22090
9554B2090k6339j7280J5612P531j2280K7949M928k5962q479M1666K6307k6402
$$ 22090 -4249 -21529 -5917 1614 -10666 17283 22211 -3751 -12230 29436 55743 29341
9542B9341k8566o179J272J4559J3006j448j4117j3274N439j1400j3913K5883M758
$$ 29341 775 -5404 -4132 10427 23433 21985 7868 -5406 33 -11367 -25280 603 5361
9529E361j9244k2663K6697K6055j9473J4464K661R40M11l769j2793l67k4096J4996
$$ 5361 -13883 -36546 -9849 16206 -3267 11197 13858 14798 15209 11440 -1353 -1720 -25816 -10820
9515a0820K5601n896L939N57K203o631j6871Q576J8080J2406k0942l0932L9015
$$ -10820 14781 8885 12824 13381 15584 8953 -7918 658 18738 31144 10202 -20730 18285
9502A8285L3427k1043l6406j0701p764j0565l921O174L3732j6379m3841K566J3148
$$ 18285 51712 30669 -5737 -16438 -24202 -34767 -38688 -32514 1218 -15161 -59002 -56436 -43288
9489d3288O756J6370K7541m940o6n692j8231n503j6093l3190M9078L1533j0K365
$$ -43288 -36532 -20162 7379 2439 2373 -3319 -21550 -27053 -43146 -76336 -27258 4275 4265 6630
9475F630l245n563o496p928j7885K515o999j770L335J0296K2516K0169N321j5558
$$ 6630 3385 -2178 -8674 -16602 -34487 -31972 -38971 -40741 -37406 -27110 -4594 15575 20896 5338
9461E338n005J9678K7098j804R211l7627m395L908L0975j3355j580k3647m6317
$$ 5338 333 20011 47109 45305 54516 16889 12494 16402 47377 34022 32442 8795 -37522
9448c7522q654Q383k7014R678J2723J7556m396J0026k4776j4334K9872M9941J7567
$$ -37522 -46176 -37793 -64807 -55129 -42406 -24850 -29246 -19220 -43996 -58330 -28458 21483 39050
9435C9050m200k8737m794l530j3903K6794J4380o43J9401K6894j8603l9326l8492
$$ 39050 34850 6113 1319 -2211 -16114 10680 25060 24417 43818 70712 52109 12783 -25709
9422b5709K1290K7015N127k5920j360M3441K441j5039j8940j6213Q056j333k4020
$$ -25709 -4419 22596 27723 1803 443 43884 46325 31286 12346 -3867 4189 2856 -21164
9409b1164j2870n579O380J1620K827K1942J7973j0514M601l427q607m363j1479
$$ -21164 -34034 -39613 -33233 -21613 -18786 3156 21129 10615 15216 11789 3182 -1181 -12660
9396a2660l2260o197j5004l767K6122R185n310J3511K9881L0661J594j3870j3045
$$ -12660 -44920 -51117 -66121 -69888 -43766 -34581 -39891 -26380 3501 34162 35756 21886 8841
9383H841Q31L7287l82k9670j4171K955j1770j1927M869o959k0745j4443j3678
$$ 8841 9672 46959 46577 16907 2736 5691 -6079 -18006 -13137 -20096 -40841 -55284 -68962
9370f8962n268k395K8052K8204P640j3132M7k644J7438K2758q571j2379k5050
$$ -68962 -74230 -76625 -48573 -20369 -12729 -25861 -25814 -28458 -11020 11738 3167 -9212 -34262
9357c4262J6968L9716J009J7624J4246j2912l5941j2137j6861j970J0064R272
$$ -34262 -17294 22422 23431 41055 55301 42389 6448 -5689 -22550 -24520 -14456 -5184
9345e184K8817o935k1492K9050r705j8565N773L3400j8331j9849j5568m2136P660
$$ -5184 23633 16698 -4794 24256 14551 -4014 1759 35159 16828 -3021 -18589 -60725 -53065
9332e3065Q4k322q310O442J3151K3557J6511Q092q570j5789L7044j973J6589J6422
$$ -53065 -52981 -55303 -63613 -57171 -44020 -20463 -3952 4140 -4430 -20219 16825 14852 31441 47863
9318D7863j7334n217Q812o073l1792j1982q168O686K0864m435N332j4599m837
$$ 47863 30529 25312 34124 28051 -3741 -15723 -23891 -17205 3659 -776 4556 -10043 -14880
9305a4880K1540M225q618J4136j1714J7872J4563j7202j2655j2870r152P251M049
$$ -14880 6660 10885 2267 16403 4689 22561 37124 19922 7267 -5603 -14755 -7504 -3455
9292c455L490J2865j1158j6771O426n120p937R703j0693L103L9941K1550j2544
$$ -3455 35 12900 1742 -15029 -8603 -13723 -21660 -11957 -22650 -19547 20394 41944 29400
9279B9400j2564l380j04L141M687M719l636n416j7841k1877j6034j6220K2993
$$ 29400 16836 13456 13352 16493 21180 25899 22263 16847 -994 -22871 -38905 -55125 -32132
9266c2132L2938J3509j1270j3499N198Q581J3823N38L0060J2067k8203n4416j5130
$$ -32132 806 14315 3045 -10454 -5256 3325 17148 17686 47746 59813 31610 -22806 -37936
9253c7936q459J485K3944L1797K923j5600j2535J6398L3945k3523p990j6383k1495
$$ -37936 -46395 -44910 -20966 10831 13754 -1846 -14381 2017 35962 12439 4449 -11934 -33429
9240c3429Q474j5146J5944J0394L496K9746J686J308k745K0877j3334j3324K4184
$$ -33429 -24955 -40101 -24157 -13763 -10267 19479 21165 22473 19728 40605 27271 13947 38131
9227C8131j762j7039J0212L342l3227K842L2254N097j4155J6145j8426k2815j5632
$$ 38131 36369 19330 29542 32884 -343 2499 34753 39850 25695 41840 23414 599 -15033
9214a5033K4549L521l3220r686r965J6273j1560J2695J8807O252Q529K2159n142
$$ -15033 9516 13037 -20183 -29869 -39834 -23561 -35121 -22426 -3619 2633 11162 33321 28179
9201B8179p965j8590J3421O500J4160j6096j802r43k3032j7322J7072M466k4483
$$ 28179 20214 1624 15045 21545 35705 19609 17807 16864 -6168 -23490 -6418 -1952 -26435
9188b6435J0132L7209k015j6590q21n533Q702j6822k1857J7327N2684P286M517
$$ -26435 -16303 20906 18891 2301 1480 -4053 4649 -12173 -34030 -16703 35981 43267 47784
9175D7784j0577n9196k7616o199O353K6678J4216l584K1671m723J4859J9362P027
$$ 47784 37207 -21989 -49605 -55804 -49451 -22773 -8557 -12141 9530 4807 19666 39028 46055
9162D6055m679k2753j4503J5258j1704R290o275k3309j4551L817J3277K0869J9267
$$ 46055 41376 18623 4120 19378 7674 16964 10689 -12620 -27171 -23354 -10077 10792 30059
9149C0059J678j5389J7263M4514L392k8633j3312k4410r60R282k778N708Q074
$$ 30059 31737 16348 33611 78125 81517 52884 39572 15162 14202 23484 20706 26414 34488
9136C4488j1050J4030j1287o901j0164k517J4465k4466k1921J8583J6797Q313
$$ 34488 23438 37468 26181 19280 9116 6599 21064 -3402 -25323 -6740 10057 18370
9124A8370M971J2224O575r700l9463K405o25k5566P076J1939J1440l1549N397
$$ 18370 23341 35565 42140 32440 -7023 -4618 -5243 -30809 -23733 -11794 -354 -31903 -26506
9111b6506J3975O791K7981J2753j0357r884O913k4374o316J7044k8819j1580K8649
$$ -26506 -12531 -5740 22241 34994 24637 14753 21666 -2708 -9024 8020 -20799 -32379 -3730
9098c730J4672K8226O314q688M859M131k9580j8644L310j0757J5311J8268j2674
$$ -3730 10942 39168 45482 36794 41653 45784 16204 -2440 870 -9887 5424 23692 11018
9085A1018l0613J1344K2548J6283O970j6398J3273K9000R941k7002j9739l5775
$$ 11018 -19595 -8251 14297 30580 37550 21152 34425 63425 73366 46364 26625 -9150
9073i150j8192o317Q753K5923Q192N216j9137k206k4978j5419J0213P7J2222J9034
$$ -9150 -27342 -33659 -24906 1017 9209 14425 -4712 -6918 -31896 -47315 -37102 -37025 -24803 -5769
9059e769L6281q729j1751k0772r919K5687J3928P534j1223O200k560q077o869
$$ -5769 30512 21783 10032 -10740 -20659 5028 18956 26490 15267 21467 18907 10830 3961
9046C961J8120O438P801j0385k0427J3544M067J6052N8n820R117K164k7957j916
$$ 3961 22081 28519 36320 25935 5508 19052 23119 39171 39229 33409 42526 44690 16733 14817
9032A4817K1774J5446k8716l0196J432L5118j1437k8004J693K2300j5638o276
$$ 14817 36591 52037 23321 -6875 -5443 29675 18238 -9766 -8073 14227 -1411 -7687
9020g687J5512j0935J1680J3626J3381M224j3411k408K741K2734K752L970j2505
$$ -7687 7825 -3110 8570 22196 35577 39801 26390 23982 26723 49457 52209 56179 43674
9007D3674J3870J7041l040M14O12k4136q940K081P546m6142j2846R781P351k4206
$$ 43674 57544 74585 71545 71959 72571 48435 39495 41576 49122 2980 -9866 -85 7266 -16940
8993a6940K3406K3189k675k2705j6068n323Q641o680j067J2452l330j2164j6680
$$ -16940 6466 29655 26980 4275 -11793 -17116 -8475 -15155 -16222 -3770 -7100 -19264 -35944
8980c5944k1693J3577K3355R924P678l959J2365k3082l2875J498j473j5366k0324
$$ -35944 -57637 -44060 -20705 -10781 -3103 -7062 5303 -17779 -50654 -49156 -50629 -65995 -86319
8967h6319J2410K0171J4984J688k227Q673N1932J3681k6253n8868k0387K2585
$$ -86319 -73909 -53738 -38754 -37066 -39293 -30620 21312 34993 8740 -50128 -70515 -47930
8955d7930J1852j0128j9835Q457K5413p484J6798K9181K2405l997l9023k4171
$$ -47930 -36078 -46206 -66041 -57584 -32171 -39655 -22857 6324 28729 24732 -14291 -38462
8943c8462Q363P73o285k1083j8573J7363M1723J5861j2071k7713P711K299J4152
$$ -38462 -30099 -29326 -35611 -56694 -75267 -57904 -16181 -320 -12391 -40104 -32393 -30094 -15942
8930a5942j4850k9966j44J3269q358J2877J7400L8723Q455k3684K2811J0403k6646
$$ -15942 -30792 -60758 -60902 -47633 -55991 -43114 -25714 13009 21464 -2220 20591 30994 4348
8917D348j5725m318J6614P870m73j5134j2396L2905L3088J1980O316k6832k1198
$$ 4348 -11377 -15695 919 8789 8316 -6818 -19214 13691 46779 58759 65075 38243 17045
8904A7045l3088j1339J0056R976k917j1424J5407J1792J159J8792K7214m923l3607
$$ 17045 -16043 -27382 -17326 -7350 -10267 -21691 -6284 5508 6667 25459 52673 47750 14143
8891A4143l289p681p462l2103L684J8589K9053K0804j2754r608j0133J4088J2092
$$ 14143 10854 3173 -4289 -36392 -32708 -14119 14934 35738 22984 13376 3243 17331 29423
8878B9423k683j116n64r249l126J0305K640r871k6375K3223q945r406J844j3592
$$ 29423 26740 25624 25060 15811 12685 22990 25630 15759 -10616 12607 3662 -5744 -3900 -17492
8864a7492J7097J3084k13N912L1256J3959j7987j5525m1525k0473J9375K0003
$$ -17492 -395 12689 12476 18388 49644 63603 45616 30091 -11434 -31907 -12532 7471
8852G471N396j234o057k1589k3174K936J1004o102J762M457k0996k0571M620K7673
$$ 7471 12867 11633 5576 -16013 -39187 -36251 -25247 -31349 -29587 -25130 -46126 -66697 -62077 -34404
8838c4404J8975N139j5228J6956L944k6193M899P881M169M067L475J3308j7489
$$ -34404 -15429 -10290 -25518 -8562 -4618 -30811 -25912 -18031 -13862 -9795 -6320 6988 -10501
8825a0501k1715N530J6660o73j1733J0308N451r941Q203J4802j3170j2475j0871
$$ -10501 -32216 -26686 -10026 -10699 -22432 -12124 -6673 -16614 -8411 6391 -6779 -19254 -30125
8812c0125q750k5209m873J5077J7638N193O586j3720Q56j4886j0573M4756j940
$$ -30125 -38875 -64084 -68957 -53880 -36242 -31049 -24463 -38183 -37327 -52213 -62786 -18030 -19970
8799a9970j0137J5111L3379k023l8580k4013j0179k1170J199L9081K2573O016
$$ -19970 -30107 -14996 18383 16360 -22220 -46233 -56412 -77582 -76383 -37302 -14729 -8713
8787h713j1908r551l689L557o465O008K901J3098J2055J155m481R0J1688J0590
$$ -8713 -20621 -30172 -33861 -30304 -36769 -30761 -27860 -14762 -2707 -1552 -6033 -5943 5745 16335
8773A6335r053k1332j9247l4880J5015L8441P150p045j1337l658j2700Q164K025
$$ 16335 7282 -14050 -33297 -68177 -53162 -14721 -7571 -14616 -25953 -29611 -42311 -34147 -32122
8760c2122K1655K4511K038m167k6766k548L4732J414k6882l5060k0370o741K4242
$$ -32122 -10467 14044 16082 11915 -14851 -17399 17333 18747 -8135 -43195 -63565 -70306 -46064
8747d6064L6523O382k6150J1975J9222L0690m738j5556R484k954j5994K318J5019
$$ -46064 -9541 -3159 -29309 -17334 1888 32578 27840 12284 21768 18814 2820 5138 20157
8734B0157L658l11L90m871o514J4760j5625k5842Q16N717j9574P482J4344q476
$$ 20157 23815 23504 23894 19023 12509 27269 11644 -14198 -13382 -7665 -27239 -19757 -5413 -13889
8720a3889K7349j0412O020O575j136j1617j139k921o856Q083P041K657J8404r257
$$ -13889 13460 3048 9068 15643 14507 2890 1751 -1170 -8026 57 7098 9755 28159 18902
8706A8902k0373O504K4562m624m0051j9279p384o682L2621R306j0970N345K7041
$$ 18902 -1471 5033 29595 24971 -15080 -34359 -41743 -48425 -15804 -6498 -17468 -12123 14918
8693A4918K6680K022J9850L482j6986q265Q935j3925P218j8773O529J0681k5931
$$ 14918 41598 43620 63470 66952 49966 41701 50636 36711 43929 25156 31685 42366 16435
8680A6435J4699j1796n5557j7092M2605K2072M755J34J326J5538R868j67n157
$$ 16435 31134 19338 -36219 -53311 -10706 11366 16121 16255 17581 33119 42987 42820 37663
8667C7663l079L200k2018J8210j5545k3840J0495L2343m40K526J2693j4339m136
$$ 37663 34584 37784 15766 33976 18431 -5409 5086 37429 36989 39515 52208 37869 33733
8654C3733J1222m274j4026l4711j1548J9987J5799J8590L1851j5556j7684P808
$$ 33733 44955 40681 26655 -8056 -19604 383 16182 34772 66623 51067 33383 41191
8642D1191l575M326m0310l1695n478J5354j539N503R32M723p460K657j8043k0662
$$ 41191 37616 41942 1632 -30063 -35541 -20187 -21726 -16223 -15291 -10568 -18028 -15371 -33414 -54076
8628e4076k764L5422J8639J0712J7474k402q410O332k16j8566K980K8531J7679
$$ -54076 -56840 -21418 -2779 7933 25407 23005 14595 20927 20711 2145 5125 33656 51335
8615E1335M60j8873K6447J1690Q254j5874k8270j8917L9147K1603j2234l4649
$$ 51335 51795 32922 59369 71059 79313 63439 35169 16252 55399 77002 64768 30119
8603C0119l0877K1088L1108o324L3468J2322l2350J1807O698J5319R8j0305O833
$$ 30119 -758 20330 51438 45114 78582 90904 58554 70361 77059 92378 92476 82171 89004
8590H9004o257M943K777J2793j5888K831L0875M726P918j0843Q732j315j2649
$$ 89004 82747 87690 90467 103260 87372 90203 121078 125804 133722 122879 131611 130296 117647
8577A17647K3513J887r020J2842J816k3478J4378R031K0849K01l3808j4147K044
$$ 117647 141160 143047 134027 146869 148685 125207 139585 148616 169465 169666 135858 121711 123755
8564A23755j2914O647P4j3525J4276j9390J733J171k1766k1018l464M513j1941
$$ 123755 110841 117488 117562 104037 118313 98923 100656 101827 80061 59043 55579 60092 48151
8551D8151Q432J3901l0841k8440k5444K0108J801J7638J5260J8074k7462k2905
$$ 48151 56583 70484 39643 11203 -14241 5867 7668 25306 40566 58640 31178 8273
8539H273k0220R018k0063Q036L0336j7770k4270K0444k826n563J2577J7914K4727
$$ 8273 -11947 -2929 -22992 -14956 15380 -2390 -26660 -6216 -9042 -14605 -2028 15886 40613
8526D0613J1788k5446j0956J4279K2624k4154j4798k1206r822Q46K5447P475j4518
$$ 40613 52401 26955 15999 30278 52902 28748 13950 -7256 -17078 -16232 9215 16690 2172
8513B172L2109j3041l9770k443K963R774M1397n589M833K867K1965k7016l053
$$ 2172 34281 21240 -18530 -20973 -18010 -8236 33161 27572 32405 35272 57237 30221 27168
8500B7168j8203k3732Q733k249K2528J2595m0015n111l543j0174L6364J1398o302
$$ 27168 8965 -14767 -6034 -8283 14245 26840 -13175 -18286 -21829 -32003 4361 15759 9457
8487I457k0671K1911K7874r470j8015k4751J9229J2342m872K0064m542K466N329
$$ 9457 -11214 10697 38571 29101 11086 -13665 5564 17906 13034 33098 28556 31022 36351
8474C6351O175K4271Q189l5946j9514l0444J7261L5802P32k4814k5095k0931n292
$$ 36351 42526 66797 74986 39040 19526 -10918 6343 42145 42877 18063 -7032 -27963 -33255
8461c3255J8754K5630P619n137N902N633K2968k211k6795k0258J7081J8220J2610
$$ -33255 -14501 11129 18748 13611 19513 25146 48114 45903 19108 -1150 15931 34151 46761
8448D6761j7428J3851K9503k2373N297L6551n4j2014m488Q369k188q313j6845
$$ 46761 29333 43184 72687 50314 55611 92162 92108 80094 75606 83975 81787 73474 56629
8435E6629j9728m11K61O166R752Q471L248r210r925k0151L044J8143L154j3628
$$ 56629 36901 36490 36751 42917 52669 61140 64388 55178 45253 25102 28146 46289 49443 35815
8421C5815k144m750k6807J1639R277o280j0907L6304K6905j3791k8980j4889q62
$$ 35815 33671 28921 2114 13753 23030 16750 5843 42147 69052 55261 26281 11392 10530
8408A0530j9498K0562J7022J0519L310j7465j8837J4937M311j5759k3684K011
$$ 10530 -8968 11594 28616 39135 42445 24980 6143 21080 25391 9632 -14052 -12041
8396a2041K6792O555j0759J4956o615l2017j1777j1390j531J4289J3370l4564
$$ -12041 14751 21306 10547 25503 18888 -13129 -24906 -36296 -37827 -23538 -10168 -44732
8384d4732q828J5134q736J3664K9523p527j5533K6203k003p791J0471J0799R750
$$ -44732 -53560 -38426 -47162 -33498 -3975 -11502 -27035 -832 -2835 -10626 -155 10644 20394
8371B0394k882L473p427J3996J4578K3820J4307k8792l3585J3444J8700k4654
$$ 20394 17512 20985 13558 27554 42132 65952 80259 51467 17882 31326 50026 25372
8359B5372m740K0138l848j934J5941L180j2212k9681k089M272j6178o004K3210
$$ 25372 20632 40770 36922 34988 50929 54109 41897 12216 10127 14399 -1779 -7783 15427
8346A5427j9748O535J6670M642p290q855m574Q538J2778J119n835L625k8634j5461
$$ 15427 -4321 2214 18884 23526 16236 7381 2807 11345 24123 25242 19407 23032 -5602 -21063
8332b1063L810j0448q328K223J4414R187N2928l330j6133p57N883j477P613j0009
$$ -21063 -17253 -27701 -36029 -33806 -19392 -10205 42723 39393 23260 22503 28386 26909 34522 24513
8318B4513m825P992j4607k5061k186J2384J0600J3398j622L896J5684J9534j1568
$$ 24513 19688 27680 13073 -11988 -14174 -1790 8810 22208 20586 24482 40166 59700 48132
8305D8132k4630k0831k6543j5522L8772R794j3674l0344n189O807L3636J0931
$$ 48132 23502 2671 -23872 -39394 -622 9172 -4502 -34846 -40035 -33228 408 11339
8293A1339r939k9663k02j1774l1032l861J3007N337K3358K1777L3480m913k0763
$$ 11339 1400 -28263 -28465 -40239 -71271 -75132 -62125 -56788 -33430 -11653 21827 16914 -3849
8280c849k6848j728j4821J5679J0648R941J2273J6367R090k0992k1793n117j3881
$$ -3849 -30697 -32425 -47246 -31567 -20919 -10978 1295 17662 26752 5760 -16033 -21150 -35031
8267c5031J4733L1870m212k5828J48K2217J7783Q756j9406m0582j9373P632K5455
$$ -35031 -20298 11572 7360 -18468 -18320 3897 21680 30436 11030 -29552 -48925 -41293 -15838
8254a5838J8505j5954M693M700r185L056j0958j7084J0802L1942R358j2859P004
$$ -15838 2667 -13287 -8594 -3894 -13079 -10023 -20981 -38065 -27263 4679 14037 1178 8182
8241H182N828l720j5970K019n069J4307N864j7045J1620M030L1174M777j9173
$$ 8182 14010 10290 -5680 -3661 -8730 5577 11441 -5604 6016 10046 41220 45997 26824
8228B6824j7769m001m326J0393J6077J4985l1362l6210j191M858Q81Q089M3718
$$ 26824 9055 5054 728 11121 27198 42183 10821 -25389 -26580 -21722 -20841 -12752 30966
8215C0966J0392m2723r334j7356J1122j3733J867J1774j4724p321q669K2516O668
$$ 30966 41358 -1365 -10699 -28055 -16933 -30666 -28799 -17025 -31749 -39070 -47739 -25223 -18555
8202a8555o663j1876R458j1267k172L0769J4028j1591J5009K6880L146Q241j6892
$$ -18555 -25218 -37094 -27636 -38903 -41075 -10306 3722 -7869 7140 34020 37166 45407 28515
8189B8515k570j5982m2450p655j1981l4052J5428M2360Q09k1588J5509J1672K8112
$$ 28515 25945 9963 -32487 -40142 -52123 -86175 -70747 -28387 -27578 -49166 -33657 -21985 6127
8176F127j1734J5768l678k5917J3247P135M492N307l942j8055o781q951q974L165
$$ 6127 -5607 10161 6483 -19434 -6187 948 5440 10747 6805 -11250 -18031 -26982 -35956 -32791
8162c2791K2066K2710j5272k6067J4551j4587K7349L3894J3021l6508q019N424
$$ -32791 -10725 11985 -3287 -29354 -14803 -29390 -2041 31853 44874 8366 347 5771
8150E771l9543l4636L5771L2181N072J4241K0557j1887k4566r512k1197k3982
$$ 5771 -33772 -68408 -32637 -456 4616 18857 39414 27527 2961 -6551 -27748 -51730
8138e1730P849N9414M1508k4630m0811k3633N761R706k5896K6809N827k2354N71
$$ -51730 -43881 15533 57041 32411 -8400 -32033 -26272 -16566 -42462 -15653 -9826 -32180 -31609
8125c1609L060k0689k7313m656K3857M4317j06J2898J5867K0880k569l2034q032
$$ -31609 -28549 -49238 -76551 -81207 -57350 -13033 -13139 -241 15626 36506 33937 1903 -6129
8112f129J5065p543m261j037r464K072J2222j4488j4872n136j705q910N415Q876
$$ -6129 8936 1393 -2868 -3905 -13369 -11297 925 -13563 -28435 -33571 -35276 -44186 -38771 -29895
8098b9895R765J8869J5535J7831R130j9418k7163j0484N1376Q671j0157k8711
$$ -29895 -20130 -1261 14274 32105 41235 21817 -5346 -15830 35546 44217 34060 5349
8086E349j3647l331j6842j0601j6171M6263M8442l3777j1364j9221o003K4013
$$ 5349 -8298 -11629 -28471 -39072 -55243 -8980 39462 5685 -5679 -24900 -30903 -6890
8074f890j565l1944k8286n67K3002K9668J7025l9k8764r178K1046K4000K6542
$$ -6890 -8455 -40399 -68685 -69252 -46250 -16582 443 404 -28360 -37538 -16492 7508 34050
8061C4050l0924m1077K66J9879K0983L3366N461K951k1985k6106n225J0088J1938
$$ 34050 3126 -37951 -37685 -17806 3177 36543 42004 44955 22970 -3136 -8361 1727 13665
8048A3665O214J0502J0522J6833k4002m5738k7642J5274K6349r540J3200j9611
$$ 13665 19879 30381 40903 57736 33734 -12004 -39646 -24372 1977 -7563 5637 -13974
8036a3974j0809J8868K3584l992q807J99J2896k7059j8595K904J1897K9843K0909
$$ -13974 -24783 -5915 17669 13677 4870 5069 17965 -9094 -27689 -24785 -12888 16955 37864
8023C7864k5299j3843L467L7186J0135k1356j4807N82J4969k1209j3867J5330
$$ 37864 12565 -1278 2189 39375 49510 28154 13347 13929 28898 7689 -6178 9152
8011I152M2025j2785j1876l739J8101k547p584k6793q592j4541O569L689k2238
$$ 9152 51177 38392 26516 22777 40878 38331 30747 3954 -4638 -19179 -12610 -8921 -31159
7998c1159K2962K2223J1949M089%j8237l0013J5843J4827J923J8581j6519k7519
$$ -31159 -8197 14026 25975 30064 30064 11827 -18186 -2343 12484 14407 32988 16469 -11050
7985a1050J107L2020L2470M9452L1904Q1448O3057O0234L968n8612q4605n8189
$$ -11050 -9943 22077 54547 103999 135903 217351 280408 340642 344610 285998 201393 143204
7973A43204j6679J828j1349K011N439K0538k787o98J9092r449j0312Q554q763
$$ 143204 126525 128353 117004 119015 124454 144992 142205 141507 160599 151150 140838 149392 140629
7960A40629m4521m8717M115N460M992r16o98k3802q296L0352m267k1281n28j0441
$$ 140629 96108 47391 51506 56966 61958 61042 60344 36542 28246 58598 54331 33050 32522 22081
7946B2081J6902K2686j5853L7704K2715J7538O826J701P2031Q2128O8119J8170
$$ 22081 38983 61669 45816 83520 106235 123773 130599 132300 204331 286459 354578 372748
7934C72748l6346p3147q3021o4736j8185M063J910j6819q164j3696N024j0720
$$ 372748 336402 263255 180234 115498 97313 101376 103286 86467 78303 64607 69631 58911
7922E8911M431k777K8284L3548k6390o146R761k7587j3087l049j3972j4445J1020
$$ 58911 63342 60565 88849 122397 96007 89861 99622 72035 58948 55899 41927 27482 38502
7909C8502R734P612r820m8864K2382K9779K0071L5402r578q403j1028j6826j8632
$$ 38502 48236 55848 46028 -2836 19546 49325 69396 104798 95220 86817 75789 58963 40331
7896D0331Q39j1106m82j1871j1959J6759Q240K0777K7752K679N135j8546k4068
$$ 40331 41170 30064 29582 17711 5752 22511 30751 51528 79280 81959 87094 68548 44480
7883D4480j857j67j4440k5226l5118P841K9558L700k4464n305N019J6540j8331
$$ 44480 42623 42456 28016 2790 -32328 -24487 5071 8771 -15693 -20998 -15979 561 -17770
7870a7770j8772K5231K9103J3692j074j7146j1248J1880P887m3445m316K0440
$$ -17770 -36542 -11311 17792 31484 30410 13264 2016 13896 21783 -21662 -25978 -5538
7858e538k2056k1491J740K2005L058k4135J5587J3794O36p183J0686L5634L0851
$$ -5538 -27594 -49085 -47345 -25340 -22282 -46417 -30830 -17036 -16400 -23583 -12897 22737 53588
7845E3588o730O883o168j2059k9393j4085K757l151j8886J1246J9086J8295l885
$$ 53588 46858 53741 47573 35514 6121 -7964 -5207 -8358 -27244 -15998 3088 21383 17498
7832A7498p984l6570K960M399j6345P763J2185L325k9036J1896O545j9123Q927
$$ 17498 9514 -27056 -24096 -19697 -36042 -28279 -16094 -12769 -41805 -29909 -23364 -42487 -33560
7819c3560K2261J9831j6604k5377l6992k2097K0535L0507Q307j8728j8470L749
$$ -33560 -11299 8532 -8072 -33449 -70441 -92538 -72003 -41496 -33189 -51917 -70387 -66638
7807f6638M0964J5841m548O6Q834k169j4097P069J84q354q159J2479J6484q833
$$ -66638 -25674 -9833 -14381 -14315 -5481 -7650 -21747 -14678 -14494 -22848 -31007 -18528 -2044 -10877
7793a0877q894p786q024J6645J4553o097k648l0061J377P851L471k5188L475K046
$$ -10877 -19771 -27557 -35581 -18936 -4383 -10480 -13128 -43189 -41812 -33961 -30490 -55678 -52203 -50157
7779e0157o468J3765m65J7128J7380J6781L0182m3224j3217j6168j1256j577J0232
$$ -50157 -56625 -42860 -43325 -26197 -8817 7964 38146 -5078 -18295 -34463 -45719 -47296 -37064
7766c7064P731p273N2191J8097m6894k2194m086n356L4157J0845m999R280K8917
$$ -37064 -29333 -36606 15585 33682 -13212 -35406 -39492 -44848 -10691 154 -4845 4435 33352
7753C3352j9802k7064O652J0318M739k3268K765K4252Q514j9907k0929j5515N939
$$ 33352 13550 -13514 -6862 3456 8195 -15073 -12308 11944 20458 551 -20378 -35893 -29954
7740b9954o042k904K821J8432r7J6520N559J2093j8703k5558k3974J3037J2135
$$ -29954 -35996 -38900 -36079 -17647 -17744 -1224 4335 16428 -2275 -27833 -51807 -38770 -26635
7727b6635N481j1721Q855J668J321R420m314j061j2854k3671r002K7234Q784Q14
$$ -26635 -21154 -32875 -24020 -22352 -21031 -11611 -15925 -16986 -29840 -53511 -62513 -35279 -26495 -25681
7713b5681J4896M595r548q649n967p040k59M7940K9471j6794j9391q974k1436
$$ -25681 -10785 -6190 -15738 -24387 -30354 -37394 -37653 10287 39758 22964 3573 -5401 -26837
7700b6837j7123K1953J557J3987J8252K0099J3479j1515j0279l533J6738j3774
$$ -26837 -43960 -22007 -20450 -6463 11789 31888 45367 33852 23573 20040 36778 23004
7688B3004k125L276k7115m7124k3541K7962K3188k032J4811p080J0861J5414k1726
$$ 23004 20879 24155 -2960 -50084 -73625 -45663 -22475 -24507 -9696 -16776 -5915 9499 -12227
7675a2227j1609N612j8997l5049k6411M3675K0243K7093P827R72K4377P941j4732
$$ -12227 -23836 -18224 -37221 -72270 -98681 -55006 -34763 -7670 157 1129 25506 33447 18715
7662A8715j6226k4459k9323o746P602p010P84L7437J1559l481j3343m9684q963
$$ 18715 2489 -21970 -51293 -58039 -50437 -57447 -56663 -19226 -7667 -11148 -24491 -74175 -83138
7649h3138l784J8618J1825j0772J1769J7179Q217j8861J295K9282O242j5926L745
$$ -83138 -86922 -68304 -56479 -67251 -55482 -38303 -30086 -48947 -47652 -18370 -12128 -28054 -24309
7636b4309j3893j031l484m545j7041K358K1866Q756j9986n89N571l634J682L7255
$$ -24309 -38202 -39233 -42717 -47262 -64303 -61945 -40079 -31323 -51309 -51898 -46327 -49961 -48279 -11024
7622a1024L5401K351n874k1895o637l861J2040k4159k4929o269j0237n036M655
$$ -11024 24377 26728 20854 -1041 -7678 -11539 501 -23658 -48587 -54856 -65093 -70129 -65474
7609f5474J2069J7156l070Q266N296j0926r139K5173K3799J979K924M05j8557
$$ -65474 -53405 -36249 -39319 -31053 -25757 -36683 -45822 -20649 3150 5129 8053 8458 -10099
7596a0099j7651P616J3749j6121j0716K8326p968p361K9759K3691j1212Q677l134
$$ -10099 -27750 -20134 -6385 -22506 -33222 -4896 -12864 -20225 9534 33225 22013 30690 27556
7583B7556o957M77k141j1731o406j4570O281k2502m642L090j1218j3543j0800
$$ 27556 20599 21076 18935 7204 798 -13772 -7491 -29993 -34635 -31545 -42763 -56306 -67106
7570f7106J5574J7685J0520K233j233k089L297k86j2990M599R080K274k263O895
$$ -67106 -51532 -33847 -23327 -21094 -22327 -24416 -21119 -21405 -34395 -29796 -20716 -18442 -20705 -13810
7556a3810Q973M445k0243k4748J3752K1476J7033q454P488J9381l885j6449J038
$$ -13810 -4837 -392 -20635 -45383 -31631 -10155 6878 -1576 5912 25293 21408 4959 5997
7543E997j5580K5457j7296n289j0006J3211M73Q529m313k913k320j0147J055J2267
$$ 5997 -9583 15874 -1422 -6711 -16717 -3506 -3033 5496 1183 -1730 -4050 -14197 -13142 -875
7529h75O513j3531J2014J7383l6799q400K9962p302n3588q041R354J0614n129
$$ -875 5638 -7893 4121 21504 -15295 -23695 6267 -1035 -54623 -62664 -53310 -42696 -47825
7516d7825q447k274p632P177J3716J7764K1397j4185j2285J849j1030L575J3546
$$ -47825 -56272 -58546 -66178 -59001 -45285 -27521 -6124 -20309 -32594 -30745 -41775 -38200 -24654
7503b4654k3427K866k923M345O322k1958J567Q194j7262K881O481N616P24O812
$$ -24654 -48081 -45215 -48138 -43793 -37471 -59429 -57862 -49668 -66930 -64049 -57568 -51952 -51228 -44416
7489d4416J4711N638L3248j2805j185J0333J4985J7163m780j6016n373K2963n022
$$ -44416 -29705 -24067 9181 -3624 -4809 5524 20509 37672 32892 16876 11503 34466 29444
7476B9444J8358j6879k3463j9090j8936p867M136Q10K9892M2360m970m4981j5959
$$ 29444 47802 30923 7460 -11630 -30566 -38433 -34297 -33487 -3595 38765 33795 -11186 -27145
7463b7145L1167j2840k3082K2859P891k473J9554J4165j5007J4980k2757k2842
$$ -27145 4022 -8818 -31900 -9041 -1150 -3623 15931 30096 15089 30069 7312 -15530
7451a5530j2306R432J4033o306j754o117n048L94N666O035K9627m7099O730J9870
$$ -15530 -27836 -18404 -4371 -10677 -12431 -18548 -23596 -23202 -17536 -11501 18126 -28973 -22243 -2373
7437b373K4319P214J5728o655m8332m1471j1056K5048J1440P117o197j0563r001
$$ -2373 21946 29160 44888 38233 -10099 -51570 -62626 -37578 -26138 -19021 -25218 -35781 -44782
7424d4782Q19K2838R684J3066J2772l0570q838L693l7155m9261J5611J0601J0073
$$ -44782 -43963 -21125 -11441 1625 14397 -16173 -25011 -21318 -58473 -107734 -92123 -81522 -71449
7411g1449J4848L499P975M852K7079n102J0944j1551J3426K8876j4833m8483j30
$$ -71449 -56601 -53102 -45127 -40275 -13196 -18298 -7354 -18905 -5479 23397 8564 -39919 -40049
7398d0049K3700m532N381J565K686P585k5999M074j5793Q347J1550j550J9585
$$ -40049 -16349 -20881 -15500 -13935 -11249 -3664 -29663 -25589 -41382 -33035 -21485 -23035 -3450
7385c450K2900J238N199l5767j8261j9252p116o040j831J2801L3279J6038k212
$$ -3450 19450 20688 25887 -9880 -28141 -47393 -54509 -60549 -62380 -49579 -16300 -262 -2474
7372b474n290J4016J3616k2932j6459j206J0698j5664m760j3571K037M6854J1437
$$ -2474 -7764 6252 19868 -3064 -19523 -20729 -10031 -25695 -30455 -44026 -41989 4865 16302
7359A6302m7921j4002L2678L0907k2238j9204q545j9100P385M987n148Q695q276
$$ 16302 -31619 -45621 -12943 17964 -4274 -23478 -32023 -51123 -43738 -38751 -43899 -35204 -43480
7346d3480l0215R077L8873O758p884J722L5279o33k0139l88l49O824j4059J1057
$$ -43480 -73695 -64618 -25745 -18987 -26871 -25149 10130 9497 -10642 -11030 -11379 -4555 -18614 -7557
7332g557J2384J2035R974M885k6679j8311k4101k3815j189K3110J6321K8321J0231
$$ -7557 4827 16862 26836 31721 5042 -13269 -37370 -61185 -62374 -39264 -22943 5378 15609
7319A5609p205j8186Q676N109o016k0625R986J055K6572R810K972q67l6966O186
$$ 15609 8404 -9782 -1106 4003 -2013 -22638 -12652 -11597 14975 24785 27757 26890 -10076 -3890
7305c890L0768j3768j0545q487K5534J5422N630p035j9069n82l9823j6760N961
$$ -3890 26878 13110 2565 -5922 19612 35034 40664 33629 14560 13978 -25845 -42605 -36644
7292c6644j7224j3897J6679J6452j3903J7730l633k2583J0226P666M2326K9717
$$ -36644 -53868 -67765 -51086 -34634 -48537 -30807 -34440 -57023 -46797 -39131 3195 32912
7280C2912K558p672k591j4397j0422j3596k2483j0033l016K0196J8049l9453j5566
$$ 32912 35470 27798 25207 10810 388 -13208 -35691 -45724 -48740 -28544 -10495 -49948 -65514
7267f5514O767m703k806O508K0192K531K6330J8984L371j6762M508j9442r153
$$ -65514 -58747 -63450 -66256 -59748 -39556 -37025 -10695 8289 11660 -5102 -594 -20036 -29189
7254b9189K7454L8388j0433j3558j1372J0380k824n0871m974L4281l158J8295
$$ -29189 -1735 36653 26220 12662 1290 11670 8846 -42025 -46999 -12718 -15876 2419
7242B419K3213J9787j8440j9326L312j1723j5749j873M315o412j4713k489J3795
$$ 2419 25632 45419 26979 7653 10965 -758 -16507 -18380 -14065 -20477 -35190 -37679 -23884
7229b3884P368P001J4402O636m75m0893J2684m352l8458j2735M3624J5139q922
$$ -23884 -16516 -9515 4887 11523 11048 -29845 -17161 -21513 -59971 -72706 -29082 -13943 -22865
7216b2865j5989J6005m087K4889P140j2153K9098j5551l7367j7788J7118o753
$$ -22865 -38854 -22849 -26936 -2047 5093 -7060 22038 6487 -30880 -48668 -31550 -38303
7204c8303k6646J6807K1483O827K7757p228K887l318O183N206m785q9l4075j1275
$$ -38303 -64949 -48142 -26659 -19832 7925 697 3584 266 6449 11655 6870 6781 -27294 -38569
7190c8569o334j7513L3129M4888K1910K2876p721m4795k9115l383J607J2402L8487
$$ -38569 -44903 -62416 -29287 15601 37511 60387 52666 7871 -21244 -24627 -23020 -10618 27869
7177B7869J4780k2071j4596k58k9831P424K6626K894j663M071l6705j3262L2653
$$ 27869 42649 20578 5982 5724 -24107 -16683 9943 12837 11174 15245 -21460 -34722 -2069
7164b069m743k9413n496j423K1307O808j195l464k0280K375p213J0110L4574Q713
$$ -2069 -6812 -36225 -41721 -43144 -21837 -15029 -16224 -19688 -39968 -37593 -44806 -34696 -122 8591
7150H591l7403l35K4724r827r580k111K4546J8576l7125k1535L3577J9003o183
$$ 8591 -28812 -29147 -4423 -14250 -23830 -25941 -1395 17181 -19944 -41479 -7902 11101 4918
7137D918r041K601J66k6481p569J4362R408K724J7855j2984J5379o907j4233j4732
$$ 4918 -4123 -1522 -1356 -27837 -35406 -21044 -11636 -8912 8943 -4041 11338 4431 -9802 -24534
7123b4534k8745j4730Q803N631P487l264P250K0431M6715k7834m3744j1903Q95
$$ -24534 -53279 -68009 -59206 -53575 -46088 -49352 -42102 -21671 25044 -2790 -46534 -58437 -57542
7110e7542j9290k8532M6557m046p192K1009K7157J4375k956J186R939j0557n568
$$ -57542 -76832 -105364 -58807 -62853 -70045 -49036 -21879 -7504 -10460 -9274 665 -9892 -15460
7097a5460j0605M643J8210J6820J6644K3720j2676j8035j965j0245j0518K017
$$ -15460 -26065 -21422 -3212 13608 30252 53972 41296 23261 21296 11051 533 2550
7085B550m05o324l1707M506Q589K189l582J2071K4410M322J8024L127m5541k9002
$$ 2550 2145 -4179 -35886 -31380 -22791 -20602 -24184 -12113 12297 16619 34643 37770 -7771 -36773
7071c6773j9013K842R652R570L6053l411L665j2487j8273N952K2998r192K039
$$ -36773 -55786 -52944 -43292 -33722 2331 -1080 2585 -9902 -28175 -22223 775 -8417 -6378
7058f378O906L3933J8340l477k7304k7295k0688K5558J2568R467j8791L663r381
$$ -6378 528 34461 52801 49324 22020 -5275 -25963 -405 12163 21630 2839 6502 -2879
7045b879k1066o607k965L333K3945o051M540K2179j1170k4951J2755O250j8364
$$ -2879 -23945 -30552 -33517 -30184 -6239 -12290 -7750 14429 3259 -21692 -8937 -2687 -21051
7032b1051l9550K0021K7179j7951n3117j6375M0554L1419j6372j3331k478m903
$$ -21051 -60601 -40580 -13401 -31352 -84469 -100844 -60290 -28871 -45243 -58574 -61052 -65955
7020f5955P661q283J8110J6689l408j0788j3009J7159J1664Q26M333J2468K067
$$ -65955 -58294 -66577 -48467 -31778 -35186 -45974 -58983 -41824 -30160 -29334 -25001 -12533 -10466
7007a0466m61j7073j9943O144N185j5537k2774m863K7439J5051K0144m784j682
$$ -10466 -10927 -28000 -47943 -41799 -36614 -52151 -74925 -79788 -52349 -37298 -17154 -21938 -23620
6994b3620J7925Q655J311K579J3546j4115l104J187q366K5968Q637q029K146j4956
$$ -23620 -5695 2960 4271 6850 20396 6281 3177 4364 -4002 21966 30603 22574 24720 9764
6980I764p679p639J7252R828k9730J2794M5053j9142l3969j4984J8914K5633m68
$$ 9764 2085 -5554 11698 21526 -8204 4590 49643 30501 -3468 -18452 462 26095 25627
6967B5627l254j0147M714M992m178l2426k1846n43K0684J8378k0221j4346j551
$$ 25627 22373 12226 16940 21932 17754 -14672 -36518 -37061 -16377 2001 -18220 -32566 -34117
6954c4117L185P003k5844J6409K4366m4632k9336L6462K7266J3875O157J1036
$$ -34117 -30932 -23929 -49773 -33364 -8998 -53630 -82966 -46504 -19238 -5363 794 11830
6942A1830j8824j6616l6266P014J8609P139J0565Q402o161j4756k9762O232j021
$$ 11830 -6994 -23610 -59876 -52862 -34253 -27114 -16549 -8147 -14308 -29064 -58826 -52594 -53615
6929e3615j7511P540J6621J4929O3074K690R586j6818l4006M603J4274k1312j6841
$$ -53615 -71126 -63586 -46965 -32036 31038 33728 43314 26496 -7510 -2907 11367 -9945 -26786
6916b6786o629l6744j2587l709K3536L1877J3783R407L751j197Q915J0724k5252
$$ -26786 -33415 -70159 -82746 -86455 -62919 -31042 -17259 -7852 -4101 -5298 3617 14341 -10911
6903a0911J3063M425k8978l1621q599l903J14L8681L0759J4715p274j921p052
$$ -10911 2152 6577 -22401 -54022 -62621 -66524 -66410 -27729 3030 17745 10471 8550 1498
6890A498l134P362r003K2813L921m2763j4047k0397O309J0208J3154l55j5994
$$ 1498 -1636 5726 -3277 19536 23457 -19306 -33353 -53750 -47441 -37233 -24079 -24434 -40428
6877d0428K2719K6550j0092k9086j2787J0350J8070R082q244L360k4195j2988
$$ -40428 -17709 8841 -1251 -30337 -43124 -32774 -14704 -5622 -13866 -10506 -34701 -47689
6865d7689K0963j3018R870R223K686k7825q912J3346J1493L6504J6654k9015j4766
$$ -47689 -26726 -39744 -29874 -20651 -17965 -45790 -54702 -41356 -29863 6641 23295 -5720 -20486
6852b0486k686K940J0924J0934k15L544P250Q511j6939j0680j8335k5103r838
$$ -20486 -23172 -20232 -9308 1626 1411 4955 12205 20716 3777 -6903 -25238 -50341 -60179
6839f0179L0485J7582j4857L8875o477n513o193J8875K3217r979l2299j1212J188
$$ -60179 -29694 -12112 -26969 11906 5429 -84 -6277 12598 35815 25836 -6463 -17675 -16487
6826a6487q437j8077n86K2489J0067k6040k7178J482K1288J0337K3398j772j1409
$$ -16487 -24924 -43001 -43587 -21098 -11031 -37071 -64249 -62767 -41479 -31142 -7744 -9516 -20925
6813b0925J8165J5159j6155n17j2809k0667k5169J2686K7133q073J4428K3160
$$ -20925 -2760 12399 -3756 -4273 -17082 -37749 -62918 -50232 -23099 -31172 -16744 6416
6801F416K6244j0256J471l5995p369o535l3856N785L8320j1393k173o05p151j8236
$$ 6416 32660 22404 23875 -12120 -19489 -26024 -59880 -54095 -15775 -27168 -29341 -29946 -37097 -55333
6787e5333l0066l124K6899K3775m1166j7002K8594J6260k6127m50o920P517R573
$$ -55333 -85399 -88523 -61624 -37849 -79015 -96017 -67423 -51163 -77290 -77740 -84660 -77143 -67570
6774f7570N025m027J5092J4129J1222r135J2638Q65j5911K3681j1001l7850k2564
$$ -67570 -62545 -66572 -51480 -37351 -26129 -35264 -22626 -21761 -37672 -13991 -24992 -62842 -85406
6761h5406K5830r990N687L0968P788J8362j2010M039J8583m465j1042J1934J024
$$ -85406 -59576 -69566 -63879 -32911 -25123 -6761 -18771 -14732 3851 -614 -11656 278 1302
6748A302n769m8000R522M5192K6039j2781k0235o828k1621j7664J0176q98m500
$$ 1302 -4467 -52467 -42945 2247 28286 15505 -4730 -11558 -33179 -50843 -40667 -41565 -46065
6735d6065r822N102J0174L0693J7342P884Q800K2616l3309j0248j5268j4534k2190
$$ -46065 -55887 -50785 -40611 -9918 7424 15308 24108 46724 13415 3167 -12101 -26635 -48825
6722d8825j7198O126j2771P395J0827R970R280J397j8396J699M4186j4151l2240
$$ -48825 -66023 -59897 -72668 -65273 -54446 -44476 -35196 -33799 -52195 -50496 -6310 -20461 -52701
6709e2701k2504M4938L4123L4088l8696j8370l2079k9434K4112L3698R761L3051
$$ -52701 -75205 -30267 3856 37944 -752 -19122 -51201 -80635 -56523 -22825 -13064 19987
6697A9987k605j6363J969M879j5313K537O999N452l6492l1943l993J9396j8909
$$ 19987 17382 1019 2988 7867 -7446 -4909 2090 7542 -28950 -60893 -64886 -45490 -64399
6684f4399P659K0638M1332J0156j2434l0824j1294j0339k435J1146m90N426J5493
$$ -64399 -56740 -36102 5230 15386 2952 -27872 -39166 -49505 -51940 -40794 -41284 -35858 -20365
6671b0365P335R90j0019j704J5314O266j0152l5132M908N683R48N834K3157J7866
$$ -20365 -13030 -12040 -22059 -23763 -8449 -2183 -12335 -47467 -42559 -36876 -35928 -30094 -6937 10929
6657A0929J453j3454m4603K886L1847N125J6764p941j2234Q983q189J1850l553
$$ 10929 12382 -1072 -45675 -42789 -10942 -5817 10947 3006 -9228 -245 -8434 3416 -137
6644a37m18k0597l164K2860K0883J2983J2496m400K1154j7696k6997l7967O550
$$ -137 -555 -21152 -24316 -1456 19427 32410 44906 40506 61660 43964 16967 -21000 -14450
6631a4450M9982R513m698J1890K0647Q245j3472M327K5860N4834J03764J27227
$$ -14450 35532 45045 40347 52237 72884 81129 67657 71984 97844 152678 256442 383669
$$ [...]
##END NTUPLES=NMR SPECTRUM
##END=
