##TITLE=Analysis number 317764
Compound Code km 00596
Project Code adrs
Chemist Name endeavour
##JCAMPDX= 6.0         $$ Bruker NMR JCAMP-DX V2.0
##DATA TYPE= NMR SPECTRUM
##DATA CLASS= NTUPLES
##ORIGIN= Bruker BioSpin GmbH
##OWNER= nmr
$$ XWIN-NMR		Version 3.5
$$ Thu Mar  2 15:55:23 2006 GMT Standard Time (UT+0h)  MAYBRIDGE\nmr@NMR_250MHZ
##.OBSERVE FREQUENCY= 250.131544655141
##.OBSERVE NUCLEUS= ^1H
##.ACQUISITION MODE= SIMULTANEOUS (DQD)
##.ACQUISITION SCHEME= undefined
##.AVERAGES= 16
##.DIGITISER RES= 18
##SPECTROMETER/DATA SYSTEM= dpx250
##.PULSE SEQUENCE= zg30
##.SOLVENT NAME= DMSO
##.SHIFT REFERENCE= (INTERNAL, DMSO, 0, 16.522)
##AUDIT TRAIL= $$ (NUMBER, WHEN, WHO, WHERE, WHAT)
$$ ##TITLE= Audit trail, XWIN-NMR		Version 3.5
$$ ##JCAMPDX= 5.01
$$ ##ORIGIN= Bruker BioSpin GmbH
$$ ##OWNER= nmr
$$ C:\u/data/dgb/nmr/ADRS/17370/pdata/1/auditp.txt
$$ ##AUDIT TRAIL=  $$ (NUMBER, WHEN, WHO, WHERE, WHAT)
(   1,<2006-03-02 15:54:14.40 +000>,<MAYBRIDGE\nmr>,<NMR_250MHZ>,
      <created by zg, POWCHK disabled, PULCHK disabled
       configuration hash MD5:
       84 BC 41 DB A1 6E 1D 46 DA 25 12 A5 C1 ED C5 3A
       data hash MD5: 64K
       13 F1 5B 37 6C 6D 02 25 4A A0 49 91 80 27 C6 2B>)
(   2,<2006-03-02 15:54:46.89 +000>,<MAYBRIDGE\nmr>,<NMR_250MHZ>,
      <Start of raw data processing
       ef LB = 0.3 FT_mod = 6 PKNL = 1 SI = 32K 
       data hash MD5: 32K
       18 DE 1C CB 5C 21 37 1E EE C9 D4 D9 4B 64 B9 1A>)
(   3,<2006-03-02 15:54:49.44 +000>,<MAYBRIDGE\nmr>,<NMR_250MHZ>,
      <apk 
       data hash MD5: 32K
       C4 0C BD 8B 8C 49 D8 91 C9 12 D8 3C 5D E7 11 06>)
(   4,<2006-03-02 15:54:50.39 +000>,<MAYBRIDGE\nmr>,<NMR_250MHZ>,
      <abs ABSG = 5 
       data hash MD5: 32K
       E8 F4 71 69 A2 BD AB 85 CB CA C1 21 0A 91 26 DF>)
$$ ##END=
$$ 
$$ hash MD5
$$ 08 59 9F A8 3D B9 C5 A6 46 41 BC C0 6A F3 DC 5C
##$RELAX= 
##$RELAX= 
##$RELAX= 
##$RELAX= 
##$RELAX= 
##$RELAX= 
##$RELAX= 
$$ Bruker specific parameters
$$ --------------------------
##$DU= <C:\u>
##$EXPNO= 17370
##$NAME= <ADRS>
##$PROCNO= 1
##$TYPE= <nmr>
##$USER= <dgb>
##$AMP= (0..31)
100 100 100 100 100 100 100 100 100 100 100 100 100 100 100 100 100 100 
100 100 100 100 100 100 100 100 100 100 100 100 100 100 
##$AQSEQ= 0
##$AQ_mod= 3
##$AUNM= <au_zg>
##$AUTOPOS= <38 >
##$BF1= 250.13
##$BF2= 250.13
##$BF3= 250.13
##$BF4= 250.13
##$BF5= 500.13
##$BF6= 500.13
##$BF7= 500.13
##$BF8= 500.13
##$BYTORDA= 1
##$CFDGTYP= 0
##$CFRGTYP= 5
##$CHEMSTR= <none>
##$CNST= (0..31)
1 1 145 1 1 1 1 1 1 1 1 1 1 1 1 1 1 1 1 1 1 1 1 1 1 1 1 1 1 1 1 1 
##$CPDPRG= <>
##$CPDPRG1= <>
##$CPDPRG2= <>
##$CPDPRG3= <>
##$CPDPRG4= <mlev>
##$CPDPRG5= <mlev>
##$CPDPRG6= <mlev>
##$CPDPRG7= <mlev>
##$CPDPRG8= <mlev>
##$CPDPRGB= <>
##$CPDPRGT= <>
##$D= (0..31)
0 1 0 0 0 0 0 0 0 0.06 0 0 0 0 0 0 0.0002 0 0 0 0 0 0 0 0 0 0 0 0 0 0 
0 
##$DATE= 1141314844
##$DBL= (0..7)
120 120 120 120 120 120 120 120 
##$DBP= (0..7)
150 150 150 150 150 150 150 150 
##$DBP07= 0
##$DBPNAM0= <>
##$DBPNAM1= <>
##$DBPNAM2= <>
$$ [...]
##$SUBNAM7= <"">
##$SUBNAM8= <"">
##$SUBNAM9= <"">
##$SW= 20.6930455092707
##$SWIBOX= (0..15)
0 0 3 0 0 0 0 0 0 0 0 0 0 0 0 0 
##$SW_h= 5175.983436853
##$TD= 65536
##$TD0= 1
##$TE= 293.16
##$TE2= 300
##$TE3= 300
##$TEG= 300
##$TL= (0..7)
0 120 120 120 120 120 120 120 
##$TP= (0..7)
150 150 150 150 150 150 150 150 
##$TP07= 0
##$TPNAME0= <>
##$TPNAME1= <>
##$TPNAME2= <>
##$TPNAME3= <>
##$TPNAME4= <>
##$TPNAME5= <>
##$TPNAME6= <>
##$TPNAME7= <>
##$TPOAL= (0..7)
0.5 0.5 0.5 0.5 0.5 0.5 0.5 0.5 
##$TPOFFS= (0..7)
0 0 0 0 0 0 0 0 
##$TUNHIN= 0
##$TUNHOUT= 0
##$TUNXOUT= 0
##$USERA1= <user>
##$USERA2= <user>
##$USERA3= <user>
##$USERA4= <user>
##$USERA5= <user>
##$V9= 5
##$VALIST= <valist>
##$VCLIST= <CCCCCCCCCCCCCCC>
##$VD= 0
##$VDLIST= <DDDDDDDDDDDDDDD>
##$VPLIST= <PPPPPPPPPPPPPPP>
##$VTLIST= <TTTTTTTTTTTTTTT>
##$WBST= 1024
##$WBSW= 4
##$XGAIN= (0..3)
0 0 0 0 
##$XL= 0
##$YL= 0
##$YMAX_a= 429763
##$YMIN_a= -416927
##$ZGOPTNS= <>
##$ZL1= 120
##$ZL2= 120
##$ZL3= 120
##$ZL4= 120
##$ABSF1= 16.522
##$ABSF2= -4.171173
##$ABSG= 5
##$ABSL= 3
##$ALPHA= 0
##$AQORDER= 0
##$ASSFAC= 0
##$ASSFACI= 0
##$ASSFACX= 0
##$ASSWID= 0
##$AUNMP= <proc_1d>
##$AZFE= 0.1
##$AZFW= 0.1
##$BCFW= 0
##$BC_mod= 0
##$BYTORDP= 0
##$COROFFS= 0
##$CY= 12.5
##$DATMOD= 1
##$DC= 0
##$DFILT= <>
##$DTYPP= 0
##$F1P= 14.0000005364418
##$F2P= -0.99999901652339
##$FCOR= 0.5
##$FTSIZE= 32768
##$FT_mod= 6
##$GAMMA= 0
##$GB= 0
##$INTBC= 1
##$INTSCL= 1
##$ISEN= 128
##$LB= 0.3
##$LEV0= 0
##$LPBIN= 0
##$MAXI= 10000
##$MC2= 0
##$MEAN= 0
##$ME_mod= 0
##$MI= 0
##$NCOEF= 0
##$NC_proc= -2
##$NLEV= 6
##$NOISF1= 0
##$NOISF2= 0
##$NSP= 0
##$NTH_PI= 0
##$NZP= 0
##$OFFSET= 16.522
##$PC= 1
##$PHC0= 239.0054
##$PHC1= 8.625356
##$PH_mod= 1
##$PKNL= yes
##$PPARMOD= 0
##$PSCAL= 4
##$PSIGN= 0
##$REVERSE= no
##$SF= 250.13
##$SI= 32768
##$SIGF1= 0
##$SIGF2= 0
##$SINO= 400
##$SIOLD= 32768
##$SREGLST= <1H.DMSO>
##$SSB= 0
##$STSI= 32768
##$STSR= 0
##$SW_p= 5175.98343685301
##$SYMM= 0
##$S_DEV= 0
##$TDeff= 65536
##$TDoff= 0
##$TI= <Analysis number 999999
Compound Code 99
Book Reference 9
Project Code 9>
##$TILT= no
##$TM1= 0
##$TM2= 0
##$TOPLEV= 0
##$USERP1= <user>
##$USERP2= <user>
##$USERP3= <user>
##$USERP4= <user>
##$USERP5= <user>
##$WDW= 1
##$XDIM= 32768
##$YMAX_p= 453064872
##$YMIN_p= -181151
$$ End of Bruker specific parameters
$$ ---------------------------------
##NTUPLES= NMR SPECTRUM
##VAR_NAME=  FREQUENCY,     SPECTRUM/REAL,   SPECTRUM/IMAG
##SYMBOL=    X,             R,               I
##VAR_TYPE=  INDEPENDENT,   DEPENDENT,       DEPENDENT
##VAR_FORM=  AFFN,          ASDF,            ASDF
##VAR_DIM=   32768,         32768,           32768
##UNITS=     HZ,            ARBITRARY UNITS, ARBITRARY UNITS
##FACTOR=    0.157963299565203, 1,           1
##FIRST=     4132.6476996994, 0,             0
##LAST=      -1043.33573715361, 0,           0
##MIN=       -1043.33573715361, -181151,     0
##MAX=       4132.6476996994, 453064872,     0
$$ Real data points
##PAGE= N=1
##DATA TABLE= (X++(R..R)), XYDATA
$$ [...]
23217 -12499 2710 -12810 -43458 -44740 -23766 -10655 23757 28756 19045 -7002 -34210 -40954
23205 -40954 -21987 -11758 -41436 -40617 -45253 -41457 -18744 10442 14591 -39743 -41092 -29993 -35086
23192 -35086 -44998 -21426 -18528 -13452 5673 12806 -2561 -9662 -12109 -20634 -22829 8190 19304
23179 19304 19581 10156 9636 9938 23654 9605 4216 15848 14880 4323 -11593 -12190 -13305 -10809
23165 -10809 -11357 -13794 -7287 -22615 -38079 -36866 -28213 -1442 -9547 -36881 -67190 -58067 -19190
23152 -19190 -6011 8411 31050 47403 37215 15451 8290 -10773 -26406 -874 2993 -6718
23140 -6718 -4025 5668 -6471 -5934 -17557 -37727 -40098 -17161 8255 -5264 11157 16489 16612
23127 16612 14012 2693 -6917 5144 18893 5629 -32472 -49811 -26428 -10222 3708 5
23115 5 -12740 -17130 -12526 7470 7145 -6023 -29800 -27855 -50542 -71118 -48626 -25025 -11474
23102 -11474 8775 2468 22045 39728 26022 -1787 -11066 4441 34066 49492 53694 17321
23090 17321 -16667 -8629 22600 26386 6817 15169 12990 3000 3341 -13444 -7490 6732 22116
23077 22116 33355 49174 41963 1960 -21756 3154 5405 15361 -2464 -19831 -20045 -31269 -39328
23064 -39328 -52021 -51901 -44401 -44368 -30252 -42557 -32679 -3954 14738 1081 -16235 -19952 -20285 -30820
23050 -30820 -31872 -3545 -23296 -12497 11750 21999 11239 -6577 -19215 -45391 -70887 -92922
23038 -92922 -59600 -30072 -11795 -1259 -24886 -40447 -31247 -22247 -21471 -8555 20032 23290 7989
23025 7989 -23778 -36706 -8048 -16012 -47069 -70392 -65770 -23222 -15209 -21025 3325 19541 36582
23012 36582 12223 6415 -3767 -33254 -61423 -71421 -37867 -11136 -4320 17661 -2588 -19408
23000 -19408 4441 2344 -24068 -41753 -35541 -21847 -6384 14205 -4589 -13340 -19323 4737
22988 4737 23671 23659 24672 29680 20013 8883 -3322 -39153 -68783 -56688 -31607 -13595 -5688
22975 -5688 -2791 -6042 2553 5925 -4731 11532 22869 31423 43889 36461 42010 15510 -9065
22962 -9065 -8345 -21742 7725 28836 15391 2411 2357 1962 -13187 -3901 -1844 10907 23104 1574
22948 1574 -6118 -9658 -13086 -12632 -8597 -5446 8706 5331 11440 44413 27386 -3878 -16835 -7673
22934 -7673 -23159 -32439 -20931 -5966 -22397 -57124 -40668 4157 38980 19391 9049 5756
22922 5756 4074 9033 618 -22845 -24451 3038 21649 39557 45235 27376 -2032 -16027 -8887
22909 -8887 -11491 -16931 -4239 17410 -5422 -10645 -16301 -2049 11586 32840 51044 42619 1623
22896 1623 33513 41948 24611 9945 4199 -1602 6947 -1151 11369 -6576 -37886 -42344 -37358
22883 -37358 -29088 -12099 1730 11005 26828 9355 2237 4673 -3594 -42447 -50496 -19078 -8409
22870 -8409 -9933 -14864 8934 22023 5601 14370 22262 33914 23537 15687 -3393 -19943 -6384
22857 -6384 6760 8090 -21189 -39742 -22774 9849 19151 -2314 3275 -3498 5724 26304 25062
22844 25062 -19782 -37719 6738 14166 12817 3748 30031 40432 29926 -8870 -29031 -25505
22832 -25505 2125 24070 36363 32166 5010 -15800 10686 11303 1713 -24116 -15502 9259 22806
22819 22806 12801 -24435 -2828 14548 37 -13907 -34418 -45607 -57591 -28637 -13910 -5236
22807 -5236 17202 2392 -12803 -34736 -38957 475 32284 35217 27166 16808 1839 815 -185
22794 -185 -33334 -38768 -12213 2465 1046 -749 -8739 -11091 -33483 -35606 -35502 -40261 -37626 -33162
22780 -33162 -25578 1479 21963 9204 -20113 -30890 -17730 9252 30594 36772 34434 3987
22768 3987 -26002 -22492 758 21157 12332 22537 22455 1517 8118 -18626 -45270 -34399 -39399
22755 -39399 -45013 -19825 3525 11390 6556 2153 -1004 -3574 -9720 -18117 -9788 18590 11351 -4741
22741 -4741 -4940 30292 43864 46037 17586 9111 26231 36410 24977 20855 6072 23393 5160
22728 5160 17972 32206 19105 -12907 -41316 -48614 -33056 -45070 -48784 -11051 20047 7304
22716 7304 21921 15048 -6658 -26776 -56477 -52900 -36262 -24584 -10170 -15396 2499 20304
22704 20304 -6274 -7125 5972 46202 34577 16151 35854 38419 29258 3587 24900 33198 16010
22691 16010 -4588 -35360 -15633 17179 18780 20611 11383 -6414 -13715 -4557 -15388 11062 43705
22678 43705 48050 9135 -8742 10908 42620 7612 -3855 -3674 -26270 -47998 -20069 7089
22666 7089 16491 24353 22498 12994 -7499 943 -8449 -23540 -14445 -6286 -13533 -16998 -6544 11374
22652 11374 18359 12988 1124 14400 16695 18129 50055 39099 7529 -11979 7536 18913
22640 18913 3861 -17247 -13574 -40023 -30391 -23819 -44085 -61341 -18469 26046 12279 25755
22628 25755 22809 31538 14404 10875 15458 -14654 -16598 -4598 -3794 -4925 2525 -12892 -13602 -17242
22614 -17242 482 7647 -6605 -12305 -11345 2990 16940 23531 48654 58677 23511 3824 -35096
22601 -35096 -19163 19124 26497 20415 13675 -150 -7269 5821 29334 45497 14316 -32265
22589 -32265 -31739 -6496 6681 26380 66568 88807 60451 43696 53293 23159 444 18278
22577 18278 29286 18577 -3521 -2129 -8997 -20157 -33401 -17493 6855 9683 -5411 -22426
22565 -22426 -46461 -45753 -54175 -71568 -41403 14498 19900 2175 19501 61453 53197 14477 -7857
22552 -7857 516 16659 36873 31494 19443 16855 24691 25655 23773 3427 -16932 -10695 -1007 34991
22538 34991 56993 44331 25481 25223 41598 50517 -843 -31858 -36676 -24310 -42893 -56372
22526 -56372 -53271 -41577 -23715 21714 14664 1779 -5750 -971 8802 25899 38770 32304 12563
22513 12563 -16752 5684 28169 8613 15003 11044 1691 -11812 11580 20253 36953 41005 27884
22500 27884 4947 -4311 28560 22734 22400 1308 -9386 -5762 -4478 5862 -2505 -33290 -26341
22487 -26341 -21385 -16987 1066 3636 -4279 6863 27654 27005 28871 13384 12561 15857 15477 31170
22473 31170 24228 23876 43544 24539 2594 -15870 7937 -11679 9202 41200 55487 53332
22461 53332 -3985 -40331 -30631 -21736 -3914 8635 39971 37873 18025 5856 25918 17598
22449 17598 19172 21417 13851 14622 5404 1970 7663 523 -12547 -9002 2215 23361 45333 54577
22435 54577 52046 25108 -5552 -7903 -421 18498 14825 10422 20285 18843 23645 9722 14676
22422 14676 20744 5366 2562 -25971 -52680 -53667 -52863 -29988 -933 24785 -1590 -7406 -17261
22409 -17261 -51613 -60755 -22410 -7909 -12966 11372 46987 33339 17792 -9577 -29340 -34241
22397 -34241 -20938 -3837 -1824 -143 2625 16588 18403 -9986 -29376 -33705 -25066 -27532 -26239
22384 -26239 -12715 -8096 -15927 -32618 -36672 -13630 1543 -3241 -15436 685 -7160 -1766 -1496
22371 -1496 -10357 -4288 -5653 1349 -1088 11042 17236 -8567 7766 -11520 -9570 4517 -6798
22358 -6798 -9359 -47171 -45801 -27484 -20342 7145 910 20732 6807 1983 -9658 -8096 1420
22345 1420 19100 13582 -7043 -8102 5897 10980 1812 -25209 -11270 23492 11436 -10689 -28825
22332 -28825 -38829 -34128 -3732 23746 42102 40829 9716 -8888 -18280 -34735 -21600 -681
22320 -681 2436 5965 22773 28860 16727 -16754 -34669 -29091 -18740 -18530 -32671 -27765 -10144
22307 -10144 10242 24031 1619 1382 15438 16162 24639 26887 27346 3378 4679 -3363 -16548 -18820
22293 -18820 15137 28297 21557 4595 5148 3002 9236 8007 -4325 -5101 -26959 -23774 5730
22280 5730 -2161 -1217 11775 15176 -8689 -13602 -17756 -17763 1599 43 11778 27628 32744 51421
22266 51421 32070 16835 -10394 -36296 -36964 -34176 -11082 12400 31347 13050 -74 12696
22254 12696 24128 24346 18265 26516 8859 4930 25193 37717 62570 57779 48004 22196 -11780
22241 -11780 -2604 8119 -2175 -12322 -12499 5632 28913 35249 19580 16486 -11704 -6735 -9387
22228 -9387 -762 -8110 -27187 -27874 -16651 -1088 11696 -457 20500 16521 8523 2654 2553 18954
22214 18954 6698 1972 14213 4467 28798 66908 68748 57213 27903 -16617 -8496 28824
22202 28824 36605 38468 24124 16809 22054 45707 37393 36550 16783 10581 8403 -11422 -10591 -20249
22188 -20249 -18533 -9355 16477 26958 30509 44202 47101 35311 24663 91 -4881 -15198 -24958
22175 -24958 -19135 -68 -8547 3523 4642 -5748 7449 19668 22770 -5994 -5625 13922 13090
22162 13090 -5523 -17033 -3632 -235 -21116 -29336 -24363 -38590 -28490 -1738 -4249 15056
22150 15056 13547 15674 19310 544 -23443 -13903 5678 -2372 10744 33928 4475 -1275 -1596
22137 -1596 1175 -5583 -1769 -4569 4269 3569 1120 8101 14132 34421 31690 30084 5553 -3561
22123 -3561 4321 33454 34262 28667 32709 16141 32650 36019 21951 13038 22025 21386 1066 -8159
22109 -8159 -1311 15949 31369 36544 26315 8230 -16752 -9651 15352 44102 39140 25212 22495
22096 22495 -15873 -16108 1143 1722 -10533 -11970 -14398 9645 37033 30735 29398 26188 7592
22083 7592 -31382 -35964 -11839 20018 32139 19480 27820 28491 49077 30562 6794 -12246 -18971
22070 -18971 -9344 19775 28660 -5444 -16819 21064 45877 32068 -453 -19824 -30706 -13157
22058 -13157 10679 8224 -4993 -3225 6938 18441 12142 15289 15920 22958 29921 51197 32274
22045 32274 24696 16026 -8299 -19197 -8121 -6625 15113 11444 3777 179 27534 20884 7398
22032 7398 28675 59066 47248 36040 59323 55843 36638 13953 6857 -1697 1621 20127 10570
22019 10570 -2741 3861 6018 -18156 -21147 -31674 -29386 -40200 -48008 -37887 -48291 -47861 -28055
22006 -28055 -28474 -4839 -21547 -29734 -6096 -7271 -653 8942 5355 17308 17169 9392 22502 23087
21992 23087 37274 51988 42856 28793 46001 50322 26635 21875 18510 25999 35053 39007 51556
21979 51556 42493 31928 14446 8582 1758 10059 18118 20791 20206 27279 -568 -13335 4244
21966 4244 21203 41032 53356 48427 40811 38305 66539 67833 42061 23879 26459 13980 26190
21953 26190 11889 3123 19300 12319 404 2745 20099 -4459 -7795 17197 57941 59580 34912
21940 34912 8431 5115 23698 10117 18286 14772 20816 17177 16165 -3304 10468 407 -12594
21927 -12594 -51553 -76806 -44859 -31611 -33329 -11484 -5837 1465 17171 23722 23784 3642 -10035
21914 -10035 -18076 -17132 -7073 -14830 -37759 -30025 -8998 -6741 -23607 -43895 -41630 -14136 1337
21901 1337 30747 18934 368 -24425 -31556 -26711 -25657 -16800 6387 26560 24476 -6542 -31608
21888 -31608 -45341 -55284 -39308 -21764 -18487 11882 28383 -10756 -36506 -49578 -32302 -40756
21876 -40756 -25886 -10681 6750 21074 48255 49767 19212 -21305 -34295 -31973 -18058 -17475
21864 -17475 -17134 -38618 -29473 -6933 318 891 -248 -10959 -44372 -66699 -67070 -64299 -53941 -49125
21850 -49125 -29463 -15345 -42310 -40170 -20250 -974 14493 10920 5374 7905 14299 32110 20163
21837 20163 -8195 -8357 1963 2875 -348 -4689 -616 33271 64227 68041 36601 5151 -14734
21824 -14734 -3286 -19847 -10725 -16778 -37057 -56412 -40319 -44127 -16903 -4851 -10250 -17056 -18215
21811 -18215 -24546 -14599 -8472 3995 4294 24224 26886 30720 1933 -5344 2888 22653 24637 5642
21797 5642 12865 867 10874 2406 24125 20231 -21102 -28704 2587 11201 -207 -25906 -14758
21784 -14758 -12572 -33069 -30298 -12177 -23551 -8707 -9703 -4165 -2656 8486 10958 7103 16191
21771 16191 19457 19088 31942 28802 32237 36774 38921 26339 2392 -4670 4055 13869 45369 65635
21757 65635 47540 26998 13122 26535 18995 15771 18946 -6079 11116 31615 22180 18766 21241
21744 21241 17860 -9468 -10891 -2707 6848 -20261 -32220 -28485 6593 9577 17345 35360 26733
21731 26733 30656 15864 -15098 -22219 -3689 -2366 -13784 -28664 -23201 2586 18205 29475
21719 29475 18419 -5991 -9788 -14703 -2052 30034 12773 -2127 7245 1166 -504 -18160 -17271
21706 -17271 1622 -6302 -28317 -41063 -30049 -19859 -23294 -29520 130 -5004 -10734 -16980 -967
21693 -967 8791 23250 29630 6099 -21909 -38740 -15293 13500 2257 8506 9325 20614 39043
21680 39043 13016 669 25246 35806 41319 21819 9401 -555 -11252 -551 -9276 13611
21668 13611 10966 21335 25935 10524 -22185 -17678 10705 -7126 7231 13783 11165 -2367 -4242
21655 -4242 -8672 -4632 -36005 -42176 -44998 -48814 -43047 3679 37533 27383 14681 25437 31603
21642 31603 6923 -8971 8539 27425 25271 21011 24768 23430 33574 9201 -15547 -4831
21630 -4831 10864 9098 18000 13946 -4082 -4102 7625 35678 34935 26903 39945 36562 20097 -4092
21616 -4092 -17441 -27933 -37075 -18450 -289 9720 17130 461 -15991 -8825 -29259 -27129 -13757
21603 -13757 -7596 -14243 4863 12205 4911 -15040 -27252 -28143 -10610 -4826 -6338 535 1791 8004
21589 8004 17593 11883 6128 -11704 -20971 -11859 -12043 -13365 -7617 -2405 7370 -3328 -530 21080
21575 21080 39721 40069 28551 25486 10805 11957 3048 10143 32602 19743 25785 -857 -9220
21562 -9220 -7606 -19417 -5643 -3044 -25059 -30995 -32152 -25865 -37473 -42930 -59435 -54961 -51266
21549 -51266 -19135 3922 -21111 -26055 -251 32566 34433 15832 11859 7627 3062 -5532 -41579
21536 -41579 -66044 -68233 -55187 -44074 -22525 -1428 -5135 -40721 -12272 32593 16529 2868
21524 2868 -1307 -3600 6349 2288 -13285 -18827 -14119 8901 24840 24303 16646 9383 15642 7862
21510 7862 6856 3010 -7084 -16601 -33986 -36501 -17544 -35788 -29802 -9879 -20613 -17394 -14638
21497 -14638 -35074 -34744 -7562 -15549 -24066 12493 16592 3746 111 -6485 2636 -11948 -16552
21484 -16552 18747 41471 30957 26096 -11064 -32438 -3586 19085 16566 14543 6424 14367 28140
21471 28140 3110 -20604 -20104 8960 45075 39573 13120 -12954 2761 8462 21630 25449 1851
21458 1851 -9577 -16132 -9234 -4033 -3412 14083 10707 -15255 -24714 -31535 -16282 7170 -2052 5880
21444 5880 15922 11256 13710 99 -14089 8579 2947 -11356 -32066 -33722 -22906 -30310 -39081
21431 -39081 -31212 -3209 12412 7275 25721 35971 22319 29546 45543 49144 53214 56935 38764
21418 38764 30869 33091 41687 38516 43574 24108 42423 48805 23877 26506 32646 54690 65305
21405 65305 41545 19316 9259 -6661 9926 -4073 -20284 -6752 14084 11574 -3611 -20123
21393 -20123 -4519 23247 30394 -20447 -46059 -37806 -33745 -23372 -17735 -12396 184 1347 -3
21380 -3 16052 36884 21070 -6396 -35653 -40980 -40300 -31849 -33571 -46425 -70815 -50629 -22975
21367 -22975 -26249 -9391 14269 15385 27571 18244 22708 16976 -1648 -785 4082 16738 19177
21354 19177 -8590 -24310 -30650 -22217 -309 25252 17650 -12518 -8299 2980 -642 13019 16149
21341 16149 4687 -11013 -4655 9173 22218 9614 -9089 -11047 -23638 -21424 -21972 -47496 -57233
21328 -57233 -54717 -27587 -28717 -31673 -6666 21437 55413 67204 52018 45608 27709 9041
21316 9041 18854 27146 8860 -9374 -22027 -21703 -13661 -7047 12998 15436 25550 17022 -2835
21303 -2835 -17311 -9638 14414 30042 38545 5391 -12907 -41877 -44613 -22331 -13822 -24612 -19180
21290 -19180 -3799 -16276 -29445 -33812 -35751 -4996 15120 7006 3324 13356 21812 20181 25379
21277 25379 22016 17672 25364 22925 15481 -345 -14337 -34061 -37529 -34104 -18338 -3622 27509
21264 27509 39658 19990 27977 30856 31518 9190 7379 11503 -17478 -49033 -24097 -4240 18743
21251 18743 -4248 -22094 9666 39830 7897 2426 7724 -4422 -27009 -21528 -4412 29243
21239 29243 56364 19161 -12676 -33133 -22048 -30359 -31639 -10695 4445 31880 16259 151
21227 151 2584 -9249 3159 -16930 -25306 -34043 -33023 -38030 -8624 19981 33886 13255 1688
21214 1688 15379 9545 2028 2981 16509 13424 25925 32124 52641 58056 22577 11730 26728
21201 26728 27784 29147 26407 45819 51733 64616 66350 47927 46007 31365 44895 51518 46802
21188 46802 44409 47657 38259 28693 47158 57216 30078 18077 -24303 -49522 -45696 -14784 -7133
21175 -7133 901 15535 17637 -848 -10546 1079 7209 7987 16259 -10038 -10577 -29654 -24319 -12560
21161 -12560 -18373 -14459 -10698 -18401 -6332 -3185 -8205 220 20554 3846 302 15779 14138
21148 14138 14723 29526 30841 15202 26194 46015 26998 24387 8122 -3396 -2906 -7074 -2665
21135 -2665 -10477 -24954 -5564 21749 17599 13867 11013 9864 884 -29451 -45826 -41444 -23744
21122 -23744 -11435 -23957 -35635 -68285 -48120 -56789 -40801 -17490 -1206 1810 -33316 -7862
21110 -7862 13788 16674 13136 9937 -4530 625 21433 17352 -7755 -24361 -37878 -27941 -9433
21097 -9433 -2323 12603 18562 28059 14129 6036 19871 34953 16069 15224 6182 -10321 -14776
21084 -14776 -15216 -10989 -12293 -2792 -27966 -53372 -31956 -45351 -54525 -24939 -14055 -33223 -36252
21071 -36252 -32330 -12006 -9889 -26438 -35416 -9644 -15963 -17873 -19019 21405 40395 7516 -4020
21058 -4020 23823 47706 39242 36970 40223 42352 2311 -26805 -22857 -19596 8365 38765 32889
21045 32889 33509 9013 -10510 -4549 -6077 14464 21990 9497 4662 36103 23578 -8900 -1116
21032 -1116 26121 42100 32549 35274 33942 30949 17943 26888 34180 16598 16481 6100 3121 9415
21018 9415 8138 -11427 -14328 4973 19119 38621 64064 52245 30171 42816 42050 38773 42295
21005 42295 18824 7380 2307 17853 30806 28840 -3300 -60204 -69766 -9325 29103 30000 32159
20992 32159 28412 27632 13690 -807 14372 23314 28732 970 -37402 -44099 -44856 -46983 -23201
20979 -23201 -1584 -6847 -3667 13628 25280 55914 65699 39512 31828 4688 -15425 -30602
20967 -30602 -2576 17092 -7420 4265 23292 25677 6666 14168 25278 57024 61250 44513
20955 44513 32229 11321 -12957 -9816 -36182 -29237 -27464 -17125 -20478 2304 -2714 2944 -17442
20942 -17442 -25892 -16888 5909 7629 -7189 3023 -7346 -26051 -28230 -14927 -2074 -14515
20930 -14515 -42357 -49091 -2364 21350 39046 37373 20296 27774 54506 3954 -27247 -25983
20918 -25983 -21920 -10608 5192 5787 -20232 -33765 19303 42788 44238 20312 -11450 -6175 -3249
20905 -3249 -22466 -16892 22585 24559 20032 41981 56230 44549 22569 18004 20301 370 13773
20892 13773 26898 26333 24250 38136 26593 39635 51283 70036 54010 21387 15541 27062
20880 27062 17742 -1046 8644 13049 -3672 -16182 -8970 -8649 -11065 -11148 -3198 14161 12138 -9126
20866 -9126 -6480 12048 1413 4167 11308 13011 -1837 -7082 -12260 -5206 -21442 -17230 -13057 -20285
20852 -20285 -12158 5493 490 -8198 13658 20490 12757 7130 8012 22866 28663 33694 19398 32560
20838 32560 21609 15887 5427 -7231 838 -7215 -22141 8898 11033 -5467 -10850 4569 14375
20825 14375 12135 20143 32586 50365 47247 42601 26231 36547 41343 17847 -14462 -6880 31239
20812 31239 35391 20065 1230 9795 31869 49481 51031 28061 36743 20530 19553 12052 -4500
20799 -4500 -17850 -15971 -35559 -23159 9335 27582 9443 19975 16160 29261 52158 35569
20787 35569 -1684 -3098 -12419 -8669 16766 26861 12959 13414 36421 68740 56446 7314 -21261
20774 -21261 -15571 -5855 18748 26160 19211 13226 1879 -12628 -9284 -28094 -41641 -43982 -36776
20761 -36776 -14524 -23 12308 19313 14762 9769 1003 -22404 -22733 -19858 6024 31020 46445
20748 46445 75194 56831 27161 15625 -4110 -5245 2850 -9826 3768 26588 36730 32263
20736 32263 24089 20232 32304 34467 17922 -1683 -18264 -3242 -2143 18128 28653 16312
20724 16312 6217 7035 -3255 -9152 -20954 2526 13938 5166 10957 49385 41376 8500 -13816
20711 -13816 -5489 3988 21667 7981 -4224 -10813 -10150 -1248 -27405 -19847 1158 36360 31189
20698 31189 37559 14010 29649 40873 33621 30110 35355 32105 26140 43676 74435 81027 71574
20685 71574 67788 42043 28696 15669 15735 13040 12137 8745 26892 41090 39849 -1972 -28347
20672 -28347 -14192 -17047 -10242 -10601 -11579 -283 323 15853 33842 24853 -1077 11234 38102
20659 38102 36751 34652 20702 1584 -16811 -1961 32952 44380 36045 22967 33296 33787 27485
20646 27485 9749 -9883 -8580 3875 12666 18497 8209 7236 -8055 -9835 -19836 -3139 25255
20633 25255 -1060 -13969 -33 14644 13398 22123 30415 -8252 -46744 -23293 -1010 -9345
20621 -9345 -24329 -29815 -24842 -27615 -5725 18467 18827 2531 -12139 -4105 -6606 -4629 23739
20608 23739 31063 25469 32535 27570 27911 11292 1574 -4755 -3743 17774 26951 40782 53746 44917
20594 44917 1287 572 809 -20180 -45633 -42331 -12901 -12446 -33426 -9131 -6283 5681 8315
20581 8315 -1082 9328 20238 35598 27035 12923 12161 29395 20498 26634 -4651 -19597 -2352
20568 -2352 4412 27806 11924 -4140 -7112 -23915 -11448 2744 -13907 -545 12704 21380
20556 21380 26250 20011 19156 6920 -25178 -31520 -26563 -8880 -10463 -11733 27446 21256 -2868
20543 -2868 12218 33625 42801 45489 35078 10213 10547 33292 30040 33327 52787 41004 12933
20530 12933 13818 -1452 2013 -786 -35137 -24781 -39272 -46030 -47094 -42693 -14225 17673 12262
20517 12262 -1287 -1596 13435 9581 862 16388 25119 32262 -23033 -38832 -39030 -12001 11159
20504 11159 -11128 -16680 21487 16785 4697 -6703 -12669 -18024 -15357 4084 13316 7388 16485
20491 16485 11817 21222 18294 32966 1182 -20590 -22845 -27030 -41343 -32041 -16171 -19097 -5028
20478 -5028 8553 8080 11291 35002 30866 36545 39635 21176 20483 7059 -10558 3487 6473 27078
20464 27078 37207 12852 3825 24773 26566 35823 2170 -4557 -22058 -18468 -31108 -26813 -38167
20451 -38167 -36263 -2028 16936 25202 29733 27190 14883 31217 58205 68758 36339 109
20439 109 -5557 -1679 26116 33504 15646 -11913 -40659 -27530 -12268 -16588 3374 10450 19129
20426 19129 27471 5188 -16426 -45013 -18311 -7997 2175 2842 -4761 -27137 -4841 -6899 8206
20413 8206 19474 13969 4765 17144 15767 16622 11408 15398 30280 21769 17294 5459 5017 13518
20399 13518 31661 3698 -25471 -31992 -17773 -12675 -16872 -29629 -15117 8244 2559 12835
20387 12835 7816 11742 36614 33703 10491 -16883 -15719 -16733 -34623 -12850 21084 31942 73931
20374 73931 67169 66494 55362 31071 18778 13453 24725 43474 96580 149023 168596 217580
20362 217580 298287 408431 534733 647550 714916 702962 586607 427755 295746 210040
20352 210040 169065 147479 98985 105230 107790 113292 109013 76642 57381 40611 28240 20742
20340 20742 1046 2511 26539 45042 63309 60425 46546 50676 37850 38897 50513 29952
20328 29952 32737 41862 24315 19968 21513 10434 19148 35026 29678 14447 32035 26854 13498
20315 13498 37712 28956 21509 20657 30752 32059 -11911 -49716 -42184 -28666 -39270 -25502 -23887
20302 -23887 -33789 -53277 -30651 -31214 -6007 17741 33749 19660 7062 -24128 -12573 9381
20290 9381 -6691 -36728 -48947 -28114 722 13837 18891 39268 36973 39434 38143 25404 19658
20277 19658 20407 26058 13745 9458 23467 49824 45715 9588 455 149 27807 34837 24294
20264 24294 7569 -16010 1374 19524 33721 45767 19545 21688 20809 41787 21173 -10679
20252 -10679 -18618 -16281 -32041 -9534 14508 10037 30489 38552 22696 20692 -4760 -2820 5485
20239 5485 19301 11815 3264 -32552 -26641 -22860 -27924 -20298 -10342 2848 13533 -5071 -796
20226 -796 7420 5382 592 3012 -1766 -27749 3656 32404 28683 28192 27309 21158 23028 50608
20212 50608 61841 18548 -19604 -10840 -7031 -17758 -36195 4956 5993 4238 19062 32674
20200 32674 32509 30088 10710 -3984 13862 13385 36369 45893 38808 26440 37245 27517 19812
20187 19812 6948 -4749 1577 24110 24373 14781 23218 4773 -15489 -14055 -1187 22442 11757
20174 11757 30140 34890 39754 48437 19206 8183 12944 18660 38906 52753 47776 34724 32073
20161 32073 12950 8423 282 17053 36658 10102 -13575 8870 15095 9599 19533 23320 22515
20148 22515 22586 27136 7616 -13277 -26255 -12220 20814 37268 31987 27999 36000 27147 10156
20135 10156 22871 28286 45271 43718 16276 16977 14564 25113 20981 15338 26456 35641 47059
20122 47059 16639 -12126 -17071 -799 16632 21462 9288 -108 18201 27695 56680 43888
20110 43888 42048 46195 31728 15944 -21721 2725 43122 20610 -1568 25929 32079 34235
20098 34235 28877 16867 4092 33654 27337 15577 5155 3216 -6245 13163 32899 31321 74747
20085 74747 95086 61223 34346 15832 9294 43367 56998 34377 16117 38503 69872 60170
20073 60170 58708 68161 58532 26643 19310 21784 18142 8606 24047 23368 19385 5986 22792 12960
20059 12960 8368 14409 19788 14903 42551 32380 19307 -2762 -8823 6246 12515 16230 27387
20046 27387 21221 27789 50580 57030 36470 6248 -3372 14548 34633 37257 24510 15814 -1255
20033 -1255 -33094 -16223 -5975 -2401 9624 803 -21670 -10493 16391 30635 15298 -2620
20021 -2620 16540 34890 57602 54579 50515 31479 22235 24343 20169 13586 23615 33384 21835
20008 21835 29053 52833 50788 33575 19904 27098 35487 35571 55070 79390 112947 107952 96275
19995 96275 75941 67766 70626 94797 94794 72619 57997 46431 37678 20864 27455 41514 44222
19982 44222 20929 6747 11690 9059 23251 48189 52141 46865 67722 56526 64296 70765 37568
19969 37568 56069 99144 93781 74689 79533 57544 47744 61982 61935 66182 73708 63848 52129
19956 52129 -7990 -41391 -43090 -15211 18908 65661 59689 50211 46261 41761 22850 1675 5566
19943 5566 20598 49543 61990 25452 6870 4057 -9476 -13096 -18632 15708 28890 7160
19931 7160 16873 35099 30373 42535 37714 16713 901 6800 -8498 -22325 -6504 11606 11803
19918 11803 23522 52755 55168 33281 40115 43357 37554 46204 41525 63031 97719 106622 95713
19905 95713 61447 63642 81086 81317 73180 76227 87973 79312 73714 78883 79756 98138 109091 118702
19891 118702 111112 112177 101920 97084 77803 51265 44182 44291 37474 30712 50875 68656 51023
19878 51023 24249 7758 -5 -7147 -59556 -95438 -97539 -65836 26892 108499 162145 234037
19866 234037 275436 306829 271456 218515 211727 204932 201387 183103 175278 165301 167901 173022 162907
19853 162907 149723 135061 149520 161330 192693 196462 169513 148240 123954 84245 69956 100145
19841 100145 132190 147797 124640 97025 106744 111750 76054 66165 97673 116981 105397 132287
19829 132287 171262 190265 186874 192783 201505 214770 204607 186533 187924 180919 167959 140782
19817 140782 147044 172242 181178 179499 182533 195478 204887 242035 268350 269014 261439 263795 263655 246311
19803 246311 256120 268615 294290 315721 319267 281932 261993 258339 285972 297692 306144 333144
19791 333144 347470 370799 361348 392786 412258 434330 477475 484862 494446 544157 578630 609380
19779 609380 665286 762803 880033 1078009 1357564 1664034 1712271 1671054 1547158 1316474
19769 1316474 1212089 1221807 1273558 1364336 1508079 1744002 2058000 2529328 2921044 3119125
19759 3119125 3321880 3462395 3635651 4058369 4751671 5744715 6897864 8123228 9764003
19750 9764003 12060300 15236403 20021282 28244700 43688043 74678508 126482576 161933657
19742 161933657 158059424 148851099 111528087 63265068 37005206 24733489 18468304
19735 18468304 14826337 12317354 10439396 8753828 7348052 6167964 5255939 4632734
19727 4632734 4207267 3964907 3860421 3634141 3348921 3093208 2712019 2401137 2202424
19718 2202424 2069693 2016577 2041965 2159241 2415051 2626073 2743310 3058683 3740803 5127141
19708 5127141 6473418 6443117 6119073 5076192 3286039 2152272 1582249 1273198 1083553
19699 1083553 943650 820987 749133 701128 643939 579312 535417 470060 434711 402309 379142
19688 379142 360210 323478 287838 262867 229331 206667 170192 159993 136173 120914 119672 120815
19676 120815 110225 100435 81761 59932 69117 53397 66469 96181 105945 91822 76635 63782
19664 63782 44111 45455 46543 56040 62488 65303 79567 67724 50327 48991 33389 22935 30095
19651 30095 36555 28097 24969 3321 8442 7524 6899 12213 21347 25444 -7241 -31732 -37619 -32087
19637 -32087 -14919 -9293 -28733 -41161 -52707 -43791 -17155 -15741 -40797 -31734 -39256 -59181 -85860
19624 -85860 -76037 -71629 -107276 -127877 -106168 -102759 -97841 -70362 -22119 35655 87606 94656 85784
19611 85784 58541 44360 39465 70307 83741 57569 40796 48595 53400 13509 2319 -997
19599 -997 -11122 -17808 -31774 -74216 -98972 -99961 -100381 -75500 -50597 -64498 -80216 -52072 -58039
19586 -58039 -46798 -48799 4475 18400 27407 2512 -40118 -43749 -43360 -44844 -11481 28055 10962
19573 10962 -8325 -13768 -23825 -27913 -14376 5193 5214 -2398 12344 24664 37119 11073 38989
19560 38989 39140 27457 -5229 -42605 -48277 -40129 -40926 -54381 -50770 -41504 -32758 -8530 -25015
19547 -25015 -40377 -19540 -27233 -30384 -14404 -24648 -35488 -16290 963 25470 61018 106195
19535 106195 128439 136617 119007 73249 43070 22871 21060 20150 -6368 -30974 -34696 -9148
19523 -9148 -6049 -28054 -53315 -31228 25579 57719 42508 5854 -1664 40272 88061 102028
19511 102028 102657 112829 119648 75654 55276 12226 -21317 -31330 -6291 -11628 -27188 -36252
19499 -36252 -33472 -16003 -316 -14681 -27728 -12657 -250 -6927 -10141 25691 38874 15871
19487 15871 -16461 -12425 -271 -20025 -9744 -8059 -1924 -20547 -34113 -32231 -38938 -47856 -44671
19474 -44671 -1573 2069 -9667 -9020 1700 -2648 -36318 -26893 -3252 8207 -10092 -6296 -4334
19461 -4334 -7445 -4512 9021 40783 47627 42251 35671 12871 -12746 -44415 -35845 -17259 -7637
19448 -7637 -40162 -33918 -23205 -31586 -32571 -45545 -19907 -8809 -19031 -8496 -9515 -13898 -6891
19435 -6891 -4549 4655 17149 31219 23746 13092 -18455 -8712 -8829 -27661 -31604 -48603 -57004
19422 -57004 -16396 -1865 -8684 -3016 22478 16572 2510 -3369 2483 -14307 4597 3758 -18296
19409 -18296 -14248 -13294 -14544 -4165 -16306 -35513 -40717 -37767 -22930 -3522 -8609 -11903 -13060
19396 -13060 -8000 12472 25732 26938 16191 -6867 -48969 -72384 -53957 -18661 -16126 -5542
19384 -5542 3294 6305 21196 1653 -5707 1685 5871 -9632 -21232 -3860 -14253 -5506 -4531
19371 -4531 13547 36327 24405 34452 21407 9031 -4146 -19026 -25932 -913 33898 48719
19359 48719 29462 15149 7238 -7161 -28295 -34309 -30898 -38767 -35403 -37901 -72063 -80566 -74435
19346 -74435 -63193 -37557 -25109 -8277 5396 -12777 -23928 -19060 1687 -4789 -29543 -39850
19334 -39850 -26140 -15019 -35525 -27048 -1441 14587 13461 -1348 11771 2713 -16703 -16301 -30392
19321 -30392 -40094 -4500 2055 19351 16698 6759 7899 14025 -18841 -30603 -27443 -12827 -6173
19308 -6173 -7117 -17994 -10200 -16088 -30314 -32540 -46085 -39224 -54252 -41465 -16130 -20551 -40576
19295 -40576 -38607 -38359 -26638 -32278 -43947 -61715 -25511 -18605 -49713 -35779 -19471 -40245 -9279
19282 -9279 10152 32056 20062 10341 16996 -3324 -26461 -3720 17967 30419 27647 3552
19270 3552 -587 -7099 1389 20432 -45 -29630 -51024 -47807 -48230 -35065 -29599 -24213 -41304
19257 -41304 -73537 -96853 -69082 -36924 -22931 -33266 -51593 -43595 -50201 -38888 -52419 -46339
19245 -46339 -30204 -10255 -15143 -21963 -15183 -4277 16057 -5707 -19252 -16120 -23338 -26332 -34914
19232 -34914 -37814 -44590 -62728 -50162 -21328 7731 -17302 -34906 -16508 -1982 -4342 -26311
19220 -26311 -45028 -28018 -15511 -14721 -10214 -21044 -29908 -18798 -22081 -48212 -46709 -42886 -29730
19207 -29730 -30848 -53666 -49174 -53399 -39823 -12700 -17123 -19891 -274 15441 16881 10340 -5130
19194 -5130 -693 14863 12435 13088 42112 16962 4101 425 -16807 -16980 8710 5696 -16216
19181 -16216 -20240 -3152 -1253 6098 -11544 -32359 -36683 -49460 -54595 -35881 -11276 -13628 -9821
19168 -9821 10981 -10143 -21059 -22587 -37821 -41606 -24859 -35524 -37025 -21202 -15576 -35504 -50411
19155 -50411 -53635 -27809 -2064 -2379 -4247 -19671 -19650 -21611 -38900 -37485 4018 19439 7304
19142 7304 4502 19432 12257 16305 37778 34446 7277 -12250 -21528 -33841 -11201 2749 17937
19129 17937 28412 15683 53535 123094 146067 198090 283904 390472 553432 688148 704169
19118 704169 628047 496739 365653 258759 206237 162599 124410 83425 41502 39363 17579
19107 17579 -7216 5848 -1294 63 21265 31188 17762 14881 -681 420 -22023 -23571 16419
19094 16419 29771 22272 12106 2350 13553 34534 42569 37401 -4269 -39511 -24565 -21954 -23721
19081 -23721 -23072 -5239 12926 8313 -2221 -28380 -30363 -34658 -36920 -34529 -8396 8095 11973
19068 11973 4776 18495 14320 17993 19261 10578 28354 14609 -9623 -15344 3145 -227 -26672
19055 -26672 -21691 -11652 -19364 -32187 -15044 -30307 -38455 -43789 -19915 3874 926 -4981 -5634
19042 -5634 -4548 -17596 -8381 -3446 -14514 -29616 -13829 -137 -3006 -3941 -23771 -23887 -9568
19029 -9568 13240 -7418 -37999 -29393 -16125 -5866 -4441 -17539 3995 13049 2259 4058 -24823
19016 -24823 -16648 -7334 6055 -6130 -22390 -22029 -21034 -30978 2371 -5110 -21577 -16200 -21458 -9777
19002 -9777 3176 6701 12620 8612 -3565 -20758 17912 27434 12310 -18765 -29122 -42792 -50741
18989 -50741 -59142 -45016 -44153 -57598 -62939 -71295 -33059 7630 16504 -8202 -27146 -46489 -48665
18976 -48665 -22812 -16570 -7046 -22236 -21681 -12681 -2524 -18980 -9782 11810 15307 4220 21573
18963 21573 21884 3939 -1675 -6195 -8862 -18838 -13110 -2051 12303 18842 6693 -24552 -24424 -7661
18949 -7661 17913 21215 -283 -16997 -17333 -13617 -10353 -7625 -8948 -20541 -27022 -12241 -26336
18936 -26336 -20997 -9231 -47443 -68445 -58204 -36089 -21472 -49468 -60918 -51019 -64552 -56881
18924 -56881 -42018 -45464 -51589 -36156 -21618 -28715 -35262 -34668 -40736 -32928 -35750 -35939 1051 3358
18910 3358 -30247 -57015 -57154 -58466 -47644 -47151 -56944 -61058 -30223 14526 31112 15664 213
18897 213 -11 -39607 -57979 -49963 -61119 -82469 -80216 -62411 -56892 -54971 -61505 -51056 -40928
18884 -40928 -12818 9525 -16155 -55804 -26254 -9956 10264 9440 6003 16704 59526 77583
18872 77583 57523 63016 62964 34783 4494 -14721 -814 -4961 -8892 -22986 -9059 19202 35203
18859 35203 13721 318 -28045 -42700 -39130 -2485 -1500 1378 17288 -3655 -252 -3094 -432
18846 -432 -1642 -2325 -9829 8488 35531 15988 -34604 -58619 -48906 -27589 -12997 2548 1329
18833 1329 -25830 -64596 -64094 -52819 -51086 -43592 -20610 -10719 -11486 -2266 -1481 -14799 -7694 5017
18819 5017 8850 -15028 -8776 -38047 -33394 -21357 -35052 -35249 -32149 -31386 -48000 -55739 -54042 -63499
18805 -63499 -54787 -44639 -53661 -33203 -10494 -18879 -20544 -34141 -36243 -17144 -11806 -36185 -41376
18792 -41376 -17719 -14088 -26409 -38812 -32170 -40600 -44887 -40103 -40100 -12101 882 11722 22387
18779 22387 11280 3641 1050 5262 2473 -25131 -11293 26230 46686 33320 11380 13437 -20692
18766 -20692 -20338 -18500 -2425 -4817 -12003 -36373 -20621 21691 18004 11020 34444 39381 47518
18753 47518 61046 55157 39277 31018 14197 19467 1750 10995 299 -15019 -21380 -14616 -26784
18740 -26784 -45103 -52087 -77379 -66912 -38997 -42834 -80468 -109095 -67677 -40509 -22577 -37884
18728 -37884 -24777 -1205 -26265 -49151 -40637 -51180 -52960 -42103 -41573 -31720 -3685 7961 8418
18715 8418 -3474 -14817 -27800 -16858 -15035 4400 -1261 -7929 -8323 -20904 -36446 -50846 -67482
18702 -67482 -40393 -11378 -2460 -12865 -39630 -28125 -15346 -32714 -61288 -64586 -55296 -51304
18690 -51304 -60232 -43242 -57537 -49286 -20191 -19361 -26213 -21478 -4985 -12607 -25139 -13837 -7347
18677 -7347 -42256 -51353 -30836 -32358 -37494 -30068 -26405 -9483 -6218 -14105 -37830 -16177 -19315
18664 -19315 -19099 -6509 -14454 -26879 -36693 -47131 -15417 13793 19128 -348 -12582 -4292 -11157
18651 -11157 -5885 8374 796 -8208 -16781 -18304 -9814 22314 37730 9603 -9089 -8978 -25991
18638 -25991 -18505 -32701 -28028 -8132 -18860 -7506 3806 22159 26568 33689 22321 -666
18626 -666 -32769 -34040 -17838 -30955 -57405 -44059 -44349 -25158 -26722 -4084 8692 11855 31159
18613 31159 30477 8427 2627 26413 37561 4414 -25257 -32878 -29557 -19677 4680 -4321 1438
18600 1438 3258 -29972 -41512 -25067 -6214 -4845 6370 9787 -7871 -15784 -17107 -13230 11600
18587 11600 17531 -16645 -21828 -13506 5153 4529 -31399 -23819 -15117 -14797 -22040 13475 29820 -5577
18573 -5577 -28843 -21637 -3572 -11006 65 -15646 -46218 -52957 -32935 -3853 -18061 -30834
18561 -30834 -49431 -43920 -24469 -18385 -31981 -37991 -35048 -18017 -15489 -3517 41590 32391 2407
18548 2407 4220 -92 -11174 -10892 17084 39375 32721 39206 33114 10486 2872 -20017 -30932
18535 -30932 -31996 -34230 -18004 -9035 3147 -9234 -19237 -29042 -39177 -41130 -33381 -42530 -44661
18522 -44661 -25481 -34715 -57518 -68034 -75842 -83432 -82999 -60946 -56196 -57282 -42541 -10129 -14660
18509 -14660 -28656 -30639 -30620 -22066 -11717 -15338 -18228 -22274 -51419 -54587 -21207 -5647 -7069 -29433
18495 -29433 -20429 10719 12179 -9603 -15774 -12330 -11504 -20276 -21818 -4641 -2394 -17495 -40516
18482 -40516 -55039 -43727 -30726 -39020 -38310 -27525 -31903 -39517 -44991 -16633 -8722 -15181 -22349
18469 -22349 -19244 -38117 -40720 -33537 -28042 -29801 2363 9113 -258 -21413 -41286 -46263 -12649
18456 -12649 3280 -19552 -42912 -38175 -22501 -33053 -39438 -41651 -35877 -28082 -21099 -11847 3447
18443 3447 -2911 -9043 2880 25559 4898 7542 5401 -17814 -1869 -4218 -6568 -2958 -5461
18430 -5461 6009 1153 -39210 -39442 -43276 -48611 -26689 -19423 -12013 -24645 -37021 -29102 -4175
18417 -4175 -10687 -10864 -3206 77 -3884 -12763 -28736 -22453 -23880 -32158 -29580 -34206 -9973 -20958
18403 -20958 -41394 -36714 -34463 -9883 -28066 -27993 -13702 -23048 -24390 -9547 -7061 -27225 -37307
18390 -37307 -30672 -20229 7326 20983 15183 21808 5914 -12471 -19251 -8467 -8345 -12587 5079
18377 5079 12189 15420 -9353 -8645 -1828 -14278 -17715 1932 17679 1407 -23112 -5863 -16341
18364 -16341 -36549 -22724 -5303 8108 25500 32760 37055 33118 23914 1043 -7999 -5617 -26269
18351 -26269 -23275 -23884 -4058 -4495 10330 11930 10690 9108 -10525 -20269 1273 25845 65565
18338 65565 52825 43865 15334 15071 9985 2814 -1453 -11100 -27360 -48271 -8853 1813 4128
18325 4128 -17387 -26036 -31211 -40529 -44169 -28993 -15702 -5276 -8367 6093 20172 3350 -25864
18312 -25864 -35535 -17560 -23979 -24907 -45988 -40757 -61018 -38432 -14304 -178 9226 -2534 -17620
18299 -17620 -27703 -15413 8862 24012 41881 28652 29061 19854 1559 -6826 -20445 -39287
18287 -39287 -37265 -19125 -16826 -19505 -12774 -20545 -11779 -10595 -1733 15867 -5027 1048 -33739
18274 -33739 -56749 -62682 -56932 -47730 -39474 -34330 -17418 -6151 5764 -12796 -17604 -57252 -73908
18261 -73908 -57034 -57169 -47565 -17678 -2940 -18314 -56820 -31465 -7268 -30120 -63978 -72578
18249 -72578 -55395 -34686 -39605 -35164 -30562 -16211 -21895 -57878 -68535 -45392 -34657 -8834
18237 -8834 -7686 -22901 -17489 -19535 -23159 4323 11170 -20227 -13864 6575 15901 22574 8870
18224 8870 -3001 18501 30386 -8480 -21247 -4536 9141 48457 34214 28402 35238 19836
18212 19836 180 12558 -9856 -15571 -21497 10085 25036 3427 -28290 -12832 -20155 -30611
18200 -30611 -13620 4201 -14910 3075 -1582 -30725 -41553 -4878 28496 27521 29102 35227 14245
18187 14245 11511 -6941 -18400 -7289 -29122 -35499 -41502 -56582 -56218 -27479 -7579 -26464 -76447
18174 -76447 -52262 -4956 29502 39050 5299 -12502 -38385 -44010 -21887 -95 12024 3377
18162 3377 -26951 -44210 -43257 -36471 -1386 2455 18665 29139 31696 52529 60713 32320 16475
18149 16475 7191 7440 8362 9299 1254 -6205 -5652 -11410 -2266 -4983 -15740 -17782 -4538 497 18806
18134 18806 48512 43383 5119 -32669 -35025 -33400 -6445 6473 18839 14408 -13349 -10782 12380
18121 12380 44405 43553 35585 27147 28638 26978 41012 103940 122352 93114 50790 47286 49492
18108 49492 33726 17519 22756 46965 72761 87700 104862 90618 77691 93695 72797 59917
18096 59917 55667 69838 87124 90113 80158 40982 53646 73372 46809 22933 20904 31732
18084 31732 44133 23416 -8214 -21164 -17248 -74 12965 27873 45173 59419 46083 34726
18072 34726 24524 34157 29693 32134 7452 -12460 3298 -2337 1903 918 16209 63241 63927
18059 63927 53866 69149 94772 108833 117525 111901 117259 128942 142410 130052 103049 74931
18047 74931 46324 41993 57201 54148 47089 65397 60984 51314 63291 68833 56253 26233 14791
18034 14791 12955 5915 -28815 -19425 1287 7442 -2872 5207 -3102 -3273 -1399 7860 251 -6765
18020 -6765 -10950 -30823 -24468 1732 1304 -18158 -30699 -32812 -9535 18241 35902 53271 72553
18007 72553 52295 56886 76267 93221 94209 114890 104487 82911 82632 95258 125979 136565 148851
17994 148851 166411 146921 140037 146115 140774 129064 93237 84891 102947 120510 125575 107517
17982 107517 57814 37126 22417 17068 35675 52350 62463 49561 39276 61057 78175 95175
17970 95175 91569 94524 97120 75284 69117 71706 61178 31764 13927 17231 17214 39980 61202
17957 61202 35342 24024 15106 36629 36351 30650 28067 56968 52951 34210 54180 30951 27353
17944 27353 42073 47519 42339 62046 55905 78020 98110 86966 86052 69952 81111 73604 37160
17931 37160 25751 25682 20778 28550 6545 -13581 -3349 15004 21598 12594 8267 20480 33335
17918 33335 33291 23446 26040 20271 12830 -3151 -3470 5696 -14962 -20506 7756 13055 23803 30121
17904 30121 27998 14056 8494 18106 31326 22136 24278 17311 -54 -5023 -14635 6091 14844
17891 14844 8602 -13367 -41613 -34205 -16140 -6930 1844 -8398 2930 22774 28599 31081 18092
17878 18092 21823 19247 -4122 -5379 13534 -3756 -16231 -18956 -10790 -8124 -22812 -21862 -9382
17865 -9382 -18525 -31778 -30683 1249 14924 1568 -10385 7941 -8352 1232 14070 2761
17853 2761 21355 1522 -29141 -18073 -17964 -21313 -32335 -30703 -23140 -41298 -13131 -11452 -8171
17840 -8171 -27412 -50718 -32858 -19775 -14433 -17109 -5809 -21365 -17527 -41576 -54282 -39545
17828 -39545 -31703 -27145 -17364 -22335 -28087 -39310 -21438 3679 16041 2510 -27545 -27790 -14061
17815 -14061 -11065 -7835 -745 18046 -7037 -30615 -17961 7392 -6145 -7338 -16936 9910 -6144
17802 -6144 -27778 -10966 20179 44806 36964 3210 -28335 -18974 -2774 11635 12388 -8968 -48782
17789 -48782 -44075 -31965 -29523 -41157 -48453 -43861 -42217 -38119 -33668 -19474 -12856 -9314 -19586
17776 -19586 -23696 -13124 -3007 -34692 -20720 1426 9099 6204 4544 4160 9384 21852 16217
17763 16217 3905 5085 3382 -12387 -16103 -22718 -19267 -5968 -10130 -15143 -22554 4625 8010
17750 8010 5958 9611 14001 -11237 -27156 -32798 -39142 -26922 -33736 -46088 -43334 -16989 -13395
17737 -13395 787 10222 13576 -6744 -20128 -17436 -24471 -17831 -2032 -4918 1680 10660 5822
17724 5822 14661 30987 38192 25104 7968 5604 -517 -10054 11068 24270 13941 -24159 -69094
17711 -69094 -46641 -22295 -40139 -19876 -10459 8325 2676 -48243 -66526 -65958 -43565 -13877
17699 -13877 -35324 -39434 -28898 -25381 -32690 -24663 -18843 -26102 -23744 -12727 8143 20567 21455
17686 21455 12101 19723 30386 15197 18937 8358 -12808 -23647 -17996 -17571 -20099 -28944 -18159
17673 -18159 10171 22186 11544 -12941 -31575 -34811 -39956 -44986 -13235 -12934 -24412 -21679 -24859
17660 -24859 -29798 -35011 -29829 -26701 798 5646 -9663 -25448 -14265 1736 22674 19372 17062
17647 17062 10258 18026 16746 5414 -3741 -9090 -6565 -11439 -1361 -17143 -9496 -12608 -11596 4202
17633 4202 -12685 -18391 11125 26707 29732 14731 19216 22040 21630 30824 28209 -1550 -40035
17620 -40035 -52309 -42098 -31019 -24463 -1322 11156 12336 -28892 -44381 -11241 6863 4516
17608 4516 18668 16121 -2686 10241 31163 27330 25283 13795 -11346 -5144 -23117 -27806 -38950
17595 -38950 -40099 -37086 -28886 -813 303 2852 270 -9633 -16643 -17342 -21359 -36244 -47014 -42217
17581 -42217 -32133 -16633 -5070 16492 3221 -15112 -23045 -21751 -14344 -13064 -36267 -45708 -43286
17568 -43286 -46319 -27426 -1762 9713 -1889 -30402 -58816 -35334 -22867 3518 27208 62056
17556 62056 44730 22845 6288 -221 -4871 -21059 -19962 -23831 -21282 -20476 3328 9663 32242
17543 32242 26476 -8344 -4867 1850 8720 12329 -10886 -28839 -34095 -25507 -27710 -44564 -39804
17530 -39804 -19286 -24570 -15845 -11615 -8121 30339 11098 -22844 -36880 -20774 -6004 4056
17518 4056 -12232 -22194 -13126 -1378 3601 7953 13791 12627 19191 13782 -17153 -39641 -15525
17505 -15525 6323 27637 43151 30736 4059 -5969 7941 23436 7557 4267 8691 -7181
17493 -7181 -47476 -52567 -19872 -4912 12501 10595 16034 16083 13911 6669 -17458 -8652 8166 -3384
17479 -3384 -25551 -15489 5657 25057 15029 4058 -11020 -39963 -35196 -22430 -8396 -18759
17467 -18759 -52718 -39404 -10615 -10909 -4167 22574 16719 -12093 -22865 -45961 -37647 -26504 -55401
17454 -55401 -79664 -63609 -35334 -7072 12746 -3310 -11520 -33065 -38584 -26875 -25024 -35092
17442 -35092 -36727 -36626 -25986 -7895 -2905 -7711 -642 18148 11391 -19642 -35600 -26542 -16772
17429 -16772 -10695 9334 21988 2882 -20472 -15370 -14820 -17687 -22169 -14248 -2688 -14052 -29298
17416 -29298 -30402 -52530 -54754 -47806 -26421 -10381 4771 19237 17953 6020 -3257 -11797 -15810
17403 -15810 -29002 -52363 -42084 3658 22220 19202 -1333 -15153 -14605 -4538 8024 23399
17391 23399 21414 -6864 -2876 -18849 -25826 6009 14209 19615 22391 5061 -15414 -24694 -48500
17378 -48500 -39240 -11074 -34782 -32451 -24162 -15197 -10901 2045 -18937 -18735 -4848 -18370 -11588
17365 -11588 6066 22327 7822 38 -1135 15723 8515 21438 20673 3545 -803 -2593 -41911
17352 -41911 -60550 -56946 -53335 -31242 -14725 -23144 -23907 -34906 -40936 -27129 -17923 -20446 -12789
17339 -12789 -16975 3026 3916 -10349 -4130 -3796 -4833 5341 10832 25606 18525 2712 -25378
17326 -25378 -19420 -32575 -49588 -53912 -31274 -8230 -16238 -19418 6351 1664 8517 4283 1272
17313 1272 -20258 -40254 -53065 -53694 -40230 -20439 -5721 2277 -4628 5322 6337 -3115 -5321
17300 -5321 11722 13626 -24067 -30104 -18403 -42819 -54344 -40961 -26119 -34691 -32241 -37689 -13560
17287 -13560 -27803 -39508 -43743 1692 29973 37407 41435 12547 -864 7430 -19599 -26967 -28362
17274 -28362 -54198 -40550 -32774 -44211 -47326 -14626 -842 -670 12224 9321 12046 13020 7081
17261 7081 -7746 -11444 -33387 -59864 -76775 -51319 -33603 -28317 -16673 -16646 -25174 -46280 -59556
17248 -59556 -34452 -29422 -1020 18782 26521 22420 8983 -5318 12106 -3741 -22623 9973
17236 9973 37746 30975 664 -8764 8081 12283 11206 -17103 -24999 -23810 -35917 -45910 -45646 -37205
17222 -37205 -29798 -21523 10410 51098 56733 45178 1591 -43924 -68165 -65667 -55175 -30119
17210 -30119 1293 -1272 -25604 -55335 -36225 -16506 12890 58878 112953 141387 151959 138671
17198 138671 102920 59107 20293 27458 30007 15334 -5034 -6317 -9257 -3177 16348 19712 18488
17185 18488 11251 5309 12792 30920 75044 114270 148347 179064 172476 111917 67399 38181
17173 38181 11948 -2533 -9720 -15417 -27119 -28773 -21842 -3077 23313 14221 -3062 -912 -20716
17160 -20716 -37636 -27948 -33475 -41558 -50654 -51263 -54126 -36997 -25970 -22449 -14789 -3944 -25601
17147 -25601 -41470 -21902 -12305 -27099 -45265 -26020 -22223 -4700 -29751 -42388 -20255 -27929
17135 -27929 -28732 -24808 -1379 14681 8223 -19129 -10867 7793 -12115 -3234 -1867 -22333 -26988
17122 -26988 -8081 -109 -8199 -16798 -12165 -23565 -18194 -24254 -39241 -50247 -54846 -22436 5325
17109 5325 2460 -3909 -24839 -20164 5730 15660 19259 27258 438 -20727 -13646 -27294 -33413
17096 -33413 -18982 889 13373 9180 10714 15518 12301 -5573 -21251 -29574 -34278 -27056 -38735
17083 -38735 -43417 -44804 -40570 -47135 -25531 -7570 -19097 -17734 -31050 -46046 -59443 -57876 -30925
17070 -30925 9703 36400 45423 45292 25876 6137 30015 45270 16774 2331 8116 13845 23310
17057 23310 24682 14518 19441 -7500 -982 12823 7792 8586 34400 52536 51842 14910 -10902
17044 -10902 -19201 3728 18045 13700 2220 8023 9517 27997 38003 24437 16893 17899 5232
17031 5232 -29508 -32073 -1390 23324 27844 31142 17367 9063 1423 8040 2144 19636 14237
17018 14237 2907 23413 17697 -2456 8647 2629 -12572 -20957 -10294 -2198 -33936 -55898
17006 -55898 -41129 -30321 -3633 10333 19841 10255 20911 21834 27821 12828 -16659 -23148 -8132
16993 -8132 -131 -2664 9932 31028 37465 31318 31995 31631 22451 17325 21525 14095 -14338 -10629
16979 -10629 -12180 -33483 -38138 -17955 17403 11405 1300 1625 19201 -15630 -18786 -1376 22812
16966 22812 30622 21143 3702 1217 -3922 -1021 2072 -7438 -33534 -42134 -42552 -41039 -34933 -16171
16952 -16171 -15203 -2172 -7115 -16221 -29529 -22995 -18636 -30975 -22095 -5704 -3787 2972 7401 1685
16938 1685 -10570 -3751 -20378 -46533 -30710 -28779 -26143 -58140 -66939 -63787 -29243 -26094 -45722
16925 -45722 -53333 -49244 -41941 -33132 -32416 2631 35413 54564 44944 25902 25074 17495 12514 14494
16911 14494 33550 39146 28157 23476 32752 17044 3994 16934 21403 23648 37737 53296 40712
16898 40712 29220 16325 9044 7185 -7347 -31033 -40159 -22628 1910 -17988 -41593 -39227
16886 -39227 -16551 -6613 28086 24371 18463 1350 -35116 -20553 1513 19055 22868 38353
16874 38353 15875 6734 -16823 9236 11828 18817 13082 2091 -16014 -46110 -50326 -54975 -32301
16861 -32301 -38725 -40830 -28306 -30991 -23401 -35873 -24289 -8654 -23979 -35897 -34585 -9824 10297
16848 10297 19970 33679 19672 28874 39549 23872 22920 20073 20508 13237 3175 -4940 -31865
16835 -31865 -47453 -24614 -6567 -14293 -20486 -15519 -27518 -12247 14543 15376 -6992 -9084 -24024
16822 -24024 -28247 -24113 -15835 2436 4065 -2815 6808 28672 41145 25528 27178 21732 13366
16809 13366 3967 -2395 -16914 -19101 -28171 -32184 -27010 -44066 -33282 -37324 -8037 32711 35288
16796 35288 2863 -18729 -32042 -39084 -13434 8673 -11473 -10416 14697 -11639 -17325 -2226
16784 -2226 -13157 -27903 -21796 -16375 -1432 -323 -17226 -10213 -15032 -16227 7087 4862 -7045
16771 -7045 11361 40530 51129 3315 -22442 -29777 -28198 -25633 -19358 -15098 -42675 -51667 -15635
16758 -15635 -16893 -6606 1109 7440 15144 30470 5156 -20179 3506 14009 18130 27306 17239
16745 17239 -74 -19099 -7563 -10389 21851 14679 -6900 260 17934 19877 7854 1628 18466
16732 18466 30331 45553 62266 33278 6468 -9030 -15568 697 7483 9803 -10545 -19170
16720 -19170 -14670 -11785 -7984 -22536 -29268 -27985 -17559 -14582 -6938 -32583 -66304 -63188 -37510
16707 -37510 -39923 -44262 -45359 -38599 -26653 -23822 -29789 -16304 -2470 1762 -16844 -11900 -14111
16694 -14111 -10430 -9916 -22832 -32263 -31144 -35988 -6612 3338 7779 13085 17105 -7761 -11374 -2504
16680 -2504 239 -19560 -33310 -27569 -17282 -15651 -27519 -23058 -4745 18462 21627 4828 -18491
16667 -18491 -18229 -23095 -44023 -34789 -18956 5149 36347 49538 35939 10744 22460 39953
16655 39953 19698 -8709 -25133 -57301 -50670 -28175 -14902 205 6069 31030 48080 36788
16643 36788 20940 7003 3470 -23028 -12480 10484 26591 16317 2242 2002 7963 5652 -19929
16630 -19929 -41623 -21134 5599 26443 9940 -12847 -13414 -11802 -16933 -17451 3764 -5102 -25558
16617 -25558 -16203 10911 42102 10998 13519 287 -26791 -23833 -18654 -9265 -1892 12994 10179
16604 10179 -3324 -30184 -28613 -24877 -122 17052 31130 11093 27285 16642 -3194 -14600
16592 -14600 -30611 -15818 -8979 -7113 -29713 -25635 -26481 -34041 -30509 -6379 6907 -10987 -29008
16579 -29008 -34145 -39832 906 9001 12711 18450 259 -10967 -31241 -12587 17411 19647 -8499
16566 -8499 -22873 -12138 -8738 -17989 -36705 -40302 -13099 5565 20482 20589 22778 16768 22208
16553 22208 41926 37278 28087 -14413 4665 17350 17849 18692 -6229 -19704 -2719 -10978 -32681
16540 -32681 -29567 -38695 -36120 -41257 -26343 4522 -7731 10667 9978 -4845 -15097 147 5828
16527 5828 -7779 2131 19208 26574 4807 -86 -26547 -31029 -39093 -10279 651 -7653 -10614
16514 -10614 -7388 11746 8791 -23265 -16420 15784 23037 2303 4660 -1520 -17198 8165 15886
16501 15886 41830 55768 32835 29092 41941 49308 30714 -3218 -30758 -31492 -11827 12983
16489 12983 18426 12944 -9838 -9823 -6171 -16198 -15594 1949 10553 15702 -9174 20595 44799 31882
16475 31882 17192 -20791 -48345 -27701 1666 5507 8815 5656 2392 -2353 -9292 -22179 -4356
16462 -4356 10526 40649 40249 16485 2067 -15009 -4306 6789 12058 -6987 -12753 -9763 -33612
16449 -33612 -24103 -4629 -1757 -5817 -9866 1284 2934 515 4080 2029 -16687 6273 34904
16436 34904 43618 39505 20640 17883 13789 1189 7675 8483 -7053 -759 -14900 -25059 -11542
16423 -11542 -5442 3224 675 435 -4775 -8104 795 -28756 -46621 -67689 -26849 23656 21447
16410 21447 28378 22423 -12991 -7844 2508 -18712 -38049 -57498 -41301 -19260 -13975 -12634 -25563
16397 -25563 -11660 11867 8511 -23890 -53632 -47433 -28179 -47828 -55068 -35912 -23470 -12023
16385 -12023 -20715 -37000 -30098 -8907 4227 -11210 -10737 -9696 -19895 -35179 -30008 -25017 -17942
16372 -17942 -12476 13448 9828 4745 9986 -6269 -10865 -18101 -26831 -41063 -27696 282 22413
16359 22413 22170 3966 -10786 10134 14247 5928 -19832 -42687 -16622 16252 21275 532 3458
16346 3458 31139 38272 14687 18236 -981 -37234 -19859 -13272 -12275 -30803 -12586 -2502 -14535
16333 -14535 6021 16529 16528 -10053 -35664 -38445 -49336 -46334 -55341 -45841 -21212 -21951 -17343 -14051
16319 -14051 -9930 -4471 2707 -20858 -9961 -15950 -44670 -20885 9478 9163 -17645 -34623 -25445
16306 -25445 -4259 14292 42705 75864 61922 40578 10139 4211 26839 27631 28646 18008
16294 18008 -11652 -30672 -24770 -23452 -8770 -30802 -43430 -25188 2341 18822 13382 5607
16282 5607 8790 -11867 -15837 5037 26542 41368 61549 54301 46337 31277 28338 31546 40063
16269 40063 32793 31049 9864 -12435 -13499 -1748 2015 -8588 -5294 36021 46669 40833 18748
16256 18748 26109 38316 36003 24945 10377 8493 29538 18383 -4417 -20059 -23775 -26962 -36680
16243 -36680 -22483 -22057 -21105 -17892 -44681 -49442 -50643 -43542 -47536 -51994 -27542 -1893 15432 18348
16229 18348 21719 9398 -6841 -1726 1396 -4396 3867 -1173 16194 35788 2605 4471 -31825
16216 -31825 -57896 -47663 -563 31876 21143 8425 3879 -11102 -15361 4269 -11017 -17831
16204 -17831 6237 -1612 -41397 -55191 -23883 17693 54002 34779 -10732 -19552 -13716 -41286
16192 -41286 -28392 -6690 5515 -2637 6067 8040 1977 18856 22237 765 9324 6442 -5051
16179 -5051 -25147 -32429 -19662 2490 -10344 -5232 836 25432 6605 -5124 -14852 -17402 -18881
16166 -18881 7468 -16201 -38500 -18558 -3295 4208 17957 30832 -2893 -5837 4038 -11887
16154 -11887 -1565 -11022 -31109 -25063 -20199 -5929 -14071 -12275 -10136 -16658 -23537 -22961 -20178 -36130
16140 -36130 -43511 -48530 -66102 -33078 -6448 -2347 -348 -15705 2739 3980 4437 18669 18246
16127 18246 5043 -7805 -764 -14820 -14474 12540 17648 21387 3784 -3462 -12330 -18556 -19446 -19522
16113 -19522 -15890 11007 8571 6050 -10750 -16305 -12152 -20539 -33960 -25971 4306 20355 23347
16100 23347 -7241 -11114 -5404 -16699 -27366 -32484 -24818 -26184 -29106 -31325 -35858 -33962 -30540 -46081
16086 -46081 -44109 -10835 5899 17938 17123 -2376 -11807 -14814 6867 4810 5494 18945 6793
16073 6793 -4215 2434 -23498 -37252 -23613 -48 -1132 1116 13432 -1792 -6842 -6888 -30927
16060 -30927 -37176 -57472 -43845 -4180 -5468 -22016 -21170 12759 19907 18592 5770 -3563 4708
16047 4708 -15547 -52538 -61865 -42122 -11886 12505 15462 -6678 -33758 -48150 -48244 -12826 476
16034 476 -9528 9110 22175 15882 -8069 -15124 -5529 -8810 -16664 9344 -11744 -24395 -13164
16021 -13164 -16916 1725 31997 51545 25324 2231 19619 22027 26620 23661 -6615 -3766 -7592
16008 -7592 3122 13980 37551 51407 27841 25543 38437 34634 24419 31884 37270 30961 13990
15995 13990 -13935 -38644 -47482 -43115 -59078 -40159 -32124 -37710 -32104 -33511 -23736 -17100 -26005
15982 -26005 -24086 -11488 -5354 -7116 -726 776 5498 3693 -15702 -37524 -41044 -45897 -19746
15969 -19746 -6953 -13045 -12276 -21272 -42143 -52690 -34735 -36337 -27318 -11023 -2420 -24518 -20305
15956 -20305 -3761 27037 16073 22849 12697 8890 -4896 -10080 7694 28035 15140 -4263
15944 -4263 746 -7904 -27028 -32232 -24802 -34189 -14195 -9250 -7110 12495 6616 -15950 -58567
15931 -58567 -86508 -66352 -42741 -23235 -23334 -6247 -30710 -56726 -36999 -32143 -23773 -4081 11744
15918 11744 -868 -10671 -26251 -38889 -37427 -33312 -14445 -19388 -17561 -4341 -15041 -19735 2776
15905 2776 13146 25126 42972 54568 33640 18007 -9795 -13608 -8619 -13553 -8102 -13335 -40137
15892 -40137 -36488 -37614 -16843 -3351 11377 21145 21092 23088 25971 56145 53041 46859 11098 -27018
15878 -27018 -26544 -13695 5322 25158 11057 -14467 -28834 -2397 35989 31890 12294 14943
15866 14943 27936 50488 69705 46995 56201 44053 14048 9617 29016 23442 27542 27607 14767
15853 14767 31054 20269 -8300 -28724 -33258 -23037 3793 -54 2863 1553 -15701 -13314 -16048
15840 -16048 -26639 -17132 -20021 -39481 -22656 -32188 -31408 -2549 -25724 -44852 -47865 -36311 -17034
15827 -17034 13457 25874 20794 27493 23935 10459 -12363 -45774 -37950 -34040 -27563 -7703 -9968
15814 -9968 -31174 -13705 21624 41106 12126 -260 20076 4363 -1307 -8203 -8575 -13675 -5782
15801 -5782 -18235 -17382 -4262 -10060 -8553 -64 10845 30870 27129 29347 7020 -16585 -28478
15788 -28478 -6918 17059 23854 27072 37041 40232 45244 -6045 -35925 -30205 -1256 10069 27118
15775 27118 -5752 -28841 -27167 -16952 -3434 -29282 -29502 -26327 -25657 -26160 -53911 -60728 -34596
15762 -34596 -40317 -38173 -35800 -24550 -8982 18121 57124 54087 22160 4519 -8730 144 16688
15749 16688 17358 -6886 -41897 -37072 -15949 2095 11215 50288 42555 11062 12188 20444 27252
15736 27252 52474 53174 25591 -4051 -19189 -9911 9277 25401 59694 48117 -179 -12929
15724 -12929 3002 -9262 4383 13855 27011 10501 830 -9943 -16986 -171 14244 11669
15712 11669 32317 54676 24755 1733 -12028 -34667 -28276 -50228 -40438 -30263 -10390 -2709
15700 -2709 11362 -987 2282 19426 11602 3479 9352 27173 26238 20771 10090 -14204 -17929
15687 -17929 -559 -3574 5571 15507 21484 5598 2810 8681 22794 -8924 -10815 -2684 14573
15674 14573 5014 15671 21184 7417 2631 10652 5425 12827 8036 -6618 -25490 -19657 10581
15661 10581 6530 -7894 -6963 -232 -11362 -25054 -11152 -4974 -17355 -36857 -28219 9834 21989
15648 21989 866 -4327 -20990 -32613 -24451 1708 48155 58325 33130 10962 1669 4414
15636 4414 -8009 -36093 -25297 -5649 -9892 5302 16735 19564 22241 16897 6421 -755 -14397
15623 -14397 -36295 -45806 -51563 -46408 -56395 -60448 -50473 -59314 -53775 -42213 -40719 -50359 -46361 -28105
15609 -28105 -26391 -41126 -36604 -19622 -19165 -15978 -23199 -21915 -30509 -20563 -9599 -21142 -10540
15596 -10540 -2542 -304 -7068 -41712 -23047 -4331 244 4268 -2987 1503 -6635 2523 37432
15583 37432 23632 -19313 -36240 -21441 -621 3195 -2658 -22678 -35894 -18429 -17718 -23263 -43170
15570 -43170 -26831 9975 -9695 -13656 5867 29150 11442 -27916 -35789 -21521 -18637 -8572
15558 -8572 -5031 -27001 -47414 -42479 -28749 -10704 29702 13637 -9784 -1969 -2209 -7105 17894
15545 17894 47412 47952 17724 -18800 -39158 -44345 -36920 -55550 -35749 -28064 -4122 18842 24355
15532 24355 42433 46045 52414 41951 15381 5209 9458 10562 9070 1190 -8784 -6994 -15620
15519 -15620 -28555 -18608 -3270 4344 5477 -13656 -26021 -8952 4769 19184 5200 5948 17971
15506 17971 22934 -2196 4325 24966 43385 40338 18243 3615 -25000 -35583 -44192 -65108
15494 -65108 -61262 -63394 -47009 -19456 -38812 -44645 -26707 -24872 -43375 -46050 -51966 -30783 -27630
15481 -27630 -34840 -29211 -32143 -5260 9448 -4529 -2068 -8831 -15486 -42476 -28727 -34324 -59554
15468 -59554 -35455 -20301 -11143 -6264 -16762 -4324 27002 12986 -16628 -20250 -17800 -13248 -27870
15455 -27870 -36856 -8214 -4240 -13370 -11098 11021 12473 7722 7712 -9691 -8881 3402 3412 10882 27134
15440 27134 6400 -6697 21200 39223 14721 -8322 -3102 -8950 -35840 -45083 -52395 -32635
15428 -32635 -8718 1014 -10841 -7446 -8544 1929 6678 7040 -3662 -25589 -53907 -48300 -22692
15415 -22692 -6042 14209 12676 -7754 -31711 -31205 -29724 -38967 -17029 2145 -4857 -17772 -39073
15402 -39073 -42424 -28936 -14641 -3250 -14341 2184 4370 15806 28193 17612 16626 -5562
15390 -5562 -6358 13263 13790 873 -10000 -24841 -36864 -33476 -16783 -10847 -1287 -13997 -20952
15377 -20952 5717 31030 2924 -18517 -27136 -6360 14465 18578 22034 21290 6439 3663 1782
15364 1782 -7420 15789 21431 9974 11677 19830 11146 4215 -2111 -2210 -30212 -24749 -13101 -15571
15350 -15571 -26191 -19753 16088 12550 15848 10039 8722 36305 15023 2023 -1083 -16907 -19068
15337 -19068 -11592 -3299 -18824 -27761 -17488 -8078 -6014 2388 -2044 -2600 -1658 8933 4538 -5446
15323 -5446 3705 1101 -21730 -26917 11413 31045 30767 25715 39356 37003 41519 37340 37321 15378
15309 15378 -23687 -41269 -45922 -15800 -7632 -5177 21633 31754 5719 7074 10008 9303 2213
15296 2213 30377 40734 39724 42965 39329 21350 -16225 -6772 3049 4480 6595 9720 3574 -15115
15282 -15115 -23400 -32272 -16364 -38692 -46488 -42685 -16861 -8715 -22022 -18530 9483 24837 -12307
15269 -12307 -50960 -53197 -34238 -23028 -17507 9851 16050 3239 -8236 -23488 -28345 -20666 -28635
15256 -28635 -19193 -2827 291 -3207 -5049 -18151 -7284 12196 21081 14544 -988 -8342 3780
15243 3780 17795 18774 13503 3713 -6195 2017 -1261 -33866 -44777 -26391 -10342 -19045 -30536
15230 -30536 -22522 -11474 -28984 -67015 -75713 -60271 -27238 -27667 -33861 -21680 -17590 -441 26260
15217 26260 42565 40925 48288 18921 18161 -3062 -28201 -21755 -21736 -18194 -16952 -17508 -29433 -24857
15203 -24857 -8510 -10525 -12069 2737 10909 -9472 1765 -23497 -7992 -126 11368 5558 -19546
15190 -19546 -34400 -3805 8460 -4980 -23391 -38115 -29468 -4372 -21631 -11532 -4590 21457
15178 21457 43452 38002 52173 29360 -7837 -6980 20 8450 17929 22344 5245 -13256 -13022
15165 -13022 -19598 1479 22399 19772 7323 -7678 -13190 -16159 -20568 -28706 -21809 -8813 9813
15152 9813 10098 -6073 -17110 -22151 -30626 -45095 -30556 -22099 -34577 -55703 -64860 -48556 -45913
15139 -45913 -59911 -61770 -42373 -31418 -44013 -39744 -31406 -24123 -15402 -18932 -29712 -8321 2837
15126 2837 -5665 -925 -3176 -13757 -10191 -7944 -31771 -35583 -6358 -12034 -13541 23462 53022
15113 53022 32133 7694 4972 5444 -58 -21581 -23811 -12788 1663 15101 23966 14218 14505
15100 14505 11883 9716 3821 -11316 -15561 3566 -13212 -15238 -28095 -48589 -50068 -24998 -25880
15087 -25880 -34670 -30640 -25873 -17880 24757 24855 16412 20032 32552 24539 19517 -6422 -20060 -12905
15073 -12905 -11096 18110 16519 8608 10274 17041 -5001 -27714 -16141 7383 19862 29673 21926
15060 21926 24618 4230 2707 -1429 -19228 -5647 20072 53556 38942 20408 3786 11859
15048 11859 -1207 -16048 -21919 -9691 -1176 3185 20020 28131 29703 22380 19016 17476 24440
15035 24440 3825 -13924 -6362 -12329 15234 54558 57842 -2247 -17374 -27560 -30511 -14241
15023 -14241 6985 10975 4330 -3410 -30482 -25265 -3357 8428 11456 -6171 11987 36391 24378
15010 24378 5220 16569 22211 42558 56072 36195 28865 -4446 -2021 8477 3101 -2065 -17885
14997 -17885 2999 5784 5953 -31858 -67926 -54951 -36038 -13154 1623 10791 -93 -12534
14985 -12534 3082 27636 18677 5440 -15269 -15069 -10769 9661 2963 -7179 -32654 -54169 -54822
14972 -54822 -15987 8038 20856 23389 13114 -18424 -25684 -23678 3815 8073 -3744 -17925
14960 -17925 -25181 -29960 1775 22634 34366 32479 16515 12729 19815 16969 1499 -13752 -17842
14947 -17842 -13669 4731 13944 -10683 -5489 3387 6251 8637 27546 29627 5529 -18240 2712
14934 2712 38997 22467 -19046 -40265 -27329 -13730 -3302 -13241 -20611 -19757 -3205 -11247 -5080
14921 -5080 -11761 -29902 -22796 -13676 -15216 -11126 -4305 -2786 -8122 1040 -1407 425 18869 -9188
14907 -9188 -1569 -13057 -12588 -632 -10141 -25470 -17925 1372 22355 16095 23025 18019 -2071
14894 -2071 -18143 -44081 -34093 -9320 10845 -716 -39721 -54640 -52224 -28115 -7163 2003
14882 2003 9578 27677 27351 22896 -577 -14816 -21353 -4395 25691 8054 7496 13317 -3667
14869 -3667 -10257 8106 26431 35219 16602 39807 29634 9982 19446 11802 29857 29609 20573
14856 20573 480 -38495 -47241 -32957 -5546 9622 32 3802 11771 16922 20346 4487 -7660
14843 -7660 -24307 5843 25634 1541 -32525 -36703 -22234 -32789 -9884 -4641 619 10115 11348
14830 11348 -11068 -12198 11401 28240 35055 51387 39075 14219 15842 -21534 5826 16433
14818 16433 36888 24662 13019 17327 15545 16430 487 -3547 3290 13428 12313 15384 22472
14805 22472 4451 1005 16238 18098 19332 -439 -10981 6504 21376 40119 37358 14763
14793 14763 618 3667 9067 9296 6246 -7282 444 -4129 -10203 -12575 -35265 -18649 4586
14780 4586 -14633 -7264 17217 4828 5824 -49 401 8083 4709 24157 5425 -3226 -6354 12117
14766 12117 18154 29288 41419 48727 41646 21789 32634 52742 72202 62098 32725 17720
14754 17720 24457 10699 -19403 -35128 -11922 -7175 -1491 6505 -6036 3283 2075 -15390 -20090
14741 -20090 -20119 100 -2085 -12004 -11632 -1715 -10517 -18743 -13707 17246 50681 46971 9114 380
14727 380 8079 17861 14494 11899 13445 7325 2826 -13977 15527 29916 28064 -8467 13354 20393
14713 20393 21208 9228 2659 6107 27267 33180 -7615 -40172 -58839 -59936 -30701 -7660 -731
14700 -731 15607 16642 -1954 3240 -4764 -19975 -14635 -11781 10479 2975 12424 23655 20713 31854
14686 31854 48986 71180 69087 43545 2796 -12101 21722 51593 65364 46756 40808 32295
14674 32295 2417 -630 31970 32739 34703 57365 68700 75330 55811 42699 18936 -11249 -39555
14661 -39555 -17977 -2838 -2620 47884 43881 20892 2848 -6568 2188 19149 44183 37378 23761
14648 23761 15546 18482 5180 -7571 -8834 -21337 -18278 -779 22115 37409 14879 -24797
14636 -24797 -41478 -49855 -31975 -21440 -3281 19126 11600 21732 21924 25385 25814 45849 41056
14623 41056 37501 18919 -5803 -8607 -27277 -17008 36116 46229 38948 5829 -14491 -27622
14611 -27622 -32728 -16933 -20907 -32804 -10828 4598 25669 12945 -18650 3927 8295 6610
14599 6610 -4553 -14750 -4789 19005 26627 13241 -1145 5035 -4236 -13700 -17211 -12792 -19559
14586 -19559 -36353 -16636 -2702 1206 24849 30605 23742 7252 9437 1878 11313 5555 2051
14573 2051 -10312 -11662 26847 39986 39413 24784 42154 44706 17123 72 -23348 -47682 -26865
14560 -26865 -1822 2019 11270 15727 3789 475 10093 16895 26138 56811 66831 45736 21306
14547 21306 25901 24749 1294 -12812 -4570 -3419 3527 -14662 -30168 7063 50099 53578 59834
14534 59834 44465 15349 25456 50357 30462 -520 -4058 10508 5840 19813 3674 -41365
14522 -41365 -47785 -52033 -51792 -54108 -44756 -44849 -16528 485 5432 4063 -3506 -4207 -32349 -21204
14508 -21204 218 -3948 13504 33248 3918 -6642 -17757 -32215 -27842 -15919 -7417 23402
14496 23402 34475 -6282 -17924 -17989 -3808 22899 32001 25181 21656 46864 49219 21254 4593
14483 4593 13134 19413 4706 -19809 -24914 -36999 -19189 4733 7874 -4363 -2949 15053 7241
14470 7241 -8 6461 -8426 -6549 9391 22662 44166 14639 -11345 -12336 -20370 -14325 3697
14457 3697 25934 34595 6674 -12662 -31698 -25360 -8583 4748 12604 11710 22483 8185 -12209
14444 -12209 -3344 8444 4116 -1398 -9995 -11634 -7901 20249 52270 68495 49795 35668 -1882
14431 -1882 -14776 2905 11112 5863 -631 -4100 -33514 -45070 -33899 -31137 -11483 -4268 -3997
14418 -3997 -19700 -6939 -10134 -32699 -40941 -32215 -19689 -24013 -24655 -33040 -31051 -14628 -21125 -22086
14404 -22086 -8193 -7289 -1258 32218 46443 14027 -10017 -13000 -13482 -24390 -28615 -4777 -4730 7448
14390 7448 14942 19533 11523 6023 17603 29688 28635 22249 11889 -17859 -32995 -42332 -35491
14377 -35491 -12443 -1562 -12032 -20908 -11823 -29308 -27469 18840 32432 22170 17972 14019 11289
14364 11289 5423 9817 19538 33138 32822 12738 -8343 -12330 7779 13879 26657 6836 -10935
14351 -10935 -9529 -5012 7071 21540 9851 -25449 -49508 -40035 -27850 -26881 -21787 17938 35807
14338 35807 33268 28766 17750 22484 23452 31318 33314 51058 49412 38706 32471 51989 45574 31898
14324 31898 36374 59447 76809 49351 23836 28474 33100 7621 6936 -525 -6143 -8925 2896
14311 2896 -3531 -4767 7724 16652 40224 41140 42079 35084 27697 23091 19250 55666 79520 43143
14297 43143 20918 41984 35490 22626 35897 40240 19450 18235 29000 15098 -1912 -25491
14285 -25491 -6768 27384 28488 27306 12629 6588 -16025 -13897 -6155 -16168 -28334 -16498 14501
14272 14501 16821 16418 8574 12869 11753 -49 12864 11957 895 8055 41368 22300 -11863
14259 -11863 -2216 34156 33901 14504 5820 17189 20661 -78 -20220 -22282 -21497 -9702 -14761
14246 -14761 -556 17881 20541 6910 16061 21387 17438 14336 24246 18971 18836 5699 6041 -7949
14232 -7949 2003 46587 33518 6123 8862 -481 -10917 -22623 -6408 -6857 7827 -270 -22128
14219 -22128 -6184 16840 27658 14220 19850 27315 26405 31247 25635 6009 -20737 -14650 -3006
14206 -3006 5146 -1959 -22633 1982 53201 65342 56166 40348 31826 15020 -5627 -14649 21374
14193 21374 26320 21597 33569 54855 42524 44800 51013 33720 11690 17939 37845 46474 35143
14180 35143 26148 3467 -12577 -4348 -6180 -7194 19677 17840 -2968 11253 -13045 -22227 -17147
14167 -17147 -25527 -38451 -47211 -37183 -19833 -37455 -54485 -48565 -16228 -20577 -26925 -21412 -6815
14154 -6815 2649 -30586 -33863 -10136 -4048 -16469 -10482 -4863 -17491 -10537 -5126 -17906 -16631
14141 -16631 -23282 -16467 -16804 11711 22489 47983 34361 36763 35353 34520 18077 11232 -10835
14128 -10835 -808 12723 12627 21394 22961 11220 11726 5854 11061 27202 13514 -1489 -1999 19788
14114 19788 -1486 4012 12648 29922 40857 34552 14764 -7587 -30740 -8865 16201 15601 37790
14101 37790 47110 36173 25793 28054 29434 23026 7469 -8893 -20098 -32392 -41000 -25905 -44340
14088 -44340 -34342 -6782 -23951 -17325 -18323 -26196 -23610 -6418 17458 14473 7298 2281 -11724
14075 -11724 -36126 -17837 4991 -21351 -30103 -13426 -2860 -3231 8498 4626 -7854 -28246
14063 -28246 -14923 2786 7344 23032 32724 21346 25940 12214 -4607 -26102 -18587 -11817 -3363
14050 -3363 -8717 8729 33771 51384 40106 25337 23952 36649 23360 31114 21767 -21409 -38954
14037 -38954 -43981 -78898 -65988 -45529 -27535 9973 8891 -1918 30079 33665 26600 11341
14025 11341 12122 19190 -11530 -4523 25463 33711 41447 45763 47042 36986 10583 -2002 -2331 26812
14011 26812 48082 39140 19093 25462 35684 34026 26430 8010 1535 12353 29679 48928 29071
13998 29071 23696 9706 8370 10829 53806 54597 31722 -4791 -2516 11711 39448 59176 60320
13985 60320 50001 43340 32275 4538 -5481 11065 50547 51815 22156 25780 27313 -2858
13973 -2858 -3351 -1060 -5018 -11149 -5611 1924 -4028 -12010 3512 26945 28429 35234 36742 52106
13959 52106 56490 36822 3311 5874 12843 -6285 8104 26655 50435 33294 42598 44731 54509
13946 54509 45214 51905 37659 21872 46500 61166 34559 8658 1173 19572 26892 39205
13934 39205 65355 76494 83795 66974 34096 33735 36945 53725 56671 58346 54005 37038 2073
13921 2073 -5085 5244 19857 26285 17448 33018 32100 35081 42208 28368 16314 7799 18031
13908 18031 20269 490 7066 12984 13171 13288 21045 26007 12440 11104 49964 49064 42275 59104
13894 59104 63394 31834 5880 -4588 -832 29988 40563 62196 68558 24688 -10751 -6384
13882 -6384 9451 26245 20140 16000 7069 19124 48048 33461 22471 35182 38399 49137 68713
13869 68713 83791 64603 15936 6505 24129 29049 -3258 -4885 10762 17404 50802 50834 44999
13856 44999 16086 5495 31783 22596 15999 -4637 -16531 10180 46616 39936 28703 21621
13844 21621 27979 37741 10848 25540 50635 50511 18298 -7661 -6516 -18316 -23731 11166 28351
13831 28351 1918 -1633 19259 18858 26359 30602 15955 9884 12782 10522 3186 825 3749 -19189
13817 -19189 4516 26753 24203 31641 39776 39870 7599 6776 -1207 30059 33824 11921 28606 33452
13803 33452 38937 52366 32807 12518 29882 41445 9744 -7584 -7712 2987 17922 14176
13791 14176 17958 27724 18452 31615 40063 29168 10946 50983 69814 55460 45719 28736 35811
13778 35811 55966 45074 27647 6667 -3517 8582 -5905 13789 38662 37396 37154 12993
13766 12993 -1661 -2915 19661 48244 51998 45946 35963 24744 -2432 7151 30683 18402 -11420
13753 -11420 -1554 17412 31194 44194 44358 47291 35132 42775 36152 -3774 -14285 -15089 -13645
13740 -13645 -5947 -9951 -21438 -3698 -19629 -1833 -2314 -5430 3619 24186 17536 11276 35784
13727 35784 32905 20646 7714 15679 12793 8229 11444 4416 28346 44856 14962 -18148 -20674
13714 -20674 -13719 -15066 19498 14966 2621 4282 17141 29654 34253 56890 68132 47119 26296
13701 26296 29952 42017 35470 33053 17017 4416 41028 60480 81807 79412 59340 41020
13689 41020 40539 18146 13178 5253 -12695 -6740 11292 43942 62536 49783 37265 41102 48675
13676 48675 57036 54090 41355 19341 -5127 -15726 -30761 -32030 -25740 -18876 -21945 -13267 38225
13663 38225 73415 39983 23779 20055 -2525 -9945 -3558 4019 30712 38919 10597 4590 -21403
13650 -21403 -17208 6885 22981 39154 29565 16208 -6095 29079 63905 41410 27469 48505
13638 48505 50192 41024 39096 23762 5137 -11413 -11845 3968 11240 21168 -10449 -25144 -15793
13625 -15793 4947 22022 38927 49845 38879 32920 40472 55251 52735 58282 60218 32293 126
13612 126 36872 46497 46309 49415 44998 37957 39946 45734 18741 12789 31583 41100 37768 16096
13598 16096 30645 30626 32071 36686 28870 28754 30614 27060 24040 16552 -5313 13858 12517 -8867
13584 -8867 -7567 6235 7357 10739 18639 6607 -27377 -29810 -20181 7819 43030 49451 43961
13571 43961 39733 8988 8796 22680 31626 22454 24257 37802 30523 8185 6266 22089 31376
13558 31376 7165 3647 10745 2436 -11941 21543 33303 49313 39060 26455 55515 62902
13546 62902 57247 62287 40723 40349 42221 19784 56138 79012 87669 85747 81492 83752 73987 37337
13532 37337 32980 24526 -3211 -3476 21414 21739 18149 34935 56313 68660 43482 19106 16204
13519 16204 34757 40839 50658 46824 75009 76681 49994 59224 42435 54331 69507 69804 66106
13506 66106 54616 51910 39097 12211 -670 -21353 -42237 -36484 -24604 15094 33932 73370
13494 73370 85911 72439 46616 48809 28792 41165 41060 27060 30799 43821 47962 35452 34669
13481 34669 22697 25527 29208 18528 8405 14210 44036 41209 17119 23621 64156 86727 79570
13468 79570 75681 77013 60179 39455 30266 55721 52413 32618 11502 21723 48309 75105
13456 75105 85320 81591 66323 58525 53050 44917 60280 92363 81216 49095 14875 45067
13444 45067 47410 17693 13345 9390 4466 -19769 -15408 -5189 -5379 13053 6112 -1641 12691
13431 12691 21319 15818 21554 48598 40865 21266 8012 18223 52619 49625 36256 24458 35805
13418 35805 34432 27551 42074 39679 45151 52177 86722 70401 65693 41467 29762 11722 -5087
13405 -5087 -24474 -11506 30381 57997 24130 -9282 -11437 7487 14445 300 -9390 -23407
13393 -23407 -6909 23301 13947 -1226 2681 8253 27192 35491 60168 67627 58665 64548 56739
13380 56739 36418 51103 44544 33373 15921 14807 34232 48696 51187 46782 54135 68701 82389
13367 82389 80030 76898 58758 31732 17158 48458 45778 42585 51968 54890 60928 47335 56974
13354 56974 67462 54026 44343 44416 66204 52731 54607 52462 19977 1297 -4827 452 -13514
13341 -13514 -5235 19323 42698 54233 55820 21398 15893 40025 72033 77599 96089 77980
13329 77980 54653 44773 45175 24664 3633 -5982 34578 58615 52650 41070 67306 61657 55652
13316 55652 58124 48276 25235 15739 31296 29205 17279 -3559 -9987 -11520 4518 2421 7021
13303 7021 5667 15462 23362 53115 64317 56764 54772 46337 63460 68799 64173 42160 22269
13290 22269 7426 26182 46815 13449 1271 28013 40780 66312 85307 67784 59845 64325
13278 64325 54772 59175 52035 32146 33259 52619 73384 77521 84453 38257 37485 28336 29954 35655
13264 35655 34958 48234 50876 35186 9793 7328 5757 15760 27774 75507 101710 85478 75356
13251 75356 54583 45667 81947 90721 65202 34693 21029 24693 23826 35889 52264 82065 63074
13238 63074 32763 23105 30419 43063 43358 32505 32091 49951 71460 90478 81766 64753 71106
13225 71106 61519 64282 74506 81357 100402 100779 83499 89279 81394 77114 71627 68103 62878 72445
13211 72445 69777 93846 78672 55658 30193 44761 51002 44567 26307 25844 33861 54916 86835
13198 86835 102663 101967 82870 45488 32583 27235 60218 44812 36603 67938 90175 87573 72420
13185 72420 60194 59552 89982 99970 82915 62092 38573 26267 33134 10986 529 19155
13173 19155 51758 53000 42532 46694 64119 67078 63921 46642 41097 52682 45804 45826 21944
13160 21944 9323 12127 17409 37435 51029 43332 41845 41142 72913 90881 85338 101874 99103
13147 99103 78713 71219 55232 51635 29136 35679 41054 34249 31902 31624 54202 66783 52140
13134 52140 34846 47232 44683 36838 41309 25319 26853 58300 65759 75379 71007 51402 22406
13121 22406 31007 65213 66297 62254 79639 96625 110943 121453 101467 92714 103066 93083 61123
13108 61123 52908 55756 46755 38868 49614 69733 46138 60379 79441 62617 63700 82157 88993
13095 88993 72674 57380 41140 40624 53828 45266 41889 54015 77203 81321 90961 98260 131469
13082 131469 114357 89854 92051 103453 96751 65029 45282 78585 104645 107350 112999 150356
13070 150356 173337 165062 176220 183006 210228 203961 226961 262394 318319 406429 541302 733623
13058 733623 994056 1393307 1932471 2304113 2347979 2169981 1715112 1219870 876309 635492
13048 635492 484079 398014 315928 274042 263085 222436 229652 218163 170594 158665 170873
13037 170873 154352 127266 132396 112186 87051 70141 69040 71611 54294 60089 62700 64441 79074
13024 79074 95684 89441 69124 71743 85816 101043 105402 115157 133426 118748 123061 99431 69229
13011 69229 63589 77872 125763 126385 120321 78854 78649 78782 93310 106995 102240 123031 141174
12998 141174 150066 155583 141505 116689 104941 101064 88080 90821 99138 100899 79690 98721 92318
12985 92318 94298 90533 94328 96340 87540 81498 74704 63509 52769 49657 54063 68468 96710
12972 96710 96600 94822 75988 76639 98909 101338 77693 71892 84351 106681 103670 68952 57531
12959 57531 76568 94167 100902 104875 104285 105307 87856 85356 71689 69398 56192 57957 81065
12946 81065 111045 120334 127180 131022 107045 96092 88448 90789 102871 83912 93554 101081 107897
12933 107897 107526 107192 93612 98713 77634 91660 130950 124703 111870 113018 110562 102652 84920
12920 84920 86140 124091 138956 129001 119001 101767 74035 74010 94421 114233 147564 151881 147295
12907 147295 124727 113810 100591 98194 106897 126470 136933 137445 137707 107190 104042 105598 78403
12894 78403 96498 132151 133371 115435 94920 89429 78912 75972 65226 68731 49812 52469 78460
12881 78460 106070 105158 127511 113653 109979 118946 137980 140384 107742 91769 87852 118001 166256
12868 166256 165626 158825 149248 120523 82497 91179 116942 158458 172826 176738 194114 209873 247825
12855 247825 261473 287430 308449 305101 306571 289164 243270 227244 219420 186821 176003 148115
12843 148115 133978 137853 140591 152537 136786 141024 123828 124615 124557 128189 117549 138717 154437
12830 154437 167332 183041 198203 180644 152950 135209 104583 107297 138791 166169 173677 177390
12818 177390 169358 137155 149687 167387 173346 141428 109160 97598 90237 85718 107756 132481
12806 132481 147597 169713 188110 196007 189407 188126 206320 214667 181910 150281 142398 143158 133042
12793 133042 135393 135864 134395 134917 195618 247212 266488 260532 226311 186046 194318 182546 155904
12780 155904 118655 110508 121289 134305 165357 164112 170641 155348 159736 165659 146599 113438
12768 113438 119258 149803 187021 202520 213621 219508 212567 204385 185832 144396 143812 162257 173373
12755 173373 190555 202497 215660 222410 263224 304311 305610 346916 433522 457715 423953 357767
12743 357767 327303 284631 241545 223404 199652 178206 150428 150340 141179 133520 111489 91558
12731 91558 78229 17573 -52249 -94121 -81635 -4607 127464 268903 475754 677260 774847
12720 774847 786855 755571 715415 652888 631187 633909 615071 595207 559091 539971 522791 517350
12708 517350 509743 521819 531956 529887 502677 486884 482696 447556 433817 438915 414209 408169
12696 408169 405040 401015 375596 364001 393519 406551 384216 378746 396596 407989 435637 461688
12684 461688 494254 511945 514151 528288 533543 526567 520060 541726 530821 535053 514917 538823
12672 538823 584409 617879 661665 711196 726013 741368 765119 781671 795989 854119 919111
12661 919111 950474 940390 942894 949845 923497 922156 946006 1009146 1070292 1093411 1122316 1140615
12649 1140615 1168698 1208177 1234423 1188505 1179039 1213154 1289000 1380117 1482939 1552969 1622856
12638 1622856 1702867 1782089 1890043 2018239 2181430 2396213 2615324 2839080 2999439 3123124
12628 3123124 3219617 3325018 3502993 3752746 4024211 4314514 4647438 5038717 5526037 6125466
12618 6125466 6830727 7660876 8593457 9692304 11078710 12896394 15224460 17778769 20433667
12609 20433667 23541326 27268169 32213520 39350985 49769131 65329069 89559685 129575297
12601 129575297 197565636 303542124 413731536 453064872 438124818 382324835 272762933
12594 272762933 176437401 118220773 84640409 64167969 50706406 41272007 34497914
12587 34497914 29648938 26186730 23418002 20922696 18649963 16402931 14410436 12911249
12579 12911249 11766774 10846609 9995024 9165925 8383665 7663633 7018475 6477893 6026805
12570 6026805 5606093 5138090 4677580 4251968 3934353 3673578 3465490 3306285 3198831
12561 3198831 3108562 3013420 2857636 2713699 2588942 2470797 2381954 2286408 2157405 2050699
12551 2050699 1947112 1851003 1748609 1654240 1553096 1489769 1412511 1323993 1256732 1191876 1130452
12540 1130452 1067650 1027099 987546 890979 809264 747129 705686 680301 652559 642647 657348
12529 657348 647451 594927 548699 551261 558672 573733 584367 573108 561702 553188 537821 504383
12517 504383 469170 464039 455419 450138 461050 471134 450072 449233 456874 488667 509525 486776 441970
12504 441970 419954 402619 369824 350010 322668 325193 357558 343465 337031 302491 256989 223365
12492 223365 215310 237447 251067 227433 199345 195062 194725 198344 178469 125535 55852 44144
12480 44144 27014 -15080 -80650 -124872 -181151 -173261 -111120 -617 156566 293656 429007
12469 429007 525484 550503 577674 582908 534031 478517 435809 406588 410858 419571 425315 404690
12457 404690 396124 368934 338286 288828 241895 181888 136681 117187 98774 118071 152211 161897
12445 161897 175575 198994 227072 217677 236370 265448 293378 293290 285054 267745 239766 224862
12433 224862 222300 233423 244324 252537 260939 279588 302924 307174 260970 213154 189649 216811
12421 216811 250673 274377 289744 318714 349286 324247 263321 225562 230136 191658 160356 161516
12409 161516 155262 178369 209496 252128 301076 294202 275697 232567 209243 222764 236533 233062
12397 233062 229978 245851 255936 250353 234587 206501 190493 213314 224487 267329 303422 317364
12385 317364 310700 305701 296928 272470 254281 235488 191114 176302 194576 205793 214661 210616
12373 210616 198653 204489 216875 230014 213413 207405 214879 212984 215337 232359 247747 255801 274917
12360 274917 265874 230754 211874 199419 205052 206593 215040 230927 228630 236867 268958 276073 275412
12347 275412 268445 261515 238798 225112 205739 203506 188467 209146 216482 211187 235221 236996 243254
12334 243254 269327 271166 230784 248005 263277 239164 258389 246988 239349 212799 204810 202880
12322 202880 224431 224421 226322 234443 248403 244001 231499 253764 257081 257095 240620 268945 284480
12309 284480 267779 272438 275737 271217 272361 235245 224700 212609 207319 192640 177244 206794
12297 206794 231945 222973 236850 237569 193882 177987 212063 242705 231878 226824 250197 273907
12285 273907 261508 274783 265972 282150 317478 312858 294591 287381 304613 332736 344350 329284
12273 329284 325159 331415 311602 284706 272057 298729 302525 287764 275083 264745 261815 249314
12261 249314 252851 276570 271048 259563 251894 251400 262323 262565 265224 251636 248409 257536 252741 266353
12247 266353 267737 259592 276138 302698 291270 293149 292062 255975 259893 293327 303818 309171 275537
12234 275537 256400 293126 320419 335631 323807 331614 303672 287412 292203 280835 279604 295428
12222 295428 313254 326711 316532 295640 294104 313628 344522 346929 341398 326717 314136 319922
12210 319922 306472 310251 329046 319153 328498 306842 297976 267328 288193 309970 303358 312240 327009
12197 327009 336619 353538 325728 333686 358117 335565 310992 308566 328205 349067 345999 364463
12185 364463 342437 352050 327083 310706 352097 378964 365889 373123 394271 398269 392048 367925
12173 367925 368596 368704 406782 418313 440383 457823 438528 443812 444207 396580 362501 365175 379643
12160 379643 381073 400107 368347 363963 373229 356785 373924 398319 404632 425789 434677 451863
12148 451863 472470 484924 495474 541096 556488 549007 589507 647935 712432 825702 995425
12137 995425 1269858 1679315 2230783 2643739 2709964 2554681 2171787 1659329 1249549 971394
12127 971394 788740 702042 648315 620791 594083 550302 526608 521031 502962 482682 487300 483880
12115 483880 472058 484101 491233 482106 480267 464742 451608 456091 449437 425739 412321 406861 442860
12102 442860 454201 447395 431915 432392 450548 441075 443681 429964 433822 445756 439446 418005 417844
12089 417844 423264 426279 447457 457408 440536 444244 449112 445129 440042 444192 448639 430737 423559
12076 423559 420635 412702 421366 421836 429684 439374 452021 450602 438523 410727 415875 441105 465548
12063 465548 489064 469493 450375 455241 469190 452800 451207 454809 459543 447892 419918 431887
12051 431887 447633 439791 443173 467389 490897 488217 477262 487296 492075 471796 430404 424377
12039 424377 452392 464246 440346 466241 499109 490103 489397 496089 494469 458206 449023 461660 472115
12026 472115 455890 468375 463237 463943 455888 456837 462473 471835 451615 437407 457052 462341 462786 499892
12012 499892 477660 457465 449878 453315 496216 492631 461851 468553 480687 492750 482789 482249 475611
11999 475611 479559 483061 478086 476552 492266 484410 449376 427197 445059 458125 437579 421993
11987 421993 405877 413784 430018 441898 446454 439679 444326 432961 421741 430613 420645 429230 424649
11974 424649 430853 443625 459591 461615 429635 418964 437430 441820 447085 444062 460858 449361
11962 449361 441613 405449 387559 402466 393317 401781 418985 421730 410838 408544 417275 418192 425826
11949 425826 391893 380430 386993 415616 421569 407375 400530 379502 340265 343484 381335 381460 392251
11936 392251 384520 371945 368477 395685 425010 408747 391499 357773 356433 372459 418281 412811
11924 412811 407538 417224 444780 449952 450469 460967 442346 423553 405828 369258 374370 383643 401863
11911 401863 415413 420893 417492 429593 450320 458366 458221 429536 403335 389817 385493 397972 378751
11898 378751 372776 365696 361559 358145 363535 389493 413394 390529 378982 378699 387441 401998 404887
11885 404887 403501 411184 391859 383384 377819 384659 398500 377879 373737 376653 363945 353777 324801
11872 324801 316389 333476 356605 368940 355181 335419 335909 305141 282688 268808 296089 313210
11860 313210 306734 310702 301660 300549 281476 288574 285153 293065 331641 373654 368887 378328 387040
11847 387040 354238 331217 335651 333406 334024 346844 328668 318783 318762 336176 337324 310342 288089
11834 288089 286062 308447 318609 290430 269912 268130 270934 285898 338996 337695 311810 304098
11822 304098 312593 283364 266100 269908 286308 309092 287197 258219 256293 232555 232957 258985
11810 258985 271639 284056 266983 255691 282330 293338 303084 297409 274529 271051 271057 285452 276803
11797 276803 276709 304519 328315 302450 289190 270682 271188 295250 302768 259930 244876 244417 263335
11784 263335 258701 238518 226909 246628 264717 272711 272234 267881 277854 259102 251256 252336 271385
11771 271385 275951 259033 250017 236251 248176 255490 243655 242137 242850 245745 242580 255854 257682
11758 257682 216599 206523 229970 228354 238123 225908 220505 213098 236031 250704 220839 201919
11746 201919 219963 205695 190275 179307 185871 225823 260263 260267 235249 197897 178239 187530 218392
11733 218392 227336 238185 261022 243844 231152 230011 268969 293020 295227 284992 266240 248477
11721 248477 217693 186058 204693 226021 212067 196362 196962 198242 193421 210282 241628 250636
11709 250636 241598 198444 163139 163144 147629 149767 142847 153546 173693 206173 198088 185738 164128
11696 164128 175883 191336 185617 148641 140520 159156 170847 195390 189007 151401 116640 133644
11684 133644 147548 158979 175603 186854 172003 161389 129590 121701 129083 117264 127471 149659
11672 149659 166172 167758 161884 144320 119905 137710 137820 113918 137068 148268 152204 182765
11660 182765 191530 177712 150070 167954 191273 199944 184952 182311 141741 130590 155433 195506
11648 195506 224222 200013 173501 164210 178870 166974 163016 156252 164958 135948 166300 195575
11636 195575 198007 182240 177100 165201 152316 125159 136207 150640 148713 152021 175796 192401
11624 192401 195751 196207 181173 161899 127323 122521 145508 140123 133043 130549 140169 139103 121783
11611 121783 111526 122762 150475 148164 134944 124240 110659 104732 128819 111900 96648 97555
11599 97555 108267 142442 119425 89313 75323 77247 86607 85554 61177 46240 55003 78966
11587 78966 87064 87699 129556 147018 123517 105045 119074 127955 131389 118578 121186 116332 114243
11574 114243 127078 128689 128666 129588 114499 117540 133828 101314 97970 108963 121451 131069 141823
11561 141823 146235 127244 95618 68895 67685 83060 107187 128914 135646 119497 92916 105557
11549 105557 118645 131063 114724 112190 106071 96679 90463 106003 108041 117161 98980 78034 80236
11536 80236 94856 114111 112388 110785 76394 78922 86409 92079 62930 68563 90424 126415 136692
11523 136692 113411 130948 133295 121424 115184 115151 111463 117179 111067 96168 102091 100522 74924
11510 74924 68749 67811 64615 72007 81959 94815 95511 108818 114425 108051 113998 117818 124816 138824
11496 138824 139605 133840 143034 124436 114199 140924 151421 129684 106468 88624 80866 76767 83720
11483 83720 77327 73162 81123 80095 58913 75278 76436 71671 83888 101190 117912 97154 82455
11470 82455 80532 75604 73394 81539 75296 76758 86870 91076 83143 69119 73254 92333 111794
11457 111794 99373 94585 103577 100031 114639 103585 95595 112391 102624 91171 79777 57993
11445 57993 82043 84086 53411 51770 80051 106716 99118 98173 84626 73855 94319 96866 96967
11432 96967 80775 69372 78264 85199 92453 94792 88403 96345 91574 78760 66866 58639 95801
11419 95801 123091 112884 109096 99762 63891 55367 58001 78598 86915 65082 58345 52908 47738
11406 47738 48449 54942 62698 65459 52189 65220 73436 75506 74850 68858 85374 89037 78289 92886
11392 92886 85039 69424 68256 79106 83023 108869 109950 101267 95581 69762 49762 61130 83802
11379 83802 99071 96398 79275 54238 48201 51233 36049 56872 90029 87052 58171 38173
11367 38173 46430 51789 34331 24052 28933 6249 12062 35649 24590 31298 50370 66047 74032
11354 74032 63081 68746 103049 89354 51292 63267 63291 78684 64278 71547 70907 63072 44886
11341 44886 40374 47199 65463 80069 90226 82799 68406 47748 24438 36103 41706 31781 45446
11328 45446 73408 71016 62295 69079 47681 18793 17103 52924 58817 47571 55109 48981 53350
11315 53350 63935 36152 25823 50230 62322 48052 47968 62173 73558 56624 67765 68588 33118
11302 33118 32717 63388 69482 65033 56734 25442 37021 60558 58712 60351 58219 30252 14128
11289 14128 31046 51569 65197 78889 111635 123783 102605 85557 82817 103098 109843 106204
11277 106204 113261 99754 47218 21087 13057 3033 30275 69167 94232 68678 34829 21040
11265 21040 56806 56060 37152 28553 15284 22377 28361 30859 42094 71806 79104 68645 53847
11252 53847 48480 50990 57804 49446 36481 44052 49961 64261 77480 68014 49194 68479 66609
11239 66609 94196 106069 67145 30197 6843 36743 61153 89092 76175 70212 83445 67545
11227 67545 47371 46055 49087 46012 55009 65573 68120 63923 61407 56958 71659 57601 64381
11214 64381 63139 41206 2779 -11095 -18311 -7291 25552 39856 30372 7451 9943 9502 21750
11201 21750 15177 11978 19103 21069 57228 85852 126795 140347 140102 150908 149835 111086 86921
11188 86921 59284 42371 29210 26025 26295 34565 16025 1454 -4674 11485 12245 7168 34718
11175 34718 48863 51278 41485 56558 52526 29371 28656 31072 31427 24194 30276 43965 39751 26642
11161 26642 41373 24184 11578 34277 41741 32458 22652 22137 20646 5334 -8105 -34266 -26545
11148 -26545 23743 51752 54458 30783 54984 81711 37138 21743 38617 43118 44558 63835
11136 63835 68684 63276 43507 17541 -2387 28878 46105 48527 50231 59019 49915 20322 27220
11123 27220 38748 52916 67509 47547 49892 69222 84697 68988 68231 60536 47659 38851 46845
11110 46845 49813 53580 83490 65296 69325 74352 47513 27233 32221 32489 39853 21416 9866
11097 9866 17686 -7622 -3800 30654 31316 29780 44500 71941 81413 42805 5651 21907 12704
11084 12704 19152 14678 11975 7796 34413 34703 25264 45564 59135 43480 13931 15567 23053
11071 23053 31005 34215 25615 50505 70656 46986 38382 25439 -4835 3438 30502 25303 37708
11058 37708 73445 64093 46029 8379 -5322 43997 56570 30148 32908 27265 2916 14263
11046 14263 63511 76261 75438 74213 44570 37058 51241 76694 96643 97009 113077 135982 129278
11033 129278 109233 95347 103629 109193 117452 139584 175918 191563 188072 193037 197530 217304 212774
11020 212774 202046 209818 213058 192790 180965 200366 227470 259136 255133 244911 225669 198814
11008 198814 167746 159944 160335 153896 178867 214449 223729 230176 219709 180756 146992 126248 124609
10995 124609 86051 55080 77800 93652 76666 81035 91330 92788 107634 123123 102046 111018
10983 111018 80226 59028 22057 18687 36451 48785 70201 69827 64211 72157 83662 71859
10971 71859 51877 11719 -703 8099 31577 44983 37482 22365 326 7253 23241 11745
10959 11745 23870 19455 23967 31254 52740 44227 58973 46460 50516 42089 24488 63704 97143
10946 97143 112772 120638 112369 125113 131817 146216 172710 167503 140839 132682 101061 70535 43712
10933 43712 21726 9767 12670 54512 59012 66028 61761 53179 49005 27620 18287 27745 21756
10920 21756 17966 6297 17772 44992 64006 59661 29213 22981 36470 50527 34070 12573
10908 12573 20490 47080 57431 60672 52679 53690 27142 22434 39143 46231 37798 36283 56125
10895 56125 63994 76956 59936 40240 35190 29509 28982 34997 54795 78312 75489 80839 58400
10882 58400 45668 49095 61912 53528 54266 48028 38480 40251 43439 29858 4250 9462 11721 11108
10868 11108 21901 36062 53245 39175 30913 12938 8434 34425 25771 18780 23846 36109 36236
10855 36236 24986 31088 39570 46376 18073 3778 23710 55044 49893 57841 57573 43310 20720
10842 20720 11928 44819 59830 44404 24036 28443 57288 55152 55601 56070 40854 36301 39242
10829 39242 49633 54602 74545 68319 29086 9239 16736 16084 11310 37626 39729 19303 16435
10816 16435 19439 19457 17135 13075 11157 48827 70521 79079 70306 45305 41425 42930 49770 37876
10802 37876 32690 19558 9143 2816 -7899 18641 26188 23343 24990 9868 29092 26935 -4902
10789 -4902 18398 42381 41117 41022 43663 32311 23785 35336 14116 25004 34876 56899 46573
10776 46573 41990 38860 34592 14409 36564 61548 65727 70583 58674 16078 -5542 27340 34956
10763 34956 23204 27478 40854 18168 24388 58495 32322 15902 46244 53348 49607 62935
10751 62935 40200 9870 19834 14971 22838 45128 51786 63734 54773 61332 46281 52054 40413
10738 40413 27951 33595 35376 37704 32248 18868 15239 26702 30663 33416 39313 61602 64411
10725 64411 79220 101342 77984 43641 43419 48326 62321 67619 69312 50169 27025 62627 71352
10712 71352 73922 84207 95287 87934 98323 100327 117673 119509 109195 92125 70369 95446
10700 95446 94076 40861 51403 69941 70569 80748 91113 95613 108615 111935 102927 119490 116953
10687 116953 89194 80489 92127 115927 119621 122876 108112 109796 87896 86457 101860 92793 90548
10674 90548 84818 88233 106390 118258 108816 101960 117201 127601 108354 112418 150106 165288 159385
10661 159385 126366 132469 134063 155606 168013 166110 160193 173733 189506 208993 222318 224589
10649 224589 222443 217597 245221 269868 278892 303094 365714 402179 421264 470487 499159 489071
10637 489071 473596 436357 399867 388067 409815 412928 417804 440416 503096 574235 640857 716598
10625 716598 799284 885207 971942 1055835 1157955 1274255 1371234 1488707 1649371 1867812
10615 1867812 2143585 2503456 3035130 3722301 4656828 5891583 7507376 9458783 11543658
10606 11543658 13241694 14283490 14576491 14274313 13756375 13480994 13765940 14793273 16748495
10597 16748495 19751234 23652200 27673249 30604633 31766179 31082445 29015041 26538829
10589 26538829 24699443 24084979 24867044 27198401 31110788 36124728 40913921 43763383
10581 43763383 43796048 41174490 36680359 31761761 27811189 25347116 24416741 24956730 26743672
10572 26743672 29248527 31502897 32329571 31243248 28448242 24563193 20612413 17477835
10564 17477835 15451013 14383979 14093120 14377862 14899358 15261676 15025177 13999149 12342301
10555 12342301 10302469 8268500 6561109 5232659 4235156 3533759 3021707 2618617 2302289
10546 2302289 2054979 1871060 1708038 1569857 1420795 1278344 1156267 1053696 1001037 940262
10536 940262 879652 828675 768785 732826 690704 646490 615104 563379 521011 482499 458062
10525 458062 421124 389338 370297 352760 340267 331990 325122 326616 297792 272721 233922 195386
10513 195386 184843 198798 195781 190794 183197 191877 177174 172510 176989 177028 147655 137649 131825
10500 131825 131054 137722 122314 102098 134847 153300 142438 126164 106000 91487 80183 73899
10488 73899 85368 79497 61182 55592 75802 60619 37215 40315 51004 49483 45302 12724 6471
10475 6471 24737 29957 26574 22364 29681 27370 24647 58614 53027 55920 68633 64643 59918 66722
10461 66722 69250 40300 37151 55640 36895 13361 13711 54544 68049 43426 69915 54868
10449 54868 62186 54664 42202 41512 37326 48611 56391 57029 30815 26472 26056 64603 55673 36980
10435 36980 45839 63577 60763 36282 40465 54960 79081 105533 106924 92287 90040 103261 90855
10422 90855 78412 53357 54957 83274 91585 112812 93186 55105 69331 76123 61048 56388
10410 56388 64188 71515 81617 79218 70265 66578 65326 62954 50742 24973 33959 27862 47402
10397 47402 63990 51594 29811 10602 18434 35704 36003 6587 -796 479 8661 12247 15058
10384 15058 28147 54014 50434 39809 21751 1174 13822 26394 67846 57906 40765 52819
10372 52819 57870 106918 113191 74008 76930 67152 43120 23722 -10916 -24183 -18003 -9680 -915
10359 -915 -6761 8238 55125 67103 58268 59554 41973 36793 24923 22979 30488 34303 37416 35690
10345 35690 29156 16155 -12493 -20696 -14514 -19005 -4022 10704 21053 11106 -6344 25111 33511
10332 33511 18004 32849 53779 36655 26327 17106 -6471 -4679 31140 29795 25941 62580
10320 62580 79427 64615 31849 34348 21909 9161 27783 29624 1885 16005 20676 35240
10308 35240 48767 33256 33493 45392 40281 45720 52577 20784 6460 5839 -9912 -13111 17866
10295 17866 21945 5309 382 22780 48233 65851 54106 54832 45331 22252 25993 5835 -10964
10282 -10964 11733 5229 -21076 9993 69839 48748 15498 22011 42263 47796 19794 25716
10270 25716 14604 18536 47436 51876 42532 48332 76941 150959 189165 226354 288742 373270
10258 373270 422473 462169 532641 574686 550722 501919 467070 424784 350009 288349 224415
10247 224415 166001 129018 98542 68305 40813 63920 88713 89855 76212 69395 82763 63390
10235 63390 44694 23553 -6810 20175 8171 -22511 -14956 30263 47851 64833 52068 30153
10223 30153 34031 35096 18273 -1923 -7433 5814 20118 27399 19863 11223 23555 13274 -7217
10210 -7217 36233 49831 35202 9601 20487 28930 11853 13418 -6386 18439 34395 49827
10198 49827 29132 13256 1273 11657 29794 -13584 -18774 -31060 -33165 -6247 2819 4479
10186 4479 2508 -9622 -13358 23807 30889 43411 70191 55385 44729 31446 29757 24355 16346
10173 16346 46587 67020 91402 121354 130140 137945 127450 91072 90282 114673 110648 107183 115844
10160 115844 146344 159051 155074 181498 197388 194716 178566 189281 188961 186422 189485 177521 179911
10147 179911 207666 240304 239975 240055 217844 194456 154637 157838 154079 130073 159262 186215 183016
10134 183016 188410 166139 138527 135430 111656 81721 84636 91571 79146 65205 43174 49983
10122 49983 72597 62577 47985 53751 94557 73492 44859 23908 25873 13680 -805 -21318
10110 -21318 -27315 -16901 10164 33992 37174 31855 25704 -3467 -39973 -47603 -25324 -25565 -21232
10097 -21232 -8635 34021 31298 15109 18732 28089 27661 39525 17063 30848 35447 17450 12312
10084 12312 3558 11050 11881 18006 13018 9834 29620 44266 44382 24919 44281 37391 20858 20561
10070 20561 11804 -3673 -12733 24150 34669 17535 -13106 3139 19515 19892 2601 -27705
10058 -27705 -23551 -10043 -8591 5951 3198 7052 -6529 -19609 -41249 -28782 -24083 -34750 -6317
10045 -6317 9759 -312 11658 10787 8553 6045 25712 27677 22302 25993 23695 17808 13201 3072
10031 3072 10709 19590 11591 -11905 -15355 -2543 -3258 -18394 -15256 -1865 7736 17566 16628 18686
10017 18686 48229 52225 24951 12355 14686 3564 -30409 -37783 -26667 -28741 -36714 -34093 -16011
10004 -16011 19430 27808 22449 23313 10059 -1549 -2883 -21645 -34382 -45970 -61353 -36553 6110
9991 6110 15544 28059 24349 26050 20892 2762 -2028 -13958 -6934 19572 18705 -14448 -24416 -13589
9977 -13589 3498 22027 24369 12519 747 4557 22450 10604 -1880 -9126 -9724 17843 26962
9964 26962 10099 16781 24096 40247 49283 39444 25734 6231 -7508 5973 14640 -1185 3307
9951 3307 -6669 5718 20788 15838 28074 38979 35327 52047 45880 52443 59698 44729 38932
9938 38932 52049 64358 37730 24251 8565 20850 25017 42036 62804 50978 16327 19763
9926 19763 45364 39753 42690 76885 121320 220506 315868 315634 295109 247779 138780 88987
9914 88987 46985 37555 32381 22009 24651 22946 13458 21042 22893 -4012 -13366 -15216 -8291 2503
9900 2503 10091 -11216 -10250 -16717 -5962 7204 -4244 -18749 -10126 11323 -8611 -22549 -7803
9887 -7803 14270 3187 -13705 -16006 -1742 -3807 -11602 -21829 -8596 2470 4102 2957 24942
9874 24942 38090 36425 36253 30586 4577 -12656 -21517 -18490 -6994 -16180 -10550 5392 14532 20198
9860 20198 3291 -6972 -10796 -1074 12030 34735 65446 57548 14664 -11906 -8983 -1604 -874
9847 -874 2981 -4867 -2836 -26841 -43415 -25880 -4650 14394 1433 7833 26345 11032 -3507
9834 -3507 -10486 -29671 -17787 -9574 -8067 -8544 -4103 20915 22265 2184 11843 9238 -2291 -18766
9820 -18766 11697 35759 57661 41978 31575 12460 -38144 -73292 -59533 -27341 -10981 -12163
9808 -12163 3059 8708 -13964 3179 -13864 -21952 -20912 -25966 -16377 -29415 -22559 -13162 -132
9795 -132 26752 14019 -962 2492 11603 17539 1031 5 -10382 -23310 -24110 -18395 -15442 -31446
9781 -31446 -23341 -4751 34734 25108 2830 1149 30477 42499 31526 13664 26214 12562
9769 12562 11911 9418 11809 6515 3691 11952 8636 13326 19641 44574 53569 43942 29396 5022
9755 5022 -914 10232 29310 51473 30966 2157 -8332 7680 7213 14100 7302 -925 9553
9742 9553 -1335 -12305 -24496 -13213 5729 10982 11739 -7613 -22 12504 11598 43117 34790
9729 34790 16268 3509 588 5421 6474 -32430 -31947 -27499 -18326 -13851 -5957 -1488 8307 16358
9715 16358 20323 12035 -4717 -9570 -7756 -12322 2466 6685 14163 22678 19238 -12394 -43874 -58216
9701 -58216 -14047 15806 25633 57653 39828 20748 30025 3133 -19226 -7002 -15026 -36241
9689 -36241 -34668 -15053 17613 19437 18991 27937 20412 19992 3937 7791 5182 -7974 -33951 -54333
9675 -54333 -42232 -34980 -22959 -10433 -19437 -26440 6048 20742 5588 -27237 786 25256
9663 25256 30444 22788 36751 24367 176 -309 30716 42999 38291 52756 53299 28692 21630
9650 21630 12269 -9447 -16180 -2390 -12440 3781 8260 9826 37964 34188 47305 37060 32229
9637 32229 24047 21962 41941 53033 32319 21136 -725 -12691 6901 6097 6559 -2956 12128
9624 12128 10813 -19964 -11992 -24442 -9975 -543 499 -8403 1328 36844 31940 22120 9063
9611 9063 -17982 18430 31390 42040 4498 -10209 -19649 -10549 -5909 -21009 -18497 5855 -17716
9598 -17716 -59973 -46279 -61224 -71833 -35378 12027 2973 -20861 -34357 -20356 -7263 -21327
9586 -21327 -4735 19093 29959 10497 7507 7814 -27705 -42406 -28102 -18115 -7939 -2964 6451
9573 6451 16678 14009 1466 -23721 -21877 -17116 -17391 -16181 -23956 -31039 -35213 -38427 -40458 -48390
9559 -48390 -27833 -20605 -38576 -65858 -73505 -38796 -5792 -557 3271 -2559 12264 24704 25637
9546 25637 16869 23315 2484 13542 -4361 -20826 -6343 12106 19682 11872 14574 33404 7688
9533 7688 -1474 725 -5998 -169 -5449 -17171 -13720 -29285 -48126 -26786 -7025 -766 8234 13088
9519 13088 5810 23421 40280 4693 -21985 -52995 -41548 -18231 5328 23322 18004 -875
9507 -875 -2643 -390 6690 7306 588 -25087 -28999 2294 13253 19758 16449 7774 -5346 -1017
9493 -1017 39985 53837 49377 34577 11203 -3498 -28256 -10063 30242 49351 62276 37719
9481 37719 -29980 -48398 -55852 -22340 22199 4595 -37217 -9447 -9450 -25157 -20392 -18793 -29396
9468 -29396 -11951 6533 24407 41562 28544 30738 27157 24673 35344 21646 3100 369 -19325
9455 -19325 -32029 -25544 -28177 -8347 -10591 -13724 -8548 -6519 5655 -1251 -22226 -25492 -22305 -21564
9441 -21564 -7039 4054 4153 13546 -3629 5309 -20648 -9167 462 19851 39103 9618 -4000
9428 -4000 3632 16208 7297 5790 8200 -1214 8489 17651 -10867 -13734 -17763 -8487 320 3007
9414 3007 -5097 -3323 25192 24227 6856 -27203 -35199 -27116 -26348 -15360 -3939 -2478 -2749 -1697
9400 -1697 -17488 -7706 1358 -23099 -24486 -24355 -24118 -16065 3706 22158 16266 17058 5356 2945
9386 2945 -19918 -12036 3427 29439 20352 631 -18041 4741 -510 32972 37067 44702 55912
9373 55912 65077 52086 37596 19780 9415 10441 43161 45844 11810 3679 31144 16281 1942
9360 1942 689 -8196 -12486 -31578 -53266 -49916 -39243 -10255 -1256 3782 12648 19342 26900 33303
9346 33303 34647 18386 6318 22846 29597 20336 -116 9275 20032 28753 18017 35940 40897
9333 40897 26636 51100 34008 -2111 -20668 -28197 -23400 -1961 2675 -27451 -23899 11873 17086
9320 17086 27096 5219 -5364 -27708 -10062 -21245 -21031 -1976 -10443 -20132 -5199 11019 -4479
9307 -4479 -23099 -16810 -5492 16070 5104 14580 1517 -4389 4903 9530 21815 15780 -19234
9294 -19234 -26056 -17577 -16624 -12009 9354 19979 36649 32798 22325 22966 13452 -8052 -26929 -11881
9280 -11881 -29160 -39228 -40666 -38898 -19711 -12217 -12900 -16569 -6493 -8670 5268 25011 19102
9267 19102 -13015 -16212 -4766 -7696 2048 1110 -30998 -16618 13889 12767 14372 3942 -7057
9254 -7057 -12911 -5658 29092 22891 7724 9638 -731 11174 38470 13195 -20662 -25456 -16084
9241 -16084 -14854 -36622 -32435 -24012 -22241 -7960 9860 -10079 -39675 -38302 -16929 4039 -2478
9228 -2478 -39061 -42951 -31915 -31935 -12092 -3460 -10912 -28547 -30759 -42996 -39639 -43727 -51752 -34525
9214 -34525 -35376 -49121 -45457 -47598 -84987 -59475 -24047 -30249 -47550 -30003 -40988 -49672 -33794
9201 -33794 -15842 -709 19020 4503 -13054 -44712 -48673 -48764 -37350 -36335 -52553 -40364 -21850
9188 -21850 -30433 -31462 -25250 -25069 -17841 -3890 2518 5861 11106 4259 9715 -4409 -11023 -696
9174 -696 -5104 -1466 -10460 2825 25506 7998 1741 -1448 -15541 -316 -21863 -10612 14392
9161 14392 24289 7166 16385 13877 -21365 -17707 -11620 5232 36439 44662 52855 23713 1782
9148 1782 -12171 9967 19270 27417 14981 -32054 -39753 -13474 -23210 -24805 -26041 -17740 -8666 -23812
9134 -23812 -11878 -15587 -19639 -16179 -8324 -2092 718 19408 996 -3406 -7412 14644 31747
9121 31747 19057 -11493 -4487 -18556 -40322 -11870 -13830 -16772 10121 27152 11967 -14008
9109 -14008 -18231 -17945 -14812 -3234 24780 20110 -19054 -56529 -26616 -28582 -44108 -34679 -9125
9096 -9125 25878 19430 25381 18118 -12913 -40943 -39487 -12503 16324 13256 8929 1864 14478
9083 14478 21669 14944 27095 30275 30780 48330 53555 45108 48632 43971 35350 25395 12380 49188
9069 49188 42664 19166 -2742 -9088 -6198 -23158 -39241 -16083 -3120 8305 27448 13455
9057 13455 12576 3864 10842 14148 18036 -8722 -14181 -28838 -45955 -23303 -11325 5760 11015
9044 11015 -5304 535 21930 8093 -25740 -15435 16152 23697 13072 -15383 -21495 -35665
9032 -35665 -34062 -41096 -30857 -22092 14035 23190 23470 18292 21473 13383 -10557 -30518 -15017 -8877
9018 -8877 -4739 -3580 -37919 -18025 10863 17130 17752 -4339 -6145 -28925 -31771 -30535 -17666 10173
9004 10173 7225 -4721 -5828 -6785 22355 4888 -4138 -10096 -22384 -12783 -1438 7448 21830
8991 21830 16950 12680 11605 13172 4914 2333 2826 12100 9671 11904 6927 -11009 -23067 -53844
8977 -53844 -64762 -38505 -16631 -5152 -6221 18112 14333 -8632 -13667 1582 11823 23421
8965 23421 41196 27020 7068 15207 4598 20131 23286 31907 42103 28152 63696 50412
8953 50412 26005 -1203 -2165 5983 4259 7497 12259 6708 12174 14918 28609 24114 -5604 -9379
8939 -9379 -615 -5244 -6909 -7594 -11481 -10442 -12080 -4375 18953 46864 36273 28078 26616 16398
8925 16398 13468 -3919 -20440 -9419 -14954 -25073 -37424 -55273 -10337 27682 35090 24047
8913 24047 11653 -14720 -15800 -10936 -20297 -10046 -14732 -30598 -27959 4506 35595 44708 18398
8900 18398 -14095 -28349 -26349 -46651 -35633 -930 31541 45132 13907 -6280 2484 -8166
8888 -8166 -29768 -55521 -16503 13824 -2413 17417 20106 13182 -5101 -1457 4317 -2718 -11269
8875 -11269 -21310 -17389 -26200 -18783 5249 9465 27130 667 -42075 -36662 -35132 -39546 -38723 -31131
8861 -31131 -27005 -28942 -25502 -24732 -20231 -19294 -27874 -26977 -27965 -55979 -54304 -33444 -42733 -19628 -28426
8846 -28426 -61901 -71131 -12663 -5923 -45819 -47770 -49976 -49861 -58407 -19525 -17827 -29280 -28523 -3298
8832 -3298 9147 -12874 -19038 -29735 -18508 -1768 -6434 15088 42346 60790 58351 32308 -12393
8819 -12393 -29430 -23767 -18223 -15388 -46460 -64961 -59704 -35393 -23316 -21306 -28223 -26347 -32979
8806 -32979 -6439 6248 -23227 -31859 -55631 -49007 -29983 -26395 -48674 -23045 -3001 8692
8794 8692 16878 -1126 -24349 2916 -2000 -36717 -20411 8148 11034 35571 38642 3800 -22454
8781 -22454 -559 -2718 -1529 -10504 -17028 8969 13442 710 -3024 -3839 -18932 -15127 -19676 -2776
8767 -2776 29049 24126 32972 26274 35780 12229 3606 36582 65833 53316 -7509 -26144 -28601
8754 -28601 -31288 -15304 2287 -3539 5035 -12125 -22964 -27259 -28230 -17479 -14486 -18180 -4642
8741 -4642 16902 34406 15642 -23970 -34679 -21882 -787 -12150 -13424 19431 10101 -3875
8729 -3875 -5787 -20949 -13084 -13742 -14858 -39613 -16709 16843 222 -26247 -30428 -10871 39424
8716 39424 48099 55247 47727 14299 4694 14849 13803 -1682 -12390 -10273 14179 24143 26758
8703 26758 38657 40512 29296 6169 5709 -23156 -39972 -19236 -16573 -19716 -7451 522 12754
8690 12754 24732 993 -2637 2948 5474 11983 35862 22482 8676 607 -13649 -3275 -8324
8677 -8324 1134 16428 14014 19964 24906 16548 10787 -2905 -9026 -5974 -4819 -3036 2075 1874 -3928
8662 -3928 -5772 5241 2672 -6300 -6249 -10261 -41093 -29071 -32364 -41105 -47456 -21450 -19338 -45802
8648 -45802 -42955 -43052 -35346 -19387 -1245 4155 -3411 10032 -5864 3976 17493 14848 18666 13050
8634 13050 -5187 -16743 8017 12326 26810 22071 -6854 -10544 236 6834 -13348 -14394 -9420
8621 -9420 -8225 -7447 12262 34975 25863 10483 -201 10876 23393 13878 192 19153 10089
8608 10089 4498 -18954 -36528 -28565 -27769 -19448 -10621 7247 13689 2904 -16357 -21610 -10734
8595 -10734 -1092 23943 29207 19567 16601 12308 15309 35276 51093 13222 -8884 8964 36438
8582 36438 47466 65036 52213 39883 20846 22491 31023 14765 11380 49618 57912 17821 -6392
8569 -6392 19658 11778 2556 25774 47786 49537 40195 35835 37366 22107 3099 -17051 -47834
8556 -47834 -47341 -54039 -36604 -32432 -18881 -1265 599 -12513 -17412 -4213 25328 30026 14047
8543 14047 8369 -391 -22273 -9941 3112 19558 19383 -11238 -9842 -13351 -15977 -4948 7865
8530 7865 -6767 -14229 -91 6363 10947 26537 14747 -14618 -11375 17978 45591 25443 50278
8517 50278 52646 35937 3039 -9948 -6542 -27183 -14049 13585 43029 28634 23071 7214
8505 7214 7478 5909 -10892 -26108 -31077 -37484 -50160 -20520 -582 3062 -8959 -16426 1973
8492 1973 14240 -222 3500 25109 37087 29509 26468 -6985 -14699 10153 157 2420 11912
8479 11912 -2850 5017 2963 4723 15034 55494 72829 61995 32427 -2255 1047 7553 15583
8466 15583 21250 11745 -20202 -51708 -44062 -20644 -12937 9425 15338 13746 -1469 -13453 -6794
8453 -6794 -2660 -22519 -19920 -22728 -12595 -11365 -5839 8981 21551 50745 52423 31628 17345
8440 17345 4335 21964 29670 20151 14798 35300 45629 64049 37453 36233 53339 28712 10501
8427 10501 -5967 -23383 -14707 25185 41217 20912 29257 24884 12864 14286 25362 31999 18275
8414 18275 -1852 -15004 -581 26899 23787 -9626 -23271 -22636 -11543 -6048 4214 29272 18964
8401 18964 26188 22036 17517 -957 -22189 -27192 6105 4945 15860 32454 10991 8573 -17977
8388 -17977 -46074 -19087 18657 36002 14193 -7099 -8675 22695 23172 16686 11518 6522 -13240
8375 -13240 -2568 -4257 -15262 -10430 8103 16688 21402 11061 6475 -3600 2833 35971 20135
8362 20135 6235 -695 -15027 -22444 -13655 -14106 -34905 -35161 -6507 -5609 -3285 -10951 -4361 -4056 -5463
8347 -5463 4234 -6811 -26143 -17701 -19952 -20750 -33027 -25944 -16228 -12865 -25298 -51030 -32566 -8421
8333 -8421 -9830 -37041 -43528 -10217 826 -19073 -55253 -33649 -5836 -10912 -14677 -25647 -21204
8320 -21204 -16819 -18862 -19295 -11884 -9478 27490 58171 56552 38153 34902 36873 40155 52358 45113
8306 45113 32145 29678 14825 3867 -8746 -29240 -46622 -39552 -27825 -22366 -6933 -3674 9535
8293 9535 25555 19535 31730 56597 41171 9405 -9213 -4365 11418 18352 4889 33657 12494
8280 12494 -26541 -11524 6413 10509 -7578 -31710 -25766 -25502 -25110 -6330 3687 -11456 -20667
8267 -20667 3884 19240 26967 16185 26999 43411 54835 40492 35486 -4642 -30256 -24693
8255 -24693 86 888 -3738 19946 32754 41460 31646 24625 19884 2455 31191 17050 15695
8242 15695 20078 18040 5622 22773 30903 17866 17047 9619 -26590 -33287 -26441 -7169 -24297
8229 -24297 -24916 4236 11341 15115 19363 9461 -8652 -344 -13334 -17060 -6508 -1828 -11848 -25761
8215 -25761 -33085 -16022 -22231 -32454 -13504 22860 36026 52236 34201 19469 10343 17010 24318
8202 24318 -2784 1335 17355 44215 32794 3810 -15406 -25988 -19315 -23893 -22924 -8957 -9860
8189 -9860 -43660 -51152 -60915 -65882 -66833 -54931 -43011 -23148 -18284 -40871 -49176 -32158 5092
8176 5092 14877 -621 -6624 -1752 6220 -16798 -38120 -25126 -32571 -5818 16883 7081 -9990
8163 -9990 -6530 7633 27486 39712 24781 27114 28971 38053 44789 37378 5695 -25590 -15458
8150 -15458 10772 24220 -8780 -28958 -48827 -54585 -39857 -10681 -24234 -10157 3271 2004
8138 2004 -483 14616 4636 5891 -901 -18208 -16596 -734 -4699 -3405 -2590 1833 20164 -4165
8124 -4165 -12900 -24417 -27093 -19152 -34130 -42499 -57266 -53952 -59416 -42355 -38516 -23604 -13261
8111 -13261 -20122 -2801 -3908 8761 14878 -792 -6225 5530 37747 30829 4260 -2774 9635
8098 9635 27676 32536 25462 3003 7146 -1903 13962 25283 21124 46975 36446 16041 -3363
8085 -3363 -13800 -10034 11074 14140 -25 -5141 -5937 -13817 5817 31681 2124 -31240 -26819
8072 -26819 -15770 -9356 10953 18700 -17064 -64505 -67638 -53175 -41957 -21862 22870 33153
8060 33153 21299 -532 -10025 -27940 -28195 -15646 -5138 -7957 -21850 9975 22781 -5117 -8598
8047 -8598 3079 7557 -13878 -21956 -36509 -36950 -33723 -28582 -29128 -33589 -22117 -37491 -53254 -51125
8033 -51125 -25942 -19915 -20447 -17276 -30222 -30292 -24621 -1922 -24182 -36551 -13560 -12457 -9609 -1519
8019 -1519 -21794 -15107 7509 -3895 -30089 -23368 -22650 14031 29770 7118 14280 27437 37623
8006 37623 33086 16628 9646 2224 -8971 -6276 -16921 -46252 -36762 -34779 -3572 -6726 -25724
7993 -25724 331 14540 34754 21281 8456 5080 -19084 -18551 -12129 -13645 -17525 11836 4383
7980 4383 -2107 5112 14529 25573 19109 12554 24100 14724 17420 15104 33827 39331 29812 35419
7966 35419 36159 -10263 -32027 -40665 -25948 -9784 3778 33981 13534 15881 45741 67130 48623
7953 48623 34915 31916 35952 24918 -17977 -19396 -7882 -3661 -4016 -3037 3051 10806 8332 -1732
7939 -1732 18067 25703 25164 15734 12225 -14179 -29335 -41443 -10786 14859 -1480 21164 54390
7926 54390 42419 20004 12373 24651 12524 -15266 -24257 -10991 14761 10780 13390 25044 23273
7913 23273 6557 -214 13177 22194 24715 36703 30244 34958 37656 46001 54404 39394 30908 6359
7899 6359 -15928 -37989 -36969 -20086 -22323 -11478 326 20450 45937 45834 20633 -15025 -19898
7886 -19898 -24492 -17509 -18743 -18816 -14979 -9154 3348 10305 8371 22491 29550 44697 21807 -8855
7872 -8855 -19471 -13950 2317 -1467 10820 25032 40331 21579 24655 43197 27459 -7001 -13602
7859 -13602 -27909 7685 -4203 -24618 -11164 18385 36307 32195 44705 27361 8618 -13138
7847 -13138 -6972 -13060 -15713 -16327 -19376 -47548 -42167 -12948 4643 -7260 -4448 -9044 -8137 308
7833 308 15669 -65 -12423 -1582 361 -15477 -27966 -12032 5387 9096 13538 -14234 -18361
7820 -18361 -20393 -37626 -39781 -34081 -20248 -13310 649 8098 -19273 -27480 -29059 -15936 122
7807 122 -9807 12167 22653 5278 -20055 -22037 -26322 -34858 -23835 -33655 -44733 -29458 3668
7794 3668 32430 27310 36903 46482 6766 -10960 -6642 1139 5602 -8963 -13318 29127 33313 9703
7780 9703 -4672 -9103 5806 22106 13185 4833 -9418 -3200 14307 3637 -5112 8286 -8337
7767 -8337 9420 30868 1633 -14951 -9581 29778 26024 13734 22380 31408 34440 16635 26469
7754 26469 52884 46321 23814 -6269 -3333 23268 45861 33241 9857 -8606 15070 33732
7742 33732 55613 33280 7685 3875 -12405 -26543 -29533 -42378 -39832 -1269 19415 19382 32745
7729 32745 39297 21072 -811 -13943 -25126 -14587 -3985 2829 1995 8449 4778 -20487 -26835
7716 -26835 -41437 -38514 -25949 -22797 -36851 -25409 -9528 -5284 -30089 -23986 -20144 -14523 3233
7703 3233 -6735 5834 37013 24304 12753 -8860 -18876 -12512 5539 27225 10853 14615 34612
7690 34612 21179 5923 9996 4378 -7258 6664 17166 3216 -19684 -28240 -17304 -6186
7678 -6186 -14103 -38475 -64853 -72599 -34129 -9650 -20408 -14283 -7171 -1334 13754 19719 -3729
7665 -3729 -20532 -41208 -42553 -44507 -45953 -53899 -26565 -2047 13245 -9898 -1894 13776 -6344
7652 -6344 -21769 -18255 -28025 -2392 9350 3836 8943 11016 7584 7318 3600 3556 12501 5107 4695
7637 4695 -2146 -12437 -1038 -16456 -6400 -11779 -29328 -35557 -26274 -22934 -14283 -26749 -18575
7624 -18575 -15711 -18374 -32520 -21616 -8993 4529 14516 11826 19805 21496 -3305 -3205 8150
7611 8150 -6011 -21219 -24517 -23886 -30851 -36371 -7063 -25772 -15323 27290 40649 39318 26136
7598 26136 11532 -14895 -31423 -30639 -13192 -3352 -9675 -47645 -47627 -21561 -9397 -16201 -5265
7585 -5265 1064 -15375 -435 31201 25722 -2538 -12019 -16478 11730 24260 14570 19035 13448
7572 13448 -6621 -28596 -23187 -9139 -15726 -25870 -13962 -25890 -56071 -62270 -17802 6662
7560 6662 27625 37665 19440 -8401 -13054 -4391 12420 32283 25764 -15784 -40356 -44508 -26044
7547 -26044 -40595 -33687 9771 16893 25045 34479 34775 49644 34432 21961 8457 7398 9200
7534 9200 -1369 -7897 -21322 -33727 -39443 -27881 -10212 14991 5020 -31159 -28975 -17989 -34293
7521 -34293 -37298 -36903 -49227 -48592 -34088 -33293 -25447 -15107 -14017 -45745 -45691 -47196 -40420 -7064 -2965
7506 -2965 -17387 -15051 13 11295 12281 784 -8975 -17627 -19019 -28233 -34267 -15911 -10819 -17810
7492 -17810 -27715 1750 5282 -17513 -12431 -29696 -53340 -47872 -5440 -4086 -10272 -28584 -26147
7479 -26147 -13805 -11106 -51461 -43239 -7777 2003 -1964 -18628 8290 28521 16487 -6729 6496
7466 6496 13244 19558 56656 75105 52315 11527 1278 -20473 -36663 -31407 -45696 -48518 -51444
7453 -51444 -37480 -45626 -55342 -56963 -41658 -13287 19164 65646 57496 28847 9057 -3333 -1819
7440 -1819 21553 8648 10592 26944 36594 15540 663 -3577 -7233 -25906 -50841 -52319 -45481
7427 -45481 -18820 13723 12305 22313 18148 18998 -1521 -10742 -12076 -12140 -14168 4119 -8486 -24038
7413 -24038 -14453 729 19234 27235 17941 15201 7522 18551 6816 22235 20751 112 -25058
7400 -25058 -16651 -28200 -24879 -37458 -35370 -23278 -33018 -16022 -8205 -11534 -30371 -26000 -5157
7387 -5157 -6233 -28883 -40887 -29244 -32892 -28434 -24164 -5092 15288 4423 1333 -8325 -6394
7374 -6394 -4976 -26463 -30804 -17787 -18604 -6937 -14370 -14565 -39637 -22339 -7475 -22625 -16327 21749
7360 21749 -10131 -32330 -48026 -50504 -46029 -27874 -24597 -29688 -19797 17966 20471 13285 -14007
7347 -14007 -33787 -14805 20052 7565 -26706 -44875 -56579 -49821 -57082 -61475 -57879 -48312 -44310
7334 -44310 -33880 -28752 14590 30877 7191 -23934 -41072 -10884 -2898 -11821 -5463 12185 2689
7321 2689 1118 -123 -17655 -12990 -10235 -12814 -5958 -5262 -21947 -29378 2280 -6292 -31763 -34584
7307 -34584 -46643 -58567 -29693 -16395 -8099 8433 25518 36090 27724 19541 11158 7456 1845
7294 1845 -10780 -6344 21077 22244 8491 -11635 -33236 -32953 -20480 -12473 -15024 -19669 -12082 10299
7280 10299 9316 3623 20272 13548 -5422 -7760 -16984 -16515 -13493 -25090 -16145 26489 19051 2764
7266 2764 -502 -6254 -23531 -20488 -39658 -45429 -37203 -26935 -42115 -30779 -15204 -15562 -16755 -21543
7252 -21543 -52359 -48177 -42784 -18094 -10511 -20247 -37191 -11859 -1710 -25693 -2350 25469 22646
7239 22646 -6718 -29778 -13848 -9494 -14624 -24740 -33509 -11394 -4916 -20568 -15604 3377 -24830
7226 -24830 -36372 -21153 7376 49791 28869 -13272 5676 -7364 -11056 13407 26026 3005
7214 3005 -656 -621 12258 7395 -10820 -5168 11830 -2958 -41534 -60457 -48896 -52594 -36166
7201 -36166 -964 11190 25612 21878 12146 1007 -3143 5447 9327 4639 -24102 -34939 -16663
7188 -16663 -21428 -33740 -27732 -36600 -29566 -42183 -48059 -37094 -21985 -32673 -47874 -21782 9882
7175 9882 -14182 -30017 -37411 -40319 -43437 -49411 -44332 -44332 -82687 -75132 -50783 -30585 701 9343
7161 9343 6851 24475 19478 15316 -3358 -5129 18764 22136 -1304 -18738 -28208 -32337 -26503 -34874
7147 -34874 -31173 -24705 612 13754 25711 34657 9021 -13438 -8297 2164 18393 30536 35178
7134 35178 22082 -2428 -1894 9057 -12696 -12224 -16144 -24565 -17343 -8383 -17134 -26598 -23937 -33906
7120 -33906 -44515 -38498 -28180 -40214 -51517 -44344 -27508 1889 9081 -2950 -19932 -9700
7108 -9700 14774 36760 55976 58502 24653 4560 197 -8968 -14548 -866 -8930 6350 35790
7095 35790 20066 -10868 -7917 -6901 7318 9643 22728 814 -298 16501 31858 33545 6248
7082 6248 -28587 -26967 -44990 -38425 -34551 -14002 26599 36718 15714 2461 6164 -4712 -15357
7069 -15357 675 -34948 -43219 -49706 -59312 -37077 -12961 -12985 -23404 -20528 -9134 -7908 9885
7056 9885 17223 19096 25905 49788 42009 27240 1194 121 -5303 4267 11014 14372 2375 -21954
7042 -21954 -44089 -32008 -27849 -8797 -477 -4208 -4833 17666 3053 -13000 13492 26831 23072
7029 23072 123 -14520 -18787 -16311 -12214 -4773 15751 -4266 7235 8364 7807 8549 -14219 -6612
7015 -6612 -21481 -38001 -21028 -26888 -10327 -1994 22885 21733 21458 -2864 -18158 -18666 -10785 2053
7001 2053 18874 37989 25172 21247 25765 -823 -711 21975 27507 382 11176 1824 -18038
6988 -18038 -7072 -5837 4695 -577 6258 19854 -45 -20844 -7134 -1048 9200 20383 8313
6975 8313 -26072 -38316 -56073 -63319 -53216 -33098 -23652 -24519 -25225 -18829 -8897 -3188 665 25921
6961 25921 3697 741 3875 -7746 -616 17415 33423 34502 23660 3714 -28032 -19958 -2874
6948 -2874 6523 -15802 -13465 -16532 5337 6591 1589 -8780 1829 -17330 -8169 14736 2718
6935 2718 -8939 29079 40684 28289 16855 -20284 -39817 -45034 -27770 5712 -15603 -39538
6923 -39538 -33115 -38028 -31230 -20439 -703 10587 1963 -16350 -13165 -10289 15979 19021 7575
6910 7575 12275 22542 24191 20789 19323 20111 23108 21851 41810 28411 25517 5217 -2644 -17811
6896 -17811 -41443 -27984 -9594 -9639 -11273 16206 50814 33701 16662 22202 36836 30428 15369
6883 15369 3104 19043 14302 2222 -7821 -12407 -12580 -44287 -34166 -33151 -38711 -16158 -2766
6870 -2766 2921 -16334 -13272 3550 17430 6342 -5574 -6799 16578 1958 -10785 -24543 -28009
6857 -28009 -13699 -12828 -26166 -32415 -45081 -53434 -37192 -11486 5021 12347 38826 31820 2479
6844 2479 -13720 -6684 -23078 -23500 -16845 -1280 -11133 -27902 -18445 -16770 -10305 -8220 17323 40834
6830 40834 44030 30167 21075 6459 -20640 -30158 -50740 -45387 -51150 -46654 -32965 2524 13094
6817 13094 9913 23211 34763 19734 -1906 -7430 -16496 -9440 3309 -1787 -6517 -26863 -19464
6804 -19464 -8412 -1608 -19280 -25883 -12358 7595 16406 -35139 -73967 -95287 -67709 -30369
6792 -30369 -24328 -4077 -16331 -22304 -8217 -9994 -24386 -31853 -24404 -8763 2325 16228 19119
6779 19119 17672 16883 448 4361 -18856 -40653 -43908 -47834 -47952 -39497 -45897 -32204 -1460 15006
6765 15006 -4969 -9850 -239 22491 23163 8289 326 3482 -15763 -46138 -59083 -63176 -47681
6752 -47681 -27325 -30267 -20724 -776 2475 -5286 -24151 -27786 -9114 -13163 -11943 -10657 -11036 -19750
6738 -19750 -14499 -28124 -39734 -35355 -9985 -7100 -9011 -24755 -39003 -48500 -38714 -21204 -27878
6725 -27878 -42477 -25189 -17401 -27100 -26148 -16394 -14441 -21904 -21944 -19411 9164 27848 11214 -10753
6711 -10753 -13889 -29611 -9110 8338 -7653 -21109 -5419 -19153 -6545 -3911 -14099 -21948
6699 -21948 -24588 -11479 -18704 -13217 13547 29065 14111 13586 -4854 13514 2951 5382 20652
6686 20652 30648 40835 24128 43026 32803 11597 -801 -12069 -20371 2172 14584 1793
6674 1793 15506 21875 21441 21914 5513 -3478 -1335 -459 -3075 -30599 -19472 10239 29743 27012
6660 27012 15390 25655 21474 18642 8100 -5407 -2875 7117 11877 -2231 -14948 -5774 -8812
6647 -8812 505 -14519 -21434 -35148 -35674 -47297 -59190 -24352 4988 3171 5892 4569 9466 7160
6633 7160 -12631 -23251 -11196 -2351 -2682 -8099 3405 15322 23445 20006 12138 15 -23989
6620 -23989 -49794 -38836 -19749 -8117 -4325 -18075 -8095 -9638 -26458 -23936 -13567 2589 26078
6607 26078 39159 17484 9744 5858 -15552 -29358 -57771 -30439 2888 -10921 -29812 -42963
6595 -42963 -26953 -11170 -944 3211 6934 1605 -3952 3051 727 23093 15413 -15855 -26332
6582 -26332 -36738 -48256 -47581 -19477 -5248 22640 17594 12382 20818 27747 16007 8846 14692
6569 14692 6340 11186 27698 11257 3752 18971 9865 -10341 -17055 -38252 -38383 -13370 16724
6556 16724 4958 -10857 -2331 -11386 4044 27931 36511 5625 16482 -6479 -26429 -6602
6544 -6602 8955 11106 -16366 -30831 -29980 4981 1389 -2613 25532 56928 45677 32010 14802
6531 14802 3306 9096 26233 19811 -13039 -24916 -25513 -16910 -8769 15575 33008 20137 -14209
6518 -14209 -4572 2160 -29876 -50342 -32673 -46267 -54557 -40647 -25062 -30677 -11474 7182 -12919
6505 -12919 -494 14758 -13557 -26814 -10727 -22231 -46801 -41483 -18991 5828 20411 16174
6493 16174 4025 -150 2966 -14177 -39547 -42352 -39301 -34638 -24009 -2525 7858 6043 -10749
6480 -10749 -11344 6364 17126 23079 839 -4664 9292 175 -18038 -29809 -5122 21224 37347
6467 37347 63130 48374 62312 105027 99979 71245 73354 74840 70012 73567 46635 18255 -10025
6454 -10025 -9436 -24160 -62229 -64101 -44986 -10587 13058 -1044 -631 1424 -11442 -29366 -33241
6441 -33241 -25242 -22407 -20889 -1370 -8748 -17595 -9728 1005 7895 -9679 -10072 -10419 -16806 -9502
6427 -9502 6220 11911 15382 20116 6463 25189 22669 28034 12716 3749 13762 5914 -20874
6414 -20874 -5369 -2253 -1957 90 15547 -11912 -12186 8262 14490 25144 37101 18721 -6004
6401 -6004 -18253 -1770 -1856 -20390 -43973 -31077 -17247 -18755 -25063 -38414 -42040 -15884 -44285
6388 -44285 -64278 -38307 -6207 -10666 23850 40928 46895 45983 21647 -8855 -11550 -14905 -12860
6375 -12860 318 3186 -3505 -12858 -19434 -9954 -13721 -7494 4895 23842 17752 -8389 -20443
6362 -20443 -23734 -10648 -1069 -6555 -4733 440 -15592 -16850 -11116 -17376 -9572 5181 27291 25724
6348 25724 7666 9471 -14497 -20110 -4311 6165 -22151 -37125 -14042 -11232 -29988 -43130
6336 -43130 -38253 -38981 -16573 -16295 -47945 -48496 -30258 -30896 -32566 -19638 -14443 8323 -5998 -11398
6322 -11398 -9198 -16390 -11470 -2559 -12614 -17884 17679 13147 -9593 -23922 -34589 -13137 9750
6309 9750 -9812 -28068 944 12457 1698 14337 30353 15988 15667 13931 -7699 -27084 -31852
6296 -31852 -23787 -21045 8270 27848 20689 28617 19445 -1396 -12472 -13231 -7356 385 -25791 -40297
6282 -40297 -44328 -53016 -56589 -34213 -20428 -1605 -5674 -34090 -48029 -28768 -2239 20542 8071
6269 8071 -10069 -8476 -20342 -10563 4143 -25438 -31076 -11683 4702 4883 -4408 -18188 -9296
6256 -9296 -4058 16006 24341 46042 41640 22172 12643 -4038 -336 -3471 -12322 6580 14785 -5388
6242 -5388 2217 -5775 4443 -10360 587 290 -17759 -9431 -10515 -34108 -35772 -589 12082
6229 12082 -1197 -17808 -31775 3344 18125 -9584 -20424 -41200 -52592 -41448 -27512 -11672
6217 -11672 -19211 -20547 -39229 -52799 -29762 1416 17446 12937 6818 15455 17779 13142 27876
6204 27876 29760 23578 -1059 -5426 13735 4375 -17385 -33955 -21157 -24750 -29684 -33917 -30340
6191 -30340 -13479 -11747 -25692 -37244 -32340 -6780 -10542 -18645 -4323 -5633 -21347 -30873 -26637
6178 -26637 -34588 -16746 -14094 -33198 -39167 -47057 -41259 -37732 -16819 15274 30961 15161 -1698
6165 -1698 6216 1329 -214 -22218 -16143 -19896 -10738 -4223 -11183 1362 -1899 -3987 -19978 -5915
6151 -5915 -6091 3241 16791 -2466 -2335 5899 12618 8986 1201 -1424 -10379 -31326 -25532 -14283
6137 -14283 -3574 3994 8196 4186 -7018 -32353 -14854 20730 33016 19674 10921 13892 27546
6124 27546 14357 10148 17347 27859 18797 4619 7058 13665 31865 11634 1283 -24269 -25593
6111 -25593 -14919 -2709 4669 15465 35613 45752 39088 54539 27166 8421 20492 36200
6099 36200 -1907 -26541 -27451 12030 10020 8273 20216 24375 25806 28113 17554 -8729 -9025 -5993
6085 -5993 -15745 456 -15095 -16658 -4755 -46400 -47741 -34365 -30660 -28934 -29853 -28949 -30311 -22077
6071 -22077 -3045 10663 -6249 -9565 -2520 -22888 -27029 -38368 -31267 -17495 -18356 1326 6372
6058 6372 13453 29173 31233 17623 783 -26963 -19620 -26449 -28707 -32243 -29897 -28324 -33826 -48811
6044 -48811 -40255 -13709 7882 2348 -5999 -25451 -35624 -46831 -18496 765 -19209 -40271
6032 -40271 -25630 734 -21196 -31225 -8050 -911 3762 6276 30284 5790 -13349 18638
6020 18638 -3793 -41303 -44173 951 22651 10084 -1567 -4973 -872 16179 4543 -41621
6008 -41621 -12032 13422 16746 20847 4959 -3602 -12085 -13009 -25677 -39498 -37399 -6251 8593
5995 8593 24541 34835 41666 14207 -10853 -14468 -21415 -25246 -32098 -30386 -31884 -21451 978
5982 978 15863 41534 47488 43756 13709 20166 21713 4632 -20094 -30605 -20711 -15639 -8558 2560
5968 2560 10743 23345 12492 1193 -8126 -15224 -15450 2238 -11321 -30521 -10606 -6794 -59104
5955 -59104 -51589 -24083 -10743 2160 2643 -101 6306 24686 32124 27496 25837 14399 -5794
5942 -5794 -1323 18532 2135 17135 43845 38437 5405 1582 8657 27434 14669 9167 16526
5929 16526 -9015 -11037 3088 -5447 -30114 -28860 -19098 -11052 -17222 -29213 -17535 -11783 981
5916 981 2980 -15657 -33600 -14784 16119 15453 -5063 -29870 -26317 -36120 -32541 -11834 -15685 -8206
5902 -8206 -2357 -2550 -1255 -1005 -92 2165 -4655 -13259 6542 5293 900 2915 8221 21856 23550
5887 23550 15547 4701 12820 5990 15488 40268 35069 26163 24846 23727 40878 41674 26649 11813
5873 11813 17897 16260 18788 14332 -436 -93 6631 23475 14868 -7732 10372 47223 44756 39391
5859 39391 24041 17813 29555 12536 1262 -12044 -30607 -36085 -26133 -27018 -37154 -18687 -10957
5846 -10957 -4055 -27600 -30782 -11507 -894 17178 -7407 -37300 -32231 -33549 -26961 -28516 -21232
5833 -21232 -17312 2748 488 24155 31456 8402 -12628 -14708 -4494 -23751 -28851 -16902 754
5820 754 3384 34061 45713 16138 -30768 -58110 -54262 -28771 -57507 -65205 -37676 -10254 -12912
5807 -12912 -21640 -6078 24652 22551 26835 34010 16351 19411 2867 11798 36635 35840 6160
5794 6160 -413 1525 1306 21128 17546 36309 54990 6318 -25610 -5649 -8757 -97 -3693 1771
5780 1771 6998 17373 20038 34735 34302 23387 5690 7080 4814 -11986 -53965 -70918 -45334
5767 -45334 -24069 -19325 -18367 -12897 2772 8067 24967 7860 -18137 -15539 59 2936 -7447
5754 -7447 -18080 -11739 9780 15413 27189 2387 6638 12787 1036 -19633 -51548 -39950 -18219
5741 -18219 -19363 -32708 -32802 -33406 -36589 -22134 -16109 -20924 -22311 -19433 1195 -8638 -20886 -23804
5727 -23804 -4841 -9213 -14791 7150 27109 14558 3470 -7882 -25138 -29541 -33162 -28906 1818
5714 1818 36869 7183 -16029 -9109 -11101 -2523 -5321 1519 -15038 -41270 -19509 7288 3072
5701 3072 -7317 -40816 -27940 8320 3123 -25709 -3118 -3070 -7054 -2424 21879 19878 23775 2840
5687 2840 -7953 -912 28006 43196 50314 66365 46427 15610 619 -1327 -792 -294 32863
5674 32863 40623 14562 4209 -12767 -12611 -4127 3985 -1048 -9054 -14422 -21476 -40874 -50231 -46056
5660 -46056 -16810 -3801 -3984 -16748 -879 25292 28646 11253 -20472 -23120 -1122 39571 53759
5647 53759 16910 7039 10517 1286 -19539 -43104 -34563 -25092 -36569 -40012 -43094 -36782 -62347
5634 -62347 -91591 -66580 -24581 20699 22734 -14122 -29412 -14577 -9973 -9320 -21960 -18202 -9748
5621 -9748 -4647 6837 -8486 -14627 -10577 13632 24433 -3859 -10872 -4344 -9690 5427 10207
5608 10207 -2706 -10893 -5852 3660 24874 17324 7402 12529 23806 33708 15976 10589 11221 3969
5594 3969 14319 -10826 -7546 27223 25903 48976 46570 19256 -4306 615 5526 11979 20041
5581 20041 19862 -826 -2267 25449 32216 30912 17430 16641 29969 13739 -12350 -7782 5710
5568 5710 -22781 -28703 -30680 -20388 -18445 -32040 -44655 -9222 30847 19192 10916 9601 3297
5555 3297 15452 460 -22931 -37135 -35480 -4069 -4524 -16337 -21575 -26921 -36363 -34085 -17282
5542 -17282 2514 -5612 -2796 -14951 -26641 -15733 -13216 -6650 -7850 -1243 -5399 -17040 -22878
5529 -22878 -47992 -41150 -6593 15199 24796 7376 -4372 -3612 -28625 -37768 -32583 -15405 -9148
5516 -9148 14786 -3128 -12922 -3587 4626 -31085 -47406 -35046 -37959 -49925 -52296 -18289 28077
5503 28077 1131 -18576 -3387 21098 33147 47726 26124 -14633 -13610 11078 32688 6715
5491 6715 5642 8554 21559 22913 8117 13653 -3926 8592 -2812 -14384 4103 -4082 -1745
5478 -1745 8726 13588 19058 13498 5975 4331 -6839 -26927 -23307 -20123 -24860 -17472 12091 7981
5464 7981 -9258 -16709 -28442 -31362 -36914 -45738 -56304 -79509 -30785 6812 -6982 -16445 -25420
5451 -25420 -14648 -9316 125 -10160 -44047 -53890 -52425 -53838 -42132 -39098 -20880 -13204 -6369
5438 -6369 -13002 -11633 -19507 -21807 -45056 -38025 -7434 -16786 -23683 -14111 -5994 -5519 12034 30900
5424 30900 15784 37344 37919 56441 39398 -24323 -56226 -76617 -61232 -37653 -39899 -45271 -36955
5411 -36955 -2358 6638 27355 19493 1925 -10156 -18357 -10034 -1168 10978 -8884 15124 -13643
5398 -13643 -48182 -32970 -11651 -24688 -16358 5770 26569 28828 27060 -422 -14976 -13578 -2052
5385 -2052 5880 6301 4320 -15984 -7822 5470 -26433 -40063 -47951 -41630 -15208 -23634 -28342 -24298
5371 -24298 12246 -3721 -6612 -7187 19522 33466 31875 14174 23815 48022 34896 8637 -8594
5358 -8594 -35598 -35437 -27995 -29562 -33037 -36109 -23132 -5407 13710 12072 -3050 14161 10386 4278
5344 4278 -17207 -32688 -15253 20583 39949 20980 -6196 5855 -1507 -6218 11627 26948
5332 26948 13612 14723 2937 -20380 -37002 -30833 -38481 -43266 -19266 -13020 -13188 2760 17444
5319 17444 33207 5470 -15831 -23872 -8359 -619 -19330 -4982 19047 2632 -8397 -703
5307 -703 954 4521 12243 17735 26592 18849 14881 5932 7467 11610 4711 -1214 2286 7023 -5363
5292 -5363 20750 19827 1602 -15278 -268 -7264 15608 32353 31047 10898 -3078 -9857 2410
5279 2410 18606 30603 -5568 -8971 9777 230 -6216 1945 4880 -19485 -30844 -31715 -16309
5266 -16309 -28249 -35525 -16484 -4901 11359 23823 30991 36522 9072 -5270 25026 58420
5254 58420 58769 14829 14293 6291 -3884 21652 27153 1917 -48434 -38183 -22067 -4613 -11758
5241 -11758 -21504 13116 3178 -13498 -5152 880 -4865 -19918 -27929 -12948 -435 2749 13011
5228 13011 322 3970 33758 20310 -216 -7795 -2926 -5569 -1975 7233 -6568 -14989 -19668
5215 -19668 -12738 -14503 -8251 22874 22518 32752 13380 -4460 -367 5864 47326 46962 29215 26812
5201 26812 39027 18028 -4972 16442 22216 3139 6863 9454 4217 -645 12282 34759 38133
5188 38133 26339 14204 4147 -3738 -1201 27434 25483 26661 14350 -19889 -13003 25841 21005
5175 21005 1419 -12697 -42019 -44256 -18444 20612 44111 33616 33697 2102 12857 12499 10858
5162 10858 -7773 -47583 -49976 -23771 -21559 -27837 -33431 -46497 -18521 22947 40971 1280 -46095
5149 -46095 -34329 16188 43925 34309 25375 1103 806 1016 -2803 -15027 -20060 -100 24385
5136 24385 16138 -11598 -13065 -12217 -19839 -28308 -21162 -12204 -6378 14175 -805 -12065 -10459 -11889
5122 -11889 14334 12418 -3480 -3070 139 -6542 12201 14196 -17340 -51226 -21839 -9423 -30308
5109 -30308 -34552 -18975 -11315 -12191 -5136 -9868 -4142 -5197 -2021 14520 -1800 -10632 -35535 -25328
5095 -25328 -460 14709 17372 44896 58161 50829 30148 16484 4704 12093 -27742 -32059 -30798
5082 -30798 -36075 -57566 -33777 -11386 -35663 -40699 -29711 -14909 -8394 -1366 -14254 9358 21522
5069 21522 19733 12072 -24875 -30875 -17674 -8910 -8902 9124 12299 5812 1370 -3247 2107 -7829 -32600
5054 -32600 -13069 -4 3330 -8379 -3029 -1969 -6673 -845 143 18558 6266 430 -2059 -10861
5040 -10861 481 14909 29510 44759 42892 -14029 -31271 -11895 18174 26840 34409 23256
5028 23256 -2263 -28662 -21620 -3219 3257 -3564 -2360 92 -13959 6747 40029 43747 28997
5015 28997 14402 -4502 937 6633 1194 -1825 -31871 -21562 -6229 24426 27070 17125 -10263
5002 -10263 -32891 -36232 -30778 -26882 -24081 -4406 24653 39573 20474 12197 34051 20654 13312
4989 13312 13924 18857 22776 45218 26202 21004 39792 29828 18636 39237 24548 2071 -14076
4976 -14076 -7792 12739 18195 37146 31525 -8150 1126 22541 7964 10234 7567 -6848 -20056
4963 -20056 -34688 -34244 -31969 -8866 2346 -1134 17125 38113 43758 47041 39302 32268 43635
4950 43635 31008 11692 -23794 -29156 -22967 -8926 -12800 -15579 -6350 11112 -5553 -28127 -15354
4937 -15354 -11732 -20671 -17484 -11921 -9723 10324 34839 43736 29021 5711 -6440 -28063 -33025
4924 -33025 -44782 -22480 -19137 -28140 -12899 8208 26751 11875 -7752 -19486 -28244 -36378 -58097
4911 -58097 -43119 -23527 11277 -266 -110 -3940 -18125 -18799 -2487 7326 17386 3154 -5535
4898 -5535 15035 -3957 -23100 -22339 -543 -5747 -3051 7865 -4663 42 5056 24051 12378
4885 12378 -15593 -8882 -24303 -38912 -35594 -34271 -21255 -4085 11301 7450 16639 28175 -722
4872 -722 -27778 -33290 -29116 -28145 -611 26349 23372 2731 -18840 -28188 -27439 -33098 -25648 -19328
4858 -19328 -34 1920 -20744 -43160 -57783 -51188 -13454 -2302 -3024 -21922 -60930 -50997 -25632
4845 -25632 -17592 -2096 26751 28079 10273 -11499 -44659 -48237 -31798 -27123 -19990 -13672 -11084
4832 -11084 -21667 -20043 9369 11146 -11704 -31839 -19300 4160 8355 4569 -3384 -15924 -20363
4819 -20363 18511 33279 21575 -14659 -28962 -20550 -15339 -11985 24578 30605 41050 39378 42017
4806 42017 31571 -12968 -16647 -27912 -9092 6490 6161 5218 22395 -525 -18732 -15897 -6077
4793 -6077 -20423 -23567 20421 29148 7479 -29881 -32260 -17672 -5744 -30226 -58664 -47214 -55493
4780 -55493 -50899 -51078 -22298 -14665 -12882 -8371 6414 14043 3847 -12760 3477 8758 10461 29587
4766 29587 21982 4243 -8485 -1417 -8445 -19048 -16381 -24998 -10675 12927 6017 -864 -6238
4753 -6238 3048 2543 -8972 18110 39506 18457 21227 29864 12463 -758 -4891 -7536 -10370 -8055
4739 -8055 911 5367 -22047 -42999 -23336 -23747 -12886 27172 24159 -25613 -28121 -6120 -3370
4726 -3370 15517 -6118 -28078 1640 18371 6981 -7657 -22403 -21940 -14626 -3641 11671 -421
4713 -421 12031 26036 25465 11582 2348 -14929 -63953 -57872 -60608 -63580 -31331 -34406 -48127 -54954
4699 -54954 -39967 -39300 -55416 -57590 -46140 -12580 547 16593 16017 10314 7515 21985 22618 14193
4685 14193 5798 8245 2676 -33049 -32966 -14243 15612 23656 38241 18722 -10391 -26092 -11555
4672 -11555 -8635 25600 38438 6587 -34909 -15304 8571 32441 32051 10029 -21946 -26180 -9182
4659 -9182 -2309 1652 2924 -14265 -20436 -11458 7930 14170 17783 7466 -21618 -31050 -20780 -6911
4645 -6911 -20228 -28958 -31598 -9228 13831 -6887 -34116 -37698 -19114 -12426 3354 30488 24097
4632 24097 -16706 -14625 5101 87 -19797 -20356 -24327 -19122 -7059 -4453 -18441 -20198 -19161 -18765
4618 -18765 -31166 -18342 8848 22596 27596 4786 2854 3085 9332 4516 6876 20519 6649
4605 6649 -14362 -18898 -3505 -3619 -4546 -2940 -830 1900 4086 -8435 -38617 -41146 -28865 -3966
4591 -3966 -17961 -16306 -34685 -51120 -19611 9819 20767 16223 20424 28115 40627 31543 5080
4578 5080 -5703 3068 35768 36412 20729 -3792 2462 19378 19380 3932 27616 27947 23725 -6506
4564 -6506 -25892 -17168 -5606 5867 15896 24300 21356 20166 10216 -3920 3592 23255 7644
4551 7644 -1139 20514 -1420 -24319 -9534 -2366 -10033 -24955 -54581 -36938 -16357 -19468 -14199
4538 -14199 -4727 7512 2483 -7448 -36 20506 -1082 1910 -2307 -3293 4148 23318 22308 7257
4524 7257 2634 5140 6995 12912 6420 -18307 -44266 -48493 -27379 -3897 -3120 -16932 -46464 -63522
4510 -63522 -47959 -35149 -48673 -32811 10366 31825 32620 22207 16802 19476 28840 22631 -7918
4497 -7918 -29981 -26760 -12293 -17888 -5369 18483 15385 -18467 7419 24099 20806 7520 -41494
4484 -41494 -30374 -9277 -16532 -23819 -19327 -17114 10169 12503 6905 9135 14118 6640 22064 26916
4470 26916 15241 27505 31410 20156 9409 19715 6485 -21945 -34977 -43485 -27101 -19252
4458 -19252 -7599 -8257 956 -2284 -19303 -40956 -43810 -20121 -13684 -14206 -12598 -19365 -8255 4517
4444 4517 -17964 -31704 -29050 -33817 -35020 -20896 -11618 6483 11963 2536 11109 40272 52674
4431 52674 50299 19382 7383 20719 29069 22668 7132 -20008 -44456 -54420 -33223 -42260 -45008
4418 -45008 -27079 1384 -2301 -20862 -32026 -9068 22606 24552 7122 12426 20457 17294 19707
4405 19707 1195 -10272 -7958 14481 33768 40964 35713 16670 -1516 -387 -17138 -22368 -13062
4392 -13062 -10017 4163 9158 -14389 -39593 -36936 19107 24118 16984 19001 12524 7580 7565 3742
4378 3742 -474 -15503 -21846 -2681 3097 -5073 -17551 -19775 -2073 -7471 -21631 -23134 -20298 -33762
4364 -33762 -31284 1150 34313 44868 18235 -13155 -18908 -8995 -1169 5233 9295 1880 16162
4351 16162 41847 32582 14344 2401 28607 46177 33462 -1089 -20148 -20887 -35764 -34512 1106
4338 1106 9009 -37898 -53745 -35518 -40781 -33887 -16068 -8360 467 11131 10672 9140 30421 32101
4324 32101 23416 34254 14487 -15077 -12937 -1364 5374 9625 -28055 -13650 -6175 -22688 -28835
4311 -28835 -31771 -1687 34751 43593 34802 9483 6956 23854 28469 14076 14945 9467 9276 3365
4297 3365 18293 32393 55158 5673 -14571 1807 3703 11551 26476 40594 32358 8342 7875
4284 7875 23448 23854 18401 24273 21419 32714 24602 -5862 -27481 -9287 -11465 -25452 -27714 -3484
4270 -3484 13488 15060 26387 32498 7362 -19522 -40262 -41046 -42881 -44190 -39174 -35306 -47553 -65447
4256 -65447 -43938 -21672 -21114 -43820 -30226 1710 24641 26015 9777 -7256 -16998 -23410 -23118
4243 -23118 -20731 -1378 504 8099 -8197 -18666 -9826 -12515 -17804 -25719 -38091 -4364 29160
4230 29160 19329 -5748 -15633 -17462 -6414 8458 -27599 -40591 -50433 -31062 -12188 6319 -4241
4217 -4241 -11637 -6030 -4073 -3516 -21899 -18837 -17445 -17406 -31520 -39675 -30088 -36332 -26954 -6663 33767
4202 33767 47114 41531 6105 -4817 -1681 24291 23519 19136 31504 8263 -26011 -27416 -31874
4189 -31874 -24391 -34721 -29510 -18465 -6334 11595 -3185 -15048 -20659 -7320 8426 26207
4177 26207 39404 36894 9080 3101 7015 -11708 -3723 -17676 -26785 -10988 17207 15348 40
4164 40 5192 9096 -798 8104 22836 -22896 -44980 -39443 -33328 -12393 -3154 7872 4274 -1225
4150 -1225 -7794 -25313 -15022 16437 35491 37805 9648 -9968 4327 16357 -1324 -15564
4138 -15564 -8436 30969 37695 6559 -15917 -7459 3643 -14898 -4160 12606 32392 27075 37722
4125 37722 48516 15617 16207 18908 -24209 -23459 -10263 -19989 -16258 1433 7583 19456 2585
4112 2585 -6326 -4598 -19757 -19309 4527 38947 48157 25385 -5073 9794 16804 -661 7314
4099 7314 11225 6982 12073 -3013 -20415 -44321 -49910 -29403 -27335 -42997 -20040 -24463 -17252
4086 -17252 -22135 -10493 17939 19906 -5128 -9790 -3866 7577 14178 61 7893 -7631 -16226
4073 -16226 -4643 -4136 -4558 -11856 -3844 -23689 -76895 -73583 -40133 -30928 -39799 -45499 -61644 -49355
4059 -49355 -6601 5027 -3610 -8941 -13180 -8866 -7951 -27404 -41946 -29236 -2653 -8443 -17545
4046 -17545 -30198 -42339 -21992 -14686 -25024 -16868 -12014 22283 21041 11092 7271 -12412 6667
4033 6667 18370 -8052 5300 14844 12184 -8965 -20953 -4247 10995 11363 17002 20396 8432
4020 8432 -36440 -63633 -54803 -28362 5437 -4702 -14879 -29674 -31289 -29729 -30410 -28287 -4548
4007 -4548 2677 -7318 2697 1821 6830 -1927 -10006 -13608 -15232 -8521 21862 39696 51446 48490
3993 48490 64439 36187 11073 19439 20714 -687 1795 17418 -5210 10977 22756 23235 22170
3980 22170 31378 9947 4411 -8519 -4888 -1696 -29016 -16095 6747 14166 19582 13466 24489
3967 24489 7870 -13458 -11608 13095 19566 30397 29485 10294 23415 21973 4915 5070 3094
3954 3094 -642 27222 30066 20550 26073 28816 1973 -5298 4137 9447 -12647 15487 35446 55543
3940 55543 55611 29390 22794 8274 -21754 -13475 30739 13511 25628 59212 84294 62626 35607
3927 35607 26906 17503 16298 -7923 -38513 -38271 -3811 12463 15043 19195 11520 6976 -5791 -19913
3913 -19913 -21138 6640 28072 66375 69111 64742 49575 47249 26200 10463 6346 5712 -15410
3900 -15410 -29746 -16274 -21711 -5411 28597 10268 -14213 -28016 1644 -3780 -38267 -37104
3888 -37104 2069 12573 1822 -9287 -30759 -29684 -29466 -629 -21276 -45292 -32234 -23997 -35009
3875 -35009 -34986 -42886 -56445 -63259 -52985 -43563 -30917 -8577 -7073 320 -14117 -27867 -41486
3862 -41486 -21888 -10319 3185 26809 50603 41988 58504 51575 35528 32841 25068 36829 50979
3849 50979 47401 39546 31242 35475 29686 31922 8613 12553 14411 11056 17024 13338 11174 -449
3835 -449 -12438 10087 21406 38698 53591 37688 20925 24092 16876 4951 23229 19709 30892
3822 30892 35030 15523 -7134 -25164 -25099 -9381 -2029 9985 13847 17673 7246 11893 8470 25972
3808 25972 20273 6363 -5932 -12800 -19690 -16669 4771 7159 -7652 27857 31503 28428 8497
3795 8497 9178 -3247 -43009 -10669 9796 -8267 -33531 -27691 -10824 6726 19643 14690 21591
3782 21591 22389 1360 -6395 14804 30339 38929 26814 42445 57962 62060 58129 51090 46200
3769 46200 18797 -10407 -32473 -4307 -10115 -21986 -14026 -24423 -38880 -26395 -19858 -34730
3757 -34730 -26875 -4930 612 -375 6910 34847 35794 27757 39809 41238 28313 -10884 -35326 -25723
3743 -25723 -22724 -32103 -53422 -51782 -29818 1053 -10654 -29820 -33715 -22165 18450 12208 5221
3730 5221 -12000 484 2777 -13096 -30636 -19758 -16532 -3877 -1406 11860 47604 39270 13960
3717 13960 15173 33184 38401 31453 7125 -872 -257 -13846 -3300 -14602 -27269 -32656 -32041 -51987
3703 -51987 -46628 -34132 -44133 -35813 -6064 -5418 9985 27435 22096 12202 -10726 -7917 13304
3690 13304 8477 -8854 -15525 7301 3608 114 24502 43517 18477 -14979 -28395 -10854 -10804
3677 -10804 9130 26628 20445 8058 22823 34328 27832 -6077 -14983 -24274 -15462 -23965 -32599
3664 -32599 -22913 -53700 -45308 -17197 1530 20580 -7321 -7816 10066 14000 -2609 -19536 -10187
3651 -10187 -15654 -10478 -31392 -28435 -8914 5769 -15089 -64711 -74761 -48192 -36646 -30982 -30435
3638 -30435 -35254 7427 24611 4558 -7549 7651 -14548 -18033 -10338 -15856 -4488 3096 -24116
3625 -24116 -42092 -34086 -58009 -77627 -45239 767 6966 5804 6766 21777 17605 11025 24302
3612 24302 39774 7636 -16070 -35051 -40342 -25086 -26124 -34277 -2214 13828 -10045 -26618
3600 -26618 -30646 -25931 -12679 -10763 8070 -5147 -11170 2524 -315 -16471 -29762 -11262 22781
3587 22781 -1336 -27522 -8653 -3768 -1759 -15937 -36363 -33859 -32131 -47997 -36023 -8069 11814
3574 11814 27937 33383 27165 -747 -13884 -9489 -4835 -10103 -1263 -208 -19836 -4162 17072
3561 17072 24926 25882 2281 -9792 -3200 3738 -5523 -4765 30839 45272 13913 -23569 -37051
3548 -37051 -53786 -28531 -19863 -17538 -16569 -20370 -15144 -18546 -10088 -1832 -4112 -7739 -6165 -12692
3534 -12692 -2277 15010 19656 13962 18150 8245 -21082 -22862 16518 35825 17236 -20575 -12308
3521 -12308 128 -1765 23282 26458 -7064 -2295 19997 22975 11672 4466 -22096 -26130 -3799
3508 -3799 -4280 -24863 -21302 -7104 29499 42801 32001 29155 15902 949 -4345 11737 -302
3495 -302 -22470 -39523 -48077 -44688 -42065 -42153 -29246 -22211 -8240 -6000 -32186 -36836 -31038 -33027
3481 -33027 -10635 -13707 -17718 -560 -4722 -7330 -8948 -24227 -30329 -29775 -18954 -1767 1831 25213
3467 25213 26656 19947 6474 -24611 -5895 18025 2933 -14904 -27141 -27693 -36204 -42843 -31367
3454 -31367 -27021 -35761 -42046 -25418 -34171 -32692 -34016 -54642 -57277 -62922 -59277 -63147 -47215 -20810
3440 -20810 -13294 -10916 -10634 -17209 -15880 449 1035 15932 10544 8950 20229 7680 -275 -35180
3426 -35180 -54851 -44225 -38436 -45436 -53158 -64390 -31029 -25801 -20535 -25872 -24049 -2765 18675
3413 18675 35649 27037 9042 25806 12494 1803 3645 13319 23669 35358 45496 36219 15639
3400 15639 14275 -25375 -45380 -30005 -8348 4735 -22628 -16507 -1948 5068 2863 -21237 1270
3387 1270 22569 12434 11810 19602 8423 1295 18786 12648 19392 22790 16270 23027 32452 23005
3373 23005 14939 10670 29409 29682 18261 902 11270 7640 20269 26315 17746 8789 -8107
3360 -8107 -26589 -9388 11779 14775 8141 30984 31990 10552 2539 -6432 -19362 -14263 12594
3347 12594 9265 -6175 -11132 -19590 -28514 -35123 -16352 18359 -10348 -41419 -43245 -19787 11900
3334 11900 24271 22749 19317 8207 -4371 -26953 -30580 -12402 13494 26170 16235 12424 19128
3321 19128 21308 8704 3511 18873 6271 -26119 -21130 -21048 -7702 -4505 8745 41732 38687
3308 38687 1902 -243 21783 727 -521 -14184 5629 4379 -7562 -7526 -3669 16059 -7573
3295 -7573 12919 53122 37769 25472 24687 10634 -4551 2619 14022 24521 28301 -18391 -37335
3282 -37335 -33778 -46297 -47673 -24930 -11568 -4956 20348 33551 24346 25825 15470 2331 -2487
3269 -2487 5198 43652 42512 -3744 -22451 -19301 -14125 15085 10146 -1280 11947 5042 -15711
3256 -15711 -40052 -32794 -19720 -7796 21518 19497 -19037 -26215 -18414 -11147 -14093 -31681 -43978
3243 -43978 -26144 10610 29740 12939 -16716 -34744 -48428 -42840 -23884 -6196 10135 27415
3231 27415 21811 28758 39690 32758 22547 11027 6465 21035 38164 55564 20562 -16334 -10552
3218 -10552 -1623 -16459 -33950 -6726 -484 15677 17026 8063 4309 5346 27081 41224 47630
3205 47630 26600 8311 -1264 -9752 -6562 -3031 -16193 -19937 -2968 -8763 -17466 -19914 -31550
3192 -31550 -33844 -51685 -69826 -33835 -18493 -18442 4588 9405 -5757 -2087 -1560 -12718 -8983 7664
3178 7664 -3452 -11923 -11559 -22263 -30030 -22663 -2620 11482 -28424 -48533 -52955 -46388 -34710
3165 -34710 -17785 10482 20946 11889 23496 20767 24936 35329 7945 -9072 -11164 -7560 -37125
3152 -37125 -51698 -37189 -26183 3323 13868 -5161 -5756 -25251 -27759 -34285 -51158 -40012 -21406
3139 -21406 -29614 -41699 -15513 1542 6078 -15880 -20887 -24054 -23288 -28220 -29886 -37577 -30710 -16692
3125 -16692 -39594 -31961 -4051 31287 28182 20408 -5543 1724 9991 8892 11038 10288 -7510 318
3111 318 -20208 -15300 7321 7460 -2349 -8980 609 26436 32233 17409 29771 38385 55107 58751
3097 58751 51255 41598 38936 25878 10695 -4385 22930 8603 -3145 18571 33690 36537 27403
3084 27403 25002 35699 24304 -6403 -13006 -38711 -49802 -45422 -51688 -65203 -57488 -34291 -18388
3071 -18388 -16390 -5056 -8464 2897 30823 39079 37704 25982 21726 24345 13901 -4159 -858
3058 -858 16061 -13388 -51620 -55342 -69294 -53944 -43075 -45287 -12198 942 2879 1671 7769
3045 7769 17047 13576 -1603 -4881 8091 -7812 -7836 -20595 -20605 -18107 -14501 14281 49516 69642
3031 69642 58733 36561 29922 25669 28166 24032 13134 14845 32356 27939 24820 35579 32461
3018 32461 29634 41594 43128 45443 27053 -9250 -8541 37570 44641 29655 -1050 -10471 18642
3005 18642 12037 9526 10027 -4177 -17217 7100 9591 -14216 -25959 2105 9642 10787 6636
2992 6636 14365 13208 20077 3886 -15516 1389 31085 26190 11614 -7440 -15533 -11540 -11614 -2758
2978 -2758 -700 -26011 -17240 7 24843 23224 18488 8865 13840 9092 -12976 -30476 -10713
2965 -10713 22912 23759 28657 57593 59703 48640 19490 23695 14733 19164 -8433 -27373 -36443
2952 -36443 -19269 10082 -2930 3893 10164 -14603 -19000 -5333 11568 8812 15147 9336 14082
2939 14082 10734 7335 -8666 -14824 -10443 2614 -13631 -31623 -16131 -5567 -8334 -11695 -816
2926 -816 28666 29006 73327 77242 62909 52444 49551 29355 11078 7117 9231 -3554 -19390
2913 -19390 -35160 -45757 -4150 17950 6495 -14801 6394 7951 14724 5162 -489 -24232 -46468
2900 -46468 -52209 -33845 -22143 -17345 13520 3374 11450 6009 10024 32746 30484 37318 31821
2887 31821 13930 -3885 9547 16055 -2763 -20412 -16697 23221 28915 -14804 -8022 -10375 15846
2874 15846 31859 10954 -14210 -20048 -15816 -14670 -21218 -30293 -44908 -26795 -6358 23420 7275
2861 7275 -2854 -12045 -14012 -28698 -47607 -46466 -47174 -34245 -33292 -9868 26919 30878 27433 35095
2847 35095 4096 -28164 -42248 -32279 -21278 -9279 28652 38356 30016 37759 5791 -27760 -20577
2834 -20577 -22377 -20409 -26308 -11660 7973 14590 -16523 -31653 -22153 25965 52641 41741 21451
2821 21451 3799 -2046 -4964 -3774 -8952 7744 23754 38149 29905 17741 3248 -30631 -31793
2808 -31793 -21956 -32557 -15861 -21124 -29390 2018 -8403 -20191 -40491 -38091 -23345 -2579 33176
2795 33176 16326 7402 22029 17528 7593 -10010 -35315 -36507 -30197 -33936 -52330 -54792 -14716
2782 -14716 -2894 -46035 -43802 -21507 -12848 14067 23681 37199 31092 10385 -7452 8205 12278
2769 12278 16306 8480 -26248 -21493 -13336 3254 -1239 12767 18315 25417 -16721 -10459 -13825 -8081
2755 -8081 49077 37994 14994 -11626 -11716 -3911 -568 -4224 15291 26763 -3487 -25969 -33765
2742 -33765 -18348 -26375 -55373 -58614 -57738 -35390 -17023 5846 22321 15132 11287 17528 -3764
2729 -3764 -22857 -8845 -1528 -34730 -32829 -31859 -44086 -58280 -29441 11447 21622 15844 16618
2716 16618 30695 19192 3050 299 7360 37144 34546 30999 23058 12186 -5062 16069 15698
2703 15698 9897 -345 -1449 594 2014 7001 4621 -4236 -18355 -19703 11749 33386 21694
2690 21694 21580 54 -10556 -14264 -5920 -37806 -32170 -19434 -28079 -25638 -7289 34836 34351 32547
2676 32547 -1613 -34368 -23868 -7111 13063 34636 22132 17726 -5043 -24060 -5317 16941
2664 16941 26679 42799 23901 16891 11667 -9594 -32458 -51 34232 38283 26857 14507 -12021
2651 -12021 -8856 1142 -5650 1980 -3928 14546 3316 -14131 -18376 -31989 -50288 -45845 -50195
2638 -50195 -43672 -41147 -39470 -45137 -39598 -19621 -31780 -15878 -2544 6393 15604 14902 -3033 3023
2624 3023 9 -5040 2143 17026 6676 -10735 -42491 -66144 -51500 -42694 -37993 -12034 1342
2611 1342 11123 9330 -8444 -10884 -9124 25202 39130 46152 26166 6514 2766 15439 -5142
2598 -5142 3821 -5661 -15625 -27544 -9399 8860 7542 10537 10059 12410 13856 644 22071 39619
2584 39619 48057 27283 30287 37737 18807 11460 17274 22394 25651 26133 14539 36597 27324 12700
2570 12700 19138 23356 -3125 9064 24830 28269 50387 54825 29470 -8832 -15971 -8100 1995
2557 1995 13163 29004 37584 45599 41430 42008 20042 -7300 -26592 -20671 -15866 1114 207 -12012
2543 -12012 -13781 -15185 -28576 -40258 -25528 -35344 -38860 -22723 -12494 4465 -7481 -13747 -22191
2530 -22191 -20014 -8179 -2347 4640 4016 8210 -4168 -20835 -17077 -7127 -8615 -34713 -2753 25638
2516 25638 16318 -10933 -2371 13708 27373 10760 -14603 -12000 -9048 -1097 -1673 -21935 -36337
2503 -36337 -16807 -13772 6305 19429 58753 75287 69292 63232 42663 4319 -3153 -4626 -3678
2490 -3678 -1185 8636 23371 22545 11434 11502 5618 -1163 12368 16792 15829 33034 41171 4654 8645
2475 8645 31274 22935 10575 -6047 6268 9197 27143 27361 44284 62197 40380 39250 58629
2462 58629 88072 80592 52814 28639 19235 19750 29823 34253 37383 9027 -4920 8892 -14596
2449 -14596 -21991 2675 17943 19110 10769 -4480 -10371 7527 24139 7983 2488 -7650 -2085
2436 -2085 -2895 17632 16681 13620 -1207 -21698 -39000 -34944 -36392 -29333 -20140 -36424 -41529 -20477
2422 -20477 -17313 -11905 -2719 2019 24587 33198 13231 -13560 5644 -14172 -26462 -48202 -67030
2409 -67030 -42862 -7948 29915 17273 -4642 -12073 -15402 -4559 17771 21897 38751 41211 27137
2396 27137 8046 -1063 -143 -3556 -3861 -6440 -15753 -18438 -23004 -39264 -24913 7108 27216 30974
2382 30974 45200 74444 78431 70155 55568 25734 35833 38023 37125 24965 9145 -24115 -7707
2369 -7707 779 7087 8894 26745 24041 2663 -2559 -6373 985 5894 18248 23141 13443 9280
2355 9280 4373 8400 32998 19032 -3703 -17879 -15391 -7625 5447 -9000 -32243 -21413 -13856
2342 -13856 -8245 8224 10494 -6649 -7027 13653 4043 -11836 -13305 -2951 7631 -3440 19145
2329 19145 36497 38210 39712 22939 33090 29557 -10824 -48647 -37131 13061 12164 -22704 -19013
2316 -19013 -29525 -17905 -14222 -9068 8955 14031 4057 -6681 -39563 -53093 -21547 -3464 -19569
2303 -19569 -19855 -6239 -24889 -28070 -16553 -7794 3609 11124 -11330 -16780 -13558 -41968 -38597
2290 -38597 7434 27781 24311 8119 -612 10388 9869 7290 -5153 -14778 -16865 -17868 -7409
2277 -7409 -20931 -20684 5713 34818 26698 1220 16153 49723 40563 45353 51874 35001 -2075
2264 -2075 -22568 -4852 -33662 -42190 -22636 -9242 41409 54245 30375 21382 30861 27670 5867
2251 5867 3484 29943 40503 41303 48128 64344 56872 44101 16363 -6891 -6404 -11476 6790 5009
2237 5009 2877 -368 8439 29152 33702 35880 39508 13701 3587 5715 -1533 22682 43744 29052
2223 29052 23275 7609 10792 38477 50348 41968 42861 41247 32066 2429 9270 436 -19954 -18441
2209 -18441 -16083 -2599 -7033 5899 -10225 -446 31348 31460 26105 30421 29125 35922 21994 5569
2195 5569 -78 28117 33083 37525 24559 -10758 -29939 -10025 16410 16742 6171 -923 -1600 -15995
2181 -15995 -14687 -8997 -15686 -44131 -50163 -25226 -17562 -5591 7948 28228 5756 -2969 22959
2168 22959 14741 19432 16552 23022 45048 37109 -690 -36358 -40433 -18453 -8457 11201 35716
2155 35716 24030 21333 17140 35917 18680 24528 15049 9504 18896 -5437 -2806 5505 9963 10900
2141 10900 -12967 -44689 -26670 -1796 18124 28819 44887 47321 26532 -15921 -40083 -42696
2129 -42696 -36665 -29656 -21528 5757 5753 -9661 -12511 12187 28467 8022 6340 16923 36590 15158
2115 15158 11299 -14354 -21169 -34492 -15317 14802 -6005 10042 36991 25800 23625 -9649
2103 -9649 -34194 -41026 -38417 -36307 -21781 -7851 -13246 -2803 642 18292 30099 39162 29558
2090 29558 2187 176 10830 10986 1511 -4030 18741 24360 38087 58964 80175 72147 49332
2077 49332 45129 42846 32862 3728 -18118 -25475 -30876 -14810 1041 15179 26672 -17439 -25963
2064 -25963 -23460 -37161 -61506 -43243 6682 48567 48185 27098 -8 -31920 -56342 -49161 -40716
2051 -40716 -46258 -64249 -38057 -6575 -20431 -39273 -42214 -42796 -15359 16287 12267 -8422 1772
2038 1772 13136 18926 -25025 -23076 105 -4606 20558 177 -17415 5905 20898 13289 -8934
2025 -8934 -5583 9294 15024 -2867 6680 12133 2684 -1180 10788 -13676 -26390 -15834 -28868
2012 -28868 -14523 5362 9350 -9932 -30849 -22738 -29444 -26093 -3675 11714 9807 21176 29029
1999 29029 12160 5421 -16400 -22944 -25642 -30925 -25347 -39300 -48111 -20500 -19493 -19089 -19872 -23383
1985 -23383 1222 -8083 -32085 -37478 -27000 -9063 -11518 -11227 11465 23066 20765 14645 26148
1972 26148 37286 34341 5726 13280 26056 34772 32275 27264 24953 35170 21914 20443 90
1959 90 -6763 11644 10905 -23154 -18301 -6975 -10658 8582 15791 12869 37087 55852 45355 10917
1945 10917 -12699 -20758 -23163 -10698 -10561 -7577 23287 30214 22730 19569 20522 21171 9876 -31
1931 -31 3664 1676 2282 -4933 -9225 -13761 -23542 -20228 -47990 -34670 -19672 2363 12145 1328
1917 1328 -631 186 16373 22495 10911 -1809 -11151 4914 22584 24273 27233 24359 20434 30478
1903 30478 11302 9017 -6729 -2447 14217 26846 20001 -2207 4004 30311 24886 26539 9527
1890 9527 -7637 11235 9723 18341 4596 -421 1902 15833 9055 -13595 -18493 -10575 -15610 -11377
1876 -11377 -30715 -30656 -28837 -1138 12237 905 -10644 -7307 22733 2705 -41035 -64898 -67074
1863 -67074 -64768 -30614 9237 13190 -27584 -35320 -24409 -18748 -4693 -18495 -36707 -31845 -38755
1850 -38755 -14784 23545 15197 712 -24089 -36206 -25254 -30439 -49059 -32668 -19296 -5133
1838 -5133 -4559 8884 27947 19678 9816 19097 21057 11024 17263 39130 37117 36631 41033 31184
1824 31184 10879 17539 17392 -10102 368 11558 7 -7146 16638 -1597 -2505 -4990 -9550
1811 -9550 3882 -2440 -22488 -25221 -47649 -51846 -31356 -12060 -13034 -28987 -36277 -26596 -19787 -26870
$$ [...]
##END NTUPLES=NMR SPECTRUM
##END=
