##TITLE=Analysis number 313697
Compound Code km 04171
Project Code adrs
Chemist Name endeavour
##JCAMPDX= 6.0         $$ Bruker NMR JCAMP-DX V2.0
##DATA TYPE= NMR SPECTRUM
##DATA CLASS= NTUPLES
##ORIGIN= Bruker BioSpin GmbH
##OWNER= NMR
$$ XWIN-NMR		Version 3.5
$$ Mon Sep 19 10:22:52 2005 GMT Daylight Time (UT+1h)  MAYBRIDGE\NMR@NMR_250MHZ
##.OBSERVE FREQUENCY= 250.131544655141
##.OBSERVE NUCLEUS= ^1H
##.ACQUISITION MODE= SIMULTANEOUS (DQD)
##.ACQUISITION SCHEME= undefined
##.AVERAGES= 16
##.DIGITISER RES= 18
##SPECTROMETER/DATA SYSTEM= dpx250
##.PULSE SEQUENCE= zg30
##.SOLVENT NAME= CDCl3
##.SHIFT REFERENCE= (INTERNAL, CDCl3, 0, 16.522)
##AUDIT TRAIL= $$ (NUMBER, WHEN, WHO, WHERE, WHAT)
$$ ##TITLE= Audit trail, XWIN-NMR		Version 3.5
$$ ##JCAMPDX= 5.01
$$ ##ORIGIN= Bruker BioSpin GmbH
$$ ##OWNER= NMR
$$ C:\u/data/dgb/nmr/ADRS/9630/pdata/1/auditp.txt
$$ ##AUDIT TRAIL=  $$ (NUMBER, WHEN, WHO, WHERE, WHAT)
(   1,<2005-09-19 10:22:34.71 +100>,<MAYBRIDGE\NMR>,<NMR_250MHZ>,
      <created by zg, POWCHK disabled, PULCHK disabled
       configuration hash MD5:
       62 19 C7 07 E1 42 D1 B7 37 6C 3D D0 77 39 F9 E6
       data hash MD5: 64K
       99 9B 4A 38 CD 17 65 F1 3D EF 78 0A A0 98 62 46>)
(   2,<2005-09-19 10:22:45.28 +100>,<MAYBRIDGE\NMR>,<NMR_250MHZ>,
      <Start of raw data processing
       ef LB = 0.3 FT_mod = 6 PKNL = 1 SI = 32K 
       data hash MD5: 32K
       1D BC F0 F4 5C EE 26 CD E8 3A AF EB D1 97 3B 62>)
(   3,<2005-09-19 10:22:46.89 +100>,<MAYBRIDGE\NMR>,<NMR_250MHZ>,
      <apk 
       data hash MD5: 32K
       22 CE 2B BF C0 25 AD 1E 7F 00 E8 B0 3B 24 31 E1>)
(   4,<2005-09-19 10:22:47.63 +100>,<MAYBRIDGE\NMR>,<NMR_250MHZ>,
      <abs ABSG = 5 
       data hash MD5: 32K
       BE D8 18 0D A3 CA A1 F5 0D E3 F3 2E C3 4E 60 F4>)
$$ ##END=
$$ 
$$ hash MD5
$$ 06 CF 7B A7 BD FE 92 B1 86 FA BB 3B 95 46 2F B2
##$RELAX= 
##$RELAX= 
##$RELAX= 
##$RELAX= 
##$RELAX= 
##$RELAX= 
##$RELAX= 
$$ Bruker specific parameters
$$ --------------------------
##$DU= <C:\u>
##$EXPNO= 9630
##$NAME= <ADRS>
##$PROCNO= 1
##$TYPE= <nmr>
##$USER= <dgb>
##$AMP= (0..31)
100 100 100 100 100 100 100 100 100 100 100 100 100 100 100 100 100 100 
100 100 100 100 100 100 100 100 100 100 100 100 100 100 
##$AQSEQ= 0
##$AQ_mod= 3
##$AUNM= <au_zg>
##$AUTOPOS= <8 >
##$BF1= 250.13
##$BF2= 250.13
##$BF3= 250.13
##$BF4= 250.13
##$BF5= 500.13
##$BF6= 500.13
##$BF7= 500.13
##$BF8= 500.13
##$BYTORDA= 1
##$CFDGTYP= 0
##$CFRGTYP= 5
##$CHEMSTR= <none>
##$CNST= (0..31)
1 1 145 1 1 1 1 1 1 1 1 1 1 1 1 1 1 1 1 1 1 1 1 1 1 1 1 1 1 1 1 1 
##$CPDPRG= <>
##$CPDPRG1= <>
##$CPDPRG2= <>
##$CPDPRG3= <>
##$CPDPRG4= <mlev>
##$CPDPRG5= <mlev>
##$CPDPRG6= <mlev>
##$CPDPRG7= <mlev>
##$CPDPRG8= <mlev>
##$CPDPRGB= <>
##$CPDPRGT= <>
##$D= (0..31)
0 1 0 0 0 0 0 0 0 0.06 0 0 0 0 0 0 0.0002 0 0 0 0 0 0 0 0 0 0 0 0 0 0 
0 
##$DATE= 1127121753
##$DBL= (0..7)
120 120 120 120 120 120 120 120 
##$DBP= (0..7)
150 150 150 150 150 150 150 150 
##$DBP07= 0
##$DBPNAM0= <>
##$DBPNAM1= <>
##$DBPNAM2= <>
$$ [...]
##$SUBNAM7= <"">
##$SUBNAM8= <"">
##$SUBNAM9= <"">
##$SW= 20.6930455092707
##$SWIBOX= (0..15)
0 0 3 0 0 0 0 0 0 0 0 0 0 0 0 0 
##$SW_h= 5175.983436853
##$TD= 65536
##$TD0= 1
##$TE= 294.16
##$TE2= 300
##$TE3= 300
##$TEG= 300
##$TL= (0..7)
0 120 120 120 120 120 120 120 
##$TP= (0..7)
150 150 150 150 150 150 150 150 
##$TP07= 0
##$TPNAME0= <>
##$TPNAME1= <>
##$TPNAME2= <>
##$TPNAME3= <>
##$TPNAME4= <>
##$TPNAME5= <>
##$TPNAME6= <>
##$TPNAME7= <>
##$TPOAL= (0..7)
0.5 0.5 0.5 0.5 0.5 0.5 0.5 0.5 
##$TPOFFS= (0..7)
0 0 0 0 0 0 0 0 
##$TUNHIN= 0
##$TUNHOUT= 0
##$TUNXOUT= 0
##$USERA1= <user>
##$USERA2= <user>
##$USERA3= <user>
##$USERA4= <user>
##$USERA5= <user>
##$V9= 5
##$VALIST= <valist>
##$VCLIST= <CCCCCCCCCCCCCCC>
##$VD= 0
##$VDLIST= <DDDDDDDDDDDDDDD>
##$VPLIST= <PPPPPPPPPPPPPPP>
##$VTLIST= <TTTTTTTTTTTTTTT>
##$WBST= 1024
##$WBSW= 4
##$XGAIN= (0..3)
0 0 0 0 
##$XL= 0
##$YL= 0
##$YMAX_a= 462360
##$YMIN_a= -530812
##$ZGOPTNS= <>
##$ZL1= 120
##$ZL2= 120
##$ZL3= 120
##$ZL4= 120
##$ABSF1= 16.522
##$ABSF2= -4.171173
##$ABSG= 5
##$ABSL= 3
##$ALPHA= 0
##$AQORDER= 0
##$ASSFAC= 0
##$ASSFACI= 0
##$ASSFACX= 0
##$ASSWID= 0
##$AUNMP= <proc_1d>
##$AZFE= 0.1
##$AZFW= 0.1
##$BCFW= 0
##$BC_mod= 0
##$BYTORDP= 0
##$COROFFS= 0
##$CY= 12.5
##$DATMOD= 1
##$DC= 0
##$DFILT= <>
##$DTYPP= 0
##$F1P= 14.0000005364418
##$F2P= -0.99999901652339
##$FCOR= 0.5
##$FTSIZE= 32768
##$FT_mod= 6
##$GAMMA= 0
##$GB= 0
##$INTBC= 1
##$INTSCL= 1
##$ISEN= 128
##$LB= 0.3
##$LEV0= 0
##$LPBIN= 0
##$MAXI= 10000
##$MC2= 0
##$MEAN= 0
##$ME_mod= 0
##$MI= 0
##$NCOEF= 0
##$NC_proc= -4
##$NLEV= 6
##$NOISF1= 0
##$NOISF2= 0
##$NSP= 0
##$NTH_PI= 0
##$NZP= 0
##$OFFSET= 16.522
##$PC= 1
##$PHC0= -73.68565
##$PHC1= 10.52728
##$PH_mod= 1
##$PKNL= yes
##$PPARMOD= 0
##$PSCAL= 4
##$PSIGN= 0
##$REVERSE= no
##$SF= 250.13
##$SI= 32768
##$SIGF1= 0
##$SIGF2= 0
##$SINO= 400
##$SIOLD= 32768
##$SREGLST= <1H.CDCl3>
##$SSB= 0
##$STSI= 32768
##$STSR= 0
##$SW_p= 5175.98343685301
##$SYMM= 0
##$S_DEV= 0
##$TDeff= 65536
##$TDoff= 0
##$TI= <Analysis number 999999
Compound Code 99
Book Reference 9
Project Code 9>
##$TILT= no
##$TM1= 0
##$TM2= 0
##$TOPLEV= 0
##$USERP1= <user>
##$USERP2= <user>
##$USERP3= <user>
##$USERP4= <user>
##$USERP5= <user>
##$WDW= 1
##$XDIM= 32768
##$YMAX_p= 488779823
##$YMIN_p= -365059
$$ End of Bruker specific parameters
$$ ---------------------------------
##NTUPLES= NMR SPECTRUM
##VAR_NAME=  FREQUENCY,     SPECTRUM/REAL,   SPECTRUM/IMAG
##SYMBOL=    X,             R,               I
##VAR_TYPE=  INDEPENDENT,   DEPENDENT,       DEPENDENT
##VAR_FORM=  AFFN,          ASDF,            ASDF
##VAR_DIM=   32768,         32768,           32768
##UNITS=     HZ,            ARBITRARY UNITS, ARBITRARY UNITS
##FACTOR=    0.157963299565203, 1,           1
##FIRST=     4132.6476996994, 0,             0
##LAST=      -1043.33573715361, 0,           0
##MIN=       -1043.33573715361, -365059,     0
##MAX=       4132.6476996994, 488779823,     0
$$ Real data points
##PAGE= N=1
##DATA TABLE= (X++(R..R)), XYDATA
$$ [...]
15735A244157m2444J1637J4074K7739j8712j0820p029n18n103j0561J4100l7986
$$ 1244157 1201713 1213350 1227424 1255163 1236451 1225631 1218602 1218084 1212981 1202420 1216520 1178534
15723A178534k7036q146k4949k9446k7488j327J2687J9858K8251m4554o2394l9789
$$ 1178534 1151498 1143352 1118403 1088957 1061469 1060142 1072829 1092687 1120938 1076384 1013990 974201
15711I74201R389j2983j4571N962N6571j484P240m624j4363J4190K3514J1652
$$ 974201 983590 970607 956036 961998 1018569 1017085 1024325 1019701 1005338 1019528 1043042 1054694
15699A054694r0607n8393P76L0061j1568j9241K7249m427n0089m673l52l7176
$$ 1054694 964087 905694 906470 936531 924963 905722 932971 928544 878455 873782 873430 836254
15687H36254J6708J9579o598o413J381J4369J2866J1071l172k9025j1116K3269
$$ 836254 852962 872541 865943 859530 860911 875280 888146 899217 896045 867020 855904 879173
15675H79173L1734K1520N5047P9224J02986J23313J51535J06629K4789j9902j55138
$$ 879173 910907 932427 987474 1066698 1169684 1292997 1444532 1551161 1575950 1556048 1400910
15664A400910j37726j13719j43747j08359p2307m849k1066k1995l7541k7129k4319
$$ 1400910 1263184 1149465 1005718 897359 825052 820203 799137 777142 739601 712472 688153
15653F88153k6798M3898k0146J2171J0521k279j3303J6920q312k4163m3969r512
$$ 688153 661355 705253 685107 697278 707799 705520 692217 709137 700825 676662 632693 623181
15641F23181J0817l5080K1253Q620k4246l4315j2997q787j9467j1478L9032L2126
$$ 623181 633998 598918 620171 628791 604545 570230 557233 548446 528979 517501 556533 588659
15629E88659k1109j4303k8558L4796K8542J9361l4673m7892k0282J3061O0383
$$ 588659 567550 553247 524689 559485 588027 607388 572715 524823 504541 517602 577985
15618E77985j1182m784m9978j6000J6467k9183k7088O757p528J7267J0264N3998
$$ 577985 566803 562019 512041 496041 512508 483325 456237 462994 455466 472733 482997 536995
15606E36995r976k7592L9130k3550j1846O625j4759n3587k9972l0508k8347J7564
$$ 536995 527019 499427 538557 515007 503161 509786 495027 441440 411468 380960 352613 370177
15594C70177L4178J3407K6998n59l0119j6001J2383m437k756m4309m823M0665
$$ 370177 404355 417762 444760 444201 414082 398081 410464 406027 403271 358962 354139 394804
15582C94804R078L1455L9054k6395J8802l4515n3522o88L4758L6466j1218j699
$$ 394804 403882 435337 474391 447996 466798 432283 378761 378073 412831 449297 438079 436380
15570D36380o475n973l2047k477o201l1249j2487o371J7664K2904L782j1491J3338
$$ 436380 429905 423932 391885 389408 383207 351958 339471 333100 350764 373668 377450 365959 379297
15557C79297m3102m4776J9721K5689M659J3208l0219j5741J5455J3371L4438L3960
$$ 379297 336195 291419 311140 336829 341488 354696 324477 308736 324191 337562 372000 405960
15545D05960j842l1673m1409L173K5782j1625P871k3191p399M6738k1120l4620
$$ 405960 404118 372445 331036 334209 359991 348366 356237 333046 325647 372385 351265 316645
15533C16645l671K2518J7167N134l7990l1328k5957O10n934J4359J8739l705K9290
$$ 316645 312974 335492 352659 357793 319803 288475 262518 263128 257194 271553 290292 286587 315877
15520C15877m363l1352K1453P490m5895k8469M9093R782K610j2289J2357j6735
$$ 315877 311514 280162 301615 309105 263210 234741 283834 293616 296226 283937 296294 279559
15508B79559k9906K1289k5004l898J7791P355n764J1265K4846k3075k4579L1445
$$ 279559 249653 270942 245938 242040 259831 267186 261422 272687 297533 274458 249879 281324
15496B81324L5700J2395n859R010l9795q925l5516j1308J7507N917j1256q633
$$ 281324 317024 329419 323560 332570 292775 283850 248334 237026 254533 260450 249194 240561
15484B40561o033k9264l101M5768J8315J8454L6628k3404N700K698j3296l8241
$$ 240561 234528 205264 202163 247931 266246 284700 321328 297924 303624 306322 293026 254785
15472B54785l0539L1568P741r430j5059k1264j5986o106Q702J6267K591P378K9615
$$ 254785 224246 255814 263555 254125 239066 217802 201816 195710 204412 220679 223270 230648 260263
15459B60263K4526J0047r098l3032n1467j7401K6529j1638j1527k86j272K7838
$$ 260263 284789 294836 285738 252706 201239 183838 210367 198729 187202 186916 185644 213482
15447B13482K9844p41n0548L5364K8713j2736l9368r160k055J0991L483R607J066
$$ 213482 243326 242585 192037 227401 256114 243378 204010 194850 192795 203786 207269 216876 217942
15434B17942l705k5082r713K849P478L5903J9730l4740k3754m867N875p269J1451
$$ 217942 214237 189155 179442 182291 189769 225672 245402 210662 186908 182041 187916 180647 192098
15421A92098J4709k6543M254J5598j9555J0215K3613m4411q568j7266L084n724
$$ 192098 206807 180264 184518 200116 180561 190776 214389 169978 161410 144144 147228 141504
15409A41504k3809N693J0382j426L3935N154K0470J62R277J0306k9880j4945J3386
$$ 141504 117695 123388 133770 132344 166279 171433 191903 192065 201342 211648 181768 166823 180209
15396A80209R932o369K3949Q935k0578j2342k4568k2851j2138K8367K2855m36
$$ 180209 190141 183772 207721 216656 196078 183736 159168 136317 124179 152546 175401 174965
15384A74965r865k6077J9870O305J2118K5591j3961P476j4909L2394j3010q433
$$ 174965 165100 139023 158893 165198 177316 202907 188946 196422 181513 213907 200897 192464
15372A92464M531l3745j8626J3154K6781J6015k4009M028o895j90K4289m568k0133
$$ 192464 196995 163250 144624 157778 184559 200574 176565 180593 173698 173508 197797 193229 173096
15359A73096R722J284j3032l1741m376J2966j5548L1933k0494k2204l5740Q191
$$ 173096 182818 184102 171070 139329 134953 147919 132371 164304 143810 121606 85866 94057
15347I4057N1402M2997L358j7402J045k2913m0087k759J2702k7220n209l5763
$$ 94057 145459 188456 191814 174412 175457 152544 112457 109698 122400 95180 89971 54208
15335E4208m590M1210K5502l3449L027M55j1090K323R594K8567M889O329N463
$$ 54208 49618 90828 116330 82881 85908 86363 75273 77596 87190 115757 120646 126975 132438
15322A32438j8732k1698K5353K4809k5362K984k4161j832N863J5912K715M518
$$ 132438 113706 92008 117361 142170 116808 119792 95631 93799 99662 115574 118289 122807
15310A22807N567j0719k1040l375J3063J8185K4209Q2k9388k1545O810k1331m5429
$$ 122807 128374 117655 96615 93240 106303 124488 148697 148779 119391 97846 104656 83325 37896
15297C7896J2872J6670L513P551L557J536J9197m199R41j8395p731P0126L4123
$$ 37896 50768 67438 70951 78502 82059 83595 102792 98593 99534 81139 73408 143534 177657
15284A77657p350j719M644k601m4001J7411J9480r475j4271k6634m155M4943j9173
$$ 177657 170307 168588 173232 170631 126630 144041 163521 154046 139775 113141 108986 153929 134756
15271A34756m4578m820J6357j685K7340K0146k4283k9379l3557j5159J9726K0675
$$ 134756 90178 85358 101715 100030 127370 147516 123233 93854 60297 45138 64864 85539
15259H5539k2860k1145k0721K0538L542J1330K7568R550L589k4123Q606L2418
$$ 85539 62679 41534 20813 41351 44893 56223 83791 93341 96930 72807 81413 113831
15247A13831j8627r381j058k9901j4600n921J1601J7988k187Q264K1115l0862
$$ 113831 95204 85823 84765 54864 40264 34343 45944 63932 61745 70009 91124 60262
15235F0262k1222N768L9841q187j3215L0556K0087m0230k780J1525j9875j9364
$$ 60262 39040 44808 84649 76462 63247 93803 113890 73660 70880 82405 62530 43166
15223D3166l383L0378j2589J9304J1161J5892K764o1043l2512O776J4350K5093
$$ 43166 39783 70161 57572 76876 88037 103929 106693 45650 13138 19914 34264 59357
15211E9357M3704J6691l5654K4146J2010J8675j011l5203k8871L376K465J6540
$$ 59357 103061 119752 84098 108244 120254 138929 137918 102715 73844 77220 79685 96225
15199I6225q07M970J2124M9119n0423l6102P746M0560K079k1044q699r351J9234
$$ 96225 95418 100388 112512 161631 111208 75106 82852 123412 125491 104447 95748 86397 105631
15186A05631j5537l4189k965K4535K0469k772j8912J2530K812k1166k1089l9655
$$ 105631 90094 55905 52940 77475 97944 95172 76260 88790 91602 70436 49347 9692
15174I692j3206K0597J6303Q899J0740N933J2350m06j072p174J060j8390K8289
$$ 9692 -3514 17083 33386 42285 53025 58958 71308 70902 69830 62656 63716 45326 73615
15161G3615L4001N2042J1822l9472l8472r36j6607n4739J7756K0305l3246Q066
$$ 73615 107616 159658 171480 132008 93536 92600 75993 21254 39010 59315 26069 34135
15149C4135k1507j0336Q440J355o6N0834k2360q716M1931K4467k94j1149l348
$$ 34135 12628 2292 10732 12087 12021 62855 40495 31779 73710 98177 97883 86734 83386
15136H3386k4846k3964m127J8928M419J9619K1870k760O338l0109k4386J5456
$$ 83386 58540 34576 30449 49377 53796 73415 95285 92525 98863 68754 44368 59824
15124E9824K902o470J127l631Q415m576K2593o689r175j310n27n465K0376l849
$$ 59824 62726 56256 57383 53752 62167 57591 80184 73495 64320 63010 62483 57018 77394 73545
15110G3545o2663k1073L8913K8991J6466N436o378N104n033m6005O072M9168l522
$$ 73545 10882 -10191 28722 57713 74179 79615 73237 78341 73308 27303 33375 82543 79021
15097G9021o918j3901R768k6970o47L0355L280J5756K2275n035m5579k8370l6411
$$ 79021 72103 58202 67970 41000 40353 70708 73988 89744 112019 106984 61405 33035 -3376
15084c376J3415M658k251K2074q166M74K4382Q991k9900o920M073K2668L2077
$$ -3376 10039 14697 12446 34520 26354 26828 51210 60201 30301 23381 27454 50122 82199
15071H2199L7655k73j8354n1833L881j0994J500K2980k080j332m0525l1400m54
$$ 82199 119854 119581 101227 49394 53275 42281 43781 66761 64681 63349 22824 -8576 -9030
15058i030J3228j9185j4996M0007K1063M156J4982K8036P983k2601k6784M51Q219
$$ -9030 4198 -14987 -29983 10024 31087 35243 50225 78261 86244 63643 36859 37310 45529
15045D5529j816m063L0439n014k7999K8243j4060n0566J5694o184j816k9859L753
$$ 45529 43713 39650 70089 65075 37076 65319 51259 693 16387 10203 8387 -21472 -17719
15032a7719N9311J7063j1959J6522p012k8006j1904J9246N116l2911l4207N7725
$$ -17719 41592 58655 46696 63218 56206 28200 16296 35542 40658 7747 -26460 31265
15020C1265N7405k291m9966j0007K1303M9741l7645l0411r573R495K8840M1230
$$ 31265 88670 86379 36413 26406 47709 97450 59805 29394 19821 29316 58156 99386
15008I9386R46q276n1558J6846J3224k0418q410Q559K9346K8359J2137M39m1181
$$ 99386 100332 92056 40498 57344 70568 50150 41740 50299 79645 108004 120141 120580 79399
14995G9399l6977l2218j7926q375j1228L4843o304j7372J2053J6549J2149K0096
$$ 79399 42422 10204 -7722 -16097 -27325 7518 1214 -16158 -4105 12444 24593 44689
14983D4689L4852K549j7888o53l012q064j591k6809K1263J2656j3139J7478j7972
$$ 44689 79541 82090 64202 63549 60537 52473 50882 24073 45336 57992 44853 62331 44359
14970D4359j0716K8462K0828j4946N90j6649k6840P516K8095q623k4399k658j7627
$$ 44359 33643 62105 82933 67987 68577 51928 25088 32604 60699 52076 27677 25019 7392
14957G392l2971n4871M1819R857n10L2288K6016J0748j8646j1314L5769j5400
$$ 7392 -25579 -80450 -38631 -28774 -29284 3004 29020 39768 21122 9808 45577 30177
14945C0177r060j2537Q368L2604K6m5343j817M321Q076j819L0046K032O596J1829
$$ 30177 21117 8580 16948 49552 49578 4235 2418 6739 14815 12996 43042 45074 51670 63499
14931F3499K0570l7139q685O780N900K5873M0928k1599o6531n3579K2787L7212
$$ 63499 84069 46930 38245 45025 50925 76798 117726 96127 29596 -23983 -1196 36016
14919C6016j5344k267J3317l5517k3903l712K3622K3943L3980p795k2982M113
$$ 36016 20672 18405 31722 -3795 -27698 -31410 -7788 16155 50135 42340 19358 23471
14907B3471K0111K3865J1552j6686l2290J3734J7043J2901j3606j0476j1259j7151
$$ 23471 43582 67447 78999 62313 30023 43757 60800 73701 60095 49619 38360 21209
14895B1209L368J8509k7762o667j4379P069q305J7669J6526K355Q319J1368J5128
$$ 21209 24577 43086 15324 8657 -5722 1347 -6958 10711 27237 29592 37911 49279 64407
14882F4407j8145k7527k854J3613j9137m816n825Q765l1507m4750K457N2073J0543
$$ 64407 46262 18735 15881 29494 10357 5541 -284 8481 -23026 -67776 -65319 -13246 -2703
14869b703l0173j4102K946J4499j7580L8725k2165K0612r835j6809L263M2221
$$ -2703 -32876 -46978 -44032 -29533 -47113 -8388 -30553 -9941 -19776 -36585 -33322 8899
14857H899K2989j9344r846K2054M675k6625l7024M330K4856L6623M856j0438k4795
$$ 8899 31888 12544 2698 24752 29427 2802 -34222 -29892 -5036 31587 36443 26005 1210
14844A210R131j2931J9294j2049j2271P95L719Q14N121M953R388j4494L2730M165
$$ 1210 10341 -2590 16704 4655 -7616 -6821 -3102 -2288 2833 7786 17174 2680 35410 39575
14830C9575m2819J4056L8689P814l7010J6908K4371m4964J5465J6894J70n186
$$ 39575 -3244 10812 49501 57315 20305 37213 61584 16620 32085 48979 49149 43963
14818D3963k6626r261L807P12Q94L8321O0926k6036m2283j7992J0879k8684R127
$$ 43963 17337 8076 11883 12595 13489 51810 112736 86700 44417 26425 37304 8620 17747
14805A7747J4300r464K5981K3249j5264k5419m0216j9973J7967L9962J5172j5844
$$ 17747 32047 22583 48564 71813 56549 31130 -9086 -29059 -11092 28870 44042 28198
14793B8198j1969r661k5370o890O4774K5594j383m1361m5531M786Q59L534N63
$$ 28198 16229 6568 -18802 -25692 39082 64676 63293 21932 -23599 -18813 -17954 -14420 -13857
14780a3857K7168K9584k1019Q13p893m3839n2394N677J8890L0394L9007J6854
$$ -13857 13311 42895 21876 22689 14796 -29043 -81437 -75760 -56870 -26476 12531 29385
14768B9385j3797O622j6257o3095n321L3857Q502R282J7494J3134k496j5325j7619
$$ 29385 15588 22210 5953 -57142 -62463 -28606 -20104 -10822 6672 19806 17310 1985 -15634
14755a5634l9559L727J2143J856o685J8477J7652j5503J1653O2106m331k7337
$$ -15634 -55193 -51466 -39323 -37467 -44152 -25675 -8023 -23526 -11873 50233 45902 18565
14743A8565n3218r604J8391L5811n232j3231L1923k5604n577J9070L3328L4750
$$ 18565 -34653 -44257 -25866 9945 4713 -8518 23405 -2199 -7776 11294 44622 79372
14731G9372J874j0079J8923o152k7125k5249j9182j1916J6831J6046k0999l2007
$$ 79372 81246 71167 90090 83938 56813 31564 12382 466 17297 33343 12344 -19663
14719a9663p62R586j9701k8109R680J0942l046K0903l421o834J9288r062j1878
$$ -19663 -20425 -10839 -30540 -58649 -48969 -38027 -41073 -20170 -23591 -30425 -11137 -20199 -32077
14706c2077K0803K7842N2385j6954n5017k8939N851J2652J9220K156P797K4782
$$ -32077 -11274 16568 68953 51999 -3018 -31957 -26106 -13454 5766 7922 15719 40501
14694D0501J2356j4147L50l865j8497l2230k1286R866J896Q371L4386K6358j5424
$$ 40501 52857 38710 39060 35195 16698 -15532 -36818 -26952 -25056 -16685 17701 44059 28635
14681B8635l5425l5552j46k583j3245n64K8434M6975J4738j3298L8242j4519p261
$$ 28635 -6790 -42342 -42488 -45071 -58316 -58880 -30446 16529 31267 17969 56211 41692 34431
14668C4431l0731p595l198K6161l3408l6596L3678J3940m202j5641j466J3162
$$ 34431 3700 -3895 -7093 19068 -14340 -50936 -17258 -3318 -7520 -23161 -24627 -11465
14656a1465Q931j587j3971m5979R247L9908J7844j6115q188L360q448J8321J9841
$$ -11465 -2534 -4121 -18092 -64071 -54824 -14916 2928 -13187 -21375 -18015 -26463 -8142 11699
14643A1699P983l1815k4675L3059o241n1539L3756L6096k1589j2472K9449p389
$$ 11699 19682 -12133 -36808 -3749 -9990 -61529 -27773 8323 -13266 -25738 3711 -3678
14631c678p825K2450N1956L3596l7692m5975q162K9561j5958m4082j6394K349
$$ -3678 -11503 10947 62903 96499 58807 12832 4670 34231 18273 -25809 -42203 -39854
14619c9854m183L415K0601j401j6941O131J6975J6476J2674l3361n2140m03L2335
$$ -39854 -44037 -40622 -20021 -21422 -38363 -32232 -15257 1219 13893 -19468 -71608 -72011 -39676
14606c9676J6536R894l4248n479J5112J7690K385k6790R510L2946M1088J1015
$$ -39676 -23140 -13246 -47494 -52973 -37861 -20171 -17786 -44576 -35066 -2120 38968 49983
14594D9983j6368l6954LL5224N059N18L413p32k1722J67J8740j5351m1299p295
$$ 49983 33615 -3339 -3336 31888 36947 37465 40878 40146 18424 18591 37331 21980 -19319 -26614
14580b6614O110Q211K3088q838M1839k914o5J7771k8064n8515J9090L212m9673
$$ -26614 -20504 -12293 10795 1957 43796 40882 40817 58588 30524 -27991 -8901 -5689 -55362
14567e5362j254J0146j6581r003K9021J1613K4499K8105J6325j1709k3018J2799
$$ -55362 -56616 -46470 -63051 -72054 -43033 -31420 -6921 21184 37509 25800 2782 15581
14555A5581L7316R966o011L3404j3641k0223o0153j6154J9321j6456J889K7033
$$ 15581 52897 62863 56852 90256 76615 56392 -3761 -19915 -594 -17050 -15161 11872
14543A1872J9704k8520l161j1087J657l7430K040K000n591K7194J5345l9746m1483
$$ 11872 31576 3056 -105 -11192 -9535 -46965 -44925 -42925 -48516 -21322 -5977 -45723 -87206
14530h7206L5962J2495K0039N2520K4295p934r850l7219J5913K0286m1119l1964
$$ -87206 -51244 -38749 -18710 33810 58105 50171 40321 3102 19015 39301 -1818 -33782
14518c3782P162Q165P115Q945r811K5213K0909M991j2145m5850L3009p34p791
$$ -33782 -26620 -18455 -11340 -2395 -12206 13007 33916 38907 26762 -19088 13921 13187 5396
14505E396L0122j2888k0377p610o909N071Q225j2397J2931K5548j9856j9879r928
$$ 5396 35518 22630 2253 -5357 -12266 -7195 1030 -11367 1564 27112 7256 -12623 -22551
14492b2551L9133L2110J754l6317l416K0479L922l6599l4525m687K3550L9068
$$ -22551 16582 48692 50446 14129 10713 31192 35114 -1485 -36010 -40697 -17147 21921
14480B1921o463o6728J6536p484r113K3778L2670p30j9947l1570K215N490r727
$$ 21921 15458 -51270 -34734 -42218 -51331 -27553 5117 4387 -15560 -47130 -44915 -39425 -49152
14467d9152Q111K1474J4662J6649K6414M011j4807k9544m5835j1882J5165k2805
$$ -49152 -41041 -19567 -4905 11744 38158 42169 27362 -2182 -48017 -59899 -44734 -67539
14455f7539K8134J0646J0145K4603M1776p893k374m447N7310J5041n2486l2443
$$ -67539 -39405 -28759 -18614 5989 47765 39872 37498 33051 90361 105402 52916 20473
14443B0473j882j6399M713N894J5484J7913L043L6m1365j7536J926K9537L2436
$$ 20473 18591 2192 6905 12799 28283 46196 49239 49275 7910 -9626 -7700 21837 54273
14430E4273O003J241L730k415p050j6318k1891m5177k1480L0960J9950l777k8595
$$ 54273 60276 61517 65247 62832 55782 39464 17573 -27604 -49084 -18124 1826 -1951 -30546
14417c0546k8343J8974n218r61N1996p684q144k0604k8495r250N969J1535P4930
$$ -30546 -58889 -39915 -45133 -46094 5902 -1782 -9926 -30530 -59025 -68275 -62306 -50771 24159
14404B4159Q803n1503j8749J3679K582M1675M380p620k1481q296j3304m747P311
$$ 24159 32962 -18541 -37290 -23611 -21029 20646 25026 17406 -4075 -12371 -25675 -30422 -23111
14391b3111J6286j4636m498q574q76P1800J5004m9638k2345O542K2267j7568J1653
$$ -23111 -6825 -21461 -25959 -34533 -35409 36391 51395 1757 -20588 -14046 8221 -9347 2306
14378B306M9127p851o07k757r627L417k3393l4115M57K380k9745P838L7048k6663
$$ 2306 51433 43582 42975 40218 30591 34008 10615 -23500 -23043 -20663 -50408 -42570 -5522 -32185
14364c2185j7264K4133j5312k8250L7870n670m591L1327j7400o921k34P51p482
$$ -32185 -49449 -25316 -40628 -68878 -31008 -36678 -41269 -9942 -27342 -34263 -34497 -33746 -41228
14351d1228k972K151J2601p49K2601L6506q487j3070j2209q654M3614l308l4296
$$ -41228 -44200 -42049 -29448 -30197 -7596 28910 20423 7353 -4856 -13510 30104 26796 -7500
14338g500l4636J3342j2712k3154Q829P717J0271L3447J477J2830l6132k9220
$$ -7500 -42136 -28794 -41506 -64660 -55831 -48114 -37843 -4396 -2919 9911 -26221 -55441
14326e5441r881K6093J1348L411M915j8808K1347K2155O153j6505j0312J5831
$$ -55441 -65322 -39229 -27881 -24470 -19555 -38363 -17016 5139 11292 -5213 -15525 306
14314C06K9131m178q041J9372p871m0708N276k006j7114R082J2464j0025j6616
$$ 306 29437 25259 17218 36590 28719 -11989 -6713 -8719 -25833 -16751 -4287 -14312 -30928
14301c0928L5791J1296K0134n4791l0594j2354J7679K380j1074q657m492j055
$$ -30928 4863 16159 36293 -18498 -49092 -61446 -43767 -41387 -52461 -61118 -65610 -66665
14289f6665J7243L508K5055P023k3900l7036l2186O0888M9348k160j0759K2347
$$ -66665 -49422 -45914 -20859 -13836 -37736 -74772 -106958 -46070 3278 1118 -9641 12706
14277A2706j1659j2876j5699P483o45k0178M374k398j1782j1553K4582j1603l302
$$ 12706 1047 -11829 -27528 -20045 -20690 -40868 -36494 -38892 -50674 -62227 -37645 -49248 -52550
14264e2550L2093M0253n363m223l7254k4152j4701K2056K3657K9145l281l7986
$$ -52550 -20457 19796 14433 10210 -27044 -51196 -65897 -43841 -20184 8961 5680 -32306
14252c2306j2798q11K3164O47J8094J2536k2009l1298l7444K9027K7773J7901
$$ -32306 -45104 -45915 -22751 -22104 -4010 8526 -13483 -44781 -82225 -53198 -25425 -7524
14240g524J8452j8612m5150J32j6583O001K4578L0732J0444m811J7922l8070k0177
$$ -7524 10928 -7684 -52834 -52702 -69285 -63284 -38706 -7974 2470 -2341 15581 -22489 -42666
14227d2666J6379J1118J2504J1344k322l7037L2229o25k4437n788p889K9013J6085
$$ -42666 -26287 -15169 -2665 8679 6357 -30680 1549 924 -23513 -29301 -37190 -8177 7908
14214G908k3144J6803J815l416J7429r468r806J20l3029j5759J3214M5726K8032
$$ 7908 -15236 1567 3382 -34 17395 7927 -1879 -1759 -34788 -50547 -37333 8393 36425
14201C6425K2972l2189m241k0435o8004j4290J4090J5218J0283k0693K3593P200
$$ 36425 59397 27208 22967 2532 -65472 -79762 -65672 -50454 -40171 -60864 -37271 -30071
14189c0071m894O27K9187J5529k759R336l2365k0559p603k01J3262L054P004k1983
$$ -30071 -34965 -34338 -5151 10378 7619 16955 -15410 -35969 -43572 -43773 -30511 -27457 -20453 -42436
14175d2436J1647K4710K2750k0339O995l3551l3480l19J3345L1943j8440j1369
$$ -42436 -30789 -6079 16671 -3668 3327 -30224 -63704 -64023 -50678 -18735 -37175 -48544
14163d8544O3874J4355j9445K5971k824j2353j8390j8175j2867j8263k5609R928
$$ -48544 15330 29685 10240 36211 33387 21034 2644 -15531 -28398 -46661 -72270 -62342
14151f2342J1547M2400j6790k2270j8374k349L1327J1452p902J032O023j3490
$$ -62342 -50795 -8395 -25185 -47455 -65829 -68178 -36851 -25399 -33301 -32269 -26246 -39736
14139c9736r143p829j6139q562J1879l2504L206M2760L6228J1853K4720k1090
$$ -39736 -48879 -56708 -72847 -81409 -69530 -102034 -98828 -56068 -19840 -7987 16733 -4357
14127d357k1701l37J3822J9576q920J553j8208k8345k5640K5783K1198k4325j0622
$$ -4357 -26058 -26395 -12573 7003 -1917 -364 -18572 -46917 -72557 -46774 -25576 -49901 -60523
14114f0523J239n167J1628L8915J6076P117K3161r706K2708j2111j4561K9476
$$ -60523 -59284 -64451 -52823 -13908 2168 9285 32446 22740 45448 33337 18776 48252
14102D8252m0884j8490j3854R133J0377r70J7351J2373k1173j7368l019k83N661
$$ 48252 7368 -11122 -24976 -15843 -5466 -6436 10915 23288 2115 -15253 -18272 -18555 -12894
14089a2894k6956L469j8798j5412J3755o382j817k0789L0646N509N656j0524l686
$$ -12894 -39850 -36381 -55179 -70591 -56836 -63218 -65035 -85824 -55178 -49669 -44013 -54537 -58223
14076e8223J3108P4326L1139l795j6368n6210l7154R638K0729K8186j887o597
$$ -58223 -45115 29211 60350 56555 40187 -16023 -53177 -43539 -22810 5376 3489 -3108
14064c108o216k4799r112k0300J0516J7217o152l4239K4784O5543J8818J1858
$$ -3108 -9324 -34123 -43235 -63535 -53019 -35802 -41954 -76193 -51409 14134 32952 44810
14052D4810k135l6685j5624o91r469L2433l617O067k6001K3842K3877l4586q752
$$ 44810 42675 5990 -9634 -10325 -19794 12639 9022 15089 -10912 12930 36807 2221 -6531
14039f531k5073K4850K33l8802l3968m894k2154N462P592K4540K3987j4398j1501
$$ -6531 -31604 -6754 -6521 -45323 -79291 -84185 -106339 -100877 -93285 -68745 -44758 -59156 -70657
14026g0657M595R05M3724K7727k5555K5265k730k9798j3764N56j3072j1541P8763
$$ -70657 -66062 -65157 -21433 6294 -19261 6004 3274 -26524 -40288 -39732 -52804 -64345 14418
14013A4418L8658j5071m4292R819k022j7264N42Q877k0127l0809L084J6303M658
$$ 14418 53076 38005 -6287 3532 1510 -15754 -15212 -6335 -26462 -57271 -54187 -37884 -33226
14000c3226J5606k0449L4395M3226m7203k4219M130k469J929k2143k4344l523
$$ -33226 -17620 -38069 -3674 39552 -7651 -31870 -27740 -30209 -28280 -50423 -74767 -78290
13988g8290J3759P0710L7366k1503j8145J4976j2795k0020R671J1254P18J8227
$$ -78290 -64531 6179 43545 22042 3897 18873 6078 -13942 -4271 6983 7701 25928
13976B5928k7956m8391K2208J1735k9309K1059Q606R260R956K3109J0340k669
$$ 25928 -2028 -50419 -28211 -16476 -45785 -24726 -16120 -6860 3096 26205 36545 33876
13964C3876l8316l2069J5870K6908J0614l4687n939k779m1074M98r13J1219K0889
$$ 33876 -4440 -36509 -20639 6269 16883 -17804 -23743 -26522 -67596 -67098 -68011 -56792 -35903
13951c5903L3892J84r330K1555j6252j0816k1334l597j334K0937J303K8812L7851
$$ -35903 -2011 -1827 -11157 10398 -5854 -16670 -38004 -41601 -42935 -21998 -20695 8117 45968
13938D5968j9222k8766j2826Q032L1882K1247k8183o429l483l0922K4834L7983
$$ 45968 26746 -2020 -14846 -6814 25068 46315 18132 11703 8220 -22702 2132 40115
13926D0115M8760l9326p4961j9505L6290J4898J3205O771K512k3918o122J955
$$ 40115 88875 49549 -25412 -44917 -8627 6271 19476 26247 28759 4841 -1281 674
13914F74p478Q333K3511K2523L4487M5053M5013N2119P6783M0340k0441n1105
$$ 674 -6804 1529 25040 47563 82050 127103 172116 224235 301018 341358 320917 269812
13902B69812n7325p6955p0599p5321r013M8249L9661K8627L554K1223j2971P313
$$ 269812 212487 135532 64933 -10388 -19401 28848 68509 97136 100690 121913 108942 116255
13890A16255k8524k1745q265o331j2971l138l1190j6932N684K3808O655k0677
$$ 116255 87731 65986 57721 51390 38419 35281 4091 -12841 -7157 16651 23306 2629
13878B629k7645j5845K2491L5806P767j9784j4048M174K1279p2M0264O6053O7374
$$ 2629 -25016 -40861 -18370 17436 25203 5419 -8629 -4455 16824 16752 57016 123069 190443
13865A90443N2757O5567J40773K40173K61960J23591j5042j53055j92036k07352
$$ 190443 243200 308767 449540 689713 951673 1075264 1060222 907167 715131 507779
13855E07779j43019o2935l6294j4029j7060m9397n4584l6644m3146j2464n524
$$ 507779 364760 301825 265531 251502 234442 185045 130461 93817 50671 38207 32683
13844C2683R733J7919J6757j7800M158J1799k6828k9734j0079p395K2390r71R513
$$ 32683 42416 60335 77092 59292 63450 75249 48421 18687 8608 1213 23603 22632 32145
13831C2145l5830k3138K3465l249J1488K6366K4935n580K6176K6161L6612L9369
$$ 32145 -3685 -26823 -3358 -6607 4881 31247 56182 50602 76778 102939 139551 178920
13819A78920O5775J84484K82511L01372J31969p5053j83658k31491j96205j74251
$$ 178920 244695 429179 711690 1013062 1145031 1069978 886320 654829 458624 284373
13809B84373r8388o3557m6865k4905N2918k0452m4441J917K8162j771j4981l7317
$$ 284373 185985 122428 75563 50658 103576 83124 38683 40600 68762 66991 52010 14693
13797A4693J2931j133k1051l0337M310K6791j7221p942R233j6870K0976J5899
$$ 14693 27624 26491 5440 -24897 -20587 6204 -11017 -18959 -9726 -26596 -5620 10279
13785A0279r64k0366k5115m466R373M2735k2551J336K6270O6956L3411L5127O4419
$$ 10279 9315 -11051 -36166 -40632 -31259 11476 -11075 -9739 16531 83487 116898 152025 216444
13772B16444N1385O6626N1618m5216l2764m6438p6993p5693n2704k0452j3957
$$ 216444 267829 334455 386073 340857 308093 261655 184662 108969 56265 35813 21856
13761B1856k401j4849l197P033l518O974k1566k9771j2557J0600j1091L1201p606
$$ 21856 19455 4606 1409 8442 4924 11898 -9668 -39439 -51996 -41396 -52487 -21286 -28892
13748b8892r90j5115N211L6046J833j1436o103j0425K2474L7653p111n9440P1
$$ -28892 -29882 -44997 -39786 -3740 -1907 -13343 -19446 -29871 -7397 30256 23145 -36295 -36224
13735c6224J8158J3768L959L406m676j5988r431k4016l102K3261k2607O066K6365
$$ -36224 -18066 -4298 -339 3067 -1609 -17597 -27028 -51044 -54146 -30885 -53492 -47426 -21061
13722b1061k2270J6272j0621l3368Q905L3165L1248l9062o0058j5890L0103K1393
$$ -21061 -43331 -27059 -37680 -71048 -62143 -28978 2270 -36792 -96850 -112740 -82637 -61244
13710f1244l8656J115M6809L0729J2295l4874j0928M4638L4512m174K8707R730
$$ -61244 -99900 -98785 -51976 -21247 -8952 -43826 -54754 -10116 24396 20222 48929 58659
13698E8659k3470m1591l3539j1648j3862l629M1027K8661J0621j5746l9285j7969
$$ 58659 35189 -6402 -39941 -51589 -65451 -69080 -28053 608 11229 -4517 -43802 -61771
13686f1771J4521J0377O831m810J3838j6687M2296J2026J8675J1890k0273l2336
$$ -61771 -47250 -36873 -30042 -34852 -21014 -37701 4595 16621 35296 47186 26913 -5423
13674e423M956L1761Q928m8653l1139K7217J9748k237j4314P914J7692j4010O968
$$ -5423 -467 31294 40222 -8431 -39570 -12353 7395 5158 -9156 -1242 16450 2440 9408
13661I408p218l950r551M3932L8308J4419M8933J0228M378k5413k8793m2508j6697
$$ 9408 2190 -1760 -11311 32621 70929 85348 134281 144509 148887 123474 94681 52173 35476
13648C5476M8439N732l8420l4332J886K9837M7817j0501k3174J0653K23J6692
$$ 35476 83915 89647 51227 16895 18781 48618 96435 85934 62760 73413 73636 90328
13636I0328j0722k8473k9444j8415j0351K566j7366l3591n815j7556j4426j5930
$$ 90328 79606 51133 21689 3274 -7077 -4511 -21877 -55468 -61283 -78839 -93265 -109195
13624a09195j4352L0618O0345K2868M778K0932k9093k1573L8945K6268K4144J0822
$$ -109195 -123547 -92929 -32584 -9716 -4938 15994 -13099 -34672 4273 30541 54685 65507
13612F5507L4332L2939L722j3785J4832Q836r793O847p042r120j522R246j3829
$$ 65507 99839 132778 136500 122715 137547 146383 136590 143437 136395 127275 125753 134999 121170
13599A21170J5063O822l5543l2967j1934J9633K2469J0705L143l8853n0991m2956
$$ 121170 136233 143055 107512 74545 62611 82244 104713 115418 118561 79708 28717 -14239
13587a4239j9181l480K2903J5681l7759R992Q507r219J5735N8203J2837L1174
$$ -14239 -33420 -36900 -13997 1684 -36075 -26083 -17576 -26795 -11060 47143 59980 91154
13575I1154j6660m5912L0883N3037m0716l9206k2288k4714m005J5407J9306J4321
$$ 91154 74494 28582 59465 112502 71786 32580 10292 -14422 -18427 -3020 16286 30607
13563C0607J2052M6405K9009K1858l4878m3468L9991K8793k4084k1790P680j8250
$$ 30607 42659 89064 118073 139931 105053 61585 101576 130369 106285 84495 92175 73925
13551G3925K3580M2026K8166k892j8144j5721l4699m5756l9548k0807k9345L0898
$$ 73925 97505 139531 167697 164805 146661 130940 96241 50485 10937 -9870 -39215 -8317
13539h317R849K5689L7059L1552J1819M7083L2886J8415j64m3987J2170K2636
$$ -8317 1532 27221 64280 95832 107651 154734 187620 206035 205871 161884 174054 196690
13527A96690k198k960k1879n065K57m9336l8987m6307K001K0287q482K4704K2050
$$ 196690 194492 191532 169653 164588 164845 115509 76522 30215 32216 52503 44021 68725 90775
13514I0775J2788K1599N1479P3957J4466L9332L2426J804M0790K4211r182o199
$$ 90775 103563 125162 176641 250598 265064 304396 336822 338626 379416 403627 394445 388246
13502C88246k9684m8101n3255j0920L1011J6583M0972K2965O845P30k5230L3691
$$ 388246 358562 310461 257206 246286 277297 293880 334852 357817 364662 365392 340162 373853
13490C73853N8193N3448M1050O1285L1912J9500M5396J06773J09103R4183J51629
$$ 373853 432046 485494 526544 587829 619741 639241 684637 791410 900513 994696 1146325
13479A146325K72645L87534L51745Q7618j28044k67002l41288k64985j50906m1737
$$ 1146325 1418970 1806504 2158249 2245867 2117823 1850821 1509533 1244548 1093642 1051905
13469A051905K0416J1791Q1461J26072J09156Q0463J00863J27529J58492J78244
$$ 1051905 1072321 1084112 1165573 1291645 1400801 1481264 1582127 1709656 1868148 2046392
13459B046392K02418K52013L30356M38028N46179P87762J022711J259323J555473
$$ 2046392 2248810 2500823 2831179 3269207 3815386 4603148 5625859 6885182 8440655
13450H440655K128068L241219N210457Q725933J3686186J6433484J0543446o37868
$$ 8440655 10568723 13809942 19020399 27746332 41432518 57866002 68409448 67771580
13442F7771580q494924j2403528j2104240r184313o336685m279251k723097j517170
$$ 67771580 59276656 46873128 34768888 25584575 19247890 14968639 12245542 10728372
13434A0728372n42796K22076M52161k74594j050189j389126j425258j117710p52285
$$ 10728372 10185576 10407652 10859813 10585219 9535030 8145904 6720646 5602936 4850651
13425D850651n01206k27396n4760N5932J75664J87728K08833K61434K93461L48764
$$ 4850651 4349445 4122049 4067289 4123221 4298885 4486613 4695446 4956880 5250341 5599105
13415E599105L92288N41350P36300R25865J242082J728590K299244K881447L497420
$$ 5599105 5991393 6532743 7269043 8194908 9436990 11165580 13464824 16346271 19843691
13406A9843691M533605O241022R244728J4724836K4741965M0305778N3179239
$$ 19843691 24377296 30618318 39863046 54587882 79329847 119635625 172814864
13399A72814864L9861792R07338k6274614l9876712m0523099l0522436k0783662
$$ 172814864 212676656 213583994 187309380 147432668 106909569 76387133 55603471
13392E5603471j3987970r030293n736836l611271k144353j337411j692696k172277
$$ 55603471 41615501 32585208 26848372 23237101 21092748 19755337 18062641 15890364
13384A5890364k244760k160166j768467j277801q80999n23186l53496j79728k0475
$$ 15890364 13645604 11485438 9716971 8439170 7558171 7034985 6681489 6501761 6481286
13375F481286P8431J31285J58632J94214K46670L27162M42292O09443Q72825J228352
$$ 6481286 6559717 6691002 6849634 7043848 7290518 7617680 8059972 8669415 9542240 10770592
13365A0770592J681930K302093K915077L501020M399974O044416Q961330J4252107
$$ 10770592 12452522 14754615 17669692 21170712 25570686 31615102 40576432 54828539
13357E4828539K3871484L9135134N3394337M3587980M450151k5263846m0119748
$$ 54828539 78700023 117835157 171229494 214817474 219267625 194003779 153884031
13350A53884031m2227464l2464211k2107160j4938294r793378o398153m366332
$$ 153884031 111656567 79192356 57085196 42146902 32353524 25955371 21589039
13343B1589039l197106k467214k125754j928979j723852j485603j191419r15259
$$ 21589039 18391933 15924719 13798965 11869986 10146134 8660531 7469112 6553853
13335F553853o60183m98231l63789k78571j99524r6204m0229n2882j2785N4806
$$ 6553853 5893670 5395439 5031650 4753079 4553555 4457351 4417122 4364240 4351455 4406261
13325D406261P5086O8951J54675K53800L37628N13584O94757R00979J136276J479883
$$ 4406261 4481347 4550298 4704973 4958773 5296401 5809985 6504742 7405721 8541997 10021880
13315A0021880K013995K942307M719102P834449J2677915J6963850J3804609K283867
$$ 10021880 12035875 14978182 19697284 27531733 40209648 57173498 70978107 73261974
13307G3261974p548271j2829393j3674407j0930724p662751n259050l515186k344669
$$ 73261974 65713703 52884310 39209903 28279179 20616428 15357378 11842192 9497523
13299I497523j668623j271061j011405q38197o85754m87217l90123l34646l00001
$$ 9497523 7828900 6557839 5546434 4708237 4022483 3535266 3145143 2810497 2510496
13290B510496k55145k69466j80447j17106r9833r0253n6711m1070n4193k2682
$$ 2510496 2255351 1985885 1805438 1688332 1588499 1498246 1441535 1400465 1346272 1323590
13280A323590m8381j7321Q315j5956m4513o461m0391j7525l3679r7544q0030m8861
$$ 1323590 1275209 1257888 1266203 1250247 1205734 1199273 1158882 1141357 1107678 1010134 930104 881243
13268H81243l4884n9302n5797l2701j2488k5067o745k0825n6669J1338K8488L2141
$$ 881243 846359 787057 731260 698559 686071 661004 654259 633434 576765 588103 616591 648732
13256F48732O51j5455j9950J3860k234J6002L0735o672k8338m4527m999m5596
$$ 648732 649383 633928 613978 627838 625604 641606 672341 665669 637331 592804 587805 542209
13244E42209m5612R279k2957J2367R11m8553l1200N485K9321J934q036L1968P617
$$ 542209 496597 505876 482919 495286 496197 447644 416444 421929 451250 453184 445148 477116 484733
13231D84733N128j0932J7081K5691k4052l5747l8737l5812k5110j0933K6751K8873
$$ 484733 489861 478929 496010 521701 497649 461902 423165 387353 362243 351310 378061 406934
13219D06934N693p091P399k8390r36L715j7414J7376K6312j7752l5360m2516l3728
$$ 406934 412627 405536 412935 384545 383609 387324 369910 387286 413598 395846 360486 317970 284242
13206B84242m4891k5845n2854J9516k784l2816k2635j1344K9198M2943N1602M7394
$$ 284242 239351 213506 160652 180168 177384 144568 121933 110589 139787 182730 234332 281726
13194B81726m2246j4432j2341l161K0209O219j905OK2947o200j3326k4682l300
$$ 281726 239480 225048 212707 209546 229755 235974 234069 234075 257022 250822 237496 212814 209514
13181B09514L8734J7706k2623n3394j9357K8405O2759L8076l001k1596m687j1893
$$ 209514 248248 265954 243331 189937 170580 198985 261744 299820 296819 275223 270536 258643
13169B58643l0407j6659J343k911J1782j1912j7934p6579n0780j1608J8184N2943
$$ 258643 228236 211577 212920 210009 221791 209879 191945 115366 64586 52978 71162 124105
13157A24105k0288k6335l2675m9571l1750n294J4080N6648M5453K81k4J3446K0335
$$ 124105 103817 77482 44807 -4764 -36514 -41808 -27728 28920 74373 74654 74630 88076 108411
13144A08411J5138J5633J6952k4340n6433k1505k449M589K1272K3333O936m9582
$$ 108411 123549 139182 156134 131794 75361 53856 51407 55996 77268 100601 107537 57955
13132E7955J3K298j285J8681Q12K4852L9578k5010m558J9890j0023j848k2991
$$ 57955 57968 60266 58981 77662 78474 103326 142904 117894 113336 133226 123203 121355 98364
13119I8364l1893J919K6988O559r798l0180k4612l010J9376O818Q338J0868J274
$$ 98364 66471 68390 95378 101937 92139 61959 37347 34337 53713 60531 68869 79737 81011
13106H1011p995N5932J5169k0828l1338k6459J3970j9159m6983L8318M5200o082
$$ 81011 73016 128948 144117 123289 91951 65492 79462 60303 13320 51638 96838 90756
13094I0756k5032L5442J1108l7134O522m48j3562k0833L1550k2276J3465k1381
$$ 90756 65724 101166 112274 75140 81662 81214 67652 46819 78369 56093 69558 48177
13082D8177l4831J3929J6774R234M06L1587j7545n9663J5590K9437K5461J5869
$$ 48177 13346 27275 44049 53283 53689 85276 67731 8068 23658 53095 78556 94425
13070I4425l0893l6148l3871k4839J6405J4716J6448M3148J2828K4940j2466k5687
$$ 94425 63532 27384 -6487 -31326 -14921 -205 16243 59391 72219 97159 84693 59006
13058E9006j7144K5773r94p21K4194J0558O406j4042o585Q0075K3609L0866L4229
$$ 59006 41862 67635 66641 65920 90114 100672 107078 93036 86451 166526 190135 221001 255230
13045B55230o342m9693k9575k8230j2500Q397O613k2753J3733j2987o435k6494
$$ 255230 248888 199195 169620 141390 128890 137287 143900 121147 134880 121893 115458 88964
13033H8964j8275l246K8456K0216Q6343R1889Q1845Q4504L5496l3536o5722n0654
$$ 88964 70689 67443 95899 116115 202458 294347 376192 460696 496192 462656 396934 346280
13021C46280j8516m8086m5334l5436m8457M101m6464l0895j7692j2621l727O858
$$ 346280 327764 279678 234344 198908 150451 154552 108088 77193 59501 46880 43153 50011
13009E0011L1079K0113k7901J6497k8931l828p372L0045M698k0428l9253j6405
$$ 50011 81090 101203 73302 89799 60868 57040 49668 79713 84411 63983 24730 8325
12997H325J8306o570l1737L7602j3995m039j5554K6529M1418K1429k0051O911
$$ 8325 26631 20061 -11676 25926 11931 7892 -7662 18867 60285 81714 61663 68574
12985F8574J3275j6564j4514K8189R1753L2931K814K242J6454P8061N4314J1449
$$ 68574 81849 65285 50771 78960 170713 203644 206458 208700 225154 303215 357529 368978
12973C68978J5091l2692n9533r0821o0905j5040M215j4037N473O10k1304m0593
$$ 368978 384069 351377 291844 201023 140118 125078 129293 115256 120729 121339 100035 59442
12961E9442J0321q510R747m1335j6868K4064L84k0571J9000M5242j1711j874j2916
$$ 59442 69763 61253 71000 29665 12797 36861 37245 16674 35674 80916 69205 67331 54415
12948E4415J2272R974k3697m7001J9158M6350K6631J4447J1726k0590K4231n717
$$ 54415 66687 76661 52964 5963 25121 71471 98102 112549 124275 103685 127916 122199
12936A22199n171L4761N0988J29975J72873K17665K78005K11124k9185j48697
$$ 122199 117028 151789 202777 332752 505625 723290 1001295 1212419 1183234 1034537
12926A034537j87361k15644j28005j13604r9078l6572l3607p0951k7582q737L0362
$$ 1034537 847176 631532 503527 389923 290845 254273 220666 149715 122133 113396 143758
12915A43758Q31k2443J491o6850o2744k5356L4780O560K2427M0916L3409o352
$$ 143758 144589 122146 123637 56787 -5957 -31313 3467 10027 32454 73370 106779 100427
12903A00427m0294O243M5626Q804m640Q885k9127k0113K1326N7119N3305R920
$$ 100427 60133 66376 112002 120806 116166 125051 95924 75811 97137 154256 207561 217481
12891B17481j0555J4855N8759R8620J16414K17418K50320J77555M5659j06177
$$ 217481 206926 221781 280540 379160 495574 712992 963312 1140867 1186526 1080349
12881A080349k17017k46578j94011r2934p3068p6548l9608j782j0445J9194o228
$$ 1080349 863332 616754 422743 329809 256741 180193 140585 138803 128358 147552 141324
12870A41324k6139j954K5813j698m670j6668n507j4015J1557J1209j6178j8336
$$ 141324 115185 113231 139044 137346 132676 116008 110501 96486 108043 119252 103074 84738
12858H4738o62k7156n3455K7247J4188M926K3690O682N522j8855l6262J5357J6295
$$ 84738 84076 56920 3465 30712 44900 49826 73516 80198 85720 66865 30603 45960 62255
12845F2255J4393J1438K1067L9987Q8130Q0553L3675j9646k4039k8687l0195n7206
$$ 62255 76648 88086 109153 149140 237270 317823 351498 331852 307813 279126 248931 191725
12833A91725m1813j1638j4448m6387J6469o306m2958K635Q511J9357o882l4802
$$ 191725 149912 138274 123826 77439 93908 87602 44644 47279 55790 75147 68265 33463
12821C3463O207j5437p224r589k6356j669J4081M317n238J870J834q222k1146
$$ 33463 39670 24233 17009 7420 -18936 -20605 -6524 -2207 -7445 -5575 -3741 -11963 -33109
12808c3109J5121P718K432M64N815K9917M6387J125j9441k6049p982J4575j7887
$$ -33109 -17988 -10270 -7838 -7374 -1559 28358 74745 75870 56429 30380 22398 36973 19086
12795A9086k1618j3244l584M7257J6703k94J5242P78k1958J1551k5721r143j1753
$$ 19086 -2532 -15776 -19360 27897 44600 44306 59548 60326 38368 49919 24198 15055 3302
12782C302j0221j4442J0499J5709K4552l047O83N606L6201J9284j2245j8970l3707
$$ 3302 -6919 -21361 -10862 4847 29399 26352 27035 32641 68842 88126 75881 56911 23204
12769B3204L308K3558j1780l2158P61J0219J2822J5512K809J7780k7112k7772
$$ 23204 26512 50070 38290 6132 6893 17112 29934 45446 48255 66035 38923 11151
12757A1151K6321l253J9092k0425j1263J5397M89k9240m7653N699M7126O719l6345
$$ 11151 37472 34219 53311 32886 21623 37020 37509 8269 -39384 -33685 13441 20160 -16185
12744a6185K3027N2872O0485q375k5404j2635k8350L4499j4349m2232m7394P464
$$ -16185 6842 59714 120199 111824 86420 73785 45435 79934 65585 23353 -24041 -16577
12732a6577K5861J8874O575r34K488K0393o165N85j8376L7799L3131k0282o2625
$$ -16577 9284 28158 34733 33799 36287 56680 50515 51100 32724 70523 103654 83372 20747
12719B0747j9894K227k9140l072J8072L1220M8094K2452k5969k4967L1630L7940
$$ 20747 853 3080 -26060 -29132 -11060 20160 68254 90706 64737 39770 71400 109340
12707A09340j0337q626l6051n1669k5786N4730M9606J1833m7517L6546P4479K7256
$$ 109340 99003 90377 54326 2657 -23129 31601 81207 93040 45523 82069 156548 183804
12695A83804k8524k2711n686q51p439J7897j3291N628j1599K630l982k5278M897
$$ 183804 155280 132569 126883 126032 118593 136490 123199 128827 117228 119858 115876 90598 95495
12682I5495Q1477R062J9000L4272j1164n8537o046j4017l743J067j0228j1847
$$ 95495 176972 186034 205034 239306 228142 169605 163559 149542 145799 146866 136638 124791
12670A24791J5336o916l358J630L1471L6740O127L120K661J7065k9076j9887K3696
$$ 124791 140127 133211 129853 131483 162954 199694 205821 208941 211602 228667 199591 179704 203400
12657B03400K6284r968p143k7086M401J913M3265L7248O958L1057K7217L0126
$$ 203400 229684 219716 212573 185487 189888 191801 235066 272314 279272 310329 337546 367672
12645C67672O4692O1489Q6208O5927k662p204K1529j5579K8259M7475J02446K31305
$$ 367672 432364 493853 580061 645988 643326 636122 657651 642072 670331 717806 820252 1051557
12633A051557L89321P15176R88934N98198j33381n32717p26797o36380l73098
$$ 1051557 1440878 2156054 3144988 3743186 3609805 3077088 2350291 1713911 1340813
12624A340813k58956k00060j23927j15617m7983M827K9583Q778O18O4227M2226
$$ 1340813 1081857 881797 757870 642253 594270 599097 628680 637458 638076 702303 744529
12613G44529l8267l4978j8413l0014m4908j9739m7385p1672k7819K9401M9657
$$ 744529 706262 671284 652871 622857 577949 558210 510825 439153 411334 440735 490392
12602D90392L3428O727m0389n1116k8319k7270j5254j9052j6606J2392L2621J5633
$$ 490392 523820 530547 490158 439042 410723 383453 368199 349147 332541 344933 377554 393187
12590C93187Q793K2940L8981O3684O2234P6607J4224j2707k6770l0009q803n942
$$ 393187 401980 424920 463901 527585 589819 666426 680650 667943 641173 611164 602361 596419
12578E96419l6801l4634K1955L4250K3893p3n123l1219j9111J8966R469L0j1785
$$ 596419 559618 524984 546939 581189 605082 605009 599886 568667 549556 568522 577991 578021 566236
12565E66236m9866r585J2423j6670l1k3104k8411l3295J1174k825k5511j8019
$$ 566236 516370 506785 519208 502538 502507 479403 450992 417697 428871 426046 400535 382516
12553C82516M2033j2295K5577J4888J8783J4909q571J8133L6379O1767L6767N6211
$$ 382516 424549 412254 437831 452719 471502 486411 477840 495973 532352 594119 630886 687097
12541F87097O6587N7790P9984O2546K5581K8254j7147n064m3136o0375j5069l9291
$$ 687097 753684 811474 891458 954004 979585 1007839 990692 985628 942492 882117 867048 827757
12529H27757p972j7177j266k2165k2254m7831P771j092M749K4155M3027M0679
$$ 827757 819785 802608 801342 779177 756923 709092 716863 715771 720520 744675 787702 828381
12517H28381L3196K3245J2625r8l4844l9785l9152l7014k8461j5706k0970M567
$$ 828381 861577 884822 897447 897349 862505 822720 783568 746554 718093 702387 681417 685984
12505F85984l699k9706k8158k5413J0606M5527J1954q725l696N2639M6591J4753
$$ 685984 682285 652579 624421 599008 609614 655141 667095 658370 654674 707313 753904 768657
12493G68657K6091j5267k6833J4861k371l450k8377k3693J5885Q513k505l6403
$$ 768657 794748 779481 752648 767509 765138 761688 733311 709618 725503 734016 731511 695108
12481F95108j5971n121K5942M0459J6127j0762k1017K552M888J7632J5495J1751
$$ 695108 679137 674016 699958 740417 756544 745782 724765 727317 732205 749837 765332 777083
12469G77083N4442q714l3831j0728J5453l6742o2532p6362p5062o509J0029M29
$$ 777083 831525 822811 788980 778252 793705 756963 694431 618069 543007 536498 546527 546956
12457E46956p310m5255j9556k6442M697K8938l68j2901R237j6045K3165N0551
$$ 546956 539646 494391 474835 448393 453090 482028 481660 468759 477996 461951 485116 535667
12445E35667K0099m2419o7202k1851m0564j6157L7232M7705J9467o793J555L6937
$$ 535667 555766 513347 446145 424294 383730 367573 404805 452510 471977 465184 466739 503676
12433E03676K2635o2420p0459L153N811l0133j9845L7690M9919k9584o9062l3417
$$ 503676 526311 463891 393432 396585 402396 372263 352418 390108 440027 410443 341381 307964
12421C07964J7386M7415J5398j9039l8019j1294p779q817k1847m063R693k6310
$$ 307964 325350 372765 388163 369124 331105 319811 312032 303215 281368 277305 286998 260688
12409B60688k5757q262m7576k2309n553J111j9705q331j589O168N468l4779j6581
$$ 260688 234931 226669 179093 156784 151231 152342 132637 124306 122717 128885 134353 99574 82993
12396H2993J244J1076K6260K789M1873J2898k5015q799n5802l1127M141j9911
$$ 82993 84237 95313 121573 124362 166235 179133 154118 145319 89517 58390 62531 42620
12384D2620J9326n0R163L0129j8589N135N592J7287M5858J3006k4680L1511J1938
$$ 42620 61946 61896 71059 101188 82599 87734 93326 110613 156471 169477 144797 176308 188246
12371A88246k1667n2878M784L3834K7783k9900j4284j14k3996L302K4373M956
$$ 188246 166579 113701 118485 152319 180102 150202 135918 135804 111808 115110 139483 144439
12359A44439r883k1101J2847J609l32m3775P410L1286J561l4614j5685K0467m0035
$$ 144439 134556 113455 126302 127911 127579 83804 91214 122500 124061 89447 73762 94229 54194
12346E4194m219J7559K1683L0039M1709k8085k6962K0049N401k6674m0676P539
$$ 54194 49975 67534 89217 119256 160965 132880 105918 125967 131368 104694 64018 71557
12334G1557O835k9146k0857K0546p567k070L1593L4360K0341m3950l1222k2588
$$ 71557 78392 49246 28389 48935 41368 39298 70891 105251 125592 81642 50420 27832
12322B7832J1818J6483M0258K3688j644l5126j5422L4926q024n5876l8517M4474
$$ 27832 39650 56133 96391 120079 118435 83309 67887 102813 94789 38913 396 44870
12310D4870K1941q855O341r758J6202j568k0952J07J0423q096J2753Q86j1740
$$ 44870 66811 57956 64297 54539 70741 69173 48221 48328 58751 50655 63408 64294 52554
12297E2554j6484j4364K3230L698K943J559L7842O782K0266k3674j1891J1315
$$ 52554 36070 21706 44936 48634 51577 53136 90978 97760 118026 94352 82461 93776
12285I3776j1107q92O653k4830j6043m8274N356k2580o727M171L703L0293K8855
$$ 93776 82669 81777 88430 63600 47557 -717 4639 -17941 -24668 -20497 -16794 13499 42354
12272D2354J2958j3018k6006O0979M8208q856l2894r95J0436K5614K7731j3168
$$ 42354 55312 42294 16288 77267 125475 116619 83725 82730 93166 118780 146511 133343
12260A33343j7323o978R264L894L364j3026l8318l7607j0057J7424K6632J6341
$$ 133343 116020 109042 118306 122200 125564 112538 74220 36613 26556 43980 70612 86953
12248H6953l8052k562J2015K906j1415J0541K6427m0202r877m613O109J1917j5880
$$ 86953 48901 46339 58354 61260 49845 60386 86813 46611 36734 32121 38230 50147 34267
12235C4267j5254J090N703M212j4071L296M210J9201j7688n2990r001M6860K0496
$$ 34267 19013 20103 25806 30018 15947 19243 23453 42654 24966 -28024 -37025 9835 30331
12222C0331j4074j521k293J3038k2215l3350J9895J2048l336l6436j2240L4921
$$ 30331 16257 14736 12443 25481 3266 -30084 -10189 1859 -1477 -37913 -50153 -15232
12210a5232K7951k9032k2060M1053r94L8818J265k7751k3051p793L085K3971M1129
$$ -15232 12719 -16313 -38373 2680 1686 40504 41769 14018 -9033 -16826 -13741 10230 51359
12197E1359l6517n0011k7884r959K4623J1736L1010K6740j0528J55j7894j69p259
$$ 51359 14842 -35169 -63053 -73012 -48389 -36653 -5643 21097 10569 10724 -7170 -7339 -14598
12184a4598k1098K2o178L12K0786L0947K1536L2991j7252n178N934J3109O520
$$ -14598 -35696 -35674 -41852 -41540 -20754 10193 31729 64720 47468 42290 48224 61333 67853
12171F7853K110K8553k5456k6310q059l3470j1245m281j810J4693j1455K0511
$$ 67853 69963 98516 73060 46750 38691 5221 -6024 -10305 -12115 2578 -8877 11634
12159A1634k1782k6712l0370j2597J6455q564l4571l763J7825J8927K2397J1571
$$ 11634 -10148 -36860 -67230 -79827 -63372 -71936 -106507 -110270 -92445 -73518 -51121 -39550
12147c9550P709j2798K7698M3148J0572m3788M235P061P999j0144l6571r30j6192
$$ -39550 -31841 -44639 -16941 26207 36779 -7009 -2774 4287 12286 2142 -34429 -35359 -51551
12134e1551o25r237N3779K8730J067J1988n431j2818N901N636n4362J529K7079
$$ -51551 -52176 -61413 -7634 21096 22163 34151 28720 15902 21803 27439 -26923 -25394 1685
12121A685K6342k8053j705J4370j1533J0298J6062J7586j8722l0421M184j1158
$$ 1685 28027 -26 -1731 12639 1106 11404 27466 45052 26330 -4091 93 -11065
12109a1065N070K8346k4516j8808L845j9679j8718j1933M3171M0843j942k4472
$$ -11065 -5995 22351 -2165 -20973 -17128 -36807 -55525 -67458 -24287 16556 14614 -9858
12097i858o265P2308Q2402M4123M2472K9550j711j8123n3773l0789j6795J580
$$ -9858 -16123 56185 138587 182710 225182 254732 253021 234898 181125 150336 133541 135121
12085A35121l5129J1202Q72n0540K2873K2031n2530o6285N122R188m5885j4126
$$ 135121 99992 111194 112066 61526 84399 106430 53900 -12385 -7263 1925 -43960 -58086
12073e8086O24n761J3840j5155K6236J5625P008K0772J1522m3731p730P839L2463
$$ -58086 -57462 -63223 -49383 -64538 -38302 -22677 -15669 5103 16625 -27106 -34836 -26997 5466
12060E466j6821m535J3331m9952m4579K3789J4415J8021O2275N1434k9067j7835
$$ 5466 -11355 -15890 -2559 -52511 -97090 -73301 -58886 -40865 21410 72844 43777 25942
12048B5942j5149N596J4684j9317n305j4357k8591K6781r34o485Q070L9910K1173
$$ 25942 10793 16389 31073 11756 6451 -7906 -36497 -9716 -10650 -17135 -9065 30845 52018
12035E2018l1372p9620k7745Q782J9492Q298Q693l2495j4819R444K6169L3106
$$ 52018 20646 -58974 -86719 -77937 -58445 -50147 -41454 -73949 -88768 -79324 -53155 -20049
12023b0049o382J1206J0377k0217j1528N543k3995j3067N5893O266m5978K7162
$$ -20049 -26431 -15225 -4848 -25065 -36593 -31050 -55045 -68112 -12219 -5953 -51931 -24769
12011b4769K5810k963k6739l010O960K1432j5931P629k5864K1865M4518l1236
$$ -24769 1041 -1922 -28661 -31671 -24711 -3279 -19210 -11581 -37445 -15580 28938 -2298
11999b298m4402J2841N433n024n710j9655j4917J8095L641J2074J9428j1367j4962
$$ -2298 -46700 -33859 -28426 -33450 -39160 -58815 -73732 -55637 -51996 -39922 -20494 -31861 -46823
11986d6823L332n013m4286J9360P244j2359r366J6254L446J2795J1413k9532o209
$$ -46823 -43491 -48504 -92790 -73430 -66186 -78545 -87911 -71657 -68211 -55416 -44003 -73535 -79744
11973g9744n776k6554j1212J6492J9543o944K6848J5399J1434K1275J831m2270
$$ -79744 -85520 -112074 -123286 -106794 -87251 -94195 -67347 -51948 -40514 -19239 -17408 -59678
11961e9678L4942M7977k6072j9740l0370j5378L7765o786p207o66j3912M5091
$$ -59678 -24736 23241 -2831 -22571 -52941 -68319 -30554 -37340 -44547 -45213 -59125 -14034
11949a4034K3867j3059k5231J541J7868k3894l585N0826k817o718l0533n8363
$$ -14034 9833 -3226 -28457 -26916 -9048 -32942 -36527 14299 11482 4764 -25769 -84132
11937h4132K8955k4558l925L0059L8514J0262L515l3889o1143J9160M4118J1533
$$ -84132 -55177 -79735 -83660 -53601 -15087 -4825 -1310 -35199 -96342 -77182 -33064 -21531
11925b1531l7366k3847r574K9715L5839k8950j6313j1423n1946n798J8606j1501
$$ -21531 -58897 -82744 -92318 -62603 -26764 -55714 -72027 -83450 -135396 -141194 -122588 -134089
11913a34089J7645K8114J8813k5335J2760L1938K8308k2185M400m564M326j5172
$$ -134089 -116444 -88330 -69517 -94852 -82092 -50154 -21846 -44031 -39631 -44195 -39869 -55041
11901e5041j1572l0526P190j3960K5591J9768P165J0719J3839J7168n717l4051
$$ -55041 -66613 -97139 -89949 -103909 -78318 -58550 -51385 -40666 -26827 -9659 -15376 -49427
11889d9427k1645Q057J7453K0351P377n5173L465K1471K7311L2665J5579n8410
$$ -49427 -71072 -63015 -45562 -25211 -17834 -73007 -69542 -48071 -20760 11905 27484 -30926
11877c0926p1K9530O866l3276N905L1529k348j1233M89k3251K7097K5268k8642
$$ -30926 -30997 -1467 5399 -27877 -21972 9557 7209 -4024 -3535 -26786 311 25579 -3063
11864c063K1792q565m620j1695j19j9346l9612M243k979n800m7198K9994L0562
$$ -3063 18729 10164 5544 -6151 -6270 -25616 -65228 -60985 -63964 -69764 -116962 -86968 -56406
11851e6406J4951j4661m3407N523J2891j5970p251K8337K555m2083k3272N3096
$$ -56406 -41455 -56116 -99523 -94000 -81109 -97079 -104330 -75993 -73438 -115521 -138793 -85697
11839h5697N9118N2687o6459l3858r20n409o792J2847K2736j2080k1320l291K4757
$$ -85697 -26579 26108 -40351 -74209 -75129 -80538 -87330 -74483 -51747 -63827 -85147 -88438 -63681
11826f3681j7919q39k9746k6050J7985K0451K7200n985l19J66m0773k2384O4144
$$ -63681 -81600 -82439 -112185 -138235 -120250 -99799 -72599 -78584 -78903 -78737 -119510 -141894 -77750
11813g7750L8642N762J2439p516k464j3611q534J3034K2752M9793r049l9874Q228
$$ -77750 -39108 -33346 -20907 -28423 -30887 -44498 -53032 -39998 -17246 32547 23498 -16376 -8148
11800h148J2975m6312l3978j5544J0555L1671J5923J6490k8092q474L6026O287
$$ -8148 4827 -41485 -75463 -91007 -80452 -48781 -32858 -16368 -44460 -52934 -16908 -10621
11788a0621J6828l2725k2702k0584j5913K2419L9013j1623l2036k2931J5354N1169
$$ -10621 6207 -26518 -49220 -69804 -85717 -63298 -24285 -35908 -67944 -90875 -75521 -24352
11776b4352j3524k0467j6543J149r111k7662K1755L4126K4384L1766k2269k2178
$$ -24352 -37876 -58343 -74886 -73737 -82848 -110510 -88755 -54629 -30245 1521 -20748 -42926
11764d2926p1422n741N9180L7218j511j5975N858j454k623J5243J1264j71k407
$$ -42926 -114348 -120089 -60909 -23691 -25202 -41177 -35319 -36773 -39396 -24153 -12889 -13060 -15467
11751a5467m7294N150K2910q708k8501k129K1713J3540j1880r554j2015K4663
$$ -15467 -62761 -57611 -34701 -43409 -71910 -74039 -52326 -38786 -50666 -60220 -72235 -47572
11739d7572j827K19K2355l799j2756j7270q25N016p248o346L386K1029J7485j2319
$$ -47572 -49399 -49180 -26825 -30624 -43380 -60650 -61475 -56459 -63707 -70053 -66667 -45638 -28153 -40472
11725d0472j4607K2436j3452j2069j3902k1628q550q491j0864l4901l9216L8269
$$ -40472 -55079 -32643 -46095 -58164 -72066 -93694 -102244 -110735 -121599 -156500 -195716 -157447
11713a57447K7527M7459M3394L2237L626j1692N862J0269L657m597n3683k8166
$$ -157447 -129920 -82461 -39067 -6830 -3204 -14896 -9034 1235 4892 295 -53388 -81554
11701h1554M530m6714k2498K6514K993R209j1634J4913J286l3985K0692P686K4366
$$ -81554 -77024 -123738 -146236 -119722 -116729 -107520 -119154 -104241 -102955 -136940 -116248 -108562 -84196
11688h4196J219M0478o195k7115j8356k2177j0572K6665J8514K6678k1047k9531
$$ -84196 -82977 -42499 -48694 -75809 -94165 -116342 -126914 -100249 -81735 -55057 -76104 -105635
11676a05635q043L6342J7007J2136j1877J4475L5202q522k8606K7157k3082k9584
$$ -105635 -113678 -77336 -60329 -48193 -60070 -45595 -10393 -18915 -47521 -20364 -43446 -73030
11664g3030k535J8094j2475R735L0021K1397l6296l9395m757J0100J2863J1010
$$ -73030 -75565 -57471 -69946 -60211 -30190 -8793 -45089 -84484 -89241 -79141 -66278 -55268
11652e5268K8951k6544j2948o70O947O229K2242J8949j0520r206K3057J322l1320
$$ -55268 -26317 -52861 -65809 -66479 -59532 -53303 -31061 -12112 -22632 -31838 -8781 -7459 -38779
11639c8779k5545J4192O398j8700j5302J8220j4051O844l848Q390R450n131j1239
$$ -38779 -64324 -50132 -43734 -62434 -77736 -59516 -73567 -66723 -70571 -62181 -52731 -57862 -69101
11626f9101K5720j0779j1807J9734L1575J2209K985n0925k9913m556R227K1419
$$ -69101 -43381 -54160 -65967 -46233 -14658 -2449 536 -50389 -80302 -84858 -75631 -54212
11614e4212M804K0323L6244j3452o087l129L27O870j5948m0694l5041Q38k004
$$ -54212 -49408 -29085 7159 -6293 -12380 -15509 -15182 -8312 -24260 -64954 -99995 -99157 -101161
11601a01161M0186k0998J0928L033N0021K7980J671j2425k1364j8741K963R06
$$ -101161 -60975 -81973 -71045 -68012 -17991 9989 11660 -765 -22129 -40870 -37907 -37001
11589c7001L270j557J6022M412k1294k6730p694n738J3077J4884J516J8395j9125
$$ -37001 -33731 -35288 -19266 -14854 -36148 -62878 -70572 -76310 -63233 -48349 -46833 -28438 -47563
11576d7563j2567l1048k1397J455M093J9025J4417k1142l151J396q789J8208M232
$$ -47563 -60130 -91178 -112575 -111120 -107027 -88002 -73585 -94727 -97878 -96482 -105271 -87063 -82831
11563h2831j7890K3687j0585M812L1694L1943O586l5894k1827K8103K7664j8165
$$ -82831 -100721 -77034 -87619 -82807 -51113 -19170 -12584 -48478 -70305 -42202 -14538 -32703
11551c2703m5418J0059J631J3711k2826k3231p733P246J2090J1906k0696J9229
$$ -32703 -78121 -68062 -66431 -52720 -75546 -98777 -106510 -99264 -87174 -75268 -95964 -76735
11539g6735N4577o994k4978j4111j5484P588m327k8471J6629O4201J1177J5222
$$ -76735 -22158 -29152 -54130 -68241 -83725 -76137 -80464 -108935 -92306 -28105 -16928 -1706
11527a706j8965l0204L696j411j115l7750J4848K69l892j0359N871q299L6420
$$ -1706 -20671 -50875 -47179 -48590 -49705 -87455 -72607 -72338 -76230 -86589 -80718 -89017 -52597
11514e2597L6381m0680j422M613j227m622m901l0122l1248N6510K6129J7904L6646
$$ -52597 -16216 -56896 -58318 -53705 -54932 -59554 -64455 -94577 -125825 -69315 -43186 -25282 11364
11501A1364N502l9909k216j0493J730K0233J2987k6337o0297k7590M1540L5252
$$ 11364 16866 -23043 -25259 -35752 -34022 -13789 -802 -27139 -87436 -115026 -73486 -38234
11489c8234j5545n2351k1758N7348m416j0687L7760L4891j3454J87j2228K3209
$$ -38234 -53779 -106130 -127888 -70540 -74956 -85643 -47883 -12992 -26446 -26259 -38487 -15278
11477a5278L2670j7676p054J3031k1373q434L8560R074q993k4434j5970p009L5048
$$ -15278 17392 -284 -7338 5693 -15680 -24114 14446 23520 14527 -9907 -25877 -32886 2162
11464B162l709J5279J442P79j9127n236j9787j5899P306k5303O681Q935K5387
$$ 2162 -1547 13732 15174 15953 -3174 -8410 -28197 -44096 -36790 -62093 -55412 -46477 -21090
11451b1090J411j1187J243J6367k6758o674k5965K912M7141J1160o0356j5064
$$ -21090 -19679 -30866 -29623 -13256 -40014 -46688 -72653 -69741 -22600 -11440 -71796 -86860
11439h6860p331j410J3440N6562J5566J0448J88j2110R865J7184L7618j2522q745
$$ -86860 -94191 -95601 -82161 -25599 -10033 415 603 -11507 -1642 15542 53160 40638 31893
11426C1893J869l5521j3231N1804M5971L9467K0805j9245m1917k1818k6975j8293
$$ 31893 33762 -1759 -14990 36814 82785 122252 143057 123812 81895 60077 33102 14809
11414A4809K3110K3872L1295L185k2334k5801k8283k2504o927J0466K4866p496
$$ 14809 37919 61791 93086 96271 73937 48136 19853 -2651 -9578 888 25754 18258
11402A8258l3616k6901K2563K4157n536R674n580J1877J7580J696j9983o127k5199
$$ 18258 -15358 -42259 -19696 4461 -1075 8599 3019 14896 32476 34172 14189 8062 -17137
11389a7137l6555R215K3536q030K1034N3893K9644m635J5544J6404M181k099O2897
$$ -17137 -53692 -44477 -20941 -28971 -7937 45956 75600 70965 86509 102913 107094 104995 167892
11376A67892O5647K8687Q732J0181K0045j3901N219j9845j7645o2849l9991j6314
$$ 167892 233539 262226 270958 281139 301184 287283 292502 272657 255012 192163 152172 135858
11364A35858k6141j6891l0542j390j5704j119l520K9041M0813n223l4342k8139
$$ 135858 109717 92826 62284 60894 45190 44071 40551 69592 110405 105182 70840 42701
11352D2701K8774Q097j9914R433Q722N830n6131l9563r959N0260L0650R81l7132
$$ 42701 71475 79572 59658 69091 77813 83643 27512 -12051 -22010 28250 58900 59881 22749
11339B2749l5950K3938N3522k741l71J4229p86K3481Q669j2760o934Q866M6475
$$ 22749 -13201 10737 64259 61518 61147 75376 74590 98071 106740 93980 87046 95912 142387
11326A42387M7321K2653M4630j6098m196j2442n3003j3908l0975m4229k3172n1011
$$ 142387 189708 212361 256991 240893 236697 224255 171252 157344 126369 82140 58968 7957
11314G957M748j2555L0586L0807K1215k4500k2974j9506J5788K695J8060J1660
$$ 7957 12705 150 30736 61543 82758 58258 35284 15778 31566 34261 52321 63981
11302F3981k4873M642O612M3728Q694m846o625l5520j189N848l5737k2884l398
$$ 63981 39108 43750 50362 94090 102784 97938 91313 55793 54604 60452 24715 1831 -1567
11289a567J5079j6886J843p345K0657N306j3279J9141L038K1009L448j736L4197
$$ -1567 13512 -3374 -1531 -8876 11781 17087 3808 22949 25987 46996 50444 48708 82905
11276H2905K9662k8824k9596k9096L6556L210m7472o247J0626m1270j6397L2078
$$ 82905 112567 83743 54147 25051 61607 64817 17345 11098 21724 -19546 -35943 -3865
11264c865K8850M250j0125m5714K486Q486L2921K1892o854j6267P705L2147K4710
$$ -3865 24985 29235 19110 -26604 -24118 -15632 17289 39181 32327 16060 23765 55912 80622
11251H0622J9359j8217n4499k9290J259k4177l271J7205M481j7495l827L0190
$$ 80622 99981 81764 27265 -2025 -766 -24943 -28214 -11009 -6528 -24023 -27850 2340
11239B340K1999M4852l5310k7993J7900j05k863l9124j8529k09J9843k0088N827
$$ 2340 24339 69191 33881 5888 23788 23683 20820 -18304 -36833 -37042 -17199 -37287 -31460
11226c1460k437O353K5508j3025n2147l4925Q757N206K9226J8743j9628j1070
$$ -31460 -33897 -27544 -2036 -15061 -67208 -102133 -93376 -88170 -58944 -40201 -59829 -70899
11214g0899O770K1941K2570l0583l7813L5156N5004L0569n0652p295j728l719
$$ -70899 -64129 -42188 -19618 -50201 -88014 -52858 2146 32715 -17937 -25232 -26960 -30679
11202c0679j503j9186r772k5020k372K1499j2755L98J3375O540J3558m4499k5571
$$ -30679 -32182 -51368 -61140 -86160 -88532 -67033 -79788 -79390 -66015 -59475 -45917 -90416 -115987
11189a15987J3676O91R543K1758l683m8536J0409j061N499N872L276O5294J0156
$$ -115987 -102311 -101620 -92077 -70319 -74002 -122538 -112129 -113190 -107691 -101819 -98543 -33249 -23093
11176b3093o254J998k695R599m360K6901J1531n1817l5302o557k808J6124N542
$$ -23093 -29347 -27349 -30044 -20445 -24805 2096 13627 -38190 -73492 -80049 -82857 -66733 -61191
11163f1191N11j7520K7098O992o000n885N358O398j6444n0796j7766K0908K6568
$$ -61191 -60680 -78200 -51102 -44110 -50110 -55995 -50637 -44239 -60683 -111479 -129245 -108337 -81769
11150h1769k4878O466o269J3359j4681k4188K741j0962l5143K094M2512R747k231
$$ -81769 -106647 -100181 -106450 -93091 -107772 -131960 -129219 -140181 -175324 -173230 -130718 -120971 -123202
11137a23202J149P008p869m427j4861J4392M0950M8032j2932k8518q25j9009J9556
$$ -123202 -122053 -115045 -122914 -127341 -142202 -127810 -86860 -38828 -51760 -80278 -81103 -100112 -80556
11124h0556M3588k8175k9310P291r143N92J28p693l86J3818j0020j7777j0939
$$ -80556 -36968 -65143 -94453 -87162 -96305 -95713 -95585 -103278 -103664 -89846 -99866 -117643 -128582
11111a28582L9464r277N1891M830k9131Q103k0206J8626O327P143K1327m0498
$$ -128582 -89118 -98395 -46504 -41674 -70805 -62702 -82908 -64282 -57955 -50812 -29485 -69983
11099f9983n4982r859J8694L0242n343p938J7074k3643K56q839K6370k903l2594
$$ -69983 -124965 -134824 -116130 -85888 -91231 -99169 -82095 -105738 -105482 -114321 -87951 -90854 -123448
11086a23448m943K7230K2132J8625p281l15k7646l7998j5491L9722K2810j4979
$$ -123448 -128391 -101161 -79029 -60404 -67685 -68000 -95646 -133644 -149135 -109413 -86603 -101582
11074a01582m6739J2115J6707K1726j2157J5549N954O060K3121m44k6203j7773
$$ -101582 -148321 -136206 -119499 -97773 -109930 -94381 -88427 -82367 -59246 -59690 -85893 -103666
11062a03666j5995J595K4301N0164M0487nj837j2702o07J7811J1700k7120k7967
$$ -103666 -119661 -118066 -93765 -43601 -3114 -3119 -4956 -17658 -18265 -454 11246 -15874 -43841
11049d3841J9118J9075j2555r185K7647j5589m5538P354o227J8966l5223l9668
$$ -43841 -24723 -5648 -18203 -27388 259 -15330 -60868 -53514 -59741 -40775 -75998 -115666
11037a15666j9311J0208P8952J3713l681k5992k9278k7682J1175M5776N9671P992
$$ -115666 -134977 -124769 -45817 -32104 -35785 -61777 -91055 -118737 -107562 -61786 -2115 5877
11025E877R89K5094K7048J3753M1044R0277R1513P643l6631m7540n319K6817O237
$$ 5877 6866 31960 59008 72761 113805 204082 295595 303238 266607 219067 213748 240565 246802
11012B46802N9691N5575l8418k5494K6288M562m2153n1097J9317k1003R7858J33700
$$ 246802 306493 362068 323650 298156 324444 329006 286853 235756 255073 234070 331928 465628
11000D65628J95283J90451R1647M7240k7755r0962n1231J5984Q6895J19166Q5934
$$ 465628 660911 851362 943009 990249 962494 871532 820301 836285 923180 1042346 1128280
10989A128280k7454j05690k11387j63196p8044k1662r0150o8260l4792n1828l0345
$$ 1128280 1100826 995136 783749 620553 542509 520847 430697 362437 327645 275817 245472
10978B45472k8334m0405j2797K3528M1612j5994l2803M257L1772M849L5411N6944
$$ 245472 217138 176733 163936 187464 229076 213082 180279 184536 216308 221157 256568 313512
10966C13512O1198L9766K5501M8293Q9154Q7551K9813K5223K4715L5451P2406
$$ 313512 374710 414476 439977 488270 577424 664975 694788 720011 744726 780177 852583
10955H52583J78201L01028M58851N32988M11182J14259j03985k72323k40071J8086
$$ 852583 1030784 1331812 1790663 2323651 2734833 2849092 2745107 2472784 2232713 2250799
10945B250799K46257K94878J02040j97564m25030n37837n11686l37420k25086
$$ 2250799 2497056 2791934 2893974 2696410 2271380 1733543 1221857 884437 659351
10936F59351j60015j30591o9412p3701o2667l4175r169j3400m3132P427M596M6350
$$ 659351 499336 368745 299333 225632 162965 128790 119621 106221 63089 70516 75112 121462
10924A21462K1895J7015K0157N0060Q129K590M2644j444R392Q250K120M8713O1159
$$ 121462 143357 160372 180529 230589 238718 241308 283952 282508 291900 300150 302270 350983 412142
10911D12142O4759J04603J59021K53642M12582N50612N70883L34553R408k18106
$$ 412142 476901 581504 740525 994167 1406749 1957361 2528244 2862797 2872205 2654099
10901B654099k63763j35022Q4989L31069K95378k1096l39709n10974n28124m59209
$$ 2654099 2390336 2255314 2340303 2671372 2966750 2945654 2605945 2094971 1566847 1107638
10891A107638l03178j93931j47554q8954p8025m5539n3796l2143r375o963k2411
$$ 1107638 804460 610529 462975 374021 295996 250457 196661 164518 155143 148180 125769
10880A25769k8772r3k7788l6376k177L6295K0586j8382Q966k2147k868J749j6998
$$ 125769 96997 96904 69116 32740 30563 66858 87444 69062 78028 55881 53013 54762 37764
10867C7764K037L4721N9208J4457K6204P3794J04516J55178J76665J14155Q4967
$$ 37764 39801 74522 133730 148187 174391 248185 352701 507879 684544 798699 883666
10856H83666k4389j08792o3927k2778R1334J07723N4298l2406r1286j52093j59094
$$ 883666 859277 750485 686558 663780 755114 862837 917135 884729 793443 641350 482256
10845D82256j16825r5823p8920m8869o4283l6624J1988m375j5230k2747k3104
$$ 482256 365431 269608 190688 141819 77536 40912 52900 48525 33295 10548 -12556
10834a2556n4238J9700M3472p803l5028q684K7141J8327m2179j9014K9477m897
$$ -12556 -66794 -47094 -3622 -11425 -46453 -55137 -27996 -9669 -51848 -70862 -41385 -46282
10822d6282m4175R359J9204J4173K7434j4197R791O344l1635R36j83J2360k073
$$ -46282 -90457 -81098 -61894 -47721 -20287 -34484 -24693 -18349 -49984 -49048 -49231 -36871 -38944
10809c8944j4645n927j8431J3331j1997m292j4527J0160j7554m0084O119n989
$$ -38944 -53589 -59516 -77947 -64616 -76613 -80905 -95432 -85272 -102826 -142910 -136791 -142780
10797a42780n643m140O95K8812L7624l3165j1816K5442O173j0628l9391k256R399
$$ -142780 -148423 -152563 -151868 -123056 -85432 -118597 -130413 -104971 -98798 -109426 -148817 -151073 -141674
10784a41674J9166O0555j8831J6133J1206n063J1902J0843r096l2716K5073J9167
$$ -141674 -122508 -61953 -80784 -64651 -53445 -58508 -46606 -35763 -44859 -77575 -52502 -33335
10772c3335O872P021L0307p412l6307j9827l2714m8447K5215m928p474K0082J7662
$$ -33335 -26463 -19442 10865 3453 -32854 -52681 -85395 -133842 -108627 -113555 -121029 -100947 -83285
10759h3285o678L3998K9125l2552J6473j8180j6452k6914r2o73j3816M620M638
$$ -83285 -89963 -55965 -26840 -59392 -42919 -61099 -77551 -104465 -104557 -105230 -119046 -114426 -109788
10746a09788k233K1472K1446j0941l924k981j1014j9288k6024K055r467j4073
$$ -109788 -112021 -90549 -69103 -80044 -83968 -86949 -97963 -117251 -143275 -141220 -150687 -164760
10734a64760K4188k4201j2175K1422k3003K3759J1046K6407r35k5090m94j9919
$$ -164760 -140572 -164773 -176948 -155526 -178529 -154770 -143724 -117317 -118252 -143342 -143836 -163755
10722a63755O496K6559J9887L5177Q990k7419j2824l4985j6518J8510J6165l7475
$$ -163755 -157259 -130700 -110813 -75636 -66646 -94065 -106889 -141874 -158392 -139882 -123717 -161192
10710a61192k2128L9573L1365k3559j4745J9422L0217K662J2102o882j0104K9824
$$ -161192 -183320 -143747 -112382 -135941 -150686 -131264 -101047 -98385 -86283 -93165 -103269 -73445
10698g3445N415J4207m3893j7958L3791k9753l4499j328M144L1142Q091k5115
$$ -73445 -68030 -53823 -97716 -115674 -81883 -111636 -146135 -147463 -143319 -112177 -104086 -129201
10686a29201N053J4061k203K1570L5569k9122j0951r911j2111J7995q328J7829
$$ -129201 -124148 -110087 -112290 -90720 -55151 -84273 -95224 -105135 -117246 -99251 -107579 -89750
10674h9750P792M227M777j8813l398K099k2053k0015j5512J5936N5341J4052l4963
$$ -89750 -81958 -77731 -72954 -91767 -95165 -93066 -115119 -135134 -150646 -134710 -79369 -65317 -100280
10661a00280m1156K5766N4186J2283m3042l146J6623j2260L410J1014n0854j1166
$$ -100280 -141436 -115670 -61484 -49201 -92243 -95389 -78766 -91026 -87616 -76602 -127456 -138622
10649a38622J3354j1425r408p86j3349J277q984j7103M935M8498K821j1429L1222
$$ -138622 -125268 -136693 -146101 -146887 -160236 -158959 -167943 -185046 -180111 -131613 -128792 -140221 -108999
10636a08999J3814J3002J6535j8766m6577p391j8501K4911m528j5328L2465J9000
$$ -108999 -95185 -82183 -65648 -84414 -130991 -138382 -156883 -131972 -136500 -151828 -119363 -100363
10624a00363J1161l7430j8026l04M539M6096J3254q305J550K8485k2134l5387
$$ -100363 -89202 -126632 -144658 -144962 -140423 -94327 -81073 -89378 -87828 -59343 -81477 -116864
10612a16864K3906k6641m195q810n037J4047m139k660J7774R068j4345p0207j5594
$$ -116864 -92958 -119599 -123794 -132604 -137641 -123594 -127733 -130393 -112619 -103551 -117896 -188103 -203697
10599b03697M8607K60j2102j8085k7221M918L5435J0020L3177J1808j2670j1954
$$ -203697 -155090 -154830 -166932 -185017 -212238 -207320 -171885 -161865 -128688 -116880 -129550 -141504
10587a41504K3768J3415j0926q435k8034K4202j0024l859j6238j1796L123l4348
$$ -141504 -117736 -104321 -115247 -123682 -151716 -127514 -137538 -141397 -157635 -169431 -166308 -200656
10575b00656R277O7356J8194r370j4197L435j3642l3814j6486N976J5028K9445
$$ -200656 -191379 -124023 -105829 -115199 -129396 -125961 -139603 -173417 -189903 -183927 -168899 -139454
10563a39454K0875J2618j6921o25m1717p502N4858L9914J4661L2965k1861m2919
$$ -139454 -118579 -105961 -122882 -123507 -165224 -172726 -117868 -77954 -63293 -30328 -52189 -95108
10551i5108J0776L7587m885J2381j9029k5104l4004j8011l5411P845J8106M1466
$$ -95108 -84332 -46745 -51630 -39249 -58278 -83382 -117386 -135397 -170808 -162963 -144857 -103391
10539a03391J4935j5807O247L1585K427J20k6692J3433K3790L1314j5424o0218
$$ -103391 -88456 -104263 -98016 -66431 -64004 -63884 -90576 -77143 -53353 -22039 -37463 -97681
10527i7681O497j3539o88J1756J9881K0864J3922Q226M651j0812Q636o189n5554
$$ -97681 -91184 -104723 -105411 -93655 -73774 -52910 -38988 -30762 -26111 -36923 -28287 -34476 -90030
10514i0030j160L129j972l5514n0373o003j2867O5464K838p988k0758l4722m0259
$$ -90030 -91190 -88061 -90033 -125547 -175920 -181923 -194790 -129326 -126488 -134476 -155234 -189956 -230215
10501b30215K128J9278p671r263M4994M5173j063q969j5007l1643o139J7975R429
$$ -230215 -228087 -208809 -216480 -225743 -180749 -135576 -136639 -145608 -160615 -192258 -198397 -180422 -170993
10488a70993Q412J4507K3428K8265M475m3251P039J5634M504P738J1j5847m4410
$$ -170993 -162581 -148074 -124646 -96381 -91906 -135157 -128118 -112484 -107980 -100242 -100231 -116078 -160488
10475a60488K319j3499P247l038J8855K6165l4255k2484L3054M7213M5536J9957
$$ -160488 -158169 -171668 -164421 -167459 -148604 -122439 -156694 -179178 -146124 -98911 -53375 -33418
10463c3418O745P89j9388J537K4944N858K1899N516L3287Q8899Q4201R8575J65399
$$ -33418 -26673 -25884 -45272 -43735 -18791 -12933 8966 14482 47769 136668 220869 319444 484843
10450D84843J93983J67435J67630J93898K72758L73623K42944N3730n62L4678
$$ 484843 678826 846261 1013891 1207789 1480547 1854170 2097114 2150844 2150282 2184960
10440B184960J28055J07853q8526k23664k66184k51529k16700k05587k12909j99369
$$ 2184960 2313015 2420868 2332342 2108678 1842494 1590965 1374265 1168678 955769 756400
10430G56400j60458j35947n7453J0133N9118Q9029J44468J87734J54477J72940
$$ 756400 595942 459995 402542 412675 471793 560822 705290 893024 1047501 1220441
10420A220441K04057L04147L38640J32970J3451M975N2153R2895j2467k05542
$$ 1220441 1424498 1728645 2067285 2200255 2213706 2218681 2270834 2363729 2351262 2145720
10410B145720k83881k67746k50401k29158k05944k03082j75292j28930r7363q3551
$$ 2145720 1861839 1594093 1343692 1114534 908590 705508 530216 401286 303923 220372
10400B20372p1110n6805k9343m8862l1748K1906j3652J0397j5732m3010k0601
$$ 220372 149262 92457 63114 14252 -17496 4410 -9242 1155 -14577 -57587 -78188
10389g8188J2458k860j0806l1951o080j0894K032j2326J8409j8246Q444Q205m77
$$ -78188 -65730 -68590 -79396 -111347 -117427 -128321 -126289 -138615 -120206 -138452 -130008 -121803 -122280
10376a22280J2959P690O778l22J108M018J2092j1899j4692j1799J1860j895k817
$$ -122280 -109321 -101631 -94853 -95175 -94067 -90049 -77957 -89856 -104548 -116347 -104487 -106382 -109199
10363a09199k540j3602p183q694o129J0314n847K1374m6594m3789j006K0321M3513
$$ -109199 -111739 -125341 -132524 -141218 -147347 -137033 -142880 -121506 -168100 -211889 -212895 -192574 -149061
10350a49061L2968J1576K093l7625p210N6444J3607J456J2500M916l0016l551
$$ -149061 -116093 -104517 -102424 -140049 -147259 -90815 -77208 -75752 -63252 -58336 -88352 -91903
10338i1903k4863k7332j6581k6261R34J2345j4257m2314o350L3139j1105K0891
$$ -91903 -116766 -144098 -160679 -186940 -186006 -173661 -187918 -230232 -236582 -203443 -214548 -193657
10326a93657R236l52R181J9941P43K3021O417l2600L646N2987M7886L1066L3066
$$ -193657 -184421 -184773 -175592 -155651 -154908 -131887 -125470 -158070 -154424 -101437 -53551 -22485 10581
10313A0581o311l6889k2946m6980l5843l624j7168N4823K0571k4540M473O7760
$$ 10581 4270 -32619 -55565 -102545 -138388 -142012 -159180 -104357 -83786 -108326 -103853 -36093
10301c6093M3877M6996J9108L2267P0496M7584j9418k2262K9162L7641J8130n0842
$$ -36093 7784 54780 73888 106155 176651 224235 204817 182555 211717 249358 267488 216646
10289B16646n3403q882K7458k5756o2528j9711m6942m2209m7600K827M8411J1543
$$ 216646 163243 154361 181819 156063 93535 73824 26882 -15327 -62927 -60100 -11689 -146
10277a46n569J2365L4505P1669M4469M5002M3231j2895P923K8282R116O135j9738
$$ -146 -5715 6650 41155 112824 157293 202295 245526 232631 240554 268836 277952 284087 264349
10264B64349n4373o344M186l2736m7936j0464l978l7748k0333q701n617j6053
$$ 264349 209976 203632 207818 175082 127146 116682 112704 74956 54623 45922 40305 24252
10252B4252J1986K6305j3290j3466J7991j2334L159K4430L678L2490K2430k2510
$$ 24252 36238 62543 49253 35787 53778 41444 44603 69033 72711 105201 127631 105121
10240A05121j8125Q800k8072r960j1256j4176q715m86O931l0503m3203k4925m3222
$$ 105121 86996 95796 67724 57764 46508 32332 23617 23131 30062 -441 -43644 -68569 -111791
10227a11791n1397k4672M85Q593M8888K4518J3323J5320J8935K0274L4338J0526
$$ -111791 -163188 -187860 -187375 -178782 -129894 -105376 -92053 -76733 -57798 -37524 -3186 7340
10215G340P992M0874K7306M2035k5949m9000j9433j0896L872p824k5409m2346
$$ 7340 15332 56206 83512 125547 99598 50598 31165 20269 24141 16317 -9092 -51438
10203e1438m6299l4301k8652n3650l7540k6379m5776m1024O594O0474O6259K1279
$$ -51438 -97737 -132038 -160690 -214340 -251880 -278259 -324035 -365059 -358465 -297991 -231732 -210453
10191b10453K9790K1867J2091Q901j613o806L857j9668j6500N1389M0644l623
$$ -210453 -180663 -158796 -146705 -137804 -139417 -146223 -142366 -162034 -178534 -127145 -86501 -90124
10179i0124M7641L4703K6522L7094k3264o376O423R047n893J6839J0527l8964
$$ -90124 -42483 -7780 18742 55836 32572 26196 32619 41666 35773 52612 63139 24175
10167B4175l0333J2081M7611O825j3916n0984j09998q1484k9253R741K5354n761
$$ 24175 -6158 5923 53534 60359 46443 -4541 -114539 -196023 -225276 -215535 -190181 -195942
10155a95942m3515M4708Q7660L1709j6769L5653L9285K9158K8903J1776L3985
$$ -195942 -239457 -194749 -107089 -75380 -92149 -56496 -17211 11947 40850 52626 86611
10144H6611P4397J2321m0550o6961o5103m4278l9800l3896j5819K022j6841l8006
$$ 86611 161008 173329 132779 65818 715 -43563 -83363 -117259 -133078 -131056 -147897 -185903
10132a85903m0385N220J278j7046k122J5026L8169j9422p132J4992L1354L8311
$$ -185903 -226288 -221068 -219790 -236836 -238958 -223932 -185763 -205185 -212317 -197325 -165971 -127660
10120a27660K0838J6825j2979N920L9653J4831P936p427M6743M1987L5568O1766
$$ -127660 -106822 -89997 -102976 -97056 -57403 -42572 -34636 -42063 4680 46667 82235 144001
10108A44001K3802J6804M2349K662K4719O0015L3542L6121N291J8387M700m595
$$ 144001 167803 184607 226956 229618 254337 314352 347894 384015 389306 407693 412393 407798
10096D07798Q8725Q9043j1372L2333K8596O7483N3531Q3934O6880N8493N4487
$$ 407798 496523 585566 574194 606527 635123 702606 756137 840071 906951 965444 1019931
10085A019931Q9083J46541J44699R4813R7328M5334O2375P8526R1653J54086J33918
$$ 1019931 1109014 1255555 1400254 1495067 1592395 1637729 1700104 1778630 1870283 2024369 2158287
10074B158287J28548J72712K24453L47605L80539M29410N82328P44009Q17346
$$ 2158287 2286835 2459547 2684000 3031605 3412144 3841554 4423882 5167891 5985237
10065E985237Q49812J013277J341116J582885J517585J280985J388391J776312
$$ 5985237 6835049 7848326 9189442 10772327 12289912 13570897 14959288 16735600
10057A6735600K276031K555338K696535L483153M691303O476950R351000J3657835
$$ 16735600 19011631 21566969 24263504 27746657 32437960 38914910 48265910 61923745
10049F1923745J9007866K3689418K5779492K7102915L2848907M5694223N9939481
$$ 61923745 80931611 104621029 130400521 157503436 190352343 236046566 295986047
10042B95986047N5246961K7932908J3515630J9740735L8009282L8348260k311389
$$ 295986047 351233008 379165916 392681546 412422281 450431563 488779823 486468434
10035D86468434l2679065m1680646m2053463l9841631m3134110m6440103m4796981
$$ 486468434 453789369 412108723 370055260 330213629 287079519 240639416 195842435
10028A95842435l7178058k6503246j6589959q192361p15101O822815J5903302
$$ 195842435 158664377 132161131 115571172 107378811 106663710 113486525 129389827
10021A29389827K7009130L8481597M4754615M1139539L6373399M3252286N7717765
$$ 129389827 156398957 194880554 239635169 280774708 317148107 360400393 418118158
10014D18118158N1766626J6345831j1600109k1478339j5154662j0280553k5172612
$$ 418118158 469884784 486230615 474630506 453152167 437997505 427716952 402544340
10007D02544340m1903181n0258215m9950705m2536837l5812966l1970223k8658975
$$ 402544340 360641159 310382944 260432239 217895402 182082436 150112213 121453238
10000A21453238k4672958k0016763j5335355j1353926q296012o014703m357201
$$ 121453238 96780280 76763517 61428162 50074236 41778224 35763521 31406320
9993C1406320l285143k616060k276554j986459j670359j384383j169287j053450
$$ 31406320 28121177 25505117 23228563 21242104 19571745 18187362 17018075 15964625
9985A5964625j062007j060340r97538q73139p59344p33175p33710o51554n68399
$$ 15964625 14902618 13842278 12844740 11971601 11212257 10479082 9745372 9093818 8525419
9976H525419m76779m69824l85296l47083l34884k87823k49343k32838k05375k38011
$$ 8525419 8048640 7578816 7193520 6846437 6511553 6223730 5974387 5741549 5536174 5298163
9966E298163k39410j80284j37263j72450j59678j77688j28150q9015r7588j09197
$$ 5298163 5058753 4878469 4741206 4568756 4409078 4231390 4103240 4014225 3916637 3807440
9956C807440q5226r7258q2187r1062q1653q3031o7986r7751j10134n9154o5606
$$ 3807440 3722214 3624956 3542769 3451707 3370054 3287023 3219037 3121286 3011152 2951998 2886392
9945B886392o8967p3507m2432k1952j9961k9485l1108o2162l1490p3982j5882
$$ 2886392 2817425 2743918 2701486 2679534 2659573 2630088 2598980 2536818 2505328 2431346 2415464
9934B415464j2896l6552j7634l2127n523j6769l1654m0746l4333J2366M3018o762
$$ 2415464 2402568 2366016 2348382 2316255 2310732 2293963 2262309 2221563 2187230 2199596 2242614 2235852
9922B235852K0664o715p106J5273l5315k3399k1845k9030k4349m1607k9090o4986
$$ 2235852 2256516 2249801 2242695 2257968 2222653 2199254 2177409 2148379 2124030 2082423 2053333 1988347
9910A988347p0494p6403o1253n5255k5674k4973m170o6133o7478k5233J8784j6767
$$ 1988347 1917853 1841450 1780197 1724942 1699268 1674295 1670125 1603992 1536514 1511281 1530065 1513298
9898A513298k2556j6623n544J1466L8072L3999L1201k859N755J8094l5584p1746
$$ 1513298 1490742 1474119 1468575 1480041 1518113 1552112 1583313 1580454 1586209 1604303 1568719 1496973
9886A496973p4871p972N093o5769q2563n5730O956l7471n6600J963P880k640k1876
$$ 1496973 1422102 1414130 1419223 1353454 1270891 1215161 1222117 1184646 1128046 1130009 1137889 1135249 1113373
9873A113373M604j6633k4015m6695j4697k3176k2845R221k0108j913r588p52r145
$$ 1113373 1117977 1101344 1077329 1030634 1015937 992761 969916 979137 959029 957116 947528 946776 937631
9860I37631j3681J3249J8299J9101n643K1245N1430k6443r105l2086n7368m3788
$$ 937631 923950 937199 955498 974599 968956 990201 1041631 1015188 1006083 973997 916629 872841
9848H72841K2259J0219j7465n6927p9990o5819n2839l4739J3213n346m3797k7579
$$ 872841 895100 905319 887854 830927 750937 685118 632279 597540 610753 605407 561610 534031
9836E34031O479Q673l28N299J9378P627K8224K4372J3053L471L5896K2005P87
$$ 534031 540510 549183 548855 554154 573532 581159 609383 633755 646808 650279 686175 708180 708967
9823G08967m3560n1340j9711m0820q0412r034o646m3496o6161l1969J8102J70
$$ 708967 665407 614067 594356 553536 473124 464090 457444 413948 347787 315818 333920 334090
9811C34090q777K1554K2317P647k4718L131L2964J845j6498Q980L723M0737Q8107
$$ 334090 325313 346867 369184 376831 352113 355244 388208 390053 373555 382535 386258 426995 515102
9798E15102o761p838J453J682l6423L945K8860j8596k1416k7761j1609L120J0131
$$ 515102 508341 500503 501956 503638 467215 471160 500020 481424 460008 432247 420638 423758 433889
9785D33889K3721J117R543j5547L993l6322k0053j2419P196k3045p446L336K4135
$$ 433889 457610 458727 468270 452723 456716 420394 400341 387922 395118 372073 364627 367963 392098
9772C92098p877m2307K2568L4469L4077o768j0693k4818o002q47J272o632j1819
$$ 392098 384221 341914 364482 398951 433028 426260 415567 390749 384747 383900 385172 378540 366721
9759C66721L297l101J019o462K0344K9292l3747j9450j3895J1058J1103k1651
$$ 366721 370018 366917 367936 361474 381818 411110 377363 357913 344018 355076 366179 344528
9747C44528j7430l332O259L2448J0125j5715j5019k048M472m5713n1659P073j360
$$ 344528 327098 323766 330025 362473 372598 356883 341864 339816 344288 298575 246916 253989 252629
9734B52629K1048M7557l817j4994N03j447K334J0294K3156K4373N662M569K2034
$$ 252629 273677 321234 317417 302423 302926 301479 303813 314107 337263 361636 367298 371867 393901
9721C93901K6980j0088p401K646j4912k3103m9979L1118L1298j5231j8617m9005
$$ 393901 420881 410793 403392 406038 391126 368023 318044 349162 380460 365229 346612 297607
9709B97607j8681K4993Q647M965P223m9227k7700J4519j9860K8190O6008K4920
$$ 297607 278926 303919 312566 317531 324754 275527 247827 262346 242486 270676 336684 361604
9697C61604M559R971m6829l8897r271j4327J5035j5847K1452j9151l9846m5668
$$ 361604 366163 376134 329305 290408 281137 266810 281845 265998 287450 268299 228453 182785
9685A82785p363L6149L3340l5404j1963K826o537k6041O0635j4177r348K2728
$$ 182785 175422 211571 244911 209507 197544 200370 193833 167792 228427 214250 204902 227630
9673B27630J4194J6136j2391k8079j3390k655O147J8382j1393R296L2161J7561
$$ 227630 241824 257960 245569 217490 204100 201445 207592 225974 214581 223877 256038 273599
9661B73599L2422m862J139k450K0231k9253m5168k9986k5249J6407Q12K0819R0685
$$ 273599 306021 301159 302298 299848 320079 290826 245658 215672 190423 206830 207642 228461 319146
9648C19146M6518O75l0408K7855J12657P2011M3199O9036J99234K22254K03536
$$ 319146 365664 366339 335931 363786 476443 548454 591653 660689 859923 1082177 1285713
9637A285713J70253J81661K87193L72045K39969N1216m6802k8280J01173P8079
$$ 1285713 1455966 1637627 1924820 2296865 2536834 2588050 2541248 2512968 2614141 2692220
9627B692220j56618k84571k60931k34937k03158j76807k14861j80429j30632j09768
$$ 2692220 2535602 2251031 1990100 1755163 1552005 1375198 1160337 979908 849276 739508
9617G39508n2810l3214Q812J2509J04485J60306J72396J43959J18552K05150K67905
$$ 739508 686698 653484 662296 674805 779290 939596 1111992 1255951 1374503 1579653 1847558
9606A847558L72813K97677J04781m6359o1000N0688O6618m7139k02910k72830
$$ 1847558 2220371 2518048 2622829 2576470 2515470 2566158 2632776 2585637 2382727 2109897
9596B109897k95739k60652k09918j99592j72429j58122j38758j56258n8053l2183
$$ 2109897 1814158 1553506 1343588 1143996 971567 813445 674687 518429 460376 428193
9586D28193k1143n4152m9684j256k374j7937o611q013M217J9626J4130K897Q70
$$ 428193 407050 352898 303214 301958 299584 281647 275036 267023 271240 290866 304996 307893 308763
9573C08763l7158l9016J9440K0809lm5491o0395n900j8538J2028N608J5065L0582
$$ 308763 271605 232589 252029 272838 272835 227344 166949 161049 142511 154539 160147 175212 205794
9560B05794j3279j5499K9728K6402l7294K79L8513J6832j2872Q184K5661K300
$$ 205794 192515 177016 206744 233146 195852 196131 234644 251476 238604 246788 272449 274749
9548B74749L053O126M738P311K742r608j3746o1316m6242K5738M7915n084j6560
$$ 274749 277802 283928 288666 295977 298719 289111 275365 214049 167807 193545 241460 236376 219816
9535B19816j1120j2818k6441l9921j4569K7828M3321k6077k3467l331j5895q766
$$ 219816 208696 195878 169437 129516 114947 142775 186096 160019 136552 133221 117326 108560
9523A08560J9781K2974l807l317p867k4635O528L9723n058J8338k9366n913o276
$$ 108560 128341 151315 147508 144191 136324 111689 118217 157940 152882 171220 141854 135941 129665
9510A29665J8858L7531Q438m7388p434N5673L5658l1252M851L0837m907l6873
$$ 129665 148523 186054 194492 147104 139670 195343 231001 199749 204600 235437 230530 193657
9498A93657l0932O478K579J433j5134k6426L37K1428J7565l082l64J0575j4430
$$ 193657 162725 169203 171782 173215 158081 131655 131992 153420 170985 167903 167539 178114 163684
9485A63684m8180K3025K0439L6188r577j1881j4438J317J3783J9178O472o8504
$$ 163684 115504 138529 158968 195156 185579 173698 159260 160577 174360 193538 200010 131506
9473A31506j5822j8582L806Q091M840j3112m6212K2279M8779J8847j5225p560
$$ 131506 115684 97102 100908 108999 113839 100727 54515 76794 125573 144420 129195 121635
9461A21635r420j471J1369K596J3890K1710p011n4569j1520M398J251J8193j6723
$$ 121635 112215 110744 122113 124709 138599 160309 153298 98729 87209 91607 92858 111051 94328
9448I4328q720M266k3410L9187J3506j6196k1105K9298R886R658k2865J700K4897
$$ 94328 85608 89874 66464 105651 119157 102961 81856 111154 121040 130698 107833 109533 134430
9435A34430L123j3606M2380P843j3284j8740J582q620k0951N657q477j4949n950
$$ 134430 137553 123947 166327 174170 160886 142146 143728 135108 114157 119814 111337 96388 90438
9422I0438J1025l104K457J0506k0393L021M7730M796j3817n374j9097l189K8214
$$ 90438 101463 98359 100816 111322 90929 93950 141680 146476 132659 127285 108188 104999 133213
9409A33213r148l7631n428J3101k287l5084k1971m847K0947K7876m338l999J9546
$$ 133213 124065 86434 81006 94107 91820 56736 34765 29918 50865 78741 74403 70404 89950
9396H9950J0720K6786r887k6563n172K2620K6259j7618l5198M2914L2396o573
$$ 89950 100670 127456 117569 91006 85834 108454 134713 117095 81897 124811 157207 150634
9384A50634J3192l4162l1238l730n723J2808K3432K7895m0513j0164J6567J2505
$$ 150634 163826 129664 98426 94696 88973 101781 125213 153108 112595 102431 118998 131503
9372A31503J7177n258j1048k5762j2800j4572n5896J1290J6185k99K1062K806
$$ 131503 148680 143422 132374 106612 93812 79240 23344 34634 50819 50520 71582 74388
9360G4388j4061K7078O562j8466j1868k7056K5070N9207n390k5557J1747K8325
$$ 74388 60327 87405 93967 75501 63633 36577 61647 120854 115464 89907 101654 129979
9348A29979l5679n4910K610J1615R567k1403j5737J752p0j506J364L4098O507
$$ 129979 94300 39390 42000 53615 63182 41779 26042 27794 27724 26218 27582 61680 68187
9335F8187r209L694K7043j7225J7175m036j4477J1014j6755j2223R069J8065K1474
$$ 68187 58978 62672 89715 72490 89665 85629 71152 82166 65411 53188 62257 80322 101796
9322A01796L87K8670N934k6740Q164p62k4515m493M2534J9408r2122k3009M0089
$$ 101796 102183 130853 136787 110047 118211 117449 92934 88441 130975 150383 58261 35252 75341
9309G5341j4749j8659p803K2436K9449L3412k5777j5007j1279J6587P665L776
$$ 75341 60592 41933 34130 56566 86015 119427 93650 78643 67364 83951 91616 95392
9297I5392M2429p926k8744l2439k131L1259q427j9639J484Q541m7373k1730L7342
$$ 95392 137821 129895 101151 68712 66581 97840 89413 69774 71258 79799 32426 10696 48038
9284D8038K2673k278q202Q04K0807K8345M2769n2928p1362K056N9453J9061j3197
$$ 48038 70711 68433 60231 61035 81842 110187 152956 100028 28666 30722 90175 109236 96039
9271I6039n1277n7241J6452L6233l5406j8459O0008M9767J3218Q511J7783j3381
$$ 96039 44762 -12479 3973 40206 4800 -13659 46349 96116 109334 117845 135628 122247
9259A22247n135J6471K2264j5681J0514j6713k1971r253j5760K1926J3755L9025
$$ 122247 117112 133583 155847 140166 150680 133967 111996 102743 86983 108909 122664 161689
9247A61689k5811k6574K5805N364l4499k095j4686o674N2750N1867m074q646j1319
$$ 161689 135878 109304 135109 140473 105974 103879 89193 82519 135269 187136 183062 174416 163097
9234A63097M037J629J8410J8633m6316j5462M813k5357m3296k0224J6057L1061
$$ 163097 167134 168763 187173 205806 159490 144028 148841 123484 80188 59964 76021 107082
9222A07082L3713L1146l773J6150J2524m9567J3360L674L836N902r97J3346J7634
$$ 107082 140795 171941 168168 184318 196842 147275 160635 164309 168145 174047 173050 186396 204030
9209B04030J8370j457m8654j6981M3006K2855J9125M0820M3738M9665J0239k0653
$$ 204030 222400 220943 172289 155308 198314 221169 240294 281114 324852 374517 384756 364103
9197C64103m933N6568N2189M2825K9757M4464R4195J08514J52582K29218L29173
$$ 364103 359170 415738 467927 510752 540509 584973 679168 787682 940264 1169482 1498655
9186A498655L06732J44166N094n4968j23996j13563j8325M1941N1519J32039J78688
$$ 1498655 1805387 1949553 1954647 1899679 1775683 1662120 1643795 1685736 1737255 1869294 2047982
9175B047982J84571K45260L14789L29775M46291M93015N28288N82510N54398M74448
$$ 2047982 2232553 2477813 2792602 3122377 3568668 4061683 4589971 5172481 5726879 6201327
9165F201327M24600L15460L8613j53872k85571l87394m80622m90658n29069m97179
$$ 6201327 6625927 6941387 6980000 6826128 6540557 6153163 5672541 5181883 4652814 4155635
9155D155635l97786l95182l56322l10314k83522j95100j70974j68654j24554o5907
$$ 4155635 3757849 3362667 3006345 2696031 2412509 2217409 2046435 1877781 1753227 1687320
9145A687320l9757O2616K50796M59920N57365K34775j69422l90667n08302m51920
$$ 1687320 1647563 1710179 1960975 2420895 2978260 3213035 3043613 2652946 2144644 1692724
9135A692724l45817k45009j76597r8681r7557r2492r8900l7551k1516l2679l4676
$$ 1692724 1346907 1101898 925301 826620 729063 636571 537671 500120 478604 445925 411249
9124D11249p326J5097J1152o519m5306k6759k2812R19J3571J2282j3362j4557
$$ 411249 403923 419020 430172 423653 378347 351588 328776 329695 343266 355548 342186 327629
9112C27629p808j6838q291m3561O637L1226p624k7058k0184L8627M8456M9194
$$ 327629 319821 302983 294692 251131 257768 288994 281370 254312 234128 272755 321211 370405
9100C70405N6853O5504J28830K01651K77157J69212m3696j51697k10714k10907
$$ 370405 427258 492762 621592 823243 1100400 1269612 1225916 1074219 863505 652598
9090F52598j42591j16659p1148m9737n3994m1145k5537j620o998j2684O569k9727
$$ 652598 510007 393348 322200 272463 218469 177324 151787 150167 143169 130485 137054 107327
9078A07327k3470o227J8518q273j4287j3153R237M104k416J05J0110Q807j5195
$$ 107327 83857 77630 96148 87875 73588 60435 69672 73776 71360 71465 81575 90382 75187
9065G5187J9114k0450K225L232K956M2293q207m0854K6273M3466L985j8373k5138
$$ 75187 94301 73851 76076 79308 82264 124557 116350 75496 101769 145235 149220 130847 105709
9052A05709n395k5681J146j6624L7900M1777k415K6597l657K8517L4999m633j4913
$$ 105709 100314 74633 75779 59155 97055 138832 136417 163014 159357 187874 222873 218240 203327
9039B03327J0790R899j0280l1272n6947j7454j7253k3043J5917K6566l5425n4383
$$ 203327 214117 224016 213736 182464 125517 108063 90810 67767 83684 110250 74825 20442
9027B0442k0213J1595J528Q080K5927j2182N600K1677m6067m276L2384K0661K0458
$$ 20442 229 11824 13352 21432 47359 35177 40777 62454 16387 12111 44495 65156 85614
9014H5614o627K7775K5204k586O246L072l2324R530L7617K4292L563m6297L7155
$$ 85614 78987 106762 131966 129380 135626 138698 106374 115904 153521 177813 181376 135079 172234
9001A72234K1110r851N8020O1034N7756m236n3745m8968j1744k4770k8481o5548
$$ 172234 193344 183493 241513 302547 360303 356067 302322 253354 241610 216840 188359 122811
8989A22811p3411M8531L9551l52k2394l1213Q071q435K2294K2991M135j6954k9732
$$ 122811 49400 97931 137482 137130 114736 83523 91594 83159 105453 128444 132579 115625 85893
8976H5893q2521n3751j043J4023J5647N2834k4943n018J4754j0655J650J6324
$$ 85893 3372 -50379 -51422 -37399 -21752 31082 6139 1121 15875 5220 6870 23194
8964B3194L4348L6526J7824k9284o4026L787M3390K1234J5015l8351K3357K3338
$$ 23194 57542 94068 111892 82608 18582 22369 65759 86993 102008 63657 87014 110352
8952A10352J6293J3820r791J4849O00l860J5116j3214O62j3788R170m61L155j543
$$ 110352 126645 140465 130674 145523 146123 142263 157379 144165 144827 131039 140209 139748 142903 141360
8938A41360J4652l129K2354R297N517n0821r4951o4326o7131j9009N0041L8605
$$ 141360 156012 152883 175237 184534 190051 139230 44279 -20047 -87178 -106187 -56146 -17541
8926a7541K6836M1364J2432j8877J0451J7403P124L2744M1889l661L3420j3819
$$ -17541 9295 50659 63091 44214 54665 72068 79192 111936 153825 150164 183584 169765
8914A69765j7360J9432n778n1513q8009k2267r11M447j969k8454n25L8161K3747
$$ 169765 152405 171837 166059 114546 26537 4270 3359 7806 5837 -22617 -23142 15019 38766
8901C8766M782j8399l0489l107R886M3156J0905n433L2147K5746k1441j9462o6378
$$ 38766 43548 25149 -5340 -8447 1439 44595 55500 50067 82214 107960 86519 67057 679
8888F79n6116j5897J6687O921J1181K6893L7469K5059P005N784L8139J5501K2849
$$ 679 -55437 -71334 -54647 -47726 -36545 -9652 27817 52876 59881 65665 103804 119305 142154
8875A42154Q3410P9903O0636O1012K0524J2584J8181N6144P7876J04532Q7692
$$ 142154 225564 305467 366103 427115 447639 460223 478404 534548 612424 716956 804648
8864H04648m2372q9683j47096j65639j39208p4138m4114J0413L9293M651l7318
$$ 804648 762276 672593 525497 359858 220650 146512 102398 112811 152104 156755 119437
8853A19437J4574j3812J308l6359M317K2945l886k2781N675L5083N9343K8963
$$ 119437 134011 120199 121507 85148 89465 112410 108524 85743 91418 126501 185844 214807
8841B14807k2452N190j0564O530L1846K8978M1802P6810Q7737P7691N8944Q9411
$$ 214807 192355 197545 186981 193511 225357 254335 296137 372947 460684 538375 597319 686730
8829F86730N4446P5734M5690k4920j2719J0556r319P727J3048k800K2460K8406
$$ 686730 741176 816910 862600 837680 824961 835517 826198 833925 846973 844173 866633 895039
8817H95039O1759R4845J27251J53619J92121K51425K24478K49249K85622L90436
$$ 895039 956798 1051643 1178894 1332513 1524634 1776059 2000537 2249786 2535408 2925844
8807B925844M36449N68839Q63540J300676J915324K300963J830341Q72633J96198
$$ 2925844 3362293 3931132 4794672 6095348 8010672 10311635 12141976 13014609 13210807
8798A3210807O5422N65281J330633K340706L745751N676642Q674118J3940429
$$ 13210807 13276229 13841510 15172143 17512849 21258600 26935242 35609360 49549789
8790D9549789K3771388M0114257N6501688M7956541Q840638k2918520l9907875
$$ 49549789 73321177 113435434 169937122 217893663 226734301 203815781 163907906
8783A63907906m3214430l4271399k3955176j6602520j1291043p666552n283075
$$ 163907906 120693476 86422077 62466901 45864381 34573338 26906786 21623711
8776B1623711l669811k575513j853612j337256r55570p73486p00315n34163l74151
$$ 21623711 17953900 15378387 13524775 12187519 11231949 10458463 9758148 9223985 8849834
8767H849834k45243j35694K6544J53246M09904O72906R23514J439440K290342
$$ 8849834 8604591 8468897 8495441 8648687 9058591 9731497 10655011 12094451 14384793
8758A4384793L564775M621494L687163J608391K97015j21845O56345K254361M218653
$$ 14384793 17949568 22571062 26258225 27866616 28163631 28041786 28698131 30952492 35171145
8749C5171145O778480J0310388J5732874K5325202M3764732P7031475J16000110
$$ 35171145 41949625 52260013 67992887 93318089 137082821 214114296 330114406
8742C30114406J03936765K0247856m4522225q0383280q8907440o9973988m8459990
$$ 330114406 434051171 454299027 409776802 329393522 240486082 170512094 122052104
8735A22052104l3418379k2674588j5348796j0579167p374439n199358l750236
$$ 122052104 88633725 65959137 50610341 40031174 32656735 27457377 23707141
8728B3707141k595071j825204j693515j665466j520862j363255j083225q26087
$$ 23707141 21112070 19286866 17593351 15927885 14407023 13043768 11960543 11134456
8720A1134456o21096m22445j44888J08962K61405M89035Q74783J411273J937781
$$ 11134456 10513360 10090915 9946027 10054989 10316394 10805429 11680212 13091485 15029266
8711A5029266J756901P62407J14692q2831K43455J007923J991852L251171M981265
$$ 15029266 16786167 17548574 17663266 17580435 17823890 18831813 20823665 24074836 29056101
8702B9056101P521341J1947029K0198354L4542358N1608740N0470182J6166172
$$ 29056101 36577442 48524471 68722825 103265183 154873923 205344105 221510277
8695B21510277j8101740l6719126m2840262l5553148k4975119j7199408j1746311
$$ 221510277 203408537 166689411 123849149 88296001 63320882 46121474 34375163
8688C4375163p939841n422637l816656k693377j878892j347445j013171q71550
$$ 34375163 26435322 21012685 17196029 14502652 12623760 11276315 10263144 9391594
8680I391594q44546q58919q29701p25774n70662m67168l35833k65098k08080j25829
$$ 9391594 8547048 7688129 6858428 6132654 5561992 5094824 4758991 4493893 4285813 4159984
8670D159984q5562r8094j49377j56415j09981r8689r6322q1073j01617n0617M0597
$$ 4159984 4074422 3976328 3826951 3670536 3560555 3461866 3365544 3284471 3182854 3132237 3172834
8659C172834K0396j472o7131r2180j30243j40252j82193j42163q4419r0568j06596
$$ 3172834 3193230 3191758 3124627 3032447 2902204 2761952 2579759 2437596 2353177 2262609 2156013
8648B156013r4283q6856n2997l7759J3434J7657l554m2861n5723k2566J7416L3751
$$ 2156013 2061730 1974874 1921877 1884118 1897552 1915209 1911655 1868794 1813071 1790505 1807921 1841672
8636A841672L6435J8217n7231r184J5747l5294j145N2605N7830P1410J26640J93435
$$ 1841672 1878107 1896324 1839093 1829909 1845656 1810362 1809217 1861822 1919652 1991062 2117702 2311137
8624B311137M40317P54417R63792N36711j45594n20482o94659o12566m07429l04479
$$ 2311137 2751454 3505871 4469663 5006374 4860780 4340298 3645639 3033073 2625644 2321165
8614B321165j97727j35296j00709m7604r1866r7615r5008r0463p6232o1332k2255
$$ 2321165 2123438 1988142 1887433 1839829 1747963 1650348 1555340 1464877 1388645 1327313 1305058
8603A305058r248l2707q123J7794K3636J6352p732n1513o0517n2139j2914j0605
$$ 1305058 1295810 1263103 1254980 1272774 1296410 1312762 1305030 1253517 1193000 1140861 1127947 1117342
8591A117342K1551j0875j5790L5564K9648L5882P6990J09883J39713K10394K98105
$$ 1117342 1138893 1128018 1112228 1147792 1177440 1213322 1290312 1400195 1539908 1750302 2048407
8580B048407N80096J144935J880413J722318J91579p76712j286746j321918j014292
$$ 2048407 2628503 3773438 5653851 7376169 7567748 6791036 5504290 4182372 3168080
8571C168080o91400m87215l53734k21963j48163j42446r3109m6048m8257m8343
$$ 3168080 2476680 1989465 1635731 1413768 1265605 1123159 1030050 984002 935745 887402
8561H87402n2393k8277J7484l0688k1828j363p171K55L206o189j6627o0072n3166
$$ 887402 835009 806732 824216 793528 771700 770337 763166 763421 766627 760438 743811 683739 630573
8548F30573r1908k0384O1963J7003L3948M8406K4980N0041N3120J18659J03081
$$ 630573 538665 518281 580244 597247 631195 679601 704581 754622 807742 926401 1029482
8537A029482J27681K42255M37284P75849R89097N02552p1876l85987m42767k19018
$$ 1029482 1157163 1399418 1836702 2612551 3601648 4104200 4032324 3646337 3203570 2984552
8527B984552J94224O60573J010350R73542L50241l55279q44875r92607q84280
$$ 2984552 3178776 3839349 4849699 5823241 6173482 5818203 4973328 3980721 3096441
8518C096441o30001m70791l22718j96627j43138j48687j27498n9078l582j702
$$ 3096441 2466440 1995649 1672931 1476304 1333166 1184479 1056981 997903 994321 992619
8508I92619k7470o0281j18111m8750J958l5013k7277o146r411K6147j1687j1238
$$ 992619 965149 904868 786757 738007 739965 704952 677675 671529 662118 688265 676578 665340
8496F65340R36O0077O4967L1893O4861K4112j7267K8286R1818Q2925Q8388J59075
$$ 665340 666276 726353 791320 823213 888074 912186 894919 923205 1015023 1097948 1186336 1345411
8484A345411K33899K91190M59230P87018J355323K151643K723151J885440J41916
$$ 1345411 1579310 1870500 2329730 3116748 4472071 6623714 9346865 11232305 11374221
8475A1374221j205174j921971j933581j553140j096001p39252m82781l67687k72040
$$ 11374221 10169047 8247076 6313495 4760355 3664354 2925102 2442321 2074634 1802594
8466A802594j87769j25841j02528r8052m9077r7022q3662q9426q0377j9353k3214
$$ 1802594 1614825 1488984 1386456 1288404 1239327 1142305 1058643 969217 888840 869487 846273
8455H46273m8798o038J9323n651K6511N6603O6815M4737L5850m9257m7137l1666
$$ 846273 797475 791437 810760 805109 831620 888223 955038 999775 1035625 986368 939231 907565
8443I07565o104J9400O8142O2143Q4554J03124J31201J77475K73738L81297O96439
$$ 907565 901461 920861 989003 1051146 1135700 1238824 1370025 1547500 1821238 2202535 2898974
8432B898974J034436J083219O00224j25542o75019r24052q44279o48968n02883
$$ 2898974 3933410 5016629 5616853 5491311 4816292 3892240 3047961 2398993 1896110
8423A896110l48829k59822j96050r6128j6974j4974n9304m3874m4312k8181o078
$$ 1896110 1547281 1287459 1091409 995281 978307 963333 904029 860155 815843 787662 781584
8412G81584o3581l6580K4980N098j0306n277o170L5029J7225j4026K6719O3902
$$ 781584 718003 681423 706403 711501 701195 695918 689748 724777 742002 727976 754695 818597
8400H18597J3624l3187J0722N2920O9949M4251N4764J16900J06339O2174k954
$$ 818597 832221 799034 809756 862676 932625 976876 1031640 1148540 1254879 1317053 1314099
8389A314099J722l0205k3721o229P4295J99489J74778L5017j10323j58650k39899
$$ 1314099 1315821 1285616 1261895 1255666 1329961 1529450 1704228 1739245 1628922 1470272 1230373
8378A230373k01269j58793q2830o9754m3013j7170r639k0704k4498k6370j7995
$$ 1230373 1029104 870311 787481 717727 674714 657544 647905 627201 602703 576333 558338
8367E58338j6057p061J1389K641M460N208k9300j849N5302K5015R56N7619R275
$$ 558338 542281 535220 546609 549250 553710 558918 529618 527769 583071 608086 609042 666661 675936
8354F75936j6308M5083R0189R2547J22226R3616O4132K6877o808J1632L136j3201
$$ 675936 659628 704711 794900 887447 1009673 1103289 1167421 1194298 1187490 1199122 1202258 1189057
8342A189057M4967J42375L19310N16184N08480J76123j86243m42097n06371l98825
$$ 1189057 1234024 1376399 1695709 2211893 2720373 2896496 2710253 2268156 1761785 1362960
8332A362960k20585j99702j26214q5817o9526j03124n8487k3816j6957J5108j3430
$$ 1362960 1142375 942673 816459 730642 661116 557992 499505 475689 458732 473840 460410
8321D60410J0054K4225l9142l5334j3545n267P531k058j0663K325P520q508N9060
$$ 460410 470464 494689 455547 420213 406668 401401 408932 406874 396211 398536 406056 397548 456608
8308D56608O7851K1846J3013P9961J16981Q5643N4214M0587l9361p9707l0442
$$ 456608 524459 546305 559318 639279 756260 841903 896117 936704 897343 817636 787194
8297G87194J1695N2407P6836J94272K69701Q9067j09259k19990k08503j56133
$$ 787194 798889 851296 928132 1122404 1392105 1481172 1371913 1151923 943420 787287
8287G87287j19268p5232l6257l6027l1212j5140j7694m9708m6520k6806j9426
$$ 787287 668019 592787 556530 520503 489291 474151 456457 406749 360229 333423 313997
8276C13997O351M3688L194j3343p648J8671L7349J5516P0341j8913k8839Q889
$$ 313997 320348 364036 367230 353887 346239 364910 402259 417775 488116 469203 440364 449253
8264D49253j0470q077J3321P550l0823K5341K6725m166J1046M098J0000N308m7780
$$ 449253 438783 430706 444027 451577 420754 446095 472820 468654 479700 483798 493798 499106 451326
8251D51326q3410j1175K6336l4838l1968j4031p7992J4089K8252L2155j8489n600
$$ 451326 367916 356741 383077 348239 316271 302240 224248 238337 266589 298744 280255 274655
8239B74655m096K5416m708J489J2355n827k84K9457K4492k5194k5633j8931K0731
$$ 274655 270559 295975 291267 292756 305111 299284 299000 328457 352949 327755 302122 283191 303922
8226C03922J0678K2963j0266K517J6353P3014J0265j9352l1639J6511M7548L5808
$$ 303922 314600 337563 327297 329814 346167 419181 429446 410094 378455 394966 442514 478322
8214D78322K6409n1465l4110m8534j2716O008l4544j3169J4546j0316j3133n713
$$ 478322 504731 453266 419156 370622 357906 363914 329370 316201 330747 320431 307298 301585
8202C01585R851M860K352k973m3591k9391M567q925l8111m0700J4706j040l6173
$$ 301585 311436 316296 318648 315675 272084 242693 247260 238335 200224 159524 174230 173190 137017
8189A37017r535J6117J7423K3215M1728K1910m9255k3255J1841P280Q274J0210
$$ 137017 127482 143599 161022 184237 225965 247875 198620 175365 187206 194486 202760 212970
8177B12970P327k2534J1951M2987R46k3614k9845K3194K3875J3460K9968L9349
$$ 212970 220297 197763 209714 252701 253647 230033 200188 223382 247257 260717 290685 330034
8165C30034m27n3553o274k684J1568p566o6937K3336K8209K1199m0284O190J4522
$$ 330034 329607 276054 269780 267096 278664 271098 204161 227497 255706 276905 236621 242811 257333
8152B57333m2434l6672j7021m84j1198j1270K245J3115R29l997J6438L3119J1497
$$ 257333 214899 178227 161206 160722 149524 138254 140499 153614 154543 150546 166984 200103 211600
8139B11600l8149o009K8744J2188l6124J5947O2219k275o5815k6578j730L2980
$$ 211600 173451 167442 196186 208374 172250 188197 250416 248141 182326 155748 154018 186998
8127A86998L0959K21k9420J040j0540n809R269L1346k412j9279M8875K5177P318
$$ 186998 217957 218178 188758 189798 179258 173449 182718 214064 211652 192373 241248 266425 273743
8114B73743p727j9172k2525l2326l6742L0540K4208l665l839k5154J8924o836
$$ 273743 266016 246844 224319 191993 155251 185791 209999 206334 202495 177341 196265 189429
8102A89429k5327k1185J6603K0755q719k4981l713J1499j088L0760L6290o873
$$ 189429 164102 142917 159520 180275 171556 146575 142862 154361 153273 184033 220323 213450
8090B13450j0467l3292J5980l5439n056K3162O434j4451j4607M4987k876l8763
$$ 213450 202983 169691 185671 150232 145176 168338 174772 160321 145714 190701 187825 149062
8078A49062M751L6075m94l421N5445J3141K4125K4421l592j4688j7761J5461N643
$$ 149062 153813 189888 189394 185973 241418 254559 278684 303105 299513 284825 267064 282525 288168
8065B88168J076j8490l2879l1074j7420L9518m449m2846n1164l2856M0326J0099
$$ 288168 289244 270754 237875 206801 189381 228899 224450 181604 130440 97584 137910 148009
8053A48009J687K2780K650k6645j2087j6694J6908L0105j8508l1059l866J5510
$$ 148009 149696 172476 175126 148481 136394 119700 136608 166713 148205 117146 113280 128790
8041A28790k5027J4373J3202J4061L2343J1911K972M804k9860K857J4838L6409
$$ 128790 103763 118136 131338 145399 177742 189653 192625 197429 167569 170426 185264 221673
8029B21673l4996l0087j5954K4407M0367k7056k6199K1339K521j6228L2397J6587
$$ 221673 186677 156590 140636 165043 205410 178354 152155 173494 176015 159787 192184 208771
8017B08771J1191j7074p2039k0402K2883K0665J2561J6413M472l4599n5635j7928
$$ 208771 219962 202888 130849 110447 133330 153995 166556 182969 187441 152842 97207 79279
8005G9279K724J3664N635l1937J8688J7843J3056L6593q853m8262k5125k3598
$$ 79279 82003 95667 101302 69365 88053 105896 118952 155545 146692 98430 73305 49707
7993D9707J5867K940O8364j7539k0410q687J7063N768j809j3314k8083K3834O851
$$ 49707 65574 68514 136878 119339 98929 90242 107305 113073 111264 97950 69867 93701 100552
7980A00552M4711J3603k3557l743j2833m5667K7924L2547p15K3978R602m4064
$$ 100552 145263 158866 135309 131566 118733 73066 100990 133537 132822 156800 166402 122338
7968A22338k0173O28N0116Q124j8261m3617q635Q836K2435M9026n072l1580j6616
$$ 122338 102165 102793 152909 161033 142772 99155 90520 99356 121791 170817 165745 134165 117549
7955A17549k3249L2021K8897j9031M671K2908j6438m5925l2974j6792k6011J7725
$$ 117549 94300 126321 155218 136187 140858 163766 147328 101403 68429 51637 25626 43351
7943D3351M5250J1980L332O022J0256K3173l0340J3402L3793j3648K536M3859
$$ 43351 88601 100581 103913 109935 120191 143364 113024 126426 160219 146571 149107 192966
7931A92966m821j1459j0402j5746p140l1751l9198n1270m0005J0215L0253P0151
$$ 192966 188145 176686 166284 150538 143398 111647 72449 21179 -18826 -8611 21642 91793
7919I1793K4731J6668j1381J2733k0116q834R687O946M417j8016m8113l2772j2632
$$ 91793 116524 133192 121811 134544 114428 105594 115281 122227 126644 108628 60515 27743 15111
7906A5111L2346q340J3139n555J3654N4599J6193l1238m3948k7117J5743j1465
$$ 15111 47457 39117 52256 46701 60355 114954 131147 99909 55961 28844 44587 33122
7894C3122R566M895M9957j5640Q520L1990L4298l7843j6936r354m8104q973R940
$$ 33122 42688 47583 97540 81900 90420 122410 156708 118865 101929 92575 44471 35498 45438
7881D5438n787O526K8886L9187k624P962l8670j0972J7002N538m677j8503K6962
$$ 45438 39651 46177 75063 114250 111626 119588 80918 69946 86948 92486 87809 69306 96268
7868I6268m141j0016K5406l4635l8478L1742M6701j3372k0932k4793j4422l0955
$$ 96268 92127 82111 107517 72882 34404 66146 112847 99475 78543 53750 39328 8373
7856H373O7387M5985J9889L329k8813k2513k2116L4508L3704J0660n5058j2490
$$ 8373 75760 121745 141634 144963 116150 93637 71521 106029 139733 150393 95335 82845
7844H2845n034m42K0373k919K0861J3942k2887J0448L0552k5210n8008J6071L1593
$$ 82845 77811 77369 97742 94823 115684 129626 106739 117187 147739 122529 64521 80592 112185
7831A12185K139o077J3554R870k2577r931Q028J8511j3684r635j2714J5267m234
$$ 112185 114324 108247 121801 131671 109094 99163 107191 125702 112018 102383 89669 104936 100702
7818A00702K997L7989K6290L783N684m069j5232R095J2072n641m0544P330J8868
$$ 100702 103699 141688 167978 171761 177445 173376 158144 167239 179311 173670 133126 140456 159324
7805A59324j6953k8428k7768l723l188K8064j7489K5049O929m3980L70P642j6462
$$ 159324 142371 113943 86175 82452 79264 107328 89839 114888 121817 77837 78207 85849 69387
7792F9387l7383O867K1548R99R874J1772k9107l2085Q763N6746L3296l711j9238
$$ 69387 32004 38871 60419 61418 71292 83064 53957 21872 30635 87381 120677 116966 97728
7779I7728j2269l6081J5984K5686j0354j2417O992K8203J4679m5772L805J6968
$$ 97728 85459 49378 65362 91048 80694 68277 75269 103472 118151 72379 76184 93152
7767I3152l800j1686m3700j5158q728j470K7582L30j8713L1804L6077O028q723
$$ 93152 89352 77666 33966 18808 10080 8610 36192 36522 17809 49613 85690 91718 82995
7754H2995K5086p722J566k2739j0909n879n085p430M1491R374j1697N865O4N022
$$ 82995 108081 100359 101925 79186 68277 62398 57313 49883 91374 100748 89051 94916 94980 100002
7740A00002K400j7905k6160k9424j221K3918M857L0210K3029l2899J7195j9215
$$ 100002 102402 84497 58337 28913 27692 51610 56467 86677 109706 76807 94002 74787
7728G4787J8036J6545J1081j1143n5132k6161R063K249L524j922K6712K4642n64
$$ 74787 92823 109368 120449 109306 54174 28013 37076 39325 42849 40927 67639 92281 91717
7715I1717k3032l7298L0559L0511j1966m8575j5570N138p211L6372j8735j4722
$$ 91717 68685 31387 61946 92457 80491 31916 16346 21484 14273 50645 31910 17188
7703A7188j8465j7318L4021J9851K5232J1749P089j0289K0544L7166k1380n4871
$$ 17188 -1277 -18595 15426 35277 60509 72258 79347 69058 89602 126768 105388 50517
7691E0517K6871K1506J76r439M953j2310k7920j6013K0242R174r071J3909j5482
$$ 50517 77388 98894 99070 89631 94584 82274 54354 38341 58583 67757 58686 72595 57113
7678E7113P506j1210q533J0107L5413J4149m363P588j0116k6809J59K5531P902
$$ 57113 64619 53409 44876 54983 90396 104545 100182 107770 97654 70845 71004 96535 104437
7665A04437K5405J5746l7987j8937l3938m0271J0352R634J2465K2699P514j4800
$$ 104437 129842 145588 107601 88664 54726 14455 24807 34441 46906 69605 77119 62319
7653F2319J0478j3114J6790K221j4584l314J7191Q979J9878L89k9759k5858J3282
$$ 62319 72797 59683 76473 78694 64110 60796 77987 86966 106844 107233 77474 51616 64898
7640F4898J1450K1327L581m582m0708r848n545o792J2043k1622N96j2030r671
$$ 64898 76348 97675 101256 96674 55966 46118 40573 33781 45824 24202 24798 12768 3097
7627C097P188K7341J4458l4156l538M5739N5746M95j1289k6530J0007j8721m1311
$$ 3097 10285 37626 52084 17928 14390 60129 115875 116370 105081 78551 88558 69837 28526
7614B8526j8857J0961Q430J7844j9492j5410K029J674K0838R487P096j7412J3543
$$ 28526 9669 20630 29060 46904 27412 12002 14031 15705 36543 46030 53126 35714 49257
7601D9257J1704r152j7593l6581j5268l261K598N6758J1373k0331L4712L7409
$$ 49257 60961 51809 34216 -2365 -17633 -20894 -18296 38462 49835 29504 64216 101625
7589A01625m083k7315k8633L464o0665k4684M2238M4474J7541k0120l5567j9487
$$ 101625 97542 70227 41594 45058 -15607 -40291 1947 46421 63962 43842 8275 -11212
7577a1212N586L876p846m902K0616n170j0839K5195J9544J1115J7956J8032J6493
$$ -11212 -5626 -1750 -9596 -14498 6118 948 -9891 15304 34848 45963 63919 81951 98444
7564I8444j5479j0674k6359k3302J2585J4231R223k823J3911r799k3009J3323
$$ 98444 82965 72291 45932 22630 35215 49446 58669 55846 69757 59958 36949 50272
7552E0272P042j525j8661M5407l6037l7181K7758L8041O459k5239m455n2415Q376
$$ 50272 57314 55789 37128 82535 46498 9317 37075 75116 81575 56336 51881 -534 7842
7539G842M4580p616m3605j4962J2137j8044m035k174J5038L0368K3031K0717j956
$$ 7842 52422 44806 1201 -13761 -1624 -19668 -23703 -25877 -10839 19529 42560 63277 61321
7526F1321j4360J1243K2351Q901J541j1549J39r567L752j4531k4226m337J0817
$$ 61321 46961 58204 80555 89456 90997 79448 79587 70020 73772 59241 35015 30678 41495
7513D1495L0055J3187m3852k7278K8207K2348r70l1334J220K3131Q364k819j1766
$$ 41495 71550 84737 40885 13607 41814 64162 63192 31858 33078 56209 64573 61754 49988
7500D9988r362j407j6220L7686M0895j5293m7570k744L1071L4904k420k6507o879
$$ 49988 40626 39219 22999 60685 101580 86287 38717 35973 67044 101948 99528 73021 66142
7487F6142j0734m810L0926l8148J1923m387k3931J6184L9738k9471k0846J370
$$ 66142 55408 50598 81524 43376 55299 50912 26981 43165 82903 53432 32586 33956
7475C3956N5746J7990l5632j2422j9279L2720L0551p917l2673j1926j7024q273
$$ 33956 89702 107692 72060 59638 40359 73079 103630 95713 63040 51114 34090 25817
7463B5817O575k859L9490J1436J656k5454j846j2055j8028L6313J7214k3683p757
$$ 25817 32392 29533 69023 80459 82115 56661 54815 42760 24732 61045 78259 54576 46819
7450D6819m1775l490M1669L7462J1196M194k0944p2654N329J2141L1008j799k9329
$$ 46819 5044 1554 43223 80685 91881 96075 75131 2477 7806 19947 50955 49156 19827
7437A9827l7073K588J7625J0834J0814K2580N072J9675q14j9990K5490j6261J576
$$ 19827 -17246 -14658 2967 13801 24615 47195 52267 71942 71128 51138 76628 60367 61943
7424F1943N831K9949k5695l0175l3046K91K8370k203M612J778L723q075L073j4979
$$ 61943 67774 97723 72028 41853 8807 9098 37468 35265 39877 41655 45378 37303 40376 25397
7410B5397K772j0130j8611q587L8986N7457J6633j1092j6581j0107Q876j4369
$$ 25397 28169 18039 -572 -9159 29827 87284 103917 92825 76244 66137 75013 60644
7398F0644K933j8066j5422o469K3763J0491J4093K0026n9963j5978O014R516j93
$$ 60644 63577 45511 30089 23620 47383 57874 71967 91993 32030 16052 22066 31582 31389
7385C1389j1009J2716N9802k9736l4931m1883m0556k8368n939K8130M4352K7776
$$ 31389 20380 33096 92898 63162 28231 -13652 -54208 -82576 -88515 -60385 -16033 11743
7373A1743K1353j5754J8708J3130Q207K5956M835j521r665q618J4298k8425l3399
$$ 11743 33096 17342 36050 49180 57387 83343 88178 86657 76992 68374 82672 54247 20848
7360B0848k6881K7071n299L4828K0656N558j4945k4157M98L843Q810J3875Q03
$$ 20848 -6033 21038 15739 50567 71223 76781 61836 37679 38177 42020 50830 64705 65508
7347F5508j45K48j945Q775P473n577k3382k5181M4199L3058Q945j2694o247p198
$$ 65508 65363 65611 63666 72441 79914 74337 50955 25774 69973 103031 111976 99282 93035 85837
7333H5837m5026k44M4882N6192j9031n3658j7443K8320j5576j9255m1628k9316
$$ 85837 40811 40567 85449 141641 122610 68952 51509 79829 64253 44998 3370 -25946
7321b5946R125O959j467M2022J2992n328J078J7020l0915j8897L2208M5612L3654
$$ -25946 -16821 -9862 -11329 30693 43685 38357 39435 56455 25540 6643 38851 84463 118117
7308A18117j4342l3100K220p146l1353L229N971M318p584N724K9371M9874j6316
$$ 118117 103775 70675 72895 65749 34396 37625 43596 47914 40330 46054 75425 125299 108983
7295A08983n4583j536K3477J2896k0573L010k1025k9174L0316J3486P641R557
$$ 108983 54400 52864 76341 89237 68664 71674 50649 21475 51791 65277 72918 82475
7283H2475J2398k7839K021j4498J6661l382k8456l445N460k0849N193K4602j4066
$$ 82475 94873 67034 69055 54557 71218 67836 39380 35935 41395 20546 25739 50341 36275
7270C6275j3005J5705j3079j4208l456J1210l0964L8378J4120k2884k3755J9801
$$ 36275 23270 38975 25896 11688 8232 19442 -11522 26856 40976 18092 -5663 14138
7258A4138M844K678P491P148k9543k0679k592q861j3562p272L2086J7644K0288
$$ 14138 18982 21660 29151 36299 6756 -13923 -16515 -25376 -38938 -46210 -14124 3520 23808
7245B3808J6059K1970l1507j2242N64K4456P173K4690J0486q975j6587l1014l5530
$$ 23808 39867 61837 30330 18088 18652 43108 50281 74971 85457 76482 59895 28881 -6649
7232f649M2104K8233j6376n8488j7076K4638N0997k5139k091N084o678J203O887
$$ -6649 35455 63688 47312 -11176 -28252 -3614 47383 22244 20153 25237 18559 19762 26649
7219B6649n18j5138J6166k3216K3297L7252J8635l2430k3264J3016n897l150O225
$$ 26649 26131 10993 27159 3943 27240 64492 83127 50697 27433 40449 34552 31402 37627
7206C7627J9258K5766M6904K8731K053m8769k0608j0971j4167O653K9590j9407
$$ 37627 56885 82651 129555 158286 160339 111570 90962 79991 65824 72477 102067 82660
7194H2660K7809n150l7778M0487k0500n7846l4435K9816J0979j5301j5486j8038
$$ 82660 110469 105319 67541 108028 87528 29682 -4753 25063 36042 20741 5255 -12783
7182a2783J3779K5918K529Q772j5331J3080l437J9619l8254k4292K4163P752j3850
$$ -12783 996 26914 29443 38215 22884 35964 32527 52146 13892 -10400 13763 21515 7665
7169G665L1916k429J6289N8407k7813k7094j2889l0635N233K7033J6520k6584
$$ 7665 39581 37152 53441 111848 84035 56941 44052 13417 18650 45683 62203 35619
7157C5619m078j156o091M912q910j7073l3718K1889K5363j0087Q615J35p807k3642
$$ 35619 31541 30385 24294 29206 20296 3223 -30495 -8606 16757 6670 15285 15420 7613 -16029
7143a6029r666J6738K1138K1892K0013J4056j8749J7819j466r085j2677O030K2035
$$ -16029 -25695 -8957 12181 34073 54086 68142 49393 67212 65746 56661 43984 50014 72049
7130G2049J8100k5457l9325k6091K4238K6157J9407k2976O524k0545j4198j5590
$$ 72049 90149 64692 25367 -724 23514 49671 69078 46102 52626 32081 17883 2293
7118B293j2031K4652J1175q369J6233o635J7107J4048n09j8805k3046j8960k438
$$ 2293 -9738 14914 26089 17720 33953 27318 44425 58473 57964 39159 16113 -2847 -5285
7105e285L9759K1363J983J5152K4694k8144R61M2117N717n3759j1896M251J9181
$$ -5285 34474 55837 57820 72972 97666 69522 70483 112600 118317 64558 52662 56913 76094
7092G6094K2934l7584l4804J0247K1521j5097k6868O435Q432p811J6221j167j3788
$$ 76094 99028 61444 26640 36887 58408 43311 16443 22878 31310 23499 39720 38553 24765
7079B4765r000J4265K2134l6517j8408J4802L6057j4520J4548M5286J4998Q54
$$ 24765 15765 30030 52164 15647 -2761 12041 48098 33578 48126 93412 108410 109264
7067A09264j4372j8380j6682n2571J229M4354j0308N407j6538m5437q550J1537
$$ 109264 94892 76512 59830 7259 8488 52842 42534 47941 31403 -14034 -22584 -11047
7055a1047K2708L5853j3700j5090j3379J1177N465k0204J0200j6822J9156O459
$$ -11047 11661 47514 33814 18724 5345 16522 21987 1783 11983 -4839 14317 20776
7043B0776k7453j3351K0615L1156Q54J4481J78Q465M010k3074m0724k0135r873
$$ 20776 -6677 -20028 587 31743 32597 47078 47256 55721 59731 36657 -4067 -24202 -34075
7030c4075J9059K9741O056R646J1770J5663L368k8937K732m513m0983k2857m17
$$ -34075 -15016 14725 20781 30427 42197 57860 61228 32291 35023 30510 -10473 -33330 -33747
7017c3747K6160k1320J1506M2970j3566o292j9697l4522K9836K9111l404n45L605
$$ -33747 -7587 -28907 -17401 25569 12003 5711 -13986 -48508 -18672 10439 7035 6490 10095
7004A0095m770M950l033j6776J5506L3609L7198K7329l9342n0163j8741K4582
$$ 10095 5325 10275 7242 -9534 5972 39581 76779 104108 64766 14603 -4138 20444
6992B0444j4655j8403q781N2622K5984m2239k5800M4563K637J4300L3195n990
$$ 20444 5789 -12614 -21395 31227 57211 14972 -10828 33735 36372 50672 83867 77877
6980G7877j5979k2257L433l0393p270K5002n478J8987j3819j1117j7737P290K1356
$$ 77877 61898 39641 43074 12681 5411 30413 24935 43922 30103 18986 1249 8539 29895
6967B9895J5137J0852j9052n345L9715J9445k770J4189n3121n6945J0439L9533
$$ 29895 45032 55884 36832 31487 71202 90647 87877 102066 48945 -8000 2439 41972
6955D1972N0714O229k4634j8239r111J3681L122j1453p830j8519l6264j8206M4210
$$ 41972 92686 98915 74281 56042 46931 60612 63734 52281 44451 25932 -10332 -28538 15672
6942A5672J6990j1318k7955l3953L432j0269l0737J0334J1760K382R123O411l5594
$$ 15672 32662 21344 -6611 -40564 -37132 -47401 -78138 -67804 -56044 -53662 -44539 -38128 -73722
6929g3722l2399N8069Q2595M2560l7335j4795L976j1803O754o068J8262R222q162
$$ -73722 -106121 -48052 34543 77103 39768 24973 28949 17146 23900 17832 36094 45316 37154
6916C7154j5300j4374o765L933K792J5120k6306J3259K1315j3793L1167j0560
$$ 37154 21854 7480 715 4648 7440 22560 -3746 9513 30828 17035 48202 37642
6904C7642j5860J3230m365k0019j804M5478K603p049m0427l279Q772J3584j48
$$ 37642 21782 35012 30647 10628 8824 54302 56905 49856 9429 6150 14922 28506 28358
6891B8358r272K013Q246l133J553K0532j2506K2780o787J8046J8664J6382k4756
$$ 28358 19086 21099 29345 26212 27765 48297 35791 58571 51784 69830 88494 104876 80120
6878H0120p244l1337m0562J164L7130L003k6913l8207j0j560K3003M747j2140
$$ 80120 72876 41539 977 2141 39271 42274 15361 -22846 -22856 -24416 -1413 3334 -8806
6865h806R394J7423j7455Q596J4845O680J0614L0869Q484j5120l4803j3808m621
$$ -8806 588 18011 556 9152 23997 30677 41291 72160 80644 65524 30721 16913 12292
6852A2292M665K469K1837l4868K544j5310k4178J3703J3264l825M991K3360m3945
$$ 12292 16957 19426 41263 6395 8939 -6371 -30549 -16846 -3582 -7407 -2416 20944 -23001
6839b3001J2214L2572j8238l8202j6768J0553K497O2629L6793k2606K77o886j174
$$ -23001 -10787 21785 3547 -34655 -51423 -40870 -38373 24256 61049 38443 38720 31834 30660
6826C0660j3824N849j1239O60Q933K987J4407j5150J9525k1248J3632r054m932
$$ 30660 16836 22685 11446 12106 21039 24026 38433 23283 42808 21560 35192 26138 21206
6813B1206k9441M738j5136K905l9081qJ8724J5688M198J2120O097O378j5284j0346
$$ 21206 -8235 -3497 -18633 -15728 -54809 -54817 -36093 -20405 -16207 -4087 2010 8388 -6896 -17242
6799a7242L7911j1627N934K9536O203j0074O887O801m1019l2997L898M2386K9153
$$ -17242 20669 9042 14976 44512 50715 40641 47528 54329 13310 -19687 -15789 26597 55750
6786E5750J9409q117O13n0444k8906N7852Q229k7682j8273j1028K497k677J6890
$$ 55750 75159 67042 67655 17211 -11695 46157 54386 26704 8431 -2597 -100 -2777 14113
6773A4113j61N562J9227J1649J4007O061j0943n2180n5986k1802L8036J9117k3975
$$ 14113 13952 19514 38741 50390 64397 70458 59515 7335 -48651 -70453 -32417 -13300 -37275
6760c7275Q818L3798N1934k2897p786k9215J2712J7731L8856J773K0563J389o9791
$$ -37275 -28457 5341 57275 34378 26592 -2623 10089 27820 66676 68449 89012 90401 20610
6747B0610l6549L2560L758k0541J1326l2582J5924M4908n218k8745M144r607K9259
$$ 20610 -15939 16621 20379 -162 11164 -21418 -5494 39414 34196 5451 9595 -12 29247
6734B9247L7064K6979Q806P437Q899j2484k1050m4733J5154j4756j0262O285K0967
$$ 29247 66311 93290 102096 109533 118432 105948 84898 40165 55319 40563 30301 36586 57553
6721E7553N4267l2495n6578O399L971r882o653p589K466K274j1958J0646M257
$$ 57553 111820 79325 22747 29146 33117 23235 16582 8993 11459 13733 1775 12421 16678
6708A6678r178R826l1076j6615K4028K6472R351J5561J6512K316m0137l8457M582
$$ 16678 7500 17326 -13750 -30365 -6337 20135 29486 45047 61559 63875 23738 -14719 -10137
6695a0137J4974J9739N366p275r155j3150k7989M1479L4448j171k3985l8608k2040
$$ -10137 4837 24576 29942 22667 13512 362 -27627 13852 48300 47129 23144 -15464 -37504
6682c7504m023j0768R732L6581J081o053J9476k202K3933j1799K4684J7271J6619
$$ -37504 -41527 -52295 -42563 -5982 -4901 -10954 8522 6320 30253 18454 43138 60409 77028
6669G7028k448k237j7041l0822o259J6026k232j3942K4398J5469j3332k0140j8791
$$ 77028 74580 72343 55302 24480 18221 34247 32015 18073 42471 57940 44608 24468 5677
6656E677k9506P117r09k0725J5181K9622q817j5126k8997J4095N5713L4958j8601
$$ 5677 -23829 -16712 -17621 -38346 -23165 6457 -2360 -17486 -46483 -32388 23325 58283 39682
6643C9682k1971l9396J0420J5178J6634Q932O243Q474k7729k364L2203l1911j3632
$$ 39682 17711 -21685 -11265 3913 20547 29479 35722 44196 16467 14103 46306 14395 763
6630G63L1708j3593j5509n944Q621N836L9346K9425j7660N687j3651l100L4504
$$ 763 32471 18878 3369 -2575 6046 11882 51228 80653 62993 68680 55029 51929 86433
6617H6433J4607m4571J5484J685l5535k3895l260K0145n0692j3087K3756K1686
$$ 86433 101040 56469 71953 73638 38103 14208 10948 31093 -19599 -32686 -8930 12756
6605A2756J3892K9132N0k0705k71P60m3154j0087m2763j4908L0222M1651L7284
$$ 12756 26648 55780 55830 35125 34854 35614 -7540 -17627 -60390 -75298 -45076 -3425 33859
6592C3859K1374j2129k0366n771k6721J0062L2136J1279R104O751j8432K454j1325
$$ 33859 55233 43104 22738 16967 -9754 308 32444 43723 52827 59578 41146 43600 32275
6579C2275k9172k7794K2239K6032L049K2909j6104k5195j9024r914N6638o123
$$ 32275 3103 -24691 -2452 23580 26629 49538 33434 8239 -10785 -20699 35939 29816
6567B9816l3526o258J2895j9705O638J3557L899l5975L647J9862M350k5865j1245
$$ 29816 -3710 -9968 2927 -16778 -10140 3417 7316 -28659 -25012 -5150 -800 -26665 -37910
6554c7910L9847Q542K6705j9505j3737Q377K4446j538k5126j9100N628P75o22
$$ -37910 1937 10479 37184 17679 3942 12319 36765 35227 10101 -8999 -3371 -2596 -3218
6541c218o583l7342j4847K0169o440J5123k8053j2998j2594K6466M6711J2576
$$ -3218 -9801 -47143 -61990 -41821 -48261 -33138 -61191 -74189 -86783 -60317 -13606 -1030
6529a030Q829R969M0768k60k6567K9339N835j6944l0732p034r518N154k5863r090
$$ -1030 7799 17768 58536 58276 31709 61048 66883 49939 19207 12173 2655 7809 -18054 -27144
6515b7144J1878K1025k7528j6292J5864k9363j1974j6772j2850M3314K6844l500
$$ -27144 -15266 5759 -21769 -38061 -22197 -51560 -63534 -80306 -93156 -49842 -22998 -26498
6503b6498k8434K9072N4972O771j7158k842k8105k6257m623J7747M6914J868k1140
$$ -26498 -54932 -25860 29112 35883 18725 15883 -12222 -38479 -43102 -25355 21559 23427 2287
6490B287N109K5559j1847J7744j224j4259R908J2723j057l3328j4483r20j941
$$ 2287 7396 32955 21108 38852 37628 23369 33277 46000 44943 11615 -2868 -3788 -5729
6477e729K5788L1673m0569l8936m396K786k8623L5212L2663k5734k9333K3815
$$ -5729 20059 51732 11163 -27773 -32169 -29383 -58006 -22794 9869 -15865 -45198 -21383
6465b1383J1959K3771K885k2041j6967K9246j1540M015K8945j2302K03j4354m527
$$ -21383 -9424 14347 17232 -4809 -21776 7470 -4070 -55 28890 16588 16791 2437 -2090
6452b090L665J450j1316K831k0756k1292J1039n372q328j5927R175J9732L9684
$$ -2090 1575 3025 -8291 -5460 -26216 -47508 -36469 -41841 -50169 -66096 -56921 -37189 2495
6439B495L0193M2176M4850K8901n6511k4629k9634o455k253m5600K0723k613J0344
$$ 2495 32688 74864 119714 148615 92104 67475 37841 31386 29133 -16467 4256 1643 11987
6426A1987K555Q493k7823j4047J1439M6073K4804J898j1545l7238k420k063K4020
$$ 11987 14542 23035 -4788 -18835 -7396 38677 63481 65379 53834 16596 14176 12113 36133
6413C6133q875l2695j4970K7405M2960J1649l6048M662J9108q276j8108l2090
$$ 36133 27258 -5437 -20407 6998 49958 61607 25559 30221 49329 41053 22945 -9145
6401i145J3021J8592L461Q773K733l005q425m1065K5299R304p196j8748j0812
$$ -9145 3876 22468 25929 34702 37435 34430 26005 -15060 10239 19543 12347 -6401 -17213
6388a7213J5629K2395n303r514j370m4846J7085M4170R202m38J536j2992M1404
$$ -17213 -1584 20811 15508 5994 4624 -40222 -23137 21033 30235 29797 31333 18341 59745
6375E9745k2858l12K28P473K4204J314j4419p108j1100L984K3960Q375m9466m1807
$$ 59745 36887 36575 36803 44276 68480 69794 55375 48267 37167 41151 65111 73486 24020 -17787
6361a7787j9004k1222K0283O2047J3026j4292L1509j1521l2200m567k6008k8666
$$ -17787 -36791 -58013 -37730 24317 37343 23051 54560 43039 10839 6272 -19736 -48402
6349d8402P481L4144J0657L645j0366R155R516P558l5121l3204K7370O583K26
$$ -48402 -40921 -6777 3880 7525 -2841 6314 15830 23388 -11733 -44937 -17567 -10984 -10758
6336a0758Q653L730J3817k730q081j4366j0065J6847J118o928N688J1842J467
$$ -10758 -2105 1625 15442 12712 4631 -9735 -19800 -2953 -1835 -8763 -3075 8767 10234
6323A0234o806L6619n5786j1475N02P996P746k682k2461J5332q928m090J9145
$$ 10234 3428 40047 -15739 -27214 -26712 -18716 -10970 -13652 -36113 -20781 -29709 -33799 -14654
6310a4654K3342M5095L3549l312j8002O000k5582l2207r966n817l317L0927K305
$$ -14654 8688 53783 87332 84020 66018 72018 46436 14229 4263 -1554 -4871 26056 28361
6297B8361l9099l9723l071P7067J0562m7250k1304j1483J0316M6472K676j8590
$$ 28361 -10738 -50461 -53532 23535 34097 -13153 -34457 -45940 -35624 10848 13524 -5066
6285e066n690K2378O272l7764l1103K9715M5288J174J411o157k0966K011Q789
$$ -5066 -10756 11622 17894 -19870 -50973 -21258 24030 25204 26615 20458 -508 1503 10292
6272A0292q075j6754r88J6159j6048M0483O457k1819l3384K9143L2285K6521k0106
$$ 10292 2217 -14537 -15525 634 -15414 25069 31526 9707 -23677 5466 37751 64272 44166
6259D4166l6542R317K5443n605L1511J8381k2474j2690K317n256L2389J0329k1153
$$ 44166 7624 16941 42384 36779 68290 86671 64197 51507 53824 48568 80957 91286 70133
6246G0133l2562l6565Q555j1107j2075n419K4913K0366J8369j661m1102k2020
$$ 70133 37571 1006 9561 -1546 -13621 -19040 5873 26239 44608 42947 1845 -20175
6234b0175L7642K0646M619Q185j4854l1567j4473k7114r990J1578K0226O999L8906
$$ -20175 17467 38113 42732 50917 36063 4496 -9977 -37091 -47081 -35503 -15277 -8278 30628
6221C0628J1580j1292k0214M040n888N783j2632M6525O24k2241j3223r883j2965
$$ 30628 42208 30916 10702 14742 8854 14637 2005 48530 49154 26913 13690 3807 -9158
6208i158K5960K1465q689J420k8006j5283J7390J5621l904J1218R06k1783l3638
$$ -9158 16802 38267 29578 30998 2992 -12291 5099 20720 16816 28034 28940 7157 -26481
6195b6481J3506L776k8740l7646r888M4568J2971k7451m9168L5140L6516M919
$$ -26481 -12975 -9199 -37939 -75585 -85473 -40905 -27934 -55385 -104553 -69413 -32897 -27978
6183b7978p353N30j6256J5361k565n462J0261o64J2714K7497L6135J0214m632
$$ -27978 -35331 -34801 -51057 -35696 -38261 -43723 -33462 -34126 -21412 6085 42220 52434 47802
6170D7802M749n835m3544k1641J5381K0795k0907L3622j6220j6434n036l9066
$$ 47802 52551 46716 3172 -18469 -3088 17707 -3200 30422 14202 -2232 -7268 -46334
6158d6334J5419L248K9747K3252k7592L643K1552l125J7376o02j8438j8479o13
$$ -46334 -30915 -27667 2080 25332 -2260 1383 22935 19810 37186 36584 18146 -333 -946
6145i46j9608N444j3679J8218J4975l9452K5965K9016K9671J106j8423l2384n7120
$$ -946 -20554 -15110 -28789 -10571 4404 -35048 -9083 19933 49604 50710 32287 -97 -57217
6132e7217J470N1032J8515K2001L0404J8577l3724k8023j0014k9570O551q037
$$ -57217 -55747 -4715 13800 35801 66205 84782 51058 23035 13021 -16549 -9998 -18035
6120a8035J3797Q587M284K5663K6404J3849j4234j1060j5844k7568P612o328j3215
$$ -18035 -4238 4349 8633 34296 60700 74549 60315 49255 33411 5843 13455 7127 -6088
6107f088l0190j0886L9696K9572k9673J400J7290M856j4412l9881j0803N652L8099
$$ -6088 -36278 -47164 -7468 22104 -7569 -6169 11121 15977 1565 -38316 -49119 -43467 -5368
6094e368l7153k427L614J5137M903K8356J9941o02p783L510j3459j0679j1866
$$ -5368 -42521 -44948 -41334 -26197 -21294 7062 27003 26401 18618 22128 8669 -2010 -13876
6081a3876j5654L355K3837K1261j4135n670j4677K9980Q089m9319R45J4325K0592
$$ -13876 -29530 -26175 -2338 18923 4788 -882 -15559 14421 22510 -26809 -25864 -11539 9053
6068I053m0715k509J7510k7748L5682J1924J0645L582k3981k0519k582M7895K5187
$$ 9053 -31662 -34171 -16661 -44409 -8727 3197 13842 17424 -6557 -27076 -29658 18237 43424
6055D3424K3470q036K3195J998m4708p2119j2421M1045N4553l133j3840j4306
$$ 43424 66894 58858 82053 84051 39343 -32776 -45197 -4152 50401 47268 33428 19122
6043A9122k1978K8290m684k5016k7359p406o631j9432M294M330P867J762J524
$$ 19122 -2856 25434 20750 -4266 -31625 -39031 -45662 -65094 -60800 -56470 -48603 -46841 -45317
6030d5317K3515Q239L4163q627m868m74J3842J0334j1584k6650o565k3215K232
$$ -45317 -21802 -13563 20600 11973 7105 6631 20473 30807 19223 -7427 -13992 -37207 -34975
6017c4975M2065J7498m8532R876R084L5523j3271l987m153K3583j1987l2671K4455
$$ -34975 7090 24588 -23944 -14068 -4984 30539 17268 13281 9128 32711 20724 -11947 12508
6004A2508r367k6199k1882J615J2383L304j9102j4408l3210J1075K3027j349l1589
$$ 12508 3141 -23058 -44940 -43325 -30942 -27638 -46740 -61148 -94358 -83283 -60256 -61605 -93194
5991i3194L486L3115N0560K7495o062N672J0477n60l8659O028M0982j2835j3755
$$ -93194 -89708 -56593 -6033 21462 15400 21072 31549 30989 -7670 -1642 39340 26505 12750
5978A2750j2924N006K6028j6458m2192P070j6511r914L2384M2133j1808k7709
$$ 12750 -174 4832 30860 14402 -27790 -20720 -37231 -47145 -14761 27372 15564 -12145
5966a2145O39J1120o944m590K7232j4534j455O848L1647J2502l5608O749P694
$$ -12145 -11506 -386 -7330 -11920 15312 778 -677 6171 37818 50320 14712 21461 29155
5953B9155L5532K3891l6976o234k648m6258K4337J2553p083K3146Q468k0094J7975
$$ 29155 64687 88578 51602 45368 42720 -3538 20799 33352 26269 49415 57883 37789 55764
5940E5764k395k9494k6098M3505M0950k2747k7700m2130j0970K8659K4429m1337
$$ 55764 53369 23875 -2223 41282 82232 59485 31785 -10345 -21315 7344 31773 -9564
5928i564q2773K9055L9038L085K5628J3253K1486j5367m9501K335J8770K4368
$$ -9564 -92337 -63282 -24244 -21159 4469 17722 39208 23841 -25660 -23325 -4555 19813
5916A9813J457L188J9735j3376J9073l8727l7241j5757p274j4373J0823J7061
$$ 19813 21270 24458 44193 30817 49890 11163 -26078 -41835 -49109 -63482 -52659 -35598
5904c5598K0777M1281L8014k4040K3703j1436K567J3228r116J321o091R310l5836
$$ -35598 -14821 26460 64474 40434 64137 52701 55268 68496 59380 60701 54610 63920 28084
5891B8084l8372j5758J9655N436J8571j4698p287p587o329J9344K5497j0785K2070
$$ 28084 -10288 -26046 -6391 -955 17616 2918 -4369 -11956 -18285 1059 26556 15771 37841
5878C7841p668k3346r763j3181L5128L1246M030j5113R428j832l984o319R434
$$ 37841 30173 6827 -2936 -16117 19011 50257 54287 39174 48602 46770 42786 36467 45901
5865D5901k8174k8687n83j4541m0165J5798O110l891k691J3081N987L2197j6264
$$ 45901 17727 -10960 -11543 -26084 -66249 -50451 -44341 -48232 -50923 -37842 -31855 342 -15922
5852a5922k1443L4497M952m871J5489K0062k7552k4761l2072m0992J8943K1804
$$ -15922 -37365 -2868 2084 -2787 12702 32764 5212 -19549 -51621 -92613 -73670 -51866
5840e1866k584P855K7616j2638k7610k7525K187j3885J9602M6671J0768K5158
$$ -51866 -54450 -46595 -18979 -31617 -59227 -86752 -84565 -98450 -78848 -32177 -21409 3749
5828C749n303l638j2678J0749l7694J725M2181j295k1449j9243j108N609K77o935
$$ 3749 -1554 -5192 -17870 -7121 -44815 -43090 -909 -2204 -23653 -42896 -44004 -38395 -38118 -45053
5814d5053J6858k2751Q088P45j4648L379L5743K6371n530l9672n2638j0006J6964
$$ -45053 -28195 -50946 -42858 -42113 -56761 -53382 -17639 8732 3202 -36470 -89108 -99114 -82150
5801h2150m680K5765M0690J8302L0563K1330k9717P640k7006k6795J3974m281
$$ -82150 -86830 -61065 -20375 -2073 28490 49820 20103 27743 737 -26058 -12084 -16365
5789a6365R311J8577L5604j8171k7746j2998j1130j1166J4864p330j8362k3714
$$ -16365 -7054 11523 47127 28956 1210 -11788 -22918 -34084 -19220 -26550 -44912 -68626
5777f8626k4517L3880M2888O316L128q014J6882r121j5605L3266n41j7239j4573
$$ -68626 -93143 -59263 -16375 -10059 -6931 -14945 1937 -7184 -22789 10477 9936 -7303 -21876
5764b1876P026K2428K3024j0036j5259j3511r430J8810J0025J2766K0289k2887
$$ -21876 -14850 7578 30602 20566 5307 -8204 -17634 1176 11201 23967 44256 21369
5752B1369k1470K038l3352j2774J5422M5054L7145J8494K316n2200m6478o346
$$ 21369 -101 1937 -31415 -44189 -28767 16287 53432 71926 74242 22042 -24436 -30782
5740c0782l0093r250L0477K7648L5322N371k0122l3147j8978K8747K9060K4855
$$ -30782 -60875 -70125 -39648 -12000 23322 28693 8571 -24576 -43554 -14807 14253 39108
5728C9108N204k5926k0020J9977J41k6564K1141J8996L751l7326N486Q674K009
$$ 39108 44312 18386 -1634 18343 18484 -8080 13061 32057 35808 -1518 3968 12642 14651
5715A4651q362r31m775J1679j0117j6130n859j8755L0168N309j3884j0923j9080
$$ 14651 6289 5358 583 12262 2145 -13985 -19844 -38599 -8431 -3122 -17006 -27929 -47009
5702d7009J6044l2340P940N2676J8145k4205k3243k6018K4397J760k6816N0940
$$ -47009 -30965 -63305 -55365 -2689 15456 -8749 -31992 -58010 -33613 -31853 -58669 -7729
5690g729J7006J7160J3082N59j0565L302K0494m536m3018N4882M2639k6387j2882
$$ -7729 9277 26437 39519 40078 29513 32815 53309 48773 5755 60637 103276 76889 64007
5677F4007k322J2931M0741l2012n4908l7880j2835M4331J3388l0693J3399O366
$$ 64007 61685 74616 115357 83345 28437 -9443 -22278 22053 35441 4748 18147 24513
5665B4513L1344L0991m264l305l5191n957L355N129L530l4794o360M6362Q279
$$ 24513 55857 86848 82584 79279 44088 38131 41486 46615 50145 15351 8991 55353 63632
5652F3632k7692j2770m4388l0751K8669K8256m8160J1725J9754o912J9303K1474
$$ 63632 35940 23170 -21218 -51969 -23300 4956 -43204 -31479 -11725 -18637 666 22140
5640B2140o315n366J0011m2613q829l1406j7827O0542K1407n105J5270J5730o834
$$ 22140 15825 10459 20470 -22143 -30972 -62378 -80205 -19663 1744 -3361 11909 27639 20805
5627B0805l3224l513m2304N619M8635P94l445K8091k333J2796p329l4615k6238
$$ 20805 -12419 -15932 -58236 -52617 -3982 -3188 -6633 21458 19125 31921 24592 -10023 -36261
5614c6261n429L4211K3974K032K01k5957N0376J3319l7922j7134j5190l907q080
$$ -36261 -41690 -7479 16495 18527 18728 -7229 43147 56466 18544 1410 -13780 -17687 -25767
5601b5767o952J24J4880J0036k1531q896K9193P116j8394k3490j6068L2646M214
$$ -25767 -32719 -32595 -17715 -7679 -29210 -38106 -8913 -1797 -20191 -43681 -59749 -27103 -22889
5588b2889j2589o317j2191J944K5171K43k3166L431L7145J8279K2507m687j761
$$ -22889 -35478 -41795 -53986 -52042 -26871 -26628 -49794 -46363 -9218 9061 31568 26881 25120
5575B5120l4445l1123K0203K5104j0799r421R135J639J7928K5578R329J3172J2267
$$ 25120 -9325 -40448 -20245 4859 -5940 -15361 -6226 -4587 13341 38919 48248 61420 73687
5562G3687J1443j1646k8526j0580Q211J6688l4852k5319n236n469j5637k9383
$$ 73687 85130 73484 44958 34378 42589 59277 24425 -894 -6130 -11599 -27236 -56619
5550e6619J6227L2707m316j2208N261M8388J5463l4117j7509K4042L1948l060
$$ -56619 -40392 -7685 -12001 -24209 -18948 29440 44903 10786 -6723 17319 49267 46207
5538D6207l2573j4080j0936J3092m962k1035J2718Q393k8868k9125K559L2983
$$ 46207 13634 -446 -11382 1710 -3252 -24287 -11569 -3176 -32044 -61169 -58610 -25627
5526b5627K348P762L1051K0727N80n7386k8015J5026N6999K6231L2053Q647k6964
$$ -25627 -23279 -15517 15534 36261 36841 -20545 -48560 -33534 23465 49696 81749 90396 63432
5513F3432l401k3381K1447N051j2378k4883j1129R754k6179n3058J4098N3598
$$ 63432 60031 36650 58097 63148 50770 25887 14758 24512 -1667 -54725 -40627 12971
5501A2971N0902L823m8247l7359j2929o59J9260j4004k269m394j2770l5861K9203
$$ 12971 63873 67696 19449 -17910 -30839 -31498 -12238 -26242 -28511 -32905 -45675 -81536 -52333
5488e2333L1538n306j6688l432j1302k228L4106K8706J3842J1717M325J0785m7305
$$ -52333 -20795 -26101 -42789 -46221 -57523 -59751 -25645 3061 16903 28620 32945 43730 -3575
5475c575j3804J5159j1692P567R436L448J2930K37p257k9086n5649k807L7568
$$ -3575 -17379 -2220 -13912 -6345 3091 6539 19469 19706 12449 -16637 -72286 -75093 -37525
5462c7525K0101R225k538L5353n894n278l5175j0273L0244J1260N758m3628R018
$$ -37525 -17424 -8199 -10737 24616 18722 13444 -21731 -32004 -1760 9500 15258 -28370 -19352
5449a9352L0494N2381L9569k1748p3430m5963k3325J7704o950M0112L0621l6866
$$ -19352 11142 63523 103092 81344 7914 -38049 -61374 -43670 -50620 -10508 20113 -16753
5437a6753k2926K4445o746j4812p628R918K7439m109k317j6102o709J9329N198
$$ -16753 -39679 -15234 -21980 -36792 -44420 -34502 -7063 -11172 -13489 -29591 -36300 -16971 -11773
5424a1773M602j005m7966K1545J3110l3530R231R030N3051k0815j9808J610n819
$$ -11773 -7171 -8176 -56142 -34597 -21487 -55017 -45786 -36756 16295 -4520 -24328 -22718 -28537
5411b8537N675N26J8455M888o628J5913O786j493k9153o583L2371n263n935J6873
$$ -28537 -22862 -22336 -3881 1007 -5621 10292 17078 15585 -13568 -20151 12220 6957 1022 17895
5397A7895L649r903Q2K8082j909j1677n0498k2356J0267L4180p87P910J3452J0944
$$ 17895 21544 11641 11723 39805 37896 26219 -24279 -46635 -36368 -2188 -2975 4935 18387 29331
5383B9331N321J8806j2080q742J1967j4402j4241m0982q069j653j8219O499j3533
$$ 29331 34652 53458 41378 32636 44603 30201 15960 -25022 -33091 -34744 -52963 -46464 -59997
5370e9997M6753L9690k5326k936M019J733K32m0950J5345O95L329o051L3203L8035
$$ -59997 -13244 26446 1120 -1816 2203 3936 4168 -36782 -21437 -20742 -17413 -23464 9739 47774
5356D7774j9058L215j5831j803l0704J5283M5142r740j3666j9446m1501m0876
$$ 47774 28716 31931 16100 14297 -16407 -1124 44018 34278 20612 1166 -40335 -81211
5344h1211K7759J2458J6415J4078J2501K3359p392j5167k82k239m540k4441l2859
$$ -81211 -53452 -40994 -24579 -10501 2000 25359 17967 2800 2518 279 -4261 -28702 -61561
5331f1561L7681P5618j755k1854k7134P795j8254k5489k6432j1029L9790N7393
$$ -61561 -23880 51738 49983 28129 995 8790 -9464 -34953 -61385 -72414 -32624 24769
5319B4769o319l0078N096j73n2620K8858K3690m250K2995R90j9673k4600K9087
$$ 24769 18450 -11628 -6532 -6705 -59325 -30467 -6777 -11027 11968 12958 -6715 -31315 -2228
5306b228J9000J0308j6550J0348n65o362J4180l113P108m579k3971l8133M4032
$$ -2228 16772 27080 10530 20878 20313 13951 28131 25018 32126 27547 3576 -34557 9475
5293I475R039k9089n160L2786K3944j7536j1599k892J7071j8139k7975M117O914
$$ 9475 18514 -10575 -15735 17051 40995 23459 11860 8968 26039 7900 -20075 -15958 -9044
5280i044m33O541O328J012L7034M460q092k2733M238j253l2137j8778M5467J922
$$ -9044 -9477 -2936 3392 4404 41438 45898 37806 15073 19311 18058 -14079 -32857 12610 14532
5266A4532j0927j3375M12R570k5628L974j5320l1139K081K8521L5813p195l6640
$$ 14532 3605 -9770 -9358 212 -25416 -21442 -36762 -67901 -65820 -37299 -1486 -8681 -45321
5253d5321J8543k4018j8144N5182M772k5503J0748L4529L3816k1148j2823m9030
$$ -45321 -26778 -50796 -68940 -13758 -8986 -34489 -23741 10788 44604 23456 10633 -38397
5241c8397k3326J7949m416L9163R705k4575J4629K9514m6232k549J9818K378O48
$$ -38397 -61723 -43774 -48190 -9027 678 -23897 -9268 20246 -25986 -28535 -8717 -6339 -5691
5228e691K2573J36m6532J6875J6759j6018j8727J0267r907j1068L3114o73k8085
$$ -5691 16882 17018 -29514 -12639 4120 -11898 -30625 -20358 -30265 -41333 -8219 -8892 -36977
5215c6977j1015j0421p822O771K375L6168K8157j5303J5620K451j2274J2797j2539
$$ -36977 -47992 -58413 -66235 -59464 -57089 -20921 7236 -8067 7553 10004 -2270 10527 -2012
5202b012j3808q33k3262M5205N7951P700l1560k752j9755o341j4835l3223j6545
$$ -2012 -15820 -16653 -39915 5290 63241 70941 39381 36629 16874 10533 -4302 -37525 -54070
5189e4070j2005K224M6107K0254m489j3594L1927R239l0512P816n243j1253N71
$$ -54070 -66075 -63851 -17744 2510 -1979 -15573 16354 25593 -4919 2897 -2346 -13599 -13028
5176a3028N568L8405M8261K164m4117n5838l7K755K2737j7238p432l582j778k1301
$$ -13028 -7460 30945 79206 81370 37253 -18585 -18622 -15867 6870 -10368 -17800 -21382 -23160 -44461
5162d4461q240P613J3400n2919j4434N1896M4469R338m5098N398k1404L849j4113
$$ -44461 -52701 -45088 -31688 -84607 -99041 -47145 -2676 6662 -38436 -33038 -54442 -50593 -64706
5149f4706j9817M365J2247L0918j2193J0132j4261j0640q185L6183L2252l1069
$$ -64706 -84523 -80158 -67911 -36993 -49186 -39054 -53315 -63955 -72140 -35957 -3705 -34774
5137c4774K0103N0241K8456m816j6179o679j4840j4193k6899j6270k1397M665
$$ -34774 -14671 35570 64026 59210 43031 36352 21512 7319 -19580 -35850 -57247 -52582
5125e2582K2464M648j375j8321P485J170L1296J3176J4757K392k3295m1038M543
$$ -52582 -30118 -25470 -26845 -45166 -37681 -36511 -5215 7961 22718 25110 1815 -39223 -34680
5112c4680K7420K5205r177j7552K3196k0214K3939K4221m474l5247j506J0646
$$ -34680 -7260 17945 8768 -8784 14412 -5802 18137 42358 37884 2637 1131 11777
5100A1777k7090K2847J7339o317j3159K096Q646J7894r496O075L5688k201p2119
$$ 11777 -15313 7534 24873 18556 5397 7493 16139 34033 24537 30612 66300 64099 -8020
5087h020k5572K2185k0734n361l4255l0535K6810J9867N2929K1728l1976Q352
$$ -8020 -33592 -11407 -32141 -37502 -71757 -102292 -75482 -55615 -2686 19042 -12934 -4582
5075d582r247r504j4121k6996K760M4860q473J313Q835j1918J53J8430o35r033
$$ -4582 -13829 -23333 -37454 -64450 -61690 -16830 -25303 -23990 -15155 -27073 -26920 -8490 -9125 -18158
5061a8158l6798L680j374K1796J0180J2956k5111P378m198K2187K986q17L9979
$$ -18158 -54956 -51276 -52650 -30854 -20674 -7718 -32829 -25451 -29649 -7462 -4476 -5293 34686
5048C4686J9336o035M8586j919p8887m1545j492P458J3557k9586J9591M5896j5361
$$ 34686 54022 47987 96573 94654 15767 -25778 -27270 -19812 -6255 -35841 -16250 29646 14285
5035A4285K5506L1088Q187k4510k2964k0014k8973r263l064j9957r82l379L4161
$$ 14285 39791 70879 79066 54556 31592 11578 -17395 -26658 -29722 -49679 -50661 -54040 -19879
5022a9879J0821K7410K1301K0197k7755j8893l4443P209J5171K0985j4567j1836
$$ -19879 -9058 18352 39653 59850 32095 13202 -21241 -14032 1139 22124 7557 -4279
5010d279M3661J4102n1787j9495K6221K198p489Q615j7928M986J4629k0711l0452
$$ -4279 39382 53484 1697 -17798 8423 10621 3132 11747 -6181 -1195 13434 -7277 -37729
4997c7729J2945J7898L857m57l4244K3937K0019O462N575k579n9397j3913N1144
$$ -37729 -24784 -6886 -3029 -3486 -37730 -13793 6226 12688 18263 15684 -43713 -57626 -6482
4984f482K3690O124K4939N621J3974m774r463m2832l868r197j511k1756K3300
$$ -6482 17208 23332 48271 53892 67866 63092 53629 10797 6929 -2268 -3779 -25535 -2235
4971b235o90n204J4269k8948m093k6738n568K0302j1174j5959J0792k424k9093
$$ -2235 -2925 -8129 6140 -22808 -26901 -53639 -59207 -38905 -50079 -66038 -55246 -57670 -86763
4958h6763j5874K0427O0240K6981l1288q016J5924L2509n527K8649M8187N650
$$ -86763 -102637 -82210 -21970 5011 -26277 -34293 -18369 14140 8613 37262 85449 91099
4946I1099m3821k8091R96n1177k7243L1568K7673O502j4391J5326l5174k0635
$$ 91099 47278 19187 20183 -30994 -58237 -26669 1004 7506 -6885 8441 -26733 -47368
4934d7368M4506J3330L5645M144m4244m127K2387l8450j0746J1298k169J0379
$$ -47368 -2862 10468 46113 50257 6013 1886 24273 -14177 -24923 -13625 -15794 -5415
4922e415K3882M7535p195j8739n744R461J6563o377L54l6656J691K0764k543J9545
$$ -5415 18467 66002 58807 40068 34324 43785 60348 53971 54325 17669 19360 40124 37581 57126
4908E7126o838k4054R402L2998n5373k9162J5918M542K9546j5742j4425l5147
$$ 57126 50288 26234 35636 68634 13261 -15901 17 4559 34105 18363 3938 -31209
4896c1209K791R216K1003M876O240N2024K1813l3197k9486l0884l8212m5147J2519
$$ -31209 -28418 -19202 1801 6677 12917 64941 86754 53557 24071 -6813 -45025 -90172 -77653
4883g7653Q1404J9180q701M246j7146j0406L9550J6885l1930k4129j4677l889
$$ -77653 3751 22931 14230 18476 1330 -9076 30474 47359 15429 -8700 -23377 -27266
4871b7266k2263K688J0839m2069M8137J5234l9651r552K1988J4056L4157P884
$$ -27266 -49529 -46841 -36002 -78071 -29934 -14700 -54351 -63903 -41915 -27859 6298 14182
4859A4182j3392p606l1592m0279J6681N4810M410j2668j039J094l513J0323N119
$$ 14182 790 -6816 -38408 -78687 -62006 -7196 -2786 -15454 -16493 -15399 -18912 -8589 -3470
4846c470r884k3933l2488L1095L5158J3902Q279j5035K522l6500k4894P875M0581
$$ -3470 -13354 -37287 -69775 -38680 -3522 10380 18659 3624 6146 -30354 -55248 -47373 -6792
4833f792P047L2938l750Q195J3860o552k5698O043j4244k0756k0234j3601J766
$$ -6792 255 33193 29443 37638 51498 44946 19248 25291 11047 -9709 -29943 -43544 -41778
4820d1778Q765k5947Q644J1469P408K037o001q62J2585J6934j8017k2663p79l2755
$$ -41778 -33013 -58960 -50316 -38847 -31439 -29402 -35403 -36265 -23680 -6746 -24763 -47426 -48205 -80960
4806h0960k9492J5080J5926M095K0560L8850J2102k9482j2755K0938j0865m837
$$ -80960 -110452 -95372 -79446 -75351 -54791 -15941 -3839 -33321 -46076 -25138 -36003 -40840
4794d0840Q515n265m93J6751q45o211J4792L6063K6535l0071l2827j3142L7351
$$ -40840 -32325 -37590 -38083 -21332 -22177 -28388 -13596 22467 49002 18931 -13896 -27038 10313
4781A0313j1352n1795J636L276L904O950L0011M0725n7202k3178J224m031L765
$$ 10313 -1039 -52834 -51198 -47922 -44018 -37068 -7057 33668 -23534 -46712 -45488 -49519 -45754
4768d5754L6486J2090n459j922m7380j8395P860K9485K7762J8567O426J3916J5151
$$ -45754 -9268 2822 -2637 -4559 -51939 -70334 -62474 -32989 -5227 13340 19766 33682 48833
4755D8833j7757j0745l272K3546K2205K1368l4803n3371r266Q277k7823o229k6906
$$ 48833 31076 20331 17059 40605 62810 84178 49375 -3996 -13262 -4985 -32808 -39037 -65943
4742f5943L5329N9600L719m5158Q236l189k0140j1410R563l4552j1555J4010J073
$$ -65943 -30614 28986 32705 -12453 -4217 -7406 -27546 -38956 -29393 -63945 -75500 -61490 -60417
4729f0417K4457L2479K1644k2585Q519O235K558j832K7456j8652o2447q924k687
$$ -60417 -35960 -3481 18163 -4422 4097 10332 12890 11058 38514 19862 -42585 -51509 -54196
4716e4196J4262l4376j6652J7088K8291J3853j0550n355J2844j6227j2204j4110
$$ -54196 -39934 -74310 -90962 -73874 -45583 -31730 -42280 -47635 -34791 -51018 -63222 -77332
4704g7332k3291r859M2405L9856J0697j3216K800J4691O187j431J3261m803k7098
$$ -77332 -100623 -110482 -68077 -28221 -17524 -30740 -27940 -13249 -7062 -8493 4768 -35 -27133
4691b7133j0861J263M5807l56k8218k6157K197k8018r99M8464L977j0052J5904
$$ -27133 -37994 -36731 9076 8720 -19498 -45655 -43458 -71476 -72475 -24011 -20034 -30086 -14182
4678a4182L1859P377o817J511j2450l2243L9275K3678m7593p457p903L828K8107
$$ -14182 17677 25054 18237 19748 7298 -24945 14330 38008 -9585 -17042 -24945 -21117 6990
4665F990J0939k0589k8811P522K7145K9833J0472j6958l0337j5267O557P124K8075
$$ 6990 17929 -2660 -31471 -23949 3196 33029 43501 26543 -3794 -19061 -12504 -5380 22695
4652B2695K8228l5043l9578k1866m2290J6929M1325R604k5204j2007P454J9924
$$ 22695 50923 15880 -23698 -45564 -87854 -70925 -29600 -19996 -45200 -57207 -49753 -29829
4640b9829K718N622M496K3060j5413O082k6597L3639Q66l5495j55J2447M664m688
$$ -29829 -27111 -21489 -16993 6067 -9346 -3264 -29861 3778 4644 -30851 -31006 -18559 -13895 -18583
4626a8583J014J4397k9249j6263K4690K4169K3802j5847j4117O911J522k6653
$$ -18583 -17569 -3172 -32421 -48684 -23994 175 23977 8130 -5987 924 2446 -24207
4614b4207K4846J1049r618q742J0515j1815P385n64J682M014j7524k6854l1555
$$ -24207 639 11688 2070 -6672 3843 -7972 -587 -1151 531 4545 -12979 -39833 -71388
4601g1388R588M5745L2272k7028l0471L144j864q201j9444N400L1876N4M6072
$$ -71388 -61800 -16055 16217 -10811 -41282 -38138 -40002 -48203 -67647 -62247 -30371 -30317 15755
4588A5755J6628k1974k5776r927J9300L7287K145l1185p213p02P670j6478J269
$$ 15755 32383 10409 -15367 -25294 -5994 31293 33438 2253 -4960 -5662 2008 -14470 -13201
4575a3201J074M97p428p811k0453P604P413J8920K3875l593l735k370K041q042
$$ -13201 -12127 -11630 -19058 -26869 -47322 -39718 -32305 -13385 10490 6897 3162 792 2833 -5209
4561e209q433L6856k6561Q13J2258l5003K3179O63R488R684m302j1621j1243k546
$$ -5209 -13642 23214 -3347 -2534 9724 -25279 -2100 -1437 8051 17735 13433 1812 -9431 -11977
4547a1977j5183K607L829O003j7251L3159M7629m897l3789J8241r104K3500Q532
$$ -11977 -27160 -24553 -20724 -14721 -31972 1187 48816 43919 10130 28371 19267 42767 51299
4534E1299p012l3470p165L992r669l7678J4013J0475l8606J4804M7779J1640J4467
$$ 51299 44287 10817 3652 7644 -2025 -39703 -25690 -15215 -53821 -39017 8762 20402 34869
4521C4869M3008j3834P178l8567k4347J7071P138j9001l6298k9387K3414J8985
$$ 34869 77877 64043 71221 32654 8307 25378 32516 13515 -22783 -52170 -28756 -9771
4509i771k777j4686l1675K0186L9992J7128l1464j1344L7262K1653m334j6734
$$ -9771 -12548 -27234 -58909 -38723 1269 18397 -13067 -24411 12851 34504 30170 13436
4497A3436K0414J3494k556k2911k8406l372K1462k6617j9041k552L69l0023l1039
$$ 13436 33850 47344 44788 21877 -6529 -9901 11561 -15056 -34097 -36649 -36280 -66303 -97342
4484i7342J0311M6552j4126R101K0529K7805K4988N5726l886o0373k4352j2346
$$ -97342 -87031 -40479 -54605 -45504 -24975 2830 27818 83544 79658 19285 -5067 -17413
4472a7413N415k3671m4123m749J7606q712P428O1700M1600J0815l0818m9023n1029
$$ -17413 -11998 -35669 -79792 -84541 -66935 -75647 -68219 -6519 35081 45896 15078 -33945 -84974
4459h4974L580L4329K9366J34J9867O0886K9213p5548k9880j2312j1183M860K4092
$$ -84974 -81394 -47065 -17699 -17565 2302 63188 92401 16853 -13027 -25339 -36522 -31662 -7570
4446g570M803j2755J7604O906k1331J1574L0494K976r926J66N554n5720l4077
$$ -7570 -2767 -15522 2082 8988 -12343 -769 29725 32701 22775 22941 28495 -27225 -61302
4433f1302j5107n948N0093L3923j930J7037j1252r982Q012J275q109J519K4931
$$ -61302 -76409 -82357 -32264 1659 -271 16766 5514 -4468 3544 4819 -3290 -1771 23160
4420B3160o13m3579J1659k4588L569p622j0203R365L7051K0992j5071k2934J377
$$ 23160 22547 -21032 -9373 -33961 -30392 -38014 -48217 -38852 -1801 19191 4120 -18814 -17437
4407a7437l3711r550R269K3648l0077Q654M0252k6760K831M406j3037l9050j2704
$$ -17437 -51148 -60698 -51429 -27781 -57858 -49204 -8952 -35712 -32881 -28475 -41512 -80562 -93266
4394i3266M2584M1265L4519P6428p578j6375j0218j7017m9513o646k7945P852
$$ -93266 -50682 -9417 25102 101530 93952 77577 67359 50342 829 -5817 -33762 -25910
4382b5910L5002J4242k2488j8970J6810j4238R87L263J4651k1039q255M220J1212
$$ -25910 9092 23334 846 -18124 -1314 -15552 -14565 -11302 3349 -17690 -25945 -21725 -10513
4369a0513k1932L4202k209j0084l223J0415J045j7450j659l347O944o816j7609
$$ -10513 -32445 1757 -452 -10536 -13759 -3344 -2299 -19749 -21408 -24755 -17811 -24627 -42236
4356d2236o894R77M0460M4019j9789J3196k4906n9162Q657M3407J8463j5443j6191
$$ -42236 -49130 -48153 -7693 36326 16537 29733 4827 -54335 -45678 -2271 16192 749 -15442
4343a5442k9120j0213J4605J4129J0055n033J6113J8281Q527l2005P598r348k5243
$$ -15442 -44562 -54775 -40170 -26041 -15986 -21019 -4906 13375 21902 -10103 -2505 -11853 -37096
4330c7096j088j0628j2106P106L2203O870j3978k6242l675K5831M3253K7356j6587
$$ -37096 -38184 -48812 -60918 -53812 -21609 -14739 -28717 -54959 -58634 -32803 10450 37806 21219
4317B1219k9115j9354l1923n34L1618M9822K4741N341k6395k2940j2684j3346
$$ 21219 -7896 -27250 -59173 -59707 -28089 21733 46474 51815 25420 2480 -10204 -23550
4305b3550l3258j2410K0670M9469N032k104M9383O941n3385j2647j4803J6730
$$ -23550 -56808 -69218 -48548 921 5953 3849 53232 60173 6788 -5859 -20662 -3932
4293c932N6627l2093l456K1656j0992M031o909n820j4637J3694p99j7530j3271
$$ -3932 52695 20602 17146 38802 27810 31841 24932 19112 4475 18169 17370 -160 -13431
4280a3431j8020P392J1365n1778m1502J6750O7493M9918q872k0426R43k505J2968
$$ -13431 -31451 -24059 -12694 -64472 -105974 -89224 -21731 28187 19315 -1111 -168 -2673 10295
4267A0295L2648l095j74j7771j9129l1812J527K121J9856n390N904M1388r794
$$ 10295 42943 39848 39674 21903 2774 -29038 -27511 -25390 -5534 -10924 -5020 36368 26574
4254B6574j0811l4638j3326J964l7676L1504j5184M036L5290P811J877L4035r534
$$ 26574 15763 -18875 -32201 -30237 -67913 -36409 -51593 -47557 -12267 -4456 -2579 31456 21922
$$ [...]
##END NTUPLES=NMR SPECTRUM
##END=
