##TITLE=Analysis number 318215
Compound Code km 06414
Project Code adrs
Chemist Name prosynth
##JCAMPDX= 6.0         $$ Bruker NMR JCAMP-DX V2.0
##DATA TYPE= NMR SPECTRUM
##DATA CLASS= NTUPLES
##ORIGIN= Bruker BioSpin GmbH
##OWNER= nmr
$$ XWIN-NMR		Version 3.5
$$ Mon Mar 20 15:10:27 2006 GMT Standard Time (UT+0h)  MAYBRIDGE\nmr@NMR_250MHZ
##.OBSERVE FREQUENCY= 250.131544655141
##.OBSERVE NUCLEUS= ^1H
##.ACQUISITION MODE= SIMULTANEOUS (DQD)
##.ACQUISITION SCHEME= undefined
##.AVERAGES= 16
##.DIGITISER RES= 18
##SPECTROMETER/DATA SYSTEM= dpx250
##.PULSE SEQUENCE= zg30
##.SOLVENT NAME= CDCl3
##.SHIFT REFERENCE= (INTERNAL, CDCl3, 0, 16.522)
##AUDIT TRAIL= $$ (NUMBER, WHEN, WHO, WHERE, WHAT)
$$ ##TITLE= Audit trail, XWIN-NMR		Version 3.5
$$ ##JCAMPDX= 5.01
$$ ##ORIGIN= Bruker BioSpin GmbH
$$ ##OWNER= nmr
$$ C:\u/data/dgb/nmr/ADRS/1090/pdata/1/auditp.txt
$$ ##AUDIT TRAIL=  $$ (NUMBER, WHEN, WHO, WHERE, WHAT)
(   1,<2006-03-20 15:10:04.35 +000>,<MAYBRIDGE\nmr>,<NMR_250MHZ>,
      <created by zg, POWCHK disabled, PULCHK disabled
       configuration hash MD5:
       84 BC 41 DB A1 6E 1D 46 DA 25 12 A5 C1 ED C5 3A
       data hash MD5: 64K
       DC DA CE 46 78 84 90 D5 61 12 21 F9 65 4A 46 B5>)
(   2,<2006-03-20 15:10:17.90 +000>,<MAYBRIDGE\nmr>,<NMR_250MHZ>,
      <Start of raw data processing
       ef LB = 0.3 FT_mod = 6 PKNL = 1 SI = 32K 
       data hash MD5: 32K
       91 AA 95 6F 73 1A F3 60 C0 45 0D 58 E8 68 76 E1>)
(   3,<2006-03-20 15:10:19.46 +000>,<MAYBRIDGE\nmr>,<NMR_250MHZ>,
      <apk 
       data hash MD5: 32K
       89 08 E5 54 FF 21 23 A6 6E 77 14 89 E7 8A A5 32>)
(   4,<2006-03-20 15:10:20.21 +000>,<MAYBRIDGE\nmr>,<NMR_250MHZ>,
      <abs ABSG = 5 
       data hash MD5: 32K
       13 1E 17 00 35 79 91 7D CE 50 06 38 6F 4A BE 04>)
$$ ##END=
$$ 
$$ hash MD5
$$ 32 B8 DB A5 BC 82 4C 88 67 B7 14 8B 23 A9 86 68
##$RELAX= 
##$RELAX= 
##$RELAX= 
##$RELAX= 
##$RELAX= 
##$RELAX= 
##$RELAX= 
$$ Bruker specific parameters
$$ --------------------------
##$DU= <C:\u>
##$EXPNO= 1090
##$NAME= <ADRS>
##$PROCNO= 1
##$TYPE= <nmr>
##$USER= <dgb>
##$AMP= (0..31)
100 100 100 100 100 100 100 100 100 100 100 100 100 100 100 100 100 100 
100 100 100 100 100 100 100 100 100 100 100 100 100 100 
##$AQSEQ= 0
##$AQ_mod= 3
##$AUNM= <au_zg>
##$AUTOPOS= <50 >
##$BF1= 250.13
##$BF2= 250.13
##$BF3= 250.13
##$BF4= 250.13
##$BF5= 500.13
##$BF6= 500.13
##$BF7= 500.13
##$BF8= 500.13
##$BYTORDA= 1
##$CFDGTYP= 0
##$CFRGTYP= 5
##$CHEMSTR= <none>
##$CNST= (0..31)
1 1 145 1 1 1 1 1 1 1 1 1 1 1 1 1 1 1 1 1 1 1 1 1 1 1 1 1 1 1 1 1 
##$CPDPRG= <>
##$CPDPRG1= <>
##$CPDPRG2= <>
##$CPDPRG3= <>
##$CPDPRG4= <mlev>
##$CPDPRG5= <mlev>
##$CPDPRG6= <mlev>
##$CPDPRG7= <mlev>
##$CPDPRG8= <mlev>
##$CPDPRGB= <>
##$CPDPRGT= <>
##$D= (0..31)
0 1 0 0 0 0 0 0 0 0.06 0 0 0 0 0 0 0.0002 0 0 0 0 0 0 0 0 0 0 0 0 0 0 
0 
##$DATE= 1142867403
##$DBL= (0..7)
120 120 120 120 120 120 120 120 
##$DBP= (0..7)
150 150 150 150 150 150 150 150 
##$DBP07= 0
##$DBPNAM0= <>
##$DBPNAM1= <>
##$DBPNAM2= <>
$$ [...]
##$SUBNAM7= <"">
##$SUBNAM8= <"">
##$SUBNAM9= <"">
##$SW= 20.6930455092707
##$SWIBOX= (0..15)
0 0 3 0 0 0 0 0 0 0 0 0 0 0 0 0 
##$SW_h= 5175.983436853
##$TD= 65536
##$TD0= 1
##$TE= 293.16
##$TE2= 300
##$TE3= 300
##$TEG= 300
##$TL= (0..7)
0 120 120 120 120 120 120 120 
##$TP= (0..7)
150 150 150 150 150 150 150 150 
##$TP07= 0
##$TPNAME0= <>
##$TPNAME1= <>
##$TPNAME2= <>
##$TPNAME3= <>
##$TPNAME4= <>
##$TPNAME5= <>
##$TPNAME6= <>
##$TPNAME7= <>
##$TPOAL= (0..7)
0.5 0.5 0.5 0.5 0.5 0.5 0.5 0.5 
##$TPOFFS= (0..7)
0 0 0 0 0 0 0 0 
##$TUNHIN= 0
##$TUNHOUT= 0
##$TUNXOUT= 0
##$USERA1= <user>
##$USERA2= <user>
##$USERA3= <user>
##$USERA4= <user>
##$USERA5= <user>
##$V9= 5
##$VALIST= <valist>
##$VCLIST= <CCCCCCCCCCCCCCC>
##$VD= 0
##$VDLIST= <DDDDDDDDDDDDDDD>
##$VPLIST= <PPPPPPPPPPPPPPP>
##$VTLIST= <TTTTTTTTTTTTTTT>
##$WBST= 1024
##$WBSW= 4
##$XGAIN= (0..3)
0 0 0 0 
##$XL= 0
##$YL= 0
##$YMAX_a= 220053
##$YMIN_a= -367531
##$ZGOPTNS= <>
##$ZL1= 120
##$ZL2= 120
##$ZL3= 120
##$ZL4= 120
##$ABSF1= 16.522
##$ABSF2= -4.171173
##$ABSG= 5
##$ABSL= 3
##$ALPHA= 0
##$AQORDER= 0
##$ASSFAC= 0
##$ASSFACI= 0
##$ASSFACX= 0
##$ASSWID= 0
##$AUNMP= <proc_1d>
##$AZFE= 0.1
##$AZFW= 0.1
##$BCFW= 0
##$BC_mod= 0
##$BYTORDP= 0
##$COROFFS= 0
##$CY= 12.5
##$DATMOD= 1
##$DC= 0
##$DFILT= <>
##$DTYPP= 0
##$F1P= 14.0000005364418
##$F2P= -0.99999901652339
##$FCOR= 0.5
##$FTSIZE= 32768
##$FT_mod= 6
##$GAMMA= 0
##$GB= 0
##$INTBC= 1
##$INTSCL= 1
##$ISEN= 128
##$LB= 0.3
##$LEV0= 0
##$LPBIN= 0
##$MAXI= 10000
##$MC2= 0
##$MEAN= 0
##$ME_mod= 0
##$MI= 0
##$NCOEF= 0
##$NC_proc= -4
##$NLEV= 6
##$NOISF1= 0
##$NOISF2= 0
##$NSP= 0
##$NTH_PI= 0
##$NZP= 0
##$OFFSET= 16.522
##$PC= 1
##$PHC0= 175.4724
##$PHC1= 10.62918
##$PH_mod= 1
##$PKNL= yes
##$PPARMOD= 0
##$PSCAL= 4
##$PSIGN= 0
##$REVERSE= no
##$SF= 250.13
##$SI= 32768
##$SIGF1= 0
##$SIGF2= 0
##$SINO= 400
##$SIOLD= 32768
##$SREGLST= <1H.CDCl3>
##$SSB= 0
##$STSI= 32768
##$STSR= 0
##$SW_p= 5175.98343685301
##$SYMM= 0
##$S_DEV= 0
##$TDeff= 65536
##$TDoff= 0
##$TI= <Analysis number 999999
Compound Code 99
Book Reference 9
Project Code 9>
##$TILT= no
##$TM1= 0
##$TM2= 0
##$TOPLEV= 0
##$USERP1= <user>
##$USERP2= <user>
##$USERP3= <user>
##$USERP4= <user>
##$USERP5= <user>
##$WDW= 1
##$XDIM= 32768
##$YMAX_p= 304911601
##$YMIN_p= -470121
$$ End of Bruker specific parameters
$$ ---------------------------------
##NTUPLES= NMR SPECTRUM
##VAR_NAME=  FREQUENCY,     SPECTRUM/REAL,   SPECTRUM/IMAG
##SYMBOL=    X,             R,               I
##VAR_TYPE=  INDEPENDENT,   DEPENDENT,       DEPENDENT
##VAR_FORM=  AFFN,          ASDF,            ASDF
##VAR_DIM=   32768,         32768,           32768
##UNITS=     HZ,            ARBITRARY UNITS, ARBITRARY UNITS
##FACTOR=    0.157963299565203, 1,           1
##FIRST=     4132.6476996994, 0,             0
##LAST=      -1043.33573715361, 0,           0
##MIN=       -1043.33573715361, -470121,     0
##MAX=       4132.6476996994, 304911601,     0
$$ Real data points
##PAGE= N=1
##DATA TABLE= (X++(R..R)), XYDATA
$$ [...]
26651 25295 -18576 61230 116406 225483 116683 19133 10003 28810 106099 124280 148410
26640 148410 194498 172194 46689 -71697 -66775 62889 11438 -175438 -139985 -81222 -41152
26629 -41152 30166 129385 293933 280045 289682 289495 133603 75451 59418 97076 89595 97253
26617 97253 130040 81173 -31852 -58815 40212 109743 86658 127568 27650 -3161 -5089 52818
26605 52818 198108 197900 131863 145964 108564 26658 30031 36976 120297 141056 132003 221064
26593 221064 156138 135345 124472 119640 177848 129365 3392 24779 112430 83473 29115
26582 29115 27063 41913 160308 171841 204639 96551 103741 232671 281348 364627 330266
26571 330266 197575 64225 35478 60803 -40351 34514 56378 29830 -6599 -19690 36147
26560 36147 12145 19436 49931 123509 113079 -6859 -5594 -62402 -177066 -138510 13262
26549 13262 -19758 -96482 -139348 -15033 116004 81004 58394 113255 161905 234452 216419
26538 216419 211537 52695 -65853 -175547 4857 52384 64121 70528 -5061 -25369 117737
26527 117737 166168 -45429 -119490 -95967 -111289 -136098 -60972 48969 124946 92046 45289
26516 45289 7516 -77761 -203895 -63364 -95494 -44261 149015 294077 295512 250450 86739
26505 86739 -46600 -31966 73085 157710 65909 -160260 -137934 177620 225542 132672 260380
26494 260380 227289 105070 71665 41383 -82901 -77621 -14851 -59880 -59456 48503 -81741
26483 -81741 -133959 -126032 -103579 11824 13662 92703 115256 69434 -1374 -124393 -184028 -126649
26471 -126649 -203541 -233458 -146970 -41499 68303 -3954 -122444 -65662 -66406 -27622 -24930
26460 -24930 -45905 -146308 -124048 -149255 -16709 2110 2683 67063 200066 205482 116963 85609
26448 85609 -7218 -30972 78849 207907 129212 73038 28803 33367 35555 -31664 16091 -54400
26436 -54400 -159261 -80723 -12377 -23924 -74089 20944 -134478 -230155 -250536 -201359 -167141
26425 -167141 -82172 38225 55450 -19967 -32544 -94335 -65486 -4823 94957 144257 18652
26414 18652 -51998 -34745 47259 -54482 -157507 -132090 -58238 -8087 -72001 -133269 -28213
26403 -28213 10871 -21977 -141473 -112671 -88380 -145046 -263829 -378266 -332359 -156687 42485
26392 42485 21885 -66478 -34217 -55633 16030 122149 -30805 -151961 -64783 -3651 -35651
26381 -35651 -40644 20032 40873 -4487 36145 75423 134233 223182 157043 111411 107218 128381
26369 128381 91221 -42220 -203497 -283476 -201003 -185887 -116697 -132727 -145858 -119098 -94629
26358 -94629 -36714 -82997 -163212 -151292 -158333 -198026 -190416 -186557 -209495 -140978 -161326 -160171
26346 -160171 -95018 -83943 -154100 -160245 -19105 14784 -60049 -130505 -134634 -36915 18297 41703
26334 41703 101729 128967 -89503 -147255 -88777 -64166 4169 -8475 -65005 -63331 -97994 -110302
26322 -110302 -90973 30596 15452 6679 26314 -5200 -32480 -134914 -139963 -102128 -96118 -230206
26310 -230206 -231021 -133177 -174567 -83350 -94511 -134587 -157923 -151284 -104980 61086 184304 53597
26298 53597 19313 -23589 -35945 -11318 62570 97083 70226 -4919 -108730 -82018 -35813
26287 -35813 136339 226222 139048 95987 38679 -159637 -110421 -80129 -181469 -178481 56401
26276 56401 124183 81061 50008 122749 63785 172 -35142 -92262 -190873 -262193 -253353 -145525
26264 -145525 -89397 -62929 -62351 53984 205897 119205 49797 95609 96059 66187 60047 35739
26252 35739 -1667 -67129 -147044 -123501 -36582 -16182 -61760 -104416 -62075 -28585 -7392 15031
26240 15031 -25659 22390 37196 118422 94179 54264 -66750 -35985 49123 85687 94279 100250
26228 100250 66114 -13553 -76950 -75300 -108936 -106514 -71993 -115332 -84601 -33016 -42710 -181575
26216 -181575 -222952 -141640 19081 151179 56881 2258 -45612 -116332 -98833 -29704 -98615
26205 -98615 -208145 -153339 -234716 -132298 42519 83770 165170 209268 223769 32231 -3358
26194 -3358 186118 298151 267871 182170 114168 98541 90556 -12203 -44477 -35720 43647 219969
26182 219969 168716 134036 138343 -54891 -46519 -106045 -102986 -27489 25283 -37620 -91763 -25039
26170 -25039 -16748 -18885 -44129 -9278 47028 65661 -93929 -133723 -139215 -113907 -95209 -91007
26158 -91007 -107255 -91027 59539 80317 -33000 -44056 -41974 -36672 -51440 19735 -2674 -2761
26146 -2761 -50393 20986 25616 53023 67064 68938 189823 146048 185954 93132 -24975 6598
26134 6598 -65230 -86002 47423 76415 -99457 -131644 -9241 44263 -47281 -74024 -186876
26123 -186876 -211897 -139103 3570 -38585 -54016 -113059 -52262 -17943 32506 178549 154410
26112 154410 72029 62115 -8405 29154 -10426 32278 84371 152458 226183 92432 9228
26101 9228 53033 115882 197398 179965 39537 -14357 17614 52145 23802 16201 -71208 -166031
26089 -166031 -187214 -49805 8904 102650 73158 85652 7553 73224 -73368 -153151 -20450
26078 -20450 2594 -114126 -33531 22685 -86241 -171702 -126465 94020 113028 -4160 -27478
26067 -27478 9830 82039 131128 6207 -43181 10083 47725 12237 -128094 -171998 -21284
26056 -21284 -170212 -156901 -117228 -177386 -130287 -6877 -43741 -150132 -79405 52755 89160
26045 89160 57076 -1195 -27384 37773 47474 -9400 -119227 -116531 -53068 -29440 -112969 -78586
26033 -78586 -48648 -190631 -218374 -182507 -102703 -54047 -136689 -183486 -173404 -216964 -183474
26022 -183474 -179677 -147764 20929 50149 68839 -62545 70047 12980 95739 166848 -18872
26011 -18872 -31262 -74990 -50717 44900 209583 298314 178743 16040 51207 70058 -100481
26000 -100481 -279129 -315577 -236196 -233973 -284354 -198957 -184389 -187041 -47625 -26157 -72178
25989 -72178 -123472 -98920 -53428 -25290 73437 165362 150652 134388 142684 64021 25472 2498
25977 2498 71349 64801 133684 165598 130141 132826 -92908 -64449 -49985 -120705 -95618 -6448
25965 -6448 6903 -29630 -36615 -63964 -157104 -73336 28364 26879 43731 196079 247046 178732
25953 178732 70567 68363 69487 74212 195756 146999 145231 256096 295791 306444 166229
25942 166229 38463 92514 27100 -30566 10880 -95745 -102121 -83482 14486 105407 97143
25931 97143 153337 52521 68368 41726 49529 33917 -70752 -52878 -111103 -152192 -212309
25920 -212309 -323225 -310429 -225738 -199034 -182070 -71698 -7132 -41430 -127090 -185725 -156403
25909 -156403 -136022 -158376 -282992 -191709 -76083 1453 113761 238706 184056 -2323
25899 -2323 -53741 29331 26100 -72998 -88122 -192850 -125897 12980 47838 -5080 29339 -26400
25887 -26400 -54212 57923 20861 13850 65622 5024 1503 80260 132116 153275 196702 179909
25875 179909 12858 -14123 49012 -8815 1697 -1988 36497 61287 50249 175904 276439
25864 276439 176559 1747 -104299 26446 145597 56397 48900 41958 126159 236934 225345
25853 225345 209252 93418 116516 112739 46873 -37519 -31307 52522 135470 111604 30568 73408
25841 73408 -54015 -178780 -127070 -105890 -52624 57299 122750 143712 90609 21001 107912
25830 107912 101826 4228 108097 188244 145669 145851 75237 -37544 -48080 -146367 -85439 -104079
25818 -104079 -192544 -133016 -16063 -66901 -66563 5818 107013 190501 161605 -20443 -116566
25807 -116566 -159009 -199825 -113649 -64341 5126 65447 -10205 60146 -5482 -563 3028 -19789
25795 -19789 118205 157623 74844 27057 -111180 -126310 37821 127160 228273 162983 -12236
25784 -12236 -103245 680 36902 68526 -61637 -173535 -157625 16140 47272 101039 168344
25773 168344 122388 -22941 -98077 -136494 -55686 -132666 -82880 -82284 -145854 -105981 -105309 -171796
25761 -171796 -188754 -133983 -7733 -30184 -43988 -73437 -64163 -74587 -118150 -270492 -464919
25750 -464919 -330030 -170924 -178301 -166335 -161682 -185462 -109305 58247 67893 -23032 63307
25739 63307 80175 57751 97871 44467 -15073 -82388 -41660 -11951 -106493 -39968 17433 -164094
25727 -164094 -216728 -154854 -129626 34904 94651 108409 26543 33261 61364 -71992 -76081
25716 -76081 -64161 62718 29054 30934 17355 -3563 32071 12540 809 76395 135365 158792
25704 158792 53493 -76328 -155670 -270836 -327858 -327586 -239140 -166737 -127983 -185792 -159903
25693 -159903 -106185 -71364 -71714 -36643 -167120 -204924 -34121 -92858 -141602 -181330 -196146
25682 -196146 -155379 -137702 -106826 -106013 -111101 -166870 -194908 -195618 -160969 -132065 -121563 5024
25670 5024 -33815 -101688 -101802 -111648 -241878 -258806 -367172 -245147 -92776 14073 -29985
25659 -29985 -20003 -19712 -104706 -73592 -38801 -80340 -61557 -99765 -63243 -106847 -162857 -8734
25647 -8734 -5541 -11674 -8848 -86064 -129287 -49095 -63361 -34039 -91072 -86227 -76700 -39316 -119089
25634 -119089 -197914 -62491 -37208 5585 39149 17939 71181 144258 33806 -21309 35994
25623 35994 114885 95278 79987 150067 92634 122578 159629 149935 172401 111214 2444 -54297
25611 -54297 71975 84211 36840 89583 248842 309763 188249 188395 137568 200125 264792
25600 264792 145374 50509 54384 -47047 -148240 -133216 -84776 -134204 -151871 -53436 186541
25589 186541 184387 49725 10319 5472 16086 -112411 -169216 -88057 -31019 49012 -30438
25578 -30438 -71872 -173985 -144221 -72529 -52119 -22909 24228 77408 -254 -7633 -24097 28492
25566 28492 27236 112704 229900 297287 244107 115281 85815 105746 43897 49603 83814 155294
25554 155294 224193 204639 167373 -5158 -68076 -40280 -44810 -7136 -28895 -79887 -181217
25543 -181217 -167882 -120591 -18640 -42873 -25367 -12477 -120391 -180695 -147112 -121258 -107439
25532 -107439 -101758 -55939 -20976 8567 4403 39086 -35271 -140153 45852 150207 35894
25521 35894 -135967 -44308 51342 115496 201481 161202 44561 45373 158629 190229 144513
25510 144513 113601 48018 3708 -70482 -66515 -129467 -132554 -134804 -45411 -58799 -118239 -115019
25498 -115019 -55165 28721 15913 163002 236540 173013 191634 47870 -68693 -158870 -149755
25487 -149755 -185156 -121171 -80582 -36835 -938 38790 -111062 -271383 -165575 -63968 -32897
25476 -32897 -41601 -79544 -35504 18124 -50159 -141037 -143621 -145323 -59085 -98647 -49779 59035
25464 59035 25563 8317 -12068 6284 82550 297727 191953 -48144 -60242 -2480 27975
25453 27975 86068 89430 111585 86478 76276 37594 43914 21791 -64689 66558 4500 -100221
25441 -100221 -95654 54556 80767 163110 212815 295776 353932 280338 248508 245100 241873 166136
25429 166136 203419 101089 25809 50162 145346 179643 152324 133073 57484 133531 227118
25418 227118 215891 174435 107778 -108321 -254649 -248278 -240398 -143569 -54489 24027 -3817
25407 -3817 20666 -19297 -49758 -12759 34799 -11362 -3649 104883 171587 88112 -104662 -197475
25395 -197475 -268733 -317764 -123231 26417 73593 101059 24997 57734 -13546 17092 -28040
25384 -28040 -128381 -86949 -68817 -43830 -174203 -201335 -155950 -83174 -140319 -150445 -121793
25373 -121793 -147655 -140256 -103415 26399 79906 76115 -65355 -96928 -95953 -92081 -92962 -112140
25361 -112140 -155025 -131499 -85725 9542 68666 37443 89903 135320 139288 10237 -101704
25350 -101704 -143917 -125663 -87736 -194543 -185607 -106864 -48698 -129975 -33577 2721 53368
25339 53368 626 -49417 3819 77704 48451 -24106 -94429 -81747 -32822 1968 36059 24389
25327 24389 110033 76224 164899 92013 80890 81653 1485 -60880 63710 59296 83074 83364
25315 83364 -54042 -74234 41407 45855 86710 10742 -13076 -38517 -112985 -196745 -199153 -85693
25303 -85693 -162723 -237261 -336789 -412039 -376148 -161014 -78859 -156986 -190293 -182396 -207821 -228170
25291 -228170 -141724 2097 -99917 -149323 -140499 -23313 13062 37144 94493 -46125 -83327
25280 -83327 -71393 -36959 -58532 160 16433 5292 -93064 -161013 -140837 -116239 -169354 -95992
25268 -95992 -58874 -36673 -216850 -310966 -255490 -195754 -110771 -44061 -184063 -242175 -174029
25257 -174029 -163969 -168494 -98123 20700 49636 89892 148191 80228 99687 -41856 -235314
25246 -235314 -354774 -398125 -248549 -226673 -158052 -111215 -184400 -171047 -219370 -142760 -178389
25235 -178389 -234161 -102141 -43227 -99125 -157682 -208226 -62450 138082 216864 194509 85969
25224 85969 129017 212924 199254 79468 44258 3831 -50745 -227522 -278873 -236258 -267685
25213 -267685 -165630 -75037 69514 48897 19159 30540 38573 96187 -37200 -9527 27946
25202 27946 64379 37570 30684 107670 62121 -1899 -84957 -77692 -66829 66591 228400 242950
25190 242950 100030 109046 31150 -231 16758 -9316 -39485 46938 81460 105117 127480
25179 127480 150888 105294 22941 -17153 9029 4693 -126380 -84056 -18945 -85531 -108977
25168 -108977 -52826 -103837 -96187 -61748 -31713 -66829 -144884 -132558 -7558 -14412 -28915 -71942
25156 -71942 -63310 -25160 -111301 -60798 -37016 -73890 -119249 -109729 -112677 -183395 -191939 -141250
25144 -141250 -154689 -110237 -64046 -126302 -52164 -15332 -58352 -70609 7109 73185 63489 -24322
25132 -24322 -105346 -123017 9889 4306 27313 144987 12696 -87741 -120710 -148112 -7719
25121 -7719 33955 -32849 -99536 -185153 -292406 -54804 2858 -41369 -69055 -30807 -16576
25110 -16576 59741 48480 9573 -28249 -81259 -143170 -192882 -100865 -41610 111518 160927
25099 160927 146262 189099 94724 95158 113377 122223 123449 85978 68607 81656 159204 228593
25087 228593 171276 41533 9546 -13298 -90128 11518 -29488 -207167 -155236 -94435 58608
25076 58608 196513 117136 69496 -34079 3383 -61354 9041 59813 -98063 -99055 -24089
25065 -24089 -1575 747 27473 47268 153245 56003 -54466 -126444 -165475 -81875 -112516
25054 -112516 -192209 -209260 -105618 91560 217525 218766 137042 75507 168150 110667 41583
25043 41583 21621 86181 -8402 36397 175943 186524 56036 63793 55623 6625 -76774 -182786
25031 -182786 -279483 -200431 -21549 -19668 52104 61051 -23818 -27514 44747 -13525 -38731 -46813
25019 -46813 -39166 36887 52272 37311 -47225 -6210 163643 123013 37171 -86825 -64590
25008 -64590 56422 78445 102204 111779 157755 49452 -37508 -24168 12253 104520 -11980
24997 -11980 -40496 64453 53545 -86627 54271 3172 49413 -17059 -859 76999 135101
24986 135101 231608 239529 260449 204894 32166 -124528 -122886 -22360 72912 138991 84220
24975 84220 6585 -202741 -189770 -104404 -67541 -70813 31713 136526 37502 -82228 -147269
24964 -147269 -88257 118 -7438 -55581 -44616 -20372 81814 -2889 38275 52157 41676
24953 41676 71333 -16314 46766 129637 159026 123875 158111 80344 10882 -63356 -138387 -66703
24941 -66703 35898 -30918 -71804 40298 36807 62742 25204 -35794 -38141 -30599 -49157 -14902
24929 -14902 -11956 -36567 -125103 -124730 -18958 7864 -36485 -153498 -92920 -23034 -3958 104594
24917 104594 36812 -117843 -151102 -171932 -165905 -41805 -13310 -69771 78335 157728 51348
24906 51348 -97374 -34279 54834 70717 49544 22633 6934 -22250 40264 -26928 -152596
24895 -152596 -104174 -21472 84643 105253 62674 -17085 -52891 -144420 -125996 -123486 -38172
24884 -38172 -3332 118247 113360 49409 14376 76719 65048 141454 146291 17400 -73188 -93137
24872 -93137 7051 178183 93660 59953 25159 -129484 -179520 -260872 -217879 -154785 -91369
24861 -91369 -123608 -167587 -139840 -22223 193486 155755 126941 151058 116660 142810 175149
24850 175149 -20309 -16146 40564 15028 -36467 -39023 -2878 27415 99398 56505 24871 -17364
24838 -17364 -47801 -88493 -43576 -47850 -79410 -46195 -33643 -75531 -104567 -188463 -233886 -133721
24826 -133721 -148241 -189388 -154131 -144372 -108020 -55770 -11657 -59259 -118043 -100572 -126959 -249331
24814 -249331 -282471 -182684 -3587 183363 120818 -41763 -112393 -89186 -158954 -171014 -192564
24803 -192564 -249904 -223163 -397129 -462390 -301100 -107749 -9006 46691 82118 -103533 -184390
24792 -184390 -98003 -181801 -184947 -150252 -35712 -33474 24636 72893 153108 153587 2269 19061
24780 19061 40031 9886 -89213 -67467 25757 -5308 -169338 -97316 -109157 -63974 45374
24769 45374 35670 62521 150714 106373 6328 -35692 -90458 -131858 -175708 -87323 -9279 -14106
24757 -14106 60174 -1518 -119849 48678 121819 56322 -100518 -78735 44141 173816 138905
24746 138905 13739 -114983 -93989 17159 61319 -14688 -125082 -203404 -164566 -144216 -101223
24735 -101223 -96376 50634 122335 40398 21261 40042 -41739 -134555 -200181 -161547 -74205
24724 -74205 -40978 -12066 4004 74182 93057 18484 -89193 -14363 -41837 -67769 -144363
24713 -144363 -163610 -195493 -183566 -57616 -25350 53286 86638 37902 13311 108947 138999
24702 138999 82496 19379 -7677 117070 157876 12029 -20693 -48207 -80437 -32726 34441
24691 34441 71254 164327 64861 22471 107695 45507 -76115 -37441 -53513 -125633 -260548
24680 -260548 -260594 -206061 -118936 23312 53577 27308 86048 310031 243081 88014 37070
24669 37070 27756 -82851 -49519 -42364 -81966 -31597 -93359 10474 -125099 -199731 -220315
24658 -220315 -265006 -346242 -448098 -340102 -268288 -163616 -15507 88051 78069 113729 -1693
24647 -1693 -62257 16078 77445 13847 -42711 -84437 -55310 -17308 85894 26291 -79741
24636 -79741 -103437 6850 -27519 -28136 105419 111250 122446 107883 169408 177934 17682 -49706
24624 -49706 -36537 19545 -34564 -85805 -93594 -180483 -146241 -59382 -53520 46807 -28498 -152038
24612 -152038 -239123 -38148 13123 28327 -13618 43719 -53963 -99474 -26943 -30175 -39156 -17048
24600 -17048 -11569 -30650 -69739 -83327 -157429 -236436 -256030 -160394 -101255 -90941 -44407 -2709
24588 -2709 85152 30522 -87861 -183853 -106437 -37826 41664 173722 100270 -21200 11279
24577 11279 5505 13849 45870 50432 42837 71688 -13857 -86291 -165209 -138743 -21433 56691
24565 56691 123242 -9412 -141508 -88823 -117847 -153353 -127950 -145090 -177271 -221551 -183994
24554 -183994 -233447 -206427 -102945 -89433 89609 119625 96858 54275 12019 -63490 -36829
24543 -36829 58690 229422 136064 -2344 -75324 -134386 -42607 30131 -19210 35200 45627
24532 45627 126462 149150 91671 170854 235631 219068 202718 69605 11220 -58618 -127635
24521 -127635 -115617 -76066 -94567 70557 157780 64994 -62443 -162504 -212619 -186065 -121588
24510 -121588 5800 117155 104360 105031 44593 -76756 -163748 -85627 -103584 -71599 17265
24499 17265 118225 100184 58563 -76117 -57 76684 55425 -23798 -98553 -190291 -190131 -87705
24487 -87705 -10961 -9894 20463 187823 290541 212319 175791 149816 110307 119991 21050 36193
24475 36193 32373 40260 -7567 -83093 -837 -18466 86346 57623 72939 141319 214063 231922
24463 231922 174695 76734 -11287 -111197 -95148 -59043 -37921 -104982 -256529 -243055 -141704
24452 -141704 -44523 36706 -64855 -122403 67351 179222 145269 153006 105209 -61734 -142140
24441 -142140 -74374 -24257 -72787 -83572 -37805 -61437 -124458 -128574 -168975 -130164 21950
24430 21950 72363 20196 31567 161761 206302 173460 13743 -140607 -208167 -109749 16070
24419 16070 -39036 -130446 -131031 -106949 -157602 -58314 52061 49056 -24216 -50004 -84858 -142323
24407 -142323 -99835 -74109 43010 4282 -123074 -108211 46487 124248 69899 27905 -66536
24396 -66536 -88049 -23482 57285 58564 5397 -58443 -56905 -90636 -43653 29747 51169 78671
24384 78671 26502 -2509 -12878 -29115 13043 16194 20229 -13801 -111543 -285039 -239883 -103470
24372 -103470 -3295 -68420 -158761 -109753 -118438 -220041 -121439 41818 48267 -138421 -254973
24361 -254973 -170455 -84066 -9260 96581 190823 128404 94123 10804 -80644 -210311 -179252
24350 -179252 -142919 -157227 -120200 -103944 -56661 56039 164655 81723 -79355 -75355 -30984
24339 -30984 20737 498 -11431 110661 92549 136045 190117 15608 -117041 -75329 -124945
24328 -124945 -47679 100932 179096 114273 54523 60470 96538 82936 46621 -135167 -117449
24317 -117449 2782 -15783 -24289 -71325 24495 14262 -89532 -172527 -115811 -106350 -9627
24306 -9627 -20420 -82542 17094 143175 202179 158773 194348 222842 205977 103570 53291
24295 53291 -63582 -222668 -319967 -199419 -28066 -20986 26994 54782 -52646 -34775 77972
24284 77972 154666 146623 32183 -46579 44193 76195 24593 5232 113558 44244 16248
24273 16248 134362 72784 -74242 -136831 -86915 -28177 46828 73549 148181 165952 174689
24262 174689 177000 121185 39161 32453 21905 63772 28150 -14720 35434 78484 -6908 -82402
24250 -82402 -85667 -28348 36750 97136 165560 90389 56721 -45735 -32568 -53478 -104243 -19098
24238 -19098 41900 82281 -49936 -127945 -91392 -79726 -35568 34599 45065 -54005 -68678
24227 -68678 -97771 -20557 -8445 72680 -107888 -97797 -18075 -134126 -182198 -9302 31687
24216 31687 -21181 -72367 -63928 -109049 -73030 -162602 -173907 -96852 -56841 63173 172906
24205 172906 151673 95612 -7132 -95041 -7829 27380 -1693 5664 -66648 33017 97976
24194 97976 137283 210902 150461 3414 -140742 -141814 -99691 -110166 -32350 37255 -62147
24183 -62147 -109859 -35680 -30992 26427 141627 62521 -115168 -187632 -149664 -18313 60189
24172 60189 -55457 -249858 -322114 -259153 -100265 -56833 -15708 28672 6472 -80702 -107513
24161 -107513 -72951 -108724 -113476 -66851 134332 136133 47425 -18124 -48261 -7122 89383 74412
24149 74412 -44816 -36205 -19308 -18064 -16772 -39546 -224208 -429546 -428258 -342092 -146151 64849
24137 64849 117842 129328 121859 171730 111957 -70243 -163549 -186820 -136314 -14378 -39860
24126 -39860 -141159 -672 -32275 -176393 -215090 -228324 -161076 -23763 42331 127091 73953
24115 73953 -2215 -70202 -77546 2112 -25861 -109044 -48843 80334 258815 159364 9576
24104 9576 -57821 34158 185569 179938 197980 134407 99607 -52980 -61475 -29014 -24810 -82913
24092 -82913 84260 109223 114583 148067 170318 105877 -92043 -211277 -128727 -110887 -177845
24081 -177845 -292466 -342886 -288786 -139015 -14287 -87090 -167695 -106159 10847 28978 -102207
24070 -102207 -45146 41066 -118035 -116127 -152077 -253439 -111624 -104851 -78729 31614 15189
24059 15189 -59598 -110338 -86943 -30488 -19423 -93508 17512 101253 73158 1456 -81782
24048 -81782 -78153 -17329 5248 -10806 27654 -78544 -136900 -127131 -75236 -56550 -44956 -20247
24036 -20247 -36602 29043 -29743 -31448 -111776 -67944 -68257 -200182 -184540 -96690 -84886 -222037
24024 -222037 -211534 -201487 -195627 -170262 -224566 -303220 -198281 -143159 -249171 -173927 -158948
24013 -158948 -132513 -176733 -125519 10642 21829 9957 -34927 -9822 -50371 -155020 -144991
24002 -144991 -164911 -186960 -211921 -142064 -71406 4821 123567 121678 72400 -12782 -172894
23991 -172894 -217748 -130832 -92759 -134377 -148386 46288 38950 -36538 -40326 -46742 100145 126052
23979 126052 78060 102006 95652 -606 7377 2343 67419 33012 8472 63349 112495 55529
23967 55529 78036 44487 90606 44043 -86777 -120164 -130247 -40262 -67349 -163011 -130592
23956 -130592 -13636 133550 121909 -58365 -118208 -162543 -113324 -101867 -98211 -138398 -37263
23945 -37263 16414 101750 163434 69475 82616 122961 97405 -34528 -101574 -180303 -209169
23934 -209169 -222179 -180785 3233 158846 182394 78086 70151 55077 14419 -31369 11617
23923 11617 67014 70644 19960 1774 -10113 -56046 -94092 -1824 -10681 -66690 -46414 -32430
23911 -32430 69552 -13781 -37542 -101043 -201105 -234767 -103563 13669 83189 46798 -35627
23900 -35627 29514 35285 -70718 -38932 50520 98755 113490 53440 -99420 12163 151675
23889 151675 145233 25385 -24251 65074 106333 -42708 -29663 -61555 -160953 -222301 -116163
23878 -116163 -33234 -41667 -13304 -47537 -82904 -107159 -110112 -227891 -99242 -82557 -140981
23867 -140981 -148978 -79147 87398 126609 46364 -1382 -105882 -150904 -92356 -29397 -7436
23856 -7436 38508 24259 -3035 -83788 -201532 -220674 -136156 -49951 87632 137318 123243
23845 123243 -17282 -38389 -31335 -39577 -119660 -99537 -113563 -161604 -88832 -101720 -50381 -50195
23833 -50195 -142904 -143299 -185936 -180089 -252960 -363320 -355783 -382088 -299063 -219969 -116602 -62240
23821 -62240 -110711 -218528 -168744 -47833 88235 -106529 -183695 -128759 -218287 -341510 -206665
23810 -206665 -144525 -151952 33467 121256 128125 114159 68719 73723 136021 76691 -64983 -51839
23798 -51839 15150 102304 108204 77111 -148107 -158856 -168595 -240840 -183574 -102754 -87253 -57339
23786 -57339 -67109 -28377 -34074 10659 128085 262570 234786 106755 -73294 -68580 -62082 -179204
23774 -179204 -154791 -33686 61324 44868 -33811 -144860 -135617 -112195 -135491 -76468 -37635
23763 -37635 -114445 -109325 -31568 2865 -24125 -85524 -49413 -31554 -152297 -204670 -101682
23752 -101682 -112160 -24112 70135 129517 141102 47211 49609 22299 -10357 -56953 -44930 102608
23740 102608 153887 113197 126381 34266 18630 57537 40479 40416 57014 35085 73680 15906
23728 15906 24799 131591 103866 136508 139656 29161 -39448 -200643 -180555 -110749 -9128
23717 -9128 31179 10788 91927 76087 -14738 -37679 -89639 -130141 -153136 -92372 -106954 -22245
23705 -22245 -69510 -55726 -121862 50424 10115 -730 -74288 -78226 28432 9434 30309
23694 30309 31872 92146 -45116 -175469 -44882 19282 35212 85783 9751 19217 76019
23683 76019 53325 -3829 -108818 -251203 -232390 -163332 -125552 -93886 33409 86250 97036
23672 97036 -28142 -122408 13519 153768 172009 29000 -20827 -91166 -44078 67245 56266
23661 56266 -66883 -110463 -105343 -45418 -30366 11931 -21574 -66296 -68509 -150571 -261309 -211042
23649 -211042 -156336 -171919 -142394 -68311 -66461 -128334 -131338 -182239 -128172 -205992 -161462 -111560
23637 -111560 43113 185297 159905 70615 76826 -33477 -35381 55087 102859 123704 128095
23626 128095 16667 42244 56176 26141 161853 178009 199500 163651 58016 -52278 -2339
23615 -2339 138040 22541 72681 107677 71718 28573 -29452 -129867 -96989 -126774 -91958
23604 -91958 -445 -18761 46745 148789 172482 48450 -12348 15355 65803 38139 -72307
23593 -72307 -153423 -204752 -114465 -5215 -44927 -91575 -60215 -48594 -106796 -61202 -64808 -54183
23581 -54183 -53977 92046 194278 188393 177768 177249 103492 61186 -25007 -76079 47321 42701
23569 42701 -91279 -181210 -137848 -21906 27552 -126879 -83973 -91707 -133387 -141305 -196113
23558 -196113 -136047 -49505 -12460 -57510 -38512 -45026 -110253 -183059 -110714 -145506 -149170 -64357
23546 -64357 -6119 2067 58161 198273 45802 -108984 -55961 141069 72099 77133 38533
23535 38533 109482 71791 51885 -18381 -89922 -81881 -14062 51111 8878 3408 12102 103854
23523 103854 158030 112475 -11126 -39226 -60545 -133262 -66388 38452 -58287 -79793 -28829
23512 -28829 -12968 -34421 -122916 -100040 86610 69297 -5285 -40631 118678 170992 85050
23501 85050 -28690 -104463 -271731 -226807 -144213 -25231 35668 117324 65630 23626 5748
23490 5748 96470 54350 -4155 -25972 -48017 -77331 -35917 -232032 -197187 -199031 -174572 -24151
23478 -24151 18612 23346 -54855 -114725 -43583 24514 18707 -12636 2675 33567 14931 -105749
23466 -105749 -272461 -402357 -384216 -289980 -275108 -273565 -243127 -195850 -232424 -98804 3583
23455 3583 10327 -23851 -227576 -328387 -180592 -5194 66313 100177 145744 86342 61262
23444 61262 10528 -82414 -97235 2643 39669 16928 -35772 11933 67935 86698 -37129
23433 -37129 -87654 -180267 -172771 -102687 -52805 -12705 -11873 -38935 -68825 -35642 76226 -6883
23421 -6883 -101086 -112366 -25124 -44384 -77933 11180 112489 156335 33986 -81397 -51169
23410 -51169 -112071 -154345 -21226 34776 -12225 10105 91078 108483 95911 38662 53375
23399 53375 -28513 -99700 -153203 -12679 -48708 -121140 -69354 13843 -66072 -166894 -235152
23388 -235152 -120786 -57129 -146288 -157167 -162732 -70258 -523 -45539 -197976 -316071 -281422
23377 -281422 -192380 -63624 2688 13229 100411 159612 102831 164693 192417 74003 87328
23366 87328 142550 -20606 -124514 -237271 -289186 -169198 -22937 -28921 -75291 -152135 -180107
23355 -180107 -127232 -188707 -265616 -168631 -85092 -21068 37278 -56121 -195259 -162590 -64454
23344 -64454 -134070 -72535 41380 30700 53599 112823 147134 173921 82112 67926 97677
23333 97677 114345 59193 -33847 -12441 44470 49388 -49466 -141935 -190776 -128666 -48568 -95845
23321 -95845 -153907 -86682 -85004 -87993 19316 -97563 -161751 -90002 -133782 -69220 -25901 -28140
23309 -28140 -100268 -138321 -112879 -161034 -39231 66810 76237 2079 -7767 64369 117525 165082
23297 165082 42868 -24199 23109 41911 72843 -20649 5670 -60371 -20204 75055 113643
23286 113643 23224 31207 -46149 -85566 -152277 94762 246372 178445 146490 150061 63601
23275 63601 42022 119864 123435 64115 -1331 -116121 40245 102529 107298 68548 86857 130798
23263 130798 109285 20612 48672 72369 39508 -23057 -79239 -55299 -85557 -14533 11703
23252 11703 15128 -22077 -150779 -178224 -211177 -149243 -91374 -40662 -69344 -104581 -98855 -85129
23240 -85129 -81910 1788 74348 59488 80142 19216 -6271 16942 38440 177549 180146 21344
23228 21344 -3007 55103 144269 183859 104997 -76433 -8556 -42429 -57802 50111 10298
23217 10298 -104649 -217935 -174287 -139590 17251 11660 -106021 -16296 13440 -64126 -134291
23206 -134291 -147244 -150726 -135093 -107805 -45623 -39065 -65499 -167709 -247089 -242175 -261131 -371066
23194 -371066 -237209 -200203 -17227 75324 18922 -34175 13501 24589 56125 144701 143699
23183 143699 122458 109303 42239 -6214 64488 40284 21476 -17918 -12114 -465 46792 58576
23171 58576 -4781 -74106 -102658 9287 -61056 -110576 -174790 -243931 -136040 -24230 -12211
23160 -12211 -21904 -16003 38505 66495 54532 38407 110810 223070 131397 5731 77547 149342
23148 149342 82860 43368 -726 57794 53560 39641 -64893 -66189 176699 210819 118289
23137 118289 -5338 -51787 -24706 -91506 36739 43583 -38564 40773 24673 51631 6252
23126 6252 -7522 46841 66147 -14857 19080 80746 89196 5428 -82610 116577 90475 32706
23114 32706 68000 -4927 8163 87123 48146 -9873 44744 70063 136733 158039 40939
23103 40939 -25035 137314 139284 20938 101523 84212 -8438 7857 -116112 -238947 -130753
23092 -130753 77381 96561 94690 154857 146602 134753 98882 -38974 -82267 -101503 -51764
23081 -51764 -30936 -52808 -17589 31558 92601 168117 87658 19938 -12638 -26360 -43590 -23406
23069 -23406 -125640 -84489 -114370 -190643 -184618 -130209 40663 159348 101304 -4628 -113652
23058 -113652 -93057 21006 35905 84530 31693 -155 132873 122722 6796 -48572 37014
23047 37014 130677 59278 87104 71604 -8258 30453 55929 -31187 21123 -26885 -61968 -42154
23035 -42154 -48928 -107911 -73798 -41445 -20126 145223 188541 214669 246374 222633 261308 160155
23023 160155 118704 -26826 -50704 191235 184962 80858 50625 -2264 88539 39159 -107643
23012 -107643 -84733 136018 131569 15378 21541 39127 91204 128118 148152 74100 -51955
23001 -51955 -177565 -226481 -145516 -166235 -94293 -38069 -44238 62292 123916 18219 -77302
22990 -77302 -90305 20974 52104 58750 8543 -104255 -86296 -13385 -23891 36152 -8653
22979 -8653 35088 70398 71301 41533 4520 -53688 25028 104334 56040 40845 34444 121764
22967 121764 256443 245587 219476 94602 31002 38474 1639 11570 -31674 -88851 -57125
22956 -57125 -75467 125654 133626 69178 -8633 141540 195403 203630 152723 -31736 -126573
22945 -126573 -139818 -136547 -104802 -20077 39511 146590 174850 50649 -19461 -12697 -33006
22934 -33006 -6987 -3649 -128667 -192134 -25042 18659 6637 -4286 3646 -100441 -122177
22923 -122177 -43525 78423 184060 178835 76211 99470 95744 96110 107907 204451 118701 100106
22911 100106 54881 46036 -53388 -129401 -124397 3829 43608 20366 -21568 -144494 -136064 -170481
22899 -170481 -81715 -110843 -153002 -104500 -142860 -203313 -131137 -87387 -45464 146495 223784
22888 223784 221712 216082 22166 -25670 -67759 -65922 -51689 -8412 6395 -59023 -48652 -109350
22876 -109350 -102673 -113570 -89825 -14602 -51393 -229941 -289565 -162081 -76253 -100556 -34857
22865 -34857 -34657 -96258 -78070 44428 101931 181130 138526 -66116 -132983 -96621 41115
22854 41115 128830 43886 -68904 -131438 -67466 42902 125370 154228 197919 192027 143171
22843 143171 64931 -20701 -1552 135775 213417 225348 85538 -14870 -17723 -8769 -39448
22832 -39448 -46296 -143906 -175386 -125942 -100174 -51463 46227 181615 183194 114891 -5663 -28184
22820 -28184 9262 -26016 -75285 -15404 -34260 -82781 63659 34947 7592 70940 41981
22809 41981 9585 -55831 11933 73200 29110 42135 -21881 -59011 -75088 -53577 -86595 -63642
22797 -63642 -97580 -28496 -23367 -63667 117516 184734 103594 -22340 -153225 -132989 -86132
22786 -86132 -73157 95971 157766 14555 -33869 39503 55791 93438 106240 54563 -53395
22775 -53395 -106723 -67671 18328 68250 102415 50898 12792 70080 113131 2572 -50312
22764 -50312 44927 41380 -92440 -153634 -148356 -22865 29261 138506 108919 20671 5855
22753 5855 -76127 -70136 34448 108082 113048 34056 8817 75875 87626 22176 14609 16352
22741 16352 -91091 -24945 29014 84347 65808 96362 95197 -17015 -89513 15387 10088
22730 10088 23003 141607 169684 110035 -76772 -31961 884 -41704 10437 -38860 -207889
22719 -207889 -255830 12887 105732 203393 62774 93118 74555 -83640 -132905 -42580 114019
22708 114019 108655 102055 128847 46339 -40328 -106556 -84876 -71695 -192597 -276763 -277284 -92401
22696 -92401 -17879 -37747 -56293 -144853 -117611 -28891 -36706 -49861 -100177 -75120 -47340 -103693
22684 -103693 -221465 -297921 -307795 -231989 -62313 -84496 -82551 80585 92757 59197 -23082
22673 -23082 28089 59855 93675 61731 92965 22994 -26492 57736 -2957 -97615 47084
22662 47084 172377 154355 102292 184312 142424 6400 -63567 -132175 -146430 -119348 -72529
22651 -72529 -49123 -87173 -168224 -65584 -57574 -72689 43872 66183 -13237 12299 24399
22640 24399 -10072 -124684 -209815 -247141 -176332 -59427 -8052 103823 8097 -53894 4386
22629 4386 -17781 -46068 27405 46298 8963 -19194 -49199 -43336 -30731 -117830 -33646 -21241
22617 -21241 -70953 -63378 -94227 -17152 -107521 -243540 -29143 15599 -56823 16181 194505
22606 194505 84317 -73833 -47741 -36947 -68880 102523 105552 21709 -80424 -44983 20499
22595 20499 -41709 -72543 -158411 -103255 -120329 -167552 -197098 -115090 -196804 -213305 -159576 -23870
22583 -23870 93671 80865 23372 98484 84730 26213 109476 166824 105124 -23351 -22226
22572 -22226 4045 -34605 -52149 -4585 -24220 92365 -38006 -58368 -75494 -86722 -115563
22561 -115563 4407 96863 8595 -60880 38773 181858 254722 105426 -108281 -158734 -141556
22550 -141556 -126621 -184305 -217692 -117856 -55122 -30670 -84475 -147354 -79206 -75205 -46861 5803
22538 5803 135471 74218 7574 -146961 -186283 -135029 -97721 -60653 -76684 -192317 -167203
22527 -167203 -86098 -54966 36272 -1616 -116482 -102929 26584 56064 80869 87259 -11668
22516 -11668 -100868 -95111 -153228 -73186 38529 8490 -160431 -185249 -137100 -13590 58047
22505 58047 -19577 -56756 -58506 -64122 -58115 -150718 -88856 -9777 65745 64879 89159 124559 154148
22492 154148 26262 12759 116218 156556 119775 79171 6731 -104447 -56502 77846 -15141
22481 -15141 -100799 -194005 -157069 -20275 41459 -24641 767 84260 106645 89428 111026
22470 111026 121688 25479 -128789 -76411 6113 -86458 -8861 86656 202619 144475 26041
22459 26041 -3851 73583 190187 253535 259774 294781 223750 234230 146136 91687 242309
22448 242309 439571 445950 309233 299698 290957 103930 19254 17883 28869 112584 10199
22437 10199 -46854 -103696 -120611 -63353 -90887 -3000 20396 -59540 -41103 27722 27725 30992 94540
22424 94540 154450 17438 -71058 -72939 -96596 -153884 -179960 -50054 31388 18200 -11101
22413 -11101 -58838 40036 -30330 -84166 -24215 -18986 -243503 -235011 -102611 13269 74465
22402 74465 82766 128495 14889 -2224 93278 27695 55518 -8363 -155255 -187651 -156874
22391 -156874 -214437 -277909 -180507 -102492 -179406 -172996 -226013 -265954 -185935 -5213 -37815
22380 -37815 -13106 -96863 -134668 -87501 -99247 -113284 -66683 11580 100698 23874 -51396 -21144
22368 -21144 34946 -57745 -110714 -17061 13261 60009 128066 189605 97979 28240 83991 110317
22356 110317 39407 23468 66320 106739 95859 136301 112023 59860 97824 105942 95613 28025
22344 28025 -73120 -52230 19202 31050 -69867 -112781 -64302 -28693 81503 113714 -50379
22333 -50379 -8737 109248 62828 -101304 -51614 69013 15143 20399 85424 78723 86253 85674
22321 85674 125858 97702 54858 -62971 -134784 -14000 125227 210496 267756 266824 198860
22310 198860 92148 -12497 135170 158664 260373 248472 99521 64190 -50095 -90052
22300 -90052 30692 92567 69035 34914 119084 93506 47060 57233 54681 107383 118865 108208
22288 108208 35461 -4319 14115 -47265 -115178 -129542 -93163 -1378 9113 42945 -28829
22277 -28829 -90165 -166076 -98690 -50469 87254 199226 123392 48610 -29602 -134260 -117894
22266 -117894 -142984 -220668 -330993 -400531 -215637 -167256 -209981 -143603 -80263 -105607 -34874
22255 -34874 -65536 -128464 -81963 1775 -56203 -10672 108660 165638 218670 216027 99836
22244 99836 -76895 12833 44948 -24697 -91920 -45667 18781 -47321 -202857 -272637 -235829
22233 -235829 -71330 18510 51660 -8399 13091 106293 41854 54439 8470 -99809 -52287
22222 -52287 -60776 -110403 -205717 -115539 -71272 -28855 -94858 -129212 -228304 -176955 -49085 -103776
22210 -103776 -182573 -143395 7139 61481 -4211 43013 -94810 -242041 -167221 -97874 -10137
22199 -10137 -19147 -24087 -16291 -16532 -75976 -68510 -63347 -73970 -75343 -121638 7764 -13393 81897
22186 81897 104593 -23473 -171720 -114557 -37742 -87781 -133794 -78077 -36392 48337 72493
22175 72493 94021 -35462 -107823 2820 -34607 -120865 -108400 -7142 69372 120712 87119
22164 87119 -46594 13451 5583 -44028 -85970 -85414 -101720 -56502 -111245 -59442 -75711 -29020
22152 -29020 24255 99625 160011 97925 110622 210580 166052 60320 -26795 -54093 26630
22141 26630 43330 30668 -99392 -200479 -146409 -22397 210503 187568 199779 52634 -152071
22130 -152071 -188902 -171005 -125029 -83932 -32025 120890 151501 66735 -224602 -305383 -235197
22119 -235197 -256950 -253106 -208195 -1463 82216 20735 -142625 -196639 -214149 -244906 -234458
22108 -234458 -167466 -24260 19855 -82748 -120329 -102187 -88437 -60833 -109762 -273427 -195771
22097 -195771 -191454 -180094 -70862 36161 -37362 -73947 -42658 105768 149495 80563 -124620
22086 -124620 -178517 -1568 91325 85454 86270 -152 -43555 -46643 14479 72883 35651 87299
22074 87299 42061 -9145 -16645 -49397 -83099 -135578 -120665 -43999 68237 90845 -8944 -116025
22062 -116025 -135721 -47464 -88921 -193350 -231772 -49960 113219 240872 245773 187803 145498
22051 145498 156665 40790 42074 107803 77261 37449 -70348 -205468 -184452 -136667 -3769
22040 -3769 112302 175630 206322 237080 -29235 -147902 -244283 -239196 -208800 4926 170225
22029 170225 162184 74642 468 -6983 -60647 -106440 -36755 15763 -9120 -69199 -104448 -216907
22017 -216907 -175792 -172331 -110081 55665 58077 81600 117758 73600 70671 94980 22642 -35439
22005 -35439 -37097 -21148 -70686 -102624 -165358 -140662 -230412 -168896 14049 -4426 -39737 952
21993 952 -13961 18576 -48769 -126840 -165577 -4301 238204 266678 124726 52381 18397
21982 18397 129830 176870 215680 88046 -13004 13208 115874 127765 149369 12604 39138
21971 39138 83506 37637 65260 -21180 -25836 39126 35374 -72161 -143373 -140526 -51728 3366
21959 3366 17626 60169 -39187 -46843 -15385 -86699 -59712 -56799 68065 159420 106902 -27475
21947 -27475 -86269 -194078 -205933 -99445 -49055 8988 -49901 -113089 -86659 29497 42897
21936 42897 38344 118293 45671 -144404 -176447 -13393 -35115 -25828 47569 45482 151959 259872
21924 259872 248270 260787 247967 223790 207254 166490 100273 116157 79628 32192 2142
21913 2142 -85040 -69713 -32213 -11431 54543 104871 97005 154756 180347 151447 81318 -82756
21901 -82756 -101089 -77675 -34095 -37240 -75150 -177790 -148016 -25408 34850 197068 229990
21890 229990 108620 12927 -31961 -67828 -24320 75773 68618 65243 138357 170385 140318
21879 140318 80795 153857 122056 33968 60099 20667 -124608 -238262 -170544 -46032 -40097
21868 -40097 -46662 14443 -27074 4263 -31665 -122906 -119034 -84081 12031 117524 107764 93658
21856 93658 48255 29316 -25893 -68323 -52543 -63792 -24618 132972 146198 182350 190263 97040
21844 97040 83195 40994 30029 -73849 -60576 -80868 -135374 -142547 -7462 10984 -88906
21833 -88906 -71101 -76381 -172112 -73559 7777 -27806 9208 73187 -30398 -127741 -75994 -160938
21821 -160938 -143550 -187980 -134753 -67100 -22959 -67746 -96373 -58235 -53936 -9302 -15378 47450
21809 47450 -54004 -47162 5465 43940 2890 46794 42081 47873 57661 22644 -70902 -31752
21797 -31752 104647 103746 193142 232782 188800 53706 -108948 -107861 -130718 -100638 -115997 -155824
21785 -155824 -159194 -124302 -116653 -41472 -148363 -207440 -214116 -225547 -152037 -153404 -141359 -176798
21773 -176798 -213729 -92704 53824 86735 75021 90811 68635 -5791 4593 27911 -21250
21762 -21250 122 -25644 -20135 99378 65312 -55611 -68118 -147296 -119423 -177957 -184504 -187374
21750 -187374 -127384 -30828 -63678 81768 77902 2893 -13166 50296 -8690 -17637 54534 23559
21738 23559 2353 -80431 -5890 50387 -48945 -110330 -258215 -182839 -122873 -70937 -100401
21727 -100401 -114866 -104734 -66360 1721 23087 30428 138291 104588 3077 -78037 13749
21716 13749 101642 -617 -68076 -135136 -79604 75990 99975 19403 -159766 -198082 -138850
21705 -138850 -98618 -148914 -179913 -213081 -194261 -313484 -312300 -196495 -51138 -11404 5996
21694 5996 4288 -41808 -68303 5840 -35658 -79769 -253077 -301186 -175199 -84174 -207781
21683 -207781 -282612 -338799 -298330 -198728 -62557 -6260 -16226 -114102 -73618 29381 86126
21672 86126 88695 65771 37578 -17948 -81786 28900 71311 148253 189424 121682 -62683
21661 -62683 -166387 -212177 -200188 -165175 -142690 -98937 -137375 -29539 -27855 -62340 22134
21650 22134 131783 113116 -32108 -87659 54830 144836 187259 113277 119223 185017 117876
21639 117876 61267 62994 -1623 -6766 -20783 -23529 -66874 -20140 57738 -27809 -144512 -182631
21627 -182631 -31936 176017 156672 158565 48196 -68368 -37530 34092 45955 129852 163347
21616 163347 181804 -119379 -265554 -163061 -38253 -4180 26630 94274 103197 50279 7825
21605 7825 -9106 54323 124320 154404 104667 110406 58830 20496 131806 211661 199997 265616
21593 265616 297580 224664 234611 201761 171124 73895 11498 56432 106758 119599 226593
21582 226593 182813 131547 138142 104423 117816 15548 -117208 -99880 -95262 -102888 -92196 -35290
21570 -35290 -21333 47754 61451 116569 164039 159577 151897 166145 111476 273653 273934 55389
21558 55389 -27106 -40801 -2275 -79311 -282851 -266443 -146351 -92771 -61493 79717 111109
21547 111109 181305 201847 164054 110479 129722 101166 -6860 74041 183454 205658 86144
21536 86144 6126 -56684 -13020 -5515 157023 122767 45787 42288 95160 75086 173364 183085
21524 183085 104583 123889 161103 58162 -63721 -34813 -25668 45903 -17283 -23692 -107774
21513 -107774 -170268 -247545 -252032 -84258 -30432 -791 70206 12937 -28225 18296 -16735
21502 -16735 -30636 -1624 8739 120404 142808 117284 30775 84307 185004 103070 195457
21491 195457 107472 98398 147070 140392 -24539 -88380 -58903 -143007 -138305 -56598 77816 53237
21479 53237 -4548 -138737 -76712 -68127 -147365 10437 -47665 -2319 52724 -58727 -200691
21468 -200691 -167131 -58403 -1159 -13577 -43270 -140719 -125755 -42537 -23128 51313 41017
21457 41017 30466 16389 -7625 44651 -19781 -70800 -29206 27863 80873 77668 107146 41925
21445 41925 64838 21784 -57335 -204918 -195183 -168317 -81378 -56510 -85062 -2708 42893 -7448
21433 -7448 -48064 -125568 -100739 74149 51984 148024 120579 -63930 -207921 -190108 -177461
21422 -177461 -111212 -32794 33592 7830 -33129 -68840 16125 25126 -56744 -60937 -19101 -21775
21410 -21775 -109639 -125464 -99222 -93869 5136 123438 211465 192214 60706 -99846 -122446
21399 -122446 -98186 -38720 4163 -16795 -46700 -105250 -51757 -45841 41793 104310 21748 -55135
21387 -55135 -20222 -75132 -134655 -85684 27266 34881 82964 128192 137540 96166 147777 126270
21375 126270 118245 156283 159104 -5930 -63582 -40293 103387 131838 236476 224185 88542
21364 88542 19138 -52505 11075 69202 173279 172985 56683 148428 154089 87208 20392 -90611
21352 -90611 -41620 32544 -42856 -93747 -58963 29388 18054 20300 8791 55910 66466 -116862
21340 -116862 -250022 -189680 -124581 -42255 -26858 -73161 -113517 30575 68321 -11373 10669
21329 10669 2490 16605 -40224 -132065 -68090 -23215 -4707 80102 194165 62479 47159
21318 47159 148810 205923 216141 224344 192893 140524 121185 169222 139933 120987 228456
21307 228456 225652 164218 -51844 -144664 -103941 46364 122105 19998 -86295 -118563 15555
21296 15555 13708 -193529 -258536 -193031 -158991 -136526 -9856 7071 14779 34107 1774 115305
21284 115305 171634 8922 -108155 -159868 -177741 -303522 -299056 -249954 -228025 -209489 -73728
21273 -73728 -26498 -6552 14972 -49320 -201411 -107151 -127173 -135750 4971 155961 258480
21262 258480 224667 1430 37499 112465 119924 149599 85444 9153 44140 137696 175206
21251 175206 112791 14092 70535 93828 -7593 -105180 -88028 32332 153540 190758 55950
21240 55950 -11133 -6142 -62599 -143059 -188654 -43005 -14501 -76013 -50810 -6155 20386 38980
21228 38980 44651 -36485 -88743 -217034 -139554 -26353 -1673 -39575 -19981 121903 289275
21217 289275 231782 89080 57423 -71997 -139523 -132318 -157573 -136450 -103947 -82476 48246
21206 48246 -34637 -46508 -60671 -90861 -85886 -60418 -117930 5336 123390 227422 313671
21195 313671 209970 101811 187046 130863 109876 112851 93912 126471 120177 182599 88961
21184 88961 -88986 -33879 44377 37173 9265 19374 -9185 2484 154280 246034 175383
21173 175383 36876 -70270 -15743 103225 114895 199396 202226 151579 33890 -89491 -43803
21162 -43803 30276 -1966 -131758 -235069 -173784 -40278 107202 226157 124386 140032
21152 140032 78722 27269 200960 230935 213270 111803 37771 112619 103378 39481 -800
21141 -800 -142335 -81113 -117794 -69486 -58428 -64388 -17387 -92729 -100881 22727 73975 -31832
21129 -31832 -10624 -43159 -99408 13604 -41716 -50078 -135822 -176826 -178595 -128046 -96520 -62159
21117 -62159 15382 65223 40947 -44696 -162070 -155100 -137585 -66141 -81132 -90272 14501 -3646
21105 -3646 -99995 -215204 -291156 -197725 -108466 46778 21914 -48461 -36161 98781 192559
21094 192559 151571 -35729 -67970 -133068 -113192 -53863 77019 52170 -21124 -39173 -147243
21083 -147243 -280857 -217543 -110346 -82301 -75867 -11340 49675 83295 60185 46639 -5139
21072 -5139 -8019 -106960 -222687 -169165 6552 -1192 -195988 -249187 -153875 -57738 -48406 5218
21060 5218 96864 105560 -48539 -67055 23323 103042 168787 129199 103278 60593 47471 33975
21048 33975 -2098 -18498 30006 137319 238452 139931 62011 -20882 -25755 -50423 64193
21037 64193 241079 159501 78036 69175 83201 95127 77325 195436 254882 256447 147923
21026 147923 88025 140433 90735 118170 66278 -19720 -42107 -142521 -90778 34610 151861
21015 151861 80606 15786 -6249 24300 -30531 44942 -48431 -64903 25421 22279 -14022 91258
21003 91258 174774 152304 81313 130556 -12724 -45581 -25653 -54945 -62718 12243 3171 177977
20991 177977 161891 96255 145079 66714 74301 5361 -49103 -63441 -19956 136943 137682 78553
20979 78553 -17141 -1750 -19599 67918 46611 16482 27913 229420 228099 49294 49312 20570
20967 20570 3241 -75121 -50117 45847 96693 97940 -5142 61480 15954 22215 69961 102930
20955 102930 34924 45540 156782 251316 229011 90858 -38281 -12212 -50159 -72257 -93044
20944 -93044 -31253 32654 -15988 -23161 82782 77657 57169 43580 15839 -22005 -66221 -139000
20932 -139000 -47863 -28720 -18959 76582 -57399 -83197 -125419 -26419 87850 -86725 -73287
20921 -73287 11243 -61834 26363 39880 -12457 35106 148292 246510 253095 232488 148767 61329
20909 61329 2127 68079 148663 175222 190366 135174 37228 -73217 -153724 -141074 -123438
20898 -123438 -233442 -289171 -290405 -130635 -31863 -33463 14675 -26448 -41547 -48990 -96411 -70710
20886 -70710 53902 56133 -45602 19371 188448 26905 -34311 -36895 -15487 -27629 -56408
20875 -56408 -44363 70410 276086 300379 184419 113470 22746 56129 130972 167046 71877
20864 71877 -32706 37804 40648 8464 44675 47500 132359 122996 45923 -16535 -26729 69261
20852 69261 166317 186020 71998 113518 76094 69397 87577 45907 -48441 -67442 -34845 9082
20840 9082 128490 115968 -48695 -94469 -52876 -73709 -5967 -42982 -18992 117075 173066
20829 173066 20224 33030 125119 110256 124827 -28801 -97962 -116764 -117757 -26588 82657
20818 82657 78750 107582 105696 33053 -981 65080 50335 84297 59362 33724 60128 -45026
20806 -45026 -8788 -30994 57215 88478 141283 150082 68682 69808 90987 70901 189109 177709
20794 177709 186555 19625 -92977 28 90580 33184 34796 168523 196449 137599 5539
20783 5539 32740 64851 157652 181841 110608 113859 161584 107705 66926 -73153 -111246 -8275
20771 -8275 66182 179831 270160 150137 78080 70505 158260 215062 78772 -22864 -27425
20760 -27425 31103 107106 175238 47506 -34438 -23795 -5848 -60009 -47765 40453 -22388
20749 -22388 -29739 -16952 -6143 2515 -71713 -79624 23383 117137 105042 40465 3118 29646
20737 29646 36489 54527 54843 39960 -34089 -95871 -3801 2657 55662 211807 256571 254184
20725 254184 226321 185514 115689 46701 47758 151395 127090 90511 78747 28016 -39901
20714 -39901 -46888 -54376 -91194 -108825 -33885 -57288 -90722 -52719 -28981 106343 216077 203658
20702 203658 186490 250705 218705 218310 112896 21453 -159516 -305232 -229976 -96912 -51142
20691 -51142 -120025 -30573 56980 108718 130555 212985 123973 79581 81349 134466 205723 30671
20679 30671 -62322 -7008 76151 116613 214280 211897 253649 349538 246948 179613 111117 93902
20667 93902 38806 -113828 -58216 -50998 -3302 -28124 -67705 -126818 -88930 59969 71983
20656 71983 92461 89457 12575 -95304 -38784 -63049 -13722 8934 9186 129037 98352 -41186
20644 -41186 -96924 -134681 -194466 -97103 -69697 179606 199137 81379 -29792 -38477 -66110
20633 -66110 18129 117642 162814 173245 115241 117944 52185 21574 -50757 1928 35771 172748
20621 172748 139141 77625 1808 -56918 -1972 167434 129429 17171 22795 8295 114905
20610 114905 167633 169450 46455 30158 121955 291897 322637 304093 181435 6612 15504
20599 15504 55437 82670 9624 -51379 -7004 32846 -35077 -84246 -179528 -213460 -72171
20588 -72171 -32681 6139 85898 118832 159926 198070 169011 135264 49644 47930 48236 -105789
20576 -105789 -27500 127496 186053 241765 203036 114632 -32516 -143460 -223255 -193361 7271
20565 7271 120336 37341 -21508 60375 152706 150328 58143 42258 -36628 37060 196686 182084
20553 182084 147772 69623 43806 50268 14385 -64316 -45556 -48432 -61874 -40020 -20425 -56669
20541 -56669 -35383 -59864 -175228 -185777 -165681 34716 139916 230149 245948 114773 58771
20530 58771 106820 191011 43683 -18215 51954 85193 86824 62004 -1407 -75312 -65757 -48542
20518 -48542 -22117 1298 -31109 -12500 -28071 13054 25047 -135515 -96652 -37703 -62356
20507 -62356 112735 136283 99592 105248 125066 97621 118206 114368 124125 135682 42252 -3435
20495 -3435 21607 47265 27926 29461 5770 87969 163155 226554 294878 369029 264457 234400
20483 234400 215758 207860 126328 75358 165952 292798 319886 231448 120715 201753 272926
20472 272926 197433 176516 150634 6232 70418 127999 258684 305372 238404 255160 179827
20461 179827 29478 -13041 -109355 -134494 -87148 -125814 -61254 75512 175573 185692 72874
20450 72874 39940 16898 91770 120191 260945 257832 150775 37553 18130 60997 100161
20439 100161 -44778 -57024 -5115 60073 172972 155039 80855 -12865 -82777 -82923 -119202
20428 -119202 -109371 -104860 -32044 14531 48937 52158 150463 137594 44384 50362 20807 -5429
20416 -5429 67533 215502 241517 204962 43720 149471 222994 104854 117481 144517 51599
20405 51599 8671 -36290 68597 206426 219323 185239 24102 -27463 -26523 71384 152047
20394 152047 82094 -18514 100400 232697 225119 197233 206528 126462 32140 1504 45246
20383 45246 166267 178768 76969 88248 184127 255870 224120 100390 78772 56455 -23423
20372 -23423 -54587 69334 247603 284855 223319 252110 213838 8021 -74921 -12208 158652
20361 158652 261363 347722 329231 279442 218724 183049 129577 48718 -4632 -24182 57641
20350 57641 -14597 15309 -9117 -9624 33743 34213 13194 -53398 -83827 83778 64284 85040
20338 85040 177265 20886 -110627 -33796 80245 21981 -17238 8765 126130 158217 141962
20327 141962 -48529 -75428 70191 105860 23724 -756 115185 93864 119715 170059 20068
20316 20068 66290 192604 87876 -61221 47798 214978 215423 259516 290633 189002 93017
20305 93017 39028 73235 68546 32077 39292 60460 161335 225644 262017 194177 151754 -8969
20293 -8969 -30800 76366 132728 72934 76131 250621 414716 337212 300339 233894 300111
20282 300111 298376 377363 452120 328414 193893 204639 270219 345998 249356 128120 86077
20271 86077 159537 179928 178286 113560 165853 179547 230373 265336 327216 250550 281535 380742
20259 380742 468960 438895 391309 584858 767379 1018827 1205882 1483506 1504747 1347612
20249 1347612 1237700 1203544 989024 682704 545457 469354 531917 766594 822664 845049
20239 845049 1019161 1221472 1317597 1377931 1367183 1344044 1011206 685753 590708 497622 426312
20228 426312 366285 242165 225575 243289 258794 150907 120664 176851 197102 94328 129171
20217 129171 173761 267267 208228 175507 84897 -69068 -30247 45617 103501 168596 203858
20206 203858 229545 139038 163277 70085 101963 174400 217131 224585 176389 136254 83347 150039
20194 150039 187931 216377 209172 159929 260529 287944 268423 181422 65180 128883 153731
20183 153731 131995 71161 121428 272959 292719 131171 140887 213335 75600 72179 57794
20172 57794 -18303 -16258 -57990 9689 136948 89542 238348 288558 302997 223325 139649
20161 139649 3 -32021 62499 20003 -63288 44556 216976 234587 177645 60110 49585
20150 49585 52141 16752 -54002 -79600 86207 88779 9835 16138 55178 209037 220229 204156
20138 204156 231069 162293 76563 133251 208059 254998 109224 10064 32367 174751 177017
20127 177017 145476 51643 -26933 85164 62138 155760 63090 15427 85118 90521 110239
20116 110239 72463 -452 28856 4316 106242 156074 84945 116137 216814 189275 205292
20105 205292 248672 414563 372613 258836 278198 354725 420882 283886 147342 92031 119721
20094 119721 168579 309355 314140 210917 194572 161116 133408 258740 242776 214390 237317
20083 237317 234005 245180 371092 344998 214932 276698 306518 330924 243261 194506 192987
20072 192987 120122 -33765 -15124 51737 181700 265510 166404 42143 -16568 99677 177428
20061 177428 196608 408530 311986 173467 242122 204902 333019 371371 293901 217899 273519
20050 273519 278510 252569 207788 123603 112834 190038 213403 220515 172147 189748 97099 85894
20038 85894 161756 127468 243056 268733 227668 222865 186488 168799 165014 135202 205552 258766
20026 258766 356818 347997 334054 163450 68391 60841 137658 130936 170840 204008 245663 249540
20014 249540 184601 231417 428451 434893 444380 303508 166241 87628 -36424 -14253 59572
20003 59572 154107 290874 246218 136697 61856 127636 229982 326278 274904 318810 388781
19992 388781 311515 283940 252794 247182 252595 220697 221409 141975 82589 -9069 21920 124376
19980 124376 234573 319305 355393 477969 361196 266271 192306 144532 40429 26787 218326
19969 218326 382055 411718 272398 234413 362504 468986 498337 482359 438162 463921 458799
19958 458799 348877 333379 289766 332196 381650 469069 510350 426833 397646 387190 230597
19947 230597 182397 239888 255319 324789 392729 332854 288479 324036 383595 361759 391236
19936 391236 380392 357181 470243 532989 403299 312644 274056 310265 391337 343396 295311
19925 295311 363925 374646 189931 76464 105133 154928 260103 340834 318451 317359 165212
19914 165212 48978 66963 -6368 53809 104507 61675 70197 163599 202326 97788 69333
19903 69333 85063 244381 277482 319067 311576 300818 207532 153120 237788 239312 247609 253814
19891 253814 246210 365040 443949 395742 395091 323745 352329 462529 476025 415758 402930 628100
19879 628100 689330 691642 740830 604772 482565 440775 522530 426170 439687 535644 442762
19868 442762 339688 406851 497702 562890 565001 603158 692942 698584 505855 386012 431754
19857 431754 490820 569219 601622 607050 564961 611393 628356 496131 550906 591384 555898
19846 555898 529701 555298 561158 594656 859412 1030480 1102118 1017758 866150 701076 584665
19835 584665 572714 649577 583157 485529 564043 763347 753184 713355 709048 764632 869134
19824 869134 860488 809837 804026 707295 638671 621696 698634 639722 639216 603263 501985 440619
19812 440619 606535 581369 580667 767547 841638 777380 763997 820649 807601 688643 691880
19801 691880 741499 751675 799509 930888 934173 854728 873664 891294 962969 916818 891659
19790 891659 835454 758842 633145 513935 654855 758515 780844 893581 967105 1050515
19780 1050515 1003198 993239 960929 976110 1051921 1151807 1239201 1363771 1375843 1325422 1315333
19769 1315333 1299370 1471067 1617101 1567036 1396926 1248787 1368278 1500862 1614469 1588666
19759 1588666 1778740 1948153 1999414 1949189 1971808 2078106 2294994 2306580 2209138 2281546
19749 2281546 2341278 2472100 2594152 2637729 2769282 3041404 3292492 3498319 3687765 3939450
19739 3939450 4175928 4544736 5132014 5691404 6257012 6935104 7589504 8330281 9157048
19730 9157048 9931834 10647556 11318288 11969426 12935970 14314901 16016463 18377809 21701452
19721 21701452 26266719 33018564 43532988 60131574 85063731 119181537 160277389
19714 160277389 200908800 230663900 242338668 231545035 202821541 164946377 127477584
19707 127477584 97836498 78833145 70461016 72308097 84538619 107764240 141194415
19700 141194415 181129187 218288654 242263161 246169434 227465012 192401177 150155324
19693 150155324 110227116 78393081 55834952 41119740 31948986 25942619 21698610
19686 21698610 18612691 16376979 14620265 13376152 12419853 11591121 10892970 10097860 9165685
19677 9165685 8381422 7571324 6837227 6071171 5307062 4708993 4089821 3576121 3209534
19668 3209534 2899716 2561936 2274961 2004681 1704433 1495924 1331628 1178427 1035474
19659 1035474 830132 802758 778855 565256 498314 495073 417858 339677 270182 418742 393317
19648 393317 361808 328852 304145 336592 214753 58413 35711 -85396 -65372 -7532 43498
19637 43498 -31991 -76038 -67380 -21560 -53506 -251287 -229607 -265273 -209902 -148801 -151733 -152484
19625 -152484 -203341 -211295 -137643 -101635 -140720 -146673 -180494 -181100 -170176 -138341 -140961 -195251
19613 -195251 -283994 -241673 -233858 -242432 -189233 -130896 -185050 -152858 -286099 -406287 -431554
19602 -431554 -286760 -44522 -87360 -108896 -152914 -210912 -39539 56984 -85219 -101440 -50613
19591 -50613 -28319 -42268 -114251 -151836 -205815 -168709 -206484 -230018 -253654 -342262 -376010 -408087
19579 -408087 -384617 -300124 -201214 -222590 -46934 -76047 -281247 -326779 -255052 -191365 -68463
19568 -68463 -61433 -80928 -80217 -92206 -176180 -137566 -112341 -150494 -172586 -200311 -85497 -135554
19556 -135554 -115431 -157568 -165680 -64651 -94921 -225482 -260300 -148423 -126038 -89108 -88713
19545 -88713 -41063 -117337 -187907 -280803 -272540 -259533 -194864 -42089 -36640 27616 -27036 -126123
19533 -126123 -58922 -114873 -82030 -49265 38800 -80417 -232302 -380925 -456990 -401856 -381724
19522 -381724 -282142 -246607 -191572 -98484 3708 -41299 -85664 -159137 -157563 -169212 -150850
19511 -150850 -223567 -291102 -268526 -344005 -283183 -340591 -266461 -114987 73360 81872 67074
19500 67074 30242 37728 25169 65801 140429 130698 50363 6363 -5102 -19927 -95918 -60079
19488 -60079 -2383 -18966 -91301 -76304 -46733 -26319 -46534 -100632 -193130 -371211 -343140
19477 -343140 -229625 -247926 -325471 -367131 -167396 -49648 -146041 -29393 60985 -94980
19467 -94980 -237247 -291126 -181696 -147214 -183194 -194315 -127441 -196817 -144327 47319 99280
19456 99280 15143 -103949 -75277 -54364 -63292 -109031 -133027 -135948 -251171 -328607 -238070 -123761
19444 -123761 -163412 -60616 73489 102235 425 -216076 -270183 -295286 -348895 -278088 -224492
19433 -224492 -294180 -262735 -218567 -248042 -328788 -237884 -97105 -66217 80940 84603 20172
19422 20172 -8375 -119212 -105055 -107873 -69517 -50866 34538 -22616 -128355 -97221 -121151
19411 -121151 -217852 -358739 -265321 -82659 20252 -19217 -60769 -75251 -126183 -25588 -22088
19400 -22088 -22507 -5175 -51321 -23520 3521 7056 40291 -19813 -136190 -219229 -263615 -156303
19388 -156303 -174612 -294916 -261336 -187939 -209383 -208223 -157225 -134094 -192650 -160049 -53233
19377 -53233 20053 -32260 -121316 -71023 -117940 -144647 -181978 -156688 -85860 -7669 28661 -14043
19365 -14043 -86419 -53849 440 -31469 -112542 -196044 -214558 -144197 -68702 -30767 -107899 -191474
19353 -191474 -18742 63630 130474 60640 -30005 -65254 -149276 -186409 -307974 -335787 -220015
19342 -220015 -225134 -235198 -188149 -292103 -286410 -165099 -40444 -19535 31021 -5419 -209061
19331 -209061 -214706 -121778 -33338 888 -2177 -12396 -115318 -85842 -36863 59504 70462 -17804
19319 -17804 -172039 -188776 -58757 35795 84308 82471 82094 135487 112520 -57663 -40331 -58912
19307 -58912 4141 5590 -92194 -152658 -70415 93879 97026 151719 168579 174284 140681 152776
19295 152776 99103 125365 108676 31991 -84167 -192088 -147608 -161970 -102928 -166201 -199706
19284 -199706 -15514 47933 -3620 -70153 -116747 -61654 -27071 19521 47181 14935 -60056
19273 -60056 -75179 -35903 68386 36656 -71281 -80935 -18402 -20883 -20699 -16464 150321 20699
19261 20699 -208418 -256550 -192885 -200392 -171442 -64401 -6497 41582 55764 65025 72601 18343
19249 18343 -35632 -99452 -52543 76937 77270 124681 52530 -69853 -43073 -26098 -9645 -26852
19237 -26852 -111327 -196406 -185744 -117060 -66092 -190232 -185743 21657 83672 104750 166826
19226 166826 236496 198295 42587 72148 140074 82026 -25083 -121843 -102013 40815 104588
19215 104588 -36359 -133054 -22125 46439 66139 134005 119691 -14874 -183905 -164981 -69420
19204 -69420 40289 118254 -45260 -129220 -102088 82115 162737 12594 -24777 -53731 -76397
19193 -76397 -66981 -61844 -16744 40174 29263 7476 -92261 -9248 129008 54366 -77944 50674
19181 50674 148847 55428 -37054 -46439 22038 202584 214415 323683 428059 656081 874075
19170 874075 1043967 1208065 1331690 1221166 942067 817338 679415 582244 399630 313529
19160 313529 356372 506481 560604 707563 981857 1258418 1350295 1296945 1174403 862252
19150 862252 638362 437826 191980 131432 155177 184314 116889 87362 229173 285089 270974
19139 270974 135673 25902 -91377 -105835 3954 132366 193182 241734 128825 99067
19129 99067 50449 134279 180736 152099 62337 -9102 5607 -134685 -116260 -7245 29254
19118 29254 21710 -26065 -53524 4046 -28064 -37892 -86503 -152785 -192282 -344533 -449254 -469372
19106 -469372 -343370 -231962 -253207 -81902 -57895 -112017 -129333 -97401 16164 31207 44370
19095 44370 57424 -2882 -94209 -40661 -97729 -128674 -133927 -56565 -37575 7396 19101 -97159
19083 -97159 -78930 -81122 -17804 -37956 64348 170063 255768 289854 223441 166185 153664
19072 153664 68524 -91293 -174515 -118908 -121434 -143497 -234693 -149220 33449 131531 219573
19061 219573 315860 310447 155542 102336 131528 73178 47648 80216 157112 199785 140612
19050 140612 30452 -52172 75521 89006 12464 -30269 -109952 -158358 -134639 -63014 -31766
19039 -31766 -44567 -18074 12484 77509 67353 -158770 -200863 -41632 -20314 -95201 -125563
19028 -125563 -30902 65799 122410 77505 129703 175006 190299 126215 168216 141700 172127
19017 172127 92529 25703 -87427 45829 79535 155513 112146 60464 7746 -42337 -67169
19006 -67169 -36053 -111408 -52050 31711 14354 -47176 -104868 9567 182850 198479 155166
18995 155166 35739 -110812 -88009 -89667 -126811 -60470 106455 63758 -52286 -120861 -175802
18984 -175802 -72981 202894 196683 208259 269512 179936 104896 270155 299721 286612 193285
18973 193285 106569 105048 212555 288771 178445 196817 249585 227438 193345 339005 207727
18962 207727 4025 -18688 64535 94567 -2733 4641 50961 79921 159104 159153 105529 65684
18950 65684 69717 258509 266046 211056 171981 212883 339403 343708 265080 211028 264969 335853
18938 335853 419637 598895 685313 918498 1076289 1127527 959905 679863 601266 478965
18928 478965 473706 392175 395209 407245 326705 316542 473144 561227 617096 668323 557942
18917 557942 447068 303112 137515 28833 191394 233269 158605 88686 19744 -89687
18907 -89687 -97904 -141636 -103347 -40015 55266 157107 123436 78324 124520 203752 120634 -58978
18895 -58978 -14682 -764 -32930 -71571 -18676 -21850 47806 -36780 39012 221558 260431 236329
18883 236329 241318 352936 524780 813175 970567 998172 953288 773844 619582 509113
18873 509113 294386 125013 171761 259326 155310 158467 452144 673371 787063 834166
18863 834166 834197 826183 703023 385531 258130 238771 152892 86501 135602 143117 122105 169613
18851 169613 302849 264122 222941 163717 63221 56649 126885 114714 31535 -5753 -40918
18840 -40918 -100070 -67433 38956 111744 200922 194524 117096 66834 93157 198534 244373
18829 244373 211304 121185 126126 61902 103432 -86551 -223078 -295634 -197518 -225245 -199305
18818 -199305 -156665 -64941 71647 192458 220578 158785 187294 125643 152520 173855 149666
18807 149666 186013 188093 91804 5627 -154026 -208712 -136984 -95170 -59724 14287 18239 -35565
18795 -35565 83469 246813 306886 400825 335765 368830 413565 475577 466668 385491 368954
18784 368954 223115 269133 255700 214001 210507 151162 264724 366538 330897 278334 358582
18773 358582 380540 464862 477573 402337 543181 833401 1119576 1034518 800332 521728
18763 521728 345491 372383 329361 224947 217303 275915 273809 169599 119817 82605 33845
18752 33845 38051 132232 154242 177930 179014 291597 418124 350703 140854 22819 144421
18741 144421 173913 143871 143762 -37940 -51981 105699 156924 133041 48485 -26634 60471
18730 60471 142968 273477 420038 397538 289801 189335 101938 121126 121268 227625 339096
18719 339096 343318 348826 425434 432893 312512 260525 316061 284507 233876 212068 128715 198337
18707 198337 349827 356327 203383 125994 161692 152758 104728 74637 18052 -91986 -92123 -94630
18695 -94630 -17927 -7935 34599 137021 220682 156168 126425 167831 182850 109862 46530 23763
18683 23763 118790 246756 187497 190823 331018 364070 230913 166298 160978 131611 174077
18672 174077 187612 275320 312761 339532 286143 283072 315068 216908 279207 347662 258503 171372
18660 171372 158338 193809 196871 217966 119350 178235 238436 310143 337540 419808 497660 507958
18648 507958 486823 363309 228155 170912 166657 271159 352456 293181 242895 135276 39472
18637 39472 86664 206843 208315 149452 118548 46121 114105 153655 203281 227104 313132 271762
18625 271762 252879 265466 293073 191863 187594 217028 272999 207556 77824 -59510 -64066
18614 -64066 139342 252125 271111 288911 228322 245115 202976 79536 114348 180937 187482
18603 187482 327961 487008 347633 220378 218430 218321 313149 304105 244828 226100 182484
18592 182484 167621 240150 316783 374496 368429 248959 313583 391910 433836 385015 399374
18581 399374 378302 301306 234727 220459 187505 153153 211720 259346 312795 391449 364047
18570 364047 312326 380519 323223 199938 228772 163771 134658 -6809 12983 241168 339048
18559 339048 328992 445031 511180 405154 234714 225691 286488 398238 433711 479236 353745
18548 353745 285149 332135 298964 341377 478742 575967 615109 624566 575540 486765 555714
18537 555714 613648 605830 654875 732680 667730 523570 499206 506350 513949 551642 571854 539744
18525 539744 592434 636089 701893 680044 715041 719520 851127 748939 493669 463715 416220
18514 416220 315278 374551 527252 522051 542250 543962 541152 495203 492163 531567 543893 638879
18502 638879 594341 649471 720062 756038 865853 820628 697622 570726 483679 467187 513273
18491 513273 431526 552137 606262 596086 557492 514654 623904 660725 562824 711281 755413
18480 755413 702349 697984 873562 802590 694633 630399 586174 645975 770289 765581 707182
18469 707182 767822 881235 1005770 981675 1005487 1060436 1083563 1014856 967290 1046038 1123696
18458 1123696 1128937 1087911 1112212 1109620 1101879 1154263 1286482 1431325 1490480 1501826 1330746
18447 1330746 1194065 1382704 1522552 1542150 1835324 1894721 1949462 2095193 2334500 2490372
18437 2490372 2490331 2509125 2567464 2742880 2893209 3041470 3357273 3621171 4029207 4433931
18427 4433931 4674575 5047240 5386608 5895381 6500653 7221935 8149566 9328398 10956863
18418 10956863 13287784 16524063 21876899 30836724 45555193 67681462 95251080 122160049
18410 122160049 137517349 135298717 117352722 91222170 66440048 47971417 36687962
18403 36687962 31327736 30319116 33225672 40936719 55401982 77179553 103441061 126671900
18395 126671900 136621616 129523584 108055028 80812910 56138438 38106157 26768532
18388 26768532 19992117 15974923 13443103 11958263 11021814 10320299 9749792 9123469 8342054
18379 8342054 7577487 7041049 6601491 6373623 6335117 6269711 6394382 6614569 6825715 7218742
18369 7218742 7695249 8381407 8898526 9478883 10127463 11065314 12488837 14477285 17519602
18360 17519602 22583343 30947943 45032183 67119043 96111483 126747554 148595667
18353 148595667 151714515 136341563 108962058 80358323 57499532 42716898 35033616
18346 35033616 32534776 34297948 41035076 54703873 76870540 105056648 132809991
18339 132809991 148967172 146291259 126332503 96792022 68106725 45851650 31022113
18332 31022113 22196211 16842911 13555479 11340411 9857629 8866337 7969471 7076816
18324 7076816 6335997 5660403 5138631 4666924 4225514 3850549 3316134 2913572 2641711
18315 2641711 2410809 2361593 2346979 2403658 2532854 2395706 2099578 1837594 1437009 1176731
18305 1176731 837617 597256 443972 477649 588404 552145 416637 298748 258236 249097
18295 249097 263628 270371 286977 280256 262214 152289 -16008 -17976 -60203 -77875 -158615 -170950
18283 -170950 -116933 -74797 16467 -9192 -137357 -130314 -116709 109179 218905 187907 25034
18272 25034 18575 98308 59980 54829 -28003 -81291 58081 67404 8769 46113 121944 23060
18260 23060 -85792 -44002 21721 -44505 -74255 -28875 -40445 -202130 -168673 -218742 -174877
18249 -174877 -57958 -54526 -76081 -167823 -115114 -21511 -70134 -73683 35096 88482 83524 98159
18237 98159 119478 292660 277555 85764 -33890 -111707 -161434 -69806 -22396 -91490 -178817
18226 -178817 -85109 -59983 -49936 68321 124857 206302 212305 171363 150411 157680 161215 130097
18214 130097 93937 80626 17367 -11268 -90443 -24571 63943 158153 283377 266104 121924
18203 121924 199391 350837 315229 320837 276292 239191 174556 29844 21111 86392 150775
18192 150775 104225 93123 139270 107877 -65324 -154103 -30817 122420 90335 98761 86818
18181 86818 68540 127629 286389 278884 257407 136979 151520 208680 253031 195035 150041
18170 150041 189738 215214 253400 236024 220671 335979 365784 244797 255871 219526 288269
18159 288269 314094 250634 302810 282840 347286 340146 342609 417863 530856 645488 618906
18148 618906 704308 707168 826572 905411 804152 766402 851454 984950 1026615 940321 861605
18137 861605 982996 1098667 1159983 1276212 1352735 1391055 1488323 1615200 1765120 1847859
18127 1847859 2059124 2455798 2809507 3153380 3655390 4244440 4825846 5566485 6488438
18118 6488438 7836182 9899809 12608981 16415705 22435483 32656369 52108504 90164078
18110 90164078 150530574 203993674 210882554 171652214 112135207 65196880 39141829
18103 39141829 25736184 18347051 13896640 11038037 9069569 7720668 6662098 5639564
18095 5639564 4797841 4194195 3768696 3213903 2800072 2624443 2392116 2286158 2271210 2146654
18085 2146654 1933079 1771974 1689466 1586129 1386055 1190190 1041543 873831 831988 808947
18075 808947 839706 745230 651144 520962 314865 215277 245796 217404 247624 70866 -55847
18064 -55847 7677 84847 67766 27520 -60399 -49774 55226 67188 154149 295627 195019
18053 195019 31663 26641 65462 28381 24167 4254 -87238 -162080 -53332 -30352 -11161
18042 -11161 144095 290625 186827 181236 168905 48822 -28004 5429 52378 13184 -79395
18031 -79395 -24099 74852 47307 -30383 -110773 -155962 -97959 35892 -23473 -83367 12677
18020 12677 381 -116021 -204628 -258314 -248939 -144427 -75027 -44804 -133816 -159073 -162271 -185860
18008 -185860 -91504 -81710 -123561 -135109 -173819 -152428 -135470 -150216 -10294 36429 -10011
17997 -10011 -70035 -42277 19929 70627 19342 75901 68807 -31533 890 59184 26076 75895
17985 75895 122402 125441 22914 93373 369783 331659 154969 69077 189457 171657 120064
17974 120064 172264 124783 141881 323496 338774 271527 123548 45831 71231 135864 180175
17963 180175 129064 127261 92268 -31230 -81467 -153420 -24129 110272 132224 42146 80577
17952 80577 209134 300419 220089 188643 114601 28853 -71322 -62809 -48071 -136286 -225179
17941 -225179 -140557 -136337 -75657 -117572 -17498 5029 -1142 -81675 -60325 -11207 10914 -61184
17929 -61184 -43050 -51575 -63106 -163272 -236592 -265961 -333252 -272819 -177177 -88050 -92623 2929
17917 2929 55032 131109 118489 107650 190046 180224 200289 200736 184195 237297 210724 123001
17905 123001 49818 1738 38083 79483 86276 111941 122702 -55538 -185497 -267786 -163061
17894 -163061 -41847 121746 151299 121006 92713 155026 129717 79931 91937 163754 243197
17883 243197 234662 166930 219049 348855 498247 606683 509912 432923 342429 118595 -14772
17872 -14772 -12777 60921 48185 135004 337367 467955 509689 610455 661932 600354 490124
17861 490124 338505 203523 192793 335218 426882 476310 442396 426044 464445 472370 372412
17850 372412 322267 301211 278742 291115 167372 95728 148332 141953 151393 121154 159573 222352
17838 222352 139390 84968 54140 23032 -44235 38174 75627 -18010 61360 149487 256225
17827 256225 388970 515122 740657 926608 923655 976737 930836 754367 585100 458033
17817 458033 391022 290208 338674 358300 398484 573028 766168 1027837 1100047 1343122
17807 1343122 1682203 1868107 1979744 2014097 1764579 1439456 1239633 919511 710139 683761
17797 683761 627501 658510 530594 464959 454197 482521 386763 202170 116356 78906 -55281
17786 -55281 -46128 -6508 74166 77529 64668 149131 190570 81130 -50073 -79778 -114926 -107719
17774 -107719 39384 120746 45809 110640 133542 55855 50282 163401 141593 144978 241406
17763 241406 264318 347682 346063 258563 86081 67650 144520 171325 70344 172592 307419
17752 307419 463445 809704 1062687 1270304 1431283 1427328 1240957 1017617 795560 483847
17742 483847 368972 383126 411988 352884 281392 208692 186780 196517 252231 277518 278876 203125
17730 203125 130412 122797 85706 189946 140421 26561 -20938 66998 204720 151748 167379
17719 167379 147569 11077 -8354 61243 133408 181586 69287 32997 31103 -9192 72128
17708 72128 161045 91465 -85603 -108131 -100064 34949 227021 241391 353866 310345 215763
17697 215763 241888 291886 317829 356008 311793 299354 133319 129296 249377 219456 109211
17686 109211 8824 64599 39159 -60749 22716 137849 114163 128464 171515 166993 138909
17675 138909 65456 22342 47204 156487 221316 186815 175771 173102 177734 220842 192576 115407
17663 115407 47323 153707 219383 255718 313173 314990 384127 481816 535326 497135 297528
17652 297528 65907 50294 125383 54530 -42855 -96634 -140385 -68115 31057 60824 137354
17641 137354 119225 134634 223099 256592 246003 242556 167573 224634 397766 399857 362881 279953
17629 279953 179039 130437 11278 61915 50644 91959 141860 146632 207129 188791 151963
17618 151963 213499 236938 144559 90171 -38750 96457 121664 55863 192838 85987 40049
17607 40049 234188 346050 373564 478243 436781 368712 188500 54986 116008 258086
17597 258086 275447 333755 359306 411565 229060 31306 41772 175729 298520 341320 341991
17586 341991 222867 170615 97644 174625 162647 121300 55649 101378 259247 249553 203134
17575 203134 135356 59606 64662 28260 -4888 211142 275906 213799 218947 131907 -974
17564 -974 -103565 -24970 -1738 75165 135757 135039 93992 46314 28151 47639 103969 160061
17552 160061 220830 169266 185715 155099 332881 476412 556210 457995 414860 495962 429634
17541 429634 340870 239855 119632 273977 439919 471425 529576 430767 278454 215342
17531 215342 141322 146998 191721 241974 195774 137857 160361 381316 470441 441359 443152 416380
17519 416380 485724 444885 351508 196102 100103 67773 44923 174564 219373 373916 431595
17508 431595 330991 367917 456560 477151 441075 427204 256794 128728 125968 72749 68878
17497 68878 105677 148511 240202 240787 207845 247970 179955 130975 190683 374305 401244 360151
17485 360151 348214 297783 393436 544517 493276 419897 351033 294598 262308 261692 218457 192861
17473 192861 312197 413001 334896 324438 387367 428658 429999 389834 397409 413041 420788 402098
17461 402098 375303 351964 319302 289266 260254 108651 85202 116410 167508 277335 332762
17450 332762 459422 534293 480887 411858 404886 550803 847001 1211337 1312351 1177339
17440 1177339 857047 698932 625540 538259 422378 441746 537238 574791 550650 432683
17430 432683 432285 498278 437565 319142 411001 456550 560059 521926 597477 866917 985686
17419 985686 941396 777589 707183 536798 415526 492837 559947 660480 693495 615743 662470
17408 662470 681414 605726 596686 590038 469627 405197 407010 360901 524573 629215 519370
17397 519370 582224 709289 653405 541115 569242 654302 543060 501846 426764 317386 259794
17386 259794 435303 638736 813526 807695 804164 749025 667005 758035 847208 937125 920614
17375 920614 758187 687374 716888 629729 667457 734084 836002 984214 1069515 962603 951836
17364 951836 986140 915913 922259 978991 968302 929736 804488 861551 1109034 1206751 1249651
17353 1249651 1196320 1078186 1060493 1169560 1201002 1237687 1350709 1225290 1203913 1210179 1259885
17342 1259885 1340702 1388974 1576405 1587818 1579959 1650733 1873978 2082498 2471992 2938859
17332 2938859 3303505 3343982 3189512 2860822 2650849 2599310 2533074 2562094 2743525 2762853
17322 2762853 2796945 3087381 3698133 4252021 4544727 4675476 4741203 4658985 4604608 4628345
17312 4628345 4974273 5332130 5723203 6221381 6861359 7605071 8492242 9639157 11178738
17303 11178738 13285753 16189083 20049071 25288480 33111081 44697287 63975643 98453247
17295 98453247 154487921 222087760 277284211 304911601 290953514 241301890 176397319
17288 176397319 116906340 75813720 51806718 37794484 29187225 23518979 19404345
17281 19404345 16411960 14266685 12671415 11579433 10726573 10148292 9628475 9042097 8255029
17272 8255029 7686810 7386862 7286683 7398592 7446221 7376511 7337476 7139458 7043014 6938964
17262 6938964 6676339 6476813 6262436 6063927 5865766 5743401 5946732 6513038 7184671
17253 7184671 7817089 8233838 8608287 9017775 9637281 10650284 12302077 14477251 17304284
17244 17304284 21418470 27529502 36781132 51649650 77596102 122108229 182322263
17237 182322263 237722352 271863910 271599742 234375738 177537991 119929972 76976297
17230 76976297 50985208 36018404 27057461 21290528 17401759 14519293 12244582 10469721
17222 10469721 9034081 7787154 6832356 6181971 5716528 5225409 4766898 4635076 4708871
17213 4708871 4786751 4847670 4759534 4645751 4210922 3644625 3226923 2778323 2336720 1983897
17203 1983897 1851219 1680014 1593993 1627073 1900459 2112743 2196660 2199883 1990555 1537634
17193 1537634 1168472 1010599 801088 706205 710218 595492 574055 515720 340944 337834 426656
17182 426656 472757 407489 271558 240332 297860 271260 183451 208400 227704 238937 261611
17171 261611 103301 64766 72915 45360 21696 -87954 -309482 -205814 52433 221435
17161 221435 256371 277690 297215 329203 274012 205269 170360 127613 91769 159118 71149
17150 71149 57515 164745 276337 269430 262041 201359 194090 266666 293182 329254 310506 190950
17138 190950 200184 241355 207301 142748 176573 186954 144070 110699 200936 235923 168837 159950
17126 159950 62679 67242 130829 88983 131929 64259 -34354 267 59130 206546 202412 144499
17114 144499 95216 15837 -120660 -160058 -156366 -9101 88973 -36546 -46532 158830 403549
17103 403549 397962 307550 382308 492909 517222 506894 485319 455369 500602 444992 423610
17092 423610 413942 293807 326706 340495 347150 471212 576057 556658 496555 507509 357719
17081 357719 316351 159494 143827 147068 211360 209423 157064 220690 214568 177427 115408 157394
17069 157394 180980 207979 178374 135355 123354 238080 247089 275570 274621 288381 252660 190255
17057 190255 154361 276383 264620 178023 266239 343728 256529 159401 140874 231573 182984
17046 182984 164112 137755 148658 219985 277218 280961 354708 254745 223537 220785 247612 323418
17034 323418 389934 391889 368521 359392 345517 417902 396249 396132 372664 337698 390122 336421
17022 336421 374807 428570 425306 451308 469023 368894 266353 310436 479421 374862 231025
17011 231025 226010 302881 397508 494066 606521 742035 677742 547439 403971 416361 407475
17000 407475 350872 372104 520602 439478 325880 283895 333540 306607 311712 308058 266037
16989 266037 283367 338578 337073 309256 350062 242640 104977 105067 59441 71678 218014 216395
16977 216395 234054 363625 400613 402121 420970 391290 328019 401527 396559 360174 463119
16966 463119 369585 287446 307818 331498 424326 381511 378626 382052 380508 304147 259117 295016
16954 295016 396352 494075 542992 358987 315630 262649 119571 44403 140048 253200 373197
16943 373197 421867 325456 271519 297535 279581 280717 142176 278522 409265 330966 315412
16932 315412 281319 163571 162561 190249 224716 210713 234348 280216 377938 416109 514156
16921 514156 507165 421549 289316 386768 476743 461584 382695 396869 396757 351926 411531 472089
16909 472089 500823 534078 565701 555456 603671 602694 465254 421138 599590 589726 514055 437054
16897 437054 377655 471635 526084 494957 497968 495260 593582 681264 684054 684284 718939 656505
16885 656505 631235 554658 443797 510494 507950 601877 550180 453839 437632 520774 576262
16874 576262 426936 405390 538015 502477 425919 485432 547807 509091 374020 351820 427359
16863 427359 442451 551629 550999 486647 527594 577192 628683 581946 448954 403377 556880
16852 556880 603469 490802 447229 569372 583507 531383 590303 623712 562860 652924 745033
16841 745033 732810 551221 509277 587353 578598 572994 476192 500435 566537 601361 616960 510652
16829 510652 415020 388178 372141 523971 488449 524040 615314 696182 637626 716675 759770
16818 759770 681886 668459 694109 695035 764969 840007 767903 624833 562647 515358 523801 530655
16806 530655 518409 551230 556012 616233 536176 445512 471365 579539 677919 771147 801004
16795 801004 873308 847740 772906 798553 771053 841066 833965 716312 838709 898435 924052
16784 924052 873295 931747 1014633 1043688 955591 921898 1209068 1611429 1833055 2103385 2341740
16773 2341740 2369985 2129154 1746655 1437696 1372856 1266177 1125461 1042475 947751 827650
16763 827650 739193 630386 696579 906124 1047444 1065961 1068081 900128 805962 743797 756238
16752 756238 760951 840522 846795 846314 968359 853618 826684 761665 854933 986005 1022114 967439
16740 967439 993997 979807 963853 1004764 1131428 1160482 1141651 1157282 1194819 1051240 937511
16729 937511 1036005 1147860 1142711 1087319 1037883 1054666 1125025 1251511 1469113 1783757 2189928
16718 2189928 2379789 2510273 2343594 1844223 1544158 1492263 1348504 1254363 1152042 1170595
16708 1170595 1156436 1024008 941690 967008 940371 895694 948523 1026374 1182305 1146526 1097615
16697 1097615 1155633 1273439 1334767 1439621 1479930 1390417 1273536 1056794 983892 1159587
16687 1159587 1334280 1257722 1278438 1297641 1176139 1124930 1204086 1227912 1180413 1232416 1288086
16676 1288086 1300620 1287861 1525034 1452801 1519138 1398772 1293184 1344028 1269829 1318794 1340724
16665 1340724 1351115 1295935 1353053 1337088 1280115 1321181 1426985 1326892 1414530 1444292 1501541
16654 1501541 1456016 1503862 1476814 1384200 1328988 1370684 1356738 1373260 1392623 1433855 1397428
16643 1397428 1490437 1495643 1574710 1663612 1587250 1484127 1386970 1428760 1526313 1462937 1503688
16632 1503688 1550289 1545107 1510584 1451715 1464968 1521089 1556545 1610975 1539473 1365757 1346101
16621 1346101 1519878 1647347 1702416 1691104 1775380 1786823 1860305 1951557 1945807 1956934 2025877
16610 2025877 1960255 1775250 1824005 1876519 1839790 1824953 1722637 1772984 1788851 1870851 1889641
16599 1889641 1917143 1929543 1948594 2021997 1986264 1985690 2055214 2100427 2137652 2126445 2037702 1986132
16587 1986132 2099381 2333840 2398067 2188144 2132824 2185653 2198601 2231524 2268304 2261357 2247669
16576 2247669 2281290 2250750 2168937 2156637 2242390 2387112 2422136 2511771 2363891 2407526 2594945
16565 2594945 2554327 2586199 2668173 2694393 2866559 3023735 3034224 3058234 3326903 3544415
16555 3544415 3485418 3390834 3501654 3472449 3295650 3168650 3076261 3101714 3072338 3117342 3090991
16544 3090991 2950723 2758651 2709527 2871002 3013712 2949320 2916263 2885450 2707292 2804539
16534 2804539 2889492 2916860 2951530 3004343 2985027 3000404 3172750 3219473 3140002 3181000 3300548
16523 3300548 3332427 3286592 3273664 3394659 3452599 3426818 3327511 3309471 3260807 3271621 3261695
16512 3261695 3201818 3297176 3376146 3400492 3431725 3418280 3435713 3487471 3583244 3684936 3728235
16501 3728235 3719514 3694645 3735114 3833247 3935815 4055119 4139629 4146517 4066730 4142496 4133121
16490 4133121 4136350 4178122 4252075 4275063 4284955 4268050 4295700 4351874 4284272 4342179 4451576
16479 4451576 4505508 4539907 4621532 4644570 4725816 4773981 4884975 4942507 4941782 4956104 5042549
16468 5042549 5059634 5094019 5152554 5075624 5060499 5113894 5122246 5263216 5330420 5440231 5484649
16457 5484649 5553801 5630237 5730222 5762283 5727259 5742365 5768216 5917572 5945471 5912544 5870287
16446 5870287 5907386 6028958 6131792 6158156 6208018 6278962 6378624 6398501 6486677 6646824 6733493
16435 6733493 6727030 6730373 6827068 7062213 7250358 7221831 7155684 7101237 7222900 7328632 7501299
16424 7501299 7636065 7756898 7841817 7973601 8121418 8204782 8163887 8360744 8328415 8413913
16414 8413913 8369573 8362561 8383118 8609490 8842399 9030883 9059901 9116741 9284337 9471900
16404 9471900 9481606 9643277 9825497 9827200 9890869 9949518 9994483 10127787 10354623 10529070 10586147
16393 10586147 10719742 10918986 11112547 11323246 11417939 11563446 11771015 11874125 11987329
16384 11987329 12109352 12234464 12370949 12585229 12678635 12765975 12917399 13180115 13343194 13535375
16374 13535375 13903359 14214089 14386071 14569746 14726761 14909120 15233907 15491060 15746975
16365 15746975 15833055 15986299 16284914 16479248 16769704 17105460 17276704 17403512 17639037
16356 17639037 17997452 18315879 18627964 18880035 19178119 19393110 19501422 19811226 20182727
16347 20182727 20557994 20902168 21236531 21612968 21975679 22316728 22590436 22953734 23369768
16338 23369768 23751075 24122240 24540956 25007017 25370482 25725942 26146019 26597206 27058431
16329 27058431 27456395 27911556 28370627 28886222 29439786 29948189 30368605 30875083 31319528
16320 31319528 31739059 32288814 32787647 33304056 33835381 34444748 35025521 35649631 36133005
16311 36133005 36528363 37107298 37646542 38269890 38824788 39417094 40112184 40759873 41401388
16302 41401388 41980552 42560438 43058672 43566721 44097498 44769923 45420823 45994520 46588668
16293 46588668 47143121 47749946 48384385 48688453 49087346 49631532 50180773 50771019 51306165
16284 51306165 51684903 52075128 52548944 52888581 53118162 53520759 53879718 54033985 54270779
16275 54270779 54569930 54854495 55135113 55463624 55605668 55641493 55761081 55756305 55747409 55753527
16265 55753527 55695959 55631208 55520584 55536672 55419455 55229913 54907474 54722724 54634099 54493119
16255 54493119 54207612 53833649 53238993 52828680 52557105 52154370 51738350 51271928 50844854
16246 50844854 50321389 49783012 49282467 48809413 48417693 47931262 47292753 46715023 46099720
16237 46099720 45623959 45179431 44527231 43873489 43225441 42567486 41968311 41435769 40882121
16228 40882121 40243613 39617365 38907732 38416253 37823426 37123567 36662380 36214318 35620346
16219 35620346 35085241 34445333 33820339 33359607 32871120 32275199 31758868 31211102 30630517
16210 30630517 30101229 29587903 29191338 28768533 28352177 27936976 27418135 26899831 26486422
16201 26486422 26022551 25619115 25128085 24618312 24212093 23824548 23410041 23057932 22640130
16192 22640130 22310304 21874672 21586651 21192655 20843232 20521829 20169611 19925501 19700841
16183 19700841 19390002 19101212 18815329 18499009 18198834 17914815 17554378 17269689 17062072
16174 17062072 16809607 16536913 16194038 15852413 15611239 15283024 15084554 14885403 14746687
16165 14746687 14519677 14280442 14058777 13969886 13873543 13623675 13358436 13118667 12916855 12850942
16155 12850942 12665240 12484971 12332003 12163680 11970591 11678306 11497216 11252415 11048761
16146 11048761 10936384 10833043 10791368 10651126 10494468 10316110 10197755 9920914 9706926
16137 9706926 9520700 9430481 9373759 9297294 9141996 9002456 9036809 8987346 8748277 8544369
16127 8544369 8447075 8376548 8276150 8111364 8063436 7957405 7866455 7710826 7671729 7643710
16117 7643710 7680356 7656160 7430511 7272387 7407714 7439766 7296969 7047293 6983589 6965906
16107 6965906 6809784 6769521 6595770 6424432 6382606 6295388 6149259 6015239 6051374 5946967
16097 5946967 5934503 5989364 6073408 5966438 5793649 5672298 5622841 5683763 5655183 5443768
16087 5443768 5427391 5308479 5251345 5263365 5341779 5277813 5111381 5036173 4970689 4967190 4982720
16076 4982720 4948115 4985703 4891263 4707237 4609373 4538226 4487057 4396829 4384150 4409642 4469067
16065 4469067 4507683 4362982 4250368 4320342 4298588 4123782 3999804 4126717 4094717 3980735
16055 3980735 3891765 3862860 3727109 3665803 3611839 3583790 3728475 3852661 3925660 3876560 3717953
16044 3717953 3566781 3479603 3504066 3489443 3442860 3321871 3239405 3290623 3215404 3129789 3216087
16033 3216087 3259242 3290813 3123232 3109324 3091594 2886519 2853841 3038834 2952023 2875233 2911632
16022 2911632 2994518 2972162 2942210 3009645 3008376 2939644 2843395 2785661 2637236 2577010 2546459
16011 2546459 2457837 2483239 2571984 2658274 2565766 2418398 2486430 2523475 2572719 2660918 2605150
16000 2605150 2658801 2569363 2440974 2427649 2385240 2409022 2376295 2379048 2421304 2452733 2527583
15989 2527583 2612486 2702118 2718046 2745153 2754629 2968357 3097614 3162799 3152596 3190859 3189193
15978 3189193 3114596 3081991 2934073 2843976 2745957 2687122 2560721 2379578 2351258 2373517 2348279
15967 2348279 2220592 2169245 2235870 2171314 2058835 2011597 1840434 1752334 1766413 1728348 1749767
15956 1749767 1676360 1675933 1829205 1825114 1715671 1594280 1648072 1805382 1863209 1843455 1750664
15945 1750664 1645187 1629544 1568380 1414847 1312934 1383897 1446701 1511268 1755566 1737775
15935 1737775 1607019 1545711 1622975 1690364 1684093 1631494 1517805 1410097 1437906 1514630 1439675
15924 1439675 1394208 1456870 1538744 1510392 1383354 1331497 1317872 1188238 1252119 1357711 1340862
15913 1340862 1375906 1350469 1315430 1361524 1436108 1386038 1271507 1155365 1121834 1123971 1198080
15902 1198080 1230611 1220584 1241439 1191367 1133335 1101958 1123865 1179412 1212344 1249842 1164857
15891 1164857 1080695 1010565 988026 1105953 1201807 1150824 1111008 1119156 1023912 1010062 1010923 1008548
15879 1008548 1102060 1145158 1140745 1213952 1202211 1176825 1200749 1125182 1076054 1028492 976887
15868 976887 843171 861032 966442 1033177 1000304 950717 958381 1090533 1089816 977463 870085
15857 870085 817985 861241 893343 862220 855715 799971 779155 875513 795484 844120 874200 784488
15845 784488 699998 703893 749681 808475 749877 659067 590855 601795 729229 852929 889169
15834 889169 965152 951070 1057557 928345 783206 853277 838523 852098 934914 977569 896746
15823 896746 822477 767292 609534 659996 706788 733320 753692 703846 727735 732797 675357
15812 675357 713080 711800 720050 701367 675228 636453 695162 640286 566120 748318 703842 721886
15800 721886 663049 512121 514777 513120 345778 489852 613484 645428 522797 540917 737676
15789 737676 698800 594273 548170 485369 511850 597178 658418 772745 802354 735208 686223
15778 686223 525537 498065 642863 630646 623666 643777 700879 620324 612024 570922 569455 651844
15766 651844 614380 622706 707599 606227 619500 615551 498436 599424 677171 670125 684372
15755 684372 587149 479722 498668 300403 283708 360739 384936 465718 486479 477300 504482
15744 504482 474182 467258 532132 586735 610755 514978 430002 389750 451438 442729 436061 359384
15732 359384 425428 541503 524405 563101 620529 619787 530695 472985 346834 273242 340287
15721 340287 291637 249349 200736 281920 502849 659845 555578 457998 331671 265745 279876
15710 279876 310264 350829 324350 496759 497748 383215 408768 568854 462978 420137 365666
15699 365666 403818 312996 215277 225257 158697 98872 121988 60289 87715 211596 351255
15688 351255 480619 517050 468443 446740 398428 319657 217285 200617 358744 379406 485605
15677 485605 518643 440883 389103 372385 360882 379902 306711 313308 358927 329087 368039 352355
15665 352355 309605 206202 296225 371045 390732 442223 466290 348149 335063 453461 488680
15654 488680 442641 411097 463833 620092 681051 673641 588500 496054 398580 343353 394921
15643 394921 293053 283365 293339 256070 182072 197262 296928 346932 331139 273908 182007 243052
15631 243052 297656 356603 362869 434561 305977 235721 283333 338843 396227 353542 295823
15620 295823 380106 320116 326073 378121 476935 524546 514892 553196 418369 307426 389325
15609 389325 455647 311114 229447 227720 295983 387653 350490 253310 226145 23572 -49070
15598 -49070 45041 56714 52620 125089 163950 25731 -68726 -85398 65337 179660 308948
15587 308948 386895 293158 149420 91151 119624 197572 181786 149013 33194 872 87775
15576 87775 129059 223654 216516 152083 145796 161950 137002 193411 285690 338486 251611 260539
15564 260539 255297 254980 195422 222718 291741 192985 125150 123645 7411 44526 240642 370144
15552 370144 318443 229405 116093 8626 3489 -12920 55001 104156 213815 299277 295302
15541 295302 346868 316379 219637 241291 282400 235365 199384 91680 110407 147151 145738
15530 145738 135761 148358 252504 299355 166873 170001 113898 92921 228150 466461 451899
15519 451899 340399 287336 166026 111529 124272 160941 246941 135158 34737 33043 37442
15508 37442 52139 191515 238073 316392 291237 74237 -15312 42352 58977 87461 -44791
15497 -44791 25032 91169 13931 48763 73851 164296 233480 174665 187692 213045 144151 52724
15485 52724 15894 42740 83949 128559 80218 47550 28212 60083 112755 -23420 -189181
15474 -189181 -173493 -3367 133715 231701 243483 196958 190929 119476 150351 249496 147615
15463 147615 144489 128516 161286 199787 158438 119111 160075 127954 303444 422463 306391
15452 306391 192941 273645 356939 215804 156414 269704 231723 48844 -1818 18078 103255
15441 103255 103135 -32762 -87042 -54582 -62607 32428 35182 586 41223 83963 135714 158897
15429 158897 151552 203931 125947 144442 207455 228282 160408 189936 270628 260278 276212 339198
15417 339198 381293 382807 263904 245829 184713 34144 -129089 -139145 -57400 30610 21553
15406 21553 82893 -26724 11583 75677 -36404 -128068 -86445 5384 32672 112206 208083
15395 208083 168817 141440 126312 188806 175149 58734 -113765 -50721 55251 18793 59241
15384 59241 109199 10774 -34359 116326 198562 104488 15085 -94736 -155208 -107607 -29891
15373 -29891 93172 157725 208818 310031 280476 233132 125842 74922 147959 116828 90338
15362 90338 67592 84790 119036 129702 121607 53268 154360 182507 77486 -59627 -191233
15351 -191233 -155475 -76068 -33077 -29458 6556 -50682 -58834 -44984 -151051 -134416 -64533 68417
15339 68417 121715 169425 219112 168568 103407 123171 93420 2946 11193 24804 77933 146743
15327 146743 82503 88203 120609 188429 165402 46425 110452 120488 112995 140411 194998 240366
15315 240366 196065 205845 180753 119335 94310 71052 135222 272967 281510 151744 101450
15304 101450 58653 71822 141872 98060 89724 17943 -101707 -59832 61733 20953 34161
15293 34161 70098 48335 85591 89060 59166 71893 190797 210821 125607 -11945 5545
15282 5545 -25612 -68828 79209 172924 109872 16458 -83414 -126563 -159376 -123964 -15547
15271 -15547 53610 63854 13840 29189 62138 -24530 -43262 16735 92909 196162 48079
15260 48079 -82938 -98475 -152553 -106427 -104662 -100439 -108917 -94144 -8913 41410 -17093 -59204
15248 -59204 -98982 -120203 -90243 -33942 -31053 -116385 -150558 -30328 160430 124008 61307
15237 61307 7457 -81856 -59197 9236 164278 196868 155862 163204 76898 55987 -40138 37485
15225 37485 -65275 -167838 -155461 -189839 -138064 -100080 -104172 -75079 12705 137832 41401
15214 41401 -140550 -106773 -60941 -57210 -136040 -91868 -242488 -256879 -174097 -143400 -34062
15203 -34062 84255 131243 130832 117381 85268 64765 49847 73499 -94362 -60003 12137 79777
15191 79777 150301 166055 10669 -246068 -343541 -264854 -145855 -7775 24413 7146 -33074
15180 -33074 21601 57633 67370 94963 80893 -6334 -42080 -24625 -10780 -11747 -84040 -151241
15168 -151241 -140081 -67588 -80329 -51304 149432 236352 178253 90822 153550 212645 334731
15157 334731 259133 98716 -2059 -84102 -17199 22831 98829 83221 109399 26262 -20480
15146 -20480 -70365 -102312 -6173 32010 -27641 -5788 32198 122687 119439 81412 -9478 -51560
15134 -51560 -27574 -13756 76407 17922 -69679 27710 4998 -101523 -111327 -12363 131862
15123 131862 214865 175757 91975 -37040 -66502 -113218 -145992 -181322 -148367 -113782 -105248
15112 -105248 29081 155735 191999 148611 101527 103044 97370 111123 95653 47757 104970
15101 104970 44887 -57309 -78393 38696 182916 120053 48936 41655 31556 30367 25480
15090 25480 -52768 -67026 -96303 -7440 109684 131882 5685 21570 92918 66633 54161
15079 54161 115458 105701 60350 133687 67076 94356 77569 98055 46136 -107206 -145365 -198482
15067 -198482 -146122 72035 118915 103133 -10977 -95872 -107227 -2054 -50093 -24449 9379
15056 9379 31192 182522 247911 156324 72896 143242 133762 65122 27778 69270 15846 -7584
15044 -7584 -69775 -107604 -34234 14188 78791 94329 63989 -9666 63305 171450 146569 11545
15032 11545 -84099 -145457 -108335 -27601 -6156 56774 16428 105332 197293 118032 -22081
15021 -22081 -39929 -55769 -54555 -97737 -90387 -8722 345 -30981 -66204 -46245 13050 25323
15009 25323 48992 -52363 -40770 99925 48472 145300 107401 -17175 63850 208868 176918
14998 176918 125652 70059 3467 61501 124880 162878 74253 83342 71309 136555 192221 191091
14986 191091 -8211 -186848 -175869 8676 165615 171313 61060 40235 118268 147946 145797
14975 145797 133872 216986 269776 46036 -14396 27537 61417 131805 110908 -52417 -56400
14964 -56400 138328 29768 -28134 -16589 41534 -1850 -19522 26905 52417 -107268 -191567
14953 -191567 -172616 -29782 17350 8677 59588 42406 -10232 -14111 64043 126214 136353 7132
14941 7132 4590 2983 42083 26439 -7783 -44732 -49532 -103057 13291 56374 74027 51563
14929 51563 -64427 -80328 -11467 85614 44752 -66478 -167488 -208548 -142979 -119298 -74767
14918 -74767 -4953 -49821 42436 14500 49799 31466 93097 145097 116126 20265 -104954
14907 -104954 -121091 -165746 -109118 -129503 -133141 -160617 -65354 -88409 -192454 -167816 -74246
14896 -74246 -48528 -37189 -19553 -37603 -8921 82353 104830 -65679 -100602 -2452 70502
14885 70502 19352 -9400 15430 -35503 -77131 -3331 38697 -1072 41455 192175 127172
14874 127172 -767 -143270 -252044 -377427 -366818 -273884 -203359 -209864 -164177 5870 138537
14863 138537 51747 56908 61222 10918 12616 -77454 -155570 -199546 -120180 -60428 -31492 -91832
14851 -91832 -108452 10214 52179 118836 152687 81244 179040 213003 162407 109249 23037
14840 23037 32154 166795 222305 140481 23651 130060 273387 290181 260961 220879 220102
14829 220102 174437 150108 107441 -2733 1961 64383 116621 111674 9361 11192 -146273
14818 -146273 -318740 -238300 -147053 -120075 61967 69946 192074 160889 92195 27309 -43788
14807 -43788 -34979 946 -171345 -221095 -124152 46875 154372 -96939 -286711 -268480 -103785
14796 -103785 -107956 -115381 -87941 -172111 -206058 -163649 -158783 -160434 -116093 -196046 -140519 -63090
14784 -63090 -31027 58782 94595 38917 112637 149691 47201 3377 -12586 -32676 -44219
14773 -44219 -33473 -89107 -83167 -90572 -185210 -327732 -404117 -386611 -253408 -66101 36184
14762 36184 -53954 -29764 -78029 -36465 -10879 66633 119176 115483 153307 88393 60012 83834
14750 83834 145416 126125 -12365 96222 86026 -14200 -53933 -26291 -25806 -83693 -152025
14739 -152025 -218604 -137480 -151822 -93794 -42288 -65723 -88229 -169161 -212988 -228356 -131980
14728 -131980 -112375 -98044 -45209 -80986 -59073 53791 26732 10336 18254 47736 -69409
14717 -69409 -220397 -215946 -117685 110659 205032 197301 164034 209898 245750 89223 -29941
14706 -29941 -26723 21121 77487 -117538 -150402 -83978 42549 243943 284729 193355 -51108
14695 -51108 -143741 3412 125518 238039 236559 -9088 -172546 -117368 12395 35681 46402
14684 46402 79881 112499 170722 209996 215088 82644 9480 -131281 -262187 -324585 -240218
14673 -240218 -78271 -40123 -177864 -109448 -99183 -181675 -57004 26619 94246 35931 -42910
14662 -42910 -62577 -61493 -191031 -188435 -77511 6240 12126 -26400 106703 71810 -17890 123970
14650 123970 116993 1764 62078 152061 157281 127063 68210 30389 23986 1647 4146 28399
14638 28399 15447 -71039 6990 13966 6715 49565 173981 97324 36836 -11731 -27747 6311
14626 6311 60696 39561 97634 69421 -56354 -165218 -237086 -190446 -62916 8511 -27909
14615 -27909 5074 66318 68117 76943 -29469 -97369 -104542 -22265 -43526 -126723 -109935 -108443
14603 -108443 -160557 -116145 -149053 -46987 -39964 43313 83902 -48818 1799 120319 83845
14592 83845 117014 152211 160449 101257 -13208 -29510 30745 48943 16733 -8049 -121298
14581 -121298 -33448 -27892 36363 131873 66375 -59579 -139504 -213816 -151289 -46612 63859
14570 63859 7824 -27095 -16286 -92138 -166334 -83654 14825 64067 -6328 -19370 -104011 -232732
14558 -232732 -191395 -145633 -46388 -68128 -39240 2750 35334 39946 -42904 -60357 -64214 -75375
14546 -75375 -2762 -44172 -76246 -200622 -226171 -367755 -376654 -161088 -34254 -3889 105162
14535 105162 170303 138715 43538 -37438 -46898 -9177 -52985 -82047 -181333 -65009 -386
14524 -386 -6423 47818 61270 -34087 -58471 -69231 10006 30770 -81435 -52805 -75309 120762
14512 120762 181433 178719 117287 174999 66606 -108254 -221905 -206718 -132402 -58829 4749
14501 4749 22793 72355 166178 33126 37608 35255 60872 16053 124846 175753 166131 181315
14489 181315 254300 230502 -8723 -46748 -45319 -17158 1690 -76046 -140203 -160994 -214105
14478 -214105 -186260 -101654 -225486 -187018 -158513 -112302 -39354 -70559 -135575 8339 -5074
14467 -5074 -28370 -15703 12712 -8651 -68297 -74164 -95497 -131046 -161735 -139398 -89001 -5418
14455 -5418 30110 -96331 -143190 -108199 14954 8136 -3760 -36848 -28660 33978 -60091 -94483
14443 -94483 72540 35673 -42058 -21909 17281 93036 91061 26545 -23853 -45648 -124704 -119553
14431 -119553 -82924 -3510 204196 90681 48578 -55772 -81833 -115417 -133051 -241422 -238202
14420 -238202 -81380 -31316 -31744 -125711 -245088 -331937 -389883 -379774 -97982 -3384 -6555
14409 -6555 -11655 3092 69484 64249 114477 105186 69236 17516 -52735 -60681 53048 65629
14397 65629 109543 70242 84595 107831 -18541 -72533 50246 198771 131451 72871 -26551
14386 -26551 -146062 -217982 -216530 -185625 -226027 -172907 -173214 -160189 -171465 -34334 11040 -99961
14374 -99961 -86229 -5178 105984 26326 -66789 -19781 -8489 68914 29858 7961 5909 -28372
14362 -28372 -34672 -97933 -120572 -68164 -98617 -17670 -44738 -48618 -104531 -204526 -223951 -149829
14350 -149829 -86953 -84390 -94433 -145623 -99604 8805 133906 136851 9400 -118886 -11716
14339 -11716 35770 -47272 -113651 -52673 -48850 4892 66683 -35992 -33799 -49151 -56101 -1297
14327 -1297 -40212 30613 -18024 -85853 -22704 127987 198366 81292 -2201 27140 86518
14316 86518 138160 105619 161412 88104 90 149792 165789 222655 167304 88562 -28839
14305 -28839 -12669 7952 -64092 -29380 25308 -58938 57739 202534 192570 137190 119406
14294 119406 86177 54635 31736 -33349 -96403 8115 79061 68126 94719 25354 14102
14283 14102 -19025 -17301 91314 7537 -76741 -197675 -196637 -225768 -119995 -48184 11284
14272 11284 49069 29391 16736 21811 -18748 43563 173162 145631 76497 126794 66069 760
14260 760 47297 113797 2757 -54992 38147 -17828 95072 73962 -48255 -55904 -18498 -53013
14248 -53013 -191849 -283354 -215927 -203297 -197556 -229778 -277478 -152792 -32473 35536 16768
14237 16768 59744 -12446 -32929 -14517 145602 226457 88156 -59682 -52695 15908 43588
14226 43588 -107106 -169722 -87612 7165 39364 -25180 -44645 -100505 -56941 -126591 -64773
14215 -64773 10277 -24137 -20010 8558 73737 59210 11320 13562 6110 -94016 -121470 -63957
14203 -63957 -5271 14389 -60835 -47101 -14751 42549 79196 170965 110728 41348 -40893 -57769
14191 -57769 31655 -80721 -233171 -136896 -181325 -145471 -143540 -47501 51165 126497 107778
14180 107778 117631 86618 74781 28100 110790 133091 148436 216943 324826 300129 236805
14169 236805 147673 92650 38309 33098 -50547 85451 72236 47662 152627 206037 158605
14158 158605 167971 195495 151858 165271 248990 143674 -39363 -78965 -26274 22455 -35713
14147 -35713 -153565 -184630 -176241 -100512 69019 148043 81549 -103564 -19951 70311 -31482
14136 -31482 -131156 -62084 65110 74502 -14155 77895 160704 122534 57995 -60049 -103338
14125 -103338 -5380 -22266 -93205 -200638 -215436 -65954 -14525 -112964 -70141 -37208 -132803
14114 -132803 -207876 -167581 -152531 -197013 -131224 -113644 9567 61372 46836 -81060 -55710
14103 -55710 -109884 -45640 106790 -3755 -28878 61502 10792 -79746 -58316 -89565 -117254
14092 -117254 -94915 -122139 -142411 -7640 -2775 -66325 -91804 -119361 -68878 12390 7256 -141623
14080 -141623 -59537 -72054 -12177 99219 179992 145415 26840 -144406 -223903 -243576 -171171
14069 -171171 -6927 137518 160057 -481 -91788 -138461 -99644 -121665 -175190 -146093 -225849
14058 -225849 -277283 -220109 -194053 -106985 -80300 -8097 7211 -135361 -137455 -177698 -171261 -49216
14046 -49216 13030 39916 9571 -88138 -109733 -64564 -35833 -80142 -80397 -64031 -50693 165802
14034 165802 303764 163410 52800 164974 126878 -41747 -74672 -31613 -54262 21812
14024 21812 138304 169296 102877 39037 -108347 -43586 17207 65484 108311 81832 55525
14013 55525 -3987 -96581 -113567 563 -136026 -267319 -250212 -157576 -161622 -299929 -232563
14002 -232563 -201818 -320151 -237375 -146139 -169659 19061 105768 199603 143347 -23720 -112476
13991 -112476 -28247 109988 113051 91854 154162 181630 78811 36251 -23790 -81407 31263
13980 31263 137597 186236 136143 31578 -130765 -78363 -91944 -117971 -41238 55672 87505
13969 87505 140008 93091 74259 23039 -22191 -8289 -140734 -109639 13126 50701 53064
13958 53064 -8582 -103542 -154651 -137078 -112343 -59323 -51901 -71232 -57417 47792 30308 -144776
13946 -144776 -25371 134472 62022 -53448 -93874 54070 243645 314108 220083 131962
13936 131962 222086 175063 88981 46111 -10488 -12456 -90838 -194803 -212484 -192351 -87342
13925 -87342 -85495 -5292 -52751 -159706 -56954 -2622 -117648 -233357 -170242 -105415 -17986
13914 -17986 47372 21581 -57868 -143954 -158151 -185008 -209495 -117568 -65897 -104771 -37521 28995
13902 28995 -3389 -45293 -67464 -61904 -108431 39822 135835 21991 -12009 -21412 -21057 -52805
13890 -52805 -21769 -3215 -42024 286 24760 20305 -46812 -79070 -95798 -229551 -288243 -165310
13878 -165310 -66742 -77970 -51772 -70383 -58367 -27439 -14373 -45295 -129417 -224510 -259977
13867 -259977 -252591 -226040 -234893 -287565 -288463 -226603 -183708 -115019 -43847 36809 -1100 -126473
13855 -126473 -54375 154446 163429 5295 -82415 -136915 -53395 -127217 -156016 -145479 -55257
13844 -55257 -167289 -183708 -75098 77903 116963 107176 79532 94454 49929 105505 114054
13833 114054 50577 -1073 53213 140520 119969 117798 134900 30695 -125157 -92842 -63094
13822 -63094 -21671 -36446 61934 101538 251502 221730 56320 5143 -21367 -55159 -20464
13811 -20464 -107659 -229195 -296764 -456975 -470121 -402750 -209520 -132315 -40638 -22267 -77610
13800 -77610 -133945 -164001 -161758 -208132 -267669 -306668 -193735 -85647 93023 184690 147942
13789 147942 -33497 -207495 -227462 -64964 214706 116914 104684 136476 80517 -43825
13779 -43825 -174756 -172599 -169904 -129439 -114381 -100986 -29145 -49953 62068 174902 261020
13768 261020 323396 289232 91735 -24416 87377 101945 69303 125050 74046 113658 111294
13757 111294 41722 35578 -49262 -101680 -200745 -332161 -299778 -177275 -142379 -88633 -16673
13746 -16673 -66052 -188228 -209849 -77294 -38840 -98559 -122453 -36131 -88143 -69625 -35332
13735 -35332 113037 176490 167649 138894 575 -6808 -57280 -69348 -17430 -38597 70122
13724 70122 15706 19062 29718 11294 -40208 -43605 -101547 -75268 -78571 -159671 -227238 -178784
13712 -178784 -145444 -119125 -94902 -196087 -182945 -145231 -145848 -165046 -244499 -221803 -159776 -211973
13700 -211973 -165636 -56772 -57037 -29364 -114034 -121070 -118431 -228910 -159177 -63488 73139 63529
13688 63529 -3858 -45496 -109771 -191046 -123620 -34143 -82083 -29198 37010 27811 -15799 26766
13676 26766 -101686 -134693 -184323 -123641 -26385 17190 -5703 -46444 15493 -135235 -275915
13665 -275915 -338975 -452009 -357696 -230545 -54765 -6174 -44323 -200416 -258927 -165432 -97964
13654 -97964 -63318 -155842 -209715 -82995 -107622 -198280 -199951 -115906 -63602 -130906 -28708
13643 -28708 45865 14293 -60434 66054 112901 197923 -1964 -155602 -270970 -249725 -211425
13632 -211425 -117476 -55644 -112759 -114748 -70078 -19837 21692 -44280 -182589 -106514 -117321
13621 -117321 -54258 38062 94803 86705 63061 149888 139007 229331 197690 130585 80041 -6414
13609 -6414 -93270 -235686 -223756 -145822 90544 60428 -48026 27812 118337 70810 131213
13598 131213 157619 -20753 -97977 -139463 -140274 -92441 -26263 42509 86280 108637 115180 53852
13586 53852 35540 2953 9867 -40597 -5808 98348 55679 -67186 -59114 -70692 -117817 -301674
13574 -301674 -224882 -173499 70305 145772 9861 -89117 -97548 9253 340 8058 -16915
13563 -16915 76024 68152 9103 122718 265301 286673 135221 48510 55958 17097 -45489
13552 -45489 21597 99299 90984 -16330 -28773 112652 176487 118985 125564 229724 316790
13541 316790 199892 71636 -54662 -126453 -163655 -160360 -93932 -32794 -31198 -57097 -69756
13530 -69756 -93475 -78671 73286 140962 110137 102010 52470 27024 55684 60609 85043 106884
13518 106884 114723 20436 -99446 -90874 -84930 -113225 -140028 -105368 -172764 -106722 2675 -33754
13506 -33754 14351 -31309 -70881 -57883 9243 82042 25074 -171877 -154895 -92780 -71885
13495 -71885 10924 57623 18663 -24316 33814 82865 165136 179241 96876 61448 58498 70927
13483 70927 -11686 -73397 -214678 -146346 15513 47527 -49926 -23027 716 -90482 -194790
13472 -194790 -186802 -84199 -148554 -92081 -48422 89714 155098 274327 370177 257748 102073
13461 102073 -23695 -87543 -192062 -171478 -95902 -124523 65049 9512 64796 110220 184721
13450 184721 205567 -19050 -127306 -118910 -144760 -169020 -117168 -117280 -264214 -312778 -140285
13439 -140285 -12699 136762 248732 207725 78501 -5940 -191206 -370994 -308641 -227611
13429 -227611 -76499 19386 -14092 -12277 -84955 -20330 62758 -8541 13188 37456 64129
13418 64129 13297 -16435 158909 154275 107073 111717 -28177 -87622 -104429 54904 -98505
13407 -98505 -149318 -179754 -141225 -61921 -127950 -131545 -127365 -54794 163694 88591 27130 -72236
13395 -72236 -105892 -94952 -60030 54123 114779 33695 -87498 -67247 -148447 -209738 -195897
13384 -195897 -238145 -173022 -31661 22318 8696 25108 44523 235021 129649 -51643 -5056
13373 -5056 11099 16805 -24420 -53460 24192 121668 75254 65168 49433 101560 169441 189074
13361 189074 161679 -22322 -129934 -149986 -112625 -62545 -145592 -194951 -71118 59906 149974
13350 149974 15579 -199587 -239009 -132954 -13080 22628 -28164 -82770 -46101 -26774 -28819
13339 -28819 -37419 -30971 -45122 -102720 -168583 -235281 -101055 -81176 -51419 50232 -108277
13328 -108277 -172933 -36375 -16556 -97620 -119604 -106497 -66623 -108928 -68065 -22461 -47372
13317 -47372 -8712 -81868 -163180 -129245 -81832 -70333 -179899 -213317 -124807 -102716 -164454
13306 -164454 -67794 -66053 -172421 -229974 -211818 -50012 -12259 -80277 -85207 -214725 -102319
13295 -102319 -61550 -58297 -84745 -176280 -127453 -142138 -200321 -186608 -135065 -106159 -84114 -22080
13283 -22080 -91095 -122972 -142814 -61816 2661 47238 -13705 -127012 -68241 969 -48715
13272 -48715 -120702 -202722 -195803 -68494 -84717 -118268 -96343 12653 83893 69410 68991 12895
13260 12895 -99117 -213190 -123995 -17735 111978 40877 -49581 16611 -21033 -106421 -114912
13249 -114912 -35505 60977 59661 -18666 -50526 -188993 -287323 -184398 -62840 -52197 -32451
13238 -32451 -17103 106487 18514 745 -70771 -18355 46473 21298 -6553 -9546 69141 24731
13226 24731 -21260 -47104 61068 -2207 -106196 -171266 -194645 -158309 -84132 -23174 -156332
13215 -156332 -209809 -176124 -132086 23110 165586 162717 51181 54901 190943 381110 556561
13204 556561 723985 884098 941905 860181 713417 548102 320698 160102 19869 -17348
13194 -17348 52039 -13688 -24341 102580 144659 11481 -101439 -112034 29111 139457 177290
13183 177290 165543 162290 152195 70168 -37187 -109076 -14054 61323 86310 145323 352017
13172 352017 438821 398011 409089 417155 457787 386811 303812 306297 427865 623922 897709
13161 897709 1279474 1830378 2626612 3183458 3297594 2987578 2338495 1563848 1121127 769697
13151 769697 582136 563257 474967 291256 256987 250124 372189 451611 342246 276300 151183
13140 151183 152914 178359 153353 178453 219720 139538 99536 148332 194581 213287 200131 30455
13128 30455 -93970 -23071 169229 209618 212997 278621 328954 332877 337793 425414 538788 730388
13116 730388 1074849 1695053 2346752 2820781 3023238 2939014 2485344 1631656 972828 622953
13106 622953 414926 317487 341432 231564 284044 287760 190986 111250 135512 142721 38268
13095 38268 58673 99911 136561 128222 77617 53069 112547 178683 191378 128255 140060 129087
13083 129087 246128 211767 176730 232959 324394 258786 166882 125202 83831 -4652 112602
13072 112602 197768 269697 342216 613300 742367 853414 1016059 935909 592235 309946
13062 309946 247672 45166 -44676 78034 125837 102202 131823 75217 18538 -136443 -148119
13051 -148119 -79878 -106000 -147638 -169072 -95054 -48175 -158495 -2841 -44440 -109716 -90866
13040 -90866 -181860 -187687 -148997 -111446 -20351 -47628 -18477 43588 141693 98260 45329 75373
13028 75373 23774 70902 64478 89045 95988 15745 -39870 -44182 12537 260474 305109 160415
13016 160415 98134 -32776 -138504 -145992 -110241 -173101 -48510 126871 165193 70047 -42834
13005 -42834 -46551 106181 171586 228689 192360 154820 63462 109176 119349 98250 53908 55214
12993 55214 85989 -90243 -193745 -172005 -162844 -82321 74994 172256 174767 161538 176521
12982 176521 52212 -43600 -44345 25643 179453 152715 149751 143615 87744 -28532 2581 384
12970 384 -67614 -133985 -219613 -163815 -124162 -75156 -54773 10940 -45495 -220266 -239820 -262681
12958 -262681 -240192 -235952 -168469 -47438 -15619 -159876 -236601 -163081 -123301 37802 2429
12947 2429 -16842 34065 -68443 -152757 -92914 -74773 -60020 -140523 -178252 -101017 28333
12936 28333 63859 -5587 -156161 -180478 -236265 -174274 -155316 -124498 -40889 9131 -12731
12925 -12731 -13824 6108 30055 54317 -88268 -207037 -93443 58094 38717 -24339 -97331
12914 -97331 -4421 20842 30772 176813 124582 39681 27418 -4475 58338 -51932 -134285
12903 -134285 -160304 -51929 36847 -56066 -58637 -72497 -2605 25203 16337 71178 -104282
12892 -104282 -202683 -98553 -3863 76958 95513 56346 -5482 14990 -116976 -236513 -257005
12881 -257005 -121191 -176866 -208477 -202917 -184796 -231069 -219607 -138631 -69463 21658 -15648
12870 -15648 -177200 -94824 -102145 -115963 -53973 -68323 -63786 -152071 -195764 -77713 27506
12859 27506 -31914 -136584 -128031 -47984 -56535 -83927 -145653 -125532 -84673 -110126 -201122 -206949
12847 -206949 -179530 -124351 -32797 -28716 -82567 -91819 -145138 -54231 -72538 -165662 -120453 -41171
12835 -41171 26407 71574 47396 62245 13626 -153642 -227832 -173596 -41399 -77421 -57483
12824 -57483 -41335 -60832 83878 319975 339041 158036 22216 -101350 -76777 -30611 -99109
12813 -99109 -19673 171915 227192 165976 -9848 -76128 -29105 7828 -35694 22085 120502
12802 120502 34103 -41417 -99008 17357 24992 36944 -42829 -46651 -30632 -7868 41972 -8966
12790 -8966 -28011 -47049 -181541 -341920 -182945 -19019 -80181 -76158 -119409 -121999 -83125
12779 -83125 -22445 59583 78907 47233 70686 131283 65308 -33237 20372 79113 210302
12768 210302 212998 246201 137205 86270 141174 117739 98920 -21612 -77336 -94817 -24823
12757 -24823 25341 85552 143112 159693 183010 90719 -21603 -53777 -55244 -43463 -32530 -161496
12745 -161496 -72991 118927 130370 165545 16803 -186890 -139097 -160206 -146193 -204876 -209020
12734 -209020 -140458 -85260 -169092 -164017 3247 -20810 -94957 -160553 -115166 -81055 -46836
12723 -46836 24838 37500 66067 -31949 -77576 -69297 -91737 -185463 -104355 -74462 -55299 -8332
12711 -8332 -9256 75898 57737 11661 -16017 -123134 -123723 -52139 -127864 -106706 -15579 37472
12699 37472 -13354 -79882 -129900 -95775 -41779 -123550 -60379 -80951 -86383 -35917 32521 10367
12687 10367 82884 -10581 -54947 -206883 -312718 -283043 -258216 -208850 -230858 -180500 -166752
12676 -166752 954 163548 114422 101976 93136 182173 116180 27207 29688 233380 297589
12665 297589 264365 172550 -14225 -110916 21119 34073 16926 12536 -76086 -64839 -19988
12654 -19988 -11468 -18938 -133189 -88391 62868 -16852 -8642 5385 60999 46756 15043 -17753
12642 -17753 -97680 -105790 -101560 -92635 78067 106545 28507 35234 -65278 -98164 -95246 -111133
12630 -111133 -90098 -59087 -22694 70084 90454 48028 58553 -27173 -184577 -226477 -144610
12619 -144610 -122015 -106209 -53888 37431 2710 -44613 -38502 -78104 -174192 -234695 -95089
12608 -95089 61026 208625 290697 242811 148404 30045 28022 20100 -38415 -3908 -67182
12597 -67182 -178130 -261676 -225980 -88808 -43590 23561 73167 63635 -81462 -232125 -154977
12586 -154977 -161582 -332211 -370227 -280998 -283230 -308660 -331751 -316968 -289666 -233553 -196205 -182767
12574 -182767 -171211 -95378 -34879 -79607 -61462 81223 48156 -61269 -78315 28292 99387
12563 99387 111976 46107 -4781 -47583 -81073 -59885 -138051 -208996 -44520 23502 -13854
12552 -13854 108198 88241 139879 54014 15037 20264 -14405 -80653 -83496 -183317 -222718 -149841
12540 -149841 -84111 -92934 -23697 36333 12478 -50178 -35118 20661 -35194 23139 152351
12529 152351 14599 -108102 -140777 -53996 37429 102389 -45078 32748 141008 38873
12519 38873 -19741 -17137 78413 165894 190170 79534 49226 10980 -44370 -125784 -16108
12508 -16108 160163 71002 -15915 -43726 -29979 -35849 -34566 -32983 -77474 -86708 -129944 -192244
12496 -192244 -91429 -118265 -72226 43276 -5598 -86737 -182916 -146482 -146520 -107527 -42618 -50037
12484 -50037 -63567 -25941 14597 -18999 -87004 20031 63457 60798 15756 24296 53540 138004
12472 138004 150188 112710 167899 181676 136303 1295 -138203 -148357 -279181 -285091 -233183
12461 -233183 -243092 -267623 -254931 -144110 -80715 -32738 25283 -64627 -14830 4279 -3401 -28841
12449 -28841 3967 93989 9885 45174 132683 158464 95890 44579 -27573 -21748 52963 41200
12437 41200 -10321 -109829 -159979 -132803 -162275 -102047 65933 148779 96216 -34129 -19438
12426 -19438 -17110 -36389 -101804 -20367 121080 219325 266892 155608 76034 41794 -75588
12415 -75588 -129159 -64632 111049 150748 135271 89380 23730 105742 277869 262104 152184
12404 152184 51580 38567 -72419 -7097 107591 143454 119240 52539 -105436 -45670 69532
12393 69532 118192 34905 77683 10234 20740 77772 119272 117392 28006 -63901 -64379 -95063
12381 -95063 7433 61778 94638 167674 113335 29349 18114 -9322 28419 56284 31542
12370 31542 -69699 -91329 -17904 -42989 7687 85017 -5472 -99407 50735 89940 38055
12359 38055 127591 87005 -106654 -176647 -99961 -37476 92276 108899 27632 -19841 -64635
12348 -64635 24265 9528 15843 39250 -35908 -13863 -58201 -8967 88085 82792 104147 65978
12336 65978 61497 -42476 -123445 -234277 -295494 -232633 -140128 -141501 59041 145464 188716
12325 188716 144535 25769 212741 185765 62465 43137 313 -6752 -8532 34347 135135
12314 135135 188481 81088 74768 77179 -62553 -127512 -173588 -132092 -84405 -336 29039
12303 29039 92547 37345 64164 63979 49263 172733 170131 140615 117702 61299 -50314 -59673
12291 -59673 -58461 -68550 -23353 4700 -28453 -95642 -118027 -25865 88584 96686 63185 144083
12279 144083 162723 3046 -84302 -160288 -179664 -39411 120993 191825 161571 74932 31379
12268 31379 -826 -117782 -110817 -84072 -11144 -23490 -89776 -184547 -197774 -222008 -123612 -87173
12256 -87173 -62786 -14642 28810 172271 160293 167237 282777 311789 240407 183763 52059
12245 52059 -9530 -40474 -95765 -41285 -11018 44277 62182 27908 105332 48735 -8354 47438
12233 47438 97656 56292 -30957 75464 212594 321228 231418 134232 13463 40651 55347
12222 55347 51884 16266 -161538 -98667 -131341 -171592 -67826 18401 -43370 -125394 -63807
12211 -63807 -4482 -15150 9520 -18657 -125765 -138987 -55620 -56495 -154750 -214315 -146122 -112996
12199 -112996 -189474 -164754 -19903 -27118 -78014 -33845 21671 33829 -60303 22187 163782
12188 163782 165423 135668 19392 -80621 -244093 -200523 -98060 2341 60277 -20855 -26943
12177 -26943 -94111 -110657 -99668 -114147 -98301 -56750 23317 37805 101490 81996 -14677 5640
12165 5640 -23023 -5345 70594 85859 5079 -101847 -57126 -68739 -76903 -44269 38031 14803
12153 14803 100649 101456 21754 -30748 -122040 -79300 -10182 -13335 -40538 -4727 8398 21155
12141 21155 70915 127720 67678 48700 134886 237713 223759 80652 4253 72858 120147
12130 120147 251771 136352 128787 9192 -107469 -69982 -86233 -167979 -120853 -49899 -68526
12119 -68526 -23432 -6312 -62676 -75380 -643 151671 88738 -57969 -83041 34046 49210
12108 49210 -60787 -77482 18316 57509 50019 43486 22618 -38918 65105 104413 209426
12097 209426 343042 355612 199171 93442 71174 40951 68208 -24675 -195380 -129971 -2349
12086 -2349 42697 -47963 59656 166451 174064 59902 -1997 -49349 -17846 -99091 -34630
12075 -34630 -48988 -12290 7635 4438 8977 -155537 -232707 -279264 -241332 -237298 -198263 -101460
12063 -101460 -64460 -176863 -136029 -105239 -170935 -71154 -4994 -83272 -64832 -137072 -210665
12052 -210665 -107831 -128313 -93135 -170221 -134133 -92044 3728 21753 -22510 -29516 183069
12041 183069 235336 49330 1383 11075 27115 -100189 -238496 -285403 -263217 -242546 -226642
12030 -226642 -73317 52165 -24476 -39245 -91493 36302 46147 -5637 12574 12420 -36674
12019 -36674 -49433 -57467 -47214 87964 101946 64330 107564 172181 104747 -15068 -72296
12008 -72296 -11567 42816 -86066 -129441 -113654 -124481 -173872 -181784 -112490 -189153 -165216 -108856
11996 -108856 -94127 23537 79473 96261 182108 -6029 -220737 -160871 -199584 -281301 -283873
11985 -283873 -195990 -214418 -187919 -138715 -128101 -125214 -138850 -174253 -220038 -173769 -85343 -99789
11973 -99789 -193825 -8682 125755 114289 124743 193701 154660 142242 153527 118065 98778
11962 98778 -15764 -143831 -158276 -173793 -100700 -64562 -17804 -21710 -34914 117821 127550
11951 127550 36921 94481 175066 218792 169322 115318 94134 181909 176072 128067 37010 32210
11939 32210 -15385 -26707 51838 29296 -21031 -64377 -10090 -67866 -148630 -170742 -4368
11928 -4368 28243 -19023 -125751 -152806 -235733 -189264 -48865 -22955 -25360 -58201 -63944 -60351
11916 -60351 10762 19212 104080 160535 181419 242520 300255 288554 161071 2687 -121544
11905 -121544 -89603 -145827 -193294 -54263 70168 155412 183210 158487 25083 2727 56011
11894 56011 113728 -12969 -78414 54725 128737 106078 65344 38002 13524 39826 94984
11883 94984 163202 270907 181997 137100 78037 30365 44260 49352 82066 157066 28568
11872 28568 21847 -74167 -102558 54582 115546 -64981 -143258 -17058 94076 79637 -90624
11861 -90624 -17807 -37701 -119192 -203485 -189034 -104524 -34562 -226269 -269471 -278591 -267583 -98174
11849 -98174 83148 96014 -83089 -225537 -188291 86115 125295 -18902 8424 11046 -54774
11838 -54774 -59420 -180570 -232192 -236924 -95263 -125951 -226182 -241091 -113779 -47126 -28753
11827 -28753 -101580 -71532 -150287 -69482 -39184 43913 51516 79155 82204 30835 -81371 -32006
11815 -32006 -102575 -69922 -39633 -83391 -169238 -113798 -104340 -109906 -106786 -47630 -111953 -51237
11803 -51237 14341 46575 26179 52315 -7494 -44860 -62195 -174337 -161718 -90728 -132539
11792 -132539 -100896 -19939 31527 -125531 -198112 -225317 -254560 -132914 -43863 -38807 9818
11781 9818 -92514 -165359 -104176 -32203 66456 38720 29105 -38416 -82052 21769 152032
11770 152032 82399 -21278 -107296 -60459 31483 -45782 -119269 -144207 26710 189287 162589
11759 162589 182671 152599 95434 53192 9139 -66370 -200141 -175984 -61129 -70532 -109049
11748 -109049 -178839 -105966 16885 130621 42802 36886 85641 131148 139995 99436 -47627
11737 -47627 -117259 -165283 -250799 -288396 -141433 -124238 -109750 -43625 -79436 38497 213277
11726 213277 146311 151705 212089 122367 40260 2824 -4805 10601 -37321 -102128 -46803 -18400
11714 -18400 -115432 -97238 -132737 -213834 -293478 -270802 -216677 -161509 -112277 -75817 49505
11703 49505 27767 25160 19635 -35137 33189 98128 -8873 -98774 -37613 -113215 -211631 -210542
11691 -210542 -197137 -87477 -69805 -208800 -286730 -197904 -87224 -108287 -229039 -183346 -138727
11680 -138727 -36851 -44414 -152936 -84529 -54959 -54205 -27796 51201 68314 -1558 -30186 -40987
11668 -40987 -44194 -122848 -227708 -195325 -81817 -87468 -135663 -138344 -35827 -25089 -20887 72959
11656 72959 82660 -29851 -72210 94084 138242 191016 226584 102707 24972 38446 38621 176246
11644 176246 231646 307037 288076 170900 -52662 -165524 -116751 -96419 -60825 -45803 -51304
11633 -51304 27536 -11524 -90704 -41801 -37930 -115491 -121352 -65010 -145884 -295477 -354413 -268872
11621 -268872 -237449 -189891 -145263 -160471 -159178 -113660 -10503 124685 168716 202262 175537
11610 175537 -15596 -42406 88942 259518 260528 221367 244208 34266 -24334 -22984 -116027
11599 -116027 -100996 47017 100600 19859 -36074 -108096 -26915 44621 -9383 -15132 -27005
11588 -27005 108744 96836 11822 31281 70230 35027 38453 -80974 -88452 -112898 -198419 -221445
11576 -221445 -324256 -240800 -90620 -12327 73824 68710 89919 134749 99704 140375 222917
11565 222917 234451 183929 70766 -14481 1128 9916 -22779 56610 154966 70036 -48110
11554 -48110 59076 11938 36577 100128 83478 88396 224721 280102 151745 20685 -89604
11543 -89604 -61062 -54796 7229 51280 59045 10167 -90639 -104516 -62056 62586 134189 130664
11531 130664 108505 161448 160755 2975 -46527 -45136 -58752 -77205 49800 94332 77160 99609
11519 99609 78010 -21523 -95261 -90049 -131839 -176146 -92468 8360 -26140 -134802 -257124
11508 -257124 -304920 -366496 -308819 -220025 -77733 97920 197692 131581 151902 -8310 -148547
11497 -148547 -177667 -120499 -99441 -73258 36560 97283 165143 148031 94019 97932 -7443
11486 -7443 -84999 -88098 25508 127954 200982 212208 161457 107377 113617 39878 -13687 15285
11474 15285 14959 25486 -28958 -20534 48515 126301 203683 196514 237677 139982 76011 -50036
11462 -50036 -83581 -39519 48033 62103 154546 61497 -72925 -57694 -6045 -41398 -62600
11451 -62600 -66290 -4852 -53877 -194936 -199763 17159 64944 4273 -62853 -47035 -51735 -43591
11439 -43591 -75348 -64929 -71000 -124481 -117971 -26822 -41400 -101301 -161949 -69643 64277 140355
11427 140355 112509 72671 113631 62875 6779 -31921 -77890 -161787 -304016 -257375 -276778
11416 -276778 -130480 74784 -38111 -109094 -141978 -167772 -99081 -157028 -152589 -121592 -72477
11405 -72477 40731 78472 116741 -17623 -159328 -237232 -177924 -100388 -116988 -128545 -39286
11394 -39286 -72870 -81486 83866 87757 -42197 -45847 25078 128981 65003 -35007 -80969
11383 -80969 -113727 -89518 -40563 -115479 -139289 -111105 -36656 30816 69140 5359 21369 36774
11371 36774 -1228 31982 95628 78892 130005 129498 32124 -97939 -93421 -89265 -104197 -73515
11359 -73515 -78704 12718 74676 85314 45597 -6747 74416 1992 -40122 -3568 36940 22293
11347 22293 19105 -79790 29635 78044 50307 -19192 -42335 -27639 -29545 20659 151607 90427
11335 90427 -46324 -42828 -129797 -169868 -129721 -76843 -117736 -82627 -21756 110135 125741
11324 125741 -8964 -35495 -6048 -113566 -133808 -54163 -47261 -103340 -18913 98144 154359
11313 154359 129969 143933 76182 48256 7110 56615 182533 44458 -61476 -126453 -120164
11302 -120164 -61923 -31570 79242 44202 6361 -21605 -43486 -40294 -49456 -109011 -67108 -18529
11290 -18529 -31755 -37802 -13266 -28052 -40179 -169585 -175625 -188277 1026 23218 -8603 -115157
11278 -115157 -130491 -124160 -129983 -25185 35665 29883 25988 -2867 25672 -29159 -121617 -167007
11266 -167007 -5330 -6752 108 26720 -16848 -41835 -137113 -254800 -280751 -161290 -145634
11255 -145634 -122628 -82374 -84335 10927 -18351 -11163 -36996 -74407 -120656 -111109 -106740 -81133
11243 -81133 -57138 -60773 -11576 -10962 -42721 35366 -69337 -116052 -106709 -87759 -231441 -233980
11231 -233980 -81750 41425 173533 196030 176777 120578 97837 110623 136284 175600 186261
11220 186261 130109 93286 156950 70084 -124243 -186967 -134911 28468 65151 127725 65527
11209 65527 -37944 17297 -6608 -17295 17518 -63757 -183986 -70975 -78883 -88742 -26384
11198 -26384 39311 47176 135898 86453 -22934 -135414 -131696 -103519 -143240 -171283 -186325 -119270
11186 -119270 -58284 -24738 39565 80850 -15079 -35435 34223 140016 105876 -80365 -89812
11175 -89812 -84393 -9817 -109396 -55910 13458 -92107 -145621 -27559 59417 -114863 -141241
11164 -141241 15216 115198 111221 134787 99359 91184 125527 66648 -51081 -88678 -56902
11153 -56902 3201 10339 -28960 -123309 -165375 -213164 -215657 -169212 -188397 -156173 -55112 -75897
11141 -75897 -191649 -156963 -93191 -94311 -52269 -55645 -75105 -16403 66211 -4048 28188 35505
11129 35505 -67239 -175420 -125972 -109700 -66693 -86351 -61327 -77631 -168913 -211247 -186510
11118 -186510 -45824 55545 174552 95780 96454 84657 96307 155999 144005 123308 -24743
11107 -24743 52789 88354 114306 25308 692 46389 15757 8679 -41503 -93370 -104050 -19824
11095 -19824 92742 66548 -49258 -103505 -22220 3734 -151891 -102170 -17198 -72669 -88569
11084 -88569 -94665 -94720 -198545 -229033 -202909 -136826 -192531 -159680 -75012 -10566 152962 233423
11072 233423 120923 36452 18588 57610 -47628 -76571 -78969 -7536 2 6489 109800
11061 109800 25745 -132107 -155429 -95065 63828 30373 13720 -47342 -43265 -37884 -47003 2936
11049 2936 48344 83532 84493 64893 -2510 128356 130636 108299 23477 -29799 -99576 -63360
11037 -63360 8255 58289 92794 -18528 -130636 -180452 -143364 -85853 16929 -98691 -15748
11026 -15748 -38120 -135779 -227942 -194776 -126376 -169429 -133178 -168793 -209233 -252789 -209815 -269617
11014 -269617 -336215 -282658 -140952 -32185 -16503 -18458 -102302 -13769 -3457 -86389 -26649
11003 -26649 -2238 -160798 -120667 22789 34769 67353 43992 22633 101866 103903 44695
10992 44695 -111743 5666 191296 102147 26593 -130224 -203863 -184873 -200899 -63949 110039
10981 110039 67902 -11363 18735 16179 113197 189023 187398 140337 130506 81946 -27019 -66826
10969 -66826 -4541 23620 -58090 -192642 -182814 -301127 -274375 -155069 -157270 -129761 -140159
10958 -140159 -181574 -128957 -48288 -68505 -14254 46334 -1740 2654 13791 -1103 -12168 -32227
10946 -32227 26241 -24172 -60385 -47556 -39466 102175 69208 130236 -22229 -197650 -263829
10935 -263829 -183979 -96433 -97338 -117179 -23375 48711 15350 47695 52142 -11983 8016 36553
10923 36553 115034 109925 77489 70593 167320 260878 164365 84651 64217 -789 33092 -36239
10911 -36239 -116721 -72774 -41604 -57390 -133093 -155930 -54036 -23481 29283 1188 -66379
10900 -66379 5946 -84186 -110964 -60675 -13504 -80317 -155594 -224347 -152378 75174 -10436
10889 -10436 -62626 -7923 44437 171849 90874 -3219 -100147 -108273 -66871 -120588 -229579
10878 -229579 -97694 -19829 -74394 -32950 100071 41998 -113273 -77825 -6901 9283 -38224
10867 -38224 -174650 -207883 -69699 38817 -1725 -137033 -164347 -131428 -143629 -199281 -273175
10856 -273175 -277391 -277145 -209013 -22501 -8534 30154 98799 84907 123170 97362 44867 -58491
10844 -58491 -88204 -37681 56582 203583 233057 63057 32136 104347 -44170 -170530 -68973
10833 -68973 22788 47563 -38196 -152416 -235835 -190980 -83257 -79909 -77330 25862 -115724
10822 -115724 -183846 16261 -622 7235 52695 24701 17857 101626 72684 15985 -92679
10811 -92679 -64749 -11095 -77701 -8633 -84790 -199788 -241212 -102024 19508 -114775 -183315
10800 -183315 -75635 -74603 -48472 102171 93359 18733 -11836 -102858 -122895 -111869 -229241
10789 -229241 -249084 -142349 -128008 -192677 -48961 118577 101790 124881 205297 50931 28122
10778 28122 118489 139081 106375 188626 164274 95868 51000 140230 203655 141709 71143 -14815
10766 -14815 -59059 -60770 -142749 -146481 -150040 -126003 -150327 -176964 -133514 -39073 -48586 -65972
10754 -65972 -64307 -81012 -73546 27449 182240 235877 218589 76500 -88148 -83004 -123114
10743 -123114 -47570 5908 -128020 -21331 60271 45601 -23511 -146267 -163692 -35574 87991
10732 87991 73632 8610 35388 156287 12538 17321 44031 2697 -43915 -44590 -61602 -72596
10720 -72596 -128242 -47811 121193 138106 185218 110402 121260 231905 148941 14605 -34093
10709 -34093 -92236 -22324 -154275 -172606 -23588 107902 101704 -48752 13198 88282 22787
10698 22787 141900 112784 49019 -19581 -52039 -51420 32387 20531 -25758 -67626 4851 -113512
10686 -113512 -165406 -140938 -77034 22757 19753 -99380 -104650 -24462 53683 73190 15639 -51637
10674 -51637 59560 154793 137448 60481 535 -7301 -89285 -39977 -19176 -8431 -116570
10663 -116570 -128746 -56896 -64821 20381 134879 20413 -20211 -124770 -237011 -120811 -27540
10652 -27540 -79627 -96837 -78735 -59521 -40376 43375 36011 10946 -8864 33511 -3042 -65194
10640 -65194 -12471 70451 -5432 -32170 27602 19251 24898 9800 -17947 3416 -80754 -185681
10628 -185681 -210223 -172710 -18219 -24072 -40466 -18563 -620 -81180 -17954 -6955 36828
10617 36828 147716 38846 -94040 -101521 -156409 -175635 -281585 -235695 -44294 96018 -14631
10606 -14631 -89726 -186321 -140652 -50523 -33777 -84058 16855 59334 35261 147249 124870
10595 124870 98722 79010 41633 15885 -64352 -131658 -115582 28364 -26667 -9508 119788
10584 119788 103659 95534 73972 99931 43807 -32069 -27864 -55078 49243 182139 139197
10573 139197 66942 149719 275492 288386 332683 274362 268159 129824 70223 66322 65796 -125327
10561 -125327 -93300 119044 158083 219115 159898 58575 739 -93511 -178041 -149952 -68904
10550 -68904 30462 152782 99084 92348 -79473 -287694 -231469 -142761 -78329 7311 1855
10539 1855 59633 14431 -653 -73315 -131309 -113953 -88801 -25808 11035 32862 15609 -111499
10527 -111499 -211737 -224069 -224891 -186059 -186307 -139437 -31773 -62146 -126178 -184081 -136276 -54305
10515 -54305 -52652 -97007 -78658 -61841 -60225 34364 81840 78124 3307 20435 -1901 -88106
10503 -88106 -73323 -25320 9083 48040 -38193 -169200 -144152 -99627 -98763 -168804 -171890 -43237
10491 -43237 -19243 5108 30498 49170 -21709 -15294 6772 23317 62056 77604 -11343 101003
10479 101003 112535 -6450 -104727 -114876 -17447 64571 -38163 -80719 17303 97709 120000
10468 120000 26063 -54540 -123682 -234991 -141078 -5715 77498 25147 -51563 -59772 20715
10457 20715 115954 78116 210249 244621 271744 157433 117532 177857 266642 278651 165628
10446 165628 -1680 4020 -19233 -10592 25262 71951 38762 26029 -82568 -183260 -202446
10435 -202446 -160847 -108080 -136802 -203344 -142320 -91665 -66269 -108619 -14054 29677 67823
10424 67823 14830 -26875 -103587 -161798 -138840 -46273 15798 -84981 -108215 -158980 -109230
10413 -109230 -94494 -215762 -322697 -317520 -105509 2880 101864 164227 119091 60163 -45188
10402 -45188 -9725 77884 97209 -17596 -53284 -86746 -122101 45179 98948 76344 112140
10391 112140 192519 113916 -36668 -13538 202304 193190 50513 39217 -18607 -21919 -15855
10380 -15855 24555 149037 173940 257529 171202 -10290 -189386 -221009 -92884 46382 44072
10369 44072 15391 315607 337690 279801 128058 70545 109378 284686 314636 250900 148957
10358 148957 100701 -62786 -118906 -33715 62043 -57366 -170124 -22735 51622 83913 121380
10347 121380 83677 125831 162301 103967 93922 135626 32534 -15788 39830 190338 238597
10336 238597 292890 175228 165068 215615 127630 50330 53338 -25048 -71604 -107208 -180662
10325 -180662 -230245 -136844 -73479 -55800 -24551 60176 -16018 -40632 -76649 -54669 -75562
10314 -75562 -72482 -97865 -57737 -71489 -51625 34084 45964 -27564 -137840 -85857 -119972 -126899
10302 -126899 -9382 -9702 -154506 -170538 -18749 -6065 -49741 -184906 -181885 -150480 -72882
10291 -72882 63603 -16062 -154037 7085 167944 194031 127432 164452 194705 118051 21289
10280 21289 -124201 -249245 -172621 -106219 -140056 -143056 -125541 -151227 -223884 -154533 -32895
10269 -32895 -107728 -180625 -204060 -247434 -93509 27526 121296 73281 109093 153742 151979
10258 151979 122372 -54026 -97243 -105540 -95942 -963 -27685 -101560 -92897 -92800 -28310 92500
10246 92500 68773 117617 124413 41874 -58029 -21680 12734 7443 73900 57480 113959 89723
10234 89723 -6719 -6588 -38694 -79343 -195970 -100515 90496 31330 34414 -31975 -98351 -103327
10222 -103327 33955 20917 18918 -15063 81196 102581 78505 34382 -51984 -5052 -78416
10211 -78416 -223523 -150876 -132758 -135993 -139865 -139714 -122779 -19825 107104 135362 106263 26282
10199 26282 -56450 33825 32617 6873 -43332 -61192 -52323 -75942 -92191 -169158 -250540 -246731
10187 -246731 -106837 -108845 -12435 45974 -21311 -62602 -90753 2171 -10310 -113628 -114573 -1779
10175 -1779 118405 118350 16143 -59694 -119200 -110973 -9626 -17653 -78470 -129781 -238251 -165082
10163 -165082 -165857 -148398 -94570 -79963 -98901 -142286 -78592 -47354 -51591 -45030 -59252 -58953 -122649
10150 -122649 -131901 -74656 -145622 -239585 -324291 -232140 -168992 -86070 -20453 27438 13195 -13722
10138 -13722 -4039 21591 -11756 -86231 -102719 -125469 -202378 -315805 -321145 -292821 -56865 156440
10126 156440 86952 -257 52027 131506 114419 143877 101410 6623 -112011 -222150 -128036
10115 -128036 -155033 -108173 27164 -70459 -77364 -121395 -134051 -69108 -125009 -93391 -19143
10104 -19143 -122114 -162409 -27137 -3929 -37213 -57769 -177035 -233472 -259132 -151402 -67476
10093 -67476 -2445 -24614 -71893 -126010 -111487 -105382 -114876 -67165 -12937 -73259 -79708 -66348
10081 -66348 -114605 -104757 -93512 -55107 4480 -83346 -105727 -50605 -35287 -105531 -172484 -100556
10069 -100556 -39080 112117 94156 12066 28828 3154 19976 134335 138707 -19089 -3915
10058 -3915 81727 72473 9913 18328 54154 17152 -42189 -197315 -170750 -195750 -138361 -197197
10046 -197197 -92786 14949 -6596 -52063 -75651 -110368 -30670 -55956 -185316 -158306 -42540
10035 -42540 -29096 44147 14120 -107621 -34812 -90237 62714 88196 14263 -46972 -122171
10024 -122171 -167518 -128377 -154902 -33709 22408 -30214 -159831 -180800 -127697 -89407 9261
10013 9261 54261 23029 85895 187534 200782 236778 151942 -4240 -55478 -84446 -86259 -78303
10001 -78303 -43144 45229 35131 -152509 -172670 -50602 -431 -1555 34466 -64259 -35931
9990 -35931 55390 62653 45744 -79649 -185153 -195760 -117903 -61894 -115070 -183625 -129832 -19738
9978 -19738 145852 333874 308471 155270 112099 55866 14835 37815 122583 90723 4770
9967 4770 23721 -71273 -60870 23572 83707 21014 67799 88799 58113 51787 101005 201807
9955 201807 215252 169839 179098 216103 101982 32435 5672 6728 73131 88580 202737 119501
9943 119501 55557 -125001 -289067 -267819 -206993 61562 101610 143804 174938 114855 36957
9932 36957 -45827 82977 107249 -1160 -41136 -55707 -67162 49220 227218 258627 271651
9921 271651 260355 281638 273489 195679 59968 -8981 88768 128677 99831 96225 122225 183657
9909 183657 151129 64242 -47010 -70843 -37246 -12560 76569 77185 -65560 -49181 97455
9898 97455 127966 201546 219310 219300 92087 -32148 -31473 -1326 -45974 -82620 -34629 -21703
9886 -21703 -69503 -88688 -124532 -18277 98817 194314 232711 218570 151344 20895 1709
9875 1709 74993 139263 209538 263031 96762 100152 158836 267564 313613 329088 364343 317110
9863 317110 415820 595287 846598 1036197 1282960 1685736 2455141 3756691 6177296 9742277
9853 9742277 13293037 14832394 13454707 10190725 6750906 4198177 2711782 1837820
9845 1837820 1233725 817197 624176 484169 412537 334150 235900 177194 186274 122283 13324
9834 13324 26746 110890 197273 201771 219278 282676 267300 293987 368257 267641 105718 17362
9822 17362 19188 45989 -22859 -50103 -12798 -56787 -92305 19073 92894 179995 196853 169342
9810 169342 144965 53744 -82215 -49459 -38443 -85036 -45422 14124 32826 23784 50209 19700
9798 19700 18173 14220 -75753 -91508 -71946 -48432 -62556 -10491 108852 63982 96260 58346
9786 58346 21934 43617 -19650 -81891 -155658 -162119 -64538 12512 23658 39178 108318 10030
9774 10030 -141784 -145011 -74396 -163077 -210114 -27583 51728 -54821 -70028 17617 -75837
9763 -75837 -36153 60426 75914 133751 125020 -29683 -58708 -77788 -164009 -124166 -45381 -57833
9751 -57833 -44157 -87649 -76960 -71760 -130145 -122739 -93203 -75389 -72553 -124953 -77300 -83290 -151937
9738 -151937 -155568 -120092 -89920 -8583 61605 -63053 -112140 -82576 -88445 32055 -6598 -39226
9726 -39226 -28867 8515 28505 -78220 4433 98942 143507 114465 97322 103378 119286 203567
9714 203567 118845 16731 94258 20255 11804 20776 39144 -96314 -163394 -176313 -112899 -1962
9702 -1962 72921 -22491 22938 74540 168785 201000 218350 170426 143042 169263 195951 107790
9690 107790 59747 44790 -5887 6811 -39010 -93651 -29944 12767 -112799 -238680 -217439
9679 -217439 -190643 -84206 -32560 9934 32212 30041 94437 126556 48929 -41529 30804 145600
9667 145600 161046 116899 -46505 -80285 -142119 -171913 -219024 -144716 -127631 -13076 27076
9656 27076 -16328 8126 -104484 -171960 -243098 -163503 123933 227208 141242 29469 -4143
9645 -4143 -73266 -9958 -111641 -76373 -50273 -81065 -166848 -95142 -30645 31782 72589 25551
9633 25551 -22299 -29132 -80203 -95767 -64214 31635 28600 44406 112504 100500 206836 190343
9621 190343 155809 159697 39750 30887 54774 100711 119293 -29688 -42758 -96866 -71615 29904
9609 29904 234607 207710 82411 -15639 -139998 -107052 -225114 -121528 -2963 98499
9599 98499 127346 61838 25750 42894 56405 58625 66499 7782 -73239 -95303 -99823 -124353
9587 -124353 -135137 15990 -9084 -106091 -195182 -96601 -63008 162196 232681 159958 58074
9576 58074 87740 74603 4319 -80617 -126517 -229759 -182251 -134677 -90832 41426 25113
9565 25113 3828 40144 74595 111364 61452 -49321 -91495 -127356 -166102 -167511 -74103 -82493
9553 -82493 -10652 24549 -15609 -24196 72730 119749 220244 301585 271042 175444 128653 58438
9541 58438 -47995 -22836 51683 -100309 -69198 8072 -63876 -160568 -109896 29282 54722
9530 54722 38862 49248 13273 -30229 20856 141202 86935 73818 136917 246631 237301 132974
9518 132974 233021 254266 94079 -13360 77364 -28389 -193807 -156475 -128738 -8079
9508 -8079 27101 -2975 -102483 -68677 -55443 -90509 -102009 -104115 31769 156938 243687 105675
9496 105675 80041 21305 2940 17846 -7945 -59478 -64783 44316 124075 31025 -60422 -66211
9484 -66211 48506 34138 104466 104796 -39910 -54418 -119306 -100266 -109897 -11276 7144 -8482
9472 -8482 117480 181389 183874 23915 -95423 9512 5663 -46388 -102208 -143782 -77862 -4402
9460 -4402 47894 81398 112842 84512 -8926 -93628 -88470 -85324 -71030 -70920 -31303 16657 -119827
9447 -119827 -242496 -99811 8661 -925 -61020 -3378 -50243 21901 97404 162306 276617
9436 276617 230424 90599 -79048 -86215 -122578 -142905 -167322 -145014 -154387 -120682 32038
9425 32038 176641 166623 99899 26085 -36485 178298 92712 75699 156400 271870 206082
9414 206082 121951 126928 69916 9064 -81945 -19773 74863 55429 50037 80983 30169 -132814
9402 -132814 -193641 -249173 -158360 -47577 52191 37263 26067 22895 -34803 -122730 -4421
9391 -4421 48476 -59920 -72611 14319 26848 -22241 9926 -6481 52690 146767 160298 198436
9379 198436 92480 37680 109881 167718 108622 183079 134514 97529 15452 51603 135117
9368 135117 197655 229094 167526 45692 12295 49476 15701 48893 48335 -10763 -23525 -97155
9356 -97155 -10310 91717 50702 122074 34935 116486 249429 323477 365765 351157 296239
9345 296239 235383 130761 79904 216016 307879 234204 148340 183615 193820 130140 72076
9334 72076 63286 63940 150529 174002 163990 76787 96745 263694 229878 82570 -1268 12997
9322 12997 -34824 -70121 76939 68081 141849 179195 204364 60475 17978 -19438 -112310 -165276
9310 -165276 -50472 3509 -114342 -103651 -105680 -103166 3869 -17285 11221 -80371 -240618
9299 -240618 -205966 -87531 -173834 -153102 -124131 -131641 -68697 -47329 -230622 -256142 -230964
9288 -230964 29521 120462 75110 -10640 -55523 27231 81728 154496 109895 80911 -20278
9277 -20278 -90261 -82898 -52867 -74023 55389 213965 65213 78175 202014 131965 16730
9266 16730 7945 28716 45489 175282 174041 168825 197365 133286 121224 97356 42338 -6581
9254 -6581 -103990 -54004 21118 18192 7995 22178 -17464 56924 20208 -30434 41095 -14752
9242 -14752 -52111 -45724 -35614 -110514 -64953 -132643 -186 70099 17644 -54652 -73992 -79102
9230 -79102 -15370 90374 79536 81022 159785 77855 98744 105666 129364 229343 191371 203905
9218 203905 48906 8661 55752 148805 36932 25712 91731 88672 67489 59916 42615 71385
9206 71385 -8644 -1245 -57143 -68165 -134079 -108222 -167041 -201856 -130935 -31708 23313 86690
9194 86690 37160 20697 -59931 -60124 -102010 1562 -2952 -47685 -70054 -128348 -116861 77957
9182 77957 239053 226718 291066 136946 86386 10568 -85392 -2022 -3990 -56805 -102552 49119
9170 49119 167649 201723 168033 104392 41440 33211 76806 175509 168121 -1355 -88235 -83719
9158 -83719 -80043 -119679 -121165 120604 274266 318269 236409 178502 142225 66448 106901 101224
9146 101224 146226 242030 198692 192444 96594 -3840 -106963 -86031 -11308 -92215 -80156
9135 -80156 -89126 54979 100875 4931 -17471 57744 64692 47939 64409 74288 91970 223838
9123 223838 234566 221198 235031 206804 263964 407319 558571 635712 663695 649947 502459
9112 502459 552464 733691 781181 838089 1035062 1148789 1395432 1578854 1924246 2455225
9102 2455225 2992895 3868802 5188873 7236477 10678497 17204726 29149377 44313502
9094 44313502 53301586 50577407 38863700 25356404 15733118 10271806 7204436 5363053
9086 5363053 4137870 3329670 2838541 2510134 2309288 2010221 1894251 1668001 1475391
9077 1475391 1312414 1127331 1000561 839279 846419 835770 756456 685781 594154 558297 600244
9066 600244 625392 514361 514638 541769 529850 358746 275413 231363 135183 71475 274709
9055 274709 407766 379612 260916 273480 286136 209618 173820 51122 -33565 218575 257917
9044 257917 134799 215952 223391 252466 172746 75911 8766 8854 5287 36875 -3684 -33881
9032 -33881 -52327 19194 -60350 -61079 -74582 -74737 -82363 -63063 -10058 46459 77026 42784 100061
9019 100061 179982 133364 60302 9733 60418 96439 280320 284394 276510 133744 -231
9008 -231 -112060 -124785 -149131 -105307 -45717 -48367 -85429 -81961 -26237 16535 5152 3877 -116180
8995 -116180 -96409 -3297 -19640 -26643 -45516 -108703 -3357 53275 83740 115659 -7706
8984 -7706 -70868 14832 48900 84788 17066 689 -66534 -40196 82888 -98473 -236527
8973 -236527 -41553 152957 206775 272269 186869 79398 -4919 -8910 -9289 -4520 -32571 -15906
8961 -15906 34266 -15583 22140 75149 49299 49139 43400 -20768 -15427 29026 -139463 -119983
8949 -119983 -84881 -55675 -12186 -46888 -122438 -103117 -72825 -28078 64473 17176 39073 139750
8937 139750 135185 141014 71913 -55026 -50617 12887 90099 -25851 -135666 -109665 -91015 -83701
8925 -83701 -12406 -32421 -1601 11554 -39154 -66014 -174058 -201276 -199100 -117419 -15851 2065
8913 2065 17909 103727 71068 28990 -26873 87823 184904 144024 72765 101845 90263 61131
8901 61131 48061 -29845 -152195 -17782 26707 15904 12153 31449 -2475 -47511 -29117 -55888
8889 -55888 25259 21301 2266 14329 83486 99664 128768 82371 85668 67039 65192 -20446
8877 -20446 -34465 -30892 1394 77834 158019 95892 7982 12451 45713 74180 78254 189452
8865 189452 197575 200593 86600 -20665 12382 -6886 85590 103131 191682 293383 387452
8854 387452 253690 128929 -16959 -161857 -79269 -94757 5907 128561 74219 8416
8844 8416 -191894 -221864 -172257 -48230 -1224 -29045 49356 3861 -220954 -190618 -78390
8833 -78390 207568 266178 152049 243068 271165 151926 29175 -41116 -62664 -6918 -103346
8822 -103346 -170629 -162659 -114261 -25707 -8050 7992 26069 1410 -52645 -86856 -84448 -52101
8810 -52101 -24279 -113580 -176015 -70239 -109399 -64970 -29458 -45946 -76819 8818 11403 -28641
8798 -28641 -107771 -101899 -121904 11179 116583 74792 74048 92558 83897 96843 64360 -42537
8786 -42537 -183982 -202039 -241193 -137035 51465 51682 6444 21270 16390 -13083 -18503 34800
8774 34800 -7647 -81150 86494 83531 95010 90414 120365 176174 84576 -68973 -140005 -107018
8762 -107018 9633 20552 104034 160769 224161 276803 183855 164278 83470 32138 73481
8751 73481 166779 269702 222060 58832 -35105 28924 160098 155088 13508 67889 80989
8740 80989 127041 132829 45154 112248 92984 -1065 55690 162628 195905 153098 195224 238480
8728 238480 196152 204769 134082 89945 -14047 25656 -6556 51561 48021 -61787 -42970 -43804
8716 -43804 -146817 -128358 -18197 29689 27455 -32376 -49288 40978 41430 63381 83037 46365
8704 46365 97329 173 -62596 -114237 -167032 -184359 -75186 99467 121603 60224 30224
8693 30224 18373 61432 -17128 -59664 6282 -5117 127193 68247 84202 146258 131116 142731
8681 142731 242245 196170 38999 12537 93096 58927 29868 136398 108255 50884 147937
8670 147937 243501 206080 35995 7195 32196 -21304 -114069 -52078 52859 39229 68879
8659 68879 137797 262274 318687 341886 461334 578806 792147 1312973 2140658 3219805
8649 3219805 3961728 3773543 2924677 2187879 1419253 799357 480120 294673 224792 265342
8639 265342 497769 530946 464415 463086 401700 310223 241455 122206 88399 11780 22583
8628 22583 181974 252592 218045 164135 31735 134596 121590 19651 10660 56817 167446
8617 167446 396854 433374 454677 440079 440598 580268 761535 933620 1179493 1561836 2209010
8606 2209010 3527696 5723972 7425083 7522452 6047507 4020899 2566773 1729717 1221498
8597 1221498 953221 805566 791782 700094 710431 705407 620103 559652 555870 533792 426500
8586 426500 434940 321753 138472 52481 71137 38985 137604 161094 96586 99002 159775 131960
8574 131960 152021 184586 261181 189771 176471 153872 150918 171645 245236 214743 411619 717906
8562 717906 1013247 1562079 2578074 3504737 3817398 3379050 2385455 1423327 816772 488244
8552 488244 339966 310612 257715 294352 313057 305590 94747 76075 109268 93006 114918
8541 114918 111315 157837 283482 186490 47999 6186 103306 239042 267611 260655 121462
8530 121462 19003 74623 102518 87387 129590 294559 406949 290839 123403 59554 129299
8519 129299 88230 91019 86321 24787 -55196 -23505 -69431 -2041 65555 65652 109145 98624 75641
8506 75641 101288 93692 179828 145524 25058 -28454 96662 173296 185768 98223 72462 36042
8494 36042 59440 125457 190333 97640 -15609 -119128 -128498 27390 13562 -22286 25325
8483 25325 -33084 -40254 10234 -57146 -185906 -127708 16753 114932 -36010 -12793 18568
8472 18568 58090 74319 103358 72355 48687 -43859 -73060 81530 104369 76371 91414 9495
8460 9495 66326 44084 17063 46791 8168 -13151 -104185 -82529 -32321 2859 60960 223801
8448 223801 310484 213949 42354 -149613 -190262 -175329 -101879 24121 91362 -48122 -218860
8437 -218860 -111533 91966 181850 210536 169183 -57482 -145866 -103886 13565 73028 -57276
8426 -57276 -113782 -219484 -189610 -84144 -30394 -48995 -111825 -160890 -189828 -226964 -60658
8415 -60658 -28653 -86644 -18176 -21203 862 50730 130108 134583 80406 -17827 43097 123580
8403 123580 107131 -52629 -94556 -44326 41176 85549 40668 51410 52570 157835 125196
8392 125196 -1820 -59786 -106967 -101544 -106680 -71812 -5489 23743 -133750 -172865 -127091 -48856
8380 -48856 -33908 20767 23113 81890 143473 78643 160983 264215 288645 233363 173615 106639
8368 106639 -32852 -113862 -87934 -6905 50434 111059 38079 -70730 -77430 29586 20338
8357 20338 -115847 -171299 -89295 -184598 -162168 -111611 -56250 -51750 -3043 33304 71942 192992
8345 192992 162556 -36920 -22950 16739 -14661 -72627 -69885 30597 169121 213037 -8280
8334 -8280 -142583 11895 -10325 8948 135609 24303 98336 103681 9549 -7 -138138
8323 -138138 -153168 -110245 -75321 -104046 -131727 -170173 -89273 -144677 -245998 -278228 -138181
8312 -138181 -26648 44044 22778 -111633 -121834 -155207 -163902 -98941 -124344 -178508 -143626
8301 -143626 -160810 -124002 -178560 -276450 -225447 -255554 -217283 -194855 -205075 -80632 -92323
8290 -92323 -103661 -62076 -10507 -29855 -112194 -167651 -138784 5124 73165 178429 169413 144727
8278 144727 166874 80822 13350 -75542 -104264 -99407 22964 134486 147397 176805 84432
8267 84432 -5420 -49981 -2726 82265 -97712 -76044 -23818 91047 101403 42204 -57456
8256 -57456 -85284 -58157 -28373 79293 183618 199974 143185 79323 -36536 -89979 -6294
8245 -6294 -2164 4620 99946 233250 262151 236060 103569 -71025 -195024 -126154 -40412 13322
8233 13322 -22583 16048 -53600 -68363 36499 151438 46318 67859 104200 82183 62639
8222 62639 204162 198651 97670 70783 28968 138363 151327 121776 111283 111750 10166 -115197
8210 -115197 24996 141885 91950 17488 6601 -57544 -43374 -31407 11757 -24870 101229
8199 101229 204498 162731 136819 192130 208712 32476 10651 36705 55508 36226 -17708
8188 -17708 -40887 -51832 -23302 7911 36082 163703 274616 230444 203267 65063 66352
8177 66352 59655 -8627 -16809 -82395 -77525 -103033 -44976 -175017 -184155 -138829 -115557 -142718
8165 -142718 -106357 113168 89353 23483 133310 113146 -12536 -3035 85114 110026 101769
8154 101769 165269 147815 69542 -54534 -67642 42990 160 -95307 -127106 -104294 63336
8143 63336 20524 -48368 19404 115972 79415 -65489 -125659 -120408 -95221 48602 70881 -34509
8131 -34509 4445 -1139 -35490 -17408 -35015 -96667 -60416 3637 -58677 -219954 -179613 -121287
8119 -121287 -122214 -129167 -112155 -153696 -41696 102299 14942 -148466 -232073 -163821 -63160
8108 -63160 92341 40909 60106 -9873 -177994 -164961 -52189 -86844 -196051 -105102 -39292
8097 -39292 -168094 -107431 -103767 -4797 -130248 -125488 -111829 -155631 -157748 -182940 -138954 -11075
8085 -11075 73260 85902 185943 228306 54289 -197572 -233844 -148945 -104616 -74771 -48645
8074 -48645 -9792 124297 88288 45220 -65468 -103518 -53937 -30060 56969 89824 36847
8063 36847 25515 -47913 842 64893 -2411 -94762 -82908 -42736 -31142 29978 157861 167662
8051 167662 1972 -55001 -177562 -159491 -162064 -127227 -41051 65660 119910 140568 106170
8040 106170 48173 20789 -26657 -11999 -93081 -76991 -38843 -10225 -102245 -119345 -61852 40744
8028 40744 140722 157636 155050 19040 -47557 -67913 5672 -92791 -139930 -168610 -64651 -48147
8016 -48147 -118780 16188 13559 -111515 -139750 -211397 -246316 -169821 -155662 -189443 -96608 47191
8004 47191 144204 216861 196632 176785 145458 143064 201358 178450 184377 186043 161559 121616
7992 121616 110655 207381 141148 59269 107865 96648 28117 143000 260581 303231 225455
7981 225455 130087 -57643 -93289 14426 -29334 16724 68344 139975 163696 74213 -405
7970 -405 53490 94037 135952 133566 91972 -36741 -37743 27377 97450 43632 55772 -43987
7958 -43987 -38917 15564 -32933 -10064 47076 34437 -18148 -55512 -131001 -189479 -144880 -84002
7946 -84002 -69641 -124371 -41975 35356 45567 91288 66807 66315 122528 109882 -101876 -126872
7934 -126872 -59872 -25675 -48144 56750 -8159 -147617 -159170 -79852 -38572 -28877 -17992
7923 -17992 -8071 -146356 -176466 -36325 110766 104370 -15616 -100650 -146379 -149599 -102022 -138999
7911 -138999 -39419 -31589 3738 3398 139543 159033 97729 -17678 -27222 -79222 -5552 87472
7899 87472 59305 -25181 48476 -6641 43800 188070 188302 57780 -27087 -70686 -34627 -59310
7887 -59310 -78973 52896 169359 144810 68415 18975 79522 61983 -36857 7564 29472
7876 29472 -111133 -68647 9722 25029 -9990 -15969 -110364 -136883 -112563 -55150 -17594 -77258
7864 -77258 -71185 13759 -21687 63706 83946 -12889 -66056 -83865 -79869 -20214 49276 199336
7852 199336 267659 188709 115704 52318 -34192 -117152 -112298 -102508 -111971 -35136 -3124 80069
7840 80069 199717 82725 -13723 -71263 -54522 66198 92502 94289 73834 100717 90742 137030
7828 137030 131951 -35483 -138838 -183894 -212563 -92278 34472 105933 55616 83277 170825
7817 170825 115896 119586 193988 227318 38372 45111 -8921 -9493 -4187 -94415 -94040 44685 10007
7804 10007 -113080 -86610 -70344 -33721 102774 204497 208451 248956 127426 2193 -63374
7793 -63374 -11097 -67894 -169800 -158608 -124738 -147381 -21595 -50061 -93421 -138543 -297817
7782 -297817 -254281 -160584 -27206 61766 -27765 -27349 19765 59326 -4857 -19755 137557 232532
7770 232532 186483 60887 20049 -6606 45649 69674 55396 68280 95987 101048 147638 91665
7758 91665 125801 249319 325901 180302 11781 28237 4114 -34668 -49418 10098 -3692
7747 -3692 -76115 -110285 -151254 -115824 -135135 -265713 -219909 -46074 12102 51086 66426 27666
$$ [...]
##END NTUPLES=NMR SPECTRUM
##END=
