##TITLE=Analysis number 318469
Compound Code km 07851
Project Code adrs
Chemist Name endeavour
##JCAMPDX= 6.0         $$ Bruker NMR JCAMP-DX V2.0
##DATA TYPE= NMR SPECTRUM
##DATA CLASS= NTUPLES
##ORIGIN= Bruker BioSpin GmbH
##OWNER= nmr
$$ XWIN-NMR		Version 3.5
$$ Wed Mar 29 15:52:50 2006 GMT Daylight Time (UT+1h)  MAYBRIDGE\nmr@NMR_250MHZ
##.OBSERVE FREQUENCY= 250.131544655141
##.OBSERVE NUCLEUS= ^1H
##.ACQUISITION MODE= SIMULTANEOUS (DQD)
##.ACQUISITION SCHEME= undefined
##.AVERAGES= 16
##.DIGITISER RES= 18
##SPECTROMETER/DATA SYSTEM= dpx250
##.PULSE SEQUENCE= zg30
##.SOLVENT NAME= CDCl3
##.SHIFT REFERENCE= (INTERNAL, CDCl3, 0, 16.522)
##AUDIT TRAIL= $$ (NUMBER, WHEN, WHO, WHERE, WHAT)
$$ ##TITLE= Audit trail, XWIN-NMR		Version 3.5
$$ ##JCAMPDX= 5.01
$$ ##ORIGIN= Bruker BioSpin GmbH
$$ ##OWNER= nmr
$$ C:\u/data/dgb/nmr/ADRS/1770/pdata/1/auditp.txt
$$ ##AUDIT TRAIL=  $$ (NUMBER, WHEN, WHO, WHERE, WHAT)
(   1,<2006-03-29 15:52:15.39 +100>,<MAYBRIDGE\nmr>,<NMR_250MHZ>,
      <created by zg, POWCHK disabled, PULCHK disabled
       configuration hash MD5:
       84 BC 41 DB A1 6E 1D 46 DA 25 12 A5 C1 ED C5 3A
       data hash MD5: 64K
       04 F9 09 AD E6 49 56 C3 75 D4 76 03 F1 C8 2E 58>)
(   2,<2006-03-29 15:52:38.03 +100>,<MAYBRIDGE\nmr>,<NMR_250MHZ>,
      <Start of raw data processing
       ef LB = 0.3 FT_mod = 6 PKNL = 1 SI = 32K 
       data hash MD5: 32K
       0A 29 EC B4 AC C1 A6 64 09 F9 B0 EB E0 6D 11 94>)
(   3,<2006-03-29 15:52:41.22 +100>,<MAYBRIDGE\nmr>,<NMR_250MHZ>,
      <apk 
       data hash MD5: 32K
       B3 09 56 AA 9A 04 FD 5D E8 2E 0E 0B 59 55 BD BC>)
(   4,<2006-03-29 15:52:42.06 +100>,<MAYBRIDGE\nmr>,<NMR_250MHZ>,
      <abs ABSG = 5 
       data hash MD5: 32K
       E9 48 A5 4D D1 D6 F5 B5 E8 BD CC 22 C8 98 E5 F2>)
$$ ##END=
$$ 
$$ hash MD5
$$ BE 8F 0A 0F 37 9D AB 41 43 F8 B4 61 46 2F DC B3
##$RELAX= 
##$RELAX= 
##$RELAX= 
##$RELAX= 
##$RELAX= 
##$RELAX= 
##$RELAX= 
$$ Bruker specific parameters
$$ --------------------------
##$DU= <C:\u>
##$EXPNO= 1770
##$NAME= <ADRS>
##$PROCNO= 1
##$TYPE= <nmr>
##$USER= <dgb>
##$AMP= (0..31)
100 100 100 100 100 100 100 100 100 100 100 100 100 100 100 100 100 100 
100 100 100 100 100 100 100 100 100 100 100 100 100 100 
##$AQSEQ= 0
##$AQ_mod= 3
##$AUNM= <au_zg>
##$AUTOPOS= <48 >
##$BF1= 250.13
##$BF2= 250.13
##$BF3= 250.13
##$BF4= 250.13
##$BF5= 500.13
##$BF6= 500.13
##$BF7= 500.13
##$BF8= 500.13
##$BYTORDA= 1
##$CFDGTYP= 0
##$CFRGTYP= 5
##$CHEMSTR= <none>
##$CNST= (0..31)
1 1 145 1 1 1 1 1 1 1 1 1 1 1 1 1 1 1 1 1 1 1 1 1 1 1 1 1 1 1 1 1 
##$CPDPRG= <>
##$CPDPRG1= <>
##$CPDPRG2= <>
##$CPDPRG3= <>
##$CPDPRG4= <mlev>
##$CPDPRG5= <mlev>
##$CPDPRG6= <mlev>
##$CPDPRG7= <mlev>
##$CPDPRG8= <mlev>
##$CPDPRGB= <>
##$CPDPRGT= <>
##$D= (0..31)
0 1 0 0 0 0 0 0 0 0.06 0 0 0 0 0 0 0.0002 0 0 0 0 0 0 0 0 0 0 0 0 0 0 
0 
##$DATE= 1143643933
##$DBL= (0..7)
120 120 120 120 120 120 120 120 
##$DBP= (0..7)
150 150 150 150 150 150 150 150 
##$DBP07= 0
##$DBPNAM0= <>
##$DBPNAM1= <>
##$DBPNAM2= <>
$$ [...]
##$SUBNAM7= <"">
##$SUBNAM8= <"">
##$SUBNAM9= <"">
##$SW= 20.6930455092707
##$SWIBOX= (0..15)
0 0 3 0 0 0 0 0 0 0 0 0 0 0 0 0 
##$SW_h= 5175.983436853
##$TD= 65536
##$TD0= 1
##$TE= 294.16
##$TE2= 300
##$TE3= 300
##$TEG= 300
##$TL= (0..7)
0 120 120 120 120 120 120 120 
##$TP= (0..7)
150 150 150 150 150 150 150 150 
##$TP07= 0
##$TPNAME0= <>
##$TPNAME1= <>
##$TPNAME2= <>
##$TPNAME3= <>
##$TPNAME4= <>
##$TPNAME5= <>
##$TPNAME6= <>
##$TPNAME7= <>
##$TPOAL= (0..7)
0.5 0.5 0.5 0.5 0.5 0.5 0.5 0.5 
##$TPOFFS= (0..7)
0 0 0 0 0 0 0 0 
##$TUNHIN= 0
##$TUNHOUT= 0
##$TUNXOUT= 0
##$USERA1= <user>
##$USERA2= <user>
##$USERA3= <user>
##$USERA4= <user>
##$USERA5= <user>
##$V9= 5
##$VALIST= <valist>
##$VCLIST= <CCCCCCCCCCCCCCC>
##$VD= 0
##$VDLIST= <DDDDDDDDDDDDDDD>
##$VPLIST= <PPPPPPPPPPPPPPP>
##$VTLIST= <TTTTTTTTTTTTTTT>
##$WBST= 1024
##$WBSW= 4
##$XGAIN= (0..3)
0 0 0 0 
##$XL= 0
##$YL= 0
##$YMAX_a= 432167
##$YMIN_a= -556609
##$ZGOPTNS= <>
##$ZL1= 120
##$ZL2= 120
##$ZL3= 120
##$ZL4= 120
##$ABSF1= 16.522
##$ABSF2= -4.171173
##$ABSG= 5
##$ABSL= 3
##$ALPHA= 0
##$AQORDER= 0
##$ASSFAC= 0
##$ASSFACI= 0
##$ASSFACX= 0
##$ASSWID= 0
##$AUNMP= <proc_1d>
##$AZFE= 0.1
##$AZFW= 0.1
##$BCFW= 0
##$BC_mod= 0
##$BYTORDP= 0
##$COROFFS= 0
##$CY= 12.5
##$DATMOD= 1
##$DC= 0
##$DFILT= <>
##$DTYPP= 0
##$F1P= 14.0000005364418
##$F2P= -0.99999901652339
##$FCOR= 0.5
##$FTSIZE= 32768
##$FT_mod= 6
##$GAMMA= 0
##$GB= 0
##$INTBC= 1
##$INTSCL= 1
##$ISEN= 128
##$LB= 0.3
##$LEV0= 0
##$LPBIN= 0
##$MAXI= 10000
##$MC2= 0
##$MEAN= 0
##$ME_mod= 0
##$MI= 0
##$NCOEF= 0
##$NC_proc= -4
##$NLEV= 6
##$NOISF1= 0
##$NOISF2= 0
##$NSP= 0
##$NTH_PI= 0
##$NZP= 0
##$OFFSET= 16.522
##$PC= 1
##$PHC0= -84.74049
##$PHC1= -9.600027
##$PH_mod= 1
##$PKNL= yes
##$PPARMOD= 0
##$PSCAL= 4
##$PSIGN= 0
##$REVERSE= no
##$SF= 250.13
##$SI= 32768
##$SIGF1= 0
##$SIGF2= 0
##$SINO= 400
##$SIOLD= 32768
##$SREGLST= <1H.CDCl3>
##$SSB= 0
##$STSI= 32768
##$STSR= 0
##$SW_p= 5175.98343685301
##$SYMM= 0
##$S_DEV= 0
##$TDeff= 65536
##$TDoff= 0
##$TI= <Analysis number 999999
Compound Code 99
Book Reference 9
Project Code 9>
##$TILT= no
##$TM1= 0
##$TM2= 0
##$TOPLEV= 0
##$USERP1= <user>
##$USERP2= <user>
##$USERP3= <user>
##$USERP4= <user>
##$USERP5= <user>
##$WDW= 1
##$XDIM= 32768
##$YMAX_p= 514028292
##$YMIN_p= -30729
$$ End of Bruker specific parameters
$$ ---------------------------------
##NTUPLES= NMR SPECTRUM
##VAR_NAME=  FREQUENCY,     SPECTRUM/REAL,   SPECTRUM/IMAG
##SYMBOL=    X,             R,               I
##VAR_TYPE=  INDEPENDENT,   DEPENDENT,       DEPENDENT
##VAR_FORM=  AFFN,          ASDF,            ASDF
##VAR_DIM=   32768,         32768,           32768
##UNITS=     HZ,            ARBITRARY UNITS, ARBITRARY UNITS
##FACTOR=    0.157963299565203, 1,           1
##FIRST=     4132.6476996994, 0,             0
##LAST=      -1043.33573715361, 0,           0
##MIN=       -1043.33573715361, -30729,      0
##MAX=       4132.6476996994, 514028292,     0
$$ Real data points
##PAGE= N=1
##DATA TABLE= (X++(R..R)), XYDATA
$$ [...]
15879E05k467j840K21L297o34k380J796J975K597L53m268j297K763j467O05M69
$$ 505 -1962 -3802 -3581 -284 -918 -3298 -1502 473 3070 3423 -845 -2142 621 -846 -241 228
15863B28j959j360K538K503k256P9O04j702L010J956k930j378J501Q65l489l236
$$ 228 -1731 -3091 -553 1950 -306 -227 377 -1325 1685 3641 711 -667 834 1699 -1790 -5026
15847e026O55P10Q29J383M605k602k086j646k416Q064L997j827p474q472m79K224
$$ -5026 -4371 -3661 -2832 -1449 3156 554 -1532 -3178 -5594 2470 6467 4640 -2834 -11306 -11785 -9561
15831i561L318M672N623j584q24L133O12k772j794J197j853J809M308J019J517
$$ -9561 -6243 -1571 4052 2468 1644 4777 5389 2617 823 2020 167 1976 6284 7303 8820
15816H820n536n85L632r11L284K900m488k293R95M915J517r19k891l119k294J367
$$ 8820 3284 2699 6331 5420 8704 11604 7116 4823 5818 10733 12250 11331 8440 5321 3027 4394
15800D394K908r432l798j200j527j539j509J288J104O5k66J432j451j242K71K440
$$ 4394 7302 -2130 -5928 -7128 -8655 -10194 -11703 -10415 -9311 -9246 -9512 -8080 -9531 -10773 -10502 -8062
15784h062K56l91R33j965j158j949k857N203O395k963j435K633n836o274K709
$$ -8062 -7806 -8197 -7264 -9229 -10387 -12336 -15193 -9990 -3595 -6558 -7993 -5360 -11196 -17470 -14761
15769a4761R282R87j187n49k715k94j506K872k644j402K631K287q60J631K220
$$ -14761 -5479 -4492 -5679 -6228 -8943 -9237 -10743 -7871 -10515 -11917 -9286 -6999 -7859 -6228 -4008
15754d008m49k576l35Q32l07N27R32m689j598R29J597K470J139J466k336l629
$$ -4008 -4457 -7033 -7368 -6536 -6843 -6316 -5384 -10073 -11671 -10742 -9145 -6675 -5536 -4070 -6406 -10035
15738a0035r37K695L983r61j091k87O57J324k794L766M260n872j144o92l889N67
$$ -10035 -10972 -8277 -4294 -5255 -6346 -6633 -5976 -4652 -7446 -3680 580 -5292 -6436 -7128 -11017 -10450
15722a0450K787k692q25m477J299O176M401L061n508p381Q94M647L457l481J079
$$ -10450 -7663 -10355 -11180 -15657 -14358 -8182 -3781 -720 -6228 -13609 -12715 -8068 -4611 -8092 -7013
15707g013J517k351K991J917j045P65L159N857l172n035k173l748j819o34K093
$$ -7013 -5496 -7847 -4856 -2939 -3984 -3219 -60 5797 2625 -2410 -4583 -8331 -10150 -10784 -8691
15692h691N007p14l687M922j764J194L282J756k488o603m593l38K127K972K323
$$ -8691 -3684 -4398 -8085 -3163 -4927 -3733 -451 1305 -1183 -7786 -12379 -12717 -10590 -7618 -5295
15677e295Q30k204J072m625n00l08p52Q56n35J310L582N195K351j445l745k561
$$ -5295 -4465 -6669 -5597 -10222 -10722 -11030 -11782 -10926 -11461 -10151 -6569 -1374 977 -468 -4213 -6774
15661f774q36j856j039q26K170r97M207L197J247r56L50J077L196q25n358m679
$$ -6774 -7610 -9466 -10505 -11331 -9161 -10158 -5951 -2754 -1507 -2463 -2113 -1036 2160 1335 -4023 -8702
15645h702O96j350J770K192l023R3j201j959J885n09J323N116p00k798K07K751
$$ -8702 -8006 -9356 -7586 -5394 -8417 -8324 -9525 -11484 -9599 -10108 -8785 -3669 -4369 -7167 -6960 -4209
15629d209K687j452q80k083j723L540K997n167n012j66J424R13L959J129J894
$$ -4209 -1522 -2974 -3854 -5937 -7660 -4120 -1123 -6290 -11302 -11468 -10044 -9131 -5172 -4043 -2149
15614b149K227J324M72m346l951K755K181p49n03M028J081k054k752l817l769
$$ -2149 78 1402 1874 -2472 -6423 -3668 -1487 -2236 -2739 1289 2370 316 -2436 -6253 -10022
15599a0022j993M008J388r41k694P64L23K604j058k40o52N340K618j038o165l614
$$ -10022 -12015 -8007 -6619 -7560 -10254 -9490 -9167 -6563 -7621 -7861 -8513 -3173 -555 -1593 -7758 -11372
15583a1372l01m74p06M7L508k490J427N245J55P0K77J403l273m238O266n45K329
$$ -11372 -11673 -12147 -12853 -12806 -9298 -11788 -10361 -5116 -4961 -4891 -4614 -3211 -6484 -10722 -4456 -5001 -2672
15566b672O98l50P44n39k53N120L349O8m484J10J443r05m911l228k547K056Q7
$$ -2672 -1974 -2324 -1580 -2119 -2372 2748 6097 6165 1681 1791 3234 2329 -2582 -5810 -8357 -6301 -6214
15549f214q29j326o415K133K204k72j149M205L395J402m200n074O204K912k886
$$ -6214 -7043 -8369 -14784 -12651 -10447 -10719 -11868 -7663 -4268 -2866 -7066 -12140 -5936 -3024 -5910
15534e910l224O909K977K41P61J916l737p343J032K699M758j449j842Q39k744
$$ -5910 -9134 -2225 752 993 1754 3670 -67 -7410 -6378 -3679 1079 -370 -2212 -1373 -4117
15519d117q77P283J744l204l788j488l280P87J871M074K333l252n364o442R65
$$ -4117 -4994 2289 4033 829 -2959 -4447 -7727 -6940 -5069 -995 1338 -1914 -7278 -13720 -12755
15504a2755M211k608J652J382L019n45L200J710l450j076l145J527l810o07M863
$$ -12755 -8544 -11152 -9500 -8118 -5099 -5644 -2444 -734 -4184 -5260 -8405 -6878 -10688 -11295 -6432
15489f432J212J731j720L423k443l124r09L51M202J827k011o165l550L009M978
$$ -6432 -5220 -3489 -5209 -1786 -4229 -7353 -8262 -7911 -3709 -1882 -3893 -10058 -13608 -10599 -5621
15474e621m60j500P05n76j645k411q18j080K682K665l647O24L021Q43O32J374
$$ -5621 -6081 -7581 -6876 -7452 -9097 -11508 -12326 -13406 -10724 -8059 -11706 -11082 -8061 -7218 -6586 -5212
15458e212l443J0j09J391J82k663n027n610J917K528J465J577j40n80j763J230
$$ -5212 -8655 -8645 -8754 -7363 -7181 -9844 -14871 -20481 -18564 -16036 -14571 -12994 -13134 -13714 -15477 -14247
15442a4247O72M079L142j41O85l658P94j161k94k631k182K391L76n56k585Q068
$$ -14247 -13575 -9496 -6354 -6495 -5810 -9468 -8674 -9835 -10129 -12760 -14942 -12551 -12175 -12731 -15316 -7248
15426g248L170p51j809r95l504J560j797Q78q42K171j810j250l236K730K349l914
$$ -7248 -4078 -4829 -6638 -7633 -11137 -9577 -11374 -10496 -11338 -9167 -10977 -12227 -15463 -12733 -10384 -14298
15410a4298K36q95j649L334M738j808n673l558N874L496L511L010K9J079M152
$$ -14298 -14062 -14957 -16606 -13272 -8534 -10342 -16015 -19573 -13699 -10203 -6692 -3682 -3653 -2574 1578
15395A578m287p686l637K470N908k560L27L78M610K867O66n801m281l927K662
$$ 1578 -2709 -10395 -14032 -11562 -5654 -8214 -7887 -7509 -2899 -32 634 -5167 -9448 -13375 -10713
15380a0713P99J551K119N080j784j132J883J602n975k063k160Q36L168J950j288
$$ -10713 -9914 -8363 -6244 -1164 -2948 -4080 -2197 -595 -6570 -8633 -10793 -9957 -6789 -4839 -6127
15365f127j028m66j05m873L218M827n06K59j199j89J643m685m308j271O785l2
$$ -6127 -7155 -7621 -7726 -12599 -9381 -4554 -5060 -4801 -6000 -6189 -4546 -9231 -13539 -14810 -8025 -8057
15349h057m063r43J954m86N322J248P21M384j503r9J991k604q89n40r53k172q99
$$ -8057 -12120 -13063 -11109 -11595 -6273 -5025 -4304 80 -1423 -1522 469 -2135 -3024 -3564 -4517 -6689 -7588
15332g588k89k138P0k030L59R20K664K4k894j771l455j123J222K562n15k589K969
$$ -7588 -7877 -10015 -9945 -11975 -11616 -10696 -8032 -8008 -10902 -12673 -16128 -17251 -16029 -13467 -13982 -16571 -13602
15315a3602N407K187j444k877K075K587l227l05O54p252l529M404L85J939L876
$$ -13602 -8195 -6008 -7452 -10329 -8254 -5667 -8894 -9199 -8545 -15797 -19326 -14922 -14537 -12598 -8722
15300h722O3k10K096k8n23k483r04l77o966p30M274K859O130K844j621n459K574
$$ -8722 -8659 -8869 -6773 -6801 -7324 -9807 -10711 -11088 -18054 -18784 -14510 -11651 -5521 -2677 -4298 -9757 -7183
15283g183N298j702o272l700J062L992M559k477k481M16k540j86J734P38k474
$$ -7183 -1885 -3587 -9859 -13559 -12497 -8505 -3946 -6423 -8904 -8488 -11028 -11214 -9480 -8742 -11216
15268a1216J802K543J104o47q99K352M420j593l921o14L565J151m079k166l049
$$ -11216 -9414 -6871 -5767 -6414 -7313 -4961 -541 -2134 -6055 -6669 -3104 -1953 -6032 -8198 -11247
15253a1247J519L432Q85l691j190L791K765l377J070L501m336l607Q08K571L786
$$ -11247 -9728 -6296 -5411 -9102 -10292 -6501 -3736 -7113 -6043 -2542 -6878 -10485 -9677 -7106 -3320
15238c320N13j505J359k924J262n60l578k753j285o245L306L244J700N014j060
$$ -3320 -2807 -4312 -2953 -5877 -4615 -5175 -8753 -11506 -12791 -19036 -15730 -12486 -10786 -5772 -6832
15223f832r08K072N474L615m266p279k306k724K798N902M619P9m400k408k94l19
$$ -6832 -7740 -5668 -194 3421 -845 -8124 -10430 -13154 -10356 -4454 165 244 -4156 -6564 -6858 -7177
15207g177j535L443K556k61m381M430M93l858p08k226J536J723K62r12k964k528
$$ -7177 -8712 -5269 -2713 -2974 -7355 -2925 -2432 -6290 -6998 -9224 -7688 -5965 -5703 -6615 -9579 -12107
15191a2107P305K569k607M66j054Q54J779J186K00J468R53m748k662n81J59K321
$$ -12107 -4802 -2233 -4840 -4374 -5428 -4574 -2795 -1609 -1409 59 1012 -3736 -6398 -6979 -6820 -4499
15175d499L651K718k225J538j05K560J169n495j468M371M773M286l692k497j553
$$ -4499 -848 1870 -355 1183 1078 3638 4807 -688 -2156 2215 6988 11274 7582 5085 3532
15160C532n380n054M086k89J07j225r45j730k579J089M574M462m676p647P24L117
$$ 3532 -1848 -6902 -2816 -3105 -2998 -4223 -5168 -6898 -9477 -8388 -3814 648 -4028 -11675 -10951 -7834
15144g834J46L833K29J092K927p266p338K967k789J608O731K257J6R31r138O40
$$ -7834 -7688 -3855 -3626 -2534 393 -6873 -14211 -11244 -14033 -12425 -5694 -3437 -3421 -2490 -11628 -10988
15128a0988J969K944m29J276M654l589j493o251j248J655j372l053m818j87Q996
$$ -10988 -9019 -6075 -6504 -5228 -574 -4163 -5656 -11907 -13155 -11500 -12872 -15925 -20743 -20930 -11934
15113a1934N126J714j386j968J608J67M84m635m90m057M80K785K370j19M272K377
$$ -11934 -6808 -5094 -6480 -8448 -6840 -6673 -6189 -10824 -11314 -15371 -14891 -12106 -9736 -9855 -5583 -3206
15097c206q19L61R57j977k925P36k525k82N70K696o89K109K674n631j754j135
$$ -3206 -4025 -3664 -2707 -4684 -7609 -6873 -9398 -9680 -9110 -6414 -7103 -4994 -2320 -7951 -9705 -10840
15081a0840q78J939j946j793J418L711L399K906k128n669O92J50l49J207m356
$$ -10840 -11718 -9779 -11725 -13518 -12100 -8389 -4990 -2084 -4212 -9881 -9189 -9039 -9388 -8181 -12537
15066a2537J36k041P61J527K113J769l481O58M942L08k869l953k398J209J101
$$ -12537 -12401 -14442 -13681 -12154 -10041 -8272 -11753 -11095 -6153 -5845 -8714 -12667 -15065 -13856 -12755
15051a2755K443J700n97P17M181l047n270L695M721J0k449m809l418N224k961
$$ -12755 -10312 -8612 -9209 -8492 -4311 -7358 -12628 -8933 -4212 -4202 -6651 -11460 -14878 -9654 -12615
15036a2615l079m963k726M803L772M206R24k778K94K816N82k512J184J729M289
$$ -12615 -15694 -20657 -23383 -18580 -14808 -10602 -9678 -12456 -12162 -9346 -8764 -11276 -10092 -8363 -4074
15021d074M96n95k246k554R44j018k051j162O322P925J907l597l469m373l680
$$ -4074 -3578 -4173 -6419 -8973 -8029 -9047 -11098 -12260 -5938 1987 3894 297 -3172 -7545 -11225
15006a1225m262K173L00K927K196N51j711J523J887k170J611L325J235q14L066
$$ -11225 -15487 -13314 -13014 -10087 -7891 -7340 -9051 -7528 -5641 -7811 -6200 -2875 -1640 -2454 612
14991F12Q34k272q01J925l385m019n994j554R89M46n29M034M122j570J617L037
$$ 612 1446 -826 -1627 298 -3087 -7106 -13100 -14654 -13665 -13219 -13748 -9714 -5592 -7162 -5545 -2508
14975b508L592L172k409n578o33p99n21n267j665M915J982p83n60K784K259l223
$$ -2508 1084 4256 1847 -3731 -4364 -5163 -5684 -10951 -12616 -7701 -5719 -6502 -7062 -4278 -2019 -5242
14959e242k237K778N082M822l457l005r33L577K615R23k821j999J288j637j85
$$ -5242 -7479 -4701 381 5203 1746 -1259 -2192 1385 4000 4923 2102 103 1391 -246 -431
14944d31K391l005j960j501l89N78L225K757j564j753m207j555K46m39K990J510
$$ -431 1960 -1045 -3005 -4506 -4895 -4317 -1092 1665 101 -1652 -5859 -7414 -7168 -7607 -4617 -3107
14928c107l549l661q16L149M811J288l148l373l98J966L169J232K817j899J411
$$ -3107 -6656 -10317 -11133 -7984 -3173 -1885 -5033 -8406 -8804 -6838 -3669 -2437 380 -1519 -108
14913a08j158j374J898n23J572o82J908N860o01j727m499k887P98j453M310J699
$$ -108 -1266 -2640 -742 -1265 307 -375 1533 7393 6792 5065 566 -2321 -1523 -2976 1334 3033
14897C033Q65J67K268j947n191k991O05K035K336J85j483J808n59J887K187k966
$$ 3033 3898 4065 6333 4386 -805 -3796 -3191 -1156 1180 1365 -118 1690 1131 3018 5205 2239
14881B239k749l712k801L298O18R75J71k99k784J208n58m183j888k054L914L220
$$ 2239 -510 -4222 -7023 -3725 -3107 -2132 -1961 -2260 -5044 -3836 -4394 -8577 -10465 -12519 -8605 -5385
14865e385K916L484l030j351K293k018n853j425R90N87k276J035J755j648K065
$$ -5385 -2469 1015 -2015 -3366 -1073 -3091 -8944 -10369 -9379 -8792 -11068 -10033 -8278 -9926 -7861
14850g861L109K744m211J501L039k402m820k674k65J872Q011L508n687j648J924
$$ -7861 -4752 -2008 -6219 -4718 -1679 -4081 -8901 -11575 -11840 -9968 -1957 1551 -4136 -5784 -3860
14835c860M75k316K573J624k716j24N00J327l894j352o357j452N746n13k219k016
$$ -3860 -3385 -5701 -3128 -1504 -4220 -4344 -3844 -2517 -6411 -7763 -14120 -15572 -9826 -10339 -12558 -14574
14819a4574M94o33Q78L722M545L281J517q440j337j675k874J265L897N221J20
$$ -14574 -14080 -14713 -13835 -10113 -5568 -2287 -770 -9210 -10547 -12222 -15096 -13831 -9934 -4713 -4593
14804d593R94n4l505j759j493J417K230m421M435l98k857N06J578L456l75p20
$$ -4593 -3599 -3653 -7158 -8917 -10410 -8993 -6763 -11184 -6749 -7147 -10004 -9498 -7920 -4464 -4839 -5559
14788e559K024K381m93l86n56j529l756j224K055P711j123J645L189j520p820
$$ -5559 -3535 -1154 -1647 -2033 -2589 -4118 -7874 -9098 -7043 668 -455 1190 4379 2859 -4961
14773d961N13K026k809L158j547q29M792N95j154j828k177m326j737L391L894
$$ -4961 -4448 -2422 -5231 -2073 -3620 -4449 343 938 -216 -2044 -4221 -8547 -10284 -6893 -2999
14758b999P51l652K937J280P92j909M996K71P33p56l785l659K592R52j140pL920
$$ -2999 -2248 -5900 -2963 -1683 -891 -2800 2196 2467 3200 2444 -1341 -5000 -2408 -1456 -2596 -2603 1317
14741A317N210r00l709k430l053k335k796J376L503K576K96l7k740J822Q46K844
$$ 1317 6527 5627 1918 -512 -3565 -5900 -8696 -7320 -3817 -1241 -945 -982 -3722 -1900 -1054 1790
14725A790k65p90m48r00K826M550k79q72J685j624k325n58n25j897Q66p76L66
$$ 1790 1525 735 287 -613 2213 6763 6484 5612 7297 5673 3348 2790 2265 368 1234 458 824
14708H24j737m10Q88l449k47J086j961M18r39j652m890O744M402L730j939n307
$$ 824 -913 -1323 -435 -3884 -4131 -3045 -5006 -4588 -5527 -7179 -12069 -5325 -923 2807 868 -4439
14692d439l661j80J009L328j50K062J16k846M985l949l712j025K983m40l614k020
$$ -4439 -8100 -8280 -7271 -3943 -4093 -2031 -1915 -4761 224 -3725 -7437 -8462 -5479 -5919 -9533 -11553
14676a1553k01K415P848L461K71n510k466L526M469Q8m30k074K378J791N87j495
$$ -11553 -11754 -9339 -1491 1970 2241 -3269 -5735 -2209 2260 2348 1918 -156 2222 4013 4600 3105
14660C105l724j885n95L536N071k016K4j360m43k329j725m753J136L669O48m666
$$ 3105 -619 -2504 -3099 437 5508 3492 3516 2156 1713 -616 -2341 -7094 -5958 -2289 -1641 -6307
14644f307l132L73K525L435J0373L921m476k477k460k450J457j35J823k949o060
$$ -6307 -9439 -9066 -6541 -3106 7267 11188 6712 4235 1775 -675 782 647 2470 -479 -6539
14629f539l288J608L487j658n75L119K098R70j882K063k548j51K350J049K824
$$ -6539 -9827 -8219 -4732 -6390 -6965 -3846 -1748 -778 -2660 -597 -3145 -3296 -946 103 2927
14614B927L91L145J26q19K147K344j005k282n009p01k803j320K333P77J187l967
$$ 2927 3318 6463 6589 5770 7917 10261 9256 6974 1965 1264 -1539 -2859 -526 251 1438 -2529
14598b529k884L268O588j77M85M143k6l669J239r52k587R21K093J879P65K847
$$ -2529 -5413 -2145 4443 4266 4751 8894 8868 5199 6438 5486 2899 3820 5913 7792 8557 11404
14582A1404J596k460o74j590n466K532k418k82k660l279J113O919L882J807o45
$$ 11404 13000 10540 9866 8276 2810 5342 2924 2642 -18 -3297 -2184 4735 8617 10424 9779
14567I779j421l470J536P162q94n047j519j283J28K362l181r24j180L160k626
$$ 9779 8358 4888 6424 13586 12692 7645 6126 4843 4971 7333 4152 3228 2048 5208 2582
14552B582N150j458k96O15o37L29o200l17M244O347L116l435L83k586L33j583
$$ 2582 7732 6274 5978 6593 5956 6285 85 -232 4012 10359 13475 10040 10423 7837 8170 6587
14536F587J45L57l05k059m109r61J603J664p38l465j335M667L226K66j286r80
$$ 6587 6732 7089 6784 4725 616 -345 1258 2922 2184 -1281 -2616 2051 5277 5543 4257 3277
14520C277N939M70m660l212J354O737L757L08J02L728J038k197l116n615m753
$$ 3277 9216 9686 5026 1814 3168 9905 13662 13970 14072 17800 18838 16641 13525 7910 3157
14505C157K144K335n2l05J9J665L030L317k454p664j835K194L233J800J209M239
$$ 3157 5301 7636 7584 7279 7298 8963 11993 15310 12856 5192 3357 5551 8784 10584 11793 16032
14489A6032n25J277k562j59j519n594j188P53k41O56j229P2j865j146L80L613
$$ 16032 15507 16784 14222 14063 12544 6950 5762 6515 6274 6930 5701 5773 3908 2762 3142 6755
14473F755n15Q68K151j371J587K349k56o26m056m322l624m44N916j070n688k84
$$ 6755 6240 7108 9259 7888 9475 11824 11568 10942 6886 2564 -1060 -1504 4412 3342 -2346 -2630
14457b630N814O01J936P78k176J17P918O862k94J267j069j799k469M9P37m729
$$ -2630 3184 3785 5721 6499 4323 4440 12358 19220 18926 20193 19124 17325 14856 14905 15642 10913
14441A0913J157J644L804K196q72l791k652n463j189J102J91K1L304Q15M20J641
$$ 10913 12070 13714 17518 19714 18842 15051 12399 6936 5747 6849 7040 7061 10365 11180 11600 13241
14425A3241P8n955J649n218n501Q89L749P087O889J793k954l341J023L702K853
$$ 13241 13319 7364 9013 3795 -1706 -817 2932 10019 16908 18701 15747 12406 13429 17131 19984
14410A9984K93k175m928n306m86L632M490p72K797M944M91n141o917j538J008
$$ 19984 20277 18102 13174 7868 7382 11014 15504 14732 17529 22473 22964 17823 10906 9368 10376
14395A0376j492J482m346j939N66j102P7l21m72J707q03K231J831Q01j194k00
$$ 10376 8884 10366 6020 4081 4647 3545 3622 3301 2829 4536 3733 5964 7795 8596 7402 7202
14379G202o5k936n39K775j911o386J166J52K641L405N414N849m30p399m811j175
$$ 7202 7137 4201 3662 6437 4526 -1860 -694 -542 2099 5504 10918 16767 16337 8938 4127 2952
14363B952L27j283K176P46j008J662J255m59R98n38q29j843K439k409L418K706
$$ 2952 3279 1996 4172 4918 3910 5572 6827 6368 7366 6828 5999 4156 6595 4186 7604 10310
14347A0310l306N99L618k341n060l152K767o29l206M945J724Q039J050M31o62
$$ 10310 7004 7603 11221 8880 3820 668 3435 2806 -400 4545 6269 14308 15358 15789 15127
14332A5127l740l295o036k257L565L643L40j153j160J475J228k206j781L558K710
$$ 15127 11387 8092 2056 -201 3364 7007 7347 6194 5034 6509 7737 5531 3750 7308 10018
14317A0018R70n563j580L509m43J197k190M047K241o39M860k577m485m480k396
$$ 10018 10988 5425 3845 7354 6911 8108 5918 9965 12206 11567 16427 13850 9365 4885 2489
14302B489j697m59j723N29J94L911n04J231J422L876M309R30l69o109k825n016
$$ 2489 792 333 -1390 -861 -667 3244 2740 3971 5393 9269 13578 14508 14139 8030 5205 189
14286A89r11K342O036J991L177j038j837Q20M36K749J438k298m297J075j10J664
$$ 189 -722 1620 7656 9647 12824 11786 9949 10769 11205 13954 15392 13094 8797 9872 9762 11426
14270A1426l032n532j441r76J551L421J683J352l518j708L403L598o31j706m570
$$ 11426 8394 2862 1421 445 1996 5417 7100 8452 4934 3226 6629 10227 9596 7890 3320
14255C320K03L608J727N008Q20j751k480l484K07J976j995J181p6k81k798j901
$$ 3320 3523 7131 8858 13866 14686 12935 10455 6971 7178 9154 7159 8340 8264 7983 5185 3284
14239C284K260K044P04k536M117k57p13n40j35m62k8K360Q63m788p420K530L624
$$ 3284 5544 7588 8292 5756 9873 9616 8903 8363 8228 7766 7738 10098 10961 6173 -1247 1283 4907
14222D907K253J05k373O44M880R92k092j894J872n272p24K069P57j069M00L21
$$ 4907 7160 7265 4892 5536 10416 11408 9316 7422 9294 4022 3298 5367 6124 5055 5455 5776
14206E776k52j935J192N367N014K860n72m520k489j168l033q23k96k67k109P41
$$ 5776 5524 3589 4781 10148 15162 18022 17450 12930 10441 9273 6240 5417 5121 4854 2745 3486
14190C486L157k80J37K555j840k395R6O22J47J371o21o16L761N62n857R48J115
$$ 3486 6643 6363 6500 9055 7215 4820 4916 5538 5685 7056 6435 5819 9580 10142 4285 5233 6348
14173F348k205k631J832J169j591K715m93j534q93O974J89k533j767L43K018N399
$$ 6348 4143 1512 3344 4513 2922 5637 5144 3610 2717 9691 9880 7347 5580 5923 7941 13340
14157A3340j466j334m415k769j951K014R93J722L067l117P61L358L550n80o322
$$ 13340 11874 10540 6125 3356 1405 3419 4412 6134 9201 6084 6845 10203 13753 13173 6851
14142F851l308l90%R45J14j215j582O93K75p49n38k964q14Q23K227N447n2K855
$$ 6851 3543 3153 3153 4098 4212 2997 1415 2108 2383 1634 1096 -1868 -2682 -1859 368 5815 5763 8618
14124H618L245j388k935k302J758j029l656j128R46n86K507N997J944m555n750
$$ 8618 11863 10475 7540 5238 6996 5967 2311 1183 2129 1543 4050 10047 11991 7436 1686
14109A686K37L807R78o31k058O16j472k772m279J691N047K237Q58Kj315K52J715
$$ 1686 1923 5730 6708 6077 4019 4635 3163 391 -3888 -2197 2850 5087 5945 5947 4632 4884 6599
14092F599L553J529L24j130k66m57J63l493l33k188k391k504m63J629l196R69
$$ 6599 10152 11681 12005 10875 10609 10152 10315 6822 6489 4301 1910 -594 -1057 572 -2624 -1655
14076a655Q320L987m492k369p19j3j794j984L418O014K04j951M08J640l794m256
$$ -1655 6665 10652 6160 3791 3072 3059 1265 -719 2699 8713 8917 6966 7374 9014 5220 964
14060I64L253J608k88K07L363M856P73o924J77k398L920L190k863Q94J95q78r91
$$ 964 4217 5825 5537 5744 9107 13963 14736 7812 7989 5591 9511 12701 9838 10732 10927 10049 9058
14043I058M816M64P99l89k734l956K140P90k965K39p48k219K153J289P42J196
$$ 9058 13874 14338 15137 14748 12014 8058 10198 10988 8023 8262 7514 5295 7448 8737 9479 10675
14027A0675K119J19l54J085J622o224k363L184J561j142J260M23L768J359j425
$$ 10675 12794 12913 12559 13644 15266 9042 6679 9863 11424 10282 11542 11965 15733 17092 15667
14012A5667j174m973m278l264J893Q66j462l98O33L941K589l335j371m05k913
$$ 15667 14493 9520 5242 1978 3871 4737 3275 2877 3510 7451 10040 6705 5334 4929 2016
13997B016N13M00o91j155r50Q63M515k59j355J742L043L106K392l215k375O26
$$ 2016 2529 2929 2238 1083 133 996 5511 5252 3897 5639 8682 11788 14180 10965 8590 9216
13981I216K762K419j682l511j14L142J85k696j752j710o3j825L116K747k153j278
$$ 9216 11978 14397 12715 9204 9090 12232 12417 9721 7969 6259 6196 4371 7487 10234 8081 6803
13965F803J347K582N690Q33k196p76m472p530J371L002L972j205J672l330j705
$$ 6803 8150 10732 16422 17255 15059 14283 9811 2281 3652 6654 10626 9421 11093 7763 6058
13950F058l769l703L448Q83L472K263l406k350l05M60J004j045n099j764J658
$$ 6058 2289 -1414 2034 2917 6389 8652 5246 2896 2591 3051 4055 3010 -2089 -3853 -2195
13935b195K729L624L025p05R49k444K2J104l770K719J287K21j115l78j055K987
$$ -2195 534 4158 7183 6478 7427 4983 5005 6109 2339 5058 6345 6566 5451 5073 4018 7005
13919G005N821J860N80K790l088m933l795l742j415L126k822L88N3k122K798j70
$$ 7005 12826 14686 15266 18056 14968 10035 6240 2498 1083 4209 1387 1775 1828 -294 2504 2334
13903B334k111j134M656K658J508m403k085R06N670J683m919j320K881L844o62
$$ 2334 223 -911 3745 6403 7911 3508 1423 2329 7999 9682 4763 3443 6324 10168 9506
13888I506k023M716J521n8N13J321J399j436k517l385j370o59J091J844K918q60
$$ 9506 7483 12199 13720 13662 14175 15496 16895 15459 12942 9557 8187 7528 8619 10463 13381 12521
13872A2521K750J771M22l81l03R38j892l003k562K121P43K44L602M4l871q18j964
$$ 12521 15271 17042 17464 17083 16780 17718 15826 12823 10261 12382 13125 13369 16971 17015 13144 12326 10362
13855A0362K34R49N34K134K844Q46l819o433K820M959k877J399K265L835M377
$$ 10362 10596 11545 12079 14213 17057 17903 14084 7651 10471 15430 12553 13952 16217 20052 24429
13840B4429k760K709q31n41k029l434l481M671K103k153k125j483K249l294k303
$$ 24429 21669 24378 23547 23006 20977 17543 14062 18733 20836 18683 16558 15075 17324 14030 11727
13825A1727M774J881j824O21K889k806j380K39K043k158j652p27k524j419p86
$$ 11727 16501 18382 16558 17179 20068 17262 15882 16121 18164 16006 14354 13627 11103 9684 8898
13810H898N070M41m015R91N440J406K516Q17K952K602k305l473l772L919O10r90
$$ 8898 13968 14409 10394 11385 16825 18231 20747 21564 24516 27118 24813 21340 17568 21487 22097 21107
13794B1107j20J719l057j288J400J306n79j815J555J473k291o093J799N27K167
$$ 21107 20987 22706 19649 18361 19761 21067 20488 18673 20228 21701 19410 13317 15116 15643 17810
13779A7810N407N21m897m518K358K880k631k819O626k27J805J02J337o212m930
$$ 17810 23217 23738 18841 14323 16681 19561 16930 14111 20737 20510 22315 22417 23754 17542 12612
13764A2612M575N397L754o501l146M279q18j393j094J975m411L4N967Q2o49P449
$$ 12612 17187 22584 26338 19837 16691 20970 20152 18759 17665 19640 15229 15263 21230 21312 20663 28112
13748B8112K280l787m972j871r25k098K013N913j032J997J739l076k993j290j291
$$ 28112 30392 26605 21633 19762 18837 16739 18752 24665 23633 25630 27369 24293 21300 20010 18719
13733A8719M50j28q62N554P87n41j163R11%P30K38j96J04k02M471m14n956O38
$$ 18719 19169 19041 18179 23733 24520 23979 22816 23727 23727 24457 24695 24499 24603 24401 28872 28458 22502 23140
13715B3140M245L86n145o495L399O135o74l830n98o129k394L819M663L361n207
$$ 23140 27385 27771 22626 16131 19530 25665 24991 21161 20563 14434 12040 15859 20522 23883 18676
13700A8676k461K470N631L661p72M52J903Q1R18k727k004o107j825P40j735l455
$$ 18676 16215 18685 24316 27977 27205 27657 29560 29641 30559 27832 25828 19721 17896 18636 16901 13446
13684A3446p8K176J971j875J26O923P14j14q92J828k617R55K595p44l447O71r5
$$ 13446 13368 15544 17515 15640 15766 22689 23403 23289 22397 24225 21608 22563 25158 24414 20967 21638 21543
13667B1543m668l393J048J012o218J067L709j110l525j819L709L999k535o267
$$ 21543 16875 13482 14530 15542 9324 10391 14100 12990 9465 7646 11355 15354 12819 6552
13653F552R30M331J349J373L037k132J827J749m528J685K974J540l40n256l644
$$ 6552 7482 11813 13162 14535 17572 15440 17267 19016 14488 16173 19147 20687 20347 15091 11447
13638A1447l497P83M782L047j172m413J092J64k575L82J796K806j009J393n065
$$ 11447 7950 8733 13515 16562 15390 10977 12069 12233 9658 10040 11836 14642 13633 15026 9961
13623I961k083k584O041L628k113m21P96K677L496j554p330K087K138j019L659
$$ 9961 7878 5294 11335 14963 12850 12429 13225 15902 19398 17844 10514 12601 14739 13720 17379
13608A7379O494j563n036j865M120l328Q51O854o43j544K472j787p308j445P67
$$ 17379 23873 22310 17274 15409 19529 16201 17052 23906 23263 21719 24191 22404 15096 13651 14418
13593A4418M06K385M736j793j345L197K825j033J357o81j464L905M323j038K214
$$ 14418 14824 17209 21945 20152 18807 22004 24829 23796 25153 24472 23008 26913 31236 30198 32412
13578C2412M237k04N66J237J672m293k766l633m272L827M950J888j870k17J311
$$ 32412 36649 36445 37011 38248 39920 35627 32861 29228 24956 28783 33733 35621 33751 33534 34845
13563C4845J503j142K88k003J661N38k631o554J862K465J589p29j231J996K957
$$ 34845 36348 35206 35494 33491 35152 35690 33059 26505 28367 30832 32421 31692 30461 32457 35414
13548C5414l748K29o11m099m74M187J728k19Q02M280J462o51j028J758l185J813
$$ 35414 31666 31895 31284 27185 26711 30898 32626 32407 33209 37489 38951 38300 37272 39030 35845 37658
13532C7658J418P6M21K823M49m555n493N057M962l579jk083j312L05K863j07K704
$$ 37658 39076 39152 39573 42396 42845 38290 32797 37854 42816 39237 39236 37153 35841 36146 39009 38902 41606
13515D1606J916l716o362j449J101q32K466O976L432l638o44K009L557l275n387
$$ 41606 43522 39806 33444 31995 33096 32264 34730 41706 45138 41500 40856 42865 46422 43147 37760
13500C7760J440N244p00J567P6n959K569K122l772O07lJ36J008O92p73P92N56
$$ 37760 39200 44444 43744 45311 45387 39428 41997 44119 40347 40954 40951 41087 42095 42787 42014 42806 43362
13483D3362m858m429Q14J966k252J321k020m680L546J384J424M35k73O69M563
$$ 43362 38504 34075 34889 36855 34603 35924 33904 29224 32770 34154 35578 36013 35740 36409 40972
13468D0972O19j344l921o139M361M363j330J438O528m206q935k701N401L798J103
$$ 40972 41591 40247 36326 30187 34548 38911 37581 39019 45547 41341 32406 29705 35106 38904 40007
13453D0007l539k037J802K150K505j388K771N427M683k669o66n9K697o365m716
$$ 40007 36468 34431 36233 38383 40888 39500 42271 47698 52381 49712 49046 48987 51684 45319 40603
13438D0603J031J135L514j361l478J893M162K44J740l270n822K885J633q62k347
$$ 40603 41634 42769 46283 44922 41444 43337 47499 47743 49483 46213 40391 43276 44909 44047 41700
13423D1700J473K162K173M40l101O50J655M460L217j304K80k474J245m16K324
$$ 41700 43173 45335 47508 47948 44847 45497 47152 51612 54829 53525 53805 51331 52576 52160 54484
13408E4484L904j965j285l395k301J968J713k434j407N147P110n67l437j877M479
$$ 54484 58388 56423 55138 51743 49442 51410 53123 50689 49282 54429 61539 60972 57535 55658 60137
13393F0137O670r72n206j779l88j149K152J989K15J666J516l50j841j651k098
$$ 60137 66807 65835 60629 58850 58462 57313 59465 61454 61669 63335 64851 64501 62660 61009 58911
13378E8911N835L995L378N924m20k101j883j454K486M341j889r2k352n415j059
$$ 58911 64746 68741 72119 78043 77623 75522 73639 72185 74671 79012 77123 77031 74679 69264 68205
13363F8205o91M82j980J700M298M373L23P55L902q66J473O10j268n083p47m595
$$ 68205 67514 67996 66016 67716 72014 76387 76710 77465 81367 80501 81974 82584 81316 76233 75486 70891
13347G0891j999m242K717P057L110K27J308M907n99j503N56m10j48o80J686p94
$$ 70891 68892 64650 67367 74424 77534 77761 79069 83976 83377 81874 82430 82020 81872 81192 82878 82084
13331H2084j195J488K603J068L10o56P30J962r11J945n418J225N900R04l510j611
$$ 82084 80889 82377 84980 86048 86358 85702 86432 88394 87483 89428 84010 85235 91135 92039 88529 86918
13315H6918L50M955N87p90l093L59m339O35P162J363J602R27K076j616P58M518
$$ 86918 87268 92223 92810 92020 88927 89286 84947 85582 92744 94107 95709 96636 98712 97096 97854 102372
13299A02372j368j575J860M98p08j769n33L634L273L284k35l755r94o88j209N905
$$ 102372 101004 99429 101289 101787 101079 99310 98777 102411 105684 108968 108733 104978 103984 103296 102087 107992
13283A07992L980p04q81J542J001J069m70n632N20K992M044R41n7M685K881l845
$$ 107992 111972 111268 110387 111929 112930 113999 113529 107897 108417 111409 115453 116394 116337 121022 123903 120058
13267A20058J507k486q56k73L930N304L203k38J887k989L206L851L88n309L482
$$ 120058 121565 119079 118223 117950 121880 127184 130387 130149 132036 129047 132253 136104 136492 131183 134665
13252A34665J391K471L232L658J416K650L634m955o062L447J570j218J364L029
$$ 134665 136056 138527 141759 145417 146833 149483 153117 148162 142100 145547 147117 145899 147263 150292
13238A50292K082J555k11M901K361l873L689L980J316J187M448j942K537M369
$$ 150292 152374 153929 153718 158619 160980 157107 160796 164776 166092 167279 171727 169785 172322 176691
13224A76691K784k420k055M851O383M375J946k16m360J292K4J652J030N344N207
$$ 176691 179475 177055 175000 179851 186234 190609 192555 192339 187979 189271 189295 190947 191977 197321 202528
13209B02528m224L272O368M097l841l599K207k515K928P47k494K056k41N012J473
$$ 202528 198304 201576 207944 212041 208200 204601 206808 204293 207221 207968 205474 207530 207289 212301 213774
13194B13774j474K702N022J364K722K234o49j93Q95l388m503K094N080K249K190
$$ 213774 212300 215002 220024 221388 224110 226344 225695 225502 226397 223009 218506 220600 225680 227929 230119
13179B30119l26k001L660J618L798K990l636K861J382J889M785O941O851K078
$$ 230119 229793 227792 231452 233070 236868 239858 236222 239083 240465 242354 247139 254080 260931 263009
13165B63009k028n242o13l460j711L159L460Q70J506M643K671N7K165L311K152
$$ 263009 260981 255739 255126 251666 249955 253114 256574 257444 258950 263593 266264 266321 268486 271797 273949
13150B73949N224N856L793J851P374Q884J302M757L925j916j09M061N967R483
$$ 273949 279173 285029 288822 290673 298047 306931 308233 312990 316915 314999 314890 318951 324918 334401
13136C34401O880M851L691P702Q196R250M807r11L158M895P551Q400P378J841
$$ 334401 341281 346132 349823 357525 365721 374971 379778 378867 382025 386920 394471 402871 410249 412090
13122D12090J065M529R507N182R543J1320P749P696J0404R232M466R061P123M928
$$ 412090 413155 417684 427191 432373 441916 453236 460985 468681 479085 488317 492783 501844 508967 513895
13108E13895O402J0331J2143Q621P680N189Q135O299J1118J2922J0751J0210J4556
$$ 513895 520297 530628 542771 551392 559072 564261 572396 578695 589813 602735 613486 623696 638252
13095F38252J4666J3805R426J1783J4132J3906R251J3916J4701J2063J5559J9919
$$ 638252 652918 666723 676149 687932 702064 715970 725221 739137 753838 765901 781460 801379
13083H01379J6065J5993J2112J7379J9170J6889K2446J7654J6179J9734K2630
$$ 801379 817444 833437 845549 862928 882098 898987 921433 939087 955266 975000 997630
13072I97630K9967K3342J7133K1172K6207L0447K8223K6226K9346K6921K9650
$$ 997630 1027597 1050939 1068072 1089244 1115451 1145898 1174121 1200347 1229693 1256614 1286264
13061A286264K8918L6362L4962K9213L2969L3871L8039L9561M0666L8989M3553
$$ 1286264 1315182 1351544 1386506 1415719 1448688 1482559 1520598 1560159 1600825 1639814 1683367
13050A683367M1444M1888M5766M9237N0668M8836N1469N9178O2159O3056O5888
$$ 1683367 1724811 1766699 1812465 1861702 1912370 1961206 2012675 2071853 2134012 2197068 2262956
13039B262956O7697O4320O5542P6113P9247Q4197Q7356Q7784R0778R5095R8678
$$ 2262956 2330653 2394973 2460515 2536628 2615875 2700072 2787428 2875212 2965990 3061085 3159763
13028C159763R8954J12645J14457J15083J25192J33039J33124J38769J47318J49986
$$ 3159763 3258717 3371362 3485819 3600902 3726094 3859133 3992257 4131026 4278344 4428330
13018D428330J58104J62287J72941J79012J90479K01090K04931K10348K27470
$$ 4428330 4586434 4748721 4921662 5100674 5291153 5492243 5697174 5907522 6134992
13009F134992K32780K37830K51755K64074K70849K83582L00572L13593L24730
$$ 6134992 6367772 6605602 6857357 7121431 7392280 7675862 7976434 8290027 8614757
13000H614757L32737L44820L61235L77672L83070L95898M14121M22162M39728
$$ 8614757 8947494 9292314 9653549 10031221 10414291 10810189 11224310 11646472 12086200
12991A2086200M57978M66331M78409M91624N05692N19830N33514N40915N48197
$$ 12086200 12544178 13010509 13488918 13980542 14486234 15006064 15539578 16080493 16628690
12982A6628690N56708N60851N67271N73102N71079N70166N70572N60678N52610
$$ 16628690 17185398 17746249 18313520 18886622 19457701 20027867 20598439 21159117 21711727
12973B1711727N43705N23030N03013M81956M55330M22234L92199L57916L23672
$$ 21711727 22255432 22778462 23281475 23763431 24218761 24640995 25033194 25391110 25714782
12964B5714782K77019K25342J83815J31838P8840L2762j4581o2645j11008j61273
$$ 25714782 25991801 26217143 26400958 26532796 26611636 26644398 26629817 26567172 26456164 26294891
12954B6294891k08968k47633k78449l21991l60875l94160m18785m41610m63397
$$ 26294891 26085923 25838290 25559841 25237850 24876975 24482815 24064030 23622420 23159023
12945B3159023m84805n00426n09277n17586n28440n35193n38667n40831n32191
$$ 23159023 22674218 22173792 21664515 21146929 20618489 20083296 19544629 19003798 18471607
12936A8471607n26328n29189n22736n08737n06521m99297m83628m76994m62333
$$ 18471607 17945279 17416090 16893354 16384617 15878096 15378799 14895171 14418177 13955844
12927A3955844m53742m43962m29510m16953m03703l95834l79945l65273l52390
$$ 13955844 13502102 13058140 12628630 12211677 11807974 11412140 11032195 10666922 10314532
12918A0314532l47182l32137l19303l13748l03049k89071k78308k68757k54995
$$ 10314532 9967350 9635213 9315910 9002162 8699113 8410042 8131734 7862977 7607982
12909G607982k45778k40836k25626k19103k12627k09942j97957j91531j81078
$$ 7607982 7362204 7121368 6895742 6676639 6464012 6254070 6056113 5864582 5683504
12900E683504j71178j66256j60801j57516j48029j42223j39173j30570j22873
$$ 5683504 5512326 5346070 5185269 5027753 4879724 4737501 4598328 4467758 4344885
12891D344885j22400j16819j16660j09478j08443j02914r1704r0986q8754q4390
$$ 4344885 4222485 4105666 3989006 3879528 3771085 3668171 3576467 3485481 3396727 3312337
12881C312337q4879q3799p9506q4342o8891o5026p0521o5338o3269n8946n5974
$$ 3312337 3227458 3143659 3064153 2979811 2910920 2845894 2775373 2710035 2646766 2587820 2531846
12870B531846n3560n2749n0518n1872m8989m6246n0359m7860m6191l9925l8051
$$ 2531846 2478286 2425537 2375019 2323147 2274158 2227912 2177553 2129693 2083502 2043577 2005526
12859B005526l7929m0736l6281l8791l3754l2641l1379k8675l1748l1343k7000
$$ 2005526 1967597 1926861 1890580 1851789 1818035 1785394 1754015 1725340 1693592 1662249 1635249
12848A635249k8697k9989k9041k3759k4605k3265j5725j9812k4329j7839k0805
$$ 1635249 1606552 1576563 1547522 1523763 1499158 1475893 1460168 1440356 1416027 1398188 1377383
12837A377383j6001j9669k3704k1746j7826j7073j6802j1399j2541k2058j4543
$$ 1377383 1361382 1341713 1318009 1296263 1278437 1261364 1244562 1233163 1220622 1198564 1184021
12826A184021j9146k2777j8471j3812j3228j6652j3353j2849j5071j9152j3179
$$ 1184021 1164875 1142098 1123627 1109815 1096587 1079935 1066582 1053733 1038662 1019510 1006331
12815A006331r085j1650j1237j0655j0401j0021j1268j0018p111q284p382j0060
$$ 1006331 997246 985596 974359 963704 953303 943282 932014 921996 914885 906601 899219 889159
12803H89159j0866j2622o660p506q177m376p661o800j696l314o865m218n969q429
$$ 889159 878293 865671 859011 851505 843328 838952 831291 824491 822795 819481 812616 808398 802429 794000
12789G94000m806j037j336l135m520m94M416l146l554m789l688j0873o551q040
$$ 794000 789194 788157 786821 783686 779166 778672 783088 779942 776388 771599 767911 757038 750487 742447
12775G42447n548o523o597n685o539m735r575k309n506p484k715Q22k759k598
$$ 742447 736899 730376 723779 718094 711555 706820 697245 694936 689430 681946 679231 680053 677294 674696
12761F74696l276j985l414m477n24L781l393j0037n077j256m351j2989j6943j5923
$$ 674696 671420 669435 666021 661544 661020 664801 661408 651371 646294 645038 640687 627698 610755 594832
12747E94832o220p480r571j1240o900j0230r126l426m227k066o356r568k178L317
$$ 594832 588612 581132 571561 560321 553421 543191 534065 530639 526412 524346 517990 508422 506244 509561
12733E09561r90m868n35K960l152l056O53N51J175P3J771L667j896m013M803M691
$$ 509561 508571 503703 503168 506128 502976 499920 500573 501124 502299 502372 504143 507810 505914 501901 506704 511395
12717E11395M987M131N524O750L956P467J3100K427l496p661m112o457m714r876
$$ 511395 516382 520513 526037 532787 536743 544210 557310 559737 556241 548580 544468 538011 533297 523421
12703E23421p757o356n897p785r110n967l373j535l918j997K141J96M992O534
$$ 523421 515664 509308 503411 495626 486516 480549 477176 475641 471723 469726 471867 472063 477055 483589
12689D83589j762k42L309R69L777J247j446J495J875l388r890p393j2229j0193
$$ 483589 481827 481585 484894 485863 489640 490887 489441 490936 492811 489423 479533 472140 459911 449718
12675D49718j0329j0861j0887j4005j0438p056o239j0393p289o702n742r948l647
$$ 449718 439389 428528 417641 403636 393198 386142 379903 369510 362221 355519 349777 339829 336182
12662C36182l097m241l518N37J250n904o415K034J420l073l731j889j231o760
$$ 336182 333085 328844 325326 325863 327113 321209 314794 316828 318248 315175 311444 309555 308324 301564
12648C01564n423J494K16O64l68p13j800j524l555m458L451P27k502l114k327
$$ 301564 296141 297635 297851 298515 298147 297434 295634 294110 290555 286097 289548 290275 287773 284659 282332
12633B82332l565n568l406M645L498k498m860n393M960P242l55l422l029J145
$$ 282332 278767 273199 269793 274438 277936 275438 270578 265185 270145 277387 277032 273610 270581 271726
12619B71726j083l349q35J609l637r59j158n596k529j422Q95K684J926n477O63
$$ 271726 270643 267294 266459 268068 264431 263472 262314 256718 254189 252767 253662 256346 258272 252795 253458
12604B53458N474k161p39n34J939J635m180K326O927M709l377l585q51N833J121
$$ 253458 258932 256771 256032 255498 257437 259072 254892 257218 264145 268854 265477 261892 261041 266874 267995
12589B67995J011L95L612j815l696M36r13k32J245q61p310l819l153O282N090
$$ 267995 269006 269401 273013 271198 267502 267938 267025 266793 268038 267177 259867 256048 252895 259177 264267
12574B64267j59L539m620o810k626N36M038Q237K266j837K38M216K756N392J329
$$ 264267 264108 267647 263027 256217 253591 254127 258165 266402 268668 266831 267069 271285 274041 279433 280762
12559B80762j576l373j019m99n675k560L005Q10k180O230M693o005K96l333l322
$$ 280762 279186 275813 274794 274295 268620 266060 269065 269875 267695 273925 278618 272613 272909 269576 266254
12544B66254J442K572N456J804O43M111l94j681L032J973L369K697N470L539M711
$$ 266254 267696 270268 275724 277528 278171 282282 281888 280207 283239 285212 288581 291278 296748 300287 304998
12529C04998N594M955P605L315P024N602M545O495P123N211P141L365J934J0007
$$ 304998 310592 315547 323152 326467 333491 339093 343638 350133 357256 362467 369608 372973 374907 384914
12515C84914J0169M997J683l170k967J439R21n400l131j885l197m982n240o060
$$ 384914 395083 400080 401763 398593 395626 397065 397986 392586 389455 387570 384373 379391 374151 368091
12501C68091m174m729J290k04l968n446r21K120K437k375o785q832p520J89j859
$$ 368091 363917 359188 360478 360274 356306 350860 349939 352059 354496 352121 345336 336504 328984 329173 327314
12486C27314m780l658o773q825o285p314k713K809n710m514m301L74M862M977
$$ 327314 322534 318876 312103 303278 296993 289679 286966 289775 284065 279551 275250 275624 280486 285463
12472B85463j188J640N20J11K25N088j038m2m12j128p9K066K779j374J03k007
$$ 285463 284275 285915 286435 286546 286771 291859 290821 290779 290367 289239 289160 291226 294005 292631 292734 290727
12456B90727Q64J118K876M642M994O970N248L304O588N204J913K03M211M850o01
$$ 290727 291591 292709 295585 300227 305221 312191 317439 320743 327331 332535 334448 334651 338862 343712 343111
12441C43111q75J233j969m080O86O480l5M437M490J540K381K771k488p91L149
$$ 343111 342236 343469 341500 337420 338106 344586 344551 348988 353478 355018 357399 360170 357682 356891 360040
12426C60040K338Q75L977P397O189M293J28K142J649K200L342m78J530l360L498
$$ 360040 362378 363253 367230 374627 380816 385109 385237 387379 389028 391228 394570 394092 395622 392262 395760
12411C95760O324L358K546M762J0840J4929J6135J4051J0817R372J4983J6712
$$ 395760 402084 405442 407988 412750 423590 438519 454654 468705 479522 488894 503877 520589
12399E20589R944J7707J7201J6220Q912Q435M033K43k753K710K126K891L514J945
$$ 520589 530533 548240 565441 581661 590573 599008 603041 603284 600531 603241 605367 608258 611772 613717
12385F13717Q118J2795J4360J9236J2501K0313K0910J5716J5294K6204K8528K4268
$$ 613717 621835 634630 648990 668226 680727 701040 721950 737666 752960 779164 807692 831960
12373H31960K6878L2853L7157L6176M7461M5951N2182N8597O4485O9051P7508
$$ 831960 858838 891691 928848 965024 1012485 1058436 1110618 1169215 1233700 1302751 1380259
12362A380259R0009R5966J07536J18362J30774J42917J60913J83153K02799K23631
$$ 1380259 1470268 1566234 1673770 1792132 1922906 2065823 2226736 2409889 2612688 2836319
12352B836319K61121K90792L33405L83472M41099N17292O06449P04336Q10821
$$ 2836319 3097440 3388232 3721637 4105109 4546208 5063500 5669949 6374285 7185106
12343G185106R36173J066809J188992J284899J340926J329066J222868J027898
$$ 7185106 8121279 9188088 10377080 11661979 13002905 14331971 15554839 16582737
12335A6582737P57385M38216J00124k05675m58383o32729p40758p96533p98942
$$ 16582737 17340122 17778338 17878462 17672787 17214404 16581675 15840917 15044384 14245442
12326A4245442p71825p11261o26884n16877l85054k49158j07296M6267J98826
$$ 14245442 13473617 12762356 12135472 11618595 11233541 10984383 10877087 10923354 11122180
12317A1122180L50196N01260O36412P57122Q64337R33687R65027R33712Q35847
$$ 11122180 11472376 11973636 12610048 13367170 14231507 15165194 16130221 17063933 17899780
12308A7899780O50564L83002N7407l02462o54687r50541j160680j268429j278896
$$ 17899780 18550344 18933346 18990753 18688291 18033604 17083063 15922383 14653954 13375058
12299A3375058j220483j113334r79064q36252p19222n98806m90355l94311l05308
$$ 13375058 12154575 11041241 10062177 9225925 8506703 7907897 7417542 7023231 6717923
12290F717923k30310j59527q9334l4704K0876P2106J35690J97416K57142L30577
$$ 6717923 6487613 6328086 6238752 6204048 6224924 6297030 6432720 6630136 6887278 7217855
12280G217855M10537N08030O15741P43227Q90053J057308J244351J459202J692844
$$ 7217855 7628392 8136422 8752163 9495390 10385443 11442751 12687102 14146304 15839148
12271A5839148J925866K141143K306686K374829K307739K070391J668855J117933
$$ 15839148 17765014 19906157 22212843 24587672 26895411 28965802 30634657 31752590
12263C1752590M79716j87408q00527j291846j630361j806769j839458j757653
$$ 31752590 32232306 32044898 31244371 29952525 28322164 26515395 24675937 22918284
12255B2918284j595729j395457j153336q92227o36098l82812j29420J27735L86371
$$ 22918284 21322555 19927098 18773762 17881535 17245437 16862625 16733205 16860940 17247311
12246A7247311O44230R12112J178244J441242J676028J860560J960083J944756
$$ 17247311 17891541 18803653 19981897 21423139 23099167 24959727 26919810 28864566
12238B8864566J763790J402140Q66546K07342n12048j208762j782699k190833
$$ 28864566 30628356 32030496 32897042 33104384 32592336 31383574 29600875 27410042
12230B7410042k410531k457889k374720k196734j981612j751332j528979j334106
$$ 27410042 24999511 22541622 20166902 17970168 15988556 14237224 12708245 11374139
12222A1374139j159330j006141q75087p61656o62306n78546n07143m50279m02574
$$ 11374139 10214809 9208668 8333581 7571925 6909619 6331073 5823930 5373651 4971077
12213D971077l58602l21902k94697k64242k42893k20668k02784j86171j72794
$$ 4971077 4612475 4290573 3995876 3731634 3488741 3268073 3065289 2879118 2706324
12204B706324j60656j49124j27930j17622j07860r8782q9634q3301p5886p5532
$$ 2706324 2545668 2396544 2268614 2150992 2043132 1944350 1854716 1771415 1695529 1619997
12194A619997o4944n5754n3292n2120m2330l7230l5780l4288k9794k2843k9645
$$ 1619997 1555053 1499299 1446007 1393887 1351557 1314327 1278547 1244259 1214465 1191622 1161977
12183A161977k0149j4372j7133j8681j0551j2898j2077r174r518k151m783o846
$$ 1161977 1141828 1127456 1110323 1091642 1081091 1068193 1056116 1046942 1037424 1035273 1030490 1023644
12171A023644n274L909J540j941l729j54J804o26L556J934J799o14q85o058j1447
$$ 1023644 1018370 1022279 1023819 1021878 1018149 1017995 1019799 1019173 1022729 1024663 1026462 1025848 1024963 1018905 1007458
12156A007458n867k744j905J860J03J331P525P480R473Q391L034O189J3343J1697
$$ 1007458 1001591 998847 996942 998802 998905 1000236 1007761 1015241 1024714 1033105 1036139 1042328 1055671 1067368
12142A067368J2629J6973J7981J8940K2908K0462K0877J9694K1583K3131K7722
$$ 1067368 1079997 1096970 1114951 1133891 1156799 1177261 1198138 1217832 1239415 1262546 1290268
12131A290268K5528K7687L5351L8185M3445M6853M6146N2927O1376O4078P1713
$$ 1290268 1315796 1343483 1378834 1417019 1460464 1507317 1553463 1606390 1667766 1731844 1803557
12120A803557P9745P9779Q5506R2238R9704J07321J19286J21274J31061J48032
$$ 1803557 1883302 1963081 2048587 2140825 2240529 2347850 2467136 2588410 2719471 2867503
12110B867503J63860J76120J89056K01913K22043K39092K63561K83841L13101
$$ 2867503 3031363 3207483 3396539 3598452 3820495 4059587 4323148 4606989 4920090
12101D920090L35927L65320M03904M39462M76001N20918N64498O11933O63563
$$ 4920090 5256017 5621337 6025241 6464703 6940704 7461622 8026120 8638053 9301616
12092I301616P20974P76887Q35101Q97154R66119J018956J077623J139053J187242
$$ 9301616 10022590 10799477 11634578 12531732 13497851 14516807 15594430 16733483 17920725
12083A7920725J224639J244731J244814J231729J208990J161220J098869J029110
$$ 17920725 19145364 20390095 21634909 22866638 24075628 25236848 26335717 27364827
12075B7364827R44994Q44046P35308O27491N18503M18107L07941K01122J12638
$$ 27364827 28309821 29153867 29889175 30516666 31035169 31453276 31761217 31962339 32074977
12066C2074977K1134p0994j63539k61193l59527m57243n69419o74318p77180q74514
$$ 32074977 32096111 32025117 31861578 31600385 31240858 30783615 30214196 29539878 28762698 27888184
12056B7888184r63203j039687j094211j135212j156949j165415j155681j135725
$$ 27888184 26924981 25885294 24791083 23655871 22498922 21333507 20177826 19042101
12048A9042101j096967j042761r82251r17129q63601q14703p65444p19487o80035
$$ 19042101 17945134 16902373 15920122 15002993 14139392 13324689 12559245 11839758 11159723
12039A1159723o20651n58108m93093m28925l67892l21120k68186k16681j74518
$$ 11159723 10539072 9980964 9487871 9058946 8691054 8369934 8101748 7885067 7710549
12030G710549j24102p9566l6496P762N0771R5432J33088J75861K29108K72727
$$ 7710549 7586447 7506881 7470385 7478147 7528918 7624350 7757438 7933299 8162407 8435134
12020H435134L22653L64882M02840M53434M98538N36518N75664O03507O22657
$$ 8435134 8757787 9122669 9525509 9978943 10477481 11013999 11589663 12193170 12815827
12011A2815827O32535O32184O25555O10116N87653N48466M89719M15160L43004
$$ 12815827 13448362 14080546 14706101 15316217 15903870 16452336 16942055 17357215 17700219
12002A7700219K74983K11278J57830J07797O6595K8158p050l7402p2815j08240
$$ 17700219 17975202 18186480 18344310 18452107 18518702 18546860 18539810 18502408 18429593 18321353
11992A8321353j49060k00606k55766l12329l64003m26186m81399n38782n91660
$$ 18321353 18172293 17971687 17715921 17403592 17039589 16613403 16132004 15593222 15001562
11983A5001562o39835o71103o93134o88259o80722o75322o63070o46405o20425
$$ 15001562 14361727 13690624 12997490 12309231 11628509 10953187 10290117 9643712 9023287
11974I023287n93264n65700n34675m94824m64418m27280l94951l69135l40306
$$ 9023287 8430023 7864323 7329648 6834824 6370406 5943126 5548175 5179040 4838734
11965D838734l12756k87626k66134k47240k24135k01037j88047j72539j61575
$$ 4838734 4525978 4238352 3972218 3724978 3500843 3299806 3111759 2939220 2777645
11956B777645j45809j36285j26648j10924r8764r1058r1189q4368p7098p5464
$$ 2777645 2631836 2495551 2368903 2257979 2159215 2068157 1976968 1892600 1815502 1740038
11946A740038p2691o7516n4160n0511n1277m7694m1981l8467l6763k7563k7721
$$ 1740038 1667347 1599831 1545671 1495160 1443883 1396189 1354208 1315741 1278978 1251415 1223694
11935A223694j9376j174N626K215q039j5852l0048m8419n5403m5088l6331k2759
$$ 1223694 1204318 1203144 1208770 1210985 1202946 1187094 1157046 1108627 1053224 1008136 971805 949046
11923I49046k4738k9587k4457j8330j9071j9398j4556j5619j8408j1295j1316
$$ 949046 924308 894721 870264 851934 832863 813465 798909 783290 764882 753587 742271
11912G42271j2044j1598r257p147q604o669q819j1422j1110j1256p866o779p56
$$ 742271 730227 718629 709372 702225 693621 686952 678133 666711 655601 644345 636479 629700 628944
11899F28944j093l260m811q7q62M455P876J1747K0628K7518L7245L8048K6557
$$ 628944 627851 624591 619780 619693 618831 623286 631162 642909 663537 691055 728300 766348 792905
11886G92905J5696L329j6371l1121k6353j9645j6679j7440j1790j2763j4239j5586
$$ 792905 808601 811930 795559 764438 738085 718440 701761 684321 672531 659768 645529 629943
11874F29943j5337j0128p712q188j5822j2951q960j2908o371K746R80l409O38
$$ 629943 614606 604478 596766 588578 572756 559805 550845 537937 531566 534312 535292 531883 532521
11861E32521Q080O83r34j590l054n756n240n008j508k151o579q091p606q524n375
$$ 532521 540601 541284 540350 538760 535706 529950 524710 519702 518194 516043 509464 501373 493767 485243 479868
11846D79868j3641n124N919K842m744n244j4909j9378j7150j3251l993q091m198
$$ 479868 466227 461103 467022 469864 465120 459876 444967 425589 408439 395188 391195 383104 378906
11833C78906r93l134n38l25r53j092j273J502N520M233P206N045J0480J3490Q864
$$ 378906 377913 374779 374241 373916 372963 371871 370598 372100 377620 381853 389059 394104 404584 418074 426938
11818D26938R222J2592J4326Q608Q850J0315O323M746P828j349l765j0465j5148
$$ 426938 436160 448752 463078 471686 480536 490851 497174 501920 509748 508399 504634 494169 479021
11805D79021j5132j9899r990j2455j7366j1803o156l350n419p364l967L376j120
$$ 479021 463889 443990 434000 421545 404179 392376 386220 382870 377451 370087 366120 369496 368376
11792C68376j053O633P393N627J0321M116R784Q163Q5P320N130Q90j592j2100
$$ 368376 367323 373956 381349 386976 397297 401413 411197 419360 419445 426765 431895 432785 431193 419093
11778D19093j6531j5749j6041j0330j3636j8525j4628q271j0872j3084p278m162
$$ 419093 402562 386813 370772 360442 346806 328281 313653 305382 294510 281426 274148 269986
11766B69986n436p487k492j103m973n1k327n606m306J262L854K715l521n321k954
$$ 269986 264550 257063 254571 253468 248495 248444 246117 240511 236205 237467 241321 244036 240515 235194 232240
11751B32240j232O15K643n350j728p70K536l162o424m403L342k184K439J805j350
$$ 232240 231008 231623 234266 228916 227188 226418 228954 225792 219368 214965 218307 216123 218562 220367 219017
11736B19017k945l93p1k086L217K81m386L278l450n99M159K138J57L20L443j142
$$ 219017 216072 215679 215608 213522 216739 217020 212634 215912 212462 211863 216022 218160 218317 218637 222080 220938
11720B20938j179M814R55j20j054J000m26J373J762p19n199k427J75q18J210o03
$$ 220938 219759 224573 225528 225408 224354 225354 224928 226301 228063 227344 222145 219718 219893 219075 220285 219682
11704B19682N862Q08N77j068K312m555Q5O23j237K354l97N364K513N063P550P279
$$ 219682 225544 226352 226929 225861 228173 223618 223703 224326 223089 225443 225046 230410 232923 237986 245536 252815
11688B52815P778L960J278M041M420M851j335J015l721J967m558q709q955o282
$$ 252815 260593 264553 265831 269872 274292 279143 277808 278823 275102 277069 272511 263802 254847 248565
11674B48565j0234n979o073j644K818n34n430l742n52K837K959N173N316J392
$$ 248565 238331 232352 226279 224635 227453 226919 221489 217747 217195 220032 222991 228164 233480 234872
11660B34872K602L639N480J1340P251Q925J0038N034J0473J2797J0399N957J5186
$$ 234872 237474 241113 246593 257933 265184 274109 284147 289181 299654 312451 322850 328807 343993
11647C43993J3434J0057J1392O715R41J0004M092N091K664J26j414r34k867K169
$$ 343993 357427 367484 378876 385591 386532 396536 400628 405719 408383 408509 407095 406161 403294 405463
11633D05463Q17n51R48m588j607j477L462O232M192O023N799l277m083L64J126
$$ 405463 406280 405729 406677 402089 400482 399005 402467 408699 412891 418914 424713 421436 417353 417717 418843
11618D18843j691J801o287o343m618j407k391J584l146n968m884j1901q555r129
$$ 418843 417152 418953 412666 406323 401705 400298 397907 399491 396345 390377 385493 373592 365037 355908
11604C55908j2911j5571j1458j3538j3884r913j3214j4997n731j389n415l175
$$ 355908 342997 327426 315968 302430 288546 278633 265419 250422 244691 243302 237887 234712
11592B34712J36n219n818k018k631k407n639k258n068n438m283M51L499p77N12
$$ 234712 234848 229629 223811 221793 219162 216755 211116 208858 203790 198352 194069 194520 198019 197242 197754
11577A97754q9K299j625j346n30K597K386j631m652L94r6M206P555M559J851K692
$$ 197754 197665 199964 198339 196993 196463 199060 201446 199815 195163 195557 195461 199667 207222 211781 213632 216324
11561B16324L458m61M321O980M005J0M783M281O073M444K097K499K302j960N74
$$ 216324 219782 219321 223642 230622 234627 234637 239420 243701 249774 254218 256315 258814 261116 259156 259730
11546B59730K383j77k128j727m684j093k349L560m001p945L92k132J90J98p492
$$ 259730 262113 261936 259808 258081 253397 252304 249955 253515 249514 241569 241961 239829 240019 240217 232725
11531B32725o878k436n144k109j673k490n151p210K117K85m688l601k520l751
$$ 232725 225847 223411 218267 216158 214485 211995 206844 199634 201751 202036 197348 193747 191227 187476
11517A87476o031m026k289M790O2R64M0J72j029k750M714K829L007m889k734j755
$$ 187476 181445 177419 175130 179920 179982 180946 180986 181158 180129 177379 182093 184922 187929 183040 180306 178551
11501A78551J784J82Q19M067N67J78l933l105k718n319j819R43N705j019l306
$$ 178551 180335 180517 181336 185403 185970 186148 182215 179110 176392 171073 169254 170197 175902 174883 171577
11486A71577l821l142N336j896j087J254k311k314m48j516j027j152L47l808K411
$$ 171577 167756 164614 169950 168054 166967 168221 165910 163596 163148 161632 160605 159453 159800 155992 158403
11471A58403N576q43J28o35K380L725J554K560k928j462o860m938p468q65J099
$$ 158403 163979 163136 163264 162629 165009 168734 170288 172848 169920 168458 161598 156660 149192 148327 149426
11456A49426j326j398n23M102L449j800r53J13j766M542O121J446J721K630J755
$$ 149426 148100 146702 146179 150281 153730 151930 150977 151090 149324 153866 159987 161433 163154 165784 167539
11441A67539k76k527k749O87L591P21K208l474L204O241P541R660N212N488Q345
$$ 167539 167263 164736 161987 162674 166265 166986 169194 165720 168924 175165 182706 192366 197578 203066 211411
11426B11411K084K857p93r002l049l454l645l923j614m001p475k871J474l099
$$ 211411 213495 216352 215559 206557 203508 200054 196409 192486 190872 186871 179396 176525 177999 174900
11412A74900N09K274n74r21o622m642l818k184P14p185j475N422L829Q01K700
$$ 174900 175409 177683 177109 176188 169566 164924 161106 158922 159636 152451 150976 156398 160227 161028 163728
11397A63728L545M27L867l133m084j567O18N035P16l487j264O787K67k317o923
$$ 163728 167273 167700 171567 168434 164350 162783 163401 168436 169152 165665 164401 171188 171455 169138 162215
11382A62215k792j786j555K256j06Q98L312N560K672p10L179L732K340L572J323
$$ 162215 159423 157637 156082 158338 158232 159130 162442 168002 170674 169964 173143 176875 179215 182787 184110
11367A84110O02k126j766q59K943N942K220j534L930Q552M216J0936N879l239
$$ 184110 184712 182586 180820 179961 182904 188846 191066 189532 193462 202014 206230 217166 223045 219806
11353B19806J410O297j75l421j624J735o48n546l922K00m951k301j327O241N110
$$ 219806 221216 227513 227338 223917 222293 224028 223380 217834 213912 214112 209161 206860 205533 211774 216884
11338B16884j511k966L470Q103N327J472K77M50K399J690L256J81K068J702K268
$$ 216884 215373 212407 215877 223980 229307 230779 231056 231506 233905 235595 238851 239032 241100 242802 245070
11323B45070P17J1084J0420Q770J3922J5183J7731J9127K1223J4439J618j0115
$$ 245070 245787 256871 267291 276061 289983 305166 322897 342024 363247 377686 379304 369189
11311C69189j4111j7872j4210j2566q049o011m78K80O816J8466J9706K2875K5704
$$ 369189 355078 337206 322996 310430 302381 296370 295892 296172 302988 321454 341160 364035 389739
11298C89739K2969J5882J4482N482l448j1085j1434r078j7815j5966r278l593
$$ 389739 412708 428590 443072 448554 445106 434021 422587 413509 395694 379728 370450 366857
11286C66857m521R52L471K449p6J761N092J516l909o798l15P12J080k79L75N504
$$ 366857 362336 363288 366759 369208 369132 370893 375985 377501 373592 366794 366479 367191 368271 367992 368367 373871
11270C73871J3752J6859K2591K9380K1592J3769J0668J1639N714m115m328j433
$$ 373871 387623 404482 427073 456453 478045 491814 502482 514121 519835 515720 511392 509959
11258E09959q805j3127k0411k3926k0790j7162r548j45k668J000J1115J9478K1460
$$ 509959 501154 488027 467616 443690 422900 405738 396190 396045 393377 394377 405492 424970 446430
11245D46430K3279J8672J6215J2556N793j06j0517j6460k1642j7684j1938r374
$$ 446430 469709 488381 504596 517152 522945 522839 512322 495862 474220 456536 444598 435224
11233D35224J63J2269J6532J2892J0467M849M575j415j087o769j2462o833m936
$$ 435224 435387 447656 464188 477080 487547 492396 496971 495556 494469 487700 475238 468405 463469
11220D63469o801n226n632L875Q48N961l30K190R964J1382J1604K679l094m879
$$ 463469 456668 451442 445810 449685 450533 456494 456164 458354 468318 479700 491304 493983 490889 486010
11206D86010n985o519j2790j2961r457q475j4349p421n533k140K032j509n898
$$ 486010 480025 473506 460716 447755 438298 429823 415474 408053 402520 400380 402412 400903 395005
11193C95005n697j3342j5150j2372r702r006n344r363p133m770k964l370r7k128
$$ 395005 389308 375966 360816 348444 338742 329736 324392 315029 307896 303126 300162 296792 296695 294567
11179B94567j340j077L880N944M736j484m184j841m317n928n892j546k48K045
$$ 294567 293227 292150 296030 301974 306710 305226 301042 299201 294884 288956 283064 281518 281270 283315
11165B83315R08j003J37j928K343J959O30q6n456j43N722L686N556J714l613m68
$$ 283315 284223 283220 283357 281429 283772 285731 286361 286275 280819 280676 286398 290084 295640 297354 293741 293273
11149B93273K379N861M654O854N221O961K571N216L615M808N516L367K361k05
$$ 293273 295652 301513 306167 313021 318242 325203 327774 332990 336605 341413 346929 350296 352657 352452
11135C52452o222q167m463k308l28K918M068r67L705J1317Q442K715J0259J5414
$$ 352452 346230 338063 333600 331292 330964 333882 337950 336983 340688 352005 360447 363162 373421 388835
11121C88835J1248N887L662J57K304N322q13n408o036M826R842M434M777N920
$$ 388835 400083 405970 409632 409789 412093 417415 416602 411194 405158 409984 419826 424260 429037 434957
11107D34957Q65M446N910J055l016m634p489l820j13k22p798l545K439p58K650
$$ 434957 435822 440268 446178 447233 444217 439583 432094 428274 428161 427939 420141 416596 419035 418277 420927
11092D20927J692K577j135m061J941R08r30M222M405m57k74l677p565q056l800
$$ 420927 422619 425196 424061 420000 421941 422849 421919 426141 430546 430089 429815 426138 418573 410517 406717
11077D06717j845K595N455N921J1571N212L483N561p17k663m296m515J234K80
$$ 406717 404872 407467 412922 418843 430414 435626 439109 444670 443953 441290 436994 432479 433713 433993
11063D33993P77j881k759l803p81J264J0384N207J721K645O680M807N694N171
$$ 433993 434770 432889 430130 426327 425546 426810 437194 442401 444122 446767 453447 458254 463948 469119
11049D69119N294Q086Q650j837L667N841O687Q603J1160M673J459J683k359R24
$$ 469119 474413 482499 491149 489312 492979 498820 505507 514110 525270 529943 531402 533085 530726 531650
11035E31650M362M65n717k357J017k991J426K302n86j311m59l914j554n309j738
$$ 531650 536012 536477 530760 528403 529420 526429 527855 530157 529571 528260 527801 523887 522333 517024 515286
11020E15286m620n667o391n755j632j752j2170j3720m948p362M18K255j527p52
$$ 515286 510666 504999 498608 492853 491221 489469 477299 463579 458631 451269 451687 453942 452415 451663
11006D51663J900L253m404J906L987l511J746R221R095R289Q790L899L184J350
$$ 451663 453563 456816 452412 454318 458305 454794 456540 465761 474856 484145 492935 496834 500018 501368
10992E01368K486J283j011k697j865l317l640J682N40O027O652K890N988N374
$$ 501368 503854 505137 504126 501429 499564 496247 492607 494289 494829 500856 507508 510398 516386 521760
10978E21760J0255J1810J4232J4221J2672J5237K3253J8483J2212J0263J2908
$$ 521760 532015 543825 558057 572278 584950 600187 623440 641923 654135 664398 677306
10967F77306M264K659Q817O076J4824J4252J5366K3609K0448K2892K6107K8002
$$ 677306 681570 684229 693046 699122 713946 728198 743564 767173 787621 810513 836620 864622
10955H64622L4125L3431L1759L5835L7313L3246K4106K1099K2679J7184K1301
$$ 864622 898747 932178 963937 999772 1037085 1070331 1094437 1115536 1138215 1155399 1176700
10944A176700K0156J9104K9204L7667M7787N7026N3580N5739O2368O6054O2781
$$ 1176700 1196856 1215960 1245164 1282831 1330618 1387644 1441224 1496963 1559331 1625385 1688166
10933A688166N8964N7766O4475O2119O5540P6105P8666R0397J02566J16573J24285
$$ 1688166 1747130 1804896 1869371 1931490 1997030 2073135 2151801 2242198 2344764 2461337 2585622
10922B585622J30858J52470J76771J97114K23380K76192L46143M39802N59387
$$ 2585622 2716480 2868950 3045721 3242835 3466215 3742407 4088550 4528352 5087739
10913E087739P27708R44891J187031J431471J639831J734637J652078J367752
$$ 5087739 5815447 6760338 7947369 9378840 11018671 12753308 14405386 15773138
10905A5773138Q85739K83232l15767q06481j108046j179407j055482p93519m45675
$$ 15773138 16658877 16942109 16626342 15819861 14711815 13532408 12476926 11683407 11237732
10896A1237732o4293L53783Q13797J344615J943438K577704L162826L573264L660372
$$ 11237732 11173439 11527222 12341019 13685634 15629072 18206776 21369602 24942866 28603238
10887B8603238L301474K451970J219034k07926j584448k660611l275346l396705
$$ 28603238 31904712 34356682 35575716 35367790 33783342 31122731 27847385 24450680
10879B4450680l107545k556929j892451j226579o10603m5106N01676J060373J607485
$$ 24450680 21343135 18786206 16893755 15667176 15056573 15011467 15513143 16573516 18181001
10870A8181001K093463K435289K537951K342390J840214J117712L22574l81383
$$ 18181001 20274464 22709753 25247704 27590094 29430308 30548020 30870594 30489211
10862C0489211q63288j067150j013481p78435m47734o2959L50970Q13012J304314
$$ 30489211 29625923 28558773 27545292 26766857 26319123 26256164 26607134 27420146 28724460
10853B8724460J764809K093468K178288J949098J396221O42441j52797p95470
$$ 28724460 30489269 32582737 34761025 36710123 38106344 38748785 38595988 37800518
10845C7800518j153482j165391q72056l48254L17065R95524J544641J843467J776356
$$ 37800518 36647036 35481645 34609589 34261335 34578400 35573924 37118565 38962032 40738388
10836D0738388J284923M17863o64222j781203k720974l325248l530356l374225
$$ 40738388 42023311 42441174 41776952 39995749 37274775 33949527 30419171 27044946
10828B7044946k939231k341292j688403j031396m00202K32150R05495J663064
$$ 27044946 24105715 21764423 20076020 19044624 18644422 18876572 19782067 21445131
10820B1445131K486564L314410M034459M434962M331249L614556K306303N84883
$$ 21445131 23931695 27246105 31280564 35715526 40046775 43661331 45967634 46552517
10812D6552517j218774k754658l747207m085975l806396l063068k072360j006551
$$ 46552517 45333743 42579085 38831878 34745903 30939507 27876439 25804079 24797528
10804B4797528N6064J099965K119606L067520L824570M238244M186269L628120
$$ 24797528 24853592 25953557 28073163 31140683 34965253 39203497 43389766 47017886
10796D7017886K620193J359209J12707q80092j411739j420652r85565l12626L25947
$$ 47017886 49638079 50997288 51109995 50229903 48818164 47397512 46411947 46099321 46425268
10787D6425268O64175N60611R704q42855j758212k501975k907673k936192k648545
$$ 46425268 47089443 47650054 47659758 46816903 45058691 42556716 39649043 36712851 34064306
10778C4064306k191667j731990j380956j205765j225941j399015j654140j911979
$$ 34064306 31872639 30140649 28759693 27553928 26327987 24928972 23274832 21362853
10770B1362853k091868k151943k087469j926482j695943j445401j203218r82671
$$ 21362853 19270985 17119042 15031573 13105091 11409148 9963747 8760529 7777858
10762G777858q03904o60806n47017m56979l94832l47259l10136k79805k50500
$$ 7777858 6973954 6313148 5766131 5309152 4914320 4567061 4256925 3977120 3726620
10753C726620k28004k01835j79110j61168j48153j30652j20905j04994r1899p6530
$$ 3726620 3498616 3296781 3117671 2956503 2808350 2677698 2556793 2451799 2359900 2283370
10743B283370p1558o8170o3047m6168l7996l4137k5102k1666j6502j1922J691
$$ 2283370 2211812 2143642 2080595 2034427 1996431 1962294 1937192 1915526 1899024 1887102 1888793
10732A888793J1449K0322L3870M1805O0594P3491P7548P7792O8821O5324N6315
$$ 1888793 1900242 1920564 1954434 1996239 2056833 2130324 2207872 2285664 2354485 2419809 2476124
10721B476124N2364N1969O4461Q3161J01520J17016J23750J29813J32853J15802
$$ 2476124 2528488 2580457 2644918 2728079 2829599 2946615 3070365 3200178 3333031 3448833
10711C448833R3392Q4241Q2043Q7562J14576J66509K37238L18489M06548N13411
$$ 3448833 3542225 3626466 3708509 3796071 3910647 4077156 4314394 4632883 5039431 5552842
10701E552842O38140P71393R08099J036814J103175J099405J000566Q04445N30164
$$ 5552842 6190982 6962375 7870474 8907288 10010463 11109868 12110434 12914879 13445043
10692A3445043K43042J6178j21437j37700l5780J54366L99173O49628Q77843J052233
$$ 13445043 13688085 13704263 13582826 13445126 13409346 13563712 13962885 14612513 15490356 16542589
10682A6542589J164777J225683J238207J188734J069135Q56456N41506J41155
$$ 16542589 17707366 18933049 20171256 21359990 22429125 23285581 23827087 23968242
10674B3968242k78070o42290q84744r45698q29855n63243k05628J60299M37725
$$ 23968242 23690172 23047882 22163138 21217440 20387585 19824342 19618714 19779013 20216738
10665B0216738N61060N04206K74462m4701l68656o20283p58580p93380p69881
$$ 20216738 20777798 21282004 21556466 21511765 21143109 20522826 19764246 18970866 18200985
10656A8200985p65559p99522q64055r13438r21233q50626p00687n02987k85814
$$ 18200985 17435426 16635904 15771849 14858411 13937178 13086552 12385865 11882878 11597064
10647A1597064r8850K1235N8938q375j62734l63350n48737o84543p23159o77245
$$ 11597064 11498214 11519449 11578387 11570012 11407278 11043928 10495191 9810648 9087489 8410244
10637H410244n60366m02843k27755m3806J44751L47145N58249P88872R96534J145746
$$ 8410244 7849878 7447035 7219280 7175474 7320225 7667370 8225619 9014491 10011025 11156771
10627A1156771J193369J108277Q90961N79683K44965k8210j81086j88119m8892
$$ 11156771 12350140 13458417 14349378 14929061 15174026 15145816 14964730 14776611 14727719
10618A4727719J90156M88957P98150J061071J244547J320613J325493J283190
$$ 14727719 14917875 15406832 16204982 17266053 18510600 19831213 21156706 22439896
10610B2439896J217234J132156J001716P86973M73813O7728l59759p24457r27899
$$ 22439896 23657130 24789286 25791002 26577975 27051788 27119516 26759757 26035300 25107401
10601B5107401r29135p27261l81957K1037L71912N95628O34509M77235J53780
$$ 25107401 24178266 23451005 23069048 23090085 23461997 24057625 24692134 25169369 25323149
10592B5323149k34555o04462q63486r94537j027472j009662j001670j008924j054085
$$ 25323149 25088594 24484132 23620646 22626109 21598637 20588975 19587305 18578381 17524296
10583A7524296j076593j033530r21931p49314n37009l20028j42654m2112n1997
$$ 17524296 16447703 15414173 14492242 13742928 13205919 12885891 12743237 12701125 12649128
10574A2649128j76626l86127o27892q47803j001683j059669j029462r38033q10740
$$ 12649128 12472502 12086375 11458483 10610680 9608997 8549328 7519866 6581833 5771093
10565E771093o90959n70726m67896l89943l30302k84178k42601k04361j77039
$$ 5771093 5080134 4509408 4041512 3651569 3321267 3037089 2794488 2590127 2413088
10556B413088j47018j26315j04177q1374p2159n8430n6345n6814o1210o8920p3014
$$ 2413088 2266070 2139755 2035578 1954204 1882045 1823615 1767270 1710456 1649246 1580326 1507312
10545A507312o9358o2713n3434n6263n3070m0887k7483k7746k7123j6683k6358
$$ 1507312 1437954 1375241 1321807 1265544 1212474 1171587 1144104 1116358 1089235 1072552 1046194
10534A046194k2743j8430r801j1309k2427k2936k1129j7300j9466j3316k782m491
$$ 1046194 1023451 1005021 995220 983911 961484 938548 917419 900119 880653 867337 864555 860064
10522H60064n690j239K936M916O347J5346K0016K6170K3030K4099K6543M4262
$$ 860064 854374 853135 856071 860987 867334 882680 902696 928866 951896 975995 1002538 1046800
10510A046800O9623R5305J41354K07393K95175L81647M37314M05358K70619P9691
$$ 1046800 1116423 1211728 1353082 1560475 1855650 2237297 2674611 3079969 3350588 3430279
10500C430279j30894l16161m22017m16234l46027k56950j88134j36117j01002
$$ 3430279 3299385 2983224 2561207 2144973 1798946 1541996 1353862 1217745 1116743
10491A116743p3985o0330m3563l8173l0609k4194k0136j6732j0642o577r277q618
$$ 1116743 1042758 982428 938865 900692 870083 845889 825753 809021 798379 791802 782525 773907
10479G73907j2666j3763j9249k0784k1197j4525j1405r182J613p62N093J2691
$$ 773907 761241 747478 728229 707445 686248 671723 660318 651136 652749 651987 657080 669771
10467F69771J7037J4740J4560J1071Q164J74j1637j3272j3782o726K788L989O911
$$ 669771 686808 701548 716108 727179 735343 735517 723880 710608 696826 690100 692888 696877 703788
10454G03788M863J4031J5305J1404J0741J3783J2328Q165K938l142m585p363j1741
$$ 703788 708651 722682 737987 749391 760132 773915 786243 794408 797346 794204 789619 782256 770515
10441G70515j4518p544k868O439J1777K0008L1721L2494L2653L5302L7558L3550
$$ 770515 755997 748453 745585 752024 763801 783809 815530 848024 880677 915979 953537 987087
10429I87087L0520L2188M3953N6809P6903R5978J22127J56631K19128L14331L97042
$$ 987087 1017607 1049795 1093748 1150557 1227460 1323438 1445565 1602196 1821324 2135655 2532697
10418B532697M26393L60366K02800M485j99913l62912m25426l87148l06771k26778
$$ 2532697 2959090 3319456 3522256 3526741 3326828 2963916 2538490 2151342 1844571 1617793
10408A617793j64841j14561p8588o0466m2726l0153j4579k958k224J063o707r592
$$ 1617793 1452952 1338391 1259803 1199337 1156611 1126458 1111879 1108921 1106697 1107760 1101053 1091461
10396A091461j9553k7076k8831k6262k8067k5232k9764k4796k2204j5744j3218
$$ 1091461 1071908 1044832 1016001 989739 961672 936440 906676 881880 859676 843932 830714
10385H30714j6381j1105j3615q314l801o30P635J5809K2531J9234J8036J4988
$$ 830714 814333 803228 789613 781299 777498 776868 784503 800312 822843 842077 860113 875101
10373H75101J1172J0305J7760J5316K1206K8785K5496K1183K3286J7496J8055
$$ 875101 886273 896578 914338 929654 950860 979645 1005141 1026324 1049610 1067106 1085161
10362A085161J1428R171o299j1210j3364p974m015n761L018J0332Q852J0022J1536
$$ 1085161 1096589 1105760 1099461 1088251 1074887 1066913 1062898 1057137 1060155 1070487 1079339 1089361 1100897
10349A100897J2055J6808J5738J3860J4606K2203K3428K0443K3880K5372K5808
$$ 1100897 1112952 1129760 1145498 1159358 1173964 1196167 1219595 1240038 1263918 1289290 1315098
10338A315098L1117L0047J2019k386j0158j8326l1921l5661k9682j8540j0904
$$ 1315098 1346215 1376262 1388281 1385895 1375737 1357411 1325490 1289829 1260147 1241607 1230703
10327A230703q872n275q792j2346j2289j1334m074M696M762Q703J5817K2972L3388
$$ 1230703 1221831 1216556 1207764 1195418 1183129 1171795 1167721 1172417 1177179 1185882 1201699 1224671 1258059
10314A258059L8899M1343M3227M0567L6223L6973M0073M2937M4228M5537M3247
$$ 1258059 1296958 1338301 1381528 1422095 1458318 1495291 1535364 1578301 1622529 1668066 1711313
10303A711313N3383N9456P3382Q5010R0015J09476J28426J48487J65044J82180
$$ 1711313 1764696 1824152 1897534 1982544 2072559 2182035 2310461 2458948 2623992 2806172
10293B806172K05112K38791K88501L56371M40272N54084P09955R39788J262658
$$ 2806172 3011284 3250075 3538576 3894947 4335219 4889303 5599258 6539046 7801704
10284G801704J685315K180159K628763K803019K481032J659354N05819p57833
$$ 7801704 9487019 11667178 14295941 17098960 19579992 21239346 21745165 20987332
10276B0987332j861496k489219k522635k133036j592050j072203o04913k28726
$$ 20987332 19125836 16636617 14113982 11980946 10388896 9316693 8711780 8483054
10268H483054R1537M22360Q23600J331555J904959K338347K318264J703264O69709
$$ 8483054 8574591 8996951 9820551 11152106 13057065 15395412 17713676 19416940 20086649
10259B0086649n38237j723349k530112k675552k287900j741277j258013r10033
$$ 20086649 19548412 17825063 15294951 12619399 10331499 8590222 7332209 6422176
10251F422176o70595n13629l97953l05019k42775j92998j50067j06777p9702m5920
$$ 6422176 5751581 5237952 4839999 4534980 4292205 4099207 3949140 3842363 3762661 3716741
10241C716741p640L3959N8181N7530M8161L0846K5166M2655P2586R8709J22440
$$ 3716741 3709101 3743060 3801241 3858771 3906932 3937778 3962944 4005599 4078185 4176894 4299334
10230D299334J38821J58554J78361J93956K21249K70610L38126M16845N24651
$$ 4299334 4438155 4596709 4775070 4969026 5190275 5460885 5799011 6215856 6740507
10221F740507O67946Q41546J062301J375611J817781K424550L228596M153713
$$ 6740507 7408453 8249999 9312300 10687911 12505692 14930242 18158838 22312551
10213B2312551M907467N068449M470622L254031J531510m94252k298442l413190
$$ 22312551 27220018 32288467 36759089 40013120 41544630 41050378 38751936 35338746
10205C5338746l865294l832314l383367k611472j705531q04289N9854R18269J837665
$$ 35338746 31473452 27641138 24257771 21646299 19940768 19136479 19196333 20114602 21952267
10196B1952267K799794L586040L891027L498790K442165Q46315j101765k910507
$$ 21952267 24752061 28338101 32229128 35727918 38170083 39016398 37914633 35004126
10188C5004126m069975m521325m406934l845398l074231k350664j777608j373098
$$ 35004126 30934151 26412826 22005892 18160494 15086263 12735599 10957991 9584893
10180I584893j083099q71300p22498o00519m84571l75880k81785k11706j51531
$$ 9584893 8501794 7630494 6907996 6307477 5822906 5447026 5165241 4953535 4802004
10171D802004r8776m7843k4569k3753l2571n3494n5507n5639m7507l3402j0516
$$ 4802004 4703228 4655385 4630816 4607063 4574492 4520998 4465491 4409852 4362345 4328943 4318427
10160D318427L5419Q8595J33974J59117J84865K05781K39138K59346K72380K87471
$$ 4318427 4353846 4442441 4576415 4735532 4920397 5126178 5365316 5624662 5897042 6184513
10150F184513L14779L79517N07532P15672J010421J438338K039448K793208L519847
$$ 6184513 6499292 6878809 7386341 8102013 9112434 10550772 12590220 15383428 18903275
10141A8903275L818789L313347K087434M92840j208597k622078l218014k927865
$$ 18903275 22722064 26035411 28122845 28615685 27407088 24785010 21566996 18639131
10133A8639131k163768j360333o98160j69509K87403P36352J233899J804400K402729
$$ 18639131 16475363 15115030 14416870 14247361 14534764 15271116 16505015 18309415 20712144
10124B0712144K824019K791014K156517J039677l06678j607272k520536k791678
$$ 20712144 23536163 26327177 28483694 29523371 29216693 27609421 25088885 22297207
10116B2297207k494163j930615j362960r17285n73502l05893o8096J56327L74865
$$ 22297207 19803044 17872429 16509469 15592184 15018682 14712789 14644693 14801020 15175885
10107A5175885O11295Q56632J098276J358956J659420K015090K382219K719335
$$ 15175885 15787180 16643812 17742088 19101044 20760464 22775554 25157773 27877108
10099B7877108L050104L397812L792369M293741N067841O261112Q044273J0700690
$$ 27877108 30927212 34325024 38117393 42411134 47478975 53740087 61784360 72485050
10091G2485050J4507055J9887667K7717290L9003307N4308287P1321509Q1043720
$$ 72485050 86992105 106879772 134597062 173600369 227908656 299230165 380273885
10084C80273885P1954531M5898595J5901281j5245805m9246269p5579128q0903601
$$ 380273885 452228416 498127011 514028292 498782487 449536218 373957090 293053489
10077B93053489o8653066n1531649l7000360k6502807j9286213j4321957j0778580
$$ 293053489 224400423 172868774 135868414 109365607 90079394 75757437 64978857
10070F4978857q185619o337865n044058m181016l703284l455952l242409l024527
$$ 64978857 56793238 50455373 45411315 41230299 37527015 34071063 30828654 27804127
10062B7804127k813289k541456k188661j816286j486899j233322j069465r71978
$$ 27804127 24990838 22449382 20260721 18444435 16957536 15724214 14654749 13682771
10054A3682771q93712q11055p16545o18155n14339m15286l23578k42674j87396
$$ 13682771 12789059 11978004 11261459 10643304 10128965 9713679 9390101 9147427 8960031
10045H960031j60305j70395j94310k05555j90683j52967j18255p7555l4814K6581
$$ 8960031 8799726 8629331 8435021 8229466 8038783 7885816 7767561 7690006 7655192 7681773
10035G681773J14151K12950K87960L30442L54882L57442L53228L66967L95388
$$ 7681773 7795924 8008874 8296834 8627276 8982158 9339600 9692828 10059795 10455183
10026A0455183M28016M94660O01044P42705Q94829J062982J256911J483855J765255
$$ 10455183 10883199 11377859 11978903 12721608 13616437 14679419 15936330 17420185 19185440
10017A9185440K102657K415696K607444K700547K821115L074847L539462M341296
$$ 19185440 21288097 23703793 26311237 29011784 31832899 34907746 38447208 42788504
10009D2788504N616287P392578R829490J3301020J8323670K5612794L6197789
$$ 42788504 48404791 55797369 65626859 78927879 97251549 122864343 159062132
10002A59062132N1024747O8824843Q1917058P7201300N2587113K2385570q021012
$$ 159062132 210086879 278911722 360828780 438030080 490617193 513002763 504981751
9995E04981751m2452682p2371899q1562606p0799111n3595916l8640759k7770879
$$ 504981751 462529069 390157170 308594564 237795453 184199537 145558778 117787899
9988A17787899k0311027j5199673j1507660q661218o419545m666062l398800k693349
$$ 117787899 97476872 82277199 70769539 62108321 55688776 51022714 47623914 44930565
9980D4930565k450108k487837k693559k922215k969009k761990k393371j972488
$$ 44930565 42480457 39992620 37299061 34376846 31407837 28645847 26252476 24279988
9972B4279988j577975j241798r49736o72925m02860j41610N6281J52181J47959
$$ 24279988 22702013 21460215 20510479 19837554 19434694 19293084 19349365 19501546 19649505
9963A9649505L4372j52566l62926n47424o55808o62528n65251l91302j56407J16063
$$ 19649505 19683877 19531311 19168385 18620961 17965153 17302625 16737374 16346072 16189665 16305728
9953A6305728L92941O13705P54996Q12030Q13731P93942Q27485R67435J224359
$$ 16305728 16698669 17312374 18067370 18879400 19693131 20487073 21314558 22281993 23506352
9944B3506352J548634J842175J984798J852316J433005P84644J7103o92959j219000
$$ 23506352 25054986 26897161 28881959 30734275 32167280 32951924 32969027 32276068 31057068
9935C1057068j506770j545405j410693j187637r15721n95462j91584L21234R20997
$$ 31057068 29550298 28004893 26594200 25406563 24490842 23895380 23703796 24025030 24946027
9926B4946027J547834K077521K366626K318059J936161J295877N28940k37074
$$ 24946027 26493861 28571382 30938008 33256067 35192228 36488105 37017045 36779971
9918C6779971q91540j383783j719455j899875j933693j836182j602268j233562
$$ 36779971 35888431 34504648 32785193 30885318 28951625 27115443 25513175 24279613
9910B4279613p41222j64270M39887J017974J526871J926831K162991K154901J865512
$$ 24279613 23538391 23374121 23814008 24831982 26358853 28285684 30448675 32603576 34469088
9901C4469088J302357N65356j91117q04355j153934j159524q42617k79228M32870
$$ 34469088 35771445 36336801 36145684 35341329 34187395 33027871 32185254 31906026 32338896
9892C2338896J203902J875243K312554K432768K177731J584952Q04307N4258m33652
$$ 32338896 33542798 35418041 37730595 40163363 42341094 43926046 44730353 44784611 44350959
9883D4350959n19342j78903N02294J380607K294324L155480L919657M597104N195553
$$ 44350959 43831617 43652714 44155008 45535615 47829939 50985419 54905076 59502180 64697733
9874F4697733N638462N853560N721739N198048M333998L267856K175951J154700
$$ 64697733 70336195 76189755 81911494 87109542 91443540 94711396 96887347 98042047
9866I8042047J94233p46331j711850k688799l598624m305737m684378m671422
$$ 98042047 98236280 97489949 95778099 93089300 89490676 85184939 80500561 75829139
9858G5829139m287224l659395k974254k430050k195603k350823k841743l517149
$$ 75829139 71541915 67882520 64908266 62478216 60282613 57931790 55090047 51572898
9850E1572898m177022m625073m749679m552822m129944l594947l036857k518469
$$ 51572898 47395876 42770803 38021124 33468302 29338358 25743411 22706554 20188085
9842B0188085k069382j697003j390950j138570r42764p93267o69397n65266m83045
$$ 20188085 18118703 16421700 15030750 13892180 12949416 12156149 11486752 10921486 10438441
9833A0438441m01783l24448k61052k04885j46646j04365p1088l8283j6792L471
$$ 10438441 10036658 9712210 9451158 9246273 9099627 8995262 8924174 8885891 8869099 8872570
9823H872570L9561R2082J60174K53170L56734M83697O33514Q06435J011113J263548
$$ 8872570 8912131 9004213 9164387 9417557 9774291 10257988 10891502 11697937 12709050 13972598
9813A3972598J558490J926987K377711K926094L539028M176672M772016N203149
$$ 13972598 15531088 17458075 19835786 22761880 26300908 30477580 35249596 40452745
9805D0452745N280233M863341L875113K349488M83471j435316l100697m267866
$$ 40452745 45732978 50596319 54471432 56820920 57304391 55869075 52768378 48500512
9797D8500512m848247m869301m475921l871612l183503k515079j894388j332723
$$ 48500512 43652265 38782964 34307043 30435431 27251928 24736849 22842461 21509738
9789B1509738q42391m44056j62830l7459q3416k89334o01373r44161j247871j447193
$$ 21509738 20667347 20223291 20060461 20023002 19939586 19650252 19048879 18104718 16856847 15409654
9779A5409654j514318j467297j337297j161493r95624q34822o99887n90720m97725
$$ 15409654 13895336 12428039 11090742 9929249 8933625 8098803 7398916 6808196 6310471
9770F310471m28965l63926l11454k61761k09090j61091j24193r7131p2660n7100
$$ 6310471 5881506 5517580 5206126 4944365 4735275 4574184 4449991 4352860 4280200 4223100
9760D223100m8771k3907r496J0706M4263P9913J25654J81748K51869L34820M30060
$$ 4223100 4174329 4150422 4140926 4151632 4195895 4275808 4401462 4583210 4835079 5169899 5599959
9749E599959N45887O76640Q19823R79075J136678J258296J325880J287343J114343
$$ 5599959 6145846 6822486 7642309 8621384 9758062 11016358 12342238 13629581 14743924
9740A4743924Q03054L74082j21230n93715r80952j229058j334087j320696j222590
$$ 14743924 15546978 15921060 15799830 15206115 14225163 12996105 11662018 10341322 9118732
9731I118732j077155r27632p94620o72643n68650m92021m30855l71732l15812
$$ 9118732 8041577 7113945 6319325 5646682 5078032 4586011 4155156 3783424 3467612
9722C467612k75802k47186k21669j98037j78272j49867j31258j09527r9475q8427
$$ 3467612 3191810 2944624 2722955 2524918 2346646 2196779 2065521 1955994 1856519 1768092
9712A768092q4424p3971o3967n7353n3358m7827m4433m6395m9111m8181l9989
$$ 1768092 1683668 1609697 1545730 1488377 1435019 1387192 1342759 1296364 1247253 1199072 1159083
9701A159083l4209m1071l6832l2273l2371l0984k4895j2186j0316j0457q220j2237
$$ 1159083 1124874 1083803 1046971 1014698 982327 951343 926448 914262 903946 893489 885269 873032
9689H73032j9016k2847j8752j0219n369p853j387P56L16K391M537J0929J3727
$$ 873032 854016 831169 812417 802198 796829 788976 787589 788345 788661 791052 795589 806518 820245
9676H20245N220J599o80N65j403J268N803J2121K0805K9788N0401P2671R9907
$$ 820245 825465 827064 826384 826949 825546 826814 832617 844738 865543 895331 945732 1018403 1118310
9663A118310J48827K13224K87817L73989M23972L77224K33892L7315j77298l64264
$$ 1118310 1267137 1480361 1768178 2142167 2566139 2943363 3177255 3214570 3037272 2673008
9653B673008m43310m11115l28264k43871j68057j20665r0451o7626n8360m6255
$$ 2673008 2229698 1818583 1490319 1246448 1078391 957726 867275 799649 741289 695034
9643F95034m2871k9849k3026k0423j6993k5475l4995l1692k1982j1253j0282p039
$$ 695034 652163 622314 599288 578865 561872 536397 501402 469710 447728 436475 426193 419154
9631D19154o645p319n151r462q194m705m64m193j0556j0173j2722j1593n696r93
$$ 419154 412509 405190 400039 390577 382383 377678 377214 373021 362465 352292 339570 327977 322281 321288
9617C21288r188n930j96P650J8820K0930J3099M291P845p428j3241j3713j1648
$$ 321288 312100 306170 305974 313624 332444 353374 366473 370764 378609 371181 357940 344227 332579
9604C32579p777n962j0106j5967j4045p580k468M349Q301L556M635L660L588Q900
$$ 332579 324802 318840 308734 292767 278722 271142 268674 273023 281324 284880 289515 293175 296763 305663
9590C05663L721L388M585Q061O604J4628K0944L7730N1608O6997J00416J36963
$$ 305663 309384 312772 317357 325418 332022 346650 367594 405324 456932 523929 624345 761308
9578G61308J82988K48446L23399L96503M21700L52366J97838m03k08942l70675
$$ 761308 944296 1192742 1516141 1912644 2334344 2686710 2884548 2884145 2675203 2304528
9568B304528m21944l79949l06606k21539j63101j20230q7167o6027n1711l8507
$$ 2304528 1882584 1502635 1196029 974490 811389 691159 603992 537965 486254 447747
9558D47747k4571j6567n614m503q166r124j1028j1521j3487j1969j3430j4271
$$ 447747 423176 406609 400995 396492 388326 379202 368174 356653 343166 331197 317767 303496
9546C03496j0825p348q721j2709p369j157K826k293l472K043R72L138j191k639
$$ 303496 292671 285323 276602 263893 256524 255367 258193 255900 252428 254471 255443 258581 257390 254751
9532B54751p329m810j2609j1618l987o79J534O041N229O752K454K875q6p569N1
$$ 254751 247422 242612 230003 218385 214398 213719 215253 221294 226523 233275 235729 238604 238518 230949 231000
9517B31000O085N589M925P263R310K266m119j0926j2439p719p229o271m760j322
$$ 231000 237085 242674 247599 254862 264172 266438 262319 251393 238954 231235 224006 217735 212975 211653
9503B11653L012L164P099Q834N530p21o030j1170j1337j0603j0001q096J931L697
$$ 211653 214665 217829 224928 233762 239292 238571 232541 221371 210034 199431 189430 181334 183265 186962
9489A86962O578M672L426L092m320K966L254j71k080n338l103P154L949L704J75
$$ 186962 193540 198212 201638 204730 200410 203376 206630 206459 204379 199041 195938 203092 207041 210745 210920
9474B10920P2O808Q863J0287R585J3871J0894O636L127J0449R064J1323J3319
$$ 210920 210992 217800 226663 236950 246535 260406 271300 277936 281063 291512 300576 311899 325218
9461C25218J6239J3369Q937R39j36k301o381m485j2261j3705j2406j5048j3449
$$ 325218 341457 354826 363763 364702 364566 362265 355884 351399 339138 325433 313027 297979 284530
9448B84530j3451j3689q752k743P335K480J802K307N171L826L066J794k400r474
$$ 284530 271079 257390 248638 245895 253230 255710 257512 259819 264990 268816 271882 273676 271276 261802
9434B61802j5842j9330j6519j5596j4056j3465r982j1812j0686q619j238j27J26
$$ 261802 245960 226630 210111 194515 180459 166994 157012 145200 134514 125895 124657 124530 124656
9421A24656k139p56J513k571p292o605q011j066j272J521k187L238J2299L117
$$ 124656 122517 121761 123274 120703 113411 106806 98795 97729 96457 97978 95791 99029 111328 114445
9407A14445P077P185O656J0154O216P601Q932J3141J3271O455Q472J2066J0089
$$ 114445 121522 128707 135363 145517 151733 159334 168266 181407 194678 201133 209605 221671 231760
9394B31760O187K454p91N179N664j630n710o837q927j1498k0981j7129j2659n599
$$ 231760 237947 240401 239610 244789 250453 248823 243113 236276 227349 215851 194870 177741 165082 159483
9380A59483l189r308j3261j6016k3660j7358q010m685m73J017k938n998k312J380
$$ 159483 156294 146986 133725 117709 94049 76691 68681 63996 63523 64540 61602 55604 53292 54672
9366E4672n77K611Q101M423L524J957k872m086m916q468o480m519n917o142l83
$$ 54672 54095 56706 64807 69230 72754 74711 71839 67753 62837 54369 47889 43370 37453 31311 30928
9351C0928O891L996K17J388N245o19J183M406J803M356N216O998L580M456J254
$$ 30928 37819 41815 42032 43420 48665 48046 49229 53635 55438 59794 65010 72008 75588 80044 81298
9336H1298l122l532N416Q006J0618J4393J3437M582J115k339o319n334j0868j1946
$$ 81298 78176 74644 80060 88066 98684 113077 126514 131096 132211 129872 123553 118219 107351 95405
9322I5405q624p327j3009r350n667n806j933l542k985l689j045m01l369J788N794
$$ 95405 86781 79454 66445 57095 51428 45622 43689 40147 37162 33473 32428 32027 28658 30446 36240
9307C6240O247n64K540R403Q968Q919J6815K2367J7073J4926O442o075j4701j7108
$$ 36240 42487 41923 44463 53866 62834 71753 88568 110935 128008 142934 149376 143301 128600 111492
9293A11492j4923j5900r650p019p195n711p952l976p91J302j818m954m393m409
$$ 111492 96569 80669 71019 64000 56805 51094 43142 39166 38375 39677 37859 32905 28512 24103
9279B4103p202m470r21J328O406L797R20O403K797K568J208Q397N111k489N960
$$ 24103 16901 12431 11510 12838 19244 23041 23961 30364 33161 35729 36937 45334 50445 47956 53916
9264E3916J3637K0291J3491P974J0958J070r517j1543k0515k0177j3702j3556
$$ 53916 67553 87844 101335 109309 120267 121337 111820 100277 79762 59585 45883 32327
9252C2327q228k201J030J820p93k416n94n90j036M859K164J494J0348L265j66
$$ 32327 24099 21898 22928 24748 23955 21539 20945 20355 19319 24178 26342 27836 38184 41449 41283
9237D1283O895P837P785Q653M920M933Q648L747Q87m81J365M531O051J1338J2819
$$ 41283 48178 56015 63800 72453 77373 82306 90954 94701 95588 95107 96472 101003 107054 118392 131211
9222A31211P693n710j9450j4951k3162k1560j2445p659l229m025k550k305m495
$$ 131211 138904 133194 113744 98793 75631 54071 41626 33967 30738 26713 24163 21858 17363
9209A7363k522k671l157j685m061j727k361P9l266q221J424K685k879m83p44J477
$$ 17363 14841 12170 9013 7328 3267 1540 -821 -742 -4008 -12229 -10805 -8120 -10999 -11482 -12226 -10749
9193a0749L722M555R53Q91l626O73K572J34L060K012L609L329n41p359o612P06
$$ -10749 -7027 -2472 -1519 -628 -4254 -3581 -1009 -875 2185 4197 7806 11135 10594 3235 -3377 -2671
9177b671K598M026K887k477m726J060K592L650M623O394M429K701l157L121O170
$$ -2671 -73 3953 6840 4363 -363 697 3289 6939 11562 17956 22385 25086 21929 25050 31220
9162C1220L116M41M325j365q656p075o27n999q319n03j243N038M510J401q06l339
$$ 31220 34336 34777 39102 37737 29081 22006 21379 15380 7061 6558 5315 10353 14863 16264 15458 12119
9146A2119j839k020M16q49K738J751k010l342j104K037J178M923K781N42J455
$$ 12119 10280 8260 8676 7827 10565 12316 10306 6964 5860 7897 9075 13998 16779 17321 18776
9131A8776k264M63l186l181l473J456l337J21J453m917k399lk665n19k449l336
$$ 18776 16512 16975 13789 10608 7135 8591 5254 5375 6828 1911 -488 -491 -3156 -3675 -6124 -9460
9115i460m643l882N473O646m593j880l619K352N387K432K114L092L102J813q36
$$ -9460 -14103 -17985 -12512 -5866 -10459 -12339 -15958 -13606 -8219 -5787 -3673 -581 2521 4334 3498
9100C498L265K679p233o651k570K91K585K357O62o85m144q014l173o40K415N115
$$ 3498 6763 9442 2209 -4442 -7012 -6721 -4136 -1779 -1117 -1802 -5946 -13960 -17133 -17773 -15358 -10243
9084a0243L689N480p36l517j83l604m75M274M033k464l656j250L958O220j606
$$ -10243 -6554 -1074 -1810 -5327 -5510 -9114 -9589 -5315 -1282 -3746 -7402 -8652 -4694 1526 -80
9069h0j039K348J53O38r067n549m206L8K426L271J879P026M974J56K318L115N651
$$ -80 -1119 1229 1382 2020 -7047 -12596 -16802 -16764 -14338 -11067 -9188 -2162 2812 2968 5286 8401 14052
9052A4052l172l040l169J014m445j318J519n406n548O631Q549N183j159j358l552
$$ 14052 10880 7840 4671 5685 1240 -78 1441 -3965 -9513 -2882 5667 10850 9691 8333 4781
9037D781m91n151k86j58j214J927N88k635k026K293K108O03o85l181j398n974
$$ 4781 4290 -861 -1147 -1305 -2519 -592 -4 -2639 -4665 -2372 -264 339 -346 -3527 -4925 -10899
9021a0899o846J503r90p700o65M400Q033K804j272J347p15J980K205n45k953q47
$$ -10899 -17745 -16242 -17232 -24932 -25597 -21197 -13164 -10360 -11632 -10285 -11000 -9020 -6815 -7360 -10313 -11160
9005a1160l98J179k335m306J49L232l933K81j813m171k921K557M786M777K906
$$ -11160 -11558 -10379 -12714 -17020 -16871 -13639 -17572 -17291 -19104 -23275 -26196 -23639 -18853 -14076 -11170
8990a1170j776k316j253j204k573j498L892l083k534J827K880J09N793J036l730
$$ -11170 -12946 -15262 -16515 -17719 -20292 -21790 -17898 -20981 -23515 -21688 -18808 -18699 -12906 -11870 -15600
8975a5600o43J713n125j066j978l472k996j435L646K637M133k905L757O490K852
$$ -15600 -16243 -14530 -19655 -20721 -22699 -26171 -29167 -30602 -26956 -24319 -20186 -23091 -19334 -12844 -9992
8960i992l379m963q840M16N513J293K583K84M31J366k041j148k74J776l556R60
$$ -9992 -13371 -18334 -27174 -26758 -21245 -19952 -17369 -17085 -16654 -15288 -17329 -18477 -18751 -16975 -20531 -19571
8944a9571L15l010l261k084l118K102M785L557L230N570K435K466j293n580l240
$$ -19571 -19256 -22266 -25527 -27611 -30729 -28627 -23842 -20285 -17055 -11485 -9050 -6584 -7877 -13457 -16697
8929a6697j099K284N21j741K061K140m997j167j935K810k000l530O27P033N722
$$ -16697 -17796 -15512 -14991 -16732 -14671 -12531 -17528 -18695 -20630 -17820 -19820 -23350 -22723 -15690 -9968
8914i968J554R64J199l655l624k065j832L466J868p128k612L174J07j125L700
$$ -9968 -8414 -7450 -6251 -9906 -13530 -15595 -17427 -13961 -12093 -19221 -21833 -18659 -18552 -19677 -15977
8899a5977L380K130L399J570m325o293k620j05k909R06k072Q27L798p43j268L436
$$ -15977 -12597 -10467 -7068 -5498 -9823 -16116 -18736 -18841 -21750 -20844 -22916 -22089 -18291 -19034 -20302 -16866
8883a6866K119L317k134l862l577j109L594j444J463M11L116K262JM225n72m115
$$ -16866 -14747 -11430 -13564 -17426 -21003 -22112 -18518 -19962 -18499 -18088 -14972 -12710 -12709 -8484 -9056 -13171
8867a3171J713m518k782K449J661N477o75k552n20K666P167M931K511q255j615
$$ -13171 -11458 -15976 -18758 -16309 -14648 -9171 -9846 -12398 -12918 -10252 -3085 1846 4357 -3898 -5513
8852e513K956n289n277K84L44L809L94j97K011O412j612m367m625k562K542l773
$$ -5513 -2557 -7846 -13123 -12839 -12495 -8686 -8292 -8489 -6478 -66 -1678 -6045 -10670 -13232 -10690 -14463
8836a4463k037J698K770M180l384j27n863j770K721K718j28Q7j222K293L944j103
$$ -14463 -16500 -14802 -12032 -7852 -11236 -11363 -17226 -18996 -16275 -13557 -13685 -13598 -14820 -12527 -8583 -9686
8820i686J14q57k959q25L359j978m320l372K91K36j167M156L457O662M738J891
$$ -9686 -9572 -10429 -13388 -14213 -10854 -12832 -17152 -20524 -20233 -19997 -21164 -17008 -13551 -6889 -2151 -260
8804b60n865m170l606j909K170o08K70J911k160J133Q07l644m11N055J102k055
$$ -260 -6125 -10295 -13901 -15810 -13640 -14248 -13978 -12067 -14227 -13094 -12287 -15931 -16342 -11287 -10185 -12240
8788a2240L082K855k020k646N717M318j314p03J078K337J526o241m539j033l425
$$ -12240 -9158 -6303 -8323 -10969 -5252 -934 -2248 -2951 -1873 464 1990 -4251 -8790 -9823 -13248
8773a3248m753k327l290J191p9R95k912J593J756M728P871K796j462j723J317
$$ -13248 -18001 -20328 -23618 -22427 -22506 -21511 -24423 -22830 -21074 -16346 -8475 -5679 -7141 -8864 -7547
8758g547n342l412k45j922m89j246J915Qo95K112M237N951n002p067L49k36P63
$$ -7547 -12889 -16301 -16546 -18468 -18957 -20203 -18288 -18280 -18975 -16863 -12626 -6675 -11677 -18744 -18395 -18631 -17868
8741a7868M649J762k961j168j083l966m674K360N831N820l41p027o86N84K51P11
$$ -17868 -13219 -11457 -14418 -15586 -16669 -20635 -25309 -22949 -17118 -11298 -11639 -18666 -19352 -18768 -18517 -17806
8725a7806PJ816J105K66K094m004r64r74j376P171Q150o9p186j388k76r44J510
$$ -17806 -17799 -15983 -14878 -14612 -12518 -16522 -17486 -18460 -19836 -12665 -4515 -4584 -11770 -13158 -13434 -14378 -12868
8708a2868J618l862j040j495j293K379l624o37K681K765M419j548M441J383K67
$$ -12868 -11250 -15112 -16152 -17647 -18940 -16561 -20185 -20822 -18141 -15376 -10957 -12505 -8064 -6681 -6414
8693f414r48J46j342o66m991j934O181P354L669p79n589k446J787k224l884m982
$$ -6414 -7362 -7216 -8558 -9224 -14215 -16149 -9968 -2614 1055 276 -5313 -7759 -5972 -8196 -12080 -17062
8677a7062M13O363N933K627j369J118J036k455K938j875p068P9K018J589M199
$$ -17062 -16649 -10286 -4353 -1726 -3095 -1977 -941 -3396 -458 -2333 -9401 -9322 -7304 -5715 -1516
8662a516K900k578n471m48K591O529L010K678N408K739N995R083O600J3268K1837
$$ -1516 1384 -1194 -6665 -7113 -4522 2007 5017 7695 13103 15842 21837 30920 37520 50788 72625
8647G2625L9208N3817P4536O0217L3616M618k5464o1754p8276o2064l5935j9601
$$ 72625 111833 165650 240186 300403 334019 338637 313173 251419 173143 111079 75144 55543
8635E5543j2600q222j0134l726m340o906j590J866k35m72o44p179l234O81k237
$$ 55543 42943 34721 24587 20861 16521 9615 8025 9891 9656 9184 8540 1361 -1873 -1192 -3429
8620c429j512J649k225j422K541j896j065K550J463m37j394L97J228p65j50L417
$$ -3429 -4941 -3292 -5517 -6939 -4398 -6294 -7359 -4809 -3346 -3783 -5177 -4780 -3552 -4317 -4467 -1050
8604a050J161K481j848o840o22J027L185m498l957P4o528k184j177j672L788L468
$$ -1050 111 2592 744 -6096 -6718 -5691 -2506 -7004 -10961 -10887 -17415 -19599 -20776 -22448 -18660 -15192
8588a5192J6n58J807J943k482J731J972R09J816J296P67k165O97L03l848J292
$$ -15192 -15176 -15734 -13927 -11984 -14466 -12735 -10763 -9854 -8038 -6742 -5975 -8140 -7443 -7140 -10988 -9696
8572i696k35N46k936n251J136L39K92K609N764p63k067j319K454J831j066l514
$$ -9696 -9931 -9385 -12321 -17572 -16436 -16097 -15805 -13196 -7432 -8195 -10262 -11581 -9127 -7296 -8362 -11876
8556a1876j046k453O14K30j270j283O12J69J896J44k358k653J591L343R82j316
$$ -11876 -12922 -15375 -14761 -14531 -15801 -17084 -16472 -16303 -14407 -14263 -16621 -19274 -17683 -14340 -13358 -14674
8540a4674O43k357K737J907n80J562j229k841l335l803j396j406N222M742K06
$$ -14674 -14031 -16388 -13651 -11744 -12324 -10762 -11991 -14832 -18167 -21970 -23366 -24772 -19550 -14808 -14602
8525a4602k630j781j112J208K780n17J685M963p17J384J960K326O400M039J453
$$ -14602 -17232 -19013 -20125 -18917 -16137 -16654 -14969 -10006 -10723 -9339 -7379 -5053 1347 5386 6839
8510F839p20l49k796j0j964o821n543J743J559j150O509M753L329j982l826l860
$$ 6839 6119 5770 2974 2964 1000 -5821 -11364 -9621 -8062 -9212 -2703 2050 5379 3397 -429 -4289
8494d289k155k453m77J124J178j630K149j506m236L673L568O22P71P36m699q89
$$ -4289 -6444 -8897 -9374 -8250 -7072 -8702 -6553 -8059 -12295 -8622 -5054 -4432 -3661 -2925 -7624 -8513
8478h513M842K129J612j382j176K929O857K741K585N349Q340O798k812m008l317
$$ -8513 -3671 -1542 70 -1312 -2488 441 7298 10039 12624 17973 26313 33111 30299 26291 22974
8463B2974r21k30L924J298j464k054k155m442p897k097o04J927J059q454j963
$$ 22974 22053 21823 25747 27045 25581 23527 21372 16930 9033 6936 6332 8259 9318 864 -1099
8448a099L025K080n523k379j745J941r4K338j980N2P737P540m6m054k85K353k093
$$ -1099 1926 4006 -1517 -3896 -5641 -3700 -3794 -1456 -3436 -3384 4353 11893 11847 7793 7508 9861 7768
8431G768l558k146l251J27O41L929J876K45J609J56R44R61k712m649L806o37q0
$$ 7768 4210 2064 -1187 -1060 -419 3510 5386 5631 7240 7396 8340 9301 6589 1940 5746 5109 5029
8414E029l356J830K472j966J958r09n594k393L22n17P215L822k401j590n333m267
$$ 5029 1673 3503 5975 4009 5967 5058 -536 -2929 -2607 -3124 4091 7913 5512 3922 -1411 -5678
8398e678o40n559J43M032j937K334P018O497J504L22J68j131k766M061J19r87
$$ -5678 -6318 -11877 -11734 -7702 -9639 -7305 -287 6210 7714 8036 8204 7073 4307 8368 8487 7500
8382G500j287j454j405j149J698j583J598L680K080J117j73L162Q722K517P4k449
$$ 7500 6213 4759 3354 2205 3903 2320 3918 7598 9678 10795 10622 13784 22506 25023 25097 22648
8366B2648K15j306k759l230j938j915l26j79n097m66o8O2J535m350q48j526m872
$$ 22648 22863 21557 18798 15568 13630 11715 11389 11210 6113 5647 5579 5641 7176 2826 1978 452 -4420
8349d420Q24K387k32O564P70M216N478K591j233J102M780M771j741l291o174L436
$$ -4420 -3596 -1209 -1441 5123 5893 10109 15587 18178 16945 18047 22827 27598 25857 22566 16392 19828
8333A9828O222R328J2256J9510L0577L4585K7554R759P72k0428l3366l4502k4082
$$ 19828 26050 35378 47634 67144 97721 132306 159860 169619 170391 149963 116597 82095 58013
8320E8013q540m222o437L811N545N918J952J25N683O214L860Q321J6503K5765
$$ 58013 49473 45251 38814 42625 48170 54088 56040 56165 61848 68062 71922 80243 96746 122511
8306A22511L7060M6469N5628O0414N6728M6974L3030J5509j0416l2871m7418n0944
$$ 122511 159571 206040 261668 322082 378810 425784 458814 474323 463907 431036 383618 332674
8294C32674m6164m5811m3933l1011j8429n557M034J3905L2423N6160P5336O4636
$$ 332674 286510 240699 196766 165755 147326 141769 145803 159708 192131 248291 323627 388263
8282C88263K6722k668l4241p9610q9693o1890l5738k1659j3181p236q048m183
$$ 388263 414985 412317 378076 298466 208773 146883 111145 89486 76305 69069 61021 56838
8270E6838J436l682m366o989m515j627o937l263m311k826j895l117k350j306r31
$$ 56838 58274 54592 50226 43237 38722 37095 30158 26895 22584 19758 17863 14746 12396 11090 10159
8255A0159R22O219P059L112k681K202Q859L744J077J539l102j681L222J2208J9516
$$ 10159 11081 17300 24359 27471 24790 26992 35851 39595 40672 42211 39109 37428 40650 52858 72374
8240G2374K5573K8339K0324P011r624j9956l1489l0712k5627j3025r122l861k270
$$ 72374 97947 126286 146610 153621 143997 124041 92552 61840 36213 23188 14066 10205 7935
8227G935K921q29k326K663J732J473l344k198m773m485n606k51K402J258k305
$$ 7935 10856 10027 7701 10364 12096 13569 10225 8027 3254 -1231 -6837 -7088 -4686 -3428 -5733
8212e733L029K333k288j157M354Q28j945O06L674L256J254N709L223L791j126
$$ -5733 -2704 -371 -2659 -3816 538 1366 -579 27 3701 6957 8211 13920 17143 20934 19808
8197A9808L45j853R99m388m986l212k299P02r2l38n78l622K234l52m274J49K94
$$ 19808 20153 18300 19299 14911 9925 6713 4414 5116 5024 4686 4108 486 2720 2368 -1906 -1757 -1463
8180a463K127O007J007K294r99l979O156L174J060k946j615o051l44j555p04N652
$$ -1463 664 6671 7678 9972 8973 4994 11150 14324 15384 12438 10823 4772 4428 2873 2169 7821
8164G821L654M724p82m473k98p26J290N131K590k464k420j586L49l498n042m727
$$ 7821 11475 16199 15417 10944 10646 9920 11210 16341 18931 16467 14047 12461 12810 9312 4270 -457
8148d57p72q1l356K44L002N201K060K549K907m35K075K812L287M249n09j259r52
$$ -457 -1229 -1310 -4666 -4422 -1420 3781 5841 8390 11297 10862 12937 15749 19036 23285 22776 21517 20565
8131B0565K68M71J737o680m710l979j136L178N327M093j794m48m288m321l744
$$ 20565 20833 21304 23041 16361 11651 7672 6536 9714 15041 19134 17340 16892 12604 8283 4539
8116D539k748q96M73K87J542K029n318j069K606L029j036N807J428Q65K438n369
$$ 4539 1791 895 1368 1655 3197 5226 -92 -1161 1445 4474 3438 9245 10673 11538 13976 8607
8100H607n862l067M077L528k638L425r5J350O664M315j510J355M316L65l182L946
$$ 8607 2745 -322 3755 7283 4645 8070 7975 9325 15989 20304 18794 20149 24465 24830 21648 25594
8084B5594j241K243k736k248m383r79J231M46K794M532J702K962l716j602K638
$$ 25594 24353 26596 23860 21612 17229 16250 17481 17927 20721 25253 26955 29917 26201 24599 27237
8069B7237P290P669Q033N193k454P92O18p094k560j1422l426j984k139l434k730
$$ 27237 34527 42196 50229 55422 52968 53760 54378 47284 44724 33302 29876 27892 25753 22319 19589
8054A9589j650M580K247m544k428P5n855m61O586l18l484q05N817K656O708O860
$$ 19589 17939 22519 24766 20222 17794 17869 12014 11553 18139 17821 14337 13532 19349 22005 28713 35573
8038C5573M446l48q72Q89R64m211K064Q687R530O836K790m08k214N341Q343O363
$$ 35573 40019 39671 38799 39688 40652 36441 38505 47192 56722 63558 66348 65940 63726 69067 77410 83773
8022H3773J2258J1471O012J992j0403j2974j2150j2638j1938j1241l392O48n676
$$ 83773 96031 107502 113514 115506 105103 92129 79979 67341 55403 44162 40770 41418 35742
8009C5742l169J616K381o83o751p471L579J998M283N40L486J454r80Q08m194l348
$$ 35742 32573 34189 36570 35887 29136 21665 25244 27242 31525 32065 35551 37005 36025 36833 32639 29291
7993B9291k058j138M164M922P149O504J467k772n590o394n407r723k960M570j749
$$ 29291 27233 26095 30259 35181 42330 48834 50301 47529 41939 35545 30138 20415 17455 22025 20276
7978B0276m255N287J842K656K691Q306k050q842k945k171n74k840n299l470m678
$$ 20276 16021 21308 23150 25806 28497 36803 34753 25911 22966 20795 20221 17381 12082 8612 3934
7963C934L68N53L177J484j760j323K110m769j780l24j453L419j414j076r35n28
$$ 3934 4302 4855 8032 9516 7756 6433 8543 3774 1994 1670 217 3636 2222 1146 211 -317
7947c17K95L587L279J17n646J90k580J997k15o97k008j996k172L339J70m929K169
$$ -317 -22 3565 6844 6961 1315 1505 -1075 922 707 10 -1998 -3994 -6166 -2827 -2657 -7586 -5417
7930e417K044n744P56L397m15N85k922j965O347K798Q0N399K994l506n129j273
$$ -5417 -3373 -9117 -8361 -4964 -5379 -4794 -7716 -9681 -3334 -536 -456 4943 7937 4431 -698 -1971
7914a971l347O64M739j415J166p175j574N305L932O93j436J948Q51P475K687J684
$$ -1971 -5318 -4654 85 -1330 -164 -7339 -8913 -3608 324 1017 -419 1529 2380 9855 12542 14226
7898A4226M314K945L665N88n595n599j949j767j716q70n87q78N647L123O062L026
$$ 14226 18540 21485 25150 25738 20143 14544 12595 10828 9112 8242 7655 6777 12424 15547 21609 24635
7882B4635m85K610J086l043j483m540L596m041o792m594o146N62K960j00J129
$$ 24635 24150 26760 27846 24803 23320 18780 22376 18335 11543 6949 803 1365 4325 4225 5354
7867E354j430l998M002L486J662J556J779L34J765N379M379j360J620O74k690
$$ 5354 3924 -74 3928 7414 9076 10632 12411 12745 14510 19889 24268 22908 24528 25202 22512
7852B2512o9n245o07P46q61R67O035M203o200o551J338J35k50j13m915J440N575
$$ 22512 22443 17198 16591 17337 16476 17443 23478 27681 21481 14930 16268 16403 16153 16040 11125 12565 18140
7835A8140L624K524j248L024j406J97l819o007n149j867J378P20k303P49M623
$$ 18140 21764 24288 23040 26064 24658 24855 21036 15029 9880 8013 9391 10111 7808 8557 13180
7820A3180K317K459K938M160L177M540l97n43J846j76r037p633n672r282j979
$$ 13180 15497 17956 20894 25054 28231 32771 32374 31831 33677 33501 24464 16831 11159 1877 -102
7805a02L33K077j714n351k317L836j261P9M103O856O194J777j242k240o11L229
$$ -102 231 2308 594 -4757 -7074 -3238 -4499 -4420 -317 6539 12733 14510 13268 11028 10417 13646
7789A3646r11l630J090J773L295R16j750N51m768j163L179M148P507K832j968
$$ 13646 12735 9105 10195 11968 15263 16179 14429 14980 10212 9049 12228 16376 23883 26715 24747
7774B4747M422J504m91K99k71j250J08J859j559q037m23J003j924j587o774p710
$$ 24747 29169 30673 30182 30481 30210 28960 29068 30927 29368 21331 20908 21911 19987 18400 11626 3916
7758C916M516N620L345L294J565M809P850N944O054O671Q847Q414J804O230O124
$$ 3916 8432 14052 17397 20691 22256 27065 34915 40859 46913 53584 62431 70845 72649 78879 85003
7743H5003J2740J3152K5837M1942O3369J12121J81149K18249J80965R2338N26
$$ 85003 97743 110895 136732 178674 242043 354164 535313 753562 934527 1026865 1027391
7732A027391j06914k07204k20284j60166r9885o0550l6825k2248k2481j8505j2295
$$ 1027391 920477 713273 492989 332823 232938 172388 135563 113315 90834 72329 60034
7721F0034n188n90j04p350p618n633r23j175m757k881O55p570n544K038M404o33
$$ 60034 54846 54256 54152 46802 39184 33551 32628 31453 26696 23815 24470 16900 11356 13394 17798 17165
7705A7165m05k529q482K971L135l171n670J826K303n59K036j819l900L930L120
$$ 17165 16760 14231 5749 8720 11855 8684 3014 4840 7143 6584 8620 6801 2901 6831 9951
7690I951p523l099j514l655l082J962j362N06q43j144J15r9Q53N148M831k38m672
$$ 9951 2428 -671 -2185 -5840 -8922 -6960 -8322 -7816 -8659 -9803 -9688 -9787 -8934 -3786 1045 807 -3865
7673c865J483J4m852J047K981K261l267j910J171J243m622j555k740k184K761
$$ -3865 -2382 -2368 -7220 -6173 -3192 -931 -4198 -6108 -4937 -3694 -8316 -9871 -12611 -14795 -12034
7658a2034j073j358j388Q0O76R27M763p13o209L996J382n351j066J866k998M92
$$ -12034 -13107 -14465 -15853 -15773 -15097 -14170 -9407 -10120 -16329 -12333 -10951 -16302 -17368 -15502 -18500 -18008
7642a8008J827j394K616K728J198J168L736N122o357n513K384R60K545q95l249
$$ -18008 -16181 -17575 -14959 -12231 -11033 -9865 -6129 -1007 -7364 -12877 -10493 -9533 -6988 -7883 -11132
7627a1132L23J117K049j71K639J326l572k489m40R6k80L341L016J52n633J532
$$ -11132 -10809 -9692 -7643 -7814 -5175 -3849 -7421 -9910 -10350 -10254 -10534 -7193 -4177 -4025 -9658 -8126
7611h126M58J412k755k118n31K011K85L144O50j261N65o53o22k302N47k315L450
$$ -8126 -7668 -6256 -9011 -11129 -11660 -9649 -9364 -6220 -5570 -6831 -6266 -6919 -7541 -9843 -9296 -11611 -8161
7594h161M817j333l453j131J921M952O57n354l443K328K670o17M29l193j35J213
$$ -8161 -3344 -4677 -8130 -9261 -7340 -2388 -1731 -7085 -10528 -8200 -5530 -6147 -5718 -8911 -9046 -7833
7578g833J595K488K751K707L06k805m820J137J771K4J55l39p84j81l581k191j796
$$ -7833 -6238 -3750 -999 1708 2014 -791 -5611 -4474 -2703 -2679 -2524 -2863 -3647 -3828 -7409 -9600 -11396
7561a1396P97L737P484p29K079m345k31o240L21j571P25K18j134M72P661L910
$$ -11396 -10599 -6862 622 -107 1972 -2373 -2604 -8844 -8523 -10094 -9369 -9151 -10285 -9813 -2152 1758
7545A758l470m881n448j205P094N716J429J960m616l774N25K824M36l086L77l940
$$ 1758 -1712 -6593 -12041 -13246 -6152 -436 993 2953 -1663 -5437 -4912 -2088 -1652 -4738 -4361 -8301
7529h301J48j337o53J892L581r81j880m436k894q91K214L822K551k632k944N122
$$ -8301 -8153 -9490 -10143 -8251 -4670 -5651 -7531 -11967 -14861 -15752 -13538 -9716 -7165 -9797 -12741 -7619
7513g619K267m04Q77L101k077J529l005n156J677o45J867r97J190M362L654Q69
$$ -7619 -5352 -5756 -4879 -1778 -3855 -2326 -5331 -10487 -8810 -9455 -7588 -8585 -7395 -3033 621 1490
7497A490k480j762J209n790p073k980p0L963M481K032O37j478j364J115j468P32
$$ 1490 -990 -2752 -1543 -7333 -14406 -17386 -17456 -13493 -9012 -6980 -6343 -7821 -9185 -8070 -9538 -8806
7481h806L560L969k00j934J085q50k753k10j088K07J553l667o440N046N700O99
$$ -8806 -5246 -1277 -1477 -3411 -2326 -3176 -5929 -6139 -7227 -7020 -5467 -9134 -15574 -10528 -4828 -4129
7465d129j913J35J303L602k464k794j883n312l218N165M733m118n93O12L169P062
$$ -4129 -6042 -5907 -4604 -1002 -3466 -6260 -8143 -13455 -16673 -11508 -6775 -10893 -11486 -10874 -7705 -643
7449f43j049j687l961L93J919J872l876j891k820Q05j497m333K226K705N154K601
$$ -643 -1692 -3379 -7340 -6947 -5028 -3156 -7032 -8923 -11743 -10938 -12435 -16768 -14542 -11837 -6683 -4082
7433d082l074l725l439n85K140O014N338J493l71k324j000L53L344P28n114j450
$$ -4082 -7156 -10881 -14320 -14905 -12765 -6751 -1413 80 -291 -2615 -3615 -3262 82 810 -4304 -5754
7417e754k591n19j453K747K184k141l625k09o49J217L067k313J103J465P01j37
$$ -5754 -8345 -8864 -10317 -7570 -5386 -7527 -11152 -11361 -12010 -10793 -7726 -10039 -8936 -7471 -6770 -6907
7401f907k839P43L115j722l081P45J283J132L797M98K373J783n53m842k168N70
$$ -6907 -9746 -9003 -5888 -7610 -10691 -9946 -8663 -7531 -3734 -3236 -863 920 367 -4475 -6643 -6073
7385f073n61j494r74j536m936K410P656K993K11K967J476N85k872p61j461L76
$$ -6073 -6634 -8128 -9102 -10638 -15574 -13164 -5508 -2515 -2304 663 2139 2724 -148 -909 -2370 -1994
7369a994L1J884k822p625L57M258n58j141J889K940M114j628P82L445p633k370
$$ -1994 -1963 -79 -2901 -10526 -10169 -5911 -6469 -7610 -5721 -2781 1333 -295 487 3932 -3701 -6071
7353f071N496N831J284m851l829m956R43M095n96n696R49p70J266k749m297k0
$$ -6071 -575 5256 6540 1689 -2140 -7096 -6153 -2058 -2654 -8350 -7401 -8171 -6905 -9654 -13951 -13971
7337a3971O661M104k31L316j498O03K68l071k5j125N621M676j478J376P26j891
$$ -13971 -7310 -3206 -3437 -121 -1619 -1016 -748 -3819 -3844 -4969 652 5328 3850 5226 5952 4061
7321D061j151L574L841o005k016q68j296M362L742Q226M720R381J2889N202l291
$$ 4061 2910 6484 10325 4320 2304 1436 140 4502 8244 16470 21190 30571 43460 48662 45371
7306D5371m604j0217p723j1136j395k860O75k782j545k059m240M459J916m143
$$ 45371 40767 30550 22827 11691 10296 7436 8111 5329 3784 1725 -2515 1944 3860 -283
7292b83m834k609J370O068J700P459K189n520j606N386N010O354L081O079N679
$$ -283 -5117 -7726 -6356 -288 1412 8871 11060 5540 3934 9320 14330 20684 23765 29844 35523
7277C5523K359L91m585l896o544j578j224k848l995n195K881l590l844j481k294
$$ 35523 37882 38273 33688 29792 23248 21670 20446 17598 13603 8408 11289 7699 3855 2374 80
7262H0j077L047Q465Q671N145Q091N150J92o776j0321o050m257m587m497m78N62
$$ 80 -997 2050 10515 19186 24331 32422 37572 37764 30988 20667 14617 10360 5773 1276 798 1360
7246A360o07j080J517j229l457l064m822N914M354o540j367q19L350K776Q74M192
$$ 1360 753 -327 1190 -39 -3496 -6560 -11382 -5468 -1114 -7654 -9021 -9840 -6490 -3714 -2840 1352
7230A352Q839P269P056Q413L001l72p428n800o84M83o455j1176q079L386K030
$$ 1352 10191 17460 24516 32929 35930 35558 28130 22330 21646 22129 15674 4498 -3581 -195 1835
7215A835K556l968o303j497J163J151k488o38k7K728J817m893J24K397M691r65
$$ 1835 4391 423 -5880 -7377 -6214 -5063 -7551 -8189 -8216 -5488 -3671 -8564 -8440 -6043 -1352 -2317
7199b317N14m925l86N176J016k018j326k684J164J495K911j467K279J376m308
$$ -2317 -1803 -6728 -7114 -1938 -922 -2940 -4266 -6950 -5786 -4291 -1380 -2847 -568 808 -3500
7184c500k791k746R1N757K226j664J568p177n391l64K0O376J948L997k104r40
$$ -3500 -6291 -9037 -8946 -3189 -963 -2627 -1059 -8236 -13627 -13991 -13971 -7595 -5647 -1650 -3754 -4694
7168d694k153o51J470J403J978Q58j130m123J700J834K512K168K570j467J942
$$ -4694 -6847 -7498 -6028 -4625 -2647 -1789 -2919 -7042 -5342 -3508 -996 1172 3742 2275 4217
7153D217L99l762l731p25l216k714L010k518M90K216l855p26o75l30N748O319
$$ 4217 4616 854 -2877 -3602 -6818 -9532 -6522 -9040 -8550 -6334 -10189 -10915 -11590 -11920 -6172 147
7137A47R65k964n50n81J470j058K869M909Q94J63n86K893J211J962l811j349M692
$$ 147 1112 -1852 -2402 -2983 -1513 -2571 298 5207 6101 6264 5678 8571 9782 11744 7933 6584 11276
7120A1276M34m028m587K424j415l606k310N58J459n324n016K784N336o736k163
$$ 11276 11710 7682 3095 5519 4104 498 -1812 -1254 205 -5119 -10135 -7351 -2015 -8751 -10914
7105a0914N15k797P54K932M758N924Q09L7l532j259j829m52K441j029k096J161
$$ -10914 -10399 -13196 -12442 -9510 -4752 1172 1981 2018 -1514 -2773 -4602 -5054 -2613 -3642 -5738 -4577
7089d577o89J638J598k663L463Q79j07n517m594K509L380p33k347L222J729l957
$$ -4577 -5266 -3628 -2030 -4693 -1230 -351 -458 -5975 -10569 -8060 -4680 -5413 -7760 -4538 -2809 -6766
7073f766r1J649j128r69K175j879n046k43m259j5M287L520J778k803k640K606
$$ -6766 -6857 -5208 -6336 -7305 -5130 -7009 -12055 -12298 -16557 -16572 -12285 -8765 -6987 -9790 -12430 -9824
7057i824P367k31R8M941J032j136k251j55k626k24Ko43k632L49K443j51l692o65
$$ -9824 -2457 -2688 -2590 2351 3383 2247 -4 -159 -2785 -3009 -3007 -3650 -6282 -5933 -3490 -3641 -7333 -7998
7039g998J855m209L63l44m031k269L937P91o10L548Q47k593K986Q315J678k441
$$ -7998 -6143 -10352 -9989 -10333 -14364 -16633 -12696 -11905 -12515 -8967 -8120 -10713 -7727 588 2266 -175
7023a75j121j611L206k751n523n382K678M746k696m060J273L057r75j878L436
$$ -175 -1296 -2907 299 -2452 -7975 -13357 -10679 -5933 -8629 -12689 -11416 -8359 -9334 -11212 -7776
7008g776q23R27K373J691j286P53M750J74m068l078L793l10J22O26l661j542K655
$$ -7776 -8599 -7672 -5299 -3608 -4894 -4141 609 783 -3285 -6363 -2570 -2880 -2758 -2132 -5793 -7335 -4680
6991d680J144M288m135l741J162J692M87J38k014K086L425J096L32q202k399j139
$$ -4680 -3536 752 -3383 -7124 -5962 -4270 -3783 -3645 -5659 -3573 -148 948 1280 -6922 -9321 -10460
6975a0460j830J689N577M680J461l711k323L143l914l431J874r59J101L519M189
$$ -10460 -12290 -10601 -5024 -344 1117 -2594 -4917 -1774 -5688 -9119 -7245 -8204 -7103 -3584 605
6960F05M646N029n73m026n63q18k780j286Q81m314l27m20j514J011J847j314l751
$$ 605 5251 10280 9707 5681 5118 4300 1520 234 1115 -3199 -3526 -3946 -5460 -4449 -2602 -3916 -7667
6943g667l680J422J380k299k911K351O543L285m640j614K00J580j450j383K922
$$ -7667 -11347 -9925 -8545 -10844 -13755 -11404 -4861 -1576 -6216 -7830 -7630 -6050 -7500 -8883 -5961
6928e961N291N115j000L992R28j692K636R286L697J925Q036O874L867K79q894
$$ -5961 -670 4445 3445 7437 8365 6673 9309 18595 22292 24217 32253 39127 42994 43273 34379
6913C4379p520m850k428o711m018J691J743j392k496l546m379j32J731L426K862
$$ 34379 26859 22009 19581 12870 8852 10543 12286 10894 8398 4852 473 341 2072 5498 8360
6898H360l091J451R06J479j804Q710O857N963P79N781J0631O496N660Q74q05r15
$$ 8360 5269 6720 7626 9105 7301 16011 22868 28831 29610 35391 46022 52518 58178 59052 58247 57332
6882E7332k239k664j0083o615n286p332q074l741m55k741l894J233n54M57k367
$$ 57332 55093 52429 42346 35731 30445 23113 15039 11298 10843 8102 4208 5441 4887 5344 2977
6867B977k266J822N64n595j212L006K589K896O53Q62L758L391P81N702N054Q36
$$ 2977 711 2533 3097 -2498 -3710 -704 1885 4781 5434 6296 10054 13445 14226 19928 24982 25818
6851B5818m66l807p801R68J723k115m362k424q32q756k050J217k365q62l843J06
$$ 25818 25352 21545 13744 14712 16435 14320 9958 7534 6702 -2054 -4104 -2887 -5252 -6114 -9957 -9851
6835i851J151p88L04N321M060r69q599l074N16k251P898L980R97n001k941J96
$$ -9851 -8700 -9488 -9184 -3863 197 -772 -9371 -12445 -11929 -14180 -6282 -2302 -1305 -6306 -9247 -9051
6819i051M368K583n710J936J562J924O87L32m506r87M23L021O74K443j07n310
$$ -9051 -4683 -2100 -7810 -5874 -4312 -2388 -1701 -1369 -5875 -6862 -6439 -3418 -2744 -301 -408 -5718
6803e718j964m442p71j03J074O90J795K231J86K973M212n450J683L36L30j09j52
$$ -5718 -7682 -12124 -12895 -12998 -11924 -11234 -9439 -7208 -7022 -4049 163 -5287 -3604 -3268 -2938 -3047 -3199
6786c199k78p130j325P091J617N29K925q03J455m738l676J730N09j391j648O69
$$ -3199 -3477 -10607 -11932 -4841 -3224 -2695 230 -573 882 -3856 -7532 -5802 -5293 -6684 -8332 -7663
6770g663J863J866l402l905J491m439K246N373o75L156J982n165k719l798M52
$$ -7663 -5800 -3934 -7336 -11241 -9750 -14189 -11943 -6570 -7245 -4089 -2107 -7272 -9991 -13789 -13337
6755a3337J912R08K933J812q98j563K495k323j527L124K631n20J176k026j944
$$ -13337 -11425 -10517 -7584 -5772 -6670 -8233 -5738 -8061 -9588 -6464 -3833 -4353 -3177 -5203 -7147
6740g147J471P91k030j046P383K233k474l005R13O104L249m758k897j865L137
$$ -7147 -5676 -4885 -6915 -7961 -578 1655 -819 -3824 -2911 3193 6442 1684 -1213 -3078 59
6725E9j934r11J376l228j381M274J291m065J490J818r45j852j593J230j436o54
$$ 59 -1875 -2786 -1410 -4638 -6019 -1745 -454 -4519 -3029 -1211 -2156 -4008 -5601 -4371 -5807 -6461
6709f461M520J602M703J07j568j827K283L933J663m018l946l586n96j229q22j623
$$ -6461 -1941 -339 4364 4471 2903 1076 3359 7292 8955 4937 991 -2595 -3191 -4420 -5242 -6865
6693f865l040J969M008N453p73J96J67L52j756n640K984L915k329j89Q72K89L385
$$ -6865 -9905 -7936 -3928 1525 752 948 1115 1467 -289 -5929 -2945 970 -1359 -1548 -676 -387 2998
6676B998k832N29K541k206o4p68k695M279k335Q13J780j125l331K356R13r47o90
$$ 2998 166 695 3236 1030 966 198 -2497 1782 -553 260 2040 915 -2416 -60 853 -94 -784
6659g84J892r86l29n97k74j181M353P70j819l245j238p40n90K069O62k363K706
$$ -784 1108 122 -207 -804 -1078 -2259 2094 2864 1045 -2200 -3438 -4178 -4768 -2699 -2037 -4400 -1694
6642a694j725L273L186M66J254NR29L059K573Mk08l611l987P7K533R25Q20k821
$$ -1694 -3419 -146 3040 3506 4760 4765 5694 8753 11326 11330 11122 7511 3524 3601 6134 7059 7879 5058
6624E058m143l088m247Q53J716L69o02j77J778R70J949j980k475O60K73m136k25
$$ 5058 915 -2173 -6420 -5567 -3851 -3482 -4084 -4261 -2483 -1513 436 -1544 -4019 -3359 -3086 -7222 -7447
6607g447P404L59k321K488J091L09k773N780j611k052l87r41k891j120j312J043
$$ -7447 -43 316 -2005 483 1574 1883 -890 4890 3279 1227 840 -101 -2992 -4112 -5424 -4381
6591d381J062M60K200K740m258Q4j210K449J574j859P53O327R8o515k530n13p47
$$ -4381 -3319 -2859 -659 2081 -2177 -2093 -3303 -854 720 -1139 -386 5941 6039 -476 -3006 -3519 -4266
6574d266N990M782j554j258j564k776N718P03j375L687j128n995j294k116J406
$$ -4266 1724 6506 4952 3694 2130 -646 5072 5775 4400 8087 6959 964 -330 -2446 -1040
6559a040J321N24n965r95J858J291K441K901Q4M01J1J490j117m35k268k011k565
$$ -1040 281 805 -5160 -6155 -4297 -3006 -565 2336 2420 2821 2832 4322 3205 2770 502 -1509 -4074
6542d074K908p01J284K743L97r83j114l072j763l942J323M941P75k631J806p87
$$ -4074 -1166 -1867 -583 2160 2557 1574 460 -2612 -4375 -8317 -6994 -2053 -1278 -3909 -2103 -2890
6526b890r61j563l924J370l84L930K356J241K674K67o2N34k779l278J261k154
$$ -2890 -3851 -5414 -9338 -7968 -8352 -4422 -2066 -825 1849 2116 2054 2588 -191 -3469 -2208 -4362
6510d362n66K090L086q6P74n871K39L614M432m127j796j76N39j272J706L484k906
$$ -4362 -4928 -2838 248 162 936 -4935 -4696 -1082 3350 -777 -2573 -2749 -2210 -3482 -1776 1708 -1198
6493a198k063N51q79q0K130M89j014Q90O00r85l29J190L223M99j747j389m83K074
$$ -1198 -3261 -2710 -3589 -3669 -1539 -1050 -2064 -1174 -574 -1559 -1888 -698 2525 3024 1277 -112 -595 1479
6475A479R53l861k149K522M825j364k590j627m363l26N378M873m755l475L899
$$ 1479 2432 -1429 -3578 -1056 3769 2405 -185 -1812 -6175 -6501 -1123 3750 -1005 -4480 -581
6460e81K16r27Q54k698M64j759J760M398j329j180j0N01r25K402k609l198P18
$$ -581 -365 -1292 -438 -3136 -2672 -4431 -2671 1727 398 -782 -792 -291 -1216 1186 -1423 -4621 -3903
6443c903j922k278P40K444K445P12m93l616l30J971K211Q28r08N87L233L172J326
$$ -3903 -5825 -8103 -7363 -4919 -2474 -1762 -2255 -5871 -6201 -4230 -2019 -1191 -2099 -1512 1721 4893 6219
6426F219r66m082j915J2l56l851m626j207L443K767J948J36K776J550P62n11l945
$$ 6219 5253 1171 -744 -732 -1088 -4939 -9565 -10772 -7329 -4562 -2614 -2478 298 1848 2610 2099 -1846
6409a846m088l239M282L823K849O15l265R05M930l690m877P20L778m582j272O64
$$ -1846 -5934 -9173 -4891 -1068 1781 2396 -869 36 4966 1276 -3601 -2881 897 -3685 -4957 -4293
6393d293L867P94k199k524k900k963N075K918p14l399r35L260K152J101K882J230
$$ -4293 -426 368 -1831 -4355 -7255 -10218 -5143 -2225 -2939 -6338 -7273 -4013 -1861 -760 2122 3352
6377C352n333o039l16q05J18M75j520n65O55M883p14l870K352K256m787L248j77
$$ 3352 -1981 -8020 -8336 -9141 -9023 -8548 -10068 -10633 -9978 -5095 -5809 -9679 -7327 -5071 -9858 -6610 -6787
6360f787q36O58J413L125L955J240o96k239p49l726l20J128K51n12n64K947J588
$$ -6787 -7623 -6965 -5552 -2427 1528 2768 2072 -167 -916 -4642 -4962 -3834 -3583 -4095 -4659 -1712 -124
6343a24k947J617L791k616J077k679k624K646M09m715K185k052J422K174j285
$$ -124 -3071 -1454 2337 -279 798 -1881 -4505 -1859 -1450 -6165 -3980 -6032 -4610 -2436 -3721
6328c721l354K083L704P46J176k42M043l32l025l102j034P299K282l464l111l798
$$ -3721 -7075 -4992 -1288 -542 634 392 4435 4103 1078 -2024 -3058 4241 6523 3059 -52 -3850
6312c850m547j286O865N332L610p61o97q537n742K407N887N92m909L749j488n272
$$ -3850 -8397 -9683 -2818 2514 6124 5363 4666 -3871 -9613 -7206 -1319 -727 -5636 -1887 -3375 -8647
6296h647J06K127P355k940o387k528M849P331J175m826n534ml28O231K826k468
$$ -8647 -8541 -6414 941 -1999 -8386 -10914 -6065 1266 2441 -2385 -7919 -7923 -8251 -2020 806 -1662
6280a662J770l011K542j87m956K316J581J951J283k110k097J906l312J747L32
$$ -1662 108 -2903 -361 -548 -5504 -3188 -1607 344 1627 -483 -2580 -674 -3986 -2239 -1907
6265a907k477J902N608J377k705K84m502n194P41L752N015m614m482J598M334
$$ -1907 -4384 -2482 3126 4503 1798 2082 -2420 -7614 -6873 -3121 1894 -2720 -7202 -5604 -1270
6250a270j573K107j458J42L810k432n936l304K207K711L897k766J98j432j837
$$ -1270 -2843 -736 -2194 -2052 1758 -674 -6610 -9914 -7707 -4996 -1099 -3865 -3667 -5099 -6936
6235f936J97N358L662j328Q6K418k322j830k294K873k429L0j445K481M175K674
$$ -6936 -6739 -1381 2281 953 1039 3457 1135 -695 -2989 -116 -2545 -2515 -3960 -1479 2696 5370
6219E370m133r28l568k287M96l257n520N128O378j66n388r09M655J405K658j961
$$ 5370 1237 309 -3259 -5546 -5050 -8307 -13827 -8699 -2321 -2487 -7875 -8784 -4129 -2724 -66 -2027
6203b027n59O909j07m660n917j524L228j104J201J174m565l883p47J263m19L612
$$ -2027 -2586 4323 4216 -444 -6361 -7885 -4657 -5761 -4560 -3386 -7951 -11834 -12581 -11318 -11737 -8125
6187h125J378pl242L058o36q56N45K616K249K024K87n11m262k450j952j539O624
$$ -8125 -6747 -6754 -9996 -6938 -7574 -8430 -7885 -5269 -3020 -996 -709 -1220 -5482 -7932 -9884 -11423 -4799
6170d799l099l18L483K255L855q65m771L074L192k658n007J050j870Q76L780K767
$$ -4799 -7898 -8216 -4733 -2478 1377 512 -4259 -1185 2007 -651 -5658 -4608 -6478 -5602 -1822 945
6154I45l417l912M971o15k089l415N46K555M599J084m69j895k534l25J560l996
$$ 945 -2472 -6384 -1413 -2028 -4117 -7532 -6986 -4431 168 1252 783 -1112 -3646 -3971 -2411 -6407
6138f407K386M114R33o19J1j985Jk596J846J130J403L25r50j448m923j329J571
$$ -6407 -4021 93 1026 407 418 -1567 -1566 -4162 -2316 -1186 217 542 -408 -1856 -6779 -8108 -6537
6121f537M47J096N60J014j444J675L164k181o8j305l315K695K794O18K24j389
$$ -6537 -6090 -4994 -4434 -3420 -4864 -3189 -25 -2206 -2274 -3579 -6894 -4199 -1405 -787 -563 -1952
6105a952K005m53l104NK644j87K898J20J497j472p465l345M459J505L969j432
$$ -1952 53 -400 -3504 -3499 -855 -1042 1856 1976 3473 2001 -5464 -8809 -4350 -2845 1124 -308
6089c08k332J629J720Q98J510q64k125K534O746k171k468l568K00j669j171k158
$$ -308 -2640 -1011 709 1607 3117 2253 128 2662 9408 7237 4769 1201 1401 -268 -1439 -3597
6073c597l6L658K047o18M064L713l361o063l674K471K804j738L132n191P56N273
$$ -3597 -3633 25 2072 1454 5518 9231 5870 -193 -3867 -1396 1408 -330 2802 -2389 -1633 3640
6057C640l784k374L062L714l94l260K197n51l231j42K405j141k455l735J033L70
$$ 3640 -144 -2518 544 4258 3864 604 2801 2250 -981 -1123 1282 141 -2314 -6049 -5016 -4646
6041d646O34R56j138m83K599j983j075N15Q96j353m299l1J993Q61j878O19J504
$$ -4646 -4012 -3056 -4194 -4677 -2078 -4061 -5136 -4621 -3725 -5078 -9377 -9408 -7415 -6554 -8432 -7813 -6309
6024f309l926m023M237R30J563M951K036j92n322k748j742K306L664l421l702
$$ -6309 -10235 -14258 -10021 -9091 -7528 -2577 -541 -733 -6055 -8803 -10545 -8239 -4575 -7996 -11698
6009a1698M98n321L39K821L767J995K45K04J539K47J66K030k802J204L505j605
$$ -11698 -11200 -16521 -16182 -13361 -9594 -7599 -7354 -7150 -5611 -5364 -5198 -3168 -5970 -4766 -1261 -2866
5993b866P54K19k075k802o16J19K637M68J766m73J504L97j069k421O56k439J429
$$ -2866 -2112 -1893 -3968 -6770 -7386 -7267 -4630 -4162 -2396 -2869 -1365 -968 -2037 -4458 -3802 -6241 -4812
5976d812L016J04J00j000L57j440Q82l143J01L157l3k447p62r90j348L713N053
$$ -4812 -1796 -1692 -1592 -2592 -2235 -3675 -2793 -5936 -5835 -2678 -2711 -5158 -5920 -6910 -8258 -4545 508
5959E08r58m315K799L224l47k181k043L757p31k092k199L098M143L714l689O51
$$ 508 -450 -4765 -1966 1258 911 -1270 -3313 444 -287 -2379 -4578 -1480 2663 6377 2688 3339
5943C339j487m842r15L689J987j957n662r54p93J295J494m00K711M106j961l627
$$ 3339 1852 -2990 -3905 -216 1771 -186 -5848 -6802 -7595 -6300 -4806 -5206 -2495 1611 -350 -3977
5927c977r45K045M549J713L790k400j371p23O76m13J705L862n55j598l121j394
$$ -3977 -4922 -2877 1672 3385 7175 4775 3404 2681 3357 2944 4649 8511 7956 6358 3237 1843
5911A843l525o121o22L250L193rm499L282j148J562J732P28k655k200j058Q24
$$ 1843 -1682 -7803 -8425 -5175 -1982 -1991 -6490 -3208 -4356 -2794 -1062 -334 -2989 -5189 -6247 -5423
5895e423L18M971j878j718L079J527m032J390K414o32J466j094Q85k160j387k269
$$ -5423 -5105 -134 -2012 -3730 -651 876 -3156 -1766 648 16 1482 388 1273 -887 -2274 -4543
5879d543M267j601k934K886N416j373P80O30o368l729J850R66J267R19K951K087
$$ -4543 -276 -1877 -4811 -1925 3491 2118 2898 3528 -2840 -6569 -4719 -3753 -2486 -1567 1384 3471
5863C471l602l95k001M078K610m209m638p91K156M35M484l168k026L51O07K910
$$ 3471 -131 -526 -2527 1551 4161 -48 -4686 -5477 -3321 -2886 1598 -1570 -3596 -3245 -2638 272
5847B72l010j242L696r3O61L202O37l967k947m387l443L703K493j007K97N79J506
$$ 272 -2738 -3980 -284 -377 284 3486 4123 156 -2791 -7178 -10621 -6918 -4425 -5432 -5135 -4556 -3050
5830c050L307k255K856L130m95p355o51N040q67r95p39M302J67m921k270l57M565
$$ -3050 257 -1998 858 3988 3493 -3862 -4513 527 -340 -1335 -2074 2228 2395 -2526 -4796 -5153 -588
5813e88M7l374m80M960j771l080K476L123R75J599K557k402l587mn037k805L378
$$ -588 -541 -3915 -4395 565 -1206 -4286 -1810 1313 2288 3887 6444 4042 455 451 -4586 -7391 -4013
5796d013j779Q33j747J852M780K870O186J485j912m262n624M18q42M31k310J95
$$ -4013 -5792 -4959 -6706 -4854 -74 2796 8982 10467 8555 4293 -1331 -913 -1755 -1324 -3634 -3439
5780c439K074M940L170m23m327n81o17r88l045m051j493N53Rj441K570N686J038
$$ -3439 -1365 3575 6745 6322 1995 1414 797 -191 -3236 -7287 -8780 -8227 -8218 -9659 -7089 -1403 -365
5763c65N62M712o63m212j544J178q37j355j512n1Q96j635j974j625L657r39l077
$$ -365 197 4909 4246 34 -1510 -332 -1169 -2524 -4036 -4087 -3191 -4826 -6800 -8425 -4768 -5707 -8784
5746h784J540L286p72j975K708Q18K225l314l990J515J027M858K44J433P53Rl86
$$ -8784 -7244 -3958 -4730 -6705 -3997 -3179 -954 -4268 -8258 -6743 -5716 -858 -614 819 1572 1581 1195
5729A195J496k8q28l267r26J67k686J239M525K88K691J203L371M88k544n11K279
$$ 1195 2691 2663 1835 -1432 -2358 -2191 -4877 -3638 887 1175 3866 5069 8440 8928 6384 5873 8152
5712H152j745k709J662l326o253n73K658l567j195L577J364l262J581q32J295
$$ 8152 6407 3698 5360 2034 -4219 -4792 -2134 -5701 -6896 -3319 -1955 -5217 -3636 -4468 -3173
5697c173k75k505k802j184J33L807o49j255l348m029j651O931J214j643J315N935
$$ -3173 -3448 -5953 -8755 -9939 -9806 -5999 -6648 -7903 -11251 -15280 -16931 -10000 -8786 -10429 -9114 -3179
5681c179M93q19k56J681Q75k096m436l173K420J62L720K626K466L500j674N38
$$ -3179 -2686 -3505 -3761 -2080 -1205 -3301 -7737 -10910 -8490 -8328 -4608 -1982 484 3984 2310 2848
5665B848L08l457J138N97J883J431j302k7k631K815J400l753K584K428l174n61
$$ 2848 3156 -301 837 1434 3317 4748 3446 3419 788 3603 5003 1250 3834 6262 3088 2527
5649B527J611j166j639j016l206k023K322M663K370j880m476m180j660K288j40
$$ 2527 4138 2972 1333 317 -2889 -4912 -2590 2073 4443 2563 -1913 -6093 -7753 -5465 -5605
5634e605J333M927K509K510l077l99L309O51o849m691L501K409k527J947L008
$$ -5605 -4272 655 3164 5674 2597 2198 5507 6158 -691 -5382 -1881 528 -1999 -52 2956
5619B956m406k229Q73M635L028J575m183m844j448j928J578M039K98o80K07k064
$$ 2956 -1450 -3679 -2806 1829 4857 6432 2249 -2595 -4043 -5971 -4393 -354 -56 -736 -529 -2593
5603b593K610K09p27l5P78n00k675J656o81k80J334l68n007J041Q11P332P55j224
$$ -2593 17 226 -501 -536 242 -258 -2933 -1277 -1958 -2238 -904 -1272 -6279 -5238 -4427 2905 3660 2436
5585B436M484K717K450m814l554l652j218MJ224K354J228l89L52k382n965K53
$$ 2436 6920 9637 12087 7273 3719 67 -1151 -1147 77 2431 3659 3270 3622 1240 -4725 -4472
5569d472L12K818J394l642m859K616N14Q93L669L198o75k257R64j759j657N527
$$ -4472 -4160 -1342 52 -3590 -8449 -5833 -5319 -4426 -757 2441 1766 -491 473 -1286 -2943 2584
5553B584L268P09N43k125k509L915J952o098k511J562L033L378O80m41l980o868
$$ 2584 5852 6561 7104 4979 2470 6385 8337 2239 -272 1290 4323 7701 8381 7940 3960 -2908
5537b908K727K947l504m271P36J224J697K195J437J615K099N14m73j916k082J034
$$ -2908 -181 2766 -738 -5009 -4273 -3049 -1352 843 2280 3895 5994 6508 6035 4119 2037 3071
5521C071o394k397m001l601O307L747K605Q81k937j568N89j350L406R47k447m066
$$ 3071 -3323 -5720 -9721 -13322 -7015 -3268 -663 218 -2719 -4287 -3698 -5048 -1642 -695 -3142 -7208
5505g208J10m08M711L040M453K357n829j536K627j320j209J53j088l320J831O617
$$ -7208 -7098 -7506 -2795 245 4698 7055 1226 -310 2317 997 -212 -59 -1147 -4467 -2636 3981
5489C981K373O06m559j557K08O309L006k928k410j489J491J938J270j867j061
$$ 3981 6354 6960 2401 844 1052 7361 10367 7439 5029 3540 5031 6969 8239 6372 5311
5474E311o677j314r31N289L491n400j476j366L25J827M813J669o19o79p51m663
$$ 5311 -1366 -2680 -3611 1678 5169 -231 -1707 -3073 -2748 -921 3892 5561 4942 4263 3512 -1151
5458a151o94j84K681m98k635n305k319J319M471M525M61m992l09j643k701L454
$$ -1151 -1845 -2029 652 154 -2481 -7786 -10105 -8786 -4315 210 671 -4321 -4630 -6273 -8974 -5520
5442e520N423M231J068K07j689j953m144k508J951J138M118L433q491m438j786
$$ -5520 -97 4134 5202 5409 3720 1767 -2377 -4885 -2934 -1796 2322 5755 -2736 -7174 -8960
5427h960L119N648j844k874K499O400O438j225q257j885K071j084J592J245J677
$$ -8960 -5841 -193 -2037 -4911 -2412 3988 10426 9201 944 -941 1130 46 1638 2883 4560
5412D560l126j567K577N839J658J28k68l471k459J597K007j459k676j66L275m165
$$ 4560 1434 -133 2444 8283 9941 10069 9801 6330 3871 5468 7475 6016 3340 3174 6449 2284
5396B284k259j321M253J669r28L042j299k224j059o96L412l75m067m401J250N387
$$ 2284 25 -1296 2957 4626 3698 6740 5441 3217 2158 1462 4874 4499 432 -3969 -2719 2668
5380B668M272j709k147k838l039N531K866k041l781O27K345J980L441l877m341
$$ 2668 6940 5231 3084 246 -2793 2738 5604 3563 -218 409 2754 4734 8175 4298 -43
5365d3l836M160M619l500m831R84L516J96l51n88k890n155j345P19J396K224Q21
$$ -43 -3879 281 4900 1400 -3431 -2447 1069 1265 914 326 -2564 -7719 -9064 -8345 -6949 -4725 -3904
5348c904J827J811K958J693K627k120l836P40j512L10J518R24L712k494k111j185
$$ -3904 -2077 -266 2692 4385 7012 4892 1056 1796 284 594 2112 3036 6748 4254 2143 958
5332I58m383k134mL877O846K187P29n30n19l979m972n092o68m408M92M624J013
$$ 958 -3425 -5559 -5563 -1686 5160 7347 8076 7546 7027 3048 -1924 -7016 -7684 -12092 -11600 -6976 -5963
5315e963j478L112J212R54k936P75K367m59j16L627K043k990Q43k116l42J791
$$ -5963 -7441 -4329 -3117 -2163 -5099 -4324 -1957 -2416 -2532 1095 3138 148 991 -1125 -1467 324
5299C24J541J676M0N44l777l155j713O92P277j035k542l601K739L128n463Q86
$$ 324 1865 3541 3581 4125 348 -2807 -4520 -3828 3449 2414 -128 -3729 -990 2138 -3325 -2439
5283b439j179j872l917K530L068m13J486N702P300m806n760l169P879K026o430
$$ -2439 -3618 -5490 -9407 -6877 -3809 -4222 -2736 2966 10266 5460 -300 -3469 4410 6436 6
5268Fj790o062j25J892j872M8N242L61L006M562J133k782j758j728J337k146J769
$$ 6 -1784 -7846 -7971 -6079 -7951 -7903 -2661 -2300 706 5268 6401 3619 1861 133 1470 -676 1093
5251A093M147N090J539o817k894J156K126j693m613k507j721L626l325M905L733
$$ 1093 5240 10330 11869 5052 2158 3314 5440 3747 -866 -3373 -5094 -1468 -4793 112 3845
5236C845N17K24l096J782J30l13L640j645m583j11J60M496n050j118m47p67P90
$$ 3845 4362 4586 1490 3272 3402 3089 6729 5084 501 390 550 5046 -4 -1122 -1569 -2336 -1546
5219a546o09J118L95j334K85j292J424K647K341N48j568k226k785O26N395p34
$$ -1546 -2155 -1037 -642 -1976 -1691 -2983 -1559 1088 3429 3977 2409 183 -2602 -1976 3419 2685
5203B685J969k444l920n63L801N35P03J111k286o853l114l78M142L584R91L2R43
$$ 2685 4654 2210 -1710 -2273 1528 2063 2766 3877 1591 -5262 -8376 -8754 -4612 -1028 -37 -5 938
5186I38K714j37j740J024L076k758l939K947J546L298p99J05K054K523j152K084
$$ 938 3652 3515 1775 2799 5875 3117 -822 2125 3671 6969 6170 6275 8329 10852 9700 11784
5170A1784n235k137O0k594P56l892j997L019l777N51R044R19n977o45k73j2J154
$$ 11784 6549 4412 4472 1878 2634 -1258 -3255 -236 -4013 -3462 5582 6501 524 -121 -394 -406 748
5153G48J650L36k203L992L686l669l890K688J793k924m048l11j818l015p28J172
$$ 748 2398 2734 531 4523 8209 4540 650 3338 5131 2207 -1841 -2152 -3970 -6985 -7713 -6541
5137f541O010L162k968Q6n13L20j797n31J774j289k488j896k235J876K803J396
$$ -6541 -531 2631 -337 -251 -764 -444 -2241 -2772 -998 -2287 -4775 -6671 -8906 -7030 -4227 -2831
5121b831M599J443K258M088K317l375k355j344l600J485J35p46j793J090j030
$$ -2831 1768 3211 5469 9557 11874 8499 6144 4800 1200 2685 2820 2074 281 1371 341
5106C41j777r4j352J925O616J263o006L108K343j784j91K169j444j825M9m025
$$ 341 -1436 -1530 -2882 -957 5659 6922 916 4024 6367 4583 4392 6561 5117 3292 3341 -684
5090f84M80J197j944k374M470K106k859j879K551L079j159m339J908O141K16k937
$$ -684 -204 993 -951 -3325 1145 3251 392 -1487 1064 4143 2984 -1355 553 6694 6910 3973
5074C973m398k755J033L404k711J361N353K367K97l030q57J246k591k859l48l206
$$ 3973 -425 -3180 -2147 1257 -1454 -93 5260 7627 7924 4894 4037 5283 2692 -167 -515 -3721
5058c721Q31J156R65l78K594J943M377Q21k056l946l180j197m775J793P48l09
$$ -3721 -2890 -1734 -769 -1147 1447 3390 7767 8588 6532 2586 -594 -1791 -6566 -4773 -4025 -4334
5042d334L753K040j860k86M309k171k886l186M900J03m623k175M765L343Q63M75
$$ -4334 -581 1459 -401 -687 3622 1451 -1435 -4621 279 382 -4241 -6416 -1651 1692 2555 3030
5026C030J515p1j545l45k066n3N107J763k004K174n9j672j596J682j377k281j416
$$ 3030 4545 4474 2929 2584 518 465 5572 7335 5331 7505 7446 5774 4178 5860 4483 2202 786
5009G86J262l37R00j008m198M835L059k080L868K545p6J378p10j212o338l247
$$ 786 2048 1711 2611 1603 -2595 2240 5299 3219 7087 9632 9556 10934 10224 9012 2674 -573
4993e73l80j174P63j246j577O83P8M557K707j838N97J606J229j940m057j447L282
$$ -573 -953 -2127 -1364 -2610 -4187 -3504 -3426 1131 3838 2000 2597 4203 5432 3492 -565 -2012 1270
4976A270r04r91J86J781K195k977K60J051K405J306j066n9M359K257J673m372
$$ 1270 366 -625 -439 1342 3537 560 820 1871 4276 5582 4516 4457 8816 11073 12746 8374
4960H374l686l505l422l153O769K334k405O05K689m62K040k40o418j210M179K685
$$ 8374 4688 1183 -2239 -5392 1377 3711 1306 1911 4600 4138 6178 5938 -480 -1690 2489 5174
4944E174n291j592K511M755K026j651J319l467K75m60l030n18k63j186O74J774
$$ 5174 -117 -1709 802 5557 7583 5932 7251 3784 4059 3599 569 51 -212 -1398 -724 1050
4928A050P52l369o81M955k869m120j52J846K021M49j1j412l379k365L47M908Q925
$$ 1050 1802 -1567 -2248 2707 -162 -4282 -4434 -2588 -567 -118 -129 -1541 -4920 -7285 -6938 -2030 6895
4911F895j798q58j217j423J122J787k805l366m8K878K931l977J9L077Q02j82j284
$$ 6895 5097 4239 3022 1599 2721 4508 1703 -1663 -1711 1167 4098 121 140 3217 4019 3837 2553
4894B553l194o284J161L411K594J046J706K669P09l408l590L27R57K67o180M56
$$ 2553 -641 -6925 -5764 -2353 241 1287 2993 5662 6371 2963 -627 -300 657 924 -5256 -4800
4878d800L742K96N596L233l240n454K26J047o23J736K555K075l199J779J381q454
$$ -4800 -1058 -762 4834 8067 4827 -627 -401 646 23 1759 4314 6389 3190 4969 6350 -2104
4862b104p581J785M842Q56L84M012j191o29O572J019m238m219J265L049K581J75
$$ -2104 -9685 -7900 -3058 -2202 -1818 2194 1003 374 6946 7965 3727 -492 773 3822 6403 6578
4846F578q63O3J071m045r83J138l95N98j269J996N76K8k248l084l314J671p09
$$ 6578 5715 5778 6849 2804 1821 2959 2564 3162 1893 3889 4465 4493 2245 -839 -4153 -2482 -3191
4829c191K344K389L30m002J295J215J80j024l843l147L111J906m31M94K117j66
$$ -3191 -847 1542 1872 -2130 -835 380 560 -464 -4307 -7454 -4343 -2437 -2868 -2374 -257 -423
4813d23J538O87l188k227N645P121l618m907m766R43J440K711K376k04J60J686
$$ -423 1115 1802 -1386 -3613 2032 9153 5535 628 -4138 -3195 -1755 956 3332 3128 3288 4974
4797D974R68Q7K765j646l761l626J178P11k098k289K157M981P10k654o226Q71
$$ 4974 5942 6029 8794 7148 3387 -239 939 1650 -448 -2737 -580 4401 5111 2457 -3769 -2898
4781b898P994K924l865j804J154J227m288k122J534k237k35o87L458k679J589
$$ -2898 5096 8020 4155 2351 3505 4732 444 -1678 -144 -2381 -2616 -3303 155 -2524 -935
4766i35K065n98N504l75r39L178k145j466J770J225n094m81P90j064m734N219
$$ -935 1130 532 6036 5661 4722 7900 5755 4289 6059 7284 2190 1709 2499 1435 -3299 1920
4750A920L625J839k563m557j346L650o06m292L198J51j775o43O040L988j018r4
$$ 1920 5545 7384 4821 264 -1082 2568 1962 -2330 868 1019 -756 -1399 4641 8629 7611 7517
4734G517q04l060k927J742J84J347J014j335p47K877k9R63j524k273L96L66J061
$$ 7517 6713 3653 726 2468 2652 3999 5013 3678 2931 5808 5779 6742 5218 2945 3341 3707 4768
4717D768j888j269K120L615l061n83J724k442o948j011K796J657j041L864P88
$$ 4768 2880 1611 3731 7346 4285 3702 5426 2984 -3964 -4975 -2179 -522 -1563 2301 3089
4702C089p19j370o55m13K853N736k95o08j009m67j952M23J089k038J79k949R5
$$ 3089 2370 1000 345 -68 2785 8521 8226 7618 6609 6142 4190 4613 5702 3664 3843 894 989
4685I89k230j684K42J772M875L513l537J256r31m43L029k484m74L263J403l856
$$ 989 -1241 -2925 -2683 -911 3964 7477 3940 5196 4265 3822 6851 4367 3893 7156 8559 4703
4669D703k771n167m017M326K915k299q12J918k86J644N224L478k63m433J72j475
$$ 4703 1932 -3235 -7252 -2926 -11 -2310 -3122 -1204 -1490 154 5378 8856 8593 4160 4332 2857
4653B857m237o59k449l11k869K368K271N494K816m39j67J603J529k314j910K131
$$ 2857 -1380 -2039 -4488 -4799 -7668 -5300 -3029 2465 5281 4842 4675 6278 7807 5493 3583 5714
4637E714L390l10L1o49K897k035j492M94k259R93k022n09K519m719J220n08l736
$$ 5714 9104 8794 8825 8176 11073 9038 7546 8040 5781 6774 4752 4243 6762 2043 3263 2755 -981
4620i81k262N02J282J997j425j938J015O68p59K079j280j485K334J244l58j552
$$ -981 -3243 -2741 -1459 538 -887 -2825 -1810 -1142 -1901 178 -1102 -2587 -253 991 633 -919
4604i19j802j683N35L279N846Q02k975o511k365j814K87K069M366k747o402r34
$$ -919 -2721 -4404 -3869 -590 5256 6058 3083 -3428 -5793 -7607 -7320 -5251 -885 -3632 -10034 -10968
4588a0968k26J572O453J617j272M137K763L282J898J359p81j701K319j656l618
$$ -10968 -11194 -9622 -3169 -1552 -2824 1313 4076 7358 9256 10615 9834 8133 10452 8796 5178
4573E178l007k74K510N408j173m210l981j573m391j190J56K791O241M74K02J028
$$ 5178 2171 1897 4407 9815 8642 4432 451 -1122 -5513 -6703 -6547 -3756 2485 2959 3161 4189
4557D189l542j587l679j623P88J319K245Q67j659O78k708L611K521J642j999k728
$$ 4189 647 -940 -4619 -6242 -5454 -4135 -1890 -1023 -2682 -2004 -4712 -1101 1420 3062 1063 -1665
4541a665M732K463k140m035M384N644k837l135J117L654k67k156K189l60q24m94
$$ -1665 3067 5530 3390 -645 3739 9383 6546 3411 4528 8182 7915 5759 7948 7588 6764 6270
4525F270m940k638j30N460L623Q73k180l468n695j645M318N457M246J438j777
$$ 6270 1330 -1308 -1438 4022 7645 8518 6338 2870 -2825 -4470 -152 5305 9551 10989 9212
4510I212k422l93j779l544J025J874J430J009k73k782M62M450J111n71K753K239
$$ 9212 6790 6397 4618 1074 2099 3973 5403 6412 6139 3357 3819 8269 9380 8809 11562 13801
4494A3801m716j596k556n749k635L169L143J052K503R30j543J87J66l426P89l024
$$ 13801 9085 7489 4933 -816 -3451 -282 2861 3913 6416 7346 5803 5990 6156 2730 3519 495
4478D95N94M981K462l364j018l820k604Q61M180J965j845k490k087J82k537P95
$$ 495 1089 6070 8532 5168 4150 330 -2274 -1413 2767 4732 2887 397 -1690 -1508 -4045 -3250
4462c250j739J945K313J046K538J639K516l089n139K08M011j783j803J816l2k450
$$ -3250 -4989 -3044 -731 315 2853 4492 7008 3919 -1220 -1012 2999 1216 -587 1229 1197 -1253
4446a253M10J890o802K781L502L247K716j24l542p265J182M492m484M306K269
$$ -1253 -843 1047 -5755 -2974 528 3775 6491 6367 2825 -4440 -3258 1234 -3250 1056 3325
4431C325p35j984N213j054k856J717k673k715j458j04m029J676n12j405K573L637
$$ 3325 2590 606 5819 4765 1909 3626 953 -1762 -3220 -3324 -7353 -5677 -6189 -7594 -5021 -1384
4415a384k908m570L432L876q47l12m091J810L973l80j28j285J890K432J576J098
$$ -1384 -4292 -8862 -5430 -1554 -2401 -2713 -6804 -4994 -1021 -1401 -1529 -2814 -924 1508 3084 4182
4399D182l657j629L057M516K66k585k938J911j799n151J619L029L463M286O53
$$ 4182 525 -1104 1953 6469 6735 4150 1212 3123 1324 -3827 -2208 821 4284 8570 9223
4384I223K000j657m57k065r20K589L113j841p828m420M2Q02j301M59J025J568
$$ 9223 11223 9566 9109 7044 6124 8713 11826 9985 2157 -2263 -2221 -1419 -2720 -2261 -1236 332
4368C32N68k23K926N16K585m25j420j530k385K306j373j876K557M410N64p75q27
$$ 332 900 677 3603 4119 6704 6279 4859 3329 944 3250 1877 1 2558 6968 7532 6757 5930
4351E930L8O71k518J163m22p47K28j598K232J774J338j13L34m56M25J032j307
$$ 5930 5968 6639 4121 5284 4862 4115 4343 2745 4977 6751 8089 7976 8310 7854 8279 9311 8004
4334H004m807j022k63K794J416m73j516n84J869q78m383k640M40L394j872j764
$$ 8004 3197 2175 1912 4706 6122 5649 4133 3549 5418 4540 157 -2483 -2043 1351 -521 -2285
4318b285L387K423o774o299Q650O417L82l468l064J093l291l826l93L76O43P998
$$ -2285 1102 3525 -3249 -9548 -898 5519 5901 2433 -631 462 -2829 -6655 -7048 -6672 -6029 1969
4302A969k156k677K202J653J9J024k879n065M510J954j023k2L441M31j704J61
$$ 1969 -187 -2864 -662 991 1010 2034 -845 -5910 -1400 554 -469 -491 2950 3381 1677 1838
4286A838j157k797L082J159o943J245M504N145N81m782n912q91M821J552l843
$$ 1838 681 -2116 966 2125 -4818 -3573 931 6076 6657 1875 -4037 -4928 -107 1445 -2398
4271b398m89L354k027l793K562N915M724n800j264r38K319J798o547p642m064
$$ -2398 -2887 467 -1560 -5353 -2791 3124 7848 2048 784 -154 2165 3963 -2584 -10226 -14290
4256a4290L182O072L322j719K992L360j716j484J88q20J178L546j181o217O87
$$ -14290 -11108 -5036 -1714 -3433 -441 2919 1203 -281 -93 -913 265 3811 2630 -3587 -2900
4241b900k905k375K606j739L907L863R11L215j991k38n93m517k826J729o9m221
$$ -2900 -5805 -8180 -5574 -7313 -3406 457 1368 4583 2592 2354 1761 -2756 -5582 -3853 -3922 -8143
4225h143L484M427k19J103J178K440O405J751n691o820k329j317o038J990P531
$$ -8143 -4659 -232 -451 652 1830 4270 10675 12426 6735 -85 -2414 -3731 -9769 -7779 -248
4210b48L322m934k7O066K865o375k930L166m085k582J307M039k319M529O001q32
$$ -248 3074 -1860 -1887 4179 7044 669 -2261 905 -3180 -5762 -4455 -416 -2735 1794 7795 6963
4194F963j852j245O43j046k322j007j716m194J331m59K108L496m458j492M965
$$ 6963 5111 3866 4509 3463 1141 134 -1582 -5776 -4445 -4904 -2796 700 -3758 -5250 -285
4179b85K817p53p69J326K558P88J712m778j979L206M050L059l607k391L192n40
$$ -285 2532 1779 1010 2336 4894 5682 7394 2616 637 3843 7893 10952 7345 4954 8146 7606
4163G606k212r25k745q14K201r51L056N49L04N24j462j200l901M597L057N34k804
$$ 7606 5394 4469 1724 910 3111 2160 5216 5765 6069 6593 5131 3931 30 4627 7684 8218 5414
4146E414k807l493p03L021l87L63k645J869o19l70K992J403k322J2K943k140m823
$$ 5414 2607 -886 -1589 1432 1045 1408 -1237 632 13 -357 2635 4038 1716 1728 4671 2531 -2292
4129b292M080N378L903k133k230k369R75L995j497l709l382l911k520j243J759
$$ -2292 1788 7166 11069 8936 6706 4337 5312 9307 7810 4101 719 -3192 -5712 -6955 -5196
4114e196M665r64J720K897M363K576l80j737p65m76l471l028J324J030p47L046
$$ -5196 -531 -1495 225 3122 7485 10061 9681 7944 7179 6703 3232 204 1528 2558 1811 4857
4098D857k086j95K413j234k778l632j067M330K794O74j783l354K737O14k449K664
$$ 4857 2771 2576 4989 3755 977 -2655 -3722 608 3402 4076 2293 -1061 1676 2290 -159 2505
4082B505j069k196j738R63K80K381j289j695j493J934O084J827p01J987k625L117
$$ 2505 1436 -760 -2498 -1535 -1255 1126 -163 -1858 -3351 -1417 4667 6494 5793 7780 5155 8272
4066H272N11J177M606k744n401n65M156j278n177j287J695j316Q49j02j254M346
$$ 8272 8783 9960 14566 11822 6421 5856 10012 8734 3557 2270 3965 2649 3498 3396 2142 6488
4050F488l649p30M480L90l209l031l4M446l40l414R54N90M147n76n09l248l851
$$ 6488 2839 2109 6589 6979 3770 739 705 5151 4811 1397 2351 2941 7088 6512 6003 2755 -1096
4033a096j197n92K176J954M91j144K211J009j976l233j318M162L330l444K77M326
$$ -1096 -2293 -2885 -709 1245 1736 592 2803 3812 1836 -1397 -2715 1447 4777 1333 1610 5936
4017E936k493K089o17M639O15k304m270n156m734j091N817K507L705k66R21j936
$$ 5936 3443 5532 4915 9554 10169 7865 3595 -1561 -6295 -7386 -1569 938 4643 4377 5298 3362
4001C362o99J013J252K353k612j64M446k975o163J218L229M028j555K321j669
$$ 3362 2663 3676 4928 7281 4669 4505 8951 5976 -187 1031 4260 8288 6733 9054 7385
3986G385L67J086m115J419m030l941M496O204O041L49k463l124r181k562l257
$$ 7385 7752 8838 4723 6142 2112 -1829 2667 8871 14912 15261 12798 9674 493 -2069 -5326
3971e326m644J980J0186L939K251J414m480k266j463K255L657K273m05l577m176
$$ -5326 -9970 -7990 2196 6135 8386 9800 5320 3054 1591 3846 7503 9776 9371 5794 1618
3956A618n230K223P74l24K698k345l623K22O413J833k15k076l442O785K465N085
$$ 1618 -3612 -1389 -615 -939 1759 -586 -4209 -3987 2426 4259 4044 1968 -1474 5311 7776 12861
3940A2861O33l057l285n414j868L134P36j586p43J678J48p71p49k761P46K840
$$ 12861 13494 10437 7152 1738 -130 3004 3740 2154 1411 3089 3237 2466 1717 -1044 -298 2542
3924B542L37K720L927j666l15K391N146j866j821k540l213k44r90J872j576M33
$$ 2542 2879 5599 9526 7860 7545 9936 15082 13216 11395 8855 5642 5398 4408 6280 4704 5137
3908E137m0n002j123M17N980K149O83m36N16j35m950l238j142q18J836L202K035
$$ 5137 5097 95 -1028 -611 5369 7518 8201 7765 8281 8146 3196 -42 -1184 -2002 -166 3036 5071
3891E071r57N216O428K502p73j94p566l865k723J10K699K24m668j56l915k764
$$ 5071 4114 9330 15758 18260 17487 17293 9727 5862 3139 3249 5948 6172 1504 1348 -2567 -5331
3875e331K455J219n446j813K588K901k216l251R10P463O599J747k599p32L723
$$ -5331 -2876 -1657 -7103 -8916 -6328 -3427 -5643 -8894 -7984 -521 6078 7825 5226 4494 8217
3860H217J261j073m57P78m549K619L81k19k720j62J281j932m813K879k58k983
$$ 8217 9478 8405 7948 8726 4177 6796 7177 6958 4238 4076 5357 3425 -1388 1491 1233 -1750
3844a750M919K851M76k447K93l087k39M612k745o309j764N390l221o879j780M069
$$ -1750 3169 6020 6496 4049 4342 1255 1016 5628 2883 -3426 -5190 200 -3021 -9900 -11680 -7611
3828g611L234r23k39J732Q5M939K797L809l534m941q00L679K589K457P03M60l770
$$ -7611 -4377 -5300 -5539 -3807 -3722 1217 4014 7823 4289 -652 -1452 2227 4816 7273 7976 8436 4666
3811D666J417j929j447P85K559K185j022L947j544l696J205j37j623k189J777
$$ 4666 6083 4154 2707 3492 6051 8236 7214 11161 9617 5921 7126 6989 5366 3177 4954
3796D954j265m52M99M292r14J6l907p16q50R86J553k404j047K182p260k252R32
$$ 4954 3689 3237 3736 8028 7114 7130 3223 2507 1657 2643 4196 1792 745 2927 -4333 -6585 -5653
3779e653J516j66k439L55N909L761l337R11J089l74l956n65J750N109l061n036
$$ -5653 -4137 -4303 -6742 -6387 -478 3283 -54 857 1946 1572 -2384 -2949 -1199 3910 849 -4187
3763d187J970M670L04J275j398L02J190m063K819K114N156j926p625l670K30j283
$$ -4187 -2217 2453 2757 4032 2634 2936 4126 63 2882 4996 10152 8226 601 -3069 -2839 -4122
3747d122j092N172M813M020L44L87k807j063L9j811M92q13J157J173P09q290o814
$$ -4122 -5214 -42 4771 8791 9135 9522 6715 5652 5691 3880 4372 3559 4716 5889 6598 -1692 -8506
3730h506R06N851P494O891k943k165l593j543P90L80o74L41K515J930J509N091
$$ -8506 -7600 -1749 5745 12636 9693 7528 3935 2392 3182 3562 2888 3229 5744 7674 9183 14274
3714A4274j668l581j40K434l062n856j627K092K661o04M014J824j786l734k208
$$ 14274 12606 9025 8885 11319 8257 2401 774 2866 5527 4923 8937 10761 8975 5241 3033
3699C033k150m595k355l663j51K342j451J479M544q50R33N274Q75K564O55l026
$$ 3033 883 -3712 -6067 -9730 -9881 -7539 -8990 -7511 -2967 -3817 -2884 2390 3265 5829 6484 3458
3683C458k322K270K736M041l751m587j450M193J086j440K690J699j671l802j724
$$ 3458 1136 3406 6142 10183 6432 1845 395 4588 5674 4234 6924 8623 6952 3150 1426
3668A426j038L142J782j549j943O37K405q18o62K545K123l620k507j91J095K119
$$ 1426 388 3530 5312 3763 1820 2457 4862 4044 3382 5927 8050 4430 1923 1732 2827 4946
3652D946j780m072j256J894L52L426N5J294L144J126k077o067j675J844L064K303
$$ 4946 3166 -906 -2162 -268 84 3510 3565 4859 8003 9129 7052 985 -690 1154 4218 6521
3636F521J970K786p406k158j711M0k12m519j201J444M441J276J026m99j958L795
$$ 6521 8491 11277 3871 1713 2 42 -170 -4689 -5890 -4446 -5 1271 2297 1798 -160 3635
3620C635j038j092j282j370J272M778j347n661L80j861r90L448M340K678l143
$$ 3635 2597 1505 223 -1147 125 4903 3556 -2105 -1725 -3586 -4576 -1128 3212 5890 2747
3605B747l187j432j316N560J165J658k711l942n29J064j770j236J767l832m73
$$ 2747 -440 -1872 -3188 2372 3537 5195 2484 -1458 -1987 -923 -2693 -3929 -2162 -5994 -6467
3590f467k60K984K262q62m298L023L746l412j942K891Q06k229j707m086k541K157
$$ -6467 -6727 -3743 -1481 -2343 -6641 -3618 128 -3284 -5226 -2335 -1529 -3758 -5465 -9551 -12092 -9935
3574i935O428J384j371J294J737P73J626P75j531q4m70J561p80j420Q60K924m27
$$ -9935 -3507 -2123 -3494 -2200 -463 310 1936 2711 1180 1096 626 2187 1407 -13 847 3771 3344
3557C344L433K19o35m520l364m153J590J086M81O863M422N88o779o665j626l8
$$ 3344 6777 6996 6361 1841 -1523 -5676 -4086 -3000 -2519 4344 8766 9354 2575 -4090 -5716 -5754
3541e754J389J650L685J525J733l067Q64M635l567k468M391M765n395o850k443
$$ -5754 -4365 -2715 970 2495 4228 1161 2025 6660 3093 625 5016 9781 4386 -2464 -4907
3526d907k68k031p15R38O635K521r74M6O696J170l048j375j638P98n004k184N261
$$ -4907 -5175 -7206 -7921 -6983 -348 2173 1199 1245 7941 9111 6063 4688 3050 3848 -1156 -3340 1921
3509A921K366l377m078K029J263r24k275l30N27P939M107R70p234l005q85j685
$$ 1921 4287 910 -3168 -1139 124 -800 -3075 -3405 -2878 5061 9168 10138 2904 -101 -986 -2671
3493b671K84J866j648J260j70r54k281l484L167j363M652J255l17m097K417K449
$$ -2671 -2387 -521 -2169 -909 -1079 -2033 -4314 -7798 -4631 -5994 -1342 -87 -404 -4501 -2084 365
3477C65j750L27L711l45P040k314m50J032L079J018l180J98j319l5j876l359J709
$$ 365 -1385 -1058 2653 2308 9348 7034 6584 7616 10695 11713 8533 8731 7412 7377 5501 2142 3851
3460C851O9j93J162J419p16k248j76o14K051q96L451O137l922k919M34J54q08
$$ 3851 3920 3727 4889 6308 5592 3344 3168 2554 4605 3709 7160 13297 9375 6456 6890 7044 6236
3443F236o40J736m37n451J264K179n870q71j81R7J554K103P05L555P99K943j276
$$ 6236 5596 7332 6895 1444 2708 4887 -983 -1854 -2035 -1938 -384 1719 2424 5979 6778 9721 8445
3426H445J160j606m546l812p85L678J249L228r81j91M453k057o489r46l388L164
$$ 8445 9605 7999 3453 -359 -1144 2534 3783 7011 6030 5839 10292 8235 1746 800 -2588 576
3410E76M007O49k996K387K574L230j505K887l017l090L37k175n565l318N802O479
$$ 576 4583 5232 2236 4623 7197 10427 8922 11809 8792 5702 6039 3864 -1701 -5019 783 7262
3394G262K535j2o356j255K11K956Q7k494m710J823K956J27P69p0l505J654M492
$$ 7262 9797 9785 3429 2174 2385 5341 5428 2934 -1776 47 3003 3130 3899 3829 324 1978 6470
3377F470J913j278M28j07J862l822l550j587K518M769M165P46n92k989m223rk298
$$ 6470 8383 7105 7533 7426 9288 5466 1916 329 2847 7616 11781 12527 11935 8946 4723 4714 2416
3360B416k979K601j161L322P864J140l090j94P09j320k089l443j084N401j761
$$ 2416 -563 2038 877 4199 12063 13203 10113 9919 10628 9308 7219 3776 2692 8093 6332
3345F332l448r8k843m174K429O864L615m523m829K873J747j894P3k103L414L531
$$ 6332 2884 2786 -57 -4231 -1802 5062 8677 4154 -675 2198 3945 2051 2124 21 3435 6966
3329F966l735K801N62L84k826K567J625l98L48j742k516j98l16J848J638j18J743
$$ 6966 3231 6032 6594 6978 4152 6719 8344 7946 8294 6552 4036 3838 3522 5370 7008 6890 8633
3312H633j286k665j046k83N21M035j091m662M43l262M33R66L977j192q77k9j40
$$ 8633 7347 4682 3636 3353 3874 7909 6818 2156 2599 -663 -230 736 4713 3521 2644 2615 2475
3295B475p89L976k94j787p96j594j370J118j628J78J549J570K613J702k238l518
$$ 2475 1686 5662 5368 3581 2785 1191 -179 939 -689 -511 1038 2608 5221 6923 4685 1167
3279A167l837l386M389j941n14M951l351k401K75K794l12J203j712n48m011J206
$$ 1167 -2670 -6056 -1667 -3608 -4122 829 -2522 -4923 -4648 -1854 -2166 -963 -2675 -3223 -7234 -6028
3263f028Q20K375N527L490j376j435k078J234j706j806J830J261k612k193M072
$$ -6028 -5208 -2833 2694 6184 4808 3373 1295 2529 823 -983 847 2108 -504 -2697 1375
3248A375L319l874j842k143P54o229J495O174J387o038j793Q95k48M106M554K322
$$ 1375 4694 820 -1022 -3165 -2411 -8640 -7145 -971 416 -5622 -7415 -6520 -6768 -2662 1892 4214
3232D214M594q03l878k106J196L130o2J038N41m681n96k851l098L747j50j900
$$ 4214 8808 8005 4127 2021 3217 6347 6285 7323 7864 3183 2587 -264 -3362 385 235 -1665
3216a665j141j214q2J53N298O539j013l202k85M040L679K588k035m38K172j116
$$ -1665 -2806 -4020 -4102 -3949 1349 7888 6875 3673 3388 7428 11107 13695 11660 11222 13394 12278
3200A2278q518j916j284L779K034n54k198K54J112p979k298L052j866M04M129
$$ 12278 3760 1844 560 4339 6373 5819 3621 3875 4987 -2992 -5290 -2238 -4104 -3700 429
3185D29j688j944Q5M080M956oj041L30j68K181l36k079q83m477j577M59K384M247
$$ 429 -1259 -3203 -3118 962 5918 5912 4871 5201 5033 7214 6878 4799 3916 -561 -2138 -1679 705 4952
3167D952M377j766k915K473L249k451l248J086O6l040m29k111J502Q68j128O044
$$ 4952 9329 7563 4648 7121 10370 7919 4671 5757 5823 2783 2354 243 1745 2613 1485 7529
3151G529m91n530p087j611l42J959K908j587P055N860l661m456K600K566j480
$$ 7529 7038 1508 -5579 -7190 -7532 -5573 -2665 -4252 2803 8663 5002 546 3146 5712 4232
3136D232N93J01J428o76J829m361J863K540m824m491J765M696l705l327K582j008
$$ 4232 4825 4926 6354 5678 7507 3146 5009 7549 2725 -1766 -1 4695 990 -2337 245 -763
3120g63J972K46M74j109j887q35m823k291r37m35O205R386R64k702l275L025N880
$$ -763 1209 1455 1929 820 -1067 -1902 -6725 -9016 -9953 -10388 -4183 5203 6167 3465 190 3215 9095
3103I095O0k878n129o99K334m75j811K853l22m518L085M958l748n73r70k11N598
$$ 9095 9155 6277 1148 449 2783 2308 497 3350 3028 -1490 1595 6553 2805 2232 1262 1051 6649
3086F649K011J655Q09j38j670k25n414n842n6N139n600q14N22J754p75k982p45
$$ 6649 8660 10315 11124 10986 9316 9091 3677 -2165 -2221 2918 -2682 -3496 -2974 -1220 -1995 -4977 -5722
$$ [...]
##END NTUPLES=NMR SPECTRUM
##END=
