##TITLE=Analysis number 314906
Compound Code km 08398
Project Code adrs
Chemist Name prosynth
##JCAMPDX= 6.0         $$ Bruker NMR JCAMP-DX V2.0
##DATA TYPE= NMR SPECTRUM
##DATA CLASS= NTUPLES
##ORIGIN= Bruker BioSpin GmbH
##OWNER= NMR
$$ XWIN-NMR		Version 3.5
$$ Mon Oct 31 12:31:32 2005 GMT Standard Time (UT+0h)  MAYBRIDGE\NMR@NMR_250MHZ
##.OBSERVE FREQUENCY= 250.131544655141
##.OBSERVE NUCLEUS= ^1H
##.ACQUISITION MODE= SIMULTANEOUS (DQD)
##.ACQUISITION SCHEME= undefined
##.AVERAGES= 16
##.DIGITISER RES= 18
##SPECTROMETER/DATA SYSTEM= dpx250
##.PULSE SEQUENCE= zg30
##.SOLVENT NAME= CDCl3
##.SHIFT REFERENCE= (INTERNAL, CDCl3, 0, 16.522)
##AUDIT TRAIL= $$ (NUMBER, WHEN, WHO, WHERE, WHAT)
$$ ##TITLE= Audit trail, XWIN-NMR		Version 3.5
$$ ##JCAMPDX= 5.01
$$ ##ORIGIN= Bruker BioSpin GmbH
$$ ##OWNER= NMR
$$ C:\u/data/dgb/nmr/ADRS/11640/pdata/1/auditp.txt
$$ ##AUDIT TRAIL=  $$ (NUMBER, WHEN, WHO, WHERE, WHAT)
(   1,<2005-10-31 12:31:13.10 +000>,<MAYBRIDGE\NMR>,<NMR_250MHZ>,
      <created by zg, POWCHK disabled, PULCHK disabled
       configuration hash MD5:
       62 19 C7 07 E1 42 D1 B7 37 6C 3D D0 77 39 F9 E6
       data hash MD5: 64K
       FB 5C EF E9 F2 4D EC F5 5B 32 9D 95 BA 20 3F 87>)
(   2,<2005-10-31 12:31:23.89 +000>,<MAYBRIDGE\NMR>,<NMR_250MHZ>,
      <Start of raw data processing
       ef LB = 0.3 FT_mod = 6 PKNL = 1 SI = 32K 
       data hash MD5: 32K
       E5 D5 6D 5D 4E D9 85 A3 48 62 7C 2D 77 DB AF 7A>)
(   3,<2005-10-31 12:31:25.69 +000>,<MAYBRIDGE\NMR>,<NMR_250MHZ>,
      <apk 
       data hash MD5: 32K
       3D FE 48 00 D6 38 5E 1A C9 56 D4 D8 DC 09 02 BC>)
(   4,<2005-10-31 12:31:26.36 +000>,<MAYBRIDGE\NMR>,<NMR_250MHZ>,
      <abs ABSG = 5 
       data hash MD5: 32K
       34 D4 8F 24 1E A9 3F 23 03 5A 4E ED 3A B5 9A ED>)
$$ ##END=
$$ 
$$ hash MD5
$$ BF DB A4 02 D1 C9 A4 CC DC 4C EC 7B 9D 69 71 47
##$RELAX= 
##$RELAX= 
##$RELAX= 
##$RELAX= 
##$RELAX= 
##$RELAX= 
##$RELAX= 
$$ Bruker specific parameters
$$ --------------------------
##$DU= <C:\u>
##$EXPNO= 11640
##$NAME= <ADRS>
##$PROCNO= 1
##$TYPE= <nmr>
##$USER= <dgb>
##$AMP= (0..31)
100 100 100 100 100 100 100 100 100 100 100 100 100 100 100 100 100 100 
100 100 100 100 100 100 100 100 100 100 100 100 100 100 
##$AQSEQ= 0
##$AQ_mod= 3
##$AUNM= <au_zg>
##$AUTOPOS= <26 >
##$BF1= 250.13
##$BF2= 250.13
##$BF3= 250.13
##$BF4= 250.13
##$BF5= 500.13
##$BF6= 500.13
##$BF7= 500.13
##$BF8= 500.13
##$BYTORDA= 1
##$CFDGTYP= 0
##$CFRGTYP= 5
##$CHEMSTR= <none>
##$CNST= (0..31)
1 1 145 1 1 1 1 1 1 1 1 1 1 1 1 1 1 1 1 1 1 1 1 1 1 1 1 1 1 1 1 1 
##$CPDPRG= <>
##$CPDPRG1= <>
##$CPDPRG2= <>
##$CPDPRG3= <>
##$CPDPRG4= <mlev>
##$CPDPRG5= <mlev>
##$CPDPRG6= <mlev>
##$CPDPRG7= <mlev>
##$CPDPRG8= <mlev>
##$CPDPRGB= <>
##$CPDPRGT= <>
##$D= (0..31)
0 1 0 0 0 0 0 0 0 0.06 0 0 0 0 0 0 0.0002 0 0 0 0 0 0 0 0 0 0 0 0 0 0 
0 
##$DATE= 1130761872
##$DBL= (0..7)
120 120 120 120 120 120 120 120 
##$DBP= (0..7)
150 150 150 150 150 150 150 150 
##$DBP07= 0
##$DBPNAM0= <>
##$DBPNAM1= <>
##$DBPNAM2= <>
$$ [...]
##$SUBNAM7= <"">
##$SUBNAM8= <"">
##$SUBNAM9= <"">
##$SW= 20.6930455092707
##$SWIBOX= (0..15)
0 0 3 0 0 0 0 0 0 0 0 0 0 0 0 0 
##$SW_h= 5175.983436853
##$TD= 65536
##$TD0= 1
##$TE= 295.16
##$TE2= 300
##$TE3= 300
##$TEG= 300
##$TL= (0..7)
0 120 120 120 120 120 120 120 
##$TP= (0..7)
150 150 150 150 150 150 150 150 
##$TP07= 0
##$TPNAME0= <>
##$TPNAME1= <>
##$TPNAME2= <>
##$TPNAME3= <>
##$TPNAME4= <>
##$TPNAME5= <>
##$TPNAME6= <>
##$TPNAME7= <>
##$TPOAL= (0..7)
0.5 0.5 0.5 0.5 0.5 0.5 0.5 0.5 
##$TPOFFS= (0..7)
0 0 0 0 0 0 0 0 
##$TUNHIN= 0
##$TUNHOUT= 0
##$TUNXOUT= 0
##$USERA1= <user>
##$USERA2= <user>
##$USERA3= <user>
##$USERA4= <user>
##$USERA5= <user>
##$V9= 5
##$VALIST= <valist>
##$VCLIST= <CCCCCCCCCCCCCCC>
##$VD= 0
##$VDLIST= <DDDDDDDDDDDDDDD>
##$VPLIST= <PPPPPPPPPPPPPPP>
##$VTLIST= <TTTTTTTTTTTTTTT>
##$WBST= 1024
##$WBSW= 4
##$XGAIN= (0..3)
0 0 0 0 
##$XL= 0
##$YL= 0
##$YMAX_a= 420976
##$YMIN_a= -424871
##$ZGOPTNS= <>
##$ZL1= 120
##$ZL2= 120
##$ZL3= 120
##$ZL4= 120
##$ABSF1= 16.522
##$ABSF2= -4.171173
##$ABSG= 5
##$ABSL= 3
##$ALPHA= 0
##$AQORDER= 0
##$ASSFAC= 0
##$ASSFACI= 0
##$ASSFACX= 0
##$ASSWID= 0
##$AUNMP= <proc_1d>
##$AZFE= 0.1
##$AZFW= 0.1
##$BCFW= 0
##$BC_mod= 0
##$BYTORDP= 0
##$COROFFS= 0
##$CY= 12.5
##$DATMOD= 1
##$DC= 0
##$DFILT= <>
##$DTYPP= 0
##$F1P= 14.0000005364418
##$F2P= -0.99999901652339
##$FCOR= 0.5
##$FTSIZE= 32768
##$FT_mod= 6
##$GAMMA= 0
##$GB= 0
##$INTBC= 1
##$INTSCL= 1
##$ISEN= 128
##$LB= 0.3
##$LEV0= 0
##$LPBIN= 0
##$MAXI= 10000
##$MC2= 0
##$MEAN= 0
##$ME_mod= 0
##$MI= 0
##$NCOEF= 0
##$NC_proc= -4
##$NLEV= 6
##$NOISF1= 0
##$NOISF2= 0
##$NSP= 0
##$NTH_PI= 0
##$NZP= 0
##$OFFSET= 16.522
##$PC= 1
##$PHC0= 78.94007
##$PHC1= 7.828295
##$PH_mod= 1
##$PKNL= yes
##$PPARMOD= 0
##$PSCAL= 4
##$PSIGN= 0
##$REVERSE= no
##$SF= 250.13
##$SI= 32768
##$SIGF1= 0
##$SIGF2= 0
##$SINO= 400
##$SIOLD= 32768
##$SREGLST= <1H.CDCl3>
##$SSB= 0
##$STSI= 32768
##$STSR= 0
##$SW_p= 5175.98343685301
##$SYMM= 0
##$S_DEV= 0
##$TDeff= 65536
##$TDoff= 0
##$TI= <Analysis number 999999
Compound Code 99
Book Reference 9
Project Code 9>
##$TILT= no
##$TM1= 0
##$TM2= 0
##$TOPLEV= 0
##$USERP1= <user>
##$USERP2= <user>
##$USERP3= <user>
##$USERP4= <user>
##$USERP5= <user>
##$WDW= 1
##$XDIM= 32768
##$YMAX_p= 506711071
##$YMIN_p= -486567
$$ End of Bruker specific parameters
$$ ---------------------------------
##NTUPLES= NMR SPECTRUM
##VAR_NAME=  FREQUENCY,     SPECTRUM/REAL,   SPECTRUM/IMAG
##SYMBOL=    X,             R,               I
##VAR_TYPE=  INDEPENDENT,   DEPENDENT,       DEPENDENT
##VAR_FORM=  AFFN,          ASDF,            ASDF
##VAR_DIM=   32768,         32768,           32768
##UNITS=     HZ,            ARBITRARY UNITS, ARBITRARY UNITS
##FACTOR=    0.157963299565203, 1,           1
##FIRST=     4132.6476996994, 0,             0
##LAST=      -1043.33573715361, 0,           0
##MIN=       -1043.33573715361, -486567,     0
##MAX=       4132.6476996994, 506711071,     0
$$ Real data points
##PAGE= N=1
##DATA TABLE= (X++(R..R)), XYDATA
$$ [...]
25967e4108q2449q5382K5184J96242l77p8511p5586K7697R0344n7373j02935j05192
25955c02446P7984J10811K9276q312N7521N6230l9519k5797M4542J26665J6393
25944A43348j09365L877m1674j2258J01561j5815j13516r0773N330L4515K7777
25933f6993J46940J16519m2063q4391l8971k26416K5527M5332M1499K6560l507
25922e9964M8938J44057l0267p1780r6949N5945N4813j8672k2388m3321Q5492
25911D5904j8195L8659r1128l0331R4367J36575j52019j50439Q6076M3452j260
25900A661m5538k627N0808P0615m2002r572k2299M9501O1676J05474k2101L5643
25888B31239j12335M615k5850j03160o5755K4456O2936m6304k1912j0861n8457
$$ plain form
25967 -54108 -136557 -221939 -196755 -513 -890 -79401 -154987 -127290 -36946 -94319 -197254 -302446
25955 -302446 -224462 -113651 -84375 -92687 -35166 21064 -18455 -44252 290 126955 143348
25944 143348 33983 37860 -3814 -16072 85489 69674 -43842 -134615 -129285 -94770 -66993
25933 -66993 79947 196466 154403 70012 31041 -195375 -169848 -124516 -83017 -56457 -59964
25922 -59964 -11026 133031 102764 30984 -65965 -10020 44793 26121 3733 -39588 45904
25911 45904 27709 66368 -24760 -55091 39276 175851 23832 -126607 -40531 2921 1661
25900 1661 -43877 -46504 4304 74919 32917 23345 1046 50547 112223 217697 195596 231239
25888 231239 118904 123519 97669 -5491 -71246 -46790 16146 -30158 -52070 -62931 -121388
25877a21388p7175r9823j3204M0540R1611j59931O9546j6644J16772M0441K9408
25866i9847J29138P4321k1391q6387m0353j0316M5637O7973q2541q8083J0522
25855a01327q5126l6025L5763R9984O3020j6842j01603k7237L348M6248K21074
25844A01277J68593n2690l1814q9894N2053o7254L7093j5150j5267o5229M5256
25833F6974J02020J1930q4224Q272j11122n3957K5362l4246l9547l9863L5537
25822a12864J22463J2972j04144L1726M7310j9523P6916J495n4279k149M4459
25811D4382K3090j97082k3979N1862j05663N9392O5121P1286J4450j39399r952
25800a46492K3908R2585J6042L9802J17608M483l8356K5942J2703r4289p247j27427
$$ plain form
25877 -121388 -198563 -298386 -311590 -271050 -179439 -339370 -269824 -286468 -169696 -129255 -99847
25866 -99847 29291 103612 82221 -4166 -44519 -54835 -9198 58775 -23766 -111849 -101327
25855 -101327 -186453 -222478 -186715 -86731 -23711 -40553 -142156 -169393 -166045 -119797 101277
25844 101277 269870 217180 185366 95472 147525 80271 117364 102214 86947 21718 66974
25833 66974 168994 180924 96700 104972 -6150 -60107 -34745 -68991 -108538 -148401 -112864
25822 -112864 9599 22571 -81573 -49847 -2537 -22060 54856 56351 2072 -77 44382
25811 44382 67472 -129610 -153589 -101727 -207390 -147998 -82877 -11591 2859 -136540 -146492
25800 -146492 -122584 -29999 -13957 25845 143453 147936 109580 135522 148225 53936 46689 -80738
25788h0738q165j5491p962M1650J28427L3610J0367J5057O1624l7978j21333p7183
25776e8115m3410q828J7473q2161q9468o3227L8323Q9073J47381J62051k9644
25765G9448L1063j7611j38573m7135k1850L7799J4829J3892R4700K4977L6625
25754A08164J24442q3414j11105J8188n368O3264k1012r9755q1997k0895Q2546
25743b6942k1204j4133P3430J09797P4677j03260j66698J1462J74494K0431M237
25732A36291k5166m0961k218K8732q9234J3876N1294m3023m3356o6545j38119
25721b18429k5734N9257K3152M5066J4461N1807K4111j9522q892k2745K2638j12193
25709a67023M9182Q9225P9351R7505q245j89127j73273O5720J41073Q7715o1377
$$ plain form
25788 -80738 -88903 -104394 -112356 -70706 57721 91331 101698 116755 178379 140401 19068 -58115
25776 -58115 -101525 -110353 -92880 -175041 -264509 -327736 -289413 -200340 -52959 109092 79448
25765 79448 110511 92900 -45673 -92808 -114658 -76859 -62030 -48138 46562 71539 108164
25754 108164 232606 149192 38087 56275 50907 114171 93159 -6596 -88593 -109488 -26942
25743 -26942 -48146 -62279 11151 120948 195625 92365 -74333 -62871 111623 132054 136291
25732 136291 111125 70164 67946 96678 7444 21320 72614 29591 -13765 -80310 -218429
25721 -218429 -244163 -184906 -161754 -116688 -102227 -50420 -26309 -45831 -54723 -77468 -54830 -167023
25709 -167023 -117841 -28616 50735 148240 139995 -49132 -222405 -156685 -15612 72103 10726
25698A0726r3577p3009K4414p877P6721n0590M0532l1856o1922J19064J90110
25687A42736N9808o0923J872P8140m4015p2702j05207J1342R3627Q833j04734
25676H777l3350O3954K0341k9651P7448O3477r7746n2420j57737J5289J3426m0993
25664a49185j6994m5863R2617j8343J3809J07382J6812O2977L1010J47144o6760
25653A74606J0604j88245j95725M4432P0335L4982J41815q5582o7185m526J06235
25642D1746R9670j3427n5093m3886l0584m8915q9034n9301m684R0182R3003L2773
25630A2450L8544j7239L7491O9699q3838p8110L3503K247N8562P8524l3456o6655
25618E1722M3577m3243l6557k8041J7517n698j29334n6834J08107m9118l5783
$$ plain form
25698 10726 -82851 -155860 -131446 -139323 -62602 -113192 -72660 -104516 -166438 -47374 142736
25687 142736 202544 141621 143493 221633 177618 104916 -291 11051 104678 113511 8777
25676 8777 -24573 39381 59722 30071 107519 170996 73250 20830 -136907 -121618 -108192 -149185
25664 -149185 -166179 -212042 -119425 -137768 -123959 -16577 235 63212 94222 241366 174606
25653 174606 185210 -3035 -198760 -154328 -83993 -49011 92804 7222 -59963 -64489 41746
25642 41746 141416 127989 72896 29010 -1574 -50489 -139523 -198824 -203508 -113326 -20323 12450
25630 12450 50994 33755 71246 140945 57107 -21003 12500 14747 73309 151833 118377 51722
25618 51722 95299 52056 15499 -12542 4975 -723 -130057 -186891 -78784 -127902 -163685
25607a63685J30554J55058q9755J7318J8n5604l0579M5263K958l6966K7188N0921
25595E2689o383j9115k03247J5505K2914L289Q9269P1730L6307j7625J7820l6355
25583B6798L3471O1133N7065k7256o5062J763R329j05419Q7274J3980J0943n1661
25571E2358R752j87682j6416L2636l6269K5168J37890k6077j02004j2115J0927
25560a11832r484M1128L9976Q439P992j21816j4879P745L8788K489j2895O827
25548a17522P4373m8784k9620m5614R3718M7308J9357m21j06751L0978J04614
25537B1636j4747R818n3580o0683J1553n7913m1598J2729J162L9905j31329K3139
25525b39908M4593O0747k3120R7130J65851m3293p7317j335J5929N0800J9931
$$ plain form
25607 -163685 -33131 121927 32172 49490 49508 -6096 -36675 8588 11546 -25420 1768 52689
25595 52689 46306 27191 -176056 -160551 -137637 -134348 -45079 26651 62958 45333 63153 26798
25583 26798 60269 121402 178467 151211 86149 87912 97241 -8178 79096 93076 104019 52358
25571 52358 62110 -125572 -141988 -109352 -145621 -120453 17437 -8640 -110644 -122759 -111832
25560 -111832 -121316 -80188 -40212 -31773 -23781 -145597 -160476 -152731 -113943 -111454 -124349 -117522
25548 -117522 -43149 -91933 -121553 -167167 -73449 -26141 -6784 -7205 -113956 -82978 21636
25537 21636 6889 16707 -36873 -97556 -86003 -143916 -185514 -172785 -171623 -131718 -263047 -239908
25525 -239908 -195315 -134568 -157688 -60558 105293 62000 -15317 -16652 -723 50077 70008
25514G0008j82380j21639N4160Q1386J63765m1870j01793K1008N3465L7613l8295
25503d572P1872p8485L239J56116o6033p7863m2337L125J2167k6676L618j4089
25491e9918J1510p9326q0077k3150m0520K8153J45903l4544j0498n1911L8356
25480a56022Q6360R3171M1822J3527P0660j05733j02525N8397Q8853L3329J2120
25469A33959j2472Q771j59359q8198J4045M7279k7343j2350j6119n341O6773J66180
25457A15825M5473j54430k4854J8029M8437J57391l8101l7113p6316p6512l2862
25446e5033M3806j05410j00242L2118J05436p6507J6237M3093Q2828o4343j08830
25435a86847l8205N0838L8440o363K9449J00914J839k8396K7885r5257o16M7449
$$ plain form
25514 70008 -112372 -234011 -179851 -98465 65300 23430 -78363 -57355 -3890 33723 -4572
25503 -4572 67300 -11185 -7946 148170 82137 4274 -38063 -34938 -22771 -49447 -45829 -59918
25491 -59918 -48408 -127734 -207811 -230961 -271481 -243328 -97425 -131969 -142467 -194378 -156022
25480 -156022 -69662 23509 65331 78858 149518 43785 -58740 -343 88510 121839 133959
25469 133959 121487 130258 -29101 -117299 -103254 -55975 -83318 -95668 -111787 -117128 -50355 115825
25457 115825 161298 6868 -17986 43 48480 205871 167770 130657 54341 -22171 -55033
25446 -55033 -11227 -116637 -216879 -184761 -79325 -155832 -139595 -96502 -13674 -78017 -186847
25435 -186847 -225052 -174214 -135774 -142137 -112688 -11774 -9935 -38331 -10446 -105703 -106319 -58870
25423e8870p0068o033m4345M1800Q4810O6722m441N2138j4484L6239k8392j42559
25411h7483j3754L0850j2321R0056n6688K2645J18436O3988j2030l0914j02047
25400A0738M960O6747M3962j05129k4963M1445J59851j7386j20751j1245J7294
25389F5523j8680J13743N562p0658p9750j4742r1020J10794j0035k967J23262
25378A31032n9635m148m5747o7305o6542k350k1902O2818j6681N1042R8629r1682
25366c2471n6308o1879J11792j8847j17478m574R3993M0074M3278M110k0011j9401
25354c7722o936j21045o5557J66018M3891k5033o6977K9160J3994j3342P3469
25343a0080J31580J10243o9301l5024k0765j8033j07385K8677m9128M1509J29724
$$ plain form
25423 -58870 -128938 -134971 -179316 -137516 -52706 14016 9575 61713 47229 83468 55076 -87483
25411 -87483 -101237 -70387 -82708 7348 -49340 -26695 91741 155729 143699 112785 10738
25400 10738 15698 82445 126407 21278 -3685 37760 197611 180225 59474 48229 65523
25389 65523 46843 160586 166148 95490 15740 998 -90022 20772 10737 7770 131032
25378 131032 71397 67249 21502 -45803 -112345 -114695 -136597 -73779 -90460 -39418 59211 -32471
25366 -32471 -88779 -150658 -38866 -57713 -175191 -179765 -85772 -45698 -2420 1690 -18321 -37722
25354 -37722 -44658 -165703 -231260 -65242 -21351 -46384 -113361 -84201 -70207 -83549 -10080
25343 -10080 121500 231743 162442 127418 106653 88620 -18765 9912 -39216 2293 132017
25332A32017j6040l8994L3416J3502j12536n503J11769P8913P0134m9642j40715
25321G6321M570L5766l4013j20110M2889j4314M860L0842j9001p996L320n6856
25309e3722n9103J2234L0200j9188n6055O0609Q3884J935J417J7320l784o022
25297I725R5800j11945j04359P90n164n9425P7850j9269j8034j7481R6006P3774
25285A8268n2715j0774q5326l5745O1548J12480P6638n3975o4056L258K0674j04182
25273a13907O363N0166K0809r2703L2566P412L8021N9766k580j6393p8084J00661
25261A2097R6245o112o1048n4887j5882J2365P0039K9529j0588j19833M0739M6008
25249C8672p5848j89827L6675j1641j29877r6368n8353P6850o2789J35038J62888
$$ plain form
25332 132017 115977 76983 110399 123901 11365 5862 117631 196544 266678 217036 76321
25321 76321 80891 116657 82644 -37466 5423 -8891 -4031 26811 7810 -186 3134 -53722
25309 -53722 -112825 -100591 -70391 -89579 -145634 -85025 -1141 794 2211 19531 15747 9725
25297 9725 105525 -6420 -110779 -109989 -115153 -174578 -96728 -115997 -134031 -151512 -55506 18268
25285 18268 -34447 -45221 -130547 -166292 -104744 7736 84374 30399 -33657 -30399 -9725 -113907
25273 -113907 -107544 -57378 -36569 -129272 -96706 -89294 -51273 8493 5913 -10480 -88564 12097
25261 12097 108342 102230 41182 -13705 -29587 -17222 52817 82346 71758 -48075 -7336 38672
25249 38672 -37176 -227003 -190328 -201969 -331846 -428214 -486567 -409717 -472506 -337468 -174580
25238a74580J63999J88538o2608k569J2435n8044N9472O3646n8420k280Q9903
25227B19492M8688p6430n5420o0802m8154j48976k3770J20712M5064l8182q4858
25216a02636q3203k5789L9643N4321J04102P170k9227p4157r9869l6649O4720
25205a81574K18169J3212L036l9418k748M7251L758k964O710l0362l4646j3680
25193a3256p035r5578p062J65396J26379j1927j86614j05250J29221K6281J59193
25182A79748j707j18952r3645N6J35007J46988j18292j09379L5032k8464n302
25171B1090l5799l4150m4933Q5231O8266N781N984K5551p1878r157k5511m1285
25159e0810j19612M5391J4658r7570q1440O1278J93709j6763j18239m0054k1370
$$ plain form
25238 -174580 -10581 177957 115349 112780 125215 67171 126643 190289 131869 129589 219492
25227 219492 268180 191750 136330 75528 27374 -121602 -145372 -24660 20404 -17778 -102636
25216 -102636 -185839 -211628 -171985 -117664 -13562 -6392 -35619 -109776 -209645 -246294 -181574
25205 -181574 36595 49807 52843 13425 10677 57928 61686 58722 65432 35070 424 -13256
25193 -13256 -20291 -115869 -122931 42465 168844 156917 -29697 -134947 -5726 20555 179748
25182 179748 178041 59089 -34556 -34500 100507 247495 129203 19824 54856 26392 21090
25171 21090 -14709 -48859 -93792 -8561 59705 65486 71470 97021 25143 15986 -9525 -50810
25159 -50810 -170422 -125031 -110373 -207943 -289383 -228105 -34396 -51159 -169398 -209452 -230822
25148b30822p962J03555K00853J02231k0485m4506Q750m9325O369o3907n7616
25137e2865M3561j0775J32891O4716l3547j15139n7220l831L222k6517L2694P4318
25125E1508R7140P0235n6750k00420r1044l7358r7047J51662Q8173p6672r9704
25114b00277j4713J34946R8685K0656J5287k7764m060p3067p8677j1019n7410
25103a97413M9228J42669N1213J8641j4362K183P606K6896K8156p4921p8602j6805
25091e5511J8634J0168M6607m9840J6960M2765j26047j85921P5622J56831J28289
25080G8557M8384o8933j48664n7702j4793n7740P6156J20217N5685j8163l2289
25069a9285j05534K7938O5505J12112J41668L2100j4242j74082j27014q599J7578
$$ plain form
25148 -230822 -238784 -135229 65624 167855 147370 102864 111614 62289 68658 4751 -52865
25137 -52865 -9304 -20079 112812 177528 143981 28842 -28378 -32209 -28987 -55504 -22810 51508
25125 51508 148648 218883 162133 -38287 -129331 -166689 -263736 -112074 -23901 -100573 -200277
25114 -200277 -214990 -80044 18641 39297 54584 26820 22760 -50307 -128984 -140003 -197413
25103 -197413 -148185 -5516 45697 64338 49976 52159 59765 86661 114817 39896 -38706 -55511
25091 -55511 -36877 -26709 19898 -29942 -12982 29783 -96264 -282185 -206563 -49732 78557
25080 78557 126941 58008 -90656 -148358 -163151 -220891 -144735 -24518 31167 13004 -19285
25069 -19285 -124819 -96881 -31376 80736 222404 254504 240262 66180 -60834 -69433 -51855
25058e1855o4345m083L0419L6981m3665L5222k6091m0869o2654p3188O4448J36194
25046f3486O5252O4770o8249j2936R057L6305j3752O9960r921j96882j1488R6868
25034c4502O6948p5561q0469n2138n9306J04307J23447M1152o1113j4262J3863
25023b7634n4217q8354J07940M7202Q923n6468q803K0269k3096L9424O0229J9732
25011D5147q5134q0396J18022J19216l6601m9693o2754J5318J01797N9441M2237
25000A86600l9786O6714J28065l9042l0581j5384j14596q1237p2486p0538m073
24989h6344J658N0183R4907m237J36163R5965m9478k1297m2529o4809j03286q1466
24977g4570L8549J6350m9974m8872O9750k5923J336m2968K0011M8320j3694J0303
$$ plain form
25058 -51855 -116200 -120283 -89864 -52883 -96548 -61326 -87417 -128286 -190940 -264128 -199680 -63486
25046 -63486 1766 66536 -1713 -14649 -5592 30713 16961 86921 77000 -119882 -131370 -34502
25034 -34502 32446 -43115 -123584 -175722 -235028 -130721 -7274 33878 -27235 -41497 -27634
25023 -27634 -81851 -170205 -62265 -15063 -6140 -62608 -71411 -51142 -74238 -34814 25415 45147
25011 45147 -39987 -120383 -2361 116855 80254 30561 -32193 -16875 84922 144363 186600
25000 186600 146814 213528 341593 302551 271970 256586 141990 60753 -11733 -82271 -86344
24989 -86344 -84686 -34503 60404 56167 192330 288295 238817 217520 174991 110182 6896 -74570
24977 -74570 -36021 -19671 -69645 -118517 -48767 -74690 -73354 -116322 -96311 -47991 -61685 -51382
24965e1382j7505m0594j0896Q9413m51p9054N3434r2734N7180L4199L5898R8921
24953G6429m2004o6541r9344j7669Q138O1288N8077j10759J1514J29150q62p5701
24941f8284k8381K6977K1373O3586R6072n8061l2327l3606K0367q2303l9879J8792
24929i5674P9056m4740m4303J11982P3856K6274m8617j0350L9636n8863j01502
24918g3245j1662J21040N4829P5460O9572o0785l9321j13777Q1392r535N0640
24907A44608p6555j27316K0761J2548M5438j16660k670m0049P2790K226n1817
24896a16696M2689j01829k6900R7185Q217K2198m3647m6758L0151L2006m4632
24885a48016k8082K18406J07348l7228M9618r5984k119j34092l4414M8342Q0175
$$ plain form
24965 -51382 -68887 -109481 -120377 -30964 -31415 -110469 -57035 -149769 -92589 -58390 -22492 76429
24953 76429 34425 -32116 -131460 -149129 -140991 -79703 -21626 -132385 -120871 8279 7417 -68284
24941 -68284 -96665 -69688 -48315 15271 111343 53282 20955 -12651 7716 -74587 -114466 -95674
24929 -95674 -16618 -61358 -105661 6321 80177 106451 57834 47484 87120 28257 -73245
24918 -73245 -84907 36133 90962 166422 235994 175209 135888 22111 103503 93968 144608
24907 144608 68053 -59263 -38502 -25954 19484 -97176 -99846 -139895 -67105 -64879 -116696
24896 -116696 -74007 -175836 -202736 -105551 -97334 -75136 -118783 -165541 -135390 -103384 -148016
24885 -148016 -176098 42308 149656 112428 162046 66062 63943 -70149 -104563 -56221 23954
24874B3954J8443j7241l7583J45724J07417p5255L7598M3122M2226j08412j19407
24863F0586J07658P4991j24317j54178j38309J5047K8933J8773P3182J19058N1534
24852A32958n7599j27203j30169k7706N9875J48478L5919j0768j1505j06986L223
24841i1483J39146m2818k7610o8506M195n2953P2374M9583o7967k659M4304j7100
24829f1494O5582j55696J5377J4786R4666J03088R998m5710j72992n4256M0573
24818a46078L9945Q2353L0884k4226P951m1388J6433N0860K0708m17o9942j36714
24806a69631O8156R9593J41143O9150j7206j34133j53353q5282l504J51824m0538
24795g3781r0998L7647M3740P7833J8665N475k4247N6974P9065Q475r3146j14931
$$ plain form
24874 23954 42397 25156 -12427 133297 240714 165459 203057 246179 288405 179993 60586
24863 60586 168244 243235 118918 -35260 -173569 -158522 -129589 -110816 -37634 81424 132958
24852 132958 75359 -51844 -182013 -209719 -149844 -1366 34553 23785 12280 -94706 -91483
24841 -91483 47663 4845 -22765 -91271 -87076 -140029 -67655 -18072 -86039 -88698 -44394 -61494
24829 -61494 4088 -151608 -136231 -121445 -26779 76309 86307 40597 -132395 -186651 -146078
24818 -146078 -106133 -23780 7104 -17122 -9171 -50559 -34126 16734 37442 37025 -32917 -169631
24806 -169631 -101475 -1882 139261 208411 191205 57072 -96281 -181563 -185067 -33243 -73781
24795 -73781 -164779 -127132 -83392 -5559 13106 18581 -5666 51308 130373 138848 45702 -69229
24783f9229L1661P4051m5637q3727n3036P5017Q6636M0987L947j29092O4782K399
24771a241r2662R1440N1741j23251K1062J46160m2075l8258l7091j8006k4893
24760f7074K9766k6122J6549l2108L7129R9462n364n3621O0208M9309M473p9118
24748C3489n155p2790j14734L326J06555J282O9117L244L1540p0451P0924O4842
24736A21189l2692j40505k082k5221k7247o2044J6973j3222M3451J6027N7247
24725d8126Q7080k6590N509K1474Q7489o0592j09610J5447N4909r9422L8349n5478
24713h9561M3443q512n4805r9675O9485Q9904N3392J08314j8153P6704k6020o9150
24701G5366m1323m4893M3190q7026L5168J869Q6371L0660j15504k3093O7521M077
$$ plain form
24783 -69229 -37568 36483 -9154 -92881 -145917 -70900 15736 56723 60670 -68422 -3640 -1241
24771 -1241 -93903 -2463 49278 -73973 -52911 93249 51174 12916 -24175 -42181 -67074
24760 -67074 -37308 -63430 -46881 -78989 -41860 57602 52238 -1383 58825 108134 112607 33489
24748 33489 28334 -44456 -159190 -155864 -49309 -48027 21090 24334 55874 -14577 56347 121189
24736 121189 88497 -52008 -54090 -79311 -106558 -168602 -151629 -164851 -121400 -105373 -48126
24725 -48126 38954 12364 17873 39347 126836 66244 -43366 -27919 26990 -72432 -34083 -89561
24713 -89561 -46118 -54630 -109435 -209110 -139625 -49721 3671 111985 93832 170536 144516 75366
24701 75366 34043 -10850 32340 -54686 -19518 -17649 68722 99382 -16122 -39215 28306 32383
24689C2383R238j28999J4642P5761M6013M0933j12173j58375J38439Q5196n8817
24678a5759N9666l5350j70967J22944J30281l987R283L5816M4509r9399j16734
24667c9697j08211m7585j3892K2080R4058O6148o0124Q2502K5984M8277l4860
24656C4680j03666Q500O9515q6824m5817J15889J6359N5690O9798l4096p2649
24645B7379o0306k3429l3791m2429R8908O9635L9305K492L3554m2620R909K4512
24633A03119p2145O3049J62978n7860j80220j45347r9072M6042K085Q655R5855
24622g2861L7595J4008O2078l680P0218K7061j48797o5244R9068M0014K1582l0003
24610E1039L79l254l0767L361Q4434k2081j19223O660M6677L3544l4710j11728
$$ plain form
24689 32383 41621 -87378 -72736 3025 49038 89971 -22202 -180577 -42138 43058 -15759
24678 -15759 43907 8557 -162410 -39466 90815 86828 96111 131927 176436 77037 -39697
24667 -39697 -147908 -195493 -209385 -187305 -93247 -27099 -87223 -4721 21263 69540 34680
24656 34680 -68986 -60486 9029 -77795 -123612 -7723 8636 64326 134124 100028 27379
24645 27379 -32927 -56356 -90147 -132576 -33668 35967 75272 77764 111318 68698 78607 103119
24633 103119 30974 94023 257001 199141 18921 -126426 -225498 -179456 -177371 -168716 -72861
24622 -72861 -35266 -21258 40820 37140 107358 134419 -14378 -79622 19446 59460 81042 51039
24610 51039 51418 48164 17397 20758 105192 83111 -36112 -29452 17225 50769 16059 -95669
24598i5669o2684J347K13660J12140p3640r1230j5860L7373n0556j25074q4185
24587b34378J20985K4644m0040K3793k602j3863m253P8735j5684j2461k9043L8283
24575f5884L8180J69834K8859j6881m7466j01071j53407P3546N3838M4495M7318
24564G1361l4405N1686M339p5066n6046p0962N8888R1487J82769L0986j06412
24553A48625j74025o2645R6821M473j9703m0369j5618k2398L9887J24827j2337
24542F7538j38414N0660J7626n9775J03752l4095J8339O0916P6644r0166n8900
24531A4125n43P3409K7215l0808j03196M4004k2958j1842J05962N8093J1881q3313
24519H2029k6852J0139m5644k9605M566k0789m1905q6922n1042J41616Q776l7025
$$ plain form
24598 -95669 -158353 -157006 56654 168794 95154 3924 -11936 25437 -25119 -150193 -234378
24587 -234378 -113393 -88749 -128789 -104996 -107598 -121461 -125714 -46979 -62663 -75124 -104167 -65884
24575 -65884 -27704 142130 170989 154108 106642 5571 -147836 -74290 -20452 24043 71361
24564 71361 36956 88642 92981 17915 -38131 -109093 -50205 41282 224051 255037 148625
24553 148625 -25400 -88045 8776 13249 -6454 -46823 -62441 -84839 -44952 79875 67538
24542 67538 -70876 -20216 -2590 -62365 41387 7292 25631 86547 163191 73025 14125
24531 14125 13582 86991 114206 83398 -19798 24206 1248 -10594 95368 153461 165342 82029
24519 82029 55177 65316 19672 -9933 -5367 -26156 -68061 -154983 -206025 -64409 -55633 -92658
24507i2658o2765p1910J6102K4604k6859O6952P6603n2708k68M1690J5058o5780
24495a31939q8476o7157J33645L0444J0323J064P9776j1425m3094j5126K3606
24484g8359L3065J202N4395L0887Q3608N2509j13524p1910o2927L9894L9820j9922
24472a1262p4387q8464L3710M3630J9546l5759L6510l2110r700K5931J21714j2220
24460A7139j3484N6557M821N4454l4717N6616l7960l4701p35J85457m766j04484
24448A44197p35j61056l1731N4834Q2584O5584q1601j44795n3054M5146J24273
24437D3646P7120J18781r0762n6138N642J0023j2944R1537J54979l7489p4434
24426B29961k9901o4819K3763J258j76388q3470m3490p8665J01385K03884l8929
$$ plain form
24507 -92658 -155423 -227333 -211231 -186627 -213486 -146534 -69931 -122639 -122907 -81217 -66159 -131939
24495 -131939 -220415 -287572 -153927 -123483 -113160 -112096 -32320 -43745 -86839 -101965 -78359
24484 -78359 -45294 -44092 10303 41190 124798 177307 63783 -8127 -71054 -31160 8660 -11262
24472 -11262 -85649 -174113 -140403 -96773 -77227 -112986 -76476 -108586 -118286 -92355 29359 17139
24460 17139 3655 60212 65033 119487 84770 141386 103426 68725 67990 253447 248681 144197
24448 144197 143462 -17594 -49325 5509 88093 153677 72076 -72719 -125773 -80627 43646
24437 43646 120766 239547 148785 92647 98289 108312 95368 186905 341884 304395 229961
24426 229961 200060 135241 159004 160262 -16126 -99596 -143086 -221751 -120366 83518 44589
24415D4589j21769K7122O6573K5057L3731p3668m2538k5700M879l5289L9873J67262
24403A10122J45530p6449j48503p1523Q6184r9237m0078O1219J74636J0360L5233
24392A87494m7711k5834m4790m7836O5488j0871j08970j26866K8084L8739K8821
24381f4252L0297q4167R4011M7771M1258n567j415j6533q5877k5773O2801k8625
24369c6071J5538j563l7737K4868L1971n6827m9123J00696O594j29026p8044J3498
24357a95226R2642N6038M0738O7553k560j01418p8527O9303O1333K5213n0735
24346a5646r8677l0110N9124R5820j04M0930P5372J5472k6457j6397n1712p4815
24334b7200R3787L6179j05326o9N8470M72L5404J2298p2990l0410l5679l053J2839
$$ plain form
24415 44589 -77180 -50058 16515 41572 75303 1635 -40903 -66603 -61724 -97013 -57140 110122
24403 110122 255652 179203 30700 -40823 45361 -53876 -93954 -32735 141901 152261 187494
24392 187494 139783 113949 69159 21323 86811 75940 -33030 -159896 -131812 -93073 -64252
24381 -64252 -33955 -118122 -24111 23660 64918 59351 57936 41403 -44474 -70247 -7446 -36071
24369 -36071 -20533 -22096 -59833 -34965 -2994 -59821 -108944 -8248 -1654 -130680 -208724 -195226
24357 -195226 -102584 -46546 -5808 61745 59185 -42233 -120760 -51457 9876 35089 -15646
24346 -15646 -114323 -144433 -85309 10511 10407 51337 126709 142181 115724 99327 47615 -27200
24334 -27200 66587 102766 -2560 -2629 55841 56313 91717 104015 31025 615 -35064 -38117 -25278
24321b5278L9316K5856J5649p6813M1173J9516n7243p2235O9117J00786J7040
24310I6884m2415j23519j2115J24828J819p5252j4684Q315k2911J5315M7639m9561
24298d5657L6240L1640J53294Q5217L66j06031n3779K7079k5773j4816p4208n9192
24286d5620K850L771O0893p126J9266N5351Q0966K5335m0668q37K4604l3889j7773
24273A27123j35611k4769K9874R795O3508J9244j3548M9482K3399l694r155j6479
24261A19169q492N835n4020j04312p3064J8042Qk2167k7342J8509O5519R4597
24249C2282P424q1709M3886o1644l0313J18712m6273K447Q1801n1677J38678M284
24237A57898r1005k7695N5951k2838j1872j03950j3128k7616M7140J9979K5277
$$ plain form
24321 -25278 14038 39894 55543 -21270 19903 39419 -17824 -90059 -20942 79844 96884
24310 96884 54469 -69050 -81165 43663 45482 -29770 -44454 -36139 -59050 -43735 3904 -45657
24298 -45657 -9417 22223 175517 260734 261100 155069 101290 128369 102596 87780 13572 -45620
24286 -45620 -42770 -38999 21894 14768 34034 89385 170351 195686 155018 154181 178785 144896 127123
24273 127123 -8488 -33257 -3383 6412 69920 89164 75616 125098 148497 144803 135648 119169
24261 119169 110677 116512 62492 -41820 -114884 -96842 -96834 -119001 -146343 -127834 -62315 32282
24249 32282 39706 -42003 1883 -59761 -90074 28638 -17635 -15188 66613 14936 153614 157898
24237 157898 66893 39198 95149 72311 60439 -43511 -56639 -84255 -37115 -17136 8141
24226H141O2461J2590M1484J02280n4803k53783o0116k2419r5845p2068J29627
24215b02451P7314J4137J02912m519m0096j3310N3321l476j03315L0949O4863
24204b3671r7899n3187J76188M939k4619M290m8239j0769m199O7103J4593K3902
24192B8432l4812p3761Q1911K8550j08628j3018R6679K752j224j05476J9125J9833
24180e9637J22288k388l0872m5253j2670M9805N5168p4534j6625Q1329p0610k6444
24168c0443R6674q712K1476R097l0026K3041K7875L0558m3771q5916O7444O1912
24156A39209j9696r232k3497J2810k4655r9629P9862P2522m9345l1896K1612R9980
24144A68045N6040K066p7368k2037j10651l3352N1345J9463M693j6258n9756l1873
$$ plain form
24226 8141 70602 83192 124676 226956 172153 -81630 -141746 -164165 -260010 -332078 -202451
24215 -202451 -125137 -111000 -8088 -12607 -52703 -66013 -12692 -16168 -119483 -88534 -23671
24204 -23671 -121570 -174757 1431 6370 -18249 -13959 -62198 -72967 -77166 -10063 4530 28432
24192 28432 -6380 -80141 1770 30320 -78308 -91326 5353 8105 6881 -98595 -79470 -59637
24180 -59637 62651 60263 29391 -15862 -28532 21273 76441 1907 -14718 66611 -3999 -30443
24168 -30443 66231 57519 78995 88092 58066 81107 108982 139540 95769 9853 77297 139209
24156 139209 119513 110281 86784 99594 74939 -24690 55172 127694 78349 46453 68065 168045
24144 168045 224085 226151 148783 126746 16095 -17257 34088 53551 58244 41986 -17770 -49643
24132d9643N8584k2148o0388m4946J10970J06436n8958q8928j3276J22716J39201
24121A99620j9136O9281q2293j03432n9803N512k7912m9994N6582Q5991K3972
24110I8388Q6069p3449Q5263J4744q6819l8413o800N8289K1649p4913k3246j9707
24098D1055j66047j5105P4672m4701k3547Q6622L2014J2638o8780K7370P2309
24087B8500P9657o2269o9235Q0179L5700K298j7340J7479j3473Q8953l5300j60132
24075b4983j5193r6642K432l1391Q218L9945P6725N517j30515O3835L2174J2052
24063e7826L2180L0266o3086r9429j2719L8552J19825O4346m8669R3641Q8473
24052A85554m2911O0469l6989J9249k0425j83017J3272m4388m4021L142l0042
$$ plain form
24132 -49643 8941 -13207 -73595 -118541 -7571 98865 39907 -49021 -62297 60419 199620
24121 199620 180484 249765 167472 64040 4237 9749 -18163 -68157 -11575 74416 98388
24110 98388 184457 111008 196271 211015 124196 85783 78983 137272 158921 84008 60762 41055
24098 41055 -124992 -140097 -65425 -110126 -133673 -47051 -15037 -2399 -71179 -43809 28500
24087 28500 108157 45888 -23347 56832 92532 94830 77490 94969 81496 170449 135149 -24983
24075 -24983 -40176 -136818 -134386 -165777 -157559 -117614 -40889 -35372 -165887 -102052 -69878 -57826
24063 -57826 -25646 4620 -58466 -157895 -170614 -132062 -12237 52109 3440 97081 185554
24052 185554 142643 203112 166123 185372 164947 -18070 -4798 -49186 -93207 -90065 -120107
24041a20107j1092o2505o9786P3904K0354M0829j18473J3039J59074L7369N1950
24030A4556R559p415j8280l203O2855j8722j9906l6301L7748N6420K3499P5277
24018A76087M1875M2229r237m0306j20578L0383J1399r3586j4004o1871L9837
24007B228o8336P7521O3808k7058L1712q5007o1221Q365K7377n4606R0434k1994
23995a6777j0600J8140l2433M6787J409j60864j78301k6438J28856N2452J19792
23984e7977J02618L4070p3337j11972P5016R5371N2653k9380J2913R8914p6687
23973A22202q46m897p6239k1341j53405K5081Q9522k5776k9496J81651J9504j75581
23961d9621j10162K1328N8076L3017j1427P0214O9490j2271o5638q0612r7549
$$ plain form
24041 -120107 -131199 -193704 -263490 -189586 -169232 -128403 -246876 -233837 -74763 -37394 14556
24030 14556 24115 16700 -1580 -4783 58072 39350 19444 -16857 20891 77311 100810 176087
24018 176087 217962 260191 250954 210648 90070 120453 131852 38266 24262 -37609 2228
24007 2228 -66108 11413 75221 48163 79875 -5132 -66353 -57988 -30611 -85217 5217 -16777
23995 -16777 -27377 -9237 -41670 5117 6526 -154338 -332639 -359077 -230221 -177769 -57977
23984 -57977 44641 78711 5374 -106598 -31582 63789 116442 87062 99975 198889 122202
23973 122202 121356 116459 40220 18879 -134526 -109445 -19923 -45699 -75195 106456 125960 -49621
23961 -49621 -159783 -138455 -80379 -47362 -58789 11425 80915 68644 3006 -77606 -175155
23950a75155N1215J632J4250R2182l9982K1535J90972n5367o2732J1576j23978
23939g3852n014n2108n270K0690J00498J09574l113j85739p0633J46340O4475
23928D5848o7290j25158O3986Q8469J8543m3832r427q9445n9518P0086k4030j7805
23916a49573M9290J9824M9119P9884J99611J15176l7778n9406j22013n2406P5519
23905A67247O273J25474n215r9106j01377j38053j5475p7940j06J12405K5681
23894a92K3516m7709M1253O624n2774p2830Q401M1670m9381l4551k026J38210
23882B11O5948k4948q3112o333l6662k5855K3801K9190j6044N0497P0967M7354
23870I5014p6687M0613n4198K0179k9334r6447m2392N2986J00618l3680n9824
$$ plain form
23950 -175155 -123940 -122308 -108058 -15876 -55858 -34323 156649 101282 38550 50126 -73852
23939 -73852 -78866 -130974 -136244 -115554 -15056 94518 91405 -94334 -164967 -18627 45848
23928 45848 -21442 -146600 -82614 5855 24398 -19434 -28861 -118306 -177824 -107738 -131768 -149573
23916 -149573 -100283 -80459 -31340 48544 248155 363331 325553 266147 144134 91728 167247
23905 167247 173520 298994 293779 194673 93296 -44757 -60232 -138172 -138278 -25873 -192
23894 -192 23324 -24385 16868 23492 -29282 -102112 -93711 -52041 -101422 -135973 -137999 211
23882 211 66159 41211 -41901 -48234 -84896 -110751 -86950 -57760 -73804 -23307 47660 95014
23870 95014 18327 58940 4742 24921 -4413 -100860 -143252 -90266 10352 -23328 -83152
23859h3152k9929J54404J21923j2183j53785q6552J24018R5201j17537j21998
23849a09590j12807p6103j2346J28989R9873l3646K9386J32359J2802l391j60338
23838a04812k2134J28725O8558j72289j37078P3677k8839K4794O9068P0690n7773
23827h7413M4433J1356Q5174j11785L0700M8278k5980R2208n1047p6573k943O3061
23815A9469N9193p4748l6769L2493j5540P9680n6109j02558L9485M2386p9040
23804i2058P9575q0R9863j8481j31682l4381P9091J53183l515q3249L261O9187
23792A20714k2216j3714Q2589j22851o0798N9970M7193q6778j37189K1931K493
23781a08656K1928R954j19225M6602N6311P8579J09806J22419j19572j01677o9928
$$ plain form
23859 -83152 -113081 41323 163246 151063 -2722 -89274 34744 129945 12408 -109590
23849 -109590 -222397 -298500 -310846 -181857 -81984 -115630 -86244 46115 58917 55526 -104812
23838 -104812 -126946 1779 70337 -101952 -239030 -165353 -194192 -169398 -100330 -29640 -87413
23827 -87413 -42980 -31624 53550 -58235 -27535 20743 -5237 86971 35924 -40649 -43592 19469
23815 19469 78662 3914 -32855 -362 -15902 63778 7669 -94889 -55404 -13018 -92058
23804 -92058 -12483 -12563 87300 68819 -62863 -97244 -18153 135030 131515 48266 51527 120714
23792 120714 98498 84784 167373 44522 -16276 43694 90887 4109 -133080 -111149 -108656
23781 -108656 -86728 -76774 -195999 -149397 -93086 -14507 95299 217718 98146 -3531 -73459
23770g3459L0654n847j10494n4237l6160J58518K01309n2604j28916p2344J35219
23759h361l6514q29J80341R0900n2036L08o2286J7036k8503j5278r6523l1156
23747d2901O0254J6138j1748j32864o1020P4321R7691k4183n3535o4695N2193
23736i0349O9342K6499K9488k3390l8895q2593m6545N3597P852O7809j8628j27012
23724a72825J38376J64133j9120j18684L0573l5145j6016j413l7910K4826R849
23713c3356N9016L4574K2652L5034j6141p9634q0046J8882P672N6860P898k2132
23701A1279j31589j9591J49143J72501L2022m1766j81841j18316L1843P724N7598
23690c0993O1526K4991q9821L6498p4857j4702J6245L1320l5130j9125o9816l4541
$$ plain form
23770 -73459 -42805 -48652 -159146 -213383 -249543 -91025 110284 57680 -71236 -143580 -8361
23759 -8361 -44875 -45704 134637 225537 173501 173809 111523 128559 100056 84778 -11745 -42901
23747 -42901 17353 33491 21743 -111121 -172141 -97820 -129 -24312 -77847 -142542 -90349
23736 -90349 -21007 5492 34980 11590 -27305 -109898 -156443 -102846 -94994 -27185 -45813 -172825
23724 -172825 -34449 129684 110564 -8120 22453 -12692 -28708 -30121 -68031 -43205 -33356
23713 -33356 25660 60234 82886 117920 101779 22145 -57901 -39019 -31347 25513 33411 11279
23701 11279 -120310 -139901 9242 181743 213765 171999 -9842 -128158 -96315 -88591 -30993
23690 -30993 30533 55524 -34297 2201 -72656 -87358 -71113 -39793 -74923 -94048 -163864 -198405
23678a98405N7489P1526N1523m6730m7563l4082j1072J18531j8316q3077R3661
23667d6515O9655Q6855L5033J4340K9287k3202M2174j29011r3657l4292j320J31191
23655H0538J22394l4224j28555j59215n5280p6470L96Q7429J13605L3065j1697
23644b8014J05380L2090J0474J6068l1969K3592q269p5812o9543m7540K9163O0803
23632A6423m515n2909Q7907m1581p5854N1805m517k8402Q5697o8425P190J12971
23620H5790K0399J17994j11563j93244j10277O7544P0015M6531o0237R864J34451
23609G7267J11455p2660K3403L1256p4023j08742p1904J10249k4003j43454M2468
23598i8688R6408O0075k5495n8773M5614O7256p1122n0285k65n8519q3082J7119
$$ plain form
23678 -198405 -140916 -69390 -17867 -64597 -112160 -146242 -157314 -38783 -57099 -140176 -46515
23667 -46515 23140 109995 145028 159368 188655 165453 207627 78616 -15041 -49333 -50653 80538
23655 80538 202932 168708 40153 -119062 -174342 -250812 -250416 -162987 -49382 -16317 -28014
23644 -28014 77366 109456 119930 135998 104029 127621 119352 43540 -26003 -73543 -44380 16423
23632 16423 11908 -41001 46906 5325 -70529 -18724 -23241 -51643 34054 -34371 -27181 85790
23620 85790 106189 224183 112620 -80624 -190901 -123357 -53342 -6811 -67048 -57184 77267
23609 77267 188722 116062 139465 170721 96698 -12044 -83948 26301 2298 -141156 -98688
23598 -98688 -2280 57795 32300 -26473 19141 86397 15275 -35010 -35275 -93794 -176876 -159757
23586a59757Q587R008R3563L3816j07479J57654K34686r7730k65112j04023Q6404
23575a10383P9313o4553k659P6882j0570m4653O3364L1181K8077M5020m7334m7740
23563d055q552o3666N089k6086Q0370J13984J907q2179j24553O1486M9299L5875
23551C8919L4950r118J8270Q8367M8857n0963L4157r0325j18639j12026P1898
23540d5653L8548k33J5193M6643j9158r9574r0939J14232L4110p2469O1093M4303
23528B6096L1195J1020P1419m1478j08217k9317m284L4819L4268k5788P1395L4912
23516A06040p6958q4073Q634L3381o6731l1008J52612r878M7904R0063M9082K5935
23504B45003j5620k8330l2135j55953j2828K6243L8098O553o702j5842j0847p2399
$$ plain form
23586 -159757 -151170 -142162 -48599 -14783 -122262 35392 270078 172348 -92764 -196787 -110383
23575 -110383 -31070 -95623 -98282 -21400 -31970 -76623 -13259 17922 45999 91019 43685 -4055
23563 -4055 -12607 -76273 -71184 -97270 -16900 97084 98991 16812 -107741 -46255 3044 38919
23551 38919 73869 64751 83021 171388 220245 169282 203439 113114 -5525 -117551 -45653
23540 -45653 -7105 -7338 7855 54498 35340 -64234 -155173 -40941 -6831 -79300 -18207 26096
23528 26096 57291 68311 139730 98252 -9965 -39282 -43566 -8747 25521 -267 71128 106040
23516 106040 29082 -54991 -46357 -12976 -79707 -110715 41897 32019 79923 169986 219068 245003
23504 245003 229383 201053 168918 12965 137 26380 64478 71031 64329 48487 37640 -34759
23492c4759o9910n3320P6949P9779Q0345n7993n2660l189O6910L9820O6555M1511
23480A80038p5298j29525p2479n1092R0029R8585L6692O8917Q2163k5421r5315
23469A07294r0626j04662p0032m1563Q682n6248l563R1775R3013M9098l6823M9654
23457d001l2368j27817P2375K616q7676J7729Q6189J31611L779p988j6709j3249
23445B4491J03361r481p9391m0920K4672M4245j57885l883N1233J0576O3217J8409
23433D8644j4963N2653K4901j11174O8613J06309J4649k7669p9205p8150j5387
23422a0779k9481M7628M2483K5261k2128j48433N0665q046q6786j972L7712j5226
23410a19102L5758K0721L2178O6730K5173k1607r6229j4197Q445l5802L4265J04928
$$ plain form
23492 -34759 -104669 -157989 -81040 -1261 79084 21091 -31569 -34758 32152 71972 138527 180038
23480 180038 104740 -24785 -97264 -148356 -58327 40258 76950 145867 228030 202609 107294
23469 107294 16668 -87994 -158026 -199589 -190907 -247155 -250718 -158943 -65930 -16832 -53655 -4001
23457 -4001 -36369 -164186 -91811 -89195 -176871 -159142 -72953 58658 62437 54449 37740 24491
23445 24491 127852 118371 38980 -1940 22732 66977 -90908 -94791 -43558 -32982 30235 48644
23433 48644 33681 86334 111235 61 68674 174983 189632 161963 82758 4608 -10779
23422 -10779 -40260 7368 49851 75112 52984 -95449 -44784 -52830 -139616 -141588 -103876 -119102
23410 -119102 -83344 -62623 -30445 36285 61458 39851 -56378 -70575 -62130 -97932 -63667 41261
23398D1261p1894m6571J01831O7365n6158l5247K281M1245J02147J0169j68388
23387a1959l2197J36440j8256j07654j02875j6070J23235l3641j61151N7014R2742
23376g4372O6753j6113j11212O5837Q6096k8539o9868L8962m0013L8715j29358
23365a73112j55884l7225q0821Q7731J62380R4617J02887M2280l3009j33243M2365
23354h1034R1134o301n5077L065O5552K4321m6452r9486J7858K2052P9256J4602
23342B9490R676n4570j45774M1084J17917O1654k2645l9169q3729m4385Q4909
23331d5542K1163L1292L9232o2410j45357o0548l8805R6789j7527m2024P0093
23320a53644m0974L2750N1050j7714k0835K3018p8001J837R3783J20492L4147
$$ plain form
23398 41261 -30633 -77204 24627 91992 35834 587 2868 44113 146260 156429 -11959
23387 -11959 -44156 92284 74028 -33626 -136501 -152571 -29336 -62977 -224128 -167114 -74372
23376 -74372 -7619 -23732 -134944 -69107 16989 -11550 -81418 -42456 -82469 -43754 -173112
23365 -173112 -328996 -366221 -447042 -359311 -196931 -102314 573 42853 9844 -123399 -81034
23354 -81034 10100 3799 -51278 -48213 17339 41660 -4792 -104278 -86420 -64368 14888 29490
23342 29490 39166 -15404 -161178 -120094 -2177 59477 36832 -2337 -86066 -130451 -45542
23331 -45542 -24379 6913 46145 -16265 -161622 -222170 -260975 -164186 -181713 -223737 -153644
23320 -153644 -194618 -161868 -110818 -128532 -149367 -126349 -204350 -202513 -108730 11762 45909
23309D5909M3397O886N69r9078J1699O8208K4115J0968j95p3985n8872O1181O1402
23296A02204R8418k0978j53662j17572L1257r6689l5669L5650J83742N1165k7965
23285D9901j13542p9450L1608K9935J72196l0384j03136R3540O1217k1840j20031
23274b9986r5605O4357N9000j3594R4524M1427J5283p3274O0169K2003L9659q2423
23262A01540p2350j0427j61155o526M0125J36189n347P377J520k7413j2382j4212
23250b3061p9006j7954J06432m654J32r6979L1054J32417K2230n3832L757L2217
23238E2753J989j0260l9183k6034P3647r0498l5550K1598o5070r5804l8631J51155
23226i9888J06341J66658N0478j28964m1342J7647J31163R4603o2218p0922m7212
$$ plain form
23309 45909 89306 96192 96761 -2317 9382 77590 101705 112673 112478 38493 -20379 40802 102204
23296 102204 200622 179644 25982 -91590 -60333 -157022 -192691 -157041 26701 77866 49901
23285 49901 -63641 -143091 -111483 -81548 90648 60264 -42872 50668 111885 90045 -29986
23274 -29986 -125591 -61234 -2234 -15828 78696 120123 135406 62132 122301 144304 183963 101540
23262 101540 29190 18763 -142392 -148918 -108793 27396 22049 29426 30946 3533 -8849 -23061
23250 -23061 -102067 -120021 -13589 -18243 -18111 -115090 -84036 48381 70611 16779 20536 52753
23238 52753 54742 44482 5299 -20735 52912 -37586 -73136 -51538 -116608 -212412 -251043 -99888
23226 -99888 6453 173111 223589 94625 53283 70930 202093 296696 234478 163556 116344
23215A16344l8341m4475L0401N5839J85097N5081r6156l2392m2232q02L5043l7134
23203A86273M1786k1841p5623j5966J9185P467j3757j22640j04203p1077k2043
23192a92439Q6425J16545K6224K0868L6197m9433l340m6509l8141M5294J9972
23181B1663Q3801Q5893l7534J3906O2615l1280j67096j53665J55242L9402m8281
23170B4666L0289k092M7475Q87n2480R0371R2350o241q0911p7918l0119r6721
23158f0444o941o4972n4548l4593L0044o3968l5181Q6803N9286j1888M948M4223
23146a07231N7235j7134J38585N7026j34671j27350k7902J33776J5880q7259n8962
23135a58007l712P8002K03498J21292L3423l5992j84261r2844o3301R5544p052
$$ plain form
23215 116344 78003 33528 63929 119768 304865 359946 263790 231398 189166 188364 223407 186273
23203 186273 228059 206218 130595 114629 133814 141281 127524 4884 -99319 -170396 -192439
23192 -192439 -106014 10531 36755 57623 93820 44387 41047 -5462 -43603 1691 21663
23181 21663 105464 191357 153823 167729 230344 199064 31968 -121697 33545 72947 24666
23170 24666 54955 52863 100338 101225 48745 139116 231466 225225 144314 66396 36277 -60444
23158 -60444 -67385 -132357 -186905 -221498 -191454 -255422 -290603 -203800 -144514 -156402 -151454 -107231
23146 -107231 -49996 -67130 71455 128481 -6190 -133540 -161442 -27666 -11786 -99045 -158007
23135 -158007 -161719 -83717 119781 241073 274496 238504 54243 -38601 -101902 -6358 -13410
23124a3410n9501o3644K1390N1256q6333p2350O5041M6058n9175J82927L5763
23113D8022j65110M4031P1465K3037K7892j38681p1127J22029J9563O7802Q1501
23102A30424K3416j6539m6140K473l1173l4248Q986R70j05868O1203O4560j07440
23090d9376j7167J05559P2065Q0193j8296j27848o6450n2875j4622J29894J23100
23079A64177N981j44438n4166p266J4191N7127J1332k0744l0221p624K3382o0722
23067d8991j2620O4331p1422p7726l0693M0895J14695n6995n3452L0323J31173
23056B9518K94q9774J6747o0224Q107N0189l2702J6248L0477J8953K0752p8236
23044f9651l9076L3458O3638J5862J27356n5667O8866k2394P4513k182l7245O0056
$$ plain form
23124 -13410 -72911 -136555 -115165 -63909 -150242 -222592 -157551 -111493 -170668 12259 48022
23113 48022 -117088 -73057 -1592 21445 49337 -89344 -160471 -38442 -18879 48923 130424
23102 130424 153840 137301 91161 93634 62461 28213 37199 38169 -67699 -6496 58064 -49376
23090 -49376 -66543 39016 111081 191274 172978 45130 -21320 -74195 -88817 41077 164177
23079 164177 170158 25720 -28446 -35712 -21521 35606 46938 26194 -4027 -11651 11731 -48991
23067 -48991 -61611 2720 -68702 -146428 -177121 -136226 -21531 -78526 -131978 -101655 29518
23056 29518 29812 -59962 -43215 -103439 -95332 -45143 -77845 -61597 -31120 -12167 8585 -69651
23044 -69651 -108727 -75269 -11631 4231 131587 75920 144786 122392 196905 194723 157478 217534
23032B17534Q0531K301j26092j06844r2407O514J9053j1991J08338o1454p3488
23021c8005M3036n9851J17267m9743K3355R9950n6266j05310j34741k2061P6342
23010a06027j6701m0282L3264R0299L8312R8282K04K3616j2068N5777J690N9672
22998B26038k9668K2286j57358j27210O8197J43890P051N3387L5369p0659l1889
22987A39434p9143o8814k6509j09626M9095n8060R3760L0593n466J1895L7403
22976A4562o8241k9868k6409P747J9130Q4539J64288n78o8440p7064m607o0194
22964d5135l9890l0062J2877P9317l4335o9186k5564J28429J09142n2494Q1793
22953A14892N282j5382k1453o2903L2001j08257m0499J20416J10269j5155k8099
$$ plain form
23032 217534 298065 300366 174274 67430 -24977 -18463 590 -11401 96937 35483 -38005
23021 -38005 5031 -54820 62447 12704 36059 136009 79743 -25567 -160308 -182369 -106027
23010 -106027 -122728 -163010 -129746 -39447 -1135 97147 97351 120967 108899 164676 166366 226038
22998 226038 196370 218656 61298 -65912 2285 146175 153226 206613 241982 171323 139434
22987 139434 60291 -8523 -35032 -144658 -95563 -153623 -59863 -29270 -34736 -22841 14562
22976 14562 -53679 -83547 -109956 -102209 -83079 1460 165748 165170 96730 19666 15059 -45135
22964 -45135 -85025 -115087 -102210 -22893 -57228 -126414 -151978 -23549 85593 33099 114892
22953 114892 120174 104792 83339 20436 52437 -55820 -96319 24097 134366 119211 91112
22942I1112L1316j7444P5798q3895k6212m2514n0975m6894R526R1075q9987j37654
22930a96748M5074J34318K9583Q0023n4827j11027m3465J628Q9400J39772P3755
22919A87486j30808j23465J784P9938N9122k7652q4171l0953J44035m8230j12982
22908h5896J09988m0962l473n4247r1114k6551J07593O7982J31459M2010o865
22897A49924j11652j70540N5053J00175K7992m9365k0179m533k4090Q2756M2768
22886G8309l0177m7167P147m7962J15622L7987J577p2580j55929l4345J37861
22875i657J29422K02237l9562r6451m8293k19597q4022P9348R9082r055j29430
22864a25978l982M4411L8154Q758m9632J43793O5182Q602m5333j6617j31266o2966
$$ plain form
22942 91112 122428 104984 180782 96887 70675 28161 -22814 -69708 -60182 30893 -59094 -196748
22930 -196748 -151674 -17356 12227 92250 37423 -73604 -117069 -115441 -26041 113731 187486
22919 187486 56678 -66787 -65003 14935 74057 46405 -37766 -68719 75316 27086 -85896
22908 -85896 24092 -16870 -20343 -74590 -165704 -192255 -84662 -16680 114779 156789 149924
22897 149924 38272 -132268 -77215 22960 50952 1587 -18592 -23125 -47215 35541 78309
22886 78309 48132 965 8112 -39850 75772 113759 115336 42756 -113173 -147518 -9657
22875 -9657 119765 322002 282440 185989 137696 -81901 -165923 -86575 12507 3452 -125978
22864 -125978 -129960 -85549 -47395 -38637 -88269 55524 120706 129308 83975 67358 -63908 -126874
22852a26874J09379R6243M2418L4863M4259r4473o8031m8596o9865l5453o5164
22841a81294L7314O2457p2833j75140J07983M5724J12024J27982n0964N6601J2077
22830H1931n153j31616m1096L5826J63840m1156j48653n3714J02632J07229N1175
22819A21245O7001k4963p2536P4497N3218j34039J5851n1773o1489p2729q4549
22808a70266k8947J5935N4543L4364L4675L6484n146R2119k7197k2143O6140o9110
22796A1451m9958o4754M2965R4713J0697P85L380o8353l8719j12026K6958M9956
22784i2905L8003m2946n3811r3385J85704P7829K9558Q1914N385j9254M770j29412
22772h550o6391n3150L7898Q3861N4236n8283n4157O1869k5123j41075n9706k7980
$$ plain form
22852 -126874 -17495 78748 121166 156029 200288 105815 37784 -10812 -80677 -116130 -181294
22841 -181294 -143980 -81523 -154356 -329496 -221513 -175789 -63765 64217 13253 69854 81931
22830 81931 76778 -54838 -95934 -60108 103732 62576 -86077 -139791 -37159 70070 121245
22819 121245 188246 163283 90747 165244 218462 84423 100274 48501 -12988 -85717 -170266
22808 -170266 -199213 -183278 -128735 -94371 -59696 -23212 -28358 63761 36564 14421 80561 11451
22796 11451 -38507 -103261 -60296 34417 45114 45899 49279 -19074 -57793 -169819 -142861 -92905
22784 -92905 -54902 -97848 -151659 -245044 -59340 18489 48047 129961 135346 116092 120862 -8550
22772 -8550 -74941 -128091 -90193 -6332 47904 -10379 -64536 -2667 -27790 -168865 -228571 -256551
22760b56551J0145J76382n979R307J34935L2321J00033r8837j38958n4747Q8879
22749c070l0997q1073n7247R1653J20906N1514p7855l1802m7066o945J13031O038
22737D7087k83444j5025J19330n617N367J38991P8392q681M8485J1356j9006o1695
22725E5540j5779L3169N966n6313j7432O2091j8261K7153p6377l6670o6495R725
22713i3683J8766J30587N0622M8686K7805q4408L3528n8684r2593q0652k2339
22702a22365P5952n0987j8847K6195K2790k7917L0296L0388l6668J78864m8243
22691E9458L5315j2888p8190r4516M3605Q5373J69044L2380j19497N0854P893
22680A78831o3706k7152O0771p3890m2469l4913j5088K9336R7023N0306q762j73265
$$ plain form
22760 -256551 -246406 -70024 -76003 -66696 68239 100560 200593 101756 -37202 -91949 -3070
22749 -3070 -34067 -115140 -172387 -80734 40172 91686 13831 -17971 -65037 -71982 41049 47087
22737 47087 -236357 -251382 -132052 -137669 -132302 6689 85081 76400 124885 136241 117235 55540
22725 55540 39761 72930 78896 22583 5151 67242 48981 76134 -243 -36913 -103408 -93683
22713 -93683 -74917 55670 106292 154978 182783 98375 131903 73219 -19374 -100026 -122365
22702 -122365 -46413 -97400 -116247 -90052 -67262 -95179 -64883 -34495 -71163 107701 59458
22691 59458 94773 81885 3695 -90821 -47216 38157 207201 239581 120084 170938 178831
22680 178831 115125 87973 148744 74854 32385 -2528 -17616 11720 108743 159049 150287 -22978
22668b2978K4230q3026n9873P9593M1945P7694M7887O5191J471q3315j04661p6425
22656i2267q4974M5714P5904J10122O9493k6300M8769j20964j30601l6600N2603
22645h9101L3753N1655L7731J7301j6653o6035K1855N5231r1128m4773k272P3239
22633a9197k8120j16132j4884P6524N6917K9812R1620O7229P346k1220n2867q8829
22621a1801p195K5304L8436R0084m2876P718l6458q6040j03098n6210J07985l8106
22609a12257Q0791J4355k5949m9917J78371P4504r1434j09757l3028K6991l5523
22598h2853O5072Q9685P2290r8137j24071j03557J03363n8415N7259l8662O3435
22587e4591K26685Q7158r5402m4061k1608p4263q2416J0479J9333l3772J1349
$$ plain form
22668 -22978 1252 -81774 -141647 -62054 -20109 57585 105472 170663 172134 88819 -15842 -92267
22656 -92267 -177241 -131527 -55623 54499 123992 97692 146461 25497 -105104 -141704 -89101
22645 -89101 -55348 -3693 34038 51339 34686 -31349 -9494 45737 -45391 -90164 -92436 -19197
22633 -19197 -47317 -163449 -178333 -101809 -44892 -15080 76540 143769 151115 129895 77028 -11801
22621 -11801 -18996 6308 44744 134828 91952 99670 63212 -22828 -125926 -182136 -74151 -112257
22609 -112257 -31466 -17111 -43060 -92977 85394 159898 68464 -41293 -74321 -47330 -82853
22598 -82853 -17781 71904 144194 46057 -78014 -181571 -78208 -136623 -79364 -118026 -54591
22587 -54591 172094 259252 163850 119789 98181 23918 -58498 -48019 -28686 -62458 -51109
22576e1109M0020J10462l8114O3492l5139k7734l7469j31303j6719P6814K6362
22565b0437l5480l2329O0811K963J2954l8249O5292Q0847r7413n8801L0387j0216
22553c9671J1136J531K8762J188p7355n6088k4404M796P552j7054n0963k3433
22541b34003L2933J35194O2805O3111o5656j0034J13574r0185q4702m2775p0001
22530a89739J7526O155p4257J04022J43492Q5897n9880o5555J5350l4911K6252
22519b5648J50712K9068j21853q3764o8988r091R8969P6726R5952M3051L0451
22508B15585l1660j26372j39164M9537P3733l3734L1916j239o2543j0626k4101
22497e8668n8457L3321o9058K2445J02446K5991o8148Q2593J08903J62714q4970
$$ plain form
22576 -51109 -11089 99373 61259 124751 89612 61878 24409 -106894 -123613 -46799 -20437
22565 -20437 -55917 -88246 -27435 -24472 -11518 -49767 15525 96372 -1041 -59842 -29455 -39671
22553 -39671 -28535 -27004 1758 2946 -74409 -130497 -154901 -150105 -142553 -159607 -210570 -234003
22541 -234003 -201070 -65876 -3071 60040 -5616 -15650 97924 7739 -76963 -119738 -189739
22530 -189739 -172213 -166058 -240315 -136293 7199 93096 33216 -32339 -16989 -51900 -25648
22519 -25648 125064 154132 32279 -51485 -120473 -129564 -30595 46131 142083 185134 215585
22508 215585 183925 57553 -81611 -32074 41659 7925 39841 38602 -23941 -34567 -58668
22497 -58668 -117125 -83804 -152862 -130417 -27971 -1980 -70128 12465 121368 284082 199112
22486A99112j78522l0753Q7734J3958q6620l6133k0498j282J17911J1802j47608
22475g0899n2663P574N8579p1665j30366K3368J54243L1079n1820L2687M4342
22464b5541M2805o6486j5857J4177M9948L1644R7104O113n5363j18207N5462J67938
22452A83737J916j33589j73738n7807p5921J81259J37808l2964q9760p9762n1308
22441a90129O770L5058j1008M4664j6854J5021P0865N1673l6457o8954m44m549
22429a04344L5498J06419K976p6080N4460L7210J3789q5447L7309j516m4465J08582
22417H4391N8206j16307m8993j49138M6860J3526J0492J28146N1458r7345P4728
22406E6024Q6265M5519l6244k3654L6989J5046j89519j667l6662P7467J9167m9971
$$ plain form
22486 199112 20590 -10163 77571 91529 4909 -31224 -51722 -53004 64907 76709 -70899
22475 -70899 -123562 -115988 -57409 -129074 -259440 -236072 -81829 -50750 -102570 -69883 -25541
22464 -25541 17264 -49222 -65079 -50902 -954 30690 127794 133907 78544 -39663 15799 183737
22452 183737 185653 52064 -121674 -179481 -255402 -74143 63665 30701 -59059 -138821 -190129
22441 -190129 -183359 -148301 -159309 -114645 -131499 -116478 -45613 6060 -30397 -99351 -99795 -104344
22429 -104344 -68846 37573 40549 -35531 18929 56139 69928 -15519 21790 20274 -24191 84391
22417 84391 142597 26290 -22703 -171841 -124981 -111455 -100963 27183 78641 -18704 56024
22406 56024 142289 187808 151564 127910 164899 179945 -9574 -11241 -47903 29564 48731 -1240
22394a240l4554P9371N447L915k602R5455J18959J00441j87344l09505o0023K5611
22382a66069J41797m5097R034J30192R2801j17067m2147R7928o7108r4429l6229
22371i6394P7908K2294j6016Q2413p3099j14067J04914N0087L4415o3181j55186
22360a45912O7632L7141n3974R3761K8349J9559p4014j16151Q7027L3440M1926
22349A8784M0879l7019J5408J2431j9387K7842L6369M807k996J18568N3948j39757
22337A29877j77310K3103O3495k9845k2803L5712K452l4872L1989M2588l8357
22326B6029r207k4024L1988m0402J3214m7918o210Q4384l248O3814k0638p7853
22314a0071k0757m4686j69260Q6168J2110j08827o5188L9428K0054P8441Q6405
$$ plain form
22394 -1240 -35794 43577 49024 52939 50337 145792 264751 365192 177848 -131657 -191680 -166069
22382 -166069 -24272 -69369 -60335 69857 162658 45591 3444 101372 34264 -60165 -96394
22371 -96394 -18486 3808 -12208 70205 -2894 -116961 -12047 38040 72455 9274 -145912
22360 -145912 -78280 -41139 -95113 -1352 26997 46556 -27458 -143609 -56582 -23142 18784
22349 18784 59663 22644 38052 50483 31096 58938 95307 100114 97118 215686 269634 129877
22337 129877 -47433 -24330 39165 9320 -13483 22229 24681 -10191 21798 64386 26029
22326 26029 16822 -7202 24786 -15616 -2402 -50320 -56530 27854 24606 88420 67782 -10071
22314 -10071 -30828 -75514 -244774 -158606 -146496 -255323 -320511 -281083 -261029 -182588 -96183
22303i6183J9374L1687M748L67n1423l8786Q9981M1447r640l9744k0225L040K2594
22290d2763N794k518L0299L7143r2577l8837J16842l5153p924p3252O581R4381
22278a984p9555j57278m7466J3993J12197M6153P4713J61362Q301J1759k8766
22267A13429q8277J10810K7350j29971m9222j7540j8819J167r3408q7881n6559
22256b88921J50455J69757N2199r8160n0076R4148m3193Q3325L9150J9656M3858
22245A72198M622o5515o531J11746l1846r1969N0454J2105o1877L0629m4698m7896
22233C1422l3393K1272N1215j1349k5847n6497p3768O8764P7560N5141j7945j6989
22221F9586J3357n9982K5202K0997r1447Q0494Q2584M0344j0260j33461O7556
$$ plain form
22303 -96183 -76809 -45122 -40374 -40007 -91430 -130216 -40235 1212 -8428 -48172 -68397 -65357 -42763
22290 -42763 -36969 -39487 -9188 27955 -64622 -103459 13383 -21770 -29694 -102946 -96365 -1984
22278 -1984 -81539 -238817 -286283 -272290 -160093 -113940 -39227 122135 130436 142195 113429
22267 113429 25152 135962 163312 33341 -15881 -33421 -52240 -51073 -144481 -232362 -288921
22256 -288921 -138466 31291 83490 -14670 -64746 29402 -13791 69534 108684 128340 172198
22245 172198 176820 111305 104774 216520 184674 92705 143159 155264 93387 124016 79318 31422
22233 31422 -1971 19301 70516 59167 33320 -23177 -96945 -28181 49379 104520 86575 69586
22221 69586 82943 22961 48163 69160 -22287 58207 140791 181135 170875 37414 104970
22210A04970N2433n6468q7889j9417r0745O6205L2147j41460R1823N5761o9809
22199f2449r3746k3489j2991O0404J4543Q9166l8923L9120k0547M8531J23313
22188A22932J4059j63833N8770q1990m9955L9511j58123K8235J03335O0418k6318
22177e2959R6787J71845n6091l8763P2211O2710L6358o8329j07925j22143M6437
22166D0138L985R102j6803L7032J58800J5900J08145p1132m5976N9640j6228J0487
22154B93090O7820j38097j13950j27942p1352J43160j0184o5938J4944k1658m0712
22143g0819m5742J36056J09060o1080J6081Q9241J511j43998r5190N0371j08087
22132a22596j35265P8896J22628J0462N9855L6441p9869l1217J20694N3331r278
$$ plain form
22210 104970 157403 100935 13046 -6371 -97116 -30911 1236 -140224 -48401 7360 -62449
22199 -62449 -156195 -179684 -192675 -132271 -117728 -28562 -67485 -28365 -48912 -381 122932
22188 122932 136991 -26842 31928 -50062 -100017 -60506 -218629 -190394 -87059 -26641 -52959
22177 -52959 43828 215673 159582 120819 193030 255740 292098 223769 115844 -6299 40138
22166 40138 44123 53225 36422 73454 232254 248154 356299 285167 239191 298831 282603 293090
22154 293090 360910 222813 108863 -19079 -90431 52729 42545 -23393 -8449 -30107 -70819
22143 -70819 -116561 19495 128555 67475 83556 172797 174308 30310 -64880 -14509 -122596
22132 -122596 -257861 -178965 -56337 -45875 13980 50421 -29448 -60665 60029 113360 104082
22121A04082n6927n1859p7K8017o3314j30214N6303p215k1269J3761M7381J3476
22109f7855Q1336K4433o0350m1124L3584L721M033l3962N8639p01j24331P070
22097a15507J0305l530L7040J41710j6181p4389j9778L8131p4850J7086N4705
22086e258m1296M1051J75051M7996j60125q4154p442P7636J3857n1437L5339m2750
22074a532j2125O7475N4876l5606L6761j3200l184J4008q8769j55542j337L5756
22062a02419J07764J14995K2675l8260j9171J69924q1592j22900P9587K9350j5257
22051A44696R5804m2573J4112p182j22673L7833Q6217J2127k5162J12487M0171
22040C45857j26264r4447q5947N5021L433p2418o4165M2378J15924M2455N4579
$$ plain form
22121 104082 47155 -4704 -4781 23236 -40078 -170292 -113989 -121204 -142473 -128712 -81331 -67855
22109 -67855 13481 37914 -22436 -63560 -29976 -26255 -22222 -56184 2455 1754 -122577 -115507
22097 -115507 -105202 -108732 -71692 70018 53837 -20552 -40330 -2199 -77049 -59963 -5258
22086 -5258 -46554 -5503 169548 217544 57419 -26735 -34177 43459 57316 5879 41218 -1532
22074 -1532 -13657 53818 108694 73088 109849 96649 93465 107473 18704 -136838 -138175 -102419
22062 -102419 5345 120340 143015 104755 85584 255508 173916 51016 130603 159953 144696
22051 144696 240500 197927 212039 204857 82184 120017 206234 218361 193199 305686 345857
22040 345857 219593 125146 39199 94220 97653 25235 -38930 3448 119372 161827 216406
22029B16406J6263l0658p1855K9748K4108K0293j28522m4385q587O2935M3464
22018A29210j7541M2706Q0316j46731k3216m0557q9975M8904M9648k0926p8807
22007f6969P3042R6714K812r0828l669Q2445J1974p8624n87j01593m4727K8926
21995i1084M6837K5006P5374j2014o0913o407J02375J131P5630L0936j69711o8049
21983e0889M2163l5587J00745Q0459o3967p0809M1119o9114n0783O9371O4399
21972E7107R4336n8899P4177K1151q9602k8525K8475k1302N0718j3222j17905
21961c491j5480M5031P3371O4077P0018p7059p5668q6672M2992N585m0812M8109
21949E0001K0521r154J13748j6558j00930j06209n2550J37361n7251j56269J5925
$$ plain form
22029 216406 232669 202011 130156 159904 184012 204305 75783 31398 22811 85746 129210
22018 129210 111669 154375 234691 87960 64744 24187 -65788 -16884 32764 11838 -66969
22007 -66969 6073 102787 105599 14771 11102 93547 105521 26897 26310 -75283 -120010 -91084
21995 -91084 -44247 -19241 56133 44119 -16794 -23201 79174 80305 155935 186871 17160 -50889
21983 -50889 -8726 -44313 56432 136891 72924 2115 43234 -25880 -76663 -7292 57107
21972 57107 151443 92544 166721 187872 98270 69745 98220 76918 127636 114414 -3491
21961 -3491 -18971 26060 99431 163508 233526 156467 80799 -5873 37119 42704 1892 50001
21949 50001 70522 61368 175116 158558 57628 -48581 -101131 36230 -21021 -177290 -161365
21938a61365K8460k0519M4767M0692L7743P1721J6597m9059m953o2307p9800Q0873
21926e7150m8343N247M4943J67352N3361p4830J46018j6609n8730j41382m9101
21915b9224o7902L3096L1203P5853J11528j24545j23394l1516P4822J05085Q8913
21904A43919m1062r5411r7228J3666M6647L2845N8243O0080n3707K8235j4347
21893H1880Q712l7064l7334N3390J927j12050j6294J11682J09583M2978l2572
21882A74838k2931j03385M2620M3574o8150j16138n5718n2037J31177O3101K4666
21871F1617k2933j37403r5568J46168J07096P7241p3401l8113j30017L2712l7314
21860a09915N6321n8811K1489K0885J1611J3702Q5293L7521Q9326N4553q1801
$$ plain form
21938 -161365 -132905 -153424 -108657 -67965 -30222 41499 58096 9037 4084 -58223 -138023 -57150
21926 -57150 -105493 -100246 -55303 112049 165410 90580 236598 219989 161259 19877 -29224
21915 -29224 -97126 -64030 -32827 43026 154554 30009 -93385 -124901 -50079 55006 143919
21904 143919 102857 7446 -89782 -76116 -29469 3376 61619 121699 67992 96227 81880
21893 81880 90592 53528 16194 69584 71511 -40539 -56833 54849 164432 207410 174838
21882 174838 151907 48522 91142 134716 66566 -49572 -105290 -157327 -26150 36951 61617
21871 61617 38684 -98719 -194287 -48119 58977 136218 62817 24704 -105313 -72601 -109915
21860 -109915 -53594 -112405 -90916 -70031 -58420 -44718 40575 78096 167422 221975 140174
21849A40174L8561K4227k9251Q3847K0414j82771q62J02169p7607j29671R594
21838a176L0920P3304O5163o0801j22755m8118J36186P0228p2075j77151J7826
21827h8449R4983k1420p2494n3503j7094M913p710J1822O6165p812j24892n189
21815b20680Q2616Q9224J22160Q6215m0430m8159M7268r0837k9990k5330O5813
21804C7870l236O2800L7735l9619j25178k6438L1435N9631m950P5777j5299l6249
21792E4279O3598m3778K4851r4130o2611p1614O9373R4056q6975q5335O4646J88579
21780A14939P1638k835p7242O603q1452J405m7552O1549O7995K8068j2872Q237
21768A38481P3224P2560p3196M9799m2102J9896k4257K1809p863j77127j57783
$$ plain form
21849 140174 178735 202962 173711 257558 277972 95201 94339 196508 118901 -10770 -1176
21838 -1176 29744 103048 168211 107410 -15345 -63463 72723 142951 70876 -106275 -88449
21827 -88449 6534 -14886 -87380 -140883 -157977 -153064 -160774 -148952 -82787 -90599 -215491 -220680
21815 -220680 -138064 -48840 73320 159535 119105 70946 118214 27377 -2613 -27943 37870
21804 37870 34634 97434 135169 95550 -29628 -56066 -24631 35000 30050 105827 90528 54279
21792 54279 117877 74099 98950 4820 -57791 -129405 -60032 34024 -52951 -138286 -73640 114939
21780 114939 186577 183742 106500 113103 31651 33056 -14496 47053 115048 143116 130244 138481
21768 138481 211705 284265 211069 260868 218766 238662 214405 236214 228351 51224 -106559
21757a06559q7048L1343R5779J83861Q703m144M1827j362n4196q0403k0916K8798
21745C5683O5608r512J3300j38883k0761N8804k5420n7425P8598j12n752L7261
21733C1389M2460N0978J1687l9263r113R9828j0875m6374K099N7400p4724j63507
21721d8015k07743P8659J87668K7758M392r4739N7347m5265j0139k6465k5081
21710a01623r703J28444R8084J3288j2542j01286j17520r0138n2359N6627O0300
21699a28428M9688J38325Q7463M6852K887r3908l7374p4039L0010R1221M7919
21688A60616j1819O1546J8109j25414o3716K255J6629J53636N7459j05985j21552
21677D1764m616O9444O0973O2398j3581j39697n8821j844n1051L4320l7371J4108
$$ plain form
21757 -106559 -193607 -162264 -66485 117376 126079 121935 163762 162400 108204 27801 6885 35683
21745 35683 101291 91779 105079 -33804 -54565 4239 -21181 -78606 -8 -120 -5872 31389
21733 31389 73849 124827 136514 97251 88138 187966 177091 130717 132816 190216 115492 -48015
21721 -48015 -255758 -177099 10569 38327 42719 -52020 5327 -39938 -50077 -76542 -101623
21710 -101623 -111326 17118 115202 128490 115948 14662 -102858 -192996 -245355 -188728 -128428
21699 -128428 -78740 59585 147048 193900 196787 102879 65505 -8534 21476 112697 160616
21688 160616 148797 210343 228452 103038 39322 41577 58206 211842 269301 163316 41764
21677 41764 37148 106592 167565 229963 216382 76685 17864 16020 -35031 -711 -38082 -23974
21665b3974J24596O2287M5251N1494M8459p4648j51291J2841k864L6569Q0987
21654B09707J1876k20572K3491K1860l402K9469L184l8960m8161O7976P2175j92437
21642f3794r329Q4401K8649N5814O7305K9008n7608J103j9436j11632j55128K0560
21630a30087J94290M5748j4688M5216J40073j00564j91372j15852R571J10158
21620g507R1055m0480Q5437j6367J0655K1944o1470r0125R216j0636m770J15593
21608A02545N148p4107K1699M3037Q723j6381J2178k1125o9571J0412M0315p1522
21596h649L6612m2070n834P3071n192o6559P082M66Q1803M064k975L892m7026
21583B8685J73910P7772j00780j9291l5972J9355N342O5033o2236r810j1271L077
$$ plain form
21665 -23974 100622 162909 208160 259654 308113 233465 82174 95015 92151 128720 209707
21654 209707 221583 1011 24502 46362 42960 72429 75613 36653 -11508 56468 128643 -63794
21642 -63794 -73123 11278 39927 95741 163046 192054 134446 135549 116113 4481 -150647 -130087
21630 -130087 64203 109951 95263 140479 280552 179988 -11384 -127236 -117665 -7507
21620 -7507 83548 43068 128505 112138 122793 144737 83267 -6858 2358 -8278 -13048 102545
21608 102545 107693 33586 55285 98322 107045 90664 102842 81717 12146 22558 62873 -8649
21596 -8649 27963 -14107 -19941 53130 47938 -18621 -11539 -11073 70730 74794 71819 75711 28685
21583 28685 202595 280367 179587 160296 124324 143679 149021 214054 151818 142008 130737 133814
21571A33814n4303p5117P0212Q7326k096K5833p7653J3646N127J36713l4108m5977
21559A83417q6321j78896N281K9218L7980M4590P3519j1019M1773o5695j22224
21548d8377j03335J29651J55368J61068j09136k39794N615L9773K2996M2077j11987
21537e6081K829N2967o6651q748J8092J971J25472P374m012p277K6542k3298K8315
21524I7495Q5100j17525r7714j2552k5928O9989j4698m5413M0279o7852J2296
21513g6523O2096r870N1235J3699j39508n4161K5610J18705J66203O7174p129
21502B17531j303j551Q7133l1496j55915k088j20150l1540r6588L9391R594M4029
21490d2953P2631K8900N0378J1065K3098m5073k1946K6043P1180J8589J258j05744
$$ plain form
21571 133814 79511 4394 74606 161932 159836 185669 108016 121662 126789 263502 229394 183417
21559 183417 97096 -81800 -76519 -47301 -9321 35269 108788 97769 139542 73847 -48377
21548 -48377 -151712 -22061 133307 294375 185239 -54555 -48940 -9167 13829 55906 -56081
21537 -56081 -53252 -285 -66936 -75684 -57592 -55621 69851 77225 73213 65936 92478 69180 97495
21524 97495 182595 65070 -32644 -45196 -71124 -1135 -15833 -61246 -20967 -88819 -76523
21513 -76523 -14427 -24297 26938 40637 -98871 -153032 -127422 -8717 157486 224660 217531
21502 217531 216228 214677 301810 270314 114399 112311 -7839 -39379 -135967 -96576 -86982 -42953
21490 -42953 29678 58578 108956 120021 143119 98046 76100 102143 173323 191912 193170 87426
21478H7426j77884N6279J18442J10993p5491n2772m1283P9409K9166j0732r6823
21467B6730n8357j1154o0959M9026J27564p330o1499k3882m0627L2856N6547R9113
21455A28028M2134k4512K3935J3191o831r4022L0969N5910N4440r2050k3166L5933
21443A43959p5870l1171N5964K9662N4706l8135l7235j6658P3221M7964K1367
21432B27774R8740n4260j74070r5880j97386r0614P7357J66294O8944J924Q5593
21421A14416J22829k0900r9452O7735P9923K2414n7859k3746M4742K9605p5581
21410B04126P6847n0154K9126O2893N7602j0393n2754k2192m3181j21795O6989
21399A97114j8208j07250r4092Q2971J01721n237N4761o837q1912r3734R7940
$$ plain form
21478 87426 -90458 -34179 84263 195256 119765 66993 25710 105119 134285 123553 26730
21467 26730 -31627 -42781 -103740 -54714 72850 65520 4021 -19861 -60488 -27632 28915 128028
21455 128028 170162 145650 169585 182776 175945 81923 112892 168802 223242 131192 108026 143959
21443 143959 68089 36918 92882 122544 177250 139115 101880 85222 158443 206407 227774
21432 227774 326514 272254 98184 2304 -195082 -285696 -208339 -42045 26899 28823 114416
21421 114416 237245 216345 116893 184628 264551 286965 229106 205360 250102 279707 204126
21410 204126 280973 230819 259945 322838 380440 370047 317293 295101 251920 130125 197114
21399 197114 178906 71656 -22436 60535 162256 157019 211780 204943 123031 29297 127237
21388A27237M2872j07048N187j4672o1443j7966m8261p365m568J16923J44300
21377A75196J0486n6800L829p703n2155r4420R787m9686j07722m6997M0786O964
21365a68435J9652Q5357K0814j00326l8181J19743M8252R7400K7947n4838n1244
21354F141k09K0216N386L8404k9351q4144K7110O1368k5671L5234J23994J6926
21342A95404J4576J2667j33665M1930k7923N071P7335j8444r0884O1089j907Q589
21330A43838K3304k2767Q5749K9836o0841l2436r0271k0548J25133n5822k1991
21319A03184K2577q2292o721J40088Q1928O1650J6487j173J3724m2720l2631N3424
21307C27525m247l0103L4002J04394R2216J45746j66657j4461K94652K16094J54728
$$ plain form
21388 127237 170109 63061 68248 53576 -7867 -25833 -74094 -81459 -86027 30896 175196
21377 175196 185682 128882 132711 125008 72853 -21567 -11780 -61466 -169188 -216185 -175399 -168435
21365 -168435 -148783 -63426 -42612 -142938 -181119 -61376 -13124 84276 112223 57385 6141
21354 6141 5932 26148 31534 69938 40587 -43557 -16447 44921 19250 54484 178478 195404
21342 195404 209980 222647 88982 130912 102989 108060 185395 166951 76067 137156 135249 143838
21330 143838 167142 144375 230124 259960 199119 166683 76412 55864 180997 125175 103184
21319 103184 125761 43469 36748 176836 258764 320414 336901 335728 349452 306732 274101 327525
21307 327525 323278 293175 327177 431571 523787 669533 502876 488415 783067 999161 1153889
21296A153889Q7541J55154L46321M00731K82404L7816q2808k47538l85965l61450
21286A386095r8731p0907m9907n3212K49503K75732J62011L13120J88484o999
21276B295189k24374k30700l67855m30284k88342j19891q0709j40179q0147m973
21266C27735m670m360p086k4379n8612j0778q656q5489n4773O6965J09417K0618
21254B65932J00155J6102o6149k5460m8194l3044k6732j05679N0156J09952p171
21243B29868p1433P0943J2576l2706Q3641j1060j30116l6993L4855M221p983N4840
21231B00653N9234r5357j6244J15352K6895L6628j6650j30100j26465J5997L4064
21220A04007J07679N3670r8691K0604o5381k2523J29383k3512j11732k3574J31540
$$ plain form
21296 1153889 1241430 1396584 1742905 2143636 2426040 2463856 2381048 2133510 1747545 1386095
21286 1386095 1287364 1216457 1166550 1113338 1362841 1638573 1800584 2113704 2302188 2295189
21276 2295189 2070815 1840115 1472260 1041976 753634 633743 553034 412855 332708 327735
21266 327735 323065 318705 311619 287240 228628 217850 209194 123705 68932 135897 245314 265932
21254 265932 366087 382189 316040 290580 242386 209342 182610 76931 127087 237039 229868
21243 229868 158435 229378 241954 209248 292889 281829 151713 114720 149575 153796 145813 200653
21231 200653 259887 164530 148286 263638 290533 327161 310511 180411 53946 69943 104007
21220 104007 211686 265356 166665 187269 121888 99365 228748 205236 93504 69930 201470
21209B01470j8797K6046m106j00400k5406l8104j09836M5139R2038R4250L0284
21198A92578O1259Q547p2410J9842R181M7635P9296R008J8638j44388r705J9988
21186B39469m7460r834P3885L58l5517N1141N6383o5391K1497Q5764R8221L7674
21174E06190j17427o5486K6501Q3017N0262J33128M2991K7165l7555M3698J08818
21163H01302J77292J40877L34342M70017M14087K26465k07928r0089m7464k59726
21153A959175k80708j34334p8330R1650L46937K06929J39868J67408n3205k86537
21143B078853l77679n06259l49786o5704j34128j77076P9824n9417j09521l7395
21133C41712n7067p1970j03797o0817K9611q6912O6312P7134P4969j7271K3406
$$ plain form
21209 201470 182673 208719 204613 104213 78807 40703 -69133 -23994 68044 162294 192578
21198 192578 253837 262384 189974 209816 218997 266632 345928 354936 373574 229186 219481 239469
21186 239469 192009 182175 256060 256418 220901 272042 328425 263034 284531 370295 468516 506190
21174 506190 388763 323277 349778 432795 483057 616185 659176 686341 648786 692484 801302
21163 801302 978594 1119471 1453813 1923830 2337917 2564382 2356454 2266365 2218901 1959175
21153 1959175 1678467 1544133 1465803 1557453 1904390 2111319 2251187 2418595 2365390 2078853
21143 2078853 1701174 1194915 845129 779425 645297 468221 548045 488628 379107 341712
21133 341712 284645 212675 108878 48061 77672 -9240 57072 134206 209175 191904 215310
21122B15310q9920o149J41984P6000r3251m1846r453j8455K9979j0553J55502
21111C49148K9283j16627l8881K5208l7584K3457M3013j26197j57983l7176R6649
21100E2310J0165p0688O087J78036J20949P999k5916O0365q132p5306O2294J01102
21088D19265r8812j69829L1872O3623K2783J9699p9069l268j6332r599k6638j1791
21076A41904q028j3550J13992n3300j55746J29411Q8920M9440J8541j4143m8177
21065B49264k2750q7899o6164J38447m649J2145R0001j37462Q2332J2962n0998
21054B15229j75090K6340O0769O2567J09747j46007j37347J7468O7973J5064J2307
21043A29020l2405Q0879J22882O4823J3376K2374j18069q3916O5532P7050q8461
$$ plain form
21122 215310 125390 119241 261225 337225 243974 202128 192675 174220 204199 193646 349148
21111 349148 378431 261804 222923 248131 210547 234004 277017 150820 -7163 -44339 52310
21100 52310 62475 -8213 -2126 175910 296859 304858 278942 339307 331175 255869 318163 419265
21088 419265 320453 150624 182496 246119 268902 288601 209532 206264 189932 180333 153695 141904
21076 141904 133876 120326 234318 181018 25272 154683 243603 293043 311584 297441 249264
21065 249264 226514 138615 72451 210898 206249 218394 308395 170933 253265 266227 215229
21054 215229 40139 66479 127248 189815 299562 153555 16208 33676 101649 116713 129020
21043 129020 96615 177494 300376 365199 378575 400949 282880 198964 264496 341546 253085
21032B53085l677K0030K2115J5544j00956o0191P511P6186j48325m0927M0926
21021H1321J30163o055j0666l0414R779o146K0216P010k2106M3396l1756n4217
21009A30525K0344M3363K8555m7137K6955K0603l559M0272j6813j10595j01232
20998C1281M3266Q3990P4416K15553q1337p6824N8167K00354m441n4009r9002
20987C91414R4180J07617k1837q486m5433M7359k6042L3819N3573q6065L8565
20976E78664N909l625P080j00830K9443J488j47930q5823R7046Q5776O9048R5700
20964F31946J9525m5020j27020j15903J1557L2777p1289m7921Q3929O6170R26
20953D39677j8384O66p3735O4788J37525j07879o8528q730Q3220J08029L3416
$$ plain form
21032 253085 249408 269438 291553 307097 206141 145950 153461 229647 81322 40395 81321
21021 81321 211484 205429 194763 164349 174128 167982 188198 195208 173102 216498 184742 130525
21009 130525 150869 194232 222787 175650 202605 223208 219649 259921 243108 132513 31281
20998 31281 74547 158537 232953 448506 367169 290345 348512 548866 544425 490416 391414
20987 391414 485594 593211 571374 562888 517455 564814 538772 572591 626164 540099 578664
20976 578664 584573 580948 588028 487198 516641 518129 370199 284376 381422 467198 536246 631946
20964 631946 651471 606451 479431 363528 375085 407862 336573 288652 372581 438751 439677
20953 439677 421293 421959 348224 413012 550537 442658 374130 365400 448620 556649 590065
20942E90065j12114k9633l7001R971J1545k1363O2849m9858o1101M3174J5657
20931D22191K2108l6851K8538J37266j36865o6118J31578O1451q7900l8243K0875
20920D58030q6249K0675j60272n4486m4306N5338N8036J6939M8570N1038q767
20909C54546N660O7416Q525j74015q7800Q9875P5717K2552R1018m820p427n8525
20897C82722k9076J9774J19887k4301K4633l3521n4145j516p9395L0791j2667
20886C43186J0724j06514j00588J4983j02883m1886K4844Q3168q684K5664k2172
20875A19842J02493K9217l146o6433r3499q9906L3559L4319M6736P8565N9595
20864B51342K7264J05905N6355P7259O214O5108J11327P7234p0057j10037L7397
$$ plain form
20942 590065 477951 448318 411317 421288 432833 411470 474319 424461 363360 406534 422191
20931 422191 444299 407448 435986 573252 436387 370269 501847 563298 475398 437155 458030
20920 458030 371781 392456 232184 177698 133392 188730 246766 263705 312275 363313 354546
20909 354546 360206 427622 436147 262132 174332 264207 339924 362476 453494 448674 441247 382722
20897 382722 353646 373420 493307 469006 493639 460118 405973 404457 325062 355853 343186
20886 343186 353910 247396 146808 161791 58908 17022 41866 125034 116350 142014 119842
20875 119842 222335 251552 248406 181973 88474 -1432 32127 66446 113182 191747 251342
20864 251342 278606 384511 440866 518125 524339 589447 700774 778008 707951 597914 635311
20853F35311L5420l9427J16259J29781o9659R343o0808n2517Q1006m1582o8231
20842F74896j9540m6240J30441O0210q1145n8049N3220m255p0930k9857P0125
20831F78876k125J34837n4063j19953L5244J63253R0559P1752L7058q133j542
20820A025763K2272l1114J41950L4117L5538J81173J12897m710m3769o5477j65348
20809A243292n6760l2802J0424M866J43558J42366O1418R1988J2704o0040j20498
20798A440516K1212n3751n6585R4698N1922l2701M891N3807m4985p5931j51336
20787A251757j1343J179l6631J1857K07591J229j0677J627J13074P4498j44732
20776A459429M515l7950N6856K9864K8066J63747K3128j4912j2634q503N8265
$$ plain form
20853 635311 670731 631304 747563 877344 807685 817028 756220 703703 784709 743127 674896
20842 674896 655356 609116 739557 799767 718622 660573 713793 709538 638608 608751 678876
20831 678876 676751 811588 757525 637572 672816 836069 926628 998380 1035438 1027305 1025763
20820 1025763 1048035 1016921 1158871 1192988 1228526 1409699 1522596 1517886 1474117 1408640 1243292
20809 1243292 1186532 1153730 1164154 1169020 1312578 1454944 1516362 1608350 1621054 1561014 1440516
20798 1440516 1461728 1407977 1351392 1446090 1498012 1465311 1470202 1524009 1479024 1403093 1251757
20787 1251757 1240414 1241593 1204962 1216819 1424410 1425639 1414962 1416589 1529663 1604161 1459429
20776 1459429 1463944 1425994 1482850 1512714 1540780 1704527 1727655 1712743 1700109 1691606 1749871
20765A749871O5169j028j02j799M9142P4805J99755J8445N3010K5144q4684o9287
20753B078441K0806N0872J31268J74843K25929R0107J92499O3514N0022J30385
20743C208686K23396K09983J49961J42430K05341J73792K98743L86365L49384
20734E348081L69427O65664O84969O43890O87355O14353M73728M36619J3553K5802
20724I963441K39192K32545N22988P74773J047183J215646J365722J598838J945174
20715A8905502J912453K101466K244404K310031K473346K834483L123724L262003
20707C9167412L409603L853123M508329N154620O295945Q224919J0756431J4237652
20699I5608034J9662692K7920511L9172018M9495566N9118246P0078925N4818283
$$ plain form
20765 1749871 1815040 1814012 1813910 1812111 1861253 1936058 2135813 2154258 2207268 2232412 2147728 2078441
20753 2078441 2099247 2150119 2281387 2456230 2682159 2772266 2964765 3028279 3078301 3208686
20743 3208686 3432082 3642065 3792026 3934456 4139797 4313589 4612332 4998697 5348081
20734 5348081 5717508 6383172 7068141 7712031 8399386 9013739 9487467 9924086 9937639 9963441
20724 9963441 10202633 10435178 10958166 11732939 12780122 13995768 15361490 16960328 18905502
20715 18905502 20817955 22919421 25163825 27473856 29947202 32781685 35905409 39167412
20707 39167412 42577015 46430138 50938467 56093087 62389032 70613951 81370382 95608034
20699 95608034 115270726 143191237 182363255 231858821 290977067 361055992 415874275
20692D15874275Q417019j4833386l5347106o8697667o9191566m5773685k3299997
20685A67147887o024049Q687691K3604700L7548386M8394662O1339436N9450975
20678D00149688J7418905j7458309l3552588o8397309q3302230o5345708m2872407
20671A06640042k7482205j7848034j2286214q705439o060364m300387l012388
20664B6945011j986480j722798j780286j699028j673397j709476j370983q86900
20656A4115663r06793q68514p85662q98076j061589r53738p10591m94195k90517
20647G145988j40912k9844q665J45373J79642J23000j13233j90209l76669n67124
20637F167347p26994o08629l47316j71483l27916j40181J3542j8752k2924L7232
$$ plain form
20692 415874275 424291294 409457908 374110802 305413135 236221569 190447884 167147887
20685 167147887 161123838 169811529 193416229 230964615 279359277 340698713 400149688
20678 400149688 417568593 400110284 366557696 298160387 214858157 149512449 106640042
20671 106640042 79157837 61309803 49023589 40318150 34257786 29957399 26945011
20664 26945011 24958531 23235733 21455447 19756419 18083022 16373546 15002563 14115663
20656 14115663 13208870 12340356 11554694 10656618 9595029 8641291 7930700 7436505 7145988
20647 7145988 7005076 6975232 6966567 7111940 7291582 7414582 7301349 7111140 6734471 6167347
20637 6167347 5440353 4831724 4484408 4312925 3985009 3844828 3858370 3839618 3816694 3853926
20627C853926O7120n2210j03262M7289O2748n958p6348R5617J19586L9759J06366
20616D154633Q1174N5878N8164J33633J07899J98168K59307K90917L71446L92792
20606F104011L27560K43675K98338M89581O55876O54834O18176O13251N12080
20597A0517382M52968J63517K69764N30915O75039Q64992J222927J652729J812425
20588A8162658J735886J493073J559694J389620J196885J858804K342869K463832
20580C2203321K926758L369812L898115M228579M635161N465957O652130Q005887
20572G1385720R658063J2570522J6571237K2650994L2460803M4421409N3985673
20565B63704421O5512322P1234350L6612553o620537k0310479m7069933o6241606
$$ plain form
20627 3853926 3921046 3868836 3765574 3812863 3875611 3869653 3793305 3888922 4008508 4048267 4154633
20616 4154633 4235807 4291685 4349849 4483482 4591381 4789549 5048856 5339773 5711219 6104011
20606 6104011 6431571 6675246 6973584 7463165 8119041 8773875 9392051 10005302 10517382
20597 10517382 10970350 11133867 11403631 11934546 12609585 13474577 14697504 16350233 18162658
20588 18162658 19898544 21391617 22951311 24340931 25537816 27396620 29739489 32203321
20580 32203321 35130079 38499891 42398006 46626585 51261746 56727703 63379833 71385720
20572 71385720 81043783 93614305 110185542 132836536 165297339 209718748 263704421
20565 263704421 329216743 400451093 437063646 430443109 410132630 363062697 296821091
20558B96821091m8388744j8022069R615663L0115442M5377246O0115145M6920572
20551D22554346k688109k7917193m5756306p8015242p9004759n6184600l5924288
20544I7063849k2890951j5056607j0719871p965047n837005m424278l426749k437703
20536B4305638j957518j584944j573245j611502j400342j231545j035013p14201
20528A3197328k73856k12701k19286m44709p99945r50989j077428j013973o69430
20519G535011k91530j70808M87J74958m5239k31278n31843q04821q13590n64515
20509D256832l80435j70157j53985k48257j94676o949J9184j69602k33858m9974
20499B668123j08320j54816n3389j626m2616j39043j8055o3982j43368l5320m2487
$$ plain form
20558 296821091 248432347 230410278 240025941 270141383 315518629 375633774 422554346
20551 422554346 419866237 391949044 346192738 268177496 189172737 132988137 97063849
20544 97063849 74172898 59116291 48396420 40431373 34594368 30170090 26743341 24305638
20536 24305638 22348120 20763176 19189931 17578429 16178087 14946542 13911529 13197328
20528 13197328 12923472 12710771 12491485 12046776 11246831 10295842 9218414 8204441 7535011
20519 7535011 7243481 7072673 7073160 7248118 7202879 6971601 6439758 5634937 4821347 4256832
20509 4256832 3876397 3706240 3552255 3303998 3109322 3102373 3121557 2951955 2718097 2668123
20499 2668123 2559803 2404987 2351598 2349972 2307356 2168313 2150258 2086276 1942908 1907588 1865101
20488A865101j54813j1735q9617j04716r3999n6694p7359o2599j16338L9042p5891
20477A060382l7817J9143n4123j6631L781J509J09834o3174n9293J9896j07886
20466H75621q6461o3970j63359j41496j0265J58884M8883K1338O2673p1584j22402
20455E07862q5977M0538o9038M8585J6348j68152j8230J14686J93240J12852j4262
20444F78452l0649j17163j27193n0278j18608q7008J62229J00220M3740m8943
20434D04799L2283K8034q6058r1294K8276o7205p2938M0619O2696L9839o2274
20423B56777k9057L5276P61q8229P1727K5882l2415n8383O6461P934J2455p3702
20411A95487K0870N5931j26559o3114P6312l7077q651q1379o0238N9367k4375
$$ plain form
20488 1865101 1710288 1698553 1608936 1504220 1410221 1353527 1276168 1213569 1097231 1136273 1060382
20477 1060382 1022565 1041708 987585 970954 974735 976244 1086078 1022904 963611 983507 875621
20466 875621 789160 725190 561831 420335 410070 568954 617837 639175 701848 630264 507862
20455 507862 421885 462423 393385 441970 458318 290166 271936 386622 579862 692714 678452
20444 678452 647803 530640 403447 353169 234561 147553 309782 410002 453742 404799
20434 404799 437082 465116 379058 287764 316040 248835 175897 216516 279212 319051 256777
20423 256777 227720 262996 263757 175528 247255 273137 240722 182339 248800 256734 269189 195487
20411 195487 216357 272288 145729 82615 158927 121850 113199 31820 -28418 30949 6574
20400F574J1165L2149l1839O1696N2161L5271m7501j0066k0323k1861Q1312O1598
20388B10336Q5039n2233q7442L813k1059P722l5258K3516J8889J34733J24854
20377D12910k631j91291o2812K21235J86720o514j32644r3025L457J09742J5017
20366D60164j51555o127J87172J07599m9850o127p4109r5399q3052m9987n4174
20355A84555q081k0449J6418M9276q2900p8784N8595n2445m6724n9692J46478
20344A06247J42605n7352j08508o1001l8289M754M466L4815p8758K2030J52886
20333A23895r701j52183q2544m440K3968J34562J24491j7082p4050l3402j26415
20322i2901m0206R2830J82088N634j03778p4675N7101M0303k7918o7666j987M8068
$$ plain form
20400 6574 17739 49888 18049 79745 131906 167177 119676 109610 89287 67426 148738 210336
20388 210336 295375 243142 155700 159513 138454 146176 110918 134434 153323 288056 412910
20377 412910 410279 218988 156176 377411 564131 557617 424973 331948 335405 445147 460164
20366 460164 308609 302482 489654 597253 547403 541276 467167 371768 288716 238729 184555
20355 184555 176474 156025 172443 221719 138819 60035 118630 66185 19461 -40231 106247
20344 106247 248852 191500 82992 21991 -16298 -11544 -7078 27737 -51021 -28991 123895
20333 123895 114194 -37989 -120533 -124973 -101005 33557 158048 140966 66916 33514 -92901
20322 -92901 -133107 -40277 141811 147445 43667 -31008 26093 66396 38478 -29188 -31175 16893
20310A6893j7919J3240L2110o4427J6904J119M7663K3343N9996J6480J4892k372
20298A57922l2483l5049N3922q9224J03890J85772l9286j4236M4089n5762r2836
20287A86719m2957O8688K9270r4213j04002r4924r6788o9828R9888J56164J0748
20276D8765o1862j01762j1034L3453Q7294N3878j2254l5849M3571o6004m5121
20265f6925L1345K5216J03718k5795R0496k3421j181k8140k5437N1387P5589M2185
20253B49037j0982m7707j05813k6869Q0671m7m9118m8621O8720Q8114o804J7254
20241B07835o1477r1812j8868L7502q3185J4361M6616o8553m8000K0286L5728
20230i567O7172m3562j13013R8260J23669m7897o0897n912N5664M1116q1109j0996
$$ plain form
20310 16893 -1026 12214 44324 -20103 -3199 -2080 45583 68926 128922 145402 160294 157922
20298 157922 125439 90390 144312 55088 158978 344750 305464 291228 335317 279555 186719
20287 186719 143762 212450 241720 147507 43505 -51419 -148207 -218035 -118147 38017 48765
20276 48765 -13097 -114859 -125893 -92440 -5146 48732 36478 629 44200 -21804 -66925
20265 -66925 -35580 -10364 93354 67559 158055 134634 133453 105313 79876 131263 206852 249037
20253 249037 238055 190348 84535 57666 138337 138290 89172 40551 109271 197385 190581 207835
20241 207835 146358 54546 35678 73180 -10005 4356 50972 -17581 -65581 -45295 -9567
20230 -9567 57605 14043 -98970 -710 122959 75062 14165 8253 63917 105033 23924 12928
20218A2928M8080o973r3137j32938n5167O0167R9376L7050p7668R5941m2775k5947
20206h1063q0220N183J79800R1469J2199j17754j7007J18839M9566l1698k5209
20195A04105M6766Q0030M2762Q1093M9818j16882k9393p0300M9434n5284j07482
20184G4667J656k8405k0589l0006j233N1789r1004M8041Q0159j24744j57556J1820
20172a85405Q9964J64584j05522O382M8742K6009K5145L2690l0746j33084p3774
20161a35015J04395k5320p448N736r3132k4600l8810l0418q7556J5371M9931J57947
20149a08919J04738k591q9439n1496L2416N6634J15447p2050j40537K1381k2826
20138a57242P4966M5103j35L2548Q6612l0309m4033k4249J55958J03906K136k4932
$$ plain form
20218 12928 61008 54035 -39102 -172040 -227207 -167040 -67664 -30614 -108282 -12341 -55116 -81063
20206 -81063 -161283 -156100 23700 115169 127368 9614 -7393 111446 161012 129314 104105
20195 104105 150871 230901 273663 354756 404574 287692 258299 187999 237433 182149 74667
20184 74667 76323 47918 27329 -2677 -3910 47879 -43125 4916 85075 -39669 -197225 -185405
20172 -185405 -95441 69143 -36379 -29997 18745 44754 69899 102589 71843 -61241 -135015
20161 -135015 -30620 -55940 -63388 -57652 -150784 -175384 -214194 -244612 -332168 -316797 -266866 -108919
20149 -108919 -4181 -6772 -96211 -147707 -115291 -58657 56790 -15260 -155797 -134416 -157242
20138 -157242 -82276 -37173 -37308 -4760 81852 51543 7510 -16739 139219 243125 245261 220329
20126B20329j07509m0848P840J6450k8302N6336m6617O8309N7136m2476O8382
20115B29030R9270O05L077M8980K2857l1016l770l8994M5973j00791m8892P564
20103B33893o9084o3652R7745J87499K1764K8887l2901m8383Q8443J25152J33346
20092G02709J49427K51515K46730K09025L51278K93034J09288n093j90096l87573
20082A730244l88741k01797q0899j35715L0675O4951K01129K72235L80997L14526
20072B187605P5079o8094k01250l50035l93236l37081k76418j67233j50735j4938
20062C03664o8005r2234N4334J5929N1046k1399j4654m337r4287n3100M2503m0561
20050G8899n1973M3989P4022l0141q0014K0770J7816p8900n2551l1777J16865
$$ plain form
20126 220329 112820 71972 79812 96262 67960 124296 77679 145988 203124 160648 229030
20115 229030 328300 328905 331982 380962 403819 372803 369033 330039 376012 275221 226329 233893
20103 233893 164809 101157 198902 386401 408165 437052 404151 355768 444211 569363 702709
20092 702709 852136 1103651 1350381 1559406 1910684 2203718 2313006 2307913 2117817 1730244
20082 1730244 1341503 1139706 1058807 923092 953767 1018718 1219847 1492082 1873079 2187605
20072 2187605 2262684 2194590 1993340 1643305 1250069 912988 636570 469337 318602 303664
20062 303664 235659 143425 197759 213688 264734 243335 228681 224344 130057 76957 119460 78899
20050 78899 26926 70915 144937 114796 34782 55552 73368 -5532 -58083 -89860 27005
20039B7005R0594N3312J26250r7049j76087q6577Q428Q9804o0588j02197J01947
20028b5158J18992M4492K1152P2358q1262J23644O4284j13157k304M4573n7593
20017B10021L1856K52394J89387J31052J64886J26424L88390M15344j54362n71053
20007A184339k81840j62255M3629J55619K25558J55193J22280M06413N60293L81140
19997B790369k24748k5940j90777o49900m74666j61913j72484j08317R492N3655
19987H44771J45957L19650M39749K53827l22417n05941k86223r2853j82714j90527
19977D23279n5303K1161O1977o0504K1674J28036j7690j8276N4812M4299J29036
19966G32501O8876K72511M68291L93730L28562L2545j2695j64171j62653k98425
$$ plain form
20039 27005 117599 170911 297161 200112 24025 -62552 -54124 35680 -24908 -127105 -25158
20028 -25158 93834 138326 159478 231836 150574 274218 338502 225345 223041 267614 210021
20017 210021 241877 494271 683658 814710 979596 1106020 1494410 1909754 1755392 1184339
20007 1184339 902499 740244 783873 939492 1165050 1320243 1442523 1848936 2409229 2790369
19997 2790369 2565621 2539681 2348904 1699004 1224338 1062425 889941 781624 791116 844771
19987 844771 990728 1310378 1750127 2003954 1681537 1175596 889373 796520 613806 423279
19977 423279 367976 389137 451114 390610 412284 540320 522630 504354 559166 603465 732501
19966 732501 801377 1073888 1542179 1935909 2264471 2297016 2284321 2120150 1957497 1659072
19956A659072j94035j62897j7477K01510K81084K99090K07550q378n1700k70538
19946A943281l98566m71043l54767k21639o8399j46656k8625J9186k8842j08398
19936A35532j35586J4481P1531K7674l4697j11042m821J65114k0396j22870M1427
19925B6347R6923P7198J15674j35221o8740K7642q590R14J00383m8090o7941q1878
19913C4621n853M2393L1728O2697L4165j47206j00207k153L7509L1380n2596k3341
19901e6863j7088N6040K1580J6417K897o1140j68560n4905J23870J85466M7361
19890I5075n6347p6301o0117j0768o8043N3252P5401J462K9325O2496P2797n1090
19878F7142M976l9097j8220N4307K7535J9716j29724K918K5146k5022q2552L0104
$$ plain form
19956 1659072 1465037 1302140 1284663 1486173 1767257 2066347 2273897 2265519 2213819 1943281
19946 1943281 1544715 1073672 718905 497266 428867 282211 253586 272772 243930 135532
19936 135532 -54 14427 85958 113632 78935 -32107 -36928 128186 107790 -15080 26347
19925 26347 123270 200468 316142 180921 112181 139823 131233 132147 232530 184440 116499 34621
19913 34621 28768 71161 102889 165586 199751 52545 -47662 -49815 -12306 19074 -33522 -56863
19901 -56863 -73951 -17911 3669 20086 22983 -38157 -206717 -261622 -137752 47714 95075
19890 95075 38728 -37573 -97690 -108458 -176501 -123249 -47848 -46386 -17061 45435 118232 67142
19878 67142 72118 33021 14801 69108 96643 116359 -13365 -10447 14699 -10323 -92875 -62771
19866f2771P6390Q3095l2815J0203R345j2980p5148n216k3546K6987N5068O6597
19854A15209J8215J03623R5094N1653j03988j10690j93949n6386P7445R0547J7319
19843A04092l6150o2083R7529k7707k4900P8486J29809J4159k6875J472j31635
19832A16197o2421j7177J27849L7723k9350K8705m1265n5581p7647q0146r1676
19821a44789n6276J63905O7444J00219K3806j00000j9153M6272J18812k3477j27465
19810D9298j5997k4606o5461n547J06597j9800N7502o1639l1232l4135Q0054R7983
19798A33017l1718j37702q6635L0588R4904J40927N5714J545o0060J7974m6264
19787A12290p4759P1047J08374J242N4626J25016p8135r4072M4262k798j17448
$$ plain form
19866 -62771 13619 96714 63899 74102 83447 70467 -4681 -9897 -33443 -6456 48612 115209
19854 115209 133424 237047 332141 383794 279806 169116 -24833 -81219 -3774 86773 104092
19843 104092 67942 5859 103388 75681 50781 129267 259076 273235 246360 247832 116197
19832 116197 53776 36599 164448 202171 172821 201526 160261 104680 27033 -53113 -144789
19821 -144789 -201065 -37160 30284 130503 154309 54309 35156 81428 200240 176763 49298
19810 49298 33301 8695 -56766 -62313 44284 24484 81986 20347 -10885 -45020 35034 133017
19798 133017 101299 -36403 -123038 -92450 2454 143381 199095 200640 140580 158554 112290
19787 112290 37531 108578 216952 218194 272820 397836 319701 225629 269891 267093 149645
19776A49645j33782j1198r9068J13812K4517j31623l1912J08287L6111O1371j0642
19765G5518p9654M0144J8347n4501O0762J20035l7974N4810n2011o4000j62456
19754h0980r6598J61332O2427O2308j9195K9557l5298l7784m3707Q1143K8198
19743A11403Q5837o8976K8037P3526L1595m9848r3615k1311j3914J61899L5559
19732B80192m3402p2027o0241M5611Q0148K8531k7624P6944K9484n2219l7173
19721B48224J25773J2496P3818J37878k0753k07825r9451j04956P3381Q1932r030
19710C11487n7813J8934M4075J01996Q3652r9891r6243J19941L0331J9408J3841
19699D89718k215j1029j25965j7660K2728o4352k1511K1538j02447j24605R2332
$$ plain form
19776 149645 15863 4665 -94403 19409 43926 -87697 -119609 -11322 24789 86160 75518
19765 75518 -4136 36008 54355 -146 60616 180651 142677 197487 145476 81476 -80980
19754 -80980 -177578 -16246 46181 108489 89294 118851 83553 45769 2062 83205 111403
19743 111403 197240 128264 156301 229827 261422 211574 117959 96648 82734 244633 280192
19732 280192 236790 164763 104522 150133 230281 258812 231188 308132 337616 285397 248224
19721 248224 373997 386493 460311 598189 577436 369611 270160 165204 238585 320517 311487
19710 311487 253674 272608 316683 418679 502331 402440 306197 426138 456469 475877 489718
19699 489718 487503 476474 350509 332849 355577 291225 269714 291252 188805 64200 156532
19688A56532J51447P4776J0106j3988L0396r3610l9541n0485J15893j17433l2131
19677A91962M4990J01063l1723j14369l2731N5335P5102k3616q146n4605n7448
19666A45814J5299q8921M0231J51693j698j30696r493k9309R3447J8288o8802
19655A35853J2325N3850R8822Q4079o6214j40041l1582q5955L2723J0231J5748
19644A19839Q0171M9174q5632k25197n0327J15061J58993J076q4206P739R895
19633I6586j01324m1514N3905O0805l7226l2982L7335M2409J02545J24667n8464
19622B46742q527j6628p9486r6312N774K40201M1631O6700q160r2238M8919K0118
19610C68734J4528L5202K0000n8130m2971o40L2799l2192N0528P5473J24189J17644
$$ plain form
19688 156532 307979 382755 392861 378873 409269 315659 276118 225633 341526 224093 191962
19677 191962 236952 338015 306292 191923 159192 214527 289629 266013 257867 203262 145814
19666 145814 161113 72192 112423 264116 262418 131722 122229 92920 186367 204655 135853
19655 135853 148178 202028 300850 384929 318715 178674 147092 61137 93860 104091 119839
19644 119839 200010 249184 163552 -61645 -111972 3089 162082 163158 78952 86691 96586
19633 96586 -4738 -46252 7653 68458 31232 -1750 35585 77994 180539 305206 246742
19622 246742 238215 221587 142101 45789 51563 291764 333395 400095 391935 299697 348616 368734
19610 368734 383262 418464 438464 380334 337363 336723 369522 337330 387858 463331 587520 705164
19598G05164j9128j01281m5455P8934L1422L4396k1973o0736l8368l8570O0215
19587E84620J77211J71852m5861r2978N975L0881l3206p0636j08858M5187n9123
19576F05064P221J29690J5187m5708N7548m9527k3672L2468k9031k3399r7721
19565E78120j12077M4111K66223K07470l6333o2234j42864j82692j25771O0498
19555D94451k0872J06528N1650k0111J7461m850r5672j28546M5217J20276P5204
19544F40736N5033M9670n3517O3377k6925r2301P8263m9592K0138k6282P4161
19533G32761R6156k3948N4917K9779M5770J20464Q6019j36946m6502R5636M4114
19522A098220L9127L6729n5964j35232M2578J68730J86412J19897Q6257J70445
$$ plain form
19598 705164 686036 584755 539300 618234 649656 684052 662079 601343 562975 524405 584620
19587 584620 761831 933683 887822 794844 800819 831700 798494 727858 619000 664187 605064
19576 605064 612285 741975 757162 711454 769002 719475 695803 728271 699240 675841 578120
19565 578120 466043 510154 776377 983847 947514 885280 742416 559724 433953 494451
19555 494451 473579 580107 631757 611646 629107 624257 528585 400039 445256 565532 640736
19544 640736 695769 745439 691922 755299 728374 636073 714336 664744 684882 658600 732761
19533 732761 828917 804969 859886 889665 935435 1055899 1141918 1004972 958470 1054106 1098220
19522 1098220 1137347 1174076 1118112 982880 1025458 1194188 1380600 1500497 1586754 1757199
19512A757199J21060O6165J47510j1334Q2425K35840K05299J8369O2562P1481
19502B756576J09076J74202J74394J95866M45403L18172J98404K92862K55707
19493D920662M01115M97986N91400O34551O50163Q85137R32588J175405J117740
19484A1806747J333931J792334K197032K609713K475780J518690J142485J608556
19476B6485268K313889L240254L903503M043665N025926O902590R617172J3691049
19468G5223316J9628498L1481026M6709249M4979840N7336428Q1921641j7993592
19461C39286406j03526213p0727488l1200741r558297N524138K1710949M3152719
19454A94661473N6189035O5161630J09135803Q1563130m2861993j9725839k7582344
$$ plain form
19512 1757199 1878259 1944424 2091934 2080600 2163025 2398865 2604164 2622533 2685095 2756576
19502 2756576 2865652 3039854 3214248 3410114 3855517 4173689 4372093 4664955 4920662
19493 4920662 5321777 5819763 6411163 7045714 7695877 8581014 9513602 10689007 11806747
19484 11806747 13140678 14933012 17130044 19739757 22215537 23734227 24876712 26485268
19476 26485268 28799157 32039411 35942914 39986579 45012505 51915095 61532267 75223316
19468 75223316 94851814 126332840 173042089 218021929 275358357 357279998 339286406
19461 339286406 235760193 165032705 133831964 124273667 129797805 151508754 194661473
19454 194661473 250850508 316012138 425147941 506711071 463849078 444123239 416540895
19447D16540895j21922096j03026891n4057266k5310642q346821O361678K3863585
19440A34102442L8232347L7043778N6141517O2879576n4906537j05377226o5967436
19433A02148461l4297572j9473541j2094413q347246n874288l882811k641017
19426A5537573j814656r95185n19405o40323m07869m71802o42307j202849j678674
19417G164503j130781q77858p17499o30201l91227j55906k27242k86983k09233
19408B537573j13361k3999o8708j64894r7761q0683o2694o6782j89323j15684
19398A553684j35389J7024J24531j8091j92766j78197Q0768j25056p2517o361
19388A047630J7644j02427l9178R4965K3727m2716j35896n8434p038J1082K8987
$$ plain form
19447 416540895 294618799 191591908 137534642 112224000 103877179 110238857 134102442
19440 134102442 172334789 209378567 265520084 328399660 273493123 168115897 102148461
19433 102148461 67850889 48377348 36282935 27935689 22061401 18178590 15537573
19426 15537573 13722917 12727732 12208327 11568004 11160135 10688333 10046026 8843177 7164503
19417 7164503 6033722 5155864 4438365 3808164 3416937 3261031 3033789 2746806 2537573
19408 2537573 2424212 2400213 2331505 2166611 2068850 1988167 1925473 1858691 1669368 1553684
19398 1553684 1418295 1435319 1559850 1541759 1348993 1170796 1251564 1126508 1053991 1047630
19388 1047630 1065274 962847 923669 1018634 1042361 999645 863749 805315 798277 809359 838346
19377H38346Q210p1939k3635o1126n04K0944j06594o323n0065N2526M4740p4857
19365E69723K3594j6210q7583p9849j61853m6460L8213q6583J7775P3306L6087
19354B80160R7235P0656L636m5039j24174n6230J5648M140k2237L6618L0013o2848
19342B27578j29886J9315N1646o9211J55316J88340N5849r3756j12913j74334
19332A17944m8318l5762j5030r1073Q043J37717K04957J39728P8714j39465j75052
19321A82403J45900j07183k87133p0382J236O5364l3723J29718j067J07393J21816
19310B54342J7223o5285j87466j94304J05364R2581p4422j8462P394p4320o2983
19299b00338R6176P606J5689M4120j0996m0249o0682o5949Q48r384R9854J1904
$$ plain form
19377 838346 846556 774617 750982 689856 689352 710296 603702 597379 547314 599840 644580 569723
19365 569723 593317 577107 489524 409675 247822 201362 239575 152992 170767 244073 280160
19354 280160 377395 448051 451687 406648 282474 226244 241892 246032 223795 260413 290426 227578
19342 227578 97692 117007 168653 99442 254758 443098 498947 405191 292278 117944
19332 117944 69626 33864 18834 -72239 -64196 73521 278478 418206 496920 357455 182403
19321 182403 328303 221120 -66013 -136395 -135159 -69795 -103518 26200 25133 132526 254342
19310 254342 271565 206280 18814 -175490 -70126 22455 -51967 -70429 -63035 -137355 -200338
19299 -200338 -104162 -96556 -80867 -36747 -47743 -87992 -148674 -214623 -213775 -223159 -123305 -111401
19287a11401l9491J25528J82422K0128j03259n9999M7101J25552Q5220J5703n7427
19276B30077P590N6449O6393k0157m8335k80450j60372q032J34209N2880n5970
19265b5718M3421O8293J0113N8184L1725o9698P5253R8866j07463n3131O0095
19254A89940L9359K2116j61058j09027j6831k965r141K16330q9360j13528K0871
19243a3294r1570N3595n5261Q525o3132M0590J17708l5406j42909O8153j904Q3835
19231c1070J27360J29989l5187J71957J63565j00624j42469r0174o3667j42233
19221a2553l203K11903J34846N9479J4928l7161k6445p995j5043k0458j73709
19210A24589q9732L6561k8541Q6389K9100n8920L6124J86395l1133j30703j15286
$$ plain form
19287 -111401 -150892 -25364 157058 177186 73927 13928 61029 186581 271801 287504 230077
19276 230077 237667 294116 360509 340352 292017 11567 -148805 -156837 -22628 30252 -25718
19265 -25718 17703 85996 96109 154293 186018 116320 191573 290439 182976 129845 189940
19254 189940 229299 251415 90357 -18670 -35501 -38466 -47607 168723 79363 -34165 -13294
19243 -13294 -104864 -51269 -106530 -98005 -161137 -120547 -2839 -38245 -181154 -113001 -114905 -31070
19231 -31070 96290 226279 191092 363049 526614 425990 283521 193347 129680 -12553
19221 -12553 -15756 196147 330993 390472 405400 368239 341794 333799 318756 298298 124589
19210 124589 34857 71418 42877 129266 158366 99446 135570 321965 290832 160129 44843
19199D4843l9891P1315k2421M5054j41891o6625k8127M4663R7010M2105R0P1681
19187A17806p6581j5751k7429O8838j1308p6335p713n1232m2838L1268O2045N9709
19175C0479O0384P6993k2533k36366j94435J436N6580L6800k7579J37935O424
19164g3882N0357P0123j61671r2532Q3068N7006o5795K5312J71190N7514j58315
19153c7625o6463k3514J4368k9305Q008J36814J81645P6051k7863o1265L1168
19142B02019j8452o0607N5100n654n6755M1307M1288p4984m8414p9674J6173R7486
19130A08833m8142Q453l8591n2145M4033J6242r479r6408m7706j7296M4835J9728
19118f7643J9688n7742m1603l539J34121J19081m3238n949j12520M2753N7901
$$ plain form
19199 44843 4952 76267 53846 98900 -42991 -109616 -137743 -93080 3930 46035 46125 117806
19187 117806 41225 25474 -1955 66883 55575 -20760 -28473 -79705 -122543 -91275 -29230 30479
19175 30479 90863 167856 145323 -91043 -285478 -284042 -227462 -190662 -218241 -80306 -73882
19164 -73882 -23525 46598 -115073 -207605 -124537 -67531 -133326 -108014 63176 120690 -37625
19153 -37625 -104088 -127602 -113234 -142539 -134531 2283 183928 259979 232116 170851 202019
19142 202019 183567 122960 178060 172406 115651 156958 198246 123262 74848 -4826 11347 108833
19130 108833 60691 69144 30553 -21592 22441 38683 29204 -67204 -114910 -132206 -87371 -67643
19118 -67643 -47955 -105697 -147300 -150839 -16718 102363 59125 53176 -59344 -16591 41310
19107D1310r608j76083k2349J34727P0653J47328L0473q5314J6298M3552j13304
19096G7683l0404J32081Q0030r2479j95567p2848P8332q1051L0312J39340J5748
19085H1177n6778j12731q4231k1428L5019M2746m7762M3813J3445l7070m0198
19074a83998n5456P8787j7469J5831J09395J20868m0874j57560k9866R0097P4837
19063D592N665j1557L255o7386o3360J0489L3074p4130m048K0124J10175M2541
19051I434L4564l4143l4600K8288O2221q0146q2732l0603l4170q9992n3727J17438
19039a88168O7411q947j5399J9772j13666k4655k6779K2405K1023J19719K7491
19028i9793j5186q1472L2405M0164L5742K1375p5047n5805O574l1367J6192M637
$$ plain form
19107 41310 31702 -144381 -166730 -32003 38650 185978 216451 131137 147435 190987 77683
19096 77683 47279 179360 259390 166911 -28656 -101504 -23172 -104223 -73911 65429 81177
19085 81177 24399 -88332 -172563 -193991 -158972 -116226 -163988 -120175 -106730 -143800 -183998
19074 -183998 -239454 -160667 -178136 -162305 -52910 67958 27084 -130476 -160342 -70245 4592
19063 4592 10257 -1300 1955 -65431 -128791 -118302 -85228 -159358 -163406 -143282 -33107 9434
19051 9434 43998 9855 -24745 3543 65764 -14382 -97114 -127717 -161887 -251879 -305606 -188168
19039 -188168 -120757 -129704 -145103 -125331 -238997 -263652 -290431 -268026 -247003 -127284 -99793
19028 -99793 -114979 -196451 -164046 -123882 -88140 -66765 -141812 -197617 -191043 -222410 -206218 -201581
19016b01581K1013J2439K0817K3811m1108J24159O0189Q1343Q1667m0040m265
19005A38444k02906m1107Q7288K1848k9651q3516J3814L6211k6093K9880J21120
18994F5332n6592m1002r5197j37989J11307K9196r3935O4432R598Q1048J85291
18983A21489n0296m4486l6080j57796J00699R5889r230n849j4137K197k7660L7258
18971A1998r24M3955l0822J4827j02543J3107Q0425K3924L9568r6497q5938L4538
18959e4382n5869o5095Q2439K3045J2379N4675R23j07590q8839N8595k842j02243
18947b44804n0961J07934M397J7454M5660J82345Q5327L3283k8098j31331r4771
18936g3565K4527k6152j04852J01962O4398j5690N9281J5757N8623K3785M7757
$$ plain form
19016 -201581 -180568 -168129 -147312 -123501 -164609 -40450 19739 101082 182749 142709 138444
19005 138444 -64462 -105569 -18281 3567 -26084 -109600 -95786 -59575 -85668 -55788 65332
18994 65332 8740 -32262 -127459 -265448 -154141 -124945 -218880 -154448 -144850 -63802 121489
18983 121489 71193 26707 -9373 -167169 -66470 29419 20189 14340 203 2400 -25260 11998
18971 11998 11074 55029 24207 39034 -63509 -50402 30023 53947 93515 -2982 -88920 -54382
18959 -54382 -110251 -175346 -92907 -69862 -57483 -2808 -1885 -109475 -198314 -139719 -142561 -244804
18947 -244804 -295765 -187831 -183434 -165980 -120320 62025 147352 180635 152537 21206 -73565
18936 -73565 -49038 -75190 -180042 -78080 -13682 -29372 29909 45666 104289 128074 175831
18925A75831l0239n2255L494N0991J282j22781L5475J05468J40970P7683N7157
18914D43076Q9460J85363K52252K01311L96404J35978l73782m71485k01111j38490
18904E18976j0518R8062J87916M32596L21945L47534N46023Q9454j34791M9609
18894B446806n16653o69479k85706j53053j10994k3783N1119K44139K27175K53459
18884A463030M11341K5534o14909n03151l26873j93748m8910p6250j0367o7306
18874E8391Jl039p5570r010N8917O7797J5651Q7158j20201o2214j7313p3052q1500
18861a53984o1986k1458p6216j2198J11236K2554J3581j0742k5371l6318j1956
18850b62858J37135J25651o8134q8026n6342J18041J16674J163r8795l2827n6875
$$ plain form
18925 175831 145592 93337 96831 147822 149104 26323 61798 167266 308236 385919 443076
18914 443076 532536 717899 970151 1171462 1567866 1703844 1330062 858577 657466 518976
18904 518976 508458 606520 794436 1227032 1548977 1896511 2442534 2531988 2397197 2446806
18894 2446806 1930153 1260674 974968 821915 710921 687138 738257 982396 1209571 1463030
18884 1463030 1874371 1899905 1284996 781845 454972 261224 212314 136064 125697 58391
18874 58391 58392 55353 -20217 -29227 29690 97487 113138 200296 80095 17881 568 -72484 -153984
18861 -153984 -215970 -237428 -313644 -325842 -214606 -192052 -178471 -189213 -214584 -250902 -262858
18850 -262858 -125723 -72 -68206 -156232 -212574 -94533 22141 23304 -75491 -108318 -165193
18839a65193M489P1426o153M5074P1917p7578j00749P4094R2907o6372j42978
18828a99116p4853N5008M0304N4477J27771N4431L8469k0997j16970r0821o1201
18817a93498n062N0828J46989l919j9075K2669j20103J3026J35424L9623k1303
18806D5599j68460j03098n2806J04183l4394m4851R4348L2379r7495o4316N4448
18795b34463J04570P7452P0120P9479j12028P1860k3046j35071j56471Q8152N3467
18784a15979j0053J0080L5811n6076l6399J14202L9659n3925J6029j26606m4671
18773b27928L7704M8604J02491L7788l2444J33893P5051k6713R4101J29757J34417
18762E06721M09126J46805l79957l48266k28084n0426J9010K0115N3706o6107
$$ plain form
18839 -165193 -160704 -89278 -95431 -50357 21560 -56018 -156767 -82673 10234 -56138 -199116
18828 -199116 -273969 -218961 -178657 -124180 3591 58022 96491 75494 -41476 -132297 -193498
18817 -193498 -198560 -147732 -743 -4662 -23737 -1068 -121171 -108145 27279 66902 45599
18806 45599 -122861 -225959 -278765 -174582 -208976 -253827 -159479 -127100 -224595 -288911 -234463
18795 -234463 -129893 -52441 17679 97158 -14870 56990 33944 -101127 -257598 -169446 -115979
18784 -115979 -126032 -115952 -80141 -136217 -172616 -58414 -18755 -72680 -56651 -183257 -227928
18773 -227928 -190224 -141620 -39129 -1341 -33785 100108 175159 148446 242547 372304 506721
18762 506721 915847 1062652 682695 334429 106345 55919 74929 95044 148750 82643
18752H2643r1437R0860q2840p9511K1855m3356J0116l9405j9264P8698k5681o6197
18740a63519J4208J15982J13951k5838q5212j1294J6714q0110J9293P4317J7921
18729F413K15668o2038o0668J4666j36152j05620l2184P8306K3299n0093J7785
18718i0618k3630k2886M9753O6000J27695p9442n5606j1125R0914r8153j11930
18707a59028k5458P505k055Q020K4958O0912j2537M6449Q3518J0703n331j27801
18695i0145K7061O8175k3457j9493k2700N9761J8788P1241j72559j05134k2924
18684b11386P108K7124L4528l0860J11577m1298M603O4137J4500p6472K477L3437
18672f0525k5237P6387L1398m2445o6569k3637L7673l000m3287J6624o9084l2965
$$ plain form
18752 82643 -8794 82066 -774 -80285 -58430 -101786 -91670 -131075 -150339 -71641 -97322 -163519
18740 -163519 -149311 -33329 80622 54784 -30428 -41722 -25008 -105118 -85825 -11508 6413
18729 6413 222081 160043 99375 114041 -22111 -127731 -159915 -81609 -58310 -108403 -90618
18718 -90618 -114248 -137134 -87381 -21381 106314 26872 -28734 -39859 51055 -47098 -159028
18707 -159028 -184486 -176981 -179036 -171016 -146058 -85146 -97683 -51234 32284 42987 37656 -90145
18695 -90145 -63084 5091 -18366 -37859 -60559 -798 17990 89231 -83328 -188462 -211386
18684 -211386 -204278 -177154 -142626 -173486 -61909 -103207 -98604 -34467 -19967 -96439 -93962 -60525
18672 -60525 -85762 -9375 22023 -20422 -86991 -110628 -72955 -75955 -119242 -102618 -171702 -204667
18660b04667m3454O0801N4021j4827Q0158O5421p2423M5093K2376J6173O6676
18649G5348L4157L3185K3245N212r4751m5979N443K5882p2001k8287o59N0837
18637A1632K711J0419J6179q2516O7129M9900K2756k0836J0657j6311p9165M5949
18625C8504M3922n9817n7459n322k846j43003m4184Q1560n1180m6739J22675j17957
18613b41846p6722J00244Q2659o6007l6593J55556Q7045N0843J8446K514j01135
18602b4996j44749l9139P5331O192k3055N7921R4964K1169J5842O414J0900J3563
18590G0357j3840q8878q2253L1166J4776p4090r0185j7246o3089N0410J21688
18579a41184O5113J6443M0176K5587Q52R3695o9982k15518k0030L6999p8O1848
$$ plain form
18660 -204667 -248121 -187320 -133299 -148126 -67968 -2547 -74970 -29877 -7501 8672 75348
18649 75348 109505 142690 165935 171147 76396 30417 35860 61742 -10259 -38546 -39205 11632
18637 11632 14343 24762 40941 -41575 25554 75454 98210 77374 88031 71720 -7445 38504
18625 38504 82426 22609 -34850 -40172 -43018 -186021 -230205 -148645 -199825 -246564 -123889 -241846
18613 -241846 -318568 -218324 -135665 -201672 -238265 -82709 4336 55179 73625 76139 -24996
18602 -24996 -169745 -208884 -133553 -127361 -150416 -92495 2469 23638 39480 45894 56794 70357
18590 70357 56517 -32361 -114614 -83448 -68672 -142762 -232947 -250193 -313282 -262872 -141184
18579 -141184 -76071 -59628 -19452 6135 6987 100682 30700 -184818 -204848 -167849 -167927 -106079
18567a06079O8280K5103P9191R2879J01443p9981j00857n0097M8480P1250j9345
18556A30267q5315K3202R0737n1935r120M288p0567o8299L1690J11921l4794p7424
18544e349j37731L2635N5580j3130p112R3522n096j33113j21673J24924K4095
18533i2448k7481r348j7252R8564o2773o5103M3636r4210J670K32676J8306k0288
18521E949J25798j3267q6596j4877k3980n9212L5262Q2266J6712K6064j36293
18510d2174r1466j7447L4119m0177p669l3447N212K8304J94581N7064l6367r620
18498D0913L8665j6510j09628j7027m4058J16729J901j15944K9046J26244K4157
18487G4488J5866j95604L6385j3422O38J70J6303p7798j02355m3704J6207P1294
$$ plain form
18567 -106079 -37799 -12696 66495 159374 260817 180836 79979 29882 78362 149612 130267
18556 130267 44952 68154 158891 106956 97836 102124 31557 -36742 -5052 106869 72075 -5349
18544 -5349 -143080 -110445 -54865 -67995 -75107 18415 13319 -119794 -241467 -116543 -92448
18533 -92448 -119929 -129277 -146529 -47965 -110738 -175841 -132205 -226415 -224745 7931 26237 5949
18521 5949 131747 118480 31884 17007 -6973 -66185 -30923 51343 68055 94119 -42174
18510 -42174 -133640 -151087 -116968 -157145 -164814 -198261 -193049 -164745 29836 86900 50533 40913
18498 40913 79578 63068 -46560 -63587 -107645 9084 10985 -104959 -75913 50331 74488
18487 74488 90354 -105250 -68865 -82287 -81649 -81479 -65176 -142974 -245329 -289033 -272826 -201532
18475b01532J39677K2555p0320K0222J23277m6151m9749k1895j0455k3356o5812
18464a83539M742L6363J20264J61271n6872p9541M7905M7056M773m6096L5286
18453I1612l8015j92278p236K06341R4388n0069n7900K5909O002j08355L004R951
18441a6646L3720R6695J0862l4768J2151n9831l566l8692j06293L0146o9429j3946
18429a59597k6146O5839N8098R052l960Q5041n6671j8509l1056o262N0104j07331
18417a41398n3110L9011k1955r5615L3499R2505k0280m9367P3077R312P5505Q0992
18405B2176l6154k0494l5303N970J81863N4873l7687j6702Q000J18418R404j24983
18393A29381o8196n8214j82205k5185K06983R7363O7235L0924j2605q8367R789
$$ plain form
18475 -201532 -61855 -39300 -109620 -89398 33879 -12272 -62021 -83916 -94371 -117727 -183539
18464 -183539 -178797 -142434 -22170 139101 82229 2688 50593 97649 102422 56326 91612
18453 91612 53597 -138681 -145917 60424 154812 104743 46843 72752 78754 -29601 -26597 -16646
18441 -16646 17074 113769 124631 89863 102014 42183 38617 -75 -106368 -76222 -145651 -159597
18429 -159597 -185743 -119904 -61806 -52754 -56714 28327 -28344 -46853 -77909 -84171 -34067 -141398
18417 -141398 -194508 -155497 -177452 -273067 -239568 -147063 -167343 -216710 -143633 -134321 -58816 22176
18405 22176 -13978 -34472 -69775 -63805 118058 172931 135244 118542 126542 244960 254364 129381
18393 129381 61185 2971 -179234 -204419 2564 99927 167162 198086 185481 97114 106903
18382A06903l2208j15383l0860l9527K1267J55494J01070P9221j7940K2439j28813
18371A21663k8848K2788p8097L404M4230J13123K4717j5125m9165Q236n6251k43757
18359a33082j35485J15353L8652M4397J35213J08886L510L6037J6469K1179o5680
18348A85449m2531o8440j05140J7410N735K2449o5875N8123R4177q7442p3463
18337e9548l6601R3534p417j11242k495Q9766m100J333M8222k4232J7795l798
18325A217n4215M2955O4407m4716K6110K3583Q2522K5728N1749K3836p3286n5023
18313A14867l4074R037q9745k0807P2432n8463J7680N3953j3752q587j5640j12418
18301h5517q3930J39724N0750k8763M1562k4012o9206j05360R506J9743l3914
$$ plain form
18382 106903 74695 -40688 -71548 -111075 -89808 65686 166756 245977 228037 250476 121663
18371 121663 92815 115603 37506 40910 85140 198263 222980 207855 158690 166926 110675 -133082
18359 -133082 -268567 -153214 -114562 -70165 65048 173934 177444 213481 229950 251129 185449
18348 185449 142918 74478 -30662 -13252 -7517 14932 -50943 7180 101357 13915 -59548
18337 -59548 -96149 -2615 -10032 -121274 -123769 -34003 -38103 -36770 11452 -12780 5015 1217
18325 1217 -52998 -10043 54364 9648 35758 59341 141863 167591 219340 243176 169890 114867
18313 114867 80793 89830 85 -20722 51710 -6753 10927 64880 51128 42541 26901 -85517
18301 -85517 -169447 -29723 21027 -7736 33826 9814 -59392 -164752 -155246 -135503 -169417
18290a69417k2891J10323l5L2431J0690j38226Q3496O4732j8133j9132L5134N5830
18278B4802k1671p8155m1875N9295J08915P7702m7706k0332K7866k0499N225L4625
18266A08192n3094m6709l2225J0353Q6349L7300p8548j81J45222M9257j34451
18255I1465n232N3897m8858q5678o3567j6516L2676q2378n3639K4437n4310L3470
18243a74233J10318J09258N0341Q599q6672j2013n7158N6938N2536l90O3717k0732
18231A00509p5779k9460j8893Q4767Q6046l9623p8953N0947P8088m151j02947
18220E0551l3227m880J17400J20962j9144J8055p5460j48890l5297N2622J46967
18209A89659L2876q3462k9536k6676n782n6441J63590l9515m4693P1081l3725
$$ plain form
18290 -169417 -192308 -81985 -82020 -49589 -38899 -177125 -93629 -28897 -47030 -66162 -31028 24802
18278 24802 3131 -75024 -116899 -57604 51311 129013 81307 60975 88841 68342 73567 108192
18266 108192 55098 8389 -23836 -13483 72866 110166 31618 31437 176659 225916 91465
18255 91465 86233 140130 91272 5594 -57973 -74489 -41813 -124191 -177830 -153393 -207703 -174233
18243 -174233 -63915 45343 95684 104283 17611 5598 -51560 5378 57914 57524 121241 100509
18231 100509 24730 -4730 -23623 61144 147190 107567 28614 79561 157649 153498 50551
18220 50551 17324 12444 129844 250806 231662 249717 174257 25367 -9930 42692 189659
18209 189659 222535 139073 109537 82861 77079 20638 184228 144713 100020 171101 137376
18198A37376o8586J9129R1166J00302q6976j01059j23533k2922j12391J78402
18188A0908Q1407N5591M5604l2610r767J1947j0005P9224L2268m8689L7375m6747
18176B06506p6019r0824J4497k8364j8614J25048Q2256p1248K5476J4358p0787
18165A12285O7309N1502J04826K3458N3378P510J21373J09437J9177k03049j78362
18154B88844J01799J4695O4735K3771N1480r8090J18142P3619J70687J39761M0045
18143I89488L8184Q3962q1222k0343P608N7249J62153R076P9655L10018K91271
18132A927099K98475J72516J66224L33731L99687M19466M14400M35188N51752
18123E118538P03975Q05259Q19060P92542P37862R48071J127617J391743J551624
$$ plain form
18198 137376 68790 87919 179085 279387 192411 91352 -32181 -55103 -167494 10908
18188 10908 92315 147906 193510 160900 151133 163080 153075 232299 264567 215878 253253 206506
18176 206506 130487 39663 54160 25796 7182 132230 214486 143238 168714 183072 112285
18165 112285 179594 231096 335922 359380 412758 420268 541641 651078 670255 467206 288844
18154 288844 390643 405338 470073 493844 545324 447234 565376 638995 809682 949443 989488
18143 989488 1027672 1111634 1030412 1010069 1017677 1074926 1237079 1246155 1325810 1635828 1927099
18132 1927099 2225574 2398090 2564314 2898045 3297732 3717198 4131598 4566786 5118538
18123 5118538 5822513 6627772 7446832 8239374 8977236 9925307 11052924 12444667 13996291
18114A3996291J730009K130978L038119M112973N898688R364985J6109392K8163973
18106H4545408L3635275L2313953N6808339L6496564o9331473p7545326m2075980
18099E4846760k0941226j1261918o558328l980659k631211j855412j365093j120156
18091E132757p87142o18353m52832l17522m27089l24704j72459j70407j17787
18082A744462k22711k98497k06098n2630m2068l0346k3972n7481m9978k9266j04495
18071F26920p36l3696j45658k5744L065k852k8285K757m1935M9089j36748M7982
18059C14159O1139L7683O8402J623m9257r1353j7099O9104q1342j03532j18955
18048I0572L7643J8860N4926O5631Q5762j2894j4445Q193n3581r9518m2323L6713
$$ plain form
18114 13996291 15726300 17857278 20895397 25008370 30907058 40272043 56381435 84545408
18106 84545408 118180683 150494636 207302975 243799539 174468066 96922740 54846760
18099 54846760 33905534 22643616 16085288 12104629 9473418 7618006 6252913 5132757
18091 5132757 4345615 3727262 3274430 2956908 2529819 2205115 2032656 1862249 1744462
18082 1744462 1521751 1223254 1017156 964526 922458 892112 868140 810659 760681 731415 626920
18071 626920 626184 592488 446830 421086 424151 421299 393014 395771 353836 402925 266177 314159
18059 314159 375298 412981 481383 483006 433749 342396 325297 394401 313059 209527 90572
18048 90572 128215 147075 202001 267632 353394 340500 326055 334248 280667 181149 138826 175539
18036A75539l1571p918N264Q3735M6323q5519R991n6318j29438m1249k5028k5983
18024h2172J65789J96641J0647j47302j05127r8056r6657o7764J21318L0159k8306
18013a00830j3342M8971N7149O1020J2176p7471N003M5245j6064R0745m7688j13536
18001d8622J9595J38305J42819K6330j49730l6102j146j50829p6231R2716L7033
17990e862m8914p9074o8730J3424Q8854J0214J4683j5503Q5146P0381R5984l4800
17978A25803K369J79681J18026p6893o1780o790L9918r8766j26029j80117N0894
17967c3684k7838O9613K6652n3671o5425p0393M5701k0079l3973J04440K1477
17956c7180N163K4825O4599P6408m4615p3915L8039o3450j9635p6737J09182J04812
$$ plain form
18036 175539 143968 136050 141314 225049 271372 185853 195844 139526 10088 -31161 -56189 -82172
18024 -82172 83617 280258 290905 143603 38476 -59580 -156237 -224001 -102683 -72524 -100830
18013 -100830 -114172 -65201 -8052 52968 65144 -12327 -7324 37921 21857 112602 64914 -48622
18001 -48622 -29027 109278 252097 278427 128697 92595 91449 -59380 -135611 -42895 -5862
17990 -5862 -54776 -133850 -202580 -189156 -100302 -90088 -75405 -90908 -5762 64619 160603 125803
17978 125803 128172 307853 425879 348986 287206 280416 320334 221568 95539 -84578 -33684
17967 -33684 -61522 8091 34743 -18928 -84353 -154746 -109045 -129124 -163097 -58657 -37180
17956 -37180 -32017 -7192 57407 133815 89200 15285 53324 -10126 -29761 -106498 2684 107496
17944A07496p2901k4382R111N6624p696R1144p7807j26475k4728Q6143O5485j10020
17932b8006j01967q7141Q405R8113P0301j54330k2424J29347O5473P4714o1792
17921i307Q7308Q0699j7286n5244Q9377J08203r37o4128j79532j15153l4310n7995
17909a68305n9078Q3078K7422L2146L2897j22376l0105J08753Q6349O5178K2521
17898G8480k17126k3568J9115K3824N6354n2000l2594L0571K8648o1532m2261
17887a92089J4052L5771Q8304J10590k0133k8706l9362J2416l1714j1670L0441
17876c2100j14133j1964J00041k938J7926M5463R8051J9927p642r5915j20108
17865a03392P1420O2276l0758p0284j65117J086Q2051M6435L7506p4322j8634
$$ plain form
17944 107496 34595 10213 19324 75948 68252 159396 81589 -44886 -69614 16529 82014 -28006
17932 -28006 -129973 -217114 -208709 -110596 -40295 -194625 -217049 -87702 -22229 52485 -9307
17921 -9307 78001 158700 141414 86170 175547 283750 282813 218685 39153 -76000 -110310 -168305
17909 -168305 -227383 -144305 -116883 -84737 -51840 -174216 -204321 -95568 -9219 55959 78480
17898 78480 -138646 -162214 -143099 -119275 -62921 -114921 -147515 -116944 -88296 -149828 -192089
17887 -192089 -178037 -142266 -53962 56628 36495 7789 -31573 -19157 -50871 -62541 -32100
17876 -32100 -146233 -158197 -58156 -61094 -43168 2295 100346 120273 112631 16716 -103392
17865 -103392 -31972 30304 -454 -70738 -235855 -234769 -152718 -106283 -68777 -143099 -161733
17854a61733O607K4463L5298m4133n8322j5077O1791J3138l6081J18544j26906
17843a82411L7829J37700P7403q2929j44683k1691J72176J01599j31869p9754
17833a16630j04606N1891R6293P0458l0449n2373n0227o9032L4725J1128J3999
17822a44823j7287j24709K1909K28193J82681j6572m3447r2013k0057J364j35615
17811a60376Q9754J04446n3622j38240r722M6720l580N1311l4770O1768P9797
17800C3486L230Q061l7912j5929j05668n4022Q5384P0173Q5408J81737j43228
17789A10720p0517m3532j64292j4045O7030N8437m6144P596Q8552R7389j90748
17778i9554n8917J24280M9007j49002N9033M6756o9610n7988m8105J4530O3559
$$ plain form
17854 -161733 -155126 -130663 -95365 -139498 -197820 -212897 -151106 -137968 -174049 -55505 -182411
17843 -182411 -144582 -6882 70521 -12408 -157091 -178782 -6606 94993 -36876 -116630
17833 -116630 -221236 -169345 -73052 -2594 -33043 -85416 -135643 -204675 -169950 -158822 -144823
17822 -144823 -162110 -286819 -264910 -36717 145964 129392 85945 -6068 -26125 -24761 -160376
17811 -160376 -70622 33824 -19798 -158038 -167760 -121040 -124620 -73309 -108079 -46311 33486
17800 33486 36716 44777 6865 -9064 -114732 -168754 -83370 -13197 72211 253948 110720
17789 110720 40203 -3329 -167621 -181666 -114636 -56199 -102343 -94747 -6195 91194 -99554
17778 -99554 -158471 -34191 14816 -134186 -75153 -28397 -98007 -155995 -204100 -189570 -126011
17767a26011O1492J76173o5349j29561J5851j238k8827l0112k4771J2014K9628
17756a10711J20862n7194j35867M353L0397k4646J25482J05248P3056k5116p1427
17745C4437l0567m2719o7o209q762k5444j5053N7036L9984J8026M5152k7884j00858
17732f2928j42708L1590K4112O0798P556O5662R9789K7590n5127j3369m767j8212
17720A9986O5260J4202q0922j00253K298R1988p0908j5931P0871P3281l0638Q9034
17708A28268J61409J51j6427o3634k7680K3095l227p0570j12553l9415n6792O8513
17696h862J38610m0370l8809P893j35255m9828j41412r971J05733N6131K9648
17685h6492j5629J6276L4791j1074O5093P8023O6522j3094j16854k06254K6641
$$ plain form
17767 -126011 -64519 111654 46305 -83256 -67405 -68643 -97470 -127582 -152353 -140339 -110711
17756 -110711 10151 -47043 -182910 -178557 -148160 -172806 -47324 57924 130980 105864 34437
17745 34437 3870 -38849 -38916 -45125 -53887 -79331 -94384 -37348 2636 20662 65814 37930 -62928
17732 -62928 -205636 -174046 -149934 -89136 -81580 -15918 83871 111461 56334 42965 38198 19986
17720 19986 85246 99448 18526 -81727 -79429 12559 -58349 -74280 -3409 69872 39234 128268
17708 128268 289677 289828 273401 209767 182087 205182 201955 131385 18832 -20583 -77375 -8862
17696 -8862 129748 89378 50569 58462 -76793 -126621 -268033 -278004 -172271 -116140 -86492
17685 -86492 -102121 -85845 -51054 -62128 2965 80988 147510 134416 17562 -188692 -162051
17674a62051J46208N1856P6165k4314J08487n1836o4490P3825o7797m6302J1540
17663E1291j0043p0464K2046j05444j07035l836J9960J40320L1410N7555j06809
17652h1049n6491l4924J6860P8698J94652K39372j42402j09134q4361j0015K5514
17641C6720O1731M0593L8276L9971k3128n5360m3661l9332J3910M7488l1130j52313
17629f6235j8064J01998J04136j7535p2843M8441q528r208n5280p2404N2912l3480
17617d6090m1549J7629r6495j12795J06913O4400m912n9082k4946O2519K7641
17606a06767l8664n6379q8015O4142j0624l8838J20042L0917J45179N9172n7703
17595B2462o1359J8766n7552J36826l5238m6372q1054M0295N4017r4120l0425
$$ plain form
17674 -162051 -15843 36013 112178 87864 196351 144515 80025 153850 86053 39751 51291
17663 51291 41248 -29216 -7170 -112614 -219649 -223485 -203525 -63205 -31795 25760 -81049
17652 -81049 -137540 -172464 -155604 -76906 117746 357118 214716 105582 21221 11206 36720
17641 36720 98451 139044 177320 217291 194163 138803 95142 55810 69720 117208 86078 -66235
17629 -66235 -84299 17699 121835 104300 31457 79898 71370 62162 6882 -65522 -12610 -46090
17617 -46090 -87639 -70010 -166505 -279300 -172387 -107987 -112899 -171981 -196927 -134408 -106767
17606 -106767 -145431 -201810 -289825 -225683 -236307 -275145 -155103 -124186 20993 80165 22462
17595 22462 -38897 -20131 -77683 59143 23905 -22467 -103521 -63226 -9209 -103329 -133754
17584a33754k8012j115P490J28870O8927R830j6222j8259r2559l9207J12418K4492
17572B2899j1421O388N8079k6039j1904m7698N7540L7753P6490p6051j907O1912
17560A46041j8884k6893M7265M9472N4052L5642r4365j41124j48134j9144O4035
17549e2037n8315Q5262o5023n8583q795k5649Q919J38803J8015J15765N1259q3324
17537F6297k3772Q304J1158m0031p1419n7191j6524P2826J26140r1930j3423k1603
17525e1168N7127J11531k1257p5277J96k0490j3960J5385J03366Q4705J5212K0482
17513B25852j55336j88687q414J23970k8778M0843J13974j86301r2560j12923
17503b68360j1401P4611J10409n8653p1265n689J11359O4717P3518l9295m8556
$$ plain form
17584 -133754 -161766 -162881 -155391 -26521 42406 52236 36014 17755 -74804 -114011 -1593 22899
17572 22899 11478 17866 75945 49906 38002 -9696 47844 85597 162087 86036 84129 146041
17560 146041 127157 100264 147529 197001 251053 286695 192330 51206 -96928 -116072 -52037
17549 -52037 -110352 -25090 -90113 -148696 -157491 -183140 -174221 -35418 -17403 98362 149621 66297
17537 66297 42525 50829 61987 21956 -49463 -106654 -123178 -50352 75788 -16142 -29565 -51168
17525 -51168 5959 117490 96233 20956 21152 662 -13298 2087 105453 190158 205370 225852
17513 225852 70516 -118171 -126585 -2615 -31393 9450 123424 -62877 -155437 -268360
17503 -268360 -279761 -205150 -94741 -153394 -224659 -230348 -118989 -54272 19246 -20049 -68605
17492f8605Q850o5599k8798n2029J03651J34155J4827L8313k5355j14538l0977
17481h6105J821R5867J9714k1547o1677J4794j29298O9739M6646j09863m946J99027
17469C4172K9584j3590J6978q438o9843n7933J02752R7235n0755j25426M8108
17458B844J22597m3240k6904n3548m22O4637j17733O168j2814O730J01065n8346
17446h966l6112J36327P5961M0556L6907J75821J90062J26741J47648L02219k21911
17435I65253n49587l38006j06407K3541k1617p032r407O8510j1174n1212L0914
17424f224j3715p1485L4306q4081L4057O0746Q4752M8937J6330j40916j05733
17413a43026m8626j9730N427J4576Q0471k3590J0336l6341J230m8609Q9159P5898
$$ plain form
17492 -68605 -59755 -125354 -154152 -206181 -102530 31625 46452 84765 59410 -55128 -86105
17481 -86105 -84284 11583 31297 9750 -51927 -37133 -166431 -96692 -50046 -159909 -164855 34172
17469 34172 63756 50166 67144 58706 -11137 -69070 33682 130917 80162 -45264 2844
17458 2844 125441 82201 55297 1749 1327 65964 -51769 -45601 -58415 -51685 49380 -8966
17446 -8966 -45078 91249 167210 207766 244673 420494 610556 737297 884945 1187164 965253
17435 965253 415666 77660 -28747 -5206 -26823 -33855 -43262 25248 14074 -37138 -6224
17424 -6224 -19939 -91424 -57118 -141199 -107142 -46396 38356 87293 103623 -37293 -143026
17413 -143026 -191652 -211382 -205955 -191379 -110908 -134498 -124162 -160503 -159273 -207882 -118723 -42825
17401d2825J07625m9861m1757P8532j4756j0089J9552l6951O1263j1344q9830
17390c0441r7678m0380l3261M4136J86678K1188j12744n6050l190R347L6328j0996
17378h7063Q505Q6356M1659P0950N6884m8416j16691j59306m3625J16226Q7486
17367A2965m6413j8491Q836l0021K6436m5738q2631L4100o6177K6906Q0282Q2294
17355a7652J14998L8057n981o0804m2284o1465m2490J5768J6J17001k102m7508
17343E554l3944o1825r7703l644K8748P4290M7549J17183m5468j07920L359P868
17331f5953r7078K010J09221m5491j28644O2627J5539L2973L7893m4615j37806
17320b59324q2189P180J24592m834O4254O7689L5039L5903k1542r2k3299K2976
$$ plain form
17401 -42825 64800 14939 -26818 51714 36958 26869 46421 9470 70733 59389 -30441
17390 -30441 -128119 -168499 -201760 -157624 29054 50242 -62502 -118552 -121742 -112395 -76067 -87063
17378 -87063 -78558 7798 49457 120407 177291 128875 12184 -147122 -190747 -74521 12965
17367 12965 -33448 -51939 -43103 -73124 -46688 -92426 -175057 -140957 -207134 -180228 -99946 -17652
17355 -17652 97346 135403 129422 68618 26334 -35131 -77621 -61853 -61837 55164 53062 5554
17343 5554 -28390 -90215 -187918 -191562 -162814 -88524 -40975 76208 30740 -77180 -73821 -65953
17331 -65953 -163031 -161021 -51800 -97291 -225935 -163308 -147769 -114796 -76903 -121518 -259324
17320 -259324 -341513 -334333 -209741 -214575 -150321 -82632 -47593 -11690 -33232 -33324 -56623 -33647
17308c3647P8944M5080k04151j44240Q5598P178l3647q256J34960Q8335N6978
17297G3132N1230p6154k4239q8697m4395M6742m7831k0614m4842J13812K826N3094
17285e936m4569O7031N1587L3505o633M0227k2715j7268o2471J00808K8171P8093
17273B39830p4035j56838j24859M5024Q2898l9386k5984P1011J48467K4079n1626
17262A38581j6217l3873J5468J1946O6016j3001j05963n3337r498M982K6447j5769
17250A5782J7610J24696k6562p3710K7502Q9706k6945n5301O4506k2168k8669
17239A06447p7580r4059M1225P6628J6981r1854j22857J2773j3455j2614j13557
17228b71922k0379o0205Q7953L00701L0798j0300J4536l921l0243P2136q8052
$$ plain form
17308 -33647 45297 90377 -113774 -258014 -172416 -165238 -198885 -207141 -72181 16154 73132
17297 73132 124362 48208 23969 -64728 -109123 -62381 -110212 -130826 -175668 -61856 -59030 -5936
17285 -5936 -50505 16526 68113 101618 94985 135212 112497 95229 32758 133566 161737 239830
17273 239830 165795 8957 -115902 -70878 12020 -27366 -53350 17661 166128 190207 138581
17262 138581 122364 88491 103959 115905 181921 168920 62957 9620 122 5104 31551 15782
17250 15782 33392 158088 131526 57816 85318 175024 148079 92778 157284 135116 106447
17239 106447 28867 -65192 -23967 52661 69642 -22212 -145069 -132296 -145751 -158365 -271922
17228 -271922 -292301 -352506 -264553 36148 66946 56646 71182 67261 37018 109154 21102
17217B1102n2701l3085M155O5271N4628n5343M4405r7785k5189j6330j7539N206
17205a03205M8146j1001J629j05858J50016O9516j9572n4131K4577n8728Q121
17194e0490P6591j17072p1608O2309P6269N4168k3481q62l1294j7751j7568N143
17182e5646L2133J6371o9955K8008M3046N8207j09932j30880N6386o385O7707
17171g0940M9692j3300l8580k2481N5096m8366l531J36173J43269Q8910j32088
17160A43854j72695o6074M1486J6057L8289N833J6686j8303J9983L2128J32983
17149A90227n3522l8478n2940J1361O9912j08227M3081P9567q1282r4279J52749
17138A18169J25007k2338o8253o3004o3125o0034p9529l8740q6368j1622K0798
$$ plain form
17217 21102 -31599 -64684 -60529 4742 59370 4027 48432 -49353 -74542 -90872 -108411 -103205
17205 -103205 -55059 -66060 -64431 -170289 -20273 49243 29671 -24460 117 -58611 -50490
17194 -50490 26101 -90971 -162579 -100270 -24001 30167 6686 5824 -25470 -43221 -60789 -55646
17182 -55646 -23513 -7142 -77097 -49089 -6043 52164 -57768 -188648 -132262 -138647 -70940
17171 -70940 -21248 -34548 -73128 -95609 -40513 -88879 -92410 43763 187032 275942 143854
17160 143854 -28841 -94915 -53429 -37372 917 6750 23436 5133 25116 57244 190227
17149 190227 136705 98227 45287 56648 126560 18333 61414 140981 59699 -34580 118169
17138 118169 243176 220838 152585 89581 26456 -33578 -113107 -151847 -238215 -249837 -229039
17127b29039P2740Q5640O1953n3071m3735k818J2736R7160l9788m5614n0381J41258
17115G041Q0455r1868o5697k5038q0615p1589J1425j7011K6952p8572O9995J78830
17103e5692Q5092N2815K0111n7015Q2204p3413j05722K3677J30248o868k4610
17092G0827q0295m9936N849R7601L0131j38220k5792P9596M3438O6023l8202j0231
17080E0789j53860P4146J11750q7655L5735J8566p3920o9710n5893N855K9899
17069a14298K4951M7611o6711N2703K2372J3588L4269o8447q5860p1545K522l3576
17057b42421Q1164J14815n951r769l2348P6006J75659j05880j11939l0267K3058
17046f7873J07066P4755K5345j43029j11704j9540N0798K4187O9813N9740J9371
$$ plain form
17127 -229039 -156299 -70659 -8706 -61777 -105512 -108330 -95594 1566 -38222 -83836 -134217 7041
17115 7041 87496 -4372 -70069 -95107 -175722 -247311 -235886 -252897 -225945 -304517 -234522 -55692
17103 -55692 29400 82215 102326 45311 127515 54102 -51620 -27943 102305 95437 70827
17092 70827 -9468 -59404 -53555 44046 74177 -64043 -89835 -10239 33199 99222 61020 50789
17080 50789 -103071 -28925 82825 -4830 30905 49471 -24449 -94159 -150052 -144197 -114298
17069 -114298 -89347 -41736 -108447 -55744 -33372 -19784 14485 -53962 -139822 -211367 -208845 -242421
17057 -242421 -161257 -46442 -52393 -62162 -94510 -18504 157155 51275 -60664 -90931 -67873
17046 -67873 39193 113948 139293 -3736 -115440 -134980 -84182 -59995 9818 69558 88929
17035H8929O929l0962o3993o193R695l0120K7291j04397l7224K8503J16403M4886
17023D9747l3086K5327o0738l9112K5453k5882n9372j8051O6037m9504q5895J22452
17011h2624J27741K7501q9070k3915J07763j6009o1043k8577K8141r7223q1840
17000a89155l27O0661J47683O5456K1221m9515k2756M3627j45086o3205l5290
16989a66686n2400M8458L8309n3361j39034l0002K03624J49283j6943n0797k7169
16978i6718N4761l3592l8570J47663R4218N7077o8899r8674j2546J279o8349r2850
16966a55200J1800P9116J74490R352r1524r4322Q4658K11q4579j5242j5249m0063
16954a36552N4250J9144l4777n1592m9480N5066P7527R344k5111l8732K5680L2951
$$ plain form
17035 88929 95858 64896 903 -5290 4405 -25715 1576 -102821 -140045 -111542 4861 49747
17023 49747 16661 41988 -18750 -57862 -32409 -58291 -117663 -135714 -69677 -119181 -205076 -82624
17011 -82624 45117 72618 -16452 -40367 67396 51387 -9656 -38233 -10092 -107315 -189155
17000 -189155 -189482 -128821 18862 84318 105539 56024 33268 76895 -68191 -131396 -166686
16989 -166686 -219086 -170628 -132319 -185680 -324714 -354716 -151092 -1809 -18752 -69549 -96718
16978 -96718 -41957 -75549 -114119 33544 127762 184839 115940 17266 4720 5999 -62350 -155200
16966 -155200 -143400 -64284 110206 119558 28034 -66288 18370 18581 -65998 -81240 -96489 -136552
16954 -136552 -82302 -63158 -97935 -149527 -199007 -143941 -66414 -57070 -82181 -120913 -95233 -62282
16942f2282L721j04507P8497J84884l0525q2783P6840Q7579n6868m1900p791k2993
16930B1872R74N5682j9107n6759l5508n6538K6361n5626P427j37972m6470J23273
16918a72391N4507J21631J08077N0973K2170j10883n4246n7156k5385R392j37282
16907a90593m4116J09263K380J96563J25334j05705j5831j312l6871m3084L3211
16896B9239J47784o3309q9071n689j25577j24380J0960J49600J84492J37860p6878
16885A75031q8328j03212r4877p4969o5788Q1502P0132J919Q8259J0370n1691
16874e1652p3557p4220J7635Q0534J9558O0755k5701m8517J2873J07754L1620
16863E7082L4082P781n6259o6335P7373m7911m5612J03692N1742r864K302j21925
$$ plain form
16942 -62282 -58561 -163068 -84571 100313 69788 -12995 63845 151424 94556 52656 44865 21872
16930 21872 22846 78528 59421 2662 -32846 -89384 -63023 -118649 -111222 -249194 -295664 -172391
16918 -172391 -117884 3747 111824 162797 184967 74084 19838 -37318 -62703 -53311 -190593
16907 -190593 -234709 -125446 -123066 73497 198831 93126 77295 75983 39112 -3972 29239
16896 29239 177023 113714 24643 18954 -106623 -231003 -220043 -70443 114049 251909 175031
16885 175031 86703 -16509 -111386 -186355 -252143 -170641 -100509 -98590 -10331 39 -51652
16874 -51652 -125209 -199429 -181794 -101260 -81702 -20947 -46648 -95165 -82292 25462 57082
16863 57082 91164 98945 42686 -23649 53724 5813 -39799 63893 115635 105771 108073 -13852
16851a3852q8351L1111o3873L4593J30225Q506R1544p4353j34337j04294m3172
16840b26253N1849L3988J2404j1417j1723P7832M3504O7145O1640j0663o4116
16829B4190j4204q0996n0253J80003K4736P0594J2748l3740j32829k4541r917
16818c4209J7940R221k9037j991m445p2769K657J51507M3462M4820M901j05981
16806B6076j06771P5987P9999L4402k9305N62j26352n2634K3172L4028N5760n5247
16794d0323Q7853L8292j07759j41944l8751Q0811O4383Q5161m5113O148n4305
16783f5547K7212J07494K4492K4367k1613l6464L1370p5019L3118j6493p1337
16772c8420O44O0990J3530L5640N8900m9531Q603J04338N4827p0951l7059n2420
$$ plain form
16851 -13852 -102203 -71092 -134965 -100372 29853 38359 129903 55550 -78787 -183081 -226253
16840 -226253 -174404 -140416 -128012 -139429 -151152 -73320 -29816 37329 98969 88306 24190
16829 24190 9986 -71010 -121263 58740 83476 154070 166818 133078 249 -24292 -34209
16818 -34209 -16269 -7048 -36085 -38076 -42521 -115290 -112633 38874 82336 127156 132057 26076
16806 26076 -80695 -4708 75291 109693 80388 80950 -45402 -98036 -74864 -40836 14924 -40323
16794 -40323 47530 85822 -21937 -163881 -202632 -121821 -57438 27723 -17390 -11242 -65547
16783 -65547 -38335 69159 93651 118018 96405 59941 91311 16292 49410 32917 -38420
16772 -38420 -37776 23214 36744 72384 131284 81753 90356 194694 249521 178570 141511 89091
16760H9091q3604M2195P2546p1066P7145L9579j45631J6040m2147j38099k8225
16749a72176O8226K3206k7681j61182Q9093p0478p6153n7238K4555R2849P4565
16738a92414O8764j2793p9126n9190l4367L1425Q8403J57753O1886p2390O9438
16727B7389N6276J8230j6652L8633l1991L398P0358n2501j34846m8220J03593
16716C3667N0397j6007j2793k463N272k7423p8753j66026M3883L222M0952L5487
16704i0585J6459K8068N8580P1863j14631o2226N180M5601L3036L0407j26291
16693a04539o6037Q8688Q0746J23204K9812l8691j02710L3608j5847j05186J5268
16682f1684M2600L81J0340r0200o2352N6502J37860J57234q3296p7134N2185P4509
$$ plain form
16760 89091 5487 47682 120228 49162 126307 165886 20255 36295 -5852 -143951 -172176
16749 -172176 -103950 -80744 -108425 -269607 -180514 -250992 -327145 -384383 -359828 -266979 -192414
16738 -192414 -123650 -136443 -215569 -274759 -309126 -277701 -189298 -31545 30341 -42049 27389
16727 27389 83665 101895 85243 123876 91885 95283 165641 113140 -21706 -69926 33667
16716 33667 84064 68057 55264 52801 58073 30650 -48103 -214129 -170246 -167024 -126072 -90585
16704 -90585 -74126 -46058 12522 84385 -30246 -92472 -87292 -41691 -8655 21752 -104539
16693 -104539 -170576 -81888 -1142 122062 151874 113183 10473 44081 28234 -76952 -61684
16682 -61684 -19084 -18703 -8363 -98563 -160915 -104413 33447 190681 107385 30251 82436 156945
16670A56945k0304j23280l8262N0098m6124p9663k7508R9968m9111O3800p3253
16659h6694k5503J42257L5440r7366j5495N8774L1978j1145K4555j4914q3313
16648d1426m5862J66938J53289r8119k1509R7434j16489j60106p0208P5520K2622
16637c7916N880l104Q3070m8140q5670k6525l2029O3486N9952j50791n487J86328
16625I054M481j59885m9308l7473J77045J09749R6921N5672q0442q7780k8956
16614I078j16779J1547n9182m8314K463J08533M1525n6128q7684q716L5656Q5202
16602h2799Q4427l3606J9348o1978O0734o6609J22222L5914p7865k3333o4994
16591h8539l5330L2983M9288R3957J14411J0174M047j17335m6590o0436K2533
$$ plain form
16670 156945 136641 13361 -24901 25197 -20927 -100590 -128098 -28130 -77241 -13441 -86694
16659 -86694 -112197 30060 65500 -31866 -47361 11413 43391 32246 56801 41887 -41426
16648 -41426 -87288 79650 232939 134820 113311 210745 94256 -65850 -136058 -60538 -37916
16637 -37916 -32036 -35140 47930 -210 -85880 -112405 -144434 -80948 -20996 -171787 -177274 9054
16625 9054 13535 -146350 -195658 -233131 -56086 53663 150584 206256 125814 38034 9078
16614 9078 -107701 -96154 -155336 -203650 -201187 -92654 -51129 -107257 -194941 -203657 -168001 -82799
16602 -82799 1628 -31978 -12630 -74608 -13874 -80483 41739 77653 -212 -23545 -88539
16591 -88539 -123869 -90886 -41598 52359 166770 176944 180991 63656 17066 -43370 -20837
16580b0837m479j27476N8379K5856O8369l2641l6143q7653K01943J25375j28769
16569D1924l9305o162l0927r8290o4970q6113J43534J31412R301J331J6954L5209
16557E3898J18610K1357j18412j54003m9936J58334P6197j38849j31099L9180
16547a24723O7658n936j7949o5272M6590P8946N2680O429J3955l7416k8214j03220
16535a16472K8285J34258o9352q5980N538P762J8351O6542L7570O0083n3962j5160
16523A7463R393O7382m3304J03820O5488m7989R907m9720q6900j19302q6306K2616
16511a37452N2145m240k6964J11721K1406j1464K3377N2455N8811n1902p5854
16500A2039k22630m7473J01649N0664R7292M7144J5507j16589K4026K4753o1793
$$ plain form
16580 -20837 -25316 -152792 -94413 -68557 -188 -32829 -68972 -156625 45318 170693 41924
16569 41924 2619 -3543 -34470 -132760 -197730 -283843 -140309 -8897 404 1735 18689 53898
16557 53898 172508 193865 75453 -78550 -128486 29848 106045 -32804 -163903 -124723
16547 -124723 -57065 -63001 -80950 -146222 -99632 -20686 31994 38423 52378 14962 -13252 -116472
16535 -116472 -88187 46071 -23281 -109261 -103723 -95961 -77610 -11068 26502 86585 32623 17463
16523 17463 26856 94238 50934 154754 220242 172253 182160 132440 45540 -73762 -160068 -137452
16511 -137452 -85307 -89547 -116511 -4790 16616 5152 28529 80984 139795 87893 12039
16500 12039 -210591 -258064 -156415 -105751 -8459 38685 54192 -62397 -38371 -13618 -75411
16489g5411J9212Q330o97m4173L1494M8449k0823J18817J19392r5841k3869k6122
16477E8758n9212n0197N1316M8659m5688o3729o8097L4619o6763K6664o240l3738
16465a73648J39646N805L4346L1006k7880p7050p0996lk2326O9453Q4200J2993
16453E546j12614l8873J13670J99675K2413j08684J0488N834j24347N4682p2487
16442d4697o7293k4262o0181O2185L8403O1198J55415N9481M5506j33808q6634
16431E313j01630J61585k0620p152O2537K9303k8142l8639j36876j5852R9172
16420H999K4568m5029o4157o868O9738J13743N6925j42893j25739j8269J7251
16409a11731R3120J03981j03591o2593q2798j992J04436k1422P3361j8209r466
$$ plain form
16489 -75411 -56199 -47869 -48566 -92739 -61245 -12796 -33619 85198 204590 108749 84880 58758
16477 58758 -454 -50651 665 49324 3636 -60093 -128190 -93571 -160334 -133670 -139910 -173648
16465 -173648 -34002 -28197 6149 37155 9275 -67775 -138771 -138774 -161100 -91647 -7447 5546
16453 5546 -107068 -145941 -32271 167404 189817 81133 91621 97455 -26892 27790 -44697
16442 -44697 -111990 -136252 -196433 -134248 -95845 -34647 120768 180249 225755 91947 5313
16431 5313 -96317 65268 44648 37496 100033 129336 101194 62555 -74321 -90173 8999
16420 8999 33567 -11462 -75619 -82487 -12749 100994 157919 15026 -110713 -128982 -111731
16409 -111731 -18611 85370 -18221 -80814 -163612 -165604 -61168 -82590 -9229 -27438 -36904
16398c6904l904n1144O345k0127p5329M553L6065M8656Q3810J17805M8248L7326
16386A95400n569l3082q5002j32453p3531R6407K9669Q5550J4136Q5129M6309
16375B22963j02613j55808M5344J25380k475J03054N9737j55656q6310K3665q1641
16364d360O882N2122m844o536l667N0810r8439j04667N7400p5181K482k0681J15255
16351c3424M6957M2258l2989J34316J0875p5120j09687J00602J07559o6321j23575
16340A451k9561O8626j4859n3099K0575m5016m9310J6704K7012N4818r4090m1189
16328a37938q085J3148J8527P1944M2029q4177J0618K4706J5044J01719J38920
16317B06455p2752j12590o747N8928p5064n8672L3804p3425j31057N7707K11858
$$ plain form
16398 -36904 -40808 -91952 -85607 -105734 -181063 -176510 -140445 -91789 -7979 109826 158074 195400
16386 195400 189831 156749 71747 -60706 -134237 -37830 -8161 77389 91525 176654 222963
16375 222963 120350 -35458 9886 135266 132791 235845 295582 139926 53616 77281 -4360
16364 -4360 2522 54644 49800 43264 39597 90407 -8032 -112699 -55299 -130480 -127998 -148679 -33424
16351 -33424 13533 55791 22802 157118 167993 92873 -16814 83788 191347 125026 1451
16340 1451 -28110 40516 25657 -27442 -6867 -51883 -101193 -84489 -57477 -2659 -96749 -137938
16328 -137938 -146023 -132875 -114348 -42404 -375 -84552 -73934 -49228 -34184 67535 206455
16317 206455 133703 21113 14366 73294 -1770 -60442 -26638 -100063 -231120 -173413 38445
16306C8445l8764Q062O6521P695j06426m5151N8462P5348m4382o0752o0942Q293
16294i3591l435K4056j3920M7608J7172O5836P3715J06190r4005j19106n1752
16283d1232L0529J51736p471k4751k8317M4138k0258N670M3059K2244j01005r9840
16271b5498R0822Q0382P768k4926J3828n3754N4128j4992j7360j7356q4789j6121
16259g868K6006O3782P5610n8546o5389l873M0901l38K5230o8902j44259n9988
16247a77634m8427l3038n0846J11318J6580N9240L0811P5887J9471j300M2228
16236D4290n7826N2673K7788k2604m6482n4188O9818P4390Q3763l8999k7689m9351
16224E5583J8539K2624o2050Q6105L8623p8349k16629p2875Q1598J65187J596
$$ plain form
16306 38445 -319 7743 74264 81959 -24467 -69618 -11156 64192 19810 -40942 -101884 -93591
16294 -93591 -97026 -72970 -86890 -39282 -22110 43726 117441 223631 129626 10520 -41232
16283 -41232 -10703 141033 133562 108811 80494 124632 104374 110044 153103 175347 74342 -25498
16271 -25498 65324 145706 153474 128548 142376 88622 142750 127758 110398 93042 8253 -7868
16259 -7868 18138 81920 157530 98984 33595 29722 70623 70285 95515 26613 -117646 -177634
16247 -177634 -226061 -259099 -309945 -198627 -182047 -122807 -91996 -16109 3362 2062 44290
16236 44290 -13536 39137 66925 44321 -2161 -56349 13469 87859 171622 132623 104934 55583
16224 55583 74122 96746 34696 120801 159424 81075 -135554 -208429 -126831 38356 39952
16213C9952r3917R625J565K6571P4037q7240j12119N0018p972j8958K6182J37790
16201D5534J20088J6555j97292R120R5940j3877j39651N2001K9327K4635J8236
16190F0616l4428M9516k1824m9880N0153J38365j46182o6347P2540K0583n1603
16179B1509j14591O450J13268J181l9698Q0850p2697N3179J09439J5879n1063
16168A23706j74344m9928J43745O0262q1428p6432L6913K0647j13736r212Q8134
16157c1673r0040J17513J14048J4711j27290R41k3900L1620q6276k9787P3683
16146c6450J1523O9732K8273N7492Q3895j02353m7206j0806J6896j4081n0919
16135E996K3940P4502N5682n4181l8348p284j45442M7258J7014m2472K2147M6780
$$ plain form
16213 39952 -53965 -44340 -42775 -16204 57833 -29407 -141526 -91508 -99480 -118438 -92256 45534
16201 45534 165622 182177 -15115 -5995 89945 76068 -63583 -11582 17745 42380 60616
16190 60616 26188 75704 53880 4000 54153 192518 46336 -20011 52529 73112 21509
16179 21509 -93082 -86632 26636 27817 -11881 68969 -3728 49451 158890 174769 123706
16168 123706 -50638 -100566 43179 103441 22013 -54419 -17506 3141 -110595 -119807 -31673
16157 -31673 -121713 -4200 109848 124559 -2731 -1790 -25690 5930 -80346 -110133 -36450
16146 -36450 -24927 44805 73078 130570 214465 112112 64906 54100 70996 56915 5996
16135 5996 29936 104438 160120 105939 67591 60307 -85135 -37877 -20863 -63335 -41188 5592
16123E592J890J0522l7231l1836j1678P306M1956k3580O7149M54q1499L982N6018
16110I045Q2550L399j8868j23611M4392Q6422m4572k8864m4186P0693J06597j8815
16098A24182l8149K2613j4073q4863j54208j3969L7301J67978o3052r2877k2871
16087a31988R259j8582M4528k702j15022O1300P9835M1911P9814k5586j38167
16076a15400M1037L0271l1084n4653k2843L8009j8957K9980J31974o8181k2362
16065f2209O4792J3937L7100n2596j2843J30356j5171j55951o7690l9527P7354
16054h2448l1853k3871J23222M9744j9034M9031r3108j21371P9844M2126o864
16043c4582P299M8810k8233l7323M3456o4646o7735J25798J05044n725j02195
$$ plain form
16123 5592 7482 18004 -19227 -51063 -62741 -55435 -13479 -37059 30090 30544 -50955 -46973 9045
16110 9045 91595 94994 76126 -47485 -3093 83329 38757 9893 -34293 36400 142997 124182
16098 124182 86033 108646 94573 9710 -144498 -158467 -121166 46812 -16240 -109117 -131988
16087 -131988 -122729 -141311 -96783 -99485 -214507 -153207 -73372 -31461 48353 22767 -115400
16076 -115400 -74363 -44092 -75176 -129829 -152672 -114663 -133620 -103640 28334 -39847 -62209
16065 -62209 2583 16520 53620 1024 -11819 118537 103366 -52585 -120275 -159802 -82448
16054 -82448 -114301 -138172 -14950 34794 15760 64791 -28317 -149688 -69844 -27718 -34582
16043 -34582 -27283 21527 -6706 -44029 -573 -65219 -132954 -7156 97888 92163 -10032
16032a0032m1762R3808M7071l1723N8249J0110m4988j03605n8852J50296j365
16021F7207P574O6038J76461L5086o8014o0278M214r4283q0938l8184j2967o9904
16009f7988M1249M3022p8555L3242p3335l3945L7475k2543p997N1245r3852p951
15997a79933p445k6247Q4001O0974Q7978J74060P6032n2231r6696m7887r353l8242
15985B5011r5990p2552P3777J3398o6357j16400o1374L8132J79896j5078N1977
15974d5560L4046K9532l0124l7618O2139M6382j50861j17636J5660J15847R6425
15963A8232R5234L4179M7026j13939p5163O486r4868N3900P8439P4853K2518o2816
15951H4081q16j7760J96m0731k686r3407L3121M9833k9569o8615M5757J07489
$$ plain form
16032 -10032 -51794 42014 89085 57362 115611 125721 80733 -22872 -81724 68572 67207
16021 67207 74781 140819 317280 352366 284352 224074 228288 134005 53067 14883 1916 -67988
16009 -67988 -26739 16283 -62272 -29030 -102365 -136310 -98835 -121378 -129375 -78130 -171982 -179933
15997 -179933 -187378 -213625 -129624 -68650 19328 193388 269420 217189 120493 72606 63253 25011
15985 25011 -70979 -143531 -69754 -56356 -122713 -239113 -300487 -262355 -82459 -97537 -45560
15974 -45560 -11514 18018 -12106 -49724 12415 58797 -92064 -209700 -194040 -78193 18232
15963 18232 113466 147645 194671 80732 5569 12055 -82813 -28913 49526 124379 146897 84081
15951 84081 83265 65505 65701 24970 22284 -71123 -38002 11831 -17738 -86353 -40596 66893
15939F6893j4080j24414n9462m895j4114r09O620P1736P7731J12253O111P779
15927A31249m5052k0637N075Q9902m977j35180m7290k6095p16K1364r9120j414
15915a32891k4932q5156O9850K7079Q9452J6940k3167q2576l8295M1989o8483
15904b10190j473J23029O0928M1654Q2119M719l4826m0889j755m3264k8542M2284
15892f206K9592o4844L8107K7799N662n5582j21483K1252L3334k9421m2489K4646
15880a39633N7799O9439n255J07068Q4797M1804j16757q8967n3566l5137j2647
15869i1055P0245j5157n6307m8513q4443K5270m7373L029k9396l1881K4688M2346
15857b38547J68265J0049N7250J2703k283l4131o2638O624M2086j03133N1704
$$ plain form
15939 66893 52813 -71601 -131063 -135958 -150072 -150981 -144361 -72625 5106 117359 123470 131249
15927 131249 86197 65560 70635 160537 155560 20380 -26910 -53005 -53721 -32357 -131477 -132891
15915 -132891 -157823 -242979 -173129 -146050 -56598 -39658 -62825 -145401 -183696 -141707 -210190
15904 -210190 -211663 -88634 -27706 13948 96067 100786 65960 25071 23316 -19948 -48490 -6206
15892 -6206 23386 -41458 -3351 24448 30110 -25472 -146955 -125703 -92369 -121790 -164279 -139633
15880 -139633 -81834 -12395 -17650 89418 174215 216019 99262 10295 -43271 -78408 -91055
15869 -91055 -20810 -35967 -92274 -140787 -225230 -199960 -247333 -244304 -273700 -305581 -280893 -238547
15857 -238547 -70282 -60233 -2983 9720 7437 -26694 -89332 -82708 -40622 -143755 -92051
15846i2051j6239O2783N699K3157J1482m5707n9766L4963P0897K1967K9998R232
15834E6415m4361K3019j03905l8337L9j8219O4325K08694j7259q8669j73025K9977
15822a01306K20232o8388p4685J28692q6651j17695k4815j7575n2942N0115j6225
15811a61243p0898N391J32522J40188J00789M303l0272O5444P667k3971m8088
15800A21832J9130L9141q1805p0987J28731O5868o8706j58278j43322K1095J08075
15789a9226j8872K282o749j7190n712k9127j5213K723m7028J27094N4109k478
15777B4613q7642j68099k3809Q2579J10347N9056R623J21981j7688j20059m5222
15766e4320P765N086n6302m6684K348J35243l3991l9189l5020O1414Q3573l5752
$$ plain form
15846 -92051 -108290 -45507 -39808 -16651 -5169 -50876 -110642 -75679 -4782 17185 47183 56415
15834 56415 12054 35073 -68832 -107169 -107130 -125349 -61024 147670 130411 41742 -131283 -101306
15822 -101306 118926 50538 -24147 104545 17894 -99801 -124616 -142191 -195133 -145018 -161243
15811 -161243 -232141 -226750 -94228 45960 146749 151052 120780 186224 193891 169920 121832
15800 121832 140962 180103 98298 27311 156042 221910 153204 -5074 -148396 -127301 -19226
15789 -19226 -38098 -35816 -42565 -59755 -65467 -94594 -109807 -107084 -154112 -27018 27091 24613
15777 24613 -63029 -231128 -254937 -172358 -62011 -2955 6668 128649 110961 -9098 -54320
15766 -54320 -46555 -41469 -97771 -144455 -142107 -6864 -40855 -80044 -115064 -53650 29923 -5829
15754e829p1377k4370j42184q8770N3239K08556J38204R9139L3514j5691q7129
15743I7302l3340j19029k7959N6732Q295K680L5136Q1175J5488m3567q7807l0342
15731d5236M9484o8286o1594r2355R2150R4738j08453j774K2135j2381q4201j34306
15719c50079O9862Q2032J19165J5490J5907l1185n7658M0829O8104L9073L2128
15708D3668P7642j13233q0535Q0803L510o0202J8378N2971M8789k5256m3055J36480
15696A39960Q8224m7402j06749j27979j29088m343J25747M939K3745n8060M4418
15685d6588N4901K780m9069L3417P050P105j38645L3801R6008K1318O5673O4774
15673A52525p6875j17682P8063N2162L33J4858o7892k5788R7086Q5290j8913o0654
$$ plain form
15754 -5829 -77206 -101576 -243760 -332530 -279291 -70735 67469 166608 200122 184431 97302
15743 97302 63962 -55067 -83026 -26294 -17999 -15319 19817 100992 116480 72913 -14894 -45236
15731 -45236 4248 -64038 -125632 -217987 -125837 -31099 -139552 -141326 -119191 -131572 -215773 -350079
15719 -350079 -280217 -198185 -79020 -63530 -47623 -78808 -136466 -95637 -27533 11540 43668
15708 43668 121310 8077 -72458 8345 11855 -48347 -29969 23002 71791 46535 3480 139960
15696 139960 228184 180782 74033 -53946 -183034 -187377 -61630 -56691 -32946 -91006 -46588
15685 -46588 8313 11093 -37976 -4559 2491 9596 -129049 -95248 760 22078 87751 152525
15673 152525 75650 -42032 36031 88193 88526 103384 35492 9704 106790 192080 173167 112513
15661A12513Q362j7610p5393O157L0194j17438k16964J00880J62457j9946o2851
15650h9639J1720o0374q5573l5675K9315R1061L8541R4276Q2628K9920J00117
15639B06317P3903r1586n3782K574p8474k65349r1488J74861J37575n6792n901
15628d8142K7427Q8433Q7516j16672j34482N9982J33555l1134n4888o6197q623
15617f3225n053M8170n6199m0430q0467j15637M6097K12859j7529p5568j38891
15606b85873J44522J57597k6249k4807l5188n7777N6740J15923l9679L5183O9710
15595A10102j08342r3416r0786J00351P3841R9549O1314q0633k7388O7283j33589
15584b1714l8011j8951O0702p3647q3179L5107J6664N7331J24457n6193m3298
$$ plain form
15661 112513 120875 103265 27872 34029 64223 -53215 -270179 -169299 -6842 -26788 -89639
15650 -89639 -77919 -138293 -223866 -259541 -230226 -139165 -100624 -6348 76280 106200 206317
15639 206317 280220 188634 134852 137426 58952 -206397 -297885 -123024 14551 -42241 -48142
15628 -48142 -20715 67718 155234 38562 -95920 -35938 97617 66483 11595 -54602 -63225
15617 -63225 -68278 -20108 -76307 -116737 -197204 -312841 -266744 -53885 -71414 -146982 -285873
15606 -285873 -141351 16246 -10003 -34810 -69998 -127775 -71035 44888 5209 40392 110102
15595 110102 1760 -91656 -182442 -82091 -8250 91299 152613 71980 44592 111875 -21714
15584 -21714 -59725 -78676 -17974 -91621 -174800 -139693 -123029 -65698 58759 2566 -40732
15573d0732K8908R6157N8246J381k415j8702K5747j5839K6107J1403l7989r6555
15561C5717p9018Q0888M8169J04533m5632P4397J04046L0469P3420m6693q7963
15550B92333o5669p4484j0738j52962j43236Q41j44470L3617m3153q3770N1189
15539c40502J7262O9605Q8159P9911O7304M3413O2754r0366r5699J2639L0078
15528e5442Q093j0927q3706k1144K9002K3969N4622p9554M7439O3276m3428J5035
15516e2765Q987k6070n7988O6108L611M9110l3985M0271J9771K7851L4566k1190
15504E8277j7703O5269K3742j08438n3403O8494m671O9903J41342k4154j78211
15493D0447p9573Q801K1010j10911J3928M1812j0698J4395K0491O7750O8022K0812
$$ plain form
15573 -40732 -11824 84333 142579 143960 141545 122843 148590 132751 158858 170261 132272 35717
15561 35717 -43301 37587 85756 190289 144657 219054 323100 353569 426989 380296 292333
15550 292333 226664 152180 141442 -11520 -154756 -153915 -298385 -264768 -307921 -391691 -340502
15539 -340502 -323240 -253635 -165476 -85565 -18261 25152 87906 -2460 -98159 -85520 -55442
15528 -55442 -47349 -58276 -141982 -163126 -134124 -110155 -55533 -135087 -87648 -24372 -67800 -52765
15516 -52765 -43778 -69848 -127836 -61728 -58117 -9007 -42992 -2721 17050 44901 79467 58277
15504 58277 40574 105843 129585 21147 -32256 36238 31567 101470 242812 218658 40447
15493 40447 -39126 -30325 -9315 -120226 -106298 -64486 -75184 -60789 -40298 27452 95474 116286
15481A16286l6484K5291M6727r8454r9695N5656j5478m8542M4783N1563J477p6546
15469c3416j09178m5273K1287J15796N6333Q7956N4594p765R1665n7070j6151
15458A58778o5141k5657o6141k6029r535J0554R1635n5006o3940K4191l299m001
15446c3591q0506J1148L4027K7066R8985l883l4422q5366O654l4608O2241Q3575
15434E1320p2252M7985O940q6535K0051k0749P9695N7077R509q7314J04085J7662
15422A27474l4318o6241j05906j16385K4491L4412N1539Q4873O5065R1904R968
15411A66876j45845o8154R5218l984p439j72864N2501Q5613J29241Q1469j35376
15400G7256l5599M3778o1338O7503Q1880L2415j22605j50486k6564l6215o5229
$$ plain form
15481 116286 79802 105093 151820 53366 -46329 9327 -6151 -54693 -9910 41653 43130 -33416
15469 -33416 -142594 -187867 -166580 -50784 5549 93505 148099 140334 231999 174929 158778
15458 158778 93637 67980 1839 -24190 -33725 -23171 68464 13458 -50482 -26291 -29590 -33591
15446 -33591 -114097 -102949 -68922 -41856 57129 53246 18824 -66542 -59888 -94496 -32255 51320
15434 51320 -20932 27053 33993 -52542 -32491 -53240 26455 83532 93041 5727 109812 127474
15422 127474 93156 26915 -78991 -195376 -170885 -136473 -84934 -61 65004 156908 166876
15411 166876 21031 -47123 48095 44111 36672 -136192 -83691 1922 131163 212632 77256
15400 77256 41657 85435 24097 91600 173480 205895 83290 -67196 -93760 -129975 -195204
15389a95204K8892q1045l5673K1885J39074j9142j12733k9291J70517Q3797P181
15378b1742o1100K2995o5979O2168l5322J42890l877l2149P830j0270l8474M2850
15366I820j32040k2356M2877K9739l1626J9926M3859m49O6415K0208L3992K3738
15354A04103l1508j21434J15189J06799L102p2815m4568m0335j05699q3491l7269
15343b07926J6329J17241Q7505k9912j7780m9397j3106l5862o784R6231R9296
15332E5835M0684k3758j02912P29L0146k6736m5073o5175R5863k388J3873J25456
15320I6544q3842l0295j0163k0592n5783N773k9452Q8694O8835l2339q6071J04285
15308A5594k895j31758M9030O0465j0956j01263l6653R9181J23005L2417l3126
$$ plain form
15389 -195204 -166312 -247357 -283030 -261145 -122071 -141213 -253946 -283237 -112720 -28923 -21742
15378 -21742 -82842 -59847 -125826 -63658 -98980 43910 40033 7884 15714 5444 -33030 9820
15366 9820 -122220 -144576 -101699 -71960 -103586 -83660 -39801 -40250 26165 46373 80365 104103
15354 104103 72595 -48839 66350 173149 176251 103436 58868 18533 -87166 -170657 -207926
15343 -207926 -191597 -74356 13149 -16763 -34543 -83940 -97046 -132908 -139692 -43461 55835
15332 55835 96519 72761 -30151 -29422 724 -26012 -71085 -136260 -40397 -42785 -28912 96544
15320 96544 12702 -17593 -27756 -48348 -104131 -98358 -127810 -39116 29719 -2620 -88691 15594
15308 15594 12699 -119059 -70029 -9564 -20520 -121783 -158436 -59255 63750 96167 63041
15297F3041N8391k8976J9326J16439j6550p3516o4610M3217O9762p0661l0803
15286H5060l8091J4812k2810j09841j19964Q4557O0814O2281m2147n4833N3076
15275b7086J12569q578j08201K4284L1193N4578J8536j9204j13918n9860J10676
15264A4989K6569R465o3172N4839l8190Q2180l441n8316r720j15787k7811m3440
15252a71835k5356M9710p3516L283L8217J7930R5670J11914o5859j40991j7954
15241a78787M7946N1938L289k9285O8565K3562j5865O6789R2591q7008j1808N8940
15229I0867P4664j7973j2623l4763j1211J38994l3731K3643L2861o6440o3382
15218A20906m769n3099J976J51089J2220j93556M3580J13711j21044r243M1333
$$ plain form
15297 63041 121432 92456 111782 228221 211671 138155 73545 116762 186524 115863 85060
15286 85060 46969 61781 38971 -70870 -190834 -106277 -45463 16818 -25329 -80162 -27086
15275 -27086 85483 76905 -31296 -7012 24181 78759 97295 78091 -35827 -95687 14989
15264 14989 41558 51023 -12149 42690 4500 86680 83239 24923 15203 -100584 -128395 -171835
15252 -171835 -197191 -147481 -220997 -217714 -179497 -161567 -65897 46017 -19842 -160833 -178787
15241 -178787 -130841 -78903 -75614 -104899 -36334 -12772 -28637 38152 130743 43735 31927 90867
15229 90867 165531 147558 134935 100172 88961 227955 194224 217867 250728 184288 120906
15218 120906 116137 63038 65014 216103 228323 34767 78347 192058 71014 61771 103104
15207A03104k563j7902p2277j96115l4505k8844P1422J65654R3849K2311o5814
15196C8320m0505K5040L9875R2529O3283o9302j44612j02397J72j2734l4647Q4768
15184f0210J83755O985j22620n0417L0467O3851m3079O795N4692j2492n5795n8975
15172e7043n547L9974J0443m1952K5340n3628P4564p18L4819j3983j64163m08
$$ plain form
15207 103104 100541 82639 10362 -185753 -220258 -249102 -177680 -12026 81823 104134 38320
15196 38320 -2185 22855 62730 155259 218542 149240 4628 -97769 -97597 -110331 -144978 -60210
15184 -60210 123545 130530 7910 -42507 -12040 51811 8732 15527 70219 57727 1932 -57043
15172 -57043 -62590 -22616 -12173 -54125 -28785 -82413 -7849 -8567 26252 12269 -151894 -152302
$$ [...]
##END NTUPLES=NMR SPECTRUM
##END=
