##TITLE=Analysis number 317417
Compound Code km 10200
Project Code qc-cat
Chemist Name ugmt ltd
##JCAMPDX= 6.0         $$ Bruker NMR JCAMP-DX V2.0
##DATA TYPE= NMR SPECTRUM
##DATA CLASS= NTUPLES
##ORIGIN= Bruker BioSpin GmbH
##OWNER= nmr
$$ XWIN-NMR		Version 3.5
$$ Mon Feb 20 12:08:07 2006 GMT Standard Time (UT+0h)  MAYBRIDGE\nmr@NMR_250MHZ
##.OBSERVE FREQUENCY= 250.131544655141
##.OBSERVE NUCLEUS= ^1H
##.ACQUISITION MODE= SIMULTANEOUS (DQD)
##.ACQUISITION SCHEME= undefined
##.AVERAGES= 16
##.DIGITISER RES= 18
##SPECTROMETER/DATA SYSTEM= dpx250
##.PULSE SEQUENCE= zg30
##.SOLVENT NAME= CDCl3
##.SHIFT REFERENCE= (INTERNAL, CDCl3, 0, 16.522)
##AUDIT TRAIL= $$ (NUMBER, WHEN, WHO, WHERE, WHAT)
$$ ##TITLE= Audit trail, XWIN-NMR		Version 3.5
$$ ##JCAMPDX= 5.01
$$ ##ORIGIN= Bruker BioSpin GmbH
$$ ##OWNER= nmr
$$ C:\u/data/dgb/nmr/ADRS/16270/pdata/1/auditp.txt
$$ ##AUDIT TRAIL=  $$ (NUMBER, WHEN, WHO, WHERE, WHAT)
(   1,<2006-02-20 12:07:20.86 +000>,<MAYBRIDGE\nmr>,<NMR_250MHZ>,
      <created by zg, POWCHK disabled, PULCHK disabled
       configuration hash MD5:
       84 BC 41 DB A1 6E 1D 46 DA 25 12 A5 C1 ED C5 3A
       data hash MD5: 64K
       47 E2 58 E9 2A 92 2C A2 0D DC 65 21 01 62 B0 B6>)
(   2,<2006-02-20 12:07:42.22 +000>,<MAYBRIDGE\nmr>,<NMR_250MHZ>,
      <Start of raw data processing
       ef LB = 0.3 FT_mod = 6 PKNL = 1 SI = 32K 
       data hash MD5: 32K
       42 ED 1E DE 6A 47 2C B8 63 99 D5 B0 06 5E 69 BD>)
(   3,<2006-02-20 12:07:45.20 +000>,<MAYBRIDGE\nmr>,<NMR_250MHZ>,
      <apk 
       data hash MD5: 32K
       B3 B3 84 AA C2 86 96 AE BB 67 F9 8D 0C 56 1C D8>)
(   4,<2006-02-20 12:07:46.26 +000>,<MAYBRIDGE\nmr>,<NMR_250MHZ>,
      <abs ABSG = 5 
       data hash MD5: 32K
       02 AE 38 BC 63 B6 D1 EE 0C 13 8F A3 D3 22 AD 91>)
$$ ##END=
$$ 
$$ hash MD5
$$ 8A 80 96 33 10 C5 2B 48 19 3B 80 FD 6D D4 5C 2D
##$RELAX= 
##$RELAX= 
##$RELAX= 
##$RELAX= 
##$RELAX= 
##$RELAX= 
##$RELAX= 
$$ Bruker specific parameters
$$ --------------------------
##$DU= <C:\u>
##$EXPNO= 16270
##$NAME= <ADRS>
##$PROCNO= 1
##$TYPE= <nmr>
##$USER= <dgb>
##$AMP= (0..31)
100 100 100 100 100 100 100 100 100 100 100 100 100 100 100 100 100 100 
100 100 100 100 100 100 100 100 100 100 100 100 100 100 
##$AQSEQ= 0
##$AQ_mod= 3
##$AUNM= <au_zg>
##$AUTOPOS= <18 >
##$BF1= 250.13
##$BF2= 250.13
##$BF3= 250.13
##$BF4= 250.13
##$BF5= 500.13
##$BF6= 500.13
##$BF7= 500.13
##$BF8= 500.13
##$BYTORDA= 1
##$CFDGTYP= 0
##$CFRGTYP= 5
##$CHEMSTR= <none>
##$CNST= (0..31)
1 1 145 1 1 1 1 1 1 1 1 1 1 1 1 1 1 1 1 1 1 1 1 1 1 1 1 1 1 1 1 1 
##$CPDPRG= <>
##$CPDPRG1= <>
##$CPDPRG2= <>
##$CPDPRG3= <>
##$CPDPRG4= <mlev>
##$CPDPRG5= <mlev>
##$CPDPRG6= <mlev>
##$CPDPRG7= <mlev>
##$CPDPRG8= <mlev>
##$CPDPRGB= <>
##$CPDPRGT= <>
##$D= (0..31)
0 1 0 0 0 0 0 0 0 0.06 0 0 0 0 0 0 0.0002 0 0 0 0 0 0 0 0 0 0 0 0 0 0 
0 
##$DATE= 1140437239
##$DBL= (0..7)
120 120 120 120 120 120 120 120 
##$DBP= (0..7)
150 150 150 150 150 150 150 150 
##$DBP07= 0
##$DBPNAM0= <>
##$DBPNAM1= <>
##$DBPNAM2= <>
$$ [...]
##$SUBNAM7= <"">
##$SUBNAM8= <"">
##$SUBNAM9= <"">
##$SW= 20.6930455092707
##$SWIBOX= (0..15)
0 0 3 0 0 0 0 0 0 0 0 0 0 0 0 0 
##$SW_h= 5175.983436853
##$TD= 65536
##$TD0= 1
##$TE= 294.16
##$TE2= 300
##$TE3= 300
##$TEG= 300
##$TL= (0..7)
0 120 120 120 120 120 120 120 
##$TP= (0..7)
150 150 150 150 150 150 150 150 
##$TP07= 0
##$TPNAME0= <>
##$TPNAME1= <>
##$TPNAME2= <>
##$TPNAME3= <>
##$TPNAME4= <>
##$TPNAME5= <>
##$TPNAME6= <>
##$TPNAME7= <>
##$TPOAL= (0..7)
0.5 0.5 0.5 0.5 0.5 0.5 0.5 0.5 
##$TPOFFS= (0..7)
0 0 0 0 0 0 0 0 
##$TUNHIN= 0
##$TUNHOUT= 0
##$TUNXOUT= 0
##$USERA1= <user>
##$USERA2= <user>
##$USERA3= <user>
##$USERA4= <user>
##$USERA5= <user>
##$V9= 5
##$VALIST= <valist>
##$VCLIST= <CCCCCCCCCCCCCCC>
##$VD= 0
##$VDLIST= <DDDDDDDDDDDDDDD>
##$VPLIST= <PPPPPPPPPPPPPPP>
##$VTLIST= <TTTTTTTTTTTTTTT>
##$WBST= 1024
##$WBSW= 4
##$XGAIN= (0..3)
0 0 0 0 
##$XL= 0
##$YL= 0
##$YMAX_a= 555970
##$YMIN_a= -546867
##$ZGOPTNS= <>
##$ZL1= 120
##$ZL2= 120
##$ZL3= 120
##$ZL4= 120
##$ABSF1= 16.522
##$ABSF2= -4.171173
##$ABSG= 5
##$ABSL= 3
##$ALPHA= 0
##$AQORDER= 0
##$ASSFAC= 0
##$ASSFACI= 0
##$ASSFACX= 0
##$ASSWID= 0
##$AUNMP= <proc_1d>
##$AZFE= 0.1
##$AZFW= 0.1
##$BCFW= 0
##$BC_mod= 0
##$BYTORDP= 0
##$COROFFS= 0
##$CY= 12.5
##$DATMOD= 1
##$DC= 0
##$DFILT= <>
##$DTYPP= 0
##$F1P= 14.0000005364418
##$F2P= -0.99999901652339
##$FCOR= 0.5
##$FTSIZE= 32768
##$FT_mod= 6
##$GAMMA= 0
##$GB= 0
##$INTBC= 1
##$INTSCL= 1
##$ISEN= 128
##$LB= 0.3
##$LEV0= 0
##$LPBIN= 0
##$MAXI= 10000
##$MC2= 0
##$MEAN= 0
##$ME_mod= 0
##$MI= 0
##$NCOEF= 0
##$NC_proc= -1
##$NLEV= 6
##$NOISF1= 0
##$NOISF2= 0
##$NSP= 0
##$NTH_PI= 0
##$NZP= 0
##$OFFSET= 16.522
##$PC= 1
##$PHC0= 241.0574
##$PHC1= 6.691714
##$PH_mod= 1
##$PKNL= yes
##$PPARMOD= 0
##$PSCAL= 4
##$PSIGN= 0
##$REVERSE= no
##$SF= 250.13
##$SI= 32768
##$SIGF1= 0
##$SIGF2= 0
##$SINO= 400
##$SIOLD= 32768
##$SREGLST= <1H.CDCl3>
##$SSB= 0
##$STSI= 32768
##$STSR= 0
##$SW_p= 5175.98343685301
##$SYMM= 0
##$S_DEV= 0
##$TDeff= 65536
##$TDoff= 0
##$TI= <Analysis number 999999
Compound Code 99
Book Reference 9
Project Code 9>
##$TILT= no
##$TM1= 0
##$TM2= 0
##$TOPLEV= 0
##$USERP1= <user>
##$USERP2= <user>
##$USERP3= <user>
##$USERP4= <user>
##$USERP5= <user>
##$WDW= 1
##$XDIM= 32768
##$YMAX_p= 348802862
##$YMIN_p= -748087
$$ End of Bruker specific parameters
$$ ---------------------------------
##NTUPLES= NMR SPECTRUM
##VAR_NAME=  FREQUENCY,     SPECTRUM/REAL,   SPECTRUM/IMAG
##SYMBOL=    X,             R,               I
##VAR_TYPE=  INDEPENDENT,   DEPENDENT,       DEPENDENT
##VAR_FORM=  AFFN,          ASDF,            ASDF
##VAR_DIM=   32768,         32768,           32768
##UNITS=     HZ,            ARBITRARY UNITS, ARBITRARY UNITS
##FACTOR=    0.157963299565203, 1,           1
##FIRST=     4132.6476996994, 0,             0
##LAST=      -1043.33573715361, 0,           0
##MIN=       -1043.33573715361, -748087,     0
##MAX=       4132.6476996994, 348802862,     0
$$ Real data points
##PAGE= N=1
##DATA TABLE= (X++(R..R)), XYDATA
$$ [...]
17683f794M504M511k812m465j3O588K734l98K931M343j811q143J997p91k394l551
17667c564r570l256P943k444m275q43Q381N956l333k470j128j759J0717N519K623
17652H497n706r021K794O367N745j937L74N305k858o811o532J79j604P4j685n047
17636a1866M019M200k587o715M021O955J052k281j581N389J054K902j593o830
17622c861J119n990j106j66l760M602M243K21J753L35M167j859m531J552M131
17607H50j659J438j1659n566M830O25K807n56M245N348N789J570o425j717m166
17592d246k890N633Q81l669p804K204l36O645R043L998j182n508l551J43N536
17577D897k021k738L24j940l457q35L887R441k183q34o269o289m887o74M985P147
$$ y = [-6794, -2290, 2221, -591, -5056, -5069, 1519, 4253, 3855, 6786, 11129, 9318, 1175, 3172, 2381, -13, -3564, -13134, -16390, -8447, -10891, -15166, -16009, -7628, -1672, -5005, -7475, -8603, -10362, 355, 5874, 8497, 2791, -6230, -3436, 2931, 8676, 6739, 7113, 12418, 9560, 2749, -3783, -3604, -5208, -5134, -6819, -11866, -7847, -3647, -6234, -12949, -8928, -1973, -921, -3202, -4783, 606, 1660, 4562, 2969, -3861, -2742, -8732, -9838, -10004, -13764, -9162, -4919, -4698, -2945, -2610, 1557, -302, -4833, -3281, 850, -809, 629, -11030, -16596, -11766, -11141, -8334, -8890, -4645, 703, 6492, 8062, 1637, -80, -4246, -7136, -1503, -622, -4291, -12095, -9891, -10227, -3582, 5461, 9459, 8277, 2769, -782, -639, 4897, 2876, 138, 462, -1478, -4935, -5770, -1883, 7558, 5375, 4541, -1728, -8017, -12904, -13578, -8593, -1446]
17561a446M806J446k058l801L361k856p059q88J710j102l124M068O715k249m481
17546f958P518j328j324J983J506l702p077l677l841K029L078L761M015L393K850
17531B226k423j012k685k58L059M343J017n612n375p956m922J119K69L836N513
17516h861m561j017L645M581J189N606M030j959l280M484p559r566j926n01L916
17501a1779N698l344J33M836j672K853M922j457J803J998L92j875L537n039q977
17486g971l606J518N49p4M493J385Q82N48K118j176J587P63q717n057J229N182
17470f347Q79k202j991L952n715M95L800J087l013O663J895j053J992n89o652
17455f799n43R89j774N331M237K43m845r25L145k033n194M892N292j663J2731
$$ y = [-1446, 3360, 4806, 2748, -1053, 2308, -548, -7607, -8495, -6785, -7887, -11011, -6943, -228, -2477, -6958, 560, -768, -2092, -109, 1397, -2305, -9382, -13059, -16900, -14871, -11793, -8032, -4017, -624, 2226, -197, -1209, -3894, -4152, -1093, 3250, 4267, -1345, -6720, -14676, -19598, -18479, -18210, -14374, -8861, -13422, -14439, -10794, -6213, -5024, 582, 4612, 2653, -627, 3857, -3702, -13268, -15194, -15695, -11779, -6081, -9425, -9292, -4456, -6128, -3275, 1647, 190, 1993, 3991, 4383, 2508, 6045, 1006, -7971, -11577, -10059, -9510, -9584, -5091, -3706, -2824, -2276, -158, -1334, 253, 1016, -7701, -12758, -11529, -6347, -5468, -7670, -9661, -5709, -11424, -10929, -7129, -6042, -9055, -2392, -497, -1550, 442, -147, -6799, -7342, -6353, -8127, -2796, 1441, 1684, -3161, -4086, -941, -2974, -8168, -3276, 2016, 353, 13084]
17440A3084K2024K5574M001r903j2390n840j3226p863m88l073m387l727j211L97
17426B972m186J738j35j552k213P93j07L550L15n077L653J517J047n30r55J976
17410B806m022k772L001M231L371n686J42k220J122j932L232K473p388l932K081
17395e493l659R871K217m740l754L155j845m124L011M635R81J328m506p258M39
17380i742J270l360l16O260P940J014l096l380n420l82P414k184j57R49M89K570
17364a31q488o56R646k536j270K689O443N38n755k677L54N177J102n412k778m697
17348h451O856N924L93p334k720O292l290j472M47r18K060p477o397P872P284
17333i31M550k787l740q15k16N590O698K635k080k536p142r558q704M057L936
$$ y = [13084, 35108, 60682, 64683, 54780, 42390, 36550, 23324, 15461, 14973, 11900, 7513, 3786, 2575, 2972, -1214, 524, 389, -1163, -3376, -2583, -2690, 860, 1175, -3902, -249, 1268, 2315, 1785, 830, 2806, -1216, -3988, -987, 3244, 6615, 929, 1071, -1149, -27, -1959, 1273, 3746, -3642, -7574, -5493, -9152, 719, 2936, -1804, -5558, -2403, -4248, -8372, -5361, -726, 255, 1583, -2923, -10181, -9742, -8472, -11832, -12148, -5888, 2052, 3066, -30, -3410, -8830, -9212, -1798, -3982, -4139, -3190, -2701, -131, -8619, -9275, 371, -2165, -3435, -746, 5697, 6235, 480, -2197, -1843, 3334, 4436, -976, -3754, -8451, -1595, 4329, 4722, -2612, -5332, 960, -2330, -3802, -3355, -4273, -2213, -9690, -16087, -8215, -931, 3619, 832, -2908, -3723, -3939, 1651, 8349, 10984, 8904, 6368, -774, -10332, -19036, -14979, -11043]
17318a1043L693j197k56K162K400j407O15L049l96K863m967k564q02j243K347
17303f746p16n047k456k71j055l759M427k004j059M284O624J728k024m248L497
17288h825k32L455J861p222J245L125j067k055k177J6200L438o182o613j609K987
17273c671Q431r26k532k682M62K410L203q595n081O801N893o021p410q942K76
17258a8384P556P330R48p51L119J953j441l82P63j622j2594r508M224M78k30l51
17242a8892J766K481l2L387M462M876j790m554l243N240L401M940n58K822o76
17227C630o785o042J557p17K644R15J811O82k57j359Q07M750k798q976K532L145
17211d461L40n29k423j176j136K304j52M189K992J416k903M399o193o001M06L026
$$ y = [-11043, -7350, -8547, -8803, -6641, -4241, -5648, -5033, -1984, -2380, 483, -4484, -7048, -7850, -9093, -6746, -7462, -12509, -14965, -15236, -16291, -20050, -15623, -17627, -18686, -14402, -7778, -6050, -8074, -12322, -8825, -9057, -5602, -3741, -10963, -9718, -6593, -7660, -9715, -11892, 4308, 7746, 1564, -5049, -6658, -3671, 4760, 3834, 1302, -1380, -918, 1492, 4695, -3900, -8981, -2180, 3713, -2308, -9718, -18660, -18384, -10828, -3498, -2550, -3301, -182, 1771, 330, -52, 711, -911, -13505, -23013, -18789, -18311, -18541, -18892, -17126, -14645, -14677, -11290, -6828, -1952, -3742, -8296, -11539, -6299, -2898, 2042, 1484, 4306, 3630, -3155, -9197, -7640, -8357, -5713, -4798, -2987, -2305, -2562, -3921, -3114, 1636, -1162, -10138, -7606, -4461, -4121, -4650, -7073, -8249, -9385, -7081, -7233, -3044, -52, 1364, -1539, 2860, -3333, -9334, -8928, -5902]
17195e902O257K061L169L375k995n311l306J384m444k707O325K781k845j017L208
17180C3L370M322n79m450K650K56M983Q50l536k32P257l281j0645m795K062m50
17164b185P707m287m202k312j547M308j090m999l664o77O294Q790L08L165o397
17149g88n682L827m27N190K086M148l548m755J331m529q282j582k301K102j403
17134a4613R01M144L946M657j375l404j987R396K605j1491m048K801L582K475
17120b411N353k682j659L142m606L229j26k854L893j019m742o276j271J1210K296
17105A477n932O142m16n789l140K35K28o68J331N592J017j939j616J225J853m799
17089e199k500J337J291M631p251n013k218j203Q020R765p82n081J866J244k573
$$ y = [-5902, 355, 2416, 5585, 8960, 5965, 654, -2652, -1268, -5712, -8419, -2094, 687, -2158, -3175, 33, 3403, 7725, 7146, 2696, 5346, 5602, 10585, 11435, 7899, 7667, 14924, 11643, 998, -3797, -1735, -2185, 5522, 1235, -2967, -5279, -6826, -2518, -3608, -8607, -12271, -12948, -6654, 2136, 2444, 5609, -788, -6470, -2643, -3070, 2120, 4206, 8354, 4806, 51, 1382, -3147, -11429, -13011, -15312, -13210, -14613, -13712, -9568, -5622, -965, -2340, -5744, -7731, 1665, 4270, -7221, -11269, -8468, -4886, -2411, 2942, 260, -1399, 1743, -2863, 366, 240, -2614, 1279, 260, -4482, -10758, -12029, -819, 1477, -4455, 1687, 1271, -4518, -7658, -7423, -7195, -7863, -6532, -940, 77, -1862, -3478, -2253, -400, -5199, -7699, -6362, -5071, -440, -7691, -12704, -14922, -16125, -8105, 1660, 878, -4203, -2337, -1093, -3666]
17074c666k994K105k079j32O505K7o84j833K073j972j0445j083K56J073k511K884
17058a2476J583N060k350l24L252J088k252M216K618r566n941N400K019o165N39
17043a3299N113O194k304j180J716K867j0316R157L492j372l335K470o60m947
17029f404k954M446P034K827m881m085J1074N544k101k671j626j804j693k116
17015E90M711k18m794k010J457o255o336L256O69K68m91J642J56J242j145j591
16999h849K283P04k954l721k016L365Q211J59J997O266j782k134N79J381O200
16984I689m419p157n650O60M487l473J374R7L89O891M352L52k897k376O31L06
16968C256K071P58n225j738r064j412Q850l335K06M350K548J982k622l982M253
$$ y = [-3666, -6660, -4555, -6634, -6766, -261, -234, -918, -2751, -678, -2650, -13095, -14178, -13922, -12849, -15360, -12476, -10893, -5833, -8183, -8507, -5255, -4167, -6419, -2203, 415, -9151, -15092, -9692, -7673, -13838, -13299, -8186, -1992, -4296, -5476, -3760, -893, -11209, -2052, 1440, 68, -3267, -797, -1457, -6404, -9358, -4912, 2122, 4949, 68, -4017, 7057, 12601, 10500, 7829, 6203, 4399, 2706, 590, 5301, 5083, 289, -1721, -264, -6519, -12855, -9599, -8930, -8662, -9153, -7511, -7355, -6113, -7258, -8849, -6566, -5862, -8816, -12537, -14553, -11188, -2977, -2818, -821, 5445, 3663, 1529, 2108, 3489, 9689, 5270, -1887, -7537, -6877, -2390, -5863, -4489, -4392, -4003, 2888, 7240, 7592, 4695, 2319, 2950, 3256, 5327, 6085, 860, -878, -9942, -11354, -2504, -5839, -5633, -1283, 1265, 3247, 625, -3357, 896]
16953H96M454o740n612K034M36Q81J047j528J375m876m167K567N292P00l147m421
16937a0809n046N518K298j98L753K084o064j0407j360R363M586J639j904J178
16923e369L347O96J15K80J587j720p108J250L943K848k315l944J391M343j291
16908a947j304n781M204m49q130k454L788P062M046n064j552J0559L264r137k614
16893e509L762M485r110r014R431j691l002K228o54l408N192O552L105j356p126
16878f115j299O173P520k468m169l506m322o21M517J07n77k033N161K627O67K53
16862A915M605k674o023O26Q823J372o93m196l31m499j829Q54l511J525P33K680
16846f23N792j890p999o491p967l660P617L632O299Q21k666j581P386O096p459
$$ y = [896, 5350, -1390, -7002, -4968, -4532, -3651, -2604, -4132, -2757, -7633, -11800, -9233, -3941, -3241, -6388, -10809, -15855, -10337, -8039, -8237, -4484, -2400, -8464, -18871, -20231, -10868, -6282, -4643, -6547, -5369, -2022, -1326, -1211, -931, 656, -1064, -8172, -6922, -2979, -131, -2446, -6390, -4999, -656, -1947, -3251, -9032, -4828, -5277, -13407, -15861, -12073, -5011, -965, -6029, -7581, 2978, 6242, -2895, -5509, -1747, 2738, -6372, -15386, -5955, -7646, -10648, -8420, -9074, -12482, -7290, -738, 2367, 1011, -6115, -7414, -1241, 6279, 3811, -358, -3864, -8186, -8807, -4290, -4183, -4760, -6793, -1632, 995, 1662, 1915, 6520, 3846, -2177, -1551, 7272, 8644, 7951, 3755, 3424, -1075, -2904, -2050, -5561, -4036, -3303, -623, 5169, 3279, -4720, -11211, -19178, -22838, -15221, -11589, -5290, -4469, -7135, -8716, -1330, 4766, -2693]
16831b693q253O733J714m770n8l786n147K793K183O151R94p902n40P916m54K120
16815b999O841J097n57l218O20l175j14j491k553J677J71J755Q48N423K869l681
16799C513K652j387k403J047O936L490j1647k202l96n642l082K836P093K004k916
16784a04p703p01M225k500Q93J11K683J319N322j483J724j339m268L286j569m984
16768e088K121K672P616j969o109p578k183m501J281J834n30J267M546L736M32
16753b453l777j862m32M672L781m995M072n85N076P201l289n942j324o304q21
16738f982M704K098J569L816L398o885M08L767K672O42q018m855m362K308j665
16723g385k341N330L465l501j0766N148O845M096P792l143j0570k288M449O033
$$ y = [-2693, -10946, -4213, -2499, -7269, -7327, -11113, -16260, -13467, -11284, -5133, -4139, -12041, -12581, -4665, -5119, -2999, 3842, 4939, 4382, 1164, 1784, -1391, -1505, -2996, -5549, -3872, -3701, -1946, -1098, 4325, 7194, 3513, 6165, 4778, 2375, 3422, 10358, 13848, 2201, -1, -397, -6039, -9121, -6285, 808, 2812, -104, -7807, -8508, -4283, -6783, -5890, -5779, -3096, -1777, 3545, 2062, 3786, 2447, -1821, 1465, -104, -5088, -2967, -295, 7321, 5352, -757, -8335, -10518, -15019, -13738, -11904, -12434, -11167, -6621, -2885, -2453, -6230, -8092, -8524, -3852, -71, -5066, -994, -1579, 3497, 10698, 7409, 1467, 143, -6161, -6982, -2278, -180, 1389, 5205, 8603, 1718, 2126, 5893, 8565, 9207, 1189, -3666, -8028, -5720, -7385, -9726, -4396, -931, -4432, -15198, -10050, -3205, 891, 8683, 5540, -5030, -7318, -2869, 3164]
16709C164J206o006J076j863J682M277j264L488n96M508K039l150j617p998n095
16694f149L17r04o493K826R17j901K371l9L08L74N156L470j799n79L010p515l399
16677a0029M338Q382L262l422r187k203O940O487L913k38J298K273o570q631o37
16662d024N209N763l791l379J302n728k242L870K279N90R56r439o462L249J1853
16647FM620l871J261j355k543J014M016o131J744K965p50M48n440j374k651k19
16631h260k062o885M324P687l763q8M140J37N257L802J613n684m038k585j308
16616g713n572K524P675J734k474K762m608n442n050p436O65K228M443L405M170
16601h689R761J391l801j0308m30M146k798o471p649M4P474O991K68k310J146
$$ y = [3164, 4370, -1636, -560, -2423, -741, 3536, 2272, 5760, 5164, 9672, 11711, 8561, 6944, -1054, -6149, -5832, -6736, -13229, -10403, -9486, -11387, -9016, -9055, -8747, -8373, -3217, 253, -1546, -2125, 885, -6630, -10029, -5691, 2691, 5953, 2531, -6656, -8859, -1919, 4568, 8481, 8243, 9541, 11814, 5244, -3387, -4024, 1185, 6948, 3157, -222, 1080, -4648, -6890, -3020, -741, -151, 805, -8634, -15096, -11847, 6, 4626, 755, 2016, 661, -1882, -868, 3148, -2983, -1239, 1726, 976, 1424, -4016, -5390, -8041, -8260, -10322, -17207, -12883, -5196, -8959, -9047, -4907, -4770, 487, 4289, 5902, 218, -3820, -6405, -7713, -13285, -10761, -3086, -1352, -3826, -1064, -5672, -11114, -16164, -23600, -22935, -20707, -16264, -12859, -8689, 1072, 2463, -1338, -11646, -12076, -7930, -10728, -17199, -24848, -24804, -17330, -10339, -10071, -12381, -11235]
16586a1235J202k292P725L911m906J676J848k517m949J636Q50M692L718K313j810
16571A862J846l920j646J792P267j932m824o76K814l501p713J966L576L192K811
16556B914o19j323M52j782o86l326j253M145P665n97l174j687m48K238l027l542
16540d050O07m149n106K262K969P11J35k080l734j341K969O514O518L414l976
16525A663p163n34m93p56o017m887Q14R571P412o29k156K128m77j345j758Q33
16509c794Q39K519r77o165j528O225k810M35N3J246J399r49o759m260M677O062
16493c787N437l078l014J789J850p090n875l189P543M521K312L728k302O03L712
16478C160j880K901j298p319N74m801k614n950N34N376K930J300k26o817K39K1
$$ y = [-11235, -10033, -12325, -4600, -689, -5595, -3919, -2071, -4588, -9537, -7901, -7051, -2359, 1359, 3672, 1862, 3708, -212, -1858, -66, 7201, 5269, 445, -231, 2583, -918, -8631, -6665, -3089, 103, 2914, 2295, 972, 1424, -358, -1044, -4370, -5623, -1478, 6187, 5590, 2416, 729, 281, 2519, -508, -4050, -3443, -7592, -12698, -10436, -7467, -6756, -6621, -8701, -12435, -13776, -10807, -4293, 2225, 5639, 1663, -5500, -6034, -6527, -7283, -13300, -18187, -17373, -7802, -390, -1019, -3175, -1047, -1524, -2869, -4627, -3794, -2955, -436, -1413, -7578, -9106, -2881, -5691, -5256, -5203, -3957, -2558, -3507, -10266, -14526, -9849, -3787, 1650, -1428, -4442, -2653, -803, -7893, -13768, -16957, -9414, -4893, -2581, 1147, -1155, -552, 3160, 1280, 4181, 2883, -4436, -3862, -8663, -11277, -17227, -16693, -11317, -8387, -7087, -7313, -14130, -13891, -13870]
16462a3870M848L653l054N719J972P29L563k168L112L466j85K384p95J144J160
16447A1678K95l933p095q169M176J439N327L970L65p885k00l999p20K478J303
16432i70p21n11N714J627p74j715j829K474J678O61j0229j1353J585Q355L756
16417b252k203R76J820j772O594j133j391p75l148o567k062N841Q24K166J92K401
16401d89L305P04k047L845O370p174p679k121R491N353q179m258M146J0844J97
16386A2308j4173o083K618K729J759l340k517j827L890j783j517P48j292L862
16372d618M752N218N44O53K554j86j645r257p213L78j646l435M841N845m14l381
16356g010O2J197l547j048J082K702k382j216J407l495J42Q104M106n739l992
$$ y = [-13870, -9022, -5369, -8423, -2704, -732, -3, 3560, 1392, 4504, 7970, 7785, 10169, 9374, 10518, 11678, 11973, 8040, 945, -7224, -3048, -1609, 3718, 7688, 8053, 168, -32, -4031, -4751, -2273, -970, -1691, -2202, 3512, 5139, 4365, 2650, 821, 3295, 4973, 5634, -4595, -15948, -14363, -6008, -2252, -4455, -3479, -1659, -3431, 3163, 2030, 639, -136, -3284, -9851, -11913, -6072, -5248, -3082, -2890, -489, 2816, 3520, 1473, 5318, 11688, 4514, -3165, -5286, 4205, 9558, 1379, -2879, 1267, 12111, 12308, -1865, -7948, -5330, -2601, -842, -4182, -6699, -8526, -4636, -6419, -7936, -7188, -8480, -4618, 134, 5352, 5896, 6549, 9103, 8917, 7272, -1985, -9198, -8820, -10466, -13901, -9060, -3215, -3629, -7010, -6948, -5751, -9298, -10346, -9264, -6562, -8944, -10160, -8753, -12248, -12106, -4002, 104, -5635, -9627]
16341i627O027N687Q34j183m655K102k200l72K993J32j89k44j725k342J548M401
16325A187N01k373M240N638M401l006o764j289j3431o445O754L329j673j266Q374
16310a823P533J462l688m015p607n416Q25p6O096N305L87J553N015n536o795l080
16294i860M108J57K93k372m316O072j759R7M741O81N090N71m639l009J865R6O356
16277D172L718N1J150o095n474P9k883K599N573O898k32q937n623J677o383k000
16261a1710K663k754K183R798J35O152j917J390L982N807l927j3842Q8o166k617
16246a0735L844Rl780q52r82Q348M363N719k495K780L008k72j014j012n382j246
16230C01J666m3J853j902N79J18k140Q04k094j766L143K127N227L662n627r64
$$ y = [-9627, -3600, 2087, 2921, 1738, -2917, -815, -3015, -3387, -394, -262, -451, -695, -2420, -4762, -3214, 1187, 1688, -685, 3555, 9193, 13594, 10588, 3824, 2535, -10896, -17341, -10587, -7258, -8931, -10197, -1823, 5710, 7172, 3484, -531, -8138, -13554, -12729, -12805, -6709, -1404, -1017, 536, 5551, 15, -6780, -9860, -5752, -5595, -5302, -7674, -11990, -5918, -7677, -7580, -2839, -2158, 2932, 3503, -1136, -4145, -2280, -2184, 4172, 7890, 7941, 9091, 2996, -2478, -2399, -5282, -2683, 2890, 9788, 9556, 619, -5004, -3327, -9710, -11710, -9047, -11801, -9618, 180, 315, 6467, 4550, 5940, 9922, 15729, 11802, -2040, -1952, -8118, -10735, -6891, -6882, -10662, -11514, -12496, -4148, 215, 5934, 3439, 6219, 9227, 8955, 7941, 6929, 1547, 301, 1967, 1924, 3777, 1875, 2454, 2572, 432, 1236, -858, -2624, 519, 2646, 7873, 11535, 5908, 4944]
16214D944l716M24K999J830L954n694k709k664m840o083K384P212k11l084N22
16199d732M449K114K053o97j0136j636R368J400j960k476j588L851K612J678l183
16184A117K694K324R65K628m001K129m182q520o092N687M482J709k101r070J071
16169i160R426J778k872n242m060M666L876P94N154K661l052l129k54o319k594
16154h327J0680M435M407l956o480m936n056M274M977L059j006L001l168l489
16140a585L949r97n140L238M749K569m412r041m670K989J527M299J179o004M245
16125c105O865M376p250q661N192j745l636L849J251k43k23p656j81M320J745
16110e102L476o509k615P372n876n906M550K449j767K943M499J511K989K563j635
$$ y = [4944, 1228, 1652, 4651, 6481, 10435, 4741, 2032, -632, -5472, -11555, -9171, -1959, -2170, -5254, -4732, -283, 1831, 3884, 3187, -6949, -8585, 783, 2183, 223, -2253, -3841, 10, 2622, 4300, 1117, 3811, 6135, 7100, 9728, 5727, 7856, 3674, -4846, -10938, -5251, -769, 940, -1161, -10231, -9160, 266, 2044, -828, -6070, -10130, -5464, -1588, -794, 4360, 7021, 3969, 840, 586, -5733, -8327, 2353, 6788, 11195, 7239, 759, -4177, -9233, -4959, 18, 3077, 2071, 5072, 1904, -1585, 2364, 1367, -3773, -535, 4214, 6783, 2371, -6670, -11340, -8351, -6824, -2525, -1346, -7350, -3105, 3760, 8136, 886, -7775, -2583, -4328, -7964, -4115, -2864, -3107, -3330, -10986, -11167, -6847, -5102, -1626, -8135, -10750, -3378, -9254, -15160, -10610, -8161, -9928, -6985, -2486, -975, 2014, 4577, 2942]
16095B942P650m146j7122J704K145r91K420N122j0064j553j640J258Q633L283
16081c59R31j515K867p7o949m423N923K036m432m042R85j779p38N124P139L244
16065C935n461o342L219L613K643L222N51l071o989K064k599K908L122j810k500
16050c495O365L791l939k129L578m294q999K735P902Q26K697m265j320o118j899
16035h564M005J48q07N656J220n302n359Q831N586j083o958K98m950N99L058K850
16019g72l171K841O691l443k25M30l476r23n57L230J24L19M676J993j949R43o680
16002E1k243r12o67k71J073j288N214K036n97k343n011N893O656k189K975o44
15986G733l175o335n256R275N965L188k500q871n496m701K24N991n721j746M093
$$ y = [2942, 10592, 6446, -10676, -8972, -6827, -7818, -5398, -276, -10340, -11893, -13533, -12275, -3642, -359, 572, -943, 1924, 1847, -5102, -9525, -3602, -1566, -5998, -10040, -9055, -10834, -11572, -6448, 691, 3935, -1526, -7868, -4649, -1036, 1607, 4829, 5380, 2309, -4680, -2616, -5215, -2307, 815, -995, -3495, 2870, 6661, 2722, 593, 4171, -123, -9122, -6387, 1515, 2341, 5038, 773, -547, -6665, -8564, -4559, -4411, -5218, 438, 1658, -3644, -9003, -172, 5414, 4331, -2627, -2329, -7279, -6680, -3622, -772, -3943, -1102, 5589, 2146, 1921, 2351, -1125, -2048, -2605, 625, 749, 1068, 5744, 7737, 5788, 6731, 51, -2192, -3104, -3771, -4042, -2969, -4257, 957, 2993, 2396, 53, -4958, 935, 7591, 5402, 8377, 7733, 4558, -1777, -7033, 2242, 8207, 11395, 8895, 24, -5472, -10173, -9949, -3958, -9679, -11425, -7332]
15971g332l165l69O52k29M886N801N253K295r82M526j125r284n910j719l000J765
15955g937q35q35K344j899l632k351M603k772O70M57P93r50k175O476K689M053
15939a301M517P278J371j839l143l584j870o120m943L696J757j059Q84L19N489
15924A452K876Q969l908n562q061K990j581k176L262m457j736j357L968M189J965
15909H33P475m542p483l470L545J0652q610R18L651K793k912j4078K27M530O544
15894G3O012P87k549J132J874M788L43l274j1211l193O835j366J936q371n140
15879a1324O01Q565O799l252l681p51k122K970K479O260m38q166K094n630J146
15864d450K214P37j209P535L909J08j900P474K810o232r751K32o059o64J212k316
$$ y = [-7332, -10497, -10866, -10214, -10443, -5557, 244, 5497, 7792, 6810, 11336, 10211, 927, -4983, -6702, -9702, -7937, -8772, -9607, -7263, -9162, -12794, -15145, -10542, -13314, -12644, -12187, -11394, -12344, -14519, -8043, -5354, -1301, 3216, 10494, 11865, 10026, 6883, 3299, 1429, -4691, -9634, -5938, -4181, -5240, -4356, -4037, 1452, 4328, 13297, 9389, 3827, -4234, -1244, -2825, -5001, -1739, -6196, -7932, -9289, -5321, -1132, 833, 8308, 3766, -3717, -7187, -3642, 7010, -1600, -682, 2969, 5762, 2850, -11228, -11001, -6471, 73, 6085, 6872, 4323, 5455, 7329, 12117, 12460, 9186, -2025, -5218, 1617, 251, 2187, -6184, -11324, -10723, -2158, 4641, 1389, -2292, -3043, -5165, -2195, 284, 6544, 6106, -2060, 34, -5596, -4450, -2236, -1499, -2708, 4827, 8736, 8844, 6944, 14418, 17228, 10996, 1245, 1477, -4582, -5246, -4034, -6350]
15848f350Q436j752p992K445O223l133o246L48j968L096P516L761K691l990m091
15833a006J447M842j40l940l069j894O208j675l156M308J195r358k505J389L583
15818c771M185m38n376o783M329L831p26O258R983k801l269L873N521p494n959
15803A363j810r33M637l744j80k663l350l295R416L409l167m2M695k557l246J779
15787C12J278l033k021j2555j356J0027j584o539K080P834K897J555j380j948
15773d433L490J526m823l589m616J184J758J648j646J724J97M342J309J296n935
15758f568J550n38J69J120j267j696J89j67o69J832O633M183L821K086q561J182
15742C299l567j177m09p138p206k802J0096L383Q620Q786l318n847l177J227m83
$$ y = [-6350, 2086, 334, -7658, -5213, 1010, -2123, -8369, -8021, -9989, -6893, 623, 4384, 7075, 3085, -1006, 441, 5283, 5143, 1203, -1866, -3760, 2448, 773, -2383, 1925, 3120, -6238, -8743, -7354, -3771, 414, -24, -5400, -12183, -7854, -4023, -4749, 1509, 11492, 8691, 5422, 9295, 14816, 7322, 1363, -447, -1380, 3257, -487, -667, -3330, -6680, -9975, -559, 2850, -317, -359, 4336, 1779, -1467, 312, 1590, -1443, -3464, -16019, -17375, -7348, -8932, -15471, -13391, -5557, -2660, -1105, -2485, -4433, -943, 583, -4240, -7829, -12445, -11261, -9503, -7855, -9501, -7777, -7580, -3238, -1929, -633, -6568, -5018, -5556, -5387, -4267, -5534, -7230, -7041, -7208, -7877, -6045, 588, 4771, 8592, 10678, 2117, 3299, -268, -1445, -1854, -8992, -16198, -19000, -8904, -5521, 3099, 11885, 8567, 2720, -457, 770, 287]
15727B87o025j41O099M411J017p140n905J85J026N333N931p436n908n67l872K487
15711a0218K371K272N187R300o365k792m152o556M660Q984P658j206r107j1014
15697a0978J472K730P62l670J091K675N200M807R430l910r37m458k020m197Q619
15682F616l113q616L113K731l955l611m70M770N56O07m870L476M377K199j296
15667B514j915M386O673M286k947j5602n700K825N543K839j287l374k70k292l678
15652g999M405P07O0N43n802p662K227N908M846P023P130M407J860l337r348N11
15636E479O02M499N587l208m748m353K402Q700l424K706K19l885m788J069m831
15621B026r14k449o80k140O95K79K465M874l236j704O410j067j927M21k259M016
$$ y = [287, -5738, -5879, 220, 4631, 5648, -1492, -7397, -7212, -6186, -853, 5078, -2358, -8266, -8833, -12705, -10218, -7847, -5575, -388, 8912, 2547, -245, -4397, -10953, -6293, 2691, 10349, 9143, 36, -10978, -9506, -6776, -6014, -9684, -8593, -5918, -718, 4089, 13519, 9609, 8672, 4214, 2194, -2003, 6616, 3503, -5113, -2000, 731, -3224, -6835, -7305, -2535, -1979, -1372, -6242, -2766, 1611, 3810, 2514, 599, 4985, 11658, 15944, 12997, -2605, -8305, -5480, 63, 2902, 1615, -1759, -2029, -4321, -7999, -3594, -2887, -2827, -2284, -8086, -15748, -13521, -7613, -2767, 4256, 11386, 15793, 17653, 14316, 4968, 5479, 6081, 10580, 16167, 12959, 8211, 3858, 6260, 14960, 11536, 14242, 14461, 10576, 5788, 6857, 2026, 1112, -1337, -2017, -4157, -3462, -3183, -718, 4156, 920, -784, 5626, 4559, 2632, 3053, 794, 4810]
15605D810K271M673j746j4868k081j849K745j973K538M518J988M20l529K170L835
15590C922m690l004R39K471k409Q78R1k317K312N36l550m845K160J909j754k10
15574g561J334K598P741q151m243R557Q183N90l338m319l063K57n856n980N327
15559f924J466K939k497P03K817J948p36j98J103k626J476J931N35K867P981J512
15543A4297L126o727j1489n194M755O127k503j99o682j816J85K285J660O086m744
15528h33n968N509n761J65K525j864K607K481J780K068j723K14M058p2k591K980
15512E575o130n265J983J483k216O682Q163J247l358p303k058J533J915L028P988
15497A3267j405m972n538j123o690j740m331N588J025L956k88K542K05o113J558
$$ y = [4810, 7081, 11754, 10008, -4860, -6941, -8790, -6045, -8018, -5480, -962, 1026, 1446, -2083, 87, 3922, -768, -3772, -2833, -362, -2771, -1893, -1802, -4119, -1807, -1271, -4821, -9666, -7506, -5597, -7351, -7561, -6227, -3629, 4112, -4039, -8282, 1275, 9458, 10048, 6710, 2391, -672, -415, -6271, -12251, -6924, -5458, -2519, -5016, -4313, -1496, 452, -284, -482, 621, -2005, -529, 1402, 1937, 4804, 12785, 14297, 17423, 10696, -793, -5987, -1232, 4895, 2392, 2193, -4489, -6305, -6120, -3835, -2175, 3911, -833, -6801, -1292, -7053, -6888, -4363, -6227, -3620, -1139, 641, 2709, 986, 1200, 5258, 5186, 2595, 5575, -555, -5820, -3837, -2354, -4570, 2112, 10275, 11522, 8164, 861, -1197, 336, 2251, 5279, 13267, 11862, 6890, 1352, 229, -6461, -8201, -12532, -6944, -5919, -1963, -2251, 291, 496, -5617, -4059]
15482d059J00K906L575o485m706K680j178N152Q001M812L322r1o271r332l303
15467d877Q577L167p043o740N224O844k870l368O641O83p271M0K579K981m080
15452D87p92j993n533l269l746L969J029P159J0059K857l164l224m548q97j855
15437c461n376N128L080K489K334m879l497L840l103o643l066o025K517L605M773
15422h284M12O475N251m531k541O29R967M526p155j368r158l495j123J384M711
15407d300p74L320O280J559j950n240L084k628q675n053q22L939Q989o31O14p267
15391i555k518M80O801M581J755K379J853l800k932k8n380l900K55P380j132j072
15375d833l28K992O854K209n418j0809m471N871L802K786P636K50o96o768k21
$$ y = [-4059, -3959, -1053, 2522, -3963, -8669, -5989, -7167, -2015, 5986, 10798, 14120, 14029, 7758, -1574, -4877, 3700, 6867, -176, -6916, -1692, 5152, 2282, -1086, 5555, 6238, -1033, -993, 1586, 4567, 487, -305, -2298, -7831, -11100, -14846, -10877, -9848, -2689, 7370, 10227, 7063, 3839, -709, -1606, -3461, -8837, -3709, -629, 1860, 4194, -685, -4182, -342, -3445, -10088, -13154, -19179, -16662, -13057, -8284, -7872, -1397, 3854, -677, -3218, -2589, 7378, 11904, 4749, 3381, -5777, -9272, -10395, -9011, -4300, -5074, -1754, 4526, 6085, 4135, -1105, 1979, -649, -9324, -14377, -15199, -11260, -2271, -2902, -2288, -9555, -12073, -11593, -4792, -211, 1544, 3923, 5776, 1976, -956, -984, -6364, -10264, -10009, -2629, -3761, -4833, -5161, -2169, 4685, 6894, 1476, -9333, -13804, -7933, -4131, -1345, 6291, 6541, 5845, -923, -1144]
15360a144j50l342L970L912l872l582m03M909K392J417o778J29K262N389O580
15345A1689k140q7o605p616l176j634M616K779J968n619J688K190j534N680P5
15330B274l810L335J291l305P813L483J118J728j040n216n7n200l080L039N365
15315G738L614j804j682j984o48J988L704l422n188l357M856J474p476q3N071
15300B801L991P83j903R1J441l867N535l512j0270p004M450J1708M711J024k459
15285G520l394j0330m913N781Q002N443o242j470J591p45M259N511k45r892n111
15270d235K94m33K45j470k576k73O079k73L22J281P147n460K458l272m612l792
15254h570m293M288N436L593m17j499J746K808l765J507n584k750l385k382N961
$$ y = [-1144, -1294, -4636, -666, 3246, -626, -4208, -4611, 298, 2690, 4107, -2671, -2542, -280, 5109, 11689, 9549, 9462, 2857, -4759, -7935, -9569, -4953, -2174, -206, -5825, -4137, -1947, -3481, 2199, 2274, -1536, 1799, 3090, -215, 7598, 11081, 12199, 13927, 12887, 7671, 7614, 2414, -666, 2373, 7738, 11352, 9548, 7866, 5882, 5234, 7222, 10926, 7504, 2316, -1041, 3815, 5289, -2187, -2270, 2801, 6792, 7575, 5672, 5763, 7204, 3337, 8872, 5360, -4910, -11914, -7464, 4244, 8955, 9979, 7520, 4126, -6204, -11117, -5336, 2666, 8109, 1867, 397, 1988, 1243, 5502, 11013, 10768, 876, -4235, -3941, -4374, -4129, -5599, -8175, -8448, -2369, -2642, -2320, -1039, 6108, 648, 3106, -166, -4778, -8570, -12863, -8575, -3139, 454, 37, -1462, 284, 3092, -673, 834, -4750, -7500, -10885, -13267, -7306]
15239g306L209L70k672n86N206M969M175r00O89l580k563q46j972n874N098Q82
15223a701J817r36L725j631q277p72N433L608J315N432L485p314k812N271L789
15208A0432n736q918j445J477Qo87p85M86l398l900M679J3785O449m324k441p126
15192a444o259L226J884p331J760J070j045J0681M784L799l997j185J011J503
15178H457k843K222j112k814N37M514p71m147l287o627K251J593M500L466j356
15163D583M954p29J13Q16m091j088L751L011j61o447P25L562K486n972J66o60
15147E019p37m146k264n883l408k494O38M712L607l189l49L710r7J172M960O375
15131G626K291r277p22J321J236m446K051k178M074L351k491m963n478n30Q121
$$ y = [-7306, -4097, -3727, -6399, -6985, -1779, 3190, 7365, 6465, 7154, 3574, 1011, 165, -1807, -7681, -2583, -1701, 116, -820, 2905, 1274, -7003, -7775, -2342, 1266, 2581, 8013, 11498, 4184, 1372, 6643, 10432, 4696, -4222, -5667, -4190, -4182, -4869, -5654, -5168, -8566, -12466, -7787, 5998, 12447, 8123, 5682, -1444, -7703, -4477, -2593, -9924, -8164, -7094, -8139, 2542, 7326, 11125, 7128, 5943, 6954, 8457, 5614, 7836, 6724, 3910, 4447, 8961, 8190, 4043, 756, -5871, -3620, -2027, 2473, 5939, 4583, 9537, 8808, 8921, 9737, 5646, 4558, 8309, 11320, 11159, 4712, 5437, 8999, 11485, 5513, 5679, 5019, 4282, 136, -2128, -8011, -11419, -13913, -13275, -8563, -4956, -8145, -8494, -4784, -4881, -3709, 1251, 7626, 9917, 640, -82, 1239, 2475, -1971, 80, -2098, 1976, 5327, 2836, -2127, -7605, -8135, -14]
15116a4k273q575L275N84n089L372L673q23J00M820l23j617o794k482O428M359
15100a379L488L538M083J110J566k624k032J581n443q607m12J0059N1k525j192
15085A262L762N904K55q461k313l928m55M059k965m105K353j434Q49M889J966
15070A638K62l599j278N273K773o480L43K066j110o337j370P936K312k78P755
15055I906k679o596M262J506j563L668j686j1968k133O626J649k143k661j564
15041e376j171O468K346P15l79Q971P635j3895j0638K786q23j32j767m457m135
15026a3852j130L037N093qK916M169k320M03P93J764K257m325q04J1856M822l089
15010A1582j202J796K3N039l14k43m938m735L298P422m228q627K268K194L29j791
$$ y = [-14, -2287, -10862, -7587, -7003, -12092, -8720, -5047, -5870, -5770, -950, -1273, -2890, -9684, -12166, -5738, -1379, 2109, 5647, 9730, 10840, 12406, 9782, 7750, 9331, 3888, -4719, -5131, 4928, 4979, 2454, 1262, 5024, 10928, 11183, 2722, 409, -3519, -3974, 85, -2880, -6985, -4632, -6066, -5217, -328, 1638, 1900, -1699, -2977, 2296, 5069, -1411, -1068, 998, -112, -6449, -7819, 117, 2429, 2151, 9906, 7227, 631, 4893, 6399, 4836, 8504, 6818, -5150, -7283, -657, 992, -1151, -3812, -5376, -6547, -79, 2267, 2982, 2603, 11574, 19209, 5314, -5324, -2538, -3361, -3493, -5260, -9717, -13852, -14982, -11945, -6852, -6860, -3944, 225, -2095, -1692, -899, 865, 3122, -1203, -2007, 9849, 14671, 11582, 10380, 12176, 12199, 17238, 16924, 16681, 11743, 7008, 10306, 17728, 13500, 4873, 7141, 9335, 9664, 7873]
14994G873k307k075J010r51k926l058K731J185l92Q418n479k635r190j278J332
14979g742O585N50j80m253m668M447Q731M265k155m881L672N176J002j55p947
14964B447m494N00J292L460J38R06J0L052O43n098q335l317J1417K274k041N46
14948C400m152m017m904j299J146Q684J0489M1k151j0634P23K265l189M350R59
14933A711k915j724J549k24o65j335k193m390J269J461m3L933N449n847K161Q003
14917F200m113j0855l872N339M399L416K176P86k169K336N766k720k430l939l892
14902c572R520O972o449q748k56j258J350M468K719j759r886P10J061P821j1775
14887i082p225L133O406l585l518l276M509N116O221J943K80r11M830M38P87K717
$$ y = [7873, 5566, 3491, 4501, 3550, 624, -2434, 297, 1482, 1090, 9508, 4029, 1394, -7796, -9074, -7742, -1157, -607, -787, -5040, -9708, -5261, 3470, 7735, 5580, 699, 4371, 9547, 10549, 10394, 2447, -2047, -1547, -255, 3205, 3343, 4249, 4259, 7311, 7954, 2856, -5479, -8796, 2621, 4895, 2854, 3400, -752, -4769, -9673, -10972, -9826, -1142, 9347, 9388, 7237, -3397, -2674, -409, -3598, 752, 1711, -1204, -2928, -1379, -1603, -2268, -3603, -5796, -10186, -8917, -7456, -7499, -3566, 1883, -3964, -1803, 6200, 2087, -8768, -12640, -7301, -2902, 514, 2690, 3476, 1307, 3643, 9409, 6689, 4259, 320, -3572, 5948, 12920, 6471, -2277, -2533, -3791, -2441, 2027, 4746, 2987, -6899, -6189, -5128, 2693, -9082, -16307, -13174, -6768, -10353, -13871, -17147, -12638, -7522, -1301, 642, 922, 11, 4841, 5279, 6066, 8783]
14871H783Q02j755J522k228j187o370J5J47q00p212K382J884K450j540R545k612
14855C826n331N935L30J224L719N451m54o690l49J1306J778m765l325m822r165
14840a332n471M056M419o589L502J707m959L156Q089r2n469j956P573O11r866
14825b621J182P600L479l504k564j2984o330n229L893R465k07q274N675Q989J883
14810D53K616r52L85J895L417k089k133L209K923m653q15K209K2J352k997j0725
14794e883q141P02k628P977P212k616o855j839N564K772L222K214q2J938L571
14779G128l000p910k519j027n292M943O637O045R86m897l715n976K980L067j053
14764c603L063k992J155N977L044j838m305l070R937k46R12O640m102l207M09
$$ y = [8783, 9585, 7830, 9352, 7124, 5937, -433, -418, -271, -1071, -8283, -5901, -4017, -1567, -3107, 6438, 3826, -1505, 4430, 4760, 5984, 9703, 15154, 14700, 8010, 7661, 18967, 20745, 15980, 12655, 7833, -1332, -6803, -2747, 1672, -4917, -1415, 292, -4667, -1511, 6578, 6486, 1017, -939, 6634, 7245, -2621, -1439, 6161, 9640, 6136, 3572, -9412, -15742, -20971, -17078, -7613, -7820, -16094, -10419, -1430, 453, 3069, 2117, 2502, 4397, 7814, 5725, 3592, 6801, 9724, 5071, 4256, 6465, 6487, 7839, 4842, -5883, -14024, -13322, -15950, -7973, -761, -3377, -10232, -12071, -6507, -3735, -513, 1701, 1619, 3557, 7128, 4128, -3782, -6301, -7328, -12620, -7677, -1040, 5005, 5991, 1094, -2621, -8597, -5617, -2550, -3603, -540, -3532, -2377, 3600, 6644, 4806, 501, -2569, 7368, 7122, 8034, 14674, 10572, 7365, 7774]
14749G774l361j771J246lK673m135q712m197r36J162q50m329P293Q422N617R24
14733F817k45P757N791n100n059k633k585k075K373j126m718n770n194k498J0675
14718c590L427n86L727J405Q16q975m260k002K092M111J085M494Q328m02l865
14703E805o102q358p338J534N418M004R400o356K61M373Q415M15m662L950P371
14688A8130o753q610q88J29n347K295O960l238m689m634M835K339n35J566L852
14673E412L275J217j687J902Q57L806n000K46j695n870r741M72N067m218q274
14658a4231Q757N929N107J737q173j850j430o381N547n345M544O861N095k904
14644C263r438k328L441p87M521j381o08j126j804K726j901l792j935J237M050
$$ y = [7774, 4413, 2642, 3888, 3885, 6558, 2423, -6289, -10486, -11422, -10260, -11110, -15439, -8146, 276, 5893, 6817, 6572, 14329, 20120, 15020, 9961, 7328, 4743, 2668, 5041, 3915, -803, -6573, -11767, -14265, -3590, -163, -749, 2978, 4383, 5199, -3776, -8036, -10038, -7946, -3835, -2750, 1744, 10072, 9670, 5805, -297, -8655, -15993, -14459, -9041, -5037, 4363, -1993, -1732, 2641, 11056, 11471, 6809, 10759, 18130, 11377, 2767, 1879, 2008, -3339, -1044, 5916, 2678, -2011, -6645, -1810, 529, -6, 1560, 5412, 8687, 9904, 8217, 10119, 10976, 14782, 9782, 10028, 8333, 2463, -7278, -6806, -1739, -5957, -14231, -5474, 455, 5562, 7299, -874, -2724, -4154, -10535, -4988, -10333, -5789, 1072, 6167, 3263, -6175, -8503, -5062, -5849, -1328, -2709, -3317, -4443, -6247, -3521, -5422, -9214, -11149, -9912, -5862]
14629e862j605k454O835J725L027P122L56K418o582o059j437j885O479O183J217
14614I478m421p297K255k125N39J742K699P388K479k556k611o505n74O36j487
14599c60o098l958j613j714N724m755N104P168L344j05M51m211k01K740M77o906
14583d913k781m701L84o22M360Q116M57p33K47j64N19P34J754j491M76Q58k381
14566A19j128L637O92k355Q03K368j72m014L686l554M17L657K899L562n236m145
14550A236j350j042o882o80M574M089j230l380l333K8o454M30K997N424N579n58
14534e52o42r82l34M24L11J515j841n688K698P583M5k778O517k782m046J0211
14518I659O660j0263j0592l142K147Q445j105P75j326j202j760L059J1886j195
$$ y = [-5862, -7467, -9921, -3086, -1361, 1666, 8788, 9144, 11562, 4980, -1079, -2516, -4401, 2078, 8261, 9478, 5057, -2240, 15, -2110, -1571, 171, 2870, 10258, 12737, 10181, 7570, 1065, 491, 1127, -360, -6458, -10416, -12029, -13743, -8019, -12774, -7670, -502, 2842, 2737, 3188, -1023, -1224, 1516, 1993, -4913, -7694, -12395, -12011, -12633, -8273, -157, 300, -433, -186, -350, 169, 903, 2657, 1166, 1642, 2500, 119, -1009, 2628, 3320, 965, 1768, 4136, 3964, -50, 3636, 82, 499, 4156, 7055, 10617, 5381, 1236, -114, -1156, -8038, -8718, -4144, -55, -1285, -4665, -7998, -7970, -14424, -13994, -10997, -5573, 6, -552, -1194, -2176, -2510, -2086, -1775, -260, -2101, -7789, -5091, 2492, 2537, -241, 6276, 3494, -552, 9659, 16319, 6056, -4536, -7678, -5531, 2914, 1809, 2584, 1258, 56, -1704, 1355, 13241, 12046]
14504A2046o469n012q083J087K806K622J848j414O17j687m49K400j379l847q567
14489a3481j255O792N419J218Q094l534j0432j765l311O237K243k562k546M44
14475h439j703N06M396K579K259J421M070M288m442p588m356m90k73j628r70P348
14459c022L733m701j823M02p902l938L532P480l248o611J337n685M77Q094N700
14444f175O483k80k387o126q5O015J388k922P324M578j678j465N513m005q925
14429b747o492j50N851J45l899m104J892L85Q314n42J39K13m033l792k353o92
14413a1865Q093J0395j419n10o750o023M401J0301J97K258n597m189o236L5J011
14398e898O993O526j262L5m226m480j123m532k85j05j083M192J455J713j344m822
$$ y = [12046, 5577, 565, -7518, -6431, -3625, -1003, 845, -569, 48, -1639, -2088, 312, -1067, -4914, -13481, -14736, -7944, -2525, -1307, 6787, 3253, -7179, -8944, -12255, -6018, -3775, -6337, -8883, -8439, -10142, -9636, -5240, -2661, -402, 1019, 5089, 9377, 4935, -2653, -7009, -7499, -7772, -9400, -10370, -3022, 711, -3990, -5813, -5411, -13313, -17251, -13719, -6239, -9487, -16098, -14761, -20446, -19969, -11875, -6175, 308, 28, -2359, -8485, -8570, -2555, -1167, -4089, 3235, 7813, 6135, 4670, 10183, 6178, -2747, -9239, -9389, -3538, -3393, -7292, -11396, -9504, -9119, -805, -1347, -1208, -995, -5028, -8820, -11173, -11865, -3772, 6623, 5204, 4694, -2056, -8079, -3678, 6623, 6820, 9078, 3481, -708, -6944, -6909, -5898, 1095, 7621, 6359, 6394, 2168, -2312, -3435, -7967, -8252, -8357, -9440, -5248, -3793, -2080, -3424, -8246]
14382h246J948j603L894O536k055l180m315K568N437N049J316j847k524k236K292
14367C034j103r0K862Q78L485n726m184L97K488N702J996k145l825K95M859k464
14351F459r803O774Q60k593l636k169m068k231Q923Q687M31n897k380J612L644
14336D613J714m228J247J416l185j548q276Q84O128O669M95j0980j754J794m731
14321i742n966M447L06q84Q226O662K1r320l884J331o81P025L604J158l166j421
14305b284o527P05J106k398m323R549P04l306L717M493L84J577K837j984m671
14290d21m355M89J201p307K341L825K868J777o446p626Q319N923K770N97n10j543
14274A902J5m10J171O84N32k371j3645m011M661M297L558o308P753J0256l621
$$ y = [-8246, -6298, -7901, -4007, 2529, 474, -2706, -7021, -4453, 984, 6033, 7349, 5502, 2978, 742, 3034, 1931, 1841, 4703, 5581, 9066, 3340, -844, -447, 2041, 7743, 9739, 7594, 3769, 4064, 8923, 6459, -3344, 3430, 4290, 1697, -1939, -4108, -8176, -10407, -1484, 7203, 7634, 1737, -643, 969, 4613, 6327, 2099, 3346, 4762, 1577, 29, -8247, -7363, -1235, 5434, 5929, -5051, -6805, -5011, -9742, -15708, -11261, -10955, -11839, -3613, 3049, 3070, -6250, -10134, -8803, -9484, -2459, 1145, 2303, -863, -2284, -8811, -8106, -7000, -9398, -13721, -4172, -3468, -6774, -3057, 1436, 1820, 3397, 6234, 4250, -421, -4776, -4287, -3086, -10393, -8052, -4227, -1359, 418, -6028, -13654, -5335, 588, 3358, 3955, 3445, 1902, 1917, 1507, 2678, 3362, 3894, 1523, -12122, -16133, -11472, -7175, -3617, -9925, -2172, 8084, 4463]
14259D463M99J371N411n246J716Q45m846k514N598K2k622k984n989k66P021O76
14243C155r68J205L809J17j342R64m272l388k363l982q54O340O636N800K197N318
14227A8372m423n430n875K512j972l485m157J694p034N119Q347m104n296L926
14213a806L494k704k713l580P033J568o131J305J510n48q7o24Q781J285M287K218
14197A3288k979m397o791m922K184j876j879o4L438l734O625o23l762K582N21
14182b389k0m6j406M22L177L52l05L634p47q07n84L786j850m313p483p621P048
14165i152N304j38k00L754j006n88k60P920k350J518J259r505l580L059L233J965
14149A233l556O00j598L105k550j28R762O767j628l448k622J93n236k886n339
$$ y = [4463, 4962, 6333, 11744, 6498, 8214, 9059, 4213, 1699, 7297, 7319, 4697, 1713, -4276, -4542, 2479, 3155, 2187, 3392, 7201, 7318, 5976, 6940, 2668, -720, -3083, -7065, -7919, -1579, 5057, 10857, 13054, 18372, 13949, 8519, 2644, 5156, 3184, -301, -4458, -2764, -9798, -4679, 3668, -436, -5732, -1806, 1688, -1016, -3729, -7309, -276, 1292, -4839, -3534, -2024, -2572, -2659, -3283, 5498, 6783, 11070, 13288, 10309, 5912, -879, -5801, -3617, -5493, -7372, -7436, -3998, -7732, -1107, -1730, -5492, -2910, -2389, -2409, -2455, -3861, -3439, -262, 90, -215, 3419, 2672, 1865, 1281, 5067, 3217, -1096, -8579, -16200, -9152, -3848, -3986, -4186, -432, -1438, -2026, -2286, 5634, 3284, 4802, 6061, -3444, -7024, -3965, -732, 1233, -2323, -1723, -3321, -216, -2766, -2894, 6868, 13635, 12007, 8559, 5937, 6130, 894, -1992, -7331]
14134g331k080o739k998Q579R396J459j805K960J328j629n040J095M270J968p737
14119d304o369N744j681L985J2910J369o499p839j89j554N65N187q78K726K975
14104F148L847j47l963N02n100k189K56K893l58J593L445m027q321p6P686P321
14088I510K610r239K2M246q38m66J671j175k358L560N464j453k017J006n569l432
14072A542o79k3O767L857q70l317j498J445R04K897n031L08R21q328o574J255
14056f424L985L313N624k568n54j803O48P03J309N114m776j1356m067k671l773
14041a7296N377P241j185m707J729L257P348l872j346J972l38o869M546L644l806
14026d305k052l244P914M769N019n7l397o132n712M968K347R13K691l243k145
$$ y = [-7331, -9411, -16150, -19148, -10569, -1173, 286, -1519, 1441, 2769, 1140, -3900, -2805, 1465, 3433, -4304, -10673, -4929, -6610, -2625, 10285, 11654, 5155, -2684, -2873, -4427, -3862, 1325, 447, 3173, 6148, 9995, 9848, 5885, 6387, 1287, -902, -646, 2247, 1889, 3482, 6927, 2900, -5421, -5497, 2189, 9510, 12120, 2881, 2903, 7149, 6311, 5845, 7516, 6341, 3983, 7543, 13007, 11554, 9537, 10543, 4974, 1542, 863, 840, 7607, 11464, 10594, 7277, 5779, 7224, 8128, 11025, 5994, 6302, 7223, -1105, -7679, -6424, -2439, 874, 6498, 3930, 3376, 1573, 2221, 2924, 4233, 9347, 4571, -6785, -10852, -13523, -17296, -11919, -4678, -5863, -10570, -8841, -5584, 1764, -2108, -3454, -1482, -1820, -8689, -4143, -499, -4305, -6357, -9601, -1687, 3082, 8101, 8044, 4647, -1485, -7197, -2229, 118, 1031, 3722, 479, -1666]
14011a666j881n469j718P078O459p331Q75L916L967l041o271O023N449p732l895
13996e237N75o79j737k811P693K380l322L133O281q78m409k838k467L014L395
13981B093K783j667o519J79r55o17O306n037o319l170P744R830L383K287O154
13966A6475m641r791m171K376k047m790J657M417k396q825m034J579O453Q584
13952H46N805j784r80K133J59J676j39n25j387R143M085o885q463K63j162p463
13936d678k847O620M797j445k423l593K3M238Q47j082k473K812k415K926O124
13921G431M335K71o754n252r94j975k857m88N252m274l558M970K384M449O964
13906I904n405p225k759j287M574K030k736o005K386M333M128l218n438J079Q860
$$ y = [-1666, -3547, -9016, -10734, -3656, 2803, -4528, -3653, 263, 4230, 1189, -5082, 941, 6390, -1342, -5237, -4662, -5341, -7078, -9889, -2196, 184, -3138, -5, 6276, 5398, 989, -1849, -4316, -1302, 2093, 4876, 3209, -3310, -3131, -4086, -4703, 1603, -3434, -9753, -12923, -5179, 4651, 8034, 10321, 16475, 11834, 2043, -2128, 248, -1799, -6589, -4932, -515, -2911, -11736, -15770, -14191, -7738, 846, 6651, 4867, 3887, 6020, 6179, 7855, 7716, 7191, 5804, 14947, 19032, 12147, 3684, 3947, 2785, -4678, -7525, -905, 3892, 2447, 24, -3569, -3546, 692, 1539, 457, -2016, 796, -1619, 1307, 7431, 11766, 12037, 5283, 31, -963, -2938, -5795, -6283, -1031, -5305, -8863, -3893, -1509, 2940, 9904, 4499, -2726, -5485, -6772, -2198, -168, -2904, -8909, -6523, -2190, 1938, -1280, -6718, -5639, 3221]
13891C221N144j07M89k803O239n541m527j522k3K895L706L608k599P36p162r74
13875G80m592j650O645j253o233j8P89k168l247Q64O312n966O851N420K18j914
13859H38l925j897r077o829J961J2414R16K653Q81L373M004m342k335N07k968
13844c826l872N378r36O159O65k113K217M935J538L992L378k557o491M847k364
13829A0950m334r03J999m825k881l360k207J09J775J55M596M472k755n976Q7O586
13813C488N058J532j71n565l117O961J123l222n008n440L630Q511K688p716l306
13798e54j581l75m227L414J244j723Q428Q534j302q713k727L968K576L39r911
13783b610K940L29j606o536N164M824M600k976L311L455j92n843l495k759M552
$$ y = [3221, 8365, 8258, 8747, 5944, 12183, 6642, 2115, 593, 570, 3465, 7171, 10779, 8180, 8916, 1754, 780, -3812, -5462, 1183, -70, -6303, -6321, -5532, -7700, -10947, -10083, -3771, -9737, -2886, 2534, 2752, 838, -3087, -4984, -14061, -20890, -18929, -6515, -5599, -2946, -2065, 1308, 5312, 970, -1365, -858, -3826, -7698, -2320, -3256, 2903, 3568, 1455, 3672, 8607, 10145, 14137, 17515, 14958, 8467, 13314, 10950, 6616, 5713, 7712, 2887, 6, -3354, -5561, -5452, -3677, -3522, 1074, 5546, 2791, -3185, -3098, 3488, 8546, 10078, 9907, 4342, 1225, 8186, 9309, 6087, 1079, -4361, -731, 7780, 10468, 2752, -554, -2135, -2510, -6737, -3323, -2079, -3802, 4626, 13160, 11858, 3145, 418, 4386, 6962, 7301, -2610, 330, 659, -947, -7483, -2319, 2505, 7105, 4129, 7440, 10895, 10703, 4860, 1365, -1394, 3158]
13768C158p070j2582J498O019L194M708l358p89k624j513L364n559n1k31j16k67
13752a2219J658J606N537M707O164J678r076l013q60K677O966O745o402o156k828
13737b816J528K844j499k017j55M021N200K08k801J99k1o375n643j387N285j280
13721d709o113K232K585m137m70O603Q26m33j139J681Q89K497j393M518K760q62
13705E335l763j67o92j167j872J413P35q545M164m151n550Q776O255l441P81Q571
13689F682L644o859m742L50O83p428q405J3583J6629l005j4000n241M100N832
13675A823K00K49l595o328l402Q44P83K228k397r58J272Q50Q509J254M15N208
13659F955l591k339K504j4j2572n026J543R550Q955J632K828K750k728K39m285
$$ y = [3158, -3912, -16494, -14996, -8977, -5783, -1075, -4433, -5222, -7846, -9359, -5995, -11554, -11605, -11836, -11952, -12219, -10561, -8955, -3418, 1289, 7453, 9131, 55, -2958, -3818, -1141, 5825, 12570, 6168, 12, -2816, -1288, 1556, 57, -1960, -2115, 1906, 7106, 7314, 4513, 4712, 4691, -1684, -7327, -8714, -3429, -4709, -10822, -8590, -6005, -10142, -10612, -4009, -3183, -3616, -4755, -3074, -2185, 312, -1081, 3437, 6197, 5335, 1572, 1405, 713, -454, -2326, -913, -178, -8723, -4559, -8710, -14260, -5484, 771, -2670, -1889, 6682, 10326, 3467, -1275, -925, -242, -7670, -16075, -2492, 14137, 11132, -2868, -8109, -4009, 1823, 2023, 2272, -1323, -7651, -11053, -10209, -9426, -7198, -9595, -10553, -9281, -8431, 78, 1332, 1747, 6955, 3364, 1025, 3529, 3515, -9057, -14083, -12540, -2990, 5965, 7597, 10425, 13175, 10447, 10686, 6401]
13644F401p920k493K05M853P743j315n639m0K790J052M084n518m624N963J516
13629G058n788M945N245n604Q65m62q907p720m058O266M782M834N705o599n89
13614b7K072j530l094L103l208K17L649N801O46j735o530J672k747L609O837o345
13598B390l722q83j858J0260J404k495j750l103j378M580K435j403K227j481l547
13583A676j551m13k467L414L621N041j217q192N34L989J259l86k60o151q903p337
13567a7343O534P298n09k802K938K542L912K448n355O026L413R54k381J434j743
13552G366n573n567l144j133K183J64l976M461K987J448l244K769N33L738K112
13537E124j039K993O175o495j356o959Q76L799J053l990m54M56K919J505j053
$$ y = [6401, -1519, -4012, -3807, 1046, 8789, 7474, 1835, 1795, 4585, 5637, 9721, 4203, -421, 5542, 7058, 1270, 6215, 11460, 5856, 6721, 6259, -2648, -10368, -14426, -8160, -3378, 1456, 7161, 562, -27, 2045, 515, -2579, 524, -2684, -2467, 1182, 6983, 7629, 5894, -636, 1036, -1711, 1898, 8735, 2390, -1332, -2215, -4073, 6187, 7591, 5096, 3346, 243, -1135, 3445, 5880, 4477, 6704, 5223, 1676, 125, -288, -2755, 659, 4280, 9321, 8104, -88, 446, 4435, 5694, 5308, 5048, -1103, -10006, -17343, -10809, -3511, -4020, -6822, -3884, -1342, 2570, 5018, -337, 5689, 9102, 10056, 7675, 9109, 7366, 1793, -3774, -6918, -8051, -5868, -5704, -9680, -5219, -2232, -784, -4028, -1259, -726, 3012, 5124, 4085, 7078, 13253, 6758, 5402, -1557, -681, 3118, 4171, 181, -273, 183, 3102, 4607, 3554]
13522C554K631O67L832J72j581j1361l758L364L788J801j327k992k897J287K411
13507d09k764r85J294K743J77O591M937M74p344j1994L837J835l207L142O551
13492D878k540j050k001o359n055L460k668M80K49k175J626L486J0285K005k280
13477B341p07p204k069q415J988Q456P148J401k340o225L280N182L960k839p316
13462c359n555p136n2J0379N352j367J853L741m429n919l643L19L955L013r60
13447c808K678l051m905N104q56K023j049K657M779O154p32j046n09n687j138
13432F14K593N020o144r969p472K89O964O92L279J0932j280o951q599k709J056
13417a1685J06Q504l12m065M942P755m48n77J506k631j046p76l666P029L736l969
$$ y = [3554, 6185, 6852, 10684, 10856, 9275, -2086, -5844, -2480, 1308, 3109, 1782, -1210, -4107, -2820, -409, -3173, -4158, -2864, -121, 56, 6647, 11584, 12058, 4714, -7280, -3443, -1608, -4815, -1673, 4878, 2338, 1288, -713, -7072, -12127, -8667, -11335, -10855, -10606, -12781, -11155, -7669, 2616, 4621, 2341, 1634, -5570, -7639, -16054, -14066, -5610, 1538, 2939, 599, -5626, -2346, 2836, 6796, 3957, -3359, -8914, -16050, -16102, -5723, -371, -1738, 115, 3856, -573, -6492, -10135, -9816, -5861, -2848, -3808, -1130, -4181, -9086, -3982, -4838, -2815, -3864, -1207, 3572, 9726, 8994, 7948, 7439, 1752, 614, 3207, 8227, 2083, -7886, -15358, -15069, -8105, -7413, -4134, 6798, 5518, -1433, -10032, -12741, -11685, -11579, -3075, -3387, -7452, -2510, 5245, 4797, 4220, 5726, 3095, 2049, 1273, -2393, 4636, 8372, 4403]
13401D403R40L995N61K661M021J768l780l924k134k089J284j211Qj394K995o673
13385A431k792O200L090j127m756r55n666j040N19L249n908n349Q051Q127n580
13370b506m930M180j244j641J1884K042j067J663m573r96N990j860M435l135j0445
13355b203J66K877K142K720J793q4m946j406m44k483l413k470j007Q14J0365J42
13339B563k343K559J496J058k905K064K584J485O66L032n925L024k100J322O293
13324A4873n188O35L64j423p06l244j190O29K750k844k965n533l067L507K089
13309a313J488m046j735R09J0578L358p915q364l810K611R152q95o482N15Q868
13294B919l47L272M078L297l362n113n340q680N75J140K368O87l587N044M618
$$ y = [4403, 5343, 9338, 9899, 12560, 16581, 18349, 14569, 10645, 8511, 6422, 7706, 6495, 6503, 5109, 8104, 1431, -1361, 4839, 7929, 6802, 2046, 1091, -4575, -5615, -5096, -1847, -7755, -13104, -5053, 3074, -2506, -7436, -3256, -4500, -6141, 5743, 7785, 6718, 8381, 3808, 2812, 8802, 6942, 11377, 8242, -2203, -2037, 840, 2982, 5702, 7495, 7411, 2465, 1059, 615, -1868, -5281, -7751, -8758, -7944, 2421, 2563, 220, 2779, 4275, 5333, 2428, 4492, 7076, 8561, 9227, 12259, 6334, 9358, 7258, 8580, 14873, 9685, 10320, 10684, 9261, 8555, 5311, 4121, 4750, 7500, 4656, 1691, -3842, -6909, -3402, -1313, 175, -3871, -5606, -4697, 5881, 9239, 1324, -7040, -10850, -8239, 913, 18, -6464, -5949, 2919, 2572, 5844, 9922, 13219, 9857, 4744, -596, -9276, -8701, -7561, -5193, -4506, -8093, -3049, 1569]
13279A569Q05L229j081M932k717p349K894p90K52O950M306O352j0191q610k239
13264a688k181q849K303K259Q14l43J838o6N366N477l169j472o36J654k615j55
13248a463j275j269J125L303O20P760N21m217n205K966M978j795p248k315O74
13233b840N666M155j129l198J209M868N160K282q80j656L27n007j267J996M436
13218A4122m072l349J814l73L70J888j941l904j103K168K261M522N153o117p132
13203D307j255m269O51J654L249o70K033K135n026L282O816n087L335n082j0654
13188d581M67L974k549L538o363p588R463M50Q84J094k504j698o627K605N371
13173d064j320k954K482P034l76j612J412J581N189j016K50n138k345j24J3803
$$ y = [1569, 2374, 5603, 4522, 9454, 6737, -612, 2282, 1492, 1744, 8694, 13000, 19352, 9161, 551, -1688, -3869, -12718, -10415, -8156, -7342, -7685, -5847, -5913, -547, 4930, 1761, 289, -347, 1307, -1308, -1463, -2738, -4007, -2882, 421, 1041, 8801, 9322, 5105, -100, 2866, 7844, 6049, -1199, -3514, -2840, 2826, 6981, 5852, 2654, 3863, 8731, 13891, 16173, 15293, 13637, 13964, 8957, 7690, 9686, 14122, 10050, 6701, 8515, 8142, 8512, 10400, 8459, 4555, 3452, 5620, 7881, 12403, 17556, 11439, 4307, 3052, -1217, -566, 1088, 4337, 3667, 5700, 7835, 2809, 6091, 12907, 7820, 11155, 6073, -4581, -4114, -140, -2689, 849, -5514, -13102, -3639, -3189, -2305, -1211, -3715, -5413, -12040, -9435, -4064, -5384, -8338, -5856, 1178, 802, -810, 602, 2183, 7372, 6356, 6606, 1468, -877, -1001, 12802]
13158A2802J733q411l854m083o069k258J098l080J201k389J403N445R871Q778
13144A2187j778m826k524M202J910k281n031J505Q060M011l996q436m560k592
13130d149N047O216n488j665N805l97n835k944m028M202K29M65J0370l77k978
13115D473N37q69l155n30P29l881J351j216K127m687L403P919K045n570k440l320
13099c084m488k3N577N183J082m792N472L244J334J116l744n345k313M163j774
13084A608n453k493K271l445j302M124L608l203n278n101M825N079j469M327k150
13069d052K24Q085L105j111n932o88n121q111L135J052M70n542P309O444j996
13054b729r18M849O34k282k533r083O36m261J261R127M187M268n091r754P045
$$ y = [12802, 14535, 6124, 2270, -1813, -7882, -10140, -9042, -12122, -10921, -13310, -11907, -6462, 3409, 12187, 10409, 5583, 3059, 7261, 9171, 6890, 1859, 3364, 11424, 15435, 11439, 3003, -1557, -4149, 898, 7114, 1626, -39, 5766, 5369, -466, -3410, -7438, -3236, -3007, -2542, 7828, 7451, 4473, 5010, 4141, 986, 456, 1185, -2696, -1345, -2561, -434, -5121, -1718, 6201, 8246, 2676, 236, -3084, -7572, -7595, -2018, 3165, 4247, -545, 4927, 8171, 9505, 10621, 6877, 1532, -781, 3382, 1608, -3845, -6338, -4067, -7512, -8814, -4690, -1082, -4285, -9563, -14664, -9839, -4760, -6229, -1902, -4052, -3828, 4257, 7362, 6251, 319, -369, -5490, -13601, -10466, -9414, -8944, -14486, -7177, -733, -2729, -3647, 1202, 1836, -446, -2979, -12062, -11426, -15687, -14426, -5299, -1112, 3156, -1935, -11689, -4644]
13039d644J0132k717l75m118l964m817J4297L74m579Q90k863j1322M029O793J963
13024i21L057K1k904J453N087k555k380J297l42o36J255l79N350J706j409o46
13008G054m841l052l028m06O21q88k389L05j341Q390k567K325N10l790m10R014
12992E507M239j361q1O77l99k300l166p670j96K95n86L469J035J488p6o186K964
12975b347k390r63K978L392M17m52J753J177J781P988j226n060K514k3k148o678
12959G13p532O12N176L74l859r99l142o61o47o92L572N575j656j622P391P64l284
12942H3j049l321k373N289P92j1778l020N810J3954K262k413n951o216J583P020
12927F72J799j365m133k062j296L951k877O24M621J0528N812l078o295p918M42
$$ y = [-4644, 5488, 2771, 2396, -1722, -5686, -10503, 3794, 4168, -411, 479, -2384, -13706, -9677, -2884, -921, 2136, 2157, -747, 706, 5793, 3238, 858, 2155, 1813, 1177, 2432, 2053, 7403, 9109, 7700, 7054, 2213, -839, -3867, -4273, -3652, -4540, -6929, -6624, -7965, 425, -2142, 183, 693, -3097, -3507, 5507, 9746, 8385, 8304, 8981, 8582, 6282, 3116, -4554, -4750, -4455, -5041, -1572, -537, 951, 875, -5311, -2347, -4737, -5700, -2722, 670, 1087, 635, 2388, 3565, 5346, 13334, 12108, 7048, 9562, 9539, 7391, 713, -6819, -6207, -1031, -657, -4516, -5515, -8657, -9318, -9965, -10657, -7085, -1510, -3166, -4788, 2603, 3367, 83, -966, -4287, -6660, -1371, -579, -12357, -15377, -9567, 4387, 6649, 4236, -1715, -7931, -6348, 672, 2471, 1106, -3027, -5089, -6385, -2434, -5311, -4687, -66, 10462, 16274, 13196, 6901, -1017, -575]
12912e75P549O166l830j0378p55l725L541L402L342k293l354n115P154m841L50
12897c362N105O797l216l138j004n467j628K635J631J655O448p59k160m025n57
12882a045o387k139N738Q368R74j649K160o395j071K354p233J061K420J075M101
12867B332n07l126L762L498K565q86P85l022j3091p519L278R61l569P539L779
12852c221j938N948n253j435n61R91L592n833q94L563o96m675Q38Q630M188k089
12836A155j0798l824N168J2297O777k37n785m161l231k879J720L351O84q107L7
12821g833R650N158N54n046q074J425O69L569P225M568p92j426j586L268l351
12806G978l217j160m367k241n616k919Q346K546j563l188J79M518n717O453L085
$$ y = [-575, 6974, 13140, 9310, -1068, -1823, -5548, -2007, 1395, 4737, 2444, -910, -6025, 1129, -3712, -3362, 1743, 8540, 5324, 2186, 1182, -4285, -5913, -3278, -1647, 8, 6456, 5697, 3537, -488, -1045, -7432, -9571, -3833, 4535, 5509, 3860, 6020, -375, -1446, 908, -6325, -5264, -2844, -1769, 2332, 1825, -1301, 2461, 5959, 8524, 7638, 8423, 5401, -7690, -15209, -11931, -10970, -14539, -7000, -3221, -5159, 789, -4464, -5899, -6460, -5469, -1877, -7710, -8604, -5041, -5737, -10412, -9574, -944, 3244, 1155, -9643, -13467, -8299, 3998, 10775, 10538, 4753, 592, -2639, -5518, -3798, -447, 237, -7870, -7833, 1817, 6975, 7529, 2483, -5591, -4166, -3497, 72, 7297, 11865, 11073, 9647, 8061, 11329, 7978, 4761, 3601, -766, -3007, -8623, -11542, -3196, -650, -2213, -5401, -5222, -704, -6421, 32, 3117]
12791C117m322M892j625K447j249k726J120J408M617k773M779L461o890r604j065
12776d413M90l27K875m4L048N190k491L366l045k2l092o369M860p6n529l797K383
12759f993l220J394M093Q698n34o358p061O207L456l112K046J878k626K939k508
12744a701n846m716M385L145L491P433Q98m382l613m48N872l077O826P803K710
12729A8780l540j2990p429l870j30M194K053R561j939Q38L852l779q523K421P334
12714F833j344j563k739j994Q32K21n629J412k727k086q11J1819j377o878M667
12699a364O730L552M088o942n26K874j209j331n81j1740l497K216L072M09n7K163
12683b143N927p73J769k541K19l556r692J716R410N256o712K952l036N00N346
$$ y = [3117, -1205, 3687, 2062, 4509, 3260, 534, 1654, 3062, 7679, 4906, 9685, 13146, 6256, -3348, -4413, -3923, -4250, -1375, -1419, 1629, 6819, 4328, 7694, 4649, 4627, 1535, -4834, 26, -50, -5579, -9376, -6993, -10213, -8819, -4726, 3972, 3438, -2920, -9981, -3774, -318, -3430, -1384, 494, -2132, 807, -1701, -7547, -12263, -7878, -4733, -1242, 6191, 7089, 2707, -906, -1354, 4518, 1441, 8267, 16070, 18780, 15240, 2250, -5179, -9049, -9179, -4985, -2932, 6629, 4690, 5528, 9380, 5601, -2922, -501, 6833, 5489, 3926, 1187, -807, 25, 246, -5383, -3971, -6698, -8784, -9595, 2224, 847, -6031, -1364, 5366, 8918, 13006, 6064, 5538, 8412, 7203, 5872, 5291, -6449, -9946, -7730, -4658, -4249, -4306, -2143, 3784, 3011, 4780, 2239, 2458, -1098, -10790, -9074, 336, 5592, -1120, 1832, -1204, -704, 4642]
12668D642l848R45J08J235J447K064K118k013p151l48L572m512k543N906P014
12653H636M844j666p916q547P570L843m676k892K093J0483O795m018o309l712
12639D528O76j507m082M634j94k234l378n361K750L948n90M043j778N278K655
12624I388m93J0584n969r325K731P596K413k053n239q187r19K826O313l08l027
12609F331n08M50o11P50m476K36o929n875k498L134J633P690J1600o56q709L544
12593E106O28o910J866K613m529r99J152M758L349K738n824J970l46k448j656
12578A468n39m130J989r65n88M803O73j739l059M10N318q78K760M31L541l777
12562E718j3p93j0794p302J1087M015r4L111N18N690L271K559n140k238k172o722
$$ y = [4642, 794, 1739, 1847, 3082, 4529, 6593, 8711, 6698, -453, -801, 2771, -1741, -4284, 1622, 8636, 13480, 11814, 3898, -4649, 2921, 6764, 2088, -804, 1289, 11772, 18567, 14549, 8240, 4528, 5204, 3697, -385, 4249, 4055, 1821, -1557, -6918, -4168, -220, -810, 3233, 1455, 6733, 9388, 8895, 19479, 13510, 4185, 6916, 14512, 16925, 14872, 9633, 1446, 527, 3353, 9666, 9358, 6331, 5823, 6273, 5662, 6412, 1936, 2172, -4757, -10632, -13130, -9996, -8363, -673, 10927, 10271, 1562, 5106, 5734, -1176, 690, 3303, -1226, -2225, -1073, 3685, 7034, 9772, 3948, 5918, 5572, 3124, 1468, 929, -3201, -1212, -2177, -2765, 2038, 2711, 972, -2087, -1677, 3641, 2763, 5523, 5954, 9495, 5718, 5705, 4912, -5882, -13184, -2097, 1918, 1824, 4935, 5453, 11143, 14414, 16973, 11833, 9595, 7423, 701]
12546G01l909K550k558j798M116K847N045Q065j33m783J237k028k18o25k965l778
12530A766L427Q55J536n671r76J072M421J506k960M304o786l956N881M439N06
12515I364l142l812R77O84n526O221J802k788M421L508J10L002N163Q70m138o171
12499A0545j158j4907n234J308Q626L833j739K55l779K896J0843K044n625j312
12485F596k014L013l945k982J846k406P352l164j0249J698J2015l281r601l472
12471h594M682N495L496O026r30j460j991o555l111M880J254k14K785J327M029
12456A1119K865k392l837Q271N636o524j0793q100L560O695M732n67q612M17q097
12441e627k169j001N372K068L036J217l843m259l645N797Q466L971L377l450n245
$$ y = [701, -3208, -658, -3216, -5014, -898, 1949, 6994, 15059, 14926, 10143, 11380, 9352, 9134, 8509, 5544, 1766, 5193, 6048, 7584, 1913, 937, 2009, 6430, 7936, 4976, 9280, 2494, -1462, 4419, 8858, 9364, 6222, 2410, 3387, 4071, -1455, 4766, 6568, 3780, 8201, 11709, 11819, 14821, 19984, 20854, 16716, 10545, 9387, -5520, -10754, -9446, -820, 3013, 1274, 1529, -2250, 646, 11489, 13533, 7908, 6596, 4582, 7595, 3650, 668, 2514, 108, 7460, 4296, -5953, -4255, 7760, 4479, -5122, -8594, -3912, 1583, 5079, 11105, 10175, 8715, 6724, 169, -2942, 1938, 3192, 2978, 5763, 7090, 11119, 13984, 11592, 7755, 16026, 21662, 15138, 4345, -3755, -195, 6500, 11232, 10665, 2053, 2470, -5627, -7796, -8797, -3425, -1357, 1679, 2896, -947, -5206, -8851, -3054, 5412, 9383, 12760, 9310, 4065]
12426D065p95k015j456J830k67l344l557n56Q07L229j662RP937J299o208o22J05
12409a201L643N126k678j752K045Q847Q80Q08j092p095l136n303m664K230O945
12394C603n1L365L412L150O738k699p864J537K551L356M052j476m490o587m52
12379H145L545Q535Q69p253J409k277r683K18j36m384j924P756R64R20L090l642
12363F152n335N9L409O70O525L988l377k054o888K712K038P14j0021l926L984
12348a350L897j13r95J056J2j69K706J993l138m791R1n717R02N138R84j203K780
12331B083O303m993q615j628L640N974K684n03k313n13m17M85q37k301j653O921
12315D317K286k861m456l077m61k65j236m639P565L690j123L404M983J091n414
$$ y = [4065, 3270, 1255, -201, 1629, 1362, -1982, -5539, -6095, -5288, -2059, -3721, -3712, 4225, 5524, -684, -1306, -1201, 2442, 7568, 4890, 3138, 5183, 14030, 14910, 15718, 14626, 7531, 4395, -908, -5572, -3342, 3603, 3552, 6917, 10329, 13479, 20217, 17518, 9654, 11191, 13742, 17098, 21150, 19674, 15184, 8597, 8145, 11690, 20225, 21094, 13841, 15250, 12973, 3290, 3508, 3372, -1012, -2936, 4820, 5784, 6704, 9794, 6152, 817, 876, 4285, 4955, 11480, 15468, 12091, 10037, 3149, 5861, 7899, 8613, -1408, -5334, -1350, 2547, 2434, 1439, 2495, 2507, 2338, 5044, 7037, 3899, -892, -801, -6518, -5616, -478, 506, -697, 2083, 8386, 3393, -5222, -6850, -3210, 2764, 5448, 4945, 2632, 2119, 1702, 2187, 1350, -951, -2604, 4317, 6603, 3742, -714, -3791, -4252, -4517, -5753, -10392, -2827, 863, -260, 3144, 8127, 9218, 3804]
12300C804K337M268K846j822p197k446N71N455l597l077L519j215p492N529K060
12285C543J969k190M281J589o277r63K806L113l499j586j583J122N921M875K651
12270A5772L81k016N002N67m526l626r3l664p17L838J735R35m440k122k354o174
12254a502k778m719J506M001N74K143K544O855r3j0455m339J1773P332m118m044
12239D680q409k0M166M19N274K428j2549n868M685P205N638M194n811k122m443
12224e33N540Q156n49Q2L97m548J214K254M620M597M60l430k066j319k530P80
12208A3125q290n340n475k596m27K281L686L091J977J50K776J164K283J868j782
12193H491P76J692n359l007J056k9N887l78n565L471o821n729j884P393R525k054
$$ y = [3804, 6141, 10409, 13255, 11433, 4236, 1790, 2361, 7816, 4219, 1142, 4661, 3446, -4046, 1483, 3543, 5512, 3322, 7603, 9192, 2915, 1952, 4758, 7871, 4372, 2786, 1203, 2325, 8246, 13121, 15772, 16153, 14137, 19139, 19706, 15180, 11554, 11461, 7797, 7080, 10918, 12653, 13588, 9148, 7026, 4672, -1502, -4280, -8999, -7493, -3492, -2918, -775, 1769, 8624, 8531, -1924, -6263, 5510, 12842, 8724, 4680, -3729, -3749, 417, 836, 6110, 8538, -4011, -9879, -5194, 2011, 7649, 11843, 6032, 3910, -533, 5007, 13163, 12614, 12696, 13093, 8545, 9759, 12013, 16633, 21230, 21690, 18260, 16194, 14875, 12345, 13125, 4835, -505, -5980, -8576, -9003, -6722, -3036, 55, 2032, 2182, 4958, 6122, 8405, 10273, 8491, 9267, 10959, 5600, 2593, 3649, 3620, 9507, 9129, 3564, 7035, 214, -5515, -7399, -6, 9519, 7465]
12177G465j1n325L581N167K074N287o079n790J258p90J416q23m22J710j619k797
12161D302O60J822m510J522P91j206K640o70O49J075M899M150M25j1414p679L685
12145A141R324L257j401m40p193o958j835l74o15M694M433K761j952m232l397
12130b787L698q71N450M414r43K810K902l186k905j865j0714K517j182K431n9
12115b90k600L167K550k047o430N543L529K645L719M314l764j746N424k736n108
12100F170j627m93O92N712K676m630p234m266J388k89K531P682M652l058m830
12085E076m507m678L700K950P124K081j256J869k115K224M426R02m74r19r469
12070F934k368j094M346k778J709J461m968p947k285L534N531M297r4n092q843
$$ y = [7465, 7454, 2129, 5710, 10877, 12951, 18238, 12159, 6369, 7627, 6837, 8253, 7430, 7008, 8718, 7099, 4302, 4962, 6784, 2274, 3796, 4587, 3381, 6021, 5351, 6000, 7075, 11974, 16124, 16549, 5135, -2544, 1141, 10465, 13722, 12321, 11881, 4688, -2270, -4105, -4479, -5094, -400, 4033, 6794, 4842, 610, -2787, 911, 40, 5490, 9904, 8961, 11771, 14673, 11487, 8582, 6717, -3997, -1480, -2662, -231, -290, -2890, 277, 2827, 780, -5650, -107, 3422, 6067, 9786, 14100, 10336, 8590, 14014, 11278, 6170, 4543, 4050, 4742, 10454, 13130, 8500, 1266, -3000, -1612, -1901, 630, 8312, 12964, 9906, 5076, 569, -4109, -409, 2541, 9665, 11746, 10490, 12359, 10244, 12468, 16894, 17796, 17322, 16403, 6934, 4566, 3472, 7818, 5040, 6749, 8210, 3242, -4705, -6990, -3456, 2075, 6372, 6278, 1186, -7657]
12055g657l372J521P145L464L590O965k194q670K581o73k866k273K224M992J126
12040E903L728M69k212m189n994j286K439l371k673P941K32j480K934k658J448
12025A231J2024J570k930O86o408k390o752L988R073O079k828m612P47l976K379
12010G881j575k380n486K866O202m67m824m024O62M364N91N846N801m518l534
11995G405O11k758J8J638o247l25j835%J749J709j476J440j240P426K466K579
11979A3160J043n147p64M26p867Q23K238j826M703l960J092p8q30P137m96L673
11963A3327K922m833k44n395m220Q983l24j543k253n565p204N20K915j844m156
11948h914j493M743K573J085Q570j486j397N096K864Q06l322n747k900P3L744
$$ y = [-7657, -11029, -9508, -2363, 1101, 4691, 11656, 9462, 792, 3373, 2700, -166, -2439, -215, 4777, 5903, 9631, 10100, 7888, 3699, -2295, -3581, -1142, -4513, -7186, 755, 987, -493, 2441, -217, 1231, 13255, 14825, 11895, 12581, 6173, 3783, -2969, 1019, 10092, 16171, 13343, 8731, 9478, 5502, 7881, 6306, 3926, -1560, 1306, 7508, 7041, 2217, -1807, -1145, 3219, 3810, 9656, 15457, 10939, 7405, 8016, 5258, 5276, 6914, 667, 342, -1493, -1493, 256, 1965, 489, 1929, 689, 8115, 10581, 13160, 14203, 9056, 8292, 8718, 851, 1674, 3912, 2086, 6789, 2829, 3921, 3843, 3013, 10150, 9654, 13327, 16249, 11416, 11172, 5777, 1557, 10540, 10216, 8673, 6420, 855, -6349, -5829, -2914, -4758, -8914, -10407, -5664, -3091, -2006, 6564, 5078, 3681, 8777, 11641, 12447, 9125, 3378, 478, 551, 4295]
11933D295N612N239j020o49k965J427k882n129m501j601L625q09K133O559L516
11918A2850M521L280r461k439j0370l096l377o695m482J0910P122J444k140j167
11904c100O09K10l098Q111L461n974j490L118j60q966L490R015p99J631J567l484
11888D141l620K483m2m030J929P670k734j94L289j04q78l304mj152l520K10P125
11871G265P386J41m750L153J742L305P9k405l026l048j439j435K181m229k031
11856B889K244l461p207k16P798Q252K341M335j150j001L556o952k160O799J31
11841A6198p80p504m703L045K902q557o550m6M9J742N590J2944p859j1637j710
11826f876N783K742p727l467K745Q515M522n940n062K019M268J719o751n245K2
$$ y = [4295, 9907, 15146, 14126, 13477, 10512, 11939, 9057, 3928, -573, -2174, 1451, 642, 2775, 9334, 12850, 17371, 20651, 11190, 8751, -1619, -4715, -8092, -14787, -19269, -8359, -1237, 207, -1933, -3100, -2491, -2281, -5379, 2732, 6193, 219, -1271, 1847, 1687, -7279, -3789, 5226, 4427, 6058, 7625, 4141, 521, 3004, 2962, -1068, 861, 8531, 5797, 5603, 8892, 8788, 7910, 4606, 4602, 3450, -70, 140, 7265, 14651, 14792, 10042, 13195, 14937, 18242, 18321, 15916, 12890, 9842, 8403, 6968, 9149, 4920, 2889, 5133, 1672, -5535, -5751, 2047, 10299, 12640, 16975, 15825, 14824, 18380, 11428, 9268, 16067, 16198, 15418, 7914, 3211, 6256, 9158, 601, -5949, -5995, -5946, -4204, 1386, 14330, 6471, -5166, -6876, -1093, 1649, -6078, -9545, -6800, 1715, 6237, 297, -4765, -2746, 1522, 3241, -3510, -8755, -8733]
11811h733O940N608K123o612K41K774m550K612M186K88q458J472L034K489k032
11796A382n164K112L961O499L389l563m787j155j482n422N343O95K734P588K708
11781A4838P71l56m25n892k604j038l936j864L6k371l528K7K2p48J183o07K987
11764c505Q69J72J920J82J412j806J504p91R438l531L488r28K709J923l538m101
11748E417j493J893P56L706N54m94l77q132j481P32o023o25Q131P775K691l864
11732I166q7K90K254k203l026J718j802J470l737R22K371j0372k148J0819M874
11717A0509O075l170j686r502q136L65l235n20K517L32M327L923k554k49L20p3
11701g57l898k55O453R435o50L427r01p777L092o555l759P819K413p272l640r52
$$ y = [-8733, -1793, 3815, 5938, -674, -433, 2341, -2209, 403, 4589, 4877, -3581, -2109, 925, 3414, 1382, -3782, -1670, 2291, 8790, 12179, 8616, 3829, 2674, 1192, -4230, 1113, 1808, 4542, 12130, 14838, 15609, 15253, 14828, 8936, 6332, 5294, 1358, -506, -470, -2841, -6369, -6342, -6320, -7068, -5885, -6492, -3505, -2636, -2464, -544, -362, 1050, -756, 748, -43, 9395, 5864, 9352, 8424, 11133, 13056, 9518, 5417, 3924, 5817, 6573, 10279, 10833, 10339, 9962, 1830, 349, 1081, -4942, -5567, 2564, 10339, 13030, 9166, 9079, 9369, 11623, 9420, 6394, 8112, 6310, 7780, 4043, 4965, 7336, -3036, -5184, 5635, 10509, 16584, 13414, 11728, 2226, -5910, -5545, -8780, -9300, -6783, -6451, -2124, 1799, -755, -1004, -684, -757, -4655, -4910, 1543, 10978, 10328, 13755, 12854, 5077, 8169, 1614, -2145, 5674, 8087, 815, -2825, -3777]
11685c777O237P250L416n57M282m755k666l511K291M886l878p21l919n871L579
11670B286j754M067R084O269p991q837l37l615M052O094N032P80j61k16n83k417
11654A1753L918m758j5390l751O051P30L398M878k598m466O703R820M117j929
11640A8476l395q548J009N655k487q423K65k48K996k68K27j024l768j805K878
11625A540m516K930J887O787R994m089Q15k314l388l462o857j975L419M525L482
11610H778p16J171n194l333J341o410K397Q653Q026J533r39k472j635L476l34
11595A4342J109k507q129M188N35o06p219r469k764M011P940L647J128l762M63
11580B907L175M456O0n566j336R96K455K310n534j107L990l174J1619P270O1K850
$$ y = [-3777, 2460, 9710, 13126, 12569, 16851, 12096, 9430, 5919, 8210, 13096, 9218, 8497, 4578, -1293, 2286, 532, 4599, 13683, 19952, 11961, 3124, 2787, -828, 3224, 9318, 14350, 15130, 14969, 14753, 14170, 11753, 15671, 10913, -4477, -8228, -2177, -1447, 1951, 6829, 4231, -235, 6468, 16288, 20405, 18476, 15081, 6533, 7542, 13197, 10710, 2287, 2552, 2304, 5300, 5032, 5259, 4235, 467, -1338, 1540, -2976, -46, 1841, 8628, 18622, 14533, 15348, 13034, 9646, 6184, -673, -2648, 771, 5296, 8778, 8062, 9233, 4039, 706, 2047, -4363, -1966, 6687, 14713, 16246, 15307, 12835, 11200, 14676, 14342, 15451, 12944, 4815, 9003, 9538, 8932, 1713, -7756, -10520, -6509, 1431, 5078, 6206, 2444, 2907, 6082, 10538, 10598, 5032, 3696, 4692, 7147, 9457, 3923, 2816, 6806, 3632, 15251, 22521, 22582, 25432]
11564B5432l190j0975o591q57M117M467m232p64k300j87o828j19P727n602k290
11549b192P11L822M038L996O723P473j650n889J806o045k003l27K036m409l377
11534D713m749Q99M429L572j524o6K283J255l405k924P326Q89k089r74J457j437
11518I655m907k606J852j282L990R662M878n380p061l192N841M198o924n438R430
11503A2716l024l688K804k977j453p05l105L911J542m12k150O746L284o523n815
11488A151m151j778o66K324P527Q538j823o129J034p311n812J965K822K811L993
11473D495L918L43J744J314j978j151O71L295J456k556n054K856l226k695R14
11458D346j872M124J896K241K525m302m597J839M334J801Q646J058j70J930J15
$$ y = [25432, 22242, 11267, 4676, 3819, 7936, 12403, 8171, 7407, 5107, 4920, -1908, -2027, 5700, 98, -2192, -1481, 2341, 6379, 10375, 17098, 24571, 22921, 17032, 18838, 12793, 10790, 10463, 12499, 8090, 4713, -36, 863, 5292, 8864, 7340, 7274, 9557, 10812, 7407, 4483, 11809, 12698, 10609, 9635, 11092, 9655, 4748, 2142, 3994, 2712, 6702, 16364, 21242, 15862, 8801, 5609, 11450, 15648, 8724, 3286, 12716, 9692, 6004, 8808, 5831, 4378, 3673, 568, 4479, 6021, 5609, 3459, 10205, 13489, 6966, 1151, -3000, -4778, -5444, -3120, 4407, 12945, 11122, 4993, 6027, -1284, -7096, -5131, -2309, 502, 4495, 8413, 8756, 10500, 11814, 9836, 8685, 9356, 12651, 14107, 11551, 6497, 9353, 6127, 3432, 4346, 2474, 6598, 8494, 10735, 13260, 8958, 4361, 6200, 10534, 12335, 20981, 22039, 21869, 23799, 23914]
11443B3914r610p392o615L866P963O084K854p000j292k650j441K126L099j373
11429A2533J60k810m003j282p450J561J0935j428n80k953R26P004P33l67L76K976
11413A6331m126L196P36m172M323J186L34k668k661k897K954l407p699K234L024
11398F688J080n336j544L924O473n52o672J849N20j139K893p24J621p65J139J243
11382A0698J493L69l030K568n790k548j22k158N315j821o475J076Q35M24O008
11367F842K347L234m925p227M608O535n282J032K327l769j004M320L388p582p254
11352b410N706J0708N842q199q498J043k088m888M226M503q939K077J0774k483
11338G374k550K573J513N200O615P016M44o71k658l13k566q534m429j200k261
$$ y = [23914, 14304, 6912, 297, 4163, 12126, 18210, 21064, 14064, 12772, 10122, 8681, 10807, 13906, 12533, 12693, 9883, 5880, 4598, -2852, -1291, 9644, 8216, 7636, 4683, 5609, 12613, 13346, 12979, 13355, 16331, 12205, 15401, 16137, 11965, 16288, 17474, 17808, 15140, 12479, 9582, 12536, 9129, 1430, 3664, 6688, 7768, 2432, 888, 4812, 11285, 10733, 4061, 5910, 6430, 5291, 8184, 7460, 9081, 8316, 9455, 10698, 12191, 12560, 9530, 12098, 6308, 3760, 3638, 1480, 6795, 4974, -1501, -425, 410, 834, 6842, 9189, 12423, 7498, 271, 4879, 11414, 6132, 7164, 9491, 5722, 4718, 9038, 12426, 4844, -2410, 3296, 14004, 19846, 11647, 3149, 4192, 2104, -2784, 1442, 5945, -2994, -917, 9857, 7374, 4824, 7397, 8910, 14110, 20725, 27741, 28185, 27514, 24856, 24543, 21977, 13443, 9014, 7814, 5553]
11323E553L060J728l99o65K125L401N826L929o533k530m621O85L816k878k249
11308A0248M054M212m865j1724L638r40n27K819N262Q001L355p704o32k314k655
11293A0228o473r670j379N987O452M842p54R08L764q00r946L857N557n653J560
11278H480M808L376j195o648p06j050q65P014j416J632j603m428L349j195m509
11263E044m352k849J883O391J0873l31Q39L968l706j514j958M348K83q496M04
11248A0827P497K653j0828J450O27m825J1185L418p439N541n12q884n410k473
11234B827n53J465J847J976J475J0421N979r101o006J6K132J1740m161p312l522
11219I223k990L056L405j666O646L269j755k984j363m345l545J687J788L013l701
$$ y = [5553, 8613, 10341, 9942, 9277, 11402, 14803, 20629, 24558, 18025, 15495, 10874, 11559, 15375, 12497, 10248, 14302, 18514, 13649, 1925, 5563, 4623, 4096, 6915, 12177, 20178, 23533, 15829, 15197, 12883, 10228, 3755, -5915, -7294, -1307, 5145, 9987, 9233, 10141, 13905, 13105, 3159, 7016, 12573, 6920, 8480, 13288, 16664, 15469, 8821, 8115, 7065, 6200, 13214, 11798, 13430, 11827, 7399, 10748, 9553, 5044, 692, -2157, -274, 6117, 16990, 16659, 17498, 21466, 17760, 16246, 14288, 18636, 18919, 10423, 10827, 18324, 20977, 10149, 11599, 12226, 7401, 18586, 22004, 14565, 20106, 19594, 10710, 5300, 2827, 2274, 3739, 5586, 7562, 9037, 19458, 25437, 16336, 10330, 10346, 12478, 24218, 20057, 12745, 9223, 6233, 9289, 12694, 11028, 17674, 20943, 19188, 16204, 14841, 10496, 6951, 8638, 10426, 13439, 9738]
11204I738j478R194M955K24k091M59p93j390o775l554p898K061L662P312L343
11189A6969l223L576O114l07p628j693L316J276j771L457n302n187q12L079P094
11174A8958O167j0382k896M821K785M450k004m343M320N412J27o787l736L435
11160B0327K333J28j845k704K359k76M423M781K749M396J100k737m725o138K60
11145B4431L678o14j032K311j240L991k958J163L619K26n855q717j1404K204N884
11130A5687P005M804k003j681k955m372M598k140M992k014L692P556j952m96J1055
11115D1776n07J246K654P21R609M167K029l173m353J0710J0244R597j536l089
11101H0095k39o300j2402m954n175p941p995m665r259Q90M705M649J357j123n001
$$ y = [9738, 8260, 17454, 22409, 22633, 20542, 21001, 20208, 18818, 12043, 8489, 591, 2652, 6314, 13626, 16969, 13746, 17322, 23436, 23129, 15501, 13808, 17124, 18400, 16629, 20086, 14784, 9597, 8785, 11864, 18958, 25125, 14743, 11847, 16668, 19453, 23903, 21899, 17556, 21876, 27288, 27415, 20628, 16892, 20327, 22660, 22788, 20943, 18239, 20598, 20322, 24745, 29526, 32275, 36671, 37771, 35034, 30309, 24171, 24431, 28109, 27495, 26463, 28774, 27534, 31525, 28567, 29730, 33349, 33575, 27720, 19003, 7599, 9803, 15687, 22692, 27496, 25493, 23812, 20857, 16485, 21083, 18943, 23935, 21921, 25613, 33169, 31217, 30721, 41776, 41269, 42515, 45169, 45890, 55499, 59666, 61695, 58522, 54169, 64879, 75123, 84720, 83184, 80095, 79856, 73556, 61154, 56200, 51025, 43084, 35089, 30424, 21165, 22055, 26760, 31409, 32766, 31643, 26642]
11086B6642K407p038O401J932o059K024M899o308j0112j0299K837O630P893J3256
11072C5105J9782J059o198l498M928N105o306N13k554m266l808J948n28M840J499
11057D7621J793M918R703M288P21O169Q463P903J1670J6149L3229O1027R1470
11044C05124J50159K94425N40959N56209J12071k13257k71261l04936l40755k74278
11034E54460j69211j03636o6559m7084l4565k2393j5490q137m085p830p589J230
11022F9111P284R229Q47o61j2887n466K372p825j2634m380o20J828R086P01n331
11007E0654o725m783n823k457O31M521L147K93M801N52m087r728k719K726Q616
10992C9619N390m966l314J09q77jJ269M925J7398M259j0030l500M167j397n469
$$ y = [26642, 29049, 22011, 28412, 30344, 24285, 26309, 31208, 24900, 14788, 4489, 7326, 13956, 21849, 35105, 54887, 55946, 49748, 46250, 51178, 56283, 49977, 50490, 47936, 43670, 39862, 41810, 41282, 46122, 47621, 49414, 54332, 64035, 68323, 69044, 75213, 83676, 91579, 103249, 119398, 152627, 213654, 305124, 455283, 749708, 1290667, 1846876, 1958947, 1745690, 1474429, 1169493, 828738, 554460, 385249, 281613, 215054, 167970, 133405, 111012, 95522, 87385, 83300, 75470, 67881, 69111, 76395, 85624, 86471, 85810, 72923, 67457, 69829, 62004, 49370, 44990, 44370, 46198, 55284, 55985, 50654, 43929, 39146, 33323, 30866, 31497, 36018, 39165, 39458, 44259, 44811, 40724, 30996, 28277, 31003, 39619, 45009, 40043, 36729, 36838, 35961, 35960, 37229, 42154, 59552, 63811, 53781, 50281, 54448, 53051, 47582]
10977D7582n634O185L359o672J130k620q44J926p73j40j1862j4300k254K03J96
10962A5482M87J619n541K092J0102P609M565J1217K627p086p681k782M355N68
10948C7633k220J194J431j1737o854n059K782L347o115J098j025m146M979O168
10934B1476M123Q466n88k592j750M224J1762j349O774j856l266l02J45q972j496
10919C4799N620k622L735L454l30L082J743K709K233m758o418r320l531j277N488
10904C4607P610K215r224m246P95k840L807J742k11J9743N5280L2979J1488M9896
10890B03641L0025o618j7086R39l4263m9888o650r67k0070k2869l204M079M983
10877H2052J106j4203j2944q19j1696n739K866O628J3693J2521Q053O852K340
$$ y = [47582, 41948, 48133, 51492, 44820, 45950, 43330, 42486, 44412, 43639, 43499, 31637, 17337, 15083, 15286, 15482, 15969, 17588, 12047, 14139, 24241, 31850, 36415, 47632, 50259, 43173, 35492, 32710, 37065, 37633, 35413, 36607, 38038, 26301, 19447, 14388, 17170, 20517, 14402, 15500, 14475, 10329, 15308, 21476, 25599, 34065, 33477, 30885, 29135, 33359, 45121, 43772, 50546, 48690, 45424, 45122, 45267, 36295, 34799, 40419, 37797, 41532, 44986, 44656, 47738, 49481, 52190, 54423, 49665, 43247, 33927, 30396, 29119, 34607, 42217, 44432, 35208, 30962, 31757, 28917, 32724, 34466, 34255, 53998, 109278, 142257, 153745, 203641, 233666, 227048, 209962, 210901, 176638, 126750, 120100, 119133, 99063, 76194, 72990, 77069, 82052, 83158, 68955, 56011, 55192, 43496, 37757, 40623, 47251, 60944, 73465, 81518, 88370, 90710]
10864I0710m29L711l032l269p855k0683o710j1113j8866p631M923P97O805P757
10850C5115K555Q26q435j2729j1123n523O103N149P174J5543J4608K9381J9308
10837I7952q69n439p554k0693k0758j7162j7820n279Q349K4394J4486J3881J3568
10824G7056R049K48j5475k3655r330j4401j200j072j1530j904L324N821N587J2553
10810C5071J3245M524K311P038J6223J6560N06l393q103j6191k4406k0856p847
10797A4682n818n888N537R915J4527K4262J0639j0585k1318k8230j5436k45O659
10784a299K0061R693L076R59L077Q238M664k31q572j0127j2806j3072j6124k0007
10770c2470l1836m5145p4805j06744j42052j90972j24063L3133J00239J44568
$$ y = [90710, 90281, 93992, 90960, 87691, 79836, 59153, 52443, 41330, 22464, 14833, 19756, 20553, 27358, 35115, 37670, 38496, 30061, 17332, 6209, 686, 6789, 11938, 19112, 34655, 49263, 78644, 97952, 97083, 91644, 84090, 63397, 42639, 25477, 7657, 2378, 10727, 35121, 49607, 63488, 77056, 86105, 86353, 70878, 47223, 37893, 23492, 22292, 21220, 9690, 7786, 11110, 16931, 22518, 35071, 48316, 52840, 55151, 62189, 78412, 94972, 95478, 92085, 83982, 67791, 43385, 22529, 14682, 8864, 2976, 8513, 18428, 32955, 57217, 67856, 57271, 35953, 7723, -7713, -7958, -1299, 18762, 28455, 31531, 32490, 35567, 43805, 48469, 48238, 39666, 29539, 16733, 3661, -12463, -32470, -64306, -109451, -184256, -291000, -433052, -624024, -748087, -714954, -614715, -470147]
10760d70147J96550J82851J28921Q7294N8267K5928k292l991J3071m524k481N018
10748B14465N112j752r221J640K608J2816J0563J2260n65j6274k0016j5505Q72
10735A97003m597j1576L224O004N323m281N906J7928K7304K0074J8135J2123J1401
10722C03971P427m400j218j156O266J5641J4977N742L664M540O282J1481J2157
10709C85374Q728J5247J1904M435r071j0349r98j647q503O922J4242K9886M6099
10696D92269N0428L1297J6536l040n817J7589L6711L1120J5070J7588J4086K40
10684G14077j0930o303K4866N2615M8454M4609O7882J00189J25190J60757K24100
10673A545506L36206N79147J119887J788885J302653j20544p29204p36964q10573
$$ y = [-470147, -273597, -90746, 38175, 125469, 183736, 209664, 207372, 203381, 216452, 211928, 209447, 214465, 219577, 217825, 208604, 210244, 212852, 225668, 236231, 248491, 247926, 231652, 211636, 196131, 197003, 192406, 180830, 184054, 190058, 195381, 191100, 197006, 214934, 242238, 262312, 280447, 292570, 303971, 311398, 306998, 305780, 304624, 310890, 326531, 341508, 347250, 350914, 355454, 361736, 373217, 385374, 394102, 409349, 421253, 425688, 416617, 406268, 405270, 403623, 395120, 402042, 416284, 446170, 492269, 542697, 573994, 590530, 587490, 581673, 599262, 635973, 667093, 682163, 699751, 713837, 714077, 703147, 696844, 721710, 774325, 822779, 867388, 935270, 1035459, 1160649, 1321406, 1545506, 1881712, 2460859, 3580746, 5369631, 6672284, 6551740, 5822536, 5085572, 4274999]
10664D274999p58951m34642j63384j0946R8232K09806L96050O84917Q66182N36995
10654E699258J71122J73069K71145L27013N47417Q94336J242433J710168K320628
10645A3356589L175296M566109P164862J1500495J8928291L5189847O9555777
10638A63437266J08227506P7138090o143415m3981226m7846218n5801400o0617216
10631A34413387m5836213k7674446j6312282j0434650p238245n113349l650786
10624A8153416k734548k126305j629689j247345r55283o06701k16707k46749o42711
10615G747378p79731p28186p41579p27435n72333l81763k74574k41194k40445
10606C060138k43511k30085k06057j80090j57630j13486j02073r3697o0922m1734
$$ y = [4274999, 3516048, 3081406, 2918022, 2907076, 3005308, 3215114, 3611164, 4296081, 5162263, 5699258, 5870380, 6043449, 6314594, 6641607, 7189024, 8083360, 9325793, 11035961, 13356589, 16531885, 21097994, 28262856, 39763351, 58691642, 93881489, 163437266, 271664772, 348802862, 342659447, 298678221, 250832003, 195030603, 134413387, 88577174, 60902728, 44590446, 34155796, 26917551, 21804202, 18153416, 15418868, 13292563, 11662874, 10415529, 9460246, 8853545, 8636838, 8390089, 7747378, 6967647, 6239461, 5497882, 4770447, 4198114, 3816351, 3541777, 3300583, 3060138, 2816627, 2586542, 2380485, 2200395, 2042765, 1929279, 1827206, 1733509, 1672587, 1630853]
10596A630853l8915o5617q3195p8088p5029p6655q2288q4772q4756r0192q9646
10585G81700p7178n0817k3790k5166k2344j2706j1812J1502M3284Q2972J35530
10574H31175K34376M67336Q54429R14003L56017n5320l29112n58605o45648n54731
10564A513920m22634l01099j73245j04675p3826o1790m7734k4798j1354j2402
10554B80363j2545j2334k1670k2561k1103j8401j7212l744O096J3196K924Q100
10542A81109R853M692K789Q503J2599M686r080l5162m1447l0909k7000j5398L11
10529F5546J1356L123p861o975k183o311p493j1594j8146k0575k0083j3905o567
10516d1668N2J2487O5442J37895J89749K71309K40513J02926m09q6923j61935
$$ y = [1630853, 1591938, 1526321, 1443126, 1365038, 1290009, 1213354, 1131066, 1046294, 961538, 871346, 781700, 704522, 653705, 629915, 604749, 582405, 569699, 557887, 569389, 612673, 695645, 831175, 1065551, 1532887, 2387316, 3301319, 3657336, 3602016, 3272904, 2714299, 2068651, 1513920, 1091286, 790187, 616942, 512267, 438441, 376651, 328917, 304119, 292765, 280363, 267818, 255484, 233814, 211253, 190150, 171749, 154537, 150793, 156889, 170085, 173009, 181109, 190962, 195654, 198443, 206946, 219545, 224231, 215151, 179989, 138542, 107633, 80633, 65235, 65546, 76902, 80025, 72164, 65189, 63006, 56695, 49202, 37608, 19462, -1113, -21196, -35101, -41668, -41616, -29129, 36313, 174208, 363957, 635266, 875779, 978705, 978296, 891373, 729438]
10505G29438j81090j29384p9427n0373m2279l6674k2998j6259j0385q707m00p76
10493A50686o865j6848j2273M343J2498J7439O804j0086r191m627j2459j3794
10481A05627j7993j070K9729J9627j913l529m267r091r774j3781j9056j3599j2080
10468D8830j52J3898K856l947k633L030Q805J2054J2474K997j570o212K620O518
10454I9568o174k392j1028k3807j7602j3016k2161M773K7828K0576K0812K4180
10442A01557J4622n038k3197k7894l1225k8819r569J3055J1347J2243O322J9272
10430E2676K0503L308K532l570j2286j3562p816K87N137l8J461Q264n36q220m294
10415D3846p25j2576j3466j2621j6924j2083M078P035Q307O141R241J5787O920
$$ y = [729438, 548348, 418964, 339537, 289164, 246885, 210211, 187213, 170954, 160569, 151862, 151462, 150686, 143821, 126973, 114700, 119043, 131541, 148980, 155784, 145698, 136507, 131880, 119421, 105627, 87634, 86564, 116293, 135920, 134007, 130478, 126211, 117120, 107346, 93565, 74509, 60910, 48830, 48678, 62576, 65432, 61485, 58852, 61882, 70687, 82741, 95215, 98212, 96642, 90430, 93050, 99568, 93394, 91002, 79974, 56167, 38565, 25549, 3388, 8161, 35989, 56565, 77377, 101557, 116179, 111141, 87944, 60050, 28825, 6, -9563, 3492, 14839, 27082, 33404, 52676, 73179, 76487, 79019, 75449, 63163, 49601, 41785, 42072, 47209, 47171, 48632, 56896, 56360, 48140, 43846, 43121, 30545, 17079, 4458, -12466, -24549, -20471, -13436, -5129, 1012, 10253, 26040, 32960]
10402C2960N341j877q041p044K253j561j3136j0673j094M31R754Q985O444P570
10388C0312m052q76J2715K1722N412m316K426q179p67k330j0954q989j0544P78
10374B2358L304J563n401l833M569J80O01j929L825j16r817j168L219l350l350
10359A0655M05K177m929P273L129l81p141m235j2954o992P347L198k763M720o510
10344g001n724N073N088N746O178O487L237N055j20M658n32m865L215o644k571
10329A7280P665l1j586l028l919l495j249m760r170M267N289l0m119J205M260
10314H579R366M404O128R864j729l117l72K096M07m308j95j648k553L953k437
10299B8438l080l021m545k709m319p057o157M234j742o844L150K335O442O774
$$ y = [32960, 38301, 36424, 28383, 21339, 23592, 22031, 8895, -1778, -2872, -2441, 7313, 16298, 22742, 30312, 26260, 25384, 38099, 59821, 65233, 60917, 63343, 55164, 54397, 52067, 41113, 32124, 21580, 22358, 25662, 27225, 21824, 17991, 22560, 22740, 23341, 21412, 25237, 25121, 15304, 14136, 17355, 14005, 10655, 11060, 13237, 8308, 15581, 18710, 18329, 11188, 6953, -6001, -12993, -5646, -2448, -5211, -491, -7001, -12725, -7652, -2564, 3182, 9360, 15847, 19084, 24139, 24019, 28677, 28145, 23280, 26495, 19851, 17280, 24945, 24914, 23328, 20300, 16381, 12886, 11637, 6877, -2293, 1974, 7263, 7233, 3114, 4319, 8579, 17945, 22349, 28477, 38341, 36612, 33495, 33123, 35219, 35626, 31318, 31123, 29475, 26922, 30875, 28438, 25358, 22337, 17792, 15083, 10764, 3707, -2450, 1784, 42, -6802, -3652, -1317, 5125, 11899]
10285A1899l513l818O767j925k743P305M179j0963k021l785q441J379Q607L950
10271F877L388P229L386l019k89M503q94J884K248J0877J1528P212J282p494q883
10256C9835r671n742j0693l171n979L697R58l982O644J3730M807O581N273N279
10242D7566N084L287k090M899J5416J1894J3203J8121L4466N3135R4346J81402
10230D80729L57297N87546M75202O84k52867k83849l21118l37532k43715j44203
10220C18174q1768n1373m4829k9782k2209j5610o44n002o262k412p847J389j596
10207E0229j166k958J726j0280r660q983J62L960O860L486k655j0436j1061M514
10193A3738k82K571M081m264o006M473O5l772j0857O54K641N095L623n58j933
$$ y = [11899, 8386, 4568, 11335, 9410, 6667, 13972, 18151, 7188, 5167, 1382, -7059, -5680, 2927, 6877, 10265, 17494, 20880, 17861, 17572, 22075, 21181, 23065, 25313, 36190, 47718, 54930, 56212, 48718, 39835, 30164, 24422, 13729, 10558, 4579, 8276, 9234, 5252, 11896, 25626, 30433, 37014, 42287, 47566, 52650, 55937, 53847, 58746, 74162, 86056, 99259, 117380, 151846, 204981, 299327, 480729, 838026, 1425572, 1900774, 1901458, 1648591, 1364742, 1043624, 706092, 462377, 318174, 236406, 185033, 140204, 110422, 88213, 72603, 71959, 66957, 60695, 58283, 50436, 51825, 50229, 49063, 46105, 47831, 37551, 27891, 18908, 19070, 23030, 29890, 33376, 30721, 20285, 9224, 13738, 13456, 16027, 20108, 15844, 9838, 14311, 14376, 10604, -253, 401, 3042, 8137, 11760, 11202, 9269]
10178I269l37l442m614L784l047j6966k6234k1010k198J6412Q182J037q85L666
10164c6383j491P6N550Q908J0646J2689P423k720k493k765L079J561l74k802j677
10149g73N823k088m293k629J983K577P187o847o650r08k80J976J10k283j142L200
10133e037l505j612j791n144j732J1261P603M073o33k765o820N134L003P675J005
10118A0715J19n059n773m998J867N311J489K6M49M058r31n578k676j477k730p82
10102e970n01K905J388j558j989J11m167P50J2300K572N95r92n948O49K508n247
10086b594l763m546k21M079J110j715k705R403N225n268m019j0013M062N997j514
10071f482k581O527r94j120n896q14n163L11O717K356J279P939L242o915k828
$$ y = [9269, 8932, 5490, 876, 4660, 1613, -15353, -41587, -62597, -64795, -48383, -40201, -39164, -40049, -36383, -37874, -37798, -32248, -23340, -12694, -5, 7418, 4698, 2205, -560, 2519, 4080, 3706, 904, -773, 5050, 2962, -1331, -3960, -1977, 600, 7787, 940, -5710, -6618, -6898, -4922, -4812, -7095, -8237, -5037, -8542, -10154, -11945, -17089, -18821, -7560, 43, 4116, 3483, 718, -6102, -968, 2035, 9710, 10715, 10834, 5775, 2, -4996, -3129, 2182, 3671, 3697, 4146, 8204, 7273, 1695, -981, -2458, -5188, -5970, -6471, -3566, -2178, -3736, -5725, -5614, -9781, -9031, 3269, 5841, 6436, 5444, -504, 145, 2653, -2594, -6357, -10903, -11124, -7045, -5935, -7650, -10355, -952, 4273, -995, -5014, -15027, -10965, -4968, -6482, -9063, -2536, -3530, -4650, -10546, -11360, -16523, -16212, -9495, -7139, -5860, 2079, 5321, -1594, -4422]
10056d422R47O672K392M000P586O2m411L68R35O90k907k495o274K545O550M671
10040A6909O664P569M574J3175L3038P0508J52532J48997O616p0780o9448p2505
10028B47849q3003n9237k5168j0832j9138j9714j5328k38n419p500J819N76j46
10015D521L188J803J451K30j747k321K3j505m939l130n19p689l432J432M322l196
9999a1508m60O437l226m811L710J466L666O618m123n428K756J584L234J499j801
9984c87l340M72q61K384O536Q712M203J53n655l251p657o847J240L21k015P46
9968e246o271J27J842j149N902J1309j818l877M53K598l472j163l898j877o47
9953g187K151l064P995N289n54j069o919o231M973M283r658o062L439J146M83
$$ y = [-4422, -3475, 3197, 5589, 9589, 17175, 17237, 12826, 13194, 14129, 14819, 11912, 9417, 3143, 5688, 12238, 16909, 23573, 31142, 35716, 48891, 81929, 152437, 304969, 453966, 460582, 389802, 320354, 247849, 164846, 105609, 80441, 69609, 50471, 30757, 15429, 15191, 9772, 2272, 4091, 4667, 4521, 7709, 9512, 10963, 11193, 9446, 7125, 7148, 5643, 704, -2426, -2945, -10634, -14066, -12634, -8312, -11508, -11968, -5531, -8757, -13568, -9858, -8392, -4726, 1892, -2231, -7659, -4903, -3319, -85, 1414, -387, -3727, -3255, -4116, -1732, 4804, 13516, 17719, 17872, 12217, 8966, 1309, -5538, -4298, -3977, -5992, -5246, -11517, -11390, -9548, -10697, -4795, 6514, 4696, 819, 1272, 3870, 398, -765, -4663, -6540, -7187, -5036, -8100, -105, 5184, 4630, 3561, -3358, -9589, -4616, -333, -9991, -16053, -12614, -11468, -10985]
9938a0985K536J724N550p45Q252O128k880o289K731N443P346k102k226l558m308
9923F617J071m393N02J65l842L356l372k9q40r504L827J4258J3559r392o352M499
9907A0130n32J53n410j622L692K606P22O578m899j0916l800l549p60K702k56N751
9891E90K941J994p961q176P893L975n560J445k409n073K086J164J418L629N726
9876C682N142L82j376l257j58k156K950P332o974q248K543O072J264k328k348
9861B522J274j940k155m39k786R56K50K04o48j960m942m697J898Q880m20M6R924
9844E967L145N863K57p142n888m007k240N05K972J273j844m0J289n365o360M700
9828f915l446p359J0717N437M791J426m357m026k602M0j031J034J142P676K127
$$ y = [-10985, -8449, -6725, -1175, -1920, 6332, 12460, 9580, 3291, 6022, 11465, 18811, 16709, 14483, 10925, 6617, 7688, 3295, 3797, 3962, 120, 3476, 104, 75, -765, -10269, -6442, 7816, 21375, 11983, 5631, 10130, 9598, 9751, 4341, 2719, 6411, 9017, 9739, 16317, 11418, 502, -3298, -6847, -7607, -4905, -5161, 590, 3531, 5525, -2436, -10612, -2719, 1256, -4304, -2859, -5268, -10341, -8255, -7091, -5673, -2044, 3682, 8824, 9206, 7830, 4573, 4415, 2259, 5209, 12541, 5567, -2681, -138, 5934, 7198, 4870, 2522, 3796, 1856, -299, -738, -3524, -2568, -2318, -2114, -2762, -4722, -9664, -14361, -12463, -3583, -4003, -3957, 5967, 9112, 14975, 15232, 8090, 2202, -1805, -4045, -3540, -568, 705, -1139, -1179, 110, -5255, -11615, -6915, -10361, -17720, -7003, -1566, 3225, 4651, 294, -3732, -6334, -6294, -7325, -6291, -5149, 2527, 4654]
9813D654q673q603k790q87L982J722P386J056q92O381m792k593j796K638J364
9798a843L757j0151l184P867k288l959J535L934L174n271J759J30L822J268o350
9783e800p006L095J2309M42r11O568j747n750l4k874K170o532n596j99j542M084
9767i323O116K56O22q879K25Q969o1k148J02k200L585J626J408m767l153M484
9751c138j33n275m38M18J346M899K587K632K237M746J906O38n746L893j867L912
9735A2617j802q134n955k084J212j913O515N18N45j251o824J737K306K297n227
9720e443j281O192K5k82L365R963Qp18r215o269k002O241K646O45n368L216l156
9703a433k936n591R62K226j784k008N142O415m32o5N049m59K713N38K751j117
$$ y = [4654, -4019, -12622, -15412, -16299, -12317, -10595, -3209, -2153, -3045, 3336, -1456, -4049, -5845, -3207, -1843, 1914, -8237, -11421, -3554, -5842, -9801, -8266, -4332, -1158, -6429, -4670, -4540, -718, 550, -5800, -12806, -9711, 2598, 3040, 2129, 8697, 6950, 1200, 1166, -1708, 462, -6070, -11666, -11865, -13407, -9323, -3207, -2951, -2329, -11208, -10983, -2014, -2075, -4223, -4121, -6321, -2736, -1110, 298, -4469, -7622, -3138, -3271, -8546, -8984, -8566, -7220, -2321, 266, 2898, 5135, 9881, 11787, 12425, 6679, 10572, 8705, 12617, 10815, 2681, -3274, -5358, -4146, -6059, 456, 974, 1519, 268, -6556, -4819, -2513, -216, -5443, -6724, -532, -507, -789, 2576, 12539, 12547, 11829, 2614, -3655, -5657, 584, 3230, 3875, -1493, 1723, -1433, -4369, -9960, -8998, -6772, -8556, -10564, -5422, 993, 561, 496, 5545, 5086, 7799, 8337, 11088, 9971]
9687I971j387l804m006n585j027J27L758K435j765m430l979p077k1K985R082O392
9671A669l430k252k926m775o124J365l256K383k133M947J1214j04k522M86j0176
9656a5634K618j538l027Q106Q465L923J424M79J103o678j0803J047M415Q702L805
9641F407q442l432R301J603p65j105L021k864k696j504Q0J753n090J630L432q20
9625E09n318K180O044j259n759L957M922K727M035r554m179j183j585L764N25
9610a74n005N401J69m137l13j734M305O74m347M670M533j75k525o619j0641k722
9594a8640J0114Q322l728m220j933K376j375l045K096M708l587K003K05n775K344
9579a0135P742N008N97K311J936l15m457q21j830L402K049m7q72j373m910L438
$$ y = [9971, 8584, 4780, 774, -4811, -5838, -5711, -1953, 482, -1283, -5713, -9692, -16769, -16790, -13805, -4723, 1669, -1761, -4013, -6939, -11714, -17838, -16473, -19729, -17346, -19479, -14532, -3318, -3422, -5944, -5458, -15634, -13016, -14554, -17581, -9475, -1010, 2913, 4337, 4816, 5919, -759, -11562, -10515, -6100, 2602, 6407, -2035, -5467, 3834, 5437, 4672, 3567, 6588, 3724, 1028, -476, -396, 1357, -3733, -2103, 1329, 509, -4809, -2629, 3415, 2156, -3603, 354, 5276, 8003, 12038, 2484, -1695, -2878, -4463, -699, -174, -5179, 222, 391, -3746, -4059, -5793, -1488, -814, -5161, -491, 4042, 3867, 1342, -5277, -15918, -18640, -8526, -204, -3932, -8152, -10085, -7709, -9084, -12129, -10033, -5325, -8912, -6909, -6704, -12479, -10135, -2393, 2615, 3212, 5523, 7459, 7144, 2687, 1866, 36, 3438, 5487, 5440, 4568, 3195, -1715, 1723]
9563A723K525K639l391l60k133l311m41k203k632l797K777R406k158m505k054
9548g915j692N357p085m227K92R856M532k385L255J743N86k44l713k691j415J874
9532c872M509k195n329L233P019j267l401j077k753N511M757j754o34l811o71
9517a735J553j796n562K375L177l592o276l727L725O111L611O908L896n62n029
9502C077l646K906m555L088M526M343r654p824m545Q487R192j21o578k782L241
9487h45K669l569l082L390R44o359m359K999M274P26j753l644m295J908J662j934
9471a1268M539L614K863K634l157p498k691P25N140O678O870r222q38n84L338
9456A143K617N388j11o024l805J065l906m270J713j794m453K64P171J947K47J0986
$$ y = [1723, 4248, 6887, 3496, 3136, 1003, -2308, -2749, -4952, -7584, -11381, -8604, 802, -1356, -5861, -7915, -9607, -4250, -11335, -15562, -15270, -5414, -882, -3267, -12, 1731, 2317, 2073, -1640, -4331, -5746, -3872, 637, -1558, -6887, -3654, 3365, 2098, -1303, -2380, -5133, 378, 5135, 3381, 2747, -1064, -1735, -182, -1978, -7540, -5165, -1988, -5580, -11856, -15583, -11858, -5747, -2136, 4772, 8668, 8106, 3077, -569, 2337, -2218, 870, 5396, 9739, 85, -7739, -12284, -3797, 5395, 5274, -1304, -4086, -845, 1824, -1745, -4827, -1437, -493, -6852, -11211, -8212, -3938, -3212, -4965, -8609, -12904, -10996, -9334, -11268, -6729, -3115, -252, 2382, -775, -8273, -10964, -10239, -5099, 1579, 8449, -773, -1611, -2195, 1143, 3760, 9148, 9037, 3013, -792, 273, -3633, -7903, -6190, -7984, -12437, -12173, -5002, -3055, -2808, 8178]
9440H178J887o510k107l510n901K638O104l305j896J474k229k930K592L23L567
9425a625M387k191P11l040k011m286N551N814k159k390M37M27r56k85o066q99
9409h581K513O769M589m450k785N52m93J346q91n01J930k515j882l842n685L183
9393a0743j411N183Q160k938O133M860o519q443J012n05o309k617m23O036P63
9378g761J34N545r67o067L490K91L592O506j318K952Q58N24K874k349k396p986
9362b078m150j673N78K476k946O839P352L686p426M149o76m458m529m412J291
9347e977m72l10P894M670l521k690j845R38K914N017M200j801j031q038K179K79
9331B406k873L207o591k281N724k895J45l297K285L493r39m615M431M215m406
$$ y = [8178, 10065, 3555, 1448, -2062, -7963, -5325, 779, -2526, -4422, -2948, -5177, -8107, -5515, -5192, -1625, 2762, 571, 1282, -1758, -3769, -8055, -2504, 3310, 1151, -1239, -802, -375, -1331, -1616, -7682, -8581, -6068, 701, 5290, 840, -1945, -1393, -1886, -540, -1431, -1932, -2, -2517, -4399, -8241, -13926, -10743, -12154, -6971, 1189, -1749, 4384, 9244, 2725, -5718, -4706, -5211, -11520, -14137, -14560, -8524, -7761, -7627, -2082, -3049, -9116, -5626, -5335, -1743, 4763, 3445, 6397, 7255, 7779, 10653, 8304, 5908, -2078, -6228, -7901, -7323, -4847, -7793, -954, 6398, 10084, 2658, 6807, 6131, 1673, -2856, -7268, -5977, -6449, -6759, 1135, 5805, 2284, -406, -2251, -1313, 1601, 6618, 10818, 9017, 7986, -52, 2127, 2406, -467, 2740, -3851, -6132, -408, -3303, -3158, -6455, -4170, -677, -1616, -6231, -1800, 2415, -1991]
9316a991k957Q05K832R83j301J1028J3868l987q000q852l146l723o200l58M478
9301f521L914P4l61n114K232L623K674q433k309M330K424N91J392P29l141n850
9285i746Q894Q580k350m439J745O15j735m269m94K36O069k6L125K447M254O034
9269A8940n107l574J053j109j899K272N059K755j854M666N077o945L89L458L283
9254B6464M342P386L01k357n064L871M834L756J971Q214J8750J4923J4960J6577
9240A18928K2585N7666R0814J44278K57574N24524R18600P44239m1847l96553
9230B440808m23037m88454n00622l53495k07738j23633q0386n2075l8451l2174
9220A40743k0349j3646p121o651j5683j0315r722l655j2718p869L510K772k824
$$ y = [-1991, -4948, -4143, -1311, -328, -1629, 9399, 23267, 19280, 11280, 2428, -718, -4441, -10641, -10999, -6521, -2607, -2533, -2894, -8008, -5776, -2153, 521, -7912, -10221, -5891, -3467, -2876, -1484, -755, -3896, -9746, -852, 7728, 5378, 939, 2684, 3299, 1564, -2705, -3199, -2963, 3106, 3080, 6205, 8652, 12906, 18940, 13833, 10259, 11312, 10203, 8304, 10576, 15635, 18390, 16536, 21202, 26279, 19334, 19723, 23181, 26464, 30806, 38192, 38493, 36136, 31072, 34943, 39777, 43533, 45504, 53718, 72468, 87391, 102351, 118928, 141513, 199179, 289993, 434271, 691845, 1216369, 2134969, 2879208, 2837361, 2440808, 2017771, 1529317, 1028695, 675200, 467462, 343829, 263443, 211368, 172917, 140743, 120394, 106748, 99627, 92976, 77293, 66978, 57256, 53601, 40883, 33014, 36524, 39296, 36472]
9207C6472m450k338N281O51r72j399m811o636n133k318j577j479p811J076O051
9192A0607l258L271p049m787J372j573J524m03l355J333O904K191K797J914n147
9177F341K469l551o031M803j393O955j558r641K027k582l936P576L378q024o532
9162i699R05p03P410L463n99l674K88k59n692L273J1805J478q482j1251l752J2024
9146c465R960l318l978K014J037J042R16l413J59P081J389k859r73q73Q13Q081
9130A3613n076m381l869l356j348M55N767J775m610R1K33L142J157k129l401l657
9114e594J817N884k295K2p126L2l56O385N639L86k004n18l528M807L120m870J4
9097A815j029j827L659J286N86k534n185k727m194O550p59l877K624K509L270
$$ y = [36472, 32022, 29684, 34965, 35616, 34644, 33245, 28434, 21798, 16665, 14347, 12770, 11291, 3480, 4556, 10607, 7349, 10620, 3571, -1216, 156, -1417, 107, -296, -3651, -2318, 4586, 6777, 9574, 11488, 6341, 8810, 5259, -772, 4031, 2638, 9593, 8035, -1606, 421, -2161, -6097, 1479, 4857, -3167, -9699, -8794, -9497, -2087, 1376, 777, -2897, -2609, -2868, -8560, -5287, 6518, 7996, -486, -11737, -15489, -3465, 6495, 3177, -801, 1213, 2250, 3292, 4208, 795, 954, 8035, 9424, 6565, 5592, 4719, 5532, 13613, 8537, 4156, 287, -3069, -4417, -3962, 1805, 3580, -1030, -939, -706, 2436, 3593, 1464, -1937, -5594, -3777, 2107, -188, -166, -7292, -7260, -7616, -1231, 4408, 4794, 2790, 2272, -1256, 3551, 6671, 1801, 1815, 786, -1041, 2618, 3904, 4490, 1956, -3229, -5956, -10150, -3600, -4359, -8236, -5612, -3103, 167]
9082A67O783j020m240k456L964K226j853L012m546J048n385l08j291M119m322
9067d102l547l362M083M3n638j1067L584M949o26M012O430j357M279k796l31O596
9051A150P672N091r37q58l388l407k655N287j522M07j090n69j95l898p0M087Q60
9034E965m825l146j10R27l763K665L363k706q383n55L63N342K692j059o109n187
9018a4526L54P172M718M556k015m749O759q135m168O407J297o236M777K300M639
9003C150k899l578n866j595R78O77j490K356K913m406j586L112R72L172L313p423
8987h200J999M615n718k184M001n205L557O699L068J898n446m111K758N701Q767
8972A2199J0298l579j0144o920j137k592p029m019n32L553L210L299p71n26m074
$$ y = [167, 6950, 5930, 1690, -766, 3198, 5424, 3571, 6583, 2037, 3085, -2300, -2608, -3899, 220, -4102, -7649, -11011, -6928, -6885, -12523, -23590, -20006, -15057, -15683, -11671, -5241, -6598, -2319, -5115, -5446, 1150, 8822, 13913, 12976, 12118, 8730, 5323, 2668, 7955, 6433, 6840, 5750, 5181, 4986, 1088, 1018, 5105, 5965, 1140, -2006, -2116, -1189, -4952, -2287, 1076, -1630, -10013, -10568, -10205, -4863, -2171, -3230, -9339, -14526, -14172, -7000, -2282, 2274, 259, -4490, 2269, -5866, -10034, -3627, -2330, -8566, -3789, -1489, 3150, 251, -3327, -9193, -10788, -9810, -9133, -10623, -8267, -5354, -9760, -11346, -8234, -7262, -4090, -777, -8200, -6201, -1586, -7304, -9488, -5487, -10692, -7135, -436, 2632, 4530, -916, -5027, -2269, 3432, 12199, 22497, 18918, 8774, 1854, 717, -1875, -8904, -12923, -13455, -9902, -6692, -3393, -4164, -4690, -8764]
8957h764L822O710J630j967K199m51k517M827j178J47K568j178m031q16j106l805
8941c910o83P260M081p111J882J864J844M386q04O380O05o046j0767o322J712
8926e629M103L266J512m429m716k56L604K536J386J836O48O316o334k71r89o7
8910B516k38P23l784j31k58J170K912K375j271m802l096j566K315J071j152J987
8894a229M38R303M664p739r992K526k675k287K007L454J540j981m347N0N726j797
8878b339q485j52P327J0107J762J30O503J111j2402o987J420N980O114J449p111
8863D427j132K330m367q050J176O245K936j738k524K535L752K693l056k63J603
8848F567J861k124q23M638j098j496p671K645N995j128k706O75M920Q41o436j813
$$ y = [-8764, -4942, 1768, 3398, 1431, 3630, 3179, 662, 5489, 4311, 4458, 7026, 5848, 1817, 1001, -105, -3910, -4593, 2667, 6748, -363, 1519, 3383, 5227, 9613, 8809, 15189, 15794, 9748, -1019, -7341, -5629, -1526, 1740, 3252, -1177, -5893, -6149, -2545, -9, 1377, 3213, 3861, 10177, 3843, 3572, 2583, 2516, 2278, 3001, -783, -914, -1172, -2, 2910, 5285, 4014, -788, -3884, -5450, -3135, -2064, -3216, -1229, -791, 8512, 13176, 5437, -4555, -2029, -4704, -6991, -4984, -1530, 10, -1971, -6318, -6268, -542, -2339, -10824, -10976, -3649, 6458, 8220, 8350, 14853, 15964, 3562, -3425, -2005, 3975, 10089, 11538, 4427, 3295, 5625, 1258, -6792, -5616, 629, 3565, 1827, -697, 1838, 5590, 8283, 5227, 4964, 6567, 8428, 6304, 5481, 10119, 9021, 7525, -146, 2499, 8494, 7366, 4660, 5335, 10255, 11096, 4660, 2847]
8832B847p72K218m154n998K402J0510K274k920o104m064r91k895N581J98n40M127
8816A719m019l359M643J810k875J53J49l519J418Q184M615K429n92l325o436L474
8800D469L441L673l263j245L217j453O401J13n798m27L465l929k853m961l248
8785b398L676k233p880j985o214P56M949L812L410j378K446J398M367K822p383
8770a835o119r58k409l082M000M085N75N335o581o675L959J55q98J971L462k687
8754g702K384L460M32K234l452L15j497l15N86m015K409J312j279p92M747j912
8738c085k24N649J131q193l209M02N358K917j234L46j1727Q198K287k5L888N554
8722H033m35n417k425m753p92O738M163j311J374l805j211j061l725l471l213
$$ y = [2847, 2075, 4293, 139, -5859, -3457, 7053, 9327, 6407, 303, -3761, -4752, -7647, -2066, -1868, -2408, 1719, -2300, -5659, -1016, 794, -2081, -1928, -1779, -5298, -3880, 4304, 8919, 11348, 10756, 7431, 995, 4469, 7910, 11583, 8320, 7075, 10292, 8839, 15240, 15353, 9555, 9128, 12593, 8664, 5811, 850, -2398, 1278, -955, -8835, -10820, -17034, -16278, -11329, -7517, -4107, -5485, -3039, -1641, 2726, 5548, -1835, -7954, -8912, -11321, -14403, -10403, -6318, -5743, -408, -6989, -13664, -9705, -9550, -10448, -8477, -5015, -7702, -5318, -1858, -1426, 808, -2644, -2329, -3826, -4141, -3555, -7570, -5161, -3849, -5128, -5920, -1173, -3085, -3309, 2340, 3471, -4722, -7931, -7529, -2171, 746, -488, -142, -11869, -3671, -1384, -1409, 2479, 8033, 7598, 2181, -244, -4997, -5789, 949, 5112, 3801, 5175, 1370, 159, -902, -4627, -8098, -11311]
8707a1311N522O000N473J820n631k990Q367Q864j659m804n315K10m489J487k845
8692a301l983p69L608K04j663p719M97P373L622J223k980L187M216l725k565K004
8676A229L106m91l072K645l320m212R0J457M869J442P659k82m293M701l86L42
8660A1484j40j585r743M221M278O197j424n804j0313L92M587K658m177j32k697
8645b198p565J525n87k81l17n165O292J007J128L276l480j447N486P912L49q661
8629b726o77P670M924m134n279K23K392O582p001l819m465k761k041l291K588
8614a1815M545J244p174k923Q12M142K317P42O626J141j1406o357K948K459m74
8599a3173j531k339M293R475n895k365N739J094N31J0088K353k736n257k700o78
$$ y = [-11311, -5789, 211, 5684, 7504, 1873, -1117, 7250, 16114, 14455, 9651, 4336, 4546, 57, 1544, -1301, -5284, -6053, -2445, -2241, -3904, -11623, -11126, -3753, -131, 1092, -1888, 1299, 5515, 1790, -775, 1229, 4335, 3844, 772, 3417, 97, -4115, -4025, -2568, 2301, 3743, 11402, 11120, 6827, 11528, 11142, 11484, 11344, 9759, 16, 4237, 8515, 14712, 13288, 7484, -2829, -2437, 2150, 4808, 631, 499, -2198, -9763, -8238, -8825, -9106, -9423, -14588, -8296, -7289, -6161, -2885, -6365, -7812, -2326, 5586, 5935, -2726, -3403, 4267, 9191, 5057, -222, 1, 2393, 8975, 1974, -1845, -6310, -9071, -11112, -14403, -11815, -7270, -6026, -13200, -16123, -15311, -11169, -8852, -8110, -1484, -343, -11749, -18106, -15158, -12699, -13173, -14704, -17043, -12750, -3275, -9170, -11535, -5796, -4702, -4171, 5917, 8270, 5534, 277, -2423, -3101]
8584c101k17p27M990O174l680j999j03Q11K485n396J688Q143m50N454J556k414
8568A3214o798k63j82o439q041O10M673J636K96k042o943J399K171R433K639m75
8552D888l67j920L056p054M088K553k540l612m331j054k47K137K312j700Q349
8537D558R359P498r0j466j3067n677J690Q6L454p548L280J601K735N41p691m438
8521e175p839n98M629R720N723m854O8l414r79q08p296m166L62Q0O59Q514K240
8504c134J274M12N079l345l876L968J038j40K936l560m219L162l495L725R256
8489I081K243M581l943q332j591P117p871j926j343J82l96j386K113J027J863
8474A419m26k67M181n840m816j536L279J301K702l246j067J296p64N028L505o627
$$ y = [-3101, -3318, -4045, 945, 7119, 3439, 1440, 1337, 2148, 4633, -763, 925, 9068, 8618, 14072, 15628, 13214, 6416, 6153, 5971, -468, -8509, -7899, -3226, -1590, -1294, -3336, -10279, -8880, -6709, 2724, 5363, 4888, 4521, 2601, 5657, -1397, 2691, 5244, 2704, -908, -5239, -6293, -6540, -4403, -2091, -3791, 4558, 13917, 21415, 21325, 19859, 6792, 1115, 2805, 2891, 6345, -1203, 2077, 3678, 6413, 6954, -737, -5175, -13014, -13612, -8983, 737, 6460, 1606, 1674, -1740, -2719, -3527, -10823, -14989, -14627, -14547, -13888, -5374, -3134, -1860, -1448, 3631, 286, -3590, 378, 1416, 1276, 4212, 652, -3567, -405, -3900, -175, 9081, 11324, 15905, 11962, 3630, 2039, 9156, 1285, -641, -1984, -1802, -2198, -3584, -1471, -444, 1419, 993, 726, 4907, -933, -5749, -7285, -4006, -2705, -3, -3249, -4316, -3020, -3784, 1244, 4749, -1878]
8458a878l342r42o575N450N876n108j478k557K279Q71M074m187j416J528L343
8443d062K422j222l110j153L039J417J742J027M23K216J572J384l228q652p357
8428a3542K798O459O932N25q257j1537K475J0545Q115L667R59o799o020K83n37
8413c934J454O608L549k588r497K285n816R53M049L303j39P664K817l666p317
8398b75m081Q03p399k81L116J74n801R74K63K457O856j04m709l624o52J117N83
8381a0583m116P5L392K724J189j329n723O996O08o308n5O709K096L700K109n949
8365d465l384r44m094K59O445k050P109J718l079k617k897M046m0O256O259M624
8349A3146J870k686m524j1641m590p895k08Q317M352m447O859O151l198k406L559
$$ y = [-1878, -5220, -6162, -12737, -7287, -1411, -6519, -7997, -10554, -8275, -7404, -3330, -7517, -8933, -7405, -4062, -1640, -2862, -5972, -7125, -4086, -2669, -927, 100, 523, 2739, 4311, 5695, 2467, -6185, -13542, -10744, -4285, 2647, 3172, -5085, -16622, -14147, -3602, 4513, 8180, 9139, 2340, -3680, -3397, -3934, -2480, 4128, 7677, 5089, -4408, -2123, -7939, -6986, -2937, 366, 227, 7891, 10708, 7042, -275, -4356, -3553, -10952, -11233, -8117, -7943, -13744, -12770, -12507, -10050, -3194, -3298, -8007, -11631, -12283, -11166, -10583, -14699, -14624, -11232, -8508, -7319, -8648, -14371, -7375, -6767, -13075, -13130, -6421, -4325, -625, 1484, -4465, -7849, -8793, -12887, -12628, -6183, -8233, -1124, 594, -2485, -5102, -7999, -3953, -3993, 2263, 8522, 13146, 15016, 12330, 7806, -3835, -8425, -16320, -16528, -8211, -3859, -8306, -1447, 4704, 1506, -900, 2659]
8334B659M688L233L95n734P67L92M23m178j887J189N62N633N604p879k339k819
8318G09K72K467j135j923q37k789O525k089m621l17Q050j899M683L484o744k819
8302A017K441l194j0847r933L79Q455P931k712m296L132J0058P973L542n047j1581
8287b682m557M657Q10P564n307n989j983j650M413M459o3M540J994m976p61J590
8271B059J336L070k292q689q518N476L945K880N396m598J76K252k836n874J508
8256d709Q963r20L050K787J192j54n839o323Q80K925J903L576m241j2646p425
8241a6981N615N971m250j50M606R48M152l129O651M797k448q109o818q71J985
8226h031J406K165j635L966M881J744J08K44L246M488K365j809j338j1116J945
$$ y = [2659, 7347, 10580, 10975, 5241, 6008, 6400, 6823, 2645, 758, 1947, 2509, 8142, 13746, 5867, 3528, 709, 981, 3448, 2313, 390, -447, -3236, 3289, 1200, -3421, -3738, 4312, 2413, 7096, 10580, 3836, 1017, 3458, 264, -10583, -20516, -20137, -11682, -3751, -6463, -10759, -7627, 2431, 10404, 13946, 8899, -2682, -7239, -2582, -1772, 5792, 485, -5504, -7487, -9137, -4724, -265, -328, 4212, 6206, 1230, 469, 2059, 3395, 6465, 4173, -4516, -13034, -7558, -3613, -733, 4663, 65, 241, 2493, -343, -6217, -4709, 4254, 3334, 6384, 9171, 10363, 10209, 4370, -1953, -1073, 1852, 3755, 7331, 3090, -9556, -16981, -11366, -5395, -9645, -9795, -5189, -4241, -89, -3218, 3433, 8230, 5782, -2327, -9145, -10016, -8031, -6625, -4460, -6095, -2129, 2752, 4496, 4604, 4848, 8094, 12582, 14947, 13138, 11800, 684, 2629]
8211B629j096j513l994l713n78N201J443l863P9M333K413k704n399O902K754m218
8195a324J591K580M499J066n854o007q15m61P406M599m683K965K320l156k995
8180A731m192k039L666k065m46l84J99m74j710L786N485m467p919K121J552M877
8164b79P236r70j720O92J511J410j400l705p183n644l090L118L178J449J307N669
8148A579M290R388n196k996K532o997M63L923J383J010q256j491j553O008M484
8133H571M416J098J864n638j264p37K50n880o703P106K229M782k531m026j638
8118A899K278N184l658j0560n480K643L900k862j921N015M917J014n015K690P74
8103H18l583r369M866R529L024K668j431J970p499m915p182j799N043j225K065
$$ y = [2629, 1533, 20, -3974, -7687, -8265, -3064, -1621, -5484, -5405, -1072, 1341, -1363, -6762, 140, 2894, -1324, 267, 2847, 7346, 8412, 2558, -3449, -4264, -4725, 2681, 7280, 2597, 5562, 7882, 4726, 1731, -2461, -4500, -834, -2899, -3345, -3729, -3530, -4004, -5714, -1928, 3557, -910, -8829, -6708, -5156, -279, 6957, 5987, 4267, 4959, 6470, 7880, 6480, 2775, -4408, -10052, -13142, -10024, -6846, -5397, -4090, 1579, 5869, 15257, 10061, 7065, 9597, 2600, 3063, 6986, 8369, 9379, 1123, -368, -1921, 4087, 8571, 12987, 14085, 15949, 10311, 9047, 8310, 8560, 2680, -4023, 3083, 5312, 10094, 7563, 3537, 1899, 4177, 9361, 5703, -4857, -10337, -7694, -3794, -6656, -8577, -3562, 1355, 2369, -2646, 44, 818, -2765, -12134, -7268, 2261, 5285, 7953, 6522, 8492, 993, -3922, -11104, -12903, -7860, -9085, -7020]
8088g020n178O98P18l431P062Q373J586M661K533k062l250o611K058L367J041
8073D545l770m13kn325L433k840K863J803l844o702K903N676j249l514J04L923
8057b409n5o501L068j589J159M121k082m28L888m398n674l4j644O841R836m055
8041D4q943O267j98j627l173K004r82M943M028k596N82J0k324n105M997j201L623
8024C49n89p74N886J709k572j0366j225J281l178K038P637L472o023K059L761
8009C465j763l217O821K143k689J222k056J696L628M46k858n342r592M920J081
7994b095k235J615J140J023N37k1P136J960j094k098O040o384j730k907J308K072
7978D267j092l502l319j094N966R022p1n703k162n478L246M110P673q434q419
$$ y = [-7020, -12198, -11500, -10782, -14213, -7151, 1222, 2808, 7469, 10002, 7940, 4690, -1921, 137, 3504, 4545, 775, 362, 360, -4965, -1532, -4372, -1509, 294, -3550, -10252, -7349, -1673, -2922, -6436, -6332, -2409, -2464, -8965, -5897, -7486, -6327, -2206, -4288, -4716, -828, -5226, -10900, -10934, -12578, -5737, 4099, 44, -8899, -2632, -2830, -4457, -7630, -5626, -6608, -1665, 2363, -233, 349, 359, -1965, -7070, -2073, -3274, 349, -240, -1014, 4872, 6581, 4009, -6357, -7582, -6301, -9479, -7441, 196, 3668, -2355, -296, 3465, 1702, -1515, 5306, 7449, 4760, 5982, 3926, 5622, 9250, 9696, 6838, 1496, -8096, -3176, -2095, -4330, -2715, -1575, -552, -15, -36, 7100, 9060, 7966, 5868, 11908, 5524, 3794, 887, 2195, 4267, 3175, -327, -3646, -4740, 1226, 10248, 10177, 4474, 2312, -3166, 80, 4190, 11863, 3429, -4990]
7963d990m813k750p12R392P906N299j215p023O99J447l216O313j668r461k354
7948g146P949k920l807K986N901J498k808N044r61L305J014O035K145k408n605
7933A0222o482j329j398P83M09l527O93P705j621n510n93N652o039J387P53j360
7917b55N378M344n990l849k518M096J709m627m953o80r36M732m94j727J071K292
7901b407k052J1173O041l067j046j708l729p323k850j021m71L365M07P803N843
7886H958m079n136J453L894L141J50m759K171L842K885M129n824o205n456k78
7871a114J641K960L621n313l102n268j552m31R470P84j0248o81J0110j423p252
7856g798k126N924L23l851J320O325r33n710n328K878K695N654j933j311P636
$$ y = [-4990, -9803, -12553, -13265, -3873, 4033, 9332, 8117, 1094, 1793, 3240, 24, 6337, 4669, -4792, -7146, 803, -2117, -5924, -2938, 2963, 4461, 1653, 6697, 5736, 9041, 10055, 16090, 18235, 15827, 10222, 3740, 2411, 1013, 1796, 2205, -1322, -629, 7076, 5455, -55, -648, 5004, -1035, 352, 1105, -255, 5123, 9467, 3477, -372, -2890, 1206, 2915, -1712, -6665, -7345, -8281, -3549, -4043, -5770, -4699, -2407, -4459, 6714, 12755, 9688, 8642, 6934, 3205, -4118, -6968, -7989, -8460, -5095, -4688, 3115, 8958, 4879, -257, 1196, 5090, 8231, 8381, 3622, 5793, 9635, 12520, 16649, 10825, 4620, -836, -1114, 527, 3487, 7108, 1795, -1307, -6575, -8127, -8558, 912, 1696, -8552, -9233, 877, -546, -7798, -9924, -4000, -3677, -7528, -6208, 117, -816, -6526, -11854, -8976, -6281, -627, -2560, -3871, 3765]
7841C765Q421M176p815n904N730k29N004k30p736R06K948M464P303k074r003n384
7825D342k304j562l541p6j643K579k218k108j883j024N673m8l105J817N004N70
7809D73m667l509n156l51j395K702P562J1464P28N34j125n793k996l260J662Q852
7793E725K825j946n91m072l576k907k397n499j805Q890M727l224j142O460J337
7778B805o341l191l48O00l097M474P66j24j983m402L251J458k338R488R147k604
7762G561m270m176M884j966J528q84n060p1K877k493J973p57k789l94Q16J254
7746a967J919J963K635l808o333J210R38l751L75l288q333K86J0119K470m497
7731a0062O026O572j492j1652n000R040M359j530n28j82l313K663P652L411J329
$$ y = [3765, 12186, 16362, 8547, 2643, 8373, 8144, 13148, 12918, 5182, 6088, 9036, 13500, 20803, 18729, 9726, 4342, 2038, 476, -3065, -3141, -4784, -2205, -4423, -6531, -8414, -9438, -3765, -3813, -6918, -5101, -97, 473, -4194, -7703, -12859, -13210, -14605, -11903, -4341, 7123, 7851, 8385, 7260, 1467, -1529, -4789, -3127, 5725, 8550, 6604, 6013, 1941, -1635, -4542, -6939, -12438, -14243, -5353, -626, -3850, -4992, 1468, 2805, -3536, -6727, -7075, -6475, -9572, -5098, -4332, -4456, -6439, -10841, -7590, -6132, -8470, 1018, 10165, 7561, 3291, -885, 3999, 2033, 3561, 2677, -2383, -2454, 423, -2070, -97, -854, -3643, -4037, -3221, -1967, -48, 1915, 4550, 742, -5591, -4381, -3443, -7194, -6819, -10107, -18440, -18154, -8035, -5565, -10062, -4036, 2536, 1044, -10608, -15608, -6568, -2209, -3739, -4267, -4449, -7762, -5099, 2553, 5964, 7293]
7716G293J442l506j687M20k235R54m45p480O15l425P88K562J749N797n130l921
7700f209j010J801k771l717J388J0794O408j117j2071q72M075N0J762J005m342
7685d826M514l25q340p974k565l92M296N202K554O560N620j252J308J148j623
7670C905m549O531O091L008p410m480K318k886k614K139J864k518k642k668o435
7655a0346K49J854L747J635N411O068M483k311K174r901p557O401J79J489L276
7640F851N910l975r73m190p636K348J610N025n775p537o832K402K008N035N326
7625d03n20l235N699K708J707j297j574k881n033L307j741p168q84P064j763k262
7609h276N124J009Q8k085Q03j437M487O280m46L902R4r989l743O547L747j439
$$ y = [7293, 8735, 5229, 3542, 3962, 1727, 2681, 2236, -5244, -4629, -8054, -7266, -4704, -2955, 2842, -2288, -6209, -7219, -5418, -8189, -11906, -10518, 276, 6684, 5567, -6504, -7376, -3301, -3251, -1489, -484, -4826, -312, -637, -8977, -16951, -19516, -19908, -15612, -10410, -7856, -1296, 4324, 3072, 4380, 5528, 3905, -644, 5887, 11978, 14986, 7576, 3096, 5414, 2528, -86, 2053, 3917, 1399, -1243, -3911, -10346, -10097, -8243, -4496, -2861, 2550, 8618, 13101, 10790, 12964, 3063, -4494, 1907, 2086, 3575, 6851, 12761, 8786, 7813, 3623, -4013, -1665, -55, 4970, -805, -8342, -15174, -12772, -10764, -5729, -403, -923, -4158, 1541, 4249, 5956, 4659, 3085, 204, -4829, -1522, -3263, -10431, -11315, -4251, -6014, -8276, -3152, -2143, -2055, -4140, -3337, -4774, -287, 5993, 5547, 9449, 9543, -446, -4189, 2358, 6105, 4666]
7593D666n254k446k522l17j42j00M566N250J662j104l296l639J366n529l090L862
7577f067M619m896k565K18K466O722L788K572k574N603n574o930l632k385M581
7562d054L589K376J822K854P404m359p525q69j052J884O237l107n71J354o408
7547d25l802k295k82P811N561m145o076k350L798O275k89J108m709J920j056L672
7531D716K471l931r982J560L365k160j425N185O78k973L998N552M86J897o931
7516B506k176O196N485m001n009P28k227l929k395R81q107m083M081R017Q333
7501E400L593N735k555j0882o055J385j245k134O870K291J245j724l629o61K421
7486E5J775j161l008J68q782j257M920M657J324L385l899k140k222L998k691o97
$$ y = [4666, -588, -3034, -5556, -5873, -6015, -6115, -1549, 3701, 5363, 4259, 963, -2676, -1310, -6839, -9929, -6067, -1448, -6344, -8909, -8691, -6225, 497, 4285, 6857, 4283, 9886, 4312, -2618, -6250, -8635, -4054, -465, 1911, 3733, 6587, 13991, 9632, 2107, 1238, 186, 2070, 8307, 5200, 4629, 5983, -425, -4227, -6522, -6804, 1007, 6568, 2423, -3653, -6003, -2205, 4070, 3781, 4889, 180, 2100, 1044, 4716, 7187, 3256, -6726, -5166, -1801, -3961, -5386, -201, 477, -2496, 1502, 7054, 7540, 9437, 2506, 330, 6526, 12011, 8010, 3001, 3729, 1502, -2427, -4822, -3841, -11948, -16031, -11950, -2933, 5400, 8993, 14728, 12173, 1291, -4764, -3379, -4624, -6758, 112, 2403, 3648, 1924, -1705, -2366, 55, 1830, 669, -2339, -2171, -10953, -12210, -7290, -2633, -1309, 2076, -1823, -3963, -6185, -2187, -4878, -5575]
7470e575R574P249k075n84P97l367j1082j792N177J887O69k774j149j912o479
7455a1436K415m542k9M219K262q74O573O583Q105o1k375N024k408l576j33q930
7439H17k378J96M95k827r264J741Q134N307R2L442k966l859j731k036p325l495
7423a5657Q31O259L482M002p52L33J269n78M478j253J808j474m478J17M613j9
7407B981R62m666k795m755K982k293l992l317k485N347L366K470N885j177k665
7392d152L691k313K19J021J994N66l673k999o340n77N394l935J039K042R547n573
7376d049q571M88J195q82J006P692L697L296k044o647r031k778N724N471j260
7361f693j011N755L66k399L916M028J66K747o498o451N078l588K905O42L758M984
$$ y = [-5575, 3999, 11248, 9173, 8589, 9386, 6019, -5063, -6855, -1678, 209, 878, -1896, -3045, -4957, -11436, -9021, -13563, -13592, -9373, -7111, -7985, -1412, 5171, 13276, 13215, 10840, 15864, 13456, 9880, 9747, 817, -1561, -1365, -870, -3697, -12961, -11220, -3086, 2221, 2313, 5755, 2789, -1070, -2801, -4837, -12162, -15657, -14826, -8567, -5085, -1083, -1835, -1502, -233, -811, 3667, 2414, 4222, 2748, -1730, -1613, 3000, 2981, 3943, -723, -3518, -8273, -5291, -7584, -11576, -14893, -17378, -12031, -8665, -6195, -310, -1487, -4152, -461, -2774, -2555, -1534, 460, 1026, -2647, -5646, -11986, -12563, -7169, -11104, -10065, -8023, 1524, -4049, -12620, -12132, -10937, -11819, -10813, -3121, 576, 3872, 1828, -4819, -13850, -16628, -10904, -5433, -6693, -7704, -1949, -1583, -3982, -66, 3962, 4128, 6875, 377, -6074, -996, -4584, -1679, -1037, 2721, 7705]
7345G705r016K369L83k434J643K16L46O29j647J582o156N75K714L949N935j475
7329G318l682J503P99n633K009K476j884l761J439L926O28l801k801N1j20k266
7313c799j672k597K257l430k228O496J044n045l975K730M284p98L398k187J10
7298e412K214j248L267N654M431o812k693N933M62m309K542o264o135K691R725
7283D046N687J646m242J537n071L064O1j53j391m955m535k290j217J935J916L331
7267f31L832n510n116k517K562j476l88N213j833l191P671L695K002j623q40k831
7251i81o470j510o302l302J2075P781M01m246j156k060j337j010J41P017O864
7236E905j16q273m132Q532M207m394j057O878Q801m406j4579m201m673M705K723
$$ y = [7705, -1311, 1058, 1441, -993, 650, 866, 1212, 1841, 194, 1776, -4380, -3805, -1091, 2858, 8793, 7318, 3636, 5139, 5938, 305, 2314, 4790, 2906, -855, 584, 4510, 5138, 1337, -1464, -1413, -1533, -3799, -5471, -8068, -5811, -9241, -11469, -4973, -3929, -8974, -12949, -10219, -5935, -6733, -3335, -5522, -5412, -3198, -4446, -1179, 4475, 8906, 2094, -599, 5334, 5796, 1487, 4029, -2235, -8370, -5679, 4046, 9733, 11379, 7137, 8674, 3603, 6667, 6728, 6575, 5184, 229, -4306, -6596, -7813, -5878, -3962, -631, 3201, -2309, -7425, -9942, -7380, -8856, -9244, -4031, -5864, -9055, -1384, 2311, 4313, 2690, 1850, -981, -7451, -8961, -15263, -18565, -6490, 1291, 1692, -2554, -3710, -5770, -7107, -8117, -7976, -959, 5905, 5789, -2484, -6616, 1916, 6123, 1729, 672, 7550, 16351, 11945, -2634, -6835, -11508, -6803, -4080]
7221d080m110O27P217M958n33m749l137Q57J0052Q96J161j013k311J930J57n56
7205G366l19L6J453p393p086o718K861Q788L248n525n067J0829J066K698k800
7190C437n971J218k192m18K682K812K066K57M95J260k300n600m959N631k356k692
7174f630J875K046J711M15l464n134R94O951M359m978k938J0128Q333j537l589
7159H542m854k268J911k508j245m619J848M611L136q22M39J073J678l026j127
7144B769l822p16m867J611J0364L159J219m680p001k080R371L212n44J279p837
7129A437l377j736L194k582q83k343L709L249K90m221l056L443p304Q970j949
7114c159l535K928L010j669M619O484L063n852j1924n205j74Q604M472j829j533
$$ y = [-4080, -8190, -7563, -346, 4612, 4079, -670, -3807, -2950, 7102, 7998, 9159, 8146, 5835, 7765, 7922, 7366, 7047, 7083, 8536, 1143, -5943, -12661, -9800, -1012, 2236, -3289, -8356, 2473, 3539, 6237, 3437, -2534, -1316, -3508, -3926, -1244, 1568, 3634, 3891, 4386, 5646, 3346, -2254, -7213, -1582, -3938, -6630, -4755, -2709, -998, -583, -4047, -9181, -8187, -1236, 3123, -1855, -4793, 5335, 13668, 12131, 8542, 3688, 1420, 3331, 823, -422, -5041, -3193, 1418, 4554, 3732, 4171, 5244, 6922, 3896, 2769, -1053, -1769, -6636, -5025, 5339, 8498, 9717, 5037, -1964, -4044, 5327, 8539, 7995, 9274, 1437, -1940, -3676, -482, -3064, -3947, -6290, -2581, 668, 958, -3263, -6319, -2876, -10180, -1210, -3159, -6694, -3766, -756, -2425, 2194, 8678, 11741, 5889, -6035, -11240, -11414, -2810, 1662, -167, -1700]
7099a700K792k787M288J217j123l672j462m841L719N600K377o27J535m12j481
7084C423k820j791l240M51Q58k909j5995O309Q331N835N648p831k973Q37M703
7069a164l962k043K294N102L163m580J805m8K064m063j047k035j158m117O346
7054c443M357j8L935M718n025j2356j224K522k829k189K447j70M552K388l490
7039e825n256N08J239k709P10L883n742M184J2667m244q140k654R13rn68k240
7023a3283J21Q295M043n589j191O116J641o820K850M154R190K009o194j0372k53
7008e283M080O380L067o316m423n036J207Q820R03J459j88n23n627j681K82m085
6992f964L708K356J065N408J808L167l937P69j837l40O14J669j643L300L579l766
$$ y = [-1700, 1092, -1695, 2593, 3810, 2687, -985, -2447, -7288, -3569, 2031, 4408, 3781, 5316, 4904, 3423, 603, -1188, -4428, -3977, -3119, -6028, -22023, -15714, -7383, -1548, 4100, -3731, -6704, -5867, -1164, -5126, -7169, -4875, 227, 3390, -1190, 615, 567, 2631, -1432, -2479, -4514, -5672, -9789, -3443, 914, 896, 4831, 9549, 4524, -7832, -9056, -6534, -9363, -11552, -9105, -9275, -4723, -2335, -5825, -11081, -10573, -9334, -12043, -11333, -7450, -13192, -9008, 3659, -585, -8725, -11379, -10466, -10475, -11043, -13283, -13162, -4867, -824, -6413, -7604, -1488, 153, -6667, -3817, 337, 9527, 11536, 5342, -5030, -5283, -1203, 5177, 8244, 1928, -2495, -7531, -6324, 2496, 3399, 4858, 4670, 4147, -1480, -3161, -2879, -6964, -3256, -900, 165, 5573, 7381, 10548, 6611, 7380, 5543, 5203, 5817, 7486, 5843, 9143, 12722, 8956]
6976H956L905J09l033m966N10j804L105l998K371k654j17k384J15J456L451L055
6960H077J232n039k381K006j448l47j909O72l529n618P84L263o18L78j224K739
6944b962O666L047R87K729n670p157m584K39o59M01N799j406n567o03K278L741
6928b721j614j96N775j631m565M380J918J010o491p08J441M865M752r86k263J369
6912D335n87k872p106j201J489k485J92M81R310R45j3005m191P293N197p11J552
6896a364l229n712J165J960o326K501j642p55N664N092K988L524M324k019l952
6881B219K149O110j90J319j531p191j0675L66m87l749K522P977k759m278K085
6866f113Q964r26l021m62L268L915K077q65J60o555r43n39N750Q498N2p203j197
$$ y = [8956, 12861, 12970, 9937, 4971, 5481, 3677, 6782, 2784, 5155, 2501, 2384, 0, 115, 1571, 5022, 8077, 9309, 4270, 1889, 3895, 2447, 2100, 191, 863, -2666, -8284, -7500, -4237, -4855, -4477, -5701, -2962, 3704, 6751, 7738, 10467, 4797, -2360, -6944, -6705, -7364, -6963, -1164, -2570, -8137, -8740, -6462, -2721, -4335, -4531, 1244, -387, -4952, -572, 1346, 2356, -4135, -4843, -3402, 1463, 6215, 5229, 2966, 4335, 3748, 876, -6230, -7431, -5942, -8427, -8235, -7754, 1556, 2501, -10504, -14695, -7402, -2205, -2916, -1364, -4593, -10305, -9140, -7180, -13506, -11005, -12647, -13402, -7738, -2646, 342, 3866, 8190, 6171, 2219, 4368, 10478, 10288, 11607, 10076, 2885, -7790, -7424, -7911, -11660, -9138, -1161, -3920, -8198, -6113, 2851, 1925, -1096, -1558, 1710, 5625, 7702, 6837, 6997, 442, -501, -1040, 4710, 13208, 13260, 6057, 4860]
6849D860J927p69k591J858L90j180k899l623k925M422O708o39L056p11L44l328
6833D900K547o688j689j837l793J063P224j976L857j025l210l763j907N581m81
6818a197k340j737L003n682l198k284j532K67L26Q212J0173k70m687k749N486
6803A791j867m582N668n035o147Q190O571N206M006q327q244k245k542N03P380
6788C26M527J049o776p405K913N541p11P35l747j221N153M522k23k485L464K75
6772E937j0475P13N113m011k360o020o855O453J1037K391j491M233k061K149L587
6757H340n214o630n728K856P02L531j653o989k963L741M432m134m92o228K260
6742a4169L690J1156P321q634l078M608K193J91J0499k999l642L967l846n904
$$ y = [4860, 6787, 6018, 3427, 5285, 5675, 4495, 1596, -2027, -4952, -530, 6178, 5539, 8595, 7884, 8228, 4900, 7447, 759, -930, -2767, -6560, -5497, 1727, -249, 3608, 2583, -627, -4390, -6297, -716, -1197, -3537, -5274, -2271, -7953, -11151, -13435, -14967, -14700, -14374, -6162, 4011, 3741, -946, -3695, 1791, -76, -4658, 1010, -4025, -10172, -1982, 4589, 9795, 13801, 5474, -2770, -5015, -7557, -7054, 326, 4853, 5902, -874, -8279, -5366, 175, -536, 199, -3548, -4769, 384, 4906, 4683, 2198, 5662, 5937, -4538, -3825, 1288, -2723, -5083, -11103, -17958, -11505, -468, 1923, 432, 4665, 2604, 4753, 8340, 3126, -3504, -9232, -6376, -5674, -2143, -3796, -10785, -13748, -10007, -5575, -9709, -10201, -16429, -14169, -10479, 677, 7998, -636, -3714, 894, 3087, 3278, 13777, 10778, 7136, 11103, 7257, 1353]
6728A353r2L532J79j029k271o441r410K495O832K576M391m088j195l425K531l002
6712g064k771L407j61l122j669N109k979K708P295q08l688J821J820p839O528
6697a413K004n097M397j444M545K983l765M95m850q806L731J0481M348N536r235
6682C910n706j448J008M044j318J776M551O93m461j893k018L282L191L555L006
6667A2172l191k264l360L536o03L532L269j771j717M304N413p014o874j846m600
6652a014p435m680L216N545L676J05j783K671J258J386m067O903J4398k205q997
6637H977k402R05j815m601L038K951J482J703J033l84J707k647k732p736o88n937
6621g146L12q79l515L748R567p170m361j999k911Q328n82l647O570L481J034N762
$$ y = [1353, 1261, 4793, 4972, 3943, 1672, -4769, -14179, -11684, -4852, -2276, 2115, -1973, -3168, -6593, -4062, -7064, -9835, -6428, -6589, -9711, -11380, -6271, -9250, -6542, 753, -55, -3743, -1922, -102, -7941, -1413, 591, -4506, -109, -1553, 2992, 5975, 2210, 2705, -2145, -10951, -7220, 3261, 7609, 13145, 3910, -1796, -3244, -2236, 1808, 490, 2266, 6817, 7510, 3049, 1156, -862, 2420, 5611, 9166, 12172, 8981, 6717, 3357, 6893, 6290, 9822, 13091, 11320, 9603, 13907, 19320, 12306, 5432, 3586, -1014, -8449, -13129, -9913, -4368, -692, -587, -2370, 301, 1559, 2945, -1122, 5781, 20179, 17974, 8977, 6575, 7480, 5665, 1064, 4102, 7053, 8535, 10238, 11271, 10887, 12594, 9947, 7215, -521, -1209, -7146, -6834, -7713, -11228, -7480, 2087, -5083, -9444, -11443, -14354, -6026, -6608, -10255, -3685, -204, 830, 6592]
6605F592Q387j985q959o707j778M794R094j325m261j931m673k937M307P77R61
6590C56j982P31k07n638L83L55P708j322l698O2O617j937J640l870j521Q262j64
6573E775m637m011K428q557n687J760j18L800L807l722K09M364n46l182o3O310
6557b070O015o124k200p892l0J0795R895m413k172m078K043K513J2690J742q005
6542H709p933m834N316l67j337M126j272k101J174N56J856L396m214n969l54k698
6526e946M34K459O503N215J387K66m215N83M365o50q098K24M564m592o122J721
6510a902M175J904j972J209N355M706j605m421q3J626m602l209m580j65K140M740
6494C316L582M613J948k527O75j986p536J143L145k530l485k489l717J797K409
$$ y = [6592, 14979, 12994, 4035, -2672, -4450, 344, 9438, 8113, 3852, 1921, -2752, -5689, -1382, -605, 356, -1626, -895, -1102, -6740, -6357, -6002, 1706, 384, -3314, -3252, 3365, 1428, 3068, -802, -2323, 5939, 5775, 1138, -2873, -445, -9002, -14689, -12929, -13047, -9247, -5440, -9162, -8953, -4589, -5135, -8317, -8380, -2070, 3945, -2179, -4379, -12271, -12301, -1506, 8389, 3976, 1804, -2274, -231, 2282, 14972, 16714, 8709, 776, -4058, 1258, 891, -446, 3680, 2408, 307, 1481, 2037, 3893, 7289, 3075, -2894, -3248, -5946, -5512, -3053, 3450, 8665, 10052, 10318, 6103, 6686, 11051, 10401, 2303, 2527, 7091, 2499, -3623, -1902, 2273, 4177, 2205, 3414, 8769, 13475, 11870, 7449, 7366, 8992, 4390, 1181, -3399, -3564, -1424, 3316, 6898, 11511, 13459, 10932, 11607, 9621, 2085, 3228, 6373, 3843, 358, -2131, -5848, -4051, -1642]
6479a642K827j716j426n583q24O66K634K121P52O23l797K836J0173M199m619l378
6463C846j756l535k795l018R329J058m350r86L554m001k48j134j888N85M016O092
6447D769r38j238J18j963K421L419J516K379J97p334l793o856l748P026J1301
6432G276l004p461l970r59N91N694J257L371L665o919J714J692j5737l489P660
6417h619Q294M620N336m11K626r6j1123n119k391M77N521n296M16K575o20L185
6401f25L939m146m354l110L698j692j568L94J129J9l159r01J910O662k379o098
6385a0281L753O210n071O23J0427l382l615L180n519L376k86n13J618k888K996
6370F28K827j702m97l032N68K674P88j121q088o271J067j623L073M813m120l933
$$ y = [-1642, 1185, -531, -1957, -7540, -8364, -7698, -5064, -2943, -2191, -1568, -5365, -2529, 7644, 11843, 7224, 3846, 2090, -1445, -4240, -7258, 2071, 3129, -1221, -2207, 1347, -2654, -2902, -4036, -5924, -5339, -1323, 4769, 3831, 2593, 2711, 748, 3169, 6588, 8104, 10483, 10680, 3346, -447, -7303, -11051, -4025, 7276, 4272, -3189, -7159, -8118, -7527, -1833, -576, 2795, 6460, -459, 1255, 2947, -12790, -16279, -8619, -325, 4295, 9631, 9220, 11846, 11750, 627, -4492, -6883, -6406, -885, -6181, -5765, -3190, -3810, -625, 3314, -832, -5186, -8296, -4598, -6290, -7858, -7464, -6335, -6316, -9475, -10376, -8466, -1804, -4183, -10281, -6528, -318, -5389, -4766, 5661, 2279, -1336, 1844, -3675, -299, -585, -1098, 520, -2368, 628, 3455, 1753, 1256, -1776, -1208, 1466, 2254, 1133, -6955, -13226, -12159, -13782, -10709, -5896, -10016, -13949]
6354a3949Q593Q340l631q50K623l208j778l693K847p437J24J1476L491r517k118
6339h687J2378n64l202n6R3K128L600o676n28j209K844N3q69K504k370m074L256
6322a379J889o10O649K096j733L197l496m02L69n177j775O532M962o358n120M992
6306D636L700q321l695L526k722j346J740q58M411N722k407o179k40J212L037
6291B216L670m932L245K704k171k576j125N036K577J35l929o130k681l666j13
6276g740O55O16j842k175N424n85n72K615J168J744n680K089j246N844M208P992
6260A2515m21q2M791k843j2273j433L669n257j428J686j923k778N992M697L150
6245H062Q22K912r408o753K109j411N312l881R20O416J591o502L647Q12o49L480
$$ y = [-13949, -5356, 2984, -647, -1497, 1126, -2082, -3860, -7553, -4706, -12143, -12019, -543, 2948, -6569, -8687, 3691, 3127, -75, -131, -38, 2090, 5690, -986, -1514, -2723, 121, 174, -695, 1809, -561, -4635, -1379, 510, -100, 6549, 8645, 6912, 10109, 6613, 6211, 6580, 1403, -372, 6160, 11122, 4764, -356, 4636, 8336, 15, -3680, -154, -2876, -4222, -2482, -3340, 1071, 6793, 4386, -1793, -2033, -821, 2216, 5886, 954, 4199, 6903, 4732, 2156, 1031, 6067, 8644, 8779, 4850, -1280, -3961, -7627, -7740, -7085, -6469, -8311, -10486, -5062, -5647, -6219, -3604, -2436, -692, -6372, -4283, -5529, 315, 4523, 12515, 12094, 12012, 16803, 13960, 1687, 254, 3923, -1334, -2762, -1076, -2999, -5777, 215, 4912, 8062, 8884, 11796, 2388, -4365, -2256, -3667, 1645, -2236, -1316, 5100, 6691, 189, 3836, 4648, 3999, 7479]
6229G479J004l246l775m323p24N397J594L16P085j888q757p125O752L254L060
6214F103k144l523k776n496O971Q864m837j346j908L459l666o134J212m269M62
6199i028O971o62K199M644Q433j592j132m616j255n224k597J747k060l960K076
6184f056M794J0245K967J073o13Q01j308o778o493k892O35N587M275K063m77o880
6168I43o265L965K490m468m022O858O72m385l649l923k028O473O404o849k719
6153a0503J2012J925M563j872m460J957l514j631q21J090j046j532O099J175m694
6138a252J381j503j830L623p751r775J848K030K469L688M0j826n145N656J158
6123g189J712J11n56k7m010j8L046o656O23Q86k808L722Q276L443r15N138J004
$$ y = [7479, 8483, 5237, 1462, -2861, -3585, 1812, 3406, 3722, 10807, 8919, 162, -6963, -211, 3043, 6103, 3959, 436, -2340, -7836, -865, 7999, 3162, 1816, -92, 3367, -299, -6433, -5221, -9490, -9028, -2057, -2719, -520, 4124, 12557, 10965, 9833, 5217, 3962, -1262, -3859, -2112, -4172, -8132, -6056, -1262, 8983, 11950, 13023, 12410, 13211, 11903, 5125, -1368, -4260, -3625, 1962, 6237, 8300, 7823, 943, -5322, -1357, 1133, -3335, -7357, -499, 173, -4212, -7861, -11784, -13812, -7339, -935, -7784, -10503, 1509, 3434, 7997, 6125, 1665, 3622, 108, -1523, -2344, -1254, -2300, -3832, 2267, 3442, -1252, 129, -1374, -3204, 419, -7332, -17107, -15259, -13229, -10760, -7072, -7032, -8858, -14003, -8347, -7189, -5477, -5366, -5922, -5949, -9959, -9977, -6931, -13587, -12964, -12078, -14886, -11164, -2888, 555, -360, 4778, 5782]
6106E782m895m029m370M533o28j117m308R637M903n537k904m06N586M437m66k837
6090C381l298j138j436L099o618k082L143j601l446L888J4928j278o961l384o76
6075c479j238K165n877N327O070o83n197p895L10K749M371M768k509j242o796
6060i156n465L853J653k762K682N692J961p816p07P890P437k960j576M849l254
6045B321J584K239k865o605M862L988p69K305n46m77l256J925J83n462k252J91
6029b634M166J421l600P98O762K481q797J772N381j179r758o173K154Q714j988
6014d80j605J422P168Q828m670n759n20k607o098p072M755J044K108J085L10m683
5998f774J187N091P81k48K247K217k955m280l0o921k388p56R993Q923K723m328
$$ y = [5782, 887, -3142, -7512, -2979, -3607, -4724, -9032, 605, 5508, -29, -2933, -3339, 2247, 6684, 6218, 3381, 83, -1055, -2491, 608, -6010, -8092, -4949, -6550, -9996, -6108, 8820, 7542, 581, -2803, -3479, -4717, -2552, -8429, -3102, 2968, 2285, -2912, -10807, -10497, -7748, -3377, 1391, -1118, -2360, -9156, -14621, -10768, -9115, -11877, -9195, -3503, -1542, -9358, -10065, -2175, 5262, 2302, 726, 5575, 2321, 3905, 6144, 3279, -3326, 1536, 5524, 4755, 7060, 6514, 6037, 2781, 4706, 4889, -573, -2825, -2634, 1532, 2953, -647, 151, 6913, 9394, 597, 2369, 7750, 6571, -3187, -9360, -7206, 1508, -480, -2085, -663, 6505, 15333, 10663, 4904, 4384, 1777, -4321, -11393, -6638, -5594, -3486, -2401, -2091, -6774, -5587, -496, 285, 37, 2284, 4501, 1546, -2734, -2764, -9685, -12073, -12829, -2836, 6087, 8810, 4482]
5982D482j2829m236M796J997j586l940k702m836J392K300N690P425j701l741O769
5967g20K938k711l374n1J328j881r14K88l084K226M440L156K503L375q41L2j442
5950E268P359j539q240l397j949L37L566Q71n633K494R34m511L74o217M394M390
5934a499M961K550J566j630l18N685m267l894J597K936k085l697o203J577J180
5919a541M750j61k857M224l88m585K838L602l525k146L070L649j230p29L448J200
5903I619N847j852o520K289k399p011m761K80K666L849K142o95n43j157k179K139
5887A714J494L941N81k651J183k574L623N177j219k061o991m159O619J885k859
5872C703o870n078K499L136j504O53R335J436o239k214J17n742J90K635q04j596
$$ y = [4482, -8347, -12583, -7787, -5790, -7376, -11316, -14018, -18854, -17462, -15162, -9472, -2047, -3748, -7489, -720, 2218, -493, -3867, -3918, -2590, -4471, -5385, -5097, -8181, -5955, -1515, 1641, 4144, 7519, 6678, 6710, 5268, 12627, 11088, 2848, -549, -2498, -2161, 1405, 2276, -3357, -863, 71, -4440, -4066, -10283, -5889, -1499, 3462, 6012, 7578, 5948, 5630, 11315, 7048, 3154, 4751, 7687, 5602, 1905, -4298, -2721, -1541, 3209, 3048, 191, 4415, 4027, -558, 2280, 5882, 2357, 211, 3281, 6930, 5700, 4971, 8419, 9619, 15466, 13614, 7094, 9383, 6984, -27, -4788, -4508, -1842, 2007, 4149, 3454, 2911, 1754, -425, 1714, 3208, 7149, 7730, 5079, 6262, 3688, 7311, 12488, 11269, 9208, 2217, -1942, 4677, 6562, 3703, -3167, -8245, -5746, -2610, -4114, -3461, 5874, 7310, 1071, -1143, -1026, -6768, -6578, -3943, -4747, -6343]
5856f343J935k7m113o671J957J0353N119N240J678q275q253m32P854J156m247
5841c069K600J979L797P63k467k935j922m045p326M780R818k092l656m140p183
5826a5098K038O507R162j094o225k26N606L427O4L762M33m13K510k51l590m554
5810B058p749j107K09L20l111j869k793K772R182N78m58J86n001k592q17K237
5794g955P111L070k491m480l38k702J06P227k44n097J0201N043o656N827l129
5779E493n038m113q60J1038L320j314K735k894l858q99M545p163m356m016l444
5764a0824L897j00N70j130M846j816K255K581L137k402j2521j925L960l857m016
5749a7345k468J290K086K087Q141L806L716O063j65K810m537P03j070r609j858
$$ y = [-6343, -4408, -4435, -8548, -15219, -13262, -2909, 2210, 7450, 9128, 853, -7400, -7832, 22, 1178, -3069, -469, 1510, 5307, 6070, 3603, 668, -1254, -5299, -12625, -7845, 1973, -119, -3775, -7915, -15098, -13060, -6553, 2609, 1515, -4710, -4936, 670, 4097, 4161, 7923, 8356, 7943, 10453, 10202, 6612, 2058, -5691, -6798, -6589, -6269, -9380, -11249, -14042, -11270, -2088, -1510, -1968, -1782, -6783, -9375, -10192, -7955, -844, 2226, -265, -4745, -5083, -7785, -7679, -452, -696, -5793, 4408, 9451, 2795, 8622, 5493, 455, -3658, -4518, 6520, 9840, 8526, 11261, 8367, 4509, 3610, 8155, 992, -3364, -7380, -10824, -6927, -7027, -6457, -7587, -2741, -4557, -2302, 279, 3416, 1014, -11507, -13432, -9472, -13329, -17345, -19813, -18523, -16437, -14350, -6209, -2403, 1313, 7376, 7211, 10021, 5484, 6187, 5117, -4492, -6350]
5734f350O75L595J535j300n765q604j354M710J1027L90k789L734O589j355k327
5719B411J391O072M003j614J658N419j727q374k442K700j532o126R48L478j892
5704D373L411k030r020J695k006j757R285k613r630n67J259R959J862o056p184
5689i019k603l074N63M035N941J374L859k638q193l680J896O822O387m460l409
5674f199L53Q106l870j86o696M182k480n315J664O854K413K989l079q054k373
5659a1691K97K74J296O878M073J716O144J925n376o760k093J647m628m134O321
5644d111N259J029q16m66j599N252J331M720L262K795j502o207j061j425j557
5629D904j015j601j190J395M818K271p956n702R98O873L473n3L817r606l005n49
$$ y = [-6350, -5675, -2080, -545, -1845, -7610, -16214, -17568, -12858, -1831, -1441, -4230, -496, 6093, 4738, 2411, 3802, 9874, 13877, 12263, 13921, 19340, 17613, 9239, 6797, 9497, 7965, 1839, 2787, 6265, 4373, 7784, 5754, -3266, -1571, -3577, -5334, 3951, 1338, -8292, -8859, -7600, 2359, 4221, -1835, -9019, -11622, -14696, -14133, -10098, -4157, -2783, 1076, -1562, -9755, -13435, -11539, -4717, 1670, -2790, -6199, -5846, 2260, -1610, -1796, -8492, -4310, -6790, -12105, -10441, -3587, -1174, 1815, -1264, -9318, -11691, -11394, -11120, -9824, -2946, 1127, 2843, 8987, 10912, 5536, -1224, -3317, -1670, -6298, -10432, -4111, 1148, 2177, 1361, 895, -704, 4548, 5879, 10599, 13861, 16656, 15154, 8947, 7886, 6461, 4904, 3889, 2288, 1098, 2493, 7311, 9582, 1626, -4076, -3078, 3795, 7268, 7215, 11032, 1426, -1579, -2128]
5613b128k784J642J3096M011l051m520q66n340j835P23J918m412L664m39K931
5598B610L464o882K571L701L14J119N249o75M12l808O073Q91k334o386o742J979
5582A556L292m474k322O43L399j315q429j265L102K241j498l543l58N698J225
5567b048k525N537N788k879r006K20N110M577m529j027l869N087P87l358o614
5552h749L860L708O77j622k782J444m256J615N12n783k331N131N395M902M951
5537F672k288k243J26J954p65m793j961n740j667J011K143K747O178j03k619L99
5521i49R020k570k136n167k615L474J581o098o93M258O232m040m19n933L859P150
5505D954n694j102L323k353J66q88M216L21j1418J199K348k710O715L826k7j367
$$ y = [-2128, -4912, -3270, 9826, 13837, 10786, 6266, 5400, 60, -1775, -1052, 866, -3546, 118, -321, 2610, 6074, -808, 1763, 5464, 5778, 6897, 12146, 11471, 11883, 8075, 14148, 15039, 12705, 6319, -423, 1556, 4848, 374, -1948, -1305, 2094, 779, -7650, -8915, -5813, -3572, -5070, -8613, -8971, -3273, -2048, -4573, 964, 6752, 3873, -5133, -4913, 197, 4774, 245, -782, -4651, 436, 1223, -2135, -8749, -4889, -1181, -504, -2126, -4908, -3464, -7720, -6105, -5593, -11376, -13707, -8576, -3181, 1721, 6672, 4384, 2141, 2267, 4221, 3456, -1337, -3298, -9038, -10705, -9694, -7551, -4804, 1374, 1271, -1348, -949, 8071, 5501, 3365, -1802, -4417, -943, 638, -5460, -6153, -1895, 4337, 297, -122, -6055, -2196, 4954, -740, -1842, 1481, -872, -706, -1594, 2622, 2943, -8475, -7276, -4928, -7638, -923, 2903, 2876, 1509]
5489A509j602j824j562M409n59j1447l000M029R461J727k873n07M79o544j958
5474a0262R899P804k152J72j549j347l756K723L164o627k391k472l522k249K69
5459a2296L509N283J213k699n55Q49K058L633N438K968j121k024O460l659p277
5444A780r215o543K989M460J26J499R29O650m19L63M348M688Q66L301j853k250
5428A1719n866j810J585m328l737L549r34k129M42n661L055K180l719K206J913
5413a535m002l6k143l963j366o44q39J397r81O702N654O155M191k064p47n06l065
5396B208l652l598L100M75L133K362l485l632K335n505n076M233N090r87K666
5381c33r10m585j0381K73J1337K707J401N959N61j0747m941J503K740O135J035
$$ y = [1509, -93, -1917, -3479, 930, 371, -11076, -14076, -10047, -586, 1141, -1732, -2239, -1760, -8304, -10262, -363, 7441, 5289, 5461, 3912, 2565, -1191, 1532, 4696, -1931, -4322, -6794, -10316, -12565, -12296, -8787, -3504, -2291, -4990, -5545, -4696, -2638, 995, 6433, 9401, 8280, 6256, 12716, 9057, 1780, -7435, -13978, -10989, -6529, -6403, -4904, -3975, 2675, 2256, 2619, 6967, 11655, 12521, 15822, 13969, 11719, 5853, 4043, 5628, 1300, -2437, 1112, 178, -1951, -1509, -7170, -4115, -1935, -5654, -3448, -1535, -5537, -5573, -7716, -11679, -13045, -13689, -14528, -13131, -14112, -7410, -1756, 4399, 8590, 6526, 5779, 5273, 2208, -1444, -5042, -1942, -1467, 1666, 4028, 543, -3089, -754, -6259, -11335, -7102, -2012, -2999, -333, -1243, -5828, -16209, -15936, -4599, -1892, -491, 5468, 6029, -4718, -9659, -8156, -5416, 719, 1754]
5366A754n931m88J0066K362j0431k320O813K953L932j980p66K025j77k391o947
5351a526m908l20j075M01K69M550o586J435N689N030K428L649L880p913q028J246
5335a779L304k290p652j258o60J783J951K369O161R292l028n053n781L96K117
5320a28Q163P63J539k544n155o265m16O757K011r19j344l3n066l353j129L818
5304c301K792l672K077J711K543L172m568L282p76o034k197o56Q850O04K119l687
5288B259M659O730l506m441l283k034L271l93%J701l20J052l452j1585m19R171
5272e90P394L381o25r301o335j017L042J506j035L55k617k766Q407J599m001o862
5256i465l789k750L688K235j009J2229M954K20j015q521m802J023K349n845l808
$$ y = [1754, -4177, -4665, 5401, 7763, -2668, -4988, 1825, 4778, 8710, 6730, 5964, 7989, 7812, 5421, -1526, -6434, -6754, -7829, -7428, -7159, -2609, -9195, -7760, -2071, 2959, 5387, 9036, 12916, 5003, -3025, -1779, 1525, -765, -8417, -9675, -10335, -8552, -6601, -4232, 1929, 11221, 8193, 3140, -2641, -2245, -128, 8035, 8798, 10337, 7793, 2638, -3627, -4043, 2714, 4725, 3806, 2462, 2429, -2637, -5990, -7119, -3301, -509, -4181, -2104, -393, 2150, 5322, 754, 4036, 3260, -2774, -4971, -5627, 3223, 3827, 5946, 2259, 6918, 13648, 10142, 5701, 2418, 384, 3655, 3262, 3262, 4963, 4643, 5695, 2243, -9342, -9761, -590, 6804, 10185, 9560, 259, -6076, -7093, -4051, -2545, -3580, -3225, -5842, -8608, -201, 1398, -2603, -9465, -13254, -16004, -12316, -10081, -11090, 1139, 6093, 6313, 5298, -3223, -8025, -7002, -4653, -10498, -14306]
5241a4306j746O30N280O368K163O351N749m968m21o30m452J062J389n193J779
5226i45L544K342j54J899Q59p351o332k164O752N661l15m779N25k400L964r76
5210A30q47K057k086O853M951J696L413k572r777k396l041L068j635n318m157
5195i661J614r5N832Q325K129k124K665j212L153M138n536q302m584k275N71O552
5179A190J502k407o821L658j922O098J0172P90o884j438k575k67R1O85L774L369
5163I015j706l049K233o084o217n996P291O523P50J488K965K859m930o091R82
5148C3Nm012m719J853K642J898J846P417n36n556J906L267Q8m70m70m262j940
5131a010M23l768k297j823K605j13l190K686k030m346L890l061m87O151J998N94
$$ y = [-14306, -16052, -15422, -10142, -3774, -1611, 4740, 10489, 5521, 5100, 4470, 18, 1080, 2469, -2724, -945, 2599, 4941, 4787, 6686, 7545, 194, -6138, -8302, -1550, 4111, 3796, -983, -458, -2858, 1106, 130, -717, 1340, -746, 6107, 11058, 12754, 16167, 13595, 3818, 1422, -1619, 1449, -186, -5504, -9661, -8047, -8142, -2310, 6015, 8144, 6020, 8685, 7473, 10626, 14764, 9228, 926, -3658, -5933, -5362, 1190, 2692, 285, -6536, -2878, -4800, 1298, 11470, 12260, 5376, 3938, 1363, 1096, 1187, 1872, 5646, 9015, 7309, 4260, 6493, 409, -5808, -11804, -4513, 2010, 2760, 4248, 7213, 10072, 5142, -949, 33, 38, -3974, -8693, -6840, -4198, -2300, -454, 6963, 6427, 871, 2777, 6044, 6132, 5662, 5192, 930, -1010, -587, -4355, -6652, -8475, -5870, -5983, -9173, -6487, -8517, -12863, -8973, -12034, -12521, -6370, -4372, -3778]
5115c778K743K783K045m997k853P40n226q55N602J193j4j9o169k33M881Q461L037
5098G341k556o266P70P421K745l454j047L616l463k773O21N885L928l107j0918
5083a257q690O01L676j270j772n505k328O274K488q59n202M873P582r80m93O87
5067b175J223j561q367M53P181O584K798m366n180k216K718k05j247N149n40m375
5051d126J237O940o62o330n123l990l92k586j76Q498O672M899K808l666o621K908
5035B90L721j275K241M931m181r40N353k091p232q53J228J310j587M1n456q88
5019e388P381N785M432M40j0349l733J1220L766m735o24n061o779q53M874l598
5004c222m030M949O110j273n700o436j403L481R735J971j165N730L240m393m210
$$ y = [-3778, -1035, 1748, 3793, -1204, -4057, -3317, -8543, -9398, -3796, -2603, -2617, -2636, -8805, -9038, -4157, 4304, 7341, 4785, -1481, -711, 6710, 9455, 6001, 4954, 8570, 5107, 2334, 2955, 8840, 12768, 9661, -1257, -9947, -9346, -5670, -6940, -8712, -14217, -16545, -10271, -7783, -8642, -13844, -8971, -1389, -2369, -2862, -2175, -952, -2513, -10880, -10427, -3246, 3338, 6136, 1770, -3410, -5626, -2908, -3113, -4360, 789, 249, -4126, -2889, 4051, 3389, -2941, -8064, -12054, -12446, -15032, -15208, -6710, -38, 4861, 7669, 4003, -2618, 290, 4011, 2736, 4977, 9908, 5727, 4787, 10140, 8049, 817, -36, 1192, 2502, 915, 956, -4500, -5388, 1993, 7778, 12210, 12650, 2301, -1432, 9788, 13554, 8819, 8195, 3134, -3645, -4498, 376, -3222, -7252, -2303, 3807, 2534, -3166, -9602, -11005, -7524, 2211, 4182, 3017, 8747, 11987, 7594, 3384]
4989C384K773N53L52j726q411N239M119N9j877j734q15m580J643J642p348M155
4973b572j039k656R622l22k612M777j698l661J799P52n985r47k547J828j71J177
4957d255n276J884M506l095k64L971m77J826m416n832Q04N264l994j115O031N850
4941A412j759K675q61k655j869P16J1l729l160l834N036K486q60m157R6Q759M738
4924C045P74j219K667j734q454L465N137j83l253q307l35Q024O360J964j0769
4909b818n944J415P368P243J060M029L643l086p965k725o08j890N217O148n384
4894E703j0336j711Q817J203p87R70L319l53n057o710j986k336M854Q523K608
4879F721k976R8J53m247j210O163o286n268J16P325N593j871n618N56M592M58
$$ y = [3384, 6157, 6710, 7062, 5336, -3075, 2164, 6283, 6342, 4465, 2731, 1916, -2664, -1021, 621, -6727, -2572, -3611, -6267, 3355, 3033, 421, 5198, 3500, -161, 1638, 2390, -3595, -4542, -7089, -5261, -5432, -4255, -9531, -7647, -3141, -6236, -6500, -2529, -3006, -1180, -5596, -11428, -10624, -5360, -9354, -10469, -4438, 1412, -347, 2328, 1467, -1188, -3057, -2341, -2330, -6059, -9219, -13053, -8017, -5531, -6391, -10548, -10452, -1693, 3045, 3819, 2600, 5267, 3533, -4921, -1456, 3681, 3498, 245, -8062, -8397, -373, 5987, 7951, -2818, -8762, -7347, 21, 7264, 8324, 12353, 15996, 12910, 4945, 2220, 1612, -278, 4939, 11087, 5703, -4633, -6344, 2473, 3676, 2889, 3859, 7178, 6825, 1768, -4942, -6928, -9264, -4410, 4113, 6721, 3745, 3843, 3996, -251, -1461, 4702, -1584, -6852, -6736, 589, 6182, 4311, -1307, -751, 3841, 4299]
4863D299q548j614K958J776K1j995j132j324j685k958L155r50O416M032j413J248
4847B286p298O697O922J081O600J0791n662j7788M503O470k65j233o150q000r61
4832b007m368R41l741n064M294L372L669P122P604q107n745M593k427l692j969
4817e525j044M417O80n731L038N205M57M84P236l670q891l097O96L278Q81k325
4801c911Q76p311K142k229l809M49Q169Q697L148K78n098J570K462j361p330l58
4785c616M710L034M539k665m120p40N85j991N60O398Q318p092m709L354j969o138
4769a542J884L50k454n149k609M770M396M546N92l499n379N037K279k47J34K34
4753C343l54j518j026l804l983l452K567m201j251J059P824m911P594J533k971
$$ y = [4299, -4249, -5863, -2905, -1129, -1108, -3103, -4235, -5559, -7244, -10202, -7047, -7997, -1581, 2451, 1038, 2286, -5012, 1685, 8607, 9688, 16288, 27079, 21417, 3629, 8132, 14602, 14337, 13104, 6954, -1046, -2007, -6375, -5434, -9175, -14239, -9945, -6573, -2904, 4218, 11822, 3715, -2030, 2563, 136, -3556, -5525, -6569, -2152, -1472, -7203, -4165, 1040, 1497, 1981, 9217, 5547, -3344, -6441, -5745, -2467, -1586, -3911, -3035, -10346, -8204, -10433, -14242, -13793, -5624, 3073, 6221, 6499, 1401, 2971, 5433, 4072, -3258, -3616, 1094, 4128, 8667, 6002, 1882, 1142, 1727, -264, 296, 6694, 15012, 7920, 3211, 6565, 4596, -1542, 342, 692, -1762, -6911, -9520, -4750, -354, 4192, 4784, 1285, -4094, 943, 3222, 2975, 3109, 3343, 2989, 1471, 445, -3359, -7342, -10794, -8227, -12428, -13679, -12620, -4796, -9707, -2113, -580, -3551]
4738c551L04L488N053K379j488J268n254k253k250j589K448L531k417n741m93
4723f565J788K411J686Q72P909j971L547M322m389Q34j162k112o96J222m065R52
4707D583L027K006K86n654j32l826p48O156Q152j025j1524p672K359k841N23n085
4691a1415o643J840O906P493K012J235m714m214j65M138K799j525q178l875P163
4676g143N908N638K838j806N81L060m169J392n99K129L340M652n044q366j925
4661D86o696o825l55M740j639k44K744N773Q443n146k545k46O143l247J943K030
4645E359l311l65M092L606l067N339M781k005o821p855j955J24o1M143O881m679
4629D206j286Q25k917l886l401M608n917p431N670P167P35j855j156P23M804l861
$$ y = [-3551, -3247, 241, 5294, 7673, 6185, 7453, 2199, -54, -2304, -3893, -1445, 2086, -331, -6072, -6565, -4777, -2366, -680, 192, 8101, 6130, 9677, 13999, 9610, 10444, 9282, 7170, 6474, 7696, 3631, 4583, 7610, 9616, 9902, 4248, 4116, 290, -458, 5698, 13850, 12825, 1301, -6371, -4012, -6853, -6330, -11415, -18058, -16218, -9312, -1819, 193, 1428, -3286, -7500, -7665, -3527, -728, -2253, -10431, -14306, -7143, -1235, 4403, 7241, 5435, 6016, 9076, 4907, 6299, 5700, 7829, 11169, 15821, 10777, 2411, 486, -6210, -13035, -13390, -8650, -10289, -10533, -7789, -2016, 6427, 1281, -1264, -1510, 4633, 1386, 3329, 5359, 2048, 1683, 5775, 9381, 6314, 11653, 16434, 14429, 7608, -247, -2202, -2078, -2139, 2004, 8885, 4206, 2920, 3745, 828, -3058, -6459, -1851, -7768, -15199, -9529, -2362, -1627, -3482, -4638, -3915, 889, -2972]
4613b972M31o034j046O570K474j09O406Q435k759l622p287m317M887K767j886
4598A938j274K758m95J08j627m321m105L290N628j022m036J271k638o72Q67n050
4582i380k321N456J897L252J87L555o358m837M020K760R559K24l919o550l544
4567e999N860L028M369J836K336j0268p304K072j654K983M003P664P904J960m776
4552A4014m193l769k317J455j556r228j638J392j019O284K370k171R3J242K549
4537C508k985j704m845l792j614L377J996L841M842K975p89k502k006O73J768
4522B743O95o112m139K776J100k776K492o08L946N232o71m067q61K637o298k263
4506f174j710N930Q613k32l271N616k571l947P624K047k340K032p1p401p45L751
$$ y = [-2972, -2541, -8575, -9621, -3051, -577, -686, 5720, 14155, 11396, 7774, 487, -3830, 1057, 3824, 1938, 664, 3422, 2927, 3035, 1408, -2913, -7018, -3728, 1900, 878, -3158, -1887, -4525, -5197, -4330, -9380, -11701, -6245, -4348, -1096, -909, 2646, -3712, -8549, -4529, -1769, 7790, 8014, 4095, -2455, -5999, -139, 2889, 7258, 9094, 11430, 1162, -6142, -4070, -5724, -2741, 1262, 8926, 16830, 18790, 14014, 9821, 6052, 3735, 5190, 3634, -5594, -7232, -5840, -6859, -575, 1795, -376, -283, 959, 3508, 523, -1181, -6026, -9818, -11432, -8055, -6059, -2218, 2624, 5599, 4810, 2308, 302, 975, 2743, 3438, -2674, -6813, -4037, -2937, -5713, -3221, -3829, 117, 5349, 4678, 611, -250, 2387, -3911, -6174, -7884, -1954, 6659, 6427, 3156, 8772, 6201, 2254, 9878, 11925, 9585, 11617, 11546, 4145, 3400, 7151]
4490G151J392L64k597r65J361J751J668p98p252n622M556J82M358j880K555l52
4474E872o620P01O928J058j438o46J526k029l531L321p234k072K931m268j261
4459f762L963l49L784m457n956J967O162K690p89P270k01l416m224k723R819J685
4443H463l575j956n222J662k677L1k088L34J678Q336J614K81K998J298m156j1916
4427d895p429P173q42o27L279O082o048l998k727M317L471k269J635l243k415
4412h536J21lL130L632N351K236p09o42n412j1791O27j325m42K286K855J830m9
4395f841O740M763r07m495L293Q98N749k956o687p214l306M939N445j364n832
4380g775l362N530O543J70j895J566J246n25n702K502p97l905N367L304M170L15
$$ y = [7151, 8543, 8907, 6310, 5345, 6706, 8457, 10125, 9327, 2075, -3547, 1009, 1191, 5549, 3669, 6224, 5872, -748, -47, 6881, 7939, 6501, 5855, 7381, 5352, 1821, 5142, -2092, -4164, -1233, -5501, -6762, -2799, -3148, 636, -3821, -9777, -7810, -1648, 1042, 253, 7523, 7322, 3906, -318, -3041, 6778, 8463, 4888, 2932, -2290, -628, -3305, -3274, -5362, -5028, -3350, 4986, 6600, 6881, 9879, 11177, 7021, -4895, -12324, -5151, -5993, -6620, -3341, 2741, -3307, -7305, -10032, -5715, -2244, -4513, -2878, -6121, -8536, -8415, -8418, -5288, -1656, 3695, 5931, 5222, 4580, -832, -12623, -11996, -13321, -13763, -11477, -8622, -6792, -6841, -101, 4662, 3755, -740, 2553, 3451, 9200, 6244, -443, -7657, -10963, -6024, -579, -1943, -7775, -11137, -5607, 936, 1106, -789, 777, 2023, 1498, -4204, -1702, -2499, -6404, -1037, 2267, 6437, 6752]
4364F752j187l505k685N98j64j985R14K403o41J263K79J06M171j117q115o034
4348h947j147J1763L264L088K590R91p366J161p638J788P579j905j1706M809P209
4333E533L169p756j008J952k157o96k033k06j568P18n646j644P263Q509l321M50
4317A559K875o892m302l427L105L378l055Q259L933L235L746l377r322n796l537
4302i618J3636N34n876J344j43m912Q13L688M173M699N2k380n721l613M174M110
4286D960k194r1K716l332j494K487O639l721o515j178m28k55K930q421r453P477
4270i873J4344k628J242M979l554j146N21L755J24p437k950L782J983P15L31l617
4254E71m962q264P287l0K301N841M69j38o21j516j114l537N484N722M31l425K916
$$ y = [6752, 5565, 2060, -625, -27, -191, -2176, -1262, 1141, 500, 1763, 2042, 2148, 6319, 5202, -2913, -8947, -10094, 1669, 4933, 8021, 10611, 11602, 4236, 5397, -2241, -453, 7126, 5221, -6485, -1676, 5533, 8702, 946, -62, 1890, -267, -963, -2996, -3202, -4770, -4052, -9698, -11342, -4079, 4430, 1109, 1559, 4434, -2458, -6760, -10187, -7082, -3704, -6759, 1500, 5433, 8668, 12414, 9037, -285, -6081, -9618, 4018, 4552, -1324, 20, -123, -5035, -4222, -534, 3639, 8338, 8390, 6010, 289, -3324, 850, 4960, 2766, 2675, 5391, 2059, 565, 3052, 9691, 5970, -545, -1723, -2151, -2406, 524, -7897, -17350, -9873, 4471, 1843, 3085, 8064, 4510, 3364, 3885, 7640, 7764, 327, -2623, 1159, 3142, 3857, 4188, 571, -4391, -12655, -5368, -5398, -3097, 2744, 3213, 3075, 2454, 938, -176, -3713, 1771, 7493, 7924, 4499, 7415]
4237G415K8L22m346r983n648j354j201P751K536L239K574q526m240M759R342K34
4221B902N99k923l468J00L242M841o954k823l149J995K451P686N63K995K592J251
4205A1900n577j1911m734K654K105J936N62q194k186O932O80p30J0721j728r457
4190g027k662O636P3k010K367j364o38j007J239Q951J187p249k850P706p0N185
4174H467J344k554j1430o337n186p338j543M855K544j119O096J0318Q40l112M689
4159E34q52l589l036l533J307Q769L602q948P44K79J0207k06l733K052J091q10
4143C878J498R39K712o452R70L969K632j920m985l378J083j478j881k518j21O065
4127A013l163q55L664k073Q30K922J273K688P508m308p508P980j195n775M512
$$ y = [7415, 7443, 7765, 3419, -6564, -12212, -13566, -14767, -7016, -4480, -1241, 1333, -7193, -11433, -6674, 2668, 2902, 3501, 578, -2890, -2790, 452, 5293, -1661, -4484, -7633, -5638, -3187, 4499, 5062, 8057, 10649, 11900, 6323, -5588, -10322, -7668, -5563, -3627, -3065, -11259, -13445, -6513, -5833, -6563, 4158, 2430, -7027, -9689, -3053, -2980, -4990, -2623, -3987, -4625, -5632, -4393, 4558, 5745, -1504, -4354, 3352, 3282, 8467, 9811, 7257, -4173, -10510, -15696, -23034, -24577, -19722, -17178, -18297, -12201, -1883, -1043, -4155, 534, -318, -3907, -6943, -10476, -9169, -400, 3202, -5746, -5002, -4723, 5484, 5278, 1545, 3597, 4688, 3878, 5376, 6315, 9027, 2575, 3545, 7514, 10146, 8226, 3241, -137, 946, -532, -2413, -4931, -5052, 1013, -2150, -3005, 659, -1414, -584, 2338, 3611, 6299, 13807, 9499, 1991, 9971, 8776, 3001, 7513]
4112G513R14l966k98j338q121J97o48N62j949k701J833j703J587K776J326j183
4096e199r63N622P865k55M343M4p239j0356R37M735p987n728P609O007L389l069
4080b45J850n804k087R170K277n370J103k351l921M97k523l609L356k300j371
4065a1328K126K441j100L20j737k686O57L547N350j653o51J085K871k013j949
4050d720K848k591k563N557Q392m618l610k782j10P465J2672o766j1815r550j092
4035a3283K967M937K518j462N690M703L220n434l290R64M83M08p35p130M251m045
4019e238m847j283O11r16J555m5J864Q5l224M007O948k319k665l87J035k243P983
4002I21Q23j175J700Q96J256l361l871l750K524M459L19L184K999K266m753k445
$$ y = [7513, 8427, 4461, 4163, 2825, -5296, -5099, -5747, -5185, -7134, -9835, -8002, -9705, -8118, -5342, -4016, -5199, -6162, -540, 7325, 7070, 11413, 11457, 4218, -6138, -5201, -466, -8453, -14181, -6572, -565, 2824, -245, 1605, -4199, -6286, 2884, 5161, -209, 894, -1457, -5378, -4881, -7404, -11013, -7657, -9957, -11328, -9202, -6761, -7861, -7541, -9278, -11964, -11307, -7760, -2410, -4063, -4714, -3629, -758, -2771, -4720, -1872, -4463, -7026, -1469, 6923, 2305, -1305, -4087, -4197, 3268, 15940, 9174, -2641, -12191, -13283, -10316, -5379, -2861, -4323, 1367, 6070, 9290, 3856, 566, 1530, 2013, 2421, 1686, -5444, -1193, -5238, -10085, -11368, -10757, -11673, -10118, -10163, -8299, -8214, -11438, -7431, -483, -2802, -5467, -5854, -4819, -7062, 921, 1744, 569, 2269, 3165, 4421, 1060, -2811, -6561, -4037, 422, 741, 3925, 6924, 9190, 4437, 1992]
3986A992M826M269J756p689j0363p61n3M243J947m402j203m2N996R962L184j522
3970A2140q50l642j810M645j687R71P66K093o960j0065m272P635k285k168m260
3955i749M121M554m466m867R635J010o943J498l879K010K71N16m311K194N532
3940b874N109J142L732l906m539L82M075M882K433k933l893r75m520l392l502
3925h779K500K072J714M031n516k276J0874K399n713k507N154O412N550r967o218
3910b70K931L393l768k688K7r44Q832k226k935M733K885m076o582J560m48p598
3894g174k221Q162Q112r28k953N073O289p640m214k408j004m365j961P15J690
3879d827K759R43J480m064n211L32M490J360k618k348K566P510L229j411j501
$$ y = [1992, 6818, 11087, 12843, 5154, -5209, -5970, -6023, -1780, 167, -4235, -5438, -5480, 516, 10478, 13662, 12140, 11290, 7648, 5838, 10483, 8796, 9767, 10533, 12626, 5666, -4399, -8671, -1036, -3321, -5489, -9749, -5628, -1074, -5540, -10407, -772, 238, -6705, -5207, -9086, -7076, -6805, -6289, -10600, -8406, -2874, 2235, 3377, 7109, 3203, -1336, -954, 3121, 8003, 10436, 7503, 3610, 2635, -1885, -5277, -8779, -6279, -4207, -2493, 1538, -3978, -6254, 4620, 7019, 1306, -1201, 3953, 10365, 15915, 5948, -270, 2661, 6054, 2286, -402, -375, -1319, 7513, 5287, 2352, 7085, 9970, 5894, -688, 872, 424, -7174, -9395, -1233, 6879, 5951, 2998, 8071, 14360, 6720, 2506, 98, -906, -5271, -7232, -6517, -4827, -2068, -1125, 355, -3709, -8920, -8588, -4098, -2738, -5356, -7704, -5138, 2372, 5601, 4190, 2689]
3864B689J63j324J503k58K139L050j124o355k146N11l09o612M322N253J502m30
3848B574p554n700L319L433k613m23l176M336L282m344l187O996M118k038L294
3833B317N967N1j689l224n548J291M111O229l127o712P183N51l428j56n901m711
3817f796K364J255l489m150K54o17L814j399m159J4002J4577m736o536J8L030
3802G432k392j831K569k996m354J409N512O240k044p787J464J663o448o613M307
3787c869l85M52J586K689J468k300j874J331q516L600P498k376j765J830k782
3772c413L55L283p99m214J930N241n56p081o54P77P010M818j665l321o405P59
3756c935O529M088l14k434O415K086J467m132k543K044L768k169p837Q00m970
$$ y = [2689, 2852, 1528, 3031, 2773, 4912, 7962, 6838, 483, -1663, -1152, -1461, -8073, -3751, 1502, 3004, 2574, -4980, -10680, -7361, -3928, -6541, -6964, -10140, -5804, -2522, -6866, -10053, -3057, 1061, -977, 2317, 8284, 8335, 6646, 3422, -2126, -835, 3276, 9505, 6378, -334, 6849, 7400, 3972, 3816, -2085, -6796, -4432, -3177, -6666, -10816, -10562, -11179, -7365, -8764, -12923, 1079, 15656, 10920, 4384, 4402, 7432, 5040, 3209, 5778, 2782, -1572, -163, 5349, 11589, 9545, 1758, 3222, 4885, -1563, -8176, -3869, -4254, -3802, -2216, 473, 1941, -359, -2233, -902, -9418, -5818, 1680, -696, -2461, -631, -3413, -3058, 225, -574, -4788, -2858, 2383, 1827, -5254, -5908, -5131, 1879, 6697, 5032, 1711, -4694, -3935, 2594, 6682, 6368, 3934, 10349, 12435, 13902, 9770, 7227, 9271, 13039, 10870, 3033, 3833, -1137]
3741a137o516J638o589N329R537M539M723j809J777N19j334L509k233n942J104
3726G115j392j722r0L182n641n880L717Q504N036q69l174k808k219k11n348n139
3710f939j0264r5O491K983K864l173J608N248K944n4O632J926p22l249j705Q37
3694E332j220N854j86L417J88l408n434O899M055k981J004r948q285J38K238J668
3678f69j021K154M584l454K35K021m664j118j304o05j050l636n346L667K98K870
3662g038R555L566L524m430o105J077K380Q02K188K204L161k691q927p515K554
3647e695L495J502M841k982l370L837Q794K602l057q477J209J234n236k995N165
3632H67J67J961L023l118l729j963J84N409N660P345k341n18M59k051k158p606
$$ y = [-1137, -7653, -6015, -12604, -7275, 2262, 6801, 11524, 9715, 11492, 12011, 10677, 14186, 11953, 6011, 7115, 5723, 4001, 3911, 7093, 1452, -4428, -711, 7793, 12829, 11960, 8786, 5978, 3759, 3548, -1800, -6939, -17203, -17298, -10807, -7824, -4960, -8133, -6525, -1277, 1667, 1613, 8245, 10171, 9449, 6200, 4495, 5332, 4112, 9966, 9780, 13197, 13385, 9977, 4543, 11442, 15497, 12516, 13520, 3572, -4713, -4575, -2337, -669, -1690, 464, 5048, 1594, 1829, 3850, -814, -1932, -3236, -3841, -4891, -8527, -13873, -10206, -9908, -7038, 2517, 6083, 9607, 5177, -928, 149, 2529, 3331, 5519, 7723, 10884, 8193, -734, -8249, -5695, -2200, -698, 4143, 1161, -2209, 1628, 10422, 13024, 9967, 1490, 2699, 3933, -1303, -4298, 867, 1034, 2995, 6018, 2900, -829, -2792, -2608, 2801, 8461, 15806, 13465, 12947, 13406, 11355, 9197, 1591]
3616A591j968K146K262K046l770k987N46p2J417O20j155K666L000l240r85O153
3600H270L276n788r615j45L254N948M773J0373l318r674n666j563j323l003k259
3585f460K524N449Q710k321o680n786N178R6l154J092O419M336L561J147n245
3570H866N56L318m108o429m424M598l204m126K567J875j058j948O63N695K792
3555E633K592n49M004o94q00K423n91n969l739j36n708k092K031K515K518L871
3539E309l882K443L193k379M262p281m196J082l36P5n725M71R239N038m718m783
3523b188n82l904K867P363q45n852p042k832J231J1032Q975J380k237l670l55
$$ y = [1591, -377, 1769, 4031, 6077, 2307, -680, -134, -206, 1211, 1831, 676, 3342, 6342, 3102, 2117, 8270, 11546, 5758, -3857, -4002, -748, 5200, 9973, 20346, 17028, 7354, 1688, 125, -1198, -4201, -6460, -3936, 1513, 10223, 7902, 1222, -4564, 614, 710, -2444, -1352, 5067, 9403, 12964, 14111, 8866, 9422, 12740, 8632, 2203, -2221, 2377, -827, -4953, -2386, -511, -1569, -3517, -2854, 2841, 5633, 8225, 7676, 11680, 10986, 10186, 12609, 12018, 6049, 2310, 2174, -3534, -5626, -3595, -1080, 1438, 5309, 1427, 3870, 7063, 4684, 8946, 1665, -2531, -1449, -1785, -1710, -7435, -6964, 2275, 7313, 2595, -2188, -2770, -6674, -3807, 3556, 2711, -3141, -10183, -13015, -11784, -752, 8223, 9603, 7366, 3696, 3341]
$$ [...]
##END NTUPLES=NMR SPECTRUM
##END=
