##TITLE=Analysis number 317802
Compound Code km 10833
Book Reference 423/64
Project Code adrs
Chemist Name bruced
##JCAMPDX= 6.0         $$ Bruker NMR JCAMP-DX V2.0
##DATA TYPE= NMR SPECTRUM
##DATA CLASS= NTUPLES
##ORIGIN= Bruker BioSpin GmbH
##OWNER= nmr
$$ XWIN-NMR		Version 3.5
$$ Mon Mar  6 09:29:21 2006 GMT Standard Time (UT+0h)  MAYBRIDGE\nmr@NMR_250MHZ
##.OBSERVE FREQUENCY= 250.131544655141
##.OBSERVE NUCLEUS= ^1H
##.ACQUISITION MODE= SIMULTANEOUS (DQD)
##.ACQUISITION SCHEME= undefined
##.AVERAGES= 16
##.DIGITISER RES= 18
##SPECTROMETER/DATA SYSTEM= dpx250
##.PULSE SEQUENCE= zg30
##.SOLVENT NAME= DMF
##.SHIFT REFERENCE= (INTERNAL, DMF, 0, 16.522)
##AUDIT TRAIL= $$ (NUMBER, WHEN, WHO, WHERE, WHAT)
$$ ##TITLE= Audit trail, XWIN-NMR		Version 3.5
$$ ##JCAMPDX= 5.01
$$ ##ORIGIN= Bruker BioSpin GmbH
$$ ##OWNER= nmr
$$ C:\u/data/dgb/nmr/ADRS/20/pdata/1/auditp.txt
$$ ##AUDIT TRAIL=  $$ (NUMBER, WHEN, WHO, WHERE, WHAT)
(   1,<2006-03-06 09:28:17.30 +000>,<MAYBRIDGE\nmr>,<NMR_250MHZ>,
      <created by zg, POWCHK disabled, PULCHK disabled
       configuration hash MD5:
       84 BC 41 DB A1 6E 1D 46 DA 25 12 A5 C1 ED C5 3A
       data hash MD5: 64K
       90 19 69 9A 84 1D 60 FF 36 CE A4 20 1A 4D B5 B3>)
(   2,<2006-03-06 09:28:49.06 +000>,<MAYBRIDGE\nmr>,<NMR_250MHZ>,
      <Start of raw data processing
       ef LB = 0.3 FT_mod = 6 PKNL = 1 SI = 32K 
       data hash MD5: 32K
       FD 5B 46 D3 B8 1F 2C C9 1B 74 D7 47 2D 74 10 6F>)
(   3,<2006-03-06 09:28:51.70 +000>,<MAYBRIDGE\nmr>,<NMR_250MHZ>,
      <apk 
       data hash MD5: 32K
       DB C9 10 10 92 1A 30 76 9E 97 E9 34 87 77 2B AC>)
(   4,<2006-03-06 09:28:52.75 +000>,<MAYBRIDGE\nmr>,<NMR_250MHZ>,
      <abs ABSG = 5 
       data hash MD5: 32K
       2A 6E 3A 73 3A 5C E2 93 52 39 CE 78 33 FC 2E 49>)
$$ ##END=
$$ 
$$ hash MD5
$$ AC AE 89 17 4F F5 8A 82 F9 7F 7B 4E DE C2 04 B9
##$RELAX= 
##$RELAX= 
##$RELAX= 
##$RELAX= 
##$RELAX= 
##$RELAX= 
##$RELAX= 
$$ Bruker specific parameters
$$ --------------------------
##$DU= <C:\u>
##$EXPNO= 20
##$NAME= <ADRS>
##$PROCNO= 1
##$TYPE= <nmr>
##$USER= <dgb>
##$AMP= (0..31)
100 100 100 100 100 100 100 100 100 100 100 100 100 100 100 100 100 100 
100 100 100 100 100 100 100 100 100 100 100 100 100 100 
##$AQSEQ= 0
##$AQ_mod= 3
##$AUNM= <au_zg>
##$AUTOPOS= <4 >
##$BF1= 250.13
##$BF2= 250.13
##$BF3= 250.13
##$BF4= 250.13
##$BF5= 500.13
##$BF6= 500.13
##$BF7= 500.13
##$BF8= 500.13
##$BYTORDA= 1
##$CFDGTYP= 0
##$CFRGTYP= 5
##$CHEMSTR= <none>
##$CNST= (0..31)
1 1 145 1 1 1 1 1 1 1 1 1 1 1 1 1 1 1 1 1 1 1 1 1 1 1 1 1 1 1 1 1 
##$CPDPRG= <>
##$CPDPRG1= <>
##$CPDPRG2= <>
##$CPDPRG3= <>
##$CPDPRG4= <mlev>
##$CPDPRG5= <mlev>
##$CPDPRG6= <mlev>
##$CPDPRG7= <mlev>
##$CPDPRG8= <mlev>
##$CPDPRGB= <>
##$CPDPRGT= <>
##$D= (0..31)
0 1 0 0 0 0 0 0 0 0.06 0 0 0 0 0 0 0.0002 0 0 0 0 0 0 0 0 0 0 0 0 0 0 
0 
##$DATE= 1141637290
##$DBL= (0..7)
120 120 120 120 120 120 120 120 
##$DBP= (0..7)
150 150 150 150 150 150 150 150 
##$DBP07= 0
##$DBPNAM0= <>
##$DBPNAM1= <>
##$DBPNAM2= <>
$$ [...]
##$SUBNAM6= <"">
##$SUBNAM7= <"">
##$SUBNAM8= <"">
##$SUBNAM9= <"">
##$SW= 20.6930455092707
##$SWIBOX= (0..15)
0 0 3 0 0 0 0 0 0 0 0 0 0 0 0 0 
##$SW_h= 5175.983436853
##$TD= 65536
##$TD0= 1
##$TE= 293.16
##$TE2= 300
##$TE3= 300
##$TEG= 300
##$TL= (0..7)
0 120 120 120 120 120 120 120 
##$TP= (0..7)
150 150 150 150 150 150 150 150 
##$TP07= 0
##$TPNAME0= <>
##$TPNAME1= <>
##$TPNAME2= <>
##$TPNAME3= <>
##$TPNAME4= <>
##$TPNAME5= <>
##$TPNAME6= <>
##$TPNAME7= <>
##$TPOAL= (0..7)
0.5 0.5 0.5 0.5 0.5 0.5 0.5 0.5 
##$TPOFFS= (0..7)
0 0 0 0 0 0 0 0 
##$TUNHIN= 0
##$TUNHOUT= 0
##$TUNXOUT= 0
##$USERA1= <user>
##$USERA2= <user>
##$USERA3= <user>
##$USERA4= <user>
##$USERA5= <user>
##$V9= 5
##$VALIST= <valist>
##$VCLIST= <CCCCCCCCCCCCCCC>
##$VD= 0
##$VDLIST= <DDDDDDDDDDDDDDD>
##$VPLIST= <PPPPPPPPPPPPPPP>
##$VTLIST= <TTTTTTTTTTTTTTT>
##$WBST= 1024
##$WBSW= 4
##$XGAIN= (0..3)
0 0 0 0 
##$XL= 0
##$YL= 0
##$YMAX_a= 351749
##$YMIN_a= -353931
##$ZGOPTNS= <>
##$ZL1= 120
##$ZL2= 120
##$ZL3= 120
##$ZL4= 120
##$ABSF1= 16.522
##$ABSF2= -4.171173
##$ABSG= 5
##$ABSL= 3
##$ALPHA= 0
##$AQORDER= 0
##$ASSFAC= 0
##$ASSFACI= 0
##$ASSFACX= 0
##$ASSWID= 0
##$AUNMP= <proc_1d>
##$AZFE= 0.1
##$AZFW= 0.1
##$BCFW= 0
##$BC_mod= 0
##$BYTORDP= 0
##$COROFFS= 0
##$CY= 12.5
##$DATMOD= 1
##$DC= 0
##$DFILT= <>
##$DTYPP= 0
##$F1P= 14.0000005364418
##$F2P= -0.99999901652339
##$FCOR= 0.5
##$FTSIZE= 32768
##$FT_mod= 6
##$GAMMA= 0
##$GB= 0
##$INTBC= 1
##$INTSCL= 1
##$ISEN= 128
##$LB= 0.3
##$LEV0= 0
##$LPBIN= 0
##$MAXI= 10000
##$MC2= 0
##$MEAN= 0
##$ME_mod= 0
##$MI= 0
##$NCOEF= 0
##$NC_proc= -4
##$NLEV= 6
##$NOISF1= 0
##$NOISF2= 0
##$NSP= 0
##$NTH_PI= 0
##$NZP= 0
##$OFFSET= 16.522
##$PC= 1
##$PHC0= 236.8771
##$PHC1= 7.395606
##$PH_mod= 1
##$PKNL= yes
##$PPARMOD= 0
##$PSCAL= 4
##$PSIGN= 0
##$REVERSE= no
##$SF= 250.13
##$SI= 32768
##$SIGF1= 0
##$SIGF2= 0
##$SINO= 400
##$SIOLD= 32768
##$SREGLST= <1H.DMF>
##$SSB= 0
##$STSI= 32768
##$STSR= 0
##$SW_p= 5175.98343685301
##$SYMM= 0
##$S_DEV= 0
##$TDeff= 65536
##$TDoff= 0
##$TI= <Analysis number 999999
Compound Code 99
Book Reference 9
Project Code 9>
##$TILT= no
##$TM1= 0
##$TM2= 0
##$TOPLEV= 0
##$USERP1= <user>
##$USERP2= <user>
##$USERP3= <user>
##$USERP4= <user>
##$USERP5= <user>
##$WDW= 1
##$XDIM= 32768
##$YMAX_p= 531458878
##$YMIN_p= -506305
$$ End of Bruker specific parameters
$$ ---------------------------------
##NTUPLES= NMR SPECTRUM
##VAR_NAME=  FREQUENCY,     SPECTRUM/REAL,   SPECTRUM/IMAG
##SYMBOL=    X,             R,               I
##VAR_TYPE=  INDEPENDENT,   DEPENDENT,       DEPENDENT
##VAR_FORM=  AFFN,          ASDF,            ASDF
##VAR_DIM=   32768,         32768,           32768
##UNITS=     HZ,            ARBITRARY UNITS, ARBITRARY UNITS
##FACTOR=    0.157963299565203, 1,           1
##FIRST=     4132.6476996994, 0,             0
##LAST=      -1043.33573715361, 0,           0
##MIN=       -1043.33573715361, -506305,     0
##MAX=       4132.6476996994, 531458878,     0
$$ Real data points
##PAGE= N=1
##DATA TABLE= (X++(R..R)), XYDATA
$$ [...]
10699A4376294O243301J1206372J7601724J3958145K481117J743750L667934O390187
10691G7668824J3774233J1265266Q386416j499124j1868209j1478041p275506
10684G8973859j420854k585892r060301q694071j0025108j2510614r519342n675922
10676A9481755l418667k377195j931574j531345j139560p82374l48785k30056
10668G722199k36668k65015l07219k86355j44019M3065K49547L61336M89817Q68241
10658H494929J524015K589307M554866Q184196J3676769J4161228L182297k608598
10650E3759009l483778o792367n020478K867498J0599976P290335l348294n493463
10642E0378438p362707j1199964r346963n661541l458196k381428j713347j220333
$$ plain form
10699 14376294 20619595 31825967 49427691 63385836 65866953 67610703 71278637 77668824
10691 77668824 91443057 102708323 111094739 109595615 97727406 86249365 78973859
10684 78973859 77553005 74967113 65906812 57212741 47187633 34677019 25157677 19481755
10676 19481755 16063088 13685893 11754319 10222974 9083414 8301040 7952255 7722199
10668 7722199 7485531 7220516 6913297 6626942 6482923 6525988 6775535 7136871 7626688 8494929
10658 8494929 10018944 12608251 17163117 25347313 39024082 53185310 56367607 53759009
10650 53759009 50275231 43482864 38462386 41329884 51929860 59220195 55871901 50378438
10642 50378438 43015731 31815767 22468804 16807263 13349067 10967639 9254292 8033959
10634H033959q49069p11675o67712m86651k84836k04506m8167l0937m9920r7125
10624D603361n8551L0948J30136L01792L90380M97269O11148Q47424J233407J936576
10614A0523890L287619N875782J0694810J6697654J2958206L24706l003444m390409
10606E2968814p468241l118679N820890J2237755O246098j768565j794702o120820
10598E7002550j1964048r504535o383454n148253k870227J72879K159134j83836
10590B3280210k261248k040089k959588l507332k492757j625608j185055r16374
10582F292159o97831n08348m17662l80351k46426j23523m7936l9744k1641j47305
10572C661392j94215j17563j0353R0059J7618K3768R7818J47777K50263L12415
$$ plain form
10634 8033959 7184890 6473215 5805503 5318852 5034016 4829510 4781343 4750406 4700486 4603361
10624 4603361 4544810 4575758 4705894 5007686 5398066 5895335 6506483 7353907 8587314 10523890
10614 10523890 13811509 19687291 30382101 47079755 60037961 60362667 57359223 52968814
10606 52968814 45500573 42381894 48202784 60440539 66686637 64918072 63123370 57002550
10598 57002550 45038502 35533967 29150513 24002260 21132033 21304912 23464046 23280210
10590 23280210 21018962 18978873 16019285 12511953 10019196 8393588 7208533 6292159
10582 6292159 5594328 5085980 4668318 4287967 4041541 3918018 3870082 3830338 3808697 3661392
10572 3661392 3467177 3349614 3339261 3429320 3446938 3470706 3568524 3716301 3966564 4278979
10562D278979N10081R55389J758353L370560O150581Q059693L494936j110020
10554B7468552j168261k611045l317889k53262L877214M874053k81465k951985
10546B5635912l177821m992514n103884l019116j632413j071382q74396q43159
10538D921227o97844o19946n93103m30734k27590r7090j03849r1843r7712j09271
10528A852245o1938r1101m389l2418K1567K0718l8931J6441r959r2870j78213
10517A401152q9500m0080m9111r2510q0780j2129q8795j27893Q4J2145k2349q4359
10505G25875L4916Q549j7580L3185n1257m3218M4339J8587p1380K8256M2109P139
10493G59520M057k2290K991J6382K8049n0811q6776n5545k5434L6657r750j08051
$$ plain form
10562 4278979 4789060 5744449 7502802 10873362 17023943 25083636 28578572 27468552
10554 27468552 26300291 23689246 20371357 20118095 23995309 28869362 28587897 25635912
10546 25635912 22458091 17465577 12361693 9342577 7710164 6638782 5764386 4921227
10538 4921227 4223383 3603437 3010334 2579600 2352010 2254920 2151071 2059228 1961516 1852245
10528 1852245 1790307 1699206 1694817 1662399 1683966 1704684 1665753 1682194 1672235 1579365 1401152
10517 1401152 1311652 1271572 1222461 1129951 1049171 1037042 948247 820354 820438 832583 810234 725875
10505 725875 760791 769340 751760 784945 733688 690470 734809 753396 682016 710272 752381 759520
10493 759520 763577 741287 744278 760660 788709 737898 651122 595577 570143 606800 597050 488999
10481D88999n2001m7725j9531q217p0237R778K9509l0286r207N601m6090k0906
10469B29687k0358R1069M8645m8003j24557r0426L025m0404j4155P1605P7262
10458A83390L9243j7111L981J0095Q0233M7699Q6431L7941j5851M1932J4143N5574
10446E67700J42497P2911j9735k1786n861p2538m3903p5533k0777k5393l2388
10435D65194m6907p7769l1201o87j10182j4890K5010k495l8499K5369p164o2078
10423A23701j1671O9205j0827j15581O9065p006n7918K6839O3661O1452R594p4402
10411A46112q1817j0179P4201O6920O812n5501l7140P91l050M6442J2976n2383
10399A14184K8404J1093k62p3936J7715J1528J0692n8234r359K0055Q63J4764
$$ plain form
10481 488999 436998 389273 369742 361525 291288 301066 330575 300289 291082 296683 250593 229687
10469 229687 209329 300398 349043 301040 176483 86057 89082 48678 34523 106128 183390
10458 183390 222633 205522 209503 219598 299831 347530 433961 471902 456051 497983 512126 567700
10446 567700 710197 783108 763373 741587 735726 663188 619285 543752 522975 497582 465194
10435 465194 418287 340518 309317 308630 198448 183558 208568 206073 167574 192943 185779 123701
10423 123701 112030 181235 170408 54827 123892 116886 58968 85807 149468 210920 220514 146112
10411 146112 64295 54116 128317 195237 202049 146548 109408 110199 107149 153591 166567 114184
10399 114184 142588 153681 153419 79483 97198 108726 119418 61184 51825 71880 72743 87507
10387H7507M6005o149j6687l4485J8817L5959O0184L6081j3805j27745p9638O0704
10375F6748J31127N9498K0483n425m8175q835J8194m7432N5135J9350m3485k5631
10363A91552l1882m1695K3982r63m0338m1983n1059r8507N0375J28159J8073n9095
10351D6619k7679Q1565M7175k157j0065M9794Q2209L2265m437j01303r9561p061
10339H7364L3903L741o277K6747P4968J52416K06613J7354O4796N0948l8456j15695
10327E58422r1811j19728j16888j0992J5926M5613J07869o909j21996Q587o0584
10316B07509r9213o3517L4120K1602L345m704j9756m6851r3266r940O8707N0016
10304D8052j8914p534O9945J0563p774m4169L8436j5224k8377N2695P9061r229
$$ plain form
10387 87507 133512 127363 110676 76191 95008 130967 191151 227232 213427 85682 6044 66748
10375 66748 197875 257373 277856 272431 224256 215421 233615 186183 241318 260668 217183 191552
10363 191552 159670 117975 141957 140994 100656 58673 7614 -90893 -40518 87641 105714 46619
10351 46619 18940 100505 147680 145523 135458 185252 267461 299726 295289 193986 94425 87364
10339 87364 121267 125008 118731 145478 220446 372862 579475 596829 661625 712573 674117 558422
10327 558422 466611 346883 229995 219003 234929 280542 388411 381502 259506 268093 207509
10316 207509 108296 44779 78899 100501 103846 99142 79386 32535 -60731 -70671 -1964 48052
10304 48052 29138 21604 91549 102112 94338 50169 88605 73381 45004 97699 176760 167531
10292A67531q3459j7864N6646o0245Q58J30627J15912J20036r663j0777P808l2847
10280C84563p4413o2028l4758n1814J9339N2697J02500J63691J69379J1862Q8072
10269G69090K8408q9324q571O5403J05321Q8741O820Q066k1373K8711R8927J43114
10257A223333J03474J04858R4746K55663L27146M22167N61607Q25205J135117
10248E053316J799192K830043M747497Q591808J2970956Q468273q32565k243112
10240D1385408l654425n756301j277812O488244R598720K62740m784970m845326
10232C7416278q698088r374788n815629l208088k016712j365217r62513q12816
10224E162427n64049k89902k15381k96055j26651m7240o9391K2385J25059J80468
$$ plain form
10292 167531 84072 66208 122854 62609 63467 194094 310006 430042 420379 409602 417410 384563
10280 384563 310150 248122 213364 161550 180889 233586 336086 499777 669156 681018 769090
10269 769090 797498 708174 699603 765006 870327 959068 965888 973954 952581 981292 1080219 1223333
10257 1223333 1326807 1431665 1526411 1782074 2109220 2531387 3092994 3918199 5053316
10248 5053316 6852508 9682551 14430048 23021856 35992812 44461085 43628520 41385408
10240 41385408 37730983 31974682 30696870 37185114 46783834 47046574 42261604 37416278
10232 37416278 28718190 19343402 13527773 10319685 8302973 6937756 5975243 5162427
10224 5162427 4598378 4308476 4093095 3797040 3670389 3623149 3553758 3576143 3701202 3881670
10214C881670N6181m4588j4654J49055K69773K26841N40609Q25682J138634J761514
10204H790717K765200M780162Q342609J0932022N017881o18565m36892j470212
10196C8102922o64246O633514J6726220J5915967n51024n901700o901115j2406113
10188E0954425r527134j71101O477480Q25104n334084m908789p386440r092207
10180B1837254o137385l389694k015397j238316p69661o37691n45720l86205k51022
10171F466163j91270J09296K88035j9968k61563l54185l99996m40158m75016k94642
10161D426696k01208l5072L6395K31133M93584P44249J112900J896903L261321
10152A1966901N758486R100238P115968J8939j570289k119864l963974j054448
$$ plain form
10214 3881670 3937851 3893263 3878609 4027664 4297437 4524278 5064887 5890569 7029203 8790717
10204 8790717 11555917 16336079 24678688 35610710 40628591 40010026 39573134 38102922
10196 38102922 37438676 44072190 60798410 76714377 76163353 70261653 63360538 50954425
10188 50954425 41427291 41256190 47733670 48558774 43224690 38315901 30929461 21837254
10180 21837254 15699869 12310175 10294778 9056462 8286801 7649110 7103390 6717185 6466163
10171 6466163 6274893 6384189 6672224 6652256 6390693 6036508 5636512 5196354 4721338 4426696
10161 4426696 4225488 4190416 4226811 4457944 4951528 5695777 6808677 8705580 11966901
10152 11966901 17725387 26825625 33941593 33960532 32390243 30270379 26306405 25251957
10144B5251957M720789P267276Q57332l305734l593156o257722p036916m489420
10136A3414406k001894p31080p62680j037696q53475p96435p12497m74177l16056
10127E728416j28864M6695K48389L28032K23145l679l86853o82830o54096n87335
10117D131020n06676l18043k24517k04416l34312k82547k34129k18826k18755
10108A588799j90816n1556j14357n7436M5166R30l5656j9356l9765m0536J0253
10097A095670P986j0946j8180P8552K11883L41492N29702M76887K72781J65754
10087C151581m420o7198L8465J83110L14710L69142N95627M85350J21539k57433
10077D930473o19649o97227p08777o13451l87934j22194j09432r7584j13890k07918
$$ plain form
10144 25251957 29972746 37240022 38097354 34791620 31198464 24940742 17903826 13414406
10136 13414406 11412512 10681432 9918752 8881056 8027581 7231146 6518649 6044472 5728416
10127 5728416 5599552 5646247 5894636 6222668 6445813 6442134 6055281 5372451 4718355 4131020
10117 4131020 3624344 3306301 3081784 2877368 2543056 2260509 2026380 1807554 1588799
10108 1588799 1397983 1346427 1232070 1174634 1219800 1220730 1185074 1165718 1125953 1085417 1095670
10097 1095670 1103656 1092710 1074530 1153082 1364965 1706457 2236159 2713046 2985827 3151581
10087 3151581 3147161 3079963 3118428 3301538 3616248 3985390 4581017 5066367 5187906 4930473
10077 4930473 4310824 3613597 2904820 2291369 1903435 1781241 1671809 1574225 1460335 1252417
10067A252417k16134j75950j81229j38010n8437k7032q2511p568o6539K0912M0935
10056C60854J0396J0968p0118M1532L9836J8552k9893o9968m9r568l1467j174
10044B69901J437k647M8302J9000p1175k1485n4213n2987Q2186J9468L1874K0676
10032B90337K4835n2277L3261L1449j6322o892J4553L3722j24796m0219K3848
10021B11499j22818k7507M9330L1445k7830M7534k882q4239p9748k9389J18969
10010H4364O7452J7382n9274N181k6159j0604k9728j7851K2672M1109n3061O4093
9998A05576K9967l1301o0396j3346N4836L8026k2006J9951o1972m2853k9346J450
9986a1414J2017J22483N5142Q735j6044k5046P034k2980l8035j5857O038J02800
$$ plain form
10067 1252417 1036283 860333 679104 541094 482657 455625 373114 365546 299007 319919 360854
10056 360854 371250 382218 312100 353632 393468 412020 382127 312159 312110 302542 271075 269901
10044 269901 271338 268691 316993 335993 264818 243333 189120 136133 218319 237787 269661 290337
10032 290337 315172 262895 296156 327605 311283 304391 318944 352666 227870 187651 211499
10021 211499 88681 61174 110504 141949 114119 161653 158771 74532 -5216 -34605 84364
10010 84364 151816 169198 109924 115105 88946 78342 48614 30763 53435 94544 41483 105576
9998 105576 135543 104242 43846 30500 85336 123362 101356 121307 59335 16482 -12864 -11414
9986 -11414 603 123086 178228 186963 170919 145873 152907 129927 91892 76035 82073 184873
9974A84873N080l0971m9848j3959k6234P922l1968N6412P6442K9092j5983o8756
9962A22102l2142j3818J3782N4073j6040P9061k1454q6496j6319p14j2350M2675
9950A12360K2281j0280K3327K2529m3761j1884n7803m1275L7610N4866J5979j5421
9938A08528m4120J7971P2814L9391m9139l4217r559l4393J8060M9412L9775j0965
9926A63558l272q300k9788R507k951l5673k8228K8988L526L0961K7214m2785K1681
9913A34438k6998n8909j2147j7912K8551J3569n0633O6303J5065l9005o2749L6801
9901B6374J6338K056O0235O4675j1849l4504J3388K0310K116L3872j7393m5028
9889A30590q992L8163n0182k2958l1485r2623N7074J11490k4175K8938o199j00418
$$ plain form
9974 184873 189953 158982 109134 95175 68941 76863 44895 101307 177749 206841 190858 122102
9962 122102 89960 76142 89924 143997 127957 207018 185564 99068 82749 82035 69685 112360
9950 112360 134641 124361 147688 170217 126456 114572 56769 15494 53104 107970 123949 108528
9938 108528 64408 82379 155193 194584 145445 111228 101669 67276 85336 134748 174523 163558
9926 163558 160286 151986 122198 131705 128754 93081 64853 93841 97367 128328 155542 112757 134438
9913 134438 107440 48531 36384 18472 47023 60592 9959 76262 91327 52322 -10427 26374
9901 26374 42712 44768 105003 169678 157829 123325 136713 157023 159139 193011 175618 130590
9889 130590 121598 159761 109579 86621 55136 -37487 19587 131077 106902 135840 129641 29223
9877B9223j01542L1861N4859M7149M5939r540o4059k8970K0884J23293j5944l8115
9865I5038J3318N7082P216l6474m5346J7347J3722L6684j2295m317L234p361l4934
9852A02914j1060J2666p2718n969M7144N463J668j0582P656j1991K3557Q6465
9840A75213K4342p4595r4780l8555Q611L6342L3335M1715K0285K0625l3768m4462
9828G4308K3370K6493j8482j2201n597j3311Q8718J07311k0169p4449r5155m1878
9816C8958L0240K0154K9944n4185j9332O7320k3537q9323L019J8223o908M9741
9804F4314j02k3850j0602k4540L5736M040n7566P1974L9780j14212K2925P4092
9792H1989M1889q4369m8908K8826p826o2400j379P4178K4354J9216K1331j1734
$$ plain form
9877 29223 -72319 -40458 14401 61550 107489 97949 33890 4920 25804 149097 133153 95038
9865 95038 108356 165438 172654 136180 90834 108181 121903 158587 146292 141975 145209 137848 102914
9852 102914 91854 104520 31802 25833 72977 78440 80108 69526 77182 65191 88748 175213
9840 175213 199555 124960 30180 -8375 236 36578 69913 111628 131913 152538 118770 74308
9828 74308 97678 124171 105689 93488 87891 74580 163298 270609 250440 175991 80836 38958
9816 38958 69198 89352 119296 65111 45779 113099 89562 239 3258 21481 14573 64314
9804 64314 64212 40362 29760 5220 40956 44996 -12570 59404 99184 -15028 7897 81989
9792 81989 123878 39509 -9399 19427 11601 -50799 -52178 22000 46354 65570 86901 75167
9780G5167K0139J6642k8884J3875M7983K8207O309j3444J5134n9078o4981K5406
9768H2475N0425n4730p2670m6413j7162O9316N2152p937m1684J5714j5863K5242
9756C8865q9535m6167N390K5664j4586O9913k7446o5135P2723O2675j840J9748
9744E0269N6256j2380m0249k8023l1993k7446k5509L8470M6307Q4245k204o7838
9732C9905m0706Q198Q7134Q4103R8192Q8682k8198r5810o6510l9524l3205N7603
9720A59864O6364M3518j1787m6621r200n1781p6712l2695J5765l764k3467O038
9708C5522P738K4466K7668L5978j37616m6354M3149r455m054R2726L3940J7941
9696A21649k9236l8526M635O1835l6416k5315N7929k5006n134J27850J18075Q1229
$$ plain form
9780 75167 95306 111948 83064 96939 144922 173129 179438 165994 181128 122050 57069 82475
9768 82475 132900 78170 5500 -40913 -58075 11241 63393 55456 13772 29486 13623 38865
9756 38865 -50670 -96837 -91447 -65783 -80369 -10456 -37902 -103037 -30314 32361 30521 50269
9744 50269 106525 94145 53896 25873 -6120 -33566 -59075 -20605 25702 109947 107743 39905
9732 39905 -801 7397 94531 178634 276826 365508 337310 241500 174990 135466 102261 159864
9720 159864 226228 269746 257959 211338 202138 150357 73645 40950 56715 52951 29484 35522
9708 35522 43260 67726 95394 131372 -6244 -52598 -9449 -18904 -22958 69768 103708 121649
9696 121649 92413 53887 58522 120357 83941 58626 116555 91549 86415 214265 332340 413569
9684D13569m3473j06807k3900j1094J7131M3799J07990J8024J4698j1031m8879
9673C70027p3466n3802J375j7572L5772j1833n8910k5621l2569l6518j5071R529
9661I1341j04l649k2559N0395n8228l6296M7060k5414l4371L0660j708l549p12
9648C2866L0473J0815M6274k9266j1904O3864n45l0276K1242q914L0624L5625
9636A90878k7600J0815L1743M6749q3664q1492k9808R554P7103P4238o16J8412
9624B36312j3748P053r936o1624m6910r286l673j06252L9547L8154Q910P9418
9612A57965O373n389k8075J0734J4093q0453k7404l0536l4098M1886m6820k7479
9600d9203j1931O6805K0784M5044M2697p3198q9757P4261P6753p8664K2481l7365
$$ plain form
9684 413569 370096 263289 239389 228295 245426 289225 397215 415239 429937 418906 370027
9673 370027 296561 242759 244134 226562 262334 250501 191591 165970 133401 96883 81812 91341
9661 91341 91237 87588 65029 115424 57196 20900 67960 42546 8175 38835 37127 33578 32866
9648 32866 63339 74154 120428 91162 79258 143122 142577 112301 133543 124629 155253 190878
9636 190878 163278 174093 205836 252585 168921 87429 57621 67175 144278 218516 217900 236312
9624 236312 222564 229617 219681 158057 111147 101861 98188 -8064 31483 69637 78547 157965
9612 157965 164338 158949 130874 141608 155701 75248 47844 17308 -16790 25096 -21724 -49203
9600 -49203 -61134 5671 26455 71499 114196 40998 -48759 25502 102255 23591 46072 8707
9588H707q100K3577M7554L0657j8274N3492l863l7252o968Q869M586n5889p3284
9575b6188L4472J20850M039k8564L0460j6473J4012l5609J743O5822j7325p8553
9563F8686m4606M345J5577l7915o5301N8824O3746l3838L7970j3708j8881K3305
9551E8204k1908J7773O1442p189p3152L2260K4689n3120k8157m0957m6728l5929
9539a12772L4276J12289K7297J8381O5116n432j01561q3316M420L3957j2038j1670
9527c1053K4415O3610j1525m4651p1772M0405N521q5810N841P2285L6621L2226
9515C6113J3288l9125K7378L515k6567j4418j0186J5106P1801k2727o0147j6293
9503b2262l1839j9643K7593m2842L9450O8184M1756k9740L0982l2228m6210L3856
$$ plain form
9588 8707 607 24184 71738 102395 84121 137613 133750 96498 89530 98399 102985 47096 -26188
9575 -26188 8284 129134 133173 104609 135069 118596 132608 96999 98742 164564 147239 68686
9563 68686 24080 28425 44002 6087 -59214 -390 63356 29518 67488 53780 34899 58204
9551 58204 36296 54069 115511 108322 35170 67430 92119 38999 10842 -30115 -76843 -112772
9539 -112772 -78496 33793 61090 79471 144587 139155 37594 -45722 -41302 -7345 -19383 -31053
9527 -31053 -6638 56972 45447 796 -70976 -30571 -25050 -110860 -105019 -32734 3887 36113
9515 36113 49401 10276 37654 41169 14602 184 -10002 5104 76905 54178 -5969 -22262
9503 -22262 -54101 -73744 -46151 -88993 -49543 18641 60397 30657 61639 29411 -16799 17057
9491A7057J7493N5127L0411j18458m5661P7041M1470n7492q548R3659r820j03893
9479a1614p0004O4773J26392k1830p8131M515k2910j0753m9739l329M6326M5039
9467A8735n0623j7856M5484M1198L6282l8416M9338K1108l7880m9054J6782L4009
9455F9107m1670M1740N7007k1385M224k4187j9023p0060Q09M964j7414o935M2672
9442A9849M2129m896l4749R260J840l8285k311O5658j9021L9214k439n5421o0302
9429c9474l0716J0709j3259K5566L6608R360Q038M1721L3575o2291p1709L2380
9417a9492J04768N9023J03965n5540q4421K474n1575n0439k1918k0670m4843Q935
9405f9733R6304P3989r9910j28926O8008J09665M629j08068n6250L9946P0267
$$ plain form
9491 17057 34550 89677 120088 1630 -44031 33010 74480 16988 8440 102099 92279 -11614
9479 -11614 -81618 -16845 109547 87717 9586 14101 -8809 -19562 -69301 -72630 -26304 18735
9467 18735 -31888 -49744 -4260 36938 73220 34804 84142 105250 67370 18316 35098 69107
9455 69107 27437 69177 126184 104799 109023 84836 65813 -4247 -3438 1526 -15888 -22823 19849
9442 19849 61978 57082 22333 31593 33433 -4852 -7163 58495 39474 78688 76249 20828 -39474
9429 -39474 -70190 -59481 -72740 -47174 -10566 -1206 6832 48553 82128 19837 -51872 -19492
9417 -19492 85276 144299 248264 192724 108303 110777 59202 8763 -13155 -33825 -78668 -69733
9405 -69733 26571 100560 650 -128276 -60268 49397 54026 -54042 -110292 -70346 -79
9394g9j0737m8667m057K2148n425O593N0105J0416o111k801m0068r4293m6197
9381a69173R761M3885P8994j6995k9569L6359n451P0606O907n0077J2328Q7449
9369G5024K9529n73k4780K7218M9563K1007R253l9162l7971l4713m3521j7532
9357A3342k5476M919L426M767J1690L2351K2614j903j7808n3619j6472N8290j3118
9344B3003j2513m507q235N0261p431p8979J834j555j0565q0568j0500j502m3237
9331a84494R6676M2664L3002l5776P366L0336j2282J292N2003L0113m9851r0253
9319g9204k0773L3564J9732Q901L0958J20090Q8581J9889o2207p2074m9396n0471
9307a2410n444o1781K5640K3600k122O4208K9441l2859j6209P455J9987o6399
$$ plain form
9394 -79 -10816 -59483 -63540 -41392 -46817 -40224 9881 20297 14186 11385 -28683 -122976 -169173
9381 -169173 -159412 -115527 -36533 -53528 -83097 -46738 -52189 18417 25324 -24753 -12425 75024
9369 75024 104553 103980 79200 106418 155981 176988 186241 147079 109108 74395 30874 13342
9357 13342 -12134 -7215 -3789 978 12668 45019 67633 65730 47922 -5697 -22169 36121 23003
9344 23003 10490 5983 -2252 48009 40578 -38401 -36567 -38122 -48687 -129255 -139755 -141257 -184494
9331 -184494 -87818 -45154 -12152 -47928 -40562 -10226 -22508 -21216 30787 60900 11049 -79204
9319 -79204 -99977 -66413 -46681 -37780 -6822 113268 201849 221738 159531 87457 38061 -12410
9307 -12410 -17854 -79635 -53995 -30395 -32517 31691 61132 28273 12064 19519 39506 -26893
9295b6893j02219k7225K6429p0211N2386L7226M4695O5051Q9782n8293o1299M9176
9283A8605r579k3866n460p781p9831L3751O0470J9973k8221M2371L311j126L760
9270B6377M2220l523J5421m1149o8616k2918R650k5847l8119J722L9138Q87k0330
9257h5087J2460O3343M0095K5916L5994M4234k9387m9115K4520O8402p3102k3449
9245E4824k3058j1425l2658l5557k1498J7455Q4123j3726k7124o263m9078l6403
9233a00388Q1222K7338k2559K1212m2112Q245L4970K0206K6475N839K8636o2151
9221B6933m4935k8480L0329J2757L7662M2821L0758k5252l1081l2938j1959M6823
9209E3438J5080N022L274K7143l1935M627R188j1163o0126m4832k445j7711O3364
$$ plain form
9295 -26893 -129112 -156337 -129908 -200119 -147733 -110507 -65812 -761 89021 30728 -30571 18605
9283 18605 9026 -14840 -20300 -28081 -107912 -74161 -13691 6282 -21939 20432 23743 22617 26377
9270 26377 68597 65074 80495 39346 -29270 -52188 -42538 -68385 -106504 -104782 -65644 -64757 -85087
9257 -85087 -72627 -9284 30811 56727 92721 136955 107568 58453 82973 151375 78273 54824
9245 54824 31766 20341 -12317 -47874 -69372 -51917 32206 18480 -8644 -14907 -63985 -100388
9233 -100388 -19166 8172 -14387 6825 -35287 -27042 7928 28134 54609 60448 89084 26933
9221 26933 -18002 -46482 -16153 -3396 34266 77087 107845 82593 51512 18574 6615 53438
9209 53438 68518 73540 76814 103957 72022 76649 85837 74674 14548 -30284 -32729 -50440 12924
9196A2924P4547m40k4588r1631M184M1596q327p1729j8957k9003O4247N8209m6395
9183c5363Q401J2966K0192M6846j6306q998l9516M1093K0027l3873o0534m5430
9171i0495N6242Q4730M8356q2973J0352N6531l4354o3030O4680J4133n6834j997
9159E341l0899M1460L7462N1792J9272k928L482q6807j08471O4356k2914p9244
9147a08098n883P9537J00755k2546l4796L6183j8685L7834P8850l2691o2229O390
9135E4621j1727M0990j954l2533l6930J0854O1034m749o9664m4525j8543L7521
9123a5605j188J1955M7392r8678k0255P1180O6390K103m5418q1275m9100M6220
9111f6279K9330j9255O6092K905l9265K4886L8640L3834R524o4698K023j6273
$$ plain form
9196 12924 87471 87031 62443 -29188 -25004 16592 8265 -63464 -82421 -111424 -47177 11032 -35363
9183 -35363 -26962 -13996 6196 53042 36736 27738 -11778 29315 49342 15469 -45065 -90495
9171 -90495 -34253 50477 98833 15860 26212 82743 48389 -14641 50039 64172 7338 5341
9159 5341 -25558 15902 53364 105156 124428 121500 124982 38175 -70296 -5940 -28854 -108098
9147 -108098 -113981 -34444 66311 43765 8969 45152 26467 64301 143151 110460 48231 54621
9135 54621 42894 83884 81930 49397 12467 23321 84355 79606 9942 -34583 -53126 -15605
9123 -15605 -16793 -4838 42554 -56124 -76379 -5199 61191 63294 17876 -63399 -112499 -66279
9111 -66279 -36949 -56204 9888 12793 -26472 -1586 37054 70888 80412 15714 17737 1464
9099A464m3239j2036m301K6940m130K436o9472J8961M1849O8108K3901K2233K4297
9086I7011q3128l7572O498M6053K0493j1240p405k6621n2406r857Q966M3979m331
9073i560p7818k1842n530N4982k9508K937J9315o755l1398r552M717P658N615
9060i6739O7283l1988l3553k1698R6565O5954o285l1940M4675P0905K9031p0835
9048H1375n9023k5860l6845L5684J0230J6277n2452j3037l0321M7655J3554l3552
9036d6315q1983k3147P8215m8506l0081L740M8445o306J4589P1338l8740k9772
9024h8523Q3955O4318N7707j9054j42508l7532J2646L8189k0981O7104R982M7378
9012G2681k3887m8325R393l345m5216m8886L570J9836L0327k454L2458P5430m2542
$$ plain form
9099 1464 -41775 -53811 -58112 -31172 -35302 -32866 -102338 -83377 -41528 26580 50481 72714 97011
9086 97011 13883 -23689 -17191 28862 49355 38115 30710 4089 -48317 -58174 -49208 -5229 -9560
9073 -9560 -87378 -109220 -114750 -59768 -89276 -86339 -67024 -73779 -105177 -114729 -110012 -102354 -96739
9060 -96739 -29456 -61444 -94997 -116695 -20130 45824 39539 7599 52274 123179 152210 81375
9048 81375 22352 -3508 -40353 -4669 5561 21838 -30614 -43651 -73972 -26317 -12763 -46315
9036 -46315 -128298 -151445 -73230 -121736 -151817 -148077 -99632 -105938 -91349 -20011 -58751 -88523
9024 -88523 -4568 59750 117457 98403 -44105 -81637 -68991 -30802 -51783 15321 25303 72681
9012 72681 48794 469 9862 6517 -38699 -87585 -84015 -64179 -33852 -36306 -3848 71582 29040
8999B9040j6122n4916J575L0791K6596M0695l7159L0650k2496k1265N1785P0459
8987A29633P613K344n9551q4641l2759K6322O4928J1702k9144l0180l1722n3174
8975g8629j3916N3604O9745r323j11878n924J0694J3551m1583O2638J7659K2423
8963a0939K3013O3384K8038l5591j2217j9771k9687J7166J8102q7759L5923Q3500
8951G3162l9798m7537M1926M8147k2170o9786j1398L7333P5K4630j4903n2637
8939c2956j6913n2118r7145M3922J19361N8940Q747J6050k2897r325K595m7997
8927b9736K541k9804k5228k8891Q830P9123P2378N125k7824L9675j4128q9n5702
8914c730K146K2502M2729J8036j0562N7592l3114j70l2321m7834k6863k0291J6873
$$ plain form
8999 29040 12918 -41998 -40423 -9632 16964 57659 20500 51150 28654 7389 59174 129633
8987 129633 137246 139590 80039 -4602 -37361 -11039 53889 65591 36447 6267 -25455 -78629
8975 -78629 -92545 -38941 30804 21481 -90397 -96321 -85627 -72076 -113659 -51021 -33362 -10939
8963 -10939 12074 75458 103496 67905 55688 35917 6230 23396 41498 -46261 -10338 73162
8951 73162 33364 -14173 27753 75900 53730 -16056 -27454 9879 9954 34584 19681 -32956
8939 -32956 -49869 -101987 -199132 -155210 -35849 23091 31838 47888 24991 15666 18261 -29736
8927 -29736 -27195 -56999 -82227 -111118 -102288 -23165 49213 54338 26514 66189 52061 51972 -3730
8914 -3730 -1584 20918 63647 81683 71121 128713 95599 95429 63108 15274 -11589 -31880 -15007
8901a5007K4337K6434k3200l0591p8412N0621J25174j25789l8048O5162L7267
8890A7948m4243n8872P1726L2772m6744n425P4207J6384m4650j9680k3471l4604
8878f4652N6829P6193j9984m7986n6865j516l7449k55J4035P4406L556l1391k6117
8865f1196l6179J8733M2115n485O468M7327J13738j494k8485j7578o8160p2381
8853f2577l0360k1196M8180L4559L7433m6278j20864M4055R7313N480l1799K8301
8841a7753L6575o036m2334l9532l0508l006j8288N2109L5972n6306o3887P0846
8829h2148J13336M4014n2259j18341M1121M2123J7211o2681m0951k9709R4668
8818c3616M5169m8733o2503K006j5179O9669k818j3232J0118m2949j5022K9337
$$ plain form
8901 -15007 9330 35764 12564 -18027 -96439 -45818 79356 -46433 -84481 -19319 17948
8890 17948 -26295 -85167 -13441 19331 -27413 -32838 41369 57753 13103 -6577 -30048 -64652
8878 -64652 -7823 68370 48386 400 -56465 -57981 -95430 -95685 -81650 -7244 -3688 -35079 -61196
8865 -61196 -97375 -78642 -36527 -42012 -35544 11783 125521 124027 95542 77964 9804 -62577
8853 -62577 -92937 -114133 -65953 -31394 6039 -40239 -161103 -117048 -19735 -14255 -46054 -17753
8841 -17753 18822 12786 -29548 -69080 -99588 -102594 -120882 -68773 -32801 -89107 -152994 -82148
8829 -82148 31188 75202 22943 -95398 -54277 -12154 5057 -57624 -98575 -128284 -33616
8818 -33616 11553 -37180 -99683 -97677 -112856 -43187 -46005 -59237 -49119 -92068 -107090 -77753
8806g7753j7759O9657L3182l6558l5514P555K9490M0471n680K600j2983L780J1855
8793A2343p2L5016M7400L656K4165l0766k5201p3435r5613P225M2694L8199n7150
8780g1539j0074l5371K0905J14309M0272O0773j0655J1377j1314k4757J1708q8570
8768G064p0837K1735M9669O5906q375n7438O6327n0856o5329l0107K5187L1018
8756a6036P7086k9035l8772J7749M8239m8286n569j19754K4981M1129j184P0377
8744B0925j6736M3389k6725j0904n3388q8176M1581O5662J2511M9151n4318k8798
8732d5826J723N6246L0944j5210o9962k4350M2475l1765L3467l440k3876l415
8720e2989j8540K9169k5958k7674J4876N1933K6887o307K725l4509n4973L1071
$$ plain form
8806 -77753 -95512 -25855 7327 -29231 -64745 -57190 -27700 12771 7091 9691 -3292 488 12343
8793 12343 12271 47287 94687 98343 122508 91742 66541 -6894 -102507 -95282 -52588 -14389 -71539
8780 -71539 -81613 -116984 -96079 18230 58502 119275 108620 119997 108683 83926 95634 7064
8768 7064 -63773 -42038 7631 73537 65162 7724 74051 23195 -42134 -72241 -47054 -16036
8756 -16036 61050 32015 -6757 10992 59231 10945 5376 -114378 -89397 -48268 -49452 20925
8744 20925 4189 47578 20853 9949 -43439 -131615 -90034 -24372 -11861 37290 -17028 -45826
8732 -45826 -44103 12143 43087 27877 -42085 -66435 -23960 -55725 -22258 -25698 -49574 -52989
8720 -52989 -71529 -42360 -68318 -95992 -81116 -29183 -2296 -8603 -5878 -40387 -95360 -64289
8708f4289P1387M2592J6274l5748n8443o0903j0017K2922q550O161k5688N8790
8696d5512O4165L1406n9580k9926J5482L8023J6498n2904o3200K3225J4929l0880
8684g8274n971M5542k9451J956J14196L4835J6925q8244q7013l1782J9607N8024
8672b9650J9394o5463J2618N2087P0336l60p7369n0288Q8420J1708q232M5567
8660F8768M235m6417J6788K2604K2453J3183o2576n880M6779l7441l9267M6419
8648D9648J3667n6059j0618j769r5061m18L9506m611O807L0291j4178N604l0876
8635f8067r852J5398R674k7517K3507l0993m1142l815J2957O5107Q4341o5225
8623c5627o1517q0455J4432L2821j3288L4743M5396K4935J6596l5788k9829O0306
$$ plain form
8708 -64289 7098 49690 65964 30216 -28227 -89130 -99147 -76225 -84775 -78614 -104302 -45512
8696 -45512 18653 50059 -9521 -39447 -23965 14058 30556 -22348 -85548 -62323 -47394 -78274
8684 -78274 -84245 -38703 -68154 -66198 47998 82833 99758 11514 -75499 -107281 -87674 -29650
8672 -29650 -10256 -75719 -63101 -11014 59322 58962 -18407 -68695 19725 31433 23201 68768
8660 68768 73003 26586 43374 65978 88431 101614 39038 33158 79937 42496 3229 49648
8648 49648 63315 7256 -3362 -5131 -100192 -100610 -61104 -65715 -58908 -28617 -42795 -37191 -68067
8635 -68067 -77919 -62521 -52847 -80364 -56857 -87850 -128992 -132807 -119850 -54743 29598 -35627
8623 -35627 -97144 -177599 -163167 -130346 -143634 -108891 -63495 -38560 -21964 -57752 -87581 -27275
8611b7275J5632k1801N377O4115j6858o51M2422M4552J7634n5812l9800o3210
8599c5675l2476l6517L5811P3108O5120p485j570m1600n7424K1989O2543K9453
8587G5277m6806k5378j3430l258J7679N0766n3130p2948l6334O6205p034k9750
8575g8141P254j9032J3825L7115R293J6820M2499l9837q7860q4300P9786L1156
8563g1422Q0407m2390J9629M4096J7930n7781k163J2032R190M3644j10706n4640
8551a12174N5679J5726K5255k516L1773l7594M1127L2640J5489K0376o9107q2682
8539f6008k8424J7876O3919l3254R3704k3775l5500q977p1636k4788J5731m0835
8527a41967J9184O8104o049K5125M6142J03753n8856K364Q5259k7486m0330m1692
$$ plain form
8611 -27275 -11643 -33444 -28067 36048 19190 18539 60961 105513 123147 67335 27535 -35675
8599 -35675 -68151 -104668 -68857 4251 69371 61886 60316 18716 -38708 -16719 45824 75277
8587 75277 28471 3093 -10337 -13595 4084 54850 1720 -71228 -107562 -41357 -48391 -78141
8575 -78141 -70887 -89919 -76094 -38979 -29686 -12866 29633 -10204 -98064 -182364 -102578 -71422
8563 -71422 8985 -33405 -13776 30320 48250 -9531 -11694 338 9528 53172 -57534 -112174
8551 -112174 -56495 -40769 -15514 -18030 13743 -23851 17276 49916 65405 85781 16674 -66008
8539 -66008 -94432 -76556 -12637 -45891 47813 24038 -11462 -20439 -92075 -116863 -101132 -141967
8527 -141967 -122783 -54679 -60728 -35603 10539 114292 55436 57800 143059 115573 75243 33551
8515C3551l8064Q4681o2468k3033K0982l749l1466o3913K6365N975k7145m0811
8503a19095k1367j0087N646j5983P5335M4518j1287L6028k863j2532Q874k5413
8491d8226j9602K7305k2304J2111N5050K8173N8635O924n3608o8020l0268n1996
8479a05826L9123K82l335Q973m6159o0872O42L8957P1462N6755m4653k4645Q4219
8466A4923L2666L779l1265m0717j6741P42m162l4857J8053P8k0574M5349J03347
8453G0621j4615k3357R500K7959K4365J5712l9359j7840O127N3190m140k8384
8441G9779j9629n2489n6163j7897L5137K6959k3836k1082o744P844N4714O1541
8429F8134m6460J00N310n605K5630m1675K774J0949R173K9211k5554o2507j5698
$$ plain form
8515 33551 -4513 80168 17700 -5333 15649 11900 -19566 -83479 -57114 -51139 -78284 -119095
8503 -119095 -140462 -150549 -144903 -160886 -85551 -41033 -52320 -16292 -19155 -31687 -22813 -48226
8491 -48226 -67828 -40523 -62827 -50716 4334 32507 91142 98066 44458 -23562 -53830 -105826
8479 -105826 -66703 -66421 -69756 -60783 -106942 -167814 -167172 -128215 -56753 2 -44651 -69296 14923
8466 14923 47589 51368 20103 -20614 -37355 -36613 -40775 -75632 -57579 -57501 -78075 -32726 70621
8453 70621 56006 32649 42149 70108 94473 110185 70826 52986 59113 112303 108163 79779
8441 79779 60150 7661 -48502 -66399 -31262 -4303 -28139 -49221 -55965 -48121 6593 68134
8429 68134 21674 21774 27084 21479 47109 5434 8208 19157 28330 57541 31987 -30520 -46218
8416d6218O6318J29760L5364l7832l202O4891J2396o8040j11944j532n0850r1450
8404a02339R528J3445K5843L4579k1067m739K829O587O401N2981M5579L42p2924
8391b955o5304L2861J9795Q354K5231j5066j0124O7288j566R006L26n931l884
8378E8031j39n8609j0988l1615n897o6527l4871K7900L3672P862k7133N0754L3932
8365b3628j7856J4324P7335l2420k1080k9657K0924j9568L9621k4741q4317J6072
8353h4991M3305P587j2294J6545K1519K6668k3116k016M3682J13141j8416r1039
8341D0575j25172L92P6558L7857J0679l9014k1334L44O3857p348q4810m0731O3949
8328b4198L2092j3308m2624m1004J3642P7459K9402j9386K5721K3869P8317k3171
$$ plain form
8416 -46218 20100 149860 185224 147392 144190 209081 221477 153437 41493 39961 -10889 -102339
8404 -102339 -92811 -79366 -53523 -18944 -40011 -44750 -41921 -35334 -28933 24048 69627 69969 -2955
8391 -2955 -68259 -35398 -15603 -7249 17982 2916 -7208 60080 58514 67520 67846 61915 58031
8378 58031 57892 -717 -11705 -43320 -49217 -115744 -150615 -122715 -89043 -81181 -108314 -57560 -23628
8365 -23628 -41484 -27160 50175 17755 -3325 -32982 -12058 -31626 7995 -16746 -101063 -84991
8353 -84991 -41686 -34099 -46393 -29848 -8329 18339 -4777 -6793 36889 150030 131614 40575
8341 40575 -84597 -84205 -7647 30210 40889 1875 -19459 -19115 44742 37394 -47416 -88147 -24198
8328 -24198 7894 -5414 -48038 -89042 -75400 2059 31461 12075 37796 61665 139982 116811
8316A16811j5820L6226P438r9511q9172L3565K843J6757j3532l5916o244J2159
8304c4396q4015m949M1285k6324K9781J00111J8180p3512n4764K1277L6309j4426
8292d5443r113R2828r345m7994l8385l3248K9616Q6945m5927j36550j05090k089
8280b63795Q032K4541R5563N5585N1831K8223k9471o7011p682j3051r738K8546
8268i8427N1281j2353K243Q485N0975p233q3170j8262Q18L4870M7466P0020l239
8255D3474l4694j0437p2567l8002Q0676J6666j049K4022L2791K8984o5628k5178
8243b0942m538K857O4570J6929M6917n0913o8624O8278M7132J5377r3794n8593
8231c5344N053K1649j1846M2613j5482j7748Q914m7227m7898J1121N1532M8038
$$ plain form
8316 116811 100991 137217 144655 45144 -44028 -10463 -7620 9137 -4395 -40311 -46555 -34396
8304 -34396 -118411 -123360 -82075 -108399 -78618 21493 39673 -33839 -88603 -67326 -31017 -45443
8292 -45443 -54556 38272 28927 -19067 -57452 -90700 -61084 25861 -20066 -156616 -261706 -263795
8280 -263795 -255763 -231222 -135659 -80074 -28243 -20 -29491 -96502 -104184 -117235 -126973 -98427
8268 -98427 -47146 -59499 -57256 -48771 2204 -5029 -88199 -106461 -105643 -70773 -23307 46713 43474
8255 43474 8780 -1657 -74224 -112226 -31550 -14884 -15933 8089 40880 69864 4236 -20942
8243 -20942 -25480 -22623 41947 58876 105793 54880 -13744 54534 101666 117043 23249 -35344
8231 -35344 -30291 -8642 -20488 22125 6643 -11105 -2191 -49418 -97316 -86195 -34663 13375
8219A3375j7763K3952J864K3022j2275k1926O8732K176N153L643K1988l2957k2522
8206E6462J3376j9637j7923K1600n8584l007O1k3323n7620Q0116M0710M3711M5853
8193A21795K3599l4390k7889K4372M5853r9610q3747j7416k2228J5741M6450K5374
8181A7904L8368r838k4254K5561j3930n2570o0194M4593n898J7791O0314J6726
8169E4573m7556l1767j4195m4678k725K3959K0774O5082N7906N6155K3039n0282
8157A10285j3446J1716p3376k531M0929K1945l8828l4792J7432k6832n1685m3941
8145h3124J8785O6279j5397k8277n719q453M9472L195J6796M4093N2905J7249
8133A27804n0873p3693m2224o221L703q201k0346M4075J8673K5938N893k7269
$$ plain form
8219 13375 -4388 19564 21428 44450 32175 10249 78981 81157 86310 89953 111941 78984 56462
8206 56462 69838 50201 32278 53878 -4706 -7713 -7652 -30975 -88595 -8479 32231 75942 121795
8193 121795 145394 111004 83115 107487 153340 53730 -30017 -47433 -69661 -53920 -7470 17904
8181 17904 56272 46434 22180 47741 33811 -18759 -78953 -34360 -40258 -22467 37847 54573
8169 54573 7017 -24750 -38945 -83623 -86348 -62389 -41615 23467 81373 137528 160567 110285
8157 110285 96839 108555 35179 32648 73577 95522 56694 21902 39334 12502 -39183 -83124
8145 -83124 -64339 1940 -13457 -41734 -47453 -55906 -6434 -3239 13557 57650 110555 127804
8133 127804 76931 3238 -38986 -45207 -41504 -49705 -70051 -25976 -7303 18635 24528 -2741
8121b741p1470P075L5816M6820J5455K1274r350n2086n3503M8955K8683j6882
8109a954J1800j296L70j0312L0269j8580l8789J0814L6311k7604q8556o4529K3424
8096a38632L7322j4322M9083P1643K1749N035L7750k153j2193k872M0973m5145
8084D8238l7390M4497K5324n4283r617l5213j07685J1845M5935O280L1527K8811
8072a731r1127K57K8285m0370j1137J9150L4628P2736n8832l3003J9369L0357
8060c1418P3523N719r1202j3565L4860l4112k5265J5888L0611k220m6554k4704
8048a08439l8137k767O5809P3453L0335k9859l6580j7037K4819M2953R315K2579
8036C6444m0002n3797P135L8151m5026J2522L5626R11k1446Q1979n2156o1073
$$ plain form
8121 -2741 -74211 -67136 -31320 15500 30955 52229 42879 -9207 -62710 -13755 14928 -1954
8109 -1954 9846 8550 8920 -1392 28877 10297 -28492 -17678 18633 -8971 -97527 -162056 -138632
8096 -138632 -101310 -115632 -66549 5094 26843 31878 69628 67475 55282 52410 93383 48238
8084 48238 10848 55345 80669 26386 16769 -18444 -126129 -114284 -68349 -62069 -30542 -1731
8072 -1731 -92858 -92601 -64316 -104686 -115823 -96673 -62045 10691 -48141 -81144 -61775 -31418
8060 -31418 42105 47824 -43378 -56943 -22083 -56195 -81460 -65572 -34961 -37181 -83735 -108439
8048 -108439 -146576 -149343 -83534 -10081 20254 -9605 -46185 -63222 -38403 4550 13865 36444
8036 36444 -3558 -57355 -50220 -12069 -57095 -44573 -8947 -8036 -29482 52497 341 -60732
8024f0732O8578Q4619j9001l6050j6903m0613k7740J4091k3688j3637K9504K2009
8012a9563N7949J2010j7964m9725L257l8946r145J7144R8876K4544n0875o1775
8000c4213j1531L6630P5065M1381j11869j6403M5952m0203m1698P851L5780j6321
7988b9579p0160n3441n2504P5898J11869Q9775l2469o3163r6408M1677L6668L8331
7976c506O4939k1010P47N6417J3857j8551o531n9051r2350M626L3136j9897J1660
7963c5514K5682L0349q9078K2338p491K513k7548P104K2131M6028L4461o2808
7951c1833p831k6062l06N4367M9788J2819k4913n8343J4592J184N2042Q889m9144
7938d751r607J2092L4034K5342K4089m6560q8572J7759j6905k2370K7937j4736
$$ plain form
8024 -60732 7846 92465 73464 37414 20511 -20102 -47842 -33751 -57439 -71076 -41572 -19563
8012 -19563 38386 50396 32432 -17293 -14036 -52982 -62127 -44983 53893 78437 27562 -34213
8000 -34213 -45744 -9114 65951 107332 -4537 -20940 25012 -15191 -56889 -49038 -13258 -29579
7988 -29579 -99739 -153180 -205684 -129786 -17917 71858 39389 -23774 -120182 -78505 -41837 -3506
7976 -3506 61433 40423 41170 97587 111444 92893 86362 27311 -65039 -60413 -27277 -47174 -35514
7963 -35514 -9832 20517 -68561 -46223 -53714 -51201 -78749 -71645 -49514 -3486 30975 -31833
7951 -31833 -39664 -65726 -66032 -11665 38123 50942 26029 -32314 -17722 -16538 35504 44393 -4751
7938 -4751 -14358 -2266 31768 57110 81199 34639 -53933 -36174 -53079 -75449 -47512 -62248
7926f2248R7597Q8014m1369j04407J3376l3383M5614K6084N4868N2478o2291n4958
7914A9375q9160n5139L9467Q0865L7282L7824p456K3025m2352r3424j3003N2168
7902a0528L8694P241L5173N7661m1663q0226j2326L5707K9058J1241l6445o0963
7890b7376m3573L6957L2840M659m2672L2240Q3389j6911o2859K3887k3788j8564
7878b1771J2053M9016l7685M9686p0787j46915J4630J41984n42p9675K1194o3814
7866a32626m5243L4573L5574L3595O9427M5726l3475o5273n2153P566m927j7055
7854a24291L576L9180K2419K6998J371O2685K5332O278q488j7792p12N5262P854
7841I9672m5347l9970n2071M6152j8372j834M1666R9051O1535k6522m9687o8147
$$ plain form
7926 -62248 35349 123363 81994 -22413 -9037 -42420 3194 29278 84146 136624 74333 19375
7914 19375 -69785 -124924 -85457 -4592 32690 70514 63058 86083 43731 -49693 -62696 -10528
7902 -10528 28166 35407 70580 128241 86578 6352 -5974 29733 58791 70032 33587 -27376
7890 -27376 -70949 -33992 -1152 3507 -39165 -6925 76464 59553 -3306 20581 -3207 -21771
7878 -21771 -9718 39298 1613 51299 -19488 -166403 -151773 -9789 -10331 -90006 -68812 -132626
7866 -132626 -177869 -143296 -107722 -74127 -4700 41026 7551 -57722 -109875 -102309 -107236 -124291
7854 -124291 -120715 -81535 -59116 -32118 -30747 31938 57270 63548 55060 37268 36556 91818 99672
7841 99672 54325 14355 -37716 8436 -9936 -11770 29896 128947 190482 163960 114273 46126
7829D6126k7586K7922L6861N934p4165J3339K6595j6301m8153j3637j8704M718
7817c7051P2381L6864j910K846o1220r7573J5126l7545J1979K7218j3878J7323
7805f5440R417O0955N268l7238k4479o205r6514J4745J23470O3734m8769Q934
7793G878M1679k6824j8845P5978O0196j1623j6564n564k1191p0628j0120j9552
7781a5180N8153L7872m678r833n972k0136j577Q2833m12j7380o651n573j263p7246
7767A2957L6392o267m6143J022O9835M7485l2746k2687k1906m4875l16N1945K9842
7754G4538q6550p299L5430L0798n827K8924K1629o0177n8723M4504L2614p5772
7742b5911J649j5857M9014M9063m6058J3345N0203J7425n317m9202q3352J9975
$$ plain form
7829 46126 18540 46462 83323 89257 15092 28431 55026 38725 -9428 -23065 -41769 -37051
7817 -37051 35330 72194 70284 73130 11910 -85663 -70537 -108082 -96103 -68885 -82763 -65440
7805 -65440 -56023 4932 10200 -27038 -51517 -57722 -154236 -139491 -16021 47713 -1056 7878
7793 7878 49557 22733 3888 79866 140062 128439 111875 106311 85120 14492 4372 -15180
7781 -15180 42973 80845 76167 66334 60362 40226 38649 121482 121070 103690 97039 91466 90203 12957
7767 12957 49349 43082 -3061 -2039 67796 115281 82535 59848 37942 -6933 -7249 44696 74538
7754 74538 -12012 -19311 16119 46917 41090 70014 91643 31466 -27257 17247 49861 -25911
7742 -25911 -24262 -40119 8895 57958 11900 25245 75448 92873 87556 38354 -44998 -25023
7730b5023O0526L0132L6998j9981q7576j3202k7846Q000M170j0001N7570k816
7718A0951M1619k0448j02764k8573R4877k0494p7978J9522L1715L0131l1197L4625
7706a8014Q3599O0920r2723K522P0914k4816q0403l159M7658o151k2376n5285
7694c7314O5889O6299n4042p4699r353L9039k152j442n8516j7049K2051m2711
7682a04000O174Q7723L9844L970k2670M986J0311k0372J2528K2660l0990j1165
7670a001k6684m7637l9079r2526L8449P4068J2782O8581M2581j3582j8350P113
7658D715m8481L8241L6m2883r2152M9760N3358P6853j4342j6734L4463o7354o0696
7645h5216N3044J4225L257j7464j8248K581K9968J0119K350r444n0796p6295n4740
$$ plain form
7730 -25023 35503 65635 102633 82652 -4924 -18126 -45972 -37972 -33802 -43803 13767 10951
7718 10951 52570 32122 -70642 -99215 -4338 -24832 -102810 -83288 -51573 -21442 -52639 -18014
7706 -18014 65585 126505 33782 36304 107218 82402 1999 -1160 46498 40347 17971 -37314
7694 -37314 28575 94874 40832 -33867 -43220 -4181 -6333 -7775 -66291 -83340 -61289 -104000
7682 -104000 -97826 -10103 29741 33711 11041 16027 26338 5966 18494 41154 10164 -1001
7670 -1001 -27685 -75322 -114401 -206927 -168478 -94410 -81628 -13047 29534 15952 -2398 4715
7658 4715 -43766 -5525 -5489 -48372 -140524 -90764 -37406 39447 25105 8371 42834 -24520 -85216
7645 -85216 -32172 -17947 -14690 -32154 -50402 -47821 -17853 -7734 -5384 -14828 -65624 -141919 -196659
7632a96659P1258M1541J4827p87k8635O4092L6387J5190R749j3902o2588J4333
7620c5194j3201m2480p821n5505R216O8764m7228O9988M2953J4722L013J9339
7608B6566k0594K944K3099k2584M4389l897l3792r6557O365P9999M1155K5934
7596G3027K2170K1767k1516J2309k6860n6259N068m7933P116l0826L2215m6522
7584e6244k4166M0469Q9782J17562J6215n6691l1215L3980q392p9171k7828j6907
7572b606L8857P94L5778P8527K2779n7683r911k208j0637m3424m808J1814j9213
7559C8059p879j8776L0467K5361o5370m7829l2919n8185K6212M7835j0947M3991
7547b9980j8184L0431m1009J2394M555j1788J0195O8319j7240l6906l4734J9254
$$ plain form
7632 -196659 -125401 -83860 -69033 -69820 -98455 -34363 2024 17214 26963 13061 -49527 -35194
7620 -35194 -48395 -90875 -98696 -154201 -144985 -76221 -123449 -53461 -10508 4214 7227 26566
7608 26566 5972 8916 32015 9431 53820 49923 16131 -80426 -74061 5938 47093 73027
7596 73027 95197 116964 95448 107757 80897 24638 29706 -18227 -11111 -41937 -9722 -56244
7584 -56244 -80410 -39941 49841 167403 183618 126927 95712 129692 121300 42129 14301 -2606
7572 -2606 36251 37045 72823 151350 174129 116446 106535 104327 93690 50266 45458 57272 38059
7559 38059 30180 11404 41871 67232 1862 -45967 -78886 -137071 -110859 -63024 -73971 -29980
7547 -29980 -48164 -17733 -58742 -46348 -41793 -53581 -43386 24933 7693 -29213 -63947 -44693
7535d4693N1692N3240L314o418J4800R35m6031r380j3356n2102N431n6725o280
7522a05573Q695Q106L9902J24490L0989Q3m7710q6849L5346j6261j7891j5330
7510d2003P2599J6063L1028J8245l9711n2357q4648m726P2750M5321k4812o4623
7498e6874L1644l2748l3922J0169J7760n4755q970j4738j2478N9521N1758Q3341
7486C9708P802q943l2694k0215j5531l786N7582k8186o1988o035P675L789l7223
7473i8045Q2513L9401j46495k0140O4717Q5465O5278j3509j934l180m9046J8134
7461B3159n2772n3771R212k3773l5405p488k1617J4634J34214Q7227k1406j9474
7449C2740l541K9933j3101j782P793m977l7924r1623o1370k1505N9132o439n721
$$ plain form
7535 -44693 6999 60239 63553 57135 71935 72870 26839 17459 4103 -47999 -42568 -99293 -105573
7522 -105573 -96878 -88772 -48870 75620 106609 106692 58982 -27867 7479 -8782 -26673 -42003
7510 -42003 30596 46659 77687 95932 56221 3864 -80784 -85510 -12760 32561 7749 -56874
7498 -56874 -25230 -57978 -91900 -81731 -63971 -118726 -127696 -142434 -154912 -95391 -43633 39708
7486 39708 47510 38567 5873 -14342 -29873 -33659 23923 -4263 -66251 -72286 -64611 -60822 -98045
7473 -98045 -15532 23869 -122626 -142766 -78049 7416 72694 59185 57251 54071 5025 23159
7461 23159 -29613 -83384 -74172 -97945 -133350 -140838 -162455 -147821 -13607 73620 52214 32740
7449 32740 29199 59132 46031 44249 52042 47065 9141 -82482 -143852 -165357 -106225 -112664 -118385
7436a18385M2114L8826l7920O3412O6048K1932n3771K3878N3607K8273K4090P8270
7424B30374K9181n1901K2488q394N2691O3908J50451J51928J62105K48251N76074
7413A627156R00929J629132K282804K438545J935276P56112o56680j665008k108316
7404G139950k033991j558851j056681o73546l38661k17121j94247j19955j52633
7395G94264j14921r7179j63588m1851n9191K2168L5933n657l6883j3827k9022
7384B90246k9765n3941k8383j4668m5423k5051m7066O6204O1220M8470o710l703
7372B11430j2476j6752j62354L649K3270O4664j5898k9060n5824m4169J7613K5316
7360I409r774J9161k030p113O26K3422l4904N751m4955n4632K6728R272L946L4824
$$ plain form
7436 -118385 -76271 -37445 -75365 -11953 54095 76027 22256 46134 99741 128014 152104 230374
7424 230374 259555 207654 230142 221748 274439 338347 488798 640726 802831 1051082 1627156
7413 1627156 2528085 4157217 6440021 8878566 10813842 11569954 10913274 9248266 7139950
7404 7139950 5105959 3547108 2490427 1816881 1478220 1261099 1066852 946897 794264
7395 794264 679343 582164 418576 376725 317534 339702 375635 369978 333095 319268 290246
7384 290246 260481 206540 178157 163489 118066 93015 45949 112153 173373 221843 215133 211430
7372 211430 198954 182202 19848 23497 46767 111431 95533 66473 10649 -33520 -15907 9409
7360 9409 -365 18796 16766 9653 10279 33701 -1203 4548 -40407 -95039 -68311 -59039 -55093 -20269
7346b0269M5755p335n0693K4194J2072K9165K1647J9750n709K6994J9474l6220
7334G8825j08784j5127K6851M5383J9719L9610j7354o7980J7752R3302J7154m395
7322A24956r185J8512M990J399k7774j9924l4960K8901L0613j0139m9290M3128
7310A01227P487j1384l3800K6227M1541r6518p5371l164K5060P8289J3447n9703
7298A3338j3797j0977j0190j388J887L320k2460K3500p8354n4069L3766j8696
7286a34120M2528R0534J0179P3829j845J6933l8885o7651n4544K876o801o4290
7274a31257K4972O4639L6670M6109j4742K0045j9799r624k9612l309K0130k4243
7262b0021J7211j4482m716q721q1481j5670l3385n642N1867J02728M4928l3421
$$ plain form
7346 -20269 25486 18151 -32542 -8348 3724 32889 54536 74286 68577 95571 115045 78825
7334 78825 -29959 -45086 -18235 27148 46867 86477 69123 1143 18895 112197 129351 124956
7322 124956 115771 134283 139273 140672 112898 92974 58014 86915 117528 107389 58099 101227
7310 101227 108714 97330 63530 89757 131298 34780 -40591 -43755 -18695 59594 73041 13338
7298 13338 -459 -11436 -21626 -23014 -21127 -17807 -40267 -16767 -95121 -149190 -115424 -134120
7286 -134120 -91592 -1058 9121 82950 81105 98038 59153 -8498 -63042 -60166 -66967 -131257
7274 -131257 -106285 -41646 -4976 41133 26391 46436 26637 17013 -12599 -15908 4222 -20021
7262 -20021 -2810 -17292 -22008 -30729 -112210 -127880 -161265 -166907 -115040 -12312 32616 -805
7250h05l1651l85j8094M8100M3197n8489l1186K2098O9503k4474m3708j315k4809
7237e2018O6875Q6082j9937j8974l1730j00302J2860P5198j7776l3909j1317j6535
7225f1483N2279p697p9634k6369K1408L2093M6834J0920L3398j3791k9973L8867
7213A6852j788l0183p2623q601N4888M1334M3432K1801n1161k8855k1295L1250
7201d949o5906o5706M3761P7239N6650O3307j058k7685q574k8595o1907m856M2073
7188A3794N3423J1355l0131L1979J6789j07500p664P9926M7795k9796j5385l9731
7176B4854o1672j6121P7835k179O1677Q4835l3298j08358m8076L6099L0362M3576
7164H9534k1044n9909j07146M2377R3175Q4091k0279p4782J905k0232k248J1861
$$ plain form
7250 -805 -32456 -32841 -50935 -2835 40362 -18127 -49313 -27215 42288 17814 -25894 -27209 -52018
7237 -52018 14857 100939 81002 62028 30298 -70004 -57144 18054 278 -33631 -44948 -61483
7225 -61483 -9204 -16901 -96535 -122904 -101496 -69403 -22569 -11649 21749 7958 -22015 16852
7213 16852 15064 -15119 -87742 -96343 -41455 -121 43311 65112 13951 -14904 -36199 -4949
7201 -4949 -70855 -136561 -92800 -15561 41089 104396 103338 75653 67079 38484 -23423 -28279 13794
7188 13794 67217 78572 48441 80420 97209 -10291 -17955 61971 109766 79970 64585 24854
7176 24854 -36818 -52939 24896 22717 84394 169229 135931 27573 -20503 15596 45958 89534
7164 89534 68490 8581 -98565 -56188 36987 121078 100799 26017 27922 7690 5442 17303
7152A7303k6991K0362J9029l5126M0014K8186j7461p0430K15j8607l4315M4102
7140c3719J6603M3911R099p7433L9556R3984K4045M7270k188k6011m8827J657
7128H7947o175J3062R3455J322q9389j05193j5674L6523p91J335l2842k6246K4060
7115a8606O891K1178J7915n1607j22033K7130J5434j3658k3555N0287R5264k942
7103A698p2041J3630N8773k5498p4717k0457K8025M1931L4550K7403m131o2523
7091e3357L2433r512j511j7404j3206O798j2282m3579L9135J41577N2214r5401
7079B5905l5231j1090L3883O997K148k1625j2666o211o7676J5893N2047N8133
7067D0507O8451K6142M868m2278j16903p0676K8350R785L2251L7373M5250n3681
$$ plain form
7152 17303 -9688 10674 29703 -5423 34591 62777 45316 -25114 -24899 -43506 -77821 -33719
7140 -33719 -17116 26795 35894 -41539 -1983 92001 116046 163316 161128 135117 86290 87947
7128 87947 81772 94834 188289 189611 100222 -4971 -20645 15878 15087 16422 -16420 -42666 -18606
7115 -18606 -11715 9463 27378 -24229 -146262 -119132 -103698 -117356 -140911 -90624 4640 1698
7103 1698 -70343 -56713 2060 -23438 -98155 -118612 -90587 -48656 -14106 13297 9166 -53357
7091 -53357 -20924 -30436 -31947 -49351 -62557 -55759 -68041 -111620 -72485 69092 121306 25905
7079 25905 -9326 -20416 13467 20464 22612 987 -11679 -17890 -85566 -69673 -17626 40507
7067 40507 108958 135100 139968 97690 -19213 -89889 -61539 -51754 -19503 17870 63120 9439
7055I439m4192o4963n7531p023P5340O5892O8049l13o0476K1769J2378j5546l6857
7042c4034q3942L6925Q0433Q9625L3179k9788l302J7613n8563M9561j3202l6049
7030D8456m0603o5620J6649N7986k742L1832M471k6978m9506R38J58k8853m5688
7017i9500j3876K7662K0817m480O78p1087j4214L5850R603l4719O1508Q1589j2141
7004a2310N1116o018j4630K2052l9565m4618K1665J8342J8415N4506O7380l5790
6992A00545m556J0658k9660l5198L6493J5037j5185m2346k2425j6678K1526J7439
6980C5650n8442p105P6350K6297n4561J7025J4284q1938K2087o995L0470l433
6968I689o4033k1653L8721j5054J1275P4912N5557k2255O479o8608q4330j7240
$$ plain form
7055 9439 -34753 -99716 -157247 -164270 -88930 -23038 45011 44698 -15778 5991 18369 2823 -34034
7042 -34034 -117976 -81051 -618 89007 122186 92398 89096 106709 48146 97707 84505 48456
7030 48456 7853 -57767 -41118 16868 14126 45958 50429 23451 -26055 -25117 -24959 -53812 -99500
7017 -99500 -113376 -85714 -64897 -69377 -68699 -139786 -154000 -118150 -108547 -143266 -81758 -169 -12310
7004 -12310 38806 32788 18158 40210 645 -43973 -22308 -3966 14449 68955 136335 100545
6992 100545 95989 106647 76987 41789 78282 93319 78134 35788 13363 -3315 18211 35650
6980 35650 -22792 -29897 46453 72750 18189 35214 49498 -32440 -10353 -17348 13122 9689
6968 9689 -54344 -75997 -37276 -52330 -41055 33857 89414 67159 73638 5030 -79300 -96540
6956i6540j2625K0496O5432K8133n8577l8813J09145N0101k0393J6383k2731o7918
6944b7907j4669O6647j7450l446K7321l4564m3437Q1659J13582k8998J5344j12984
6932B1098p5357L5175K1361l8754k1227N423o811R98L6524J0674Q3033Q2480m7621
6919A06996j7888j1776J3535n6485l7652L3137O8987J1386r631O5466m1458l5818
6907H8799o89l3164k9564O7913J4675n8883p4275l2098N4985k8973l6707k7142
6895i5123L7525M7131O9019L8489j00321L0070K6237k9609R546L711N3405m531
6883H5549l0426P613J3448k6877j4628K7131L5245o5193J4670j4930k198l8731
6871i327M6440R237K9862J4616k0687j3080m1193O986j7738p2385o0787o4832
$$ plain form
6956 -96540 -109165 -88669 -23237 4896 -53681 -92494 16651 66752 46359 62742 40011 -27907
6944 -27907 -42576 24071 6621 3175 30496 -4068 -47505 34154 147736 118738 134082 21098
6932 21098 -54259 -19084 2277 -36477 -57704 -52281 -59092 -58094 -21570 -10896 72137 154617 106996
6919 106996 89108 77332 90867 34382 -3270 29867 98854 110240 100609 166075 124617 88799
6907 88799 88110 54946 25382 93295 107970 49087 -25188 -57286 -2301 -31274 -67981 -95123
6895 -95123 -57598 -10467 58552 97041 -3280 26790 53027 23418 32964 36675 90080 85549
6883 85549 55123 62736 76184 49307 34679 61810 97055 31862 46532 31602 29404 -9327
6871 -9327 37113 46350 76212 90828 70141 57061 15868 22854 5116 -67269 -128056 -192888
6859a92888Q7817M5380J1094M2741n629M4273k7781o1714j9204j4689P1643k108
6847b1065p731l0099q8381j6340R5709P257p0057L1945Q9198p813k4371Q969J3601
6834a9178m46l0667j7273K4617J7669Q5155n9m3136k5878L1234j1929Q526l7535
6821a8900J6412R3858M6617j6396p4228k4159m3517p2747J8573K6129p357k6342
6809h2057M1492K2183N4519J7791o4553O101J761k2231J081J0582k0075m7150
6797h0556n3166J0950K6496K0502K4816k5461o1394O3652R4463o3748r239O1709
6785I024Q8599J43o8487j8092q9631K7753Q2646j2641l4248N4382l254q5247l3354
6772h2407J2940K856N4779N1566j6087o9071K8080J1034j9614N7646j831j5806
$$ plain form
6859 -192888 -105071 -59691 -48597 -5856 -11485 32788 5007 -56707 -75911 -90600 -18957 -21065
6847 -21065 -28796 -58895 -147276 -163616 -67907 -60650 -130707 -98762 -9564 -17377 -41748 -32779 -19178
6834 -19178 -19624 -50291 -67564 -42947 -25278 59877 59818 16682 -9196 22038 10109 18635 -18900
6821 -18900 -2488 91370 137987 121591 47363 23204 -20313 -93060 -74487 -48358 -55715 -82057
6809 -82057 -40565 -18382 36137 53928 -10625 -4524 -2763 -24994 -23913 -13331 -33406 -80556
6797 -80556 -133722 -122772 -96276 -75774 -50958 -76419 -137813 -74161 20302 -43446 -52685 9024
6785 9024 97623 97766 29279 11187 -78444 -50691 31955 19314 -14934 39448 36194 -49053 -82407
6772 -82407 -69467 -66611 -11832 39734 23647 -45424 -17344 -6310 -25924 31722 29891 14085
6760A4085K617j7325k274M4138j080k4759j1858p707j8980L1063k9399j3037Q3993
6747D9477N2787M7764k779n7381n5900m3160p837m2504J4616L0291K2263m202
6735C435q3363P817O0566Q636K6565K3310M9775l5057j06037l7452p098L8629
6723e0274J4177J6044J6821O388q513n4038l4499J3116Q229n951L9457l4866j6837
6710i0746k2966N7537N6863R371P867J3917m4599l5895L2787j1506N9338M3946
6698G5914j0353o2254N3812L6356n1184m1191n7950q296O0123k0985j9770j649
6686d7427l5495O3217j6090L707L1513k0595k7991l6806O8783K0336j1533M0641
6674C2260o8128j7384l0657k8368n2003J589J2969N861M1021P4458J9603l3456
$$ plain form
6760 14085 16702 -623 -2897 41241 40161 15402 3544 -4163 -23143 7920 -21479 -34516 49477
6747 49477 102264 150028 147249 89868 33968 -9192 -17029 -59533 -44917 -14626 7637 3435
6735 3435 -79928 -72111 -11545 -2909 23656 46966 96741 61684 -44353 -81805 -88903 -50274
6723 -50274 -36097 -20053 -3232 3156 -5357 -59395 -93894 -80778 -72549 -78500 -39043 -73909 -90746
6710 -90746 -113712 -56175 688 10059 17926 31843 -12756 -48651 -15864 -27370 31968 75914
6698 75914 65561 3307 57119 93475 42291 1100 -56850 -65146 -5023 -26008 -45778 -47427
6686 -47427 -82922 -19705 -35795 -32088 -575 -21170 -49161 -85967 -17184 3152 -8381 32260
6674 32260 -35868 -53252 -83909 -112277 -164280 -162691 -149722 -143861 -102840 -28382 -8779 -42235
6662d2235p139m4491O0692L6862j6654k4550J2241p749M4381K5863n731K1020
6650E2510J2281n4526m3778l9868K2692L3569K7448q021K3524o609n2230o7887
6638a00895L4729N0904K1889p561n768L484j0233O4633L2246J4340j6000L9538
6626A21306J3031j1858o2453m8108P867O636j0596P5455j7892m1942M3661m1566
6614C3541q1759K3697K1465n11R8855J1460P141l5311q1300p2187k6278k782O6422
6601c7547O5268J1678k3354k1427l5962l8262m0538M1558L9317p15K514K7066
6589a0404J3714r064J6295j7512m2330q777m2463L26L6462P3345N4701J1653j9836
6576E6110K9566N3393m4551M779K3050l6466k7337m8338k7327R02L2L6464N3829
$$ plain form
6662 -42235 -49374 -93865 -33173 3689 -12965 -37515 -25274 -33023 11358 37221 31490 52510
6650 52510 64791 10265 -33513 -73381 -50689 -17120 10328 2307 25831 19222 -33008 -100895
6638 -100895 -66166 -15262 6627 -934 -6702 -3218 -13451 51182 83428 97768 81768 121306
6626 121306 134337 122479 60026 11918 19785 26421 15825 91280 73388 31446 75107 33541
6614 33541 -48218 -24521 -3056 -3567 95288 106748 113889 78578 -2722 -74909 -101187 -103969 -37547
6601 -37547 27721 39399 16045 -5382 -41344 -79606 -120144 -78586 -39269 -39984 -37470 -10404
6589 -10404 3310 -5754 10541 -6971 -49301 -58078 -100541 -100215 -63753 9592 64293 75946 56110
6576 56110 85676 139069 94518 99297 122347 85881 58544 10206 -17121 -16219 -16187 20277 74106
6563G4106M814j3013k3028J7989L2943J6331J8427j5515l0434l0219L2801p6616
6551H586l6914K8327L0518M7691k6189j9337l1050k1682J8972K3203j8231j5036
6539a1142j8093O2652m397o9553k6955J3606O8030O4839j769n6525q6645p4120
6527a40072P8639M1370K8764K9259K5611N143n723l7267J8807N457k0364r8416
6515f8792k5181J360o1659m2137P0413O6378k4884o4561K6214J13575J289j2128
6503b0113J8416j984l6560r7329O0231L5544M8337J09407n0031p209k386q8260
6491c1937j1891P5789j9093l7594L661K1384M2744M561K1204r729K0240J4058
6479I3397n2029o686M2889k0829O3472L1128J058o1755j1752Q6838m7853p8858
$$ plain form
6563 74106 78920 65907 42879 60868 93811 110142 128569 113054 82620 52401 85202 8586
6551 8586 -28328 -1 30517 78208 52019 32682 1632 -20050 -1078 22125 3894 -11142
6539 -11142 -29235 33417 29020 -40533 -67488 -53882 14148 78987 77218 20693 -65952 -140072
6527 -140072 -61433 -20063 8701 37960 63571 68714 62991 25724 44531 49988 29624 -68792
6515 -68792 -93973 -92613 -154272 -196409 -125996 -59618 -84502 -149063 -122849 -9274 -7985 -20113
6503 -20113 -1697 -3681 -40241 -137570 -77339 -41795 6542 115949 65918 58709 56323 -31937
6491 -31937 -43828 31961 12868 -24726 -21065 319 43063 47624 68828 59099 79339 93397
6479 93397 41368 34682 77571 56742 120214 151342 152400 90645 78893 165731 117878 39020
6467C9020n0153p4498k974p52k4440N0244O2536m578K5962j3912N894O3117M6036
6454A21502l3848m7723l6493j822J6961J1514O0701m5564m8095l217N0158L1204
6442G5278k2088j7649J9550M2888J9789M372j08113m8888K7525Q9603m768R88
6430G8487m2511l5879J1623j8762L5866N3271J653j0803n2884l3662l0744K9644
6418a4701M1421l3172l8773l3273l1557k441N6420J4279P2741O1040j1793j7576
6406F2615o8322m9939J6528o418L4937r525Q648N4923n3001o7262N9337m2329
6394e9808o9376J008k262M1879K1103j675o244K801k8972L3381P4050J1480l1354
6381a3989k5316M7005L736j9686m5310L6906k2467J6519M8014m1085O6064L9146
$$ plain form
6467 39020 -11133 -85631 -88605 -89357 -113797 -63553 -1017 -5595 20367 6455 12349 75466 121502
6454 121502 87654 39931 3438 1616 18577 30091 90792 45228 -2867 -6084 44074 75278
6442 75278 53190 35541 55091 97979 117768 122140 14027 -34861 -7336 82267 77499 78487
6430 78487 35976 97 11720 -7042 28824 82095 83748 72945 20061 -13601 -44345 -14701
6418 -14701 26720 -6452 -45225 -78498 -110055 -112496 -56076 -41797 30944 91984 80191 62615
6406 62615 -5707 -55646 -39118 -45536 -10599 -20124 -11476 43447 -9554 -76816 -17479 -59808
6394 -59808 -129184 -128176 -130438 -88559 -67456 -69131 -75375 -72574 -101546 -68165 5885 17365 -13989
6381 -13989 -39305 7700 11436 -8250 -53560 -16654 -39121 -22602 25412 -15673 50391 89537
6369H9537j192k0596J1850L384j055n4865k7189O0175J1444j1061j0938o7106
6357a7612q423K1218k8455j9671K0822L1639l249L7261Q267r9238m668O1289L085
6344B265L720n2226O5256j8438j8402K8984M4814j6992k2637J3583J7823p182
6332D0568J4228l8945m4120l1000k332L8045R7584J9720p6902j3270j8565n5027
6320g0016J6272M5045K6712j1308L8389M3201k0633o7730m3573L6247K3996m283
6308A2319p3192o4968J1017l2638K5674J19243K3516m7541J2670K9854K472r013
6296I413K2438l8589p6936o5652j5885o127m1240J5530P0504O502K1118M4564
6284e4360j0593k2098l7337J711p3979J2204L8591j7042K7248J07289N8842l3041
$$ plain form
6369 89537 88345 67749 79599 82983 81928 27063 -126 60049 71493 60432 49494 -17612
6357 -17612 -26035 -4817 -33272 -52943 -32121 -482 -3731 33530 41797 -57441 -62109 -820 2265
6344 2265 5985 -46241 19015 577 -17825 11159 55973 38981 16344 29927 47750 40568
6332 40568 54796 15851 -28269 -59269 -61601 -23556 74028 93748 16846 3576 -14989 -70016
6320 -70016 -53744 -8699 18013 6705 45094 88295 67662 -68 -43641 -7394 16602 12319
6308 12319 -60873 -125841 -114824 -147462 -121788 -2545 20971 -26570 -13900 15954 18426 9413
6296 9413 31851 -6738 -83674 -149326 -165211 -171338 -212578 -197048 -126544 -120042 -98924 -54360
6284 -54360 -64953 -87051 -124388 -122677 -196656 -184452 -145861 -162903 -135655 -28366 30476 -2565
6272b565K1422K2041l81K1162n0750k780k0976K9515O6840m3133K6646J324K112
6259G0477K6225p3736J7406m1297M161k483k4576p6636m8144J3237N9153P6402
6247A89J25333O701l4570R87p007k5171L4571l346p5044M2933n301j06565n8926
6234a05216N6375L6707j5207k2121k9757j8815L1204p9238J3055l613N5747J9139
6222f1740j855K7350P029J1734N3594R652O439k6645K0678j4850P428O866O1354
6209A07034n7628l0856j4302J23264j2810m1144M9423j1467o9631M7368J2302
6198A01553o8003L4922j2662K3750M7762l3865r903n7286o0258k9475l746J4549
6186e2662K4197M7337J4456P676k9266J0507J3795j4849K5919L1687l6969m2868
$$ plain form
6272 -2565 18857 40898 40517 61679 10929 8149 -12827 16688 83528 40395 67041 68365 70477
6259 70477 96702 22966 40372 -925 3236 753 -23823 -100459 -148603 -135366 -76213 189
6247 189 125522 132223 97653 98640 91633 66462 101033 97687 22643 65576 60275 -46290 -105216
6234 -105216 -48841 -12134 -27341 -49462 -79219 -98034 -66830 -146068 -133013 -136626 -80879 -61740
6222 -61740 -63595 -36245 -29216 -17482 36112 45764 52203 25558 46236 31386 38814 45680 107034
6209 107034 49406 18550 4248 127512 114702 73558 122981 111514 41883 89251 101553
6198 101553 33550 68472 55810 79560 127322 93457 83554 26268 -33990 -63465 -67211 -52662
6186 -52662 -28465 18872 33328 41004 11738 22245 36040 21191 47110 78797 41828 -1040
6174a040K5924j9619j5434K6253L8817O7536M781M3232O4694r7345o3245j7065
6162E7489r1449n220k9330m8913Q5493N9801j5107J4848j14095j51715O753J41110
6150i0335O2250L9466K6818q8441n5282k5248O0752N6851K2112L597J4427n2753
6138b5786j6295J08851n9281m7092M7648K0123J6198m1465M463k7031K7387n365
6126B355m7039j5052l664M323l1555q070Q8434j1923j0607M1816M7992m3420N5751
6113F9341O5715k6533l8379l6827p1158J0611n468N4658m495p4320o9033Q7345
6101c8543N2249O5175j4508p0631l2883r92M440L8476n4635M910L4996K5742o9406
6088e5610m823p137N6195n808n9764q308O9967N3626j71j1610K2764m32k862K2497
$$ plain form
6174 -1040 24884 5265 -10169 16084 54901 122437 127218 170450 235144 137799 74554 57489
6162 57489 -33960 -39180 -68510 -117423 -31930 27871 12764 27612 -86483 -238198 -231445 -90335
6150 -90335 -28085 11381 38199 -50242 -105524 -130772 -70020 -13169 8943 12540 26967 -25786
6138 -25786 -42081 66770 7489 -39603 8045 28168 44366 2901 7364 -19667 7720 2355
6126 2355 -44684 -59736 -63400 -59077 -90632 -98702 -10268 -22191 -32798 9018 57010 13590 69341
6113 69341 135056 108523 70144 33317 -37841 -27230 -32698 21960 17465 -56855 -125888 -38543
6101 -38543 13706 78881 64373 -6258 -39141 -40133 -35693 2783 -51852 -46942 -11946 13796 -55610
6088 -55610 -60433 -67570 -11375 -17183 -76947 -85255 -15288 38338 38167 26557 49321 48889 46027 68524
6074F8524J3356N871m5172j1088O1812k4899m7426k9529l1327m1533N8110Q1782
6062E8481j1679k215k1068r3144K4243l3597J6964K7413N1189Q1674n6319k0296
6050B1646O0246L8492K2102l0782n4149m7060j238K1169l3875n9166J0278M7773
6038d564J3388l9603K1198K5912O3707N2305l9386j08104m7804r454R8027P7213
6026A02835k7574j9257k6477j5673j2643L0935n1188j2066L0572K9124K9461n030
6014E3019j00299n4012N2063M952L7499M8639Q9391K8530j0495k4586k694q7467
6002C4540o5876M9972j6045M0420J1296k2096p2679N039j6016k8606M5427L6619
5990A995K0683q3165N3387K9025n2804J9334K4177J0877k382n7963q5054J5469
$$ plain form
6074 68524 81880 87751 42579 31491 93303 68404 20978 -8551 -39878 -81411 -23301 58481
6062 58481 46802 44587 23519 -69625 -45382 -78979 -62015 -34602 16587 98261 41942 21646
6050 21646 81892 120384 142486 111704 57555 10495 9257 30426 -3449 -62615 -52337 -4564
6038 -4564 8824 -30779 -9581 16331 80038 132343 92957 -15147 -62951 -72405 25622 102835
6026 102835 75261 56004 29527 13854 1211 32146 -19042 -31108 -536 28588 58049 53019
6014 53019 -47280 -101292 -49229 -44277 -6778 41861 131252 159782 149287 124701 122007 34540
6002 34540 -31336 18636 2591 43011 54307 32211 -40468 -35429 -51445 -80051 -34624 1995
5990 1995 22678 -60487 -7100 21925 -30879 -11545 12632 23509 21127 -36836 -121890 -106421
5978a06421Q0976P8249j8081m2561l1330m179j619K2744Q2155j1039o6492J2332
5966e266K759N0588M5097k3198q2570n7908J0760m015k432P307l9734n3262N2594
5953i9280K7821J2243j8284P365K622j6804j9761N6769L5716Q595N736k9495l131
5940b9888J2403l417m4313N4215P9952J4647j05183j2297J4101k4397R0473q818
5928C7478n0575m3793J8375P1595k3977l5506k9087K9002m763k5096J2578P61
5916d3008K1905L430J0109M9374K553m8898k8337l658n0585J62O7122j343k5766
5903d6940k116m572j3085k7158N7537P9395O0607L0458L8l7644p9904K7278N076
5890D8970l62j381m3259n7489n0245K7934O2516Q4940J4206k9399K3244j7106
$$ plain form
5978 -106421 -25445 52804 34723 -7838 -39168 -43347 -44966 -22222 59933 48894 -17598 -5266
5966 -5266 -2507 48081 93178 69980 -12590 -70498 -59738 -63753 -66185 -58878 -98612 -151874 -99280
5953 -99280 -71459 -59216 -77500 -70135 -67513 -84317 -104078 -47309 -11593 -2998 2738 -26757 -29888
5940 -29888 -17485 -20902 -65215 -11000 68952 83599 -21584 -33881 -19780 -44177 46296 37478
5928 37478 -13097 -56890 -38515 33080 9103 -26403 -55490 -26488 -31251 -56347 -43769 -43008
5916 -43008 -21103 -17673 -7564 41810 44363 -4535 -32872 -36530 -87115 -86953 -19831 -21174 -46940
5903 -46940 -49056 -53628 -66713 -93871 -36334 43061 103668 134126 134164 96520 16616 43894 48970
5890 48970 48608 47227 3968 -53521 -103766 -75832 -13316 71624 85830 56431 79675 62569
5878F2569q0705K7336J6415J8047j1105k1064m9253n5384j4409N279K9431J165
5866g1678k1089J1254L2146P1477l7700n0683L4029L0745K1548k6107j02449j3163
5854a21670K7196j9575R5165J38198N519m9819j3228J665m8656j5569L5969J3236
5842D8431k1727j595l7829J0124P9396N9084m2595n3161j0715j5771p4315L5819
5830b4854M5470p9490m4395N9703M5106J3320m4660m5702J01820O7525j8423k4913
5818E0507q685K1714q076k7426m4426r9056j6682P7275J476P918N0514j0999j6587
5805b2533o8740K4932K9807q707m7108K4908L7188N0594r921r7923k3354J3882
5793i6975K9368R417N4324L1335q7423l6050J5196k2328N0449J7354k452k9566
$$ plain form
5878 62569 -18136 9200 25615 43662 32557 11493 -37760 -93144 -107553 -102274 -72843 -71678
5866 -71678 -92767 -81513 -49367 22110 -15590 -66273 -32244 -1499 20049 -6058 -108507 -121670
5854 -121670 -94474 -114049 -18884 119314 124833 75014 61786 63451 14795 -774 35195 48431
5842 48431 26704 25109 -12720 -2596 76800 135884 93289 40128 29413 13642 -60673 -24854
5830 -24854 20616 -58874 -103269 -43566 1540 14860 -29800 -75502 26318 93843 75420 50507
5818 50507 41822 63536 55460 28034 -16392 -115448 -132130 -54855 -53379 -45461 5053 -5946 -22533
5805 -22533 -91273 -66341 -36534 -45241 -92349 -67441 -30253 20341 10420 -87503 -110857 -96975
5793 -96975 -67607 -58190 -3866 27469 -59954 -96004 -80808 -103136 -52687 -35333 -37785 -67351
5781f7351R402M0109J2157m523k6010j4693j8039N3933m48m6722k8115Q5970L24
5768d006J1651Q8513K5566o7020m7773q7225p5187J1905M2270R5611R261R170
5756A2736M6931p3692k6021J5885R3805K8372r5656r4164L3710P995J8150M2362
5744A0413m231m2091N4627L5382J7974n3225k4670q89k1509j9048l8393k3303
5732a08963j3226J2974M294p765j5278n7755N2526O1725j4749M1269J0072j362
5720c6238n2690n7861J3050O1093l372L6971m6971j0516O9619K6405l1683J1288
5708b0905q190K5871J0818Q048J8508L333J6378k986l5010p0654K7559K1927p4352
5695g9655N815m3691p3196L0547K1007L9012Q3242O1138N581k9581K9693K9346
$$ plain form
5781 -67351 -57949 -17840 -5683 -10206 -36216 -50909 -68948 -15015 -15463 -62185 -90300 -4330 -4006
5768 -4006 7645 96158 121724 54704 6931 -80294 -155481 -143576 -101306 -5695 3566 12736
5756 12736 59667 -14025 -40046 -24161 69644 98016 2360 -91804 -58094 -50099 -31949 10413
5744 10413 6182 -35909 18718 54100 72074 18849 -5821 -6710 -28219 -47267 -85660 -108963
5732 -108963 -122189 -109215 -104921 -112686 -127964 -185719 -133193 -71468 -86217 -44948 -34876 -36238
5720 -36238 -88928 -146789 -133739 -72646 -76018 -39047 -86018 -96534 -26915 -510 -32193 -20905
5708 -20905 -29095 -3224 7594 15642 34150 37483 53861 50875 15865 -54789 -27230 -5303 -79655
5695 -79655 -73840 -117531 -190727 -160180 -139173 -100161 -16919 44219 49800 20219 49912 79258
5683G9258l8149k3835J8301j2472q673K8372K9691o451m2472o9105r522L8110
5671a6947N5099j7281r4754J3773O9985K2613m7264j1976K6226j1405P5366M6790
5659A10225l5637l1438n4837j3892m482m0288j057L9240Q1186K1436n9033j7531
5647f108J0590J8162j1100l6627n7028P701L3794j0209L1771L4658m6292R969
5635b0719n7908l2220O899L4547P6237J6409j8724p6024L8338L7433J1309q1694
5623f6117j6787K668L0124K8802L3103k5545j2458M1768K8863M253J7733O4087
5611A30494M0561J8969l7562o0664m6931j26235j03408O6931K8651k0257K9886
5600g9565J0674n2688j2104P3326Q6916M3365R990n5382o3145J1074J1609L7593
$$ plain form
5683 79258 41109 17274 35575 23103 14430 42802 72493 66042 23570 -45535 -55057 -16947
5671 -16947 38152 20871 -73883 -60110 9875 32488 -14776 -26752 -526 -11931 63435 110225
5659 110225 74588 43150 -11687 -25579 -30061 -70349 -71406 -32166 49020 70456 11423 -6108
5647 -6108 4482 22644 11544 -25083 -82111 -74410 -40616 -50825 -19054 15604 -30688 -20719
5635 -20719 -78627 -110847 -103948 -69401 6836 23245 4521 -71503 -33165 4268 15577 -66117
5623 -66117 -82904 -80236 -50112 -21310 11793 -13752 -26210 15558 44421 48674 66407 130494
5611 130494 171055 190024 152462 91798 44867 -81368 -184776 -117845 -89194 -109451 -79565
5600 -79565 -68891 -121579 -133683 -60357 26559 69924 79914 24532 -38613 -27539 -15930 21663
5588B1663K2530K2477m2004q8598p3136J3635Q1402M1577L7596j6738r3511J2668
5576f0439Q7656P9078K718l4160p0245j5302K3598l5018n4625l5933M9281J7793
5564d5598M6990Q3668m7491P8555l2507o7090k2331l0601J8223L9485J7356p142
5552C1517J7652M9826o3607n2553j5964L209N5712M4481K8688n2179R1l3211l2706
5539a9044n0153n067L0978J9837k3910o9008m6513M6896P8930N5616o589M140
5527A6113R1977M5606l9556j66884j01474Q733R4651j2244p7321L5233R1311K1558
5515G703L1692J5127p1042o5629Q4428O2921j6291M8125L4474m0567k0481K9742
5503A00202L3682J9242Q0822M0626j25884o6680M0166M0150Q4479J06288J64375
$$ plain form
5588 21663 44193 66670 24666 -63932 -137068 -123433 -42031 -454 37142 20404 -73107 -60439
5576 -60439 27217 106295 109013 74853 4608 -10694 12904 -22114 -76739 -112672 -63391 -45598
5564 -45598 1392 85060 37569 116124 83617 16527 -5804 -36405 -18182 21303 38659 31517
5552 31517 49169 98995 35388 -17165 -33129 -29920 25792 70273 98961 46782 46873 13662 -19044
5539 -19044 -69197 -74264 -43286 -23449 -47359 -116367 -162880 -115984 -37054 18562 11973 16113
5527 16113 108090 153696 114140 -52744 -154218 -145485 -50834 -63078 -140399 -105166 -13855 7703
5515 7703 39395 54522 -16520 -82149 2279 65200 48909 97034 131508 90941 70460 100202
5503 100202 133884 153126 233948 274574 148690 82010 122176 162326 246805 353093 517468
5492E17468J91489L76128M74164M73442L54900K4031j60657l26938n07829l13151
5482A103047j90247j95987q2592r9158o3287l6535k5893p6572j38649q648m1235
5471A44244p2495n248n849k0228k0030l580M3663J2644L5047K892m6371R703l9592
5458C4800r57k2012k8197r485O792P1591L4976l0715n7448m4358j3751O3014Q5857
5445I0107L6826o751l5016K5192J03240k2272r0784n9339K8263J4557j6603j6678
5433E0742n0286m966M6485N4940j8229L4561l3737J1315K4221n4373J5302M812
5421H0787m2443o9934j5796m33M2276k5458j4034O7037j9312j1447R404j9253
5409a8606L368J1339K4617R555m3086K3652K0947J9278o7165K6288K3187L598
$$ plain form
5492 517468 708957 1085085 1559249 2032691 2387591 2411622 2250965 1924027 1416198 1103047
5482 1103047 912800 716813 634221 535063 471776 435241 409348 332776 194127 185479 144244
5471 144244 71749 66501 60652 40424 20394 16814 60477 73121 108168 111060 64689 74392 34800
5458 34800 33843 11831 -16366 -25851 -19059 52532 87508 56793 -655 -45013 -58764 4250 90107
5445 90107 126933 120182 85166 110358 213598 191326 100542 41203 69466 84023 67420 50742
5433 50742 456 -4510 41975 96915 78686 113247 79510 90825 115046 60673 75975 80787
5421 80787 38344 -31590 -47386 -47819 -5543 -31001 -45035 22002 2690 -8757 647 -18606
5409 -18606 -15238 -3899 20718 30273 -12813 10839 31786 51064 -16101 10187 33374 36972
5397C6972O4268L291m523J8230j18483M635L9266O136k1182P2391O83r0421M9046
5384F0309L4214k0636l8114p1314m0648M785l1570L1624L9815P4344m280L5025
5372G3554O1345M1804L656n7484J2062m120N716j3710j7925j6716J0751M3798
5360A42731N2327J8219l8684n2144j31409K2671M7274n3469l6438k6827k6321
5349h2070N6432O1398J21581N2584p5479M947K1642o1230p7382j7385Q2428O5523
5337A52989J352k8159k0002k635K3534P4241Q7335j5788M9276M8741L8227K7286
5325D36397q9793j78392j23802o0470j6018M2831L5932k5309m3165l6525m2469
5314a00783M6036K5634q684K2647n9406K9030P5843K4092o919q1284n0005K7473
$$ plain form
5397 36972 101240 104531 100008 118238 -245 4390 43656 49792 28610 101001 101684 11263 60309
5384 60309 94523 73887 35773 -35541 -76189 -71404 -102974 -71350 -31535 42809 38529 73554
5372 73554 134899 176703 180359 122875 134937 130817 136533 122823 104898 88182 98933 142731
5360 142731 195058 213277 174593 122449 -8960 13711 60985 7516 -28922 -55749 -82070
5349 -82070 -25638 35760 157341 209925 134446 139393 161035 99805 22423 5038 87466 152989
5337 152989 154341 126182 106180 103545 127079 201320 288655 272867 322143 370884 409111 436397
5325 436397 346604 168212 44410 -16060 -32078 10753 46685 21376 -21789 -58314 -100783
5314 -100783 -54747 -29113 -37797 -15150 -74556 -45526 30317 54409 47490 -33794 -83799 -56326
5302e6326O6584J056o2911k5449M6154O538R854P948M7179Q3720P085k2371K1559
5289A30620p852j1720j3563j4337M5367Q5559n5095M4898j0237l149N45j8118
5277A72918j07730j29198J6747Q9187j2147j5748M1203m6934n9991j5692Q806
5266e8579J10849J21838M3715l0670q1502p4047L9846J0876k5147k3605k120P8760
5254A10214K7184K304j0036m2495l8521n7793M3398J05104j044l4286J5045M0243
5242A59317R238j7810j0781M2093K3523n9918k2082K9813M9758Q536R653O2632
5230B83972L6640J605p600l7815j08277o6156n2190J3880J4367L5874N1571N5565
5218B21436J02724o086j5728L6561R7516J13193m154J3214K9799R665J5531M6454
$$ plain form
5302 -56326 10258 11314 -51597 -77046 -30892 -24354 -14500 -6552 40627 124347 131432 109061 130620
5289 130620 122768 111048 97485 83148 128515 214074 158979 203877 193640 190491 191036 172918
5277 172918 65188 -64010 -47263 41924 29777 14029 55232 8298 -51693 -67385 -58579
5266 -58579 52270 174108 217823 187153 105651 31604 71450 82326 57179 33574 31454 110214
5254 110214 137398 139702 129666 87171 48650 -9143 34255 139359 138315 104029 119074 159317
5242 159317 168555 150745 139964 182057 205580 145662 123580 153393 203151 211687 221340 283972
5230 283972 320612 322217 314617 276802 168525 102369 50179 64059 78426 114300 165871 221436
5218 221436 324160 318074 302346 338907 436423 549616 545462 558676 588475 598140 613671 660125
5206F60125P0817J40292N1865m3451l03433k89478k65109j85819k14899r4090
5196d73180l3125L2036L6358P7693Q2337N4162P9737K8509R712l819M8429p2178
5184a33329q1960J921K5892M6519N2743L6874Q462j6356l9460O516K4995m2076
5172a09259o1348j9K3839O0654Q3829J31222J13497K9581j1069j2052n0479n7138
5160A41258o5985o8637l2551q024L0006N0848Q6589J73756N6588o363L1662P33
5148C89880n6300K1407O5689J4334l1080J1164K5549m1092j13215n5741l6601
5137A93994O891J25197J54462J09771m0276j26401j56155q8966o1555N9439O5188
5126B41589J9113J27181L7803L2947J34586K9194l0082l682Q0577Q8738J1349
$$ plain form
5206 660125 730942 871234 923099 879648 576215 286737 21628 -164191 -379090 -473180
5196 -473180 -506305 -474269 -437911 -360218 -277881 -223719 -143982 -115473 -105761 -109580 -61151 -133329
5184 -133329 -215289 -213368 -187476 -140957 -88214 -51340 -42878 -59234 -98694 -92178 -67183 -109259
5172 -109259 -170607 -170626 -146787 -86133 -2304 128918 242415 271996 260927 248875 198396 141258
5160 141258 75273 6636 -25915 -33939 -3933 46915 133504 307260 363848 357485 389147 389880
5148 389880 333580 354987 420676 435010 403930 415094 440643 399551 286336 230595 193994
5137 193994 200885 326082 480544 590315 550039 423638 267483 178517 116962 176401 241589
5126 241589 260702 387883 425686 458633 593219 622413 592331 588649 669226 757964 769313
5115G69313K2702N2214l7051k6667N4355R2964J5868k3979Q3849J7227J20945
5104A141740L27930N75594R51495J330204J445936J202231J223784Q23480l8875
5095H983519r3394M11969N82541N70215Q53199J163241J414380K066091L198942
5086A9150703M162928M517640N340681P430320J1074089J7257198K8537225M8621888
5078A46092672Q3686427J30925017J32959829L7794933l3124892n6431791r5038790
5071C46863405j06530815p5908515m5914694k8262914j8136511j2073399r082926
5064E0953631p317444n916411n045445m524154l933045l173285k166979j400246
5056A7476622j017726m94298L7995J45374j28912j64676j41392p83893j030993
$$ plain form
5115 769313 792015 844229 807178 780511 834866 927830 943698 919719 1003568 1020795 1141740
5104 1141740 1469670 2045264 2996759 4326963 5772899 6975130 8198914 9022394 8983519
5095 8983519 8890125 9302094 9884635 10454850 11308049 12471290 13885670 15951761 19150703
5086 19150703 23313631 27831271 33171952 40602272 51676361 68933559 97470784 146092672
5078 146092672 229779099 360704116 493663945 531458878 498333986 441902195 346863405
5071 346863405 240332590 164424075 118509381 90246467 72109956 60036557 50953631
5064 50953631 43636187 37719776 32674331 28150177 24217132 21043847 18876868 17476622
5056 17476622 16458896 15964598 16002593 16147967 16019055 15854379 15712987 14929094 13898101
5047A3898101j091949j228155j173187j105040r22066p52261o13354m19593l60848
5038F231648l06516l31868l75543l48397l08697k65653j61855j44419j16100j30203
5028C742397j83634q3524J4432l7809r2358o0096l563l6215o5738j75824k09280
5017B808788k30225j76771p9970k0445r6321m8603p9168j51431r2835p4842j10078
5006A648099j25602r0339l9821l8482n2961K9990j26399j59181l6023M3746L3921
4995A086948J02433J38115K016m0388n3760l7042k6317j05158j62936n7709N8691
4984I04893N6190r2546k0330m4637k3043J09497Q2561J8191j0772r1097m9894
4973H39013Q0516K5445q7872Q524J8952q3652l3270j826L0765q225K5076l4287
$$ plain form
5047 13898101 12806152 11577997 10404810 9299770 8377704 7625443 7012089 6592496 6231648
5038 6231648 5925132 5593264 5217721 4869324 4560627 4294974 4133119 3988700 3872600 3742397
5028 3742397 3558763 3475239 3489671 3451862 3359504 3299408 3295845 3259630 3193892 3018068 2808788
5017 2808788 2578563 2401792 2321822 2301377 2205056 2156453 2077285 1925854 1833019 1758177 1648099
5006 1648099 1522497 1432158 1392337 1353855 1300894 1330884 1204485 1045304 1009281 1053027 1086948
4995 1086948 1189381 1327496 1329512 1289124 1235364 1198322 1172005 1066847 903911 846202 904893
4984 904893 961083 868537 848207 803570 780527 890024 972585 990776 980004 888907 839013
4973 839013 919529 944974 857102 865626 884578 800926 767656 765830 796595 788370 813446 779159
4961G79159O7503P0358J11858R090L9169L6750n0804j1398n9876N2296O3608q2335
4949A025378p7142k62748l42763k68262r8986k9539K325K0549k402j581n0778
4938h5949l3728J2664K8274K152Q4399J06731J12634O7178k5937m4780P321M552
4926B35511N1264J30994J4200j33128L1017M6162l5228n3886O857M168l0935L398
4914B70394l3225K8708P6572n5106o2077m5699O0771K1123O7880J4374n0364l7843
4902B55508n0550L142k0718k8730J0691M6885L2798J4659J0067m1575n1250q819
4890A72108n4385k691M2765j0638R61J3294K7615N7639L8248l793K6729K8517
4878C36369m6052m3080P0770k3712p2776J3777n7509k2035l6135L7456K8838P387
$$ plain form
4961 779159 846662 917020 1028878 1037968 1077137 1113887 1063083 1051685 991809 1044105 1107713 1025378
4949 1025378 948236 685488 342725 74463 -24523 -54062 -51737 -31188 -33590 -35171 -85949
4938 -85949 -119677 -107013 -78739 -76587 7812 114543 227177 294355 268418 223638 230959 235511
4926 235511 286775 417769 431969 298841 329858 376020 340792 286906 293763 297931 266996 270394
4914 270394 237169 265877 342449 287343 225266 179567 240338 261461 329341 343715 293351 255508
4902 255508 204958 208100 187382 158652 169343 216228 249026 263685 273752 232177 180927 172108
4890 172108 117723 115032 157797 147159 148120 161414 189029 246668 284916 281123 307852 336369
4878 336369 290317 247237 318007 294295 221519 235296 177787 155752 119617 157073 185911 193298
4866A93298L1256q196J7968K7423l2278o041p1800j0469k3676L2958O6624K1589
4854B38656K8421q874O381j9197l0897O8685L6949k8875l2249O1915j3137K4711
4842C32489m912m2199q167o4120O1332j4378K8314M3376P4087k6329j5724o8616
4830B95153R790P574K0883j2642m137m5558k3144m1213l1823Q725M655M6646J14250
4817C49159J01755k0966j03091o0003O3095k3936m7793l5416Q5892P3041p7762
4806C03975j4490K9935p0693m5253o105K306l865M4521K3403L4060l8283k2404
4794B37107l4875k8198K4105O0752Q8460q831p8461j8038k7407k3070n7215q9963
4782D4366j8446P858Q4566P5214n0842j2891K8047J984r1965J2759M6335O6713
$$ plain form
4866 193298 224554 216358 234326 261749 229471 223430 151630 141161 117485 150443 217067 238656
4854 238656 267077 258203 264584 245387 214490 283175 320124 291249 259000 320915 307778 332489
4842 332489 327577 285378 277211 213091 274423 260045 288359 331735 405822 379493 363769 295153
4830 295153 304943 312517 333400 320758 316621 271063 247919 206706 174883 183608 188263 234909 349159
4817 349159 450914 429948 326857 266854 329949 306013 258220 222804 308696 381737 303975
4806 303975 289485 319420 248727 203474 197369 199675 195810 240331 263734 297794 259511 237107
4794 237107 202232 174034 198139 258891 347351 338520 260059 242021 214614 191544 134329 44366
4782 44366 25920 33778 118344 193558 142716 129825 157872 159856 67891 80650 126985 193698
4770A93698M7937J17p2048n0160j5838J3297J0029K207J3665k6013k4679p4486
4758A7726k6244k0355K7306R1566K181m6783l3252N8852R4323m7076p462J5656
4746A26438j8072L8053j5959L8323l0657j1974J0995P9639P9848l7922o6095m235
4734A88382M8l5087J3826Q0813P6771O1549j9714o0341o6795J1403k0963M2148
4722B72040L0279j5758o5824k5407j7247R418O94o072r322n7753p7324l8504K7344
4709B6564K3499L6647L1808N3474L4922l838M4726K3357L0690J5369o8296p7400
4697A71522N1354J6705k6182j9358m2536r946K464M1239O3560j4952r559r684
4685B14627j1946p401J3436L5317K3357J17007P8567p592j34609j58462j8706
$$ plain form
4770 193698 241635 241752 169704 119544 103706 117003 127032 129239 142904 116891 92212 17726
4758 17726 -8518 -28873 -1567 89999 92180 45397 12145 70997 165320 118244 110782 126438
4746 126438 108366 146419 130460 168783 138126 126152 137147 216786 296634 258712 192617 188382
4734 188382 188430 153343 167169 247982 324753 386302 366588 306247 239452 250855 229892 272040
4722 272040 302319 286561 220737 195330 178083 187501 188195 182123 172801 115048 37724 -780 26564
4709 26564 50063 86710 118518 171992 206914 203076 247802 271159 301849 317218 248922 171522
4697 171522 222876 239581 213399 194041 151505 141559 144023 185262 248822 233870 224311 214627
4685 214627 202681 195280 208716 244033 267390 384397 462964 455372 320763 162301 143595
4674A43595M681M167K9921L3949M7057J1097N3648L6165J2523Q8338J02048J44664
4662G11853J57829K77216L70891N70887N37395J84253j15064k12454l99303m76081
4652A607422l47331k51770k78224j32336n9624k6439l9290m0861p7761r489M3518
4641C87815k6339J0471M9482m1634q8840q2229j5316K435J01780L8423k4704k8442
4629B82902k8401p816J4048K460j2396j8611r3283l3029M5879O6733J4167L2246
4617B64899J8320L6362m7743l1788o492l7237J3854M5307N1680N7926o828o2010
4605B96250Q417K8536N1488k6241l265j01416n8798l4451L2146N6592n863j1081
4593B32314O551r43p0748k1980P205O4291k17K1919N003j7475k505K837j913m1691
$$ plain form
4674 143595 148276 152443 182364 216313 263370 274467 328115 364280 376803 465141 567189 711853
4662 711853 869682 1146898 1517789 2088676 2626071 2810324 2695260 2482806 2083503 1607422
4652 1607422 1260091 1008321 730097 597761 538137 511698 472408 431547 353786 344297 387815
4641 387815 361476 371947 421429 379795 290955 208726 193410 195845 297625 336048 311344 282902
4629 282902 254501 246685 260733 263193 250797 232186 138903 105874 151753 218486 232653 264899
4617 264899 283219 319581 271838 240050 233558 196321 210175 255482 307162 365088 358260 296250
4605 296250 304667 333203 384691 358450 355185 253769 194971 160520 192666 249258 243395 232314
4593 232314 238865 237922 167174 145194 152399 216690 216473 238392 243395 225920 223415 226252 224339 182648
4579A82648q893j0171j601M8001M3733M0975J9933q7736j1898O6157J0494l3603
4567B58039J0483K2048o3951K998L3753O3611J7468L171r030j0983R165M6548
4555C83320n061m94J585J1779o629q1255j8965N0921K6329L0449K7226m5677l1456
4542C42072l6985O2928M8895n1865j10275r3521n7232Q6783R5262O5450K8328
4531C79840L4996k0712m5438m1033J7993N1300R0000P84k4871m1471k9998L0755
4519D02145R4927j9672o9573l5334o0337l197l5202o953M1293M2349R0889J9226
4507D60561m2434l0961k6479N1857k6628n0315K7182Q739P078N6881k136J0345
4495D43690M0725r5894n1848P4473N906k4957j03035K8172K2911K9114O4267N5003
$$ plain form
4579 182648 173755 163584 161983 209984 253717 294692 314625 226889 214991 281148 291642 258039
4567 258039 268522 290570 226619 229617 263370 326981 344449 347620 338590 327607 336772 383320
4555 383320 378259 377765 379350 391129 384500 303245 284280 335201 361530 391979 419205 373528 342072
4542 342072 305087 368015 416910 365045 254770 161249 104017 190800 286062 351512 379840
4531 379840 414836 394124 348686 307653 325646 376946 466946 467730 442859 401388 371390 402145
4519 402145 497072 477400 407827 372493 312156 308959 273757 266804 308097 350446 441335 460561
4507 460561 418127 387166 360687 412544 385916 335601 362783 371522 378600 435481 433345 443690
4495 443690 484415 388521 336673 411146 417052 392095 289060 317232 340143 369257 433524 488527
4483D88527J5851P0366k9142j94425j43105k305N3707O656L3744K2469K5511k2103
4471C25751J0814k6110O2058M9703m5945J0602J4420q478p81L0460K9157K8194
4459D79845k4210J4770K4632K2952p166m7381n6118k6018N2329L14L4529M5908
4447E14386n3064k4371N5562m0514m5608J3292P8741J3593l8893n2900j8445K8061
4435D29840M3064n6414l5862J1962n9499p3067M3376J18289J0052k7889K7513
4424D31365O2381n8871m6535p0648R114O0513k1613l1458K2022P4971R9739l189
4412E27791m4030l4345k936K9344N4399R9311j750r5835p0292o179K7240K5370
4400E08088J6289O414j0171J0504J2620r3753K5765J7613k5368k3038j4582l298
$$ plain form
4483 488527 504378 574744 545602 351177 208072 205767 259474 266130 299874 322343 347854 325751
4471 325751 336565 310455 372513 422216 376271 386873 401293 392815 392034 422494 451651 479845
4459 479845 455635 470405 495037 517989 510823 463442 407324 381306 433635 433949 468478 514386
4447 514386 461322 436951 492513 451999 406391 419683 498424 512017 473124 420224 401779 429840
4435 429840 472904 416490 380628 392590 333091 260024 303400 421689 431741 403852 431365
4424 431365 493746 434875 388340 317692 326806 387319 365706 334248 356270 431241 530980 527791
4412 527791 483761 449416 446480 475824 530223 629534 627784 531949 461657 455478 482718 508088
4400 508088 524377 530791 520620 531124 543744 449991 475756 493369 468001 444963 430381 427083
4388D27083K6919P795J32101L2390o3103n0411K3738l0489n9428M5629N8645M8899
4376E99768n839m0877K7164K0323m0366p8749o310L2101M0467J7919K9682Q3835
4364F79118R333j4975O2486L0534k3943j3987j7445J6511j7101n0301K4470p104
4352F77596j4975r5292r665J37145J1193r1019N4657O0918J3709J0351m870m7092
4340G02656m9022N4964p71j8066M49L120Q02j7819J7203l470M4303J2672l187
4327G43834k0044M3055k3431q4891J3117K5494R4093J15583R39K8960o4729K605
4315H74585O8961j5405K649n5554j11202J3854J10995k0736o8618K6536p954o387
4303H11724R2987P0724p628J2663M135M4706m2806j02625k9072L4344n0335n4382
$$ plain form
4388 427083 454002 461797 593898 626288 563185 512774 536512 506023 446595 492224 550869 599768
4376 599768 593929 553052 580216 600539 560173 481424 475114 507215 547682 565601 595283 679118
4364 679118 688451 673476 735962 766496 742553 728566 711121 727632 710531 660230 684700 677596
4352 677596 662621 567329 557664 694809 706002 614983 669640 730558 744267 754618 749748 702656
4340 702656 653634 708598 707827 689761 690210 693330 694132 676313 693516 690046 734349 747021 743834
4327 743834 723790 766845 743414 658523 671640 697134 791227 906810 907749 936709 871980 874585
4315 874585 943546 928141 930790 875236 764034 777888 888883 868147 799529 826065 818111 811724
4303 811724 904711 975435 967807 980470 984605 1029311 986505 883880 854808 889152 838817 784435
4291G84435j1075n162J01242O2101J01523N4178j08578k1033O4673N1859m895
4280A069268j0537J120k9911l2445L2999P911P3397r5160o6178L5485O0240M557
4268A050746M5190Q3219o2757m1298R1303n9168k2660K8202k6670L1030k123L4497
4256A149511R3352j2856M7737L7502J5255m457m5992k0428L5909K6556j5376J3863
4244A320576j5463n6591K3187R9446N2754j5074o4243o550L1449O2173K5722j2946
4232A444440K0103N0708p1353j2061O2819M321L9814O8409J6879r289m6341p7509
4220A490940k746N7540P3687J084l0964J2415L4631Q0372J6694j3192j4522k0327
4208A685612m2792k0552O6418R9013P1114L6163k3517M1425N5731k9389L9232
$$ plain form
4291 784435 773360 768198 869440 931541 1033064 1087242 978664 957631 1022304 1074163 1069268
4280 1069268 1058731 1059851 1029940 997495 1030494 1038405 1111802 1016642 950464 985949 1046189 1050746
4268 1050746 1095936 1179155 1116398 1075100 1166403 1107235 1084575 1112777 1086107 1117137 1115014 1149511
4256 1149511 1242863 1230007 1277744 1315246 1330501 1326044 1280052 1259624 1295533 1322089 1306713 1320576
4244 1320576 1305113 1248522 1271709 1371155 1423909 1408835 1344592 1338042 1369491 1431664 1457386 1444440
4232 1444440 1464543 1515251 1443898 1431837 1494656 1498977 1538791 1607200 1624079 1614790 1568449 1490940
4220 1490940 1488194 1545734 1619421 1620505 1589541 1601956 1636587 1716959 1733653 1720461 1705939 1685612
4208 1685612 1642820 1622268 1688686 1787699 1858813 1894976 1871459 1912884 1968615 1939226 1978458
4197A978458P6497o3246J431M8259L7933j9486j837M0325M1619L4155K0050o9932
4185B124226P996K189L8348J7880K3533K3735k1900N6613m9k9059J00118Q3860
4173B427490o808N5064L8216K2290k4999J368K294J5162J2573J4472P3523J63238
4161B793883J38818P216n5920R154P4677J450N2688Q364J3415P3312Q0370K7077
4149C224504J468k8288P333N4584N5065K1969L3872j6109J17498Q3824M3137J01751
4137C700608J30785L110m0026J5048J5407K2123J5538M5196Q0816j1124J298M0107
4125D018886J08774N8096R2085J07921l718J41733Q8372P5891Q023J2129k7387
4114D680805L9529M6702K2920Q3877M2418N6393J14241J04632J61753J61366K9880
$$ plain form
4197 1978458 2054955 1991709 1993140 2041399 2079332 2059846 2058009 2098334 2139953 2174108 2194158 2124226
4185 2124226 2132222 2134411 2172759 2190639 2214172 2237907 2216007 2272620 2272571 2243512 2343630 2427490
4173 2427490 2420682 2475746 2513962 2536252 2511253 2512621 2514915 2530077 2542650 2557122 2630645 2793883
4161 2793883 2932701 2939917 2883997 2893151 2967828 2969278 3021966 3030330 3043745 3117057 3197427 3224504
4149 3224504 3225972 3197684 3205017 3259601 3314666 3336635 3370507 3354398 3471896 3555720 3598857 3700608
4137 3700608 3831393 3834503 3794477 3809525 3824932 3847055 3862593 3907789 3988605 3977481 3978779 4018886
4125 4018886 4127660 4185756 4277841 4385762 4382044 4523777 4612149 4688040 4696063 4708192 4680805
4114 4680805 4720334 4767036 4789956 4873833 4916251 4972644 5086885 5191517 5353270 5514636 5544516
4103E544516P9762R7867K9579R4743J14820Q7018M3914M1310J01976J17840J17265
4092F470610J37687J22398R0457N2133J35289R1713P3535J27011J13609P3442
4082G487884R8936J36582N5440J68801J51135J31360M9848N6178J20760J19924
4072H576848J95468K13698J46281P7358M8256J10929J03944J11113J19319R0068
4062I793282J27383J50419J19687J22508J28046J56485J67355J72041J93486J43192
4052A1273884J27239J33796J73880J33696J28444J37422J32901P6089J08864J58535
4042A2584750J12992J54627J55113J57032J06123J58596J87225J46444J01722
4033A3864624J42582Q4940L6179J23156J04399O4476J01428J39160O5876N2407
$$ plain form
4103 5544516 5624278 5722145 5751724 5846467 5961287 6048305 6092219 6133529 6235505 6353345 6470610
4092 6470610 6608297 6730695 6821152 6873285 7008574 7100287 7173822 7300833 7414442 7487884
4082 7487884 7586820 7723402 7778842 7947643 8098778 8230138 8279986 8336164 8456924 8576848
4072 8576848 8772316 8986014 9132295 9209653 9257909 9368838 9472782 9583895 9703214 9793282
4062 9793282 9920665 10071084 10190771 10313279 10441325 10597810 10765165 10937206 11130692 11273884
4052 11273884 11401123 11534919 11708799 11842495 11970939 12108361 12241262 12317351 12426215 12584750
4042 12584750 12697742 12852369 13007482 13164514 13270637 13429233 13616458 13762902 13864624
4033 13864624 14007206 14092146 14128325 14251481 14355880 14420356 14521784 14660944 14726820 14779227
4023A4779227J42751J59829R4440K6928L3479O5139Q1357P8781P9630j0303j2598
4012A5518660j0368l673K6079Q1357j323j0338p2170Q64j03779j3887k646n9347
4000A5349429j8215q1178r600m6858p4098r0426j80310r9007k4578l6723q0199
3989A4608237j12495q1954j83850j28145j61312j24383l6347j11501q9688j26794
3979A3451768j63360j83309j21130r6125m1422j80451j73797j19017q2564j55069
3969A2135524k03911k08586j70124j45641q8419j27668j58290o8120q5520j49427
3959A0729818j32363j6896q9311j55908j93374j58382j85871j50448j53055j75390
3949I318820k7508J0935q1627j62587j44160j60155j58733j49740j35717j04022
$$ plain form
4023 14779227 14921978 15081807 15176247 15203175 15236654 15301793 15383150 15461931 15541561 15531258 15518660
4012 15518660 15508292 15504619 15530698 15612055 15610732 15600394 15528224 15529088 15425309 15411422 15408776 15349429
4000 15349429 15331214 15250036 15240436 15193578 15119480 15029054 14848744 14749737 14725159 14688436 14608237
3989 14608237 14495742 14413788 14229938 14101793 13940481 13816098 13779751 13668250 13578562 13451768
3979 13451768 13288408 13105099 12983969 12887844 12846422 12665971 12492174 12373157 12290593 12135524
3969 12135524 11931613 11723027 11552903 11407262 11318843 11191175 11032885 10964765 10879245 10729818
3959 10729818 10597455 10580559 10491248 10335340 10141966 9983584 9797713 9647265 9494210 9318820
3949 9318820 9291312 9302247 9220620 9058033 8913873 8753718 8594985 8445245 8309528 8205506
3939H205506j00150q5649q9815j08212j02201j28805k9718j09631j70407r8775
3929G182143j17756p8366p7102p6696j52792j34226o7596p2539j16877j03503
3919F184690o5630j30376p5990j22526o2537k734n8659j20112j71336j44177l6936
3908E193677n4458m2452q3889J044n283m6079p7186o4219n5555l0395o5774j02700
3896D566731n1292m9200o2091l5115m5810l5155k3430m0082j3384k2341p2419
3885D116412j11725q1950j2540j7524k7142q4992o7698j01527r0535q0608p4313
3874C365858p4761m4359m0459l874k4227K7332j0379n4086j7887j1816k3930k7153
3862C060259l8609k2425k7832n3747M761j01238j28212n2371J6437j7024p9606
$$ plain form
3939 8205506 8105356 8019707 7929892 7821680 7719479 7590674 7560956 7451325 7280918 7182143
3929 7182143 7064387 6986021 6908919 6832223 6679431 6545205 6477609 6405070 6288193 6184690
3919 6184690 6119060 5988684 5912694 5790168 5727631 5724897 5666238 5546126 5374790 5230613 5193677
3908 5193677 5139219 5096767 5012878 5013922 5008639 4962560 4885374 4821155 4765600 4735205 4669431 4566731
3896 4566731 4515439 4466239 4404148 4369033 4323223 4288068 4264638 4224556 4211172 4188831 4116412
3885 4116412 4004687 3922737 3910197 3892673 3865531 3780539 3712841 3611314 3520779 3440171 3365858
3874 3365858 3291097 3246738 3206279 3202405 3178178 3205510 3195131 3141045 3123158 3111342 3087412 3060259
3862 3060259 3021650 2999225 2971393 2917646 2922407 2821169 2692957 2640586 2657023 2639999 2560393
3851B560393o3890J3283P3906O0974m2561l7319l3915r8518m3274r4004m0688
3840B254387M7193J4084m140n749N0267o3959r6390p5936M076L3971n7266k2565
3828B077973K742j7784o8890L2600K5856j8552q3534n3486L574p1901q0079l9939
3816A708580j3159N0241Q1282K1289k7582o7636p8875M674J6728K0300L4881j8724
3804A731999k9903K7972m253l5116r2164r0686N0922O6296l6705k0121k6768m399
3792A537074p1814l5003L0360N709q1889n0925j814K9411L8053j1739K5567n8400
3780A354590J9624K0123K1316j889o7423l3009l3767j2422M0979k3278m0334j2326
3768A232184j4428m49m6178l0358l7573K1474j4843N2829M1680P0768n6941o3267
$$ plain form
3851 2560393 2496503 2509786 2583692 2644666 2602105 2564786 2530871 2432353 2389079 2295075 2254387
3840 2254387 2301580 2315664 2311524 2305775 2356042 2292083 2195693 2119757 2123833 2157804 2100538 2077973
3828 2077973 2080715 2062931 1994041 2026641 2052497 2033945 1950411 1896925 1900499 1828598 1748519 1708580
3816 1708580 1695421 1745662 1826944 1848233 1820651 1753015 1674140 1678814 1695542 1715842 1750723 1731999
3804 1731999 1702096 1730068 1725815 1690699 1598535 1507849 1558771 1625067 1588362 1568241 1541473 1537074
3792 1537074 1465260 1430257 1460617 1466326 1384437 1333512 1331698 1361109 1399162 1387423 1412990 1354590
3780 1354590 1374214 1394337 1415653 1413764 1346341 1313332 1279565 1267143 1308122 1284844 1244510 1232184
3768 1232184 1217756 1217307 1171129 1140771 1103198 1124672 1109829 1162658 1204338 1275106 1218165 1154898
3756A154898m2580j11586N726j2843M0348O3758j4471n1609J5943J7485r845m6717
3744A008507J0031K634J8659k5289j1612r5053l0033K9342O8694O4350n5649j3962
3732I70619m9337p1034l0425P0748J2962j6632m133p3222k2365k916M0676M914
3720H29855m1721J0182k25Q3961J5466j2553j06314m4083J1432j0036q9344J0145
3708F56765P8665J13156L0811m2043l4634p998j04021j9234N4374J4215K872K6469
3696G69397P805k6089j18899j1306P7436j1127P3288J0326l6175p634N961N5119
3684G88102j8747r5052m4081m0613K4195J9851M7740Q136p4118l2094p3823j0047
3672D99449P3108O9749p0904l4554J7425K8664j6860l3533P712K8137r3419j5342
$$ plain form
3756 1154898 1112318 1000732 1006458 993615 1033963 1097721 1083250 1031641 1047584 1065069 1055224 1008507
3744 1008507 1018538 1021172 1039831 1014542 1002930 907877 877844 907186 975880 1040230 984581 970619
3732 970619 921282 850248 819823 890571 903533 886901 882768 809546 787181 784265 824941 829855
3720 829855 788134 798316 798091 882052 897518 884965 778651 734568 746000 735964 646620 656765
3708 656765 735430 848586 879397 837354 802720 794722 690701 671467 725841 740056 742928 769397
3696 769397 777202 751113 632214 620908 698344 687217 760505 770831 734656 727022 732983 788102
3684 788102 769355 674303 630222 589609 613804 633655 681395 689531 615413 583319 509496 499449
3672 499449 572557 642306 571402 536848 554273 582937 566077 532544 540256 568393 474974 459632
3660D59632M0421O8482q1153o0047O1710N9391J7986m253J4142n4248j1059L7220
3648E48224N8464K6064N1210p127o6606k0273j4920o5210N1531M289l4596P6465
3636F07515n547o6082q7766m0617O0106n8610n8357N7781O5252M6462k4856k3742
3624D71539l3051j5017j517j5869K1856M8640k5101j711k2726p2145N840K3194
3612C83932M7723L0943l169j12282k8529J7591Q1986m7549J989L8955n7490m0769
3600C13331P1349n23M5475K061o6370o7129m2362P9213M7043O02k332j3476J5970
3587C82852P906j9041J6412K8954l2114q854j2872k3474M1200K5868n1141m4756
3575C10940p632q857J5185L5674N4230N377p3899o5604M7059k400M0376O144j0642
$$ plain form
3660 459632 500053 568535 487382 427335 489045 548436 566422 562169 576311 522063 511004 548224
3648 548224 606688 632752 683962 676835 610229 589956 575036 509826 561357 565646 531050 607515
3636 607515 601968 535886 448120 407503 467609 408999 350642 408423 473675 520137 495281 471539
3624 471539 438488 423471 421954 406085 427941 476581 451480 449769 427043 354898 360738 383932
3612 383932 431655 462598 459429 347147 318618 336209 418195 370646 372635 411590 354100 313331
3600 313331 384680 384157 429632 431693 365323 298194 255832 335045 382088 382690 380358 366882 382852
3587 382852 390758 371717 388129 417083 384969 376115 363243 339769 380969 406837 355696 310940
3575 310940 303308 294451 309636 345310 399540 404917 331018 265414 312473 310073 350449 356593 345951
3562C45951N309k3011K4027m9390k1500m8148j3708R737K9767m92Q5031M3838
3550C87411l1774k3676R27l083M2010k75l6618j53729m4854P342K50N9388P344
3537B10663p8299K8385N4202N2406p695M573q62M0587k02K2553L9000m9758k271
3524C13282P0255P472m0849j8563m0747k9047j0995L1605K6237k2412p7543k4588
3512A84107K2467O896M2937M4206q003m3532j5669L3726M767l915Q230M4618k9114
3499B91721o5548m1916j6156O1761N3659o042l4381L0682P6130O1960J1964J6513
3487D40347P0894N6291r1611n3252j1803M0963L4457R68O3295J4474J32526O6158
3475G63707j3161j786m0944o4435q9211k3574K0365N980Q8619J68216J28953J64029
$$ plain form
3562 345951 351260 328249 352276 302886 281386 233238 219530 229267 259034 258542 343573 387411
3550 387411 355637 331961 332888 329805 371815 371540 334922 181193 136339 143681 143931 203319 210663
3537 210663 132364 160749 214951 267357 259662 264235 263373 303960 303758 326311 365311 315553 313282
3524 313282 383537 391009 350160 331597 290850 261803 250808 282413 308650 286238 208695 184107
3512 184107 206574 213470 256407 300613 292610 249078 233409 267135 271902 267987 276217 320835 291721
3499 291721 226173 184257 168101 229862 283521 277479 243098 273780 349910 411870 423834 440347
3487 440347 511241 567532 475921 422669 410866 451829 486286 487254 550549 565023 697549 763707
3475 763707 750546 748760 707816 643381 554170 530596 550961 556941 645560 813776 942729 1106758
3463A106758Q2217J15o1716j20475j53129j43711q2321j1633L071N4766J06554
3452G80496J06337L0823o6564l2782r1415o6538j02547q2415q8686P4935L9263
3441E00907M0311J5318L3558m9239p1343l7350q9383p715J9367k358m5710j4151
3429B92212l8788m8342n7590L0412r236O965K8693q1446n3489P0302P0419o3783
3417A46329K790L0074L4717j5308j1712M240p459m9296j0796r555k846p408M7872
3404A51642m474l6001J2892q9571j1138M6099J0472k7379M1451k030m8044o8107
3392b4188O86j9028K0100Q3863O8721m0548M563N8853j1470j7294m3627J2788
3380I3419L4222o784k1687j8624N8353J9051k6112n9963L6865M1616K769q6730
$$ plain form
3463 1106758 1188975 1189090 1127374 1006899 853770 710059 627738 616105 619176 673942 780496
3452 780496 886833 917656 851092 818310 726895 660357 557810 475395 386709 461644 500907
3441 500907 541218 556536 590094 540855 469512 432162 342779 335064 354431 352073 306363 292212
3429 292212 253424 205082 147492 177904 168668 175633 204326 122880 69391 139693 210112 146329
3417 146329 149119 179193 213910 198602 186890 191130 183671 134375 123579 114024 111178 103770 151642
3404 151642 147168 111167 124059 34488 23350 69449 79921 52542 93993 91963 43919 -24188
3392 -24188 -23502 -42530 -22430 61433 130154 89606 94169 153022 141552 124258 80631 93419
3380 93419 127641 120857 99170 80546 138899 157950 131838 71875 108740 150356 153125 66395
3368F6395l1065N0322L5491N3282N2248j2419k3290m2095k0970K7027k2956R178
3356A41148M3276L2862j7714l4638J9781P7408M0302l7329q7343j1641j2864l1051
3344A22197k7340K3048J400k9206j8105M1392M8213o4151P960P0605n254n2930
3332A17829N0198R0199k9069p4447m102j588l5198N2286k8617P911l7703q3436
3320B4263L4205j660k6262M8842K6143Q8315M4612M7774k6993o9539J2359n1746
3308A50313j28725l671N3463J4933k3732N9019J8667n957M3549J17321P8748p6123
3296B97805j23391o4378k3108J5099L4894L582K3660M8978m3730p2474m2969L4026
3284H7994l3821p1687q854M3778Q223l0508k3431j8321N6068L9409K5855O0189
$$ plain form
3368 66395 35330 85652 121143 174425 226673 214254 190964 148869 127899 154926 131970 141148
3356 141148 184424 217286 199572 164934 184715 262123 302425 265096 177753 166112 153248 122197
3344 122197 94857 117905 119305 90099 71994 113386 161599 97448 105408 176013 170759 117829
3332 117829 168027 258226 229157 154710 150608 149020 113822 166108 137491 145402 107699 24263
3320 24263 58468 56808 30546 79388 105531 193846 238458 286232 259239 189700 202059 150313
3308 150313 21588 17917 71380 86313 62581 121600 140267 134310 177859 295180 373928 297805
3296 297805 174414 110036 86928 102027 136921 140503 164163 213141 169411 96937 53968 87994
3284 87994 54173 -17514 -26368 17410 25633 -4875 -28306 -46627 9441 48850 74705 134894
3272A34894k5385m679m554J4506m967j5680k4295L0025N7555N0139k6404k1127
3260A60028m2144n5648o2109K7698j8158K2838l2001m5972l4130L9359J21833
3249H1594j9261p3146r3110J9199N5338P2568R3586K0656k2236K0862l3220Q728
3237A31558r724r61J8616m8618m5463K5767N0819N7751j7464j0018p7023k8933
3225D6307Q7857O7869K2505K2780M9924Q9979K8450J1238J2579J0583m5602j24487
3213B79982j9572l5749M3196Q8509J30969J98261K09808N8494j02661j36413j59041
3202E55783j16556k3227J8400J039M0806J11030K29821L26816J43029q8748p0901
3191A127292j67563j65116m2877q0068n4836O2562R1993J17543J00242P2445o9826
$$ plain form
3272 134894 109509 104830 100276 114782 109815 94135 69840 99865 157420 207559 181155 160028
3260 160028 117884 62236 127 27825 9667 32505 504 -45468 -79598 -40239 81594
3249 81594 62333 -10813 -103923 -84724 -29386 43182 136768 157424 135188 156050 122830 131558
3237 131558 121834 120873 139489 90871 45408 71175 121994 179745 162281 152263 75240 46307
3225 46307 134164 202033 224538 247318 297242 387221 415671 426909 439488 450071 404469 279982
3213 279982 260410 224661 267857 356366 487335 685596 895404 953898 851237 714824 555783
3202 555783 439227 416000 434400 435439 476245 587275 817096 1143912 1286941 1198193 1127292
3191 1127292 959729 794613 751736 671668 616832 679394 771387 888930 989172 1061617 991791
3180I91791j13629p3663j26920o1005l0768j2942l5753l0225J1260l9560J8437
3169D97023k3843J8310j8038k4663n4074m5330K461K5066k3018r9675p4105n8952
3157A21162n8469m0663l0417Q5870K6780j0626K1082o9661m0395l8056o8144p577
3145a09114L3577R321K1832K5934n7324p8394K9223M709N4945n9521l3033L1317
3133a26528k8147j51051k4647J28917P6797K2462J1884J3715r440N2054k5161
3122e9145p908o0748n7403Q3253M3810M5570K1553L8132k4390j5504l8831N9912
3110B8301J24468N7155K9035Q291o79J2133M3908Q2006Q9496J28171J31493K12105
3098I45883L02503N17275J010604J870528L003453J792851o59087q73697j442755
$$ plain form
3180 991791 878162 804499 677579 616574 585806 572864 537111 506886 518146 478586 497023
3169 497023 473180 491490 473452 448789 394715 349385 351846 376912 353894 254219 180114 121162
3157 121162 62693 22030 -8387 77483 104263 93637 114719 45058 4663 -33393 -101537 -109114
3145 -109114 -75537 -66216 -44384 -18450 -75774 -154168 -124945 -120236 -65291 -124812 -157845 -126528
3133 -126528 -154675 -305726 -330373 -201456 -124659 -102197 -90313 -76598 -86038 -33984 -59145
3122 -59145 -67053 -127801 -185204 -101951 -58141 -12571 8982 47114 22724 7220 -31611 28301
3110 28301 152769 209924 238959 247250 246571 258704 302612 384618 474114 602285 733778 945883
3098 945883 1248386 1765661 2776265 4646793 7650246 9443097 8784010 7910313 6467558
3089F467558k112091j524781q36876n80172l37365r4900K1374P6719J06279K7001
3079A212746J19133L49988M80197L58984J01084N0571O3399J25015J79454M02142
3069C442713N33409O49609R44632J484672K271945L309024M714488P344434J0756517
3060C5451443J2378696Q293684J681223k275576n333958p210305n393709j754358
3052C5837140K001772O443192J2769370K1098128K5989462J7047068J389499p006718
3044A15568913j3257876j7690775j4505441p167028J24396P656916J7106088K8876716
3036A16711909L6296662K4149582M35657j2616686k1568472k8682526k4967544
3029H9758582j5564348o991274L74527P933977J6698759K2471237J5105742j173863
$$ plain form
3089 6467558 4355467 2830686 1993810 1413638 1076273 981373 1002747 1079466 1185745 1212746
3079 1212746 1331879 1681867 2162064 2521048 2622132 2672703 2736102 2861117 3040571 3442713
3069 3442713 3976122 4625731 5570363 7055035 9326980 12636004 17350492 24694926 35451443
3060 35451443 47830139 56123823 57805046 55529470 50195512 42985207 37591498 35837140
3052 35837140 37838912 44282104 57051474 78149602 104139064 121186132 122575631 115568913
3044 115568913 102311037 84620262 70114821 62947793 63072189 70729105 87835193 116711909
3036 116711909 153008571 177158153 177593810 164977124 143408652 114726126 89758582
3029 89758582 74194234 67202960 67577487 75511464 92210223 114681460 129787202 128613339
3021A28613339j0360928j6091290k0978599j8683869j2043815o151830j631391
3014D2671617K378576O392719Q926477O019155j050141n669332q445557j0521887
3006D0701627r808276p149622m679847l184616k222289j654857j307808r58382
2998I735930q40725p18858o44840m95437m80684n21391m17419k82465l62815k98964
2988D672332k86464k46920j37656j59740j98338q5128j01335j23598j61843j07093
2978C064217j74335j50232j12156j19124j19503o5244k4308j39499q3522l7593
2968B038701j38881j64597p1844l4633L0174n1950j47842j33913k7189K0256k9348
2957A288934l5826L4513M3634n5210r3806j52874m7706P981j4750k8933o0962
$$ plain form
3021 128613339 118252411 102161121 81182522 62498653 50454838 44303008 42671617
3014 42671617 45050193 51442912 60369389 66388544 65338403 59669071 51223514 40701627
3006 40701627 30893351 23743729 19063882 15879266 13656977 12002120 10694312 9735930
2998 9735930 8895205 8176347 7531507 7036070 6555386 6033995 5616576 5334111 4971296 4672332
2988 4672332 4385868 4138948 4001292 3841552 3643214 3558086 3456751 3333153 3171310 3064217
2978 3064217 2889882 2739650 2627494 2508370 2388867 2323623 2299315 2159816 2076294 2038701
2968 2038701 1899820 1735223 1663379 1628746 1658920 1606970 1459128 1325215 1298026 1318282 1288934
2957 1288934 1253108 1287621 1331255 1276045 1182239 1029365 981659 989640 974890 945957 884995
2946H84995K3732J09r305L6465L2110N233l021n4899p9618k9445L8325K8029n7916
2933H14794k6014r3616J5973J0396N4461l8104p323l3339l342N3902L6845j7660
2921G66973m0155j7543j4067P9097J9466l5667k7098l931p7540n7896k3032l8306
2909E30301J719m197n0497k2271L1342K4520P363j8255n9834q230O4113k2640
2897D73434q9328q3378K0903L8201N0890J8158q6068p5299J2151q9274j29837
2886F0553j9501p0887L990K2069J5461J08067M1947N55j8477j06387n1255J8100
2874D235m5303k8895N6023J860K2638k1058l1226K1828J417K5628l3626J9574
2862f905N4157l4455j1875L8269p1550q926O8979M8959m8841L7044N6455L6472
$$ plain form
2946 884995 908727 908836 899531 935996 968106 973339 970318 915419 835801 806356 844681 872710 814794
2933 814794 788780 695164 711137 721533 775994 737890 730567 697228 693886 747788 784633 766973
2921 766973 726818 709275 695208 774305 793771 758104 731006 727075 649535 591639 568607 530301
2909 530301 532020 527823 477326 455055 486397 510917 518280 500025 440191 431961 496074 473434
2897 473434 384106 300728 321631 359832 410722 428880 342812 267513 279664 190390 60553
2886 60553 41052 -29835 -25845 -3776 11685 119752 161699 162254 143777 37390 -13865 4235
2874 4235 -41068 -69963 -13940 -12080 10558 -10500 -41726 -19898 -18481 7147 -26479 -6905
2862 -6905 47252 12797 922 39191 -32359 -41285 27694 76653 27812 64856 121311 157783
2850A57783l8745L3663M4805j4396l6572j9820K3580L1264J7174M1469Q8226N8004
2838C86435K8053M6210J18847J24666J62835K85502K75931N22768J183617K202506
2828E337370L000399J060926p71810q35269j533288k072468j464522q97335m70839
2819A353164k40778k12226j21187o1214K3576Q0883J00310K07569K63939K93945
2809A687981K64723K87426Q6513j13456j34582j23021m3718J18751L84398N35821
2799B950836P09740R44351J180819J439748J747666K568743M365717P569196J2983771
2790C6460587J6940878J0267610l52560l834587p303638j0434316p749374l294972
2782C0699628O63191M983003J1273104K1423449L3091491K7535819K625716q837060
$$ plain form
2850 157783 119038 152701 197506 183110 146538 126718 150298 181562 198736 240205 328431 386435
2838 386435 414488 460698 579545 704211 867046 1152548 1428479 1951247 3134864 5337370
2828 5337370 8337769 9398695 8626885 7791616 6258328 4185860 2721338 1824003 1353164
2819 1353164 1112386 900160 778973 717759 741335 822218 922528 1130097 1394036 1687981
2809 1687981 1952704 2240130 2326643 2213187 2078605 1955584 1911866 2030617 2415015 2950836
2799 2950836 3660576 4604927 5785746 7225494 8973160 11541903 15907620 23476816 36460587
2790 36460587 53401465 63669075 63316515 59481928 52178290 41743974 33994600 30699628
2782 30699628 31362819 36345822 47618926 69042375 102133866 129669685 132295401 123458341
2774A23458341j4003452k2987062k1019014j1399924k986339M051710J2727721
2767F7841981K5913795M3421616M6559065J3698200j2271094j9507225l2534421
2760A33121917l6539963k4722613j2492590m136304K974888J1732628K3499932
2753I3437895L1775176J6304371o745640j3221739k0119063k6586298k0545007
2746E4299695j1419223n254288r66160L279783Q653191J3726605J0614702j092637
2738G1841668o594147r146788j3135047j2211055p892591m663953k976274k035852
2730A3185961j519243j204599r57374q40150p63055o50681n66153m89986l59644
2721E835076k87106l66301l84413k51773j79052k12312k06419j25093o4056j47603
$$ plain form
2774 123458341 109454889 86467827 65448813 54048889 51062550 55114260 67841981
2767 67841981 93755776 137177392 183736457 197434657 185163563 165656338 133121917
2760 133121917 96581954 71859341 59366751 55230447 58205335 69937963 93437895
2753 93437895 125213071 141517442 134771802 121550063 101431000 74844702 54299695
2746 54299695 42880472 37626184 36660024 39939807 48592998 62319603 72934305 71841668
2738 71841668 65247521 56100733 42965686 30754631 22862040 18198087 15221813 13185961
2730 13185961 11666718 10462119 9504745 8664595 7901540 7250859 6684706 6194720 5835076
2721 5835076 5547970 5181669 4797256 4545483 4366431 4154119 3947700 3822607 3758551 3610948
2711C610948j09880j35073j13864j38361k02239j82366j31513j11773p1792J2095
2701B426182j51677j12893j20294p7884K6186j4013n2093j22995p7477R991Q963
2690A741996n7927r2553o4052r2613n4453o722l0193o2190K8534k166n5309k683
2678A249669k3087K462o8932l4550m1923j02090p6528P0367J5121L9707k5096
2667A005120j8239J6809j7357l0544j8811l2400o6822m978k0718K2418Q510M471
2655H47459O9685M3641l7121Q535p0719p9079j10164o1242K4196j7122j1727j6177
2643E90165M6561O0084n4556l412l8058o5131j05260r7852j8915Q130K0330K4895
2631C66981N6609O2943M6046j0017m1206q436q600J2633n1189l1746M5977Q273
$$ plain form
2711 3610948 3501068 3365995 3252131 3113770 2911531 2729165 2597652 2485879 2414087 2426182
2701 2426182 2274505 2161612 2041318 1963434 1989620 1975607 1923514 1800519 1723042 1733033 1741996
2690 1741996 1684069 1591516 1527464 1434851 1380398 1373676 1343483 1281293 1309827 1307661 1252352 1249669
2678 1249669 1226582 1229044 1160112 1125562 1083639 981549 905021 975388 990509 1030216 1005120
2667 1005120 986881 1003690 986333 955789 936978 904578 837756 832778 812060 834478 842988 847459
2655 847459 917144 960785 923664 932199 861480 782401 672237 610995 635191 618069 606342 590165
2643 590165 636726 696810 642254 638842 600784 535653 430393 332541 313626 321756 342086 366981
2631 366981 423590 486533 532579 522562 481356 472920 464320 476953 425764 394018 439995 448268
2619D48268n5751L2726N8382J3286L3609L827L0297J11501R6728M092n6687q735
2607G11543j15673j16963j2636o058K9703J40722J85661J66896R5646k3779l7048
2596A018014l6965j09746j15718n6561k1937n890M892O0601J74223J19819m9863
2585I80869o1884q0640j27511j34517o8190L980l8629K0483L8705P0834L6934
2574F40434r6833m8610k680l9745L2250l3535r4269o7704M9368Q444j6658k7095
2562C03367j4627n926m5159p9496K602Q9175O9046L0481n6755n9402P018J8076
2550B58400J0500L9014L5226o9712K539m9532j085o982n2636Q0407o934k3114
2538B16091l3847n7499j4101N8276J08831N6262K4178k4055J9511m0653q7337
$$ plain form
2619 448268 392517 425243 483625 496911 530520 534347 564644 676145 772873 776965 720278 711543
2607 711543 595870 478907 466271 460213 489916 630638 816299 983195 1078841 1055062 1018014
2596 1018014 981049 871303 755585 699024 677087 671197 676089 736690 910913 1030732 980869
2585 980869 918985 838345 710834 576317 508127 512107 473478 493961 532666 603500 640434
2574 640434 543601 494991 492311 452566 484816 451281 357012 289308 338676 347120 330462 303367
2562 303367 288740 282814 237655 158159 160761 249936 318982 349463 292708 233306 240324 258400
2550 258400 268900 307914 343140 273428 275967 226435 225350 218368 165732 246139 239205 216091
2538 216091 182244 124745 110644 168920 277751 334013 358191 334136 353647 312994 225657
2527B25657K1068J2445o3365J5475K4561L1304r404m7732M3308K3889J9841j4915
2515B82132m8063O457m4504n6806K2617M1759O1557l5048m0028Q333Q4166K0999
2503C03571j00000o8697k9964N8989J6895j8993j7796Q7732N7100l258M071r6735
2491A92915m3629K2256N5341j9766k7133O025L2280k3856r996n2177l5947P0184
2479A66497J868l106J0744N6427J8604K5224j71n3715m8299j614o3288m7048l9857
2466B2266j4729Q388N4856O2095L6301K5476k214q1389k5880l0734L939n5643
2454B732j9625P2871K0282m6308J7388K989l6567L5550r234L6727j5963j4844
2442D5998J6937M094P2930P6591o9722j7982n8049k7921O0349O3663O5837k7204
$$ plain form
2527 225657 246725 259170 195805 211280 235841 267145 257741 210009 253317 277206 297047 282132
2515 282132 234069 240526 196022 139216 161833 203592 265149 230101 190073 198406 282572 303571
2503 303571 203571 134874 104910 163899 180794 161801 144005 231737 288837 285579 289650 192915
2491 192915 149286 171542 226883 207117 179984 186009 218289 194433 184437 132260 96313 166497
2479 166497 168365 165259 176003 232430 251034 276258 276087 222372 174073 172459 109171 62123 22266
2466 22266 7537 15925 70781 132876 169177 194653 192439 111050 85170 54436 58375 2732
2454 2732 -16893 55978 76260 29952 47340 50329 13762 49312 40078 76805 60842 45998
2442 45998 62935 67029 139959 216550 146828 128846 70797 42876 103225 166888 232725 205521
2430B05521j525o5513n4131m2671j236L1711J00699L7590m362l6223l8878M7331
2418A78313m558q8699k4185M4918N4610N4841K282M720j4410k3540Q2586J5696
2406B82574n6187j31787n8888K4579M8041K1683j2258o7560M821L0057k4150L4144
2394I5069k7025j0594L6815K3738L3714Q2298L79P461O6840l8147q3760P359m3385
2381A50762l4685J0662j2205L353m743K130K6998K6685k718p2465l1678R166j2458
2368E8804J2177L4243R962L154M3687k4438K153J6347l2117j1151N1896N3755
2356B18472J0228m8569K8602J40785J23654m4873j50320j7878L1702l312R1562
2345C80053J1955N861M2131J22880J77799J25224l8101n0150j36977k33257j03441
$$ plain form
2430 205521 203996 138483 84352 41681 40445 72156 172855 210445 206083 169860 130982 178313
2418 178313 173755 85056 60871 105789 160399 215240 217522 222242 207832 184292 266878 282574
2406 282574 226387 94600 35712 60291 108332 130015 117757 50197 55018 85075 60925 95069
2394 95069 68044 57450 94265 118003 151717 234015 234394 241855 308695 270548 186788 194147 150762
2381 150762 116077 126739 114534 117887 113144 115274 142272 168957 166239 93774 62096 71262 58804
2368 58804 70981 105224 115186 118340 162027 137589 139742 156089 123972 112821 164717 218472
2356 218472 228700 180131 208733 349518 473172 428299 277979 260101 291803 288491 380053
2345 380053 392008 397869 440000 562880 740679 865903 827802 777652 640675 407418 303977
2334C03977K5996k0900J22382J11204P6097J43840J74882J36853r951j6078j75780
2323H72522k29568j09661j0519K286K2062J5660J01080J31402L0396l3347k3321
2312G68992j11411j59151j19292m6651p5100n7973P9639Q6880M8148j3473j3138
2301C87470L1752j1892o5304p2251k9135l7638l3419l264L9656l9306j2014N691
2289A60346q683m9479m0213m4038M2663K8097J2558J6747K109l7892j4541o0423
2277G251J6119P821N7071P0029j8214J9271o1149m0683q075M2864J32997j9770
2265B05532n2269K1463j8221j5411J9471k5934m3547j6125k8619o6034K8701Q2313
2253I1320K3704k1047J9039K968j7825l6566O7750P5758O7897l1173j18962p8394
$$ plain form
2334 303977 329973 309073 431455 542659 618756 762596 937478 1074331 1064380 1048302 872522
2323 872522 642954 533293 522774 525060 547122 562782 663862 795264 825660 792313 768992
2312 768992 657581 498430 379138 332487 257387 199414 279053 365933 414081 400608 387470
2301 387470 419222 407330 342026 269775 240640 203002 169583 166319 205975 166669 154655 160346
2289 160346 151663 102184 61971 17933 60596 88693 101251 117998 120107 82215 67674 7251
2277 7251 23370 31191 88262 158291 140077 159348 98199 57516 49441 92305 225302 205532
2265 205532 153263 174726 156505 141094 160565 134631 91084 74959 46340 -19694 9007 91320
2253 91320 115024 93977 113016 115984 98159 61593 129343 205101 272998 241825 122863 44469
2241D4469K0481Q278n7545m192L2228J6257Q7611j3839p8001j2564J320K711J6106
2228F3320k4807n7665R3895L4508n105r258J9035j2687j8594m6264o0745K3371
2216i96O2431M9749N519m5183l6985K9708M1088M263J5877J5399r066m0349M5814
2203A37269r715l0993l1892k57R7755p0549J4570r0420q6838L0970L3770L0697
2191B4367R043O4609m437J3510J0403p409n759l2676k2909M2594O8176J222o9752
2178I0982o9540M6193J4780m1038m9723N585N6038Q407R7795j096m5319J7362
2166A30426m6593j2086J6238J3500n2873l0328L2442k468M118P1250m2129j2274
2154F9223j5501J0867l2358J3623J7422n1682m510J504N183K2060M9031M029n3465
$$ plain form
2241 44469 64950 73228 15683 11491 43719 59976 147587 133748 55747 43183 44503 47214 63320
2228 63320 38513 -19152 74743 109251 104146 94888 113923 101236 82642 36378 -24367 -996
2216 -996 61435 111184 116703 71520 34535 64243 105331 109594 125471 140870 131804 91455 137269
2203 137269 127554 96561 64669 64412 162167 91618 106188 15768 -71070 -40100 -6330 24367
2191 24367 33410 98019 93582 107092 117495 110086 104327 71651 48742 91336 159512 160734 90982
2178 90982 21442 67635 82415 41377 -8346 -2761 53277 61684 159479 158383 113064 130426
2166 130426 83833 71747 87985 101485 48612 18284 50726 48258 52376 123626 81497 69223
2154 69223 53722 64589 32231 45854 63276 11594 7084 8588 13771 35831 84862 88891 35426
2141C5426k9293j1424K6967J3124m4228L416J70J5588J0760J9195Q0768K8931
2129A49400J278l0419p9620j4037K0266l0726j1540L0919k2050M4235J7384J3315
2117H8405l7277k9310N5433L6656n113m8535Q6459N709r4378k9359J6064K7452
2105G2206L5588n0558K8486k3549J8929j104l3421l5093R348j3184l4596J5087
2093a1861M1648n1175o0527L4797j1303J7286K4604m805j0467p465k300K8774
2081a2794L7800O0826n0481o7605K8117j6647j9378J8115j5233j4404Q3738J13489
2069A45543J7555J0657p0952r4351J4619O3038l013L9982M3773k5830p2034k5330
2057D3657L7782l9754l3845L209l9518m7166L529P2075k0954J318O1060J378l6833
$$ plain form
2141 35426 6133 -5291 21676 34800 -9428 -6012 -5842 9746 20506 39701 120469 149400
2129 149400 150678 120259 40639 26602 46868 16142 4602 35521 13471 57706 75090 88405
2117 88405 51128 21818 77251 113907 108794 60259 146718 152427 58049 28690 44754 72206
2105 72206 107794 57236 85722 62173 81102 79998 46577 11484 20832 7648 -26948 -11861
2093 -11861 29787 -21388 -81915 -47118 -58421 -41135 -16531 -21336 -31803 -39268 -41568 -12794
2081 -12794 25006 85832 35351 -32254 -4137 -20784 -40162 -22047 -37280 -51684 32054 145543
2069 145543 163098 173755 102803 8452 23071 86109 83096 123078 166851 141021 68987 43657
2057 43657 81439 41685 7840 11049 -28469 -75635 -72106 -31 -20985 -19667 41393 42771 5938
2044E938K2048l0959k8547K3997K736L5942N9810L2602N129l5223l5283m5780
2032A2410O421M1506J9318K3257j7944o1552J05658k740m3479N390l4518o1787
2020h060j408M0610K1511R1780K2582m3380j32971J257K7852O1366j4710m8973
2008A7456q414k724M3886L4148K1261K1151n3534l8891n7895j9450O227k7859
1996f4638K0023J8607P221M2705J9098P238J8970o9312r48N4522J5869j4786J8078
1983G2647J5865J121m1132k937n1911m907N1419O3996k4688m5965M837P8769Q160
1970A25274m7630K5983M336M1410p8785p7686r661K403p8268J9814M3260P3983
1958D4433k7465l2048k8025O7131N1366j8809j5771L1777k3241l9544M2388m449
$$ plain form
2044 5938 27986 -2973 -31520 -7523 -4787 31155 90965 123567 128696 93473 58190 12410
2032 12410 18831 60337 79655 102912 84968 23416 129074 126334 82855 88245 53727 -8060
2020 -8060 -9468 31142 52653 144433 167015 123635 -9336 -8079 19773 81139 66429 17456
2008 17456 9042 6318 50204 84352 105613 126764 73230 34339 -23556 -43006 -36779 -64638
1996 -64638 -44615 -26008 -18787 23918 43016 50254 69224 -88 -1036 53486 69355 54569 72647
1983 72647 88512 89633 48501 45564 -6347 -11254 40165 104161 79473 33508 38345 117114 125274
1970 125274 77644 103627 107963 149373 70588 -7098 -16759 -14356 -92624 -72810 -29550 44433
1958 44433 16968 -15080 -43105 24026 75392 56583 40812 72589 49348 9804 52192 47743
1946D7743m9347j9468J3562L2076P2296J926l9418n9204k2003L885j379k3577
1934d2908J9011m8825o8008Q1928N6294j07919o6625L1363M3342R7800j0054J3723
1922h78L8033O3574N5192K7915k6583m0992l5960n4667k6401r329O129j2551l4447
1909e0965M706O273O0045L1903k0749j4657l3966j2706K3386Q2414j8858l9739
1897A7087J9223l3219m5370J2436O6337M5784m8503r0044o755O5248R143j02023
1885i0656M1975j2658N732k006j9729J04950M5032j17386n3931K4680N5998j0956
1873b8955j744R93Q229K1723p8548l3989o7J19298P1762j6501P327j0979j6080
1860D2469j2730n8188n295O9309L7214o4199M481J9821r6638k9461j9924M7405
$$ plain form
1946 47743 -1604 -21072 -7510 24566 96862 98788 59370 166 -21837 -17952 -19331 -42908
1934 -42908 -23897 -72722 -140730 -58802 -2508 -110427 -177052 -145689 -102347 -4547 -14601 -878
1922 -878 37155 100729 155921 183836 157253 116261 80301 25634 -767 -10096 -3967 -16518 -50965
1909 -50965 -46259 -39986 20059 51962 31213 16556 -17410 -30116 -6730 75684 56826 17087
1897 17087 36310 3091 -42279 -29843 36494 82278 33775 -56269 -63024 2224 11367 -90656
1885 -90656 -48681 -61339 -55607 -57613 -77342 27608 72640 -44746 -98677 -73997 -17999 -28955
1873 -28955 -30699 -29706 -21477 246 -78302 -112291 -112358 6940 78702 62201 69528 58549 42469
1860 42469 29739 -28449 -33744 35565 72779 8580 13061 32882 -63756 -93217 -113141 -65736
1848f5736J0137J6418r044K2337L2243q495l5057M4561k0835l4352j6463n7104
1836a21390R241M9898K2541o846k6298M11L9478R1539K3767K3347p028m6506k4931
1823B7223r215o3601J2679j4650r261N2688p175J9626o788j1011r813l8997r26
1810e9221N8336N6973n2238l7417K2393j154O3736n0776K87P3576j6872n8015
1798c92k0647K160J0597P12K2415O9305J9602k6841p4577m1499n047Q8153O439
1785E0380p7878L4885K580o6754N6285J25657N1259n6253Q850j5222O969l1350
1773H9408m0621J0754n076o9987J9241M6081J9849k9088n4329m0751j8750q6609
1761a59878O859N9318Q698L3439K0450m4662k7947M3509j6936l3233M9940K6000
$$ plain form
1848 -65736 -55599 -39181 -48225 -25888 6355 -2140 -37197 7364 -13471 -47823 -64286 -121390
1836 -121390 -112149 -62251 -39710 -46556 -72854 -72443 -32965 58574 82341 105688 98660 52154 27223
1823 27223 18008 -45593 -32914 -47564 -56825 -4137 -11312 8314 1526 -9485 -19298 -58295 -59221
1810 -59221 -885 56088 3850 -33567 -11174 -12328 51408 632 919 74495 57623 -392
1798 -392 -21039 -18879 -8282 -7570 14845 84150 103752 76911 2334 -39165 -44212 43941 50380
1785 50380 -27498 7387 9967 -56787 -502 125155 176414 120161 129011 113789 120758 89408
1773 89408 48787 59541 54465 -15522 3719 49800 69649 40561 -13768 -54519 -73269 -159878
1761 -159878 -153019 -93701 -85003 -51564 -31114 -75776 -103723 -60214 -77150 -110383 -60443 -34443
1749c4443p5589n903L4609n7353O945P1450M4997L9338m1422k5705k0338k4567
1737h7981J5675K416J43992Q7210j2105L3848j1966N8936M7435K0897J50n6769
1725B41738p7836n6339k2851m7826k987N4710k9644j955O084k511k6598k2256
1713A1729M3001l3804l4889r6851M615J38743j0497l22m9727m877L7123P8161
1701H2405M6433r4238j01271n1656j8592M2496L9107P6786N1843l0299P181J8996
1689F9191j6918K1668k2131m8514k7555L2611J7256m978m518J6782o431j5261
1677A1202j3125k2101j8511o8664o120J9871K1275J5493J0788L1665M9712N4407
1665H5892l6446k9798P1081K0187o1739N9095p1344j7895N8339n6609p1335n0129
$$ plain form
1749 -34443 -110032 -115935 -81326 -138679 -131734 -60284 -15287 24051 -17371 -43076 -63414 -87981
1737 -87981 -72306 -69890 74102 161312 149207 183055 171089 230025 277460 298357 298507 241738
1725 241738 163902 107563 84712 36886 33899 88609 58965 57010 63094 60583 33985 11729
1713 11729 54730 20926 -13963 -110814 -106199 32544 22047 21725 -28002 -32879 4244 82405
1701 82405 128838 34600 -66671 -118327 -136919 -94423 -55316 21470 73313 43014 50195 69191
1689 69191 52273 73941 51810 3296 -24259 8352 25608 20630 16112 32894 26463 11202
1677 11202 -1923 -24024 -42535 -111199 -117319 -97448 -76173 -60680 -49892 -18227 31485 85892
1665 85892 49446 19648 90729 110916 49177 108272 36928 19033 77372 20763 -50572 -100701
1653a00701L6706Q8037M7305k0534o7475J7700L9832p3506q729Q3495K8831n9441
1641A1520M478j2986P4425k0638l5461o2788n8223J5563M798L2722j789k1744
1629g0123M1055N2868o4518m6960o715J5576N4044M1285J9029J8437K0700R14
1617G5592j4712J3350P753k1418k0966r2570n6584J5990Q7465Q5943P392o9245
1605A7990k31L9931J0971l0631n8928M3105R4165j202m4720o0221l436L5659P144
1592D9596K3016j5594n6973k8675l1019N8437M030n227k3869k5706J432n1186
1580a01738l4366k4888L9941K7163M2139L3007l0359j1692O3021O9051K513m0862
1568C2930l2414J6904P067q157O5016o583n1519M8501M8165N06j33113o5070N6276
$$ plain form
1653 -100701 -63995 24042 71347 50813 -16662 1038 40870 -32636 -41365 42130 70961 11520
1641 11520 15998 3012 77437 56799 21338 -41450 -99673 -84110 -79312 -46590 -48379 -70123
1629 -70123 -29068 23800 -40718 -87678 -94393 -78817 -24773 16512 35541 53978 74678 75592
1617 75592 60880 74230 81983 60565 39599 -52971 -109555 -93565 -6100 79843 87235 17990
1605 17990 17759 57690 68661 38030 -20898 22207 116372 115170 70450 10229 6793 42452 49596
1592 49596 72612 57018 45 -28630 -59649 -1212 2818 -2409 -26278 -51984 -50552 -101738
1580 -101738 -136104 -160992 -121051 -93888 -51749 -18742 -49101 -60793 2228 71279 73792 32930
1568 32930 516 17420 24487 16330 81346 74763 23244 71745 119910 120416 -12697 -77767 -21491
1555b1491l3412K851L7839l297j9630k5103J09293J68430Q6915l4507r5678l0096
1543A42114j11912M36J9608m7782j1307M1605k4891O019l9253q513M5386J9237
1531C0747M6095K2435K5822l1894k4760m8834j9110k0955M2718q5071J4981Q6744
1519C8918L0940m5003j3547k3157l4682k6662m8609j2131n676K6816P9935N2093
1507A9235j2740K2022N8142j3458l2716j02090q1054Q237L9635j2246J4334R5618
1495B919M4826l7475l3429N0541M0855k8524n1590q93R539O041k0082l8537j8353
1482g4162K6042m974M8319M2138r922k5645j7867J1292L5871l2707m2946j4841
1470e9402k8074K84l5888j8936J15350P6735L0205L0786k6399J3074j9346j2211
$$ plain form
1555 -21491 -54903 -52052 -14213 -17510 -37140 -62243 47050 215480 302395 267888 172210 142114
1543 142114 30202 30638 50246 2464 -8843 32762 7871 13890 -25363 -33876 11510 30747
1531 30747 76842 99277 125099 93205 68445 19611 501 -20454 22264 -62807 -47826 38918
1519 38918 69858 24855 11308 -11849 -46531 -73193 -121802 -133933 -139609 -112793 -32858 19235
1507 19235 6495 28517 86659 73201 40485 -61605 -142659 -134422 -94787 -107033 -92699 2919
1495 2919 47745 10270 -23159 27382 68237 39713 -11877 -12770 -3231 2810 -17272 -55809 -74162
1482 -74162 -48120 -53094 -4775 37363 27441 1796 -16071 -4779 31092 -1615 -44561 -59402
1470 -59402 -87476 -87192 -123080 -142016 -26666 50069 80274 111060 84661 97735 78389 66178
1458F6178M4537l2939j19500l7693L0406J387n1908k6312K8731K3199L0411l7312
1446h0815L031P8646l2305M4523L5886l7222n9877m5586O4708M8964N2989P151
1434H0093k9718k1981k2430k9116m354M0613L1160j2748L9023j1422m3536K0747
1422C6331N1492n4552l0435l6082m7298k6439Q7465Q10K5089p7315k9603J9627
1410h0910J4565m9094k9438M2796P0968O0179j2380o8812k3931K2472o926j0007
1398g0518K1010l5039m3865K0913k587M8469M748K4642m2460k1439M1047M834
1386e0245J7187m1587L5978P807l9062N2690l7167J0137n602L796L1739L8421
1374B4092R6013p603p1284o1698m966K8662L6346L3616o7783n4666n2508k1587
$$ plain form
1458 66178 110715 77776 -41724 -79417 -49011 -47624 -99532 -125844 -97113 -73914 -43503 -80815
1446 -80815 -77784 862 -31443 13080 48966 11744 -48133 -93719 -29011 19953 72942 80093
1434 80093 50375 28394 5964 -23152 -27506 13107 44267 31519 70542 59120 15584 36331
1422 36331 87823 33271 2836 -33246 -80544 -106983 -19518 -18708 6381 -70934 -100537 -80910
1410 -80910 -66345 -115439 -144877 -102081 -31113 29066 16686 -52126 -76057 -53585 -60511 -70518
1398 -70518 -49508 -84547 -128412 -107499 -110086 -61617 -56869 -32227 -74687 -96126 -55079 -50245
1386 -50245 -33058 -74645 -38667 -30860 -69922 -17232 -54399 -44262 -49864 -46068 -14329 24092
1374 24092 120105 112502 41218 -20480 -25446 3216 39562 73178 5395 -49271 -101779 -123366
1362a23366J05153L8766K2221l5990o5290m831m7115L3984j7564M4082K2368k0764
1350d8346j01674K7757K2249L1286J46488q229q7390J8147J9324j0629J9950m4562
1338a5629n2660R9182J7226p6470l919L2975K2033K4960k553j20912r0036Q2227
1326h3576P0665N3476j4724N7549O343l5243p1361m1536J8714K7403n520q848
1314b6658L3015Q0641N8057K6160k5275o5596k3003l6100j2502j0030n21N9789
1302E7977K1048L5979m5561l1763N396J4472j5321n268N268J2564o6187q914N7759
1289C7449k7926k7454k3774Q1554N1347n8519m0495n1937k8831L0380N6470M863
1277C127M2444J4870m932k0928l4863N0930o5528p0468K8177P1234K1846p0631
$$ plain form
1362 -123366 -18213 20553 42774 6784 -58506 -63337 -110452 -76468 -94032 -49950 -27582 -48346
1350 -48346 -150020 -122263 -100014 -68728 77760 69531 -17859 288 19612 8983 28933 -15629
1338 -15629 -68289 30893 48119 -28351 -32270 705 22738 47698 45145 -75767 -165803 -83576
1326 -83576 -12911 40565 25841 83390 89733 54490 -16871 -58407 -39693 -12290 -17810 -26658
1314 -26658 6357 86998 145055 171215 145940 80344 57341 21241 8739 -1291 -1812 57977
1302 57977 79025 115004 69443 37680 43076 57548 42227 36959 42227 54791 -11396 -20310 37449
1289 37449 9523 -17931 -41705 39849 91196 32677 -7818 -59755 -88586 -58206 -1736 3127
1277 3127 45571 60441 55509 34581 -282 50648 -14880 -85348 -57171 14063 35909 -34722
1265c4722n759L8477O7748l7857k3486m4114j5502k4355j6074M0941O8638K8073
1253D2008L2647L4250p125j00678n3516M5559k2472l5500n7389o3774r2201J6815
1241b61376R2719j3521Q9991P0333J5402n061J6491M7723l6803o6576n3013o9181
1229a72872n681R9008P7785P7425J5882o7236j3295J3487J6451l7200j4694J1386
1217D46N2615p488o3591o3316l4407N9237k7530l913j6303N2757L8576N9649J1148
1204E7880n900m8959M3146M3914m8761q046L9965K0797j7805j23674l4780l003
1192h5226M1002J1832k4496J9153j0344j5303l068k1896K2048K1278K935j3672
1180e5757L0958k1644k3988N1196j851N379K7870j4250K6351k2041o8794Q125
$$ plain form
1265 -34722 -40481 -2004 65744 27887 4401 -39713 -55215 -79570 -95644 -54703 13935 42008
1253 42008 74655 108905 101780 1102 -52414 -6855 -29327 -64827 -122216 -185990 -278191 -261376
1241 -261376 -168657 -182178 -92187 -21854 -6452 -11513 4978 52701 15898 -50678 -103691 -172872
1229 -172872 -178553 -79545 -1760 75665 91547 24311 11016 24503 40954 3754 -10940 446
1217 446 53061 45573 -18018 -81334 -115741 -56504 -84034 -87947 -104250 -51493 -12917 46732 57880
1204 57880 51980 3021 46167 90081 41320 33274 73239 94036 76231 -47443 -82223 -85226
1192 -85226 -44224 -32392 -56888 -37735 -48079 -63382 -66450 -88346 -66298 -45020 -42085 -55757
1180 -55757 -24799 -46443 -70431 -19235 -21086 -15707 12163 -2087 24264 2223 -66571 -58446
1168e8446L4300m2827l058O0303j2910l6522P754J8964n808n0369K197M1798M6594
1155A970K3076J8903n6422m5194m4183J4913M8500P0591n3384o564L3820J4113
1143B0139j4129k1274l467j9791l2566j5440J0336J214J6862N8906L3676M8732
1131H3198R239k920k9377r1179q715j3542p6286j2894M1371J15236L7259m821
1119D6569k197N885J5945M4970j5453n4002l9226j708l3580m570M8227J118o268
1106E710p289J1032j00446P542J16330K9060n1393k3247m483j8161n8583O883
1094h7045L5998J4399k5388K1583m5617L1542L7426j2840J0032l7276k2054r68
1082h0208L1838J5519j0887P1624j9119m2628o993l0281L6026N1788M1690L498
$$ plain form
1168 -58446 -24146 -66973 -70031 -9728 -22638 -59160 -51406 -32442 -38250 -88619 -86422 -44624 1970
1155 1970 25046 43949 -12473 -57667 -101850 -86937 -38437 32154 -21230 -27794 6026 20139
1143 20139 6010 -15264 -18731 -38522 -71088 -86528 -76192 -74978 -58116 790 34466 83198
1131 83198 92437 89517 60140 -31039 -39754 -53296 -129582 -142476 -101105 14131 51390 46569
1119 46569 44372 50257 66202 111172 95719 41717 2491 783 -32797 -37367 10860 11978 5710
1106 5710 -1579 9453 -90993 -83451 32879 61939 10546 -12701 -17184 -35345 -93928 -87045
1094 -87045 -51047 -36648 -62036 -40453 -86070 -54528 -17102 -29942 -19910 -57186 -79240 -80208
1082 -80208 -48370 -32851 -43738 27886 8767 -33861 -40854 -71135 -35109 16679 58369 61867
1070F1867l6359m6855K3257Q429P2657j8206j15901l4262o4857N1579M9625L1129
1058a7897j9577J9680M4670o9647k820P1671k0673k0920m3488n6136l0233P936
1046a37434P4259Q590j2936j3653m054l3504l680J8542m1799K179J0086L8860
1034i4544P6422N1J4834n7838m3282M1959L7129l4821o2475l408O7194N666J9687
1021c3426R056K2370j2538P119l1291M609j6383m7258n8575K0059O8128L1457
1009c6673o8278J7575K4790m7004n2392N2604L6653N984Q5789J9822j7709m244
997A6917l1747J234J5464q342P2812l2213l8182k8193j6361L8762N2447n1298
985h700J885M436R017O950j1915l2126k0792J8301j0747R596J482n3745p495N7004
$$ plain form
1070 61867 25508 -21347 1910 10339 82996 64790 -51111 -85373 -150230 -98651 -49026 -17897
1058 -17897 -37474 -17794 26876 -42771 -45591 26080 5407 -15513 -59001 -115137 -145370 -137434
1046 -137434 -63175 -54585 -67521 -81174 -85228 -118732 -122412 -103870 -145669 -143490 -133404 -94544
1034 -94544 -18122 -18071 -3237 -61075 -104357 -62398 -25269 -60090 -122565 -125973 -58779 -53113 -33426
1021 -33426 -24370 -2000 -14538 -7419 -38710 -34101 -50484 -97742 -156317 -136258 -68130 -36673
1009 -36673 -104951 -87376 -62586 -109590 -161982 -109378 -72725 -66741 19048 38870 21161 16917
997 16917 -14830 -13596 1868 -6474 66338 34125 -4057 -32250 -48611 -9849 42598 -8700
985 -8700 -6815 -2379 6638 13588 1673 -30453 -51245 -32944 -43691 -34095 -32613 -86358 -93853 -36849
971c6849L1273J1820P0370L4125o8066p0049m4898J1735L1506m2347o4260m448
959a40088J4663K5254J0012p345M2487Q0137M5287n7273n7949o9369K2569J1639
947g9976q794L4646m4590L6216L7944L6878p0845l1632J920J1982K5738m3317
935i3830l741J8629k3018O9441O6947N4487k9494o8129n4719O2114O7484j8462
923D7709P996j9572k87m0710k5739m5984n9280M6579P8028K5958l0254N1055M787
910D0286J7991l6328K7799j2674j08620k728k417M6745N7437l0053K5090K7494
898E0022J8293o0769m802k2116m1311P5804P362k9038q9473j5709J4666O7451
886b9620P3433j8584L5466j2773n2463k5147p026R3712j1159k0551J2356n919
$$ plain form
971 -36849 -5576 6244 76614 110739 42673 -27376 -72274 -60539 -29033 -71380 -135640 -140088
959 -140088 -125425 -100171 -90159 -97504 -55017 25120 70407 13134 -44815 -114184 -91615 -79976
947 -79976 -88770 -54124 -98714 -62498 -24554 12324 -58521 -90153 -88233 -76251 -50513 -93830
935 -93830 -97571 -78942 -101960 -32519 34428 88915 59421 -8708 -63427 -1313 66171 47709
923 47709 55705 36133 35846 -4864 -30603 -76587 -135867 -89288 -11260 14698 -15556 35499 40286
910 40286 58277 21949 49748 37074 -71546 -74274 -76691 -29946 27491 -2562 22528 50022
898 50022 68315 7546 2744 -19372 -60683 15121 22483 -6555 -96028 -111737 -97071 -29620
886 -29620 43813 25229 60695 47922 -4541 -29688 -36714 56998 45839 25288 37644 31725
874C1725K5038p6980j00621L013J2035J7845k5287K9192j3393n1210K6835O9067
862e2741l9718j3904Q0086m2745K1833K2639N1770L4574K614m7198J2759j8473
850A1496Q780K8972n171j1799K574o6334r285k7105m1094K4089K418j6093o556
837a05108M2006P999L5552K6678M7321K9841n6752L527l3616L565M7735l0914
825A7834p7061N459L9804O1788K9649l2983j9512L3302n8524o054K8696M3739
813F6137K6269L5279L8116m9747n7555q3996L1411j5343L8385k2461m4088k820
801d0413p1200j7187o18K3030P4780L6399L1748m0077o0434M8790L0873J4740
789C0431q4102l0073K6032P698m5370n0419K9289k0651N3007q932j8428K488R252
$$ plain form
874 31725 56763 -20217 -120838 -117825 -105790 -87945 -113232 -84040 -97433 -148643 -121808 -52741
862 -52741 -92459 -106363 -26277 -69022 -47189 -24550 27220 61794 64408 17210 29969 11496
850 11496 20276 49248 44077 32278 34852 -31482 -40767 -67872 -108966 -84877 -82459 -98552 -105108
837 -105108 -63102 -55103 -19551 7127 54448 84289 27537 31064 -2552 1013 48748 17834
825 17834 -59227 -53768 -13964 47824 77473 44490 24978 58280 -244 -6298 22398 66137
813 66137 92406 127685 165801 116054 58499 -25497 5914 -9429 28956 6495 -37593 -40413
801 -40413 -111613 -128800 -129418 -106388 -31608 4791 36539 -3538 -63972 -15182 15691 30431
789 30431 -53671 -83744 -57712 -50014 -95384 -145803 -116514 -137165 -84158 -93090 -111518 -109030 -99778
776i9778K0998O7543j0436K7201p31p1283N1723L3312m997k5965L6614J8559k8862
763A3898K820r0419l1368j4694j1076J3041Q1735K5087l6767j1727j1119m181
751g4770N5912L784m0987L1481J7143m938J7191R67j1600j9379r6606k2994N9230
738h5566J07387L0117M1774K8759m2754k4342L9541q3955p6201L7355l386j9610
726e0881j9492J6313M4380j0576q9050m3523Q258N6291P412J4767J678K5079P0202
713C0858O3012j8952q1934J4873L798k5925l7910k8650l6481L3387M0144M1169
701b611K8485r972k1762k2763J3025m1297m0525q018P0877Q1201q418j8708L9388
688E8902m2489o8141O488M2354L0664K1262k0110K6272j06731m1894k0912j413
$$ plain form
776 -99778 -78780 -11237 -21673 5528 4797 -66486 -14763 18549 13552 -12413 24201 42760 13898
763 13898 16718 -73701 -105069 -119763 -130839 -117798 -36063 -10976 -47743 -59470 -70589 -74770
751 -74770 -18858 -15074 -56061 -24580 -7437 -12375 4816 5783 -5817 -25196 -121802 -144796 -85566
738 -85566 21821 51938 93712 122471 79717 55375 94916 10961 -65240 -27885 -31271 -50881
726 -50881 -70373 -54060 -9680 -20256 -109306 -152829 -144571 -88280 -80868 -66101 -64423 -39344 30858
713 30858 93870 74918 -7016 7857 11655 -14270 -52180 -80830 -117311 -83924 -43780 -2611
701 -2611 25874 15902 -5860 -28623 -15598 -56895 -97420 -105438 -34561 46640 38222 19514 58902
688 58902 16413 -51728 -45240 -2886 27778 49040 28930 55202 -51529 -93423 -114335 -115748
676a15748k9023j4584P7493M7133k169O8516j0195m6636L3376k8723k1967K0254
664b2273J1218Q5282K10j7736m454l0551m6960q3954p0042O5824O026K5248N6538
651b5624k2648n6902l2877J9825M1413J13798l481o0739p9232l3286M5719J23322
639B9288M4171M4968j10038j08977M220O3858N3531M2903n7717l7894n267L6218
627g36j4658K4102j5224o34J0104P417l2096q913l7000m3993k6282N084m5638
614a78467K6724K7492L6989L5870j0133m836K2225J5548Q514L1006K7487m774
602C3645l3250J285O6641p966J3287j4273J5907k4098o8840m7043K3180P7449
590C5924M6840o4179k6667J333N4385O9932r4736q8245J3153J07688L1096k4967
$$ plain form
676 -115748 -144771 -159355 -81862 -34729 -36898 31618 21423 -25213 8163 -20560 -42527 -22273
664 -22273 -11055 74227 74437 56701 52247 21696 -25264 -109218 -179260 -113436 -107410 -82162 -25624
651 -25624 -48272 -105174 -138051 -118226 -76813 36985 33504 -27235 -106467 -139753 -94034 29288
639 29288 73459 118427 8389 -100588 -96368 -32510 21021 63924 6207 -31687 -36954 -736
627 -736 -15394 8708 -6516 -7150 2954 10371 -21725 -30638 -67638 -111631 -137913 -132829 -178467
614 -178467 -151743 -124251 -87262 -51392 -61525 -66361 -44136 -28588 -20074 10932 38419 33645
602 33645 395 1680 68321 60355 73642 59369 75276 51178 -17662 -64705 -41525 35924
590 35924 82764 18585 -8082 -6749 47636 117568 22832 -65413 -52260 55428 86524 61557
578F1557m1914m9283o1351k3329p665N7097K112R9421L3953m610k9244l2850k0747
565a6853m1262L5100M3811k566m3887M3378p2120m142N5678J2768m348N5402N414
552F6373k2031K081M8310K6954l2061n9610l0844n4462o9617n0819q864M6442
540a38148N9017l5201N924O4790J0671M2472J3943j49847n4934l0324N3098J49052
528i487j201k281q690J0583K1856m929m1551J9372K1710k9693l2767Q216M8317
515e45K7785m0826p0768k1306k1914m0532J1144O8956M7794L4612k1815m5670
503g3085J7453J287J836L0403P021n1269n4221k163r087L1084R169L7988k9781
490h3365L0867L1691k9445j4484l182K8616j4341n516L0261N8013N6480o8961
$$ plain form
578 61557 19643 -29640 -90991 -114320 -121985 -64888 -62776 36645 70598 65988 36744 3894 -16853
565 -16853 -58115 -23015 20796 18230 -25657 17721 -54399 -58541 -2863 9905 5557 60959 66373
552 66373 44342 46423 94733 121687 89626 30016 -828 -55290 -124907 -175726 -184590 -138148
540 -138148 -79131 -114332 -108408 -43618 -32947 9525 23468 -126379 -181313 -211637 -158539 -9487
528 -9487 -10688 -12969 -21659 -11076 10780 5851 -35700 -16328 5382 -24311 -57078 -48862 -545
515 -545 27240 -13586 -84354 -105660 -127574 -168106 -156962 -88006 -40212 -5600 -27415 -73085
503 -73085 -55632 -54345 -52509 -22106 -15085 -66354 -120575 -122738 -131825 -100741 -91572 -53584 -83365
490 -83365 -52498 -20807 -50252 -64736 -67918 -39302 -53643 -59159 -28898 29115 85595 16634
478A6634l2567m332n7503J9359L8517l2702K6808J949n788q137j2403J1033k664
465d1796N7823M14n9805o3464L0221M3024j9189J4716K6502J2558r509K2696K6244
452D0435J1819j1262m992m7943l2763q2930k6417R1594P1065L1312o1J0877N5241
439A05975k2710j0693k293k7458q4301q4481o851N5278K3325O9977N748l7938
427a6422j8660N9640k8956j5562l3334N574J9506K6499L8020N382m862j11847
415g5022p7852j21584k6497J64870O0311m8707m5023M9899O2076M532k0011N353
403f7655P6368j776m3362O8265L1260p2044m3447l6802K8838J7599M5863j3243
391a0136Q722l0099n5260L7551M3267K1940k9051J517O4267k4703l3102k2022
$$ plain form
478 16634 -15933 -20265 -77768 -58409 -19892 -52594 -25786 -23837 -29625 -37762 -50165 -39132 -41796
465 -41796 16027 16441 -43364 -106828 -76607 -33583 -52772 -38056 -11554 1004 -8505 14191 40435
452 40435 52254 40992 36000 -11943 -44706 -127636 -154053 -62459 8606 39918 39857 50734 105975
439 105975 83265 72572 70279 42821 -41480 -125961 -132812 -77534 -54209 15768 21516 -16422
427 -16422 -35082 24558 -4398 -19960 -53294 -47720 -28214 -1715 36305 41687 36825 -75022
415 -75022 -152874 -274458 -300955 -136085 -75774 -124481 -169504 -119605 -57529 -52997 -73008 -67655
403 -67655 8713 6937 -36425 31840 63100 -8944 -52391 -89193 -60355 -42756 3107 -10136
391 -10136 -1414 -31513 -86773 -49222 -5955 15985 -13066 -11549 52718 28015 -5087 -27109
379b7109l5266o756Q1247L3210l4706o093l1505l5535r1048K0063j4313o2378
367b10189L0533j6364M5341R2736k0666j9297K7991Q1273o154j6932L3316J913
355B3501m5164l6440L8736q6995o4826M2667R9246J0522p019M7269P065N792m1851
342g497j3636k1529m7499N7904M6111j8513j5406J2417l5929J08m9961p4420M5313
329a22537R9963J2269l4818L655j924n2717J2694N0669Q5952o6586o1991J7253
317e8118j0903j4778M6270M1590k117j8265K6800L4362J1660o296n7081m005J5309
304D428r198j5273m2750k3153M3834K5826o2281L0253P6518Q625R350J1604n0847
291F936o1533n662j934l750Q924m1440m752p0608j5628J10538O6781l6557n859
$$ plain form
379 -27109 -62375 -69131 12116 45326 10620 4527 -26978 -62513 -153561 -133498 -147811 -210189
367 -210189 -179656 -196020 -150679 -57943 -78609 -97906 -69915 11358 5204 -11728 21588 23501
355 23501 -21663 -58103 -19367 -106362 -171188 -128521 -29275 -18753 -25772 21497 28562 34354 -7497
342 -7497 -21133 -42662 -90161 -32257 13854 -4659 -20065 -7648 -43577 -43469 -93430 -167850 -122537
329 -122537 -22574 -10305 -45123 -41468 -43392 -96109 -83415 -32746 53206 -13380 -75371 -58118
317 -58118 -69021 -83799 -37529 4061 1944 -16321 10479 44841 56501 50205 -6876 -10881 4428
304 4428 -4770 -20043 -62793 -85946 -42112 -16286 -78567 -48314 28204 36829 46179 57783 6936
291 6936 -54597 -60259 -62193 -65943 -57019 -98459 -103211 -173819 -189447 -78909 -12128 -48685 -54544
278e4544j2885j3364n229O839L4404K7229J3327j9494N8141j988k9423j1524J4408
265E897j4919o163q1474k6444O1815O0603Q7229L7236n6720j06494o8085m8o747
252a14314M0025J0369L2841J9629J696l6771k1291n8920k5830Q919J9379L2330
240i1938k0090m9930j4192j4060M6020M4090K5200P85J5984k6420m3819M1515
228h6855M6514M3934J6875m7336o9814j6617J2553l5555j2206L8797J1227K4445
216g4038K4653l2254l5272J5287N0565L9058M1510K9046J1900k9713k7697L91
204A3436n1896p056M7941J2325k9923M6013j5214j2845K1417m1783n0437k655
192g0677K5475K4188N0391J3776K298m5052k1738K6340J7461j655n4866K9860
$$ plain form
278 -54544 -67429 -80793 -86022 -79183 -44779 -17550 -4223 -23717 34424 32436 3013 -8511 5897
265 5897 -9022 -15185 -96659 -123103 -61288 -685 86544 123780 67060 -39434 -107519 -107567 -114314
252 -114314 -74289 -63920 -31079 -11450 -9754 -46525 -67816 -126736 -152566 -143647 -124268 -91938
240 -91938 -112028 -161958 -176150 -190210 -144190 -100100 -74900 -74115 -58131 -84551 -128370 -86855
228 -86855 -40341 3593 20468 -26868 -96682 -113299 -100746 -136301 -148507 -109710 -98483 -74038
216 -74038 -49385 -81639 -116911 -101624 -51059 -12001 29509 58555 70455 40742 13045 13436
204 13436 -38460 -45516 2425 14750 -15173 30840 15626 2781 24198 -17585 -68022 -70677
192 -70677 -45202 -21014 29377 43153 45451 399 -21339 5001 22462 20807 -34059 -4199
180d199k3248j9600j4021K558K2600J498m8815j8898K7667j4509j7122O2358N9272
167A5541L5659K1439k6911j0551M5508q791k2574m0303n399o029n3572j673M0190
154a7466J1095N8004J9197l1302m1325p9942m1778k0989R833J6057P8430L5966
142d220L1741N158o465N639n3555j8405m2653J862M0379j5107K8370L8631J3640
129B5015n9635k2464O2758j8297l2765M2252O6850J634k0519o1578p2319l4209
117a23277j2942M5850q134j2329R49J2749J3736q707L7606K7121m2311Q369K4602
104c6718n720j1456j8221l1870K3644J864n999L9253J7856J2990k3285j2622n4534
91a04818k2787j1899p412J9356N9935l239j3611R1875J3733l8004l3547K6951
$$ plain form
180 -4199 -27447 -47047 -61068 -58510 -35910 -34412 -83227 -102125 -74458 -88967 -106089 -43731 15541
167 15541 51200 72639 45728 35177 80685 71894 49320 9017 3618 -2411 -55983 -57656 -17466
154 -17466 -6371 51633 70830 39528 -1797 -81739 -123517 -144506 -134673 -118616 -40186 -4220
142 -4220 27521 32679 26214 31853 -21702 -40107 -82760 -80898 -40519 -55626 -27256 11375 25015
129 25015 -34620 -57084 5674 -12623 -45388 -3136 63714 65348 44829 -16749 -89068 -123277
117 -123277 -136219 -90369 -98503 -110832 -109883 -97134 -83398 -92105 -54499 -27378 -69689 -61320 -36718
104 -36718 -42438 -53894 -72115 -103985 -80341 -78477 -84476 -45223 -27367 -14377 -37662 -50284 -104818
91 -104818 -127605 -139504 -146916 -127560 -67625 -70864 -84475 7400 21133 -16871 -50418 -23467
79b3467L5253m3113k5451j7713k4336n085o0818j7857J4256M7032O6308K7912
67b7079M1818Q872k8415n5128m6830p118O7131L2663M7302J8331l7629k5186j380
54a2648j9805o9109m4943M4204N1772J5611k758J3684O632K057o7720m0302M0135
41h3190P5672J0214n7053J9243l8178n905j3704m7112M6888N9702J457M644J3888
28a3434K1388k2537n1333q384J4414J3132L494N896K5738N9411N399m3331J1154
15B1007N10j2363m2140l0519k0575j2637K0905J1239n289K7248j3889K5084j7361
2d8780l4402k8726
0a11908
$$ plain form
79 -23467 11786 -31327 -56778 -74491 -98827 -103912 -164730 -182587 -168331 -121299 -54991 -27079
67 -27079 14739 23611 -4804 -59932 -106762 -113880 -46749 -14086 33216 51547 13918 -11268 -12648
54 -12648 -32453 -101562 -146505 -102301 -50529 -34918 -37676 -23992 -17360 -15303 -83023 -123325 -83190
41 -83190 -7518 2696 -54357 -35114 -73292 -79197 -92901 -140013 -93125 -33423 -31966 -27322 -13434
28 -13434 7954 -14583 -65916 -74300 -59886 -46754 -43260 -37364 -11626 47785 53184 9853 21007
15 21007 21517 9154 -32986 -63505 -84080 -96717 -75812 -64573 -69862 -42614 -56503 -31419 -48780
2 -48780 -83182 -111908
0 -111908
$$ Imaginary data points
##PAGE= N=2
##DATA TABLE= (X++(I..I)), XYDATA
32767a71078o7671k297K6642k233L6234M3747k3564j2209k918N196r045J438k6735
32754b04493K3603O995Q935j0724L5795N1022k628m2390j7589j374l029m8490
32742b04367k6090J2471N0577K2310k0455M985N4232L0248K1850J911J5820r369
32730d5877k0459l2033l3339P7880L4088j3444p7425K6504P5054k3255J5207q432
32718b5531l3214M299l0623m2178l9442P5063L4071j0888N302L8672J1171P318
32706e980P107M167r483l854J7048j7216j7173j8742J4771r969N3469L9622l2296
32693B1471j2723l3911j9563P185N720l4730j7812L949K5057J1579l0422L3663
32681d0537O0702L5544k2389M0290M6363l0125p722P502n420M785l8294n1356
$$ plain form
32767 -171078 -238749 -241046 -214404 -216637 -180403 -136656 -160220 -172429 -175347 -170151 -179196 -177758 -204493
32754 -204493 -180890 -173895 -164960 -175684 -139889 -88867 -91495 -133885 -151474 -152848 -155877 -204367
32742 -204367 -230457 -217986 -167409 -145099 -165554 -160569 -106337 -76089 -54239 -52328 -36508 -45877
32730 -45877 -66336 -98369 -131708 -53828 -19740 -33184 -110609 -84105 -9051 -32306 -17099 -25531
32718 -25531 -58745 -54446 -85069 -127247 -166689 -91626 -57555 -68443 -63141 -24469 -13298 -5980
32706 -5980 1127 5294 -4189 -8043 9005 -8211 -25384 -44126 -29355 -39324 14145 53767 21471
32693 21471 8748 -25163 -44726 -37541 -31821 -66551 -84363 -80414 -55357 -43778 -74200 -40537
32681 -40537 20165 55709 33320 73610 119973 89848 82126 89628 84208 88993 50699 -657
32669f57m5377M750m774N3439J5226K002M0000K5797R178K4601n2818k9879k9359
32656A2129k40P101m7134R152N4383M3622O722M4429K10k5332K479L4998o946
32643A35573k1103l2650K1438O6740M4115j0985k9957m9385k0187O310k440Q116
32631A15585q58J797p0451j1522N1825O5020J9014k8770l7264L901N5679O9296
32619B33252k3255J0986L2363L6983K585l0545n0061O780l6746j4337j9559N274
32607A53720l3255o34L6717k0425Q643L0170m2624j2092j1929j984L7292K5108
32595A68707K3887j2616K9279L7228j1053K0434p0551m1060n348J2575J7419K0358
32583A89259j1527p026J2779L8999l3123k293k5903K316K7206J8234P496j2702
$$ plain form
32669 -657 -46034 -41284 -46058 7381 22607 24609 64609 90406 99584 124185 71367 41488 12129
32656 12129 11889 18990 -28144 -18992 35391 79013 85735 130164 130374 105042 107521 142519 135573
32643 135573 114470 81820 103258 169998 214113 203128 173171 123786 103599 109909 107469 115585
32631 115585 114727 116524 46073 34551 86376 151396 170410 141640 104376 108277 163956 233252
32619 233252 209997 220983 253346 290329 292914 262369 212308 219088 182342 168005 148446 153720
32607 153720 120465 119831 156548 136123 144766 174936 132312 120220 108291 106307 143599 168707
32595 168707 192594 179978 209257 246485 235432 255866 185315 144255 138907 151482 168901 189259
32583 189259 177732 170706 183485 222484 189361 187068 161165 163481 190687 208921 216417 203715
32571B03715J105K9991K2929L7056k9634k792J691j9179K1964J9238m4797R10
32559B42197K9622k2049R880J9553J039M261R12m0957k0064N1270N8033j8053
32547C15644J4082J1601J7724m41k3095o9697k2160J0590N1618K864o7395r6649
32535A44686L7527N8098L3739J1707O748j5369o4765k8942L2290R987j8770R945
32523B16881N7582P4324J7439k2116k336o203L765M522m515K7263N1378L0501
32511D48485m0021r7766j381J5409m5743j075j7939k7272l3034J3693K8288N3610
32499B95254K3901j3253j495j9851K7342j2766K7158j2302k8105j4218N8110R5927
32487D25702k6270m2950K0512j9758l5835n2293r539J7639j763P2197L6517o354
$$ plain form
32571 203715 204820 234811 257740 294796 265162 262370 264061 244882 266846 286084 241287 242197
32559 242197 271819 249770 259650 279203 280242 284503 285415 244458 224394 275664 333697 315644
32547 315644 329726 341327 359051 358610 335515 265818 243658 254248 305866 308730 241335 144686
32535 144686 182213 240311 274050 285757 292505 277136 212371 183429 215719 225706 206936 216881
32523 216881 274463 348787 366226 344110 341774 335571 339336 343858 339343 366606 417984 448485
32511 448485 408464 310698 309317 324726 278983 277908 259969 232697 199663 213356 241644 295254
32499 295254 319155 305902 304407 284556 311898 299132 326290 313988 285883 271665 329775 425702
32487 425702 399432 356482 376994 357236 321401 269108 259569 277208 275445 347642 384159 377805
32475C77805K9339m3434l9139L7089K0621l9516p883O3341M2712M631k1259l7546
32463C86761j7888j3906R143k1208p1957L1681M8829r823L3364k3635j8279l2246
32451C00836J5731M8324j4165j8401j7213l5534l0708J1679O5144M1432M5322
32440D12447K4280k6867l4526N5019N8998O793k8905o2302J8003L1867j1495n0454
32428C92858k9365j5275N3938M008P238N787K3970l991k1894L3541N3183K4567
32416E28565r7123J786J1138J9245J5577l6372p1586l3127K2707K5967J00013
32405D86790J6820K2182Q404J0538q4562j11651r668R194j3908K8846M5205Q1127
32393D89317L2153M908m1445o4846k3273K1934O9722K6199m5328o6725j6933k6250
$$ plain form
32475 377805 407144 363710 324571 361660 382281 342765 334882 398223 440935 445566 424307 386761
32463 386761 368873 354967 364110 342902 270945 302626 351455 341632 374996 351361 333082 300836
32451 300836 316567 364891 350726 332325 315112 279578 248870 260549 325693 367125 412447
32440 412447 436727 409860 375334 430353 489351 496144 467239 404937 422940 454807 443312 392858
32428 392858 363493 348218 402156 406164 413402 419189 443159 439168 417274 450815 503998 528565
32416 528565 431442 433228 444366 463611 479188 442816 371230 338103 360810 386777 486790
32405 486790 503610 525792 534196 544734 460172 348521 338853 348047 334139 362985 408190 489317
32393 489317 521470 526378 484933 420087 396814 418748 488470 514669 469341 402616 385683 359433
32381C59433j63O9273L9197J465j3335l723m7136n5952p224O91m142K7661K4260
32368C90305M1608J5866j0534L1580l6761k4480M2054j3495q345m3698L4171N7002
32356D75273K4954n6615m1285P062J0732K1791j0313L4271N9832K0913M991M4756
32344E96362O7260k5519m2096k2437J0818j373n8323p0118M4840P085k8186o7453
32332D10860j5278L389N6552L4107l2610N6514Q8636j9949l9577p1638l3538j4547
32320D22921Q0192k9619l5491L9987l4322j1429R998L7248O9080j0504m9061P896
32308D96896p7945j4116l3071K6523j5849K0111N4268O7247O3628K8448l4649
32297E81491n1028n4842n5071K5205L1110M896M2871L7655l9092j4681r991k6351
$$ plain form
32381 359433 359270 428543 467740 469205 455870 452147 405011 349059 341835 342526 338384 366045 390305
32368 390305 431913 447779 437245 468825 432064 407584 449638 436143 427798 384100 418271 475273
32356 475273 500227 443612 402327 409389 420121 441912 431599 465870 525702 546615 551606 596362
32344 596362 663622 638103 596007 573570 584388 583015 524692 454574 499414 506499 478313 410860
32332 410860 395582 398971 455523 489630 457020 513534 602170 582221 542644 471006 437468 422921
32320 422921 503113 473494 438003 477990 443668 432239 442237 479485 548565 538061 489000 496896
32308 496896 418951 404835 371764 398287 382438 402549 456817 524064 587692 616140 581491
32297 581491 530463 475621 420550 445755 476865 481761 524632 562287 523195 508514 498523 472172
32285D72172k7055J7532l2150P2682N6471l5247r147j2219k0177M3295O3894N8288
$$ plain form
32285 472172 445117 462649 430499 503181 559652 524405 515258 503039 482862 526157 590051 648339
$$ [...]
##END NTUPLES=NMR SPECTRUM
##END=
