##TITLE=Analysis number 319080
Compound Code ac 35945 / mo 00052
Book Reference ac35945
Project Code adrs
Chemist Name mariap
##JCAMPDX= 6.0         $$ Bruker NMR JCAMP-DX V2.0
##DATA TYPE= NMR SPECTRUM
##DATA CLASS= NTUPLES
##ORIGIN= Bruker BioSpin GmbH
##OWNER= nmr
$$ XWIN-NMR		Version 3.5
$$ Fri Apr 28 12:46:26 2006 GMT Daylight Time (UT+1h)  MAYBRIDGE\nmr@NMR_250MHZ
##.OBSERVE FREQUENCY= 250.131544655141
##.OBSERVE NUCLEUS= ^1H
##.ACQUISITION MODE= SIMULTANEOUS (DQD)
##.ACQUISITION SCHEME= undefined
##.AVERAGES= 16
##.DIGITISER RES= 18
##SPECTROMETER/DATA SYSTEM= dpx250
##.PULSE SEQUENCE= zg30
##.SOLVENT NAME= DMSO
##.SHIFT REFERENCE= (INTERNAL, DMSO, 0, 16.522)
##AUDIT TRAIL= $$ (NUMBER, WHEN, WHO, WHERE, WHAT)
$$ ##TITLE= Audit trail, XWIN-NMR		Version 3.5
$$ ##JCAMPDX= 5.01
$$ ##ORIGIN= Bruker BioSpin GmbH
$$ ##OWNER= nmr
$$ C:\u/data/dgb/nmr/ADRS/3460/pdata/1/auditp.txt
$$ ##AUDIT TRAIL=  $$ (NUMBER, WHEN, WHO, WHERE, WHAT)
(   1,<2006-04-28 12:45:38.17 +100>,<MAYBRIDGE\nmr>,<NMR_250MHZ>,
      <created by zg, POWCHK disabled, PULCHK disabled
       configuration hash MD5:
       84 BC 41 DB A1 6E 1D 46 DA 25 12 A5 C1 ED C5 3A
       data hash MD5: 64K
       15 55 57 88 29 59 18 57 A6 E6 7C 94 DD B9 FA FD>)
(   2,<2006-04-28 12:46:01.33 +100>,<MAYBRIDGE\nmr>,<NMR_250MHZ>,
      <Start of raw data processing
       ef LB = 0.3 FT_mod = 6 PKNL = 1 SI = 32K 
       data hash MD5: 32K
       CA 29 54 B2 41 F7 86 2D F2 18 4B 2C E2 4C 4B 7A>)
(   3,<2006-04-28 12:46:04.78 +100>,<MAYBRIDGE\nmr>,<NMR_250MHZ>,
      <apk 
       data hash MD5: 32K
       DF BB AA D7 E9 4A 68 83 5E 24 F0 03 68 DE AE E8>)
(   4,<2006-04-28 12:46:05.75 +100>,<MAYBRIDGE\nmr>,<NMR_250MHZ>,
      <abs ABSG = 5 
       data hash MD5: 32K
       C8 C8 BE 9B 45 62 B9 6E 63 C7 06 D9 6A E9 E3 34>)
$$ ##END=
$$ 
$$ hash MD5
$$ 20 CC BC 8D 7E 37 30 01 B3 AB 9F FA 9C ED 50 E8
##$RELAX= 
##$RELAX= 
##$RELAX= 
##$RELAX= 
##$RELAX= 
##$RELAX= 
##$RELAX= 
$$ Bruker specific parameters
$$ --------------------------
##$DU= <C:\u>
##$EXPNO= 3460
##$NAME= <ADRS>
##$PROCNO= 1
##$TYPE= <nmr>
##$USER= <dgb>
##$AMP= (0..31)
100 100 100 100 100 100 100 100 100 100 100 100 100 100 100 100 100 100 
100 100 100 100 100 100 100 100 100 100 100 100 100 100 
##$AQSEQ= 0
##$AQ_mod= 3
##$AUNM= <au_zg>
##$AUTOPOS= <33 >
##$BF1= 250.13
##$BF2= 250.13
##$BF3= 250.13
##$BF4= 250.13
##$BF5= 500.13
##$BF6= 500.13
##$BF7= 500.13
##$BF8= 500.13
##$BYTORDA= 1
##$CFDGTYP= 0
##$CFRGTYP= 5
##$CHEMSTR= <none>
##$CNST= (0..31)
1 1 145 1 1 1 1 1 1 1 1 1 1 1 1 1 1 1 1 1 1 1 1 1 1 1 1 1 1 1 1 1 
##$CPDPRG= <>
##$CPDPRG1= <>
##$CPDPRG2= <>
##$CPDPRG3= <>
##$CPDPRG4= <mlev>
##$CPDPRG5= <mlev>
##$CPDPRG6= <mlev>
##$CPDPRG7= <mlev>
##$CPDPRG8= <mlev>
##$CPDPRGB= <>
##$CPDPRGT= <>
##$D= (0..31)
0 1 0 0 0 0 0 0 0 0.06 0 0 0 0 0 0 0.0002 0 0 0 0 0 0 0 0 0 0 0 0 0 0 
0 
##$DATE= 1146224729
##$DBL= (0..7)
120 120 120 120 120 120 120 120 
##$DBP= (0..7)
150 150 150 150 150 150 150 150 
##$DBP07= 0
##$DBPNAM0= <>
$$ [...]
##$SUBNAM7= <"">
##$SUBNAM8= <"">
##$SUBNAM9= <"">
##$SW= 20.6930455092707
##$SWIBOX= (0..15)
0 0 3 0 0 0 0 0 0 0 0 0 0 0 0 0 
##$SW_h= 5175.983436853
##$TD= 65536
##$TD0= 1
##$TE= 295.16
##$TE2= 300
##$TE3= 300
##$TEG= 300
##$TL= (0..7)
0 120 120 120 120 120 120 120 
##$TP= (0..7)
150 150 150 150 150 150 150 150 
##$TP07= 0
##$TPNAME0= <>
##$TPNAME1= <>
##$TPNAME2= <>
##$TPNAME3= <>
##$TPNAME4= <>
##$TPNAME5= <>
##$TPNAME6= <>
##$TPNAME7= <>
##$TPOAL= (0..7)
0.5 0.5 0.5 0.5 0.5 0.5 0.5 0.5 
##$TPOFFS= (0..7)
0 0 0 0 0 0 0 0 
##$TUNHIN= 0
##$TUNHOUT= 0
##$TUNXOUT= 0
##$USERA1= <user>
##$USERA2= <user>
##$USERA3= <user>
##$USERA4= <user>
##$USERA5= <user>
##$V9= 5
##$VALIST= <valist>
##$VCLIST= <CCCCCCCCCCCCCCC>
##$VD= 0
##$VDLIST= <DDDDDDDDDDDDDDD>
##$VPLIST= <PPPPPPPPPPPPPPP>
##$VTLIST= <TTTTTTTTTTTTTTT>
##$WBST= 1024
##$WBSW= 4
##$XGAIN= (0..3)
0 0 0 0 
##$XL= 0
##$YL= 0
##$YMAX_a= 243771
##$YMIN_a= -529082
##$ZGOPTNS= <>
##$ZL1= 120
##$ZL2= 120
##$ZL3= 120
##$ZL4= 120
##$ABSF1= 16.522
##$ABSF2= -4.171173
##$ABSG= 5
##$ABSL= 3
##$ALPHA= 0
##$AQORDER= 0
##$ASSFAC= 0
##$ASSFACI= 0
##$ASSFACX= 0
##$ASSWID= 0
##$AUNMP= <proc_1d>
##$AZFE= 0.1
##$AZFW= 0.1
##$BCFW= 0
##$BC_mod= 0
##$BYTORDP= 0
##$COROFFS= 0
##$CY= 12.5
##$DATMOD= 1
##$DC= 0
##$DFILT= <>
##$DTYPP= 0
##$F1P= 14.0000005364418
##$F2P= -0.99999901652339
##$FCOR= 0.5
##$FTSIZE= 32768
##$FT_mod= 6
##$GAMMA= 0
##$GB= 0
##$INTBC= 1
##$INTSCL= 1
##$ISEN= 128
##$LB= 0.3
##$LEV0= 0
##$LPBIN= 0
##$MAXI= 10000
##$MC2= 0
##$MEAN= 0
##$ME_mod= 0
##$MI= 0
##$NCOEF= 0
##$NC_proc= -5
##$NLEV= 6
##$NOISF1= 0
##$NOISF2= 0
##$NSP= 0
##$NTH_PI= 0
##$NZP= 0
##$OFFSET= 16.522
##$PC= 1
##$PHC0= 159.1944
##$PHC1= 12.48167
##$PH_mod= 1
##$PKNL= yes
##$PPARMOD= 0
##$PSCAL= 4
##$PSIGN= 0
##$REVERSE= no
##$SF= 250.13
##$SI= 32768
##$SIGF1= 0
##$SIGF2= 0
##$SINO= 400
##$SIOLD= 32768
##$SREGLST= <1H.DMSO>
##$SSB= 0
##$STSI= 32768
##$STSR= 0
##$SW_p= 5175.98343685301
##$SYMM= 0
##$S_DEV= 0
##$TDeff= 65536
##$TDoff= 0
##$TI= <Analysis number 999999
Compound Code 99
Book Reference 9
Project Code 9>
##$TILT= no
##$TM1= 0
##$TM2= 0
##$TOPLEV= 0
##$USERP1= <user>
##$USERP2= <user>
##$USERP3= <user>
##$USERP4= <user>
##$USERP5= <user>
##$WDW= 1
##$XDIM= 32768
##$YMAX_p= 399413170
##$YMIN_p= -632742
$$ End of Bruker specific parameters
$$ ---------------------------------
##NTUPLES= NMR SPECTRUM
##VAR_NAME=  FREQUENCY,     SPECTRUM/REAL,   SPECTRUM/IMAG
##SYMBOL=    X,             R,               I
##VAR_TYPE=  INDEPENDENT,   DEPENDENT,       DEPENDENT
##VAR_FORM=  AFFN,          ASDF,            ASDF
##VAR_DIM=   32768,         32768,           32768
##UNITS=     HZ,            ARBITRARY UNITS, ARBITRARY UNITS
##FACTOR=    0.157963299565203, 1,           1
##FIRST=     4132.6476996994, 0,             0
##LAST=      -1043.33573715361, 0,           0
##MIN=       -1043.33573715361, -632742,     0
##MAX=       4132.6476996994, 399413170,     0
$$ Real data points
##PAGE= N=1
##DATA TABLE= (X++(R..R)), XYDATA
$$ [...]
24322a8521n5785p2053M461P2977K31428n1411j48145J07681q4298j24476k895
24311a41037j1251j19112o479O7877L4881J02656Q061n685L1471L7872m561j05711
24299a11018j41899j06428K14970Q5940M5345j68761n3220k1379J50734O2244
24289d3472o638K4130n5677J7209K8280Q0812k10622j0711P9617j1029L1068O7619
24277i414J0734L164K8997l8800N0850P6277n0677j31629O1878Q615k24839J61359
24265e3485J78223N3926j4357O300R9802K1313r8251j11677k53623l08123N5945
24254d24007J33113J36314n6377j14943M0007K46644j1679n8105J56595K06591
24244B54153l0602j20977j94755q8511j8784J17641k7519j80434k6235J60554
$$ plain form
24322 -18521 -74306 -146359 -141898 -68921 162507 111096 -37049 70632 -13666 -138142 -141037
24311 -141037 -152288 -271400 -277879 -210002 -175121 -72465 -64404 -70089 -38618 -746 -5307 -111018
24299 -111018 -252917 -359345 -144375 -58435 -13090 -181851 -235071 -256450 -105716 -43472
24289 -43472 -50110 -25980 -81657 -64448 -36168 44644 -165978 -176689 -97072 -108101 -77033 -9414
24277 -9414 1320 4484 33481 -5319 45531 121808 71131 -60498 1380 9995 -214844 -53485
24265 -53485 124738 178664 164307 170607 270409 291722 193471 81794 -171829 -479952 -424007
24254 -424007 -290894 -154580 -210957 -325900 -285893 -39249 -50928 -109033 47562 254153
24244 254153 223551 102574 -92181 -180692 -199476 -81835 -109354 -289788 -316023 -155469
24234a55469J05357J14179J65943M8656j06189j91014L832O2841j03428Q0104
24224B4812R3988j97902j75665P8550m3484L4658j40898q4882J75033L6831M2930
24213a56029L5230j5607K67417K9566p5206p9071l0413l3207n4999l1429Q3697
24202f0051J10870l5286N5408J30499q7696j00127j14930j03713J04554O3323
24192c7149J45386K9507M185O355L13J646j15469L6774J71790K8481p0954k13132
24180a2267R584K2616J6059L7011Q0424p1176L380J63873j06565p3331j4262J13146
24168A68492p0247M4677j2300L6140M5276Q6796L2582j90687k64017k8734m6398
24157a98420j334J87377Q4411N9591k3035j16924k23232J06485q7623j58029J75255
$$ plain form
24234 -155469 -50112 64067 230010 278666 172477 -18537 -14705 48136 -55292 24812
24224 24812 118800 -79102 -254767 -176217 -219701 -185043 -325941 -410823 -235790 -198959 -156029
24213 -156029 -120799 -136406 131011 160577 85371 6300 -24113 -57320 -112319 -143748 -60051
24202 -60051 50819 15533 70941 201440 113744 13617 -101313 -205026 -100472 -37149
24192 -37149 108237 137744 141929 148284 148597 150243 34774 71548 243338 271819 200865 -12267
24180 -12267 -2683 19933 35992 73003 153427 82251 85631 249504 142939 69608 55346 168492
24168 168492 98245 142922 130622 166762 212038 298834 331416 140729 -123288 -152022 -198420
24157 -198420 -199754 -12377 72034 131625 108590 -8334 -231566 -125081 -212704 -370733 -195478
24146a95478J99702J57701o7172l1392O7284k0907n4507N2273l9852j31287m8751
24135a12386p3917M1896j07165r5731K66945Q2588K8646Q3927K2097l50577m6376
24124b60053L3292J47089j5884P5066k4276J57682Q2227j68381j7823k6409P1397
24113E3927l4455k6408m3533P1507K3369l6686J7903q0080m7193l9517n878j0742
24101a57786M7679K1055j3071k1549m8208q7747J05086K0241N3750K49489N7761
24090B26700j61479N4573j1159r7539j20048P6246J48178J2965q0905r9673m625
24079e6766n501R1909j39904J21193J86368N656M3288j21176R765K0896l5890
24068A19838K057k2800L2291m7654k38173p3459q4853K2228J80877J20812j16890
$$ plain form
24146 -195478 4224 161925 94753 63361 130645 109738 55231 107504 67652 -63635 -112386
24135 -112386 -186303 -144407 -251572 -347303 -80358 2230 30876 114803 136900 -213677 -260053
24124 -260053 -226761 -79672 -95556 -20490 -44766 112916 195143 26762 8939 -17470 53927
24113 53927 19472 -6936 -50469 21038 44407 7721 25624 -54456 -101649 -141166 -147044 -157786
24101 -157786 -110107 -89052 -102123 -123672 -171880 -259627 -154541 -134300 -80550 168939 226700
24090 226700 65221 119794 108635 11096 -108952 -32706 115472 128437 47532 -52141 -56766
24079 -56766 -62267 29642 -110262 10931 197299 202955 246243 125067 134832 155728 119838
24068 119838 121895 99095 131386 83732 -154441 -227900 -312753 -290525 -109648 11164 -105726
24057a05726K8116J10446K7108j30437j05239K2722p0266L6564J21148l6065Q575
24046i3054Q6620j9431J15388J3118j3238O9635j03013j46509j39140m0960K09543
24035f1041J42326L2550R7495k8414K9329L5469J8793N2945l4064j88275R2893
24024A90006R2763M4038k7181j39387m336m575J4424J59630K1282j16030k94570
24013f3936k00386K34011R6254j5527K2899L02n4059K5161j32200l260K48666
24002A57925R4306k25839r0064m5259O8597P3229l1802O020k3166j33088J06213
23991d2928M8841P066j13421o4392J44329j10623k9765k5955K247L3809L8522
23980a12270P8470k4417j0557Q844k170j5102P3823o7176n0152Q9002O6223j74826
$$ plain form
24057 -105726 -77610 32836 59944 -70493 -175732 -153010 -223276 -186712 -65564 -101629 -93054
24046 -93054 -6434 -25865 89523 102641 89403 159038 56025 -90484 -229624 -270584 -61041
24035 -61041 81285 113835 211330 182916 212245 247714 266507 319452 285388 97113 190006
24024 190006 282769 326807 299626 160239 155903 151328 165752 325382 346664 230634 -63936
24013 -63936 -264322 -30311 65943 50416 73315 73617 19558 44719 -87481 -90741 157925
24002 157925 252231 26392 -63672 -108931 -40334 32895 1093 7113 -16053 -149141 -42928
23991 -42928 5913 12979 -100442 -164834 -20505 -131128 -160893 -186848 -184601 -150792 -112270
23980 -112270 -33800 -58217 -68774 -59930 -62100 -77202 -3379 -70555 -120707 -31705 34518 -140308
23968a40308J29960m0984L9091N063J12852j06093r6877j88295q5831Q0368J15530
23957a75524O0179n699m2059J13794K6552L325P3242p9954k38141K5424j1673
23946b50534P5871k2278j3967r4109O8099R6624j6807R4688J1430m3493M1520
23935e2956M194m8281j72050J08123J69609J55605p1483m1660k6806o461q6711
23924f8877j5316j4776J207R0194o2589K4551l5598Q6554L3929O1085J27138p5996
23912A51506k01296q3297l7222L643m0496J34265J01632J9518l8507K5470O1494
23901I6710L176j63235k22104m2935L7310k4294l9021N9283K25894j5773J9029
23890f5960L1175P1342J50609J17832K3769k52898k42722R8842J3571l1028l0563
$$ plain form
23968 -140308 -10348 -51332 -12241 -7178 105674 -419 -97296 -285591 -371422 -291054 -175524
23957 -175524 -115345 -121044 -163103 -49309 -22757 -19432 53810 -26144 -264285 -238861 -250534
23946 -250534 -174663 -196941 -210908 -305017 -236918 -140294 -157101 -62413 -50983 -94476 -52956
23935 -52956 -48762 -97043 -269093 -160970 8639 164244 92761 51101 24295 17834 -68877
23924 -68877 -84193 -98969 -97762 -7568 -70157 -45606 -81204 5350 39279 100364 227502 151506
23912 151506 -49790 -133087 -170309 -166666 -207162 -72897 28735 48253 9746 35216 96710
23901 96710 99886 -63349 -285453 -328388 -291078 -315372 -354393 -295110 -69216 -84989 -65960
23890 -65960 -34785 36557 187166 304998 328767 75869 -166853 -68011 -54440 -85468 -116031
23879a16031L7221N8269j0714R4076Q0590j84419L97K27663J35605j11487m4554
23868A66616j79846r3045O8936K8927j2636P4486R814P5957j3906j52020k1797
23857d8514m3494K88O0796N6480l6144K6822p8230k0976K0601J39442L0197j1862
23845I5406l157J53020j43860L3648R1854j46612j87367m7128n721l4183L460
23834a90640M7535J30045P0720R8644M7812M651n6497k31348n6599J38711J78824
23823A81858P6361l1469j44148q879l046R3410Q8570q3029k5986p0420K27r8595
23811b5146j0291Q2310R2785K3611j4156k9221l5907l4001q4205L4612Q5100r2125
23799f634j33206j39054J81871J71605j44303n07M1343M4596L0569r3915l0854
$$ plain form
23879 -116031 -78810 -20541 -31255 62821 143411 -41008 -40611 187052 322657 211170 166616
23868 166616 -13230 -106275 -37339 -8412 -21048 53438 63252 139209 125303 -26717 -48514
23857 -48514 -92008 -91720 -30924 25556 -10588 16234 -61996 -82972 -62371 77071 107268 95406
23845 95406 92249 245269 101409 135057 226911 80299 -107068 -154196 -159917 -194100 -190640
23834 -190640 -143105 -13060 57660 156304 204116 208767 152270 -79078 -135677 3034 181858
23823 181858 258219 226750 82602 73723 70677 164087 252657 169628 143642 73222 73449 -25146
23811 -25146 -35437 46873 139658 163269 149113 119892 83985 49984 -34221 391 85491 -6634
23799 -6634 -139840 -278894 -97023 74582 -69721 -70228 -28885 15711 46280 -47635 -78489
23788g8489M6124R0823J50430k9938k01556j09468j08781O9441P8107j8765j6453
23777a28525j2627J83040Q3129J57826j5946j77101o5903Q7130J09105N145j5049
23766B10224j41561m3801K69730N028j83767j77743O542K6238r0268k5410n9497
23755b04285q1811J55134m1086L3786l7614J16566J00162J0630L4226O5499M1506
23744A92713p7659q325j35945n8393o1461l340Q2699R5452M9601j3260j1949M9967
23732A00100j7920q6198l3204N5905J40899m6136j35679j8675K4871j36524p5945
23721b28506j13666j6297J43742N5500O3993n1181J75439J04723j76881j77754
23711b20888J96847l0989M545q4433k16327p4852M9256K16952J73025Q1439k711
$$ plain form
23788 -78489 -32365 58458 208888 178950 -22606 -132074 -240855 -171414 -93307 -112072 -128525
23777 -128525 -141152 41888 125017 282843 266897 89796 23893 111023 220128 225273 210224
23766 210224 68663 24862 294592 299620 115853 -61890 -55348 -29110 -119378 -144788 -204285
23755 -204285 -286096 -130962 -172048 -138262 -175876 -59310 40852 51482 85708 151207 192713
23744 192713 115054 106729 -29216 -87609 -149070 -152410 -69711 25741 75342 62082 50133 100100
23732 100100 82180 -4018 -37222 18683 159582 113446 -22233 -40908 -16037 -152561 -228506
23721 -228506 -342172 -358469 -214727 -159227 -95234 -146415 29024 133747 -43134 -220888
23711 -220888 -24041 -55030 -50485 -134918 -351245 -426097 -376841 -159889 13136 94575 91864
23700I1864j86708O3169J16025K8464j19430j5665k8634j4264r9707p1132P6168
23689a59850J49515N7293l1403p2345n5207n3163l5106O549O866r411k3479k2387
23677b42128p2971Q530p26N3566M1810J34803J42396O0987k7312L0147j12968
23666A6134j39285N9585k9573n9661O6562M6315R771m3686M4141j33687J22084
23655d1300J04860L6614j16782j22240J53157k8677j04151M4588Q2630M4524k0995
23644C2228j7288N3606O5150m7883j10065l3703J08958j4959K3778k6658n7172
23633b4008j5789L7024L95178m9710k07075j98143J4483K2884N3303j11359j9947
23622a03159j75352M6912K2979O0153R2358Q957P5820Q3591O5612o4341j49608
$$ plain form
23700 91864 -94844 -31675 84350 112814 -6616 -22281 -50915 -65179 -164886 -236018 -159850
23689 -159850 -10335 46958 15555 -56790 -111997 -165160 -200266 -193717 -186851 -196262 -219741 -242128
23677 -242128 -315099 -306569 -307295 -253729 -211919 -77116 65280 126267 98955 129102 16134
23666 16134 -123151 -63566 -93139 -152800 -86238 -39923 -30152 -73838 -29697 -163384 -41300
23655 -41300 63560 100174 -16608 -138848 14309 -14368 -118519 -73931 8699 53223 32228
23644 32228 14940 68546 133696 85813 -24252 -57955 51003 36044 59822 33164 -24008
23633 -24008 -39797 -2773 392405 342695 135620 -62523 -48040 -25156 28147 -83212 -103159
23622 -103159 -278511 -231599 -208620 -148467 -56109 -47152 28668 112259 177871 113530 -36078
23611c6078J29779K38924j77245j28989J511Q8716O3829q0715J5349o3275N7280
23600A09086j5054n5238J18260n0917r1882L9057M3427R5072j41275m9945l27700
23589c27109j28443P0732J20659K41615R1990j95771O2959K1954m6420M2928o048
23578e0954J10990n3388j33753L3620r2719r1943L942J00254N6292j0012J24061
23567c610Q1248j07628J42633J30502q384k02421Q9627J08252j82500j372N6837
23556A03184P7416J3299j756M7559k4432o9710j16239j61413J52680R8022J2279
23545A30889L4097P9687j94514M9177n6208M6161N8002J11596j02319j2894j45653
23534a979q4195J29294o0268k028J04151l5803m9720n71k2231j23607j22500Q6453
$$ plain form
23611 -36078 93701 332625 155380 26391 27902 116618 180447 99732 115081 51806 109086
23600 109086 94032 38794 157054 106137 14255 53312 96739 191811 50536 591 -327109
23589 -327109 -455552 -384820 -264161 -22546 69444 -126327 -63368 -41414 -87834 -44906 -50954
23578 -50954 60036 6648 -127105 -93485 -186204 -278147 -274205 -173951 -117659 -127671 -3610
23567 -3610 77638 -29990 112643 243145 234761 32340 121967 230219 47719 46347 103184
23556 103184 180600 193899 192143 239702 215270 145560 29321 -132092 20588 118610 130889
23545 130889 164986 244673 50159 99336 43128 89289 147291 258887 156568 143674 -1979
23534 -1979 -86174 43120 -17148 -19176 84975 49172 -548 -1119 -23350 -146957 -269457 -183004
23522a83004j40382k3647J26449k1453L1446J73672L29652m3500r2616k1040J4337
23511A49914k16003j00293j8481k6930P0319J08484P1490O192k58790K2764J00048
23500i1286j984M6044L7320N5792P1237l9484j04474O7394O0623M040k21387J44213
23488B8048l6089p2018J25299k3525l0002J0587N1284J39157j14989L2294R7326
23477B07372N0773n7342k66797j21214l2245J8344j00995K36815K01342l1409
23467A04644k6531j5799j9683k08866n7037J12915j68205m35J13226o6638J9678
23456b12731R1475K10468J16577k8739j4826P1279R7860r4798j92005P562j08777
23445e6655l815P8545m4602p0121J9555p1323q533l1820J52443L4072M3643j3814
$$ plain form
23522 -183004 -323386 -347033 -220584 -242037 -210591 -36919 292733 249233 156617 135577 149914
23511 149914 -66089 -166382 -184863 -211793 -141474 -32990 38500 44692 -214098 -191334 -91286
23500 -91286 -93270 -47226 -9906 45886 117123 77639 -26835 40559 101182 105222 -116165 28048
23488 28048 -8041 -80059 45240 21715 -8287 2300 53584 192741 77752 110046 207372
23477 207372 258145 200803 -65994 -187208 -219453 -201109 -302104 -65289 136053 104644
23467 104644 78113 62314 42631 -166235 -223272 -110357 -278562 -278997 -165771 -232409 -212731
23456 -212731 -121256 89212 205789 177050 162224 233503 331363 236565 44560 52122 -56655
23445 -56655 -60470 18075 -26527 -96648 -77093 -148416 -156949 -188769 -36326 -2254 41389 27575
23433B7575p0676M1139j2261l2286p3575Q0154J65162Q7750n1851j31013K9130
23422E9248N8403j9058o5441j07293R6412J69152j152l12007n2485j8988P2979
23411a20230o5902q4457N0237J89794J9023M7190O4157J06377r9773r6274R5324
23400A05466P3688j13912j66351r1505P0694J42984J8009p849J074J70378J01061
23389C03737j27892k76622o6057R5510k0838O5530j9875J092m2520J78925L4442
23378A25432R555O8260r8792k48328k5395L1358J9336J34764J10499m2574j43229
23367e9114j20843o261q13l4035k0226J41898o8437o12O9647R0052O7540Q6578
23355A45374K1851l7139j23436q3772O4503N5784o1589J79887K8876j19511j6199
$$ plain form
23433 27575 -43101 -1962 -14223 -46509 -120084 -39930 125232 212982 161131 30118 59248
23422 59248 117651 98593 33152 -74141 22271 191423 190271 -121736 -174221 -193209 -120230
23411 -120230 -186132 -270589 -220352 -30558 -11535 35655 99812 206189 106416 10142 105466
23400 105466 179154 65242 -101109 -192614 -121920 21064 39073 31224 32298 202676 303737
23389 303737 175845 -100777 -166834 -71324 -92162 -26632 -46507 -45415 -87935 90990 125432
23378 125432 134987 203247 104455 -143873 -169268 -137910 -118574 16190 126689 84115 -59114
23367 -59114 -179957 -186218 -187031 -221066 -241292 -99394 -167831 -168443 -98796 -8744 58796 145374
23355 145374 167225 130086 6650 -77122 -12619 43165 -18424 161463 190339 70828 54629
23344E4629l5799N8229J49550p1806k20678Q9811j427J716J32456M7686K68363
23333D72730R5511q9146j19880j38001q2852m5843J20223j43997j37307J9973
23323d8589N8931r9052R9100N3776r7001j20251m3161j5264l9656L5700J49866
23312f5601p2886k17986Q1243K40463Q0118K246L8577K092m1539J28444j33427
23301D1744k19291p0436J97611J63810M7199k05026j6371J78392j11147j69338
23291a62853J17415K20270n4573j066J44777j65879k65938k25993R5254J66809
23281a31777J00730P9945J81613J7559q2520j79924J53482M7772j48564n2224
23271a3908j24380o7972J18233M8250j5413r161L8817q713j8699p2476O2650L6621
$$ plain form
23344 54629 18830 77059 226609 154803 -65875 23936 22509 24225 156681 204367 472730
23333 472730 568241 479095 359215 221214 138362 92519 212742 68745 -68562 -48589
23323 -48589 10342 -88710 10390 64166 -32835 -153086 -196247 -211511 -251167 -215467 -65601
23312 -65601 -138487 -356473 -275230 -34767 45351 47597 86174 88266 46727 175171 41744
23301 41744 -177547 -247983 -50372 113438 160637 -44389 -60760 117632 6485 -162853
23291 -162853 -45438 174832 120259 119193 263970 98091 -167847 -393840 -298586 -131777
23281 -131777 -31047 48898 230511 248070 165550 -14374 139108 186880 38316 -13908
23271 -13908 -138288 -206260 -88027 -39777 -55190 -64351 -25534 -34247 -52946 -125422 -62772 -26151
23259b6151k89129j6051J07437J74649Q8180k7594J13180P7696j40543l5905Q6008
23248A11777J12199J5761j27607p0288n8132J56871M7075m3328J59682j331j98964
23237A03715k15139J31357j1524J2454L12097J55002L9325j48586k13463j38944
23227B6294j87096q5338R8527P9533j46051o9434M2951K0122p5128K1560R9557
23216a74503J58167j5347j15688p1599R0722N2576O0042R7105p174J35441K7605
23205B37347k44252k86197j28919O7403K28370j7343j64848J03518J22230j24799
23195b07490l1641K10733P2746Q8095M4981k2136o3396k9972K4236j51574j06471
23184a71889J4455K1808Q5636q0934J55559J20937o9143r284j55715J5183k8088
$$ plain form
23259 -26151 -315280 -331331 -223894 -49245 38935 11341 124521 202217 61674 25769 111777
23248 111777 223976 239737 112130 41842 -16290 140581 187656 144328 304010 302679 103715
23237 103715 -111424 19933 8409 20863 332960 487962 527287 378701 165238 26294
23227 26294 -160802 -246140 -147613 -68080 -214131 -283565 -240614 -220492 -295620 -274060 -174503
23216 -174503 -16336 -31683 -147371 -218970 -128248 -75672 -15630 81475 74301 209742 237347
23205 237347 -6905 -293102 -422021 -354618 -126248 -143591 -308439 -204921 -82691 -207490
23195 -207490 -239131 -28398 44348 132443 177424 155288 91892 61920 86156 -65418 -171889
23184 -171889 -157434 -135626 -49990 -130924 24635 145572 76429 67145 -88570 -73387 -101475
23173a01475J5979R9718J0504K679n9405K4690K6193j06193o9524Q9326J37227
23162F9719j0495J7689r1976j04813J13037J4847K8947k5020m9891m1900j85421
23151b65277J63396J14553O1029N3689l2589j45078r1283J11311K08097J40077
23141C17925l3892J03635j05979k3762o3501k20516p2542O2942P6105j14187k1121
23130i4893Q8562J33717L6016J63241K3549p566j87434j39983O4720J93010k485
23119B70454q7979k5644J25864l9162p2218r2543j22977j44847n2800J1330p1987
23108c02509j1921N8606K53964L57159J04769j82525k21247j38585J04190k094
23098A9807J1527r7958k8731N6535o9423J55699J77476j26387P700P2069j34860
$$ plain form
23173 -101475 -85496 14222 24726 27405 -32000 -7310 18883 -87310 -156834 -67508 69719
23162 69719 59224 76913 -15063 -119876 -6839 8008 36955 11935 -37956 -79856 -265277
23151 -265277 -101881 12672 73701 127390 94801 -50277 -141560 -30249 177848 317925
23141 317925 284033 387668 281689 257927 194426 -26090 -98632 -35690 40415 -73772 -94893
23130 -94893 -6331 127386 163402 326643 350192 342626 155192 15209 79929 272939 270454
23119 270454 182475 156831 282695 243533 171315 78772 -44205 -189052 -241852 -230522 -302509
23108 -302509 -314430 -255824 -1860 355299 460068 277543 56296 -82289 21901 19807
23098 19807 31334 -66624 -95355 -38820 -108243 47456 224932 98545 106245 178314 43454
23087D3454r8613j01879p1555q6408J45317K1093K4696J17169Q3284O1077J4974
23076A52609k20373q3714j90009P4944J19374J89818R7042j91078j05902J46294
23066a0995M6817J1829J8294m164l9821k17466j18011N8705O8916R1829J93980
23055I9913o916j7657n0010n3491j05243k57013J28463J07689p303j3480N6390
23044a18658J75951M767n3849j45189m7891J18273K21787J04493p95q7226j56990
23033A4673k08760J09935p7723N2184j4709J4024J35195O7397j93815j35091k1598
23022b58288J24993l8199P9068o7846j02482p2166Q8678K4965J21069O6921M1400
23011H113n8792k08447j17739J8910L04806J46501r8834n276r954M0973L6236
$$ plain form
23087 43454 -55159 -157038 -228593 -315001 -169684 -148591 -123895 -6726 76558 137635 152609
23076 152609 -67764 -151478 -341487 -266543 -147169 42649 139691 -51387 -157289 -10995
23066 -10995 35822 47651 65945 61781 21960 -195506 -313517 -254812 -185896 -94067 99913
23055 99913 92997 75340 25330 -28161 -133404 -390417 -261954 -154265 -161568 -175048 -118658
23044 -118658 57293 62060 8211 -136978 -184869 -66596 155191 259684 258889 171663 14673
23033 14673 -194087 -84152 -161875 -109691 -124400 -110376 24819 92216 -101599 -236690 -258288
23022 -258288 -133295 -171494 -92426 -160272 -262754 -334920 -246242 -221277 -100208 -33287 8113
23011 8113 -50679 -259126 -376865 -357955 -53149 93352 -5482 -10758 -20712 20261 56497
23000E6497j0577o3102K1557Q7253Q9178n669j19890J4504Q7176p4538r8364n5329
22988g1304j27514k14407n3069M4174J60365J08570k1148n7857l2871P6256J88118
22977f87J29015j7136n8531j6427j27163r0559J5333J66406J6964N0767k9737
22966C8245K04912L30752p4009j99463k20045j59161q3904q2073L78M9358J22007
22955g3003m186K8015n5363m3496R3132O9987j79236n4335P0772Q4069R8747q8912
22943e3809J98614K65257J46343j48488P8099N8236j20131k15393k72651j48450
22933b12373L8149J13160O3410p650q8805Q5363m9123K02831l9206j74128j08660
22922a77032j75118l0626K6143j05784k131R7849K67151N1873j36262o288J2862
$$ plain form
23000 56497 45920 -17182 4375 91628 180806 175137 55247 69751 156927 82389 -15975 -71304
22988 -71304 -198818 -413225 -466294 -422120 -261755 -153185 -174333 -232190 -265061 -188805 -687
22977 -687 128328 111192 52661 36234 -90929 -181488 -166155 251 17215 67982 38245
22966 38245 243157 573909 499900 300437 80392 -78769 -162673 -244746 -244368 -195010 -73003
22955 -73003 -77189 -49174 -104537 -148033 -54901 15086 -164150 -218485 -147713 -63644 35103 -53809
22943 -53809 144805 410062 556405 407917 486016 544252 424121 208728 -63923 -212373
22933 -212373 -174224 -61064 2346 -5304 -94109 -8746 -57869 144962 105756 -68372 -177032
22922 -177032 -352150 -382776 -356633 -462417 -464548 -366699 -99548 -47675 -183937 -190225 -177363
22911a77363J47567Q3732J29411j2407r714j39956r0193J13089q032q2036j3990
22900e9892J30462P1498Q7952n4970j19079k18990M8814j45881j06429M3387K59913
22889f3215o0410j8407J19353J51868N9188j35739K06274j25978L111j6627j1069
22878A08349K0806l3046o7897l7040l1064Q6023J43174l5592j06066q4241p2453
22867a09047o0707L9888K20430N8462k44626j87373l7576J70325J44558J34680
22857A29014l806K8591n0091L6134J6277K860j10625j67298o1343L1896M6062
22846a02329j4825Q9886n0378p3413o6162l6313J43996R0548l312m8198J09461
22835C8961J82123l435J4748j72305Q368K1995j78655j22883J60389L3374j9027
$$ plain form
22911 -177363 -29796 53936 183347 170940 161226 21270 -68923 44166 36134 -45902 -59892
22900 -59892 70570 142068 230020 175050 55971 -163019 -114205 -260086 -366515 -323128 -63215
22889 -63215 -123625 -142032 -22679 129189 188377 52638 258912 132934 136045 119418 108349
22878 108349 129155 96109 28212 -8828 -39892 46131 189305 153713 47647 -36594 -109047
22867 -109047 -169754 -129866 90564 149026 -95600 -282973 -320549 -150224 -5666 129014
22857 129014 125208 153799 103708 139842 156119 158979 48354 -118944 -180287 -148391 -102329
22846 -102329 -117154 -27268 -77646 -151059 -217221 -253534 -109538 -18990 -22302 -70500 38961
22835 38961 221084 217649 232397 60092 68460 90455 -88200 -211083 -50694 -17320 -36347
22824c6347J33657r6316K8908R3641M7381j26403j70643m6456N6689R3980n2816
22813g4725j33111l5284Q9803N3031l4467j24208O9036q2752j6635Q0062J94828
22802a4422O7943l1107q9005O5136r1265j0512P2240m2893L6691J78250P057j23363
22790B4750k00592M8096J56309J84341j28221j91768J2152O0666m6497j76666
22780b57430K5605J07898J47927o631j11407Q1150J19435l6187K0039O3700J8085
22769A72184p7700J164J02192N0711L8487J9672k8012k11614J0655k18909Q509
22758a32661O678j1690J98725J86848p5726k27472o0298J02761n367j39858j19465
22747b77525Q064K34700J13787K6542N5593j11487j73757K1982K11706J25052
$$ plain form
22824 -36347 97310 994 29902 123543 170924 44521 -126122 -172578 -115889 -21909 -74725
22813 -74725 -207836 -243120 -153317 -100286 -134753 -258961 -189925 -272677 -289312 -209250 -14422
22802 -14422 53521 22414 -66591 -1455 -92720 -103232 -30992 -73885 -37194 141056 148113 24750
22790 24750 -175842 -127746 28563 212904 84683 -107085 -94933 -34267 -80764 -257430
22780 -257430 -231825 -123927 24000 17369 -94038 -12888 106547 70360 90399 154099 172184
22769 172184 94484 95648 197840 248551 287038 306710 278698 67084 77739 -141170 -132661
22758 -132661 -125983 -137673 61052 247900 172174 -55298 -115596 -12835 -18202 -158060 -277525
22747 -277525 -269461 -34761 79026 105568 161161 49674 -124083 -102101 109605 234657
22737B34657j49518j12172o3115m2226O3950L2713q0602p944l8356j4436K1943
22726a55106K16563J83862m9269N2352k7350j53144o9446j6426j95287j09582
22716c22833J48768J00860L832K8464j6683O8151Q8756j11843k010J00387J3947
22705I9796J01098J8923j1071P6191P4736p5406j55505m4379j4959L8145j09187
22694a618l8900n6351o7432L8827M7652O8775J7956N9407j4314k27476m226k0585
22682a98285p4496K03977k2694k4746j16700R9546P3263M1314K3401j3348J18627
22671A09859k1199j62938q198N7930l1232j34116o9022j08172Q4748K06222P0781
22660e337j09715M1601J04881k2580l3368L3249Q4024m1712j23670L1432N6842
$$ plain form
22737 234657 85139 -27033 -90148 -132374 -68424 -35711 -116313 -124257 -162613 -177049 -155106
22726 -155106 61457 245319 196050 248402 221052 67908 -1538 -17964 -213251 -322833
22716 -322833 -174065 -73205 -69373 -40909 -57592 10559 99315 -12528 -14538 85849 99796
22705 99796 200894 219817 208746 284937 359673 284267 128762 84383 69424 107569 -1618
22694 -1618 -40518 -96869 -164301 -125474 -77822 -9047 8909 68316 54002 -173474 -177700 -198285
22682 -198285 -272781 -68804 -91498 -116244 -232944 -133398 -60135 -18821 4580 -8768 109859
22671 109859 88660 -74278 -82476 -24546 -55778 -189894 -258916 -367088 -282340 -76118 -5337
22660 -5337 -115052 -73451 31430 8850 -24518 8731 92755 51043 -72627 -41195 15647
22649A5647q1027K06p5019k10635j4564J81048K07772m8052j12462n3238K11480
22638B1156Q9454K9775p6955p1350O7829N9510o5390m141K3133p1289j37153J7637
22626a17784j24431m3842O2725J63062p9180J6417P4009J191r3281J78680J11072
22615A48638j34242r5922M8703l0639N2908n0607P4556J25076J47422o3896k19330
22604B667j16636m2932O6990J50980J3957j26410k44127n498J73360O5667j5514
22593g7496m1808n3162j4050O1973l1015j1450j10493K9725L00401J47875r5515
22582A04985q2604m1608k120r4116o3951K9509J41145K84726m026q8066j14326
22571F9548r5618k1565n205K2970j78348J63504J07061o351p5826J1476k2016
$$ plain form
22649 15647 -65380 -65174 -140193 -350828 -365392 -184344 23428 -24624 -137086 -190324 21156
22638 21156 110610 140385 63430 -7920 59909 119419 54029 49888 73021 1732 -135421 -117784
22626 -117784 -242215 -286057 -223332 -60270 -139450 -123033 -49024 -47833 -141114 37566 148638
22615 148638 14396 -81526 -32823 -63462 -10554 -61161 13395 138471 285893 221997 2667
22604 2667 -113969 -156901 -89911 61069 75026 -51384 -295511 -301009 -127649 -61982 -77496
22593 -77496 -119304 -172466 -186516 -124543 -155558 -167008 -277501 -247776 52625 200500 104985
22582 104985 22381 -19227 -21347 -115463 -179414 -149905 -8760 275966 271940 183874 69548
22571 69548 -26070 -47635 -52840 -29870 -208218 -44714 62347 55996 -19830 -8354 -30370
22560c0370j25037q3936J11559O4412J49324J47191r2133p5956J14367J67526
22550C46947j94282k04133j82011k7771P9775j93643L4919J43612L6427j52392
22540c12552R863J88502J39019R3738K8702j44239l54215M2397Q6114P6603Q6417
22529e9651L6000K53120R7096k01662j82148n1252O9473j13690m6872P1066q5148
22518b13668K998j34351j76168J5669q875J23649J55303l6991L7293J54512J06212
22507B5583j04284N4095R4123M0726N5079L4383J04577j39538k2267o1021L8882
22496A20338j40943j11385j3112K12826r0171j08747J8723n8199R8504J17961
22486D5795N6291K4751j16736r4198L4245R7240j00423L8032J0597N9975m7705
$$ plain form
22560 -30370 -155407 -239343 -127784 -63372 85952 233143 141010 65054 179421 346947
22550 346947 152665 -51468 -233479 -261250 -181475 -375118 -340199 -196587 -160160 -312552
22540 -312552 -302689 -114187 24832 118570 147272 3033 -351182 -308785 -222671 -146068 -59651
22529 -59651 -23651 229469 326565 124903 -57245 -108497 -39024 -152714 -199586 -128520 -213668
22518 -213668 -210670 -345021 -521189 -505520 -514395 -390746 -235443 -272434 -235141 -80629 25583
22507 25583 -78701 -24606 69517 110243 165322 199705 304282 164744 142477 81456 120338
22496 120338 -20605 -131990 -145102 67724 -22447 -131194 -112471 -170670 -72166 45795
22486 45795 102086 126837 10101 -84097 -49852 47388 -53035 -15003 -4406 55569 7864
22475G864j24769q2634K4266P5841j6308J12634Q2675r0348L6238j14834l8178
22464a27553K83127O0090m9929n8701O3030l7628N3924j7789j05887n5457o8530
22453f1303J4799l2950J30753P058n8920j9328J64565m1675j10472J09544N2673
22442A54744j45034q6131J50226K44705o2129j86511n7815m4069o5975M4687q6992
22431a40294K7725j2377J14001J23754O1610P0825k7995j13369j71567k5811J496
22420i2002p361p3416K2417R934J85312M571J0249j47411n6752L1316L8641J53249
22408G8747p2987R300K4463n4674j44207p6115P7924Q2786J47198j24317m5348
22397i7230r0471J29505k0146j66739Q7639J59186k41533r7740j29846J00628
$$ plain form
22475 7864 -116905 -199539 -175273 -99432 -115740 -3106 79569 -10779 25459 -89375 -127553
22464 -127553 155574 215664 165735 107034 170064 132436 186360 168571 62684 7227 -61303
22453 -61303 -46504 -79454 51299 58357 -563 -19891 144674 102999 -7473 102071 154744
22442 154744 9710 -76421 73805 318510 256381 69870 12055 -32014 -97989 -53302 -140294
22431 -140294 -112569 -124946 -10945 112809 174419 245244 217249 103880 -67687 -93498 -92002
22420 -92002 -99363 -172779 -150362 -140428 44884 49455 59704 -87707 -144459 -113143 -74502 78747
22408 78747 5760 15060 39523 -15151 -159358 -235473 -157549 -74763 72435 -51882 -97230
22397 -97230 -187701 -58196 -78342 -245081 -157442 1744 -239789 -337529 -467375 -366747
22387c66747R9652j720J06677K61261M0892q3193r4371M0713J073l366n9326j49981
22375b08436O4050J81037N0433L1904J74745m539j01479r8822j86405l37462j09327
22364e44301P6987J04216L54439J11724j06516M1987J78958j2924j01753q1297
22354B1520j57806o4797K8346r6447j3393O1156M7100J83099R9579j12112J03551
22343I9796j666m2533L111o2486j21082j85746K2736P6180J43119j9914o5466
22332a53951j63142L6989P1879L7561J82359j13164n221J27958Q4408k9837O3599
22321A39438q5914Q4851n4782j37745n4485M9146j8261n4222O8644Q0063Q8753
22310A05486J01385q4095k7836j3965r6626r739n4676l1837L46155o578M1714
$$ plain form
22387 -366747 -267095 -268815 -162138 99123 140015 56822 -37549 3164 4237 871 -58455 -208436
22375 -208436 -144386 36651 87084 118988 293733 289194 187715 88893 -97512 -434974 -544301
22364 -544301 -467314 -363098 -8659 103065 -3451 38536 217494 204570 102817 21520
22354 21520 -136286 -201083 -172737 -269184 -282577 -221421 -174321 8778 108357 -3755 99796
22343 99796 98130 55597 58708 -3778 -124860 -310606 -287870 -211690 -68571 -88485 -153951
22332 -153951 -317093 -280104 -208225 -170664 11695 -101469 -106690 21268 105676 75839 139438
22321 139438 53524 138375 83593 -54152 -108637 -59491 -77752 -131974 -63330 16733 105486
22310 105486 206871 122776 94940 80975 -15651 -25390 -80066 -111903 234252 227674 269388
22299B69388r9935l00928j68547J26347L16993p0612l5984L7637k35506K5534
22289a35613K58056j5353k10903k235J10215O5799k3274r1890o6728K21060k8739
22278H0395n9613K1979j0283j24703j47051J81242K9924j25858n6747M6786P821
22267a56108j6702R2620L5298L1736Q310m90l3361j18246L2147J29959j2507K5451
22255A8107j64301r8141M5165O3075k2524L7656j09965l9559L5333j40219N9363
22244c16010J47020p593O3577N8996J10647R4326Q8005r5850m701j57287j66226
22233a85096o7216k7097J28875J10178L8328J007N2489Q5391r0063j33828R4393
22222G361O4816o1001m5534j80844j1186L10239K6572l30316J3333J81237j15038
$$ plain form
22299 269388 169453 -131475 -300022 -173675 143318 72706 36722 74359 -161147 -135613
22289 -135613 122443 107090 -103813 -106048 4167 69966 46692 -45198 -111926 109134 80395
22278 80395 20782 42761 32478 -92225 -239276 -58034 -28110 -153968 -210715 -163929 -156108
22267 -156108 -172810 -80190 -44892 -13156 -4846 -5336 -38697 -156943 -124796 5163 -7344 18107
22255 18107 -146194 -244335 -199170 -136095 -158619 -120963 -230928 -270487 -235154 -375373 -316010
22244 -316010 -168990 -176583 -113006 -54010 56637 150963 238968 143118 138417 -18870 -185096
22233 -185096 -252312 -279409 -150534 -40356 -2028 -1021 51468 136859 46796 -87032 7361
22222 7361 72177 11176 -34358 -215202 -226388 83851 110423 -219893 -206560 -25323 -140361
22211a40361k01552K14912J98260o5969n9784p1507j27322K3105J14969P1963
22201d3286L3907k5158j9165j1264L7432j1433k1985j7207l4639J8326k8375o0721
22189a83568J06241N3060j09332N9322J43829l6297J6631M3511n51n5276r1865
22178e4295M0611j53129M2773l2287n2753o8114J54203K03103m8445l29063j21799
22167d19195J58536J10981J4481o389R0061Q7712R2443Q1607q4239k60063J4462
22156a19603Q6669J69725o5698k5137K33577L6140l5767k59536k39724l9093m3074
22145c01521R0020J4283J37760M0328l8353J05236J4660J06442N2920J88531l3045
22134C77261j20696j02028k02824J03536J27267j21737l9203Q8425j24371j43170
$$ plain form
22211 -140361 -341913 -127001 71259 5290 -54494 -126001 -253323 -230218 -115249 -43286
22201 -43286 -9379 -34537 -53702 -64966 -27534 -38967 -60952 -78159 -112798 -94472 -122847 -183568
22189 -183568 -77327 -24267 -133599 -74277 69552 33255 49886 93397 92846 37570 -54295
22178 -54295 -13684 -166813 -124040 -156327 -209080 -277194 -122991 80112 31667 -297396 -419195
22167 -419195 -260659 -149678 -135197 -141586 -51525 36187 128630 210237 125998 -134065 -119603
22156 -119603 -32934 136791 71093 45956 279533 315673 279906 20370 -219354 -258447 -301521
22145 -301521 -211501 -197218 -59458 -19130 -57483 47753 62413 168855 221775 410306 377261
22134 377261 256565 154537 -48287 55249 182516 60779 21576 110001 -14370 -157540
22124a57540O9867J07147O7987o8069j2558K32487R4006j2711o2417j255j90482
22113F6462p5277J38770K7194O0498o8277p232m1725O5103m2417j19747p333r023
22101a3004l9960q8638p5183N6669n8658K0712r430J29732P347k9829j31567r2166
22089c23975Q7604k48516k5412J92936L0462q12J31918O5281j55262Q4882Q3255
22078g7639R502J4525J04686J10849J83765J84847j06115p1199l9598j76515j31235
22067E873J7193Q8457l139j11800Q643M7776m0458K1902k8911l2952r3780Q1923
22055c9273l3169j57375O348L4053p9049p3846J42225m3974Q0183J36374n3038
22044h0541k74194Q2898K87634N3725k7752M2764j21445k0140j17416R3028J15066
$$ plain form
22124 -157540 -87673 19474 87461 19392 6834 239321 333327 320616 258199 256944 66462
22113 66462 -8815 129955 157149 217647 149370 142138 100413 165516 123099 3352 -3981 -13004
22101 -13004 -52964 -141602 -216785 -160116 -218774 -198062 -207492 -77760 -70413 -100242 -231809 -323975
22089 -323975 -236371 -484887 -510299 -317363 -286901 -287713 -155795 -90514 -245776 -160894 -77639
22078 -77639 -68137 -53612 51074 161923 345688 530535 424420 353221 313623 137108 5873
22067 5873 23066 111523 108384 -3416 5227 53003 12545 34447 5536 -27416 -121196 -39273
22055 -39273 -72442 -229817 -223469 -189416 -268465 -342311 -200086 -244060 -163877 -27503 -80541
22044 -80541 -354735 -271837 15797 69522 41770 84534 -36911 -57051 -174467 -81439 33627
22033C3627K2563J07804j31899O7466O6674j48861R8362L4312k6709j01985O9811
22022I1165l4610j60863j05650J82689m8050O7755J43348k0011L0152J45725j8021
22011B73629k4065j14892j85420J1506R7039J3532J09948j1414q3850J61875J1537
22000B59425p2803j58613j4237n2306j9013q5273p6270J92932K4690J0285M3829
21989E2646M3831p119J0978J1931j86883J5989q8262M2611P8227l7272L3044K04611
21977A74332P2340Q1043q0537j32138k57295j18873O13p4288J25600R5521M6837
21966f6845L8329j02221N8910N2080l2048J04726J92402j35813k03147N8962p8664
21955a13329j07551K9670R5754R548J6876L2503l5711K8913J41098k1434r4473
$$ plain form
22033 33627 56190 163994 32095 99561 166235 17374 115736 150048 123339 21354 91165
22022 91165 56555 -104308 -209958 -27269 -75319 -7564 135784 115773 145925 291650 273629
22011 273629 249564 134672 -50748 -39242 57797 71329 181277 169863 86013 247888 259425
22000 259425 186622 28009 13772 -38534 -57547 -142820 -219090 -26158 -1468 8817 52646
21989 52646 96477 89358 100336 112267 -74616 -58627 -146889 -104278 -26051 -63323 -30279 174332
21977 174332 246672 327715 247178 115040 -142255 -261128 -260515 -334803 -209203 -113682 -66845
21966 -66845 -28516 -130737 -71827 -19747 -51795 52931 245333 109520 -93627 -34665 -113329
21955 -113329 -220880 -191210 -95456 -85908 -69032 -36529 -72240 -43327 97771 76337 -18136
21944a8136N3588m2698m0296J7905j66266J8612J11698Q6317J5084M8777j9964
21933F4621n0783j36727n6102L7203k1792J08381P6201Q7166j4235j68855l7475
21922a12397n1837O2408J11628j1286k624N6749J28479q0750q4836j7962r275
21911a1703K6839O903N7399J02754j13931j1509p0368q2972q6331J19043J06120
21900D2244M0567L2499M2130J5812j22543k1973K2845N7937j61233N8867L2432
21889C9584j36225P2225R8247J0032j09509L4466J4497l218q4638n9437k4565
21878a48541k8818K19324Q2732r4495J03793K6823r9062o6999K8854m2008M0591
21867B2194Q1490j08627k06444j7225O3950k5680j15646J83481M6706k7814r8300
$$ plain form
21944 -18136 35452 -7246 -47542 -29637 -195903 -177291 -65593 20724 35808 84585 64621
21933 64621 13838 -122889 -178991 -141788 -163580 -55199 21002 108168 93933 -74922 -112397
21922 -112397 -164234 -101826 9802 -1484 -4108 52641 181120 100370 15534 -2428 -11703
21911 -11703 15136 22039 79438 182192 68261 56752 -13616 -96588 -182919 -63876 42244
21900 42244 82811 115310 157440 173252 50709 28736 51581 109518 -51715 7152 39584
21889 39584 -96641 -24416 73831 83863 -25646 8820 23317 20099 -64539 -123976 -148541
21878 -148541 -177359 41965 124697 30202 133995 160818 61756 -5243 23611 -18397 22194
21867 22194 103684 -4943 -211387 -228612 -164662 -190342 -305988 -122507 -75801 -103615 -201915
21856b01915q4562J52610J88497j3048r7033J055J41476M8704P139Q8644n270
21845B26297N3346k21715l20295k0882J06118J08718J59645q8815j53185j52619
21835c03387j66743M5497J85012n711M9389K7082Q6251J41983o9515o583j2328
21824b9053m8193n049j75692K6651J18626m4061J26329J99674N757n6299M0240
21813A58930p0580K930k0016k75757J76787K36429j90757n769J89334j9749J01507
21802B83289k7567q6377q4738l4662j01946p5229L6928J12214P354j50504J826
21791a19412K07363j9559l0711J6460K6318j9393p9442L8836J08649P1886k7097
21780A73898j74174j54850k6150J87909l8064p9256o3186j3644M9835Q8941J6166
$$ plain form
21856 -201915 -286477 -133867 54630 41582 -55451 -54396 87080 135784 142923 231567 226297
21845 226297 279643 57928 -262367 -283249 -177131 -68413 91232 2417 -150768 -303387
21835 -303387 -470130 -424633 -239621 -245332 -195943 -168861 -82610 59373 -10142 -16725 -29053
21824 -29053 -77246 -82295 -257987 -231336 -112710 -156771 -30442 169232 174989 118690 158930
21813 158930 88350 91280 71264 -204493 -27706 208723 17966 12197 201531 181782 283289
21802 283289 255722 169345 84607 49945 -52001 -127230 -90302 21912 29266 -121238 -119412
21791 -119412 87951 68392 37681 54141 80459 61066 -18376 20460 129109 200995 173898
21780 173898 -276 -155126 -181276 6633 -31431 -110687 -173873 -187517 -137682 -48741 -32575
21769c2575m8191o0617n3222L2587j01094r7008j44115M545J36650J46617Q1775
21758a34648O1047m3773N1223j28480q6287R3704P3922J2312J88567L3501Q2357
21747B03445n2663M9763k7112j08757j83297o0429m6986k9667J53518J84245o1494
21736B0566R3920n6549J8222Q7697m2657j55047J1465J34939J1237K9719J01835
21725B55347k93359j64434P4051j6692J12053M1423o9324m012j4566p9096o5384
21714b23993R7145Q2872o3669p1940J34760L6338M168N6343K6815J05701J17994
21703C02534r7266q0344O3886l0113N1359n3197j07268r6564j96097J4605L1859
21692a96606J35511J35572n1843j26736k05906Q3663K18002j4329K4534j30742
$$ plain form
21769 -32575 -80766 -141383 -194605 -162018 -263112 -360120 -504235 -499690 -363040 -216423 -134648
21758 -134648 -73601 -117374 -66151 -194631 -280918 -187214 -113292 -100980 87587 121088 203445
21747 203445 150782 200545 173433 64676 -118621 -179050 -226036 -255703 -102185 82060 20566
21736 20566 114486 57937 76159 163856 121199 -33848 -22383 112556 123793 153512 255347
21725 255347 -38012 -202446 -128395 -145087 -33034 8389 -60935 -64947 -79513 -158609 -223993
21714 -223993 -126848 -43976 -107645 -179585 -44825 -8487 -4319 52024 78839 184540 302534
21703 302534 205268 124924 188810 158697 210056 156859 49591 -46973 -243070 -228465 -196606
21692 -196606 -61095 74477 22634 -104102 -310008 -226345 -8343 -22672 1862 -128880
21682a28880k3373r4568K0800P8881L3871J62791K3795k4754K8119N3331J08264
21671B38277O2142j22714M614Q4206n5762J971r1482J6674k3229j0788m6470n140
21659E2299R9170Q9242k3839p0706L0955n9438j67019p0412J2323n1408N0966
21648a07867j3484L7532P3446Q7559n3034k10218K9855K2672J48387J7612o6848
21637c4388J07178J15234j44917k08568R7334J21925m2126l2428M3216M0137j54954
21626i2357J0679P1474r1627P1275o3445p2956J13800l0307j33610o0723J24509
21615a53288P3841k4290j61049M3813L0540K1861K55591K28446j34045j6686j72750
21604h016P9822P9673j15175J0000k6722M0712R2537l7241o8951K6311k50544
$$ plain form
21682 -128880 -152253 -246821 -226021 -147140 -113269 49522 73317 48563 76682 130013 238277
21671 238277 300419 177705 182319 266525 210763 212734 121252 137926 114697 103909 57439 52299
21659 52299 151469 240711 216872 146166 177121 117683 -49336 -119748 -107425 -158833 -107867
21648 -107867 -121351 -83819 -10373 77186 24152 -186066 -156211 -133539 14848 32460 -34388
21637 -34388 72790 188024 43107 -165461 -68127 53798 11672 -20756 22460 62597 -92357
21626 -92357 -81678 -10204 -101831 -30556 -94001 -166957 -53157 -83464 -217074 -277797 -153288
21615 -153288 -79447 -103737 -264786 -220973 -190433 -168572 87019 315465 181420 164734 -8016
21604 -8016 71806 151479 36304 46304 19582 60294 152831 115590 46639 72950 -177594
21593a77594k32786K1098K16268K66456R9163l0721j29325j04257K4931j02966
21583a49733o1958J56987m132R879K07980o7469j39965o8121j05754j30645J20661
21572b32270J21394O5702R9723O1380M3499R7536j98113j25285l1501j5042J3533
21561i9444p3918P8166N1211K5795m7891k30932q4991K10815J21230r927j9600
21550g9486l6835m3754k6492J07843j6619j49993L4676J15897J72146O6301L8009
21539A81693j34657j41230o852O9528J63782J4002q2047n8736k2823J04095L8023
21528A24778j60617j14284J13225M7012q0874J04932J21919n4818L9307P2010
21518B12590J01695n8855j28143m9326r2173j97097P3482J39775J26628j4511
$$ plain form
21593 -177594 -410380 -389282 -173014 93442 192605 161884 32559 -71698 -46767 -149733
21583 -149733 -211691 -54704 -58836 -48957 159023 91554 -48411 -116532 -222286 -352931 -232270
21572 -232270 -110876 -45174 54549 115929 159428 256964 58851 -66434 -97935 -112977 -99444
21561 -99444 -173362 -95196 -43985 -18190 -66081 -297013 -382004 -171189 -49959 -59886 -79486
21550 -79486 -116321 -160075 -186567 -78724 -95343 -245336 -210660 -94763 77383 143684 181693
21539 181693 47036 -94194 -101046 -31518 132264 146266 64219 5483 -17340 86755 124778
21528 124778 -35839 -150123 -36898 10114 -70760 34172 156091 101273 140580 212590
21518 212590 314285 255430 127287 77961 -14212 -211309 -137827 1948 128576 114065
21508A14065r1733l0689o102P7357p3027q5609K7177N6165K6833J14542J22672
21497B51651L3038J01987L5136m5666k07764j09003l1350j48005m8910n8798J07041
21486a20643J47453L5497j75353N0883O3911m7520J0108m1088o0290j18404N0359
21475b05087R5561O885L6182J25870Q0215O1032J74867q3546m2457n648j14471
21464A29403l07219R1452O5523K6073J372o6037Q2718n7407n246P7801j22838
21453h4405o0587N186P8958N8719j4982J5356j4682j20373q3756r2038J32775
21442a79829J21958N0625O2400p1037o6670J38362R6065L2100m9015Q489j7693
21431A25755O5148r8264j14639J0208J7496l7801j18228l7218J0276J15077J90382
$$ plain form
21508 114065 22332 -8357 -14459 62898 -10129 -95738 -68561 -12396 14437 128979 251651
21497 251651 284689 386676 421812 376146 168382 59379 28029 -119976 -168886 -227684 -120643
21486 -120643 26810 62307 -113046 -62163 1748 -45772 -35664 -76752 -137042 -255446 -205087
21475 -205087 -109526 -102641 -66459 59411 139626 200658 375525 291979 249522 243874 129403
21464 129403 -177816 -86364 -20841 5232 6604 -59433 23285 -34122 -39368 38433 -84405
21453 -84405 -144992 -139806 -60848 -2129 -17111 -1755 -16437 -136810 -220566 -312604 -179829
21442 -179829 -57871 -7246 55154 -15883 -82553 55809 151874 183974 134959 143448 125755
21431 125755 190903 92639 -22000 -11792 5704 -32097 -150325 -187543 -177267 -62190 128192
21420A28192P74O4639P2549j69018j43233j37007j2087O0924J4418j65239J65038
21409a20050K57070M3489p6344j50065p9455j8412Q1883L9068J32038K557K318
21398A14097R0378p991n5693j67029n4770O1277R7657J06692j06086J6914q3461
21387A1985j91108O7566M275j79502n0460J01285N4634J70300J5470p5972j48468
21376b19995O9157Q7074K32447J03680j82845k74575l1804J23719J10849L9237
21366E6944j3795O1436O3611p9978q9006Q7419N6285k9427k0697p4310M5524N422
21354F9428p4485p2613m785J22919P535m5494L9638O3892M5104j84504k28998
21343b62363k97996J11902K25556J64188O1565k5055J23527k8378n1810j35432
$$ plain form
21420 128192 128966 193605 266154 97136 -46097 -183104 -195191 -134267 -119849 -285088 -120050
21409 -120050 137020 180509 104165 -45900 -125355 -143767 -61884 -22816 109222 111779 114097
21398 114097 204475 196484 140791 -26238 -81008 -19731 77926 184618 78532 95446 11985
21387 11985 -179123 -111557 -107282 -286784 -337244 -235959 -181325 -11025 4445 -71527 -219995
21376 -219995 -150838 -63764 168683 272363 89518 -185057 -216861 -93142 17707 56944
21366 56944 43149 104585 168196 88218 -788 86631 142916 113489 92792 18482 64006 69428
21354 69428 -5057 -77670 -82455 40464 47999 2505 42143 106035 151139 -33365 -262363
21343 -262363 -560359 -448457 -222901 -58713 2852 -22203 101324 72946 21136 -114296
21333a14296j97076j46285O4608R5605J85983O791j79837L8194J43793Q6014j11881
21322a28387j81470k6258N6810K3107o674P0550J09463J12846N2659J09332o9776
21311A22202O4172O8682N1424k04959q3332l7104M9191J74042l5712J09969o3680
21300B14895j14677k1252r6384m167l55n3494J37573J10174J08346K0512j05207
21289A95964o0548r5308k5727l4312R2130J5203j25433J9028R2405N6708K2251
21278A52361q7575p7480p094l7758Q2919Q4916r5265j525J03140J6220j49693
21267a6834J12326O6318J26292j0430k8404N4877k266n4971k0524K2253l8866
21256B09771n9457K07042n7102k34828j39364j85174j10484J43166N6318N9613
$$ plain form
21333 -114296 -311372 -457657 -393049 -297444 -111461 -104670 -284507 -246313 -102520 -16506 -128387
21322 -128387 -309857 -336115 -279305 -256198 -262872 -192322 -82859 29987 82646 191978 122202
21311 122202 186374 255056 306480 101521 18189 -18915 30276 204318 168606 278575 214895
21300 214895 100218 78966 -17418 -21585 -21940 -75434 62139 172313 280659 301171 195964
21289 195964 135416 40108 14381 -19931 72199 87402 -38031 -19003 73402 130110 152361
21278 152361 64786 -12694 -19788 -57546 25373 110289 15024 13499 116639 132859 -16834
21267 -16834 95492 161810 288102 277672 249268 304145 301879 246908 226384 248637 209771
21256 209771 150314 357356 300254 65426 -73938 -259112 -369596 -226430 -170112 -110499
21246a10499L5811J06315J03585j44805O433O8512O5822o4026j59050m0982R136
21235a23748J40063m087j05503R2216J04320J1171m6843r5846R2294J34153p9509
21224A18681m3778j98330k09910j6665J01059M1726m2725J02907J58499J1916
21214B3380R7468p0495O5946M0792j37952j10473j58545K16373J50862P9344q0960
21203A15740j83250K22289K28433l2991L4973j6617j38152q1557j61560j95714
21193b08406l9657l6971N7082l605p1782R3758j02728k30544J11757J57899K51241
21182b1956K48279q9787j02210K402j54199m9193j8267j52530J30117J1856J9576
21171a75912J19765K8919j00611q566J02848K34826N9386l3405j34425n018K1228
$$ plain form
21246 -110499 -74688 31627 135212 -9593 -3160 65352 131174 67148 -91902 -132884 -123748
21235 -123748 16315 12228 -93275 -1059 103261 114432 67589 -28257 64037 198190 118681
21224 118681 74903 -123427 -333337 -350002 -248943 -207217 -249942 -147035 11464 23380
21214 23380 120848 50353 116299 157091 19139 -91334 -249879 -33506 117356 196700 115740
21203 115740 -67510 154779 383212 350221 385194 368577 230425 148868 -12692 -208406
21193 -208406 -248063 -285034 -227952 -231557 -303339 -209581 -312309 -542853 -431096 -273197 -21956
21182 -21956 226323 136536 34326 36728 -117471 -166664 -184931 -337461 -207344 -195488 -175912
21171 -175912 -56147 -27228 -127839 -136405 -33557 201269 260655 227250 92825 87807 109035
21160A09035o6903P5298o659j43973j01567P0469P8493j12636J0946o9555J0020
21149a47032q710Q1240L2848J37683R4276j51416j79073N7992K3188n3809J96146
21138H3333Q8236J11760j11072j92617l1196J05613J30809l022j03267n4549K15880
21127B39908L4249j77431r5227o3975J5715n353K7381Q8933j6528n1093r1659
21116i5080m7023q3985K22618L38691K8664j53379o4574J77301o2587j13368j55147
21105g869j1758J46867M5232K1776N6860N688m6172K4868p1219j75089o5718K2339
21093e4195j44563m3774J76349O2774K5733M0891j4785K8921n8897Q119q1238
21082e4665O0598j8065k9030M2365L5974J27759j54061r7922J08288l4864p95
$$ plain form
21160 109035 42132 117430 110771 -33202 -134769 -64300 14193 -98443 -87497 -157052 -147032
21149 -147032 -155742 -74502 -41654 96029 190305 38889 -140184 -82192 -59004 -112813 83333
21138 83333 171569 283329 172257 -20360 -51556 54057 184866 181844 78577 24028 239908
21127 239908 274157 96726 1499 -62476 -46761 -52114 -24733 64200 47672 -3421 -95080
21116 -95080 -142103 -226088 -3470 335221 363885 210506 145932 323233 260646 147278 -7869
21105 -7869 -19627 127240 172472 194248 251108 256796 210624 235492 164273 -10816 -76534 -54195
21093 -54195 -198758 -242532 -66183 -3409 22324 63215 48430 77351 18454 26573 -54665
21082 -54665 5933 -12132 -41162 1203 37177 164936 10875 -87047 21241 -13623 -14418
21071a4418m2132Q6503l0470R1222r5722p5573j7369r8024q9510J9852J74685
21060i0956p562J5464J42346J4977j10746K8260j63025o328J67100k3920q7582
21049a21972J00270J04856L0200R3399M7650j98371j42171n010R8955J19171R346
21038A36323M3451Q2311k44221k37098K6047J55122K9711P793J05784j01631k21588
21027b17996M5627M7390O1424L3797Q2657K6263n1394q1142K5274L655K31463
21016B07018P3819o8293N2886Q5988o1114j30159j01135J7302N9883J9238P7256
21005B32689j9709j71157o4300L7277K6796j95414l5310L86Q5112M6325R711J75600
20993A28006J40176j49007j92017n961J48340J6226K3944j7323m7738j70302k6798
$$ plain form
21071 -14418 -56550 29953 -517 90705 -5017 -80590 -97959 -195983 -285493 -265641 -90956
21060 -90956 -98518 -83054 59292 74269 -36477 -8217 -171242 -177570 -10470 -34390 -121972
21049 -121972 -21702 83154 113354 206753 254403 56032 -86139 -91149 7806 126977 136323
21038 136323 179774 262085 17864 -219234 -193187 -38065 -8354 -561 105223 3592 -217996
21027 -217996 -172369 -124979 -63555 -29758 52899 79162 27768 -53374 -28100 -24445 207018
21016 207018 280837 212544 265430 351418 290304 160145 59010 76312 136195 155433 232689
21005 232689 212980 41823 -22477 14800 41596 -153818 -189128 -188742 -103630 -57305 -47594 128006
20993 128006 268182 119175 -72842 -78803 69537 85763 109707 92384 44646 -125656 -152454
20982a52454j27754R1709J82145J58869K8183K950k00641k25326j07854K41672
20972a08501J55300N9498j78014q1220P9328m5533j62650M9144R1917K5296j01325
20961b16760j21310Q5961J65307q6801l7039P4733J76541m0930M4293N7037r196
20950I1836k28521K866O235n5785K30392R9776K606k8079K34517o4951k22400
20939F8492j59171j2315K27190J52857j65726j85510j4446l4073M0516J05964
20929B3778K13778J34136n1931l04197Q473p6149l8347o3687O038J64194L6306
20918E2392Q8558Q0843j9206R917m9954M8382m9722r6671R1257l2410J11510R9969
20906C34865j59098k41825J91021P0686o3567n9004N2650J0351J15350Q9437N4056
$$ plain form
20982 -152454 -280208 -188499 -6354 152515 180698 183648 -16993 -242319 -350173 -108501
20972 -108501 46799 106297 -71717 -152937 -73609 -119142 -281792 -232648 -140731 -115435 -216760
20961 -216760 -338070 -252109 -86802 -173603 -210642 -135909 40632 -298 43995 101032 91836
20950 91836 -136685 -133819 -127584 -183369 47023 146799 149405 121326 355843 290892 68492
20939 68492 -90679 -102994 124196 277053 111327 -74183 -88629 -122702 -82186 23778
20929 23778 237556 371692 319761 15564 24037 -52112 -90459 -154146 -148108 16086 52392
20918 52392 140950 221793 202587 212504 162550 210932 161210 64539 155796 123386 234896 334865
20906 334865 175767 -66058 124963 195649 132082 73078 125728 136079 251429 340866 394922
20895C94922k31280P4213Q5312j89800l56189m4587k2309L7248m351O7320q1260
20884b70761R3967M4061j05113J58483N4563J42097K13271K186r9427j74680Q7024
20873A45671K4748M5041o3797j06867j58626J31594P3698l4111o9959J6907L0396
20862C4695n395l5471J28641J02238J0899n1296k13669r2678J98252M4215k5191
20851I5240J47319j46373n8245K7990m2149l0934J2666J58421J67663N1322o6791
20840C16129j75435r1021j46812P7778M8111j26880L9146j9648Q5007K04836K5946
20829B37157j35620q602p4660n3960p589j68518R0488J66246N7534R0685k2934
20818A70227k2518j1530L8883n3349m5109j9661n997J19930L0682j27250j6091
$$ plain form
20895 394922 163642 237855 323167 133367 -222822 -267409 -289718 -252470 -256821 -189501 -270761
20884 -270761 -176794 -132733 -237846 -79363 -24800 117297 330568 332754 233327 58647 145671
20873 145671 170419 215460 151663 44796 -113830 17764 91462 57351 -12608 4299 34695
20862 34695 29300 -6171 122470 224708 235607 184311 -29358 -122036 76216 120431 95240
20851 95240 242559 96186 37941 65931 23782 -7152 5514 163935 331598 382920 316129
20840 316129 140694 49673 -97139 -19361 28750 -98130 -58984 -78632 6375 211211 237157
20829 237157 101537 92935 18275 -35685 -43274 -211792 -121304 44942 102476 193161 170227
20818 170227 147709 136179 175062 121713 76604 56943 50946 170876 201558 74308 58217
20807E8217N1253l4017j23275r0625j9327N8479l6076o9631N2150M3132O1404
20796d8316J40459m9905L1329R3227j31904j27381N3964p7365j01653o093J76317
20785d7321K57075P105o2045P9759k73772K1696K07572P149n2174J09726k9449
20774B25321j96301j47575R4991J98662p4106O0347J7653L2834l5891j19371p596
20763D8968P5455P5140M3623j37862o2488j10120o6049j31012j2468N5968P9714
20752a41131J53511j4779L6176j04087k8885j2270l9565J21460R7503P4182o7103
20741G5012j09640r3653j16313j34018j2084K10535J06029p5246n9070m7160O7670
20730a87938M6435K3420Q9318K39990M8358k28077j17969m0034Q8715J48290J6104
$$ plain form
20807 58217 109470 75453 -47822 -138447 -157774 -99295 -135371 -205002 -152852 -109720 -48316
20796 -48316 92143 42238 73567 166794 34890 -92491 -38527 -115892 -217545 -223638 -47321
20785 -47321 209754 216859 154814 234573 -39199 -17503 190069 197218 145044 254770 225321
20774 225321 29020 -118555 -23564 175098 100992 161339 178992 211826 175935 56564 48968
20763 48968 124423 199563 243186 105324 42836 -67284 -133333 -264345 -276813 -220845 -141131
20752 -141131 12380 -2399 33777 -70310 -99195 -111465 -151030 -29570 67933 142115 75012
20741 75012 -34628 -128281 -244594 -378612 -390696 -180161 -74132 -149378 -208448 -255608 -187938
20730 -187938 -141503 -118083 -28765 211225 259583 31506 -86463 -126497 -37782 110508 126612
20719A26612o3103k41188l8757L8768j07640P2716J36073J69203j51936q5415
20709a44667k339N4093P1797j55237K14637J66472O5429j30611l9906j71878p0525
20698a42735K1179O3714K73205O6357k08432J949Q0666j83845j56744M8769O552
20687a29365o519O6138J38614j36891j90502p5669J86823J88684O5690n1954m964
20676E0085J0348J21514j23776j52247M829p0969j98635j10908K28676R4331J19974
20665b6778J30815o0662L2008l859l698m2154n0830j7514K2345o854J17711L002
20653I3532J4902J02227j86226j65454M3800R0364J78489k0636J08N8032p1163
20642A37975j64694j6559M7664p1606J46498O2681j81582J16112L5966p9225M2433
$$ plain form
20719 126612 63509 -177679 -216436 -177668 -285308 -212592 -76519 92684 -59252 -144667
20709 -144667 -147006 -92913 -21116 -176353 38284 204756 270185 139574 99668 -72210 -142735
20698 -142735 -121556 -57842 215363 281720 73288 75237 155903 -27942 -184686 -135917 -129365
20687 -129365 -135884 -69746 68868 -68023 -258525 -334194 -147371 41313 107003 55049 50085
20676 50085 60433 181947 58171 -94076 -89247 -160216 -358851 -469759 -241083 -146752 -26778
20665 -26778 104037 43375 75383 71524 67826 25672 -25158 -42672 -20327 -27181 90530 93532
20653 93532 108434 210661 24435 -141019 -97219 -6855 171634 150998 151106 209138 137975
20642 137975 -26719 -43278 4386 -67220 79278 141959 -39623 76489 112455 33230 75663
20631G5663J60432J05802K2801r9049j20022j78446L2707Q7306J79992j45042
20621A22144o3613Q1813j51152j40201J16372J14666k8607R7746l125m342J70673
20610C12374J60741j67900k36067p0304j65243M0810J39429J36370j33445k32201
20600b15436P2506J40052J22829J1925L099m4727K2694J10801k2793J2191J2255
20589B25396j8105n2158j32620J09888o2005k15689j21607q4726k8206K63207
20579a16625J0554n2634r3438R9881J07543j15287K1750J12751Q495N3122N4597
20568I0709J3423K9060l7966O3678L4777j57079j60141k2321K08851K25382K6393
20557C14766n7032j64490l3126O7304J56631j9749P6876k83015j44941J17282
$$ plain form
20631 75663 236095 341897 364698 265649 145627 -32819 -112 87194 267186 122144
20621 122144 58531 140344 -10808 -151009 -34637 80029 51422 149168 146043 141701 312374
20610 312374 473115 305215 69148 -1156 -166399 -125589 13840 150210 16765 -215436
20600 -215436 -142930 -2878 119951 131876 134975 90248 112942 223743 200950 213141 225396
20589 225396 207291 155133 22513 132401 70396 -145293 -266900 -351626 -379832 -116625
20579 -116625 -106071 -158705 -252143 -152262 -44719 -160006 -138256 -25505 -17010 36112 90709
20568 90709 104132 133192 95226 158904 193681 36602 -123539 -145860 62991 288373 314766
20557 314766 257734 93244 60118 127422 284053 264304 341180 58165 -86776 30506
20547C0506J11964k5704j54150o8129L3341j9603O8530p521j25183K0830N0556
20536h4563n8061k9691K27541J8337m3795l7699L1659j35184P7408P3925O7260
20525A07137P1684R9452j04412k65299Q784K605J58427J39162J07506o2218j1144
20514B51684j0384o9450p8266r4971R2059J44592j49455j11620q1941k9222O5881
20503g1093J53409O0195k1530p7747K9922Q0413p0400o804O3000l7111J6915J5560
20491A34729j22697l2234O7986j48023l3115j05160n1193L0097L8638J78338q726
20480e1360M6491j9933J36963J03291J02933r2884p7113k16049J9528J11157K08901
20469B71925K3515k4168l6858M5719O7524J01367R3970M0843q778k3438L2596
$$ plain form
20547 30506 142470 116766 -37384 -105513 -72172 -91775 -23245 -30766 -155949 -135119 -84563
20536 -84563 -142624 -172315 55226 73563 29768 -7931 23728 -111456 -34048 39877 107137
20525 107137 178821 278273 173861 -91438 -82654 -80049 78378 217540 325046 262828 251684
20514 251684 241300 171850 93584 -1387 90672 235264 85809 -25811 -107752 -136974 -71093
20503 -71093 82316 142511 120981 43234 73156 153569 83169 76365 139365 102254 119169 134729
20491 134729 12032 -20202 47784 -100239 -133354 -238514 -289707 -259610 -220972 -42634 -51360
20480 -51360 -4869 -24802 112161 215452 318385 225501 148388 -67661 -48133 63024 271925
20469 271925 295440 271272 234414 280133 347657 449024 542994 583837 575059 551621 584217
20458E84217q8517N7470k154j53493J3068j43559j42828o2984j60413M332J30898
20447C6037J64744j24312k51607J43975M2354M1175o6529k30384j94116Q9396
20437c49267J19404l3244r7439J09185M9307O8471J02460n7003o4443Q9233J78700
20426A15364r7991R7425N5960R2005N8965R0009q2425j97163M2705j11808N5807
20415A18853l4279K9278j03805J2792L3966K5643J10372K16377j28840j9339j15062
20404A45956o5716Q252K2493J16191M4352r5325r8590j73832k9699J3968Q5843
20393b6107J08315j09080N9118R6263j51834O028p1219l6703K14763q2464J3897
20382B0977K7964p9086J3062M292L8073Q7001J40028J15968n4091J0639r9085
$$ plain form
20458 584217 495700 553170 551016 397523 410591 267032 124204 61220 -99193 -94861 36037
20447 36037 200781 76469 -175138 -31163 11191 52366 -14163 -244547 -438663 -349267
20437 -349267 -229863 -263107 -360546 -251361 -202054 -133583 -31123 -88126 -152569 -63336 115364
20426 115364 17373 114798 170758 262763 321728 411737 329312 132149 174854 63046 118853
20415 118853 84574 113852 10047 22839 56805 82448 192820 409197 280357 261018 145956
20404 145956 80240 88492 110985 227176 271528 176203 77613 -96219 -125918 -111950 -26107
20393 -26107 82208 -26872 32246 128509 -23325 -17297 -88516 -125219 89544 7080 20977
20382 20977 48941 -30145 -17083 -12791 25282 112283 252311 368279 314188 324827 225742
20371B25742k9275Q8736l1253j13142J10320l3229j54002J6147j19208j7670J7102
20360c9732o5146Q3965Q3913k4337J43341Q324j07620j65735m9387J76363J55450
20349A99399j85333j09020L7040M6695Q8876L3471j125Q2195J14053J36400j07133
20338C35518k43797r9052K0720n6622N1275l0185O4339J16976J02887L7761j02911
20327A96909j6457j0621p4407j27096J36680J49537Q3806j04574o1585r7255l5688
20316C9249m8484m4054R5269J30241J20685N2600m8464R2385J15750l7441j62478
20305C05258j53736l6726m3208Q4180J9182o4113j66144J19192J77623Q2069J3493
20294C37070q5426j70311J0886j01903n8139r2703r3215M8450R7012O0901J6172
$$ plain form
20371 225742 196467 285203 253950 140808 251128 217899 63897 80044 -39164 -56834 -39732
20360 -39732 -104878 -20913 63000 38663 182004 190328 82708 -83027 -132414 43949 199399
20349 199399 14066 -94954 -57914 -11219 77657 111128 110003 192198 306251 442651 335518
20338 335518 91721 -7331 13389 -43233 8042 -22143 42196 159172 262059 299820 196909
20327 196909 180452 169831 95424 -31672 105008 254545 338351 233777 172192 74937 39249
20316 39249 -9235 -53289 41980 172221 292906 345506 297042 389427 505177 467736 305258
20305 305258 151522 114796 71588 155768 174950 110837 -55307 63885 241508 323577 337070
20294 337070 251644 81333 92219 -9684 -67823 -160526 -253741 -205291 -108279 -47378 -31206
20283c1206r0314o8885O6030J92291M0977n1651j00455J1446j09273q6359R6538
20272a30861J26948O6251J40243O3696M7398j87422k3789j10282j448J14637R0062
20261A95433K2893o5006P56n8496m2576Q3548M8333M1180K10367R1874p2490j21667
20249C34149j15396r3560k1743p4707K065J84834J55401J5117o2281J790J19924
20238D45593J09809Q1090N3435r6014j25005k8272q4198j08765k5056n1777J7179
20227A88019J28214K26455j11073l1307q1240k6391p0620M3650Q9232j53129J3220
20216B15030P3863l454q9817j33815j32319k5504L8656R7506R4351R4287J3590
20205B42374j41944j02772N1348o969L3599P2963J182j09193l6263K37939J34164
$$ plain form
20283 -31206 -121520 -190405 -124375 67916 108893 57242 -43213 -31767 -141040 -227399 -130861
20272 -130861 -3913 62338 202581 266277 313675 126253 102464 -7818 -9266 105371 195433
20261 195433 218326 153320 154076 95580 53004 136552 184885 226065 436432 528306 455816 334149
20249 334149 218753 125193 103450 28743 30808 215642 371043 386160 323879 325669 445593
20238 445593 555402 636492 689927 593913 468908 440636 356438 247673 222617 170840 188019
20227 188019 316233 542688 431615 400308 319068 292677 222057 265707 354939 201810 215030
20216 215030 288893 285439 195622 61807 -70512 -96016 -57360 40146 134497 228784 242374
20205 242374 100430 -2342 49006 42037 75636 148599 149781 40588 4325 242264 376428
20194C76428j03723j29259p3509M980m0158k742k12170j40298L4731R4009K33852
20183D2141P2766j15845N1743P3204N1683j414o4208J7208j9018J56554P121m4735
20171B27200j32506j42587N9664Q2728j6240j01801J67236J098n9924r477l3763
20160D1628M1019J19886j11296M3946N0733J95610O3882L563j00037r3068k15531
20149D0335m9280K0143J9453j32530K31326L4577k12632r9416m7592N5661J51161
20138A1206K61888n0726j11618m2831j53520n114L7767J13288N309j85555M7821
20127g2085R3245K9441j9336P3245l9908J05361Q1966q982j28924J56866J4662
20116B85551j54151N9967j10807M0304P7337l6960m3727Q4591j80541k09917p096
$$ plain form
20194 376428 272705 143446 69937 74917 34759 32017 -180153 -320451 -285720 -191711 42141
20183 42141 114907 -938 50805 124009 175692 174278 110070 127278 108260 264814 271935 227200
20171 227200 94694 -47893 11771 94499 78259 -23542 143694 144792 84868 75391 41628
20160 41628 82647 202533 91237 135183 185916 381526 445408 448971 348934 255866 40335
20149 40335 -8945 11198 30651 -101879 129447 164024 -48608 -148024 -195616 -139955 11206
20138 11206 273094 222368 110750 67919 -85601 -90715 -52948 60340 65649 -119906 -72085
20127 -72085 21160 50601 31265 104510 64602 169963 251929 242947 114023 270889 285551
20116 285551 131400 191367 80560 120864 198201 161241 117514 202105 21564 -188353 -195449
20105a95449J38515m4898K28997J09251j29547j09143O7031O9479R1368j6604
20095B09000j18841N4888O1658o2268j41273m4840R0833J74678J16510n7036L4460
20084C17769Q3568j50402J4306L8442k5466j18790l0953p5690L1221P8315l6167
20073A26153l717r2490j50036R1355K02246o0564n1652J7245O6908j410P8376
20062B22414l3613l2086l7345q9122j35069K0381L1643L4848r9661O0563j8070
20051g5117n083P324J53855q4906k3802O6062L4735m4031o9973j1698p2609J13201
20039a2042k0129k4748n0105J59381J22618l2311k6687N6160j52762m3360J42063
20028A18078J7163k31077K3622J3891j4892L3977N1516N6988j64984J76966K35749
$$ plain form
20105 -195449 -56934 -101832 127165 236416 106869 -2274 64757 134236 225604 209000
20095 209000 90159 145047 206705 144437 3164 -41676 49157 223835 340345 283309 317769
20084 317769 401337 250935 265241 303683 278217 159427 128474 52784 84005 162320 126153
20073 126153 122436 29946 -120090 -28735 173511 112947 61295 78540 145448 144038 222414
20062 222414 188801 156715 119370 30248 -104821 -84440 -52797 -17949 -117610 -57047 -75117
20051 -75117 -80200 -72876 80979 -3927 -27729 38333 73068 29037 -40936 -52634 -125243 -12042
20039 -12042 -32171 -56919 -107024 52357 174975 142664 115977 172137 19375 -23985 118078
20028 118078 135241 -95836 -72214 -58323 -73215 -39238 12278 69266 -95718 81248 316997
20017C16997q1199j38425o332r5341j92474K6000K1968R4167J23398j64001j59278
20006b54520m1659J73612J86704R3837l0449p5867K2127J28999J2299j11216n7151
19995D6716M5233M364l09698k7877J97612O958P2661q741m5065R1403n7478r1841
19983g5753R0013J33498K4886p3145L3344Q4369J1895m5580m8525j7810O594k201
19971A21585j1720j1029N6700o7230j88718Q741O0314n1106l6195R4257p1007
19960i5408n6634o0170L3761K14905N8723J27909P0125r2344o2555j57476n1934
19949g1098k2180o6901j45891l467O1339K48596J60540m9556M357M3393K1069
19938A80201j02773P922K4517Q0679j8934j8468l4782p951N2279P8983j66952
$$ plain form
20017 316997 235798 97373 91041 -4300 -196774 -170774 -148806 -54639 68759 -95242 -254520
20006 -254520 -296179 -122567 64137 157974 127525 51658 73785 202784 215083 103867 46716
19995 46716 91949 96313 -213385 -241262 -43650 -36692 35969 27228 -17837 73566 16088 -75753
19983 -75753 14260 147758 172644 99499 132843 217212 229107 183527 135002 117192 123786 121585
19971 121585 109865 98836 155536 88306 -100412 -91671 -31357 -82463 -118658 -24401 -95408
19960 -95408 -152042 -212212 -178451 36454 95177 223086 293211 200867 138312 -19164 -71098
19949 -71098 -93278 -160179 -306070 -309537 -248198 398 160938 111382 115739 159132 180201
19938 180201 77428 85350 109867 190546 171612 153144 118362 110411 162690 241673 74721
19927G4721j5316J14092j40388J1928L2505J55843R8056M3118k4139j55538P2417
19916B67299M1625r8089K89j00407o843O3414k66m6573n6175q306O6723J3615
19904A36306q5604j7247k5255J21701k1421M6683K6892k38334O3040K577J48473
19893A57811K2128M5635K2111j22883m0549K9157J48975J15070J12746j7612j64192
19882C08397j60975p8920q033M1363j76708k02016L9963J45488J66215L3385k5102
19871H3057j24733j8900K01707J40766M041O4825j20471P033k14544j65237J32789
19860i667J87447O7750j32727j06788N2639J26535Q8903r4316M0789p9060N0040
19849A91545N5440J5438O5948L3609l27069j23824J92850J65207m0717j76317
$$ plain form
19927 74721 59405 173497 33109 45037 77542 233385 331441 374559 350420 194882 267299
19916 267299 308924 210835 211124 110717 103874 167288 167022 120449 64274 55968 122691 136306
19904 136306 50702 33455 8200 129901 108480 155163 182055 -56279 6761 9338 157811
19893 157811 179939 225574 247685 124802 84253 113410 262385 377455 490201 472589 308397
19882 308397 147422 68502 60469 101832 -74876 -276892 -236929 -91441 74774 108159 83057
19871 83057 -41676 -60576 141131 281897 285938 350763 230292 237325 22781 -142456 -9667
19860 -9667 177780 245530 112803 6015 58654 185189 274092 179776 220565 141505 191545
19849 191545 246985 262423 328371 361980 34911 -88913 103937 269144 228427 52110
19839E2110k8390N293J39171j7822j24900p7133l4624j029L5650R2509p999N3282
19827H6118K157J79762o11k51435k1112O3599o0796m3577K4406N8348l1754K01374
19815B06479P1102k17847n1767R2746J38721J43123m9848n5986k48680j29241
19805a01198J29562J00663k6058p2787o8475K71126J72185j24419j28716Q9242
19795B41125j3962O7682n3784n7004K104q787n0715K4333J34391k1736n749m7467
19783B10431l8885j29331j19852l829J17461p9142R5361M1989j12581j8751J96811
19772A59682L5382o8556j07767n1065J52954J61796K54613J21157l00475m6392
19762C11329N0771j03304k39200M4441K30001J32822R631J21280o1068j84392
$$ plain form
19839 52110 23720 29013 168184 150362 25462 -51671 -86295 -87324 -51674 40835 32836 86118
19827 86118 88275 268037 267426 15991 -5121 58478 -2318 -45895 -21489 36859 5105 206479
19815 206479 277581 59734 7967 100713 239434 382557 332709 276723 28043 -101198
19805 -101198 28364 129027 102969 30182 -38293 232833 405018 280599 151883 241125
19795 241125 227163 294845 241061 184057 186161 177374 126659 150992 285383 263647 257898 210431
19783 210431 171546 42215 -77637 -81466 35995 -43147 52214 94203 -18378 -37129 159682
19772 159682 195064 126508 18741 -32324 120630 282426 537039 658196 357721 311329
19762 311329 362100 258796 19596 64037 294038 426860 436491 557771 496703 312311
19752C12311k14831J8850J298M6273J97693j5490n9947P33j59001l9716J34442
19741B22615o0409k41972j30858J27394n0366j7266p1007J14814K38265O6042
19731A97252j05832j644M7029J23035O7459k9150k08363O262J08282J60964j36287
19720B29007m7758O9179M547r0760M460j9435K8252k01248l4035K4824K17586
19709A84619J81863M6411N5555j06187r8888j16607M601K733j13876p5981j0277
19698d6034L44046K80186r7571K2490p6969j52820k84334j7546j0923Q5193M2175
19687H7893Q7559P6927l3166j09059J15818Q2683o4906j63309j63288J45582k7807
19676C4927m8511J13116J02795P2165J8048j90558k06124q8164Q4125j13151J32934
$$ plain form
19752 312311 97480 116330 117628 163901 361594 346104 286157 286890 127889 88173 222615
19741 222615 162206 -79766 -210624 -83230 -133596 -150862 -221869 -107055 131210 197252
19731 197252 91420 89776 136805 259840 327299 298149 89786 96048 204330 365294 229007
19720 229007 181249 250428 254975 164215 168675 149240 177492 -23756 -57791 -32967 184619
19709 184619 366482 412893 468448 362261 263373 146766 151367 154100 40224 -35757 -46034
19698 -46034 298012 578198 480627 503117 426148 273328 -11006 -28552 -39475 45718 87893
19687 87893 175452 252379 219213 110154 225972 308655 243749 80440 -82848 62734 34927
19676 34927 -13584 99532 202327 274492 292540 101982 -104142 -192306 -108181 -221332 -88398
19665h8398K4797M8476K12719K2840j39766J20588J93451q4342j7039J62491j2990
19654D42827j57749q375J45597l464j88357o4781n8761k4839k0117M3446J46288
19643B51715j08568k79132O2568K34925J39400l0538j7647m4262o4598M7458J84909
19632C76230P4658l5338j02892L0349K9260J4177j44752k35701J51091M35769
19622E92851N146k13800n0702J2744j22720j09040j7395n2836n2340L0224P9169
19611A01301j09749J2579K3674J13067J0473P4850J17756o1715j78434l4167J6976
19600H6611J4828O878J01416L9622p887Q59J214M1122K07250p4316j50466n1943
19588B15188R9367j10641r2765o2338J2781J79846j41320k8736J69325K39628
$$ plain form
19665 -88398 -63601 -15125 197594 220434 80668 201256 394707 310365 293326 455817 442827
19654 442827 285078 276703 422300 418836 230479 165698 106937 82098 61981 105427 251715
19643 251715 143147 -135985 -73417 161508 300908 270370 252723 208461 143863 191321 376230
19632 376230 450888 415550 312658 343007 372267 386444 241692 5991 157082 592851
19622 592851 597997 384197 333495 346239 223519 114479 97084 44248 -8092 22132 101301
19611 101301 -8448 4131 27805 140872 151345 226195 343951 282236 103802 69635 86611
19600 86611 101439 108317 209733 249355 241468 242327 243541 284663 491913 417597 267131 215188
19588 215188 314555 203914 111149 48811 61592 241438 100118 71382 240707 480335
19578D80335P1804O9476j11610j66489k9513j2865J9724k6815P0724l224m8753
19567C12794p8516P4366L5526K8977j0469k4983j56706Q7256q5749j28075m737
19556D9684J01232J66013k2519m4987N5800R85p0675M8550K04651l9070o1272
19545C88392M5985N589K3430j10798K1882n593L5928J1924j28583j36725j5137
19534A36294M6957Q9690R8782Q1275L6438j57176J44259N6680k12819l53247Q9585
19523E6718J87855K3809J28945J39300l5460m272k968j62019j44184p251J60789
19512C41262K11937L2181k02852p9417j65989j27107K8302K23893K37656q7920
19502D11946q6306o9561R5248j8652J2878K6993O5420r5782l4568j02291j96435
$$ plain form
19578 480335 552139 621615 510005 343516 314003 301138 320862 294047 364771 361547 312794
19567 312794 234278 308644 344170 373147 362678 337695 180989 268245 182496 54421 49684
19556 49684 150916 316929 294410 249423 305223 306208 235533 284083 488734 449664 388392
19545 388392 434377 439966 463396 352598 374480 368887 404815 416739 288156 151431 136294
19534 136294 183251 272941 371723 452998 489436 332260 476519 533199 320380 -32867 56718
19523 56718 244573 268382 397327 536627 501167 496895 493927 331908 187724 180473 341262
19512 341262 553199 585380 382528 303111 137122 10015 38317 262210 499866 411946
19502 411946 325640 256079 351327 332675 345553 372546 437966 342184 307616 205325 8890
19491H890j5979J0998k6949k943j54380J00428K56452J00449P5397p977Q7858
19480D32244J84526J04838p5652r1491l6450l0022p4665r2870L6054j17653q8229
19469A50630L8871j48578J5296J72522K22371N1560j32786L75J3369j04120R7647
19458C77157k227P7633R1286j68189n4988O4143K06966k9316M0324o8782J82722
19447G16729p1548j48257K25Q6052R6180j91217k04066J7755J61712j6962j88947
19436B57656m6862N1359K04914J70044l6363M5286N518j51602j23693j8031q911
19425C49315O1619J27624q5867K6070J66441m2266k8475j58342j96309j39921
19415G9889O872J47768K11423J00496j89884q8713L9516p1250l0845M808P8426
$$ plain form
19491 8890 -7089 3909 -23040 -25983 -180363 -79935 176517 276966 352363 344386 432244
19480 432244 616770 721608 645956 554465 518015 487993 413328 320458 356512 238859 150630
19469 150630 189501 40923 56219 228741 451112 502672 369886 370261 383630 279510 377157
19458 377157 374930 452563 543849 375660 320672 384815 591781 562465 602789 534007 716729
19447 716729 645181 496924 497149 583201 679381 488164 284098 301853 463565 446603 257656
19436 257656 210794 262153 467067 637111 600748 646034 651552 499950 376257 358226 349315
19425 349315 410934 538558 452691 478761 645202 602936 574461 416119 219810 79889
19415 79889 86761 234529 445952 546448 356564 267851 307367 236117 205272 210080 288506
19404B88506R0371j15227m6119O0992J7967j74266J33598k8204p3463P8173K57434
19393D89762K30056j55918j61851K0012N6076O9783j64111O7288p3525m0853J45428
19382D82147M1532k0282p0414p6832L3885M4428J19469p7224P5452J10421N3021
19371G15603k5316p0939k2392j18234K6400N5995N1234M0682p3243o6094j03075
19360D10621N1239K56739o0675O6195J65943P6348J7344J33200J34627o6858j30334
19349A054389p0034p3259j46774n0942j7661r8431J45214Q5319j7910L1350J18446
19338I59707l2087Q101n5518j13840n5700j74789j57326Q5829K55022K9419q4282
19327F64536P2365O6219O1585J52460M1451q0198J56765K0361P4739k8652j75019
$$ plain form
19404 288506 378877 263650 217531 278523 296490 122224 255822 227618 154155 232328 489762
19393 489762 719818 563900 402049 422061 478137 547920 383809 451097 377572 336719 482147
19382 482147 523679 503397 432983 356151 390036 434464 553933 476709 552161 662582 715603
19371 715603 690287 619348 596956 478722 505122 561117 612351 653033 579790 513696 410621
19360 410621 461860 718599 657924 724119 890062 966410 983754 1116954 1251581 1184723 1054389
19349 1054389 984355 911096 764322 713380 695719 597288 742502 827821 809911 841261 959707
19338 959707 927620 935721 880203 766363 710663 535874 378548 464377 719399 748818 664536
19327 664536 736901 803120 864705 1017165 1058616 978418 1135183 1155544 1230283 1201631 1026612
19316A026612k36410J2206J87459K1378N3295J25527J04249j1096o2755J31231
19306A351696n1833j68293p0219J04586k9422j34374j405K9421j07440M2976R0014
19295A055707N2982M1457P2058j52090J3418q325J8004n5854k76393l03492Q1716
19284E39188K95480M6314j11045L3599j03572o1721j7786K5861K070o3720O8223
19273F52891J25644K04657k8269j78700o6307J69422J88731j04689o0974q6776
19263H15630j50815J84582L736Q8111j2162J40308k6j09168n9688L5047o8765
19252H66790j16540l1436q5335M1372J8803j03270Q6638J50851R0227o263k482
19241I09355M3223M3647l5555K1565L0359j02183K33334J48708l46380j30014
$$ plain form
19316 1026612 790202 802408 989867 1011245 1064540 1190067 1294316 1283220 1220465 1351696
19306 1351696 1299863 1131570 1061351 1165937 1136515 1002141 1000736 1030157 922717 965693 1055707
19295 1055707 1108689 1150146 1222204 1070114 1083532 1075207 1093211 1037357 760964 457472 539188
19284 539188 834668 880982 769937 803536 699964 638243 620457 646318 648388 584668 652891
19273 652891 778535 983192 954923 776223 709916 879338 1068069 963380 902406 815630
19263 815630 664815 849397 853133 941244 929082 1069390 1069364 960196 900508 935555 866790
19252 866790 750250 718814 633479 674851 693654 590384 677022 827873 918100 911837 909355
19241 909355 952578 996225 960670 982235 1012594 910411 1143745 1292453 946073 816059
19231H16059Q9201P8810n5555m820L716o8825Q2862M961M5134J00986j17813J03402
19219A078118J74011J39371o5851r7086N6834J90805K50314n072K30608L79424
19209B331476L19387K90904L41928J99197K49163L96152K38776M3817j65264l12683
19199C932853m73333l47513l83960l34707j87387j89778k20805l3049p9935j8883
19189A663503P2684J9904J27350M8079j2667j91623l03265J0183O9614m9339P2447
19178A526870K51907K9641l2635j88095j12572p1434m66J49390J91108l3692l3356
19167A676666J00978J85485M2655p6250J94946J80296J9007j51835o8095J97243
19157B301096O1239q084O4574N5224m7055j14259j56202j43881M7938J21437J86747
$$ plain form
19231 816059 905260 984070 928515 923695 927411 858586 941448 946409 991543 1092529 974716 1078118
19219 1078118 1252129 1391500 1325649 1228563 1285397 1476202 1726516 1721444 1952052 2331476
19209 2331476 2650863 2941767 3283695 3482892 3732055 4128207 4366983 4410800 4245536 3932853
19199 3932853 3459520 3112007 2728047 2393340 2205953 2016175 1795370 1762321 1682386 1663503
19189 1663503 1736187 1756091 1883441 1931520 1918853 1727230 1423965 1434148 1503762 1454423 1526870
19178 1526870 1778777 1808418 1775783 1587688 1475116 1403682 1403216 1552606 1743714 1710022 1676666
19167 1676666 1777644 1963129 2005784 1929534 2124480 2304776 2323783 2171948 2103853 2301096
19157 2301096 2362335 2354251 2418825 2474049 2426994 2312735 2156533 2012652 2060590 2182027 2368774
19146B368774K30169J16585O087N6909J00726O5409O622o3402O2751M5277R9890
19135C095797N098k115J01643K36549K18869r94m907M5375J26096K12318J37129
19124D170858p5134j5544J10513K65868L57613J79590K49110M72579K07219L3872
19114E956544K38046L34117L90895K61565L14409O66669N92798N72342N24524
19105I851909N87936P84290J018907J029430R88933J412067J751516J883857J973190
19096B1282035K227104K624093L108605L616530M249976M952369N946756P743173
19088E5750641J0215720J3922886J9350579K7410889L9025691N1716762N8211702
19081B75604870N1910827L6528659K2006118J1767525J595171j4942104l9756882
$$ plain form
19146 2368774 2598943 2715528 2721615 2778524 2879250 2944659 2951281 2887879 2950630 2995907 3095797
19135 3095797 3100895 3098780 3200423 3436972 3655841 3654847 3649940 3695315 3821411 4033729 4170858
19124 4170858 4095724 4080180 4190693 4456561 4814174 4993764 5242874 5715453 5922672 5956544
19114 5956544 6194590 6528707 6919602 7181167 7495576 8162245 8755043 9327385 9851909
19105 9851909 10439845 11224135 12243042 13272472 14261405 15673472 17424988 19308845 21282035
19096 21282035 23509139 26133232 29241837 32858367 37108343 42060712 48007468 55750641
19088 55750641 65966361 79889247 99239826 126650715 165676406 217393168 275604870
19081 275604870 327515697 364044356 386050474 397817999 399413170 384471066 344714184
19074C44714184o0071755o2030262m9336879l4806633k3987210j6710982j2326907
19067H5443556r127359p036746n828292m751155m087745l615417l195035k880997
19059D4920810k489190k405925k118293j805773j732660j675808j642535j427832
19051B9622794j217588j075763j250288j143818r80373j056859p39394o12240
19043B1546471p23357o48804p05923o50318o02881o27417n54194m30163m44745
19034A6158669m50171k74872m35515m99502m59973m77145l65902l71391l89915
19025A2434283l33231k73366j64615j62310l71306k70421j2359m6570l00556l02876
19015A0196673j59288r220r2929N916N3945j24360k65564p2503k27301l44504
$$ plain form
19074 344714184 284642429 222612167 173275288 138468655 114481445 97770463 85443556
19067 85443556 76316197 69279451 63451159 58700004 54612259 50996842 47801807 44920810
19059 44920810 42431620 40025695 37907402 36101629 34368969 32693161 31050626 29622794
19051 29622794 28405206 27329443 26079155 24935337 23954964 22898105 22158711 21546471
19043 21546471 20823114 20174310 19468387 18818069 18215188 17587771 17033577 16603414 16158669
19034 16158669 15708498 15433626 14998111 14498609 14038636 13561491 13195589 12824198 12434283
19025 12434283 12101052 11827686 11663071 11500761 11129455 10859034 10846675 10800105 10499549 10196673
19015 10196673 10037385 10028165 9935236 9941152 9995097 9870737 9605173 9532670 9305369 8960865
19005H960865m16409k32159j32679l33914j77156l03458k79379o617r437j20833
18995F948824r373J44332p8810l5117N6206j27125K992K35634m168n1331j0241
18984G071823j42253p6261q2764m5815j27692R079o6360r6410J63995K46764M20774
18973G274880L36286J43936M9852R3279j31245m7052O0556O99l90851l62964L73
18962G027749n2249j66292k71465r4448R4865K58482J83051j97111J00803Q9864
18952F973249P772M3666j66959k67005m12182l52747k79564p6965j08073k48859
18942E112333j67726j3004k8987J58138p0691J44819L18191J07579M723L8149
18932E603524o2880R7912Q192j95722j85127k4789m519o2687K42142K79205J24485
$$ plain form
19005 8960865 8544456 8312297 8179618 7845704 7668548 7365090 7085711 7079094 7069657 6948824
18995 6948824 6939451 7083783 7004973 6969856 7026062 6898937 6901929 7137563 7133395 7082064 7071823
18984 7071823 6929570 6853309 6770545 6724730 6597038 6606117 6539757 6443347 6607342 6854106 7274880
18973 7274880 7611166 7755102 7804954 7898233 7766988 7719936 7780492 7781191 7390340 7027376 7027749
18962 7027749 6975500 6809208 6537743 6443295 6538160 6796642 6979693 6782582 6883385 6973249
18952 6973249 6981021 7024687 6857728 6590723 6178541 5825794 5546230 5469265 5361192 5112333
18942 5112333 4944607 4931603 4902616 5060754 4990063 5134882 5453073 5560652 5565375 5603524
18932 5603524 5540644 5638556 5646748 5451026 5265899 5241110 5236591 5173904 5416046 5695251 5819736
18921E819736K76218K94037J94821J35259J72780J8451j31703L0544N8621k15075
18911F653689l89098k08371k51032k68667j63790k3290j35801l57404K25284K84827
18901E366347J75025J31130L6734J82196P5656K21258K52414R2778K09576L98361
18891G141475K78156J55193J79861N55299N95666N36519P57068J177209J542691
18882A2919137J992199K077263J883650J838000J607226J692713J552315J249947
18874B6812450J404815J817755K619450M283270O601349R819943J3821095J7319775
18866H4499902J8033542J4735091J1046131Q742603O693256K969359m226725j2872184
18858A29620975j5966365j3291623r503494o629861n601369m945778m076579l435662
$$ plain form
18921 5819736 6095954 6389991 6584812 6720071 6892851 6911302 6779599 6810143 6868764 6653689
18911 6653689 6264591 6056220 5805188 5536521 5372731 5349441 5213640 4856236 5081520 5366347
18901 5366347 5541372 5672502 5709236 5891432 5967088 6188346 6440760 6533538 6743114 7141475
18891 7141475 7419631 7574824 7754685 8309984 8905650 9442169 10199237 11376446 12919137
18882 12919137 14911336 16988599 18872249 20710249 22317475 24010188 25562503 26812450
18874 26812450 28217265 30035020 32654470 36937740 43539089 53359032 67180127 84499902
18866 84499902 102533444 117268535 128314666 137057269 143750525 146719884 142493159 129620975
18858 129620975 113654610 100362987 90859493 84229632 78628263 73682485 69605906 66170244
18850F6170244k906304k965701l707599m548957n119534n034362m387434l447766
18842C4052587k510469j879869j449838j099845q90598p09549n09850j00432J22348
18833B5024485K46810M00446N98800J062734J547561K083371L062059M083724
18825C8109990M703798N073590M938766M303575M107470M260000M210849M363491
18817G4071529M813324N773249P334781R943579J4050990J7128544J6332171J0207005
18809A59655172K998238j318066l973783o826328j3115867k0531718k2662507
18802I4225141j8052715j2335309q135498n106128l204668k106715j674982j508020
18794D2101106j488559j684526j836579k187715k646558k711373k638310k296050
$$ plain form
18850 66170244 63263940 60298239 56590640 52041683 46922149 41887787 37500353 34052587
18842 34052587 31542118 29662249 28212411 27112566 26221968 25512419 25002569 24902137 25024485
18833 25024485 25271295 25671741 26270541 27333275 28880836 30964207 34026266 38109990
18825 38109990 42813788 47887378 52826144 57129719 61237189 65497189 69708038 74071529
18817 74071529 78884853 84658102 91992883 101936462 115987452 133115996 149448167 159655172
18809 159655172 162653410 161335344 157361561 150535233 137419366 116887648 94225141
18802 94225141 76172426 63837117 55701619 50595491 47390823 45284108 43609126 42101106
18794 42101106 40612547 38928021 37091442 34903727 32257169 29545796 26907486 24611436
18786B4611436j639949j226882j212934j017715p36817q23083o18818n77974n50746
18777A6206518m75269m64897o96841p76626m51239m97105m60223n51218m73233
18768A1359867k98412j86885r0317m50546l54186k49724m03176k83078j66895
18759H876648j98108l22917k8255l0215k10891k76764l00353j67422k02577l87315
18749F751831l71562m60250l00067Q7362j6225J1153K9840O6008M765r4010N5814
18738E764659k6429o2244m8344J277k38173l44604j7974N8846j01244j12598k80652
18727D592520j86283j97673o2181j99285k18073j14670j21771j06603j68910q5232
18717C131839q7453j62138M2374M0059m6769K152o4924k4405R8142p9174N131
$$ plain form
18786 24611436 22971487 21744605 20531671 19513956 18777139 17954056 17335238 16757264 16206518
18777 16206518 15731249 15266352 14569511 13792885 13341646 12844541 12384318 11833100 11359867
18768 11359867 11061455 10874570 10784253 10333707 9979521 9729797 9326621 9043543 8876648
18759 8876648 8678540 8355623 8327368 8297153 8086262 7809498 7509145 7341723 7139146 6751831
18749 6751831 6380269 5920019 5619952 5707314 5691089 5702242 5732082 5798090 5802855 5708845 5764659
18738 5764659 5738230 5675986 5627642 5628919 5390746 5046142 5028168 5087014 4985770 4873172 4592520
18727 4592520 4406237 4208564 4146383 3947098 3729025 3614355 3492584 3385981 3217071 3131839
18717 3131839 3044386 2882248 2924622 2964681 2917912 2920064 2855140 2830735 2928877 2849703 2854834
18706B854834p7175j02890j21802j58095P8960K08583Q8654l4900J9473M741k4127
18695B736256k13070q8906O3227j3520J3375J03104Q2335M6566j46012p0061q5429
18684B427865L3144Q3861J47536M771q9685j38822l27762m39487j56270M8158
18674A593309M8664M5553q0993j13250j2612O622j35185j37645J7888p2889r69
18663A158493J25221M3599r1365o3740j66889k4245o6576n62j39948J5761J06800
18652H96549J23094J08064K7432j52624m8986o7067j68323j16767N0610q2074
18642E69908j36350m1962N3450J18718J41945j07576j12414k9979J64088j28149
18632D91679j11740J10318J44040N4985r5992k8341j01471J51120N0618k38665
$$ plain form
18706 2854834 2777659 2674769 2552967 2394872 2473832 2682415 2771069 2736169 2755642 2760383 2736256
18695 2736256 2523186 2434280 2497507 2483987 2497362 2600466 2682801 2729367 2583355 2513294 2427865
18684 2427865 2461009 2544870 2692406 2697177 2607492 2468670 2140908 1701421 1545151 1593309
18674 1593309 1641973 1687526 1606533 1493283 1480671 1487293 1352108 1214463 1232351 1159462 1158493
18663 1158493 1283714 1327313 1235948 1172208 1005319 981074 914498 913936 773988 789749 896549
18652 896549 1019643 1127707 1155139 1002515 953529 886462 718139 601372 651982 569908
18642 569908 433558 391596 445046 563764 705709 598133 485719 455740 619828 491679
18632 491679 379939 490257 634297 689282 593290 564949 463478 614598 665216 426551
18622D26551n3252J78679k07252j92881M3423L2106r3514p33Q3942J59539P5403
18611D52011j41209j181K4328j09787k3197n4573j53459R146L344r6595j3297
18600a04469J53766Q0934O5332m0762q7106O4106J45250J5544o5578n0708Q5024
18589B61333n0784R818p3387J20238P4812K351j26j72379k9728j41387L2791J4048
18577D7600K2509M4750R6490o482O7610k6167O965n1472n0196k06208n5109P9502
18565c0208k9768L0589K14868o2059K3614p1332j00829J12684m5351L1941l4491
18554C9658R1194J6954k39058m6636J10561O0824Q7077O7713j20582j07328j18216
18543a57839q647M8896R0445M2937M1658j93208l2815O6924P2774p6458k9659
$$ plain form
18622 426551 373299 551978 344726 151845 195268 227374 133860 133127 217069 376608 452011
18611 452011 310802 309621 333949 224162 200965 146392 -7067 2079 5423 -91172 -104469
18600 -104469 49297 130231 195563 154801 67695 131801 277051 292595 227017 176309 261333
18589 261333 210549 220367 146980 267218 342030 344381 344255 171876 142148 761 33552 47600
18577 47600 70109 114859 211349 204867 272477 246310 253275 201803 151607 -54601 -109710 -30208
18565 -30208 -59976 -29387 185481 123422 147036 75704 -25125 87559 42208 74149 39658
18554 39658 130852 147806 -91252 -137888 -27327 33497 120574 188287 67705 -39623 -157839
18543 -157839 -166486 -117590 -27145 15792 57450 -135758 -168573 -101649 -28875 -105333 -134992
18532a34992L606J69901J25634r591j48431m7500p3814o2502m4498o359k11773
18521d40319o8063J01078J37617J42940J40268L7877n566K881j48587k7313K4216
18510a02971J26355M5758J1575K7447q2610j19613j38092Q1376n9666n1220J24583
18499a37078j88042j39308R5991J51755K2140J03771J3567P7596Q2751K655j79465
18488i3667m0197m1627l7859j35282J9626J26068n330j08552J9478J70898n9709
18477a86153l4736K2600M1929J32356O8414j07560j09936J7717M4404M9131P0224
18466H390J6218N4100j4360l1498q0614J00721O6921J7968r5486j25969l935j83426
18454b70970j4450M288J03683K7910n8366j41446n3887J53505J26456J61926M8351
$$ plain form
18532 -134992 -131386 38515 164149 154558 6127 -41373 -115187 -177689 -222187 -228546 -440319
18521 -440319 -508382 -407304 -269687 -126747 13521 51398 45832 48713 -99874 -127187 -102971
18510 -102971 23384 69142 80717 108164 25554 -94059 -232151 -150775 -210441 -261661 -137078
18499 -137078 -325120 -464428 -368437 -216682 -194542 -90771 -77204 392 83143 85798 -93667
18488 -93667 -133864 -175491 -213350 -348632 -329006 -202938 -208268 -316820 -297342 -126444 -186153
18477 -186153 -220889 -198289 -156360 -24004 44410 -63150 -173086 -155369 -110965 -61834 8390
18466 8390 24608 78708 64348 32850 -47764 52957 119878 137846 42360 -83609 -87544 -270970
18454 -270970 -285420 -281132 -177449 -149539 -207905 -349351 -403238 -249733 -123277 38649 87000
18443H7000r0546p3517Q4017R8312K5135j61561k44371P5395K7186j10206k1224
18432c04380P292M5128K05076k0125n9272O3989Q0627M4662k149p4530p1174P9539
18420e317j5813J1927M9507J7100J40127j0895r5052j1637k6109o4471J2169R6933
18408I8469O7102O8660j30289o9987o8633r4293J22803r8769l1366p6418k40j1708
18396b24669L8384J87540K9433K7684q1155p5757l7165j4878J56928K57407q53
18385B62899k4295k17886n8035J28486P1029J00600K449n1950j52419j87163L17
18374a25968M8642O6893J12419o428J60755J35547q8773M8087L83O738m5144q2842
18362B30309O9673m6058M0363J18377J21228k72136l4819N933R6203P649M7613
$$ plain form
18443 87000 -3546 -77063 6954 105266 130401 -31160 -275531 -200136 -172950 -283156 -304380
18432 -304380 -297088 -251960 -46884 -67009 -126281 -62292 18335 62997 60848 -13682 -84856 -5317
18420 -5317 -21130 -9203 40304 57404 197531 186636 91584 79947 53838 -10633 1536 98469
18408 98469 165571 234231 103942 33955 -34678 -128971 -6168 -104937 -136303 -212721 -212961 -224669
18396 -224669 -186285 1255 30688 58372 -22783 -98540 -135705 -150583 6345 263752 262899
18385 262899 238604 20718 -37317 91169 162198 262798 265247 213297 60878 -126285 -125968
18374 -125968 -77326 -10433 101986 95558 256313 391860 303087 351174 351557 358295 313151 230309
18362 230309 299982 253924 294287 412664 533892 261756 226937 232870 329073 336722 384335
18351C84335R3012p1134r0290q1294m1198J6499j63907n0259J33583J03547Q198
18340B41092n0664M7835m255Q8137j30854j63252J1055J37199M7357j85637j58435
18329a20422j19506J27859M2169j0406R0388P2353P5207q855M4859J14987M0167
18318C48800j0767N4402q3617j1325J09028P6598R1582p3580J21611q865m0405
18307E73462l9157o0751j6063o652O9565n558q4231l8593K0n010n2846p1669r5315
18294A67202J5227j82145j16840o809p824O9393L1010O9163p503k8399o505k4610
18282b8640l371L4600q6700L8809J59339n9113K02676J33124j63272p9914l7659
18271A09879J2266M355P3021J01206J19349J98402J7897N8937K38097N2792J54366
$$ plain form
18351 384335 477347 406213 315923 234629 193431 209930 46023 -4236 129347 232894 241092
18340 241092 190428 238263 234008 322145 191291 28039 39094 176293 223650 38013 -120422
18329 -120422 -239928 -112069 -69900 -80306 10082 82435 157642 148787 193646 308633 348800
18318 348800 338033 392435 308818 297493 406521 483119 574701 501121 622732 613867 573462
18307 573462 534305 473554 457491 450839 520404 514846 430615 392022 392042 387032 334186 262517 167202
18294 167202 182429 284 -116556 -123365 -131189 -61796 -30786 38377 30874 2475 -4030 -28640
18282 -28640 -32011 2589 -84111 -45302 114037 54924 257600 390724 227452 147538 109879
18271 109879 122145 126500 199521 300727 420076 618478 636375 695312 933409 986201 1140567
18260A140567L47208L19813L15534J38554L47376J94463R7757o2035k44751k04845
18250B389641o13273m97889l14580k11280p9387n7292j39113J6444L0219q173
18240E15317R7052k992j00027J03308k2007k42943m7640R4349L9678o0211j80102
18229A93782J2889p1025j1845Q0518j31696n8610J24654q706o8314J3273J35296
18218B10216J96657j49724q0273J1965j1422j25955p944K09425Q5388m571J06618
18207D40380J7264j46325n9245M9496O5731J90408P1053k1242j13875n6132p7117
18196C60396n7156j23607o3596p351L3800J06115J33028R9336K59603R861j29459
18185F20970J7430R0588j04198j57013N4881K33034Q204j75143l8682J09304K8498
$$ plain form
18260 1140567 1487775 1807588 2123122 2261676 2609052 2803515 2901272 2839237 2594486 2389641
18250 2389641 1776368 1278479 963899 752619 673232 615940 476827 493271 523490 515317
18240 515317 612369 609377 509350 612658 590651 347708 300068 394417 434095 373884 193782
18229 193782 206671 135646 123801 204319 72623 14013 138667 129961 61647 74920 210216
18218 210216 406873 257149 176876 188841 177419 51464 43520 252945 338333 333762 440380
18207 440380 457644 311319 252074 301570 367301 557709 628762 607520 493645 437513 360396
18196 360396 303240 179633 116037 108686 142486 248601 381629 480965 740568 750429 620970
18185 620970 638400 728988 624790 467777 522658 755692 763896 588753 550071 659375 687873
18174F87873m4216k7440J69809q588q9080q6040l3923J37201J53238k2354J33353
18163I69833P4669p1291j60909q9794K18162m13L9923Q6373R3037J21461o6282
18152A214769p4150k08477k67393n4390m1522N9221j97581o2368K09207o745J54992
18141G25563J0187j10964m773m3634r4948M1994j08792l9771Q7850N2153J4209
18130E29074k2124Q6324Q3732J48038M4018o9409j14152k33078N3213R1921J94008
18119G91565P6709P023k17594J6576P0988m6369Q0708P8691P0460j40547k4305
18108G63905k12712L8526J86426k1204J23436j2281m19707k51899N504Q8383l3267
18097B55110j07843p0476J64336J61107j11859j83987q8781R1745N8427J6224
$$ plain form
18174 687873 643657 616217 786026 777438 688358 602318 568395 705596 858834 836480 969833
18163 969833 1044502 973211 812302 722508 940670 940257 980180 1066553 1159590 1281051 1214769
18152 1214769 1140619 932142 664749 610359 568837 628058 430477 368109 577316 570571 725563
18141 725563 735750 624786 620013 576379 481431 523425 414633 374862 462712 514865 529074
18130 529074 506950 593274 677006 825044 869062 799653 685501 452423 505636 597557 791565
18119 791565 868274 875297 657703 674279 745267 698898 779606 858297 928757 788210 763905
18108 763905 551193 589719 776145 754941 878377 866096 446389 194490 199994 288377 255110
18097 255110 147267 76791 241127 402234 290375 106388 17607 109352 167779 184003
18087A84003O8995l1688L7705Q6348q3231O7898K7583l6614j32739q8796K9564
18076A29028J15160J6846k2634j288k00673k93816n2701K6676J25581L3380m0680
18065a65121k9070R1309j9344n7993J32171N8398k04933P8672N0613P7329M851
18054A6882P5827J15759K7363j07859J25131J62354n8405o1070J6557n8743M9429
18043C03225R6987j307p9591K7278p5457k2144k62678K3657l9961R159M7832N4893
18031H1893Q8311p588l2351j53479j03970L6104R679O6073q7961O6536P8511K34644
18019B76402q2196k66010M6609J28921J44908O9665j25517O9586r3715j88868
18009b0215K3965J38959J76324n4842M6348O0922J36447j14934k70294o5288M5497
$$ plain form
18087 184003 252998 221310 259015 345363 262132 330030 357613 320999 188260 99464 129028
18076 129028 244188 261034 238400 237112 36439 -257377 -310078 -283402 -157821 -124441 -165121
18065 -165121 -194191 -102882 -122226 -180219 -48048 10350 -194583 -115911 -65298 12031 16882
18054 16882 92709 208468 235831 127972 253103 415457 357052 295982 312539 253796 303225
18043 303225 400212 398905 319314 346592 271135 248991 -13687 9970 -29991 -20832 27000 81893
18031 81893 170204 162616 130265 -23214 -127184 -91080 -81401 -15328 -103289 -36753 41758 276402
18019 276402 194206 -71804 -25195 103726 248634 318299 192782 262368 168653 -20215
18009 -20215 3750 142709 319033 264191 310539 371461 507908 392974 122680 57392 102889
17998A02889J0597P1488K9141J01920j26421R6518k2331j56911r3171J3953K49515
17987B77187l8615J04516R8547j03525k3981j23701k10531k27253J783R4935J96117
17976D5479P5206J0433j04000J1851J50633O2887R8135O9599Q722M8431J421P6459
17964E55256j1758l07614j84567j03271J83388L9325Q1287n6666K5699j14332
17954A06747k6116m8107N8496K3715J2248l2442O0108J10856J54346k1684L7503
17943D35670j14882j1405o5465L5418p6733P6622l1857K20169m6393j59333O0233
17932C22044j6539k04484J05647L0509j71297J33573K27371K00414J28337k49015
17922E06560n9241k2562j08594N7450J90470m4641k49668j94184m3332j03380
$$ plain form
17998 102889 113486 184974 214115 316035 189614 286132 263801 106890 13719 27672 277187
17987 277187 238572 343088 441635 338110 314129 190428 -20103 -247356 -245573 -150638 45479
17976 45479 120685 131118 27118 38969 189602 252489 350624 420223 428945 477376 478797 555256
17964 555256 543498 235884 51317 -51954 131434 170759 252046 195380 221079 106747
17954 106747 80631 32524 91020 114735 126983 94541 154649 265505 419851 398167 435670
17943 435670 320788 309383 243918 279336 202603 279225 247368 467537 421144 261811 322044
17932 322044 305505 101021 206668 237177 65880 199453 426824 627238 755575 506560
17922 506560 447319 424757 316163 373613 564083 519442 269774 75590 32258 -71122
17912g1122N1263J20462J25948l8327m5635M8426M9497q7899L208Q7724R6012
17901C39557L0943n1669r5757k9090M4914j10404L7058Q4697P4620j6844N7291
17890C65316P7548m3513L8013j24526M5760J29412J31239n8580j19608l8797j37469
17879B64795j0119O363R1719N8846M5202j73571j87053P17m5563M5028O5221K3674
17867A85259q67j3550Q3352M4316J03310L11422n0162l01324L0477p9205P3641
17856C86669K62483j0534o6642N0705K620N5688r8925j38052k0521O8400j3878
17845D78013m0064m1491j66835J08934N6548j5592R7577M9890m3582q7487J14120
17834E10031l1884l18068L991K39504J17883m2520k341R936l2483J10468l143
$$ plain form
17912 -71122 -19859 100603 226551 188224 142589 191015 240512 152613 155821 243545 339557
17901 339557 370500 318831 223074 193984 238898 128494 165552 250249 324869 308025 365316
17890 365316 442864 399351 437364 312838 358598 488010 619249 560669 441061 402264 264795
17879 264795 254676 261039 352758 411604 456806 283235 96182 96899 51336 96364 161585 185259
17867 185259 184392 170842 254194 298510 401820 713242 663080 361756 392233 313028 386669
17856 386669 649152 638618 571976 622681 625301 680989 582064 444012 423491 491891 478013
17845 478013 437949 396458 229623 338557 395105 379513 477090 526980 483398 395911 510031
17834 510031 478147 160079 164070 403574 521457 478937 476596 486532 454049 564517 561374
17823E61374k55524m6764J56273q9505o437N8224O1452K39289N800R8169o6568
17812G15783J60381P1912k30856k0629M1670o8853J7019M939m9229r766M1102
17801F73473J48334L30837K09499J28205L17376j32735R2363n5407k864Q7352
17791A796433m0374n9991Q0064p6063k00581l7789k29629l1277p2913o833Q3376
17780A204423K18983J22960o97k70656l9262J7979J32883J31960k0817n5935L3973
17769A475794P363j10886j4053N4640L41192J46747n793J9688m9523J63632J40235
17758B169036J76171K77136J33621J57450L05869L17997K70859M95497O26849
17749D930485L56597L27614K90230J67636J80907m9206q3587k95047j32428N4861
$$ plain form
17823 561374 305850 259086 415359 325854 319417 377641 439093 678382 684182 782351 715783
17812 715783 876164 948076 717220 696591 738261 669408 686427 691366 642137 632371 673473
17801 673473 821807 1152644 1362143 1490348 1807724 1674989 1767352 1711945 1709081 1796433
17791 1796433 1756059 1696068 1776132 1700069 1499488 1461699 1232070 1200793 1127880 1121047 1204423
17780 1204423 1423406 1546366 1545669 1275013 1235751 1253730 1386613 1518573 1497756 1441821 1475794
17769 1475794 1483157 1372271 1358218 1412858 1754050 1900797 1895004 1914692 1865169 2028801 2169036
17758 2169036 2345207 2622343 2755964 2913414 3219283 3537280 3808139 4303636 4930485
17749 4930485 5287082 5614696 5904926 6072562 6253469 6204263 6120676 5825629 5693201 5748062
17739E748062n3858l56876j52885r6565j07608j30579j24498p7472O9893J17841
17729D835455n6059J01653n1342j06616l5732j07559K2770J28187R4732k4012
17719D801477j43441j79193j12868p591J66925k0936p6114J5822J57741J56579
17709D758401J77320R2799K17550K38697P0739L03982L37676K87256L19656L83735
17699G187811M00031L07494O17663P33532O80757Q47454R46859J061342J165549
17690A3948492J523847J585334J871195J972374J974963J839837J764785J675108
17682B8155935J679831J791891J728261J898824L141076N002074P938055J2131261
17674F3467208J6936913K0510709J9816396J5633650J1524836Q962237O354413
$$ plain form
17739 5748062 5694204 5337328 5184443 5087878 4980270 4849691 4725193 4647721 4717614 4835455
17729 4835455 4779396 4881049 4829707 4723091 4687359 4579800 4602570 4730757 4825489 4801477
17719 4801477 4658036 4478843 4365975 4358384 4525309 4504373 4428259 4444081 4601822 4758401
17709 4758401 4935721 5028520 5246070 5484767 5555506 5859488 6197164 6484420 6804076 7187811
17699 7187811 7587842 7895336 8512999 9246531 9927288 10774742 11721601 12782943 13948492
17690 13948492 15472339 17057673 18928868 20901242 22876205 24716042 26480827 28155935
17682 28155935 29835766 31627657 33355918 35254742 38395818 43397892 51335947 63467208
17674 63467208 80404121 100914830 120731226 136364876 147889712 156851949 163206362
17667A63206362J146863p816287j6289958j8121011j4623540j0182693p280789
17660I0038947n769324m704031m108737l706133l340527l600819m175674n211582
17652E5422120n906135n587322m585113l697399k842577k130540j587765j335511
17644B7749758j059980q72555o74184m67180j00201R8771L06031N16619R97296
17635B6494375J486624K067517K962157L764341M523545N079950M828339M247894
17627E5454742M037021M379426M355936M215328M094128M974804O727026R524997
17619I7763408J3261123J5756611J4228288Q589934K569760j174672l647721o930470
17611A40416261j3238206j9767604k1245940j6830846j1357624p372122m726772
$$ plain form
17667 163206362 164353225 156536938 140246980 122125969 107502429 97319736 90038947
17660 90038947 84269623 79565592 75456855 71750722 68410195 64809376 60633702 55422120
17652 55422120 49515985 43928663 39343550 35646151 32803574 30673034 29085269 27749758
17644 27749758 26689778 25817223 25143039 24675859 24575658 24674429 24980460 25497079 26494375
17635 26494375 27980999 30048516 33010673 36775014 41298559 46378509 51206848 55454742
17627 55454742 59491763 63871189 68227125 72442453 76536581 81511385 88238411 97763408
17619 97763408 111024531 126781142 141009430 149599364 152169124 150994452 147346731 140416261
17611 140416261 127178055 107410451 86164511 69333665 57976041 50603919 45877147
17604D5877147k822415j879652j270809j453318j382376j333089j387544j742668
17596C2605276k403827k454410k287525k138347j913752j484727j113066j120990
17588A7688632r16688p92857q42928o71401m33846k15189l49232p85545o95749
17579A1985197n15503n59484k53113l02313m39926l39057j17963k52823j60818
17570I044197l10603j70109k86507l44874l13216l09312J7770J06918j67145k84792
17560F982327k82901j95835k5934k53225k29442j5792j3852k16645j99826l0449
17550E518426J10056J05171o5377o804j63581m0576K3868O4876L7807Q973k97435
17539E295404j16607j33709k36853k12545j74057N9217q3789k78593j58111k56207
$$ plain form
17604 45877147 43054732 41175080 39904271 38450953 37068577 35735488 34347944 32605276
17596 32605276 30201449 27747039 25459514 23321167 21407415 19922688 18809622 17688632
17588 17688632 16771944 15979087 15136159 14464758 14030912 13815723 13466491 12680946 11985197
17579 11985197 11469694 10910210 10657097 10354784 9914858 9575801 9457838 9205015 9044197
17570 9044197 8733594 8563485 8276978 7932104 7618888 7309576 7327346 7434264 7267119 6982327
17560 6982327 6699426 6503591 6477657 6224432 5994990 5979198 5965346 5748701 5548875 5518426
17550 5518426 5628482 5733653 5668276 5661472 5497891 5457315 5481183 5546059 5583866 5592839 5295404
17539 5295404 5178797 5045088 4808235 4595690 4421633 4480850 4397061 4118468 3960357 3704150
17529C704150j82771q197l8067K0705n119k25626l28091p0344j38644k43966O2216
17518B546246J15424J24671k8501n8427j38873r6424L9019J15357q7019j23751
17508B407722Q864J076P7519M1974m4161m0822r4609q5083q3072K9571K57255
17497B476234P9759q1950k7406M306M5029M6380K5074j00288O468J2105j75031
17486B310680j97623K2714q1921k98667j86590j13597j22775j59835j23861P2030
17476A120555M7148K49323J34368J1453q710P119J0905k61961R5520Q1416k34315
17465A252821l02899k928O7288n7097o2492j4478J35887q2690j46167J01025L6424
17454I24694l5274M1881P1271j35998j70492l5374Q4457J79993q87j07004N0389
$$ plain form
17529 3704150 3521379 3513182 3475115 3495820 3490701 3265075 2936984 2866640 2727996 2484030 2546246
17518 2546246 2661670 2786341 2757840 2699413 2560540 2464116 2503135 2618492 2531473 2407722
17508 2407722 2416586 2417662 2495181 2537155 2492994 2452172 2357563 2272480 2189408 2218979 2476234
17497 2476234 2555993 2474043 2446637 2450943 2495972 2542352 2567426 2467138 2473606 2485711 2310680
17486 2310680 2113057 2135771 2053850 1755183 1568593 1454996 1332221 1172386 1048525 1120555
17476 1120555 1167703 1417026 1551394 1562847 1554137 1561256 1572161 1310200 1405720 1487136 1252821
17465 1252821 949922 946994 1014282 957185 894693 880215 1016102 933412 787245 888270 924694
17454 924694 889420 931301 1002572 866574 696082 660708 745165 925158 924271 817267 867656
17443H67656j3385q3347J02305J61191j22674j73336L4602J12213k6765l6318
17433H22142r3436j02963J12583o3813l9302j73204j0620j053J08693m9298p8793
17422D30936j32459k23294n0830J19689J18680J13522l4681P5936Q0227J82218
17412F79944J61276k1609k80428j5256J86911j42482o7277O0989q7775j42783
17402C31510K9320J83693O0519J8306k5176j26775j95891l0393O2532M6724J76265
17391E30634j2267j34295j55065O9380L37344O6585k3484j09200k61097j38682
17381A69853M9085J15547L3106K2299J7092j53945j07937M2282r9193M9401R8306
17370B35896R6085K4594j12212k41994n443m9784l4181N9663K3502M7536M9908
$$ plain form
17443 867656 854271 770924 873229 1034420 911746 738410 773012 885225 858460 822142
17433 822142 728706 625743 738326 674513 635211 462007 451387 450334 559027 509729 430936
17422 430936 298477 75183 24353 144042 262722 376244 341563 417499 497726 679944
17412 679944 841220 819611 539183 523927 710838 568356 501079 562068 474293 331510
17402 331510 360830 544523 605042 623348 598172 471397 275506 245113 307645 354369 530634
17391 530634 518367 384072 229007 298387 635731 702316 678832 569632 308535 169853
17381 169853 218938 334485 367591 389890 406982 253037 145100 187382 88189 137590 235896
17370 235896 331981 356575 244363 2369 -3074 -52858 -87039 -27376 -3874 43662 93570
17359I3570m7827j68127J06134n2263M5923R8325M10j00254R509n0487k3355k8097
17347a16539K7015Q8085O554M0325K2620N8012q0528J6139N5427l3764P2158N3252
17335B08756R695j64375k1216J09143n1246j6476k9225k4639m0476J30818L3565
17324A44324N1539L9685j09611L8554k8105M5607o178j81943l797P3786N8481
17313A22342k0519k84121O697J19780L5844J95672l7512j74473p0834p1345l3527
17302b11996P8789m0218k21391P5707J76035j475n8301r0093Q51J54194K2731
17291a15167q5995M1336L8324j77979J03611J74359J6222N9644k4344j62371K52045
17280A19685L27705q1637k01624j61786j53746m2410K01557k899r0649N6257j13276
$$ plain form
17359 93570 45743 -122384 -16250 -68513 -22590 75735 76145 -24109 -14600 -65087 -88442 -116539
17347 -116539 -89524 -1439 5115 45440 68060 126072 45544 61683 117110 83346 155504 208756
17335 208756 218451 54076 32860 142003 90757 74281 45056 20417 -20059 110759 144324
17324 144324 195863 235548 125937 164491 136386 181993 175815 -6128 -9925 63861 122342
17313 122342 101823 -182298 -175601 -55821 -19977 175695 138183 -36290 -107124 -178469 -211996
17302 -211996 -133207 -173425 -394816 -319109 -143074 -144549 -202850 -292943 -292092 -137898 -115167
17291 -115167 -201162 -159826 -121502 -299481 -195870 -21511 -5289 54355 30011 -132360 119685
17280 119685 447390 365753 164129 2343 -151403 -193813 7744 4845 -85804 -29547 -142823
17269a42823o058o208j2809Q2472m4665n627J29114m5061m6699N2141O4965J32303
17257A51045P9060J1564j55689L1922O5397K2139o9107j46786l6068J8494k3924
17246e1953R4214N8492Q4551k744m2443j57233m7911r8182q5664O0267K01368
17235A2762K2588k29577l8221J50331K00260O2787K4303k3872j53752O2368k5781
17224F4196j16366j98846j14580L28782J12689o6838O823L8747J29769o0201r5514
17213B8661J57806J13978j96470J2927Q610m9899j73451j5405j00706j00067J70784
17202a43232Q3020l7289l0305m1847k16463J9826J54559K73260j34308j70176
17192b42955j5620k0532P9082m0518N8880J00177m0947K08818J73259n9548J15665
$$ plain form
17269 -142823 -148881 -155089 -167898 -85426 -130091 -135718 -6604 -51665 -98364 -46223 18742 151045
17257 151045 230105 241669 85980 117902 183299 205438 136331 -10455 -46523 -28029 -51953
17246 -51953 42261 100753 185304 182560 140117 -17116 -65027 -163209 -248873 -188606 12762
17235 12762 35350 -194227 -232448 -82117 118143 180930 205233 181361 27609 89977 64196
17224 64196 -52170 -251016 -365596 -36814 75875 9037 15860 54607 184376 124175 28661
17213 28661 186467 300445 103975 116902 125512 75613 -97838 -113243 -213949 -314016 -143232
17202 -143232 -60212 -97501 -127806 -169653 -386116 -366290 -211731 61529 -72779 -242955
17192 -242955 -258575 -279107 -200025 -240543 -181663 -81486 -122433 86385 259644 200096 315761
17181C15761J2991j74077j42741k3742p52o0461J54492L4448p0063J0937J39243
17170A96036n0342Q7576J52739J08634Q2675k11484j24414J69603R3288n297p6485
17159D22529J54946J41226o5742k43616o0277j06349l075l5793P6632r0089m022
17148A86370L8001n6372k05707j9658j5542J47810J44244k4287n1537R2774l0969
17137B05127L2922q5660m0898j5121K2540m3695q1999K21913J50179r3450j82593
17126H9265P316J83418j06663j93185J59150J89543J48158J60503m9196j66777
17116D21532N2398O3582K2435o2924k01008j53663j17572j14142K3923J38343
17106G2904o812R7296J0023r9752O6841R4489M8118J37364m4507j10814j6106
$$ plain form
17181 315761 328752 154675 11934 -11808 -12560 -73021 81471 115919 45856 56793 196036
17170 196036 145694 233270 386009 494643 577318 365834 241420 411023 504311 499014 422529
17159 422529 577475 718701 652959 409343 349066 242717 239642 203849 280481 190392 186370
17148 186370 224371 167999 -37708 -57366 -72908 74902 219146 194859 143322 236096 205127
17137 205127 238049 152389 111491 96370 118910 75215 -6784 215129 365308 271858 89265
17126 89265 96581 279999 173336 -19849 139301 328844 477002 637505 588309 421532
17116 421532 473930 537512 559947 497023 296015 142352 24780 -89362 -65439 72904
17106 72904 66092 163388 173411 73659 140500 234989 283107 420471 375964 265150 249044
17095B49044r6225q0070K6946j62579l2918J56371o1432r8635O8839M7548m2617
17084b5728n3167L8325N8245j52398J9226m239j6602P8313j05892J1223L4373
17073a18321r656J00089J4989K4442K4720o0484q0680o1625J15786P0238J7882
17062C7380K9823M5558m944k32538j92525q3764K27531J7743j61922r016Q8148
17051b38526M5232l2110J3469J8923q5896R8710K09816K41436q5883j88190j09022
17040a12041n5949m5839j12036j10828l1753J65709P5137J51941J99948J6247
17030A40536j33429j41145j9628p9653J41176O9757M2429j12025j32161J32075
17020i2068n0254j00056m8312j3991J07101J39069n1369p4910O286O7129l0236
$$ plain form
17095 249044 152819 72749 99695 -62884 -95802 60569 -863 -99498 -30659 16889 -25728
17084 -25728 -78895 -40570 17675 -134723 -115497 -119736 -136338 -58025 -163917 -152694 -118321
17073 -118321 -127977 -27888 -12899 11543 36263 -24221 -104901 -166526 -50740 19498 37380
17062 37380 67203 112761 107817 -124721 -317246 -401010 -173479 -155736 -317658 -326674 -238526
17051 -238526 -193294 -225404 -211935 -193012 -278908 -180198 29618 271054 185171 -3019 -112041
17040 -112041 -167990 -213829 -325865 -436693 -468446 -302737 -227600 -75659 124289 140536
17030 140536 7107 -134038 -153666 -233319 -92143 -22386 20043 -91982 -224143 -92068
17020 -92068 -142322 -242378 -290690 -304681 -197580 -58511 -109880 -184790 -178504 -111375 -141611
17009a41611N5360K8849j44537J0142M5889j18429o5174L3571Q0965n5799J98607
16998g2167P7276J22620K38941R953Q252k7868j12191J15819K29051L1462r54
16987F20194L0581J60566J71543j58245p4663R1730R0709m1848k48587q583j00830
16976E32567k38068j01743k78907l1949J95058K27279j3914p9252J30865k22412
16966A19524j6053M5810k2199o4226O5592M6489j06325q5275O7596r783j44027
16955a02877l0064M7652K6153L0910P3628j46757j91117k2585J63789K8252J09840
16944a3176P9091m0837J7736J12324j37331J255K5507r4657k9732q9176n5990
16933b24986J535j34432K6331K03632J745J06379j36708p9922J30321J50481j2479
$$ plain form
17009 -141611 -86251 -57402 -201939 -191797 -145908 -264337 -329511 -295940 -214975 -270774 -72167
16998 -72167 5109 127729 366670 376623 384875 357007 244816 360635 589686 621148 620194
16987 620194 650775 811341 982884 824639 749976 841706 932415 890567 641980 633397 532567
16976 532567 294499 192756 -86151 -118100 76958 304237 290323 211071 341936 119524
16966 119524 103471 149281 127082 62856 128448 174937 68612 -16663 50933 41150 -102877
16955 -102877 -132941 -85289 -59136 -28226 45402 -101355 -292472 -315057 -151268 -123016 -13176
16944 -13176 65915 25078 42814 155138 17807 19062 44569 -50088 -79820 -168996 -224986
16933 -224986 -223451 -357883 -331552 -127920 -126175 -19796 -156504 -236426 -106105 44376 31897
16922C1897O3437o0233J3845j01435K5597j29897j3924J59362N7235k851r4681
16911e1648r2155J47218J69160l5214r9234n9496r2311n2349q4201j8938J35326
16900a33842M9631J0490j3526j34990K8807o9650J6930N6533j35401J7666J49198
16889a58154o2440m2798k6538K9731K5030k628n6561M7703l1536M177j35281J86347
16877b22948R7755m460j04352j74570J14367J81051o3770r037l6355l4026j26187
16866c82532M8775R6596J84971J88431Q4959j87700m7902K2388j151l6696q833
16855c8694q4362p9566j11037M7015J11694N6731m4917j28879k372O6371q4690
16844b92706m6562K1727N6762J94018j6892j40339r5964o7141j16270J30020J66911
$$ plain form
16922 31897 95334 35101 48946 -52489 -26892 -156789 -170713 -11351 45884 43033 -51648
16911 -51648 -143803 3415 172575 137361 38127 -21369 -113680 -166029 -250230 -269168 -133842
16900 -133842 -84211 -73721 -87247 -222237 -193430 -263080 -246150 -189617 -325018 -307352 -158154
16889 -158154 -220594 -263392 -289930 -260199 -235169 -237797 -294358 -246655 -278191 -274014 -409295 -222948
16877 -222948 -125193 -129653 -234005 -408575 -294208 -113157 -176927 -185964 -222319 -256345 -382532
16866 -382532 -333757 -237161 -52190 136241 221200 33500 -14402 7986 6835 -29861 -38694
16855 -38694 -123056 -202622 -313659 -266644 -154950 -98219 -143136 -272015 -274387 -208016 -292706
16844 -292706 -339268 -317541 -260779 -66761 -83653 -223992 -319956 -387097 -503367 -373347 -206436
16833b06436K01842J17998j2020j92264j56556J72812J36927l8894M574j37127
16823a09144j50645j9076p9008R2951J58964M9184j43367Q2538k36636q6176J95507
16812b44908J07781O7003k2547J6597K1763J74715P4148O5528r5202j04504l2531
16801B7843n338r2600r6118q1883M542n0750m130J6436o2987J28486R9782j4285
16789a31002k00258k11502k9778K50666K80761J33728L9072j36683j08030m3878
16779a56904J12183M3425K9751J3997j83622j78195j89664J3890L9802O8877K03398
16768a83062J18995L072k15487k07890R3846J10560j11521K44114K23297o2807
16758A3117r0359k14014k6784J00003R4048J26283o4218n0022J51168j13214j33387
$$ plain form
16833 -206436 -4594 113404 101384 -90880 -247436 -74624 62303 23409 27983 -109144
16823 -109144 -259789 -278865 -357873 -264922 -105958 -56774 -200141 -117603 -354239 -440415 -244908
16812 -244908 -137127 -70124 -92671 -76074 -54311 120404 194552 260080 164878 60374 27843
16801 27843 22505 -70095 -166213 -248096 -243554 -294304 -298434 -281998 -344985 -216499 -116717 -131002
16789 -131002 -331260 -542762 -572540 -321874 -41113 92615 131687 -4996 -113026 -156904
16779 -156904 -44721 -1296 28455 42452 -141170 -319365 -509029 -495139 -455337 -386460 -183062
16768 -183062 -64067 -60995 -276482 -484372 -390526 -279966 -391487 -147373 75924 13117
16758 13117 -77242 -291256 -318040 -218037 -123989 2294 -61924 -111946 39222 -73992 -207379
16747b07379L7426J46517O4127j25333k1480M1202k4524j1670Q153j27014o2183
16736b82158O1706O7466m3199j1826O1929P2906J72784K7578M364L6821q8461
16725G9910K2913N2332m4558k3536J391m8371n0207j77353j1709K1574M2869n5992
16713a90737K153J56132J03507k3176p2928j3029J41849L819j61679j06972R763
16702a51298j1892j77055j28840J47174Q7632J2210j21224l4534J76549J32280
16692f8998m2791j51784k417L1036r1597j38984J17229J94186p960R5535l141
16681f9686j71743l5650J22162M1804P425l0177j0566r789o2356k460K2296Q9169
16669a09571J11964k8328j42431K7246M9606p2745m3592M4815R3273j16665R8585
$$ plain form
16747 -207379 -169953 -23436 40691 -84642 -106122 -64920 -89444 -101114 -92961 -219975 -282158
16736 -282158 -220452 -152986 -196185 -208011 -146082 -73176 99608 127186 131550 168371 79910
16725 79910 102823 155155 110597 87061 88452 40081 -10126 -187479 -199188 -177614 -134745 -190737
16713 -190737 -188584 -32452 71055 47879 -25049 -38078 103771 107590 -54089 -161061 -151298
16702 -151298 -163190 -340245 -469085 -321911 -234279 -222069 -343293 -377827 -201278 -68998
16692 -68998 -111789 -263573 -265990 -234954 -326551 -465535 -348306 -154120 -162080 -66545 -69686
16681 -69686 -241429 -277079 -154917 -113113 -105688 -135865 -146431 -156220 -218576 -221036 -198740 -109571
16669 -109571 2393 -25935 -168366 -141120 -91514 -164259 -207851 -163036 -69763 -186428 -87843
16658h7843O1250j02332q1303J27221O5333P5550j8567k41721j01116M8152P200
16647b48176J11870j22397q8286K30343p4859J75388J42409j67274r1892l1217
16637a64091O4124j27281m2807L7675j1964k7066J844N8046M9930n5003N1561
16626a65032J55513K0529n1772j46571k09419j57234j4715R2429J36710o8358
16616d07920N9123K2123J99701O4084r0826n4847M754N9065O2062o4590j97641
16605c44912Q6043K7253J7499Q9820M9587k3099m673j22488O6487J73414j2860
16594B071p5638j33445Q2347K2394N1045J6117j08173j12199j23091O495N0601
16583c21476K7808Q3565J09985Q7075j03645K9064L1833K27868l6014k41722k48252
$$ plain form
16658 -87843 -26593 -128925 -210228 -83007 -17674 57876 39309 -202412 -303528 -255376 -248176
16647 -248176 -136306 -258703 -346989 -116646 -191505 -16117 126292 -40982 -132874 -164091
16637 -164091 -99967 -227248 -270055 -232380 -244344 -271410 -269566 -211520 -161590 -216593 -165032
16626 -165032 -9519 11010 -40762 -187333 -396752 -553986 -568701 -476272 -339562 -407920
16616 -407920 -348797 -326674 -126973 -62889 -153715 -208562 -203808 -144743 -82681 -147271 -344912
16605 -344912 -258869 -231616 -214117 -124297 -74710 -97809 -102482 -224970 -158483 14931 2071
16594 2071 -73567 -207012 -124665 -102271 -51226 -35109 -143282 -255481 -378572 -372077 -321476
16583 -321476 -293668 -210103 -100118 -13043 -116688 -87624 -55791 172077 136063 -105659 -353911
16572c53911l8524R1042J0185N5343J13380M4878J33822j45031q1230Q8550N2045
16561b9451N120K9298j30922K7894J03276Q803j31043Q2395N9116j26561n6618
16550a58693k7208m0530n8337J69968K54879r330q0357K6056j49804m1844o4481
16539a79681r5005q6944R5865J35210j20916l635L5476l4782j72492r3010O5629
16528d54285K32765J96476O686j53246J6694P7913o9390p863J7957q6170k21790
16517d44253j40690J38631Q3159J10651J41597k885j47755L680K2868K0603q1830
16506b96224j03583L3704L5352j54162J63842J46507K5953L596l8615N580Q8049
16495i0001j26028j24858J8037O6652k3806O8080K13634K6857J3844l7560P9582
$$ plain form
16572 -353911 -392435 -301393 -291208 -235865 -122485 -77607 56215 -88816 -170046 -81496 -29451
16561 -29451 -24331 4967 -125955 -98061 5215 14018 -117025 -34630 24486 -102075 -158693
16550 -158693 -185901 -226431 -284768 -114800 140079 130749 50392 76448 -73356 -115200 -179681
16539 -179681 -274686 -361630 -265765 -130555 -251471 -255106 -219630 -254412 -426904 -519914 -454285
16528 -454285 -221520 -25044 -18358 -171604 -154910 -76997 -146387 -154250 -136293 -222463 -444253
16517 -444253 -584943 -446312 -363153 -252502 -110905 -113790 -261545 -257865 -234997 -214394 -296224
16506 -296224 -399807 -366103 -330751 -484913 -321071 -174564 -148611 -145015 -183630 -178050 -90001
16495 -90001 -216029 -340887 -322850 -256198 -280004 -211924 1710 28567 42411 4851 84433
16484H4433P5415l2263j39663k6506p7133r1481q7183J03481Q8054l9858J8374
16473a24330R9897l4001j9201P4192M1491o6282l2991q922q6685J24245k4412
16462e6999p6017n0446q6627Q0320L4314K8312n7501j14047O3749J92624M4764
16451B446j88037m5439J50949r7525k5730P1672p6756Q0156R2041r285J49300
16440A03792j3295n6840Q1001L8846o8120j28720j40p8293k6066p7697p7153L5977
16428b66708P8841M5218p7947j54105J43172K12877J08323Q8587O0698k17902
16418B1054j96367k3377q2018Q805r4495J10418L05364l4820j67531L3693m5770
16407a65044J29220J03599n1098k60099p7847J39874J94367j34448P3745r6871
$$ plain form
16484 84433 159848 127585 -12078 -38584 -115717 -207198 -294381 -190900 -102846 -142704 -124330
16473 -124330 -24433 -58434 -77635 -3443 38048 -28234 -61225 -70147 -156832 -32587 -56999
16462 -56999 -133016 -183462 -270089 -189769 -155455 -127143 -184644 -298691 -234942 -42318 2446
16451 2446 -185591 -231030 -80081 -177606 -203336 -131664 -208420 -128264 -36223 -45508 103792
16440 103792 90497 33657 114658 153504 85384 -43336 -43476 -121769 -147835 -225532 -302685 -266708
16428 -266708 -187867 -142649 -220596 -374701 -231529 -18652 89671 178258 238956 21054
16418 21054 -175313 -198690 -280708 -271903 -366398 -255980 49384 14564 -152967 -119274 -165044
16407 -165044 -35824 67775 16677 -243422 -321269 -181395 12972 -121476 -47731 -144602
16397a44602l619k4735L0767n967j01688O4664J34294N0857K01807L0941j50326
16386H2393j42272j21599j03341m3077N1814J20632Q7596O9309l7164J13822l6943
16375D1170j2015j46691j35558m1171J33623N7253r8756J15686J62601o0686o4518
16364d9062j81717Q068J57442j4537P2643J22612j168M2363n6007j76296j81902
16353b57561q6831M2981r0225J09705K50287J54297j05127r3664j45638j3091
16343b34867P0445j01950J04629J52630p8550j27008J13313n5036m7988J38068
16333f6314L9744J20361o7317j45068L8277l2678L7093q0362j60558M0424n5415
16322c31813P2911Q3998J4379j42459J3403j1072J45406p233j9635r266J35729
$$ plain form
16397 -144602 -148221 -172956 -142189 -148156 -249844 -185180 -50886 -29 201778 232719 82393
16386 82393 -59879 -181478 -284819 -327896 -276082 -155450 -67854 1455 -35709 78113 41170
16375 41170 29155 -117536 -253094 -294265 -160642 -103389 -202145 -86459 76142 15456 -49062
16364 -49062 -230779 -222711 -65269 -79806 -7163 115449 114281 156644 100637 -75659 -257561
16353 -257561 -344392 -301411 -391636 -281931 -31644 122653 17526 -76138 -221776 -234867
16343 -234867 -164422 -266372 -161743 -9113 -87663 -214671 -101358 -156394 -204382 -66314
16333 -66314 -26570 93791 26474 -118594 -80317 -112995 -75902 -156264 -316822 -276398 -331813
16322 -331813 -258902 -174904 -160525 -302984 -289581 -300653 -155247 -162480 -182115 -191381 -55652
16311e5652p2237o4910j16533j0103P8698N9031L9945M9445K857m9524j04051
16300b43034n1398J38463l9225p822k6064Q1332j39900l2222K4819m0704J21280
16289b14475r1751o847Q4382O2304Q6543k1529K6302l7181L5313N3484j57373
16278a80828l5100l5114j57634p0872K52651P5232k7539j31667k15960r2984P0667
16267e49148K52574J30141J65839q93J13759J50952j70895o7599J67884m9104
16257A43510j38565r5621K9591J3204p7062J79674P3899j25932N5597Q8387q0577
16246F6105R329j17175j42630J82141j87627n8683J34351J42025O2651j51025
16236f0538J10746J74189p2235k45298j30066J30489K00482J9191M1736k3076
$$ plain form
16311 -55652 -127889 -192799 -309332 -319435 -240737 -181706 -141761 -92316 -89459 -138983 -243034
16300 -243034 -294432 -155969 -195194 -203016 -229080 -147748 -287648 -319870 -295051 -335755 -214475
16289 -214475 -306226 -313073 -228691 -166387 -79844 -101373 -75071 -112252 -76939 -23455 -180828
16278 -180828 -215928 -251042 -408676 -479548 -226897 -151665 -179204 -310871 -526831 -619815 -549148
16267 -549148 -296574 -166433 -594 -1487 112272 263224 92329 24730 192614 143510
16257 143510 4945 -90676 -61085 -47881 -124943 54731 128630 2698 58295 146682 66105
16246 66105 75434 -41741 -184371 -2230 -189857 -248540 -114189 27836 90487 -60538
16236 -60538 50208 224397 152162 -93136 -223202 -92713 107769 126960 168696 145620
16226A45620p3995q5367J00508m1538k00022j5654N3694O0865J34404n2097k79650
16215b53232L546J71288P3196M0094K8169o0033R4268M0384K1339M8214j25406
16204H1827j98444p6479J64181k6289j11464j22540j30855O390J15568J35455
16194a62650K5945p2558L5234J48713l5479l5786r8462J16501O9067j95320m0634
16183b45429L6442M7526J87633J08312m0500J3485J00954L5895k24673o9302K1439
16172b8218L2j26862p0031K7645m7987M7886J42162Q1729j80233j74021K5946
16161c01952K10194M2815J7067O1708J18669r4687n7215l2606j64802n406r446
16150b15661K5780K40114l3598k18832K3618Q9274K0268j13201l5499n8044O9841
$$ plain form
16226 145620 71625 -13742 86766 45228 -154794 -170448 -116754 -55889 78515 26418 -253232
16215 -253232 -249686 -78398 -5202 34892 63061 3028 97296 137680 159019 207233 81827
16204 81827 -116617 -193096 -28915 -55204 -166668 -289208 -420063 -413673 -298105 -162650
16194 -162650 -136705 -209263 -174029 -25316 -60795 -96581 -195043 -78542 -9475 -204795 -245429
16183 -245429 -208987 -161461 26172 134484 93984 107469 208423 244318 19645 -49657 -28218
16172 -28218 -28186 -155048 -225079 -197434 -245421 -197535 -55373 26356 -153877 -327898 -301952
16161 -301952 -91758 -48943 -31876 29832 148501 53814 -3401 -36007 -200809 -206215 -215661
16150 -215661 -189881 50233 16635 -202197 -178579 -89305 -69037 -182238 -217737 -275781 -205940
16139b05940J12362J60545P3687J02169j77101l01651j08940r2294L3663J18216
16129b85284Q4159m7646o0134O6226r0841J25264K36402L8916P212j37539j64633
16118b27898J63694J19381l4333j72445P1380j0604Q7293J30217J7460Q812j05536
16107D7421j62372j03545n3743j2800j06641P0174J31466l577m3709P9408j35533
16096b93451L739J36496K00166Q654l1484j82886k46949j17620R6678J57075J31278
16085a38304O2348J9002l2042k7834m779J36633N7931j84791j43011J60638J94933
16074A00724j32517k35253o8771p0536J10194J64395K02300o604n4214p5536o2086
16063a27904q3595J06529J02568K7231J14756L6520Q314K3642J4347k24153j12928
$$ plain form
16139 -205940 -93578 66967 140654 242823 65722 -235929 -344869 -437163 -403500 -285284
16129 -285284 -201125 -248771 -308905 -242679 -333520 -208256 28146 67062 74274 -63265 -227898
16118 -227898 -64204 55177 20844 -151601 -80221 -90825 -3532 126685 144145 152957 47421
16107 47421 -114951 -218496 -272239 -285039 -391680 -321506 -190040 -193617 -237326 -157918 -293451
16096 -293451 -289712 -153216 46950 55604 24120 -158766 -405715 -523335 -426657 -269582 -138304
16085 -138304 -75956 -56954 -88996 -116830 -121609 15024 72955 -111836 -254847 -94209 100724
16074 100724 -31793 -267046 -335817 -406353 -296159 -131764 70536 63932 9718 -65818 -127904
16063 -127904 -211499 -104970 -2402 24829 139585 176105 184419 208061 222408 -1745 -114673
16052a14673l206l6981j6080J25937j72197O5834J71178l3518q4842K3232k188
16041g7504J19958o6568j67476q7826j0302K21385J64249K3642j5045o4287m8550
16030h324j42387J0711L8170N0001j20067J14937L14992K24853j43976k16562
16020A22348p1985N1317M7604r86o7014o3361m8068p3320O7167K5541j11053R9023
16008b2787N4802M2542L1861j16653o1673L0427p7293M477K32541m1159j66380
15997h9295O5517N4819Q3217o6172o0410J66027P7899j08641j7551r6343j04665
15986i5598m0169n5400R5203J25987j4336r6740N4451J72875j59530K9072Q0562
15975I6377l2288k95549k25534N7628J39533n3526n3497J53369q6522M9100O0086
$$ plain form
16052 -114673 -117879 -154860 -170940 -45003 -217200 -151366 19812 -13706 -98548 -75316 -77504
16041 -77504 42454 -24114 -191590 -279416 -289718 -68333 95916 119558 104513 40226 -8324
16030 -8324 -150711 -140000 -101830 -51829 -171896 -56959 258033 482886 338910 122348
16020 122348 50363 101680 149284 148298 81284 17923 -30145 -103465 -36298 -10757 -121810 -22787
16008 -22787 32015 74557 106418 -10235 -71908 -41481 -118774 -114297 118244 77085 -89295
15997 -89295 -23778 31041 114258 48086 -12324 153703 231602 122961 105410 9067 -95598
15986 -95598 -135767 -191167 -95964 30023 15687 -81053 -26602 146273 -13257 15815 96377
15975 96377 64089 -231460 -456994 -399366 -259833 -313359 -366856 -213487 -300009 -250909 -190823
15964a90823n0675K01501J29286j9832l4040L4476J30466q9775m0011J15422j31071
15953E4924p5595j2589P8831P6936l1570Q238Q6660n4969p1938j42909p2718k1949
15941a78648j04653k12508J27358K12146J8300n9446n5765M8000N7388Q5673j18845
15930a81000r2082J29396N5805J2730L7631J4952j41395o6727J49332K3143j50144
15919b08359K4821L8326j0105O352p000k1285P1230J61876l7181j11359O9293
15908b3391j06799j0515O6744k2321j102J18949J34697M8647j90720k82279L7360
15897b30730O3232M0072L2654J11349J76104J33317n199k10332j26203L2663q4073
15886f7146p5838j18145l4188j43387j30316R7135K65165J38335K2755J38482
$$ plain form
15964 -190823 -241498 -39997 89289 69457 35417 69893 200359 110584 70573 185995 54924
15953 54924 -20671 -33260 45571 122507 90937 99175 185835 130866 58928 -83981 -156699 -178648
15941 -178648 -283301 -495809 -368451 -156305 -138005 -197451 -253216 -205216 -147828 -62155 -181000
15930 -181000 -273082 -143686 -87881 -75151 -37520 -22568 -163963 -230690 -81358 -58215 -208359
15919 -208359 -183538 -145212 -155317 -148965 -155965 -177250 -106020 55856 18675 -92684 -23391
15908 -23391 -130190 -140705 -73961 -96282 -97384 21565 156262 204909 14189 -268090 -230730
15897 -230730 -167498 -127426 -94772 16577 192681 325998 320799 110467 -15736 16927 -67146
15886 -67146 -142984 -261129 -295317 -438704 -569020 -471885 -206720 -68385 -45630 92852
15876I2852J72350k0165k20683k46591r4840Q4197j1581l4271m5911n673k0693
15865c51009L4306J39775J70039M0271R6832P8033R3919q8535N0343O0101j06134
15854B17941k95409j25942K31785K1176n2853k58700l787Q9243L22115J03003
15844B48572o8737Q2371l6820J03096j7340O2301k7206O8822j26651l2024r119
15833B47265R4431o5577n6832R5368N3008K9992K6216j61322j17257k1104l4463
15822H9725p4548J02192J45412P5381o2013q1417j4830P4987P7928J15936o2679
15811C86074l8141P392O3148j99622k18465K2049J05791j0922N6398j76832j72800
15800a75930P0109J00275J49056L3254l8358k23816m2969J54750l7837j11769
$$ plain form
15876 92852 265202 245037 24354 -222237 -317077 -232880 -244461 -278732 -324643 -330316 -351009
15865 -351009 -316703 -176928 -6889 33382 130214 208247 302166 213631 263974 324075 217941
15854 217941 -77468 -203410 28375 49551 -3302 -262002 -265789 -176546 145569 248572
15844 248572 179835 262206 225386 328482 311142 373443 346237 415059 288408 256384 247265
15833 247265 341696 276119 219287 314655 367663 397655 423871 262549 145292 124188 89725
15822 89725 15177 117369 262781 338162 276149 194732 179902 254889 332817 448753 386074
15811 386074 347933 355325 418473 218851 386 22435 128226 117304 173702 -3130 -175930
15800 -175930 -105821 -5546 143510 176764 138406 -85410 -128379 26371 -11466 -123235
15790a23235l5986j01416J4596J20439O9094J94086J50844j33502j70449J62784
15780A47255j10726j21438K78312Q9052j72100M891J08660q7624r1056K2036p2065
15769d803r2201J17728Q0432q6666K0898J20274J5340j20163M5887K5823o5136
15758E7413r1572Q9919q9216k7855l2733R4363R5054n4716j22669J07375J45180
15747A70543J40340o1049r4242L7836j06715j03746k25388n4207K36537Q2140
15737B2049J58654j37689k70082j13587r4918k2799Q6392N8133K6085J32423J77925
15726B2586m875k6323P928J60966m0937j69500M8088N1837M4819M7321O3970n8015
15714A47865q6934J41422p5261m8809P8563M3499j982r2320j68151j17768M5007
$$ plain form
15790 -123235 -159221 -260637 -246041 -125602 -56508 137578 288422 154920 -15529 147255
15780 147255 36529 -84909 193403 282455 110355 115246 223906 136282 45226 67262 -4803
15769 -4803 -97004 20724 101156 14490 35388 155662 171002 50839 96726 122549 57413
15758 57413 -34159 55760 -33456 -61311 -94044 319 95373 40657 -82012 25363 170543
15747 170543 310883 249834 155592 193428 86713 -17033 -242421 -296628 -60091 22049
15737 22049 180703 43014 -227068 -340655 -435573 -458372 -371980 -313847 -287762 -155339 22586
15726 22586 17711 -8612 -684 160282 119345 -50155 -2067 49770 94589 141910 205880 147865
15714 147865 60931 202353 127092 78283 156846 200345 198363 106043 -62108 -179876 -134869
15703a34869J87751J41595j02560j9156j13213o9200J38124R1157m9359m0542
15693B9728m5203J21860j5172P5483n005n5503P3476M177m9k8213j78869j24408
15681a47698N1363N4924m6784j34236O5329J41624p469n2928K58151N0555k01921
15670C0910n6226K1558M6390j11641Q0470Q5182K7496K4785r1907j416o4536l0420
15658c9355p50L973n3902p0312j1627K08062l1882k5452J06824j4654j14747k3730
15646f7552j53480j45143J94718J29556R3323J32449J70058P9787k6719j80568
15636B26429j14152K3123j64575n5209J11931J27521K9365O9953J11494J561k5209
15625C42232k66753j49041L4129j23463N0719J20786J70740M7226q2751m7957
$$ plain form
15703 -134869 52882 194477 91917 72761 -40452 -109652 28472 119629 70270 29728
15693 29728 -15475 106385 91213 166696 161691 106188 179664 183841 183792 155579 -23290 -147698
15681 -147698 -96335 -41411 -88195 -222431 -157102 -15478 -22947 -75875 182276 232831 30910
15670 30910 -25316 -3758 42632 -69009 11461 96643 124139 148924 57017 55601 -8935 -39355
15658 -39355 -40105 -36132 -90034 -160346 -171973 36089 4207 -21245 85579 70925 -43822 -67552
15646 -67552 -221032 -366175 -171457 -41901 51422 183871 353929 433716 406997 226429
15636 226429 112277 135400 -29175 -84384 27547 155068 184433 254386 365880 367441 342232
15625 342232 75479 -73562 -39433 -162896 -112177 8609 179349 226575 143824 95867
15615I5867O5878p1963j68055Q0369n1396J21802P8910k1357K2672J6409m2905
15604A26231j52534j65964J00959J42614m6615O8863K0364r9489j50301J20890
15594c4982Q8591r2262k7892R9964J90867J44064q4244r54p61N326o5765l1461
15582A90491j3906l6550K5780k71K8212m1946j12802P9486O4871J4602j33069
15571F4898j06261j42271R0475J99131P3031k4834K9589M9712o6626j96081j24235
15560a53472J50633K02397Q3282j5087j56797j45142J9259J54951k4050r3959
15550B2015J46980j2670p8484j81741n9237J22730J6406J12886M6777l492Q2545
15539B14715n5319k12540j09305J5342M0194m8727m9645J0192J7761o478L4770
$$ plain form
15615 95867 161745 89782 -78273 2096 -49300 72502 151412 130055 152727 169136 126231
15604 126231 -26303 -192267 -91308 51306 4691 73554 93918 -5571 -155872 -34982
15594 -34982 53609 -38653 -66545 33419 224286 368350 284106 283152 282391 287717 221952 190491
15582 190491 176585 140035 165815 165544 193756 151810 39008 118494 183365 197967 64898
15571 64898 -41363 -183634 -93159 105972 179003 154169 183758 233470 166844 -29237 -153472
15560 -153472 -2839 199558 282840 267753 110956 -34186 -14927 140024 115974 22015
15550 22015 168995 156325 77841 -103900 -163137 -40407 -24001 88885 135662 132170 214715
15539 214715 159396 -53144 -162449 -147107 -106913 -155640 -205285 -195093 -177332 -183810 -149040
15528a49040n057R3292J70002n8946r7213J6138K147K5735N4471k14589J9050
15517a44010J19520J21274K1095O7134l7921j85826J38041l4330J46432N4689
15507B66098l3835j67882n6442k386j222k9627K10686J98738r7862J19767Q1384
15496D87417p0028q6264o829Q4531j54465j76034m3368j1246k2273m4671J61844
15485A18614Q7862J19206O0319j19088j40642l7235K13239P2266l05582j73977
15475a05018J53368Q8306J26925k6364p5645j83510J01840J92404J79987N7580
15465E09873p7043q5448o9102r589j19229k2273l7974L20761K40281j01458r4411
15454D54388K3150n8164Q437j1381j2804J7870O8301R6700J30816l383K0088j19437
$$ plain form
15528 -149040 -154097 -60805 109197 50251 -46962 -30824 -28677 -2942 51529 -163060 -144010
15517 -144010 -24490 96784 117879 185013 147092 -38734 99307 64977 211409 266098
15507 266098 232263 64381 7939 5553 4331 -25296 185390 384128 286266 406033 487417
15496 487417 417389 331125 324296 408827 254362 78328 34960 23714 1441 -43230 118614
15485 118614 206476 325682 386001 266913 126271 89036 302275 374541 68959 -105018
15475 -105018 48350 136656 263581 237217 161572 -21938 79902 272306 452293 509873
15465 509873 432830 347382 278280 268691 149462 127189 89215 409976 650257 548799 454388
15454 454388 477538 419374 427811 416430 403626 421496 489797 586497 717313 713930 734018 614581
15442F14581R1247R6382j68749J0732R1862J3759O3112M8419n0615j313k7432
15431G81985k990J2576k6101M5284j4079n2308l5036Q2471P4437k9565Q2832j57370
15419G62136j83106j64661l3068J79419R2127m345J6832l9762J3471n0822q044
15408E80177q401n0529J13366J45115J22211L8426l9161o107o6124q0190M7556
15397G96339J61818j31556L6610q5643k4343J20724J90270N2877r924m6662k5841
15386A034669J53451R4866J20679M1829L4210K5775p5658q3467O6421P6488j11839
15375A377424O9313K09136K73256P4457p0811K67228L01742J70737R0356K06631
15365B969469K9375J02330L86023L53452K53069L86332K76416K97458K85848M38023
$$ plain form
15442 614581 705828 802210 633461 644193 736055 749814 812926 861345 810730 809417 781985
15431 781985 778995 791571 765470 810754 796675 744367 709331 791802 866239 836674 919506 762136
15419 762136 579030 414369 381301 560720 652847 648502 665334 625572 639043 588221 580177
15408 580177 571776 521247 634613 779728 901939 940365 901204 895097 828973 748783 796339
15397 796339 958157 826601 863211 777568 753225 873949 1064219 1117096 1107172 1060510 1034669
15386 1034669 1188120 1282986 1403665 1445494 1479704 1505479 1429821 1346354 1412775 1489263 1377424
15375 1377424 1446737 1655873 1929129 2003586 1932775 2200003 2501745 2672482 2762838 2969469
15365 2969469 2998844 3101174 3487197 3840649 4093718 4480050 4756466 5053924 5339772 5777795
15355E777795M95773O02702Q19867P98601J104107J301518J467169J574136J834817
15346A5776485K207507K466161K652190K830026K933152K829885K539628K309372
15338C6544406J799134J312746R94956M03249K60464m9746l02846j27486K16548
15329D1051425R14669J488486K137294K911852L247664L728094L922421L829453
15321F3231358L454507L003919K643407J918525J185920N12090m5134o90646j396121
15312G3817825k086246k578895k763307k961939l126457l138871k731503k342938
15304E2087669j632808p38046m03785O3708K45804n5163k57451m34831q25338
15295D8049759j322729j914433k382818k687783k933449l110053l027622l007793
$$ plain form
15355 5777795 6273568 6876270 7696137 8494738 9598845 10900363 12367532 13941668 15776485
15346 15776485 17983992 20450153 23102343 25932369 28865521 31695406 34235034 36544406
15338 36544406 38343540 39656286 40651242 41054491 41314955 41265209 40962363 40834877 41051425
15329 41051425 41966094 43454580 45591874 48503726 51751390 55479484 59401905 63231358
15321 63231358 66685865 69689784 72333191 74251716 75437636 75949726 75904592 75213946 73817825
15312 73817825 71731579 69152684 66389377 63427438 60300981 57162110 54430607 52087669
15304 52087669 50454861 49716815 49313030 49376738 49622542 49567379 49309928 48875097 48049759
15295 48049759 46727030 44812597 42429779 39741996 36808547 33698494 30670872 27663079
15287B7663079k813523k222806k072995j773746j453105j106196r62580j045279
15279A4212849o98299p08864n58172m83780n66805m99872m32488j84855l49966
15270I729748n89733n27499m49530l35877k88998k59227k71949l32665k45165
15261F429105n8336k19280k35442j42607l8749n9354j34467j57205Q4909q5173
15251E383401l62886j53546j37488J4948j18915k83508j87005r8585m2011n6346
15241C958059j74982j82337K9192m202k0999q3452j27795r2094J3961J24282k652
15230C436981j72281j72574k61094r5559M2192j10739p5584o0571n9343o7871
15220B403557j1153N692M042K2496k5837J544L1221m3040k35646r1416J29340
$$ plain form
15287 27663079 24849556 22626750 20553755 18780009 17326904 16220708 15258128 14212849
15279 14212849 13514550 12805686 12247514 11763734 11196929 10697057 10264569 10079714 9729748
15270 9729748 9140015 8612516 8162986 7827109 7538111 7278884 7006935 6674270 6429105
15261 6429105 6370769 6151489 5916047 5773440 5734691 5675337 5540870 5383665 5468574 5383401
15251 5383401 5020515 4866969 4729481 4744429 4625514 4342006 4155001 4056416 4014405 3958059
15241 3958059 3783077 3600740 3629932 3625730 3604731 3521279 3393484 3301390 3315351 3439633 3436981
15230 3436981 3264700 3092126 2831032 2735473 2777665 2666926 2591342 2530771 2471428 2403557
15220 2403557 2392404 2398096 2402138 2424634 2398797 2400341 2431562 2388522 2152876 2061460 2190800
15209B190800l9533k7109J7608k5114p7997L7240q504j50967P8753R9775j2835
15198B082117j68947j45996O0189K20110N0623j69322q2264j83581j481N6839
15188A718287j9931l9035k9880Q7865j56177K7862o512q8237P5074N3766o0081
15177A563001K8238j01936l6202j24980k6768R3730J04535n8870m6389J7482k53937
15166A157904L3930l1192q3998n015J38108L8990r7795r9752r4291o3401L8477
15155I31965q4921k39686j28364J25090K06993O8297K8898J23562J07657k51318
15145H88173p486k6062r793j2688m1247p2773j3642k7964j49862j30293m8931
15134C47432m9554k6906o3713J8854J64292K64202m9232j90111n9031J21057J39097
$$ plain form
15209 2190800 2151267 2124158 2141766 2116652 2038655 2075895 2067391 1916424 1995177 2094952 2082117
15198 2082117 1913170 1767174 1827363 2047473 2098096 1928774 1846510 1662929 1661448 1718287
15188 1718287 1698356 1659321 1629441 1717306 1561129 1588991 1582479 1494242 1569316 1623082 1563001
15177 1563001 1591239 1489303 1453101 1328121 1301353 1395083 1499618 1440748 1394359 1411841 1157904
15166 1157904 1191834 1160642 1076644 1071629 1209737 1248727 1150932 1051180 956889 893488 931965
15155 931965 847044 607358 478994 604084 811077 879374 908272 1031834 1139491 888173
15145 888173 880687 854625 844832 832144 790897 718124 704482 676518 526656 396363 347432
15134 347432 297878 270972 207259 226113 390405 654607 605375 415264 356233 477290 616387
15123F16387n7983P9509m3122j77250j11422o5533J11037O1142j64308j44255
15113A04202m9761K15196J20463J60898k3439n8186J90003j16358j27923o1903
15103C53192J08768P0482R4228j03241J52188l6701o4757N2542q0243j32735l2917
15092C80806k44872j00108K48659Q9560m3477M5702J02774M169j52302o9310K1258
15081B82859K2205o955r0384l2143L2081N0092J6204j2053O9560n9929l9532J63932
15069C95937o6422k39043j62609j80876J13442J5912j72522J87747O6289K4366
15059a7779J25029r886p6316p8360j49066j77412J40790K12428J49442O8931J35877
15048C23678m8295j40956l8910p9559J43721m687j37361O154l2116p6876M4830
$$ plain form
15123 616387 558404 637913 594791 417541 306119 240586 351623 412765 248457 104202
15113 104202 54441 269637 390100 550998 527559 469373 659376 543018 415095 353192
15103 353192 461960 532442 626670 523429 675617 638916 574159 626701 546458 413723 380806
15092 380806 135934 35826 284485 374045 330568 376270 479044 483213 330911 261601 282859
15081 282859 305064 298109 207725 175582 207663 257755 273959 261906 331466 271537 232005 395937
15069 395937 329515 90472 -72137 -253013 -139571 -123659 -296181 -108434 -42145 -17779
15059 -17779 107250 97364 21048 -57312 -206378 -383790 -243000 -30572 118870 187801 323678
15048 323678 275383 134427 95517 15958 159679 154992 17631 23785 -8331 -85207 -40377
15037d0377K1448K0850O7706k4919j27632j06025O3248L24382K18857q6406j12400
15026B18732J623n2968o7687j2194q8656l5459L3671J22903o2940j30276q9905
15015a63156J77078J8070r3035j8450J84186J53188j49426k44442j49345N6132
15005b29200J93705M3059j91448p1234J71119r0097j8294o3298l5833J53353J08800
14994b9368P633j58116n2610r8700P9026P1717m6795P7559O1400r4519O1851J77385
14982E6463j7J53419N166k75140j55476L9214P4446J42633m5038o6429o971l0925
14970a08655R1367K8719j26255K4687M4075j58583j16854K22204J17302J4375
14960C2382j27116o3439l4723K3306L6360l6576M1273j15925J7696N8831j3888
$$ plain form
15037 -40377 -18929 1921 69627 44708 -82924 -188949 -125701 198681 417538 331132 218732
15026 218732 220355 167387 99700 87506 -1150 -36609 -2938 119965 57025 -73251 -163156
15015 -163156 13922 31992 -61043 -79493 104693 257881 108455 -135987 -285332 -229200
15005 -229200 -35495 7564 -183884 -255118 -83999 -174096 -192390 -255688 -291521 -138168 -29368
14994 -29368 -21735 -179851 -232461 -331161 -252135 -180418 -227213 -149654 -88254 -182773 -120922 56463
14982 56463 56446 209865 215031 -60109 -215585 -176371 -101925 40708 -4330 -70759 -77730 -108655
14970 -108655 -17288 11431 -114824 -90137 -46062 -204645 -321499 -99295 18007 32382
14960 32382 -94734 -158173 -192896 -169590 -133230 -169806 -128533 -244458 -226762 -167931 -181819
14949a81819q5666p5011p3143J50092j2689J03069J99764J19782M1582j18434
14939F7527j14998p1953Q1746l4625Q855P1753P3365P2953N376p1663p3063L4043
14927D9316j13813m3899J27769R3142P2613p4090q9684J1902n5053q1550J61586
14916E8239J48699J74823j38939r3121O4922Q4390L7861K07428l7568k84106j24082
14905I8546j53819Q4677p6483M9068k1804K1015J94538K3183o9979j7145M8643
14894A80440J4075j22649j43580R9803J26921J46436l6838j73392J7498j01639
14884G075m220J7744o5885N1287j18695j36155m0465K11101J7480J8066J94676
14873A52009J23958j19540l7481l3327o52p1720k11993m4114N6137q777J97299
$$ plain form
14949 -181819 -267485 -342496 -415639 -265547 -278236 -175167 24597 144379 185961 67527
14939 67527 -47471 -119424 -37678 -72303 -63448 8305 81670 154623 159999 88336 15273 49316
14927 49316 -64497 -108396 19373 112515 185128 111038 21354 33256 -21797 -103347 58239
14916 58239 206938 381761 242822 149701 214623 299013 336874 544302 506734 222628 98546
14905 98546 -55273 29404 -47079 1989 -19815 1200 195738 218921 148942 131797 180440
14894 180440 194515 71866 -71714 28089 155010 301446 264608 91216 108714 7075
14884 7075 2855 20599 -45286 6001 -112694 -248849 -289314 -78213 -60733 -42667 152009
14873 152009 275967 156427 118946 85619 84967 13247 -198746 -242860 -186723 -195500 1799
14862A799K1960j56098J4506o9378l5275K8621N3143R2921M5229K5838j2229l7976
14850b6939K0156q5300n4610N4094m629o1096K449M2571l5346n9006j78332p9464
14838d65452K6306J20872K38953J09510P3543j4072m1626Q1911l1706k10210m5637
14827a57608J55747O0316j13353l6323o3774j88505R4105J36823k7717J6929j7744
14816a41104k1443J03903n121q6437M1283J93808J80306j62682r3771n5294J53111
14805A06559J62673j23215n3270M4507n0768k0048j37419j12761J82933J25769
14795A24960R5297j27481q3477P2964K63370L5100j48907J14541Q9764q9948q8020
14784B58163j60186j65092J94085P1233l9706k642K21067J24851q7474k5544P420
$$ plain form
14862 1799 23759 -132339 -117833 -187211 -222486 -193865 -140722 -47801 -2572 23266 11037 -26939
14850 -26939 -6783 -92083 -146693 -92599 -97228 -158324 -155875 -113304 -148650 -207656 -385988 -465452
14838 -465452 -439146 -318274 -79321 30189 103732 89660 48034 129945 98239 -111971 -157608
14827 -157608 -1861 58455 -54898 -91221 -154995 -343500 -249395 -112572 -140289 -123360 -141104
14816 -141104 -162547 -58644 -63765 -150202 -108919 84889 265195 102513 8742 -46552 106559
14805 106559 269232 146017 92747 137254 86486 66438 -70981 -183742 -809 124960
14795 124960 220257 92776 9299 82263 345633 380733 231826 346367 436131 346183 258163
14784 258163 97977 -67115 126970 198203 158497 155855 376922 501773 414299 388755 396175
14773C96175n336p4653j09034j62164M8840J76064Q4954J1220q2692J2623p4579
14762B21418j72342j33686Q1007j5776M9773J51751J63545k432m4491k58573j76317
14751a36123j56051M5292K31388L3383o4818l3123j06153K028K6675J9253J19187
14740a9062J65121r8240j91056m8715J3107N7978k2095Q4633L0271J675q5657
14729a12040K7014R3973m6472J05909L5710j07528m897P834p7275j9033J9059
14718g7746n1518L350R1830p3497K2919L0718j12506j04723M5345J19019j43059
14707b49868o7686K9206n4497j15969K59993J09247j41308P6674K8035K14856
14697H8683R0084q6273J34732j85201o0661J85296O8837m2158j38979K0658N0240
$$ plain form
14773 396175 390839 316186 207152 44988 93828 269892 354846 366066 283374 295997 221418
14762 221418 49076 -84610 -3603 -19379 30394 182145 345690 343258 298767 40194 -136123
14751 -136123 -292174 -246882 -15494 17889 -46929 -80052 -186205 -184177 -157502 -138249 -19062
14740 -19062 146059 47819 -143237 -191952 -178845 -120867 -142962 -58329 -28058 -26383 -112040
14729 -112040 -85026 8947 -37525 68384 104094 -3434 -8331 -497 -77772 -96805 -77746
14718 -77746 -129264 -125914 -34084 -107581 -84662 -53944 -166450 -271173 -225828 -106809 -249868
14707 -249868 -317554 -288348 -342845 -458814 -198821 -89574 -230882 -154208 -126173 88683
14697 88683 178767 92494 227226 42025 -18636 166660 235497 193339 54360 75018 125258
14686A25258L729j50187p6869J23888l2418p6090M0951m5770j32714J36482J4441
14675f9299j20815P7904J4980k8462P6606M1030R9281O195k11909j40682J30229
14664a24942K34910k7410j38061r6417j38839J12225Q2026k0379j51154m4872
14654c12913J68220J74391J5041k9879j64279k10871J12034J72556l4061l6554
14644a46315m4405R3097R2783L6561J07957p9643o2354j15987q5755o1489J7475
14633b48075j488R3653Q5606k9338j71856j6094K69871k6193M2267l059p7597
14622h2303m5549q6546j37797J83964M1606J7479r6880m5944r9825n2956L9959
14611c64792J40244K58853O8647k31308N1881m7827N3152J2453j35489M3648M7565
$$ plain form
14686 125258 128987 -21200 -98069 25819 -6599 -82689 -41738 -87508 -220222 -83740 -69299
14675 -69299 -190114 -112210 -97230 -125692 -49086 -8056 91225 97420 -114489 -255171 -124942
14664 -124942 109968 82558 -55503 -151920 -290759 -178534 -96508 -116887 -268041 -312913
14654 -312913 -144693 29698 44739 14860 -149419 -360290 -248256 -75700 -109761 -146315
14644 -146315 -190720 -97623 -4840 31721 139678 60035 -2319 -118306 -204061 -265550 -248075
14633 -248075 -249563 -155910 -70304 -99642 -271498 -287592 -17721 -43914 -1647 -4706 -82303
14622 -82303 -127852 -214398 -352195 -168231 -126625 -109146 -206026 -251970 -351795 -404751 -364792
14611 -364792 -224548 34305 102952 -128356 -76475 -124302 -71150 -58697 -194186 -150538 -102973
14600a02973O8583L707J2558J1389K30387J08096P5383l8679K5328M8218r9866
14589C42131j78283r8559q7081O7325K9019L9728Q0201q5351j10687K880Q6755
14578H8078j09062j89653j9653O4716o3143j4319J09756Q9791o3532K0148K1909
14567f4964J18645J09750J8310N3757j03264k02373R870L11092O5655k65372j34532
14556h3426j35897L7274J09819J6864M6151L5766k51771j79189r2123P8592P4475
14545c43465J04263R3561P6592M1667l0445J14956j64872j44685J01231J51671
14535D74R6671k689p6725j7788j1498J01538j40353j1900p5931J7728l3727n9247
14523b13447J3461L13027m405q3723l4485J30574Q4084o9283q9466r6447Q847
$$ plain form
14600 -102973 -34390 -30683 -18125 -6736 223651 331747 407130 368451 393779 441997 342131
14589 342131 163848 65289 -21792 45533 74552 114280 194481 109130 -1557 1323 88078
14578 88078 -20984 -210637 -230290 -165574 -228717 -243036 -133280 -43489 -107021 -86873 -64964
14567 -64964 53681 163431 181741 235498 132234 -70139 -60269 250823 316478 51106 -83426
14556 -83426 -219323 -182049 -72230 -55366 -9215 26551 -225220 -404409 -496532 -417940 -343465
14545 -343465 -239202 -145641 -69049 -27382 -57827 57129 -107743 -252428 -151197 474
14535 474 97145 94456 17731 -57 -11555 89983 -50370 -62270 -138201 -120473 -154200 -213447
14523 -213447 -199986 113041 108636 24913 -9572 121002 205086 135803 46337 -50110 -41263
14512d1263n2505J2700Q9843o5087j07813p081j22961O2710K9619Q2461J32576
14501A3199m669n2815j23281n6716J18554m9575j166J30357Q5336o4493k7932
14490c3201K533K00724J08623k0146p6799j76565j07342J8225O465r8929j0764
14479a87176M8183J71675j6947n9560m7835K8363l7946N434J76721K11823j03399
14468A89336j23197l5514L8692J8457j07290L5006j20328p8328J4034Q7439K15938
14457A34245K0317j70227j18510J20384n7877R928J34040O1101o738j20876n8127
14446e2340j02489N4219p1275J0435J12822J03397r5381m4935K607L4528r472
14435e7884k8874r9768J32659j9064r2618J58411J96718j98533j92143j37875
$$ plain form
14512 -41263 -93768 -81068 8775 -56312 -164125 -171206 -294167 -231457 -201838 -119377 13199
14501 13199 8530 -44285 -167566 -224282 -105728 -155303 -156469 -26112 59224 -5269 -33201
14490 -33201 -30668 170056 278679 258533 181734 5169 -102173 -83948 -77483 -176412 -187176
14479 -187176 -138993 32682 15735 -43825 -91660 -63297 -101243 -95809 80912 292735 189336
14468 189336 66139 30625 69317 87774 -19516 15490 -104838 -183166 -169132 -81693 134245
14457 134245 154562 -15665 -134175 -13791 -71668 -61740 72300 133401 126663 5787 -52340
14446 -52340 -154829 -100610 -171885 -161450 -48628 54769 -40612 -85547 -82940 -48412 -57884
14435 -57884 -86758 -186526 -53867 -72931 -165549 -7138 189580 -8953 -201096 -338971
14425c38971m6356J38642P2338K0063Q9266q9508r7917J07369J42216l2044M1010
14414F108L74m5547Q2512n9775j54784j5650L2542O5695J43014p8041o6942j72230
14402b62724j2489J13689M4886P7709k0629j37764j08936L412Q6376J57101N9913
14391E44M2497J36789j31313q6191M8531m561N0185l1289L2968l6239r8231n7224
14379a33534j15100q0684l8240L5211M3750J84307J55674P8326l7688k8776k5157
14368C8089P8336r9214q6536J28604J69518q6394j17161r6975j4560J151q0679
14357a65821j9626k7012J5034q899n9709r0144J19096R9827K1733J94j97776o9729
14345c82832J87436J58134N5630n2382J00149J4868p0810K2874r3186J6278p1819
$$ plain form
14425 -338971 -385327 -246685 -174347 -154284 -65018 -154526 -252443 -145074 -2858 -34902 6108
14414 6108 6482 -39065 43447 -16328 -171112 -186762 -154220 -88525 54489 -23552 -90494 -262724
14402 -262724 -275213 -161524 -116638 -38929 -59558 -197322 -306258 -302846 -216470 -59369 544
14391 544 43041 179830 48517 -37674 10857 6296 56481 25192 58160 21921 -76310 -133534
14379 -133534 -248634 -329318 -367558 -332347 -288597 -104290 51384 129710 92022 63246 38089
14368 38089 116425 17211 -69325 59279 228797 142403 25242 -71733 -86293 -85142 -165821
14357 -165821 -185447 -212459 -197425 -206324 -266033 -356177 -237081 -137254 -115521 -115327 -313103 -382832
14345 -382832 -195396 -37262 18368 -34014 66135 81003 10193 33067 -60119 -43841 -115660
14334a15660k06962k6560J32054J04368n461o5422n3600Q0627J5179r6876O5355
14323a72958J01009P4220m2062p3163p7946o3671J6815J12542K9949P8678j53497
14312a70084l6684N3054M5478Q0495J03584N872l9445j45980p9223k93852N3903
14301d22882P6764q377K5095N4256K8481m016o681k3318n2959J09017J65097K3227
14289c6296o235Q7075O992q2392o4820l8486n0949m1665O6351O9265J08350L8064
14277E5254K5710k8560R1145K7587r223n8463J175N5722o2950j52863j31042N329
14265a81179M9595L6172j41497l6129J78287P6760l2867m5236J0390j8867Q3535
14254b1036L4312j12278k0623Q293O9881r9705j0955M7687N4301M054j02008M10
$$ plain form
14334 -115660 -322622 -349182 -217128 -112760 -118221 -183643 -237243 -156616 -141437 -238313 -172958
14323 -172958 -71949 2271 -39791 -112954 -190900 -254571 -237756 -125214 -95265 -16587 -170084
14312 -170084 -206768 -153714 -108236 -27741 75843 81715 42270 -103710 -182933 -476785 -422882
14301 -422882 -346118 -354495 -329400 -275144 -246663 -250679 -257360 -280678 -333637 -224620 -59523 -36296
14289 -36296 -42531 44544 51536 -30856 -95676 -134162 -185111 -226776 -160425 -91160 17190 55254
14277 55254 80964 52404 143549 171136 161913 103450 104625 160347 97397 -55466 -186508 -181179
14265 -181179 -131584 -95412 -236909 -273038 -94751 -17991 -50858 -96094 -85704 -104571 -21036
14254 -21036 13276 -99002 -119625 -111332 -41451 -141156 -152111 -104424 -50123 -46069 -148077 -147667
14242a47667o019P0435R1394j8503p1445j58139j07264K12549J52948o5240j33281
14231a80232m049k0490j08175J16244J4049O600O6124J00976j7144j75232k0381
14220b21710q388j26824J55032K28247l1264j16035k3061m8087J01505Q2350j25351
14209a33586j55974l8020J2210N6485L8475J66385K62524N7063j12104j44424
14199I034k96062j27307L5303O9154J56671K32353J59093k04656Q5255q5479j55455
14188a22096N4188K23414M2261J09396j4032j44131n6235j2691p0225j41589r1726
14177b23466J76741o2571j25700J3265l2069L4862L8997L54454j8284o7053M5497
14166A34673o0731j11212j3317J6472J2869r7823j91421J03671J22285P9217N0101
$$ plain form
14242 -147667 -153686 -83251 8143 -10360 -81805 -239944 -347208 -134659 18289 -46951 -180232
14231 -180232 -184281 -204771 -312946 -196702 -182653 -176053 -109929 -8953 -26097 -201329 -221710
14220 -221710 -230098 -356922 -201890 26357 -4907 -120942 -144003 -192090 -90585 -8235 -133586
14209 -133586 -289560 -327580 -315370 -258885 -220410 -54025 208499 265562 153458 9034
14199 9034 -287028 -414335 -379032 -309878 -153207 79146 238239 33583 118838 33359 -122096
14188 -122096 -67908 155506 197767 307163 293131 149000 92765 80074 9849 -131740 -223466
14177 -223466 -46725 -109296 -234996 -221731 -253800 -218938 -179941 174513 156229 89176 134673
14166 134673 73942 -37270 -50587 -34115 -21246 -119069 -310490 -206819 -84534 -5317 44784
14155D4784R101L8019p6165j22330j14511Q7696Q948m0275M8300m6904J20522
14144d2815J62470r2986j20947J08546n1177n4641M1439n7155r6328p0795j2183
14133b86572O9588K9936P0037J24185O1136r120j1901j66101o0336O5597m1594
14122a55145r8497k9176K77305K05683o556L4870k31217m9720m500K3049j1934
14111d5838Q20k3935M5496j28442L257q419M2315J13486J02228L7872k233J13436
14099B50043n7000r9408j47369l6794o2615j36094M6590O4980j2368j0957K28319
14088B7327j06552J64810k4596m5288O1407n7817j8194M1677l9276j22375P8q497
14076a27296o0644j0241J21804R7308o1481p8572J31468j40894q5979K40L8932
$$ plain form
14155 44784 53885 91904 15739 -106591 -221102 -133406 -124458 -164733 -116433 -163337 -42815
14144 -42815 119655 26669 -94278 14268 -36909 -91550 -50111 -107266 -203594 -274389 -286572
14133 -286572 -216984 -187048 -117011 7174 68310 59190 47289 -118812 -179148 -113551 -155145
14122 -155145 -253642 -282818 -5513 200170 193614 228484 -2733 -52453 -56953 -33904 -45838
14111 -45838 -45018 -68953 -23457 -151899 -148642 -157061 -114746 -1260 100968 138840 136607 250043
14099 250043 193043 93635 -53734 -90528 -153143 -289237 -242647 -177667 -190035 -200992 27327
14088 27327 -79225 85585 60989 15701 77108 19291 1097 42774 3498 -118877 -118799 -127296
14076 -127296 -187940 -198181 -76377 20931 -40550 -119122 12346 -128548 -214527 -214287 -175355
14065a75355m6770J35274P7792k8150L5935L9911M1505n1956O9839q4414k04267
14054a90656m3552K16439J57785M1316j12411o8409r8603j70974J0376k9700n2243
14043c40632O3344J05298K03938j31436J27824k626k58230k01031J02176J52144
14033a79231O4848k0632J0929j77006K2692k1812R6886O0038q8478J33166k411
14022a01011Q2565n4897p8055M5005o0041M2255J717k3342Q6543N0246j41051
14011a50066k31554J58055O4819K3953j19997j80195K9019Q8047L7382N9700L4649
14000a86188J68809P2912j17416Q503K22973l7322k9530P2581j83548l7269j9562
13989f5057K583k1139m4703K18471L2500P412R4703J91368M303n1204j26622j65164
$$ plain form
14065 -175355 -222125 -86851 -9059 -37209 -1274 38637 80142 28186 98025 13611 -190656
14054 -190656 -234208 -17769 140016 181332 68921 512 -98091 -269065 -258689 -288389 -340632
14043 -340632 -277288 -171990 31948 -99488 28336 25710 -232520 -433551 -331375 -179231
14033 -179231 -114383 -135015 -124086 -301092 -278400 -300212 -203326 -143288 -231766 -98600 -101011
14022 -101011 -18446 -73343 -151398 -106393 -166434 -124179 -122462 -145804 -59261 -9015 -150066
14011 -150066 -381620 -223565 -158746 -134793 -254790 -434985 -405966 -317919 -280537 -220837 -186188
14000 -186188 -17379 55533 -61883 -53380 169593 132271 102741 175322 -8226 -45495 -65057
13989 -65057 -62474 -83613 -128316 90155 122655 130067 224770 416138 420441 369237 242615 77451
13977G7451R76q7563L0075M4275K29177m3888k11305L7018R033n9292m5802j46509
13965a66354l1284J48082o3475r508Q9206j994j70637N0909J79172J24587p1734
$$ plain form
13977 77451 78427 -9136 20939 65214 294391 250503 39198 76216 85249 25957 -19845 -166354
13965 -166354 -197638 -49556 -113031 -122539 -33333 -35327 -205964 -155055 24117 148704 76970
$$ [...]
##END NTUPLES=NMR SPECTRUM
##END=
