##TITLE=Analysis number 313558
Compound Code mo 00053
Project Code adrs
Chemist Name stores
##JCAMPDX= 6.0         $$ Bruker NMR JCAMP-DX V2.0
##DATA TYPE= NMR SPECTRUM
##DATA CLASS= NTUPLES
##ORIGIN= Bruker BioSpin GmbH
##OWNER= NMR
$$ XWIN-NMR		Version 3.5
$$ Mon Sep 12 16:59:07 2005 GMT Daylight Time (UT+1h)  MAYBRIDGE\NMR@NMR_250MHZ
##.OBSERVE FREQUENCY= 250.131544655141
##.OBSERVE NUCLEUS= ^1H
##.ACQUISITION MODE= SIMULTANEOUS (DQD)
##.ACQUISITION SCHEME= undefined
##.AVERAGES= 16
##.DIGITISER RES= 18
##SPECTROMETER/DATA SYSTEM= dpx250
##.PULSE SEQUENCE= zg30
##.SOLVENT NAME= CDCl3
##.SHIFT REFERENCE= (INTERNAL, CDCl3, 0, 16.522)
##AUDIT TRAIL= $$ (NUMBER, WHEN, WHO, WHERE, WHAT)
$$ ##TITLE= Audit trail, XWIN-NMR		Version 3.5
$$ ##JCAMPDX= 5.01
$$ ##ORIGIN= Bruker BioSpin GmbH
$$ ##OWNER= NMR
$$ C:\u/data/dgb/nmr/ADRS/9370/pdata/1/auditp.txt
$$ ##AUDIT TRAIL=  $$ (NUMBER, WHEN, WHO, WHERE, WHAT)
(   1,<2005-09-12 16:58:20.05 +100>,<MAYBRIDGE\NMR>,<NMR_250MHZ>,
      <created by zg, POWCHK disabled, PULCHK disabled
       configuration hash MD5:
       62 19 C7 07 E1 42 D1 B7 37 6C 3D D0 77 39 F9 E6
       data hash MD5: 64K
       6A 7A BB EF C3 CD 25 A2 9C 84 D8 62 D7 8E 06 9F>)
(   2,<2005-09-12 16:58:41.88 +100>,<MAYBRIDGE\NMR>,<NMR_250MHZ>,
      <Start of raw data processing
       ef LB = 0.3 FT_mod = 6 PKNL = 1 SI = 32K 
       data hash MD5: 32K
       07 C2 DA 54 17 EE F2 26 E5 3F E6 EB 90 2E 9F 57>)
(   3,<2005-09-12 16:58:45.08 +100>,<MAYBRIDGE\NMR>,<NMR_250MHZ>,
      <apk 
       data hash MD5: 32K
       13 B8 0C 58 3E 6C B4 D4 EB 5A 8A 28 40 D5 2D 52>)
(   4,<2005-09-12 16:58:46.42 +100>,<MAYBRIDGE\NMR>,<NMR_250MHZ>,
      <abs ABSG = 5 
       data hash MD5: 32K
       83 68 5C D6 47 13 D8 E3 1B D7 3E DD C9 C3 41 4E>)
$$ ##END=
$$ 
$$ hash MD5
$$ 83 D0 3D 70 11 A0 CE 5B 80 6E 13 F2 13 B8 AC 26
##$RELAX= 
##$RELAX= 
##$RELAX= 
##$RELAX= 
##$RELAX= 
##$RELAX= 
##$RELAX= 
$$ Bruker specific parameters
$$ --------------------------
##$DU= <C:\u>
##$EXPNO= 9370
##$NAME= <ADRS>
##$PROCNO= 1
##$TYPE= <nmr>
##$USER= <dgb>
##$AMP= (0..31)
100 100 100 100 100 100 100 100 100 100 100 100 100 100 100 100 100 100 
100 100 100 100 100 100 100 100 100 100 100 100 100 100 
##$AQSEQ= 0
##$AQ_mod= 3
##$AUNM= <au_zg>
##$AUTOPOS= <53 >
##$BF1= 250.13
##$BF2= 250.13
##$BF3= 250.13
##$BF4= 250.13
##$BF5= 500.13
##$BF6= 500.13
##$BF7= 500.13
##$BF8= 500.13
##$BYTORDA= 1
##$CFDGTYP= 0
##$CFRGTYP= 5
##$CHEMSTR= <none>
##$CNST= (0..31)
1 1 145 1 1 1 1 1 1 1 1 1 1 1 1 1 1 1 1 1 1 1 1 1 1 1 1 1 1 1 1 1 
##$CPDPRG= <>
##$CPDPRG1= <>
##$CPDPRG2= <>
##$CPDPRG3= <>
##$CPDPRG4= <mlev>
##$CPDPRG5= <mlev>
##$CPDPRG6= <mlev>
##$CPDPRG7= <mlev>
##$CPDPRG8= <mlev>
##$CPDPRGB= <>
##$CPDPRGT= <>
##$D= (0..31)
0 1 0 0 0 0 0 0 0 0.06 0 0 0 0 0 0 0.0002 0 0 0 0 0 0 0 0 0 0 0 0 0 0 
0 
##$DATE= 1126540698
##$DBL= (0..7)
120 120 120 120 120 120 120 120 
##$DBP= (0..7)
150 150 150 150 150 150 150 150 
##$DBP07= 0
##$DBPNAM0= <>
##$DBPNAM1= <>
##$DBPNAM2= <>
$$ [...]
##$SUBNAM7= <"">
##$SUBNAM8= <"">
##$SUBNAM9= <"">
##$SW= 20.6930455092707
##$SWIBOX= (0..15)
0 0 3 0 0 0 0 0 0 0 0 0 0 0 0 0 
##$SW_h= 5175.983436853
##$TD= 65536
##$TD0= 1
##$TE= 295.16
##$TE2= 300
##$TE3= 300
##$TEG= 300
##$TL= (0..7)
0 120 120 120 120 120 120 120 
##$TP= (0..7)
150 150 150 150 150 150 150 150 
##$TP07= 0
##$TPNAME0= <>
##$TPNAME1= <>
##$TPNAME2= <>
##$TPNAME3= <>
##$TPNAME4= <>
##$TPNAME5= <>
##$TPNAME6= <>
##$TPNAME7= <>
##$TPOAL= (0..7)
0.5 0.5 0.5 0.5 0.5 0.5 0.5 0.5 
##$TPOFFS= (0..7)
0 0 0 0 0 0 0 0 
##$TUNHIN= 0
##$TUNHOUT= 0
##$TUNXOUT= 0
##$USERA1= <user>
##$USERA2= <user>
##$USERA3= <user>
##$USERA4= <user>
##$USERA5= <user>
##$V9= 5
##$VALIST= <valist>
##$VCLIST= <CCCCCCCCCCCCCCC>
##$VD= 0
##$VDLIST= <DDDDDDDDDDDDDDD>
##$VPLIST= <PPPPPPPPPPPPPPP>
##$VTLIST= <TTTTTTTTTTTTTTT>
##$WBST= 1024
##$WBSW= 4
##$XGAIN= (0..3)
0 0 0 0 
##$XL= 0
##$YL= 0
##$YMAX_a= 573085
##$YMIN_a= -604000
##$ZGOPTNS= <>
##$ZL1= 120
##$ZL2= 120
##$ZL3= 120
##$ZL4= 120
##$ABSF1= 16.522
##$ABSF2= -4.171173
##$ABSG= 5
##$ABSL= 3
##$ALPHA= 0
##$AQORDER= 0
##$ASSFAC= 0
##$ASSFACI= 0
##$ASSFACX= 0
##$ASSWID= 0
##$AUNMP= <proc_1d>
##$AZFE= 0.1
##$AZFW= 0.1
##$BCFW= 0
##$BC_mod= 0
##$BYTORDP= 0
##$COROFFS= 0
##$CY= 12.5
##$DATMOD= 1
##$DC= 0
##$DFILT= <>
##$DTYPP= 0
##$F1P= 14.0000005364418
##$F2P= -0.99999901652339
##$FCOR= 0.5
##$FTSIZE= 32768
##$FT_mod= 6
##$GAMMA= 0
##$GB= 0
##$INTBC= 1
##$INTSCL= 1
##$ISEN= 128
##$LB= 0.3
##$LEV0= 0
##$LPBIN= 0
##$MAXI= 10000
##$MC2= 0
##$MEAN= 0
##$ME_mod= 0
##$MI= 0
##$NCOEF= 0
##$NC_proc= -3
##$NLEV= 6
##$NOISF1= 0
##$NOISF2= 0
##$NSP= 0
##$NTH_PI= 0
##$NZP= 0
##$OFFSET= 16.522
##$PC= 1
##$PHC0= 125.9405
##$PHC1= 6.139799
##$PH_mod= 1
##$PKNL= yes
##$PPARMOD= 0
##$PSCAL= 4
##$PSIGN= 0
##$REVERSE= no
##$SF= 250.13
##$SI= 32768
##$SIGF1= 0
##$SIGF2= 0
##$SINO= 400
##$SIOLD= 32768
##$SREGLST= <1H.CDCl3>
##$SSB= 0
##$STSI= 32768
##$STSR= 0
##$SW_p= 5175.98343685301
##$SYMM= 0
##$S_DEV= 0
##$TDeff= 65536
##$TDoff= 0
##$TI= <Analysis number 999999
Compound Code 99
Book Reference 9
Project Code 9>
##$TILT= no
##$TM1= 0
##$TM2= 0
##$TOPLEV= 0
##$USERP1= <user>
##$USERP2= <user>
##$USERP3= <user>
##$USERP4= <user>
##$USERP5= <user>
##$WDW= 1
##$XDIM= 32768
##$YMAX_p= 562973076
##$YMIN_p= -358698
$$ End of Bruker specific parameters
$$ ---------------------------------
##NTUPLES= NMR SPECTRUM
##VAR_NAME=  FREQUENCY,     SPECTRUM/REAL,   SPECTRUM/IMAG
##SYMBOL=    X,             R,               I
##VAR_TYPE=  INDEPENDENT,   DEPENDENT,       DEPENDENT
##VAR_FORM=  AFFN,          ASDF,            ASDF
##VAR_DIM=   32768,         32768,           32768
##UNITS=     HZ,            ARBITRARY UNITS, ARBITRARY UNITS
##FACTOR=    0.157963299565203, 1,           1
##FIRST=     4132.6476996994, 0,             0
##LAST=      -1043.33573715361, 0,           0
##MIN=       -1043.33573715361, -358698,     0
##MAX=       4132.6476996994, 562973076,     0
$$ Real data points
##PAGE= N=1
##DATA TABLE= (X++(R..R)), XYDATA
$$ [...]
17613a23165K6535J5211j568o648O548J7178K3886K7537J9646J2379O571l808
17601B0302k723O957J572J0172Q573O322m302r136j819J098n290p580r811l834
17587A0501o192K015O026J519L516K771M109L012J255k356L665J0946J0670J259
17573E2716p18O148L672o23M469k692o241J827O655r32k372K392o144o498o337
17558D5322q933K551n789K988l443p216n826Q95K655l502o131n71L076R03J157
17543A8136J822J331R93j869l884K087k305o536N581P143K030m725J038J1034
17529C1876P860m95J885N403m86j939q39k496J917L301Q428K950J424M825J003
17514F4617k177j175p318k43L792J230P238K483N076l003r992R26K920m567O628
$$ plain form
17613 -123165 -96630 -81419 -82987 -89635 -83087 -65909 -42023 -14486 5160 17539 24110 20302
17601 20302 17579 24536 26108 36280 44853 51175 46873 37737 35918 37016 31726 24146 14335 10501
17587 10501 4309 6324 12350 13869 17385 20156 24265 27277 28532 26176 29841 40787 51457 52716
17573 52716 51998 58146 61818 61195 65664 62972 56731 58558 65213 64281 61909 64301 58157 51659 45322
17558 45322 36389 38940 33151 36139 32696 25480 19654 20549 23204 19702 13571 13000 16076 16979 18136
17543 18136 19958 21289 22282 20413 16529 18616 16311 9775 15356 22499 24529 19804 20842 31876
17529 31876 39736 39241 41126 46529 46043 44104 43265 40769 42686 45987 54415 57365 58789 63614 64617
17514 64617 62440 61265 53947 53704 57496 58726 65964 68447 73523 70520 60528 61454 64374 59807 66435
17499F6435Q931J409K005M720k105J069K249J793Q297N083m89J0219J2636K0773
17485A43025K3030K8529L3186L9976L0985K4036M2405O3581O4375N7205L7834
17474E88167k7552m2419K777J3686J5932K4427k2210q0728p9452m8789k1602j3370
17462C08867j2288j1800p776M648J1334K3252J7540J4241L9966N8039O3984N6373
17450E66380K2925k6259l0937J762J1951J7211J2554l1722p7415o1412k9689l1006
17438C44343l5795l7178n0392m7152l1989k6024j7005j2114p548p730j3739r397
17426D8280J163L169r475j1814j6390n291J39J345l708o899k603j706J064j594
17412d320l982r19j35m021m294J400O157n791j051j339K550J812m354K109N933
$$ plain form
17499 66435 75366 76775 78780 83500 81395 82464 84713 86506 94803 99886 99397 109616 122252 143025
17485 143025 166055 194584 227770 267746 298731 322767 365172 428753 493128 550333 588167
17474 588167 560615 518196 520973 534659 550591 575018 552808 472080 392628 343839 322237 308867
17462 308867 296579 284779 277003 281651 292985 316237 333777 348018 387984 446023 510007 566380
17450 566380 589305 563046 532109 533871 545822 563033 575587 543865 466450 405038 375349 344343
17438 344343 308548 271370 220978 173826 141837 115813 98808 86694 79146 71416 57677 48280
17426 48280 49443 52612 43137 31323 14933 9642 9781 11126 7418 519 -2084 -3790 -2726 -4320
17412 -4320 -8302 -9221 -9356 -13377 -17671 -16271 -10114 -15905 -16956 -18295 -15745 -13933 -18287 -16178 -10245
17397a0245M945n62n294J863k892K642M367l029k40Q85k851l396N383O013L622
17382A211k320l042k032m134l280M938k759l419K4L201Q85j902l788M6J529O272
17366h570R074L031q659l935M039j417o291m071J196o32K266j262P444K218m784
17351a0353k97k862j805M599L693O158N25j375M968k558n154K843M486N341J098
17336I307n862o242l168L58J08j779L661J0991R428j2222m009k108m279l637q4
17321i537J799j861N15P07J706M825N462k586k2K564J92m329r51J985m695n645
17305i871M706O18l216p042O72K892L33m77P656l138p147l780J582P743N913P80
17289a776l519K409j13M602K641j711p578j311L194K111n41L653j2l811l428o72
$$ plain form
17397 -10245 -5300 -5862 -11156 -9293 -12185 -9543 -5176 -8205 -8445 -7560 -10411 -13807 -8424 -2411 1211
17382 1211 -1109 -4151 -6183 -10317 -13597 -8659 -11418 -14837 -14813 -11612 -10727 -12629 -16417 -16371 -14842 -8570
17366 -8570 504 3535 -5124 -9059 -5020 -6437 -12728 -16799 -15603 -16235 -13969 -15231 -7787 -5569 -10353
17351 -10353 -10650 -13512 -15317 -10718 -7025 -867 -342 -1717 3251 693 -4461 -1618 2868 8209 9307
17336 9307 3445 -2797 -5965 -5607 -5499 -7278 -3617 7374 16802 4580 571 -1537 -5816 -9453 -9537
17321 -9537 -7738 -9599 -9084 -8377 -6671 -1846 3616 1030 1008 3572 3764 -565 -1516 469 -4226 -9871
17305 -9871 -5165 -4547 -7763 -14805 -14133 -11241 -10908 -11385 -3729 -6867 -14014 -17794 -16212 -8469 -2556 -1776
17289 -1776 -5295 -2886 -2999 1603 4244 2533 -5045 -6356 -3162 -1051 -1592 2061 2049 -1762 -5190 -5862
17273e862l699l108M394J372n01Q46r30L76j678k550M401R13M17j94J232N971
17257A400P33o37q37M721l34k010l301N31M745N853M086N307O592M427N918J0182
17241D7376j142m804N52J571N143O029M470O699L281J06O262J2697J9687K2891
17227A30818K9857L0737L2059L9385L8612L2802L3271M1304N3649P3731O4538
17216F00763M1321J2738j0532k4401j4213K988J2802J2817j4704m6610o9895p0718
17204D32356n5611m7824l6562k4184l6094m0655l4972l5623l0376j5636j5099
17193E9720j8131j0319r849o118l315k016n278o684l841p04k05L910l11m150m811
17178a2102M79O362l696L287N769K849r035m450l328k902k431k299m335k847K133
$$ plain form
17273 -5862 -9561 -12669 -8275 -6903 -7404 -6558 -7488 -7112 -8790 -11340 -6939 -6026 -5609 -5803 -4571 1400
17257 1400 2133 1496 659 5380 5046 3036 -265 266 5011 10864 14950 20257 26849 31276 37194 47376
17241 47376 46234 41430 41982 43553 48696 54725 59195 65894 69175 69281 75543 88240 107927 130818
17227 130818 160675 191412 223471 262856 301468 334270 367541 408845 462494 536225 600763
17216 600763 642084 654822 644290 619889 605676 608664 621466 634283 619579 572969 503074 432356
17204 432356 376745 328921 292359 268175 232081 191426 156454 120831 90455 74819 59720
17193 59720 41589 31270 21421 15303 11988 9972 4694 -1990 -5831 -6535 -6740 -2830 -3141 -7291 -12102
17178 -12102 -11623 -5261 -8957 -5670 99 2948 -6087 -10537 -13865 -16767 -19198 -21497 -25832 -28679 -26546
17163b6546R32j504J731o544K282J061j614K793M696J464q240M312J342j834k070
17148b7739j302l8j291M316J2146J499k697J420o141l43J934L388M490L21L45
17133i692l368j197Q416M213k989j013k692J090o093K222J541l291n181l10J446
17118a6898L766m467J613O218Q12l98J047k04j866n497J030m208m261m91M153
17103a9651j225L877M481J991O808L289m370n979J180L414L357j0350l908K479
17089a4607L33K880O459P13K100N844k98o573M75k121K464j078L36K302J601Q919
17073I749K984k182K976J895K314K608r63O342L720m583k911n935r164k017o471
17058a638m298l146j412L650M213J294j212j492k138K814J491j813O99n02n160
$$ plain form
17163 -26546 -25614 -27118 -25387 -31931 -29649 -28588 -30202 -27409 -22713 -21249 -29489 -25177 -23835 -25669 -27739
17148 -27739 -29041 -29079 -30370 -26054 -13908 -12409 -15106 -13686 -19827 -20170 -18236 -14848 -10358 -10037 -9692
17133 -9692 -13060 -14257 -5841 -1628 -4617 -5630 -8322 -7232 -13325 -11103 -9562 -12853 -18034 -18344 -16898
17118 -16898 -13132 -17599 -15986 -9768 -8956 -9354 -8307 -8511 -10377 -15874 -14844 -19052 -23313 -23804 -19651
17103 -19651 -20876 -16999 -12518 -10527 -3719 -430 -4800 -10779 -9599 -6185 -2828 -13178 -17086 -14607
17089 -14607 -14274 -11394 -4935 -4222 -2122 3722 3424 -3149 -2674 -4795 -2331 -3409 -3073 -771 830 9749
17073 9749 12733 10551 13527 15422 17736 20344 19381 25723 29443 24860 21949 16014 6850 4833 -1638
17058 -1638 -5936 -9082 -10494 -6844 -2631 -1337 -2549 -4041 -6179 -3365 -1874 -3687 -2988 -3490 -8650
17043h650j614j2192K360M709R869q872P73O128k820n163l876L68M404K623j165
17028a3118M03K619j734K963k915o513k207l741O442R478j085K966M25m469o039
17013a6525j252N584O230m795J15k168j0118J497K959R647J0455o803n870j412
16999a2456K740Q10Q11p383l450R05M362M213P91j381O66l337k47L503M332N129
16983Hm420j054o561m401p15J927K463K395j372m395L158j627K339J338K177l467
16967a2207l731l672J797N46K182M919J129j128K09J480k960n028R92J282K839
16952a1351o85k83L798J529m436L042k245o996K766P447O970l051l77J926j197
16937c143J211M582j016Q280R441r51o397M703M055j473J230L772k390j402O258
$$ plain form
17043 -8650 -10264 -22456 -20096 -15387 -5518 -14390 -13617 -7489 -10309 -15472 -19348 -18980 -14576 -11953 -13118
17028 -13118 -12715 -10096 -11830 -8867 -11782 -18295 -20502 -24243 -17801 -8323 -9408 -6442 -6017 -10486 -16525
17013 -16525 -17777 -12193 -5963 -10758 -10643 -12811 -22929 -21432 -18473 -8826 1629 -5174 -11044 -12456
16999 -12456 -9716 -8906 -8095 -15478 -18928 -18023 -13661 -9448 -8657 -10038 -9372 -12709 -12956 -9453 -5121 8
16983 8 -4412 -5466 -12027 -16428 -17143 -15216 -12753 -10358 -11730 -16125 -12967 -14594 -12255 -10917 -8740 -12207
16967 -12207 -15938 -19610 -17813 -17267 -15085 -10166 -9037 -10165 -9956 -8476 -11436 -16464 -15472 -14190 -11351
16952 -11351 -12036 -12319 -8521 -6992 -11428 -8386 -10631 -17627 -14861 -7414 -444 -3495 -3872 -1946 -3143
16937 -3143 -1932 2650 1634 9914 19355 18404 12007 16710 20765 19292 20522 24294 21904 20502 26760
16922B6760J410L182K187L89N282Q550N337N302J1649P914J4098J3967J6268K8630
16908A50925L1388J8603K0743J7955J6147N429j397r514j5549j9861j5328j4723
16896A84818j7109j8488m152O426N778L619J2147J1539J3448J9939J8635J8201
16884B54801K2991J6140O510k375j0200K477P039j032n504j6605k2077k0440k1914
16871B09811j8090j4853k2891k6903k3962k2677p232p946j4184j2130q612p470
16859B2861l865r90l749j1539j1947J376o382K936L221K20J0310J995q535o288
16845a0376o790j704L250Q064R228j33k964K00K995K933l909k104k126q06J595
16830b647K419J343m181j300j150r70J278R37N406M948m957q075p91N258N89k472
$$ plain form
16922 26760 28170 31352 33539 33928 39210 47760 53097 58399 70048 77962 92060 106027 122295 150925
16908 150925 182313 200916 221659 239614 255761 261190 259793 250279 234730 214869 199541 184818
16896 184818 167709 149221 145069 151495 157273 160892 173039 184578 198026 217965 236600 254801
16884 254801 277792 293932 300442 298067 287867 290344 297383 296351 290847 274242 252165 231725 209811
16871 209811 191721 176868 153977 127074 103112 80435 73203 65257 51073 38943 30331 22861
16859 22861 18996 18006 14257 2718 -9229 -7853 -14235 -11299 -8078 -7858 2452 4447 -4088 -10376
16845 -10376 -17166 -18870 -15620 -7556 1672 1539 -1425 -1225 1770 4703 794 -1310 -3436 -4242 -2647
16830 -2647 -228 1115 -3066 -4366 -5516 -6486 -5208 -4271 1135 6083 1126 -6949 -7740 -2482 -1893 -4365
16814d365N26K232K560N004M011j901R260O358j774m162l514P138Q77m162q24
16799A7264L14j784m220o578o866p574M587J103k822k421j862K137J317m63j149
16784i017j765N059j150l05k224P29q08K632J298k208N299J496J160m298p312
16769a1414j533J202N653J420r73N954N507j0469p989j5R29K718K348M698l236
16754e200k446K235O592N739N58o165j0973r757k945L32R626J458K750p09k256
16739a1161K463N980m645j2433l9L516K395L36J148P602j817R41l935j649n680
16724a6978m419k790J611P034N839Q1n133k038O79N53N390p407K067Q121L949
16709c441k686j488L577J110r86M132j302p526o174o66K690Q58O52j458M07L431
$$ plain form
16814 -4365 -3839 -1607 953 5957 9968 8067 17327 23685 21911 17749 14235 21373 22250 18088 17264
16799 17264 17578 15794 11574 4996 -1870 -9444 -4857 -3754 -6576 -8997 -10859 -8722 -7405 -7868 -9017
16784 -9017 -10782 -5723 -6873 -7178 -9402 -8673 -9481 -6849 -5551 -7759 -2460 -964 196 -4102 -11414
16769 -11414 -12947 -11745 -6092 -4672 -5645 309 5816 -4653 -12642 -12657 -11728 -9010 -6662 -1964 -5200
16754 -5200 -7646 -5411 1181 6920 7478 1313 -9660 -19417 -22362 -22030 -12404 -10946 -8196 -8905 -11161
16739 -11161 -8698 -2718 -7363 -19796 -19835 -16319 -13924 -13588 -12440 -4838 -6655 -5714 -9649 -11298 -16978
16724 -16978 -21397 -24187 -22576 -15542 -9703 -9622 -14755 -16793 -16114 -15561 -10171 -17578 -15511 -7390 -3441
16709 -3441 -6127 -7615 -4038 -2928 -3914 218 -1084 -8610 -14784 -15450 -12760 -11902 -11250 -12708 -12301 -8870
16693h870L401n764q69M41k611p85R606N448l107r580J094O677M53k09j744k711
16677i130k697K520J430r846k228j487p59K434O58J759K136K294M720O68L944
16662c584j0075n937P249J0565m416M35N633n10r022n826m138J131k574j999r7
16647b3165O441M331m239k400L264J307j58L952J862l303j343j15N099K936k72
16632e803O34n70p546j950n7J037r093k959M539l499L220R79P681N79M160J776
16616f872j189k123K276j326m052j656j013L672m823l969N64M629K282J224Q30
16601a1546o67o261M518k20m770J0750P758m153q473j327M953M49J854O330K56
16586e49o816o780r60M917K864J286Q64J17K910j676l819J637L105l337o213n72
$$ plain form
16693 -8870 -5469 -11233 -12102 -11661 -14272 -15057 -5451 -3 -3110 -12690 -11596 -4919 -4466 -4675 -6419 -9130
16677 -9130 -11827 -9307 -7877 -17723 -19951 -21438 -22197 -19763 -19105 -17346 -15210 -12916 -8196 -7528 -3584
16662 -3584 -13659 -19596 -12347 -1782 -6198 -5763 -130 -640 -9662 -15488 -19626 -18495 -21069 -23068 -23165
16647 -23165 -16724 -12393 -16632 -19032 -15768 -14461 -14619 -10667 -8805 -12108 -13451 -13566 -8467 -5531 -5803
16632 -5803 -5169 -5739 -13285 -15235 -15292 -14255 -23348 -26307 -21768 -25267 -22047 -21068 -13387 -12808 -8648 -6872
16616 -6872 -8061 -10184 -7908 -9234 -13286 -14942 -15955 -12283 -17106 -21075 -20511 -15882 -13600 -12376 -11546
16601 -11546 -12213 -18474 -13956 -14176 -18946 -8196 -438 -4591 -13064 -14391 -9438 -8989 -7135 -805 -549
16586 -549 -7365 -14145 -15105 -10188 -7324 -6038 -5174 -5057 -2147 -3823 -7642 -6005 -2900 -6237 -12450 -13022
16570a3022o287j466k887L649O245L420N649N55n134K039l978q2k125K351K773
16555h300J458M709L17n21n187j1500j283P658P407L8j867L134k160j17n182k163
16539a3559o816N801Q018j379m527M621J0990K317k305J488l236p362j69N670
16525d48k601p704n501J486n972Q65M834K058rK278J708Q45P981l718Q62M294
16509A258M459R41L152n159n306o310r135j577J748M135M983M163q22m741o149
16494a4360K950L752K193L061K805k31q52J29K048m574n040N796J097o717p65
16479h708J945j719k914j427l79O388R52k739q37Q20l420L435L166K25k980r662
16463a7854q244N739M852K526M911J530L084L33l899r646l951N728m297K543J888
$$ plain form
16570 -13022 -19309 -20775 -23662 -20013 -13768 -10348 -4699 -4144 -9278 -7239 -11217 -11299 -13424 -11073 -8300
16555 -8300 -6842 -2133 -1816 -2337 -7524 -19024 -20307 -12649 -5242 -5204 -7071 -3937 -6097 -6214 -11396 -13559
16539 -13559 -20375 -14574 -6556 -7935 -12462 -7841 3149 5466 3161 4649 1413 -5949 -6118 -448
16525 -448 -3049 -10753 -16254 -14768 -20740 -19875 -15041 -12983 -12992 -10714 -9006 -8161 -180 -3898 -3036 1258
16509 1258 5717 6658 9810 4651 -655 -6965 -16100 -17677 -15929 -11794 -6811 -2648 -3470 -8211 -14360
16494 -14360 -11410 -7658 -5465 -2404 401 170 -682 -553 1495 -3079 -8119 -2323 -1226 -7943 -8708
16479 -8708 -6763 -8482 -11396 -12823 -13202 -6814 -5862 -8601 -9438 -8618 -12038 -8603 -5437 -5212 -8192 -17854
16463 -17854 -26098 -20359 -15507 -12981 -8070 -6540 -3456 -3123 -7022 -16668 -20619 -14891 -19188 -16645 -14757
16448a4757M432L376l46M29L965j727n159p792j916L540P940l451k165J137J662
16433a0832l238n389J515p05Q35m326N140P301J192n820R21L259k209j2447M88
16418b4315K640K740j311J372L521O144K191N130Q877j008n250m051j419k245
16404f984K397L517j405q121l105K174J309o51Q76O431n45n541j648K722K651
16389e923j76k843j048K438k934J404n404N737O563n801q631n46p2J566o923L481
16373a9112N886M999K022K856o061j3123n000L662K684Q568N471J493N740J045
16359A130j35N49p65j418r59q6l177K991P34P47m313m184J63J695k37M006J412
16342a847P95J620J221K918J148k356r132l149M876K273j363p776q309J864M905
$$ plain form
16448 -14757 -10325 -6949 -7295 -6866 -2901 -4628 -9787 -17579 -19495 -15955 -8015 -11466 -13631 -12494 -10832
16433 -10832 -14070 -19459 -17944 -18649 -17814 -22140 -17000 -9699 -8507 -14327 -13406 -10147 -12356 -24803 -24315
16418 -24315 -21675 -18935 -20246 -18874 -15353 -9209 -7018 -1888 6989 5981 731 -3320 -4739 -6984
16404 -6984 -4587 -1070 -2475 -10596 -13701 -11527 -10218 -10869 -9993 -3562 -4107 -9648 -11296 -8574 -5923
16389 -5923 -6099 -8942 -9990 -7552 -10486 -9082 -14486 -8749 -2186 -7987 -16618 -17164 -17236 -15670 -22593 -19112
16373 -19112 -13226 -8227 -6205 -3349 -9410 -22533 -27533 -23871 -21187 -12619 -7148 -5655 85 1130
16359 1130 995 1544 779 -639 -1598 -1684 -4861 -1870 -1136 -389 -4702 -8886 -8723 -7028 -7265 -3259 -1847
16342 -1847 -1052 568 1789 4707 5855 3499 -5633 -8782 -3906 -1633 -2996 -10772 -19081 -17217 -12312
16327a2312P795m00M24K140J140o039l43m185p773J86j77j527J130j612N58P937
16311a3058L658k87n648n906M894M420J369J292M413l275L120M461N34m115p678
16296a1806k118J189O390J955j083n266j786N476q51P256m532n57j908l668l424
16281a4733J21O309P17l781J767Q684k70m355k46j809R463K955n279k598m93P13
16265b835n127m114j138q1J448L573R12K259K496k846j641L82k247J594j296k12
16249h873J148L536n55m210J356j824m028L291j433p182j646l50n61K390M474
16234a4467M254l170K147L789k516O07K698p21L744K457j917l686l406J108l068
16219a2147k100O67P0Q74J86p0j291N430j937m073M407O778n095K32m855K048
$$ plain form
16327 -12312 -4517 -4917 -4493 -2353 -1213 -7252 -7595 -11780 -19553 -19367 -19544 -21071 -19941 -21553 -20995 -13058
16311 -13058 -9400 -9687 -15335 -21241 -16347 -11927 -10558 -9266 -4853 -8128 -5008 -547 -13 -4128 -11806
16296 -11806 -13924 -12735 -6345 -4390 -5473 -10739 -12525 -7049 -7900 -644 -5176 -5733 -7641 -11309 -14733
16281 -14733 -14612 -8303 -7586 -11367 -9600 -916 -1186 -5541 -5787 -7596 1867 4822 -457 -3055 -3548 -2835
16265 -2835 -7962 -12076 -13214 -13295 -11847 -8274 -7362 -5103 -2607 -5453 -7094 -6712 -8959 -7365 -8661 -8873
16249 -8873 -7725 -4189 -4744 -8954 -7598 -9422 -13450 -10159 -11592 -18774 -20420 -20770 -21331 -18941 -14467
16234 -14467 -10213 -13383 -11236 -7447 -9963 -9356 -6658 -7379 -3635 -1178 -3095 -6781 -10187 -9079 -12147
16219 -12147 -14247 -13580 -13510 -12636 -12450 -12520 -13811 -8381 -10318 -14391 -9984 -3206 -8301 -8069 -12924 -10876
16203a0876M466N855l560m035M588M920k66O46m283L308o780m511L3K999j728
16188i224j520p74r174n069K651J1508R515k718L5k074J653R72M569L415l828
16173f3m039j1199j079M781J245m602M164M01O165l06r72J709m810p572J619L991
16157a0567J024m468l730l211O708Q384N856p74J47M3q656p209R055N810K396
16142H08n540K325n637p28K826M07m396l033j389L969L212m014K120n397K363
16127a2104M449M426m610n667r7J665o258m456O226k407q362R601N499l1L143
16112h983l590J183L400o340k100N375o29M360k425J480l555p37L192O915L785
16097A331j203n397L382j963j607J086N25k996k740l025J503l890r97l085L630
$$ plain form
16203 -10876 -6410 -555 -4115 -8150 -3562 1358 1092 1738 -2545 763 -6017 -10528 -10495 -7496 -9224
16188 -9224 -10744 -11518 -20692 -25761 -23110 -11602 -2087 -4805 -4770 -6844 -5191 -4219 350 3765 -63
16173 -63 -4102 -15301 -16380 -11599 -10354 -14956 -10792 -10391 -4226 -4532 -5504 -3795 -8605 -16177 -14558 -10567
16157 -10567 -9543 -14011 -17741 -20952 -14244 -5860 -4 -778 -631 -588 -9244 -16453 -7398 -1588 808
16142 808 -4732 -2407 -8044 -8772 -5946 -5539 -9935 -12968 -14357 -10388 -7176 -11190 -9070 -14467 -12104
16127 -12104 -7655 -3229 -7839 -13506 -13603 -11938 -18196 -22652 -16426 -18833 -27195 -17594 -12095 -12126 -8983
16112 -8983 -12573 -11390 -7990 -14330 -16430 -11055 -11684 -7324 -9749 -8269 -11824 -12561 -9369 -2454 1331
16097 1331 128 -5269 -1887 -3850 -5457 -4371 -3846 -6842 -9582 -12607 -11104 -14994 -15991 -19076 -15446
16082a5446N710J029p025l963l375l39M755N059L416M798K160K206k084n052P91
16067g360K076M076O76k612m756l243M339J821J994K298l43J829k470j585k533
16052e793n675M443O350J730L205m434r605j115J1O833O346p59r791j803J518
16037h539j966L099K65j177L680L979j860m666l616r76m273J389R914L003N48
16022a196k954l392j787k777K719N052J345M110p21m782k874l454l032j524M243
16007a1024N67j533M163K536m859N659K286n16j355l303o610J541N041J685j966
15992g688k732J54o08K898j83n72J372J271k19J416l645n527M18P28L575p64Q233
15975a873J102o383k920L117l49m987j115J0796K421k178K500j015P39l354m565
$$ plain form
16082 -15446 -9736 -8707 -15732 -19695 -23070 -23409 -18654 -13595 -10179 -5381 -3221 -1015 -3099 -8151 -7360
16067 -7360 -5284 -1208 -532 -3144 -7900 -11143 -6804 -4983 -2989 -691 -1034 795 -1675 -3260 -5793
16052 -5793 -11468 -7025 -675 1055 4260 -174 -9779 -10894 -10883 -4050 2296 1537 -8254 -10057 -8539
16037 -8539 -10505 -7406 -7141 -8318 -4638 -659 -2519 -7185 -10801 -11777 -16050 -14661 -4747 -1744 -1196
16022 -1196 -4150 -7542 -9329 -12106 -9387 -4335 -2990 1120 399 -4383 -7257 -10711 -13743 -15267 -11024
16007 -11024 -10457 -11990 -7827 -5291 -10150 -4491 -2205 -2721 -4076 -7379 -13989 -12448 -7407 -5722 -7688
15992 -7688 -10420 -10266 -10874 -7976 -8159 -8731 -7359 -6088 -6307 -4891 -8536 -14063 -13645 -12917 -9342 -10106 -1873
15975 -1873 -771 -7154 -10074 -6957 -7306 -12293 -13408 -2612 -191 -2369 131 -884 -145 -3499 -8064
15960h064j989m78M863J261j545j601r72n222k978J352j184M831Q168J0372P41
15945G555p971p719p27M016j267j1282k701K35j234J584M022o007O107O025K062
15930g302L521p70K269J9L582L160j1675j0958J230P049j24j663L16M457r36j027
15914h852m531m13P626L163k611k883n144K697l448J640P932K598n559K854k435
15899g366M609O446m147m802n50M910j510J389p86r07L355p64p752J946n530L752
15883g707K037M660N82o543L04o107l080J227j334L886Q350j191O23k439K276
15868d456j856L166K390J332j301m753P57K40l259J403L506M388k250o81j556
15853b930j271J698N115N465k567j1300l675k384k755l628J169J81O164N23K860
$$ plain form
15960 -8064 -10053 -10531 -5668 -4407 -5952 -7553 -8525 -13747 -16725 -15373 -16557 -11726 -3558 6814 7555
15945 7555 -416 -8135 -8862 -4846 -6113 -17395 -20096 -19861 -21095 -19511 -15489 -21496 -15389 -9364 -7302
15930 -7302 -3781 -4551 -2282 -2263 1319 4479 -7196 -18154 -16924 -9875 -9999 -11662 -11346 -6889 -7825 -8852
15914 -8852 -13383 -13796 -6170 -3007 -5618 -8501 -13645 -10948 -14396 -12756 -4824 -2226 -7785 -4931 -7366
15899 -7366 -2757 3689 -458 -5260 -5810 -900 -2410 -1021 -1807 -2714 641 -123 -7875 -5929 -11459 -7707
15883 -7707 -5670 -1010 -428 -6971 -6667 -12774 -15854 -14627 -15961 -12075 -3725 -4916 -4293 -6732 -4456
15868 -4456 -6312 -3146 -756 576 -725 -5478 -4721 -4481 -7740 -6337 -2831 1557 -693 -1374 -2930
15853 -2930 -4201 -2503 2612 8077 5510 -5790 -9465 -11849 -14604 -18232 -17063 -16882 -10718 -10195 -7335
15838g335L840J1k56P5Q08K925j090m845l058M707k569M42M9K40k635l215K420
15821i486P898J687J477l853k056o901j267N896M332n598J086K183l644j004J915
15806g335o118j401M783R108l728k214R3N541M311k460p694J27M814J669l045
15791c549M129P32J575k250j597m274n896J002l894n08Q765j60m089j509K535
15776h988K446J716K189k098j924n919o943J515Q695J303K976j995K08J651J610
15761c558j632J494l100k679k031L310N819n154m307n185K812r90L13J979O058
15746f851n226l580L081O67K20J334q007N41N837M685J53j750O288M222l490Q9
15730a787O170j960q052j834L517K298Q92J054m987n789M169O194O63k188j3475
$$ plain form
15838 -7335 -3495 -3484 -3740 -3665 -2857 68 -1022 -5867 -8925 -4218 -6787 -6345 -6296 -6056 -8691 -11906 -9486
15821 -9486 -1588 99 1576 -2277 -4333 -11234 -12501 -6605 -2273 -7871 -6785 -4602 -8246 -9250 -7335
15806 -7335 -13453 -14854 -10071 -963 -4691 -6905 -6812 -1271 3040 580 -7114 -6987 -2173 -504 -3549
15791 -3549 580 1312 2887 637 -960 -5234 -11130 -10128 -14022 -14530 -5765 -5925 -10014 -11523 -8988
15776 -8988 -6542 -4826 -2637 -4735 -6659 -12578 -19521 -18006 -9311 -8008 -5032 -7027 -6819 -5168 -3558
15761 -3558 -5190 -3696 -6796 -9475 -11506 -8196 -2377 -7531 -11838 -17023 -14211 -15201 -14888 -12909 -6851
15746 -6851 -12077 -15657 -12576 -11909 -11689 -10355 -18362 -17821 -11984 -7299 -7146 -8896 -2608 1614 -1876 -1787
15730 -1787 4383 2423 -5629 -7463 -3946 -1648 -756 298 -4689 -10478 -6309 -115 548 -1640 -15115
15715a5115o534N241J771L868N282L042L319k792p579k586m837o028q3K813J1109
15700i109l86M079J382j640j110j69m223J872n389r22P42L31K263K078N805K521
15684a875l575L54n463k659R349L079K875L497J561M13p423P34r164j252N359
15669d190K649K043l725M33m818l73O130K798n756j0411k833j62M36j389R64j445
15653a9649N717M5j476l131M705O987l196j442O738P507k74j663L787j159l488
15638Hq668j640o239j047P354M819l209p072K865R200N473n080n519j095L42j520
15622a1028L818q68r916J401M639M366P71k607l50K015p94O399J862k858l869
15607g019k519K093j565j117R70N154L086Q14n791n562k605J221j327J061P96
$$ plain form
15715 -15115 -21649 -16408 -14637 -10769 -5487 -2445 874 -1918 -9497 -12083 -16920 -22948 -23031 -20218 -9109
15700 -9109 -9495 -5416 -4034 -5674 -6784 -6953 -11176 -9304 -14693 -15615 -14873 -14542 -12279 -10201 -4396 -1875
15684 -1875 -5450 -5096 -10559 -13218 -3869 -790 2085 5582 7143 7556 133 867 -8297 -9549 -4190
15669 -4190 -1541 502 -3223 -2790 -7608 -7981 -1851 947 -4809 -15220 -18053 -18215 -17779 -19168 -18204 -19649
15653 -19649 -13932 -13887 -15363 -18494 -13789 -6802 -9998 -11440 -4702 2805 2531 868 4655 3496 8
15638 8 -8660 -10300 -16539 -17586 -10232 -5413 -8622 -15694 -12829 -3629 1844 -3236 -8755 -9850 -9508 -11028
15622 -11028 -7210 -8078 -17994 -16593 -11954 -7588 -6817 -9424 -9774 -7759 -8553 -2154 -292 -3150 -7019
15607 -7019 -9538 -7445 -9010 -10127 -9157 -4003 -917 -103 -5894 -11456 -14061 -12840 -14167 -13106 -12310
15592a2310j645m566N203L630K940L665n983L407M764j189j649l873p743M427
15578a0922J242L305L631J229l034r927k732N350N730N194L856l745j370j509
15564c702l62o57L685j638L789K658j747m816q58p61k445p34N698m622r569K566
15548a3515M532M892q9Q53o938M188K047K441j851m234o437j559M205Q280J218
15533a967n669n88J689n099l711L462j823R39L606j516m892J220L18J805K928
15518i298k546k100L75J1139N389j876j870R65N457l344j0431k205O624L572K29
15503H0n024k216M800l203O16l123K370O439n09j998m709P66N597o36J770L287
15487D307j871J339M094m3P061k671k093n152k7l080j74N342k080K0l158r882
$$ plain form
15592 -12310 -13955 -18521 -13318 -9688 -6748 -3083 -9066 -5659 -895 -2084 -3733 -7606 -15349 -10922
15578 -10922 -9680 -6375 -2744 -1515 -4549 -14476 -17208 -11858 -6128 -934 2922 -823 -2193 -3702
15564 -3702 -4064 -4721 -1036 -2674 1115 3773 2026 -2790 -3648 -4409 -6854 -7588 -1890 -6512 -16081 -13515
15548 -13515 -8983 -4091 -4180 -3327 -10265 -6077 -4030 -1589 -3440 -7674 -14111 -15670 -11465 -3185 -1967
15533 -1967 -7636 -8224 -6535 -11634 -15345 -11883 -13706 -12767 -9161 -10677 -15569 -14349 -14031 -12226 -9298
15518 -9298 -11844 -13944 -13569 -2430 2959 1083 -787 178 5635 2291 -8140 -10345 -3721 -149 80
15503 80 -4944 -7160 -2360 -5563 -4947 -8070 -5700 739 230 -1768 -6477 -5711 -114 -750 1020 4307
15487 4307 2436 3775 7869 7826 14887 12216 10123 4971 4944 1864 1690 7032 4952 4972 1814 -8068
15471h068o280N099N100J273J124n431L705J786j695J08J273Q020P88l990k097
15456G15j945l135n17N275N876o705n044o249M67R12j920M705M084j32K157L07
15440a149K946m919j400N221K799o373j008K549j007k521n028M720l350J901R991
15425C372l552m756M048Q075j649m908p27k7o800k842j106N68L520k129N394M147
15409F28n906l805K834L313N564J44J070q212n413L278q85j820N434l604J768
15394e612j479J840K315M605K923k776m065j884j795j182j805l159j90Q80L710
15379g674N322j426k722l193J577L776k008n83L303n316m179J222L272o48L723
15364e554k462M715K1l153j30N13M563p06r45l294o90O745L715k98n124L99N10
$$ plain form
15471 -8068 -14348 -9249 -4149 -2876 -1752 -7183 -3478 -1692 -3387 -3279 -2006 6014 6802 2812 715
15456 715 -1230 -4365 -4882 393 6269 -436 -5480 -11729 -11262 -10350 -12270 -7565 -3481 -3613 -1456 -1149
15440 -1149 1797 -3122 -4522 699 3498 -2875 -3883 -1334 -2341 -4862 -9890 -5170 -8520 -6619 3372
15425 3372 -180 -4936 -888 7187 5538 630 -97 -124 -6924 -9766 -10872 -10304 -6784 -8913 -3519 628
15409 628 -5278 -9083 -6249 -2936 2628 2772 3842 -4370 -9783 -6505 -7390 -9210 -3776 -7380 -5612
15394 -5612 -7091 -5251 -2936 1669 4592 1816 -2249 -4133 -5928 -7110 -8915 -12074 -12264 -11384 -7674
15379 -7674 -2352 -3778 -6500 -9693 -8116 -4340 -6348 -6931 -3628 -8944 -13123 -11901 -8629 -9277 -5554
15364 -5554 -8016 -3301 -3280 -6433 -6563 -6050 -1487 -2193 -3138 -6432 -7122 -377 3338 3040 -2084 -1685 -1175
15347a175k043J606j0297M189l94j061L71k116k974L537K336J882L4j699K702
15332e102n36m009j391J12O026N528j086O413k164m559j721p102k198M20Q2n116
15316a6403M446O967J349O994L468l368l582n222m081J902J066L90J971O55L569
15301A21n347k560J1971l100o299J410O327l648N016l86m364r451J861j553K673
15286g329Q895j036m917r146L838m35j914L515q91K511K370L651K455O5l928k23
15270b519N598l544J366r44j982J043L129M252n218n838M569k133m396n076K765
15255h928J409o595L509N496m577N06k31M530J519Q07k69n43k447o436j650M669
15239i231J995N50k544O100J309L230J398K068n499K338k877L457K488N457K05
$$ plain form
15347 -1175 -3218 -1612 -11909 -7720 -8114 -9175 -8804 -10920 -13894 -10357 -8021 -6139 -6105 -7804 -5102
15332 -5102 -5638 -9647 -11038 -10926 -4900 628 -458 5955 3791 -768 -2489 -9591 -11789 -11369 -11287 -16403
15316 -16403 -11957 -4990 -3641 3353 6821 3453 -129 -5351 -9432 -7530 -6464 -6074 -4103 -3448 121
15301 121 -5226 -7786 4185 1085 -5214 -3804 2523 -1125 3891 3505 -859 -10310 -8449 -10002 -7329
15286 -7329 1566 530 -4387 -13533 -9695 -10130 -12044 -8529 -9420 -6909 -4539 -888 1567 1632 -2296 -2519
15270 -2519 3079 -465 901 -43 -2025 -982 2147 6399 1181 -4657 -88 -2221 -6617 -11693 -8928
15255 -8928 -7519 -14114 -10605 -5109 -9686 -9180 -9411 -4881 -3362 -2555 -2824 -3367 -5814 -12250 -13900 -9231
15239 -9231 -7236 -6686 -9230 -3130 -1821 1409 2807 4875 -624 1714 -1163 2294 4782 10239 10444
15224A0444l161K952j353j4841k604M982m79n502k213K903P808O730n261o511
15210f106J083m551K070J970k744m98O894O945n483n208J582M858K190j832q556
15195g386M90J7l660o072R57Q820O985m41l819q069P81k78L274J1498P092r260
15179I29j0041k164N391M403J009n005P89O50l938N237n08K348n38K381p414n829
15163a2300l880P581P178k250J250J666L316m83L522J606l421n285n735j044O759
15148a520M417r80k551L186l116k925L697M711J609l277o307j3604l026Q494K117
15133i075k439K017P472J047l666m757l694k836N647n99m5K763o323l899M336
15118a4051k122K675L313o885k870N772J171M238N846k086m477O105K238M903
$$ plain form
15224 10444 7283 10235 8882 -5959 -8563 -3581 -4060 -9562 -11775 -8872 -1064 5666 405 -6106
15210 -6106 -5023 -9574 -7504 -5534 -8278 -8776 -1882 5063 -420 -5628 -4046 812 3002 1170 -7386
15195 -7386 -6896 -6879 -10539 -16611 -15654 -6834 151 -290 -4109 -12178 -11397 -11675 -8401 3097 10189 929
15179 929 -9112 -11276 -5885 -1482 -473 -5478 -4689 -4039 -7977 -2740 -3248 -900 -1438 943 -6471 -12300
15163 -12300 -16180 -8599 -1421 -3671 -2421 -755 2561 2078 5600 7206 3785 -1500 -7235 -8279 -1520
15148 -1520 2897 1917 -634 2552 -564 -3489 208 4919 6528 3251 -3056 -16660 -19686 -11192 -9075
15133 -9075 -11514 -9497 -2025 -978 -4644 -9401 -13095 -15931 -10284 -10883 -10928 -8165 -14488 -18387 -14051
15118 -14051 -16173 -13498 -10185 -17070 -19940 -14168 -12997 -8759 -2913 -4999 -9476 -3371 -1133 3770
15104C770k175K629q02k311L742q328q236j390N045m391j575J693K68J735L193
15089g133O131K98r802m280L016q126P641Q130J884l510m140m43O417j578l760
15074i255L246k596J738k101p259P338P329P12o343n673k597L507K471m717l902
15059a8102O986Q66k667P219N777L149k320o422k424R8L434o218l19N368k353
15044g928l645K851L87J40j031L984R58l564J501j933k701n577K418L162n469
15029a6447J209k52o28O319j448K543N716n25j040l327l343M435K853J120l825
15014f640j261k165M457m85L435O146o393J217L239j709k449j828M44N244N617
14999F869m333r685Q96k71M90l041j907n00j028M716R42J995J395N21K684K028
$$ plain form
15104 3770 1595 4224 3422 1111 4853 -3475 -11711 -13101 -8056 -12447 -14022 -12329 -12061 -10326 -7133
15089 -7133 -1002 -704 -10506 -14786 -11770 -19896 -12255 -4125 -2241 -5751 -9891 -10334 -3917 -5495 -9255
15074 -9255 -6009 -8605 -6867 -8968 -16227 -8889 -1560 -848 -7191 -12864 -15461 -11954 -9483 -14200 -18102
15059 -18102 -11116 -10250 -12917 -5698 79 3228 908 -5514 -7938 -7840 -4406 -10624 -10943 -5575 -7928
15044 -7928 -11573 -8722 -8335 -8195 -9226 -5242 -4284 -7848 -6347 -8280 -10981 -16558 -14140 -10978 -16447
15029 -16447 -15238 -15490 -16118 -9799 -11247 -8704 -2988 -3513 -4553 -7880 -11223 -6788 -3935 -2815 -6640
15014 -6640 -7901 -10066 -5609 -6094 -2659 3487 -2906 -1689 1550 -159 -2608 -4436 -3992 1252 6869
14999 6869 2536 -7149 -6253 -6524 -6034 -9075 -10982 -11482 -12510 -7794 -6852 -4857 -3462 -2941 -257 1771
14983A771L066P664m047m471k047j998M97m03Q242J727p283j688j842q085o825
14968a5722k448O007K512Q59J912Q81k084m519P948O791n24j72L099L543n307
14953B776l57L184l674j0565j553J971k788J235P204R603k477q228L549k067m013
14938f200m471K401N362k351L044J784l831n934p875m23Q835K337p62N351P197
14923D464K089m172q83n601n467l09R17N061M866K442n133m090P13k776J878j75
14907f176L350j546k497m367k531l101n60M909P178n070n905K916M915R716N136
14892F367o261o271J864J748j463m180J87l398K661n446l763k73K810k804M92
14877a7730O428R397J04o536k565L556K951J757r80M382K949p050j245J073Q55
$$ plain form
14983 1771 4837 12501 8454 3983 1936 -62 435 32 8274 10001 2718 1030 -812 -8897 -15722
14968 -15722 -18170 -12163 -9651 -8792 -6880 -5999 -8083 -12602 -4654 2137 1613 1441 4540 8083 2776
14953 2776 2419 5603 1929 -8636 -10189 -8218 -11006 -9771 -2567 7036 4559 -3669 -120 -2187 -6200
14938 -6200 -10671 -8270 -2908 -5259 -2215 -431 -4262 -10196 -18071 -18494 -9659 -7322 -8084 -2733 4464
14923 4464 6553 2381 1498 -4103 -9570 -9879 -8962 -3901 965 3407 -1726 -5816 -5103 -7879 -6001 -6176
14907 -6176 -2826 -4372 -6869 -11236 -13767 -16868 -17428 -12519 -5341 -10411 -16316 -13400 -8485 1231 6367
14892 6367 106 -6165 -4301 -2553 -4016 -8196 -8009 -11407 -8746 -14192 -17955 -18228 -15418 -18222 -17730
14877 -17730 -11302 -1905 -1801 -8337 -10902 -7346 -4395 -2638 -3618 764 3713 -3337 -4582 -3509 -2654
14862b654M879R076L970p573q258m378J808J526L761P285j5j0695n340K947j456
14847e117l374L887K798K69J146L70K337n665j374O623k578l845o483L792N516
14832a698k503n028k341M741j719l822P836M376j0201l042P078P027N232p580
14818a644k521J747L343J806L511j922k585k626j403J705n82l456J334J247M337
14803B291j956l288j355Q25J770K441l324N499K026m814j0284K343P652L018J989
14788D833p64N55N4l916K776K134o118j0307Q1j80o76J530k670Q077J948M013
14772A370j416L060J245n010n208L195L119l733j718L589p32l402p277J516p44
14757a2146q4K988J059P23L746O973j517q531L64J153J686L786M45k818k486k458
$$ plain form
14862 -2654 2225 11301 15271 7698 -560 -4938 -3130 -1604 2157 9442 9427 -1268 -6608 -3661 -5117
14847 -5117 -8491 -4604 -1806 -1537 -391 -21 2316 -3349 -4723 1900 -678 -4523 -11006 -7214 -1698
14832 -1698 -4201 -9229 -11570 -6829 -8548 -12370 -4534 -158 -10359 -13401 -6323 704 5936 -1644
14818 -1644 -4165 -2418 925 2731 6242 4320 1735 -891 -2294 -589 -1171 -4627 -3293 -2046 2291
14803 2291 335 -2953 -4308 -3483 -1713 728 -2596 2903 4929 115 -10169 -7826 -174 2844 4833
14788 4833 4069 4624 4678 762 3538 5672 -446 -10753 -10672 -10852 -11528 -9998 -12668 -4591 -2643 1370
14772 1370 -46 3014 4259 -751 -5959 -2764 355 -3378 -5096 -1507 -2239 -5641 -12918 -11402 -12146
14757 -12146 -12230 -9242 -8183 -7460 -3714 3259 1742 -6789 -6425 -5272 -3586 200 645 -2173 -4659 -7117
14741g117J622J936O652P444l412m201k504L572M447l032l516m416j168r435n564
14726a8692R458L345r557J607M53K123K352M305M570k792K62k177j494l191m776
14711a4204P141O648o905R62O007n52J424J773n894J709k955k752M38O014P674
14696F528K238j126R39J314N822m358l431k900P35Q7q096l178K828k570k546J31
14680g583K822L168M160L863k979l145L506l591m474M950K447K883R59k705o541
14665b260k475P221P943M355m362p890l712R42M73p98j135l225N266O150l446
14650C047p572K25K06K728l23J099o611m562L350j789N671J092M212k887r10Q149
14634E125K216p039m232m35M445l169m308M076O430J9m660K523N396j365q177
$$ plain form
14741 -7117 -5495 -3559 3093 10537 7125 2924 420 3992 8439 5407 1891 -2525 -3693 -13128 -18692
14726 -18692 -9234 -5889 -15446 -13839 -13386 -11263 -8911 -4606 -36 -2828 -2566 -4743 -6237 -9428 -14204
14711 -14204 -7063 -415 -7320 -6358 -351 -903 521 2294 -3600 -1891 -4846 -7598 -7160 -1146 6528
14696 6528 8766 7640 8579 9893 15715 11357 7926 5026 5761 5848 -2248 -5426 -2598 -5168 -7714 -7583
14680 -7583 -4761 -1593 2567 6430 3451 306 3812 221 -4253 697 3144 6027 6986 4281 -2260
14665 -2260 -4735 2486 10429 14784 10422 2532 -1180 -238 235 -563 -1698 -4923 343 6493 3047
14650 3047 -4525 -4300 -4094 -1366 -1689 -590 -7201 -11763 -8413 -10202 -4531 -3439 773 -2114 -3024 5125
14634 5125 7341 302 -3930 -4365 80 -3089 -7397 -3321 3109 3128 -1532 991 6387 5022 -3155
14619c155j669Q385L543Q27J520l901r53L895L224q017l242K174K543O934O71
14604A2779o185J924K225n803l064O196k699r596J465R21r81K17N228O074o0k143
14588F498M501J567r158q527K022N36L004L398m42k478l90j599p226l365O441
14573e218J28J308J743l277O123L009m685m042M009O51n326N31L520M802k694
14558E82k440m861k667M406N115L454n298j774k816k678L548k057J279k49M639
14543a817N897K306m613l323L342J489L335J651M391r7j0694m734j214p155l529
14528a4765l401L476O087k483O43L630L747M569P826L40r2N31p636q858n454K491
14512i349R303j5N82k253j174j33r037l987M199O156k429m039p197J895M039j901
$$ plain form
14619 -3155 -4824 3561 7104 7931 9451 5550 4597 8492 11716 3699 457 2631 5174 12108 12779
14604 12779 6594 8518 10743 4940 1876 8072 5373 -4223 -2758 -1837 -2818 -2601 2627 8701 8641 6498
14588 6498 10999 12566 3408 -5119 -3097 -2561 443 3841 3399 921 531 -1068 -8294 -11659 -5218
14573 -5218 -5090 -3782 -2039 -5316 807 3816 -869 -4911 -902 -251 -5577 -5046 -1526 3276 582
14558 582 -1858 -6719 -9386 -4980 135 3589 -1709 -3483 -6299 -8977 -5429 -7486 -6207 -6456 -1817
14543 -1817 4080 6386 1773 -1550 1792 3281 6616 8267 12658 12561 1867 -2867 -4081 -11236 -14765
14528 -14765 -18166 -14690 -8603 -11086 -10443 -6813 -3066 1503 9329 9669 9577 10108 2472 -6386 -11840 -9349
14512 -9349 -46 -61 521 -1732 -2906 -3039 -12076 -16063 -11864 -5708 -8137 -12176 -19373 -17478 -13439 -15340
14496a5340O181R87j504o848n14M020L285K301J854m515L99L661K366M476O933
14481G742O191p526p877j0322o285M838M95M12N046N460m43n188J019l383m732
14466a4553K130N226l929M337N963r54j745k899n984K153J3140Q067L10n219k243
14451C800l293j14M908j319J076o706l05M872J278l223o454M169N585j442L474
14436F306J431o548o187K02J727J719o746n004k380k114R52M792M307J106O21
14421e816N612K620k093N148N839r087l270J449K783Q79j617n981j258M696J208
14406A112N29O263O863j2141l539J777M964N545L323k655j0470l838n42N603l341
14391e47m653J377l541M467K520j508J195k198o623j211J620Q271J846Q26K128
$$ plain form
14496 -15340 -9159 -8172 -9676 -16524 -17038 -13018 -9733 -7432 -5578 -10093 -9694 -6033 -3667 809 7742
14481 7742 13933 6407 -1470 -11792 -18077 -13239 -12744 -12332 -7286 -1826 -2269 -7457 -6438 -9821 -14553
14466 -14553 -12423 -7197 -11126 -6789 -826 -1780 -3525 -6424 -12408 -10255 2885 10952 11262 6043 3800
14451 3800 507 393 5301 3982 5058 -1648 -1953 2919 4197 974 -5480 -1311 4274 2832 6306
14436 6306 7737 1189 -4998 -4796 -3069 -1350 -8096 -13100 -15480 -17594 -16642 -11850 -7543 -6437 -5816
14421 -5816 -204 2416 323 5471 11310 2223 -1047 402 3185 4064 2447 -3534 -4792 -96 1112
14406 1112 1641 7904 14767 2626 -913 864 5828 11373 14696 12041 1571 -2267 -2809 2794 -547
14391 -547 -5200 -3823 -7364 -2897 -377 -1885 -690 -2888 -9511 -10722 -9102 -831 1015 1841 3969
14376C969L430q14K002L90k090k470o317q083M48L324N28K99m311l12L342M810
14360a855L712k263k636j750N398p89q549q32K572L765P077M177J670R41m593
14345F045j0187k786N487L035J126O014J4M87n042j3785j476R972K110L967P23
14330E704J089Q696j132o868J903q89k826L695k843p065K272N686n712J190q71
14315B029J948K832k529k546j226m558Q59L440J1767K102k806n606o616J291m593
14300d212J385M111O914n29o074n130N989m01M26l627O80O671K086l884K960J782
14284I147l71j848n097q592q64M476l177K920P815L395K030p483J702r95L998
14269G056O004j546l405l06j124k034m154p99L829m294k255M841l534k771K886
$$ plain form
14376 3969 7399 6585 8587 8977 6887 4417 -1900 -9983 -9535 -6211 -5683 -5384 -9695 -10007 -6665 -1855
14360 -1855 1857 -406 -3042 -4792 606 -183 -8732 -9564 -6992 -3227 3850 8027 9697 10638 6045
14345 6045 -4142 -6928 -1441 1594 2720 8734 8748 9235 4193 -9592 -11068 -1096 1014 4981 5704
14330 5704 6793 15489 14357 7489 9392 8503 5677 9372 6529 -536 1736 7422 1710 2900 2029
14315 2029 3977 6809 4280 1734 508 -4050 -3191 249 12016 14118 11312 5706 -910 381 -4212
14300 -4212 -2827 1284 8198 7669 1595 -3535 2454 2053 2479 -1148 -468 6203 8289 4405 7365 9147
14284 9147 8776 6928 1831 -6761 -7625 -3149 -6326 -3406 4409 7804 9834 2351 4053 3058 7056
14269 7056 13060 11514 8109 7803 6679 4645 491 -308 3521 -773 -3028 1813 -1721 -4492 -1606
14254a606K645K128n95r87m043q021o423J0975Q252P42N11M658o59O59L72o561
14238B047m782m464Q33N181o50P08O640K857m468o796J639N159q618k647Q761
14223A400Q05j382J998q08l18J163J854m91o20K208j972m262q83j441K269M075
14207C595P1L163k969l308l793o959l520R563Q947m141o825n890O003K003K471
14192a589M309L852n658l1L798O331K951k631k458k826l857N40j708J371j532
14177H62O147K167m098l043L308P128n075j0387N93M321m657K000l69k601L612
14162i2L760J992N846k854j338J0p041n830P762k314n746R616J915j0283j148
14147e745K555L236J393j92j964K673j220J874k112J15J33l310l868m928k754
$$ plain form
14254 -1606 1039 3167 2572 1585 -2458 -10479 -16902 -5927 2325 3067 3578 8236 7577 8236 8608 2047
14238 2047 -2735 -7199 -6366 -1185 -1835 -1127 5513 8370 3902 -2894 -1255 3904 -4714 -7361 1400
14223 1400 2205 823 2821 2013 1695 2858 4712 4221 3601 5809 3837 -425 -1308 -2749 -480 3595
14207 3595 3666 6829 3860 552 -3241 -10200 -13720 -4157 4790 649 -6176 -12066 -6063 -4060 -1589
14192 -1589 2720 6572 914 883 4681 11012 13963 11332 8874 6048 2191 2731 1023 2394 862
14177 862 7009 9176 5078 2035 5343 12471 7396 -2991 -2398 1923 -2734 -734 -1103 -3704 -92
14162 -92 3668 5660 11506 8652 7314 7324 283 -5547 2215 -99 -5845 3771 5686 -4597 -5745
14147 -5745 -3190 46 1439 1247 -717 1956 736 2610 498 613 746 -2564 -6432 -11360 -14114
14132a4114K361L817M188j577L173N330N644j117k612L759P982o580o232k73L018
14117F767J23j890j398q40o921J8N879N673J716m157o299q12K220o45l66M801
14101C869Q8P4r82j39k679J115q15O508R390K712l891J44q897l433K234J288j585
14084E001k94o84L83N92l407J132K560P35n266k370l198J610N563N209N96K64
14068H426Q55j686O360l647k638l087J319L15L516L55l496m639k603m327L021
14053a956K446M202l421n219p77j581J302O294L849n46J166L130RR30K226J297
14037A3351n02J325K128r829l15K271K76m887L099K243k251L478K650R51m457
14022I531o47L605j208J849k255M686m0L926j19j265q42m520j1666p506K691P60
$$ plain form
14132 -14114 -11753 -7936 -3748 -5325 -2152 3178 8822 7705 5093 8852 16834 10254 4022 3749 6767
14117 6767 6890 5000 3602 2762 -4159 -4141 1738 7411 9127 4970 -1329 -2141 79 -566 -932 3869
14101 3869 3957 4031 3049 2910 231 1346 531 7039 16429 19141 15250 15394 6497 3064 5298 6586 5001
14084 5001 4707 4023 4406 4998 1591 2723 5283 6018 752 -1618 -4816 -3206 2357 7566 8162 8426
14068 8426 9281 7595 13955 10308 7670 4583 5902 6217 9733 10088 6592 1953 -650 -4977 -1956
14053 -1956 490 4692 1271 -3948 -4725 -6306 -5004 1290 5139 4593 5759 8889 8898 9828 12054 13351
14037 13351 12849 14174 16302 6473 6158 8429 8705 3818 6917 9160 6909 10387 13037 13988 9531
14022 9531 8884 12489 11281 13130 10875 15561 15521 19447 19328 18063 17221 12701 1035 -6471 -3780 -3020
14006c020O38N933l00P17J381l021k708J134k003O909k44k986N843j156N08K963
13990A0588m045o615J869O435M875M597J713j20p34j258j700Q707J1855K632J995
13975D0794O609J2286J718K720l285l98K840j2334o766j265n687j963m127j016
13961C0126n979J495j681j516k700n990k336k997m522m99M929L592n956O877M969
13946A7812K573p532k150j0663q753k033L285l298N590P916L382R17n490k077
13932e21l293k036K778J897N735j517j740m049O50m586k739j117Q211M093l077
13917a311J453N57M527Q27n497n611J373N595J855j032l781n555Q876O697K662
13902A1635k534j173j303l448J179J931m875j584R411L612o705l836l70K335Q6
$$ plain form
14006 -3020 -2382 3551 3251 3968 5349 2328 -380 754 -1249 5660 5416 2430 8273 7117 7625 10588
13990 10588 6543 -72 1797 8232 13107 17704 19417 19297 18563 17305 15605 24312 36167 38799 40794
13975 40794 47403 59689 61407 64127 60842 60444 63284 50950 44184 42919 37232 35269 31142 30126
13961 30126 24147 25642 23961 22445 19745 13755 11419 8422 3900 3401 8330 11922 5966 12843 17812
13946 17812 20385 12853 10703 40 -8713 -10746 -7461 -10759 -5169 2747 6129 7046 1556 -521
13932 -521 -3814 -5850 -3072 -1175 4560 3043 1303 -2746 -2096 -6682 -9421 -10538 -2327 1766 -1311
13917 -1311 142 699 5226 6053 556 -5055 -3682 1913 3768 2736 -1045 -6600 2276 8973 11635
13902 11635 9101 7928 6625 3177 4356 6287 1412 -172 9239 12851 6146 2310 1940 4275 4361
13887D361o116j103K739K314M232k838q052O91M628k959M323R36l900l076L880
13872F0M755p397n58k872n596N27J0326P929l954p204L309N156J025l757l618
13857a869o97J903J008k468K168J870N736M498r101m291K484m296N86M921k631
13842a79o028Q48N400O094J768n452l939j573L905R956o50l446j31j30Q13k943
13826D313L010j195n110J253L070l98L437M298n879p948o124M008Q21j545l170
13811g159L288k888M550P735K173l688j292l70k322o77n50J562l663P541J589
13796E829l435J312J846m675k296n234J282L201L688J045K508M205P285p70l345
13781A2446m272n13K427j384P50L769l699k517m497K566N284k402o23p196j562
$$ plain form
13887 4361 -1755 -2858 -119 2195 6427 3589 -4463 -3772 856 -2103 2220 3156 -744 -3820 60
13872 60 4815 -2582 -3140 -6012 -11608 -11081 -755 7174 3220 -3984 -675 4481 5506 1749 -1869
13857 -1869 -2566 -663 345 -2123 45 1915 7651 12149 3048 -1243 1241 -3055 -2469 2452 -179
13842 -179 -6207 -5359 41 6135 7903 2451 -1488 -3061 844 10800 10150 6704 6573 6443 7256 4313
13826 4313 7323 6128 1018 2271 5341 4943 8380 12678 6799 -1149 -7273 -3265 -2444 -3989 -7159
13811 -7159 -3871 -6759 -2209 5526 7699 4011 2719 2349 27 -650 -1200 362 -3301 4240 5829
13796 5829 2394 3706 5552 877 -1419 -6653 -5371 -2170 1518 2563 5071 9276 16561 15791 12446
13781 12446 8174 7661 10088 8704 9454 13223 9524 7007 2510 5076 10360 7958 7335 139 -1423
13766a423K811N808J0031M634N03j945m957l70m946L86l985r276N57j50L162L966
13750D806m460m37N931L220N4L32Q43j637K909K278j842R68j748o809m837L802
13734C373k430K457M420j000M106p91o635m599M23J840O155K025K910j145m39
13719A0670Q965j533q293Q38j013m207J379L562n93k631j453n514M489L437n3
13704H050K897N770m122Q5M755K101l54K78m259l335l196j060K981l577l855n782
13688b623m182Q699K466Q20K884N859n382p863j631L914N720Q42J613m861J274
13673G549M255o629R74K573M129L337l239K91m617n088J271L491l072q157N288
13658B356N672M177J273L209n08n434n971J262o66J969K295j912l43J028j385
$$ plain form
13766 -1423 1388 7196 17227 21861 22364 20419 15462 15092 10146 10532 6547 -2729 -2172 -2322 840 4806
13750 4806 346 -91 5840 9060 9114 9446 10289 8652 11561 13839 11997 12965 11217 4408 -429 3373
13734 3373 943 3400 7820 6820 10926 10135 3500 -1099 -676 1164 7319 9344 12254 11109 10670
13719 10670 19635 18102 9809 10647 9634 5427 6806 10368 9775 7144 5691 177 4666 8103 8050
13704 8050 10947 16717 12595 12680 17435 19536 19182 19460 15201 11866 8670 7610 10591 7014 3159 -2623
13688 -2623 -6805 1894 4360 5180 8064 13923 8541 678 -953 2961 8681 9523 11136 6275 7549
13673 7549 11804 5175 6149 8722 12851 16188 12949 13240 8623 3535 4806 8297 5225 -2932 2356
13658 2356 8028 12205 13478 16687 16179 10745 4774 6036 5370 7339 9634 7722 7379 8407 7022
13643G022j030r5J009l421m544l490M596M148J97J448M496R8M153M595m190n730
13627I262Q55K482K163J287R992L847n933n924j2443l750L775K986j472K893N926
13612A5946J99n061p514l124L960n908J930n66J846N26k126j843q00n642K935
13597e242Q905M513P51M850k347l970k848P085L878J347K582R20n285n651L165
13582A2653N88p285k904L322Q02j0091q3K320O84j336n35K461j755m14L131N57
13566B115M995j035J442O174M92l283j162l683K112l92m481m262L597N266p497
13551C98n252r0J991Q994Q923M706M534n515m601k753k340N469m741m23J957K755
13535A4012K65n289p51L774j671o860O61l543J335K701m46K487J656K645M54K609
$$ plain form
13643 7022 5992 5897 6906 3485 -1059 -4549 47 4195 4392 5840 10336 10434 14587 19182 14992 9262
13627 9262 10117 12599 14762 16049 26041 29888 23955 18031 5588 1838 5613 8599 7127 10020 15946
13612 15946 16145 11084 3570 446 4406 -1502 428 -138 1708 2234 108 -1735 -2535 -8177 -5242
13597 -5242 3663 8176 8927 13777 11430 7460 4612 11697 15575 16922 19504 20424 15139 9488 12653
13582 12653 13241 5956 3052 6374 7176 -2915 -2998 -678 6 -1330 -1865 596 -1159 -1573 1558 2115
13566 2115 7110 6075 7517 13691 14183 10900 9738 6055 8167 7775 3294 -968 2629 7895 398
13551 398 -4854 -4944 -2953 6041 14964 19670 24204 18689 14088 11335 8995 14464 9723 9300 11257 14012
13535 14012 14277 8988 8237 12011 10340 3480 4141 598 1933 4634 4188 6675 8331 10976 11430 14039
13519A4039L638N52p768j1191M495N258J622J904k832k502j0019L890Q296K54
13505I636m976m79M354k312j571j696O663P283n390q71l330m008l253N966N981
13490A1997n304q531Q001J331j0897k33Q932m15K097l784j231M206J249M17L641
13475A1476J267o01j095p89J091r66l709j809J07J566J776R051J134m956j937
13460A1606m811j858l024N355M200L376l993J028J2497p90q278J964M76n629J106
13445A3225q13j0658n053P768Q444M226K891q098p180K147P168L385P28n708n890
13430F582l94N806L148k760r887l176K342N604J940k612k026j046K127L539o246
13415B941r93q165J378O209J1187M341l677q20M065l45p70j495j378j841k001
$$ plain form
13519 14039 17677 18229 10461 -730 3765 9023 10645 12549 9717 7215 -2804 1086 9382 9636
13505 9636 4660 4181 8535 6223 4652 2956 9619 16902 11512 10641 7311 3303 50 6016 11997
13490 11997 6693 -1838 6163 7494 -3403 -3636 5296 4881 6978 3194 1963 6169 7418 7835 11476
13475 11476 12743 12142 11047 10258 11349 10383 6674 4865 4972 6538 8314 17365 18499 13543 11606
13460 11606 6795 4937 1913 7268 11468 14844 10851 11879 24376 23586 15308 17272 17748 12119 13225
13445 13225 12412 1754 -3299 4469 12913 17139 20030 11932 4752 6899 14067 17452 18180 12472 6582
13430 6582 6188 11994 15142 12382 2495 -681 1661 7265 9205 6593 4567 3521 5648 9187 2941
13415 2941 1948 -6217 -4839 1370 12557 16898 13221 12401 16466 16121 15351 13856 12478 10637 8636
13400H636R3j999K557P009J317m150p497p82P02M50R030J490J618J1099m320j1266
13384A3987o745M251N0l430m212o27J135Q453K175n522j60n138l832K113O993
13369I491K968m391J547j794J393K21k90l170R1L910M253mj85K867K607j275l858
13352A4381k945J262L216M359m89k686m926L77K07O962O507n675j1337n276k212
13337A725L599M573l431J261J544M50Q749M747k147p319j888K782J496K873m469
13322A4545n499P01M668n29Q35K627J902l747n092m062j090O025N12l149J350
13307I997M108K259n33k806O579L332n537l62J172o538n653N266J557o913J902
13292G830P267j013j546P93j55L774J519n7j399p99K351L92n424o353O643j72
$$ plain form
13400 8636 8729 6730 9287 16296 17613 13463 5966 5184 5886 6336 15366 16856 18474 29573 25253 13987
13384 13987 7242 11493 11543 8113 3901 3274 4409 12862 15037 9515 9355 4217 385 2498 9491
13369 9491 12459 8068 9615 7821 9214 9435 9145 5975 6066 9976 14229 14225 14040 16907 19514 18239 14381
13352 14381 11436 12698 15914 20273 19784 17098 12172 12549 12756 19718 26225 20550 9213 3937 1725
13337 1725 5324 9897 6466 7727 9271 9721 18470 23217 21070 13751 11863 14645 16141 19014 14545
13322 14545 9046 9747 14415 13886 14721 17348 19250 15503 10411 6349 5259 11284 11796 8647 9997
13307 9997 14105 16364 15831 13025 19604 22936 17399 17037 18209 11671 6018 11284 12841 5928 7830
13292 7830 15097 14084 12538 13331 13176 16950 18469 18412 17013 16214 18565 18957 13533 7180 13823 13651
13276A3651o853l199K750K928N308P845l123l840n950j987n83j045L651N470J028
13261A6051l839O605K887j27n600n551j091q28l574n397P550L730R40J461J326
13246A4543L886Q769l426o995m696m029k84J0074J416M889L790k701m702j2710
13232G824p435K019L29n45K233J1304l521o282j815K71M054M429K004l731J303
13217A2441k211n52k978L48K259K178k153J240N818p57l836O220L493J542k362
13202B0690m458L60K945L163k992k276m872m359o15L827k406M794N631k887J10
13187A6655L859p402l513J395M445q001K693K164N520N103q726l636K471K201
13173A5228L686L514j799j180L236k212j541m696o322M081R88K192M041l077k762
$$ plain form
13276 13651 6798 3599 6349 9277 14585 22430 19307 15467 9517 7530 6947 5902 9553 15023 16051
13261 16051 12212 18817 21704 21577 15977 10426 9335 8507 4933 -464 7086 10816 11756 13217 14543
13246 14543 18429 27198 23772 16777 12081 8052 7768 17842 19258 24147 27937 25236 20534 7824
13232 7824 389 2408 2737 2192 4425 15729 12208 5926 4111 4382 8436 12865 14869 11138 12441
13217 12441 10230 9678 6700 7048 9307 11485 9332 10572 16390 15633 11797 18017 21510 23052 20690
13202 20690 16232 16592 19537 22700 19708 17432 12560 8201 7586 11413 9007 13801 19432 16545 16655
13187 16655 20514 13112 9599 10994 15439 7438 10131 12295 17815 22918 14192 10556 13027 15228
13173 15228 18914 22428 20629 19449 22685 20473 18932 14236 7914 11995 12983 15175 19216 16139 13377
13158A3377J928J649J042P588l265m968k560k443J03o989l483M492N430K286K221
13143A6408l171k863K080m811K859P109M9q734R84L157M522j28p74o877l61N799
13127A5248l459j316J385R01O108O8j449L642m432p90L59Q90J387J658k81m9K986
13110B2856J678m106n316o765l083M904j249L298M31l276R11j76K702K456Q218
13095B3483k767p159j646q46m831l892L922k442L296P941L433o181k25M281j247
13080A5120j011m016K560J47M059n10l282j735k421O632J691Q18r27J36L345M49
13064B1055m13m153l039l52P78K361P646J876m638p457n878N539n07l218k179
13049G421n584J621j022K128P014L557k39K175l863m155o01l103N302Q268M290
$$ plain form
13158 13377 15305 16954 17996 25584 22319 17351 14791 12348 12451 5462 1979 6471 11901 14187 16408
13143 16408 13237 10374 12454 7643 10502 17611 17660 8926 9910 13067 17589 17461 16687 9810 9449 15248
13127 15248 11789 10473 11858 12759 18867 18935 17486 21128 16696 15906 16265 17155 18542 20200 19919 19870 22856
13110 22856 24534 20428 15112 8347 5264 10168 8919 12217 12648 9372 10283 10107 12809 15265 23483
13095 23483 20716 13557 11911 11065 6234 2342 6264 3822 7118 15059 18492 12311 12086 16367 15120
13080 15120 14109 10093 12653 12800 16859 16349 13067 11332 8911 15543 17234 18052 17125 17261 20606 21055
13064 21055 20642 16489 13450 13098 13876 16237 23883 25759 21121 13664 7786 13325 12818 9600 7421
13049 7421 1837 3458 2436 4564 11578 15135 14896 17071 13208 9053 8452 5349 10651 18919 23209
13034B3209l477o683o521K576K708j071m169J616K003M81O44L618P481k583q510
13019A1322N083j295k621K060j235J455l331n128J433L629j073o251L306K10n88
13004F976p607j955P851O538m080j609L292P612L140J360k981m800m867k059J515
12989H326K313k437o202J0202l269J433k81j366n602j61L162K235N63J847j155
12974I608L739K147l011j416q12L172k387K266R832M613k374m221m646J911N92
12959A9013n429m49P99l160K097N84M184K353M22K602R015J840p602m537k877
12944A8855j736J148K388l308r6O47N388M503o499o227l599K34K788o24N100M019
12928B2981m043m974R44R442j622m766n822l220m856n487N56O053K199K896r40
$$ plain form
13034 23209 19732 13049 6528 9104 11812 10741 6572 8188 10191 10672 11316 14934 22415 19832 11322
13019 11322 16405 15110 12489 14549 13314 14769 11438 6310 7743 11372 10299 4048 7354 7564 6976
13004 6976 -631 -2586 5265 11803 7723 6114 9406 17018 20158 21518 18537 13737 8870 6811 8326
12989 8326 10639 8202 2000 12202 8933 10366 10085 8719 3117 2956 6118 8353 8916 10763 9608
12974 9608 13347 15494 12483 11067 10255 13427 11040 13306 23138 27751 25377 21156 16510 18421 19013
12959 19013 13584 13135 13934 10774 12871 13455 17639 19992 20414 23016 32031 33871 26269 21732 18855
12944 18855 17119 18267 20655 17347 17251 17898 23286 27789 21290 15063 11464 11698 14486 13862 18962 22981
12928 22981 18938 13964 14908 24350 22728 17962 12140 8920 4064 -1423 -867 5186 7385 10281 9341
12913I341K592J850K589M6k079L998p8l467M036j427j308q84n594l897k995L876
12897F599L255J571P99l684l773p35P605J033L177l776J686J413M345k553q78
12882A6084Q68J426j682N003m15k152J560Q67j783J20n87m729l970l17N571M9
12866A5913k671R87l638K495J777l94J268J663k981n02M017N689q69o784L617
12851A9587N171J533q24j547k050j530l2j760m474j256K685K726m786o583J846
12836H706J2569O125p751m29n270J505L450Q294m0l374J440k73k117N367No637
12820B1570k855L942N8n058p818j607N348Q3O068M478q338k429O037M732J397
12805B5608J067K818L7K514L27l115j635p208n488k922M844Q45Q178K642l40L482
$$ plain form
12913 9341 11933 13783 16372 16418 14339 18337 18259 14792 18828 17401 16093 15209 9615 5718 2723 6599
12897 6599 9854 11425 12224 8540 4767 4032 11637 12670 15847 12071 13757 15170 19515 16962 16084
12882 16084 16952 18378 16696 21699 21284 19132 20692 21559 19776 19896 19309 14580 10610 10293 15864 15913
12866 15913 13242 14229 10591 13086 14863 14469 15737 17400 14419 13917 17934 23623 22754 15970 19587
12851 19587 24758 26291 25467 23920 21870 20340 20308 18548 14074 12818 15503 18229 13443 6860 8706
12836 8706 21275 27400 19649 19220 13950 15455 18905 27199 27159 23785 25225 24952 22835 28202 28207 21570
12820 21570 18715 22657 22715 17657 9839 8232 13580 13663 19731 24209 15871 13442 19479 24211 25608
12805 25608 26675 29493 29530 32044 32371 29256 27621 20413 14925 12003 16847 17692 25870 28512 28172 31654
12789C1654j91m905n782n684L554Q709K15q387k175J961J86N047l590j49k347
12774A8116K405J499O239L471n800r60M329k779O615O411j957n398l653p024r208
12759A2306k092J172O13M283O550J66K415J93n197J266L151l293m191O81M97r73
12743A7547K823l311p135k305K867n229L846j448O37M155N195M972l193l670k044
12728A3707J689N383J70q33o86m031j129P088J196Q166L005K224j1481k597L230
12713B5101J422n48r51j889m39L680K460K511j172k734n078k578K839J727K768
12698B7119N39K092M885m27j919o159l470l400P09j918J066M115M12K651K274
12683B8569R96O425j110Q14j784o022j147lM056l197N770M202K613l577J640L162
$$ plain form
12789 31654 31463 26558 20776 15092 18646 27355 27570 19183 17008 18969 19155 24202 20612 20463 18116
12774 18116 20521 22020 28259 31730 25930 24970 29299 26520 33135 39546 37589 32191 28538 21514 12306
12759 12306 10214 11386 11999 16282 22832 22998 25413 25606 20409 21675 24826 21533 17342 18023 18520 17547
12743 17547 20370 17059 9924 7619 10486 5257 9103 7655 8292 12447 17642 22614 19421 15751 13707
12728 13707 15396 20779 20949 20116 19430 15399 14270 21358 22554 30720 33725 35949 24468 21871 25101
12713 25101 26523 25975 25024 23135 22696 26376 28836 31347 30175 27441 22363 19785 22624 24351 27119
12698 27119 27658 29750 34635 34208 32289 26130 22660 19260 19969 18051 19117 23232 23644 26295 28569
12683 28569 29565 35990 34880 35694 33910 27888 26741 26738 30794 27597 33367 37569 40182 36605 38245 41407
12667D1407k566N237l724k432l791K51m495K831M555K243M734L833M409P090R991
12652F9573K168j136N05l299N809Q685O353q57k176o140J14q287k726k001j283
12637F5302l992m688r40l510n052o347n22j552n966o004O146m365j3968L287Q901
12622B6730j291k397N243M820J436N446l352j1291j0171J885Q869M83l712o68
12608B2030N135J081o931j170M586j654Q04l660K320N644K93O47j122L257K210
12593C3470n756K902M528n419p785n06m37k939m86K448M41M481O275L41k156R04
12577C0306P77J373m357k911n104N592R768k612r610L481L474J418o114j436N063
12562B9108O372Q817m035j3920n621M22Q734K627j003M606j10O33k889j2974j718
$$ plain form
12667 41407 38841 44078 40354 37922 34131 34382 29887 32718 37273 39516 44250 48083 52492 59582 69573
12652 69573 71741 70605 71110 67811 73620 82305 88658 87801 85625 79485 79599 71312 68586 66585 65302
12637 65302 61310 56622 55682 52172 47120 40773 40251 38699 32733 26729 32875 28510 14542 17829 26730
12622 26730 25439 23042 28285 33105 34541 39987 36635 25344 15173 17058 25927 26410 22698 22030
12608 22030 27165 28246 21315 20145 24731 23077 23881 20221 22541 28185 28478 29125 28003 31260 33470
12593 33470 27714 30616 35144 29725 21940 21434 20997 18058 17572 20020 20461 24942 31217 31558 29402 30306
12577 30306 31083 32456 28099 25188 20084 25676 35444 32832 23222 26703 30177 31595 25481 24045 29108
12562 29108 35480 44297 40262 26342 20721 21143 29877 32504 31501 36107 35997 36630 33741 20767 19049
12547A9049k204q28O395L426L935K045n235k361P131N501j815p020l187k876l228
12532A8728L946M400j331L625q862m042j18O169Q072Q757L092l371n198m319j898
12517B7650o082n82O091L446m910l67K65M039O461l273p09k04m02j924n597n027
12501A8875L862O347k473L400L894J634m586j553N15J880l368j511O535J01K695
12486C6247L566q671k312k363L930k577P520l528k407l069j522K645L629M682
12472C5770L706J35r94l948N26o819q984N035R099R307n054l764o595o134K246
12457B3532O266K68l234m490j790J254N37N727M878o878o290K672K05l675k825
12442A6157Q258J31J325Q173O218J481m497m610l834n877j784K022n546p22J0012
$$ plain form
12547 19049 16845 16017 22412 25838 29773 31818 26583 24222 31353 36854 35039 28019 24832 21956 18728
12532 18728 22674 27074 25743 29368 20506 16464 16346 22515 30587 39344 42436 39065 33867 29548 27650
12517 27650 21568 20986 27077 30523 25613 25246 25511 29550 36011 32738 32029 31825 31423 29499 23902 18875
12501 18875 22737 29084 26611 30011 33905 35539 30953 29400 29915 31795 28427 26916 33451 33552 36247
12486 36247 39813 31142 28830 26467 30397 27820 35340 31812 29405 26336 24814 27459 31088 35770
12472 35770 39476 39611 38617 34669 35195 28376 19392 24427 33526 42833 37779 34015 27420 21286 23532
12457 23532 29798 30066 26832 22342 20552 21806 22343 28070 32948 26070 19780 22452 22657 18982 16157
12442 16157 24415 24546 25871 34044 40262 41743 37246 32636 28802 22925 21141 23163 17617 16895 26907
12427B6907Q660K346J400L010j397j0276p955l681N735N856J165K063K18O56l776
12412C0931k549J981L843l57l196J247R354O804q797k870j085l120J282J553L721
12397C8742n88m082N011N406j961M2J182l962L12r298j3415m48N157O741L571
12382C2410m693m737N203O841P97L60K591o511Q508k043k014M47L972r61n872
12367C4298m037M426M975O71l626j255o809n343M126M834l119k631M598k333J757
12352C0532L548k923l607r4N843M559M792N93J604k340j741L771p921n471j483
12337B9662K799j908m644K972l443P315Q186J188M698J990k607q599N382J578
12323D4569j1553m91K413n779l976M595J3315o21J86N17l286j780n089L540Q173
$$ plain form
12427 26907 35567 37913 39313 42323 40926 30650 22695 19014 24749 30605 31770 33833 34051 34707 30931
12412 30931 28382 30363 34206 33849 30653 31900 41254 48058 39261 36391 35306 32186 33468 35021 38742
12397 38742 38154 34072 39083 44489 42528 42570 43752 39790 40102 30804 17389 16941 22098 28839 32410
12382 32410 27717 22980 28183 35024 35821 36181 38772 32261 40769 38726 36712 37159 41131 40170 34298
12367 34298 30261 34687 39662 40333 36707 35452 28643 23300 27426 32260 29141 26510 31108 28775 30532
12352 30532 34080 31157 27550 27456 33299 37858 42650 43243 44847 42507 40766 44537 36616 31145 29662
12337 29662 32461 30553 25909 28881 25438 32753 40939 42127 46825 48815 46208 37609 42991 44569
12323 44569 33016 32525 34938 29159 25183 29778 43093 42472 42658 43175 39889 38109 33020 36560 44733
12308D4733n69o995l354k176k314L225L28N438P79m114k051N088J937l507n766
12293C0682K392K237n515k079o255n042N055n152L524J1630P852m03L773j523
12279D1176K053k327J477M624N308J18n517n602j141M113M542p270k317M115M171
12264D7523m688m079j802L142k297n753m40J264N339p466k042K602J99K795N66
12249C4863J566M838l231o39Q569K956p68k050o293r699j842O276R069R77l197
12234D1395p120K580O678n580q27N8Q433M196J151n55n706k812M71k21k788K616
12218D1969l085n806K129P87j556N057J2244n026l098m275J395N350J501j490
12204D6096J45M29m27k67n191K327P678K997j206p991r143p842J1012k054o126
$$ plain form
12308 44733 44164 37169 33815 31639 29325 32550 32878 38316 39095 34981 32930 38018 39955 36448 30682
12293 30682 33074 35311 29796 27717 21462 16420 21475 16323 19847 31477 39329 38926 42699 41176
12279 41176 43229 40902 42379 47003 52311 52429 46912 41310 40169 44282 48824 41554 39237 43352 47523
12264 47523 42835 38756 36954 40096 37799 32046 31606 32870 38209 30743 28701 31303 31502 34297 34863
12249 34863 36429 41267 38036 37397 45966 48922 48154 46104 39811 30112 28270 34546 43615 44592 41395
12234 41395 34275 36855 43533 37953 37126 37184 45617 49813 50964 50409 44703 41891 42362 42141 39353 41969
12218 41969 38884 33078 35207 35994 34438 39495 51739 46713 43615 39340 40735 46085 47586 46096
12204 46096 46241 46670 46243 45976 40785 43112 50790 53787 52581 44590 35447 27605 38617 36563 30437
12189C0437j417N951L789R21k983q091j946O087R376K440j810O3l865j169J987
12174C9770m942l841J570M741j044m133K314L713K027M961l585J547k262j612
12160C9224j760L565M382N105l272p828r169k074L687k19L028J842l850K835K930
12145C8426j288K308j131m407L716M897K398o748L8J1344K718n930o536J416n657
12130C5564n542O884J830J698J493j14L037k595L310K24K021j16L625L1m620L014
12114D9744o394k551j287R54L327l511j819j028L109J304l542j0010j326Q305
12100C5275K806M735N90l693l42M065p577k926l924k935L643R431n59p39K160
12085D0010O492L807j10j945J999j738K71J13P19r11j307N050l736n197J41N514
$$ plain form
12189 30437 29020 34971 38760 39681 36698 28607 26661 32748 42124 44564 42754 42817 38952 37783 39770
12174 39770 34828 30987 32557 37298 36254 32121 34435 38148 40175 45136 41551 43098 40836 39224
12160 39224 37464 41029 45411 50516 47244 39416 30247 28173 31860 31641 34669 36511 32661 35496 38426
12145 38426 37138 39446 38315 33908 37624 42521 44919 38171 38209 49553 52271 46341 39805 41221 35564
12130 35564 30022 36906 38736 40434 41927 41813 44850 42255 45565 45789 47810 47694 51319 51350 46730 49744
12114 49744 43350 40799 39512 40466 43793 40282 38463 37435 40544 41848 38306 28296 26970 35275
12100 35275 38081 42816 43406 39713 39371 43436 35859 32933 29009 26074 29717 39148 38589 37850 40010
12085 40010 46502 50309 50199 48254 50253 48515 48786 48899 49618 48707 47400 52450 48714 43517 43658 49172
12069D9172k008l800k933L921N52l00N558K839j756N133M591l192q709J815P66
12054E1649j784J205L134p727J936K398o581k253N873N709q17j563l501J113l514
12039D5277L57K04K349K618J674o199k266Q674k145j832l810m499j569K631K450
12024D3914R53k40M530L064n846o681r479p551N410N468K861NN2O982N644l89
12008D8697n536k02J31k010j452L574P151K307K01p683o390L247M628N23L012
11993E0198o75j756M883M116l510l421P44J744P783J680m307k321K446l756n733
11978D8115M316o225m066R61M253O885J155K939J442R43Q11K883L616l106m259
11963F0663m122k161Q76j525J012N723O546n252m932n17L06M876m08k922m058
$$ plain form
12069 49172 47164 43364 40431 44352 44904 44604 50162 53001 51245 56378 60969 57777 49068 50883 51649
12054 51649 49865 51070 54204 46477 48413 50811 44230 41977 47850 53559 52742 51179 47678 48791 45277
12039 45277 45634 45838 48187 50805 52479 46280 44014 52688 50543 48711 44901 40402 38833 41464 43914
12024 43914 44867 44627 49157 52221 46375 39694 30215 22664 28074 33542 36403 36408 36460 43442 49086 48697
12008 48697 43161 42959 43090 41080 39628 43202 50353 52660 52861 45178 38788 42035 46663 47186 50198
11993 50198 49523 47767 52650 56766 53256 49835 50579 52323 60106 61786 57479 55158 57604 53848 48115
11978 48115 52431 46206 42140 43101 47354 54239 55394 58333 59775 60718 61529 64412 68028 64922 60663
11963 60663 56541 54380 55256 53731 54743 60466 67012 61760 56828 56311 56617 61493 61085 58163 54105
11948E4105k987O41l645j025l89o56m838L18K872N376m171o524m03J798Q62j458
11932C9876p575J500J1101O881L332L476j747K617r40M56k84n623J492q64j660
11917E2038j749j509J3347o56l496p01k212N268o086o51N217M552M222l965k410
11902F1209m604k03l96J19J77q8k602k446LO689K610j111l106K251K082r983o44
11885D9957O409J786j034O887J54p602q206o155N03J976q83Q574N475K808K928
11870F3577j532N367l331o801m305j214l021k039O179Q441L103j164k356J954
11856F2858L727r98q91J49J11j965N594J504m891k584n720r70j250O409N850l311
11840F3622L509L992j0060q561K920L872R33L99q846L648M099N887M376l46L437
$$ plain form
11948 54105 51118 51759 48114 47089 46700 46044 41206 41524 44396 49772 45601 39077 38674 40472 41334 39876
11932 39876 32301 33801 44902 51783 55115 58591 56844 59461 58521 58977 58693 53070 54562 53698 52038
11917 52038 50289 48780 62127 61471 57975 57274 55062 60330 54244 53593 58810 63362 67584 63619 61209
11902 61209 56605 56402 56006 56125 56302 56214 53612 51166 51169 57858 60468 59357 56251 58502 60584 50601 49957
11885 49957 56366 58152 57118 64005 64159 56557 48351 42196 42699 44675 43792 52366 57841 60649 63577
11870 63577 62045 67412 64081 57280 52975 51761 48740 46701 52880 61321 64424 63260 60904 62858
11856 62858 66585 65587 64696 64845 64956 62991 68585 70089 65198 62614 56894 55924 54674 61083 66933 63622
11840 63622 67131 71123 61063 52502 55422 59294 60227 60626 51780 55428 59527 65414 69790 69444 72881
11825G2881K104k352m710o692j257o670m983j923k59k086n684j269M250L217R415
11810E3982J705n29O61J274K875P875J722m63k693j352k19J0J649l941M116N39
11794F7211o79l280n35R238o216l705J664M966L274o820o217n994k607M565J093
11779E5958k134o180L77M250Q333K944l069k09O69M78l202j50k79J130j23j958
11763E6835K723L513n85O471n95m709o611l406N161O008P553L035j496m670l799
11748F5428L611J588k33m336k153K804P606J132n87N015K506k811p542k763j042
11733F8223m308L861j774O2j695O08Q784J3657l345n836K504n9J809l097o06J659
11717H0447J781k964k107n403K479r49K839N042n188j893K455J692j742J675J539
$$ plain form
11825 72881 74985 72633 67923 61231 59974 53304 48321 46398 46139 44053 38369 37100 41350 44567 53982
11810 53982 55687 55158 55819 57093 59968 67843 69565 69102 66409 65057 64838 64848 66497 62556 66672 67211
11794 67211 66532 63252 62717 71955 65739 62034 63698 68664 71938 65118 58901 52907 50300 54865 55958
11779 55958 53824 47644 48021 52271 60604 63548 60479 60270 60939 61417 58215 58065 57786 58916 58793 56835
11763 56835 59558 63071 62486 68957 68362 63653 57042 53636 58797 64805 72358 75393 73897 69227 65428
11748 65428 69039 70627 70394 66058 63905 66709 74315 75447 74860 79875 82381 79570 72028 69265 68223
11733 68223 63915 67776 66002 66064 64369 64977 73761 87418 84073 78237 80741 80682 82491 79394 78788 80447
11717 80447 82228 79264 77157 71754 74233 73284 76123 81165 75977 74084 76539 78231 76489 78164 79703
11702G9703n95n464P114k880m750j531l161k615P257K319J778k337j340N741J10
11687G9349J275K771k764l701J074p216j306O174J565J932K168K95l561n487L6
11672G2604m259n55k11K163P037o545M849K265J944P649o83k835J854J255n537
11657H0995J009N347j492q243j695K774p46L436K884k036l209k157O482M545j769
11642H6125K153j501n315m459L99k634o44O576J0095J385o110l609j581L91M299
11627H5570O333l412m157K452M158K880m859p204L59M430n51L052n731n700j958
11612G5662O051N23K835r66k565n176j676R01M367K020L37R79J603J28J0642N63
11596I6228m026k206n176l345N60O299n58m899j994L16R99j320O566k127M51k638
$$ plain form
11702 79703 79108 73644 80758 77878 73128 71597 68436 65821 73078 75397 77175 74838 73498 79239 79349
11687 79349 80624 83395 80631 76930 78004 70788 69482 75656 77221 79153 81321 81616 78055 72568 72604
11672 72604 68345 67790 67579 69742 76779 70234 75083 77348 79292 86941 86258 83423 85277 86532 80995
11657 80995 82004 87351 85859 77616 75921 78695 77949 81385 84269 82233 79024 76867 83349 87894 86125
11642 86125 88278 86777 81462 77003 77402 74768 74124 80700 90795 92180 86070 82461 80880 81271 85570
11627 85570 91903 88491 84334 86786 90944 93824 88965 81761 82120 86550 85999 89051 83320 77620 75662
11612 75662 81713 82236 85071 84105 81540 76364 74688 75589 79956 81976 82313 83292 84895 85023 95665 96228
11596 96228 92202 89996 84820 81475 82035 88334 87776 82877 80883 81199 82198 80878 87444 85317 85768 83130
11580H3130k602M420P768L98m310m754l363j747J979K296j51j801M611O843l018
11565H9699l627J012J165O384j725l515K104P64R313O92k062J967k213J57l734
11550I6381j902M06N39k654j775K037l923K408k584m186m285l189K229Q674L055
11535I1231N005M772j095k696L08N365Q724Q059j014j3702k561o84J585L504J542
11520A08343j037j440R52m39P79j70L925O210N257J234m16r079l042l808l54P454
11504A14369Q371K52J416o16n724o904R520O627m858n834q98k255r6L667l677
11489A13360n330M137l963k785p182k970J0033R880j314k826L183Q639L020J630
11475A27512n628o307j340Q758M006Q62O08l853l353Q87L576M430J726r86j992
$$ plain form
11580 83130 80528 84948 92716 93114 88804 84050 80687 78940 80919 83215 83064 81263 85874 92717 89699
11565 89699 86072 87084 88249 94633 92908 89393 91497 92261 101574 102266 100204 102171 99958 100115 96381
11550 96381 94479 94885 95424 92770 90995 93032 89109 91517 88933 84747 80462 77273 79502 88176 91231
11535 91231 96236 101008 99913 97217 97525 102890 111614 119673 118659 104957 102396 101712 103297 106801 108343
11520 108343 107306 105866 106818 106379 107158 106988 110913 117123 122380 123614 123198 114119 111077 107269 106915 114369
11504 114369 122740 122992 124408 123792 118068 111164 120684 127311 122453 116619 115721 113466 113370 117037 113360
11489 113360 108030 112167 108204 105419 98237 95267 105300 115180 113866 111040 114223 122862 125882 127512
11475 127512 121884 115577 114237 122995 127001 127863 128471 124618 121265 122152 125728 130158 131884 130898 128906
11460A28906k055l261n3O088Q40O14R479P279Q42l203l891r136L283M924r196
11445A31460o14O9M444m96M437l404p017P660L311k503p510l974p41k238K612
11430A25496j191l405M74M075P701P081R050k684o392o706q990n754l1J0022M376
11415A33122j193n678k460l154K484O653Q083P27J812m805M235N964O261L544
11401A55595M52J106Q708j779l034O672K481p522J012K691r064l959J350p473
11387A47236q363K391l208j351O308J1955j697K066J919l76j207M382O295N078
11373A71428k483l717K427Q626N852R047J1483R787N55k705j503J860K023o076
11359B06604k255L675J480L617J0295m064k1351k538k494k763L535K294N601P969
$$ plain form
11460 128906 126851 123590 123537 129625 130465 131079 140558 147837 148679 145476 141585 132449 135732 140656 131460
11445 131460 130846 130915 135359 134863 139300 135896 128879 136539 139850 137347 129837 125863 125122 122884 125496
11430 125496 124305 120900 121374 125449 133150 140231 149281 146597 140205 133499 124509 118755 118724 128746 133122
11415 133122 131929 126251 123791 120637 123121 129774 137857 138584 140396 135591 139826 145790 152051 155595
11401 155595 156047 157153 165861 164082 161048 167720 170201 162679 163691 166382 157318 153359 154709 147236
11387 147236 138873 141264 138056 136705 143013 154968 153271 155337 157256 156880 155673 160055 166350 171428
11373 171428 168945 165228 167655 176281 182133 191180 202663 212450 213005 210300 208797 210657 212680 206604
11359 206604 204349 208024 209504 213121 223416 219352 198001 195463 192969 190206 193741 196035 201636 209605
11345B09605O876J6484J2281Q434J2835J2046N506J052J536Q508R611J5337K1462
11332C41573K9350L7732N1199O7942R0343J30668J70689K17806K77205L43386
11322A757893L85316L79931L60564L01234J74965J5701j17558k22651l42920m12197
11312B280278m07646l69824l17041k67816j97170j31306r5875p5755n6488l3111
11302C28246k7158k2562k0442j1631q058o869n059k505j1093r359j459m104k039
11289A95908j0465j2917o057J92j060L388Q831J1915Q29k456j198M810L401j068
11275A94053N79l099l286j553K686L277L857k740K423J188M949p745p610M142
11261A91121J857L483J895n033k776k072q46m293K353k34M894M351L648Q796J97
$$ plain form
11345 209605 216481 232965 245246 253680 266515 278561 284067 285119 286655 295163 304774 320111 341573
11332 341573 370923 408655 459854 527796 618139 748807 919496 1137302 1414507 1757893
11322 1757893 2143209 2523140 2883704 3184938 3359903 3375604 3258046 3035395 2692475 2280278
11312 2280278 1872632 1502808 1185767 917951 720781 589475 493600 417845 361357 328246
11302 328246 301088 278526 258084 246453 238395 231526 226467 223962 212869 203510 202051 197947 195908
11289 195908 185443 172526 166469 166661 165601 168989 177820 189735 190564 188108 186910 191720 195121 194053
11275 194053 194632 191533 188247 186694 189380 192657 196514 193774 196197 197385 202334 194589 186979 191121
11261 191121 192978 196461 198356 193323 190547 188475 187629 183336 185689 185455 190349 194700 198348 207144 207341
11246B07341M466k575K24K75q407j0124k362k264r542n888k80j898q851N47N290
11231A65952r12j0104J562k953m296n976l932P416N812m57N252J3643J4542J2229
11217A97778J8841L0921L0928K3203K8468K5193K0468J4103M451K816m586j1270
11205C81314j5680j2012k288n949q384m794M21n686j41l09M093k469n557m018
11191C18541j90k079l407j645r258j202L739j591J572L865m69K927N804K771P516
11176C26894L337n598o763J567O9n240j174J2825J7604R657P350J2733K2152J5552
11162D10965j996M674K418L223O088J793O969J1177J331K917m049n215j752p477
11148D31066m314p061p494j951J929l081r186n358n595j3477j5191p279n149j1121
$$ plain form
11246 207341 211807 209232 209456 209731 201324 191200 188838 186574 177032 171144 170864 168966 160115 160662 165952
11231 165952 165040 154936 156498 153545 149249 143273 139341 146757 152569 152112 157364 171007 185549 197778
11217 197778 216619 247540 278468 301671 330139 355332 375800 389903 394354 397170 392584 381314
11205 381314 365634 353622 351334 345385 337001 332207 332628 326942 326801 326492 330585 328116 322559 318541
11191 318541 318351 316272 312865 311220 301962 300760 304499 302908 304480 308345 307876 310803 316607 319378 326894
11176 326894 330231 324633 317870 319437 319506 314266 313092 325917 343521 353178 360528 373261 395413 410965
11162 410965 408969 413643 416061 419284 425372 427165 434134 445311 446642 449559 445510 440295 438543 431066
11148 431066 426752 419691 412197 410246 412175 409094 399908 394550 388955 375478 360287 353008 347859 336738
11134C36738j6806k1006j6268n235l066k911p526k332J27J915j684j65K899J517
11120B66197L471L937R238R243L720M296K598Q483J230l206l452m69K669n989
11106C01966k0860r371q564k733m398r598k968K848J1924K9283K9151K6187L5171
11093C78038L2746K9207K3380J6173J02n730p103j3165k3531k6934p266M21L684
11080D00022k153o602P941P647l6O525M106l753J71J228p192l691R14N594K1173
11065D31894L1977N1859Q4746R9866J15568J46544J37029J19644J14793R3710
11055A427630N1884J7346p671k3307m0017l5020j6133q724L785L3527N2928O4934
11043A521162O9736M2162j1817o6862j16719j30506j12906r2297q1232n7876l6822
$$ plain form
11134 336738 319932 298926 282658 277423 274357 271446 263920 261588 261715 263630 261946 261781 264680 266197
11120 266197 269668 273605 282843 292086 295806 300102 302700 311183 312413 309207 305755 305286 307955 301966
11106 301966 281106 271735 263171 260438 256040 246442 243474 246322 258246 287529 316680 342867 378038
11093 378038 410784 439991 463371 479544 479646 473916 466813 453648 430117 403183 395917 396338 400022
11080 400022 397869 391267 399208 406855 406819 413344 417450 413697 413868 415096 407904 404213 405127 410721 431894
11065 431894 463871 515730 600476 700342 815910 962454 1099483 1219127 1333920 1427630
11055 1427630 1479514 1496860 1489189 1465882 1425865 1390845 1374712 1365988 1369773 1403300 1456228 1521162
11043 1521162 1590898 1633060 1621243 1554381 1437662 1307156 1194250 1101953 1020721 962845 926023
11032I26023l2146j3431O842K5202L2641M0239M3137L8021L0138L5964L8329L2590
11020A203549K5725J2472J1170J0109j0664j1491q162k786l828j2406p674L470
11008A209484K171L818M22M764O196P072J0664R165J6814J5431K7835L6382L3819
10995A384037L1156L2011L8582L7532L8869M1153M3679N2813N3852N4763N8003
10984A866450O5292O5842N9579M6740M9365M7285M8043K9549K5856L1649K5970
10973B361620K3922K7936L2532M1482N7771P6533R0044R5523J00622J19176J33114
10962C160275J39805J41799J49183J51287J62703J65890J81056J93470K06569
10953D652037K25989K50174K81059L09001L41200L72408M10828M58493N11111
$$ plain form
11032 926023 893877 880446 887288 912490 945131 985370 1028507 1066528 1096666 1132630 1170959 1203549
11020 1203549 1229274 1241746 1252916 1263025 1252361 1240870 1232708 1229922 1226094 1213688 1206014 1209484
11008 1209484 1211655 1215473 1215895 1220659 1226855 1233927 1244591 1253756 1270570 1286001 1313836 1350218 1384037
10995 1384037 1415193 1447204 1485786 1523318 1562187 1603340 1647019 1699832 1753684 1808447 1866450
10984 1866450 1931742 1997584 2057163 2103903 2153268 2200553 2248596 2278145 2304001 2335650 2361620
10973 2361620 2385542 2413478 2446010 2487492 2545263 2621796 2711840 2807363 2907985 3027161 3160275
10962 3160275 3300080 3441879 3591062 3742349 3905052 4070942 4251998 4445468 4652037
10953 4652037 4878026 5128200 5409259 5718260 6059460 6431868 6842696 7301189 7812300
10944G812300N57852O07479O75619P39160Q06014Q86123R84394J086841J184437
10935A5340219J300898J428006J553438J679282J817634J953684K016959K047251
10927B9137371K060750J987620J893675J872081J927279K063402K349555K860436
10919D6152169L664624M815928O416083Q650471J1783703J6092865K1938691K9829163
10911A49343697L9243813M8754285N8632828O5261856O3722379N7316408M7883799
10904E30159065K8816828L997183j5441806l0747865m9203152o4996785o7971193
10897C34612275o3399717n8510626n0187163l8860345k8802676k1123249j5310304
10890E8418195j1095926q188986o201506m781115l751933l020323k428206j941409
$$ plain form
10944 7812300 8370152 8977631 9653250 10392410 11198424 12084547 13068941 14155782 15340219
10935 15340219 16641117 18069123 19622561 21301843 23119477 25073161 27090120 29137371
10927 29137371 31198121 33185741 35079416 36951497 38878776 40942178 43291733 46152169
10919 46152169 49816793 54632721 61048804 69699275 81482978 97575843 119514534 149343697
10911 149343697 188587510 237341795 295974623 361236479 424958858 482275266 530159065
10904 530159065 558975893 562973076 547531270 516783405 467580253 402583468 334612275
10897 334612275 271212558 212701932 162514769 123654424 94851748 73728499 58418195
10890 58418195 47322269 39133283 32931777 28150662 24398729 21378406 18950200 17008791
10882A7008791j549274j272682j118137j030032r47554r06929r23915q89106p96940
10873G574222p05870o05178n01883m02407l06069k17959j44356q3269k1742K8457
10863D613946N4203N2838O5962M2002m7582p3092o2586j11821j59411j58421j64572
10852D051466k39494k90570k73094k95825l33681l07517k70446k30508j88898
10843A621433j52392j16837r4607q2115p5702o5809n9601o7386p6730o9584p7866
10832F82804p8205o3765n3689m8299l7775k9117j4603n523k468M09j80J0715P025
10819C67329J903Q805Q541K876K571m25k648k861N684j148o244m038p939k523
10805C69883l06j2949k0802k0679j3764j1713q150n883k481M093n789l763j964
$$ plain form
10882 17008791 15459517 14186835 13068698 12038666 11091112 10184183 9260268 8371162 7574222
10873 7574222 6868352 6263174 5761291 5358884 5052815 4834856 4690500 4607231 4585489 4613946
10863 4613946 4668149 4720987 4786949 4828951 4781369 4708277 4645691 4533870 4374459 4216038 4051466
10852 4051466 3811972 3521402 3248308 2952483 2618802 2311285 2040839 1810331 1621433
10843 1621433 1469041 1352204 1257597 1175482 1099780 1033971 974370 906984 830254 760670 682804
10832 682804 604599 540834 487145 438846 401071 371954 357351 351828 349360 349769 349589 360304 367329
10819 367329 369232 378037 386578 389454 392025 391600 388952 386091 391775 390627 384383 380345 372406 369883
10805 369883 369577 356628 335826 315147 301383 289670 281520 275637 273156 277249 271460 267697 265733
10792B65733m993k404J382l468m607R95Q88L832Q831J5849K9464K7438J8225M1429
10778C98594N0224L8689K1493K5063J7618q201k9921l6681n0022o0877o6277n4046
10766B45656l7597m0168l5085k5575k6414k2021k0130j5334j4439k6219j8152
10755c5478j8140j9939j119J5197L3562N9924Q7699J15368J31934J30470J37762
10744F37240J44500J38480J28915J32172J56020J91806K63389L88588M91630N52240
10734C224980O13150N00864J96388J11706K5288j15741l5869M2039j72999l88347
10724D001459m72376o53062o67267n16346l77115k78138j99755j28084p6254n1015
10714E82047k7009j4801j439k514j321l000m345j56L805N334J1158K656o363j537
$$ plain form
10792 265733 260740 258336 259718 256250 251643 252638 253526 257358 266189 282038 311502 338940 357165 398594
10778 398594 448818 487507 509000 534063 551681 543480 513559 476878 426856 365979 299702 245656
10766 245656 208059 167891 132806 107231 80817 58796 38666 23332 8893 -17326 -35478
10755 -35478 -53618 -73557 -74676 -59479 -25917 34007 121706 237074 369008 499478 637240
10744 637240 781740 920220 1049135 1181307 1337327 1529133 1792522 2181110 2672740 3224980
10734 3224980 3838130 4338994 4535382 4647088 4672376 4556635 4520766 4562805 4389806 4001459
10724 4001459 3529083 2876021 2208754 1692408 1315293 1037155 837400 709316 633062 582047
10714 582047 555038 540237 538798 536284 534963 531963 527618 527462 531267 536601 547759 550415 544052 542515
10700E42515n26L872R063R253K3718K7979J6334J2897J3288J362k1531j8839j8374
10687F01011l0427m6049l8754l1673l9377k6842j1232j8967j4755j337N287O217
10675C53102P876J749P988O525L73K76l741m042n916l581r949o720l904m467j0283
10660C25286p934M582J282k801R3n920j0361m327j1439k2516j7365j8444k4171
10647B05965j0342q741j04R413J1814J9859K1663J5104J9917K4050J0949O439
10635C25986J9389J9672Q69J115L682o4q374j0478j5867k0773j9558r245j0929
10622B75425p822q929j5379j8581r040o340q061j861N08J2442K0996M9849N9867
10609C43074O6510P9558R2289P6409N1449O4027O0727L5989L3025M6029M6766
$$ plain form
10700 542515 541989 545861 554924 564177 587895 615874 632208 645105 658393 659755 638224 619385 601011
10687 601011 570584 524535 485781 454108 414731 387889 376657 357690 342935 341598 346885 353102
10675 353102 360978 362727 370715 377240 377613 377889 374148 370106 364190 360609 350660 343940 340036 335569 325286
10660 325286 317352 321934 323216 320415 320508 314588 304227 299900 288461 265945 248580 230136 205965
10647 205965 195623 186882 186778 196191 208005 227864 249527 264631 284548 308598 319547 325986
10635 325986 345375 365047 365916 367031 370713 370649 362275 351797 335930 315157 295599 286354 275425
10622 275425 267603 258674 243295 224714 215674 209334 201273 199412 199920 212362 233358 283207 343074
10609 343074 409584 489142 581431 657840 709289 773316 834043 870032 903057 949086 995852
10598I95852K9938L5429M3228K1829p25J0360R59o158m111K558j0988k3387k5189
10585A069595l2556k4455l5313m0745l5518k8175l0364j5574j515k465m287m158
10573H14470J2870m88K351K1062J2719J3772K2845J9100Q713o34Q856J3867M609
10560I54112K105R255N543M860Q310M540J172J198j561M437J9695J5866J1259
10547A040791J6845J5384J8732J4512K4185K8022K6477K3385K3867K8785L6291
10536A297276M3828N4859N5304N4099O0752N9692N1917O2726N8049M1333N2375
10525A892210N0733M0493L6850M6995M4146L5850M3712M9601M5736M8837N7094
10514B392257O2544P0813Q8241R7547R8969J08108J22622J31942J41953J50778
$$ plain form
10598 995852 1025790 1061219 1104447 1126276 1125551 1135911 1136870 1130712 1126601 1129159 1118171 1094784 1069595
10585 1069595 1037039 1012584 977271 936526 901008 872833 842469 826895 825380 822915 818628 814470
10573 814470 827340 826852 829203 850265 862984 876756 899601 918701 927414 926780 935636 949503 954112
10560 954112 956217 965472 971015 975875 984185 988725 989897 991095 989534 993971 1013666 1029532 1040791
10547 1040791 1057636 1073020 1091752 1106264 1130449 1158471 1184948 1208333 1232200 1260985 1297276
10536 1297276 1341104 1395963 1451267 1505366 1566118 1625810 1677727 1740453 1798502 1839835 1892210
10525 1892210 1942943 1983436 2020286 2067281 2111427 2147277 2190989 2240590 2286326 2335163 2392257
10514 2392257 2454801 2525614 2613855 2711402 2810371 2918479 3041101 3173043 3314996 3465774
10504C465774J56261J65176J78482J99952K04757K24482K49226K75041L17491
10495E436642L68308M16624M82841N66484O59100P62890Q79074R72652J049445
10486A1594060J106513J137987J091115J018925R53441R05507Q43054Q33649R20658
10477B0404909J064484J215976J366324J523727J694586J780988J854260J995285
10469C2900539K150262K322493K592765L079204L807676M743741O063824Q064168
10461F5724672J0845710J4495837J9567952K5447069L0867707L7420136M1919287
10454B46288370L9226264L7608152L7766936K4954296J3161260J4832635J0116498
10447D23954411l530077q102652m818513j0911368k6073908k8974110k7433691
$$ plain form
10504 3465774 3622035 3787211 3965693 4165645 4370402 4594884 4844110 5119151 5436642
10495 5436642 5804950 6221574 6704415 7270899 7929999 8692889 9571963 10544615 11594060
10486 11594060 12700573 13838560 14929675 15948600 16902041 17807548 18650602 19484251 20404909
10477 20404909 21469393 22685369 24051693 25575420 27270006 29050994 30905254 32900539
10469 32900539 35050801 37373294 39966059 43045263 46852939 51596680 57660504 65724672
10461 65724672 76570382 91066219 110634171 136081240 166948947 204369083 246288370
10454 246288370 285514634 323122786 360889722 385844018 399005278 413837913 423954411
10447 423954411 420424334 412321682 407503169 396591801 370517893 341543783 314110092
10440C14110092l8744222m5255756l9823564l6256676l3520056k7171794k0457053
10433G2880971j5218775j1211272q250217o069824m526271l524549k842546k319268
10425A8918249j916027j690537j514584j285729j134749j068900r37061q10896
10417H559766p71735o94321n88027n18792m42234l55671k64525j81416j28278
10408D614767r7303o3948r0401j38324j84096k23782k45656k75555k84025k40621
10398B771056k04784j80258j51619j28816j11068j00083q8666p3719o8765o8069
10388A595209o5678o9728o1319o3825o8588n8759n1358m0992l5626k8901j4407
10377A036028l28K2927L8976L2657L6123K8112n669l1642j9109l6809o2262n1328
$$ plain form
10440 314110092 275365870 230110114 190286550 154029874 120509818 93338024 72880971
10433 72880971 57662196 46450924 38200707 32130883 27604612 24080063 21237517 18918249
10425 18918249 17002222 15311685 13797101 12511372 11376623 10307723 9370662 8559766
10417 8559766 7788031 7093710 6505683 5986891 5544657 5188986 4924461 4743045 4614767
10408 4614767 4517464 4453516 4363115 4224791 4040695 3816913 3571257 3295702 3011677 2771056
10398 2771056 2566272 2386014 2234395 2105579 1994511 1894428 1805762 1732043 1663278 1595209
10388 1595209 1529531 1459803 1398484 1334659 1266071 1207312 1155954 1114962 1079336 1050435 1036028
10377 1036028 1035700 1058627 1097603 1130260 1166383 1194495 1188826 1157184 1138075 1101266 1039004 987676
10365I87676k6157j8473j2802K355J6985K4385L1725L9367N3941N0399O9534O8945
10353A287880N6056N6596N9511L3915K0560L8849M0076q858l2872k4500l4192
10342A493021o3986o8357o2112o6720r3374q2406o9109p1000q2404o2268m5445
10331G25840l6454k3941o938k253J560K8672M1211K6235K5367O8937P8972P6185
10319A003393J10477J46726J79098K17545L51544M98820M72747L53199K23541
10310C557090k89982p24074o45584n08876m27223l40600k57286k05030j62991
10301d556j27952r5769o5749m2778k1894J3459L5997K4401L1741N1616N0379M2815
10289a08290M8497O9410O1698M3686N4806N3872M0581J8462Q841K14j346o840
$$ plain form
10365 987676 961519 943046 930244 932599 949584 973969 1005694 1045061 1099002 1149401 1218935 1287880
10353 1287880 1343936 1400532 1460043 1493958 1514518 1553367 1593443 1584585 1551713 1527213 1493021
10342 1493021 1429035 1360678 1298566 1231846 1138472 1056066 986957 915957 833553 771285 725840
10331 725840 689386 665445 658507 656254 657814 686486 727697 753932 779299 848236 927208 1003393
10319 1003393 1113870 1260596 1439694 1657239 2008783 2507603 2980350 3333549 3557090
10310 3557090 3267108 2543034 1897450 1388574 961351 620751 363465 158435 -4556
10301 -4556 -132508 -228277 -294026 -336804 -358698 -345239 -309242 -284841 -253100 -201484 -151105 -108290
10289 -108290 -59793 9617 71315 115001 169807 223679 264260 282722 291563 291777 290431 283591
10277B83591j0096j543j1131j2724o307K426P668K679Q54N696L558K687j558R233
10263B75033N107M161J5654J6454J3725K0769K8037J8853L512J2162K1038J7776
10251D52281P605K8586K6761L8110O1405Q0512J03356J20398J19966J20360J18336
10240A277676P5604M0592N161l6363p0538r7725j23623j49551j39323j20921j05848
10229E55141r5182o6324m9010m0402k1503m964p73L627P061P364j69M61l831j6193
10215B75303j3711j1923j6467j7832j2376q844L00l664o108j101Q99j588o457
10202A76431j2727j4409k1719k2052k0524j2681r011j457j246o614O480j859L553
10189F2165O839P596P987M703l72j790n92m960r577j1160p174n896n728p577n269
$$ plain form
10277 283591 273495 271952 260821 248097 241790 244216 251884 254563 255417 261113 264671 267358 265800 275033
10263 275033 280140 284301 299955 316409 330134 350903 378940 397793 401305 413467 434505 452281
10251 452281 459886 488472 515233 553343 614748 695260 798616 919014 1038980 1159340 1277676
10240 1277676 1353280 1393872 1399033 1362670 1292132 1194407 1070784 921233 781910 660989 555141
10229 555141 459959 393635 344625 304223 282720 277756 276983 280610 287671 295035 294866 295327 291496 275303
10215 275303 261592 249669 233202 215370 202994 194150 194450 190786 184678 183577 184476 182888 176431
10202 176431 163704 149295 127576 105524 85000 72319 63308 61851 60605 53991 60471 58612 62165
10189 62165 69004 76600 84587 89290 88918 87128 86536 81576 71999 60839 53665 47769 42041 34464 29195
10174B9195m360o128l563n870l022j1137j1185n256j144p776j0777j2786l535
10161e7344N79m314J52l761j0671r300n592Q80p104p019m042j1923j0212m705
10147a34376l701O466L843j206q81J696O256J2242J5642J1571J6712J7834K0551
10134b7351J6429J7111J4065O197J2758R018j515l776O996O233k832p24K260m961
10120D9908q107l425k40N596l546q208n146o093n508K907p758m488P94l847j452
10105A387N155L748n717l59J560n43L622J643N982J368M119O045j239j844O107
10090C1034J1312J1121O081M537M370J4185L1023L9201M2950M3559N2400N6298
10078C48071N0719N3049L3435J6364J6336l009k8485k9463l1764m8174n2234m2311
$$ plain form
10174 29195 24835 18707 15144 9274 6252 -4885 -16070 -21326 -22470 -30246 -41023 -53809 -57344
10161 -57344 -56765 -61079 -60927 -64688 -75359 -84659 -90251 -89371 -96475 -103494 -107536 -119459 -129671 -134376
10147 -134376 -138077 -131611 -127768 -128974 -129855 -128159 -121903 -109661 -94019 -82448 -65736 -47902 -27351
10134 -27351 -10922 6189 20254 26451 39209 48227 46712 42936 49932 56165 53333 52609 54869 49908
10120 49908 41801 38376 38136 43732 40186 31978 26832 20739 15231 18138 10380 5892 6686 2839 1387
10105 1387 6542 10290 4573 4214 5774 5231 8853 10496 16478 17846 21965 28010 26771 24927 31034
10090 31034 42346 53467 59548 64085 68455 82640 113663 152864 195814 239373 291773 348071
10078 348071 398790 451839 485274 501638 517974 514965 486480 457017 425253 377079 324845 282534
10066B82534l4567k6896j0713j0656l093J924Q400O106L470J637J0683K4120J1707
10053B64656O611R860R487J2756J5509K4390M3449N3940P9099J14104J49538J88090
10041I71489K29301K48724K40355K58507K53849J88883J59419J41684N4579q5592
10031B661198j22245j10573j62326k08116j90429k21478k73807k51458k07671
10022I13095j89207j62307j19910r3015p2308m4327k9712k8715k1335j8440j6066
10011A17753j4462j0193q124n227l434q519o152j0374r312l395O09k255n64N641
9997D1992M453j2868L77P673m904j0333O218M467j8055O0J6781j096j3970L23
9983B1118M534r067m51o507p862j1936n392O359m62N155K018n413m87J1288L316
$$ plain form
10066 282534 247967 221071 210358 199702 196609 198533 206933 213039 216509 218146 228829 252949 264656
10053 264656 271267 281127 290614 303370 318879 343269 386718 440658 519757 633861 783399 971489
10041 971489 1200790 1449514 1689869 1948376 2202225 2391108 2550527 2692211 2746790 2661198
10031 2661198 2538953 2428380 2266054 2057938 1867509 1646031 1372224 1120766 913095
10022 913095 723888 561581 441671 348656 276348 232021 202309 173594 152259 133819 117753
10011 117753 103291 93098 84974 79747 76313 67794 61642 51268 41956 38561 39170 36915 36351 41992
9997 41992 46445 33577 33954 41627 36723 26390 32608 37075 19020 19080 35861 34765 20795 21118
9983 21118 25652 16585 16134 9627 1765 -10171 -15563 -9204 -9666 -4511 -2493 -7906 -8393 2895 6211
9968F211P267K158j001L630n361p016m739n613p729j248n762l204K082L312Q380
9953h633P735O560J6126K3408J8963J9616J1949J184p911k6995k0555k0306q338
9940A2803o317m179n304J145n200k49P324O135P873L196q63p56L58J897l402j0550
9924C911j1161o767q564j16n490j588L293n341j934J799Q855p862l708J1099J1875
9909a1699J0651J0358P358R71m626k696o438j1526j620m055j297p981j1613k433
9895c6646Q542L08M70j741k135l939j426J11l074K519o820O355M293k175j000
9880c6358O383k146m375k806N843L209l673n30R319M066j810k364j18k166p415
9865c4941l55L396k359L617m706q669n497J760M827k60q566o060Q674P393J674
$$ plain form
9968 6211 13478 15636 14635 18265 12904 5888 1149 -4464 -12193 -13441 -19203 -22407 -20325 -17013 -8633
9953 -8633 -898 5662 21788 45196 64159 83775 95724 96908 88997 62002 41447 21141 12803
9940 12803 6486 2307 -2997 -1852 -7052 -7301 23 6158 14031 17227 16364 15608 15966 17863 14461 3911
9924 3911 -7250 -14017 -22581 -22697 -28187 -29775 -26482 -31823 -33757 -31958 -23103 -30965 -34673 -23574 -11699
9909 -11699 -1048 9310 16668 17639 13013 10317 3879 -7647 -9267 -13322 -14619 -22600 -34213 -36646
9895 -36646 -28104 -27796 -27326 -29067 -31202 -35141 -36567 -36456 -39530 -37011 -43831 -37476 -33183 -35358 -36358
9880 -36358 -29975 -32121 -36496 -39302 -33459 -30250 -33923 -34453 -25134 -21068 -22878 -25242 -25360 -27526 -34941
9865 -34941 -35296 -31900 -34259 -30642 -35348 -44017 -49514 -47754 -42927 -43187 -51753 -57813 -49139 -41746 -40072
9850d0072K948j146j145k303J109N941j989k607l698K649p257j642Q488l428o114
9835e0266M897J1342P119J134O63K96n554p715L086K600J689N059M06q263k762
9820c6269K631L328k672o183o05j318j257M332j500k685m73O767%l64R57L797
9804c1514L027n118J57L479n825J904L720M321p04o530o449M717O501N664R55
9789b1695n123n27P115k301l824j190R49L477M121K71n451o395j603J057K731
9774b8388l079o980M594O919L792n762j476L018m891J646O16L18J74m98L202l948
9758c0743k942j00j615n21L778N987j470J174J783J015J143n84m360m186n654
9743c7295k716K032M241K717J071j924k01r6l152J134L977K143j736m697m551
$$ plain form
9850 -40072 -37124 -38270 -39415 -41718 -40609 -34668 -36657 -39264 -42962 -40313 -47570 -49212 -40724 -44152 -50266
9835 -50266 -45369 -34027 -26908 -25774 -25111 -24815 -30369 -38084 -34998 -32398 -30709 -25650 -25244 -33507 -36269
9820 -36269 -33638 -30310 -32982 -39165 -39770 -41088 -42345 -38013 -39513 -42198 -42671 -35904 -35904 -36268 -35311 -31514
9804 -31514 -28487 -33605 -33448 -29969 -35794 -33890 -30170 -25849 -26553 -33083 -39532 -34815 -28314 -22650 -21695
9789 -21695 -26818 -27345 -20230 -22531 -26355 -27545 -26596 -23119 -18998 -18727 -24178 -30573 -32176 -31119 -28388
9774 -28388 -31467 -38447 -33853 -26934 -23142 -28904 -30380 -27362 -32253 -30607 -29991 -29673 -29499 -29997 -26795 -30743
9758 -30743 -33685 -33785 -35400 -35921 -32143 -26156 -27626 -26452 -24669 -23654 -22511 -23095 -27455 -31641 -37295
9743 -37295 -40011 -37979 -33738 -31021 -29950 -31874 -32075 -32171 -35323 -34189 -30212 -28069 -29805 -34502 -39053
9728c9053j713n32j73P405J0121K017n335q411j597M76K885l143L475J2324p668
9713b8922m271p14M772j205r53K62n444o005k191M005J680l307k010l615J467
9698d6451K725N496p62m203O203q08p53K826P79l027k992M135J128J860P48j64
9682c3260q60K999k384J682J0160K184o576m208n509n259l911n14L425P12K525
9667c8794K803L766p723j415R81m876M17K601J056L959M205K145l78m39J498k878
9651c3072m283J449j405j199R17N199m667r45L258L206K8k148L650O48k910l828
9635c6102n989N422Q209n60k455J519K985J946J701j47l159q102M154M601m415
9620c0392l977K836K358N093K081j056o889o816J087N923j472J806L469n079K658
$$ plain form
9728 -39053 -40766 -41298 -41471 -34066 -23945 -21928 -27263 -35674 -37271 -36795 -33910 -37053 -33578 -21254 -28922
9713 -28922 -33193 -33907 -29135 -30340 -31293 -31031 -36475 -42480 -44671 -40666 -38986 -42293 -44303 -47918 -46451
9698 -46451 -43726 -38230 -38992 -43195 -36992 -37800 -38553 -35727 -34948 -37975 -40967 -36832 -35704 -33844 -33096 -33260
9682 -33260 -34120 -31121 -33505 -31823 -21663 -19479 -26055 -30263 -35772 -41031 -44942 -45456 -42031 -41319 -38794
9667 -38794 -35991 -32225 -39948 -41363 -40382 -45258 -44841 -42240 -41184 -37225 -33020 -30875 -31253 -31692 -30194 -33072
9651 -33072 -37355 -35906 -37311 -38510 -37593 -32394 -37061 -38006 -34748 -31542 -31514 -33662 -30012 -29364 -32274 -36102
9635 -36102 -42091 -36669 -28460 -29020 -31475 -29956 -26971 -25025 -23324 -23471 -26630 -34732 -30578 -25977 -30392
9620 -30392 -34369 -31533 -29175 -24082 -22001 -23057 -29946 -36762 -35675 -29752 -31224 -29418 -25949 -31028 -28370
9605b8370l539j662l124k517J564n35L368M173R47k813l648M331K366o40M232
9590b5867K376k788j789l86p52L9L92K409q16L021M947q288q218M532K506j981
9574c0663L164J718r69J888K734J235o95m89j297o34r54m822q66N239N480q35
9558b0766o633l434n053k48Q328o36l450l018J476K323O990O740J131k271m61
9543a8982j141q586r783r867m421L331L161M981L232k017K218K884K208K558L584
9528b6640j178l070J098J93q932K182M524L466m092j595O128j078m868l268k04
9513c7334p08K735P461J476n746j480n175j0195n670J021M619n5l56Q40N165O167
9497c7235J904r29l920j163K074J041J628K794M366M201J141m772l522K339m103
$$ plain form
9605 -28370 -31909 -33571 -36695 -39212 -37648 -38183 -34815 -30642 -29695 -32508 -36156 -31825 -29459 -30099 -25867
9590 -25867 -23491 -26279 -28068 -28454 -29206 -29167 -28775 -26366 -27182 -24161 -19214 -27502 -35720 -31188 -28682 -30663
9574 -30663 -27499 -25781 -26750 -24862 -22128 -20893 -21588 -22077 -23374 -24008 -24962 -29784 -30650 -25411 -19931 -20766
9558 -20766 -27399 -30833 -35886 -36134 -27806 -28442 -31892 -34910 -33434 -31111 -24121 -17381 -16250 -18521 -18982
9543 -18982 -20123 -28709 -38492 -48359 -52780 -49449 -46288 -41307 -38075 -40092 -37874 -34990 -32782 -30224 -26640
9528 -26640 -27818 -30888 -29790 -29597 -38529 -36347 -31823 -28357 -32449 -34044 -27916 -28994 -33862 -37130 -37334
9513 -37334 -38042 -35307 -27846 -26370 -32116 -33596 -38771 -48966 -54636 -53615 -48996 -49051 -49407 -48567 -43402 -37235
9497 -37235 -35331 -36260 -40180 -41343 -39269 -38228 -36600 -33806 -29440 -25239 -24098 -28870 -32392 -30053 -34156
9482c4156J695K110M840L796K956m270n353k530P709K560J441L973m021K310J688
9467a5252j362L616M98p420p366p673j989L142j067r081N349O167J0266o41P245
9452a5568M954n786p430l48j269l034m43K025J022J324R11r70l118n036k173J2986
9436b1953N021r766n259Q025R96j009n245o730j785J731J760Q459Q379K306j447
9421a6517n671m368n490r847J862N620Q781R43j034j028L280P73o038r97M629
9406b5102L744l711j643L032k194k986Q091P422J35r51j213j1335n640R26J004
9391c0421O621O646l703L470P3r761p319n730l0K128R045P814O925r93k399M833
9375a2801M215M841j604j733m317n278l897o642k168O897P012M37r876k433Q037
$$ plain form
9482 -34156 -32461 -30351 -25511 -21715 -18759 -23029 -28382 -30912 -23203 -20643 -19202 -15229 -19250 -16940 -15252
9467 -15252 -16614 -12998 -12500 -19920 -27286 -34959 -36948 -33806 -34873 -43954 -38605 -32438 -22172 -22813 -15568
9452 -15568 -10614 -16400 -23830 -24178 -25447 -28481 -28924 -26899 -25877 -24553 -23642 -24612 -27730 -32766 -34939 -21953
9436 -21953 -16932 -26698 -31957 -23932 -22936 -23945 -29190 -35920 -37705 -35974 -34214 -25755 -17376 -15070 -16517
9421 -16517 -22188 -26556 -32046 -41893 -40031 -34411 -25630 -24687 -25721 -26749 -23469 -22696 -28734 -29731 -25102
9406 -25102 -21358 -25069 -26712 -23680 -25874 -28860 -20769 -13347 -13212 -14163 -15376 -26711 -32351 -31425 -30421
9391 -30421 -23800 -17154 -20857 -17387 -17314 -27075 -34394 -40124 -40154 -38026 -28981 -21167 -14242 -15235 -17634 -12801
9375 -12801 -8586 -3745 -5349 -7082 -11399 -16677 -20574 -27216 -29384 -22487 -15475 -15038 -24914 -27347 -19310
9360a9310L632j656m62L721J439j090m704K400J989J99j943O78R793K563k354
9345e105j730n786J436N335N99j424k02j805m473J826R704K448P410P023p083
9330H173j1463O058L943q18p256o296l722J761M817l427j420m104j894l295k147
9315b1090J0500M68l225k301k83l41J40P65m009J223L448n84J818Q474N356m365
9299d006R31M176J860L498r12l387r647L719O716O063K873r22n285l271J307K145
9283E858L129k237m947O106N788o936r328O392L181K533l518l264L935m09m586
9268A697o765k243N894J0809K160l852j416m34L03K806M326O045m8k367o050j554
9252I311K933L612P068K904k776O796L578m122K486O883J375o9o60J564Q480m31
$$ plain form
9360 -19310 -15678 -17334 -17796 -14075 -12636 -13726 -18430 -16030 -14041 -13842 -15785 -15107 -5314 -2751 -5105
9345 -5105 -6835 -12621 -11185 -5850 -5251 -6675 -6877 -8682 -13155 -11329 -1625 823 8233 15256 8173
9330 8173 -3290 2768 6711 5893 -1363 -7659 -11381 -9620 -4803 -8230 -9650 -13754 -15648 -18943 -21090
9315 -21090 -10590 -10122 -13347 -15648 -15931 -16272 -16132 -15367 -19376 -18153 -14705 -15289 -13471 -4997 359 -4006
9299 -4006 -3075 1101 2961 6459 5547 2160 -7487 -3768 2948 9011 11884 10962 5677 2406 3713 5858
9283 5858 8987 6750 1803 7909 13697 6761 -2567 3825 7006 9539 6021 2757 6692 6283 1697
9268 1697 -5068 -7311 -1417 9392 11552 7700 6284 5850 6153 8959 13285 19330 19282 16915 10865 9311
9252 9311 12244 15856 22924 25828 23052 29848 33426 29304 31790 38673 40048 39979 39319 40883 49363 48932
9236D8932o330o365M671O127L484K000J1230O064L838N470Q339K359M041P793
9222A01653Q770J2440M900R089J1228J2279J1536J9014J5527J4205J7530J1975
9210B50146J7314J9237K2994K5367K9791K3611K6544K6668K7111K7638K9516L2368
9198E58305M4020N0113N7011O6421P8381J10975J41530J72260K17878K80425L53652
9187B130971M46850N58158O98697Q60811R96689J000217Q40437N00038l1970n94599
9177G406299r73982j078578j011541q64305o98966n58802m41649l38519k58880
9168A181077j99697j53575j30689j01872p5084o4296n6203n2720l7718l0639k8965
9157B49619k8083j6541j0720k1964j5048j3099j4516j0931n406p860m224p377
$$ plain form
9236 48932 42602 36237 40908 47035 50519 52519 63749 69813 73651 79121 87460 89819 93860 101653
9222 101653 110423 122863 127763 136852 148080 160359 171895 190909 206436 220641 238171 250146
9210 250146 267460 286697 309691 335058 364849 388460 415004 441672 468783 496421 525937 558305
9198 558305 602325 652438 709449 775870 854251 965226 1106756 1279016 1496894 1777319 2130971
9187 2130971 2577821 3135979 3834676 4695487 5692176 6692393 7532830 8032868 8000898 7406299
9177 7406299 6432317 5353739 4342198 3477893 2778927 2220125 1778476 1439957 1181077
9168 1181077 981380 827805 697116 595244 520160 455864 399661 346941 309223 278584 249619
9157 249619 221536 204995 194275 172311 157263 144164 129648 118717 113311 105451 101227 93850
9145I3850o499m722n965M224k969q425o020m501l083k375k816o84j974j677j0931
9130C5433k252M52K638J303q312q614l394j30N006k478p222j877j232k032j641
9115E648Q952L733p06l68m117q729p385j239M473L24j59n020R299O20p507p46
9099b927m501K657N278L734K17p503k857K696M592k935q951O163P015m164n305
9084f791P3M564q87j546j841O90P52k340K845o650j884L719K649Q05m877l29n104
9067a6152K713J0262o79l509J405l586j534O489K168p751p329N364P309k26J350
9052c706l97j499l916J928k457J860J743j961m33J588J67k908k562P45j852M097
9036i563j058J917j331m74J915r534n937O05N228m906j315P536K846Q218Q48l91
$$ plain form
9145 93850 87351 82629 76664 80888 77919 69494 63474 58973 55890 53515 50699 50015 48041 46364 35433
9130 35433 33181 33633 36271 37574 29262 20648 17254 17124 22130 19652 12430 10553 9321 7289 5648
9115 5648 14600 18333 17627 17259 13142 4413 -2972 -4211 262 586 427 -4593 4706 5326 -2181 -2927
9099 -2927 -7428 -4771 507 4241 4458 -3045 -5902 -3206 1386 -1549 -10500 -4337 2678 -1486 -6791
9084 -6791 -6718 -2154 -3041 -4587 -6428 -5738 -4986 -7326 -4481 -11131 -13015 -9296 -6647 -5842 -10719 -11048 -16152
9067 -16152 -13439 -3177 -3856 -7365 -5960 -9546 -11080 -4591 -2423 -10174 -17503 -12139 -4830 -5056 -3706
9052 -3706 -4103 -5602 -9518 -7590 -10047 -8187 -6444 -8405 -8838 -7250 -7083 -9991 -12553 -11808 -13660 -9563
9036 -9563 -10621 -8704 -10035 -10509 -8594 -18128 -24065 -23460 -18232 -23138 -24453 -16917 -14071 -5853 -5005 -5396
9020e396P5J261l233j70n842M9l080l76L634k624K0l73L024J95k457K854q13K467
9002a0785K519L579L824l423j996O69J951j280n185l432L593M998N445k204k561
8987d288n608L737L151m032l061N286j904j153j954l177L930l916N82N990l612
8972a0029L173M179M956l880n667L719K723k133J412j563n660n755J229r34n15
8957a4745L973J404q326N501O146m9N302N075m984l906o927n879K004J73L306
8942a1932N056o697K795R64L360M689K219l179j95K90j29m388j1041n326K089
8927b1425k606J932Q545N254N15L730n391R32J516l982m418K930K292j384J15
8912a1445j646J59M554L278o917M327J705m028R99j849q895J517L870j12L119
$$ plain form
9020 -5396 -5321 -4060 -7293 -7463 -13305 -13256 -16336 -16712 -13078 -15702 -15682 -16055 -13031 -12836 -15293 -12439 -13252 -10785
9002 -10785 -8266 -4687 -863 -4286 -6282 -5613 -3662 -4942 -10127 -13559 -9966 -4968 477 -1727 -4288
8987 -4288 -9896 -6159 -3008 -7040 -10101 -4815 -6719 -7872 -9826 -13003 -9073 -12989 -12407 -6417 -10029
8972 -10029 -6856 -2677 2279 -1601 -7268 -3549 -826 -2959 -1547 -3110 -8770 -14525 -13296 -14230 -14745
8957 -14745 -10772 -9368 -17694 -12193 -6047 -6096 -794 4281 -703 -4609 -11536 -17415 -15411 -15238 -11932
8942 -11932 -6876 -13573 -10778 -9814 -6454 -1765 454 -2725 -2920 -2630 -2759 -7147 -18188 -23514 -21425
8927 -21425 -24031 -22099 -13554 -8300 -7785 -4055 -9446 -8514 -6998 -10980 -15398 -12468 -10176 -11560 -11445
8912 -11445 -13091 -12932 -8378 -5100 -12017 -7690 -5985 -10013 -9014 -10863 -19758 -18241 -14371 -14483 -11364
8897a1364L313r961l136K627J164L676j312K117m710o90P947M366k064j069m713
8882a3809m816L051J413O19K322q21M736M38o365R4N406J774l873m072K019J256
8866a0628j631n624N70J79L112R059N566l892o495r28Ml517m774M089L615r1p47
8849a2133k803L961M304M646L876L862j238j330m157q3l759j903P80K647Q730
8834E400L184K273m765m261m171Q530M028O49m360n045m257j556n775p436J620
8819a5942K558r64j301O86P053N027L897K198R90J846M434J102K948l249o39o032
8803D612k618M15L878k853o243m145p004j452K661P78k83K032L202K159R295N970
8787A0404M955j590l192l908N963M310J77J0323J53p629j554j282l896q860j812
$$ plain form
8897 -11364 -8051 -18012 -21148 -18521 -17357 -13681 -14993 -12876 -17586 -18276 -10329 -5963 -8027 -9096 -13809
8882 -13809 -18625 -15574 -14161 -13542 -11220 -12041 -7305 -6867 -13232 -13138 -7732 -5958 -9831 -13903 -11884 -10628
8866 -10628 -12259 -17883 -17313 -17134 -14022 -4963 603 -3289 -9784 -10712 -10708 -14225 -18999 -14910 -11295 -11386 -12133
8849 -12133 -14936 -10975 -6671 -2025 1851 5713 4475 3145 -1012 -1095 -4854 -6757 -5977 -3330 5400
8834 5400 8584 10857 6092 1831 -2340 6190 10218 10867 6507 1462 -2795 -4351 -10126 -17562 -15942
8819 -15942 -13384 -14348 -15649 -14963 -7910 -2883 1014 3212 4202 6048 10482 11584 14532 11283 10644 4612
8803 4612 1994 2409 6287 3434 -2809 -6954 -13958 -15410 -12749 -11971 -12254 -10222 -7020 -4861 4434 10404
8787 10404 15359 13769 10577 6669 12632 16942 17119 27442 27595 19966 18412 17130 13234 4374 2562
8772B562p954l411N696L411l147K715n669k276K106K50L215J126M277N343j884
8757F360j571L686k182r763n958l082L757M459R34k989K523r41N083O940J658
8742H914n08m51L762K959K366q061o918K915O869O733k789J955q511j938n104
8727B193N3k317r29k370K264j196K081J0248P10n697m020q80M526J0250j672o995
8711F249j561M874J046L908J120l965K072m68K153o36r357K290M72L271R091k920
8695A7639j364K495j150P9j347k994o049o341r85Q927L197m662Q58L124j71J21
8679A1377O232M50p071L975k07k523n551k078L423K78J733O482K906K21j005L261
8663B1903O104m924j1532O362L762n752j685L313l150k560M561m016k870j492
$$ plain form
8772 2562 -5392 -8803 -3107 304 -2843 -128 -5797 -8073 -5967 -5717 -2502 -1376 2901 8244 6360
8757 6360 4789 8475 6293 -3470 -9428 -12510 -8753 -4294 -3360 -6349 -3826 -4767 316 7256 8914
8742 8914 8406 7955 11717 14676 17042 8981 2063 4978 11847 18580 15791 17746 9235 7297 2193
8727 2193 2246 -71 -1000 -3370 -1106 -2302 -221 10027 10737 5040 1020 140 4666 14916 13244 6249
8711 6249 4688 9562 10608 14516 15636 11671 13743 13275 15428 14792 5435 7725 8197 11468 20559 17639
8695 17639 16275 18770 17620 17699 16352 13358 7309 968 -17 8910 12107 7445 8303 11427 11256 11377
8679 11377 17609 18059 10988 14963 14756 12233 6682 4604 8027 8305 10038 16520 19426 19647 18642 21903
8663 21903 28007 23083 11551 17913 21675 15923 14238 17551 14401 11841 16402 12386 9516 8024
8649H024M492Q54L602j622P43o148J627P711R451P085m121l135m951j574M007
8634B6045k416k607j770J225N680k90N63P711L943l308r599N491M873n57J673
8619C6657q37N111O496q85o934M661M060L424l598j108R473L682M133N147M252
8604G3734M562n24k154R856N832M272R302N987R970Q081L266N799J5859J6360
8590A70202J8899J0804K1098K5699L0154K6802K9724K5080L0620K9638J2516O965
8578D38201j4339l1486m1961m3492l6591m2813l3100k1321j9962j9216j6830j3021
8566A04069n082j4591j3887j3858q193o897p708p319l588M825N345L028k715m348
8552B9081N753Q268q796q200N66L769n328Q02n871J133m835M348p308l758O504
$$ plain form
8649 8024 12516 13370 16972 15350 16093 9945 11572 19283 28734 35819 31698 28563 23612 22038 26045
8634 26045 23629 21022 19252 20477 26157 25867 26430 34141 38084 34776 25177 30668 35541 34984 36657
8619 36657 35820 40931 47427 46542 39608 44269 48329 51753 48155 47047 56520 60202 64335 69482 73734
8604 73734 78296 77772 75618 85474 91306 95578 104880 110867 120837 128918 132184 137983 153842 170202
8590 170202 189101 199905 221003 246702 276856 303658 333382 358462 389082 418720 431236 438201
8578 438201 423862 392376 350415 306923 270332 227519 194419 173098 153136 133920 117090 104069
8566 104069 98987 84396 70509 56651 48458 41561 33853 26534 22946 27771 33116 36144 33429 29081
8552 29081 34834 43102 34306 26106 26672 30441 25113 25915 20044 21177 16342 20690 13382 9624 16128
8537A6128J66K073M210j0805q684l507r43M522lL403M198n96J168q2j4214m273
8521g239K86L459O652R84p559q62O551M251k414l626j256l324M23N629L362o036
8505g19K511J547k07r641k237L271J998j381K764J961m640l266P716N483l070
8490B090j486k019K152N62K961J122j988l25k735m849N08L340l137j961O610M887
8474E732M865J830k437m685k962p155j238k751Q84K724N063K033M548n344l18
8459G89j681o020Q48L68M24J093J981K987K563M827j45k136j966k845m125l741
8443f779k983p87N869l000R74O686M693k593k579p37K175O563K150m662l495l517
8427b022l261L779L709L888L832N256o89q979r447N73j343K033R735q008l747
$$ plain form
8537 16128 16294 18367 22577 11772 3088 -419 -1362 3160 3157 6560 10758 10162 11330 11248 -2966 -7239
8521 -7239 -6953 -3494 3158 4142 -3417 -4279 2272 6523 4109 483 -773 -4097 -3674 1955 5317 -719
8505 -719 1792 3339 3132 -6509 -8746 -5475 -3477 -4858 -2094 -133 -4773 -8039 -323 5160 2090
8490 2090 604 -1415 737 1299 4260 5382 3394 3069 334 -4515 -4007 -667 -3804 -5765 845 5732
8474 5732 10597 12427 9990 5305 2343 -4812 -6050 -8801 -7917 -5193 -130 1903 6451 1107 789
8459 789 -892 -6912 -6064 -5696 -5272 -4179 -2198 789 3352 8179 8034 5898 3932 1087 -3038 -6779
8443 -6779 -9762 -10549 -4680 -7680 -6706 -20 4673 2080 -499 -1236 939 7502 9652 4990 1495 -2022
8427 -2022 -5283 -1504 2205 6093 9925 15181 14492 5513 -3934 -3361 -4704 -2671 7064 -944 -4691
8412d691O199L44l45L237k581J610K428L98o162j208O708l981o334J912M075n166
8396c557q735L956L822M57k328j2O957l5l875K700L009n521m959l1O871N520Q88
8379E127J176M525n322o243j787L295L059n289L690J480M117M056k371p237q141
8364e865J658M816J041m64K701K884o129j003K503K761R31l58p037n717k044P261
8348b061K383J94p394K944N51L383K422L344K563j591n89n536r76k319l571j463
8332g716o4l81L245N143m23k466l69m795J214O868L210M042k643j061l207p15
8316a18m093m827J003Q83J0777K851k948o793j374K320N322J086l675j541k496
8301c623R51k543P56p108p790J670R01J686N468L760K086L816N532J667n659j0499
$$ plain form
8412 -4691 1508 1852 1507 4744 2163 3773 6201 6599 437 -771 5937 1956 -4378 -2466 1609 -3557
8396 -3557 -12292 -8336 -4514 -4057 -6385 -6397 560 525 -3350 -650 2359 -3162 -8121 -8152 -1281 4239 5127
8379 5127 6303 10828 5506 -737 -2524 771 3830 -1459 2231 3711 7828 11884 9513 2276 -5865
8364 -5865 -4207 609 1650 1186 3887 6771 642 -361 2142 4903 5834 5476 -1561 -7278 -9322 -2061
8348 -2061 322 516 -6878 -3934 -3383 0 2422 5766 8329 6738 6149 613 -363 -2682 -6253 -7716
8332 -7716 -7780 -8161 -4916 227 -196 -2662 -3031 -7826 -6612 256 3466 7508 4865 3804 597 -118
8316 -118 -4211 -9038 -8035 -7152 3625 6476 3528 -3265 -4639 -2319 3003 4089 414 -1127 -3623
8301 -3623 -2672 -5215 -4459 -11567 -19357 -17687 -16786 -15100 -9632 -5872 -3786 30 5562 7229 1570 -8929
8285h929o59P063N714l361n406M950O41L25Q49n547N70j112j305l322L308L301
8269b920P64J669N074Q99J193k60p955J947J341J751m311l783o346l841M547M661
8253e570L367N089J867j394K462n835l654J904R0n130Q42p61M460N113j067m352
8237b569M811P727k010n05k313l015j316p43J076M302l021k604j300o82R30j653
8221b885O65k513k341N874K2J035J336L354n047m753K304K095n367L361P855m782
8205B13l690k105q03j075M09M407K547P019K502k781m596o417k350j9L773k219
8189e185P814M588J359n741p85m661n337L964K34j728J632P279N536N57k571o053
8173I02m386n246M701N852L034j56p98J21r80J97K418p867k743J907P954q6j567
$$ plain form
8285 -8929 -9588 -2525 3189 -172 -5578 -628 13 338 1187 -4360 -3790 -4902 -6207 -9529 -6221 -2920
8269 -2920 -2156 -487 4587 5486 6679 6419 -1536 411 1752 3503 -808 -4591 -10937 -14778 -10231 -5570
8253 -5570 -2203 2886 4753 3359 5821 -14 -3668 -1764 -1674 -6804 -5962 -6723 -2263 2850 1783 -2569
8237 -2569 2242 9969 7959 7454 5141 2126 810 67 1143 5445 2424 -180 -1480 -2162 -1232 -2885
8221 -2885 -2220 -4733 -7074 -1200 -1178 -143 1193 4547 -500 -5253 -2949 -854 -6221 -2860 4995 213
8205 213 -3477 -5582 -6385 -7460 -7051 -2644 -97 6922 9424 6643 2047 -4370 -6720 -6739 -2966 -5185
8189 -5185 2629 7217 8576 2835 2050 -2611 -7948 -3984 -3750 -5478 -3846 3433 8969 9526 6955 902
8173 902 -3484 -8730 -4029 1823 4857 4701 3903 4024 3044 3241 5659 -2208 -4951 -3044 4910 4824 3257
8156C257N180m64n002n677M079m947m170J44L940J163k539m478J202l660o44K379
8140a0237L964J044k040n377O62K233J878m05J270J532j332J366k711j508N624
8125d037J058l668L736l609r839r39l120k540N404M272K520J645R76l777J907
8110a0011O747J585o12L757j642j669N455N476K059p256l890K765J287m554n610
8095f113p23j119N37l583K903Q579K747j083n478k649M322l488j875L831N235
8080B043J156m415n287M149j519m120N515L939m676J917Q019M799k637k063k401
8065D419J432Q8J739L234m260k345J851R29m421K047J364J445J49J945N754j630
8049A3740P575k656K162l082j562p834O35O003k166k848k25j911K561J2940L478
$$ plain form
8156 3257 8437 7973 2971 -2706 1373 -3574 -7744 -7600 -3660 -2497 -5036 -9514 -8312 -11972 -12616 -10237
8140 -10237 -6273 -5229 -7269 -12646 -11984 -9751 -7873 -8278 -7008 -5476 -6808 -5442 -8153 -9661 -4037
8125 -4037 -2979 -6647 -2911 -6520 -16359 -17298 -20418 -22958 -17554 -13282 -10762 -9117 -8141 -11918 -10011
8110 -10011 -3264 -1679 -2291 1466 -176 -1845 3610 9086 11145 3889 -1 2764 4051 -503 -6113
8095 -6113 -6836 -7955 -7418 -11001 -8098 481 3228 2145 -3333 -5982 -1660 -5148 -7023 -3192 2043
8080 2043 3199 -1216 -6503 -2354 -3873 -7993 -2478 1461 -3215 -1298 6721 11520 8883 6820 4419
8065 4419 5851 5939 7678 10912 6652 4307 6158 7087 2666 4713 6077 7522 7671 9616 15370 13740
8049 13740 21315 18659 20821 17739 16177 8343 8978 14981 12815 9967 9742 7831 10392 23332 26810
8034B6810l120n004n10P607n301J058m705j792m34O371K61k314P120J404k448
8019B5003p80k689R69N855o31q66O410l848p990J119Q219O730n163n489j277N57
8003B6129p74l672N885N364L760p998m323N14O190p67K905L128k325K720R901
7988D6637L782j274N404J2158J2129M15j494l957n368j3226p204l200K461m491
7974D2772m219o78L27j665o725j1379j682N140o13q1m020l047n610O56K363O402
7958A7941K523l729N781J914k810k467M626J1516p80O91K955M82j560K88M809
7943D2180O935J203P368N054m372m781o412n735q4K272m223m065J379K758m417
7928C5060n579K29K91n770p117q94j386N84j431L256O479j531p292m627M28Q565
$$ plain form
8034 26810 23690 18686 18176 25783 20482 21540 16835 15043 14609 20980 21241 18927 26047 27451 25003
8019 25003 24223 21534 22503 28358 27727 26861 33271 29423 21433 22552 30771 37501 32338 26849 25572 26129
8003 26129 25355 21683 27568 32932 36692 28694 24371 24885 31075 30308 33213 36341 34016 36736 46637
7988 46637 50419 49145 54549 66707 78836 79251 77757 73800 68432 55206 48002 44802 47263 42772
7974 42772 38553 37875 38202 36537 29812 18433 16751 21891 21278 21197 17177 14130 8520 9176 11539 17941
7958 17941 20464 16735 22516 24430 21620 19153 23779 35295 34515 35206 38161 38643 37083 37371 42180
7943 42180 49115 50318 57686 62740 58368 53587 47175 41440 41356 43628 39405 35340 36719 39477 35060
7928 35060 29481 29710 30001 24231 17114 16220 14834 15418 13987 17243 23722 22191 14899 10272 10700 19265
7912A9265L007j286N188k089j29J252k175m122k867k099M801Q30n761m586K295
7897A1524N733L371j319o567L32P227m557K133L389m103n029k748J020j807J602
7882A0201J687k390n190k437J411M097M26m35J064N54L50k685j199j548j412k910
7866d16l895l300N039K596K031j871m857l541R4M681L644j993Q88L447j35l643
7850a231k564l105m38K190L367L286K51J156l621O145o166m013O431M623J918
7835H229q839q133j893K023j296l791L5K708k324J403J32m988j161Q511J333l054
7819a1105j058P881O75n21J244J278j802m79M151J434n433m832L575K104l91J84
7803c095k759m080K582O958J047K69k505n383K271R09j107j837J023j401o56L969
$$ plain form
7912 19265 22272 20986 26174 24085 23956 25208 23033 18911 16044 13945 18746 19576 13815 9229 11524
7897 11524 17257 20628 19309 12742 13074 20301 15744 17877 21266 17163 12134 9386 10406 8599 10201
7882 10201 11888 9498 4308 1871 3282 7379 7805 7370 8434 8988 9338 6653 5454 3906 2494 -416
7866 -416 -4311 -7611 -2572 24 2055 184 -4673 -8214 -8120 -3439 205 -1788 -900 2547 2412 -1231
7850 -1231 -3795 -6900 -7338 -5148 -1781 1505 1756 2912 -709 5436 -730 -4743 1688 6311 8229
7835 8229 -610 -8743 -10636 -8613 -9909 -13700 -13665 -10957 -13281 -11878 -11746 -16734 -17895 -9384 -8051 -11105
7819 -11105 -12163 -4282 -3607 -4128 -2884 -1606 -3408 -3887 264 1698 -3735 -8567 -4992 -2888 -3279 -3095
7803 -3095 -5854 -9934 -7352 -394 653 922 -1583 -6966 -4695 -3786 -4893 -6730 -5707 -7108 -7764 -3795
7787c795N560p57q431J648N222K783l084l195K154J333J755j217n68L660m683
7772a615m800L240K945j818k051J006O297K300J203l636L826l483m431k23j201
7757b441O94l980j455K25J649R41j97l291n767l611r64O155P615J1183n312r390
7741g946l548L731M502P622j254o635K547p4n52l99k199q201l676Q706M28k066
7725i014L100L691K864K31P26n502k216L845R43k962l874k40K022L352O68l439
7709e805q48k12m28L462j613r09j266j586j095l836Q297J2050L910m278k922k946
7693b5o855r282l704M489M099N886r85M65r22L732k169l789L277R774M978m488
7677D481j0804j4171L003J534M394J135p670L625L326n068M157N803K902k31j584
$$ plain form
7787 -3795 1765 1008 -7423 -5775 -553 2230 -854 -4049 -1895 -562 1193 -24 -592 3068 -1615
7772 -1615 -6415 -3175 -230 -2048 -4099 -3093 3204 5504 6707 3071 6897 3414 -1017 -1240 -2441
7757 -2441 -1747 -5727 -7182 -6957 -5308 -4367 -4564 -7855 -13622 -17233 -18197 -12042 -4427 6756 1444 -7946
7741 -7946 -11494 -7763 -3261 4361 3107 -3528 -981 -1055 -1607 -2006 -4205 -12406 -16082 -7376 -6948 -9014
7725 -9014 -5914 -2223 641 872 1598 -3904 -6120 -2275 -1332 -4294 -8168 -8408 -6386 -3034 -2366 -5805
7709 -5805 -6653 -6865 -7293 -3831 -5444 -6353 -7619 -9205 -10300 -14136 -5839 6211 10121 5843 2921 -25
7693 -25 -6880 -16162 -19866 -15377 -11278 -5392 -6377 -5912 -6834 -3102 -5271 -9060 -5783 3991 8969 4481
7677 4481 -6323 -20494 -17491 -15957 -11563 -10428 -18098 -14473 -11147 -16215 -12058 -6255 -3353 -3584 -5168
7662e168l109j756L591j080l575M823J646N111l425j1115n253L430L884L847M091
7647d058l734k784j94M230J076k458J605j22P10J069K063P790P227k040n700o11
7631D069l919j319o96K854k629P6m65k463L311J100l903m121m514j904J143o096
7615a9476j517r17j03Q70N00k940l658K215O683N583R928K163K852K977n428l899
7599d167o571J215K021R10L310l27l823j960K262k297K355N66Q358k339q256j518
7583a0261l973j589P992N86j3677m057M290Q018M140p26K889J058k490l916R014
7568b702q04m124L762p33L470l001j355K048l093k497l309k204R52P638K463j532
7552e021l93r365k132K660J4479K474o15m273l83j673k52J099O26n521K032p7
$$ plain form
7662 -5168 -8277 -10033 -6442 -7522 -11097 -6274 -4628 483 -2942 -14057 -19310 -15880 -11996 -8149 -4058
7647 -4058 -7792 -10576 -10770 -6540 -5464 -7922 -6317 -6439 -5729 -4660 -2597 5193 12420 10380 4680 4069
7631 4069 150 -1169 -1865 989 -1640 -1564 -2029 -4492 -1181 -81 -3984 -8105 -12619 -14523 -13380 -19476
7615 -19476 -20993 -21910 -22013 -21143 -20643 -23583 -27241 -25026 -18343 -12760 -2832 -669 2183 5160 -268 -4167
7599 -4167 -10738 -9523 -7502 -6592 -3282 -3609 -7432 -9392 -7130 -9427 -7072 -6506 1852 -487 -8743 -10261
7583 -10261 -14234 -15823 -7831 -7245 -20922 -24979 -20689 -12671 -8531 -9257 -6368 -5310 -7800 -11716 -2702
7568 -2702 -3506 -7630 -3868 -4601 -1131 -4132 -5487 -3439 -6532 -9029 -12338 -14542 -13590 -5952 -3489 -5021
7552 -5021 -5414 -14779 -16911 -14251 228 2702 2087 -2186 -2569 -4242 -4494 -3395 -2769 -8290 -6258 -6335
7536f335L600p258o849M95O076Q071K595L578j875j450L888l427k348k45o799
7521h283n219N086N530M211l382k567m535L291P389J014J406p632q661m211M305
7506a2258K939O45k538K229M041L949l215r06r187l255P310L44L198N180J08m350
7490e766l968J743l711J821K455n756k936K22L775J0890K408j411l232N55M318
7475A407p56o904m150J684K733r018l710J383K002L042Q471P569M58k116L011
7460E106J881o067j0897M060N56J75l013k845M308M90r229L359M16j266J545o107
7444a7528p65M19j66o7J741M64P351J2553q597r691K006K728J194L22k428O785
7428c679L076J124j740n88n766j871L96J785j341j244K086j871q93k895P75N210
$$ plain form
7536 -6335 -2735 -9993 -16842 -16347 -10271 -2200 395 3973 2098 648 4536 1109 -1239 -1484 -8283
7521 -8283 -13502 -8416 -2886 1325 -2057 -4624 -9159 -5868 1521 2535 3941 -3691 -12352 -16563 -12258
7506 -12258 -9319 -8674 -11212 -8983 -4942 -993 -4208 -5114 -14301 -17556 -10246 -9902 -6704 -1524 -1416 -5766
7490 -5766 -9734 -7991 -11702 -9881 -7426 -13182 -16118 -15896 -12121 -1231 1177 -234 -3466 -2911 1407
7475 1407 651 -6253 -10403 -8719 -5986 -15004 -18714 -17331 -15329 -12287 -3816 3753 4211 2095 5106
7460 5106 6987 920 -9977 -5917 -5361 -5186 -8199 -11044 -6736 -6246 -15475 -12116 -11700 -12966 -11421 -17528
7444 -17528 -18293 -17874 -18040 -18107 -16366 -15902 -8551 4002 -4595 -14286 -12280 -9552 -8358 -8036 -10464 -3679
7428 -3679 -603 521 -1219 -1807 -7573 -9444 -9048 -7263 -8604 -9848 -7762 -9633 -10526 -13421 -12646 -7436
7412g436L615L751m30J940l023o173n626L395l311p255K534k132n548Q422Q391
7397h886O799J438N04n082k856N270O128j162m049J198j424j2060n785O685J0874
7382b408O715m697R13m515k718N847J440j040j150l206n735j360L860L107J715
7367c232n195j077j977k086P628r90o23J303N709m94k089P67k684j800R15m563
7351a0488j31R015N270k358o508k807l803j330L077n860k591M201Q841l12n34
7336f318q47P573J198J993O012J075o182p085r73k209M536m747M392K971J643
7321C032N378j574j980r891j371k791m635j271K257l169l449m402M632P293J147
7306a0794M364j718p435J96Q09Q585L519L978P44m733m158q03m663k44R93J303
$$ plain form
7412 -7436 -3821 -70 -500 1440 -1583 -7756 -13382 -9987 -13298 -20553 -18019 -20151 -25699 -17277 -8886
7397 -8886 -2087 -649 -145 -5227 -8083 -2813 3315 2153 -1896 -698 -2122 -14182 -19967 -13282 -2408
7382 -2408 4307 -390 523 -3992 -6710 -863 577 -463 -1613 -4819 -10554 -11914 -8054 -4947 -3232
7367 -3232 -8427 -9504 -11481 -13567 -5939 -6929 -7552 -6249 -540 -1034 -3123 -2356 -5040 -6840 -5925 -10488
7351 -10488 -10619 -1604 3666 1308 -5200 -8007 -11810 -13140 -10063 -15923 -18514 -14313 -5472 -5784 -6318
7336 -6318 -7165 408 1606 3599 9611 10686 4504 -2581 -3554 -5763 -1227 -5974 -1582 1389 3032
7321 3032 8410 6836 4856 -5035 -6406 -9197 -13832 -15103 -12846 -16015 -19464 -23866 -19234 -11941 -10794
7306 -10794 -6430 -8148 -15583 -15387 -14578 -5993 -2474 1504 2248 -2485 -6643 -7446 -12109 -12353 -11360 -10057
7290a0057m380L411J344l711O45J0255P004L158l449j0433m398k659j619M071
7276a0818K201J539q86M023l60P790r08o266K323m20r09l764p518j358N280k903
7260a2954m00O966R115m239l049m868j301L6m233m000M062j265n875O231Q881
7245f893R183n15l234l346l323m533Q49M382M66k432K788Jj818M243Q62q07m480
7228h607q106j723K584M263l464k56K257M062k193J231L384K047O882K259o759
7213b139N3q10k666K479O452P8M127J067p545L896N985K847m741m374n213r767
7197a0271K730L334L44K115l010l037J376l280J020O716N725J110q866R32L935
7182H73J343J304M98l057n824O49M759j870k600l411j827L559N074J073L641K116
$$ plain form
7290 -10057 -14437 -11026 -9682 -13393 -12748 -2493 4511 7669 4220 -6213 -10611 -13270 -14889 -10818
7276 -10818 -8617 -7078 -7964 -3941 -4301 3489 2581 -3685 -1362 -1782 -2691 -6455 -13973 -15331 -10051 -12954
7260 -12954 -13354 -6388 2727 -1512 -4561 -9429 -10730 -10694 -14927 -18927 -14865 -16130 -22005 -15774 -6893
7245 -6893 2290 1775 -1459 -4805 -8128 -12661 -11812 -7430 -6964 -9396 -6608 -6607 -8425 -4182 -3320 -4127 -8607
7228 -8607 -16713 -18436 -15852 -11589 -15053 -15309 -13052 -8990 -11183 -9952 -6568 -4521 2361 4620 -2139
7213 -2139 -2086 -2896 -5562 -3083 3369 3447 7574 8641 1096 4992 10977 13824 9083 4709 -504 -10271
7197 -10271 -7541 -4207 -3863 -1748 -4758 -7795 -6419 -9699 -8679 -1963 3762 4872 -3994 -3062 873
7182 873 2216 3520 4018 961 -4863 -4214 545 -1325 -3925 -7336 -9163 -5604 -530 543 4184 6300
7166F300j010k008n348O44P26j940l259J932N486j997n268l209j361k877L647
7151i542J041L209J581M720k084J691p72K521k457m080j551p723n801O055M752
7136h440j711o792l818L209J1361O616P41j726k781j331K088l640q409p57K037
7121a3353N152k268J194k674R32K535M21K107J680j496L56P77l4J76m084k961
7105a1540o112R63J450j19j87O976l98J241j384o620J65O123M73m86O12M661N001
7088H19N801j435n343M244r72L96O015K315j856p951l789r040l903q043P436O357
7072h949k40M350N162L897k456n455j216J008J302k916n757J594K377L232j480
7057e547n413l479L195M130n174J863l448N987K494p869J456L870P389N915K571
$$ plain form
7166 6300 5290 3282 -2066 -1422 -696 -2636 -5895 -3963 1523 -474 -5742 -8951 -10312 -13189 -9542
7151 -9542 -8501 -5292 -3711 1009 -1075 616 -156 2365 -92 -4172 -5723 -13446 -19247 -13192 -8440
7136 -8440 -10151 -16943 -20761 -17552 -6191 425 1166 -560 -3341 -4672 -2584 -6224 -14633 -15390 -13353
7121 -13353 -8201 -10469 -9275 -11949 -11017 -8482 -8061 -5954 -4274 -5770 -5414 -4637 -4671 -4495 -8579 -11540
7105 -11540 -17652 -16689 -15239 -15358 -15545 -8569 -8967 -7726 -9110 -15730 -15565 -9442 -8969 -9455 -8843 -4182 819
7088 819 6620 5185 -158 4086 3114 3510 9525 11840 9984 2033 -1756 -10796 -14699 -22742 -15306 -8949
7072 -8949 -9189 -4839 323 4220 1764 -3691 -4907 -3899 -2597 -5513 -11270 -9676 -7299 -4067 -5547
7057 -5547 -10960 -14439 -11244 -7114 -12288 -10425 -13873 -7886 -5392 -13261 -11805 -7935 -546 5369 7940
7042G940k280k937J858l898n484K722o395O74M648n307k388j16q44J020K118r025
7026a7694k462R112K796O4R13k653q74O138Q80J927Q978K329p283n109m521M39
7010g020j379k348K79K67l168R997N116j002J000k063p759o421L618M842R803
6995C762J748m830m847j73M066j505l03m42k767J879L361J625m688M410j923k39
6979h66j258j92p84K03l830J812O284M371k396m314m158J751J531m905q84J543
6963f092L948K541Q16Q38r85J864k208n83m161K922p125k301K961P57J002J175
6947d631j917o519J136m68O391l66k386l300j399L049q67m156K430j72J136Q09
6931a1230K753l542L401L624M764p66j0086q967l421J981O722K541n3O890M621
$$ plain form
7042 7940 5660 2723 4581 683 -4801 -2079 -8474 -7800 -3152 -8459 -10847 -10963 -11807 -10787 -8669 -17694
7026 -17694 -20156 -11044 -8248 -8184 -7271 -9924 -10798 -4660 -3780 -1853 7125 9454 2171 -2938 -7459 -7020
7010 -7020 -8399 -10747 -10468 -10201 -13369 -3372 1744 742 1742 -321 -8080 -14501 -10883 -6041 3762
6995 3762 5510 680 -4167 -4340 -274 -1779 -2082 -2524 -5291 -3412 -51 1574 -3114 1296 -627 -866
6979 -866 -2124 -2316 -3100 -2897 -6727 -4915 1369 5740 3344 -970 -5128 -3377 -1846 -6751 -7635 -6092
6963 -6092 -2144 397 1213 2051 1066 2930 722 139 -4022 -1100 -8225 -10526 -7565 -6808 -5806 -4631
6947 -4631 -6548 -13067 -11931 -12399 -6008 -6374 -8760 -12060 -13459 -10410 -11277 -15433 -13003 -13175 -12039 -11230
6931 -11230 -8477 -12019 -8618 -4994 -230 -996 -11082 -20049 -23470 -21489 -14767 -12226 -12279 -5389 -768
6916g68k7M053N528N115p369o179K894M846k731p518k238j14k027O88L966J438
6900d43l961j0077J853k81m151N214N866j048K038l317M973K243J364J173M84
6885A930j328m809k943J826K010L645M24l612J735k367k417P830R24m746O82o17
6869a833J451m60Q05n485p411k776j048j423K374K348O937R976n40m929m087l003
6853i104Q486P272j444l320k071l07k097L8l827k915l80O444K930o13r45k586
6837d439j1038m56M608j012N555R87M531L404J715Q22o842n485m895j160L95r78
6821a4288K195N142R630L527k488k868m270j027Q86n009l905J237L650K091k082
6806g579k665j21j33k618j658R10l42L936N360m731j171q30J24O77O369K311Q07
$$ plain form
6916 -768 -795 3258 8786 13901 6532 353 3247 8093 5362 -2156 -4394 -4508 -6535 -5847 -1881 -443
6900 -443 -4404 -14481 -12628 -12909 -17060 -11846 -5980 -7028 -4990 -8307 -3334 -1091 273 1446 1930
6885 1930 602 -4207 -7150 -5324 -3314 331 755 -2857 -1122 -3489 -5906 1924 2848 -1898 -1216 -1833
6869 -1833 -382 -842 -37 -5522 -12933 -15709 -16757 -18180 -15806 -13458 -6521 3455 2915 -2014 -6101 -9104
6853 -9104 -618 6654 5210 1890 -181 -488 -2585 -2547 -6374 -9289 -9669 -3225 -295 -908 -1853 -4439
6837 -4439 -15477 -15933 -11325 -12337 -6782 -5795 -1264 2140 3855 4677 -2165 -7650 -12545 -13705 -13310 -14288
6821 -14288 -12093 -6951 2679 6206 3718 850 -3420 -4447 -3561 -8570 -12475 -11238 -7588 -5497 -7579
6806 -7579 -10244 -10365 -10498 -13116 -14774 -13864 -14206 -10270 -4910 -9641 -10812 -11642 -11518 -10841 -4472 -2161 -1354
6789a354k057n227Q30P023O4M232l144q9M040K372J736P880K838q577p425l81
6773B761l12l92j0039o588Q222k15P69P86k022n05q131L04k305K804N139Q707
6757a017K713O73m982K642Q005O707K770j852R82O606K185o51j26j1181n193m553
6741C728o78m464l521l222N917N799m46j015k474m737P28L352m021L38P739P446
6725A0469N970M282n03k703j704n765n491O65m18J464j477p057j664K460J844
6710C72R8o72K976O001l15K993k581p048M34k474L246J0585q471o455r96l908
6694f215K247O267R4R32m407k33j995o555m352K928O572K955J451j776n746M489
6678c344J578K46r55j536l815k699L657L632P090o737J677K089j01k51O34j079
$$ plain form
6789 -1354 -3411 -8638 -7808 -785 -721 3511 367 278 4318 6690 8426 16306 19144 10567 3142 2761
6773 2761 2449 2057 -7982 -14570 -6348 -6563 -5794 -5008 -7030 -7535 -15666 -15362 -17667 -14863 -9724 -1017
6757 -1017 1696 2369 -2613 29 8034 14741 17511 15659 16641 23247 25432 24781 24655 13474 8281 3728
6741 3728 3050 -1414 -4935 -8157 -2240 3559 3113 2098 -376 -5113 -4385 -1033 -5054 -4716 3023 10469
6725 10469 16439 20721 20218 17515 15811 10046 4555 5220 4802 6266 4789 -2268 -3932 -1472 372
6710 372 470 -202 2774 8775 8460 11453 8872 1824 2258 -216 3030 13615 5144 -1311 -2307 -6215
6694 -6215 -3968 2299 2393 3325 -1082 -1315 -3310 -9865 -14217 -11289 -4717 -1762 -311 -2087 -7833 -3344
6678 -3344 -1766 -1520 -2475 -4011 -7826 -10525 -6868 -3236 3854 -2883 -1206 883 782 531 1165 86
6662H6k16K589n949l185J737K18J359k124k75j009J151J247l476K42M147L913
6646D55r09m931m024N422K573k374J555P505j431l964o84N292j379r261n637k382
6630a4174R002j701r57K056k77o658n123Q74Q845Q285l11j884l111j05K87O412
6614A460J500k294r53J56k502q125j922J423J807P681L679j28q574k222k779p193
6598a8986L559N329O545K754j120L322M545k980J022k943m281J33N282m671J31
6583b359L622m313j129M26j929M183M49P11p442N634M460o015n123K792L914l466
6567e585Q725J0187o928m191l98p41J671N273M078p74j0306q466o471j251N343
6552i834J0006J746N403j807l516L54M465N6k835l714n873j327q2K070L328m278
$$ plain form
6662 86 -130 2459 -3490 -6675 -4938 -4720 -3361 -5485 -5760 -6769 -5618 -4371 -7847 -7605 -3458 455
6646 455 -454 -5385 -9409 -3987 -1414 -3788 -2233 5272 3841 -123 -807 4485 3106 -6155 -11792 -14174
6630 -14174 -5172 -6873 -7830 -5774 -6051 -12709 -17832 -16958 -8113 172 -139 -2023 -5134 -5239 -4952 1460
6614 1460 2960 666 -287 -131 -2633 -10758 -12680 -11257 -9450 -1769 1910 1782 -6792 -9014 -11793 -18986
6598 -18986 -15427 -10098 -3553 -799 -1919 1403 5948 2968 3990 1047 -3234 -3101 2181 -2490 -2359
6583 -2359 1263 -3050 -4179 -3753 -5682 -1499 -1050 -339 -7781 -2147 2313 -3702 -8825 -6033 -2119 -5585
6567 -5585 3140 13327 6399 2208 1810 1069 2740 8013 12091 11317 1011 -7455 -13926 -15177 -9834
6552 -9834 172 1918 7321 5514 1998 2352 6817 6873 4038 324 -5549 -6876 -6958 -4888 -1560 -5838
6536e838L83j648j876l593O04N121L085p55N095j145o117o78L390K854L93J794
6520A069L88l110K435l304k97l262P23m490m094j083Q586J725j122M291k376J113
6504b808o44M259o119l594N238l597l254N446j244k45L902m858p774J0375N424
6489E07K055L814K133j996j545m091l049L820l818L15k060o132o2O48J256P497
6473g08N38n870M931M945j179l481m629l10k6N973O026k027k802n20r00j2655
6457a2694J634L769n361K330M261K938q9N113l720m385p560L71L499M629k399
6442g664o936K202P473N086K478J029k360q620k146k57P35K939k667J37O317k870
6426e124j517l045M112O692J482M82j515q48J296n35o993l571R458K169l377n568
$$ plain form
6536 -5838 -5455 -7103 -8979 -12572 -11968 -6847 -3762 -4517 578 -567 -6684 -7362 -3972 -1118 -725 1069
6520 1069 1457 -1653 782 -2522 -2819 -6081 -5358 -9848 -13942 -15025 -6439 -4714 -5836 -1545 -3921 -2808
6504 -2808 -3452 807 -5312 -8906 -3668 -7265 -10519 -5073 -6317 -6562 -2660 -7518 -15292 -4917 507
6489 507 2562 6376 8509 6513 4968 877 -2172 1648 -2170 -1855 -3915 -10047 -10109 -9461 -8205 -708
6473 -708 -170 -6040 -1109 3836 2657 -824 -5453 -5763 -5789 184 6210 4183 1381 861 -39 -12694
6457 -12694 -11060 -7291 -12652 -10322 -6061 -3123 -3212 1901 -1819 -6204 -13764 -13393 -9894 -5265 -7664
6442 -7664 -14600 -12398 -4925 161 2639 3668 1308 -7312 -9458 -9715 -8980 -6041 -8708 -8571 -2254 -5124
6426 -5124 -6641 -9686 -5574 1118 2600 3082 1567 719 2015 1480 -5513 -9084 374 2543 -834 -6402
6410f402l94O031Q651j598k533K907P17n808q197o166j815P752K13j393L145N921
6394A031l67J090R2J654n61k316K05M915m443n474l947L15n226l835L06Q594L568
6377d399k952O12K802j677J216R30K051M946m05m49n865k635K675l407k925J503
6361g979R58M057k512k884N68N947r63j112p36m387p99M284O411l162l942o10
6345f861l281K363N671o24k758l229L456N293j615l949j429J2M977N278r402m330
6329a0428l569q119N751N829J147K90j831k131J0546P248o94l143o263l540N142
6314c765r23L96k09n4M508M380m62m1n045j661l010k284N581L248K328k893q558
6297h464O497L496m288k533j47N223N24j2670N84J755l900m580L869O003N965
$$ plain form
6410 -6402 -6796 -765 7886 6288 3755 6662 7379 1571 -6626 -12792 -14607 -6855 -6642 -8035 -4890 1031
6394 1031 664 1754 1846 3500 2939 623 828 5743 1300 -4174 -8121 -7806 -13032 -16867 -16561 -7967 -4399
6377 -4399 -7351 -6739 -3937 -5614 -4398 -3468 -1417 3529 3124 2675 -3190 -5825 -3150 -6557 -9482 -7979
6361 -7979 -7021 -2964 -5476 -8360 -7792 -1845 -2808 -3920 -4656 -9043 -9842 -5558 853 -2309 -6251 -6861
6345 -6861 -10142 -7779 -2108 -2732 -5490 -8719 -5263 30 -1585 -5534 -6963 -6951 -1974 3304 -6098 -10428
6329 -10428 -13997 -22116 -16365 -10536 -9389 -9099 -10930 -13061 -2515 4733 4039 896 -5367 -8907 -3765
6314 -3765 -4688 -4292 -4501 -4555 -47 4333 3871 3830 -1215 -2876 -5886 -8170 -2589 659 2987 94 -8464
6297 -8464 -1967 1529 -2759 -5292 -5439 -216 308 -12362 -11778 -10023 -13923 -18503 -14634 -8631 -2666
6282b666L946K118M90J209l404r582n638R141K785K023L966J998m856N362k908
6267C984o904O984M420n533m532l297R08J99o094p97J598k729J635k425K013J727
6251h843L253Q379p664K469O944K131r166k525L483o040p336k28N656R758M867
6236E138j535j692l839l991R130O36j16o317l900L393N389O318L942m056q472
6221B8p296o20N831L808m122L64P628j356j462K441n084j440K354J532J525n453
6205a322J364N506j670o554N749M568k799K057M16p860K008K952K448k203l062
6190A598j315k152J915j402l732j614P17R84q346o074j685M422Q734K132K877
6175b941q93l307q78L043K067p622j774N638Q778j126q59j348j100N57j518N887
$$ plain form
6282 -2666 1280 3398 3888 5097 1693 -7889 -13527 -4386 -1601 422 4388 6386 1530 6892 3984
6267 3984 -2920 4064 8484 2951 -1581 -4878 -3970 -3771 -9865 -10662 -9064 -11793 -10158 -12583 -10570 -8843
6251 -8843 -5590 2789 -4875 -2406 4538 6669 -2497 -5022 -1539 -7579 -14915 -15143 -9487 271 5138
6236 5138 3603 1911 -1928 -5919 3211 3847 3731 -2586 -6486 -3093 2296 8614 12556 8500 28
6221 28 -7268 -7888 -2057 1751 -2371 -2007 5621 4265 2803 5244 160 -1280 1074 2606 4131 -1322
6205 -1322 42 5548 3878 -2676 3073 7641 4842 6899 7315 -545 1463 4415 6863 4660 1598
6190 1598 283 -1869 46 -1356 -5088 -6702 -5985 -5001 -13347 -19421 -21106 -16684 -7950 -5818 -2941
6175 -2941 -3834 -7141 -8019 -4976 -2909 -10531 -12305 -6667 2111 985 126 -1222 -2322 -1765 -3283 2604
6159B604Q150r46q775m494n213P90N3M44L109N044J159p641n938O104Q760M351
6143G561j037q480o561P40J207M275K146K901l786N879m456r123M98R24L498n136
6127h950m547N952M032n947J72M45p34l162N398P25M296K07n152o354l12O218
6111g713j564j899k136N574N617k64K122l551N73L007k513o904N449m22l437j347
6095i408j624n560J710O679K354k658j733L041O335k017o094J6N48N66J610l598
6079i833N331K495J0821M007m191j0423J995M41N45r02j107m679J215j012j742
6064g039k297M204K881K507O37k104j9N146n303k527K308L315o169o08J0061J791
6048F784k611o137l249L772N192j655m940K545J243L638J807K840n157M939j405
$$ plain form
6159 2604 10754 9808 1033 -3461 -8674 -7884 -7831 -7387 -4278 766 1925 -5716 -11654 -5550 3210 7561
6143 7561 6524 -1956 -8517 -7777 -6570 -2295 -149 2752 -1034 4845 389 -8734 -8236 -7312 -3814 -8950
6127 -8950 -13497 -7545 -3513 -9460 -9288 -8843 -9577 -12739 -7341 -6616 -2320 -2113 -7265 -13619 -13931 -7713
6111 -7713 -9277 -11176 -13312 -7738 -2121 -2385 -263 -3814 -3241 -234 -2747 -9651 -4202 -4624 -8061 -9408
6095 -9408 -11032 -16592 -14882 -8203 -5849 -8507 -10240 -7199 -864 -2881 -8975 -8959 -8411 -7845 -6235 -9833
6079 -9833 -4502 -2007 8814 12821 8630 -1793 202 643 1188 286 -821 -5500 -4285 -5297 -7039
6064 -7039 -9336 -5132 -2251 256 893 -1211 -1230 3916 -1387 -3914 -1606 1709 -4460 -5068 4993 6784
6048 6784 4173 -1964 -5213 -1441 3751 2096 -2844 -299 944 4582 6389 9229 4072 9011 7606
6033G606p325n855L571q84m861P210K954j650o57J144o492m171j010k337J441
6018a1316M848L722N387K542M825l810l805q178k345k456J505J631K431L084J943
6003Hl076k248k693J782P529j233k6M284n90m902l344l28M289k343k170J111M732
5986G82L871o780j408K053O47M636l090N303O935p378k334l953j237L806m06j845
5970c98k656K813m09Q15L761P86J571m332jj806r52L465m840J473k006l813j278
5953g807R75o76j869M91o97n89o37Q017O75l543m001n3o80R81j406j084o44J522
5935a1025N254M553J103j147K887j738k187M955J924N480k475p503J327m22j338
5920c52l442J073J11J823L79j343o28K610j100N150L896k81j903k230p162k4l046
$$ plain form
6033 7606 281 -5574 -2003 -2887 -7748 -538 2416 766 109 1253 -5239 -9410 -10420 -12757 -11316
6018 -11316 -6468 -2746 2641 5183 10008 6198 2393 -5785 -8130 -10586 -9081 -7450 -5019 -1935 8
6003 8 -3068 -5316 -8009 -6227 1302 69 43 4327 3737 -1165 -4509 -4837 -548 -2891 -5061 -3950 782
5986 782 4653 -2127 -3535 -1482 -835 3801 711 6014 12949 5571 3237 -716 -1953 1853 1447 -398
5970 -398 -3054 -241 -650 165 3926 4712 6283 1951 1950 144 -808 2657 -2183 -710 -2716 -6529 -7807
5953 -7807 -6832 -7508 -9377 -8886 -9583 -10172 -10809 -2792 -2117 -5660 -9661 -9714 -10394 -9413 -10819 -11903 -12547 -11025
5935 -11025 -5771 -1218 -115 -1262 1625 -113 -2300 2655 4579 10059 7584 81 1408 986 -352
5920 -352 -3794 -2721 -2610 -787 -408 -1751 -2379 231 -869 4281 8177 7896 5993 3763 -3399 -3423 -6469
5903f469p014J454K427K678O621P800L620p587n75l71L048l521K178L870r88N11
5887G682N593m456N133M205n136n817n987K699J252l990j537J2567k875k728j877
5872D728J557k763J032l452l171K207N42L468n07n49k288m159j329o21K92K221
5856b792P241J582J350l374l413K201K077K50K291J901l778j423l763o617Q30
5841e437M198J846K563K968L565l003j547K465k085j36j616k056n07j718J083
5826E83O742K594l052J259l157Q29K657n475m584M537j428j1967k328N915Q095
5811A220L986r89o169r58K936K520n226k818m456J062P29n423L133J122O378L159
5795B06p940n367N420N759k000l003K631j943J257j010k2L758J440j601q855k976
$$ plain form
5903 -6469 -13483 -12029 -9602 -6924 -303 7497 11117 3530 2955 2584 5632 2111 4289 8159 7171 7682
5887 7682 13275 8819 13952 18157 13021 7204 1217 3916 5168 1178 -359 12208 9333 6605 4728
5872 4728 6285 3522 4554 1102 -2069 138 680 4148 3641 3092 804 -3355 -4684 -5305 -5013 -2792
5856 -2792 4449 6031 7381 4007 594 2795 4872 5122 7413 9314 5536 4113 350 -6267 -5437
5841 -5437 -1239 607 3170 6138 9703 6700 5153 7618 5533 5397 3781 1725 1218 -500 583
5826 583 7325 9919 6867 8126 4969 5798 8455 2980 -1604 2933 1505 -10462 -12790 -6875 1220
5811 1220 5206 4217 -1952 -2910 26 2546 -2680 -5498 -9954 -8892 -8163 -13586 -10453 -9331 -2953 206
5795 206 -7734 -13101 -7681 -1922 -3922 -6925 -4294 -6237 -4980 -5990 -6012 -2254 -814 -2415 -11270 -14246
5779a4246K001J388Q29K872P233l138n169K326k954J934k88K640M566K317K439
5764D750P926K930n695k517j724R48p34M628j334m115J60M538n185k354n729L85
5748c122L720M421L121L308K798m565l959J087k669J234P53M620k833o757l43
5733H14k379O085K404J561n08j666P87q248p117M856M462N029m483r026l830L131
5717h128N263N652M49l947j578L635j945L694K522R07m022j701j849K312j372
5702a08j084k07k27J494l080K980L945j50m869o254j126k792J697O745M625J533
5686C122j106l995L57j408L499l252m793p43K857p78P653M190K537j26L473p736
5670C751p396J230R452k047m434q90R73M667l705N42J116m586n486O38O468M041
$$ plain form
5779 -14246 -12245 -10857 -10028 -7156 77 -3061 -8230 -5904 -8858 -6924 -7212 -4572 -6 2311 4750
5764 4750 12676 15606 9911 7394 5670 6618 5884 10512 9178 5063 5223 9761 4576 2222 -3507 -3122
5748 -3122 598 5019 8140 11448 14246 9681 5722 6809 4140 5374 6127 10747 7914 1157 814
5733 814 -1565 4520 6924 8485 7977 6311 7098 -1150 -8267 -3411 1051 6080 1597 -7429 -11259 -8128
5717 -8128 -2865 2787 3236 -711 -2289 1346 -599 3095 5617 6524 2502 801 -1048 1264 -108
5702 -108 -1192 -1399 -1626 -132 -3212 -232 3713 3563 -1306 -7560 -8686 -11478 -9781 -3036 1589 3122
5686 3122 2016 -1979 -1622 -3030 469 -2783 -7576 -8319 -5462 -6240 1413 5603 8140 8014 11487 3751
5670 3751 -3645 -2415 7037 4990 556 -334 639 5306 1601 2143 3259 -1327 -6813 -6175 293 4334
5654D334M85j697j338k045J198j849N206O771j066L947o342l259O56J668K285
5639H954l441j171m93l585n293j400K162k372M111j95j529L426J302J6j780j387
5623b675j155p6l560j101O3R71P090j404n087L872M417M262m003J492o746l792
5607g432L691K415N333M284J394M35p189n559o924j190%k005m29l40K193M633
5591f690M86l488j005j680K397K082q51J532O111J0371J209p639O70K706p20o881
5575a390l330j512K604M935o7Q27m865j863L979M096M51m293j901j116m489j024
5559h958N855M794j834j71J799n187p503K237J450k205O71L728L126r99p324o00
5543a1121Q60L248N429p92p448K876J542Q7l038N549K83o039K174M046N800K437
$$ plain form
5654 4334 4819 3122 1784 -261 937 -912 4294 11065 9999 13946 7604 4345 5001 6669 8954
5639 8954 5513 4342 3849 264 -5029 -6429 -4267 -6639 -2528 -2723 -4252 -826 476 492 -1288 -2675
5623 -2675 -3830 -3906 -7466 -8567 -8504 -7533 -443 -1847 -6934 -3062 1355 5617 1614 3106 -3640 -7432
5607 -7432 -3741 -1326 4007 8291 9685 10120 2931 -2628 -9552 -10742 -10742 -12747 -13176 -13516 -11323 -6690
5591 -6690 -6204 -9692 -10697 -12377 -9980 -7898 -8749 -7217 -1106 9265 10474 2835 3505 6211 5491 -1390
5575 -1390 -4720 -6232 -3628 1307 1240 2067 -2798 -4661 -682 3414 3865 -428 -2329 -3445 -7934 -8958
5559 -8958 -3103 1691 -143 -314 1485 -3702 -11205 -8968 -7518 -9723 -9052 -5324 -2198 -3197 -10521 -11121
5543 -11121 -10261 -7013 -1584 -2376 -9824 -6948 -5406 -5319 -8357 -2808 -2525 -8564 -6390 -2344 3456 5893
5527E893J437n879k453j616P9M531m904j0548J183K900N816N440l058k151k059
5512e389j867K026J893M087l96j717j100o48J903R10l223K734J540j155L869l308
5496A59J198L607l782k238O132k88J364n445j0436k920K573L731K390J042O57
5481b256m30L39J213N416M903k564m063R83n164n89k203L320P42k911j476N436
5465F96l006m171K980R123O18p620p909L798Q042O648r379q503N527O657O881
5450A0382J561m812n040l352l208j790j175L529L404N31K643o716K731P470m132
5435B026m501j398J480N69L776m390j42K510O855K942k588l767k332l78l159L148
5419F51k443p83K986m337O507O403l939j0939L825K557k909N566m0k141p180l874
$$ plain form
5527 5893 7330 1451 -1002 -2618 -2539 1992 -2912 -13460 -12277 -9377 -3561 1879 -1179 -3330 -5389
5512 -5389 -7256 -5230 -3337 750 354 -1363 -2463 -3111 -1208 -298 -3521 -787 753 -402 3467 159
5496 159 1357 4964 1182 -1056 5076 4788 6152 707 -9729 -12649 -10076 -6345 -3955 -2913 -2256
5481 -2256 -2686 -2347 -1134 4282 9185 6621 2558 3541 -1623 -2212 -4415 -1095 -353 -3264 -4740 696
5465 696 -2310 -6481 -3501 5622 6240 -1380 -9289 -5491 2551 9199 -180 -8683 -3156 3501 10382
5450 10382 11943 7131 2091 -1261 -4469 -6259 -7434 -3905 -501 30 2673 -4043 -1312 6158 2026
5435 2026 -2475 -3873 -2393 -1824 1952 -2438 -2580 -70 6785 9727 7139 3372 1040 662 -2497 651
5419 651 -1792 -2575 411 -3926 2581 8984 5045 -5894 -2069 488 -2421 3145 3105 964 -6216 -10090
5403a0090j119N393M384n36m754J141J706J668j429r67L740M863M31j257o115
5388b941n583N116J093n928o430J982J274L362J222o950J404M997L427j04K310
5373a749q00J81L157j126j128p793p43j570M135L373K961M146n099l298j08j93
5357e654R93o02M095L368M942m120n350n319l532K737R676J562J839K840n448
5342B027P4K986K937m042k182L56J792l624J551J067N197R00L93Q40N025m191
5326A1106j3287n722m364m520J462O02M310P176O560J254J787q78j993K08l105
5311E96j676K961rP82m14K948K805K832K369l655m983K383r32j700L318R68n203
5294C390K358p51k263n17M146o223r950M901O852J702j007L150n879o220K648
$$ plain form
5403 -10090 -11209 -5816 -1432 -1968 -6722 -5581 -3875 -2207 -3636 -4603 -863 4000 4431 3174 -2941
5388 -2941 -8524 -3408 -2315 -8243 -14673 -12691 -11417 -8055 -6833 -13783 -12379 -7382 -3955 -4059 -1749
5373 -1749 -2549 -2368 789 -337 -1465 -9258 -10001 -11571 -7436 -4063 -1102 3044 -2055 -5353 -5461 -5654
5357 -5654 -4661 -5263 -1168 2200 7142 3022 -2328 -7647 -11179 -8442 1234 2796 4635 7475 2027
5342 2027 2101 5087 8024 3982 1800 2156 3948 324 1875 2942 8139 9039 9432 10272 15297 11106
5326 11106 -2181 -7903 -12267 -16787 -15325 -14723 -10413 -3237 3323 4577 6364 5486 3493 3701 596
5311 596 -1080 1881 1872 2654 2240 5188 7993 10825 13194 9539 4556 6939 6007 4307 7625 8593 3390
5294 3390 5748 4997 2734 2217 6363 140 -9810 -4909 1943 3645 2638 5788 -91 -6311 -3663
5279c663R390K968j682j313n523m999m402j262O575r2l872j892n766K445N204
5264g884R939k737n245k252R815O302r70j854L309q05K596K4p165j0273l80R450
5248A870P430o151p299O771O428m598j1107l954Q691J7793k112k576n278q786
5234b878J369k314J433L379O33l72K222L13J687j628J58k112j124k315L406P367
5218I224J26k967M319J210k363n978l643J734K320M65m441o0n5r40k677q35L43
5201d218K62N166N015N78k955l558M616R39M337J023n034l584k204o952o84J61
5185g092m585O952O763L897l279l296M018K993k778p702r08l079K026L523o39
5170c186r22J580K186M916O83m801j098O448n41n134r203J582L057L059k958O28
$$ plain form
5279 -3663 5727 8695 7013 5700 177 -4822 -9224 -10486 -3911 -4003 -7875 -9767 -15533 -13088 -7884
5264 -7884 2055 -682 -5927 -8179 1636 7938 6968 5114 8423 7618 10214 10238 3073 -7200 -7580 1870
5248 1870 9300 3149 -4150 2621 9049 4451 -6656 -10610 -1919 15874 13762 11186 5908 -2878
5234 -2878 -1509 -3823 -2390 989 1622 1250 3472 3785 5472 3844 4002 1890 766 -1549 1857 9224
5218 9224 9350 6383 10702 11912 9549 3571 -72 1662 3982 4447 6 -54 -109 -1049 -3726 -4561 -4218
5201 -4218 -3956 1210 6225 6803 3848 290 4906 5845 10182 11205 6171 2587 383 -6569 -7253 -7092
5185 -7092 -11677 -4725 2038 5935 2656 -640 3378 6371 3593 -4109 -5017 -8096 -6070 -2547 -3186
5170 -3186 -4108 -2528 -342 4574 5257 456 -642 5806 5265 131 -9072 -7490 -4433 -1374 -4332 -3704
5154c704O57K839K681m331k703L959M886M417j258j137K145M598o676j488K934
5139G819k051J362Q95m948k018q780J186M882O340O196K738j246o178l840N243
5124G600M406p528n730m877P747K296o563K743k662K328L960N73k319K290M924
5109I188k620o354l31k837j426L598M763j632n725O120M809o75j453n186n414
5094e175k553N673N04M889K668j133R08K414M348n77p180l67J153m93J457J602
5078H138P74l673o259j292N9j696N77j745K840K584k168L805n3j59n79m394P327
5061D086N048o907m422j632K150L448P000M81p031j621K408l925p587j323L978
5046e849q89M919J046j529l143j498N66L83N054K26j8m57M52O721K455J930k849
$$ plain form
5154 -3704 -3047 -208 2473 -1858 -4561 -602 4284 8701 7443 6306 8451 13049 6373 4885 7819
5139 7819 5768 7130 8025 3077 1059 -7721 -6535 -1653 4687 10883 13621 12375 6197 2357 7600
5124 7600 12006 4478 -1252 -6129 1618 3914 -2649 94 -2568 -240 3720 4293 1974 4264 9188
5109 9188 6568 214 -117 -2954 -4380 -782 3981 2349 -3376 2744 7553 6878 5425 239 -5175
5094 -5175 -7728 -2055 -1551 3338 6006 4873 5781 8195 12543 11966 4786 4419 5572 5079 6536 8138
5078 8138 8912 5239 -1020 -2312 -2253 -3949 -3372 -5117 -2277 307 -1861 1944 1891 1732 1153 -3241 4086
5061 4086 9134 2227 -2195 -3827 -1677 1771 8771 9252 2221 600 3008 -917 -8504 -9827 -5849
5046 -5849 -6738 -1819 -773 -2302 -5445 -6943 -6377 -5994 -940 -714 -732 -1189 -737 5984 8439 10369 7520
5029G520q601J559O403O047j717o237n46m18K632m310K53O488L344K992l929q82
5013A0598m103m888j349j70RN357P421J175m363m33N15o402P017q12o472K758
4997E858J527L70m286K887k489k239j520k86J252l663p695k461P216L104k553
4982d978n27r85q76q732O696L183N619k806n752m658J2764Q113K845k176l899
4967C831l472J918m366j707J364P92k098l784J037K691O0Q62P956N982k404K852
4951A1514L896J741n991m515r231J00q94L625L675M364l29L994j623j0113p841
4936g628M441n87j032P61j141j89k857J870K917K112k658R37n140q44N262p31
4920d507m219K401P786N041J415k647K046r30k298J789L085o400l095K974m206
$$ plain form
5029 7520 -1081 478 6881 12928 11211 4974 4428 4010 6642 2332 2585 9073 12417 15409 11480 10598
5013 10598 6495 1607 258 88 97 5454 12875 14050 9687 9254 9769 3367 10384 9572 3100 5858
4997 5858 7385 7755 3469 6356 3867 1628 108 -178 1074 -2589 -10284 -12745 -5529 -2425 -4978
4982 -4978 -5505 -6490 -7366 -16098 -9402 -6219 -600 -3406 -9158 -13816 -1052 7061 9906 7730 3831
4967 3831 359 2277 -2089 -3796 -2432 -1640 -3738 -7522 -6485 -3794 -3734 -2872 5084 11066 8662 11514
4951 11514 15410 17151 11160 6645 -2586 -2486 -3380 245 3920 8284 7955 11949 10326 213 -7628
4936 -7628 -3187 -3774 -4806 -4045 -5186 -5375 -8232 -6362 -3445 -1333 -3991 -3054 -8194 -9038 -3776 -4507
4920 -4507 -8726 -6325 1461 6502 7917 5270 7316 6386 4088 5877 8962 2562 -533 2441 -1765
4905a765K972K443m283K788K978J091l112k643J710o274l997j129N859j86L197
4890c51P053n211o889O374n021j1118J608N226M380N910j39j878J820q11j465
4875e12k817K13q597R349J2234k77l043n63M957L13p608J869k127j762K020L982
4859G631o388p158J235O009P615n546j891k771j878n703k627m057K090O085M845
4844b509J462k011o916m148K984M134K65K723M45j754M637l891j432m967J487
4829i491J821O745K076L754o46r082k368P73N936L702p562l914O85O363L028j155
4813F65J706j888m393k786n132l333N56K419Q988M109l712n082k986K789j499
4798i579p02J1887M662o274q82n290o600k514Q85K803L703n038j830N736K829
$$ plain form
4905 -1765 1207 3650 -633 2155 5133 6224 3112 469 2179 -4095 -8092 -9221 -3362 -3548 -351
4890 -351 6702 1491 -5398 976 -4045 -15163 -13555 -8329 -3949 1961 1822 -56 1764 953 -512
4875 -512 -3329 -3116 -11713 -2364 9870 9593 6550 5987 10944 11257 3649 5518 3391 1629 3649 7631
4859 7631 1243 -5915 -4680 1329 8944 3398 1507 -1264 -3142 -8845 -11472 -15529 -13439 -7354 -2509
4844 -2509 -1047 -3058 -9974 -14122 -11138 -7004 -6739 -4016 -3571 -5325 -688 -4579 -6011 -10978 -9491
4829 -9491 -7670 -925 1151 4905 4259 -4823 -7191 -6418 -482 3220 -4342 -8256 -7571 -1208 1820 665
4813 665 2371 483 -3910 -6696 -11828 -15161 -14605 -12186 -3198 911 -2801 -7883 -10869 -8080 -9579
4798 -9579 -10281 1606 6268 -6 -888 -6178 -12778 -15292 -14407 -11604 -7901 -12939 -14769 -9033 -6204
4783f204R23P019l744p337N54P366R93j79j05l744J444j650l149K36J200K237
4767d140L783J568m849L590m456n18l178Q25l48N263P527k270q139J626P292O62
4751D238j847m040Q693j245k030j842J738k603p04L174J030k67N55l060k435j859
4735b504k959O384L843m616k369J625L758J625N60N01K647j955K617J340L42j123
4719I716m387j89M193k741m007l169l008j62O375J1279l727k842o108J3K374O654
4703A0264J869J542m007m169p042P186M351l867L07j0649l924O450N301M218M481
4688A2311l448o653m632j075j115P142L904k045J582J471M231l442K605J906n275
4673G467j001K023k571o341j654j268l002M178M606M490j523R1K563J908R37m331
$$ plain form
4783 -6204 -5281 1738 -2006 -9343 -8789 -1423 -430 -609 -714 -4458 -3014 -4664 -7813 -7577 -6377 -4140
4767 -4140 -357 1211 -3638 -48 -4504 -5022 -8200 -7375 -7723 -2460 5067 2797 -5342 -3716 3576 4238
4751 4238 2391 -1649 7044 5799 3769 1927 3665 1062 358 3532 4562 4295 4850 1790 -645 -2504
4735 -2504 -5463 921 4764 148 -2221 -596 3162 4787 5347 5848 8495 6540 9157 10497 10839 9716
4719 9716 5329 5140 9333 6592 2585 -584 -3592 -3754 2621 13900 10173 7331 1223 1236 3610 10264
4703 10264 12133 13675 9668 5499 -1543 5643 9994 6127 6434 -4215 -8139 -1689 3612 7830 12311
4688 12311 8863 2210 -2422 -3497 -4612 2530 6434 4389 5971 7442 11673 8231 10836 12742 7467
4673 7467 6466 8489 5918 -423 -2077 -3345 -6347 -2169 2437 6927 5404 5495 8058 9966 10903 6572
4657F572l118j71l604l759N848J1396M422q276o282j820K941N918N004j186l214
4642A0671n68n218m221r80L175J041N82J645M232j552l942r95L210n42K370j376
4626G532j02m945m107l558L224K988O45n792J507Q560L298q6p310n619o83L625
4610h23O752n176l328L201k92K603L16m619L147M710k021p785K334j354O44N851
4594D160M164L170L645o756p820k555j43O555O473m661j842l168j603R518m739
4579D398n556j075P674P40n598k595j543j94O283M511L116n438R36n604j305N994
4563D744N806n817q239k548N577M84k347k062M313M61p16M602M529j254J42j684
4547E991k413l14k830j690L326M664K686p72o568l96J601J453o42j853o284K088
$$ plain form
4657 6572 3454 3283 -321 -4080 1768 13164 17586 9310 3028 1208 4149 10067 15071 13885 10671
4642 10671 10103 4885 664 -316 2859 3900 4482 6127 10359 8807 4865 3870 7080 6538 8908 7532
4626 7532 7430 2485 -1622 -5180 -1956 1032 1677 -4115 -2608 5952 9250 9164 1854 -3765 -4448 -823
4610 -823 5929 753 -2575 626 334 2937 3253 -1366 1781 6491 4470 -3315 -981 -2335 -1691 4160
4594 4160 8324 11494 15139 8383 563 -1992 -2135 4420 10893 6232 4390 1222 -381 9137 4398
4579 4398 -1158 -2233 5441 6181 583 -2012 -3555 -3749 2534 7045 10161 4723 5659 55 -1250 4744
4563 4744 10550 4733 -3506 -6054 -477 7 -2340 -4402 -89 372 -344 4258 8787 7533 7675 5991
4547 5991 3578 3264 434 -1256 2070 6734 9420 8648 2080 1684 3285 4738 4096 2243 -4041 -1953
4531a953J665L665O279n045m228O77L41o08m195Q64M520k79l041n120M417O438
4515D397J487K949J289o350l463l899p27J198oK073K844k714o360n21P268K521
4499A986m668m914o94j47O09J254M084O158N157j271J233K615M15o138j336r28
4483C415o02N211j596l211M021o33l104J868O508N557J424r118j0919p271n191
4468a3641O543O387P692K404p545j772K511R39k648j005r87M470m76M216j196
4453E892k636Q03l756J89j812n294j50L581M602J013l664q38Q931L942j092q71
4437H840J114N488j148J330o703k792O434N546J384o732n990J529l24j569n042
4422A365n00Q89P410j334k77k920l087J61L984L375n07k528J050l195j2358m215
$$ plain form
4531 -1953 -288 3377 9656 4611 383 1060 1401 793 -3402 -2538 1982 1703 -1338 -6458 -2041 4397
4515 4397 5884 8833 10122 3772 309 -3590 -4317 -3119 -3125 -1052 1792 -922 -7282 -7803 -535 1986
4499 1986 -2682 -7596 -8290 -8437 -7828 -6574 -2490 3668 8825 7554 8787 11402 11817 5679 4343 3415
4483 3415 2813 8024 6428 3217 7238 6605 3501 5369 11877 17434 18858 9740 -1179 -8450 -13641
4468 -13641 -7098 -711 6981 9385 1840 68 2579 3518 870 -135 -1122 3348 2872 7088 5892
4453 5892 3256 4059 303 492 -1320 -6614 -6764 -3183 1419 2432 -1232 -2070 6861 10803 9711 8840
4437 8840 9954 15442 14294 15624 8921 6129 12563 18109 19493 12761 6771 8300 7976 6407 1365
4422 1365 865 1754 9164 7830 7553 4633 1546 1707 5691 9066 8559 6031 7081 3886 -8472 -12687
4406a2687J764O134N047L806m444n654k760j762Q386k871n311k346Q004J0661
4392E967P834J075m995j94m444l010n52k483M237N30j556k549j562k376k961J732
4376e307L790M112K747J764o64K74M855n19n78k253o739K323P271J034m728l076
4360D306M719J767m239k487l477R72l455J05k305K13N639Q216n22l605N642j67
4344A1322r262m366L468p676j76N635M197M308O15k578j884j017M944L216o922
4329C824m366K872L211p05L142l227p903l74O26L633K24K016J18P75k630q28K206
4312B614Q624J137Q78N742n595n514r16L908j066j086L674N101j0404q819J075
4297f47N960k81p795n42K417m103L367K403m993K907l42m316k651J407k477J449
$$ plain form
4406 -12687 -10923 -4789 258 4064 -380 -6034 -8794 -10556 -2170 -5041 -10352 -12698 -4694 5967
4392 5967 13801 14876 9881 9687 5243 2233 1681 -802 3435 3965 2409 -140 -1702 -4078 -7039 -5307
4376 -5307 -1517 2595 5342 7106 6442 6716 11571 11052 10474 8221 1482 3805 11076 12110 7382 4306
4360 4306 9025 10792 6553 4066 589 1561 -1894 -1789 -4094 -3881 1758 9974 9452 5847 11489 11322
4344 11322 2060 -2306 1162 -6514 -6690 -1055 3142 7450 8065 5487 3603 2586 7530 10746 3824
4329 3824 -542 2330 5541 4836 7978 4751 -3152 -3526 -2900 733 957 2973 3091 3866 1236 408 2614
4312 2614 11238 12375 13253 18995 13400 7886 6970 10878 9812 8726 12400 17501 7097 -1722 -647
4297 -647 5313 5032 -2763 -3305 -888 -4991 -1624 779 -4214 -1307 -1649 -5965 -8616 -7209 -9686 -8237
4281h237L571M72k169l812L324M266k532m502J0411M780j488L039l257k469R77
4266B374J063L593K952m712m148P54J207k230q994k679M845J1148J455r703n094
4251h169j6K066K132J694k535j244Q6N756r88l591n918r97R525p219l27R069L167
4234B491M096j812o065N348J95n203j181j74J077K445k407j550k913l039K416
$$ plain form
4281 -8237 -4666 -4194 -6363 -10175 -6851 -2585 -5117 -9619 792 5572 4084 7123 3866 1397 2374
4266 2374 3437 7030 9982 5270 1122 1876 3083 853 -8141 -10820 -5975 5173 6628 -3075 -8169
4251 -8169 -8185 -6119 -3987 -2293 -4828 -6072 -5986 -230 -1218 -4809 -10727 -11724 -2199 -9418 -9745 -676 2491
4234 2491 6587 4775 -1290 4058 4253 -950 -2131 -2305 -1228 1217 -1190 -2740 -5653 -8692 -6276
$$ [...]
##END NTUPLES=NMR SPECTRUM
##END=
