##TITLE=Analysis number 314127
Compound Code mo 00162
Book Reference 2
Project Code adrs
Chemist Name ugmt
##JCAMPDX= 6.0         $$ Bruker NMR JCAMP-DX V2.0
##DATA TYPE= NMR SPECTRUM
##DATA CLASS= NTUPLES
##ORIGIN= Bruker BioSpin GmbH
##OWNER= NMR
$$ XWIN-NMR		Version 3.5
$$ Thu Oct  6 10:12:29 2005 GMT Daylight Time (UT+1h)  MAYBRIDGE\NMR@NMR_250MHZ
##.OBSERVE FREQUENCY= 250.131544655141
##.OBSERVE NUCLEUS= ^1H
##.ACQUISITION MODE= SIMULTANEOUS (DQD)
##.ACQUISITION SCHEME= undefined
##.AVERAGES= 16
##.DIGITISER RES= 18
##SPECTROMETER/DATA SYSTEM= dpx250
##.PULSE SEQUENCE= zg30
##.SOLVENT NAME= CDCl3
##.SHIFT REFERENCE= (INTERNAL, CDCl3, 0, 16.522)
##AUDIT TRAIL= $$ (NUMBER, WHEN, WHO, WHERE, WHAT)
$$ ##TITLE= Audit trail, XWIN-NMR		Version 3.5
$$ ##JCAMPDX= 5.01
$$ ##ORIGIN= Bruker BioSpin GmbH
$$ ##OWNER= NMR
$$ C:\u/data/dgb/nmr/ADRS/10540/pdata/1/auditp.txt
$$ ##AUDIT TRAIL=  $$ (NUMBER, WHEN, WHO, WHERE, WHAT)
(   1,<2005-10-06 10:12:06.55 +100>,<MAYBRIDGE\NMR>,<NMR_250MHZ>,
      <created by zg, POWCHK disabled, PULCHK disabled
       configuration hash MD5:
       62 19 C7 07 E1 42 D1 B7 37 6C 3D D0 77 39 F9 E6
       data hash MD5: 64K
       CC 2B 9F 21 37 34 2B 62 1C 69 7A DB 6F 78 43 2C>)
(   2,<2005-10-06 10:12:18.21 +100>,<MAYBRIDGE\NMR>,<NMR_250MHZ>,
      <Start of raw data processing
       ef LB = 0.3 FT_mod = 6 PKNL = 1 SI = 32K 
       data hash MD5: 32K
       50 AD BB 2E 82 8B 6B 4B 21 D0 8F C8 48 9D DE E0>)
(   3,<2005-10-06 10:12:20.13 +100>,<MAYBRIDGE\NMR>,<NMR_250MHZ>,
      <apk 
       data hash MD5: 32K
       E6 2B DF CF D2 7D 83 B6 BC 51 03 AC 6F 40 AF 8C>)
(   4,<2005-10-06 10:12:20.95 +100>,<MAYBRIDGE\NMR>,<NMR_250MHZ>,
      <abs ABSG = 5 
       data hash MD5: 32K
       10 82 35 88 6C 86 C4 AE F5 49 4C 58 63 7A F3 39>)
$$ ##END=
$$ 
$$ hash MD5
$$ DA F5 F5 A3 3A 7A 05 A5 37 24 E1 C2 29 BD 7F 66
##$RELAX= 
##$RELAX= 
##$RELAX= 
##$RELAX= 
##$RELAX= 
##$RELAX= 
##$RELAX= 
$$ Bruker specific parameters
$$ --------------------------
##$DU= <C:\u>
##$EXPNO= 10540
##$NAME= <ADRS>
##$PROCNO= 1
##$TYPE= <nmr>
##$USER= <dgb>
##$AMP= (0..31)
100 100 100 100 100 100 100 100 100 100 100 100 100 100 100 100 100 100 
100 100 100 100 100 100 100 100 100 100 100 100 100 100 
##$AQSEQ= 0
##$AQ_mod= 3
##$AUNM= <au_zg>
##$AUTOPOS= <10 >
##$BF1= 250.13
##$BF2= 250.13
##$BF3= 250.13
##$BF4= 250.13
##$BF5= 500.13
##$BF6= 500.13
##$BF7= 500.13
##$BF8= 500.13
##$BYTORDA= 1
##$CFDGTYP= 0
##$CFRGTYP= 5
##$CHEMSTR= <none>
##$CNST= (0..31)
1 1 145 1 1 1 1 1 1 1 1 1 1 1 1 1 1 1 1 1 1 1 1 1 1 1 1 1 1 1 1 1 
##$CPDPRG= <>
##$CPDPRG1= <>
##$CPDPRG2= <>
##$CPDPRG3= <>
##$CPDPRG4= <mlev>
##$CPDPRG5= <mlev>
##$CPDPRG6= <mlev>
##$CPDPRG7= <mlev>
##$CPDPRG8= <mlev>
##$CPDPRGB= <>
##$CPDPRGT= <>
##$D= (0..31)
0 1 0 0 0 0 0 0 0 0.06 0 0 0 0 0 0 0.0002 0 0 0 0 0 0 0 0 0 0 0 0 0 0 
0 
##$DATE= 1128589925
##$DBL= (0..7)
120 120 120 120 120 120 120 120 
##$DBP= (0..7)
150 150 150 150 150 150 150 150 
##$DBP07= 0
##$DBPNAM0= <>
##$DBPNAM1= <>
$$ [...]
##$SUBNAM7= <"">
##$SUBNAM8= <"">
##$SUBNAM9= <"">
##$SW= 20.6930455092707
##$SWIBOX= (0..15)
0 0 3 0 0 0 0 0 0 0 0 0 0 0 0 0 
##$SW_h= 5175.983436853
##$TD= 65536
##$TD0= 1
##$TE= 295.16
##$TE2= 300
##$TE3= 300
##$TEG= 300
##$TL= (0..7)
0 120 120 120 120 120 120 120 
##$TP= (0..7)
150 150 150 150 150 150 150 150 
##$TP07= 0
##$TPNAME0= <>
##$TPNAME1= <>
##$TPNAME2= <>
##$TPNAME3= <>
##$TPNAME4= <>
##$TPNAME5= <>
##$TPNAME6= <>
##$TPNAME7= <>
##$TPOAL= (0..7)
0.5 0.5 0.5 0.5 0.5 0.5 0.5 0.5 
##$TPOFFS= (0..7)
0 0 0 0 0 0 0 0 
##$TUNHIN= 0
##$TUNHOUT= 0
##$TUNXOUT= 0
##$USERA1= <user>
##$USERA2= <user>
##$USERA3= <user>
##$USERA4= <user>
##$USERA5= <user>
##$V9= 5
##$VALIST= <valist>
##$VCLIST= <CCCCCCCCCCCCCCC>
##$VD= 0
##$VDLIST= <DDDDDDDDDDDDDDD>
##$VPLIST= <PPPPPPPPPPPPPPP>
##$VTLIST= <TTTTTTTTTTTTTTT>
##$WBST= 1024
##$WBSW= 4
##$XGAIN= (0..3)
0 0 0 0 
##$XL= 0
##$YL= 0
##$YMAX_a= 478133
##$YMIN_a= -484837
##$ZGOPTNS= <>
##$ZL1= 120
##$ZL2= 120
##$ZL3= 120
##$ZL4= 120
##$ABSF1= 16.522
##$ABSF2= -4.171173
##$ABSG= 5
##$ABSL= 3
##$ALPHA= 0
##$AQORDER= 0
##$ASSFAC= 0
##$ASSFACI= 0
##$ASSFACX= 0
##$ASSWID= 0
##$AUNMP= <proc_1d>
##$AZFE= 0.1
##$AZFW= 0.1
##$BCFW= 0
##$BC_mod= 0
##$BYTORDP= 0
##$COROFFS= 0
##$CY= 12.5
##$DATMOD= 1
##$DC= 0
##$DFILT= <>
##$DTYPP= 0
##$F1P= 14.0000005364418
##$F2P= -0.99999901652339
##$FCOR= 0.5
##$FTSIZE= 32768
##$FT_mod= 6
##$GAMMA= 0
##$GB= 0
##$INTBC= 1
##$INTSCL= 1
##$ISEN= 128
##$LB= 0.3
##$LEV0= 0
##$LPBIN= 0
##$MAXI= 10000
##$MC2= 0
##$MEAN= 0
##$ME_mod= 0
##$MI= 0
##$NCOEF= 0
##$NC_proc= -2
##$NLEV= 6
##$NOISF1= 0
##$NOISF2= 0
##$NSP= 0
##$NTH_PI= 0
##$NZP= 0
##$OFFSET= 16.522
##$PC= 1
##$PHC0= -60.0523
##$PHC1= 8.706694
##$PH_mod= 1
##$PKNL= yes
##$PPARMOD= 0
##$PSCAL= 4
##$PSIGN= 0
##$REVERSE= no
##$SF= 250.13
##$SI= 32768
##$SIGF1= 0
##$SIGF2= 0
##$SINO= 400
##$SIOLD= 32768
##$SREGLST= <1H.CDCl3>
##$SSB= 0
##$STSI= 32768
##$STSR= 0
##$SW_p= 5175.98343685301
##$SYMM= 0
##$S_DEV= 0
##$TDeff= 65536
##$TDoff= 0
##$TI= <Analysis number 999999
Compound Code 99
Book Reference 9
Project Code 9>
##$TILT= no
##$TM1= 0
##$TM2= 0
##$TOPLEV= 0
##$USERP1= <user>
##$USERP2= <user>
##$USERP3= <user>
##$USERP4= <user>
##$USERP5= <user>
##$WDW= 1
##$XDIM= 32768
##$YMAX_p= 475644638
##$YMIN_p= -86544
$$ End of Bruker specific parameters
$$ ---------------------------------
##NTUPLES= NMR SPECTRUM
##VAR_NAME=  FREQUENCY,     SPECTRUM/REAL,   SPECTRUM/IMAG
##SYMBOL=    X,             R,               I
##VAR_TYPE=  INDEPENDENT,   DEPENDENT,       DEPENDENT
##VAR_FORM=  AFFN,          ASDF,            ASDF
##VAR_DIM=   32768,         32768,           32768
##UNITS=     HZ,            ARBITRARY UNITS, ARBITRARY UNITS
##FACTOR=    0.157963299565203, 1,           1
##FIRST=     4132.6476996994, 0,             0
##LAST=      -1043.33573715361, 0,           0
##MIN=       -1043.33573715361, -86544,      0
##MAX=       4132.6476996994, 475644638,     0
$$ Real data points
##PAGE= N=1
##DATA TABLE= (X++(R..R)), XYDATA
$$ [...]
17219E963n522n505p075r321K316j3763j069O713J2912J5443Q257l875o514j2128
17205a3168Q974j208m777P603L162j161m521K7j3801m279l339L263N809Q960J133
17190g323j064P313L120q634r458k375k938K315J8777j511k362l096m663o640
17176a8539Q564K120N281P877j788K030l152J192n742J156r491j4530k207J721
17162b5508N074k383J6993n026m413R052K4457Q082j270o140J963K3659J6222
17149F0762J2784J3834J888M714j713j3014p650q624j8622j6688r057J989k22
17136B0381N019r349j3505j1620j84r75r239l358P762m090p013P090J3223N055
17122h03N679Q015j4763p832N506M472L711k945J040n587J97N821N14R902l213
$$ plain form
17219 5963 441 -5064 -12139 -21460 -19144 -32907 -33976 -27263 -14351 1092 9349 5474 -1040 -13168
17205 -13168 -4194 -5402 -10179 -2576 586 -575 -5096 -5069 -18870 -23149 -26488 -23225 -17416 -8456 -7323
17190 -7323 -8387 -1074 2046 -6588 -16046 -18421 -21359 -19044 -267 -1778 -4140 -7236 -11899 -18539
17176 -18539 -9975 -7855 -2574 5303 3515 5545 2393 3585 -2157 -1001 -10492 -25022 -27229 -25508
17162 -25508 -20434 -22817 -5824 -10850 -15263 -6211 18246 26328 25058 18918 20881 44540 60762
17149 60762 73546 87380 89268 93982 92269 79255 71605 62981 44359 27671 18614 20603 20381
17136 20381 25400 16051 2546 -9074 -9258 -10233 -19472 -22830 -15068 -19158 -26171 -19081 -5858 -803
17122 -803 4876 12891 -1872 -9704 -4198 274 3985 1040 2080 -3507 -3310 2511 3025 12927 9714
17107I714j1893l598K713J4374m761J05j775r790J522q15P263R279k886j776J2166
17092A9842J1838K1051K1020J5445Q161k408m476k212q265j7314j9909k6005p385
17079I383L200R064j8167p591N155P774r946j001l899L958J6304p88n033l143
17065E270J688k981J644P127N852n950j717j0353j0279n544P609J0191R382n984
17051E955n450j8832k787J9831j0923p581O086N998n449m578n330O180Q481K659
17037e740L523M581m12M959o24k538l367k775O891o477p742J0247Q012q792j915
17022b169K183q458n748P193l353m691Q012J0516K80j111o007K015j0499j4769
17008b6606k17N620P904J0738N588o107Q65Q94J867J1914K141r676j70j314k204
$$ plain form
17107 9714 -2179 -5777 -3064 11310 6549 6654 4879 -4911 -3389 -4204 3059 12338 9452 7676 19842
17092 19842 31680 52731 73751 89196 97357 94949 90473 88261 79996 62682 42773 16768 9383
17079 9383 12583 21647 3480 -4111 1044 8818 -1128 -2129 -6028 -2070 14234 13446 8413 5270
17065 5270 6958 3977 5621 12748 18600 12650 10933 580 -9699 -15243 -7634 2557 11939 5955
17051 5955 505 -18327 -21114 -1283 -12206 -19787 -13701 -7703 -13152 -17730 -23060 -16880 -8399 -5740
17037 -5740 -2217 2364 1952 6911 6287 3749 382 -2393 4498 -1979 -9721 526 8538 -254 -2169
17022 -2169 14 -8444 -14192 -6999 -10352 -15043 -7031 3485 3765 2654 -3353 -1338 -11837 -26606
17008 -26606 -26823 -21203 -13299 -2561 3027 -3080 -2215 -1321 546 12460 14601 4925 4755 3441 1237
16993A237n975l557L389N427N516J3934l48K785R053m81p10m618n468J87o518
16978A3853j2746r337l609P5O890N128l843q925n660N798Q362O96q470k25P412
16963d601M109L544j869Q863p964j1351j1551K841N961N726Q569r146o502R92
16949a2379J0064j595L156k232q712Q900q331j1597L029J2845R367R188o467o588
16935a352M195l120o967M390M014J856N313O424m173k944P184o65o243q892q745
16920i725N454J213j1059Q708R821M737P313L385l500j2382o344p156j4682K862
16906b1355Q008Q034J5942J578l560r584o480J3116L994j1848J495j74r069j970
16892a1873m066L844M68J648J1388o788M305J1696J686r843q286J501l980R942
$$ plain form
16993 1237 -4738 -8295 -4906 521 6037 19971 19623 22408 31461 30980 30270 25652 20184 20371 13853
16978 13853 1107 -8230 -11839 -11764 -4874 254 -3589 -12514 -18174 -12376 -4014 -3318 -11788 -12013 -4601
16963 -4601 -492 3052 1183 10046 2082 -9269 -20820 -17979 -12018 -6292 2277 -6869 -13371 -12379
16949 -12379 -2315 -3910 -754 -2986 -11698 -2798 -11129 -22726 -19697 -6852 2515 11703 5236 -1352
16935 -1352 2843 -277 -7244 -2854 1160 3016 8329 14753 10580 7636 14820 14155 7912 -980 -9725
16920 -9725 -4271 -3058 -14117 -5409 4412 9149 16462 19847 16347 3965 -2379 -9535 -24217 -21355
16906 -21355 -13347 -5313 10629 12207 8647 -937 -7417 5699 9693 -2155 -660 -834 -9903 -11873
16892 -11873 -15939 -12095 -11627 -9979 1409 -5379 -1074 10622 12308 2465 -5821 -4320 -8300 1642
16878A642k740P363M435p341o051Q76q967P57n081K049n904j017K425J1189o006
16863a2371o232J787q8N505M93p496j30N284J7303l112P89P448k804k728N58k867
16847A339q394n879k705P936J0252M498j1498J0329M272J23j020r20j1047r006
16833a1720J14P682M166K539q868k685O458O837O844l197j2170O757N569q823
16819d97j523p685L62j2084J240O953l726l8N74Q094m302j7582R288J2423N182
16804c321n607o093J326l64q441k663k502J2669R891n472o568R98L233J0250o411
16789i075j1166j3078L464P150R519L118k747m793n783j1183r23K063o335O474
16775c3295P621J8339J306o865j8247J917l523L236J0438J3413N491m695J005
$$ plain form
16878 1642 -1098 6265 10700 3359 -2692 -1816 -10783 -10026 -15107 -13058 -18962 -19979 -17554 -6365 -12371
16863 -12371 -18603 -16816 -16904 -11399 -10906 -18402 -18532 -13248 4055 943 1732 9180 6376 3648 4206 1339
16847 1339 -7055 -12934 -15639 -7703 2549 7047 -4451 5878 10150 10273 9253 8333 -2714 -11720
16833 -11720 -11606 -3924 242 2781 -6087 -8772 -2314 4523 11367 8170 -4000 2757 8326 -497
16819 -497 -2020 -9705 -9343 -21427 -20187 -13234 -16960 -16998 -16424 -8330 -12632 -30214 -20926 -8503 -3321
16804 -3321 -8928 -15021 -13695 -14059 -22500 -25163 -27665 -14996 -5105 -10577 -17145 -16147 -12914 -2664 -9075
16789 -9075 -20241 -33319 -29855 -22705 -13186 -10068 -12815 -17608 -23391 -34574 -35497 -33434 -39769 -33295
16775 -33295 -25674 -7335 -6029 -12894 -31141 -29224 -32747 -29511 -19073 -5660 -169 -4864 -3859
16762c859j404j1701j2475K240O047J5139J574Q330K649j0705j2844J656K238
16749a3115P1J901N336k936O7k151j3305l660R976J1267J567o595m925J646n47
16734a5403K779P944J714J781L757p052k867N462m332j4908P943J1573n033j1
16720f653O538j452k983m684N396m301k1098q637M457q413m891R786P914J42j714
16705c0593Q239J071r608O722j587J2504n99N364J2726O272n528j4003m241L328
16691i933l156n16P022M051j2663r464R23R428M495O378L454P185L259q925j3279
16676a1741J664L504l357k123m07l764o407K389M060j915K728R714J0426J1268
16662A6039k568j0576m863j1359M578J688K986k476K706j2973j1609p213N134
$$ plain form
16762 -3859 -5263 -16964 -29439 -27199 -21152 -6013 -4439 3891 6540 -4165 -17009 -15353 -13115
16749 -13115 -13044 -11143 -5807 -8743 -8676 -10827 -24132 -27792 -17816 -6549 -4982 -11577 -16502 -14856 -15403
16734 -15403 -12624 -4680 -2966 -1185 2572 -4480 -7347 -1885 -6217 -21125 -13182 -1609 -6642 -6653
16720 -6653 -115 -1567 -4550 -9234 -3838 -8139 -29237 -37874 -33417 -41830 -46721 -36935 -29021 -28879 -30593
16705 -30593 -22354 -21283 -30891 -24169 -25756 -13252 -13851 -8487 4239 10511 4983 -9020 -13261 -9933
16691 -9933 -13089 -13605 -6583 -2532 -15195 -24659 -23736 -14308 -9813 -3435 19 7204 10463 1538 -11741
16676 -11741 -10077 -6573 -9930 -12053 -12460 -16224 -22631 -20242 -16182 -18097 -15369 -5655 4771 16039
16662 16039 13471 2895 -1968 -13327 -8749 -7061 -4075 -6551 -3845 -16818 -28427 -35640 -30506
16649c0506K5965O030m672r854j9769j1806L908J0801J1017k878k802M665K008
16636a7893j949M078K701j2661p245R225N534O583K154M867J662j650j597o984
16622a3175Q947J2447j033j3730j7949k360J4473R243M258L212k653o973p681
16609a2974K313K371L585n571n873q785L942J2693N48r958L999N150j0410k101
16595b1071m137m270J2594J4785J977q43NJ820L586M129n78r470j576p380j3264
16580b3693O285l699K0963Q464j0941j8142m450n91R547L792Q52J382r682j3608
16566c3521N251K597l794P832K071J892l390j242L880R058R99L82m544o910j71
16551a9610J1165q303P523K697j0348m669p181N283J6841J2328k185l722n033
$$ plain form
16649 -30506 -4541 1489 -3183 -13037 -32806 -44612 -40704 -29903 -18886 -21764 -24566 -19901 -17893
16636 -17893 -19842 -15764 -13063 -25724 -32969 -23744 -18210 -11627 -9473 -4606 -2944 -4594 -6191 -13175
16622 -13175 -4228 8219 7186 -6544 -24493 -26853 -12380 -3137 1121 4333 1680 -5293 -12974
16609 -12974 -10661 -8290 -4705 -10276 -16149 -24934 -20992 -8299 -7751 -17709 -13710 -8560 -18970 -21071
16595 -21071 -25208 -29478 -16884 -2099 -122 -965 -960 860 4446 8575 7997 -1473 -3049 -10429 -23693
16580 -23693 -17408 -21107 -144 8320 -2621 -20763 -25213 -25804 -16257 -12465 -11613 -10231 -19913 -33521
16566 -33521 -28270 -25673 -29467 -21635 -19564 -17672 -21062 -22304 -18424 -9366 -8367 -7985 -12529 -19439 -19610
16551 -19610 -8445 -16748 -9225 -6528 -16876 -21545 -28726 -23443 -6602 5726 3541 -181 -5214
16538e214P038J616r729p542j5207k373J0960R902J796M482J130k663K608k197
16524e393j013O57q149j6577j0530N431J0582l017R21L4N432J550j919p11P251
16509a5451O411O087K412j3051l837K058R244p794o359M835L796o057j0038P68
16495b6976J7291K0441k907q987q824J520O754o241n390o5l635j318M35l744R97
16480b0649M497J6918K692o546o145J347m944o59k747q516k209N475J0130J866
16466i490j422J3644k176j5838m271J226J4310J1080o377m694j4746r0L965L263
16452a1616r523K758J5330Q303j3494Q73J508M723L659j830l06k363J183j255
16438b050J72k540j454P001J6906r941j1490n787J2397J732j7752j5836J5319
$$ plain form
16538 -5214 1824 3440 -6289 -13831 -29038 -31411 -20451 -10549 -8753 -4271 -3141 -5804 -3196 -5393
16524 -5393 -6406 -5749 -13898 -30475 -41005 -35574 -24992 -28009 -27088 -27054 -21622 -20072 -21991 -22702 -15451
16509 -15451 -9040 -2953 -541 -13592 -17429 -15371 -6127 -13921 -20280 -15445 -11649 -17706 -27744 -26976
16495 -26976 -9685 10756 7849 -1138 -9962 -8442 -1688 -7929 -13319 -13384 -17019 -18337 -17902 -21646 -20649
16480 -20649 -16152 766 3458 -3088 -9233 -7886 -12830 -13489 -16236 -24752 -26961 -21486 -11356 -9490
16466 -9490 -10912 2732 556 -15282 -19553 -18327 -4017 7063 686 -4008 -18754 -18844 -14879 -11616
16452 -11616 -21139 -18381 -3051 5252 -8242 -7369 -5861 -1138 2521 691 385 -1978 -795 -2050
16438 -2050 -1878 -4418 -5872 1129 18035 8094 -3396 -9183 3214 4946 -12806 -28642 -13323
16425a3323Q387N520K946m899N645L090n412j7884m021J1764N127n738M149m315
16411h964n387o991o492M69P84q124N272K799p405L967P520L143L156l593K837
16396a7009J1290J5092J1644m285k1893p355J508k403r527j5479q005J1356O584
16383b8482N550M737P19o603j54R755k17l509Q857J147J321p94j860N822m765
16368h476j2240K543M164j381O460N511L550r030q108O885o463L829M549K188
16354f019k048l89L623N859p200j0299l279n931l953N91N26K194P426j040k058
16339b1997j0570j834K4672J5188o749Q751L123k131j0843J2833l730l814J175
16326D074r127o788J362P068j1283j1080p671M376J1403O002o19M947k104j289
$$ plain form
16425 -13323 -4936 584 3530 -1369 4276 7366 1954 -15930 -19951 -8187 -3060 -8798 -4649 -8964
16411 -8964 -14351 -21342 -27834 -27365 -26581 -34705 -29433 -26634 -34039 -30072 -22552 -19409 -16253 -19846 -17009
16396 -17009 -5719 9373 21017 16732 -5161 -12516 -11008 -13411 -22938 -38417 -46422 -35066 -28482
16383 -28482 -22932 -18195 -17476 -24079 -24233 -14478 -14695 -18204 -9347 -8200 -6879 -7673 -9533 -3711 -8476
16368 -8476 -20716 -18173 -14009 -15390 -8930 -3419 131 -8899 -17007 -10122 -16585 -12756 -8207 -6019
16354 -6019 -8067 -8456 -4833 1026 -6174 -16473 -19752 -25683 -29636 -29045 -28519 -26325 -18899 -19939 -21997
16339 -21997 -32567 -34401 -9729 5459 -1290 7461 10584 8453 -2390 10443 6713 2899 4074
16326 4074 -5053 -11841 -10479 -3411 -14694 -25774 -33445 -29069 -17666 -11664 -12283 -7336 -9440 -10729
16312a0729j4619l874l913N78J8475J6622k906K357o784j5838Q48j13o854l335
16298c0085Q281J871M529o300l188k281r98L030k384n517M756J1909J8539P789
16284I951j579o353R05j5200m294o071L096J0814J605m336N337O216l424j1606
16270a4939l53k207m548L84k122N657J030o511R740j704J0080m273O427L719R505
16255I885l712j5593M500Q954o662q243l045j284n019J4874P768p17k0980o852
16241b6126j037M717J0436o234o979N094P153Q317n21n842j799J951j3870n042
16227b9782j215K65j520J1531K679l303J3459J6382N820j630p565l72O426q910
16213B265k2087j4429p533Q379L41N253k166M176l924J0589J433Q438R91L789
$$ plain form
16312 -10729 -25348 -29222 -33135 -32557 -14082 2540 -366 1991 -4793 -20631 -19783 -19896 -26750 -30085
16298 -30085 -21804 -19933 -15404 -21704 -24892 -27173 -28171 -25141 -27525 -33042 -28286 -16377 2162 9951
16284 9951 8372 2019 2924 -12276 -16570 -22641 -19545 -8731 -7126 -11462 -6125 91 -3333 -14939
16270 -14939 -15292 -17499 -22047 -21663 -23785 -18128 -17098 -23609 -13869 -15573 -5493 -9766 -3339 380 9885
16255 9885 6173 -9420 -4920 4034 -2628 -10871 -13916 -15200 -20219 -5345 2423 1706 -19274 -26126
16241 -26126 -27163 -22446 -12010 -18244 -25223 -20129 -12976 -4659 -5180 -11022 -12821 -10870 -24740 -29782
16227 -29782 -30997 -30732 -32252 -20721 -18042 -21345 -7886 8496 14316 12686 5121 4749 11175 2265
16213 2265 -19822 -34251 -41784 -33405 -33064 -27811 -29977 -25801 -29725 -19136 -17703 -9265 -8274 -4485
16199d485o557j1166j1351j531J9856J2615P892J2204j4922m297q08k1825j1097
16186c5472O175J0391j571Q0O793L653Q864J61j5762j2684Q519N866j723J1970
16172d740M224n252j0103p775o982j30J0123K031R752O987l611J238L558N523
16158D843n830j0983O383Q058k857J946J0891p802k0612r072J809L2o97K916L814
16143a7161K154P09J487n272n73N274m057m642L83M908L619O066K27q009r912
16128b4799q74Q474J1080K60k780M832M151q254l85k716p670j3526q465J3647
16114b7025O47k169O825O839p79m886j019j1417O975J0542J5126M617k1887o149
16100b3760J014M887K107r953o242J2111l55k770J721M031J119M891p364M791
$$ plain form
16199 -4485 -11042 -22208 -33559 -35090 -15234 -2619 5273 17477 2555 -1742 -2550 -24375 -35472
16186 -35472 -29297 -18906 -20477 -20397 -13604 -9951 -1087 -926 -16688 -29372 -20853 -14987 -16710 -4740
16172 -4740 -516 -5768 -15871 -23646 -30628 -30758 -20635 -18604 -8852 -1865 -5476 -4238 -680 4843
16158 4843 -987 -11970 -5587 2471 -386 1560 12451 4649 -15963 -25035 -23226 -23194 -23891 -20975 -17161
16143 -17161 -15007 -14298 -12811 -18083 -18656 -13382 -17439 -22081 -21698 -16790 -13171 -7105 -6878 -14887 -24799
16128 -24799 -25673 -17199 -6119 -5859 -8639 -3807 344 -7910 -8295 -11011 -18681 -32207 -40672 -27025
16114 -27025 -26378 -28547 -21722 -14883 -15662 -20548 -21567 -32984 -26009 -15467 -341 4276 -17611 -23760
16100 -23760 -22746 -17859 -15752 -25705 -31947 -19836 -20191 -22961 -21240 -17209 -16090 -11199 -18563 -13772
16086a3772J1527Q23o84J730k0291q464n33J1209M794O216l148j2736J4684R608
16072I63j1681M535j254P838j661m820j2332r448Q986J4149k527o8J1453m790
16058f57j6268n022P684l885L885J1195l155j330j538N690j1641o579J173L136
16044a7312q401k43J5992O732L016k994K510n098j1352q373o22P15J0130R64N944
16029h392o331r338p21N565L806M142n222n861J211P699O511P688R93p118m097
16014i465J2069J3813M318r535j1027m340k057o242J093J0166Q36o748l934N357
16000e696J4J375O669M461l214j1869p438P781J032o551n851J216L10O146N916
15985e699J548k358R65P747J3040l643k3913j3138L572J7858J0868L127M536l48
$$ plain form
16086 -13772 -2245 -1422 -2106 -376 -20667 -29131 -29664 -18455 -13661 -7445 -10593 -23329 -8645 963
16072 963 -10718 -6183 -7437 401 -1260 -6080 -18412 -27860 -18874 -4725 -7252 -7320 4133 -657
16058 -657 -16925 -21947 -14263 -18148 -14263 -3068 -6223 -7553 -9091 -3401 -15042 -21621 -20448 -17312
16044 -17312 -25713 -25956 -9964 -3232 -216 -3210 -700 -5798 -17150 -25523 -26145 -25430 -15300 -14336 -8392
16029 -8392 -14723 -24061 -24782 -19217 -15411 -11269 -16491 -22352 -21141 -13442 -6931 757 1750 -5368 -9465
16014 -9465 2604 16417 20735 11200 173 -4167 -6224 -12466 -11373 -1207 -371 -7119 -11053 -5696
16000 -5696 -5682 -4307 2362 6823 3609 -8260 -15698 -7917 -6885 -13436 -19287 -18071 -17761 -11615 -5699
15985 -5699 -4151 -6509 -5544 2203 15243 11600 -12313 -25451 -21879 -4021 6847 9974 14510 14162
15971A4162j7803j2175O907n422p62n095Q914O759o840K712J706j3578k167j065
15957b3747j293k673J799J669l322N628l483l909j892N190J3196j384P629j821
15943h413k831J2652q20l586N6k325o902N341j633j3433m601Q52j961m893O353
15928b6144J291J0502P573L815L857M085p803q123L690O133M302j0867p203m857
15914a9749K005J6958J6620j408j2849o513m948j1024k0186n717J4746r96m42
15901c3503O768J0844J0036k813p356K663r74k50j1589j0169j617J2836r56l066
15887b9146q77N292M151J285K078n002j3234J1464P723l296j434K114J0252L921
15873d709n037m556P973r195j437J0469L912M787J333j0690q187p598M267j485
$$ plain form
15971 14162 -3641 -15816 -8909 -14331 -15093 -20188 -11274 -4515 -11355 -8643 -6937 -20515 -22682 -23747
15957 -23747 -25040 -27713 -25914 -24245 -27567 -21939 -25422 -29331 -31223 -26033 -12837 -14221 -6592 -8413
15943 -8413 -11244 1408 588 -2998 -2942 -5267 -12169 -6828 -8461 -21894 -26495 -25643 -27604 -32497 -26144
15928 -26144 -24853 -14351 -6778 -2963 894 4979 -2824 -10947 -7257 -1124 3178 -7689 -14892 -19749
15914 -19749 -17744 -786 15834 14426 1577 -4936 -9884 -20908 -41094 -46811 -32065 -33061 -33503
15901 -33503 -26735 -15891 -5855 -8668 -16024 -13361 -14335 -14585 -26174 -36343 -37960 -25124 -26080 -29146
15887 -29146 -30023 -24731 -20580 -19295 -17217 -22219 -35453 -23989 -16266 -19562 -20996 -18882 -8630 -4709
15873 -4709 -9746 -14302 -6329 -15524 -16961 -6492 -2580 2207 3540 -7150 -15337 -22935 -18668 -20153
15859b0153q386o682M937J40P692O938L139m09l849p199P493k794R01k856M982
15844a6106Q701J2009J4263m683q887J676J7132j329j1276j7814j1061k113L093
15831a6395J5746N677N717j1912j185l373J064J1668J0150j5664N03j0231p224
15818a5459P981J1796M111O075m22p150q061k197J2444l962j0939L729M706q526
15804e874K464N552j009J299j503J1596n93l965j380o305q459m10L590j5421l342
15789b3760M438j607j1213J996J4509J8747m424j0916q98O365l51j7809r166M871
15775b9218J2582J3749J3244m325p39k916l121k68j2133m503l322J3286r08j493
15761a0085P958k954J535O800P92o522m608k891P30J086J4404M155p466j5215
$$ plain form
15859 -20153 -28539 -35221 -30284 -30144 -22452 -15514 -12375 -12784 -16633 -23832 -16339 -19133 -18232 -21088 -16106
15844 -16106 -7405 4604 18867 14184 5297 6973 24105 22776 11500 -6314 -17375 -19488 -16395
15831 -16395 -649 5028 10745 -1167 -2352 -5725 -4661 7007 17157 1493 1996 -8235 -15459
15818 -15459 -7478 4318 8429 14504 14082 6932 -1129 -3326 9118 5156 -5783 -2054 2652 -5874
15804 -5874 -3410 2142 1133 2432 929 12525 11932 7967 6587 282 -8177 -8587 -4997 -20418 -23760
15789 -23760 -19322 -20929 -32142 -30146 -15637 3110 -1314 -12230 -13128 -6763 -7114 -24923 -34089 -29218
15775 -29218 -16636 -2887 10357 6032 5293 2377 -744 -1012 -13145 -17648 -20970 -7684 -8592 -10085
15761 -10085 -2127 -5081 -3546 3254 4046 -2476 -7084 -9975 -9245 -8159 6245 10400 2934 -12281
15747a2281j1252p34k744O137N617L997J355l95P239l344j3864p103m983N23J1576
15732b0256O480L585J6382p653j4254o747n37K254Q582O701p789n84j890Q833
15718f893k41p756k050P780j79P506J028o184k911p848L496M356l074l521R539
15703f952M51n637j866M112J829k779J974O808Q45j0097l96N393O076m241n622
15688a0102k080L402K519J968r668j1184O250M92J2118Q97J58O827m006L498J728
15673B817J2756o143j7690r625n621K145J076M797J1663K393o570p743L309l816
15659a6252M249m673N928N187l775o21j8517r219N615P374O75K294J144R760j5885
15644b6716o395Q473j3263M001M51P128N891m281K379M792J4134p341L016M170
$$ plain form
15747 -12281 -23533 -24267 -27011 -20874 -15257 -11260 -9905 -10300 -3061 -6405 -20269 -27372 -32355 -31832 -20256
15732 -20256 -13776 -10191 6191 -1462 -15716 -22463 -23000 -20746 -12164 -5463 -13252 -13836 -15726 -6893
15718 -6893 -7134 -14890 -16940 -9160 -9339 -1833 -805 -6989 -9900 -17748 -14252 -9896 -12970 -16491 -6952
15703 -6952 -6501 -12138 -14004 -9892 -8063 -10842 -8868 -2060 -1215 -11312 -11708 -6315 -239 -4480 -10102
15688 -10102 -12182 -8780 -6261 -4293 -13961 -25145 -18895 -18403 -6285 -5388 -5230 1597 -2409 1089 2817
15673 2817 15573 9430 -8260 -17885 -23506 -21361 -20285 -15488 -3825 -1432 -8002 -15745 -12436 -16252
15659 -16252 -12003 -16676 -10748 -5561 -9336 -9957 -28474 -37693 -32078 -24704 -24029 -21735 -20591 -10831 -26716
15644 -26716 -33111 -24638 -37901 -33900 -33449 -26321 -20430 -24711 -22332 -17540 -3406 -10747 -7731 -3561
15630c561O732r262j1377K713Q359q08j0693m248K388M477O57o999m522m966J4894
15615a6216J3086R430q359o584l753l075J0191R897M914K702L569o005r704j7066
15601a6973K4N232j780m888k684K375J593P244N227Q98j414j152m419J2383Q610
15586A0276R579k0508k0070L075J7459n667L404J0898Q929N978r336o353M835
15573A2499l346l725n378j1421l861J1873o83m098J039J7233j3190n879M94r940
15559a8383K012J1889q051K235Q724M801J060o042o217N42K463l39q236j953J679
15544a3816R407m34M906N334p391r076R07n902J5462k240j8779j1117m136R567
15530b7308J2994Q370k377M874P915j3588j6806N966j101r352P013P091L317j30
$$ plain form
15630 -3561 3171 -6091 -17468 -14755 -6396 -7204 -17897 -22145 -19757 -15280 -14623 -21622 -26144 -31110 -16216
15615 -16216 -3130 6300 -2059 -8643 -12396 -15471 -5280 4617 9531 12233 15802 9797 93 -16973
15601 -16973 -16949 -11717 -13497 -18385 -21069 -18694 -17101 -9857 -4630 -3732 -5146 -6298 -10717 1666 10276
15586 10276 19855 -653 -20723 -17648 -189 -5856 -2452 8446 17375 23353 14017 7664 12499
15573 12499 9153 5428 50 -11371 -15232 -3359 -4042 -8140 -7101 10132 -3058 -8937 -8443 -18383
15559 -18383 -16371 -4482 -12533 -10298 -1574 3227 4287 -1755 -7972 -7430 -4967 -5306 -13542 -15495 -13816
15544 -13816 -4409 -4843 63 5397 -1994 -11070 -10163 -16065 -603 -2843 -21622 -32739 -36875 -27308
15530 -27308 -14314 -5944 -8321 -3447 4468 -9120 -25926 -19960 -21061 -30413 -23400 -16309 -12992 -13122
15516a3122p681J859P888N588m611l181j872m142N271j986k945N72L55P207J6266
15501E466J3788o380o257p311j5332n149L639m77j122m655O05J9092J0590j0318
15487c821j1326j60n35j872K153n317k600K679J9349L653k05j3421j734O208r578
15472a6527j178R386m527n263O599j844m627j726j4154J308n421j861P174L746
15458b8915L555J1079L08J502Q762N986m652j9580p227J0817O279K387J688j365
15444i376r163k488L474k345M987L172J2886n265k161J209J978j4469J1668J5961
15430A0068o938j4121p235O878j181K443J2390Q480j9550o440M232R723J7261
15417A6010j427j5703k805Q936P684J965j0064j0210q835p853l884M451K0455
$$ plain form
15516 -13122 -20803 -18944 -11056 -5468 -10079 -13260 -15132 -19274 -14003 -15989 -18934 -18362 -18007 -10800 5466
15501 5466 19254 12874 6617 -694 -16026 -21175 -17536 -18013 -19135 -23790 -23185 -4093 6497 -3821
15487 -3821 -15147 -15307 -15842 -17714 -15561 -20878 -23478 -20799 -1450 2203 1998 -11423 -13157 -6949 -16527
15472 -16527 -17705 -8319 -12846 -18109 -11510 -13354 -17981 -19707 -33861 -32553 -37974 -39835 -32661 -28915
15458 -28915 -25360 -14281 -13973 -12471 -3709 2277 -2375 -21955 -29182 -18365 -12086 -9699 -8011 -9376
15444 -9376 -18539 -21027 -17553 -19898 -14911 -11739 1147 -4118 -6279 -5070 -3092 -17561 -5893 10068
15430 10068 3130 -10991 -18226 -11348 -12529 -10086 2304 10784 -8766 -15206 -10974 -1251 16010
15417 16010 14583 -1120 -3925 5011 12695 14660 4596 -5614 -14449 -22302 -26186 -21735 -1280
15404a280K986n224J1366L090n245m205j70K683o521q986n341O359o060R370L241
15389c937j9076P67j461l246M26l27R074J0955P65j1702m943J2453O091K027k633
15374d767j336N633n434L323m259j41J0997K298m52o629M152Q910J4649l994k0164
15359B786j4585L849K169k847N905l705o643k785O18O761n004l016m713p309M330
15344b4189M02L7o075K859N410L846J0210l404l917J985L719m979n202K629n332
15329b2001O85J5486N918j0833p010k164k153M2p024R881J4296o275k993L097
15315a1048J779m934j1635k038J3791P720j1424L023Q019n193n611N534N821K972
15301c224j631Q558m953m759K024o458m132l780M229N53K190Q192p697j369K828
$$ plain form
15404 -1280 1706 -3518 7848 10938 5693 1488 1318 4001 -2520 -11506 -16847 -10488 -16548 -7178 -3937
15389 -3937 -23013 -22246 -23707 -26953 -26527 -26854 -17780 -6825 -6060 -17762 -22705 -10252 -4161 -2134 -4767
15374 -4767 -6103 -470 -5904 -2581 -6840 -6981 4016 6314 5862 -767 3385 12295 26944 22950 2786
15359 2786 -11799 -7950 -5781 -8628 -2723 -6428 -13071 -15856 -15238 -8477 -13481 -16497 -21210 -28519 -24189
15344 -24189 -23787 -23750 -29825 -26966 -21556 -17710 -7500 -10904 -14821 -12836 -9117 -14096 -19298 -16669 -22001
15329 -22001 -21316 -5830 88 -10745 -17755 -19919 -22072 -22030 -29054 -19173 -4877 -11152 -14145 -11048
15315 -11048 -9269 -14203 -25838 -27876 -14085 -6365 -17789 -14766 -6747 -11940 -17551 -12017 -6196 -3224
15301 -3224 -4855 3703 -1250 -6009 -3985 -10443 -14575 -18355 -14126 -13573 -11383 -3191 -10888 -12257 -9429
15286i429j718M690J4177N942P673J786n437K55p675n787j453j0005j3740r36
15272b1657M802r681l049n203q375K545J4606K0784R875l621j1793j4265K570
15259b2462J7332O556n323j1925l365k642j0514J0633R909q534j67P688n119l277
15245b1210N898M014q279k873M740N544P762K464K6j7j888k946j786l039q380
15230a9970K05P669o608j6106J217J4868J7740j207l933n221q752M756M224l321
15216a4439l243j903L84l609l331p559J0076K056j1750K448R886l900o340N809
15202b5415N994J2147j424j4058Q484J1951L83p571N55j8666k221R325l165k576
15188b6257J0044O359j0351Q055J1650Q70n433O789O699R243L963p31m525l145
$$ plain form
15286 -9429 -11147 -6457 7720 13662 21335 23121 17684 17939 10264 4477 3024 -6981 -20721 -21657
15272 -21657 -16855 -26536 -29585 -34788 -43163 -40618 -26012 -5228 4647 1026 -10767 -25032 -22462
15259 -22462 -5130 1426 -3897 -15822 -19187 -21829 -32343 -21710 -11801 -20335 -20502 -12814 -17933 -21210
15245 -21210 -15312 -11298 -19577 -22450 -17710 -12166 -4404 -1940 -1914 -1931 -3819 -6765 -8551 -11590 -19970
15230 -19970 -19765 -12096 -18704 -34810 -33593 -18725 -985 -2192 -6125 -11346 -20098 -15342 -11118 -14439
15216 -14439 -17682 -19585 -19201 -22810 -26141 -33700 -23624 -21568 -33318 -30870 -20984 -24884 -31224 -25415
15202 -25415 -19421 -7274 -8698 -22756 -14272 -2321 -1938 -9509 -8954 -27620 -29841 -20516 -23681 -26257
15188 -26257 -16213 -9854 -20205 -12150 -500 370 -5063 1726 8425 17668 21631 20900 16375 13230
15174A3230n761P129J3532Q76o541l913q849P831J0141j0660Q752m239j9552q324
15160f348l788o632O953M068J828N195j509o565N310O501M609j849k569o649K697
15145A252L197K561J0891j271j0248j623j252p969L205P11n942m456N264J029
15131d651M512O992K029j4755o486J96J1960l570p302J481N650l546N458N008
15117B976L960k497k590o52j2983j0062K282J0441k083p404N388K581l130n596
15103a9369j0791M620Q189J3226P695o862o244j1003n544J067N109J3369K3134
15090A6596M45P8P46j1280r142p212q942J0534L496m302r18j988J4916l381j646
15075b000R03m12k493M115P46k583p80R680j618r51m387j2563p557K656L508p94
$$ plain form
15174 13230 7469 14598 28130 29006 22465 18552 9703 17534 27675 17015 25767 21528 1976 -6348
15160 -6348 -10136 -16768 -9815 -5747 -3919 1276 -233 -6798 -1488 5013 9622 7773 5204 -1445 1252
15145 1252 4449 7010 17901 16630 6382 4759 3507 -4462 -1257 -546 -6488 -10944 -5680 -4651
15131 -4651 -139 6853 8882 -5873 -12359 -12163 -203 -3773 -11075 -9594 -3944 -7490 -2032 2976
15117 2976 6936 4439 1849 1197 -11786 -21848 -19566 -9125 -11208 -18612 -13224 -10643 -13773 -19369
15103 -19369 -30160 -25540 -17351 -4125 3570 -3292 -9536 -20539 -26083 -25016 -19907 -6538 16596
15090 16596 17041 17119 17865 6585 -2557 -9769 -18711 -8177 -4681 -8983 -9901 -11889 3027 -354 -2000
15075 -2000 -1097 -1509 -4002 113 859 -1724 -2504 7176 5558 4607 220 -12343 -19900 -17244 -13736 -14530
15059a4530L050o001o721Q578J2936L383o556J1159n373m515L493j1021j0634
15046b2752O324J1647J1880j0894q713N400j678k472k162l85n106R42Q40K988
15032a4141K560M051j615N385l129Q801L587p964q361k739J799l760k743L76j421
15017a9314J0580O080K574n846j0527K905K459P125O80p669k164P660J1852m270
15003B125j3491r387l24R456N127m264L028M489j1916k316O676J2521m984r925
14989a3185J387j915O122J807k051o062Q410o568q941R56K676O024j63L566p202
14974a5139Q470j0651m437Q28O283O627K978O12O294m425j5396k449J0953J0429
14960I77q472p387M288j784o731K126j6181k397o37j305J1211R925L986j1719
$$ plain form
15059 -14530 -11480 -17481 -24202 -15624 -2688 695 -5861 5298 -75 -4590 -1097 -12118 -22752
15046 -22752 -16428 -4781 7099 -3795 -12508 -7108 -8786 -11258 -13420 -13805 -18911 -17969 -17129 -14141
15032 -14141 -11581 -7530 -9145 -3760 -6889 1912 5499 -2465 -10826 -13565 -11766 -15526 -18269 -17893 -19314
15017 -19314 -8734 -2654 -80 -5926 -16453 -13548 -11089 -3964 -3284 -10953 -13117 -5457 6395 2125
15003 2125 -11366 -20753 -21077 -11621 -6494 -10758 -7730 -3241 -15157 -17473 -10797 1724 -3260 -13185
14989 -13185 -11798 -13713 -7591 -5784 -7835 -13897 -5487 -12055 -20996 -20040 -17364 -11340 -11503 -7937 -15139
14974 -15139 -6669 -17320 -21757 -20929 -14646 -8019 -5041 -4429 1865 -2560 -17956 -20405 -9452 977
14960 977 -7495 -14882 -10594 -12378 -19109 -16983 -33164 -35561 -36198 -37503 -26292 -16367 -12381 -24100
14946b4100M866J4192o760j3406l460m608P699R258l98p430R327N348K514R645
14932B687J873n440j3661l915J0148m521q95K342j772J817J2002K774o837q812
14918a2210O863O325L622j585j062R747n882K322J277l788k410J71n919n157j0101
14903a7787m941N374j53P042l474n447J4526o514N551N201j917k653m667J2506
14889B647j3600o934R642L035L974J868L437k142j770o996Q05P829m222j718l372
14874g517R24l525J0472J0689j3214r277J761J2107l505n951j2999m516p48j59
14860b5458P397L274J0096P125O326j306j0515j2322k802K784N437P183p035m319
14846a4135p758O521k615L474L444N00K77O404K604o761o093Q754j1394q095N835
$$ plain form
14946 -24100 -19234 -5042 -11802 -25208 -28668 -33276 -25577 -16319 -16717 -24147 -14820 -9472 -6958 2687
14932 2687 4560 -880 -14541 -18456 -8308 -12829 -13724 -11382 -13154 -11337 665 3439 -3398 -12210
14918 -12210 -5347 978 4600 3015 1953 11700 5818 8140 9417 5629 3219 3390 -2529 -7686 -17787
14903 -17787 -22728 -17354 -17507 -10465 -13939 -19386 -4860 -11374 -5823 -622 -2539 -5192 -9859 2647
14889 2647 -10953 -17887 -8245 -5210 -1236 632 4069 1927 157 -6839 -6034 1795 -2427 -4145 -7517
14874 -7517 -6593 -10118 354 11043 -2171 -11448 -9687 2420 -1085 -7036 -20035 -24551 -25299 -25458
14860 -25458 -18061 -14787 -4691 2434 8760 7454 -3061 -15383 -18185 -15401 -9964 -2781 -9816 -14135
14846 -14135 -21893 -15372 -17987 -14513 -11069 -10569 -10292 -3888 -1284 -8045 -14138 -5384 -16778 -24873 -19038
14831a9038k014L601J0627j564j7585m957M632J8292l60L208L652J116O40j644
14817a394k302n923m908Q397k974j3438R91R102J350m407R139J693J4752O811
14803A6889p554Q360L060r709j9135n877O70Q38n033L017m570R135l41J663k784
14788a1371o460r53J2714J1600n402l949K326O919j0376p002L916O11m678o040
14774a8145n342L381m494N136J0757N37M602R48j386q295l68q61K869M467j484
14759g678K577o833n770K13J752M912J428P299N004L922L24p677j2631l705m45
14744a7308n4l578L35K719q035M679K544P575J341q350l67O853K956p670r235
14729b5595P781N338O474l869n638j0142j3954R510J5924K660j655O603J451o974
$$ plain form
14831 -19038 -21052 -17451 -6824 -8388 -25973 -30930 -26298 -8006 -8366 -5158 -1506 -390 250 -1394
14817 -1394 -3696 -9619 -14527 -6130 -9104 -22542 -21551 -12449 -11099 -15506 -6367 -4674 10078 16889
14803 16889 9335 17695 20755 11046 -8089 -13966 -13296 -12458 -17491 -14474 -19044 -9909 -10250 -8587 -11371
14788 -11371 -17831 -18784 -6070 5530 128 -3821 -1495 5424 -4952 -11954 -8038 -7427 -12105 -18145
14774 -18145 -23487 -20106 -24600 -19464 -8707 -8170 -3568 -2620 -4006 -12301 -12669 -13530 -10661 -6194 -7678
14759 -7678 -5101 -11934 -17704 -17491 -15739 -10827 -9399 -2100 2904 6826 7150 -527 -13158 -16863 -17308
14744 -17308 -17362 -20940 -20605 -17886 -25921 -21242 -18698 -11123 -9782 -18132 -18499 -11646 -8690 -16360 -25595
14729 -25595 -17814 -12476 -6002 -9871 -15509 -25651 -39605 -30095 -14171 -11511 -13166 -6563 -5112 -12086
14715a2086m067l484P740P214J708k814J528P472K430k824n420j5810J874M335
14701a2204N490N321k83j34j0549k279j1818J060R617R111J0462J838J3464J098
14687B0194l886k1813p663M728O164q679j1558K873J874o278J2539n897R15J0026
14673f461n449m862M630J3175K388M563m834M79q112j2816l602J2915k879o634
14659a7499p754m546j16J0414P304k960N208l691l063m366N786n489n89Q113L713
14644i535k056N578J6099O939R501q177j5735k556K114j276l606K88j161q734
14630a2317j1148j1762m118L412Q665k860Q5L406K264j4066j968O290J5793J5128
14616c196Q914o092M218J0737j2410j0098J0750N5o911j0980l628O954M766P511
$$ plain form
14715 -12086 -16153 -19637 -11897 -4683 -2975 -5789 -4261 3211 5641 2817 -2603 -18413 -16539 -12204
14701 -12204 -6714 -1393 -1676 -1810 -12359 -14638 -26456 -25396 -15779 -6668 3794 5632 19096 20194
14687 20194 16308 -5505 -13168 -8440 -2276 -10955 -22513 -19640 -17766 -24044 -11505 -17402 -16487 -6461
14673 -6461 -11910 -16772 -12142 1033 3421 7984 3150 3629 -4483 -17299 -20901 -7986 -10865 -17499
14659 -17499 -25253 -29799 -29915 -19501 -12197 -15157 -9949 -13640 -16703 -21069 -15283 -20772 -21361 -13248 -9535
14644 -9535 -11591 -6013 10086 17025 26526 18349 2614 58 2172 896 -2710 -2422 -3583 -12317
14630 -12317 -23465 -35227 -39345 -35933 -27268 -30128 -30043 -26637 -24373 -38439 -40407 -34117 -18324 -3196
14616 -3196 5718 -374 3844 14581 2171 -7927 2823 2878 -4033 -15013 -18641 -11687 -6921 590
14602E90P85J80j3833j2827J600M758J1148J1105l842o895j3166k0L844l293j402
14587b1268O236J0224j425m087k861J0861N539m121k413O376N751l300k3027p270
14573b4785M893L030p286J0355K138r939R432K0431J316N329j425m101M904l939
14559A0353p092k358J667q928J3611P189m999r597q679m922M108m440M674J369
14545h044q05K552P477j1909m948O598N364l72M27l638m952n958K158Q633o484
14530a3901M532J0287R512l694j5640q711P268J0630N803q486K519j889L386q712
14516g096o598J5006J5672j61l213j5578l881R696J7238M20m559j348m254j460
14502I884M392r670o271m437R195j420k2254k875R306N401R931k552n297O350
$$ plain form
14602 590 1375 1555 -12278 -25105 -23505 -18747 -7599 3506 -336 -7231 -20397 -20417 -16573 -19866 -21268
14587 -21268 -15032 -4808 -6233 -10320 -13181 -2320 3219 -902 -3315 3061 8812 5512 -17515 -24785
14573 -24785 -19892 -16862 -24148 -13793 -11655 -21594 -12162 8269 9585 14914 13489 9388 14292 10353
14559 10353 3261 903 2570 -6358 7253 14442 9443 -154 -8833 -13755 -9647 -14087 -9413 -8044
14545 -8044 -8849 -6297 1180 -10729 -15677 -9079 -3715 -4087 -3660 -7298 -12250 -18208 -16050 -7417 -13901
14530 -13901 -9369 918 10430 6736 -8904 -17615 -10347 283 6086 -2400 119 -1770 1616 -7096
14516 -7096 -13694 1312 16984 16823 13610 -1968 -5849 3847 21085 21505 16946 15598 11344 9884
14502 9884 14276 4606 -1665 -6102 3093 1673 -20581 -23456 -14150 -8749 1182 -1370 -6667 -317
14488c17O689j5082j3980J3959J5556J169j1202j8703K870L528N297n56j0739
14475b1511P280J0490p5n42m82p640k844o954m872L998P417J2589n297K912k593
14460h124r46N08P340m281j52P075l617j7512q823J1785P415p337j362M607l794
14445a7218j646K4167J0397p60j1929L32k651l104q633N658R538P606J0292j3969
14431H080r575j040O539N872j092L286j6370j0890P06L98Q406N736J0394L899
14417A4349m223j282j1334j939m090L015j609J791M937r325j4428J4434L495k708
14403h917n58o57K662Q658l859n084N1N159P99n32J7408J0192j0619j8873k0352
14388b4522q365J4040J4410Q583R15K093j4262j5563p89J2160J5307P365o776
$$ plain form
14488 -317 6372 -8710 -22690 -8731 6825 7994 -3208 -21911 -19041 -15513 -10216 -10772 -21511
14475 -21511 -14231 -3741 -3816 -4358 -4840 -12480 -15324 -22278 -27150 -23152 -15735 -3146 -8443 -5531 -8124
14460 -8124 -9070 -8562 -1222 -5503 -5655 1420 -2197 -19709 -28532 -16747 -9332 -16669 -18031 -13424 -17218
14445 -17218 -18864 5303 15700 14940 3011 3343 692 -2412 -11045 -5387 4151 11757 22049 8080
14431 8080 -1495 -2535 4004 9876 8784 12070 -4300 -15190 -14484 -14086 -5680 56 10450 14349
14417 14349 10126 8844 -2490 -4429 -8519 -5504 -7113 -5322 -385 -9710 -24138 -9704 -6209 -8917
14403 -8917 -9475 -10132 -7470 1188 -2671 -7755 -7704 -2545 -1746 -2278 15130 25322 14703 -4170 -24522
14388 -24522 -32887 -18847 -4437 4146 5061 7154 -7108 -22671 -23460 -11300 4007 11372 4596
14375D596l221o739o506Q522O977J842J469j205J432o342r509o63J191O223m129
14360f062k606m002k291M373M440M836M014n072q616N369J3932O360j2721j0027
14346h073L612P535O299k191l048O94j0972p388L63Q434j1525L779J3196K951
14332C666q403k060J5347K42J448L41l334l281N1n083m794M555N70P669L185O793
14316A6912P862l126j1384j2659m541m374j49J915K930J847M474M019J1585K336
14302A7647P456j0070r628j385j4240o439J392P109P774J4139K068p194k774K886
14288H741r483j2673l983J900Q400Q438J1963N973n957p692m046M445j60m229
14274A637r460p403n718N613J4306m439o934M634n801L168P784L136J2048J8201
$$ plain form
14375 4596 1375 -5364 -11870 -3348 3629 5471 6940 5735 7167 825 -8684 -9347 -8156 -1933 -6062
14360 -6062 -8668 -12670 -14961 -10588 -6148 -1312 2702 -2370 -10986 -5617 8315 14675 1954 -8073
14346 -8073 -4461 3074 9373 7182 4134 4828 -6144 -13532 -13169 -4735 -16260 -12481 715 3666
14332 3666 -4737 -6797 8550 8792 10240 10581 7247 3966 4017 -1066 -5860 -1305 -735 6934 10119 16912
14316 16912 24774 21648 10264 -2395 -6936 -11310 -11459 -9544 -6614 -4767 -293 3726 15311 17647
14302 17647 25103 15033 5405 4020 -10220 -16659 -15267 -8158 -384 13755 15823 8629 5855 8741
14288 8741 -742 -13415 -17398 -15498 -7098 1340 13303 19276 13319 5627 1581 6026 5866 1637
14274 1637 -7823 -15226 -20944 -15331 -1025 -5464 -12398 -7764 -13565 -10397 -2613 523 12571 30772
14260C0772N418Q056j2859n640p834j1525p883r781m816M477J990J2929R805o756
14246F353o30k052N706l326j2771n714m883J415M012M171N522R597K657q413r587
14231g943p527l259K104J8745k987j1868L642J517j197K893J923J2555J377j1426
14217a451j7457j668j599J5839J3791K734l608l081j814m580p690n522q91J1205
14203e792O643m447q970k406M438O810L964J023o183k488P903m84o033N401q456
14188i077J832J2147J864p008J222Q36j976M294n470q937K890q790K439M556J2651
14173C473j502m182k497j2134K42m277J927p31K161L193R000l758l049n19j120
14158a3773m52M713J0378J13p638J3995J326r40P914K621j0116p986m175R053
$$ plain form
14260 30772 36190 44246 31387 25747 17913 6388 -1495 -11276 -16092 -11615 -9625 3304 13109 6353
14246 6353 5723 3671 9377 6051 -6720 -12434 -17317 -15902 -11890 -7719 -2197 7400 10057 1644 -7943
14231 -7943 -15470 -18729 -16625 2120 -867 -12735 -9093 -7576 -8773 -5880 -3957 8598 9975 -1451
14217 -1451 -18908 -20576 -22175 -6336 7455 10189 6581 3500 1686 -2894 -10584 -16106 -16997 -5792
14203 -5792 851 -3596 -12566 -14972 -10534 -3724 240 1263 -4920 -7408 495 11 -6022 -621 -9077
14188 -9077 -7245 4902 6766 -242 980 1816 -160 4134 -1336 -10273 -7383 -16173 -13734 -9178 3473
14173 3473 1971 -2211 -4708 -16842 -16600 -20877 -18950 -19681 -17520 -14327 -5327 -9085 -12134 -12653 -13773
14158 -13773 -14225 -9512 866 979 -6659 7336 8662 7722 15636 18257 8141 155 -4020 5033
14144E033O159l552j3701j1624P431M353o795r281M021m548j5309J5600J6819
14131e394N33n19o373J0300J908j3112j8427O258J2108M343k49N981J5623P964
14117B0944j139k612n322L33R39o30q324K354J5670q109j3906r657Q927J5475
14103A4943q434j4618P30J0680r285q564K358o990j1025J8057J9342l259n234
14090a299P465n378l868L983n231n577m976k431J2186P256l281K448K666n677
14076a714j3428N726O63j315J3116J0201J3811l886l986n101j6276j1404q797
14063b2390K387O359M505N617K921R369l402j6275l017O635R0R120o59j2304L010
14048h034M252J639k616O735L981r546j872k68r122J765k079J422M861N331P826
$$ plain form
14144 5033 11192 7640 -6061 -17685 -10254 -5901 -12696 -21977 -17956 -22504 -37813 -22213 -5394
14131 -5394 -4861 -5380 -11753 -1453 455 -12657 -31084 -24826 -12718 -8375 -8624 -2643 12980 20944
14117 20944 19805 17193 11871 12204 13143 12513 4189 6543 22213 14104 198 -9459 -532 14943
14103 14943 6509 -8109 -7379 3301 -5984 -14548 -12190 -19180 -30205 -12148 7194 3935 -1299
14090 -1299 6166 788 -3080 903 -4328 -9905 -14881 -17312 -5126 2130 -1151 1297 3963 -1714
14076 -1714 -15142 -9416 -8753 -10068 3048 13249 27060 23174 19188 14087 -2189 -13593 -22390
14063 -22390 -20003 -13644 -9139 -3522 -601 8768 5366 -10909 -13926 -7291 -7201 1919 1260 -11044 -8034
14048 -8034 -3782 -2143 -4759 1976 5957 -3589 -5461 -5729 -14851 -13086 -15165 -13743 -8882 -3551 4275
14033D275N845K106p834j5264l54J199Q754l697q466L484Q906k021N430J2840
14019A5203L464k724l879M762r179j079L271j5564p134p012N956J8853J4581j1531
14005G988j8838J498R089l517K729l750m806L00j0895l329J1046N632j4974L521
13991a8306M360J1376N081J47j0287n295l659J1670J2495q400n255J1927J672
13978G526n824j283K229k131K812J5692N783P66j4200j4720j089p956p809l832
13964b4036N965R043m384R269Q795L385Q358L752J0043P067L805N550q74p212
13950C8526q804j5375O9l483j416J814r378j4970q404J1460K85p105P27j3141
13936b9195O642J3056j2722m806J2220M93j1181J129N725L266N771k107p382K549
$$ plain form
14033 4275 10120 12226 4392 -10872 -11226 -10027 -1273 -4970 -13436 -9952 -1046 -3067 2363 15203
14019 15203 18667 15943 12064 16826 7647 6568 9839 -5725 -12859 -19871 -13915 4938 19519 7988
14005 7988 -10850 -9352 -263 -3780 -1051 -4801 -9607 -9307 -20202 -23531 -12485 -6853 -21827 -18306
13991 -18306 -13946 -2570 2511 2658 -7629 -12924 -16583 -4913 7582 -818 -6073 5854 7526
13978 7526 1702 419 2648 517 3329 19021 24804 25570 11370 -3350 -4439 -12395 -20204 -24036
13964 -24036 -18071 -9028 -13412 -4143 4652 8037 16395 20147 30190 37257 41062 46612 45738 38526
13950 38526 29722 14347 14416 10933 9517 11331 1953 -13017 -21421 -9961 -9676 -16781 -16054 -29195
13936 -29195 -22553 -9497 -22219 -27025 -14805 -14312 -25493 -24364 -18639 -15373 -9602 -11709 -19091 -16542
13922a6542J5773L940n086m28L851j1544P015L840K537n400M296m3j1092p071
13908a5954M383J0645J930Q66K580r197L227p149P572n313j6659N679J0689J6453
13894I752k278p226l275P874N015k1194r685O120N153N846n628n610m448K688
13880a6896R489j0364k521J1999l63m666m47N089P059m905j0404L915N494K160
13866e361L141N133j06p384l495j1717O253O023k775K431J4694p60m580n748J1714
13851G463R461o686j063k641n590q610O182J146l454O080P148q425r863J676O442
13836g34J3355m334j7617L672J2730k427j4962j00J1356N905J0494n793n191q432
13822b078K519K474l910j1045o322J0332R914P925O625j1161j7293K326m825L961
$$ plain form
13922 -16542 -769 3171 -1915 -2343 1508 -10036 -3021 819 3356 -2044 2252 2209 -8883 -15954
13908 -15954 -11571 -926 1004 1870 4450 -4747 -1520 -8669 -1097 -6410 -23069 -17390 -6701 9752
13894 9752 7474 248 -3027 4847 9862 -11332 -21017 -14897 -9744 -3898 -9526 -15136 -19584 -16896
13880 -16896 -7407 -17771 -20292 -8293 -8656 -13322 -13769 -8680 -1621 -6526 -16930 -13015 -7521 -5361
13866 -5361 -2220 2913 2807 -4577 -8072 -19789 -13536 -7513 -10288 -7857 6837 6077 1497 -4251 7463
13851 7463 16924 10238 9175 6534 944 -7666 -1484 -338 -3792 2288 9436 1011 -8852 -7176 -734
13836 -734 12621 8287 -9330 -5658 7072 4645 -10317 -10417 939 6844 17338 11545 6354 -2078
13822 -2078 441 2915 -995 -12040 -18362 -8030 1884 9809 16434 5273 -12020 -9694 -14519 -10558
13808a0558M240M985K202r06p464Q933J0720j138O225N427j1758l807J749o541
13794B309j0599J2558O532q192j2446j26K362J73J0955L642n199j1397j575j3751
13780b4754j4627N365J2837N069J533M995R797N36O992N601P50r024J913N884
13766A2867j1806r977Q184J4912k448M525m084M580J3529J171m197m002j0092
13753A3162p446P568k932k687K504R755O89k363P420L885j7195j0949O317k855
13739D873j1755J5235j708n549l094N703Q081K1997J0974q293K237M923r258j0820
13725B3546k452r592K91r119j0484N193N284K1457K433m630p138q642o982K665
13711A830q123j44J2654N7K964j858N85M523k890q948R296N099j867l637j64k725
$$ plain form
13808 -10558 -6318 -1333 869 -37 -7501 1432 12152 11014 17239 22666 10908 7101 8850 2309
13794 2309 -8290 4268 10800 2608 -9838 -9964 -7602 -7429 3526 7168 1969 -9428 -11003 -24754
13780 -24754 -39381 -34016 -21179 -16110 -14577 -9582 215 751 7743 13344 14094 5070 6983 12867
13766 12867 1061 -8916 -732 14180 11732 16257 12173 16753 30282 31453 27256 23254 13162
13753 13162 5716 13284 10352 7665 10169 19924 20613 18250 25670 29555 12360 1411 7728 4873
13739 4873 -6882 8353 6645 1096 -1998 3705 11786 33783 44757 36464 38701 43624 34366 23546
13725 23546 21094 11502 11793 2674 -7810 -2617 2667 24124 26557 21927 14789 6147 -835 1830
13711 1830 -6293 -6437 6217 6274 9238 7380 7965 12488 9598 650 9946 15045 13178 9541 9377 6652
13695F652l863N509J132J8077M952n292q111N262R54j310M252n711l756n490N665
13680A8922P327K813o635K647M833j2019q365L262j649j1154l224P125J028P005
13666A1916J763J081j077J3129J934q068m861o968R600o846j4169K028O345J4038
13652A9845Q406k909l663L168J2029l920l332p662M282M055O055l60O37m496M53
13637C2588N887J534N193L339o232n989m144o581M463o699j008j057K805J309
13623B5408l305R791J576L251R288K676O224j49j3710j3817n389K171r648O068
13609B0435P846O948l974p96m75J1115J0465p356O59J5787J6193K7220J8763k5567
13595I7263k5194q826k2681o942L536P09N369P714M250J3059N444P511o54l397
$$ plain form
13695 6652 2789 8298 9430 27507 32459 27167 19056 24318 25272 23962 28214 22503 18747 13257 18922
13680 18922 26249 29062 22427 25074 29907 17888 9523 12785 11136 -18 -3242 3883 4911 11916
13666 11916 13679 14760 13683 26812 28746 20678 15817 8849 18449 11603 -2566 -538 5807 19845
13652 19845 28251 25342 21679 24847 36876 32956 29624 21962 26244 30299 36354 35994 36631 32135 32588
13637 32588 38475 40009 45202 48541 42309 36320 32176 25595 30058 23359 22351 21294 24099 25408
13623 25408 22103 31894 33470 36721 46009 48685 54909 54760 41050 27233 21844 24015 14367 20435
13609 20435 28281 35229 31255 30459 29984 41099 51564 44208 44867 60654 76847 104067 122830 97263
13595 97263 72069 63243 40562 33620 37156 37865 43234 50948 55198 68257 73701 81212 80558 77161
13581G7161r631j4003K590L712p993o727j453m838j5078n956n86q195j895N497
13567A2605j045k700P243Q194K1078j036j7847j1842p39K907J5834J3488J5218
13554F1358K0852K1888P968j2773j9549o408o935n913p445n213k953j3724j1463
13541A9690l558n419M150J2758o000k327L19j4059N06o879k985J3032O816o129
13527I915J653J178K381l417N08M821o972m581j071N320j0754k877r025J704Q082
13512c135J2058k207r55j554J5402J3577K344o165K568K176o154j3847m804q79
13498H425k429K875L308J0260n070p531m500q72J334j68L281J5011N151o799K720
13483B4996M933O836m617o686N982m277k872l266L996p373r180m033J0631J1147
$$ plain form
13581 77161 67530 53527 56117 59829 51836 45109 43656 38818 23740 17784 17198 9003 7108 12605
13567 12605 11560 8860 16103 24297 45375 44339 26492 14650 13911 16818 32652 46140 61358
13554 61358 82210 104098 112066 99293 79744 73336 66401 60488 53043 47830 44877 31153 19690
13541 19690 16132 10713 14863 27621 21621 19294 19613 5554 6060 -819 -3804 9228 16044 9915
13527 9915 11568 12746 15127 11710 12218 17039 10067 5486 4415 9735 -1019 -3896 -12921 -11217 -3135
13512 -3135 8923 6716 5761 4207 19609 33186 35530 29365 31933 34109 27955 14108 9304 8425
13498 8425 5996 8871 12179 22439 17369 9838 5338 4466 5800 5632 8913 23924 29075 22276 24996
13483 24996 29929 36765 32148 25462 31444 27167 24295 21029 25025 17652 8472 4439 15070 26217
13469B6217n961p181J5514J0347M486l864j1233J432o240j920n138o678J405k440
13455H746j2087L538J0398l065L614N318M619P94j119J0721K709n660o036J5411
13441C7901J734m671l744J0192l854p781J30n016r705n404J1205J0844J095k208
13427C0718k577R08K362o506n656Q807M374P803J1966l232j8097k751N562n900
13413B7781n01l963L827J0041p1L18P87M66r545j4538P249M036R604R22j534j0856
13397B4023P20L322o687J0696O067N742K989p422p707Q57l883R473K1987J6785
13383G6962r110n977n92K292M857m237o459R74o855j508L303k649L41j8549q443
13368B4350M5J1759L276L82p460l658q38l694M468L886N738K114m713k410L582
$$ plain form
13469 26217 20256 13075 28589 38936 43422 39558 28325 29757 23517 21597 16459 9781 11186 8746
13455 8746 -3341 197 10595 7530 11144 16462 21081 21875 20756 31477 34186 28526 22490 37901
13441 37901 39635 34964 31220 41412 37558 29777 29907 24891 15186 9782 20987 31831 32926 30718
13427 30718 28141 29049 31411 24905 19249 28056 32430 40233 52199 48967 30870 28119 33681 27781
13413 27781 27280 23317 27144 37185 37114 37432 38219 38685 29140 14602 21851 25887 35491 36413 34879 24023
13397 24023 24743 28065 21378 32074 38141 43883 46872 39450 31743 32600 28717 38190 60177 76962
13383 76962 67852 61875 61283 63575 68432 64195 57736 58710 51855 50347 53650 51001 51342 32793 24350
13368 24350 24395 36154 39430 39812 32352 28694 27856 24162 28630 32516 38254 40368 35655 33245 36827
13353C6827R495k443j13j960K325j4396N675J2089Q421K731p718N75M222k000
13339E3730J932Q379J1627L2273L6456L4260J3224k1692j2624j1707k3443k3484
13327I8931j4597L882J159j6997j0374K834J879j039K995J4729L292J1487K1704
13314A19885J1120K4935L5856K1543n837k2984k5296j5273k5246k8253p679N678
13302H8449j1001j918J1547M492L138L471j0990m670n455K769O624K6515L7120
13289A50091M6163L6626j1780k3017k2724k5810j9685j9201n093k129O975n610
13277A04806k669M626M927J1507J2678P38K5067L0241O0294Q2657J04879R0245
13265E29996J7681m6881q2797q7735q4680n0768l6082k4048k801p354q070p866
$$ plain form
13353 36827 46322 43879 43766 41806 44131 29735 35410 47499 55920 58651 50933 51508 55730 53730
13339 53730 55662 64041 75668 107941 144397 178657 191881 170189 157565 145858 122415 98931
13327 98931 84334 88216 89375 72378 62004 64838 66717 65678 68673 83402 86694 98181 119885
13314 119885 131005 155940 191796 213339 207502 184518 159222 143949 118703 90450 82771 88449
13302 88449 77448 75530 87077 91569 94707 98178 87188 82518 77063 79832 86456 112971 150091
13289 150091 196254 232880 221100 198083 175359 149549 129864 110663 105570 103441 110416 104806
13277 104806 102137 106763 111690 123197 135875 136613 161680 191921 252215 334872 439751 529996
13265 529996 547677 500796 417999 330264 245584 194816 158734 134686 131885 124531 116461 108595
13253A08595m179P956M447l717q686M384l86N693J4517J3989K4340J5715l446
13240A79222j4782j9370k3784j4238Q35P080J308J777k0820j920K0138J193p491
13227A09148N831K7784M1504N0515P0200J01422Q9872L6450m1530q4577q0677
13216C25942n4690n3851n6194k3536j1054n679J738L644j0630j3301j4613L23
13204H8099J0517j284k751J0860M615j281R72N23j0576o160K052l019j1649M103
13190H5021J8494J1107j1432j99r319q076q860j3869P111Q922K5836J9320J1251
13177A35307K5225L5134K6118j272l2927l0360j7227j6245p716Q78j6j1020j373
13164A04506J841K258p686o636n562j0555j3394M628J0584N787m857O399K51q037
$$ plain form
13253 108595 104416 112372 116819 113102 104416 108800 108414 114107 128624 142613 166953 182668 179222
13240 179222 164440 145070 121286 107048 107883 114963 116271 118048 97228 95308 115446 116639 109148
13227 109148 114979 142763 184267 234782 304982 406404 496276 532726 491196 406619 325942
13216 325942 271252 217401 161207 137671 126617 120938 122676 126320 115690 102389 87776 88099
13204 88099 98616 97332 94581 105441 110056 108775 109747 110270 99694 93534 95586 92567 80918 85021
13190 85021 103515 114622 103190 102991 93672 85596 76736 62867 69978 78900 104736 124056 135307
13177 135307 160532 195666 221784 220512 187585 157225 139998 123753 116037 116915 116899 105879 104506
13164 104506 106347 108605 100919 94283 88721 78166 64772 69400 79984 85771 80914 87313 87564 79527
13150G9527j0883M078P413p735r434q232K891p033j0804k743N906K248K642L103
13136E0944N778j1303k1833n751M798j244M988N786J7037k367J298P534j2187
13123D3478l149k786M679J817M882P460P391p657l865O504N342q770j0328j761
13109D3237j7892r308J279J0857P198l397M93J2297K608m135k032L375J975Q196
13095E4751L542j3224j2486P514P437m318j7968N90M545K909o331J538j668l380
13081B3451O120o99J5204P867j0386p450O956p462j2061O738K655j260m389O566
13067C1850J268k239K233N738m487m164k30j867m633J0181J1586k808q023K732
13053C7137M59J285j028n585j0417K458J0931q256N412J1000k701o707r12Q84
$$ plain form
13150 79527 68644 72722 80135 72400 62966 54734 57625 50592 39788 37045 42951 45199 47841 50944
13136 50944 56722 45419 23586 17835 22633 21389 26377 32163 49200 46833 48131 55665 43478
13123 43478 40329 37543 42222 44039 48921 56381 63772 56115 52250 58754 64096 55326 44998 43237
13109 43237 25345 16037 17316 28173 35371 31974 32467 44764 47372 43237 41205 44580 46555 54751
13095 54751 58293 45069 32583 40097 47534 43216 25248 25838 30383 33292 26961 28499 26831 23451
13081 23451 29571 28872 44076 51943 41557 34107 41063 33601 21540 28278 30933 29673 25284 31850
13067 31850 33118 30879 33112 38850 34363 30199 29969 28102 23469 33650 45236 42428 34405 37137
13053 37137 37596 38881 37853 32268 21851 24309 35240 26984 32396 43396 40695 33988 33076 33960
13039C3960k403j9978j487N057n345m453J0481J3661p356p999o504l597K468M687
13025A1192l148J0562M47p76P140j500n803k366m374k655N24L065j069J681n788
13010G132M36j0031O02M620K27R84p938P137K0982J2300n143r167j0085M1L614
12995A5711M030q714q522l220Q227J1895O093l869j109j911P50P02J0940j182
12981B9821K539J391k634m926q871J2337K780q675M222J3522M291k42n673m268
12967C5614k966n62j044n000l462o584n72o822n788M470O560O533L040n631o115
12952A1671o76M237N961l412j2981k054L698r256L053K015P189j491q92Q63l534
12937D391q064K381j035N722L34k982o88Q94J880K965K941o41P090M616L082p196
$$ plain form
13039 33960 31557 11579 10092 15149 9804 5351 15832 29493 22137 14138 7634 4037 6505 11192
13025 11192 8044 18606 19053 18277 25417 23917 18114 15748 11374 8719 9243 12308 11239 12920 7132
13010 7132 7568 -2463 -1861 2759 2986 3970 -3968 3169 24151 36451 31308 22141 12056 12097 15711
12995 15711 19741 11027 2505 -715 7512 19407 25500 21631 20522 18611 19361 20063 31003 29821
12981 29821 32360 33751 31117 26191 17320 29657 32437 23762 27984 41506 45797 45555 39882 35614
12967 35614 32648 32086 31042 26042 22580 15996 15424 8602 2814 7284 13844 20377 23417 17786 11671
12952 11671 10995 15232 21193 17781 4800 2746 6444 -2812 241 2256 9445 7954 7062 7925 4391
12937 4391 -3673 -1292 -2327 3395 3729 747 59 953 2833 5798 8739 8098 15188 19804 22886 15690
12921A5690q70N61M409l809o653J6070r15p893l599p027N547N612J2335J3645
12907D3103N828p111M218Q08l698l146m664J1730J9283K3548L3905K2866j514
12894A45156j7413k1707j5772j2346j6167j8786r038p210l978K455j286j2435
12882A1473m193J1472J495j828k278k136r15J2584J170L264j2350M125L567K340
12868B7790r933r371O927l677J419J0236L849L421J4771k916j0574j5832L284
12855A9394l962n291K894Q819K226L32m955r783k896O137m406k017Q754J367M06
12840A7019N948o827p834l713l985L878O533j322r010J1544J130m385l963M67
12826E480J2473J309k633N602M360N05J0444K0810n048J0411L1011K9972P057
$$ plain form
12921 15690 14820 15381 19790 15981 9328 25398 24483 16590 12991 5964 11511 17123 29458 43103
12907 43103 48931 41820 46038 46846 43148 40002 35338 47068 66351 89899 123804 146670 145156
12894 145156 127743 106036 90264 77918 61751 42965 33927 26717 22739 25194 23908 11473
12882 11473 7280 18752 20247 18419 16141 14005 13090 25674 26844 30108 17758 21883 25450 27790
12868 27790 17857 8486 15413 11736 13155 23391 27240 30661 45432 42516 31942 16110 19394
12855 19394 15432 10141 13035 21854 24080 24412 19457 9674 6778 12915 8509 6492 15246 16613 17019
12840 17019 22967 16140 8306 4593 608 4486 11019 9697 687 12231 13361 8976 5013 5480
12826 5480 17953 19262 16629 22231 26591 27096 37540 58350 53302 63713 94724 124696 131753
12813A31753j8405j6906o447j3875j6348o842q414p830l308o589r416q863J1678
12800B0188P521l295r119k757J0540k266q039j61J844P05J2620O827m100n014
12786B5494r486m081l833n069M432k690j4643Q818K21j373J0205k020l013Q757
12772A1719J423j919q06O410R618P507l982p766q031m884k060O167J0261m676
12758A8981n780n007k231M951P67J910K028p06M402J2437q003j4502N009O318
12744B0574J88n377L792M970Q243P303k246j7788n836J881m128j418j132r115
12730h9R797P024l205K729j863L579J0997q770o557p035j4655Q09J398M729N588
12715D476m213j552J4139Q961L065K093j0324n611P521K422J677r411k603M140
$$ plain form
12813 131753 113348 96442 89995 76120 59772 52930 44516 36686 33378 26789 17373 8510 20188
12800 20188 27709 24414 15295 12538 23078 20812 12773 12612 14456 15161 27781 34608 30508 25494
12786 25494 16008 11927 8094 3025 7457 4767 -9876 -1058 -837 -2210 7995 5975 2962 11719
12772 11719 13142 11223 10417 16827 26445 33952 29970 22204 14173 9289 7229 13396 23657 18981
12758 18981 13201 8194 5963 10914 11681 13591 15619 14913 19315 31752 23749 9247 14256 20574
12744 20574 20762 15385 19177 24147 32390 39693 37447 19659 13823 15704 11576 10158 9026 -89
12730 -89 9708 16732 13527 16256 14393 17972 28969 20199 13642 6607 -8048 -7239 -5841 -1112 4476
12715 4476 263 -1289 12850 21811 24876 26969 16645 11034 18555 20977 22654 13243 10640 14780
12701A4780m116R10J2017N599m702O861J0531J501l206j9027m822P420L348J220
12687B8314K789k717l40M383O23o067J590j0697J1015J4516j2004r944j654O158
12673B5965J2816M874k93P716k400J63r748p668p112K036P079L587L860J100k0751
12658B1224j5311k065R576R534N462q615j1007J2090N329K167l314m25P243J144
12644C3032n883k359O332J620o747r258P74M076l328N069R23j1103L782J0526
12630B7456J6448J0822M053j1693k2964p661M501o429m487p290N477p6j9081N012
12616e912O213O756L674M299o027j4744l841P964Q881L105J971j313j640j042
12602H344l717l98L160o021M320q81N631k747q936l622M22M636Q493N173p429
$$ plain form
12701 14780 10664 11574 23591 29190 24488 31349 41880 43381 40175 21148 16326 23746 27094 28314
12687 28314 31103 28386 28046 32429 33052 26985 28575 17878 28893 43409 31405 21461 19807 25965
12673 25965 38781 43655 43362 51078 48678 48841 39093 31425 24313 26349 33428 37015 40875 41975 21224
12658 21224 5913 3848 13424 22958 28420 19805 8798 20888 26217 28384 25070 24645 31888 33032
12644 33032 27149 24790 31122 32742 25995 16737 17511 21587 18259 23328 24251 13148 16930 27456
12630 27456 43904 54726 58779 47086 24122 16461 20962 14533 10046 2756 8233 8157 -10924 -5912
12616 -5912 301 7057 10731 15030 9003 -5741 -9582 -1618 7263 10368 12339 11026 9386 8344
12602 8344 4627 4229 7389 1368 5688 4807 10438 7691 -1245 -4867 -4445 191 8684 13857 6428
12587F428J67p042N438P115j6747N778J0744K714l203q688Q822o873k132j53Q256
12572A0624K365q919o94L619k261o402M312O047K295J779j226o688L760K596k522
12557H685O987l636M616j974l879R284O746k880J0953j8947j8848P565Q066K118
12543A4856J2206J919j0756q306j2335n249j274L115R334m801m050J2026O001
12530A2686J0658J543r036P214k353j4744j3773L091Q300j408J5079J0191m174
12517B3274j2439K502O213L00k9p549q550k000K938J5568M919q343j0449L63M145
12502A0863n729j4447J288J2470L401J704J610o989j50R379M003n699k437L445
12488A2712q942r965N35J909R572Q394o531L409M640M901L827j1630j0445J672
$$ plain form
12587 6428 6595 -447 4991 12106 -4641 1137 11881 14595 11392 2704 11526 4653 2521 2368 10624
12572 10624 12989 4070 3376 6995 4734 -1668 2644 8691 10986 12765 11539 4851 8611 11207 8685
12557 8685 15672 12036 16652 14678 10799 20083 26829 23949 34902 15955 -2893 4672 12738 14856
12543 14856 27062 28981 18225 9919 -2416 -7665 -8939 -5824 3510 -1291 -5341 6685 12686
12530 12686 23344 24887 15851 23065 20712 5968 -7805 -4714 3586 2178 17257 27448 23274
12517 23274 10835 13337 19550 19850 19821 12272 3722 1722 4660 20228 25147 16804 6355 6718 10863
12502 10863 5134 -9313 -8025 4445 7846 9550 11160 4171 4021 13400 17403 11704 9267 12712
12488 12712 3770 -6195 -5660 -3751 5821 14215 7684 11093 15733 20634 24461 12831 2386 4058
12474D058J3499M056M262j1383j1257R041O328j550O515M788P16k217p49n125
12460B0982k937n973k837L925m513j3485L981J472J3881J8514j3815r540Q081
12447A7736m894r403Q87J276M476R01j0524K096k578P9N057O602J0347R022J2697
12432D3777L928j6940j9508N117R728l166L195j5817n457R652O519J1001J0341
12419D2370K162j5697j2958j932P521p095l495m993J91J721n262m964K315p12
12405h28P853r50J782J898J497J1129k64r146j4232M264J9198K193p323J0675
12391B7746j987q837o318j542J998j829J6103M132m156j012l483n472m655O611
12377A7299P0q95j2035l919m615N099O143L342n017j057k760j4821L530P794N59
$$ plain form
12474 4058 17557 21613 25875 14492 3235 12276 18604 17054 23569 28357 29073 26856 26107 20982
12460 20982 18045 12072 9235 13160 8647 -4838 -857 615 14496 33010 19195 9655 17736
12447 17736 12842 3439 4326 5602 10078 10979 455 2551 -27 52 5109 11711 22058 31080 43777
12432 43777 47705 30765 11257 16374 26102 22936 26131 10314 4857 14509 21028 32029 42370
12419 42370 44532 28835 15877 13945 21466 14371 10876 5883 6074 7795 2533 -2431 -116 -828
12405 -828 7025 6075 7857 9755 11252 22381 22117 12971 -1261 3003 22201 24394 17071 27746
12391 27746 25759 16922 10604 9062 11060 9231 25334 29466 25310 24298 20815 15343 10688 17299
12377 17299 17369 16474 4439 520 -4095 1004 7147 10489 5472 4415 1655 -13166 -9636 -1842 -1283
12362a283O036J2806o541r92L932p517K329L99p521O089J0083l353j2620j646
12348B01K252p778M584K0129L71n810Q690J7397L961l379o196j642q863j4213
12334I704N158n030Q200M042j1056J895L671R455j7297j0137N166K05J6089J679
12320B1744q308p559r327K599l124N050K473J1412n293P358P778J3982Q877K998
12306E0660k717R868J324p149j1060Q01o978q958J2623m245j5698j710P682O895
12292C1338o999q644P129O303j08j2569k39K666K957M0J9q36k636J6269K563n705
12276C1548M061o237O623R641J4126J1530J2075Q393L720K677m989q031j9069
12263F6068j4643p570o250m925n859O623N322j137K184o019p224n470L179M380
$$ plain form
12362 -1283 4753 17559 11018 10026 13958 6441 8770 9169 1648 7737 17820 14467 1847 201
12348 201 2453 -5325 -741 19388 19759 13949 22639 40036 43997 40618 34422 32780 23917 9704
12334 9704 14862 9832 18032 22074 11018 12913 16584 26039 8742 -1395 3771 3976 20065 21744
12320 21744 13436 5877 -3450 -851 -3975 1075 3548 14960 9667 17025 24803 38785 47662 50660
12306 50660 47943 57811 59135 51986 40926 41727 34749 25791 38414 34169 18471 16761 24443 31338
12292 31338 24339 15695 22824 29127 29019 16450 16211 18877 21834 21874 21893 21057 18421 34690 37253 31548
12276 31548 35609 29372 35995 45636 59762 71292 83367 91760 95480 98157 93168 85137 66068
12263 66068 51425 43855 37605 32680 26821 33444 38766 37629 39813 33794 26570 21100 24279 28659
12249B8659P230l981n143M64P671q826j0740N916J3920k95j261k848J791P644
12235D0201k731K429J522J210l56K991j5316j965P864m621p333N53M862N177K38
12220C4725k806O43N727j6813k064J3271o878j0366J251Q90p603k697J1164J3780
12206C2224J0786m063q376q500m790J2628R775p265J662p406j3879n655j1352
12193d211O764O388m591j095K695N619M937j130K78O510o154L973m292m744M935
12178A5882j763N272J4918O194l480j153K594N3K139r421o062j1503m255L20o3
12163I672J0670P087j0048P468p155m803K423o09n889j030J6235Q328m894p16
12149B6739L54p927r633L412N879N837q98p378L217O833J351K800j1462o371J0805
$$ plain form
12249 28659 35889 31908 26765 27229 34900 26074 15334 21250 35170 34875 33614 30766 32557 40201
12235 40201 37470 39899 41421 42631 42275 45266 29950 27985 35849 31228 23895 24448 29310 34487 34725
12220 34725 31919 32562 38289 21476 19412 32683 25805 15439 16690 17580 9977 7280 18444 32224
12206 32224 43010 38947 30571 22071 17281 29909 39684 32419 34081 26675 12796 7141 -4211
12193 -4211 2553 8941 4350 3255 5950 11569 16506 15376 15654 22164 16010 19983 15691 10947 15882
12178 15882 14119 19391 34309 40503 37023 35870 38464 38517 40656 31235 25173 13670 9415 9735 9672
12163 9672 20342 27429 17381 24849 17694 12891 15314 14705 8816 7786 24021 32349 27455 26739
12149 26739 27093 19166 9533 12945 18824 24661 23763 16385 19602 26435 27786 30586 19124 12753 23558
12134B3558J11p795j053K772L905L572n800j1214j2831P291J6947J2345k512q970
12120B0326m643P213J3927L139O365p938j1635l385K209J870j8839l467K4267
12107B9409M332L839o501r006J389K309k964j745o856r545l509M204J0931J530
12093A7817j2242L395M327J316j0669L525n12n632j1031q502P768N503O403L012
12079D478m79j709J969M338j436P260M025L377K30O37L753O181O014O326m000
12064D0964j0352l92p062M953m368p548j831n777k976j042j323l340K880J893
12050D679J561Q250O593J3884K137k368n374j0633j97K040J127N767j115O084
12036C2435J841J1288n375p676J3215K4550K2464L3562M9428O4366O6631K4905
$$ plain form
12134 23558 23669 15874 14821 17593 21498 25070 19270 8056 -4775 2516 19463 31808 29296 20326
12120 20326 15683 22896 36823 39962 46327 38389 26754 23369 25578 27448 8609 5142 29409
12107 29409 33741 37580 31079 22073 23462 25771 22807 21062 14206 4661 1152 5356 16287 17817
12093 17817 5575 8970 13297 14613 3944 7469 6957 1325 -9706 -18208 -10440 -4937 1466 4478
12079 4478 3999 2290 4259 8597 7161 14421 18446 21823 22053 22690 26443 32624 38638 44964 40964
12064 40964 30612 30220 23158 28111 23743 16195 14364 8587 5611 4569 3246 -94 2786 4679
12050 4679 6240 14490 21083 34967 37104 34736 29362 18729 18532 20572 21699 27466 26351 32435
12036 32435 34276 45564 40189 32513 45728 70278 92742 126304 175732 240098 306729 331634
12024C31634l0742n6749m6080m5757l7153k8477k0344k2595j8028o955m672L081
12012A7163K288M244J559j2638m178k119K534o479m804k868J55P56m391R220R457
11997I899n896r5L011K922Q521R764L563j599p990q146j62j03l312M712p929R875
11981A7035N708J4865k199l8p256r971M589J096N916k893R457j3024q331M039
11967A8993J681j1960l806m035L376L389K652Q149l978j0465j2263P156J7414
11954A6303Q335p65M076l602m894j851R815N201R87l609J2841O347N547j2547
11940D2184j5405j0855p355O439q87l345N663N958N925P10N554j507j0928Q71
11926B3022J566P03P302Q982J1840J1374O907J7427J8868J3974Q470K1370N8851
$$ plain form
12024 331634 300892 244143 198063 152306 115153 86676 66332 43737 25709 18754 14082 17163
12012 17163 19451 23695 25254 12616 8438 6319 8853 2374 -2430 -5298 -5143 -4387 -8778 442 9899
11997 9899 4003 3908 6919 9841 18362 28126 31689 30090 22100 13954 13792 13689 10377 15089 7160 17035
11981 17035 22743 37608 35409 35371 28115 18144 22733 23829 29745 26852 36309 23285 14954 18993
11967 18993 20674 8714 4908 873 4249 7638 10290 18439 14461 3996 -8267 -1111 16303
11954 16303 24638 23873 27949 24347 19453 17602 27417 32618 33605 29996 42837 49184 54731 42184
11940 42184 26779 15924 8569 15008 14121 10776 16439 22397 28322 29032 34586 33079 22151 23022
11926 23022 24588 25291 32593 41575 53415 64789 71696 89123 107991 121965 130435 151805 210656
11913B10656J02228J35238J34522O6437k1293r3328j09029j04441r0728o5649
11903A64613m9475j6438j2969j6619j9304m017j3887J651r156j0770m928M067
11891A2768J274J402M844l025K486M603Q564n390j0356K12K683j098o555q014
11877D398K254M841k690r26L011p549m245j193J5991Q196j9159j2106Q123J988
11863I34J1145R352l022l835j685q546j3098J83J7507O756p32L807K635m927q0
11848A6394j2604R0J1185O477n642J560J93J1250o736o718Q277J1890k46k631
11834C2739k897j0222o830J0084n4n184j1459k206m064Q34Q329J327K620n30j7729
11819e242k58R42o562J4163O576N000r559k847q915J1243J6900M784N513j0641
$$ plain form
11913 210656 312884 448122 582644 649081 627788 534460 425431 320990 230262 164613
11903 164613 115138 98700 85731 69112 49808 45791 31904 33555 24399 13629 8701 12768
11891 12768 14042 15444 20288 17263 19749 24352 32916 27526 17170 17382 20065 18967 12412 4398
11877 4398 6652 11493 8803 7877 10888 3339 -906 -2099 13892 22088 2929 -9177 -1054 934
11863 934 12079 21431 18409 14574 12889 4343 -8755 -8572 8935 15691 14959 18766 21401 16474 16394
11848 16394 3790 3880 15065 21542 15900 17460 17653 28903 22167 15449 23726 35616 35370 32739
11834 32739 29842 19620 12790 22874 22820 17636 6177 3971 -93 741 9070 10397 13017 12487 -5242
11819 -5242 -5500 -4558 -11120 3043 9619 14619 5060 2213 -6702 4541 21441 26225 31738 21097
11805B1097Q56M876q042p972J3415mj1713q75J2940J4290j6002j9537l737J468
11791A060J1019l387K383R739j180j3700p285r399r567q02Q911o94J9926P902
11777A4926Q143J855J0472j908j7713q417k400R35M032j955L245k410j0834o351
11763h380o506Q485R650l292n20l227Q86O604J247L943Q233l419m003M192o946
11748F947q635N707J24K297P593P720n414Q406N34r028O808j3771j1866R122L628
11733A0172Q3m237k828K071k978N252Q974P627O094l901j1989K512L130q774p281
11718C927m76l37M960r407n738p419k57J1089J1818j1675m310k199K915P038j066
11703a137L863J4061K057k524p774j1137j3850j406J0273J2977J1627j3310l061
$$ plain form
11805 21097 21953 26829 18787 10815 24230 24226 12513 11638 24578 38868 22866 3329 -408 1060
11791 1060 12079 8692 11075 20814 19634 5934 -1351 -10750 -20317 -21119 -12208 -12902 7024 14926
11777 14926 23069 24924 35396 33488 15775 7358 4958 5893 9925 7970 11215 8805 -2029 -8380
11763 -8380 -14886 -6401 3249 -43 -563 -3790 -2904 3700 4947 8890 17123 13704 9701 13893 6947
11748 6947 -1688 4019 4143 6440 14033 21753 16339 24745 25279 16251 23059 9288 -2578 6544 10172
11733 10172 10255 6018 3190 5261 2283 7535 16509 24136 30230 26329 14340 16852 19982 11208 3927
11718 3927 3451 3114 8074 -1333 -7071 -14490 -14747 -3658 8160 -3515 -7825 -10024 -7109 -71 -1137
11703 -1137 2726 16787 18844 16320 8546 -2591 -16441 -17847 -7574 5403 17030 3720 659
11690F59P096L268O653k890K314j2556j1640K936j0422M040N447K528j4448p82
11676a7797P784R304J768J3258k579R90M94J1441J737j9489N074j2255k589P426
11662D567L038n878j552q262o038J921K295L76M470J6222o103l228N268q55M089
11647A0330m165J1270J4682r135j4795M13R890M500j1470j15J618n922l410M145
11633G836k406J244P343o090j1609m09n714M669L469M315L629l807P266j972n467
11618B297L072n598J1997N403N559K795m079J981m664r256o588J4177J1563j0894
11604A7765L365K546r61L287L678J1498K847M380Q530l848j1800J963q322j5365
11590A9563l436N885M330P388K388Q99M607j319J3855J8848L952j9020k2800j3690
$$ plain form
11690 659 7755 11023 17676 14786 17100 4544 -7096 -4160 -14582 -10542 -5095 -2567 -17015 -17797
11676 -17797 -10013 -709 1059 14317 11738 12728 13222 24663 26400 6911 11985 -270 -2859 4567
11662 4567 7605 1727 175 -8087 -14125 -12204 -9909 -9533 -5063 11159 5056 1828 7096 6241 10330
11647 10330 6165 17435 32117 22982 8187 8600 18490 22990 11520 11405 13023 7101 3691 7836
11633 7836 5430 6674 14017 7927 -3682 -4091 -9805 -5136 -1667 2648 6277 2470 9736 7764 2297
11618 2297 5369 -229 11768 17171 22730 25525 21446 23427 18763 9507 2919 17096 28659 17765
11604 17765 21130 23676 22715 26002 29680 41178 44025 48405 56935 53087 41287 43250 34928 19563
11590 19563 16127 22012 26342 33730 36118 37017 41624 40305 54160 73008 76960 57940 35140 21450
11576B1450J748N182p241N713K095m090L098r835j1999L822J068o593K672M785
11562A1875Q527J0643J810J1470O068l5K088j0359j7919J299K50k250O187q61
11548B8793Q911P804l710p960q799M826M336j037m964l129N907K306n36K37o501
11533B6484r928j4109l488k974L478J2309K823m634L77q800M38k074L404l057
11519B49p044M962L123Q606l580m531J5681M706j1882p581q72k881m442J0092
11505D606L262R353O134k1513q255o797r993O684R443P970l21l2j553J4516O109
11490A9613l241n490j455j0280N859N657l86r853o95Q45p451J0032N751r46o592
11475A368m212l892n890j2546M512P6M195J3495Q154k583j0479j403l456M97M219
$$ plain form
11576 21450 23198 28380 21139 26852 28947 24857 27955 18120 6121 9943 11011 4418 7090 11875
11562 11875 20402 31045 32855 44325 50393 50358 52446 42087 24168 25467 25717 23467 29654 28793
11548 28793 37704 45508 41798 33838 25039 29865 34201 33164 28200 25071 30978 33284 32748 32985 26484
11533 26484 16556 2447 -1041 -4015 -537 11772 14595 9961 10338 1538 1976 -98 3306 249
11519 249 -6795 -1833 1290 9896 6316 1785 17466 22172 10290 2709 1837 -1044 -5486 4606
11505 4606 7868 17221 23355 1842 -6413 -13210 -23203 -16519 -7076 894 573 541 -1012 13504 19613
11490 19613 16372 10882 9427 -853 5006 10663 10277 424 -271 574 -6877 3155 8906 7960 1368
11475 1368 -2844 -6736 -12626 -25172 -20660 -20584 -16389 -2894 5260 2677 -7802 -9205 -12661 -12164 -7945
11460g945j058Q473P023J352m164j0092j1749o151P101L859N798j403L869K171
11446b916m110m206n631J1531m03N592K369M55q833l850L685L587R451M170N198
11431A6089j2672p158j074Q119k46k877n464o060M217O497m829L70j216J548J056
11416c700J147l650O330n851m880k128P077J2149P32j2801p23j390j0140n082
11402b2910O946M26R609N881l77q659K09N234K714O644J2071k613J80k154j0632
11387B569p553R156J5214L433l569M671m834L152j648j6312j3443R74l95M713
11373c872N931K127M32j3967q177R34N445J8726n095k964M280N340n455o414J856
11358h73l177N314M654j472L909q501o771M29N71P87m482R086O871q457l737K49
$$ plain form
11460 -7945 -9003 -530 6493 7845 3681 -6411 -18160 -24311 -17210 -13351 -7553 -8956 -5087 -2916
11446 -2916 -7026 -11232 -16863 -5332 -5735 -143 2226 2681 -6152 -10002 -6317 -2730 6721 10891 16089
11431 16089 3417 -3741 -4815 3304 3058 181 -5283 -11343 -7126 -629 -5458 -5088 -6304 -4756 -3700
11416 -3700 -2553 -6203 127 -5724 -10604 -12732 -5655 6494 7226 -5575 -6298 -7688 -17828 -22910
11402 -22910 -15964 -15538 -5929 -48 -425 -9084 -8875 -3641 -927 5717 17788 15175 15355 13201 2569
11387 2569 -4984 4172 19386 22819 19250 23921 19087 22239 20591 4279 -9164 -8190 -8585 -3872
11373 -3872 2059 4186 4618 -9349 -17526 -16592 -11147 7579 2484 -480 3800 9140 3685 -2729 -873
11358 -873 -4050 1264 5918 4446 8355 -146 -6917 -6488 -5917 -5130 -9612 -526 6345 -2112 -5849 -5600
11342e600m213n340J1212J5999n610j487K629L126J5891N81L073o573l810K864
11328B2742J0144M623m842J0567J3928K6273N008j4297n281o229j2543q905j2733
11315B8455j1003j291k789K143J1860M812k195m011j2988j2357j1499q162K745
11302a6280Q467r89o704L050M009J2903J0046p538j728k664l295p127O688O569
11288E407J085J6826J5462o03j0169l77j04j1398r589r990k104p861k965J1431
11274d949Q014M686J3614Q100N031k522r216k0931J169M953k780N262o544j378
11260B509k296J02j855n647n857P189L329J0790L845L22K296o654j8082n168Q756
11245f421L043J0968M050m136q396j2500N053Q476N665M937J483n936o639m936
$$ plain form
11342 -5600 -9813 -15153 -3941 12058 6448 4961 7590 10716 26607 27188 30261 23688 19878 22742
11328 22742 32886 37509 32667 43234 57162 83435 88443 74146 68865 62636 50093 41188 28455
11315 28455 17452 16161 13372 15515 27375 32187 29992 25981 12993 636 -10863 -19025 -16280
11302 -16280 -7813 -8802 -15506 -12456 -8447 4456 14502 6964 5236 2572 -723 -7850 -1162 5407
11288 5407 6492 23318 38780 38177 28008 27631 27527 16129 6540 -3450 -5554 -13415 -16380 -4949
11274 -4949 3065 7751 21365 29465 34496 31974 22758 1827 2996 7949 5169 10431 3887 2509
11260 2509 213 315 -1540 -7187 -13044 -5855 -2526 8264 12109 12431 14727 8073 -10009 -15177 -6421
11245 -6421 -3378 7590 11640 7504 -892 -13392 -8339 137 5802 10739 12222 6286 -353 -5289
11231e289o558Q247Q057j812P15J1395M504n84j1545L782J0565J5766J2441K3354
11217G3038L1330K7367K2334l543K35m020k1488k5920k1855l5614j3509l794r019
11204A5542j5467o576P590p563Q917R839p642J597l395J623Q870R747j288j3029
11190H765j5976N821j3878n671J069J1145L939o43J0451J0359J3628P483J1774
11177D8266K326n909M609J7402R033j565J7374J6513J9693L0840N6588O6905Q8977
11164C71052J27555K15024L63119N88044O93813K83298l11043m55478m32539m16412
11154A026433l53040k33900j26532q5657o1310k4438j9902k1694j1545L587o222
11143H5780k0087j3808k610L526M711j1148j1012n406P422J4412O804q339j2707
$$ plain form
11231 -5289 -11847 -3600 4457 2645 3360 14755 19259 18675 7130 10912 21477 37243 49684 73038
11217 73038 104368 131735 154069 150526 150761 146741 125253 99333 77478 41864 28355 24561 15542
11204 15542 75 -6501 1089 -6474 2443 12282 4640 6237 2842 4465 13335 23082 21794 8765
11190 8765 -7211 -1390 -15268 -20939 -19870 -8725 -4786 -5429 5022 15381 29009 36492 48266
11177 48266 50592 44683 49292 66694 75727 74162 91536 108049 127742 158582 215170 282075 371052
11164 371052 498607 713631 1076750 1664794 2358607 2641905 2330862 1875384 1442845 1026433
11154 1026433 673393 439493 312961 227304 165994 141556 121654 99960 88415 92002 85780
11143 85780 65693 51885 49275 52801 57512 46364 35352 29946 37368 51780 58584 50245 37538
11130C7538k2051q913J0222m512j5902l088k47J527j142p63k181M215O547K503
11116C753m899p206j6127j678m020K928P304J15k155J241P500J689m215Q582M522
11101b666k349n206k581l413n026L590J458O850N619L25P084l895j0267j5877
11087b6354L505J0448L086n787m541J4347N221l514P277k184n275J2572L653q899
11073C555k159j1282q727q493L788R561J4787N052P67j1376k1834j8207j514J1041
11059c5041L727J0138k462j7766j69K083J376J5026L4076J6124N991N70j0458
11046B3215P201P123r148r050L299R938R795j1642j3330o571l733J4221J4053
11033C5371j6770j8985K05j1803j5717N3N098Q544L301M17K251o689L712l99M293
$$ plain form
11130 37538 15487 6574 16796 12284 -3618 -6706 -6953 -5426 -6568 -7331 -9512 -5297 1250 3753
11116 3753 -1146 -8352 -24479 -26157 -30177 -27249 -19945 -19830 -21985 -20744 -13244 -11555 -15770 -7188 -2666
11101 -2666 -5015 -10221 -12802 -16215 -21241 -17651 -16193 -9343 -3724 -3399 3685 -210 -10477 -26354
11087 -26354 -22849 -12401 -9315 -15102 -19643 -5296 -75 -3589 3688 1504 -3771 8801 12454 3555
11073 3555 1396 -9886 -18613 -27106 -23318 -13757 1030 6082 6849 -4527 -26361 -44568 -46082 -35041
11059 -35041 -31314 -21176 -23638 -41404 -41573 -39490 -38114 -23088 10988 27112 33103 33673 23215
11046 23215 30416 37539 28391 19341 22640 32578 42373 30731 17401 10830 7097 21318 35371
11033 35371 18601 -384 -179 -11982 -27699 -27646 -22548 -14004 -10703 -10286 -8035 -14724 -11012 -11411 -7118
11018g118J3412L3355K7573L0708M1780M8839M0402N6946J6018l5942j6310l6683
11006B12980r3607r5373l3124p129N322K4571O619J5781J4016n76j1259j7464
10994B0757k4618k5137k1993j6428j0390P144N347J6755J5266J4259m455j3501
10982c6994l868O561Q895J1721K963L96j855n931Q179k728j3442L490K173O473
10968a3967N346M334K870K302j7958j3856L525L159J343P062o113j590J2427O8
10954a1048K31K6751K9288K1307J132j7999k6102k3873M137J4235J2454k1403
10942I110l9205j4367o618O484j3417j5299j3232N420N550J9243K271j365K715
10929e2710L188j4349j4298k537J4352M761n749K8558R469Q798Q465R755R249
$$ plain form
11018 -7118 6294 39649 67222 97930 139710 188549 228951 285897 301915 265973 249663 212980
11006 212980 119373 24000 -9124 -16253 -10931 13640 20259 36040 50056 49480 38221 20757
10994 20757 -3861 -28998 -50991 -67419 -77809 -70665 -65318 -48563 -33297 -19038 -23493 -36994
10982 -36994 -40862 -34301 -25406 -13685 -10722 -10326 -12181 -18112 -9933 -12661 -26103 -22613 -20440 -13967
10968 -13967 -8621 -4287 -1417 885 -17073 -30929 -27404 -24245 -22902 -15840 -21953 -23543 -11116 -11048
10954 -11048 -10817 15934 45222 66529 67661 49662 23560 -313 3824 18059 30513 9110
10942 9110 -30095 -44462 -51080 -44596 -58013 -73312 -86544 -81124 -75574 -56331 -54060 -55425 -52710
10929 -52710 -49522 -63871 -78169 -80706 -66354 -61593 -67342 -38784 -29315 -20517 -12052 -2297 6952
10916F952J8456Q536J1037J0115L1805J2185m317l3003l3941q135J1881K1009
10904E2580N0379M0937N373K771R920J0668J6290P375M42O617N520j0844k1357
10891A76671j1536j4851j9149m040r295j0405K4737K4547L3516J4332j6824l0366
10879A57337o4760o7625m9113l0473j3499J364J2628O828J8224R743R936k349
10867a1759L727j1002l079Q523J3747J9616M380j525Q849P181P343l341m740l595
10853C4325j6441j7054J568J2739J1053O947J0365j1622j1204j1849j2049N313
10841B091K3848L3619K4486K3697L420j78k073M792N584J9431J2143M801J2192
10828A67853J5158n65k735O162J534K6630L9447K5864K4201L4995K8656M3035
$$ plain form
10916 6952 25408 33944 44981 55096 86901 99086 94769 61766 27825 19690 31571 52580
10904 52580 102959 143896 149269 152040 161960 172628 188918 196293 196735 203352 208872 198028 176671
10891 176671 165135 150284 131135 127095 117800 107395 132132 156679 190195 204527 187703 157337
10879 157337 92577 24952 -24161 -54634 -68133 -66769 -54141 -47313 -29089 -19346 -9410 -11759
10867 -11759 -8032 -19034 -22113 -13590 157 19773 24153 22628 31477 38658 46001 42660 37920 34325
10853 34325 17884 830 2398 15137 26190 33137 43502 31880 20676 8827 -3222 2091
10841 2091 25939 59558 84044 107741 111161 110983 108910 113702 119286 138717 150860 155661 167853
10828 167853 183011 182446 179711 185873 187407 214037 253484 279348 303549 338544 367200 410235
10816D10235O2876O0104M9192L8530P201J9485M0533O1323P2427R4987Q1337N9232
10804A057462K7430M736r831J8026Q8338J59262J99600K35231K60710K62914L05270
10793B609148L52216L89578M42857N47521P00058Q66765J081550J396461K001769
10784A0387923L215554N772080J0115325J3804177Q776646l899041p921652o336122
10776C3914890n933859n148567l422365j600776k55512N76140J228665J934077
10768B1292693K747831L694136M876499O527970Q736405J2091793J7785384K7820396
10760A05573107M6969628Q0918205J20468722J11643577J0071399p5718666p9664401
10753C20261571p5217786p4052529n7503230l5963545k1470827j3322661q765251
$$ plain form
10816 410235 473111 533215 582407 620937 628138 647623 688156 749479 821906 916893 998230 1057462
10804 1057462 1084892 1089628 1079797 1097823 1186161 1345423 1545023 1780254 2040964 2303878 2609148
10793 2609148 2961364 3350942 3793799 4341320 5041378 5908143 6989693 8386154 10387923
10784 10387923 13603477 19375557 29490882 43295059 52071705 48172664 40251012 33914890
10776 33914890 27981031 22832464 19410099 17809323 17553811 18129951 19358616 21292693
10768 21292693 24040524 27734660 32611159 39139129 47875534 59967327 77752711 105573107
10760 105573107 152542735 233460940 353929662 465573239 475644638 399925972 320261571
10753 320261571 245043785 170991256 113488026 77524481 56053654 42730993 33965742
10746C3965742o159470m497000l408768k719314k194141j775997j404459r17917
10738A0888676m02338k53079o94827j058172r38487q19055p26838n80156m61269
10729D954455m11001l89835l54221k88012k15124j65790j35047j27220j06218
10720B761987p2716o6511r7536r3796n5871l6674l9500n2105p5372j26223j70392
10709A875291j55766j36942j10659n3496j6795m21j1926l6831n3209n8356m6115
10698A194775k7215q823Q16q565j9351j4316k2334l5026j9147n481j6819k1396
10686I97118k8706k6407j2782j818n319j3237j7994k5052j2006j5442k6695l4689
10674G76971j7078o87K783J365O10m252j5308k3431k1806k0276m390K827j1367
$$ plain form
10746 33965742 27806272 23309272 19900504 17181190 14987049 13211052 11806593 10888676
10738 10888676 10486338 10233259 9538432 8480260 7541773 6722718 5995880 5415724 4954455
10729 4954455 4543454 4153619 3799398 3511386 3296262 3130472 2995425 2868205 2761987
10720 2761987 2689271 2622760 2525224 2431428 2375557 2338883 2299383 2247278 2171906 2045683 1875291
10709 1875291 1719525 1582583 1471924 1418428 1401633 1401212 1389286 1352455 1299246 1240890 1194775
10698 1194775 1167560 1158737 1159553 1150988 1131637 1117321 1094987 1059961 1040814 1035333 1018514 997118
10686 997118 968412 942005 929223 927405 922086 908849 890855 865803 853797 838355 811660 776971
10674 776971 759893 759206 761989 763354 763964 759712 744404 720973 699167 678891 674501 677328 665961
10661F65961j6383k4335j9924j9770j2461j5409j1584j6451m342L350R747q848
10649E29551K750J9714P165j0510j4163m013K16j0494M644J4008P049J1475J1534
10636E68926J4737l33l2286m9110m4844m6955j4111K869R105j6437m4995l8578
10624C07988j7914q453j885j8408m6181l0527j9373j3384N74m411n276k666m818
10611A35266O244J4922K2803K4333K1472L9906L2914j4696m8744n9119q545M8016
10599B14772M7498J7961J1538Q916n341j0733M631J3012J1536J269O136k493M496
10586C23198j082N198m3k0465k4047o356J4496R93o285J3256P788L089P367j7367
10572B99740m5556k9783p316J0320J891l211l510k6204k1261j7986j519J6121
$$ plain form
10661 665961 649578 625243 605319 585549 573088 557679 546095 529644 525302 528652 538399 529551
10649 529551 532301 552015 559180 548670 534507 530494 530710 520216 524860 538868 545917 557392 568926
10636 568926 583663 583330 551044 501934 457090 410135 396024 398893 407998 391561 346566 307988
10624 307988 290074 281621 279736 261328 215147 184620 165247 151863 152437 148026 142750 140084 135266
10611 135266 141510 156432 179235 203568 225040 264946 297860 283164 234420 175301 166756 214772
10599 214772 262270 280231 291769 300685 295344 284611 289242 302254 313790 315059 321195 318702 323198
10586 323198 322116 327314 327271 306806 282759 276403 290899 291892 285607 298863 306651 309740 317107 299740
10572 299740 254184 224401 217085 227405 229296 226085 222575 196371 175110 157124 155605 171726
10560A71726J7105J2935R097J220R758K929O663J9442L0229J3270K3337N6035
10548C73746Q7332L6313k2792n6330l7251m9954m6671l7155j6876j0577r385k0662
10536A89738p233J3006J3686P332n310m693q606O445O666K969J0629J5638K4022
10523B64289P404n339j3860o94n153j1407O252K5425N2105J06443J71099K20186
10511H16750J54111k478j10248j22016j26273j22829r3901p4272m3149j8699k4510
10500B32486k8388k4525r929R625P134L615R680J0724j0266k3367r909j0658o293
10487A49929Q123N631k031j0665j2401k615j6605m647k099J2844J8055j271p788
10474A34460m278N432j2722k3132k285k009K963j5104q291P206J6870J5253k071
$$ plain form
10560 171726 188831 201766 210863 212083 221841 224770 231433 250875 281104 294374 317711 373746
10548 373746 461078 497391 474599 418269 381018 331064 284393 247238 230362 219785 210400 189738
10536 189738 182505 195511 209197 216529 211219 206526 197920 204365 211031 214000 224629 240267 264289
10523 264289 271693 266354 252494 251800 246647 235240 241492 266917 319022 425465 596564 816750
10511 816750 970861 968383 858135 736119 609846 487017 393116 318844 275695 256996 232486
10500 232486 204098 179573 169644 179269 186403 190018 199698 210422 200156 176789 166880 156222 149929
10487 149929 158052 163683 161652 150987 138586 135971 119366 114719 112620 125464 143519 142248 134460
10474 134460 130182 135614 122892 99760 97475 95466 98429 83325 75034 82240 99110 114363 112292
10461A12292L693J1374J8359K20p708P138J4562J3052j157r987L956K921l777
10448A64938j0532j8008m499M316k517J2653Q405l778k0421k1022p017R252J1285
10435A23055K205M71R33j769K39J6370Q674J6641K3739R749J755R038n28j0371
10421B00201J934J1666j46j1897k1982j6257l177q657N846K595j3073j4938J2014
10408A44129J3066q426p721p968j5036n27m855L069K723j3369m385M940r600L920
10394I9960J4194K34K949J2509P232r73j2109l423j0370L825l42L691k386N823
10380A20814k867j228k092P094J7473P711P733j0701j7075M13O919R276k76Q224
10366A51418J6105M604N770m13M898P230J9456K4631M3581M4439M6495O2631Q5498
$$ plain form
10461 112292 115985 127359 145718 145938 138230 145368 159930 172982 171825 161838 165794 168715 164938
10448 164938 154406 136398 131899 136215 133698 146351 154756 150978 130557 109535 102518 111770 123055
10435 123055 125260 125731 126664 124895 125134 141504 150178 166819 190558 200307 202062 211100 210572 200201
10421 200201 202135 213801 213655 201758 179776 163519 160342 151685 157531 160126 147053 132115 144129
10408 144129 157195 148769 141048 133080 118044 117517 112662 115731 118454 105085 100700 105640 96040 99960
10394 99960 114154 114388 117337 129846 137078 136105 123996 120573 110203 114028 113686 117377 114991 120814
10380 120814 117947 116719 114627 121721 139194 146905 154638 143937 126862 127275 134194 143470 143194 151418
10366 151418 167523 172127 177897 177484 182382 189612 209068 233699 277280 321719 368214 430845 516343
10353E16343J59691K67746M66404O67128N89541J0313m14255m23312m07024l65858
10343A066717k78315j72492j01122n5723n2782m7783l8088l4232l2853l6869j7256
10332A99202q931j1078n634p33k3658r830j0249j2764r500p938k20k000k870l766
10318I0031N068J0814R136j4486j2133N449P440l115r540Q97N486J0821L940m608
10304A05200j101N744N54p452o418j0185k070l774k898j3444J590o004n663m170
10290D9909l353Q86J7529O035l281j0435j0417N040P285K703k1728P03J9362R474
10276F9712o39n544K000j569k268P367l79J3213M661o337k878J2156J1510j855
10262I9150r920o091K082J2807J9316J8160n423j8009j4741j0955N98q348k560
$$ plain form
10353 516343 676034 943780 1410184 2077312 2666853 2677166 2262911 1839599 1432575 1066717
10343 1066717 788402 615910 514788 459065 406283 358500 320412 286180 253327 216458 199202
10332 199202 190271 179193 173559 172826 149168 139338 129089 116325 106825 98887 98667 96667 93797 90031
10318 90031 95099 105913 115049 100563 88430 93879 101319 98204 88664 89561 95047 105868 109808 105200
10304 105200 104099 109843 110397 102945 96527 86342 84272 80498 77600 64156 65746 59742 54079 49909
10290 49909 46556 47442 64971 71006 67725 57290 46873 51913 59198 61901 40173 40876 60238 69712
10276 69712 69073 63529 65529 63960 61692 69059 68680 81893 86554 80217 77339 89495 101005 99150
10262 99150 89230 83139 85221 98028 117344 135504 130081 112072 97331 86376 86974 78626 76066
10249G6066M315J631O464l277j191N527k4797k207J6445J1982J992q663P49q647
10235G6389q558j1585j141L367O944Q176n368o878j011J896m806j903n077l38
10221E0107l88j929N869K993L124j986J657n444K097M816m571j442l620j1123
10207D0160n238Q839M217J0105n678J925k275J562P764K098j4252J0289M077r409
10193E4184j127j404L100o32K730J1929n179p853P145Q99l739J265j0897r560
10179D0861J4909N368n997j904l938n941j157K51J791J2320M144L970k259p665
10165E4753p916J540Q15l5M642r719n815m60O099J5194k079j1309p087p227L500
10150C4896M303N533M022q54M79l375n97M640Q391L175k489m482o175N14o827
$$ plain form
10249 76066 80381 82012 88476 85199 84008 89535 64738 62531 78976 90958 92950 84287 85036 76389
10235 76389 67831 56246 55105 58472 65416 73592 68224 61346 60335 62231 57425 55522 50445 50107
10221 50107 49719 47790 53659 56652 59776 57790 59447 54003 56100 60916 56345 54903 51283 40160
10207 40160 34922 43761 47978 58083 52405 54330 52055 53617 61381 63479 49227 59516 63593 54184
10193 54184 53057 51653 54753 54121 56851 68780 63601 55748 62893 63792 60053 61318 50421 40861
10179 40861 55770 61138 55141 53237 49299 43358 42201 42452 44243 56563 60707 64677 62418 54753
10165 54753 46837 48377 49192 49157 53799 44080 38265 37805 43904 59098 57019 45710 38623 31396 34896
10150 34896 39199 44732 48754 47900 48379 45004 44407 49047 57438 60613 58124 53642 47467 47981 41154
10135D1154r610R289O510L285j627j3902k066L77M052J0774M501o548l116l327
10121C9746N431J3052o200r483J872M058j42L873l364r445k338o78k677Q465k260
10106C9910N35J1724p472j384j609J87j517O608n049j0968K109O612M631L982
10092D8299P588j0683p361N133m694r580O735L09p238l951K301j656n249L630
10078B3583J6005J1721l39L004L213j9213o129J2654k587L954J38J036r07q799
10064C7334J222K571p191k200j870J3022Q373J2425p04j0064K968P982M220J74
10050F8262k038p80j0086l806l404P307P340j797j8831j1688l128j239j241r59
10036B3912L872J0294N864o370r014j571N723J966j1554j3762l55Q119j221P666
$$ plain form
10135 41154 31544 40833 47343 50628 49001 35099 33033 33410 37462 48236 52737 46189 43073 39746
10121 39746 45177 58229 52029 42546 44418 48476 48334 52207 48843 39398 37060 36382 33705 42170 39910
10106 39910 40445 52169 44697 43313 41704 41891 40374 46982 41933 30965 33074 39686 44317 48299
10092 48299 55887 45204 37843 42976 38282 28702 35437 35746 28508 24557 26858 25202 19953 23583
10078 23583 39588 51309 50970 53974 57187 37974 31845 44499 41912 45866 46004 47040 46133 37334
10064 37334 38556 41127 33936 31736 29866 42888 51261 63686 62982 52918 55886 63868 68088 68262
10050 68262 66224 65444 55358 51552 48148 55455 62795 60998 42167 30479 27351 26112 24871 23912
10036 23912 27784 38078 43942 37572 28558 26987 32710 34676 23122 9360 9005 17124 15903 23569
10022B3569m24L943N783K650j14J477P138r02J386n79m7p202p143N41L02R104
10006C9482M980M89n435P166J014j2945m351Q850l329K67J305P899r932O282M57
9991D2199p483J0273J2016j3707j2651N02J394N970o854k394P206M42j1213j443
9977B4257j476p803K718q94K846K09j473N46J1138p124n571Q111J0056J5208j708
9962D9040q277r290p65o965m032q728K382O081j2907j0769J078J462l871K8450
9948B2889Q452j034O669j1634p041K650J1291O161J464R92j0070M583J5236J1206
9934F1814p428r488p571p668m523J0764N463l738P454l329J315J4939O453J0615
9920G5072j1273p869j3313j772j0762O235K405j1150m921l351o515M551j1205
$$ plain form
10022 23569 23145 27088 32871 35521 35407 36884 44022 43120 44506 43927 43880 36678 29535 30076 30378 39482
10006 39482 44462 44951 39516 46682 47696 34751 30400 39250 35921 36188 37493 45392 35460 41742 42199
9991 42199 34716 44989 57005 43298 30647 31149 32543 38513 31659 29265 36471 36913 25700 24257
9977 24257 22781 14978 17696 16802 19648 19857 18384 18930 30068 22944 17373 25484 35540 50748 49040
9962 49040 40763 31473 30708 23743 19711 10983 13365 19446 6539 -4230 -3152 -1690 -5561 22889
9948 22889 31341 30307 36976 25342 18301 20951 32242 38403 39867 40859 30789 35372 50608 61814
9934 61814 54386 44898 37327 29659 25136 35900 41363 37625 45079 41750 43065 58004 64457 75072
9920 75072 63799 55930 42617 40845 30083 36318 38723 27573 22652 19301 12786 17337 6132
9907F132P105k56j3212L214J2748M583J9541R748m800r830k61j7865p97P829K263
9892B6142J2204N952Q16L349L617O583j2528j5207L666J0742P633j017m710N15
9878D7757P668j0372n290M86J129K682j0346n689L536R986o091N756K0579Q68
9864F2659j7595J558J4375n771j0028j2908j81k490j845K042j090l836J682O260
9850C2832J040j0619n684k187j720J8237J0940j0701j6008j4062P95L316J0576
9837A6755M166m533l101m769p37r3n895k692J2432M601J4771J5656o632m932j619
9822C3378n950l989J363j631q96M268j525R312m83p59J2182K784k664O229o885
9807D4734n745L834j0680K346L264m964l394J957J1174r851m741P171O9p018q922
$$ plain form
9907 6132 13237 12981 -231 2983 15731 20314 39855 49603 44803 34973 34712 16847 16050 23879 26142
9892 26142 38346 44298 45114 48463 52080 58663 46135 30928 34594 45336 52969 51952 47242 47757
9878 47757 55425 45053 39763 40249 41378 44060 33714 28025 31561 41547 35456 41212 61791 62659
9864 62659 45064 46622 60997 55226 45198 32290 32109 29619 27774 29816 28726 24890 26572 32832
9850 32832 33872 23253 17569 15382 13662 31899 42839 32138 16130 2068 2863 6179 16755
9837 16755 20921 16388 13287 8518 7781 7688 1793 -899 11533 16134 30905 46561 39929 34997 33378
9822 33378 27428 23439 24802 23171 22275 26543 25018 34330 33847 33088 45270 48054 45390 51619 44734
9807 44734 38989 42823 32143 34489 37753 32789 29395 31352 42526 32675 27934 35105 35174 28156 19234
9792A9234J199P871q921M801M761o667k515M116R355j533l024l959m658k458m004
9777A3598J1926m344p124J1774P351M041N672j1699J096M004m151R993p080j8481
9763A6576j0297r983J1488J9515m751J505j771n996j512n014L71j350N264m95
9749A3550K508M625J472N593j063K98n061l141l232r87O517N261J3159n599j3388
9734B0512k0810q5J4353J1897O921q846j7786O26J0766J9116j907n788o376p088
9720A5505J120r591M683J4580L624p25Q423K253L160o364n241j1212j3147p65
9706F303N255J597j4258O251M581k693j062J1967J1066J696P707M12m854O392
9692D0360l183j7834n796P732R784r966k97j900q106P52m175K771P832p668n657
$$ plain form
9792 19234 20433 28304 19383 24184 28945 22278 19763 23879 33234 31701 28677 24718 20060 17602 13598
9777 13598 25524 21180 14056 25830 33181 37222 42894 31195 32291 36295 32144 42137 35057 16576
9763 16576 6279 -3704 7784 27299 22548 24053 22282 16286 14774 9760 10131 8781 14045 13550
9749 13550 16058 20683 22155 27748 26685 26983 21922 18781 15549 14562 21079 26340 39499 33900 20512
9734 20512 -298 -383 13970 25867 32788 23942 6156 6782 17548 36664 34757 28969 22593 15505
9720 15505 16625 7034 11717 26297 29921 29196 37619 39872 43032 36668 31427 20215 7068 6303
9706 6303 11558 13155 -1103 5148 9729 7036 5974 17941 29007 30703 38410 38822 33968 40360
9692 40360 37177 19343 13547 21279 31063 21097 20800 18900 10794 11546 7371 10142 17974 10306 4649
9677D649J715nk869K222j227M962J1242Q80r917p157k378m480j86M70K96J0149
9661H366o157K12m732O082L061M131J2059p297q189M00q7N160l738M497j0620
9646C148j0297L712J4764J6086K337L595k385n165m484p091n076p19n130J753
9632E048K726J2435L063j1243o653o674J0006J0801L544K319k28k373n328k434
9618A5009j445P822N821N611j5376m625k92J279l918R713J272O95m662l407J085
9603A4582K944N679K531j526m387q635j4830O911P991N757M72J988o947n465M222
9588A1287J1840k664m522M464J894r511k724l609R413K793R309l34L665m846n305
9573B1150J1585j2626q202q391n503J4028K767r51j032N18q447R371R388J0718
$$ plain form
9677 4649 6364 6359 3490 5712 4485 9447 20689 21569 11652 4495 2117 -2363 -2549 -2079 -1783 8366
9661 8366 2209 2421 -2311 3771 6832 10963 23022 15725 7536 7936 7849 13009 9271 13768 3148
9646 3148 -7149 -3437 11327 27413 29750 33345 30960 25795 21311 14220 9144 8425 3295 5048
9632 5048 7774 20209 23272 12029 5376 -1298 8708 19509 23053 25372 25144 22771 17443 15009
9618 15009 13564 21386 27207 32818 17442 12817 12525 13804 9886 19599 20871 21566 16904 13497 14582
9603 14582 17526 23205 25736 24210 19823 11188 -3642 3269 11260 17017 17489 19477 12530 7065 11287
9588 11287 23127 20463 15941 20405 22299 12788 10064 6455 15868 18661 27970 27636 31301 26455 21150
9573 21150 32735 20109 11907 3516 -1987 12041 14808 13857 12825 13343 4896 14267 23655 34373
9559C4373m722p36N395r153j729l86M978K071k436q258j2988P217J366j0350L667
9544H309R749J786L674l954N027n791j0647p611J173J0472k319N30K678j522j1424
9529A30m187O126Q413R156p017n981j585M153P474l612J334M434p653L385O447
9514B1017J454l575p576l334O964K200q057q356j382P761O908P598O033j3380
9500A4275p872K758O918N690l664n347k265N74J0448L855j1641p291j2421Q841
9486B858K0036R704m626j3154j2879l082K0869N765k409l444L940m21q898n615
9472H644j609M772M115j439o141l414l030j87m004Q766J3147P974p49j8984J215
9457I076R47p07K853j96m532P776m883q5J3336K61m897m665O828P74l452k256
$$ plain form
9559 34373 29651 28915 34310 25157 23428 23042 28020 30091 27655 19397 6409 13626 14992 4642 8309
9544 8309 18058 19844 23518 19564 24591 18800 8153 542 1715 12187 9868 10398 13076 11554 130
9529 130 -4057 2069 10482 19638 12621 6640 5055 9208 16682 13070 14404 18838 11185 14570 21017
9514 21017 22471 18896 11320 7986 14950 17150 9093 737 -645 7116 14024 21622 27655 14275
9500 14275 6403 9161 16079 21769 18105 12758 10493 11067 21515 25370 13729 6438 -5983 2858
9486 2858 22894 32598 27972 14818 1939 -1143 19726 25491 23082 19638 23578 23157 14259 8644
9472 8644 7035 11807 15922 14483 8342 4928 1898 1711 -2293 6473 19620 27594 26845 7861 9076
9457 9076 10023 9316 12169 11973 7441 15217 10334 10249 23585 23846 18949 14284 21112 21886 18434 16178
9441A6178J647N928J703K914K370p160j610m085K07j1510p926J826M888L150J112
9426I632j0739N987N833p215j1997k820J2772Q986J8943M037L469O350q356N08
9412C5390M106m86p806q033o420n931l608R806O109k496n751O260l007K674J286
9397B2093q938P73J614J267K767L030n869J1171o348k1309n618M884j994l073
9383e550J283N767Q368Q567r022j0780M914L709r837j0057K370O002M812L037
9369C583j685l428J1217P780p367J892o384k510J3791J4618j0053j5675j1822
9356f043L633L480Q829P784N563m34p64j6325j8679m003P00J3179J3834L493j451
9341A2796L860p32p86J208Q505N632q717O904k037j653j0560p822J471K393m082
$$ plain form
9441 16178 17825 23753 25456 28370 30740 23580 21970 17885 18092 6582 -1344 482 5370 8520 9632
9426 9632 -1107 4880 10713 3498 -8499 -11319 1453 10439 29382 33419 36888 43238 34882 35390
9412 35390 39496 39010 31204 23171 16751 10820 7212 17018 23127 20631 14880 21140 18133 20807 22093
9397 22093 13155 13928 15542 16809 19576 22606 16737 27908 21560 251 -5367 -483 -2477 -5550
9383 -5550 -4267 1500 9868 18435 9413 -1367 3547 7256 -2581 -12638 -10268 -4266 546 3583
9369 3583 1898 -1530 9687 17467 10100 11992 5608 3098 16889 31507 21454 5779 -6043
9356 -6043 -2410 1070 9899 17683 23246 22812 22048 5723 -12956 -16959 -16259 -3080 10754 14247 12796
9341 12796 16656 15924 15138 16346 24851 30483 21766 28670 26633 24980 14420 6598 8069 10462 6380
9326F380q956l920j50K948P750r45q806j167L437J1794M513m314r758j0677Q35
9311a1036J3137l159N85p069O97J1666J2622k591j7903M5J1129K001q729Q623
9297A0018p30J553j264J581m003r85R873P889j1995r15j393p04j1337R82J1358
9282I928O594Q37J0525N895q366j9859n939l419m847k93m44M410r8m040k68J2217
9266B833J3041J1833j87o020j1559P431m246L352M362P02l372j1011N97O975J226
9251A5957L377j4206L544J0774j0685M334o969k07n105q687r169J1360J5374j394
9237H298j0344J663J0291k085m889n103P59Q168p04L062l086L90P947R367Q253
9222C1987k663o097M943R48p064r919m702m64K676J018J092J2677L608N09q494
$$ plain form
9326 6380 -2576 -6496 -6646 -3698 4052 3107 -5699 -6866 -3429 8365 12878 8564 -1194 -11871 -11036
9311 -11036 2101 -1058 -473 -7542 -6845 4821 17443 14852 -3051 -3006 8123 10124 1395 10018
9297 10018 9288 10841 9577 11158 7155 6170 16043 23932 11937 11022 9629 8925 -2412 -1430 9928
9282 9928 16522 17359 27884 33779 25413 5554 -385 -3804 -8651 -8944 -9388 -4978 -5076 -9116 -9384 2833
9266 2833 15874 27707 27520 21500 9941 17372 13126 16478 20840 21542 18170 7159 7756 14731 15957
9251 15957 19334 5128 8672 19446 8761 13095 6126 5919 814 -7873 -17042 -5682 9692 8298
9237 8298 -2046 -383 9908 7823 2934 -2169 -1410 6758 6054 9116 6030 6420 14367 23734 31987
9222 31987 29324 23227 28170 29118 22054 12135 7433 6969 9645 10663 11755 24432 28040 28549 20055
9207B0055j5658J949P887n948l695p795q158j022r05M877l114L598Q401J8569
9193A9041N103N318j236j6548j1808n38R24j1696j0360M006J3733J1754M624n717
9179F600j4974j4109M752Q941J0513R640J0208L848K009n665L272l043j2297J0897
9165B0592K071j2892j2604o977J2385J9199l891l053r89j169j8931k180O052J8800
9151A6413J6873M430j5608j5713J901n024L828Q980J254l387m563n916M575j491
9137F552L643M62O732q112J555J0419n795K3o196o187n298Q701n90O428n891J2243
9121A8689R839o675j1228J0806M482J057J768O761j6717o079m792j382l679q34
9107B016M551J1956M212l934k782L703O135P847r642j7472r422M526O099L933
$$ plain form
9207 20055 4397 6346 14233 8285 4590 -3205 -11363 -12385 -13290 -8413 -11527 -7929 472 19041
9193 19041 24144 29462 28226 11678 -130 -668 256 -11440 -21800 -17794 -4061 7693 12317 6600
9179 6600 -8374 -22483 -17731 -8790 1723 11363 21571 25419 27428 21763 25035 21992 9695 20592
9165 20592 22663 9771 -2833 -9810 2575 21774 17883 14830 13841 12672 -6259 -8439 -2387 16413
9151 16413 33286 37716 22108 6395 8296 3272 7100 16080 17334 13947 9384 3468 8043 6552
9137 6552 10195 10657 17389 9277 10832 21251 15456 15479 9283 3096 -2202 6499 5909 12337 6446 18689
9121 18689 28528 21853 10625 21431 25913 26970 28738 35499 18782 12703 7911 6529 2850 2016
9107 2016 6567 18523 22735 18801 16019 19722 25857 33704 24062 6590 -2832 1694 7793 11726
9093A1726j8242n337P121O964j456q447j731J5282l507J829K153j6474L641J0707
9079D229N610J085M418r732M01n052M003J1937p336m419L065R212P077j0662j6342
9064b506n704J989n582n50R219n126k347J481R682l832j0488K970N774M955L096
9049C031P038l64n978O521n23n135N637R268L457J0499Q128o737j6066q20O35
9034A8591O00m543j6080j3035Q70l27k473J3357J8762J1081L550O478n597j3163
9020A8071j5239J367K124M550K1029l31m035j537j685j8560j3392R657Q483L508
9006A4010l877k333O69J278n229l63Q951J400o887l035P001n070n125O570J179
8991I139L652l166j2127M28o757R06K037L419L43m604J877R767J0554K34l269
$$ plain form
9093 11726 -6516 -11853 -4732 2232 776 -7671 -9402 5880 2373 4202 6355 -10119 -6478 4229
9079 4229 9839 10924 15342 5610 6011 959 4962 16899 9563 5144 8209 17421 24498 13836 -2506
9064 -2506 -8210 -6221 -11803 -12353 -3134 -8260 -10607 -9126 556 -3276 -13764 -10794 -5020 -65 3031
9049 3031 10069 9705 3727 10248 9725 4590 10227 19495 22952 33451 41579 34842 18776 17956 18591
9034 18591 19191 14648 -1432 -14467 -13597 -13924 -16397 -3040 15722 26803 30353 36831 31234 18071
9020 18071 2832 4199 6323 10873 31902 31571 27536 25999 24314 5754 -7638 2019 10502 14010
9006 14010 10133 7800 8469 9747 4518 4155 13106 14506 7619 4584 11585 6515 1390 7960 9139
8991 9139 12791 9625 -2502 -2074 -8831 -7925 -5888 -2469 -2126 -6730 -4853 4914 15468 15702 12433
8976A2433j2099O581O734m920p958m266M169J2741j736j0236L761N684M895j716
8962A4067q181J1148Q538l372J47j5112r968J735M026L906J37j7446o55N682N431
8947H3P201m645k357M548J420P953j152j095q13k730K907J398M363K204r80P68
8931A9073n314k1q496n152J2229K104P46j396j801M196o811j2238o199R771O369
8916G060M672O516K860m193o9R02P173l920m36k83K718n110l138m546m002Q753
8900A4957R959o563P40q08O212M606p437l127o343m573J2801Q897j8681k2072
8886a1432P965J1800n243R495j601q07j1016p928m111o90J4326J6861l183L722
8872A8158O38m729J2118N681J0252P818P80m015J4471j08J2037R248j4704j4902
$$ plain form
8976 12433 334 6915 13649 8729 771 -3495 674 13415 11679 1443 5204 10888 15783 14067
8962 14067 5886 17034 25572 22200 22347 7235 -2733 -998 3028 6934 7071 -10375 -11030 -5348 83
8947 83 7284 2639 282 4830 6250 14203 13051 11956 11143 8413 11320 12718 17081 19285 18305 19073
8931 19073 13759 13738 5242 90 12319 14423 15169 13773 11972 16168 9357 -2881 -9080 691 7060
8916 7060 11732 18248 21108 16915 16846 17748 24921 21001 20565 20282 23000 17890 14752 10206 6204 14957
8900 14957 24916 18353 19093 18285 24497 29103 21666 18539 12196 7623 20424 29321 10640 -11432
8886 -11432 -3467 8333 3090 12585 10984 10177 -839 -8767 -12878 -13568 758 17619 14436 18158
8872 18158 18796 14067 26185 31866 42118 49936 50716 46701 61172 61064 73101 82349 67645 52743
8858E2743q079q707n592o051j5254K764p548j0934o138N909J0571K081M491k63
8844I993j0755K818J733M661j945p513Q870m718l527N9k699K0760J8470L485j2678
8829B7014n368J8493J7870l852J205J301p192R512J2270J330N473K1030M0406
8816A39492L3378o342k5356k8969k1510j0460j8711k3537j4452j737N010n924
8804B0882j215o30l530N24J0337j385o265L977J0088n814o445N071J0761N23j3042
8789B3837j1886L979Q832n022J015N902J1674n095q01o399m03Q302L371r056M917
8774C3167J8441K9449J6814O062j8105j0830n720j3182q393j4610j4882O56L742
8761B2609J91O509n106K207o736J310J3457R567r20r382o727j9248p167j0144
$$ plain form
8858 52743 44664 35957 30365 24314 9060 11824 4276 -6658 -12796 -6887 3684 5765 10256 9993
8844 9993 -762 2056 3789 8450 6505 -1008 7862 3144 -383 -324 -3023 17737 36207 39692 27014
8829 27014 21646 40139 58009 54157 55362 56663 49471 58983 71253 72583 78056 99086 139492
8816 139492 172870 166528 141172 112203 90693 80233 61522 37985 23533 21796 26806 20882
8804 20882 19667 19037 15507 16031 26368 24983 18718 22695 32783 26969 20524 25595 36356 36879 23837
8789 23837 11951 15930 24762 19740 20755 26657 38331 33236 32435 26036 25633 33935 37306 28250 33167
8774 33167 51608 81057 97871 103933 85828 74998 69278 56096 47703 33093 18211 18867 22609
8761 22609 22800 29309 24203 26410 19674 20984 34441 44008 43088 33706 26979 7731 564 -9580
8747i580R51J3054k138J411O946K472M599J1146J2332l000j3892r980m223p153
8733B945j168N996M644R916R918m608N597M75r969l117n741M59K588O860N007
8718B9802Q454J4841Q499j7465j3273K5658K6904K7490j596j7753m866J5460J3821
8705A15976n257m694K287n770P32J099J0256K7189J1269k3824k3056k2143j584
8692H2480r443k1043k322M767J905K354j600j6466m710J2358J8174p15j6070J607
8678E1276l147j440q723R919J0100J0800J1267J0145N279J8710L1740K4340J048
8665A71314j4908K802M255Q182K9050M4802O3625J27411J51452Q2888j4483k5482
8653F30908k0222n0097r8496r0612n7416n1684l5293m1226k4089O68k238o470
$$ plain form
8747 -9580 -8629 4425 2287 3698 10644 13116 17715 28861 41193 38193 24301 14321 10098 2945
8733 2945 1777 7773 12417 22333 32251 27643 33240 33715 23746 20629 14888 15347 17935 24795 29802
8718 29802 38256 53097 61596 44131 30858 56516 83420 110910 109314 91561 86695 102155 115976
8705 115976 110719 106025 108312 102542 103274 104373 114629 141818 153087 129263 106207 84064 82480
8692 82480 73037 51994 49672 54439 56344 58698 57098 40632 35922 48280 66454 65739 49669 51276
8678 51276 48129 46689 37966 47885 57985 68785 80052 90197 95476 114186 145926 170266 171314
8665 171314 156406 159208 163463 171645 200695 245497 309122 436533 587985 670873 656390 630908
8653 630908 610686 560589 462093 371481 314065 262381 227088 185862 161773 162441 160203 153733
8641A53733n246l125r590j1365L579J2552k414Q26L617J4500Q038l698r762j7036
8627A34609p06K0949j396L999O992N450J0974K832Q10J5671L5713N1058Q3582
8614C70537J34353K17221K81160J73677o6200j39496j23742j33380j43529j12834
8604D57767p3922n0565k4820k5484l0982j8087j8940r475j3250Q683j3826p035
8592A80064J705n999j0259m496P513K0571K3613K8716J1408r420k4884k0624q680
8579A89228j547l887j589m832O214Q244K8962K0819J0389K1611N1774Q7868J36312
8566E49566J04241n253p4368q1147o9224n3936m4711k2431n562j3614k6143k0316
8554B37102l595j6045k0900m127j1008k5088o536K049j2066j2298q959n339L254
$$ plain form
8641 153733 148487 145362 135772 124407 127986 140538 138124 138950 142567 157067 165105 161407 151645 134609
8627 134609 133903 154852 153456 157455 164447 169897 180871 183703 184513 200184 235897 286955 370537
8614 370537 504890 722111 1003271 1176948 1110748 971252 847510 714130 570601 457767
8604 457767 383845 333280 308460 282976 251994 233907 214967 205492 192242 200925 187099 180064
8592 180064 181769 175770 165511 161015 168528 189099 212712 241428 252836 243416 218532 197908 189228
8579 189228 187681 183794 182205 177373 183587 191831 220793 241612 252001 273612 325386 413254 549566
8566 549566 653807 648554 574186 493039 423815 369879 325168 302737 297175 283561 257418 237102
8554 237102 233507 217462 196562 192435 181427 156339 149803 151852 139786 127488 118529 113190 116444
8541A16444J0614J3247O929k500j9106q914l144p22R36m713j0494l342K037P961
8527A05233k513o968j3333n229k337J0942O140O668P231K0361k870p006P211J3299
8513A36829J4094l545k47o261j6904q416o91P729O553J2114J3768j2355n473j7244
8499A19951j9103j0837j1367j0283l902o395O606P138l724m729L818J9125J5146
8486A01444n477j0209j8875Q108J9199N017n002m247o225K63Q43M74J1926n510
8472I1729O446R501R087m044M058M982P143J2326m108P393J6247o737J7810L4202
8458B06035K8345J2749l0255m4888l3405k6008n777j3620j961R507K783j0257
8446I3248Q975k227j794M711j836r722j2591j5611q160l614J0606Q71m759l655
$$ plain form
8541 116444 127058 140305 147234 144734 125628 116714 113570 112848 113784 109071 98577 95235 97272 105233
8527 105233 102720 95752 82419 77190 74853 85795 91935 98603 105834 126195 123325 116319 123530 136829
8513 136829 150923 147378 147131 140870 123966 115550 114859 122588 129141 141255 155023 142668 137195 119951
8499 119951 100848 90011 78644 68361 64459 58064 64670 71808 68084 63355 67173 86298 101444
8486 101444 95967 85758 66883 74991 94190 99207 94205 89958 83733 83996 84839 85313 97239 91729
8472 91729 98175 107676 116763 112719 116777 121759 128902 141228 137120 144513 160760 154023 171833 206035
8458 206035 234380 247129 216874 171986 138581 112573 106796 93176 91215 100722 103505 93248
8446 93248 102223 99996 98202 102913 101077 91355 78764 63153 54993 51379 61985 62856 58097 54442
8432E4442m722m054J665Q305j137r741m182M034L818J091k47N160J2255O318O413
8417G9418J6292J2972J2637K3489P893j1869j3619k0640j3927j1175r872l713
8405F7886N729M0900J6540j8549j9326j3297j1353j4122m975N87k945L037J882
8392E1994n498l539O233L685n533K600l457m447j633n61j602m149l420k009m370
8377B4294Q28j75K40N623J452P173K889j4550R494J4483K923L521N617J310o303
8362E8819j1450j4451m625J1156l89J431j84m059q134J186K459K887q885n824
8348A9937L358r457r041J0487J0969O698k820k131k978m823K681M916n975j0363
8334A1458j0810L226J1553j049n617N916m33n343J2142P756r34k821j083K391
$$ plain form
8432 54442 49720 45666 47331 55636 54499 44758 40576 44610 48428 49519 49272 54432 66687 73005 79418
8417 79418 95710 108682 121319 144808 152701 140832 127213 106573 92646 81471 71599 67886
8405 67886 73615 114515 131055 112506 93180 79883 68530 54408 49433 50020 47075 50112 51994
8392 51994 46496 42957 49190 52875 47342 49942 46485 42038 40405 39844 38242 34093 30673 28664 24294
8377 24294 25122 24947 25187 30810 32262 39435 42324 27774 37268 51751 54674 58195 63812 65122 58819
8362 58819 47369 32918 28293 39449 39060 40491 40307 36248 28114 29300 31759 34646 25761 19937
8348 19937 23295 13838 4797 15284 26253 32951 30131 28000 25022 20199 22880 27796 21821 11458
8334 11458 648 3874 15427 14378 8761 14677 14244 8901 21043 28799 27865 25044 23961 26352
8320B6352J1380M675k110p630j4044j632J0670J236L792O35k997K551J585M660
8306C9123p677k245m794o108L905k175o432N0J42k379o920o47P514R277N417m236
8290B1815l64l533K3l374j4490q074q74J4156J1620N220L692m836j3274j5150
8276g443N817r56j716J9348Q412l653J796M650M939l936j298j0745j1305j449
8262B461N238K5412M216l573J0q398j544Q369Q101o368q627Q731r195r949P288
8247B2172Q930k928l084j086M936m07L161l046K783K703l913j0774J4190J3014
8233D6651N059j0039k0371o368K622l317l4J1694K943k2043n737J865O340j716
8219G549P917m028Q35l766N898n661l753M166Q362O393l052K21M412O161j2547
$$ plain form
8320 26352 37732 42407 40297 32667 18623 16991 27661 28897 32689 33324 30327 32878 34463 39123
8306 39123 31446 29201 24407 18299 22204 20029 13597 13647 13789 11410 4490 3843 11357 20634 26051 21815
8290 21815 21451 17918 17941 14567 77 -7997 -8871 5285 16905 22125 25817 20981 7707 -7443
8276 -7443 -1626 -2582 -4298 15050 23462 19809 21605 26255 31194 27258 25960 15215 3910 2461
8262 2461 7699 33111 37327 33754 33764 25366 23822 32191 40292 33924 25297 34028 24833 14884 22172
8247 22172 31102 28174 25090 24004 28940 28533 31694 28648 31431 34134 30221 19447 33637 46651
8233 46651 51710 41671 21300 14932 17554 14237 14203 25897 28840 6797 1060 2925 9265 7549
8219 7549 15466 11438 12273 8507 14405 8744 4991 9157 17519 23912 20860 21081 25493 31654 19107
8204A9107j622k179j7M491o895m815n470j0735J0267K140m162q32L342J4482k400
8189A4702o232q187N368n51J764K796O237k510N344l752L732q262k396n709q880
8174f536J972R719o5O499O810n897k969l343q101k610P616J3221Q637j2054j9339
8159f440J1830J2114n070j493o605r132J260R528K442M459K73q007k263j0220
8145g324N807L196O997j997k199J938o149M029J0327j789p562j668n618r420R342
8130b090Q69J433R64m897K700M879r934q067O314Q740j135J504M850R755J140
8115A7025k183K152p768r647l221M751J2197l499j2383l170J739L108j473N934
8101C562P485L227n864j80n318J062j240o932L677K519J124m201p881O959J2552
$$ plain form
8204 19107 17485 15306 15289 19780 12885 8070 2600 -8135 2132 4272 110 -722 2620 17102 14702
8189 14702 8470 283 5651 5100 6864 9660 15897 13387 18731 14979 18711 10449 8053 2344 -6536
8174 -6536 -4564 5155 5090 11589 18399 12502 9533 6190 -1911 -4521 3095 16316 24953 12899 -6440
8159 -6440 5390 17504 12434 10941 4336 -4796 -3536 5992 8434 12893 13166 5159 2896 -7324
8145 -7324 -1517 1679 8676 6679 4480 6418 269 4298 14625 12836 5274 3606 -2012 -11432 -2090
8130 -2090 -1221 212 1176 -3721 -1021 3858 -6076 -14143 -7829 911 -224 1280 6130 15885 17025
8115 17025 14842 16994 9226 -421 -3642 1109 13306 9807 -2576 -5746 -4007 -899 -2372 3562
8101 3562 11047 14274 8410 8230 2912 3974 2734 -4198 -521 1998 3122 -1079 -8960 -2001 10551
8086A0551M483L406n283j643j1771j602q94R596J3534k201j113p481Q28Q316l827
8071A4899k950J0034K164l175r133p277l511R392M45j8302q906J1347P332J946
8057D305q38j1136p234K229N866R063m147J722l49M491N994j2398L108Q890M367
8042A3933Q352j0158n107M149j948j546J321R851m157r849j299j0640o593P44
8028a2947M181L849R097N839l319j1005q414l574M339q78Q300R742M55K207J2528
8013B0400o842m238J4740P013m193Q606r072l072m437o858j543K519l824R068
7999A8267J0064J4870j293j6182k0215l173J421K024l08J7332m013j1606N13P822
7985A5523j94j0524N510J0932J0964q603n791R225k046L889O305R384N467n309
$$ plain form
8086 10551 15034 18440 13157 11514 -257 -1859 -2753 6843 20377 18176 17063 9582 10410 18726 14899
8071 14899 11949 21983 24147 20972 11839 4562 1051 10443 10888 -7414 -16320 -4973 2359 4305
8057 4305 3467 -7669 -14903 -12674 -6808 2255 -1892 -170 -519 3972 9966 -2432 676 9566 13933
8042 13933 22285 12127 7020 11169 9221 7675 8996 18847 14690 4841 3542 -7098 -13691 -12947
8028 -12947 -8766 -4917 4180 10019 6700 -4305 -12719 -16293 -11954 -12832 -4532 5210 5665 7872 20400
8013 20400 13558 9320 24060 31073 26880 35486 26414 23342 18905 12047 10504 13023 9199 18267
7999 18267 28331 43201 41908 25726 5511 2338 3759 5783 5475 22807 18794 7188 7701 15523
7985 15523 15329 4805 10315 21247 32211 23608 17817 27042 24996 28885 35190 44574 50041 44732
7971D4732M030L910p439q776m644P225J5695o644p240q350n476o592k885J8831
7957C6377J1651R525j2872j2734k451q493p246n540K913N198N108O091O464n278
7943B8713j1891k716j1647P816J4933m960O344j299j650K897Q031m527m899m124
7929B1021k249M279J8213P198J038m671K983N349J3994J356j323j315j4853p002
7915D4018n703r526O93M463o580q029l547N375p123l270M01m979l459J0774N148
7900A8656m222j1382R851j719j545j2027k22J0742P971m915l179N07N10R478N676
7885B4180O039m501j502N020m488j1716j1614N717P808P549L216L926k039q956
7871A8639j0363j3343J1643P191l21r121P771J462l311K390J11j0633n18m08n855
$$ plain form
7971 44732 48762 52672 45233 36457 31813 39038 54733 48089 40849 32499 27023 20431 17546 36377
7957 36377 48028 57553 44681 31947 29496 21003 13757 8217 11130 16328 21436 27527 33991 28713
7943 28713 16822 14106 2459 10275 25208 20248 26592 25293 23643 26540 34571 30044 25145 21021
7929 21021 18772 23051 41264 48462 49500 44829 47812 53161 67155 68511 67188 65873 51020 44018
7915 44018 38315 28789 29482 33945 27365 19336 15789 21164 14041 10771 11172 6193 2734 13508 18656
7900 18656 14434 3052 12903 11184 9639 -2388 -2610 8132 16103 11188 8009 8516 9026 18504 24180
7885 24180 30219 25718 24216 29236 24748 13032 1418 7135 14943 22492 25708 29634 27595 18639
7871 18639 8276 -5067 6576 13767 13446 4325 12096 13558 10247 12637 12748 2115 1597 1189 -4666
7856d666J167L014N266J4024Q086q612j7274L091k079J0522j2122o155J7483N213
7842A6958N747n680n687n891M018O035j0760j0750J3098J262o828R84r302p116
7828a3912Q558j2124K1491J4143j0225o074k672p123J0761J9433k427q422K882
7815A4289k990r286l175m646J2334J3180j1627j4885k857J7170Q614k860j3915
7802f54m337Q335O622k155j0137L268R814J764O47K080m786p146K273j495p673
7787c580p281J0885r969r726l18N209L551J3509L320r360j2433K636N502l857
7773a1912o070m427P902M628j990j129m42M038J0821O240m208p933P374k56j0397
7758g761l247R222P34J7123l619o527j0609r467N480Q032R14J0910P415m476o874
$$ plain form
7856 -4666 -3499 -485 4781 18805 26891 18279 1005 4096 2017 12539 417 -5738 11745 16958
7842 16958 22705 17025 11338 5447 9465 15500 4740 -6010 7088 8350 1522 2506 -6796 -13912
7828 -13912 -5354 -17478 4013 18156 7931 1857 -815 -7938 2823 22256 19829 11407 14289
7815 14289 11299 2013 -1162 -5808 6526 19706 8079 -6806 -9663 7507 16121 13261 -654
7802 -654 -4991 3344 9966 7811 -2326 942 10756 12520 13167 15247 10461 3315 5588 4093 -3580
7787 -3580 -10861 24 -9945 -19671 -19989 -14780 -11229 2280 5600 -3760 -16193 -13557 -8055 -11912
7773 -11912 -17982 -22409 -14507 -9879 -11869 -12998 -13440 -9402 1419 7659 3451 -4482 2892 2636 -7761
7758 -7761 -11008 -1786 -1052 16071 12452 5925 -4684 -14151 -8671 -639 275 11185 18600 14124 7250
7743G250M89N201O129j0040j5225n961O281J0307P950m407q520m047j885R260
7729B782L723J828P776o228K865q742Q930M485j0423n652K01j3552r620J5613
7715f014J1070r972O601J5292J394r125L446J722j4497n371j067M392m289J2483
7701F065o93r799r672n063L191m660N0o780J292j789L323O719J0462m907k975
7686a5236n067l290L441M515Q35o876L210J2873Q943l596n872l848P81j1853J666
7671a9374k846Q908K36J5058J1338q429n100j612j0640q380o766Q2Q818m75j1755
7656c0937M912J1890R045J509n148j95k068p7J739M291P882n650o740k397P945
7641c999N22q433k82K079R6l908l898K917Q708K441n751m72J127O08l492K9K055
$$ plain form
7743 7250 7739 12940 19069 9029 -6196 -12157 -5876 4431 12381 7974 -546 -4593 -6478 2782
7729 2782 6505 8333 16109 9881 12746 4004 12934 17419 6996 1344 1545 -12007 -21627 -6014
7715 -6014 5056 -4916 1685 16977 18371 9246 12692 14414 -83 -5454 -6521 -2129 -6418 6065
7701 6065 5372 -4427 -14099 -19162 -15971 -20631 -20581 -27361 -26069 -27858 -24535 -17816 -7354 -12261 -15236
7686 -15236 -20303 -23593 -20152 -15637 -14802 -21678 -18468 -5595 3348 -248 -6120 -9968 -9187 -21040 -19374
7671 -19374 -22220 -13312 -13076 1982 13320 4891 -209 -1821 -12461 -20841 -27607 -27525 -18707 -19182 -30937
7656 -30937 -26025 -14135 -5090 -3581 -8729 -8924 -10992 -11069 -9330 -5039 2843 -2807 -9547 -11944 -3999
7641 -3999 -3477 -11910 -12192 -10113 -10017 -13925 -17823 -14906 -6198 -3757 -9508 -9980 -8853 -8245 -11737 -11708 -9653
7624i653l926j0063J1189J2341N957O16O60j676J3910M19k206O986m571K378j8785
7609C576J052r746j9362l771K522m077M404J7540L743K344j2280r953M458O618
7595a2932M086N436O231k862p400K122m786k493M010q98J283M316M091r760l233
7580a2789j368p830q526J640J5855j331o60O85J6284n168q136J637K274L675K836
7565i22k867o283K452m541J2896Q378r68o535j4455Q442J277l54R016R295r084
7550E747k20J865q095n369J2869N081q063n362N430Q13q259m371L588j0399o562
7535b1307M546R097M188n251M543N396m556k657j2288p012O542L701l58k555j655
7520a9626m076O151N405P960l018K208K828p66L424l952n695p59J405R876J392
$$ plain form
7624 -9653 -13579 -23642 -12453 -112 5845 6461 7121 5445 19355 19774 17568 24554 19983 22361 3576
7609 3576 4628 -5118 -24480 -28251 -25729 -29806 -25402 -7862 -4119 -1775 -14055 -24008 -19550 -12932
7595 -12932 -8846 -3410 2821 -41 -7441 -5319 -10105 -12598 -8588 -9486 -8203 -3887 204 -9556 -12789
7580 -12789 -14157 -21987 -30513 -28873 -13018 -14349 -15009 -14324 1960 -3208 -11344 -9707 -7433 -3758 -922
7565 -922 -3789 -10072 -7620 -12161 735 9113 8145 1610 -12845 -4403 -3126 -3480 5536 14831 5747
7550 5747 5527 7392 -703 -6072 6797 11878 3815 -1547 3883 4696 -3563 -7934 -4346 -14745 -21307
7535 -21307 -16761 -7664 -3476 -8727 -4184 1212 -3344 -6001 -18289 -25301 -18759 -15058 -15416 -17971 -19626
7520 -19626 -23702 -17551 -12146 -4186 -7204 -4996 -2168 -2934 490 -3462 -9157 -9916 -8511 1365 2757
7505B757k737m421m765P332J4017n396r688l777J565R317n592l655J072J2284
7491H313p723j7629M921J0300q29m411l558J696K086k897j831O321J2854q6m566
7476B961q517J3427L210j039j4311m751l747q251O567K541p00k027O932j115O543
7461b277L624k767N035k793j3025J894J1918j952L469O241J3804o99j2307l17
7447I848L890j1169k390J2757n655p25j181n309K91n293o460O754p622j0397m286
7432b6947k412K913L014k433j489O159K691N036R404L469j741j0020p173O878
7418a2651P250n5P686l886q611l319N834M677o44j3470K082J457m562o003j1257
7403c5472l403J1155M127J1015P084j0065o711O103J0341q481j0996k315L168
$$ plain form
7505 2757 20 -4401 -9166 -1834 12183 6787 -2901 -6678 -5113 4204 -1388 -5043 -3971 8313
7491 8313 590 -17039 -12118 -1818 -2647 -7058 -10616 -8920 -6834 -9731 -11562 -5241 7613 7527 2961
7476 2961 -5556 7871 11081 10042 -4269 -9020 -12767 -21018 -14451 -11910 -12610 -14637 -7705 -8820 -2277
7461 -2277 1347 -1420 3615 822 -12203 -10309 1609 -343 3126 9367 23171 22472 10165 9848
7447 9848 13738 2569 179 12936 7281 6556 5375 66 357 -4936 -11396 -4642 -12264 -22661 -26947
7432 -26947 -29359 -26446 -23432 -25865 -27354 -21195 -18504 -13468 -4064 -595 -2336 -12356 -19529 -12651
7418 -12651 -5401 -5456 2230 -1656 -10267 -13586 -7752 -3075 -3719 -17189 -15107 -13650 -18212 -24215 -35472
7403 -35472 -38875 -27720 -23593 -12578 -5494 -15559 -22270 -16167 -5826 -14307 -25303 -27618 -24450
7390b4450L88j184l442J938j640L963O429k802o307l958J8674L477L177Q00l665
7375h602J965k901R710N383q637k547P141J047r440N253K410j116J566r913M066
7360d615N846Q212J988M558M419p587j1324r516n672M791K311k587L002M296j518
7345c396J419n324j3291k729J0794j171l521P104J6673J2832k273n919m969p116
7331h87k261r77p305j4075n057J0656M880M492J3357n299j709J1963L870k189
7317I459L67q163p851k036N464o225K35k288q930r16p66n19k537J1362J4804o533
7301e073j4342n039L846L64J71L312L643K376N26j593L89J270J2837N74k933k770
7285b442K657k851M635p300O62l343j477K378O152k017j3470j366j583K207L763
$$ plain form
7390 -24450 -24062 -25246 -28688 -26750 -28390 -24427 -17998 -20800 -27107 -31065 -12391 -8914 -5737 -4937 -8602
7375 -8602 -6637 -9538 172 5555 -3082 -5629 1512 2559 -6881 -1628 782 -334 1232 -8681 -4615
7360 -4615 1231 9443 11431 15989 20408 12821 1497 -8019 -13691 -8900 -6589 -9176 -6174 -1878 -3396
7345 -3396 -1977 -7301 -20592 -23321 -12527 -13698 -17219 -10115 6558 19390 17117 11198 6229 -887
7331 -887 -3148 -4125 -11430 -25505 -30562 -19906 -15026 -10534 2823 -2476 -4185 7778 11648 9459
7317 9459 9826 1663 -6188 -8224 -2760 -8985 -8750 -11038 -19968 -20884 -21650 -22169 -24706 -13344 1460 -5073
7301 -5073 -19415 -24454 -20608 -20244 -20073 -16761 -13118 -10742 -10216 -11809 -11420 -10150 2687 3261 328 -2442
7285 -2442 215 -2636 1999 -5301 -4639 -7982 -9459 -7081 -929 -2946 -16416 -17782 -19365 -17158 -13395
7270a3395Q016R949M155n483P91j766Q885n489p914m854K079L853N958p419Q213
7255E579N075o276q967l841j609K80Q88l009L902r335p822J495N183Q775k468
7240a2150n597L310Q428k40R1J470n7j0609n878N817R113J490r306m143j070J4073
7224e258M365o067r256q57J908K496M570k432J430P130J1053o066j2599j282P543
7209c322q610o712l406R473N441P206k223j0199j0214J0002P879k044p072q598
7195b2399Q173K0230P147n301j0141j3778j1958M501R151m898m769J1164J9886
7182G008K1379r426j1677j7540P989J84j1015Q787J3818n854j3226j0958j400
7169b1931J1007r31r673N928K013L520r623o151P900K665O038K716n004k962O292
$$ plain form
7270 -13395 -5379 4570 8725 3242 4033 2267 11152 5663 -2251 -7105 -5026 -1173 4785 -2634 5579
7255 5579 10654 4378 -4589 -8430 -10039 -9759 -8871 -11880 -7978 -17313 -25135 -23640 -18457 -9682 -12150
7240 -12150 -17747 -14437 -6009 -6249 -6158 -4688 -4745 -15354 -21232 -15415 -6302 -4812 -14118 -18261 -19331 -5258
7224 -5258 -893 -6960 -16216 -17073 -15165 -12669 -8099 -10531 -9101 -1971 9082 3016 -9583 -10865 -3322
7209 -3322 -11932 -18644 -22050 -12577 -7136 70 -2153 -12352 -22566 -12564 -4685 -6729 -13801 -22399
7195 -22399 -14226 6004 13151 7850 -2291 -16069 -28027 -23526 -14375 -19273 -24042 -12878 7008
7182 7008 28387 18961 7284 -10256 -2267 -2083 -13098 -4311 9507 3653 -9573 -20531 -21931
7169 -21931 -10924 -11855 -21528 -15600 -13587 -10067 -19690 -25841 -17941 -15276 -9238 -6522 -11526 -14488 -8196
7154h196J7191m973j1098L911J1976m426q19K33p897L960K368J2989q441J200
7140G978r872Q92P215K612o563P73j929j4195M606J4011N104q203o356l240k170
7125i337l502j0061l523n821J561J0422N801J7332J1941j5236j8835o736K0308
7112e686P372N825K672n611k2288o936P704J496m079j146L874P169J023q93P080
7097b424j032R650J0486J395r635l451n122j2325L424p360k430m502J99R187O053
7082g887M18O020j3319j573Q480K043j831J816M475M136l378q220L576J035j2428
7067a6637M521J1852J0652o948m79J1010J373M144r94n718j429N065j5605m417
7053c610J3572P564k085r326n682O060L779m765r886j451J3745K640m686j1343
$$ plain form
7154 -8196 8995 4022 -7076 -3165 8811 4385 3566 3799 -4098 -138 2230 15219 6778 7978
7140 7978 -1894 -1002 6213 8825 2262 3035 1106 -13089 -8483 5528 10632 2429 -3927 -7167 -9337
7125 -9337 -12839 -22900 -26423 -32244 -30683 -20261 -14460 2872 14813 -423 -19258 -25994 -5686
7112 -5686 1686 7511 10183 4572 -17716 -24652 -16948 -15452 -19531 -20677 -16803 -9634 -8611 -9504 -2424
7097 -2424 -3456 6194 16680 18075 8440 4989 -133 -12458 -9034 -16394 -18824 -23326 -23127 -13940 -7887
7082 -7887 -7469 -1449 -14768 -16341 -7861 -5818 -7649 -5833 -1358 2778 -600 -8820 -5244 -4209 -16637
7067 -16637 -12116 -264 10388 3440 2961 13971 15344 19488 18494 12776 11347 16412 807 -3610
7053 -3610 9962 17526 15441 6115 433 6493 10272 5507 -4379 -5830 7915 10555 5869 -5474
7039e474j1983J3805J3727K350n230m609o778j1545r230N278j184J896P444n260
7025a6793O154k217q552j519P824J8200q46j2164l665P77J388O182M437M878J981
7010F065L170p256m704j753m055l588n812J731J3185O900m670j4272m155K162
6996a7052N626J1096J758o323Q11J0355J67m583j0751o087J5344Q018j1281l151
6982f053r63j078k32Q489Q860j038k265J0144N74p130n390K843O843m135j0802
6967a333j462L888p381N50M355J2138j060L976j2461l560m900L138J8947j163
6953A3672j2647o244p104m85J0212N723l284p63l717j0762N566O922J0946J985
6939A0020o20j6106n629K534J2991o48q587K652P924P627o687j2016j033l212
$$ plain form
7039 -5474 -17457 -3652 10075 12425 7195 2586 -4192 -15737 -24967 -19689 -20873 -18977 -11533 -16793
7025 -16793 -10639 -12856 -21408 -22927 -15103 3097 2251 -9913 -13578 -12801 -11413 -5231 -794 4084 6065
7010 6065 9235 1979 -2725 -4478 -8533 -12121 -17933 -16202 -3017 3883 -787 -15059 -19214 -17052
6996 -17052 -11426 -330 1428 -4895 -4084 6271 6438 1855 -8896 -14983 361 8379 -2902 -6053
6982 -6053 -7016 -8094 -8326 163 9023 7985 5720 15864 16438 9308 3918 6761 13604 9469 -1333
6967 -1333 -2795 1093 -6288 -5738 -1383 10755 9695 13671 1210 -2350 -7250 -4112 14835 13672
6953 13672 1025 -5219 -12323 -12808 -2596 3127 -157 -920 -4637 -15399 -9833 -2911 8035 10020
6939 10020 9400 -6706 -12335 -9801 3190 2542 -6045 -3393 4531 12158 5471 -6545 -7578 -10790
6925a0790Q2k732N015Q368m315o625j612J435m340Q266R34n203q751o76N003O96
6909a5245j1604O435P997k676K922J5260K91k52N302K918P29J2409k269j4310
6895G907K630n72k25K19o909K945J6l353M450o992J896M44p25L799O171j2771
6879a070r824P225R850o420l486j4297J0046P502j908k729N318j307L738L45p624
6864d641k1495n69P019R685J8556J3772j0451j6047q443j92r420O722P670J42
6850g692K734p010M630O356k799M584M409K22j3009r862O971J1196l511M998P414
6835I631k396j0013j1779j083l37l819m783o794O928Q36K814P942M817R911R809
6820A1684k506q826k979p212o005j1246K914R041K176j1542M014M696j724p107
$$ plain form
6925 -10790 -10708 -13440 -8425 -57 -4372 -10997 -12609 -11174 -15514 -7248 -6314 -11517 -20268 -20944 -15941 -15245
6909 -15245 -26849 -20414 -12417 -15093 -12171 3089 3380 3128 8430 11348 12077 24486 22217 7907
6895 7907 10537 9965 9740 9959 3050 5995 6011 2658 7108 116 2012 2456 1731 5530 11701 -1070
6879 -1070 -10894 -3669 6181 -239 -3725 -18022 -7976 -474 -2382 -5111 207 -1100 2638 2983 -4641
6864 -4641 -26136 -26705 -19686 -10001 8555 22327 11876 -4171 -12614 -12806 -22226 -15504 -7834 -7692
6850 -7692 -4958 -11968 -7338 -982 -3781 803 5212 5434 -7575 -17437 -10466 730 -2781 2217 9631
6835 9631 7235 -2778 -14557 -15640 -15977 -19796 -24579 -31373 -24445 -23609 -20795 -12853 -8036 1875 11684
6820 11684 9178 352 -2627 -9839 -15844 -27090 -24176 -15135 -12959 -24501 -20487 -15791 -17515 -24622
6806b4622N176k219j940J608N300J7l345J0584P620j257j569j389l62o739r648
6791b2785n607M696J7417M389j1868j0743Q465N814j0146J2044N294J306o219
6778g943N981J1327m983k9058j4401P084Q801j543O861Q466J0107M024j588r508
6764f373r399R472j882n146m401m60O791L455R368R255k939r276j251O632O346
6749A0192P781q004J057Q681R744o975j6570j204p983m654o656M160J5815P78
6735F162j3643p533J918N237m161J906P283l228q777N584K695L768J833r320m330
6720a4606l321J524J3802q74o635r924r02P468O583R090o388j2059P95J0747j87
6705d887m630R797r25J884j0655K128n22M883M976R002N36q549p278j0916J935
$$ plain form
6806 -24622 -19446 -21665 -23605 -21997 -16697 -16680 -20025 -9441 -1821 -3078 -4647 -6036 -6398 -13137 -22785
6791 -22785 -28392 -23696 -6279 -1890 -13758 -24501 -16036 -10222 -20368 -8324 -3030 -1724 -7943
6778 -7943 -1962 9365 4382 -24676 -39077 -31993 -23192 -24735 -17874 -9408 699 4723 3135 -6373
6764 -6373 -15772 -6300 -8182 -13328 -17729 -18189 -11398 -7943 1425 10680 7741 -1535 -2786 3846 10192
6749 10192 17973 9969 11026 19707 29451 22476 5906 4702 -3281 -7935 -14591 -10431 5384 6162
6735 6162 -7481 -15014 -13096 -7859 -12020 -10114 -2831 -6059 -14836 -9252 -6557 -2789 -956 -10276 -14606
6720 -14606 -17927 -16403 -2601 -3475 -10110 -20034 -20936 -13468 -6885 2205 -4183 -16242 -15447 -4700 -4887
6705 -4887 -9517 280 -645 1239 -9416 -7288 -7810 -2927 2049 11051 11587 3038 -4240 -15156 -13221
6690a3221J1185J2986J975j0534j5808n316J1020P232l153j90O965R447J0000
6677B2588p130j0038k431n403K801M010j947k037K610J627J451P064n758k449
6663D958L191K599j930q899O273K032P427m433j69r81p337j1022j0836r34Q037
6648a2024J0160o52p151L798l888j0187J2497M546r087N49J5343k272j7165j3279
6634b8812m33L780k716L560J0079J3090R671Q407q72j2389J811k567j0602m317
6620a2310O895l443m405O754j152o180O734P036O912Q746q949k799j801j0193
6606h155K84n086l546L864m664J8178M078j4299j1793J492P288j247n957J0418
6592i145J1262m692n675O200N839j06K21n615r139O400J3161P625p887n445m649
$$ plain form
6690 -13221 -2036 10950 12925 2391 -13417 -18733 -7713 -481 -3634 -3824 3141 12588 22588
6677 22588 15458 5420 2989 -2414 387 4397 2450 413 3023 4650 6101 13165 7407 4958
6663 4958 8149 10748 8818 -81 6192 8224 15651 11218 11049 10068 2731 -8291 -19127 -20061 -12024
6648 -12024 -1864 -2516 -9667 -5869 -9757 -19944 -7447 -2901 -11988 -11439 3904 1632 -15533 -28812
6634 -28812 -29245 -25465 -28181 -24621 -14542 -1452 8219 16626 15754 3365 5176 2609 -7993 -12310
6620 -12310 -5415 -8858 -13263 -6509 -7661 -13841 -7107 -71 6841 15587 6638 3839 2038 -8155
6606 -8155 -7871 -12957 -16503 -12639 -17303 875 4953 -9346 -21139 -19647 -12359 -13606 -19563 -9145
6592 -9145 2117 -2575 -8250 -2050 3789 3683 3904 -1711 -10850 -4450 8711 16336 8449 3004 -1645
6577a645J850m474j5842n693k076J2238J4074n121R45j1576j7717L147O609J245
6563b4036J1210J5494M721J9564L124k922r919m95l215P568n75p612j0537m63
6549A907m214o32N817j315l130j0237J3273J4456R1N76j3638l741L451m402N871
6534D133K183k323m984j4530m871M709N339n110M167J0192o984l376R747J3495
6520A1787M883o040o341P122p204j6228r165J1838J3883k522j3918q870L58J5676
6506d741k586j7996M6N692K408M291J1834J042l613L32L754J2635m58L598l77
6491A5861j354p184j5157l563J1931L835k817J170J570j837K591q642m024O759
6477h61P11n400l044k9L343N787P315N67r895p55p772j0395l080L041P365Q498
$$ plain form
6577 -1645 205 -4269 -20111 -25804 -27880 -15642 -1568 -6689 -5744 -17320 -35037 -31890 -25281 -24036
6563 -24036 -12826 2668 7389 26953 30077 27155 17236 16741 13526 21094 20519 12907 2370 1907
6549 1907 -2307 -2939 2878 1563 -1567 -11804 1469 15925 16016 16592 2954 -787 2664 -1738 4133
6534 4133 6316 3993 -991 -15521 -20392 -15683 -10344 -15454 -11287 -1095 -8079 -11455 -1708 11787
6520 11787 16670 10630 4289 11411 4207 -12021 -21186 -9348 4535 2013 -11905 -20775 -20417 -4741
6506 -4741 -7327 -25323 -25277 -19585 -17177 -12886 -1052 -10 -3623 -3291 463 13098 12640 16238 15861
6491 15861 14507 7323 -7834 -11397 534 4369 1552 2722 4292 2455 5046 -3596 -7620 -861
6477 -861 -150 -5550 -8594 -8623 -5280 507 7822 8389 -1506 -2261 -10033 -20428 -23508 -20467 -13102 -4604
6461d604l028j2047n730O035J843R303o901p566n66J3079K045r927j359K084L880
6446a3459K945R293J122n799j820J1236M732q760j3000J0050L984l206Q915l517
6432B716r592P36L028m091K493q401j0870Q096N677J7271K310q638l898n384M80
6417h067P344n182j3049O61O549P897M405j1876j089L981N81j138n063o129K913
6402a7262J5991n491l325l641m818o845N855J1157l272p049M757R12Q10r129l841
6387b5191N560N078R513O103j4422r203K917O063N925p336p518m763p75j78N062
6372b3165R530P148o643r592p72o952J218Q189J3776N908k18R88J185o235Q126
6357B491K986m535n74k313k057p35J0000o324j9692j874J2098n558J845J130j0711
$$ plain form
6461 -4604 -7632 -19679 -25409 -19374 -17531 -8228 -15129 -22695 -23261 -10182 -8137 -18064 -19423 -17339 -13459
6446 -13459 -10514 -1221 -99 -5898 -7718 3518 8250 -510 -13510 -3460 524 -2682 6233 2716
6432 2716 -6876 -6140 -3112 -7203 -4710 -13111 -23981 -15885 -10208 7063 9373 735 -3163 -8547 -8067
6417 -8067 -723 -5905 -18954 -18293 -11744 -3847 558 -11318 -12407 -8426 -7845 -8983 -14046 -20175 -17262
6402 -17262 -1271 -6762 -10087 -13728 -18546 -25391 -19536 -8379 -11651 -18700 -13943 -13031 -12221 -21350 -25191
6387 -25191 -19631 -14553 -5040 1063 -13359 -22562 -19645 -13582 -7657 -14993 -22511 -27274 -28049 -28227 -23165
6372 -23165 -13635 -6487 -13130 -22722 -23494 -30446 -29228 -21039 -7263 -1355 -1573 -585 600 -5635 2491
6357 2491 5477 942 368 -1945 -4002 -4737 5263 -1061 -20753 -22627 -10529 -16087 -14242 -13112 -23823
6342b3823l087L505J1162M998j668l807K813J7416m620L199K325m782j149m63
6328B019J1783m70j555n291p439j3677q70P551M365L554l159l731m13l832O887
6313d278o331k268K983l272n643P68K885K95o425J379O166Q528N670J555K153
6298D165L315l079j769K80q680k826K694P877m59q631l179O294J7957O24L014
6283A7597j1849O912n115r248j5508k211Q788J0536j1007j2073Q1M717J1266k138
6269i252m349P928P64J153j546n488J3807J059q3m159R41J0243m520j5919j036
6254a0457N703r33K500L84M299l352R434Q158Q402k516j5137j2463p142o736K07
6239a9649j62N305J413J9241k350j6598j1393P252p43L351j2409p88L151N627
$$ plain form
6342 -23823 -26910 -23405 -12243 -7245 -8913 -12720 -9907 7509 2889 6088 8413 3631 2482 2019
6328 2019 13802 13332 11777 6486 -953 -14630 -15500 -7949 -3584 -30 -3189 -6920 -7333 -11165 -4278
6313 -4278 -10609 -12877 -9894 -13166 -18809 -18041 -15156 -14861 -21286 -19907 -13741 -5213 457 2012 4165
6298 4165 7480 4401 2632 2912 -5768 -8594 -5900 1977 1518 -7113 -10292 -3998 13959 14583 17597
6283 17597 5748 12660 7545 -1703 -17211 -19422 -10634 -98 -11105 -23178 -23097 -18380 -7114 -9252
6269 -9252 -13601 -5673 -4909 -3756 -5302 -10790 3017 4076 3993 -166 775 11018 6498 -9421 -10457
6254 -10457 -4754 -5687 -3187 -2803 1496 -1856 7578 15736 24138 21622 6485 -5978 -13120 -19856 -19649
6239 -19649 -19811 -14506 -13093 6148 3798 -12800 -24193 -16941 -17684 -14333 -26742 -27530 -24379 -18752
6225a8752n024L018J2259L842m827k987k763r023P875J3880K706n47K804o63q880
6210g082j2446q096M296J3072Q759M201j2585N262K235p37J5163m262l30M679
6196A2129J128R374j1587j0089m481k833J1743m172q249J6751J2841p70j6750
6183E035j1853q945M48l06O94O319L965J069J52N501J637K627Q223p198j5606
6168h238j0253L050j369l469L185O630L304j707j4013l487N401Q166J5449M481
6154G130M737j3227j6551j0270r697O207K660J1489P363o762j031n194Q003P744
6140g399J032J479K14M424O357k432l472j8812k930J1253J564L313J843l372j2693
6125a9631J335Q596N319p064r823n928J7660K52j0755n299k031N018K88J5234
$$ plain form
6225 -18752 -23776 -20758 -8499 -4657 -9484 -12471 -15234 -24257 -16382 -2502 204 -343 2461 1798 -7082
6210 -7082 -19528 -27624 -23328 -10256 -1497 2704 -9881 -4619 -2384 -3121 12042 7780 7450 12129
6196 12129 13257 22631 11044 955 -3526 -6359 5384 1212 -7037 9714 22555 21785 5035
6183 5035 -6818 -15763 -15315 -15621 -14927 -8608 -4643 -3574 -3422 2079 3716 6343 14566 7368 -8238
6168 -8238 -18491 -15441 -16810 -20279 -17094 -10464 -7160 -8867 -22880 -26367 -20966 -12800 2649 7130
6154 7130 11867 -1360 -17911 -28181 -37878 -31671 -29011 -17522 -10159 -16921 -17952 -23146 -15143 -7399
6140 -7399 -6367 -4888 -4674 -250 6107 3675 203 -18609 -21539 -10286 -8722 -5409 -3566 -6938 -19631
6125 -19631 -18296 -9700 -4381 -11445 -21268 -27196 -9536 -9284 -20039 -25338 -27369 -22351 -22063 -6829
6111f829p436l799l329L381P48K543k886j434L666J505O60M741N252O192o815
6096c840o794l563l119O602J779N789l137j4650J57r763K940J8798Q793o154J171
6081d991k058j6067o54K841k226M802J2628P189L675r558p602P770Q80m425n435
6066a3231J747m290j1989K010O483P684o564P203K292O013O568p413N772P207
6052I492P479j2873q352J386n164p376q251M959j0625N29O041M975L978J3689
6038a13J3600j1138k0102K853J8198O510q782r602L598J8976L474o692j3037q540
6024a0797R21n170L016J2413J2399N083J042M02j6742p970j009M105N443M411
6010G547j0176L193m782q929q223O061J935M757R317K541j9657m689P726k853
$$ plain form
6111 -6829 -14265 -18064 -21393 -18012 -17264 -14721 -17607 -19041 -15375 -13870 -13210 -8469 -3217 2975 -3840
6096 -3840 -10634 -14197 -17316 -10714 -8935 -3146 -6283 -20933 -20776 -30539 -27599 -8801 -8 -6162 -4991
6081 -4991 -7049 -23116 -23770 -20929 -23155 -18353 -5725 1464 5139 -4419 -12021 -4251 -3371 -7796 -13231
6066 -13231 -11484 -15774 -27763 -25753 -19270 -11586 -18150 -10947 -8655 -2642 3926 -3487 2285 9492
6052 9492 16971 4098 -4254 -2868 -8032 -15408 -23659 -18700 -29325 -28796 -22755 -17780 -13802 -113
6038 -113 13487 2349 -17753 -14900 3298 9808 1026 -8576 -4978 13998 17472 10780 -2257 -10797
6024 -10797 -9876 -15046 -12030 383 12782 17865 18907 19309 2567 -5403 -6412 -2307 3136 7547
6010 7547 -2629 564 -4218 -13147 -21370 -15309 -13374 -8617 700 3241 -16416 -21105 -13379 -16232
5996a6232N292j95l836j630o71L327O851J0538R870k936q571m630r038q576K771
5981a7666J519J0843O137k257l722O100P493p491o735p485p193q694j681J0605
5967b0227J5178J6200j0781j0841L222J6781Q744j0979n632k662m448O130m430
5954c745p091m045N469K81J286P739j1676J375j705J916N970J0086N254n877k915
5939B322m295L807j0612k696k229K241J408k465J1362M671j935k3467j0267J102
5925c1053P487q405J6081J4795P368o431j1555j3310N330P000J457L230k531R409
5911a128m395j0856k363Q531L514l095q927m402K937R528p19j0206N97k833J1691
5896a2126Q188Q789j180O926n327j0784m1l146M359L124n876q73n83q294J0786
$$ plain form
5996 -16232 -10940 -11135 -14971 -16601 -17272 -13945 -7094 3444 13314 10378 1807 -2823 -11861 -20437 -17666
5981 -17666 -16147 -5304 833 -1424 -5146 954 8447 956 -5779 -13264 -20457 -29151 -30832 -20227
5967 -20227 -5049 11151 370 -10471 -7249 9532 18276 7297 1665 -997 -5445 685 -3745
5954 -3745 -10836 -14881 -9412 -9131 -7845 -106 -11782 -10407 -12112 -10196 -4226 5860 11114 5237 2322
5939 2322 -1973 1834 -8778 -11474 -13703 -11462 -10054 -12519 -1157 3514 1579 -21888 -32155 -31053
5925 -31053 -23566 -31971 -15890 -1095 6273 -158 -11713 -25023 -19693 -12693 -11236 -8006 -10537 -1128
5911 -1128 -5523 -16379 -18742 -10211 -6697 -9792 -18719 -23121 -20184 -10656 -11375 -21581 -20984 -23817 -12126
5896 -12126 -3938 4851 3671 10597 5270 -5514 -5555 -8701 -4342 -1218 -7094 -7967 -8550 -16844 -6058
5881f058j659J526j046J5277l233j4437M099L942J593J996j756K213N043n254
5867B246k884l238q223O100P75q150n145J0343j865j333Q796k193j554J2788L143
5852I606k160j0610r33k193o724K973L195p688J3842R966M38r321J1259Q322j1534
5837H438j2363K972r283L537L435K858R685l080r994L272O208o888o04L292J371
5822B856j4087J1374J228Q823j429q243k519L044P056k54o657j1635p819p396
5808b5658O302L470M178j09J0898j5009j414Q189J6080J868q81j222j971j5642
5794a0921l800K631j206j841j4725k551J9157M834J1458J3360J117j4702m581
5781a770m490n956P177P55J2987l59j6584j7900O415J8212J3766P422j059q234
$$ plain form
5881 -6058 -7717 -6191 -7237 8040 4807 -9630 -5531 -1589 4 2000 244 2457 7500 2246
5867 2246 -638 -3876 -12099 -5999 -5224 -13374 -18519 -8176 -10041 -11374 -2578 -4771 -6325 6463 9606
5852 9606 7446 -3164 -4097 -6290 -13014 -10041 -6846 -14534 -692 9274 9712 391 11650 19972 8438
5837 8438 -3925 -953 -10236 -6699 -3264 -406 9279 6199 -3795 -523 5685 -1203 -1807 1485 2856
5822 2856 -11231 143 1371 10194 8765 522 -1997 1047 8103 7849 1192 -10443 -18262 -25658
5808 -25658 -19356 -15886 -11708 -11817 -919 -15928 -17342 -9153 6927 8795 7914 6692 4721 -10921
5794 -10921 -14721 -12090 -13296 -15137 -29862 -32413 -13256 -8422 3036 16396 17513 2811 -1770
5781 -1770 -6260 -12216 -5039 -4284 8703 8344 -8240 -26140 -19725 -1513 12253 19675 18616 10382
5767A0382j0837l976m206N265j824M672L839j79j6506M975J4509J2662O095r787
5753A5084j1831o130K284J381R92L627K732j289j2152k92m23k143J5693J1205
5739A8738K878k0915r61j1751q483N559K431J0668p272l132K596J4308j7324q555
5725b1215P802J1875k3P142K52o843O40o408K736m107M915R88m269J057R037o804
5709c225j1904k738J8176N607p692k447q969j3542R320O027M759R977j279N74
5695B644K634l237p54K029m021j6143O40J9195M24j7233m661N728L567K619j1152
5680a7721J397L744j004P368P094j315J6912K139j4265J584j1184k222P23r828
5666a6578LO406M554J2219K069K335j7550j1406J3134J0821m851m385O783L692
$$ plain form
5767 10382 -455 -4431 -8637 -3372 -5196 -524 3315 3136 -13370 -8395 6114 18776 24871 15084
5753 15084 3253 -2877 -593 788 1780 5407 8139 6850 -5302 -5594 -6017 -8160 7533 18738
5739 18738 21616 701 -260 -12011 -20494 -14935 -12504 -1836 -9108 -12240 -9644 4664 -12660 -21215
5725 -21215 -13413 -1538 -1561 5581 5833 -1010 -370 -6778 -4042 -8149 -3234 -2246 -6515 -5458 3579 -3225
5709 -3225 -15129 -17867 309 5916 -1776 -4223 -13192 -26734 -17414 -11387 -6628 3349 2070 2644
5695 2644 5278 2041 1287 3316 -705 -16848 -16208 2987 3411 -13822 -18483 -12755 -9188 -6569 -17721
5680 -17721 -16324 -12580 -13584 -6216 878 -437 16475 18614 4349 5933 -5251 -7473 -6750 -16578
5666 -16578 -16575 -10169 -5615 6604 8673 11008 -6542 -17948 -4814 6007 1156 -3229 3554 7246
5652G246n450j2503K603J3219K587p955j0797N109n043l912N604K015q352P352
5638h277J3478J892r776j3486r04J1887N766L330l182n429j138L148L316N518
5624F143o594j410J1934n759q343q22O448M346K786p810p592p14K530k566o451
5609a3874p665J327J0714k8N096J4289N76J195j4468p907j356R1M280m085k799
5594a4614O91j475L834k722J576j210J428J2054J109n485M093P84n909q053L050
5579a0849Q554L66j186k696m081O953l994n830K22L402O170J176L081J675n118
5564b155p555o441J255J2738j804j973o611O461L727J274J4966m240p702R34Q287
5549A1161r10J707k0320p800J913p915q74o130n399P805O492p176L833J0218J2237
$$ plain form
5652 7246 1796 -10707 -8104 5115 7702 -253 -11050 -5941 -10984 -14896 -9292 -7277 -15629 -8277
5638 -8277 5201 7093 -2683 -16169 -17073 -5186 580 3910 728 -4701 -5839 -2691 625 6143
5624 6143 -451 -1861 10073 4314 -4029 -4851 1597 5943 8729 919 -6673 -7387 -4857 -7423 -13874
5609 -13874 -21539 -20212 -9498 -9526 -4430 9859 10435 11630 -2838 -10745 -12101 -12010 -7730 -11815 -14614
5594 -14614 -13923 -15398 -11564 -14286 -12710 -13920 -12492 -438 671 -4814 -721 63 -5846 -13899 -10849
5579 -10849 -2295 -1929 -3115 -5811 -9892 -2939 -6933 -12763 -12541 -9139 -2969 -1793 1288 2963 -2155
5564 -2155 -9710 -16151 -14896 -2158 -3962 -5935 -12546 -6085 -2358 -1084 13882 9642 1940 2874 11161
5549 11161 10251 11958 -8362 -16162 -14249 -22164 -23038 -29168 -34567 -26762 -20270 -27446 -23613 -13395 -1158
5534a158N250o466R633L187j5655q345p919N629J3753N363L544j433j1779k84
5520f680J89K811L185l484r673L449J0957O543p584n191J3760q627j602o981o596
5505a5524l736J0771Q270k548j0490q412l934J1387M52o25k254m664p890l340
5491c2537M667J037j4597J1069J2616R541P783l172j3451j0233N020L293J2000
5478f964Q210p408J949j063l589L746L853m038k907J229l856O291J0350j3237
5464g434M714N865O319L110k200l682l615k175o953j423j9391j781P292J548m918
5449b4724P95k45M15J82J2521R06M925J631O473J1464J2458L96m611q622j4269
5434c05j5189J5831J432j2487Q440K126L40J4o809j0561N669O125l210O925j364
$$ plain form
5534 -1158 4092 -2374 7259 10446 -5209 -13554 -21473 -15844 -2091 3272 6816 5383 -6396 -6680
5520 -6680 -6491 -3680 -495 -3979 -13652 -10203 754 7297 -287 -5478 8282 -345 -1947 -8928 -15524
5505 -15524 -19260 -8489 -219 -2767 -13257 -21669 -25603 -14216 -13764 -14389 -16643 -21307 -29197 -32537
5491 -32537 -27870 -26833 -41430 -30361 -17745 -8204 -421 -3593 -17044 -27277 -22257 -18964 -6964
5478 -6964 1246 -6162 -4213 -5276 -8865 -5119 -1266 -5304 -8211 -6982 -10838 -4547 5803 -7434
5464 -7434 -2720 3145 9464 12574 10374 6692 3077 902 -6051 -7474 -26865 -28646 -21354 -19806 -24724
5449 -24724 -23929 -24174 -23759 -23577 -11056 -10150 -5225 -3594 2879 14343 26801 27197 22586 13964 -305
5434 -305 -15494 337 1769 -10718 -2278 -152 188 202 -6607 -17168 -11499 -5374 -8584 -1659 -3023
5419c023O26M039J2597N031L727j4933j986l925m549Q28K89n857M367O336n131
5404a564k916M27k326j1638M055P194J1731j136m185l629j5312J1169L163l654
5390h621J3129J0020p581r101R522J243K834L334J948r563R07k454j2961n68q590
5375a6502O168R391j2811m149N288J913j478K931l441K732K089K421J4514n040
5361D026j8488K825n746K279J0762o187k094J276j84L032L033N433l469k598K319
5346c781m299o54J2605J0789K108r881q373k071k777k216o865L492p962j1652
5332c1537J0387K0906k403r201M985J1199p355L465J299q85k625o887q73N627
5318c898M682l544l780N040k288N243L915P186o440j5640l803J4452J2445j2129
$$ plain form
5419 -3023 -2397 1642 14239 19270 22997 8064 6078 2153 -2396 -1568 -1279 -7136 -2769 3567 -1564
5404 -1564 -4480 -4053 -6379 -18017 -13962 -6768 4963 3827 -358 -3987 -19299 -8130 -4967 -8621
5390 -8621 4508 14528 6947 -2154 7368 8611 11445 14779 16727 7164 8071 5617 -7344 -7912 -16502
5375 -16502 -10334 -943 -13754 -17903 -12615 -10702 -12180 -9249 -12690 -9958 -7869 -5448 9066 4026
5361 4026 -14462 -11637 -17383 -15104 -4342 -10529 -12623 -11347 -11531 -8499 -5466 -33 -3502 -6100 -3781
5346 -3781 -8080 -8734 3871 14660 16768 6887 -1486 -3557 -6334 -8550 -15415 -11923 -19885 -31537
5332 -31537 -21150 -244 -2647 -11848 -6863 4336 -3019 446 1745 860 -1765 -8652 -9525 -3898
5318 -3898 784 -2760 -6540 -1500 -3788 1455 5370 12556 6116 -9524 -13327 1125 13570 1441
5304A441j0512R457N169j216l575K117M206m204L380q070m969m876l549J2608
5290b593k16P450N299l899l999l25k159O51K771p364r950p007N115L039j8j184
5274a4389Q079n087O257n882K70Q882N978m445o050N701K240L087l754K036p206
5259d283p34k981m781L299l389J605J9062K533J295m884j0107k604n56J982L6
5244d507m707q929Q144N996m969q059j1624P809M825J5099J0170p062q584j501
5230g899M848l360j141m560p742P753P760J3059j458o448p40l409J008n484l754
5215a1567q483j2852k260J0338J5877n139N801N092J0317M51P1q753p674R952
5201A171M426j307l007J368Q421k577j6107q708j0602j693J7012m693j1881O992
$$ plain form
5304 1441 -9071 386 5555 4339 764 2881 7087 2883 6263 -1807 -6776 -11652 -15201 -2593
5290 -2593 -2809 4641 9940 6041 2042 1717 -442 209 2980 -4384 -14334 -21341 -16226 -13187 -13205 -14389
5274 -14389 -6310 -11397 -5140 -11022 -10752 -1870 4108 -337 -6387 -686 1554 4641 887 2923 -4283
5259 -4283 -5017 -7998 -12779 -9480 -12869 -11264 7798 10331 11626 6742 -3365 -5969 -6525 -4543 -4507
5244 -4507 -9214 -18143 -9999 -4003 -8972 -17031 -28655 -20846 -16021 -922 9248 2186 -6398 -7899
5230 -7899 -3051 -6411 -7552 -12112 -19854 -12101 -4341 8718 7260 812 72 -3337 -2329 -7813 -11567
5215 -11567 -20050 -32902 -35162 -24824 -8947 -14086 -8285 -3193 7124 7575 7646 -1107 -8781 1171
5201 1171 5597 4290 1283 2651 11072 8495 -7612 -16320 -26922 -28615 -11603 -16296 -28177 -21185
5187b1185J252J0467J1143o581m346J0013J0817l625P41P388P540j3878j608j726
5173F412j059r04M322O560m637j2132K041N167j2598o029m785K222J2872Q558
5159F010q963p689K183R033R879o35J013p050m237Q632M342r452j3703M319J0473
5144D155M337k11n755r806o325O152l241M12p378K259J3675l151j2099l352M004
5129a6324j025Q019K2124n20n429j1516N130P719K242q375j124K395l976o100
5115f760R052J3081M789j4115j4845J23O877N932K997p155p669r700l889K75P438
5100a3569R022O377J000L835j661J885R32q115L020R65q538O249n151r65m004
5085h718n650M637M001k042p853P44O483J9329J4960n868O82n823p706Q61P763
$$ plain form
5187 -21185 -19933 -9466 1677 -4904 -9250 763 11580 7955 8696 16084 23624 9746 8138 6412
5173 6412 5353 4449 8771 15331 10694 -1438 603 5770 -6828 -12857 -17642 -15420 -2548 6010
5159 6010 -2953 -10642 -8459 574 10453 9818 10831 3781 -456 8176 12518 3066 -10637 -6318 4155
5144 4155 8492 8281 2526 -7280 -13605 -7453 -10694 -10282 -17660 -15401 -1726 -4877 -16976 -20328 -16324
5129 -16324 -17349 -9330 12794 12274 6845 -4671 459 8178 10420 2045 921 3316 -660 -6760
5115 -6760 2292 15373 20162 6047 -8798 -8675 -1798 4134 7131 -24 -7693 -17393 -21282 -21007 -13569
5100 -13569 -4547 1830 2830 6665 5004 6889 7821 -294 2726 3691 -4847 1402 -3749 -4714 -8718
5085 -8718 -14368 -9731 -5730 -7772 -15625 -14881 -8398 10931 25891 20023 20705 14882 7176 8037 15800
5070A5800L538Q27J16j1169j1370O913J779q779j008P009o690K69J824K032J2298
5055A3389L751l382q834r148J369k073K081r173n000j0278K213O165L749Q280
5041f891N513r178n89j1232L995J4807L97q64Q56q355J381Q366N121Q478N454
5026A7259q281p303J5901R978j5332q426n362Q649Q243Q16j3318j789j77O77J2056
5011A3591j443q187R650k360q863l568J695M276m770l213M572J0401q939J1326
4997A4168k236m78l114N035j1335r50J761j0571o330J2282m07l153N486P082m917
4982B323j4291k721Q342r46J3236L415P06M644l678m404k647n853N477l964K0
4967c41o678O810M184n160j6091M832N664r70n78q881q717M823N049J2226j606
$$ plain form
5070 15800 19338 20165 20281 9112 -2258 4655 6434 -2345 -3353 3656 -3034 -2765 -941 1091 13389
5055 13389 17140 13758 4924 -4224 -2855 -4928 -2847 -12020 -17020 -27298 -25085 -18920 -15171 -6891
5041 -6891 -1378 -10556 -11145 -22377 -18382 -3575 -3178 -4042 -3186 -11541 -10160 -1794 3327 11805 17259
5026 17259 8978 1675 17576 27554 12222 3796 -1566 7083 15326 16142 2824 1035 858 1535 13591
5011 13591 12148 3961 13611 11251 2388 -1180 515 4791 21 -3192 1380 11781 2842 14168
4997 14168 11932 11454 8340 13375 2040 1090 2851 -7720 -14050 -1768 -2175 -5328 158 7240 2323
4982 2323 -11968 -14689 -6347 -7293 5943 9358 10064 14708 11030 6626 3979 -1874 3603 -361 -341
4967 -341 -7019 -209 3975 -1185 -17276 -12444 -6780 -7750 -8328 -17209 -25926 -21103 -16054 -3828 -5434
4952e434k951j1927l601J0261J396m72L097o559M66J3275J1639k602j8710l265
4938a5387n797J196Q22J601Q039j744m370Q368Q277O389L131R163J972m415J060
4923A8305o308m801l489p372m168K951K292n968P456j11N14K89r160j0608O524
4908a3654J0609J298l558N902K854K131l171j779j0804r278j853R446k01J404
4894a0654P57K640J339M553l280o995p498J931P560J977J209p505q202J4706P182
4879b80m28j159N236j576m880p097m878k422M048M499q28M083m736Q032J158L492
4863B264J9553K316j5749j1964l272l522j530O139J451m926J86J551k342q027
4849a7872l284P958o097j411N042p843n977L653M664L75l058N254Q855k404j9666
$$ plain form
4952 -5434 -8385 -20312 -23913 -13652 -12256 -12728 -9631 -16190 -15724 -2449 9190 6588 -12122 -15387
4938 -15387 -21184 -19988 -19166 -17565 -9526 -11270 -15640 -7272 1005 7394 10525 19688 21660 17245 18305
4923 18305 11997 7196 3707 -3665 -7833 -4882 -2590 -8558 -1102 -1213 -699 -410 -9570 -20178 -13654
4908 -13654 -3045 -1747 -5305 597 3451 5582 2411 632 -10172 -19450 -21303 -11857 -12058 -10654
4894 -10654 -9897 -7257 -5918 -1365 -4645 -11640 -19138 -17207 -9647 -7670 -6461 -13966 -22168 -7462 -280
4879 -280 -708 -1867 3369 1793 -3087 -10184 -15062 -17484 -13436 -8937 -9765 -5682 -10418 -2386 -1228 2264
4863 2264 21817 24133 8384 -3580 -6852 -10374 -11904 -5765 -4314 -9240 -9054 -7503 -9845 -17872
4849 -17872 -21156 -13198 -19295 -20706 -15664 -23507 -29484 -25831 -21167 -20792 -23850 -18596 -9741 -12145 -31811
4834c1811l006J0814P339P107l825r084J1533Q165M615L104o901o388o578M908
4820a0008Q023P638j688j9992l800K110K579n208k211J2227R640j1678j268n127
4806a8763m775J456m027n967J677O071J394Q913O11K039o085J249N187K845r126
4791a7301k172J415n876M179N658J7346m984j1431j381M875j4848P056J480J087
4777a4897N83O352J0526j1627k4365K562J5787P200J1298m699j6601k910P478
4764a3313J7330O415O41M195N065k589r086j0530j3994Q1P651O2J816k241L997
4749d500o06K956R498P268r008j434P154K265J35j3511j2749j624n757Q138l217
4734a4992m787K952P682Q728J221L828K364o294j4027P652J1331m736q753O903
$$ plain form
4834 -31811 -34817 -24003 -16664 -9557 -13382 -22466 -10933 -2768 1847 4951 -1950 -8338 -14916 -10008
4820 -10008 -1985 5653 3965 -16027 -19827 -17717 -15138 -20346 -22557 -10330 -690 -12368 -13636 -18763
4806 -18763 -23538 -22082 -26109 -32076 -30399 -24328 -22934 -14021 -13410 -11371 -17456 -16207 -11020 -8175 -17301
4791 -17301 -19473 -18058 -23934 -19755 -14097 3249 -1735 -13166 -14547 -9672 -24520 -17464 -15984 -14897
4777 -14897 -14314 -7962 2564 -9063 -33428 -30866 -15079 -7879 3419 -1280 -17881 -20791 -13313
4764 -13313 4017 10432 11073 15268 20333 17744 8658 -1872 -15866 -15785 -8134 -8072 -6256 -8497 -4500
4749 -4500 -5106 -2150 7348 14616 5608 4174 11328 13593 13728 217 -12532 -14156 -19913 -11775 -14992
4734 -14992 -19779 -16827 -9145 -417 804 4632 6996 702 -13325 -5673 5658 922 -7831 -928
4720i28L764j302L576n50K481m112q86R256N432J1015O63j167N11M69m647o693
4704A6882j228j2157K687P684L982r168p900l252K009J694k088J041N01R759J1775
4689B2221N659N743n135j5795p274M95l290l630p155J1102K645r894O48n31K425
4674a766k227j1495p568j1317J20L436o24J2438k689N383J0402J3855O760P079
4660B1787J035j5181r128p690J0083O371K004k877m772J0331J612r294K293O561
4646A3135k440k573N914l538o478N018j1829j0553P353L021m161L688J2474O267
4632A5298p095O245N234j403m892j3449J96k267L124j375j059n866r798m153K270
4617a8990J850o340j658J6032J208K035J659j274N922k807q242q287k196J8101
$$ plain form
4720 -928 2836 1534 5110 4560 7041 2929 2043 11299 16731 27746 28409 27242 27753 28222 23575 16882
4704 16882 15654 3497 6184 13868 17850 8682 782 -2470 -461 1233 -855 186 687 10446 22221
4689 22221 27880 33623 28488 12693 5419 5914 2624 -1006 -8161 2941 5586 -4308 -3660 -4191 -1766
4674 -1766 -3993 -15488 -23056 -34373 -34253 -30817 -31441 -19003 -21692 -16309 -5907 7948 14708 21787
4660 21787 22822 7641 -1487 -9177 906 7277 9281 6404 1632 11963 13575 4281 6574 13135
4646 13135 10695 8122 14036 10498 4020 9038 -2791 -13344 -5991 -2970 -7131 -3443 9031 15298
4632 15298 8203 14448 19682 18279 13387 -62 134 -2133 991 -384 -1443 -7309 -17107 -21260 -18990
4617 -18990 -17140 -23480 -25138 -9106 -7898 -5863 -4204 -5478 444 -2363 -10605 -18892 -21088 -2987
4603b987K016j5337l08J389J1022Q752q462p156O285m67K427n220Q188J8507n904
4588A2745j4873L098O509n596O951Q585l128p077j609Q787l922j735j404m221
4574C110j6655K586M396o211l428P740J8465N349k78j9527j0288K311m146N083
4560a1493J7653K011J009Q013q298k2045J655P673J454L522n821n202K9L858O412
4545D30Q06K644k107p786J616j405k974R129l053l440K310N668m123p590k0J0338
4529D43N592M767p754j5026k091M749J257o741p603K0918J395l271K112l515o767
4514a1535Q374M433J0158R591K330j1431j0049j616J1618j0923k89j0933m536
4501a4808J0264k499o139k710J2430M718j956q133q791k577J0661j625M483O565
$$ plain form
4603 -2987 -971 -16308 -16616 -15227 -4205 4547 -3915 -11071 -4786 -5253 -2826 -8046 142 18649 12745
4588 12745 -2128 970 7479 1883 8834 17419 14291 7214 5605 14392 10470 8735 7331 3110
4574 3110 -13545 -10959 -6563 -12774 -16202 -8462 10003 15352 15074 -4453 -14741 -12430 -16576 -11493
4560 -11493 6160 8171 9180 17193 8895 -13150 -11495 -3822 -2368 1154 -4667 -9869 -9840 -5982 430
4545 430 1236 3880 1773 -6013 -4397 -5802 -8776 353 -2700 -6140 -3830 1838 -2285 -9875 -9895 443
4529 443 6035 10802 3048 -11978 -14069 -9320 -8063 -14804 -22407 -1489 -94 -3365 -1253 -4768 -11535
4514 -11535 -3161 1272 11430 21021 23351 11920 1871 255 11873 950 661 -10272 -14808
4501 -14808 -4544 -7043 -13182 -15892 -3462 1256 -700 -8833 -17624 -20201 -9540 -11165 -6682 -117
4487a17l812q17M276j8666q435N778k958N016L299M657J1931O575k734r575p200
4472a2782j446P040N672k487l408r577k22K301l817l966L064J928J0378J2460
4458E138P296L149q872j2539j5682O019j784J2950R909N254J34o372n951q171
4444i522Q098M756l256k062O601m243L08J845M8N791N833L518r34j2428q718P529
4428C164J2758m37j1953j3242k256J40j724K114L955Q901j5401j0190K749j962
4414b3384J0075N107j4641L064Q025R05l295j442n7p306O047J6789M519p976n308
4399h878M280J952Q581J0048R188M152k333q430r585j3680o064Q581m477l561
4385a0226m511P056J4022M386j130j0436j842k952j3390j113J20K218O282K49
$$ plain form
4487 -117 -3929 -4746 -470 -19136 -27571 -21793 -24751 -19735 -16436 -11779 152 6727 3993 -5582 -12782
4472 -12782 -14228 -7188 -1516 -4003 -7411 -16988 -17210 -14909 -18726 -22692 -19628 -17700 -7322 5138
4458 5138 12434 15583 6711 -5828 -21510 -15491 -17275 -4325 5584 10838 10972 4600 -1351 -9522
4444 -9522 -1424 3332 76 -1986 4615 372 680 2525 2573 8364 14197 17715 16781 4353 -4365 3164
4428 3164 15922 15485 3532 -9710 -11966 -11826 -13550 -11436 -7481 1420 -13981 -24171 -21422 -23384
4414 -23384 -13309 -8202 -22843 -19779 -11754 -10849 -14144 -15586 -15643 -22949 -16902 -113 4406 -3570 -8878
4399 -8878 -4598 -2646 5935 15983 25171 29323 26990 18560 8975 -4705 -10769 -2188 -6665 -10226
4385 -10226 -14737 -7681 6341 10727 9597 -839 -2681 -5633 -19023 -20136 -20016 -17798 -11516 -11267
4371a1267O359r060k907k165P004N537L557N331j525r575J7833J229p067m342
4357a058K403l953K257R29K812R180p786j1325L882M640K4J0193k931o609O276
4342H934j663j4043n261J729n980M470j812q804K527j923k967J8623K761N096
4328A687J4618M738p854n449j5174n5j1674k692J220Q951J2911M43K682L776m971
4313C157Q370o956M513J1737r771j0420n617j180l181J210J544R809N682q137
4299G60p019p025o469M766p264p474O242L386M377j340P942n385L430J842L014
4284f217p289j641m09J2669L699m24N127O94J337j4517L002m353k970N849L523
4269a920p966j0642J232M999N44Q491J0580m148j775l533Q050N211n0l025j3812
$$ plain form
4371 -11267 -4908 -13968 -16875 -19040 -12036 -6499 -2942 2389 864 -8711 9122 10351 3284 -1058
4357 -1058 1345 -2608 -351 578 3390 12570 4784 -6541 -2659 1981 2005 12198 9267 2658 8934
4342 8934 7271 -6772 -12033 -10304 -16284 -11814 -13626 -22430 -19903 -21826 -24793 -6170 -3409 1687
4328 1687 16305 21043 13189 7740 -7434 -7489 -19163 -21855 -20635 -11684 1227 1670 4352 8128 3157
4313 3157 11527 4571 9084 20821 11050 630 -4987 -6167 -9348 -8138 -6594 3215 8897 760
4299 760 -6259 -13284 -19753 -14987 -22251 -29725 -23483 -20097 -15720 -17060 -9118 -14503 -11073 -9231 -6217
4284 -6217 -13506 -15147 -15556 -2887 812 388 5515 6209 7546 -6971 -3969 -8322 -11292 -5443 -1920
4269 -1920 -9886 -20528 -19296 -14297 -13753 -5262 5318 1170 -605 -4138 3912 9123 9073 6048 -7764
4254g764J1058R2j0613J7l086K269N13J614K999J695M504Q34j1646L47R509j130
4238A212k453j287j813M159K417r117P950N886r71n456J0788L247j140K68n388
4223H302j2982j3057j2394J2435J4693K214o618O854J6491r480n944q404m109
4210a1999J1976o507q018m812J1129O724j3728l390J2727J1989M097J0361L044
4197B3593j4582j4452l733Q859J2097N00j3112L789m454p413L515o913m75P555
4183e226r611j176J3388j583j590m129J1570o131k598m155j093L993j0020j508
4169a9869j463M080j682J2333J2393M988j2278n815l538j1204J0722J1575m423
4156d181p380Q314o08j3725m338J8313m20l637J1379R4j401k467j3511m494j30
$$ plain form
4254 -7764 3294 3386 -7227 -7210 -10296 -8027 -7514 -5900 -2901 -1206 3298 4132 -7514 -7167 2342 1212
4238 1212 -1241 -2528 -4341 -182 2235 -6882 1068 6954 5983 527 11315 14562 13422 13690 8302
4223 8302 -4680 -17737 -30131 -17696 -3003 -789 -7407 -553 15938 6458 514 -7890 -11999
4210 -11999 -23 -6530 -14548 -19360 -8231 -1507 -15235 -18625 -5898 6091 10188 20549 23593
4197 23593 9011 -5441 -9174 -315 11782 12282 -830 2959 -1495 -8908 -5393 -12306 -12781 -5226
4183 -5226 -14837 -16013 -2625 -4208 -5798 -9927 1643 -4488 -7086 -11241 -12334 -8341 -18361 -19869
4169 -19869 -21332 -17252 -18934 -6601 5792 10780 -1498 -7313 -10851 -22055 -11333 242 -4181
4156 -4181 -11561 -3247 -3855 -17580 -21918 -3605 -4025 -7662 3717 3811 2410 -57 -13568 -18062 -18192
$$ [...]
##END NTUPLES=NMR SPECTRUM
##END=
