##TITLE=Analysis number 318502
Compound Code mo 00307
Project Code adrs
Chemist Name prosynth
##JCAMPDX= 6.0         $$ Bruker NMR JCAMP-DX V2.0
##DATA TYPE= NMR SPECTRUM
##DATA CLASS= NTUPLES
##ORIGIN= Bruker BioSpin GmbH
##OWNER= nmr
$$ XWIN-NMR		Version 3.5
$$ Thu Mar 30 10:13:24 2006 GMT Daylight Time (UT+1h)  MAYBRIDGE\nmr@NMR_250MHZ
##.OBSERVE FREQUENCY= 250.131544655141
##.OBSERVE NUCLEUS= ^1H
##.ACQUISITION MODE= SIMULTANEOUS (DQD)
##.ACQUISITION SCHEME= undefined
##.AVERAGES= 16
##.DIGITISER RES= 18
##SPECTROMETER/DATA SYSTEM= dpx250
##.PULSE SEQUENCE= zg30
##.SOLVENT NAME= CDCl3
##.SHIFT REFERENCE= (INTERNAL, CDCl3, 0, 16.522)
##AUDIT TRAIL= $$ (NUMBER, WHEN, WHO, WHERE, WHAT)
$$ ##TITLE= Audit trail, XWIN-NMR		Version 3.5
$$ ##JCAMPDX= 5.01
$$ ##ORIGIN= Bruker BioSpin GmbH
$$ ##OWNER= nmr
$$ C:\u/data/dgb/nmr/ADRS/1900/pdata/1/auditp.txt
$$ ##AUDIT TRAIL=  $$ (NUMBER, WHEN, WHO, WHERE, WHAT)
(   1,<2006-03-30 10:12:59.56 +100>,<MAYBRIDGE\nmr>,<NMR_250MHZ>,
      <created by zg, POWCHK disabled, PULCHK disabled
       configuration hash MD5:
       84 BC 41 DB A1 6E 1D 46 DA 25 12 A5 C1 ED C5 3A
       data hash MD5: 64K
       E4 C4 04 20 E3 CC A0 86 E1 E1 EC 1C B9 95 59 8F>)
(   2,<2006-03-30 10:13:15.11 +100>,<MAYBRIDGE\nmr>,<NMR_250MHZ>,
      <Start of raw data processing
       ef LB = 0.3 FT_mod = 6 PKNL = 1 SI = 32K 
       data hash MD5: 32K
       39 14 E9 3F 7E DA 6B 5D 92 C2 64 ED 4C 14 D0 81>)
(   3,<2006-03-30 10:13:16.61 +100>,<MAYBRIDGE\nmr>,<NMR_250MHZ>,
      <apk 
       data hash MD5: 32K
       49 2A 9A 27 71 0E 56 0A 7F 71 74 4B 86 AE 3E 33>)
(   4,<2006-03-30 10:13:17.56 +100>,<MAYBRIDGE\nmr>,<NMR_250MHZ>,
      <abs ABSG = 5 
       data hash MD5: 32K
       54 1C 0B 3D B2 53 DB D9 8E E2 6E 1E 66 52 B5 50>)
$$ ##END=
$$ 
$$ hash MD5
$$ D2 9E 7E 06 D3 D7 8C C5 39 64 B5 D4 D4 DE 2A D0
##$RELAX= 
##$RELAX= 
##$RELAX= 
##$RELAX= 
##$RELAX= 
##$RELAX= 
##$RELAX= 
$$ Bruker specific parameters
$$ --------------------------
##$DU= <C:\u>
##$EXPNO= 1900
##$NAME= <ADRS>
##$PROCNO= 1
##$TYPE= <nmr>
##$USER= <dgb>
##$AMP= (0..31)
100 100 100 100 100 100 100 100 100 100 100 100 100 100 100 100 100 100 
100 100 100 100 100 100 100 100 100 100 100 100 100 100 
##$AQSEQ= 0
##$AQ_mod= 3
##$AUNM= <au_zg>
##$AUTOPOS= <15 >
##$BF1= 250.13
##$BF2= 250.13
##$BF3= 250.13
##$BF4= 250.13
##$BF5= 500.13
##$BF6= 500.13
##$BF7= 500.13
##$BF8= 500.13
##$BYTORDA= 1
##$CFDGTYP= 0
##$CFRGTYP= 5
##$CHEMSTR= <none>
##$CNST= (0..31)
1 1 145 1 1 1 1 1 1 1 1 1 1 1 1 1 1 1 1 1 1 1 1 1 1 1 1 1 1 1 1 1 
##$CPDPRG= <>
##$CPDPRG1= <>
##$CPDPRG2= <>
##$CPDPRG3= <>
##$CPDPRG4= <mlev>
##$CPDPRG5= <mlev>
##$CPDPRG6= <mlev>
##$CPDPRG7= <mlev>
##$CPDPRG8= <mlev>
##$CPDPRGB= <>
##$CPDPRGT= <>
##$D= (0..31)
0 1 0 0 0 0 0 0 0 0.06 0 0 0 0 0 0 0.0002 0 0 0 0 0 0 0 0 0 0 0 0 0 0 
0 
##$DATE= 1143709978
##$DBL= (0..7)
120 120 120 120 120 120 120 120 
##$DBP= (0..7)
150 150 150 150 150 150 150 150 
##$DBP07= 0
##$DBPNAM0= <>
##$DBPNAM1= <>
##$DBPNAM2= <>
$$ [...]
##$SUBNAM7= <"">
##$SUBNAM8= <"">
##$SUBNAM9= <"">
##$SW= 20.6930455092707
##$SWIBOX= (0..15)
0 0 3 0 0 0 0 0 0 0 0 0 0 0 0 0 
##$SW_h= 5175.983436853
##$TD= 65536
##$TD0= 1
##$TE= 294.16
##$TE2= 300
##$TE3= 300
##$TEG= 300
##$TL= (0..7)
0 120 120 120 120 120 120 120 
##$TP= (0..7)
150 150 150 150 150 150 150 150 
##$TP07= 0
##$TPNAME0= <>
##$TPNAME1= <>
##$TPNAME2= <>
##$TPNAME3= <>
##$TPNAME4= <>
##$TPNAME5= <>
##$TPNAME6= <>
##$TPNAME7= <>
##$TPOAL= (0..7)
0.5 0.5 0.5 0.5 0.5 0.5 0.5 0.5 
##$TPOFFS= (0..7)
0 0 0 0 0 0 0 0 
##$TUNHIN= 0
##$TUNHOUT= 0
##$TUNXOUT= 0
##$USERA1= <user>
##$USERA2= <user>
##$USERA3= <user>
##$USERA4= <user>
##$USERA5= <user>
##$V9= 5
##$VALIST= <valist>
##$VCLIST= <CCCCCCCCCCCCCCC>
##$VD= 0
##$VDLIST= <DDDDDDDDDDDDDDD>
##$VPLIST= <PPPPPPPPPPPPPPP>
##$VTLIST= <TTTTTTTTTTTTTTT>
##$WBST= 1024
##$WBSW= 4
##$XGAIN= (0..3)
0 0 0 0 
##$XL= 0
##$YL= 0
##$YMAX_a= 331443
##$YMIN_a= -385273
##$ZGOPTNS= <>
##$ZL1= 120
##$ZL2= 120
##$ZL3= 120
##$ZL4= 120
##$ABSF1= 16.522
##$ABSF2= -4.171173
##$ABSG= 5
##$ABSL= 3
##$ALPHA= 0
##$AQORDER= 0
##$ASSFAC= 0
##$ASSFACI= 0
##$ASSFACX= 0
##$ASSWID= 0
##$AUNMP= <proc_1d>
##$AZFE= 0.1
##$AZFW= 0.1
##$BCFW= 0
##$BC_mod= 0
##$BYTORDP= 0
##$COROFFS= 0
##$CY= 12.5
##$DATMOD= 1
##$DC= 0
##$DFILT= <>
##$DTYPP= 0
##$F1P= 14.0000005364418
##$F2P= -0.99999901652339
##$FCOR= 0.5
##$FTSIZE= 32768
##$FT_mod= 6
##$GAMMA= 0
##$GB= 0
##$INTBC= 1
##$INTSCL= 1
##$ISEN= 128
##$LB= 0.3
##$LEV0= 0
##$LPBIN= 0
##$MAXI= 10000
##$MC2= 0
##$MEAN= 0
##$ME_mod= 0
##$MI= 0
##$NCOEF= 0
##$NC_proc= -3
##$NLEV= 6
##$NOISF1= 0
##$NOISF2= 0
##$NSP= 0
##$NTH_PI= 0
##$NZP= 0
##$OFFSET= 16.522
##$PC= 1
##$PHC0= 174.6534
##$PHC1= 5.21754
##$PH_mod= 1
##$PKNL= yes
##$PPARMOD= 0
##$PSCAL= 4
##$PSIGN= 0
##$REVERSE= no
##$SF= 250.13
##$SI= 32768
##$SIGF1= 0
##$SIGF2= 0
##$SINO= 400
##$SIOLD= 32768
##$SREGLST= <1H.CDCl3>
##$SSB= 0
##$STSI= 32768
##$STSR= 0
##$SW_p= 5175.98343685301
##$SYMM= 0
##$S_DEV= 0
##$TDeff= 65536
##$TDoff= 0
##$TI= <Analysis number 999999
Compound Code 99
Book Reference 9
Project Code 9>
##$TILT= no
##$TM1= 0
##$TM2= 0
##$TOPLEV= 0
##$USERP1= <user>
##$USERP2= <user>
##$USERP3= <user>
##$USERP4= <user>
##$USERP5= <user>
##$WDW= 1
##$XDIM= 32768
##$YMAX_p= 399240172
##$YMIN_p= -201256
$$ End of Bruker specific parameters
$$ ---------------------------------
##NTUPLES= NMR SPECTRUM
##VAR_NAME=  FREQUENCY,     SPECTRUM/REAL,   SPECTRUM/IMAG
##SYMBOL=    X,             R,               I
##VAR_TYPE=  INDEPENDENT,   DEPENDENT,       DEPENDENT
##VAR_FORM=  AFFN,          ASDF,            ASDF
##VAR_DIM=   32768,         32768,           32768
##UNITS=     HZ,            ARBITRARY UNITS, ARBITRARY UNITS
##FACTOR=    0.157963299565203, 1,           1
##FIRST=     4132.6476996994, 0,             0
##LAST=      -1043.33573715361, 0,           0
##MIN=       -1043.33573715361, -201256,     0
##MAX=       4132.6476996994, 399240172,     0
$$ Real data points
##PAGE= N=1
##DATA TABLE= (X++(R..R)), XYDATA
$$ [...]
22972 -14961 -57198 -47466 -10216 3542 11207 5120 25765 32293 18281 -4941 -47985 -26261
22960 -26261 2664 -1819 -30070 -50571 -78701 -79094 -80624 -32394 10230 73668 78126 60901 44454
22947 44454 43115 -27816 -43089 -6268 -12010 -21860 -29410 -42889 -23262 -6317 37569 51697
22935 51697 6753 -15646 -20701 19661 66665 56353 68282 69541 67591 96054 187543 388920
22923 388920 587053 653531 567656 415676 287039 197013 186613 116861 44573 47494 48514
22912 48514 7650 10170 -15844 -61986 -80735 -32345 -14714 -13221 -17133 3587 3155 -49554 -51453
22899 -51453 -61565 -28939 501 -30786 -79049 -89944 -109527 -92932 -105118 -77247 -71446 -38904
22887 -38904 -32140 -985 33234 38580 32385 15540 18159 69560 68623 48470 49890 3537 -27654
22874 -27654 -31398 -44908 -95189 -98033 -92857 -40378 -37189 -34357 -20333 -54558 -89429 -79485 -28615
22861 -28615 -5471 5050 13682 8046 14347 32614 37325 -12060 -25901 -1674 19556 -19113
22849 -19113 -50653 -35102 -23733 -9987 -16714 -7245 27151 48342 75844 42810 9010 -12608
22837 -12608 -2202 7220 -22289 -6123 23861 74678 74007 68052 14241 -53349 -54815 -54815 -30390
22824 -30390 -5261 -24926 20136 64428 32267 43394 5214 -27965 2112 1175 -20944 -5748
22812 -5748 31008 55941 39478 60223 120783 96332 30403 25468 39473 42367 36679 47021
22800 47021 12677 21550 37494 32533 23586 21388 60375 58373 53617 58285 -10133 -82576 -40330
22787 -40330 -21240 -34067 -18413 18362 63160 23980 -11759 -23308 -27951 -4914 14722 -6047
22775 -6047 18883 15635 16864 -13091 6272 37673 36601 42823 37511 24983 28981 9651 27299
22762 27299 75775 86570 89326 46505 22138 2631 -14497 -18765 12199 33856 43683 38438
22750 38438 23884 4219 22544 78699 61735 -2927 -14996 -27370 4619 7937 -9705 -47043
22738 -47043 -69195 -34781 6200 -15345 5073 5158 -12551 -21659 -32014 -27865 -44585 -53058 -87909
22725 -87909 -58268 -42160 -12563 32863 69101 48114 33735 38026 21317 14383 27054 30643
22713 30643 41833 78424 59227 -9730 20050 77808 48892 2067 -4213 19304 48056 43748
22701 43748 43496 29545 -2976 -14195 -14817 -20637 -65414 -65486 -71079 -36821 18793 55469 69694
22688 69694 53271 51130 83618 103807 69936 48646 -18265 -32420 -7145 -16577 -48063 -28177
22676 -28177 15197 52451 9657 -29510 -22584 -30745 -3993 18060 -11998 -35000 -61896 -60804
22664 -60804 -32752 -4279 -2641 -19376 -39428 -14883 -12766 -16799 -52073 -38166 -375 8311
22652 8311 -22435 17872 32173 918 -28214 -19315 3007 15927 32239 2434 26308 23021
22640 23021 6889 -4380 8111 23756 48732 24951 26024 55599 68034 106227 94105 34402
22628 34402 -10653 -41736 -70034 -43760 -24865 -39210 -56816 -56813 -28048 -40833 -52828 -54755 -23454
22615 -23454 -6991 -3725 9222 -24133 -47710 -28306 -13632 -13892 -43935 5461 46074 39052
22603 39052 3020 -12183 11406 -6146 -12696 -23988 -53129 -18554 -25894 -34735 -36343 -36569 -43854
22590 -43854 -53949 -10088 6849 40724 21502 -2426 43048 64905 56992 57811 37942 41386
22578 41386 52425 70519 33283 44140 26519 4743 14955 7983 -42052 -42295 -13998 11681
22566 11681 63885 75220 48395 67420 54154 49653 26471 -12215 -30567 -40559 2809 25530
22554 25530 4332 -12084 -22519 -71060 -44476 -3600 40989 50545 57989 50275 53646 50371 76025
22541 76025 110541 107524 58457 11274 8720 36881 12945 -16107 -26453 -37005 -45664 -6851
22529 -6851 372 -26530 10650 -6132 -2979 13551 48619 73565 76721 43836 38729 40073 51187
22516 51187 76137 59825 68196 54092 19701 -31678 -48795 -65522 -7654 36553 29849 -358
22504 -358 -17962 -50305 -73567 -80847 -38218 -46289 -27731 11967 -3312 -30938 28835 34569 -6959
22491 -6959 -37106 -72359 -61356 -53414 -43161 -41544 -8976 13609 27610 19238 3827 25701
22479 25701 72650 63167 4947 -72 3881 10735 49262 53426 34062 4204 49696 87255 86377
22466 86377 134315 201576 234897 268027 429198 692147 878955 811127 557636 332405 205092
22455 205092 183375 210881 154699 103911 91097 78264 66145 94491 109922 95811 87482 70180
22443 70180 44173 13686 50908 64694 76268 102812 106079 84119 51887 34879 43994 52056
22431 52056 27940 63231 128959 168385 171753 168417 137623 130708 145260 147722 170324 187411
22419 187411 207186 240357 268644 324268 370885 405740 405901 390489 464702 564430 704210 854402
22407 854402 990076 1114994 1211111 1423690 1717986 1891873 1907488 1878614 1978093 2315354
22397 2315354 2723747 3001410 3165392 3379090 3941087 4937741 6333590 8330938 11220084
22388 11220084 15853491 24391483 41797835 76481875 122767541 149782051 138233686
22381 138233686 100636516 61895794 38117575 26064327 19524537 15471503 12564157
22374 12564157 10345120 8625825 7333840 6456938 5870601 5219471 4509924 3824089 3266325
22365 3266325 2842899 2526917 2253267 2028225 1849005 1676228 1536700 1456509 1425195 1350414
22355 1350414 1266080 1178145 1050447 992355 954711 926678 834797 800654 768737 694912 632148
22344 632148 616566 595941 498167 432113 387093 336238 277070 269731 284424 259201 237030 281943
22332 281943 294857 245152 270469 250975 189218 161350 133460 177077 258377 241372 229401
22321 229401 213782 248982 247061 201329 157324 117810 123100 123485 142816 126570 119588 185911
22309 185911 264427 366186 498226 746435 960149 949333 749064 527805 388167 276321
22299 276321 205206 166621 176211 181090 167359 116565 115981 146628 199044 235896 226345 188460
22287 188460 192046 142388 84277 66970 103977 90492 83781 100668 116432 101854 111120 115571
22275 115571 107684 122132 102440 60835 73086 70429 47718 8928 44023 16362 26825 25592
22263 25592 70068 126951 134946 115212 138682 164725 185613 156389 175123 137897 95257 74620
22251 74620 59772 44130 33898 55639 63619 -18023 -38177 708 21592 27340 56848 109189
22239 109189 100712 56780 78913 79255 87618 77492 60677 69806 42472 46095 114626 135741 94026
22226 94026 98442 89907 88839 44381 4980 -14866 -58356 -41895 -13158 28678 6498 -23781
22214 -23781 -30300 -46456 -15301 12182 37850 19277 -35559 -31364 -23283 15532 59041 42998
22202 42998 31857 2567 -48691 -77703 -33224 21422 7273 -54515 -52060 6745 -2324 -19572
22190 -19572 -25878 -19250 -43318 -75825 -71433 -31330 -8361 -25208 -43109 -72911 -68160 -47492
22178 -47492 -76645 -65049 -24629 -9952 28037 53020 71496 71229 51069 83970 92224 79266
22166 79266 30235 -18815 -2045 25693 21712 4527 2970 -16747 -6940 -8322 -7612 -44135 -14787
22153 -14787 -17272 -67976 -37791 -45022 -36918 -9042 6608 26519 44167 48486 20380 5419
22141 5419 35687 38840 -14497 874 35992 46017 64725 49881 37695 14606 2567 42401
22129 42401 55463 41933 32492 -31147 -67111 -68432 -75975 -5914 -36798 -34420 -24539 -9126 -44747
22116 -44747 -8140 48297 77267 48533 36064 8853 -70290 -73279 -21390 7513 40975 46896
22104 46896 28133 790 -36224 -12941 -30015 -8286 30828 50835 68299 94914 53501 17137
22092 17137 -22393 -8830 20454 24782 21687 -6811 -80996 -73936 -20839 1268 -14502 -28498
22080 -28498 -14732 -29051 -22324 15045 -10658 -49229 -27637 -2600 32628 26002 -7401 -22458
22068 -22458 -35142 -53606 -25083 -12981 17103 33465 8795 22953 15877 -29599 -35322 -33409
22056 -33409 -24786 -4219 -248 -32500 -58928 -36914 -25146 -10875 -11313 17175 -3594 -13302 -14474
22043 -14474 -14816 38528 22122 -18612 -6898 -15619 -7229 -2959 -25426 -47324 -84828 -60454 608
22030 608 3050 -41893 -74593 -50845 -39480 -43607 -13255 7112 28266 38485 35795 33476 56254
22017 56254 74232 53687 36553 39042 27559 -10061 -27411 -37511 -10684 -12878 -16456 2152
22005 2152 -31250 -81102 -116634 -137753 -106291 -36507 -49897 -7042 45593 48104 75083 67401
21993 67401 67977 43967 -7990 44959 49144 33418 31771 31512 64827 69738 26105 19389 25155
21980 25155 1197 -19731 -27499 -36585 -6819 16575 50748 78233 64949 62782 46883 39861
21968 39861 40827 71846 70750 53998 55308 61106 70285 69080 31709 -9518 13611 42148 58199
21955 58199 23428 37829 28721 -9713 -31449 -63879 -100458 -75519 -56797 -18158 -31168 -23037
21943 -23037 -41663 -32415 -27573 2628 19272 10274 19479 12515 -15485 -35168 20242 29924 13688
21930 13688 -14041 714 3774 -11194 -21230 -66922 -43137 -32776 -22361 -38140 -36271 14410
21918 14410 7531 39697 43721 47549 31461 38669 41552 -9044 -28482 -16723 -31952 -32241 -20099
21905 -20099 -18799 -5513 -37303 -49950 -23205 -17795 -25507 -56657 -65423 -61448 5845 944 -21810
21892 -21810 -17487 -42600 -17775 19695 28295 24129 -43173 -54765 -51591 -18297 9152 -16920
21880 -16920 -55417 -56239 -51674 -77502 -60738 -43062 -42969 -57901 -31509 -13919 -4808 12047 51094
21867 51094 35036 -8210 -8351 -1209 38264 11797 -25776 6997 46541 39099 -10972 35818
21855 35818 46359 9493 -6167 -21627 -3235 -10858 -24335 7427 27484 36905 25230 11224
21843 11224 47719 36752 14645 11819 74142 155450 261408 441388 636932 704170 615546
21832 615546 466607 294142 179815 121052 110677 122056 101795 108459 146323 120686 66981
21821 66981 51475 42288 38904 81325 75743 22011 20206 185 -45914 -31289 -50498 -50747 -59864
21808 -59864 -35908 -8300 -53797 -40310 -21560 -32099 20056 41816 25965 29062 49066 23232
21796 23232 20912 -26270 -74459 -40627 -30307 -45381 -40484 -31292 -23573 2495 3971 2645 21915
21783 21915 43292 53857 59102 79593 24067 -15627 4776 13249 -26370 -35907 -12607 3327
21771 3327 11562 51325 21185 -35658 -24236 37493 4918 -41192 -65171 -93570 -107161 -53380
21759 -53380 -11072 -8096 -26699 -52764 -41912 -2217 17649 -45886 -89685 -19877 31600 41370
21747 41370 11028 -22440 -38461 -47392 1859 57269 45483 -641 -27972 -5227 -12643 -19045
21735 -19045 -7746 -15740 -34842 -56127 -31369 -29139 -34716 -11051 5579 26300 24544 -7648
21723 -7648 12839 9166 -14973 -31897 -46772 -22325 5302 -39912 -102186 -78936 -50045 -10648
21711 -10648 -21993 -31298 -14443 11808 -4692 16817 9993 -242 -50146 -58016 -5872 -2179
21699 -2179 -16935 -6547 -3106 -4750 22687 41188 23251 17271 11006 17000 16321 2355 8122
21686 8122 802 -1331 -41267 -26763 -15748 -22952 -17918 18226 -10379 -63727 -59647 -55029 -75599
21673 -75599 -117985 -91522 -19064 27727 41938 -13973 -7716 19043 26430 26680 -35317 -34883 -71152
21660 -71152 -109166 -45743 20008 16797 -34415 -32682 -39995 -74721 -92442 -77776 -62486 -21679
21648 -21679 17426 31055 760 -24773 -50698 -47230 11293 29742 602 5761 8628 -3971
21636 -3971 37173 36550 26519 24221 31877 45238 40864 17012 15079 25789 31096 -1820 -1742 -12595
21622 -12595 -14873 -41041 -54454 -78602 -71980 -3972 -22440 -59268 -53498 -52726 -77419 -86721 -85016
21609 -85016 -76724 -92499 -87668 -82635 -73896 -39093 -6543 14156 40162 45657 24143 -4452 -15686
21596 -15686 -41357 -59455 -36466 -39151 -74036 -72514 -46490 -459 15074 -1951 -6601 -62266
21584 -62266 -48803 -48032 -21740 -22586 -25750 22465 26930 -7575 -23930 -47812 -66592 -48165 9359
21571 9359 -13520 -22108 -3096 -24431 -25569 -14790 19999 -6995 -19677 -19018 3600 33004 33752
21558 33752 3056 14287 68753 67484 67269 32818 -33603 -27742 -20323 -40792 -50085 -22848 -15613
21545 -15613 -37507 -7068 14125 -7361 18783 60512 60607 29839 13684 8427 -1886 750 14342
21532 14342 -9151 -42408 -41017 -49222 -85729 -66706 -29641 11930 53937 40851 30421 8692
21520 8692 -5509 10682 22196 20667 16088 -5618 36618 57512 60612 2065 -17635 -15589 10708
21507 10708 4503 39888 -16729 -83174 -74527 -28045 -16900 -23145 -37790 -14503 16722 14252
21495 14252 32859 23926 4743 -3833 1300 19730 35344 36476 -2711 -22095 -8862 -21511
21483 -21511 -49070 -79735 -85589 -76739 -80119 -94523 -113901 -72619 -82878 -74492 -52321 -14039
21471 -14039 4283 -10428 218 -7030 -33810 -46212 -44641 -26762 -21149 -14981 -34094 -76219
21459 -76219 -74634 -43808 -52289 -61716 -43195 -37319 -21393 -25566 2188 -18540 -59745 -53121 -28592
21446 -28592 -38844 -47198 -48723 -28597 -35261 -31852 -44301 -46429 -58455 -56197 -59203 -47768 -21525
21433 -21525 -3636 -141 1668 -10976 51444 63399 62204 42472 44622 36227 23639 45971 44726
21420 44726 -11090 -78356 -78780 -48802 -31441 15030 64775 60049 77408 64315 18802 10594
21408 10594 -4997 3892 -29518 -64649 -84411 -94117 -60897 -44804 -28320 2277 -5242 -28006
21396 -28006 -50592 -43933 5478 -21164 -27384 -14602 -30909 -35347 -55620 -33529 11940 2982
21384 2982 -43521 -80627 -71253 -32857 -23693 -11849 7676 60233 54282 29933 7003 -37016
21372 -37016 -40311 -8245 -10795 -29259 -59362 -115999 -112016 -93555 -64062 -67231 -82946 -103921
21360 -103921 -49767 -27658 4341 -55193 -73831 -90746 -90757 -107205 -89235 -76807 -11761 62564
21348 62564 59642 57146 35536 35221 35173 53496 44289 -18297 -29953 -31930 -50461 -33166 -26974 -25781
21334 -25781 -349 -20969 -35131 -20158 -47443 -16330 19266 7918 19795 57127 38622 51727
21322 51727 104708 113716 74253 38151 20544 6015 -38539 -45584 -24916 2674 71613 84431
21310 84431 40038 -5058 -27623 -19846 -13926 -41631 -50018 -74711 -55156 -62430 -44699 -699
21298 -699 -5219 12644 -6664 -36561 -19035 18559 47484 16809 -10974 -33268 -448 8850
21286 8850 -38432 -37459 11636 7866 -12369 -55633 -93282 -88653 -42382 -38158 -22598 -6898 10100
21273 10100 45126 92835 117694 69284 7120 -34371 -42189 -2387 -24602 -16187 1519 -1774
21261 -1774 -11211 -6536 -16292 -44142 -56049 -60729 -67490 -98398 -87264 -71798 -63548 -47034 -29422
21248 -29422 -53465 -78966 -42063 -23700 -30679 -15802 -19965 -39139 -29218 24450 60951 62583
21236 62583 68412 78239 49560 -2001 27939 11014 12379 4267 -13010 -12039 6278 -8265 -21467
21223 -21467 -26011 12692 5231 19442 25113 1653 -14705 -6313 28244 3422 -8477 -3135 -11284
21210 -11284 22009 57718 61330 110459 116143 40524 18663 -1472 -30246 -36684 -26864 -8912
21198 -8912 -27877 -37177 -18650 -44019 -37665 -21076 1458 17728 10379 12974 23376 24072 41409
21185 41409 36403 14293 12332 23734 51186 39098 15527 -3357 -16401 -47288 -42901 -7312
21173 -7312 9985 -87 -21924 -41000 -19513 6050 -196 -18252 4262 -22188 -15824 15430
21161 15430 32464 14820 10367 3552 20529 46026 16219 23235 -5275 -21581 -2311 25630
21149 25630 40946 47872 39746 939 -2645 1037 -28 -3351 12392 -18163 -39417 -36200 -43804
21136 -43804 -49876 11338 9524 10395 4336 -29547 -56077 -56053 -49282 -20988 19246 40233 14565
21123 14565 5204 5455 -13872 4711 73508 98622 81311 29717 20814 35473 33846 44075 53970
21110 53970 14358 7492 20366 38362 10769 -32211 -48563 -28864 -9462 11140 21628 34166
21098 34166 8500 -13154 -15820 -26860 -35616 5975 18760 53238 39344 7790 20243 57937
21086 57937 101286 57434 49629 50292 8563 8685 33053 16718 13965 9061 -761 -7517 14962
21073 14962 64509 57201 39705 16570 4402 11666 19241 7619 -25410 -14808 6889 3304
21061 3304 -18024 -14544 -22210 -52736 -49889 -26538 9978 31966 19668 146 -24363 -18459 -45654
21048 -45654 -21413 16731 18395 -18488 -21693 23477 23445 4291 -24798 -46575 -36866 -15511 -10171
21035 -10171 -85805 -109789 -69056 -45323 -75702 -73567 -53908 -23515 -32641 -30886 -46946 -37824
21023 -37824 -16212 -38462 -29431 25260 32936 27299 63514 47612 41529 40936 36020 37386 50107
21010 50107 66951 9648 6881 -7082 -14583 -50281 -88754 -72993 -90802 -90991 -41899 -15967
20998 -15967 -23382 8531 63030 87449 80395 67383 41837 62134 84065 79953 23874 29599
20986 29599 49502 17444 -11757 622 -3063 -17564 -22727 -12951 25270 12141 -10100 -44974
20974 -44974 -50657 -45180 -43042 -32809 5601 18520 -4423 -17836 -26422 -6377 18422 1677
20962 1677 -10184 -2950 -28406 -36641 -20873 18728 1007 10759 2046 12147 -7689 -33004 -25958
20949 -25958 -20786 20396 -8050 27026 30023 37486 29589 2947 4756 -38031 -47632 -69236 -40994
20936 -40994 -20753 -5978 -22665 -44457 -78692 -78567 -98991 -112633 -84232 -77293 -126606 -99965
20924 -99965 -62685 -32004 3355 18318 1111 -19796 -8332 -8193 -4552 -19177 -6486 -28552
20912 -28552 -23467 12312 17228 4460 -19042 -20619 34987 25119 23339 25494 19133 17179 -11392
20899 -11392 -11060 12385 63821 59253 65043 79170 16819 -45927 -39707 18190 73269 64791 51253
20886 51253 36448 35529 16863 7914 32504 57381 47502 223 -18334 -36730 -64105 -80209
20874 -80209 -67962 -49841 -17676 4346 -6995 3020 8616 -24287 -20126 -18470 -8868 -1360 -15949
20861 -15949 -48420 -55216 -60048 -11303 27803 37177 26325 -20041 -27864 -10784 4459 6274 -2673
20848 -2673 12596 1484 -3468 -21181 -32642 13127 19912 19674 -25997 -13977 22146 2411 -3258
20835 -3258 -3975 -20834 7564 15168 20730 34152 42095 33992 29828 31665 55301 42561 36824 27171
20821 27171 38419 57883 93007 72239 27877 10755 32853 98052 89438 43512 5180 11278
20809 11278 -9770 -53108 -66810 -65440 -16856 -9482 -1487 -21447 -32976 -19518 -7018 -28303
20797 -28303 -21819 -9236 -12542 -910 36709 55473 56460 7634 8224 -21687 -26119 -1112 14407
20784 14407 -21129 -27069 -14026 -30383 -67482 -80899 -76239 -49637 8221 41745 50476 19749
20772 19749 -4866 -12552 -33339 -13316 -32425 -13756 31585 50759 35201 6920 -8855 -22956
20760 -22956 14908 21339 13378 -18534 -51438 -25002 2555 4829 -49832 -90711 -77497 -52804
20748 -52804 -40364 -18379 -12787 -30928 -51568 -54787 -25646 -24817 2732 18779 -9755 -13896 -4425
20735 -4425 30195 33343 18347 16603 13814 611 54 68800 103601 81758 41002 50027 40629
20722 40629 31914 13530 -42850 -80245 -60250 -22238 -20926 -6789 -19858 -54166 4684 53046
20710 53046 34344 8072 8946 -16432 -44308 -66404 -57835 -56198 -56586 -32929 -13857 -8930 -24486
20697 -24486 4177 15055 33566 34611 30539 15200 -547 -10137 18054 -21554 -35135 -24528
20685 -24528 -43352 -58569 -64294 -74251 -73645 -73390 -28952 -48381 -94732 -71697 -66464 -106941 -136833
20672 -136833 -56925 15465 48429 73250 37897 -922 -27926 -1748 -15318 -727 26093
20661 26093 57058 25022 -34723 -23392 17482 -18708 -44350 -22827 -21219 -50071 -43295 -35721
20649 -35721 -11609 -24482 -4932 17743 2527 -22947 5907 23948 -8645 -76530 -99681 -70830
20637 -70830 -28530 -20431 -17241 -7779 -16380 9477 21573 57988 43266 -764 -29367 -42897
20625 -42897 -3418 43095 28931 -15894 -10666 -2307 1001 -26156 -50435 -39086 -52872 -80982
20613 -80982 -68376 -44792 -51347 -59174 -66583 -30565 7561 -31790 -67271 -81529 -46874 -38330
20601 -38330 -86305 -36281 16933 24693 30632 53450 21133 9207 14050 11908 35044 57358
20589 57358 81459 46783 36190 34709 53076 23806 -9124 -8643 -40427 -47832 -33394 -51645
20577 -51645 -59486 -48363 -44429 -53591 -68040 -70255 -36235 -12371 8931 38861 2645 -50767
20565 -50767 -73542 -68925 -17909 -39157 -59478 -53345 -40617 -27583 8306 37855 54508 -6480
20553 -6480 40408 106389 73397 46222 51681 43740 19362 11574 -19252 -24539 -79176 -81664 -115265
20540 -115265 -100761 -71944 -59027 -74667 -56373 -20949 -28599 -3897 14198 -9408 -9520 -13571
20528 -13571 8760 25639 31210 -18781 -56353 -31129 -17362 -1753 3463 17634 7265 -3547
20516 -3547 -35274 -62769 -30233 735 5917 26017 53292 57102 39719 21272 19435 25020 21723
20503 21723 14349 -391 25249 28865 9267 -4999 -37954 -33965 -19279 12199 18612 6961
20491 6961 -10937 -68435 -76129 -26045 6890 -7461 -29275 -5570 550 14692 -2603 -3892
20479 -3892 -33562 -73639 -105565 -76981 -47125 2032 -294 34176 76436 33374 17797 11195
20467 11195 -26170 -12022 13342 23340 -8205 4084 20088 11678 -12207 6643 26682 52145
20455 52145 55434 30183 -9921 -11796 15449 8005 14718 -47071 -37357 -33707 -63127 -34271 -14978
20442 -14978 -32306 -52128 -52533 -47229 -40405 -50781 -15894 -5632 -10482 -43566 -44904 -14501 26857
20429 26857 9107 12949 4322 8232 25423 -18060 -30820 -30909 -16549 24033 -45530 -90134 -50939
20416 -50939 -15313 -49656 -53539 -17966 33456 45930 -4796 -5149 48520 52672 53011 34075 35613
20403 35613 26436 48499 40706 -5156 -35286 -31150 -57102 -73311 -89035 -97233 -29930 -26209 -1361
20390 -1361 -19011 -61477 -62760 -63868 -67384 -51403 -2728 1514 -39742 -44674 -22738 -15998 -9882
20377 -9882 -66270 -85398 -71632 -62121 -46883 -13851 -17335 -24303 -27364 -2855 16874 13738 45585
20364 45585 39554 23415 -2440 -20069 -31623 -6304 -16914 -17988 34076 46467 7969 -29206
20352 -29206 -51125 -30926 -7129 -36120 -23507 -1118 5768 32101 -10444 -48560 -51660 -43999
20340 -43999 -6055 1302 -11109 -32286 -48349 -18568 6171 23487 -13814 -7436 13669 -7089
20328 -7089 -37578 -35431 -21556 -9063 -10222 -23236 -3940 19587 3254 -15859 -56488 -44954
20316 -44954 -6187 20917 -6027 -52679 -30954 -49491 -51053 -19344 -898 -19954 -42220 -52133
20304 -52133 -44751 -14271 -10338 -29206 -17562 11107 20763 -17950 -17381 -9756 -5475 49812 51524
20291 51524 35149 33782 40584 36980 -6878 -40046 -43756 -73435 -47401 14923 27424 12332
20279 12332 25692 31858 -20275 -47758 -52084 -12385 -54331 -97399 -84941 -46828 -33153 -37363
20267 -37363 -50647 -57566 -997 16996 12939 -13738 10185 23285 -38051 -59027 -30401 -15007
20255 -15007 -19456 -45023 -97992 -116922 -95492 -66512 -59185 -72544 -61298 -73900 -60793 -49842
20243 -49842 -57973 -28289 3702 21638 24339 12411 -25662 -50356 -31549 -3460 -9233 -9313 -21495
20230 -21495 -26305 -28487 -16790 -17696 3467 10686 -23763 -29572 -17483 -54303 -55281 909 13429
20217 13429 -36652 -55597 -18227 7419 -18987 -20091 -21746 -29376 -14608 -4005 -27967 -31313
20205 -31313 -8068 -3013 -74619 -110662 -53628 -22684 -36124 -11330 19167 21437 1722 -651
20193 -651 34300 24303 3562 -38066 -223 8957 3101 2828 -4998 -11391 -38404 -33432 17796 67819
20179 67819 37046 -7688 16002 10892 -2579 -22546 -10482 -6679 6975 -19004 -86562 -129246
20167 -129246 -129317 -133371 -103520 -30372 3037 20287 44086 38203 29705 -164 13816 12492 -12878
20154 -12878 20357 27605 -417 -24926 -57249 -57902 -61540 -68799 -72410 -43321 -44319 -53382 -60370 -52541
20140 -52541 -49701 -49283 -39034 -75010 -95925 -62914 -10968 27903 19460 -8725 -6749 40700 20109
20127 20109 -9886 21367 65369 89749 72095 -5267 -29978 -3654 15658 52171 75341 35738
20115 35738 19535 22649 -1928 19978 24661 24691 48242 35477 721 -9386 -9532 -26016 -13617
20102 -13617 -32119 -90021 -91052 -41660 -7704 2513 -921 18424 42029 26281 36916 7161
20090 7161 -5263 17623 32821 66380 57295 56940 64973 59246 84377 43171 4347 16742 60095
20077 60095 30897 36515 19661 32205 24448 23559 17996 39132 77602 60902 61161 27654 -12798
20064 -12798 -24434 -31474 -18582 -47813 -71519 -62157 -52949 -58065 -55672 -71092 -49571 12036 19020
20051 19020 -27576 -27300 -36040 -36761 -24388 -45375 -70309 -84764 -51043 343 31214 32940 -35328
20038 -35328 -44849 -11697 -1281 17380 11454 -21082 -20516 -25785 -23421 -23752 -23737 -30569 -28783 11141
20024 11141 43408 29446 -11536 -18700 -19865 -22065 -21728 -13605 25106 48840 74839 58784 21754
20011 21754 4704 -57958 -60376 -66631 -74407 -28468 10651 -6396 -9826 1606 20384 -8225
19999 -8225 4048 14914 34082 26462 -23027 -79904 -87155 -88205 -77292 -48105 39 19685
19987 19685 18073 -2909 23140 15056 -6585 -24912 -41085 -2167 -9234 -41149 -41421 -41779 -31768
19974 -31768 -22999 -9932 -52970 -41963 12061 -21743 -15296 18460 44030 28082 9418 -17349
19962 -17349 -52368 -91142 -100680 -70021 -46581 -31346 -157 -5601 26031 25849 14112 11293 -9580
19949 -9580 -22673 -30224 -50536 -63698 -74185 -76448 -67488 -37037 -17152 18521 65140 65821 92673
19936 92673 70907 59975 24136 1447 26151 31085 49773 46384 31349 45574 60537 61447
19924 61447 43329 40601 78810 95831 141728 219793 276515 310812 342571 393839 429724 445822
19912 445822 426692 343629 252425 196304 137432 69785 66492 63586 75944 82939 51554 27472
19900 27472 -22560 -83457 -48720 -23728 12117 18157 -10346 -53266 -67433 -72780 -51436 -4252
19888 -4252 22485 47030 15428 -35414 -78590 -99011 -80970 -84056 -85621 -57071 -11067 -1344
19876 -1344 -27907 -22857 -2823 -9392 12340 12974 8137 -51322 -72183 -41880 -63600 -56621 -39123
19863 -39123 -22798 -26753 11723 16794 3322 30840 59154 37186 18946 30838 -3032 12025
19851 12025 56524 15641 -29394 -91845 -82971 -53303 -21459 -43382 -60752 -62032 -37067 -6436
19839 -6436 -21304 -27899 -16296 19285 -11748 -36711 -20622 -26733 -11232 59112 63028 35022
19827 35022 27316 13210 -7602 -9320 -46311 -76822 -69535 -19371 3914 3419 -18783 -9991 25272
19814 25272 903 -31511 26676 20705 -23735 -57566 -70918 -38076 18805 39113 26151 -25506
19802 -25506 -62874 -78156 -53208 -54873 -94908 -91913 -61599 -14847 3012 -4311 -3457 -4131 -73192
19789 -73192 -66978 23190 62109 50710 13647 534 -6269 -3519 -4832 -14279 -6282 -36774 -68534
19776 -68534 -32605 -23608 -67930 -59320 -19104 -5839 16705 -10749 -39095 -51109 -26411 23350
19764 23350 71992 24027 -27907 -39571 -41635 -48306 -39332 -38257 -23110 -10398 -21902 -27518 -60536
19751 -60536 -43834 -35849 -47060 -24870 4258 -15355 15744 46968 63311 23050 -28061 -7678
19739 -7678 26657 60393 44670 27656 21882 16653 17180 -8168 -1584 -23674 -31434 -47139 -49426
19726 -49426 2344 64321 45771 -8195 -29862 -76731 -50648 -9971 -13201 -30506 -31415 -26138
19714 -26138 -17016 -837 6741 -3951 -4649 -27041 -70880 -65755 -74055 -101163 -61341 -7760 -14119
19701 -14119 -1566 -23658 -78258 -85196 -56754 -30625 -48579 -55785 -16733 28487 36570 -5361
19689 -5361 21158 3737 874 -19621 -65390 -83895 -68790 -35302 -23206 -49146 -27214 -15020
19677 -15020 7257 22784 10866 24297 53659 -550 -13648 2771 33327 3798 -9088 29031
19665 29031 -6254 9379 59700 82178 97391 62000 88694 119145 184068 296897 369287
19654 369287 447264 508518 525190 480506 402456 308523 250945 221545 213281 136195 50338 54996
19642 54996 52248 53837 24158 -15393 -47908 -70670 -69705 -51692 -24746 4280 -10658 -40075
19630 -40075 -55909 -75506 -34725 -18457 6299 -597 -32053 -67889 -98196 -115702 -51369 5166
19618 5166 -11069 -64974 -29939 7585 42352 16694 -14615 -6035 41228 52269 4124 28253
19606 28253 27082 -20153 -42514 -11513 11618 11158 7170 1046 31511 32019 10286 -36945 -26288
19593 -26288 39477 34418 25597 32590 39151 60964 58827 31029 36552 22897 13944 -24605 -4115
19580 -4115 20919 63932 48746 69404 116669 102988 81438 59949 48230 29719 -1627 12432
19568 12432 24249 44425 88637 84925 74278 45958 24633 35841 24525 19289 28546 37967
19556 37967 3071 38846 63378 38166 35735 24729 23380 26321 22489 -3874 12205 75579
19544 75579 117512 110950 54144 16980 10921 32514 53265 33366 60804 61464 2948 5832 34697
19531 34697 59210 35668 8480 36941 33154 13813 15940 -410 -17812 16208 45650 48746
19519 48746 60651 74250 73156 61276 34909 6667 35347 -12369 -74804 -39670 -27551 -18092
19507 -18092 -17182 -9275 -33888 -34462 -50387 -89129 -69502 -59852 -62355 -71821 -35432 -27076 -31105 -19491
19493 -19491 -20602 12933 31553 46289 45062 30839 1824 -7814 17203 10675 -6326 -6922 21115
19480 21115 34416 36964 42577 54956 47166 -27885 -52518 -27805 -634 8488 -20439 -70
19468 -70 30564 8983 -2348 25740 25852 -17388 -29504 -36227 -66045 -38589 -20733 -3894 35041
19455 35041 23156 -213 -31874 -53051 -53939 -53994 -48827 -33355 -35911 19459 47758 39908 24400
19442 24400 15767 -45317 -48036 -49285 -35796 -5234 -13490 20528 15478 7262 22806 38353 15240
19429 15240 -13834 7591 6088 29639 43929 54158 76743 89999 68051 79984 65297 115876
19417 115876 166475 100282 49955 34997 22466 9484 34665 10158 -4018 -4701 18636 37766
19405 37766 80381 56127 47811 58882 64051 70271 84654 88204 109488 116522 138849 75097 78313
19392 78313 80106 109902 124168 125875 124459 135547 116600 127085 177360 165445 123989 142252
19380 142252 156760 160265 134233 166412 189639 191028 187141 210760 238389 271501 282457 303044
19368 303044 365322 389294 392708 457247 501792 515710 566478 620188 698040 769622 904567
19357 904567 1057902 1220977 1319850 1396388 1452007 1436641 1367823 1325254 1311407 1299747 1371987
19346 1371987 1464426 1607100 1821335 2055428 2351257 2692773 3091771 3564097 4144080 4906935
19336 4906935 5852610 7165708 9005949 11738632 15894226 22350541 31556666 43582374
19328 43582374 57668168 71264437 81323606 85786679 83563316 75271728 63034858
19321 63034858 49646307 37612378 28111741 21229973 16518271 13299624 11061061 9388737
19313 9388737 8061749 7014520 6170485 5426468 4774063 4203956 3704386 3300533 2983838
19304 2983838 2703744 2497551 2307699 2163411 2101761 2114457 2105810 2092355 2060398 2003123 1936552
19293 1936552 1807574 1622801 1433010 1267573 1118079 976524 934502 905887 898686 846998
19283 846998 794371 737484 651749 587506 489435 412453 373489 364013 369962 355788 341408 329777
19271 329777 339040 343399 319308 319546 355295 379398 407858 367499 330041 329605 291421 269762 287460
19258 287460 276929 259402 221261 187153 200876 221424 188830 188078 215533 254288 230063 185501
19246 185501 136903 74128 78819 147329 185078 186394 155516 91167 61639 128821 153250 137433
19234 137433 98107 83284 91267 104575 62732 60524 98943 86269 96272 137662 90546 85997
19222 85997 91591 57892 76906 86222 83673 54391 50535 93476 81789 62784 46927 82958
19210 82958 103424 86116 98829 77488 60453 56413 39352 77957 108657 100358 67991 47646
19198 47646 42997 50040 72613 67704 66902 46618 21045 4377 -9386 5351 -913 -9146 20422
19185 20422 71606 56518 59883 83572 62496 44102 22168 64458 119443 116383 89573 51040
19173 51040 52736 31361 21398 -23189 -56223 -45521 -16418 -20952 -35920 -63182 -56691 -24202
19161 -24202 16034 12893 4221 1440 17841 62807 75137 61037 63450 40765 33711 46648 70624
19148 70624 75292 56136 75993 108025 78346 36174 17446 16343 25177 69190 116499 106957
19136 106957 57761 21382 -773 8388 -11587 -58062 -40035 -42189 12752 39301 23946 23634
19124 23634 33784 -3533 4794 -5530 -25737 -43156 -37992 7253 11772 -5645 -16425 15222
19112 15222 37159 84840 90006 113778 56938 43204 59878 42896 73340 61875 30106 45119
19100 45119 72210 68621 38311 4015 4773 -34828 -24830 12125 18356 -7070 -4825 31509 18973
19087 18973 29824 27730 14431 21791 32294 3801 13435 -7699 -16469 -23161 -22773 -10106 525
19074 525 -1705 -9210 -7230 -12051 14333 28482 39225 52710 61441 24924 20692 45179 70312
19061 70312 77272 64314 14198 3925 6689 30345 40437 15090 29603 2166 24451 25274
19049 25274 25188 -32734 -26290 16695 30390 22076 28507 39658 62493 45927 8400 -1301 -13799
19036 -13799 -1237 25532 -757 -26356 5343 1859 25618 33678 -18064 -6704 17353 -6849
19024 -6849 -50278 -53253 10271 28028 56022 87466 54858 46560 61599 45103 -6100 15860
19012 15860 34639 44775 46807 23500 27215 57064 69290 32714 15889 40025 26665 16987
19000 16987 -6957 19916 7528 -13885 -10343 504 15656 22003 28536 21778 -348 -31022
18988 -31022 -14722 -17252 4358 10648 5442 -7936 -32687 -60634 -32429 9398 41851 59575
18976 59575 15385 -50362 -52124 -65045 -26976 33946 18213 -27835 -65216 -17757 9148 38482
18964 38482 40935 19107 -39678 -49046 -34013 -64014 -53365 -8587 12993 43478 5461 -33022
18952 -33022 16140 40643 18790 13249 15975 55707 58889 64637 48844 13318 16972 -3962 -13537
18939 -13537 -15602 -24719 -17166 -15065 -39706 3070 -3913 -88803 -105490 -75553 -106427 -112987 -120734
18926 -120734 -119067 -92822 -100682 -69766 -40083 -17349 -5988 34025 18543 42398 62600 1873
18914 1873 -1493 10772 32278 22057 -27920 -42716 -37028 -26985 -51627 -59789 -40978 -77325
18902 -77325 -71048 -70104 -35777 -15083 -28807 -45680 -53496 -51554 -41288 -34865 -18072 -3283 -9719
18889 -9719 -28159 -65224 -77056 -63780 -39536 -40167 -43068 12337 43815 90082 112566 83344
18877 83344 68400 33397 5901 -841 -39674 -45147 -7825 5848 15592 7204 14325 23373 91472
18864 91472 51010 31271 32605 28708 20823 270 13594 -35171 -72826 -44889 -18459 -24685
18852 -24685 3614 65490 48714 15615 25574 -7911 -54665 -41316 -43299 -37013 13774 32427
18840 32427 6991 19696 3649 54003 83890 56521 26325 18049 3257 -13570 -43072 -93467
18828 -93467 -89025 -57290 -35536 -20058 8465 39609 10265 -33081 -37797 -15338 2292 8181
18816 8181 29731 33498 5814 -4864 9233 -23627 -52973 -17907 -32226 -57207 -81790 -65604
18804 -65604 -39311 -49577 -25489 -4806 -36996 -55271 -12570 3594 11899 56403 81743 92787
18792 92787 76261 38269 10931 32885 21530 -317 22393 71051 117205 146370 134866 74667
18780 74667 66338 90173 137219 140581 113341 171697 155857 119421 74960 133212 151827 154320
18768 154320 178662 196469 212430 346699 534557 609464 570588 492944 366245 286596 258196
18757 258196 261470 231402 164912 117771 122029 147565 162107 172815 181439 201976 160983 95979
18745 95979 55265 34094 18448 10613 32927 105999 133452 115328 81300 85165 108860 141982
18733 141982 198636 215215 278810 399548 447405 478393 489777 412489 334517 315802 315133 249988
18721 249988 234472 183152 241216 271517 293367 248320 145288 106683 89100 111097 140083
18710 140083 194831 242387 184132 123408 81693 90915 99294 134386 249682 243714 202171 167907
18698 167907 130287 65328 36323 29681 7137 -24022 28138 72610 58602 25817 -25400 -15943
18686 -15943 24236 27875 -3175 2825 4148 6079 11660 -9191 -16567 -5307 33015 -1013 -6266
18673 -6266 -9508 -35594 -11447 21195 41880 21275 19184 25579 -19113 -50516 -48443 -33282 -23756
18660 -23756 -23860 -32817 -50110 -43781 6000 36380 57499 46074 24038 30005 47924 -28 -17443
18647 -17443 24947 73668 148653 180437 225324 321329 389073 369017 282699 206785 164564 130749
18635 130749 119501 112775 87593 52765 41695 65082 84071 121300 177451 199602 172761 98213
18623 98213 21109 1584 15858 50249 27087 -1774 -12268 -4016 -23653 -24173 7169 9193
18611 9193 11361 46868 15321 31477 52566 56819 15715 -20165 13362 55389 88920 85720
18599 85720 123855 145250 166527 130258 92480 75848 52100 8677 26757 76485 118640 201208
18587 201208 257395 248456 303370 453136 514500 460559 359526 220521 129702 95422 81549
18576 81549 45622 20917 21131 35274 69140 65017 32983 2604 -31927 -44215 -82463 -97360
18564 -97360 -30178 9654 -4354 -6217 4226 13202 -10161 -38249 -11645 24689 23515 3694
18552 3694 36294 21347 38028 37049 9085 33077 12631 -5243 36358 44398 5679 -40883
18540 -40883 -51275 -8637 -21323 -11015 -31891 7253 19291 -30271 -30363 -12524 40231 42604
18528 42604 15994 26635 3391 -26432 -16451 -11940 -7332 13145 36370 39828 81888 125966
18516 125966 129023 93133 60144 26924 4475 2512 -28871 -45385 -9664 70053 98233 109851
18504 109851 38801 -16247 -15651 -62091 -50896 -18179 -28282 -118 11706 -11607 -11110 14703
18492 14703 43021 15016 2939 -24358 -29601 -4417 12872 7392 8101 -23148 -673 16091
18480 16091 46022 62509 23945 7318 25793 27160 55793 48527 35541 28941 40991 67459
18468 67459 66496 90726 50300 14548 30694 69216 107944 105616 52815 47882 45369 39017 17472
18455 17472 16339 63489 107324 70445 16343 27256 12940 22870 53416 45774 21106 17607
18443 17607 9895 42929 40109 52658 14629 -50934 -49364 -11646 -45128 -74802 -72888 -39924
18431 -39924 -4044 29145 78307 65051 33874 -19723 -30165 34649 30565 -1457 9172 15733
18419 15733 23606 -4856 -51121 -74517 -31509 -11267 19890 34535 62223 78228 66668 86795
18407 86795 82120 68598 34738 9212 20487 52205 45190 50010 66516 81034 37583 4770
18395 4770 -2639 24590 19988 34455 59585 25325 16994 28491 56750 69214 12204 4944 -22754
18382 -22754 3434 45414 39571 14195 -17778 3575 30834 48183 31961 -4754 -5696 -11636
18370 -11636 -17150 417 16958 59852 68755 109465 136911 101181 40460 35020 62187 69496
18358 69496 96750 103402 62489 28147 14951 14263 27043 63218 87771 119010 116468 116325 106221
18345 106221 97450 106528 117293 114562 103241 92023 95623 92505 85215 79231 69958 72004 50578
18332 50578 31480 29158 54337 77231 116215 120634 74507 40309 47150 74876 103279 110213
18320 110213 123286 102602 29491 10587 33790 78876 96540 92985 53812 20385 17936 39033
18308 39033 82068 150799 183023 161970 164785 178443 190272 221029 250163 288105 320466 314812
18296 314812 337709 346479 349359 358862 373079 374162 451949 563803 675119 833991 1021784
18285 1021784 1182711 1324521 1481445 1648133 1940483 2559651 3726132 5394288 6590123
18276 6590123 6546209 5543704 4265327 3428421 3023876 2771942 2723759 2815513 3000845 3292729
18266 3292729 3776081 4433394 5339505 6674590 8561872 11478744 16466002 25737762 42384151
18257 42384151 63677559 76936602 77860999 68326155 54810703 41576785 30178443
18250 30178443 21946859 17059515 14461223 13317790 13287714 14452380 17256863 21771496
18242 21771496 25696902 25776098 21999832 16511072 12021696 9217477 7467191 6327759
18234 6327759 5663795 5258837 5048630 4905357 4722158 4604747 4612319 4571231 4463919 4405379
18224 4405379 4423487 4515257 4697509 4947645 5281957 5947769 7097741 9122729 12698517
18215 12698517 18365533 24882584 28270290 26889219 22203268 17351361 14343156 13117608
18207 13117608 13126285 14327951 17001017 21932585 30906835 45121260 62991234 82978289
18199 82978289 99563138 100050647 83923482 59675255 39136156 26721738 19614963
18192 19614963 15267704 12375934 10368347 8945984 7846330 6942334 6239567 5704859
18184 5704859 5333488 5208614 5342501 5998362 7420093 9501553 10921436 10533122 8628313
18175 8628313 6348252 4803578 3942567 3462097 3201398 3002084 2720286 2386492 2035908
18166 2035908 1731803 1502255 1343947 1285786 1171776 1074458 993609 872503 817573 797081
18156 797081 769132 677044 602386 608662 610385 616769 637073 638982 589804 542664 552154 590645
18144 590645 582265 511587 501976 537060 608681 599456 565611 550933 527012 506786 506281 506868 585799
18131 585799 671948 706595 732231 790193 788171 818836 897593 986678 1098382 1235635 1315364
18120 1315364 1380095 1443761 1535413 1674140 1843968 2150223 2624950 3253575 4203318 5603786
18110 5603786 7877188 11787828 19310498 35205730 65071001 88287383 85249942 63146054
18102 63146054 36981071 22189109 14923415 10965857 8466958 6734031 5475636 4602721
18094 4602721 3909927 3341991 2898082 2522356 2264000 2080263 1887572 1739313 1597477
18085 1597477 1423133 1309426 1194857 1125843 1071551 1047596 1011037 957151 906873 859568 831719
18074 831719 761753 711298 722543 697623 693696 672730 642285 680164 720438 744073 732926 668593
18062 668593 541526 425164 363933 331608 366876 379897 373031 357185 325753 301896 288230
18051 288230 248732 197541 192922 202604 200437 156788 177169 182873 192566 217932 215423 203725 191487
18038 191487 194439 212093 209678 195443 181040 234752 250911 217229 179825 175903 139210 121704
18026 121704 127074 147621 161825 184389 182087 205264 227234 214396 156841 120313 83769 82783
18014 82783 103364 127578 136445 144473 129422 101113 93171 123000 142942 135957 127573 139965 127535
18001 127535 82848 63257 58766 75535 106004 158139 170555 188644 186633 163430 129977 108908
17989 108908 79580 73743 92945 114132 135100 137559 115788 124647 150643 209134 242541 269213
17977 269213 214099 134908 105131 102346 138042 137142 107837 107062 95835 77363 87165 73867 61154
17964 61154 49699 68849 74136 50663 63394 61325 55321 52323 52203 82484 76139 80041 52523
17951 52523 57104 105767 93321 80264 74147 69587 90275 92240 90895 55010 44426 6530 66578
17938 66578 111945 102903 110621 127962 95774 51648 48846 82794 87041 75600 77640 67674 71252
17925 71252 86887 84743 72491 54762 22506 21155 94858 110908 114430 71689 -250 -22787
17913 -22787 -41071 -51304 -18409 28542 66083 15221 5896 25318 24543 24748 63264 37991 36229
17900 36229 30465 34615 -1973 -19789 42090 73138 65218 62437 46100 59356 77046 70605 71083
17887 71083 46995 9916 16465 19788 51345 108123 115633 99243 87378 64398 41255 55780
17875 55780 86666 80997 72101 64781 54054 37695 38453 46471 23246 -12226 -28111 -7527 -6361
17862 -6361 -29841 -9338 26142 24401 13583 5201 19394 5347 -17757 -6979 37981 26243
17850 26243 3622 10688 28626 80130 102155 70975 49385 46509 34850 31817 36782 53120
17838 53120 45279 53007 49015 25369 32266 40532 43457 44822 53048 53763 57929 39353 60825 70826
17824 70826 45263 25332 25850 25237 35684 538 40692 89181 134539 177503 193605 191649 154600
17811 154600 145944 133692 57190 62952 72075 28898 -1464 -7833 17370 53385 59826 8397
17799 8397 16947 26487 40256 84691 65721 97097 92496 135664 154031 181322 205860 229627
17787 229627 233238 243116 235039 214672 239859 261264 258059 256763 235539 241091 284176 302501 324388
17774 324388 432771 523989 595524 696245 835450 1060734 1299770 1517243 1666112 1854340
17764 1854340 2116822 2561328 3457327 4952854 7045891 8877180 9378804 8430079 6777307
17755 6777307 5345553 4443328 3969143 3750499 3718044 3845921 4182124 4788768 5679843
17746 5679843 6854799 8448154 10808137 14640181 21312502 33432398 53231360 76905983
17738 76905983 93738579 96532716 86101719 68975141 51730792 37653823 27672855
17731 27672855 21397459 17752262 15846308 15349081 16222807 18731070 22836477 27045258
17723 27045258 28550627 26119151 21097250 15935455 12199174 9804089 8148984 6872648
17715 6872648 6015143 5458088 5102378 4989735 5070878 5193240 5164971 4984504 4735168 4519791
17705 4519791 4382914 4395354 4597254 5033045 5767230 6793701 8389938 11005200 15225638
17696 15225638 20459077 24274610 24567288 21639396 17542852 14280231 12498326 12111013
17688 12111013 12925274 15039487 19230083 26554542 37291882 50478352 64475055 75700449
17680 75700449 77515490 67668883 50878539 34585988 23355625 16722679 12805529 10359341
17672 10359341 8669955 7454884 6569126 5836812 5216704 4645490 4233765 4047403 4133974
17663 4133974 4434417 5137343 6215291 7249359 7470626 6680974 5324068 4106589 3332273
17654 3332273 2900768 2704460 2569679 2329870 2065909 1802007 1577660 1372944 1207122
17645 1207122 1071813 1001435 942826 930511 946167 975365 1013347 993615 962712 917268 811857
17634 811857 694501 609178 577989 575205 579028 544958 467305 429544 393732 315846 264716 260897
17622 260897 300218 354123 388727 412434 391899 361648 349339 342973 322532 303753 356974 359246
17610 359246 323581 275409 240999 210780 194069 180294 203893 203687 197022 177349 180703 194512
17598 194512 233176 269584 311560 328884 343154 371037 453635 485224 450464 369485 356613
17587 356613 314050 230016 217557 229098 212780 199512 202982 187843 221018 243311 286264 239161
17575 239161 186753 181230 153637 137691 123698 75056 93784 114591 114909 116881 127560 110390
17563 110390 117403 128965 150539 147241 123554 119595 96377 71198 132532 194723 196349 205295
17551 205295 182075 179656 205403 154805 147331 187627 148396 148545 193735 175199 148329 186787
17539 186787 242905 279710 334655 407333 412222 384973 342172 257746 189832 131411 106692 83776
17527 83776 51385 28140 21818 29510 50939 64241 81944 93901 57775 69095 60864 59208
17515 59208 77045 60012 18304 65 30403 47842 31485 47703 40760 22339 -2400 2795
17503 2795 27159 60472 64614 62926 46941 27740 37180 76942 74109 56933 34790 30527 28504
17490 28504 8268 -25904 -61699 -78032 -32660 14559 17098 51108 16573 28504 76149 93068
17478 93068 69583 68797 95982 103949 112182 66796 33120 19479 48357 47579 44851 70122 80328
17465 80328 65208 52347 62626 96281 107567 96847 74219 48216 23614 39752 25044 17193
17453 17193 84459 109473 72962 65279 46130 25945 62936 120778 153499 122623 129844 153843
17441 153843 215131 310826 452008 484763 407909 262793 158491 115122 133854 148350 134398
17430 134398 129176 84664 81032 89565 46792 9777 -35122 3210 34287 79603 96288 141690
17418 141690 125886 53504 42357 49369 61998 66423 67160 64143 53915 -27359 -24931 -2689 40818
17405 40818 105286 105034 111169 107991 74827 82272 90644 75668 60159 76221 53703 36744 53341
17392 53341 23025 3593 19921 29149 33655 17421 -46281 -90368 -56746 -15995 -324 -2152
17380 -2152 21132 59055 39391 34891 10813 -408 -8605 -38220 -56565 -69618 -37865 -20580
17368 -20580 -5269 839 13136 56938 21466 -11993 -25530 -13076 20058 41467 78743 70554
17356 70554 56843 82173 98143 75424 57063 97132 110029 110218 101536 89139 84063 52688
17344 52688 14894 14167 37223 33329 6225 34307 61500 53113 22396 -9981 -22984 -17826 -4381
17331 -4381 30706 20374 -13753 -10147 19247 33346 -10523 -14471 10547 13212 25644 30256 34221
17318 34221 31520 32273 22814 62947 94946 84148 55406 43636 52488 46929 19483 -12839 1911
17305 1911 -8394 -16154 7344 -5561 3748 47360 54455 47389 68094 78368 37567 32339 22447
17292 22447 29761 70242 55245 57595 85971 106437 77910 25089 40458 68938 88641 90010
17280 90010 69344 39416 -6781 3679 47345 56431 73435 72898 71297 31951 20572 44105
17268 44105 57263 63751 44227 7010 30793 69463 52957 56332 31183 -12327 -44918 -39173
17256 -39173 -3667 7536 -12238 -79593 -51369 -27556 19128 43029 65607 75242 65241 13173
17244 13173 -19647 -1683 43556 33341 14836 519 12098 54379 94585 137861 186763 220123
17232 220123 228847 246398 198471 159432 207970 252771 269228 254474 217823 222883 200517 187107
17220 187107 203362 221216 245406 325435 346348 276793 241595 203026 154174 125460 84322
17209 84322 77474 18803 37955 51639 59999 99324 99516 102594 89728 91344 65180 52301 74403
17196 74403 87659 133537 146414 111141 76600 34720 28109 31755 112928 142227 113336 127817
17184 127817 149122 151316 180258 209159 207446 199928 192596 207826 195706 215201 225353 243939
17172 243939 224425 191581 153345 141363 141360 95542 70496 40804 21237 22294 54269 65834
17160 65834 106719 148421 157133 195442 211890 194528 190100 180910 180033 161339 81210 59236 67856
17147 67856 107054 110255 86559 28613 6436 4463 24541 13709 11481 47648 97310 99779
17135 99779 33192 41707 26494 29214 65321 95897 76421 39596 -7004 -16953 -23248 -27655 33923
17122 33923 80193 77805 61423 36461 45646 28955 -8679 -14762 -37231 -22393 -44941 -5886
17110 -5886 33309 51601 17606 3306 14089 26668 18305 5122 -12939 -30171 -57446 -38780
17098 -38780 -33831 -34888 -53245 -69885 -88251 -81477 -61752 -29261 -7079 -30976 18393 50151
17086 50151 49253 82931 82895 52780 24236 40997 48306 44320 50328 56812 62454 42417 44093 42630
17072 42630 67613 66430 63859 31830 10442 -24960 -43043 -20152 42975 48958 69071 50816
17060 50816 25526 30896 51968 5638 -769 20002 19835 25500 20838 -4746 -62163 -49934 16594
17047 16594 40366 23951 -22106 -32399 9862 56063 44825 54568 46059 44092 47858 35289
17035 35289 21200 43201 40883 33745 -26627 -65011 -92053 -89226 -52290 -25728 -31015 -40739 -14362
17022 -14362 -21917 -31346 -8662 -23759 -21000 24287 57182 49199 18440 -19940 -9799 2199
17010 2199 98 6718 36485 7278 -16846 42458 81380 111474 135492 161557 121533 88004
16998 88004 152328 223319 291715 296602 228933 205844 217065 193143 180718 141524 111077 72776
16986 72776 55102 44245 65489 117405 114707 128047 93769 100623 102559 47755 33590 40848
16974 40848 11258 -14606 11338 -9299 7277 34055 -9363 -10958 22171 69952 52993 20932
16962 20932 25933 34797 -1554 10325 9590 -20669 12271 19130 7351 -24131 -41139 -5062 19826
16949 19826 40937 40112 39407 41011 44330 34775 8259 -27895 12501 53759 92768 77465 61210
16936 61210 42131 55557 57372 30940 -5080 14997 37080 34218 17259 27055 43893 30283
16924 30283 20726 26697 10287 -19394 -60320 -49078 -23878 -28698 42593 57119 21652 28886
16912 28886 39606 49498 18107 28955 88802 82779 50174 32630 32500 33894 57322 73832 111279
16899 111279 133696 92276 1095 -12695 -25677 -11458 30214 26347 -3438 -17639 9593 18987
16887 18987 44893 44256 7744 -2741 50451 48951 8857 -19354 -25700 -18799 70706 94371 75465
16874 75465 41895 30907 26570 10527 30987 50536 41758 10391 4268 -19761 -31629 -9918
16862 -9918 -6856 -9992 -45150 -24287 -10773 -21682 -47604 -29663 -51835 -47057 -2943 7030 -16520
16849 -16520 9122 56720 33511 20458 46213 34761 -19625 -51652 -41856 -4727 -3763 24255
16837 24255 76587 63591 3595 -6965 9992 24848 15521 43364 29175 -17521 -83784 -67603
16825 -67603 -55532 -60544 -34485 -9204 9340 40137 34423 -21479 -33712 -52929 -75303 -38338
16813 -38338 -25175 -51358 -41172 -29053 -45106 -67372 -66385 -25890 -10265 -43969 -59134 -44215
16801 -44215 -27518 20764 8964 12973 -3600 24326 17712 41087 120050 114393 39038 -8804
16789 -8804 -20076 23937 58462 38436 -332 -19449 -17996 -17060 27732 19265 4130 13320 6988
16776 6988 -29446 22237 86501 68838 14637 -9255 -32699 -18348 -7952 -4098 17237 46083
16764 46083 57603 45224 42663 10533 -44001 -88218 -124871 -116029 -76253 -51171 -63671 -50156
16752 -50156 -38109 -82361 -91679 -76148 -66670 -46028 -27224 -1374 15415 15561 33616 41775 1713
16739 1713 -34913 -23649 -11170 -3803 17280 33497 23378 8958 22276 44366 41769 6730
16727 6730 -40310 -41250 -25475 -27293 -31218 17719 23755 9221 36650 38669 30871 12687 27945
16714 27945 17454 -11565 -16877 -1655 53650 100211 100996 58404 28894 38795 48245 61542 26355
16701 26355 41655 27795 18878 20920 30853 -13636 -27884 20138 27935 54746 22050 -8461
16689 -8461 14178 -12665 -52075 -53262 -67712 -71281 -53339 -44773 -6157 9842 78562 91565
16677 91565 85355 49895 -7328 -3123 21085 31075 62340 69582 8696 734 38914 18481 21057
16664 21057 12967 -47291 -68039 -31189 1933 5212 -40599 -40100 8053 23976 37861 13696
16652 13696 -20850 -54866 -28953 86 29858 56149 60272 40609 22496 -14174 -5271 -2050
16640 -2050 2823 -2614 -33063 -20340 -33495 -36485 -69517 -62072 -54089 -88043 -93449 -29371 -273
16627 -273 -12036 -20672 210 8558 -7037 2857 -4895 -10122 -6362 -8981 -35243 3891 56938
16614 56938 57436 -4611 -28590 -32833 -70599 -67606 -47175 -65109 -44773 1280 -7927 -19566 -9038
16601 -9038 15788 36753 56440 51752 43560 39001 18580 77564 127556 142824 118061 91489
16589 91489 32982 57540 62992 96422 95354 25046 -3559 21590 25006 57389 69019 14175
16577 14175 -44214 -66949 -37916 -50293 -15768 35656 24698 -17863 -84566 -105336 -46406 5175
16565 5175 -15970 -58080 -74728 -44929 -30965 -7148 -6420 -8326 -28853 -46596 -89722 -85055 -38837
16552 -38837 -15310 -3806 21196 15455 -4337 -22641 -23611 -35679 -23794 11055 34907 30280
16540 30280 20149 4499 -20159 47338 104101 65387 292 2384 2586 7320 -18143 -7659
16528 -7659 -16409 10018 36704 26340 11137 -12217 -57005 -46547 -28610 -8405 -1768 18084
16516 18084 27709 48590 34274 1089 -21960 18037 64616 53360 60227 57579 48714 59589
16504 59589 84506 79526 59461 45651 -14497 -9802 13453 5944 11647 26814 1103 -32168
16492 -32168 -42568 -30880 -25103 10678 5868 -1317 19803 -20665 -39958 -14685 -27709 -58493
16480 -58493 -71923 -56801 -84584 -80670 -72957 -83621 -92939 -96643 -58224 -44562 -61756 -72153
16468 -72153 -40323 -15464 45412 72772 61024 59839 46956 31890 17814 -10899 3145 17494
16456 17494 7119 5248 -29498 -28628 -14216 2580 10543 -20400 -19489 -37023 -51950 -36542 -29350
16443 -29350 -52944 -56853 2959 50093 29263 7131 49223 52609 32544 8699 -293 2356
16431 2356 33760 32330 20478 -10211 -14217 -1757 32426 32671 7404 -21775 -25841 -32116 -64354
16418 -64354 -75298 -57980 -12122 27701 27558 20113 11124 -33538 -23618 -35886 -67720 -38271 4546
16405 4546 40029 22540 10820 -31583 -4148 44162 10174 -17028 2126 -14117 -33167 -31718
16393 -31718 -19422 8718 17320 18294 -6603 -46512 -23358 19333 8253 -4961 -20272 -26051
16381 -26051 -40375 -68639 -100861 -62061 -72067 -34431 -1865 -8135 -288 -10491 -29721 -75425
16369 -75425 -83883 -44814 -14745 35719 36247 46095 50104 3895 -9778 5401 44565 52551 69342
16356 69342 26084 -6848 -60929 -62738 -43329 26768 51937 3856 -2977 21845 23965 39238
16344 39238 48737 45266 37338 47834 46841 19184 29121 31539 42330 42038 28503 -9008 -36420
16331 -36420 -69982 -68330 -64970 -39219 -46844 -26188 6377 -11118 -12133 40834 59571 41979
16319 41979 26464 -8605 -7058 13369 46923 47915 22259 -371 -16872 -8757 -669 -21732 -35085
16306 -35085 -62397 -41644 36930 32137 -40230 -35962 6810 12947 12981 37959 35879 2552 46076
16293 46076 65353 67879 40663 8037 9019 14205 -8986 -57896 -58034 -101302 -95852 -83432 -72127
16280 -72127 -60028 -35348 -74095 -125945 -98319 -51206 -9539 -43794 -75575 -53388 -19550 -36584
16268 -36584 -67926 -47988 -15278 -20546 -62004 -81690 -79350 -32369 -16679 -39886 -37563 -59796
16256 -59796 -54844 -33409 -64502 -73516 -53202 -29202 10646 14710 -10624 -24822 -19109 -45981
16244 -45981 -42072 -214 62977 55482 25362 -17164 -56496 -15234 5729 11666 -32529 -38227
16232 -38227 -6889 2847 -32056 -17355 3633 12542 44397 38965 643 -48973 -24687 -25856
16220 -25856 -2360 31197 57521 26493 -28709 -27935 4985 4218 -6243 -15963 -7185 -38301 -36612
16207 -36612 -22775 -26028 -13764 -33045 -24977 -11908 -36720 -38892 -58827 -48043 -49286 -39855 -44013
16194 -44013 -70455 -55915 1418 30049 18155 16051 40021 59514 69703 58809 23530 -54534
16182 -54534 -59756 -40674 -56117 -64442 -84823 -104799 -67134 -42898 -32650 -26686 -59306 -44135
16170 -44135 -7365 24113 -2730 -17025 -29525 -26562 -28050 -55408 -22635 -17803 -1010 11914
16158 11914 -6927 3267 -40232 -17395 3499 32009 84736 58729 26506 15198 3380 37978
16146 37978 50815 8880 -11477 -3701 6086 31254 -7506 -43742 -21916 -23025 -32076 -7741
16134 -7741 -2676 22283 8621 165 -8303 -9818 3601 -5538 -11900 11232 35932 32292 19353
16121 19353 29839 81646 82456 55005 30479 34909 4814 11620 17676 65143 60607 49053 68054
16108 68054 44034 31626 -1077 -35282 -53752 -52628 -5173 2273 8426 -6199 -26580 -62306
16096 -62306 -72792 -82393 -117507 -115649 -49436 -5089 42936 45908 8431 -24474 -26935 -30614 -48481
16083 -48481 -35840 -3524 -10357 -48845 -28280 19040 59737 83584 71687 20603 24432 53563
16071 53563 63384 40280 -33721 -49030 12736 49523 35863 27470 33158 21463 -33084 -68133
16059 -68133 -22359 -8841 -18483 -7725 -12772 -60133 -88789 -74826 -30539 -23662 -16638 2870
16047 2870 8797 142 15591 79674 119872 101734 54271 29423 11113 29602 20885 2373
16035 2373 18861 5186 26566 29763 -11419 -42943 -43221 -55138 -32190 -939 -41888 -31194
16023 -31194 -3646 10997 -23629 18829 71831 46937 31115 82163 111122 98187 56230 16838
16011 16838 2188 21549 16784 -1507 -24407 -3590 40628 956 15645 19280 63889 40129
15999 40129 -11413 -24929 -18656 -23240 -45615 -53520 -26310 19080 8604 3140 45277 54281 17991
15986 17991 -16926 -75285 -55738 25477 38030 4265 -7007 -677 -19188 -47465 -75527 -82424
15974 -82424 -94754 -79175 -63705 -52709 -60990 -84207 -76875 -76986 -102269 -79776 -20295 -15528 -24987
15961 -24987 -2206 35875 54818 53167 21141 -8437 7548 29777 2301 -24055 -50302 -46744
15949 -46744 -32656 -25127 -34646 -43603 -1191 -5858 12988 12125 38215 32158 19289 -4302 -17936
15936 -17936 4338 24281 59601 46053 -12711 -9130 37515 45783 42569 29732 -32726 -67501
15924 -67501 -74188 -47014 -15821 -21179 -26746 -30535 -149 33825 30221 20479 36978 46682 39616
15911 39616 -7188 45146 86848 78582 22478 -7682 -9612 -5920 -17706 -38094 -442 25594
15899 25594 32166 59211 23545 -39905 -93794 -84419 -25253 -14681 -65418 -40308 -1982 -13854
15887 -13854 -51278 -35739 -20579 -4343 -70231 -43316 -26382 -9885 41015 50724 39227 35796
15875 35796 84725 123164 100429 49520 -10660 -64979 -44761 -46363 -35640 3595 4090 16069
15863 16069 -20114 -27256 1335 -35293 -1505 -24986 -50677 -20213 -6184 -553 14504 35876
15851 35876 33332 15586 -8269 -28953 -25880 -15380 15227 21129 35155 54351 86564 78494
15839 78494 33004 50612 62683 63015 49637 482 1950 7606 13131 22289 41427 61492 39406
15826 39406 6703 -4670 2238 57652 70322 14330 -38163 -59139 -31205 17708 881 759
15814 759 9855 22163 30579 67239 59243 26345 21695 12691 -7367 -7085 -24569 -25216 -28888 17558
15800 17558 4958 15841 -8902 -42513 -21832 -10945 -23134 -3926 9499 -27112 -43836 4589
15788 4589 1596 -11159 1841 10989 3980 45502 37772 9582 5866 8420 36168 7864 -22148
15775 -22148 -59780 -65844 -54982 -33161 -24567 -6261 -25993 -55799 -72515 -47779 -45387 -58537
15763 -58537 -65418 -73657 -30540 28219 38872 17872 7539 -51908 -32729 -18737 -20870 -13165
15751 -13165 -14809 -14456 -8400 -7587 -21231 -16028 25951 18538 -7656 -27340 -38712 -51749 -18452
15738 -18452 15494 -1696 -37885 -77908 -41883 -6590 -17216 16727 39274 35414 12031 -19294
15726 -19294 -7134 -22846 -49140 -58139 -63382 -29085 -6153 2866 -39807 -79826 -81570 -50179
15714 -50179 -17310 6137 26313 31136 6542 -51595 -91602 -133393 -104250 -47005 20618 23034
15702 23034 -19610 -53525 -63196 -47288 -43466 -72350 -71517 -77263 -30990 -1572 -17751 -11257 8425
15689 8425 58229 67599 34075 26263 34968 -5102 2705 -23599 -78379 -89339 -44518 -18729 -36673
15676 -36673 -45177 -28832 -14245 -15430 -9415 -24263 -14658 -18479 36169 36834 11016 35188 28639
15663 28639 6366 6734 -10764 -44018 -106873 -74673 -49020 -53038 -56897 -59640 -61659 -75275 -52306
15650 -52306 -5950 11564 28681 17339 10559 17865 62657 70809 38047 38648 812 -22050 -33910
15637 -33910 -16046 12170 -2617 -36664 -22188 28354 68072 73556 49802 37056 42528 5253
15625 5253 51687 51511 46107 35332 -1963 -1900 4110 1533 -12847 -22853 -17734 -10749 -1623 22883
15611 22883 61190 58888 33849 -6292 -4789 34213 30042 5490 -1782 -34155 -47336 -33165
15599 -33165 13404 24976 13743 5513 -18204 -6599 13050 -30271 -32730 -23632 -23286 -26785 -18460
15586 -18460 -30211 3849 19252 -26223 -45221 -34759 -54382 -61224 -61089 -56523 -48409 7176 28505
15573 28505 -51569 -43314 -20875 -13089 163 -5896 -32456 -26187 8652 18219 -5538 -31838 -46347
15560 -46347 -53019 -58710 -46316 -38926 -31407 -6295 15568 2771 -16702 -80942 -96703 -29125
15548 -29125 -3110 -1737 -5313 -4550 5626 17512 -42974 -84315 -57540 -23158 -22829 -48809 -57068
15535 -57068 -47526 -53658 -56862 -39637 -30489 -58864 -78003 -85306 -70693 -51358 -27347 -21221 7345
15522 7345 24208 44559 33555 31507 -31108 -25486 -6168 31607 -14773 -41286 25104 63220
15510 63220 5743 -42018 -46773 -79715 -78736 -57470 -24567 10794 17618 -3118 -9784 -2359 10554
15497 10554 16591 4623 10647 44657 61761 15269 -10837 12645 -7021 -8349 7515 4373
15485 4373 4353 45094 36125 -4345 -355 29741 30579 2078 -28199 -20916 3687 19567 -35179
15472 -35179 -97215 -91296 -68607 -16883 24414 58827 25559 -14694 -43482 -61478 -44325 -46976
15460 -46976 -19223 -1997 10875 31520 3455 -5458 12868 17238 22419 32673 23902 387
15448 387 6752 4693 -4710 14642 14870 33516 20629 -1398 -12690 34296 58838 19254 12690
15435 12690 35609 25463 42489 27800 -1738 -22173 5836 -18228 -39200 -50367 -74431 -89200
15423 -89200 -78232 -71480 -51794 -42331 24069 45394 66101 57061 25069 33444 52662 20102
15411 20102 -19795 -62825 -39731 4040 22847 24059 31646 43434 26639 -20605 -3225 -22781
15399 -22781 4410 11143 -23710 -43687 -26410 -32197 -21156 -19687 8289 4580 20757 -4120
15387 -4120 -48468 -92026 -91057 -66108 -65009 -54985 -32288 -19008 -1707 45591 37585 3822 -20470
15374 -20470 -3152 327 -2739 -25608 5247 30624 16354 -35259 6823 32192 18426 -997
15362 -997 26833 39702 23355 8269 29364 44866 71970 64768 91617 65621 -26923 -37507
15350 -37507 -2039 8313 -32681 -63224 -90753 -139973 -142211 -118164 -57534 9082 22627 11431
15338 11431 -4014 -33119 -17098 32954 38160 21588 28498 -8770 -51179 -55561 -72351 -76143
15326 -76143 -24484 -3005 -19814 -11693 -4340 -1052 -24656 -45102 -39150 -60118 -19468 26263
15314 26263 44485 44588 20968 17924 -16398 -35707 -40937 -53699 -96050 -80911 -51319 -6800
15302 -6800 10523 27741 71353 42080 22139 5304 17123 -22013 -39083 -51880 -78669 -65990
15290 -65990 -89051 -66874 -41224 -67771 -86205 -81314 -143840 -106100 -37152 -3261 -19129 -82570
15278 -82570 -73983 -56109 -55587 -43596 -10330 -24711 -32123 -26981 -44712 -84810 -85236 -26322 58573
15265 58573 61498 53224 44755 70030 70264 54335 67029 66628 86271 97446 63651 16985 1778
15252 1778 8061 12166 -22570 -8634 -22497 -48452 -15015 -648 -3279 40252 57327 20002
15240 20002 -26811 -33295 5367 16879 8146 -1901 -20944 -41711 -34284 -26554 3886 32674
15228 32674 48701 13720 -11965 -42029 -45356 -19120 -25289 -15463 23583 51992 2868 -61467
15216 -61467 -55523 17002 -15845 -51336 -2 2629 -16379 -1537 37532 19164 -4045 10823
15204 10823 12302 17292 9120 -18912 -43887 -37726 -13368 60506 52747 32777 58785 55849 -2533
15191 -2533 -24194 -32590 -41658 -37201 -48275 -39064 -61530 -88454 -53252 -16326 15871 65266 51180
15178 51180 -18344 -42727 -56148 -38704 -24966 -25603 -11703 126 -9297 -392 -10561 -1847 2420
15165 2420 9157 1317 513 -5222 -325 -27586 -39272 -48558 -15035 -2322 34757 70990 81279
15152 81279 92279 50704 34496 11095 14685 -9124 -14848 -42853 -34178 -54878 -58091 -69270
15140 -69270 -51161 -65765 -37983 -32984 -49643 -22301 8768 24092 41479 -10547 -62497 -78595
15128 -78595 -80082 -20268 -8542 13238 -5715 24472 59790 48000 21341 5477 21047 34329
15116 34329 34409 11649 282 -14318 -20010 32416 37028 13351 -4920 -44436 -43672 -50761 -63125
15103 -63125 -40388 -34096 -51240 -58503 -68594 -36420 -7014 -2609 -9207 -1138 29107 22503 1633
15090 1633 -5526 -6505 11204 10164 18441 -27625 -47139 -44742 -44221 -25491 -22270 -14128 -18163 -35346
15076 -35346 -30294 -18002 -3691 -646 32079 15445 29602 44769 6168 -18243 -12638 43411
15064 43411 28190 -11908 -9289 -14271 -8500 20312 50364 16574 -25772 -51994 -39182 -2022
15052 -2022 -22516 -21086 -12790 17628 27357 5630 -12793 -20191 -15339 -1715 -6931 -64165 -92570
15039 -92570 -99598 -79466 -84840 -104781 -87599 -47678 -39912 26194 35934 -30503 -80439 -44676
15027 -44676 -3095 -675 -3068 -447 39213 79789 75304 66700 52723 23533 43512 27640 14097
15014 14097 42082 65440 90134 107681 85636 65595 73432 68558 63920 51839 27812 21992
15002 21992 2461 -8182 26880 99088 205213 373615 438325 314180 174617 98898 41163
14991 41163 4364 7064 11303 -5081 -12781 -10344 -10662 -21915 -11127 51426 74699 61400 46049
14978 46049 1413 -1930 29408 41114 44176 32829 -1542 -25675 -37413 -50832 -49650 -33112
14966 -33112 -41765 -25022 9089 33186 3023 -65645 -38516 7157 13708 -25189 -55317 -37933
14954 -37933 -29430 -54682 -50799 -5890 5162 9803 3089 -4430 -10304 18828 26180 22156 9723
14941 9723 17139 10342 8054 -21930 -75021 -26810 32882 54713 24566 -8058 -44603 -66504
14929 -66504 -70295 -28615 -19766 -27822 -42199 -26220 -22016 11432 -14263 -29376 -42032 -64263
14917 -64263 -46829 -25240 -45449 -49784 -29207 -37429 -56904 -5452 -5881 -9087 25595 32382 -7072
14904 -7072 -45550 -38140 -17802 22096 99784 123262 126989 58260 -21678 4531 40552 67738
14892 67738 79445 26696 -21331 -43188 -35668 -65647 -37599 10007 -15436 -33758 -26776 -7318
14880 -7318 -32560 -74204 -96330 -91074 -43648 -24649 -51553 -73518 -77167 -40478 -53616 -56572
14868 -56572 -1545 47186 37572 -20102 -64201 -53227 -30482 12102 13777 -19057 -32678 -9485
14856 -9485 -7131 -30871 -18349 -19906 -32802 -37761 -116 64621 43760 50970 56915 54792 42960
14843 42960 59329 9778 -33328 -12620 21157 32671 -6642 -29484 -37617 -7206 -3727 -58997
14831 -58997 -71790 -57741 -11556 22095 18473 35579 41477 7489 -10940 -27905 385 11911
14819 11911 7458 9865 -1805 6139 -2543 -42552 -69097 -94301 -37049 48659 56886 11430 13210
14806 13210 252 -38834 -39699 -32061 -39525 -63370 -65432 -53048 -45562 -28350 -11801 -31933 -36545
14793 -36545 -37839 -3893 39443 35449 63 -2675 33505 48073 -12459 -68267 -58812 -46636
14781 -46636 -50380 -28739 17194 21970 35956 39173 24480 40297 23420 -24197 -38729 10724
14769 10724 10444 43184 31379 1385 -10617 10294 31234 38926 33609 -13236 -23171 -50793 -39414
14756 -39414 2377 28870 58362 43635 19485 18828 29285 -28600 -51277 16627 24088 -27852
14744 -27852 -27238 367 -16271 6483 20529 14441 -15514 -10091 41847 65383 54564 44115
14732 44115 49703 46795 48946 18625 -14539 -29554 -27275 -42944 -57054 -68960 -58739 -18042
14720 -18042 33853 56560 31382 28544 27251 -12752 -11258 -9843 -10596 -17182 -41639 -46138 15271
14707 15271 26926 10509 -29572 -53476 -5792 7268 12854 -3209 16719 -1961 1512 36698
14695 36698 35463 15387 11021 22399 28029 43357 38024 31011 43480 -5789 -10941 33067 47006
14682 47006 44016 -23524 -18697 54739 79045 76752 54663 36644 19171 15078 -12573 -69463
14670 -69463 -83903 -52495 3719 20764 -5346 -36830 -47752 -72581 -38181 -29524 207 15247
14658 15247 -3398 -10590 -18386 -24667 -16793 7910 39020 11840 -26338 -14686 -59847 -72589
14646 -72589 -46862 -2400 -14983 -3147 1031 19068 44576 56294 49110 47808 39393 44958 66463
14633 66463 81753 79494 17830 -41731 -37406 -66667 -54472 20307 65587 87081 89414 79908
14621 79908 63386 34900 7314 -13216 -3555 -859 -41834 -68501 -92520 -96825 -80570 -79783 -81908
14608 -81908 -32877 11841 70627 94796 94435 48916 16444 24988 40065 26646 13613 2766
14596 2766 18712 38464 26644 -11734 -58702 -87238 -51013 -36446 -55421 -85611 -59850 -23082
14584 -23082 -4423 -50947 -67373 -37210 -31808 -38761 -49636 -27912 -33963 -48889 -13815 17411
14572 17411 -2048 -5403 7777 -8799 321 -27776 -47004 -32841 -61085 -40419 -24422 -41506
14560 -41506 -42278 -29008 12499 14196 12063 -5772 -18501 23427 51013 31592 -6470 -35044
14548 -35044 -46769 -16377 -51339 -90288 -63071 -53706 -18878 9307 39618 29226 2050 -31683
14536 -31683 -92643 -118787 -124400 -112337 -157753 -140897 -82172 -83202 -84306 -68603 -61314 -65303 -54538
14523 -54538 -20458 -34786 -52346 -61212 -43172 18431 16521 6266 -17091 -38368 -16907 -47864
14511 -47864 -71889 -46979 -17288 376 56743 3092 -12333 11456 36680 54848 58131 30619
14499 30619 27357 36131 56431 51800 30271 34812 54766 44743 9284 21823 39963 33071 40325
14486 40325 100384 85934 41114 44685 17912 27520 41836 28557 -25729 -20789 -8142 53304
14474 53304 51606 55061 46659 12859 -24721 -41835 -44138 -47625 -40621 -9480 -25727 -11580 -10540
14461 -10540 -19640 -27784 -32724 -36882 -6314 -16983 -22149 40517 45404 26223 56239 82137 26459
14448 26459 -24786 -43681 -67307 -54918 -7562 -18861 -59644 11674 29309 -7664 -7062 -1115
14436 -1115 -48804 -80228 -58910 -38753 -38977 -22512 -6283 10472 8814 17500 5282 -30760 -10343
14423 -10343 -22964 -28073 -51602 -21521 6707 -43757 -50239 -11247 -16542 -17246 -12383 -70644 -82184
14410 -82184 -53853 -58456 -71602 -49899 -42736 -34220 -34440 -33538 -69911 -52481 -8710 6258 9301
14397 9301 -14740 12706 9163 13346 32229 13226 20307 3866 5169 -4959 -12580 -10888 -41374
14384 -41374 -18940 -24694 -21814 30900 28621 17638 39039 19135 28529 -4552 -13910 8921 12993
14371 12993 -72596 -84794 -40133 -17276 17490 -6661 11491 81512 89761 33832 24772 -11255
14359 -11255 -71570 -108291 -71543 1783 16457 45472 38971 13925 36639 43681 40580 40255 4201
14346 4201 -59944 -93290 -42545 5562 -16293 -31531 -27949 -16087 -11757 -19434 -34302 -23721
14334 -23721 -26985 -41417 -78964 -129105 -115428 -59568 -24181 -949 30295 2259 5415 38256
14322 38256 55708 21792 -10102 5396 -32372 -28009 -1644 -19979 -41795 -60854 -62153 -24123
14310 -24123 -32431 -26409 -12742 -4482 37727 23756 -18189 -20085 -20963 -35945 -64609 -54177 343
14297 343 35679 21546 30423 88879 106770 72226 46788 44072 44654 36664 -14617 -5039 -6992
14284 -6992 -3780 -5273 -18095 2137 39256 20450 17782 -10201 -58469 -56228 -56495 -72909 -68701
14271 -68701 -46581 -29450 -23743 -48680 -86991 -78197 -28900 28677 18998 -12385 -60838 -51545
14259 -51545 -10014 13045 15936 40753 32369 11214 1151 17125 -6344 -8864 41669 30677
14247 30677 12908 -10638 -33122 -40259 -22725 -42426 -89517 -84214 -44958 -1484 22539 18224
14235 18224 10671 -759 -19102 4780 27098 -86 2677 30740 7403 -24550 -48233 -17005
14223 -17005 4224 1927 8366 -2447 12716 5819 12667 19004 30808 -9739 26100 66514 22612
14210 22612 30292 7306 10884 1324 -6258 -9459 -37429 -36490 -36754 -28719 -11099 -14541 13172 18885
14196 18885 23732 -3190 -21919 -48764 -55469 -56787 -64706 -64215 -35790 -35077 -51657 -52081 -50047 -72401
14182 -72401 -65129 -54779 -20834 -64790 -49655 -6697 11013 -30244 -10844 -38019 -73642 -25376
14170 -25376 -27917 -11585 1280 -6701 7846 54724 49730 37391 86361 68119 29940 -21556
14158 -21556 -388 47421 38896 -3103 14195 -13168 -43301 -61634 -70405 -41539 -22184 -20693
14146 -20693 4554 -378 -3179 8147 -61272 -37214 -6571 -30432 -22688 -19256 -1978 1718 -28129
14133 -28129 -21886 -11902 -40695 -90973 -91872 -50947 -55984 -44449 -32100 -34696 -26203 -7789 -12792
14120 -12792 -17891 380 30015 -1107 -16518 -52122 -2903 -765 -19086 -13642 23855 48822
14108 48822 22587 10342 -907 11377 76152 121679 75242 57971 19667 -43170 -67951 -98794
14096 -98794 -89383 -61728 -51841 -79905 -48772 2407 12026 -37735 -52391 -72564 -104734 -100680
14084 -100680 -78634 -44047 1790 3498 25921 77757 34899 -55008 -78805 -74491 -74987 -65679
14072 -65679 -68440 -86995 -126934 -141839 -129633 -65207 -18142 10325 17716 44603 4486 -54434
14060 -54434 -58765 -38928 -19158 -13775 -23194 -36586 6874 4764 9204 56361 26818 -1743 3824
14047 3824 -12804 -20076 -4739 49399 90574 57888 -24410 -80991 -110137 -117093 -87958 -13233
14035 -13233 -27788 2911 39957 3808 10463 2268 -22978 -35874 -11887 27292 24947 -14132
14023 -14132 -22560 -24015 -50584 -51766 -42522 -35834 36232 82710 54541 37142 16055 37845 10143
14010 10143 -12497 -23547 -54367 -85566 -50091 6998 13689 -30875 -52118 -42573 -10509 -30289
13998 -30289 -21954 19726 21957 -22610 -12589 37221 56583 31402 -9041 -35390 -11756 -17949
13986 -17949 31568 81996 39073 787 -33047 -35103 -4856 11066 22308 37974 18336 -20999
13974 -20999 30832 64367 93492 67906 15753 -14656 -16011 -20853 46000 45110 33000 13435
13962 13435 -5813 9456 23122 45876 68982 70006 42091 3214 -11440 -9650 -5038 31351
13950 31351 67662 52169 31710 15198 1380 21683 16062 29701 -8717 -52039 -90647 -111528
13938 -111528 -114809 -79856 -59083 -44502 -3014 2410 -7495 -655 8996 9170 34122 53327 12880
13925 12880 7431 -18977 -45951 -15000 41974 46339 23617 2455 34200 63376 48780 -52
13913 -52 -21846 -59615 -52829 -58495 -54874 -13387 -957 -15378 -27089 -22656 6699 12614 27196
13900 27196 28011 43861 55107 26193 -42774 -26909 46676 62190 56448 38434 26021 -3883
13888 -3883 27066 37822 4485 -4597 10974 27597 62778 49674 78110 76747 29576 -10599
13876 -10599 -17485 -9600 1871 58142 51339 11656 -18135 -33552 10707 27476 -8014 -12507
13864 -12507 -11308 -33865 -50135 -44973 -56185 -7580 14908 -18407 -13270 -11714 -65480 -46963
13852 -46963 -28086 -11715 18702 44261 17581 14815 6527 -40609 -21907 1621 8526 -9603
13840 -9603 -8505 -32335 -53621 -52834 -20675 -7256 -9642 6899 -24690 -582 -27873 -31708 -37526
13827 -37526 -26975 -44355 -53233 -16946 -14517 -42855 -64706 -72983 -38242 -38521 -25950 -44571 -35394
13814 -35394 -53792 -83628 -42202 -956 47461 76722 134479 139993 116072 36077 25914 52083
13802 52083 94605 92270 52388 2770 -14650 -48529 -62536 -71478 -64705 -44700 -45505 -89546 -57237
13789 -57237 -14670 928 -5316 19231 38354 61243 36272 -26985 -38569 -13693 4166 11624
13777 11624 -15489 -45495 -23288 530 49323 52291 24042 4421 4464 58860 111419 114433 85475
13764 85475 9530 -12632 -72390 -71403 -36527 -51479 -7016 42700 26033 31327 70322 35612
13752 35612 25134 17068 -19041 -35879 -23350 27066 25014 43691 95247 100373 74967 50165
13740 50165 1149 28985 8047 -10831 -11004 20719 69190 67986 63987 73512 36044 2209 -16517
13727 -16517 -37683 -13668 37686 86150 102103 100364 108161 98273 71582 10715 -5557 4142
13715 4142 3943 20790 46137 1980 -40563 -70276 -15690 36383 72089 59007 4348 -26686
13703 -26686 -25449 18133 11178 -18360 -13675 -5235 -3603 -34047 -45910 -35585 -33574 -30198 -13776
13690 -13776 15844 38430 39776 9173 -18572 -29481 -34636 -4332 31360 46100 28733 -25363
13678 -25363 -35183 -31834 -24773 -1996 -13036 -26565 -49020 30125 59150 42749 47255 65020
13666 65020 44354 -9978 -28096 -35461 -38671 -57091 -66008 -41716 -31886 31560 54192 12163
13654 12163 24590 -5796 -50247 -13380 -25520 -52847 -96832 -119868 -120726 -87780 -43309 -15229
13642 -15229 -43766 -56152 -64107 -91214 -90360 -75917 -36046 13282 3395 -593 38124 51038 28564
13629 28564 -44 -25702 -9375 -15602 -21412 -22669 -24775 1831 9381 -1172 24339 53630 10622
13616 10622 -28677 -23241 4405 28733 2801 13974 40943 36769 6273 -9865 -31831 -40212
13604 -40212 22222 44953 69623 61462 32762 -13370 -22292 2735 40775 63342 70514 65620
13592 65620 -8108 -78493 -73775 -68300 -53044 -72477 -61284 -47287 -44778 -29345 -43533 -85400
13580 -85400 -68630 -41700 -283 -7633 -41693 -28379 10932 60263 52412 1307 -472 7538
13568 7538 34454 7382 9328 37965 27410 -5702 -24933 30972 27216 13207 9337 -18120
13556 -18120 -62734 -79559 -82993 -44966 11166 -15697 -72704 -75788 -45935 -33867 -36822 -28673
13544 -28673 26369 68418 75619 46645 18512 -21079 -43037 -77892 -46839 -13984 10094 5220
13532 5220 666 2463 28899 2920 1444 4342 20287 47339 13758 -20284 -28748 -21925 -6759
13519 -6759 -29954 -39217 -46781 -74982 -101718 -67472 -58575 -61031 -38178 -31488 -50090 -21306 -28743
13506 -28743 -41262 -39190 -16803 2256 45737 38105 -3664 -32023 -8272 20729 25452 10249
13494 10249 7859 35145 43930 50400 55399 25368 10815 -20287 -12848 9746 -40046 -76125 -115397
13481 -115397 -88130 -126867 -121607 -69119 -14347 -12480 -70435 -66284 -19109 -918 4748 7552
13469 7552 8474 -2164 -13741 1402 8393 -3238 -4360 37866 104123 99367 84081 84283 93754
13456 93754 86868 77196 39729 7915 -32674 -57568 -54613 -69982 -94823 -93250 -68759 -53110
13444 -53110 15190 -1234 -40681 -39531 -29995 -46914 -22131 -68614 -107996 -78742 -59823 -19949
13432 -19949 3627 24803 12017 -14198 1888 -24103 -30427 9750 8891 9438 36930 68874 69212
13419 69212 44391 417 -44213 -80548 -91771 -48821 2414 40945 79678 65089 14468 1074
13407 1074 1490 -14304 -19412 -18507 -16612 -38725 -54441 -57626 -66329 -76275 -95191 -80825 -45948 47844
13393 47844 71557 27771 1068 -12864 11352 -38379 -81223 -54100 -27864 -50233 -66244 -96399
13381 -96399 -115198 -67437 -43473 -56874 -59432 -40007 -2424 36727 14587 -1559 6440 15304
13369 15304 5743 -17098 -41876 -44081 -54070 -33312 -14413 -43321 -46863 -18331 -39960 -36941 -59772
13356 -59772 -52726 -4899 49790 60234 33983 2824 3417 2286 -42968 -52809 -49251 -85600 -87104
13343 -87104 -93933 -51546 685 74742 21216 12226 35157 32174 8218 -29608 -49273 -28578
13331 -28578 17493 64438 47869 6945 1946 -2751 -13381 -18129 -4006 -16575 -33425 -20032
13319 -20032 -8783 29205 15122 25664 46450 24563 -17337 -31178 10317 8273 -20778 -35076
13307 -35076 -44695 -71990 -80949 -35194 -29170 -72481 -54488 -7520 -791 1768 -27901 -39023 -23442
13294 -23442 -3077 571 -10288 -2369 -14222 -26252 -31099 -31416 -55180 -70549 -17831 29255 34237
13281 34237 51212 46689 44641 25160 28080 34372 52561 53824 58118 14196 -35302 -25039 24813
13268 24813 26346 56293 73647 50821 7189 15196 13395 22110 34258 8705 41944 14768
13256 14768 -19793 -5436 -13636 5344 15290 -10318 12225 20511 8937 314 51182 64780
13244 64780 30417 39156 61160 52613 -20700 -11617 7477 6935 20377 37327 16936 18302 6193
13231 6193 35550 27760 8557 -10811 -6810 -9445 -5087 -29475 -23730 -32973 -103840 -66089 -33159
13218 -33159 -20667 35159 49789 -7729 -18981 5940 18552 27368 7619 56366 80588 71518
13206 71518 73012 53771 36121 11766 37042 70348 64719 79043 128326 197086 320491 472644
13194 472644 680898 1070814 1597430 2013981 2067753 1769459 1285078 892586 652351 486731
13184 486731 367514 321675 280347 220040 141897 52872 33244 45938 73653 97273 94818
13173 94818 113714 147350 122121 102575 62770 2645 6262 1130 -36498 -26859 -37984 -18708
13161 -18708 6377 34595 90388 105116 103902 82937 66854 42298 29940 6173 21095 4024
13149 4024 -2446 193 3530 22965 -3029 -23383 -22594 -33993 -39821 -39208 -50293 -56977 -14490 26517
13135 26517 26594 29211 44769 14991 7876 -26263 -7726 15528 37784 81820 61315 20297 44581
13122 44581 10951 5086 6973 -6820 19514 99372 128967 85926 84166 110153 62237 24832
13110 24832 -18380 19925 65052 55373 70582 98841 89707 60506 62963 68365 1210 18835
13098 18835 58318 11027 -38855 -31793 -13950 -9169 -29291 -32423 -7398 -22586 -31014 15798
13086 15798 37699 18697 25371 -5619 -18249 -21125 -24005 -46124 -7550 18061 -6281 -8201
13074 -8201 -35523 -13957 25943 55215 73029 74673 24074 28390 51256 49192 30937 89247
13062 89247 128580 109269 123134 140687 153740 105640 92226 90701 88724 59540 11846 -2678
13050 -2678 19679 13773 37350 65334 100616 101731 96451 117261 92972 24638 33965 75635 102910
13037 102910 98198 123437 94784 57324 55922 56727 59612 41140 21021 6446 -10939 -3644 -780
13024 -780 -16045 7451 64954 100254 103076 98121 82358 74224 100338 141726 141153 129417 73591
13011 73591 14748 1144 3016 -11241 -11594 -32421 -14783 9683 55732 78844 109673 149151
12999 149151 124423 127912 78491 91827 111241 93753 91643 98293 126342 158089 140344 119541
12987 119541 107941 61940 24273 29470 63862 98932 125489 131191 86751 50939 28747 34961
12975 34961 62377 80354 42320 -23169 -21600 9889 35940 40768 58106 56263 30412 -5438
12963 -5438 -27117 -6083 27278 41533 68206 53175 24537 26214 19985 11836 6482 -24688 -8338
12950 -8338 74893 129736 140201 111687 98756 90226 80364 61561 66804 40833 16928 -8852
12938 -8852 11725 70136 118240 150926 194218 215699 238943 245210 168432 130532 66150 70670
12926 70670 78872 63109 67439 57339 35609 -6122 2466 -14312 -30556 -32799 -12089 -21904 -3050
12913 -3050 -12924 -11361 27063 103512 165651 173771 126423 118082 126499 160126 221958 221519 169858
12900 169858 166221 164356 191027 191699 166832 158637 149093 88956 63566 59017 53105 17987 62919
12887 62919 70080 35738 19271 38762 19211 18798 -3366 -72915 -35450 8794 37970 69973
12875 69973 97994 106683 76542 91594 117608 163691 153332 106421 22601 -101223 -201256
12864 -201256 -141596 -100360 -54737 -32828 -41638 -100025 -154165 -146440 -99983 -58371 -42502 -54874
12852 -54874 -101588 -109682 -47273 -19165 -21608 15485 51853 80350 52717 44182 29806 21436
12840 21436 65344 98058 109354 95609 52980 66263 147033 127472 128581 173347 142769 149721
12828 149721 147313 121472 133426 176878 155616 126129 100876 81080 77039 132574 161259 181024
12816 181024 204918 249366 291742 288077 254509 209658 237823 253486 235038 208040 244854 242131
12804 242131 239417 238523 249950 251795 234771 241492 276042 308298 391791 450085 427226 400398
12792 400398 409480 376980 332073 337040 356127 349784 404111 475200 533005 593034 649247 636004
12780 636004 612502 632329 674755 680575 739525 780831 851942 969922 1081062 1183440 1239876
12769 1239876 1325858 1404947 1463029 1580186 1772167 1991729 2239615 2535088 2805864 3157460
12759 3157460 3493991 3810075 4178872 4671759 5348382 6234986 7382030 8816026 10276331
12750 10276331 11485281 12717187 14489182 17253850 21341131 27395403 36546923 50957002
12742 50957002 75362976 119324447 196841189 304779985 391045509 399240172 330259046
12735 330259046 231027856 150490335 101117453 72543717 54964901 43290482 35080190
12728 35080190 29150315 24894267 21882000 19627257 17591057 15505118 13457916 11661626
12720 11661626 10230786 9087392 8139024 7343574 6656169 6084735 5693365 5440023 5250590
12711 5250590 5193897 5312555 5603216 5894218 5868608 5387351 4646930 3896730 3325311 2927046
12701 2927046 2620445 2378342 2181391 2018171 1828002 1657095 1506994 1412548 1307779 1220000
12691 1220000 1147313 1081655 1054159 1056862 1049312 1024337 965632 902929 832782 758721 742701 760684
12679 760684 746342 720404 740369 751785 751441 757981 733666 688814 602363 519796 470149 442965
12667 442965 485481 502741 459961 416414 386580 373332 349373 344117 356793 354038 348929 350762
12655 350762 368830 366537 357300 345516 351563 348896 369228 323111 249912 204789 219509 225382
12643 225382 199882 197982 269518 269909 268230 290833 312223 341045 321105 311317 274104 237390
12631 237390 244603 242174 219887 236505 273984 321367 344206 319743 301214 248492 205845 244150
12619 244150 307708 318532 269408 237664 274117 294621 357296 446995 515435 545375 488521
12608 488521 339201 247523 221102 244908 226669 186335 182237 157271 143627 115607 95595
12597 95595 122273 158159 157165 153105 165459 102476 73059 114717 147914 167550 160517 137328
12585 137328 135591 102215 84817 42206 -13702 -18425 32965 85690 87259 58807 61500 17921
12573 17921 -405 17931 26005 40591 29191 19213 103725 110643 109369 126318 133560 155969 167055
12560 167055 149074 152049 173840 171791 154599 152826 126832 128802 116167 111694 62358 101492
12548 101492 126527 101562 33640 -8322 -37543 -66199 -58907 -46070 377 -34466 -65398 -12226
12536 -12226 18144 16740 9306 24464 60870 73104 30047 -15721 -40504 -33427 8974 66907
12524 66907 31044 -15645 -23875 37757 -5322 -46151 -36665 -11537 -3710 -18776 -29980 -12458
12512 -12458 -2123 -21860 844 5612 -17813 -38198 -25281 36313 85110 60431 94457 109594
12500 109594 95138 72480 39327 65625 64112 39166 17396 18175 43727 93114 107916 107802
12488 107802 106479 113618 82506 64827 31453 61543 56027 27085 30989 101847 118331 106405
12476 106405 100746 70699 58075 29488 8019 46033 65757 73200 78626 83487 67406 41146
12464 41146 89367 99721 48743 14693 5124 16012 24239 31216 62622 56519 57122 48248 9967
12451 9967 -22988 -12116 -13411 -18856 -32378 -38126 -15241 32606 49126 65934 82169 38481
12439 38481 8975 17655 15659 24683 45694 16295 29665 46958 38706 42568 40868 22117 46945
12426 46945 62598 61996 59452 57954 63205 13769 -16005 57315 110453 66848 47139 36298 25329
12413 25329 -13123 -9812 9924 77131 71970 34170 24475 63200 113801 128924 82533 46295
12401 46295 8176 -25630 -16462 -25897 -40232 23902 33307 2729 11654 -2314 -8640 -38892 -29592
12388 -29592 24404 43612 63486 30190 -20141 15961 -692 -13882 11603 -28730 -59933 -24613
12376 -24613 2779 47096 53415 38831 41181 31291 34587 16763 13068 15858 33665 62031 53555
12363 53555 33469 37532 58902 57929 33924 27060 17801 -24989 -20665 39715 64161 103384 78388
12350 78388 21677 31510 39376 6713 6597 68748 75287 60239 40523 8950 -3466 -29923 -16315
12337 -16315 -29071 -36091 -16207 1390 49155 46846 22130 12047 -6084 17264 49359 37201
12325 37201 47101 37398 69260 104309 88537 19953 -7777 -18021 -55720 -76707 -33310 -1159
12313 -1159 12839 4119 17445 32507 44810 47682 69129 11969 -31273 -9307 28187 23065
12301 23065 28822 3573 4924 23488 3655 -5754 42125 48684 53050 113623 120524 71583 85586
12288 85586 109987 119097 146772 205925 242464 272450 361747 565536 983960 1491446 1961279
12277 1961279 2141150 1955534 1506396 1046035 733792 578371 434527 332479 270276 202108
12267 202108 139631 113879 75156 65944 62853 31601 14294 20118 22486 51251 60827 43760
12255 43760 20801 39722 31330 7946 22595 21958 39053 65155 71197 54461 61028 57224 45588
12242 45588 19287 -11415 31796 62587 17437 -17949 -20576 44036 82669 54482 -5348 -27808
12230 -27808 -26548 -4342 10949 8497 17064 32498 52351 77348 49194 -19110 -56119 -50051
12218 -50051 -52690 -56352 -7046 -7517 1167 34541 51657 50415 2162 35117 32220 12282 -2336
12205 -2336 -28625 -36796 -42542 -32154 -26157 -22756 -36940 -37411 11647 8892 20948 61158 83220
12192 83220 43901 23403 53912 36352 33533 46042 896 -31414 -33613 -17898 -6594 -29601
12180 -29601 -10592 -6254 10864 -6948 595 -47884 -64668 -62491 -56421 -24550 25604 34717 40061
12167 40061 34421 -8287 -40691 -5999 35013 -21527 -27209 4567 -9260 4489 6058 -2680
12155 -2680 -6740 28034 37231 30512 25747 -6665 -38716 -646 -6145 -6334 -19993 19963 11007
12142 11007 -60391 -44290 -1121 -403 -4574 -14643 26968 41265 37146 48247 36299 40058 36596
12129 36596 43433 44599 54040 63342 4315 -22876 -9979 -2519 -17601 25424 54142 53929 26587
12116 26587 -10745 -24549 -57115 -67460 -51633 -41708 -3253 26487 39216 17905 -57833 -90714
12104 -90714 -64547 9805 21365 -5073 12166 23181 49567 74061 24101 -4747 -16002 -40817
12092 -40817 -29552 -7444 -26663 -5646 26450 4963 -37321 -60216 -51759 -12314 -10477 -33097
12080 -33097 -15234 29788 -2079 -13231 -1473 36158 39413 51327 47910 3907 -34669 -20666
12068 -20666 1576 4183 29040 35728 24725 23906 13676 12447 20455 49536 40255 -6896 -22685
12055 -22685 -32524 12416 13141 1816 -37846 -76527 -57038 -54201 -83753 -111037 -99373 -68013
12043 -68013 -25910 5690 -6023 -24644 -23953 -3671 22912 18027 11027 -11109 -8843 5245 40181
12030 40181 26861 53572 65618 44332 1067 -17030 -21203 -2913 6981 -20942 -8027 -4323
12018 -4323 -10854 -34833 4063 6189 13232 14778 7115 16337 40214 38785 38650 31909 931 -29663
12004 -29663 3342 26257 15884 -11252 31776 44893 -26108 -47863 -21057 -11303 6950 24806
11992 24806 32328 31771 47130 4962 -20007 -9364 -2533 32341 2572 -26974 18484 81500
11980 81500 87931 30497 -20669 -58549 -58289 -52904 -39962 -12508 7441 -21283 -33638 -26236 -19651
11967 -19651 6558 21677 19275 57324 69864 34254 -22134 -38947 -18954 -2405 -4150 -28457
11955 -28457 -42105 -47915 18669 40869 26726 26570 -8377 -22785 -54965 -88100 -52613 -51329
11943 -51329 -13150 -7271 -43629 -54870 -20619 -15369 -8898 12743 -55615 -81179 -52462 -15420
11931 -15420 -4447 -8315 27498 8531 -2780 10128 19473 17638 5758 4547 12803 -36546 -73480
11918 -73480 -67162 -73312 -40817 30355 55239 15813 -20706 -29493 -67319 -59862 -24182 -33437 -57092
11905 -57092 -45735 -21174 -8717 -39368 -41389 -59816 -69429 -16982 -6835 -2240 4724 -2929 11413
11892 11413 -8597 -31849 -43011 -34697 -66610 -57502 -28646 -18554 39866 54174 -4014 -25852
11880 -25852 -165 9518 17715 -18909 -56272 -60485 -35483 -27618 -31814 -49050 -24157 -26512 -4713
11867 -4713 -20195 -24522 17097 20048 10050 31867 44051 32750 20892 -3036 -32260 -79639
11855 -79639 -93291 -45811 31475 65891 50823 34839 32070 -2105 -5510 -47338 -40364 -37028
11843 -37028 -21682 -13204 -22153 14051 24200 17946 31066 43345 -117 -1200 9114 -1643
11831 -1643 1949 19749 36658 62359 33132 21478 -15131 -29566 -12631 4704 12168 16905
11819 16905 -13921 -36071 -57707 -33707 -36383 -16978 -9227 -19178 -9852 12098 17566 1883 -32248
11806 -32248 -45658 -67940 -39859 -22104 -8988 -7159 -3715 19721 18971 6645 -22200 -20349 -7692
11793 -7692 32046 31576 35864 47700 48241 32793 8376 -13949 5529 20536 8195 -9934 7345
11780 7345 59718 29998 -58758 -80046 -69842 -46330 297 5515 -47174 -5051 17473 14579
11768 14579 13878 13888 38305 60663 7743 -5686 -30968 -50053 -46889 -43704 -52262 5388 14644
11755 14644 -29501 -34391 -15310 -31676 -34248 -623 -29610 -35610 -44822 -30688 -11806 -21663 -27042
11742 -27042 -70243 -102120 -65740 -60769 -38131 -1179 -4633 -18820 -25438 -22137 -43937 12422
11730 12422 26199 9384 23761 3068 -5458 -18114 5739 -637 -10742 -46442 -86154 -66934
11718 -66934 -82735 -74186 -47044 -9723 36752 37741 1312 -17166 -6532 46038 84115 38124
11706 38124 21180 38450 11866 -46403 -8177 34746 11857 -9970 -12261 4682 23129 22171
11694 22171 27981 42795 41855 87558 93111 46886 27076 36995 40253 28870 21488 -4876 -15957
11681 -15957 28284 65210 77215 112562 90314 54205 46950 27627 7999 -4396 26438 49278
11669 49278 48966 43172 41978 46868 67742 36626 35581 58307 85330 41795 -44960 -82058 -104075
11656 -104075 -130299 -111939 -100115 -61856 -15038 -19918 -26923 -26538 -12608 -18097 -4283 -20957
11644 -20957 -75397 -88541 -66754 -62227 -37672 -35285 -20101 -50444 -63928 -50486 -40294 -12994
11632 -12994 5726 4798 9976 32227 13697 20073 8143 7829 -32590 -28914 -75424 -90066 -101789
11619 -101789 -123459 -65966 -32714 -69264 -78956 -50623 -47047 -50063 -48540 -31539 -4724 18317
11607 18317 -10482 -50136 -54471 -34755 -45309 -46333 144 -21256 -66251 -56250 -21046 -9537
11595 -9537 -27939 -13275 -27284 -43534 -35811 3536 11308 -19155 -23566 26550 37456 57284
11583 57284 53549 35118 36159 18105 -30262 -64399 -78702 -56765 -55610 -20809 50219 5253
11571 5253 -24905 -15910 27075 27524 46994 43527 -21660 -44583 -59188 -87180 -60337 -43833 -42004
11558 -42004 -60102 -20314 -6501 -31197 -37052 -8854 41710 34801 6219 -6236 -18991 -57472
11546 -57472 -59179 -68383 -58066 -83896 -35928 -11111 17833 58513 40446 41655 3017 18822
11534 18822 15482 32518 46928 39701 -4569 -11099 -13750 -9374 -16219 -48724 -28063 -20234 -19927
11521 -19927 -34868 -25351 -42072 -48951 -6965 10730 -16345 -29262 -73283 -59631 -24221 -65
11509 -65 4607 -26377 -31982 20147 40438 19338 8515 25554 -259 -26855 -16655 -16960 -35013
11496 -35013 -4199 -5513 -13279 -15099 -32539 -5489 20171 -5815 -44735 -41475 -45982 -28898 -28014
11483 -28014 -3330 -52831 -2975 29131 39345 2748 7001 988 -28102 -54510 -42784 -22398
11471 -22398 -4368 -44519 -83437 -39015 -4414 1484 -55189 -36680 -58328 -43437 -26726 -2658
11459 -2658 5076 -13380 -56982 -34089 -57067 -70117 -79896 -26040 17749 18212 -18579 -50823 -60658
11446 -60658 -35602 -25023 -37687 -25311 4957 3348 -5293 4817 29413 21377 27687 5209
11434 5209 -24875 -6525 29001 34565 32218 29133 59847 104888 58433 17341 16300 -4678 -18129
11421 -18129 -48061 -59159 -63801 -28241 29393 34547 39148 -6814 882 56183 92066 48303
11409 48303 15829 -30661 -24288 -23491 -3321 -17181 -56721 -76119 -72786 -35021 -21643 -34285
11397 -34285 -55783 -8504 43365 60732 23069 -13359 -76742 -57404 -37954 -48459 -39868 -2048
11385 -2048 -6300 9752 11225 29982 24798 17014 -40 -28328 -53051 -28560 -10476 169 -3152
11372 -3152 -47821 -57473 -83240 -98024 -71295 -7553 9689 23355 -6629 -29256 -9397 -13880
11360 -13880 3259 30227 42937 17934 34050 34541 17683 15575 -11427 -32101 -10899 7821
11348 7821 -29289 -48702 -51782 -44530 -60602 -41219 -10987 -8772 -6770 -33341 -35880 -49093 -66256
11335 -66256 -103506 -101368 -43121 -30971 -45930 -1 -12438 -26473 -18263 -14130 14956 2453
11323 2453 26985 73615 64850 67316 39190 8379 40065 13194 -21540 -31664 -25713 15304
11311 15304 35588 -6147 -23233 -16158 -30885 -52469 -35518 -64689 -51670 -15878 16666 57825
11299 57825 62908 29335 16497 28754 57553 63135 28816 15053 8268 -7151 -46860 -35132
11287 -35132 -19807 -40652 -70146 -68912 -29734 -1179 46990 35495 -23519 -45882 -28696 -1794
11275 -1794 32208 12751 1940 7445 -8716 -15557 -28242 -32076 -30558 -13615 5811 8958 -6872
11262 -6872 7004 747 4110 748 -1669 15676 23042 -8025 -1838 10444 9274 19497 -10399
11249 -10399 -49029 -19267 -18220 -62516 -40011 -20001 -3280 5666 -13972 4697 11137 -16604
11237 -16604 -40858 -38999 -18365 14590 -1024 -35252 -49848 -62041 -51047 -36363 17900 65240
11225 65240 44173 48080 39413 -8605 -43732 -38114 -39834 -8867 31312 41043 13092 -34798 -24337
11212 -24337 -26014 9459 9933 -3014 14361 737 -17892 29803 43069 9633 21439 18922
11200 18922 22298 32219 22121 23016 44853 33131 34402 41474 19882 -3019 -10081 -51726 -112902
11187 -112902 -122617 -106502 -77793 -50482 12695 28812 -22278 4797 -4785 -27283 -176 -5927
11175 -5927 33165 61053 6425 -51774 -29255 47428 59266 17482 -66469 -88190 -56253 -67736
11163 -67736 -65733 -35371 -7991 -12423 -29330 -7245 11963 34427 54653 90246 78851 30550
11151 30550 12 -21049 -28563 -4442 17573 8420 14136 -4053 11096 31911 57417 60215
11139 60215 46438 20295 37200 60560 33416 9509 -31286 -52410 -73271 -70951 -38632 3725
11127 3725 -17398 -8849 -3122 -5920 -4993 26506 9288 -22404 1880 25414 -6596 -26562 -61237
11114 -61237 -71564 -38333 31081 43699 14397 -6805 -6940 -24882 -58682 -61633 -27934 -27315 -40317
11101 -40317 -15731 11402 18774 32802 34481 63986 64954 83547 86357 58923 17885 50066 62856
11088 62856 34844 -3752 -6245 -11771 -5392 28664 31682 23607 25568 51916 61296 47046 27736
11075 27736 17020 -22331 -34022 -2342 11606 35887 67749 90797 133410 165500 171781 242328
11063 242328 292689 443128 729795 1131446 1530427 1799266 1887115 1710202 1357722 938891
11053 938891 625585 452452 370140 323854 243481 189686 176203 158734 136259 124978 84228
11042 84228 59070 31847 34489 61265 24284 12084 39680 42397 35631 -10061 27653 42273
11030 42273 44153 33736 27504 12215 4254 8833 29568 16154 15466 -13116 -17461 1692 15989
11017 15989 7127 2466 25815 63843 63492 79653 90658 85282 84554 83555 42977 -9637 -9229 13470
11003 13470 64689 66265 44436 62601 70430 35255 24056 47032 54303 62551 67269 13126 -8681
10990 -8681 23119 24058 11325 30734 25605 49269 58887 38979 40299 39592 55390 10584 -36778
10977 -36778 -21121 37932 58045 36662 51926 79308 67088 55340 50142 48515 10398 24780
10965 24780 -17650 -32206 -47931 -83358 -58512 -29255 -31979 -12539 32918 51117 48275 30170
10953 30170 14998 7971 -19344 -26665 5428 19448 40829 77063 32212 21070 16229 -21885
10941 -21885 -59720 -61122 -16693 17195 42394 38556 52266 93544 110247 76483 26824 4027
10929 4027 -20580 6987 46356 99553 103883 102191 57263 -1390 7569 75603 62640 27837
10917 27837 55029 85923 52878 56640 95772 63719 85629 98721 110970 91758 75417 101986
10905 101986 99911 103267 128169 161184 136585 123291 115113 112483 149974 140801 134822 75605 28917
10892 28917 35499 45612 77394 102787 98620 87943 79015 42150 13320 39962 47289 40589 67365
10879 67365 108267 78987 62011 58470 31467 11203 3223 -14482 -30385 2746 -931 -33765
10867 -33765 -13428 -5366 8066 3102 40941 103834 96157 81279 84099 85644 73910 72183 48554
10854 48554 76951 73661 68724 33418 27412 74563 127441 133266 149112 199288 154962 133643
10842 133643 119822 144171 149114 137847 135094 110965 30534 -38156 -27126 2367 6929 -16391
10830 -16391 -1068 -12547 -22584 -29354 -10051 582 31646 10441 17409 36376 35556 83661
10818 83661 107329 83418 70094 86907 129375 117616 66168 35927 17908 36595 108168 137047
10806 137047 149909 135188 120129 87159 62465 43993 74281 16829 -19552 -45804 -44774 -70114
10794 -70114 -45546 -8816 19120 27112 -1985 -29427 -17246 24532 55291 104142 73698 67065
10782 67065 60907 63795 78864 99817 54150 -42848 -90743 -144938 -176962 -143629 -115974 -131181
10770 -131181 -134133 -96380 -65721 -43492 -17966 -11477 10018 15699 -12270 -18029 24668 72630
10758 72630 60551 62416 40950 15720 71039 129603 136316 114574 109207 104723 61258 46618
10746 46618 66523 104004 103892 72136 39936 68015 69400 74268 92479 84632 65522 55046 77405
10733 77405 111862 143856 162572 104214 53908 77559 131275 147562 188387 205447 247598 299487
10721 299487 332655 325750 322695 350101 289623 263323 264046 278368 288429 290940 284535 283325 284684
10708 284684 313634 385988 411863 464694 518755 552659 566634 545334 517843 477489 489420
10697 489420 522049 568901 648519 727164 849857 975661 1147856 1372373 1609913 1846425
10687 1846425 2214886 2590829 2858602 2924954 2730125 2371335 2027634 1851149 1812894 1836289
10677 1836289 1826814 1898116 2067622 2336083 2705608 3170640 3736197 4480278 5090097 5587032
10667 5587032 5877613 5958237 6049527 6319309 6903853 7700381 8777415 10229045 12319074
10658 12319074 15266179 19078630 24108998 30987483 41159596 58082431 88283347 143105769
10650 143105769 225128626 299176031 345830079 351216135 305301006 234065810 158838277
10643 158838277 105661169 74856958 56678760 45016004 36884807 30692498 25770954
10636 25770954 21814786 18677274 16296497 14484944 13010238 11794181 10718962 9873847
10628 9873847 9300765 8799253 8325859 7822986 7176826 6440787 5682341 5140477 4752133
10619 4752133 4398175 4039491 3699826 3406506 3116190 2843882 2579471 2341754 2193542
10610 2193542 2079021 1935639 1776485 1648349 1507268 1400352 1341398 1213663 1100857 1054442
10600 1054442 1028579 1031159 1015931 997253 943356 944228 940712 880356 788176 742216 680392 671657
10588 671657 705536 735752 734807 732668 652164 566052 501040 477336 473283 435540 451609 491239
10576 491239 452386 447887 430554 440332 449604 482899 513818 531190 560476 533698 470829 424509
10564 424509 386523 382264 347873 336571 325389 297825 296050 331670 339095 305654 286071 312241
10552 312241 285220 273768 235638 219226 205478 254216 311354 324795 337633 275875 261380
10541 261380 279182 339052 353329 322908 296846 310279 313550 325986 344376 358300 377327 364137
10529 364137 316244 295439 307879 324156 343966 356550 409030 455056 506112 484765 400857
10518 400857 299004 215541 171794 144478 108064 80498 61384 96263 84924 106682 100227
10507 100227 119473 152620 149715 164579 162704 153832 146362 153778 181101 177900 141258 130719 117931
10494 117931 83038 20168 13782 5543 -26786 923 64462 84159 56820 49276 43211 40657
10482 40657 61407 94665 89525 76845 21880 34898 68199 38437 27530 40215 24431 55279
10470 55279 122529 140870 105388 68233 97461 141671 181428 153630 157575 180997 166717 110041
10458 110041 98725 74861 13444 -42781 -7906 12939 -28737 -29430 -9061 25319 36983 32254
10446 32254 55040 112940 115713 127116 82287 103831 83034 24887 -23977 19539 64427 44981
10434 44981 50972 64582 28862 47085 32921 7497 8387 59783 49181 32206 30706 44477
10422 44477 77572 90266 99217 59035 35791 54203 22720 28506 79402 103156 52639 63416
10410 63416 75852 65702 52682 49295 44486 31895 72067 78860 98218 76167 72315 87785
10398 87785 69390 72325 49765 -3218 -21755 -22193 13670 36483 33768 59473 115290 119566 104298
10385 104298 82974 816 -22283 3181 23928 4975 -1669 -20497 13651 19952 9204 -18783
10373 -18783 -19728 13599 48370 79965 59021 5018 18714 47366 21169 -5016 49776 55516
10361 55516 20825 21404 60181 60519 35892 68248 61910 29702 53305 115191 84168 55452 35863
10348 35863 -19570 -47677 -58402 -37642 -30023 -17850 -16464 -35839 -35157 2358 20980 19604 -9090
10335 -9090 17967 -19140 -31312 -4671 -35204 -46433 -3987 2350 -2077 35427 62827 78734
10323 78734 48077 14960 -30108 -42308 -25252 17053 71047 98008 57563 28715 18895 2747
10311 2747 6075 51929 86165 62741 26738 28147 50740 26780 32750 30922 -16258 -37023 -44053
10298 -44053 -40634 -49514 -47351 -54069 -40858 -50331 -18462 20657 28207 27888 814 1684 23840 40070
10284 40070 65981 65589 27677 -13674 -42793 -35702 23303 56860 22800 22276 43568 67274 56911
10271 56911 53574 31799 -2010 -38825 -91735 -94365 -70177 -49039 -18291 10869 13028 22948
10259 22948 12122 -6558 3903 16932 38766 35011 22420 37889 59722 29956 -4257 -26530
10247 -26530 -24551 1196 31127 31730 15834 36662 46799 135080 211810 284422 402151 584197
10235 584197 1021680 1484578 1782106 1906793 1698054 1377114 990668 666447 465928 343536
10225 343536 314297 276940 176764 92312 100619 83808 80097 69618 68535 55683 53203 89373
10213 89373 162580 148526 74284 39150 52159 49392 60367 44815 -9861 -6671 45097 60635
10201 60635 61328 38916 57349 89198 59514 34146 -3141 36367 40294 34832 -7266 -58700
10189 -58700 -69650 -40597 7038 61771 80030 65721 89311 78063 49486 73299 120839 120328
10177 120328 89384 60367 9052 29530 18912 -6416 -15892 -1877 22489 5315 850 12175
10165 12175 9861 -3055 -41102 -65145 -33313 -32471 -9726 38991 42794 39428 47712 13240 -20870
10152 -20870 -25070 -15636 -35418 -19243 24600 44671 45370 51739 78740 97732 54391 10630 13549
10139 13549 48534 99086 129870 129957 91184 102513 129085 108004 62619 -7689 -53799 -51938
10127 -51938 2854 42351 53967 7997 355 -11524 9490 49557 42981 76897 53725 29664
10115 29664 41813 25867 -26193 -37437 -61939 -26917 2822 -11941 -24168 -16069 26100 46835
10103 46835 31880 46635 25067 2459 -3145 -15065 -24031 -60540 -102760 -93528 -33613 -42928
10091 -42928 -46108 -48138 -53689 -26840 -6916 2348 -18743 -52651 -57181 -47198 11909 20334 9139
10078 9139 6840 3535 6735 319 404 13866 7400 30916 44224 -17956 -38519 -26361 -29191 -20833
10064 -20833 10146 34530 39697 37009 9481 -20724 38584 77922 14847 -10374 10084 -17937
10052 -17937 -19072 -15986 6556 20000 23806 4308 52259 140223 202217 171217 115608 61835
10040 61835 5728 -14966 -7114 -42517 -71694 -69345 -43414 -19436 57905 120222 100663 87963
10028 87963 7054 -67777 -89448 -93061 -76108 -81468 -60409 12951 15015 44056 64615 54092
10016 54092 50600 5745 -25738 443 32021 25435 35373 64895 55150 56320 15408 18465 25412
10003 25412 15988 12535 -1023 -11134 -1488 29836 47576 47089 34603 38885 18200 -54444 -74875
9990 -74875 -11005 -17716 -63687 -40488 -18600 7176 5304 4480 -36208 -23802 -27284 -20705 -14548
9977 -14548 -38282 -53901 -65547 -33415 -5774 2163 -12455 -18199 -32659 23525 27903 47341
9965 47341 58062 48667 42404 59231 58144 95245 140578 115568 92245 54443 14762 17182 -19682
9952 -19682 -53318 -44026 14411 2928 -1040 -882 38584 26564 -14923 -6776 -15180 -26299 -23169
9939 -23169 -32062 -27177 -25786 11146 47264 1546 -48670 -64764 -63789 -28501 -39116 -36984 -34755
9926 -34755 -55608 -82117 -40837 -8489 -9701 3002 -19331 -33258 -49076 -57885 -9499 19617
9914 19617 -13422 29468 25496 -14155 24718 65213 58687 39716 43320 50121 -95 -38903 -60545
9901 -60545 -70591 -12285 5165 22401 18537 -2017 -13236 -18772 -38678 -12205 152 -8985
9889 -8985 44531 22702 28433 22824 -13783 -35198 6038 41367 54333 43962 29122 17736
9877 17736 24875 7182 1960 -5518 1128 22709 -8842 7151 -15955 -10410 -5238 -68 3077
9864 3077 4754 7283 2239 -52474 -50449 5651 64611 70511 46608 11970 26601 19217 27897
9851 27897 10135 31673 95213 117380 94684 8785 7546 65603 83499 97487 100295 49610
9839 49610 22898 34745 47356 49757 67962 94120 59738 4379 -31042 -22534 -47587 -64143
9827 -64143 -44058 -21964 -26329 -18787 4846 27359 44018 41546 3126 -36099 -51662 -99552
9815 -99552 -88537 -69325 -31901 -34386 -26529 -13671 -57229 -56213 -30895 -34326 -59733 -61761 -16317
9802 -16317 36318 74703 99468 124661 100299 54970 43321 18179 13151 -32979 -39845 22059
9790 22059 61186 59653 67387 43839 39072 -7425 -24332 -11925 218 -40813 -69451 -44935
9778 -44935 -53059 -51040 -48216 -46968 -16725 26539 9005 4864 14624 23205 -33686 -64834 -66240
9765 -66240 -30254 -1233 -73062 -85086 -69895 -59642 -36541 -2921 5883 -36263 -16703 47975
9753 47975 61253 38930 23191 23483 -14811 -49198 -46924 -92269 -119843 -119111 -115410 -99410 -66942
9740 -66942 -40954 -11975 -6120 -51913 -56177 -36611 -64141 -50735 24932 8241 -33497 -32235
9728 -32235 -17527 5560 16168 -1346 -7771 -3132 8080 -56579 -78861 -83399 -89445 -59812 -57709
9715 -57709 -53316 -35992 19064 62116 118767 146507 122692 63386 73129 55159 -6831 -39381
9703 -39381 -20209 32247 23288 -24677 -41999 -18946 -41487 -62167 -49857 -49593 -28484 -12105
9691 -12105 -19436 -38729 2889 -10123 -19783 -13130 -23782 -62247 -45745 -50992 -47844 -31108 -9616
9678 -9616 21751 28874 49555 22119 -19565 -45771 -400 12452 -8105 15652 57711 46538
9666 46538 52332 52687 36426 14705 -12747 -35374 22855 56794 16062 9720 -26013 -40827 -48121
9653 -48121 -6443 10956 -16792 -46832 -78720 -66657 -66711 -58362 -38162 -15990 -3331 -431 57017
9640 57017 59154 22209 16206 58553 64931 14733 -25292 -56045 -38538 -10306 -52584 -120403
9628 -120403 -101519 -53546 -54032 -46099 -74805 -89732 -32956 -24290 -67355 -64106 -66150 -57640 -7369
9615 -7369 6680 -47777 -25680 -11069 6288 31229 1401 -41846 -25250 -27682 -6891 22370
9603 22370 31536 61178 31393 28181 43657 27783 14770 22412 21206 -7883 -16307 16654 28722
9590 28722 23958 -9485 12639 16436 -1861 3527 1645 4397 -20689 -9754 14770 20629 -10510
9577 -10510 -8159 2356 9635 43147 25786 -4625 -17807 -13244 -32054 -41456 -34901 -14625 2602
9564 2602 28385 27793 -10894 405 -3771 -6505 -6503 -18789 -15926 -14765 -31625 -49102 -42004 -12245
9550 -12245 -1234 15004 5677 5872 -2877 47116 25092 -1267 36881 72994 77583 37588 14352
9537 14352 24081 42191 29988 -4175 -33629 -28136 -22150 -29 17781 34386 21329 33054
9525 33054 27524 3469 23329 27622 52167 7767 -21570 -5573 1896 1877 7759 -23505 -15417
9512 -15417 23280 47578 24402 39041 76427 70508 86229 66097 43255 2960 -3937 -44963
9500 -44963 -28029 -14158 -4064 -10843 -9607 -37857 -6279 -21717 -21931 -48814 -39226 -27032 -36625
9487 -36625 20538 26369 22442 15220 23961 56249 79145 76676 48537 50309 17278 41179 39743
9474 39743 32035 49252 72846 95288 60289 30763 10815 -13863 -49012 1098 32476 64955
9462 64955 36266 136 27109 17019 31233 62623 43132 6545 33594 83811 62814 4645
9450 4645 7504 4441 -11090 5653 17557 27669 46861 52799 77754 112342 119665 61009 21779
9437 21779 38735 47755 34398 8771 2991 18256 42472 29151 23653 16293 15708 617 36760
9424 36760 55059 22038 26048 43357 41048 27159 44024 43723 61338 41325 53544 59517 56158
9411 56158 55659 64800 42517 -2067 -9615 653 11409 23253 6251 -32063 -27360 -38455 -48068
9398 -48068 -41713 -28001 -15873 -30356 -57117 -54852 -51046 10317 101805 60742 54420 48793 -668
9385 -668 -483 7830 -11362 -26202 -20357 34188 47980 9453 21165 30321 11017 39555 63777
9372 63777 39864 34786 42311 38979 2401 -6397 -10423 5507 60025 122678 128562 114919 78134
9359 78134 65780 71902 92123 105164 94403 76325 66606 45484 38481 -8252 -41801 -2798
9347 -2798 33144 27159 56560 72624 68235 50961 28701 49266 56958 58422 69117 64307 9113
9334 9113 27057 53687 24987 -25906 -36096 14808 92060 59036 49747 43578 10309 -23862
9322 -23862 -5046 6184 35566 60836 57762 28707 561 -22454 -10624 32581 50995 38712
9310 38712 28153 35734 15394 47444 75710 86536 77923 81334 78447 74145 95555 117116 93989
9297 93989 40626 24657 8645 21574 41027 17937 1429 -22135 -39447 -15932 701 -8098
9285 -8098 -7718 10829 21458 15869 40957 28895 -19606 6335 65107 78248 82282 115420 97582
9272 97582 71603 20967 6708 19595 60615 103145 115740 86840 55759 53846 75815 76473
9260 76473 73639 70020 94110 90024 93725 96299 123526 119448 79361 86014 94142 108825 107093 109074
9246 109074 135738 155499 172026 136989 127967 160401 173932 159093 123827 151029 192111 181934
9234 181934 202130 219444 218346 179396 161749 188423 213167 244363 258310 255841 222104 243155
9222 243155 279035 301656 289640 290418 288035 285103 294365 279673 297770 335645 359705 386270 403677
9209 403677 405788 387897 380142 389565 383623 404458 444442 518636 537452 542510 527809 569673 620924
9196 620924 676554 706804 723831 775121 815064 936264 1032874 1130485 1203669 1296014 1392407
9185 1392407 1485605 1618749 1800106 1950265 2149280 2407108 2729532 3079112 3435506 3858792
9175 3858792 4382642 5100934 5981416 7038268 8439616 10322413 12843365 16229936 20788654
9166 20788654 26916256 34738386 43286661 50171269 52591454 49658891 42885272 34969834
9158 34969834 27849794 22154570 17871330 14629050 12149994 10231763 8743303 7552976
9150 7552976 6545612 5739077 5028759 4387895 3937235 3538676 3171761 2921761 2685481
9141 2685481 2424683 2215079 2080385 1951875 1815278 1677155 1579772 1489412 1369235 1274448
9131 1274448 1175984 1104653 1051538 983069 955224 933084 872564 825853 776452 712257 647374
9120 647374 583580 544713 563589 564904 562199 567929 566565 546885 483996 434017 421285 413570 387079
9107 387079 352542 340937 333991 296755 296682 284250 258385 243403 249450 246714 282773 328921 299780
9094 299780 278672 292223 269699 243035 226689 205011 174811 205109 202660 184689 177942 166725
9082 166725 150424 155434 153129 140931 156807 170781 174585 143603 118098 137972 123776 118988
9070 118988 123831 108172 156012 185465 176473 160487 160762 116559 97950 114982 39947 13822
9058 13822 12882 -10310 38882 97190 118528 117409 118484 122367 57495 35080 9977 -10778 -11081
9045 -11081 -15490 23415 37418 70057 79034 86271 43110 8482 34791 22484 55912 55302 82302
9032 82302 112210 100389 87084 80494 61229 61811 19979 -1666 37042 66705 57907 52415 39030
9019 39030 38161 85272 92479 81656 94526 65715 37883 6407 20863 51231 50750 22876 41926
9006 41926 70083 63126 48269 59276 92819 101237 75046 47281 8740 13860 61004 58598 29123
8993 29123 10889 -21286 -32658 3439 14031 30403 -3169 10907 16690 29507 29054 36455 35323
8980 35323 38430 29176 64615 70715 78507 62181 35439 35181 29620 -40132 -51657 -18206 27160
8967 27160 9598 11049 37610 43406 13035 26625 50727 36876 95262 170411 150563 113911
8955 113911 109149 73523 37798 4277 3537 8180 11707 29692 19729 22537 25136 16470 38937
8942 38937 42565 7406 976 13259 631 12586 14823 15238 31540 3872 8977 2484 22796
8929 22796 27446 55922 45390 31032 56862 117626 109602 83126 71897 63064 48453 50405 37694
8916 37694 44172 58503 80552 81033 79281 69146 136010 194925 205159 186602 147927 101494 62269
8903 62269 40804 29842 47439 85558 93060 101381 88456 30242 65210 89840 47572 -430
8891 -430 -16633 18074 26739 34544 19185 23618 63343 6066 -28771 -14792 -8682 4341 -14210
8878 -14210 -41249 -16121 -11885 -7936 24039 50646 68464 59781 50563 84287 123578 79783 50982
8865 50982 104491 135339 136895 92813 83355 85366 63445 22980 -31235 -32180 -15254 31310 29240
8852 29240 -5947 -9049 13450 6763 7321 38681 55703 8513 18741 57158 42453 8955 -26134
8839 -26134 -26649 -16392 19359 41752 17322 28386 5248 -50120 -33011 -3766 -20713 -42114
8827 -42114 -28594 -6938 -4779 -11985 739 -1590 -4993 -24471 -42292 -21768 -33592 -30355 -23412
8814 -23412 -9099 -21249 2656 -11475 -61006 -61130 -50826 -35442 -37594 -32210 -33773 -6573 10350
8801 10350 17712 52080 34602 52339 26755 65266 77113 76988 54760 36905 4914 -33301
8789 -33301 -55486 -37001 -64089 -71431 -60313 -29765 17718 -10565 -55036 5836 50515 58656
8777 58656 68215 38198 21096 12915 23613 14449 -21462 -14675 15031 10521 58500 36943 -403
8764 -403 -1649 -31664 -20602 5396 46953 65436 60712 64225 25110 12839 22212 2291 -14822
8751 -14822 -29113 -7652 24859 28506 26690 -4968 -26538 25700 21543 -29315 -30354 -54216 -71055
8738 -71055 -76431 -82596 -78104 -71170 6989 42428 59562 86657 67510 36949 35508 33753 32177
8725 32177 55805 48334 37989 25470 7529 -46989 -51219 -9969 638 11711 68667 72502
8713 72502 85523 24411 7542 17045 70134 107020 101251 62470 75777 77455 70347 65230 78573
8700 78573 106250 141668 97062 52979 26518 3895 -41975 -6036 2873 -31965 -47856 -18458
8688 -18458 19057 53653 56121 25630 -14828 -25234 -17541 -1524 2099 -120 -8560 -28717 -23326
8675 -23326 6830 27131 33351 49427 34338 3307 28713 27830 28182 15285 -4719 -31338 -4962
8662 -4962 -3990 9926 5653 23543 5512 -7329 54111 93702 51567 21603 -11838 -37317 -10957
8649 -10957 41519 101386 122308 65695 47369 83948 96257 89614 30750 11212 36565 53201
8637 53201 45451 21190 20926 9085 -9518 -9688 33541 45109 26037 -25942 -23851 -5507 21950
8624 21950 13291 12246 14153 17345 -17802 -4660 -12124 -17658 -5942 11658 18795 -1630 -1970 28743
8610 28743 28129 33499 83345 35017 26676 51921 36152 45227 57254 44409 40674 76179 74177
8597 74177 78160 83833 55688 55859 46571 20017 10432 14576 19690 32966 91917 86581 34539 28708
8583 28708 40486 41066 12158 2856 -41130 -17193 14639 22480 -1720 -47140 -42771 18557 41430
8570 41430 51852 57209 48065 54434 41396 -10305 3225 44445 35460 18163 43152 65364 50185
8557 50185 38802 21162 -8607 -66187 -49126 -6660 47881 106409 115346 83128 74780 24556
8545 24556 -3783 34709 48912 15537 6389 56984 61766 17033 18668 25404 38177 50471 27675
8532 27675 -25231 -14005 -25127 -15973 -33769 -15342 13450 -13358 -27635 -43453 -55757 -31226
8520 -31226 -8090 2308 -16553 14365 -30660 -32113 15778 51834 26330 26013 39341 65467
8508 65467 56913 9063 -1442 39011 40188 33049 -3214 -28744 14371 35282 18929 32544
8496 32544 46573 13876 -4137 2029 -46153 -102983 -47495 -19076 -44231 -42874 -54767 -52802
8484 -52802 -25477 -13492 4443 59485 49513 -14720 -46709 -21399 -19273 2170 -17106 -35847
8472 -35847 -20479 -25182 2795 506 -9797 -14382 -23110 30559 217 -29342 -46227 -51057 -89077
8459 -89077 -62599 -38374 -62522 -61344 -36574 4676 9839 -10895 -9792 13075 -1988 3544 23003
8446 23003 56869 66133 37395 20173 17745 40132 20978 17716 -19428 -15186 -30554 3583 -14739
8433 -14739 -1263 35957 23885 -34154 -57768 -65200 -37199 -32885 -40945 -54282 -41077 -37181 -56482
8420 -56482 -49000 -76149 -66868 -6528 -673 -39670 -28144 4043 2540 -8690 -12607 -20561 -9636
8407 -9636 42693 71313 55804 27974 -17070 -37489 -42483 -74824 -100343 -37507 15845 -10176
8395 -10176 -15237 12458 -10518 -18333 -8486 25960 20216 -21261 3939 16300 9110 12683 -15825
8382 -15825 3330 -19361 -37574 -40587 -2107 -10554 -4418 10362 43022 74422 48075 10070
8370 10070 9325 10558 1683 -31137 -17779 10456 3766 32911 74583 59281 29912 -17727 -18037
8357 -18037 -25949 -3053 -29109 -22579 16764 12956 4546 7104 -21668 -48156 -21289 -44167 -50017
8344 -50017 -25755 6705 26374 9327 -20611 -34388 23930 86918 51208 5640 2702 -4688
8332 -4688 -6900 -13745 -10473 -22993 -15075 -27978 -7489 5164 25754 13046 4568 23210 29652
8319 29652 36096 39231 30614 30352 35336 27041 3167 11937 8323 14134 -5086 -5636 -29927 -54010
8305 -54010 -39150 -10059 7129 -23573 -33457 -29731 -21133 -44086 -46375 -63259 -71547 -59622 -10821
8292 -10821 43343 -9659 -38945 -13824 -4796 -33064 -28900 -42955 19486 41482 13047 -9787
8280 -9787 3069 6824 -10254 -15322 72653 78584 53234 38877 43828 30435 23342 -8886 -10328
8267 -10328 2252 -62660 -52764 -36075 -17362 -18868 -33628 -26420 -59524 -100789 -65623 -12833
8255 -12833 8572 442 -16139 -26063 -1467 -6540 -28534 -46401 -54077 -57844 -88166 -81584 -98261
8242 -98261 -84787 -33076 -4797 -9818 18636 5410 -38920 -52487 -49693 -28567 12551 -298
8230 -298 -26129 8133 -17402 -27868 -15021 -57097 -32968 11118 3376 626 -20048 -822 29505
8217 29505 23528 -7944 -2451 -29118 -26081 4502 42358 29544 30395 40957 -16520 8067 23503
8204 23503 12659 -50310 -68512 -54725 -32030 -62554 -38229 -40284 -11872 19790 11788 35372
8192 35372 36504 -4110 -2584 -5360 8200 -14559 -18137 -5707 -3840 -23818 19672 -6324 -19530
8179 -19530 -37605 -59603 -47394 -4613 -44439 -31594 -23416 -36479 -43324 37926 67358 36900
8167 36900 -19963 -31652 -30503 -7997 -33168 -19571 11099 -12835 -22586 -40097 -24212 3980
8155 3980 -21903 -22194 -22610 -25283 -27910 -4147 12451 -14250 -8586 5930 5281 25128 27864 -29451
8141 -29451 -40651 -61003 -42777 -16854 -23032 -29804 23638 71844 90228 88481 71871 46255
8129 46255 38111 35844 30751 -3501 -31136 -73325 -133597 -105850 -49291 -29296 -36243 -38652 -55755
8116 -55755 -35802 5188 29383 27258 29577 -9939 -33358 -39385 -43387 -14771 6026 3690 -13098
8103 -13098 -38650 -21415 -7549 -6207 1810 -17476 -73721 -61164 -34591 23799 45901 12765
8091 12765 28304 30281 716 -15577 -4996 -62378 -86959 -40845 10495 1784 40409 31229
8079 31229 -16951 -1908 -5581 -50532 -49901 -10895 -30405 -61704 -52272 -38384 -48835 -60530 -64987
8066 -64987 -9178 6327 28705 14714 -6173 34732 38463 39505 56040 33330 35784 -9701
8054 -9701 -37246 -38662 -49439 -31118 20225 41477 34665 -9891 -16848 4270 13279 2576 30880
8041 30880 45727 -33459 -42166 -51418 -7122 -5148 -14261 -47916 -66654 -78777 -47070 -37924 -37118
8028 -37118 -29455 -10186 -22586 -10011 -19956 -49364 -46865 10341 68789 67160 10821 -20401 11144
8015 11144 60956 71489 45717 25954 4053 9977 20102 29425 69832 58734 15706 -235
8003 -235 6598 -1468 -3995 1531 8435 -2673 -10802 -24394 -67009 -85680 -81434 -77997 -50436 -45173
7989 -45173 -24219 17357 19458 6445 20008 29557 34707 24933 13086 -33068 -47713 -18715 -2748
7976 -2748 44812 34496 -13702 -44269 -45154 2134 -17786 -19238 -30754 -58030 -41378 -39098 -47751
7963 -47751 -70990 -66731 -37168 -13527 -160 25358 39026 36889 31515 11107 -2629 -1139 13432
7950 13432 23781 16575 -8484 -36475 5885 35703 40596 -12842 -31868 -33759 -30452 6637 35436
7937 35436 7221 -13908 -7154 6519 -59820 -86597 -54575 -64074 -63699 -85100 -71502 -52316 -48877
7924 -48877 -51488 -58026 -6427 46176 42515 36923 47476 5834 -39726 -66224 -63686 -44604 -5597
7911 -5597 -485 -22459 -14748 -31138 -22048 19210 28544 -8382 2974 37094 36450 29900 -2682
7898 -2682 -1153 34826 48571 18475 24930 44774 57249 41455 -2754 -62184 -73281 -35615
7886 -35615 30178 37687 22742 10697 12 -34450 -21531 -24242 -40900 -26304 -16336 -21494 -37999
7873 -37999 -26798 -26548 -23794 -17059 -853 6075 4196 -21117 -4694 15165 22654 11685 -1192
7860 -1192 -20692 -26028 -27338 -47905 -75816 -69279 -73932 -60066 -8983 47524 40343 18139 -3560
7847 -3560 10642 5550 24655 48453 70121 58198 21225 13250 -16159 -47537 -79690 -89715
7835 -89715 -60559 -51571 -16659 13712 70398 74425 39892 16827 8278 3405 24416 54635 27205
7822 27205 14153 11076 24879 30902 35544 47906 6614 -11692 -37895 -36921 -31935 -19678 939
7809 939 5265 -5951 -53533 -25116 27098 80095 68742 39602 59371 38687 27494 -26186
7797 -26186 -14714 -17909 -17587 588 19334 -31223 -42820 -23332 -18336 -40110 -6809 20108 12024
7784 12024 -35640 -75174 -107481 -68702 -49802 -54418 -32157 -10250 -41818 -54615 -26813 -24733
7772 -24733 -27390 -62005 -71699 -37621 -19359 -14149 11729 -707 -16919 -48636 -76949 -58011
7760 -58011 -36490 -20555 -1200 17829 37629 15877 9871 37019 54291 45776 -5758 -33390
7748 -33390 -39761 -31588 -73566 -56501 -60844 -14869 45802 48280 76738 97360 51794 21884 36853
7735 36853 12635 -17223 -43305 -67668 -67487 -65036 -29831 -49071 -25971 -33577 -36431 -15306 21737
7722 21737 -27076 -59524 -77701 -21215 -31382 -79975 -65986 -31726 -554 20629 9941 -13855
7710 -13855 -13470 -11927 -61703 -48022 -32137 -17204 -20297 -8420 29356 12212 1655 -45292 -69260
7697 -69260 -67229 -49799 -30333 -67921 -47796 16523 51684 82673 51300 755 9119 46201
7685 46201 46981 14712 42356 17703 -10811 7117 11759 -15994 -2396 -22270 -43332 -34908 11737
7672 11737 17671 26978 32153 14002 9010 43198 63864 38336 30748 30202 3751 30664 36253
7659 36253 45159 46079 41684 37568 43414 50847 60595 68669 73832 78037 59789 1217 -398 -1674
7645 -1674 -13548 -15244 -15749 8697 43294 63238 44683 52078 56969 29578 6175 -8485 14803
7632 14803 28631 54642 59194 55537 31104 44453 69145 53516 50085 67109 48232 42085 41138
7619 41138 45889 94302 78087 45708 47959 60827 94612 29977 -20620 -63222 -58691 -26246
7607 -26246 -1631 22640 18853 -41162 -40731 -56369 -76033 -100420 -72792 -17008 493 36 -4353
7594 -4353 10284 23806 19652 41272 37671 22909 45181 102145 108027 69094 25308 54849 58090
7581 58090 16900 -9195 -44415 -65136 -65447 -41860 -22586 -57055 -49756 -67463 -21801 9178
7569 9178 41173 55986 29272 6751 3865 21023 -29231 -17608 35469 4429 -3612 -32747
7557 -32747 -45164 -17659 -16558 3115 42652 45896 13895 -39919 -52088 -55813 -53789 -52653 -72985
7544 -72985 -32502 -40147 -45027 -74430 -74910 -79907 -95147 -91883 -27269 -53116 -62405 -43437 -27365
7531 -27365 -84444 -115280 -92223 -121532 -104949 -102290 -59600 -16993 -24569 -46882 -52427 -2195
7519 -2195 47373 54242 12432 -225 4471 15853 550 4273 7604 -26268 -23424 17566 47626
7506 47626 40127 60505 76161 61461 22931 -324 29353 58067 64917 79952 43276 11925
7494 11925 -7399 30426 8331 -7551 -22646 -66780 -54095 -8534 5258 -21132 3804 10477
7482 10477 -19697 -8527 -2685 -45513 -52819 -53689 -41281 -53266 -54356 -52882 -34196 -45501 -51023
7469 -51023 -42357 -45829 -49012 -44927 -55141 -30918 -41829 -42767 -25974 9667 38210 46105 9467
7456 9467 23349 19464 21315 25656 60 -33465 -18934 -12753 -26762 -38077 3991 1717 -81396
7443 -81396 -95558 -38031 -3360 -9633 -44264 -69465 -39240 -3455 -40757 -84761 -118185 -111943
7431 -111943 -64694 -56126 -52246 -33121 -31784 -20536 -15474 9583 62445 50914 40286 50886
7419 50886 34220 -7995 -26115 -38121 -6310 51650 56549 55102 55814 46208 10423 -9187 -27362
7406 -27362 -30010 14374 17309 24862 18765 13097 -21252 -61567 -61659 -39149 -31636 4904 47739 4878
7392 4878 6148 2144 -13380 4378 18143 161 -51852 -37105 -49606 -20613 47426 66838
7380 66838 53770 22571 8012 20304 39420 23269 10152 32684 28012 13640 6644 -879
7368 -879 -34656 -31030 35346 13330 -35322 -21948 -37848 -32194 -20819 -7305 -29267 -33361 -44799
7355 -44799 -61254 -65779 -21876 11722 14089 -20045 -25110 -19554 3758 35860 -6706 -92146 -93648
7342 -93648 -35759 -5489 -6871 6108 2275 38761 50101 29568 -6963 -72028 -64193 -45124
7330 -45124 -76530 -94931 -89691 -92119 -74369 -76833 -77862 -35640 9809 27385 14976 6235 28312
7317 28312 38258 17536 16808 38239 42557 93172 125296 107069 46521 31908 59936 46165 26627
7304 26627 28610 41188 1776 -32957 -49279 -50927 20423 22878 2168 -34418 -77413 -68401 -34410
7291 -34410 -15098 -9795 22728 52547 35914 -19961 -33919 -25588 -14048 -20143 -27271 429 24359
7278 24359 6286 -33139 -65451 -43830 -33668 -9148 -14085 -27599 -13793 14442 -21277 -66624
7266 -66624 -44152 -30083 -34624 25852 19518 21150 9938 -4723 -40940 -57832 -68053 -85792
7254 -85792 -85393 -66361 -75414 -30603 24524 43932 37918 33593 33749 73238 38872 -6439 10781
7241 10781 4459 -28802 -17323 10212 6815 4184 -5452 -8109 -30050 -42056 -36174 13652 14982
7228 14982 31592 10382 34877 68627 52899 47888 64177 52415 66862 82916 74674 47726
7216 47726 42452 18079 36319 24251 4454 19308 24987 17872 -17926 -23319 47665 23493 6255
7203 6255 5984 -12171 -9524 12913 15213 -33081 -25049 13900 52376 15338 -1817 -11976 21057
7190 21057 22068 22656 14186 -475 -21844 -47941 -23558 26329 59470 103176 91702 55243 -36655
7177 -36655 -69338 -58724 -90729 -78227 -46034 -57215 -23112 13519 26774 21953 3944 4247
7165 4247 35408 36737 32385 17693 41587 37818 38982 55287 38072 29101 60883 105224 66664
7152 66664 51351 44543 29198 32537 7845 22717 85459 63468 79224 56291 32221 32298 4996
7139 4996 -223 22328 30051 14748 13606 37055 31744 -5285 -14450 -3541 6627 48867 55738
7126 55738 32085 13566 15009 -2824 -16141 -5743 -12261 24093 84223 74118 50110 48192
7114 48192 55344 44336 17943 -2648 1931 15760 -27909 -62233 -74559 -45750 -16583 28936
7102 28936 58685 96938 72259 58358 38999 54014 48144 14166 -10054 1054 11539 -28442
7090 -28442 -49571 -18415 -4903 6059 20556 22764 30484 5182 -33417 -41884 -75742 -97560
7078 -97560 -65425 -40730 -68862 -76870 -60600 -74152 -41937 -52705 -45791 -40459 -26775 -18210 -3106
7065 -3106 -21564 -39479 -26326 -49452 -46386 -37026 -1092 25773 44084 34921 11588 -38035 -14456
7052 -14456 3559 -31845 -63063 -11105 15606 -20922 -19784 -9170 -2520 -569 -32828 -6816
7040 -6816 37907 103844 102546 41412 -40397 -50210 -34207 -14658 -13631 -30137 18306 36634 4200
7027 4200 22682 30580 -8591 -34357 -12661 -9236 34536 49927 -366 -45288 -31859 -61028
7015 -61028 -44581 -12394 -24621 -57659 -79880 -65469 -55957 -25331 -80935 -102115 -99151 -102435
7003 -102435 -34172 26849 44434 79462 91703 75323 21479 -4072 -48265 -27764 -3699 -12685
6991 -12685 -10897 2424 10238 -9766 6217 18384 18827 43173 46261 62292 32816 41575 927
6978 927 -44118 -23070 -15727 -11111 17080 -2477 -37000 -56150 -47402 -45128 -37437 6003 19719
6965 19719 -11507 -34333 -34133 -31570 -51204 -44920 -10973 -55269 -121643 -110472 -127401 -88513 -77434
6952 -77434 -55201 -60314 -73063 -47250 -3122 27006 1133 -22675 -69663 -57641 -22327 -19298
6940 -19298 7259 15149 -24786 -89216 -96598 -77802 -65977 -37342 -13670 -1183 37973 16330
6928 16330 5079 16975 -22525 7662 13499 36640 -48157 -94048 -60941 -25267 -30723 -69887
6916 -69887 -64487 -68059 -88981 -87691 -96596 -77475 -23801 -22453 -37048 -11635 -8464 -24644 -27588
6903 -27588 -21316 -344 3257 -55114 -61237 -19309 -27747 10130 42711 -268 -4677 -10129 -36409
6890 -36409 -37772 -21136 35083 28982 6485 -14037 -54868 -104488 -94847 -51933 -51552 -47809 -48493
6877 -48493 -32750 22587 21503 -10313 -40871 -76311 -38435 -22905 -1231 1926 -12317 -37584
6865 -37584 -66841 -28062 -15972 -17398 -29100 2518 13666 -15995 -47827 -16490 -16422 -5206 14794
6852 14794 69185 71029 20284 -33533 -13329 37945 26017 -16429 -45932 -28358 35167 78341
6840 78341 71867 42341 -11452 -35103 6717 -17576 -33043 -792 15997 9447 -28073 -4780
6828 -4780 -2568 -52398 -18879 8093 26414 8388 17235 9824 5863 -11634 7439 16376 44591
6815 44591 47398 34959 27917 26208 16571 11283 26819 52966 91001 75606 23954 -969 -27801
6802 -27801 2229 56675 82927 55736 55934 18210 -23377 -36619 -30847 -23209 -3183 -13506 -43736
6789 -43736 -46701 -17411 -7287 -13356 -20858 -16446 -17910 3649 -22167 -10443 39917 25660 27330
6776 27330 38696 79419 70251 46237 73183 58758 19431 -111 6280 9945 10536 36595 75251
6763 75251 44216 45669 35373 -15484 -8870 4175 -29484 -18782 -5090 -13398 -37574 -41781 -46962
6750 -46962 -54218 -63281 -31609 -9923 -6504 -8228 -9869 -27080 17659 19748 15275 19168 -20171
6737 -20171 3787 1948 -27733 -13677 2761 11083 32764 25026 25093 53724 120784 126727 108468
6724 108468 60440 59563 24265 25592 68991 108713 106870 83931 107916 119901 178124 194794
6712 194794 184698 164736 125094 64363 -1128 -7141 -29752 -58014 -21741 -4499 39322 57030
6700 57030 38048 19456 18325 32967 27887 30962 26963 10349 37234 36386 26017 -5752 2927
6687 2927 3033 -26184 -34484 -23841 1974 35303 41444 23950 13738 -48347 -21722 -26188 -9945
6674 -9945 7167 17755 -14805 -73375 -47317 -40171 -49985 -30936 -21075 9470 -15 12074 -6163
6661 -6163 -14432 -11170 -42084 -31662 -29839 -56473 -59213 -26766 -59801 -56922 -30803 -63266 -82035
6648 -82035 -72412 -54900 -26522 -45950 -48859 -20264 51174 74385 44538 2811 -7993 -21347
6636 -21347 -53332 -66589 -56669 -38273 -7474 -7994 -599 -67926 -91721 -77595 -47863 -17896 11720
6623 11720 43607 22926 33209 48125 -15644 -32207 -41326 -70831 -72543 -50298 -51135 -89553 -82460
6610 -82460 -35109 -13694 -14718 -42890 -9170 10116 1302 18616 7536 -14742 -35212 -37576
6598 -37576 12106 -16392 -64214 -46617 -1222 -16868 -51825 -50277 -8178 9157 -10271 -24964
6586 -24964 -19569 -18421 -31321 -14043 -976 -2014 22351 58228 34287 17270 1017 18120
6574 18120 27281 21997 41149 41780 49835 76881 86970 46028 17463 13057 14916 24005 60530
6561 60530 59021 28716 -9575 4421 36374 35383 42144 47063 45155 15935 47084 65131 36366
6548 36366 49140 96927 89871 57128 1129 10174 12679 31730 62914 43151 -17233 -14662 -31382
6535 -31382 -29434 698 -29625 -52149 -78251 -33623 9375 -11358 -27749 -80350 -73181 -69343
6523 -69343 -133098 -159022 -140627 -76463 -58482 -50018 3115 25759 -12384 -51711 -47088 34714
6511 34714 67329 69371 66687 38385 19093 833 -26327 -35351 -36843 -43603 -72614 -98998 -84323
6498 -84323 -37223 16660 72176 65785 14657 1219 27243 40721 79386 70322 35178 59176
6486 59176 62330 54868 62448 34995 732 -27777 -25051 -24928 -41407 -47607 -24778 11327 2327
6473 2327 -53195 -68918 -54307 -31695 -14009 -8128 -23280 -24277 11008 19850 16770 26407 -24310
6460 -24310 -19394 -7597 -32535 -29222 4621 14815 64773 70496 32930 21075 23215 -6517 -35919
6447 -35919 -52961 -7 8816 2143 22582 70593 59934 8685 27634 42492 40911 36239 38975
6434 38975 -9370 -37889 -2543 77274 73581 29225 11434 -5888 11725 33324 -2732 -30844
6422 -30844 -49434 -55547 -81186 -80683 -33462 22183 -7308 -21178 3185 26423 19467 43941 22291
6409 22291 -11065 -22996 -34027 -28085 -37294 -72949 -65230 -6842 12368 29946 27204 -4141 -31053
6396 -31053 -55114 -42866 -27840 24417 33269 36305 51484 -173 29637 12428 -9256 -14562
6384 -14562 -19652 -18825 -9257 -198 -14874 -33490 -42361 -55933 -55350 -80776 -98124 -116932 -87526
6371 -87526 -52752 -25305 3849 -12343 -25164 -52518 -31896 23154 23060 31557 -398 -821 -9850
6358 -9850 3157 -23549 -30667 -34878 -57301 -66149 -26183 -19589 -29389 18985 72516 46046 -22602
6345 -22602 -52071 -13229 -1483 27603 30524 23439 7386 -8227 -24994 5919 16828 48682
6333 48682 49727 58457 46070 21298 21845 21514 -24700 -28642 -51239 -95313 -89423 -14714 -31948
6320 -31948 -33882 -28737 -19273 16876 44945 21462 -11239 -40508 -48673 -63416 -63243 -32274 -37433
6307 -37433 -18611 -62805 -58172 -33245 -30908 -40907 -54828 -73334 -91253 -63954 -54682 -28108 -33554
6294 -33554 -42503 -62001 -55439 -47815 -28420 1768 -6318 20261 20797 -23433 -71087 -31249 -15118
6281 -15118 17204 -12012 -72522 -76189 -39150 1274 -2920 -45372 -80806 -92611 -73051 -49505
6269 -49505 -54748 -31163 -9826 5433 -20255 -25235 -24658 -19658 22016 24529 -18227 -21741 -45510
6256 -45510 -18887 -53087 -14723 21352 -20701 -45723 -14199 -27693 -18585 12500 35989 53976
6244 53976 75900 62945 29444 1913 3253 -10909 15824 -10015 15418 46568 18975 12873
6232 12873 -10689 25232 80166 71452 62580 36569 34147 62478 41594 276 5676 -27651 -117756
6219 -117756 -122944 -103535 -102343 -75807 -52996 4989 13609 52846 22020 -2328 -55110 -119547
6207 -119547 -80273 -36367 -31465 1972 10003 -13779 -61742 -53510 -32583 -3228 -20851 -53390
6195 -53390 -29714 -6468 24319 43762 2926 -15820 -31931 -45706 -12662 -42340 462 37879
6183 37879 17872 -33668 -6534 14281 -40829 -50111 -43340 10301 7244 2266 494 -1211 16593
6170 16593 5992 44 -7138 13281 10014 17260 37785 96905 89998 97154 66192 31886 -6131
6157 -6131 -32942 1861 32167 -3480 -59319 -83745 -93736 -83706 -49825 -11858 -1228 -22624
6145 -22624 -18824 -19792 -1890 39422 57610 29314 26332 15403 18955 -4920 -16670 8706 24519
6132 24519 43737 6855 -19266 -53538 -55777 -75852 -81195 -55348 -45222 -11990 -12245 -26196 -21334
6119 -21334 25553 40136 31890 -11124 -29814 -8513 348 22202 57951 53710 62212 58063 25252
6106 25252 24031 47090 35000 -14431 -22518 -45138 7714 41144 26542 -22784 -18099 -3984
6094 -3984 19148 50841 22956 -18072 778 18834 23769 23958 47735 3131 -50384 -49052 -3131
6081 -3131 -10219 11716 38168 69553 12910 -12495 -17754 -24215 -663 10242 -23026 -11762 16472
6068 16472 56534 21078 10297 18021 30354 -4855 -3146 10732 37250 34094 11123 33372
6056 33372 56757 42703 13146 -5886 -22359 -32248 -38530 -37317 -24308 -15754 -3106 -5414 -11473
6043 -11473 28189 85762 108718 65248 44768 53129 70343 81274 27952 21173 18608 22304 18544
6030 18544 31181 52277 54197 42840 27324 29037 35998 28022 -14035 -71704 -79483 -54135 -37652
6017 -37652 -13136 -14775 -19390 -13621 -3465 6146 31291 80846 87562 92401 68794 35658 -35940
6004 -35940 -48960 -839 12038 35652 18725 -1052 17275 65539 36290 29590 -6900 -7852
5992 -7852 -4760 -8153 41149 37014 -7368 -33029 -25730 -13757 13077 37766 -27678 -76575 -107530
5979 -107530 -77863 -56833 -41520 -23741 -38296 -56432 -68164 -28452 -41692 -66902 -91407 -88972
5967 -88972 -55102 -46851 -72301 -36230 -16031 5102 37744 42862 24923 -15940 33482 58624
5955 58624 72267 18484 -4887 25054 33621 42963 49392 22272 43655 60695 43162 9269
5943 9269 -34288 -44406 -34500 -18907 7650 54912 64460 78385 75666 46149 33230 28967 19435
5930 19435 21434 47693 42223 22474 21911 42855 3960 -40306 -29404 -39993 -20167 6258 -23214
5917 -23214 -51229 -15455 23862 -13840 -21623 5012 20826 11509 -1376 17716 23131 33508
5905 33508 7333 2557 -8346 13805 29942 54457 60656 44805 46291 68928 23617 9378
5893 9378 -13636 -12166 -1293 17456 23330 2821 -2548 -2224 16371 18997 -27341 -40989 -38690
5880 -38690 -23537 -9118 13138 -29062 -79095 -109694 -116873 -78838 -68574 -48228 -63039 -95079
5868 -95079 -95891 -58136 -18661 847 27962 7130 -26230 -11127 -21662 -32392 -31081 -43887
5856 -43887 -32790 -46 13935 21823 -18563 -21149 -17280 -5074 -39657 -44987 -19728 37364 58165
5843 58165 74201 89174 48351 32862 -2231 19638 18073 -12002 -41614 -21944 5063 9194
5831 9194 3335 52263 49299 13898 -3172 -30401 -49499 -79444 -66222 -34697 18598 40876
5819 40876 37743 50916 35947 16230 31348 35399 37300 11846 32137 40473 33710 55465 86094
5806 86094 91175 97904 109738 78508 55718 21934 5691 6899 48034 60923 7272 -33983
5794 -33983 -34058 -1509 8262 11497 54266 24778 -13925 -42352 -46412 -30730 -7712 -17860 -41145
5781 -41145 -35674 19431 17938 21773 10913 22814 23342 11701 -19714 -21059 31514 1402 2891
5768 2891 23729 39539 102933 58675 44381 32467 23039 -10360 -8190 13818 9568 -13614 2189
5755 2189 9801 22913 -561 -22341 -31076 -22887 -26203 -25657 -19005 -26823 -1566 -14048 -38485 -43559
5741 -43559 -37403 -34002 -74831 -57923 -40409 -13723 -19479 -25189 -44061 -57176 -28606 -5650 -26717
5728 -26717 -32479 -22276 -11032 -7883 15789 35981 24724 2480 30737 5090 -35785 -41335
5716 -41335 -56730 -65817 -25140 -20526 29440 77535 27283 -42258 -36938 20447 54843 62962 114444
5703 114444 123036 102404 42311 -30080 -37006 -11911 1409 5200 -4967 -12408 -11600 24445 1284
5690 1284 -20627 1707 -22418 -31997 9006 43555 34154 58793 -4914 -18462 -7570 -66895
5678 -66895 -123586 -103819 -46306 28341 5621 -31148 -44192 -21681 -23704 -26734 -11825 -24176
5666 -24176 -56896 -43890 -26192 17237 2060 22723 -1245 -8647 25703 6704 17866 35463
5654 35463 -30127 -51511 -36502 13001 68555 58613 17208 5894 15997 6660 -46588 -35961
5642 -35961 -61825 -76499 -83462 -43107 -33121 -9385 42735 56181 144 -17131 -4274 -878
5630 -878 -27679 -47880 -88105 -53049 -10147 1971 23614 24667 10530 13041 43509 60194 30810
5617 30810 -10309 -3027 7297 26707 4813 -15151 -25711 -50648 -22729 -14483 -27800 -43250
5605 -43250 -28474 -28755 14217 6756 -16565 13528 20787 46058 78504 62181 59069 34064 12436
5592 12436 33600 60533 15914 17891 17707 -28721 -71520 -50581 -19136 -48638 -63976 9394
5580 9394 19882 -468 -63695 -85089 -109653 -110444 -81835 -79438 -54337 -39708 -40417 -38781 15719
5567 15719 39965 -2288 -52109 -78215 -33944 6948 12360 -51460 -27165 11410 37707 45024
5555 45024 32072 12531 6549 22969 13731 -20 -22251 -25425 -10375 -37186 -18617 24816
5543 24816 20885 35423 20657 -5956 -13762 -5753 -39881 -38239 -36081 -22651 -46970 -44088 -14824
5530 -14824 -40714 -45763 -40433 -50769 -18691 -21664 -37841 -81607 -89420 -37501 -3168 -28931 -45601
5517 -45601 -62834 -65582 -63478 -60395 -20184 34664 42456 11544 -21205 -42589 18358 29534 -30264
5504 -30264 -57604 -39764 -30929 -24115 14788 40235 62397 51607 25879 -43069 -48852 -17823
5492 -17823 849 6552 7194 27326 23256 -16235 -59226 -59462 -30314 -17033 -25441 -46883 -40613
5479 -40613 -55290 -42679 -15506 -7171 -27838 -58754 -41207 -13787 -44026 -58492 -32004 -21326
5467 -21326 10440 46510 30624 6087 51422 71154 83765 32447 -23380 -24555 14497 16838
5455 16838 12335 -44497 -86025 -23825 -34662 -63627 -61116 -60688 -91294 -125721 -84639 -17048 -10907
5442 -10907 -37702 -31650 -18157 -39743 -32361 -3969 -834 2103 5483 -10455 -72676 -121221 -67776
5429 -67776 -25831 -55790 -70749 -34587 -33289 -31338 -1580 15543 -14516 -17333 -28167 -35248 -27634
5416 -27634 33391 85770 38574 3063 26000 12720 -14862 -14242 4996 -1425 30293 27628 12146
5403 12146 -13545 17949 7871 32757 58064 81474 46115 -4282 -43676 -61684 -31480 -38713
5391 -38713 -68153 -4021 35846 -19632 -75347 -13420 -11087 -19526 -11699 -25439 -6122 6810
5379 6810 23675 9861 -20429 -18994 -33918 -32440 -27548 -15653 -19161 -12095 -15670 -33310 -14453
5366 -14453 8125 797 -30001 -27765 -32357 -15800 22764 41870 51560 36532 -5254 -6085 9146
5353 9146 17996 -28422 -81963 -92144 -23197 17223 44540 48232 15117 56691 100832 49534
5341 49534 33160 87754 90059 43287 65149 60325 62024 70324 59807 30401 -1980 -27489 -43960
5328 -43960 -61481 -73125 -12606 -10417 2894 26138 41363 54155 36691 27941 54468 69318
5316 69318 35720 17308 28729 -4211 -12651 -3827 -13408 -12091 3852 -10974 -17875 -31801 -50956
5303 -50956 -3964 11492 23218 4015 5979 -18553 -46138 -26326 -3190 17238 23907 31548
5291 31548 41308 33762 -3047 12417 51565 49758 67095 60615 51118 31164 12458 -23889 -39159
5278 -39159 -41183 -13465 10822 -23303 -72725 -49518 -9087 37056 61817 -10366 -75583 -69188
5266 -69188 -35853 -1203 26151 13839 -1768 31490 33512 82263 108921 80727 64484 34434
5254 34434 -20411 -26246 -19839 -16572 4268 -5785 -34926 3325 33500 33807 31001 13445 4524
5241 4524 22723 36834 18377 -5184 -11857 24598 80329 55984 21270 9029 29987 -32969
5229 -32969 -81356 -45464 -30943 -23020 -17414 -22505 -48685 -64495 -46626 -59198 -75759 -31017
5217 -31017 -16330 -11427 -22614 -6989 -11618 -40197 -29587 32155 35372 -8295 26513 92037
5205 92037 71594 33789 37074 -22408 -67433 -28977 19330 69038 48983 1188 -21917 -21630
5193 -21630 -8590 11402 25795 2354 5589 22000 29493 16448 26031 -182 -51006 -63495
5181 -63495 -78431 -53226 -58902 -48530 -29032 -9987 28341 41950 39476 57781 31126 3311
5169 3311 8497 -3118 -45992 -35949 -32335 -3317 -13163 26534 63676 54704 57484 32912 -22138
5156 -22138 -54874 -78998 -53469 -53703 -79250 -72849 -27228 -14610 -5685 -31716 -52473 -38349 -35299
5143 -35299 -30789 -53839 -42932 -39413 -10528 -23421 -31395 -946 2115 -39505 -36387 -30115 -2001
5130 -2001 277 -14527 -45624 -56204 -42090 -44940 -40603 -32663 5589 -693 -428 -15835 -19229 -35396
5116 -35396 -26923 -16529 32853 11744 -7634 8250 26092 17442 18022 22628 26856 -17468 8997
5103 8997 83656 50755 35628 74285 65295 78210 70128 79952 43764 13276 19378 50760 26190
5090 26190 28592 37945 74251 89976 88657 44711 59975 69929 24384 45713 32222 -7669 -22324
5077 -22324 -8713 -11945 -21291 8391 21384 28182 14442 12260 45970 74878 54310 35370 -8717
5064 -8717 4292 11501 -38077 -64662 -58182 -56097 -64487 -61111 -62330 -54983 -62159 -42011 -40600 -50281
5050 -50281 -60774 -73065 -45006 -25809 -25545 -57464 -54764 -78557 -66180 -36462 -50005 -60531
5038 -60531 -70418 -45416 19734 76011 59262 68593 77680 76044 46114 11773 -40115 -53337 -47964
5025 -47964 -34177 -53617 -21839 6601 -6561 -40531 -31733 -3640 23857 12374 -23580 5502
5013 5502 38999 17937 -23313 25668 -461 -34038 -40982 -45126 -52844 -73976 -95169 -56961 -18336
5000 -18336 -11532 -11795 8747 35873 32722 -15491 -38109 -67448 -38945 5988 -29424 -22039 3069
4987 3069 15394 -21240 -25969 -35254 -58124 -79956 -78844 -30399 23348 19273 -3293 -25004 -20666
4974 -20666 -16615 -19554 4498 37406 61106 54186 16285 -20999 -25150 10946 49562 36604 20818
4961 20818 -22765 -76708 -61143 13154 27837 11771 8945 40885 4100 -2504 17961 -3893
4949 -3893 -5672 -22615 -42033 -63179 3381 46683 -4298 -13007 -645 -9073 25200 46560 37792
4936 37792 46016 41356 4041 -11001 -26797 -2175 30763 -3513 39620 54345 39526 22242
4924 22242 21982 48637 64974 47299 53415 29880 55325 89870 23098 11480 4019 -19169 -21003
4911 -21003 -15413 -6641 45713 28981 -391 -23324 -63724 -58395 -68443 -87153 -89616 -72593 -16780
4898 -16780 2019 -32673 7313 57414 11485 19013 33596 5410 1155 -20009 -36346 -25878
4886 -25878 -16568 10961 -2835 -36539 -41569 -28094 12171 14414 17748 28280 7965 -30058 -46627
4873 -46627 -48232 -54085 -35639 12578 37454 15337 30384 25651 39083 62317 61740 -11490 -69221
4860 -69221 -33492 -5945 8127 -2060 -5585 33164 43562 44050 61081 71521 40697 35852 29924
4847 29924 8429 7371 -58930 -59657 -7032 27316 -4623 -20429 -2259 38570 50762 12482
4835 12482 -6718 -15175 22327 13580 9695 33 -18967 15458 -12275 -43982 -14841 288 3325
4822 3325 -41846 -34215 -12977 -32892 -30790 -46892 -41740 -38831 -26025 -14941 -36259 -360 -4416
4809 -4416 -30830 -25905 7090 44338 42976 59416 56914 64148 15444 -51740 -43200 -57702 -69418
4796 -69418 -40094 -13307 6681 42031 58301 18313 10956 44491 45092 68972 64924 12769 -22427
4783 -22427 11161 38329 14254 -62587 -62936 -55381 -52986 -54227 -37753 -4436 17038 -8537 58676
4770 58676 106448 73405 8729 5097 26684 15681 20321 2959 -40101 -21428 -28370 20257
4758 20257 60915 72294 60114 40465 5211 -46697 -82998 -50006 -64092 -104547 -125746 -129919
4746 -129919 -79420 -34677 -5107 17507 26264 38434 36634 15513 -12218 -18035 19108 41924
4734 41924 25064 -5925 -16916 4905 34237 4941 -16506 -228 -32861 -24224 -44345 -46562
4722 -46562 -40694 -35953 -20305 797 -14289 -49143 -800 50358 27361 17585 13533 25613 8320
4709 8320 -38398 -22003 -21619 -15582 41093 19770 -7244 -56193 -90362 -64671 -3086 -8755 -2565
4696 -2565 -32222 9740 52842 107536 109582 88859 37011 39896 46937 39013 29013 6929 -5970
4683 -5970 8620 3206 14378 23351 9884 -2769 -7426 -23263 -66854 -90650 -55174 10352 28878
4670 28878 6591 -9648 7797 -10828 11553 60312 43777 47739 17041 -23669 -34459 -43086
4658 -43086 -33350 -19437 33024 48665 10259 -4632 -8397 -1480 -6013 2841 -22478 33399 60741
4645 60741 48761 40455 12045 5229 12222 15512 39686 42565 -250 6578 37994 -3098 -7279
4632 -7279 -47845 -59662 -61824 -43539 -13570 -12460 -4879 13176 27765 42999 14809 -10345 -37127
4619 -37127 -104196 -100615 -107737 -51442 -41367 -46606 18516 46193 42360 47715 -5143 -31296 -30153
4606 -30153 7268 29275 61089 31107 13729 -6762 -1024 -26660 -53409 -39662 -31502 5188
4594 5188 28370 12179 16237 20532 -6014 -9507 -20207 628 46874 34340 4354 19729 52910
4581 52910 25284 -22479 -16604 -9511 1021 10182 -4709 1291 -21544 -58155 -64735 -31065 -37230
4568 -37230 -13708 1560 3412 13318 9002 1431 -32600 -44292 15904 63267 49798 -4325 -2785
4555 -2785 3634 4993 -312 20792 7233 6030 4576 -2540 -29317 -38923 -2362 5974 3160 -20077
4541 -20077 -30259 -48611 -56975 -34745 -34736 -9488 -4268 10017 9606 -26274 -21327 18373 12051 27552
4527 27552 28704 11390 -14669 2261 -17965 -38116 -27479 -29383 -18012 -6699 -22052 -28501
4515 -28501 -29986 -17722 -7340 3130 19962 -11129 -28851 -14548 39705 51600 67493 75447
4503 75447 39386 15710 31692 16294 -12799 -10075 -16680 -69109 -96416 -83849 -46085 6832
4491 6832 4263 42593 83680 116127 61823 16398 5046 14027 12507 13869 16913 -30142 -38916
4478 -38916 -51302 -14490 50828 29629 -3479 18401 36109 34154 30297 14804 -2259 2694
4466 2694 8814 -18661 -26281 -17236 4582 70859 95253 92508 66935 32781 29763 67594 53115
4453 53115 53773 27791 -24373 -44458 -34467 21606 43678 29812 15645 -1524 -13987 35789
4441 35789 57033 42554 24782 -14977 -14820 4712 -52329 -97729 -81790 -56541 -37043 -9040
4429 -9040 -3795 -52993 -53748 -50426 -25117 -22369 17323 86598 109560 27338 18460 1780 9157
4416 9157 51555 30755 -12263 -29015 -34324 -17571 -7111 -20550 16507 30052 3674 -19827
4404 -19827 -7303 27530 42195 16853 999 -15138 -29822 -83944 -99853 -51405 5583 16737
4392 16737 26975 40186 40345 29016 24089 -5656 -41382 -34989 15505 39949 32875 18808 -7462
4379 -7462 -26898 -49169 -36777 26723 39133 18384 -27254 -30942 37907 57901 68556 66981
4367 66981 31352 -7682 -44202 -58179 -45687 -36880 -43902 -37022 -32478 -55050 -77090 -69821 -38145
4354 -38145 -21637 -41236 -58013 -22825 15322 18883 33677 62704 81118 15757 -38679 -71926
4342 -71926 -2856 11553 -21527 -64863 -62171 -8051 -1214 15869 33807 11079 -7169 -8146 -1409
4329 -1409 43084 49764 25735 12948 7661 -25000 -7343 31596 38353 6361 -31735 -34763 -8276
4316 -8276 6022 -1182 1175 -7732 -27721 -19173 -1595 16297 -29213 -811 27821 -19430 -20601
4303 -20601 -11214 -30082 -45895 -20794 -5355 16660 411 -46276 -46651 -71992 -59723 -69607 -87874
4290 -87874 -52132 -41130 -44624 -28515 -9366 -22525 -27249 -35412 -87003 -101585 -65202 -2284
4278 -2284 22947 25161 21461 -22648 -36924 -43667 -19477 -37717 -34646 1476 21288 28976 67166
4265 67166 80064 127912 126545 93914 48868 27419 -17477 -55946 -26506 -12395 -62511 -69112
4253 -69112 -63037 -85155 -79292 -70498 -2776 49092 37500 37202 16464 -6245 -35605 -37214 -11513
4240 -11513 -4193 -27083 -9417 -29257 -30724 -36116 -28671 -10578 -9265 3856 35719 73543 104291
4227 104291 70700 42084 10580 -5693 14683 28265 17787 8979 45953 14468 1896 1495
4215 1495 45530 48157 35266 34044 50026 59957 65175 42718 50260 63872 46850 93202 73503
4202 73503 37504 15506 19606 26313 6571 17381 12329 6902 -13753 3445 19497 28457 31905
4189 31905 61878 102810 102834 72923 29710 44888 53003 64092 75557 79637 97653 60806 5143
4176 5143 8446 -4347 -10804 34685 49208 29436 58242 88183 34033 -31370 -69194 -40252
4164 -40252 -34155 -15372 -14544 -28010 -26557 10324 40931 35976 31666 41705 26127 -32714 -12132
4151 -12132 19025 42300 49103 62818 30937 4507 14393 31277 50758 67998 59966 53230 94423
4138 94423 85569 67823 75091 67599 44228 -134 6260 7516 21488 511 -40882 -67925 -80087
4125 -80087 -85925 -69952 -68830 -68096 -43094 -19139 -26121 -29057 -4522 15789 20002 -18843 -64060
4112 -64060 -109141 -62778 -875 -19438 -31936 18713 5873 -16238 -32914 -27809 -23398 -9826
4100 -9826 -12911 -8157 9214 -10394 -18278 -55885 -63943 -15580 27634 50984 31144 39172 16467
4087 16467 31491 47543 21192 39964 -2661 -36046 -399 -6325 -7218 5883 -24026 -45441
4075 -45441 5547 21923 -19628 -27616 -53870 -75978 -36652 -9199 -24546 -66802 -52125 -7031
4063 -7031 17971 60484 36566 37310 5403 -22635 -9070 -15202 -15532 -47605 -41025 -13583 -25278
4050 -25278 -43877 -35799 -19056 -44862 -12885 458 -73 -18565 -32297 26474 17481 -2990 24532
4037 24532 14783 9910 12664 -40166 -55734 -23460 -20857 2778 16746 6017 -25334 -36087 -44808
4024 -44808 -45706 -7811 24298 48534 26375 -38881 -71693 -15730 17389 19567 15885 -2174 43892
4011 43892 63708 50364 -14644 -39420 3447 331 -11229 10462 -46916 -22226 61605 45354
3999 45354 -26890 -51428 -66861 -58633 -8330 21517 44977 25090 -9712 -38418 -37549 -11215
3987 -11215 -23515 -38214 -55522 -67060 -19079 28219 44395 19492 6384 25436 627 -20662
3975 -20662 -25428 -37748 -51113 -74421 -75588 -62131 -34575 -26949 -24495 7175 -7792 -6985 11546
3962 11546 46549 34591 18157 5042 -17133 -39133 -63517 -69910 -64181 -58191 -3079 68790
3950 68790 56182 35886 33238 34152 -14742 -46528 -75498 -9062 54415 55646 8207 12226 7466
3937 7466 22948 56290 82306 90426 58932 -2018 -45970 -59122 -48177 47512 136483 104853
3925 104853 42960 46530 44021 12288 6905 43668 45805 33105 -2036 -24521 -4862 -13966 -27352
3912 -27352 -4413 -38158 -70013 -85366 -83008 -95746 -89923 -53495 -20658 -2587 3465 -32604
3900 -32604 -32410 -16117 21387 -29223 -69940 -90017 -81899 -44956 -53525 18096 34330 -10678 -33861
3887 -33861 -41276 -10043 22861 1907 -29536 -16881 -14327 -4176 39405 61096 26274 12264
3875 12264 -4749 -15254 22826 64163 11363 -4478 28502 10596 -14145 -10414 -23764 -59055
3863 -59055 -95564 -102059 -74861 -39425 -27660 5705 22598 -9634 -35418 -35579 -4873 -4623 -29412
3850 -29412 -41129 -33987 -102067 -107602 -81906 -35194 -36675 -41658 -33380 -3783 1984 -27737 -53866
3837 -53866 -62743 -28976 -15832 16207 30825 35995 47019 66713 64382 27423 -25969 -43109
3825 -43109 -27815 -13764 -13923 -16665 26911 22622 9201 -27698 -24903 -40247 -51249 5291 51907
3812 51907 11737 -1870 -2734 -17834 -31368 -25347 -18445 -48090 -28435 -10829 -8495 15208 31260
3799 31260 28555 15220 -7886 -7004 -50688 -103791 -81366 -66420 -90033 -57723 -34247 -31148 11051
3786 11051 33587 27564 -6727 -26513 -12982 12593 44070 13011 -47662 -52080 19971 41565
3774 41565 11728 11297 -8253 -27060 -21287 -23554 -29391 -30971 1806 -969 -64025 -64496 -63988 -28960
3760 -28960 8153 31655 34505 56898 73201 -12683 -24313 -20603 -11200 -4525 -22097 -1793 21029
3747 21029 16572 18926 4976 -15056 -4593 -3135 -38044 -57463 -41655 -4515 21426 32812
3735 32812 5928 -11372 -20581 -4113 -18399 -46561 -18600 -3502 -29436 1633 33547 21313
3723 21313 29611 29497 31291 34633 35239 55169 36598 42305 47330 16188 -53474 -91027 -94148 -90831
3709 -90831 -54882 -51673 2913 19471 -18552 -54437 -61372 -14418 -12935 19275 -9648 -25422
3697 -25422 -22634 10790 12863 20960 33595 63915 77509 45369 55274 62511 92364 74877 47806
3684 47806 68282 105409 145468 132447 81070 5519 -18503 -57080 -73681 370 26155 37724
3672 37724 50443 17557 -9464 32808 47567 35430 23437 20777 6823 1635 1339 14250 10496
3659 10496 -28748 9956 7848 -3352 36860 45421 -27530 -29796 -10631 -8188 -5234 -15549 -35098
3646 -35098 -64599 -32553 -9807 -591 19710 36242 25913 -32445 -32068 -4759 -24976 -29691 19334
3633 19334 50901 10187 -3460 -24793 -19842 -9843 -8722 -9323 15643 51433 93342 79887 28356
3620 28356 43207 61212 67188 42236 -11710 -3155 37807 50765 24838 -31138 23206 64545
3608 64545 69707 48422 32246 61322 45597 11438 6830 -19051 -62466 -80593 -46691 -62775
3596 -62775 -27523 -5152 -22222 -22171 15945 81967 83323 81677 60038 45141 23571 1959 26579
3583 26579 58488 4467 -53104 -44785 -50349 -549 30051 19962 34452 47511 68460 45243
3571 45243 42543 14387 -18447 -52970 -54167 -23031 10644 39594 20279 21845 29371 26638 10238
3558 10238 23042 54070 70937 30391 -40920 -33823 -19256 8257 21997 21350 50198 52207 -1384
3545 -1384 -3103 11122 25198 -19210 -14695 31050 35714 2384 2918 46089 23805 48095 46171
3532 46171 22054 32546 36911 9180 -15180 -21198 -44042 -59545 -50734 -52409 2519 18775 1435
3519 1435 -7444 31801 34358 2009 43153 46421 -1282 -84975 -68898 -40401 -27873 -31385 -13033
3506 -13033 8927 -13665 -30338 15272 72518 62537 23380 -10465 -5059 -14752 -4675 -22739
3494 -22739 -34579 -8569 -12268 -30287 -52684 -28729 -10752 -44068 -31678 -9591 -6526 577
3482 577 13060 24110 15743 -1910 -14856 16423 4149 28368 48724 -5525 -25220 -33448 -48461
3469 -48461 -27363 18823 20409 27986 33382 24708 35474 27793 74565 71855 27312 28742 34063
3456 34063 -2272 -4571 31035 61927 54574 52659 -18612 -17948 20898 2097 -12851 7324 23213
3443 23213 42822 20613 44422 30022 -29359 -41290 -9678 -23644 -31661 -18042 -7427 31354
3431 31354 12209 29483 27287 10017 -1913 -8620 -24430 -37132 -19259 3938 13224 -33089
3419 -33089 -50880 -42112 -35818 -22642 3751 28120 20602 36983 35074 23632 -3663 5090 -1263
3406 -1263 -1915 7910 21415 6929 10117 15926 -21427 -47921 -26873 -19762 -40257 -94963 -89056
3393 -89056 -80462 -20337 -2612 11098 54664 31680 30882 -5186 -46518 -43883 -46024 -84603 -80552
3380 -80552 -58025 -30056 -15093 21193 11829 20889 16889 1883 -27347 7194 102969 136493
3368 136493 63354 33221 31585 6203 -16823 27992 46939 20987 -17865 -17153 -18156 -18518 -51219
3355 -51219 -85223 -65105 -64694 -84797 -119382 -104442 -57548 -6442 45551 23605 -18227 39041
3343 39041 101240 120201 100608 63828 23332 51935 55855 27097 45352 75759 93158 69841
3331 69841 17681 10611 24959 33293 5129 39548 68952 52208 51353 29920 27743 4399 -20593
3318 -20593 -14175 -9895 -25868 -26776 313 -5944 -15558 -6875 7947 -6171 -16338 12149 -1681
3305 -1681 25533 47199 107077 123141 31837 -13121 -21634 -31546 -31933 -55599 -44597 4521 29330
3292 29330 9255 -5986 -17477 2674 -25910 -59183 -63715 -32883 -19023 -22838 -11161 -17132
3280 -17132 -25545 6390 17113 13761 10914 -5330 9554 25994 45857 48653 38735 60896 42962
3267 42962 -4383 -32005 -79179 -60102 -43664 -5478 17079 -5152 -45315 -88460 -83020 -61721
3255 -61721 -57955 -86285 -123940 -88606 -15914 44056 11154 19438 23878 4794 -10856 8546
3243 8546 30068 51521 10296 17376 5830 5297 -21339 -23276 -56558 -116621 -103360 -68779 -20364
3230 -20364 -8024 -22933 -27455 19023 4457 -28592 -62219 -60480 -61286 -42054 -4587 32974 37236
3217 37236 23867 8911 -16588 -19133 7224 37074 33311 57752 41228 13182 3358 -21368
3205 -21368 -10305 3242 -26454 -63829 -39267 11769 8010 46820 66149 57061 18832 -38303
3193 -38303 -43236 -32082 -22982 6382 13168 -4228 4324 14311 9891 3051 -25488 -43026 -23362
3180 -23362 10152 -19178 -24485 -15596 5049 39210 31859 11885 14571 30556 14730 -30962 -25438
3167 -25438 30856 11701 26185 23379 11653 15582 4993 11992 8738 -2131 877 -17685 -39446
3154 -39446 -38878 -39498 -62136 -62546 -71743 -77744 -101092 -93142 -36039 -26799 -34989 -12440 -31316 -57080
3140 -57080 -25287 -28895 -66500 -100053 -54129 -25752 -29458 -15598 26471 26249 -28075 -73446 -63443
3127 -63443 -53981 -53623 -32954 29901 49077 47270 67700 17812 -11472 -13164 -25612 -30150 -32787
3114 -32787 2977 15539 30167 57890 78904 92854 92269 62986 39823 34094 -2151 -37025
3102 -37025 -51431 -3607 14603 -21569 -30348 -24165 -20346 -29620 4046 56729 76975 62830 41308
3089 41308 2501 -50591 -46205 -61938 -28140 -2988 31433 59292 41373 26649 13965 41689
3077 41689 55172 57513 39722 -12314 18288 18256 50645 67653 29374 2571 36835 16946 -3401
3064 -3401 -23528 49924 26008 15457 57540 72013 22633 5502 12755 -3729 -10157 -15107 15710
3051 15710 7012 -12713 -27416 -25153 -39161 -33385 -32959 -43326 -19850 3044 29168 61591 32377
3038 32377 -4676 -13930 -40757 -79758 -77979 -58358 -89281 -46567 1422 6394 -26577 -23138 10108
3025 10108 -3700 -67455 -92737 -53306 -45191 -3910 9108 -23303 -44004 -54321 -26707 -3427
3013 -3427 17150 26925 40890 21372 -9097 -3905 21207 3818 -9727 -7432 17787 44565 34557
3000 34557 -12032 -25101 -12870 -4072 18147 54073 14187 -22813 -26166 -42601 -46426 -2624
2988 -2624 -17818 33832 13510 -3063 -49614 -45349 -23988 -37862 -12551 3607 -35984 -53117
2976 -53117 -31958 -23976 -4820 -38690 -19375 44151 61457 21830 -15354 -30461 -774 35364
2964 35364 22385 11287 -2691 -30203 18396 47861 52902 54024 24343 -11375 4689 5704
2952 5704 9646 -6787 1570 10159 -13351 -27257 -48459 -60822 -60901 -69139 -60828 -52705 -66152 -52869
2938 -52869 -2766 3351 -26492 -23900 -17404 -14238 33198 55357 61267 34676 -6261 10718 15685
2925 15685 -11864 -36062 9074 38461 59422 41787 -3783 -32266 -19183 3898 7313 -13710
2913 -13710 -51351 -62014 -8932 -68318 -109404 -81191 -31303 -10595 -25244 -54627 -82265 -61058
2901 -61058 -66958 -84734 -105780 -69812 -4107 26035 -13619 18112 8514 35619 31226 23052 21140
2888 21140 69 8524 34468 27198 -5799 -4760 -35746 -57547 -46801 -94154 -156114 -121759
2876 -121759 -98392 -47443 -20845 -30423 -3102 1021 21659 15214 -11332 -35310 -55064 -28777
2864 -28777 -19852 -6843 -14947 2310 30376 52611 57916 8556 14167 -10166 -46044 -26913 -4085
2851 -4085 -36061 -28439 9111 10373 40458 30049 13226 43266 24895 -5475 -12346 5907 -3499
2838 -3499 -18369 1825 25466 9882 -51445 -81737 -49097 -32363 -35686 -23490 -22866 -192 5841
2825 5841 -43132 -58645 -21897 -45620 -22398 20798 13839 18385 25765 6155 16055 24532 27293
2812 27293 38480 51678 -7302 4096 18754 21616 35068 46720 37524 49609 63082 51518
2800 51518 36324 5290 -25959 -67340 -27083 -21287 -2008 -32171 -23957 -43742 -62572 8994
2788 8994 43190 49685 73416 61551 50627 42266 -36987 -56535 -34587 -21472 -27179 -21964 -27100
2775 -27100 -19721 10257 5808 19648 28380 21783 34382 55959 83569 60265 33785 36932 -7875
2762 -7875 -91 50512 83532 62396 25286 36452 39400 54259 19123 -30785 -56409 -46099
2750 -46099 -3519 1243 60283 53265 8949 11550 28042 26237 26044 42147 30738 18484 40367
2737 40367 23311 17179 42149 68405 35341 22195 41088 42206 14510 -4516 37993 51130
2725 51130 42491 14610 -26568 -17821 -3503 14883 929 12731 38517 21133 26441 45097
2713 45097 21282 18182 21098 26062 27462 6291 11460 -6666 16054 35282 48752 -7255 -53808
2700 -53808 -41862 -10911 32574 43169 53226 50608 14128 16008 57646 81647 56318 47652
2688 47652 34712 -13671 -19067 -14273 -17447 -11688 -59965 -101515 -110602 -66559 -3785 15806 22840
2675 22840 -28007 -51403 5386 62706 79060 67399 57507 36674 28589 41809 59928 57110
2663 57110 28228 -20932 -12396 45723 59939 32235 9860 -5899 18956 18177 16488 8926 -3151
2650 -3151 -40052 -42676 -43549 -59334 -57253 -17833 -16272 2947 9556 11309 13495 21585 122 -925
2636 -925 -10147 -2565 50134 63697 41475 23705 -187 -30109 -6376 69428 60472 -10032 -9407
2623 -9407 5237 -26073 -87663 -89230 -65332 -72569 -29051 -583 -26038 -16556 -19733 -35701 -45261
2610 -45261 -55747 -38136 -23991 -44931 -50381 -25996 -16105 -2518 -17651 -34372 -24220 1713
2598 1713 11758 -9527 -43112 -46147 -58532 -97645 -81274 -23821 -27433 -32544 -5787 5589 -11777
2585 -11777 8058 -2496 -20664 -11908 -4825 12115 27775 39449 26453 -9626 -12579 -3554 -23816
2572 -23816 -40929 9092 11054 26070 82082 41083 27521 -3931 35903 86849 78216 78845 53502
2559 53502 41734 52182 32062 33253 31418 25867 35822 -1805 23830 61025 60452 52825 37410
2546 37410 34195 44473 22346 8506 12985 28151 39048 -7312 -27885 -38517 -23962 -32033
2534 -32033 -40549 -42742 -43583 -70023 -83586 -88724 -43259 2477 5015 9503 -27215 -71220 -60140
2521 -60140 2778 8941 -36739 -66166 -24133 256 -39179 -20962 3294 27970 44695 24268
2509 24268 28779 32358 8225 -34231 -34088 -467 19115 27177 -31752 -102639 -61882 -40635 -68278
2496 -68278 -52644 -26891 -21351 -21227 -25260 -47036 -70032 -36186 -34821 -88232 -106144 -124031 -88008
2483 -88008 -56592 -33565 -29556 -28680 -33777 -46851 -47125 -19950 4845 -32006 -71006 -38421 11136
2470 11136 5839 22240 16853 5601 44770 10702 -39400 -78631 -80410 -27615 -13762 7153
2458 7153 -28663 -70149 -46207 -12062 -4507 28825 12337 4576 -25412 -4077 10234 -5949
2446 -5949 6414 36279 33031 41847 84946 82692 39796 41026 681 -37407 -31478 -38036 -45700
2433 -45700 -46010 -33534 -27968 -12421 -2297 -21053 -67353 -30929 8893 22506 -11217 -38919
2421 -38919 -35583 -20994 -45458 -24153 -25285 -37813 -23067 46441 42638 21416 19720 -11164 -19969
2408 -19969 -10922 -24645 -30248 3722 40401 23483 -6301 21755 69097 50521 -19647 -2849
2396 -2849 12168 13592 -20212 -5630 -11827 14542 37270 54513 10097 -14780 -8905 -8398 13639
2383 13639 23965 37356 21917 13170 -3734 -12740 30615 37318 58874 73169 53899 73519
2371 73519 90642 61458 16500 -3571 9675 -2266 -28403 -49740 -60229 -36957 -21829 -41809
2359 -41809 -43623 17761 19446 -36455 -69975 -21746 11240 8381 29584 -8191 -24268 -56332
2347 -56332 -74378 -55336 -37237 -59933 -33083 -43632 -49546 -41086 -21550 -8219 -25688 -14840
2335 -14840 37543 51341 80248 71313 30227 46759 22558 -8575 -27795 -30460 -8168 5626
2323 5626 14038 48105 81594 83475 23871 -15207 -29250 14863 14321 38882 19219 -45754 -57507
2310 -57507 -61064 -90128 -55942 -31588 -15954 -39937 -39961 -31010 -3388 9078 -9455 15857 57689
2297 57689 51771 58890 43912 5970 11564 34892 2992 -35186 -836 22568 3436 35471
2285 35471 19755 32760 53860 2185 -12219 27949 33153 -25900 -66315 -48447 -47793 -36619
2273 -36619 -22211 -38382 1206 31180 35121 27049 33901 35216 22734 31481 15502 35171 64685
2260 64685 54350 31726 -1599 -20080 -17914 -35819 -11994 -45054 -67687 -82981 -59490 -51832
2248 -51832 -59012 -59307 -4474 21030 25349 55967 42359 44458 70672 77787 61485 37940 23319
2235 23319 24118 258 -59910 -53459 -18887 12726 21278 -13333 -59262 -64477 -36720 -40186 -3316
2222 -3316 22680 56603 70644 33798 68185 79224 44314 -3234 -11760 14302 66636 40960
2210 40960 87253 87714 56833 37215 39897 20129 -4033 -10402 23072 14140 -41143 -45260 -14397
$$ [...]
##END NTUPLES=NMR SPECTRUM
##END=
