##TITLE=Analysis number 318452
Compound Code mo 00310
Project Code adrs
Chemist Name prosynth
##JCAMPDX= 6.0         $$ Bruker NMR JCAMP-DX V2.0
##DATA TYPE= NMR SPECTRUM
##DATA CLASS= NTUPLES
##ORIGIN= Bruker BioSpin GmbH
##OWNER= nmr
$$ XWIN-NMR		Version 3.5
$$ Wed Mar 29 11:33:43 2006 GMT Daylight Time (UT+1h)  MAYBRIDGE\nmr@NMR_250MHZ
##.OBSERVE FREQUENCY= 250.131544655141
##.OBSERVE NUCLEUS= ^1H
##.ACQUISITION MODE= SIMULTANEOUS (DQD)
##.ACQUISITION SCHEME= undefined
##.AVERAGES= 16
##.DIGITISER RES= 18
##SPECTROMETER/DATA SYSTEM= dpx250
##.PULSE SEQUENCE= zg30
##.SOLVENT NAME= CDCl3
##.SHIFT REFERENCE= (INTERNAL, CDCl3, 0, 16.522)
##AUDIT TRAIL= $$ (NUMBER, WHEN, WHO, WHERE, WHAT)
$$ ##TITLE= Audit trail, XWIN-NMR		Version 3.5
$$ ##JCAMPDX= 5.01
$$ ##ORIGIN= Bruker BioSpin GmbH
$$ ##OWNER= nmr
$$ C:\u/data/dgb/nmr/ADRS/1630/pdata/1/auditp.txt
$$ ##AUDIT TRAIL=  $$ (NUMBER, WHEN, WHO, WHERE, WHAT)
(   1,<2006-03-29 11:33:19.24 +100>,<MAYBRIDGE\nmr>,<NMR_250MHZ>,
      <created by zg, POWCHK disabled, PULCHK disabled
       configuration hash MD5:
       84 BC 41 DB A1 6E 1D 46 DA 25 12 A5 C1 ED C5 3A
       data hash MD5: 64K
       9F 55 1D CC 69 71 AF 46 43 E6 2D A9 AD EB A1 F0>)
(   2,<2006-03-29 11:33:34.05 +100>,<MAYBRIDGE\nmr>,<NMR_250MHZ>,
      <Start of raw data processing
       ef LB = 0.3 FT_mod = 6 PKNL = 1 SI = 32K 
       data hash MD5: 32K
       97 F5 38 52 5F 34 E2 B4 D5 EB 9C 74 EA F2 81 FC>)
(   3,<2006-03-29 11:33:35.70 +100>,<MAYBRIDGE\nmr>,<NMR_250MHZ>,
      <apk 
       data hash MD5: 32K
       2E 9A 9C 40 0C 1A 94 67 22 18 39 96 16 3F 6A 08>)
(   4,<2006-03-29 11:33:36.45 +100>,<MAYBRIDGE\nmr>,<NMR_250MHZ>,
      <abs ABSG = 5 
       data hash MD5: 32K
       1E A1 0B D7 8D 1D AE CF FB ED DA AF A5 B6 AF 5B>)
$$ ##END=
$$ 
$$ hash MD5
$$ EE 5C 1A 34 81 AF 01 B1 98 27 7F 96 D1 C8 DB D8
##$RELAX= 
##$RELAX= 
##$RELAX= 
##$RELAX= 
##$RELAX= 
##$RELAX= 
##$RELAX= 
$$ Bruker specific parameters
$$ --------------------------
##$DU= <C:\u>
##$EXPNO= 1630
##$NAME= <ADRS>
##$PROCNO= 1
##$TYPE= <nmr>
##$USER= <dgb>
##$AMP= (0..31)
100 100 100 100 100 100 100 100 100 100 100 100 100 100 100 100 100 100 
100 100 100 100 100 100 100 100 100 100 100 100 100 100 
##$AQSEQ= 0
##$AQ_mod= 3
##$AUNM= <au_zg>
##$AUTOPOS= <16 >
##$BF1= 250.13
##$BF2= 250.13
##$BF3= 250.13
##$BF4= 250.13
##$BF5= 500.13
##$BF6= 500.13
##$BF7= 500.13
##$BF8= 500.13
##$BYTORDA= 1
##$CFDGTYP= 0
##$CFRGTYP= 5
##$CHEMSTR= <none>
##$CNST= (0..31)
1 1 145 1 1 1 1 1 1 1 1 1 1 1 1 1 1 1 1 1 1 1 1 1 1 1 1 1 1 1 1 1 
##$CPDPRG= <>
##$CPDPRG1= <>
##$CPDPRG2= <>
##$CPDPRG3= <>
##$CPDPRG4= <mlev>
##$CPDPRG5= <mlev>
##$CPDPRG6= <mlev>
##$CPDPRG7= <mlev>
##$CPDPRG8= <mlev>
##$CPDPRGB= <>
##$CPDPRGT= <>
##$D= (0..31)
0 1 0 0 0 0 0 0 0 0.06 0 0 0 0 0 0 0.0002 0 0 0 0 0 0 0 0 0 0 0 0 0 0 
0 
##$DATE= 1143628398
##$DBL= (0..7)
120 120 120 120 120 120 120 120 
##$DBP= (0..7)
150 150 150 150 150 150 150 150 
##$DBP07= 0
##$DBPNAM0= <>
##$DBPNAM1= <>
##$DBPNAM2= <>
$$ [...]
##$SUBNAM7= <"">
##$SUBNAM8= <"">
##$SUBNAM9= <"">
##$SW= 20.6930455092707
##$SWIBOX= (0..15)
0 0 3 0 0 0 0 0 0 0 0 0 0 0 0 0 
##$SW_h= 5175.983436853
##$TD= 65536
##$TD0= 1
##$TE= 294.16
##$TE2= 300
##$TE3= 300
##$TEG= 300
##$TL= (0..7)
0 120 120 120 120 120 120 120 
##$TP= (0..7)
150 150 150 150 150 150 150 150 
##$TP07= 0
##$TPNAME0= <>
##$TPNAME1= <>
##$TPNAME2= <>
##$TPNAME3= <>
##$TPNAME4= <>
##$TPNAME5= <>
##$TPNAME6= <>
##$TPNAME7= <>
##$TPOAL= (0..7)
0.5 0.5 0.5 0.5 0.5 0.5 0.5 0.5 
##$TPOFFS= (0..7)
0 0 0 0 0 0 0 0 
##$TUNHIN= 0
##$TUNHOUT= 0
##$TUNXOUT= 0
##$USERA1= <user>
##$USERA2= <user>
##$USERA3= <user>
##$USERA4= <user>
##$USERA5= <user>
##$V9= 5
##$VALIST= <valist>
##$VCLIST= <CCCCCCCCCCCCCCC>
##$VD= 0
##$VDLIST= <DDDDDDDDDDDDDDD>
##$VPLIST= <PPPPPPPPPPPPPPP>
##$VTLIST= <TTTTTTTTTTTTTTT>
##$WBST= 1024
##$WBSW= 4
##$XGAIN= (0..3)
0 0 0 0 
##$XL= 0
##$YL= 0
##$YMAX_a= 363460
##$YMIN_a= -415352
##$ZGOPTNS= <>
##$ZL1= 120
##$ZL2= 120
##$ZL3= 120
##$ZL4= 120
##$ABSF1= 16.522
##$ABSF2= -4.171173
##$ABSG= 5
##$ABSL= 3
##$ALPHA= 0
##$AQORDER= 0
##$ASSFAC= 0
##$ASSFACI= 0
##$ASSFACX= 0
##$ASSWID= 0
##$AUNMP= <proc_1d>
##$AZFE= 0.1
##$AZFW= 0.1
##$BCFW= 0
##$BC_mod= 0
##$BYTORDP= 0
##$COROFFS= 0
##$CY= 12.5
##$DATMOD= 1
##$DC= 0
##$DFILT= <>
##$DTYPP= 0
##$F1P= 14.0000005364418
##$F2P= -0.99999901652339
##$FCOR= 0.5
##$FTSIZE= 32768
##$FT_mod= 6
##$GAMMA= 0
##$GB= 0
##$INTBC= 1
##$INTSCL= 1
##$ISEN= 128
##$LB= 0.3
##$LEV0= 0
##$LPBIN= 0
##$MAXI= 10000
##$MC2= 0
##$MEAN= 0
##$ME_mod= 0
##$MI= 0
##$NCOEF= 0
##$NC_proc= -2
##$NLEV= 6
##$NOISF1= 0
##$NOISF2= 0
##$NSP= 0
##$NTH_PI= 0
##$NZP= 0
##$OFFSET= 16.522
##$PC= 1
##$PHC0= 171.0838
##$PHC1= 4.891037
##$PH_mod= 1
##$PKNL= yes
##$PPARMOD= 0
##$PSCAL= 4
##$PSIGN= 0
##$REVERSE= no
##$SF= 250.13
##$SI= 32768
##$SIGF1= 0
##$SIGF2= 0
##$SINO= 400
##$SIOLD= 32768
##$SREGLST= <1H.CDCl3>
##$SSB= 0
##$STSI= 32768
##$STSR= 0
##$SW_p= 5175.98343685301
##$SYMM= 0
##$S_DEV= 0
##$TDeff= 65536
##$TDoff= 0
##$TI= <Analysis number 999999
Compound Code 99
Book Reference 9
Project Code 9>
##$TILT= no
##$TM1= 0
##$TM2= 0
##$TOPLEV= 0
##$USERP1= <user>
##$USERP2= <user>
##$USERP3= <user>
##$USERP4= <user>
##$USERP5= <user>
##$WDW= 1
##$XDIM= 32768
##$YMAX_p= 287716334
##$YMIN_p= -65861
$$ End of Bruker specific parameters
$$ ---------------------------------
##NTUPLES= NMR SPECTRUM
##VAR_NAME=  FREQUENCY,     SPECTRUM/REAL,   SPECTRUM/IMAG
##SYMBOL=    X,             R,               I
##VAR_TYPE=  INDEPENDENT,   DEPENDENT,       DEPENDENT
##VAR_FORM=  AFFN,          ASDF,            ASDF
##VAR_DIM=   32768,         32768,           32768
##UNITS=     HZ,            ARBITRARY UNITS, ARBITRARY UNITS
##FACTOR=    0.157963299565203, 1,           1
##FIRST=     4132.6476996994, 0,             0
##LAST=      -1043.33573715361, 0,           0
##MIN=       -1043.33573715361, -65861,      0
##MAX=       4132.6476996994, 287716334,     0
$$ Real data points
##PAGE= N=1
##DATA TABLE= (X++(R..R)), XYDATA
$$ [...]
21493 6900 -28617 -34543 -21608 -16940 -22768 -35067 -23569 -19611 -6731 1900 2497 5146 -3995 -8080
21479 -8080 11867 18676 15391 16536 17315 -1896 -11820 6178 32617 35466 22984 26495 10786
21466 10786 -1781 12113 21734 14786 5274 11013 9745 9414 6526 5058 -16257 -28406 -6023
21453 -6023 11815 -4568 -8256 1569 -4725 -19349 -17205 1915 14558 15637 1642 -15991 -27512
21440 -27512 -10525 -4696 -13447 -34748 -25187 -17329 -11055 -9865 1391 4370 16781 11173 3560
21427 3560 -1760 -544 -7098 -6527 -1784 5887 -182 -9060 -18990 4771 39570 46262 27335 18730
21413 18730 24324 13867 1385 5550 -2798 7711 15596 30135 33489 17383 1369 1588 9257
21400 9257 19118 11202 11194 6773 7182 18017 12620 9317 15608 30341 38625 33564 41190 39331 31938
21385 31938 24447 12983 -1022 -7559 -6621 -6232 -12142 -19857 -13955 -661 -1854 -8034 -12423 -261
21371 -261 -15190 -40321 -44908 -31109 -31621 -16878 -6004 -9728 -22591 -19986 -29815 -28850 -37212 -51971
21357 -51971 -28194 -8541 3310 8938 2985 -12560 -10827 507 -1777 -2298 -5831 -6719 -1062 -3096
21343 -3096 -10232 -9334 -1974 -4405 4289 803 -8082 -18068 -22155 -14136 -11310 -25018 -30599 -23864 -14758
21328 -14758 -4716 -5530 -24727 -23041 -6456 -2350 -9268 -14657 6666 -11217 -22752 -6420 11042
21315 11042 12873 10817 11486 10180 888 15777 665 3204 -3237 -6452 -11647 -9907 -18895 -37832
21301 -37832 -23415 -7699 19496 13107 2340 -15553 -11058 -4268 -346 -10094 -30836 -27814 -19997
21288 -19997 -7487 -11286 -20602 -25377 -10631 11018 -5020 -7260 -5963 -2315 -2931 -11907 -17074 -18858
21274 -18858 -3454 9907 28349 22325 4008 -7128 -5786 -6564 -5923 10814 6164 -7464 2382
21261 2382 19436 19871 14537 27198 11214 8568 -236 -9966 -766 4539 1051 -21196 -26554 -7417
21247 -7417 -723 3258 3866 -843 5192 18971 12534 23623 38999 36882 36233 32174 24429 28231
21233 28231 35805 27699 33728 35942 23800 -3867 9919 30898 22334 13900 27503 37487 26124
21220 26124 22043 21010 15957 2960 -5180 -6029 -16681 -1801 4628 -1830 -198 -7182 -7161 689
21206 689 14523 6907 -11108 -6948 -22036 -45700 -11700 3707 -16889 9499 31701 22338 5712
21193 5712 10265 13393 8410 4411 -9021 -12417 -7599 -1482 -4503 -5654 -10766 -4009 -881 1473
21179 1473 6901 8485 274 8460 27032 20348 921 -1034 4856 3413 -7528 -12094 -3679 -7108
21165 -7108 -17940 -36156 -54188 -53103 -31734 -21333 -2471 20092 15751 -9542 -31331 -38574
21153 -38574 -58818 -50022 -24834 -14335 -3638 -599 -2981 3505 14327 13665 12035 1028 -14944
21140 -14944 -29170 -34496 -37771 -28311 -14481 -2776 7435 25038 29655 29214 19303 15494 22590
21127 22590 -3603 8182 22842 12587 12129 9477 9274 -4445 -16414 -7981 -2816 -12346 -23402
21114 -23402 -20629 -21218 -25469 -21713 -26548 -10240 7551 6288 5499 1006 -2600 -1929 13029 4195
21100 4195 -5562 -3617 -1736 -1297 -3058 -4595 -3568 1341 -1362 -12593 -1195 -7378 7570 2634
21086 2634 -18095 -31272 -41751 -14406 11096 9957 -5809 -4822 3972 22206 14637 4601 -13523
21073 -13523 -28117 -36356 -47808 -17006 3709 -3549 -24773 -8360 14045 15087 5923 13494 19206
21060 19206 12335 10044 -1073 -1394 -4932 -15810 -23469 -31112 -17911 -2938 -8815 -19890 -22383
21047 -22383 -20625 -21966 -6625 -12813 -26134 -28812 -12046 10628 30119 14975 -8812 -8398 1475
21034 1475 5090 22 -4179 -3227 -14705 -14984 -17778 -22285 -36822 -33729 -30337 -36645 -39476 -36960 -27089
21019 -27089 -27528 -27272 -14630 -2011 -11783 379 -4513 -11135 -18161 -7287 10834 7742 9706 8426
21005 8426 -8357 -24010 -27888 -11222 6367 10617 31077 23725 18452 5318 278 18496 30228
20992 30228 10735 -10647 -25584 -23219 -76 5325 -14352 -26279 -27817 -27783 -30581 -34657 -31713
20979 -31713 -31476 -37108 -39685 -22042 -15713 1286 20478 -2317 -2941 -2910 -5874 -11693 -6909 11818
20965 11818 3743 -5890 -24379 -13904 -13597 -25997 -22688 -7779 -8901 -19307 -25987 -16948 -3456
20952 -3456 15303 7500 -9573 11142 26424 13509 -707 1866 11198 1338 -13978 -15728 -1997
20939 -1997 -4290 -13128 -3811 3171 5731 4672 24932 24410 16423 12514 11117 -1823 -626 2931
20925 2931 -3678 4672 16433 2335 1528 -4962 -14732 -15918 -3630 -11133 -22566 -14337 -13626 -10050
20911 -10050 -6986 -16756 -2772 -4366 -4061 -8464 1418 -1064 6013 10824 14615 10420 13218 18983
20897 18983 15735 10558 8771 -3857 -8505 -14061 168 7463 -926 -7213 -14046 -17055 -31514 -33700
20883 -33700 -29139 -30093 -24916 -26788 -30293 -23155 -6207 5643 -5475 -5904 -11122 -20485 -22745 -2620
20869 -2620 8086 -11349 -25058 -16049 -15312 -21806 -23525 -16071 -4201 -10030 -19704 -8645 14659
20856 14659 18272 7986 -10429 -9668 4906 3076 -11184 -31819 -35768 -15711 -9008 -7653 7448
20843 7448 10349 29141 15974 -9222 -111 19456 16415 14763 10802 3884 3931 -5090 -15431 -16098
20829 -16098 -30625 -28832 -28599 -25188 -19263 -15038 -4131 12077 -10236 -22231 -27072 -25527 -20532
20816 -20532 -21018 1001 7967 -11490 -16291 -6297 7985 7230 -4546 -15559 -20804 -24724 -13074
20803 -13074 -6934 -8264 -10941 -24467 -22182 -37561 -16414 8197 6650 -9068 -10756 4727 -903
20790 -903 2415 11622 -4739 -19588 -18954 -9295 -4188 -16521 -9395 -8949 -2922 -5610 -17311 -26851
20776 -26851 -10616 -16814 -24126 -30973 -14451 -10107 -17575 -32828 -31264 -31819 -22422 -21287 -12425 -12029
20762 -12029 -7725 -6670 -30368 -27778 -33534 -28050 -39258 -38044 -20201 -5489 1287 9925 -2911
20749 -2911 -20117 -22523 -12986 -17619 -8012 -14432 -17796 -9500 -5376 -8640 -6277 -10867 -11545 -30929
20735 -30929 -35693 -13406 -129 3932 -9716 -27012 -28526 -13342 -10187 -5595 -3452 11188 29984
20722 29984 21015 20087 20195 20868 21254 5624 -5794 -10950 -41601 -60146 -61143 -40951 -44852 -30112
20708 -30112 -17735 -20949 -27140 -10515 1679 -12880 -21835 -33194 -29280 -22198 -20167 -18639 -27683
20695 -27683 -24997 -11175 -1475 5262 1989 -7942 -11445 -12846 -10405 -13887 1408 7993 9827 15512
20681 15512 6262 -4259 -22585 -39732 -30027 -19943 -32649 -32692 -19956 -23647 -24848 -25509 -19897 -5223
20667 -5223 7800 7473 4066 -25030 -36658 -35712 -17256 -2299 1691 -1520 -10010 -4211 -10683 -7421
20653 -7421 2449 4590 15552 13874 33817 30290 20910 12546 5812 -2195 399 -13263 -24162 -14499
20639 -14499 -7251 -13798 -8209 3292 -5791 -23631 -25353 -15468 -8480 -6554 -7613 23969 26067 11586
20625 11586 1578 -13257 -16265 -23768 -39821 -28773 -22201 -13763 1915 -16164 -30761 -23155 -27060
20612 -27060 -36397 -33195 -14943 -16108 -25926 -23242 -8019 -10862 -5575 -22935 -10516 -7280 -15651
20599 -15651 -16183 -13710 -4788 -7554 -5071 12630 7017 -9096 -5228 8919 34 -20467 -29792 -13114
20585 -13114 12133 -2217 -11365 -8547 408 3625 710 -2178 3112 -2794 -14450 -10235 6287
20572 6287 8502 4208 13520 27022 24668 27896 28949 17675 10202 11108 36247 39063 31478 11008
20558 11008 11456 7388 -4158 6655 17261 13132 2697 9475 18258 22519 13796 14133 14174 1653
20544 1653 -4681 10040 26638 16568 5505 4477 -7956 -13366 -9351 36 8281 4554 8007
20531 8007 9577 -2941 -13949 -11849 2563 149 -27497 -39698 -30274 -10705 -17577 -8569 1421
20518 1421 2698 15262 16226 24923 -724 -23766 -12823 1159 10672 27344 9543 22070 33835
20505 33835 5767 8114 9479 -7046 -9724 -21432 -23586 -22940 -9140 -14791 -5378 -13757 -11480 1932
20491 1932 11183 -150 -10769 -20885 -12595 -19025 -36791 -43873 -39467 -25472 -20570 -984 -17744
20478 -17744 -38948 -16917 -7696 -6110 -7567 12213 18048 18491 18687 25265 28250 23632 -4683 -24715
20464 -24715 -21031 -18891 -11160 1851 11970 7156 3729 2894 9250 3587 -7870 -19095 -20229 545
20450 545 -2122 -16917 -12411 -21151 -22784 -14276 -1382 -14599 -8688 -17596 -28287 -30132 -30293 -23401
20436 -23401 -5547 2337 6064 9937 18422 23200 8060 -8619 -15026 -10303 3270 16933 20636
20423 20636 2989 -11080 -10471 -7400 -1705 1111 2730 6291 14425 14475 9792 11544 7679 6538 13095
20408 13095 1319 -8897 -14006 -10170 8766 22150 2146 -23210 -36758 -29516 -20417 -6285
20396 -6285 4420 17010 30900 19031 9302 -3540 -7234 6068 12767 19980 18152 -13558 -20120
20383 -20120 -11599 -8282 -8670 -12142 3284 23591 15914 2948 4940 25469 31169 -1331 -14579
20370 -14579 -5015 16616 -1038 -12218 -14291 -18122 5691 23896 26616 23325 22557 10901 4189
20357 4189 4541 15788 7664 -14381 -11761 -15681 191 10493 6985 12965 -3006 -14126 -24264
20344 -24264 -23951 -22143 -22961 739 758 -11310 -18952 -33962 -44422 -38795 -30015 -33896 -16080 -6546
20330 -6546 -20012 -20721 -13231 -6793 -1302 412 -3566 10982 23613 20244 -7980 -29203 -38183 -32974
20316 -32974 -23330 -25314 -17592 -15512 -15329 -887 6963 8139 19875 -1482 -17211 -16819 -8219 -20754
20302 -20754 -27255 -17441 -15749 -14064 4462 23940 23036 15368 10431 -2195 -13356 -14691 -30117
20289 -30117 -21114 -5784 -2041 -5491 -36463 -45862 -15286 39 -3521 -13168 -2655 20785 4385
20276 4385 -9236 -7576 -8545 -33292 -34604 -12790 -6811 -6133 11498 8919 -2999 -26484 -33743 -33108
20262 -33108 -12037 -11859 -14575 -10064 -14141 -5049 -12571 -24169 -4240 9027 18772 15848 8181 -5111
20248 -5111 -34596 -48121 -27676 -11206 -4041 -683 -252 -19697 -42046 -39363 -24568 -6197 -2025
20235 -2025 -9408 -1128 -2383 -21847 -22297 -3343 1740 5197 -2965 17804 3623 -23846 -49095
20222 -49095 -40061 -42336 -44291 -37850 -28353 -5360 16413 18855 2895 -13982 -12107 -15213 -18522
20209 -18522 -23100 -18746 -11645 -6126 -8892 -9843 -4146 -9288 -27193 -25258 -23862 -21869 -4176 8064
20195 8064 5932 -7061 -4391 -148 -13775 -10898 2324 14411 29896 17513 11366 17118 4386
20182 4386 -15132 -17006 -2599 -1276 2098 12994 28748 25027 25670 12843 -5849 -1541 5273
20169 5273 -10707 -19911 -22822 -9074 6657 18434 19322 20675 19426 1319 -7489 -9408 -10392 -22465
20155 -22465 -25482 -29834 -36435 -37421 -25129 -17148 -12883 -21042 -22865 -6397 -6562 2061 9737 15999
20141 15999 21597 12726 234 12145 6275 2728 -11295 -21862 -11009 -17060 -20016 -26917 -23456
20128 -23456 12658 40616 52319 54332 54062 37155 17785 10544 -9310 -23904 -11068 12901
20116 12901 14964 5754 9467 -12539 -24249 -13491 -5041 1965 3119 -21602 -15013 3514 19687
20103 19687 16688 17410 26057 23867 23856 13693 9522 5120 6705 20251 31103 18138 10611 17023
20089 17023 26612 26791 26776 27690 6023 -1664 12529 3341 -7164 -800 -23 -16701 -27473 -37455
20075 -37455 -25866 -22001 -23611 -22527 -23702 -33835 -32769 -21110 -23201 -17327 -13298 -688 8117
20062 8117 967 -1361 8693 11821 11770 9360 24680 20575 9104 -7738 6336 696 395 -13373
20048 -13373 -13934 5071 -10773 -25945 -17088 -320 3309 -2778 -2002 4338 12302 19041 4317 -8657
20034 -8657 -5526 3815 1632 -5208 8945 8231 6845 6256 11650 -16274 -36308 -34309 -31930 -20627
20020 -20627 -4750 3198 25450 14235 -6470 -8069 18269 1369 -7222 -2667 -9838 -37705 -47697
20007 -47697 -31359 -15416 -30489 -40323 -42321 -12883 -21392 -18712 -12675 -15263 -4232 -1593 5047
19994 5047 -8440 -24578 -17262 -12524 -3926 -2503 -5462 -8191 -17869 -13475 -8149 -19562 -35141 -36693
19980 -36693 -40754 -37168 -36236 -22802 -1380 -6183 -19572 -2640 -19299 -15070 -12621 -4563 -9724
19967 -9724 -5580 -1480 -5988 -11134 -17335 -19442 -15576 -11132 -395 2321 14715 5147 -3513 -5407
19953 -5407 11135 20372 10035 -9995 -9247 21885 57287 90671 134909 170220 228759 271973
19941 271973 311936 357478 345767 308115 267529 218848 175869 151730 108620 74373 42666
19930 42666 28220 15120 -10287 -23519 -15419 -6066 -5850 595 11902 5923 -757 15310 26377
19917 26377 3644 -8454 -3612 -5184 18190 42787 34146 38492 40270 22899 12016 -8435 -16876
19904 -16876 -33272 -12455 3371 12118 11506 14754 9738 13758 24151 25221 18594 11735 -10445
19891 -10445 -16644 -19407 -30683 -28822 5038 5879 -19650 -26783 -23943 -8605 -9338 -1604 3919 -9874
19877 -9874 -27074 -32856 -27757 -26374 -18991 -14898 11617 8098 -7121 -5512 -14492 -6537 11304 28821
19863 28821 23879 18700 -3529 -19375 -20061 -23603 -31005 -29580 -11708 -24225 -18771 -18932 -25496 -22010
19849 -22010 -28430 -19135 -8624 -11555 -16222 -7413 8759 3379 -10463 -228 8681 8835 14644 14949
19835 14949 14583 15354 11348 2404 -1305 2020 -8891 -12439 -10608 -828 10454 23886 12077 -785
19821 -785 12811 5401 -2748 -2488 -6972 -1563 -8311 -18973 -14535 -5643 -14644 -25489 -13019 -24094
19807 -24094 -24966 -19814 -25631 -32163 -36651 -32641 -21061 -14521 -32287 -38941 -38656 -14103 1823 -4449
19793 -4449 -5152 -875 -5733 -11533 -8259 -1418 -7076 756 6195 -19393 -28117 -14873 -4969 -9402
19779 -9402 -12515 6553 2416 -8972 -11443 -13863 -18059 2650 28358 19950 4615 98 17457
19766 17457 20696 21318 19731 871 -6609 -4939 -1783 -8970 -28562 -29636 -29169 -30553 -13691 17944
19752 17944 21920 12557 3290 10936 7148 -2129 -14867 -12990 -5262 177 -1837 9292 9739 8762
19738 8762 5455 14756 -3740 -12552 2181 6139 5729 9112 17532 36361 22999 1082 -4892 -12262
19724 -12262 -6195 -8810 9080 16225 17589 41673 44570 34535 44693 45149 41870 24525 15462
19711 15462 875 -7987 -1411 3785 -1018 -11847 -14497 -10947 -11896 -17190 -33016 -27538 -11258 3172
19697 3172 9383 -8629 -15046 -8942 3719 3374 5289 22512 22381 12889 2909 4899 18015 18687
19683 18687 5668 -13991 -16660 -7437 -31038 -31423 -16511 -7902 -19851 -15604 5391 865 6855
19670 6855 10942 7095 -4172 -14480 2092 18393 20529 15969 4571 -21039 -13739 5965 5513
19657 5513 -1672 -227 -11377 -25302 -25203 -15429 -15286 -15731 -10821 11376 13446 21748 23525 17428 20551
19642 20551 15609 14129 17489 9646 774 -12759 -32956 -8835 8352 -2116 -5854 9232 8921
19629 8921 5818 -2027 -26023 -25364 -14813 -14007 -8920 -10051 -409 13838 11147 15081 17295 23214
19615 23214 19192 6534 27533 32386 18110 31050 49934 38117 26114 34469 26412 32567 20908
19602 20908 18029 9366 -5954 -20249 -1572 16709 26210 23756 25907 16024 4763 4805 -3938 4537
19588 4537 20971 23111 17926 17158 8278 3752 10543 -9943 -8434 4644 808 -13118 -25536 -8360
19574 -8360 1770 9626 7225 1057 2537 12653 7032 13193 770 -18861 -10321 -1230 -18356
19561 -18356 -28111 -34620 -25828 444 13249 14996 2087 12018 15785 7071 -14649 -22204 -6469
19548 -6469 -2006 -6453 -5619 -12327 5804 15843 18756 2897 -3426 -8531 -5490 11688 20187 28168
19534 28168 24065 31851 33098 19931 15030 13583 13843 6900 12465 3538 2769 13824 8684 1441
19520 1441 -12602 -3268 -6369 3749 18184 26779 24705 32987 11239 -15609 -15495 -6811 4922
19507 4922 10013 3116 -11870 -16497 -14772 -1983 10846 17229 25868 15682 6421 29684 31488
19494 31488 28077 23744 23413 12053 1604 4223 -1812 23827 36746 33506 38092 41460 46505 48576
19480 48576 62870 69283 64081 51156 39357 48944 48424 30355 23455 17988 31115 29161 40827
19467 40827 50746 42966 34486 35824 38829 34334 31914 34094 27969 19897 46409 66850 45088 43754
19453 43754 51342 38605 19136 1245 19118 23983 9867 24316 42033 42706 50707 49058 42794
19440 42794 45305 52401 50775 57225 54062 50772 43770 53219 68377 68689 71807 81919 85290 94919
19426 94919 95889 111981 113088 91911 90374 108660 98814 83548 72492 86365 94129 99838 104354
19413 104354 114648 102477 81148 78782 74560 78423 94681 120794 128278 127600 141632 150813 176349
19400 176349 187112 194537 191543 183206 205162 234211 266581 318965 368215 417663 459469 499144
19388 499144 512458 523699 545936 563772 615058 703270 794861 896370 1005556 1098502 1151660
19377 1151660 1171620 1175600 1170543 1199474 1236741 1277409 1340607 1436482 1567209 1722130 1904394
19366 1904394 2142133 2437813 2813230 3291340 3908509 4642906 5592209 6881918 8706073
19357 8706073 11448021 15542022 21544572 29669733 39657208 50412300 59840164 65996438
19349 65996438 67642458 64403787 57083949 47365421 37345670 28580953 21667395 16605670
19341 16605670 13066942 10566328 8754622 7419998 6362549 5505654 4819677 4250162
19333 4250162 3768629 3359438 2992457 2686422 2431297 2223875 2051472 1903484 1799267
19324 1799267 1719593 1677943 1662284 1671465 1644906 1606422 1540675 1438910 1316993 1193432 1083547
19313 1083547 1017364 962488 886900 822423 770514 729566 699075 668943 639152 594222 539694
19302 539694 498827 464666 430431 397459 357376 331338 323487 302729 290682 273715 274434 279716
19290 279716 254560 250541 237892 222001 226055 230171 179991 147561 138282 147080 155556 141035 116396
19277 116396 101459 116627 127138 117968 110419 111428 109155 114500 111577 112740 119490 109883 126435
19264 126435 137418 113356 104247 113166 112947 123071 110749 91240 79353 82669 67048 54763
19252 54763 39448 40851 64621 68633 58886 50498 58936 56351 58197 59718 85423 81624 88552 90402
19238 90402 88467 62911 40583 32989 37113 37763 47940 42050 50472 59550 62647 66152 70596 61064
19224 61064 41952 28936 40249 46194 42310 44725 34767 26507 22713 38633 50090 47841 51922
19211 51922 17847 1303 21156 36139 42323 45757 66129 56860 33103 27156 40727 47947 54681
19198 54681 57960 66757 67603 65620 57353 47902 49983 66046 54248 57831 71238 76393 52622 24870
19184 24870 33026 42574 25676 34759 37929 34748 42324 42179 28254 16560 30373 53209 68622
19171 68622 58581 36818 18559 14491 27738 28615 28272 46040 71679 62055 29862 3480 6396
19158 6396 17811 23078 11793 15151 13325 5331 1064 -5881 17413 38852 22547 9804 15188
19145 15188 19756 11940 12322 23435 27002 19307 20406 15586 9615 16417 14610 6747 1523 1927 -12727
19130 -12727 -24545 -8348 1984 9704 15717 27531 30069 16931 3291 -8130 7189 6834 38690
19117 38690 30604 10911 -3552 15023 21529 19069 12833 -7792 -12868 6003 25993 12312 7002
19104 7002 20890 12642 8306 -3168 -6965 4616 15316 31174 35042 40494 39977 33011 27622 36983
19090 36983 43927 45481 47634 49692 22081 12839 12254 13957 25261 20937 7419 5740 7746 26318
19076 26318 32511 32009 24736 34039 45668 33616 23533 21076 24870 17930 12593 14331 13181 -4982
19062 -4982 -7707 6284 18691 20172 8654 -11203 -15629 -5296 2164 -8696 -4427 23049 13927
19049 13927 -1329 4069 33546 58548 60243 54859 38213 29128 20474 17421 18574 2172 -1422
19036 -1422 -6947 -15254 -4972 -4034 -8105 -2305 -4925 7648 1068 8729 17057 21845 28911 23867
19022 23867 35211 29563 20565 11903 14627 14716 17269 23474 29218 19279 24735 3338 -9834 -2488
19008 -2488 6589 -1278 -11508 -32802 -10420 -11308 -22840 -10251 4829 19087 25929 2858 -7824
18995 -7824 -5908 -7731 -9363 -4400 9402 20548 34838 37575 34314 25450 27313 11796 13076 31904
18981 31904 35006 25073 23449 18667 30532 24284 22461 29437 40816 38564 16098 -435 -7747
18968 -7747 -14205 -17446 -13122 -21203 -7951 19999 19094 13015 12498 6735 3727 -6489 -15425 -20368
18954 -20368 -18441 -14866 2983 12720 21007 5219 -224 15177 12703 20370 31345 27090 18129
18941 18129 11803 35706 57984 51743 44754 45959 44042 27715 32054 46305 64641 87584 72780
18928 72780 49032 39779 56147 58941 37837 33427 36341 45662 43180 52335 53984 57616 48167 33650
18914 33650 35572 52728 57682 56108 60634 55259 63635 78379 60118 61060 69472 85941 92867 94599
18900 94599 85734 91642 74913 60365 53332 31802 29736 35465 55250 68347 83231 99133 104187
18887 104187 88763 69287 83929 122816 152535 143038 122761 102273 70510 53966 63286 76654
18875 76654 97639 111860 130509 143486 130595 107582 99481 84680 91022 108981 118378 106115
18863 106115 93370 85444 79814 79003 83360 90930 103402 125837 153997 171090 156070 114586 100864
18850 100864 70451 54885 54049 56261 64737 81200 105892 118422 120224 118336 101915 68975 57192
18837 57192 67814 87349 101040 102370 105695 86253 56134 40652 45054 53710 72918 79131 89353
18824 89353 78434 57717 37279 33379 35394 35215 27622 40985 45089 43239 53960 41891 23476
18811 23476 25603 26137 22240 716 -6994 -1904 -2031 -11211 -9182 21529 35017 25567 17047 15899
18797 15899 1053 -9751 -14973 -11218 7253 11389 663 -3652 -21140 -30941 -13077 -1121 -1256
18784 -1256 8103 13520 32330 40432 23617 3331 -912 -3597 7541 20362 16279 15464 20310 10525
18770 10525 2899 13839 39590 58504 72572 113138 168568 206731 207373 176641 132578 120314
18758 120314 112080 115576 124803 149141 200998 255943 311288 356928 368019 351229 309301 269566
18746 269566 231532 204029 162966 130730 114029 72639 24989 22042 41448 31666 31069 29448
18734 29448 39122 50794 76892 67240 46242 28999 13808 20308 20954 3690 19866 37434 27960
18721 27960 34348 49504 50170 53041 58359 53590 35095 20185 1549 22564 25354 23843 22205
18708 22205 31409 30749 29096 37815 42015 44308 30618 10 -22012 -27968 -19100 560 24245
18695 24245 44662 52886 50316 43578 36175 36251 36730 34250 28549 52021 32993 23702 25585 29767
18681 29767 21425 18563 29403 51002 45179 18769 17268 29488 35167 28175 17773 -739 -4330
18668 -4330 1218 14188 24918 25257 26598 28529 18354 4028 10500 10803 1240 17362 23239 30180
18654 30180 12220 -14130 177 18250 22489 21585 16225 28255 24922 28781 37711 28931 17409
18641 17409 43544 53756 49261 46177 23363 23415 41018 27958 23337 38322 43926 40295 32500
18628 32500 23728 21252 29734 37684 60081 81734 100076 119891 111889 97022 86498 74996 57274
18615 57274 48029 55814 78481 91358 82155 81187 72446 46438 52503 64127 65398 62866 65342 72203
18601 72203 66750 52070 44186 55448 46334 37900 50882 61225 72351 85552 78403 71590 55359
18588 55359 47902 47071 44514 38652 39893 59302 64825 76310 91515 99329 104190 95047 82601 98472
18574 98472 104896 139716 160038 182007 182477 153411 130422 137335 149594 153139 163301 178860 198469
18561 198469 194319 152340 121169 137054 156563 161631 175630 170675 161814 152381 138488 117095
18549 117095 117466 113643 120848 141969 160381 148635 135080 111468 115617 131621 138476 126060 117309
18536 117309 119352 129829 136224 131850 100990 95646 79183 48381 40835 44323 59607 81003 98964
18523 98964 107295 108187 107202 128945 134474 128831 113372 116690 120974 122714 127674 137183 159502 143474
18509 143474 131309 121117 135207 137477 126973 109609 108984 107746 113515 126605 123689 113729 115665
18496 115665 135494 159942 160466 163663 164692 181141 186021 198794 218413 207529 186535 154728
18484 154728 154066 146521 128317 123716 105634 82361 84671 97269 107658 139428 154081 139872
18472 139872 108378 101355 106915 117025 111912 87723 103281 122427 138067 156095 174802 194226
18460 194226 176701 156980 148248 146620 150049 161670 157717 169192 157751 154152 148023 143272 170833
18447 170833 202198 220362 223536 198246 202226 224636 243321 256865 302253 363036 412994 444182
18435 444182 456680 470801 479486 473043 520605 596451 693981 885082 1236886 1829706 2406986
18424 2406986 2587296 2323835 1822869 1432782 1206149 1083711 1067463 1138278 1251321 1380814
18414 1380814 1548698 1768975 2102197 2600372 3284648 4264155 5848477 8665292 13888130
18405 13888130 21775059 27912959 29764150 27493969 23132767 18573456 14168579 10716786
18397 10716786 8745715 7959028 7787120 7677742 7547390 7733831 8843606 10636855 11566797
18388 11566797 10863576 8902420 6865810 5536141 4799829 4455963 4414598 4600802 4995005
18379 4995005 5723420 7032000 9554899 14465875 22416265 29259632 31590383 29572204
18371 29572204 24983581 20232883 15645958 11973423 9772311 8758121 8648158 9514352
18363 9514352 11702793 15201116 18626734 20655997 20148248 17491168 14148904 11290935
18355 11290935 9612071 8969616 9142311 10160136 12468531 16962712 23957118 32327695
18347 32327695 40962125 45715298 42738101 34011443 23645461 16429219 12316666 9888274
18339 9888274 8378359 7392093 6808753 6580021 6741225 7458118 9079578 11630676 13702957
18330 13702957 13955337 12599935 10913336 10277169 10471817 10467810 10079303 9698137 10154732
18321 10154732 12046850 16155919 22821071 30897336 39276770 44390431 42045245 33863913
18313 33863913 23564803 16028360 11566826 8854547 7055458 5811490 4925069 4272568
18305 4272568 3769281 3322931 2978364 2767651 2642628 2612106 2755072 3130914 3899775 4857175
18295 4857175 5197370 4708714 3642076 2663810 2062404 1702873 1491844 1343885 1244121
18286 1244121 1158485 1091535 1051853 1009815 960881 877474 777728 686710 626151 557168 499246
18275 499246 473704 444351 418587 402437 393938 373833 358752 352517 346198 327943 291295 285092
18263 285092 291518 277633 271634 256896 222953 207175 201939 182337 164476 161636 158373 162291 165912
18250 165912 171001 192721 183687 181870 169029 140870 133189 143869 128419 118156 131268 132500
18238 132500 132711 151326 154958 153751 151186 146798 145574 135835 109645 95903 97893 102683 116204
18225 116204 130539 143727 157424 141971 121458 123303 118105 119249 97080 93680 91873 90557 100907
18212 100907 102363 113104 123725 109204 88119 86020 84873 83801 84650 101185 98406 100366 84800
18199 84800 82585 81574 85603 101946 96403 85667 91403 96669 89845 78065 73635 64281 58995 72548
18185 72548 67271 72939 80515 70077 72191 92196 104847 100532 102966 91553 70007 63460 76452
18172 76452 85320 78395 89424 88613 91281 107536 88567 83245 102460 106692 121273 125907 128707
18159 128707 138439 132996 130667 127937 133692 135258 120615 117005 129843 137816 140210 156145 189140
18146 189140 195995 174428 162522 163017 160049 151501 164564 168242 160108 186259 214357 227174 245394
18133 245394 241695 232954 232454 250777 285856 310483 325522 350621 378123 404455 444056 477163
18121 477163 516484 589897 670333 778119 922007 1091501 1301459 1569001 1909746 2349281
18111 2349281 2928680 3857105 5529585 8733558 15460671 28393300 39102257 39116805
18103 39116805 30043110 18454166 11791368 8354960 6424417 5282887 4568520 4097230
18095 4097230 3808533 3648531 3669613 3901104 4409000 5274682 6595436 8759255 12637438
18086 12637438 19954818 31357965 41201563 44862895 41202066 33140854 24810494 17704287
18078 17704287 12764709 9767391 7956637 6882304 6350657 6315217 6889134 8306319 10668180
18069 10668180 12759282 12916510 11107238 8409020 6297683 4981204 4180984 3673389
18061 3673389 3342449 3108352 2971979 2976845 3212190 3762876 4728327 5891786 6354591 5930309
18051 5930309 4917394 4074240 3680256 3600416 3707354 3978954 4498449 5432549 7055940
18042 7055940 9625549 12378162 13785570 13721385 13096211 13703771 16860662 24079281 35628411
18033 35628411 45662553 50025413 48133209 43687940 40336742 38435139 38913544 39574955
18025 39574955 36247961 29558723 21605126 16388657 13994598 13635852 14781139 15864440
18017 15864440 15238754 12873404 9900824 7603768 6121891 5174207 4567176 4180917 3929076
18008 3929076 3845803 4004587 4429794 4744978 4613215 4075624 3453057 3010566 2734662 2569192
17998 2569192 2514466 2538845 2639912 2854529 3275435 4086170 5576829 7936977 10231042
17989 10231042 10873409 9684511 7562053 5894789 4997149 4656271 4751657 5303514 6494460
17980 6494460 8750448 12590538 17575342 22695496 28058959 31290777 29198716 23054342
17972 23054342 15491037 10402544 7429865 5609126 4425482 3638406 3073300 2650812
17964 2650812 2334810 2097700 1938935 1861460 1816206 1801351 1843355 1977939 2286761 2749209
17954 2749209 3030994 2857385 2313039 1722211 1351827 1128490 995753 914489 877267 821620
17944 821620 742840 656196 573283 532628 493471 454898 411053 376562 359047 340590 318063
17933 318063 304957 285347 275406 291615 291038 290303 277325 254137 239236 212213 184847 185299 201328
17920 201328 188418 174459 153974 145072 154459 155740 152544 145072 141265 156320 149584 136082 146574
17907 146574 146350 148955 155522 144361 137036 127873 97455 92834 113679 100002 82665 86452 83010
17894 83010 84674 77478 83699 90774 93997 120145 143374 159592 150525 141139 146544 155267 164223 183593
17880 183593 170609 154439 135739 110780 106433 115894 114752 123746 129466 143960 153734 168109 173887
17867 173887 158255 158288 169952 174355 169622 142473 127714 141200 154008 168882 187105 191006 181972
17854 181972 164471 165400 181596 200170 185547 137344 101160 94314 103413 101923 103238 115332 132072
17841 132072 141481 143214 134451 147594 156037 170691 165783 164705 159603 140406 120217 100871 98234
17828 98234 112783 112451 125889 160685 176140 153021 132449 126825 112652 102073 116782 128543
17816 128543 131176 120960 100922 73058 52195 74187 104241 113800 120981 139106 140318 106761
17804 106761 86922 96792 97650 84326 92449 103164 109238 103301 107311 95636 99909 108765 97098
17791 97098 86190 45328 46523 43129 43040 74020 98093 88796 86755 77822 77339 82445 95926 96483
17777 96483 96190 107056 99591 86774 72971 56964 49883 42981 35618 44693 66510 69057 47962
17764 47962 30757 20886 16945 18886 23926 5940 4410 27932 39683 35293 23774 21691 28942
17751 28942 34657 42028 47291 45549 45078 50151 35262 30470 15664 18303 22077 36996 36562 42592
17737 42592 46649 62855 54129 45642 44347 39623 25117 24906 26227 33493 44692 49453 62728 51786
17723 51786 50578 42286 31149 33209 26923 7282 16013 47574 36950 8246 -4612 -25 24544
17710 24544 22836 21985 8318 8093 31354 34224 36002 21402 4052 -1828 10495 20782 18830
17697 18830 34807 28395 12332 18931 25291 29293 18221 12399 9730 956 3867 13227 11836 29861
17683 29861 33407 18560 21654 16214 19757 18167 11529 9985 16501 38902 42504 25862 1158
17670 1158 -7730 -2788 15217 24175 30318 25413 28409 22059 27099 24685 17905 12200 29348 26796
17656 26796 3248 -9788 -4101 6185 22240 27537 33984 19496 9143 -2112 2564 15588
17644 15588 11123 28150 36060 22440 10685 8052 2829 -6257 -13139 -4659 5606 16740 -3401
17631 -3401 -19462 -7202 -3406 -1784 3170 8293 2903 738 1547 23891 41848 59798 57226 42956
17617 42956 40668 50133 51624 36415 19054 15888 23670 25141 22498 14582 11861 16719 11156 2686
17603 2686 12006 24377 35726 33429 12875 12405 19043 14567 17075 21302 -4257 -2685 2366 -6459
17589 -6459 2612 10517 8731 21172 23948 12344 1517 10782 14550 17170 28640 46441 44030
17576 44030 34179 26316 20147 28608 13371 6501 26933 60984 90447 102311 85480 85824 89174
17563 89174 77897 89623 99623 99986 78186 63843 50211 68047 73390 63500 59886 50586 62012
17550 62012 98752 101468 86910 75354 56716 47030 34809 15518 11239 15540 31533 37307 34341
17537 34341 46626 57506 54041 42380 48052 51304 55041 75882 77282 56261 57613 46984 40256
17524 40256 45178 57615 60339 58976 71254 89744 124475 137187 160958 190177 163132 142612
17512 142612 148346 159894 187115 188119 178988 160308 126678 136697 130793 113814 90426 69874
17500 69874 60213 86428 106307 95027 98092 93803 73735 64548 59649 74807 80002 69049 75102
17487 75102 92566 85813 79034 64197 42389 26947 25316 24899 21762 28491 32652 36747 36996 33650
17473 33650 27979 23010 31487 35121 44693 46431 50540 51035 62288 68615 77875 80827 71036 67346
17459 67346 80729 102038 109308 90136 75868 77018 79980 80109 79360 65337 56231 63042 53064 37196
17445 37196 27938 32713 46168 73911 128119 187721 247683 274241 230146 163572 114023 94669
17433 94669 80191 77014 57238 32580 16572 20975 13322 -16033 -19763 -6594 1040 13816 18138
17420 18138 24218 15544 -6183 -16699 -18190 -25090 -15752 -17810 -20747 -7618 1297 12662 32939
17407 32939 29959 30988 34029 20554 6356 4481 653 -4439 937 -16518 -28908 -28221 -34584 -23961
17393 -23961 -213 -933 -16120 -22410 -10932 -2295 14411 3319 -20863 -20365 1944 421 31427
17380 31427 31387 -2515 -8829 1405 14175 9486 27630 16621 21466 29813 25578 7036 11643
17367 11643 34414 24061 20597 20242 14088 16313 7077 11393 22504 19262 14418 4573 7505 10458
17353 10458 19662 21652 19457 1242 2042 5005 8795 12635 4819 -800 -5910 -2829 1812 2881
17339 2881 -1275 3600 -214 -4160 -8164 -12689 -10720 -634 13170 17248 12902 -418 -15371 -4312
17325 -4312 9882 6610 18052 4239 13560 25054 32916 29696 25308 20828 12566 1551 -3175
17312 -3175 7406 4140 -5890 -7399 -1547 9396 4261 -3166 -5607 2154 10930 13291 17016 16063
17298 16063 17077 -7731 -23639 -18779 -1908 14994 17911 7138 -3228 -12291 -16994 -18941 -10689
17285 -10689 -6516 -7273 -15082 -10347 -596 7587 17957 29843 42900 24782 16650 12932 14703 13279
17271 13279 29015 26928 27711 30751 18475 8380 1972 -17224 -43292 -47500 -32889 -12827 -621
17258 -621 197 -5900 -6720 -24828 -37783 -32958 -29558 -7424 -5099 3985 11591 13018 22101 31032 21575
17243 21575 17785 22506 19189 20539 12496 -2655 657 6762 9578 10395 4406 -3369 443 8651
17229 8651 14072 12863 -8109 -7755 -9627 -4333 -4267 -12673 -16051 -13043 -23131 -32979 -36044 -20459 -15323
17214 -15323 2126 14382 9026 -13286 -12677 8423 24739 15901 -767 -3829 6304 8340 5722
17201 5722 -4918 -5033 11303 27090 20019 13653 17407 17498 30574 38075 19389 3647 -3622 -15182
17187 -15182 -16563 476 2728 12417 21331 28246 20622 -13081 -9559 4486 -4647 -15368 -6909
17174 -6909 11644 6642 -4765 12410 20831 8846 -735 -25130 -15980 -9379 6512 20819 20494
17161 20494 30249 29616 21935 6714 2253 5119 7135 11615 -9141 -15287 -2401 -152 1224 -10994
17147 -10994 -8456 -7223 -2833 118 -19189 -14632 -12974 3784 6129 7944 24104 44655 51699
17134 51699 35697 17870 12294 32547 31790 19047 2425 9377 15198 6619 18880 19063 20724
17121 20724 32821 46287 22915 -6452 -26837 -40186 -30724 -25848 -21006 -6976 -7786 9335 16358
17108 16358 11552 6409 17803 16237 5629 -3627 9691 5998 -3888 -1115 -16783 -39025 -22614
17095 -22614 -10795 -6495 4034 14164 23236 19455 16248 1612 7794 -2243 -5872 -9969 -22727
17082 -22727 -10410 -7275 -2915 -4127 -653 -7336 -11657 -18946 -10523 -4132 -8580 -3501 15874 27985
17068 27985 33950 25155 -1199 -12553 -8730 -2526 -10168 9733 8920 -10368 -5814 3693 -2618 -9049
17054 -9049 6546 11843 15847 10260 825 4469 15939 18057 -1032 -20833 -14736 -726 13287
17041 13287 21029 -2058 -20824 -10154 -3329 -2119 -1313 -8294 -4230 2156 10529 510 9264 28552
17027 28552 14795 14747 6311 -4021 -13623 -18181 -12026 -1611 -5609 -1617 -3828 -659 2946 -828
17013 -828 -133 19116 28965 3700 -5178 -10963 -13191 196 11085 10933 572 8785 25831 29560
16999 29560 25639 26857 22712 20323 31946 22881 25636 31581 39761 27756 8656 1085 1961 -12653
16985 -12653 -17479 -3586 2363 11659 18556 -6564 -28398 -19828 -18158 -25864 -40770 -31511 -11087
16972 -11087 -4735 -2344 7095 22779 35254 22331 14457 -552 -15309 -8658 14638 8778 -1577
16959 -1577 7458 845 -2803 -514 20677 36306 26186 17235 7381 1368 -2040 -6487 3798 4440
16945 4440 8363 30596 35801 42971 21515 -6647 -5613 3390 -5435 -19688 -16888 -20465 -16977 -25498
16931 -25498 -23534 -24878 -6907 -3488 11770 14862 13140 13413 12397 9093 -2834 -24876 -24911 -15157
16917 -15157 -10400 3400 2168 -8490 -13910 -7848 -2792 6909 16578 16996 11186 23270 30831 13147
16903 13147 5575 14348 10726 26143 36878 29585 4807 -17884 -32480 -26701 3661 16052 7155
16890 7155 -1831 -24534 -25874 -22904 -10751 73 200 -10931 -27032 -21193 -6808 2608 10089
16877 10089 15693 13587 28533 29825 22458 25607 29389 26412 13011 16503 38591 28400 41792
16864 41792 28986 7964 -12602 8503 29457 32601 29309 25044 1259 -15375 -33719 -17876
16852 -17876 16673 11718 2709 8586 5834 -2260 -6008 4888 3918 -6879 -1063 -1294 5612 6990
16838 6990 21086 25942 15543 -3501 -18125 -18056 -22549 -2845 14974 43702 50759 35330 55040
16825 55040 48217 28454 -7275 -30391 -15172 -6039 6538 10068 -5749 -17747 -13749 -10335 -19326
16812 -19326 -18300 -25980 -21886 -12750 3215 7726 6231 12993 15706 21937 24534 9262 13329 8415
16798 8415 -15903 -20554 -12038 -1914 827 6581 3493 -6513 -12810 -10579 -2856 -3448 -7705 -4779
16784 -4779 1075 13551 18380 10672 10925 1450 180 -4095 -13425 -7076 4306 12205 4306 8499
16770 8499 19383 19148 27551 36201 23574 16346 10834 4036 8749 9674 -6316 -19677 -2872 14155
16756 14155 -5221 -15571 -9501 -3470 -3567 -605 -6160 -3068 7280 10626 5854 7343 6432 -746
16742 -746 -10363 -10853 258 12310 10299 226 8352 20849 9379 6736 5131 16908 20826 10744
16728 10744 3314 350 12450 15927 3765 5933 3192 -14237 -21946 -17575 -23468 -31613 -31485 -24930
16714 -24930 -27250 -30684 -25583 -11029 -17879 -24192 -16101 -15748 -22305 -15948 -10280 -18897 -29064 -20129
16700 -20129 -18030 -28029 -35528 -27288 -2787 9121 5697 -10145 -4756 -4697 7187 1802 -13029 -10545
16686 -10545 2830 13388 -3907 -25004 -18761 -6873 -8713 -20732 -7546 18248 17562 8663 1065
16673 1065 -10322 5636 10349 10366 -2375 -8227 -19533 -28992 -15574 -14024 -5506 7891 -942 -10764
16659 -10764 -11219 15904 26880 13092 -5767 6392 2319 -1582 160 2940 2044 3288 9192 19630
16645 19630 16300 26785 43726 34386 12559 6020 13104 24495 22289 -4036 -15177 -10209 -3856
16632 -3856 2188 -988 10101 25607 18219 9301 1151 21575 15253 7573 26317 16968 -8182
16619 -8182 -11508 -12636 -5921 -17626 -24639 -20317 -15109 -10603 -16247 -16063 -15031 1819 10150 11387
16605 11387 22461 17121 -2105 -19687 -25213 -18571 -4835 -18059 -24019 -4605 5145 1725 -15416
16592 -15416 -27130 -21487 -27283 -25472 -14710 4864 7810 6686 1947 -125 10134 8158 471
16579 471 6779 5641 4233 6231 7101 17915 14388 11648 658 -3813 -13520 -15945 -6982 2831 12409
16564 12409 3718 -12020 -10946 1864 10251 -2362 11059 15454 8840 17496 21770 -3553 -22702
16551 -22702 -12662 -8724 -12528 -16961 -4030 12403 17559 7252 -5543 -19262 -17775 -15761 -3840
16538 -3840 15106 15875 12679 20480 13917 -6184 -11615 -3334 12716 25002 12924 22428 55502
16525 55502 63290 55038 56070 39058 31738 38885 20461 -8160 -2533 -14817 -19124 -8829 4299
16512 4299 301 -15073 -15799 1085 23826 6138 2088 -6647 -4980 -618 4856 7061 3998 2257
16498 2257 8433 12183 -3399 -5890 -5661 -3401 104 -2482 -2682 -50 -5657 -3751 -14793 -16806 7377
16483 7377 12722 13592 7760 7504 29698 34341 23540 -4579 -15263 -13993 -23915 -27707 -16155 11153
16469 11153 11820 2577 7300 5457 -9060 -10448 17315 46282 44877 26280 24196 20008 21638 23985
16455 23985 15183 8045 18340 2485 -1610 -7823 5640 7169 24036 26730 9101 1168 -7703
16442 -7703 340 457 -5320 -6467 -2942 -5627 -4431 -1847 3233 -1774 -5508 3670 -298 -5395 26
16427 26 5590 26491 21668 2448 3259 13070 2754 2008 -6232 -6005 -7339 -13709 -2188 -19120 -36469
16412 -36469 -25359 -5230 9474 2450 1628 5775 11279 3060 6428 16174 1430 -33380 -41357
16399 -41357 -18037 -10588 -29798 -25698 -12917 2238 12222 19041 27710 11736 -11483 -16194 -19578
16386 -19578 -28055 -14342 -20596 6383 13365 26123 25118 18954 1073 -3353 -10759 -25663 -24807
16373 -24807 -6595 -10539 -6771 -15207 -21441 1978 -4791 -13665 -13497 -17733 -10679 -8577 -10151 -7385
16359 -7385 -11032 -18491 -9100 -9754 -8382 2113 5515 15099 18725 5699 -16750 -18379 -21013 -14256
16345 -14256 11667 -1299 -5382 -8136 -6112 3128 -5125 -12449 -6464 10172 25917 22592 14433
16332 14433 4695 2653 15165 13471 17355 24243 29237 8717 22004 8653 -14468 -15180 -18995
16319 -18995 -23444 -18185 -14897 -29542 -25898 -19682 -15485 -12745 -5116 6285 242 -14933 -19374 -8874
16305 -8874 -1344 3909 1463 2203 15599 9136 6300 1073 3545 11682 1185 -14588 -17557 -11439
16291 -11439 -7791 -5650 -16925 -9926 4362 19396 27440 21846 17392 6662 990 -11459 -23840
16278 -23840 -25726 -18073 -9741 -23511 -33785 -20328 -15081 -12873 -10536 -6221 1953 -148 17974
16265 17974 32547 28899 -11501 -19060 -4952 -1731 -7393 -605 13508 19796 9999 -12477 -23008
16252 -23008 -21158 -19203 -22220 -5914 -9305 -332 914 -1522 -8019 -9446 -18040 -6028 12261 3038
16238 3038 -12697 -33624 -24318 -28332 -19982 -6589 -10445 -20471 -15162 -12758 -10762 -14677 -10836 -12468
16224 -12468 745 9525 22332 21127 17787 28363 38139 22164 8246 -4623 12597 26179
16212 26179 11904 -6057 -3338 -15117 -22187 -23080 -5347 2153 6434 25094 13791 5653 13736
16199 13736 15293 439 -4732 -15663 -22168 -16100 3294 -3369 -17457 -21780 -23674 -25134 -26760
16186 -26760 -17960 626 8620 6973 -7153 -8281 -9264 -2516 3688 -12913 -15871 -11326 439 7450
16172 7450 12050 28458 28370 10977 4048 18690 14573 -2483 1964 1301 -910 14329 5448 -5841
16158 -5841 -7425 1521 1270 21197 32230 39185 24152 8869 293 5297 5566 7470 5285 2167
16144 2167 -11033 -16477 -15722 -10929 -15108 -5820 890 8359 -1904 -18205 -12889 -14143 -11873 8047
16130 8047 13983 13252 21518 16550 8349 -3989 -5654 4811 15590 2749 1889 13318 2221 2690
16116 2690 -16421 -20386 -30772 -21659 -2970 15833 26201 13688 9888 24222 19844 11140 12228
16103 12228 12352 13972 9820 -4291 -3793 9422 23494 24011 22172 26224 38694 38329 14928 -10765
16089 -10765 -12312 8373 19587 31163 38598 21698 1722 3325 11552 16996 19138 12180 10667
16076 10667 33567 39812 24047 29219 27266 13134 10445 984 9355 22005 15661 -6806 16663
16063 16663 -672 -26208 -32509 -16035 11920 -5031 -30739 -28596 -21763 5999 14514 11373 16461
16050 16461 9007 -3955 -3143 -7474 6160 16509 10841 22605 24883 12767 -5339 -2568 1730
16037 1730 -9781 -15091 -16835 -10784 -1595 1078 -6986 -3937 -17233 -22378 -6909 1725 -7801 -7164
16023 -7164 -1768 11872 19112 17072 25381 36783 11226 272 18820 26072 17397 7226 4450
16010 4450 13895 25873 15827 23160 31573 37788 28859 25621 12604 -3996 5882 10345 11538 8878
15996 8878 5398 21078 15999 1983 5994 5391 5286 4774 -614 13010 4586 5101 14072 9569 20470
15981 20470 28727 23437 24615 11661 9341 15058 11523 2217 -7341 -9448 -9128 -9694 -988 1902 14010
15966 14010 26513 29944 30013 18863 -1882 14812 28833 22122 22420 7376 -7115 3205 16831
15953 16831 15499 19084 10939 -5155 -7438 -3278 -714 -469 -13786 -15758 -24299 -25444 -23973 -11764
15939 -11764 -13656 -11638 10457 19307 17827 8676 14964 8146 -239 -16625 -20809 -14939 -9919 -18003
15925 -18003 -18130 -9476 3998 -1924 -15952 -11185 -5628 -10506 -4143 10875 10630 14823 16161 24774
15911 24774 12335 10589 14631 6123 -1390 -10439 -16082 -22394 -5515 -13178 -34608 -40268 -42705 -35184
15897 -35184 -31874 -19990 -7390 -8116 -718 10896 16613 17961 27706 16503 7797 2610 10240 4456
15883 4456 11382 20993 2364 6872 18724 19082 15110 6587 697 7448 -10753 -21697 -26490 -13742
15869 -13742 -6060 2894 1105 -11049 -32075 -37093 -24653 -17404 -3290 18867 9783 3578 11736
15856 11736 152 -13651 -6236 -1158 -8205 -8050 7491 14052 3204 -16302 -20593 -34669 -26522
15843 -26522 -12777 -7154 -8074 -14855 -23022 -12058 248 -12659 -12309 -15584 4661 1131 -20469
15830 -20469 -38347 -18607 4896 14563 7881 4764 4359 10088 11429 13290 -4528 9474 8147
15817 8147 2022 -6348 -14646 -15464 4748 7608 6987 -7780 -24675 -26695 -8453 792 7910 4196
15803 4196 13856 14373 21656 32948 37195 24508 16902 -200 -11319 888 -8164 -6219 -10539 -11394
15789 -11394 -12366 -9444 -16763 -25212 -14085 4735 775 4211 6941 967 14740 15927 -3221 -9283
15775 -9283 565 11348 13791 17154 20257 22256 4246 -785 -5796 4034 13105 9094 3537 645
15761 645 8566 -4067 -12095 -7243 12976 3297 9905 6848 13415 23205 25892 17944 12125 -878
15747 -878 -12247 -12221 -18375 -29700 -21430 -9878 -11936 -14047 -6407 -9960 -12198 -12027 -1125 -3959 -25660
15732 -25660 -20699 -29080 -21582 -7206 -8486 -8510 -7083 -4618 -5633 -18605 -26221 -9692 11483 3653
15718 3653 -8355 -8737 -1092 -12278 -1954 18788 3689 6207 10267 19914 19285 8108 3301 -3661
15704 -3661 -14115 -20814 -27563 -24321 -26017 -16240 -6884 -1650 -7279 -25605 -32374 -33186 -10923 6947
15690 6947 1581 4067 -5219 -11538 -2116 8146 -2781 -17039 134 26808 34011 20223 26455
15677 26455 20192 12882 159 -13736 -13977 -4869 10150 13909 19137 10910 4874 4863 -1294 -3780
15663 -3780 -13363 -18269 -20760 -12236 -6371 8063 15396 14659 21194 20847 8792 3256 5769 3839 -5468
15648 -5468 -8032 -11531 -10308 6601 3543 269 7989 4289 3562 -6983 -10585 -20854 -37332 -27414
15634 -27414 -24694 -4706 16544 12540 -4024 -19014 -32969 -41151 -43463 -30873 -5860 11771
15622 11771 13754 19060 15532 5883 -4303 -3576 -3811 412 -11423 -17330 -6706 14175 -564 -4322
15608 -4322 5373 5429 -9874 2546 15592 26428 23577 7270 -11873 3841 9499 218 -4 4494
15594 4494 16593 9536 -1899 9811 12597 5483 15882 24116 19378 18025 13885 12460 20774 24064
15580 24064 8573 -11778 -4046 -387 -3550 -5171 -29246 -12184 -1086 5767 -4923 -13583 -8172
15567 -8172 15158 13863 23478 22327 20460 26772 13706 7243 2457 -12664 -28740 -17421 -11732
15554 -11732 -12676 2587 6690 9307 8207 11569 -8191 -7788 -6477 -11901 -11007 1694 24553 18399
15540 18399 -1027 6156 21723 -3274 -10056 -6822 -155 -651 -20380 -19174 -13570 -14721 -2278
15527 -2278 1608 -2036 -5615 5802 -12912 -31355 -16366 3543 3719 -4397 -1912 -9585 -16560 1319
15513 1319 15931 29932 24060 15443 4096 6339 4204 3349 12510 -6027 -17604 -16205 -4161
15500 -4161 8102 16999 8416 19566 31780 12286 -12852 -11966 7419 16314 12603 -1561 4252
15487 4252 10892 3485 -12363 -13386 1545 29550 13926 -10153 -11891 -19598 -19210 -16899 -11116 -7782
15473 -7782 -15471 -18591 -17882 -11280 6149 30850 28482 16129 -1746 -26753 -25375 -599 -9697
15460 -9697 2773 30713 27938 16672 21813 30364 46920 41742 706 -11638 -16846 -4587 -3664
15447 -3664 -21501 -36178 -24780 -7870 10658 3817 -5481 5125 12010 4285 -13218 -10836 -33406
15434 -33406 -49324 -27841 2885 16152 15311 4752 -4292 -7978 -10976 -22109 -17202 -34937 -44241
15421 -44241 -40302 -31910 -29682 -22276 -18751 -20636 -5423 -9714 -20532 -9379 -461 14302 22256
15408 22256 20350 -987 -26770 -13713 3650 3006 15019 5137 -5343 -1251 -8496 -14471 -18488
15395 -18488 -14336 -8877 -6884 -9513 -4192 -9036 -3305 4670 -10580 -2852 10949 24496 23708 8133
15381 8133 1280 -15845 -3571 -1113 -6722 4315 26329 27427 26060 33965 21412 22458 10042
15368 10042 16611 21203 9800 12344 17481 12980 28601 19174 11399 9223 -123 -6194 -10800 -1125
15354 -1125 -2570 -25707 -26214 -22721 -17244 1929 7460 -6827 1190 17102 -81 -4598 -69 4072
15340 4072 1139 10772 26046 16472 18197 20505 7812 1448 -594 6995 -685 -13794 -8361 -24875
15326 -24875 -38750 -18970 -5201 -9009 -35056 -35363 -37542 -34302 -17390 -19971 -27406 -32638 -10424
15313 -10424 -12060 -6486 -14537 -26202 -14418 -19573 -28227 -10541 14685 17607 -2428 -271 7139
15300 7139 6983 6354 1573 -870 3210 14998 22394 15588 27662 22822 30503 11444 -6955 -2281
15286 -2281 12294 16305 -5260 -37328 -47827 -39423 -18972 -7581 -8540 -349 3846 5124 -2883
15273 -2883 -5068 -11377 -2868 5193 11340 2717 1737 -20946 -11013 -12429 -23156 -18694 -12990 -14009
15259 -14009 222 9037 9940 19382 21386 19871 22658 5721 -11931 -28558 -26357 -10760 -149
15246 -149 10416 -1645 -3191 7237 16105 12660 -4672 -22131 -12826 -19498 -27008 -41884 -25399
15233 -25399 -14732 -15500 -13393 -26038 -21816 -22141 -26390 -20788 -547 15009 19855 11277 -14851 -20924
15219 -20924 -18703 -19578 -18844 -6063 8835 5373 -2750 -5911 -6590 -4781 -5639 11966 25787 17647
15205 17647 2763 1245 6521 12821 776 -20237 -34836 -35297 -26415 -18909 -10761 5612 16758
15192 16758 6457 -17751 -19942 -10971 -12757 825 4401 6731 9886 2514 2134 1211 1667 14021
15178 14021 4662 4750 -1012 333 1277 -8246 -14485 -11704 -24703 -23722 -25554 -16452 -13981 -4155 -2726
15163 -2726 -6727 -295 3655 1813 -9492 -20868 -27985 -17360 3963 13213 2224 -4832 -19338
15150 -19338 -25229 -16802 -18822 -24621 -38553 -65861 -50672 -16288 -10453 -3603 1544 -10189 -28014
15137 -28014 -38663 -24036 4901 10442 -12696 -8633 13802 14749 -5041 -18669 -10569 -5416 10947
15124 10947 12006 -5773 681 276 11336 10256 3490 -14558 -42858 -40787 -20446 6537 18233
15111 18233 15217 9620 9917 12967 5654 -6405 -20330 -31595 -14615 4318 15782 2455 -17626
15098 -17626 -27086 -3121 8731 -2933 -2536 12371 10471 18722 32767 21557 15006 1155 -8221
15085 -8221 -4813 1249 -7086 -2172 5545 -3754 -13600 -19351 -18004 -1452 8025 4331 4958 -853 6996
15070 6996 1419 -19778 -10852 -5204 -6540 -4672 13097 21905 17888 33979 16509 -20471 -33479
15057 -33479 -25159 -5573 6407 -6125 -10326 -23321 -20913 -10006 4156 -2239 -7564 -2025 5376
15044 5376 1471 10822 6871 -680 3913 12490 12061 17991 16123 29498 11771 -11558 -22037 -11390
15030 -11390 -16247 -21071 -24308 -13145 -7798 -18711 -12274 -6814 -19706 -3694 3346 -5381 2142
15017 2142 11395 3155 -5655 8768 22354 7465 5556 10503 16298 18457 -1641 -3930 1350 16491
15003 16491 27831 15786 -7757 -17521 -11144 -24149 -30323 -9564 25445 66797 121460 163893
14991 163893 178169 124553 65625 56003 50634 32384 20393 15210 12755 30014 27353 19908 6965
14978 6965 -11397 -11542 -18158 -5320 5428 -7234 -10593 -13201 -10087 -22200 -23151 -21778 -13784 -19422
14964 -19422 -13935 -10476 -28828 -34126 -16570 -3346 3097 1846 -9261 6859 18413 5642 -24237
14951 -24237 -36065 -30599 -24153 -13274 -23800 -24060 -10465 7865 7910 2386 -24557 -18747 -9256 -10238
14937 -10238 -16967 -27182 -24196 -22080 -24535 -15245 -17801 -13492 3034 2820 8140 -139 -9414 2012
14923 2012 -3391 -5406 -3628 -9281 -20404 -35691 -12879 -20567 -20013 -11967 -7976 -4197 -1003 -4225
14909 -4225 12166 3243 1632 -10154 -7403 13568 24369 19236 14324 -6638 -23731 -14806 -12475
14896 -12475 -15002 -12889 -12703 -9109 -6297 -14106 -21149 -20790 -16702 -2913 -5111 -10204 -10832 -11864 19757
14881 19757 20048 24602 32763 32923 23427 3829 -11949 -12727 -10873 -10166 -4359 5244 11689 562 -7074
14866 -7074 -23475 -16615 -11181 -27732 -11437 6786 -9016 -30514 -23337 -15737 3793 13068 -1437
14853 -1437 -19582 -20725 -21272 -13419 -2712 3585 10325 28513 19328 13264 8099 12940 16305 20750
14839 20750 12298 16705 6474 -11244 -21689 -16039 -1036 -6482 -8811 -11553 -1790 -3205 -12070
14826 -12070 -8168 -5978 -7190 -5046 2458 12454 15473 3362 -21220 -20291 -3982 16349 9965 933
14812 933 -1843 -17777 -28622 -17337 8693 7724 -8597 -29711 -29582 -11123 -12054 -7399 -15334 -28354
14798 -28354 -25605 -19583 -15641 -8324 -6732 -201 6194 16481 12901 14366 18593 16951 18887 2649
14784 2649 -124 2959 -6382 -15045 -6921 -8358 -6773 -13812 -8550 -908 2084 -4444 -7252 20103
14770 20103 18334 -336 7576 864 5438 716 8544 19942 23266 8310 -8592 -6678 5437
14757 5437 14057 23287 22427 18437 33455 23314 16738 -3079 -8313 -128 -9064 -15184 -9209 1209
14743 1209 8302 5144 2782 2100 17037 22801 -785 -22598 -20175 -23530 -13478 -5189 -11240 -11796
14729 -11796 -15842 -12972 -4116 -12915 -15144 -36600 -28155 -12746 -16000 -6152 6184 -2150 -6429 4425
14715 4425 19640 31690 16522 -11532 -18616 -9637 2568 14308 7905 3247 -2201 -7921 -28517
14702 -28517 -27277 -11254 -9642 -2233 11094 9534 9488 -8379 -17483 -12986 -7487 -12747 -9950 -12749
14688 -12749 -22425 -9125 -4713 2317 -281 3306 11420 8101 5324 2556 -4144 9875 16402 5540
14674 5540 2288 -19130 -21178 -17393 -2105 -554 -11473 -3713 14469 9197 -8053 -13666 -13454 -15584
14660 -15584 -333 8195 3153 -6308 17095 25152 22887 20724 15406 -7454 -12929 -7577 -20205
14647 -20205 -23973 -21366 -14805 -17461 -19234 1641 9737 5260 3868 22234 20453 5742 -7829
14634 -7829 -1441 13186 27731 24826 3302 -8510 -4754 55 4449 2352 5739 4949 -2381 16673
14620 16673 9364 7303 1798 15651 8254 2834 14771 23657 10229 2487 -14866 -22094 -13411
14607 -13411 -3581 -16257 -25256 -24182 681 24372 22777 16611 11809 16001 23404 19726 6169
14594 6169 -1277 3328 4287 9105 15575 18832 15038 27812 35037 28907 16643 8137 7372 1946 -9581
14579 -9581 -17612 -14242 -11710 -4811 -10850 -15194 -6033 15000 11905 17062 15469 7722 7831 7394 1292
14564 1292 -887 12407 4661 6778 4393 2229 10629 3068 -7575 -17328 -27154 -21668 -6944 1118
14550 1118 4863 2033 2460 -9105 -13973 -24144 -22815 -10395 -3120 8453 13279 9826 1674 -7333
14536 -7333 -8423 -16601 -10403 967 5405 -8619 -21778 -27154 -9587 10028 17377 16415 24680 24400
14522 24400 3858 2292 -8059 -2136 13513 18685 5119 -9970 -17720 -4867 -2465 6933 11340
14509 11340 -6891 -29692 -41229 -17778 14238 20514 10704 6337 -4897 1980 8365 263 13686
14496 13686 25040 22434 13621 -12253 -25087 -12476 -12490 -3934 -2826 4126 1194 -8766 -20230 -22943
14482 -22943 -10459 -4556 -8018 -16702 -5402 4499 -1780 -15986 -25683 -6065 4101 10963 7830
14469 7830 13084 17852 16838 12146 22174 12736 1942 551 -1241 -25537 -28235 -24556 -7098 2367
14455 2367 3267 13637 15864 16602 9931 -10752 -18165 -11111 1599 -442 -8247 -7603 -9966 -14453 -10452
14440 -10452 -6327 3461 8380 3674 -6242 -22693 -8380 12125 18494 15226 -10752 -22788 -19730
14427 -19730 -14537 -7887 -3551 -13588 -15852 -32719 -40328 -22491 -24979 -31373 -42588 -36336 -35653 -27759
14413 -27759 -17325 -17679 -14503 -24523 -38214 -28208 -13906 -17604 -40954 -49822 -26397 -18029 -8100
14400 -8100 6477 -5517 -21170 -20705 -25917 -7449 13964 16786 10640 4539 4188 12458 1302 8533
14386 8533 13161 5184 4183 -14139 -16490 -11425 -10714 -8258 7084 20623 16685 11313 8461 30012
14372 30012 23859 12724 372 -9188 -6163 -6391 2351 -633 -5610 -8211 -8655 -11660 -8409 -15475
14358 -15475 -7629 4967 -1470 -16424 -15962 -11749 -10675 -28389 -32034 -34656 -41859 -36832 -18534 -6127
14344 -6127 -4960 -3902 1931 9179 -4635 -741 -1231 -1530 -10713 -9501 -4723 9965 23490 31061
14330 31061 32004 12164 -1708 -15247 -14761 -10934 -4260 -11250 -4156 -7037 -9266 -6310 4830 11045
14316 11045 20492 9858 -19972 -23997 -11949 -572 26353 11358 -11684 -19523 -18302 -4589
14304 -4589 15754 -366 -14280 6465 14945 11957 4786 12356 9049 698 -5526 -11602 -19702 -28350
14290 -28350 -23190 -24029 -17129 -17641 -9672 3807 -3715 -517 13094 17511 1780 -8480 -23762 -17499
14276 -17499 -16737 -11204 1861 8313 4293 -2957 8712 -4753 -26793 -13317 -10098 -18409 -13447
14263 -13447 -28607 -23253 -25121 -45326 -46754 -20287 -8207 -5029 -8074 -9346 -8631 -6148 -8060 -12995
14249 -12995 -14942 -6775 1324 -3869 -1058 4379 -962 5051 20870 27948 16198 1418 -9041
14236 -9041 -15489 -16035 -18901 -31443 -27390 -20148 -16907 -7796 12252 32167 41403 43138 15269 4836
14222 4836 -2489 -4177 -8744 -7659 12016 29539 23330 22655 29795 30208 20778 -800 -23217 -8799
14208 -8799 5180 20134 11948 11131 13164 13330 311 -9309 -16008 -25385 -21203 -57 14609 12630
14194 12630 9366 24256 30049 24780 30326 26547 28322 34852 25680 14013 7874 15384 22463 18925
14180 18925 21995 21138 19124 25088 28949 28364 30526 40194 32195 21364 10247 7670 -13105 -25388
14166 -25388 -24261 -12758 -7465 9178 16899 20410 26408 25123 26626 12485 6311 11967 10557 -8978
14152 -8978 -17590 -11699 -17665 -32721 -22423 -4603 22693 42661 32301 22613 28332 12003 -4646
14139 -4646 -6842 -3090 13918 13858 5750 8730 8382 12728 -14077 -35275 -34581 -16566 485 2570
14125 2570 -3766 -7879 -9042 -10426 -26481 -24668 -13688 -4405 -5227 -6256 561 -2191 -9085 8275
14111 8275 12048 14811 5791 6519 691 -4813 -7700 -2442 -5239 -7360 -1043 11523 15034 18351 25681
14096 25681 19215 9798 -9830 -6776 -10034 -10040 -6815 -9151 -9595 -1268 22625 39330 55409 48643
14082 48643 30559 10611 14768 28651 27024 17532 19690 25848 25757 6917 22341 38766 30805
14069 30805 39372 14573 -6629 -13713 -4240 -7273 -8446 -4978 3088 7232 -17986 -13202 9696
14056 9696 19041 16384 3181 -2053 7358 1589 8195 -4230 -12295 -23293 -25654 -16588 -59 11008
14042 11008 20701 2493 8683 9081 -3195 -10848 -11910 -11107 -11669 -8274 -23248 -714 13515 6403
14028 6403 10552 7453 5645 -7033 3058 18772 22461 13754 11545 9575 -7301 -22025 -22559 -16020
14014 -16020 -7471 -5110 -12918 -17423 -14094 -12557 -32628 -14125 -10187 -22187 -19196 -7389 -725
14001 -725 7729 10066 7498 14105 11887 18194 16179 27355 42277 39538 34280 10388 -9704 -11726
13987 -11726 -4200 -5041 -15526 -5633 9834 12712 3511 7298 -5052 1292 28408 30454 7520
13974 7520 -7537 -9879 9612 17563 10426 10009 -649 -1672 -1402 -14518 -3077 11897 4005 1728
13960 1728 9824 19381 22095 4718 -3490 6604 15459 24233 16069 8649 10163 2383 -5768 -7498
13946 -7498 6663 14754 18231 33549 40725 30363 20780 11091 -4277 -7186 -14315 -13359 -1283 14201
13932 14201 2131 -12988 -11154 -4733 21950 24750 19592 -5090 -1617 7500 -819 -7648 -3751
13919 -3751 2043 19345 24123 1334 716 -2879 1776 -11988 -20470 -24635 -941 17854 23311 20111
13905 20111 11220 13983 15570 13798 -4056 22 2269 -10534 -17634 -12811 8269 21427 16233
13892 16233 13191 5008 -12099 -5011 5144 1933 4260 -953 -24580 -34660 -21742 -24149 -38561
13879 -38561 -37964 -19252 -19101 -29306 -11261 12427 24548 17272 6609 2512 3930 379 -3231
13866 -3231 -23683 -36641 -29266 -32340 -29910 -21484 -8216 7277 25226 27335 20141 10206 -3684
13853 -3684 -2522 -6987 -16350 -6591 1947 19012 20481 21740 17301 30837 21006 5151 -9422 -11355
13839 -11355 -4037 -3900 -8811 -4586 413 -280 16851 26482 7611 -6840 -18937 -2710 7241 11140
13825 11140 18280 20172 1922 -5474 -11449 -22539 -30051 -23651 -14126 -3284 22297 17790 -6222
13812 -6222 -9360 12575 28951 12566 5049 13059 12847 -3442 -11103 -16891 4610 18558 8832
13799 8832 9403 9130 2602 -6541 -5824 -5485 3014 12704 21445 28452 30811 30318 10271 2410 -2338 -19772
13783 -19772 -18113 -10702 -6210 6453 4710 -11294 -7596 -11540 -8393 10383 17443 21773 19402 17635
13769 17635 15687 9336 8034 23941 19728 14770 -811 -2643 466 -20763 -14456 -7401 1497 -3861
13755 -3861 7182 9342 -13622 -16658 -3585 1470 -14950 -17049 -15263 -971 12698 7636 677
13742 677 6804 22593 16990 4604 12171 7254 -3377 6347 18180 12109 10169 1132 6059 16713
13728 16713 3366 -7992 7287 14751 29976 31654 30321 18498 16827 25561 29655 21942 15493
13715 15493 24898 28561 21858 -5368 -16035 -13094 -22273 -9371 3746 5870 8161 3070 2492 -3505
13701 -3505 -21338 -18775 -26280 -10690 -9122 -7142 2197 -6855 -13348 -20987 -9678 8576 -6560
13688 -6560 -14421 -15533 -7618 3585 -4037 -13742 -21121 -40342 -50252 -25185 -11125 -21986 -34582
13675 -34582 -52261 -42599 -19400 -6536 13455 22769 12623 7402 16831 31377 14972 -12973
13663 -12973 -35994 -50134 -64733 -43519 -10800 -11985 -13342 -4182 4975 -10708 -17675 -454 14448
13650 14448 -1419 -20325 -21606 -14222 -17840 -15105 -11584 -20996 -21905 -29205 -21858 -19022 -10731 -15896
13636 -15896 -27868 -34684 -30436 -19509 -12115 -9900 -13818 -16189 11849 19495 17591 14730 15936 17251
13622 17251 24108 39079 33838 17402 2941 74 10928 18288 11105 -4929 -5240 13938 24843
13609 24843 9183 -6242 -12137 -20147 -2411 26356 20897 -786 -8782 834 -15769 -28702 -28151
13596 -28151 -49632 -45520 -14722 -6782 -843 12010 8558 -82 11420 18476 9974 3557 6431
13583 6431 19120 31580 23383 6921 10976 22372 -3178 -8383 8134 20569 16485 5861 2739
13570 2739 1802 -13628 -21114 -26790 -20402 -5522 -16603 -22799 -34870 -17678 -4338 -14362 -23154
13557 -23154 -17345 -10286 -3401 -2520 -5673 -7782 -5844 -999 2750 10249 10404 -3967 5041 16513
13543 16513 -1625 1252 8654 9620 12973 20425 25792 18914 -26229 -31397 -16237 -7381 7810 7766
13529 7766 11571 12947 -4520 -9420 -10827 -10138 -21913 -9923 -27247 -21670 -912 -2351 1254 -9573
13515 -9573 -1732 -5483 -17926 -7143 7457 6782 10411 7736 -1850 -27316 -26973 2073 9783 10385
13501 10385 11698 17668 17477 9944 11840 6673 70 10724 6237 3867 -4378 2436 8104 1269
13487 1269 -10537 -18741 -15101 -7795 -389 14751 10666 -5833 -10961 8707 8540 -7606 -15473 -1034
13473 -1034 -3469 -27596 -21811 -5723 3031 3645 2670 -1493 3046 -11908 -16239 -11955 -15961 -6755
13459 -6755 -63 -120 -2050 347 -5815 -2309 -2741 9518 22284 12798 16692 28656 22612 3365
13445 3365 -2131 -128 6721 12859 10696 590 -3134 -14876 -19048 -38148 -43624 -27630 -7541
13432 -7541 -3341 -7334 -10635 -37450 -33772 -24720 -24741 -18086 -6117 -13966 -18107 -13967 -493 15127
13418 15127 13813 -314 -6776 -10794 -5478 7514 19630 5460 -22381 -18483 -14407 -17796 -20561
13405 -20561 3461 12946 9096 11432 23989 19620 -1867 -6173 -5332 2593 1808 3805 6378 7787
13391 7787 17169 22838 22072 23380 17657 23320 13753 1769 122 -808 -14520 -5342 -1565 -16439
13377 -16439 -26905 -22598 -22701 -27698 -28413 -26136 -33597 -26501 -19080 -9945 20 -1630 -1467 -4786 7967
13362 7967 22788 18859 -7697 -13697 -4861 -8589 -12569 5548 6912 1542 -370 5250 2001 -13025
13348 -13025 -8059 -11403 -13352 -18569 -24622 -18956 -10749 -4551 -15811 -16394 -17453 -14901 417 25597
13334 25597 32766 20809 4581 -5390 -3634 -7203 -11068 -4131 10274 23372 34394 25839 8869
13321 8869 2371 4874 -16887 -20928 -14674 -15580 -24898 -23334 -9173 -8523 -21216 -23419 -27437 -9222
13307 -9222 3006 -9101 -37930 -36757 -12916 -7245 -1403 10707 6284 -5854 -2665 14741 11418
13294 11418 -7389 -3148 -3207 2237 -6940 3237 4661 -14548 -17452 -1602 -5553 -8965 -12680 -9640
13280 -9640 3062 13496 24365 28890 18986 17265 3127 94 3299 8627 9580 4848 16325 15938
13266 15938 4597 -3505 -7140 2376 -9718 -471 18045 10946 7861 4640 -5173 8476 10328
13253 10328 709 -9290 6597 3529 -1788 2770 -1452 -5266 -5500 -4866 15912 11697 -11675 -1646
13239 -1646 9049 5381 5602 14043 33440 33868 23745 -1654 -6952 19308 32740 17158 8760
13226 8760 18207 23818 11947 1567 15032 12916 -15111 -27328 -27241 -39081 -31410 -10973 12715
13213 12715 13523 7620 12177 4251 -18476 -26865 -31166 -28793 -17834 -3147 1885 -10697 -4665 2449
13199 2449 12670 4239 -11549 -4753 10680 17382 15443 12002 -1136 -8796 -4234 6306 -9249
13186 -9249 -15381 -14909 -2292 -12623 -29291 -32431 -15721 -1178 -6083 -10613 -12363 -18479 -24119 -6781
13172 -6781 129 -4149 313 0 -10403 -19955 -27656 -36375 -20971 -6341 -993 -19242 -32492 -38453
13158 -38453 -25005 2930 -251 -12915 -13192 4170 9336 12147 6034 3399 11209 2797 4764 9591
13144 9591 -14977 -17198 -973 5618 8178 11023 17353 28402 41215 48144 52148 34975 10195
13131 10195 -2107 -21042 -27245 -18664 -19111 -30640 -24455 -13555 -20484 -3600 24551 25020 16536
13118 16536 26009 7747 -10666 -8841 255 -3095 -2392 4554 5399 4035 3856 11672 -4344 -15755
13104 -15755 -7828 11481 4339 4830 -6780 -2864 11273 20759 17801 13720 10042 1320 3824 7502
13090 7502 8633 21135 13891 -3672 -5014 -10018 -15149 -7333 1113 -6878 -5725 -8900 -21144 -9477
13076 -9477 21801 37566 4713 -16910 -32598 -42614 -44040 -31230 -24510 -35856 -47693 -60009
13064 -60009 -55289 -39503 -28214 -32030 -27357 -6289 119 -7907 -4940 6226 22704 20793 16159
13051 16159 9045 24010 10533 21866 26718 4930 -965 -4656 -18572 -14902 -16856 -18289 -10691
13038 -10691 -9402 967 24514 33839 27035 20039 16904 11494 5797 -9115 -12220 13279 29313
13025 29313 13032 11338 25170 24486 6528 -8408 -9388 -23056 -33087 -33330 -29187 -28972 -31880 -26497
13011 -26497 -8499 7879 16661 21365 13304 3217 5300 7410 9989 854 7046 -3405 -2610 -4181
12997 -4181 -5011 298 6142 880 -2494 -6458 -848 6690 5939 9994 588 -11806 -25152 -31955 -15615
12982 -15615 -10558 -18472 -20093 -1724 -4337 -35758 -29917 -15949 -22931 -8380 5045 4156 -3911
12969 -3911 -3163 -11030 -24337 -23045 -6955 -7436 3812 5324 2047 3712 13140 18367 18742 9377 -6000
12954 -6000 569 11667 8757 3771 -176 -1886 -2449 -10829 -30440 -46476 -31016 -21819 -27108 -26980
12940 -26980 -24436 -34333 -28529 -21846 -17001 -12307 -2076 8719 24786 14764 -4088 -18783 -17732
12927 -17732 3894 -1822 8400 12007 -275 -13932 -15278 6866 38141 51525 36816 29300
12915 29300 27273 16595 -3929 791 22099 12725 -5846 4185 8529 7773 1522 -8550 -7296
12902 -7296 -3794 -5172 -16405 -27659 -34061 -27949 -14718 615 18375 28247 10101 256 141
12889 141 -699 5769 13487 20225 21234 33687 42092 28813 7251 -9803 13113 17512 19872 28859
12875 28859 1664 -5221 -1418 -5135 6335 600 -14360 -20204 -11668 -414 -7173 137 -9492
12862 -9492 -11451 -14589 -14320 -16758 -19699 -21268 -15671 -5848 3141 408 1711 -6258 1799 895 -19274
12847 -19274 -15801 -102 10533 18168 22859 14610 6103 18366 14032 20843 17586 5443 10924
12834 10924 14139 10582 -8837 -24310 -13919 579 -5874 -17785 -20310 -14817 9711 10159 -16897
12821 -16897 -26089 -24650 -23135 430 -824 5960 26820 9315 -18157 -30912 -29900 -17136 -13371
12808 -13371 7095 -1158 -23592 -24845 -30412 -21399 -2194 -9594 -24454 -20815 -14372 -3500 12962
12795 12962 20509 9035 5386 2240 -18804 -48306 -46425 -21711 -17194 -20520 -22433 -19809 -23718
12782 -23718 -23031 -1476 400 8703 7107 9715 13517 5921 6137 2272 -4095 -16237 -23296 -12591
12768 -12591 -6871 14661 20392 -18051 -28003 -10027 -14746 -15571 -1909 8066 1574 -4568 7783
12755 7783 -6541 -9107 -7568 9273 26041 19813 13426 4404 13006 -3301 7389 7991 6045 985
12741 985 -17771 -13850 -3992 2273 -4464 -11372 -4340 -1110 -5222 -26183 -23117 -23806 -23226 -29261 -28108
12726 -28108 -14850 -17355 -26455 -15119 -13039 -3685 12182 25192 18102 27420 21850 10311 11356
12713 11356 11303 12685 45 -17642 -21154 -5312 5081 9806 6297 -16257 -10549 -1690 702 -3598
12699 -3598 15908 25134 25385 16871 5026 12798 21382 6534 3109 11438 2465 12145 19105 -1723
12685 -1723 -9777 -11337 -10640 -7974 -19018 -8167 2739 -2315 -8965 -7079 -17410 -25814 -11378 -12457
12671 -12457 -22608 -13021 -3964 -8643 3371 25991 239 -29238 -31444 -26147 -33833 -23617 -12139
12658 -12139 -11041 1091 1966 22335 35710 26681 33489 21258 9769 21091 17953 29347 31726
12645 31726 43180 33912 15607 2237 9702 23617 19614 13973 21917 35965 30459 25719 15102
12632 15102 13689 12264 -5385 925 1535 -6718 -7161 -3448 742 -6698 -4912 -3215 -21998 -28930
12618 -28930 -38408 -37879 -25098 -17595 -3940 -8104 -22073 -33357 -23315 -12471 -18524 -16966 -26167
12605 -26167 -18101 -13628 -13304 -2592 -12464 -25819 -19208 -34658 -43908 -20315 -4443 12141 34281
12592 34281 48672 37310 30081 17276 1024 -9543 -7357 -2370 -16717 -11242 -11966 -13964 -13718
12579 -13718 -8622 6615 5859 -5193 6977 16643 15447 20747 24063 17140 16582 21509 35863 28535
12565 28535 10327 16150 33045 27170 16516 4762 7141 6350 -8288 -5542 -8257 -11879 -912
12552 -912 5885 14448 27382 15230 11402 3960 -4262 2735 8605 10516 1364 5135 5407 6372 10020
12537 10020 -4616 -10513 15250 26221 15515 5452 5124 14686 27636 16840 -579 10045
12525 10045 3374 -5675 -20169 -24840 -19884 -10783 4000 8156 445 -10384 -14076 -10088 8691
12512 8691 9630 -6945 -11112 -18147 -10617 -19558 -22208 2711 13469 11148 26814 20590 13142 19002
12498 19002 3599 -16076 -12361 -6086 -29505 -31256 -29071 -24268 -14688 -5848 -10453 -8768 -3195 7425
12484 7425 -13941 -13582 -8599 14758 9535 -22903 -14322 6784 13687 2313 4756 6464 5209 -21170
12470 -21170 -35395 -20590 2208 3885 -12407 -11133 -11312 -19738 -10328 -5290 -6276 2681 789 5136
12456 5136 3781 4531 -2749 -1351 10435 4434 21606 33376 18693 14735 38606 37669 -3704 -27649
12442 -27649 -23873 -15107 -9908 -3364 2369 5890 -8704 -4472 -13556 -23208 -14914 -3410 -2391 -1213
12428 -1213 -7485 -5151 8530 14132 15254 6837 -1987 -17984 -20963 -42131 -58081 -30847 -7489
12415 -7489 -4641 9080 -7201 -19703 -23885 -21280 17462 28488 8528 11444 18474 -1811 -18069
12402 -18069 -26692 -21836 -16162 -22095 -8785 3356 8601 27204 38185 34764 24701 23976 9602
12389 9602 17547 35821 25888 -3495 -12876 -10652 -15852 -13790 -11351 -7010 -27320 -35543 -16298 -5981
12375 -5981 -79 282 316 -1639 -12952 -6800 -15869 -24027 -26134 -23744 7405 41099 47131 53838 58771
12360 58771 49443 33555 6292 -4055 -12293 -29197 -49610 -41480 -23742 -13630 -7295 -8409 -859
12347 -859 654 7705 -1329 -18043 -11957 1753 1365 -4500 -4059 -11489 -7238 118 782 -10035 -25752
12332 -25752 -14871 -8714 -809 1922 -24439 -40021 -28433 -30839 -19856 -22117 -22151 -41320 -34939
12319 -34939 -15276 -10607 -25903 -22214 -18222 -17803 -24923 -23410 -16021 -7379 -6715 -1444 3429 11224
12305 11224 2196 4262 -4093 -8883 7549 23203 15299 8413 -2492 -21362 -20556 -9919 -4867
12292 -4867 -14407 -20812 -21853 -7383 -9819 -16055 -17425 -9101 1907 -6472 -11559 21494 13203 -10639
12278 -10639 -6116 -2712 5269 12236 -2523 -2101 -17158 -32817 -14857 7524 20126 6876 -14943
12265 -14943 -16780 -18412 -18074 6314 9732 2609 -504 -4109 5511 18038 20137 36739 32202 18237
12251 18237 11994 -12482 -13880 1040 8831 17188 27246 24195 7736 -2451 12996 16783 5133
12238 5133 -2747 -11253 -26283 -1993 14711 6760 6370 16899 17746 6441 5872 -5049 1632 -5255
12224 -5255 -22397 -25940 -7912 -113 -12894 -5498 -9 -61 17857 8315 -4316 5206 15534 23021
12210 23021 -5651 -654 16797 12221 6005 14864 22779 17280 12719 10097 -10137 1511 7058
12197 7058 13520 30 -12303 -1153 -9398 3993 7082 -189 -12978 -24671 -36948 -25743 -8131
12184 -8131 -1704 -3295 572 21668 27348 19332 28760 39724 31713 32911 27331 15007 14914 7985
12170 7985 -2041 -10042 4860 7629 2232 5799 -3611 -9863 -12506 5818 18577 17888 19610 7938
12156 7938 10845 11556 11979 -1603 -1495 3166 14269 7954 12162 8093 8388 16573 12623 8865 3852
12141 3852 -1369 -9651 -8962 5539 8100 5753 2748 7041 10198 29831 32889 14865 335 -9115
12127 -9115 -7850 -5705 -12737 -12745 -3486 19122 7573 -9373 -4283 16688 -5312 -20521 -20038 -14226
12113 -14226 -30729 -28054 -23081 -24727 -18311 -11601 -16401 -14859 -15654 -7637 -2318 8282 -1335 356
12099 356 -8253 -18939 -15032 -8117 -11861 -15763 -1510 5263 -4346 -14636 -20942 -11784 -17744 -21138
12085 -21138 -8142 -2680 -5013 -2899 -9796 -10211 -6970 3916 -3110 12174 28411 29506 11766
12072 11766 6068 -3758 -9347 -9010 -20160 -13460 -5328 -2764 9348 3527 -2554 -13552 -19518 -13361
12058 -13361 3688 10835 5035 -14006 -4736 13986 20471 17209 14917 13854 22074 33204 26971
12045 26971 31574 22260 8250 12196 -6644 -10602 15111 30418 18515 22740 19266 14940 10535
12032 10535 6188 811 -16757 -27221 -10189 -7878 -16486 -8033 1460 -6795 -6498 3217 16998 21939
12018 21939 19509 5114 10595 2623 2115 -6852 -8642 -13863 -11989 8887 15132 18962 13426 -6920
12004 -6920 -22181 -27744 -30734 -24138 -12099 1696 10413 10902 353 -5330 -9452 -1990 -13048 -20314
11990 -20314 -3755 13845 21195 15016 -2267 -6757 2696 -5656 1442 -8637 -7393 -2422 -1560 -4956
11976 -4956 -13663 -17105 -19334 -26489 -28344 -22507 -15748 -6444 -9629 1869 13906 11445 -9475 -17246
11962 -17246 -11891 -12132 -31408 -18986 5766 4703 -13783 -1861 11804 5740 -360 -13896 6632
11949 6632 13236 4054 -12324 -23718 -12338 6551 1983 -15132 -8048 2560 11621 14216 28301
11936 28301 46514 42501 22424 4792 4087 5806 9315 1492 -5079 783 -366 -16184 -28621
11923 -28621 -39468 -34750 -30442 -27384 -29784 -28526 -38427 -29682 -24173 -17262 -20428 -19646 -27073 -40631
11909 -40631 -56605 -50971 -44317 -44299 -39314 -26016 -12013 3588 13464 31112 13330 -1744 747
11896 747 13382 34565 31442 27464 3657 -16282 -2125 -3238 3085 7937 8313 5617 6414 6170
11882 6170 205 -3645 6176 12185 11338 12481 -8620 -25062 2685 11007 14681 9803 -5684 11622
11868 11622 18241 -4024 -11231 -13702 -10274 19563 30070 9467 -8470 -10731 -17415 -31176 -27345
11855 -27345 -17501 -1971 8869 5298 3317 -20954 -32726 -24075 -10017 -4241 -21119 -33365 -9884
11842 -9884 14314 24482 32288 35247 33438 17446 9304 17434 19080 22831 19808 6037 21776
11829 21776 21733 27639 27612 -2949 779 17738 22949 11895 12748 19914 7150 -3949 3281 3846 -6488
11814 -6488 -14553 -15461 -11937 -7939 -11388 -10519 -17506 -19171 -21955 -9460 -3884 -20029 -30037 -29069 -13593
11799 -13593 -6908 8 8149 11128 -2558 848 5346 -452 -2326 595 -10947 -137 807 -11026
11785 -11026 -19074 -16706 -10902 -18190 -12763 -7710 -2543 -19095 -16561 -8008 2827 -8356 -16241 -22565
11771 -22565 -10715 -20033 -17733 -2908 -4915 -16158 -12457 7067 6736 -429 2766 -1886 -9346 -10784
11757 -10784 -14135 -3115 24135 30136 30706 21535 20603 7836 -139 -13790 -14909 -4606 15628
11744 15628 22136 14010 -1437 -13816 2369 -27 -4597 -4482 -207 14596 10546 10564 20843 12266
11730 12266 12270 26263 26648 12090 7436 -6777 -6505 3131 2854 10090 17734 12605 -3254 3681 718
11715 718 5954 -1535 -6071 331 -2 -6627 698 -600 7847 5712 -15436 915 18047 21472
11701 21472 16992 13232 -7902 -16884 -13054 5182 24854 22731 27327 33094 22284 9481 13870
11688 13870 17997 17209 8463 6059 16729 1539 -6504 -13328 -21190 -22929 -12327 -376 -2178 10123
11674 10123 13006 25542 53461 50407 36465 39763 39797 36685 19516 19667 7623 -5965 -14377 -22715
11660 -22715 -25563 -38754 -29312 -30062 -39838 -23763 1332 13916 25746 33158 23909 13528 4193
11647 4193 -7048 -13265 -17589 -17581 -9427 -3582 9580 -6118 -21374 -18678 -15225 -13607 -12170 -8720
11633 -8720 5629 -3671 -8447 -3842 -2744 10481 8352 7270 17625 13013 6966 -1479 -12728 -18144
11619 -18144 -11567 -2873 4832 12112 17291 23389 31388 30389 8459 4342 14321 -7613 -24035 -20389
11605 -20389 -24046 -20085 -5501 4646 5611 18465 20046 12516 8335 3920 20151 13526 11788 3026
11591 3026 -4637 -12999 -20525 -12012 -693 5020 10485 11518 1501 12773 11492 3496 -9855 -14827
11577 -14827 -4534 -25733 -25346 -20428 -14976 -9600 -6924 8405 -98 1058 -2103 -895 -8934 -13288
11563 -13288 -19466 -35381 -30634 -23914 -26136 -16311 -631 15670 23837 37116 37507 30710 39514 33022
11549 33022 37179 28617 5811 10331 341 -2083 -1223 8316 14114 -1594 -4600 4712 7583 -4957
11535 -4957 2300 3392 -13526 -5715 6724 10677 754 -1034 -6259 5515 2067 -20509 -16019 -8837
11521 -8837 -889 2577 5083 3074 -5046 -15523 -18996 -14800 -3168 -14236 -16012 7399 8466 8818
11507 8818 28725 20230 -13870 -31790 -36762 -32071 -26640 -22007 -36213 -22633 -4917 752 3389
11494 3389 -10930 -9558 -2498 10395 6660 9124 22627 40422 38522 28128 21885 15460 20463
11481 20463 21639 19828 18223 19986 27482 29673 7562 -4412 9159 11635 252 -7440 -15916
11468 -15916 -24013 -28293 -21816 7617 10774 2693 -2616 -10134 -6198 -16519 -20587 -29803 -47035 -41587
11454 -41587 -17136 -6716 2904 22680 13797 336 14320 4687 -6721 9975 23903 15853
11442 15853 6573 -3181 -12699 2250 6874 2669 8649 21504 23313 25110 19591 13239 311 -8763
11428 -8763 -5177 3815 -3941 5828 8151 25342 20094 21928 30874 41376 30116 20813 4010 3845
11414 3845 8694 7727 1905 6058 19759 21256 15699 6484 -17231 -23204 -6782 -4663 -13838 -16552
11400 -16552 -14031 -10265 -7374 -4533 10855 6689 4534 16322 12078 -1511 -11709 -10526 3437
11387 3437 10559 15399 5095 -8259 -22961 -13972 9316 11567 13871 18782 8336 4980 4198 -4268
11373 -4268 -19279 -25821 -29464 -23658 -15741 -16034 -14520 -19134 -16218 -28312 -31509 -16441 -14841 1519
11359 1519 9772 4897 15058 2305 -3523 -9141 -12457 -10886 -15798 -13199 -3537 7057 4752 -24277
11345 -24277 -25617 -19034 -4973 -9681 -17236 -14856 -5458 16441 17011 16434 2086 -35088 -26010 -18019
11331 -18019 -13009 14548 12174 -5526 4804 15719 -953 2675 -2190 -3086 -8693 -12443 -9548
11318 -9548 -4068 14507 14581 13026 24267 9082 -9461 -12472 -1262 -4677 -11081 -12171 -7945 -18837
11304 -18837 -15072 -5616 1000 2822 4169 -9100 -4840 13113 8408 -8231 -29925 -25278 -11538
11291 -11538 -12363 5718 31429 25381 2861 1892 10134 6621 10817 16433 33697 29497 33245 24998
11277 24998 2635 -5560 -887 2687 12095 3139 -4031 -5481 80 367 12187 6576 -5777 -13252
11263 -13252 -14520 -13354 -9314 -3261 -7129 2925 424 4277 1902 5224 2412 -8197 -14976 -10220
11249 -10220 -18917 -11294 5486 -7713 1803 9345 -3710 9116 9804 -1891 -6300 -10760 -12836
11236 -12836 -7427 -1241 -9306 -4483 6090 -378 6757 -8775 -17764 -10597 -6207 -14114 -19219 -10520
11222 -10520 9271 18164 28415 23108 21377 33267 50703 42005 25236 12017 -6388 -7836 -4132
11209 -4132 -6013 -15888 -14426 -5497 -19212 -22285 1499 10861 7771 3749 -3181 -5072 2455 8007
11195 8007 13517 26804 20056 21337 33623 47286 53670 43617 42839 53488 45773 30144 32036
11182 32036 30854 14646 9493 11162 12571 12753 7180 20939 31983 31822 30097 25427 18272 21888
11168 21888 26738 18127 6390 23416 27300 24479 22421 22084 17251 27048 25386 23250 22191 33277
11154 33277 35379 19612 15321 -2458 -13668 -3356 -763 3496 18843 23205 27898 5659 1916
11141 1916 6795 -228 19047 23532 17865 16509 -493 -8751 3911 24475 33567 39572 16952
11128 16952 -12470 -23244 -22693 -16800 3090 3529 4734 -5080 10396 17164 10652 17692 32524 30158
11114 30158 31460 34151 33180 7530 -8117 -1853 22920 44866 55246 57436 99127 148089 197849
11101 197849 249816 322681 489682 786117 1147810 1447381 1616649 1525212 1275322 952489
11091 952489 658797 472207 354858 271062 211718 171005 144114 120906 104863 91784 87169
11080 87169 76790 78896 89582 93891 77285 65088 68223 50582 55118 56924 47221 35746 18154
11067 18154 7287 12600 11517 9437 2062 -3604 -8312 -17986 -7179 3920 10983 14866 37644
11054 37644 34061 33406 31741 21965 42406 50458 44413 40555 38983 35891 25851 33161 17719 15258
11040 15258 17929 8226 27779 36123 49753 54616 59276 64223 61960 50250 51265 67198 69699
11027 69699 68313 66789 76518 72684 51602 43410 55420 55724 39134 40595 45506 49972 35117 25460
11013 25460 17779 34293 48290 48306 64602 70915 56764 41662 42165 49932 62761 70544 54456
11000 54456 36706 22993 12302 21202 41563 32447 28796 25821 17957 27916 32611 34547 37046
10987 37046 41030 42199 27546 23952 30422 35063 34329 44516 62751 37786 22516 19496 16142
10974 16142 34383 55656 72186 71110 58083 57366 50089 29273 32648 44953 41903 28813 38486
10961 38486 46275 59423 58356 54454 58626 74922 85414 65941 35124 29006 43504 57702 47543
10948 47543 52796 34135 28728 42287 56464 52128 54256 58478 72400 71892 89543 99227 100445
10935 100445 96369 90930 110389 128837 137115 116045 87636 71109 58568 70526 44366 37363
10923 37363 53382 58534 40377 40424 40235 47581 47010 34128 29367 26344 27952 25851 19019 15533 3564
10908 3564 11047 25126 28274 19425 27777 32221 14836 12145 -944 -4968 9702 36468 37836
10895 37836 24235 20258 24958 29947 26056 32434 56995 46068 33286 35473 26349 14531 13360
10882 13360 8468 14666 17740 32617 34223 65445 78784 85777 86978 69858 62821 58818 56315
10869 56315 65627 45884 40273 38885 39992 31417 25392 27732 20616 18383 19163 28177 35526 42913
10855 42913 49429 32482 6683 14952 35641 53068 50422 50711 67200 67003 37014 9531 -1974
10842 -1974 6132 191 -18974 -949 15721 44681 94802 125864 130309 122045 99682 99772 107455
10829 107455 107580 101822 101647 114733 112410 109788 112706 112041 107082 106423 106382 140888 168177 193364 229302
10814 229302 253414 245840 244988 199772 135030 87893 72059 81682 114061 141470 155936 151938
10802 151938 135133 126950 135600 117647 111419 107922 109976 129699 139010 130616 117666 127334 129031
10789 129031 123820 125974 136769 142501 154709 155707 153020 152759 150827 157406 154650 161632 177362 186186
10775 186186 185715 188106 180373 176643 184501 204522 216232 204319 196552 207284 218333 205056 198660
10762 198660 216559 228293 244050 254332 284731 294721 279842 254415 225136 198482 202661 209699
10750 209699 221471 252182 266700 287694 297904 303612 297206 292639 294193 303809 297319 334147 370920
10737 370920 395173 403005 409209 419931 465249 504308 553812 623317 681609 736761 775217 812790
10725 812790 906311 1059385 1214998 1304684 1391558 1414868 1357339 1286439 1261944 1300412 1385494
10714 1385494 1498218 1625889 1770621 1966508 2226892 2594553 3087847 3626575 4073728
10705 4073728 4404310 4545131 4594828 4654130 4904925 5473022 6306903 7432629 8909919
10696 8909919 10899245 13500489 16792242 21141097 27155658 36398214 51997243 80418099
10688 80418099 131499876 200087984 254737634 287716334 282486867 241998341 182537173
10681 182537173 122232103 82298958 59075902 44899198 35543392 28983693 23973909
10674 23973909 20009176 16803631 14355107 12513307 11069891 9896644 8919663 8123664
10666 8123664 7542886 7213538 6936833 6628725 6207769 5635785 5002832 4364309 3886464
10657 3886464 3554443 3286026 3070182 2896314 2744232 2579286 2408261 2225992 2059958
10648 2059958 1927833 1836620 1735103 1622568 1516959 1416145 1313359 1219350 1143283 1075354
10638 1075354 1032129 999511 934176 852128 795878 752845 723210 698796 670289 638729 613304
10627 613304 585708 563570 520309 470360 436126 421913 417758 423036 434942 410980 381791 347144
10615 347144 319959 301105 283197 277585 277725 274689 294006 309299 302044 299139 304766 278023 248382
10602 248382 238531 248592 255982 248608 248058 239363 216638 202160 171906 149025 162122 159470 143735
10589 143735 152731 170055 199725 215609 200025 188634 169426 155742 146042 144094 136430 129503
10577 129503 148612 151553 148333 143174 126260 121772 107897 93234 91038 69351 62058 64186 87431
10564 87431 123820 136852 140117 128354 109446 91503 65947 35825 27837 15264 12718 43245
10552 43245 58824 58748 60606 56457 50971 53014 56087 54920 29526 27221 34082 45151 51914 39075
10538 39075 27539 13523 11742 22044 37666 56738 66685 80765 93234 114544 112009 112347 115060
10525 115060 116386 133318 136301 106092 86464 68071 59027 69750 88487 91154 80704 79781 78993
10512 78993 77859 91147 88874 75356 68689 60541 52366 38935 17761 19145 23270 32934 12334
10499 12334 5388 13134 17878 2437 6727 18139 24872 29202 43461 57608 61007 58986 43777
10486 43777 40427 65076 57328 42661 42291 36030 26263 25590 39547 30300 21790 11676 35341 39073
10472 39073 41114 50135 34408 29539 29316 37429 46314 39349 31678 32214 21710 18483 26864 42400
10458 42400 38171 42155 18894 -1301 9786 27552 37303 22447 26988 24866 8678 18332 19905
10445 19905 29109 36873 37113 47951 46723 34238 30260 34467 16552 -349 6634 20330 45321
10432 45321 37846 23499 17511 30502 39527 32298 33347 27551 18471 24991 38568 53568 48078
10419 48078 38067 44790 38642 32487 20764 14700 14943 22518 37665 39103 21278 17893 22670 15360
10405 15360 2268 -1057 3813 5202 12005 8361 1196 -9482 -1865 6150 10492 -867 -4189 5911
10391 5911 829 -21340 -13977 3775 22377 37875 20875 2622 -8688 -3121 11496 25414
10379 25414 34164 29897 33749 40574 50944 38384 8136 -25163 -24601 -18821 -9326 2653 -705
10366 -705 -8471 14172 8490 -6055 3853 13585 11767 13166 6899 4399 -7419 -3971 5114 8376
10352 8376 15430 13849 11261 15853 -1119 -2857 -4057 697 -894 -3869 -198 8010 10519 3737
10338 3737 5424 352 -2963 16632 41378 49877 41300 36568 34666 4897 -10637 4022 10520
10325 10520 13726 15311 -2407 -2766 15795 17802 2760 7583 15143 6514 1057 9709 15592 25927
10311 25927 42783 46544 41140 26812 16499 13444 23784 32671 37658 24688 39750 45081 47474
10298 47474 41101 39477 11388 3987 2879 -1691 -2637 -530 3445 18304 21451 10027 4614 7613
10284 7613 24381 48487 78534 81094 87375 104179 122971 162715 206551 262497 365616 528123
10272 528123 825776 1185689 1436746 1555052 1483977 1242349 913737 616963 443256 331442
10262 331442 248837 199812 159940 142643 124788 104952 92448 79099 75879 56975 49105 33810
10250 33810 17427 21228 39890 46819 38980 40478 53788 56434 79543 111264 118190 98884 78275
10237 78275 65386 49507 70003 73961 67608 51183 44550 59554 76510 76737 81638 135963 179379
10224 179379 202100 194007 160541 129902 85781 68181 57315 49384 44297 33995 19276 8683
10212 8683 -12694 -21477 -10924 5519 2369 8787 6479 10418 11337 3682 2721 15073 12400 4636
10198 4636 -11797 -25425 -9010 2378 1976 -13957 -13913 -1528 6499 10450 7529 17006 9020 7847
10184 7847 13423 27608 17299 10033 11479 10344 2387 18690 28688 11922 5558 3550 13383 4038
10170 4038 -6297 -9837 -16053 -12018 -4150 666 2491 1466 421 -1969 -646 2707 8923 -1162
10156 -1162 -20056 -26032 -11773 -6854 -17229 -3352 -6719 -10519 1290 -8779 1274 1758 16009
10143 16009 19469 36629 32262 8492 15852 10337 1450 17102 8862 -9210 -5009 20220 30988
10130 30988 17316 -2342 -15157 -10504 1082 1226 3350 -5908 -12086 4077 -148 3695 -6975
10117 -6975 -12886 -27757 -13353 1188 -3965 7971 19170 10534 -3390 1859 3208 2293 -11941
10104 -11941 -18561 -17139 -7227 -3062 622 5647 -3990 -6632 -6696 -2233 2186 2397 17817 16740 6894
10089 6894 4498 12236 19259 25721 29563 381 -32559 -21174 -9003 -20558 -27880 -18837 -20510
10076 -20510 -15535 -1913 -4013 -7343 -2704 -27255 -16265 4859 885 1119 7842 2729 -18631
10063 -18631 -25007 -10399 -2249 -9216 9886 9256 -14431 -16156 -5217 -11087 -10181 -2289 8149 16441
10049 16441 5660 -7544 1181 11201 5000 6220 27193 20380 -3263 -2583 27241 50294 52915
10036 52915 14365 2130 12607 989 -7237 -12494 -15126 -17525 -4451 17260 16835 11277 33727
10023 33727 26441 -1058 -9531 -19430 -34686 -37476 -20086 6611 6876 0 1288 3315 15215
10010 15215 29075 28293 20690 12145 -4550 1943 10213 -715 9800 16319 3405 -5435 1336
9997 1336 3416 11512 13756 11056 14727 11007 -3445 1844 7078 8951 1078 -3630 -11235 -16668 -10325
9982 -10325 -21388 -23784 -4057 -1740 13582 2396 -16069 -27986 -36990 -17245 3362 13215 10643
9969 10643 1527 -4934 -6980 -17163 -11332 -9652 -12744 -466 9141 2521 18417 480 -2478 -5664
9955 -5664 -11480 -715 8038 10554 10403 20757 19829 -656 107 1466 14877 14756 3873 -1326 -17449
9940 -17449 -17356 15439 34596 20146 1304 6902 2463 6966 8776 17685 27841 16664 37566
9927 37566 46449 51351 53842 31466 7237 10681 18562 42932 67405 43932 22771 9381 5112
9914 5112 17659 18117 8730 1082 -21544 -12736 -1326 -1436 -3167 17536 29981 23298 13748 15139
9900 15139 10261 4916 5383 9847 10220 24039 14352 7991 10736 18678 24646 25933 45964 53178 64081
9885 64081 57131 13069 8634 10639 28280 17536 15525 11808 12764 12562 -1177 -3038 976 2615
9871 2615 -12977 -20526 -15884 -15951 -8164 -11771 -13783 -7134 -12163 -24344 -13123 382 11391 5878
9857 5878 -3338 9402 17193 17267 12357 8547 6100 4531 6364 -16064 -25866 -18994 -22442 -14253 -12867
9842 -12867 -21496 -31078 -16602 -163 -5427 11403 5597 1369 14971 -11356 -16964 -18849 -34145
9829 -34145 -30323 -4496 -2744 -19267 -15678 -7563 -2054 12157 -9616 -23994 -2984 4086 -9404
9816 -9404 -12527 -5121 -15315 -11110 -4343 -3195 -10909 -8304 -8257 -10841 -851 -1596 -18898 -19679 -9609
9801 -9609 18044 16795 -15266 -16469 -20265 -14307 -4761 -11196 -21863 -33334 -21583 -14952 -9497 -22789
9787 -22789 -30295 -16109 -5716 -8412 -9425 1147 -9065 -18891 -15775 645 4338 14103 19287
9774 19287 13053 3035 -9466 -26558 -26077 4733 6227 -16231 -24185 -16659 -12936 -18221 -9371 3046
9760 3046 2012 -1530 -7109 -8409 -9633 -7884 -1702 2476 -1768 -20996 -26304 -24724 -2745 -7048
9746 -7048 -3980 -16127 -20978 -17921 5164 10306 11008 9837 -1792 -15217 807 5924 -6735 7605
9732 7605 33969 32467 36884 16031 12569 17540 5338 -4237 -8941 -6728 1220 -6725 -2053 24909
9718 24909 32774 24922 11529 -10364 -26170 -25146 -28451 -8009 12860 12168 11371 -5525 -25392
9705 -25392 -27568 -25823 -15463 -4027 16066 22540 26736 37621 39326 30007 13174 217 -10744
9692 -10744 -15387 -3043 -12472 -17483 -8688 6696 19135 16609 16850 17178 11995 16842 16697 14030 -11908
9677 -11908 -15827 3686 12952 15770 6883 -18248 -32628 -11668 12201 -904 -14620 -9733 -3963
9664 -3963 -2369 6438 -11825 -14573 -6017 -6736 -5901 -4170 -12089 -10857 3675 27401 18990 10829 16674
9649 16674 23354 24190 29444 12714 10830 -10688 -30984 -17539 10010 12689 -6589 -14944 9462
9636 9462 12614 15350 21615 13130 10306 -7948 -18254 -23063 -29918 -17096 -5381 1930 -1505 2509
9622 2509 6782 3870 6310 -2632 -4978 -9138 668 12115 20075 19579 1794 -24323 -24245 -18773 -21184
9607 -21184 -5496 -2601 1293 2035 -3423 -15862 -19837 -22855 -27038 -30709 -16852 -20500 -13121 18670
9593 18670 41650 31044 7221 -6977 -15680 -23478 -23911 -21221 -19150 -4559 -1360 -554 -12400 -19820
9579 -19820 -9560 10934 8989 -6416 -15442 12510 20640 15118 29471 27100 20724 6346 -1376
9566 -1376 -10806 -17808 4877 10708 10290 14111 18933 3175 -6149 -11358 -14216 -7543 5804 6248 -6350
9551 -6350 -12908 -10114 -5593 -10021 369 2452 -5720 -17296 -16007 -6538 -11680 -5363 4786 1485
9537 1485 14490 17872 32595 26967 16942 7772 11889 13101 16952 6955 12953 16581 7245 4592
9523 4592 -5238 -16398 8941 16229 5687 2751 544 -8698 5957 21959 5842 -14553 -11406
9510 -11406 1482 -12076 -11639 4031 9910 5297 -7249 -5186 10585 16166 -5145 -18028 -9239
9497 -9239 -2920 -10089 -13157 -6768 -9157 -2916 6158 12465 9499 -4382 -14604 -21345 -34981 -14089
9483 -14089 4643 3060 24944 29232 20379 12987 -2650 -719 10407 13714 4332 -4239 -3992 10426
9469 10426 27285 33457 35794 27280 15180 9223 5598 21846 18372 7243 4792 4705 4693 7235 18201
9454 18201 15352 3329 -1087 13249 33440 30660 19986 10055 -6443 -21302 -18540 -14947 -1174
9441 -1174 -4873 3242 9534 15700 15947 17017 22204 19558 13797 11430 24162 32342 28488 22037 16142
9426 16142 -8076 -9547 -2788 2209 -6180 -5709 -7791 -5708 -9951 -23829 -22657 -22909 -17842 -16121 -12525
9411 -12525 135 674 -4284 9184 -2750 -13575 -18413 -18055 -13786 -10955 -11228 -19348 -22703 -16728
9397 -16728 -27899 -30413 -29208 -15941 -8749 -4184 -3173 14232 13096 9554 -7675 -20451 -25409
9384 -25409 -23149 -13795 7592 24833 19108 30144 25215 -3427 -20868 -16042 -10872 -28205 -35932
9371 -35932 -31169 -23322 -15540 1971 14156 9636 -7331 -3830 5793 5317 566 12617 31226 21646
9357 21646 8806 5226 17472 6760 -575 6491 13819 327 -10841 -11392 18797 41278 34483
9344 34483 3641 -3273 2280 -9489 -1141 4241 8662 18936 21484 26161 24558 32530 34334 37732
9330 37732 40754 29720 30933 36879 34595 27348 30447 10246 -1345 -8597 -13156 -10564 -16015 29
9316 29 9419 15579 2946 -5378 1286 -1241 3556 15050 8454 2260 -490 -371 1540 11706 5663
9301 5663 8568 10337 4841 13925 25867 11179 3704 10530 25428 19413 11136 9259 31493 39878
9287 39878 35984 25368 19370 842 -2194 27009 64158 42223 17517 9902 18200 14325 8601
9274 8601 19229 22226 22776 14686 25990 36646 22420 19540 20372 15177 2939 -14489 -12172 -9136
9260 -9136 -13569 2 4516 16088 38320 56427 63764 52263 32650 25533 20913 12388 8960
9247 8960 23830 26150 11122 12974 20883 28094 34745 30001 28147 32187 28996 28868 32328 25849 36270
9232 36270 45295 83513 113807 109442 95917 101144 100198 99183 104113 110189 141864 183783 217856
9219 217856 256156 297261 352451 418219 509554 616162 776304 1026054 1399007 2046915 3187089
9208 3187089 5308222 9022300 12526211 12977342 10558786 6909925 4431436 3033041
9200 3033041 2202114 1684594 1318577 1048519 849866 723407 619776 551846 494106 455619
9190 455619 406512 339368 310490 300733 265693 232371 203166 185549 165065 175032 163725 136254
9178 136254 107015 91440 97744 117870 133659 137030 117467 111701 97014 75578 76576 57669 44440
9165 44440 50540 53213 59571 46475 40503 34139 23400 14067 32883 42789 32604 26629 13167
9152 13167 11797 28584 37996 41297 33476 50090 45180 29264 26896 20404 13741 19521 28335 21276
9138 21276 16661 17027 8565 10026 7897 -3387 -1158 9470 -2016 1375 21710 39379 37833 29629
9124 29629 26294 35918 44386 38408 13008 -3622 -8842 -5194 10703 4862 13612 11876 7295 3317
9110 3317 1788 -11452 -19700 -33252 -26567 -26307 -9564 -15163 -1902 13587 18017 12336 18616 19746
9096 19746 6473 14470 12612 -14155 -25721 -22576 -7897 2732 -1516 -22339 -26552 -12484 13361
9083 13361 24216 20365 15980 15028 11900 -3744 -9668 -1311 -5002 -28922 -16261 3803 8386 7874
9069 7874 10250 12678 -1029 -10786 -7326 -11875 3231 4580 -9762 112 -4479 1893 26233 9950
9055 9950 -11749 -21947 -27993 -22329 -2732 20371 23691 13399 -6070 -6298 5334 -4814 8420
9042 8420 16373 12983 13748 30921 33167 25559 2993 2284 16829 19549 14737 20084 26644 20470 19698
9027 19698 19487 20900 21125 14646 28110 14380 388 3252 3497 -3493 -15620 -18166 3511 15306
9013 15306 4406 3557 2913 11829 12663 -4635 -9128 -15039 -22694 -25685 -14604 -5753 -12681 -26002
8999 -26002 -21497 -25319 -23849 -10191 -7690 -23420 -9973 17287 57740 49531 31622 12937 -1921
8986 -1921 -4632 9390 12665 15891 7528 -5179 -4957 -5882 -3228 -5730 -12022 -13136 -12343 -9003 7484
8971 7484 1097 5808 3067 -1798 -12701 -20764 -7571 8463 5874 17887 14897 1661 20085
8958 20085 22650 16791 5692 -1878 -5714 -13430 -12608 -4068 10429 19513 21745 20027 18044 6585
8944 6585 6455 9906 14610 16409 23261 22165 10122 16270 13578 19625 10255 4613 -3206 12758 7010
8929 7010 -3312 11125 10543 3189 -1646 -7185 -19153 -29320 -26646 -20972 -8624 26044 43638
8916 43638 35270 20263 9988 18540 3158 -13187 -13868 -6455 520 -13005 -14742 5087 857
8903 857 4450 20264 25938 16222 16029 28384 20014 13737 10825 11438 8147 8367 8419 -10161 -13142 -9032
8887 -9032 -1905 9383 13829 -1013 3330 7460 14030 11434 8220 4350 -105 725 -9367 -6462
8873 -6462 -625 2246 -1078 5382 11157 8758 1653 5350 18716 2464 -961 1463 -1387 10210
8859 10210 1788 -16201 -10772 12999 9316 -2234 -11804 -11307 6407 13319 16429 10937 -3113 10539
8845 10539 11404 12685 23598 24082 20192 14495 13113 1583 -14687 2030 -2588 5423 2530 13851
8831 13851 13605 15815 10893 233 -6521 3548 10360 23825 19290 17987 -6888 -23273 -19161 -8591
8817 -8591 6195 16602 17823 9711 4591 -5096 519 3361 16675 20270 6451 -8339 3374
8804 3374 10017 14769 15553 10383 -10409 -26498 -19990 -12210 -15800 -18304 -27452 -44510 -32281 -15017
8790 -15017 -23512 -33699 -21445 3570 1024 3032 -4960 4935 -3051 -15196 -17436 -23083 -20027 -20307
8776 -20307 -22223 -18785 -4405 -17128 -30792 -25370 -2676 -1528 4061 6729 9297 13853 22894 19303
8762 19303 22932 24724 21091 26610 30788 22247 16027 5091 14121 14951 4126 -874 -6804 -16043
8748 -16043 2667 2244 -3374 -139 -8046 -13030 -1945 11741 13136 30001 20726 8118 4580 12316
8734 12316 15531 13845 22010 20229 14895 17038 20966 10960 20311 15296 -7510 8301 8824 2830
8720 2830 3412 4759 -6005 -12855 -21500 -1187 14028 11811 11915 22200 11723 6648 20045 21837
8706 21837 22332 22255 13725 12271 -9847 -14552 -22848 -20382 -14479 -20517 -12144 -15065 -14902 4053 9515
8691 9515 7177 -10505 -18297 -4844 -2087 -11064 -11633 -11413 -9459 -10777 -5309 736 7844 1987 15072
8676 15072 25739 24879 8701 4198 -4034 -19406 -27343 -23458 -14190 -8121 -2455 -2024 3310 19350
8662 19350 17309 15344 17567 19547 13056 13733 11265 -8746 -12509 -6809 -808 908 -3530 -4760 -13674
8647 -13674 -32983 -35121 -31702 -15077 -8645 -18623 -31152 -19600 -25550 -22626 -6148 1456 -6766
8634 -6766 -700 4257 -1918 -4352 1324 12808 15671 17472 -841 -14332 -3184 19165 12047 23111
8620 23111 25928 32983 26413 9161 -5467 -1290 13678 5333 4877 6548 8982 15039 20891 20540
8606 20540 38110 34144 12500 8350 3925 4591 23796 21201 20248 25161 17706 -6590 16695 17214
8592 17214 5632 18851 29164 31018 33319 35303 32681 44860 43608 40317 28977 36603 40102
8579 40102 24309 31586 24555 16409 -1464 4553 18523 16644 14363 11386 -531 -5317 -9099 -16112
8565 -16112 -10082 -712 13541 20120 14124 22078 15828 20728 21025 11211 -8892 -17410 -3152 9727
8551 9727 25863 21463 16207 19500 23760 17771 17218 20871 28357 17424 1679 -177 4591 11377
8537 11377 1860 -1519 -4954 7461 27649 25357 11710 6697 16347 20520 2256 883 -11411
8524 -11411 -9603 6688 6782 -2801 141 -1100 11075 21205 25775 23818 21786 23607 16280 27991
8510 27991 25980 9861 -75 -7297 4087 8591 13981 -3255 -15712 -12363 709 -10411 -12105
8497 -12105 -22659 -27786 -26789 -14542 -9492 -12449 -14664 -16967 946 9404 8948 7124 5924 19869
8483 19869 18213 19958 17063 31042 27953 22570 6648 2464 -2468 10558 4834 5474 6579 28880
8469 28880 33281 19250 15651 8601 12345 10022 2358 -10819 -15906 -17486 -16645 -3725 2825 18054
8455 18054 12275 -417 6974 21527 30909 23381 26460 24936 6215 -13041 -7483 -1345 1927 22425
8441 22425 14897 789 1294 839 -19394 -36183 -32384 -17181 -5274 14336 15693 6880 6786 13505
8427 13505 2419 -15442 -12772 -15906 -23866 -17062 11607 16108 1898 -12551 -19815 -1479 5338
8414 5338 8679 2646 -3405 -11735 -18492 -30129 -27186 -7318 2918 7873 20263 25369 18629 5722
8400 5722 8709 -9759 -18403 -10711 -20989 -22104 -13162 -16909 -7906 -625 8216 26129 27532 14752
8386 14752 7447 18181 20940 21695 18956 20176 31975 21088 27344 20897 18896 -2404 6359 19595
8372 19595 5057 1490 -3782 1755 14371 13430 3484 -21872 -15424 1081 9286 21023 24004 19782
8358 19782 9734 -16861 -36325 -19440 -666 3410 645 14029 6917 3011 1575 8927 1628
8345 1628 -7577 3294 -640 -4857 1223 -346 20774 28683 6215 684 -4139 -16870 -20267 -14053
8331 -14053 -10858 -6756 -15519 -2882 5110 -14409 -1685 15486 15778 16003 7187 15001 4430 2346
8317 2346 1246 7917 11226 11246 14239 17999 14752 17087 -271 -4271 2059 3876 2700 -10008 -2061
8302 -2061 5267 2776 -8435 3916 18396 20494 19332 26638 16171 14589 13137 13501 24063 16803
8288 16803 13671 -1939 231 2268 -1479 -11593 -9154 11428 19813 17056 17434 2746 -7099 -9215
8274 -9215 -944 3383 2367 5911 19031 3843 -6743 -12287 -16610 -21137 -28476 -22878 3435 1820
8260 1820 -15463 -17551 -19146 -6185 -11801 -13137 2597 -2407 -7977 2626 7357 8255 12085 8428
8246 8428 -8946 -17074 -30785 -36720 -13292 -4970 -5263 540 -22691 -37203 -48792 -39872 -23139
8233 -23139 65 2727 -15954 -12416 -23481 -18028 -15908 -5974 5843 2822 -2157 -8062 -1361 19741
8219 19741 744 -11850 -11949 -452 5910 13523 27083 26835 13826 -1791 -23411 -30213 -26857 -9124
8205 -9124 8577 11994 27277 28837 24938 39344 55096 42924 22871 12816 8034 7646 4671
8192 4671 -1564 6426 4712 11706 1901 -5217 -7773 -32938 -34308 -7640 3391 6149 -89 -19000
8178 -19000 -24796 -21725 -24331 -11665 -2394 6696 16848 8315 3165 -5090 -279 23002 26767 4286
8164 4286 -3138 153 -5362 -11531 -24252 -18185 1549 1818 -14858 -29856 -29352 -36201 -23324 -10238
8150 -10238 -546 1776 6734 -4552 7042 27419 43081 31633 -2855 -5402 2562 -9156 -9483
8137 -9483 -12627 -21470 -3864 6882 1965 -8889 -1289 16440 11648 5529 9999 29365 33147 20411
8123 20411 7435 4552 -14925 -27655 -7771 -11677 -20590 -22646 -22829 -5381 15343 16338 8034 17563
8109 17563 28001 46286 38914 25546 18708 4634 6895 10696 10573 11808 9930 18299 8159 -468
8095 -468 -3706 2850 10090 4956 751 -13083 -577 -15295 -34457 -30083 -38382 -30181 -18239 -13934
8081 -13934 -23697 -29686 -27469 -37536 -19880 827 -1342 2258 18352 33058 10403 -17556 -23255
8068 -23255 -3579 7168 17456 50127 53590 25479 -5418 -17053 -13244 -7992 -10113 -10902 -25137
8055 -25137 -17840 -7179 8290 23898 32306 21617 4522 5349 5830 3706 270 8102 8940 11195
8041 11195 20722 32339 35162 37139 27051 34318 33263 21829 1319 17924 26410 17585 32714
8028 32714 27391 10113 10826 -1822 -12521 1300 -4004 2909 13886 3607 18597 26129 14129
8015 14129 -12 -149 13691 19375 15534 741 -9706 2463 18904 2764 3506 3590 -456 -5755
8001 -5755 -13443 -638 19393 22921 3195 4906 21441 21533 25834 30212 19413 17730 10607 -1149
7987 -1149 -2141 1708 6617 -4575 -5816 14812 14796 183 -3244 -11947 -20190 -16747 -29997 -23551 -17087
7972 -17087 -9002 -12233 -3124 -72 -14386 -23704 -29336 -36867 -20163 -25122 -32022 6097 16241 13984
7958 13984 15459 21281 22901 -12302 -14289 -19411 -22399 -11730 -1850 10497 12543 3799 8392 22379
7944 22379 28739 15107 22299 31159 29981 6418 -1253 13788 15774 14460 26028 27918 6894
7931 6894 24426 36905 27897 20829 31548 18144 8994 365 2698 17056 -1200 -14909 -19821
7918 -19821 872 9284 2496 3501 53 10394 5626 -3182 3644 16102 12193 12942 19383 18772
7904 18772 3143 -5259 -8354 -13470 -6361 3320 10379 15510 7416 -5222 -5545 -5344 -12055 -21270 -23479
7889 -23479 -16347 -27767 -27669 -24360 -21958 2771 1787 -1332 -3500 -11149 -1007 71 8410 10173 9437
7874 9437 -4229 -838 20518 23463 25058 20686 21882 18373 3530 813 -9269 -19041 690 20220
7860 20220 4356 716 -11250 4034 18275 7478 3352 4205 13065 10752 15501 9801 11123 6358
7846 6358 14628 17559 4141 -3900 3252 -14878 -18031 -20999 -23152 -6966 3549 4184 14205 2844
7832 2844 -7674 -20870 -252 25504 34136 14370 -6245 11308 34833 45126 32427 10850
7820 10850 13905 7694 330 -1640 2612 9271 7161 17968 -2976 -7299 1859 21294 17888 682
7806 682 4073 29298 42604 27342 12548 13981 9774 21636 26437 11820 -6012 -10783 -2572
7793 -2572 -8292 -12868 -16920 -13203 -21023 -21593 -20853 -27321 -25055 -14542 -11877 -5923 17825 26732 27473
7778 27473 23595 10408 -340 -8897 5908 24546 20998 6100 -3379 -3077 6795 -5597 -6580 -11178
7764 -11178 -18032 -9447 -20527 -22807 -1059 30509 40399 26226 20047 -1172 -21804 -14771 -8858
7751 -8858 -6651 -1123 -4774 -3009 -2385 -7535 -19765 -7109 -4934 14631 30069 36149 34619 31615
7737 31615 13663 -13423 -1175 16143 10641 -494 11621 7912 4531 5472 -5171 -13056 -11386
7724 -11386 -555 7858 7350 8547 13014 18287 14346 -6027 -7830 4242 -3207 -4549 -13735 -29843
7710 -29843 -7322 4214 -8607 -2144 -4849 386 9561 32096 35456 25139 25297 29335 511
7697 511 -22861 -29972 -11588 4507 17763 2986 -14112 -17130 -3529 2052 -3514 2545 2504 -1358
7683 -1358 -16343 950 6418 -1282 -13391 -27419 -19128 -1249 7157 665 -4585 -4851 4685 -4683
7669 -4683 -17676 -18525 -9868 6182 357 -14792 -4344 878 13844 6831 -4556 1734 1079 -109
7655 -109 -6793 11323 15784 79 -13581 -9922 -3699 -4119 4267 -6275 -3379 3528 18455 7214
7641 7214 -2765 -4300 1782 -14774 -25590 -14199 2382 21310 9644 -2182 2148 -4173 -15780
7628 -15780 -24950 -27748 -27544 -10198 -25354 -17255 -13631 -10969 1535 -2972 -4092 17929 24349 16791
7614 16791 -749 -12968 -7099 -6583 -22531 -40857 -35222 -16211 -1701 7131 18202 16483 1569
7601 1569 -17937 -16523 -17169 -9475 -1823 -4426 -18733 -12780 252 -505 1217 -3016 -18607 -21605
7587 -21605 -33442 -41224 -35447 -10337 -10907 -18266 -6960 7112 -4835 -9139 -13940 12410 21578
7574 21578 3381 -12670 -20951 -18791 -13788 -2213 -3936 -5599 -10519 -4212 12192 15072 7335 6600
7560 6600 6591 259 2879 1496 -1753 -12546 -9891 -2771 8840 17624 4121 -12814 -16975 -18352 -2818
7545 -2818 -5412 -12294 -8553 -2136 9837 12427 1116 -15198 -18049 -16072 -22646 -21933 -8257 10505
7531 10505 5254 -3950 -23086 -34155 -13719 -709 -928 -16776 -27621 -22933 -24332 -9192 -7971
7518 -7971 -17226 -9649 -11586 -15716 -809 14973 14651 4479 -391 10713 12107 14631 4022 -19182
7504 -19182 -21232 -17311 7263 8407 -7460 -13607 -8784 -3214 5476 16587 26417 19378 17073 18010
7490 18010 -3395 -17396 -11032 1134 7232 -9444 -17604 -13994 -19782 -11316 967 2037 8913
7477 8913 16870 15306 459 8632 16203 8911 19502 23303 17779 17528 15555 -5084 -17729 -15770
7463 -15770 -9543 -16209 -23731 -11316 -10004 -2689 10286 2127 -2566 -1976 -8871 -6032 10010 20823
7449 20823 33066 19552 10944 2613 -13709 -26588 -28847 -19806 -28751 -27612 -32451 -18011 -7911
7436 -7911 -4019 -2743 4222 -1598 1223 -1423 -11479 -8176 -9352 -2319 -3003 -6005 241 -5135 -13636
7421 -13636 -15504 -2134 -1371 -8775 -14788 -29809 -20395 -7710 -10125 -12820 -16026 -704 -591 8774
7407 8774 32751 21650 651 -1991 -295 15103 13599 2945 19113 24450 30554 23816 11215
7394 11215 5178 -6029 -7831 -15984 -6107 7724 24457 16235 16935 -840 -18245 -18522 -15718 -7634
7380 -7634 -12366 -18857 -21194 -3384 20487 42514 21897 7454 16979 9858 14616 14107 -1452 -16518
7366 -16518 -19210 -11690 -6399 -5747 -11283 -5106 2298 9254 33846 34874 14509 -14520 -12956 -4279
7352 -4279 -6121 10725 5764 13653 19833 19960 4090 11940 25479 28484 23205 15986 11492 -3097
7338 -3097 -17119 1096 -5757 -5078 -4876 -832 -15927 -25784 -8470 -56 -7213 -10428 -8111 -6107
7324 -6107 -8678 -70 -13250 -13771 -15527 358 -5621 598 10112 12936 3521 -1056 1408 -5800 -15787
7309 -15787 -9642 4479 7926 17147 10824 -5966 -5469 7777 23232 -3011 -24286 -11087 -18000
7296 -18000 -14361 -6998 5935 -4869 -15900 -13299 -12445 1180 -112 -10590 -4912 -182 -1736 11067
7282 11067 3398 -11150 -22488 -11628 3160 23582 15235 12066 -1760 260 -3389 -6587 1276
7269 1276 3007 7434 19340 9662 9871 17301 6307 7434 7898 -3378 -17342 -20434 -20004 -18450 -5766
7254 -5766 -4638 -19701 -23799 -10620 -9533 4146 6303 -9547 -13712 -10184 650 6987 16475 15615
7240 15615 -2764 -9636 -1187 -10978 -24866 -27402 -18195 -6801 3859 -16762 -26078 -20522 -21957
7227 -21957 -23912 -11854 -8836 -25368 -21489 -854 7132 16764 17323 1307 -6154 5901 7492 14332
7213 14332 6892 5687 2948 -3418 26650 51024 54049 14153 5452 22666 23254 26585 23337 18771
7199 18771 8663 2925 6533 14558 19553 3670 -15661 -33488 -32961 -14014 -13969 -6018 -872 751
7185 751 9069 16398 23181 21277 16297 13149 3125 9189 18177 24053 19294 8069 9006 6085 6322
7170 6322 20762 29417 11254 -16493 -15425 -6363 -4267 -18475 -21482 -21821 -20260 -4894 15176 8148
7156 8148 -4025 -12293 -5396 13143 30882 20488 5014 4993 7312 5841 -6365 -11204 -1234 1695
7142 1695 1562 8288 5854 -3182 -17584 -18613 -4961 -6126 -7745 -15385 -22707 -15178 -19117 -17018 -23647
7127 -23647 -21945 -15777 -2318 -10433 -12912 -13326 -18296 11752 29583 29676 24169 9738 3436 -7573
7113 -7573 -4716 -16948 -21550 -15954 -21670 -19207 -34421 -26261 -18478 -2491 -3961 -20426 -17086 -4683
7099 -4683 -20493 -1873 23269 16704 -4761 -9853 -2608 -11691 -2785 5949 17391 12464 12379 6013
7085 6013 359 -5971 -2148 4332 6040 9160 5983 -1766 -8490 -14389 -13162 -37426 -42319 -25100
7071 -25100 -8438 13719 -1816 -6983 -24200 -27488 -24172 -24183 -8200 3625 3971 -12678 -26933
7058 -26933 -36689 -38403 -40211 -17456 2008 4701 -1360 14740 22949 8599 -2476 5747 -1599
7045 -1599 -19349 -26543 -12300 7097 3852 -6982 -8127 -8672 7608 2828 -22076 -34748 -38591
7032 -38591 -30487 -17079 1409 -1209 -7132 4733 -3182 -21942 -14972 -12741 -15771 -22153 -15213 1611
7018 1611 2806 4814 17500 7364 11823 12735 3041 14748 5411 -15165 -19369 -8978 13860 30763
7004 30763 17896 10160 -5722 -10837 -16725 6034 24011 10294 2230 9870 18803 9932 2470
6991 2470 -14036 -15312 -18350 -5463 3104 8889 13079 -465 14267 -149 -9444 -5147 -15494
6978 -15494 -36870 -34910 -15068 -16531 -6458 12689 11801 21501 24771 21851 17270 3457 -2386 -4851
6964 -4851 683 -3698 -13425 -8964 88 1995 -495 -12055 -19883 -497 -9342 -21881 -17134 -20684
6950 -20684 -21778 -16244 -13917 -18641 -8444 1916 -7436 -14023 -20731 -1763 8400 -338 -14786
6937 -14786 -19300 -23942 -9613 -16537 -18274 -2 7973 918 -5910 7090 6974 -7357 -23647 -30136
6923 -30136 -14620 -1203 -6417 -6606 -1628 -989 -1791 -8442 -7633 -6638 -4882 3172 11990 20448 28810
6908 28810 11438 7052 12023 19298 13370 -9416 8903 11593 -7798 -22969 -9994 9361 9850
6895 9850 5756 2535 -3111 -21403 -41421 -19172 -13567 -2514 14122 13652 2726 15638 13630
6882 13630 -1420 2188 6463 -14774 -20273 -9564 -8862 -7030 4668 439 908 1792 7498 657
6868 657 -15620 -17191 -9356 -15324 -7147 -10905 -21620 -18618 -21701 -32237 -21174 -20139 -19232 -26977
6854 -26977 -21096 4502 17849 9781 2782 -785 14811 7972 18652 19085 14367 21234 23955 18566
6840 18566 23656 16135 -3547 -544 -1056 -11636 10142 6213 2245 12566 12097 16330 14597 -5589
6826 -5589 -26776 -30334 -31928 -16312 -1942 3027 -3400 -7550 -11652 5347 14011 15332 15673 9138
6812 9138 11836 1033 -14002 -23708 -21921 -31163 -29142 -13993 -305 4097 -16892 -25722 -18176 -15167
6798 -15167 -13100 -17734 -11747 -122 16 -8576 6463 25774 620 949 11929 14518 -2845 -19364
6784 -19364 -24103 -26730 -26948 -9565 -327 -2819 -6517 9754 16051 4492 -22117 -16435 905 9714
6770 9714 2769 -1608 -15487 -4099 -5380 -11273 -928 7263 5376 8390 10349 17706 21858 9701
6756 9701 -7475 -16161 -26903 -16150 3082 12184 6302 9205 21742 45804 41581 23206 7300
6743 7300 -20269 -29908 -24496 -22537 -13902 -5145 -13113 -24360 -52292 -40526 -14565 -1979 -11312
6730 -11312 -24504 -32237 -29076 -19180 2076 12465 6077 142 -7146 -6497 -11383 -18312 -3722 -5239
6716 -5239 -8730 7074 29762 57308 76085 84948 100873 115820 105303 81108 34615 10829
6704 10829 12773 8547 -15037 -9277 -7627 -1962 -10193 -5598 13098 11371 -7146 -735 2438 -10720
6690 -10720 -9112 -6658 -20388 -10911 -2568 -3631 -17473 -16799 -10516 -17527 -15996 2597 -700 -23498
6676 -23498 -25987 -29255 -34268 -7712 9737 13502 19789 1673 8158 6633 -391 3454 -575 -5403
6662 -5403 14566 9989 8084 305 15578 22796 21855 15985 8069 -7859 -6736 -4650 5225 7165
6648 7165 16717 5107 1450 -14762 -19324 -517 -1251 2242 15049 13627 4739 -808 3878 -2391
6634 -2391 -10289 -17034 -7655 -2674 4428 -3463 -2301 16005 16278 12241 10500 29009 18328 1591
6620 1591 -19370 -11393 -10352 -10870 -14071 -2367 21171 35150 36775 30684 22073 10004 -6265 3697
6606 3697 1456 -5501 -10444 -18857 -11784 -1429 3714 -1164 -11126 -4205 -1070 -209 1466 11303 13405
6591 13405 8088 18386 28885 10125 -13306 -15801 -8633 -16744 -20299 -21547 -14298 -7415 -19340
6578 -19340 -19515 -21850 -18969 -8040 -16272 -15689 -8680 -114 478 -2616 10461 17765 12292 19385 5263
6563 5263 -8988 -23482 -30438 -16789 2124 -2686 -11640 -14038 -1220 -3998 -7127 -16499 -11663 -10243
6549 -10243 -4383 1950 21043 25056 42913 48100 35864 9153 6622 6240 10693 600 2569 6363
6535 6363 22353 25113 2984 -11655 -20228 -31644 -24473 -9088 -3861 -10680 -8546 2935 -11806
6522 -11806 -14580 -9576 -4890 12470 2318 -6026 6027 -5326 -11828 -21728 -12669 2803 3999
6509 3999 7551 18841 3103 -8368 -2330 -7763 -6205 -8051 -5471 -15579 -4975 10571 10010 15717
6495 15717 21247 15424 929 6899 19113 3922 -9458 -3543 17277 33868 28461 22971 29877
6482 29877 19107 13734 -1914 -6642 3287 19610 11684 -3485 -17837 -22912 -21359 -23211 -14508
6469 -14508 -1561 29214 46761 51651 50116 34344 19125 915 -2003 532 -1626 -10532 -31031
6456 -31031 -39992 -25197 -5783 -4489 -780 13815 17385 38718 49694 56127 45222 16310 -1200
6443 -1200 -21429 -24201 -17643 -16202 -17386 -11619 -15200 -10331 -21155 -23559 -138 7789 11335 22533
6429 22533 4720 -1895 1412 -872 3763 -405 23408 9883 2478 -6435 -18791 -29987 -30201 -34251
6415 -34251 -31844 -20855 -23405 -31780 -13431 6378 5827 12239 12254 8378 -7591 -17207 -1755 -6079
6401 -6079 -904 -4095 -11018 -1876 -2128 -12574 -19494 -5202 6532 7226 -207 8812 17808 29791
6387 29791 39788 49001 29317 11594 14699 19542 17826 12021 12006 -19256 -38391 -21861 -19502 -25249
6373 -25249 -9371 -2048 -9394 -18525 -18389 -4247 4578 661 6634 8628 -3466 -15588 -15002 -4857
6359 -4857 -11909 -43874 -41821 -19762 -5248 5201 29203 24142 24954 8721 -5811 -24679 -37891
6346 -37891 -37612 -35956 -29976 -25605 -9174 4164 5921 7200 11325 4854 3283 8052 18222 22769
6332 22769 -2286 -11232 -9981 -2741 5659 12332 20458 28551 -223 -24366 -22382 -12206 -4107 -1809
6318 -1809 6251 -7462 6729 34371 20851 15943 21791 21677 8107 -25078 -23657 -3889 12579
6305 12579 -942 -16770 -19410 -9702 -14391 -11283 595 -17017 -16286 2638 1948 15913 27551
6292 27551 29289 29941 7218 -8605 -15116 -18137 -35185 -41088 -21922 -16003 -14156 -6435 -6772 -9219
6278 -9219 -17340 -23465 -5062 -145 -14082 -11628 7410 12254 13679 -676 -9367 -3727 -189 -9946
6264 -9946 -14804 -24929 -23958 -28463 -19964 -9303 -7245 -2937 20916 1551 -13953 -9271 8404 7949
6250 7949 7814 -4735 -6537 6229 11146 3081 -831 -4235 -706 -6192 -17712 -12703 -9338 -5377
6236 -5377 2624 589 -5987 -5185 4156 -4304 1978 -14287 -14593 -1036 1844 -199 -9892 -11162 -10396
6221 -10396 -1300 388 14159 34140 17047 4064 10227 21720 2039 -16762 -15535 -5064 11574
6208 11574 28407 23105 2327 9333 12223 5752 9243 13715 7817 22830 24581 16079 -3699 -17613
6194 -17613 -23273 -25779 3837 22497 27118 16745 22999 24102 26636 34888 40659 24096 10196
6181 10196 -652 -4149 10161 3738 -6220 5757 14661 20945 9886 7986 15992 31146 29722
6168 29722 23347 17109 8051 -4664 -16766 -6909 5926 5577 7771 5818 -1983 -6412 -9470 -4307
6154 -4307 5837 11 -8232 4551 8110 13032 -2985 7201 -5454 -11941 -22459 -15417 -14936 -17781
6140 -17781 -6893 -6310 -225 14092 29549 17952 -1680 4516 13739 23541 32412 37829 28770 11417
6126 11417 9277 -299 -11507 -20532 -19743 -15789 -7547 11821 11346 -1096 -5599 -12235 -3904 -3262 21317
6111 21317 24600 13969 18034 8572 15119 10826 7000 -4261 1736 7140 3261 -11893 -15224 -13464
6097 -13464 -16882 -18048 -24389 -24626 -17440 -8807 -10996 -17118 -9528 -11082 -18169 -12026 -17135 -19160 -22235
6082 -22235 -17612 -12274 -19163 -27818 -34833 -45396 -32855 -6227 580 8497 7445 4366 9611 1301
6068 1301 6733 14091 21020 9127 -9245 -6975 -5372 -15279 -999 27569 34806 14337 14446 13972
6054 13972 4557 -17520 -28214 -17188 -2463 11119 2241 -17002 -5780 7281 6032 3240 746
6041 746 9367 35189 27971 15561 277 -3972 -7831 -15953 -16861 -384 1149 6570 16830 17883
6027 17883 11034 -10703 -27541 -29399 -3312 -5009 -13023 -16952 3355 17365 25468 7467 -8192
6014 -8192 -11717 -38508 -49912 -46664 -38453 -27771 -35208 -32166 -15235 -16102 -40952 -31414 -5342 -9340
6000 -9340 -2441 7240 19022 18218 3988 -11535 -8561 -2299 -12102 -10782 1098 5813 5462 -1265
5986 -1265 -18467 -18360 -15466 -5212 7256 9024 2999 2567 18081 24812 29861 21747 3233 -16872
5972 -16872 -21217 -25437 -17930 4183 61 -1502 14707 9494 10811 3850 -7117 -20485 -5054
5959 -5054 10370 8678 -1881 8421 8924 5850 2130 -434 4055 15366 23213 4651 -11469 -31733
5945 -31733 -44438 -42206 -29813 -15299 -15990 -14284 -12467 -9661 -12114 -12066 -3967 4353 1147 11799
5931 11799 6801 17378 8607 4215 4605 -2333 -7154 2815 12908 6312 -4311 3914 13699 17983
5917 17983 14817 10959 28623 17573 804 -11434 -10488 -1941 2971 -4859 -19297 -11402 4694
5904 4694 7536 15272 17980 10348 34449 25786 23440 -7525 -14767 -13934 181 -4824 -21310 -11719
5890 -11719 15493 5638 -11977 -797 6793 -9691 -26172 -13120 -2263 573 8930 4487 -2000
5877 -2000 -13340 -4176 5949 -1659 3154 3318 23378 40567 24775 12425 -14265 -8551 14992
5864 14992 8489 -2206 -1256 -805 -3312 -766 2387 16411 9375 6156 -4347 -6375 -10 11798
5850 11798 -5972 -15696 -7696 -7055 -9568 -2909 -9756 -12421 930 14359 -3573 -8320 8969 -76
5836 -76 8532 25334 16965 -830 -11326 -8458 -7792 -15896 -22549 -7526 -2469 -8944 -23611 -11694
5822 -11694 -7099 -11275 -18888 -4235 4580 3525 18392 13352 -13283 -25380 -17096 -10304 -5088 -19236
5808 -19236 -24882 -19799 -22107 -25237 -27807 -16171 -6018 4860 9764 8898 8422 10440 38777 23644
5794 23644 -3433 -14820 -4605 1242 7250 7880 -327 -13571 -19002 -12451 -20138 -34132 -25431 -12699
5780 -12699 5942 -15338 -11599 -4923 686 -9583 -29350 -25914 -11173 -8756 -2383 1496 1104 -305
5766 -305 -5635 -2952 -2888 2944 23653 25230 12779 -2707 -2226 -12487 -27227 -25220 -16047 686
5752 686 -13702 -10477 -6853 -6512 -9567 -13726 -17526 -3742 -538 -9263 -9893 8610 20206 13446 3141
5737 3141 -2857 1472 24740 20000 17373 16342 -7147 -11616 8745 17412 9297 -651 -11913 -12007
5723 -12007 3056 8977 24542 18164 4994 630 2652 21323 22704 8975 4339 -14420 -17791
5710 -17791 -15824 -24908 -25272 -23949 -19580 7510 13156 -39 -11842 -7336 -9317 -11624 -16573 -21860
5696 -21860 -23617 -14634 -3680 -6609 -650 -5719 -21688 -30166 -6054 16804 13923 -12250 -32878
5683 -32878 -20095 -4975 -1288 -6173 -8997 -1617 2757 5136 2281 2313 -13337 -21061 -11252 -602
5669 -602 -7095 -14743 -8749 13163 14749 2585 1733 2540 -8532 -3335 16191 19682 4193 -18929
5655 -18929 -18294 -20944 -23227 -25310 -10586 2174 -2212 -9956 -21230 -21539 -18521 -17714 -5952 -14880
5641 -14880 -36278 -57461 -32553 -13485 -15941 -15274 -2253 12727 3410 16898 28554 14640 10886
5628 10886 -2279 -1200 -4629 -22215 -20539 -9640 14557 15225 30061 32942 28883 24151 14135
5615 14135 1295 -5687 -1605 -8433 -10193 2041 -13310 -24837 -15408 -15408 -15332 -20255 -33308 -36084 -20390
5600 -20390 2914 7376 4954 -19157 -28669 -35747 -32336 -18255 -5552 11892 22776 21499 -4622
5587 -4622 -15643 -14757 -19452 -5078 18202 10217 3126 -15432 2222 27229 32327 21787 20317
5574 20317 18116 21357 16586 9441 17760 14008 -1464 -4937 5889 4684 7793 -1373 4267 21211
5560 21211 17325 -1812 -8902 3360 16303 15132 -23741 -31528 -14283 444 -659 -13863 -10429
5547 -10429 576 2426 -430 -8506 -924 21203 24919 24084 20745 834 -9040 -10304 -6813 -1030
5533 -1030 10236 11903 15599 6134 -15555 -13642 4795 -7384 -26648 -36195 -32333 -12515 -17308
5520 -17308 -10934 2353 470 -4023 -9165 -17206 -2033 6109 2204 -14009 -1583 9876 16867
5507 16867 18392 -1607 -2719 -5232 -6959 -7538 -5404 -9147 -16637 -26822 -22204 -12917 -4612 -4976 -9188
5492 -9188 -13245 -16335 -25293 -6614 14685 8691 4983 18966 9358 4326 9236 20808 19251 18383
5478 18383 11986 3624 -12145 -21575 -22397 -4928 -4270 -187 -2255 -14317 4291 -11493 -18918 -13576
5464 -13576 -1842 10828 12325 8410 1795 13032 7170 5701 11758 9876 -1045 1674 5172 -5773
5450 -5773 -26934 -27402 -19603 -5774 7864 11847 10669 -6406 -19517 -21163 6256 12327 17257 17884
5436 17884 298 -17446 -39163 -19170 -5335 7212 26362 29432 9631 4637 5481 13332 20381
5423 20381 3402 -6314 -347 -13651 -24193 -25911 -11324 7850 -9331 -4480 10638 5701 -6005
5410 -6005 -28107 -30612 -8202 4426 9778 1782 -6934 -5432 -8100 -17149 -14356 -28075 -37090 -30061
5396 -30061 -18809 -26928 -34080 -16971 -4258 11932 9630 26652 46782 42570 29565 30311 4528
5383 4528 -774 16549 17607 22969 -2499 -7672 5807 -5319 -13408 -11826 -30595 -38966 -25315
5370 -25315 -10597 -2563 -2795 9412 7328 1634 3199 13423 8839 -1973 6979 17077 19009 9994
5356 9994 15137 25671 34710 6283 -27082 -25739 -40754 -38137 -24499 -17245 2300 16665 27101
5343 27101 23332 14250 22601 26014 6041 -11638 -12323 -24407 -28263 -30249 -12247 -55 -5919 681
5329 681 5322 -3208 8096 16202 12779 6916 7871 11222 3924 -21432 -24980 -17682 -22917 -13277 -6531
5314 -6531 -16711 -21784 -3646 3064 1347 -6589 -3037 6591 8530 9366 3142 -3622 -16895 -13903
5300 -13903 12320 13251 -2737 -977 -9187 1530 -7014 283 9312 4602 -5059 9385 -5062 -14565
5286 -14565 -8336 21185 36486 39473 34515 21894 12741 589 -9018 -14345 -6593 1199 4212 14557
5272 14557 13657 14418 -8726 4293 5017 -4387 2751 -14112 -23325 -10580 -10301 -7497 2153 -16828
5258 -16828 -12954 -23183 -13421 2377 -1919 10861 4039 -4903 -24584 -47130 -51273 -47606 -41539
5245 -41539 -40588 -21137 1738 -241 -3765 -12203 -14590 -27818 -41507 -41129 -21664 -13579 -2825 -14716
5231 -14716 -21800 -20453 -6590 3074 33518 46451 20201 6387 16978 26152 29524 30076 10558
5218 10558 5345 -3141 -6335 13307 28806 17329 -3869 -15703 -19875 -4952 13296 26944 25454
5205 25454 25374 38099 31192 39042 20986 21179 29840 21153 1019 20124 21979 29660 20885 -1527
5191 -1527 -8042 -3040 -16442 -15272 -663 7734 14716 2517 -4444 -441 -9427 -14200 -14552 -13971 -2996
5176 -2996 9693 -444 -14295 -25456 -22003 -521 9604 6074 -952 -3077 -5523 -14778 -7584
5163 -7584 -3047 -6706 -7515 12534 36277 47053 25112 19893 9530 6208 441 4008 -3314 -13035
5149 -13035 -12834 -7586 -19375 -18920 -27017 -33722 -19211 -29012 -30836 -35871 -27833 -22759 -24693 -26003 -34653
5134 -34653 -23544 -11081 -27798 -34729 -26132 -20973 -6372 3373 24438 14151 8982 -3548 -12030
5121 -12030 -10396 1663 2173 835 15081 24313 13408 7582 24022 35509 34097 41110 39514 28112
5107 28112 19699 5784 -899 9026 10030 16791 39996 22978 803 -5903 -1965 -4886 -905 296
5093 296 5173 21110 42310 22052 -730 -8726 1312 12028 -636 -2636 3728 -2986 -9846
5080 -9846 -6236 -3741 -12248 -5585 9035 5666 -11884 263 11032 5978 8649 4934 -3734 -10590
5066 -10590 3294 14746 -3030 -7817 920 18444 15493 8809 2949 -2778 1971 -6860 -31617
5053 -31617 -37055 -19901 -12603 -2772 -12410 -29437 -4632 2809 -8972 -14680 -19892 -24441 -5509
5040 -5509 3089 9177 7010 2298 -17752 -11114 -3677 5699 -2336 -9102 11209 17432 5440 974
5026 974 4467 -10634 -19470 -26138 -16042 -10696 -9983 -10091 4150 8584 18858 10853 5750 -6183
5012 -6183 -10757 -8293 8788 22339 19576 12884 5434 14144 7053 -2608 -10903 -5765 -15622 -12839
4998 -12839 2318 7673 421 -16410 -15224 -4697 7317 23961 14068 472 -4228 -3939 -422
4985 -422 -6994 -18643 -15584 3060 1130 -8460 -2303 1560 6948 181 -6523 -11617 -19696 -24818 -19059
4970 -19059 -3819 1555 11289 4494 -3622 -8614 -10133 5716 20434 19300 -2518 12675 36845
4957 36845 29174 2062 -4691 -4160 -990 21712 23893 16548 1129 -4921 2223 1148 -2606 17064
4943 17064 12963 5991 14176 20136 25256 25823 11253 5169 25088 44831 35749 42026 39655 23933
4929 23933 22803 33212 29322 9671 -1098 -2154 -18844 -20947 -5312 12555 18844 21503 5132
4916 5132 -13941 -16369 -8414 5083 11746 -9251 -22006 -22021 -4525 -7268 4094 2276 -8222 -7365
4902 -7365 394 1970 1781 -5842 -26869 -35856 -33891 -39713 -25192 -7653 -7757 -13757 -12099 -8810 -12233
4887 -12233 -9933 -2498 -4215 9318 21882 32155 28041 22982 11770 2874 8492 -6741 1269
4874 1269 12744 24763 10967 1623 -2077 8194 10183 -4015 -18049 -18407 5166 11151 1981
4861 1981 -6791 -7439 -16928 -6251 2982 -5547 -12557 -15857 -28785 -28329 -30276 -28326 -30925 -23709 -15897
4846 -15897 -17875 -22748 -9861 -17390 -21986 -26912 -20890 -3162 -4340 -13010 -24618 -30094 -16276 -7161
4832 -7161 12632 24062 5269 10108 18945 32769 35537 30310 3148 -15458 -204 569 11988
4819 11988 1252 744 7120 7534 14790 16217 27093 28944 13918 6440 2708 657 3034 2593 -2532
4804 -2532 -4736 5552 16518 17271 -1241 5169 3455 9467 25565 29289 -28 -22285 -17053 -19668
4790 -19668 -10436 -6911 -19544 -16684 -23904 -12531 9127 13392 1269 3251 2083 882 -1358 -8053
4776 -8053 -4937 8364 5496 -5995 -11829 -19863 -9219 -9157 2756 2226 -6785 -11363 -16016 -16099 -13907
4761 -13907 -35287 -39965 -30821 -32581 -32480 -28870 -20371 -1938 -7683 -20308 -22360 -14025 4719 8034
4747 8034 -2873 -14326 -22043 -29969 -16563 -5748 10819 21139 -54 -18695 -14263 -5532 5024
4734 5024 21811 16131 13981 20945 13207 17659 12444 9585 11015 10879 12825 15584 18286 27076 16233
4719 16233 3670 10537 26839 31951 18014 1566 -7708 1626 13278 458 -641 -6649 -10463
4706 -10463 -16647 -14017 -13471 -28234 -22715 -16324 -14842 -13671 -4084 2360 2302 338 -3586 16033 14215
4691 14215 2269 -4099 -348 7349 -7165 -6015 -3151 12471 16673 30841 24792 19311 12487 10959
4677 10959 15135 24008 23618 4227 -2881 -617 6560 8512 -4471 -29726 -26637 -23680 -3679 21049
4663 21049 24522 3774 -3612 -5730 -2682 3105 17250 21544 -326 -4645 5890 4666 2132 -3963
4649 -3963 1886 6813 805 9479 17074 12971 19396 19489 20790 12235 11872 8742 6789 10766 -3113
4634 -3113 -7602 -15136 2736 -1791 -9410 -10629 -5553 -12586 -211 17084 5736 14744 7063 1816
4620 1816 -2177 244 4274 10435 10806 -13942 -20703 -35581 -17943 1433 -6837 -9836 -7059 11402
4606 11402 29184 34512 19997 9803 17129 11809 18111 23611 4983 12680 8200 -9669 -21153
4593 -21153 -13063 -5812 -3345 9689 93 -3325 7125 16629 6020 -10930 1775 7266 6804 -17291
4579 -17291 -17700 -10308 -6050 -8296 8900 27432 40844 39312 18850 10771 15292 5849 2328 2185
4565 2185 189 9170 13774 20729 27251 35938 39918 50138 41780 21086 6089 -10236 -25492 -30913
4551 -30913 -23138 5651 15389 8242 1242 -5230 777 372 19432 32463 32702 28224 18172 21117
4537 21117 13315 18240 35488 37959 18293 15515 15398 14368 18770 18269 23672 21927 580 472 11084
4522 11084 21505 30441 21124 3574 -2844 2035 16420 17242 38179 54313 44713 24691 -5755
4509 -5755 -2427 22305 -1586 -19074 -4951 849 -3607 -24221 -8846 4664 10327 26634 25946
4496 25946 11585 406 7090 34097 44508 34123 35121 40462 33554 14875 -6356 12400 18663
4483 18663 1354 -10802 -27516 -16653 6368 13813 726 -4766 -6002 8093 26071 22025 8831
4470 8831 2329 5749 2692 1520 -7351 -12403 -1567 5080 2960 818 -3163 -1358 -13032 -3321
4456 -3321 5676 6632 5183 3794 4125 -1209 -22096 -28950 -14184 -19140 -7244 -743 4608 2717 -6520
4441 -6520 -11804 -2679 -12493 -22218 -25547 -24082 -23961 -17166 2905 14807 17180 11270 -8068 -30362
4427 -30362 -33111 -35299 -41603 -38232 -31604 -36005 -32580 -31374 -29468 -26234 -22527 -27375 -32573 -45244
4413 -45244 -51997 -55107 -42671 -25910 -23743 -15603 -3813 2058 -12707 -10822 -9666 -2218 -1003 397
4399 397 11422 26132 18793 20772 15920 7844 17021 1384 -10383 -25188 -35965 -31572 -19023
4386 -19023 -4717 1848 3940 9394 -3212 -3117 4721 -70 -3303 -19649 -28203 -22346 -35529 -25341
4372 -25341 -32521 -47978 -32184 -23841 -43390 -50128 -35060 -11750 3160 6526 15724 29183 19292
4359 19292 9435 10548 3105 11698 14793 24454 31815 27389 27622 24105 18555 19363 15736 -10841 -3974
4344 -3974 10235 5035 -6685 -1931 4843 1604 -14273 -13098 -6945 -2186 2669 -7620 -11424 -8008
4330 -8008 -18588 -18385 -4396 -15189 -10912 -4973 -9666 -16177 -34202 -23888 1659 5532 19310
4317 19310 21800 21325 32532 31937 10483 2152 20499 6179 -7054 -13586 -12166 -9178 -17813 -8552
4303 -8552 -8810 -5243 -7751 -5500 -1657 931 -203 9482 -12517 -32542 -32066 -13442 -5232 -21627
4289 -21627 -15908 6874 14783 -10574 -16583 19 4249 3960 20120 20511 5190 -18634 -29076
4276 -29076 -24623 -13556 417 8831 -2037 -619 -10541 -33912 -27643 -8635 5416 -7668 -17926
4263 -17926 -11924 -1559 -8997 -5522 -946 -12706 -17280 -23672 -13008 -18753 -19713 -9620 -15237 -31759
4249 -31759 -32255 -17283 -18109 -6658 2517 2430 -758 1325 11223 1914 -8800 -5405 16825 11631 -9394
4234 -9394 -28244 -31664 -21329 -23719 -31048 -20859 -18844 -9485 -19530 -26996 -29057 -11598 -12057 4418
4220 4418 28521 20948 16624 16248 10271 15175 15234 14178 5511 -3863 -16046 -29529 -26321 -21655 -27385
4205 -27385 -34919 -32394 -41607 -27564 -2993 -20990 -34455 -12781 1329 6773 6686 -7394 -9756
4192 -9756 4222 835 -6178 3423 8077 2442 2405 6768 10055 731 -15177 -31185 -38999 -37387 -33076
4177 -33076 -33861 -22363 -5103 -4175 -4700 -5850 -11094 -17104 1117 4642 10058 23616 17653 -1454
4163 -1454 -5191 -13545 -21379 -21244 -21567 -36706 -35576 -24277 -28907 -25651 -28536 -6315 -9875 -5011 11259
4148 11259 27768 38525 24956 5917 -6261 13135 8246 -10115 -13651 -26035 -30597 -17941
4136 -17941 -14981 -13474 -2560 3426 8183 16437 14289 13732 9194 11500 10680 -5679 -10846 -19618 -7900
4121 -7900 -1426 8685 -8979 -31530 -43723 -26264 -18978 -14423 -12203 8331 -4321 -17170 -14275
4108 -14275 -6425 2271 9716 8255 -3788 -14440 -21348 -6322 13824 9721 6459 759 12759
4095 12759 -4560 -18368 -11975 -1538 -1070 -10034 5544 14454 12586 -9295 -14413 -19482 -11026 -2516
4081 -2516 -17742 -24230 -27421 -17287 -8867 12892 16260 -4558 -5919 16031 24218 21246 29902 30544
4067 30544 14927 9723 19799 30030 26634 12980 -9238 -22862 -15826 -22571 -18298 -3570 4839
4054 4839 10783 -6388 -5628 3681 1728 -5474 -8293 4743 18566 14314 3184 15342 207 -29457
4040 -29457 -37328 -19717 -13465 854 -5299 -491 -12497 -10958 -9570 -2414 -5472 -3624 2020 2473
4026 2473 -4454 -5147 8582 7209 -1254 -30 -17130 -11673 -6928 -21264 -19961 -11669 1219 540
4012 540 -19230 -16961 5219 7626 14053 18314 15897 14741 4953 -5792 -14002 -3119 1773 -10082
3998 -10082 -6876 -1306 -13630 -28349 -18951 2791 5966 10372 2178 -30063 -35838 -9366 -12434
3985 -12434 -6616 3504 3140 -1189 -11502 -33494 -28828 -22085 -14593 -11544 -18549 -15985 -13842 -2433
3971 -2433 4761 12300 18361 16609 2560 -6784 -6728 -920 10707 35844 40363 24561 7695 12557
3957 12557 7582 1917 -4694 -9625 -9841 -29574 -34290 -11238 -5212 -2408 -23183 -15373 2716 14558
3943 14558 2036 -6810 9989 144 -21682 -21441 -6780 10398 16875 17203 12423 3770 7490 1981
3929 1981 -12618 330 15144 10883 10358 22416 19602 13723 8721 6367 15262 20175 14119 17367
3915 17367 12940 -2814 -8104 836 16925 12286 -954 293 -4219 -10754 -3967 10440 16605 -3978
3901 -3978 -10821 -3044 6706 -3539 -1201 -19651 -424 9274 14007 -3875 -3240 8807 28006 19003
3887 19003 -1619 -2257 -104 -166 8253 -1727 11162 27800 25189 7808 1898 -2500 56 8693
3873 8693 16511 1729 -9292 -8828 -9299 -13652 -6281 2806 7733 6375 4314 -17510 -46344 -38848
3859 -38848 -30710 -13847 -17851 631 3526 2254 -10180 -17698 -16672 -27694 -13427 9212 6512
3846 6512 7960 6606 -21432 -21398 4020 8858 8884 15918 19780 11723 9060 6223 -6059 363 -11657
3831 -11657 -13635 -18354 -21418 -8795 2607 24628 14177 -4643 -3863 8136 12116 -4539 -3647
3818 -3647 1959 6375 -4647 -13648 -20343 -13557 -11708 -14974 -32794 -40956 -23505 -4170 7657 3291
3804 3291 -6596 -7033 -7814 -20886 -34528 -29027 -17477 -12591 -17859 -17118 -15560 -10849 -2682 -4108 -20370
3789 -20370 -30849 -18513 -17460 -11421 -4106 -9137 -7794 10488 18630 16507 10672 3213 -1819 20498
3775 20498 37015 29887 22265 18589 19809 -3057 -17339 -10168 -15292 -18147 -16240 -9124 -12690 -2301
3761 -2301 -6775 -15502 -17844 -16086 -5663 -12775 -14543 -2051 9135 3517 -6720 -14702 134 4761
3747 4761 26007 18747 21554 32739 25014 5919 6462 19799 17423 4675 -18066 5791 25456
3734 25456 28598 21851 6886 3616 7607 16194 6244 679 -7551 -16112 -14159 -14190 -10300 6301 -14224
3719 -14224 -18017 -1987 1622 -812 6945 3004 2241 7083 1327 -5039 -5573 -5479 -11750 -15008 -13269
3704 -13269 1813 3365 -1522 2971 750 10834 13811 7973 8018 4646 -8890 -18420 -15388 -10064
3690 -10064 -17185 -24946 -30858 -19757 -20128 -6111 2009 -10561 -7145 -20579 -31129 -22153 -10828
3677 -10828 -5111 4386 7108 3171 -15620 -14185 19949 37244 42770 40516 34935 19152 12641 3492
3663 3492 -2292 -4934 -13657 -5367 10357 20093 23220 17409 16298 16295 21284 17875 9538 13133 21664
3648 21664 10117 3633 2891 1731 5315 11808 11815 29183 22297 16635 25163 8811 -948 -3396 -14441
3633 -14441 -31546 -37673 -21573 1679 -2975 5472 -1804 -12069 -22737 -13660 -5948 376 14167
3620 14167 17354 6777 308 5130 13193 24959 13600 -6937 -28053 -29331 -22891 -13011 -17554
3607 -17554 -25547 -43040 -50554 -49857 -54499 -50152 -34676 -35739 -32389 -18101 -5809 7120 5347 -10601
3593 -10601 -6889 -14537 -10708 -7237 -7061 -7817 6066 10531 8617 3919 -5279 -13 13092 25185
3579 25185 23679 15921 4740 5932 2728 -4830 -11232 -11335 -13834 -18347 3163 32021 25118 -4708
3565 -4708 -3976 9582 8830 -417 3765 6570 18941 21184 -8613 -9110 2180 8288 -1476 -6900 -12141
3550 -12141 -6722 -3327 -3709 260 -12155 3427 27825 23310 6108 -833 -19606 -41011 -37271
3537 -37271 -16347 8761 -13068 -26623 -14227 -3308 1731 -3363 -435 -32685 -32270 -14699 1980
3524 1980 3732 601 -11330 -18331 -18635 314 19469 39335 26859 12557 -4788 -14289 -6423
3511 -6423 3627 16251 15845 4083 -18928 -30738 -33949 -32559 -32443 -11378 -12687 -24721 -17118 -3124
3497 -3124 17414 14388 -5196 -1906 -1150 1206 16515 12871 13408 10269 -3626 -26692 -34356 -5044
3483 -5044 23671 20306 13390 26619 39986 22571 2230 -1757 11644 9336 27218 29954 7825
3470 7825 2452 9884 22274 15343 -6448 -15237 -7990 2727 -18021 -1269 9135 9590 16185 5600
3456 5600 -18741 -16426 -11061 -2939 5317 21256 17151 12989 3379 11240 16578 -4294 9316 19935
3442 19935 26456 46642 63703 37753 17381 11915 26759 12747 3186 11200 -14895 -17170 -11181
3429 -11181 -6873 2111 20020 20270 4002 -6701 -8364 -27025 -30668 -25246 -7386 11037 5631
3416 5631 -9544 -2871 4766 5927 5808 4778 5929 2482 -13686 -21797 -11143 -10704 -18564 -6055
3402 -6055 -2972 -3959 -5320 -13603 -12671 -9889 13943 37292 44843 31112 5970 -10029 -13461 3213
3388 3213 1228 -18529 -31424 -4280 6876 9483 8843 14851 7757 -2345 9592 11387 -11963
3375 -11963 -1589 8580 2518 14077 17696 -7088 -19530 -23819 -22482 -14832 -21729 -20805 -22870 -15788
3361 -15788 -560 14595 22871 31413 26044 19567 20228 2642 -5392 -1640 -3854 -444 -344 2208
3347 2208 -648 -15863 -13228 -15765 -8254 -908 15515 25314 33754 33928 24578 7939 -10433 -15732
3333 -15732 -19626 -15289 -12854 -14549 9356 26804 11644 -6171 -11455 -374 -3659 -12232 -6066
3320 -6066 2702 5618 3048 9656 18600 20009 21584 10235 -3764 8414 798 -10343 -225 1118
3306 1118 -10632 -11342 12045 36284 26674 7407 8220 2489 696 -6090 5304 -1428 6200 3742
3292 3742 1419 7641 15850 10942 15140 8932 11271 10646 -2350 -8855 1198 -8134 -21358 -17667
3278 -17667 -7215 5014 9631 -5606 -2967 15797 23970 20563 10418 19287 26053 18065 10477
3265 10477 14359 12745 10065 -8768 -17593 -4204 11598 8314 -169 3401 -1058 -7992 -13103 -2255
3251 -2255 22902 35924 29721 20235 25341 17308 2955 1138 510 -11746 -25012 -25097 -14802 -13249
3237 -13249 -17085 -10631 -9128 -5707 247 4276 12807 16939 27616 19380 17568 23284 19038 18105 12386
3222 12386 15215 9233 13193 5525 -16542 -19722 2990 13880 13033 23301 18827 3971 -239 -1313
3208 -1313 -12787 -16216 -14207 -24569 -21656 -17724 -4895 2381 1434 4115 9692 -2125 3572 5798
3194 5798 15265 13012 -506 -5766 -8531 -987 11438 27011 18162 10615 9791 -5397 -18186 -697
3180 -697 18937 12985 4195 -10076 -2121 559 9465 -3854 -19931 -10909 19163 14757 -1456 -16793
3166 -16793 -15872 -29657 -29494 -27723 -19931 -4911 -4099 -1693 -5732 -12588 3451 14386 33583 37238
3152 37238 44365 59292 48236 26511 28461 40519 27563 12583 9100 12757 30327 21013 18516
3139 18516 28886 7174 -14248 -9849 -219 -5110 -8800 10262 16480 3836 -9725 -6187 548
3126 548 8483 635 718 -5070 -19543 -21114 -16684 -18663 -21424 -13643 -20360 -29870 -54675 -39802 -22563
3111 -22563 -37593 -44333 -30261 -16181 -3095 -5710 -2894 -15790 -25701 -27881 -25499 -18759 -19517 -21652
3097 -21652 -24054 -16057 -12914 -23263 -44467 -52510 -51692 -34433 -16060 -2895 4290 8253 28189
3084 28189 32239 30747 37821 35536 18545 20395 27482 32612 7706 -8124 -9106 1776 5562 2717
3070 2717 -2795 -5909 -8306 -2669 -15674 -31552 -20681 -2201 28502 30408 33556 24008 17258 17218
3056 17218 25368 36965 18467 4433 8316 7210 -2205 -9113 -27141 -19089 -18282 -24262 -19504 -19404
3042 -19404 -7491 6161 3687 -4239 -8824 -7402 -423 15272 13555 309 771 2462 8952 -20447
3028 -20447 -41109 -11890 -4685 -1385 -139 -3911 -5550 -12254 -35549 -23349 -6 12906 29119
3015 29119 22994 9423 -4339 -5643 4832 23588 21803 13768 18 -44 6126 9385 4278 5263
3001 5263 7850 17763 20466 15733 19340 28681 25780 6386 2495 -14557 -14412 3735 12154 13473
2987 13473 4491 15610 13830 8074 -618 -5775 -3623 14602 13818 23621 27773 4074 -2466 17642
2973 17642 21964 25054 26942 37584 39595 24749 50196 51892 29094 25157 16070 9525 -9396
2960 -9396 -20134 -6547 6285 7526 -6324 -10940 -20830 -8648 8125 45501 53140 32971 11035
2947 11035 3273 -10414 -38484 -48726 -37707 -19567 -7375 253 -4176 -6265 11004 18548 14088
2934 14088 20578 10428 742 9507 -88 -17256 -25476 -29374 -32746 -5937 1342 4357 273 -7029
2920 -7029 -1043 7246 1598 2380 -13506 -6848 -15732 -23646 -28617 -18373 1134 -2932 -12416 519
2906 519 3579 1807 13755 1551 -6210 1553 7641 10218 -6763 -7800 1667 -11264 -35623 -33794
2892 -33794 -28237 -29657 -6689 28949 31587 9039 -3138 -8783 -9200 -26973 -29693 -31831 -24739 -14228
2878 -14228 -19866 -20692 -17620 -17297 -18473 -9307 -11120 -13262 -4190 18939 9211 -2828 -16204 -15501 -13775
2863 -13775 -29193 -44083 -35016 -30386 -21431 -28256 -36755 -23525 -2330 7737 317 -4857 -7275
2850 -7275 -2604 3808 7222 16177 11227 -7609 -14278 -2782 8497 -8843 -3509 -103 -1764 -4703
2836 -4703 12255 12459 6531 5602 -11180 -26669 -21833 -4644 9453 27530 26529 1411 -29981
2823 -29981 -24127 -26954 -14892 2584 9074 -4737 -4516 -884 5766 9739 2555 -22632 -21561 -9405
2809 -9405 -3830 -8301 -8526 -4535 -5873 -777 14647 20609 22155 7630 1131 -6808 -20939 -18682
2795 -18682 -11144 -27814 -56369 -36418 -13929 -13420 -19045 -15855 -2316 -2278 4431 11754 6772 -4951
2781 -4951 -10537 -2823 -3697 -8984 -21139 -3603 10759 13511 8915 18724 15848 16998 10281 17073
2767 17073 22774 9207 -12132 -3085 -21390 -24467 -14272 -7103 -3911 -103 10198 10397 24948
2754 24948 34041 13245 -11445 -8055 -538 12878 10693 1962 -469 -13423 -27495 -17774 -11525
2741 -11525 -15468 -11117 -4570 2213 11811 -6866 -1527 15102 34775 37537 15037 4945 -6575
2728 -6575 3331 12971 27275 32729 19177 12484 16848 23944 19228 10249 -8078 -6390 -5223 10149
2714 10149 316 3939 15544 5342 -65 8826 5359 -10592 -7022 -14914 -14825 263 10475 -7837
2700 -7837 -19772 -15437 -16602 -9252 -1470 7868 1914 -4491 -14436 -16929 -8601 824 -539 -22353
2686 -22353 -20000 -16023 -11408 -7815 -3712 -4728 12534 13674 1975 3888 15838 10786 -18840 -34641
2672 -34641 -9302 10642 -1723 -24070 -10219 -6907 -1825 9576 10694 10976 976 5083 15574
2659 15574 27202 23542 11111 5815 6835 7047 9271 7360 1449 118 -5994 -328 -12231 -22198
2645 -22198 -14297 -14673 -2739 5779 -6063 -8765 -8669 -12761 -3692 10617 30789 27485 16240 -1723
2631 -1723 -14175 -21121 -32608 -22345 -4165 3835 -7869 -15403 2194 13679 21668 13564 -8714
2618 -8714 -992 3812 8817 6967 7391 1178 -5316 7379 -4073 1871 106 -7017 -15964 -9577 -6047
2603 -6047 3427 11149 28987 13181 1004 -14884 1371 -7650 -9979 -9058 -12690 -9834 -4609 2333
2589 2333 1232 -5274 -5874 7569 4197 5439 16009 13316 -5158 -989 20773 13662 20999 11784
2575 11784 771 -9406 -21934 -18611 8327 8394 -130 11196 33928 24220 7464 -16537 -8135
2562 -8135 16135 16719 4418 5268 21801 20637 -2365 -11256 -8614 5956 14331 4913 -7909 2860
2548 2860 11460 7902 2971 -10305 -32245 -38570 -31966 -8521 19803 22144 11351 -9980 -17352
2535 -17352 -7870 3481 9706 12343 5458 12055 10555 -10299 -1839 13668 12862 -334 8847 14189
2521 14189 20442 -648 -15254 -22363 -11720 -2185 8685 11518 25478 19290 780 -4715 -9538
2508 -9538 12094 23998 9134 8750 2093 -4737 6216 13394 15487 2905 -20211 -17743 -6542
2495 -6542 -8367 4174 18164 1956 -12343 7896 14833 20988 10190 -13858 -7035 -880 -1936
2482 -1936 -7630 703 5680 10988 4824 3262 14779 10800 -870 3254 7176 3576 -22929 -32456
2468 -32456 -36877 -36491 -7239 -5733 2555 9265 -11599 -29122 -24567 -9215 1526 9056 6249 -3019
2454 -3019 -8506 -4153 -13202 -6663 -1181 1127 17110 20525 7026 -11201 -21077 -12599 -9828 6222
2440 6222 14796 -5173 -9257 4365 9466 7365 -5929 -13229 8472 -4634 -11138 12976 11940
2427 11940 7530 20358 35947 45649 39610 20658 9912 9803 -1947 -3891 4337 910 -4090 -8000
2413 -8000 -5039 -2781 8562 5135 -12401 -4615 -5128 -24303 -13035 1445 13085 10075 -3860
2400 -3860 7482 13408 2607 -6779 -7180 -291 -4373 -5018 -22006 -23779 -8907 -10412 -6108 -3449
2386 -3449 -6968 -7803 -6019 888 338 -9713 -20948 -23459 -35682 -41599 -36154 -40807 -32014 1108
2372 1108 5341 12946 5500 -14057 4781 19523 16437 -446 -33330 -29781 -25175 -6498 5142
2359 5142 163 -17888 -16594 -4659 10493 13401 17534 2799 502 5639 15210 19825 11723 -13021
2345 -13021 -20380 -15720 5722 4264 23130 33407 14748 -1276 -9824 1208 13738 8741 2076
2332 2076 -7638 -22249 -29796 -11659 6116 7037 10387 26486 26685 15337 899 -5501 -8781 -1386
2318 -1386 6974 11285 10415 -6970 -19985 -21904 -4950 -1357 -857 1925 -88 -3089 8592 2518
2304 2518 -3042 2976 -12265 -20199 -17778 -4939 -7590 3114 11848 12298 3385 9397 -9001 -19704
2290 -19704 -10362 10362 3140 3435 9144 3141 18412 16754 21970 33345 37447 29108 29968 27391
2276 27391 13130 -19723 -42340 -31250 -6610 -6266 -7839 -11610 -2413 -16566 -32523 -30595 -25517
2263 -25517 -10617 6759 13207 19651 8425 -17514 -29142 -29935 -22037 -9191 -7815 -6553 -13780
2250 -13780 -26834 -13720 -9589 788 102 7117 5653 5940 476 -1527 -9091 -27989 -34593 -14002
2236 -14002 -4615 -18144 -12948 10476 16285 14836 3201 189 3034 8774 16434 -787 -8214 -633
2222 -633 -15688 -16252 -5329 -5195 -2240 1352 7262 19438 584 -6583 -14560 -5211 -4094 -17473
2208 -17473 -25287 -12676 -10077 2933 -2983 -3348 -5511 -23773 -20542 5889 31027 24264 17015 17376
2194 17376 306 2753 -5783 -5200 29928 40780 20147 -7212 -24592 -18482 -10793 1381 -326
2181 -326 -13819 -21193 -26573 -40995 -29483 -9486 -13613 -20844 -9713 8032 13769 2811 -14910
2168 -14910 -13776 -7708 -9971 -9482 1761 3614 11867 13795 11922 11255 18095 3155 -456 -3609 -7350
2153 -7350 -2949 6369 1853 10813 3976 -12940 -6284 -6131 -7007 -1161 2872 4925 9743 21792 1696
2138 1696 -50 -2527 2721 -19389 -41015 -29048 -5471 6304 -927 -119 2367 -3077 13187 11855
2124 11855 1940 -12188 -22101 -8530 -6240 7738 27726 20952 8676 2210 50 2882 4439
2111 4439 9784 21765 13123 6167 -6072 7393 20896 32756 22893 17783 103 6039 23958
2098 23958 13153 14020 17874 5453 -3836 -3026 -1262 -2272 -3214 -8301 -5998 -8357 -2993 12039 -129
2083 -129 2004 8133 11567 5235 -3926 5221 10380 9439 30442 35782 18425 -16058 -21946 -5255
2069 -5255 3732 3528 2440 1975 23986 25504 3390 -5786 3796 5762 16328 26241 13906 14130 22064
2054 22064 2003 -17818 -15811 -11856 -6509 130 -13418 -13204 -12358 -1188 1691 3564 12602 2360
2040 2360 -19279 -27102 -9518 1543 -8031 -17299 -7881 5523 4167 -13847 -26045 -22640 -25241
2027 -25241 -4814 18749 7142 19490 18234 16866 23415 27205 13148 10371 13411 13006 16080 3954
2013 3954 6288 6851 12348 8173 21387 23377 27031 9066 -12126 -15797 11184 23566 8742 -3114
1999 -3114 -13306 -6842 -603 -8025 -12834 -13673 -21649 -34732 -6428 642 -12636 -13401 -3263 -21786
1985 -21786 -22891 -14332 -8704 -15772 -12977 -6517 4346 -4247 6130 8122 18035 16895 14040 10721
1971 10721 -8345 -5334 909 3990 8008 21099 7653 5025 1757 -13045 -8328 -1791 -1962 3052
1957 3052 8737 5096 -4981 -10933 -1834 4006 10097 409 -11392 2370 15106 11325 6250 13270
1943 13270 14015 16812 7002 -18176 -35867 -26679 -27299 -23152 -13889 -5974 -8442 -23105 -24505 -35631
1929 -35631 -37619 -37773 -23673 -12681 2367 9434 -11957 -20006 -8673 1486 -3671 -13860 -12240
1916 -12240 -19264 -19833 -17806 -17864 -9969 -486 -2132 -7099 -8862 -2456 -10901 -16798 4629 10471 11346
1901 11346 4398 6712 11775 -14788 -32139 -25207 -12942 -860 9612 -553 -2235 971 -10790
1888 -10790 -35776 -38848 -25937 -6544 1441 -3225 -11600 -8644 848 -6039 -5210 -13828 -1330 -12244
1874 -12244 -12811 -10931 -3655 -3555 -10498 -8192 -2668 8230 2516 5012 7619 -127 -8767 3902 -876
1859 -876 -14394 -3118 -9667 -1127 -3666 -5905 10918 18861 27258 43076 38711 32632 20792 17597
1845 17597 22252 20678 21484 696 -12304 -10297 -18926 -5705 15793 9603 19608 15781 17606 34431
1831 34431 26754 14662 16055 15903 27983 29180 12579 -1288 -4267 16750 15052 -3046 -7816
1818 -7816 -10462 -31123 -27904 -21442 -21155 -9855 2223 -8424 -7649 5994 14784 12820 4584 -3274
1804 -3274 -1523 41 6306 1649 -438 3216 4483 -1541 5557 14140 4778 -669 7582 3577 3202
1789 3202 12260 22816 17247 16823 9515 -4632 -10667 -4091 -10495 -8712 -16963 -3633 4823 -9431
1775 -9431 -17529 1764 9495 12873 4529 -2650 -5322 4890 -2314 -14352 -19519 -6393 -4826 -17902
1761 -17902 -23919 -14718 298 13838 2572 22563 29426 23755 19345 5479 7586 17549 30012
1748 30012 23972 14554 13121 26537 22173 10129 5853 -7166 4609 16128 15142 10731 495
1735 495 526 14537 19259 10300 10750 1053 -13331 -19390 -30968 -9174 6436 9230 -19174 -30505
1721 -30505 -17639 2347 16186 23346 16879 7289 3272 5840 -155 8033 0 -21663 -22981 -6351
1707 -6351 10210 8943 697 15812 24043 19014 9728 7576 8942 4493 5771 9436 6752 19447
1693 19447 30623 28542 20104 24947 22734 22904 19800 20772 11345 -5270 -6457 3119 1982 -3631 -13583
1678 -13583 -19225 -10281 3610 -2075 -6217 4325 6448 8006 17874 10930 13836 19987 32983 19208
1664 19208 -4591 -10267 6104 16505 10126 -13497 -18328 -13510 553 30068 12970 12697 20387
1651 20387 10467 6971 -9893 -32329 -21255 -5351 -1620 6570 16803 13062 19741 15850 5225
1638 5225 -6891 -10654 -1951 15313 4111 -647 -9859 -11674 -9092 28714 39871 21399 4507
1625 4507 -10757 -7583 10299 14033 4826 -6908 -14911 -7254 8689 -4099 -6262 12069 13171
1612 13171 8069 -10244 -17918 -8951 -10891 -20895 -11609 4595 1482 -21547 -36228 -54417 -47231
1599 -47231 -26434 -11958 11377 16950 11367 10299 17075 35482 37946 18930 12977 7575 -727
1586 -727 -10522 5819 -3612 -24435 -24365 -11114 -13384 -17489 -17049 6468 10005 -13216 -23126 -11491
1572 -11491 -510 -13812 -18379 501 457 -2672 3482 -6146 -17513 -4760 3404 -3005 2612 6231
1558 6231 10334 9698 7759 15679 21650 17132 18859 13301 22588 12460 11111 12780 25746 17585 3139
1543 3139 6246 13154 11771 8302 -3285 -12482 -8771 4583 -3468 -12034 -1102 14511 30912 41046
1529 41046 28673 20641 8999 11288 1053 -17907 -30668 -29695 -22263 -27009 -28246 -24542 -10459
1516 -10459 14354 21730 -509 1937 12048 18380 12745 15455 31484 29432 6009 10424 23942
1503 23942 11541 19698 32701 30544 30645 17999 21714 7662 -15702 -20925 5423 12351 375
1490 375 -6452 -16777 -7636 9123 21940 16349 -4064 8510 527 3479 4825 -264 881 12408
1476 12408 11723 -11137 -13901 7165 10668 -5450 -30264 -30739 -21986 -11336 -8027 -17582 1062 -5291
1462 -5291 -18265 -4309 -7682 8895 8883 16896 8072 -345 -7304 -14605 -10620 -5863 -928 -6200 9168
1447 9168 12356 18175 16857 3777 1118 31982 35148 20929 21782 8172 -13363 -18965 -20132 -24932
1433 -24932 -19915 -24357 -18436 -10219 -11711 -25234 -26487 -24972 -17009 3747 -1060 -3199 4773 186
1419 186 -21483 -26109 -25524 -28244 -35012 -35207 -18951 -9632 1567 -6204 -5962 2213 8432 10694 -1228
1404 -1228 -2595 -12112 -11896 -10611 3119 11943 19625 8358 -17789 -38903 -23588 -27498 -19709 -10737
1390 -10737 -15372 -12110 -5974 -4175 14915 12872 -13190 -28562 -16102 99 10649 -4131 -31796
1377 -31796 -16287 8196 14838 12149 18966 18912 22802 16981 3084 -705 -3770 -16100 -16432 -8988
1363 -8988 -2583 -14704 -25119 -22053 -17724 -15940 -23977 -22204 -34344 -34482 -21731 -9587 -215 17762
1349 17762 20696 14670 1277 -22809 -24247 8100 5034 6958 -778 -16601 5157 29796 37396
1336 37396 32563 17454 11241 7852 28243 28154 32032 45462 28408 25660 37516 35331 17616 -7484
1322 -7484 -29293 -41841 -28600 -6881 4587 427 -5774 -14069 -21509 -25158 -21040 -28194 -16320
1309 -16320 1567 -255 -11398 -8716 1921 4188 11908 10459 -7824 -13573 -14270 -4988 6340 19342
1295 19342 12964 5195 -1923 -14886 -12849 10035 8881 -121 3361 23442 25642 16992 16373 -228
1281 -228 -9074 2123 -6103 3878 -3356 4708 18402 28701 25088 14874 22236 4597 -11011 -17601
1267 -17601 -986 4276 -12211 -31229 -18162 -15829 -4524 -3800 -5792 -178 7948 -2825 -14110
1254 -14110 -11867 -10313 -5928 9696 12529 8351 4929 -1456 4149 -5263 -16758 -17368 -13498 -3876
1240 -3876 15259 19536 6143 -3900 -115 7091 -1816 2172 11098 12008 16598 23331 31878 24684
1226 24684 22124 11789 8697 17039 19180 35185 29887 19853 22583 30164 25605 15049 17428 18417
1212 18417 16905 15589 27315 15340 1804 -7087 -10560 -5285 -12461 -10161 -7569 -15348 -17403 -20939
1198 -20939 -9155 3639 7390 1171 -3762 -5537 3912 13133 29386 26087 27462 21850 1983 -10624
1184 -10624 -17668 -5114 -714 -711 -5308 -3623 12705 5909 -7458 1841 3829 -16870 -23788 -30604
1170 -30604 -14263 1802 12249 2684 -6260 -3740 -4469 2924 -13286 -19459 -14621 4042 7178 -5751
1156 -5751 -3933 -7194 -12903 -5880 9215 17057 14059 5496 -2117 1870 14406 9486 2036 7768
1142 7768 26381 22925 5609 -9624 -7190 -1264 3467 20165 26507 36472 40273 29260 3318
1129 3318 10459 22248 16488 6415 9993 7391 15856 28505 20228 5050 8177 7912 -3312 -16237
1115 -16237 -11807 -17232 -21367 -4362 -7706 -1208 19532 3957 -4387 3565 -6081 -8772 -9546 -21860
1101 -21860 -21922 -5680 14974 31164 22912 5258 10447 22089 24640 3936 -6879 -15372 -6256
1088 -6256 4024 -6394 -3545 -8525 -10758 -16099 -4031 3460 21596 12927 -7986 -12360 -6424 1078
1074 1078 8392 -3064 -859 -2408 -1270 -7554 -9512 -12620 -27052 -45544 -36681 -41359 -38625 -28994
1060 -28994 -1582 2907 -6558 -13948 -17042 -35976 -35765 -31359 -33887 -20794 -12597 -14983 -12738 1685
1046 1685 -157 -1543 -9403 -2625 8686 12417 24471 26462 -3363 -5260 -1223 14351 12095 10891
1032 10891 -292 16058 13360 -4726 -7000 -4892 -10952 -10278 -3928 -11448 -23075 -25827 -13591 277
1018 277 9352 16063 -9190 -25581 -1803 15347 26824 28613 19625 6393 5717 1503 -10197 -12024
1004 -12024 1151 4488 2514 1564 244 5943 7249 15632 -6489 -24961 -23807 -27463 -11810 -8420
990 -8420 -6631 13551 24259 15865 10735 11674 16334 12696 17131 24902 22005 8466 -7210 -15260
976 -15260 -21519 -15892 -3147 -858 14993 20601 20602 28463 24677 12080 10592 11200 1831 2563 7700
961 7700 -1041 1598 25484 29920 17571 7151 4217 7086 -1274 -20631 -30835 -20063 -2454
948 -2454 5272 7197 12302 295 2643 3662 -4316 -12119 -12641 -9857 -10975 315 -163 -2155 -13369
933 -13369 -8028 1260 5506 19818 4032 -18553 -10392 -11353 -21486 -16612 -16691 -14395 -79 -11226
919 -11226 -18782 -9866 2731 -4140 -3273 -3119 12132 21762 20277 11739 3500 9506 15628 20767 18789
904 18789 4144 -15697 -25454 -16805 -6030 14650 12042 25304 17777 6354 16577 11309 17871
891 17871 13867 3712 -12946 -28281 -43112 -22444 8070 24879 30049 16832 29553 26220 25410
878 25410 19145 20488 15935 10111 4998 -5360 -1211 -2625 -1521 20906 15779 -273 11130 13281
864 13281 18998 19223 9155 -2328 10163 15901 -1718 -5140 -5323 -14140 -21667 -16148 627 9466
850 9466 26977 16729 -2032 -4023 -5356 -13987 -735 -913 -4425 7646 23066 27460 43630 56047
836 56047 59335 52722 22254 5245 3650 -6629 -8471 2255 -11150 -21165 -2805 22953 17905
823 17905 3844 6246 10119 2034 -12335 -8637 -6874 -15607 -10172 -695 2355 16902 8169 20483
809 20483 22400 -1696 -5298 -10784 -12695 -8962 -9877 -14996 -41266 -59089 -56720 -29009 -32394 -22066
795 -22066 -21993 -29597 -31537 -21176 -6004 5257 350 -16003 -23720 -21387 -12610 -24724 -19274 -16093
781 -16093 -22631 -20101 -13612 -10599 -7584 -16828 -38573 -29807 -30326 -25812 -3337 -2167 -18896 -20011
767 -20011 -2707 6939 4985 7054 6398 -7408 -14171 -7455 10221 3209 -1805 -727 3452 -12455
753 -12455 -19684 -10671 3616 9655 5989 7033 12916 11414 2246 11071 12725 15695 25162 15271 3590
738 3590 20228 4328 -1352 2998 11519 -11446 -25221 -30923 -37993 -42853 -20959 1695 30330
725 30330 35941 25817 23929 24698 24587 30769 28902 -5390 -13241 -11941 -10086 -9086 -508 16985 10253
710 10253 2179 -18907 -15245 -8165 -15834 -17874 -15851 -10245 -12983 -5166 23171 6263 -9970 -215
696 -215 12471 -14450 -10110 19093 21305 11633 9696 1915 -162 -6132 -10156 -8584 -12197 -35693
682 -35693 -30222 -5233 -5318 -19502 -27679 -43839 -44662 -36810 -34065 -29428 -17952 -6145 -4483 9767
668 9767 20018 14308 27130 15060 603 -4865 -9190 -21081 -32259 -39346 -14927 7627 10684
655 10684 3259 -5998 -4891 -13878 -24493 -15627 -16745 -14929 -12774 4746 -389 -8273 -2887 -6599
641 -6599 -12957 -21528 -12429 -3464 -15037 -10059 -14931 -21625 -27825 -19774 6006 14569 -4855 -25860
627 -25860 -43602 -39620 -34138 -28767 -21049 -19561 -33745 -34348 -24066 -6664 -3644 -6307 -18760 -24821
613 -24821 -29165 -37153 -28942 -22127 -23401 -10380 -11285 -11668 -2431 -3221 -10987 -10043 8386 30349 22081
598 22081 15264 -717 601 -27465 -50465 -43447 -24551 5037 -7198 -20941 -3490 -1658 -18794
585 -18794 -14666 6698 1768 6448 1795 1291 868 18448 14797 5224 5491 -4379 0 4795 -92
570 -92 4314 12170 9742 2769 -23091 -42916 -40364 -33108 -20960 -20420 -37091 -44628 -45136 -37133 -26336
555 -26336 -9868 8257 10233 -17236 -17214 -11771 -21534 -13848 -7399 -8974 -19402 -23913 -20753 -11819
541 -11819 -18403 -18861 -1399 28515 31339 4652 -13201 -15162 -24347 -29712 -4018 15881 19617 13987
527 13987 5094 -9512 -11110 -13362 -6895 2496 989 7108 13534 280 18934 25849 5223 -10343
513 -10343 -8284 -7093 -22382 -19081 -15402 15564 26181 14872 3841 4516 1760 -14238 -26635
500 -26635 -12415 1531 -1995 -1524 21207 24726 15187 4323 -5599 -15584 -24591 -21694 -5666 -15190
486 -15190 -17366 -20465 -36459 -49393 -53090 -36815 -15957 -8327 -10282 -6007 -752 4412 3925 -6250
472 -6250 -1773 8750 8744 -1109 -151 13223 26464 17868 14902 22418 29890 27987 10932 7872 11428
457 11428 10756 2669 -11931 -23389 -11183 -4669 -14567 -19994 -4625 10333 -1070 -18750 -25003
444 -25003 -16148 -4963 -5821 1104 -4064 -9778 -1222 -3600 -5990 -9687 -8261 -8804 -462 -9047 -33246
429 -33246 -33528 -34249 -24522 -9427 -9107 -12207 -21475 -31000 -24462 -30984 -24300 -23326 -11040 3842 16814
414 16814 18755 13702 10766 -8644 -23165 -27775 -15327 -17049 -21129 -10151 -8356 2769 12973
401 12973 12686 13294 19340 18600 20887 2780 -5539 239 -4867 -1379 4 -18446 -12651 -2772 432
386 432 6173 9045 -2157 -10612 -20515 -20107 -12778 -1827 5985 9002 -4735 -15804 -13977 -14270 -16921
371 -16921 -18054 -26204 -42170 -28596 -22943 -10691 -8163 6484 19273 10870 3450 -15832 -10397
358 -10397 11894 5218 -5104 -10473 -7652 -8046 -5334 -1541 515 271 -3336 -17932 -14603 -2008
344 -2008 -5498 -12019 -2845 -21199 -33499 -23584 -20251 -6275 -2244 -14795 -10915 10990 28133 18296
330 18296 21862 19083 1623 3359 3727 7435 7621 14629 1695 -5744 -2053 14121 1397 1256 719
315 719 8864 6964 -8442 -1027 2509 2846 4966 -5166 -6737 12754 22016 5874 -8694 2203
301 2203 3537 579 -4661 -13001 -7642 -10394 -25975 -36550 -28084 -17799 -13980 -28401 -41857 -36070
287 -36070 -21836 -16462 -21003 -26734 -25522 -17934 -16021 -9323 4820 12793 7200 1450 10122 10056 847
272 847 -12016 -4598 -13065 -13673 -1918 9133 13235 4311 -7083 -4986 -8063 -10491 -10627 7450 15141
257 15141 -3623 -11430 -13187 -23587 -21209 -16390 -3790 -5073 -3484 -7479 -8588 -3368 -11078 -2229
243 -2229 10920 -4180 -14531 -16422 -18795 -24611 -12922 -562 -7406 -17853 -16445 -23521 -13526 -2025
229 -2025 -7151 -7050 903 -568 -14603 -16384 2693 -3476 -9320 -1382 1443 12731 10592 4468 10683
214 10683 5793 -8824 -14902 -10039 -689 16311 27021 16651 2967 -20487 -13204 639 -7277
201 -7277 -10985 7300 12330 24614 12269 -10688 -16425 -14017 -7659 -12832 -18623 -15026 -19142 -15859
187 -15859 -9129 -13466 3570 7629 1260 -7916 -8476 -9956 -7469 -2741 -10616 -13819 -5815 -6043 -29771
172 -29771 -33650 -31855 -31691 -18571 -9355 -8193 -15042 -12966 -8162 11941 13549 4018 10035 882 -8362
157 -8362 -19483 -13305 8896 2104 -9450 -7484 -2597 -4784 -14550 -7602 -12436 -15071 -29363 -31695
143 -31695 -13109 -10276 -4648 -1126 -976 -10598 -23426 -11137 -2327 -7780 -8870 -4846 -4714 -8467 -17248
128 -17248 -11596 -14170 -11663 -6059 -1018 5498 30816 31347 26165 8403 -8835 -6312 -5052 -13029
114 -13029 -9436 12262 22765 19577 5532 3506 -2827 -8276 -3429 9033 6208 3398 -1712 -11859
100 -11859 -8598 -9089 -7293 -8119 4953 -1919 -15344 -15239 -12094 -236 -2653 -4933 -1565 -12932 -18164
85 -18164 -23459 -12235 -8647 -143 -6644 -4715 -5734 -8130 2089 -886 -12011 -7864 -663 -467 -8880
70 -8880 4686 4120 -2481 -6567 -5145 -5472 -22153 -21787 -5472 1317 -2722 -4479 3421 -130 4328
55 4328 10322 7118 333 2170 637 13046 12679 1638 7887 872 -7236 -10201 -7695 -10009 2150
40 2150 9052 5985 2977 1014 -2840 630 7918 3326 3650 9815 5230 9418 4036 -13862 -20075
25 -20075 -20664 -15524 -12940 -6086 -9416 -4744 -8522 589 -5071 -13245 -9605 -8382 -12002 -4857 -131
10 -131 2172 2002 -1500 -2942 -7338 -8793 -11203 -15286 -19194 -21524
0 -21524
$$ Imaginary data points
##PAGE= N=2
##DATA TABLE= (X++(I..I)), XYDATA
32767 52749 62779 61776 74306 62581 58962 64483 51179 42079 42762 43517 46952 47175 51769 54249
32753 54249 60527 58499 57111 51922 46409 35218 32775 46720 55065 54473 48113 44045 38284 28764
32739 28764 41131 48490 53206 52902 51571 49379 55512 70841 79790 84544 71549 57820 50504 47369
32725 47369 57832 62438 47431 45962 55327 60262 67950 65659 60342 59511 73950 79242 81475 84452
32711 84452 73347 67524 75363 78228 82635 86870 79449 68740 61068 59108 66624 67652 66570 69356
32697 69356 72245 75981 54918 45215 50178 58459 65422 71784 81739 79614 80331 83225 88618 92678
32683 92678 104135 99336 80566 73887 80254 82439 83421 90396 92206 93057 88383 93291 98578 102474
32669 102474 104891 106121 97033 88840 89329 95326 96190 99699 94291 104116 111224 111676 91695 87542 91822
32654 91822 90702 99938 92686 85911 92691 97319 94202 99246 102607 100944 100908 106207 105105 107226 129543
32639 129543 137593 129905 131378 126631 114538 104874 101610 103339 107518 106553 107764 98863 111078 113366
32625 113366 113145 118064 124615 125124 111243 97808 84924 84688 88251 93529 100588 99966 110353 114501
32611 114501 121719 119187 107108 101224 119089 118892 122305 112494 112359 123252 140599 138960 125020
32598 125020 107087 110853 115242 102567 102031 105419 87350 87187 98099 107336 110942 104974 107422 121250
32584 121250 121340 137890 145149 128592 131441 125856 126887 143244 147562 136209 125048 131223 129478
32571 129478 130867 129850 140650 150798 139905 136515 135607 146327 163857 163620 157945 156849 161735
32558 161735 149091 128316 127759 132613 121233 112575 113285 124339 131736 125140 126881 116151 119949
32545 119949 124344 122200 118064 112954 111273 128565 153408 154523 155955 152920 155373 158502 151829 160355
32531 160355 162855 159475 155937 156647 159989 141071 136127 146390 141077 141446 139857 137122 134797 135792
32517 135792 140903 157413 165438 156922 142451 141780 142555 141523 139461 137074 129641 128780 143768 154365
32503 154365 144294 142934 144716 140467 151873 150152 147604 164473 154927 148946 150582 145468 145195 146002
32489 146002 156104 170488 160055 147904 135294 114169 111863 126669 143968 136743 132229 151949
32477 151949 161334 153764 143621 143218 140277 144419 149836 147250 161641 153776 155723 167918 166805 159961
32463 159961 155357 155788 164118 167798 167294 154261 147868 161344 173770 180540 183276 178272 177818 192385
32449 192385 194960 193276 204218 181632 165141 150733 142024 168599 172328 175658 176069 169233 169385
32436 169385 168367 171237 188295 186090 171901 169998 159797 164933 158443 148334 140989 154600 165249
32423 165249 173691 172967 181749 171072 177133 184740 172963 160329 157272 157996 169861 162877 152540
32410 152540 160701 186486 207544 204358 192197 175835 172535 190489 190213 170853 176816 176694 176179
32397 176179 171235 163314 167640 160614 163436 166343 157227 168210 190184 198106 207326 197701 181045
32384 181045 177761 178661 177405 174716 170109 166708 176506 171526 186802 188989 178611 186281 198732 204682
32370 204682 203147 210239 197399 188914 178311 167887 171870 170409 170559 161841 167673 162181 142749
32357 142749 143686 168855 179504 176485 176325 170675 181536 188162 192601 199386 209465 198213 181169
32344 181169 176659 190696 188247 191911 197736 186221 178849 186771 182504 190588 188401 177468 178683
32331 178683 187929 187642 187701 180382 178151 189319 205081 201531 216812 213558 206331 195251 199343 193469
32317 193469 197865 202192 193876 182949 193580 200411 194991 180997 176459 191271 196888 187944 191939
32304 191939 192579 202703 200534 175832 154587 158680 162868 182088 186674 182269 167226 162298 164570
32291 164570 159088 155713 154810 175380 205035 224547 221452 220696 207016 203551 205707 195024 199099
32278 199099 205585 208107 204895 201657 197056 185818 164752 167515 166004 169754 180824 183491 189276
32265 189276 177584 181855 187136 200530 195769 194567 186205 178599 185821 189144 179948 165986 176173
32252 176173 183194 176912 179856 181363 181530 172629 167552 161647 190375 226923 212121 190846 181132
32239 181132 165538 169051 181482 185746 192928 210142 196184 174463 169905 176299 180743 183758 186967
$$ [...]
##END NTUPLES=NMR SPECTRUM
##END=
