##TITLE=Analysis number 314566
Compound Code mo 00546
Project Code adrs
Chemist Name ugmt
##JCAMPDX= 6.0         $$ Bruker NMR JCAMP-DX V2.0
##DATA TYPE= NMR SPECTRUM
##DATA CLASS= NTUPLES
##ORIGIN= Bruker BioSpin GmbH
##OWNER= NMR
$$ XWIN-NMR		Version 3.5
$$ Thu Oct 20 08:58:30 2005 GMT Daylight Time (UT+1h)  MAYBRIDGE\NMR@NMR_250MHZ
##.OBSERVE FREQUENCY= 250.131544655141
##.OBSERVE NUCLEUS= ^1H
##.ACQUISITION MODE= SIMULTANEOUS (DQD)
##.ACQUISITION SCHEME= undefined
##.AVERAGES= 16
##.DIGITISER RES= 18
##SPECTROMETER/DATA SYSTEM= dpx250
##.PULSE SEQUENCE= zg30
##.SOLVENT NAME= DMSO
##.SHIFT REFERENCE= (INTERNAL, DMSO, 0, 16.5105)
##AUDIT TRAIL= $$ (NUMBER, WHEN, WHO, WHERE, WHAT)
$$ ##TITLE= Audit trail, XWIN-NMR		Version 3.5
$$ ##JCAMPDX= 5.01
$$ ##ORIGIN= Bruker BioSpin GmbH
$$ ##OWNER= NMR
$$ C:\u/data/dgb/nmr/ADRS/11050/pdata/1/auditp.txt
$$ ##AUDIT TRAIL=  $$ (NUMBER, WHEN, WHO, WHERE, WHAT)
(   1,<2005-10-20 08:57:50.19 +100>,<MAYBRIDGE\NMR>,<NMR_250MHZ>,
      <created by zg, POWCHK disabled, PULCHK disabled
       configuration hash MD5:
       62 19 C7 07 E1 42 D1 B7 37 6C 3D D0 77 39 F9 E6
       data hash MD5: 64K
       BE C7 F4 CF 26 98 E2 CE A3 5A 4A FD 88 C0 FE E0>)
(   2,<2005-10-20 08:58:06.21 +100>,<MAYBRIDGE\NMR>,<NMR_250MHZ>,
      <Start of raw data processing
       ef LB = 0.3 FT_mod = 6 PKNL = 1 SI = 32K 
       data hash MD5: 32K
       81 11 96 FE 16 ED CA D1 19 46 2F 4D B0 A9 14 6E>)
(   3,<2005-10-20 08:58:10.63 +100>,<MAYBRIDGE\NMR>,<NMR_250MHZ>,
      <apk 
       data hash MD5: 32K
       54 5A 1E A5 E4 0F 67 0A AC D6 3D C7 BB 35 A9 85>)
(   4,<2005-10-20 08:58:12.02 +100>,<MAYBRIDGE\NMR>,<NMR_250MHZ>,
      <abs ABSG = 5 
       data hash MD5: 32K
       B9 60 5F 7A 9D 08 D1 F7 5F 20 9B 27 01 BB D5 AF>)
$$ ##END=
$$ 
$$ hash MD5
$$ A1 B0 B8 8A 82 34 36 7C 8C B5 C1 1C B2 0F 48 CE
##$RELAX= 
##$RELAX= 
##$RELAX= 
##$RELAX= 
##$RELAX= 
##$RELAX= 
##$RELAX= 
$$ Bruker specific parameters
$$ --------------------------
##$DU= <C:\u>
##$EXPNO= 11050
##$NAME= <ADRS>
##$PROCNO= 1
##$TYPE= <nmr>
##$USER= <dgb>
##$AMP= (0..31)
100 100 100 100 100 100 100 100 100 100 100 100 100 100 100 100 100 100 
100 100 100 100 100 100 100 100 100 100 100 100 100 100 
##$AQSEQ= 0
##$AQ_mod= 3
##$AUNM= <au_zg>
##$AUTOPOS= <5 >
##$BF1= 250.13
##$BF2= 250.13
##$BF3= 250.13
##$BF4= 250.13
##$BF5= 500.13
##$BF6= 500.13
##$BF7= 500.13
##$BF8= 500.13
##$BYTORDA= 1
##$CFDGTYP= 0
##$CFRGTYP= 5
##$CHEMSTR= <none>
##$CNST= (0..31)
1 1 145 1 1 1 1 1 1 1 1 1 1 1 1 1 1 1 1 1 1 1 1 1 1 1 1 1 1 1 1 1 
##$CPDPRG= <>
##$CPDPRG1= <>
##$CPDPRG2= <>
##$CPDPRG3= <>
##$CPDPRG4= <mlev>
##$CPDPRG5= <mlev>
##$CPDPRG6= <mlev>
##$CPDPRG7= <mlev>
##$CPDPRG8= <mlev>
##$CPDPRGB= <>
##$CPDPRGT= <>
##$D= (0..31)
0 1 0 0 0 0 0 0 0 0.06 0 0 0 0 0 0 0.0002 0 0 0 0 0 0 0 0 0 0 0 0 0 0 
0 
##$DATE= 1129795068
##$DBL= (0..7)
120 120 120 120 120 120 120 120 
##$DBP= (0..7)
150 150 150 150 150 150 150 150 
##$DBP07= 0
##$DBPNAM0= <>
##$DBPNAM1= <>
##$DBPNAM2= <>
##$DBPNAM3= <>
$$ [...]
##$SUBNAM7= <"">
##$SUBNAM8= <"">
##$SUBNAM9= <"">
##$SW= 20.6930455092707
##$SWIBOX= (0..15)
0 0 3 0 0 0 0 0 0 0 0 0 0 0 0 0 
##$SW_h= 5175.983436853
##$TD= 65536
##$TD0= 1
##$TE= 295.16
##$TE2= 300
##$TE3= 300
##$TEG= 300
##$TL= (0..7)
0 120 120 120 120 120 120 120 
##$TP= (0..7)
150 150 150 150 150 150 150 150 
##$TP07= 0
##$TPNAME0= <>
##$TPNAME1= <>
##$TPNAME2= <>
##$TPNAME3= <>
##$TPNAME4= <>
##$TPNAME5= <>
##$TPNAME6= <>
##$TPNAME7= <>
##$TPOAL= (0..7)
0.5 0.5 0.5 0.5 0.5 0.5 0.5 0.5 
##$TPOFFS= (0..7)
0 0 0 0 0 0 0 0 
##$TUNHIN= 0
##$TUNHOUT= 0
##$TUNXOUT= 0
##$USERA1= <user>
##$USERA2= <user>
##$USERA3= <user>
##$USERA4= <user>
##$USERA5= <user>
##$V9= 5
##$VALIST= <valist>
##$VCLIST= <CCCCCCCCCCCCCCC>
##$VD= 0
##$VDLIST= <DDDDDDDDDDDDDDD>
##$VPLIST= <PPPPPPPPPPPPPPP>
##$VTLIST= <TTTTTTTTTTTTTTT>
##$WBST= 1024
##$WBSW= 4
##$XGAIN= (0..3)
0 0 0 0 
##$XL= 0
##$YL= 0
##$YMAX_a= 272147
##$YMIN_a= -427118
##$ZGOPTNS= <>
##$ZL1= 120
##$ZL2= 120
##$ZL3= 120
##$ZL4= 120
##$ABSF1= 16.51051
##$ABSF2= -4.182663
##$ABSG= 5
##$ABSL= 3
##$ALPHA= 0
##$AQORDER= 0
##$ASSFAC= 0
##$ASSFACI= 0
##$ASSFACX= 0
##$ASSWID= 0
##$AUNMP= <proc_1d>
##$AZFE= 0.1
##$AZFW= 0.1
##$BCFW= 0
##$BC_mod= 0
##$BYTORDP= 0
##$COROFFS= 0
##$CY= 12.5
##$DATMOD= 1
##$DC= 0
##$DFILT= <>
##$DTYPP= 0
##$F1P= 14.0000005364418
##$F2P= -0.99999901652339
##$FCOR= 0.5
##$FTSIZE= 32768
##$FT_mod= 6
##$GAMMA= 0
##$GB= 0
##$INTBC= 1
##$INTSCL= 1
##$ISEN= 128
##$LB= 0.3
##$LEV0= 0
##$LPBIN= 0
##$MAXI= 10000
##$MC2= 0
##$MEAN= 0
##$ME_mod= 0
##$MI= 0
##$NCOEF= 0
##$NC_proc= -4
##$NLEV= 6
##$NOISF1= 0
##$NOISF2= 0
##$NSP= 0
##$NTH_PI= 0
##$NZP= 0
##$OFFSET= 16.51051
##$PC= 1
##$PHC0= -77.25547
##$PHC1= 6.172741
##$PH_mod= 1
##$PKNL= yes
##$PPARMOD= 0
##$PSCAL= 4
##$PSIGN= 0
##$REVERSE= no
##$SF= 250.130002873836
##$SI= 32768
##$SIGF1= 0
##$SIGF2= 0
##$SINO= 400
##$SIOLD= 32768
##$SREGLST= <1H.DMSO>
##$SSB= 0
##$STSI= 32768
##$STSR= 0
##$SW_p= 5175.98343685301
##$SYMM= 0
##$S_DEV= 0
##$TDeff= 65536
##$TDoff= 0
##$TI= <Analysis number 999999
Compound Code 99
Book Reference 9
Project Code 9>
##$TILT= no
##$TM1= 0
##$TM2= 0
##$TOPLEV= 0
##$USERP1= <user>
##$USERP2= <user>
##$USERP3= <user>
##$USERP4= <user>
##$USERP5= <user>
##$WDW= 1
##$XDIM= 32768
##$YMAX_p= 268513246
##$YMIN_p= -288622
$$ End of Bruker specific parameters
$$ ---------------------------------
##NTUPLES= NMR SPECTRUM
##VAR_NAME=  FREQUENCY,     SPECTRUM/REAL,   SPECTRUM/IMAG
##SYMBOL=    X,             R,               I
##VAR_TYPE=  INDEPENDENT,   DEPENDENT,       DEPENDENT
##VAR_FORM=  AFFN,          ASDF,            ASDF
##VAR_DIM=   32768,         32768,           32768
##UNITS=     HZ,            ARBITRARY UNITS, ARBITRARY UNITS
##FACTOR=    0.157963299565203, 1,           1
##FIRST=     4129.77378642402, 0,            0
##LAST=      -1046.20965042899, 0,           0
##MIN=       -1046.20965042899, -288622,     0
##MAX=       4129.77378642402, 268513246,    0
$$ Real data points
##PAGE= N=1
##DATA TABLE= (X++(R..R)), XYDATA
$$ [...]
16311G2672o9844J440P8899O8030j9451k4716j2492j7499l7326n9097J9836K6141
16299B6593j7827m0713n2462k6111P8324K4839P201M436k131j0256J4361K6736
16287C2990j1495l1284J619J4105J4866K3152n6009o8542J9433O0552L6783J6520
16275E2690Q693j1061m3219l2995o704k2530M7503K5200L826m6580q266j7255
16263e0698J9434K6587J3614o005K9690k7061k0331n715L1283J3182J9895N979
16251D9854J6083J1200K1726J4780K1351o1146l7507j3877k7931M2891O1034q6220
16239A2238l6450j5883M188O3702p1325J6346N0039P78n1974M941K0495j1166
16227a4071k7126m3094j6317O1283k2573j2795N0917M7686P2331K473m2619q433
$$ plain form
16311 72672 2828 4268 83167 151197 131746 107030 94538 77039 39713 -19384 452 26593
16299 26593 8766 -31947 -84409 -110520 -32196 -7357 -156 4280 2149 -8107 6254 32990
16287 32990 21495 -9789 -8170 5935 20801 43953 -12056 -80598 -61165 -613 36170 52690
16275 52690 61383 50322 7103 -25892 -32596 -55126 -7623 17577 21403 -25177 -33443 -50698
16263 -50698 -31264 -4677 8937 2932 32622 5561 -14770 -20485 10798 23980 43875 49854
16251 49854 65937 77137 98863 113643 134994 73848 36341 22464 -5467 37424 98458 12238
16239 12238 -24212 -40095 -35907 27795 -43530 -27184 22855 23633 -28341 -23400 -2905 -14071
16227 -14071 -41197 -84291 -100608 -39325 -61898 -74693 -23776 23910 96241 98714 56095 47662
16215D7662l9355m6959m2301L8507m4279l5345K5526O6210P7498J6006q4816J8301
16203c345R9335J575q6321L772M4746K5252k4277r8767j0530O389k0248J8470
16191d3949L3063L6850R679K0078N579o9069k967O081p390N1204j1559n1509j4183
16178c8092j9060k2305L9000K8478k0613P0037M0567n140j0218l7897L934j4377
16166A4314L3963p624r0639K1254L3560j2713J1407p6369o6029K3131O6889K6167
16154b2689K809l613L2635k615k2146O448N1707K6019K5445L8537p4755m2423
16142A5359K8142n566J839l0224l2134o7022P6116p715J9370k1467J4010R8228
16130H8936o1480q8586J2414M0823J2532J6590k1664k5518q499K0987M8924L4018
$$ plain form
16215 47662 8307 -38652 -80953 -42446 -86725 -122070 -96544 -30334 47164 63170 -21646 -3345
16203 -3345 95990 97565 11244 15016 59762 85014 60737 -38030 -48560 -42171 -62419 -43949
16191 -43949 -10886 25964 35643 55721 61300 -7769 -10736 -4655 -12045 39159 27600 -23909 -38092
16178 -38092 -57152 -79457 -40457 -11979 -32592 37445 78012 72872 62654 24757 28691 14314
16166 14314 48277 40653 -49986 -28732 4828 -7885 3522 -72847 -138876 -115745 -48856 -22689
16154 -22689 -19880 -23493 9142 6527 -15619 -9171 42536 68555 94000 132537 57782 15359
16142 15359 43501 37935 39774 9550 -22584 -89606 -13490 -21205 -1835 -23302 -9292 88936
16130 88936 27456 -61130 -48716 -7893 4639 21229 -435 -25953 -34452 -13465 35459 69477
16118F9477k9656l8575L5572L7906k0496j2086Q6726N6908l5714m442r2157l2840
16106B0623L4832K0174k2405n2906m878j4634p1995k8309L3158N8020N9545L2423
16094F3648J0189L786P304J1323j5888n5011L9066M2558l0712k8177m7900l6349
16082c6163q6036q555L9078m2121K4858Q8056O5935L7415K9119J5222m0125r7337
16070a0654J5424K3923L806k0553l8225K5880N5669N6292p6848J12497R2764r8006
16058A41969j02734L5089l748m6006j5058j1809j1921N754m8622N2193P4841p956
16046F1992n3605M2414O6534Q4336j0776k2435l2431m5214j5393N8266J4377j17147
16034C0918l4368N1716k4247j7464K4840K7036j6040l1043K5402R0705k9667O740
$$ plain form
16118 69477 39821 1246 36818 74724 54228 42142 128868 185776 150062 145620 53463 20623
16106 20623 55455 75629 53224 318 -4560 -19194 -91189 -119498 -86340 -28320 31225 63648
16094 63648 73837 77623 84927 96250 80362 25351 64417 106975 76263 48086 186 -36163
16082 -36163 -122199 -130754 -91676 -133797 -108939 -20883 45052 82467 111586 126808 86683 -10654
16070 -10654 4770 28693 32499 11946 -26279 -399 55270 111562 34714 147211 239975 141969
16058 141969 39235 74324 70576 24570 9512 -2297 -14218 -8464 -57086 -4893 69948 61992
16046 61992 8387 50801 117335 201671 190895 168460 136029 90815 75422 133688 148065 30918
16034 30918 -3450 48266 24019 6555 31395 58431 42391 11348 36750 127455 97788 104528
16022A04528P437J0136K9993j17991m2609J2980k4964m4158k763k2384J870Q0152
16010g773K092P468J1877J8619J87m8504K7831Q524K9611l410m6311k3700R5019
15997G1530Q2570m1014j37483q5920M3777K8972K6909j1022j2767M8999j2424
15986B127K5608k1722m8935K7185k9240K8223K5428J1753L295j7170o5505m3190
15974a02143K362P5569J2036n3340k1901R776J5068j269J9069K6820O0443L5545
15962G8035j2388j0798j1688l6783K8230J2404o0802k9193j5144O6095L6902l0695
15950A4175p471q296K2911M2101K7079J1872k1407J2182l1601j9251m3367J2078
15938A1005K7465J25194L3157m7292j8324n931l9823l2559j680m118j0383m8537
$$ plain form
16022 104528 111965 122101 152094 34103 -8506 4474 -20490 -64648 -67411 -89795 -87925 -7773
16010 -7773 -5681 1787 13664 32283 32470 -16034 11797 20321 49932 46522 211 -23489 71530
15997 71530 154100 113086 -24397 -110317 -66540 -37568 -10659 -21681 -34448 14551 2127
15986 2127 27735 6013 -42922 -15737 -44977 -16754 8674 20427 23722 6552 -58953 -102143
15974 -102143 -99781 -24212 -12176 -65516 -87417 -77641 -62573 -63842 -44773 -17953 42490 78035
15962 78035 65647 54849 43161 6378 34608 47012 -13790 -42983 -58127 7968 44870 14175
15950 14175 6704 -1592 21319 63420 90499 102371 80964 93146 61545 42294 -1073 11005
15938 11005 38470 163664 196821 149529 131205 125274 85451 52892 51212 47094 36711 -11826
15926a1826p5356K4809J00443J3846j3311P2924J1773j0611L0978l7814m3110
15915F2745m4913K1644M1287l0083l6801j7827k9274Q914q8782j2165N9315l3634
15903i9574J1837J2514R3091l643j0223Q66J6785L3829J5361k9713M3696j9628
15891F5198l8275r739J6612K4646m9260r2976P8417M1724L2848N7261o6782k3947
15879C5727L878r2489j6144N8472M8882P152M0956p9054j00914Q125N6201p855
15867c7063J9000M6061k9788K7166N8986k2525p6498l107K097L4689P0876N1566
15855A41460K6032k7351n0815l9537j6495J3037K0355Q0195M0884m9482r2510
15844D5773j2480p644K3054J7284j6108L9224j5724k546r258l4626n1832l5061
$$ plain form
15926 -11826 -87182 -62373 38070 51916 38605 111529 123302 112691 143669 105855 62745
15915 62745 17832 39476 80763 50680 13879 -3948 -33222 -24308 -113090 -125255 -65940 -99574
15903 -99574 -87737 -75223 17868 14225 4002 4868 21653 55482 70843 41130 84826 65198
15891 65198 26923 17184 33796 58442 9182 -83794 -5377 36347 69195 126456 59674 35727
15879 35727 39605 -52884 -69028 -10556 38326 45478 86434 7380 -93534 -85409 -29208 -37063
15867 -37063 -18063 27998 -1790 25376 84362 61837 -14661 -17768 -15671 19018 89894 141460
15855 141460 167492 140141 89326 49789 33294 46331 66686 146881 187765 138283 45773
15844 45773 33293 25649 48703 65987 49879 89103 73379 70833 61575 26949 -24883 -59944
15832e9944M295M082n0678L4339N4901J7602O1663Q9872j02401j16996n7442M0239
15820h0468K9031M9700Q583Q656L6545P587j7690j01948m9416M1051k1328N7779
15808c1918K8424p65p5310K2089m098R920L6845K5720O2980q032K827K811J3811
15795H5304J1654o220M7399l7445o7135j01351R145l483j5075N9849L6572K2593
15783D1807o972K1902K9837J4589m4390j3643M2973n2343o3709L0154N9873L9932
15771A00010m6571l080k1648o3604J280Q27N269M4796L4325l6631k6959O0425
15759D8439J1440J445l969m3220j4103O2384K3039J60510K69217J73698Q8644
15748G77524j28204j94117j54950r3861m555K0121n3841o0788l7321M4999R6757
$$ plain form
15832 -59944 -55649 -51567 -102245 -67906 -13005 4597 66260 156132 53731 -63265 -120707 -80468
15820 -80468 -51437 -1737 6846 15502 52047 59634 41944 -60004 -109420 -68369 -89697 -31918
15808 -31918 -3494 -4259 -79569 -57480 -61578 -51658 -14813 10907 73887 65855 68682 71493 85304
15795 85304 96958 90738 138137 100692 33557 -67794 -58649 -62132 -77207 -17358 19214 41807
15783 41807 34835 56737 86574 101163 56773 43130 86103 33760 -29949 205 60078 100010
15771 100010 53439 50359 28711 -34893 -33613 -32786 -27517 17279 51604 14973 -11986 48439
15759 48439 59879 61324 57355 14135 32 62416 85455 245965 515182 688880 777524
15748 777524 649320 455203 300253 206392 201837 221958 168117 107329 70008 115007 211764
15737B11764O9545l9890l9752N600l6539p3757m0551O0999J11473J5322m3697
15726B00517l2900m8407l7630J0471l7754m1252M419R5091K6556m1913j1932j7489
15714F7777k2785J7078j2693j5673L1583M5591j107l9137l7550r167j0324j1200
15702B393L1472m0506O408O5027N0650L0768p457o0383j4113M1316l2530n1005
15690B2040l8050K3235o459k0963P5269M2172m5011l5089K6893K1307k1960j7245
15678B6139j2496K4769M6009j1017K1699J0814j9760j5015L4406O2279j2906k912
15666A52009L2997j4852p5254n2516J0506m3165O41L2857J4457j124k1564N0181
15654H5173M9141J1412j9288m6474q615O2796N807J3436n4348r4538m756P8941
$$ plain form
15737 211764 281309 241419 201667 207267 170728 96971 56420 117419 228892 244214 200517
15726 200517 167617 119210 81580 92051 54297 13045 17464 112555 139111 97198 85266 67777
15714 67777 44992 62070 49377 33704 65287 110878 109771 70634 33084 23917 13593 2393
15702 2393 33865 -6641 -233 64794 115444 146212 138755 78372 64259 105575 73045 22040
15690 22040 -16010 7225 766 -20197 55072 97244 52233 17144 44037 65344 43384 26139
15678 26139 13643 38412 84421 73404 95103 105917 86157 71142 105548 167827 154921 152009
15666 152009 185006 170154 94900 42384 52890 9725 10366 43223 57680 56556 34992 85173
15654 85173 134314 145726 126438 79964 71349 134145 139952 153388 99040 4502 -254 78687
15642G8687l3092N5211r516l8291K1494N163l8235L0585P9942j1923k1141K8095
15630A46979l5118m0932k4746k341K9868j3026n4253Q0843P3890j6594o2752r4606
15618a2788l6819L177N0583N3139M0437P2866q892l7276m1722j4331M4440J051
15606A13865M4667N0656k633q0716j9654j6589j5857m234L0761m296n9038k4164
15594A2768J7050j8173k4332M9567R2389m8817j05455k8413P63L7488K3580K2183
15582C0598R1943M2364k0784K487j6141n5434J0047K0094l1284r6045q3476q852
15570a14483Q9268L0012m824N491n9478P2178L1844M0551k784m5584P0973J1060
15558A24224K7462J04820k1473m0658m2963o4310K4954N3007q617k1354j5762
$$ plain form
15642 78687 45595 100806 91290 52999 74493 79656 41421 72006 151948 140025 118884 146979
15630 146979 111861 70929 46183 43842 73710 60684 6431 87274 161164 144570 81818 -12788
15618 -12788 -49607 -46430 4153 57292 97729 170595 161703 124427 82705 68374 112814 113865
15606 113865 158532 209188 206555 125839 106185 89596 73739 69505 100266 95970 36932 12768
15594 12768 29818 11645 -12687 36880 129269 80452 -25003 -53416 -52653 -15165 8415 30598
15582 30598 122541 164905 144121 146608 130467 75033 85080 105174 73890 -22155 -105631 -114483
15570 -114483 -25215 4797 -27 5464 -54014 18164 50008 90559 87775 42191 113164 124224
15558 124224 151686 256506 235033 194375 151412 87102 112056 165063 156446 135092 119330
15547A19330l4565Q6046J9577o7517k4818O109N555J1509r3833J6523O3335O2258
15535A69509R890m8338r1200K3867N0133j8623o649K2676J4535Q050L222K705
15523A39777l542l3317K6041k7115k9357j6224l9161M1500M1792m5287j135J7988
15511G1960K6691M1388n8937o2872J2926P3551k3817n3899k0685j4724P108J1693
15499A0383o221m2778m9036M6492J7029N1302O7446j2663P65o5010l8590R734
15487a1147j1254L3220N1596J582m8638m0673K0311J1898p156j3847O240k6152
15475c4020K4099O1018n9780m7005L0913k1076J36964M5828j03210j3903k1006
15464a178k5738J7080K1460l03O1404l2111k6490j5565K036o93K006L1152N0678
$$ plain form
15547 119330 84765 170811 190388 122871 98053 104162 109717 121226 27393 43916 107251 169509
15535 169509 179399 131061 39861 63728 113861 95238 88589 111265 125800 133850 137072 139777
15523 139777 136235 102918 128959 101844 72487 56263 17102 58602 100394 55107 53972 71960
15511 71960 98651 140039 81102 18230 31156 104707 80890 26991 6306 -8418 -1310 10383
15499 10383 4162 -38616 -87652 -41160 -24131 27171 94617 81954 82719 17709 -20881 -11147
15487 -11147 -22401 10819 62415 63997 15359 -25314 -5003 6895 -261 -14108 -7868 -34020
15475 -34020 -9921 51097 -8683 -55688 -24775 -45851 91113 136941 33731 19828 -1178
15464 -1178 -26916 -9836 11624 11321 72725 40614 14124 -1441 595 -98 1908 33060 83738
15451H3738k6551n003K6790n786m6321P048L5242M3454J1894n6574k8016o548
15439C3367O0171M427p3124J0764j9710J2995L712k9304M9901o308l9414J3735
15427B1212J2553O339m2795l6277K1557L4452M8083Q013p6797j2308N7806L2259
15415G4097N8899j7754r4835K4517J16273N023m4531m7245R770K2261n1128j05340
15403d9993K4702M7767K7955L9775K0533M8567p1479m1817M2189j3969o5702P891
15391A6419J4397M7783l1826j4523Q9903K4219k9342j2521M302Q811j26k5736
15379I1760K4849L2295L2141k2008o3394q2856o5831M833R8927J5905l5817j4418
15367A6386l4501K8804Q0271M2696j4794p4045L648q3398k984P7896J2847l2282
$$ plain form
15451 83738 57187 52184 78974 73188 26867 33915 69157 112611 124505 67931 39915 33367
15439 33367 93538 97965 24841 35605 15895 28890 32602 3298 53199 46891 7477 21212
15427 21212 33765 40104 -2691 -38968 -17411 17041 65124 73137 -3660 -15968 41838 74097
15415 74097 132996 115242 20407 44924 161197 166220 121689 74444 84214 106475 55347 -49993
15403 -49993 -25291 22476 50431 90206 110739 159306 87827 46010 88199 74230 8528 16419
15391 16419 30816 78599 46773 32250 122153 146372 117030 104509 108811 117622 117496 91760
15379 91760 116609 148904 181045 159037 95643 12787 -53044 -48211 50716 66621 30804 16386
15367 16386 -18115 10689 90960 133656 118862 44817 48465 -34933 -37917 39979 52826 20544
15355B0544j4060P2527J3688j8370q5442J074M0927J4309R342j4241L2587O8485
15343A41370L3253n5973m3092l2331J3243M294O850J7168Q8936k4394J2096J4
15331A61434m9101o6281r6168J473M9686J7291M7877j0227k7651K6107j2110P894
15319E0224L1632l6672j9533M1506p9240k6415O8001M1788M9621M2199m4490j4921
15307A03700m2000q0759N907P4609P9819k4241l1429N9888L6386n6253l0808J5675
15295A10494N3706O6023R6m0293j28206p1427L0775M1419K0410M9771k9613k9176
15283G3979k9021M8495M7437L7168j4066n666p698k8298j9068n5751l4487K6196
15271C9220J4366J362R442N6969M4562R078k1270r0529L9990P3149k5467p3191
$$ plain form
15355 20544 6484 79011 92699 74329 -11113 -10039 30888 45197 54539 40298 72885 141370
15343 141370 174623 118650 75558 43227 56470 60764 67614 84782 173718 149324 161420 161434
15331 161434 112333 46052 -50116 -48643 1043 18334 66211 55984 28333 54440 42330 50224
15319 50224 81856 45184 25651 67157 -12083 -38498 29503 71291 120912 163111 118621 103700
15307 103700 61700 -19059 -13152 61457 141276 117035 85606 145494 181880 125627 94819 110494
15295 110494 164200 230223 230319 190026 61820 -9607 21168 62587 82997 132768 103155 73979
15283 73979 44958 93453 140890 178058 163992 158326 150628 122330 103262 47511 13024 39220
15271 39220 53586 54948 64390 121359 165921 174999 153729 63200 103190 176339 150872 77681
15259G7681K1552O8208K4278k2311m6927m4867J574j6057k361K553k1734R7210
15247A38799M391Q4264m489n0412o1296j2439j5027M853M4956J4045K0518l808
15235A64355J5716l4973n488K4968J0397q925k1143k3793q1990k6817J02909K7084
15223A42300m0034m4609J4386L94P1020K1547n1516n522n0756j689L8536n509
15211H8548k4108o5139M3086J5078N847L9941P711o400n2980j0730K2878J4119
15199G7851j2678k4315q078O451N2389o036J8896N4907l0448j6599L251M392k4170
15186I5813L2451K2918l7871K2952L2053k9823n9160K159j7176L6268P5610l660
15174A72534o1648n6313J4138K3595N7448M5882n672J2452L6452l3267o6355n0909
$$ plain form
15259 77681 99233 167441 191719 169408 122481 77614 79188 63131 60770 63323 41589 138799
15247 138799 143190 227454 222965 172553 111257 98818 83791 88644 133600 147645 168163 164355
15235 164355 180071 145098 139610 164578 174975 166050 144907 121114 39124 12307 115216 142300
15223 142300 102266 57657 72043 72437 143457 165004 113488 107966 57210 55521 94057 88548
15211 88548 64440 -699 42387 57465 63312 103253 110964 104564 51584 40854 63732 77851
15199 77851 65173 40858 32780 39231 91620 85584 104480 159387 128939 112340 115591 119983 95813
15186 95813 128264 151182 113311 136263 168316 138493 79333 81492 64316 100584 176194 172534
15174 172534 110886 54573 68711 92306 149754 195636 189964 202416 238868 205601 139246 88337
15162H8337p0781J7811K0355M6063L2801l0807N00l0616K6350J9219Q856j1366
15150A16722N208q8425K0352K345P327L2131L9039k2837p5546l5614M2868O4242
15138A07812o961j0869O0220Q1788m135o6711l7854k3299j1299K7379j797o5240
15126D9034l1699k329N2308K3250m412n9623N9337O9547p7089n9826K5303M5931
15114H9732k0840k4360l0896K9551O2853j7833p3917J2071K1447N1021J606K1244
15102A21679J9883R120O351l8847n235j8396n41p006K6855K9785L8442k4024K0942
15089A79008n605o1656o2118J5400l4415p0699L8701Q6670K1973k7492k0770k1820
15077C7177O7160N0316O004l9549q2207L4877N5284o908l7795L648n3867J5094
$$ plain form
15162 88337 17556 35367 55722 101785 134586 103779 104279 73663 100013 119232 128088 116722
15150 116722 121930 33505 53857 56202 63529 95660 134699 111862 36316 702 43570 107812
15138 107812 100851 89982 150202 231990 227855 161144 123290 99991 88692 116071 114274 49034
15126 49034 17335 15006 67314 90564 86152 26529 85866 155413 78324 18498 43801 89732
15114 89732 68892 44532 13636 43187 106040 88207 14290 26361 47808 98829 100435 121679
15102 121679 141562 150682 157033 118186 112951 94555 94014 87008 113863 143648 182090 158066 179008
15089 179008 173403 111747 49629 65029 30614 -40085 -1384 85286 107259 79767 58997 37177
15077 37177 104337 154653 160657 121108 38901 73778 129062 122154 84359 88007 34140 49234
15065D9234O5953l4084o164l5862o0813j7251O6260L0476r3605O1806J9752L8923
15053H4625O6921O721j23279L4251k2579l5502J17839k3106m9754R032l645M7369
15041A08893P8073k7337l0798j5261k6033K9358K9374p10O7049J8183m3057J1787
15029A99521k7912m1657l6546R167l3347K420P4645O7229j5551q6740j0056P86
15017A01959m0549L5042L1409L2526J4591Q0918K1459o4800j8001n285l4609R232
15005A63892j4056m5317J6796O322M0360L5696k8244n5443K1842o924J5627L0844
14993A81395r645k2453Q662n9903k6823M4601L7786m2548j820L1521N786l5642
14981A10917K5077J046l057K7333K7496K3198l3536k1659l3672m7537o0449K4454
$$ plain form
15065 49234 115187 81103 74939 39077 -21736 -38987 27273 57749 -35856 25950 45702 84625
15053 84625 151546 158267 34988 69239 46660 11158 128997 105891 56137 65169 61524 108893
15041 108893 186966 159629 128831 113570 87537 116895 146269 145559 212608 230791 187734 199521
15029 199521 171609 129952 93406 102573 69226 71646 146291 213520 197969 111229 101173 101959
15017 101959 61410 96452 127861 160387 174978 255896 277355 212555 194554 189269 154660 163892
15005 163892 149836 104519 121315 127637 167997 203693 175449 120006 141848 134924 150551 181395
14993 181395 171750 149297 157959 98056 71233 115834 153620 111072 109252 140773 146559 110917
14981 110917 135994 137040 133983 161316 188812 212010 178474 156815 123143 75606 15157 39611
14969C9611L1581N6672O5965O6466L0264n0912l3921P2163k432n0219n4900l982
14957A66356N5409j9147q862J3315q3323K8495J3938m9017N4771K6231P444M9676
14945B55286j4505O692n930l0453l3004m2963k0896J1303m6646j4244o0313L5880
14933D0207O4999n569K0939j6617K4303J4711L6124l0565l1509M430J2527l451
14921A30529R442j9306k8160L5326P7925R1586r6740o6706j6558K595P120l2586
14909I4467j9382l2501K830L3625J7808q075L4611M7806n4014j7611K6489L3706
14897A59759K832j5326J3363j2830n9346K8976K9592m3764K4101O0353J5889l7030
14885A66569m0773O4389O3300L4247j9429l3835o9366j0385K504M8721P4873K1367
$$ plain form
14969 39611 71192 127864 193829 260295 290559 239647 205726 277889 275457 225238 170338 166356
14957 166356 221765 202618 193756 207071 123748 152243 166181 117164 171935 198166 205610 255286
14945 255286 240781 247473 241543 211090 178086 135123 114227 125530 78884 64640 4327 40207
14933 40207 105206 99637 120576 103959 128262 142973 179097 148532 117023 121453 133980 130529
14921 130529 139971 120665 92505 127831 205756 297342 200602 133896 117338 119933 127053 94467
14909 94467 75085 42584 45414 79039 96847 88772 123383 171189 117175 99564 126053 159759
14897 159759 162591 147265 160628 147798 88452 117428 147020 103256 127357 187710 203599 166569
14885 166569 125796 190185 253485 287732 268303 234468 165102 154717 157221 205942 280815 302182
14873C02182l8738n8876n4426m6384N751J1202O032R159K3265k9849l4928P2786
14861A67176K0238q1245J6645N7789j3071J6749J9924j9280p6570J049P7608M4994
14849B32006K0009o9845l1425J0153l3876j925J3830k3828J9327L5479L474L1646
14837B05025L279j7583K3531n1481o3698K2116L3408o2193P954O1798L0016j4178
14825A77994j8025K1390L9664n9507K0340R028n2451K4777L3786n1524k6282M755
14813A23945j6410J6030l30o5923J3758J01953Q6215L8467m7712m0130L197K5171
14801B38231j4302J3348M2879J2703k8809R441l3550m0858k5545K0661L1072o873
14789B18398K0293M062j5597m8076j9769N8100J9476k8241p9001j751J9918J4790
$$ plain form
14873 302182 263444 204568 150142 103758 109509 120711 126743 135902 159167 129318 94390 167176
14861 167176 187414 106169 122814 180603 167532 184281 204205 184925 108355 109404 187012 232006
14849 232006 252015 182170 150745 160898 127022 125097 138927 115099 134426 169905 173379 205025
14837 205025 208304 190721 214252 162771 99073 121189 154597 92404 100358 162156 192172 177994
14825 177994 159969 181359 221023 161516 181856 190884 138433 163210 196996 145472 119190 123945
14813 123945 107535 123565 123235 57312 71070 173023 259238 297705 249993 209863 213060 238231
14801 238231 223929 237277 280156 292859 264050 273491 239941 199083 173538 194199 225271 218398
14789 218398 238691 242753 227156 179080 159311 217411 236887 208646 129645 127894 147812 162602
14777A62602n2854n6952o5732J3673K3460K299K4251L4416J680M3804O04L2545
14765A63796L721K7943O4624J4051l4667o5745j7021J2630L1416m1303L7550N2241
14753B49236j3611o6304m2489J6717K4432M2185m438m351l4824j6442m3364J2726
14741A19473N8152J7743q803L904r396N1056Q312L4029N5756l2243J0153n0227
14729B57909k2298n3453n0909L9629n650m4107l0532J7080Q7275M9804J3930P1400
14717C30078n0069n5881J6316n368M2881N0112o0305m0840k801K8809l9277J7151
14705B30806N5392K9720k6902m8846K6146o1402M1081Q111p239k0612m9139l2127
14693A44989J3414P7978R5088l5465n6468j7798l2744k5330l1279m3258P6307
$$ plain form
14777 162602 109748 52796 -12936 737 24197 26496 50747 85163 86843 130647 131251 163796
14765 163796 167517 195460 260084 274135 239468 173723 156702 169332 200748 159445 196995 249236
14753 249236 235625 169321 126832 143549 167981 210166 205728 201377 166553 150111 106747 119473
14741 119473 177625 195368 186565 190469 181073 232129 240441 274470 330226 297983 308136 257909
14729 257909 235611 182158 131249 170878 165228 121121 90589 107669 194944 244748 258678 330078
14717 330078 280009 224128 240444 235076 277957 328069 267764 226924 224123 252932 213655 230806
14705 230806 286198 315918 289016 240170 266316 204914 245995 254106 246867 226255 177116 144989
14693 144989 158403 236381 331469 296004 239536 221738 188994 163664 132385 89127 165434
14682A65434L8429j2463K707J4990L4022O2736L221p3414P8652J55346n0362j26853
14670B92445p2931K16j0129k5605k1072m7033L6642N2985P1973Q365O453M4839
14658C37148p7406q5374O4379R214K570L6194k5708l5983p6642J1188Q1370P78
14646B41728J0874M9558o0419P460J9829j3701k7534n1965J5635J8252K0558K1696
14634B51971L5596j1235k6185o0014M4704L2326m5343l1821j2686J16536N7049
14623C50898m5990K2670o041o3076K8988M4556L5627N188n9646m5967l0315p1302
14611A65590J345K946J0036P1735L9936j8377N635M204m7966N5757L8014J6218
14599C45073o549k8763j3157k309M9592J1385m4044L3375M7498o7895k1559J9510
$$ plain form
14682 165434 203863 191400 194107 209097 243119 305855 309076 235662 314314 469660 419298 292445
14670 292445 219514 219730 209601 183996 162924 115891 152533 205518 277491 285856 292309 337148
14658 337148 259742 174368 238747 247961 250531 286725 261017 225034 148392 159580 240950 241728
14646 241728 252602 302160 241741 249201 269030 255329 227795 175830 191465 209717 230275 251971
14634 251971 287567 276332 250147 190133 234837 267163 221820 189999 177313 293849 350898
14623 350898 304908 327578 321537 258461 287449 332005 367632 372820 313174 267207 236892 165590
14611 165590 166935 169881 179917 251652 291588 273211 278846 283050 235084 290841 328855 345073
14599 345073 338524 309761 296604 294295 343887 355272 311228 344603 392101 324206 302647 322157
14587C22157p046j01906q058Q4306k8328r0697K2291n2595l0715P9906o1349j1160
14575A16806J0590K5464P3365p197o6566N855O0852Q222k9632J6208m7176l4040
14563A32751N8761K9791L2075J5962J2483M7118L2952o5129k7551l0017n0478
14552A88718J1383j2534J9852k1392L1584Q0586p7501j6194j1838l4060l0218
14541A28386Q8184R6015J0373q5870k3143J00016M2004M7175l1479j10914l1996
14530B28751K7112O2511J3578l2689r6319O760P1706J9843k6631M947J3116o147
14518B86538o3493p467O7818Q0063o8960p2852j1452o953k1893K5582o524j3975
14506A86432j8512l1979J3707Q674J2610L6722O4271m37j0259l2222J8193k0294
$$ plain form
14587 322157 315111 213205 205147 289453 261125 170428 192719 140124 109409 189315 127966 116806
14575 116806 127396 152860 226225 219028 152462 158317 219169 227391 197759 213967 166791 132751
14563 132751 191512 221303 253378 269340 281823 328941 361893 296764 269213 239196 188718
14552 188718 200101 187567 207419 186027 217611 298197 220696 204502 192664 158604 128386
14541 128386 216570 312585 322958 237088 213945 313961 355965 403140 371661 260747 228751
14530 228751 255863 318374 331952 299263 202944 209704 281410 301253 274622 279569 292685 286538
14518 286538 223045 215578 283396 363459 294499 221647 210195 203242 181349 206931 200407 186432
14506 186432 167920 135941 149648 158322 170932 207654 271925 271488 261229 229007 247200 226906
14494B26906J05782K5462k8904n319j9157j8495m4974k7441N4117N9860M790l4545
14482B98082n2229N0141Q7169l793J6232j4096k8760K5037j1460q1076o4438J5491
14470B36300M483R40R3674N173K4479l6777K5324Q1405O922k5788j6298K4629
14458D24466l1434p097l7196n8342j5575l4573l634N4684m4626L1833N9649L7478
14446C75633K629o9653r021J7423j7246j8739O7935N4492N668n18J3316l072R68
14433D19815r2090j0479j099k2170L0560k0510j3674K6208K314j7294n9264P3308
14421C15625K9924K1427J1702k3168K3907M9596N3857m1443j4099m8354m2128
14410C36846M2498R895L2629r927m8808o7979r639r20M8209L4239J1819L9023
$$ plain form
14494 226906 332688 358150 329246 323927 304770 286275 241301 213860 267977 327837 332627 298082
14482 298082 245853 295994 383163 379370 395602 381506 352746 377783 366323 285247 220809 236300
14470 236300 240783 241723 335397 340570 365049 328272 353596 435001 441923 416135 399837 424466
14458 424466 393032 385935 348739 290397 274822 240249 236615 291299 246673 278506 338155 375633
14446 375633 378262 308609 299588 317011 299765 281026 348961 403453 409121 408603 421919 418847 419815
14433 419815 327725 317246 316147 293977 324537 304027 290353 316561 318875 301581 242317 315625
14421 315625 345549 366976 378678 355510 379417 429013 482870 441427 427328 378974 336846
14410 336846 379344 389239 421868 411941 363133 295154 285515 284595 332804 367043 378862 417885
14398D17885j1873j11121j4240M5667p4442l4755L0032N1972M8607l600n3816
14387B90316K6586M1795M8396j14065l293m3983l0315K8482P721l1552K050j4573
14375B07565J6662N7263N4106k3686k0134K1278J436l6646l1480l5422N1868J9574
14363B82384p825q441o1425Q3337N4047N5434N549o0204j5627J0747l167j2550
14351C22259K5064M3841o955o3500l6965l8447J6024K9423P14l0707J1592j0725
14339B61618N4147N5726p1404J9166N1320Q121p7600n304L5559j6189j2265P2429
14327C75324L2082K9079l4888k2427o1435j4856P271l7921J7446O729n0721l1846
14315B13837K8663j3355K7520P8608P201K7928m8074O0747L4006j0512n528N2305
$$ plain form
14398 417885 406012 294891 280651 326318 251876 217121 247153 299125 347732 344132 290316
14387 290316 316902 358697 407093 293028 289735 245752 215437 243919 251640 220088 222138 207565
14375 207565 224227 281490 335596 311910 291776 313054 314490 277844 246364 210942 262810 282384
14363 282384 274559 266118 204693 288030 342077 397511 403060 342856 327229 337976 334809 322259
14351 322259 347323 391164 384209 320709 283744 245297 261321 290744 291458 260751 272343 261618
14339 261618 315765 371491 300087 319253 370573 378694 301094 295790 331349 315160 302895 375324
14327 375324 407406 436485 401597 379170 317735 302879 310150 272229 289675 296404 245683 213837
14315 213837 242500 229145 256665 335273 342474 370402 322328 383075 417081 406569 401041 453346
14303D53346l5265k3762J265k6554J2180J5150p3113J8195K6156N0637L8495m3493
14291D13237p9164p0713K6170O6883l7984j7069L8027L6395m2457J7435o083n781
14279C38896N0341P2310K0406o3313K1587J732n1529K504L2234K7067J1764m3653
14267D20346l7262N6327L5284L2520k7158r0559j0410L8842j156L5872J151k7378
14255D26419n875m660J469N4039L500n682l2595o8237n0434P1937K423l185o2733
14242C26386L978N3734J2174K3755n4890o6924N0651Q8023N41p0375L5830N3748
14230D56631j8391o1800K2490N8050R1823N6934k9633o8043k8256p1854M2973
14219D50924O2994j3548m4113j15961n0484J7940J5127R4795P6583l5130j0304
$$ plain form
14303 453346 418081 394319 395584 369030 381210 396360 323247 341442 367598 418235 456730 413237
14291 413237 334073 263360 289530 356413 318429 301360 339387 375782 333325 350760 344677 338896
14279 338896 389237 461547 481953 418640 440227 441959 390430 392934 425168 452235 463999 420346
14267 420346 383084 439411 474695 507215 480057 389498 379088 417930 416774 452646 453797 426419
14255 426419 420544 415884 417353 471392 474892 469210 436615 368378 317944 389881 392304 389119 326386
14242 326386 330364 384098 396272 420027 365137 298213 348864 436887 437428 367053 402883 456631
14230 456631 438240 376440 398930 456980 548803 605737 576104 508061 479805 407951 450924
14219 450924 513918 500370 456257 340296 289812 307752 322879 417674 494257 459127 448823
14208D48823N0025r2555p4525K1513K9424K6062K9366M6960l454O12k2487n0726
14196D09038J3241k9371l6576j872O79j0528q1588K5070L9081N8291P2820L8574
14184D96859n9367j7883P02j1645n164P3987n7761J583K0865l8711l6776N461
14172C72150K9376J2241L3535m355n3084k6563M694J1605p260j6990O7879J5023
14160D38251j5600P2696l6626j4976P3156K0486k330m7136j30560j6067M4569
14149C85863M5518M0006M595k9094m3833L112R1181J8703m5343J7669M5889J6752
14137E51018j2017k5745k6242L8863l116j4699Q929M4150q01o4373K5693N4676
14125E76336o3067o5115l867N6816P7097j3116n8395K5028j5830k3835R451L0238
$$ plain form
14208 448823 498848 406293 331768 353281 382705 408767 438133 485093 481639 482251 459764 409038
14196 409038 422279 392908 356332 354460 355139 344611 263023 288093 327174 385465 458285 496859
14184 496859 437492 419609 420311 408666 403502 477489 419728 421311 442176 403465 366689 372150
14172 372150 401526 413767 447302 442947 389863 363300 367994 379599 372339 355349 423228 438251
14160 438251 422651 495347 458721 443745 516901 537387 535057 487921 357361 341294 385863
14149 385863 431381 471387 475982 446888 403055 406167 497348 516051 470708 488377 534266 551018
14137 551018 539001 513256 487014 525877 522761 508062 516991 561141 560340 495967 521660 576336
14125 576336 513269 448154 444287 501103 578200 565084 506689 531717 515887 492052 501503 531741
14113E31741k5590q572O8821J02570m6271q4221J6763J5q111J4470J7850m1344
14101E38121k6903k9153n078L7060k9603n034J3274N7857O6946k3104n9011j5631
14089E19741m715J5521q2546m298Q3097o281l7194l6087l0703M3520k7820J0456
14077D42691L0964M3297M917K9630l2444j926J3571J5378L1515m0069n2911J6346
14065E00959k7805M0913J0309l4069k5237K8963J8842K007q852J7960J2787j8195
14053E18582l1647K605m631k9037M8442o885k9430L6408r825k2104L5400M2605
14041E50483j0819j5680K8931K0048J5310Q589k6949j9616q30K0756j5538j5329
14029E39356o2183l9944P466K9098J0841J9705N3691R716M4300J8346m5051K284
$$ plain form
14113 531741 506151 497579 566400 668970 622699 538478 555241 555256 547145 561615 579465 538121
14101 538121 511218 482065 476987 514047 484444 479410 492684 550541 617487 594383 535372 519741
14089 519741 515026 530547 448001 443703 526800 520519 483325 447238 416535 460055 432235 442691
14077 442691 473655 516952 521869 551499 519055 517129 530700 546078 577593 537524 484613 500959
14065 500959 473154 514067 524376 490307 465070 494033 512875 514882 506030 523990 536777 518582
14053 518582 486935 489540 484909 455872 504314 497429 467999 504407 494582 472478 507878 550483
14041 550483 539664 523984 552915 572963 588273 596862 569913 550297 549467 570223 554685 539356
14029 539356 477173 437229 444695 473793 484634 504339 558030 567746 612046 630392 585341 587625
14017E87625N0161j4198n0992j2137p0767J8686R3297P134J6054n0325j2134J855
14005E64259K9042J2656j3281l6851J5662l2397p6506J9154R7125L7972k3306
13994E93529j6868N7794L6630l3338K9643J0404r3957p9288M1376k984J1934l0312
13982E24563l4514K0277L1599N9087M8877Q776m1193l8430m1403k0801L2109K8856
13970E77803J1664j3125j049j0019m535K8948j0822N5549J942j8065j2270l2481
13958E73540k761m6967K6583O6465N1575l9046j3623k2423m9425k5301k0811J7115
13946E14921J08714N6721N484l8762l8198J6443L3019o6815l7944J8303J5425
13935E87311M6820R0721R720l080o1597K3296n244j03616o6347k9277l339R2961
$$ plain form
14017 587625 637786 623588 572596 560459 489692 508378 601675 608809 624863 574538 562404 564259
14005 564259 593301 605957 592676 555825 571487 539090 462584 481738 578863 616835 593529
13994 593529 576661 634455 671085 637747 667390 677794 583837 504549 545925 542941 554875 524563
13982 524563 490049 510326 541925 601012 649889 658665 617472 579042 537639 516838 548947 577803
13970 577803 589467 576342 575293 565274 560739 589687 578865 634414 636356 618291 606021 573540
13958 573540 570779 523812 550395 616860 668435 629389 615766 593343 543918 518617 497806 514921
13946 514921 623635 680356 685840 647078 608880 625323 658342 591527 553583 571886 587311
13935 587311 634131 724852 734572 731492 669895 693191 687947 584331 517984 488707 485368 578329
13923E78329K3236O856J9110L0328K4441L440L630n3884p6713O8780O4788K9759
13911G22100M12L4067o2033l2819n3847p2116k0607P7584O2955N5834l6319K8860
13899G04071l2371J4905P1143J0030m4305o9171l3930K8075O2838P818j8853m9519
13887F50731n3984L6986M8414P2733o03J0244r237n7289k798p1632l2831J5420
13875F06154P6522J6660J662l1169q329L2147J6297l1010J4875l9403N0364n669
13863F99101l6769n866L0728L8637j2657m6723J7219j1104K7441L4689j3119k3880
13851F97697K640M542Q648j3440J3284k2388k39P2410L8256K5002o971k0314k8703
13838G70424j5726N2433M0249p079J4140n3062M372M7364j2343j7593o8244m7316
$$ plain form
13923 578329 601565 608421 627531 657859 682300 685740 689370 635486 558773 627553 692341 722100
13911 722100 722512 756579 694546 661727 607880 535764 515157 592741 655696 711530 675211 704071
13899 704071 671700 686605 757748 767778 723473 654302 620372 648447 711285 719103 700250 650731
13887 650731 596747 633733 682147 754880 754277 764521 755284 697995 695197 623565 590734 606154
13875 606154 682676 699336 700998 669829 661500 693647 709944 678934 693809 654406 704770 699101
13863 699101 662332 656466 687194 725831 713174 666451 683670 672566 700007 734696 721577 697697
13851 697697 700337 704879 713527 700087 713371 690983 690744 763154 801410 826412 819441 799127 770424
13838 770424 754698 807131 847380 840301 854441 801379 805751 853115 840772 823179 754935 707619
13826G07619K9706J6028J5921J6388n105n418L9406K3673q110k9677q4411q180
13814G07840L2422M287Q047K6903j4845n0624n2334O0687M5122K9254J8875j02984
13802G12650m7756R703R066N6149R7535k3476p2517j5332L5677L494N1164N9733
13790H76090L5996J9452k9436q6286k7660k0091J3334J297L9681k1891m5596J5615
13778G70505M191O5914J6447m3551m0836J0641K3547k7397j3783P3668k0418j7337
13766H01591j7806K7257O9654K3782p6941l0925O6394N3815O3407J2176j0435
13755I81969J9366M1910l2162L1022M8347j3187m8665n6909l8272n8030J7302
13744H92691O9096o8602k4642N0018k6382o4621k3083p081r763j3943p519J5119
$$ plain form
13826 707619 737325 753353 769274 785662 780557 775139 814545 838218 830108 800431 716020 707840
13814 707840 740262 744549 752596 779499 764654 714030 661696 722383 767505 796759 815634 712650
13802 712650 664894 674597 683663 739812 837347 813871 741354 726022 761699 765193 816357 876090
13790 876090 912086 931538 902102 815816 788156 768065 781399 782696 822377 800486 754890 770505
13778 770505 774696 840610 857057 813506 772670 783311 806858 779461 765678 839346 818928 801591
13766 801591 783785 811042 880696 904478 827537 796612 863006 916821 980228 992404 981969
13755 981969 1001335 1043245 1011083 1042105 1090452 1077265 1028600 971691 933419 875389 892691
13744 892691 961787 893185 868543 918561 892179 827558 804475 797394 787631 773688 766169 781288
13732G81288O3628M2765L9226j3048K8562O4018l6215l9121J1865k6817n0038
13721H66113k5527L917L5880J8106j1954m3242L3842N667N9712K9080J0000J4164
13709I95758Q864L445r0746p7542K1346M0859N395J4899K0742r2607j07716K9609
13697G72306Q1881K7328J5976n3869m7958L2122O5700J1221J3886l0572o521M6562
13685I28062p111J9722P6145j4716j8020j9290K2101m0446K9948l573m0602M3029
13673I75249O4898k9195q9188l0586J7586L5246N5286L9631o86q9015k5687N4246
13661I77785K8573J7713N3878l698o2032j3761O4403M8269l179J6053R549O626
13649A140179p241q7627m8346K7996J0275L4296k3314j3362n944k8472P7096L4367
$$ plain form
13732 781288 844916 887681 926907 913859 942421 1006439 970224 931103 942968 916151 866113
13721 866113 840586 844503 880383 898489 886535 843293 877135 882802 942514 971594 981594 995758
13709 995758 1004622 1008067 917321 839779 861125 901984 907379 922278 943020 850413 742697 772306
13697 772306 854187 881515 897491 843622 795664 827786 893486 904707 918593 888021 881500 928062
13685 928062 920951 940673 1016818 1002102 984082 964792 986893 946447 976395 972822 932220 975249
13673 975249 1040147 1010952 921764 891178 908764 944010 999296 1038927 1038241 949226 923539 977785
13661 977785 1006358 1024071 1077949 1074251 1012219 998458 1062861 1111130 1107951 1124004 1133553 1140179
13649 1140179 1132938 1045311 996965 1024961 1035236 1069532 1046218 1032856 1026912 998440 1075536 1109903
13637A109903l4787K0738k2868j1303O779J4658K600P7500j3994o2356L0876K3568
13625A141314o157l9051k2051M1263p696L3692l2833p4543K3560P290l7344K6343
13613A053787J12844M1910l0996k9570n7992k1655m7892l9864J6676J16967M463
13602A118678q6651M0214L5263R2307J349k4670k6911k8205k8260j4921J965L4724
13590A114882n5427K1494N869L0125N2239N5915n4791r213N0842K4918k2814J532
13578A215571N7874K672p7629k9454Q6674L7242K3777o7656k0596j2607o7388
13567A148480Q645L2922j5117J9069L9201O259m1694j14391K5883O4550N5615
13556A229422K2470o4403n3747n4662M5969M2631L0218M6186j1886K1083j6857
$$ plain form
13637 1109903 1075116 1095854 1072986 1061683 1068462 1083120 1085720 1163220 1149226 1086870 1117746 1141314
13625 1141314 1135157 1096106 1074055 1115318 1107622 1141314 1108481 1033938 1057498 1064788 1027444 1053787
13613 1053787 1166631 1208541 1177545 1147975 1089983 1068328 1020436 980572 997248 1114215 1118678
13602 1118678 1032027 1072241 1107504 1199811 1201160 1176490 1149579 1121374 1093114 1078193 1080158 1114882
13590 1114882 1059455 1080949 1086818 1116943 1169182 1225097 1170306 1161093 1211935 1236853 1214039 1215571
13578 1215571 1273445 1276117 1198488 1169034 1255708 1292950 1316727 1249071 1228475 1215868 1148480
13567 1148480 1157125 1190047 1174930 1193999 1233200 1239459 1197765 1083374 1109257 1173807 1229422
13556 1229422 1251892 1187489 1133742 1079080 1125049 1167680 1197898 1244084 1232198 1253281 1236424
13545A236424p1770j0713K0921O7059N7602K4604j3005r5156m5157K3651K8838
13534A223298L8480O7535J7399L904l9753n5986L9724l7333n924L6098n667m1775
13522A240000j1829l97l56N2419O3785q646j7564K2181K7734j2717p3116j2043
13510A269451K9317l049L748M5711l5709R095J2274M0278m5744N1983L3284m965
13498A405674J2667K3466l259m9785m671j8633k7973K372K9841O6314j6624l2157
13486A387232l5426J867J2284K6895R2111K4492o4743j03608r646O4415Q3100
13475A478973k6652r3729m8908J04210N8357l1303Q333p595O5070j7097n4135
13464A435524k7619N7578k656m575N3526J4150O591N4281j7921p0277n2262k9970
$$ plain form
13545 1236424 1164654 1153941 1174862 1241921 1299523 1324127 1311122 1215966 1170809 1194460 1223298
13534 1223298 1261778 1329313 1346712 1350616 1310863 1254877 1294601 1257268 1251344 1287442 1281775 1240000
13522 1240000 1228171 1227774 1227418 1279837 1343622 1334976 1317412 1339593 1367327 1354610 1281494 1269451
13510 1269451 1298768 1295719 1299467 1345178 1309469 1318564 1330838 1371116 1325372 1377355 1410639 1405674
13498 1405674 1418341 1441807 1438548 1388763 1384092 1365459 1337486 1339858 1369699 1436013 1419389 1387232
13486 1387232 1351806 1353673 1365957 1392852 1484963 1509455 1444712 1341104 1331458 1395873 1478973
13475 1478973 1452321 1358592 1309684 1413894 1472251 1440948 1449281 1441686 1506756 1489659 1435524
13464 1435524 1407905 1465483 1462827 1458252 1511778 1525928 1532519 1586800 1568879 1498602 1446340 1416370
13452A416370K7275l2510j9176K561N7589P8218p834K4618j0171q732n6123j7178
13440A454907K9939M0956l6005l9208l9294P4396P253j25971p4529Q8384J12037
13429A492865l0859L9977N3335k8747k3486J872l5321K0727Q3561K8688N8759
13418A661371K0070j7001L5344O77j6441j8411N1071l0262r4532P8230O6154J7086
13406A753356K3388n2934o7287k6943K5645K7423n7178r5237N8783K7816M8323
13395A665155K6581k1626o705K2492j2045o886N1236K4407l1987j5158M2739M5803
13383A784006k4788l2101m5324Q0397r619n0980r809M7998K3889K087o4972J2627
13371A713411J707p265N1455m733J0576N7732n050N4773K951l8946j0202j03457
$$ plain form
13452 1416370 1443645 1411135 1391959 1394520 1452109 1530327 1522493 1547111 1536940 1528208 1472085 1454907
13440 1454907 1484846 1525802 1489797 1450589 1411295 1485691 1492944 1366973 1292444 1380828 1492865
13429 1492865 1462006 1501983 1555318 1526571 1503085 1504957 1469636 1490363 1573924 1602612 1661371
13418 1661371 1681441 1664440 1699784 1700461 1684020 1665609 1716680 1686418 1591886 1670116 1736270 1753356
13406 1753356 1776744 1723810 1656523 1629580 1655225 1682648 1625470 1530233 1589016 1616832 1665155
13395 1665155 1691736 1670110 1663405 1685897 1673852 1666966 1718202 1742609 1710622 1695464 1738203 1784006
13383 1784006 1759218 1727117 1681793 1762190 1752571 1701591 1691782 1739780 1763669 1765756 1700784 1713411
13371 1713411 1715118 1707853 1759308 1754575 1765151 1822883 1817833 1872606 1875557 1836611 1826409 1722952
13359A722952K908M8653O260M5118J6626K6490n921j9891N0726J1750n1230k7796
13347A826645M2001n4750L096n3708J5043M1590K3978j4661j7957P89L6760P3273
13335A922099N3569n4374K1240M619O34j0089K297K6953j0145k2318l1343M5886
13323A949028R349k2108K0485K171L1103k0874p0345J4030N3363N4748N937k2056
13311B004831Q618J4427J706k6582M9307L5334P0353K6313L839P1517j6422q2936
13299B160305q0049m3029n9075R877N5627M1427M1601O3039N154j48l0183j3551
13287B150995K9766l3891Q0151l5477o6418l9652J9679P775M691M7182J5302K6752
13275B206855k5590p5088J13405Q7113Q092m5317k6569P006L9028M9918J3129
$$ plain form
13359 1722952 1725860 1774513 1780773 1825891 1842517 1869007 1863086 1843195 1893921 1905671 1854441 1826645
13347 1826645 1868646 1813896 1816992 1763284 1778327 1819917 1843895 1829234 1811277 1812066 1848826 1922099
13335 1922099 1975668 1921294 1942534 1947153 1947787 1937698 1939995 1966948 1956803 1934485 1903142 1949028
13323 1949028 1958377 1936269 1956754 1958925 1990028 1969154 1898809 1912839 1966202 2020950 2026887 2004831
13311 2004831 2013449 2027876 2029582 2003000 2052307 2087641 2157994 2184307 2188146 2259663 2243241 2160305
13299 2160305 2080256 2037227 1978152 1988029 2043656 2085083 2126684 2189723 2194877 2194729 2164546 2150995
13287 2150995 2180761 2146870 2227021 2191544 2125126 2085474 2105153 2112928 2117619 2164801 2180103 2206855
13275 2206855 2181265 2106177 2219582 2306695 2314787 2269470 2242901 2249907 2288935 2338853 2351982
13264B351982k6942j0041l142J0803J8418l1400j7093J138O1551L7508L217l0717
13252B365282q563L380n556m0276j4157j8618L807J8914M5690O5777l3931o7324
13240B314425k7898L827L2276M5326R7183j361k266l9168m820R251l563P755J3478
13227B444445P3454J082m7301n0982l0235n636J0962Q9491N0837J8986P574J351
13215B564028K3966j9860J8649K8845J0457p7804r3622N490P3949l0898j1379
13204B491821l6191J1726J5118j3558M231L9905M7117M1881M6367K5161j4925
13193B658653n90J2599j0840l2526K3519J0489N288j8689l8551O4521M0824l7252
13181B677445J2010P6603J00123O1991k2670p028n4342q2508j556J0406J01746
$$ plain form
13264 2351982 2325040 2314999 2311857 2322660 2341078 2309678 2292585 2293723 2355274 2392782 2395999 2365282
13252 2365282 2356719 2360099 2354543 2314267 2300110 2281492 2285299 2304213 2349903 2415680 2381749 2314425
13240 2314425 2286527 2290354 2322630 2367956 2465139 2463778 2461512 2422344 2417524 2426775 2423212 2430967 2444445
13227 2444445 2517899 2518981 2471680 2420698 2390463 2384827 2395789 2485280 2536117 2555103 2562677 2564028
13215 2564028 2587994 2568134 2586783 2615628 2626085 2548281 2454659 2460149 2534098 2503200 2491821
13204 2491821 2455630 2467356 2482474 2468916 2473147 2513052 2560169 2602050 2648417 2673578 2658653
13193 2658653 2658063 2670662 2659822 2627296 2650815 2661304 2666592 2647903 2609352 2673873 2714697 2677445
13181 2677445 2689455 2766058 2866181 2928172 2905502 2898474 2844132 2761624 2760068 2770474 2872220
13170B872220J1009l4313k6348j6757k4390m813P8896N9873o583J0887K0962K0192
13158B960835j9004J8105J5149k5146j503l8049l318J4752M2515N6511M159k0479
13146C004527R800P1995O027j4002L6573K6717l4604L1342K8305J904l0534l0520
13134C107530R520j4737N874K0619R4372O7779j9773o9225j3654p881M2181O055
13122C228660M71l2242j1517K9449N7681M6519J447l8347l2781l6474j4368m192
13110C194306J4191M2294L7439M8844J0579o302J3568P7550L0847n7349N688L4466
13098C446121l471l130M5940k7500K9011M3254N682J4638r87N5621k5847l972
13086C575360n566J8206k8994K3254j3672k4694O0861K8938k8374J9148J2831
$$ plain form
13170 2872220 2883229 2848916 2822568 2805811 2781421 2776608 2855504 2915377 2908794 2919681 2940643 2960835
13158 2960835 2941831 2959936 2975085 2949939 2948436 2910387 2907069 2921821 2964336 3020847 3025006 3004527
13146 3004527 3014327 3086322 3092349 3078347 3114920 3141637 3107033 3138375 3166680 3168584 3138050 3107530
13134 3107530 3117050 3102313 3108187 3128806 3223178 3290957 3271184 3201959 3188305 3180424 3222605 3228660
13122 3228660 3229131 3196889 3185372 3214821 3272502 3319021 3320468 3282121 3249340 3212866 3198498 3194306
13110 3194306 3208497 3250791 3288230 3337074 3347653 3341351 3354919 3432469 3463316 3405967 3411655 3446121
13098 3446121 3442650 3439520 3485460 3457960 3486971 3530225 3535907 3550545 3549558 3605179 3579332 3575360
13086 3575360 3569794 3588000 3559006 3582260 3568588 3543894 3604755 3633693 3605319 3624467 3637298
13075C637298N3805K4747l0020j1897j1906M9892k8570Q777L0415q411o951P147
13063C714326K3906K2740N9525m7960j6932K8536P542J1121n512q836P0676J7768
13051C876900j4259o809K0005M1554O5552J49l0408l728M9463o1954j1704N9443
13039C984204J4512L6839M7538M2332K5919J9708J1316k8598l6996l2972K7721
13028D111523M4689m8485m1303R4303P6210P2826P939m1363k0481K4940R0201
13017D370999K9142L9686M3629L2535K3128J9246n9528l7055L7079k994L946m059
13005D495754j610l126o318K7046N0991O3681j6281k0327l746k7773L8590J08383
12993D705264J5167n1214M655L6236L9950R532J3900j4650J1172k674K5217L0032
$$ plain form
13075 3637298 3691103 3715850 3685830 3673933 3662027 3711919 3683349 3692126 3722541 3714130 3707179 3714326
13063 3714326 3738232 3760972 3820497 3772537 3755605 3784141 3791683 3802804 3797292 3788456 3859132 3876900
13051 3876900 3862641 3855832 3875837 3917391 3982943 3983092 3952684 3948956 3998419 3936465 3924761 3984204
13039 3984204 3998716 4035555 4083093 4125425 4151344 4171052 4182368 4153770 4116774 4083802 4111523
13028 4111523 4156212 4107727 4066424 4160727 4236937 4309763 4317702 4276339 4255858 4280798 4370999
13017 4370999 4400141 4439827 4483456 4515991 4539119 4558365 4498837 4461782 4498861 4495867 4499813 4495754
13005 4495754 4494144 4491018 4484700 4511746 4562737 4626418 4610137 4589810 4586064 4558291 4596881 4705264
12993 4705264 4720431 4669217 4673872 4710108 4750058 4759590 4773490 4758840 4770012 4767338 4792555 4822587
12981D822587M1295Q9517O288m9424K9532K7193l5157n1598L101l0432n1535R0661
12969D892028O715M5212P5669Q5769L7940n8025n819O0966m0417n3421m1289j8744
12957D986584Q7814P1195O2541N2370O9860L6284Q14k0722j8324R611K1048K0632
12945E379707N6835k7512m4443K7316P246o100j3301N8353P6122P3865N0694l2639
12933E606143K4856K6778M1821q742k0673K7898N1726K834J0542P878l7073O508
12921E740496J25437P9854R098k8687p705l3215O249O9650L3223K5945J04558
12910F124903R281O007O2931K4469K2990m0945J3753q798K1315j7129K6550J1753
12898F257080j5835K5082J07403P3555k7565r3864k0126P5102Q3950L6250m0805
$$ plain form
12981 4822587 4863882 4953399 4959687 4910263 4939795 4966988 4931831 4880233 4883334 4852902 4801367 4892028
12969 4892028 4898743 4943955 5019624 5105393 5143333 5085308 5079489 5140455 5100038 5046617 5005328 4986584
12957 4986584 5074398 5145593 5208134 5260504 5330364 5366648 5367462 5346740 5328416 5338027 5359075 5379707
12945 5379707 5436542 5409030 5364587 5391903 5399149 5393049 5379748 5438101 5514223 5588088 5638782 5606143
12933 5606143 5630999 5657777 5699598 5690856 5670183 5698081 5749807 5752641 5763183 5771061 5733988 5740496
12921 5740496 5865933 5945787 5954885 5926198 5918493 5885278 5891527 5961177 5994400 6020345 6124903
12910 6124903 6134184 6140191 6203122 6227591 6250581 6209636 6223389 6214591 6235906 6218777 6245327 6257080
12898 6257080 6241245 6266327 6373730 6447285 6419720 6325856 6305730 6380832 6464782 6501032 6460227
12887F460227M1004N2507L1031P567K8279R217p372l2382O9906J0430R9694M2490
12875F812598j3018j8459K755m160K3093L4906N5679j8399l4732K7776M4932O3018
12863F975989O7976L0096q905J6828K0385M2173N7005J5528K5300j755j0203K8232
12851G258649K9614P5369N0770l152m363O7659J6120J1111R189O4539N5051k2306
12839G608250L9194P780Q5830M3431k626k2414M0406j6464K7523L2150Q3177J5314
12827G941551J8854J0434N305J6098J7611J6259L2905M1007J7953K3548L5841
12816H177366L6417K6154j650K4971q992L8546R4898J14615J2382K6480O065N7905
12804H605157l3481K9004N3326O0427J6049J8598M0703M3682J3429J7996L3682
$$ plain form
12887 6460227 6501231 6553738 6584769 6592336 6620615 6629832 6622460 6590078 6659984 6670414 6770108 6812598
12875 6812598 6799580 6781121 6783876 6779716 6802809 6837715 6893394 6874995 6840263 6868039 6912971 6975989
12863 6975989 7043965 7074061 7065156 7081984 7102369 7144542 7201547 7217075 7242375 7240620 7230417 7258649
12851 7258649 7288263 7363632 7414402 7411250 7406887 7474546 7490666 7501777 7510966 7575505 7630556 7608250
12839 7608250 7647444 7655224 7741054 7784485 7781859 7759445 7799851 7783387 7810910 7843060 7926237 7941551
12827 7941551 7960405 7970839 7976144 7992242 8009853 8026112 8059017 8100024 8117977 8141525 8177366
12816 8177366 8213783 8239937 8238287 8263258 8254266 8292812 8387710 8502325 8514707 8541187 8547252 8605157
12804 8605157 8571676 8600680 8654006 8714433 8730482 8749080 8789783 8833465 8846894 8864890 8898572
12793H898572p50J5270L0743K6432J29382P9961J7028L4353j1862j5124K6358
12782I230363k5287N0344Q9479N95j335M7541M2202L2896N2373J25640R3832M9108
12770I787751N9626J9844l4688K1700j647q32M2928M252P4035M9161O8775j2608
12758A0078297K519N5933N382J53L3812J09735M2771j07K3323j30r856R7384N6982
12745A0496198L1002J5767J3122N3076j63K3974M8713J03917M0988o130L8468
12734A0858932L9400j7678J8338O3380M2519N9895Q6595P6478M1887J6461j684
12723A1284523L8518Q7575M454n2373N883M5571J23202N8301R8641J06240K4631
12712A1825166m5593p580O6304N8844K2608q0486P888J25038M8932J4100K4187
$$ plain form
12793 8898572 8897822 8913092 8943835 8970267 9099649 9179610 9196638 9230991 9219129 9204005 9230363
12782 9230363 9205076 9255420 9344899 9345494 9344159 9391700 9433902 9466798 9519171 9644811 9738643 9787751
12770 9787751 9847377 9867221 9832533 9854233 9852586 9851754 9894682 9898934 9972969 10022130 10090905 10078297
12758 10078297 10080816 10136749 10142131 10142284 10176096 10285831 10328602 10328495 10351818 10351688 10341832 10439216 10496198
12745 10496198 10527200 10542967 10556089 10609165 10609002 10632976 10681689 10785606 10826594 10820464 10858932
12734 10858932 10898332 10880654 10898992 10962372 11004891 11064786 11151381 11227859 11269746 11286207 11284523
12723 11284523 11323041 11410616 11415070 11362697 11368580 11414151 11537353 11595654 11694295 11800535 11825166
12712 11825166 11779573 11771993 11838297 11897141 11919749 11839263 11847151 11972189 12021121 12035221 12059408
12701A2059408N6569N5143K1870J26751L2577K2252N6908O0300J5686J2007R9775
12690A2619246J25576N4615R0974P5827l1990O1638O2089J8823Q951J6468N8907
12679A3161124O0254J7516j1127o2819m9370Q3277R1010L1808J6813Q2312J61679
12668A3582477Q5829M8318J0937J9964K7314J5454J2905L9972P2898J10311J5742
12657A4042121j8009J1365l333M1567R7998L5816J0517L8479J02705J31954M0607
12646A4531787J5805J1739R237O0984P3063L319j9982K9528M6608P8989J00198
12635A4941275M2007J4134M8643J6596L6291R2698R2913O3583N2407L4576l818
12624A5431305O7827Q2819L7773P34K1038J0095O3331M6940M075j1949O4132L1015
$$ plain form
12701 12059408 12115977 12171120 12192990 12319741 12352318 12374570 12431478 12491778 12507464 12519471 12619246
12690 12619246 12744822 12799437 12890411 12966238 12934248 12995886 13057975 13076798 13085749 13102217 13161124
12679 13161124 13221378 13238894 13227767 13164948 13115578 13198855 13289865 13321673 13338486 13420798 13582477
12668 13582477 13668306 13716624 13727561 13747525 13774839 13790293 13803198 13843170 13916068 14026379 14042121
12657 14042121 14024112 14035477 14032144 14073711 14171709 14207525 14218042 14256521 14359226 14491180 14531787
12646 14531787 14547592 14559331 14568568 14629552 14702615 14705934 14685952 14715480 14762088 14841077 14941275
12635 14941275 14983282 14997416 15046059 15062655 15098946 15191644 15284557 15348140 15400547 15435123 15431305
12624 15431305 15499132 15581951 15619724 15620458 15641496 15651591 15714922 15761862 15765937 15753988 15818120 15849135
12612A5849135R6388Q2370K0807L7334O3947Q040L04P1894N5461O8623M0030j47
12600A6394186J4863J0360L8064N0095j6315K7891N9525M0549N7613J2593M9708
12589A6739132J8141R278Q1087M6716K6064J14441M8106M0936K4931k6156J0686
12578A7133362P189J3025N6716J07867P6481j4240N2779O7913O6294j414j31292
12567A7434680K7133J20216O4587N6640N206J8097m2963o162P3617N7223J07054
12556A7915328R2724Q8965M0358L3050K4489n533n6991o7910l2643K2477N8404
12545A8112718O7336J9849K547L1925N2874N8052K6521K8226m658L2010L8948
12534A8466348M0447M9845K1322J1225O1416m274k2952k8528O7509M734L449L5206
$$ plain form
12612 15849135 15945523 16027893 16048700 16086034 16149981 16158021 16158325 16230219 16285680 16354303 16394333 16394186
12600 16394186 16409049 16419409 16457473 16507568 16491253 16519144 16578669 16619218 16676831 16689424 16739132
12589 16739132 16757273 16766551 16847638 16894354 16920418 17034859 17082965 17123901 17148832 17122676 17133362
12578 17133362 17140551 17153576 17210292 17318159 17394640 17380400 17433179 17501092 17567386 17565972 17434680
12567 17434680 17461813 17582029 17646616 17703256 17708462 17726559 17683596 17677434 17751051 17808274 17915328
12556 17915328 18008052 18097017 18137375 18170425 18194914 18189381 18132390 18064480 18031837 18054314 18112718
12545 18112718 18180054 18199903 18202450 18234375 18287249 18345301 18371822 18400048 18395390 18427400 18466348
12534 18466348 18506795 18556640 18577962 18589187 18650603 18646329 18623377 18594849 18662358 18667092 18670541 18705747
12522A8705747M9736j2047j812N6556R4342k5055r294R724k3278M0302N4918J5166
12510A8955005n9952m2874r742K0146O9740M1080N0269M1091L0558k2526m4249
12499A9028546L5712r348J4800N242r633k2730O9653N0475J0997r9274K7177O3005
12487A9164622J341k1822K8508m50k5995j474o4700k1051K8559J06227j6736n3974
12475A9123055q8057K3937j2895k658J7316M6608k0542n0368m2778l2118O6032
12464A9027532K5854m8935l431M0312N7216m7434l2950j0296J9138M62n6182m7716
12452A8923570o2336k9495J671O6097l3968j02187l859L8982n1882k4970J8040
12441A8739663j1246j37413j9727K7605j5239K2618J7776N0774r14j1047o9184
$$ plain form
12522 18705747 18755483 18743436 18741624 18798180 18892522 18867467 18858173 18867897 18844619 18884921 18939839 18955005
12510 18955005 18895053 18852179 18842437 18862583 18932323 18973403 19023672 19064763 19095321 19072795 19028546
12499 19028546 19064258 19054910 19069710 19074952 19065319 19042589 19112242 19162717 19173714 19074440 19101617 19164622
12487 19164622 19165963 19144141 19172649 19172199 19146204 19144730 19080030 19058979 19087538 19193765 19177029 19123055
12475 19123055 19034998 19058935 19046040 19043382 19060698 19107306 19086764 19036396 18993618 18961500 19027532
12464 19027532 19053386 19004451 19001020 19041332 19098548 19051114 19018164 19007868 19027006 19027468 18971286 18923570
12452 18923570 18861234 18831739 18833410 18899507 18865539 18763352 18759493 18798475 18746593 18721623 18739663
12441 18739663 18728417 18591004 18571277 18598882 18583643 18606261 18624037 18674811 18673897 18662850 18593666
12430A8593666r1924q3854k3024p3383L2830K7517n5995n0752l1832m0334K9820
12419A8232735r545M6162M2801j19506j27141n7969j643J1466o4254o9297M195
12408A7888004J8377l6925k5136m0408q609o1995P497J6922L3046n2514o0977
12397A7677282m9808n0802n8437k4212j9609j0754l3753k4804N771j7422k8068
12386A7365384j02017l6374j9114n3914l8223L741j6998p6683n1786q1713n9377
12375A6832926K3423q0611k9169m562n1234m654o2276p1739m3706r971p0277m7436
12363A6380714n1746m7728n1411j8237p6015k1820K5808m8551o1732M7977j524
12352A6075735k6986j3453j27570n7279k7450j7563q316j0549o6462n7261o7914
$$ plain form
12430 18593666 18501742 18417888 18394864 18321481 18354311 18381828 18325833 18275081 18243249 18202915 18232735
12419 18232735 18223190 18269352 18312153 18192647 18065506 18007537 18005894 18017360 17953106 17883809 17888004
12408 17888004 17906381 17869456 17844320 17803912 17795303 17733308 17740805 17757727 17790773 17738259 17677282
12397 17677282 17627474 17576672 17518235 17494023 17474414 17463660 17429907 17405103 17410874 17393452 17365384
12386 17365384 17263367 17226993 17207879 17153965 17115742 17119483 17102485 17025802 16974016 16892303 16832926
12375 16832926 16856349 16775738 16746569 16742007 16690773 16686119 16623843 16552104 16508398 16498427 16428150 16380714
12363 16380714 16328968 16281240 16229829 16211592 16135577 16113757 16139565 16091014 16029282 16077259 16075735
12352 16075735 16048749 16035296 15907726 15850447 15822997 15805434 15797118 15786569 15720107 15662846 15594932
12341A5594932o3098K0320j16305n5937Q0020o1863n8047p2156p7444q9444k7262
12330A5073716k3675q516l8550l661l1602n4584m1567p7061k8417n3622j5489
12319A4696972r9456q4617j4550J9031k6419n513l2956q1966j04071o0406r8828
12308A4107221J2905p020o0215m0753l9910q7638l8757l3594r3857j25436k0649
12297A3572297n5189k1000j2334j8254k0590j0513M4864m9504j00259j00736k1390
12286A3207392N5063m1829l8659l7334n578l5182k9998J5144K4734l4505J0823
12275A3090071j4810j05994p7382j4608j23976j08260k1812o6395q7838q5618
12265A2383378j34831j9966p289J5635p9734n5546p5181o8194j5396K7757K0840
$$ plain form
12341 15594932 15531834 15552154 15435849 15379912 15459932 15398069 15340022 15267866 15190422 15100978 15073716
12330 15073716 15050041 15041525 15002975 14999314 14967712 14913128 14871561 14794500 14766083 14712461 14696972
12319 14696972 14597516 14512899 14498349 14517380 14490961 14485448 14452492 14370526 14266455 14206049 14107221
12308 14107221 14120126 14113106 14052891 14012138 13972228 13884590 13845833 13812239 13718382 13592946 13572297
12297 13572297 13517108 13496108 13483774 13465520 13444930 13434417 13479281 13429777 13329518 13228782 13207392
12286 13207392 13262455 13220626 13181967 13144633 13139055 13103873 13073875 13089019 13113753 13079248 13090071
12275 13090071 13075261 12969267 12891885 12877277 12753301 12645041 12623229 12556834 12468996 12383378
12265 12383378 12248547 12228581 12221292 12236927 12157193 12101647 12026466 11958272 11942876 11970633 11991473
12254A1991473j9285r1048r5196k7271l2921K5992l398o4963m8886l5247J2794
12243A1612044m428m4667n2416o9680m2432l7514n5658r9929o5466k9326q3804
12232A1026724J9239O957m0765p1319o8634k5907L8126M1684n2869m6919j06584
12221A0719733j9829m4564k0668m7992q3282q135K4600o1736n9853l1928l8251
12210A0328095m547o245r7723m7928Q205P236o9944r7867m7298j0682k005O283
12198I965580k3583q2652j05492o1995P149J1705m9674k7517m8864m3889p4865
12187I465903n7012l9611j1987k1994j1381l8896k5285L7618q1961j5826o0762
12176I138806p0643J3360L74l444L0357l647o7627q5823p3717k0273q6546m1035
$$ plain form
12254 11991473 11972188 11881140 11785944 11758673 11725752 11751744 11748346 11683383 11634497 11599250 11612044
12243 11612044 11607616 11562949 11510533 11440853 11398421 11360907 11305249 11205320 11139854 11110528 11026724
12232 11026724 11045963 11052920 11012155 10940836 10872202 10846295 10884421 10926105 10873236 10826317 10719733
12221 10719733 10699904 10655340 10634672 10586680 10503398 10495263 10519863 10458127 10398274 10366346 10328095
12210 10328095 10323548 10317303 10219580 10171652 10179857 10187093 10117149 10019282 9971984 9961302 9959297 9965580
12198 9965580 9941997 9859345 9753853 9691858 9699007 9710712 9661038 9633521 9584657 9540768 9465903
12187 9465903 9408891 9369280 9357293 9335299 9323918 9285022 9259737 9297355 9215394 9199568 9138806
12176 9138806 9068163 9081523 9081897 9078453 9108810 9105163 9037536 8951713 8877996 8857723 8771177 8730142
12164H730142j4950J9151J6400R441o1778r2235n3882q186n8622n0784j4351J2249
12152H432595l1951m8393j7742J2915r5854o5810n5758J8948K1905M6271L5564
12141H252690m7022o2775k3138p5991n3649J1865l9533N1806J2682n9784q2606
12130G884545m2051j43163l7497m6405K3096K0877n6044l4410K5765j06m7111
12119G547496N212J9709j634m5872o8003m1338l8991j1244q492j9257k9931J9006
12107G326661L252m4579j07791j10129j3183j989L5713J2417Q1006M6088k1241
12096G206225M3614n6542j29407l1011l5643o3757r0105l5223L0289k1040m8898
12085F768502j1286p5257l2004J2863m737J6014l4653o1705L170L962J428m9231
$$ plain form
12164 8730142 8715192 8734343 8750743 8760184 8698406 8606171 8552289 8544103 8485481 8434697 8420346 8432595
12152 8432595 8400644 8352251 8334509 8347424 8251570 8185760 8130002 8148950 8170855 8217126 8252690
12141 8252690 8205668 8142893 8119755 8043764 7990115 8001980 7962447 8014253 8026935 7967151 7884545
12130 7884545 7842494 7699331 7661834 7615429 7638525 7659402 7603358 7568948 7594713 7594607 7547496
12119 7547496 7552708 7572417 7570783 7524911 7456908 7415570 7376579 7365335 7356843 7337586 7307655 7326661
12107 7326661 7329913 7285334 7177543 7067414 7054231 7052242 7087955 7100372 7181378 7227466 7206225
12096 7206225 7249839 7193297 7063890 7032879 6997236 6933479 6843374 6808151 6838440 6817400 6768502
12085 6768502 6757216 6681959 6649955 6662818 6658081 6674095 6639442 6577737 6580907 6584869 6586297 6537066
12073F537066m8451l8353l1500L3287j5081p4750n3838n1956R543l2558n123m4695
12061F183591k2086k1761J02645O982q836L1024M2130N1586j1310l9081K321J4059
12049F331264o4029K069M2753K7969j6479L464o2666r7338P352l1500j00433l7268
12037F005158n0016k7875K890m3528j516q6831q1603k6703l2662K2856K9644r238
12025E700576k6874o1897L529p0235q3299L8053k5329o1659p8449j11458M1670
12014E264628m361N3929R0644J1247j28077j0064O5312K8477o0124j05181l0397
12003E176033m0913j4498L4519r756m7663r397L9105O6023K698o3263m5073l3751
11991E054064L1943l8005o8705o6257l802n6246m7237O5238n3227o006O288o0205
$$ plain form
12073 6537066 6488615 6450262 6418762 6452049 6436968 6362218 6308380 6256424 6265967 6233409 6228286 6183591
12061 6183591 6161505 6139744 6242389 6249371 6240535 6271559 6313689 6365275 6353965 6314884 6317205 6331264
12049 6331264 6267235 6269304 6312057 6340026 6323547 6327011 6264345 6167007 6174359 6142859 6042426 6005158
12037 6005158 5955142 5927267 5930157 5886629 5885113 5798282 5716679 5689976 5657314 5680170 5709814 5700576
12025 5700576 5673702 5611805 5615334 5545099 5461800 5499853 5474524 5412865 5334416 5222958 5264628
12014 5264628 5260267 5314196 5404840 5416087 5288010 5277946 5343258 5371735 5311611 5206430 5176033
12003 5176033 5135120 5120622 5155141 5145385 5097722 5088325 5127430 5193453 5196151 5132888 5087815 5054064
11991 5054064 5086007 5048002 4979297 4913040 4909238 4852992 4805755 4870993 4817766 4811760 4818048 4757843
11979D757843q5328k1939P0631L6728l1392R028J1267p762k1379k3840p0716O794
11967D629935M4496m4429J3203K8892J9355K2866m2081J5280o0181r6202n9120
11956D472014m7934k2092j6875K5047j3962m864O6420p465p0212m8394k1298j5839
11944D294546J4529k0942m3374n3471O2300O4132N652j2082L697j6610l5050k4415
11932D238912p7935j2430r754K152L488l594j6098p093n2642j3826j1874j9729
11920D019577k922j4230q3387k3309P5159P9091n1472p5394L1089k6525j3769
11909C913908l6404l3943r842J5864l5953O5908L6699j3750L429l8737J83m4952
11897C822410o391K7008m8674q735p2058k0328n9887N543J2937R095J3954q183
$$ plain form
11979 4757843 4672515 4650576 4721207 4757935 4726543 4735571 4746838 4739076 4717697 4693857 4623141 4629935
11967 4629935 4674431 4630002 4643205 4672097 4691452 4714318 4672237 4687517 4627336 4531134 4472014
11956 4472014 4424080 4401988 4385113 4410160 4396198 4391334 4457754 4450289 4380077 4331683 4310385 4294546
11944 4294546 4309075 4288133 4244759 4191288 4253588 4317720 4323372 4311290 4314987 4298377 4263327 4238912
11932 4238912 4160977 4148547 4138793 4140945 4144433 4140839 4124741 4117648 4065006 4051180 4039306 4019577
11920 4019577 4016655 4002425 3919038 3895729 3970888 4049979 3998507 3923113 3954202 3927677 3913908
11909 3913908 3877504 3843561 3833719 3849583 3813630 3879538 3916237 3902487 3905916 3867179 3867362 3822410
11897 3822410 3816019 3843027 3794353 3785618 3713560 3693232 3633345 3638888 3651825 3660920 3674874 3666691
11885C666691k3283l0776n6860J5998N4292l0553q317m545k1460m1636q2190M276
11873C441637J7140J8300Q57l2044o1347m4102k0157K9063P3214M6022k7583m4558
11861C396442R632k9632K9691P991M103p3643M2191K9238r449M11k4273l5270
11849C347432k4988q809L1968p1127n4875k2309J0449O2300l1817m2098j8043
11838C178083M0663O3100J039p4821n7381N1578N2236k6407M216k4138o6747J2111
11826C153532N219J1427k560l3775m2697K1155j7417j7888j8493K557p3656J1159
11814B998563K6880M026K5069m4118l7809j3754l0111J3837L2446P015o6582k7226
11802B888236P5589j6304L435r094N5008q491m3295o2885j02133j02192M9622
$$ plain form
11885 3666691 3643408 3612632 3555772 3571770 3626062 3595509 3587192 3582647 3561187 3519551 3437361 3441637
11873 3441637 3458777 3477077 3477934 3445890 3384543 3340441 3320284 3349347 3422561 3468583 3441000 3396442
11861 3396442 3406074 3376442 3406133 3414124 3418227 3344584 3386775 3416013 3406564 3406975 3382702 3347432
11849 3347432 3322444 3313635 3345603 3274476 3219601 3197292 3207741 3270041 3238224 3196126 3178083
11838 3178083 3218746 3281846 3282885 3208064 3150683 3202261 3254497 3228090 3232306 3208168 3141421 3153532
11826 3153532 3158751 3170178 3167618 3133843 3091146 3112301 3094884 3076996 3058503 3061060 2987404 2998563
11814 2998563 3025443 3029469 3054538 3010420 2972611 2958857 2928746 2942583 2975029 2982044 2915462 2888236
11802 2888236 2963825 2947521 2950956 2941862 2996870 2988379 2945084 2882199 2780066 2677874 2727496
11791B727496M0989L4102j9921m7727k9239K5226K2054P8436l729l7243L3110
11780B823554N573m6457m0866l0447K1851M2056M0659p4848l9970k0418k4134
11769B656553m840o61K4126K5511M8945J4109p9457n740J4841l9246n4328O954
11757B606767O9998k6602p6340L073K0332p3144k6584J7031J2862j0380J6837
11746B533850N6518p4418r650L880k4845o4402M4932J5143M928K7486j9585m9266
11734B444571q48L7724o111j7537p9408m428M1240K3779L8648k1146Q088N1475
11722B516047j9371q1592j15801n0229M0217N8287m5958n652O4765m5421n3333
11711B261959p216K9116L892m1132m7209J863j6505J4594P1782j9077M792J281
$$ plain form
11791 2727496 2768485 2802587 2782666 2734939 2705700 2730926 2752980 2831416 2827687 2790444 2823554
11780 2823554 2829127 2782670 2741804 2711357 2733208 2775264 2815923 2741075 2701105 2680687 2656553
11769 2656553 2651713 2651052 2675178 2700689 2749634 2763743 2684286 2678546 2693387 2654141 2599813 2606767
11757 2606767 2676765 2650163 2573823 2576896 2597228 2524084 2497500 2514531 2527393 2517013 2533850
11746 2533850 2590368 2515950 2506300 2510180 2485335 2420933 2465865 2481008 2485936 2513422 2493837 2444571
11734 2444571 2443723 2481447 2475336 2457799 2378391 2373963 2415203 2438982 2477630 2456484 2464572 2516047
11722 2516047 2496676 2415084 2299283 2249054 2289271 2347558 2301600 2295948 2360713 2315292 2261959
11711 2261959 2254743 2283859 2287751 2246619 2199410 2201273 2184768 2199362 2271144 2252067 2256859 2258140
11699B258140J6578r882j5673L507K2032j1445j3209N4844j4415m0563j1010l1889
11687B207015n9753O3619J4080M4993n0391j4892J1337R103m0637L8041L3888
11676B256403L086r5609m8432Q234k577O1391L3722L4128n80p7661m8832R322
11664B132595K6815n9230j5333k6171L0081J7600J576o0623K267J7260M452j2496
11652B058793L2211k6520M802q8776l5594M350K8499o2534k7724Q9717k3268m7558
11640A906398J8637M0411M6692J5109m3315j3074R472L4512J8914L7672k2287
11629B049141o1919q770l982R155K7796r1412j2297L2078L9948J4705j3972m2821
11617A937650K7141R895j39930m4408O7519M2222j9992p2633j0769M0401j9927
$$ plain form
11699 2258140 2274718 2264836 2249163 2252670 2274702 2263257 2250048 2304892 2290477 2249914 2238904 2207015
11687 2207015 2147262 2210881 2224961 2269954 2219563 2204671 2216008 2225111 2184474 2222515 2256403
11676 2256403 2259489 2163880 2115448 2123682 2121105 2182496 2216218 2250346 2249766 2172105 2123273 2132595
11664 2132595 2159410 2100180 2084847 2058676 2088757 2106357 2107933 2047310 2049577 2066837 2071289 2058793
11652 2058793 2091004 2064484 2069286 1980510 1944916 1949266 1977765 1915231 1887507 1977224 1953956 1906398
11640 1906398 1925035 1965446 2012138 2027247 1983932 1970858 1980330 2014842 2033756 2071428 2049141
11629 2049141 1987222 1978452 1974470 1983625 2011421 1920009 1907712 1939790 1979738 1994443 1980471 1937650
11617 1937650 1964791 1974686 1834756 1790348 1857867 1900089 1880097 1807464 1796695 1837096 1817169
11606A817169o1470O4797O7376K2162j4108n6091J7799l105m1476o3862p0792
11595A678399K2521K9058q18J10209N6060o2029l7214j40o821m1182m1766j6880
11583A689397l5599l4917K3554O5630R9040M1914r1467l6595Q667N453J5186N1288
11571A801551L449k1718o063M568q1369j2692o559Q551J07338l7200q9778l8329
11559A631749l2085M1853k5076r492p187K5879M4359k3437o7905p165J4464k8124
11547A557833j5540R3083K5906q293j3673o4391K292J8678M099j5441K4719q1035
11535A528237m1541L7479N0722p0106m8985L6067J9857M8430l293o6938l6438
11524A453491P59J768R2879M7647J0153L0452n3467k7595J8016p279l8510m5635
$$ plain form
11606 1817169 1755699 1820496 1887872 1910034 1895926 1839835 1857634 1854529 1813053 1749191 1678399
11595 1678399 1700920 1729978 1729160 1839369 1895429 1833400 1796186 1796046 1789225 1748043 1706277 1689397
11583 1689397 1653798 1618881 1642435 1708065 1807105 1849019 1757552 1720957 1729624 1735077 1750263 1801551
11571 1801551 1805000 1783282 1777219 1781787 1700418 1687726 1681167 1689718 1797056 1759856 1670078 1631749
11559 1631749 1599664 1641517 1616441 1606949 1599762 1625641 1670000 1646563 1578658 1571493 1585957 1557833
11547 1557833 1542293 1635376 1661282 1652989 1639316 1574925 1577217 1595895 1599994 1584553 1609272 1528237
11535 1528237 1486696 1524175 1574897 1504791 1455806 1491873 1511730 1560160 1556867 1489929 1453491
11524 1453491 1454250 1456018 1548897 1596544 1606697 1637149 1583682 1556087 1574103 1566824 1528314 1482679
11512A482679Q355O0559j6717l8301Q479N7590m4756l6093o1600J858l6587K8790
11500A414256Q3497J587n328l5906l3850o061j6988J08432J4542l5161n0798l4080
11488A404142k9687O3701j7431q1924n6909k0456N1340L7333J737l7717M7149
11477A361278L6816O896J1264K1666j4017m1823o899P268O5769L851j15057J1905
11465A348917Q5442j0018p0534M79m354L1443J3400k1939K4593N925P832p591
11453A403595m1154J9967k6091m1119j9605l9225j8907Q970N2015P1476J8187
11442A388109m5968j9677o891k020m024N5734L6626l4531J5301K5333O07k4045
11430A384554l8174k4883L4526k0617j6779l1985Q2920R941p1316k2982l3610
$$ plain form
11512 1482679 1491034 1551593 1534876 1496575 1505054 1562644 1517888 1481795 1420195 1422053 1385466 1414256
11500 1414256 1497753 1499340 1494012 1458106 1424256 1418195 1401207 1509639 1524181 1489020 1438222 1404142
11488 1404142 1374455 1438156 1420725 1338801 1281892 1261436 1312776 1350109 1351846 1314129 1361278
11477 1361278 1398094 1404990 1416254 1437920 1423903 1382080 1375181 1382449 1448218 1452069 1337012 1348917
11465 1348917 1434359 1424341 1353807 1354286 1349932 1381375 1394775 1372836 1397429 1403354 1411186 1403595
11453 1403595 1362441 1382408 1356317 1315198 1295593 1256368 1237461 1246431 1298446 1369922 1388109
11442 1388109 1342141 1322464 1315573 1313553 1309529 1365263 1401889 1367358 1382659 1407992 1408599 1384554
11430 1384554 1346380 1321497 1356023 1335406 1318627 1286642 1369562 1379503 1308187 1285205 1251595
11419A251595M9498k3620j0679L355J0531k0896q0197l18P7264M7800k7355l3858
11407A243120m8686k046J8293P762j8082L4997L6783L6177q545k2876k3285k9849
11395A223763o6762L6056P377k5816m3472L1264j1742l9313R544P4431M1398J4689
11383A251417n630K2544k5469n2589k1519K2637O1914n2312n0195P8988J0019
11372A239805l6534K5445l716J4035r53o4304n0023L2735J3848l9364k1628r404
11360A099942o3184Q5682J06738J6308k1819P513o841o2633k0853o4873N03P387
11348A083870k4064L6641P9234M873l9402m789J1404q919k6406l9899j4211j5841
11336A042491M501J00843M9825o6746j4364N8401l8886q1958N6034j6255m4647
$$ plain form
11419 1251595 1301093 1277473 1266794 1270149 1280680 1259784 1179587 1179269 1256533 1304333 1276978 1243120
11407 1243120 1194434 1192388 1210681 1218443 1200361 1235358 1272141 1308318 1299773 1276897 1253612 1223763
11395 1223763 1157001 1193057 1200434 1174618 1131146 1162410 1150668 1111355 1120899 1195330 1236728 1251417
11383 1251417 1245787 1268331 1242862 1190273 1168754 1191391 1253305 1200993 1150798 1229786 1239805
11372 1239805 1203271 1228716 1225000 1239035 1238082 1173778 1123755 1156490 1170338 1130974 1109346 1099942
11360 1099942 1036758 1122440 1229178 1245486 1223667 1231180 1224339 1161706 1140853 1075980 1076483 1083870
11348 1083870 1059806 1096447 1175681 1180554 1141152 1136363 1147767 1138848 1112442 1072543 1058332 1042491
11336 1042491 1046992 1147835 1197660 1130914 1116550 1174951 1136065 1054107 1110141 1093886 1049239
11325A049239k2244k6626k6697M0791L0774J8221j8286j546j971r5857M0745j0574
11313I75969o832j7047L7388P3889K2406m5879m1300o172p651J8368m098M891
11301A003932J3041J2365J7634K3556k9711p809K3518n0840L0514K088m9032l055
11289I86201L4064j980j3136M4485R4078K6302l6719r7250J1249K6253j5480r209
11277A048858J1272O0451k512l5995r210J7545L9352L9160O0953R9955J42324
11266A472153J71964J87301J90310J51611O5615k6017j88989j90472j34149j53674
11256A545653j55816K872j7278n2355n5983j14990m1636j0477j6580o198J4m2187
11244A035039l0173P5095J0703n3441n6799N0474K268j1000J9736o066m2750k1418
$$ plain form
11325 1049239 1026995 1000369 973672 1014463 1045237 1063458 1045172 1043626 1041655 945798 986543 975969
11313 975969 969137 952090 989478 1063367 1085773 1039894 998594 992422 984771 1003139 999041 1003932
11301 1003932 1016973 1029338 1046972 1070528 1040817 1033008 1056526 1005686 1036200 1038288 989256 986201
11289 986201 1020265 1018285 1005149 1049634 1143712 1170014 1133295 1036045 1047294 1073547 1058067 1048858
11277 1048858 1060130 1120581 1118069 1082074 1072864 1090409 1129761 1168921 1229874 1329829 1472153
11266 1472153 1644117 1831418 2021728 2173339 2238954 2212937 2023948 1833476 1699327 1545653
11256 1545653 1389837 1392709 1375431 1323076 1267093 1152103 1110467 1099990 1083410 1077212 1077226 1035039
11244 1035039 1004866 1079961 1090664 1037223 980424 1030898 1033166 1022166 1041902 1035836 993086 971668
11232I71668k2967k6341q58O6008r432M083J9062o479l1607n6125L814L0877k3261
11219I18442l2408j11K005J7706n8867P2819L9280j8676m6273m8462L6099K5610
11207I07164J2124j5350k1796l3469K6604P4185R114m8647o0266m6801L055M1199
11195H47116M3990l7997M6361m0241r6494l5033K1095J5316J1867O3950P7058
11184I16988k993l8263o9997n8988m2586J307R5222P6994k9758N6723J8376l5557
11172H87468m9187k0555j5886K2522J7408J1804l2417J2127l297j2188p102l0015
11160G80682o0948L2921J7201L0383M3704P3537L2062l1865q3469j14088o9670
11149F50450O4234L5372L3540j6520j1140J708L7023L117k0436M5281N4632j1412
$$ plain form
11232 971668 948701 922360 921502 987510 978078 982161 1001223 994744 963137 907012 910826 941703 918442
11219 918442 886034 885923 887928 905634 846767 919586 958866 940190 893917 845455 881554 907164
11207 907164 919288 903938 882142 848673 875277 949462 958576 909929 849663 802862 805917 847116
11195 847116 891106 853109 899470 859229 762735 727702 748797 764113 775980 839930 916988
11184 916988 913995 875732 805735 746747 704161 705468 800690 877684 847926 904649 923025 887468
11172 887468 838281 817726 801840 824362 841770 853574 821157 833284 829987 817799 810697 780682
11160 780682 719734 752655 769856 800239 843943 917480 949542 917677 834208 720120 650450
11149 650450 714684 750056 783596 767076 755936 757644 794667 797784 777348 822629 877261 865849
11137H65849r597J2230O7172j09758q1392M3853O1767l835k8486l8909k1207j9667
11125G38020J7022J1200j3775J5658j8953J1474Q2342M1253P14o2648J1693Q2574
11113I16574P9326l7079p581m7848j47853l3115R5256k3169p7113Q9417J356l0962
11101G77209k5396k2539K5687l0072O917L7170o2174l3055J1597l0041K7684J6217
11089F99204J0992o822K7925J4891k9573L0746l6702p6577r735N8797J6406N4458
11077G54010P3274l1574k3506J5355L1977M0478n6237j8689m0681K4837n23k8097
11065G40624o8280n694o6502M6288K8233K0695o276K7916k5415M026K1589M4714
11053G61918J2860q832K2347L0309j515P8619N6346m7843j219K936j9338j0725
$$ plain form
11137 865849 856252 868482 935654 825896 744504 788357 850124 846289 817803 778894 757687 738020
11125 738020 755042 766242 752467 768125 749172 760646 842988 884241 884955 822307 834000 916574
11113 916574 995900 958821 951240 903392 755539 722424 817680 794511 717398 806815 808171 777209
11101 777209 751813 729274 754961 724889 731806 768976 706802 673747 685344 655303 682987 699204
11089 699204 710196 703374 731299 746190 716617 747363 710661 634084 624349 683146 699552 754010
11077 754010 827284 795710 772204 787559 819536 860014 803777 785088 744407 769244 768721 740624
11065 740624 672344 666650 600148 646436 674669 695364 689088 717004 691589 695615 717204 761918
11053 761918 774778 765946 788293 818602 817087 895706 952052 904209 902990 905926 886588 875863
11041H75863J6078P8882N5432M3733l4018J7928J4937M0036m6682L0896K1909
11030A114994L863j2481l828N5824M0878K0681P9987L1357J700j3570p8519r0599
11018A150287J653l7518r8640n0615R150O0546P1812N0147L0215j7032q1231j29860
11006I58914j6458m3894j1112R677l6196m8530L7652j0803n0485q017j5225j7272
10994G48251j9391J7874O8038P6254l6790M490n8021q6754l2446k5444m8306O1600
10982F69355J01363L6442K3430o087J9293N4894R415K0217R7357Q4809R3787J26994
10970A331269O0533P1818P7017N6425m8476o2735p7302j13107j3439p5886o7398
10959A138719P469L3189n4987r9157m9380K2517K9962j582m868J0116n0427n6540
$$ plain form
11041 875863 891941 970823 1026255 1069988 1035970 1053898 1068835 1108871 1062189 1093085 1114994
11030 1114994 1118857 1106376 1102548 1158372 1199250 1219931 1299918 1331275 1332975 1319405 1240886 1150287
11018 1150287 1151940 1114422 1015782 965167 974317 1034863 1106675 1156822 1187037 1170005 1088774 958914
11006 958914 942456 898562 887450 897127 860931 812401 850053 839250 788765 780748 765523 748251
10994 748251 728860 746734 814772 891026 854236 858726 800705 713951 681505 656061 607755 669355
10982 669355 770718 807160 830590 824503 843796 898690 908105 928322 1025679 1110488 1204275 1331269
10970 1331269 1391802 1463620 1540637 1597062 1548586 1485851 1408549 1295442 1282003 1206117 1138719
10959 1138719 1146188 1179377 1124390 1025233 975853 998370 1028332 1026750 1021882 1031998 981571 925031
10947I25031L8346M1969n127m53M1635QN668j9699K4723k1774p9672l9940J9408
10934I30123L7594m206m3517N7167M3251O0011m838Q5188J28258R3696J04685
10923A487412K78078L75090M41803O47229R21835P24966K80970l26143o97300
10914D133940o65235m73921l95141k58233j55761m8187o2147l9358q5326k2277
10904A928354L248K9K2039m1044P945r967L0299Q0047J2853J6777P3832R6787
10892B221199Q6381J48367J34762J58695K60823K50403L03895L23152K78354L95720
10882D561751N88186O34088O52100P05187O94363N94225N91424P94877J168043
10873A0984244J356987J427294J526125J751940K082675K828484L987110N552693
$$ plain form
10947 925031 963377 1005346 1000219 999766 1041401 1041409 1047077 1027378 1052101 1030327 950655 910715 930123
10934 930123 967717 963511 919994 977161 1020412 1080423 1075585 1160773 1289031 1382727 1487412
10923 1487412 1765490 2140580 2582383 3229612 4151447 4876413 5157383 4831240 4133940
10914 4133940 3468705 2994784 2599643 2341410 2185649 2137462 2075315 2035957 1950631 1928354
10904 1928354 1931602 1931631 1953670 1912626 1920571 1910604 1940903 2020950 2033803 2050580 2124412 2221199
10892 2221199 2307580 2455947 2590709 2749404 3010227 3260630 3564525 3887677 4166031 4561751
10882 4561751 5149937 5784025 6436125 7141312 7835675 8429900 9021324 9816201 10984244
10873 10984244 12341231 13768525 15294650 17046590 19129265 21957749 25944859 31497552
10865C1497552Q009844J1562862J6892828K4437737L4331393M5302743N0074831
10858B22109790L8480025P923431k8803917m6126629m1212591l0715296k2140582
10851I9514231j6135785j1838148q761353o652282m928774l621552k830500k778074
10843D1967763l210067l508483l439408l182295k858022k411831k005373j800307
10835A9551977j700753j648275j473963j324995j164787r79156q36071o80503
10827I743474o71571n03818l38136k74780j54465j1499K15078N21985N36041J67854
10817I230163m74410j017516j085887q11000o05796n11329m28090l57847k64369
10808C673919j54633j61836j90961j59767j35390j73173j20470j56753j57253
$$ plain form
10865 31497552 39507396 51070258 67963086 92400823 126732216 172034959 222109790
10858 222109790 260589815 268513246 239709329 193582700 152370109 121654813 99514231
10851 99514231 83378446 71540298 62778945 56126663 51197889 47576337 44745837 41967763
10843 41967763 38757696 35249213 31809805 28627510 25769488 23357657 21352284 19551977
10835 19551977 17851224 16202949 14728986 13403991 12239204 11260048 10423977 9743474
10827 9743474 9071903 8568085 8229949 7955169 7800704 7789205 8004283 8526268 9062309 9230163
10817 9230163 8755753 7738237 6652350 5841350 5235554 4724225 4296135 3938288 3673919
10808 3673919 3519286 3357450 3166489 3006722 2871332 2698159 2577689 2420936 2263683
10799B263683p7145N667o4505j19016m4985k5102l9675m5947j41196p2798k241
10788A636740K4001L3876o6930r7491m45k1548k9303O650l7106o5392l6039j8802
10776A328211j3362m2729m4800o3860n2744K46j261k5556N3503J8319O785k270
10764A160482m7307j3062n3591p5646p9000R319M4399K4171K6655L3556l1215
10753I98761m2411k5389k054M8113N685Q0771j8389n3693j05255r4399N8936J29428
10741I80104N149n6946j3827n7209k9075p34M3614L0247K1911L0370L5875J1806
10729A001285M8324L6740l3210l7386o1362o9114M668N347j7837m2043o8500m3589
10717G23323j2435M4408L5684O0218L4696O826q9684n8949L2163O6450J6010K9951
$$ plain form
10799 2263683 2186538 2192205 2127700 2008684 1963699 1938597 1898922 1852975 1711779 1638981 1636740
10788 1636740 1660741 1694617 1627687 1530196 1529751 1508203 1478900 1485550 1448444 1383052 1347013 1328211
10776 1328211 1314849 1272120 1227320 1163460 1110716 1110962 1109701 1084145 1137648 1155967 1162752 1160482
10764 1160482 1113175 1100113 1046522 970876 891876 901195 945594 969765 996420 1029976 998761
10753 998761 956350 930961 928907 977020 982705 1063476 1045087 991394 886139 791740 850676 980104
10741 980104 985253 928307 914480 857271 828196 827462 871076 901323 923234 953604 989479 1001285
10729 1001285 1049609 1086349 1053139 1015753 954391 885277 889945 895292 877455 835412 766912 723323
10717 723323 710888 755296 790980 851198 885894 892720 803036 744087 776250 842700 858710 888661
10705H88661m4442K0172O9020l9275o2550j0775K7560k7397n4958J3398O5326
10694H44740K1239n8766r859M7304J3034o5520o9665M411j2368K6213j4417j5647
10682G10699L3756K242k2039q510j2096m4404k6503R7210M2615k3551j5362J1836
10670G45893Q3370Q250K2386o6034l7238M6607L7801J4187m1765o4654l7627L647
10658G14823M4653L0024K2963J8484n9236J9842J8726k2033n854J9306k6579j1856
10646G63263J7589P9860R1519O9864O2880O7732J1806Q825J27694J13929J07543
10635A522504K19867K43508J66478J81411K50406K06315K41937L62932M58252
10626C853610M99699P17911J173767J451636J985254K720500L485701M357506
$$ plain form
10705 888661 844219 864391 933411 894136 831586 820811 848371 820974 766016 779414 844740
10694 844740 865979 807213 797354 844658 857692 792172 722507 726918 714550 740763 726346 710699
10682 710699 744455 746697 724658 716148 704052 659648 633145 730355 772970 749419 734057 745893
10670 745893 829263 837513 859899 793865 756627 803234 841035 855222 813457 748803 711176 714823
10658 714823 759476 789500 812463 830947 771711 791553 810279 788246 782392 801698 775119 763263
10646 763263 780852 860712 952231 1022095 1084975 1152707 1164513 1173338 1301032 1414961 1522504
10635 1522504 1742371 1985879 2152357 2333768 2584174 2790489 3032426 3395358 3853610
10626 3853610 4353309 5071220 6244987 7696623 9681877 12402377 15888078 20245584
10618B0245584M919951M758262L615609J701505l7809q62004o31459M27073J982771
10609C6119483L914701O044806Q168507R727528R243359N993992Q80412l535676
10601G6557112n149254m121125j891416J017149M167337P403092J0492169J2067435
10593A00542499J0415318M851657k880529q963818j0815687r312484o459345l335771
10585G4041840m16984K380044M768247N653987M230137K47806m870194q622680
10577G7412203r343343p987068n903353l872388k170494o92431L50670O33694
10569D8427490m6520j716739l656009m952926n168445m678067l892663l212026
10561B1104095k508031k054601j729768j399559j159751r83846r68678r08810
$$ plain form
10618 20245584 25165535 29923797 33539406 35240911 35203102 34341098 33709639 34136712 36119483
10609 36119483 40034184 46078990 54247497 63975025 73218384 79212376 80092788 76557112
10601 76557112 71407858 67286733 65395317 66412466 70579803 77982895 88475064 100542499
10593 100542499 110957817 115809474 112928945 103965127 93149440 83836956 77377611 74041840
10585 74041840 73624856 76004900 80773147 86427134 90657271 90905077 86034883 77412203
10577 77412203 68068860 60081792 54178439 50306051 48135557 47443126 47793796 48427490
10569 48427490 48380970 46664231 43008222 38055296 32886851 28208784 24316121 21104095
10561 21104095 18596064 16541463 14811695 13412136 12252385 11268539 10299861 9391051
10553I391051q05591p83657o29111o31672n49601m80019m21614l67888l67681
10544D354217l03356k10518k52149k43974j85621j79337j66565j38292j34308
10535B540097j47855j19911j48770j36274r1375l8420j02542j7026n0625j03285
10525A584014q8228q4227o9484j7643l0076m7975J9730O2621p4468r0259p3n7974
10513A105958j2082j0440l2313J0676j2834J1903o6412l6204K5378K6348K9297
10502A039275N3422n3833o2737J7386L748K5677j6680o339j8336k2699j7483q1350
10490H60051l2468M6144K3690n554M077l8166r121N93k9427J4699K4546l2393
10478H26671K3694m646k5882K6986l2804l5563M0387K8441l7503m195j2056K5322
$$ plain form
10553 9391051 8585460 7801803 7172692 6541020 5991419 5511400 5089786 4721898 4354217
10544 4354217 4050861 3840343 3588194 3344220 3158599 2979262 2812697 2674405 2540097
10535 2540097 2392242 2272331 2123561 1987287 1895912 1857492 1754950 1737924 1687299 1584014
10525 1584014 1495786 1411559 1342075 1324432 1294356 1246381 1266111 1328732 1254264 1164005 1163932 1105958
10513 1105958 1093876 1083436 1051123 1061799 1048965 1060868 994456 958252 983630 1009978 1039275
10502 1039275 1092697 1038864 976127 993513 997261 1022938 1006258 999919 981583 958884 941401 860051
10490 860051 827583 873727 897417 891863 895940 857774 848653 849246 819819 834518 859064 826671
10478 826671 850365 845719 819837 846823 814019 778456 818843 847284 809781 805586 793530 818852
10466H18852Q1020J8493K1882k5038k1257J4955R982l3840q659J1425j0525J04555
10454I81845J30961J45287P1251J08185K30278K06909K05377J52346j04463k54289
10444A873687k20447j62489j31543j01275q3979j15918n0697m0215m2875J3484
10434I37733m8456o8857K1177N0380K2023j30318q8294l2742L4989k1615k91l1891
10422F43838P118O6211k6990k8852m0611k8910k5017j8513L1726n2580m9993L9554
10410E16981N4852k3979p2476M2126m947J5507o0871j6543K9558K4022j1010j561
10398D91659O652Q08L0580J6836l7294J3239N1825j1305M726n789R2306J14851
10386G69094J1816l8790k2892p585J2832m3545j22787l1974J7602J9015j0735
$$ plain form
10466 818852 899872 918365 940247 915209 893952 908907 918889 885049 876390 887815 877290 981845
10454 981845 1112806 1258093 1329344 1437529 1667807 1874716 2080093 2232439 2127976 1873687
10444 1873687 1653240 1490751 1359208 1257933 1173954 1058036 1007339 967124 924249 937733
10434 937733 889277 820420 841597 891977 914000 783682 695388 662646 697635 676020 675729 643838
10422 643838 650956 717167 690177 661325 620714 591804 566787 548274 580000 527420 477427 516981
10410 516981 571833 547854 475378 517504 512557 528064 467193 450650 480208 504230 493220 491659
10398 491659 498311 499119 529699 546535 509241 522480 574305 563000 567726 561937 654243 769094
10386 769094 780910 742120 719228 711643 724475 680930 558143 526169 543771 562786 552051
10375E52051k1366n9198K377o5483k2506Q6479k208k8227K3185K8556m6675l2253
10363D14732K2354l6953P95K4342l4821j0377P3694J6455N4968m0163k8919k0702
10351D35405j5797K6180L5640J1254K1537J6966n4857o9042M1214k1930l8174
10340C88396J8766O3003j7800L5827O0180P14m2218K5197o1509n3120K4401K9339
10328D71176k0401L9780M552J4252j1829m9943k5865J0752o6437p917M1875M0572
10316D40567O9506L7599J8129k2300m8426M8831J9798q5117o255L5248l8534l6475
10304D32571l0939k2277l1002M5325m6537N9213R201l9065K0580o825M307L080
10292C97632K3504K5073N6432n1319l2236o7509k1062J5824l3400J9003L2329
$$ plain form
10375 552051 530685 471487 473864 408381 385875 472354 470146 441919 465104 493660 446985 414732
10363 414732 437086 400133 400928 425270 390449 380072 453766 470221 525189 485026 456107 435405
10351 435405 419608 445788 481428 492682 514219 531185 476328 407286 448500 426570 388396
10340 388396 407162 470165 452365 488192 548372 549086 506868 532065 470556 417436 441837 471176
10328 471176 450775 490555 495107 509359 497530 447587 421722 432474 366037 358120 399995 440567
10316 440567 510073 547672 565801 543501 495075 543906 563704 478587 472332 507580 469046 432571
10304 432571 401632 379355 348353 393678 347141 406354 415555 376490 397070 390245 394552 397632
10292 397632 421136 446209 502641 451322 419086 351577 330515 346339 312939 331942 364271
10281C64271O27k9276L7821q840n992M715j9746M6041O4342q1791o6766l0201
10269B75205P8267K3191l4275j2900j8030j267J2384j4853q7343J19016P5585
10258D14980p9537j2659R1992k5232l9641l0429j316j5641L0497q464r308O57
10246C15899K6730J6199L1068J4909J863m021l1951J5857J3945m4733r0908K2549
10234B87406K0987j3228j314R596L8038M762J736K1525L2663m0625M4078M9583
10222D55207n7124k1616m8374K31l0853l6648J990L6584K8696r56O25o615J469
10209C22616k2296J6965K404K0962J9258m0075k9398K9300N021J7303m8088j6563
10197B77409M5391J6932J690j5069L6464O11o0147l962R2123N7568m0993K762
$$ plain form
10281 364271 364898 335622 373443 364603 358611 363326 343580 389621 453963 372172 305406 275205
10269 275205 353472 376663 342388 329488 311458 310191 322575 307722 220379 339395 414980
10258 414980 335443 322784 414776 389544 349903 319474 318158 302517 333014 324550 315242 315899
10246 315899 342629 358828 389896 404805 406668 402647 370696 386553 400498 355765 264857 287406
10234 287406 308393 295165 293851 303447 341485 346247 347983 369508 402171 361546 405624 455207
10222 455207 398083 376467 328093 328324 297471 260823 262813 299397 328093 327137 327762 321147 322616
10209 322616 300320 317285 319689 340651 359909 319834 290436 319736 324757 342060 293972 277409
10197 277409 322800 339732 341422 326353 362817 363428 303281 299319 391442 449010 408017 410779
10185D10779N7656J3857N0961J00315k19p350l0801m9600p0773k5024M0562L5931
10173E26294j149L9337O2373N5636J5667N9612k6363l2514k4455m009l6075j3266
10161F21088j4467O8269J2774N8819J12918M7645j7230n9088o4505Q73L3775k4515
10149G76356m9208l8730K3143Q3919J61274Q602k8608p8727j14908n9848M781
10138F88046q6854r9753L8078J4972L5292L8254j6981m5499R318q6682p9361K1072
10126D29902K1021m7677q3601l0088M4366o9109L4878M1414J5729o3245L644J0132
10114C07366N6561O653j0782j5405j01213n1245N6950O9588j1467q313k4167q2102
10102A92424m9682m665K0881J322L165l414N1778P8502K4693q0950L4025O7399
$$ plain form
10185 410779 468435 482292 533253 633568 633349 625999 595198 545598 474825 449801 490363 526294
10173 526294 525145 564482 626855 682491 698158 757770 731407 698893 674438 670429 634354 621088
10161 621088 606621 674890 687664 746483 859401 907046 889816 830728 766223 767096 800871 776356
10149 776356 727148 688418 711561 795480 956754 965356 936748 858021 743113 683265 688046
10138 688046 601192 501439 539517 554489 589781 628035 611054 565555 574873 488191 408830 429902
10126 429902 450923 403246 319645 289557 333923 264814 299692 341106 356835 293590 297234 307366
10114 307366 363927 370580 359798 344393 243180 191935 248885 318473 307006 298693 274526 192424
10102 192424 142742 138077 158958 160280 163445 160031 211809 290311 315004 234054 268079 335478
10090C35478K4861K0738n1820o7632r151j8919K469j5557N4639l286p1408k0839
10078A79573l2298J6853R426Q7055j2261R919j0103P414n2712L323K1320L2051
10066B59560l9513o205K532K0918M0711o9275o2362M7974L4329L305k8971M974
10054B07977N8709O9575l904q5739m0935l8954L912O0848P4961K9138k7512j4039
10042B94037j1525j2596q585j8704L8247L048j9652M1635P6650j2557m4605k1665
10030C03728j1943o8968J1652J8508K8905K542l3472K7164m9455q15M2052K7995
10018B97893K6219q0627m4372j6681l3680n6171J5914k1651K8995J8591M1170
10007A75600J0832L3728L1664J9152m1137l3101K7091R520K8719L557k7516l862
$$ plain form
10090 335478 360339 381077 329257 261625 252474 233555 236024 220467 275106 271820 200412 179573
10078 179573 147275 164128 173554 260609 248348 258267 248164 255578 202866 206189 227509 259560
10066 259560 220047 213842 216374 237292 278003 208728 146366 194340 228669 231974 203003 207977
10054 207977 266686 336261 332357 246618 205683 166729 170641 231489 306450 335588 308076 294037
10042 294037 282512 269916 261331 242627 280874 283922 264270 305905 382555 369998 325393 303728
10030 303728 291785 222817 234469 252977 281882 284424 250952 278116 228661 227846 269898 297893
10018 297893 324112 243485 199113 182432 148752 92581 108495 86844 115839 134430 175600
10007 175600 186432 220160 251824 270976 229839 196738 223829 233349 262068 265625 238109 234247
9995B34247k3726l7866l6189r217K1853O082J8692M6062K9505L8648k5206l8044
9983B24841R929M0583N2153k2850J9413K1947M611k5310L0279m3960m3493j2922
9971B55221q9240M204O2778k4023k335p797k858k7662n0145K8076M5465O7386
9959B59070p061n3451J5430L2025O973L0192K1469J919p7754r818K227M1327M988
9946B67536o975o440l034q602k3061J8129M511J2204k0497o0094J3773K8030O6035
9933B81515N6666p365L6166m579K2487k7364n7738k0910J856j1943m8575p4293
9921A45923n9144r425j7018M5959N8117j100Q4883L843k0382K079p7041K1727
9909A78421P2218l1038j1453M6489j2309p7307N3043k7391k7959r883O0691N3922
$$ plain form
9995 234247 210521 172655 136466 127249 149102 155184 173876 219938 249443 288091 262885 224841
9983 224841 234770 275353 327506 304656 324069 346016 350627 325317 355596 311636 268143 255221
9971 255221 165981 170185 232963 208940 206605 198808 195950 168288 118143 146219 191684 259070
9959 259070 252009 198558 213988 246013 252986 283178 304647 306566 228812 218994 221221 262548 267536
9946 267536 260561 254121 251087 242485 219424 237553 242064 254268 233771 173677 187450 215480 281515
9933 281515 338181 330816 366982 362403 384890 357526 299788 278878 280734 268791 220216 145923
9921 145923 86779 77354 60336 106295 164412 163312 248195 252038 231656 233735 156694 178421
9909 178421 250639 219601 208148 254637 242328 165021 218064 190673 162714 152831 213522 267444
9897B67444l4922M641J4715m95L2812M69j1078M6697k1012k4893l0823J5069K4743
9884B83367q886k7021l2043l4608n4352M4275L3995k1614R1296L0502o7807m7648
9872A89456l001L8455K9040o8999N213L0778j5952k9358J5159m1874l0429o9515
9860D8973j1280N4413L5806K1707l2334O3926O681n4459O821R2555k2441J7201
9848B27569M7545m6535o9895J4250J7633O693j069n2551L9104l391M2311k7200
9836A94464J7750K4089n361n0903M416M1015J0696K3177j6875k2719j1139k5726
9824A82884q1881l497m0320k2054P2042P1726M3125o3828l6826K2325J3799N7976
9812B15471K6320k9059l310M1250Q5527L1068l2354p9377m100o7790n4433N6225
$$ plain form
9897 267444 232522 237163 251878 251383 284195 284664 273586 320283 299271 274378 243555 258624 283367
9884 283367 274481 247460 215417 180809 126457 170732 204727 183113 274409 304911 237104 189456
9872 189456 186455 224910 253950 184951 190164 220942 204990 175632 190791 148917 118488 48973
9860 48973 37693 92106 127912 149619 117285 181211 187892 133433 140254 232809 210368 227569
9848 227569 275114 228579 158684 172934 190567 197260 196191 143640 182744 179353 221664 194464
9836 194464 212214 236303 230942 180039 184455 225470 236166 259343 242468 219749 208610 182884
9824 182884 101003 97506 57186 35132 107174 178900 222025 158197 121371 143696 157495 215471
9812 215471 241791 212732 209422 250672 336199 367267 334913 255536 251436 183646 129213 185438
9800A85438Q1302O6608q895j00569o5385j2631M6308M1542P255k4542L951j9686
9788B00696m2121k9928j7622M2186N1675K2997l364J8637r613J6764l6151L1730
9776B45886O3969q852k8170K9487m5904k9904Q7985Q663n0162l1679k1791o0241
9764A59287L597J41K2942M6854l0573l1717K300j1195L5568N4766L2649l0021
9752B54598o0397K1187P000n905j5470j2994k7895l9350J9209L0562M7529J0179
9740B28253n050j3123Q121p169r406M7659K5123P650k827k2979J0533n4995K796
9727B14586K3047K8478n924p0391K4294m7646J6047M2951m0304n9469M4867l4711
9715A35825L1314o2387r3537J3397N3289K8269O1717J8934J4475j4194p0907k9644
$$ plain form
9800 185438 266740 333348 324453 223884 158499 145868 192176 233718 240973 216431 220382 200696
9788 200696 158575 128647 111025 153211 204886 227883 224519 243156 233543 250307 214156 245886
9776 245886 309855 301003 272833 302320 256416 226512 314497 323160 272998 241319 219528 159287
9764 159287 162884 163025 185967 232821 202248 170531 172831 161636 197204 251970 284619 254598
9752 254598 194201 215388 222388 216483 201013 188019 160124 120774 139983 170545 218074 228253
9740 228253 223203 210080 218201 211032 201626 249285 274408 282058 279231 256252 266785 211790 214586
9727 214586 237633 266111 260187 189796 214090 166444 182491 225442 185138 125669 170536 135825
9715 135825 167139 104752 11215 24612 77901 106170 167887 186821 201296 187102 116195 86551
9703H6551k6608p568j5300J2790M6306K7923L3130M2816J8092l5662m6601j2043
9691A23826L4701j16341j4146O0381K0828L909n6070K2279N5010j5219m2590j9549
9679E7019L1558M9444j6160l7714M8446M8020K511J0032j0206o0862j6925M1143
9667A46306m3643j5267m5387j8050R1012Q8524Q0368K9295J4517O891O2916J3172
9655D10654n0826o512r577j01353j0014K3491j0119m1770j2643M9976n532r0856
9643A44919l3665J6947J6490L3560M3320J2463j15103p202L7476l2079J4113K028
9631A33267M0360k89J8640j7905n8197m8618M518K4602m2464l975L0769O3345
9619A44053K5762O2885j2817p5068K603k699J8488q613p0969l8236o6441M4804
$$ plain form
9703 86551 59943 52375 37075 49865 96171 124094 157224 200040 218132 182470 135869 123826
9691 123826 158527 42186 28040 88421 109249 113158 57088 79367 134377 119158 76568 57019
9679 57019 88577 138021 121861 84147 132593 180613 183124 193156 182950 122088 105163 146306
9667 146306 102663 87396 42009 23959 114971 203495 283863 313158 327675 334566 397482 410654
9655 410654 359828 353316 343739 242386 232372 255863 245744 203974 191331 241307 235775 144919
9643 144919 111254 128201 144691 178251 221571 234034 118931 111729 149205 117126 131239 133267
9631 133267 173627 173338 191978 174073 115876 67258 71776 96378 53914 49939 80708 144053
9619 144053 169815 232700 219883 144815 147418 144719 163207 154594 83625 45389 -21052 23752
9607B3752Q8970Q4043L8205k3505p2789j37528J3162R290O0981J0571K4522M196
9595A23870J7046N356j4303k696o7585N1052K4581k3328L5450j094K6732n7273
9583A17808j13760m0489N9940Q8156q984j4243J7562n5517K4298N6500j1584p601
9571A12086l2313J0244k6752m2458R473L4949k1257k3043L4145M1116O9771P2018
9559B37979M48m5502j6184L113k785r7826o9058J4649K4632j0972L4949N4428
9547A27871l644N4086K2631L092k216l3335l7957j6529M2127l503J2895j1940
9535A53578m8550j03403Q7063L3251K0988r8281O245K0215P1708K0390J3498R065
9523A85767m3015l308J018m5729m6149m3647M7385N6992J1214n2428k3246r8562
$$ plain form
9607 23752 112722 196765 234970 211465 138676 1148 14310 23600 84581 95152 119674 123870
9595 123870 140916 146272 131969 129273 61688 112740 137321 113993 149443 148349 175081 117808
9583 117808 4048 -36441 23499 111655 102671 88428 105990 50473 74771 131271 119687 112086
9571 112086 79773 90017 63265 20807 30280 65229 43972 20929 55074 96190 165961 237979
9559 237979 238427 192925 176741 179854 177069 79243 10185 24834 49466 38494 73443 127871
9547 127871 124227 178313 200944 204036 201820 168485 130528 113999 156126 152623 165518 153578
9535 153578 105028 1625 88688 121939 142927 44646 50891 71106 142814 163204 176702 185767
9523 185767 142752 139444 140462 94733 48584 4937 52322 109314 120528 68100 44854 -53708
9511e3708j9943R1256M8428K346J4804J5702O1342m0427k598L6404J5112J17549
9499B86267K0795j35987r7719j8110P82m0550L225K0962K514o233M8918J24664
9487B09528M850p8374k9252M9311n664O637l2996j30636L9684Q6186p0840n7339
9475h905m865j0374N9184N2757N0700j2606k3112l2104k3806j9429K5262L9420
9463I2122K8714J3174J8858K1798J3207n4485L2408j4181q8456l9095J3348L0071
9451F7483K2052k7960l229O6083l7955j9722m7356R365N1851J7257q2123p334
9439H412N1104L2670M0138L5230k1620k5111j850l2602j0821n343j1857N9180
9427A17530k4705p744N8671l4851N9136P8705m4633j04245n4917o7724M2961K3161
$$ plain form
9511 -53708 -73651 17605 66033 68379 83183 98885 160227 119800 117202 153606 168718 286267
9499 286267 307062 171075 73356 55246 56028 15478 18703 39665 42179 35946 84864 209528
9487 209528 214378 136004 106752 156063 150399 157036 124040 -6596 33088 119274 48434 -8905
9475 -8905 -13770 -24144 35040 87797 138497 125891 102779 70675 46869 27440 52702 92122
9463 92122 120836 134010 152868 174666 187873 133388 165796 151615 63159 24064 37412 67483
9451 67483 89535 61575 58346 124429 86474 66752 19396 28761 80612 97869 15746 8412
9439 8412 59516 92186 132324 167554 145934 120823 118973 86371 75550 70207 58350 117530
9427 117530 92825 85081 143752 108901 168037 246742 202109 97864 42947 -24777 18184 41345
9415D1345O0414L4275r4418m6362J2003M6511m8970L9028K8732M6023K4486m153
9403A38914K1773L9560K3380l8469n7593l2115o5903L4159O1510J8190l1221k7727
9391H4458K7527M3051J8605q9343M867O0466q2833n1747N3984m5424J6830J11785
9379A52226M654j01364p6656J8558p367o2023P6740L9232R055N2769O2226m8565
9367A19485j9231J2164k1090N23l189k579l6701k1398K0381J4952P209N9483J06508
9354B36517R639n2498r3709k6708M2762l5418L6287l5999L3351m5094J5648N1339
9342A36117L2662P074k7962p617K539K6021j2929l3333N0929K9318k8123r6082
9330G8614q4078L127J30604k4846r3153J8031J03435N985l6547q194n7426j503
$$ plain form
9415 41345 101759 136034 41616 -4746 7257 53768 4798 43826 72558 118581 143067 138914
9403 138914 160687 200247 223627 185158 127565 95450 29547 63706 125216 143406 112185 84458
9391 84458 111985 155036 173641 84298 89165 149631 66798 15051 69035 23611 40441 152226
9379 152226 156880 55516 -21140 -2582 -9949 -71972 4768 44000 53055 105824 168050 119485
9367 119485 100254 112418 91328 91851 88662 86083 49382 27984 48365 63317 70526 130009 236517
9354 236517 246156 193658 99949 73241 116003 80585 116872 80873 114224 69130 84778 136117
9342 136117 168779 175853 147891 140274 142813 168834 155905 122572 173501 202819 174696 78614
9330 78614 -5464 -2337 128267 103421 10268 28299 131734 137719 101172 92978 35552 34049
9318C4049J2976L7244J8640N755P769k0149k0538m5417J2354M9135K0531j0891
9306A01458k2896o2755L1070Q4567P854K4845j1789n940n5570j6709o8232n3631
9294d7728n0786L1887O6066K5197N4459k3974N7811K471l967k2268K141R6611
9282A87920J6015p4939j2468J0769K7936m0386r6674l596P9080J4194j5148J5591
9270A08294p867r5005r360L4652J02574m2211n5285J0943M9542k9140k3617N6307
9258I9827J582j9346m2113j0359J0579K991J7846K1171Q57m4387k9056M4329K9539
9245H3460k8844k6598l6700J1537r350L2307M9305n2278k338J6417j5111o2354
9233d0547k1841O7315M3917j1733Q498M9388L9173j21715l8744K5802M2110j3343
$$ plain form
9318 34049 47025 84269 102909 108664 116433 96284 75746 30329 42683 91818 112349 101458
9306 101458 78562 15807 46877 131444 139298 164143 152354 146414 90844 74135 5903 -47728
9294 -47728 -98514 -66627 -561 24636 79095 55121 112932 115403 111436 89168 91309 187920
9282 187920 203935 128996 116528 127297 155233 114847 18173 14577 93657 107851 92703 108294
9270 108294 100427 5422 -3938 30714 133288 91077 35792 46735 96277 67137 43520 99827
9258 99827 101409 82063 39950 29591 40170 43161 61007 82178 83035 38648 9592 53921 83460
9245 83460 54616 28018 -8682 2855 -6495 25812 75117 22839 20501 36918 21807 -40547
9233 -40547 -62388 4927 48844 37111 45609 94997 134170 12455 -26289 -487 41623 28280
9221B8280k7484L5535O4706K7850n2360M907n794K8617n7182o3764m98N2372o347
9208B8838K7092j3567J0587K4240M832j1575q23k2370j606J7020l7433m1273j9387
9195c5425N1606P6610j4108o83O8123j6499l7880m1243K5260l6273r884J1190
9183D0794J0318N046l0851Q7431M8389k8074p2503J3465n4377p579j2784L0388
9171B9663K3996j1379l9198L7754L2321n7107m0835o843k3481J7194N8123J0631
9159C0839l5725M5320M2991P776m975j0088L4439J9674k9211l5279j00135L0182
9147d192Q1953K271l2668L2460k3604k4346J6583n1378j1830M4283r499M5150
9135F5183K021l6405m540j251M6150M1896M409k0806j5483n6937m7959J1248P5571
$$ plain form
9221 28280 796 36331 101037 128887 76527 81434 75640 104257 47075 -16689 -17187 35185 28838
9208 28838 55930 42363 52950 77190 82022 70447 69624 47254 45648 62668 25235 -16038 -35425
9195 -35425 16181 92791 78683 78000 146123 129624 91744 50501 75761 39488 29604 40794
9183 40794 51112 56158 25307 112738 161127 133053 60550 74015 19638 12059 -725 29663
9171 29663 53659 42280 3082 40836 73157 16050 -24785 -31628 -55109 -37915 20208 30839
9159 30839 -4886 40434 83425 91201 86226 76138 110577 130251 101040 65761 -34374 -4192
9147 -4192 77761 80032 47364 79824 56220 31874 48457 -2921 -14751 29532 20033 65183
9135 65183 67204 30799 26259 25008 71158 113054 117463 96657 81174 24237 -23722 -12474 63097
9122F3097r226j0287n410K7524M0303K7641J5846l3351L054O538p44J4632R311
9109A48928q9658n4145O280Q320M8784L7141k4459K2986j7063K9250L132n684
9097A13812J6058o548l9887l6456J4619j0555k3904L7233J17829L4386m3764l2125
9085A40698J4621J120m4406n25k2437k1528L6455O7649K3920j9814n4667m8994
9073G2092K8688m0846j9999Q265m673K1420K5578k4246q8716N0476P7352L4256
9061A39647j0807m811Q278J0413q061k594l7498j4278N2621n9365j1544Q2220
9049A44221k0065p0877N846R369j0183K0060k4268j8996K5129L9549k4049o1370
9037A4366l6552K970M3017O8222K5404k9133o2067p933R8745K055n2791m897o0675
$$ plain form
9122 63097 53871 43584 38174 65698 106001 133642 149488 116137 119191 125729 124985 139617 148928
9109 148928 59270 5125 11405 19725 68509 105650 81191 104177 87114 116364 119496 113812
9097 113812 129870 123322 83435 46979 61598 51043 27139 64372 182201 216587 172823 140698
9085 140698 155319 156439 112033 111508 89071 67543 103998 171647 195567 175753 121086 72092
9073 72092 100780 59934 39935 48200 43527 64947 90525 66279 -22437 28039 105391 139647
9061 139647 128840 124029 132307 142720 134659 132065 94567 80289 132910 73545 62001 144221
9049 144221 124156 53279 59125 68494 58311 78371 54103 35107 60236 99785 75736 14366
9037 14366 -22186 -19216 23801 92023 117427 88294 26227 18294 117039 119094 66303 61406 731
9024G31j7699K4508N355M4794M3273j1043o0588J1778L2145k9338j155Q4708Q3363
9011B10832l2542j6558L826m9307j8176q0795m4037K4119o391K0869M1472K4022
8999G7334L1256l7977l1019N3122N1510j4853J6038j4999K1431k9123L0862k5630
8987A27952l0473k890J5045k7862l7871n3752J8473R5997O8392l1999k0199k7620
8975I3193j4686J0593L9304J3363k2365m2801J1076L5547k320n968k3189L2493
8963A24240o8079j00224L2098R5577j4556l5892n0209P947j4936l6507N7655K7660
8951B4774l9054P591M5217L3226n6824m1271l5948K4116N6465L2099J2767n7042
8939F116k418k513J3949L4534k1524K2453M7760Q644J8174l2224l2820m5174p8063
$$ plain form
9024 731 -16968 7540 12895 57689 100962 89919 29331 41109 73254 43916 42761 127469 210832
9011 210832 178290 161732 165558 116251 98075 17280 -26757 -2638 -9029 11840 53312 77334
8999 77334 108590 70613 39594 92716 144226 129373 145411 130412 151843 122720 153582 127952
8987 127952 97479 94589 109634 81772 43901 -9851 8622 104619 173011 141012 120813 93193
8975 93193 78507 89100 128404 141767 119402 76601 87677 123224 120904 114936 91747 124240
8963 124240 56161 -44063 -11965 83612 69056 33164 -17045 -9098 -24034 -60541 -2886 24774
8951 24774 -14280 -6689 38528 71754 14930 -26341 -62289 -38173 18292 50391 63158 6116
8939 6116 3698 1185 15134 49668 28144 50597 98357 107001 125175 92951 60131 14957 -63106
8926f3106L982O8813N7378N021L4827K9994n7165j02971Q8935P8268r176k1962
8914A12838p4150k1920J9644J7066j0455n520K9123k1284J633K7022J3389J7115
8902A04501O684K023l8716K8889j7464K8958N030o1541p4951q732O5708M5985
8890H6374n0403j6724M7393k6983j5966P6132L5970j4836o3937n2470l5280j182
8878c1912K7033M4343M022k4623l6622j5845J0730L2557k858K0615M2345K5870
8866I5655k962j5220r951j4053l202J7455O381k1440m238j1894l746M3536l3637
8853D2684m4041M1408k0872M8684N5435R748o569o5948m1656K6838L786P7521
8841A27018K3562p072n5869L7401O469k2320o0894o9733L3152L9290P4735k2775
$$ plain form
8926 -63106 -59124 9689 67067 72088 106915 136909 79744 -23227 65708 143976 134800 112838
8914 112838 38688 16768 36412 53478 43023 37503 66626 45342 46975 73997 87386 104501
8902 104501 111185 113208 74492 103381 85917 114875 119905 58364 -16587 -25319 40389 86374
8890 86374 35971 19247 66640 39657 23691 99823 135793 120957 57020 4550 -30730 -31912
8878 -31912 -4879 39464 43486 18863 -17759 -33604 -22874 9683 6825 27440 69785 95655
8866 95655 92693 77473 67522 53469 50267 67722 74103 52663 48425 36531 32785 76321 42684
8853 42684 -1357 40051 19179 67863 123298 133046 126477 60529 18873 45711 49497 127018
8841 127018 150580 143508 87639 125040 131509 109189 48295 -21438 11714 51004 125739 102964
8829A02964r1091p350k8529L0118r7758l1604K0112L3018L7815q701o445l8836
8817h6287j1061O9355M3869k8845M0380J8122n6147R024P3173O57j0706M4073
8805A05607P2634l0680o2526p5323p727N1715n2p7942J633K0285L9083j1731m9384
8792b4408l6653N8394P9340p660J4459j740o8944j5703K5836M8407p4048l1991
8780c4711K2675N6210j5096j6693L1592J4904n763r1927j8674O2729L5316j0356
8768C0206m328O0023K8666O993k2922k7216l5331k0032K7473o4874q778K068N7506
8755B9454N1605k7738n8480K344k9884M2920J17078j520j03143r056j1227K0466
8743B2819J0155J9958o4104l4848j347j8575O1791J8554k7958k2035k3641k804
$$ plain form
8829 102964 11873 4523 -24006 6112 -91646 -123250 -103138 -70120 -32305 -41006 -47451 -86287
8817 -86287 -97348 -27993 15876 -12969 27411 45533 -10614 -1590 71583 72240 61534 105607
8805 105607 178241 147561 85035 9712 1985 53700 53648 -24294 -22661 -2376 36707 24976 -24408
8792 -24408 -61061 -2667 76673 69013 83472 81732 12788 -2915 22921 71328 -2720 -34711
8780 -34711 -12036 44174 29078 12385 43977 58881 53118 -38809 -57483 5246 40562 30206
8768 30206 25878 85901 114567 121560 98638 71422 36091 16059 43532 -21342 -30120 -28052 29454
8755 29454 81059 53321 -5159 -2815 -32699 10221 127299 125779 22636 13580 2353 22819
8743 22819 32974 52932 -11172 -46020 -47367 -65942 -4151 14403 -13555 -35590 -59231 -62035
8731f2035L3458L0648R644N2527k0863M7328k348j03496m8093K8444J9489K5373
8719A0076N1981L9808n7910l8130K1272J4682m2551o0201J8461n2870L331O7166
8707b4885M0634L5762j1654O1793k5915p985j1947o3321o9933k2302N7553P525
8695c4675l3343k4547j4057L9193M8782N576M5793M9208L3614N2328n08p7898
8683H9466j6814l2332K7040l7879j1158L2045N7146L9022j8459k6110l4247M0455
8671A08175J1328j4815k7306P6038n2272m8565M1023k6841j5493j097K1759l8477
8659C3457l6395P4987J02662j5227j9716K495m1957l1367M2804k5560p9759M6419
8647E2843K829k6301K5442M0054k4858K88o8945j2254J9450j4034l6442j4808
$$ plain form
8731 -62035 -28577 2071 11715 64242 43379 90707 88359 -15137 -63230 -34786 -15297 10076
8719 10076 62057 101865 43955 5825 27097 41779 -772 -60973 -42512 -95382 -92051 -24885
8707 -24885 15749 51511 39857 101650 75735 67750 55803 -7518 -77451 -99753 -42200 -34675
8695 -34675 -68018 -92565 -106622 -67429 -18647 -13071 32722 81930 115544 167872 167364 89466
8683 89466 72652 40320 67360 29481 18323 50368 107514 146536 128077 101967 67720 108175
8671 108175 119503 104688 77382 153420 101148 52583 93606 66765 51272 50175 71934 33457
8659 33457 -2938 72049 174711 159484 139768 142263 100306 68939 111743 86183 6424 52843
8647 52843 55672 29371 54813 94867 70009 70297 1352 -10902 8548 -5486 -41928 -56736
8635e6736r991J8919K3213l604J5060m0615K0279P394Q481m270n0970N8260N0507
8622C5927m6633p097L0170L3720J8192J9579M65n2783m5498J6746K816P7510j1230
8609G1884l6318m0995j3590J7108l0573r346m0320P3382j6043J9952K4867J2332
8597C2340M5597N3049J4450N350q0017j1302J1020K8092P4599m9544j9899N114
8585A08849o1007j0463p108L5300L913K6045O0985L7623N2854j2160m6892j02125
8573H5814J973N6807L1558l9997J4015K7118m2183p018K429q4665o5703j8279
8561c8131J8382M1926M942r418N274Q275k1658R311j2234K5756M7988O383r571
8548G7225M595L0929K7226K1360L8839l2940p8401j6283j372m5108q9356m7584
$$ plain form
8635 -56736 -66727 -47808 -24595 -28199 -13139 -53754 -33475 -26081 -17600 -21870 -72840 -14580 35927
8622 35927 -10706 -17803 12367 46087 64279 83858 84323 31540 -13958 2788 5604 83114 71884
8609 71884 35566 -5429 -19019 -1911 -32484 -41830 -82150 -8768 -24811 -4859 20008 32340
8597 32340 77937 130986 145436 150786 70769 59467 70487 98579 173178 123634 103735 108849
8585 108849 47842 37379 30271 65571 69484 95529 156514 194137 246991 234831 187939 85814
8573 85814 87787 144594 176152 136155 150170 177288 135105 128087 130516 45851 -19852 -38131
8561 -38131 -19749 22177 27119 17701 22975 31250 9592 18903 6669 32425 80413 86796 77225
8548 77225 81820 112749 139975 161335 200174 167234 88833 72550 71178 26070 -63286 -110870
8536a10870l7870p885L1172R1929K7497j6713M9505M1020n3866m4001Q2147j2921
8524C9144q5642R121J151o400J21910M7387j2625j0989K8277j6404j9049M3499
8512A39380l0299l1227k6025k2093l3491L109K8597n632j6464l7239K414J7934
8500a1036J6973J5388j3764j238J3977j3001p310J3656P6936n2858j7570M2354
8488F2507M3692j8971l4944k0532j4662k2790L3724k0436M7004j3057k3537k2068
8476d070L3805O8703j0674p0860n2258J4772J11193Q911n4553n3214o863L8272
8464B3164j6234O453O0578k3052r602l7364o4048j4615L0802M337K2120J3318
8452d143M8537M0787Q8390K5259R892l4209m2221K2373j2196n4325p8564R595
$$ plain form
8536 -110870 -148740 -156625 -125453 -33524 -6027 -22740 26765 67785 13919 -30082 52065 39144
8524 39144 -46498 -37377 -36226 -42626 79284 126671 114046 103057 131334 114930 95881 139380
8512 139380 109081 77854 51829 29736 -3755 -646 27951 22319 5855 -31384 -28970 -11036
8500 -11036 5937 21325 7561 6323 20300 7299 -11 13645 90581 37723 20153 62507
8488 62507 106199 87228 52284 31752 17090 -5700 28024 7588 54592 41535 17998 -4070
8476 -4070 29735 98438 87764 16904 -35354 -20582 90611 99522 44969 -8245 -15108 23164
8464 23164 6930 13383 73961 50909 41307 3943 -60105 -74720 -43918 -39581 -17461 -4143
8452 -4143 44394 85181 173571 198830 208722 174513 132292 154665 142469 88144 9580 19175
8440A9175O2179m5285P511N1658j3896o2873o119j4939M1243j8827j15183p5630
8428a70986K3727O6007M2963L1281P537j7464n0527p487K7407j9550O7805m61
8416B52J4661L9965k4023o2863m1408Q461N4735N8306J7293q2321r273N6998L7694
8403F8477J8220j7519p783k7416k6960k402n2669k9062o109O9885J7875N718l388
8390F867P155O2201O279m4663j22511j0876K8246M2419j2491l2754K7891N5164
8378A2927J0898M0685J5106l3342k0936M8070m0653L2812K6206l443o7275O589
8366B7644M1511k6374J131k5227J3371j9088k1654m0111J9636J2770L1558m085
8354A1082J3955p9321o2152O8836O6124K9676k178k5399J3270M3346Q2154Q139
$$ plain form
8440 19175 81354 36069 43580 95238 81342 18469 12350 -2589 38654 19827 -95356 -170986
8428 -170986 -147259 -81252 -38289 -7008 529 -16935 -67462 -74949 -47542 -67092 713 252
8416 252 14913 54878 30855 -32008 -73416 -64955 -10220 48086 65379 -16942 -26215 30783 68477
8403 68477 86697 69178 61395 33979 7019 4617 -48052 -77114 -83223 -13338 4537 10255 6867
8390 6867 14022 76223 82502 37839 -84672 -95548 -67302 -24883 -37374 -70128 -42237 12927
8378 12927 23825 64510 79616 46274 25338 73408 32755 65567 91773 88330 21055 27644
8366 27644 69155 42781 43912 18685 32056 12968 -8686 -48797 -29161 -16391 15167 11082
8354 11082 25037 -54284 -116436 -47600 18524 48200 46022 20623 33893 77239 159393 167532
8342A67532p339J2915K1610l5251K1908k4629j1841J3043J621m3421m2206j08317
8330c4375m3954J0576Q5220R9609j3045p1900k0628M7676j5527m1515L5658N2630
8318I0425j847o1041n5757N3951P383J1349K168L0448M109r042m6090N40Q3060
8305A09656J2857l5389k6878N5644J04857J37314P2632R3727R933q4421j21316
8294C28616q8654r4224m2486l135M8323k1616m0332m9119p1387k999m815L2785
8282i043O129j6658K2208O5033J6224o6836K2070p6814L8865O5542L4247j9392
8270H1575Q681o93j8423o9598n4064K4786K1296J3217m5483l6659J2254j791L9712
8257b5190M0159O2628Q4877L2676l4937n7814j5581J02968M8665l8656p6275m2016
$$ plain form
8342 167532 160193 173108 194718 159467 181375 156746 144905 157948 159569 116148 73942 -34375
8330 -34375 -78329 -67753 17467 117076 104031 32131 11503 59179 43652 2137 37795 90425
8318 90425 88578 27537 -28220 25731 33114 44463 46631 77079 81188 72146 26056 26596 109656
8305 109656 122513 87124 60246 115890 220747 358061 430693 524420 534353 449932 328616
8294 328616 239962 145738 103252 100117 148440 126824 86492 37373 -34014 -37013 -41828 -9043
8282 -9043 -2914 -19572 2636 67669 83893 17057 39127 -37687 1178 66720 100967 81575
8270 81575 90256 89563 71140 1542 -52522 -27736 -6440 6777 -38706 -75365 -63111 -64902 -25190
8257 -25190 14969 77597 162474 195150 160213 102399 86818 189786 238451 199795 123520 81504
8245H1504J3560L419K6580j0394j312j0161j1219n9335l1569J8257n1889Q958
8233b3601k7200N7205J06420j8307n2709k8793K7769N0001l1496n3495N3876J5759
8221G5429k6580J5102L0061O4176l1591j01101m6276m1547N9987N7335J8383O1338
8209A34716r1331L048K9423o1811p6651l1668M8843N2117M5098j3025p233L9834
8197G1360L6718o8956j0099l9260l8594M6868M7587R477k4454j2727o2915r37
8185d5932Q917o3128j2812Q1434J3963N3224O9221Q056k6719m8739M638l7888
8173D235l1458j4071L1435j0816n3169J8419K5398K2974j7683k9728K0990P1817
8161C8343J3033J4354J2849J0584r1558j0738j5174J7517K193j2298J112k1239
$$ plain form
8245 81504 95064 98483 125063 114669 113357 103196 91977 32642 1073 19330 -32559 -23601
8233 -23601 -50801 6404 112824 94517 41808 13015 40784 90785 59289 5794 59670 75429
8221 75429 48849 63951 94012 158188 126597 25496 -20780 -62327 -2340 54995 73378 134716
8209 134716 43385 46433 75856 14045 -62606 -94274 -45431 6686 51784 38759 31526 71360
8197 71360 108078 39122 29023 -10237 -48831 -1963 45624 55101 30647 17920 -44995 -45932
8185 -45932 -37015 -100143 -112955 -31521 -17558 35666 104887 112943 86224 37485 42123 4235
8173 4235 -27223 -41294 -9859 -20675 -73844 -55425 -30027 -7053 -24736 -54464 -33474 38343
8161 38343 51376 65730 78579 89163 -2395 -13133 -28307 -10790 -8597 -20895 -19783 -41022
8149d1022n9102M7337o903M1825M4898j5104o874l7510l2159j5784J03897N3218
8137G6717J7131k3682O0734J8218o5032l3331K1792n8814k3210j2359l8042L5620
8125b4258j822M327K4709K2755L9953o1060M3770p1266M9655O198k3166K7961
8113C7756M7820k6812m9464m2712l3979J301N2071L2230M7088k6512m503n2619
8101a8335j3807n2717l9247M4349M8837O3852J8576L4563k5301n1738p3242o10
8089f4820n310k6581L0091M0595M798P001M0304J3539L0527j3420O1908Q0476
8077A99108k8004q4685m560J8327l0423j4853j457m5353K239j9466p408M5354
8065B8819J9104p135k9188n698j5155j3345j4203Q4498M9994j4998N0051J8877
$$ plain form
8149 -41022 -100124 -52787 -59690 -17865 27033 11929 5055 -32455 -64614 -80398 23499 76717
8137 76717 93848 70166 130900 149118 84086 50755 72547 13733 -9477 -21836 -59878 -24258
8125 -24258 -26080 -21753 2956 25711 65664 4604 48374 -22892 26763 32961 9795 37756
8113 37756 85576 58764 9300 -33412 -67391 -66090 -14019 18211 65299 38787 34284 -18335
8101 -18335 -32142 -84859 -124106 -79757 -30920 32932 51508 86071 60770 9032 -64210 -64820
8089 -64820 -70130 -96711 -66620 -26025 -21227 -14226 26078 39617 70144 56724 118632 199108
8077 199108 171104 86419 81859 100186 69763 54910 53453 8100 10339 -9127 -16535 28819
8065 28819 47923 40788 11600 5902 -9253 -22598 -36801 47697 97691 82693 132744 151621
8053A51621m5622n5561j2457K5888J6802R295j7246l7941j8347l6180L006o298
8041b3040L7580k391k856l0913M5732L2674L9452o114n9281j132M1468o237m6688
8028A8254r48j4002j7076N9759N2358r2527J1583n5960l3050L017k4382M1340
8016e1634J5808p6398J6519O3349R8734J5060j0147k6229k7637P6M586J6694n7801
8003a9020J3260K2611o971Q751M247j1519p744J39M305l4905m4739M3621M0126
7990A2162K5628J0694k1998N2729J8636j08181k4626l5313Q042N6524Q3913l3817
7978D4393J36K685p318l0951N348j853K509r787k5345P664L9238O483O135j57
7964C9180j0391n7206M3916O9927q3930p2956k1872Q5178O6281J874k186q8439
$$ plain form
8053 151621 105999 50438 37981 63869 80671 89966 72720 34779 16432 -19748 -16742 -23040
8041 -23040 14540 12149 9293 -21620 24112 56786 96238 90124 30843 29711 71179 64942 18254
8028 18254 17306 3304 -13772 45987 98345 5818 17401 -38559 -71609 -68592 -92974 -51634
8016 -51634 -35826 -112224 -95705 -32356 66378 81438 71291 45062 17425 17501 22087 38781 -19020
8003 -19020 -5760 16851 9880 18631 22878 11359 3615 3754 8059 -26846 -71585 -27964 12162
7990 12162 37790 48484 26486 79215 97851 -10330 -34956 -70269 -62227 -5703 78210 44393
7978 44393 44529 47214 39896 8945 14293 12440 14949 5162 -20183 -12519 26719 33202 39337 39180
7964 39180 28789 -28417 15499 85426 1496 -71460 -93332 -8154 58127 60001 57815 -30624
7952c0624l5480L6472r39J8312p486l0176p600K9717L1784n789K2599Q46m1661
7939b0025R032k4157j5282N6202J5497k4449j7654K9948k2462n5203M7351L756
7927a7446L0100o0662l4145O3890j0353k7123J459K3781K2339L595J1736N0312
7915E7483J1241j6568L916m7654K3810M3880k6748m1731l9295J2108j1741l3172
7903f4471J05038Q2469M0964l1629q0571j7359N8360k4040k6622L041k9693O356
7891B1843j047J8928j1667l6326j4146K5057K1602m6631m406M2529o3144j5501
7879f2909j8808j8878N1359j3516k7377N0839M2250m2541N3599J8055L279l3273
7867B079q0974J5784M1650j5388K570M1476J5132J2306l0092j7636K3770r920
$$ plain form
7952 -30624 -66104 -29632 -30571 -12259 -19745 -49921 -57521 -27804 3980 -1809 20790 21636 -20025
7939 -20025 -10993 -35150 -50432 5770 21267 -3182 -20836 9112 -13350 -68553 -21202 -17446
7927 -17446 12654 -48008 -82153 -18263 -28616 -55739 -54280 -30499 -8160 -4565 7171 57483
7915 57483 68724 52156 56072 8418 32228 76108 49360 7629 -31666 -19558 -31299 -64471
7903 -64471 40567 123036 164000 132371 51800 34441 92801 68761 42139 45180 15487 21843
7891 21843 20796 39724 28057 -8269 -22415 2642 24244 -22387 -26793 15736 -47408 -62909
7879 -62909 -81717 -100595 -49236 -62752 -90129 -39290 2960 -39581 14018 32073 35352 2079
7867 2079 -78895 -63111 -21461 -36849 -34279 7197 22329 34635 4543 -13093 10677 757
7855G57M2028j8353n0609o161n375j00393M0795Q6942l1357J7633K8268l7104
7843c2929l1511n927M1513M2847J5936R407K0103q901m237k6254j3145J2557L777
7830B3236J3031r471j2114L3541j1178n179k785J8961m3563M2581J2752K9201
7818H9013N3439n0585J8160p575q3183n9883J0269m5831k1546K0424R3678N0493
7806F6873k694n6246p0978L6623l3339J68J6463N8217M0313n7384k9769L0671
7794a082j2349n6425j4674J0739j4062L623k0297j3796k4828R397J17395O0421
7782D4062K3889K1863l7071n84k5727M5210J3875m601J0021k9782m0406n5300
7770c4551L757L2475K4634L2894j0588l3688L2624M2327q270k8779K8196j5433
$$ plain form
7855 757 42785 24432 -26177 -32338 -37713 -138106 -97311 -10369 -41726 -24093 4175 -32929
7843 -32929 -64440 -70367 -28854 13993 29929 39336 59439 50538 46301 20047 6902 19459 23236
7830 23236 36267 26796 14682 48223 37045 31866 29081 48042 4479 47060 59812 89013
7818 89013 142452 91867 110027 102452 19269 -40614 -30345 -76176 -97722 -77298 16380 66873
7806 66873 64179 7933 -63045 -26422 -59761 -59593 -43130 15087 55400 -1984 -31753 -1082
7794 -1082 -13431 -69856 -84530 -73791 -87853 -84230 -104527 -118323 -143151 -133754 -16359 44062
7782 44062 67951 89814 52743 52159 26432 71642 85517 80916 90937 61155 20749 -34551
7770 -34551 -30794 1681 26315 59209 48621 14933 47557 89884 81614 52835 81031 65598
7758F5598q1345j5903K1156k4331n6967j3944P221K9182q557j332j1317j837J5343
7745g7033j6092K0979N9741P4723R42j7705J787m47n6752m4854K2472J8655L442
7732a0142M2469J5161k6217l6341L8217K0054K3275m6808j7383k0706j5361O2107
7720B8325p070l0906k1839n2662m042K6819Q8876O4733o9846q727K9305M3973
7708H6939p657n6333j7070k1987m671j8723j1058M9264l376o863J3914N976K2151
7695C0506n9616K855l9135j2820J3399l2418N2989j9324k8716j6075j2096k6237
7683a46688M5286j4851n7860M7582M7459M9317P902l4158m8085O607l0023K5843
7671a01669N1184K5895L9945K4326L4943M2423L8082j0004n8149K617k0403l3181
$$ plain form
7758 65598 -15747 -31650 -10494 -34825 -91792 -105736 -98515 -69333 -77890 -79222 -90539 -92376 -77033
7745 -77033 -93125 -72146 -12405 62318 63260 45555 47342 46895 -9857 -54711 -32239 -13584 -10142
7732 -10142 32327 47488 21271 -15070 23147 43201 66476 19668 2285 -18421 -33782 28325
7720 28325 21255 -9651 -31490 -84152 -88194 -61375 27501 92234 22388 13661 42966 86939
7708 86939 79282 22949 5879 -16108 -20779 -39502 -50560 -1296 -4672 -11535 2379 8355 30506
7695 30506 -29110 -26255 -65390 -78210 -64811 -97229 -44240 -63564 -92280 -108355 -120451 -146688
7683 -146688 -101402 -116253 -174113 -126531 -79072 -29755 -21853 -56011 -104096 -97489 -127512 -101669
7671 -101669 -50485 -24590 15355 39681 74624 117047 155129 145125 86976 89593 69190 36009
7659C6009l3849M1633N6261M6660l3912L026j88m1861O09n2211n4488q1930K4759
7646h9482K4441o091K6854j876N1821K9682m7764k1570L9668k3412r606j8539
7634d5874L8152K8223R1493J8118q5052N895l1608n4002r26Q7286J1791j0059
7622E3437J7001j2226J8263J0168O15k367j9163k6109l8556L3K3742l7737l8175
7609e1074l6043j1876K4931K7168M6894J01665l0727m1680o7170n4905k2651K1728
7597i3740L1188M826l0649l7837J9055J8449P1218J7948k4k5067n2143R95O0060
7584a5721J2388J0958M3553l2296m1493N797K7271n108m5657k8025K9549J6570
7572b2214O055J69M1842r588m1067K1016L360J8810l6162j7149Q635l8266N6440
$$ plain form
7659 36009 2160 43793 100054 146714 112802 115828 115640 73779 74388 22177 -32311 -114241 -89482
7646 -89482 -65041 -71132 -44278 -46154 5667 35349 -12415 -33985 5683 -17729 -27335 -45874
7634 -45874 -7722 20501 111994 130112 45060 50955 19347 -34655 -35581 51705 63496 53437
7622 53437 70438 58212 76475 86643 87258 84891 65728 39619 1063 1096 24838 -12899 -51074
7609 -51074 -87117 -98993 -74062 -46894 0 101665 70938 29258 -37912 -92817 -115468 -93740
7597 -93740 -62552 -57726 -88375 -126212 -107157 -88708 -17490 458 434 -24633 -76776 -75781 -15721
7584 -15721 -3333 7625 51178 18882 -22611 -16814 10457 5349 -40308 -68333 -38784 -22214
7572 -22214 -16159 -15990 25852 16264 -24803 -3787 -427 18383 -17779 -34928 -26293 -64559 -8119
7559h119M8294Q2907p607m1158r4675N7821Q1000j7780n7843K7663J6045P8459
7547A65007k5611l6714n7919l7962n0965K3288O3625j8218k4500Q174j6579n9740
7535f8114L8975P0660O8767m1291j5542m7689L0749M2570J540j08257K5008M6670
7523D4046J382k1737n9162M3429P747o48l5092L5609N449m459J885l361j2077
7510C011L0730j7619J4640M2789j6917q531l543K175o427L4336L2093m3598M1306
7497A04445m5083j23836j4635M1322k2013K4971j6511k7601J078N9595l4309j2334
7485f4911k1016L3869n4829l6900J12828P3282k4864j1276K7839q86R71j8020
7473A6087p07K7865p3279L502K2538l8515J8984L9037p6204o9750O2912N3784
$$ plain form
7559 -8119 40175 123082 115475 74317 -20358 37463 118463 100683 42840 70503 86548 165007
7547 165007 139396 102682 44763 6801 -44164 -20876 42749 24531 31 8205 -8374 -68114
7535 -68114 -29139 41521 110288 68997 53455 5766 36515 79085 80625 -27632 -2624 44046
7523 44046 45428 23691 -35471 7958 15705 15057 -20035 15574 21023 16564 18449 15088 3011
7510 3011 33741 16122 30762 73551 56634 48103 44560 46735 40308 74644 106737 63139 104445
7497 104445 59362 -64474 -79109 -37787 -59800 -34829 -51340 -78941 -77863 -18268 -52577 -64911
7485 -64911 -85927 -52058 -106887 -143787 -30959 42323 17459 6183 34022 33136 34107 16087
7473 16087 15380 43245 -30034 -26532 -3994 -42509 -23525 15512 -60692 -130442 -67530 -13746
7461a3746q700L7736M589K9713K34K1634L1676j1674l9971Q177k9470J5479M5714
7448I1391k0876J3949k3106K6201O1425J9683J9113q2926o8497n7047m851n0081
7436g5622M872J10050L3033J8628j4925n9194j2681m6211K9813n7273O9454N0289
7424E0233l5742n3610j1213P0117P5729m7101L8468p463l4067N9970K7968n4022
7412G9267p1394L8314J8067J8811m096L8981j470J3009l781K2724m5143o3774
7400C9515K1369J8834n9070n8038R488P353M1761P1270P5404k3774p8012n7390
7388H710p0293k1949Q255J6058L627j9161r669j9568K593j8165m7909O6444J6276
7375h4751k6632J3887J9616M2251O5109k8570n4173q4K626j445K800n0881M2395
$$ plain form
7461 -13746 -22446 15290 19879 49592 49826 71460 103136 91462 51491 59668 30198 45677 91391
7448 91391 70515 84464 61358 87559 148984 168667 187780 104854 36357 -20690 -25541 -75622
7436 -75622 -70750 39300 72333 90961 76036 16842 4161 -42050 -12237 -69510 -56 50233
7424 50233 14491 -39119 -50332 19785 95514 48413 86881 79418 45351 105321 133289 79267
7412 79267 7873 46187 64254 83065 78969 117950 116480 129489 125708 148432 103289 39515
7400 39515 60884 79718 20648 -37390 -27902 -20549 21212 92482 167886 144112 66100 8710
7388 8710 -61583 -83532 -75277 -59219 -55592 -74753 -84422 -103990 -101397 -119562 -167471 -101027 -84751
7375 -84751 -111383 -97496 -77880 -35629 29480 910 -53263 -53347 -50721 -52166 -49366 -100247 -57852
7362e7852J3672M1842m6945p9696l614n5395k2574l457N273N4891M5013l6537
7350a45379N9228J14792k6056k2749N4676K8407k4355m5461m4397P621Q7385k9085
7338A4627k8973l0425k246J0397M4626O4999J892o8203o2277o094J6068k400L2245
7325a5764k4496L3143L5954M083j04757K1699k1923m5375l0053P2061J0606M6040
7313a8782J0584m5401N2662P6004n0945o3338m1391p8434L2945L5401R35R897
7301g9863O343L4843L5198l7587n842n2660K1735Q1626Q2784n504l9496l6204
7289E373N5244M9280k5478q6410l4367M2446l3701j4148J2368k4875j5237O9887
7277C82r78j20021K8091Q1986L9301l861n9589m8560L1152N468r130P0959L8238
$$ plain form
7362 -57852 -44180 -2338 -49283 -128979 -132593 -187988 -210562 -214019 -208746 -153855 -108842 -145379
7350 -145379 -86151 28641 2585 -20164 34512 62919 38564 -6897 -51294 -43673 43712 14627
7338 14627 -14346 -44771 -47017 -36620 8006 73005 74897 6694 -55583 -61677 -45609 -48009 -15764
7325 -15764 -40260 -7117 28837 32920 -71837 -50138 -72061 -117436 -147489 -75428 -64822 -18782
7313 -18782 -8198 -53599 -937 75067 24122 -39216 -80607 -159041 -126096 -90695 -89760 -79863
7301 -79863 -73520 -38677 -3479 -41066 -46908 -99568 -77833 3793 86577 81073 41577 5373
7289 5373 60617 109897 84419 -1991 -36358 6088 -27613 -41761 -29393 -54268 -69505 382
7277 382 -596 -120617 -92526 -10540 28761 24900 -34689 -83249 -52097 -46629 -55759 15200 53438
7264E3438K1509n9376p8310j0407M4419L5149o815K4714M474p435L6844L9662
7252I7866j4145l8547q8993L9921J6014m1304n2103M0840M9311l7530L0293P7259
7240G8882o868K4198m9582l5438L6607k0704p917k3937l3158j1565j3117r63P3306
7227I744j3539m4684k4817l6461O1053M2464k6169K0513j151o1764K1599N179
7215d8033m4804J4573Q047L6422M0507J7543r0097n3962P785N9729O6564L2853
7203D7127J7603k6763j4463k9119p3730l3767M9937n9593K3689J998n435l118
7191a05634M9552p3712K0243K4407k9621P235P444m400o140M2934J8633O572K8926
7178a3561l3213o9721j0218N6475M8044j4255j4247K076j140L3084k8546K0917
$$ plain form
7264 53438 74947 15571 -62739 -73146 -28727 6422 -393 24321 28795 21360 58204 97866
7252 97866 83721 45174 -43819 -3898 12116 -29188 -81291 -40451 8860 -28670 1623 78882
7240 78882 72014 96212 46630 11192 47799 27095 19178 -4759 -37917 -49482 -62599 -63562 9744
7227 9744 -3795 -48479 -73296 -109757 -48704 -6240 -32409 -11896 -13047 -74811 -53212 -48033
7215 -48033 -92837 -78264 -70217 -33795 6712 24255 -65842 -119804 -112019 -52290 14274 47127
7203 47127 64730 37967 23504 -5615 -79345 -113112 -63175 -122768 -99079 -97081 -102516 -105634
7191 -105634 -56082 -129794 -109551 -85144 -114765 -107530 -100086 -104486 -110626 -67692 -49059 -42487 -13561
7178 -13561 -46774 -116495 -126713 -70238 -22194 -36449 -50696 -48620 -49760 -16676 -45222 -24305
7166b4305K2431K2079L5232k7902k6692L2328M0305j5452l3022j3687j0304M0054
7154D1065O084q320k4078m2369m3085r5717L550L2143O649N0344J6886n0590L1540
7141g5898L0121O2089k231m5196M2313M8574k3070r2509p680r51r712O5640O1361
7128E2851P375q589q7961K6778J0910J4861L654j6275j7301K1816R569k9892m9418
7115f1622j8305M5714j7633L8731j4817p857R273L6588j9469k1041M3699K2174
7103C5435M4108k1985j4193m0109k0156J00078J4430k0003r897m6758m9564J1577
7091a7037j6213k0403K6247k4894k7222j3495M1733j9319N9235M3271M6885l2140
7079D6648n3351q732J0833J1723M3165k267q6729m3172J2421M6556M7330N6059
$$ plain form
7166 -24305 -1874 20205 55437 27535 843 33171 73476 58024 25002 11315 1011 41065
7154 41065 47149 38829 14751 -27618 -70703 -166420 -162870 -130727 -124078 -73734 -56848 -107438 -75898
7141 -75898 -45777 16312 14081 -31115 11198 59772 36702 -55807 -63487 -64438 -74150 -8510 52851
7128 52851 60226 51637 -36324 -9546 1364 16225 19879 3604 -13697 8119 17688 -12204 -61622
7115 -61622 -79927 -34213 -51846 -13115 -27932 -35789 -26516 10072 -9397 -30438 13261 35435
7103 35435 79543 57558 43365 3256 -16900 83178 97608 77605 67708 20950 -28614 -17037
7091 -17037 -33250 -53653 -27406 -52300 -79522 -93017 -51284 -70603 -11368 31903 78788 46648
7079 46648 -6703 -15435 -4602 7121 50286 48019 -38710 -81882 -69461 -22905 24425 80484
7067H0484L7431p52j5991j03960J7130L9719k2343j7700j6199k356J3537j7354
7055h354l6109k7275j8394M7109M8250J6860l6995q5989j6974p914O3291N6686
7043e808k4735k3830N8697J7592P272l5838l1913l4971K7642J8864j4639k8368
7031g0035N3371Q043m2147N0639M5323l5780j04497L7370O810R288K6942J3062
7019a611p347o4853m9923N3931N1432L480l1125L3907L6780j128k6585j4749K5404
7006G613Q1909K2340l7506q9765K569J2949k5183K0705L1869N0780L4381L6606
6994A49267k3579l2247j11564r8907N4992M2145N813k7695n424L0790K2366k0853
6982a4896K0122m3626M7987k1864o7962P647M1293K2808l9195j6905j6798J0591
$$ plain form
7067 80484 117915 117163 101172 -2788 14342 54061 31718 14018 -2181 -4537 9000 -8354
7055 -8354 -44463 -71738 -90132 -43023 5227 22087 -14908 -100897 -117871 -125785 -62494 -5808
7043 -5808 -30543 -54373 4324 21916 29188 -6650 -38563 -73534 -45892 -27028 -41667 -70035
7031 -70035 -16664 -8621 -50768 -129 45194 9414 -95083 -57713 -50903 -41615 -14673 -1611
7019 -1611 -8958 -73811 -123734 -69803 -18371 -14891 -46016 -12109 24671 23543 -3042 -17791 7613
7006 7613 89522 111862 74356 -15409 -12840 109 -25074 -4369 27500 78280 112661 149267
6994 149267 125688 93441 -18123 -117030 -62038 -19893 -14080 -41775 -47199 -16409 5957 -14896
6982 -14896 5226 -38400 9587 -12277 -80239 -72592 -31299 -8491 -47686 -64591 -81389 -70798
6970g0798m872j7339O7637Q3100P946m1308k0433k1336j1252K4137k3036M0176
6958A2622K101L1504N0674k9567o5493n881l2898p9099m578J6339J4659J2413
6946g7204K961o122P6919L4061l1059J4169L7924L4174O4270J232l8660k1823
6934I0842j5565O36n1842n3944L1265J9699j7519n1623k2090M8456K7841n2088
6922d5932J9612N6013N6549r5311r1054k4315Q827K4303J7839l252M6013J5389
6910a5319P684L8290M0190k1435n1643o6184l7079M491M2934J9382l091j2367
6898e4147L6151N3467p2225j9885J10493J3089p6068o4847L0392M7917K3161l7050
6886i552r890q0576K0731J04944L7148J4419k5406n0366m6873o1419N5006L9738
$$ plain form
6970 -70798 -75670 -93009 -25372 57728 65674 24366 3933 -17403 -28655 -4518 -27554 12622
6958 12622 14723 46227 96901 67334 1841 -4040 -36938 -116037 -120615 -104276 -89617 -77204
6946 -77204 -74243 -80365 -3446 30615 -444 13725 51649 85823 150093 151325 112665 90842
6934 90842 75277 75913 24071 -29873 1392 21091 3572 -48051 -70141 -21685 6156 -45932
6922 -45932 -26320 29693 86242 -9069 -100123 -124438 -115611 -91308 -73469 -76721 -30708 -15319
6910 -15319 -7635 30655 70845 49410 -2233 -68417 -105496 -101005 -58071 -38689 -41780 -54147
6898 -54147 -17996 35471 -36754 -56639 53854 66943 -9125 -73972 -43580 4337 27498 -9552
6886 -9552 -19442 -100018 -79287 25657 62805 77224 51818 1452 -45421 -106840 -51834 -12096
6874a2096j4168r530j0539m6456j9098N8144O8395J2014J9184j2823r45l6863
6862d781p5847m4217M8284O8481j3926m5316N6777j7222J3634k727L5926N3455
6850G2521l5395k0951p624j0837r653o5958k9366j3357K2445O647K0072J4267
6838e7189Q716P506O5508k0120o365M7700r5088j3304M1226j9828n746L3923O3498
6825E0437P0350k08l7300J705o7478m4161J8732L9634J4995m6428p4173o0499
6813a34394Q06R7530J3518m805j9303l3450N2825L6393k6716l4137j6063J9372
6801d8424J0541r144k3861r633M0183j850L5132K568l4481l9660p0123j9830K855
6788a65727j3111k4741M9289O5281J1524R9317J9658j6216l5470n1043O257k387
$$ plain form
6874 -12096 -26264 -35794 -46333 -92789 -111887 -53743 14652 26666 45850 33027 32082 -4781
6862 -4781 -80628 -124845 -76561 -8080 -22006 -67322 -10545 -27767 -14133 -16860 19066 72521
6850 72521 37126 16175 8551 -2286 -11939 -77897 -107263 -120620 -98175 -91528 -71456 -57189
6838 -57189 -48473 -40967 24541 4421 -1944 45756 -49332 -62636 -21410 -41238 -46984 -13061 50437
6825 50437 120787 120579 83279 84984 17506 -26655 -7923 31711 46706 278 -73895 -134394
6813 -134394 -133588 -36058 -22540 -27345 -46648 -80098 -27273 9120 -17596 -51733 -67796 -48424
6801 -48424 -37883 -47027 -70888 -80521 -40338 -42188 -7056 -4488 -38969 -78629 -148752 -168582 -165727
6788 -165727 -178838 -203579 -154290 -89009 -77485 21832 41490 25274 -10196 -61239 -54982 -57369
6776e7369L5018K0210N7567K9100j28983j05037L8408k958j4245J3548M3457M1925
6764b9359l1528j5505L6986L6358L2687m0363l5646J1221R81k2119R957K1669
6752b4661j3724P3665Q0761j628n7369J9804L4521m1487j35375k3855O0194k4982
6740e4136k823N8967N1803J0012J6569k813k4944J5795l5323j9822J728p140J668
6727I541j3266L6493o761m1559k9791J6180N2582P257j794l2826j3529J8149L4134
6714C4810m1748R099p236j6136j3988k8066N8120r892n3882K5722l064k2615j2727
6701h1603l6127j6945L2334Q7857K1089K7136K5517k1722j7522m4855l7351J9148
6689d3044M7167N7109P9131j1343l5469j0669J3940j839m8280n9429j4900O4655
$$ plain form
6776 -57369 -22351 -2141 55426 84526 -44457 -149494 -111086 -114044 -128289 -114741 -71284 -29359
6764 -29359 -60887 -76392 -39406 -3048 29639 -10724 -46370 -35149 -34168 -56287 -46330 -24661
6752 -24661 -38385 35280 116041 114413 57044 76848 111369 69882 -65493 -89348 -29154 -54136
6740 -54136 -56959 2008 53811 63823 80392 77579 52635 68430 33107 13285 15013 7873 9541
6727 9541 -3725 32768 26007 -15552 -45343 -29163 23419 30676 28882 -3944 -17473 676 34810
6714 34810 -6938 2161 -5075 -21211 -35199 -63265 -5145 -15037 -68919 -43197 -46261 -68876 -81603
6701 -81603 -117730 -134675 -102341 -14484 6605 33741 59258 37536 20014 -24841 -62192 -43044
6689 -43044 4123 61232 140363 129020 93551 82882 96822 94983 46703 -12726 -27626 37029
6677C7029P1336K9830o1935n4087K7832k4435n193K2636J6042k0554Q434j0144
6665C6791j7101L5005P843K7267K6048K7757m4125j624l0641k18J03072M9884
6653B19958j4342P978J17664J01350N3000J36123K44746L10252L45247R9767j92762
6642A428981l34171j25535p77N8194L8448O2475J42247K66765L71440N33409P37380
6631C178856R26681J414733K147673L399887N693259R535379J3120200J1204811
6623E0621479K352560j1142891j3361242q208253m612394k841553j975265j459315
6615I373126j202737r95121p57142m41881k51452k76962n35109m92885l92128
6606D027709l56430j84493K0629l0059j94752m37246n14732l68750k02051j28780
$$ plain form
6677 37029 108365 138195 76260 22173 50005 25570 20377 43013 59055 38501 46935 36791
6665 36791 19690 54695 62538 89805 115853 143610 99485 97861 67220 67002 170074 219958
6653 219958 205616 213594 331258 432608 485608 621731 866477 1176729 1521976 1621743 1428981
6642 1428981 1094810 969275 968498 1026692 1065140 1127615 1269862 1536627 1908067 2441476 3178856
6631 3178856 4105537 5520270 7667943 11067830 16761089 26296468 39416668 50621479
6623 50621479 52974039 41831148 28469906 20261653 15649259 12807706 10832441 9373126
6615 9373126 8170389 7175268 6418126 5976245 5724793 5447831 4912722 4419837 4027709
6606 4027709 3671279 3486786 3507415 3477356 3282604 2845358 2330626 1961876 1759825 1631045
6596A631045j90992j33291j46043j13522l9878o7699O1473j04499j91734r5805
6586F09055q537m3346q5048p4971J9957l6402K4807J0736l0457l3119m4779K0028
6574C27924K7713q9096o9807k8752K036l8043O274N2748l8176n9511p522P2877
6562A58665J3261R898M61o8728j7232n068R1060K6942l3518J7554n4017n1281
6550H7997j1311J8665l1235m12l7K4220k3189m6781K6649J7375k2071j2506l239
6537B4125P7837L9325n770r9444k3370P477j4743p373k808K3241K925Q638o5913
6524c5853o7574M9298R8631j5324l1095J5958k1091o1589O736M4428Q7361j5131
6512E4755l9237r594N2242Q831J4258l7904o2659p89L9118l917L1318N642K9830
$$ plain form
6596 1631045 1440053 1306762 1160719 1047197 1007319 939620 1001093 896594 704860 609055
6586 609055 600518 557172 472124 397153 417110 380708 405515 416251 385794 352675 307896 327924
6574 327924 355637 266541 196734 167982 170018 131975 138249 190997 152821 93310 85788 158665
6562 158665 171926 181824 182285 113557 96325 91257 182317 209259 175741 193295 139278 87997
6550 87997 76686 95351 64116 63704 63667 87887 64698 17917 44566 61941 39870 27364 24125
6537 24125 101962 141287 135517 36073 12703 20180 5437 -1936 -4744 18497 21422 30060 -35853
6524 -35853 -103427 -54129 44502 29178 -1917 14041 -7050 -68639 -61903 -17475 69886 54755
6512 54755 15518 5924 58166 66997 81255 43351 -19308 -20097 19021 15104 46422 52064 81894
6499H1894M3908K557j7531l4456j5389k2343q3974K4792J6645k9937K9877o214
6487a0171m1387o9142l665K1145L3845j7230Q019J5329M3992k797l8790m9438
6475a10290L9441K8996K0882L3859J6204l2364j6216M5303j5694R618n348J3599
6463B7990j0432p1268O8657Q5866l6376q2342q566m5695m2060J8285N6141J3696
6451b6104k6338m4499Q1528l522l6690K0600K9678k4055L6639L8568k1147k4445
6439B13k4349N724j4759n9388j7292K0817L8003l465k4516J3126M6586l0969p3594
6426a23863k2527L4860M5904k0465l7943k5165j6813K3663O0175J598k3215P0028
6414c3763K6697m5620M332K0302K0408J2897J4781o008J2651N4579q681j3142
$$ plain form
6499 81894 125802 128359 110828 76372 60983 38640 -45334 -20542 -3897 -33834 -3957 -10171
6487 -10171 -51558 -120700 -124365 -103220 -69375 -86605 -78586 -63257 -19265 -22062 -60852 -110290
6475 -110290 -70849 -41853 -20971 12888 29092 -3272 -19488 25815 10121 19739 14391 27990
6463 27990 17558 -53710 14947 100813 64437 -17905 -26471 -72166 -114226 -95941 -39800 -26104
6451 -26104 -52442 -96941 -15413 -18935 -55625 -35025 -5347 -29402 7237 45805 24658 213
6439 213 -24136 -18412 -33171 -92559 -109851 -89034 -51031 -54496 -79012 -65886 -19300 -50269 -123863
6426 -123863 -146390 -111530 -65626 -86091 -124034 -149199 -166012 -142349 -82174 -80576 -103791 -33763
6414 -33763 -7066 -52686 -48354 -28052 -7644 5253 20034 14026 26677 81256 72575 59433
6402E9433J6029j5504m5811m990n8955n1419k243N0591N5529m8720l2716o678
6390h5454N2479J00002P453j7340l2347k445n4328k1265M424N5776J9437j8012
6378H380j3489j1129N350J4253j8478j405L3872Q378R5516N4822l6894p1586m6308
6365B1282k5870r342j7221N4634J2415J6303M6842n6103o5339o64N227o5321k690
6352h5847q242p3351M537R3963q996O4114K1204k2759k0446j3883k3259J4258
6340e8707L5838K6946K831p7594K600M9998O7703L381N7018k0442q4629n7332
6328e2389J0327K8805k2979L469K7951P232J4618J004k4363J743L0928L4493k5972
6315C4867l1477r2758l2732J0109K0079Q9288M8104j2827l8304j0940L3318Q117
$$ plain form
6402 59433 75462 59958 14147 9157 -49798 -101217 -103460 -52869 2660 -46060 -78776 -85454
6390 -85454 -32975 67027 74480 57140 24793 22348 -31980 -53245 -48821 6955 26392 8380
6378 8380 -5109 -16238 -10888 3365 -15113 -16518 17354 25732 121248 176070 139176 67590 21282
6365 21282 -4588 -13930 -31151 23483 35898 52201 99043 42940 -22399 -23063 -17836 -83157 -85847
6352 -85847 -94089 -167440 -162903 -68940 -77936 -13822 7382 -15377 -35823 -49706 -72965 -58707
6340 -58707 -22869 4077 6908 -70686 -68086 -18088 49615 52996 110014 89572 4943 -52389
6328 -52389 -42062 -13257 -36236 -32767 -4816 2416 17034 18038 -6325 -4582 26346 60839 34867
6315 34867 3390 -89368 -122100 -111991 -91912 -2624 45480 32653 -5651 -16591 16727 24844
6303B4844O8268L441q1037j8092k2641n0930j6667J3180j6185L8678J3511j8682
6291f2312O9818j8653l9771P3629k6870l3185K7539q686k7943q108k963Q4007
6279B6502J3495r3172N3411O7114M754q5969p8971M1446N0899k009R210O908o5140
6266e1522r1905n515J4815N6848K8059N8012L4239l3742k5766P188P9897j1006
6254E9602n8047n4730K6830O2668P8836P8192J0744k0696J1106K0269J4295r1982
6242A37087n6200o2310J4356L9797j2454j8980q3040j5152j6209Q978J9094K496
6230d2537l2296J6114k9229K1427N674J2578O0049K2832j5254n3395P1105N2592
6218H9660n7403n7673n020O1471o6764q0042J4428Q0667M3420K8795o5164p0009
$$ plain form
6303 24844 93112 96553 15516 -2576 -25217 -76147 -92814 -79634 -95819 -57141 -43630 -62312
6291 -62312 7506 -11147 -50918 22711 -4159 -37344 -9805 -18491 -46434 -54542 -57505 26502
6279 26502 39997 -53175 236 67350 72104 -13865 -92836 -51390 -491 -2500 6710 13618 -51522
6266 -51522 -143427 -148942 -134127 -77279 -49220 8792 43031 9289 -16477 -9289 70608 59602
6254 59602 1555 -53175 -26345 36323 115159 193351 204095 183399 194505 214774 229069 137087
6242 137087 80887 18577 32933 72730 60276 41296 -41744 -56896 -73105 -64127 -45033 -42537
6230 -42537 -74833 -58719 -87948 -66521 -60847 -48269 11780 34612 19358 -34037 37068 89660
6218 89660 32257 -25416 -30436 31035 -35729 -115771 -101343 -20676 22744 51539 -13625 -83634
6206h3634k4119j9512p953j0332O3738J10028K3887J8258J9685K0101k8576m7168
6194C4403l1315n0705K7765K7312q270j873M4960M1235N226k9914m6839j0741
6182A244L0734Q5739k6352o7603k8293j8748k3155J698K2153m0603l6883N437
6170i4632N1229l9987o1784J1696O379q41K7687O5440N819Q0896j606l0089n5712
6157c5505j434l43J1105P3393K6421l2647n2405j928J9207K7745J7714j4391l3589
6144C343n7519k4379O3893o376m634j4203K5573L672j8186m4050O4733M3999k7432
6131H434p2543l6464L404k7720M0187p264l3677O1533Q8065O4481m7124Q636k2117
6118B7831n495k2349J1934M3622K0339K1806p279q937k0841l9016k6345K9099
$$ plain form
6206 -83634 -107753 -127265 -135218 -145550 -81812 28216 52103 70361 90046 110147 81571 34403
6194 34403 3088 -47617 -19852 7460 -810 -2683 42277 83512 88738 58824 11985 1244
6182 1244 31978 117717 91365 23762 -4531 -23279 -46434 -44736 -22583 -63186 -100069 -94632
6170 -94632 -43403 -83390 -145174 -133478 -127099 -127940 -100253 -34813 -28994 51902 50296 20207 -35505
6157 -35505 -36939 -37282 -26177 47216 73637 40990 -11415 -13343 5864 33609 51323 36932 3343
6144 3343 -54176 -78555 -14662 -21038 -25672 -39875 -14302 -10630 -28816 -72866 -8133 35866 8434
6131 8434 -64109 -100573 -97169 -124889 -84702 -91966 -125643 -64110 23955 88436 41312 49948 27831
6118 27831 22336 -13 11921 55543 75882 97688 90409 81472 60631 21615 -4730 24369
6106B4369J7039j7835l3757p6480p2176N3272P1118m09p8971k5623j8166J07685
6094d9934L8643J4878k6402J5429o505k0398K2091k1193l0612j6738l1989K2181
6082i0549M6200J992J6498l9012K841K1132J9491n5561Q565M7811L8067J8272
6070C5747J7728o0532Q903N7791L1407n0291q0093m1328l5937j4329q13M5732
6058h6015k6667R2642R3564Q041p1121M072K2277o592m2266l6914M119J8715K3937
6045b208L3108o5487l9629K873L1690M0412j67J9099o1188J3541l0446r570N6118
6032a1854L7366k3567J848J7169N561R801k7367o768M9016P244p672l5705o1970
6019d6898p715p79J6883j1429M9153l7285j4485M3445k3479K9962P3566j2513
$$ plain form
6106 24369 41408 23573 -10184 -86664 -158840 -105568 -34450 -34859 -113830 -139453 -157619 -49934
6094 -49934 -11291 3587 -22815 -7386 -13891 -34289 -12198 -33391 -64003 -80741 -112730 -90549
6082 -90549 -44349 -42357 -25859 -64871 -62030 -40898 -21407 -76968 -68403 -20592 17475 35747
6070 35747 53475 -7057 1846 59637 91044 40753 -39340 -80668 -116605 -130934 -131747 -86015
6058 -86015 -112682 -20040 73524 81565 10444 14516 36793 30201 -12065 -48979 -44860 -26145 -2208
6045 -2208 30900 -34587 -74216 -71343 -39653 759 592 19691 -41497 -27956 -58402 -67972 -11854
6032 -11854 25512 1945 3793 20962 26523 36324 8957 2189 51205 58449 50777 15072 -46898
6019 -46898 -54613 -55392 -38509 -49938 -785 -38070 -52555 -9110 -32589 -2627 70939 58426
6007E8426q3098k9866k3238K8111k8242J4296L2964q817K540k1577j684o118K4559
5994d1744j9008K3326Q8618L9151l9543j15457k3880J4522j4954l364N3435O4374
5982B5476K1578o4253n5006O848M1369J0521K636L3355l9199n7247K6122L1569
5970a6231m041N6221L0032l4239q6170m9316J7895J5308M6890K0145l6091L8924
5958f73n286L3332Q4571J5312o6947l23P4566m9608k4279j9259J1271l8335o9023
5945e4681n7881L2121l1553K9316O2445P3143J6984k0794j03454r314L6312L6876
5933I520o914n3414k4957l8842J2268P5239J0832M9144n962k6534o026K2449k2872
5920f069k7080Q150J8723n1521J6887j9607k6881m4125M4407K312p065m3330O9509
$$ plain form
6007 58426 -24672 -54538 -77776 -49665 -77907 -63611 -30647 -39464 -36924 -58501 -60185 -66303 -41744
5994 -41744 -60752 -37426 51192 90343 50800 -64657 -88537 -74015 -88969 -92333 -38898 25476
5982 25476 47054 -17199 -72205 -65357 -23988 -13467 -10831 22524 -16675 -73922 -47800 -16231
5970 -16231 -20272 35949 65981 31742 -54428 -103744 -85849 -70541 -23651 -3506 -39597 -673
5958 -673 -5959 27373 111944 127256 60309 59986 134552 84944 60665 41406 52677 14342 -54681
5945 -54681 -112562 -80441 -111994 -82678 -20233 52910 69894 49100 -54354 -63668 -27356 9520
5933 9520 2606 -50808 -75765 -114607 -102339 -27100 -16268 32876 26914 380 -5646 16803 -6069
5920 -6069 -33149 -24999 -6276 -57797 -40910 -60517 -87398 -131523 -87116 -84804 -91869 -135199 -65690
5907f5690J41592Q7868k2801q3871j5678m2461J247N5559J1892l7923j8632l4757
5895b3655l5003o392M5793O2091K5466J3489o7594p7060N636Q236k7197K574k8880
5882a02496M8000K4929l9979j0931M072k8687K2045L1253N0768J2498j344J1621
5870B1749J0127j3635r3554L1246M1210j9326L4251j0145m318J6488j4837j9697
5858b0441l1119k5999J3373M7258Q468o0857K192j4565J5624P0814r523n4004
5846e8779l4902J1538M2708M4655n8646K237o293L211N3021l1171l7320J3632
5834e6109l457p081m424K5063P3620M0519m4943k2073l0613o7025L7518Q7983
5822B8978O73o9863k1759M733K3222k0337L3347l0226L16N6671j5193J58K9334
$$ plain form
5907 -65690 75902 163770 140969 57098 41420 -1041 206 55765 67657 29734 11102 -23655
5895 -23655 -58658 -65050 -19257 42834 68300 81789 14195 -62865 -57229 -48993 -76190 -73616 -102496
5882 -102496 -54496 -29567 -69546 -80477 -76405 -105092 -83047 -51794 -1026 11472 10128 21749
5870 21749 31876 18241 -75313 -44067 -2857 -22183 12068 1923 -2395 14093 -744 -20441
5858 -20441 -51560 -77559 -64186 -16928 -8460 -69317 -67125 -81690 -66066 4748 -4775 -58779
5846 -58779 -93681 -82143 -39435 5220 -53426 -51189 -57482 -54271 -1250 -32421 -69741 -56109
5834 -56109 -59566 -66647 -71071 -46008 27612 68131 23188 1115 -29498 -96523 -59005 28978
5822 28978 29651 -40212 -61971 -57238 -34016 -54353 -21006 -51232 -50916 5755 -9438 -9280 20054
5809B0054m417K7227o1538m3671k6509j0501k0271L1513P7860k7816m3599p4082
5797a55750Q857N7412j5046l2499j653Q228k3152m40Q1578M4515L9774J141Q032
5784B0997o1729l1023Q459K3188L3533n688n4536m0302M8611l5167l3782M1549
5772h5890M9036M8173k6374p9985j165L254J9153K8567k9874K6159l4791m5676
5760a29413k0348L0341n7028R1767J10902N068j5005J5001m2545m2332K7200j1373
5748c7765p878P3485J02780l0934l4153K449o4329m6934n205L2636l7485o4443
5736a17776L9662j6573p696L5168q816R366J8306L1912J3950Q0559m7921p2398
5724d2257M4599r552l9238k5299j9546J1736l958p894O783K207L0665q488k5527
$$ plain form
5809 20054 15637 42864 -18674 -62345 -88854 -99355 -119626 -88113 -10253 -38069 -81668 -155750
5797 -155750 -146893 -89481 -104527 -137026 -138679 -130451 -153603 -154043 -72465 -27950 11824 12965 20997
5784 20997 -40732 -71755 -63296 -40108 -6575 -12263 -66799 -107101 -58490 -93657 -127439 -85890
5772 -85890 -36854 11319 -15055 -95040 -96205 -92951 -73798 -45231 -75105 -48946 -83737 -129413
5760 -129413 -149761 -119420 -176448 -84681 26221 31289 16284 31285 -11260 -53592 -26392 -37765
5748 -37765 -45643 27842 130622 99688 65535 67984 3655 -43279 -48484 -15848 -53333 -117776
5736 -117776 -78114 -94687 -102383 -67215 -76031 -66665 -48359 -16447 -2497 78062 30141 -42257
5724 -42257 2342 -7210 -46448 -71747 -91293 -79557 -83515 -91409 -84626 -82419 -51754 -60242 -85769
5711h5769K9198P4682N7184k7732j6226r1213p0181Q755R1053O9355q688n1423
5699b1005j5288O6453L827M512k9150n7496k1885N5123N877m400K33k1842l7441
5686g2482J6347k0088k1036j4308N2356O8473P907P770q144l3406K493N8686m3133
5673A435n2104J2978l9142l7411O6774J0238o760J1667l0122q339K1372N51j2870
5660f1733J0581k3067m50j7754K0761l0566J1788K6216N4414L3594Q800N8569
5648I1153K2039o5081j0791m1012q8368j6281K4737J0177N7756J2520j2841r925
5636b5917M2945m0711r337k3435J1018M7078M2171O330j3512l4925j627K9669
5624B9747L0578j0890l8630l3661J2025q9001M730O7194K621N6480N454J9197
$$ plain form
5711 -85769 -56571 18111 75295 47563 31337 -59876 -130057 -121302 -30249 39106 30418 -21005
5699 -21005 -36293 30160 33987 38499 9349 -48147 -70032 -14909 -9032 -13432 -13199 -35041 -72482
5686 -72482 -56135 -76223 -97259 -111567 -59211 9262 17169 24939 16795 -16611 -14118 44568 1435
5673 1435 -50669 -37691 -76833 -114244 -47470 -37232 -43992 -32325 -62447 -70786 -49414 -48863 -61733
5660 -61733 -51152 -74219 -74669 -92423 -71662 -102228 -90440 -64224 -9810 23784 32584 91153
5648 91153 113192 48111 37320 -3692 -92060 -108341 -83604 -73427 -15671 -3151 -15992 -25917
5636 -25917 17028 -23683 -33020 -56455 -45437 1641 43812 50142 36630 1705 78 29747
5624 29747 60325 49435 10805 -22856 -10831 -99832 -95102 -27908 -25287 31193 36647 55844
5612E5844K2370J7077n6269p6755j7K2278K2651N3803Q22n5423r1853K23j1115
5599i6364K2931N5265O3247l5349j3126N9166p897l7303k4357k8442m3303J3050
5587g2482N9721K6706L6415k0294o3021M518N75J1420j1855r6762J7286J28143
5575B0370o5496m7947N0418O4993k9444k0058J01331M7773j185j8098n9040J2368
5563E5985m0426m2765l6228m6706K5918O6913L40k1638l0840O3624K7254M5344
5551F6775l5614n0388q315l2161n1634Q548P8392L7454n0876k5160o1263o38L2361
5538i2519J1746l0147N9413j2060o404J6518l0526M8072J2396M6322m4720j6747
5526c8656M6268j01924l4748q815J3420K8168J0486J6013j7106l8367M9329P0506
$$ plain form
5612 55844 78214 95291 39022 -37733 -37750 -15472 7179 60982 61804 6381 -85472 -85249 -96364
5599 -96364 -73433 -18168 45079 9730 -3396 55770 47873 10570 -13787 -42229 -85532 -72482
5587 -72482 -12761 13945 50360 30066 -32955 -28437 -27862 -16442 -28297 -125059 -107773 20370
5575 20370 -45126 -93073 -42655 22338 -7106 -27164 74167 121940 120755 102657 43617 55985
5563 55985 15559 -27206 -63434 -110140 -84222 -17309 -16969 -38607 -69447 -5823 21431 66775
5551 66775 31161 -19227 -27542 -59703 -111337 -102789 -24397 13057 -37819 -62979 -124242 -124880 -92519
5538 -92519 -80773 -110920 -51507 -63567 -69971 -53453 -83979 -35907 -23511 22811 -21909 -38656
5526 -38656 7612 -94312 -129060 -137875 -124455 -96287 -85801 -69788 -86894 -125261 -75932 -5426
5514e426n8879J8226N3434K6895N2779l6204n8789l3458M5718J9196O830N3737
5502H4059M0213j3535k6479J2722m2833l418r471l6000j8427k1570j1829J7325
5490b9243k0866n3777k542Q0290J771p8943k8274L6256K4136j2226M665N7301
5478b1452M2381l874k0114k0955o1423m3674K6463M5114J561L3220R085J6737
5466C069J734j3778J6200m2529K038n950L4132j7255o0389n9863j1380o430M4130
5453a16271M0479J2705Q9145L5858j4795n966L4744n1558k5211k1200l0529k2860
5441g5459P706N3585N3162m1868j4039j7343m3873J6898L8997L5808J4622r2656
5429f4460q626N9804L8859j1272L0442m8389q6706l5533p8867l110M5952J8123
$$ plain form
5514 -5426 -64305 -46079 7355 34250 87029 50825 -7964 -41422 4296 23492 30322 84059
5502 84059 124272 110737 84258 96980 54147 50729 41258 5258 -13169 -34739 -46568 -29243
5490 -29243 -50109 -103886 -106428 -26138 -24367 -103310 -131584 -95328 -71192 -83418 -78753 -21452
5478 -21452 20929 17055 -3059 -24014 -85437 -129111 -102648 -57534 -55973 -22753 -13668 3069
5466 3069 4803 -8975 7225 -35304 -33266 -39216 -5084 -22339 -82728 -142591 -153971 -160401 -116271
5453 -116271 -75792 -63087 26058 61916 47121 41155 75899 24341 -870 -22070 -52599 -75459
5441 -75459 -67753 -14168 38994 -2874 -16913 -34256 -78129 -61231 -22234 13574 28196 -64460
5429 -64460 -73086 -13282 25577 14305 44747 -3642 -90348 -125881 -204748 -207858 -161906 -143783
5417a43783q35L5607r952k907O2414K739K106K7003K3592j4132m0049J3529O3542
5404A8874k1637k3653K9357M1943K4372O5885l7010o4342l0084K9868k4104J082
5392A0551o9676m9329L1103R0928O0169k3520m0076J7789Q300K5513l3413m3951
5380a5612n0782P1046O9888M8457m3472j3413k2150K0457k294l1112L5804J063
5368F7880K3240L7614p051k3288m1207p1365o5381p052R577J5338J385J1999J7001
5355c1310Q7222R007l3664L0551p66p1483n7022J6258M7293r419l0354R726K6097
5342g864L6634j0763k3043l0132K7110M5384j9898m4246P85k03Q8716R905n1802
5329B0583n9440N430q2576n3004J5002P7652J18902J7492k923r1196K3711n134
$$ plain form
5417 -143783 -144618 -109011 -118963 -121870 -59456 -56717 -54611 -27608 -4016 -18148 -58197 -44668 18874
5404 18874 -2763 -26416 2941 44884 69256 135141 98131 33789 3705 33573 9469 10551
5392 10551 -59125 -108454 -77351 13577 73746 50226 10150 27939 36239 61752 28339 -15612
5380 -15612 -66394 4652 74540 122997 79525 66112 43962 64419 62125 31013 66817 67880
5368 67880 91120 128734 121683 98395 57188 -14177 -79558 -86610 -77033 -61695 -60310 -48311 -31310
5355 -31310 55912 64919 31255 61806 61040 -10443 -67465 -51207 -3914 -13333 -43687 -33961 -7864
5342 -7864 28770 18007 -5036 -35168 -8058 37326 17428 -26818 -26033 -26236 62480 72385 20583
5329 20583 -38857 -33427 -116003 -169007 -154005 -76353 42549 60041 57118 -34078 -10367 -15501
5317a5501L1444N8832Q6189k8635o4871M09k1572n2749l5193K4552L532K6619
5305A3056P5458l7097o9589j7000M0742n8127K3174n5301J0790L8088k3753J0485
5293d9074o5536n4966L0465J4585L477O6184k9862l2734J8656N2607J5992n7741
5281h7947k0718L1448J7053p672K077L8160k4480N6667p330l2996k0470L4391
$$ plain form
5317 -15501 15943 74775 160964 132329 67458 67867 46295 -6454 -41647 -17095 -13563 13056
5305 13056 88514 51417 -18172 -35172 5570 -52557 -29383 -84684 -73894 -35806 -59559 -49074
5293 -49074 -114610 -169576 -139111 -124526 -121049 -54865 -84727 -117461 -98805 -46198 -30206 -87947
5281 -87947 -108665 -77217 -60164 -67836 -65759 -27599 -52079 4588 -2742 -35738 -56208 -21817
$$ [...]
##END NTUPLES=NMR SPECTRUM
##END=
