##TITLE=Analysis number 318599
Compound Code mo 00639
Project Code adrs
Chemist Name scafell
##JCAMPDX= 6.0         $$ Bruker NMR JCAMP-DX V2.0
##DATA TYPE= NMR SPECTRUM
##DATA CLASS= NTUPLES
##ORIGIN= Bruker BioSpin GmbH
##OWNER= nmr
$$ XWIN-NMR		Version 3.5
$$ Wed Apr  5 14:43:04 2006 GMT Daylight Time (UT+1h)  MAYBRIDGE\nmr@NMR_250MHZ
##.OBSERVE FREQUENCY= 250.131544655141
##.OBSERVE NUCLEUS= ^1H
##.ACQUISITION MODE= SIMULTANEOUS (DQD)
##.ACQUISITION SCHEME= undefined
##.AVERAGES= 16
##.DIGITISER RES= 18
##SPECTROMETER/DATA SYSTEM= dpx250
##.PULSE SEQUENCE= zg30
##.SOLVENT NAME= DMSO
##.SHIFT REFERENCE= (INTERNAL, DMSO, 0, 16.522)
##AUDIT TRAIL= $$ (NUMBER, WHEN, WHO, WHERE, WHAT)
$$ ##TITLE= Audit trail, XWIN-NMR		Version 3.5
$$ ##JCAMPDX= 5.01
$$ ##ORIGIN= Bruker BioSpin GmbH
$$ ##OWNER= nmr
$$ C:\u/data/dgb/nmr/ADRS/2090/pdata/1/auditp.txt
$$ ##AUDIT TRAIL=  $$ (NUMBER, WHEN, WHO, WHERE, WHAT)
(   1,<2006-04-05 14:42:18.09 +100>,<MAYBRIDGE\nmr>,<NMR_250MHZ>,
      <created by zg, POWCHK disabled, PULCHK disabled
       configuration hash MD5:
       84 BC 41 DB A1 6E 1D 46 DA 25 12 A5 C1 ED C5 3A
       data hash MD5: 64K
       CE D4 11 D9 CF DB 5C D3 0A BA F2 7F 2D B8 18 35>)
(   2,<2006-04-05 14:42:38.65 +100>,<MAYBRIDGE\nmr>,<NMR_250MHZ>,
      <Start of raw data processing
       ef LB = 0.3 FT_mod = 6 PKNL = 1 SI = 32K 
       data hash MD5: 32K
       0A 2E A7 D2 DB DD D5 8F 5F 64 D8 9E F8 61 7F A7>)
(   3,<2006-04-05 14:42:43.12 +100>,<MAYBRIDGE\nmr>,<NMR_250MHZ>,
      <apk 
       data hash MD5: 32K
       AA 50 5F C6 2E 22 8D 78 40 51 98 F9 14 63 20 1F>)
(   4,<2006-04-05 14:42:44.85 +100>,<MAYBRIDGE\nmr>,<NMR_250MHZ>,
      <abs ABSG = 5 
       data hash MD5: 32K
       0B D3 0D 96 EA 46 BB 1E AD FE CF 79 AA F8 2D 06>)
$$ ##END=
$$ 
$$ hash MD5
$$ 5B 9A 41 80 DF D7 23 5A 95 53 5F 39 BC 7C 62 D0
##$RELAX= 
##$RELAX= 
##$RELAX= 
##$RELAX= 
##$RELAX= 
##$RELAX= 
##$RELAX= 
$$ Bruker specific parameters
$$ --------------------------
##$DU= <C:\u>
##$EXPNO= 2090
##$NAME= <ADRS>
##$PROCNO= 1
##$TYPE= <nmr>
##$USER= <dgb>
##$AMP= (0..31)
100 100 100 100 100 100 100 100 100 100 100 100 100 100 100 100 100 100 
100 100 100 100 100 100 100 100 100 100 100 100 100 100 
##$AQSEQ= 0
##$AQ_mod= 3
##$AUNM= <au_zg>
##$AUTOPOS= <44 >
##$BF1= 250.13
##$BF2= 250.13
##$BF3= 250.13
##$BF4= 250.13
##$BF5= 500.13
##$BF6= 500.13
##$BF7= 500.13
##$BF8= 500.13
##$BYTORDA= 1
##$CFDGTYP= 0
##$CFRGTYP= 5
##$CHEMSTR= <none>
##$CNST= (0..31)
1 1 145 1 1 1 1 1 1 1 1 1 1 1 1 1 1 1 1 1 1 1 1 1 1 1 1 1 1 1 1 1 
##$CPDPRG= <>
##$CPDPRG1= <>
##$CPDPRG2= <>
##$CPDPRG3= <>
##$CPDPRG4= <mlev>
##$CPDPRG5= <mlev>
##$CPDPRG6= <mlev>
##$CPDPRG7= <mlev>
##$CPDPRG8= <mlev>
##$CPDPRGB= <>
##$CPDPRGT= <>
##$D= (0..31)
0 1 0 0 0 0 0 0 0 0.06 0 0 0 0 0 0 0.0002 0 0 0 0 0 0 0 0 0 0 0 0 0 0 
0 
##$DATE= 1144244533
##$DBL= (0..7)
120 120 120 120 120 120 120 120 
##$DBP= (0..7)
150 150 150 150 150 150 150 150 
##$DBP07= 0
##$DBPNAM0= <>
##$DBPNAM1= <>
##$DBPNAM2= <>
$$ [...]
##$SUBNAM7= <"">
##$SUBNAM8= <"">
##$SUBNAM9= <"">
##$SW= 20.6930455092707
##$SWIBOX= (0..15)
0 0 3 0 0 0 0 0 0 0 0 0 0 0 0 0 
##$SW_h= 5175.983436853
##$TD= 65536
##$TD0= 1
##$TE= 295.16
##$TE2= 300
##$TE3= 300
##$TEG= 300
##$TL= (0..7)
0 120 120 120 120 120 120 120 
##$TP= (0..7)
150 150 150 150 150 150 150 150 
##$TP07= 0
##$TPNAME0= <>
##$TPNAME1= <>
##$TPNAME2= <>
##$TPNAME3= <>
##$TPNAME4= <>
##$TPNAME5= <>
##$TPNAME6= <>
##$TPNAME7= <>
##$TPOAL= (0..7)
0.5 0.5 0.5 0.5 0.5 0.5 0.5 0.5 
##$TPOFFS= (0..7)
0 0 0 0 0 0 0 0 
##$TUNHIN= 0
##$TUNHOUT= 0
##$TUNXOUT= 0
##$USERA1= <user>
##$USERA2= <user>
##$USERA3= <user>
##$USERA4= <user>
##$USERA5= <user>
##$V9= 5
##$VALIST= <valist>
##$VCLIST= <CCCCCCCCCCCCCCC>
##$VD= 0
##$VDLIST= <DDDDDDDDDDDDDDD>
##$VPLIST= <PPPPPPPPPPPPPPP>
##$VTLIST= <TTTTTTTTTTTTTTT>
##$WBST= 1024
##$WBSW= 4
##$XGAIN= (0..3)
0 0 0 0 
##$XL= 0
##$YL= 0
##$YMAX_a= 182881
##$YMIN_a= -389091
##$ZGOPTNS= <>
##$ZL1= 120
##$ZL2= 120
##$ZL3= 120
##$ZL4= 120
##$ABSF1= 16.522
##$ABSF2= -4.171173
##$ABSG= 5
##$ABSL= 3
##$ALPHA= 0
##$AQORDER= 0
##$ASSFAC= 0
##$ASSFACI= 0
##$ASSFACX= 0
##$ASSWID= 0
##$AUNMP= <proc_1d>
##$AZFE= 0.1
##$AZFW= 0.1
##$BCFW= 0
##$BC_mod= 0
##$BYTORDP= 0
##$COROFFS= 0
##$CY= 12.5
##$DATMOD= 1
##$DC= 0
##$DFILT= <>
##$DTYPP= 0
##$F1P= 14.0000005364418
##$F2P= -0.99999901652339
##$FCOR= 0.5
##$FTSIZE= 32768
##$FT_mod= 6
##$GAMMA= 0
##$GB= 0
##$INTBC= 1
##$INTSCL= 1
##$ISEN= 128
##$LB= 0.3
##$LEV0= 0
##$LPBIN= 0
##$MAXI= 10000
##$MC2= 0
##$MEAN= 0
##$ME_mod= 0
##$MI= 0
##$NCOEF= 0
##$NC_proc= -6
##$NLEV= 6
##$NOISF1= 0
##$NOISF2= 0
##$NSP= 0
##$NTH_PI= 0
##$NZP= 0
##$OFFSET= 16.522
##$PC= 1
##$PHC0= 172.4109
##$PHC1= 1.551824
##$PH_mod= 1
##$PKNL= yes
##$PPARMOD= 0
##$PSCAL= 4
##$PSIGN= 0
##$REVERSE= no
##$SF= 250.13
##$SI= 32768
##$SIGF1= 0
##$SIGF2= 0
##$SINO= 400
##$SIOLD= 32768
##$SREGLST= <1H.DMSO>
##$SSB= 0
##$STSI= 32768
##$STSR= 0
##$SW_p= 5175.98343685301
##$SYMM= 0
##$S_DEV= 0
##$TDeff= 65536
##$TDoff= 0
##$TI= <Analysis number 999999
Compound Code 99
Book Reference 9
Project Code 9>
##$TILT= no
##$TM1= 0
##$TM2= 0
##$TOPLEV= 0
##$USERP1= <user>
##$USERP2= <user>
##$USERP3= <user>
##$USERP4= <user>
##$USERP5= <user>
##$WDW= 1
##$XDIM= 32768
##$YMAX_p= 482045051
##$YMIN_p= -4153544
$$ End of Bruker specific parameters
$$ ---------------------------------
##NTUPLES= NMR SPECTRUM
##VAR_NAME=  FREQUENCY,     SPECTRUM/REAL,   SPECTRUM/IMAG
##SYMBOL=    X,             R,               I
##VAR_TYPE=  INDEPENDENT,   DEPENDENT,       DEPENDENT
##VAR_FORM=  AFFN,          ASDF,            ASDF
##VAR_DIM=   32768,         32768,           32768
##UNITS=     HZ,            ARBITRARY UNITS, ARBITRARY UNITS
##FACTOR=    0.157963299565203, 1,           1
##FIRST=     4132.6476996994, 0,             0
##LAST=      -1043.33573715361, 0,           0
##MIN=       -1043.33573715361, -4153544,    0
##MAX=       4132.6476996994, 482045051,     0
$$ Real data points
##PAGE= N=1
##DATA TABLE= (X++(R..R)), XYDATA
$$ [...]
19018 3886321 5646502 7746657 9862713 11678725 14270066 18397950 23185225 29424515
19010 29424515 38312425 51489912 71874323 103121037 149113266 208626336 265911995
19003 265911995 304991697 333693930 358405487 359086935 314772970 247271627 188646480
18996 188646480 147980117 121443317 103645148 91333242 82328939 74943879 69714000
18989 69714000 66097493 63464471 61225068 59936555 59693287 60093833 60799068 62718093
18981 62718093 65541080 70540358 78968333 91634969 111769098 144481978 195024213
18974 195024213 263107043 333167297 383142239 417215177 447230840 455234270 412392206
18967 412392206 332315253 257154842 203868671 168367357 144248332 127344664 114942004
18960 114942004 104955073 96820132 90572034 85074272 80121599 75779995 71763836 68271654
18952 68271654 64955073 61655755 58470417 55425045 52753397 50687255 48691487 46918136
18944 46918136 45649850 45341846 44853411 43812875 42977463 41940405 41074694 40289983 39314329
18935 39314329 38037519 36920704 36439398 35675632 35513174 35345810 35442680 35948508 36511634
18926 36511634 38308142 41265377 44735585 49116369 53427486 56151531 57619749 58509473
18918 58509473 57226414 53135888 47785687 42661511 38175720 35207965 32969895 31055674
18910 31055674 29747756 28757824 27553076 26717596 25998820 25464242 24930976 24777639 24596869
18901 24596869 24497117 24569884 25060497 25912647 27005144 28552335 31102144 35009727 40156064
18892 40156064 45275383 49791859 53047848 55051255 55747536 53265711 47745412 41510696
18884 41510696 36091346 31805701 28732440 26576438 24836214 23162820 21839603 20762489
18876 20762489 20173335 19765976 19939744 19691680 18944832 17983415 16768918 15963753 15566596
18867 15566596 15092029 14820616 14745851 14514323 14510305 14234894 13790041 13347872 13217788 13315448
18857 13315448 13565118 13362375 13219657 12613366 11633870 11688511 11284110 10934396 10753182
18848 10753182 10811017 10502176 10061824 10036678 10184895 10303756 10304150 10223747 9622365 9080777
18838 9080777 8878741 9080514 8811221 9009802 9104878 8962609 8813247 8739663 8418947 7767409
18828 7767409 7263144 7332432 7418707 7401339 7157439 6870222 6296330 6187635 6517449 6132852
18818 6132852 6127675 5794822 6092909 6312697 6081384 5874706 5493502 5337340 5348073 5591088
18808 5591088 5564406 4858686 4698123 4908432 4916221 4498941 4748507 4791708 4378563 4429330
18798 4429330 4641593 4780989 4957112 4943745 5263236 5020569 5387370 5219758 4569845 4731992
18788 4731992 4737154 5088682 5780225 5965358 5382653 5062936 4669421 4523742 4742023 4723082
18778 4723082 4618628 4411693 4224162 4742821 4686266 4286098 3704361 3566639 3739091 3625054
18768 3625054 3156812 2996057 2752760 3105061 2986150 3176844 3454727 3780435 3554510
18759 3554510 3048220 2680450 3222721 3663652 3876946 3984364 4006239 3849202 3639886 3314694
18749 3314694 2876164 2797477 3203284 3182043 2973653 3011085 2734120 2691897 2424541 2529677
18739 2529677 2693714 2775069 2764193 2617652 2649067 2600007 2390643 2241085 2560193 2116698
18729 2116698 2161075 2625431 2718662 2378620 2230960 2256962 1738217 876147 1192657 1477717
18719 1477717 1277078 1135498 1282212 1757022 2061291 1789575 1420547 1740363 2067911
18710 2067911 2684953 3250158 4130516 4829067 5166642 5611770 5790843 5575421 4973651
18701 4973651 4341954 3315302 2570530 2447034 2410498 2192436 2423572 2790462 2999565
18692 2999565 3603685 3877042 4851823 6385461 7455025 7940061 8506466 9689989 10129302
18683 10129302 10478856 10368961 10761843 11342600 11899986 13027965 15074332 17501780 20124661
18674 20124661 22907339 26072141 29769315 33855732 38494064 45471771 56073490 71409581
18666 71409581 94884858 129837104 178173958 237548446 296374451 340230640 371520469
18659 371520469 394563679 394533453 356138363 293292950 233768603 189402839 158616186
18652 158616186 136526671 120172248 107843819 98535765 91387543 85698087 81278681
18645 81278681 78640261 77218755 76039714 75491480 75627515 76363327 78727876 82918128
18637 82918128 89701433 100439691 116843506 142003473 178403461 226710423 276439183
18630 276439183 314426199 340588302 360404399 363804419 334797907 280880632 226425760
18623 226425760 184108477 153929011 133288758 118880013 107590814 98894407 92091797
18616 92091797 86242701 82138282 78402507 75659903 72828250 70203616 67739250 64696807
18608 64696807 61969266 59953574 57852200 55316172 53459909 51977908 50415952 49027672
18600 49027672 47619399 46448695 45239521 43535482 41967294 40152604 38780967 37619253
18592 37619253 36598439 35706660 34935281 34350938 33585464 32470494 31467215 30894835 29926516
18583 29926516 28637391 27636729 27398098 26940477 26321315 25753654 25467837 24847305 23828069
18574 23828069 22850827 22589830 22145457 21925932 21683888 21376051 20914683 20301118 20000764
18565 20000764 19803419 19112522 18425836 17897934 17861389 18248799 18297068 17618361 16681257 15974468
18555 15974468 15594609 15515842 15644513 15531920 15241188 14936362 14832022 14432466 14355110 14564720
18545 14564720 14336715 14080339 13721704 13695541 13568064 13528825 13426644 13671583 13826636 13301700
18535 13301700 12786170 12898479 12787833 12530480 12694841 12687663 12108792 11654166 11260176 11191047
18525 11191047 11410239 11711492 11772769 11402568 11354188 11292143 10779571 10709792 10937113 11068811
18515 11068811 11272076 11382658 11271954 10961166 10719863 10926434 11346706 11125776 11527809
18506 11527809 12224888 12611849 13384749 14901325 16470245 19399862 23184935 27932353
18498 27932353 32931429 38386687 42659614 45992087 48175358 48239356 44868510 39146291
18490 39146291 32856916 28129161 24952008 22318990 20575290 19244924 18234051 17550030
18482 17550030 16867906 16456426 16126668 15704262 14874769 14631240 14621521 14703699 15139132 15650017
18472 15650017 16692891 18090071 20383745 23230089 27183220 32047016 36547484 39727266
18464 39727266 41527061 42668590 41909439 38435958 33253641 27953883 23910806 21078717
18456 21078717 18978562 17515090 16422263 15661452 14981155 14348731 13620772 13561686 13068982
18447 13068982 13039114 13061310 11820947 10925360 10695205 10477171 10589709 10467737 10019129
18438 10019129 9691036 9507521 8956379 8558920 8619185 8527479 8611019 8549650 8162069 7698856
18428 7698856 7591889 7566853 7208664 7313710 7320970 6814844 7065795 6916516 6829928 6405029
18418 6405029 6035378 5691530 5817968 6126199 5885101 6000635 6485238 6511571 6202974 6288724
18408 6288724 6367091 6613310 6744679 7214538 7743816 8661049 9763410 10716936 11464129
18399 11464129 11770781 12153359 12600412 12480011 11696509 11331980 11702055 11744003 11542751
18390 11542751 11756872 11848718 10873757 9748779 8806221 7943201 7125514 6769209 6704913
18381 6704913 6533123 5925769 5690942 5616329 5558820 5907474 6017605 6100337 6365126 7256158
18371 7256158 7578369 8088091 8908871 9574854 9767347 9972800 10490713 9620135 9105674
18362 9105674 9277095 9431355 9427833 9327780 9616152 9893753 9563155 7788755 6512482
18353 6512482 5727551 5173542 5179869 5427075 5333007 4902054 4777182 5065064 5334696 5100309
18343 5100309 4660706 4419596 4457225 4525210 4190095 3448234 3328567 3053982 3064428 3183002
18333 3183002 3053550 2911383 3330466 3737704 4052852 3936226 3511629 3567151 3143019 3272739
18323 3272739 3755366 3748531 3222397 2940024 2765575 3031705 2966972 3073549 3227971 3127632
18313 3127632 3174090 3101970 3082920 2934580 2232799 2123768 2567214 3241919 3377273 2910578
18303 2910578 2484793 2476447 2729315 3021178 3137735 2968286 2542919 2631748 2755556 2475908
18293 2475908 2178588 2148695 2275070 2542541 2462282 2223645 2214740 2374848 2368053 2366170 2152359
18282 2152359 1758319 1965041 1804150 1689012 2002751 2246770 2073215 2147846 2284538 2117189
18272 2117189 2179358 2249595 2096252 1840345 1948553 2035966 1790732 1665033 1824284 1941330
18262 1941330 1698730 1496935 1630834 1813025 1748383 1999216 1834189 1806502 2031903 2090071
18252 2090071 1589124 1794498 2256453 2468018 2330443 1716510 1738174 1665055 2130785 2507721
18242 2507721 2383882 2003702 1634046 1510386 1266873 1242071 1270770 1254142 1311826 1581335
18232 1581335 1804820 1837621 1783583 1973578 1865226 1945464 1977583 2202286 1755875 1688841
18222 1688841 1877175 2007783 2079960 1852525 2046955 2159922 1872620 2067649 2671883 2950528
18212 2950528 2924001 3104588 3352745 3528493 4015121 4220067 4717474 5424716 5909323 6650032
18202 6650032 7737399 9772893 11984335 14923052 19000446 23664995 28393508 32054831
18194 32054831 34039532 35347739 34697899 31623625 27301595 22980932 19464242 16536162
18186 16536162 14737351 13486176 12047753 11003783 10609441 10282356 9413280 9286238 9524455
18177 9524455 9744456 9821006 10441293 11201715 12406988 13833758 16158280 19756428 23954920
18168 23954920 28601910 33330023 37747581 41029650 42369299 41663626 38725938 33621891
18160 33621891 28622483 24505720 21046839 18069538 15932602 14408759 12927338 11848308
18152 11848308 11481257 10675974 10035503 9881087 9736194 8908275 8269842 8354077 8272700 7668783
18142 7668783 7263560 6848796 6159049 5779504 5686494 6147134 6449311 6508993 6567786 6039545
18132 6039545 5629483 5621202 5323280 5426092 5211908 5180821 4924929 4882338 4870942 5310970
18122 5310970 5226265 5273592 5521560 5390896 5008558 4879713 4848974 4549124 4505390 4506482
18112 4506482 4256366 4094768 3644942 3489269 3083750 2856839 3028380 3604621 3586742 3461438
18102 3461438 3503307 3273389 3311179 3356596 3033123 2884744 3003768 3106687 2976374 2873829
18092 2873829 2642533 2861101 3318068 3631960 3230951 3607041 4042950 4013398 3891933 3627203
18082 3627203 3281796 3127177 3397117 3388498 2786567 2925926 2964793 2734800 2214391 1996319
18072 1996319 2217288 2460919 2980520 2914448 2946249 3340195 3153129 2760661 2274943 2176119
18062 2176119 2192652 2121682 1822888 2079063 2229355 2359460 2139046 1735632 1415636 1547477
18052 1547477 1309942 1000105 1227066 1804251 2250457 2087601 2324776 2574685 2131177
18043 2131177 1858172 1844030 1514207 1647861 1818514 1989496 1826329 1664120 1761424 1562907
18033 1562907 1636828 1344300 1341462 1320798 1331059 1167993 604267 832497 783388 443986
18023 443986 434873 687805 1023715 1143254 1228523 1331388 1378817 1265686 1191124 1180877 1532827
18012 1532827 1423452 1365834 1663938 1496802 1243197 783151 639154 483833 714660 1199530
18002 1199530 1094342 734548 420881 255685 524834 513398 456261 454670 430701 709516
17992 709516 713074 899934 1339890 1453108 1285893 1140564 894017 409482 433363 914506
17982 914506 1297574 1753144 1622558 1382838 1166166 981442 1032599 1317882 1646122 1977074
17972 1977074 1910673 1737289 1702790 1424278 953264 912742 800670 558749 616302 418014
17962 418014 760690 924605 1366109 1773028 1944239 1807242 1610886 1405242 1616629 1747451
17952 1747451 1555525 1566443 1670221 1524971 1222697 1283822 1157558 497507 283552 493301
17942 493301 856752 905805 1131981 1357501 1391855 1000388 1062429 974812 505242 392198
17932 392198 754355 892202 1000279 1145795 1214628 854024 865348 1255607 1832869 1496547
17922 1496547 1173601 1061618 659588 530167 527788 618801 567741 252117 196973 481268
17912 481268 94159 170710 560386 862720 1079547 589489 -93130 4273 453534 589482
17902 589482 297845 59628 -161471 52993 342035 724542 802408 821821 793174 396707
17892 396707 22859 -95712 41304 -62160 198730 657769 541975 284507 450328 428626
17882 428626 63631 -218328 -67149 121738 75140 274829 543656 491610 243342 223914
17872 223914 519272 575004 687531 669958 774367 632254 311358 406788 354182 493771
17862 493771 673877 205518 281605 346423 415096 298506 522424 705670 349988 166432
17852 166432 180360 453924 362235 495936 388529 328520 -50595 -96544 -143685 -38754
17842 -38754 202805 218111 518687 450818 382009 295284 329635 421039 260164 613114 552274
17831 552274 274706 143663 296580 654766 582053 446592 527933 595789 238743 105932
17821 105932 168513 117132 102183 -208117 -3983 -138636 257615 327431 339612 349642 575544
17810 575544 625846 553442 727616 1186501 1121059 1056295 446334 332602 288515 425665
17800 425665 618592 235444 -104013 -283935 255611 331862 228083 271372 287298 622923
17790 622923 598388 430589 -1845 -192785 -153266 -37942 -81515 182174 462451 502295
17780 502295 533183 327795 86265 51351 88193 126607 427410 407447 636007 291433
17770 291433 -391853 -783538 -488403 -64310 -346634 -518184 26152 836707 1032096 849561
17760 849561 651892 117026 174693 74750 -10187 186287 215148 90149 -29642 -300229
17750 -300229 -9114 -38280 -153821 1481 -6860 97079 569914 410933 200096 353195
17740 353195 218415 -37668 -13186 90967 75523 -21891 -138230 371772 1021364 1542538
17730 1542538 1559272 1693532 1945371 2541979 2633467 2315781 2115019 1973615 1998257 2250590
17720 2250590 2589816 3544417 4331937 5100844 6141501 7470093 9552830 12916368 17077386
17711 17077386 22367085 27899541 32340365 36148880 38401431 38829050 36535037 31723961
17703 31723961 26372435 21698076 18152730 15280542 13516338 12465994 11467304 10605480
17695 10605480 9964416 9529572 9307113 9394020 9246762 9518899 9443700 9350839 10003518 11100900
17685 11100900 12595691 15001044 17927249 22361569 27272336 31448822 34758824 37224695
17677 37224695 37909946 36496905 32284290 27423367 22780290 19035990 16396272 14314147
17669 14314147 12644648 11762032 10983334 10170477 9490425 9103127 8632701 8380645 8120808
17660 8120808 8036931 7146109 6330018 5799171 5912482 5884411 6324390 6124114 5636655 5249008
17650 5249008 4780862 4839107 4560255 4211255 4219981 4378675 4196085 3926799 3542751 3151124
17640 3151124 2979851 2920708 3365351 3498898 3174286 2565132 2471301 2406493 2395333 2702930
17630 2702930 2740345 2840693 3196636 3145596 2716649 2337786 2365586 2377417 2628628 2490874
17620 2490874 2509907 2448215 1906864 2275539 2565793 2664281 1893783 1774774 2207422 2012272
17610 2012272 1556659 1945534 2130662 1934085 1543728 1428886 1571231 1578445 1458623 1429362
17600 1429362 1480734 1295470 1169893 1141409 1272758 1526557 1532834 1552783 1406950 1482664
17590 1482664 1442821 1468303 1281656 1327790 1501841 1567067 1433182 1522894 1502420 1346659
17580 1346659 1467627 1533274 1482211 1308137 905930 818899 843776 759455 563562 772309
17570 772309 767373 788058 567016 560245 1025902 1084334 1097534 791229 1178441 1355741 1059260
17559 1059260 1021237 981990 1116270 1213702 491222 36955 412948 1017551 1343773 1009723
17549 1009723 720316 720790 842446 1171009 1428207 1388321 1272548 1174625 929148 960722
17539 960722 1112468 1389145 1670434 1894379 1648760 1389791 1172047 860778 950098 818526
17529 818526 852245 617705 764899 888964 1194100 964284 741891 946897 1139435 898080
17519 898080 737277 663417 574371 672062 379333 229994 545630 1050042 1028967 789841
17509 789841 642294 828217 946097 776298 413277 206116 202890 60217 289855 244733
17499 244733 146833 362553 523628 253008 95494 -263592 -574608 -680213 -659399 -427541
17489 -427541 -44763 -97075 -63829 203675 567048 702547 522767 343306 69979 -445844
17479 -445844 -566716 -527183 127487 213744 -305387 -516336 -732551 -789264 -497324 -320305
17469 -320305 -21098 -320816 -348969 73864 -58321 -123966 220224 59637 193082 392501
17459 392501 113132 -53818 -377377 -704759 -809109 -672774 -746040 -540625 -304985 -45888
17449 -45888 30588 -34667 -427627 -392946 -147056 -74537 175312 -141636 -116842 -470803 -870854
17438 -870854 -738988 -317340 -81965 -57651 -388750 -488336 -553730 -731040 -168307 155658
17428 155658 123587 7561 117569 239817 215303 11409 -392476 -180414 192548 164668
17418 164668 -320194 -476761 -191680 438491 585574 21667 -72333 54780 517322 420329
17408 420329 169495 -281319 -248329 -312424 -384670 -178305 94283 -500100 -836438 -616626
17398 -616626 -212857 284313 598729 656956 597286 573029 185419 123368 -196591 -439870
17388 -439870 -208052 -41978 153773 -204235 -751905 -678069 -613204 -228065 -101508 61587
17378 61587 381856 -207278 -236275 -111031 -307723 -173865 109061 -185307 -556581 -271183
17368 -271183 88461 -150496 -32970 -32242 -236669 -435449 -387395 -567586 -367695 -69714
17358 -69714 4966 -309623 -201725 -83152 -10844 47150 280364 281053 134091 -216207 -360315
17347 -360315 146540 716365 573472 487211 623023 533781 -27857 -547042 -482769 -507201
17337 -507201 -312735 -318370 -216719 -101550 -246944 -459462 -276801 75291 -203251 -300011
17327 -300011 -535543 -520319 -361838 -340852 -677844 -604788 -938537 -894962 -439396 -378037
17317 -378037 -144729 -233008 -509165 -574186 -519072 -814432 -934396 -796997 -510786 -174089
17307 -174089 107994 17221 366795 280555 48966 -538594 -756291 -793370 -385398 -366160
17297 -366160 -264549 230506 292045 140930 -35545 -320507 119720 469834 289237 91209
17287 91209 -173067 -386994 -307839 -154453 -482841 -644530 -418825 -2462 267851 142963
17277 142963 -210939 -407280 -397018 -462029 -75013 180308 441520 208409 -15582 99043
17267 99043 -14613 -322931 -15869 425674 62125 -291482 -420418 -449209 -332144 8485
17257 8485 373086 380728 348922 355562 -231191 -628981 -488822 -148873 83715 -112211 -311485
17246 -311485 -203837 -722965 -1257470 -853244 -245643 -364976 -876385 -782564 -971110 -1178739
17236 -1178739 -722077 -313747 -377584 186107 300200 -34814 -497314 -617193 -418881 -470494
17226 -470494 -503394 -504682 -79780 102802 124668 -131251 -57567 42965 125563 531791 376485
17215 376485 392354 -111871 -179807 43869 20172 -105181 -220950 -173932 -140599 213327
17205 213327 369757 -46911 187 -521294 -1006401 -859037 -998996 -617355 -267674 324597
17195 324597 454311 -6957 -170619 -391610 -826909 -954221 -322985 -265306 -87024 131540
17185 131540 -35660 -364988 -514010 -334029 -710489 -898581 -746835 -405820 -141069 -128504
17175 -128504 -162825 -105580 327084 807290 324528 -49558 -151116 11795 -210111 -118278
17165 -118278 92773 381992 391831 210751 -50678 -145873 61388 110177 54367 175373
17155 175373 143000 32877 154035 164281 -41127 6533 54462 96132 2208 20662 93327
17144 93327 296105 453377 501807 629898 278986 -103634 46663 119618 121584 472454
17134 472454 554115 255691 359751 508086 -42990 -147750 -310994 -148025 -311232 -566292
17124 -566292 -493508 -444473 -214641 -42536 -525186 -582333 -390864 -387496 -468827 -36794 -48040
17113 -48040 -529522 -291901 -198519 -223191 -294413 -645140 -478240 -545703 -24711 377237
17103 377237 354255 251439 247052 321735 17358 148316 145787 -362910 -126771 448321 202643
17092 202643 -45720 156869 398098 221031 84966 -357996 -413442 -296722 -330646 -2671
17082 -2671 264241 11447 -269679 -358030 -286378 -536039 -401701 -298967 -43117 99390
17072 99390 -318699 -319433 -375153 -508798 -393727 -627561 -754641 -636546 -605755 -103395 -96824
17061 -96824 -296856 -940582 -878308 -106239 97598 36908 -191023 -367080 -129686 71864
17051 71864 -94310 -337380 -432152 -346225 -553464 -677192 -646680 -310077 -335029 -658370
17041 -658370 -471353 -180111 -30331 -77778 -234845 -526832 -542398 -411330 -122368 -129583
17031 -129583 -6458 -180369 -310216 -216224 -284700 -299337 206732 431557 254799 189492
17021 189492 275008 263922 374945 470691 493758 485391 310527 -119823 -268301 -440338 -477139
17010 -477139 -224460 -83533 -120151 94572 -245419 -577422 -346227 190148 442492 183920
17000 183920 -154017 -498438 -440172 -561292 -807288 -823964 -931047 -505860 -422252 -658230
16990 -658230 -727367 -401373 -427919 -458452 -516405 -21663 -106426 -399052 -240286 -409783
16980 -409783 -719004 -550455 -419104 -305299 -48107 73431 299317 268440 231690 -6484
16970 -6484 -45314 -55161 -247778 -966129 -1307665 -932052 -865428 -726989 -603549 -753679 -1014450
16959 -1014450 -1113624 -754016 -601871 -317661 -515145 -361691 -891910 -1293678 -653543 -159746
16949 -159746 12117 98850 -65785 -315967 -104589 70035 -13426 -26465 -505350 -709785
16939 -709785 -973530 -1193013 -1513943 -1229501 -760885 -600699 -712543 -704916 -664566 -349755
16929 -349755 -353437 -464108 -419540 -865220 -1050580 -1087447 -716581 -684507 -678750 -626162 -248883
16918 -248883 53862 280421 -108732 -437639 -568824 -343858 -461986 -390143 -263158 -388040
16908 -388040 -522809 -321719 -422628 -930688 -636164 -332499 -325117 -618952 -1012224 -768516
16898 -768516 -862758 -530686 -100318 -47022 -317313 -358839 -934856 -1423595 -1100113 -950736
16888 -950736 -613947 -25517 27060 -474281 -928052 -1008746 -275943 -261072 -658104 -732641
16878 -732641 -602495 -411292 -506318 -270509 -315087 -392822 -235589 103257 168599 33624
16868 33624 -182966 -117998 -204280 -394796 -180941 -74076 -452059 -616422 -651466 -736637
16858 -736637 -764305 -795079 -742474 -405036 -79483 -222158 -231903 -134198 -393162 -747464 -882886
16847 -882886 -823321 -695822 -184696 -77758 -174163 123404 335080 -158690 -367606 -640619
16837 -640619 -769600 -696747 -496458 -449548 -439745 -500592 -555636 -919360 -1131974 -889336 -811382
16826 -811382 -588675 -411403 -133260 327754 338627 49008 -48692 181861 291794 165995
16816 165995 12981 241417 -142301 -481636 -580107 -245407 145996 302085 42280 -213768
16806 -213768 -562778 -819808 -432296 -237859 -225028 -121313 -96577 -33753 -80791 -192556
16796 -192556 -222683 -436740 -1001009 -1101003 -1025108 -859056 -419277 -368874 -563509 -402864
16786 -402864 -6373 54249 -12529 -743937 -662861 -86955 107965 145628 -238709 -242753 -48196
16775 -48196 74 -24840 -387511 -488517 -616430 -404590 -662444 -938366 -711815 -268193
16765 -268193 -186044 -78422 -77727 -339576 -316003 54914 -207317 -642946 -418119 -146123
16755 -146123 -384348 -551107 -681414 -835774 -1049882 -538569 -206974 -300190 -511046 -535153
16745 -535153 -466000 -244109 144216 -232985 -598423 -991570 -978568 -665486 -218551 378769
16735 378769 142717 181073 371741 112068 -268896 33775 331943 397825 204710 -340937
16725 -340937 -1022176 -992611 -636307 -792467 -771190 -689703 -626232 -256702 -151705 -73292
16715 -73292 -78771 -37297 -49779 1704 114774 -29803 -210646 -429820 -385646 -126972 39525
16704 39525 -181894 -392656 -617258 -901048 -987004 -891620 -646831 -931656 -798827 -437749
16694 -437749 -841933 -978623 -539052 -496694 -829033 -935256 -867233 -881347 -834815 -539404
16684 -539404 -790073 -1014833 -714789 -178668 -44440 -399539 -62871 107252 -292859 -773203
16674 -773203 -1215239 -1254038 -1046772 -960631 -826782 -892342 -711867 -614464 -271475 -149786
16664 -149786 40885 -221331 -463998 -353102 -131039 -377347 -486899 -621180 -542920 -322188
16654 -322188 -78471 12850 -99461 -425109 -165959 15660 59868 231780 -38390 -55169
16644 -55169 33710 -221793 -189776 -82710 -35665 -234441 -278787 -358194 -556997 -748402 -633125
16633 -633125 -525498 -530731 -648880 -469248 33330 -268795 -639193 -209078 -196829 -400841
16623 -400841 19001 141661 -137471 284635 460090 119591 -89231 -221796 -390044 -709033
16613 -709033 -183479 301972 878158 912951 694251 415428 -155154 -338661 -158795 -165714
16603 -165714 -758970 -592651 -399662 -335180 -642313 -669818 -374572 -173982 -287517 -319157
16593 -319157 -161451 -261605 104290 263433 159170 224356 230206 -257358 -639044 -955167
16583 -955167 -908305 -620783 -370323 38466 -260718 -565923 -458097 -78645 201825 -430278
16573 -430278 -538064 -511812 -480596 -257197 -362566 -844375 -824352 -329292 -270082 -207853
16563 -207853 -236570 84067 249502 111880 384325 151767 81331 33815 256819 229245
16553 229245 235169 -54494 -188638 -479928 -733131 -372443 6683 64073 -492981 -1016388
16543 -1016388 -1200374 -726589 -192450 48095 150765 -39669 -552334 -662557 -389388
16534 -389388 189695 581031 464392 96870 -213824 -454480 -601956 -496786 -371087 -427120
16524 -427120 -418514 -283312 -489398 -445918 -653054 -623402 -352644 -267142 -564285 -399643
16514 -399643 -604004 -395614 -150837 -435620 -481601 -150433 363093 645858 688191 589332
16504 589332 310566 84938 -97591 -115086 -30145 -290068 -199869 -198009 -531587 -504979 -407618
16493 -407618 -318205 -540154 -953141 -1059993 -491325 -359866 -560953 -799094 -767905 -784405
16483 -784405 -594613 -315661 -500727 -608861 -695318 -821468 -946444 -741427 -440853 -277376
16473 -277376 -215419 -60085 266142 401635 268739 149010 68050 -46138 -303357 -598850
16463 -598850 -362639 -44133 -477248 -1015849 -986730 -324312 97009 374064 157828 390520
16453 390520 572400 389392 -199296 -166336 -76682 -278739 24239 -174819 -60359 323292
16443 323292 257401 -313345 -509395 -440303 -585396 -736215 -827816 -488915 -394963 -552104
16433 -552104 -414709 -370883 -338313 -355211 -122729 -88386 108433 -174903 -382887 -447845
16423 -447845 -451893 -721075 -450824 -492690 -393930 -64866 -187309 -846494 -1196508 -1025903
16413 -1025903 -514106 -338206 -34473 -502300 -1100984 -1109471 -891071 -560845 -590071 -475581
16403 -475581 -701206 -650430 -642873 -471929 -321908 127487 -249396 -38584 -45434 -222759
16393 -222759 -175645 -288105 -217863 -466256 -1035490 -931963 -609184 -496360 -69917 110034
16383 110034 -287611 -313732 -157341 -610824 -839168 -540882 -568828 -607065 -451434 -368567
16373 -368567 -767019 -915643 -645769 -658470 -1004312 -1128642 -1168351 -540226 77499 -127807
16363 -127807 -111364 -416732 -374305 -513602 -460514 -327869 59433 3464 -294664 -702859
16353 -702859 -450853 52202 -93916 -120977 154006 -1201 311242 509462 416371 22428
16343 22428 -527033 -472746 -425063 -736501 -951509 -800713 -628117 -799209 -320924 -396040
16333 -396040 -309681 -194745 -398037 -789956 -946142 -685435 -195176 -118060 -29035 123183
16323 123183 413343 504905 -29829 -130127 -326785 -355202 -533173 -749926 -566195 -427139
16313 -427139 -491525 -166934 310952 34142 -124669 179552 644253 586962 170467 -76819
16303 -76819 -547126 -516663 -124523 -464327 -288841 -426173 -753589 -790849 -767490 -467360
16293 -467360 -163029 -88908 -325998 -509054 -177275 -549328 -614106 -762955 -551069 -276536
16283 -276536 6151 112853 -42846 -262358 -563140 -501747 -643226 -715394 -916897 -901574
16273 -901574 -860168 -531345 -392032 -264984 -103275 39030 70955 125693 -28887 -96838
16263 -96838 -279629 -256138 -145844 -174429 -470630 -504106 -557003 -1025617 -933929 -269974 -481767
16252 -481767 -220598 -237188 -327658 -440374 -400175 -255771 274603 640558 455317 124411
16242 124411 208451 475940 443895 406641 -65946 -340606 159959 449426 162001 40324
16232 40324 82903 148974 -289372 -535045 -392001 -189878 128020 151689 51940 -29701 260758
16221 260758 254316 -25807 -324515 -860477 -800936 -162695 216618 235292 212960 283678 43021
16210 43021 -255041 -395258 -467927 -686851 -364832 45111 -150045 -335022 -356854 -407953
16200 -407953 -444556 -457329 -210129 -441487 -584530 -407196 -170067 -97867 145505 545766
16190 545766 290329 245083 40404 -220752 -301028 -339217 -620595 -506647 -350110 -454265
16180 -454265 -619694 -496412 -484104 -680700 -479518 -212084 -323811 -311493 -317406 -661998
16170 -661998 -500236 -376541 -250512 -122598 -148720 -520685 -231392 -277509 -411982 -635024
16160 -635024 -530559 -43526 310413 360088 594882 624746 396229 309151 -75521 -64385
16150 -64385 -92732 -146431 16646 -168091 -343023 -299923 -109943 -148495 -441206 -192465
16140 -192465 -193158 -445861 -637359 -595355 -813336 -660980 -177307 -342103 -567954 -716654
16130 -716654 -710820 -1016122 -855483 -345382 10695 153388 130376 -240846 -60740 -245825
16120 -245825 -622028 -498982 -339651 -60254 -91261 -98521 -121980 -414508 -158398 -186272
16110 -186272 -266999 -273833 -96097 -301875 15116 40278 -81781 -85188 -345526 -440510 -265642
16099 -265642 -148532 -3778 75103 10958 -331076 -223496 -346951 -902278 -873091 -292791
16089 -292791 -280203 -314484 -104700 51248 41514 -208813 -81667 280839 -152254 -112845
16079 -112845 107354 62246 169742 -247935 -480886 -542479 -185807 -72259 -27110 -72880
16069 -72880 135204 365807 112051 243477 448524 49013 -168954 -428152 -458661 -180960
16059 -180960 -68067 -171346 -241678 -298071 -308455 -201119 279538 93361 23189 421069
16049 421069 240272 -81468 -344138 -470933 -689221 -806519 -240456 61457 -445617 -716939
16039 -716939 -491253 -529045 -696895 -421441 -452503 -189324 -118718 223253 408271 215129
16029 215129 217480 -306808 -441638 -148904 202967 170565 -80862 -313444 -236971 -442537
16019 -442537 -427221 -347864 -478188 -586022 -597918 -361176 -272880 -440458 -620677 -704125
16009 -704125 -435280 -164132 204991 384836 375022 209468 -220868 -405899 -398441 -77324
15999 -77324 334282 179568 -39946 -22456 -9129 246669 -73218 -163516 -125790 -13140
15989 -13140 -89167 -219756 -119468 23455 94472 37838 102361 -174726 -282407 -363978 -574958
15978 -574958 -463845 -151682 -31294 393848 565406 340957 414886 403130 97039 -97142
15968 -97142 -357343 -623847 -325415 131691 297441 251024 46262 27249 -342152 -430316
15958 -430316 -342953 -516887 -419720 -12638 -563790 -546394 -54855 -210112 -628284 -729441
15948 -729441 -454955 -252455 -627 -105501 -85893 -188180 -2546 132888 187978 169032
15938 169032 -360203 -540543 -661944 -436246 -618610 -681290 -768513 -527975 -324421 -163009
15928 -163009 -304502 -477299 -459384 -11111 463556 430745 362318 247150 -181683 -379401
15918 -379401 9592 232839 465241 37064 -475621 -525938 -559293 -375438 -180215 -188969
15908 -188969 -190325 124691 317470 33032 -309637 -60013 99692 218991 -165906 -584163
15898 -584163 -264306 -416772 -265252 -283770 -697432 -919657 -804757 -689105 -555096 85011
15888 85011 84948 -279344 -509149 -152651 247597 129873 -293604 -792384 -822416 -513638 37565
15877 37565 51150 -167706 -374616 -79357 -363976 -353434 -106736 -21580 -25112 -274534 -10687
15866 -10687 223741 194697 637185 694184 681703 640293 587589 210364 -124659 -367466 23071
15855 23071 183845 490780 907943 651278 567760 132350 78997 -146359 -404720 -680809
15845 -680809 -955319 -1095457 -631717 -436309 -249484 -512846 -118620 8677 -123404 -306096
15835 -306096 -304995 146563 245099 206406 -130239 8280 315617 -157202 -447782 -349876
15825 -349876 -274050 -544138 -254586 133717 -165618 -284279 -225498 219954 -101668 -470937
15815 -470937 -416262 -571685 -65044 3336 -199993 -374333 -140051 449301 654529 353139
15805 353139 -48158 346979 38084 -2528 -47237 328468 507553 532021 385529 105650
15795 105650 -146099 61140 179185 196461 377903 486846 506767 431445 -101387 -130256
15785 -130256 -68669 -281556 -233825 -222738 -539304 -647468 -1119837 -649872 -481188 -280577
15775 -280577 -162895 -174480 -88870 -329784 -291194 3124 401277 203163 -376507 -668972
15765 -668972 -580762 -287002 -289314 -427507 -460383 -461341 -373664 -413378 -321523 -740785 -440702
15754 -440702 -381766 -86018 -363406 -350829 -203987 -21998 278000 489147 662567 707978
15744 707978 688803 424740 132464 -50860 8548 290349 244121 121302 496649 918633
15734 918633 985466 492714 288668 391027 810880 810540 720472 471037 -133216 -464817
15724 -464817 -869025 -666788 -420182 274005 735581 577108 376209 -204997 -332644 -26423
15714 -26423 161300 106188 -224182 -317436 -163354 139998 -468242 -706591 -777779 -774725 -100142
15703 -100142 13348 -175552 -179108 -179401 65877 29086 132959 246042 176731 193308 34027
15692 34027 147945 621150 254497 470806 283364 185971 -108618 -314648 -166901 -297170
15682 -297170 -332539 -338601 -375806 -208230 320399 913141 762659 421427 427429 691324 670060
15671 670060 548684 502864 419853 841261 853177 548295 331648 -2123 103322 -79724
15661 -79724 -138495 379488 175643 92653 -246488 -611782 -490705 -290432 -160016 -22364
15651 -22364 -348854 -393676 -642214 -758130 -708467 -592644 -792264 -767680 -428883 59096
15641 59096 268275 184818 191723 311740 444880 494490 212887 153549 192952 604113 879507
15630 879507 819665 604452 382811 379173 640225 447288 33217 -8681 -72945 77736
15620 77736 392435 634645 1086879 1211778 820020 289898 185921 559438 819192 722541
15610 722541 730588 710747 365311 -227308 -710729 -530134 -204234 -14332 43046 299422
15600 299422 276170 -290959 -981881 -930423 -167565 397513 667152 919615 315157 131305
15590 131305 -152700 -307832 -12106 480742 354451 -107547 -263750 -200671 -158643 -241352
15580 -241352 -49561 294170 252829 83605 -18089 121127 -80362 143480 350451 215356
15570 215356 -552024 -749751 -600243 -297498 -403438 -362741 -281162 -344091 23575 167937
15560 167937 300001 115459 36540 287973 207886 127479 193811 -298698 -462527 -207587
15550 -207587 72393 148043 31987 278806 -206718 -314678 160455 605670 472800 485585
15540 485585 543513 305543 15143 232550 -12305 -52387 -88456 -93722 424714 495445 218383
15529 218383 30117 320887 144432 -295271 -351327 -611448 -647017 -475945 -24291 238971
15519 238971 454571 240772 155955 -25579 192674 626084 917042 1000516 779760 815532
15509 815532 571167 23094 31910 409758 705451 971629 836428 182224 152270 183059
15499 183059 250756 124446 67452 -209662 -168675 -87269 93597 344353 652291 723903
15489 723903 638729 536813 477256 597551 661229 838838 1133872 1010003 756077 810568
15479 810568 1372497 1186495 647869 390600 116486 -11506 265696 395764 379622 694256
15469 694256 916081 871811 576316 380721 482677 228265 177427 281830 348144 968
15459 968 344449 618528 380520 389336 131533 89395 142059 227020 292965 73227 223080
15448 223080 510179 482390 730923 579549 462581 641148 863441 800019 368306 136747
15438 136747 332503 273372 -8399 -30452 142312 212734 445058 466930 444049 8177
15428 8177 -88735 -133787 -54176 3417 -54822 -24359 -165482 326786 555444 255630 -199067
15417 -199067 -105814 631306 571699 316936 258511 561704 700152 552339 422716 224798
15407 224798 592220 451156 -62788 -114810 227080 761799 591714 289761 215345 160841
15397 160841 212975 560619 722899 627673 495882 268446 -261978 -48668 -26722 -337653
15387 -337653 -303545 -79568 165192 524894 612473 593627 758949 826725 743572 714893 646337
15376 646337 570441 672818 502637 -116639 -377032 65144 106953 299219 179708 -6451
15366 -6451 247715 336197 110702 311230 594685 608154 251026 62437 -312868 -18825
15356 -18825 454285 625538 356355 -96670 -134006 230655 589536 515354 486900 209926
15346 209926 184566 290661 509911 881194 585856 173385 -171631 217722 151419 -95987
15336 -95987 -104174 -79594 553372 1237598 1325630 1128501 793632 857820 1047586 1010828 879497
15325 879497 434111 254932 513703 236064 272252 -19994 108523 196674 202323 305650
15315 305650 305451 456136 705507 676965 909980 1030750 826686 417328 246030 232001
15305 232001 608103 614818 788294 863470 1255034 1245427 559169 38233 270705 331224 287911
15294 287911 622512 774437 625772 425147 372964 379961 375422 286311 428081 718170 899759
15283 899759 592566 469332 735014 680283 536791 482618 225555 111915 403657 -73535
15273 -73535 -910308 -702576 -368686 -510180 -373550 -245893 -56638 187519 49178 62873
15263 62873 -49805 19141 178391 823921 919870 662225 -24068 63043 248951 -120861
15253 -120861 -118157 214503 467579 690465 433063 292577 -4888 36260 472060 750631
15243 750631 557921 63143 81404 -90321 5575 110272 544588 683789 542775 709983
15233 709983 826639 436933 724189 409523 -71397 -604274 -139804 288742 71569 405321
15223 405321 712315 773979 689422 858093 1053360 797927 645038 439777 494026 467770
15213 467770 446592 629013 540441 -71067 -306888 33460 125805 70367 297424 475274
15203 475274 538173 61988 -809086 -532847 -16579 393414 190963 135410 280736 77906
15193 77906 81683 544861 421209 420040 621766 774314 641768 530472 251709 607010
15183 607010 415106 -151873 -39160 30864 280580 618797 957411 923904 730301 424793
15173 424793 265921 382353 70151 -40731 -136666 102616 251391 670571 590168 377992
15163 377992 621578 817354 675442 471225 489754 541060 402662 277320 103930 3559
15153 3559 287871 934818 618405 459955 417939 -397 -105801 65145 304382 168307
15143 168307 208401 464437 458125 388287 579434 561924 625657 905824 975371 798721 791631
15132 791631 566569 338336 -89308 -595580 -585187 -216032 233497 348747 642334 943767
15122 943767 711663 265166 818948 1161750 1187623 1228997 1067998 296209 36759 625992
15112 625992 813549 518472 481111 585627 491547 317830 215191 435782 671335 875800
15102 875800 773932 712809 731870 667156 510710 583706 550406 688243 553858 65706
15092 65706 -204707 -213537 177990 599304 689971 800466 720046 501516 667324 970743
15082 970743 738750 723374 606288 643078 629562 587927 763212 971577 994394 1241846
15072 1241846 932849 708346 736395 1090633 815669 419601 737247 1005555 888486 967038
15062 967038 938087 803670 746133 412032 203812 356057 154395 219280 147292 44869
15052 44869 107571 109386 92991 457150 483775 629662 761330 368564 319962 703142 1173152
15041 1173152 937654 911465 888044 883580 1240882 881792 1095443 1547637 1389956 1038022
15031 1038022 903439 1227723 754304 585991 834423 732895 599486 994660 820807
15022 820807 403402 273370 673718 734653 839275 807546 328014 196649 123229 159822
15012 159822 473622 974566 936391 814598 1060367 1030429 983055 937657 774462 721870
15002 721870 640675 855899 1043359 1028684 682382 901351 1012371 864616 945172 1090068
14992 1090068 1139962 1053028 682973 83120 276438 567905 482301 767841 1209486 1007875
14982 1007875 1193644 1130474 915712 750917 885839 1237306 1337249 1436994 1525853 1272493
14972 1272493 1090428 975773 1121891 1156531 932302 907378 970326 350181 732417 1067835
14962 1067835 1108677 1132219 774579 728652 961580 1118823 928072 1086650 1288791 1294493
14952 1294493 829081 740490 755684 1059321 1115437 1342734 1638803 1269211 898637 981754
14942 981754 716801 505394 527269 322438 331057 155158 518592 1096431 709573 246020
14932 246020 713545 782563 778290 838301 871714 1458001 1310314 995235 1069238 1147620 945362
14921 945362 783324 394538 90197 33257 -24492 269995 429437 77789 245829 680242
14911 680242 841240 1017995 799815 1087599 1223441 1048999 836930 851445 1065945 755483
14901 755483 446198 965076 826723 716229 599277 956680 999948 937061 1142863 615808
14891 615808 333385 405663 654002 968671 892284 415305 434489 527541 833945 938259
14881 938259 867399 1023467 1108341 805888 371925 735929 668290 442422 790950 536408
14871 536408 553700 492937 526968 943835 938441 732797 841311 558635 1181059 1522566
14861 1522566 1387590 1187327 977395 928070 953937 783066 943229 897367 452683 389398
14851 389398 708686 1159161 1354173 1279689 1058599 676766 874586 1008959 956525 691017
14841 691017 931757 1134558 1341921 1170764 1177604 816778 806879 854866 1336435 1291231 1162567
14830 1162567 807685 669728 813124 723919 546449 636541 830799 514227 243865 499997
14820 499997 621699 805685 1381656 1304604 1133796 922833 673789 470075 442724 798783
14810 798783 1167297 898032 380911 771716 979554 970292 862134 981970 709888 829385
14800 829385 616581 346139 385164 807557 1103028 1131752 923767 676664 612757 979038
14790 979038 1107736 685473 958892 833162 676461 946380 1118962 979819 792113 631654
14780 631654 867489 1092442 1234634 1324262 1031247 1138687 1170775 915399 558156 430178
14770 430178 640009 551984 766038 829397 1032084 1263976 1224648 1321036 1261724 1033824
14760 1033824 1069868 1094868 869059 866625 836387 761868 798525 848530 779743 790673 968923
14749 968923 782310 585028 398069 246670 267801 566426 862231 743166 512227 639097
14739 639097 562771 459218 462824 629949 418100 172251 295933 695153 420208 358026
14729 358026 292569 -36453 193669 689542 988476 1397174 1205935 907587 1016867 999366
14719 999366 866371 1078527 932134 481554 901317 1039500 1054774 777120 950102 1097069
14709 1097069 1277400 1096965 1017535 595363 705521 935086 785633 513552 471424 511238
14699 511238 475656 843890 1385246 1487139 1600199 1642862 1136384 580242 669597 838844
14689 838844 1056760 1083824 1030564 597653 421475 412094 621555 948566 1014941 904363
14679 904363 807840 957360 1112231 1067082 1376951 1069802 551409 861878 905091 856921
14669 856921 1253592 1285733 1374783 1017756 1060927 1293197 930952 575087 740013 752948
14659 752948 957620 1159996 1308928 1077953 1027096 1146840 977957 553092 336991 466462
14649 466462 632710 1069239 1287964 1608270 1423760 1278480 1237399 1165555 1089388 732610
14639 732610 649661 403795 485288 821283 1229990 1246203 1287993 1504511 1251960 976997
14629 976997 1215137 996711 554429 468344 689314 727812 894968 779747 1079997 1470062
14619 1470062 1508618 969044 319884 257790 643078 913413 1093652 1201504 1650856 1663253
14609 1663253 1303348 921511 688375 581208 1130672 1448706 1355837 1210986 1072650 916144
14599 916144 1071408 1357188 1383364 867791 613292 1342265 1655285 1286110 1198661 1567440
14589 1567440 1587180 1422508 1728928 1608731 1596423 1334684 1609759 1755801 1587018 1030479
14579 1030479 770946 683539 817969 1143115 1119623 1199424 1159931 1514572 1583728 1478150
14569 1478150 1828305 1818154 1626303 1532939 1541595 1941075 2043760 2114100 1837331 1469123
14559 1469123 1033676 910185 1067388 1113540 1041537 1142460 1343969 1343034 1219600 986442
14549 986442 919042 1033264 1263057 1363580 1175284 1377056 1266973 1378569 1175172 935423
14539 935423 1019583 1120058 1005772 843748 1220923 1122347 630359 490181 835398 1106868
14529 1106868 1024384 912224 602176 686893 746855 649949 550844 998366 1209860 1045290
14519 1045290 629655 458346 646478 1072206 1263294 1026264 903750 1122207 1036317 1097941
14509 1097941 1362760 1637221 1285793 1272028 1217815 1399291 1368552 1142936 1027566 1039456
14499 1039456 995064 821231 1139807 1578252 1582410 1291434 1025441 1185757 821193 808014
14489 808014 904193 601151 790873 1204427 926389 1014780 1185424 1061838 658175 515783
14479 515783 233667 701273 1303716 1774645 1742728 1455634 840304 594689 1143022 1189548
14469 1189548 1317970 1344689 1236290 1393793 1405896 1281077 859619 397753 205237 540601
14459 540601 875101 1066484 1134630 1008209 1082264 774765 416507 620763 731813 607545
14449 607545 743453 1279752 1827002 2150991 1936190 2049136 2000589 1831686 1679277 1675420
14439 1675420 1491675 1622973 2126823 2071588 1792512 1621044 1200630 1085152 1205311 1241479
14429 1241479 1586940 1508745 1528192 1319808 894624 734506 726435 936909 1026365 1260590
14419 1260590 1276981 1152347 1085436 1257907 1062716 1055874 1010530 1136646 1374691 1377514 1339536
14408 1339536 1222425 1394606 1436305 1318112 1540424 1697148 1408443 1233087 1357203 1257023
14398 1257023 1081878 1300830 1589271 1507699 1722307 1972562 1873520 1776844 1906778 1779683
14388 1779683 1534939 1129340 860565 998770 835669 1045891 1169814 1034262 746169
14379 746169 389717 542265 719637 1060729 735886 733547 733258 603346 702095 1100627 921895
14368 921895 716655 786917 1119629 1442237 1552848 1604109 1255342 1168469 837105 734166
14358 734166 1323504 1773010 1854038 1189819 477277 657109 1036520 1438539 1605386 1041087
14348 1041087 1166241 1449162 1376293 1236222 1262231 1061178 778800 701022 1029949 1310007
14338 1310007 1325402 1345610 1211057 1089161 1217149 942549 1059827 1171406 1062524 1634599
14328 1634599 1674084 1452736 1289176 1371695 1364479 1231221 1149780 1055790 1066427 764534 446371
14317 446371 236895 548312 1028807 1305380 1400034 1440045 1201167 1202880 1221504 1012954
14307 1012954 838127 1562934 1988626 1517800 1486615 1581888 1470701 1072151 705103 743024
14297 743024 1091443 1096593 1043880 1212768 1235384 1098653 1484947 1585693 1283354 969312
14287 969312 975110 1516981 1576954 1838204 1641590 1119375 1236886 1278522 1518256 1473844
14277 1473844 1144178 1189057 1395097 1439272 1510625 1480840 1513850 1996749 1810949 1307374
14267 1307374 994514 801432 1178779 1437377 1146087 669854 1031721 1189215 1620954
14258 1620954 1870179 1714899 1396740 1449175 1114693 1132184 1106860 1131021 1052539 1385846
14248 1385846 1600591 1695211 1606295 2248618 2317646 1909240 1810662 1736392 1786345 1740858 1748434
14237 1748434 2023969 2278157 2130198 1725142 1161291 559373 610942 1002848 1399013 1415635
14227 1415635 1425302 1238785 937109 886025 775309 832021 1435979 1591865 1390256 1395054
14217 1395054 1097778 913867 1181997 1100127 1444212 1420446 1116721 860121 689193 656234
14207 656234 756226 856610 909018 1309724 1481322 1446476 1424593 995518 967011 1184847
14197 1184847 1187895 1259419 1250312 1378022 1570453 1751955 1755136 1653839 1788754 2169011 1930885
14186 1930885 1259049 1226763 1382594 1368188 1595432 1752802 1637600 1521939 1851588 1883053
14176 1883053 1958708 1812617 1773920 1029965 620100 593437 230663 387547 956492 1148537
14166 1148537 1421250 1544655 1729236 1374453 1346789 1255453 914764 1304517 1656206 1751094
14156 1751094 1349832 1642851 1702595 1383948 1237221 1133369 1443816 1752536 1572012 1370686
14146 1370686 1323779 1461654 1629747 1560925 1878726 2538469 2476990 2072883 1532189 1446996
14136 1446996 1098864 1417220 1597364 1221995 1252556 941665 911623 1091529 1265632 1366369
14126 1366369 1292259 1576836 1838617 1783910 1703271 1528737 1378116 1364474 976942 947839
14116 947839 1098630 1083307 1054534 1136149 1205288 959177 797626 738341 372850 255017
14106 255017 677614 1118717 1388486 1572629 1623882 1605575 1254028 1016208 1040760 1348173
14096 1348173 1354019 1227435 1277564 1763137 2279963 2087542 1670083 1322913 1513845 1784296
14086 1784296 2114898 1608602 1506789 1473580 1422232 1487369 1555448 1470466 1189898 947943
14076 947943 913256 1048981 1137259 930737 835840 831949 850150 982978 1026108 1205937 1294455
14065 1294455 1267902 1276901 1422299 1736224 1668836 1632235 1346035 941529 1225928 1230003 1171135
14054 1171135 1142313 988697 1069231 1136130 1059051 1190363 1370768 1576200 1835271 1852227
14044 1852227 1896819 2105800 1763145 1180120 1275094 1661625 1555309 1572412 1810420 1642250
14034 1642250 1277631 1270696 1232669 1215531 1522683 1606349 1623034 1480347 1697580 1916526
14024 1916526 1603411 1343784 1186315 1372501 1308327 1374516 1496443 1516939 1457695 1586837
14014 1586837 1893944 1926030 1889645 1865590 2050524 2301673 1960911 1698667 1472113 1617130
14004 1617130 1893506 2024209 2022299 1585848 1747282 1875648 1622690 1241878 1357339 1323853
13994 1323853 1403752 1558940 1702470 1764315 1777979 1695910 1636086 1548042 1235910 1294619 1620343
13983 1620343 2110633 2112522 2075817 1672809 1262597 1502270 1370247 1186088 1170901 1073601
13973 1073601 1678548 1865840 1802148 1802991 1702653 1777877 1754005 1927324 2014751 2229549 2367858
13962 2367858 2282158 2421358 2281568 2306268 2555113 2312993 2046304 1467004 1585099 1392701
13952 1392701 1169972 1368319 1580159 1496521 1772350 1986131 1943277 2273580 2671752 2570009
13942 2570009 2493253 2507070 2648613 2639579 2632370 2634675 2555160 2354798 2689265 2706318 2768618
13931 2768618 3216083 3509778 3615380 3608530 3237265 2876193 2800887 2965024 3066611 2922205
13921 2922205 2933145 3072743 3439794 3311279 2940776 2637730 2814987 3303445 3341454 3344168
13911 3344168 2989358 2907043 3046364 3190671 2567573 1820871 1991719 2474301 3004960 2754521
13901 2754521 2853004 2967049 3125445 3393858 3434118 3251565 3257883 3270441 3254352 3556428
13891 3556428 3679534 3671605 3613281 3268451 3252507 3311513 3171434 3595864 3660022 3385202
13881 3385202 2750801 2929712 3006479 3016243 3051239 3009122 3444143 3522952 3035388 2797828
13871 2797828 2722209 2774734 2565766 2109124 2026613 2580968 3027746 2903625 2664864 2383206
13861 2383206 2479126 2791888 3180249 3321719 3343704 3286554 3426712 3879158 3837991 3487268
13851 3487268 3470616 3222159 3077355 3373232 3648818 3445967 3119147 3031603 3370609 3464206
13841 3464206 3052679 2981079 3022453 2877558 2777352 2779431 2771223 2641868 2668269 2519915 2312965
13830 2312965 2404180 2701201 2766945 2629921 2616197 2703779 2535944 2617901 2517922 2434184 2546906
13819 2546906 2355436 2179996 2251991 2377373 2469831 2642303 2984601 3008981 2738119 2651610
13809 2651610 2503098 2374278 2296329 1962539 1654815 1476199 1490512 1574102 1932355 1813402
13799 1813402 2183116 1913181 1791865 1737264 1801293 2299273 2450587 2638574 2564465 2538082
13789 2538082 2463755 2260039 2020488 1994133 1487684 1184962 1024932 1050060 1132503 1080512
13779 1080512 1448978 1678491 1596044 1724370 1680593 1757196 1955804 1709564 1872846 2413465
13769 2413465 2221898 1989704 1942624 1923732 2017149 1604314 1349352 1356819 1274915 1166280
13759 1166280 1527881 1263223 1242505 1113516 1075933 1483024 1298928 1685552 1580516 1630371
13749 1630371 1456588 1143567 1160994 1473548 1620630 1330410 1354786 1905222 2111767 1656543
13739 1656543 1910321 2104439 2126282 1889551 1778235 1924691 1750839 1534981 1639908 1335848
13729 1335848 1332280 1480036 1681882 1984723 1845096 1452735 1511986 1511570 1575971 1950989 2048121
13718 2048121 1684028 1767541 1804759 1554387 1602434 1364152 1447732 2037437 2096697 1797400
13708 1797400 1545410 1429758 1707448 1946256 1581317 1501245 1634324 1641731 1222050 582223
13698 582223 754031 1042473 866071 804950 1149780 1265019 1347157 1315930 1112539 1421893
13688 1421893 1801398 1988245 1888615 2047160 1800481 1685504 1613127 1195616 732660 550513
13678 550513 1236637 1526180 1625601 1971941 1743311 1557607 1563246 1878283 1520394 1204921
13668 1204921 962727 971236 871153 926192 952052 1232971 1483128 1245963 1590145 1460468
13658 1460468 1254287 1568555 1292427 1121477 1070643 1478016 1648716 1295110 1021965 1373165
13648 1373165 1881714 1772284 1309653 951977 927539 1061734 1344866 1426739 1644922 1828092
13638 1828092 1955352 1768542 1500427 1325309 1214404 955529 979783 1134401 1594371 1787492
13628 1787492 1555643 1138731 1320215 1837786 2268550 2140082 1799343 1946348 1769631
13619 1769631 1344483 1472573 2059123 2487913 2279280 1846367 1959870 1699239 1302556
13610 1302556 1388419 1540279 1491495 1466377 1600515 1946717 1917343 1796333 1761040 1804415
13600 1804415 2068139 1886602 1720023 1742944 1426213 1096956 1108387 1312009 935808 549399
13590 549399 667728 652974 837454 1232311 1570446 1767362 2143843 2024266 1852024 2145299
13580 2145299 2012800 1823573 1823871 1715305 1801725 1829362 1535606 1413214 1496653 1455990 1474583
13569 1474583 1849108 1709111 1366531 1029374 967654 814934 1090190 1059517 1036706 1278200
13559 1278200 1503751 1645224 1188402 1188461 1232407 1111330 1042034 912337 1193064 1464816
13549 1464816 1466799 1074273 885721 738177 743160 902472 1036781 1504760 1720571 1540711
13539 1540711 1515408 1494054 1899223 2215828 1723094 1436539 1621086 1405291 1096645 1627074
13529 1627074 1916174 1841735 1513868 1815821 2259076 2495408 2232930 1363268 1455779 1545648
13519 1545648 1767394 1259338 1072788 1476436 2219148 2296532 2234850 1665748 1150045 1397707
13509 1397707 1193254 975754 1206858 1223555 1557314 1562289 1394699 1205392 578170 470467
13499 470467 1013995 1277561 1316487 968660 922529 728029 508724 1036682 1237912 1539652
13489 1539652 1810957 2125514 1672540 1272948 954915 914726 770468 534598 459952 582859
13479 582859 797907 901860 947230 1060217 1292327 1319299 945798 814035 674465 765837
13469 765837 1060579 1133562 1154229 1579956 1913287 1469555 1019701 856830 613153 902808
13459 902808 1188118 845276 820294 1003834 1326493 1539369 1540525 1454026 1132412 949062
13449 949062 675982 612334 935986 537393 591436 881409 1055642 1232384 948610 909357
13439 909357 910813 768289 906126 1135722 1356621 934989 308176 196344 -50613 -4988
13429 -4988 883043 1495110 1469290 1645266 1785103 1438931 1281945 1363906 1385089 1086244
13419 1086244 1168709 1388309 1329640 1148390 1000326 934976 991382 890636 915982 1238259
13409 1238259 1289627 1015286 1415255 1542559 1155107 1122125 1264923 835988 588789 637133
13399 637133 644864 711449 1079977 1696585 1523503 1352831 1256284 904342 1118239 1207955
13389 1207955 1186628 923503 1003183 1007695 1140536 1124750 823552 797008 1317255 1920078
13379 1920078 2230989 1877282 1469742 1142968 641827 286139 565950 746569 851872
13370 851872 920837 1155669 1046063 1187725 1168039 1060861 1207302 1262433 1635277 1481974
13360 1481974 1598919 1587566 1752545 1835791 1367652 1346802 1205908 901194 1068935 1324769
13350 1324769 1195856 1249804 829972 652400 721510 1079398 961147 1103013 964648 683178
13340 683178 339442 298183 734513 1001100 1157624 922695 1134845 1538172 1533437 1317110
13330 1317110 1332511 1124446 912091 745206 706729 729405 1015933 1037160 779608 886333
13320 886333 1249455 1074895 1171984 1678891 1337219 812550 535755 517825 641745 661304
13310 661304 642009 893726 1270224 848546 433941 676541 676372 802998 1028558 1018739 777350
13299 777350 572221 948205 1536729 1921508 1735469 1502756 1851987 1534386 816695 610293
13289 610293 709091 1298237 1352009 1473058 1352125 851171 552727 570380 749486 739650
13279 739650 680801 1086927 1220500 1479218 1491580 1367621 1205301 899884 1017106 1131714
13269 1131714 875233 530791 192498 633355 908045 1072602 1262878 1568817 1321201
13260 1321201 1100129 932989 972079 1194189 995270 435707 451087 487736 695983 990267
13250 990267 824515 517525 523666 279119 -16539 -50101 -73404 304459 486577 184288
13240 184288 316174 186562 401608 531150 440065 444273 395194 268103 518572 353013
13230 353013 331346 651718 817672 639541 616081 539401 339405 598313 1256359 1606999
13220 1606999 1479962 1422628 1118975 835363 960584 1153582 976653 944143 1152071 813379
13210 813379 503799 413462 535481 723969 965796 1106069 1085701 1255971 1297047 1438044
13200 1438044 1422837 1192980 898928 898551 845103 483146 706394 1024249 763148 732886
13190 732886 688194 1019708 1230985 1167148 745030 921146 1182125 1343809 933130 733731
13180 733731 1049553 1164476 1233234 1096644 1405220 1602938 1587720 1388226 1034130 944705
13170 944705 577529 488935 563800 323211 589223 889175 971227 1204129 1214307 832742
13160 832742 589987 490062 693699 912626 880422 1040650 1333280 1061351 777698 1078470
13150 1078470 986314 1146822 1020588 532137 616715 752304 705175 806890 889666 805476
13140 805476 716786 691585 331803 118052 115924 181403 -143167 162124 409184 470223 694795
13129 694795 1095460 963244 992244 897074 866312 981258 1103524 1098643 1085198 838785 1013936
13118 1013936 1318873 1251515 777289 868274 800992 616449 780718 950221 867345 886230
13108 886230 1113422 1453925 1090591 721418 801536 465935 661054 645646 595381 448870
13098 448870 304734 178719 393739 164026 73098 -30560 315695 274634 -23281 51486
13088 51486 162754 226784 265834 121460 251719 825698 795475 497938 77807 301147
13078 301147 503864 1117655 1300934 1574133 1368272 968267 702333 856352 910233 905301
13068 905301 449738 143563 452318 659271 591106 937891 1223545 963588 289539 64512
13058 64512 261524 716849 1099935 731456 720309 1131172 812366 167647 329149 727168
13048 727168 659832 579600 711141 793338 1102411 1138832 949714 784143 848704 919229 719737
13037 719737 483004 598058 1042098 1418449 1582977 1117435 821747 581616 926794 1037275
13027 1037275 720642 898212 942398 714825 779241 853494 526631 612400 666208 1002729
13017 1002729 832127 826498 1024623 834434 533951 274787 323069 765164 747183 889983
13007 889983 1113439 978027 547306 266171 562856 785630 677521 646950 281608 188200
12997 188200 575821 439202 284497 442947 1047503 1061039 394980 450670 921362 956491
12987 956491 717395 607202 616442 473996 706200 575350 113533 311724 116152 290476
12977 290476 571428 729302 942639 1113493 1424525 1282139 601295 264562 294892 557629
12967 557629 897544 992812 1085500 830271 499420 550342 220295 199582 739675 752529
12957 752529 470600 551509 502622 237964 145434 422325 234956 329811 515758 294114
12947 294114 414445 870618 1298291 1191013 843967 641493 852185 992410 1201098 1187245
12937 1187245 961383 1259236 1540555 981178 544524 898446 1276283 1152282 510445
12928 510445 291655 425280 159058 87563 -88448 -139039 52956 -122220 -26457 197493
12918 197493 170124 388942 591915 348877 863164 619478 268765 -162592 -74849 239697
12908 239697 474985 683927 556200 405372 384304 109264 -370752 -113451 107948 4643
12898 4643 351085 66690 -120256 -311346 -425187 -326436 209179 261815 -358410 -487593
12888 -487593 -130140 159093 581568 971414 964213 815316 450291 160999 839572 1363095
12878 1363095 1239730 1083283 724330 752053 602221 601756 299918 60041 -119322 101575
12868 101575 259588 260282 387877 396329 477635 217496 -76550 -353463 -307598 -298176 -73502
12857 -73502 76545 -56742 140844 135853 -334882 -402908 -133187 -39552 -13568 -353394 -37064
12846 -37064 -66760 111305 251091 245652 395462 447545 421531 333574 472359 316231 114328
12835 114328 261233 526058 540668 272652 386724 344968 211790 150737 -144198 -567076
12825 -567076 -128307 95428 98110 43089 -88174 -291863 -634899 -268313 -38918 -335529
12815 -335529 -351498 127232 71115 -126833 -239022 -167015 -378779 -463034 -183521 325555
12805 325555 676829 433401 -17566 89779 255336 166476 117900 28223 -32531 -249019
12795 -249019 -99802 -204938 -35581 -120565 -277515 -332939 -334093 -427516 -404576 -166999 -10960
12784 -10960 65735 161954 127407 253145 585621 201368 -205917 -162650 -160204 -2307 -249299
12773 -249299 236286 538592 445598 526860 715382 956701 853781 659828 523206 288293
12763 288293 204192 452839 678092 1095197 1176419 730289 540923 421944 173412 392761
12753 392761 107684 -94888 60418 318917 262500 50549 -251153 -135791 275677 608477
12743 608477 770629 927775 640873 -40867 -76823 109210 145986 397708 271018 93772
12733 93772 6827 25258 191042 374160 964828 1117653 818147 436707 255779 511733
12723 511733 653972 1024808 932822 953770 730867 1104016 1713001 2078397 1744710 1482614
12713 1482614 1634543 1606002 1642085 1962749 1834147 1634526 1568724 1383368 1302767 1200862
12703 1200862 461834 210487 473282 617603 610555 331573 572466 423512 329238 673645
12693 673645 1016799 827002 755802 799016 962413 1467671 1359600 1310991 1309115 1663464
12683 1663464 1573459 2017459 2842096 3683101 4963632 6765502 8446223 9502636 10467030
12674 10467030 10948121 10507201 9539383 7876430 6528866 5791231 4949392 4128832 3616046
12665 3616046 2904128 2568975 2740614 2819841 2922643 2997404 2860324 2336140 2091240 1826332
12655 1826332 1627873 2013798 2296078 2573425 2761661 2898203 2966608 3668111 3729680 3841136
12645 3841136 4677863 5638503 7053458 9109232 11553700 14686718 18284986 21545714
12637 21545714 23471614 24805012 25503656 24790780 21984006 18174922 15324323 12829857
12629 12829857 10634244 8847434 7967928 7424412 6776193 6213774 6349599 6139946 5794334
12620 5794334 5297511 4765545 4123733 4135354 4353646 4530950 4567892 4415410 4878223 5560997
12610 5560997 5844056 6053875 6659369 7885021 8490080 9435912 11431874 14496776 18165967
12601 18165967 23282272 28059079 31986937 34353855 35945670 36094925 33850604 29500511
12593 29500511 24333432 20062203 16708407 14472494 12984507 11736592 10859856 9887267
12585 9887267 8784678 8303943 8467760 7978935 7132421 6844235 7014626 6544521 6293770
12576 6293770 5815289 5728792 5776095 5935171 5782710 6234018 6802728 7062519 7486365 8413003
12566 8413003 10091482 11941313 14405393 17403733 20736051 23771204 26502829 28484711
12558 28484711 29532573 29108223 26627728 22778222 19732885 16454966 13635335 11805990
12550 11805990 10697047 9732630 8752040 8218865 7650037 7084985 6920421 6829078 6291613
12541 6291613 5880589 5505714 5174608 4796208 4305264 4180195 4439220 4927989 5396328
12532 5396328 5360298 5336881 5418368 5683129 5791456 6200821 6889167 8299478 9943082 11477170
12522 11477170 12625828 13266544 13563896 13754734 13302781 12027355 10718138 9381505 8069501
12513 8069501 6983189 5988346 5672202 5124961 4747455 4715667 4405637 4373857 4196874 4113819
12503 4113819 4031068 4103997 3558566 3079938 2855061 2596762 2346383 2155245 1940327 2054192
12493 2054192 2343271 2166290 2511672 2726769 2875990 2880739 2853628 3382150 4122856 4328403
12483 4328403 4807044 5250497 4394793 4108185 3877504 3583634 3284404 2803777 2248153
12474 2248153 2603107 2852928 2755720 2547191 2490231 2272689 2600191 2682214 2490678 2364845
12464 2364845 2023585 1551248 1396693 1473657 1320560 1397968 1604061 1447789 1201861 1239721
12454 1239721 1665291 1582693 1442271 1042601 869594 363128 559479 855394 837195 824529
12444 824529 996819 764275 616984 712149 1091178 1200466 1149533 640615 663167 722923
12434 722923 811402 1102875 688007 662456 577385 283619 357462 452923 408401 409304 341388
12423 341388 862947 671170 553668 653049 418977 550483 846514 669955 280048 340308
12413 340308 339824 261320 -240454 -460807 -515409 -54015 293337 472994 240225 -133919
12403 -133919 172762 302025 133788 -338713 -209736 11799 161107 226221 252188 223682
12393 223682 92633 460205 652189 336235 193867 357314 855459 841080 446988 65151
12383 65151 144856 389449 302420 -26189 -327039 -319813 358773 167538 -484166 -650102
12373 -650102 -134827 59566 417533 760944 1064189 1201350 1066978 705083 544143 304853
12363 304853 247135 -50256 92569 596958 604859 155842 -195748 -182714 110261 -26407
12353 -26407 114943 204411 -75040 -17396 -100815 -74124 63720 152794 246700 36944 142097
12342 142097 305298 -192432 -20681 533773 908971 607261 223056 -197163 -198182 10893
12332 10893 225282 276378 150407 -253385 -65422 -57733 -146460 -235201 -269727 -418692 -761405
12321 -761405 -169065 396455 398559 87453 -41992 460535 801383 234735 -142316 -326825
12311 -326825 -573002 -462205 -181286 67151 -4155 -23982 -121070 56793 207645 308008
12301 308008 301686 344756 619100 802396 570547 448202 160578 -94874 -519800 -695652
12291 -695652 -713266 -154720 186802 -209487 -394493 -792748 -1111199 -683243 -549993 -476572
12281 -476572 -437439 -15081 -187400 -349834 -177531 -83457 -103558 -312347 -592990 -732181
12271 -732181 -733541 -421592 -328111 -384011 -603156 -835018 -724634 -629084 -868527 -681726
12261 -681726 -600073 -786216 -603863 -390565 -556509 -541235 -549114 -880188 -1274428 -1174845
12251 -1174845 -618242 -372759 -597843 -876978 -468055 -190704 58421 373743 -33736
12242 -33736 -169928 -601914 -1020364 -1113435 -808500 -812449 -422866 67302 -23754 -474239
12232 -474239 -690454 -753901 -398720 -303509 -226058 -503260 -784196 -169230 -352496 -805849
12222 -805849 -994616 -1206837 -660074 -387205 -483658 -380305 -549000 -543671 -504573 -422038
12212 -422038 -524417 -788034 -795663 -905533 -997447 -847560 -655191 -365998 -573751 -449551
12202 -449551 -247054 -485074 -412142 -107648 -273738 -380175 -541418 -693183 -534494 -740663
12192 -740663 -906010 -1443994 -1510158 -993621 -770151 -741534 -709950 -642956 -654073 -808656
12182 -808656 -707273 -793201 -1049014 -986948 -497994 -453973 -608337 -372643 -609012 -572243
12172 -572243 -116375 88231 -720014 -1269623 -1468902 -1125306 -1041106 -1137701 -903621 -697569
12162 -697569 -480224 -710116 -501572 -497888 -795557 -657507 -683174 -405709 -392228 -594839
12152 -594839 -67173 -154111 -259394 -511417 -221010 -485007 -874575 -970075 -732054 -748152
12142 -748152 -551722 -298299 -324749 -661759 -480966 -1010563 -1083317 -777536 -730937 -685204
12132 -685204 -870288 -961802 -1157232 -1079296 -1140850 -1155245 -919531 -669620 -538469 -673415
12122 -673415 -538836 -483659 -479963 -705946 -777892 -684267 -575481 -457830 -292515 -515115
12112 -515115 -969850 -959102 -529332 -158852 -410925 -770238 -582547 -685086 -684041 -942453
12102 -942453 -1203695 -860925 -884547 -1117278 -1204951 -1180343 -1179411 -973135 -910311 -656871 -414014
12091 -414014 -259088 -113103 463274 418710 -225044 -706614 -637995 -1032643 -1030037 -891925
12081 -891925 -810351 -542501 -985990 -1131582 -855754 -395165 -517275 -475547 -552348 -773251
12071 -773251 -870113 -628995 -511370 -706505 -834835 -890220 -397021 -232163 -346799 -111441
12061 -111441 166744 235492 7341 -287489 -344641 103518 292798 -162072 -547379 -249368
12051 -249368 -331433 -730105 -929209 -864465 -846641 -1096479 -1109704 -1054764 -1221520 -1006331
12041 -1006331 -644053 -430878 -826544 -681133 -281808 -445503 -1075868 -1102818 -977500 -1052097
12031 -1052097 -1020246 -617273 -674263 -689403 -833670 -941249 -616027 -351879 -129103 88659
12021 88659 -96041 -391493 -395070 -870204 -1088364 -1176955 -618539 -52256 71775 -365332
12011 -365332 -815227 -1122776 -1017346 -407654 -25212 -539790 -836093 -378773 37457 -98090
12001 -98090 -399066 -742935 -805506 -896660 -763448 -756051 -719589 -542956 -943593 -786822 -756566
11990 -756566 -655021 -644521 -847576 -546768 -412294 -495525 -330503 -358177 88808 690767
11980 690767 846050 770165 898920 912010 760602 790685 813023 473060 214330 459344
11970 459344 574450 232104 -76322 -278401 -507983 -316174 84266 -137471 -465068 -719398
11960 -719398 -996610 -1362400 -1048497 -692503 -477502 -577738 -402075 -588519 -432295 -562306
11950 -562306 -773381 -596028 -67248 -96841 -113492 -3619 -296566 -403103 -402793 -143033
11940 -143033 202767 603473 600708 870442 1042924 926478 915532 771001 799498 732236
11930 732236 287235 -48737 -59918 -152631 235682 214021 -21659 -234311 -493221 -311407
11920 -311407 -243396 -712703 -1430900 -1169773 -853128 -622813 -817549 -609901 -226430 -206971
11910 -206971 -466610 -494927 -45231 -123749 -238465 -202285 -37458 -112789 16100 -162016
11900 -162016 -183434 264443 255655 -187797 -44891 120986 67897 109268 55201 162284 -260502
11889 -260502 -188344 -330179 -723480 -528222 -577911 -741540 -984224 -734217 -881981 -908647
11879 -908647 -989566 -1211023 -1330139 -1209335 -952195 -721595 -480880 -385177 -692017 -884844
11869 -884844 -764266 -741966 -336193 -155221 -543194 -447664 -288793 -358537 -29139 1866
11859 1866 -30026 -290497 -502627 -587835 -469573 -542953 -322605 -470576 -796408 -601138
11849 -601138 -197186 -74854 -70490 -371363 -781504 -895884 -1076836 -804345 -611462 -425578
11839 -425578 -548433 -718450 -830707 -1084189 -799482 -701712 -815749 -1004230 -1294474 -1391636
11829 -1391636 -1569119 -1683785 -1419228 -1570288 -1685611 -1569769 -1290507 -1430716 -1192631
11820 -1192631 -583066 -609641 -873801 -1142585 -1265731 -1191576 -1266048 -603834 -112636 -237244
11810 -237244 -526155 -366507 -15947 -198566 -569575 -753640 -1278902 -1846036 -1879338 -1821763
11800 -1821763 -1749410 -1713921 -1594714 -1262171 -779223 -763943 -555027 -623831 -795296 -696516
11790 -696516 -735070 -568212 -673020 -973320 -1186432 -1418257 -1810915 -1588247 -1112957 -780073
11780 -780073 -768644 -360698 -753717 -1196368 -1159106 -767739 -683549 -617932 -546701 -992723
11770 -992723 -1258316 -1634652 -1396053 -1269671 -1057219 -1202116 -1399592 -1301979 -1294232 -1084019
11760 -1084019 -1412489 -1802519 -1830599 -1750398 -1393736 -1162200 -1422162 -1513207 -1473172 -1577177
11750 -1577177 -1802222 -2192098 -2269243 -1875975 -2123589 -2010357 -1936242 -1837005 -1798673 -2027859
11740 -2027859 -2017405 -2052287 -2106091 -2220998 -1919856 -1629081 -1248402 -1278647 -1213587 -1447208
11730 -1447208 -1293279 -1327106 -1324177 -1196348 -1298972 -1628306 -1339007 -924127 -1112787 -1245276
11720 -1245276 -1285647 -917998 -728176 -817270 -1374391 -1579988 -1397419 -1243312 -817261 -942214
11710 -942214 -1030580 -1167766 -1091838 -1186840 -1481206 -1090829 -497010 -608839 -437329 -493836
11700 -493836 -893991 -854674 -1252195 -1430143 -1478728 -1279652 -1466933 -1755091 -1264910 -1022689
11690 -1022689 -1209279 -1865473 -1912495 -1455876 -1197077 -1209289 -1032177 -778991 -898538 -1328525
11680 -1328525 -1232096 -1039641 -688377 -1097412 -1060382 -791077 -902205 -1303139 -1562631 -1744481
11670 -1744481 -1767447 -1511427 -1541821 -1776351 -1857892 -1513631 -1408535 -1230031 -1230610 -1158664 -843315
11659 -843315 -673261 -715338 -1230586 -1286693 -1134932 -1696113 -1981863 -1564026 -1740855 -2173878
11649 -2173878 -1866954 -1624004 -1572534 -1308221 -1266746 -1022945 -674431 -425353 -446152 -830993
11639 -830993 -884319 -1075519 -848852 -868309 -1395982 -1622879 -1535429 -1419186 -995393 -1022874
11629 -1022874 -1234390 -1315080 -1201572 -1167010 -1259817 -1365513 -1620702 -2034965 -1990094 -1839986
11619 -1839986 -1848183 -1850531 -1439091 -1534236 -1484982 -1465912 -1618047 -1431235 -1378451 -1438167 -1204431
11608 -1204431 -1323482 -1923411 -1736576 -1393650 -1138068 -1195458 -1456582 -1086241 -630313 -775392
11598 -775392 -1372786 -1686673 -1709732 -1634498 -1515428 -978969 -1232144 -1351364 -1429314 -1318959
11588 -1318959 -1592301 -1265928 -856443 -1369766 -1569163 -1609989 -1615522 -1651070 -1445374 -1524310
11578 -1524310 -1600955 -1654494 -1237083 -801061 -1024263 -1607860 -1601482 -1556424 -1677960 -1924249
11568 -1924249 -2210610 -1915915 -2153227 -2205090 -1866639 -1697071 -1869599 -1848356 -1571235 -1407024
11558 -1407024 -1383012 -1528385 -1906665 -1907456 -1804466 -1716857 -1257154 -1222428 -1239382 -1227349 -1292420
11547 -1292420 -1637805 -1680125 -978147 -460260 -766001 -765194 -1094499 -1842268 -2229153 -2128893
11537 -2128893 -1360023 -779004 -1089898 -1590703 -1528545 -1764484 -1471030 -1292626 -1438171 -1241358
11527 -1241358 -1420621 -1756436 -1994104 -2065399 -1872736 -1432064 -1719774 -1676757 -1730827 -1661778
11517 -1661778 -1706982 -1824004 -1457013 -1288475 -1340731 -1137255 -1000158 -1220083 -1027214 -1001488
11507 -1001488 -1697557 -1776893 -1441792 -1157519 -1508436 -1566776 -1933162 -1954858 -1852185 -1938645
11497 -1938645 -1671136 -1431093 -1039021 -969884 -865277 -701367 -687392 -1069182 -1364319 -1413325
11487 -1413325 -1452942 -1508763 -1479190 -1631006 -1717531 -1748104 -2038065 -1970705 -1685239 -1728862 -1671260
11476 -1671260 -1620718 -1500770 -1263593 -1192896 -1522922 -1451332 -1213370 -1318389 -1712234 -1945615
11466 -1945615 -2255568 -2269816 -1939863 -1849052 -1938087 -1914487 -1722895 -1759815 -1585653 -1384850
11456 -1384850 -1492963 -1648911 -1598366 -1374175 -1380701 -1666371 -1485812 -1109737 -1097894 -1538606
11446 -1538606 -1616038 -1465475 -1254801 -1144424 -970638 -967902 -561662 -513007 -856588 -1302959
11436 -1302959 -1847458 -2376115 -2375475 -2720617 -2312366 -2044709 -1915389 -1516927 -1234003 -1382791
11426 -1382791 -1211634 -1107402 -1158637 -1428528 -1526090 -1650220 -1314847 -1274731 -1396347 -1496143
11416 -1496143 -949337 -611256 -908669 -1085945 -981310 -1015885 -1033445 -1362548 -1425690 -1408884
11406 -1408884 -1723951 -1414075 -1535676 -1575240 -1179229 -1121373 -951789 -1280983 -1498269 -1444351
11396 -1444351 -1260760 -1199056 -1513585 -1342583 -990569 -1363209 -1184311 -1525987 -1690286 -1779023
11386 -1779023 -1777199 -1648300 -1707637 -1481615 -1283029 -1484823 -1541130 -1561220 -1516038 -1519680 -1498394
11375 -1498394 -1170334 -1169110 -1348355 -1237319 -1192377 -1525741 -1836048 -1872919 -1476389 -1573966
11365 -1573966 -1378107 -883884 -1077962 -1286024 -1296450 -1537409 -1544760 -1775605 -1717886 -1512060
11355 -1512060 -1430735 -1395499 -1275520 -1328464 -1215911 -1258152 -1518580 -1106100 -1249163 -1399344
11345 -1399344 -1191039 -1355035 -1199429 -1611343 -1684203 -1755814 -1623725 -1717563 -1774111 -1719778
11335 -1719778 -1497317 -1206583 -1154703 -1374842 -1260676 -1383321 -1184173 -1466279 -1627064 -1911171
11325 -1911171 -1895035 -1727890 -1844016 -1688635 -1650021 -1751966 -2178667 -2153326 -1877983 -1895560
11315 -1895560 -2003401 -2344474 -1936373 -1859045 -2110560 -2280302 -1928346 -1954896 -1984165 -1515099
11305 -1515099 -1527594 -1718885 -1477694 -1451133 -1363809 -1351275 -1471093 -1895767 -1794981 -2084230
11295 -2084230 -1942103 -1743806 -1625639 -1722277 -1777325 -1969485 -1970234 -2006008 -1846106 -1884160 -1459635
11284 -1459635 -1629784 -1417913 -1261495 -1681095 -1816490 -2125729 -2285106 -2309616 -2102472 -2151897
11274 -2151897 -1820275 -1602910 -1267844 -1596334 -2027038 -2102993 -1932359 -1615674 -1753940 -1925789
11264 -1925789 -2052058 -1870672 -1835412 -1979520 -2142267 -1957427 -1837604 -2062283 -2146609 -1794498
11254 -1794498 -1862639 -1433270 -1367370 -1385402 -1303120 -1220037 -1227051 -1427970 -1389919 -1641260 -1782134
11243 -1782134 -1611681 -1411322 -1668999 -1774412 -1590276 -2064731 -1984783 -1930269 -1551690 -1474972
11233 -1474972 -2043824 -2198033 -1843868 -1491377 -1341100 -1466389 -1694870 -1827391 -1916518 -1984845
11223 -1984845 -1474658 -1641763 -1685264 -1735220 -1770442 -1741101 -1380538 -1410073 -1734059 -1822105
11213 -1822105 -1958410 -1706312 -1564580 -1599854 -1545038 -1582777 -2094299 -2308752 -2379081 -1983569
11203 -1983569 -1637357 -1497370 -1805169 -2155349 -2197372 -2220405 -1912138 -1442636 -1054246 -1208024
11193 -1208024 -1862898 -2082560 -2137717 -1814371 -1630439 -1288655 -1509077 -1563382 -1153029 -1492994
11183 -1492994 -2007234 -2134930 -1924606 -1932870 -1892848 -1927999 -1870833 -2038510 -1788678 -1581778
11173 -1581778 -1435948 -1541977 -1789028 -1936083 -2395776 -2486376 -2145277 -1926781 -1895235 -1554512
11163 -1554512 -1104795 -1209388 -1415572 -1562641 -1890041 -1997181 -1818109 -1433343 -1573516
11154 -1573516 -2272215 -2406566 -2188036 -1814729 -1153368 -1612664 -1930012 -2002574 -2297532 -2163500
11144 -2163500 -1794332 -2024616 -2078331 -2106828 -2208280 -1866133 -1777430 -1588687 -1713407 -1746076
11134 -1746076 -1586345 -1613858 -1680246 -1932902 -2536975 -2575589 -2359361 -2441914 -2261003 -2002968
11124 -2002968 -2080473 -2077281 -1947531 -2278247 -1937768 -1311219 -1546148 -1605033 -2027094 -2445883
11114 -2445883 -2478698 -2252301 -2369094 -2014611 -2229543 -2309727 -2137951 -2134598 -2197494 -2124014
11104 -2124014 -1957726 -1829208 -1910827 -1976320 -1617439 -1614047 -1976196 -2102060 -1900035 -1860513
11094 -1860513 -1586548 -1541259 -1722328 -1765863 -2092251 -2291144 -2198153 -2038110 -1570925 -1317917
11084 -1317917 -1518823 -1299339 -1324888 -1386808 -1444810 -1726930 -1973524 -2489877 -2696136 -2626216
11074 -2626216 -2725725 -2612689 -1758136 -1475805 -1864350 -1856748 -1924751 -2067511 -2203766 -2250970
11064 -2250970 -2043424 -2068132 -2156886 -2439543 -2710837 -2660647 -2151612 -1741303 -1501324 -1736604
11054 -1736604 -1616697 -1422404 -1571303 -1508465 -1717624 -1835677 -1761066 -1609623 -1273221 -1431173
11044 -1431173 -1190484 -846346 -830829 -1138593 -1483977 -1240467 -1408738 -1223014 -1510536 -1313842
11034 -1313842 -850594 -780142 -890044 -767076 -551370 -568968 -692937 -627401 -735865 -516201
11024 -516201 -73605 564941 685137 631889 631882 861557 1224718 1497213 1098716 565086 247345
11013 247345 -376856 -741634 -911548 -1061283 -547895 -378344 -337747 -465264 -538587 -574562
11003 -574562 -460638 -605751 -714743 -820542 -1098046 -1008477 -736396 -653614 -988779 -834140
10993 -834140 -779761 -760342 -931118 -1143555 -1140316 -1312910 -1727929 -1844234 -1653059 -1426856
10983 -1426856 -1402866 -1455306 -1770032 -2068509 -1434467 -1216433 -1150098 -1254217 -1357693 -1605745
10973 -1605745 -1628768 -1606741 -1376645 -1740845 -2109101 -2268878 -2039522 -1917597 -1561627 -1523965
10963 -1523965 -1842936 -1554130 -1580963 -1969650 -2380280 -2189479 -1810939 -2052418 -2495124 -2681347
10953 -2681347 -2683621 -2495793 -2188853 -2306415 -2544030 -2741677 -2905282 -2738416 -2029189 -1519172
10943 -1519172 -1528162 -1650937 -2182069 -2129211 -2317029 -2674733 -2237372 -1926246 -2307926 -2301389
10933 -2301389 -2386988 -2549086 -2557800 -2357069 -2213993 -1975500 -1619012 -1325834 -1279735 -1198855
10923 -1198855 -1585287 -2058519 -2108327 -2203478 -2406961 -2105580 -1898644 -2426221 -2877611 -2544635
10913 -2544635 -2137852 -1823720 -2141978 -2328456 -2182108 -2411226 -2597900 -2543831 -2183842 -2478896
10903 -2478896 -2736629 -2858125 -3018886 -2992211 -2211564 -2114902 -2230884 -2159348 -2257762 -2448377
10893 -2448377 -2340952 -2338715 -2351929 -2320870 -2397188 -2215189 -2140537 -1874627 -1840352 -2073044 -2335321
10882 -2335321 -2027353 -2219021 -2018825 -1895467 -1699806 -1702911 -1819618 -2010654 -1896040 -2118097
10872 -2118097 -2505616 -2080651 -1923080 -2148469 -2124464 -2419593 -2530530 -2219870 -2126241 -2472940
10862 -2472940 -2767416 -2513429 -2597817 -3028939 -3182452 -3064086 -2854861 -2470577 -2336373 -2350992
10852 -2350992 -2490332 -2319469 -2579085 -2543968 -2528679 -2469317 -2345828 -2655056 -3014527 -2992001
10842 -2992001 -2708608 -2395226 -2055438 -1903476 -1798767 -1750920 -2184745 -2513819 -2208518 -1918785
10832 -1918785 -2011706 -1919565 -1632652 -1930881 -2051032 -2468230 -2895925 -3378551 -3431721 -3296454
10822 -3296454 -2854658 -2714288 -2682468 -2595534 -2599464 -2712758 -3190279 -3483206 -3605245 -3463679
10812 -3463679 -3574011 -3696297 -3653478 -3492890 -3423181 -2831075 -2591333 -2787332 -2358697 -2105290
10802 -2105290 -2389624 -2405735 -2839821 -2987759 -2860133 -2977463 -2906803 -2867371 -3013089 -2908261
10792 -2908261 -3091801 -3190708 -3357739 -3610692 -3335208 -2853868 -2764782 -2685810 -2954197 -3265912
10782 -3265912 -3468036 -3277740 -3005421 -3034842 -3133890 -2694091 -2786985 -3323192 -3585399 -3193757
10772 -3193757 -2696574 -3099953 -3326950 -3317438 -3627101 -3915258 -3671128 -3984606 -4153544 -4092608
10762 -4092608 -3876182 -3795901 -3499081 -2905044 -3103083 -3610252 -4129344 -4096318 -4082425 -4085670
10752 -4085670 -3388935 -3146307 -3345539 -3494274 -2701547 -2421392 -3216005 -3191316 -2918576 -2855024
10742 -2855024 -2435632 -2280541 -2563166 -2758737 -3003751 -2756760 -2766645 -2652867 -2934854 -2838531
10732 -2838531 -2920242 -2719034 -2348061 -1897121 -1666953 -1547963 -1197672 -864264 -707615 -227909
10722 -227909 19753 -492012 -751906 -625433 -256691 -118113 -312019 -454221 -511881 -632708
10712 -632708 -442430 -613208 -672170 -274256 136502 313455 82084 -49630 -194567 -668938
10702 -668938 -719148 -611787 -715347 -760983 -318548 29160 -263693 -198658 -96810 -191344
10692 -191344 -779819 -864234 -1092998 -1346084 -1462872 -1776218 -1893516 -1345094 -846656 -1206868
10682 -1206868 -1605451 -1713238 -2014255 -2306349 -2586653 -2392061 -2328809 -2193023 -2246104 -2283807
10672 -2283807 -2235441 -2479943 -2366301 -2110331 -1902551 -2072840 -2410774 -2531908 -2452033 -2206700
10662 -2206700 -2467166 -2749050 -2561036 -2092618 -1755545 -2117826 -2114057 -1652994 -1089284 -798239
10652 -798239 -698077 -1000367 -1225452 -1092139 -964338 -1396864 -1638054 -1505192 -1627701 -1679968
10642 -1679968 -1549715 -1436841 -1652794 -1428118 -1119546 -242838 509245 1043561 1913554
10633 1913554 2753221 3792005 4648354 6155932 7108805 8088352 9384792 10372775 11928435
10624 11928435 14885642 19191856 24192702 30525206 39130759 50127317 64104364 80475149
10616 80475149 97477765 113946115 128658035 141339685 150859994 155703294 157275501
10609 157275501 160028942 167778759 182555693 204493017 232448660 262164969 290115079
10602 290115079 313984769 331516282 340053551 337160296 326403378 316995259 315975064
10595 315975064 327196783 351362111 384002223 418511485 448172157 470272731 482045051
10588 482045051 478546485 457018588 424236977 391782094 368857503 358816740 360704634
10581 360704634 370173568 381893590 391026090 394955873 392007220 378328353 353344743
10574 353344743 321912897 291869361 269389062 254836103 247073843 243168560 240935511
10567 240935511 237980637 232866835 224367813 211733253 195260613 176201661 157516685
10560 157516685 141824902 129161208 118606092 110200796 103585694 97360141 92092327
10553 92092327 88215775 84207948 80674454 77557648 74670371 72137421 69104038 67042915
10545 67042915 65508144 63696166 61659469 59908560 57947963 56233641 54740853 53626640
10537 53626640 52182490 50629643 48981350 47540284 46609165 45436845 44060891 43282813
10529 43282813 42398379 41414745 40625916 40383467 39678832 38727297 37418267 36382042 35332957
10520 35332957 34329799 33558804 32434845 31339503 30576648 30055205 29663929 29368036 29412915
10511 29412915 28846301 28273519 27541918 26697286 26052256 25720446 25501848 25001595 24466710
10502 24466710 24113602 24330868 23810331 23035856 22561885 22200413 21877885 21861667 21476449
10493 21476449 21315885 20828172 20643253 20387359 20273243 19555109 19118043 18689971 18056312
10484 18056312 17796227 17573475 17469738 17223112 17235985 17551549 17507612 17105666 16846091 16961042
10474 16961042 17041185 16429356 16406509 16421183 16087282 16073139 15639565 15589112 15486988 15314407
10464 15314407 15556940 15496590 15600382 15742323 15153270 14258740 13814867 13585274 13572452 13478076
10454 13478076 13288283 13014325 13056830 13168137 13067770 12755545 12356443 12080199 11934081
10445 11934081 11428975 11369864 11440097 11354781 11191329 10981915 10939315 10589346 10589548 10498742 9886860
10434 9886860 9650108 9843587 9701658 9414096 9029755 8613086 8142489 7992966 7963633 8000804
10424 8000804 8280808 8433584 8389536 8204465 7899654 7559161 7465958 7380576 7686865 7623390
10414 7623390 7496137 7158754 7105356 7006495 6747108 6471086 6485245 6235165 6033687 6065179
10404 6065179 5917673 5609876 5652758 5413295 5218195 5562833 5356154 5320302 5408043 5247936
10394 5247936 4919443 4994020 4867567 4822744 5056092 4656026 4143655 4271395 4419619 4534491
10384 4534491 4386217 4464912 4408963 4402860 4361786 4147669 4094428 3911412 4070043 4000873 4025783
10373 4025783 3811627 3783323 3730712 3586321 3583107 3449437 3155521 3395130 3604886 3518462
10363 3518462 3253160 3265183 3665405 3686091 3766432 3883063 3560775 3441399 3033890 2905827
10353 2905827 2820815 2656517 2899769 3076169 3336326 3382515 3170730 2977159 2880151 2823286
10343 2823286 3197407 3448415 3318027 2680293 2885738 2898665 2592970 2372734 2885660 3212494
10333 3212494 2962698 2550869 2208589 2276793 2574345 2687909 2303280 1885434 1966624 2234573
10323 2234573 2061819 1546542 1357966 1383128 1492670 1594226 1756541 1922266 1678396 1707375
10313 1707375 1662929 1275299 1525171 1765239 2020955 1865209 1612680 1554449 1765692 1978781
10303 1978781 1924538 2128281 2181337 1812946 1414169 1272962 1233184 1137503 1296814 1527132
10293 1527132 1057161 1356200 1230622 948458 1132438 1083475 1195110 1081130 1038350 1072043
10283 1072043 1414023 1492692 1101728 770700 731016 1229168 1426130 1189305 897609 1134645
10273 1134645 667984 854020 925467 611196 326348 50890 120338 84170 424081 751709
10263 751709 705773 366429 192580 353624 230922 55037 -304135 -413530 213178 758650
10253 758650 419921 152910 294609 675426 515521 322927 250678 417770 263343 156675
10243 156675 225791 20122 -115820 -275251 -432724 -754136 -426233 148154 204787 18651
10233 18651 -271900 -523355 -220766 -163030 -202268 97411 204657 -268035 -193758 -94876
10223 -94876 -160876 -485798 -837142 -539899 -135461 135016 -83039 -480808 -364299 169140
10213 169140 294504 23621 -458214 -477005 -123956 24495 -172119 114912 291306 301690
10203 301690 453168 214180 66285 115774 162877 530912 682000 558116 270362 -98231
10193 -98231 -24111 -75469 -175177 187579 -15815 -566113 -402488 138820 221950 -162370
10183 -162370 -161321 23867 378249 704384 835554 833069 1200306 1231510 795859 867336 1022427
10172 1022427 1390254 1304258 1120930 1289612 1561459 1659660 1775990 1535223 1044076 927964
10162 927964 1201488 1269470 1106966 719002 855202 1587569 2080372 1962512 2086476 1979583
10152 1979583 2108159 2595223 2407360 2325888 2162718 2306388 2675818 2924285 3159106 3075444
10142 3075444 2852929 2532889 1946239 1273072 1199816 1346075 1654089 1625092 1474004 1204968
10132 1204968 752768 588352 442547 158668 219461 248575 148727 -149802 -244805 141750
10122 141750 382203 362692 277227 217148 -155967 -209136 -124548 -29990 103596 255368 187225
10111 187225 180807 21382 86257 290078 201472 495491 581670 538309 523495 257805 28896
10100 28896 -361364 -360690 47860 184237 59542 -150910 -263856 -486998 -699950 -643182
10090 -643182 -745292 -792243 -967264 -514049 -411924 -570010 -417937 -235860 315659 572763
10080 572763 296046 354409 -229119 -763730 -488664 -253753 -773128 -929730 -616327 -203396
10070 -203396 -609 -156207 -402669 -329218 -322826 -65751 -369283 -225840 -569588 -767926
10060 -767926 -780636 -798414 -717913 -680211 -438442 -593352 -1042862 -1380841 -961280 -427724
10050 -427724 -46363 158790 11072 -205802 -18866 81175 -476208 -1176917 -1228419 -508678
10040 -508678 -371223 -437628 -139574 -437954 -585617 -352864 -349219 -561931 -64037 -147745
10030 -147745 -621510 -442053 -275302 -35354 -434303 -818281 -605009 -650343 -845464 -848789
10020 -848789 -1096732 -1104711 -937928 -971484 -983442 -981503 -800555 -590975 -897378 -1053066 -1039219
10009 -1039219 -794910 -613820 -738237 -799510 -571286 -499003 -790640 -1089998 -807192 -938071
9999 -938071 -808880 -851569 -646376 -589669 -639468 -450881 -241797 -531186 -814260 -613872
9989 -613872 -176312 51708 -328031 -589449 -417001 -805106 -767848 -983425 -1192603 -873430
9979 -873430 -656350 -684544 -375910 91145 -9149 -517488 -563389 -639179 -902953 -1039170
9969 -1039170 -922560 -570892 -86257 -60628 -497527 -765318 -504154 -469567 -808765 -543176
9959 -543176 -679098 -704534 -547971 -580199 -868193 -655227 -759345 -585551 -473944 -414154
9949 -414154 -579667 -581781 -567272 -473348 -368844 -464317 -740100 -540590 -749562 -469518 -660588
9938 -660588 -537871 -16326 205759 -90246 -224773 54469 310733 1013032 2359598 3818201
9928 3818201 4730334 5582295 6392829 6454130 5125284 3267807 1746192 1228996 689628
9919 689628 393537 148961 -23687 -49533 -394187 -841694 -1081547 -744981 -186367 -329778
9909 -329778 -745201 -789094 -395382 -130312 33030 -302270 -431484 -127994 -117539 -297707
9899 -297707 7360 99891 -191750 -897888 -961498 -836406 -1091977 -1345788 -1112186 -954092
9889 -954092 -772039 -681408 -1088029 -1003097 -889061 -759934 -1196709 -1534135 -1208459 -781195
9879 -781195 -586690 -67968 204364 88999 -709562 -1186479 -546238 -706277 -1282429 -1283808
9869 -1283808 -944045 -980735 -1014711 -1410393 -1689614 -1542310 -985874 -1241918 -1072507 -646428
9859 -646428 -709350 -1150421 -1335703 -934622 -687401 -621015 -503256 -537077 -811627 -1101910
9849 -1101910 -1071038 -1066100 -1205651 -832540 -933205 -977536 -1353128 -1495441 -1350578 -986650
9839 -986650 -870843 -942157 -844994 -905315 -967216 -575872 -612504 -726149 -1333468 -1340599 -1442733
9828 -1442733 -1463848 -1427943 -947329 -530879 -503958 -632240 -645980 -475294 -485094 -184067 -372381
9817 -372381 -976848 -1310660 -1472085 -1412839 -1010887 -855042 -1153820 -939630 -925036 -767664
9807 -767664 -705676 -966557 -1043925 -1161006 -1321336 -1383220 -1472567 -1191837 -903078 -1319631
9797 -1319631 -1673765 -1704030 -1664567 -1758669 -1854799 -1554384 -1090374 -795154 -989591 -1077142
9787 -1077142 -814743 -755139 -555891 -643021 -559764 -824097 -1335563 -1143409 -506815 -205425
9777 -205425 167711 323677 202138 374819 146895 -203119 -106401 -16725 -122910 -125705
9767 -125705 -334597 -566287 -743717 -1010077 -945142 -1063723 -907747 -690876 -583657 -883123
9757 -883123 -1171966 -1350785 -1145709 -884823 -703093 -852889 -1074316 -784140 -361373 -509037
9747 -509037 -930360 -1407536 -1243460 -1015636 -847602 -873322 -871857 -961263 -895321 -765539 -765913
9736 -765913 -708054 -546939 -698167 -1049270 -870828 -978751 -1300980 -698132 -449013 -603676
9726 -603676 -826716 -850777 -977992 -1142607 -1140000 -689735 -942076 -848419 -658275 -1059987
9716 -1059987 -1435548 -1465346 -1368963 -1533360 -1411664 -905516 -491605 -651558 -558383 -645393
9706 -645393 -655536 -618844 -530199 -243563 -821156 -683404 -265883 -478107 -652081 -890066
9696 -890066 -890095 -1023563 -1134438 -992832 -720954 -802457 -699157 -784022 -1210340 -1225023 -490174
9685 -490174 -388763 -428216 -592191 -854877 -706645 -692313 -640613 -606117 -823979 -1056727
9675 -1056727 -780151 -1053409 -936002 -528455 -507617 -792605 -788060 -1151675 -1207002 -1262622
9665 -1262622 -972951 -1172642 -915579 -883463 -1230982 -1332618 -1042840 -797406 -345844 171457
9655 171457 10423 -125182 962578 2411826 3529917 4077695 4339527 4591207 4434080
9646 4434080 3163167 1761650 917793 -9556 -358334 58052 114644 -115321 -476925
9637 -476925 -712330 -856728 -511104 -319705 -240509 -110926 -92143 -138779 48229 403559
9627 403559 63182 -356546 -612626 -733344 -470558 -362429 -225915 -409762 -1007686 -1032863
9617 -1032863 -598699 -355711 -202918 -524262 -461349 -187710 -258504 -347469 -518975 -568311
9607 -568311 -548735 -758322 -745111 -560134 -705733 -582274 -294491 -278263 -607680 -795645
9597 -795645 -625211 -911509 -921519 -921732 -729727 -641054 -786219 -1058457 -1267569 -1453970 -1423805
9586 -1423805 -1402528 -1697260 -1654125 -843007 -672147 -885016 -706331 -573164 -721616 -410122
9576 -410122 -700522 -748913 -471194 -474875 -581283 -403880 -643581 -891859 -985215 -942450 -888366
9565 -888366 -645847 -518254 -605174 -357423 -206826 -440644 -649555 -810738 -1056476 -1123577
9555 -1123577 -1516748 -1725027 -1515260 -1170812 -1149357 -1449596 -1509653 -1751533 -1557561 -1493910
9545 -1493910 -1709532 -1276442 -1032718 -878229 -831003 -1173732 -1326878 -1348255 -1383827 -1217969
9535 -1217969 -882706 -506107 -391224 -282952 -112343 24283 -382258 -866646 -769629 -703494
9525 -703494 -416732 -273598 -434092 -273691 -342713 -1051764 -1173467 -552579 -708238 -885505
9515 -885505 -1202726 -1631492 -1303032 -1260348 -1421480 -1259505 -1065569 -867055 -869075 -693710
9505 -693710 -687034 -630346 -839403 -1453514 -1433746 -893100 -835464 -971240 -723612 -571154 -698487
9494 -698487 -858555 -1052660 -888357 -1211525 -1384659 -1321448 -1376675 -604881 -363927 -691672
9484 -691672 -1119055 -867981 -485401 -289420 39264 -460355 -940693 -742789 -828697 -946129
9474 -946129 -1037734 -926743 -808015 -614153 -589270 -602937 -534753 -679684 -695948 -706466 -584409
9463 -584409 -866619 -1147012 -1289635 -1439137 -1355950 -855081 -678637 -705157 -598401 -605890
9453 -605890 -945294 -1040042 -1221039 -1321935 -1224953 -1067240 -767673 -863830 -731571 -342189
9443 -342189 -391446 -547611 -971616 -1067496 -1069696 -1108404 -1380169 -1696133 -1505433 -1171590 -1182397
9432 -1182397 -1170851 -1255610 -976882 -1038323 -1411511 -1511323 -1140997 -957376 -1278965 -1388344
9422 -1388344 -1073175 -849642 -872700 -505471 -594757 -878265 -708067 -984999 -1209765 -1461706
9412 -1461706 -1494018 -1433746 -1388462 -1081352 -833152 -770927 -894009 -962334 -1145548 -1021614
9402 -1021614 -878760 -1255198 -1112118 -728690 -890539 -869310 -1024948 -1333863 -1238737 -1548903
9392 -1548903 -1363709 -1078243 -1203317 -938887 -949967 -1044820 -1465851 -1627534 -1788902 -1879007
9382 -1879007 -1972283 -1873320 -2016739 -2039179 -1797210 -1973939 -1867332 -1570717 -1194348 -788480
9372 -788480 -746472 -1040619 -823669 -1029538 -1525136 -1050402 -875311 -1004831 -1132287 -1265675
9362 -1265675 -1410496 -1422773 -1300156 -1335772 -1279222 -1522686 -1419070 -1450144 -1515706 -1208631
9352 -1208631 -1190805 -1662676 -1881081 -1804132 -1502376 -1502932 -1671152 -1593441 -1242712 -1352006 -1241682
9341 -1241682 -992379 -841186 -813786 -1153354 -1093113 -914129 -580484 -399307 -834896 -1017396
9331 -1017396 -1191347 -1314058 -1195342 -1391777 -1633289 -1671396 -1430314 -1463528 -1278405 -1319102
9321 -1319102 -942439 -1137922 -1270365 -1308687 -1233537 -1557334 -1510125 -1110829 -1194723 -1132783
9311 -1132783 -938641 -1067023 -1171532 -1194036 -1361540 -1163169 -1345395 -1272750 -1185352 -1378820
9301 -1378820 -1411441 -1277474 -1618392 -1550246 -1175921 -1274833 -1501084 -1558937 -1178749 -1240747
9291 -1240747 -1496854 -1596196 -1393287 -1315770 -1006447 -1188839 -1143188 -1161278 -1268770 -1251509
9281 -1251509 -1080848 -1137997 -1402548 -1545628 -1377925 -979562 -1258300 -1405274 -1535994 -1336239
9271 -1336239 -1136434 -904901 -905648 -1021123 -1321891 -1227648 -979990 -1170143 -942753 -1125067
9261 -1125067 -1193209 -978331 -1481251 -1242573 -1160646 -1438435 -1057117 -682007 -410938 -376389
9251 -376389 -1109313 -1596580 -1673985 -1793235 -1311223 -785236 -446735 -904002 -1101273 -1014816
9241 -1014816 -913119 -873316 -886082 -276638 -501590 -1259305 -1386949 -1273985 -789446 -1067945
9231 -1067945 -871280 -1020524 -989301 -1096812 -1328126 -1566248 -1557391 -696020 -831023 -1211091
9221 -1211091 -1229697 -957033 -895493 -593849 -509211 -731991 -653556 -725737 -851717 -857819 -988353
9210 -988353 -882692 -816711 -886822 -962796 -990532 -1180555 -1248022 -1087717 -1183025 -1221187 -1445420
9199 -1445420 -1245344 -1202778 -1415072 -1269405 -868185 -889407 -1208440 -1140803 -1154590 -1137140
9189 -1137140 -1004375 -1364027 -1618127 -1568728 -1718682 -1889024 -1661991 -1800423 -1816171 -1523568
9179 -1523568 -1467814 -1268154 -740553 -534351 -1035564 -1234767 -884498 -792973 -1143930 -1488016
9169 -1488016 -1607297 -1313434 -967666 -942217 -1035354 -981536 -480626 -400602 -392495 -290777 -657058
9158 -657058 -1096773 -1525559 -984086 -606195 -689179 -651955 -772981 -1123573 -784529 -894019
9148 -894019 -1191514 -1346142 -1223420 -1210720 -1504994 -1545475 -1375027 -1303912 -1245654 -1182901 -1006781
9137 -1006781 -760459 -871551 -556937 -540518 -862108 -921726 -919051 -806182 -882070 -1047144
9127 -1047144 -1530753 -1539369 -1338133 -1075842 -1174286 -1046752 -1135914 -1065203 -916265 -1017257
9117 -1017257 -1583780 -1429945 -1259337 -1073053 -694791 -652347 -592072 -879356 -1359186 -1115754
9107 -1115754 -1106514 -1196825 -735416 -861698 -1103612 -1461640 -934837 -283872 -569172 -1159169
9097 -1159169 -1137937 -1459368 -1323245 -1077535 -1070320 -1048383 -630302 -320554 -387418 -865525
9087 -865525 -1192751 -1527297 -1517662 -1454591 -1089533 -795314 -677948 -556755 -449653 -508911
9077 -508911 -987334 -910510 -713243 -1008554 -805464 -700602 -840931 -1042634 -1200745 -916305
9067 -916305 -933687 -751587 -764955 -936410 -1108319 -1251098 -1507654 -1066687 -803159 -830160
9057 -830160 -1041299 -1124645 -1088958 -1063709 -920921 -624646 -847444 -806286 -892955 -858944 -854376
9046 -854376 -1168655 -1287859 -1301429 -824715 -747015 -634925 -888655 -856803 -1024515 -919751
9036 -919751 -858667 -873036 -1050871 -1454651 -1386412 -1123244 -1352287 -1711887 -1701501 -1640833 -1898276
9025 -1898276 -1812244 -1724693 -1710207 -1832972 -2192547 -2001324 -1580627 -1723049 -1887397 -1421580
9015 -1421580 -969396 -1034903 -1367235 -1470061 -1389236 -1511339 -1465012 -1156928 -1043483 -837819
9005 -837819 -727888 -382528 -210886 -156025 -381880 -465165 -476715 -760384 -938930 -1464667
8995 -1464667 -1240658 -1242462 -1518749 -1516830 -1112518 -817096 -786778 -437945 17209 -58433 -366107
8984 -366107 -1160374 -1431097 -1222325 -774302 -517061 -801148 -1203181 -1159168 -1360024 -1234220
8974 -1234220 -921704 -1109635 -1102782 -1177481 -1191778 -936560 -965285 -925252 -1008489 -1349504 -1259579
8963 -1259579 -1491457 -1733734 -1553132 -978434 -575899 -998488 -1034879 -1215920 -1764630 -1751386
8953 -1751386 -1751893 -1587485 -1097536 -837817 -810804 -821512 -1174503 -1306888 -1133465 -1353588
8943 -1353588 -1175934 -777760 -685738 -1000859 -775694 -697151 -820659 -1227162 -1266709 -940241
8933 -940241 -741130 -841765 -1002630 -876288 -704901 -487035 -616295 -570855 -1011614 -1205096
8923 -1205096 -835106 -589512 -881332 -713896 -722239 -865493 -936053 -1066134 -948367 -886399
8913 -886399 -1298312 -1309976 -1149752 -886494 -944560 -1201373 -1370520 -1108560 -1069468 -1017427
8903 -1017427 -1109131 -984618 -1262296 -1184752 -925346 -1083215 -1436663 -1288626 -1148896 -1666390
8893 -1666390 -1803258 -1276803 -1137552 -1055322 -1025942 -869297 -911285 -816382 -833647 -814246 -645919
8882 -645919 -623237 -1116427 -993426 -987850 -1066798 -1337310 -1486666 -1415401 -1459031 -1159061 -1163066
8871 -1163066 -1452523 -1479584 -936769 -825010 -900134 -1356828 -1828635 -1928860 -1609518 -1439880
8861 -1439880 -1355522 -1426909 -1003988 -1029606 -1300138 -1463741 -1062322 -1066194 -1441408 -1699502
8851 -1699502 -1516955 -1258733 -1233150 -1166099 -1608350 -1850229 -1767763 -1446541 -1606447 -1889189
8841 -1889189 -1805967 -1783624 -1212777 -1294047 -1420151 -1479996 -1456749 -1018341 -901629 -965544 -978331
8830 -978331 -1081303 -1296423 -731106 -532198 -886211 -796188 -529562 -859627 -1046598 -926434
8820 -926434 -873846 -922174 -965173 -799762 -675094 -882419 -1099975 -949192 -829538 -684453
8810 -684453 -897237 -1071082 -1267492 -1436616 -1486111 -1316759 -794527 -806131 -1058513 -1279021
8800 -1279021 -1744589 -2179963 -2201322 -1681091 -1309543 -987473 -1104246 -1237573 -1562881 -1683035
8790 -1683035 -1603427 -1661649 -1713844 -1816660 -1586473 -1034470 -969092 -1572937 -1561538 -1294332
8780 -1294332 -1363745 -1260331 -1572572 -1197831 -621319 -697340 -1024434 -1082757 -1089814 -676915
8770 -676915 -498385 -368665 -602804 -305499 -523375 -870898 -379157 -385057 -608305 -389983
8760 -389983 -574376 -623346 -622455 -954289 -1063091 -560054 -479932 -1115457 -1270714 -1141232 -1372528
8749 -1372528 -1194041 -1006231 -880611 -923649 -1135970 -710966 -906161 -1047519 -888627 -770840
8739 -770840 -511581 -420636 -899065 -968698 -1120472 -560968 -371623 -462873 -595928 -1028452
8729 -1028452 -1363077 -1606447 -1412185 -828846 -190814 -361716 -908471 -729762 -223114 -612476
8719 -612476 -992511 -867736 -674732 -504664 -276841 -343603 -835882 -1086871 -1041669 -1231360
8709 -1231360 -1436899 -1771703 -1885735 -1861072 -1735436 -1582992 -1701600 -1659756 -1579223 -1468116
8699 -1468116 -1277812 -783006 -593888 -876532 -993026 -1234972 -1286319 -964593 -1040990 -972753
8689 -972753 -1071343 -1060510 -664495 -217598 -469097 -667180 -875237 -642024 -265114 54036
8679 54036 -240635 -406834 -114996 318671 1048404 1207714 943446 667547 398477 286689
8669 286689 298594 229392 -32232 -456999 -203068 253354 32279 -496249 -513183 -121299
8659 -121299 -78488 87007 234353 365211 193596 -124312 -574877 -797098 -1003099 -830404
8649 -830404 -492641 -306131 -282819 -218028 -103868 -123092 -109372 297316 947436 1289165
8639 1289165 1337953 581064 337652 243603 559618 446607 174071 137911 -25386 -128828
8629 -128828 -644873 -1143740 -1338275 -1080054 -927225 -791833 -1294434 -1562954 -1405422 -1123673
8619 -1123673 -870985 -928843 -878389 -795770 -609318 -284806 -624502 -777609 -638295 -474988
8609 -474988 -532089 -408458 -272778 -207783 -252521 -360586 -851182 -998824 -488288 -593138
8599 -593138 -1237362 -951492 -725992 -610735 -797288 -1055288 -824279 -621920 -829822 -1100631
8589 -1100631 -1318308 -1260566 -887471 -717432 -742884 -529692 -204501 -268532 -379309 -253154
8579 -253154 78755 385846 399957 616102 534654 619615 861106 915874 1066530 1457574
8569 1457574 1891656 1907234 1600283 1401747 1973781 2827986 3477751 3696873 3800980 4227297
8559 4227297 5067249 5555048 5994580 6664207 7718813 8795130 10071570 11413116 12812762
8550 12812762 14603742 16317876 18401685 21197908 24344039 26601736 28738753 30919913
8542 30919913 32083674 32037520 31094001 29203492 26932928 24906547 22894547 21030974 19280157
8533 19280157 17676677 17041702 16407472 15792785 15198063 14708219 14108197 13953103 13241220
8524 13241220 12518251 12326072 12272021 12740657 12834166 12744293 13382354 13790585 14454405 14878982
8514 14878982 15528210 16503742 17321477 18546111 19923111 21054418 22535152 24643463 26626403
8505 26626403 28791111 31168547 33181795 34385078 34898937 34459102 33114081 30720752
8497 30720752 28208211 25545427 23704699 21684238 19438024 18093336 17136929 16158247
8489 16158247 15298765 14782203 14157767 13131017 12473539 11374551 10941556 11007738 10835811
8480 10835811 10388099 10308464 10085364 9382987 9306559 9294344 8603344 7849496 7307979 7125945
8470 7125945 6657563 6229099 6084892 6171036 6292957 5921156 5379594 5061085 5131982 5319521
8460 5319521 5244956 5076476 5192136 4837613 4675985 4715927 4520000 5048911 5085620 4752163
8450 4752163 4274346 4181805 4080063 4616247 4793371 4407370 3772897 3777711 3734952 3652816
8440 3652816 3705021 3471580 3528397 3522883 3568533 3747296 3879629 3737727 3581861 3111907
8430 3111907 2940294 3184275 2642027 2475606 2701390 2988339 3371645 3623389 3071458 2952287
8420 2952287 3061898 3578378 3839419 3744857 3280744 3369931 3947740 4112190 4542383 4733095
8410 4733095 4388108 4235362 4342801 4106443 3776177 3652934 3747485 3605029 3632430 3530322
8400 3530322 3257182 3229339 2713701 2538858 2978449 3050445 2843827 2931017 3119248 2944695
8390 2944695 3091859 3206194 3208513 3032914 2803958 2979339 3008548 2943823 3339598 3248218
8380 3248218 2560149 2441474 2281573 2516055 2875132 3071702 3208878 3820398 4160543 3702113
8370 3702113 3386459 3027535 3406216 4020721 3745778 3573321 3496087 3411663 3981131 4309930
8360 4309930 3875183 3160216 2850867 2819976 2706435 2296454 2427432 2283656 2518138 2719134
8350 2719134 2498481 2117860 1642998 1331762 1544191 1370799 1076663 1046090 1414649 1829506
8340 1829506 1675595 1029205 874269 974638 913768 1340772 1873131 2080561 2237133 2525967
8330 2525967 2530775 2729522 2916843 3351133 3259416 2708719 2377856 2849606 3068098 3416676
8320 3416676 3455989 3148323 3306514 3304535 3442715 3641525 3654938 4077989 4715211 5677141
8310 5677141 6198539 6705212 7373334 8096711 9328985 10663342 12090175 13579244 15962348
8301 15962348 17922648 19936659 22887162 26689198 31029339 36346702 43435126 52718756
8293 52718756 65602615 84085587 110756017 147572115 195438845 248871106 295887375
8286 295887375 330483487 354060262 363977468 347782588 302017534 245117856 195139806
8279 195139806 157878398 131345206 112808520 99624074 89618430 81889008 76188773
8272 76188773 71195230 67489943 64454037 62230679 60240120 58065172 56050668 54153830
8264 54153830 53006034 52981784 53605149 54734540 56442203 58855923 62380726 67670035 74293189
8255 74293189 83412755 97346058 117610648 146509177 186254451 235012673 285240357
8248 285240357 326305498 354883358 373217028 374400764 346346848 293927386 237637068
8241 237637068 192146816 159120250 135611639 118771661 106089829 96185652 88652404
8234 88652404 82633963 77360419 73262545 70022279 66819316 63569070 60111788 56305521
8226 56305521 53028956 50388441 47923155 46078942 44195727 42505358 41076731 39875055
8218 39875055 38430484 37322310 36367835 35568343 34500756 33492604 32519050 31711891 30550674
8209 30550674 29855903 28841596 28072580 27780058 27364727 26763777 25656198 25198572 24734724
8200 24734724 23869733 22939110 22045518 21548052 21317427 20781884 20503879 19857040 19651524
8191 19651524 19345566 18708779 18340287 17789822 17351936 16971128 16717685 16468194 15905320
8182 15905320 15448021 15051227 15167204 14979380 14346135 14009297 13819702 13913314 14176038 14242127
8172 14242127 14349438 13787075 13310453 12693196 12617305 12661534 12514581 12278162 11526750 11028523
8162 11028523 10567311 10407928 10517820 10514835 10437087 10670191 10857898 10623567 10535832 10846844
8152 10846844 10551974 10222288 9897981 9669086 9636793 9446099 9316718 9484248 9246548 9305190
8142 9305190 9052633 8607369 7950358 7882913 8053173 8029965 7745225 7815491 7781089 7229785
8132 7229785 7102982 7465910 7865147 7698894 7268648 7352247 7651282 7681528 7305503 6959726
8122 6959726 6824080 7122268 7154199 6947357 6347653 6366586 6419482 6232288 6173583 6530655
8112 6530655 6771624 6416507 6471449 6654069 6668838 6262873 6306998 6286994 5517235 5300356
8102 5300356 5307333 5634463 5452254 4892865 4820792 4819928 5034082 4737529 4580916 4463816 4399475
8091 4399475 4350699 4514996 4971273 4782009 4518625 4356559 4526138 4458519 4304129 4389126
8081 4389126 4118597 3917977 4045632 3811984 3988593 3944610 3744357 3571377 3085889 2755814
8071 2755814 2792184 3452954 3914875 3337523 2847694 2858747 3540131 3678351 3791271 3902870
8061 3902870 3919803 3892200 3398679 3190218 3020108 3264981 3248282 2591526 2262190 2281564
8051 2281564 2425086 2501895 2281411 1930182 1960257 1815110 1859385 1644584 1292432 1794325
8041 1794325 2038827 1769907 1323859 1860374 2140942 1917476 1588165 1793128 1935593 1686167
8031 1686167 1907211 2169264 2332896 2564281 2362158 2126377 2061726 1887236 1843950 1701030
8021 1701030 1807829 1898953 2159510 2349195 2079331 1904755 1928094 2089925 1724474 1619450
8011 1619450 1349482 1421515 1370114 1558197 1880471 1926207 1852541 1600386 1675891 1991696
8001 1991696 1943782 2002888 1974282 2049993 1850438 2054232 2100968 2023231 2041343 1707715 1759733
7990 1759733 1634946 1303263 1175580 1593159 1426405 1393733 1948481 1901475 2006471 2054653
7980 2054653 1835416 1458662 1223997 1756664 1903080 1984640 1843843 1730162 1393681 1245597
7970 1245597 1555023 1394965 1268392 1404369 1361736 1058116 698309 295729 530413 909194
7960 909194 708091 833554 890701 714765 1032633 1357807 851033 377648 16433 -15340
7950 -15340 458174 751794 1005311 1645956 1929214 1660210 1191212 1189761 487666 263877
7940 263877 164434 411606 742962 900037 349723 151676 621596 626359 752374 826442
7930 826442 859264 1186609 941395 1249628 1141592 1026533 1195529 1410926 1182228 834223
7920 834223 426209 210410 395937 426958 715462 1106561 897883 802174 678406 691509
7910 691509 717300 153599 308039 666684 531799 844200 862331 748225 856634 891759
7900 891759 931689 886764 774946 1009828 1000646 1291282 1342681 1251988 1418653 1434911 1470765
7889 1470765 1498054 1694221 1895671 1774402 1953410 2173844 2012192 1343469 738037 1029521
7879 1029521 775345 697932 680256 1110866 1359913 1060330 724365 490341 311243 111486
7869 111486 -56992 -28448 77796 351946 482578 704015 950950 714385 392125 892936
7859 892936 1307171 1187378 1246869 1364539 1527101 1911590 1897304 2367131 2597017 2242302
7849 2242302 2323905 2049515 2183973 2195449 1780119 952083 569538 869024 908588 1149470
7839 1149470 1371395 1178744 866360 840256 786026 396636 95327 -69384 304179 613835
7829 613835 361328 181723 260166 -143780 -165139 49348 -24994 -23263 319878 695927 828201
7818 828201 719569 396929 254008 509604 789339 1029665 885884 824662 714670 271503
7808 271503 519098 787557 390642 319808 96214 -403145 -627672 -703620 -303622 -236078
7798 -236078 -396008 -164581 227248 307986 437362 166838 -76227 176838 234127 194679
7788 194679 -82343 72466 -48497 -89830 -133892 -160622 33803 -41223 -291732 -275008 220855
7777 220855 902510 719575 -130220 -220019 235811 203173 -340740 60242 791925 531192
7767 531192 -64537 -389417 -241454 -464378 -699031 -324622 -45864 -100496 -191242 119146
7757 119146 51181 -199265 275269 1001076 830910 296739 -77646 -159756 -261211 -383804
7747 -383804 -214516 -603223 -676357 -563235 -602124 -435203 5437 476339 561784 759454
7737 759454 308014 208602 527862 623956 335225 -239399 145989 364410 -16736 -248824
7727 -248824 -221039 -518326 -613685 -358956 -508731 -393837 -273388 -251259 -281947 -110132
7717 -110132 -111859 -87639 87175 245918 298972 420145 372863 416810 317496 605226 480191
7706 480191 152154 27707 188028 138650 -228471 -273788 -179038 194407 284349 -137589
7696 -137589 -168749 -172292 -111011 -117026 -184928 -44089 -99244 -109459 -318867 -353079 -505978
7685 -505978 -535773 -703740 -564775 -955076 -915770 -399019 -94429 -50413 292652 424845
7675 424845 393297 195949 535432 577343 458348 98914 -262342 -468089 50336 56023
7665 56023 -172113 -120212 -197492 -57795 -231061 -120993 -423158 -370234 -120216 -87953 -101374
7654 -101374 -212832 -443374 -108864 378606 636272 490068 298591 70558 93917 143632
7644 143632 170920 403981 382886 114240 -379109 -939366 -658439 -409979 -185429 -416582
7634 -416582 -234740 216653 643220 571041 576320 727725 583786 350920 116017 -70337
7624 -70337 -68795 318873 166194 250012 406311 263658 87661 310520 475096 -48542
7614 -48542 -250967 -641901 -645414 -631967 -637724 -740876 -980163 -1156593 -1017332 -1384333 -1092758
7603 -1092758 -617033 -309174 -547737 -442446 22028 297181 -69002 -313479 -473049 -607824
7593 -607824 -302665 -184705 -255815 -613052 -614758 -151942 -119398 -51512 -67714 -107933 -178848
7582 -178848 -422842 -874380 -828905 -859342 -944437 -965013 -502139 -104255 -258281 -620157
7572 -620157 -270104 -126563 -22092 100667 -12076 -18258 -138252 -303489 -322425 -365663
7562 -365663 -574929 -430980 -288302 60042 372485 148318 76047 330875 429594 -146891
7552 -146891 -848273 -1145024 -699698 -207264 -184889 -487051 -473707 -498797 -512820 -549867 -280122
7541 -280122 -30472 25375 -260367 -230119 -351066 -7458 30994 199526 -137709 -493126
7531 -493126 -612349 -441124 -524167 -658232 -205352 -108120 -129932 -518463 -447362 -699458
7521 -699458 -923684 -770778 -898783 -806824 -312970 185735 -93464 -592171 -681541 -471328
7511 -471328 -366568 -621762 -428088 -604 175402 -128542 -604211 -344656 -108179 -39649
7501 -39649 293208 486507 357400 77389 -150760 -36879 -22212 279339 537131 266214
7491 266214 -472069 -585352 -35791 96880 -151222 -101094 25639 101162 50679 243825
7481 243825 260469 213345 -89204 -354602 -436474 -188046 83204 291331 345623 284778 201772
7470 201772 81930 178048 -352401 -626332 -600375 -627074 -196615 -23899 350202 293714
7460 293714 12842 -54840 -164917 93075 69450 119419 513129 701763 861956 960712
7450 960712 647132 392681 1020962 1181322 1060819 714486 207075 12974 202369 498361
7440 498361 269979 331791 44506 -228012 -75431 492037 650302 564553 585674 178018
7430 178018 82417 -122211 174286 96120 -176233 -540134 -480643 -209640 12930 202301
7420 202301 -111791 -320577 -322827 -398853 -386123 -308383 -221970 -149549 -332633 -603020 -499186
7409 -499186 -147643 -6388 -44245 -245399 -955252 -791529 -790256 -507355 100593 501781
7399 501781 367160 -107829 -106015 -54025 -230550 -595308 -137388 -15987 252295 472125
7389 472125 310301 -5551 -55627 -38561 135000 584214 344701 -113007 -459133 -218012
7379 -218012 -283818 -827016 -587869 -257283 -178005 -329441 -435169 -181694 -221076 -317235
7369 -317235 -239502 -161719 -43432 -88105 23578 78081 -60494 47420 179922 322671
7359 322671 16347 -378557 -201431 -275860 -520135 -486530 -165278 -143359 -293879 -284616 -603905
7348 -603905 -836558 -546563 -71630 507603 733692 642713 272073 219015 -100115 -198073
7338 -198073 -455358 -476893 -118826 173719 89148 -82413 -169380 303332 155360 -43364
7328 -43364 364286 667662 415488 245666 498566 440332 103014 224292 666733 444334
7318 444334 -161648 -466719 -727099 -669924 -394580 -262449 8242 -262325 -208999 -178094
7308 -178094 -276957 -206658 494143 495112 75550 -50833 -422223 -310996 -359061 -274841 -363965
7297 -363965 -370281 -555357 -124764 -122588 -118520 -3231 53116 -17628 -155518 -233559 -412198
7286 -412198 -126123 -210634 -423798 -650552 -372172 -216768 53979 389072 353165 351146
7276 351146 563370 109815 -255945 -497902 -530200 -525886 -463238 -816643 -411758 90754
7266 90754 162916 132250 17311 -395819 -298824 59816 415548 578613 262236 -314844
7256 -314844 -779982 -912686 -902854 -311671 214189 578563 200595 110936 -313974 -305060 -307408
7245 -307408 -775475 -663357 -507553 -53255 174304 244266 186073 -148590 -444007 -592420
7235 -592420 -394031 1835 -156153 -31571 266350 478364 -97776 -279063 -185748 -103934
7225 -103934 -78200 -68748 -155607 -78660 -145254 34782 100552 -419287 -35228 -72535 -423325
7214 -423325 -305834 -278498 105838 243509 229347 21231 -25915 -28815 -355749 -785483 -707115
7203 -707115 -196297 298433 228642 39528 303279 112981 -492382 -540677 -381881 -208406
7193 -208406 79552 -427296 -571050 -570740 -582474 -686771 -557171 -321036 -661111 -902021
7183 -902021 -976038 -748714 -321461 -15962 -213539 -128517 98392 97255 -177752 -406192
7173 -406192 -540335 -139707 -276104 -215958 -80884 -204990 -503875 -737521 -408037 -418906
7163 -418906 -283183 -85624 190657 194209 64578 17439 -468289 -634463 -429974 -222548
7153 -222548 -277034 -455371 -595577 -321851 -407965 -356446 28081 -11153 72783 287931 439593
7142 439593 719130 812200 324222 -84569 -366259 -338826 -146604 -475812 -654293 -574798
7132 -574798 -138507 2135 261947 350290 597888 579744 -25761 -485880 -329741 -110607
7122 -110607 16792 -414063 -938242 -1009317 -828811 -950829 -718948 -58067 157260 33226
7112 33226 70196 -162186 -130053 -49424 1842 1384 149631 71492 18020 -189855 -482270
7101 -482270 -608412 -445433 -498501 -473895 -573975 -832784 -780351 -902895 -649773 -156714
7091 -156714 -531229 -833983 -968152 -853074 -1049689 -899345 -782688 -366867 -300156 -52968
7081 -52968 -153651 101126 -67901 64840 142706 220335 602471 298328 33330 76709
7071 76709 89818 48167 253822 107411 -441896 -789457 -948843 -643478 -37363 -161997
7061 -161997 -335154 -152781 -299151 -371649 -627741 -582527 -321773 -91539 347481 781067
7051 781067 209102 -111115 -225657 -405850 -596314 -355275 -54191 126154 261069 234324
7041 234324 72946 -182617 -509028 -67070 -128099 -233409 -444803 -209428 499678 914525
7031 914525 706372 181641 63839 -201458 -138120 71844 -21648 185392 447938 629198
7021 629198 497284 48211 75389 658004 851482 421475 213488 435047 352244 -107995
7011 -107995 -68880 71056 -288147 -360958 -309709 -368284 -717793 -883293 -704360 -174841
7001 -174841 -314480 -586515 -431521 -498667 -673907 -1045823 -1068898 -775551 -611950 -590075
6991 -590075 -328347 -799429 -352886 158029 227702 -113312 -199106 -363991 -333261 3985
6981 3985 -72893 -26396 -166362 -482007 -344656 -253615 -428742 -147152 150380 163625 152725
6970 152725 8701 -137424 -499396 -670396 -163446 174926 329370 271374 383669 494734
6960 494734 728802 352402 -109155 -355705 -219124 -139864 -86199 -105427 -204115 -88967
6950 -88967 -292017 -457993 -674907 -579719 -380891 -439453 -650161 -621805 -425873 -522339 -361524
6939 -361524 -176529 -180409 -272558 -219440 -383044 -384580 35133 4361 -98660 -272756 -335877
6928 -335877 -115170 145875 303079 -326575 -427004 -233731 37339 -177787 -342801 -202149
6918 -202149 49678 -242578 -290432 -138928 -594703 -381869 -437271 -515367 -873197 -913544
6908 -913544 -474129 -152834 104499 -125027 -365073 -269661 -224536 -253951 -304660 -293262 55755
6897 55755 128746 -67926 -115100 -288824 -211237 255415 279992 -6237 -300656 -718411 -376943
6886 -376943 -166676 -417506 -303496 -56493 -191326 -168891 -25364 32693 -401689 -763250
6876 -763250 -745875 -704097 -935086 -312744 -98969 -224102 -227728 -263304 55714 349222 287625
6865 287625 134710 -145183 163852 107748 -110759 -26627 -99932 -518605 -535873 -519474 -184058
6854 -184058 -161454 -543418 -716063 -904532 -643045 4780 -27892 -321443 -188326 65570
6844 65570 -123398 -173170 -187710 -313605 -135073 -47893 279055 193665 -124892 -239298 -190865
6833 -190865 -350400 -342347 -259304 132010 214633 135422 -1947 99908 -237279 -615867 -843263
6822 -843263 -503541 -589817 -585891 -596971 -635999 -599515 -79348 151491 123864 178257 411110
6811 411110 123623 305785 462031 526156 552346 277546 -198423 -349081 79335 309901
6801 309901 -10675 -129928 -138823 313627 539743 641044 313528 89032 303957 276117
6791 276117 388139 264035 -125146 -230386 139271 446747 764698 552307 556835 478197
6781 478197 -155802 -275034 -92554 -151628 244797 291553 25708 -61632 -170966 -287979
6771 -287979 -29579 22691 14219 438193 524113 779809 1046533 855934 506067 -27582
6761 -27582 -343028 -20625 -228430 -294080 -116948 -252553 -595131 -364546 -227366 -201506
6751 -201506 -76617 246830 381009 189813 12825 87513 97262 325050 389063 152938
6741 152938 141271 -125131 -101589 -403908 -244910 -219150 -155328 179791 377905 538849
6731 538849 641698 373841 61657 -259072 -470191 -570030 -578422 -614637 -536848 -57470 -297907
6720 -297907 -68775 283768 154006 -4678 -220065 113626 28578 19304 -76269 -203974
6710 -203974 -320610 49130 -61064 -281504 -662654 -754544 -595492 -113829 83816 -887
6700 -887 -234911 -520237 -469037 157905 22055 735 -184635 -258013 -451810 -274248 120448
6689 120448 149929 -130334 -162456 -30032 41394 -91200 -13246 156827 227414 59456 -116112
6678 -116112 -474986 -544933 -113860 800670 986577 875642 251882 18396 50914 199973
6668 199973 479576 62596 -143681 -111187 -94880 -36360 -133079 -229205 -185941 75583 143875
6657 143875 465883 216625 67361 -290284 -366448 -20830 148776 -295711 -293280 -363894
6647 -363894 -540895 -873069 -969050 -717631 -494510 -703757 -977296 -1045459 -732647 -717292
6637 -717292 -826826 -987433 -659649 -422665 -242044 -140164 -207372 40294 7617 332907
6627 332907 87085 -78758 -306318 -86236 -61646 -333105 -711255 -471799 -241934 -68607
6617 -68607 191022 88634 -141481 -521321 -766682 -827682 -449750 -539120 -433698 -50823
6607 -50823 -58365 -63646 -16460 -216737 -75366 147801 86694 -164291 -283921 -211775 -267621
6596 -267621 -93075 433458 606284 213781 101247 30434 -451744 -601573 -488572 -361851
6586 -361851 -26386 349944 382582 255989 -122664 -80310 -284894 -398004 -111210 -297587
6576 -297587 -118910 -37015 -120916 40375 693251 477496 268781 274340 269454 426628 115000
6565 115000 -466561 -405603 -200944 -43600 32546 51735 -10198 32735 -102837 -2596 318207
6554 318207 355479 84252 402109 660206 517021 149154 232114 661092 752035 572354
6544 572354 24163 196396 328019 401746 408948 238635 132122 232304 316008 411191 464769
6533 464769 540306 348230 262196 451679 -196119 -553403 -702340 -728036 -807323 -674895
6523 -674895 -97968 103895 5030 -42353 -14631 49799 135617 232791 553458 312489 17514
6512 17514 38570 -52402 146887 219295 226661 -37414 -339425 -436707 -231533 -153139 186764
6501 186764 323151 162806 267772 375461 756540 637037 16844 131909 388778 386571
6491 386571 194349 391924 575587 344660 466106 528899 223506 -67108 -280908 -549406
6481 -549406 -552492 -461420 -618799 -383486 -356598 -341943 -102520 -6409 254403 254086 110125
6470 110125 274556 354051 195425 16347 -107266 -316666 -19945 325333 730427 1088445
6460 1088445 1423635 1070385 469486 317894 512533 505103 319506 237925 244311 297255 249900
6449 249900 33672 -62004 -155860 -426694 -435315 -478379 -238249 20944 303957 222239 83092
6438 83092 4537 239609 615803 348985 -163139 38914 126266 -160345 -182204 -74227
6428 -74227 -409737 -421809 -548714 -788394 -622720 -357988 -151695 -116253 -26504 -224560
6418 -224560 -365866 59851 87851 -37791 -210200 -208759 -14114 152854 145854 -10209 -319092
6407 -319092 -265848 -384435 -151683 -402353 -626763 -563815 -118230 85068 -52626 -29926
6397 -29926 -159209 -295972 -453580 -259142 -84867 -39345 75068 508819 819242 590794
6387 590794 235037 206597 139675 -304502 9039 -18988 -95224 255218 266871 193772 156443
6376 156443 131235 68350 -12439 -61361 -281776 -691976 -493109 -524078 -1007008 -962089 -697852
6365 -697852 -246944 374628 355472 97612 28867 -511123 -580041 -426877 -267938 -312814
6355 -312814 -76899 -333784 -178890 -278794 -263249 -299762 -484608 -431248 -114998 -94600 228649
6344 228649 480197 163317 43003 417589 505876 173011 80214 16025 146082 -130434
6334 -130434 -10442 12959 -150770 -189072 -205308 -189517 -74850 144313 42784 -46388 -119191
6323 -119191 217417 438752 687892 503912 278350 121248 -88535 615086 1079395 747323
6313 747323 395479 370752 93658 -140401 19706 112954 231416 187691 117848 -458900
6303 -458900 -460219 282770 394402 208871 -201588 -494740 -734816 -732437 -394408 47103
6293 47103 -167700 -9187 -264441 -226702 71690 117246 -63707 -259627 -348583 -180492
6283 -180492 99971 449308 440381 203930 292579 103293 -15574 222705 298066 336250 491923
6272 491923 254940 -130086 -125012 -437451 -159054 286079 228341 -192463 -520367 -569925
6262 -569925 -344224 -171686 -68404 6944 300382 316461 980 -305277 -60856 481738
6252 481738 877050 710128 398084 134298 -11767 36236 195532 186224 519546 508086
6242 508086 659951 674962 311634 189835 238621 197821 -58057 -316002 -91535 -139378
6232 -139378 47225 -99894 51351 81727 -263663 -405885 -218087 -338956 -475904 -394396
6222 -394396 -160294 -157911 -134497 -165644 -39222 -228933 -403849 -407598 -260614 -71984 -2569
6211 -2569 -122823 251910 686549 1205222 1289577 1186591 644808 478384 688903 675709
6201 675709 274645 243083 171005 56518 43803 38635 285241 381947 35612 -144534 45975
6190 45975 219570 143201 -125286 -467196 -200860 41006 -38484 -214281 -481079 -520259
6180 -520259 -555846 -710532 -579423 -544912 -277676 86478 -193757 -586810 -407061 24295
6170 24295 19024 -198031 -410017 -544569 -441633 -123413 -27776 -28733 -357600 -266240 179346
6159 179346 228041 165400 70579 12896 405972 816147 727506 477679 29547 -157471 -172324
6148 -172324 -41920 -151853 -232097 -73344 348232 656181 563033 371095 596725 597911
6138 597911 404711 520829 307446 -192966 -495107 -409455 -40668 -4100 43021 218416
6128 218416 219388 281946 545932 731338 951570 639517 269561 98466 -60453 232862
6118 232862 806180 403559 370634 178647 110079 128350 141237 268510 277809 129621 8920
6107 8920 220557 329243 324273 92447 -366166 -373678 -67848 554145 393243 442553 406395
6096 406395 797555 1046896 799434 510919 757316 535678 318516 -75858 -330848 -149258
6086 -149258 -285645 -150589 207219 213352 545859 330896 -54512 164455 -35387 -146226
6076 -146226 143067 120393 90966 190810 323886 329282 131848 -123650 27027 250958 -167288
6065 -167288 -424451 -382780 -222211 -11284 -134398 -49497 -46554 65330 63371 143238 406592
6054 406592 152254 -173381 -46322 436838 431940 -150504 -335370 -199428 -150176 -39203
6044 -39203 -103550 -385 43304 236067 171896 -138529 105279 273029 182549 443919 482379
6033 482379 201687 241 -65033 107462 211350 244309 191931 388985 105022 -329720
6023 -329720 -166523 -34754 122287 622830 759262 639209 50137 148541 575152 240315
6013 240315 344969 504210 288807 279435 335840 435470 453732 -25513 -307553 -509025 -205268
6002 -205268 -14889 66530 -38318 -87867 -38737 -91721 91651 235424 90558 -542508
5992 -542508 -250960 263837 661650 560549 271908 -439563 -333612 -154338 -302745 -268407
5982 -268407 -228543 36304 122759 190433 369061 486519 440920 433976 -160325 -294392 -77155
5971 -77155 346717 529751 395822 592303 996109 753356 376655 711059 758047 265084
5961 265084 294704 205848 251054 276549 450901 25056 -175006 -347848 -30592 180075
5951 180075 -145005 -270455 -29333 -64302 -71502 -5512 298111 299769 112034 73882 198837
5940 198837 119591 58158 331175 509182 650831 224693 -67605 -227094 -318256 -134450
5930 -134450 -213323 -263789 -68991 -159315 145796 596633 547142 623016 454510 42515 104883
5919 104883 168900 349215 112317 -243928 -164615 -155787 -279273 -360662 -501462 -551328 -719316
5908 -719316 -1042049 -857850 -361946 -44883 89469 18048 248143 571308 34606 95791
5898 95791 267074 137410 -392152 -502246 -114391 -60272 -198110 -433130 -510848 -430596
5888 -430596 -302409 -128784 -199725 -277748 -656536 -904078 -538334 -220428 201428 156840
5878 156840 -5142 -104942 101379 -40101 -266707 -638010 -625765 -473246 -613967 -367225
5868 -367225 75831 -151530 -400563 -455963 -20258 -32058 -3599 -143160 -281569 -625604
5858 -625604 -755963 -440948 49883 3309 662 -52409 271862 413426 497444 637426 814246
5847 814246 781774 322886 -40191 96588 360651 179462 2421 176335 133388 -216912
5837 -216912 -700963 -866435 -616785 -211514 -22174 101701 175419 69627 -379784 -326816
5827 -326816 -107746 237833 273567 427645 545762 641862 427034 292679 973265 1093776
5817 1093776 658022 550519 490482 561530 248818 380788 541067 429601 264197 467016
5807 467016 273248 137245 -20667 380946 626481 995843 989156 572155 881395 604823
5797 604823 181715 168446 -384344 -445207 -248353 150061 341211 354143 323395 247269 542520
5786 542520 639552 547938 374333 542828 647490 660152 1010187 1112518 774982 450559
5776 450559 281576 768610 852872 659799 684404 351020 180643 191621 323784 278608
5766 278608 446121 371051 83255 407788 652574 792081 439126 174213 61060 -230297
5756 -230297 -643383 -225091 671145 522388 15391 130353 410044 528433 143034 -102463
5746 -102463 -12651 211756 324400 278544 245182 21470 -94316 137628 906072 996976
5736 996976 347963 286259 340679 560253 724212 199665 344725 711163 361405 85014
5726 85014 132004 147912 250189 317905 533452 342746 234771 471101 509635 84198 -115071
5715 -115071 -256690 -542308 -911496 -977110 -549651 -340451 -17365 228739 295759 129810
5705 129810 7379 -430800 -465331 -367040 -325733 128077 130691 233571 272882 270629 256598
5694 256598 115535 -164128 -342565 -245174 -132038 69713 375032 262075 318074 22673
5684 22673 -76686 -197953 127617 409402 190169 198770 91171 756293 947656 889288 841006
5673 841006 412466 -132848 -466239 -91536 192969 32899 -166844 -15130 301547 287329
5663 287329 424247 553614 244913 136496 158984 96463 289010 436739 373727 378485 597433
5652 597433 611729 281529 54549 5661 4982 147220 377197 465104 749007 629091 236730
5641 236730 31485 512682 938622 634766 734819 930709 622359 16524 -102718 639118
5631 639118 1119384 988676 816146 448743 345271 180917 322884 466825 409883 143931
5621 143931 89598 -20441 -259658 88735 174429 354805 559500 706045 234223 98700
5611 98700 290755 616733 619480 541003 569514 301834 38739 -193496 -223421 117000 243842
5600 243842 408068 296950 480010 341718 -438 -308379 -263421 30323 61165 -230671
5590 -230671 -367638 -77515 400226 120956 -564552 -714779 -826452 -864841 -735537 -326912
5580 -326912 311072 646896 530318 321363 273237 454735 587628 734293 798579 612826
5570 612826 509870 474292 598725 408850 719170 999283 1014176 635840 643622 716688 249719
5559 249719 -359560 -120535 335583 -37775 -489559 -415823 -165796 -30712 -89865 229554
5549 229554 111290 50168 -32281 62773 79925 -58760 163736 83893 162873 23733 -34844
5538 -34844 655644 1038897 792031 509097 501072 766170 734753 462234 347259 355401 377767
5527 377767 617043 473763 727395 679120 473220 229969 220147 306943 595773 844980
5517 844980 706415 496018 599140 661939 630842 683823 907607 587549 51623 -640875
5507 -640875 -287118 59825 -138751 -128869 -259405 -123311 164549 271436 605282 691973
5497 691973 850584 845043 594285 624780 386551 417990 229663 234049 105113 435073 203487
5486 203487 249675 113434 159611 70358 -302774 14595 632336 780979 724830 435102
5476 435102 299216 301481 323225 133617 78101 243759 688087 483828 368104 644656
5466 644656 492069 109002 -306730 -518158 -355405 -236430 305164 270789 679568 808592
5456 808592 347295 -121995 -276389 23897 135252 209294 565169 467313 277903 465638
5446 465638 618747 753998 607975 256782 138932 137442 622825 619063 709515 1057429 943393
5435 943393 664128 765246 549444 410462 661502 823226 980840 1428488 627397 180585
5425 180585 19155 -333740 -888331 -573618 -319103 -363258 -411484 -117636 139351 45665
5415 45665 288170 370435 527153 758284 729528 565107 587798 847440 545850 491286 658588
5404 658588 191444 156627 -31610 -138134 327853 792198 376714 44048 242612 426462
5394 426462 659690 1003510 984645 1067514 714767 632903 638961 445510 539765 410671 424415
5383 424415 538053 548381 396505 436195 41042 208268 333694 -63011 -69250 195935
5373 195935 -198052 -372804 -111203 393664 298984 -28810 -177432 178086 346432 189314
5363 189314 6965 -574080 142430 778380 652862 238442 425486 196475 23529 -96041
5353 -96041 -87359 -138452 -137519 -211953 -9466 219920 6242 -206932 180541 47586 -18478
5342 -18478 -167962 -409617 -560599 -327990 192641 133461 98531 29497 52703 179406 -26636
5331 -26636 -102636 160055 256317 314648 470681 556232 345489 -3890 -536221 -698270 -340551
5320 -340551 -81677 315501 624910 780826 672524 463322 690482 458481 -152192 -39054
5310 -39054 200772 351695 677432 568419 601979 526930 128410 -72565 515533 1029803
5300 1029803 726343 557742 485160 596566 628024 345573 483832 564367 372126 53930
5290 53930 201473 530473 502312 394333 322962 544807 435539 411516 903456 832562 657456
5279 657456 262566 134478 239202 244845 274964 151857 77332 230220 217930 221581 493147
5268 493147 576314 581554 386314 -119812 -159728 88536 -97179 -146020 -44048 -308790 -98059
5257 -98059 474049 860728 1158184 912360 783366 531624 241357 -167767 -60452 377153
5247 377153 177943 -3241 309618 137337 100832 235052 238356 165818 156164 -242534 -486092
5236 -486092 -250498 41253 155412 164070 125260 -132889 69288 367970 687129 388745
5226 388745 -3706 -27443 -51386 -94339 -26487 -73033 202495 190106 335716 292792 -95751
5215 -95751 -190102 -358590 -303964 382961 272979 -23838 104843 241712 443232 42623
5205 42623 36834 429045 595546 492237 745687 514537 608408 819757 1144237 1262597
5195 1262597 1106894 330214 556270 933171 854351 735751 480495 695869 613682 561455
5185 561455 571958 638462 1007600 794158 491342 502587 512464 351947 -11467 -61643 -168791
5174 -168791 -92298 50217 167737 323768 656624 733052 727778 525302 659626 659874 225320
5163 225320 -488400 -271295 -158896 313200 288994 -188358 -156043 -14425 122212 307395
5153 307395 36673 43838 -123633 -200913 -163105 139410 521123 718572 357364 167703
5143 167703 439129 295286 -6782 112906 252063 577147 470411 126841 65455 176596
5133 176596 235525 468692 417888 236760 407234 541555 418700 1045577 1332612 1145007
5123 1145007 820462 324013 -140374 -62968 110126 -201353 50426 -223153 -541690 -253323
5113 -253323 156100 233695 -72776 -674345 -622963 -14120 416226 391821 247219 893342
5103 893342 1147794 575788 502868 683737 462257 66181 112828 91046 80902 434941
5093 434941 851234 818432 509927 -193580 -91297 -18637 -110567 211086 111997 164435 220445
5082 220445 -163085 -903469 -1221977 -600090 50365 304570 379608 459908 70473 -104049
5072 -104049 -61024 29167 -216119 -122458 -181863 13102 -235368 -588994 -547432 -301734 26286
5061 26286 104044 144102 280166 30329 272313 281204 110300 51757 -210207 -88697 139347
5050 139347 -163822 508183 707188 975348 680089 485299 336718 295766 240949 72549
5040 72549 240084 190437 33122 257693 479665 690340 840611 757192 958476 912198
5030 912198 445515 138015 3388 29300 -183191 -15418 514487 889152 678037 -257333
5020 -257333 -398834 293503 117633 223322 246160 300207 790344 694716 472034 336310
5010 336310 250265 376737 191074 188257 156480 348119 726934 997853 909356 690493 504926
4999 504926 731097 471641 380260 780488 1239047 1065145 592231 152526 328947 131644
4989 131644 206434 222813 842524 1203556 953019 338361 42076 -357314 -573832 -208075
4979 -208075 299360 501406 361756 -93128 -31576 346090 248118 546882 715158 454427
4969 454427 379034 620061 935330 1218676 1373076 1343999 947307 850868 765354 557288
4959 557288 442174 245203 115401 182436 152370 -36425 385149 369492 475949 639162
4949 639162 851496 679914 984415 1007455 354554 365718 531021 328346 87750 51081
4939 51081 158496 412523 430760 573128 781041 914293 882965 1244084 1300994 1047484
4929 1047484 436969 179354 515013 692751 797853 1089945 915071 736199 713940 522012
4919 522012 134949 186138 358200 239721 -7771 -242523 -470724 -136206 1668 58784
4909 58784 -87558 -31583 416351 700167 552312 474182 592320 361533 156262 517195
4899 517195 189788 210269 409791 399136 -260438 -327499 -110351 174499 465947 192405
4889 192405 16922 3760 -26645 57017 93777 84160 -80234 -297459 -644965 -673153 -57238
4878 -57238 97450 42641 254838 15929 160826 502728 509688 406798 306530 217613 520218
4867 520218 988632 1263314 1097218 755111 373279 460683 827944 825083 455206 406057
4857 406057 662922 962305 564019 221193 342831 338594 282285 383316 464656 545355 913429
4846 913429 980231 958060 1042639 502823 114974 44326 169997 315934 264579 113840 51670
4835 51670 40711 318022 311274 337708 569883 765800 649719 541772 565566 387685 42139
4824 42139 -14907 223528 724598 709670 766245 881010 632981 783872 461847 622657
4814 622657 922566 589839 -8692 -523288 -523318 -90581 -181224 -261138 -343822 274733 686809
4803 686809 588690 633185 448964 -39206 -111092 48436 -23283 -105646 348315 524541 555618
4792 555618 314105 561655 310442 756978 768863 774241 802613 654975 474554 234606
4782 234606 340424 387113 462973 605125 -42289 -128324 -33577 126043 -157384 409974
4772 409974 540744 139702 162051 220410 197570 4290 -573302 -880560 -356162 3976
4762 3976 199130 271750 -40000 453046 437130 -16424 361928 669686 324481 -76534
4752 -76534 -163145 -111187 -138256 -265781 -347682 66682 405018 201579 105045 275406 391299
4741 391299 285734 -120918 63515 -172030 -326737 -254890 377408 741186 684841 324325
4731 324325 225971 458253 559325 68670 -140756 -185800 -110894 11694 135986 -57582
4721 -57582 -374240 -307348 -298997 -318769 -554163 -264165 175442 281760 610964 163441 -527957
4710 -527957 -541595 117534 663472 850814 839539 810300 705490 363117 72872 37898
4700 37898 -400204 -283916 103397 87485 39633 -584415 -872289 -266785 24331 315487
4690 315487 826248 1224221 1196548 939513 867018 786634 728084 759978 561268 -23278 132038
4679 132038 331499 396688 638296 668977 369120 599175 748898 417634 243705 -82523
4669 -82523 2377 180270 12893 496401 950318 971692 533408 76165 102400 -346724
4659 -346724 -481911 -82857 187865 441147 253588 -207884 -200551 369057 524356 320259
4649 320259 188105 -159114 -22000 184953 30301 -288838 -277640 -110442 -36224 622194
4639 622194 914611 218292 -315671 -600269 -302302 129007 12301 -322940 12047 608745
4629 608745 488303 275897 182981 448146 677059 580734 609054 571885 142878 -118037
4619 -118037 236306 596915 479876 204764 -140457 -203687 -168488 101678 483893 418139
4609 418139 615864 650019 355368 349841 441003 612882 719366 604099 474641 154267
4599 154267 -257727 42695 43132 -361515 129373 604798 390667 455497 192284 373459
4589 373459 515354 580687 704864 632382 522012 178753 271239 536416 274545 89474
4579 89474 221133 259871 60946 -136855 -247576 448031 633516 264982 391158 206908
4569 206908 724432 1073091 891641 546994 340970 571840 139531 -136194 -338788 -141153
4559 -141153 51806 386753 454875 305021 -269907 -218387 200243 633415 721923 326618
4549 326618 448125 683354 525460 647670 688384 836288 638950 221388 -99298 -232002
4539 -232002 4113 663249 940326 546520 219155 396752 574989 424284 377837 320125
4529 320125 111236 228683 429968 295371 -105597 28502 95950 327741 750339 668589
4519 668589 642551 1265674 1256759 1041456 685409 423134 599314 433380 520960 772707
4509 772707 894628 492430 199817 66901 -115421 -523634 -671010 -387371 -283815 -42779
4499 -42779 175228 471076 683114 580921 819424 600743 495474 383706 420316 557383
4489 557383 565704 679552 396868 618320 804040 332038 -165599 -121481 213854 596250
4479 596250 445560 179050 280224 664857 825953 418360 301417 196980 312910 520118
4469 520118 683230 505468 320375 396730 490341 308010 327011 222785 195917 90885
4459 90885 309181 759356 774477 370446 537507 547387 603491 526223 663399 1012981 659675
4448 659675 311213 434713 718660 878402 776718 707108 647408 606513 914109 1001524
4438 1001524 1005969 915804 983141 1194824 884154 63081 -324129 -375263 25071 596382
4428 596382 916329 945912 565091 80742 44745 406318 240269 220241 251809 559755
4418 559755 711626 888343 685183 408203 523738 687944 930853 1037157 1012527 852957
4408 852957 87403 -253901 -238862 117941 457499 302813 -103555 79026 199789 282503
4398 282503 181265 -71006 -81542 401761 641519 632115 461725 531879 543530 522510 474257
4387 474257 556282 231175 238003 708128 541044 360581 317646 263754 223369 164865 177528
4376 177528 126396 -205188 -534876 -662958 -311426 128212 460147 298315 162625 159756
4366 159756 166350 531980 655907 360380 144478 105583 277868 182941 -241146 -46470
4356 -46470 497192 639596 353031 725673 859030 1105546 1036448 560579 373273 377022
4346 377022 697056 574884 350679 463595 479539 155522 462488 538357 162113 165781
4336 165781 359197 491021 -168800 -327585 -74700 -29054 -128139 -41677 -37557 133351 347843
4325 347843 128142 92587 184980 -424201 -325822 -23724 208374 246951 242415 155811 313110
4314 313110 310307 319417 -48874 -311728 -236976 -93345 -31418 -174126 -273546 -124092 69142
4303 69142 327660 263809 -44743 188920 591505 708342 811586 763553 440685 188168
4293 188168 339433 236956 322363 251171 138245 288032 99579 -348116 -231920 309848
4283 309848 434949 716012 617324 674456 491430 701938 779547 446028 182769 228472
4273 228472 675320 1004224 451337 46285 71536 116349 553336 421296 188601 157440
4263 157440 173915 275042 321196 463442 227121 103487 180176 194883 111614 -4486 18855
4252 18855 -223060 -549487 -492602 -711120 -465847 114343 285377 338645 45660 121357
4242 121357 443717 628530 695528 624204 625863 423296 274774 544381 744639 763611 580900
4231 580900 240876 -58235 203360 258669 -56522 -429487 -139755 197737 456390 578448
4221 578448 508027 847233 1088543 833229 954594 923183 442962 1049067 1074841 1013629
4211 1013629 1353253 1517506 1393748 1202186 1326357 1046256 951274 1002479 713737 771817
4201 771817 700074 167466 225813 569067 342214 540796 526092 527902 522033 638268 689446
4190 689446 1036255 1056416 1022479 326558 -106270 -141535 206102 -74475 -306132 -322636
4180 -322636 -98800 -143743 -367257 -99501 -232381 -369575 -206478 137806 185687 -40760
4170 -40760 -20135 444275 425387 110965 32885 377171 663478 541262 513537 466828 628821
4159 628821 848817 535434 577903 595868 590125 365979 438437 448307 88005 159956 284414
4148 284414 497867 731867 363743 95251 -115758 -125368 -60744 -43937 233480 410574
4138 410574 827890 857868 577968 788295 1146093 700553 586776 1031146 1058129 822296
4128 822296 890749 1246471 1535435 1416286 770595 418336 333007 299215 219889 412372
4118 412372 599003 446155 204870 114985 120308 433522 949163 1073308 837307 854809
4108 854809 1152798 1231019 983995 1031879 1144695 923728 744059 708924 544661 594232
4098 594232 496112 293372 521701 1054113 880911 926793 1245739 524734 468721 665282
4088 665282 777663 1203213 1365132 1141646 538194 613522 812545 578579 693288 788935
4078 788935 636860 432468 176636 340047 723516 594759 259072 296009 10898 -352358
4068 -352358 -490575 -317720 150 114761 103980 54045 211784 449885 642833 487863
4058 487863 280235 -86689 -573280 -8252 275324 349544 212210 43111 218099 259892
4048 259892 633576 537227 516670 567795 525785 661618 352942 248486 610285 518474 139392
4037 139392 -82029 306569 256558 132604 357489 841545 825839 599978 347595 120598
4027 120598 3481 68664 573773 340731 70063 101164 -87227 -240032 -96695 355452
4017 355452 465681 497088 421462 159259 -12813 321427 686383 526875 410233 487719
4007 487719 293534 319936 35347 211447 603447 382762 432731 587968 751001 441906
3997 441906 195605 403584 1010341 959919 481391 416312 164618 444633 417761 550695
3987 550695 588519 274057 106692 609165 789048 793592 1005716 1011679 1000180 739722 622311
3976 622311 571520 497303 362142 386609 574783 714618 356739 195210 176420 191718 97376
3965 97376 161597 309228 -317606 -585808 -676256 -615267 -414170 -331257 -408595 -49497 -216774
3954 -216774 -195527 8172 441319 797025 753231 590523 446153 669490 719717 753497
3944 753497 455142 207349 16550 494273 487302 691866 1172589 1012737 675330 527569
3934 527569 399637 449735 279407 519957 642647 333437 82862 -121464 -78786 413188
3924 413188 374304 380373 535086 600912 523272 709596 723708 597719 367742 356940 597447
3913 597447 441400 667004 804845 602631 1034175 862001 355626 770845 593574 822988
3903 822988 955152 679179 640242 337165 -31298 -38074 203751 35186 -87724 330700
3893 330700 322778 218745 92704 -26996 146356 115925 30186 -213458 -281629 1805 396727
3882 396727 396764 -7622 58491 116005 459672 413941 418576 547198 922952 689676 684384 532222
3870 532222 358817 327171 493530 626299 365216 371966 602695 659564 368451 265179
3860 265179 116435 -27435 78471 629004 1056818 897161 560963 337812 123316 -265018
3850 -265018 -111831 509228 765538 653086 349502 91468 -418366 -270650 125282 -53824
3840 -53824 217448 173866 25365 -120393 193019 509040 537512 587538 280740 334723 599390
3829 599390 346180 422337 513482 468754 622059 1127140 1178450 970673 486618 122431
3819 122431 111554 -36107 32718 -169036 -200825 -68814 18896 63963 120422 -156593 -66746
3808 -66746 30295 100608 190072 292684 75898 320562 643756 571892 1013376 919127 770840
3797 770840 755349 713111 549559 626261 353831 444956 355248 324224 76435 309577 471559
3786 471559 579446 -32937 171308 649067 554970 582872 246896 40634 133360 671904
3776 671904 274068 20826 486143 517136 784945 1292121 1126034 1035884 757668 1074522
3766 1074522 1283185 1095689 603750 577607 287930 110366 618641 892161 452355 586387
3756 586387 770739 790206 651320 823033 677570 417167 324904 326292 187076 251394 555755
3745 555755 753529 811033 606938 393052 304981 466591 553993 144486 302545 464737
3735 464737 695777 795643 537308 380663 247321 171270 574567 782944 523134 52004
3725 52004 230321 711113 1142587 1632673 1312735 581264 579244 431139 293920 312256
3715 312256 356796 402511 -57029 -59060 480296 705486 572781 744885 729148 737731 666055
3704 666055 758402 461968 229267 419246 455461 424614 507772 793428 795703 664062 759123
3693 759123 674452 367173 81267 -66868 112112 -31172 227316 479416 604183 723241
3683 723241 426312 262718 372524 431212 317453 -164729 119652 612120 845696 686965
3673 686965 764436 760390 391141 188649 219882 63096 62983 349389 536635 384152 -2486
3662 -2486 207135 506446 308192 175422 219673 177641 342820 336149 541541 638289 676802
3651 676802 210037 188788 504338 807201 980318 892730 753181 125878 141429 151464
3641 151464 263851 520391 549720 826376 1023594 768748 564297 259895 195840 51898
3631 51898 170922 162725 485301 431915 328595 70779 110022 455722 364862 456531 567332
3620 567332 377178 259032 35582 136526 278213 69203 146579 234766 339210 343941
3610 343941 641509 799122 823503 487681 505857 435446 15850 -17535 241396 20212
3600 20212 184536 526175 396340 263584 127438 254413 500197 227342 -95300 -179349
3590 -179349 -155227 370139 784202 1017064 658903 303659 299148 297816 77309 126006 -58034
3579 -58034 -193365 -257517 275689 48184 -420961 -132630 -10655 155056 281696 252409
3569 252409 221231 400955 656604 277198 -206907 -354051 -405577 212612 392917 93403
3559 93403 71752 315864 466598 690162 906276 916845 472412 112883 454758 646037
3549 646037 570894 477163 414653 594601 657447 703679 501804 738181 715289 509624 223225
3538 223225 -257153 -208889 -13166 -299207 -172466 242536 644502 473324 233307 98177
3528 98177 282676 207549 -175301 -366828 -339883 -235464 271908 525158 493793 511946 439838
3517 439838 44779 -285024 -217846 -219862 -590521 -318920 -67827 185858 366254 -104631
3507 -104631 -675407 -347341 -120556 -21393 -100345 -216147 -67418 -40911 -32602 248857 619931
3496 619931 387089 348433 528802 766462 468556 52641 485205 576356 400451 630967
3486 630967 386838 221882 -7268 168595 292922 355955 354350 380611 842318 1059675
3476 1059675 1067392 782915 534340 165568 -171144 -1016 49042 -103001 -104929 133587
3466 133587 447249 544615 225349 184181 116552 -93740 129959 159821 347671 894056
3456 894056 1077219 989031 777927 375103 277392 416766 519680 202559 547698 568186
3446 568186 790897 690548 58196 72127 186842 172588 200667 437241 880041 1039552
3436 1039552 1118651 1030051 877926 454890 191194 262232 414004 349322 275999 188896 -153121
3425 -153121 -42867 300286 567770 600157 286804 460418 641127 439455 177257 425535
3415 425535 853556 679875 327534 209597 332559 547585 9552 -327071 36142 318211
3405 318211 82686 44255 241484 191993 686694 1205855 826425 931208 685553 517582
3395 517582 718960 815586 901983 968885 751526 834254 1083346 726828 522381 542815 565973
3384 565973 398620 27653 303621 274243 556998 666518 954129 654102 552379 364623
3374 364623 315088 661473 422890 -97130 112964 477508 615349 328641 304872 216619
3364 216619 64224 -173872 155449 170771 -181138 -140929 59542 181441 300253 291863
3354 291863 510303 66205 -80699 166404 369568 435097 224704 -73214 -156346 -118206
3344 -118206 40254 -367405 -255845 95824 453049 514826 375526 447158 32860 -20318
3334 -20318 -277490 -92884 316487 463584 454122 807449 928784 679858 951129 1462653
3324 1462653 1434307 1033387 487767 439657 130530 206080 235172 -92462 -768989 -304321
3314 -304321 281540 305328 339714 564217 280727 197806 531611 783765 577928 137437
3304 137437 19830 -134263 -159078 48118 293655 114092 -45030 -214947 -53213 487151
3294 487151 645701 299156 170235 -82321 -90866 96256 145419 33182 93455 493043
3284 493043 539313 400317 442254 346684 204258 111240 87509 30970 -86456 -160743 -123439
3273 -123439 -168940 185288 590591 670242 760277 588157 1050895 519505 696034 1087515
3263 1087515 861638 295001 424295 364639 601267 819267 613422 269278 76267 271665
3253 271665 377125 476170 541531 989380 1025802 1007622 637241 -97626 -214489 129946
3243 129946 537857 914056 1025609 1090983 1164738 1089971 726668 217906 380116 326686
3233 326686 408754 197686 233854 565313 655241 158772 448724 485432 315479 422626
3223 422626 707439 870144 904624 652033 589682 1081041 1065664 593137 154695 285561
3213 285561 284544 725263 851635 486785 536820 479418 548587 612655 377068 278933 567691
3202 567691 361482 197264 -14951 97378 108256 108108 -89256 -160546 302925 849495 943018
3191 943018 666880 457187 140203 126778 562780 958749 903196 917858 1045463 761096
3181 761096 338459 28635 -289921 -340593 -196421 189405 480587 494201 522319 146456
3171 146456 -68783 -263689 -16972 506053 484773 117453 -320206 -546408 -257772 -241836
3161 -241836 -158175 448826 410854 364226 353786 426196 301930 320170 -64167 -82392 139817
3150 139817 294424 157355 -35831 -31556 26625 -80369 -66668 -281392 -183920 615461 723310
3139 723310 669687 205798 -232352 251994 558344 646049 293986 43114 414530 797445
3129 797445 1169319 1104851 935168 435226 194364 -297300 -139479 97004 -93656 -344106
3119 -344106 -299418 37892 170494 82874 140638 297751 341635 450288 232840 47490
3109 47490 110704 -221827 4754 237603 362418 49893 -318059 31485 173988 218699
3099 218699 68614 451198 699855 749390 592138 467810 510562 429290 388686 276464
3089 276464 97688 584071 839774 494631 599988 855173 577227 239355 187071 280421
3079 280421 515058 586589 431032 504175 625986 541307 229376 189691 338496 819406
3069 819406 846803 1110710 1506952 1460699 931659 828434 844546 510821 458364 553954 195839
3058 195839 -86999 -324358 -108445 -116076 232719 929835 1002739 858453 423393 721330
3048 721330 899618 1045275 1086362 705836 435550 365552 749819 840990 536218 -96334
3038 -96334 -73029 138291 275646 312142 133276 -272403 -395414 -98719 223486 615272
3028 615272 534170 59018 -157220 -367483 -268937 -345945 -192720 -5421 377585 519980
3018 519980 37029 203924 621125 327160 180997 -109312 -350743 -39958 612114 700290
3008 700290 283186 666624 794793 440719 186110 553357 755450 818374 817002 486536
2998 486536 403686 323147 481249 451478 344958 -54883 -99954 -7203 -162783 -209120 -25032
2987 -25032 -166256 254825 744506 494837 379160 718923 589965 394137 317829 479567
2977 479567 256457 162146 758828 905196 470132 332116 580068 556693 337061 691407
2967 691407 581554 362527 406262 403223 487434 200827 338306 204839 112594 182607 426638
2956 426638 462555 33760 -23408 44355 251248 238845 201437 342922 -177396 -378513 56890
2945 56890 46649 530780 637817 547090 158708 -26143 9062 -197723 -2802 325330
2935 325330 485675 587883 571417 338967 270944 651867 549561 252337 454077 723269
2925 723269 777564 926958 887165 852114 785177 470385 186574 306840 308975 663978 309440
2914 309440 -434900 -708222 -398438 168578 215576 432292 945569 745491 715162 689467
2904 689467 774714 455628 433729 267450 35076 407108 429301 366485 89529 267602
2894 267602 519326 511755 333441 299757 592111 251965 -238418 -485404 -895106 -390462
2884 -390462 -4917 -104906 238182 446166 68437 -309035 -206247 -498392 -275255 -149791
2874 -149791 -80766 -207229 -63593 -200091 -768741 -590057 -43981 145205 172421 -77732
2864 -77732 -380154 -618454 -118108 306891 552187 229963 140521 387701 135894 207401
2854 207401 265961 295798 189695 -243782 286185 777499 882931 761168 501573 789397
2844 789397 471929 479347 653519 573342 575442 620483 578379 483748 134772 -338379 -276448
2833 -276448 -564671 -695460 -634290 -196932 -3340 163896 -73831 -207661 -230633 -76421
2823 -76421 -309042 -30926 135895 361175 127771 -132203 -275235 -127444 -72390 96226
2813 96226 168091 -51485 27592 -211159 -129848 281010 571606 275008 317682 509047 448620
2802 448620 396616 618944 240352 -85277 -7082 -77150 -23281 227145 628049 326942
2792 326942 372827 323736 139354 154580 385784 638426 765557 1001637 1237586 980529
2782 980529 608246 -21312 -58781 -78706 -103953 95105 77732 40830 253402 128020 305432
2771 305432 728542 1038842 1267689 968287 896310 327136 -25841 57900 190722 286002
2761 286002 318179 396139 339628 137302 305042 605439 517355 156507 113972 446331 420250
2750 420250 340540 562643 848384 552567 362110 302251 -237311 -499681 -644062 -359991
2740 -359991 -165539 319603 636930 207125 170162 -43976 -513728 -309823 -150806 -36952
2730 -36952 326823 788125 1155963 925176 227788 -13672 -12586 -137402 -30536 101733
2720 101733 -69674 368148 464699 138368 -213449 -242663 303149 498976 694832 1008231
2710 1008231 934515 757816 561915 260713 292239 -17529 168030 364310 545692 504431
2700 504431 391566 176495 194140 262681 -44823 -447976 -230855 -2718 367486 298332
2690 298332 511140 1158572 872778 854600 925332 390068 542117 679662 210263 283997
2680 283997 229965 213991 181644 -267260 -328305 -26091 119218 202662 -41221 -62324 196074
2669 196074 54200 132451 213660 187205 232132 56608 -95797 -87759 190007 80977 188976
2658 188976 445515 248774 227416 428913 529479 541474 181743 145713 709745 810321
2648 810321 582156 378123 -73468 82989 365787 554552 804764 400316 140143 -122846
2638 -122846 -317658 292980 589392 247866 29818 -208822 -219107 41132 -107519 2673
2628 2673 374724 789232 506033 114140 190065 280146 -43321 -400210 -227187 153489
2618 153489 125633 82838 621704 894617 890085 630078 76852 -219905 123170 434090
2608 434090 430294 505187 447353 411266 361153 229277 169432 165167 129786 213161 226524 -28819
2596 -28819 228989 246134 -105899 444446 1056556 1042857 1007209 620716 323240 -216732
2586 -216732 -302126 -299347 -18274 649571 822245 659979 498005 507298 384292 627694 800670
2575 800670 961375 382580 -39242 -604166 -400516 -135233 -261888 -327841 -500771 -586465
2565 -586465 -302632 203946 685740 493590 266227 102774 -154383 -573297 -320404 -393221
2555 -393221 -111797 -155046 106496 708695 1135086 747104 564559 556951 410045 851721
2545 851721 935727 806593 218445 4790 261203 300099 654665 317262 289524 501729
2535 501729 201803 67979 383308 208020 9236 -106456 -101008 -368978 -415241 -55011
2525 -55011 368538 559275 289305 123666 -252616 -743547 -686269 -848943 -585375 -69054
2515 -69054 159238 395222 362020 -50911 -116547 -163095 166841 377098 267818 167362
2505 167362 251884 303132 518786 431016 368253 205630 573821 657847 267639 290667 217116
2494 217116 155291 462215 499659 299589 -172795 -104650 -6793 351101 407098 -4378 49151
2483 49151 -178554 -408730 -72149 99455 -60433 -137682 -22167 164606 506956 741026
2473 741026 669323 527561 274035 186028 114086 -32249 107961 155384 354811 77077
2463 77077 53416 404682 417701 569207 698298 364369 -28429 47634 233914 354814
2453 354814 439313 548967 424787 633860 660677 605097 294665 230461 282640 -4789 -363827
2442 -363827 -156893 -252978 -635020 -82994 225991 42861 213050 791488 634824 629704
2432 629704 842345 1047007 1037439 846128 593610 354398 349013 513171 378981 435367 772233
2421 772233 836002 755400 751763 479380 662160 939576 1007726 691667 264063 242529 303229
2410 303229 133870 151402 450481 698043 408090 381082 256573 209833 -345113 -83189
2400 -83189 219521 204410 20682 281170 165357 -3664 91113 27701 107821 69385 188171
2389 188171 281919 -46671 -340440 -345595 -237085 -218797 365820 264891 327249 525648 375945
2378 375945 242208 214917 -20694 -74630 59720 29272 328812 340320 62203 142872 38618
2367 38618 197719 40507 -334254 -489322 -451489 -755386 -405166 225823 314523 288237
2357 288237 500791 159062 10222 -81680 -227794 129805 231370 317525 358508 404340
2347 404340 445424 237329 -37687 -56574 38163 -93024 -55046 -101380 -351898 -72137 150232
2336 150232 -40883 -84131 -275662 -398799 -168949 -63275 -131857 -121744 -589317 -126601
2326 -126601 296803 422775 488725 251446 205489 161216 273283 303678 104894 -132589
2316 -132589 289499 1078005 877711 543175 178125 168528 157282 493637 473415 429878 588214
2305 588214 624531 753060 433568 231475 226873 204330 338089 284069 481312 654953 891053
2294 891053 687846 224145 172186 48055 -320697 -665790 -165230 150634 330146 416874
2284 416874 234175 -2841 -10570 -79920 -354587 -283365 346762 618843 77651 -234839
2274 -234839 -83724 273009 544271 310073 452917 653802 712741 259397 -199210 -296952
2264 -296952 174982 454290 281395 119648 -174924 -329095 -379415 -209524 -266930 -9541
2254 -9541 278739 322785 358079 391512 480829 671629 715032 580047 361981 649464 808236
2243 808236 806079 895433 470934 52896 109519 134285 462324 338018 492284 448570 126304
2232 126304 242032 220187 120610 284357 513437 760869 521780 -116424 -286113 -146612
2222 -146612 148938 255357 73938 222229 503107 655326 1019093 586297 -113699 -425550
2212 -425550 -147064 -18066 348659 406943 618861 524902 184749 314712 381644 270424
2202 270424 -42596 259705 363249 336930 674077 746348 612073 238211 11834 -171880
2192 -171880 -273523 -352187 -63356 341652 202833 -232990 -234198 -120627 -359987 -303238
2182 -303238 -401971 -216817 -49899 -153547 205642 276568 506460 775436 327979 -12162
2172 -12162 -54707 151324 620477 376666 -1879 347733 358307 35968 37299 132838 324826
2161 324826 448235 423205 -120143 -219832 -85470 -3871 -106930 -268622 -188697 -256391 -88422
2150 -88422 56940 -14276 1542 154445 99264 503729 281922 -38905 -278972 -413298
2140 -413298 -323176 -312507 -173787 48281 169294 -98441 105390 274436 136323 343908
2130 343908 317874 224454 205189 362997 630862 661408 502304 171434 -912 236874
2120 236874 485771 551624 408151 664586 494715 -59913 -166463 -198083 -26004 207816
2110 207816 -21691 53286 422699 109809 -168079 -254344 -395842 -46119 161051 18017
2100 18017 343953 540887 723079 814950 680579 717084 935010 469828 -39906 368010
2090 368010 542506 522932 264944 140836 358087 315091 49616 -208172 -312705 -100158
2080 -100158 30257 -165981 124259 531390 773678 906424 455829 -13166 286660 453014
2070 453014 361481 75579 -138309 211597 564712 97290 81345 114875 -286608 -193382
2060 -193382 -249192 178120 167577 152880 192373 65374 -32550 -306086 -244867 -235725 -88301
2049 -88301 358271 502803 60712 324266 587231 187258 -44340 -28977 -81813 -74833 -384790
2038 -384790 -647718 -480948 -186454 -22764 25130 -163578 -59868 224232 246968 279452
2028 279452 574394 686887 775286 257520 -225286 -440905 -420896 -239478 356161 121330
2018 121330 257405 458098 470737 492211 605642 784689 785054 512604 220960 427558 342679
2007 342679 -16493 -36584 -243632 -121771 174435 471110 487996 -42614 -401475 -349224
1997 -349224 -105195 -10341 -199513 -65445 -15238 -236260 -311 -323055 -607525 -140714
1987 -140714 54780 -35608 -199158 12615 -161937 -370957 -215663 -126709 -174023 9408
1977 9408 302357 20316 -295596 -525472 -857327 -503368 -181665 -334934 -293894 -141906
1967 -141906 244156 428381 701147 707076 518628 591054 602490 449316 462169 631965 649418
1956 649418 707686 449505 74821 -179457 -210353 -744069 -880811 -429075 -239525 -346014
1946 -346014 -295162 -193522 -85121 -192724 -102979 127927 -82288 -77187 -232137 -237932 -244852
$$ [...]
##END NTUPLES=NMR SPECTRUM
##END=
