##TITLE=Analysis number 318506
Compound Code mo 00640
Project Code adrs
Chemist Name ugmt
##JCAMPDX= 6.0         $$ Bruker NMR JCAMP-DX V2.0
##DATA TYPE= NMR SPECTRUM
##DATA CLASS= NTUPLES
##ORIGIN= Bruker BioSpin GmbH
##OWNER= nmr
$$ XWIN-NMR		Version 3.5
$$ Thu Mar 30 11:57:30 2006 GMT Daylight Time (UT+1h)  MAYBRIDGE\nmr@NMR_250MHZ
##.OBSERVE FREQUENCY= 250.131544655141
##.OBSERVE NUCLEUS= ^1H
##.ACQUISITION MODE= SIMULTANEOUS (DQD)
##.ACQUISITION SCHEME= undefined
##.AVERAGES= 16
##.DIGITISER RES= 18
##SPECTROMETER/DATA SYSTEM= dpx250
##.PULSE SEQUENCE= zg30
##.SOLVENT NAME= CDCl3
##.SHIFT REFERENCE= (INTERNAL, CDCl3, 0, 16.522)
##AUDIT TRAIL= $$ (NUMBER, WHEN, WHO, WHERE, WHAT)
$$ ##TITLE= Audit trail, XWIN-NMR		Version 3.5
$$ ##JCAMPDX= 5.01
$$ ##ORIGIN= Bruker BioSpin GmbH
$$ ##OWNER= nmr
$$ C:\u/data/dgb/nmr/ADRS/1940/pdata/1/auditp.txt
$$ ##AUDIT TRAIL=  $$ (NUMBER, WHEN, WHO, WHERE, WHAT)
(   1,<2006-03-30 11:57:06.80 +100>,<MAYBRIDGE\nmr>,<NMR_250MHZ>,
      <created by zg, POWCHK disabled, PULCHK disabled
       configuration hash MD5:
       84 BC 41 DB A1 6E 1D 46 DA 25 12 A5 C1 ED C5 3A
       data hash MD5: 64K
       94 76 99 D3 17 F5 78 A5 6F 69 73 92 1A 25 0D 79>)
(   2,<2006-03-30 11:57:19.99 +100>,<MAYBRIDGE\nmr>,<NMR_250MHZ>,
      <Start of raw data processing
       ef LB = 0.3 FT_mod = 6 PKNL = 1 SI = 32K 
       data hash MD5: 32K
       28 CF EC 8F 3D 6F 3C F5 56 44 E9 92 4B BF DA 8F>)
(   3,<2006-03-30 11:57:21.61 +100>,<MAYBRIDGE\nmr>,<NMR_250MHZ>,
      <apk 
       data hash MD5: 32K
       D8 97 05 D2 8A 12 F8 6C C8 A4 22 27 AA 0E BF 58>)
(   4,<2006-03-30 11:57:22.38 +100>,<MAYBRIDGE\nmr>,<NMR_250MHZ>,
      <abs ABSG = 5 
       data hash MD5: 32K
       09 58 E9 C6 60 E0 60 55 B3 19 72 4A D4 10 2D 72>)
$$ ##END=
$$ 
$$ hash MD5
$$ 46 AC 04 9E 0D 11 42 78 EC 95 A0 D3 55 86 DD 4B
##$RELAX= 
##$RELAX= 
##$RELAX= 
##$RELAX= 
##$RELAX= 
##$RELAX= 
##$RELAX= 
$$ Bruker specific parameters
$$ --------------------------
##$DU= <C:\u>
##$EXPNO= 1940
##$NAME= <ADRS>
##$PROCNO= 1
##$TYPE= <nmr>
##$USER= <dgb>
##$AMP= (0..31)
100 100 100 100 100 100 100 100 100 100 100 100 100 100 100 100 100 100 
100 100 100 100 100 100 100 100 100 100 100 100 100 100 
##$AQSEQ= 0
##$AQ_mod= 3
##$AUNM= <au_zg>
##$AUTOPOS= <25 >
##$BF1= 250.13
##$BF2= 250.13
##$BF3= 250.13
##$BF4= 250.13
##$BF5= 500.13
##$BF6= 500.13
##$BF7= 500.13
##$BF8= 500.13
##$BYTORDA= 1
##$CFDGTYP= 0
##$CFRGTYP= 5
##$CHEMSTR= <none>
##$CNST= (0..31)
1 1 145 1 1 1 1 1 1 1 1 1 1 1 1 1 1 1 1 1 1 1 1 1 1 1 1 1 1 1 1 1 
##$CPDPRG= <>
##$CPDPRG1= <>
##$CPDPRG2= <>
##$CPDPRG3= <>
##$CPDPRG4= <mlev>
##$CPDPRG5= <mlev>
##$CPDPRG6= <mlev>
##$CPDPRG7= <mlev>
##$CPDPRG8= <mlev>
##$CPDPRGB= <>
##$CPDPRGT= <>
##$D= (0..31)
0 1 0 0 0 0 0 0 0 0.06 0 0 0 0 0 0 0.0002 0 0 0 0 0 0 0 0 0 0 0 0 0 0 
0 
##$DATE= 1143716225
##$DBL= (0..7)
120 120 120 120 120 120 120 120 
##$DBP= (0..7)
150 150 150 150 150 150 150 150 
##$DBP07= 0
##$DBPNAM0= <>
##$DBPNAM1= <>
##$DBPNAM2= <>
##$DBPNAM3= <>
$$ [...]
##$SUBNAM7= <"">
##$SUBNAM8= <"">
##$SUBNAM9= <"">
##$SW= 20.6930455092707
##$SWIBOX= (0..15)
0 0 3 0 0 0 0 0 0 0 0 0 0 0 0 0 
##$SW_h= 5175.983436853
##$TD= 65536
##$TD0= 1
##$TE= 294.16
##$TE2= 300
##$TE3= 300
##$TEG= 300
##$TL= (0..7)
0 120 120 120 120 120 120 120 
##$TP= (0..7)
150 150 150 150 150 150 150 150 
##$TP07= 0
##$TPNAME0= <>
##$TPNAME1= <>
##$TPNAME2= <>
##$TPNAME3= <>
##$TPNAME4= <>
##$TPNAME5= <>
##$TPNAME6= <>
##$TPNAME7= <>
##$TPOAL= (0..7)
0.5 0.5 0.5 0.5 0.5 0.5 0.5 0.5 
##$TPOFFS= (0..7)
0 0 0 0 0 0 0 0 
##$TUNHIN= 0
##$TUNHOUT= 0
##$TUNXOUT= 0
##$USERA1= <user>
##$USERA2= <user>
##$USERA3= <user>
##$USERA4= <user>
##$USERA5= <user>
##$V9= 5
##$VALIST= <valist>
##$VCLIST= <CCCCCCCCCCCCCCC>
##$VD= 0
##$VDLIST= <DDDDDDDDDDDDDDD>
##$VPLIST= <PPPPPPPPPPPPPPP>
##$VTLIST= <TTTTTTTTTTTTTTT>
##$WBST= 1024
##$WBSW= 4
##$XGAIN= (0..3)
0 0 0 0 
##$XL= 0
##$YL= 0
##$YMAX_a= 448022
##$YMIN_a= -502113
##$ZGOPTNS= <>
##$ZL1= 120
##$ZL2= 120
##$ZL3= 120
##$ZL4= 120
##$ABSF1= 16.522
##$ABSF2= -4.171173
##$ABSG= 5
##$ABSL= 3
##$ALPHA= 0
##$AQORDER= 0
##$ASSFAC= 0
##$ASSFACI= 0
##$ASSFACX= 0
##$ASSWID= 0
##$AUNMP= <proc_1d>
##$AZFE= 0.1
##$AZFW= 0.1
##$BCFW= 0
##$BC_mod= 0
##$BYTORDP= 0
##$COROFFS= 0
##$CY= 12.5
##$DATMOD= 1
##$DC= 0
##$DFILT= <>
##$DTYPP= 0
##$F1P= 14.0000005364418
##$F2P= -0.99999901652339
##$FCOR= 0.5
##$FTSIZE= 32768
##$FT_mod= 6
##$GAMMA= 0
##$GB= 0
##$INTBC= 1
##$INTSCL= 1
##$ISEN= 128
##$LB= 0.3
##$LEV0= 0
##$LPBIN= 0
##$MAXI= 10000
##$MC2= 0
##$MEAN= 0
##$ME_mod= 0
##$MI= 0
##$NCOEF= 0
##$NC_proc= -2
##$NLEV= 6
##$NOISF1= 0
##$NOISF2= 0
##$NSP= 0
##$NTH_PI= 0
##$NZP= 0
##$OFFSET= 16.522
##$PC= 1
##$PHC0= 168.1568
##$PHC1= 6.390033
##$PH_mod= 1
##$PKNL= yes
##$PPARMOD= 0
##$PSCAL= 4
##$PSIGN= 0
##$REVERSE= no
##$SF= 250.13
##$SI= 32768
##$SIGF1= 0
##$SIGF2= 0
##$SINO= 400
##$SIOLD= 32768
##$SREGLST= <1H.CDCl3>
##$SSB= 0
##$STSI= 32768
##$STSR= 0
##$SW_p= 5175.98343685301
##$SYMM= 0
##$S_DEV= 0
##$TDeff= 65536
##$TDoff= 0
##$TI= <Analysis number 999999
Compound Code 99
Book Reference 9
Project Code 9>
##$TILT= no
##$TM1= 0
##$TM2= 0
##$TOPLEV= 0
##$USERP1= <user>
##$USERP2= <user>
##$USERP3= <user>
##$USERP4= <user>
##$USERP5= <user>
##$WDW= 1
##$XDIM= 32768
##$YMAX_p= 331568727
##$YMIN_p= -62966
$$ End of Bruker specific parameters
$$ ---------------------------------
##NTUPLES= NMR SPECTRUM
##VAR_NAME=  FREQUENCY,     SPECTRUM/REAL,   SPECTRUM/IMAG
##SYMBOL=    X,             R,               I
##VAR_TYPE=  INDEPENDENT,   DEPENDENT,       DEPENDENT
##VAR_FORM=  AFFN,          ASDF,            ASDF
##VAR_DIM=   32768,         32768,           32768
##UNITS=     HZ,            ARBITRARY UNITS, ARBITRARY UNITS
##FACTOR=    0.157963299565203, 1,           1
##FIRST=     4132.6476996994, 0,             0
##LAST=      -1043.33573715361, 0,           0
##MIN=       -1043.33573715361, -62966,      0
##MAX=       4132.6476996994, 331568727,     0
$$ Real data points
##PAGE= N=1
##DATA TABLE= (X++(R..R)), XYDATA
$$ [...]
17071B2419N555q735K274m698l541r867n697r463K023J1496J06Q092n943o545
17057b524q869P951J210j3677k818O97J9090J9430j3418j2755O13K991k216Q602
17043D307k998P400P124N340r082l828l501Q687K729p178r584j4089j9108l623
17029c7404M743L369K046Q823l133J1819n456k57J125M265k24J1406q852m86p691
17014a5907J1302r283p174R318J211p015M256K836J5033L798j2456k484r167J7344
17000A612K740l668j1458m448q386o953K1412N773l415n377J9369J0997j5282
16987B916j777j865j6185K177Q708j842j5712M39o08o339M938J443P439P885n415
16972a3798J2138N887j0417k2407n458J0608J1188J0136m429N58k910j3196r021
$$ plain form
17071 22419 27974 19239 21513 16815 13274 3407 -2290 -11753 -9730 1766 1872 9964 4021 -2524
17057 -2524 -11393 -3442 -2232 -15909 -18727 -18030 1060 20490 7072 -5683 -5070 -2079 -4295 4307
17043 4307 1309 8709 15833 21173 12091 8263 4762 13449 16178 9000 -584 -14673 -33781 -37404
17029 -37404 -32661 -29292 -27246 -18423 -21556 -9737 -15193 -15450 -14325 -10060 -10284 1122 -7730 -8216 -15907
17014 -15907 -4605 -13888 -21062 -11744 -10533 -17548 -13292 -10456 4577 8375 -4081 -6565 -15732 1612
17000 1612 4352 684 -10774 -15222 -23608 -30561 -9149 -3376 -6791 -12168 7201 18198 2916
16987 2916 1139 -726 -16911 -14734 -6026 -7868 -23580 -23141 -23749 -30088 -25150 -23707 -16268 -8383 -13798
16972 -13798 -1660 4227 -6190 -28597 -34055 -23447 -12259 -2123 -6552 -5994 -8904 -22100 -31121
16959c1121O201Q127J671j0269j0600K586J6210J4818q763n634l651n227n018
16946c0670k460j868J2963J2817R525m268j6574J7764l253o78O757O804j5273
16933h414j1077J700n176j4616j1377J172J2667J5547P749o306J1510J5085K648
16920A1112r406m882R392L086l596j734n635m948J5140O645k1186l10J1205m320
16906E63M676R356j644M030Q074n63p216J374R71R71L274j6346j7412R579J535
16891A222J5439k079r810N984N927Q052j0169p33R172K650j2661q281j0600j747
16877g634k7590o548K3598K2677j26j0104p821O901J2583R081o929M37M412j1280
16863A657j2775j134J8960J0610j929j2517P274J4899O904j0881j5729n111j7135
$$ plain form
16959 -31121 -24920 -16793 -15122 -25391 -35991 -33405 -17195 -2377 -11140 -16774 -20425 -25652 -30670
16946 -30670 -33130 -34998 -22035 -9218 307 -3961 -20535 -2771 -6024 -6702 55 6859 -8414
16933 -8414 -19491 -17791 -22967 -37583 -48960 -47788 -35121 -19574 -11825 -18131 -6621 8464 11112
16920 11112 1706 -3176 6216 9302 5706 3972 -1663 -6611 8529 15174 -6012 -6322 4883 563
16906 563 5239 14595 12951 16981 25055 24492 17276 18650 19621 20592 23866 7520 -9892 -313 1222
16891 1222 16661 14582 4772 10756 16683 24735 14566 13833 23005 25655 12994 4713 -5887 -7634
16877 -7634 -35224 -41772 -18174 4503 4377 -5727 -13548 -6647 5936 15017 8088 8525 12937 1657
16863 1657 -11118 -12252 6708 17318 15389 2872 10146 25045 31949 21068 5339 228 -16907
16850a6907L555O467P416N99k770J683J0138j969k7690j432J2613M937M697k162
16836h25j7826l344L622J8389J5187j285l614r808k448J216m668N91J190m865
16822h488o447J466p850P15k886l15J6640n64j0882K744R633K3070j0419j1174
16808d757J067j3499j897L977n930r382N257J2878o371Q063k882j090J2058n242
16794g750J189j761P595L801q13L924l455m627o148j2501K452R424j487M51Q114
16779a592m827k502o552J273J1480P964j4306J920j500M3O805j750j641O597J3430
16764A4842j0726o110J0190n615k773N599l726j7180l054j1587N538P256N29R654
16750g163K295O386N446j2689m631m977L235m072l067J0686J6097m213j4925j0492
$$ plain form
16850 -16907 -13352 -6885 531 1130 -1640 43 10181 8212 -19478 -20910 -8297 -3360 1337 -825
16836 -825 -18651 -21995 -18373 16 15203 13918 10304 496 -1952 -736 -5404 -4813 -3623 -8488
16822 -8488 -14935 -13469 -21319 -20604 -23490 -23805 -7165 -7729 -18611 -15867 -6234 16836 6417 -4757
16808 -4757 -3690 -17189 -19086 -15109 -21039 -30421 -25164 -12286 -18657 -10594 -13476 -14566 -2508 -7750
16794 -7750 -6561 -8322 -727 3074 2261 6185 2730 -1897 -8045 -20546 -18094 -8670 -10157 -9706 -1592
16779 -1592 -6419 -8921 -15473 -14200 -2720 5244 -9062 -7142 -8642 -8599 -1794 -3544 -5185 1412 14842
16764 14842 4116 -1994 8196 2581 -192 5407 1681 -15499 -18553 -30140 -24602 -17346 -16817 -7163
16750 -7163 -4868 1518 6964 -5725 -10356 -15333 -12098 -16170 -19237 -8551 7546 3333 -11592 -22084
16736b2084K889j0075J8945J7293K633j0283m995m146L217m999J1719L917M856
16723H887o500Q465m121l627K409k690J3863L238p685n323k6322j1864J828J6464
16709a2978K008p936j0166J5861K5498J850o964O547K202j8421P25J7079k903
16696A2402j2623m997J878r833n942O36J5760N259l858R146K539j0782j443M348
16682B490q983P299J4536p981k265j0637q562n601J34q444J1402k537J1852k263
16668i560l194n125O012P121n521j4586K654P997l059j0828k403k70P524L95J7561
16653e282O952q953o336O989K460l032j1195M372p0J2781J6708l873O206J947
16639A9674o576R403j4159j8459n119j694O26M913l911N063J8972j1124j3403
$$ plain form
16736 -22084 -19195 -29270 -10325 6968 9601 -682 -5677 -9823 -6606 -11605 114 4031 8887
16723 8887 2387 10852 6731 3104 5513 2823 16686 19924 12239 6916 -19406 -31270 -29442 -12978
16709 -12978 -10970 -18906 -29072 -13211 12287 14137 7173 13720 15922 -2499 -1774 15305 12402
16696 12402 -221 -5218 -3340 -13173 -19115 -18479 -2719 2540 -1318 7828 10367 -415 -1858 2490
16682 2490 -6493 806 15342 7361 5096 -5541 -14103 -19704 -19570 -28014 -16612 -19149 -7297 -9560
16668 -9560 -12754 -17879 -11867 -4746 -10267 -24853 -22199 -14202 -17261 -28089 -30492 -30762 -23238 -22843 -5282
16653 -5282 1670 -7283 -13619 -6630 -4170 -7202 -18397 -14025 -14095 -1314 15394 11521 17727 19674
16639 19674 13098 22501 8342 -10117 -15236 -16930 -16304 -11391 -15302 -10239 8733 -2391 -15794
16626a5794l088J3970Q327O268r925k3592L075J554J4955J2312n05j0849p349
16613a0641k425K115L762M297P058K035n36J0334N722M708k281n19j4160j5163
16599e694K935J065J5579p725q335J2404M140p260j7461l755P797P033J5272o067
16585I928q979j755J156M024Q249R251Q721N403o766j2031j764k77m047j9025
16571g912J982J940j3930j2453L710O771J1045o416j0526R563K2421P249j4207
16558g63p084l805l821j1292l142N382Q444J6007J5470N146k834q288j3720N976
16544A676O007j700j719L617J1667l418j4816n863L51q050q418n887J978K634
16530b1941l208J0420Q001J4267J098j6742K1603O836j2625M481j246o493O107
$$ plain form
16626 -15794 -18882 -4912 3415 9683 -242 -23834 -20759 -19205 -4250 8062 7557 -3292 -10641
16613 -10641 -13066 -10951 -7189 -2892 4166 6201 5665 15999 21721 26429 24148 23629 9469 -5694
16599 -5694 -2759 -1694 13885 6160 -2175 10229 14369 7109 -10352 -14107 -6310 723 15995 9928
16585 9928 949 -806 350 4374 12623 21874 30595 35998 29232 17201 15437 15160 11113 -7912
16571 -7912 -5930 -3990 -17920 -30373 -26663 -19892 -8847 -15263 -25789 -16226 6195 13444 -763
16558 -763 -7847 -11652 -15473 -26765 -29907 -24525 -16081 -74 15396 20542 17708 9420 -4300 1676
16544 1676 7683 5983 4264 7881 19548 16130 1314 -4549 -4198 -12248 -20666 -26553 -24575 -21941
16530 -21941 -25149 -14729 -6728 7539 8637 -8105 13498 20334 7709 12190 10944 4451 10558
16517A0558r085j114m493j4899p183q535K28K4302L0825j975k2228N975Q374O497
16503A7247p077j5588K784j6028L793J4110J2085j2643j7401K976J3745J832J3047
16490A2882m811k2233l44p847M408p807p549J1891R842k907p994N681M594m696
16476a6890M696O359O048l088k8093r675L761N766L384k801J1697j626j951m247
16462b6660L267N731M667O245O417j0974l506J0102N814M165p424j2020k345J7337
16448H16K1495n947L80q237q784J4660R896j319l482j2691L70j425j019l932J6395
16433A7176M802o286j6069m622m909j0395K558Q230J8753r083j5908j7024M839
16420b7938L095p84J641M838J726P188p822j2345L52j054n794R460P824Q090p209
$$ plain form
16517 10558 1473 359 -4134 -19033 -26216 -34751 -34523 -10221 20604 18629 -3599 2376 10750 17247
16503 17247 10170 -5418 -2634 -18662 -14869 -759 11326 -1317 -18718 -15742 -1997 -165 12882
16490 12882 8071 -14162 -14506 -22353 -17945 -25752 -33301 -21410 -11568 -14475 -22469 -16788 -12194 -16890
16476 -16890 -12194 -5835 213 -2875 -30968 -40643 -36882 -31116 -27732 -30533 -18836 -20462 -22413 -26660
16462 -26660 -23393 -17662 -12995 -6750 -333 -11307 -14813 -4711 1103 5268 -2156 -14176 -16521 816
16448 816 22311 16364 16744 8507 -277 14383 24279 22960 19478 6787 7157 5732 4713 781 17176
16433 17176 21978 15692 -377 -4999 -9908 -20303 -17745 -9515 9238 155 -15753 -32777 -27938
16420 -27938 -24843 -25627 -23986 -19148 -17422 -10234 -18056 -30401 -30049 -31103 -36897 -27437 -19613 -11523 -18732
16405a8732m342j138N417J810j614k501l015o55O994L360L966k349J3331M812
16391E344l856J8070k364p260L029j558j3088p473k722P129R203N20l295j0945
16377i266l930J0826J697r858J0723J1630J520O571j1264l091k081Q674q432o390
16363b671j4204q986J3310L948K531j3769j4509Q434J7649M297J4640P465k5621
16350g486k2564j0653O896J5907L850M460j5913r189J073K5865K659J1042q328
16337b381L27o378K165N356j3409J1324J7563o83n379l822q015q709P864o74J4789
16322I938L819l392Q25L483Q55k1367j8843R425J0487j714j456r034m568k745
16308b4287m998J6317J3609o620O127J0419N81j5658L299J1706l660m006l719
$$ plain form
16405 -18732 -23074 -24212 -18795 -16985 -18599 -21100 -24115 -24770 -17776 -14416 -10450 -12799 532 5344
16391 5344 1488 19558 17194 9934 12963 11405 -1683 -9156 -11878 -4749 4454 4974 1679 -9266
16377 -9266 -13196 -2370 -673 -10531 192 11822 13342 19913 8649 5558 3477 12151 3719 -2671
16363 -2671 -16875 -25861 -12551 -8603 -6072 -19841 -34350 -25916 -8267 -3970 10670 18135 -7486
16350 -7486 -30050 -40703 -33807 -17900 -14050 -9590 -25503 -34692 -33619 -7754 -5095 5947 -2381
16337 -2381 -2054 -8432 -6267 -911 -14320 -2996 14567 13884 8505 4683 -3332 -12041 -4177 -4851 9938
16322 9938 13757 10365 11190 14673 15528 -5839 -24682 -15257 -4770 -6484 -7940 -16974 -21542 -24287
16308 -24287 -29285 -12968 641 -5979 148 10567 11148 -4510 -1211 10495 6835 2829 -890
16295h90P180o851O072J604j6052j0545j0098K590K2630N682p984o535M661m913
16281a3449O141J2845M599j0622j8302j7138Q382J6795J612o484k307K842k066
16268a7152Q292o48O451o961l108O979n259q65R916r761j4585o738K1983J6797
16254E341m351M772P96j0321m573j684J4758L821k1664j009o481Q982N444Q972
16240B803Q402p076r616J115n899k636Q477K715n894K859P06O39j740m846p825
16225a7816P693r419J825j24k496k081K197l031O712R142r572m45q93N510K458
16210a0340l613p63N820J3017l678j5009N299P254J822l67Q221J681n516j2171
16196h343r127j1998J3650N529O59n881K890j595p723O781J0923L288J1638J317
$$ plain form
16295 -890 6290 -561 5511 7115 -8937 -19482 -29580 -26990 -4360 1322 -6662 -13197 -8536 -13449
16281 -13449 -7308 5537 10136 -486 -18788 -35926 -27544 -10749 -9137 -15621 -17928 -15086 -17152
16268 -17152 -8860 -9508 -3057 -10018 -13126 -6147 -11406 -12271 -2355 -12116 -26701 -33439 -11456 5341
16254 5341 990 5762 6558 -3763 -8336 -10020 4738 8559 -13105 -14114 -20595 -11613 -6169 2803
16240 2803 11205 4129 -5487 -4372 -10271 -12907 -4430 -1715 -7609 -4750 -4044 -3405 -5145 -9991 -17816
16225 -17816 -10123 -19542 -17717 -17841 -20337 -22418 -20221 -23252 -16540 -7398 -16970 -17415 -18308 -12798 -10340
16210 -10340 -13953 -14716 -8896 4121 443 -14566 -9267 -2013 -191 -558 7663 9344 3828 -8343
16196 -8343 -17470 -29468 -15818 -10289 -9630 -15511 -12621 -14216 -21939 -15158 -4235 -947 10691 12008
16182A2008r554j480r296j5822k711J3303J7587N293r037m158R097R675j3282
16169A623m627j989j1060j7570O174O869N898P396O145J0331n823l13J3083n978
16155A0159j0320R242q201k004Q563J04j1335q563L074P333L49n306k547j0045
16141a9497j4872J956q144J2040K245O105Q597O067P11oJ4386r181k3341M670
16127a8264J5873o119m776K863l194k18J2429M958R178L069p051j8870n380J2585
16113b917L160j7M981o998J073J0094O237j9526k439l768j3762q7P216K4666N088
16098A3001k314q699k019p863m455J0465J093m977RJ0895O670l762o936L275N036
16083I419l469p809r96q98K488l854R1O543l046n53n404L745P837J1607J0894
$$ plain form
16182 12008 2454 974 -8322 -24144 -26855 -13552 4035 9328 291 -3867 5230 14905 1623
16169 1623 -3004 -4993 -16053 -33623 -27449 -20580 -14682 -7286 -1141 9190 3367 3054 16137 10159
16155 10159 -161 9081 880 -1124 7439 7543 -3792 -12355 -9281 -1948 -1599 -6905 -9452 -19497
16141 -19497 -34369 -32413 -40557 -28517 -26272 -20167 -11570 -5503 -4792 -4798 9588 407 -22934 -18264
16127 -18264 -2391 -8510 -13286 -10423 -13617 -13835 -1406 3552 12730 15799 8748 -10122 -15502 -2917
16113 -2917 243 226 5207 -1791 -718 9376 15613 -3913 -6352 -10120 -23882 -23969 -16753 7913 13001
16098 13001 10687 1988 -31 -7894 -12349 -1884 -791 -5768 -5759 5136 11806 8044 1108 4383 9419
16083 9419 5950 -1859 -2855 -3753 -1265 -5119 -5028 1515 -1531 -2084 -7488 -3743 4094 15701 26595
16068B6595q325p945j4206j5452R98k866O015K386J8J862K0629P27J594l976l007
16053E047Q895j9515k358R757r600j1738J3976R628K263k561R913J864r905L840
16039I506o58l072p542l907k62J1911P995R264L647n360j0486r695l496o883n441
16024a4479n133R859j857j962L43n892j3153N093K2009J9393J5j4967p972L864
16010d839j4280l684L956M558L135J926J074l330n738j0919Q816j3218l043m103
15996c9689J303Q659N175O416L740m171o681m822p424k828Q078J2002J1098o252
15982a5396j3518j3287j896J3884j076J7259O226j199O025M258L06n877l286Q384
15968H07J1867P387l519J1585o861n831r493K987M898r896R623L459m456k6693
$$ plain form
16068 26595 18270 10325 -3881 -19333 -18335 -21201 -15186 -12800 -12782 -10920 9709 10436 12030 8054 5047
16053 5047 13942 -5573 -7931 1826 -7774 -19512 -5536 4092 6355 3794 13707 15571 5666 9506
16039 9506 8848 5776 -1766 -5673 -5935 5976 13971 23235 26882 21522 11036 1341 -2155 -9038 -14479
16024 -14479 -19612 -9753 -11610 -13572 -13229 -19121 -32274 -27181 -5172 14221 14236 -731 -8703 -4839
16010 -4839 -19119 -22803 -18847 -14289 -11154 -9228 -8154 -11484 -17222 -28141 -19325 -32543 -35586 -39689
15996 -39689 -38386 -29727 -24552 -18136 -14396 -18567 -25248 -30070 -37494 -40322 -32244 -20242 -9144 -15396
15982 -15396 -28914 -42201 -44097 -30213 -31289 -14030 -7804 -9003 -2978 1280 1586 -4291 -7577 807
15968 807 12674 20061 16542 28127 21266 15435 5942 8929 13827 3931 13554 17013 12557 -14136
15954a4136j960r691J901J2330L375q751M228o560j1782j1092N904K1321j4751
15941b9664k790J5783Q765j1658J3436M351M532M040o257p506J2205j2520k405
15928i688J1709J806k585k751L97o872j0469P413K095J147M524l17L745K539m923
15913b230J01R071K064J115l667K144N343J376L125m258o926P054j1530q291O90
15898d819O321K6379q727k4261o079Q109p038l574O241P467K2339l20j3172j0180
15884a314k2614l995J4475J0440k373n051J1178m075j2022L622J1876R40N209
15871F296o881R775L834j8035j068Q001j7m310l451l926j2726R761M122Q142J6344
15856A5861L596j6242q751K213j4682k2753O306K253j5345P200J0459L662j0469
$$ plain form
15954 -14136 -16096 -25787 -23886 -11556 -8181 -16932 -12704 -19264 -31046 -42138 -36234 -14913 -29664
15941 -29664 -32454 -16671 -7906 -19564 -6128 -1777 2755 6795 538 -6968 5237 -7283 -9688
15928 -9688 2021 3827 1242 -1509 -1112 -7984 -18453 -11040 -8945 -7798 -3274 -3591 154 2693 -2230
15913 -2230 -2129 6942 9006 10121 6454 8598 13941 15317 18442 14184 7258 14312 2782 -5509 -4819
15898 -4819 1502 27881 19154 -5107 -11186 -3077 -10115 -13689 -7448 19 22358 22038 8866 -1314
15884 -1314 -23928 -27923 -13448 -3008 -5381 -10432 746 -3329 -15351 -11729 147 1087 6296
15871 6296 -585 9190 13024 -5011 -6079 1922 1905 -2405 -5856 -9782 -22508 -12747 -8625 -483 15861
15856 15861 19457 3215 -5536 -3323 -18005 -40758 -34452 -32199 -47544 -40344 -29885 -26223 -36692
15843c6692k600l273Q195P602J0179J9546P14o525J80o998M421k854R889Q12q20
15828A776n232n541m097K361J3449n372j465M910K098l322m789L356m883M002
15814b749j321k44k803q539q39M620M424R470J0070J949L001l280j3198j2567
15800a2006o000Q275J8654P09m08M224j6687j0872J2699M164k672J1004M115r246
15786E953o787j144J875l222j31m132K4355K747m677j1719j9218l684K638P316
15772i830J3610o690j2888k971N859Q02Q054O916j6342Q137O54n519K0475p809
15758B458r377M487J1220N353j2438j8642J1555Q690p113K560N954r54N630l738
15744E645k1183p327l878P103Q288p02J5377o981r387j9043R149N261j1804J3533
$$ plain form
15843 -36692 -39292 -42565 -34370 -26768 -16589 2957 3671 -2854 -2674 -9672 -5251 -8105 1784 2596 1776
15828 1776 -3456 -8997 -13094 -10733 2716 -2656 -4121 789 2887 -435 -5224 -1868 -6751 -2749
15814 -2749 -4070 -4314 -7117 -15656 -16495 -11875 -7451 2019 12089 14038 17039 13759 561 -12006
15800 -12006 -18006 -9731 8923 9632 9224 13448 -3239 -14111 -1412 2752 80 11084 15199 5953
15786 5953 -834 -1978 -103 -3325 -3456 -7588 16767 19514 14837 3118 -16100 -19784 -17146 -9830
15772 -9830 3780 -2910 -15798 -18769 -12910 -12108 -4054 2862 -13480 -5343 -4689 -10208 10267 2458
15758 2458 -6919 -2432 8788 14141 1703 -16939 -5384 3306 -3807 -1247 4707 3753 9383 5645
15744 5645 -15538 -22865 -26743 -19640 -11352 -12054 3323 -3658 -13045 -32088 -22939 -17678 -29482 -15949
15730a5949K2611L684l036l357l574J1102j681p356M225j332J4313N23j8095j9448
15716a7370J2029O499L753J3106L724l607m856l272r1q0l364M647r613P536k504
15701F537r853j0984O507J7594l69j480j1720m205m661N15J2119R438J5810q310
15687A6938j7662r858K0272p68j7026j1445N835m704r647J5667R993K025N15j562
15673a427J3009K870Q598N41j4222j4369L310J8905L068j0729J598j1378j9678
15660a9904j1366Q900L241M368L348q995N577J7846K203P62N56j5538n746J268
15646a3480O857m212N921N496j0450j5521M15Q93N7J1596J1620L518j8486r150
15632b4926o548J1960K1122L866N83k4349J0672N408q175K068K880l668J74J802
$$ plain form
15730 -15949 6662 10346 7310 3953 379 11481 9800 2444 6669 5337 19650 20173 2078 -17370
15716 -17370 -5341 1158 4911 18017 21741 18134 13278 10006 9915 9835 6471 11118 1505 9041 6537
15701 6537 -3316 -14300 -7793 9801 9432 7952 -3768 -7973 -12634 -12119 0 9438 25248 16938
15687 16938 -724 -10582 9690 8922 -8104 -19549 -13714 -18418 -28065 -12398 -2405 -380 135 -1427
15673 -1427 11582 14452 23050 23591 9369 -5000 -1690 17215 20283 9554 11152 -226 -19904
15660 -19904 -31270 -22370 -19129 -14761 -11413 -20408 -14831 3015 5218 5980 6536 -9002 -14748 -13480
15646 -13480 -6623 -10835 -4914 582 -9868 -25389 -24974 -24081 -24024 -12428 -808 2710 -15776 -24926
15632 -24926 -31474 -19514 1608 5474 6057 -18292 -7620 -2212 -10387 -8319 -5439 -9107 -8933 -7131
15618g131N32J0608N512m926Jj521o039J764M978J228o321k194p136Q802R299
15603G456j4527j8931L367L502O374N94j542Q424J1349p831m635J2058o436j085
15589a863O178o161j0338J2187J3430L340l461k1484j3170j921P540K3290o372
15576A195q132k814j4732l611J6793J3707j3534k098p99r682k138o368r188Q937
15562c2464K1001J4269o251k2085j0583M56j664J0075r208J9868K5855M000j5089
15549a820j7955l634J3876J4647j9365k05J0732P299P915j098N87p701j4596j6461
15535b7779j723K828k732K0609J8947L190j1268l43p665m103R088O823K212m459
15521C625l402l511L656o202J633P811n005M527J98N195K20j6046J964j428l318
$$ plain form
15618 -7131 -6599 4009 9521 4595 4596 3075 -2964 -1200 3778 5006 -1315 -3509 -10645 -1843 7456
15603 7456 -7071 -26002 -22635 -19133 -12759 -12165 -13707 -5283 6066 -1765 -6400 5658 -778 -1863
15589 -1863 4315 -1846 -12184 3 13433 16773 13312 -8172 -21342 -23263 -15723 7567 1195
15576 1195 -6937 -9751 -24483 -28094 -11301 2406 -11128 -13226 -14025 -23707 -25845 -32213 -41401 -32464
15562 -32464 -11463 2806 -3445 -25530 -36113 -35657 -37321 -27246 -36454 -16586 9269 13269 -1820
15549 -1820 -19775 -23409 -9533 5114 -14251 -14456 -3724 3575 11490 10392 10979 3278 -11318 -27779
15535 -27779 -29502 -26674 -29406 -8797 10150 13340 2072 1729 -5936 -10039 -951 5872 8084 3625
15521 3625 223 -3288 368 -5834 -4201 3610 -1395 3132 3330 8525 8745 -7301 -5337 -6765 -10083
15506a0083K338L497r130j6581j8241q92K4722K0688l095O829p44J0938P978j629
15492A6595j8677o773J74n298J5767J2753o413k8084m94K255P668m975p944Q394
15478a5052P435j2170l704J2497J7011Q213j0097l189n728J346o12J7218m712
15465H456m385n12O191P928m824o563n005J8811L040j1101J8124l962j6348N58
15451A0408O52O6Q325L799M398o842j3631p393j356j100J0977K406J0061j527
15437A9243J068j3222j0864l001J1046j466q30J479P125k882J907l675j6528K385
15423h215R678j490j3717j1241M636J4424n125r027l632N794M398p681m372J1061
15409a4509R480Q919L495N260Q14R004j5660J339L327o14n896j2086N010j4725
$$ plain form
15506 -10083 -7745 -4248 -13378 -29959 -48200 -49092 -24370 -3682 -6777 52 -692 10246 18224 16595
15492 16595 -2082 -8855 -8681 -13979 1788 14541 8128 -19956 -20450 -18195 -10527 -15502 -23446 -15052
15478 -15052 -7617 -19787 -23491 -10994 6017 14230 4133 944 -4784 -3438 -4050 13168 8456
15465 8456 4071 3559 9750 17678 12854 6291 1286 20097 23137 12036 30160 26198 9850 10408
15451 10408 11060 11126 19451 23250 27648 20806 7175 -218 -1574 -2674 8303 10709 20770 19243
15437 19243 20311 7089 -3775 -6776 4270 2804 1974 3453 10578 7696 9603 5928 -10600 -8215
15423 -8215 1463 -27 -13744 -24985 -20349 -5925 -11050 -20077 -23709 -17915 -13517 -21198 -25570 -14509
15409 -14509 -5029 3890 7385 12645 13459 22463 6803 8142 11469 10855 4959 -7127 -2117 -16842
15395a6842l651O008K658N307J7482J719J3078o827m301n947j598L895J1524j4294
15381H211J0715J3505k3338j3384L374R312q140k541J3222q066p601m579L541
15368e769j1926m658J1976J0414m507K293J2045p122j1224L074J4354m886r104
15355e040j3213r297M85L584P494J4624J763j3411k1260J3786R181Q32N980Q302
15341C810L084q594j8925p814J6158K3169j040j894M621q680r515j1437R271L951
15327c835L425k628j7438p550L073J1150N522n469L23Q599O358m418j1661n752
15313b0301J329q45J3339m939k437P443R880r450j8908Q809K91M216P361L274
15299i38N723m308j3623M50K3075j2195k3072m066O620R779O167J3221O268r77
$$ plain form
15395 -16842 -20493 -14485 -11827 -6520 10962 12681 25759 18932 14631 8684 7086 10981 22505 8211
15381 8211 18926 32431 9093 -4291 -917 8395 255 -2286 10936 2870 -4731 -9310 -5769
15368 -5769 -17695 -22353 -10377 37 -4470 -2177 9868 2746 -8478 -5404 8950 4064 -5040
15355 -5040 -18253 -27550 -27065 -23481 -15987 -1363 400 -13011 -34271 -20485 -11304 -10472 -4492 3810
15341 3810 6894 -1700 -20625 -28439 -12281 10888 9848 7954 12575 3895 -5620 -17057 -7786 -3835
15327 -3835 -410 -3038 -20476 -28026 -24953 -13803 -8281 -13750 -13427 -4828 1530 -2888 -14549 -20301
15313 -20301 -18972 -19817 -6478 -11417 -13854 -6411 3469 -5981 -24889 -16080 -15789 -11573 -4212 -938
15299 -938 4785 477 -13146 -12696 10379 -1816 -24888 -28954 -22334 -12555 -6388 6833 13101 12124
15285A2124j3555Q545L687j4826j3029r566N709J215J170p457Q103O732l217N047
15271i318J0784P484R949j2804L374n79o478p186J0493N707l905j1904M892r270
15257h761j2617N95Q446J6578J4025P67j1378O139K279j6048j1434M416J8892
15244A1899k063n075j789j4310l370m882j0202j2591k223J6886R531R348K0712
15231A1871j0616p503J579J0718j95j5368q891Q585L360O300j9203p471J5714
15218a1120J5716k62M636r499r562M479q78k65K240k497j3630K210O076O285Q221
15203B150M068O434l082j21l631O868M214p312j4694j0557k871J0368O496k012
15189c682R976J106j0420m617R89N235P871R932q471q262j504l87M724Q143j2258
$$ plain form
15285 12124 -1431 7114 10801 -4025 -17054 -26620 -20911 -19696 -18526 -25983 -17880 -11148 -14365 -9318
15271 -9318 1466 8950 18899 6095 9469 8890 2412 -4774 5719 11426 7521 -4383 509 -8761
15257 -8761 -21378 -20783 -12337 4241 18266 19033 7655 13794 16073 25 -11409 -6993 11899
15244 11899 9836 4761 2972 -11338 -14708 -19590 -29792 -42383 -44606 -27720 -18189 -8841 11871
15231 11871 1255 -6248 -4669 6049 5854 -9514 -18405 -9820 -6460 -160 -19363 -26834 -11120
15218 -11120 4596 4334 8970 -529 -10091 -5612 -6490 -6755 -4515 -7012 -20642 -18432 -12356 -6071 2150
15203 2150 6218 12652 9570 9449 5818 12686 16900 9588 -5106 -15663 -18534 -8166 -1670 -3682
15189 -3682 6294 7400 -3020 -7637 -6648 -1413 6458 16390 7919 -343 -1847 -2234 2490 10633 -1625
15174a625l734p141m0O4o764J5318J9879m239o427j4260N78r953K220K525R594
15159d005J1075N413n916n694m930o279n210q34J1185P561n419P422l263m521
15145c415k123m31j8027N758J1541J1294n098m668k597J1203k95p709p542J0288
15131a821R454k566L879q463j5829N557Q49P887k746K755L362L901j5068o266
15117a5115J7343O811N039K5L89j6409j090N407q16p509J0481j2033K962P789
15103C274l802q355N930R232J4869J2120j2247k3198p932J7494O810j2242j7262
15090a5309j4735R738J5794M040J371Q47Q116O822k652Q48J71j308o242j864K722
15075H359J6749J394r980j198j0880m834R213K218J25j849j0768N428N724o264
$$ plain form
15174 -1625 -5359 -12500 -12540 -12476 -19240 -3922 15957 11718 5291 -8969 -8391 -18344 -16124 -13599 -4005
15159 -4005 7070 12483 6567 873 -4057 -10336 -15546 -16380 -5195 2366 -3053 4369 1106 -3415
15145 -3415 -5538 -5969 -23996 -18238 -6697 4597 -501 -5169 -7766 3437 3142 -4567 -12109 -1821
15131 -1821 7633 5067 8946 483 -15346 -9789 -8940 -1053 -3799 -1044 2318 6219 -8849 -15115
15117 -15115 2228 9039 14078 14103 14492 -1917 -3007 2400 1584 -5925 4556 -7477 -4515 3274
15103 3274 -528 -8883 -2953 6279 21148 33268 21021 -2177 -10109 7385 14195 1953 -15309
15090 -15309 -30044 -20306 -4512 -472 899 1746 9862 16684 14032 14880 15051 13743 7501 5637 8359
15075 8359 25108 26502 16522 15324 4444 -390 8823 11041 11166 9317 -1451 3977 9701 3437
15061C437J645J641n442p321j29K149q747Q126K893j028p081q336j036L189N776
15046a0264P454q673n33J0123o761N794K1455k499n737J726m502j0814l438j0963
15032a7632K323L819q752J8009J2874j0170N499R332O20j4823Q946J869r15m693
15018F306j39l205m091J3595R733M292l77j2076j8679n608N466J0643J70Q481
15004A4511q104j0610P257N681R005N314m53j1608L59j3936l069J0768p1r560
14990d516k443J3239L076p843o362J1524O050k0057r188K330j937Q310P33K934
14976d150m739O750r880j3775J1480P494J659J335N867j767J6215K920n31o527
14962A2351j3708n919R346M449o788p341K123J4755J0797o347j2158j8503n760
$$ plain form
15061 3437 5082 6723 1281 -6040 -6169 -4020 -12767 -4641 -1748 -2776 -9857 -18193 -19229 -16040 -10264
15046 -10264 -2810 -11483 -12016 -1893 -8654 -2860 18595 16096 10359 12085 7583 -3231 -6669 -17632
15032 -17632 -15309 -11490 -20242 -2233 10641 471 5970 15302 15922 1099 10045 11914 10999 6306
15018 6306 6167 2962 -1129 12466 22199 26491 26114 14038 -4641 -10249 -4783 5860 6030 14511
15004 14511 6407 -4203 3054 8735 17740 23054 22601 10993 11352 -2584 -5653 5115 5044 -4516
14990 -4516 -6959 6280 9356 1513 -4849 6675 12725 -7332 -16520 -14190 -16127 -7817 -7084 -4150
14976 -4150 -8889 -2139 -12019 -25794 -14314 -6820 -5161 -3826 2041 274 16489 19409 18878 12351
14962 12351 -1357 -7276 2070 6519 -269 -7610 -5487 9268 20065 13718 1560 -16943 -22703
14949b2703l362K884m720m818N664Q160P080q231l128O305J6202K9631K6205n233
14935D9936l710j752j2303l4851k5047K655K2863J3300q184j1218j0863m141J0120
14922a3195O471k277l24m680p862J4623J1286M810j574j363l486j2991O738q42
14908d666J4084l862j1838j4754k257Q007R32N545K7202Q515j5625j9594N755
14895b556J5595k674J0667k953j1592q301P065J0077j0006j4104j9157J0853J2160
14882d926J156o524p455j106p991r74M16J6254J577J563J9902j014j2804m422
14868f348J2227K287P915J8603k2185j1425J9189r608k1105p381j1884l060M180
14855b8595L525J2883Q477l672m831R390P974J1510J7274j0926J070j0149p327
$$ plain form
14949 -22703 -26065 -23181 -27901 -32719 -27055 -18895 -11815 -20046 -23174 -16869 -667 28964 55169 49936
14935 49936 46226 44474 32171 -2680 -27727 -25072 -2209 11091 2907 -8311 -19174 -23315 -13195
14922 -13195 -6724 -9001 -9325 -14005 -21867 -7244 4042 8852 7278 5915 2429 -10562 -3824 -4666
14908 -4666 9418 5556 -6282 -21036 -23293 -15286 -14354 -8809 18393 26908 11283 -8311 -2556
14895 -2556 13039 10365 21032 18079 6487 -1814 5251 15328 5322 -8782 -27939 -17086 -4926
14882 -4926 -3770 -10294 -17749 -18855 -26846 -27820 -27404 -11150 -9573 -8010 11892 10878 -1926 -6348
14868 -6348 5879 8166 16081 34684 12499 1074 20263 10655 -10450 -17831 -29715 -32775 -28595
14855 -28595 -25070 -12187 -3710 -7382 -12213 -2823 5151 16661 33935 23009 24079 13930 6603
14842F603p530j2275M753J32k542k01Q300J3706k498j2106J507N064N886l034
14828E765j4869J9380J3435J714n478m033N797j023l002L787K410j1286m300l171
14814E126p979R494j3195J616l675j0021n609O586J6404J5331J987j656r334R879
14800A4954L020p969O752m001r860p853L526L329J28L115m533N132P554m628j0349
14785a683J822P399j61j9554m567J8145K917P337L507J0594L958j0867n758p331
14771E758J5459m084l485k552j2206N133r58P716P412N40o426n786j2764k650
14757h893N558J496M114k19J2065l586Q902N583j1053k1470J572N812L721L967
14743G569M665J35q357j4148o799p170R907J5241q350P927J1526j6386j5233J437
$$ plain form
14842 6603 -927 -13202 -8449 -8317 -10859 -11060 -2760 10946 8448 -3658 -2151 2913 8799 5765
14828 5765 -9104 10276 23711 25425 19947 15914 21711 20688 17686 21473 23883 12597 8297 5126
14814 5126 -2853 6641 -6554 -4938 -8613 -18634 -24243 -17657 -1253 14078 16065 14409 5075 14954
14800 14954 17974 10005 16757 12756 2896 -4957 -1431 1898 2026 5141 608 5740 13294 8666 -1683
14785 -1683 139 7538 7377 -12177 -16744 1401 4318 11655 15162 25756 29714 18847 13089 5758
14771 5758 21217 17133 13648 11096 -1110 4023 3065 10781 18193 18733 12307 6521 -6243 -8893
14757 -8893 -3335 -1839 2275 2056 14121 10535 19437 25020 13967 -7503 -5931 -119 3602 7569
14743 7569 12234 12369 4012 -10136 -16935 -24105 -14198 1043 -7307 620 12146 -4240 -19473 -18036
14729a8036J1872q8p472p189P556k395M22J9007O079r0j3952J5321J2110L945
14715B7090M960j3604j1164j1414P463k098q672J052K161l362r209L672m775L335
14701a4565j192j886J28M161k107M898Q416j0225J661O644N608m407P13k75J0222
14686G794J1447m652j1820N652n497j3881J4192N429j8277p575L543n460j5324
14673c4429M408N705j0463Q492J1456n318R465J2983J2591k438j7477M343J5180
14660A4498j0574m158r130p354o81J1914j00j7220P667M560L728L054N422J462
14646C088J1243q255m739M54M256l542M109o478j718Q969J6785P694q079J982
14632B5769j7775j4224M142Q011k793o858N196j190j2K340K9347P552M08o102
$$ plain form
14729 -18036 -6164 -6252 -13724 -20913 -13357 -15752 -15330 3677 9756 9666 -4286 11035 23145 27090
14715 27090 32050 18446 7282 -4132 3331 1233 -7439 -6387 -4226 -7588 -16797 -13125 -17900 -14565
14701 -14565 -15757 -17643 -17515 -13354 -15461 -10563 -2147 -12372 -10711 -4067 1541 -2866 -2153 -2428 7794
14686 7794 19241 14589 2769 8421 2924 -10957 3235 8664 -9613 -17188 -13645 -19105 -34429
14673 -34429 -30021 -24316 -34779 -26287 -14831 -20149 -10684 2299 14890 12452 -5025 -682 14498
14660 14498 3924 -234 -9364 -16718 -17399 -5485 -5585 -22805 -15138 -10578 -6850 -3796 1626 3088
14646 3088 14331 6076 1337 1791 6047 2505 6614 136 -1582 7387 24172 31866 23787 25769
14632 25769 7994 -6230 -2088 5923 3130 -3728 1468 278 266 2606 31953 39505 39913 33811
14618C3811j6573k0417o689P04q564N458J9017N118J1606j164j457l911j5962
14605I77k316Q471k850q571N33N654J2531J6244j3858k2515q969M928J9867P05
14591A0831k3437k39J3498j156q866J0373M28j521J5758L29j1060j8162p151K275
14577a8100N418P758j403M096P772m969L99J100M857M353p858j3518R531J3350
14563A2786j889j0368j82J793k594j5658O871O339l992J5290L789j5011j2342
14550a5168O346L892J0072j311Q616L471n446q874J0687N111O332O767p381j0941
14536A2173l894l850m473N263M481M020j0203K396k503P271O304j2565R104Q090
14522B1614K893n6j4068r529P062J2452K461j8103p784J3630o009j7305n905l050
$$ plain form
14618 33811 17238 -3179 -9868 -9164 -17728 -12270 6747 11865 23471 22307 20850 16939 977
14605 977 -1339 7132 4282 -4289 -3756 1898 14429 30673 16815 -5700 -14669 -9741 10126 10831
14591 10831 -12606 -12845 653 -503 -9369 1004 1432 -89 15669 15998 4938 -13224 -20375 -18100
14577 -18100 -12682 -4924 -6327 -2231 5541 572 971 2071 6928 11281 3423 -10095 -564 12786
14563 12786 10897 529 347 2140 -454 -16112 -9241 -2902 -6894 8396 12185 -2826 -15168
14550 -15168 -8822 -4930 5142 3831 12447 15918 10472 1598 12285 17396 23728 30495 23114 12173
14536 12173 8279 4429 -44 5219 9700 13720 3517 5913 3410 10681 16985 4420 13524 21614
14522 21614 24507 24451 10383 854 7916 20368 22829 4726 -3058 10572 4563 -12742 -18647 -21697
14508b1697J374J7559n846J648M947P14j4849j076J1288m371J321N292K364r624
14494a0956j4528R650J3848O005n396j4201q90J231K3321J2427j14k0932j1628
14481a2163q695n397n642J756P922J3016K163J295j618k85n443n197J2878Q00
14467d610J770r555M176M517p115l760J1309J6602K08k0103m01J8390k302o404
14453B722J0239N059q824k0423j1012M636M060N497m604Q583M65m745J1254l701
14439g94j9095o842J0700j0708M652J0043L219Q8q612o239L543n36L606J4062
14425b913J6561N715k302j3378n363k026l421k361N673J4237M730q016p30J053
14411G459j505p772k803J3346J1614j5824j1256o509n861L659R385M099q772q218
$$ plain form
14508 -21697 -20323 -2764 -8610 -6962 -2015 -1301 -16150 -17226 -5938 -10309 -8988 -3696 -1332 -10956
14494 -10956 -25484 -15834 -1986 4019 -1377 -15578 -16468 -15237 8084 20511 20397 -535 -12163
14481 -12163 -20858 -26255 -31897 -30141 -22219 -9203 -7040 -5745 -7363 -7648 -13091 -18288 -5410 -4610
14467 -4610 -2840 -12395 -8219 -3702 -10817 -14577 -3268 13334 13542 -6561 -6962 11428 9126 2722
14453 2722 12961 18020 9196 -11227 -22239 -17603 -13543 -8046 -12650 -4067 -3602 -8347 2907 -794
14439 -794 -19889 -26731 -16031 -26739 -22087 -12044 -8825 -8737 -17349 -23588 -20045 -20581 -16975 -2913
14425 -2913 13648 19363 17061 3683 -1680 -3706 -7127 -9488 -3815 10422 15152 7136 6406 7459
14411 7459 5954 -1818 -4621 8725 20339 4515 -6741 -13250 -19111 -15452 -6067 -1968 -10740 -18958
14397a8958j827j0839J8373K8347k667j6106J2102O48k0965j264j2201L183J6628
14384e546Q038q856L974R038n872j583j820R84J5040L632j5686j3441K629P360
14370b109k011l240l666M725q78L794n728n038P749J3567q387q601n835l094l38
14355a9090J1071N820l330k326J108l257m892o600Q938J0771l257n270L372P268
14341C26J253M356L678m497P51K382j0405j9284p671K0608n907r462l862O382
14327b1352Q768P348P96j0008n24O677O849O045j3598R73N639k297J8724R490
14313B3530j1687m669j574j9354p288J2433m466j0917q850K0032Q901Q214J1079
14300A5384l970o515l038P301q145m794O510q083Q097P928n800J334r965j3850
$$ plain form
14397 -18958 -20785 -31624 -13251 15096 12429 -3677 8425 9073 -11892 -13156 -25357 -22174 -5546
14384 -5546 2492 -6364 -2390 6648 776 -807 -2627 -1643 13397 17029 1343 -12098 -9469 -2109
14370 -2109 -4120 -7360 -11026 -6301 -7179 -3385 -9113 -14151 -6402 7165 -1222 -9823 -15658 -18752 -19090
14355 -19090 -8019 -2199 -5529 -7855 -6747 -10004 -14896 -21496 -12558 -1787 -5044 -10314 -6942 326
14341 326 1579 5935 9613 5116 5867 8249 -2156 -21440 -29111 -8503 -14410 -23872 -27734 -21352
14327 -21352 -12584 -5236 -4440 -14448 -14972 -8295 -1446 4599 -8999 -8026 -2387 -4684 14040 23530
14313 23530 11843 7174 5600 -13754 -21042 -8609 -13075 -23992 -32842 -12810 -3909 4305 15384
14300 15384 11414 4899 1861 9162 1017 -3777 2733 -5350 2747 10675 4875 6209 -3756 -17606
14286a7606l881N231j825j02q442J371R933J7319k874L055K789R450k299k943
14272I176l440l343m161J4000Q833r014o033p92j397K201N843q63K423K924o211
14257A0146L786l421q895p951J0909M738k313R226Q553p952j6840j360J067Pj1883
14242a2183O571J9081J6816k964l042j1324r250o105p805L753R427J0774p024
14229F725p445J0189l536P95o37Q29J8202j432l912n370P982q30k065n546m92
14214A3457r253q37J0779j3215j422J7693J1476j3983q255o465M145J7483j0671
14201A0932p914k0405j3812Q235J9382k483q683O577P316n710o363J802P77j895
14187a2244R355n02M341j50j4489l497J2748K0413L391l015K917o998j7061J2268
$$ plain form
14286 -17606 -21487 -16256 -18081 -18183 -26625 -25254 -15321 1998 -876 2179 4968 14418 12119 9176
14272 9176 5736 2393 -1768 12232 21065 12051 6018 5226 3829 6030 11873 11010 13433 16357 10146
14257 10146 13932 10511 1616 -6335 4574 9312 6999 16225 24778 16826 -14 -1374 -307 -300 -12183
14242 -12183 -5612 13469 30285 27321 24279 12955 3705 -2400 -10205 -6452 2975 13749 6725
14229 6725 -720 9469 5933 6728 6091 6920 25122 23690 19778 14408 22390 21560 19495 13949 13457
14214 13457 4204 3367 14146 931 -491 17202 28678 14695 6440 -25 4120 21603 10932
14201 10932 3018 -17387 -31199 -22964 -3582 -6065 -14748 -8171 -855 -6565 -12928 -11126 -10349 -12244
14187 -12244 -2889 -3391 950 800 -13689 -17186 -4438 15975 19366 16351 19268 12270 -4791 7477
14173G477O915P481M1j6896l332P700j140j0321N19l147R516J417l416q371L603
14158a954J201J4753J9358k386p960k4621N609K2456O739p772p591l1Q299j1783
14144A4317j77P274R000J778r853o643j5919j3021O1K9290J2246r504J744j0142
14130A0451k179J2485p35n974r238m933J8911J3839q450j3692N769P828r481r569
14116E032n328R01Q420R539k839j780l021P150o62Q5K175N684p655q499J4522
14101B3724j2092j4497J3006J0921M945j8081j7892j021J2773J5026n918r344
14089A550q999J7376J3830K2453J370q775p015p064k345n545q772MN489J714q937
14074F334j1599J0415J5475j1157k068K4912m85l027k1904j3688j1299l155J2731
$$ plain form
14173 7477 14392 21873 21914 5018 1686 9386 8246 -2075 -1556 -4703 4813 6230 2814 -5557 -1954
14158 -1954 -753 14000 33358 30972 23012 -1609 4000 26456 33195 25423 17832 17801 26100 14317
14144 14317 14140 21414 30414 32192 22339 15696 -223 -13244 -13183 16107 28353 18849 20593 10451
14130 10451 8272 20757 20022 14048 4810 -123 18788 32627 24177 10485 16254 24082 14601 5032
14116 5032 -296 605 9025 18564 15725 13945 10924 18074 17412 17497 19672 25356 17701 9202 23724
14101 23724 11632 -2865 10141 21062 26007 7926 -9966 -10987 1786 16812 10894 1550
14089 1550 -7449 9927 23757 46210 47580 38805 31790 24726 22381 16836 8064 8068 13557 15271 6334
14074 6334 -5265 5150 20625 9468 7400 32312 31827 28800 6896 -6792 -18091 -21246 -8515
14061h515M788O53j432P438J0234m801N895o33N075j8122q726J2041l870j327
14047a302J0268K817j85P505J896k283O035K58K380r892J205k433j0807r162l958
14032g658J5581K304j7301L921Q37k068J1354j491K508m914j4331k702J3407J2392
14018A1839J3718N667k255j3453m997O699l122j0088l101L65R901L764o739N580
14004A3778K168k892j50j6508J5162J6195j0806n935Q254j574j9105M680J7575
13991B0842p474j2100j329j6282o149J838P163O490J0125k421J1375m700j6569
13978i191P387k793K202j5153j0892N680R587j484P831Q471R259K956k0634p768
13964a4542J1499j229K528K964R916J4962r109j7595j0257J33J5375L694N028
$$ plain form
14061 -8515 -3727 -3074 -4506 2932 13166 8365 14260 13627 18702 580 -8146 3895 25 -1302
14047 -1302 8966 11783 11598 19103 20999 18716 24751 25009 27389 17497 18702 16269 5462 -3700 -7658
14032 -7658 7923 10227 -7074 -3153 -2316 -4384 6970 5479 7987 3073 -11258 -13960 -553 11839
14018 11839 25557 31224 28969 15516 10519 17218 14096 4008 907 1272 11173 14937 8198 13778
14004 13778 15946 13054 12904 -3604 11558 27753 16947 11012 19266 17692 -1413 3267 20842
13991 20842 13368 1268 -61 -16343 -22492 -20654 -13491 -7001 3124 703 12078 7378 -9191
13978 -9191 -1804 -4597 -2395 -17548 -28440 -22760 -13173 -14657 -6826 1645 10904 13860 -6774 -14542
13964 -14542 -3043 -4272 -1744 1220 11136 26098 16989 -606 -10863 -10730 4645 8339 13367
13951A3367j4086l500J3210L977j095o990p408j1426j267J0560K1609P235R711
13938C3897L925j3394j5481l4051l276J2851Q260m565O265j854K05m376L430P34
13924g430R030J0560o426r395k926N641M487J692j0567m090k599k757m110m688
13910b3578J7034R669Q98o783N873J0071K1340j5155j3562N020M219o348l771
13897D927J0803J096n65j4132p698J6228J4598j416O118q63j7373j0729P176q722
13883e52j1340o315R15L302R500p74M163J1382m896r022l751j1316j245K208O666
13868a1075R823J5376N663p453K209O589q569k435n749j713N407m243K68J766
13854E864J7097J1055j5131j2340k029o821K0959L364K476J617j2344J0552L882
$$ plain form
13951 13367 -719 -4219 8991 12968 11873 4883 -2525 -13951 -15218 -4658 16951 24186 33897
13938 33897 37822 24428 8947 -25104 -28380 -15529 -7269 -11834 -5569 -7423 -7218 -11594 -8164 -7430
13924 -7430 1600 12160 5734 -3661 -6587 -946 3541 5233 -5334 -9424 -12023 -14780 -18890 -23578
13910 -23578 -6544 3125 4023 -2760 3113 13184 34524 19369 5807 10827 15046 8698 4927
13897 4927 15730 16826 16261 2129 -5569 10659 25257 23841 29959 29096 11723 994 8170 -552
13883 -552 -11892 -18207 -17292 -13990 -4490 -5264 -1101 10281 5385 -3637 -7388 -18704 -19949 -17741 -11075
13868 -11075 -1252 14124 19787 12334 14543 21132 12563 10128 4379 2666 8073 3830 4098 5864
13854 5864 22961 34016 18885 6545 4516 -2305 18654 22018 24494 26111 13767 24319 28201
13841B8201o093m953k309l339n233P29N291j8010j1542J1930R287r265Q26J2989
13827H509J0427p82k679o166r316n42o12M724M466J1477J0400p975k367O033k293
13812B3304p532q119L890q435j8708L589R606J4594l902K853r305j5906m197J2567
13798e701J1054K087r871j759R156J3447k732j0426o906J3902R712P199q197N620
13784B6585j518j1152K566o101j0606j041l926m061K2470P313j9483j8049J0371
13771f632R62j072J1649J3099o637m376Q952L487m124r936j4323m644R84o18K360
13756a0869Q396N350O210p901P220L852N922m513K053p532j4237l712J4804r625
13742d582K57N759j5572J3791k341r452j8407K3506J7683J783j0706J4510k685
$$ plain form
13841 28201 22108 17155 14846 11507 6274 7003 12294 -5716 -17258 -5328 3959 -5306 -4480 8509
13827 8509 18936 18154 15475 9309 -7 -549 -1161 3563 8029 19506 29906 21931 19564 25597 23304
13812 23304 15772 7653 11543 3108 -15600 -12011 -2405 12189 8287 11140 1835 -14071 -18268 -5701
13798 -5701 5353 7440 -2431 -4190 4966 18413 15681 5255 -1651 12251 21963 29162 20965 26585
13784 26585 25067 13915 16481 10380 -226 -1267 -5193 -9254 13216 20529 1046 -17003 -6632
13771 -6632 -5670 -6742 4907 18006 11369 6993 15945 19432 15308 5372 -8951 -13595 -12611 -13229 -10869
13756 -10869 -2473 2877 9087 1186 8406 12258 18180 13667 15720 8188 -6049 -9761 5043 -4582
13742 -4582 -4325 1434 -14138 -347 -2688 -12140 -30547 -7041 10642 12425 1719 16229 13544
13729A3544k1878n073M460P146J5920j9854k8065M256K5495k382J1130J3997m450
13716A4246k460L854O376Q77L750l655r314p201N769O836J3987j2289q265l410
13702I101r336j8410j2272J3919J9798P96r545j3545P069J6804J4419k951p879
13689G968L12P889k682J086m321p780K3238J834j1898m735K217J7072Q227N948
13675D4375M605j510L84j7162n243k613j1071O978J2612M652j1729r423j836K020
13661A5039m229M238M329m210N755o962j6364m419j0740n960J0199k099m239J5058
13647d604J9038J0334l982j3269O398N769j4062K258J8792M71j5525j8511k851
13634i744O421K065m0L612K3J638J5491J4427j4507k7281n535j1478R448J1908
$$ plain form
13729 13544 -8334 -13407 -8947 -1801 14119 -5735 -33800 -29544 -4049 -6431 4699 18696 14246
13716 14246 11786 15640 22016 22893 26643 22988 13674 6473 12242 19078 33065 20776 12511 9101
13702 9101 -235 -18645 -30917 -16998 2800 3596 -5949 -19494 -12425 4379 18798 15847 7968
13689 7968 8280 16169 13487 14573 10252 2472 25710 27544 15646 10911 13128 30200 38427 44375
13675 44375 48980 47470 47854 30692 25449 22836 11765 18743 31355 36007 24278 14855 13019 15039
13661 15039 10810 15048 19377 15167 20922 13960 -2404 -6823 -17563 -23523 -13324 -15423 -19662 -4604
13647 -4604 14434 24768 20786 7517 13915 19684 5622 7880 26672 27143 11618 -6893 -9744
13634 -9744 -3323 -1258 -1298 2314 2337 3975 19466 33893 19386 -7895 -13430 -24908 -15460 -3552
13620c552K2381J5784k821j1193j9047Q140J1109J9226l403j0793q554j7144N586
13607E719K833q682J0776J8634k843n634k056M764N702P311N635n368k9218m626
13593B947J2925j701q963j590J102p13N730O311m543k406j1723R426m418M498
13579F882J2261p5j3168n693P454k20O55j090q730q979J913J2661J649j1011J4040
13564H549J3189l412j1095L004J4577P855j6893o486n60K021l593K150R754J0952
13550C0012n173l306p434L814J0477l26p701m553J3500j271j0172q113Q421J3035
13536C1210l639k672q64k0165m451J2100l884p897R817J637o467J1887j579j3943
13522A090Q192J0106k808O276N203p412j5780m606J416L572J2783r217j9350N51
$$ plain form
13620 -3552 18829 34613 31792 20599 1552 9692 20801 40027 36624 25831 17277 133 5719
13607 5719 8552 -130 10646 29280 26437 20803 18747 23511 29213 36524 42159 36791 7573 2947
13593 2947 15872 14171 5208 3618 4720 4007 9737 16048 11505 9099 -2624 6802 2384 6882
13579 6882 19143 19068 5900 207 7661 7441 8096 7006 -1724 -10703 -8790 3871 5520 -5491 8549
13564 8549 21738 18326 7231 10235 24812 32667 15774 9288 8728 10749 7156 9306 19060 30012
13550 30012 24839 21533 14099 17913 28390 28064 20363 15810 29310 28039 17867 9754 18175 31210
13536 31210 27571 24899 24035 3870 -581 11519 7635 -262 9555 11192 4725 16612 15033 1090
13522 1090 9282 19388 16580 22856 28059 20647 4867 261 1677 5249 18032 8815 -10535 -9984
13508i984L774J3945J5295j982Q366q513K537k589K375k406l784O73j7019r821
13494i133M488P042J590J0605r622j904L362Q580J1925n298m878o65r576m038
13480B478L685O526p63K528q835j0822m435J7971N746N923k147p552M465P184
13466B1952o520r71K750K87n54M110K636r973j0283j3665K852O907Q588O176j582
13451A2710J2222N991j3891j401J516q306P98q602j66R888J4775J1185n900k0217
13437A0602q098l040N991N552K620J4725n459j7453J9K8577J3617K095k2846j8411
13423H491J2488J3000J7196M037j3491q405p671n403n044J1209J9274j806j6761
13410B7114n772O912K553Q158k598o725p888j3305L348o066L960K906m889M849
$$ plain form
13508 -9984 -6210 7735 23030 21048 29414 20901 23438 20849 23224 20818 17034 17707 688 -9133
13494 -9133 -4645 2397 3987 14592 4970 3066 6428 15008 26933 21635 16757 16092 6516 2478
13480 2478 6163 12689 11926 14454 5619 -5203 -9638 8333 14079 20002 17855 10303 14768 21952
13466 21952 15432 14461 17211 17498 16944 21054 23690 13717 3434 -10231 -7379 -472 8116 14292 12710
13451 12710 24932 30923 17032 15631 17147 8841 9639 1037 871 10759 25534 36719 30819 10602
13437 10602 2504 -536 5455 11007 13627 28352 22893 5440 5459 34036 47653 49748 26902 8491
13423 8491 20979 33979 51175 55212 41721 33316 25645 20242 15198 26407 45681 43875 27114
13410 27114 21342 28254 30807 38965 36367 29642 21754 8449 11797 5731 9691 12597 7708 12557
13396A2557L595r07K1J359o353r509J1757M742J1411L621j2167O64r513n589J8293
13381B3982O925j3413P037L88J558L519l487m604j3682q315M605K08J7856p96
13367B1781r979L072K2313R676n090j0768l602J7246L603r527o491l260J6259
13354D5233R268J1314q273r623J0416K358n026k5149j3380K750J2465N673j23
13341C7903M867j4086K279R797J7144o339P400L3o928O710J8816j0352l577k465
13327F1202P520K4614K1312L193K204L75p080Q388J2825J8812Q345J4223M5759
13314B21692N5956O7697Q8493J30563J98243L06884M02385K97484n6236k98978
13304A414183l21976k52160j82067j28618j04960p5639o3132m9476k7085l4690
$$ plain form
13396 12557 16152 15245 15266 16625 10272 763 12520 17262 28673 32294 20127 20791 11278 5689 23982
13381 23982 30907 17494 24531 24919 26477 29996 26509 21905 8223 -92 4513 4721 22577 21781
13367 21781 11802 14874 37187 46863 41773 31005 27403 44649 48252 38725 32234 28974 45233
13354 45233 54501 65815 57542 47919 58335 60693 55667 30518 17138 19888 32353 38026 37903
13341 37903 42770 28684 30963 40760 57904 51565 58965 58998 52070 58780 77596 67244 63667 61202
13327 61202 68722 93336 114648 117841 120045 120420 113340 121728 134553 153365 161710 175933 221692
13314 221692 277648 345345 433838 564401 762644 1069528 1471913 1769397 1713161 1414183
13304 1414183 1092207 840047 657980 529362 424402 348763 285631 236155 209070 174380
13294A74380j7405L52q465j2822r795j7404p291J2090M425o01k1781j0071j8782
13281F6830j5624p943r260J0245P450j4594L226J1917J5317K986j3314R951j509
13268F5678j9176n656M369Q443L837N941L478N15l856j2048J250N680O486j3917
13254E1024k185J481r541N72O43Q490o006j262J104q859K3J7846J4967M82j3898
13239E4881k505j788p710o207N653l142J2004O23l619J3319J1387P266N598j0041
13225G5719J433j2712j8304j1965j5894q276J1606J1995J2562J4835J046J1904
13213G3949m328o305p009n871p944P010J9470n638k0909M646Q051J614j223j9621
13199C5892q622R525N437J1005k238J0641J7102o71M299k20k504j2404j5409K653
$$ plain form
13294 174380 156975 157327 148862 136040 126245 108841 101550 113640 118065 117464 95683 85612 66830
13281 66830 51206 43263 34003 44248 51698 37104 40330 52247 67564 70550 57236 67187 65678
13268 65678 46502 40846 45215 53658 57495 63436 66914 67429 63573 51525 52775 58455 64941 51024
13254 51024 48839 50320 40779 41351 41994 50484 44478 43216 44320 35461 35484 53330 68297 68779 54881
13239 54881 52376 50588 42878 36671 42324 39182 51186 51809 48190 61509 72896 80162 85760 75719
13225 75719 77152 64440 46136 34171 18277 10001 21607 33602 46164 60999 62045 73949
13213 73949 69621 63316 56307 50436 42492 49502 68972 63334 42425 47071 55122 56736 55513 35892
13199 35892 27270 36795 42232 53237 50999 61640 78742 78071 82370 82150 79646 67242 51833 54486
13185E4486P988R63q251K054R95j653m719N834o44R87M85q684k1659J028J9842
13170D9052J0907Q449m994j0601j2414R790L385L097l089J7034n016k0242n50
13157D4808K347j2417j2104K101p010p480m080l710n413J860J3230J6656Q312
13144C7100j934J0435M602m679o878J235o978m539n356L804J35J2158J7060j320
13130E4845O792O455J1473L416j7738j4504r218j118K4278L767j0144P264L431
13117F8999q710n539L849m431M159O538L688k351J6300M224R249o494K2944J8184
13103A30609L571Q162P286J1828M0830L7012O670p844J3347r629l338j9644m2386
13090A76474k1421j1281k8094j7506Q764L0507k843l219L197j0676o276k049P586
$$ plain form
13185 54486 62474 63437 55186 57240 58235 56582 51863 57697 57053 58040 58525 49841 28182 29210 49052
13170 49052 59959 68408 63414 52813 40399 50189 53574 56671 53582 70616 65600 45358 44808
13157 44808 47155 34738 22634 24735 17725 10245 6165 2455 -2958 -1098 12132 28788 37100
13144 37100 35166 45601 50203 45524 38646 39881 32903 28364 23008 26812 26947 39105 56165 54845
13130 54845 61637 68092 79565 82981 65243 50739 41521 40403 64681 68448 58304 65568 68999
13117 68999 60289 54750 58599 54168 58327 64865 68553 66202 82502 86726 95975 89481 112425 130609
13103 130609 134180 142342 149628 161456 202286 239298 245968 238124 251471 241842 238504 218860 176474
13090 176474 155053 143772 115678 98172 106936 137443 134600 131381 134578 123902 117626 115577 123163
13077A23163k272r887J1K670M305K806o269l428l255m608p802P478n298L951l952
13062I7613r152J2903J5072O568o969j4967L349o406q086p344j2253n454m124
13049F0750R530L2R23J9160K2979M289j1984q406k194j1023n068K54J494j960
13035G8776K1802J8441O264M6444L5528J2328K13J2154J537l073j1307k049J3192
13022B30250J1265q698K616M457n462p655l1660k2259K6662K5153j8743j5813
13010A90113j7469j6420n720r242j8795k491j0914j2787j7769j9416j5881L058
12998D6267K5448O2468N1186K6277J2255P140L496K764J2430n200o294l208n553
12985B29476K397J1633J3752l538J0435J3580M046J0605j6112N910O256p378J1630
$$ plain form
13077 123163 120891 111004 111015 113685 117990 120796 114527 111099 107844 103236 95434 102912 97614 101565 97613
13062 97613 88461 101364 116436 123004 116035 101068 104417 98011 89925 82581 70328 64874 60750
13049 60750 70280 70312 71235 90395 113374 117663 105679 97273 95079 84056 78988 79242 80736 78776
13035 78776 100578 119019 125283 171727 207255 219583 219796 231950 233487 230414 219107 217058 230250
13022 230250 241515 232817 235433 239890 234428 226773 195113 172854 199516 224669 205926 190113
13010 190113 172644 156224 150504 141262 122467 119976 109062 96275 78506 59090 43209 46267
12998 46267 71715 134183 185369 211646 223901 231041 234537 237301 249731 244531 238237 235029 229476
12985 229476 231873 243506 257258 253720 264155 277735 281781 292386 276274 282184 288440 281062 292692
12972B92692j674j1081j6578j9634k0184J3348N5186L7002r057k5503o543L990
12960B91964j755K496J0950J5010J0348J3067J5253R12m139l46p267o581j7591
12947C22321m687J2662m46J5631J0657R845J9347L4549L4202L1213K932q815o695
12934D72716K762n487p537J5835J1784K39O070J4299K541J0175K1494P186J5805
12921E67882K1186J6294K0760J2397K1361L210K6934L7726J8789N567q901J170
12909G44375J9906K5447L3247L2758L2965J0407K8585L2360K3323K1632M2642
12898A047647N6650N9208M5986K9007L2592M4388N3203N2964M0016L2223O2631
12887A556515R0214J06995Q9187R0022Q7862Q5633J02528J17454J48567J44520
$$ plain form
12972 292692 291018 279937 263359 243725 223541 236889 292075 329077 320020 294517 287974 291964
12960 291964 290209 292705 303655 318665 329013 342080 357333 358245 354106 353760 346493 339912 322321
12947 322321 317634 330296 329850 345481 356138 365983 385330 419879 454081 485294 488226 479411 472716
12934 472716 475478 469991 462454 478289 490073 490312 496382 510681 513222 523397 544891 552077 567882
12921 567882 589068 605362 626122 638519 659880 663090 690024 727750 746539 752106 743205 744375
12909 744375 764281 789728 822975 855733 888698 899105 927690 960050 983373 1005005 1047647
12898 1047647 1104297 1163505 1209491 1238498 1271090 1315478 1368681 1421645 1461661 1493884 1556515
12887 1556515 1646729 1753724 1842911 1932933 2020795 2106428 2208956 2326410 2474977 2619497
12877B619497J23602J52399J87074K14404K44015K64465K86171L18524L67298
12868D777449L87121M32212M55934N15084N76615O53252P38314Q26864R59846
12859A0322691J081351J231297J447915J772345K201542K502545K615231L003606
12851B6178523L960212N438516P383711J0080840J4164354K0795157L1557874
12844A19559187M8451447O9744541P3817185J9996367m6264794o3686678n4690504
12837A66926751m0639866k8770007k0480642j4884046j1027319q323324o385575
12830C6415972m884644l815912l281293l038156k678189k219297j814739j483938
12822A3199804j234953j060579r27021q43056p98465p14978o35801n58362m95192
$$ plain form
12877 2619497 2743099 2895498 3082572 3296976 3540991 3805456 4091627 4410151 4777449
12868 4777449 5164570 5596782 6052716 6567800 7144415 7797667 8535981 9362845 10322691
12859 10322691 11404042 12635339 14083254 15855599 18057141 20559686 23174917 26178523
12851 26178523 30138735 35577251 42960962 53041802 67206156 88001313 119559187
12844 119559187 168010634 237755175 311572360 331568727 285303933 221617255 166926751
12837 166926751 126286885 97516878 77036236 62152190 51124871 42801547 36415972
12830 36415972 31531328 27715416 24434123 21395967 18717778 16498481 14683742 13199804
12822 13199804 11964851 10904272 9977251 9134195 8335730 7620752 6984951 6426589 5931397
12813E931397l97586l01374k23491r6340J2003p4952k95024l64046l47726l20443
12803C522418l03013k56659k12931j92009j61972j28678j16971j04122r2671r5848
12793A857544r8606r2317o0663o1755p0673p3979p5419n5487l5960k1938l5215
12782A175532l6427l3228m2722l9052o5772m2898j4328k8919j1104l7534l9316
12771G84232l0606m2824j9833p087j8074j9315j1801K567q862j6608j8338m5305
12759E48146k9926J0383l620j1120p438j3733j7883q543k0090p933l4749k8789
12747C74705j8018j8874n029p921J2583K1723Q794J8624J8503L68j0728m0100
12735C54630l503o627l689j904q294j7034k3227n639k139n232N238j2176j214
$$ plain form
12813 5931397 5533811 5232437 5008946 4912606 4924609 4849657 4554633 4190587 3842861 3522418
12803 3522418 3219405 2962746 2749815 2557806 2395834 2267156 2150185 2046063 1953392 1857544
12793 1857544 1758938 1666621 1605958 1544203 1473530 1399551 1324132 1268645 1232685 1210747 1175532
12782 1175532 1139105 1105877 1063155 1024103 958331 915433 901105 872186 861082 823548 784232
12771 784232 753626 710802 690969 683882 665808 646493 634692 637259 628397 611789 593451 548146
12759 548146 518220 528603 524983 513863 506425 492692 474809 466266 446176 438243 403494 374705
12747 374705 356687 337813 332784 324863 337446 359169 367963 386587 405090 405458 394730 354630
12735 354630 351127 344500 340811 338907 330613 313579 290352 284713 282574 277342 282580 270404 269190
12722B69190J683M648K1298L1095Q684r67j1130J5817L8882L1052r368J8644K8387
12709D47915N7692J13578J98619K73441K74800j7148k47423k54360j85386j35603
12699E26125q7683m2939k9801k7566m3129n4921l1252j5792j1766l054j7107j7757
12687A43358J8928N1537K4398n952O486L221p640j9794J934r610k6682j6545r930
12674A53709M747q339l0716j3569j160j5400r80k0239n697j4851k1556j2775M064
12661A7238J4871o645j1686J52Q371M599j00j1077k0602l11M4249L6317J3156
12648H8532q545o140K4407L4454r06j9550j0153J910K776j014j7495j9824M390
12635G2842M358O443L334K954J2162L24N959o776P97k564M172m726j6577M44l113
$$ plain form
12722 269190 270873 275521 296819 327914 336598 335631 324501 340318 379200 410252 400884 419528 447915
12709 447915 505607 619185 817804 1091245 1366045 1348897 1101474 847114 661728 526125
12699 526125 438442 395503 365702 338136 295007 240086 208834 193042 181276 178222 161115 143358
12687 143358 162286 213823 238221 232269 238755 241976 234336 214542 216476 206866 180184 163639 153709
12674 153709 158456 150117 119401 105832 104672 89272 88292 68053 62356 47505 25949 13174 17238
12661 17238 32109 25464 13778 13930 22301 26900 26800 15723 -4879 -5190 39059 75376 88532
12648 88532 79987 73847 98254 132708 131802 112252 102099 104009 106785 105771 88276 68452 72842
12635 72842 77200 83643 86977 89931 102093 102417 108376 101600 102397 99833 104005 99279 82702 83146 80033
12620H0033J4522J3458j460q460L666L198J318m403j9628j1204j5097J674J2345
12607F9962m172j7889m829K568N37J2038O56r353j13m414O68J0887M279j683l310
12592E5832j3626n501o875j6541j4081r439k557N844J2081Q357K735j5890m600
12579d261O812J4601p97k1232j365J6117J7885J9886N585j3179l09r792J4479
12566D4430q410l803o667m50m099K732J3075L158p384j8922J1447P325p60n753
12552B5919j0811J4721J6784N649P96r000J0266p984l2766j7572J2276L136j4206
12539b792P313K4334J6274P580l586R051J4808L246K2998q159o396p639r090l459
12525F4483o276p181j6982j3945l939k544o427L034J11j233R992j5813o275J1101
$$ plain form
12620 80033 94555 108013 106553 98093 101759 104957 106275 101872 82244 71040 55943 57617 69962
12607 69962 65790 47901 43072 45640 46177 58215 58871 49518 49405 44991 45659 56546 60825 59142 55832
12592 55832 42206 36705 29830 13289 -792 -10231 -12788 -6944 5137 13494 16229 339 -4261
12579 -4261 2551 17152 16355 -4877 -6242 9875 27760 47646 53231 40052 39743 29951 44430
12566 44430 36020 32217 25550 25100 21001 23733 36808 39966 32582 13660 25107 32432 31672 25919
12552 25919 15108 29829 46613 52262 53058 44058 54324 46340 13574 -3998 8278 11414 -2792
12539 -2792 4521 28855 45129 52709 49123 58174 72982 76228 99226 91067 84671 77032 67942 64483
12525 64483 58207 51026 34044 20099 16160 13616 7189 10223 10334 9101 19093 3280 -2995 8106
12511H106k319j2850K453K423l016o858m121N011K2499o108l727K946n254j1101
12497a1916k700J4406p13m88Q432M899k1831n471J1720K819k189p813m632K0612
12483E135N406J605M532o147J817J0211q093m814r277O869J0268J0774J0536o639
12469C2183j3353j3533k2675K491J4617k836J2147j640l494p538j509Q890J3416
12456A7166L200K338j5644n834J2792N682J0358k982j5111L179k440p325K120
12443G499o93Q997k62n713j694j1047l979L656k609K235K822K2938J138k0605
12429B683r138K289J0615j6m933K826L381J139K379R621P298j2106R677R974o138
12414B9551n308m637j0426j672n95J5426J6468n143m837q557r524m515R202N237
$$ plain form
12511 8106 5787 -7063 -4610 -2187 -5203 -12061 -16182 -11171 11328 5220 1493 4439 -815 -11916
12497 -11916 -14616 -210 -923 -1411 7021 11920 -9911 -15382 -3662 -843 -3032 -10845 -15477 5135
12483 5135 10541 12146 16678 10531 12348 22559 14466 9652 375 7244 17512 28286 38822 32183
12469 32183 18830 5297 -17378 -14887 -270 -3106 9041 7401 3907 -3631 -5140 3750 17166
12456 17166 20366 22704 7060 1226 14018 19700 30058 27076 11965 15144 12704 5379 7499
12443 7499 6806 15803 15541 9828 8134 -2913 -6892 -3236 -5845 -3610 -788 22150 23288 2683
12429 2683 -6455 -4166 6449 6433 1500 4326 7707 8846 11225 20846 28144 16038 25715 35689 29551
12414 29551 24243 19606 9180 7508 6913 22339 38807 33664 28827 20270 10746 6231 15433 20670
12400B0670Q710R63Q718k57q748P69j0794O300R984K6515J2699o065R582R019
12386H8065j1216p595M497n111J0971J0497q632J1475L5985L4712L8940O7144
12374B69732Q2593J11703J27701J82114L00319L80166K99330l8867k86777l33530
12364A094484k70383j96226j35689r0977o6930n0642l2749k5900k9410l0970k1499
12353A43109j6662n555p546j3671j2965k2618m023K998k4955k2266N603R451M564
12340C5464j7292K026J3662r456J1360R670r482n86J0663m382k1410j685O153
12327B4705o274J0816M545r678O62K99n672j739J3468m767j4510j7709m577N831
12313d600O661N757N485P561Pk4543j3604L063Q081L210J6080O059n164j043L134
$$ plain form
12400 20670 29380 30343 39061 38804 30056 30825 20031 26331 36315 62830 75529 69464 79046 88065
12386 88065 76849 69254 73751 68640 79611 90108 81476 92951 128936 163648 202588 269732
12374 269732 352325 464028 591729 773843 1074162 1454328 1753658 1714791 1428014 1094484
12364 1094484 824101 627875 492186 401209 334279 283637 250888 224988 195578 164608 143109
12353 143109 126447 120892 113346 99675 86710 64092 60069 63067 38112 15846 21449 30900 35464
12340 35464 18172 20198 33860 24404 35764 45434 35952 35366 46029 41647 20237 18552 24705
12327 24705 18431 29247 33792 24114 24776 25075 19403 17664 31132 26365 11855 -5854 -10431 -4600
12313 -4600 2061 7818 13303 20864 20871 -3672 -17276 -14213 -6132 -2922 13158 19217 14053 13010 16144
12298A6144L581M678r067j1948o300p163J7272R54M603m104M87q528j006P55o096
12283e738p055R113Q409O999o166n521k986P897L400N05o229p965k823m79J1469
12268B830K938O887m895r045j2737j9288K44J403K103p72J0606P176Q050L358
12254a142p578L183r95n818r034O769J3284k072R984O135N513O767j5362N183
12240A4817M710m546j01J479m732m214L424m600n531M173k612r787j3709R344
12226a1885J1263P487j509O901o025j5839J2271m088p12k255N620p92r70j656
12212b189J3158J0631m805r218R75P234r306q822J0171M829J853K940j5236j638
12198E77j5981j2469j262M564Q057J2934J0887p527j170l690N847K103R102J0176
$$ plain form
12298 16144 19725 24403 15336 3388 -2912 -10075 7197 8151 12754 8650 9137 609 -397 358 -5738
12283 -5738 -12793 -3680 4729 11728 5562 41 -2945 4952 8352 8857 2628 -5337 -8160 -8639 2830
12268 2830 5768 12655 7760 -1285 -14022 -33310 -33066 -31663 -29560 -30332 -19726 -12550 -4500 -1142
12254 -1142 -8720 -5537 -6532 -12350 -21384 -14615 -1331 -3403 6581 12716 18229 24996 9634 14817
12240 14817 19527 14981 14880 16359 11627 7413 10837 6237 706 4879 2267 -7520 -21229 -11885
12226 -11885 -622 6865 5356 12257 6232 -9607 2664 -1424 -2136 -4391 1229 437 -533 -2189
12212 -2189 10969 21600 16795 7577 8552 15786 6480 -2342 7829 12658 14511 17451 2215 577
12198 577 -15404 -27873 -29135 -24571 -16514 -3580 7307 -220 -1390 -5080 767 2870 11972 22148
12184B2148j2669p958Q712j2587j4400N101o8k688K5148J9731o725l1453j2156
12171a9864J6915J5660q605J227M207K666L840j2647p133r167J133j0140M693
12158a7215J14o33p972J1858J2607j178j1191J6440p453j2679p556k821P067K5550
12144D938K2608j6931k0398P987M752N575k3266j7020K7179J3489q93q505j473
12131a958j0618k689J5369K933q370q403j713J5010N081q516N216K624j3910o52
12117a0596N192m858Q443J4946J3661R076j4879n527J173j5160o350R535L470
12104H126l095m640n083N007l698n235j211j077O993l114M320Q126N370j1563
12090g74O970M965j7665r519r63P511O850J0362K393P985M4P99j1572j6933J1965
$$ plain form
12184 22148 9479 1521 10233 -2354 -16754 -11653 -11721 -14409 10739 30470 23745 -7708 -19864
12171 -19864 -2949 12711 4106 5333 9540 12206 16046 3399 -3734 -12901 -11768 -21908 -17215
12158 -17215 -17101 -17734 -25706 -13848 -1241 -2419 -13610 2830 -4623 -17302 -24858 -27679 -20612 4938
12144 4938 27546 10615 -9783 -1796 2956 8531 -14735 -31755 -4576 8913 8020 -485 -1958
12131 -1958 -12576 -15265 104 3037 -5333 -13736 -15449 -439 4642 -3874 1342 3966 -9944 -10596
12117 -10596 -5404 -10262 -1819 13127 26788 35864 20985 15458 16631 1471 -4879 4656 8126
12104 8126 5031 391 -4692 315 -3383 -8618 -9829 -10906 -3913 -7027 -2707 5419 10789 -774
12090 -774 6196 11161 -6504 -16023 -16986 -9475 -2625 7737 10130 18115 18159 18958 7386 -9547 2418
12075B418J2743k959r651j1754O969p987o15K559L942kJ5700J9738M079p436j0026
12060A7718r586j4110l268J8123J2589Q921l000p579j4226r880L28j0032j2165
12047b6167J5878O553R142q583O656p197k3084j873J454L638J6190J9758J95r646
12033B914n572K290N853r734J5126L745M779R45o777K183n106j0383j0356Q021
12019b072N182o803r896J5217j0035q102J4263R879K605o395Q643P144q095q727
12005B808n77o436J2431J5968j1019j1779K596r188J3754M081j291R009j0506
11992I851o13K616J0241P467N603q36j9894k4318n960J8388J4335L528j4523k3385
11978a7500L555K0644L553m980j0325J1773l727r563l346M745R321j1575k196
$$ plain form
12075 2418 15161 12202 2551 -9203 -2234 -10221 -10836 -8277 -4335 -4337 11363 31101 35180 27744 17718
12060 17718 8132 -5978 -9246 8877 21466 30387 27387 19808 5582 -4298 -3970 -14002 -26167
12047 -26167 -10289 -3736 5406 -3177 3479 -3718 -26802 -28675 -27221 -23583 -7393 12365 12560 2914
12033 2914 -2658 -368 5485 -4249 10877 14622 19401 20346 13569 15752 10646 263 -10093 -2072
12019 -2072 3110 -3693 -13589 1628 -8407 -16509 -2246 7633 10238 3843 12486 19630 11535 2808
12005 2808 2231 -4205 8226 24194 13175 1396 3992 -5196 8558 12639 11348 20357 9851
11992 9851 9238 11854 22095 29562 35165 34329 14435 -9883 -15843 2545 16880 20408 5885 -17500
11978 -17500 -13945 6699 10252 5272 -5053 6720 2993 -6570 -9916 -5171 4150 -7425 -9621
11965i621O422M498M756o427N822J338P85O382N28P445l336l559K827J864L54
11950B0078P204o171j2071j6637M101m207j243j627N466J4745p606j4028l694
11937a5690R958O278l188k4297O56R490K109n60r381J5956J1966J472m255O0k5
11922E49Q909L7K31n039q895J1011j0400j021J0762J2340O624O181N37N736j4190
11907B3372l2700k2962R140J4397J0695n725k468j4888l418O971k751r078P780
11894b1635k726J3759R939q612m649J0145J6279j4583l836J364M946P393K564
11881A0348m18n838J405m263J7010J3973k2115o437J0841p281p618j1688l34p224
11867a9639K272J8158J6209N02R85o449j822O902r988l590O204q972k468Q996
$$ plain form
11965 -9621 -3199 1299 6055 -372 5450 6788 7573 13955 14483 21928 18592 15033 17860 19724 20078
11950 20078 27282 21111 9040 -7597 -3496 -7703 -8946 -10573 -5107 9638 2032 -11996 -15690
11937 -15690 -5732 546 -2642 -26939 -26283 -16793 -14684 -15244 -24625 -8669 3297 4769 514 574 549
11922 549 9458 9495 9726 4687 -4208 6803 -3597 -4618 6144 18484 25108 31289 31826 37562 23372
11907 23372 -9328 -32290 -23150 -8753 1942 -3783 -6251 -21139 -24557 -17586 -20337 -29415 -21635
11894 -21635 -24361 -10602 -663 -9275 -13924 -3779 12500 -2083 -5919 -4555 391 7784 10348
11881 10348 9930 4092 5497 1234 18244 32217 10102 3665 14506 7225 -393 -12081 -12415 -19639
11867 -19639 -17367 791 17000 17502 18487 12038 10216 17118 7130 3540 9744 772 -1696 7300
11853G300j768j158q864P177M015o312q004O103M309R251l810j0576L450K861
11839C974J1523j006q697J0514J29k866j2180K366j4546p934J8250K2178q489
11826A3216o119J5445k0499K448j1781p420Q629J5826O632j7852K067O381q098
11813a125j0532j6478N058J7979m614q760n609J729J6706j0064r541J3771q62
11800a2342l315K300L221j437L65Q281J860l625k699J6105J1830q775p938k8178
11786b4347r934J1517J8145n050k908P732J8077J4737R169K367j0933n241l280
11773B0051o409p553J039K166n72Q998P533l821j639j3401j6885j1373j697l734
11759b7297R452N427J2790J0545J494j0577k3560j1362Q768J867J663o241l950
$$ plain form
11853 7300 5532 4374 -4490 2687 6702 390 -7614 -1511 2798 12049 8239 -2337 1113 3974
11839 3974 15497 14491 5794 16308 16437 13571 1391 3757 -10789 -18723 -473 21705 13216
11826 13216 7097 22542 2043 4491 -7290 -14710 -6081 9745 16377 -1475 592 6973 -1125
11813 -1125 -11657 -28135 -23077 -5098 -9712 -18472 -24081 -22352 -5646 -15710 -25251 -11480 -12342
11800 -12342 -15657 -13357 -10136 -11573 -11208 -2927 -1067 -4692 -7391 8714 20544 11769 3831 -24347
11786 -24347 -34281 -22764 -4619 -9669 -12577 -4845 13232 27969 37138 39505 28572 23331 20051
11773 20051 13642 6089 7128 9294 8722 17720 25253 21432 19793 6392 -10493 -21866 -23563 -27297
11759 -27297 -17845 -12418 372 10917 12411 1834 -21726 -33088 -24320 -22453 -20790 -27031 -30981
11746c0981J7916K1586J150J1198J1841O991j3747q369L139q2j3385K976k285
11733G948j8934j4048O815J7785J9482M194j2352k7116P032N649K460N826k795
11720A946j3995K002J1993k285K848J5339m220j718j850O782K669r975j8477R13
11706h028Q572R75j3367p175M314J4929q990o853j168n486l691J5625n359p6L506
11691a2272j4623P830K0594O82R050m629m447J4702K170p790O28K681k724m719
11677G133J0369J108j4987n606P860Q504k2238l028J3006j5899P119M646m823
11664f836K299J6280l818r371j4626J2058Q396M83j1009k769k805N884J3706j184
11650F688o444P469m3p656O758N760J920k482n392k813P562J1066k0295j4953
$$ plain form
11746 -30981 -13065 8521 9671 20869 32710 39701 25954 17585 20724 20642 7257 10233 7948
11733 7948 -10986 -25034 -18219 -434 19048 23242 10890 -16226 -9194 -3545 -1085 4741 1946
11720 1946 -12049 -10047 1946 -339 2509 17848 13628 11910 10060 16842 19511 9536 -8941 -8028
11706 -8028 544 1519 -11848 -19023 -14709 220 -8770 -15623 -16791 -22277 -25968 -10343 -15702 -15778 -12272
11691 -12272 -26895 -19065 1529 2211 11261 6632 2185 16887 19057 11267 11895 14576 11852 7133
11677 7133 17502 18610 3623 -1983 5877 14381 -7857 -10885 2121 -13778 -6659 -2013 -6836
11664 -6836 -4537 11743 7925 -1446 -16072 -4014 4382 4865 -6144 -8913 -11718 -5834 7872 6688
11650 6688 244 7713 7670 14 6772 12532 14452 11970 6578 3765 11327 22393 2098 -12855
11636a2855O409R268J2935N249r850j7190O437o917j2418J1245J8857r830k0447
11623a9107m113K0071J9748J7779l929j7014j6906m485j3306J0645R479o290J4821
11610G393J2510r223j6942o487J0095P157o71J628j5467n945P443k649p266J0717
11596g707J2293J1805j0476k4145j1080J600n105L645L922Q788Q436k100J278
11583h846q152j4795L488J7695J7202j0367o371J0687R405K611j1018p590P63
11570e288l306K109P2J3J5932R96Q64j7473q324K90M327p348M105J4858J1008
11555A2835Q799j1425K711J1094J1906n087l027j7570J355J1861j0624o912O360
11542A2276Q686n266p152o817p361j340M870J1951k340n888J1426P704o894r924
$$ plain form
11636 -12855 -6446 2822 15757 21006 11156 -6034 403 -6514 -18932 -7687 11170 1340 -19107
11623 -19107 -23220 -3149 16599 34378 30449 13435 -3471 -7956 -21262 -10617 -1138 -7428 7393
11610 7393 19903 10680 -6262 -12749 -2654 4503 3832 5460 -10007 -15952 -8509 -11158 -18424 -7707
11596 -7707 4586 16391 5915 -18230 -29310 -27710 -32815 -29170 -25248 -16460 -8024 -10124 -8846
11583 -8846 -16998 -31793 -28305 -10610 6592 -3775 -10146 541 9946 12557 1539 -6051 -5288
11570 -5288 -8594 -6485 -6413 -6400 9532 10528 11392 -6081 -14405 -14115 -9788 -17136 -13031 1827 12835
11555 12835 21634 10209 12920 24014 35920 30833 27806 10236 11591 23452 12828 5916 12276
11542 12276 20962 15696 8544 1727 -5634 -6974 -2104 9847 7507 1619 13045 20749 13855 3931
11528C931l638J2237R847M44R954o732j4304j380P861K6550o268j3015j2064j1103
11514B320L383J0232l176N624l91O828R277j4942j1307J473O248k459q711j0875
11500f476n469J5811J482M152P040M541r62q320K1224k420m325r834M939J3733
11486C5116l053j0269k461q060k936j0550O711P156L001k224J3403J1362M603
11473D1799j4299r521k086r256j7645r833J3033J0044N588J0227J2953k341j9124
11460I539P575Q829p359k814p635p407P766o877N235R349N939N997l274j1247
11446A3616j1764l966l859P549K143O906k629j5196Q951m671j506K425O509J803
11432F311o564R15k926M860J236J4327N417K992j281j688n979l772P488J869j3531
$$ plain form
11528 3931 293 12530 22377 22821 32775 26043 11739 10359 18220 44770 38502 25487 13423 2320
11514 2320 5703 15935 12759 18383 17992 24820 34097 19155 7848 9321 15569 13110 4399 -6476
11500 -6476 -11945 3866 5348 9500 16540 21081 20119 11799 33023 30603 26278 16444 21383 35116
11486 35116 32063 21794 19333 11273 8337 -2213 4498 11654 14655 12431 25834 37196 41799
11473 41799 27500 17979 15893 6637 -11008 -20841 -7808 2236 7824 18051 31004 28663 9539
11460 9539 17114 25943 18584 15770 8135 728 8494 1617 6852 16201 22140 28137 24863 13616
11446 13616 1852 -2114 -5973 1576 3719 10625 7996 -7200 1751 -2920 -4426 -2001 4508 6311
11432 6311 -253 662 -2264 2596 3832 18159 23576 26568 25287 23599 17620 13848 21336 23205 9674
11417I674K487J9921N986j9127j3162K769n781R056j382j3199Q37K1821J6147
11404C6047j2742j2181p097M379J6015M154P83K1929o198k0166j9811j3368j402
11391i658J4731J9752M648j5239p682j0563l227j1908Q97K2775K6711R38k1792
11378A0383q228m288M836J1621k315k956L758K1344P990j285k5407p4j2917j0022
11364g560M285J639O227J4502K237M897j4522k6561J65K4640L835l120L516O688
11350B0868L278N67P179j5297j0395J801l543k237k909J5687J0825J504P221M898
11336C9447o605L628Q688J742j890j1548j5048k339l373p528r380N421J6012L86
11322A7613K711j254J0466K919q614r316n379M750R559j1605J793P740J5071j2517
$$ plain form
11417 9674 12161 32082 38068 18941 5779 8548 2767 11823 10441 -2758 -1921 19900 36047
11404 36047 23305 11124 4027 8406 24421 28575 29358 51287 45089 24923 5112 -8256 -9658
11391 -9658 5073 24825 29473 14234 6552 -4011 -7238 -19146 -18249 4526 31237 32175 10383
11378 10383 2155 -2133 2703 14324 12009 9053 12811 34155 42145 40860 15453 15379 2462 -7560
11364 -7560 -3275 -1636 4591 19093 21330 26227 11705 -14856 -14691 9949 13784 10664 14180 20868
11350 20868 24146 24713 31892 16595 6200 8001 4458 2221 -688 14999 25824 27328 34549 39447
11336 39447 32842 36470 45158 46900 45010 33462 18414 16075 12702 5174 -4206 1215 17227 17613
11322 17613 20324 19070 29536 32455 23841 14525 9146 13896 23455 11850 13643 21383 36454 23937
11308B3937K345J4235q688j1477p360O016M414j5936j4193j037m056R29J7576
11295F705j018p824R698N232N880M966O195N42M47r27q453k4664r219k137l785
11280a8362K1045J9133l078R023J123M505m846o091O47K386J3818j0240m861N284
11266B9486M236q436j2780j3068p53J2169j252p2j779M269p734m150J862J0882
11252A2880l284j04P492k5282P22J4755K372J7571J7187Q198J1462j9502k0553
11239B3914j808l111q533j5370j877K6301K8045r121j2590p261O28J3864J5078
11226D8159L91J032J720j3318n255P7k2640M360J9497n563j2063N561k763L1644
11212E0839J9907j4864j393k2370o577J1568J1621j3912m959o668k139K056J2407
$$ plain form
11308 23937 26282 40517 31829 20352 12992 19008 23422 7486 -6707 -7744 -11800 -10871 6705
11295 6705 5687 -2137 7561 12793 18673 23639 29834 30376 30823 29896 21443 -3221 -12440 -14577 -18362
11280 -18362 2683 21816 18738 27761 28884 33389 28543 22452 23099 25485 39303 29063 24202 29486
11266 29486 33722 25286 12506 -562 -1315 10854 9602 9530 7751 12020 4286 136 1998 12880
11252 12880 9596 9492 16984 -8298 -7576 7179 9551 27122 44309 52507 63969 44467 23914
11239 23914 22106 18995 10462 -4908 -6785 19516 47561 38440 25850 18589 19217 33081 48159
11226 48159 48550 49582 51302 37984 32729 32806 10166 14526 34023 28460 16397 21958 19195 50839
11212 50839 70746 55882 54489 32119 25542 37110 48731 34819 29860 23192 21053 23109 35516
11199C5516J0199k102m245J2722J6339j0485j1907k753J257k685P4m806p44P128
11185D3508O476m633Q9J8600P494R723K8985Q346Q307l849O468P47j652O900K1150
11170A56659O835L892J6339L3879M5095O9831N9787R3797J44136J92663K57566
11159A080479K53685J17766L9527m0413k04820k71922k24826j59674j07417r8831
11149C83554o3440m9577m4233r583k1597j6678j1601j1187j0598j764o106r591
11137A27599k3211Q286J9042j2973j3906j3762m777J11Q863j0817n215Q991N588
11124I3819j8080j0673j5040q985R659J049L391J9873M205P366j8287j629j3741
11111E2927j579M853j4824o590l212P157P823j4701K778M006J701P283L042P04
$$ plain form
11199 35516 45715 43613 39368 52090 68429 57944 46037 43284 44541 41856 41930 37124 36380 43508
11185 43508 49984 45351 45440 64040 71534 81257 110242 118588 126895 123046 129514 130261 128609 135509 156659
11170 156659 163494 167386 183725 217604 262699 332530 392317 486114 630250 822913 1080479
11159 1080479 1334164 1451930 1491457 1451044 1246224 974302 749476 589802 482385 383554
11149 383554 320114 270537 226304 216721 195124 178446 166845 155658 145060 143296 137190 127599
11137 127599 104388 112674 131716 118743 104837 91075 86298 86409 95272 84455 79240 88231 93819
11124 93819 75739 65066 50026 41041 50700 51749 55140 75013 79218 86584 68297 66668 52927
11111 52927 51348 56201 41377 34787 31575 38732 46555 31854 34632 38638 40339 47622 50664 51368
11097E1368J0319k011O981L938j198j274j5257r290J9015J2922j333l79j535o484
11083F5782k831r715l94J0990m616j1027k451n45j798O999J6615j777k776j9967
11069D2489j5759J7674P7j1187j4690m968m521K616M702M841J2098l39l06K04
11055C2931k224l779l534N265j2494J1562K3133K1357n134j1385l066j8402p677
11042B6553M700M413l778j774J5209R218q599m976m809J0270R916n718p232j3539
11028B9854L291R31P618J2706J147p754o867K075K981p575r299N436J7559K437
11014E4540q170P387R544O649J5095J2624O169J7330K2401P573J2661K9364J3559
11001B06726o235Q926j8433j2645Q558k5104k6265k6898j3573J1498M752J6174
$$ plain form
11097 51368 61687 59676 66657 70595 69397 68123 52866 43576 62591 75513 74180 73801 72266 65782
11083 65782 62951 53236 52842 63832 59216 48189 45738 45193 43395 50394 67009 65232 62456 42489
11069 42489 26730 44404 44481 33294 18604 13636 9115 11731 16433 21274 33372 33033 32727 32931
11055 32931 30707 26928 23394 28659 16165 27727 50860 72217 67083 55698 52632 34230 26553
11042 26553 31253 35666 31888 30114 45323 54541 45942 40966 36157 46427 56343 50625 43393 29854
11028 29854 33145 34076 41694 54400 55547 47793 40926 43001 45982 38407 29108 34544 52103 54540
11014 54540 46370 53757 63301 69950 85045 97669 103838 121168 143569 151142 163803 193167 206726
11001 206726 200491 209417 190984 178339 186897 161793 135528 108630 95057 106555 111307 127481
10989A27481O558p778n924P424m022K596r268k1025j1298j029R55J2894O870r49
10975A03485J5727j401j9104j7523J8689Q266Q479o713j2830j1639k83R526o398
10962H8281k3231n81O930o028j3286j0265k194M390J2820O649n463k468n394R578
10948E9738L978M43k539J946L620J176j5267P070L1503M2935L5098K3762J4753
10935B08216J657o722j7651N951O758J0517N047m294L480m255j0808j0265O331
10922A93962p556J1163P129o633j5189N147j075o424j3064k5074k8257o777N820
10909A13172L278j4960k4190j1670J7830L9664K1147J8816K9012J7260M903k930
10897B11332j1390j4636J6611L404M971Q864R060O188J7752L406j811N493j844
$$ plain form
10989 127481 134039 126261 120337 127761 123739 126335 117067 96042 84744 83715 84670 97564 104434 103485
10975 103485 119212 117811 98707 81184 99873 108139 116618 109905 97075 85436 85153 94679 88281
10962 88281 65050 64469 71399 65371 52085 41820 39626 44016 56836 63485 58022 55554 50160 59738
10948 59738 63716 64159 61620 63566 67186 68362 53095 60165 91668 134603 169701 193463 208216
10935 208216 209873 203151 185500 191451 198209 208726 213773 209479 212959 208704 197896 187631 193962
10922 193962 186406 197569 204698 198065 182876 188023 186948 180524 167460 142386 114129 107352 113172
10909 113172 116450 101490 77300 65630 83460 123124 144271 163087 192099 209359 214262 211332
10897 211332 199942 185306 201917 205321 210292 219156 228216 234404 252156 255562 253751 259244 257400
10884B57400K372j5742O060Q105Q356q642k46n936j6846o346j1761J821K2235
10871B40830L0820J7968L161n351O5j306j406K0563Q082J2431J83k229K806N000
10857C31617J4673L927j350j826p944K0219N302q798J1215J7267K1552O831l450
10844D09235L540K2142J1046k488k588J1912J532j685K0257J4231K027O595O22
10831D96378k968j613J9301Q098J3372K4357L4741J0471J7934K1040J4136J3181
10819F68428L1140L9891J3544J4114J2100J2237K9627L7099L2473L5688N2430
10808I78771M9033Q4545J16922J28257R6279P4327N3586J7332m4002m4465p320
10797A503265P887J9102L6663M4132M7195O2140R1607R2447Q6397R3171J01449
$$ plain form
10884 257400 259772 244030 250090 258195 266551 257909 257663 251727 234881 228535 216774 218595 240830
10871 240830 271650 289618 292779 287428 287493 286187 284781 305344 313426 325857 326040 323811 326617 331617
10857 331617 346290 350217 348867 347041 339097 359316 364618 355820 367035 384302 405854 412685 409235
10844 409235 412775 434917 445963 443475 440887 452799 454331 452646 472903 487134 489161 495756 496378
10831 496378 493410 491797 511098 519196 532568 556925 591666 602137 620071 641111 655247 668428
10819 668428 699568 739459 753003 767117 779217 791454 821081 858180 890653 926341 978771
10808 978771 1027804 1112349 1229271 1357528 1453807 1528134 1581720 1599052 1555050 1510585 1503265
10797 1503265 1511152 1530254 1566917 1611049 1658244 1720384 1811991 1904438 1990835 2084006 2185455
10786B185455R1807J13576J56349J67641K02892K00326K34724K67301K92475L34682
10776D247228L83863M43823N03965N96253P02042Q16630R51866J015163J011250
10767A0672083J131020J271332J212245J156035J212361J283385J394437J693205
10759B1026103K248717L120442M300673N879079Q138060J1569992J6970987K5610020
10751I8864073L8462384N1469922M5927327J9158068P562064k998539l2576582
10744B25868717m7307418m2270535l2179802k3120310j6521889j2054304q971484
10737D3442975o735259n150847l953345l012289k339317j978989j722709j521928
10729A7028292j400361j315906j236272j146396j000955r69359j002582r51485
$$ plain form
10786 2185455 2277262 2390838 2547187 2714828 2917720 3118046 3352770 3620071 3912546 4247228
10776 4247228 4631091 5074914 5578879 6175132 6877174 7693804 8645670 9660833 10672083
10767 10672083 11803103 13074435 14286680 15442715 16655076 17938461 19332898 21026103
10759 21026103 23274820 26395262 30695935 36575014 44713074 56283066 73254053 98864073
10751 98864073 137326457 188796379 234723706 253881774 261443838 258445299 225868717
10744 225868717 178561299 136290764 104110962 80990652 64468763 52414459 43442975
10737 43442975 36707716 31556869 27603524 24591235 22251918 20272929 18550220 17028292
10729 17028292 15627931 14312025 13075753 11929357 10928402 9959043 8956461 8004976
10721H004976q54217p51129o08139m96227m33864l90461l16100k57052k29949
10712C667838j99420j84456j83897j81886j74848j54368j53422j32352j14971
10703B188218j07596j04801r3337q8471r0140p7555o3725p4381p3614p3944m8176
10692A292478l4321m2477m8821l8970l3956n0559m6757l7051l1764k4734k3845
10681H79223k9666m9506j6071k2986k4205j4688l0448k8855r600k3539m152N0
10669F25557j4923o809j1571k4984l5717l0191J606J339n381k3846k4147j5197
10657D35736j6647k0589J432L516k7169k1421j1389n307L966K713M677p499p965
10644C34054j1483J6736j8660j1666k191k1162o965J177r265q519m64m524j7757
$$ plain form
10721 8004976 7150759 6399630 5791491 5295264 4861400 4470939 4154839 3897787 3667838
10712 3667838 3468418 3283962 3100065 2918179 2743331 2588963 2435541 2303189 2188218
10703 2188218 2080622 1975821 1882484 1794013 1703873 1626318 1562593 1488212 1414598 1340654 1292478
10692 1292478 1258157 1215680 1166859 1127889 1093933 1043374 996617 959566 927802 903068 879223
10681 879223 849557 800051 783980 760994 736789 722101 691653 662798 653198 629659 625507 625557
10669 625557 610634 603825 592254 567270 531553 501362 502968 504307 498926 475080 450933 435736
10657 435736 419089 398500 399932 403448 376279 354858 343469 338162 342128 344841 349518 342019 334054
10644 334054 322571 339307 320647 308981 306790 285628 278663 279840 270575 262056 261592 257068 239311
10631B39311K949M559k288N818P445K3354K538n873l590J2981r74k4730Q94j3528
10617B48866l3151k9331j5610r170J808P849P960j1546o775j1803O742q826l884
10604A43129n830J375n043k267j0644j1895m194j4911m166L566K3531J7118K1648
10591A51417L0616K9752J0104j520j3945j7438j4278K620p4o440k554q547j5552
10578A44161k6320k9652q258M865K0593J5588j546j3979j2616k897L624J2003
10566A05566K4128Q832R796L9090N0147O2363J21556J94247J83788R0648N6980
10555I47141K9441j08324j50358j41804j00440o8856n1549l5241l4472l9299k6422
10544B19817j9098k4230P969m095q907l131j2922j4004j866k6405j3381J4305
$$ plain form
10631 239311 242260 246819 244531 250349 257794 281148 283686 277813 274223 287204 286230 261500 262394 248866
10617 248866 215715 186384 170774 161604 163412 171261 179221 167675 160900 149097 155839 147013 143129
10604 143129 137299 138674 133631 131364 120720 108825 104631 89720 85554 89120 112651 129769 151417
10591 151417 182033 211785 221889 220369 206424 188986 174708 177328 177254 170814 168260 159713 144161
10578 144161 117841 88189 79931 84796 105389 120977 119431 105452 92836 89939 93563 105566
10566 105566 129694 138526 148322 187412 237559 299922 421478 615725 799513 890161 947141
10555 947141 976582 868258 717900 576096 475656 406800 355251 320010 285538 246239 219817
10544 219817 200719 176489 184458 180363 171456 168325 155403 141399 139533 113128 99747 114052
10532A14052O24n358K497L578N423j112j33r643m257K93p893j2995j3492j4046
10518E7538k024N680P463R169l05k6376p155k821J7001n095l784N850L257j403
10504E6995J3757R07n928p668J581l90o897K208p276k5572k9372q71Q593L264
10490C331N289L084j572J0207L859r672o485J978J0903P445J0652P191m01j0403
10476C5406M531L188J485mr765j5390q28K5186k319l47L456q082j0481m748Q56
10461B2144M248P623K667k1118n648Q508k548J0427J2104K560J1078j7904k3346
10448A0795Q196J352p436J275J9448Q610N843j511J743J2681J3263M782n383j948
10434G1710M35j4076p202O137l885l83k992j7858j540J5057j0701j1374r87J481
$$ plain form
10532 114052 114676 109318 111815 115393 120816 119704 119571 109928 105671 105964 98071 85076 71584 57538
10518 57538 55514 61194 68657 77826 77521 51145 43990 41169 58170 53075 49291 55141 58398 56995
10504 56995 70752 71659 65731 58063 59644 59254 52357 54565 47289 21717 -7655 -8526 67 3331
10490 3331 8620 11704 10132 20339 24198 14526 8041 10019 20922 28367 39019 46210 45809 35406
10476 35406 39937 43125 44610 44606 34841 19451 18623 43809 41490 41143 44599 36517 26036 21288 22144
10461 22144 26392 34015 36682 15564 9916 18424 15876 26303 38407 40967 52045 34141 10795
10448 10795 18991 20343 12907 14182 33630 42240 48083 46572 48315 60996 74259 79041 73658 71710
10434 71710 72145 58069 50867 57004 53119 52736 49744 31886 30346 45403 34702 23328 22341 23822
10420B3822p677j882j127O601J6067n143n535P852j3540j5323r730J1782n020
10407A147P020J0726Q121o510J187n428k0954m900N044M894p898p720l209O715
10393a1765r18J0671J4888J4064j1687j1328M576j1420j2141J2510J2166K92Q271
10380A8179J0340P215O1M831K206j1608j6725L014j715L277k108N921J5340K3912
10366F2140N591r000k4625m742J7033J3536l183q35o181m372K629R874k229J486
10352E7122L080Q191L067J2814J6660L4630J477M098l055M086J9597K7529K3218
10339B12514M1275P8366J11892J32536K16954K93941K24963R9189K6995n8816
10329A379809k09282k52574j90099j66680j30329r8150m8804n1913m5067k0586
$$ plain form
10420 23822 16145 14263 13136 19737 35804 30661 25126 32978 19438 4115 -5615 6167 1147
10407 1147 8167 18893 27014 20504 21691 16263 -4691 -9591 -4547 347 -7551 -15271 -18480 -11765
10393 -11765 -12683 -2012 12876 26940 15253 3925 8501 -2919 -15060 -2550 9616 9908 18179
10380 18179 28519 35734 35795 40626 42832 31224 14499 17513 15798 19075 16967 22888 38228 62140
10366 62140 67731 58731 34106 29364 46397 59933 56750 55915 49734 45362 47991 57865 55636 57122
10352 57122 60202 68393 71460 84274 100934 135564 137041 141139 138084 142170 161767 189296 212514
10339 212514 253789 332155 444047 576583 793537 1087478 1312441 1411630 1438625 1379809
10329 1379809 1170527 917953 727854 561174 430845 332695 283891 231978 186911 166325
10319A66325p335k6196n619l50j2745k911j1956j6724O629j1887j2083O458P362
10306G8968k2865k3089J0041L941k140j4439r817K702m01L075O465N893j9992
10293A8342l190O698J2730o61j9105k3872J613J697k693K1792J5286j6978j2785
10280a126p89p766J6308Q784j2988P544K0920l296l986p384j5598j0656J817J1638
10266C422l330m371m92j835R842O731L740J988k189j217o55m411j16j0739k145
10251e777M514k2537k3154J6162K3152m17R726K3145K738j2871j1587q660L388
10238b178M20n481R386K423l496j280k871k614L287Q731L366R679j4163j0438
10224e229Q505J1598L714k098q100r934K054K419j6760q684R504P427M091k284
$$ plain form
10319 166325 158990 132794 127175 126825 114080 111169 99213 82489 89118 77231 65148 71606 78968
10306 78968 56103 33014 43055 46996 44856 30417 20600 23302 22901 25976 32441 38334 18342
10293 18342 15152 21850 34580 33919 14814 -9058 -7445 -5748 -8441 13351 28637 11659 -1126
10280 -1126 -1915 -9681 6627 15411 2423 9967 30887 27591 23605 16221 623 -10033 -8216 3422
10266 3422 92 -4279 -4771 -6606 3236 9967 13707 15695 13506 12289 11634 7223 7107 -3632 -5777
10251 -5777 -1263 -23800 -46954 -30792 -7640 -8057 1669 24814 27552 14681 3094 -5566 -2178
10238 -2178 -1758 -7239 2147 4570 1074 -206 -3077 -5691 -2404 6327 9693 19372 5209 -5229
10224 -5229 3276 14874 18588 16490 8390 -1544 510 2929 -13831 -22515 -13011 -5584 -1493 -3777
10210c777k332J8903Q014q004o420o671m892n293J221P994J7789J4477n931M33
10196B5511j3048r059P362O636j0334r760n185n211k957K440J3276R470j239j1901
10182c999k462L063p898J2254M639j6465m776K0816P360j0058r310q270j102J5906
10168c02R030L084l648k1072j0819q925O726J4323J2421m215k857j0925m183N370
10154a5992Q285J667n202j5666Q512P955M961N331l499N538P687J1246j7438j0833
10140g448J7752l532j2233J960j025J0828m011k2884r718J7036O680o216M458
10127h353m425K09p333p611M524J2390J2861j6046j0127J4680J2668k358n176
10114d097K077J0576L370j7876N33j2970j2680J0937p870j8193O38K0003O235
$$ plain form
10210 -3777 -6109 12794 20808 12804 6384 -287 -5179 -10472 -9251 -1257 16532 31009 25078 25511
10196 25511 12463 3404 10766 17402 7068 -2692 -7877 -13088 -16045 -13605 -329 9141 7902 -3999
10182 -3999 -6461 -3398 -11296 958 5597 -10868 -15644 5172 12532 2474 -6836 -15106 -16208 -302
10168 -302 8728 11812 8164 -12908 -23727 -32652 -25926 -11603 818 -3397 -6254 -17179 -21362 -15992
10154 -15992 -7707 -6040 -11242 -26908 -18396 -10441 -5480 -149 -3648 1890 9577 20823 3385 -7448
10140 -7448 10304 6772 -5461 -3501 -4526 6302 2291 -20593 -30311 -13275 -6595 -12811 -8353
10127 -8353 -12778 -12569 -19902 -27513 -22989 -10599 2262 -13784 -23911 -9231 3437 1079 -4097
10114 -4097 -2020 8556 11926 -5950 -5417 -18387 -31067 -20130 -28000 -46193 -45555 -25552 -19317
10101a9317P262J7072r08l241p795Q854J3263j6784j3132J4341J312r868O718
10088b223K359k3997m40J4712J0565J8984j1532j6559m200n105J7938K287j7670
10075a4881J7811L130n419o469j494j281j839K123N093k382N302j339J360m674
10061d959J505l007r133K279J2249J5981l347k6836k987m836P246n244j0418O026
10047b5481Q021J8980J766j603m807r55P547L698J471M200j0916R41J4933r742
10033H053k9317p908O051J7548l598r743J0076L098k663P047N022J269q047J1867
10019H755J0776r129j0590q51M2R543m474q056J1684J3182j659j1979j2768N516
10005hj6386j6662L165R562L585n697J598J3627K941P743L921O143j690j3090
$$ plain form
10101 -19317 -12055 5017 4109 868 -6927 1927 15190 -1594 -14726 -385 927 -8941 -2223
10088 -2223 136 -23861 -24301 -9589 976 19960 8428 -8131 -12331 -17436 502 2789 -14881
10075 -14881 2930 6060 641 -5828 -7322 -8603 -10442 -8319 -3226 -5608 -306 -1645 -285 -4959
10061 -4959 -3454 -6461 -15594 -13315 -1066 14915 11568 -15268 -18255 -23091 -15845 -21089 -31507 -25481
10047 -25481 -17460 1520 3286 1683 -3124 -4079 3468 7166 8637 12837 1921 2862 17795 8053
10033 8053 -21264 -29172 -23121 -5573 -9171 -18914 -8838 -5740 -8403 -1356 3666 4935 -3112 8755
10019 8755 19531 10402 -188 -1039 -997 8546 4072 -3984 7700 20882 19223 7244 -5524 -8
10005 -8 -16394 -33056 -29891 -20329 -16744 -22441 -20843 -7216 -4275 3468 7389 13532 11842 -1248
9991a248n358O492o392q030l338J492p813J2252n282m431J0139m26O167R219L428
9976F871k833L031l123k497Q300k153o891j523J8361J775p699J685P513l363j7705
9961b51o492K643O639l194j2836m460J1710J3407j567J119p699j0203k064N310
9947g938P671l391N006k093J204j6840o44L748p416j314K1605J7725p101R092
9933A9314P944j3425O385O243L516P298k1516n009J1516q074j4427m67l734q131
9919a2567J3867J158j6457L307K41L156J0040J053k322J6039N728l687m841j0091
9905D624j140r073j8802J335N710J5224N464P246q540o721j835P381J666J03m141
9890a499N132p982k661p08K6303P46j5287p073J690j2438J39P52J7011J0488k951
$$ plain form
9991 -1248 -6606 -114 -6506 -14536 -17874 -16382 -24195 -11943 -17225 -21656 -11517 -11943 -5776 3443 6871
9976 6871 4038 7069 3946 1449 9749 7596 705 -818 17543 19318 11619 13304 20817 17454 -251
9961 -251 -6743 -4100 2539 -655 -13491 -17951 -6241 7166 5599 6718 -981 -11184 -13248 -7938
9947 -7938 -267 -3658 1348 -745 459 -16381 -17025 -13277 -20693 -22007 -402 17323 10222 19314
9933 19314 27258 13833 20218 26461 29977 37275 15759 10750 22266 14192 -235 -702 -4436 -12567
9919 -12567 1300 2458 -13999 -10692 -10451 -7295 2745 3798 1476 17515 23243 19556 14715 4624
9905 4624 3484 -5589 -24391 -23056 -17346 -2122 3342 10588 2048 -4673 -6508 873 2539 2642 -1499
9890 -1499 3633 -4349 -7010 -7718 18585 19331 4044 -3029 -1339 -13777 -13638 -12886 4125 14613 11662
9875A1662M689k0293j2201L867N932k760p484k928P108R243J720O79L5j417o563
9860h711o793r961K592P546Q914R402n861m396r885N056K314p095J3013j500r15
9845f280J1173K2142j0145J509j0306n272j989J343K877K223l87M383N522j5324
9831A469j551L59L42j8175Q757R554q366p982l37m277N397n431Q534p764O171
9816a3300J1657K3090J0489r025j7398j3780l975P945L498j6506j0678p090P211
9803b7862R588P353P973L236J656j5246J337N213L682P830o341k0993N54J3491
9789h529q264M245n9m175P319O614j48J215L087M493O452p854j1067j8530J434
9774b3767J2638J5109J811K331p712l936J6986N703r834p003j0003j0564j467
$$ plain form
9875 11662 16351 -3942 -16143 -12276 -6344 -9104 -16588 -19516 -12408 -3165 -1445 -766 -731 -2148 -8711
9860 -8711 -15504 -25465 -22873 -15327 -6413 2989 -2872 -7268 -17153 -12097 -9783 -16878 -3865 -5365 -6280
9845 -6280 4893 27035 16890 18399 8093 2821 832 2175 5052 7275 6888 11271 16793 1469
9831 1469 -82 277 619 -17556 -8799 755 -7611 -15593 -15930 -20207 -14810 -20241 -11707 -19471 -13300
9816 -13300 -1643 21447 31936 22911 5513 -8267 -12242 -4297 -799 -17305 -27983 -35073 -27862
9803 -27862 -18274 -10921 -2948 288 1944 -13302 -11965 -6752 -3070 4760 -1581 -22574 -22020 -8529
9789 -8529 -16793 -12548 -12607 -16782 -9463 -2849 -2997 -1782 1305 5798 12250 4396 -6671 -25201 -23767
9774 -23767 -11129 3980 5791 8122 410 -3526 13460 19163 9329 2326 -7677 -18241 -19708
9761a9708R290J8328r821p861K514J8124o486L697l248r695M097P164m832N43
9747B106l128K93L296J0381j1212j3502l047l791N871J3848K243j4349q282Q573
9733a0700R542l683p811p286j550M671R897K959q582L728J2847m861l105M281
9719C47J185j3043p868K020R523J6790m883P426J616j1926k344L63J1817j168
9705I855l839j2822l382J2290J2042l885j2133J2227o618m625m039L770L475k97
9691B019j2461j0157j6055J1620J468L892P40J8713R115q419j6422J4703J1926
9678A0682p612j6374K930o782k358O322Q022O72J5284m861l489J1406J0472l247
9664B1067j650j0869P919L693j3636m015m81p329m142J3603m004r238j5590J1051
$$ plain form
9761 -19708 -10418 7910 -1911 -9772 -7258 10866 4380 8077 4829 -4866 -769 6395 1563 2106
9747 2106 -1022 -729 2567 12948 1736 -11766 -14813 -18604 -12733 1115 3358 -10991 -19273 -10700
9733 -10700 -1158 -4841 -12652 -19938 -21488 -16817 -6920 -3961 -12543 -8815 4032 -829 -3934 347
9719 347 1532 -11511 -19379 -17359 -7836 8954 4071 11497 13113 1187 -1157 -794 11023 9855
9705 9855 6016 -6806 -10188 2102 14144 10259 -1874 10353 3735 -890 -4929 -1159 2316 2019
9691 2019 -10442 -20599 -36654 -25034 -23566 -19674 -18934 -221 8894 475 -15947 -1244 10682
9678 10682 3070 -13304 -10374 -17156 -19514 -13192 -5170 -4498 10786 5925 2436 13842 24314 21067
9664 21067 19417 8548 16467 20160 6524 2509 2028 -5301 -9443 4160 156 -9082 -24672 -13621
9650a3621J6363J9539j344n750j6005j668o787N67J4644L039j384j710k0437M393
9636a0161J899N406R445o854q185j0690L008K5428j2758n3R794R376J0046Q06
9622B6507q403j2808m041J5845J9994k09p952j2365j0454j2061j032j283j6419
9609b4681j1416o527J5595N474K92J8713L698l464m467N897k711j5940R29J483
9595a7125r79P491O39J0980J3497p410j6756K605J4248M398j2281m183N741l546
9581b681m432o64k777J3650J3968J7303M262j5859j2739R04K991m10j7396N08
9567c372L1608J6547l527j783r043j251L038k380m463k708j8081k937J6430J3397
9553C1475m718r490q460J0055J1600L86n441L733J1971K467j7949R64O796j4800
$$ plain form
9650 -13621 2742 22281 20937 15187 -818 -2486 -9273 -8706 5938 8977 7593 5883 -14554 -10161
9636 -10161 -8262 -2856 6589 -265 -8450 -19140 -16132 9296 -3462 -3515 6279 15655 25701 26507
9622 26507 18104 5296 1255 17100 37094 36885 28933 16568 6114 -5947 -6979 -8262 -24681
9609 -24681 -36097 -42624 -27029 -21555 -21263 -2550 1148 -2316 -6783 -886 -3597 -19537 -18608 -17125
9595 -17125 -18104 -10613 -9974 1006 14503 7093 -9663 -7058 7190 11588 -693 -4876 865 -2681
9581 -2681 -7113 -7777 -10554 3096 17064 34367 38629 22770 10031 10935 13926 13516 -3880 -3372
9567 -3372 28236 44783 41256 39473 30430 29179 32217 29837 25374 22666 4585 1648 18078 31475
9553 31475 26757 17267 8807 18862 30462 30848 25407 29140 41111 43578 25629 26593 33389 18589
9539A8589j2474k339k918k487O615J6420J2837M720q543p904o439o409k159o223
9525A286K814Q913k014n852Q085J0397o449Q129J6420L993k041p844j4250P162
9511B8749K2580R531j3661p383M590J072j3455Q138J0769j0843j6988q66j0961
9498A1272p453L143N879k398J5095n238j0840j0809N345O769R844k244J6434J699
9484C6498N267Q167r397R950M079j4968Q03n408r052k3037J1142J4242J4851J9382
9470F2519k605j1025m078j7373J917q165q881k443K1978R803j1622l376j514k994
9456B2141J326K2716L187o74j6666p071k737N221J9477K698m300o119p706j0471
9442B1022j4043L036M089K5468K9164j0335K882p053L386r493j9392K349Q830
$$ plain form
9539 18589 6115 3776 858 -1629 4986 21406 34243 38963 30420 22516 16077 9668 7509 1286
9525 1286 4100 13013 10999 5147 13232 23629 17180 25309 41729 45722 43681 35837 21587 28749
9511 28749 51329 60860 47199 39816 44406 45478 32023 40161 50930 40087 23099 22233 11272
9498 11272 3819 6962 12841 10443 25538 20300 9460 -1349 3996 10765 20609 18365 34799 36498
9484 36498 41765 49932 40535 50485 54564 39596 40399 34991 25939 2902 14044 28286 43137 62519
9470 62519 59914 48889 44811 27438 29355 21190 12309 9866 31844 41647 30025 26649 25135 22141
9456 22141 23467 46183 49370 48696 32030 24959 22222 27443 46920 49618 45318 39199 31493 21022
9442 21022 6979 10015 14104 39572 68736 58401 61283 54230 57616 48123 28731 31080 39910
9429C9910p952j2617J0295J6825R661N210Q74m059p126n92L834P799J4226j720
9415G4568J184q905M171L794j9605q682k631Q808P451P825M099p840n895J4689
9401G3031J5886k206j7798j4984j0638r07M326j1607K0550K4280J3115j8292k0354
9388E4402J0572J725P588J0525O837J192j1600j1620J3364K067j2202p109Q041
9375G3782n21P687r341n379P188J6758J758o435M119K395M896K855R233M844J1650
9360A25489K172o269O152Q302l210l72j1956J3280J6650k086j6455R305K781m230
9346A39553j1517m140P075L504m274Q772M529K013J3423P765J0415J3042j0391
9333A79769j7152J758J6755m83J698m752Q551J0381Q828n182J5225j0228q469
$$ plain form
9429 39910 31958 19341 29636 46461 56122 61332 62206 58147 51021 50429 54263 62062 76288 74568
9415 74568 75752 66847 71018 74812 55207 46525 43894 52702 60153 67978 72077 64237 58342 73031
9401 73031 88917 86711 68913 53929 43291 42384 46710 35103 55653 79933 93048 74756 54402
9388 54402 64974 66699 74287 84812 91649 92841 81241 69621 82985 85052 72850 65741 73782
9375 73782 73261 80948 71607 66228 73416 90174 91932 85497 89616 92011 96907 99762 108995 113839 125489
9360 125489 127661 121392 127544 135846 132636 132264 120308 133588 150238 148152 131697 141002 143783 139553
9346 139553 128036 123896 130971 134475 130201 138973 143502 145515 158938 166703 177118 190160 179769
9333 179769 162617 164375 181130 180647 182345 177593 186144 196525 205353 200171 215396 205168 196699
9320A96699J0618l675L211r997J6442J5812J0067L23P213M868M753L809J04L124
9306B63371J409R052J2195m446n282O081k865P535J2840L0308k39m471J4424R306
9292C49218N853N778K471M385J5783K7402P328L917Q531k062J2269J3942P929
9279D62744K0791K2787R369l209P458J3546R591R792L468J3094O733N424R905
9266E91493J4816L835K1708L7573R620K982J3183J4991K247M11K3577K3017J1701
9253G71154J5016K5684J6245j0383L646J5552R778n895J052K0638Q645P269J0322
9240H88723k835K7405N488l193m635j1918k2065m822K1759j2905O337M073m116
9227H87296j207M366p215k0659j0776k455n893M414n693r601o175l764m202j8729
$$ plain form
9320 196699 207317 203642 206853 196856 213298 229110 239177 239500 246713 251581 256334 260143 260247 263371
9306 263371 264780 273832 286027 281581 276299 282380 279515 287050 299890 330198 329959 325488 339912 349218
9292 349218 355071 360849 363320 367705 383488 410890 418218 422135 430666 428604 440873 454815 462744
9279 462744 483535 506322 515691 512482 519940 533486 543077 552869 556337 569431 576164 581588 591493
9266 591493 606309 610144 631852 669425 679045 682027 695210 710201 712448 712859 736436 759453 771154
9253 771154 786170 811854 828099 817716 821362 836914 846692 840797 841849 862487 871132 878401 888723
9240 888723 885888 913293 918781 915588 910953 899035 876970 872148 893907 881002 887339 891412 887296
9227 887296 886089 890455 883240 862581 851805 849350 843457 847871 842178 832577 826402 822638 818436 799707
9213G99707k6621j4723j3231q947j7779n998m16j3671o255j5500k3894k6932j9655
9200F06085q645j3191J94j0426j8119R793j3745j2240j4198n245j2861p709j4945
9187D84748N89k884r68r313k8552k3740Q276j025j8796q953q116l416j2430j1045
9173C64375n765K554j2803k2954n358j2451L744j426q741l992L694K430L132q241
9159B98198l735q802p656p426j4492k0884j875m050j0301l572Q196K535q422j0899
9145B06815l806J37p01j6083j3975q21k514j790P483j5188n738M45Q067j01n122
9130A57108k6249K05J1650o333N227M384N760K47m245K443M984j2519j2591Q746
9116A38817R003p580L400j8314j2526M55N203j5280r896j665L493J9752M653l77
$$ plain form
9213 799707 773086 758363 745132 736185 718406 712408 711992 698321 692066 676566 652672 625740 606085
9200 606085 597440 584249 584443 574017 555898 565691 551946 539706 525508 520263 507402 499693 484748
9187 484748 485337 482453 481485 472172 443620 419880 428156 427131 408335 399382 391266 387850 375420 364375
9173 364375 358610 361164 348361 325407 320049 307598 311342 309916 301175 297183 300877 303307 306439 298198
9159 298198 294463 285661 278005 270579 256087 235203 233328 229278 218977 215405 223601 226136 217714 206815
9145 206815 203009 203146 202445 186362 172387 171566 169052 167262 174745 159557 153819 154264 162331 162230 157108
9130 157108 130859 131064 142714 136381 141608 145992 151752 151999 147754 150197 155181 142662 130071 138817
9116 138817 147820 140240 143640 125326 112800 113255 118458 103178 93282 91617 95110 114862 119515 119138
9102A19138j452p900j6188j1442j599o097K352P845R007r902M643J0218j3061
9089H5562K682K674n356j3377l746j043M851r10n842o407M465L634p494L132J394
9074F4219j093Q072K996K1229J582j3946j1315p229Q113J1534j0369p223J0095
9061G6665M311R788J5296m149r240j7725r417n674K0182J1731o097p959p098O79
9047G1293j2146q702K52n657M488Q742R730p276j6457k789J4186K0540L139m506
9033G4837q527j3391k167L166r075m846O251K1265P461p973k2753r083P681P736
9019E0582O582P706q984K267j2834j3393R045p544o499m261r603k178J1903L245
9005B6034M610K779Q502o918p691M040J1317r171O98m008J1531J1328P470j4899
$$ plain form
9102 119138 117686 109786 93598 82156 80557 74460 76812 84657 93664 83762 88405 98623 85562
9089 85562 88244 90918 85562 72185 68439 67396 72247 71337 65495 59088 63553 67187 59693 62825 64219
9074 64219 63126 71198 74194 95423 97005 83059 71744 64515 72628 84162 73793 66570 76665
9061 76665 80976 90764 106060 101911 92671 74946 65529 59855 80037 91768 85671 77712 70614 71293
9047 71293 59147 50445 50697 45040 49528 58270 68000 60724 44267 41478 55664 76204 79343 74837
9033 74837 66310 52919 50752 53918 44843 39997 46248 67513 74974 67001 44248 35165 42846 50582
9019 50582 57164 64870 55886 58153 45319 31926 40971 33427 26928 22667 13064 10886 22789 26034
9005 26034 30644 33423 41925 35007 27316 31356 42673 33502 34200 30192 41723 53051 60521 45622
8991D5622j5348j1701m947O340P69n679R296J3654J4232r791J0749J0325o054
8978E7467k2706q447L700o621L641J5858l330q702p480o144k009p511l543J319
8964E492Q753J3709J671J667R41L304N813L765k498j1994n305j3302R043J0077
8950C1136K214m656j2927j6934N550p395K781K413r038j0072K0954K2598J080
8937B7704j367J1618K676P57j4382J263j0088q769N926l841n038J6342K242j2982
8923A2061j1744p916O236P441J2779L566O634j9911j563J8803o216j7659q988
8910f477R708J3088j3800m651O451M941O640M428L88j446j1607l474P179K883
8896A4251J2018R580j0400j1905m788J0045l8K837l226L379o408j9208J0660M677
$$ plain form
8991 45622 30274 18573 13626 19966 20735 15056 24352 38006 52238 42447 53196 63521 57467
8978 57467 34761 26314 30014 23393 27034 42892 39562 30860 23380 17236 15227 7716 4173 5492
8964 5492 14245 27954 29625 31292 32233 35537 41350 45115 42617 30623 25318 12016 21059 31136
8950 31136 33350 28694 15767 -1167 4383 -3012 -231 2182 -6856 -16928 4026 26624 27704
8937 27704 26337 37955 40631 41388 27006 28269 18181 9412 15338 11497 6459 22801 25043 12061
8923 12061 317 -7599 -1363 6078 18857 22423 29057 9146 7583 26386 20170 2511 -6477
8910 -6477 3231 16319 2519 -2132 4319 9260 15900 20328 20716 19270 7663 4189 11368 14251
8896 14251 26269 35849 25449 13544 8756 18801 18763 21600 18374 21753 15345 -3863 6797 11474
8882A1474Q708k305p575l139J4076L082n308O912R419m123r603j4136j3090q21
8868f429l6q452j573J2908J0748r863l392N871J7729j352P275J2198j164n458
8854B9010o13J3449k0862L022j903j9346L125n046o846P987M586K679K263J2688
8840B4193l269j5325o730J0616j626M373Q559j0125p287J431J5163P620j5707
8827A1886k36M162P860n10j0463l086n36m38L900p895K2979N970p236j875j9268
8812E214j4488K860N698J6109R320J52Q976j2489n917k2793M60J9443m413o960
8798A172K1179n729j5082M37J39q316k501J231M691L516N492O833p27K844r063
8783F116n131J5459l083j3815o545r945l281R158J1737J648j1506R598J6232N727
$$ plain form
8882 11474 20182 17877 10302 7163 21239 24321 19013 25925 35344 31221 21618 7482 -5608 -6429
8868 -6429 -6465 -14917 -16490 -3582 7166 -2697 -6089 -218 17511 16159 23434 35632 34468 29010
8854 29010 28397 41846 20984 24006 22103 2757 5882 836 -6010 1977 6563 9242 11505 24193
8840 24193 20924 5599 -1131 9485 7859 12232 20791 10666 3379 4810 19973 27593 11886
8827 11886 11650 15812 23672 23162 12699 9613 9077 8639 12539 4644 27623 33593 26357 24482 5214
8812 5214 -9274 -6414 -716 15393 24713 24865 33841 21352 15435 -7358 -6898 12545 8132 1172
8798 1172 22351 16622 1540 1977 2116 -6200 -8701 -7470 -2779 737 6229 13062 12335 15179 6116
8783 6116 985 16444 13361 -454 -6999 -16944 -20225 -11067 670 2318 -9188 410 16642 22369
8769B2369r08K157l899l206k773l957j722N197J1555J0236l824j3843N26n574
8755A2334L806J4497M09n474l421p270j3055j5144k789M23Q633R900k63j4297
8741a1711j326K0156J0687M124J572q899N922k848j0871K450J0133N588K889R06
8727B8772j3938j2735P856K0106Q809j6363k318M068r63k096O914K3619Q696o642
8713E3785l192j9424q03q203K712J16K82p841l564L239J237j0552o539J1585J1840
8698B4678K875n674o660n62r905K59J0208J5279r388j040j999P22o194m563J5143
8683B3179M683n160J7822o823K467p86k442J0398P789J3375r164o981r339N021
8669D4039L461J8179J4810N441l32j0290j7891n976j7950o524J2101K7443l334
$$ plain form
8769 22369 21461 23618 19719 16513 13740 9783 8061 13258 24813 35049 31225 17382 17908 12334
8755 12334 16140 30637 31046 25572 22151 14881 1826 -13318 -16107 -15684 -7051 2849 2586 -11711
8741 -11711 -13037 7119 17806 21930 23502 14603 20525 17677 6806 9256 19389 24977 27866 28772
8727 28772 14834 2099 9955 30061 38870 22507 20189 24257 23294 21198 28112 51731 60427 53785
8713 53785 50593 31169 30366 22163 24875 24991 25273 17432 13868 17107 18344 7792 1253 12838 24678
8698 24678 27553 21879 15219 14657 4752 5011 15219 30498 21110 20070 18071 18793 12599 8036 23179
8683 23179 27862 22702 40524 33701 36168 35382 32940 43338 51127 64502 55338 48357 39018 44039
8669 44039 47500 65679 80489 85930 85598 75308 57417 51441 33491 26967 39068 66511 63177
8656F3177o281p6J8009J9773p785j4095K8r327j0668j2479m919J3714J4150P104
8642G0325j543k541J3087l153r24p044l506O806j338K240J4456K838O326r455
8628H6574M882j4874P031k933L41J6211R329K428r677O640J1162N533o407K5576
8614A41816L5459J5712O650n435j506R641J6894N079J7165J2279J3247k717k935
8601B61349J135j8062j7692Q558N46P640m756j6634N586l352j6294j5918r727
8588A82379r91r225j001l102r003J0719j0372j4344p294J610k93q154j8394r233
8574A03302q622o550m280J604N919L959r913q47q699o0j5144o775p792m965o816
8559C4321l111J137R521n759j2243J1163m676M049o702j2513j2221r9J0918L377
$$ plain form
8656 63177 56896 56820 74829 94602 86817 72722 72750 63423 52755 40276 35357 49071 63221 70325
8642 70325 68782 66241 79328 76175 75251 68207 64701 71507 70169 72409 86865 89703 96029 86574
8628 86574 91456 76582 83613 80680 81021 97232 106561 108989 99312 105952 117114 122647 116240 141816
8614 141816 177275 192987 199637 194202 192696 202337 219231 224310 241475 253754 267001 264284 261349
8601 261349 262484 244422 226730 235288 235834 243474 238718 222084 227670 224318 208024 192106 182379
8588 182379 181388 172163 171162 168060 159057 169776 159404 145060 137766 139376 139083 130929 112535 103302
8574 103302 94680 88130 83850 85454 91373 95332 85419 84572 75873 75813 60669 53894 46102 41137 34321
8559 34321 31210 32347 41868 36109 23866 35029 30353 34402 27700 15187 2966 2867 13785 17162
8545A7162K740N15N459j623j1166j0770L168J1563L39J1116J0419m343j6085j501
8531A6993k905m590m093R379N192J3542K906j5032l961P14j6832q668J062Q565
8517B272K0461J1580K552j4466m808O688L83O693n25j691j9164j1435Q62J861
8503A263R70o49K226k585p562p579L048J5513J0859L142R09O069J428n773l44
8488B0935J920r38p777j4978j1510R954J3798Q481J487j4610j890J561K397J1350
8474B0180r473k0082N991j7653q203K9863K1415j701j2084n529J829k521O678
8461H710j0526l879p56Q592k312j2575j832O944N124k476p120J5288R213m001
8447H394j246j3285j861Q814j828M906J687L28R033Q297j5353j169q199p079J2438
$$ plain form
8545 17162 19902 20417 25876 24253 13087 2317 5485 17048 17387 28503 38922 34579 18494 16993
8531 16993 14088 9498 5405 14784 19976 33518 36424 21392 17431 18145 1313 -7355 -6293 2272
8517 2272 22733 34313 36865 22399 17591 24279 24662 31355 30830 29139 9975 -1460 -598 1263
8503 1263 2233 1584 3810 1225 -6337 -13916 -10868 4645 15504 18646 19555 25624 27052 21279 20935
8488 20935 22855 21917 14140 -838 -12348 -2394 11404 19885 21372 6762 4872 6433 8830 20180
8474 20180 10707 -9375 -3384 -21037 -29240 623 22038 20337 8253 2724 4553 2032 8710
8461 8710 -1816 -5695 -6451 2141 -171 -12746 -14578 -7634 -2510 -4986 -12106 3182 12395 8394
8447 8394 7148 -6137 -7998 816 -1012 3894 5581 5909 14942 23239 7886 6717 -1482 -8561 3877
8432C877J1709p193J137J2489O807r10o1r20o938Q073q742j0366J0000M26L836
8417B3224j3057O21K865K885n457k008N101J2678k749j1496k159J089J3905j180
8403B4262L275K40K790r797j1452j795R32P32M323j1554k4778J8322P852K809
8389F161Q772j5754o913J3475K3479O201k417L060o355j0030P574q85o554Q03
8375B0617r19P846J612j3811j936o244k267o305N239N603p208j420J0095q143
8361B759O834Q041j054m861l500K556O40o192p400J8190J9265k5034j9107N626
8347c237M82o98M421m620m939o14l503q423O188J2749K924m74K2344L805n864
8332B0541o174j814n78O265K199M5J171j0047N757J69o289J198J5896j3060p624
$$ plain form
8432 3877 15586 8393 9530 22019 28826 27916 27855 26935 19997 28070 19328 8962 18962 19388 23224
8417 23224 10167 10788 13653 16538 11081 9073 14174 26852 24103 12607 10448 11537 25442 24262
8403 24262 27537 27777 30567 20770 9318 7523 8455 9187 13510 1956 -22822 -4500 3352 6161
8389 6161 14933 -821 -7734 5741 29220 35421 33004 36064 29709 19679 27253 26368 19814 20617
8375 20617 19698 27544 29156 15345 13409 7165 4898 -1407 3832 9435 2227 807 10902 2759
8361 2759 9593 17634 16580 11719 8219 10775 11415 5223 -2177 16013 35278 10244 -8863 -3237
8347 -3237 -2755 -3453 968 -3652 -8591 -9205 -12708 -21131 -14943 -2194 730 256 22600 26405 20541
8332 20541 14367 12553 11975 18240 20439 20484 21655 11608 17365 17534 11245 12443 28339 15279 7655
8317G655m902m491N752L940j6368Q522K7158K215q019j0473r673J3534J5587q483
8303B1954j9293n545O044k698J1999J1153j3607j602m858J561M612k722n499R604
8289A1103J1387m301m369P987P659J1358j1555k3690n443K019M947L719q932n494
8275c605k805M426J2366J0926o02k441o144L959M30j118o400n128j1L558m522
8260B889K118P026O047J0913n416J1823L216j5380j2686m153n023j0996J9557
8247I935j732o792j2673n695P062Q885p462n321O628P879L935O659M349p810j9013
8232a1166M89n323m143j0294K3379P170p74l670K079M611m626n979K339j042J5136
8217H186P307o02J7620K007K515r894k0363j4061J9065J8672l19j3170j6254l041
$$ plain form
8317 7655 2753 -1738 4014 7954 -8414 108 27266 29481 21462 10989 1316 14850 30437 21954
8303 21954 2661 -2884 3160 462 12461 23614 10007 8405 3547 5108 9720 6998 1499 11103
8289 11103 22490 18189 13820 21807 29466 40824 29269 5579 136 2155 7102 10821 1889 -3605
8275 -3605 -6410 -1984 10382 21308 20706 18265 12121 16080 16510 15392 8992 3864 3853 7411 2889
8260 2889 5007 12033 18080 28993 23577 35400 38616 23236 10550 6397 1374 -9622 9935
8247 9935 8203 1411 -11262 -16957 -9895 -1010 -8472 -13793 -7165 714 4649 11308 15657 7847 -11166
8232 -11166 -10677 -16000 -20143 -30437 -7058 112 -662 -4332 -2253 2358 -2268 -8247 -5908 -6950 8186
8217 8186 15493 14891 32511 34518 37033 27139 6776 -7285 11780 30452 30133 16963 709 -2332
8203b332J549J34K820j2283n613J399K972j3228N37J8452P566J2554L059q132
8189I454r560p590J2594N504P483j6601m703k226j952J1752m692M359J188j305
8175C705N513k390l710Q497O778o21k3314j8500K448Q225J183j0069O843Q740
8161f672J1226l207l683Q236m518l534J4438K966k0567n466r565M223k42J7573
8147A208K6693J5083J2823j181j614j6623q822J634k1865r652n260K579L408L066
8133A477j3639p561R195N936j195m52o231K0799J1269q566N520k817N42R11j833
8118A3355R853K0308j154l1490n754J1356o976k317M561L617j527J9720J1761
8105D5313M397j7220R973K0824O235m699j1581j6155n860p640p738j4871q145
$$ plain form
8203 -2332 -783 -649 2171 -10112 -15725 -14326 -11354 -24582 -24045 -5593 1973 14527 17586 9454
8189 9454 -106 -7696 4898 10402 17885 1284 -3419 -5645 -7597 4155 -537 3822 5010 3705
8175 3705 9218 6828 3118 11615 18393 17772 -5542 -24042 -21594 -13369 -12186 -22255 -15412 -6672
8161 -6672 4554 1347 -2336 5900 1382 -2152 12286 15252 -5315 -10781 -20346 -16123 -16365 1208
8147 1208 27901 42984 55807 54626 53012 36389 27567 29201 7336 -2316 -7576 -4997 -1589 1477
8133 1477 -12162 -19723 -10528 -4592 -5787 -6239 -12470 8329 19598 11032 16552 13735 14277 15188 13355
8118 13355 23208 43516 42362 10872 5118 16474 9498 7181 11742 15359 13832 33552 45313
8105 45313 49710 32490 42463 63287 69522 64823 53242 37087 31227 23587 15849 978 -7167
8092g167J5349O588R764M455J564j1288j4480P53J6397j53k131l709j0839l812
8078A291K2418K595n293p935J496o157J6506j324j6714j739Q76m902J0341l347
8064H112O754N863R153J156P491m516j2638K962j583k409J435l244k1276q060
8050a0800M777J6600N925P775K2427J2250q479L013j3484J557J812j367J7336
8037E9342J7077K1246Q285l787r233l851J4326J1521n744j9170K284L307q152
8024H7451l903j462n916J620J0344n290N903O362k823r552k124R728j0271o888
8010G3179L606N255p019Q510j312O676J2044J3079n36K1339K0384K5502K2394
7997B03101J4079K9433N4423L6290j491j9794k7064l7049k1927j5624m1206j8633
$$ plain form
8092 -7167 8182 14770 24534 28989 30553 19265 4785 5538 21935 21782 19651 15942 5103 1291
8078 1291 23709 26304 21011 13076 14572 8415 24921 23597 6883 5144 6020 1118 11459 8112
8064 8112 14866 20729 29882 31038 38529 34013 21375 24337 22754 20345 21780 18536 -2740 -10800
8050 -10800 -6023 10577 16502 24277 46704 58954 50475 53488 40004 41561 43373 42006 59342
8037 59342 76419 97665 105950 102163 92930 89079 103405 114926 109182 90012 92296 95603 87451
8024 87451 83548 82086 76170 77790 88134 82844 88747 95109 92286 82734 80610 90338 80067 73179
8010 73179 76785 82040 75021 83531 82219 88895 100939 114018 113482 134821 155205 180707 203101
7997 203101 217180 246613 301036 337326 335835 316041 288977 251928 230001 214377 173171 154538
7985A54538K4063K0170J9379N997p708o523r548l8731l0674j1640j3582k2201
7973H3540p15q37n023J4058j024l123n757J8246K3594m816j775J1444n181j0808
7959A11823M771k1610j62J6614K9639L2716K8797K8859J8743K3146K2227L631
7947B99194k0279k2388j8087l7873j4750J4868P033j86n59j8582k9932j9048l0015
7934A09396j9640j780j1457r832J522k457k408N394q057P803m062j1428j9461
7921C3533j4889R124J0708L813k269j8826Q192J7896M105Q145K0021L0237J2362
7908A22152M16j2178j4371j418O632K505p092r493j9281j5491o885r640r897j1751
7894A4208k1149r749J402J8094J2706k262n456M186O955l564m986j205J2024M045
$$ plain form
7985 154538 178601 198771 218150 224147 216439 209916 200368 161637 130963 119323 105741 83540
7973 83540 82825 81988 76965 91023 89999 86876 81119 99365 122959 118143 116368 127812 122631 111823
7959 111823 116594 94984 94822 111436 141075 173791 202588 231447 250190 273336 295563 299194
7947 299194 278915 256527 238440 200567 185817 200685 207718 207532 206973 188391 158459 139411 109396
7934 109396 89756 87976 76519 66687 68209 65752 63344 68738 60681 68484 64422 52994 33533
7921 33533 18644 27768 38476 42289 40020 21194 29386 47282 51387 59532 79553 109790 122152
7908 122152 122568 110390 96019 94601 101233 103738 96646 87153 67872 52381 45496 35856 25959 14208
7894 14208 -6941 -16690 -15288 2806 15512 13250 7794 11980 18935 15371 10385 9180 21204 25249
7880B5249r762L297j229J929j035L298J420R833j2163q373r589j4694J1798J1528
7866A1507l647j6397j0691j3220J0430J3779p0R068J6149j1627j475R336O923
7853B0065q772k1088m551J5644N937K179O930N289M270k863j3971j4644P1R327
7839C823J1945M589k665p678o863j1729q22k622n398M670J4264J3545q655L310
7825I714O973n438n076r66k124l387j549j2411n201j0344m17J8371J313M973K694
7810b875M781n686M221P477J869N011L914m589j0867j6309j0860J431J6736J6420
7796A0674k768p356J1O37o000k672l130j4491K071p869j8069M408J9726J3087
7782a1741R540m017m726p487J5383R219L651N359r464L803P708m85k0246K059
$$ plain form
7880 25249 15487 18784 17555 19484 18449 21747 23167 33000 20837 12464 2875 -11819 -21 11507
7866 11507 7860 -8537 -19228 -32448 -22018 -8239 -8309 759 16908 5281 3806 13142 20065
7853 20065 11293 -9795 -14346 1298 7235 9414 16344 21633 25903 23040 9069 -5575 -5504 3823
7839 3823 15768 20357 17692 10014 3151 -8578 -9400 -12022 -17420 -12750 1514 15059 6404 9714
7825 9714 16687 11249 6173 5207 3083 -304 -1853 -14264 -19465 -29809 -30226 -11855 -10542 -5569 -2875
7810 -2875 1906 -3780 441 7918 9787 14798 18712 14123 3256 -13053 -23913 -22482 -5746 10674
7796 10674 7906 550 561 1198 -4802 -7474 -10604 -25095 -23024 -30893 -48962 -44554 -24828 -11741
7782 -11741 -2201 -6218 -10944 -18431 -3048 6171 9822 15181 5717 9520 17228 16743 -3503 -1444
7768a444R801o541r662j4736O686N444m445j0334K405M027L074m606J4295J828
7754d208j871m872p744J3005J7079m558N001j354o424N199p701m668j0002o647
7740a9765n52O014J6646l696n062J0919p897j6119o754n692N921J1926J43J1160
7726b808j0185q089J899L59K4710O007j3447q004O823O15R603m667J80O346m690
7711D652j6197j2763M422P061P106R366l189l37J2295L526l3232k948J3052J3790
7697F604j6502o702j3048j4831N332J7736P057l973j4888j844J4602J0931n868
7684a5394m148n298l721L61O038m438L516K2265K289L147l522K908n496j4048
7670a5541J244M441J1335K211k188o613n633M053N51k119m721k433r947j5872
$$ plain form
7768 -1444 8357 1816 -7846 -22582 -15896 -10452 -14897 -25231 -22826 -18799 -15725 -20331 -6036 -4208
7754 -4208 -6079 -10951 -18695 -5690 11389 6831 11832 10478 4054 9253 1552 -3116 -13118 -19765
7740 -19765 -20317 -14303 2343 -1353 -6415 4504 -3393 -19512 -26266 -31958 -26037 -14111 -13968 -2808
7726 -2808 -12993 -21082 -19183 -18824 5886 11893 -1554 -9558 -2735 -2120 7483 2816 2996 9342 4652
7711 4652 -11545 -24308 -19886 -12825 -5719 3647 458 121 12416 15942 -17290 -20238 -7186 6604
7697 6604 -9898 -16600 -29648 -44479 -39147 -21411 -14354 -18327 -33215 -35059 -20457 -9526 -15394
7684 -15394 -19542 -24840 -28561 -28200 -22162 -26600 -23084 -819 1470 4617 1095 4003 -1493 -15541
7670 -15541 -14297 -9856 1479 3690 1502 -5111 -10744 -6691 -6140 -8259 -12980 -15413 -25360 -41232
7656d1232j2964k564J6406J0677R641J4803J541j0970J745K5628j843j8829j914
7643i875o501r142j074R68O395J0831l522N524j477N765k379j147N26q936j3944
7628b7988P487k723n565O467L135k611J153r562n873m171N930J0216K0758K0805
7614A7458j3455j1922j62l748M975J511K096J20N857n456q333p363R779K0753
7600A2110J1628L257q51K011m457p290P768M652l659j1528L496O18k443q990k2417
7585a6095q762P800J3573m353r43M038K1426k674r027n945N144l378r755j0366
7571a9317j7719J1281K5427M884O41k564R09J2802o837o927L382n862K910M182
7557G192j1471J560J1633J5882j2670k9249J949Q016K896P90O942j888Q302J4200
$$ plain form
7656 -41232 -54196 -56760 -40354 -29677 -20036 -5233 -3692 -14662 -12917 12711 10868 -7961 -9875
7643 -9875 -16376 -25518 -26592 -25624 -19229 -8398 -11920 -6396 -7873 -2108 -4487 -5634 -5108 -14044 -27988
7628 -27988 -20501 -23224 -28789 -22322 -19187 -21798 -20645 -30207 -36080 -40251 -34321 -24105 -3347 17458
7614 17458 4003 -7919 -8081 -11829 -6854 -5343 -3247 -3127 2730 -2726 -11059 -18422 -8643 12110
7600 12110 23738 26995 26144 28155 23698 16408 24176 28828 25169 13641 17137 17755 15312 6322 -16095
7585 -16095 -24857 -17057 -3484 -7837 -8780 -4742 16684 14010 4983 -962 4182 804 -8951 -19317
7571 -19317 -37036 -25755 -328 4556 5197 2633 3542 16344 9507 2580 5962 100 3010 7192
7557 7192 -4279 -2719 8914 24796 12126 -17123 -15174 -7158 -4262 -3472 3470 1582 9884 24084
7543B4084p054o929O849p303j5743Q901J3433o047k0017j6762m948N255j0181
7530c6462q222J9398P561j081l017k139j054M549J8717J2506J6127j2058j6831
7517b006K341L983q691o070P378j412j6638J9497P342n358j1312n252l504J749
7503a7953l103L956m229l070J3551P218l1825j7226J2465l343J632Q546N87J3259
7489a9535J038O457J8900K032k0447p333P368L390O783J330r82K529n34p769p429
7474a4202k579P766J941M305J0946j0466j3294r939K17N502J715L873K479m696
7460a6432q083R650J1047j851l954j100M908J0666k496N647M585L679P834m64
7446B3636j1168p656J3486j1253q025N738J089k369j0529n510J513J0420p949
$$ plain form
7543 24084 17030 10101 16950 9647 -6096 2805 16238 10191 -9826 -26588 -31536 -26281 -36462
7530 -36462 -44684 -25286 -17725 -18806 -21823 -23962 -25016 -20467 -1750 10756 26883 14825 -2006
7517 -2006 335 4318 -4373 -10443 -3065 -4477 -21115 -1618 5724 366 -10946 -16198 -19702 -17953
7503 -17953 -21056 -17100 -21329 -24399 -10848 -3630 -35455 -52681 -40216 -43559 -41927 -33381 -32794 -19535
7489 -19535 -18497 -12040 6860 8892 -11555 -18888 -11520 -8130 -1347 -17 -999 1530 996 -6773 -14202
7474 -14202 -16781 -9015 -7074 -2769 8177 -2289 -15583 -25522 -25305 -19803 -18088 -14215 -11736 -16432
7460 -16432 -24515 -14865 -3818 -5669 -9623 -10723 -5815 4851 2355 8002 12587 16266 24100 23636
7446 23636 12468 4812 18298 7045 -980 4758 5847 3478 -7051 -12561 -11048 -628 -8577
7433h577j0021J543L126M632j0853k5031m437J9660J3312R342N463J1887j826
7420H220m996m785o518P93j0204L759J7120J6658K797p239k037j2439m077j5267
7406a8215Q1J4674J57j5127j080M512j431r432n488J154L240n57L694J0419Q931
7391d468J648l202J5725k978j4473J898K6495P140q994j4070K238q614j3808N579
7377i884J4657K1441L286o706m84n445n788j5694q169J4062p291r027J7658Q515
7363A1131m334r352k478k034j1861K752R076o77O129J1048o196l190p681L012
7349d655J7390K3K930k822N225p531q963q051M082J6202M18j1401L724R250N536
7334B1357p150j5291j1529l730m290J1878J5010J629O970R760k659n282L564J2451
$$ plain form
7433 -8577 -18598 -17055 -13929 -9297 -20150 -45181 -49618 -29958 -16646 -7304 -1841 10046 8220
7420 8220 3224 -1561 -8079 -7286 -17490 -13731 3389 20047 22844 15605 13568 1129 -2948 -18215
7406 -18215 -18134 -3460 -3303 -18430 -19510 -14998 -16429 -25861 -31349 -30195 -26955 -27512 -23818 -13399 -4468
7391 -4468 -2820 -6022 9703 6725 -7748 -5850 20645 27785 18791 4721 6959 -1655 -15463 -9884
7377 -9884 4773 26214 29500 22794 22310 16865 11077 -4617 -12786 1276 -6015 -15042 2616 11131
7363 11131 6797 -2555 -5033 -7067 -18928 -16176 -7100 -7777 -1648 9400 3204 14 -7667 -4655
7349 -4655 12735 12758 15688 12866 18091 10560 1597 -6454 -2372 13830 14248 2847 6571 15821 21357
7334 21357 14207 -1084 -12613 -16343 -20633 -8755 6255 7884 14854 24614 21955 16673 20237 32688
7320C2688l693j9865l683L43n058J430M980j598k588j1277N752P564J0853j2219
7306C629o149k135j2937r45O853r506k449J1505J7529p233j1627k519O646l348
7292a2686Q859J7973q703k9443j2186R124J9279N360n805O591j437J759p082m327
7278a2724O831P085j3126j505K673j0472N495J1252O852k1969M995K1276M841
7265A1504r409o634N775P390K634N015J316j1290j9466J3230J0807j5939n702
7252a0769R462J3007k211j7413j092J065L327J6493o468k5922j4441P464J5853
7239a1645J4619J869j5234q455j240n959J0747M976m511m641k4O482l286J3662
7225b640M3l066q951Q852J4019J030m488p313J08M272j3128p155j598j2065M544
$$ plain form
7320 32688 28995 9130 5447 5790 732 2162 7142 5544 2956 -8321 -2569 4995 15848 3629
7306 3629 -2520 -4655 -17592 -18537 -11684 -21190 -23639 -12134 5395 -1838 -13465 -15984 -9338 -12686
7292 -12686 -3827 14146 5443 -24000 -36186 -27062 -7783 -2423 -8228 -1637 -3074 -1315 -8397 -12724
7278 -12724 -5893 1192 -11934 -13439 -10766 -21238 -15743 -4491 2361 -19608 -14613 6663 11504
7265 11504 2095 -4539 1236 8626 11260 16275 17591 6301 -13165 65 10872 -5067 -10769
7252 -10769 -1307 11700 9489 -7924 -9016 -7951 -4624 11869 5401 -20521 -34962 -27498 -11645
7239 -11645 2974 4843 -10391 -18846 -20086 -26045 -15298 -10322 -14833 -19474 -19498 -13016 -16302 -2640
7225 -2640 -2597 -5663 -14614 -5762 8257 9287 4799 -2514 -2406 1866 -11262 -18417 -20015 -32080 -27536
7210b7536J4509J6940O540n407o49j5459o525R345J3984o142j0767J831M210O689
7196A563O095n64P749j2806j4015o929k3053O261K3333N70o295o471j1570O208
7182b9924M964K0798k410j031M625k464k496J5234O322L500r866K717J5510k150
7168B3329l769j7129j4481r214j1951k6K1236K0522m225r74J854J3185o06k167
7154A5584J5167q055j7772k3003k2550q931J1477N804O817O489J2517J6814O786
7141A7144L59N08l994K608L889k126p644j0247o040r918Q042K2633k0989k2345
7127b8120N246L1049J7383j9916j6830J3387M433p982M486l144J304J3977n96
7114A4677p592j0705m325J37L799N689n98q813P886j1090j4642J2162K4852j1404
$$ plain form
7210 -27536 -13027 3913 10453 5046 4397 -11062 -17587 -8242 5742 -400 -11167 -9336 -5126 1563
7196 1563 7658 7094 14843 2037 -11978 -18907 -41960 -35699 -12366 -11796 -18091 -24562 -36132 -29924
7182 -29924 -24960 -4162 -6572 -7603 -2978 -5442 -7938 7296 13618 17118 7252 9969 25479 23329
7168 23329 19560 2431 -12050 -21264 -33215 -33241 -12005 8517 4292 3318 5172 18357 17751 15584
7154 15584 30751 22696 4924 -18079 -40629 -49560 -38083 -32279 -25462 -18973 -6456 10358 17144
7141 17144 17503 18011 14017 16625 20514 18388 10744 497 -5543 -15461 -7419 15214 -5775 -28120
7127 -28120 -22874 8175 25558 5642 -11188 2199 6632 -1350 3136 -8 1296 15273 14677
7114 14677 7085 -3620 -7945 -7808 -4009 1680 1082 -7731 155 -10935 -25577 -13415 11437 33
7100C3j2481O542J1638M29o76j0011q268j5398r010K321L858J3722J1644P082
7086A425Q918j1522L675K10P539K887r210j5036J760J7206n973R706r01j1403
7072g19R13j646M362P945j3554j0407j187M267m478j673O025Q306m585k729J0493
7057A333O205K088p135R87j1563n262P09j1602o347J2833O812K7o42P441R313
7042E197Q621K903j0364l404P099O930j2209k0578k911q41K2906R615j4318k0021
7028b1375q65Q866J293J1915L171l868Q716O104m991p146j311Q088k1631k920
7014a5954O510P35j6277q635l902Q56K1014O717M102K260n958j5410K827J2681
7000h434K430q120l160M444P532l477j046k503J7419p948n109J4077j1320Q84
$$ plain form
7100 33 -12448 -5906 5732 6161 5485 -4526 -12794 -28192 -37202 -34881 -31023 -17301 -5657 1425
7086 1425 10343 -1179 2496 2706 10245 13132 3922 -11114 -9354 7852 1879 11585 10684 -719
7072 -719 194 -1452 2910 10855 -2699 -13106 -14293 -10026 -14504 -16177 -10152 -1846 -6431 -9160 1333
7057 1333 7538 9626 2491 3478 -8085 -13347 -12638 -24240 -30587 -17754 -10942 -10915 -11557 -4116 5197
7042 5197 13818 16721 6357 2953 10052 16982 4773 -15805 -18716 -19557 3349 12964 -1354 -21375
7028 -21375 -22240 -13374 -12081 -166 3005 -863 7853 13957 8966 1820 509 8597 -13034 -15954
7014 -15954 -9444 -8709 -24986 -33621 -37523 -36667 -15653 -8936 -4834 -2574 -8532 -23942 -21115 -8434
7000 -8434 -6004 -14124 -17284 -12840 -5308 -8785 -9831 -12334 5085 -2863 -7972 6105 -5215 -4331
6986d331R851r368r654J6692J4734Q309j0861p354j0533j0046m202O367j792n661
6972a7849R228L835J3591M36j5122M886P928j2556p402n40J6260l723r304J361
6958h971M1J2982l329j0899j7468k413J1745L626k979J618Q605Q599k285r769
6944a0897K335k474n475K771o080j3918J1131J4551K336p951p439J982J4359J6640
6930A1871J1845j0695j3247j0017J774P5R738J1187J1017q019j5084k870M528
6917B103J0439p438j3112Q983J3455j2577o912J0507l240j0224N755L476J346
6904B561R30r272m396k979k31J4901J4817k494j5435o188o032J1240M657K608
6890D687J0378J443J3353q462k2738j0722j9393J3843l712j0306n243J5250J5414
$$ plain form
6986 -4331 5520 -3848 -13502 3190 17924 26233 15372 8018 -2515 -12561 -16763 -10396 -12188 -17849
6972 -17849 -8621 -4786 8805 9241 -5881 -995 6933 -5623 -13025 -13565 2695 -1028 -10332 -8971
6958 -8971 -8930 4052 723 -10176 -27644 -30057 -18312 -14686 -17665 -16047 -7442 1157 -1128 -10897
6944 -10897 -8562 -11036 -16511 -13740 -19820 -33738 -22607 -8056 -5720 -13671 -21110 -19128 -4769 11871
6930 11871 23716 13021 -226 -10243 -8469 -8394 1344 12531 23548 15529 445 -2425 2103
6917 2103 12542 5104 -8008 975 14430 1853 -5059 5448 2208 -8016 -2261 1215 2561
6904 2561 3491 -5781 -10177 -13156 -13387 1514 16331 13837 -1598 -7786 -13818 -2578 2079 4687
6890 4687 15065 16508 29861 21399 -1339 -12061 -31454 -17611 -21323 -31629 -36872 -21622 -6208
6877f208q061p462j321K0807M883R865R794j9054j4492Q918p181j1651m673K557
6863b3279K0353N231j3333M28N956R739K263q170j2460q274r635k8J969J3162
6849a6078K593k96J2481j1247J606j1232P016M313k075k256J1664o478k783r173
6835b1945J2582J5894J9149k604o248N704J949j0991n168k3278o693J4703P95
6822f151J1315n202m891L298N749P480j2108j676L814r609J575K892n729j5432
6808b4675M133J2645J1299n103k270j3685k2018q685J4429J682O227J4284m578
6795a6315J586J110j650O369L423j1062j2832P424J3992N008j667m878o743o610
6781b2845L738O830Q745K917r665j2076J7962j0490j0784K6846J3615l948j0951
$$ plain form
6877 -6208 -14269 -21731 -23052 -2245 2638 12503 22297 3243 -11249 -2331 -9512 -21163 -25836 -23279
6863 -23279 -2926 2305 -11028 -10600 -4644 5095 7358 -812 -13272 -21546 -31181 -31209 -29240 -16078
6849 -16078 -13485 -13781 -1300 -12547 -10941 -22173 -15157 -10844 -12919 -15175 -3511 -9989 -12772 -21945
6835 -21945 -9363 6531 25680 23076 16828 22532 24481 13490 8322 -14956 -21649 -6946 -6151
6822 -6151 5164 -38 -4929 -1631 4118 11598 -510 -2186 1628 -7981 -6406 -3514 -9243 -24675
6808 -24675 -20542 -7897 3402 -1701 -3971 -17656 -39674 -48359 -33930 -32248 -26021 -11737 -16315
6795 -16315 -14729 -13619 -15269 -8900 -5477 -16539 -29371 -21947 -7955 -2947 -4614 -9492 -16235 -22845
6781 -22845 -19107 -12277 -3532 -615 -10280 -22356 -4394 -14884 -25668 1178 14793 10845 -106
6768a06k907L121j810q932L0359J2834k7824R887N649P35j483N249j8432j3907
6754g567p319k124J3114J3041q762l428R23n295q345R777K252r604K08L37R993
6739b799J8185j410O854p302k0780J295J542j407k615r116O629k23p029j445J3239
6724f382j785o60J5008L820M557l433P530j2587k3346j2571J805j261M602L203
6710b1500M642J3688Q882m398J278P318k629J3637J4666o380n349j4121P082o426
6696A0390j2714k0830N731N004k722J8230J9510J0163r405j0735P496q461j9404
6683g747J475j0639L394O585M002L115J0488m420J607k465p649j6426J4535J1470
6669G325P98o739j7764l328J4870M455M008L174j2182o174m965m07K6N932J2097
$$ plain form
6768 -106 -3013 108 -1702 -10634 19725 32559 4735 14622 20271 21006 19523 24772 6340 -7567
6754 -7567 -14886 -17010 -3896 9145 383 -3045 -2122 -7417 -15762 -5985 -3733 -13337 -13129 -12792 -2799
6739 -2799 15386 13976 20830 13528 -7252 -5957 -4415 -5822 -8437 -17553 -10924 -11147 -18176 -19621 -6382
6724 -6382 -8167 -8827 6181 10001 14558 11125 18655 6068 -17278 -29849 -28044 -29305 -24703 -21500
6710 -21500 -16858 -3170 5712 1314 2592 9910 7281 20918 35584 29204 23855 9734 16816 10390
6696 10390 -2324 -23154 -17423 -12419 -15141 3089 22599 32762 23357 12622 20118 11657 -7747
6683 -7747 -6272 -16911 -13517 -6932 -2930 185 10673 6253 7860 5395 -2254 -18680 -4145 7325
6669 7325 8123 1384 -16380 -19708 -4838 -383 3625 6799 -5383 -11557 -16522 -16929 -16903 -10971 1126
6654A126l002p931L755J9187Q509L136j0520j6195n394m421m582N628J6380N990
6640A1666n490J4473M345R662m474q626j8539j7043k238p52K3421N375K604q124
6626F260r943p355J725K094j4538m098J029M34N842P890R17Q448P289j3950K649
6611e307P68r506L469P72L904q198p46J5399m116r177o909J1576p74j7915R629
6596a7131o957M02J4414J0212M044j2352j0353M306J5503J1321n000j6146r723
6583a7460p60J1792j642o979p600l789J8092q89J509J6990j3976o616J0737M841
6569D250j0622r18M605O045p207l505j2240k405p579n011p633O187J6772K9205
6555I944j25n111j1274q597P991J5498k390o503j6739J0J951L998P025N608o724
$$ plain form
6654 1126 -1876 -9807 -6052 13135 21644 24780 14260 -1935 -7329 -11750 -16332 -10704 5676 11666
6640 11666 6176 20649 24994 34656 30182 21556 3017 -14026 -16264 -17016 6405 11780 14384 6260
6626 6260 -3683 -11038 -9313 -7219 -21757 -25855 -24826 -24392 -18550 -10660 -9743 -1295 5994 -7956 -5307
6611 -5307 -4539 -14045 -10576 -9804 -5900 -14098 -14844 555 -3561 -12738 -19647 -8071 -8845 -26760 -17131
6596 -17131 -24088 -23686 -9272 940 4984 -7368 -17721 -13415 2088 13409 8409 -7737 -17460
6583 -17460 -18220 -6428 -8070 -15049 -22649 -26438 -8346 -9235 -7726 9264 -4712 -11328 -591 4250
6569 4250 -6372 -7290 -2685 3360 -3847 -7352 -19592 -21997 -29576 -34587 -42220 -36033 -19261 9944
6555 9944 9819 4708 -6566 -15163 -7172 8326 5936 -567 -17306 -17296 -15345 -11347 -4322 1286 -5438
6540e438r752j093j186M116J464m751k752J5287J3768l693M394j1644q621Q246
6526a655O926M326J3396o65j5946j3522j1439n599J3545m041j2157J947L22K4100
6512d62J7248r607j7229r757J224k37k0221N09N684J1040Q183N632n327K034K1384
6497A0098Q128Q37O228n937j7359p387j2346n771J0754J4226M176q056J0252l652
6483D191o637P356j1019m447q81P379n33J471r94o043J4621J6748j0365k6232
6469a5385j3156N238K495l070P96J5477J091n292N977k273N150L799r065L013
6455e205R392l605p605J201J4920K294j2707j3530J779l009R261J6302M344k1783
6441g951J012P907L318j2353j223J1705k873l265J1869p529l955l176j2091k349
$$ plain form
6540 -5438 -15190 -16283 -17469 -13353 -11889 -16640 -19392 -4105 9663 5970 10364 -1280 -9901 -1655
6526 -1655 5271 9597 22993 22328 6382 -7140 -18579 -24178 -10633 -14674 -26831 -24884 -24562 -462
6512 -462 16786 7179 -10050 -19807 -18583 -18820 -39041 -38532 -32848 -21808 -13625 -7993 -13320 -11286 10098
6497 10098 18226 19063 25291 19354 1995 -5392 -17738 -23509 -12755 1471 5647 -2409 7843 4191
6483 4191 -2446 4910 -6109 -10556 -11437 -4058 -4591 -3120 -4114 -10157 4464 21212 10847 -15385
6469 -15385 -28541 -23303 -20808 -23878 -23082 -7605 -6514 -11806 -5829 -8102 -2952 847 -8218 -5205
6455 -5205 4187 582 -7023 -5822 9098 11392 -1315 -14845 -13066 -16075 -6814 9488 13832 -7951
6441 -7951 -6939 968 4286 -8067 -9290 2415 -458 -3723 8146 617 -3338 -6514 -18605 -20954
6427b0954J307j7756q587P240K0525R402J1041j1978k637J515J419j972R954J946
6413D65Q932q623j88L100q647j2293J3506N996L668k506m809m105M504l865q878
6398a3743K909Q16N726J265o977q216l814K6450P559j6645Q45j235J6884P902
6384A9726K411j3194m057m693j9199K906m55j0983J1814K6715k080p039P131q744
6370B59j9203L425J1418J0027J0741l114q57j1711q307k943j1094O458P766j669
6356h804N688K825J420o16J2623L793m774k039O834n434l409J6096Q37p439k897
6341A4704j1312q54k235j5076j8552J2810P663j0112L344o84l470J5451J9688
6328A1365R819k01o309j8736j485j773j2859l759o902k776R593J8527O825P475
$$ plain form
6427 -20954 -19647 -37403 -45990 -38750 -18225 -8823 2218 -9760 -12397 -10882 -9463 -11435 -1481 465
6413 465 9397 774 586 3686 -4961 -17254 -3748 2248 5916 3410 -1399 -5504 -1000 -4865 -13743
6398 -13743 -10834 -10018 -4292 -3027 -10004 -18220 -22034 4416 11975 -4670 -3825 -5060 11824 19726
6384 19726 22137 8943 4886 193 -19006 -16100 -16555 -27538 -15724 10991 8911 1872 9003 259
6370 259 -18944 -15519 -4101 5926 16667 13553 12696 985 -7322 -10265 -21359 -14901 -7135 -8804
6356 -8804 -3116 -291 1129 513 13136 16929 12155 10116 16950 11516 8107 24203 25040 17601 14704
6341 14704 3392 2538 303 -14773 -33325 -20515 -12852 -22964 -19620 -20304 -23774 -8323 11365
6328 11365 21184 20983 14674 -4062 -5547 -7320 -20179 -23938 -30840 -33616 -24023 -5496 1329 8804
6314H804R670K055j9910r441M580J0402K990m994j8364j620L66l903l579O381
6300a6563P358Q608p372j736J0245j151j4657M791Q499N376j296k634P123J785
6286H376j1277p071J1308o087l207Q74q457m293J0834J3694P3j237K018N4l1200
6271b5598n799J7740J9231O431j9796j0893N164L919M378j7148j5687L743K0044
6258a4271K796J9502K928j3883j3267N945l172m401L948J3536P685j791J5717
6245B1272j2080k1498j6663R536L1499N748j9035j5464L451K212k991J759K516
6232i738o80n650j160J219l506J2321K4993J0730Q685q559k491n009m090J0940
6218B8005o57p669l33L012j7423k1763J0616R5Q298n606K617N029l327N586M359
$$ plain form
6314 8804 18474 20529 619 -8822 -4242 6160 9150 4156 -14208 -15828 -15462 -19365 -22944 -16563
6300 -16563 -9205 -597 -7969 -9705 540 -611 -15268 -10477 -1978 3398 2102 -532 6591 8376
6286 8376 -2901 -9972 1336 -4751 -7958 -7084 -15541 -19834 -9000 4694 4767 3530 5548 5602 -25598
6271 -25598 -31397 -13657 5574 12005 -7791 -18684 -13520 -9601 -5223 -22371 -38058 -34315 -14271
6258 -14271 -11475 8027 10955 -2928 -16195 -10250 -13422 -17823 -13875 -339 7346 5555 21272
6245 21272 9192 -12306 -28969 -19433 12066 17814 -1221 -16685 -13234 -11022 -14013 -12254 -9738
6232 -9738 -10418 -16068 -17228 -16009 -19515 -7194 17799 28529 37214 28655 26164 21155 17065 28005
6218 28005 27348 19679 19346 22358 4935 -16828 -6212 -6117 2181 -3425 -808 4221 894 6480 10839
6203A0839P839l060k330P302L742j6111j8961r540m072M65L093O573J7385J3816
6189A6980j1020k6501r48k937M435M526J1467J3060J1676n933j2342p764M544
6176g57m25N477J5394J3062j6179j8501N727j917Q973Q02l882N862N657m67K672
6161B1498r738q954J0162m003L52l547J7154r557j3700J3565M078r754n172j5711
6147a3327L444J4676K911n009j6877l453J0545K0629J2198m978n938j3884r333
6134h396k260O176p057k639n006j6537J0058J7314L696p631L819l1N455j3716
6120a6755k856p046k3744J6142J9152R622J0433P688j667k805j4570p178J7257
6107C673j7912j2189k863J0688M423J2983P496m40j1761p677j0883M007l942q495
$$ plain form
6203 10839 18678 15618 13288 20590 24332 8221 -10740 -20280 -24352 -23887 -20794 -14221 3164 16980
6189 16980 5960 -20541 -21489 -24426 -19991 -15465 -3998 9062 20738 14805 2463 -5301 -757
6176 -757 -1182 4295 19689 32751 16572 -1929 3798 1881 10854 11656 7774 13636 19293 18826 21498
6161 21498 11760 2806 12968 8965 9317 5770 22924 13367 -333 13232 17310 7556 2384 -13327
6147 -13327 -9883 4793 7704 2695 -14182 -17635 -7090 13539 25737 20759 14821 937 -8396
6134 -8396 -10656 -4480 -11537 -14176 -19182 -35719 -25661 -8347 -4651 -12282 -8463 -8494 -3039 -16755
6120 -16755 -19611 -26657 -50401 -34259 -15107 -5485 4948 12636 10969 8164 -6406 -13584 3673
6107 3673 -14239 -26428 -29291 -18603 -14180 -1197 6299 5859 -5902 -13579 -24462 -20455 -24397 -32892
6093c2892M812J6984K690j7537k498N262N756J3289J5393l07M772j3561Q439J270
6079A1872J0301j5222n717k31N350p613j6359q541l831Q859Q658P55q073Q738
6065a1054M03l62R026J4685J0805R557J330l534J4043o84k7428k8346o661j2308
6051c0528M609J1849R747P582m829j5455N547L554p843r76N197J024k44m351j5268
6036c0385l368J4057J8362o931j0813J4340m210K472N631k104k0J3154j379M004
6022A2810M634p609J019n475j1850N134R015q137P51J3765n612r724q531j5915
6008b5725O967J5108R586j277o431J0207j3798o085m581M680J4390J2517k436
5995A3122j3826n842J0260j5618l022R797j6132j0683J3742J2144R471P418J0206
$$ plain form
6093 -32892 -28080 -11096 -8406 -25943 -28441 -23179 -17423 -4134 11259 10952 15724 2163 10602 11872
6079 11872 22173 6951 1234 1003 6353 -1260 -17619 -26160 -29991 -21132 -12474 -11719 -19792 -11054
6065 -11054 -10651 -11013 -1987 12698 23503 33060 34390 30856 44899 44215 16787 -11559 -18220 -30528
6051 -30528 -25919 -14070 -4323 3259 -1570 -17025 -11478 -7924 -15767 -16743 -11546 -10522 -10766 -15117 -30385
6036 -30385 -33753 -19696 -1334 -8265 -19078 -4738 -8948 -6476 -845 -2949 -2969 10185 8806 12810
6022 12810 17444 9835 10854 5379 -6471 -1337 7678 -459 292 14057 8445 -1279 -9810 -25725
6008 -25725 -18758 -3650 5936 4659 -1772 8435 -5363 -11448 -16029 -11349 3041 15558 13122
5995 13122 -704 -6546 3714 -11904 -14926 -5129 -21261 -31944 -18202 -6058 3413 10831 21037
5982B1037m106K10K08m039l339L278j634p323O234M256j4441M50J8485j1130j4986
5967f840j533j32J3147N261m616r182J38m184m816l205r44R933p360j612Q246
5952g699K196J0162J3024p496j5568M000J2528N396r293j9099J974J3164J2139
5939A5428R827J505j389J894j0051l16j1418j3181l486J812n547Q58j399J3500
5925a963J3089l800j4022J9771J917l981j5728m124L212O191n913j5179j0476
5912c1006Q513N438m78j805j168R059P914r125r206N086l52P688j0100k122q12
5897b2476k135K540J929M778J768N16n12R475M647j9726k634Q641J477m840R964
5882f588O240R963o91q438K789K675O162J226L653j8865j1304k685J2517r411
$$ plain form
5982 21037 16931 17141 17349 13310 9971 13249 11615 4292 10526 14782 341 791 19276 8146 -6840
5967 -6840 -8373 -8505 4642 9903 5287 -3895 -3757 -7941 -12757 -15962 -16906 -6973 -14333 -15945 -7699
5952 -7699 -5503 4659 17683 10187 -5381 -1381 11147 16543 7250 -11849 -9875 3289 15428
5939 15428 25255 26760 25371 27265 17214 16898 5480 -7701 -11187 -9375 -14922 -14064 -15463 -1963
5925 -1963 11126 7326 -6696 13075 14992 11011 -4717 -8841 -5629 562 -5351 -20530 -31006
5912 -31006 -22493 -17055 -17533 -19338 -20506 -11447 -3533 -12658 -21864 -16778 -17130 -9442 -19542 -21664 -22476
5897 -22476 -24611 -22071 -20142 -15364 -13596 -13080 -13592 -4117 530 -19196 -21830 -13189 -11712 -16552 -6588
5882 -6588 -348 9615 8924 486 3275 5950 12112 13338 16991 -1874 -13178 -15863 -3346 -12757
5868a2757k007J9061L883j5768K813P486J983m231M819j2598k477j348N454O371
5854F84Q226r889M186j757q92l977j1006P687L590J1658o16O215r623j4640R00
5839i254J0504O238k1723j0371K204J0486L685J7759j94k1421K824q436k046J7768
5825a977n181j8185M462J1009J3503M593k3046p093O60P003p932j1486J4472O481
5811a2717p194M434K3503J3719j1002j2335j4812O320J1008J1003M8j4323p957
5798a0305l465J031J2174J0317P569K059j2888r424n689K677J8352N095j6817
5785F86j562k523L285N722j4112N22P187J9564P269j2999o194p908j8177J1033
5771h207J4027R960r460j7018p648j907M587O651J784O264K771P306j0409m379
$$ plain form
5868 -12757 -14764 4297 8180 -7588 -4775 2711 4694 463 5282 -7316 -9793 -11141 -5687 684
5854 684 8910 -979 3207 1450 558 -3419 -14425 -6738 -3148 8510 7894 14109 4486 -10154 -9254
5839 -9254 1250 7488 -14235 -24606 -22402 -11916 -8231 9528 9334 -12087 -9263 -17699 -19745 -1977
5825 -1977 -7158 -25343 -20881 -9872 3631 8224 -14822 -21915 -21255 -14252 -22184 -33670 -19198 -12717
5811 -12717 -19911 -15477 8026 21745 10743 -1592 -16404 -10084 924 11927 11975 -2348 -10305
5798 -10305 -13770 -12739 -565 9752 17321 19380 6492 -2932 -8621 -5944 12408 17503 686
5785 686 -876 -3399 -114 5608 -8504 -7982 -795 18769 26038 13039 6845 -1063 -19240 -8207
5771 -8207 5820 15780 6320 -10698 -18346 -20253 -15666 -9015 -7231 -967 1804 9110 -1299 -5678
5757e678J2026N5N836k3965j4350J2840K747L437m136j0299l183M125l563n854
5743b9962M670M693K368o980O382L560p957J284r180O697J087P459K612K851O140
5728d276J0347l755j3511N561L742K759m366l340j038q430J3777J1137N68J3402
5714B2577J4060O987j4017p373j3383p027p136n090m384M435J8603Q482j3520
5701C214n374J0461p160J625M276l477O156P332k508J557L99L073N230o249p671
5686A0884r53j718j6093j8914r464K0726R89k375o823M975K6084n110k1554j2692
5672c2038m884J5873J3225J2457O166k713p692m563l908J0330m73o825J0598J5759
5658B1312j4420k1502r108J3960O181j108J0384l011L564L29N357q482m626J1269
$$ plain form
5757 -5678 6348 6403 12239 -11726 -26076 -13236 -10489 -7052 -11188 -21487 -24670 -20545 -24108 -29962
5743 -29962 -25292 -20599 -18231 -25211 -18829 -15269 -23226 -21942 -31122 -24425 -23338 -15879 -13267 -10416 -4276
5728 -4276 6071 2316 -11195 -5634 -1892 867 -3499 -6839 -7877 -16307 -2530 8607 9175 22577
5714 22577 36637 43624 29607 22234 8851 1824 -5312 -10402 -14786 -10351 8252 16734 3214
5701 3214 -2160 8301 1141 2766 7042 3565 9721 17053 14545 16102 16501 19574 24804 18555 10884
5686 10884 9931 8213 -7880 -26794 -36258 -15532 -14543 -16918 -23741 -18766 7318 2208 -19346 -32038
5672 -32038 -36922 -21049 -7824 4633 10799 8086 394 -4169 -8077 2253 1780 -5045 5553 21312
5658 21312 6892 -14610 -23718 -9758 -3577 -4685 5699 2688 6252 6581 11938 3456 -1170 10099
5644A0099o408l750Pj4668n96K168K507J0614K039p753k323Q036K594m076j529
5629c039M591k357p156M3M957j4337p622L261M908M308J4353l556P050M238L528
5614A3170R46j3823j2659j5791l412J4790J2404r68j2755q194Q212J2608l046
5601h518j3121L458J3088N828J0605j1571j6969O644N792Q762M329q533j7225
5588a7431j4583J042J0201K158J748n93J1105P09r097P74J7084J0631O983k730
5574A8001l455l268J0571q140j0583k498n25r16J358k951l770M270J48n575N164
5559b169J1069r161o327K771Q469K0192Q436j544q67j6844j2725Q077K0290J1845
5545D1512o716j5023o850j7712r359R657O082p309m417k288J929J4949J2429j4175
$$ plain form
5644 10099 3691 -59 -52 -14720 -15316 -13148 -10641 -27 2012 -5741 -8064 -28 2566 -1510 -3039
5629 -3039 1552 -805 -7961 -7918 -2961 -17298 -24920 -21659 -16751 -12443 1910 -1646 5404 9642 13170
5614 13170 14116 293 -12366 -28157 -31569 -16779 -4375 -5343 -18098 -26292 -18080 -5472 -8518
5601 -8518 -21639 -18181 -5093 735 11340 -231 -17200 -10556 -4764 3998 8327 -206 -17431
5588 -17431 -32014 -30972 -20771 -18613 -16865 -17458 -6353 -5644 -14741 -13967 3117 13748 20731 18001
5574 18001 14546 11278 21849 13709 3126 628 103 -813 545 -2406 -6176 -1906 -1758 -7333 -2169
5559 -2169 8900 -261 -6588 -3817 4652 24844 33280 31736 30869 14025 1300 9377 29667 41512
5545 41512 34796 19773 12923 -4789 -14148 -4491 1591 -5718 -10135 -12423 -10494 4455 16884 2709
5531B709q428k0260p009J0735Q007J2084N78M241M476k741j2605J237l094J3766
5517C696J3926m363r732m161r913l763J4773J944k287J4598N347j1003j0903q755
5503a0596O0J0395n145m357M315J771M965j3336l325J7635N813Q84j635l814l163
5488D67m048L40J689N775K301j0864M745K115j3143O124M880j936O087R175j0
5473A3697j4389l731K451K2931m742j8150n099J1224J3614j165j9173j2045o083
5460b0660q20l681r834J1101R588r07M045m413J749j496O458O510P877m004r647
5445h134n940J4418K347K675J262M524L583j0164L457O096j2696l456l293J752
5431c569n364j1743K53J4075K427K361l080n81K521N370K452j25l202K502J970
$$ plain form
5531 2709 -5719 -25979 -32988 -22253 -14246 -2162 -1584 2657 7133 4392 -8213 -6976 -10070 3696
5517 3696 17622 13259 3527 -634 -10547 -14310 463 2407 120 14718 20065 9062 -1841 -10596
5503 -10596 -10536 -141 -5286 -9643 -5328 -3557 1408 -11928 -15253 2382 8195 9079 7444 3630 467
5488 467 -3581 -3241 -1552 4223 6524 -4340 405 2520 -10623 -4499 381 -1555 4532 13707 13697
5473 13697 -692 -4423 -1972 20959 16217 -1933 -7032 4192 17806 16641 -2532 -14577 -20660
5460 -20660 -21480 -25161 -34995 -23894 -14306 -15213 -11168 -15581 -13832 -15328 -8870 -2360 5517 1513 -8134
5445 -8134 -14074 344 2691 5366 6628 11152 14735 4571 8028 14124 1428 -2028 -5321 -3569
5431 -3569 -8933 -20676 -20423 -6348 -3921 -1560 -4640 -5221 -2700 2670 5122 4997 1795 4297 6267
5416F267P078j5288j2343k354m257Q635N278J4761O784M337j3907R286l582j7299
5402f604L161Q437l875k332k859l904N170J1133J1645j9326l198K708q856P387
5388a313K405j750l058p053K289L139r737J426P002m373j202J1325j0719l586
5374a5205J1794J0191J491j4703j418J2371O49j0137j1657q090M477L772N592
5361a0873J996n727k614K334J7157J9334R683J994k958j4529n270J0188l513m926
5347A2276P268j3772j1513k256p466m132K698J7441p757o315J4595j7642p935
5334b4510j102j355J262N526l639J965j022J23J5452K837Q365J1690K321p567
5320A0346j240O777j1290M348J0125j3368k142R93Q311J795k345Q563P933l197
$$ plain form
5416 6267 13345 -1943 -14286 -16640 -20897 -12262 -6984 7777 14561 18898 4991 14277 10695 -6604
5402 -6604 -3443 4994 1119 -1213 -4072 -7976 -2806 8327 19972 646 -2552 156 -8700 -1313
5388 -1313 1092 -658 -3716 -10769 -8480 -5341 -15078 -13652 -6650 -11023 -12225 -900 -11619 -15205
5374 -15205 -3411 6780 8271 -6432 -7850 4521 5170 -4967 -16624 -24714 -20237 -16465 -10873
5361 -10873 -8877 -14604 -17218 -14884 2273 21607 31290 33284 30326 15797 10527 20715 17202 12276
5347 12276 19544 5772 -5741 -7997 -15463 -19595 -16897 544 -7213 -13528 1067 -16575 -24510
5334 -24510 -25612 -26967 -25705 -20179 -23818 -21853 -22875 -22752 -7300 -4463 3902 15592 17913 10346
5320 10346 9106 15883 4593 8941 19066 5698 3556 4549 12860 14655 12310 20873 28806 25609
5306B5609k306q5j3208j1848n380r646l901J3165M570j2708K020P170J97q508
5292a4859L327O318j048j074m34m940j0160J0630L934n79N151L365Q823Q065R629
5277B6148m516k0286j1798l179J0401k332o537j311p040M925K563R04O809j0430
5263a5679j7333J250J8530J7309o429k79j432o41j0670K602J3276N746K906k703
5249F453n398M323J409o192o339L831K1852J868j9125O782o370O732Q538k8949
5235a0585q601l755N699j301j2096k828O945q17J9955K0333o060J946M407j0994
5221B248j2908P272P591l006L553P487k912k3817l797O506l487O720K7607J3248
5207C2305j2694l178r032l078j832m045j5457j2778J0399K376J6892J1004N758
$$ plain form
5306 25609 23303 23218 10010 -1838 -7218 -16864 -20765 -7600 -3030 -15738 -13718 -6548 -6351 -14859
5292 -14859 -11532 -5214 -6262 -7336 -7770 -12710 -22870 -12240 -8306 -8885 -3734 -369 8454 16519 26148
5277 26148 21632 1346 -10452 -13631 -3230 -5562 -12099 -13410 -20450 -15525 -12962 -12058 -5249 -15679
5263 -15679 -33012 -31762 -13232 4077 -2352 -2631 -4063 -4704 -15374 -12772 504 6250 9156 6453
5249 6453 1055 5378 6787 595 -5744 -1913 19939 21807 2682 9464 3094 9826 18364 -10585
5235 -10585 -19186 -22941 -17242 -18543 -30639 -33467 -26522 -27339 -7384 12949 6889 8835 13242 2248
5221 2248 -10660 -3388 4203 1197 4750 12237 9325 -14492 -18289 -11783 -15270 -8550 19057 32305
5207 32305 19611 16433 7401 4323 2491 -1554 -17011 -29789 -19390 -17014 -122 10882 16640
5194A6640J36n599j516n361r309k675P872J0474K215R395J228q461k653j4151
5180a765M132k738n832O503r438q256R678Q615j1516j0291R038k145R41J9948
5166F874N058j634J516j7025J7576M804q001L243R093p442k7594Q236J5978O981
5152A7663q207r319o530J6976Q16O68o18J331K717j305n143J1498O383k664j0523
5137A3743l214m506N376K149o264l662j0768j2351R0P691P103l975O715L692j5557
5122a3738k047n14K3162p765L607N265k620N616J5317j812K692j4024k1607p254
5108a5722p843p031P489J9070J1589K028N404J6636j7198k1726P803r30K832J198
5094C599M14j3748o252J1782J5833j6502j3507j0485L961P018J0503M101J2618
$$ plain form
5194 16640 16776 11177 9661 4300 -5009 -7684 188 10662 12877 22272 23500 15039 12386 -1765
5180 -1765 2367 -371 -6203 300 -9138 -17394 -7716 899 -10617 -20908 -11870 -14015 -13074 6874
5166 6874 11932 10298 11814 -5211 12365 17169 9168 12411 21504 14062 -13532 -5296 10682 17663
5152 17663 9456 137 -6393 10583 11399 12067 11449 12780 15497 14192 9049 20547 26930 24266 13743
5137 13743 10529 6023 11399 13548 7284 3622 -7146 -19497 -19407 -11716 -4613 -8588 -1873 1819 -13738
5122 -13738 -15785 -16299 6863 -902 2705 7970 5350 10966 26283 24471 27163 13139 -8468 -15722
5108 -15722 -23565 -30596 -23107 -4037 7552 9580 14984 31620 14422 -7304 499 -431 2401 3599
5094 3599 4013 -9735 -15987 -4205 11628 -4874 -18381 -28866 -24905 -17887 -7384 -3283 9335
5081I335L978k885n530j4472o657N654M110J0225p565r30M312K1851N868j5389
5067A1905j6828l305m080q300k814O207L617k499l553J334Q98J282J192M429K614
5052g901k836N623L927j74P66p30Q3M289J823L96J2064J6469M216m556j5287j2218
5036E954o604j5491j208n77L287R728j1807l081L928k559M554M061L682Q774o521
5021c880p187n510m58M294l252L876J0850k127K087K251j1124o298j667K16M233
5006a3696n157K498J731m611p573R085K7587K0311j2410k2385J758P8K275o277
4992f786l566o945o566J0086l686K417J2135q709J4776n380j2404P535P469P968
4978H344R302p460j6024L092k064j5017r73J1125J8182P916J5030m43j8258j7035
$$ plain form
5081 9335 13313 10428 4898 -9574 -16231 -10577 -6467 3758 -3807 -4737 -425 21426 27294 11905
5067 11905 -4923 -8228 -12308 -20608 -23422 -17215 -13598 -16097 -19650 -18316 -17418 -16136 -14944 -10515 -7901
5052 -7901 -10737 -5114 -1187 -1361 -595 -1325 -1242 3047 4870 5266 17330 33799 38015 33459 18172 5954
5036 5954 -650 -16141 -17349 -17926 -14639 -4911 -16718 -19799 -15871 -18430 -13876 -9815 -6133 2641 -3880
5021 -3880 -11067 -16577 -17035 -12741 -15993 -12117 -1267 -3394 -1307 944 -10180 -16478 -18145 -17929 -13696
5006 -13696 -18853 -16355 -14624 -19235 -26808 -17723 9864 30175 17765 -4620 -2862 -2784 -509 -6786
4992 -6786 -10352 -17297 -23863 -13777 -17463 -15046 -2911 -11620 3156 -2224 -14628 -7093 376 8344
4978 8344 17646 10186 -5838 -2746 -4810 -19827 -20800 -9675 8507 16423 31453 31010 12752 -4283
4964d283l234o813O687n83N203J719p332J0874L833j920m213O347m487j0380l633
4949a2215n41k082J8954K5024O82m380k555k9000j8669O619J1295J769L343Q484
4935F728M762n644N129k070k368L447J259j766K725L567j727p832j4569l295J6348
4920D694J092q408L429J7141P641K681q330o951J668m567Q610j920l071j78j7432
4905c901L57N264j0231Q59J1059m695j0640J6330N279p689j6207P703Q180k522
4891h54j3982N136r173N531p65l484q50M31J564m204N736J082J0750P599r309
4876d792j1819n917J552J1261J4784J1487j195J2209k7986j0151q537M664j0243
4863b4683q78Q651Q156p658r274J8818N102r181l211J2409J2675k855j7296n039
$$ plain form
4964 -4283 -7517 -14330 -7643 -8226 -3023 -1304 -8636 2238 6071 4151 -62 6285 1798 -8582 -12215
4949 -12215 -12756 -14838 4116 29140 29822 25442 22887 -6113 -24782 -18163 -6868 -5099 -1756 6728
4935 6728 11490 5846 10975 8905 6537 9984 11243 9477 12202 15769 14042 6210 -8359 -11654 4694
4920 4694 5786 -2622 807 17948 25589 28270 19940 12989 14657 10090 18700 16780 13709 13531 -3901
4905 -3901 -3544 1720 -8511 -7652 3407 -1288 -11928 4402 9681 1992 -14215 -6512 1668 -854
4891 -854 -14836 -9700 -18873 -13342 -14107 -17591 -18441 -18010 -16446 -20650 -14914 -13832 -3082 4517 -4792
4876 -4792 -16611 -22528 -20976 -9715 5069 16556 15361 27570 -416 -10567 -19104 -14440 -24683
4863 -24683 -25561 -16910 -8754 -16412 -25686 -6868 -1766 -10947 -14158 -1749 10926 8071 -9225 -14264
4849a4264J4715J8234p010k1426M085P39p535m09N697P780j1608j8300R1J5348
4835a3863P922O622N443j1279j5232O843K7088o594m5J0176j6298Q821m561p742
4821b699K523J0651K947j5095r638q242k180R303j0840p00J0625J4889j4449J608
4807a1297J9105J8386k912q688j3789j0338j1174K454q507J2905J7044J418j1887
4794g280p048n230N778q715O15J5792J6934J2616j1183k1024J793J497r600J2624
4780b431O282Q837N884p27j0526j5440j3263J4418Q145j785J891K011K416M540
4766A0252O876l436j6630j1389n075o812J6742O425j6456l669L14L435N848m676
4752a8251n815n589P889K1318P945j3248k956J76l157R480N400o167O036j372
$$ plain form
4849 -14264 451 18685 11675 -9751 -5666 -4927 -12462 -12871 -7174 606 -11002 -29302 -29211 -13863
4835 -13863 -5941 681 6124 -5155 -20387 -13544 13544 6950 6905 17081 783 9604 5043 -2699
4821 -2699 -176 10475 13422 -1673 -11311 -19553 -21733 -12430 -23270 -23970 -13345 1544 -12905 -11297
4807 -11297 7808 26194 23282 14594 805 -9533 -20707 -18253 -26760 -13855 3189 4607 -7280
4794 -7280 -14328 -19558 -13780 -22495 -21880 -6088 10846 23462 12279 -8745 -6952 -5455 -15055 -2431
4780 -2431 3851 12688 18572 17845 7319 -8121 -21384 -6966 1179 -606 1285 3296 5712 10252
4766 10252 17128 13692 -2938 -14327 -19402 -26214 -9472 -3047 -19503 -23172 -22858 -19423 -13575 -18251
4752 -18251 -24066 -29655 -21766 -448 7497 -5751 -8707 -8531 -11688 -2208 3192 -2975 3061 1689
4738A689k0583J832R314m354O388J2043J0547R322M472n724j5918R506j269k0662
4724c397J530P253N021j0953O57Q02j3981l48P237O674M818L003L436n364j2o114
4708B62p148l769j1412m849J701J4304L1110P487k219k3555o190J2502M375L769
4694A6368j3042J609J8127p377q667l79j4134k407M469K313j2777K469L986k175
4680a1617K567J1870J7265m670r716p634J1748O093j310l511k1302n063L638p147
4666a8789k801k095j3972o921N615J2475n348q21J783n274K444J0597J302N682
4652a6123J0436O36n22L184K665K326P731N220j1704k403o914L882J1693K237
4638A2344k0972o898K5155P760J0207J2806p207k3959o914p627m348J2909L61
$$ plain form
4738 1689 -18894 -17062 -7748 -12102 -5714 6329 16876 26198 30670 24946 9028 18534 17265 -3397
4724 -3397 -1867 5386 10407 -546 111 913 -13068 -13416 -6179 495 5313 8316 11752 6388 6376 262
4708 262 -6886 -10655 -22067 -26916 -25215 -10911 20199 27686 25467 1912 -4278 8224 12599 16368
4694 16368 3326 4935 23062 15685 7018 6639 -7495 -9902 -5433 -3120 -15897 -13428 -9442 -11617
4680 -11617 -9050 2820 20085 15415 5699 -1935 9813 15906 14596 11085 -10217 -15280 -11642 -18789
4666 -18789 -21590 -23685 -37657 -44578 -38963 -26488 -31836 -32657 -30874 -36148 -33704 -23107 -21805 -16123
4652 -16123 -5687 -5051 -5573 -2389 276 2602 10333 15553 3849 1446 -5468 -1586 10107 12344
4638 12344 -8628 -15526 9629 17389 27596 40402 33195 9236 2322 -5305 -9653 3256 3617
4625C617j0528P685K1041K0065j2500k3059j2261Q950M920O424Q688j3155p339
4612B548j8146p485N233R779l478j347R049L0558Q238q304k0187m844J860J6694
4598B0168J6404k119q791j9016K216M409K687P880o50k888j7325m323J0922j284
4584H290k629j0175m062M679n033J1629J9061q733j1427k121N588j944j2341n833
4570a5051j631M656K5897P429j6050K852j0105J368r663n660L580m425J671l944
4556a9076L916K0786R926j2828O07K788j4737j4613J2898N902k53J1178L396j4207
4542d317j1041N251J8700m166K883p889o358Q829l580P080m403J0906K2954n411
4528B9438j8419nJ167j3462J3344J3130n112r246N053k626j1349l853q688j1468
$$ plain form
4625 3617 -6911 774 21815 41880 29380 6321 -5940 3010 7930 14354 23042 9887 2548
4612 2548 -15598 -23083 -17850 -8071 -11549 -12896 -3847 26711 34949 26645 6458 1614 3474 20168
4598 20168 36572 34453 25662 6646 8862 13271 15958 23838 23188 20300 2975 -1348 9574 8290
4584 8290 5661 -4514 -8576 -3897 -8930 2699 21760 13027 1600 -521 5067 3123 -9218 -15051
4570 -15051 -16682 -12026 13871 21300 5250 8102 -2003 -635 -10298 -15958 -12378 -16803 -15132 -19076
4556 -19076 -15160 5626 15552 2724 3331 6119 -8618 -23231 -10333 -4431 -4684 6494 9890 -4317
4542 -4317 -15358 -10107 8593 4427 7310 -579 -6937 1892 -1688 5392 989 11895 34849 29438
4528 29438 11019 11014 12181 -1281 12063 25193 20081 10835 15888 13262 1913 -1940 -10628 -22096
4514b2096K85M218k16K170J283K861m282l433K572q489j2953J0389J7198Q90p22
4499a0325N855R182P696M242k26Q802j3963j0253n614K329K846O069L719j6549
4485f190L977j633M734M563l943J880K1270o298n589J794j1960O97j6037o700
4471a9435m056P49J4553l15m502K0792J8086j4608l177m66k284n839j02j5762
4457a6366m681J2554L700n531j8726k5485O184j728J0167Q182J0633m987O215
4444a9869J2488k27J449P257J330p316P166K033P350l232j9290K129m678l05J5235
4429A520J9254J434J395o869o497j478J0007M12k6960r338J1567J2706m839O97
4415C011L204l671N246P720J279j6962p104l89p024J1182Q637r889j574r976J0433
$$ plain form
4514 -22096 -21811 -17593 -17809 -15639 -14356 -11495 -15777 -19210 -16638 -25127 -38080 -27691 -10493 -9603 -10325
4499 -10325 -4470 4712 12408 16650 16424 25226 11263 1010 -4604 -2275 571 6640 10359 -6190
4485 -6190 -2213 -3846 888 5451 1508 3388 24658 18360 12771 14565 2605 3302 -12735 -19435
4471 -19435 -23491 -22742 -8189 -8504 -13006 7786 25872 11264 8087 7621 5337 -502 -604 -16366
4457 -16366 -21047 -8493 -4793 -10324 -29050 -54535 -48351 -50079 -39912 -31730 -21097 -26084 -19869
4444 -19869 -7381 -7608 -6159 1098 2428 -4888 2278 4311 11661 8429 -10861 -8732 -13410 -13715 1520
4429 1520 20774 22208 23603 16734 10237 8759 18766 19178 -7782 -17120 -5553 7153 2314 3011
4415 3011 6215 2544 7790 15510 16789 -173 -7277 -7666 -14690 -3508 5129 -4760 -6334 -16310 -5877
4400e877P189j0061Q891l875m940J331k2099L438O580J148j585K661O058m076
4386a5217P413J2251K284q787M209J748k2353N578J6484p69O68m762K54j909j27
4371c035o201N81M947j664O484Q230j912q254J976Q730K5397J888p694q397J4381
4356C5457m68j860q171j4167K587k942r592o064Q9m173M672j2076j1895M178Q557
4341a5868L580m171k07J394M887Q866J636M278j538n734M514M05j0172J3783O439
4326A2092k598l85l06M730R195R367j4983j6476l112P123J203P724p428k56K819
4311H709j3209j344O977k409P016q077r28O621m276N749J1053l666j3018j5435
4297a6237l977Q810P544r385p199J8186k506K089J2851l216j352M851n166j2398
$$ plain form
4400 -5877 1312 -8749 142 -3733 -8673 -7342 -29441 -26003 -19423 -18275 -19860 -17199 -11141 -15217
4386 -15217 -7804 4447 6731 -2056 2153 3901 -18452 -12874 3610 2841 3509 -1253 -999 -2908 -3035
4371 -3035 -9236 -8655 -3708 -5372 1112 9342 7430 -824 1152 9882 35279 37167 29473 21076 35457
4356 35457 34989 33129 24958 10791 13378 10436 844 -5220 -5131 -9304 -4632 -16708 -28603 -24425 -15868
4341 -15868 -12288 -16459 -16666 -15272 -10385 -1519 117 4395 2857 -2877 1637 2042 -8130 5653 12092
4326 12092 9494 9109 8803 13533 22728 32095 17112 636 -2476 4647 5850 13574 6146 5890 8709
4311 8709 -4500 -5844 1133 -1276 5740 -2337 -3265 3356 -920 4829 15882 12216 -802 -16237
4297 -16237 -20214 -11404 -3860 -13245 -20444 -2258 -4764 -2675 10176 6960 5608 10459 5293 -7105
4283g105j1460J4342K1063K215J0250k923m725j1453J7602j817o366j121j575
4270A6927N147q457j1049q638J602j506J893p15j0338J7189O836m136l366L439
4256D828P829p352N440l365l806q183j2033l583k725J1002K8919J1772q288n104
4242A5351j5996j342j5759q483J4908N675j137m641n494J1492N252J4398M500
$$ plain form
4283 -7105 -18565 -4223 16840 19055 29305 26382 21657 10204 27806 25989 19623 18502 16927
4270 16927 22074 13617 2568 -6070 -4468 -5974 -4081 -4796 -15134 2055 8891 4755 1389 4828
4256 4828 12657 5305 10745 7380 3574 -4609 -16642 -20225 -22950 -11948 16971 28743 20455 15351
4242 15351 -645 -1987 -17746 -26229 -11321 -5646 -6783 -11424 -16918 -5426 -174 14224 18724
$$ [...]
##END NTUPLES=NMR SPECTRUM
##END=
