##TITLE=Analysis number 318005
Compound Code mo 00734
Project Code adrs
Chemist Name ugmt
##JCAMPDX= 6.0         $$ Bruker NMR JCAMP-DX V2.0
##DATA TYPE= NMR SPECTRUM
##DATA CLASS= NTUPLES
##ORIGIN= Bruker BioSpin GmbH
##OWNER= nmr
$$ XWIN-NMR		Version 3.5
$$ Fri Mar 10 12:00:32 2006 GMT Standard Time (UT+0h)  MAYBRIDGE\nmr@NMR_250MHZ
##.OBSERVE FREQUENCY= 250.131544655141
##.OBSERVE NUCLEUS= ^1H
##.ACQUISITION MODE= SIMULTANEOUS (DQD)
##.ACQUISITION SCHEME= undefined
##.AVERAGES= 16
##.DIGITISER RES= 18
##SPECTROMETER/DATA SYSTEM= dpx250
##.PULSE SEQUENCE= zg30
##.SOLVENT NAME= DMSO
##.SHIFT REFERENCE= (INTERNAL, DMSO, 0, 16.522)
##AUDIT TRAIL= $$ (NUMBER, WHEN, WHO, WHERE, WHAT)
$$ ##TITLE= Audit trail, XWIN-NMR		Version 3.5
$$ ##JCAMPDX= 5.01
$$ ##ORIGIN= Bruker BioSpin GmbH
$$ ##OWNER= nmr
$$ C:\u/data/dgb/nmr/ADRS/510/pdata/1/auditp.txt
$$ ##AUDIT TRAIL=  $$ (NUMBER, WHEN, WHO, WHERE, WHAT)
(   1,<2006-03-10 12:00:11.83 +000>,<MAYBRIDGE\nmr>,<NMR_250MHZ>,
      <created by zg, POWCHK disabled, PULCHK disabled
       configuration hash MD5:
       84 BC 41 DB A1 6E 1D 46 DA 25 12 A5 C1 ED C5 3A
       data hash MD5: 64K
       8B EC 83 29 F2 FA 62 36 FA 20 FB FB E9 E3 9B F6>)
(   2,<2006-03-10 12:00:23.39 +000>,<MAYBRIDGE\nmr>,<NMR_250MHZ>,
      <Start of raw data processing
       ef LB = 0.3 FT_mod = 6 PKNL = 1 SI = 32K 
       data hash MD5: 32K
       DE 7E 93 35 F4 FB C9 EB AE 45 AA E3 E6 67 CA 0E>)
(   3,<2006-03-10 12:00:25.03 +000>,<MAYBRIDGE\nmr>,<NMR_250MHZ>,
      <apk 
       data hash MD5: 32K
       2D 3C 23 66 8C 42 92 13 5E F0 0E 33 CD 4D EA CC>)
(   4,<2006-03-10 12:00:25.97 +000>,<MAYBRIDGE\nmr>,<NMR_250MHZ>,
      <abs ABSG = 5 
       data hash MD5: 32K
       DC 5D 6F 23 39 29 69 5F 5E 71 EB E0 4E 71 37 3C>)
$$ ##END=
$$ 
$$ hash MD5
$$ 1E 69 1B 35 00 E4 43 56 8A 4B 8A 27 16 1B 32 FB
##$RELAX= 
##$RELAX= 
##$RELAX= 
##$RELAX= 
##$RELAX= 
##$RELAX= 
##$RELAX= 
$$ Bruker specific parameters
$$ --------------------------
##$DU= <C:\u>
##$EXPNO= 510
##$NAME= <ADRS>
##$PROCNO= 1
##$TYPE= <nmr>
##$USER= <dgb>
##$AMP= (0..31)
100 100 100 100 100 100 100 100 100 100 100 100 100 100 100 100 100 100 
100 100 100 100 100 100 100 100 100 100 100 100 100 100 
##$AQSEQ= 0
##$AQ_mod= 3
##$AUNM= <au_zg>
##$AUTOPOS= <26 >
##$BF1= 250.13
##$BF2= 250.13
##$BF3= 250.13
##$BF4= 250.13
##$BF5= 500.13
##$BF6= 500.13
##$BF7= 500.13
##$BF8= 500.13
##$BYTORDA= 1
##$CFDGTYP= 0
##$CFRGTYP= 5
##$CHEMSTR= <none>
##$CNST= (0..31)
1 1 145 1 1 1 1 1 1 1 1 1 1 1 1 1 1 1 1 1 1 1 1 1 1 1 1 1 1 1 1 1 
##$CPDPRG= <>
##$CPDPRG1= <>
##$CPDPRG2= <>
##$CPDPRG3= <>
##$CPDPRG4= <mlev>
##$CPDPRG5= <mlev>
##$CPDPRG6= <mlev>
##$CPDPRG7= <mlev>
##$CPDPRG8= <mlev>
##$CPDPRGB= <>
##$CPDPRGT= <>
##$D= (0..31)
0 1 0 0 0 0 0 0 0 0.06 0 0 0 0 0 0 0.0002 0 0 0 0 0 0 0 0 0 0 0 0 0 0 
0 
##$DATE= 1141992011
##$DBL= (0..7)
120 120 120 120 120 120 120 120 
##$DBP= (0..7)
150 150 150 150 150 150 150 150 
##$DBP07= 0
##$DBPNAM0= <>
##$DBPNAM1= <>
##$DBPNAM2= <>
##$DBPNAM3= <>
$$ [...]
##$SUBNAM7= <"">
##$SUBNAM8= <"">
##$SUBNAM9= <"">
##$SW= 20.6930455092707
##$SWIBOX= (0..15)
0 0 3 0 0 0 0 0 0 0 0 0 0 0 0 0 
##$SW_h= 5175.983436853
##$TD= 65536
##$TD0= 1
##$TE= 294.16
##$TE2= 300
##$TE3= 300
##$TEG= 300
##$TL= (0..7)
0 120 120 120 120 120 120 120 
##$TP= (0..7)
150 150 150 150 150 150 150 150 
##$TP07= 0
##$TPNAME0= <>
##$TPNAME1= <>
##$TPNAME2= <>
##$TPNAME3= <>
##$TPNAME4= <>
##$TPNAME5= <>
##$TPNAME6= <>
##$TPNAME7= <>
##$TPOAL= (0..7)
0.5 0.5 0.5 0.5 0.5 0.5 0.5 0.5 
##$TPOFFS= (0..7)
0 0 0 0 0 0 0 0 
##$TUNHIN= 0
##$TUNHOUT= 0
##$TUNXOUT= 0
##$USERA1= <user>
##$USERA2= <user>
##$USERA3= <user>
##$USERA4= <user>
##$USERA5= <user>
##$V9= 5
##$VALIST= <valist>
##$VCLIST= <CCCCCCCCCCCCCCC>
##$VD= 0
##$VDLIST= <DDDDDDDDDDDDDDD>
##$VPLIST= <PPPPPPPPPPPPPPP>
##$VTLIST= <TTTTTTTTTTTTTTT>
##$WBST= 1024
##$WBSW= 4
##$XGAIN= (0..3)
0 0 0 0 
##$XL= 0
##$YL= 0
##$YMAX_a= 558334
##$YMIN_a= -505904
##$ZGOPTNS= <>
##$ZL1= 120
##$ZL2= 120
##$ZL3= 120
##$ZL4= 120
##$ABSF1= 16.522
##$ABSF2= -4.171173
##$ABSG= 5
##$ABSL= 3
##$ALPHA= 0
##$AQORDER= 0
##$ASSFAC= 0
##$ASSFACI= 0
##$ASSFACX= 0
##$ASSWID= 0
##$AUNMP= <proc_1d>
##$AZFE= 0.1
##$AZFW= 0.1
##$BCFW= 0
##$BC_mod= 0
##$BYTORDP= 0
##$COROFFS= 0
##$CY= 12.5
##$DATMOD= 1
##$DC= 0
##$DFILT= <>
##$DTYPP= 0
##$F1P= 14.0000005364418
##$F2P= -0.99999901652339
##$FCOR= 0.5
##$FTSIZE= 32768
##$FT_mod= 6
##$GAMMA= 0
##$GB= 0
##$INTBC= 1
##$INTSCL= 1
##$ISEN= 128
##$LB= 0.3
##$LEV0= 0
##$LPBIN= 0
##$MAXI= 10000
##$MC2= 0
##$MEAN= 0
##$ME_mod= 0
##$MI= 0
##$NCOEF= 0
##$NC_proc= -2
##$NLEV= 6
##$NOISF1= 0
##$NOISF2= 0
##$NSP= 0
##$NTH_PI= 0
##$NZP= 0
##$OFFSET= 16.522
##$PC= 1
##$PHC0= 165.4367
##$PHC1= 8.492143
##$PH_mod= 1
##$PKNL= yes
##$PPARMOD= 0
##$PSCAL= 4
##$PSIGN= 0
##$REVERSE= no
##$SF= 250.13
##$SI= 32768
##$SIGF1= 0
##$SIGF2= 0
##$SINO= 400
##$SIOLD= 32768
##$SREGLST= <1H.DMSO>
##$SSB= 0
##$STSI= 32768
##$STSR= 0
##$SW_p= 5175.98343685301
##$SYMM= 0
##$S_DEV= 0
##$TDeff= 65536
##$TDoff= 0
##$TI= <Analysis number 999999
Compound Code 99
Book Reference 9
Project Code 9>
##$TILT= no
##$TM1= 0
##$TM2= 0
##$TOPLEV= 0
##$USERP1= <user>
##$USERP2= <user>
##$USERP3= <user>
##$USERP4= <user>
##$USERP5= <user>
##$WDW= 1
##$XDIM= 32768
##$YMAX_p= 326191106
##$YMIN_p= -505085
$$ End of Bruker specific parameters
$$ ---------------------------------
##NTUPLES= NMR SPECTRUM
##VAR_NAME=  FREQUENCY,     SPECTRUM/REAL,   SPECTRUM/IMAG
##SYMBOL=    X,             R,               I
##VAR_TYPE=  INDEPENDENT,   DEPENDENT,       DEPENDENT
##VAR_FORM=  AFFN,          ASDF,            ASDF
##VAR_DIM=   32768,         32768,           32768
##UNITS=     HZ,            ARBITRARY UNITS, ARBITRARY UNITS
##FACTOR=    0.157963299565203, 1,           1
##FIRST=     4132.6476996994, 0,             0
##LAST=      -1043.33573715361, 0,           0
##MIN=       -1043.33573715361, -505085,     0
##MAX=       4132.6476996994, 326191106,     0
$$ Real data points
##PAGE= N=1
##DATA TABLE= (X++(R..R)), XYDATA
$$ [...]
19161d1290J4661K6934J6474p655k0612J4023J2704m17j4811o552K6186r782j9761
19148i898j40j8706Q39J5472k79J5055o00O753r023Q88M355j951K517o810J689
19133A61K2809J770k1586N53J0736P739R795J1241k73j0023O739j4924l6586j0039
19119b1888J834R362K6107P533j1558n208j6176k326J1556R023o634K634m187
19106G2J162K4776k722j6130j7401o655J692Q070J2993m456J2018P202J4473M180
19092C9274l071r957q525L840j4942l1471j5848j689R816j436K2212J8483j5987
19079i301j7138J202M746j2534j777J7454k758P725J2870M027j6292j5923K1222
19066f477Q369q337r206j7790n138K0284J3763R969q423j7171O274l003M507l58
$$ y = [-41290, -26629, 305, 16779, 9124, -11488, 2535, 15239, 14822, 11, -6541, 19645, 9863, -9898, -10038, -28744, -27905, -12433, -12712, 2343, 1743, 8496, -527, 361, 4716, 2765, 5282, -1528, 161, 22970, 24740, 3154, 3707, 14443, 22182, 31977, 43218, 42945, 32922, 39661, 24737, -11849, -21888, -20054, -10692, 15415, 22948, 11390, 6182, -9994, -12320, -764, 8259, 1625, 4259, 72, 1234, 26010, 23288, 7158, -10243, -16898, -15206, -7136, 5857, 1401, 13419, 20621, 35094, 39274, 36203, 26246, 17721, 21561, 6619, -24852, -40700, -42389, -32573, -34009, -11797, 6686, -9301, -26439, -25237, -20491, -33025, -34802, -17348, -20106, -12381, 489, 4516, -11776, -27699, -6477, 1892, -6445, -15651, -33441, -38579, -18295, -4532, 5437, -2986, -20157, -13883, -16886, -12379, -12737]
19052a2737K1383M748K378j4012j1350M686l643j9190L748J1497J4635M190J9584
19039B5917J778j1242k3990j7462K0330J0012j5896P475J0562J3333m794j2243
19027C780j3814j141K2614j0694k0337p147O242J408J812l321m585O294K342Q102
19013h445K4145r19j977r875j0319j3519J1647K4400K5483m991p354j4486o50
19000A3140J254P924N714N10j4406j083K8633r892k6127l3245o733O677j7888
18987d5522J897K9103P100R857J5822P753J0959j158p898J10j2231l953L569J3323
18973B8731p061j2441L818J3191m152k2892m124n66r455j965m072K8842J9211
18960B7065Q396k60L971k8312n330j032K529J404j5266R709R385j0131L913N27
$$ y = [-12737, 8646, 13394, 15772, 1760, -9590, -4904, -8547, -27737, -23989, -12492, 2143, 6333, 25917, 27695, 16453, -7537, -24999, -4669, 5343, -10553, -3078, 7484, 20817, 16023, 3780, -10034, -11175, 11439, 745, -19592, -26739, -20497, -19089, -17277, -20598, -25183, -18889, -16547, -8445, 15700, 14781, 12804, 2929, -7390, -20909, -9262, 15138, 40621, 35630, 28276, 13790, 13140, 14394, 22318, 28032, 28542, 14136, 13053, 41686, 31794, 5667, -27578, -34311, -27634, -45522, -43625, -14522, -7422, 2435, 18257, 26010, 36969, 35811, 27913, 28023, 15792, 11839, 15408, 28731, 21670, 9229, 13047, 26238, 22086, -806, -4930, -5496, -14951, -16916, -20988, 7854, 27065, 35461, 35201, 39172, 10860, 5530, 4498, 7027, 8431, -6835, 2874, 12259, 2128, 6041, 6568]
18946F568j542L207j8285q563l306R922J0223j7465P176J015N956O407K4443j5224
18932A0532J3246K062o879j0063L44j8919j3365J2166j0940k8354J0741J9319
18920b0110N608Q169r829j1111l690k5685J0358L4346m320P376J960j893J0482
18907A661k543j088k090j0392k2115j3104m795J1376J3789J0806M058J753L240
18894i444n502O492J4156j3767j9170Q754N181K4570J6538j1942M926p948k1050
18881h206r047L15J2217m973j0083j2000L354M600K647O602l30k880m356j3421
18867c5561R665O283J3924K3518p747Q78M122j3818r917j592n780j7021j2447
18854d5493n045M03J4765J9439P705p383R872O344J550K0416k704j2214k339k8769
$$ y = [6568, 5026, 8233, -10052, -18615, -21921, -11999, -1776, -19241, -12065, -11050, -5094, 1313, 25756, 10532, 23778, 25840, 18961, 8898, 9242, -9677, -23042, -10876, -21816, -50170, -39429, -20110, -14502, -6333, -16162, -27273, -30963, -56648, -46290, -11944, -16264, -8888, -6928, -8821, 1661, -882, -1970, -4060, -14452, -36567, -49671, -54466, -43090, -29301, -18495, -14437, -12684, -9444, -14946, -8454, 5702, -8065, -27235, -18481, -13300, 11270, 27808, 15866, 20792, 12844, -8206, -17253, -16938, -4721, -9694, -19777, -31777, -28423, -23823, -21176, -14574, -14904, -17784, -22140, -35561, -25896, -19613, -5689, 17829, 10082, 10960, 15082, 1264, -8653, -10245, -16025, -33046, -45493, -50538, -50135, -35370, -15931, -8226, -15609, -5737, 607, 2157, 22573, 19869, 7655, 5316, -23453]
18840b3453j6742j6381k3649q543K3610J7904O829K0564m748J6556P404k514l772
18827f935K3389j893K045j1741j3468K607k232l483o907K1820P596L621k0906
18814f487q907J4253J9315r13q592j1050l223j9171l564q100N975K790n283K577
18800c0380P347P195J047j9271k406M806j7110k4311Q280K5957K0633j355R157
18787a0411J4665J9546j0203k0547j6954K4691q356N824J3140L1489r131k5840
18775G913L08L871J5O800P426J0456j5592J1469O044r621j5027o039P912p416
18761H519j9550Q410Q646p65K68j8077K29J7960M66r902j8252J4001j1390j4470
18747c3907K0873L0371O354k7180N832O515j4879N559K4655n451k0021M266j225
$$ y = [-23453, -40195, -56576, -80225, -88768, -65158, -47254, -40425, -19861, -24609, -8053, -649, -3163, -6935, 16454, 14561, 16606, 4865, -8603, -5996, -8228, -11711, -18618, 3202, 10798, 14419, -6487, -15394, -1141, 18174, 17261, 8669, -2381, -5604, -24775, -28339, -36439, -30464, -27674, -32957, -30380, -23033, -15838, -14791, -34062, -36468, -31662, -48772, -73083, -64803, -38846, -18213, -19568, -10411, 4254, 23800, 13597, -6950, -23904, 787, -7569, -1745, 11395, 42884, 33753, 7913, 8221, 12092, 12107, 18907, 26333, 36789, 21197, 32666, 38710, 29089, 14062, 8023, 15935, 8519, -11031, -2621, 6025, 5260, 5528, -12549, -12320, 5640, 6106, -3796, -22048, -8047, -19437, -33907, -13034, 17337, 23691, -3489, 2343, 8858, -6021, -462, 24193, 18742, -1279, 2987, 1762]
18734A762O148L413j4898j3191j6716k110P745J1935K487J4358L683R620k760
18721A1476j7513j6111L957J2104J2587P904j069j6203j5202Q89K1446J4848K537
18708B1650q430j1212k305J2692J4729j819l214j4596J2003j5801l323N390k9
18695E735J0113j6187r610O74J621O509J437J3364L749j7396r226q143O554J2633
18681A827K0220j0992j4282j0r421O993O482j6382L982J219L997K850q721q611
18667b0849Q312j097j1879J152l348j4535N130K4884J2875M390N976j0826p295
18654g110j1370k4539l377J464K599J2603J3332Q105K6818n31m88l837N264P421
18640B6354j38R90l680j4380k768j3042p890L987L396K869J869J4056o70n298
$$ y = [1762, 7910, 11323, -3575, -16766, -33482, -35592, -27847, -15912, -13425, 933, 4616, 14236, 11476, -6037, -22148, -18191, -6087, 6500, 14404, 13335, -2868, -18070, -17181, 4265, 19113, 21650, 13220, 2008, -297, 12395, 27124, 25305, 22091, 7495, 19498, 3697, 374, 5764, 5735, 15848, -339, -9949, -9275, -7654, -1145, 292, 13656, 17405, 9, -9217, -17360, -10806, 1827, 22047, 11055, -3227, -3237, -12658, -5665, 817, -15565, -11583, -10364, -6367, -3517, -12238, -20849, -12537, -13634, -25513, -24361, -27709, -42244, -37114, -12230, 645, 5035, 11011, 185, -7110, -18480, -43019, -46396, -44932, -42333, -29730, -16398, -8293, 18525, 17994, 17506, 13669, 18933, 26354, 26216, 27206, 23526, 9146, 6378, -6664, -14554, -10567, -7171, -4302, -2433, 11623, 10953, 5655]
18626E655N332k180k287k105p477n957R275k878k5997n330J7756J1544J4837J8984
18612B9172k1515l3300O16K0199K0134j5361l0838p20R512N457j330r554J469
18599b6059J8349n888k4660N221J5361m286Q895O97k417p216l171J9891J6820
18586A1537k0577L160J3263o488o244j9131o193K4442J0072M71O544O031O451
18573B3338N123q062r973M608r955K397N217q755K302N074j1355j0801R974J5034
18559A4166j4618k4160M321K9508k100q876p083J3057J2526L428j2235R4j3835
18546e807p198Q843K1931j4225l0691k866K179R127J4947m602N842J0301k412
18533E369Q161J1021n359m123P199j0663j514J732j4377l255N50j905K0276J0169
$$ y = [5655, 10987, 8807, 6520, 4415, -3062, -9019, 256, -2622, -28619, -33949, -16193, -4649, 10188, 29172, 7657, -25643, -25027, -4828, 15306, -55, -30893, -31613, -22101, -16644, -17974, -27528, -26059, -7710, -13598, -38258, -33037, -17676, -21962, -13067, -12370, -14787, -22003, -25174, -5283, 11537, -9040, -5880, 7383, 895, -5349, -24480, -30673, -6231, 3841, 4312, 10856, 16887, 23338, 28461, 20399, 10426, 15034, 5079, 7476, 12693, 3938, 6240, 11314, -41, -10842, -868, 14166, -452, -24612, -20291, 9217, 7117, -1759, -8842, 4215, 16741, 20169, 7934, 8028, -5807, -13005, -4162, 17769, 3544, -27147, -30013, -27834, -18707, -3760, -8362, -2520, 7781, 5369, 13530, 24551, 19192, 15069, 22268, 11605, 10091, 11823, -2554, -5809, -5259, -7164, 13112, 23281]
18519B3281j0857J030m601J1131N888N98P576J926p534L46j7135p452k517K2587
18505B4267J0113k0733j2206j4863J748K3178K1510J622k1687j7323J4525K548
18493A2699j9963k0289J2485N808J115j2920P436K5145K4616r168j0205k4167
18481g408j194J0630l29J2185K237k6113q030K2669O193m837k501m864m937N102
18467a197P399n871J797R861j1042j3113m778P138J1691l505P168P540K488k605
18453A2971k0109j4799j3021j8426P673J0719j936M217q111q223J7926K4711P206
18440G98Q658m905j9786j3657P637k0775N460l430J6293R319L101J8287l1660
18427b4660j0256m181j2995K5339j97j4176P618J4998r67L853J9671p784n999
$$ y = [23281, 12424, 13454, 8853, 19984, 25872, 26470, 34046, 35972, 28438, 28784, 11649, 4197, 1680, 24267, 34380, 13647, 1441, -13422, -11674, 11504, 33014, 34636, 12949, -4374, 10151, 12699, -7264, -27553, -15068, -9260, -8145, -21065, -13629, 11516, 36132, 26964, 16759, -7408, -8602, 2028, 1699, 13884, 16121, -9992, -18022, 4647, 10840, 6003, 3502, -1362, -6299, -1197, 6202, 331, 2128, 11989, 947, -12166, -16944, -9806, 1885, -1620, 5548, 13088, 15576, 12971, -7138, -21937, -34958, -53384, -45711, -34992, -36928, -32711, -40822, -49045, -31119, -6408, 798, 9456, 4551, -15235, -28892, -21255, -42030, -36570, -40000, -23707, -14388, -11287, 7000, -24660, -34916, -39097, -52092, -26753, -26950, -41126, -33508, -18510, -19477, -15624, 4047, -3737, -9736]
18414i736n787J4780J153m989J2866K265R851J2634j1459k1274k3911O451L0663
18401A3507K9702o441j3730j7419j790j77j984J581M821k0971k4237qK1176P987
18387g983Q604L217O51P236j8851O255J6472j6483k3616k513J7136m200k299p18
18373a7092j5832J2538R238K5225O033k760k6477n750J2327J6007K108k3046o770
18360a4251j9374j617K5586K204n263M966J3883j452j2211k35J3139Q812p156
18347G031J1768J924l0819l3085o710N007K5185J3102P881R724L214J732j926
18334A4028O672N054N546j3747l0281j503L800k363q334J6632J328j0568J3440
18321b96O978j963m852N901J6881N119j2705L752l988k7400j4421P281m180j5992
$$ y = [-9736, -15523, -743, 410, -4579, 8287, 10552, 20403, 33037, 21578, 304, -23607, -17156, 13507, 43209, 36768, 23038, 5619, 3829, 3652, 1668, 3249, 8070, -12901, -37138, -37146, -15970, -7983, 621, 3838, 4489, 11725, -7126, -871, 15601, -882, -24498, -27011, -9875, -14075, -16374, -17092, -32924, -20386, -11148, 14077, 20110, 17350, -9127, -14877, -2550, 13457, 15565, -7481, -14251, -33625, -35242, -9656, -7452, -12715, -7749, 6134, 4682, -7529, -7764, 5375, 14187, 7031, 18799, 20723, -10096, -43181, -49891, -44884, -19699, -6597, 1284, 11008, 14222, 15954, 14028, 20700, 25754, 31300, 17553, -12728, -14231, -10431, -12794, -21128, -4496, -3168, -13736, -296, 6682, 4719, -133, 5768, 22649, 27768, 15063, 18815, 14827, -12573, -26994, -19713, -23893, -39885]
18307c9885R612K0617J2432r418j3180J1288j4825J5475J9346k0360j1293j8309
18295c8500r541o063O221K4178J9388K1109J6057k0766l0759J707j3173J528K5417
18282c197J4541J3676L922q286M449j6314k4642L667L856o026N407P280J4901
18269A3234J4237n127r321Q772m002j6899o647O733J2187p865o499K7869L741
18256C0413k3381j4470N293J7137P457r418j9206j1731m142R411n89Q777j2223
18243a6672k94j164n272K5769K0319J1130P157r305r070p544n263j4694J1776
18230F873j580j0891R230O25j9389P1J5277k8398k2247q18J3996R573K273K482
18216b2923J9076Q51N5J3899J4070o505j8989J2288R235n871J916q525k0512o788
$$ y = [-39885, -30273, -9656, 2776, -6642, -19822, -8534, -23359, -7884, 11462, -8898, -20191, -38500, -48041, -54104, -47883, -23705, -4317, 16792, 32849, 12083, -18676, -16969, -30142, -28614, -3197, 11344, 25020, 28942, 20656, 25105, 8791, -15851, -12184, -8328, -14354, -8947, -1667, 13234, 27471, 22344, 13023, 21795, 17793, 894, -5753, 980, 13167, 5302, -1197, 26672, 30413, 7032, -7438, -2145, 14992, 22449, 13031, -6175, -17906, -22048, -12637, -13226, -4449, -16672, -16966, -18130, -23402, 2367, 22686, 33816, 40973, 31668, 22598, 15054, 9791, -4903, 6873, 5293, -5598, 3632, 4257, -15132, -15061, 216, -28182, -50429, -51247, -37251, -27678, -25405, -22923, -3847, -2996, -2941, 10958, 25028, 18523, -466, 11822, 21057, 15186, 17102, 8577, -11935, -18723]
18202a8723K677k740J8960L5385J3882k8903J2408N712k1206j5231M325j8980
18190a2434r192Q88M681J1152o380r56J7404P526o620o46Q472j966p546j40N685
18175I928l76O998L596o10j0042j689j1734K775J9280r523j4042K4057k884j1630
18161D104r561k2991p665N542J9546P191j553j1061J5545N673k3737J0135J8869
18148A0037j6250j1079R197J1255O662j5381k1466J242R608j0815R620J7685J8291
18135A8606j2405N602P663M325n62O022J452l3398k847K3890J3363J1985M288
18122D7984n878J1591j4564j3840J8399L083Q895K2678k0819l0278k0824k9849
18110b3422P973K7686J7448j653k1964n045N092j7582K1993J9867M260J1266j2492
$$ y = [-18723, -16046, -18786, 174, 35559, 49441, 20538, 32946, 38658, 17452, 2221, 6546, -12434, -21626, -20738, -16057, -4905, -11285, -12241, 5163, 12689, 6069, 5423, 13895, 11929, 4383, 4243, 9928, 9552, 16550, 20146, 19536, 9494, 7805, -3929, -1154, 18126, 8603, -5439, 18618, 15734, 4104, -5457, -28448, -36113, -30571, -11025, -3834, -5387, -16448, -903, 4770, -18967, -8832, 10037, -6213, -17292, -8095, 3160, 9822, -5559, -27025, -25783, -16175, -26990, -17370, 315, 18606, 6201, 11803, 19466, 23791, 23229, 29251, 30703, -2695, -5542, 18348, 31711, 43696, 47984, 42106, 53697, 39133, 25293, 43692, 46775, 55670, 78348, 57529, 27251, 6427, -23422, -15449, 12237, 29685, 28032, 6068, 1023, 6115, -11467, 10526, 30393, 34653, 45919, 33427]
18097C3427j1028l802r344n961J2935R606J0028j7502j7379R478n868R108n684
18084H014l608O911J3213l452K000M058k192j3945m268k4L202j2394J1886r945
18070e44j657J3331J3521R248j0896j1072m964k009P586L245m750k0957l190j0318
18056b3426R623J3177m152J4284j7245k789J4525M353L190K125q642J0007j1790
18043C240j4258Q763n311J3440K511p174r191Q325P510r704K826o270mR583L93
18028D679J635J1262N014J2603l624j6207k4832P285j2911J0816r381n924J4151
18015e434L051Q81R059j907M331R270K242K2063r905r513j0197n472k449J0922
18001A6942j3988j4867J291O442J0426J087p077m396j5222O050J221O856J809
$$ y = [33427, 22399, 18597, 9253, 3292, 16227, 25833, 35861, 18359, 980, 10458, 4590, 13698, 8014, 4406, 11317, 24530, 21078, 23078, 27136, 24944, 10999, 6731, 6707, 9909, -2485, 9401, -544, -2201, 11130, 24651, 33899, 23003, 11931, 6967, 4958, 12544, 15789, 11039, -9918, -13108, -23426, -13803, -626, -4778, 9506, -7739, -10528, 3997, 8350, 11540, 13665, 5023, 15030, 3240, -11018, -2255, -7566, 5874, 8385, 1211, -7980, 345, 7855, -1849, 977, -5293, -5297, 4286, 4679, 6314, 17576, 22590, 35193, 31569, 15362, -9470, -2185, -15096, -4280, -13661, -19585, -5434, -2383, -1502, 7557, 5650, 9981, 19251, 21493, 43556, 33651, 24138, 13941, 8469, 6020, 16942, 2954, -11913, -10622, -4180, 6246, 7333, 256, -4140, -19362, -13312, -12091, -5235, -3426]
17988c426J1640J0522K4983P795k417k6628j4496j9569j5865Q812L2661P724l726
17975A8010n224j2378l675N912j8945K4023K6065N994p831k4816k6077M470Q870
17962e602J9462M265k3816l999j5580J378L781R790n333o807O560J8160p326K249
17948b818J7492J1883L180j2198j6510k4775k390K342K28J310L110k676J6892
17935d930j208q31M226j5288j7243j549J0548R309r412n588j4072J493L008M054
17921c7483J716J5038p10j0863J2250j1637k0073N746p17RK1809P101j7279J2477
17907b2616N83q04N47J1790N891L599M0K376j2672p330J679K2774Q396p345P575
17892A4483J5919m915o187j3601m521J854M741j163r241q819K627Q861j447k524
$$ y = [-3426, 8214, 18736, 43719, 51514, 49097, 22469, 7973, -11596, -27461, -18649, 14012, 21736, 18010, 12786, 408, -3267, 2645, -16300, 7723, 33788, 39782, 31951, 7135, -18942, -14472, -5602, 13860, 18125, -5691, -9690, -25270, -23892, -20111, -10321, -15654, -22461, -15901, 2259, -5067, -2818, 14674, 26557, 29737, 17539, 1029, -23746, -26136, -23794, -23566, -22256, -19146, -21822, -4930, -6138, -6969, -2743, -18031, -35274, -36823, -26275, -16966, -26378, -31966, -46038, -44545, -41537, -37483, -35767, -20729, -21439, -32302, -20052, -31689, -51762, -46016, -46733, -46724, -24915, -17814, -35093, -22616, -22033, -22837, -22290, -10500, -4609, -1010, -970, 1406, -11266, -18596, -16917, 5857, 14253, 6908, 14483, 30402, 25487, 19300, 5699, 1178, 3032, 7773, 6610, -2631, -11450, -8823, 38, -1409, -3933]
17878c933j4492l357k898Q446Q933j0879j4593J6305J3604k2415q988o291L998
17865c6560L2909R491Q486J1331q99K595J7663j2441k6792r454r184J785q255
17852a9325n726J1111J3325l109p401N188J3739J3835j4865Q943N64q55k5031
17839i607k2599l212J7066k752p566p470j309J8639K2888K4715K315l221R467
17826C7354m780m192P283K5856L644k7475l6077K94r071l888J1910K4567N663
17813C1088p783M508l312k5613J332J1303O672J7843J6151j6961k3815M84j6734
17800d837j0303R303J6913J2194Q011L211q646k0414N759k0658O401J7879K4048
17787C8861L13m972K166j0779k6450k4568J4279J4969J5580n48r073R062J5010
$$ y = [-3933, -18425, -21782, -24680, -16234, -7301, -18180, -32773, -16468, -2864, -25279, -34267, -40558, -36560, -3651, 5840, 14326, 25657, 24758, 27353, 45016, 32575, 5783, -3671, -12855, -11070, -19325, -25051, -13940, -615, -3724, -11125, -5937, 7802, 21637, 6772, 15715, 16279, 15424, -9607, -32206, -35418, -18352, -21104, -28670, -36140, -37449, -18810, 4078, 28793, 31108, 27887, 37354, 32574, 28382, 35665, 61521, 65165, 37690, 1613, 1907, -7164, -11052, 858, 25425, 31088, 23305, 27813, 24501, -1112, 220, 11523, 18195, 36038, 52189, 35228, 11413, 11897, -4837, -15140, -5837, 11076, 23270, 31281, 34492, 25846, 5432, 11191, -9467, -3066, 14813, 38861, 39174, 34202, 36368, 25589, -861, -25429, -11150, 3819, 19399, 18851, 9778, 18840, 33850]
17774C3850j3197j629k3043J2022J2412n20k3603P589j2464j5230J4212l5l376
17761a3012j4481l786K104K534j3277J2047K2104J1126Q20p055K5762M615K572
17748C2073k0070n008p125o379j1441O90m999Q243j390j592q656p617K2745K2472
17734A1946K830J1409l519j8201q296J7304L015j8263l4414L431o150r89K66J1672
17720b7959l232K2947O483p242j2671O244R470j4773k933r254j4614j8030K5139
17707d0425J9271J6208L0861j1121j0055k2478m631J3423J3607L703j4064j1983
17695a7684N187J3610L050K466j3337r736j4609m385J2351L13J286J5175p383
17682a3696K5633K850J483l847j1825K517l095M675Q94K08j2814k522K398m294
$$ y = [33850, 20653, 19024, -4019, 8003, 20415, 19895, -3708, 3881, -8583, -23813, -9601, -9636, -13012, -27493, -31279, -29175, -26641, -39918, -27871, -5767, 5359, 6179, -876, 24886, 29501, 32073, 12003, 6995, -130, -6509, -17950, -17260, -22259, -14016, -15406, -16998, -25654, -33271, -10526, 11946, 14776, 26185, 22666, 4465, -3831, 13473, 16488, -1775, -36189, -32758, -38908, -39897, -39631, -27959, -31191, -8244, -1761, -9003, -21674, -15430, -5960, -20733, -23666, -32920, -47534, -65564, -40425, -21154, -4946, 25915, 14794, 4739, -17739, -22370, -8947, 4660, 8363, -5701, -17684, -12497, 1113, 4163, 6629, -6708, -16444, -31053, -35438, -23087, -22774, -21488, -6313, -13696, 11937, 14787, 16270, 12423, 598, 3115, 20, 4695, 5589, 5797, -7017, -9539, -7141, -11435]
17668a1435j0967n960J1112R516k1441k815K2210J7704q155n061r894R635m700
17655a0251j2444k2436Q419K5206J2722r524J1799L3679m230j1462J102o075m666
17642A1839j19n54q578j3130n359n311k2944O253J9040j6533J2476J3782P938
17629a200J1653J2091J5090k9361P78P637k407J4841j3291k2418J3834J6186j75
17616B3258r726j6708j7435K847p253L781J2894j4306o249K42K2571J8336L766
17603A6018k1690N454K795M778k914p757j9831J127L4867M0094O53j5740j2797
17590B5057k1802j041J2624j0246K522r142K835j30n2J028q328J2791J4024j0345
17576I795O753R54o122j6865p658k1352j614K1368J721K1775j4365m677k995O270
$$ y = [-11435, -22402, -28362, -17250, -7734, -29175, -31990, -9780, 7924, -231, -5292, -15186, -5551, -10251, -22695, -45131, -36712, -11506, 1216, -8308, 3491, 37170, 32940, 21478, 22580, 16505, 11839, 11720, 11166, 2588, -10542, -15901, -21212, -44156, -37903, -18863, -35396, -22920, -9138, -1200, 10453, 22544, 37634, 8273, 9051, 16688, 14281, 29122, 15831, -6587, 7247, 23433, 23258, 13532, -3176, -20611, -17764, -25017, -21236, -8342, -22648, -28897, -28655, -6084, 12252, 16018, -5672, -218, 2577, 7355, 4441, -3316, -23147, -22020, 12847, 52941, 53594, 37854, 25057, 3255, 2214, 14838, 4592, 7114, -2028, 807, 677, 625, 1653, -6675, 6116, 20140, 9795, 16548, 17502, 11380, -5485, -13143, -34495, -36109, -14741, -13020, 8755, -5610, -10287, -13282, -7012]
17562g012J9059K1349K979q359l0008l0385J8853K7637k358j641j0115L943J1257
17549A5199K1401j9762k6430j5575J332R60J3818N13k21K5116L820k824n346j8539
17535f538O39M669Q366p718J1447J4404k3722q295P120J6883r142j0423O436J0132
17521A4258j9041j8580P11K2265J6422R693j4551r469J6241n921l662n978M513
17508F901r354J9907N882j4923m969J708J1546L707n513J355j219j779j3974Q140
17494G415N287N57l82j2701K507O223O932j4199j3788r679j9053l18P867J9845
17480a3487K5270k2309o825J6012k293N389K1709K2114j0905K296P93j1260j0444
17467A6060R570q586k8029r586O378J9540J3570J7057n087m973l736j5551j0033
$$ y = [-7012, 12047, 33396, 36375, 28016, -1992, -32377, -13524, 14113, 11755, 10114, -1, 3942, 15199, 36600, 16838, -9592, -25167, -23835, -22875, -9057, -8544, -8765, 16351, 20171, 17347, 12001, -6538, -5899, -1230, 7136, -582, 10865, 25269, 1547, -6748, 372, 17255, 8113, -2310, 4126, 14258, -4783, -23363, -22652, -387, 16035, 25728, 11177, 1708, 17949, 12028, 8366, 2388, 6901, -2453, 17454, 23336, 8413, 3444, 5152, 16698, 20405, 14892, 16247, 15028, 13249, -725, 7415, 12702, 13259, 12877, 176, 2683, 8906, 15838, 1639, -12149, -21828, -40881, -41199, -33332, -13487, 11783, -10526, -17351, -1339, -3632, 1757, 23466, 45580, 34675, 36971, 37764, 26504, 16060, 25630, 17044, -10985, -20571, -14193, 5347, 18917, 35974, 30887, 25914, 22178, 6627, -3406]
17454c406o355o592l410Q498J602J1134R342r5O41k2439k005j0100l234K5310
17440a109O832m580L293n018j1304O313n933m731j1824q550N502Q730M175k696
17426b0900n950j950j000L7938O099j2820j2897j2209p515R023J4785J1403P263
17413A1270N11J8780j2279k0066o96L1314o798k0152o502K386r772L670k1789
17400c0123R860R608p139l679J3262N973R917p056J348r343k310j1403J1225K091
17386g769J617J5386J1209M399j0845j9396j383N544R923r907j2786J7034m69
17373B557o103J0952K6928O31j1271K164L746J6825O963p979q359j8113J100o342
17359A3699R798k422J4483j240j4857q809j7134l0759R123R970K165N645p644
$$ y = [-3406, -9761, -16353, -19763, -11265, -9663, 1471, 10813, 10718, 11359, -11080, -13085, -23185, -26419, -1109, 5723, 1143, 4436, -582, -11886, -5573, -11506, -16237, -28061, -36611, -31109, -22379, -18204, -20900, -26850, -28800, -29800, 8138, 14237, 1417, -11480, -23689, -31204, -22181, -7396, 4007, 11270, 11781, 30561, 18282, -1784, -2480, 28834, 22036, 1884, -4618, -2232, -12004, -8334, -30123, -20263, -10655, -17794, -21473, -8211, -2238, 7679, 623, 1971, -7372, -9682, -21085, -9860, -7769, -6152, 9234, 20443, 24842, 13997, -5399, -6782, -1238, 8685, -1222, -14008, 3026, 2557, -3546, 7406, 34334, 34965, 23694, 25858, 29604, 46429, 53392, 45413, 37054, 18941, 20041, 13699, 23497, 21075, 35558, 34318, 19461, 10652, -6482, -37241, -28118, -18148, -15983, -10338, -17982]
17346a7982J5825J2187l640j1247j3439r054O110J0894j5518P264J9069j1215
17334a0746n162J6854n176L175j789m758j1459N773J4298K0367R258j0077j0983
17321I575j6784k9891M41K655L5704L1637r965r663M31j671K583n566K635l821
17307H300J503j0832p699j3533j5252l221J3724L627j7678J883q743J8048j2383
17294d2256m188J5872K9496n476J1784k040r264J41J2743j3764P919j980k587
17281c600p972j062o885O395J8519j108O385Q37K1314J1134j7133k5203l520p821
17267i720l47P683J6361l0292q827J2858k1081j1660n744K4954K3152P898m446
17254G89n952m440K625k3014N842L229m218O869J5395n741k50j236O08r44l724
$$ y = [-17982, -2157, 10030, 6390, -4857, -18296, -27350, -21240, -10346, -25864, -18600, 469, -10746, -15908, 946, -4230, -1055, -2844, -7602, -19061, -13288, 1010, 21377, 30635, 20558, 9575, -7209, -37100, -36659, -34004, 1700, 33337, 23372, 13709, 14140, 12469, 15052, 9486, 12121, 8300, 9803, -1029, -8728, -22261, -37513, -40734, -27010, -23383, -41061, -39178, -47921, -29873, -42256, -46444, -30572, -1076, -6552, 5232, 3192, -6072, -5931, 6812, -6952, 967, -1013, -3600, -11572, -12634, -19519, -13124, 5395, 4287, 10672, 11509, 32823, 43957, 26824, 1621, -1899, -9720, -10067, -2384, 13977, -16315, -25142, -12284, -33365, -45025, -50769, -25815, -2663, 5235, 789, -5163, -9603, -6978, -29992, -24150, -20921, -25139, -18270, -2875, -8616, -8866, -10102, -9494, -10438, -14162]
17239a4162N013O762K4258P434n671j1473J528k1060K445J486j5546O464l189
17226a5711J781Q693O417M883R062j4245j7731J3675K5305j3206k995M019m940
17213E007k9041q939l744K1155K5532J8023j3776j3017J0293J390j512K845k4280
17200a0064J1771J7142J2237j460j025j0244j9985j0198o511m873k9852J1723
17188d1339K0195j0415P911J5591j6260j6155J0870O075N572n649q297J7526Q575
17175e800J1862j674k1734k2010m395n576K8389J3931j7001L077J5940q633k3875
17162c7499K0353K678l4364N224J9981J1976k902J3218O226o402o035j266Q7L014
17148e711j6434j0796N672l271O324O973L416K0618k980Q250j0676J0718N57J91
$$ y = [-14162, -9149, -2387, 21871, 29305, 23634, 12161, 13689, -7371, -4926, -3440, -18986, -12522, -15711, -13930, -5237, 1180, 6063, 15125, 880, -16851, -3176, 22129, 8923, 5928, 9947, 5007, -24034, -32973, -36717, -15562, 9970, 27993, 14217, 1200, 11493, 12883, 11371, 14216, -10064, 1707, 18849, 31086, 29626, 28601, 18357, -1628, -11826, -18337, -23210, -53062, -41339, -21144, -31559, -23648, -8057, -24317, -40472, -29602, -23527, -17955, -23604, -31901, -14375, -5800, 6062, 4388, -17346, -39356, -43751, -49327, -20938, -7007, -24008, -20931, -4991, -13624, -37499, -17146, -14468, -48832, -43608, -23627, -11651, -14553, -1335, 4891, -1511, -7546, -8812, -8725, -5711, -22145, -32941, -27269, -30540, -24216, -17243, -13827, 6791, 3811, 12061, 1385, 12103, 12660, 12851]
17134A2851R914M583m221J1074k792k0949j975J3145J3637j6939j3527P476J421
17121A3698j9282m0575q077L172M4061L2543k1431l5512L861L8444J5096j183
17109B4815m957j4477Q777K787K3344M89k9647j4360R696k398P203j4139j8769
17096b1636K990R540J1814K064l493N243L029J4667j1623j5977q83J5865L852
17083A5452k762Q488K0377O078k8249M962L3034l6805l3483J438J1531J2157p590
17070D628J2110p073J0171M364j0208M080K5740J141M986p336M19n717J1626l481
17056D5450M719j2277k6561K6757J5743p496N859K2366J9659J8012J3331K5670
17044A51232P4602P4801J23927J72736K17205L02978L95249M59929K87330J50289
$$ y = [12851, 22765, 27348, 23127, 34201, 31409, 10460, 8485, 21630, 35267, 18328, 4801, 12277, 13698, -5584, -46159, -54236, -51064, -7003, 25540, 4109, -31403, -27542, 10902, 25998, 24815, 19858, 5381, 14158, 16945, 40289, 40778, 11131, -3229, 6467, 4069, 11272, -2867, -21636, -18646, -9106, 2708, 4772, 1279, 6522, 9551, 24218, 12595, -3382, -4265, 11600, 15452, 12690, 21178, 41555, 47633, 19384, 24346, 57380, 20575, -12908, -11470, 61, 12218, 4628, 16738, 9665, 19836, 24200, 13992, 18072, 43812, 44953, 49939, 42603, 43022, 37305, 48931, 45450, 50169, 37892, 11331, 38088, 53831, 46335, 52194, 74560, 94219, 112231, 125562, 151232, 225834, 300635, 424562, 597298, 814503, 1117481, 1512730, 1972659, 2259989, 2410278]
17034B410278J09090l6586j54752k20592l35274l92277l43759k66299j98405j31549
17024D39875j02855n9041l4816m0200N759j7881k5253j8439j2232m3459k3655
17013F7803J3093J5199N670j5081k0219k8264j1956O63l274r119j1756q899j1347
17000a7487l433j2185N852K4686P414O520J3870J28K5856J5849l335l0856r824
16987B3055j4337j1066o696K4718K0050Q652J9101l926k2566k4088j1429j3622
16975a2154J030J192J7351M427j6503J5385J2648j6339l3979m584J7021k4552
16963c9057L02P029j805O734j041M480L0540J6616k6929M170Q621j4350r850K2623
16949H083J5330J0219j9530j3904Q484J9396m307J9601r312k3568J882K745p846
$$ y = [2410278, 2519368, 2482782, 2328030, 2107438, 1772164, 1379887, 1036128, 769829, 571424, 439875, 337020, 277979, 243163, 202963, 208722, 190841, 165588, 147149, 134917, 91458, 67803, 80896, 96095, 101765, 86684, 66465, 38201, 26245, 26908, 23634, 14515, 2759, -6140, -17487, -20920, -33105, -27253, -2567, 4847, 11367, 25237, 25365, 51221, 67070, 63735, 32879, 23055, 8718, -2348, -9044, 15674, 35724, 44376, 63477, 59551, 36985, 12897, 1468, -12154, -11124, -9932, 7419, 11846, -4657, 10728, 23376, 7037, -26942, -31526, -14505, -39057, -38755, -31726, -33531, -26797, -27838, -23358, 7182, 23798, -3131, 1039, 9660, -4690, -14540, 8083, 23413, 33632, 14102, 198, 8682, 28078, 23771, 43372, 34060, 10492, 12374, 15119, 7273]
16936G273O96J2521m025j4546j591Q934K8989q178k2415j5226r524J6356J777
16923A041j2517r450j4779O590J0689N594L921J4156P062o327j9795j726J5180
16910c61k92o637q0j2921J5034K9980K1011l987k0625k6108n446j0090o403R355
16896a7570R830J4496O250p726j3629j9163K63j009k263O070K5548P643j450q776
16882a486n743R951J4374P34j6696j6517J0301N188J1883r798n874j8854J1045
16869a1492K2683q708K054J9154j6372m1310r760J9956J1031J0802p824J4605
16857D819J2188L63J1606P637q982o511j1420r420K9901O452j2801J330j2230
16844A2932l061j0638k1525r218J8922R262m422P611j9903o79K4953K552k4492
$$ y = [7273, 7969, 20490, 16465, 1919, 328, 9262, 38251, 30073, 7658, -7568, -17092, -736, 1041, -11476, -20926, -35705, -29115, -18426, -12832, -8911, 5245, 12307, 5980, -13815, -15541, -361, -653, -7290, -7370, -20291, -5257, 24723, 45734, 41747, 21122, -4986, -10432, -20522, -26925, -17570, -7740, 6756, 13006, 5280, -8349, -27512, -27249, -28258, -30521, -24451, 1097, 8740, 7290, -1486, -7229, 2722, 17096, 17830, 1134, -15383, -5082, 106, 11989, 2191, -3683, -22537, -11492, 11191, 2483, 4537, 23691, 7319, -33991, -43751, -23795, -12764, -1962, -9786, 4819, 17007, 17370, 28976, 36613, 27631, 21120, 9700, 280, 30181, 36633, 23832, 25162, 12932, 9871, -767, -22292, -31510, -12588, -3326, -7748, -137, -20040, -20719, 4234, 6786, -17706]
16831a7706k5640L0598L2840J680r052J061L124j1475L419K9749Q471J323r446
16818C8946k5330m491p99N857j8045j1171L461K0233m209J4818r03k031j8170
16805a834m270J0459j1790k163N730J9824J2144r768k8332j0174P620M86j819
16792a3887N063j505l720r040J223K0940N653J50O185j4793L29j4231o914P74
16778b3773M137m261P408k752K468R886l299l282j682Q630N477j8852k722J9157
16764c460m193O940n434J3181n404j2245K3284j5596q366p614K240K1285j768
16751B850n004l449j4237K331J5166j7544j6442Q391K2392J9260O042N111j7987
16738F880N796J379j1083k238n704k2031J6247J2457K3550J4831J974L354N908
$$ y = [-17706, -43346, -12748, 20092, 21772, 12720, 13781, 16905, 5430, 8849, 38598, 47069, 48392, 38946, 13616, 9125, 8326, 14183, -3862, -15033, -11572, 8661, 4452, 19270, 18367, 16336, -1834, -6104, 4355, -7435, -9598, -3868, 15956, 28100, 18332, -10000, -20174, -12554, -12068, -13887, -8824, -10329, -14049, -23089, -21866, -926, 4727, 4877, 11062, -3731, -3402, -17633, -24547, -23773, -19636, -23897, -16489, -19241, -16773, -6887, -10186, -13468, -15150, -6520, -1043, -19895, -22617, -3460, -7653, -713, -6147, 7034, 1630, -10615, 12669, -2927, -11293, -18907, -16667, 4618, 2850, -2154, -5603, -19840, -17509, -2343, -19887, -36329, -27938, -5546, 13714, 19756, 24867, 6880, 12676, 14055, 2972, 734, -4970, -27001, -10754, 1703, 25253, 40084, 42058, 45412, 51320]
16725E1320j0245j4368Q220l734n479J50l812Q131j1322j7307m035j6483Q054
16712a0910K4511K8332L612k147j6938k3761l031j1125k0156j0805Q782K5776
16700g860M792J0853P138J182j2033P24j6150j6089j0175K6736R127p384r464
16687a8603k0964M115j3206r84L419J6708j7084L898Q744p679J3844J2302q233
16674b3723P023K2775q639j2958J3987Q317L94j4781n577O745N487n903r316O749
16660i420J7470J6303P004p666p960m432M907m550j4552n002l59Q72K189J4373
16646I177R487k139r909j9263J2494J4470R49L371m456p134J6405k013o187M840
16632B0092l088o766J998L3035J4824o940k1068o427n286j9478k3669K0389J5022
$$ y = [51320, 41075, 26707, 34927, 31193, 25714, 25864, 22052, 30183, 18861, 1554, -2481, -18964, -10910, 13601, 41933, 45545, 43398, 26460, 2699, -332, -11457, -31613, -42418, -33636, -7860, -3068, 7785, 14923, 16105, 4072, 4796, -11354, -27443, -37618, -10882, -1755, -9139, -18603, -39567, -35452, -48658, -49642, -46223, -29515, -46599, -42701, -33957, -41636, -27792, -15490, -23723, -16700, 6075, -2564, -15522, -1535, 6782, 7176, -7605, -13182, -6437, -950, -6853, -16169, -9420, 8050, 24353, 31357, 23691, 15731, 11299, 16206, 11656, -2896, -7898, -8257, -7385, -5196, 9177, 18664, 16525, 6616, -12647, -153, 14317, 15266, 18637, 14181, 7047, 23452, 21439, 15252, 20092, 17004, 10238, 12236, 45271, 60095, 53155, 32087, 25660, 20374, 896, -22773, -2384, 12638]
16619A2638k1026k1333M829k064J3410j462j6363j0657j1422K8516N043J456L966
16606a4469m37N20l832M877n309n689J4518P240O314J6385r995j1872j4333j7310
16592c3392r904J1634J5115J2493R770n167l024J6164m163o543M671L099Q052
16579A8805r058k4801j7487L3763K4701O085n659o773r167K0649j2309k8886L14
16566i823Q031R199J9604n12j5638j2169J914k942P17p665L084K1173j37j824
16552A3012j3973r601R077P954o047L998r314J865R273k8164k0489P565J7891
16539a6953O00k5768l5208L757K7970L8978O036L79J2865J8117m116j6853j3941
16526d137O3o901O593J7010L220Q494j7560k1413J9639j4852j5995P356J2824
$$ y = [12638, -8388, -29721, -24892, -26956, -13546, -15008, -31371, -42028, -53450, -24934, -19891, -18435, -14469, -14906, -14386, -18218, -13341, -18650, -24339, -9821, -2581, 3733, 20118, 10123, -1749, -16082, -33392, -43296, -31662, -16547, -4054, 5716, 549, -2475, 13689, 9526, 2983, 7654, 10753, 18805, 9747, -15054, -32541, 1222, 25923, 32008, 26349, 19576, 10409, 31058, 18749, -10137, -9823, -1792, 7407, 27011, 26499, 10861, -1308, 606, -2336, -1619, -9284, -6200, 14973, 14836, 13012, -961, -10562, -1485, 6469, 422, 4420, -4894, -3029, 6244, -21920, -42409, -34844, -16953, -16353, -42121, -77329, -73572, -45602, -6624, -588, -209, 12656, 30773, 26657, 9804, -4137, -4074, -10975, -4382, 12628, 15848, 24342, 6782, -14631, 5008, -9844, -25839, -18483, -5659]
16513e659q88k0772n824k737J6728J0416j9927k4088J5582J8832j380O693J6460
16500C436j743N553j485j8567j6981L035O373M815J6676j6913R59J6480K2329
16487B3967J136j232j4130K129R218l405J726j9209k0024J1044K8363P65j1378
16474H970j2426K35J4984j6953k1651J202J3451L278P454j196o95M651p501N880
16460c17L936m21j6918p624M176J8144K008k924r211P347R435j0932j7239J5802
16446d738P496M978k2209j7599J2747L1038j1657p445J2924J3448L146p829r544
16433D756r171O879N871q87O494j9119o046p319Q787J4818n558O862j3897l893
16419a1423K881q920J3896n251M727J2400J7380m042k0835j1611J8614P990p186
$$ y = [-5659, -6547, -27319, -33143, -35880, -19152, -8736, -28663, -52751, -37169, -18337, -19717, -13024, 3436, 1693, 7246, 5761, -12806, -29787, -26752, -20379, -15564, 1112, -15801, -14842, 1638, 23967, 25103, 23871, 9741, 11870, 21088, 17683, 19409, 200, -19824, -8780, 19583, 20348, 8970, -3456, -3221, 11763, -5190, -26841, -25639, -12188, -8910, -1456, -2652, -3347, 1304, -6197, -317, 3619, 3198, -13720, -21344, -17168, 976, 2984, 60, -9151, -1804, 7631, -3301, -20540, -4738, 2758, 7736, -14473, -32072, -19325, 11713, 56, -7389, 5535, 18983, 22129, 14300, 4756, -4415, 2464, 8335, 7448, 13942, -5177, -11223, -18542, -9755, 5063, -495, 6367, -7530, -11423, -8542, -17462, -3566, -8817, -4090, 8310, 25690, 21648, 813, -10798, 7816, 15806, 8620]
16406H620j8437j3292N614J663o725j4146J1173J6423K6875O902k2628o447J0128
16393E723K621j8370K723o620J7686J186p255N330k786M076n01N804P087J1000
16379B7704k2204k7134o448R906J9860o450j7763j630J6412j1131M267M941q162
16366a7832M093O740J84j3057r645J1758j0761p593R263L267j4054M639K0880
16353a2118Q234O401J542j8507L138J0490O502r267j7733n401P103Q404J9671
16340H459j6157j1507j0111n094P574M386Q87J8019L2862k660j2502j8354N118
16327I20R062M789J7194L74j1408k2218j5242O150n082j023O649Q631l094N907
16313A609R893n335J943L414j2047r98N176j708N448j1164j9458P095N692J5517
$$ y = [8620, -9817, -23109, -17495, -15832, -22557, -36703, -25530, -9107, 17768, 24670, 2042, -4405, 5723, 8344, -10026, -7303, -13923, 3763, 4949, -2306, 3024, 238, 4314, 3813, 9617, 16704, 27704, 5500, -21634, -28082, -18176, 1684, -4766, -22529, -24159, -7747, -18878, -14611, -9670, -17832, -13739, -6999, -6815, -19872, -29517, -17759, -28520, -36113, -26850, -23583, -37637, -32998, -12118, -3884, 2517, 4059, -14448, -11310, -820, 5682, -3585, -21318, -26719, -19616, -11212, 8459, -7698, -19205, -29316, -34410, -26836, -22450, -21563, -3544, 29318, 26658, 14156, -4198, 920, 9982, 14771, 31965, 32339, 20931, -1287, -16529, -10379, -15461, -16484, -9835, -1204, -4298, 1609, 11502, 6167, 8110, 11524, -523, -1521, 3655, 1947, 7395, -3769, -23227, -16132, -10440, 5077]
16299E077M213j2715J048n5l0763j9741O624J4566K091j411Q992O869J9052Q012
16285A1859j5073m819J5521J1851J1272q824k3785j146Q251j606J0438N018R528
16272B8485J3627k6890j0321k946j5263O022n178R035J0167O608j3522j0605M505
16259f276J5231l176k5755J4570M788j4995N657R105J2021j5076Q524o475j3573
16246a5430O71o102J595j158r744j0837J3714N106K3768J4451k1425l6986J774
16233d0603M155q211M080j853K0116J5657R908j8407m931K0562L7j5195k888K5693
16219H120N465k0898J0864m298j1125j8236j5944M369P675M696P625J2923j820
16206a0584N631J4529q88N868J563j1655J984j3664J0356J791j4677n664L533
$$ y = [5077, 9290, -3425, -2377, -2432, -33195, -52936, -46312, -31746, -29655, -31066, -22074, -15205, 3847, 11859, -3214, -8033, 7488, 19339, 30611, 21787, -1998, -3144, 5107, 3501, 13939, 18957, 28485, 42112, 15222, 4901, 1955, -13308, -7286, -12464, -3429, 6738, 13346, -176, -10781, -6276, 8955, 5779, -19976, -5406, -618, -15613, -9956, -851, 11170, -3906, 4618, -1857, -15430, -14759, -20861, -19266, -20424, -30168, -41005, -27291, -22185, 1583, 16034, -5391, -42377, -40603, -36448, -44659, -40579, -42432, -22316, -6659, 3249, -15158, -20089, 473, 510, -14685, -17573, 8120, 13585, -7313, 3551, -747, -11872, -30108, -46052, -41683, -34008, -29312, -21687, -8764, -10584, -4953, 9576, 8688, 14556, 16119, 4464, 6448, -7216, 3140, 4931, -9746, -15410, -11877]
16193a1877j865k476M043M1894r197n823j3561k5949l703J3553q835L025J8767
16180b004K2044j9194r396j0145k510J5738Q871K671k7027J2639K9341R520j6249
16167A4299r437J6661O567j1151l3813p854K3144K1851k4979j2858j4345m162
16155c6077R919M402J5486O729j6700k1382J9943J8369J2504j8251j5069l992
16143b4119n514K843p463j3652J668J6050J7922J5267o480R469K1811M238r271
16130B2769k8792p946q633N059J6816K0674Q103N957K588j8158o210r595k4228
16117b1596L954o162L969J3732m618m105J3631j0631K2832K0908J023Q72j3566
16104B0243l772m835j6280k443L443r672M565j308j3875J07K387J0096M720R177
$$ y = [-11877, -13742, -16218, -12175, 29719, 20522, 14699, 1138, -24811, -28514, -14961, -23796, -20771, -2004, 20040, 846, -8550, -18695, -21205, -5467, 3404, 6075, -20952, -8313, 21028, 30548, 14299, 4862, 21523, 28090, 16939, -16874, -24728, -1584, 20267, -4712, -17570, -31915, -36077, -26158, -21756, -6270, 459, -16241, -37623, -17680, 689, 13193, -5058, -20127, -24119, -29633, -26790, -34253, -47905, -46237, -30187, -12265, 3002, -3478, 5991, 27802, 32040, 22769, -6023, -13969, -22602, -17543, -727, 19947, 28050, 34007, 36595, 18437, 12227, 2632, -21596, -17642, -23804, -19835, -6103, -10721, -14826, -1195, -11826, 11006, 31914, 32937, 33809, 20243, 16471, 11636, -4644, -7087, -3644, -13316, -8751, -10059, -23934, -23827, -21440, -11344, -6624, 2553]
16090B553K188j177R830n073q555K1151o204R763K182l948k9159q140K1718p413
16076b84Q668j3974P629J2706r704l273J4553J8715o83m550j1490J687j0583q725
16062F92m959K0229p953j3702K068m911J9048m300k3001J4368J5842J4729k2391
16049E759k1367m177L905K3357k429j746L6611m830k7784J0561O086O139r426
16036B0659O923m468j4209k2857q738r444j361K0843K2348J4618J4666L678j8549
16023B4109q602k0967j8091j1470K1337P390j3100O604K8021j5124l111O47r380
16010a1737K7785J3806j6716J7511o628r06k672N793J2197j0844j3713R516j6799
15997F593j859K8503N45j4027j870k3713m212Q092J3922j3690j5317o406j4224
$$ y = [2553, 4741, 3564, 13394, 8321, -234, 20917, 14713, 24476, 26658, 22710, -6449, -14589, 7129, -284, 8384, -5590, 2039, 14745, 5041, 1768, 16321, 35036, 34353, 29803, 18313, 20000, 9417, 692, -4267, 15962, 8009, -5693, -3625, -8536, 10512, 6212, -16789, -2421, 13421, 28150, 5759, -15608, -19785, -15880, 7477, 5048, 3302, 39913, 35083, 7299, 17860, 23946, 30085, 20659, 27582, 23114, 8905, -13952, -22690, -32134, -33495, -12652, 9696, 24314, 38980, 42658, 24109, 15507, -5460, -23551, -35021, -13684, -6294, -19394, -12790, 15231, 107, -3004, -2357, -11737, 16048, 29854, 13138, 30649, 24021, 23115, 20443, 26236, 38433, 27589, 13876, 23392, 6593, 4734, 33237, 33782, 19755, 17885, -5828, -10040, -1948, 11974, -1716, -17033, -23439, -37663]
15984c7663j3475q90J1919K8340K3287M363j3170n840j637K0605K0388j5967k5097
15971d837j1295J863K2427J0894k2752k1292j76n225J1915n809M461J3258k532
15958i100K462j0787k138L729k379j1673K1181k7822j5018L1528O709j1802R005
15945a6105J9364J6265n173p994j094k847J0740R810j6770j5889K2843J587j5356
15932f19P190o204P255K51j2670j5960j0937K445J5541J4057J2149k012l150P696
15918A5032J3649K705j3558r720M602J2417p786j3627r198r137L472l00K220P795
15904a434J3616j2969j1376j5836r192O563M9207J6907K0423J8412j1752k5307
15892C7262l0646n603m54K46J1874j5217O187Q232j1660k106n577o432J1606M154
$$ y = [-37663, -51138, -52028, -40109, -11769, 11518, 15881, 2711, -3129, -4766, 15839, 36227, 20260, -4837, -16132, -14269, 8158, 19052, -3700, -24992, -25168, -30393, -18478, -24287, -19826, -6568, -9100, -6638, -17425, -19563, -15834, -18213, -29886, -8705, -36527, -51545, -20017, -13308, -25110, -16105, 3259, 19524, 14351, 6357, 5263, 2416, 13156, 22966, 6196, -9693, 13150, 14737, -619, 6571, 367, 7622, 7873, -4797, -20757, -31694, -29249, -13708, 349, 12498, 10486, 7336, 15032, 28681, 31386, 17828, 8108, 12710, 25127, 17341, 3714, -5484, -14621, -11149, -11449, -9229, -1434, 12182, -787, -12163, -27999, -37191, -30628, 18579, 35486, 55909, 74321, 62569, 37262, 6616, 1013, 559, 805, 12679, -2538, 3649, 11881, 221, -1885, -7462, -13894, -2288, 1866]
15878A866j6445r185O368R485J4334J9214N815m781r660j2661J5869j1536k2481
15865a3798J3626J3901l78j9741K983J2924j5997o588l590p678r304q135K4628
15852a7147J4625j0944J2034O54o246M084R749o053j661k262r33r174n424J1850
15838f848M956j3382J135M005R590O726N089o017j6734r971l304j307M438R551
15824a2073J4620O355J5619j1043k0881j2307j701L183j002n724n490j0050q404
15811d8898K2888P972k377j1345K5586J5417p658j0598Q793K4677k2157L607j4377
15798h470p672K3815P805j4261l0265K6294L7738K420k1256k4860m81K024p243
15785a4412L259J291L031m447P093o52r016J699l410K9475K8935q349l01J4738
$$ y = [1866, -14579, -23764, -17396, -7911, 6423, 25637, 31452, 26671, 17011, 4350, 20219, 8683, -13798, -172, 13729, 13351, -6390, -3407, 9517, -6480, -13068, -16658, -24336, -33640, -41775, -17147, -2522, -13466, -1432, -778, -7024, -2940, 6809, 756, -905, -3167, -4100, -13274, -18698, -6848, -1892, -15274, -14139, -10134, -544, 6182, 11271, 5254, -11480, -21451, -24755, -26062, -21624, -12073, 2547, 8902, 24521, 13478, -7403, -19710, -21411, -18228, -19230, -24954, -30444, -40494, -48898, -26010, -18038, -20415, -31760, -6174, 9243, 1585, -9013, -220, 24457, 2300, 5907, -8470, -16142, 7673, 15478, 1217, -29048, -2754, 34984, 37404, 16148, -8712, -9193, -7169, -14412, -11153, -9862, -6831, -11278, -4185, -4837, -13853, -12154, -15564, 13911, 42846, 34497, 34196, 48934]
15771D8934q2k7482k4662l388K3220m185M657J840p757J4722J222p076k0593k1276
15757b1906m166J3100J8496J1694J1743K598N596k3466r652j1058K948k987p652
15744a4712L110j479l103Q515K320J5042K4321j334q222r62J765j4605n811J6990
15730B1835J8222o57j8534k8222J5592j2717n831R55l516K323J4993p161j2453
15717a5171n260j237J0829J6532j572l38P060m464m68j1016n989n126R237J6736
15703I753n015n978L300J4150Q976j0758k6297O969J8813N456j4081j080r615
15690e407k2762Q673J080J3799N142J4451J0354j7096k5260J4857R725m799O590
15677I347J4038p17k360K169j0278k284j1095J0516j2610J816J4198J8830l313
$$ y = [48934, 48852, 21370, -3292, -6680, 16540, 12355, 17012, 18852, 11095, 25817, 27039, 19963, -630, -21906, -26072, -12972, 5524, 17218, 28961, 31559, 37155, 13689, 4037, -7021, -4073, -7060, -14712, -11602, -13081, -16184, -7669, -5349, 9693, 34014, 32680, 24458, 23496, 25261, 10656, 4845, 21835, 40057, 39400, 20866, -7356, 8236, -4481, -10312, -9357, -12873, -10550, 4443, -2718, -15171, -20431, -21668, -10839, 5693, 4121, 3783, 10843, 6379, 5911, -5105, -11094, -16220, -6983, 9753, 4738, -1240, 2060, 16210, 25186, 14428, -11869, -4900, 13913, 19369, 5288, 4208, -5407, -28169, -19496, -18416, -4617, 525, 14976, 25330, 8234, -17026, -2169, 7556, 2757, 9347, 23385, 22668, 20308, 22477, 12199, 9915, -1180, 9336, -3274, -1458, 12740, 31570, 28257]
15664B8257o477k0864k0266M2403R205K839j1551k3487j7510Q701L7705J3466
15652D2421j5356k7251N339j373k0806q408o208j4089j706J7867N669K1311P601
15639E011o068Q49J6206Q158k5061k5336l43l829J4491K2801L46j8079k1326L34
15625c1846r391l529L150J2778K0049L156j1547K1952N687o291j5382K838O82
15612g694N101L91K763j1720n764j016L124J671M141J9589j339j3485p454m364
15598a6056k353K960o091K863n795J4779M523j3360j2065q894J6512Q196M445
15585a0336p737J2049P471j73m059j2371J2253J5059J6954K793p067j4022j2047
15572a233j4128M539j3875J6075N249k914j0701J2837Q159j6465l131j506K210
$$ y = [28257, 21780, 916, -19350, 23053, 32258, 35097, 23546, 59, -17451, -8750, 28955, 42421, 27065, -186, 5153, 3780, -17026, -25434, -31642, -45731, -47437, -29570, -23901, -2590, 5011, -1057, -208, 15998, 24156, -905, -26241, -26584, -30413, -15922, 6879, 7225, -10854, -32180, -31846, -41237, -44766, -41616, -28838, -8789, -5633, -17180, 4772, 10459, 4168, -11214, -8376, -7694, -2593, -2202, 561, -11159, -16923, -17939, -14815, -13144, -9003, 10586, 9247, -4238, -11692, -16056, -18409, -15449, -21540, -18677, -24472, -9693, -5170, -18530, -30595, -39489, -22977, -14781, -10336, -18073, -6024, 1447, 1274, -2785, -15156, -2903, 12156, 29110, 31903, 24836, 10814, -1233, -15361, -10822, -24697, -8622, -3373, -6287, -16988, -4151, 4008, -12457, -15588, -17094, -14884]
15559a4884k951J1788N517Q758k1476q60R798n000M272j789J6859Q045o06P003
15545B4474P546j0662L869K692k4842j8677r388J4327J0699K750J5633j1125j4895
15532g599L16J4660k603l922M965J156j841j3095p827J3858J1900o419J2789k2855
15518f517j9121J4778K582M074j2351q312R140R095J8407J088l073n772k3707
15505a9689r628j944K4990L928j3527K8403J2940j3744k1445o72O729J6331J1500
15492B4172k263j1770q189K902q845J1194Q897o346J5597J1944p064r937J7107
15479C7399o604l0422j9489j7606J2116Q387p725L811L950N779J909q05j9014
15466b8314j1493M974J6291K3521p582q445J2578K4937j6397j2510P201J147p270
$$ y = [-14884, -17835, -6047, -530, 8228, -13248, -14108, -4310, -9310, -5038, -6827, 10032, 18077, 17471, 24474, 32020, 21358, 25227, 27919, 3077, -15600, -24988, -10661, 38, 2788, 18421, 7296, -7599, -7283, 7377, 4774, 852, 5817, 6973, 5132, -7963, -15790, -1932, 9968, 3549, 16338, -6517, -25638, -10860, -8278, -4204, -16555, -24867, -15727, -6632, 11775, 12863, 9790, 4018, -19689, -29317, -31261, -6271, -2343, -15870, 12533, 25473, 11729, -9716, -10388, -3659, 12672, 24172, 21909, 10139, 1950, 4852, -3993, 7201, 16098, 9752, 25349, 37293, 30229, 20292, 37399, 30795, 373, -19116, -36722, -24606, -16219, -23944, -20133, -16183, -10404, -8495, -9300, -28314, -39807, -34833, -18542, 4979, -2603, -11048, 1530, 26467, 10070, -2440, 4761, 5908, -1362]
15453a362j3746o442O176J591k9929L177L1331J0302j7914j0388J0412K777N571
15440h444O200J720N699j1857q0Q046j9298m828n185o05J079K6256Q98j6118o247
15425b2764J8535L762k5041J1036J3146L697P161j9731j8761j4673k783j587j6082
15412f4085J6790J378M967L0357J8509J97k1444k190K689J5772R008J494K86k212
15398A1516k0696l356J9246m639k7217k2849O297J8480j373J2043P296J5729k977
15385G500q445p012j4507o06L1366j3412o657Q904P872j4024j1132J5115J5780
15372A0742j8931l188J1673J2672q411k2414L0610J8633k0854j9918O672k534
15360e248k568R97R187j4070O008R473j4964j0461K7993J9343N898J1553k1967
$$ y = [-1362, -15108, -21550, -15374, -13783, -43712, -40535, -9204, 1098, -16816, -27204, -16792, -14015, -8444, -2244, -524, 5175, -6682, -6762, 1284, -18014, -22842, -28027, -28632, -27553, -1297, -399, -16517, -22764, -4229, -467, -25508, -14472, -1326, 2371, 9532, -10199, -28960, -43633, -46416, -48003, -64085, -47295, -45917, -40950, -10593, 7916, 8113, -13331, -15521, -12832, 2940, 11948, 13442, 13728, 11516, -9180, -12536, 6710, 2071, -25146, -47995, -41698, -23218, -24591, -12548, -5252, 10477, 7500, -945, -7957, -22464, -23070, 8296, -5116, -11773, -2869, 5003, -9021, -20153, -5038, 10742, -8189, -11377, 296, 12968, 4557, -17857, 12753, 31386, 10532, -9386, -2714, -5248, -7816, -6819, 2368, -11702, -5694, 3779, -11185, -21646, 6347, 25690, 31588, 43141, 21174]
15347B1174k6325P854K0838l535j5968j7152J6368R193j9660N137L714J3786J1563
15334B6987q905j9538r347J3678n80J1270o51j216k6477j1415j232J4929K7125
15321A4628j1969o577J7759J4037n21j0509j1569K271R167q014J5198M23j8767
15308E557m934J418j866q887J8786P546j0591l3515j0885j247K1431K6313R817
15295A8943r3k2561j9477m192J3448j525p282n043J3242J3536L672Q621J0857
15282B2146n391J1675J7001m39O898l6601L80j517k29j7420j9363J8676J9723
15269A5539j6972k2354p344O60J603J5055M243L820N939k1739o845J008K524L820
15255b1043K6691m295J0980K299j5871k0079l946J8907o592j1721J0886L416r077
$$ y = [21174, -5151, 2703, 23541, 20006, 4038, -13114, 3254, 12447, -7213, -2076, 1638, 15424, 26987, 18082, -1456, -10803, 2875, 2295, 13565, 12914, 11698, -14779, -26194, -27426, -12497, 14628, 2659, -3918, 13841, 27878, 27357, 16848, 5279, 7550, 16717, 8703, 23901, 24324, 5557, 623, 2041, 175, -8712, 10074, 17620, 7029, -26486, -37371, -38618, -17187, 9126, 18943, 18850, -3711, -23188, -27380, -13932, -15457, -22739, -27782, -14540, -1004, 2668, 11289, 22146, 16755, 28430, 45431, 44992, 51890, 15289, 15669, 14152, 13923, -3497, -22860, -4184, 15539, -1433, -23787, -31131, -30471, -28868, -13813, -9570, -5750, 189, -21550, -28395, -27387, -24863, -21043, 5648, 1353, 12333, 14632, -1239, -21318, -25264, -6357, -12949, -24670, -13784, -10368, -19445]
15242a9445Q24J3815p217k7849M86R784R035k272J0293J1193o629j4667Q921J0781
15228b947O506o890J1300K697O821j224j0919m01R94j1100j7852Q169j1320n503
15214c1669L3625J0639Q657l4221r102K6679J2477J0887J4663K1188k3632K136
15202D2327J3625j0827k212k4015j6562J0179o257q326o045K2667K811j4458J3856
15189A6763J2134m151n319J6306J2328k6261j0124j2874K517o249L2J3145j3387
15176e140M331m128J3780J924o04L1007J3473j9717k6615j978N33J50m409j688
15162I19M171J749n617R182m168J1247Q919K5824J0635j7018j7103j5375o617
15149F748j0346k2273k888J0845p949M36j313j7747QK0021j142m841K6703m011
$$ y = [-19445, -18621, -4806, -12023, -39872, -39386, -29602, -20567, -22839, -12546, -1353, -7982, -22649, -13728, -2947, 3559, -3331, 7969, 10666, 17487, 16263, 5344, 4943, 5937, -5163, -23015, -14846, -26166, -31669, 1956, 12595, 21252, -12969, -22071, 4608, 17085, 27972, 42635, 63823, 40191, 42327, 55952, 45125, 42913, 18898, 2336, 12515, 6258, -2068, -8113, 14554, 17365, 2907, 16763, 28897, 24746, 19427, 35733, 48061, 21800, 11676, -1198, 1319, -4930, -4898, 8247, -5140, -809, -4937, 8843, 10767, 10163, 41170, 54643, 34926, 8311, 6333, 6866, 7016, 2607, 919, 5090, 6839, 1222, 10404, 6236, 17483, 26402, 52226, 62861, 45843, 28740, 13365, 6748, -3598, -25871, -28759, -17914, -25863, -25427, -26740, -44487, -44479, -24458, -25600, -30441, -3738, -7749]
15135g749K3875O06j5382J517j457k0462K820J9672J303K782O132K053M45j6839
15121f84j6038R238M750l969J0474j091P28p242J5754K3447k5175k6856j7212
15108c3876K3299j4561j2145J0702L3031J3219k7299j6143J8670J9578J6733j1396
15096A9812j9259k3938o318J1434K6474J8461j1679k7632J093l464M651J710j4795
15083b3450j449K198O994R102M998M281J1835j3858j6744J1341r547j0702K7763
15070B762J1634r262o769j1086K1549n928n019Q916l841M927j5874k891j600K0561
15056H079J6699j1878p443j5874j1389J7144L280j6429r838n256L310k86l348
15043c3229O996N69L440J4631k0141j5043K3458L5577J3036l464j83K317j1856
$$ y = [-7749, 16126, 16732, 1350, 2867, 1410, -19052, -16232, 3440, 4743, 7525, 13657, 15710, 16155, -684, -16722, -7484, -2734, -6703, 3771, 2680, 3408, -3834, 11920, 35367, 10192, -16664, -33876, -10577, -25138, -37283, -26581, 6450, 19669, -7630, -23773, -5103, 14475, 31208, 19812, 553, -23385, -29703, -18269, 8205, 26666, 14987, -12645, -11552, -15016, -10365, -8655, -23450, -24899, -22701, -15707, -6605, -1607, 2674, 14509, 651, -16093, -4752, -14299, -25001, 2762, 14396, 5134, -1635, -12721, 8828, 2900, -2119, 6797, 2956, 7883, -7991, -10882, -12482, 8079, 24778, 12900, 5457, -10417, -21806, -4662, -1382, -17811, -27649, -32905, -29595, -29881, -33229, -26233, -25664, -22224, -7593, -27734, -42777, -19319, 16258, 29294, 25830, 25647, 27964, 16108]
15030A6108l86q638R722J2250o032m733m06Q12K0117j3441k0969l1143k0009K5200
15016b1548K6370N398j6472j433J9875P902r707j7130K2634J9475L457q689P574
15003C7706l584k2191k5371J2911K2001j8051j786j489q186J2308R671R080R138
14990C2157j2818j6686M831Q455O187R105J2478j1752j4745j4965m26O580j320
14977G081J1086j616j0255N654n671J6060J0300j5144O710Q370j7454j8739j3832
14964a7450J75N945n961k500L4111J8150j3288J2528O537q397j0276N571Q039
14951C3184n241j2960j8524N737k5911k1737J4270O420N582o238p77j496J4852
14938a2839L1598j1398k2597r539J6004K3163J1852Q848o19l0086k300J3550K870
$$ y = [16108, 15722, 7084, 16806, 29056, 23024, 18291, 17885, 18697, 38814, 25373, 4404, -26739, -46748, -21548, 4822, 10220, -6252, -7685, 12190, 20092, 10385, -6745, 15889, 35364, 38821, 30132, 37706, 34122, 11931, -13440, -529, 21472, 3421, 1635, 146, -8040, 4268, 13939, 23019, 32157, 19339, 2653, 7484, 15939, 22126, 31231, 43709, 31957, 17212, 2247, 1821, 8401, 7081, 18167, 16551, 6296, 11950, 6279, 22339, 32639, 17495, 24205, 32575, 15121, -3618, -17450, -17275, -11330, -17291, -19791, 14320, 32470, 19182, 31710, 38247, 29850, 19574, 25145, 33184, 27943, 14983, -3541, 2196, -23715, -45452, -31182, -24762, -19180, -25418, -26195, -27691, -12839, 18759, 7361, -15236, -24775, -8771, 14392, 26244, 35092, 34473, 4387, 2087, 15637, 18507]
14925A8507J0967j4287q359J556O241K314M298l963j0257j1702l949P854P160
14912F380l406j2045j4907l172L2991K729j994n480J7960J8814R318j9604l177
14899B4407K539j4991o494M897o183k5654p51J6092J421o987j985L793J2765n27
14885B342P992j3082j5102M435Q131o217p296j495K1345q584R643J3144j7703
14872b447j2529j0485J6554J5886j2916J923J035K0838K9238L487p32l582k0021
14859B6249l226r724K239P712j7142l0175j1451L677J0772n156k397L860J6211
14846h551K8265J5485o38k727k7346j4257r320K954J6981r369j3233N49J8766
14833b441J5175n72J892k0914k1343j79K7052J7879J5847q82j8873K774J5740
$$ y = [18507, 29474, 15187, 6828, 8384, 14625, 16939, 21237, 17274, 7017, -4685, -8634, -780, 6380, 2974, -9071, -23978, -27150, 5841, 8570, 6576, 1096, 19056, 37870, 47188, 27584, 24407, 26946, 11955, 5461, 10358, 4175, -21479, -22230, -6138, -4717, -11704, -13689, -9896, 2869, 2342, 10334, -2748, -17850, -13415, -5284, -11501, -18797, -20292, 1053, -7531, 2112, 15256, -2447, -14976, -25461, -8907, 6979, -5937, -4014, -2979, 17859, 47097, 50584, 49852, 46270, 26249, 23023, 13299, 15538, 23250, 6108, -24067, -35518, -31841, -21069, -26225, -28622, -24762, -8551, 19714, 35199, 34561, 31834, 4488, -9769, -19089, -16135, 846, -8523, -21756, -21207, -2441, 12734, 12162, 14054, -6860, -28203, -28382, -1330, 16549, 32396, 31514, 12641, 15415, 31155]
14820C1155j1522k3541m140l545r147J347P273J938Q7l970l814l576K1932K6043
14806B6520J3915l092k5811p711R395j0274j490N150n334m09J1721k4033J0195
14793a258k458j8179j425J2895k04M165p17J1678R747K3727L421p574J4446j5180
14779C3084k4728R61J1899J812m10k5730q831O951Q432J113j8428j1532J4757
14766a0650J4075o331j0938O873J006p275k6308j6268J4160K6493J5939K2286
14754B3062N530R801k9918q039J1564j9878k472P941K0552q053k2352j4090o553
14741c2905J0590K917j9066r00j695J865M058R190o739P592k370J3215K6607P393
14727A9752k2281l3565o292j9150K4280R076O313J0632J955j10n066P700j7669
$$ y = [31155, 19633, -3908, -8048, -11593, -20740, -19393, -12120, -10182, -10095, -14065, -17879, -21455, 477, 26520, 40435, 37343, 11532, 3821, 13216, 2942, 1452, 6602, 1268, 859, 12580, -11453, -1258, -3716, -21895, -23320, -10425, -10629, -6464, -7181, 4497, 14244, 37971, 41392, 33818, 48264, 33084, 8356, 9317, 21216, 23028, 22618, -3112, -11943, -4992, 3440, 4553, -13875, -25407, -10650, 3425, -2906, -13844, -6971, -5965, -13240, -39548, -55816, -41656, -15163, 776, 23062, 28592, 38393, 8475, 436, 12000, -7878, -10350, -2409, 18143, 10090, -12262, -26352, -32905, -22315, -19398, -38464, -39364, -41059, -39194, -35136, -25946, -32685, -25093, -27463, -14248, 12359, 19752, -2529, -36094, -42386, -61536, -37256, -28180, -21867, -11235, -9280, -9390, -14456, -6756, -24425]
14714b4425k2044p484j0865J7094L3387J3563R23Q19J0327j8594m337K30J1281
14701a25k504J0045J5145J0691r31j9187j7763J6397J9631p849l629j9763j2613
14688a2455q180M194O962j3754j4239J7842J6705L3537p889j8858j3393K1346
14676A1818J6274j5511j7307j9033j71K6563K0254N749l1799n249N503J9731j0590
14663F232P883j546Q134k052j6729l145K755N781P52o5J0842O119l235k1950j9078
14648a9302j4393k1583R084L0112L3397O186j7795j5846J1110p730J2596L643
14636I479M101K1485n275k0245m561L712j0317q981J2114j424k184j807O046K1683
14622B3826M787j8474j2497K1582P730k7329j1161K8908K164q178J1469m906k4102
$$ y = [-24425, -46469, -53953, -64818, -47724, -14337, -774, 149, 968, 11295, -7299, -11636, -11406, -125, -2629, 7416, 22561, 33252, 32321, 13134, -4629, 11768, 31399, 23550, 19921, 158, -12455, -20635, -16441, -9479, -23233, -37472, -19630, -2925, 30612, 22723, 3865, -9528, 11818, 28092, 12581, -4726, -23759, -23930, 2633, 22887, 28636, -3163, -8412, -2909, 16822, 6232, 14115, 12569, 20703, 18651, 1922, -1223, 1532, 7313, 8065, 8000, 18842, 24961, 21726, -224, -19302, -33695, -55278, -46194, -16082, 17315, 23501, 5706, -10140, 970, -6760, 5836, 9479, 13580, 35065, 29790, 9545, 4984, 8696, -1621, -10602, 1512, 88, -2096, -3903, 2143, 23826, 28613, 10139, -2358, 19224, 26954, -375, -11536, 17372, 19536, 11358, 22827, 17921, -6181]
14609f181m440J8123J7819J458k6892J0510Q497k5892r307P790k911j20j828l68
14595a3742P756L0749J4416k0997K093q528r343N126J2479l328k4570O000K2277
14582B0388O875r751Q295p04o432r223o349O545J7122j62q620j7912k0177k183
14568b2288K7385P578q823j6190O98K049j444J4764L3300r191J537Q504K073j6361
14554B3591r616j0944k587J258j7957k0963Q470K6616J9036P632j584k1306j1068
14541i422O403M695L572J6178k2649o277J4342p724j3356J356P405k2767J4917
14528a3327Q499J970J7207N39j473J363k4112l1083O456J6093j220p339K6830
14515D03J7707k8335q840k5O257J3235O375k797M061q918M488l210J6108M312
$$ y = [-6181, -10621, 7502, 25321, 26779, -113, 10397, 18894, -6998, -16305, -8515, -11426, -11546, -13374, -13742, -5986, 24763, 39179, 18182, 20275, 11747, 2404, 7530, 20009, 16681, -7889, -1889, 20388, 27263, 17512, 25807, 25103, 18671, 9448, 3099, 9644, 26766, 26604, 17984, 72, -20105, -22288, 5097, 12675, 3852, -12338, -11640, -9591, -11035, 3729, 37029, 27838, 29375, 37879, 39952, 23591, 13975, 3031, 444, 1702, -16255, -37218, -28748, -2132, 16904, 24536, 22952, 1646, -9422, -3019, 1676, 5248, 21426, -1223, -7500, 6842, -882, -14238, -12882, -5477, -28244, -13327, -4828, -2858, 14349, 14888, 13415, 14778, -9334, -40417, -33961, -17868, -19088, -26427, 403, 18110, -10225, -19065, -19090, -12833, 402, 6777, 3980, 8041, -877, 3611, 401, 16509, 20821]
14501B0821o120p159o119K6221k5747k0872l445j6o258J3902J3102P16K1495o416
14487A4105N921j020k2069j9910J8479o43L491L772J600l709J140J1942P1k3565
14473a0395j2378l129L308J4718l879P394J4250m058J2956j539j1115P721o297
14460G557J1626K178j5146n746o402J0657J0366L2489K0174j6797j3379j6567
14448B1010k4765K444K18O724J2165n94q080R412j3693j050J0129l395m597j8213
14434a2285j2018j0179J9429k701r688Q329m927P032L5850m190j2054p812L898
14421a316m294k1477j5582j2615R409R767O997P256M089J2608r525L795j7942
14408b8830J3292J4528J3835J0406J938K1125k8622j5337J4171p901r635O172
$$ y = [20821, 14701, 7542, 1423, 27644, 1897, -18975, -22420, -22436, -28694, -14792, -1690, -974, 20521, 14105, 20026, 19006, -3063, -22973, -4494, -5137, -1646, 2126, 3726, 17, 1157, 13099, 13170, -10395, -22773, -25902, -22594, -7876, -11755, -4361, 9889, 5831, 18787, 17248, 6133, 13854, 7557, 19183, 21361, 6215, 469, -5933, 4724, 15090, 47579, 67753, 50956, 37577, 21010, -3755, -1311, -1093, 5631, 17796, 17202, 9122, 18534, 4841, 3791, 13920, 10525, 5928, -12285, -24303, -34482, -15053, -17754, -27442, -19113, -24040, -17008, 18842, 14652, 2598, -5214, -1316, -5610, -27087, -42669, -55284, -45875, -36108, -29111, -21855, -17766, -5158, -14683, -10888, -28830, -15538, -1010, 12825, 23231, 25169, 46294, 17672, 2335, 16506, 8605, -1030, 5142]
14396E142K994j603p769J074n872J1718o004j4290J303l182N411J8900j0546j2675
14382a5399J7740R660Q551l654j0222L014j5353K201J8527M152O202J6766j188
14369D0997j1270j4521k4391q601N873n902j3069J5504L734Q356j899j0910Q870
14356g229m975K630r26k3078m3265l840M2176L7768q54P368N556l676O489R463
14342B3607l2526l2298J60K0980Q328M813j980L2096M430j8509j6308n483K0992
14329H302O538m16j459j8571k097p910M210j1144J949q470K217K3438k865j2117
14315a8395l37J4573R045j016J1316n256p780j1422R631J6626L331N472j727r077
14301A4984q12j2259j7860J277N846L426J3685P214j8121j966p767j5453j0759
$$ y = [5142, 8136, 6533, -1236, -162, -6034, 5684, -320, -14610, -13307, -16489, -11078, 7822, -2724, -15399, 2341, 12001, 20552, 16898, 6676, 9690, -5663, -3462, 15065, 19217, 25419, 42185, 40997, 29727, 15206, -9185, -17786, -11913, -17815, -30884, -15380, -11646, -3290, -5189, -16099, -7229, -12204, -9574, -10500, -33578, -76843, -80683, -38507, -739, -1593, 5775, 11331, 7655, 14144, 23607, -8919, -41217, -41057, -20077, -11749, -6936, -8916, 23180, 27610, 9101, -7207, -12690, 8302, 14840, 14424, 12965, -5606, -7703, -15613, -11403, -22547, -20598, -29068, -26851, -3413, -6278, -18395, -18732, -4159, 4886, 3870, 15186, 9930, 2150, -9272, 359, 16985, 20316, 25788, 24061, 14984, 14172, 1913, -15947, -14670, -8824, -5398, 8287, 15501, -2620, -4586, -12353, -27806, -38565]
14288c8565l3Q619Q249Q456j578K646O637j868j4322j9219p120K8511J1983J5310
14274G706J4693K35J6688j6583l4553M868N504j404n833m458M953J2862j2201
14261g523k466J1451K844j1077j1403J3522J9144p359l4075k7959J5430R792K3542
14248f137Q087j0416J2976J880Q67K3790J806r904l58o34k2294j9238J0905M073
14234d597N003l927k1928M082j795L6486Q380j7955j1995j3845J3873J1847J867
14221E496n292j4425J5338J2149j1801K908J2247j3448p686J7877N314l994j413
14208A3270q491j7687J2124O781Q645p709r275J6228k342j9118O015J0086n028
14195C499J1937M743L726j406o331k9819J749J8740K2168m78k3102J829r150n794
$$ y = [-38565, -38598, -29979, -21730, -13274, -14852, -12206, -5569, -7437, -21759, -40978, -48098, -19587, -7604, 7706, 22399, 22634, 39322, 22739, -11814, -6946, -1442, -2846, -8679, -13137, -8184, 4678, -7523, -9989, 1462, 4306, -6771, -18174, -4652, 14492, 7133, -26942, -54901, -39471, -29679, -6137, 1950, -8466, 4510, 6390, 7257, 31047, 32853, 22949, 22591, 21957, -337, -19575, -8670, -4597, 406, -3521, -25449, -21367, -23162, 13324, 21704, 3749, -8246, -22091, -8218, 3629, 5496, 204, -14221, 1117, 13266, 1465, 4373, 16620, 3172, -4514, 13363, 18677, 14683, 13270, 4779, -12908, -784, 5997, 14642, 6933, -2342, 13886, 11544, -7574, -1559, 8527, 3499, 15436, 20179, 23905, 22499, 16168, -13651, -11902, 6838, 29006, 28528, 5426, 7255, -1895, -7689]
14181g689q216K62o177J2332q131j6106J0094J2918j530p341m154N498J2391J5413
14167I564j396j4967j2169j5131m581j1831K978K1740K9406J1907j5611j1296
14155a1387J3512j6241j7293q394P699K552p955L0245L9064K469k9311J234L768
14142I962K878P279N04o972r702Q471j956l791j1944J0515L4697J3987k4951k2689
14128F288m432j3250j7277j703N764J0293p032K038J831J6366J6735L135p872
14115A0884o294k7508j3383K5685o299r076J3502n079j6204l023J0083K7627Q565
14102I480P865j1203K8776K2324j0674j496K548k5002k282N861j4235r905K3898
14089B5955Q521r710J437J6214O010q289k0008k9166j4908n533P863J7025J5599
$$ y = [-7689, -15905, -15643, -21820, -9488, -17619, -33725, -23631, -10713, -12243, -19584, -23738, -18240, -5849, 9564, 8168, -6799, -18968, -34099, -38680, -50511, -47533, -25793, 3613, 15520, -91, -11387, 2125, -14116, -31409, -39803, -32104, -29552, -37507, -7262, 31802, 34271, 4960, 6194, 9962, 12840, 20119, 20623, 13651, 3949, 12420, 10464, 6673, -5271, 5244, 39941, 53928, 28977, 6288, 1856, -11394, -28671, -30374, -24610, -14317, -21349, -19311, -17480, -1114, 15621, 18756, 10884, 4590, -22918, -36301, -10616, -16915, -25991, -12489, -17568, -33772, -36795, -26712, 915, 9480, 17345, 6142, 34918, 57242, 46568, 45072, 47620, 22618, 20336, 26197, 11962, 2057, 25955, 34476, 24766, 26203, 42417, 48427, 40138, 20130, -9036, -23944, -29477, -21614, -4589, 11010]
14076A1010j7147L497J7545N548N187O440Q585j973k2772k2176J859R920k060
14063C463j0299j2131R601K4022J8957J2280N727j2145j3857P446j280k537j7801
14050A1446j5269o314j4879K997J3539m70J8605L0168L839k2740k0871j0669J9974
14037I356K0951J6265J7168j7496j7493l629O705n941k732O162j0871k3460J9640
14024A4625L4035j9721k4952j8987j567o248J0518n496q242K4408J3000k5647
14012a4274j5773J349J6672l674r583j1539J4795J4052L338l46J2398q13o184
13999D18j0393k592J7342J7387l032k391J794P200j3582P066J0525O214p633k5713
13985B610j6911m578k548k783J2363J5790J4328K6600j441j7794r43j4862l5K9170
$$ y = [11010, -6137, -2640, 14905, 20453, 25640, 32080, 40665, 38692, 15920, -6256, -4397, 5523, 3463, -6836, -18967, -9366, 14656, 33613, 45893, 51620, 39475, 25618, 33064, 31784, 29247, 11446, -3823, -10137, -25016, -22019, -8480, -8950, 9655, 39823, 43662, 20922, 51, -10618, 9356, 30307, 46572, 63740, 46244, 28751, 25122, 31827, 25886, 23154, 29316, 18445, -5015, 14625, 48660, 28939, 3987, -15000, -16567, -22815, -12297, -17793, -26035, -1627, 11373, -14274, -30047, -28698, -12026, -15700, -25283, -36822, -22027, -7975, -4637, -4983, 7415, 6602, 418, -9975, -12567, 4775, 22162, 19130, 16739, 18533, 25733, 12151, 19217, 29742, 35956, 28323, 2610, -14301, -18879, -21427, -24210, -11847, 3943, 18271, 44871, 43430, 25636, 24693, 9831, 9796, 38966]
13971C8966n530j2716o982K47l413Q288L370k9722j1686J1468O847m391j0477
13958a5731j6704J1474J9018K6283O427l962n664j876R027j70j3071J4647j9922
13945I776k8152J9209J2686j7446m065L018r803J4915K3730L572q416p94n04j4294
13931C432k632l070L480m604k542j662n263R532J6813N351k3102j5137J9169J6454
13917A6219m934J1963L442K2506J650k2676l430N483P350j4038P803J0572j2200
13904B9710r134o568l810J790N265j0519r338J2284j843j2785q422K2231J6635
13891B5496j3590r584J4212p790l589n487q69J5040J0180o921O967j7264j4640
13878g839O246q952k288R226O382L385J5595n965j2391J0152j0533M059J8240
$$ y = [38966, 33436, 20720, 13738, 13985, 10572, 18860, 22230, -7492, -19178, -7710, -863, -5254, -15731, -32435, -20961, -1943, 24340, 30767, 26805, 21141, 19265, 28292, 28122, 15051, 29698, 9776, -18376, 833, 13519, -3927, -7992, -4974, -14777, 138, 23868, 27440, 19024, 18230, 17726, 3432, 800, -2270, 1210, -3394, -5936, -7598, -12861, -3329, 13484, 18835, -4267, -19404, -235, 16219, 11285, 23248, 26690, 49196, 50846, 28170, 24740, 30223, 37573, 23535, 31338, 41910, 29710, 20576, 14008, 10198, 11988, 17253, 6734, -2604, 9680, 7837, -4948, -13370, 8861, 25496, 11906, 2322, 16534, 8744, 5155, -332, -1201, 13839, 24019, 17098, 24065, 6801, -7839, -1593, -10545, -12833, -3607, 2775, 6160, 21755, 15790, 3399, 13551, 3018, 7077, 25317]
13865B5317J5600k236r992n16j891l1763j9549J3069N403P055q860O939N458J272
13851E306P060J3880o428j6096q865q573j4672L225O504P438j7245J3910N188
13838i368M636Q898N742m962O64j0535J6311k354J7167l752j2122r837j1668K6969
13824A5789J6772N528j0289l8416k8511K8903J0900M938m372n585K1987o506j2213
13811a075J504p221l940j7936j2689L2604J0414m587J9972P83j8915j0770J7467
13798E611J3428L016J2957Q455p257j4133o085j1589l031J3099n538o910L015
13785E038M842J613j2119o479J3024L198j115q320K431O87M199j2758R20Q076
13771C237M12N080j8714q796J5700l797k210m402K2751R478j1294K7543k558p144
$$ y = [25317, 40917, 38681, 28689, 28173, 26282, -5481, -25030, -11961, -6558, 497, -8363, -1424, 4034, 5306, 12366, 26246, 19818, 3722, -5143, -13716, -28388, -25163, -18659, -11221, -28466, -14556, -9368, -4732, 4166, 9908, 4946, 5610, -4925, 11386, 9032, 26199, 22447, 10325, 488, -11180, 15789, 32561, 38089, 27800, -10616, -39127, -10224, 676, 5614, 1242, -4343, 17644, 11138, -1075, 429, -6792, -10732, -28668, -41357, -8753, 1661, -2926, 17046, 17829, -1086, -11856, 5611, 19039, 22055, 35012, 43467, 36210, 22077, 15992, 4403, 1372, 14471, 8933, 2023, 5038, 9880, 11493, -626, -7105, 5919, 9117, 8002, -318, 2113, 2800, 6999, -5759, -4839, 3237, 3649, 8729, -9985, -18781, -3081, -6878, -9088, -13490, 9261, 18739, 7445, 34988, 32430, 25286]
13757B5286J4483J139J223O386j7611k6959k738r210r717N863J1277L0697J206
13744C1325n961j1379o142J728q782l458p241p228R090k143o163j1555j240K2096
13730g053P968l4870L460J1215J1873J5261O489J1182j4941j3893j2791J8633
13718B533J2655q052l1547p98J9325j6349k6295L928K4642R120o633k177K4437
13705D789K1124j9249k2771O293J3522r183m860M538q495k591Q920J3256k99R719
13691A4713j589J9917N863N115M808l0999n185J3184M457R530k32m850j181j6380
13677A7171o466r84J466j5369j8830j144J2573M809K1777O181k931l06j8092p475
13663g620k198j5174R323J4494K6156J3895q340K542o387j7492j3051K914K243
$$ y = [25286, 39769, 40908, 42131, 48517, 30906, 3947, 1209, -8001, -17718, -11855, -578, 30119, 31325, 25364, 13985, 7843, 9571, 789, -2669, -9910, -17138, -8048, -10191, -16354, -27909, -29149, -7053, 915, -33955, -30495, -19280, -7407, 7854, 14343, 25525, 10584, -3309, -16100, 2533, 15188, 7136, -24411, -25209, -5884, -22233, -48528, -44600, -19958, -10838, -17471, -19648, 4789, 25913, 6664, -16107, -9814, 3708, -5475, -10335, -5797, -14292, -16883, -7963, 5293, 4994, 14713, 13124, 33041, 38904, 44019, 48827, 17828, 12643, 25827, 30284, 39814, 39582, 34732, 33551, 17171, 10705, 9721, 11187, -4182, -23012, -24156, -11583, -6774, 15003, 21184, 18253, 17947, -145, -7620, -9818, -24992, -15669, -1175, 24981, 38876, 30536, 33078, 26691, 9199, -3852, -938, 1305]
13650A305P873q574j1732J4482L644J0565j559r978P852R535j5819r956J5429
13637A3067q382N84J8056P875k0519L960k903J863J2754k2850J337P648L702O606
13623B2798n351j334L898K61J6438r360l801k514j3634j0216J6504l207J4625
13610B5107J467k3515k378k652n970j2671Q671J5493P262K0562L204p82k2041
13597A1757n343J3530K2512K796j2174k1423l375K1057J0939j5385k4002q849
13585g960l414K0911J0542K4970K043k6446L943K1394P79k4185J0067J9269L13
13572E2226k8565j3754j3810K0343J3910J400p287k83n695l0599O198l023n003
13559a3942N368j002j4559p542K6527J8202p312k9382K761J1457J8314J1961j0655
$$ y = [1305, 9178, 604, -11128, 3354, 6998, 17563, 16004, 6026, 13878, 23413, 7594, -2362, 13067, 4685, 5269, 23325, 31200, 10681, 14641, 11738, 13601, 26355, 3505, 4842, 12490, 16192, 22798, 17447, 16113, 20011, 20272, 36710, 27350, 23549, 21035, 7401, -2815, 13689, 10482, 25107, 26574, 3059, 681, -1971, -7941, -20612, -11941, 3552, 10814, 31376, 34580, 33798, 11757, 6414, 19944, 42456, 45252, 33078, 11655, 8280, 29337, 40276, 24891, 889, -7960, -11374, 9537, 20079, 45049, 47092, 20646, 24589, 45983, 46762, 22577, 32644, 51913, 52226, 23661, 9907, -3903, 16440, 30350, 31750, 24463, 24180, 18485, -12114, -5916, -8939, -13942, -8574, -9576, -24135, -31677, -5150, 13052, 5740, -23642, -20881, -9424, 8890, 20851, 10196]
13546A0196K1687l954k6037j791M890J3051m111J6164l09p300M186j396q468M906
13532B1714j3500J2242J06j5819p319j9316p694N139J3306J4906J9003j3683J2327
13519B1412M824k4610K3625J7995k4272j5008j4785O166J7727L6456j811j4121
13507C3598k2402q773j417J8265M194k8301o912J9028N642j7723K111J1236J6716
13494B5262N945J8265l888m1641j1171P505J0064K7941k0126j1085M72J1157N050
13481B3750o201l28Q585J0410q338m586M618J3916j6577k3847m864P829j1154
13468f787K9649K1918o238j417p947m339l219J8201K6211Q75m989k5731j6670
13455A9517J7661q621j8713m354J0193P732q877o287j1281r271j3991J4052K2139
$$ y = [10196, 31883, 27929, 1892, 101, 4991, 18042, 13931, 30095, 29786, 22486, 26672, 25276, 16808, 21714, 8214, 20456, 20562, 4743, -2576, -21892, -29586, -24447, -11141, 3765, 22768, 9085, 21412, 26236, 1626, 25251, 43246, 18974, 3966, -10819, -4653, 13074, 49530, 47719, 33598, 11196, 2423, 1006, 19271, 23465, -4836, -11748, 7280, 12922, -4801, -2690, 8546, 25262, 31207, 49472, 45584, 3943, -7228, 277, 10341, 38282, 18156, 7071, 7543, 18700, 23750, 17549, 17221, 25806, 36216, 27878, 23292, 27910, 41826, 25249, 1402, -3462, 4367, -6787, 22862, 44780, 38542, 37125, 29178, 24839, 21620, 39821, 66032, 66907, 61918, 36187, 19517, 37178, 28557, 9844, 5490, 15683, 23415, 14538, 8251, -3030, -12301, -26292, -12240, 9899]
13442I899K3852M297q125j2970J6005M707k4461K573L657p846Q489J6084J507
13429C7668j6527j4317r068j2331k870p698j0448q043P851J298Q898P503L7751
13416A9667K3695K1813K271K0711K2031K9683j47L0536N0916P0869P7846J24836
13404D94727J88837K46980L48658K75623J03000p7975k23262k96363k92373k19984
13394E47868j19921q9885p8748m2841l2447n0789k2297j713q257r379j1408j7978
13382F2205K497R82l065Q6L629j9351j206K673N538o612p06p688K5997K8033J3108
13367A06120R971r714j1608k3998j6458r342J6592J0153l744k3727k0901J8579
13355D1923J1059J180n78J3342M540j1001n447j2499L384J1327k3108k7977k316
$$ y = [9899, 33751, 38048, 29923, 16953, 32958, 37665, 13204, 15777, 19434, 11588, 20077, 36161, 37668, 21141, 6824, -2244, -14575, -17445, -25143, -35591, -43634, -35783, -34485, -25587, -18084, 19667, 43362, 65175, 67446, 88157, 110188, 139871, 139724, 170260, 221176, 292045, 369891, 494727, 683564, 930544, 1279202, 1554825, 1657825, 1579850, 1356588, 1060225, 767852, 547868, 427947, 338062, 259314, 216473, 184026, 133237, 110940, 109227, 100970, 91591, 80183, 62205, 64702, 65684, 62619, 62705, 66334, 46983, 45777, 48450, 53988, 47376, 46670, 38982, 64979, 93012, 106120, 116091, 106377, 94769, 70771, 54313, 44971, 61563, 71716, 67972, 44245, 23344, 41923, 52982, 54162, 53584, 66926, 71466, 60465, 55018, 42519, 45903, 57230, 34122, 6145, 3829]
13342C829K6108l061K865j005L037L404O095P48k6172n5254J5330M0840J9050
13329C5814k458L342K6599M463j0953l921O233J1534j9721k8805Q167J6635k3772
13316B3157j3717K0354L0532P824J5358Q421L4j2922l5644Q102J584j4426O296
13303D4953R521O431k127O10j94q495n506q086N155Q542j293l395M915k0158m74
13288C0399L513P983P10J4990J1501R42N387n821J4961m040k1280j6067J8065
13275F1243J5582N91p425k925k763J2985j0138j2507l458l55k7401j8295J2119
13262A7253P738q288J2867J4661K63P109J203k424j9146r702k542n726k533N173
13248A5906K0699n398l458n155j1864l536n105J555L482K7371O159j2102J164
$$ y = [3829, 29937, 26876, 29741, 28736, 31773, 35177, 41272, 42020, 15848, -39406, -24076, 16764, 35814, 33356, 36698, 63297, 67760, 56807, 52886, 59119, 70653, 50932, 22127, 30294, 46929, 23157, 9440, 29794, 60326, 68150, 83508, 91929, 91963, 79041, 43397, 51499, 53083, 38657, 44953, 54474, 60905, 58778, 59388, 59194, 50699, 45193, 37107, 42262, 50804, 49511, 46116, 51031, 30873, 30399, 33912, 41895, 42605, 57595, 69096, 70038, 75425, 69604, 84565, 80525, 59245, 43178, 61243, 76825, 77416, 69991, 67066, 64303, 77288, 67150, 54643, 51185, 50830, 23429, 5134, 17253, 24991, 16703, 29570, 44231, 44494, 51603, 52806, 50382, 31236, 21534, 18992, 13266, 10733, 15906, 36605, 31207, 27749, 22594, 10730, 7194, 2089, 3644, 7126, 34497, 40656, 28554, 29718]
13235B9718p710l094o144J3077J3670K906j3618o841J8195J0953j668j314o198
13222D1932k899j3028k99J2347Q427N699q010R068L0149M0565M2345K9918R722
13209B05936j7812k3999q270R157J32n645p579k1293j9624l8679K187j3519l8330
13196B2662J6186J2400p295j7178J7335L193j1831j3516Q081Q1K015J1137k663
13183D0607j0554k1875k741J2860J1798J8472J6545M22j6378J294j3948j1163
13171B5339o72M373N097P502r871j9958j6219N452n658L668N291M879o84m356
13157D183j7494K7346K3846j8271k018k2702j5407j1554k8504n1516q9357j25719
13145c27167j30745m7173J5327N4491Q7769Q6380Q3827O4303J6223j6287K0995
$$ y = [29718, 22008, 18914, 12770, 25847, 39517, 42423, 28805, 21964, 40159, 51112, 49444, 48130, 41932, 39033, 26005, 25706, 38053, 46480, 52179, 44169, 53237, 83386, 123951, 166296, 196214, 205936, 188124, 164125, 155855, 165012, 165144, 159499, 151920, 130627, 111003, 72324, 74511, 60992, 22662, 38848, 51248, 43953, 26775, 44110, 47303, 35472, 21956, 30037, 30118, 32133, 43270, 40607, 30053, 8178, 5437, 18297, 30095, 48567, 65112, 65534, 49156, 50450, 36502, 25339, 24667, 29040, 34137, 41639, 31768, 11810, -4409, 1043, -4615, -947, 4344, 9223, 8539, 4183, -13311, 14035, 37881, 19610, 17592, -5110, -20517, -32071, -60575, -112091, -201448, -327167, -457912, -505085, -489758, -435267, -347498, -261118, -177291, -112988, -96765, -113052, -92057]
13134i2057P635K5815k899J1099l092J3503J2470K984M197q212j9332k2963k5
13121g0877o520k2641j7172k1714k7638k5639k248m9712l1280J3122J16426J54320
13109H427J65377J07512N8378K0462j5165o953L797l1256k6169P890j0481k6796
13097B55023j972j1778r249J221K1198J6598p779Q76Q808J4799K6211L1838L9523
13084C85317N3089J6611l3077n1427r6256p2067o7170q419J8370q303p513l417
13072A25738N305M732R451j8019q372j1035k582O308N546n396J603j614k2557
13059H9108M068K3325J0580P913J661P22J7258L0528k681l469k46K2953J953K69
13045B03942J761J444Q049K4950p919m863n082O826j888r873l1218N821J7389
$$ y = [-92057, -84422, -58607, -61506, -50407, -53499, -39996, -27526, -24542, -20345, -28557, -47889, -70852, -70877, -77397, -100038, -117210, -138924, -166562, -192201, -194449, -244161, -275441, -262319, -145893, 8427, 173804, 281316, 339694, 360156, 344991, 338038, 341835, 310579, 284410, 292300, 281819, 255023, 253051, 241273, 232024, 233245, 254443, 271041, 263262, 264138, 272946, 287745, 313956, 345794, 385317, 438406, 455017, 421940, 370513, 274257, 202190, 135020, 126601, 144971, 136668, 129155, 125738, 131043, 135775, 145226, 127207, 118835, 107800, 105218, 111526, 117072, 111676, 113279, 111665, 89108, 93176, 116501, 127081, 134994, 136655, 137377, 154635, 185163, 182482, 179013, 178767, 201720, 203673, 203942, 205703, 207147, 215196, 240146, 232227, 227364, 222282, 229108, 227220, 217347, 186129, 191950, 209339]
13032B09339K3987K834L281r673L779J0082K3657K5184J2369K0011L0153L6232
13020C91235J4203J1351J1637J7988K4146J965q364j0568j0680Q540j141J0402
13008D60714L825m763K025R757L0806N5141N2937O5150M1940J8884L5304N3546
12996H25266M6379L8278O1201N4913M1013N6310O5215O0367L9861N4323Q3114
12985A426240J16537J36860J55324J75186J91160K03348K08014K64735L13120
12976C190524L40147M00299M77375N45618O59697Q03923R48340J139289J420327
12967I925539J797260K384427L188372M311974N921541Q184978J1540508J7087037
12959F4341636K6660718M2080398O1084791O9546996N0613128J1863439k9606874
$$ y = [209339, 233326, 236160, 239441, 229768, 233547, 243629, 267286, 292470, 304839, 324850, 355003, 391235, 405438, 416789, 428426, 446414, 470560, 472525, 464161, 453593, 442913, 451453, 450312, 460714, 464539, 459776, 461801, 471558, 502364, 557505, 610442, 675592, 717532, 736416, 771720, 825266, 871645, 909923, 971124, 1026037, 1067050, 1123360, 1188575, 1248942, 1288803, 1343126, 1426240, 1542777, 1679637, 1834961, 2010147, 2201307, 2404655, 2612669, 2877404, 3190524, 3530671, 3930970, 4408345, 4953963, 5613660, 6417583, 7365923, 8505212, 9925539, 11722799, 14107226, 17295598, 21607572, 27529113, 35714091, 47254599, 64341636, 91002354, 133082752, 194167543, 263714539, 314327667, 326191106, 296584232]
12952B96584232n7312635o4371814n1251305l4281047k1976764j4511512j0139240
12945D2739915p389636n550629m246208l363728k784575k333229j969198j630354
12937A3472358j342019j127429r03477p72130o35496n00178l63924j87205l3244
12928G607256K43309O88442J307575J913199J914324R96900m54393j702250k318299
12919A0196063k220062j647058j082190p24537n34684l82567l03607k46741k13183
12910B841434k05091j90317j38138j15697q4292p8222r6502j02640j14728j21698
12900A594109j19140q0304m7528o1031o6169p5737p7554o3878k1146k2492n3376
12889I05754m7202l7182k7181l1252k2037l3433j2895m884m469k0034j6742k9334
$$ y = [296584232, 239271597, 174899783, 123648478, 89367431, 67390667, 52879155, 42739915, 35350279, 29799650, 25553442, 22189714, 19405139, 17071910, 15102712, 13472358, 12130339, 11002910, 10099433, 9327303, 8691807, 8191629, 7827705, 7640500, 7607256, 7850565, 8539007, 9846582, 11759781, 13674105, 14671005, 14216612, 12514362, 10196063, 7976001, 6328943, 5246753, 4522216, 3987532, 3604965, 3301358, 3054617, 2841434, 2636343, 2446026, 2307888, 2192191, 2107899, 2029677, 1933175, 1830535, 1715807, 1594109, 1474969, 1394665, 1347137, 1286106, 1219937, 1144200, 1066646, 1002768, 981622, 959130, 905754, 858552, 821370, 794189, 762937, 740900, 707467, 694572, 689688, 685219, 665185, 648443, 619109]
12877F19109j1057q540l2408j4172k6883j3717J0558p759j0589m875j9239k8605
12865D51823j2660j3613k1310j3197q497k5341P765P055N859j2202j4779N116
12853C56019J7617J2923L946q58k012k5306j885J785j9750J0526J7672n984j4746
12840C49947k3986j1231m277R261K800J6711J2387J7656L5912o640k6076n0111
12828C22353j09506j10554n3986k0382R668j6418L205K1863l579J4130P586j2183
12816E2197j2490q998N920k0801j3967P874N575j0425n558k0644k4502k7258k7675
12803a00752m5985j0304K4872J13580J36814J46331J15715Q4672J1911J54l0520
12792D46488j6327m5444n5863q477j5753j7560k8797N3K672J711M723j522j7130
$$ y = [619109, 608052, 599512, 567104, 552932, 526049, 512332, 522890, 515131, 504542, 499667, 480428, 451823, 439163, 425550, 404240, 391043, 382546, 357205, 364970, 372025, 377884, 365682, 350903, 356019, 373636, 386559, 390505, 389647, 387635, 362329, 360444, 362229, 342479, 353005, 370677, 364693, 349947, 325961, 314730, 310453, 319714, 322514, 339225, 351612, 369268, 405180, 398540, 372464, 322353, 212847, 102293, 48307, 27925, 37593, 21175, 24380, 46243, 42664, 56794, 64380, 52197, 39707, 30709, 36629, 15828, 1861, 9735, 15310, 4885, -673, -21317, -45819, -73077, -100752, -146737, -157041, -132169, -18589, 118225, 264556, 380271, 464943, 476854, 477008, 446488, 430161, 384717, 328854, 320377, 304624, 287064, 258267, 258320, 260992, 262703, 267426, 265904, 248774]
12779B48774J0110L3675r5j4598N322J1060k638J0069K0144K5524N2011P3896
12767D73254J13056R3796N3180p286r5759j23052r2485o8834n8092j6715j1332
12756B59731j515j6100k6466j5798j44n371k0300k1024N396R216R45J2243j2209
12743A68604J4704J0152j6074R62J0609j7586k2719N925N383L01K2633o389l0087
12730A46418J0056K8247P99j3440j5634j0548j0782J3053p118K3578J7128j5289
12718A66468l29J5355M350q585r808j4663K401j1371J1646K6818n116j3080p534
12705A56552q692J0127N767P40j6072j2921j255J790J5685n439l410j856l3711
12692A07305p64J7482j588J6404J4105O57j4394J2323j3274J2981J6865k235q701
$$ y = [248774, 258884, 292559, 292464, 277866, 283188, 294248, 291610, 301679, 321823, 347347, 399358, 473254, 586310, 680106, 733286, 726000, 630241, 507189, 414704, 345870, 287778, 271063, 259731, 258216, 242116, 215650, 199852, 199708, 194337, 174037, 153013, 158409, 167625, 168570, 180813, 168604, 183308, 193460, 177386, 178348, 188957, 171371, 148652, 154577, 159960, 160261, 182894, 176505, 146418, 156474, 184721, 185520, 172080, 156446, 145898, 135116, 148169, 141051, 164629, 181757, 166468, 166139, 181494, 185844, 177259, 167451, 152788, 155189, 143818, 155464, 182282, 177166, 164086, 156552, 147860, 157987, 163754, 164494, 148422, 135501, 134246, 136036, 151721, 146282, 142872, 141016, 107305, 106541, 124023, 122435, 138839, 152944, 153601, 139207, 151530, 138256, 151237, 168102, 165867, 157166]
12679A57166j8132n356l853p923P852J4411k825l993J380j0232j728R056Q975
12666A44798k1780k8362J967L33J112K518N083K3315J6077p561J0248r388q031
12653A30329J2441J7191j3154L666j9923j3521L483M181o378k8620k7602k9679
12641C2414l704j876p88J6078Q650J697j473K2013K665l988M932N387K5362J758
12627A09127J7474q636k5678J0446K3076j6145n891l595K687N454l5J2245r93
12614A19536m727J333o032n594j1792o526N826n312o502R073J4704q470j2612
12601H2905n165j691K8686l462k5062p532o928J3959J6226J0184R045K4134j346
12588A33953l0572j4892K1499M720k466J3875O256n930n109M375J5875r816r754
$$ y = [157166, 139034, 133678, 129825, 121902, 129754, 144165, 141340, 137347, 138727, 128495, 126767, 135823, 144798, 123018, 94656, 96623, 96956, 98068, 100586, 105669, 128984, 145061, 137500, 147748, 138360, 130329, 142770, 159961, 146807, 150473, 130550, 117029, 120512, 124693, 118315, 89695, 62093, 32414, 28710, 26834, 26046, 42124, 50774, 52471, 50998, 73011, 75676, 71688, 76620, 82007, 107369, 109127, 126601, 117965, 92287, 102733, 125809, 109664, 103773, 100178, 102865, 108319, 108284, 120529, 119536, 114809, 116142, 110110, 104516, 92724, 86198, 92024, 86712, 80210, 89283, 103987, 95517, 82905, 77740, 76049, 104735, 101273, 76211, 68679, 61751, 75710, 91936, 102120, 111165, 135299, 133953, 103381, 88489, 109988, 114708, 112242, 126117, 132373, 126443, 121334, 125709, 141584, 131768, 122014]
12575A22014O627l607K517n537p331j5921p680K7856l352p43O588P962j720j6586
12561A11087j2970j9683k189j746J4970K0840J8639K3268j4231j6946r07j5907
12549A04225m425k4680o372O016k351O873J4558J2298J1873j9785j79q211j7205
12536G2635N813J9820K7337M166j8255L816Q124J6791K5065P722j218j5620j2849
12523A43347K1744O870j4944j3041K0493J747n877j9252k836L1754L6418K4252
12511B30675J9475K4318N1211O2623P5077J62642K28846K98789L01829K39437
12501A694922O6070j53800k51774l12303k55342j72267j29900q0401m0231j3241
12491C51733k7037k1383K4148P300j7145m0525j7575j4717k5206j6817N862J9251
$$ y = [122014, 128641, 125034, 127551, 122014, 114683, 98762, 91082, 118938, 115586, 114843, 121431, 129393, 127673, 111087, 98117, 78434, 76245, 74499, 89469, 110309, 128948, 152216, 137985, 121039, 120132, 104225, 99800, 75120, 68748, 74764, 72413, 79286, 93844, 106142, 118015, 98230, 98051, 89840, 72635, 78448, 98268, 125605, 129771, 111516, 115332, 123456, 140247, 165312, 173034, 171816, 156196, 143347, 165091, 171961, 157017, 143976, 164469, 166216, 160339, 141087, 138251, 170005, 206423, 230675, 250150, 274468, 325679, 388302, 463379, 626021, 854867, 1153656, 1455485, 1694922, 1760992, 1607192, 1355418, 1043115, 787773, 615506, 485606, 405205, 364974, 351733, 324696, 303313, 327461, 334761, 317616, 277091, 259516, 244799, 219593, 202776, 208638, 227889]
12479B27889J3043o183j0030j8624j1371J9978K3976p163m03r468o207n386k1791
12466A88260K246q867r275q666Q705M869j9108k93K3307L1372j857k0294k1474
12453A68925j5061J7665J3036p327k223Q303Q878m024q729m690l513L051n715
12440A68576r61L425R07j6048k0509J184Q288J4410j076j0569P601l391j32N909
12426A57614j330j646M665O607K0028j5545Q962j3503k586j0497r543M248J9521
12413A66995R898K0184L726o376l914n271m612n724J5993O328K956o854j7964
12400A75365r242L391L2664K0587J0052j0856j3092j7679q436j9073o90R840R474
12387A82305r684j5526l6K7358J0883k763m735J9358L720l362K200j0935L570
$$ y = [227889, 240932, 234749, 224719, 206095, 194724, 214702, 238678, 231515, 231112, 221644, 215437, 210051, 188260, 190506, 181639, 172364, 163698, 172403, 177272, 158164, 157871, 181178, 212550, 210693, 190399, 168925, 153864, 171529, 184565, 177238, 175015, 183318, 192196, 188172, 179443, 174753, 171240, 174291, 168576, 167615, 171040, 171947, 155899, 135390, 136574, 144862, 159272, 158196, 147627, 155228, 151837, 151705, 157614, 156284, 154638, 159303, 165910, 185938, 170393, 179355, 165852, 163266, 152769, 143226, 147474, 166995, 176893, 197077, 200803, 194427, 190513, 185242, 180630, 174906, 190899, 197227, 200183, 193329, 175365, 166123, 169514, 202178, 222765, 232817, 221961, 208869, 191190, 182754, 163681, 162991, 172831, 182305, 172621, 157095, 157059, 184417, 195300, 192537, 187802, 207160, 210880, 207518, 209718, 198783, 202353]
12374B02353P009j5219p36P602M540k0667j2421k042m595J5150O657K693j4410
12361A75914o526K0052J7062k312k2458O484J0832N215l880l552J2378o397j1570
12348A91242Q04k889J607R184J7375L593Q563k324N065j3936J0200N419j7943
12335B15960K388K26j3158j3963m008l22K6442o772j215J7485k270J6576M740
12322B42109l965L1819k104p852k4788q022J8054O178K0216J3518J0241O923k3760
12309B78567j9397R275j9148k7533r741J0121J0291R867J1279j1106l137J1492
12297B50830L764J2555R006j3968q969J321L05m569R042J2474K503L709J2102
12284B90105Q09l511K5396N866j0117j6751l0811n130J7023J4003J2189m202m162
$$ y = [202353, 209362, 194143, 193407, 201009, 205549, 184882, 172461, 170419, 165824, 180974, 187631, 190324, 175914, 169388, 189440, 206502, 204190, 181732, 188216, 199048, 204263, 200383, 196831, 209209, 202812, 191242, 192046, 189157, 190764, 199948, 217323, 220916, 229479, 227155, 232220, 218284, 228484, 233903, 215960, 218348, 218574, 205416, 191453, 187445, 187123, 213565, 206793, 205578, 223063, 220793, 237369, 242109, 238144, 269963, 267859, 260007, 235219, 227197, 245251, 251429, 271645, 285163, 295404, 302327, 278567, 259170, 268445, 249297, 221764, 212023, 222144, 232435, 242302, 253581, 242475, 239338, 250830, 254594, 267149, 276155, 262187, 253218, 254539, 254844, 250275, 259317, 271791, 274294, 278003, 290105, 290914, 287403, 312799, 318665, 308548, 291797, 260986, 255856, 272879, 286882, 299071, 294869, 290707]
12271B90707j4128J3539N907o400Q273J6229K553J0018j60j6501j8754N172J6181
12258C12636K422k4987J3121K0470l838L392J841J4297O996J5778j1986k1189
12246C28953j227K821J0883j445j0136J696J330J1039K3588k217J7885J4422O772
12233D04364k665p762j0051n385j0013m574K0390J2670J7735k112j7627Q772j689
12220D02053K5494J1801k5572j0320K0281L6715j6273j3538K047j1841m937j0657
12208D05253K111K0961O287q944R490K0127k317j1558j557K9307R727M738K547
12195D86172L778J971j8853o52J818j823N456L872J5711k314n696j8217o474J3054
12181D77803K4906K3229K2625pr278q540k5752l911J6964R757L075j5545m909
$$ y = [290707, 276579, 290118, 296025, 289625, 297898, 314127, 316680, 326698, 326538, 310037, 291283, 296455, 312636, 315058, 290071, 303192, 323662, 319824, 323216, 325057, 339354, 346350, 362128, 350142, 328953, 327726, 330547, 341430, 339985, 329849, 331545, 332875, 343914, 367502, 365285, 383170, 397592, 404364, 401699, 393937, 383886, 378501, 368488, 363914, 384304, 396974, 414709, 412597, 394970, 403742, 402053, 427547, 439348, 413776, 403456, 423737, 460452, 444179, 430641, 432688, 420847, 415910, 405253, 407364, 428325, 434612, 425668, 435158, 455285, 452968, 441410, 439853, 469160, 478887, 483625, 486172, 489950, 491921, 473068, 472416, 474234, 472411, 477867, 481739, 497450, 495136, 489440, 471223, 464749, 477803, 502709, 525938, 548563, 548556, 539278, 530738, 504986, 501075, 518039, 527796, 530871, 515326, 510417]
12168E10417J3900K4339J2595n731M20J805K3519K0083J3507o587l8154m902K9268
12155E94479J2471p311O245L015J2718n960r301K118K6699K7431m180L288q143
12142F53569j1815K2557K0677P783J2450K2783j6572k27J1487r13m774m501M470
12129G16974J7174j5M51O654K0129J1288l259j6114O511K2211K995N742q49j757
12115G88135J4507M414J3020r571j706K0469J7036L0432L9115J3565O001l944
12103I31473P55j9525k1466J4157N239K4730J5296J7526L275l129K1021j6315
12091I73037K250J3373J6243J1450J6568J4530k806R922Q993J7716n757n113J4516
12078A084922M2522K3326j4504K816L0266K3296P541J4237L351k6658J2613L6349
$$ y = [510417, 524317, 548656, 561251, 555520, 555940, 557745, 581264, 601347, 614854, 608267, 570113, 565211, 594479, 606950, 599639, 605884, 608899, 621617, 615657, 606356, 608474, 635173, 662604, 658424, 661712, 653569, 641754, 664311, 684988, 692771, 705221, 728004, 711432, 711205, 722692, 721779, 717005, 712504, 716974, 734148, 734133, 734584, 741238, 761367, 772655, 769396, 753282, 759793, 782004, 784999, 790741, 789892, 788135, 802642, 807056, 820076, 810505, 808799, 829268, 846304, 876736, 915851, 929416, 935417, 931473, 932228, 912703, 891237, 905394, 910633, 935363, 950659, 968185, 971460, 968331, 989352, 973037, 975287, 988660, 1004903, 1016353, 1032921, 1047451, 1044645, 1054567, 1063560, 1081276, 1075519, 1070406, 1084922, 1127444, 1150770, 1136266, 1139082, 1169348, 1192644, 1200185, 1214422, 1217773, 1191115, 1203728, 1240077]
12066A240077O106j2263R236J6286k2778n828K3960N5473N0204J0799O352O812
12054A384436P254J128R817K4693K3856J9548k8957k3461K2429M1783M7642J3199
12042A543367j074K8904L0039j291J4622K6214J6502L189q037K6633J4568K2286
12030A715922J6493J1995J3888L1599L3257K9411K9349K867P928k727l525K6928
12018A913385L8688L0372J7924j2616K644L6847K1105K1191J5141J7689K0823
12007B123193J5041L0470K6001K2224J3832P579J6016Q274J0928L6746L5633K7700
11995B373637K0407K3169J1788K0970K4776J119L5834L3352J5560N24J7028K9488
11983B607652J9935K6536J630q47q105L3140M2640L1957K4578K8614J8860L170
$$ y = [1240077, 1246183, 1233920, 1243156, 1259442, 1236664, 1230836, 1254796, 1310269, 1360473, 1371272, 1377624, 1384436, 1391690, 1392818, 1402635, 1427328, 1451184, 1470732, 1441775, 1418314, 1440743, 1482526, 1530168, 1543367, 1542293, 1571197, 1601236, 1599945, 1614567, 1640781, 1657283, 1660472, 1652435, 1679068, 1693636, 1715922, 1732415, 1744410, 1758298, 1789897, 1823154, 1852565, 1881914, 1884781, 1892709, 1889982, 1886457, 1913385, 1952073, 1982445, 2000369, 1987753, 1990397, 2027244, 2048349, 2069540, 2084681, 2102370, 2123193, 2138234, 2168704, 2194705, 2216929, 2230761, 2238340, 2254356, 2262630, 2273558, 2310304, 2345937, 2373637, 2394044, 2417213, 2429001, 2449971, 2474747, 2475866, 2511700, 2545052, 2560612, 2561136, 2578164, 2607652, 2627587, 2654123, 2655753, 2654906, 2646801, 2679941, 2722581, 2754538, 2779116, 2807730, 2826590, 2829760]
11971B829760o179L1455J7104J2705J4994L1209K1074K0686K6868K7483M693m1925
11959B989927m941J7964M0827K2481J3569K9373K5757Q372j7085k869J6794N814
11947C145983l092l008K4784J4964O923J7169O43n935J2981R725r748N502L453
11934C220344Q797K1309K1184m434K903j4928k265M530p982k1025j3753R274J8568
11921C242522R495L718l2894j6881j7952k0148j1818j1091k0821M460P001J8789
11909C154380j5080l4659l2688q668q679K957k6461j8073j6739k8799k8998o539
11897B931954j5859k4640p814K190j8512l4559j5185j7770k7388j3368j6762K823
11885B745110j7429l6263l1823k2547j7453M320k6511j6666P988k8496j4137j9491
$$ y = [2829760, 2823581, 2855036, 2872140, 2884845, 2899839, 2931048, 2952122, 2972808, 2999676, 3027159, 3031852, 2989927, 2984986, 3002950, 3043777, 3066258, 3079827, 3109200, 3134957, 3143329, 3126244, 3123375, 3140169, 3145983, 3142891, 3139883, 3164667, 3179631, 3186554, 3203723, 3204366, 3198431, 3211412, 3221137, 3211389, 3216891, 3220344, 3229141, 3250450, 3271634, 3267200, 3270103, 3255175, 3252910, 3257440, 3249458, 3228433, 3214680, 3223954, 3242522, 3252017, 3255735, 3222841, 3205960, 3188008, 3167860, 3156042, 3144951, 3124130, 3128590, 3135591, 3154380, 3139300, 3104641, 3071953, 3063285, 3054606, 3057563, 3031102, 3013029, 2996290, 2967491, 2938493, 2931954, 2916095, 2891455, 2883641, 2885831, 2867319, 2832760, 2817575, 2799805, 2772417, 2759049, 2742287, 2745110, 2727681, 2691418, 2659595, 2637048, 2619595, 2623915, 2597404, 2580738, 2588726, 2560230, 2546093, 2526602]
11873B526602l3729k4124k3105k3445k3480j2965l2948j9979j8951j1676k3465
11862B278735k4687k6740l4124k9092r069J484j2888l6349k4532o79k0769l3261
11850B028029k2932o397j4110j1340L125P618j9782k3858k6558k1025l3927k7562
11838A831281M829k8039j7908j5606j9590j5058o055J2851k4680m6911l4713j7713
11826A622688J1441M812j6519k6578k9450l6965j8558r004j6995l926J1882j7013
11814A475815q421m890r281j9169j3403l0748j8942k0489j8337k0512r94o337
11802A304292j2661k5045j8885q225j1824L139N342k2240l2647o254N233O580
11790A186805p775l2583k4390j4475N676J8314m296L357q620l1793k3944j6220
$$ y = [2526602, 2492873, 2468749, 2445644, 2422199, 2398719, 2385754, 2352806, 2332827, 2313876, 2302200, 2278735, 2254048, 2227308, 2193184, 2164092, 2155023, 2156507, 2143619, 2107270, 2082738, 2082059, 2061290, 2028029, 2005097, 1998700, 1984590, 1973250, 1976375, 1983993, 1964211, 1940353, 1913795, 1892770, 1858843, 1831281, 1836110, 1808071, 1790163, 1774557, 1754967, 1739909, 1733854, 1746705, 1722025, 1675114, 1640401, 1622688, 1634129, 1638941, 1622422, 1595844, 1566394, 1529429, 1510871, 1501867, 1484872, 1480946, 1492828, 1475815, 1467394, 1462504, 1453223, 1434054, 1420651, 1389903, 1370961, 1350472, 1332135, 1311623, 1310629, 1304292, 1291631, 1266586, 1247701, 1239476, 1227652, 1230791, 1236133, 1213893, 1181246, 1174992, 1180225, 1186805, 1179030, 1146447, 1122057, 1107582, 1113258, 1131572, 1127276, 1130633, 1122013, 1090220, 1066276, 1050056]
11778A050056j9991R470J4003k1914k5725R12r737j6995J446j5655K1196j3877
11766I73189l8573J6227J4711l8505k5645P318M214m589J462k3245l2426p307
11754H46831o71j5964m944k1511k2357O792L737K262K866j3350K193j3934l2921
11741G39029k1819j3018J9892J5082k2443k4474J5023K3193O359L946j3054M963
11729G32679o868r489j8689k0280p030j1802J1643K3496k6431k1732n626m605
11717F35266r969l391m571j677N168J8458k5691j3620n678o277K148o557j9799
11704E63810q27M762m788j1340n33N014J4232j359p472j0628j4738J519q430L688
11690E32910j3876j1593l1281j4455K4286J6832j3073k1017n838k476p363j3048
$$ y = [1050056, 1030065, 1039535, 1053538, 1031624, 1005899, 1006811, 997074, 980079, 981525, 965870, 987066, 973189, 934616, 950843, 965554, 927049, 901404, 908722, 912936, 908347, 909809, 886564, 854138, 846831, 846160, 830196, 825252, 803741, 781384, 788176, 791913, 794175, 797041, 783691, 785884, 771950, 739029, 717210, 704192, 724084, 739166, 716723, 692249, 707272, 730465, 736824, 740770, 727716, 732679, 725811, 716322, 697633, 677353, 670323, 658521, 670164, 693660, 667229, 645497, 639871, 635266, 625297, 621906, 617335, 615658, 620826, 639284, 613593, 599973, 594295, 588018, 590166, 583609, 563810, 562983, 567745, 562957, 551617, 551084, 556098, 570330, 568971, 561499, 550871, 536133, 537652, 529222, 532910, 519034, 507441, 476160, 461705, 485991, 502823, 489750, 468733, 462895, 460419, 453056, 440008]
11678D40008R607K3205R962L66k534o181k3286j5060N096L9145p097k1382k6878
11665D24971j6815n647j3119Q91L6038J0677k836M514j0671k9664j4756o753Q994
11652C85824J3548k908j2691j1112Q90L9686N286N241j0390j5481j7025J1856
11640C92724J1145r687M090k675j9480l4697m879L1860L710j4034j1787J27K6083
11627C72500q463J1346k2078n549M383j9056j4945K3077L00j4080j2924J3950
11615C28461J3290j1237p130j6719j704k4401j6200J6713J758j858J9555l509
11603B97019k2838p449K3383L966q145r102J4658J5704L010j3949j1874R461r112
11590B84732j1950j4831o587r257k8456P048K7697J1882O598R382K499j6354j2273
$$ y = [440008, 449615, 472820, 482782, 483148, 480614, 474433, 451147, 436087, 441183, 480328, 473231, 451849, 424971, 408156, 402509, 389390, 390281, 426319, 436996, 434160, 438674, 428003, 398339, 383583, 376830, 385824, 399372, 396464, 383773, 372661, 373551, 413237, 418523, 423764, 413374, 397893, 380868, 392724, 403869, 394182, 398272, 395597, 376117, 341420, 336541, 368401, 372111, 358077, 346290, 346417, 372500, 364037, 375383, 353305, 347756, 352139, 333083, 318138, 341215, 341515, 327435, 314511, 328461, 341751, 330514, 323384, 306665, 304961, 280560, 264360, 281073, 282831, 280973, 300528, 297019, 274181, 266732, 290115, 294081, 285936, 276834, 291492, 307196, 310206, 296257, 284383, 293844, 284732, 272782, 257951, 251364, 242107, 213651, 220699, 248396, 260278, 266876, 276258, 278757, 262403, 250130]
11577B50130J7120J5127O444q099J2998K0925k3357l7934k4583j2783P773R447
11565B33208j490M90k480k097q676R346J179k392k531J2764J722j2846K434J7574
11551B46205r327j7557j8124M889L900j0161k1656J1017M969n531K3892J9224
11539B31740j7273j911J0089k2543j0628j626M961J1194J3431K4226n693j8692
11527B17275j070N943P994j3934k3461P511R264j7618k6794n034J3097J4863N912
11514A93948K022j830O755R785M923K7048m206j7702j4151k1522k0434k385O892
11501A69143l98k4056r539J1376L0361O331j0868j1725O230Q890N700K292n889
11488A77848o226o05k141K0664K3116R831k5731j6521J998j6610j0918J8515N525
$$ y = [250130, 267250, 282377, 288821, 280722, 293720, 314645, 291288, 253354, 228771, 215988, 223761, 233208, 231718, 232208, 229728, 227631, 218955, 228301, 229480, 227088, 224557, 237321, 239043, 226197, 228631, 246205, 236878, 219321, 201197, 206086, 209986, 199825, 178169, 189186, 194155, 188624, 212516, 231740, 214467, 212556, 222645, 200102, 189474, 187848, 192809, 204003, 217434, 241660, 235967, 217275, 216205, 222148, 230142, 216208, 192747, 200258, 209522, 191904, 165110, 160076, 173173, 188036, 193948, 195970, 194140, 200895, 210680, 215603, 242651, 238445, 220743, 206592, 185070, 164636, 162251, 169143, 168745, 144689, 135150, 146526, 176887, 183218, 172350, 160625, 166855, 175745, 181445, 183737, 177848, 171622, 171017, 168876, 189540, 212656, 222487, 196756, 180235, 182233, 165623, 154705, 173220, 178745]
11475A78745L456j8556J5378N540k2508k1063n09P64j2696m457J1502j4450L480
11462A24626L1510J8264m775m607K6561k501j7999l59m936P129P956R954K198
11449A93021m2252j7723J196R178J5982k0433j1179J6630N688p226o08q089l088
11436A31097P541j1332m545K3696J1030K174j1k2197j0166R820L2035K789O506
11423A78437J0945j1830k1376j0208j3204Q287N000j8708j1260K709J576j9097
11411A01271n958J3810K0973K8789N814k0672k0450k638P591J2253k6417M921
11399A19287K941K133j6017j890N15J5290P314J0463J1225p441l4212k4346R040
11386I4302O168j2371j1161J5852K250O014K218J581r245P254J2374o920k276
$$ y = [178745, 182201, 163645, 179023, 184563, 162055, 140992, 140483, 141247, 128551, 124094, 135596, 121146, 124626, 156136, 174400, 169625, 165018, 191579, 189078, 171079, 170720, 165784, 172913, 180869, 190823, 193021, 150769, 133046, 134242, 143420, 159402, 138969, 127790, 144420, 150108, 142882, 142274, 134185, 131097, 138638, 127306, 122761, 146457, 157487, 159661, 159650, 137453, 127287, 137107, 169142, 171931, 178437, 189382, 177552, 156176, 145968, 132764, 141051, 146051, 127343, 116083, 118792, 120368, 101271, 95313, 109123, 130096, 158885, 164699, 144027, 123577, 120939, 128530, 140783, 114366, 119287, 122228, 124361, 108344, 106454, 106969, 122259, 129573, 140036, 151261, 143820, 109608, 85262, 94302, 100470, 88099, 76938, 92790, 95040, 101054, 103272, 104853, 95608, 102862, 115236, 108316, 106040]
11373A06040j2403j7832J9170J960J1112j648K66J866q806k48J2384M094l1367
11360H4588J2411j5173j1036J273j1622O201K8884N638o93j212k538R137j9520
11347H6338J2K0163p036r915L192J9307j143j2806m310Q065M096n721L235M151
11333A07628j1111j0757j0112j3755K625J3865J4680k3654j693J1562K2122O439
11321A07839L001Q031k3174k4241j8303q350J074N536J5657N547j9154J5750K7657
11308I6870J0043k3630q419J5409L384j0992L0083k074k0564L575j848j424L581
11295I3994r699k226k149j0243p161R957J1781k067p144j0973J985j2761K1596
11282G4890K6194m995o850l47P260M017q366j0053l633J4013N74J198m372o362
$$ y = [106040, 93637, 75805, 94975, 96935, 108047, 106399, 106665, 108531, 99725, 99477, 111861, 115955, 84588, 96999, 81826, 70790, 72063, 60441, 66642, 95526, 101164, 100471, 99259, 96721, 105858, 86338, 86350, 106513, 99477, 89562, 92754, 112061, 110918, 98112, 93802, 101867, 105963, 100242, 103477, 107628, 96517, 85760, 75648, 61893, 64518, 78383, 93063, 69409, 67716, 79278, 101400, 107839, 110840, 118871, 95697, 71456, 53153, 44803, 45877, 51413, 67070, 72617, 53463, 69213, 96870, 106913, 83283, 74864, 90273, 93657, 82665, 112748, 110674, 90110, 93685, 91837, 90413, 93994, 84295, 82069, 79920, 69677, 62516, 72473, 84254, 82187, 75043, 64070, 66055, 53294, 74890, 101084, 96089, 89239, 88892, 96152, 100169, 91803, 81750, 78117, 92130, 92704, 93902, 89530, 83168]
11268H3168m835j1266M580K1160J1186j2780k1071r813j470M088J0879N617K0444
11255I9887Q403N669l1069k6377j4225j7481n654L589J7378L827J2682J8446k712
11242G2363o966Q149J6254R390k527l0034l2886N313M993K0634J2268J545M314
11229H2810l263k925k611P267Q19q191k1879j7488P551J8791J0628l067r842l6113
11215B2487o694j3809j859J2081O788J3180K4988j4064L252J0924j591J835O134
11202F3652P822k1571o227O500p360r598r098K7410J4529P533r673q994r528k1081
11188B4316J7479j17q924J3562q650j920j928J2403J3831J9490j0830j2937K154
11175E7929p629n509o758J4542J2129J9466j1445m4787k8468R419P388J5074J7091
$$ y = [83168, 78333, 67067, 71647, 92807, 103993, 91213, 70142, 60329, 58859, 62947, 73826, 79443, 99887, 108290, 113959, 82890, 56513, 42288, 24807, 19153, 22742, 40120, 43947, 56629, 75075, 72363, 65397, 73546, 89800, 99190, 96663, 66629, 33743, 39056, 44049, 64683, 76951, 78496, 82810, 79547, 76622, 74011, 81278, 82097, 73906, 52027, 34539, 42090, 60881, 71509, 68442, 58600, 22487, 15793, 1984, 125, 12206, 18994, 32174, 57162, 43098, 46350, 57274, 55683, 57518, 63652, 71474, 49903, 43676, 50176, 42816, 33218, 24120, 51530, 66059, 73592, 63919, 54925, 45397, 24316, 41795, 41678, 32754, 46316, 37666, 35746, 33818, 46221, 60052, 79542, 68712, 55775, 57929, 50300, 44791, 38033, 52575, 64704, 84170, 72725, 27938, -530, 8889, 16277, 31351, 48442]
11162D8442R307J0802J1920j7555k6600k068K454K3778j1397n710J8260l145J916
11149F0404J5390j4060m580J445n073J6398J0518L992J3031m723j386k3189l6516
11136C1651m128K9229R275k2012p421q375P420J4334Q357J882j3399j4571R560
11123D1802P301j1501j1403m051J1647Q372K3602l96n034k8006o912j9707j8865
11110a3151L2073K4355N521P138M247j7457m492J9845L6516m309j2037o005o389
11097F5855q150O055L645M293p074k7620m57r771N460Q623j534j4484K409j9619
11083G631n88J9592J1729p029P097R044K538R72J4582n566k2631L814o274j05
11069C4806r356K2070O184r187j6359L70J5664J0258m074J7821j0373k9585M063
$$ y = [48442, 57749, 68551, 80471, 62916, 36316, 34248, 36702, 60480, 49083, 43373, 61633, 58488, 60404, 75794, 61734, 57154, 58599, 53526, 69924, 80442, 84434, 97465, 92742, 91356, 68167, 31651, 27523, 56752, 66027, 44015, 36594, 28219, 35639, 49973, 58330, 60212, 46813, 32242, 41802, 49103, 37602, 26199, 22148, 33795, 42167, 65769, 65373, 60339, 32333, 25421, 5714, -13151, 18922, 43277, 48798, 55936, 60183, 42726, 38234, 58079, 94595, 90286, 78249, 72244, 65855, 57705, 63760, 67405, 71698, 64624, 37004, 36547, 26776, 32236, 40859, 39325, 24841, 27250, 7631, 7043, 26635, 38364, 31335, 38432, 47476, 50014, 50986, 65568, 60002, 37371, 41185, 34911, 34806, 25450, 47520, 53704, 44517, 28158, 28528, 44192, 54450, 50376, 68197, 57824, 28239, 32302]
11056C2302J8691o116J454r981l955J0003J4079j1583J018J9862Q798j0763l506
11043F0303j8292P12K456Q492R261J5043Q275k957M943N274K3277m088j1514j1047
11029I0138j1452J7331L1830J7776L2779J1609j4620k4473m893j7860q524k114
11017A17527K7804K4193K6437K1516L8037R907k0049k1042l9570k5466p968R451
11005A60777J3669J1349J9341R058P378k9496j7679k1031k0696p85k1379j652
10993A08854q485J2348j1773k922J6404K5048j5903n831j6084j6674n815q027
10981G1140j9553P707k742j4940j643r220J821l472k57J8344J0742j6389j536
10968D0002j1845J4133p079K0644n589m0282K8161K8552l1237k0652o03O402J8101
$$ y = [32302, 50993, 44877, 46331, 36350, 32395, 42398, 56477, 44894, 45912, 65774, 74572, 63809, 60303, 42011, 42723, 45179, 53671, 62932, 77975, 86250, 83293, 88236, 93510, 116787, 112699, 101185, 90138, 78686, 96017, 127847, 145623, 178402, 190011, 175391, 150918, 146025, 128165, 119641, 117527, 145331, 169524, 195961, 217477, 255514, 265421, 245372, 224330, 184760, 159294, 151326, 160777, 174446, 185795, 205136, 214194, 221572, 192076, 174397, 153366, 132670, 131885, 110506, 108854, 100369, 112717, 100944, 98022, 114426, 139474, 123571, 117740, 101656, 84982, 79167, 71140, 51587, 59294, 56552, 41612, 39969, 30749, 32570, 29098, 28841, 47185, 57927, 41538, 40002, 28157, 42290, 35211, 55855, 50266, 9984, 38145, 66697, 35460, 14808, 14205, 20607, 38708]
10955C8708J3622j5672j7702j6632j9748O146M211P754K1602j692j0020M254p244
10942G587L294l164O933j0678j0388J2424K1458J034j1694K383N30k679J9690
10929C6730O233j8910j0174K303o443P187J1890J573o796p030J7973L6263j819
10916F8980k4969r168n600j3746J3234J8001j2751j4789N254J9048l514r971R478
10903C9487J2289o252l158l140j2814J2341o499j4569m118J0677O958J5509J0640
10890E7351P60q127k1652j7671j1234j358K6326J1691n476j9450j1009k252J4075
10877A1974J1963K0293J3580n132R054j5334n329J9j0869k3060J7492P365J5165
10864D7181K116j2658P373J3320j5612j271r48J898j7133k0971R615K2987j1655
$$ y = [38708, 52330, 36658, 18956, 2324, -17424, -11278, -7067, 687, 22289, 20597, 10577, 14831, 7587, 10881, 7717, 14650, 3972, -6416, 6008, 27466, 28500, 16806, 19189, 19719, 17040, 36730, 42963, 24053, 13879, 16182, 9739, 16926, 28816, 30389, 23593, 16563, 34536, 70799, 68980, 44011, 34843, 29243, 15497, 28731, 46732, 33981, 19192, 24446, 43494, 39980, 30009, 39487, 51776, 45524, 42366, 39226, 26412, 38753, 32254, 17685, 13567, 24244, 31202, 46711, 57351, 58111, 49984, 28332, 10661, -573, -1931, 24395, 36086, 30610, 11160, 151, -2101, 11974, 23937, 44230, 57810, 52678, 61732, 46398, 41069, 41088, 30219, 7159, 24651, 32016, 47181, 49297, 36639, 44012, 57332, 41720, 40449, 39501, 41399, 24266, 3295, 12910, 35897, 24242]
10851B4242o298K146J6603o298k586j9585m434J5192O093R243J4857j8412j3028
10838A7735J2581J0257n978L362M527J3457o266P2j7135j5946K6468m82J394N732
10824D9778n538j0169k6937k6141j811J777R834K4606J4291j4129j8397L229q214
10811g821P487J1174l292J0161j723r057J5424j0509r98J3636M465q647L577m318
10797A9559k5167J058J0166M746k934j073k7410J0752J0560J778j796j8699j9231
10784c7691p98R380l32O62j4217k2189Q112L8198N055l0259J283j7336k6162J2631
10770g3663J4675M332m660K864J4344J4436q69k3768N149m785j822l890M64n278
10756f2471J8562J6293O507j5427q550p859K5258K1810k730j7735j3332j0704
$$ y = [24242, 17944, 20090, 36693, 30395, 27809, 8224, 3790, 18982, 25075, 34318, 49175, 30763, 17735, 30316, 40573, 34595, 37957, 42484, 55941, 49675, 49747, 32612, 16666, 43134, 42652, 44046, 49778, 44240, 34071, 7134, -19007, -20818, -19041, -9207, 15399, 29690, 15561, -2836, 393, -7821, -334, 10840, 7548, 17709, 15986, 6929, 22353, 11844, 10846, 24482, 28947, 20300, 23877, 19559, -5608, -4550, 5616, 10362, 7428, 6355, -21055, -10303, 257, 2035, 239, -18460, -37691, -38489, -29109, -29441, -28779, -42996, -65185, -57073, -18875, -13820, -44079, -42796, -60132, -86294, -73663, -58988, -54656, -59316, -56452, -42108, -27672, -28541, -52309, -47160, -51945, -53767, -57657, -57193, -62471, -43909, -27616, -21109, -36536, -45086, -52945, -27687, -5877, -8607, -26342, -39674, -50378]
10744e0378J1057M40l117J5655q080L315J3078K8537P443P338K025r347K266r472
10730A0760M165K1916j0233J6975p147p707J8138R979R921l563n174j4536j5169
10717B8325p366J5496K976j5395L1518J2063K2596j9957l0741J7830J424j4150
10705D4619k7389M87M196j82P10Q936J4140l619j4901k65j9015p456j278J3912
10691A2895J8731J5138k784K57P206r033j9258K952J9574k3018k8392N010L204
10678B482p165J589o689J3814P196R663J1034M534j671J8352M239J240P608j8532
10664D7694j1669k414j1477J951K1104k262M126l323j1681J1679L264N626R445
10651F2063j2593j0422R745K0420P29j2266J2512Q596O502L4419L6565R037K081
$$ y = [-50378, -39321, -38881, -41998, -26343, -34423, -31108, -18030, 10507, 17950, 25288, 27313, 17966, 20232, 10760, 14925, 36841, 26608, 43583, 36436, 28729, 46867, 56846, 66767, 63204, 58030, 43494, 28325, 20959, 36455, 39431, 24036, 55554, 67617, 90213, 70256, 39515, 57345, 58769, 44619, 17230, 17717, 21913, 21731, 22441, 31377, 45517, 41898, 26997, 26732, 7717, 261, -1017, 12895, 31626, 46764, 43980, 44237, 51443, 42410, 23152, 26104, 45678, 22660, -5732, -722, 2482, -4683, -3094, -9783, 4031, 11227, 20890, 31924, 36458, 34787, 53139, 57378, 58618, 66226, 47694, 36025, 33611, 22134, 24085, 45189, 42927, 47053, 43730, 32049, 43728, 46992, 52618, 62063, 49470, 39048, 48793, 69213, 69942, 57676, 70188, 78784, 85286, 119705, 156270, 165307, 167388]
10638A67388J0683j7008j585J7563J0885M913P516J8662j4777R560M3654K5688
10626B83142N2346P4213O5767P0591R8605O8401O3575N6851R5534J44568J74757
10615A248350K52859L43146M73794O64090Q94898J254194J649973J960465J892089
10606A0633858J398638O71911p1431n46932n79083j92626M04087J170005K118181
10597A5006608L187607L976564L779996K383040L74338j447976k450056k293058
10589B2517063j397775j62633J216302K723269M178619N109648M479025K050367
10581D0713885r95816l557152m781596m394125l140837j687763k78657J001751
10573B2879690K110846K668868K070967L18536j737305l331337l909394l441261
$$ y = [167388, 178071, 161063, 159478, 177041, 187926, 192839, 200355, 219017, 204240, 213800, 257454, 283142, 335488, 409701, 475468, 546059, 644664, 713065, 776640, 833491, 929025, 1073593, 1248350, 1501209, 1844355, 2318149, 2982239, 3877137, 5131331, 6781304, 8741769, 10633858, 12032496, 12704407, 12632976, 12086044, 11506961, 11314335, 11718422, 12888427, 15006608, 18194215, 22170779, 25950775, 28333815, 28708153, 27260177, 24810121, 22517063, 21119288, 20956655, 22172957, 24896226, 29074845, 34184493, 38663518, 40713885, 39718069, 36160917, 31379321, 26985196, 23844359, 22156596, 21877939, 22879690, 24990536, 27659404, 29730371, 30048907, 28311602, 24980265, 21070871, 17629610]
10565A7629610k498155j477625o44568J9190M95456O46984K81114m18335j225585
10556A2808086j811973j968209j792648j429400j062240p99469o14096m44964
10548B885087l15629k73938k17514j77125j77806j55406j26977j10876j15098
10539A214718j01536q6739n8221p7852p6841m5674k2489l7115k9868l2273l1751
10528F14359j5475m1217m4005m0168k0649k9041k1067k3267j6257k607n660k8031
10516C26915j5794k06m578j7921j7690o748k0960k2695l5963l383J1945J3120
10504B06042m005o684p852k2638j1877k4168k3787O901J8149J1259J1308j64j527
10491A50957P464r917K466J3076j9675k8204m878q992j2529j8898k2180j440L0108
$$ y = [17629610, 15131455, 13653830, 13009262, 13028452, 13523908, 14170892, 14452006, 14033671, 12808086, 10996113, 9027904, 7235256, 5805856, 4743616, 3944147, 3330051, 2885087, 2569458, 2295520, 2078006, 1900881, 1723075, 1567669, 1440692, 1329816, 1214718, 1113182, 1026443, 968222, 890370, 813529, 767855, 745366, 708251, 678383, 646110, 614359, 598884, 557667, 513662, 473494, 452845, 423804, 402737, 379470, 363213, 360606, 354946, 326915, 311121, 310915, 306337, 288416, 270726, 263978, 243018, 220323, 184360, 180977, 192922, 206042, 202037, 195353, 187501, 164863, 152986, 128818, 105031, 111932, 130081, 141340, 152648, 152484, 150957, 158421, 148504, 150970, 164046, 144371, 116167, 111289, 102297, 89768, 70870, 48690, 47250, 77358]
10478G7358J2417Q917J1829p916J7661K3415J8414j0809j7706j7377j5632j6816
10466H3755N274n115o769K4282J4610r963j0354k7216k3037j0306q413L914j2204
10453A8458k411P178J0274P674m196r256J2080J3425M086J0598K593o807m237
10440E9459N255J8558q590P32J3914P575l276J0871J2027P025j478K7812K7309
10427A77193J5808K7609L6826O5160P4829P3600R5153J71198K36399K54350K33094
10416A461219J17226m9860j89062k61896k31383j69559j08257q4352o8992m9945
10406C65139m7780m0676P147j3602k962R696k4443k866k7k3630j8219J6259K345
10393B26381P71r830l2935l6346l0821M528J6071K0728p785j7667K419J5308p547
$$ y = [77358, 89775, 98692, 110521, 102605, 120266, 143681, 162095, 151286, 133580, 116203, 100571, 83755, 89029, 83914, 77145, 101427, 116037, 106074, 95720, 68504, 45467, 35161, 26748, 30662, 18458, 16047, 23225, 33499, 41173, 36977, 27721, 39801, 53226, 57312, 67910, 70503, 63696, 59459, 64714, 83272, 74682, 75414, 89328, 96903, 93627, 104498, 116525, 123550, 122072, 149884, 177193, 193001, 220610, 257436, 322596, 397425, 471025, 566178, 737376, 973775, 1228125, 1461219, 1578445, 1528585, 1339523, 1077627, 846244, 676685, 568428, 484076, 415084, 365139, 317359, 276683, 283830, 270228, 267266, 276962, 252519, 249653, 249626, 225996, 207777, 224036, 226381, 227152, 217322, 184387, 148041, 117220, 121748, 137819, 158547, 150762, 133095, 135514, 150822, 143275]
10380A43275k7597p889L383l6678n101J9027J9914M208j8451j688L6139J4160
10368A42702j4008m844o436j5611j7809j8808j7842J6576J3813P831o9q154J4268
10355I1609J5352k1282j8375M601J6101p387q983n911J276J6634O782k471q501
10342G9445j6497j7491O773J3224J3157P194o99j4882k32J1243R795l935k6901
10329F0194l688P434K8810m671k3811J193M771r468n290Q61J2073q943l4981r129
10315A5355J3635K98m520q095N083K0821K7286J9689j9192l7562j4193J6151K6534
10302F1290j9491o695k816O790l347j9470p495m70Q077R321R082O692m220k0886
10288A6362P694q052J0135J167J767j509Q190J0656j3764j5958L738J0416N846
$$ y = [143275, 115678, 107789, 111172, 74494, 69393, 88420, 108334, 112542, 94091, 92403, 128542, 142702, 128694, 123850, 117414, 101803, 83994, 65186, 47344, 63920, 77733, 85564, 85495, 77341, 91609, 106961, 85679, 67304, 71905, 88006, 80619, 71636, 65725, 67001, 83635, 90417, 87946, 79445, 62948, 45457, 52230, 65454, 78611, 85805, 85106, 70224, 69992, 81235, 91030, 87095, 60194, 56506, 63940, 92750, 88079, 64268, 65461, 70232, 60764, 55474, 56335, 68408, 59465, 24484, 15355, 28990, 29288, 24768, 16673, 21756, 42577, 69863, 89552, 70360, 32798, 18605, 34756, 61290, 41799, 35104, 32288, 39078, 35731, 16261, 8766, 8296, 16373, 25694, 34776, 41468, 37248, 16362, 24056, 16004, 26139, 27306, 29073, 27564, 35754, 46410, 32646, 16688, 20426, 30842, 36688]
10275C6688J5350J4710J3295N938Q537K0042K5700J081K879o50j8490j9503p824
10262I7753k0321J465m075l3541j5957J3352J7860j2792j764K0160j3179k2931
10250B6030q966j9314m850R683p851Q068o720r771J5587K230P214K287n155Q613
10236A7085J1086p069M553r685k1737k6818j6244K4240L4981K5444j9362k3532
10224g058j7535m741P850J5189k82p241M717L1013M21k7022k1662o30j4866J2392
10210b9455j3355j6371P212l8249p7746j26860j21802m1353M3M7158P3746P7787
10198b59245O4338M7801Q485J7843J3183j1559L187J7879K3612L8706l585J0438
10186b8917o44r282j0472j9457m52N945r878k4034n345l311k9981j6835j5195
$$ y = [36688, 52038, 66748, 80043, 85981, 94518, 114560, 140260, 141341, 144220, 143570, 125080, 105577, 97753, 77432, 78897, 74822, 41281, 25324, 38676, 56536, 43744, 41980, 62140, 48961, 26030, 17064, -2250, -7100, 2583, -5268, 2800, -3920, -13691, 1896, 4126, 11340, 13627, 8472, 17085, 28171, 21102, 25655, 15970, -5767, -32585, -48829, -24589, 10392, 35836, 16474, -7058, -24593, -29334, -21484, -6295, -6577, -13818, -9101, 21912, 22333, -4689, -26351, -26981, -41847, -29455, -42810, -59181, -51969, -90218, -167964, -294824, -416626, -457979, -457936, -410778, -337032, -259245, -194907, -147106, -138621, -120778, -107595, -119154, -115967, -98088, -74476, -35770, -39355, -28917, -29561, -38843, -49315, -68772, -69224, -63279, -73157, -97191, -102536, -105847, -135828, -152663, -167858]
10173a67858j5373p753K9377O5983J04393J38280J18347P9100L6750J7254m833
10162C93667m226J8210N144j4604k445O770N900K0099j4017n1745j3582J1365
10150C60536J0134R373J3418L7861M6816K2291K9199L4086q297k0867n4321p1632
10138D08597p7841k7385j8124n445q598K003r43k6346l6396k0543M763q75j314
10125A91553k741k048o040J935j6268M673m358j9991r177n411k5094J3229K8522
10112A48784J2647J0977l969R54R35K6217N825j0501o156K303J4818K1890m948
10099B19776j1556P869K1504J2311k090j4991j2717o03Q039J4515J5800J5710
10087B73567K4352K8855L5723J3188o333K4644L7255r257l923J9557J9112L339
$$ y = [-167858, -183231, -190984, -161607, -95624, 8769, 147049, 265396, 344496, 381246, 398500, 393667, 389441, 407651, 412795, 398191, 395746, 402516, 408416, 428515, 414498, 362753, 349171, 360536, 370670, 380043, 393461, 431322, 478138, 500429, 529628, 563714, 555417, 534550, 480229, 408597, 330756, 303371, 285247, 279802, 271204, 273207, 272264, 245918, 209522, 188979, 193742, 192867, 191553, 188812, 186764, 180724, 182659, 166391, 171064, 166706, 146715, 137538, 132127, 107033, 120262, 148784, 161431, 172408, 168439, 169393, 170328, 196545, 202370, 191869, 185713, 188016, 202834, 224724, 219776, 208220, 216089, 237593, 249904, 247814, 232823, 220106, 219503, 227542, 242057, 257857, 273567, 297919, 326774, 362497, 375685, 369352, 393996, 431251, 421994, 418071, 437628, 456740, 460079]
10075D60079L357J4249J2713o699l068J7673K7175K0357L0212J8419N050J2149
10063F11666K6533L2609M5125N6731N7861O2837M9140K9550O3761R7202O5721
10052A198736Q0087O8824R2738P5238J03602Q8855J21527J49826J71617J99080
10042B350130K32746K46369L11143L93160N18037O52443P70902Q15423Q30069
10033G120422Q40344R39522J226780J718651K239209K583566K733966K722230
10025B2124690K668527K748359L136142M076032N910952R061314J4111793K1942561
10017H5780370L3209335M6783084N5603139M7373291K1582929j1707484l8901472
10010B39723192n1758052m8505878l6540983k5133715j6936747j1596065q177696
$$ y = [460079, 463436, 477685, 490398, 483699, 480631, 498304, 525479, 545836, 576048, 594467, 599517, 611666, 638199, 670808, 715933, 772664, 830525, 893362, 942502, 972052, 1035813, 1133015, 1198736, 1278823, 1347647, 1440385, 1515623, 1619225, 1708080, 1829607, 1979433, 2151050, 2350130, 2582876, 2829245, 3140388, 3533548, 4051585, 4704028, 5474930, 6290353, 7120422, 7960766, 8900288, 10127068, 11845719, 14084928, 16668494, 19402460, 22124690, 24793217, 27541576, 30677718, 34753750, 40664702, 49726016, 63837809, 85780370, 118989705, 165772789, 221375928, 268749219, 290332148, 278624664, 239723192, 187965140, 139459262, 102918279, 77784564, 60847817, 49251752, 41074056]
10003D1074056n943893m507052l591647l075985k748482k430210k122512j749124
9995A4905151j349331j032737p93681o56447o16819o85319p73088p99018p60786
9986G437925o73795n61742m48159l85862l58203l29287k64865k52813k42208k20405
9976C700586k09188j95189j69418j72428j65014j41874j25251r8455j15840j09097
9966B198832o7207p4317p7912q0307o1224n0437q2832j24714j16184p5044o5833
9955A322821m2068l9452o3398n8428l2501n2619n4868k8824l5615m7841m3259
9944H23948j5953j9729l0320j9795j8945j1108l8127N561J94k0810Q20j3112j2965
9931F29659J0750p090k1110q721o746k3164m4307l1945k0770L6998K0118j2125
$$ y = [41074056, 35130163, 30623111, 27031464, 23955479, 21206997, 18776787, 16654275, 14905151, 13555820, 12523083, 11729402, 11072955, 10456136, 9770817, 8997729, 8198711, 7437925, 6764130, 6202388, 5754229, 5368367, 5010164, 4680877, 4416012, 4163199, 3920991, 3700586, 3491398, 3296209, 3126791, 2954363, 2789349, 2647475, 2522224, 2423769, 2307929, 2198832, 2131625, 2057308, 1979396, 1899089, 1837865, 1787428, 1704596, 1579882, 1463698, 1388654, 1322821, 1280753, 1241301, 1177903, 1119475, 1086974, 1034355, 979487, 950663, 915048, 867207, 823948, 807995, 788266, 757946, 738151, 719206, 708098, 669971, 675532, 675726, 654916, 655736, 642624, 629659, 640409, 633319, 612209, 603488, 596742, 573578, 529271, 497326, 476556, 513554, 533672, 521547]
9919E21547k4389j795k6998j1089R740P945j6629j4051J2227J9734K6688o262
9907D96668j6624k7114k2662j6210k0584j3423O108p928k1110J575R509J323j0342
9894C59186K101J423L1744K5944j557k3649n9198q1459j10383p8926m5960K975
9882B2241J4775J4207l53L0908R946J1185J1608j0886k1574J4754j3464j2762
9870G0585j603j3646q0J9688R040k7645m4131n3389m9829j4927J2194P6949J17245
9857A00451J32314J05342P5025L7410P96l1812l0722k805r838q370k6558j5095
9845C26138J1756j52r531j3674q678p245n232K782M207M040r25K876K5841j651
9831C30552n613J6439K9915L2982N5231O3636P5219O9729J402o0074r3621j03163
$$ y = [521547, 497158, 495363, 468365, 457276, 467016, 474961, 458332, 444281, 456508, 476242, 502930, 496668, 480044, 452930, 430268, 414058, 393474, 380051, 386159, 378231, 357121, 358696, 368205, 369528, 359186, 361287, 362710, 394454, 420398, 418841, 395192, 335994, 254535, 144152, 65226, 19266, 22241, 37016, 51223, 50870, 81778, 91724, 102909, 114517, 103631, 82057, 96811, 83347, 70585, 68982, 55336, 55256, 74944, 83984, 56339, 12208, -41181, -91010, -105937, -93743, -16794, 100451, 232765, 338107, 413132, 450542, 451338, 419526, 388804, 385999, 376161, 367791, 341233, 326138, 337894, 337742, 328211, 314537, 305859, 298614, 293382, 296164, 300371, 304411, 303486, 306362, 332203, 330552, 324939, 341378, 371293, 404275, 459506, 523142, 598361, 668090, 669492, 609418, 515797, 412634]
9819D12634o8445m9839k4993j4388r271l4512k0778J0233O246Q064k9879k7736
9807A57336N25n848o849K4404K5646q354j0076j4132l50J7262O648L706K1554
9794B11472J3130k8909k6657p027j4296j2222j1534P933Q091J0453n777j4829
9782A29828j5288K33j24J8021J621j5739K1552l472l448j6473R986K175L6073
9769A64945L3475M7299K9942M2402R444k6610n5533k0446m2119l5986j0879J020
9757A36954m870j3122k832L0845n898L526n053r739k066k836m695l605j5653K97
9743A01253k424l750J6539J1947Q915j541k0038j2813j671K1985J8941J0425J4174
9730A61942l090j0863L995J85l5456k0342j0585K377Q128k213L442l536k551K057
$$ y = [412634, 344189, 294350, 269357, 254969, 245698, 211186, 190408, 200641, 206887, 214951, 185072, 157336, 157861, 152013, 145164, 169568, 195214, 186860, 176784, 162652, 162302, 179564, 186212, 189918, 211472, 224602, 195693, 169036, 162009, 147713, 135491, 123957, 131890, 139981, 150434, 144657, 129828, 114540, 114773, 114649, 132670, 134291, 118552, 140104, 136632, 133184, 116711, 126697, 128872, 164945, 198420, 245719, 275661, 318063, 327507, 300897, 245364, 224918, 182799, 146813, 135934, 136954, 132084, 118962, 116130, 146975, 141077, 144603, 139550, 129811, 127745, 124909, 120214, 116609, 100956, 101253, 98829, 95079, 111618, 123565, 132480, 130939, 110901, 98088, 96417, 118402, 137343, 147768, 161942, 158852, 147989, 151984, 152169, 116713, 96371, 85786, 88163, 96291, 94078, 97520, 93984, 91433, 93490]
9716I3490J2624J851O76K7J3228M45k1071k3031M861q738K4919L5046j0968l2794
9702I0565n9000k7473j2749J7468K0781j2902M739q630r82K0180P60K4143L3524
9689I0424n892k1574n786P934R336j3686R94K8284M433j1240J0093k606j0384
9676H0330j8783j06L109j9226r373k713J7715K7060J6026l6J994L530K0224J3764
9662A33515l0030r093R331L134j1167r915j5038O209K6917J9349K0312p210J4358
9649A50672K5886L4105M3915J03660J60062K76598N23194P47603L53649q2846
9639B336498l25136o83370m94779k60627j39879r5580m4011k4394j4706j6277
9629B37739l2497k6370k4930L154R374K1042K5687J9622o25j5284q287L1733J8329
$$ y = [93490, 106114, 107965, 108641, 108668, 121896, 122341, 101270, 78239, 83100, 74362, 99281, 134327, 123359, 90565, 31565, 4092, -8657, 8811, 29592, 16690, 21429, 12799, 11817, 31997, 32757, 56900, 90424, 84532, 62958, 57172, 65106, 74442, 60756, 61750, 90034, 94467, 83227, 93320, 90714, 80330, 61547, 61441, 64550, 45324, 35951, 33238, 50953, 78013, 94039, 94003, 95997, 99527, 119751, 133515, 103485, 94392, 103723, 106857, 95690, 85775, 70737, 76946, 103863, 123212, 143524, 136314, 150672, 176558, 210663, 254578, 358238, 518300, 794898, 1318092, 2065695, 2419344, 2336498, 2011362, 1327992, 833213, 572586, 432707, 337127, 293116, 268722, 254016, 237739, 205242, 178872, 153942, 157096, 166470, 187512, 213199, 232821, 232196, 216912, 208625, 240358, 258687]
9616B58687j7377R224J6678J0535M4433M7971R9202J56391J93067K30783K45126
9605A294720J92795N0839j16701k11518k58419k15447j81037j23082p4388l9938
9595C17824m4135k9552l212j4721j1613j5762l5122l0951k373O15M662J5139k3305
9582A27494l6710j1336M006M515Q272J9990q546j6550L727J012j5142k5581k4165
9569C0986J500J1533R755j1583J3207Q773R749K776q654L950j3N349Q356k5471
9555F0213k242R973l182m481J7507j2194N947q300J8306J7051j5464j7880j868
9542F3386J3912o163j032k220k3247k330k373J5906K794J3088J695j981k262j5041
9528E4132Q370j263R271o290o580P77j0543J2825j6121J883J1980N933J0388o413
$$ y = [258687, 241310, 250534, 267212, 277747, 322180, 370151, 469353, 625744, 818811, 1049594, 1294720, 1487515, 1538354, 1421653, 1210135, 951716, 736269, 555232, 432150, 357762, 317824, 273689, 244137, 240925, 226204, 214591, 198829, 163707, 132756, 130383, 130998, 135660, 150799, 127494, 90784, 79448, 83454, 87969, 96241, 116231, 107685, 91135, 94862, 95874, 80732, 55151, 30986, 32486, 44019, 53774, 42191, 55398, 64171, 73920, 76696, 68042, 71992, 71979, 77328, 85684, 60213, 57971, 67944, 64762, 60281, 77788, 65594, 71541, 63241, 81547, 98598, 83134, 65254, 63386, 77298, 71135, 70103, 67883, 44636, 42306, 39933, 55839, 58633, 71721, 73416, 71435, 69173, 54132, 62502, 61239, 70510, 64220, 57640, 58417, 47874, 60699, 44578, 46461, 58441, 64374, 74762, 68349]
9514F8349M405j3942o452m755K3415J395k3681j9094O516J4219K0607J2614N678
9501H9274m341j0882P690p619j3487p377q121N846k756j1335j0116p677R346k1205
9487G240j652K858O11j1207P687l878K6370L4249j4804N350j80m828M83J3654
9473F1953j0333q236p231R371j7525r52m613J728N518l649j212k8567p634L3464
9459B2082K6958J7048m177M33k3058p495R436k590k750P609L342N983m82m125
9445D8214o676l708r206J3489J0868L550L496p296K2340r825q837j6039k0186
9432B0184K997J0707Q86O002j9623q815Q369K0026J0813j0990l889J6998n921
9419D7744j8302k1706N713K5772K7728j8956k7250j0888M345J4153p689J5139
$$ y = [68349, 72754, 58812, 52360, 47605, 71020, 72415, 48734, 29640, 36156, 50375, 70982, 83596, 89274, 84933, 74051, 81741, 74122, 60635, 53258, 45137, 50983, 48227, 36892, 26776, 19099, 28445, 7240, 5588, 8446, 9057, -2150, 5537, 1659, 28029, 62278, 47474, 52824, 52644, 47816, 48299, 61953, 51620, 43384, 36153, 45524, 27999, 27047, 22434, 24162, 29680, 26031, 24819, -3748, -11382, 22082, 49040, 66088, 61911, 62344, 39286, 31791, 41227, 38637, 35887, 43496, 46838, 52821, 52339, 48214, 41538, 37830, 28624, 42113, 52981, 56531, 60027, 52731, 75071, 65246, 56409, 40370, 20184, 23181, 33888, 34774, 40776, 21153, 12338, 20707, 40733, 51546, 40556, 36667, 53665, 47744, 29442, 7736, 13449, 39221, 66949, 47993, 20743, 9855, 14200, 28353, 20664, 35803]
9407C5803R156R235k023k1061J6704J4318k6273j3704r010P589J2942P706N745
9394D7127j1341j5170Q418M825J6033o521q386K042o789j4093o282o527Q958K0441
9380C2735j7428O208o393K2456l903k0222O995K5540M116k3574p333m784j2859
9367A554N917J7638O310L258K525l176j037J0545N466k3606j7156j4166O717K195
9353B984N713J0198Q310j0006L827P42k0525K796L597Q182K2924J5828k1383j7096
9339A6091j4041J4577K470M487J2641K6470n073l5981j3926O257Q507K8113K1411
9326G2003r162k1601K461J997p635J50n455J8760O157k0839k2392J5835M087n747
9312B8619J6079k445j4439m248Q66J2857J1897l012j7928J0662p418Q373n171
$$ y = [35803, 44959, 54194, 52171, 31110, 47814, 62132, 35859, 22155, 13145, 20734, 33676, 41382, 47127, 35786, 20616, 29034, 33859, 49892, 43371, 34985, 37027, 30238, 16145, 9863, 3336, 12294, 32735, 15307, 21515, 15122, 37578, 33675, 13453, 20448, 45988, 50104, 26530, 19197, 14413, 1554, 7471, 25109, 31419, 34677, 37202, 34026, 32989, 43534, 49000, 25394, 8238, -5928, 789, 2984, 8697, 18895, 27205, 17199, 21026, 21768, 1243, 4039, 7636, 15818, 38742, 54570, 33187, 16091, 2050, 16627, 19097, 23584, 36225, 62695, 57622, 21641, 7715, 13972, 22479, 50592, 72003, 62841, 41240, 43701, 45698, 38063, 38213, 32758, 51518, 57675, 36836, 14444, 30279, 34366, 28619, 44698, 42253, 27814, 23566, 24432, 37289, 49186, 46174, 28246, 38908, 31490, 39863, 34692]
9299C4692p191R096L105j1307k833j9031o369l268r298J4015J1238p546K3023
9286B8326K2324j211k5341O46o734J1743L1874Q400j7672j3371l959L390o72j2503
9272B5240q492j4904o467K0189M806l126p332k2562K5729J4692j2858j9060j959
9259f104n689l747R556p607n249L15J3105J8589N461o043K074L1020J2522o58
9245E7545j2935j5404n600p344q928r712r715J4334J021J7501P1M166p784k1161
9231c945L025N191J498K695n151n519j433k929J9602j047O971J1171n747j7977
9217F405M517k478L855n068M443q947M522O376K0549l961j7875K900n793k1177
9203a1732K722J6640L3311J1100k2221j021o767m441o35R331m430j8253o234P167
$$ y = [34692, 27501, 36597, 39702, 28395, 25562, 6531, 162, -3106, -12404, 1611, 12849, 5303, 28326, 50650, 49439, 24098, 24744, 18010, 29753, 61627, 70027, 52355, 38984, 35025, 38415, 37743, 25240, 16748, 1844, -4623, 15566, 20372, 17246, 9914, -12648, 13081, 27773, 14915, -4145, -6104, -11793, -15540, -5984, -13591, -18840, -18525, -5420, 13169, 18630, 12587, 14661, 45681, 58203, 57545, 44610, 29206, 23606, 16262, 7334, -2378, -12093, 2241, 3262, 20763, 20834, 25000, 17216, -3945, -920, 4271, 5769, 8464, 3313, -2206, -3639, -6568, 13034, 11987, 18958, 30129, 24382, 6405, 10922, 8444, 12299, 7231, 11674, 2727, 7249, 13625, 34174, 30213, 12338, 15238, 9445, -11732, -9010, 7630, 40941, 52041, 29820, 28799, 22032, 17591, 16956, 26287, 21857, 3604, -2630, 4537]
9189D537J6017K05n2k699O17O702R197J2035N518r222O130n252j9154n654K572
9174B1497n614j5151j1799n935J4263j2130R394J7667M145J0368l494j2759j1942
9161a490l194r506k5357J0286K3425J1769J5968O834m291L437j6819m299n092
9148A671j3468J9503J1144J9519J2711k482r106m251P690L776M905k1283l1897
9135a568M108j7151Q559M419Q552J2574K457o99j9440P541M442N723J2486q990
9121B3013m437J5524k1177k0878J6617q10j1333q875J3266L3236K2784k924j0236
9108D3770j3679m894j2714k5509r320j591k9675K3142N3502J6588k3480j4135
9096B005j0698R991J5811j3560k2435p402k472J6663K2735j2312k0267O773N109
$$ y = [4537, 20554, 20759, 20707, 18008, 18625, 25327, 34524, 46559, 52077, 42855, 48985, 43733, 24579, 18925, 21497, 15883, 732, -11067, -17002, -2739, -14869, -5475, 12192, 16337, 26705, 23211, 10452, -1490, -4684, -14190, -39547, -29261, -5836, 5933, 21901, 28735, 24444, 27881, 11062, 6763, 1671, -11797, 7706, 18850, 38369, 51080, 48598, 39492, 35241, 42931, 46707, 51612, 30329, -1568, 2540, -14611, -6052, -1633, 6919, 19493, 21950, 21251, 1811, 9352, 13794, 19517, 32003, 23013, 18576, 34100, 12923, -7955, 8662, 7852, -3481, -12356, 910, 34146, 56930, 54006, 43770, 30091, 25197, 12483, -13026, -22346, -23937, -53612, -30470, 23032, 39620, 16140, 2005, -8693, 1298, 17109, 3549, -18886, -26288, -28760, -12097, 10638, -1674, -21941, -15168, -10059]
9083a0059J7390K1994j9986n98N645N89k127J822J8583k2724j0623M720N82K7135
9069C2343O247j4961j1756j9150j2008M326n546M620k232n672J1315L3968J2792
9056C4286j208r366j7889L901K44J2537O054M43J0220k258q381m587k829R224
9042C0391P550o917k1679k1001O81O165K0103J7879J481j438j079J2k8329q767
9028d948P635J7066o403q257J437L016O729j0227j8384j685k838J905K4389q921
9014E14r14K3374J7437R288j9633k6837K2060L665p515J3093J380R839m088j0548
9000C1115O142P331j2642K778j933n507r392k4173j1017P367K7620o865j9478
8987h654j1207P895K4401m267J161J7537n43j6628R97J2093N524j4060k0358K0510
$$ y = [-10059, 7331, 29325, 9339, 8741, 14386, 14975, 12848, 14670, 33253, 10529, -94, 4626, 5208, 32343, 38590, 23629, 11873, -7277, -19285, -14959, -20505, -15885, -18117, -23789, -12474, 21494, 34286, 33078, 23712, 5823, 9724, 9968, 22505, 28559, 29002, 39222, 36964, 28583, 23996, 21167, 30391, 37941, 31024, 9345, -11656, -10975, -4810, 15293, 33172, 34653, 33215, 32136, 32148, 3819, -4948, 2687, 19753, 13350, 5093, 6530, 9546, 16275, 6048, -12336, -14021, -16859, -14954, 9435, 514, -400, 22974, 40411, 49699, 30066, 3229, 25289, 28954, 21439, 34532, 35912, 45751, 41663, 31115, 37257, 44588, 31946, 34724, 32791, 27284, 17892, -6281, -17298, -9931, 17689, 10824, -8654, -19861, -11966, 12435, 8168, 9329, 26866, 26323, 9695, 10692, 22785, 28309, 14249, -6109, 14401]
8973A4401O825k421j5534o328l188r068k53j2834j833J7449J2498o841m677m776
8959a6580K0164M4805j0359k4268j0941L965J0519j1934p732j397n078q107j3161
8946c0104J0987J1738L265Q024R033k6950j9244J0838r77k140J1954J8023r792
8933e345o975M157J5988m190j4854j1197J4244O589l891J6201N951n527p079K2401
8919B6473J6544k048J9562j3908k1882Q905J828j5596j5789j0499K5815R068p361
8906B1112r179M641M097L25J3564J3671j7733k5888Q53l092j0233L160O8J572
8892c062J4936J0600q330j9146K469k498j8050j4129p00j399Q901o686K5908N688
8878e498L3j5266k2883J5542J7802J8096r98p801J3410L418p841k2860j9656j5058
$$ y = [14401, 21226, 18805, 3271, -3057, -6245, -15313, -15566, -28400, -30233, -12784, -286, -7127, -11804, -16580, 3584, 48389, 38030, 13762, 2821, 6786, 17305, 5371, -2361, -3758, -8836, -16943, -30104, -19117, -7379, -4114, 3910, 12943, -14007, -33251, -22413, -23390, -25530, -13576, 4447, -5345, -12320, -8163, 7825, 3635, -11219, -22416, -8172, -1583, -5474, 10727, 16678, 11151, 4072, 26473, 43017, 40969, 60531, 46623, 24741, 33646, 35474, 19878, 4089, -6410, 19405, 28473, 21112, 11933, 16574, 20671, 20996, 34560, 48231, 30498, 4610, 5463, 2371, -7862, -4702, -4634, -3062, 11874, 22474, 14144, -5002, -2533, -5031, -23081, -37210, -37910, -39309, -30408, -37094, -11186, -5498, -5465, -20731, -43614, -28072, -10270, 7826, 6828, -973, 12437, 15855, 8014, -14846, -34502, -49560]
8864d9560M330K5641K0096j315K994j1799j5329J6878J416l241o957q431K9136
8851C859L0416J7123Q780j8293k9408j9457j423J4942J1757L24r756K579r102
8838B341j6859J6277K1210L920N713N924j920O718j3817k2318K856J6470j605
8825B4910O538j0591p273Q951K9253q554p064r142r244P075n285K663k450k2150
8811b363j2989J8412J1945j4662m127r55M808J0689n773K918O812j131J1146R860
8797C4590l2952J7791r0j9663o434J3877K395K154R765r860J028J9816k5631j9830
8783a3044j5955o532R778J6015n682l683m295R334p414Q144o593j90Q164J034
8769a0919J9157J077m277q562Q321J9306L02q742j1744n878J5836k6152l0077
$$ y = [-49560, -45230, -19589, 507, -808, 2186, -9613, -24942, -8064, -6648, -9889, -16846, -25277, 3859, 34275, 51398, 60178, 41885, 12477, -6980, -8403, 6539, 18296, 18620, 8864, 11443, 2341, -14518, 1759, 22969, 26889, 32602, 38526, 36606, 43324, 29507, 7189, 10045, 26515, 24910, 31448, 20857, 13584, 22535, 51788, 43234, 36170, 27028, 17784, 24859, 19574, 22237, 19787, -2363, -15352, 3060, 15005, 343, -3784, -4739, 69, 10758, 4985, 7903, 14715, 13584, 24730, 34590, 1638, 19429, 19339, -324, -6758, 7119, 9514, 11668, 21433, 11573, 12601, 32417, 6786, -13044, -28999, -35531, -25753, -9738, -15420, -19103, -23398, -14064, -21478, -13334, -19927, -20117, -11953, -10919, 8238, 9315, 5038, -3524, 4797, 24103, 24405, 15663, 3919, -1959, 13877, -12275, -42352]
8756d2352J1064R007M107J8530J0058J2805j3397k1130J297K3894K504p014J324
8743A0697J2006J7554j662j3337j4867j2160J994J9665J1022j1048P600j4193
8731A3271j4761j702O542P572m884J6318j816J753j1450N738J7092o990M993M557
8717C6233J6418k2358l5072J2436L518j8120J2604J7394M873j3792j0361O551
8705A0324j5306K875J1097P857r510j8420K663J8815L619L483L920K4101J5715
8692F1233j5742j7345k0951l981o227K288J0791J3031n7l148k284N41j0416n428
8678B305L192j2558K6709J0147m064l442m058k2971r268J802Q555m352r989K0423
8664B431j731n756k935R464J3056J9374r154j6095l5339l240J4587K6229K190
$$ y = [-42352, -31288, -22281, -18174, 356, 10414, 23219, 9822, -11308, -10011, 13883, 16387, 9373, 10697, 22703, 40257, 38595, 25258, 10391, -1769, 225, 19890, 30912, 19864, 27464, 13271, -1490, -3192, 3350, 10922, 6038, 22356, 20540, 22293, 10843, 16581, 33673, 26683, 31676, 36233, 52651, 30293, -4779, 7657, 11175, -6945, 5659, 23053, 27926, 14134, 3773, 10324, -4982, -2107, 8990, 16847, 7337, -11083, -8420, 10395, 14014, 17497, 21417, 45518, 61233, 45491, 28146, 7195, 3214, -3013, -725, 10066, 23097, 23040, 19892, 17608, 18149, 7733, 2305, 5497, -7061, 19648, 29795, 25731, 22289, 18231, -4740, -14008, -12206, -3651, -8003, -17992, 2431, 700, -5056, -7991, 1473, 14529, 33903, 24749, 8654, -26685, -29925, -15338, 10891, 13081]
8651A3081L230m949N749K137J8407j3315k2286j087q283K2315J5043j509r491
8638A9042j5371k8273O391K2033O168j99J636J7593J4824j3599k7740n738J7191
8625A3958k835j2981J9869J4561K079l160j6104j321J6418J9893j5863K867J7158
8612E4539j66r820N16k1194m117Q2j790m413o575J492J1552k093k171n609n653
8597D580K028l360N96Q723o005o319J236m160J6121J6134Q945k3105l3362q575
8583b6523J6263K7937l374L918n296j612l3093J9413J0855k290R43q00n666N480
8569F155m00K913K0558J1558J707j2140k2715j7720L805J4570J5975k397j6307
8556E562j535P259R769k97N688L4390l0516j8677n889j0767k79N390P75J9999
$$ y = [13081, 16311, 11362, 17111, 19248, 37655, 24340, 2054, 967, -7316, 14999, 30042, 28533, 19042, 3671, -24602, -18211, 3822, 9990, 9791, 11427, 29020, 43844, 30245, 2505, -3233, 13958, 11123, -1858, 18011, 32572, 34651, 31491, 15387, 14066, 30484, 50377, 34514, 37381, 54539, 54373, 44553, 45069, 23875, 19758, 19840, 18050, 13637, 7062, 8554, 20106, 18013, 15842, 10233, 4580, 6608, 3248, 3844, 12567, 6562, 243, 1479, -2681, 13440, 29574, 38519, 15414, -17948, -26523, -10260, 17677, 14303, 18221, 12925, 11313, -21780, -2367, 8488, 6198, 7141, 6341, 675, 6155, 5755, 8668, 29226, 40784, 42491, 30351, 7636, -10084, -6279, 8291, 24266, 21869, 5562, 4027, 11286, 21055, 20758, 26446, 60836, 30320, 11643, 5754, -5013, -5292, 98, 873, 20872]
8542B0872n344p773N675J9021L550l031J6665L418q805L146J6070q028j6202L906
8528D3140j9813r770o464M899m430m258M379K2300J9674J9877j909j899r340k7796
8514B8590r974m294J2782l686m698O260p293j2715N209k958N855P709P663j6868
8500A1582j5217Q954Q979j1115n231O901L719j1008n511J467j293o688m070Q802
8486i729J9804K1909J2348J207n160r406P502l771R416M111K4042K4413J2402
8473A09088q013j9552k2067j6059j4271M021o757l0099o078K1267n857L939l006
8460F556j1260J4062K910K484m205j0075J0329K4435j0719R72j5918N272J3819
8447B8662q91J2292O328M067M530n46p724q832j2189Q407q316j216J6020J9367
$$ y = [20872, 15528, 7755, 13430, 32451, 36001, 32970, 49635, 53053, 44248, 47394, 63464, 55436, 39234, 43140, 23327, 13557, 7093, 11992, 7562, 3304, 7683, 29983, 49657, 69534, 67625, 65726, 56386, 28590, 18616, 14322, 27104, 23418, 18720, 24980, 17687, 4972, 10181, 7223, 13078, 20787, 28450, 11582, -3635, 5319, 14298, 3183, -2048, 4853, 8572, -2436, -7947, -6480, -7773, -14461, -18531, -9729, 10075, 31984, 44332, 45539, 40379, 30973, 38475, 34704, 44120, 48231, 72273, 96686, 109088, 101075, 81523, 59456, 43397, 29126, 33147, 26390, -3709, -9787, 11480, 5623, 9562, 6556, -4704, 9358, 12268, 14752, 10547, 472, 10801, 35236, 24517, 25489, 9571, 14843, 28662, 27771, 40063, 46391, 50458, 54988, 54442, 46718, 37886, 25697, 34104, 25788, 24572, 40592, 59959]
8433E9959o643R675J9880K0910J068J0686j4150k5663l1728K445N104k9622p065
8420A4856Q02L946J0101P18k9781j4293Q975q260J5807J0181j7779J1373J40N053
8406A1839J5664J8637j3365j2734R194q456P602K1208l2038n126k94L455j1039
8393D547j8644q011Q841Q392L724j2095Q774J381p379n099J1420N60m012O093
8379a508M507k6500Q92J6632J8764m590j2860n42J8295J4375n711l005L777L755
8365B6281p029j6964j1126J0944k1244k4476L96q49J1191J6180J9263J5632N597
8352B3796R660j9591l3078j1719P127j7175k058O796p182Q906K2639q980o102
8339b6961J2519J7850Q385J2343N544O284P376p4j3786k5121o503K5379K0696
$$ y = [59959, 53316, 62991, 82871, 103781, 104849, 115535, 101385, 75722, 43994, 46439, 51543, 21921, 14856, 15658, 19604, 29705, 30423, 642, -13651, -4676, -12936, 2871, 13052, -4727, 6646, 6786, 11839, 27503, 46140, 32775, 20041, 29235, 20779, 28381, 49589, 17551, 12425, 12131, 15586, 4547, -14097, -22108, -13267, -4875, -1151, -13246, -4472, -3091, -10470, -15569, -4149, -3589, -7601, -1508, 2999, -23501, -22609, -5977, 12787, 8197, -4663, -5205, 13090, 27465, 21754, 18749, 22526, 26281, 19252, 2288, -8838, 2106, -19138, -43614, -43218, -44067, -32876, -16696, 2567, 18199, 23796, 33456, 13865, -19213, -30932, -23805, -40980, -43038, -36242, -43424, -34518, -11879, -20859, -26961, -14442, 3408, 11793, 24136, 29680, 35964, 43340, 43266, 29480, 4359, -2144, 23235, 43931]
8326D3931J235j9407k1801n789j0185k464J3604l420p485j0541K355J149j9478
8313c8296R572K8504l787j7406j2177l659o206K2387J2306k551M336j3619n356
8300b5952K083j056L2731L1383q042k6132k5730J6156M938l134M052L263O569
8287A1129j4904j1580J2408N490P949O630Q535J260j7238k1897R35p02j5680r553
8273c7218J1294K17j408P879P906k566r659m05q184J8743J4160R019P981k904
8259A4855J198k3717J4311J2911j0648o420R315r0m366m992j0159p058M685L79
8245i796J1912N262q430J2012J0116m939k8757o174J6615J0854J0539j4472k0215
8232a5473J1007K666l509j2749K5880J6008J6800o528k3434k5369K2998k2530
$$ y = [43931, 45166, 25759, 3958, -1831, -12016, -14480, -876, -4296, -11781, -22322, -19967, -18818, -38296, -28724, -220, -4007, -21413, -33590, -37249, -43455, -21068, -8762, -11313, -6977, -20596, -25952, -23869, -24925, 7806, 39189, 31147, 5015, -20715, -4559, 379, -2755, 1297, 4560, 11129, -3775, -15355, -2947, 2543, 10492, 17122, 25657, 26917, 9679, -12218, -11283, -11985, -27665, -37218, -25924, -25707, -27115, -19236, -11330, -13896, -23555, -23960, -32144, -13401, 759, 9778, 17759, 14855, 16053, -7664, 6647, 19558, 8910, 2490, 11805, 11715, 7349, 2357, -7802, -14860, -10175, -9796, 2116, 7378, -1052, 10960, 21076, 16137, -12620, -18794, -2179, 8675, 19214, 4742, -15473, -4466, -1800, -5309, -18058, 7822, 23830, 40630, 34102, 10668, -14701, 8297, -14233]
8220a4233j3812J3292J7483J3491o326j272r457j3738M945q27N706L702J1513
8207A0467j410M682l317J481j0697o710j6569j9203R155L5490J0204k4479O51
8194a0255J1199J859J6051m4240m33J5871L616j5508j1126J240L3714K8434q361
8181B2061J3555J0250j7179k5901j5498P537J6719J1540p063J1955k969l25J6876
8168D1558J4047k830j6960J7890k0778j5580j7077j3233Q76J8961K806o300J4566
8155A7946l77j4632o004J0388j0279j2783m666o222M229K0421R500k2021O170
8142h330K639O473J5107q010k6729p729M296N522K5003l450P14K3501K992p525
8128B4474P39J230J2794l009j3465j3008j0721J1892J1204J6023K3762o268p025
$$ y = [-14233, -28045, -14753, 2730, 16221, 9895, 8623, -834, -14572, -9627, -10454, -4748, -1046, 10467, 9057, 13739, 10422, 11903, 1206, -5504, -22073, -41276, -32121, 3369, 13573, -10906, -10255, 944, 2803, 18854, -25386, -25819, -9948, -6332, -21840, -32966, -31726, 1988, 30422, 22061, 35616, 45866, 28687, 2786, -12712, -5175, 11544, 23084, 16021, 27976, 25007, 24682, 41558, 55605, 52775, 35815, 53705, 32927, 17347, 270, -12963, -12087, 6874, 9680, 3380, 17946, 17569, 2937, -3067, 7321, -2958, -15741, -20407, -26629, -22400, -1979, 7521, -14500, -8330, -5691, 782, 15889, 7879, -18850, -26579, -22283, -16761, 8242, 4792, 5506, 29007, 31999, 24474, 25213, 26443, 39237, 36228, 22763, 9755, -966, 10926, 22130, 38153, 61915, 55647, 48622]
8115D8622r707o493r979L931K791K0605j5238j9650m895K481j828j4103J6787
8102A3324J0523j2337k1269j6875j2078J746K0805J3370j5144J416K2909j8855
8090a2465r67J7929K4401j441k411l8737J5279O938j1054J2250J9691O615j4559
8077B1469r559j8023p756L910Q401j5567j2289q969K691k353r695k602J4426L0539
8063e377J0109O73J1696O11j1807J1975j146k844K1893l840J79j0206o899o416
8049H601j542J091n477j1097K449K05j4378j3263j2426Q007L08j1174J8348O840
8035b3508l532Q85O747K9791J884r304K267R582j0411k6550J573m186L76K367
8021b2019K4810J0161k875j40l681K925J068o477J7507J2637m859n44K709n953
$$ y = [48622, 38915, 32422, 22443, 26374, 29165, 49770, 34532, 14882, 9987, 12468, 10640, -3463, 13324, 23847, 11510, -9759, -26634, -38712, -36966, -16161, -2791, -17935, -16519, 6390, -12465, -13432, 4497, 28898, 27457, 25046, -13691, 1588, 8526, -2528, 9722, 29413, 36028, 21469, 11910, -6113, -13869, -9959, -1558, -17125, -29414, -38383, -35692, -38045, -47740, -50342, -35916, -5377, 4732, 5405, 17101, 17712, 5905, 17880, 16734, 13890, 35783, 31943, 32122, 21916, 15017, 8601, 7059, 8150, 2673, -8424, -5975, -5770, -20148, -33411, -45837, -37830, -37522, -48696, -30348, -23508, -27040, -26155, -19408, 10383, 12267, 2963, 5230, 14812, 4401, -22149, -20576, -24762, -24386, -22019, 2791, 12952, 10077, 9937, 6256, 9181, 10249, 3772, 21279, 33916, 29057, 28513, 31222, 25269]
8007B5269j3402k526j1825n531R240K494J1787J2633m410j328k0283j9081k695
7994a9658j5347J3226J8799M339k2286o082L903N786j1695j0866K2707J0134Q067
7981A027M232J95j3963k507J0393K507j4245J4976l539k641j3785j4014J6334
7968a5030Q287O522L4042n69j7874j2906k206J2585l165Q191m593J1581O912j6760
7954A5017m385r59J31Q613j2037L080L5883J5011l6489l3443j8389J0224m482
7941b2225R889J2246L645j8927j3558L785J8068q125J987j105k398j0505l156
7928c0379O505J0421J0673l073K0847N179j0292Q086m754j3673K792K0140J932
7915B4404j3301n015N200k267k996p986O216J3650L712k689j2849O760k029k4441
$$ y = [25269, 11867, 9341, -2484, -8015, 1225, 3719, 15506, 28139, 23729, 22401, 2118, -16963, -19658, -35005, -21779, -2980, 1359, -20927, -27009, -23106, -17320, -29015, -39881, -17174, -7040, 1027, 5259, 5454, -8509, -11016, -623, 1884, -12361, 2615, -924, -3565, -17350, -31364, -15030, -6743, -221, 33821, 33252, 15378, 2472, 266, 12851, 9686, 17877, 13284, 24865, 31777, 15017, 10632, 9673, 9804, 18417, 6380, 9460, 45343, 60354, 23865, -9578, -27967, -17743, -22225, -12336, -90, 3555, -15372, -28930, -25145, -7077, -15202, -13215, -14320, -16718, -27223, -30379, -23874, -13453, -2780, -5853, 14994, 20173, 9881, 17967, 13213, -460, 2332, 22472, 24404, 11103, 6088, 11288, 9021, 6025, -1961, 4255, 17905, 21617, 18928, 6079, 12839, 10810, -13631]
7901a3631m390J1249k027k879J6465j283k519K206K598q555J2328J7339l026l198
7887B0677J8235K980j7058j3910j0210j7027n787J0445M166Q516m987m959n063
7874a3982N113K707J8335K1654n986p016K930j3038o332k287k136j5502r170L127
7860b1583l519J045P891J3559M347q05j0128k4631q506M446J8540j311p908j167
7846b9730R664J5542l487L4N583N504M134O938O118P231k58k2841j0181J4622
7832H873q899r414Q031P593j2229J033J7759k2857Q245K550k7591n694K1084K1902
7818A0386k001r415K2712j0294l208J19J2m106O685l52j0266P45J9063J0244K774
7803C3098j4028j2024j5602j6457M744J5904n566m983K103J889J8812J4844o238
$$ y = [-13631, -18021, -6772, -8799, -11678, 4787, 3504, 985, 3191, 5789, -2766, 9562, 26901, 23875, 20677, 38912, 41892, 24834, 10924, 714, -16313, -22100, -11655, -7489, 1027, -3960, -8919, -13982, -8869, -6162, 12173, 33827, 27841, 20825, 23755, 10717, 4385, 2098, -38, -15540, -24710, -21583, -25102, -24057, -16166, -2607, 1740, 935, -9193, -33824, -42330, -37884, -19344, -20655, -28563, -29730, -20066, -4524, -8011, -7977, -2394, 3110, 7244, 14182, 20300, 27531, 27273, 4432, -5749, 8873, -26, -9440, -1409, 6184, -6045, -5012, 12747, -10110, -1865, 685, -26906, -32600, -11516, 10386, 8385, -1030, 21682, 11388, 8180, 8299, 8311, 4205, 10890, 10538, 272, 1017, 20080, 30324, 33098, 19070, 7046, -8556, -25013, -20269, -4365, -9931, -14914, -12811, -10922, 7890, 22734, 16496]
7790A6496j1866o288J8090k919o938O134Q078j4790j006L49o789j5175P891j0016
7776a8749J181j6530q659Q598Q798O443J2221k24K0546K234k8224j6916j866K9067
7762b080K5356n312m014m010N454o40N294K670M052p503p880k1929l245K7018
7748A3231k083J319J223N352J7608j2158k9471l04M515M526j0880j3936K6143
7735E085m774R167M606j7350k697j0361k808q356p447k903k152l556J9383L2501
7721H338q693N304r648q77K1347Q509m279j584P987L141j6092L108r19k9576k2201
7706c6135m1O717J8698l661k064J788R995l4982J5299L6136j3935k2231r140M553
7692b9003N240j089L386J0457j290M560J9403L798q699m360J159l837m000J3400
$$ y = [16496, 4630, -1658, 16432, 13513, 6575, 12709, 20787, 5997, 4991, 5340, -1449, -16624, -8733, -18749, -17568, -34098, -42757, -34159, -25361, -18918, -6697, -6921, 13625, 15859, -12365, -29281, -31147, -2080, 23276, 17964, 13950, 9940, 15394, 14754, 20048, 22718, 26770, 19267, 11387, -10542, -13787, 13231, 11148, 12467, 13690, 19042, 36650, 24492, -4979, -5283, -768, 3758, -7122, -21058, 5085, 311, 9478, 14084, -3266, -5963, -16324, -19132, -27488, -34935, -37838, -39990, -43546, -24163, 8338, -355, 4949, -4699, -5576, 15771, 24280, 20001, 18417, 26404, 29545, 13453, 16561, 15642, -13934, -36135, -36176, -29459, -10761, -14422, -16486, -14698, -4703, -39685, -24386, 11750, -2185, -24416, -33556, -29003, -23763, -24852, -21466, -11009, -12299, -7739, 11664, 15462, 6763, 2403, 3562, -275, -4275, 9125]
7678I125N96j0531R288j4308l444p456N01L630M053Q149N534K1229N933n902j012
7663B5385J9663j0607l5664k4390J735L6687l608q608K9482j4011k0909m493N488
7650c850k577K5377J499j6687n810o875J1181K0984J127O274O060p687j7705j0324
7636I87J7614J0493j308m30k3190j7064j06L853m377J3363J083j0054r568K2189
7622C485O655q235J5113J7271k791n960j7811k433l370m424J931j3640r871J012
7608b3068K3841K4613j1806r973j2020k5847N26J4767k166K539J2726J1437P579
7595A3148k389k645j4855J1784K8241J4375j3661l7966j9473K5742J1852J078
7583A5231j9341k0156k78Q665J1352K7996l5278q838J4685j5296J3912K3106k335
$$ y = [9125, 9721, -810, 8478, -5830, -9274, -16730, -16229, -12599, -8546, -397, 5137, 26366, 32299, 26397, 25385, 45048, 34441, -1223, -25613, -23878, 12809, 9201, 593, 30075, 16064, -4845, -9338, -3850, -6427, 18950, 20449, 3762, -2048, -8923, 2258, 23242, 24369, 30643, 36703, 29016, 11311, 987, 18601, 29094, 27786, 27356, 4166, -12898, -13004, -9151, -13528, -165, 918, -9136, -18704, 3485, 10140, 1905, 17018, 34289, 31498, 25538, 7727, 5294, 1924, -2500, -569, -14209, -24080, -23068, 773, 25386, 13580, 3607, -8413, -34260, -33734, -18967, -21133, -18594, -5868, 5569, 13148, 10759, 8114, -6741, 5043, 33284, 47659, 33998, -3968, -23441, 2301, 14153, 15231, -4110, -24266, -24544, -15879, -4527, 23469, -11809, -20647, -5962, -21258, -7346, 15760, 13425]
7570A3425j5632o875N192j1279j4076K3134J3690m442J3699J5480q320k1739l6013
7557c3756l281O323J4305K1492J0986j5804o183K580J151j0312n787P991R959
7544c36R098m552M0M256J0166J1303K0899k4742k0752l659J1137J0892M568n95
7530B7723J4963j4239j5175o020J8466J9541k0183q912l711j8706N235K0710R584
7517B9276j4436O831J0030Q394k2348L58j3480N017M66j851J7651K156j228K119
7503B8955j2942j2921o024m318J8968p439k2241l1383k926J8590K1470O666k2232
7490b7777j4520n642N963K393K5130J073q197N143L89N619J426J7270P12n74k3448
7475a5040K115J8604J8924j528l5282k6640j6008P952J5008J5152J245j9196Q141
$$ y = [13425, -2207, -9082, -3890, -15169, -29245, -6111, 7579, 3137, 16836, 32316, 23996, 2257, -33756, -37037, -30714, -16409, 5083, 16069, 265, -5918, -3338, -2187, -12499, -18286, -10295, -336, 8762, 4210, 4250, 8506, 18672, 29975, 50874, 26132, 5380, 1721, 12858, 23750, 28318, 27723, 42686, 28447, 13272, 7252, 25718, 45259, 25076, 16164, 12453, -6253, -1018, 19692, 29276, 14840, 21671, 31701, 40095, 17747, 18105, 4625, 9642, 10108, 8257, 25908, 28064, 26836, 28955, 16013, 3092, -2932, -7250, 11718, 4279, -17962, -49345, -52271, -33681, -12211, -5545, -27777, -42297, -47939, -41976, -39583, -14453, -13380, -21577, -16434, -16045, -10426, -9000, 8270, 8982, 8408, -15040, -12925, 5679, 24603, 23075, -12207, -38847, -54855, -46903, -31895, -16743, -15498, -34694, -26553]
7462b6553K1976N823k3541K573J6801N628j805o336k67j0790j6598m787P584R291
7448b1001j768Q236P394k289j7233J9860L094j5305k9837m038J7421J6657K2269
7435C460K2983l145j0449K810p082j5682l3829j1571N821K4656J7333L2000J6208
7422D3513m260k2250k737Q30K09o567j2043l388K6337P185m291j7194o596R342
7408H090J1454p216j3239r627J6822k2618O7l13k974R609K3546J4712P664m212
7394C1765j0518R294Q595J0268j0882q631j5365m252j4138n315L28K8271J8406
7381C7826P641r980M467P239l1156k9797j4527J1119O467J0411J1861J6908j01
7368B8378p847k318q290J067m955m19k184m762j5085k1816J6473K2984Q973N939
$$ y = [-26553, -4577, 1246, -22295, -19722, -2921, 2707, 902, -5434, -5701, -16491, -33089, -37876, -30292, -21001, -22769, -14533, -7139, -9428, -26661, -6801, -3707, -19012, -48849, -52887, -35466, -18809, 3460, 26443, 23298, 12849, 15659, 8577, -7105, -40934, -52505, -46684, -22028, -4695, 27305, 43513, 39253, 17003, 14266, 15096, 15305, 8738, -3305, -6693, 19644, 26829, 22538, 5344, -1252, 8090, 19544, 12328, -911, -10538, 6284, -16334, -16267, -16580, -19554, -9945, 13601, 28313, 35977, 31765, 21247, 30541, 39136, 49404, 38522, 29891, 14526, 10274, -3864, -9179, -8851, 19420, 37826, 45467, 35487, 39954, 47193, 16037, -13760, -28287, -17168, -10701, -290, 11571, 28479, 28378, 20531, 18213, 9923, 10990, 6035, 5616, 3432, -1330, -16415, -38231, -21758, 1226, 10199, 16138]
7354A6138l396N111p854M05L092P528p323m633K235R801o847o386J3291j7041
7340D121k661Q482k072n460m510r761j2513j700N600o245J0234K1269J2877j6022
7326A639j8849Q874J0282j1877j5905R049J3717o436P798J6299j3933J0084k2211
7313a1469n294j0831J295K4720K2397P782k3325k7530J4967N994R992l431o978
7300a711k162o086k954J30R666M828J949J1554K0399M967k0287j5887l196L703
7286D913K0674K9679k0461k9882j365O258j1270J256J368m476j4421j457J9j2345
7272c1510O422K0577J554p887p315K3156J0985M00K1571j2170k9283P935J6477
7259B0912J3454J280J0285j1888k2433P627j755n441q821j3609R113j0081l361
$$ y = [16138, 12742, 17853, 9999, 10404, 13496, 21024, 13701, 9068, 11303, 21104, 14257, 7871, 21162, 4121, 1460, 9942, 7870, 2410, -2100, -11861, -24374, -26074, -20474, -26719, -16485, 4784, 17661, 1639, -17210, -8336, 1946, -9931, -25836, -16787, -3070, -9506, -1708, 14591, 658, 10742, -11469, -16763, -27594, -26299, -1579, 20818, 28600, 5275, -22255, -7288, -1294, 8698, 5267, -1711, -3873, -9959, -12913, -12783, -3117, 1711, 3660, 15214, 35613, 40580, 20293, 4406, 1210, 4913, 25587, 55266, 34805, 4923, 3558, 9816, -1454, -198, 1170, -3306, -17727, -19184, -19165, -31510, -25088, -4511, -2957, -10844, -18159, 4997, 15982, 16382, 37953, 25783, -3500, 4435, 20912, 34366, 35646, 45931, 34043, 11610, 19237, 17482, 12041, 3220, -10389, -1276, -11357, -14718]
7246a4718r68J6728Q549k525j4180P275R024l6605N425J7813J1068N692p500j1798
7232f720q168J2066M171k2289k587q257O489J6888Q806m995N364j4941k5554j1928
7218e1655K870O369J3352K4063L6138k599k0514j5331J4667J4626q355k9852k358
7205a8579K596K004Q280l013j7851L085r033k2782J6591M952P060J4309K1126
7192H745P537j7131j1085M674k0865Q799K9208K2286m109k3977k4505k4030K4777
7179a9676J8786N689K468k057k3863P037J0302j2390K677K196m303m997J449p708
7165b4390m690J3550K3682M111r340j4350r299k707j8360j0542J2430L3686J8884
7152A2665n634j9678n930l090p287J1305J8489P103l692J93Q46n407j8773j2115
$$ y = [-14718, -15686, 1042, 9591, 7066, -7114, 161, 9185, -27420, -21995, -4182, 6886, 12578, 5078, -6720, -14888, -2822, 1349, -20940, -23527, -31784, -25295, -8407, 399, -4596, 768, -14173, -39727, -51655, -48785, -42416, -29064, -5001, 31137, 28538, 8024, -7307, 7360, 21986, 13631, -16221, -18579, -15983, -13979, -5699, -8712, -26563, -23478, -32511, -55293, -38702, -33750, -26690, -12381, 8745, 16282, -849, -11934, -7260, -28125, -19326, 9882, 32168, 28059, 4082, -20423, -44453, -19676, -890, 4799, 7267, 5210, -18653, -11616, -1314, -13704, -11027, -8831, -13134, -18131, -16682, -24390, -29080, -15530, 8152, 12263, 2923, -11427, -20726, -23433, -41793, -52335, -39905, -6219, 12665, 7031, -12647, -18577, -21667, -28954, -17649, 840, 7943, 4251, 4444, 5290, -117, -18890, -31005]
7138c1005j1920M921K9852K2331j272M551q913j2045n936R862l180K681N859Q460
7124A4246p743n976j3193J2462j9494m442Q318k433J6627L950J3887Q248o975
7111A7482L771N193K244M127l6948p403N060K571m692k8636R964L1250J3709J558
7097A9250q628p369P318M088l292m696l3K345q51k690o830K043n729O71k501j8249
7081b5153n687L413K8228J2102O26j6133q297K2229J6913R337q309j674M591k0793
7067A1393k0374J1999M743O615k506j3566j1656j0710k0002K8554K3328M803l807
7054H814K609J4175J0221k844r218n015k163p826j0622o266J478J9848k6371j6591
7040b9771J4099K1979O163k2742k2773J1845J0635K7k129j3841j0535j8232J9804
$$ y = [-31005, -42925, -38004, -8152, 14179, 12907, 17458, 8545, -3500, -9436, 426, -2754, -73, 5786, 14246, 6503, 527, -12666, -204, -19698, -24140, -15822, -18255, -1628, 2322, 16209, 24457, 17482, 21253, 26446, 28690, 32817, -4131, -11534, -6474, -3903, -8595, -37231, -27267, 3983, 17692, 19250, 10622, 3253, 10571, 14659, 11367, 6671, 6638, 8983, 8132, 5442, -1388, 655, -5074, -4403, -6904, -25153, -30840, -27427, 801, 12903, 13529, -2604, -10901, 11328, 28241, 37578, 29269, 27595, 32186, 11393, -8981, 3018, 7761, 14376, 11870, -1696, -13352, -24062, -44064, -15510, 7818, 12621, 8814, 11423, 25598, 35819, 32975, 23757, 18742, 16579, 8753, -1869, -8135, -6657, 13191, -13180, -29771, -15672, 6307, 12470, -10272, -33045, -21200, -10565, -10538, -12667, -26508, -37043, -55275, -35471]
7027c5471K9915K1253k227m872K4368j4636j2965J2064j0907j1913R022n282J4569
7014A2918n126k9612k3610J2426L194J2508Q92p526m141O560J4771K4398o979
7001A0673j6618R591M272L731L070j4987q216J2889Q06K0130P914q489r659p033
6987H074O752o868r149O148J4579J0035o238j6985k1962K905j3007j0283j116
6974c7115J8901q159k384K214R529l186K596J1316J1609j0981o951j0538P12P859
6960a4578j7231q464N394J0082o317K2183K1137k8794r091L530j6356J0445N208
6947b2852r749K993M97R632J3080P748O711J6690j3934j5477O982J285o845n100
6933h339o848j3701j7240Q471J6115K3520L59k854j0348n106P529N295K5256J1799
$$ y = [-35471, -5556, 15697, 13470, 8598, 32966, 18330, 5365, 17429, 6522, -5391, 3631, -1651, 12918, 7792, -21820, -45430, -33004, -29810, -17302, -16410, -23936, -28077, -21517, -6746, 17652, 10673, -5945, 3646, 7918, 11649, 14719, -268, -8484, 4405, 5211, 25341, 33255, 24766, 15107, 8074, 14826, 7958, -1191, 4957, 19536, 29571, 23333, 6348, -15614, -12709, -25716, -35999, -37115, -18214, -26373, -28757, -26543, -17014, -20200, -17604, -6288, 5321, -5660, -12611, -23149, -22437, -14578, -31809, -40273, -34879, -24797, -31114, -8931, 12206, -16588, -25679, -22149, -38505, -28060, -22852, -32601, -29608, -29111, -19479, -6399, 1349, 8060, 24750, 10816, -4661, 2321, 3606, -3239, -8339, -15187, -28888, -46128, -37657, -21542, 1978, 2337, -517, -10865, -15971, -8442, -3147, 22109, 33908]
6919C3908n385j2840l6222M094Q46m940k64R97p208J2275J0817j4133j1795p134
6905c6984j2302K3768J3794M164r187O451N751k024L969R289Q661N379j9161R656
$$ y = [33908, 28523, 15683, -20539, -16445, -15599, -20539, -20803, -19806, -27014, -14739, -3922, -18055, -29850, -36984, -49286, -25518, -11724, -7560, -16747, -10296, -4545, -6569, -2600, 6689, 15350, 20729, 1568, 11224]
$$ [...]
##END NTUPLES=NMR SPECTRUM
##END=
