##TITLE=Analysis number 317445
Compound Code mo 00744
Book Reference 458/56
Project Code qc-cat
Chemist Name stevem
##JCAMPDX= 6.0         $$ Bruker NMR JCAMP-DX V2.0
##DATA TYPE= NMR SPECTRUM
##DATA CLASS= NTUPLES
##ORIGIN= Bruker BioSpin GmbH
##OWNER= nmr
$$ XWIN-NMR		Version 3.5
$$ Mon Feb 20 16:54:24 2006 GMT Standard Time (UT+0h)  MAYBRIDGE\nmr@NMR_250MHZ
##.OBSERVE FREQUENCY= 250.131544655141
##.OBSERVE NUCLEUS= ^1H
##.ACQUISITION MODE= SIMULTANEOUS (DQD)
##.ACQUISITION SCHEME= undefined
##.AVERAGES= 16
##.DIGITISER RES= 18
##SPECTROMETER/DATA SYSTEM= dpx250
##.PULSE SEQUENCE= zg30
##.SOLVENT NAME= DMSO
##.SHIFT REFERENCE= (INTERNAL, DMSO, 0, 16.522)
##AUDIT TRAIL= $$ (NUMBER, WHEN, WHO, WHERE, WHAT)
$$ ##TITLE= Audit trail, XWIN-NMR		Version 3.5
$$ ##JCAMPDX= 5.01
$$ ##ORIGIN= Bruker BioSpin GmbH
$$ ##OWNER= nmr
$$ C:\u/data/dgb/nmr/ADRS/16400/pdata/1/auditp.txt
$$ ##AUDIT TRAIL=  $$ (NUMBER, WHEN, WHO, WHERE, WHAT)
(   1,<2006-02-20 16:53:48.42 +000>,<MAYBRIDGE\nmr>,<NMR_250MHZ>,
      <created by zg, POWCHK disabled, PULCHK disabled
       configuration hash MD5:
       84 BC 41 DB A1 6E 1D 46 DA 25 12 A5 C1 ED C5 3A
       data hash MD5: 64K
       51 70 1C ED 6B 41 B2 E6 FA 19 CF 2A 12 6B E3 61>)
(   2,<2006-02-20 16:54:05.53 +000>,<MAYBRIDGE\nmr>,<NMR_250MHZ>,
      <Start of raw data processing
       ef LB = 0.3 FT_mod = 6 PKNL = 1 SI = 32K 
       data hash MD5: 32K
       98 A8 04 8E 1B D1 60 39 8A A6 32 30 CD 0C 3E D3>)
(   3,<2006-02-20 16:54:09.79 +000>,<MAYBRIDGE\nmr>,<NMR_250MHZ>,
      <apk 
       data hash MD5: 32K
       E8 85 6F 4A 7A 67 55 4D 6C 45 29 25 13 8F 74 6A>)
(   4,<2006-02-20 16:54:11.34 +000>,<MAYBRIDGE\nmr>,<NMR_250MHZ>,
      <abs ABSG = 5 
       data hash MD5: 32K
       31 0D AD 58 50 56 22 EC 59 01 F8 EC A8 52 84 7B>)
$$ ##END=
$$ 
$$ hash MD5
$$ 2E FA 40 17 E1 60 44 B4 01 63 BB 03 93 9D C5 E8
##$RELAX= 
##$RELAX= 
##$RELAX= 
##$RELAX= 
##$RELAX= 
##$RELAX= 
##$RELAX= 
$$ Bruker specific parameters
$$ --------------------------
##$DU= <C:\u>
##$EXPNO= 16400
##$NAME= <ADRS>
##$PROCNO= 1
##$TYPE= <nmr>
##$USER= <dgb>
##$AMP= (0..31)
100 100 100 100 100 100 100 100 100 100 100 100 100 100 100 100 100 100 
100 100 100 100 100 100 100 100 100 100 100 100 100 100 
##$AQSEQ= 0
##$AQ_mod= 3
##$AUNM= <au_zg>
##$AUTOPOS= <54 >
##$BF1= 250.13
##$BF2= 250.13
##$BF3= 250.13
##$BF4= 250.13
##$BF5= 500.13
##$BF6= 500.13
##$BF7= 500.13
##$BF8= 500.13
##$BYTORDA= 1
##$CFDGTYP= 0
##$CFRGTYP= 5
##$CHEMSTR= <none>
##$CNST= (0..31)
1 1 145 1 1 1 1 1 1 1 1 1 1 1 1 1 1 1 1 1 1 1 1 1 1 1 1 1 1 1 1 1 
##$CPDPRG= <>
##$CPDPRG1= <>
##$CPDPRG2= <>
##$CPDPRG3= <>
##$CPDPRG4= <mlev>
##$CPDPRG5= <mlev>
##$CPDPRG6= <mlev>
##$CPDPRG7= <mlev>
##$CPDPRG8= <mlev>
##$CPDPRGB= <>
##$CPDPRGT= <>
##$D= (0..31)
0 1 0 0 0 0 0 0 0 0.06 0 0 0 0 0 0 0.0002 0 0 0 0 0 0 0 0 0 0 0 0 0 0 
0 
##$DATE= 1140454427
##$DBL= (0..7)
120 120 120 120 120 120 120 120 
##$DBP= (0..7)
150 150 150 150 150 150 150 150 
##$DBP07= 0
##$DBPNAM0= <>
##$DBPNAM1= <>
$$ [...]
##$SUBNAM7= <"">
##$SUBNAM8= <"">
##$SUBNAM9= <"">
##$SW= 20.6930455092707
##$SWIBOX= (0..15)
0 0 3 0 0 0 0 0 0 0 0 0 0 0 0 0 
##$SW_h= 5175.983436853
##$TD= 65536
##$TD0= 1
##$TE= 294.16
##$TE2= 300
##$TE3= 300
##$TEG= 300
##$TL= (0..7)
0 120 120 120 120 120 120 120 
##$TP= (0..7)
150 150 150 150 150 150 150 150 
##$TP07= 0
##$TPNAME0= <>
##$TPNAME1= <>
##$TPNAME2= <>
##$TPNAME3= <>
##$TPNAME4= <>
##$TPNAME5= <>
##$TPNAME6= <>
##$TPNAME7= <>
##$TPOAL= (0..7)
0.5 0.5 0.5 0.5 0.5 0.5 0.5 0.5 
##$TPOFFS= (0..7)
0 0 0 0 0 0 0 0 
##$TUNHIN= 0
##$TUNHOUT= 0
##$TUNXOUT= 0
##$USERA1= <user>
##$USERA2= <user>
##$USERA3= <user>
##$USERA4= <user>
##$USERA5= <user>
##$V9= 5
##$VALIST= <valist>
##$VCLIST= <CCCCCCCCCCCCCCC>
##$VD= 0
##$VDLIST= <DDDDDDDDDDDDDDD>
##$VPLIST= <PPPPPPPPPPPPPPP>
##$VTLIST= <TTTTTTTTTTTTTTT>
##$WBST= 1024
##$WBSW= 4
##$XGAIN= (0..3)
0 0 0 0 
##$XL= 0
##$YL= 0
##$YMAX_a= 401078
##$YMIN_a= -380427
##$ZGOPTNS= <>
##$ZL1= 120
##$ZL2= 120
##$ZL3= 120
##$ZL4= 120
##$ABSF1= 16.522
##$ABSF2= -4.171173
##$ABSG= 5
##$ABSL= 3
##$ALPHA= 0
##$AQORDER= 0
##$ASSFAC= 0
##$ASSFACI= 0
##$ASSFACX= 0
##$ASSWID= 0
##$AUNMP= <proc_1d>
##$AZFE= 0.1
##$AZFW= 0.1
##$BCFW= 0
##$BC_mod= 0
##$BYTORDP= 0
##$COROFFS= 0
##$CY= 12.5
##$DATMOD= 1
##$DC= 0
##$DFILT= <>
##$DTYPP= 0
##$F1P= 14.0000005364418
##$F2P= -0.99999901652339
##$FCOR= 0.5
##$FTSIZE= 32768
##$FT_mod= 6
##$GAMMA= 0
##$GB= 0
##$INTBC= 1
##$INTSCL= 1
##$ISEN= 128
##$LB= 0.3
##$LEV0= 0
##$LPBIN= 0
##$MAXI= 10000
##$MC2= 0
##$MEAN= 0
##$ME_mod= 0
##$MI= 0
##$NCOEF= 0
##$NC_proc= -4
##$NLEV= 6
##$NOISF1= 0
##$NOISF2= 0
##$NSP= 0
##$NTH_PI= 0
##$NZP= 0
##$OFFSET= 16.522
##$PC= 1
##$PHC0= 240.5195
##$PHC1= 0.200632
##$PH_mod= 1
##$PKNL= yes
##$PPARMOD= 0
##$PSCAL= 4
##$PSIGN= 0
##$REVERSE= no
##$SF= 250.13
##$SI= 32768
##$SIGF1= 0
##$SIGF2= 0
##$SINO= 400
##$SIOLD= 32768
##$SREGLST= <1H.DMSO>
##$SSB= 0
##$STSI= 32768
##$STSR= 0
##$SW_p= 5175.98343685301
##$SYMM= 0
##$S_DEV= 0
##$TDeff= 65536
##$TDoff= 0
##$TI= <Analysis number 999999
Compound Code 99
Book Reference 9
Project Code 9>
##$TILT= no
##$TM1= 0
##$TM2= 0
##$TOPLEV= 0
##$USERP1= <user>
##$USERP2= <user>
##$USERP3= <user>
##$USERP4= <user>
##$USERP5= <user>
##$WDW= 1
##$XDIM= 32768
##$YMAX_p= 398031236
##$YMIN_p= -333431
$$ End of Bruker specific parameters
$$ ---------------------------------
##NTUPLES= NMR SPECTRUM
##VAR_NAME=  FREQUENCY,     SPECTRUM/REAL,   SPECTRUM/IMAG
##SYMBOL=    X,             R,               I
##VAR_TYPE=  INDEPENDENT,   DEPENDENT,       DEPENDENT
##VAR_FORM=  AFFN,          ASDF,            ASDF
##VAR_DIM=   32768,         32768,           32768
##UNITS=     HZ,            ARBITRARY UNITS, ARBITRARY UNITS
##FACTOR=    0.157963299565203, 1,           1
##FIRST=     4132.6476996994, 0,             0
##LAST=      -1043.33573715361, 0,           0
##MIN=       -1043.33573715361, -333431,     0
##MAX=       4132.6476996994, 398031236,     0
$$ Real data points
##PAGE= N=1
##DATA TABLE= (X++(R..R)), XYDATA
$$ [...]
$$ plain form
16004 21564 89670 62747 3418 16772 6528 54168 85653 87442 47665 -1313 -75974 -99779
15992 -99779 -36383 -36207 33219 83164 4399 -80371 -124287 -76203 -8005 78115 25608 -13371
15980 -13371 20082 30187 -31743 -14788 -14671 -19343 6518 3789 -51573 -160238 -71645 -22676
15968 -22676 -118243 -200480 -142600 -112143 -19814 66233 38809 71702 151692 142142 -49415 -47031
15956 -47031 14364 52440 38211 3582 -52722 -106692 -107515 -113921 -101622 -39922 1281 51712
15944 51712 90956 63253 -6808 -113820 -110927 -94842 -135200 -138225 -101968 -64190 -68610 -34468
15932 -34468 -67072 -104059 -86210 -49070 -54044 -138028 -177962 -176418 -93086 -7620 -5406 -13541
15920 -13541 31534 29826 48638 32986 19873 -5163 -42505 -37155 -6048 -59025 -89682 -6264
$$ packed form
16004B1564O8106k6923n9329J3354j0244M7640L1485J789l9777m8978p4661k3805
15992i9779O3396J76O9426M9945p8765q4770m3916M8084O8198Q6120n2507l8979
15980a3371L3453J0105o1930J6955J17m672K5861k729n5362j08665Q8593M8969
15968b2676r5567q2237N7880L0457R2329Q6047k7424L2893P9990r550j91557K384
15956d7031O1395L8076j4229l4629n6304n3970q23o406J2299O1700M1203N0431
15944E1712L9244k7703p0061j07012K893J6085m0358l025L6257L7778m420L4142
15932c4468l2604l6987J7849L7140m974q3984l9934J544Q3332Q5466K214q135
15920a3541M5075j708J8812j5652j3113k5036l7342N350L1107n2977l0657Q3418
$$ plain form
15908 -6264 81631 98158 111254 65282 -25102 -33893 46577 33987 40724 5863 -64612 -86698
15896 -86698 -62052 -31366 -92429 -83658 -120071 -63458 64037 51033 1490 24437 -9103 44111
15884 44111 95882 -7226 6330 63234 72196 60191 93624 52522 27156 26737 101115 87096
15872 87096 108020 -30141 -156883 -49059 27173 57176 28200 29209 -10183 -20613 25383
15861 25383 76054 48074 -32997 -27537 -88093 -92948 -77831 11949 43058 -9176 40621 185078
15849 185078 174350 50113 49176 36194 -4759 -16358 27725 -11630 -11190 -11360 1970 44666
15837 44666 98907 95379 10027 -129126 -177965 -109600 20149 63538 -3489 -4297 20621 60262
15825 60262 105637 24232 38015 -3016 -60028 -31047 -20592 22441 -10262 -55134 780 67898
$$ packed form
15908f264Q7895J6527J3096m5972r0384q791Q0470j2590O737l4861p0475k2086
15896h6698K4646L0686o1063Q771l6413N6613J27495j3004m9543K2947l3540N3214
15884D4111N1771j03108J3556N6904Q962j2005L3433m1102k5366m19P4378j4019
15872H7096K0924j38161j26742J07824P6232L0003k8976J009l9392j0430M5996
15861B5383N0671k7980q1071N460o0556m855J5117Q9780L1109n2234M9797J44457
15849A85078j0728j24237r37j2982m0953j1599M4083l9355M40j70J3330M2696
15837D4666N4241l528q5352j39153m8839O8365J29749M3389o7027q08K4918L9641
15825F0262M5375q1405J3783m1031n7012K8981J0455M3033l2703m4872N5914O7118
$$ plain form
15813 67898 -10763 -79036 -46418 -50507 -63130 -69582 -103556 -105249 672 -4625 -15674 44887
15801 44887 21017 16469 49043 -28545 -28882 -35131 -120991 -129265 -188371 -167129 -120603 -35589 30606
15788 30606 89660 54181 -20888 -14801 48505 2575 -62638 -103834 21133 50332 -26288 -68209
15776 -68209 -22168 21672 11090 -22390 -16504 58547 84783 828 -132788 -237359 -208472
15765 -208472 -102699 -70640 -40321 16290 78417 62128 53296 43248 -8846 -56716 -85561
15754 -85561 -73216 -10872 -2817 3989 110521 133148 139468 174469 119819 60480 -15522 -25822
15742 -25822 47709 113631 225706 205000 144776 85768 47379 80565 110314 78731 -10067
15731 -10067 -87012 -71085 49197 139870 191521 86203 10960 38837 -31188 -8929 56996
$$ packed form
15813F7898p8661o8273L2618m089j2623o452l3974j693J05921n297j1049O0561
15801D4887k3870m548L2574p7588l37o249q5860q274n9106K1242M6526Q5014O6195
15788C0606N9054l5479p5069O087O3306m5930o5213m1196J24967K9199p6620m1921
15776f8209M6041M3840j0582l3480N886P5051K6236q3955j33616j04571K8887
15765b08472J05773L2059L0319N6611O2127j6289q832j0048n2094m7870k8845
15754h5561J2345O2344Q055O806J06532K2627O320L5001n4650n9339p6002j0300
15742b5822P3531O5922J12075k0706o0224n9008l8389L3186K9749l1583q8798
15731a0067p6945J5927J20282R0673N1651j05318p5243K7877p0025K2259O5925
$$ plain form
15720 56996 44579 57450 59528 85748 117468 41626 38307 -19347 27253 -39621 -113546 -59952
15708 -59952 28289 -84901 -107761 26214 104054 58689 30452 94315 103205 95033 30610 21568
15696 21568 50487 81106 72249 68220 14421 24448 -31667 -120148 -82889 -59328 1900 3002
15684 3002 -36857 21554 173523 289852 276162 190247 155311 88668 -9331 -27988 -19868 -19608
15672 -19608 -9357 -2419 -23869 12277 -35142 -124540 -95278 -43685 -63686 -65439 -61919 -81853
15660 -81853 -49170 57493 81729 56905 98287 65954 74756 76652 106638 99250 104504 73799
15648 73799 120349 117373 49925 89046 59495 37814 28588 22867 -65987 -85189 -30076 -68860
15636 -68860 -60498 -46415 -33491 -676 12007 -4532 -99119 -170399 -154853 -100100 -34630 2553
$$ packed form
15720E6996j2417J2871K078K6220L1720p5842l319n7654M6600o6874p3925N3594
15708e9952Q8241j13190k2860J33975P7840m5365k8237O3863Q890q172o4423r042
15696B1568K8919L0619q857m029n3799J0027n6115q8481L7259K3561O1228J102
15684C002l9859N8411J51969J16329j3690q5915l4936o6643r7999j8657Q120K60
15672a9608J0251O938k1450L6146m7419q9398K9262N1593k0001j753L520j9934
15660h1853L2683J06663K4236k4824M1382l2333Q802J896K9986p388N254l0705
15648G3799M6550k976o7448L9121k9551k1681r226n721q8854j9202N5113l8784
15636f8860Q362J4083J2924L2815J2683j6539r4587p1280J5546N4753O5470L7183
$$ plain form
15624 2553 -29580 -89307 -114144 -74227 -53641 10030 -36482 -67806 -28233 15673 -36866 25098
15612 25098 81471 91972 86752 52694 36013 7160 -72676 -114213 -70297 -47575 -8536 10406
15600 10406 12358 -36914 -89563 -136692 -208255 -178325 -81703 -29937 9107 -22931 30572 71716
15588 71716 -20555 -94429 -105119 -102169 -108815 -95392 -1766 68001 -4856 -4940 50406 29334 -59659
15575 -59659 -17489 -39873 -62699 -65836 -13112 -25855 -9842 3183 -52425 -58517 -74887 -110279
15563 -110279 -104900 -73274 -10241 -25479 -106206 -83450 34358 19352 8662 36750 66889
15552 66889 79732 8175 15090 -36968 -81318 1587 67896 29245 -15609 3184 5342 -13000
15540 -13000 -25695 -66263 44586 121858 91210 -9621 98527 193623 82510 72984 23176
$$ packed form
15624B553l2133n9727k4837L9917K0586O3671m6512l1324L9573M3906n2539O1964
15612B5098N6373J0501n220l4058j6681k8853p9836m1537M3916K2722L9039J8942
15600A0406J952m9272n2649m7129p1563K9930R6622N1766L9044l2038N3503M1144
15588G1716r2271p3874j0690K950o646J3423R3626O9767p2857q4N5346k1072q8993
15575e9659M2170k2384k2826l137N2724j2743J6013J3025n5608o092j6370l5392
15563a10279N379L1626O3033j5238q0727K2756J17808j5006j0690K8088L0139
15552F6889J2843p1557O915n2058m4350Q2905O6309l8651m4854J8793K158j8342
15540a3000j2695m0568J10849P7272l0648j00831J08148R5096j11113r526m9808
$$ plain form
15529 23176 -471 4038 6621 68902 78532 52034 61608 980 -71869 -131711 -95793 -83265
15517 -83265 -21563 24055 45539 -8436 -8566 -22919 -51591 -101428 -88385 -33208 24356 60506
15505 60506 181976 110800 -7167 41098 84213 156108 221638 187526 169085 114544 47991
15494 47991 49527 12761 1200 35765 25019 25541 86983 33346 49900 102890 15798 -40526
15482 -40526 430 13323 10302 13428 -9638 16867 60975 75620 134620 131695 111023 106270
15470 106270 54197 -37730 -78211 -18210 46884 79649 88927 -15370 -100729 -53176 -24077
15459 -24077 -50336 -136222 -151460 -21230 -9699 26124 48625 -18740 24796 28469 6348 3766
15447 3766 -10436 45468 52471 -2215 21278 29446 76526 53783 35158 110451 68915 230
$$ packed form
15529B3176k3647M509K583O2281R630k6498R574o0628p2849n9842L5918J2528
15517h3265O1702M5618K1484n3975j30j4353k8672m9837J3043N5177N7564L6150
15505F0506J21470p1176j17967M8265M3115P1895O5530l4112j8441n4541o6553
15494D7991J536l6766j1561L4565j0746N22O1442n3637J6554N2990q7092n6324
15482d0526M0956J2893l021L126k3066K6505M4108J4645N9000k925k0672m753
15470A06270n2073r1927m0481O0001O5094L2765R278j04297q5359M7553K9099
15459b4077k6259q5886j5238J30230J1531L5823K2501o7365M3536L673k2121k582
15447C766j4202N5904P003n4686K3493Q168M7080k2743j8625P5293m1536o8685
$$ plain form
15435 230 28273 79688 35772 -57211 -56168 37890 14343 52727 51805 18521 58096 89336 118507
15422 118507 125076 126834 2331 -9501 -28662 -122884 -122936 -161644 -223534 -185823 -60293 -19156
15410 -19156 -67700 -86932 28084 80475 40932 83082 42528 58564 78680 93214 84025 57760
15398 57760 64628 36611 3422 21810 -31595 -65215 4240 57646 25387 30243 64645 -24156
15386 -24156 -59948 14094 107193 90921 41950 -63215 -111986 -102885 -34671 -15922 30154 -3262
15374 -3262 -36491 -13844 19078 30337 -4520 -57216 -91837 -123849 -136563 -201651 -164495 -84352
15362 -84352 68025 205746 194221 162688 237556 318755 231569 153959 113209 34590 27566
15351 27566 29836 -14330 -126773 -139190 -117241 -158334 -142354 -29010 9374 6754 -73566 -129272
$$ packed form
15435B30K8043N1415m3916r2983J043R4058k3547L8384r22l3284L9575L1240K9171
15422A18507O569J758j24503j1832j9161r4222n2l8708o1890L7711J25530M1137
15410a9156m8544j9232J15016N2391l9543M2150m0554J6036K0116J4534r189k6265
15398E7760O868k8017l3189J8388n3405l3620O9455N3406l2259M856L4402q8801
15386b4156l5792P4042R3099j6272m8971j05165m8771R101O8214J8749M6076l3416
15374c262l3229K2647L2922J1259l4857n2696l4621l2012j2714o5088L7156Q0143
15362h4352J52377J37721j1525l1533P4868Q1199q7186p7610m0750p8619p024
15351B7566K270m4166j12443j2417K1949m1093J5980J13344L8384k620q0320n5706
$$ plain form
15339 -129272 -65926 -65250 -40663 -4329 54591 83479 8603 -44591 -122268 -155041 -144969 -140232
15327 -140232 -78981 -66715 -12562 60677 88818 111599 126595 15634 32401 76374 -8574
15316 -8574 -38894 -103754 -94210 -78799 -95362 -90043 -113670 -147429 -207336 -104456 -151578 -173098
15304 -173098 -116568 -30883 40180 25935 -1766 25721 33584 43860 34941 80199 101416 69894
15292 69894 68992 96536 106058 75057 83534 57756 61804 137769 111369 -35580 -91291 -79640
15280 -79640 -50349 9617 20962 86699 115843 173551 152541 149640 82135 19414 2643 46705
15268 46705 -10389 -64968 -2267 -54361 -30370 15088 -4370 -35908 -179163 -103589 -28850
15257 -28850 -71136 -94117 -24158 -37113 -51210 -47081 -5284 -21023 -106101 -142696 -81386 -54777
$$ packed form
15339a29272O3346O76K4587L6334N8920K8888p4876n3194p7677l2773J0072M737
15327a40232O1251J2266N4153P3239K8141K2781J4996j10961J6767M3973q4948
15316h574l0320o4860R544J5411j6563N319k3627l3759n9907J02880m7122k1520
15304a73098N6530Q5685P1063j4245k7701K7487P863J0276q919M5258K1217l1522
15292F9894r02K7544R522l1001Q477k5778M048P5965k6400j46949n5711J1651
15280g9640K9291N9966J1345O5737K9144N7708k1010k901o7505o2721j6771M4062
15268D6705n7094n4579O2701n2094K3991M5458j9458l1538j43255P5574P4739
15257b8850m2286k2981O9959j2955j4097M129M1797j5739q5078l6595O1310K6609
$$ plain form
15245 -54777 -116580 -108532 -12580 -9876 12557 32066 23765 13182 12275 31495 119062 298909
15233 298909 298050 242271 163824 73684 89329 93208 33593 87252 115778 18470 -3855 -62156
15221 -62156 -113249 -58579 29744 68164 50509 79126 56827 33019 66401 80135 99145 95311
15209 95311 13854 2320 -40841 -47359 -76287 -78067 -21877 36007 68304 60107 69742 15218
15197 15218 5823 43954 33091 -113733 -143898 -118377 -120069 -71045 -87363 -114984 -106713 -106650 -99153
15184 -99153 -57660 -34263 -9962 40669 88295 65723 21645 48006 53632 13827 -5646 16633
15172 16633 30000 -1471 -49582 74271 62272 -62105 -68915 -58473 -25716 -1853 -47556
15161 -47556 -24149 -33930 27527 101597 85581 5541 -7643 24145 -25174 -10806 8144 -87769
$$ packed form
15245e4777o1803Q048R5952K704K2433J9509q301j0583r07J9220Q7567J79847
15233B98909q59n5779p8447r0140J5645L879n9615N3659K8526r7308k2325n8301
15221f2156n1093N4670Q8323L8420j7655K8617k2299k3808L3382J3734J9010l834
15209I5311q1457j1534m3161o518k8928j780N6190N7884L2297q197R635n4524
15197A5218r395L8131j0863j46824l0165K5521j692M9024j6318k7621Q271O3P497
15184i9153M1493K3397K4301N0631M7626k2572m4078K6361N626l9805j9473K2279
15172A6633J3367l1471m8111J23853j1999j24377o810J0442L2757K3863m5703
15161d7556K3407r781O1457P4070j6016q0040j3184L1788m9319J4368J8950r5913
$$ plain form
15149 -87769 -133827 -36356 21604 3161 -51210 -70935 -113427 -86150 11671 34235 34374 24447
15137 24447 -39768 -23055 -631 -1439 -60974 -103509 -60521 -25743 -24301 -42728 -75889 -59825
15125 -59825 -50289 -142973 -142101 -102374 -132140 -171068 -19369 109056 133227 103820 96780 53686
15113 53686 -4600 -78753 -53037 -37723 -65673 -78486 -66707 -67033 -62798 30898 10117 41258
15101 41258 26349 70852 120455 70703 34476 83121 4639 -13906 31672 -846 78403 122949
15089 122949 113946 63889 5270 26275 57527 56729 27159 -25805 -32914 -55930 -55278 -105424 -62390
15076 -62390 -73366 -51276 10856 49224 48741 47554 86623 158287 176730 110747 52163 9775
15064 9775 8878 -39469 15068 -11272 14421 -14273 4957 -60480 -104153 -93749 -109879 -104841
$$ packed form
15149h7769m6058R7471N7960j8443n4371j9725m2492K7277R7821K2564J39r927
15137B4447o4215J6713K2424q08n9535m2535M2988L4778J442j8427l3161J6064
15125e9825R536r2684Q72L9727k9766l8928J51699J28425K4171k9407p040m3094
15113E3686n8286p4153K5716J5314k7950j2813J1779l26M235R3696k0781L1141
15101D1258j4909M4503M9603m9752l6227M8645p8482j8545M5578l2518P9249M4546
15089A22949r003n0057n8619K1005L1252p98k9570n2964p109k3016O52n0146M3034
15076f2390j0976K2090O2132L8368m83j187L9069P1664J8443o5983n8584m2388
15064I775q97m8347N4537k6340K5693k8694J9230o5437m3673J0404j6130N038
$$ plain form
15052 -104841 -61702 -52990 -22290 -4709 -43456 -72544 -47166 16315 37766 61512 117994 135431
15040 135431 102171 28186 -77737 -127140 -89150 -49560 -77127 -6943 -6420 -37144 -41002 1752
15028 1752 22379 68829 85754 -10850 -40009 -58386 -36183 -33787 -1609 38945 50232 8319
15016 8319 -68851 -78944 -13078 94388 73247 32671 -28874 -24967 -36061 -86395 -27001 -43973
15004 -43973 -17642 9688 37612 25259 42129 110033 19654 -38784 -158601 -232638 -183586
14993 -183586 -131512 -103409 -97567 -46977 58042 76740 81923 52031 28734 40805 59613 -20048
14981 -20048 -74940 -124413 -171517 -136976 -18842 57825 -5898 -69483 -28581 -25066 -59196 -9738
14969 -9738 74908 108215 88443 61130 1073 -42108 -43983 80879 63791 68870 33301 80241
$$ packed form
15052a04841M3139Q712L0700J7581l8747k9088K5378O3481K1451K3746N6482J7437
15040A35431l3260p3985j05923m9403L7990L9590k7567P0184N23l0724l858M2754
15028A752K0627M6450J6925r6604k9159j8377K2203K396L2178M0554J1287m1913
15016H319p7170j0093O5866J07466k1141m0576o1545L907j1094n0334N9394j6972
15004d3973K6331K7330K7924j2353J6870O7904r0379n8438j19817p4037M9052
14993a83586N2074K8103N842N0590J05019J8698N183k9892k3297J2071J8808p9661
14981b0048n4892m9473m7104L4541J18134P6667o3723o3585M0902L515l4130M9458
14969i738Q4646L3307j9772k7313o0057m3181j875J24862j7088N079l5569M6940
$$ plain form
14957 80241 111108 16964 -30027 -28976 -79960 -79414 16348 4884 -54595 -24896 19368 -1444
14945 -1444 -59725 -24574 12422 4564 -51002 -109022 -138692 -200674 -213034 -153633 -112375 -109084
14933 -109084 -73218 -52188 -53845 -35926 -70461 -62905 7019 121901 154104 49043 -28536
14922 -28536 34484 -30814 -66468 2433 -4823 -85072 -72718 -86614 38001 259864 250702 141819
14910 141819 109519 100971 61253 32035 25424 9109 -62031 -82324 -48128 -78338 3890 156809
14898 156809 172540 52909 7793 27227 34523 -16506 1197 21222 39431 54789 26984
14887 26984 -28854 -88075 -61838 9673 31609 -71606 -120260 -72577 24218 18875 28412 114766
14875 114766 109094 93125 77925 31509 236 30310 63821 36630 36480 14242 -128461 -144599
$$ packed form
14957H0241L0867r4144m6991J051n0984N46R5762j1464n9479K9699M4264k0812
14945a444n8281L5151L6996p858n5566n8020k9670o1982j2360N9401M1258L291
14933a09084L5866K1030j657J7919l4535P556O9924J14882L2203j05061p7579
14922b8536O3020o5298l5654O8901p256q0249J2354j3896J24615K21863r162j08883
14910A41819l2300q548l9718k9218o611j6315p1140k0293L4196l0210Q2228J52919
14898A56809J5731j19631m5116J9434P296n1029J7703K0025J8209J5358k7805
14887B6984n5838n9221K6237P1511K1936j03215m8654M7683R6795n343R537Q6354
14875A14766n672j5969j5200m6416l1273L0074L3511k7191j50k2238j42703j6138
$$ plain form
14863 -144599 -128484 -167088 -144307 -113035 -29967 35252 77619 108917 65198 -32321 -63423
14852 -63423 -114149 -109073 -115233 -158583 -54944 -27748 12863 66102 103109 65138 44212 -38672
14840 -38672 60234 87994 39341 63628 98126 106684 128012 101888 70618 32328 -13552 15751
14828 15751 -39311 21659 23545 -27324 -68658 -118240 -113755 -107553 -43236 15775 33068 2660
14816 2660 41626 110702 101138 24801 17523 -40838 -25659 40429 31732 -3963 -44581 -62057
14804 -62057 -83988 -68102 -21898 75605 35901 38740 74898 41718 26539 -36369 -70748 5952
14792 5952 56071 -6090 -62021 -83621 1710 22670 -35083 -42220 -30967 -58529 36638 19427
14780 19427 2586 71500 85512 97315 33454 65853 25157 58204 59497 82786 26123 23610
$$ packed form
14863a44599J6115l8604K2781L1272Q3068O5219M2367L1298m3719r7519l1102
14852f3423n0726N076o160m3350J03639K7196M0611N3239L7007l7971k0926q2884
14840c8672R8906K7760m8653K4287L4498Q558K1328k6124l1270l8290m5880K9303
14828A5751n5062O0970J886n0869m1334m9582M485O202O4317N9011J7293l0408
14816B660L8966O9076r564p6337p278n8361J5179O6088q697l5695m0618j7476
14804f2057k1931J5886M6204R7503l9704K839L6158l3180j5179o2908l4379P6700
14792E952N0119o2161n5931k1600Q5331K0960n7753p137J1253k7562R5167j7211
14780A9427j6841O8914J4012J1803o3861L2399m0696L3047J293K3289n6663k513
$$ plain form
14768 23610 16434 -25429 -5351 -27965 -47361 -68824 -31820 16610 -26603 -127248 -185350 -138590
14756 -138590 -66488 -38216 3079 58255 89989 104773 148492 131148 21113 81264 174206
14745 174206 189089 99238 -3366 -60191 -36770 -11690 14618 48105 33474 125565 112267
14734 112267 54140 64548 126370 112164 26237 -9486 -71825 -62481 -17499 -69011 23672 114560
14722 114560 146186 123555 84488 11958 22078 17149 -44617 -86489 -110798 -152961 -81501 -69324
14710 -69324 -69986 -70707 206 -2535 3427 49979 57022 -12144 -89374 -143752 -73631 -76705 -57577
14697 -57577 -12872 6984 10214 -10736 38095 35752 33369 93938 106412 52740 30825 29111
14685 29111 62162 54100 99631 87038 68286 62606 83484 183466 113907 29211 40579 97232
$$ packed form
14768B3610p176m1863K0078k2614j9396k1463L7004M8430m3213j00645n8102M6760
14756a38590P2102K8272M1295N5176L1734J4784M3719j7344j10035O0151R2942
14745A74206J4883q9851j02604n6825K3421K5080K6308L3487j4631R2091j3298
14734A12267n8127J0408O1822j4206q5927l5723o2339R344M4982n1512R2683R0888
14722A14560L1626k2631l9067p2530J0120m929o1766m1872k4309m2163P1460J2177
14710f9324o62p21P0913k741N962M6552P043o9166p7230n4378P0121l074J9128
14697e7577M4705J9856L230k0950M8831k343k383O0569J2474n3672k1915j714
14685B9111L3051q062M5531j2593j8752n680K0878R9982o9559q4696J1368N6653
$$ plain form
14673 97232 152399 123252 62150 -24952 -62740 -31933 92243 182866 201316 180838 112735
14662 112735 37210 -1060 -7203 -44380 -1321 10662 -99893 -166759 -86833 -9978 57651
14651 57651 111792 135580 86331 9300 33684 58589 6616 -65794 -72610 -18118 17790 21246
14639 21246 -46323 -112989 -119142 -126551 -48540 -13706 -35638 -52120 -93927 -137411 -92436 24823
14627 24823 -29769 -57028 27092 54747 61039 68692 64972 -6851 11636 1623 33299 -19513
14615 -19513 -37498 -19139 -74490 -29351 1291 -59502 -91090 -99107 -111341 -98475 -130159 -160885
14603 -160885 -121016 9388 -19325 -66425 -65935 -14491 17484 -4707 31621 61126 37396 29873
14591 29873 3229 -28035 -143640 -135794 -133485 -25625 23508 -1042 -76196 494 45482 -15181
$$ packed form
14673I7232N5167k9147o1102q7102l7788L0807J24176R0623J8450k0478o8103
14662A12735p5525l8270o143l7177M3059J1983j10555o6866P9926P6855O7629
14651E7651N4141K3788m9249p7031K4384K4905n1973p2410o816N4492L5908L456
14639B1246o7569o6666o153p409P8011L4834k1932j6482m1807m3484M4975J17259
14627B4823n4592k7259Q4120K7655O292P653l720p1823J8487j0013L1676n2812
14615a9513j7985J8359n5351M5139L0642o0793l1588q017j2234J2866l1684l0726
14603a60885L9869J30404k8713m7100M90N1444L1975k2191L6328K9505k3730p523
14591B9873k6644l1264j15605P846K309J07860M9133k4550p5154P6690M4988o0663
$$ plain form
14579 -15181 -33457 -44431 -46 -25905 -45418 40849 53605 -6863 -65654 -104569 -114716 -125526
14567 -125526 -34780 -5769 -33615 21276 2126 -66175 -60112 41806 93750 85370 93633 70961
14555 70961 100163 123457 33648 -26020 -64912 -93972 -57711 -59764 -35529 27017 30973 -61496
14543 -61496 -116013 -88068 -17858 12389 -57431 -10507 3445 21222 -7408 20572 17703 7426
14531 7426 -9496 -74652 -131671 -26007 11988 -70184 -29278 30398 61396 86579 31113 63705
14519 63705 27438 -11570 60957 85579 55176 38632 4048 -34126 21200 7086 -53612 19941
14507 19941 125919 158406 146048 87745 61791 47341 -28861 -26518 45459 65622 106333 79873
14495 79873 96868 71429 38658 33159 -59923 -26187 -12302 17679 -5934 -53676 -44732 45812
$$ packed form
14579a5181j8276j0974M4385k5859j9513Q6267J2756o0468n8791l8915j0147j0810
14567a25526R0746K9011k7846N4891j9150o8301O063J01918N1944q380Q263k2672
14555G0961K9202K3294q9809n9668l8892k9060L6261k053K4235O2546L956r2469
14543f1496n4517K7945P0210L0247o9820M6924J3952J7777k8630K7980k869j0277
14531G426j6922o5156n7019J05664L7995q2172M0906N9676L0998K5183n5466L2592
14519F3705l6267l9008P2527K4622l0403j6544l4584l8174N5326j4114o0698P3553
14507A9941J05978L2487j2358n8303k5954j4450p6202K343P1977K0163M0711k6460
14495G9873J6995k5439l2771n499r3082L3736J3885K9981k3613m7742Q944R0544
$$ plain form
14483 45812 39602 -29272 -31547 -12846 -30066 28113 119629 115646 85982 49250 34135 84242
14471 84242 177831 128726 35559 95867 183025 50638 -54520 -28888 -45894 -105252 -85117
14460 -85117 -123005 -213235 -222430 -163598 -123736 -70815 -8265 -5679 -38707 -11689 -39699 -70535
14448 -70535 -16472 -17604 -47064 -81757 -109199 -65588 -58926 -11461 38580 30745 -9739 20821
14436 20821 59530 45972 72738 73553 90133 33750 15981 97622 155789 173070 132974 122260
14424 122260 44685 -24964 -67100 -112808 -227002 -138022 -114336 -115028 -99407 -59287 50111
14413 50111 48931 -17412 -29521 -93739 -54482 44210 93656 86449 44736 11470 -1337 -27548
14401 -27548 -28390 6458 33563 70735 98672 93501 -6713 -95177 -105203 -3726 -33190 -46412
$$ packed form
14483D5812o210o8874k275J8701j7220N8179R1516l983k9664l6732j5115N0107
14471H4242R3589m9105r3167O0308Q7158j32387j05158K5632j7006n9358K0135
14460h5117l7888r0230r195N8832L9862N2921O2550K586l3028K7018k8010l0836
14448g0535N4063j132k9460l4693k7442M3611O662M7465N0041p835m0484L0560
14436B0821L8709j3558K6766Q15J6580n6383j7769Q1641N8167J7281m0096j0714
14424A22260p7575o9649m2136m5708j14194Q8980K3686o92J5621M0120J09398
14413E0111j180o6343j2109o4218L9257R8692M9446p207m1713l3266j2807k6211
14401b7548q42L4848K7105L7172K7937n171j00214q8464j0026J01477k9464j3222
$$ plain form
14389 -46412 32854 -33295 -55699 -34195 18348 42060 75988 -24667 4580 -2513 62267 108674
14377 108674 90079 53629 21271 29638 -24119 -48585 -55512 8227 25437 5518 -33038 -47005
14365 -47005 69764 83457 50809 111236 61955 -52391 -73088 -35232 -10704 -28439 6739
14354 6739 15337 -61753 -54791 -31242 -17040 -18279 -30619 -19230 18436 15122 -1358 14259 136123
14341 136123 175794 68436 -1474 -29952 -89464 -84816 -69688 -82985 -80139 -1831 95987 68917
14329 68917 52059 40056 -84787 -110533 -24558 82064 84649 88226 109973 48167 -14500 29753
14317 29753 70432 67990 39418 64000 70104 30372 31036 18267 -32783 -15020 25779 -39527
14305 -39527 -32780 -82652 -49670 11236 99683 105162 10240 28362 101666 101595 78233 79396 47222
$$ packed form
14389d6412P9266o6149k2404K1504N2543K3712L3928j00655K9247p093O4780M6407
14377A08674j8595l6450l2358Q367n3757k4466o927O3739J7210j9919l8556j3967
14365d7005J16769J3693l2648O0427m9281j14346k0697L7856K4528j7735L5178
14354F739Q598p7090O962K3549J4202j239j2340J1389L7666l314j6480J5617J21864
14341A36123L9671j07358o9910k8478n9512M648J5128j3297K846P8308R7818k7070
14329F8917j6858j2003j24843k5746Q5975J06622K585L577K1747o1806o2667M4253
14317B9753M0679k442k8572K4582O104l9732O64j2769n1050J7763M0799o5306
14305c9527O747m9872L2982O0906Q8447N479r4922J8122P3304p1k3362J163l2174
$$ plain form
14292 47222 23802 32107 19695 42732 2204 64184 141352 132983 138436 129707 51591 46102 15558
14279 15558 40687 96587 101461 107060 20147 1291 3863 6332 81347 36843 438 -17383
14267 -17383 70169 154747 127925 10460 -92785 -146905 -60204 8552 10040 5412 -92943 -140413
14255 -140413 -172840 -127971 -19834 -21288 -134007 -92105 -57233 10210 81637 124370 65614
14244 65614 50691 89617 13374 -35574 -23234 20121 77226 94623 83964 80142 38110 -24638
14232 -24638 -64015 -10938 54925 58657 57676 26015 57243 -4869 -61460 -90081 -151519 -136839
14220 -136839 -115509 -130056 -92757 -100505 -79673 -15305 -52999 -13495 -61366 -78121 -3245 22662
14208 22662 73861 65472 34514 29474 92766 47816 -15751 -43112 -41615 28805 22753 -53132
$$ packed form
14292D7222k3420Q305j2412K3037m0528O1980P7168q369N453q729p8116n489l0544
14279A5558K5129N5900M874N599q6913j8856K572K469P5015m4504l6405j7821
14267a7383Q7552Q4578k6822j17465j03245n4120Q6701O8756J488m628r8355m7470
14255a40413l2427M4869J08137j454j12719M1902L4872O7443P1427M2733n8756
14244F5614j4923L8926p6243m8948J2340M3355N7105J7397j0659l822m2032o2748
14232b4638l9377N3077O5863L732r81l1661L1228o2112n6591k8621o1438J4680
14220a36839K1330j4547L7299p748K0832O4368l7694L9504m7871j6755P4876K5907
14208B2662N1199q389l0958n040O3292m4950o3567k7361J497P0420o052p5885
$$ plain form
14196 -53132 -21075 31720 10849 -16388 -32466 -24999 7194 69050 39507 43979 51658 1248
14184 1248 8502 45403 103722 223450 163528 65493 56451 97973 79642 5434 3463 -4939
14172 -4939 4629 -22419 -125088 -75001 -37671 7938 -19474 -35514 -18207 34121 -27788 -75271
14160 -75271 -49767 -6339 -134719 -223370 -262077 -206178 -114829 -14940 -51824 -71707 -75043 -39052
14148 -39052 -69133 -25269 26869 34970 -27499 -126708 -114984 -28497 23564 -32668 -6159 77928
14136 77928 36452 -29386 5831 56753 145877 100299 9749 -49030 -98066 -193979 -110332 -38111
14124 -38111 -14270 -4184 -11657 -23537 -118620 -87027 -81175 -118091 -54718 -37343 -48922 -62254
14112 -62254 -128929 501 45678 -5031 79651 151254 177329 126184 2966 27354 105748
$$ packed form
14196e3132L2057N2795k0871k7237j6078P467L2193O1856k9543M472P679n0410
14184A248P254L6901N8319J19728n9922r8035r042M1522j8331p4208j971q402
14172d939R568k7048j02669N0087L7330M5609k7412j6040J7307N2328o1909m7483
14160g5271K5504M3428j28380q8651l8707N5899R1349R9889l6884j9883l336L5991
14148c9052l0081M3864N2138Q101o2469r9209J1724Q6487N2061n6232K6509Q4087
14136G7928m1476o5838L5217N0922Q9124m5578r0550n8779m9036r5913Q3647P2221
14124c8111K3841J0086p473j1880r5083L1593N852l6916O3373J7375j1579j3332
14112f2254o6675J29430M5177n0709Q4682P1603K6075n1145j23218K4388P8394
$$ plain form
14101 105748 132755 72436 50169 -2823 -18853 1850 -94967 -106080 12794 44921 37282
14090 37282 70490 46188 65557 45145 2125 -48898 -83249 -92567 -95178 -49566 -72461 -94902
14078 -94902 -8394 68594 172241 155967 65348 -15223 -14972 36454 53631 74249 83346 92395
14066 92395 118051 91273 107783 44187 -19679 42495 146858 151124 105073 62727 -42892
14055 -42892 -75381 -5157 26810 36191 55234 29113 51652 103299 111937 94435 113655 38810
14043 38810 26688 15131 45628 7100 36027 46133 27988 36236 12004 57973 46696 57457
14031 57457 59256 27533 53113 92973 51418 -43195 -72972 -43168 12336 111004 144788 87134
14019 87134 91077 105086 141832 177134 199072 80497 11181 18519 28796 -21901 7659 -29889
$$ packed form
14101A05748K7007o0319k2267n2992j6030K0703r6817j1113J18874L2127p639
14090C7282L3208k4302J9369k0412m3020n1023l4351r318k611M5612k2895k2441
14078i4902Q6508P6988J03647j6274r0619q0571K51N1426J7177K0618R097R049
14066I2395K5656k6778J6510o3596o3866O2174J04363M266m6051m2346j05619
14055d2892l2489P0224L1967R381J9043k6121K2539N1647Q638j7502J9220p4845
14043C8810j2122j1557L0497l8528K8927J0106j8145Q248k4232M5969j1277J0761
14031E7457J799l1723K5580L9860m1555r4613k9777K9804N5504R8668L3784n7654
14019H7134L943J4009L6746L5302K1938j18575o9316P338J0277n0697K9560l7548
$$ plain form
14007 -29889 -43924 122434 119068 168082 110945 101963 107823 68055 1458 -41872 182 -7150
13995 -7150 -10081 28542 -12583 -9646 52786 75234 82499 138146 131449 13651 -27151 -113330
13983 -113330 -115849 2901 96490 27079 38375 34543 -16065 -15599 -57013 -40074 10240 34850
13971 34850 36741 98798 69776 94750 131388 111553 39864 100547 88649 7047 -14501 -41865
13959 -41865 -33258 -48220 -175311 -133240 -47154 -22333 -15983 -35775 3609 68707 40773 -6924
13947 -6924 -102162 -100151 -85736 -33460 -130630 -151901 -76889 27503 27107 4299 3359 74918 89145
13934 89145 80569 77207 65651 53664 -25015 -58331 -31997 10090 57446 52179 -33400 -70795
13922 -70795 -32482 -12938 56755 113308 53995 3920 -55449 -162556 -264249 -333431 -215018
$$ packed form
14007b9889j4035J66358l366M9014n7137q982N860l9768o6597m3330M2054p332
13995g150k931L8623m1125K937O2432K2448P265N5647o697j17798m0802q6179
13983a13330k519J18750R3589o9411J1296l832n0608M66m1414J6939N0314K4610
13971C4850J891O2057k9022K4974L6638j9835p1689O0683j1898q1602k1548k7364
13959d1865Q607j4962j27091M2071Q6086K4821O350j9792L9384O5098k7934m7697
13947f924r5238K011J4415N2276r7170k1271P5012J04392l96k2808r40P1559J4227
13934H9145q576l362j1556j1987p8679l3316K6334M2087M7356n267q5579l7395
13922g0795L8313J9544O9693N6553n9313n0075n9369j07107j01693o9182J18413
$$ plain form
13911 -215018 -81082 -84945 -40244 -27863 18352 95283 219236 315994 317306 106604 915
13900 915 94040 101692 126591 56901 80550 62045 98002 76727 60702 115808 143266 164381
13888 164381 205175 151343 46191 -1323 -10738 -30295 -50355 -81061 -88136 -13039 76515 120203
13876 120203 83196 -21116 -39732 -10612 4014 -108162 -89900 -8589 87117 12049 -105450
13865 -105450 -34202 111792 77804 7187 2957 -26298 -95459 -129876 -103344 -43222 32804
13854 32804 37442 34652 31477 56513 29503 -16133 4059 31587 132125 167493 88592 26072
13842 26072 34702 59422 16579 -23139 -78815 -18064 67215 117232 65853 98829 119127 123924
13830 123924 57172 5534 -19312 18776 16106 -53495 -46371 -20888 1778 23393 -33295 -51409
$$ packed form
13911b15018J33936l863M4701J2381M6215P6931J23953R6758J312k10702j05689
13900I15R3125P652K4899o9690K3649j8505L5957k1275j6025N5106K7458K1115
13888A64381M0794n3832j05152m7514r415j9557k0060l0706p075P5097Q9554M3688
13876A20203l7007j04312j8616K9120J4626j12176J8262Q1311R5706p5068j17499
13865a05450P1248J45994l3988p0617m230k9255o9161l4417K6532O0122P6026
13854C2804M638k790l175K5036k7010m5636K0192K7528J00538L5368p8901o2520
13842B6072Q630K4720m2843l9718n5676O0751Q5279N0017n1379L2976K0298M797
13830A23924o6752n1638k4846L8088k670o9601P124K5483K2666K1615n6688j8114
$$ plain form
13818 -51409 -47249 13118 74888 13007 -15290 14982 57857 -10754 -34329 -73637 -154887 -129668
13806 -129668 -143347 -81809 -15981 22422 -1248 54922 42131 29172 26734 -81859 -86559 47091
13794 47091 94471 36174 34341 10455 -39174 13149 84515 6555 -158514 -157304 -126932 3723
13782 3723 -56117 -154467 -206191 -109243 27611 70011 116354 93062 28337 -37181 -58073 -64661
13770 -64661 -79822 -37798 -35550 -28874 47044 84922 116156 70148 -85194 -212406 -142343 -15324
13758 -15324 61506 16220 -56216 -67625 20290 81099 22219 61656 35824 74404 81911 -18971
13746 -18971 -53857 8032 34063 -10101 1505 18207 29323 26919 130273 210834 164154 104206
13734 104206 63421 36469 12010 -2560 -49204 -109046 -151400 -202055 -145891 -110615 1377
$$ packed form
13818e1409M160O0367O1770o1881k8297L0272M2875o8611k3575l9308q1250K5219
13806a29668j3679O1538O5828L8403k3670N6170j2791j2959k438j08593m700J33650
13794D7091M7380n8297j833k3886m9629N2323P1366p7960j65069J210L0372J30655
13782C723n9840r8350n1724R6948J36854M2400M6343k3292o4725o5518k0892o588
13770f4661j5161M2024K248O676P5918L7878L1234m6008j55342j27212P0063J27019
13758a5324P6830m5286p2436j1409Q7915O0809n8880L9437k5832L8580P507j00882
13746a8971l4886O1889K6031m4164J1606J6702J1116k404J03354Q0561m6680n9948
13734A04206m0785k6952k4459j4570m6644n9842m2354n0655N6164L5276J11992
$$ plain form
13723 1377 59054 87314 47648 53489 74792 18336 60953 136523 89367 55222 43268 90312
13711 90312 112586 76376 -9851 78757 57501 47739 12818 26850 18998 -34852 -8899 -48349
13699 -48349 -68422 -70526 3845 36262 -6522 -7363 91616 69693 -24363 -5437 8088 -74674
13687 -74674 45190 96987 135195 97290 65102 44228 67133 65335 156241 235163 187709 115045
13675 115045 -85190 -90147 20310 50194 3599 32709 1006 -61143 -40865 -1747 65281
13664 65281 -24811 -44148 -51333 59028 90972 88163 78350 56476 68206 78533 43171 10578
13652 10578 44694 -58238 -51003 -68045 -25566 126476 117054 55691 30580 40548 10457 48038
13640 48038 56500 5924 -37201 -76553 -96907 -114679 -157774 -154850 -14023 -2478 -73492 -141215
$$ packed form
13723A377N7677K8260l9666N841K1303n6456M2617P5570m7156l4145j1954M7044
13711I0312K2274l6210q6227Q8608k1256r762l4921J4032p852n3850K5953l9450
13699d8349k0073k104P4371L2417m2784q41R8979k1923r4056J8926J3525q2762
13687g4674J19864N1797L8208l7905l2188k0874K2905j798R0906P8922m7454p2664
13675A15045k00235m957J10457K9884m6595K9110l1703o2149K0278L9118O7028
13664F5281r0092j9337p185J10361L1944k809r813k1874J1730J0327l5362l2593
13652A0578L4116j02932P235j7042M2479J52042r422o1363k5111R968l0091L7581
13640D8038Q462n0576m3125l9352k0354j7772m3095K924J40827J1545p1014o7723
$$ plain form
13628 -141215 -138860 -60804 -20975 -41917 -24983 27469 -9494 50023 136228 178222 143523 79191
13616 79191 48137 67341 65088 69828 25107 -38776 -23931 -11112 11661 3857 34046 41854
13604 41854 60320 106837 78065 93304 143223 179425 145758 83602 33187 24301 80153 68911
13592 68911 -11472 -63797 -14797 36723 12287 -15128 -44367 -68471 -5569 146710 64647
13581 64647 33751 51976 70906 3971 123565 210572 153037 96559 52676 -25455 4432
13570 4432 3019 -62013 -50416 -17660 -22214 -16660 -25038 -78163 -16965 66417 77328 70566 -10466
13557 -10466 -96175 -57173 42227 34987 57884 35031 46740 21505 42425 75773 109733 116510
13545 116510 45003 -18376 31526 12524 -26184 -119484 -6982 23146 115379 83900 74793
$$ packed form
13628a41215K355P8056L9829k0942J6934N2452l6963N9517Q6205M1994l4699o4332
13616G9191l1054J9204k253M740m4721o3883J4845J2819K2773p804L0189P808
13604D1854J8466M6517k8772J5239M9919L6202l3667o2156n0415q886N5852j1242
13592F8911q0383n2325M9000N1520k4436k7415k9239k4104O2902J52279q2063
13581F4647l0896J8225J8930o6935J19594Q7007n7535n6478m3883p8131K9887
13570D432j413o5032J1597L2756m554N554q378n3125O1198Q3382J0911o762q1032
13557a0466q5709L9002R9400p240K2897k2853J1709k5235K0920L3348L3960O777
13545A16510p1507o3379M9902j9002l8708r3300J12502L0128R2233l1479r107
$$ plain form
13534 74793 42692 47253 101210 12219 -76113 -133680 -69182 -56077 100697 141658 103471 114402
13522 114402 161190 94742 79811 37689 -1021 -19619 -4193 47583 12297 19694 123074
13511 123074 109981 66989 -40499 -97682 -96462 -29339 23821 10496 24793 55847 40359
13500 40359 -3741 3931 34323 47584 2193 -60603 -116887 -54085 18469 559 -66784 -87702
13488 -87702 13593 7931 4134 39797 92528 97103 79801 -28729 -58980 -15599 5345 88330
13476 88330 83984 69773 69415 21806 13461 -61976 35506 110043 140642 113505 59108 62078 34336
13463 34336 1323 82106 40700 2344 -4124 -20702 10826 67296 542 -169148 -136501 -114258
13451 -114258 -89531 -181834 -205140 -109389 18416 -7094 -10688 -33412 -1995 41534 37236 45190
$$ packed form
13534G4793l2101M561N3957q8991q8332n7567O4498J3105J56774M0961l8187J0931
13522A14402M6788o6448j4931m2122l8710j8598J5426N1776l5286P397J03380
13511A23074j3093m2992j07488n7183J220O7123N3160j3325J4297L1054j5488
13500D0359m4100P672L0392J3261m5391o2796n6284O2802P2554j7910o7343k0918
13488h7702J01295n662l797L5663N2731M575j7302j08530l0251M3381K0944Q2985
13476H8330m346j4211l58m7609q345p5437R7482P4537L0599k7137n4397K970k7742
13463C4336l3013Q0783m1406l8356o468j6578L1528N6470o6754j69690L2647K2243
13451a14258K4727r2303k3306R5751J27805k5510l594k2724L1417M3529m298P954
$$ plain form
13439 45190 62858 21549 18906 123033 6550 -51922 -109883 -130340 -95709 6311 120544
13428 120544 142850 67166 32032 -49787 -56534 32029 53132 38787 -10390 -19531 -30400 92519
13416 92519 75215 72120 49740 -17132 -40638 -112772 -132376 -76189 -76066 -36193 -22866 -122670
13404 -122670 -155858 -127320 -148085 -194677 -140194 -140883 -150657 -137955 -73771 35218 68382 -19088
13392 -19088 -109541 -89906 -77726 -127048 -144149 -90513 -62461 23384 55776 122395 236951
13381 236951 180338 154974 156991 142943 95398 17921 -23792 21095 87542 90994 -35167 -92629
13369 -92629 -55208 -60905 -65774 15957 93804 63866 26442 -10615 16712 5286 9028 -9057
13357 -9057 30699 -15682 11641 69957 18772 35436 137565 83130 34171 54040 44529 1480
$$ packed form
13439D5190J7668m1309k643J04127j16483n8472n7961k0457L4631J02020J14233
13428A20544K2306p5684l5134q1819o747Q8563K1103j4345m9177r141j0869J22919
13416I2519j7304l095k2380o6872k3506p2134j9604N6187J23L9873J3327r9804
13404a22670l3188K8538k0765m6592N4483o89r774J2702O4184J08989L3164q7470
13392a9088r0453J9635J2180m9322j7101N3636K8052Q5845L2392O6619J14556
13381B36951n6613k5364K017j4048m7545p7477m1713M4887O6447L452j26161n7462
13369i2629L7421n697m869Q1731P7847k9938l7424l7057K7327j1426L742j8085
13357i057L9756m6381K7323N8316n1185J6664J02129n4435m8959J9869r511m3049
$$ plain form
13345 1480 83007 125950 88387 48737 23562 37037 25449 -11008 -146172 -182579 -49789
13334 -49789 357 -43516 -95028 -61987 -44408 -10007 4867 82226 127095 115832 58054 -36231
13322 -36231 -57841 -18104 45165 49155 26905 -18106 -4632 119731 178910 158399 156151 54822
13310 54822 -14634 -26934 -33953 -29795 -33175 -96643 -173467 -147321 -114660 -142366 -175802 -125593
13298 -125593 -52982 -77617 -101973 -153339 -159504 -122233 6958 96239 39408 -50827 -124412
13287 -124412 -79087 22299 29592 -2084 4664 68747 101219 125890 113116 46928 -29871 -51230
13275 -51230 26269 39456 26362 -2476 -3176 -55698 -78508 -24531 64764 120325 53722 40569
13263 40569 86983 18125 -62546 4492 58068 -22079 -76527 -23151 -19940 -89766 -52450 -38539
$$ packed form
13345A480Q1527M2943l7563l9650k5175J3475j1588l6457j35164l6407J32790
13334d9789N0146m3873n1512L3041J7579L4401J4874P7359M4869j1263n7778r4285
13322c6231k1610L9737O3269L990k2250m5011J3474J24363N9179k0511k248j01329
13310E4822o9456j2300p019M158l380o3468p6824K6146L2661k7706l3436N0209
13298a25593P2611k4635k4356n1366o165L7271J29191Q9281n6831r0235p3585
13287a24412M5325J01386P293l1676O748O4083L2472K4671j2774o6188p6799k1359
13275e1230P7499J3187j3094k8838p00n2522k2810N3977Q9295N5561o6603j3153
13263D0569M6414o8858q0671O7038N3576q0147n4448N3376L211o9826L7316J3911
$$ plain form
13251 -38539 -39919 -22033 13133 92586 122867 95720 137808 178400 161888 123811 139910 73725
13239 73725 30760 17024 50107 68893 54618 20363 -2904 28673 -46853 -155840 -176038
13228 -176038 -58903 65583 -50232 -116951 -158831 -110224 -25295 -78981 -141698 -124976 -103579
13217 -103579 -77370 -45433 37492 27745 -28919 -96564 -63470 9533 14085 -19019 -58545 -95457
13205 -95457 -88749 -75105 -79353 -79666 -26582 35614 44476 65569 48195 -16930 17912 -25587 -36922
13192 -36922 -9130 31753 92862 84311 120208 143594 96789 60194 59483 163542 245901 214697
13180 214697 166163 19838 48688 97609 142916 159389 174217 160517 133624 37390 22041
13169 22041 -9574 -75175 -38811 63952 111378 32906 8336 -64551 -21965 59956 112819
$$ packed form
13251c8539j380J7886L5166P9453L0281k7147M2088M0592j6512l8077J6099o6185
13239G3725m2965j3736L3083J8786j4275l4255k3267L1577p5526j08987k0198
13228a76038J17135J24486j15815o6719m1880M8607Q4929n3686o2717J6722K1397
13217a03579K6209L1937Q2925r747n6664o7645L3094P3003M552l3104l9526l6912
13205i5457O708J3644m248l13N3084O2196Q862K1093j7374o5125L4842m3499j1335
13192c6922K7792M0883O1109q551L5897K3386m6805l6595p11J04059Q2359l1204
13180B14697m8534j46325K8850M8921M5307J6473J4828j3700k6893r6234j5349
13169B2041l1615o5601L6364J02763M7426p8472k4570p2887M2586Q1921N2863
$$ plain form
13158 112819 139836 26248 -33450 -69952 -47982 13387 -3233 16207 46255 27294 5531
13147 5531 -37052 -19209 -10386 2111 56814 76965 28432 -31882 44569 68389 72902 110728
13135 110728 153874 136459 -867 -86826 -62253 -28281 -97593 -74478 -67220 -27246 51796
13124 51796 57719 -35284 -24935 -31663 8456 60100 108296 60282 -80141 -110777 -89560 -113213
13112 -113213 -105443 -58206 -37823 -99288 -66137 -16431 6053 41174 28983 104890 142961 87123
13100 87123 32772 64367 139192 123872 190096 230226 135480 -16552 101608 112868 55489
13089 55489 28683 35076 6176 -92691 -89430 89324 120397 122140 62852 43853 50110 52433
13077 52433 -14245 -10966 -33205 49375 109035 98292 170768 150886 58027 52270 53394 73496
$$ packed form
13158A12819K7017j13588n9698l6502K1970O1369j6620J9440L0048j8961k1763
13147E531m2583J7843Q823J2497N4703K0151m8533o0314P6451K3820M513L7826
13135A10728M3146j7415j37326q5959K4573L3972o9312K3115P258L9974P9042
13124E1796N923r3003J0349o728M0119N1644M8196m8014j40423l0636K1217k3653
13112a13213P770M7237K0383o1465L3151M9706K2484L5121j2191P5907L8071n5838
13100H7123n4351L1595P4825j5320O6224M0130r4746j52032J18160J1260n7379
13089E5489k6806O393k8900r8867L261J78754L1073J743n9288j8999O257K323
13077E2433o6678L279k2239Q2580N9660j0743P2476j9882r2859n757J124K0102
$$ plain form
13065 73496 82718 78999 43414 27631 55552 -33241 -70766 16470 71739 83642 32945 32350
13053 32350 82526 94117 88657 104220 47502 -12697 -25516 -64307 -124212 -176143 -144969 -97506
13041 -97506 -35993 -10786 -104655 -92823 -71002 -93648 -139255 -167058 -131136 -123217 -58293 -61931
13029 -61931 -36214 -7515 -87765 -112930 -62086 -171362 -253657 -194515 -87438 -69977 -94412
13018 -94412 -83468 -166178 -115084 -82052 -19970 14529 14596 -62498 -17870 -80881 -115497 -151613
13006 -151613 -111148 11867 97076 90057 118561 160734 8655 -134919 -179236 -119157 -55552
12995 -55552 43362 47514 26325 80877 88885 103420 93427 51991 39622 99422 121183 151927
12983 151927 116549 156729 183165 132070 107148 69561 19395 37934 82728 51899 66319
$$ packed form
13065G3496R222l719l5585j5783K7921q8793l7525Q7236N5269J1903n0697n95
13053C2350N0176J1591n460J5563n6718o0199j2819l8791n9905n1931L1174M7463
13041i7506O1513K5207r3869J1832K1821k2646m5607k7803L5922P919O4924l638
13029f1931K5717K8699q0250k5165N0844j09276q2295N9142J07077J7461k4435
13018i4412J0944q2710N1094L3032O2082L4499O7p7094M4628o3011l4616l6116
13006a51613M0465J23015Q5209p019K8504M2173j52079j43574m4317O0079O3605
12995e5552R8914M152k1189N4552Q008J4535r993m1436j2369N9800K1761L0744
12983A51927l5378M0180K6436n1095k4922l7587n0166J8539M4794l0829J4420
$$ plain form
12972 66319 27813 -15760 -9890 35840 90068 77405 79481 24542 -48119 -24916 -25030 -54535
12960 -54535 -32941 -164313 -282485 -237230 -101598 -38405 67717 107426 103244 124343 116868
12949 116868 81141 56881 46905 115112 135888 70776 30924 -6092 -4216 59334 97704 103932
12937 103932 79380 33009 -52187 -19966 33890 14345 17585 -28631 -45332 -49165 -88643 -28637
12925 -28637 52915 -4268 37425 87236 66707 23837 19779 -13850 -19319 -8952 3432 34316
12913 34316 45680 56663 25289 16731 67858 43397 61096 17972 -4755 -36838 12656 -5209
12901 -5209 -5083 14520 -101349 -103808 -79660 -92599 -81190 -80353 -108191 -137781 -149489 -134607 -50978
12888 -50978 21381 -20582 -28144 48527 -13118 40807 52427 -30224 -87827 -37405 23048 61327
$$ packed form
12972F6319l8506m3573N870M5730N4228j2663K076n4939p2661K3203j14k9505
12960e4535K1594j31372j18172M5255J35632O3193J06122L9709m182K1099p475
12949A16868l5727k4260r976O8207K0776o5112l9852l7016J876O3550L8370O228
12937A03932k4552m6371q5196L2221N3856j9545L240m6216j6701l833l9478O0006
12925b8637Q1552n7183M1693M9811k0529m2870m058l3629n469J0367J2384L0884
12913C4316J1364J0983l1374q558N1127k4461J7699m3124k2727l2083M9494j7865
12901e209J26J9603j15869k459K4148j2939J1409Q37k7838k9590j1708J4882Q3629
12888e0978P2359m1963p562P6671o1645N3925J1620q2651n7603N0422O0453L8279
$$ plain form
12876 61327 104237 121938 56648 64650 42299 -16785 -78233 489 118618 191705 158092 148662
12864 148662 114399 91359 41654 18304 24948 66168 160244 130941 60266 -14752 -10468 41658
12852 41658 35748 30634 67768 165892 190314 122540 99058 124974 36155 -54160 18 49064
12840 49064 6771 -51985 -69906 -92010 -63076 -8363 -48899 -48211 30606 1276 50933 89086
12828 89086 107085 123879 56150 -9950 -20957 2189 -351 -53194 -10190 24042 67606 84498
12816 84498 108931 42487 3622 20908 107435 117950 132722 150615 47610 -25738 -26563 -42282
12804 -42282 -15939 65349 92014 62613 87986 61070 -16397 -34350 -43829 -47453 -57330 -75670
12792 -75670 -13837 61334 115468 39314 -12468 -70738 -40484 22698 40310 63880 9924 -74533
$$ packed form
12876F1327M2910J7701o5290Q002k2351n9084o1448P8722J18129P3087l3613r430
12864A48662l4263k3040m9705k3350O644M1220R4076k9303p0675p5018M284N2126
12852D1658n910n114L7134R8124K4422o7774k3482K5916q8819r0315N4178M9046
12840D9064m2293n8756j7921k2104K8934N4713m0536O88P8817k9330M9657L8153
12828H9086J7999J6794o7729o6100j1007K3146k540n2843M3004L4232M3564J6892
12816H4498K4433o6444l8865J7286Q6527J0515J4772J7893j03005p3348q25j5719
12804d2282K6343Q1288K6665k9401K5373k6916p7467j7953r479l624r877j8340
12792g5670O1833P5171N4134p6154n1782n8270L0254O3182J7612K3570n3956q4457
$$ plain form
12780 -74533 -21214 15396 13019 7194 -33870 9026 138382 211744 100739 63875 100502 60276
12768 60276 10806 -58230 -90849 -33213 -29877 -33250 24498 38245 22197 -34068 -13843 31655
12756 31655 64130 75226 53598 3583 37750 123617 141733 129328 163532 196950 110456 39725
12744 39725 49544 143383 156660 96451 -362 -42000 130 88499 180722 164093 38993 -38750
12732 -38750 -16964 -5614 -16870 -4291 37583 22000 -6062 33003 64315 83241 154237 60444
12720 60444 35181 112291 133147 122648 39591 -29496 -64712 -98898 -140781 -86818 -47202 -16359
12708 -16359 16242 32416 19416 7346 34886 -1883 29344 50181 77068 81493 57903 21655
12696 21655 34988 58107 101287 135383 68278 -33860 19363 133497 169994 198305 156547
$$ packed form
12780g4533N3319L6610k377n825m1064M2896J29356P3362j11005l6864L6627m0226
12768F0276m9470o9036l2619N7636L336l373N7748J3747j6048n6265K0225M5498
12756C1655L2475J1096k1628n0015L4167Q5867J8116j2405L4204L3418q6494p0731
12744C9725R819R3839J3277o0209r6813m1638M2130Q8369R2223j6629j25100p7743
12732c8750K1786J1350j1256J2579M1874j5583k8062L9065L1312J8926P0996r3793
12720F0444k5263P7110K0856j0499q3057o9087l5216l4186m1883N3963L9616L0843
12708a6359L2601J6174j3000j2070K7540l6769L1227K0837K6887M425k3590l6248
12696B1655J3333K3119M3180L4096o7105j02138N3223J14134L6497K8311m1758
$$ plain form
12685 156547 34101 -10926 2580 -28688 -53018 -43573 4270 27713 34900 76599 59544 56867
12673 56867 14734 6516 -8955 -23680 62052 164949 132935 77824 46259 94537 119196 160523
12661 160523 163500 137164 43761 -13884 -84903 -93684 -70644 -135320 -122745 -6943 6936 -15973
12649 -15973 -14417 34583 42656 114218 148102 159193 157860 111510 96249 89261 141932 212892
12637 212892 183815 165411 123915 145601 104865 22914 -11354 -22112 5389 114821 41222
12626 41222 -61211 -145536 -141315 -96572 902 16852 41395 81404 59001 42034 81167 95786
12614 95786 58735 -14847 -100676 -108603 -116934 -49331 48388 189761 213590 161725 97821 83872
12602 83872 47941 86882 125250 131673 187127 155906 195218 128780 14998 -10671 -23970 -66078
$$ packed form
12685A56547j22446m5027J3506l1268k4330R445M7843K3443P187M1699j7055k677
12673E6867m2133q218j5471j4725Q5732J02897l2014n5111l1565M8278K4659M1327
12661A60523K977k6336r3403n7645p1019q781K3040o4676J2575J15802J3879k2909
12649a5973J556M9000Q073P1562L3884J1091j333m6350j5261o988N2671P0960
12637B12892k9077j8404m1496K1686m0736q1951l4268j0758K7501J09432p3599
12626D1222j02433q4325M221M4743R7474J5950K4543M0009k2403j6967L9133J4619
12614I5786l7051p3582q5829p927q331O7603R7719J41373K3829n1865o3904j3949
12602H3872l5931L8941L8368O423N5454l1221L9312o6438j13782k5669j3299m2108
$$ plain form
12590 -66078 -91838 -56444 51605 87870 57863 -10965 -17327 145552 176373 60047 17970
12579 17970 -503 -31725 15491 11626 24836 35846 20239 15463 -19569 -63955 -2734 67200
12567 67200 24154 -9320 93212 93597 77091 15868 51152 81259 32248 -53014 -55557 2080
12555 2080 46142 23360 104063 165439 84682 166968 234259 123052 52407 41914 104417 134240
12543 134240 75657 102678 133326 183445 204097 113633 124464 129173 64315 40727 111785 45347
12531 45347 81266 95279 151983 150665 99339 67541 20510 -16525 -88690 -72212 -11223 19073
12519 19073 6488 -43698 -51870 35259 30805 35574 112847 164764 232510 237033 162155 52344
12507 52344 33348 78670 82087 44915 -37107 18035 14695 -16954 14119 -11480 -1576 30817
$$ packed form
12590f6078k5760L5394J08049L6265l0007o8828o362J62879L0821j16326m2077
12579A7970j8473l1222M7216l865J3210J1010j5607m776l5032m4386O1221O9934
12567F7200m3046l3474J02532L85j6506o1223L5284L0107m9011q5262k543N7637
12555B080M4062k2782Q0703O1376q0757Q2286O7291j11207p0645j0493O2503K9823
12543A34240n8583K7021L0648N0119K0652r0464J0831M709o4858k3588P1058o6438
12531D5347L5919J4013N6704j318n1326l1798m7031l7035p2165J6478O0989L0296
12519A9073j2585n0186q172Q7129m454M769P7273N1917O7746M523p4878j09811
12507E2344j8996M5322L417l7172q2022N5142l340l1649L1073k5599R904L2393
$$ plain form
12495 30817 25255 51422 -21726 -35339 -6106 49176 119054 154079 74515 45101 56817 148209
12483 148209 189018 108003 78544 36999 35935 181396 253966 242670 138861 92212 133346
12472 133346 174286 102673 -24267 -36728 72155 159941 155254 106947 70810 -10253 16476
12461 16476 127489 144680 55762 -7276 -33949 -23503 24301 55340 91982 87904 107090 116006
12449 116006 89143 99612 172708 212823 198623 177346 195962 134116 57102 -5552 -46764
12438 -46764 96642 198667 202751 270830 265959 216867 179292 111124 235212 347452 299340
12427 299340 248662 208880 212159 247891 318855 368497 398296 308483 275185 310429 325775 347731
12415 347731 317468 267232 249165 245406 233531 214431 134510 87884 54363 111691 211483 231812
$$ packed form
12495C0817n562K6167p3148j3613K9233N5282O9878L5025p9564k9414J1716R1392
12483A48209M0809q1015k9459m1545j064J45461P2570j1296j03809m6649M1134
12472A33346M0940p1613j26940j2461J08883Q7786m687m8307l6137q1063K6729
12461A6476J11013J7191q8918o3038k6673J0446M7804L1039L6642m078J9186Q916
12449A16006k6863J0469P3096M0115j4200k1277J8616o1846p7014o2654m1212
12438d6764J43406J02025M084O8079m871m9092l7575o8168J24088J12240m8112
12427B99340n0678l9782L279L5732P0964M9642K9799q9813l3298L5244J5346K1956
12415C47731l0263n0236j8067l759j1875j9100p9921m6626l3521N7328R9792K0329
$$ plain form
12403 231812 205541 277326 252410 271467 310447 357000 324397 336044 348109 331657 302063
12392 302063 311538 309136 330196 391832 436322 433968 444611 473153 421866 404702 443594 537961
12380 537961 541038 478432 508734 670629 705763 780668 925638 964733 1062306 1076625 1106596
12369 1106596 1111241 1184909 1360554 1668932 2069922 2754792 3425540 4071662 4371259 4218612
12359 4218612 3734062 3459398 3518822 3542846 3478741 3240072 2923041 2736893 2558134 2579094
12349 2579094 2736932 3003279 3288498 3477736 3516004 3398942 3370651 3391622 3404819 3535685
12339 3535685 3756587 3959638 4158145 4406615 4556551 4540653 4310690 4147852 4153988 4301001
12329 4301001 4609465 4928458 5230593 5762873 6252079 6667307 7265680 8268092 9398905
$$ packed form
12403B31812k6271P1785k4916J9057L8980M6553l2603J1647J2065j6452k9594
12392C02063R475k402K1060O1636M4490k354J0643K8542n1287j7164L8892R4367
12380E37961L077o2606L0302J61895L5134P4905J44970L9095R7573J4319K9971
12369A106596M645P3668J75645L08378M00990O84870O70748O46122K99597j52647
12359D218612m84550k74664N9424K4024o4105k38669l17031j86148j78759K0960
12349B579094J57838K66347K85219J89238L8268j17062k8291K0971J3197J30866
12339C535685K20902K03051J98507K48470J49936j5898k29963j62838O136J47013
12329D301001L08464L18993L02135N32280M89206M15228N98373J002412J130813
$$ plain form
12320 9398905 10414753 10991034 10601481 9389401 8111570 7407675 7031092 6672230 6384464
12311 6384464 6031170 5624553 5320125 5158883 5048560 5132358 5352935 5397108 5246839 4883122
12301 4883122 4414281 4132298 4011180 3901601 3815685 3716742 3758753 3801531 3684352 3499792
12291 3499792 3230231 2866804 2719843 2733555 2869749 3109665 3305036 3592145 3800859 3870832
12281 3870832 3956606 4000505 4245275 4643974 4875391 4615182 3862487 3029304 2441654 2176073
12271 2176073 1953196 1846686 1849201 1794891 1681466 1608841 1508520 1399836 1299520 1219787
12261 1219787 1128827 1072808 1029627 964211 894947 826860 817866 819207 852835 853527 843370 759960
12249 759960 594441 485104 451966 519134 570150 584263 594910 633081 617471 581151 498328
$$ packed form
12320I398905J015848N76281l89553j212080j277831p03895l76583l58862k87766
12311F384464l53294m06617l04428j61242j10323Q3798K20577M4173j50269l63717
12301D883122m68841k81983j21118j09579q5916r8943M2011M2778j17179j84560
12291C499792k69561l63427j46961J3712J36194K39916J95371K87109K08714O9973
12281C870832Q5774M3899K44770L98699K31417k60209p52695q33183n87650k65581
12271B176073k22877j06510K515n4310j13425p2625j00321j08684j00316p9733
12261A219787r0960n6019m3181o5416o9264o8087q994J341L3628O92j0157q3410
12249G59960j65519j09337l3138O7168N1016J4113J0647L8171j5610l6320q2823
$$ plain form
12238 498328 426131 418784 425646 382019 349921 391781 418359 378292 328172 296751 286046 340485
12226 340485 297182 291622 301045 316756 309239 258199 261639 321374 339467 300584 295588 384784
12214 384784 433273 385694 322496 244631 212054 231540 369735 490587 449017 402828 439456
12203 439456 416461 388635 371530 312150 282807 260400 270519 350076 431826 435023 399413 383803
12191 383803 295113 200495 245575 290930 379246 434090 386807 357593 350840 367658 301643 334636
12179 334636 470905 461530 454489 489393 486315 439007 502010 475502 457695 363645 325318 308099
12167 308099 280535 354363 409726 419359 360049 244667 294337 297839 273226 296545 281055 305829
12155 305829 277482 275589 291710 327331 278031 290316 301869 265358 206324 263372 328965 412664
$$ packed form
12238D98328p2197p347O862m3627l2098M1860K6578m0067n0120l1421j0705N4439
12226C40485m3303n560R423J5711p517n1040L440N9735J8093l8883m996Q9196
12214C84784M8489m7579o3198p7865l2577J9486J38195J20852m1570m6189L6628
12203D39456k2995k7826j7105n9380k9343k2407J0119P9557Q1750L197l5610j5610
12191C83803q8690r4618M5080M5355Q8316N4844m7283k9214o753J6818o6015L2993
12179C34636J36269r375p041L4904l078m7308O3003k6508j7807r4050l8327j7219
12167C08099k7564P3828N5363R633n9310j15382M9670L502k4613K3319j5490K4774
12155C05829k8347j893J6121L5621m9300J2285J1553l6511n9034N7048O5593Q3699
$$ plain form
12143 412664 321276 343199 466031 421948 317696 334299 318707 219454 213695 226264 329774
12132 329774 438478 469740 443379 374467 314295 287065 310733 335148 373559 370971 436928
12121 436928 431608 410226 407465 387133 354856 446371 492266 533981 504375 499127 542104 492501
12109 492501 328510 293764 305562 409087 491354 455394 388579 460407 593317 635955 556015
12098 556015 475779 414280 396787 482225 470772 371243 414281 427827 513937 608823 649613
12087 649613 584551 582182 557065 445752 406911 376282 431697 442153 417053 415712 458764 553488
12075 553488 575211 528196 435335 535766 620111 596115 587242 552476 599396 668778 698388
12064 698388 657683 601844 674996 714048 689345 688222 685271 624813 564585 627910 680373 686149
$$ packed form
12143D12664r1388K1923J22832m4083j04252J6603j5592r9253n759J2569J03510
12132C29774J08704L1262k6361o8912o0172k7230K3668K4415L8411k588O5957
12121D36928n320k1382k761k0332l2277R1515M5895M1715k9606n248M2977m9603
12109D92501j63991l4746J1798J03525Q2267l5960o6815P1828J32910M2638p9940
12098E56015q0236o1499j7493Q5438j1453r9529M3038J3546Q6110R4886M0790
12087F49613o5062k369k5117j11313l8841l0629N5415J0456k5100j341M3052R4724
12075E53488K1723m7015r2861J00431Q4345k3996q873l4766M6920O9382K9610
12064F98388m0705n5839P3152L9052k4703j123k951o0458o0228O3325N2463N776
$$ plain form
12052 686149 658929 740182 815181 893534 934859 919395 926158 886127 814232 898538 1031255
12041 1031255 1180489 1183750 1123575 1044687 1045615 1050414 1036952 1070671 1088059 1166553 1188977 1154609
12029 1154609 1075058 1176495 1219194 1235910 1232396 1195725 1217558 1191179 1196595 1329885 1412332
12018 1412332 1531692 1526765 1451565 1478995 1496066 1603820 1645665 1662041 1640414 1547586 1560835
12007 1560835 1670337 1809171 1898870 1958613 1898756 1940967 1934038 2015818 2066610 2034032 2090362
11996 2090362 2203913 2289819 2388338 2452042 2537960 2469930 2537497 2545261 2566064 2679682 2680976
11985 2680976 2801543 2960448 2987433 3037192 3086041 3140047 3323503 3471710 3609234 3720715
11975 3720715 3815314 3977658 4129639 4227685 4296923 4481482 4668777 4912033 5162366 5340177
$$ packed form
12052F86149k7220Q1253P4999P8353M1325j5464O763m0031p1895Q4306J32717
12041A031255J49234L261o0175p8888R28M799j3462L3719J7388P8494K2424l4368
12029A154609p9551J01437M2699J6716l514l6671K1833k6379N416J33290Q2447
12018A412332J19360m927p5200K7430J7071J07754M1845J6376k1627r2828J3249
12007A560835J09502J38834Q9699N9743n9857M2211o929Q1780N0792l2578N6330
11996B090362J13551Q5906R8519O3704Q5918o8030O7567P764K0803J13618J294
11985B680976J20567J58905K6985M9759M8849N4006J83456J48207J37524J11481
11975C720715R4599J62344J51981R8046O9238J84559J87295K43256K50333J77811
$$ plain form
11965 5340177 5455770 5627535 5853215 6078952 6376881 6663481 7009809 7324406 7606033
11956 7606033 7879704 8275443 8638206 9076554 9568543 9986670 10443707 10966023 11555212
11947 11555212 12193188 12868430 13627361 14402979 15211684 16021444 16910337 17948060 19081688
11938 19081688 20384355 21750261 23084511 24486623 26027794 27657149 29364530 31259182
11930 31259182 33215703 35213837 37134516 39128101 41043782 42956098 44789078 46531745
11922 46531745 48094287 49375762 50241598 50849569 51060196 50899966 50474449 49855557 49002566
11913 49002566 47864420 46436539 44822097 43152528 41506467 39776604 38056113 36285555
11905 36285555 34484906 32773885 31091178 29469982 27846729 26324238 24972445 23698128
$$ packed form
11965E340177J15593J71765K25680K25737K97929K86600L46328L14597K81627
11956G606033K73671L95739L62763M38348M91989M18127M57037N22316N89189
11947A1555212O37976O75242P58931P75618Q08705Q09760Q88893J037723J133628
11938A9081688J302667J365906J334250J402112J541171J629355J707381J894652
11930C1259182J956521J998134J920679J993585J915681J912316J832980J742667
11922D6531745J562542J281475Q65836O07971K10627j60230m25517o18892q52991
11913D9002566j138146j427881j614442j669569j646061j729863j720491j770558
11905C6285555j800649j711021j682707j621196j623253j522491j351793j274317
$$ plain form
11897 23698128 22531010 21342560 20278563 19310857 18255385 17311939 16413216 15583882 14807859
11888 14807859 14065085 13392650 12767066 12170302 11616694 11137327 10636175 10140061 9687586
11879 9687586 9207292 8787410 8401330 8132750 7897388 7630308 7263361 6915377 6655180
11870 6655180 6415613 6143972 5927247 5762807 5502652 5208494 5036325 4883915 4690491
11861 4690491 4554157 4409532 4318465 4151588 3871900 3760095 3701567 3607593 3554701 3397804
11851 3397804 3302522 3254649 3142046 3001790 2958923 2966034 2892276 2760581 2627870 2512279
11841 2512279 2376249 2356585 2330963 2269227 2264412 2195064 2146446 2125385 2068075 2011602 1998204
11830 1998204 1972664 1832407 1723062 1732116 1734442 1648168 1602379 1538911 1482672 1514761 1573616
$$ packed form
11897B3698128j167118j188450j063997r67706j055472r43446q98723q29334p76023
11888A4807859p42774o72435o25584n96764n53608m79367n01152m96114m52475
11879I687586m80294m19882l86080k68580k35362k67080l66947l47984k60197
11870F655180k39567k71641k16725j64440k60155k94158j72169j52410j93424
11861D690491j36334j44625r1067j66877k79688j11805n8528r3974n2892j56897
11851C397804r5282m7873j12603j40256m2867P111p3758j31695j32711j15591
11841B512279j36030j9664k5622o1736m815o9348m8618k1061n7310n6473j3398
11830A998204k5540j40257j09345R054K326q6274m5789o3468n6239L2089N8855
$$ plain form
11819 1573616 1578363 1654863 1630975 1556771 1480923 1353421 1261342 1208644 1145899 1089086 1077227
11808 1077227 1096552 1091468 1025073 1044192 1023029 1030400 1036853 997397 1009523 1051077 1035831 1017890
11796 1017890 1059057 1051985 1014743 985517 942178 886250 855234 835060 860079 882252 833849
11785 833849 850980 913736 932922 869125 872148 853233 821851 850568 882495 931132 896514 747774
11773 747774 774892 826886 801092 892670 940903 850019 761956 682588 648551 668205 712518
11762 712518 795896 781656 722136 656178 728219 829939 833230 752116 641757 583145 549560
11751 549560 616952 602361 635641 674153 682695 670444 592530 601766 661027 550607 424566
11740 424566 426217 503467 451323 474399 499264 397297 320903 279603 379660 378233 418346
$$ packed form
11819A573616M747P6500k3888p4204p5848j27502r2079n2698o2745n6813j1859
11808A077227J9325n084o6395J9119k1163P371O453l9456J2126M1554j5246j7941
11796A017890M1167p072l7242k9226m3339n5928l1016k0174K5019K2173m8403
11785H33849J7131O2756J9186o3797L023j8915l1382K8717L1927M8637l4618j48740
11773G47774K7118N1994k5794R1578M8233r0884q8063p9368l4037J9654M4313
11762G12518Q3378j4240n9520o5958P2041J01720L291q1114j10359n8612l3585
11751E49560O7392j4591L3280L8512Q542j2251p7914R236N9261j10420j26041
11740D24566J651P7250n2144K3076K4865j01967p6394m1300J00057j427M0113
$$ plain form
11729 418346 592768 649486 502266 298330 265157 293081 352399 353124 367473 339745 399551
11718 399551 375547 401200 391975 369473 399733 400076 486009 505138 456617 381421 299579 353456
11706 353456 461665 524394 534303 485643 477727 403756 338280 398737 407701 401639 383150 260324
11694 260324 293901 377663 353189 360697 369008 375080 297515 292550 337241 334987 245401 203346
11682 203346 182106 222573 313448 247207 203125 263158 263852 255476 300638 376059 474096 415318
11670 415318 335653 196323 213385 282011 277323 193947 215410 360793 370517 340734 272893
11659 272893 301245 299707 242693 287572 392011 358561 348732 283663 180099 198609 209956
11648 209956 190460 262328 272497 238502 149878 128113 125207 99135 167202 210085 203725 189561
$$ packed form
11729D18346J74422N6718j47220k03936l3173K7924N9318P25J4349k7728N9806
11718C99551k4004K5653r225k2502L0260L43Q5933J9129m8521p5196q1842N3877
11706C53456J08209O2729R909m8660p916p3971o5476O0457Q964o062j8489j22826
11694B60324L3577Q3762k4474P508Q311O072p7565m965M4691k254q9586m2055
11682B03346k1240M0467R0875o6241m4082O0033O94q376M5162P5421R8037n8778
11670D15318p9665j39330J7062O8626m688q3376K1463J45383R724k9783o7841
11659B72893K8352j538n7014M4879J04439l3450r829o5069j03564J8510J1347
11648B09956j9496P1868J0169l3995q8624k1765k906k6072O8067M2883o360j4164
$$ plain form
11636 189561 75787 -4622 83699 150796 124430 143488 187598 176594 217859 196473 136903
11625 136903 60854 107262 170291 245624 134436 84999 136339 87767 36337 95130 163948
11614 163948 160778 137474 147292 120751 195778 223433 234608 214101 176197 111225 188952 260726
11602 260726 225585 181466 176846 223664 219314 78654 35265 48680 2426 9176 12888 35000
11590 35000 110760 172393 127858 154892 206750 178788 189509 145134 88888 88791 80820 96302
11578 96302 94859 203399 157264 34516 -113739 -109582 -22622 31230 77092 50779 47961 131527
11566 131527 195142 168061 64299 48276 32674 114189 226038 217982 206088 210929 135637
11555 135637 100975 98097 94775 111231 122900 119513 66442 71550 99778 47199 54335 73274
$$ packed form
11636A89561j13774q0409Q8321O7097k6366J9058M4110j1004M1265k1386n9570
11625A36903p6049M6408O3029P5333j11188m9437N1340m8572n1430N8793O8818
11614A63948l170k3304R818k6541P5027K7655J1175k0507l7904o4972P7727P1774
11602B60726l5141m4119m620M6818m350j40660m3389J3415m6254O750L712K2112
11590C5000P5760O1633m4535K7034N1858k7962J0721m4375n6246r7p971J5482
11578I6302j443J08540m6135j22748j48255M157Q6960N3852M5862k6313k818Q3566
11566A31527O3615k7081j03762j6023j5602Q1515J11849q056j1894M841p5292
11555A35637l4662k878l322J6456J1669l387n3071N108K8228n2579P136J8939
$$ plain form
11543 73274 15795 -8626 -17651 23742 48127 66396 82242 61004 39706 25073 47101 76241
11531 76241 83864 109620 150154 194648 224332 207372 182722 165520 110208 51739 97349 84630
11519 84630 73677 69810 130158 191005 183927 126971 141948 190986 258317 246932 245112 214860
11507 214860 162923 87858 122690 108164 59902 142745 238297 205339 113139 26532 14521
11496 14521 91690 168771 151376 114492 142375 138041 124880 145157 87863 66887 30348 70320
11484 70320 68713 -15682 26985 95496 101340 72594 116190 220858 168856 149660 159668 226082
11472 226082 152738 177378 169454 229804 183395 121783 91871 -24832 -77440 -73345 58439
11461 58439 165473 157164 122521 66433 21391 96136 75041 61662 109168 192826 230162 227187
$$ packed form
11543G3274n7479k4421r025M1393K4385J8269J5846k1238k1298j4633K2028K9140
11531G6241P623K5756M0534M4494K9684j6960k4650j7202n5312n8469M5610j2719
11519H4630j0953l867O0348O0847p078n6956J4977M9038O7331j1385j820l0252
11507B14860n1937p5065L4832j4526m8262Q2843R5552l2958r2200q6607j2011
11496A4521P7169P7081j7395l6884K7883m334j3161K0277n7294k0976l6539L9972
11484G0320j607q4395M2667O8511N844k8746M3596J04668n2002j9196J0008O6414
11472B26082p3344K4640p924O0350m6409o1612k9912j16703n2608M095J31784
11461E8439J07034q309l4643n6088m5042P4745k1095j3379M7506Q3658L7336k975
$$ plain form
11449 227187 281172 287227 191968 156788 149017 129848 77066 143232 192220 221384 181220 159862
11437 159862 74431 102222 128026 86718 130850 214534 180922 116922 132718 123829 91165 62914
11425 62914 28317 -16729 -5251 18355 78204 95710 71223 49029 26612 -8778 -33499 -57948
11413 -57948 -20799 -9166 -108514 -60221 30506 78237 137594 170939 201758 215263 146563 161762
11401 161762 234137 168630 165005 228235 232269 149241 114486 183463 176333 213764 228735 186512
11389 186512 231613 260227 232814 235903 147570 66232 33047 54822 110419 69905 -16226 -10141
11377 -10141 58895 111919 107416 81115 95264 85189 3626 -68720 -67907 64271 62333 59035
11365 59035 88609 97033 75968 64224 113521 100238 107187 137127 175278 170319 259943 256297
$$ packed form
11449B27187N3985O055r5259l5180p771j9169n2782O6166M8988K9164m0164k1358
11437A59862q5431K7791K5804m1308M4132Q3684l3612o4000J5796q889l2664k8251
11425F2914l4597m5046J1478K3606N9849J7506k4487k2194k2417l5390k4721k4449
11413e7948L7149J1633r9348M8293R0727M7731N9357L3345L0819J3505o8700J5199
11401A61762P2375o5507l625O3230M034q3028l4755O8977p130L7431J4971m2223
11389A86512M5101K8614k7413L089q8333q1338l3185K1775N5597m0514q6131O085
11377a0141O9036N3024m503k6301J4149j0075q1563p2346Q13J32178j938l298
11365E9035K9574Q424k1065j1744M9297j3283O949K9940L8151m959Q9624l646
$$ plain form
11353 256297 191404 123202 146579 179210 103377 61464 53945 88861 74348 10024 -19486 -2064
11341 -2064 30592 50113 103265 117474 65855 106690 138958 161892 217532 167677 100696 116032
11329 116032 111073 6877 -87825 -147598 -74325 -4851 17002 60624 128193 217986 284684
11318 284684 263289 137983 128253 161468 141654 95800 150074 150916 82070 79002 104606 13754
11306 13754 -92358 -19823 13331 -15650 -18209 -1601 56823 105228 229490 326689 334266 344530
11294 344530 386677 420495 343277 302729 310428 391692 402990 371836 372102 543013 787684 1065379
11282 1065379 1556344 2192474 2887708 3533375 3904022 3880160 3470514 2828160 2094444 1667834
11272 1667834 1435969 1278968 1115703 993599 851836 684743 573573 565260 494449 424765
$$ packed form
11353B56297o4893o8202K3377L2631p5833m1913p519L4916j4513o4324k9510J7422
11341b064L2656J9521N3152J4209n1619M0835L2268K2934N5640m9855o6981J5336
11329A16032m959j04196r4702n9773P3273O9474K1853M3622O7569Q9793O6698
11318B84684k1395j25306r730L3215j9814m5854N4274Q42o8846l068K5604r0852
11306A3754j06112P2535L3154k8981k559J6608N8424M8405J24262R7199P577J0264
11294C44530M2147L3818p7218m0548P699Q1264J1298l1154K66J70911K44671K77695
11282A065379M90965O36130O95234O45667L70647k3862m09646o42354p33716m26610
11272A667834k31865j57001j63265j22104j41763j67093j11170q313p0811o9684
$$ plain form
11262 424765 492082 603841 543425 471164 453147 358884 426870 418547 357830 327950 328735 219177
11250 219177 193079 209719 191469 221596 132167 44885 115471 195210 187969 150070 145572 115572
11238 115572 95113 45596 71405 106879 129487 180042 238906 238341 219926 234292 254167 271426
11226 271426 267188 191701 112775 35280 5791 54588 93436 160983 126225 28807 65247 122821
11214 122821 199542 204088 160613 181541 157278 141055 162320 148033 141703 182491 240309 292110
11202 292110 224570 213237 164891 70194 144813 100200 98600 138468 143878 174356 150519 111506
11190 111506 106820 87509 121304 89916 21696 72650 196986 274849 279069 282229 223576 199356
11178 199356 163373 91139 26981 24178 41505 54943 -8897 -59681 29863 197232 208886
$$ packed form
11262D24765O7317J11759o0416p2261j8017r4263O7986q323o0717k9880P85j09558
11250B19177k6098J6640j8250L0127q9429q7282P0586P9739p241l7899m498l0000
11238A15572k0459m9517K5809L5474K2608N0555N8864n65j8415J4366J9875J7259
11226B71426m238p5487p8926p7495k9489M8797L8848O7547l4758r7418L6440N7574
11214A22821P6721M546m3475K0928k4263j6223K1265j4287o330M0788N7818N1801
11202B92110o7540j1333m8346r4697P4619m4613j600L9868N410L0478k3837l9013
11190A11506m686j9311L3795l1388o8220N0954J24336P7863M220L160n8653k4220
11178A99356l5983p2234o4158k803J7327J3438o3840n0784Q9544J67369J1654
$$ plain form
11167 208886 235026 225221 185470 176171 174529 192016 207245 290563 275166 256794 256113 205459
11155 205459 185894 213175 265452 235747 218012 208192 174451 250776 311404 338758 242837 80755
11143 80755 64869 161937 220047 230719 191933 215918 223615 202271 261103 300804 273939 260067
11131 260067 234994 217792 207595 185877 191996 192508 195357 239153 315202 274792 265716 234646
11119 234646 177404 257866 292076 205769 251146 296607 358630 301250 202200 236413 186566
11108 186566 156020 155343 220690 211258 104101 70344 84210 110632 185030 234561 325105 355280
11096 355280 306148 242796 143560 156188 109914 107360 109320 144200 251619 252446 233465 247672
11084 247672 234577 314811 343397 321624 277135 230396 166631 316033 401602 348495 258921
$$ packed form
11167B08886K6140r805l9751r299j642J7487J5229Q3318j5397j8372o81n0654
11155B05459j9565K7281N2277k9705j7735r820l3741P6325O0628K7354r5921j62082
11143H0755j5886R7068N8110J0672l8786K3985P697k1344N8832L9701k6865j3872
11131B60067k5073j7202j0197k1718O119N12K849M3796P6049m0410r076l1070
11119B34646n7242Q0462L4210q6307M5377M5461O2023n7380r9050L4213m9847
11108A86566l0546o77O5347r432j07157l3757J3866K6422P4398M9531R0544L0175
11096C55280m9132o3352r9236J2628m6274k554J960L4880J07419Q27j8981J4207
11084B47672j3095Q0234K8586k1773m4489m6739o3765J49402Q5569n3107q9574
$$ plain form
11073 258921 205209 256715 341637 318160 298733 247858 187340 158991 140753 90818 89321 177939
11061 177939 250689 270473 335499 328921 335388 310601 220190 197054 206434 219484 228971 194930
11049 194930 169371 226422 246309 283226 272930 289892 298090 344217 411955 486718 558517 623070
11037 623070 664724 701580 826866 931421 1004288 1270165 1662297 2055923 2518959 2871005
11027 2871005 3271184 3405923 3503321 3472358 3249206 2871689 2409675 2205369 1972025 1665611
11017 1665611 1462080 1412866 1376699 1276222 1204191 1222925 1138477 1080218 1019285 906855 859815
11006 859815 764590 740354 779817 759573 831676 911233 869424 788113 660346 577712 574903
10995 574903 522580 452033 406753 464803 466076 357160 281376 226813 232413 221363 237449 189266
$$ packed form
11073B58921n3712N1506Q4922k3477j9427n0875o0518k8349j8238m9935j497Q8618
11061A77939P2750J9784O5026o578O467k4787r0411k3136R380J3050R487l4041
11049A94930k5559N7051J9887L6917j0296J6962Q198M6127O7738P4763P1799O4553
11037F23070M1654L6856J25286J04555P2867K65877L92132L93626M63036L52046
11027B871005M00179J34739R7398l0963k23152l77517m62014k04306k33344l06414
11017A665611k03531m9214l6167j00477p2031J8734q4448n8259o0933j12430m7040
11006H59815r5225k4236L9463k0244P2103P9557m1809q1311j27767q2634k809
10995E74903n2323p0547m5280N8050J273j08916p5784n4563N600j1050J6086m8183
$$ plain form
10983 189266 197670 265494 394365 397108 273399 197154 220303 254415 347984 384288 348669
10972 348669 332370 231977 231790 198488 141809 149094 159837 179563 175388 198444 266508 315024
10960 315024 351884 368298 288402 282095 281816 228400 241686 209873 235328 271838 339081 293992
10948 293992 197807 257361 243715 121602 134007 297154 357421 348963 362367 372774 323600
10937 323600 325057 408465 482216 552962 740297 890099 1091723 1342463 1517586 1732202
10927 1732202 2092051 2316542 2271653 2046980 1828066 1615966 1425517 1224793 1045610 980922
10917 980922 893867 773359 665286 625268 597166 612346 538204 500964 505636 473920 416991
10906 416991 384681 426924 410687 372364 483449 536761 469092 399729 457039 530142 529271 465823
$$ packed form
10983A89266Q404O7824J28871K743j23709p6245K3149L4112R3569L6304l5619
10972C48669j6299j00393j87l3302n6679P285J0743J9726m175K3056O8064M8516
10960C15024L6860J6414p9896o307k79n3416J3286l1813K5455L6510O7243m5089
10948B93992r6185N9554j3646j22113J2405J63147O0267q458J3404J0407m9174
10937C23600J457Q3408P3751P0746J87335J49802K01624K50740J75123K14616
10927A732202L59849K24491m4889k24673k18914k12100j90449k00724j79183o4688
10917I80922q7055j20508j08073m0018k8102J5180p4142l7240M672l1716n6929
10906D16991l2310M2243j6237l8323J11085N3312o7669o9363N7310P3103q71o3448
$$ plain form
10894 465823 415661 438670 459873 444128 378857 388778 422093 473265 532097 475580 471178 457064
10882 457064 513699 533635 455950 331921 329578 312635 285201 246170 282261 283640 327215 350898
10870 350898 319678 256909 137788 179252 248666 350123 402696 420463 367490 364466 338436
10859 338436 292018 338749 382836 371567 342251 359429 429106 447375 388437 355494 283780
10848 283780 299201 319384 361443 398233 443067 478393 460493 517538 502207 446022 469848
10837 469848 548643 510310 492746 554591 506931 363251 445315 624772 724677 744103 660451
10826 660451 523220 464393 435527 426384 501508 484112 398249 424187 341779 296108 325571
10815 325571 261516 319253 303319 258784 273145 373144 386736 394006 446919 484896 412422 377916
$$ packed form
10894D65823n0162K3009K1203j5745o5271R921L3315N1172N8832n6517m402j4114
10882D57064N6635J9936p7685j24029k343j6943k7434l9031L6091J379M3575K3683
10870C50898l1220o2769j19121M1464O9414J01457N2573J7767n2973l024k6030
10859C38436m6418M6731M4087j1269k9316J7178O9677J8269n8938l2943p1714
10848B83780J5421K0183M2059L6790M4834L5326j7900N7045j5331n6185K3826
10837D69848P8795l8333j7564O1845m7660j43680Q2064J79457R9905J9426q3652
10826F60451j37231n8827k8866r143P5124j7396q5863K5938q2408m5671K9463
10815C25571o4055N7737j5934m4535J4361R9999J3592P270N2913L7977p2474l4506
$$ plain form
10803 377916 393735 415528 457233 392428 362371 410059 429785 358956 249364 220577 290265
10792 290265 318841 422069 405197 392311 451290 548479 551921 459788 498558 522338 437910
10781 437910 516090 603606 648495 635689 587082 672744 809952 878849 938784 1065836 1226478
10770 1226478 1329908 1596628 1908398 2238647 2378600 2377475 2296276 2061326 1797212 1574741
10760 1574741 1352614 1195687 1152524 1088642 969990 902824 890586 823704 818918 879562 746160
10749 746160 496639 434472 425585 482358 519817 528184 512914 490231 477617 409862 349780 316188
10737 316188 317215 310862 349446 338498 317905 343854 283240 327859 385368 386531 386676 463476
10725 463476 395744 359061 413525 395024 477549 499655 472028 427207 459844 425286 401616
$$ packed form
10803C77916J5819K1793M1705o4805l0057M7688J9726p0829j09592k8787O9688
10792B90265K8576J03228j6872j2886N8979R7189L442r2133L8770K3780q4428
10781D37910P8180Q7516M4889j2806m8607Q5662J37208O8897N9935J27052J60642
10770A226478J03430K66720L11770L30249J39953j125q1199k34950k64114k22471
10760A574741k22127j56927m3163o3882j18652o7166j2238o6882m786O0644j33402
10749G46160k49521o2167q887N6773L7459Q367j5270k2683j2614o7755o0082l3592
10737C16188J027o353L8584j0948k0593K5949o0614M4619N7509J163J45P6800
10725D63476o7732l6683N4464j8501Q2525K2106k7627m4821L2637l4558k3670
$$ plain form
10714 401616 454193 497878 457551 411552 390881 419798 401054 480083 525438 614762 675593
10703 675593 713292 748333 738644 763394 808377 822619 821604 880951 967505 973624 972632 952926
10691 952926 829535 836241 785480 745712 778374 861763 954254 903860 981214 996018 998984 998389
10679 998389 987367 991783 957961 891893 749858 618581 448465 272950 276172 300090 331065
10668 331065 504800 639146 664035 694571 703936 661686 643932 661179 782835 818437 746725
10657 746725 772922 773418 828279 931964 1060717 1112859 1124548 1336238 1586659 1794451 1905765
10646 1905765 2057833 2225349 2402916 2490075 2571565 2559840 2529817 2469830 2365050 2369993 2333883
10635 2333883 2383943 2445987 2523363 2527376 2634472 2679881 2898789 3115097 3360733 3590889
$$ packed form
10714D01616N2577M3685m0327m5999k0671K8917j8744P9029M5355Q9324O0831
10703F75593L7699L5041r689K4750M4983J4242j015N9347Q6554O119r92j9706
10691I52926j23391O706n0761l9768L2662Q3389R2491n0394P7354J4804K966n95
10679I98389j1022M416l3822o6068j42035j31277j70116j75515L222K3918L0975
10668C31065J73735J34346K4889L0536R365m2250j7754J7247J21656L5602p1712
10657G46725K6197M96N4861J03685J28753N2142J1689K11690K50421K07792J11314
10646A905765J52068J67516J77567Q7159Q1490j1725l0023n9987j04780M943l6110
10635B333883N0060O2044P7376M013J07096M5409K18908K16308K45636K30156
$$ plain form
10625 3590889 3899000 4179172 4607391 4985597 5268047 5549252 5916552 6434316 7108279
10616 7108279 8027262 9201851 10774913 12889187 15522569 18738978 22611653 27083550
10608 27083550 32019449 36736728 40429456 42482331 43061710 42861054 42983559 44273558
10600 44273558 47213471 52142641 58990423 67543331 76940379 85256906 90634099 91792932
10592 91792932 89024275 84501189 80913310 79845368 81905446 87229314 95494580 105953225
10584 105953225 116796381 125462851 128892618 125713679 116974772 106106322 96731017 90447087
10576 90447087 87541087 87798760 90478765 94715290 99096649 101569209 100454054 94889625
10568 94889625 86003976 76296900 67955765 61803840 57982109 56046583 55433233 55502920
$$ packed form
10625C590889L08111K80172M28219L78206K82450K81205L67300N17764O73963
10616G108279R18983J174589J573062K114274K633382L216409L872675M471897
10608B7083550M935899M717279L692728K052875N79379k00656J22505J289999
10600D4273558K939913M929170O847782Q552908R397048Q316527N377193J158833
10592I1792932k768657m523086l587879j067942K060078N323868Q265266J0458645
10584A05953225J0843156Q666470L429767l178939q738907j0868450r375305o283930
10576I0447087k906000K57673K680005M236525M381359K472560j115155n564429
10568I4889625q885649r707076q341135o151925l821731j935526o13350O9687
$$ plain form
10560 55502920 55461461 54556890 52101942 48009503 42763086 37472026 32714680 28759044
10552 28759044 25773356 23449620 21581157 20059497 18761045 17784922 16998428 16374159
10544 16374159 15954200 15803877 15901676 16041824 16404676 16949202 17644218 18454324 19240896
10535 19240896 20175078 21257804 22756701 24633226 27083591 30392779 34559724 39965759
10527 39965759 46936497 55920426 67604542 83071743 103904303 132086613 169972214
10520 169972214 218699781 276435373 334830615 378460264 391829445 367396458 313219515
10513 313219515 252545447 202950877 167185275 142195817 124337043 110422847 98100120
10506 98100120 86604036 76078510 66898495 58961182 52238112 46529326 41622903 37483137
$$ packed form
10560E5502920m1459r04571k454948m092439n246417n291060m757346l955636
10552B8759044k985688k323736j868463j521660j298452r76123p86494o24269
10544A6374159m19959j50323R7799J40148L62852N44526O95016Q10106P86572
10535A9240896R34182J082726J498897J876525K450365L309188M166945N406035
10527C9965759O970738Q983929J1684116J5467201K0832560K8182310L7885601
10520A69972214M8727567N7735592N8395242M3629649J3369181k4432987n4176943
10513C13219515o0674068m9594570l5765602k4989458j7858774j3914196j2322727
10506I8100120j1496084j0525526r180015p937313o723070n708786m906423m139766
$$ plain form
10498 37483137 34105563 31222789 28814272 26720731 24738355 22845324 20867546 19133838
10490 19133838 17602977 16302741 15125760 14033054 13017405 12119415 11199319 10382400
10482 10382400 9678208 8983421 8362802 7764571 7238407 6775880 6416649 6062635 5742119
10473 5742119 5501599 5332346 5130709 4892474 4585288 4351228 4162579 4006859 3853333
10464 3853333 3761733 3792042 3654359 3495376 3433494 3371210 3231835 3052438 2922530 2803175
10454 2803175 2609373 2578425 2682526 2690194 2557045 2464725 2450423 2456765 2453836 2367237 2267876
10443 2267876 2182180 2188337 2286618 2332596 2334302 2299107 2325470 2311608 2267765 2140652 2121779
10432 2121779 2175219 2226868 2318794 2412325 2481671 2458920 2447497 2402196 2489005 2584766 2551475
$$ packed form
10498C7483137l377574k882774k408517k093541j982376j893031j977778j733708
10490A9133838j530861j300236j176981j092706j015649q97990r20096q16919
10482A0382400p04192o94787o20619n98231n26164m62527l59231l54014l20516
10473E742119k40520j69253k01637k38235l07186k34060j88649j55720j53526
10464C853333r1600L0309j37683j58983o1882o2284j39375j79397j29908j19355
10454B803175j93802l0948J04101P668j33149r2320j4302O342k929q6599r9361
10443B267876q5696O157R8281M5978J706l5195K6363j3862m3843j27113j8873
10432B121779N3440N1649R1926R3531O9346k2751j1423m5301Q6809R5761l3291
$$ plain form
10421 2551475 2553668 2553444 2519541 2499751 2595088 2723457 2781665 2696854 2727379 2722021 2795719 2859688
10409 2859688 2853554 3027760 3162247 3312945 3379309 3498761 3640342 3823379 3974355 4103486
10399 4103486 4273336 4380665 4478742 4779940 5112699 5479999 5792483 6135746 6565065 7168239
10389 7168239 7850212 8577761 9417856 10385229 11478784 12558636 13628539 14738351 15855434
10380 15855434 17095218 18794752 20961698 23620590 26884397 31023474 36306990 43113257
10372 43113257 51847321 63076112 77813544 97537029 124310934 160521918 208136521
10365 208136521 266164548 327531167 377225144 398031236 379843208 327339267 263834906
10358 263834906 210561615 172199195 145702014 127048185 112750943 100315721 88897887
$$ packed form
10421B551475K193k24l3903j9790R5337J28369N8208q4811L0525n358P3698O3969
10409B859688o134J74206J34487J50698O6364J19452J41581J83037J50976J29131
10399D103486J69850J07329R8077L01198L32759L67300L12484L43263M29319O03174
10389G168239O81973P27549Q40095R67373J093555J079852J069903J109812J117083
10380A5855434J239784J699534K166946K658892L263807M139077N283516O806267
10372D3113257Q734064J1228791J4737432J9723485K6773905L6210984M7614603
10365B08136521N8028027O1366619M9693977K0806092j8188028n2503941o3504361
10358B63834906n3273291l8362420k6497181j8653829j4297242j2435222j1417834
$$ plain form
10351 88897887 78535464 69483847 61723277 55171887 49621986 44627937 40287267 36360383
10343 36360383 33019342 30137406 27708023 25684722 23735512 21663617 19677293 17991420
10335 17991420 16495569 15175641 14025171 12978160 11945962 11006205 10178544 9406267
10327 9406267 8734013 8072525 7448546 6830952 6326835 5878275 5582456 5339767 4997125
10318 4997125 4744325 4530149 4361952 4170718 3982294 3755215 3563160 3408992 3186246
10309 3186246 3122692 2918837 2751183 2633382 2493226 2354847 2319217 2306531 2218008 2153459
10299 2153459 2083596 2034950 1910407 1892199 1877238 1868618 1903375 1948204 1907993 1938974 1869422
10288 1869422 1696128 1565678 1564067 1528897 1490138 1365185 1311847 1253885 1192611 1129031 1066296
$$ packed form
10351H8897887j0362423r051617p760570o551390n549901m994049m340670l926884
10343C6360383l341041k881936k429383k023301j949210k071895j986324j685873
10335A7991420j495851j319928j150470j047011j032198r39757q27661p72277
10327I406267o72254o61488o23979o17594n04117m48560k95819k42689l42642
10318D997125k52800k14176j68197j91234j88424k27079j92055j54168k22746
10309C186246o3554k03855j67654j17801j40156j38379l5630j2686q8523o4549
10299B153459o9863m8646j24543j8208j4961q620L4757M4829m0211L0981o9552
10288A869422j73294j30450j611l5170l8759j24953n3338n7962o1274o3580o2735
$$ plain form
10277 1066296 1027589 964575 859873 814897 732800 697289 756809 766435 703024 661568 698326
10266 698326 690346 588518 524882 557082 645206 624698 676305 730627 700121 684288 673844
10255 673844 577544 502612 546203 671934 686551 573569 472171 522087 589282 569839 543170
10244 543170 554672 700025 735400 841197 986540 980305 977457 1010354 1026616 1039366 971476
10233 971476 835976 763394 680996 717725 747862 804311 916849 930675 907243 865834 936990
10222 936990 1012393 963519 928000 950078 1003551 1065161 1068218 1063785 1114916 1336445 1502970
10211 1502970 1657926 1723356 1818724 1879044 1796179 1493028 1292746 1048381 780266 665946
10201 665946 677106 692332 641845 582542 519583 424078 385770 402834 396643 376398 293051 240234
$$ packed form
10277A066296l8707o3014j04702m4976q2097l5511N9520R626o3411m1456L6758
10266F98326p980j01828o3636L2200Q8124k0508N1607N4322l0506j5833j0444
10255F73844r6300p4932M3591J25731J4617j12982j01398M9916O7195j9443k6669
10244E43170J1502J45353L5375J05797J45343o235k848L2897J6262J2750o7890
10233I71476j35500p2582q2398L6729L0137N6449J12538J3826k3432m1409P1156
10222I36990P5403m8874l5519K2078N3473O1610L057m433N1131K21529J66525
10211A502970J54956O5430R5368O0320q2865l03151k00282k44365k68115j14320
10201F65946J1160J5226n0487n9303o2959r5505l8308J7064o191k0245q3347n2817
$$ plain form
10189 240234 335674 436523 499754 390692 358519 286375 185645 204433 238546 244755 202105
10178 202105 124278 125676 211261 188766 165225 254783 285088 348932 436863 475681 486153 381602
10166 381602 404888 390293 334165 306612 308554 323351 385460 483470 580672 570623 552367 535524
10154 535524 435018 475490 542510 643298 671671 742767 850381 854775 837944 859687 845042
10143 845042 788760 775247 788351 845900 818509 887700 1042168 1254149 1474739 1700400 1978616
10132 1978616 2151496 2375356 2678013 2742657 2538575 2218551 1901573 1633310 1488447 1414619
10122 1414619 1248106 1140864 1126057 1016160 963776 982537 885798 732772 638003 670165
10112 670165 651648 620038 711603 735834 799687 1052678 1343324 1566068 1759473 1970023
$$ packed form
10189B40234R5440J00849O3231j09062l2173p2144j00730J8788L4113O209m2650
10178B02105p7827J398Q5585k2495k3541Q9558L0305O3844Q7931L8818J0472j04551
10166C81602K3286j4595n6128k7553J942J4797O2109R8010R7202j0049j8256j6843
10154E35524j00506M0472O7020J00788K8373P1096J07614M394j6831K1743j4645
10143H45042n6282j3513J3104N7549k7391O9191J54468K11981K20590K25661K78216
10132A978616J72880K23860L02657O4644k04082l20024l16978k68263j44863p3828
10122A414619j66513j07242j4807j09897n2384J8761r6739j53026r4769L2162
10112F70165j8517l1610R1565K4231O3853K52991K90646K22744J93405K10550
$$ plain form
10102 1970023 2188803 2207016 1978445 1684714 1433601 1153171 923493 891648 812855 764122
10092 764122 705502 595881 523789 419587 408881 479721 428958 358761 347820 339571 302164
10081 302164 359699 317563 344866 282682 250408 209294 175768 186392 249640 270948 283758
10070 283758 241040 209229 242990 259796 284354 333751 296118 260119 200197 260609 324930
10059 324930 357453 323357 314558 274043 199300 95600 72109 -54253 -91876 -38504 -72834
10048 -72834 -80517 -76082 -97220 -115311 -72935 -84516 -120400 -84914 -11666 7219 -5664 33452
10036 33452 61715 43585 344 -54274 -86987 -115187 -67289 -21267 -22616 -12871 -39251 -2757
10024 -2757 42438 -20277 -63905 -3268 -39134 -37900 20794 64262 82084 52255 89336 99450
$$ packed form
10102A970023K18780J8213k28571k93731k51113k80430k29678l1845p8793m8733
10092G64122n8620j09621p2092j04202j0706P0840n0763p0197j0941q249l7407
10081C02164N7535m2136K7303o2184l2274m1114l3526J0624O3248K1308J2810
10070B83758m2718l1811L3761J6806K4558M9397l7633l5999n9922O0412O4321
10059C24930L2523l4096q799m0515p4743j03700k3491j26362l7623N3372l4330
10048g2834p683M435k1138j8091M2376j1581l5884L5486P3248J8885j2883L9116
10036C3452K8263j8130m3241n4618l2713k8200M7898M6022j349R745k6380L6494
10024b757M5195o2715m3628O0637l5866J234N8694M3468J7822k9829L7081J0114
$$ plain form
10012 99450 54003 -33421 -114592 -88823 -54912 -83428 -87639 -85281 -46716 64269 114068 66061
10000 66061 76383 59514 101454 74269 80689 37560 14359 62741 73886 27355 -42912 -63731
9988 -63731 -6124 -19654 78914 95736 30849 71934 96521 153218 134032 107204 75232 149102
9976 149102 180375 56515 98227 110619 109941 135533 130127 226408 350352 352663 333602 314173
9964 314173 310830 368939 415477 470131 642326 757304 926194 1220759 1461914 1745002 1753226
9953 1753226 1800356 1754055 1481242 1279505 1084408 882307 724371 610612 634852 593861
9943 593861 490665 467333 481776 478599 406057 336050 265175 271870 197566 199135 261839 288719
9931 288719 349936 395863 382302 308194 290327 281793 306857 345914 409058 348468 270386 190602
$$ packed form
10012I9450m5447q7424q1171K5769L3911k8516m211K358L8565J10985M9799m8007
10000F6061J0322j6869M1940k7185O420m3129k3201M8382J1145m6531p0267k0819
9988f3731N7607j3530R8568J6822o4887M1085K4587N6697j9186k6828l1972P3870
9976A49102L1273j23860M1712J2392o78K5592n406R6281J23944K311j9061j9429
9964C14173l343N8109M6538N4654J72195J14978J68890K94565K41155K83088Q224
9953A753226M7130m6301k72813k01737j95097k02101j57936j13759K4240m0991
9943E93861j03196k3332J4443l177p2542p0007p0875O695p4304J569O2704K6880
9931B88719O1217M5927j3561p4108j7867q534K5064L9057O3144o0590p8082p9784
$$ plain form
9919 190602 76447 -11888 -24107 -56656 -43375 -84531 -32253 -10486 -42447 7610 164401
9908 164401 158500 112812 157230 116426 118298 75574 33120 53728 109458 127163 132927 20084
9896 20084 -12122 58224 101792 108651 39441 33571 50709 107808 95453 42349 52672 51645
9884 51645 102803 92830 26508 16513 -4880 -30821 -27397 9567 40775 37573 34559 15101 -23469
9871 -23469 -55175 -85936 -26484 81481 32704 -6400 -6265 -11928 -18314 -17226 -17394 -62665 -6665
9858 -6665 7726 -28862 -27563 -53753 36429 100436 95895 55303 112241 34589 -52370 9815
9846 9815 99689 137917 59119 -18296 -106005 -73170 -48465 -56935 -82319 22458 7914 -104135
9834 -104135 -96718 -7796 102748 42896 -35304 58295 127670 142492 88558 23229 29821 13840
$$ packed form
9919A90602j14155q8335j2219l2549J3281m1156N2278K1767l1961N0057J56791
9908A64401n901m5688M4418m0804J872m2724m2454K0608N5730J7705N764j12843
9896B0084l2206P0346M3568O859o9210n870J7138N7099j2355n3104J0323j027
9884E1645N1158r973o6322r995k1393k5941L424L6964L1208l202l014j9458l8570
9871b3469l1706l0761N9452J07965m8777l9104J35n663o386J088j68m5271N6000
9858f665J4391l6588J299k6190R0182O4007m541m0592N6938p7652q6959O2185
9846I815Q9874L8228p8798p7415q7709L2835K4705q470k5384J04777j4544j12049
9834a04135P417Q8922J10544n9852p8200R3599O9375J4822n3934o5329O592j5981
$$ plain form
9822 13840 100626 102419 13442 -30190 -94206 5439 85519 135074 187176 122983 648 35960
9810 35960 83136 105404 101149 23349 -72826 -163906 -120233 -31997 -26019 -6894 27723 7807
9798 7807 36826 12217 20989 18598 375 66631 84500 75110 161147 176548 43667 -70125
9786 -70125 38138 113391 140415 118765 37584 26553 64791 121589 67265 -48740 -66450
9775 -66450 -29365 11883 78084 110094 57758 31012 -20580 -44488 30892 42663 53780 111517
9763 111517 22871 -52119 -43437 -3452 -51770 -41737 11708 -37843 -61049 -21341 -32300 -65609
9751 -65609 -54517 -91654 -82127 -49597 -85733 -106933 -44463 -89371 -118785 -63052 41530 60389
9739 60389 107072 174851 124069 106787 110670 109125 45672 36500 134590 167669 195852 385173
$$ packed form
9822A3840Q6786J793q8977m3632o4016R9645Q0080M9555N2102o4193j22335L5312
9810C5960M7176K2268m255p7800r6175r1080M3673Q8236N978J9125L4617j9916
9798G807K9019k4609Q772k391j8223O6256J7869r390Q6037J5401j32881j13792
9786g0125J08263P5253K7024k1650q1181j1031L8238N6798n4324j16005j7710
9775f6450L7085M1248O6201L2010n2336k6746n1592k3908P5380J1771J1117N7737
9763A11517q8646p4990Q682L9985m8318J0033N3445m9551k3206L9708j0959l3309
9751f5609J1092l7137R527L2530l6136k1200O2470m4908k9414N5733J04582J8859
9739F0389M6683O7779n0782j7282L883j545o3453r172R8090L3079K8183J89321
$$ plain form
9727 385173 571607 717474 874188 1130109 1375922 1762992 2282440 2716893 3061854 3128079
9717 3128079 3035563 2914547 2627747 2215211 1827561 1451530 1223174 1027461 782597 608435
9707 608435 514230 520456 458709 388850 340378 273413 259305 158577 147297 137645 64974 27376
9695 27376 1067 50136 27432 55616 53375 -59321 -11739 79682 51533 31070 22527 37332
9683 37332 41555 574 -41838 -84047 -126869 -174226 -188228 -145259 -14628 28610 48484 52966
9671 52966 78381 138261 89482 40369 -27744 27768 -12860 -123511 -83501 -16888 -4939 22138
9659 22138 65941 58697 -48003 -111771 -86054 -66167 -52029 -61962 -79726 -81576 -105067 -90323
9647 -90323 1567 68447 169472 200017 195269 269079 287340 236936 127927 32928 -16263 -61459
$$ packed form
9727C85173J86434J45867J56714K55921K45813L87070N19448M34453L44961O6225
9717C128079r2516j21016k86800m12536l87650l76031k28356j95713k44864j74162
9707F08435r4205O226o1747o9859m8472o6965j4108j00728j1280r652p2671l7598
9695B7376k6309M9069k2704K8184k241j12696M7582R1421k8149k0463q543J4805
9683C7332M223m0981m2412m2209m2822m7357j4002M2969J30631M3238J9874M482
9671E2966K5415N9880m8779m9113o8113N5512m0628j10651M0010O6613J1949K7077
9659B2138M3803p244j06700o3768K5717J9887J4138r933j7764j850k3491J4744
9647i0323R1890O6880J01025L0545m748P3810J8261n0404j09009r4999m9191m5196
$$ plain form
9635 -61459 -86127 -36863 28929 85433 63253 51107 80995 44563 20723 -37333 -56943 -41586
9623 -41586 -20417 -36712 -87562 -38535 24749 -31068 -1048 -52841 -114381 -116177 -126983 -159325
9611 -159325 -92155 -39257 44379 34735 -24702 -14855 12626 25597 19865 57355 23079 -2542
9599 -2542 -29516 -115956 -55954 -4234 22830 -85156 -120707 -149374 -83023 -66715 -77990 -67280
9587 -67280 -135145 -65396 -21624 270 -2313 -58174 -25358 -30978 -54886 -56314 -173467 -243009
9575 -243009 -207239 -196370 -135627 -52835 -27434 -28773 -243 59964 129043 201713 140232 59628
9563 59628 71748 80106 61745 -51844 -84932 -50983 -53589 -46781 -67295 -68022 -57270 -57541 -57306
9550 -57306 -96787 -187949 -191323 -110170 -74423 21708 26901 -87535 -96262 -69773 -74680 -30706
$$ packed form
9635f1459k4668M9264O5792N6504k2180j2146K9888l6432k3840n8056j9610J5357
9623d1586K1169j6295n0850M9027O3284n5817L0020n1793o1540j796j0806l2342
9611a59325O7170N2898Q3636r644n9437R847K7481J2971n732L7490l4276k5621
9599b542k6974q6440O0002N1720K7064j07986l5551k8667O6351J6308j1275J0710
9587f7280o7865O9749M3772K1894k583n5861L2816n620k3908j428j17153o9542
9575b43009L5770J0869O0743Q2792K5401j339K8530O0207O9079P2670o1481q0604
9563E9628J2120Q358j8361j13589l3088L3949k606O808k0514p27J0752k71K35
9550e7306l9481r1162l374Q1153L5747R6131N193j14436q727K6489m907M3974
$$ plain form
9538 -30706 -66114 -96353 -42139 -20097 -11194 52261 83219 85984 80381 -17318 -7652 -107210 -130545
9525 -130545 -85819 -21366 39278 22592 -74013 -40142 63018 143227 122049 215357 291847
9514 291847 290137 225155 243627 204325 97834 112342 96689 64849 13624 -41246 -16155 62930
9502 62930 105163 52327 130722 100917 73941 42554 65743 156577 129312 180280 223294 329599
9490 329599 390844 312310 251094 289299 285350 248377 248180 320250 236906 161472 268622 322422
9478 322422 281643 258967 347812 338223 239973 213369 188280 150497 91125 111314 194957 174965
9466 174965 202028 280695 334953 366958 333822 296150 376887 532648 671737 914388 1049322
9455 1049322 1088353 1061596 1057827 1156607 1289088 1382397 1542340 1868952 2428741 3045202 3762183
$$ packed form
9538c0706l5408l0239N4214K2042Q903O3455L0958K765n603r7699R666r9558k3335
9525a30545M4726O4453O0644j6686r6605L3871J03160Q0209k1178R3308P6490
9514B91847j710o4982J8472l9302j06491J4508j5653l1840n1225n4870K5091P9085
9502F2930M2233n2836P8395k9805k6976l1387K3189R0834k7265N0968M3014J06305
9490C29599O1245p8534o1216L8205l949l6973j97P2070q3344p5434J07150N3800
9478C22422m0779k2676Q8845r589r8250k6604k5089l7783n9372K0189Q3643j9992
9466A74965K7063P8667N4258L2005l3136l7672Q0737J55761J39089K42651J34934
9455A049322L9031k6757l769R8780J32481R3309J59943L26612N59789O16461P16981
$$ plain form
9444 3762183 4287982 4440641 4118097 3581851 3242180 2989962 2754113 2523584 2230345 2106247
9434 2106247 2011260 2003273 2094946 2452574 2806603 3179738 3637688 4054607 4417124 4736647
9424 4736647 4937023 4960365 4764900 4627652 4549786 4409212 4266964 4203695 4133484 3987273
9414 3987273 3935318 3966926 3870389 3819651 3980284 4231322 4691483 5490203 6583849 8002679
9404 8002679 9790873 11550065 12638748 12659666 11360611 9284515 7547578 6341962 5597822
9395 5597822 5122826 4817151 4631016 4494814 4501719 4446819 4372290 4159128 4149709 4292821 4371560
9384 4371560 4507384 4765417 4969811 5069992 5115478 5088564 4854031 4541724 4165459 3658900
9374 3658900 3184940 2780050 2458400 2295381 2221470 2197096 2282206 2539742 2805817 3021044
$$ packed form
9444C762183N25799J52659l22544n36246l39671k52218k35849k30529k93239j24098
9434B106247r4987p987R1673L57628L54029L73135M57950M16919L62517L19523
9424D736647K00376K3342j95465j37248p7866j40574j42248o3269p0211j46211
9414C987273n1955L1608r6537n0738J60633K51038M60161P98720J093646J418830
9404H002679J788194J759192J088683K0918j299055k076096j736937j205616p44140
9395E597822m74996l05675j86135j36202O905n4900p4529k13162r419J43112P8739
9384D371560J35824K58033K04394J00181M5486k6914k34533l12307l76265n06559
9374C658900m73960m04890l21650j63019p3911k4374Q5110K57536K66075K15227
$$ plain form
9364 3021044 3273647 3491162 3801584 4086681 4292336 4204804 3692686 2957422 2424956 2128863
9354 2128863 1948342 1757122 1616327 1558796 1488938 1460525 1288463 1125584 1054131 955242
9344 955242 810237 623234 582826 608351 575584 485995 439222 445159 428609 295093 197646
9333 197646 186403 221139 290578 322740 279921 257946 305423 286235 214977 288031 295448 284650
9321 284650 334483 334064 352249 362289 413810 432237 369593 343961 302353 265520 150462 161793
9309 161793 97940 66971 30384 102709 130582 34950 -47598 4752 100404 109735 75588 86225
9297 86225 49544 52928 73218 103786 91106 167058 182576 161807 30467 13653 12463 -50348
9285 -50348 -36660 -43338 -9317 60283 121782 49792 -3289 51559 71804 44814 54631 114359
$$ packed form
9364C021044K52603K17515L10422K85097K05655q7532n12118p35264n32466k96093
9354B128863j80521j91220j40795n7531o9858k8413j72062j62879p1453r8889
9344I55242j45005j87003m0408K5525l2767q9589m6773N937j6550j33516r7447
9333A97646j1243L4736O9439L2162m2819k1975M7477j9188p1258P3054P417j0798
9321B84650M9833m19J8185J0040N1521J8427o2644k5632m1608l6833j15058J1331
9309A61793o3853l0969l6587P2325K7873r5632q2548N2350R5652R331l4147J0637
9297H6225l6681L384K0290L0568j2680P5952J5518k0769j31340j6814j190o2811
9285e0348J3688o678L4021O9600O1499p1990n3081N4848K0245k6990R817N9728
$$ plain form
9273 114359 207405 84789 -31857 -9724 -54449 -44075 -8343 -27556 -71588 -73184 -71787 -44855
9261 -44855 64315 161968 142309 30935 -48920 -37901 31377 83413 91276 63262 12677 -16761
9249 -16761 39839 108921 54148 3718 -4039 -80470 -50541 -12081 -39446 -53389 5175 17963
9237 17963 -24833 -25493 -29774 -28374 -28089 -45896 -4213 -3779 -38916 -53139 -23857 788 -52998
9224 -52998 -25958 11488 -40572 -38900 -76382 -54230 32556 -53410 -44957 27414 19058 -7143
9212 -7143 -33633 -10916 47244 2814 -66925 -50481 -66504 -93975 -199732 -215055 -158223 -41148
9200 -41148 18343 -7032 -11282 -111180 -166950 -151811 -164787 -66737 47221 30241 -44693 -17250
9188 -17250 -12506 -17490 -83453 4082 34846 55129 73071 46339 26692 9000 -484 -18275
$$ packed form
9273A14359R3046j22616j16646K2133m4725J0374L5732j9213m4032j596J397K6932
9261d4855J09170R7653j9659j11374p9855J1019O9278N2036P863k8014n0585k9438
9249a6761N6600O9082n4773n0430p757p6431K9929L8460k7365j3943N8564J2788
9237A7963m2796o60m281J400K85j7807M1683M34l5137j4223K9282K4645n3786
9224e2998K7040L7446n2060J672l7482K2152Q6786q5966Q453P2371q356k6201
9212g143k6490K2717N8160m4430o9739J6444j6023k7471j05757j5323N6832J17075
9200d1148N9491k5375m250r9898n5770J5139j2976R8050J13958j6980p4934K7443
9188a7250M744m984o5963Q7535L0764K0283J7942k6732j9647j7692r484j7791
$$ plain form
9176 -18275 -53795 -46755 -20732 -111136 -171271 -97270 -29272 -93415 -103942 -43147 -14947 -23915
9164 -23915 -22031 -51939 -134839 -174715 -150451 -113722 -2637 24377 -78718 -157642 -135627 -222361
9152 -222361 -217108 -116511 -12983 111380 119242 113816 140587 123837 -26754 -93691 -78331
9141 -78331 -38075 -32944 -42566 -42263 -26243 -82141 -78288 -88681 -65436 -34166 52261 12846 -38935
9128 -38935 -36557 -105219 -55198 -53924 -105033 -115436 -97108 -95387 -69216 -59321 -33615 -47099 -61649
9115 -61649 -46824 -50717 -60318 -39394 -129608 -135756 -133115 -130685 -63447 17015 83072 74257 -12334
9102 -12334 -51679 -51358 13151 -44919 -97314 -94548 -76188 -20289 21838 -54971 -84817 -103388
9090 -103388 -97638 -41724 735 40063 26348 33609 34923 6434 -42453 -107263 -68405 -56351
$$ packed form
9176a8275l5520P040K6023r0404o0135P4001O7998o4143j0527O0795K8200q968
9164b3915J884k9908q2900l9876K4264L6729J11085K7014j03095p8924K2015q6734
9152b22361N253J00597J03528J24363P862n426K6771j6750j50591o6937J5360
9141g8331M0256N131r622L03J6020n5898L853j0393K3245L1270Q6427l9415n1781
9128c8935K378o8662N0021J274n1109j0403J8328J721K6171R895K5706j3484j4550
9115f1649J4825l893r601K0924r0214o148K641K430O7238Q0462O6057q815q6591
9102a2334l9345L21O4509n8070n2395K766J8360N5899M2127p6809k9846j8571
9090a03388N750N5914M2459L9328j3715P261J314k8489m8887o4810L8858J2054
$$ plain form
9078 -56351 -81181 52415 84406 63537 113762 76413 5180 -26266 -32768 -9634 -99 -13500
9066 -13500 -58500 -40194 -1977 21602 119359 144709 43481 36243 43205 11659 -76501 -155167
9054 -155167 -93561 21823 134558 117939 2475 47078 -1893 -26719 -86271 -104928 -51312
9043 -51312 9536 41244 89452 76873 35056 12544 -46769 -51101 11685 62749 70792 50523
9031 50523 27808 -39713 -81189 -16408 -53232 -114481 -79492 -89574 -60413 -120437 -192486 -145186
9019 -145186 -58476 -1873 -19965 -66068 -37300 9771 11451 -37758 -121810 -118576 -35749 -4654
9007 -4654 32100 -54277 -76681 -59700 -51362 -91110 -69842 -78890 -46242 -45897 -14462 -17492 24040
8994 24040 8744 -64892 -71584 -68659 -45634 -43208 -90407 -42754 9820 88092 -17727 -74579
$$ packed form
9078e6351k4830J33596L1991k0869N0225l7349p1233l1446o502K3134R535j3401
9066a3500m5000J8306L8217K3579R7757K5350j01228p238O962l1546q8160p8666
9054a55167O1606J15384J12735j6619j15464M4603m8971k4826n9552j8657N3616
9043e1312O0848L1708M8208j2579m1817k2512n9313m332O2786N1064Q043k0269
9031E0523k2715o7521m1476O4781l6824o1249L4989j0082K9161o0024p2049M7300
9019a45186Q6710N6603j8092m6103K8768M7071J680m9209q4052L234Q2827L1095
9007d654L6754q6377k2404J6981Q338l9748K1268r048L2648L45L1435l030M1532
8994B4040j5296p3636o692K925K3025K426m7199M7653N2574P8272j05819n6852
$$ plain form
8982 -74579 -23116 68711 110171 27805 67114 67301 60678 69303 59867 51761 56578 14473 -33041
8969 -33041 -95943 -117283 -70706 -101447 -42755 -19405 4251 15214 -81493 -147001 -168614 -55506
8957 -55506 24692 45082 67340 70174 101454 148464 114662 109331 67998 50284 101619 41776
8945 41776 16621 1659 -17586 30206 6985 5360 45586 118858 101805 31467 -3830 46656
8933 46656 126294 223631 252056 103427 12123 10356 -4067 -376 -50099 -34579 2977 -34836
8921 -34836 -115022 -97076 33866 37180 106890 168198 195207 152732 63136 -27839 -76063 -104977
8909 -104977 -122374 -101312 -33362 -97938 -138881 -41488 -55160 -44764 -32288 -148145 -27932
8898 -27932 -7610 -9939 56777 62765 57947 16034 71037 94354 171106 164844 146379 150654 92666
$$ packed form
8982g4579N1463R1827M1460q2366L9309J87o623Q625r436q106M817m2105m7514
8969c3041o2902k1340M6577l0741N8692K3350K3656J0963r6707o5508k1613J13108
8957e5506Q0198K0390K2258K834L1280M7010l3802n331m1333j7714N1335n9843
8945D1776k5155j4962j9245M7792k3221j625M0226P3272j7053p0338l5297N0486
8933D6656P9638R7337K8425j48629r1304j767j4423L691m9723J5520L7556l7813
8921c4836q0186J7946J30942L314O9710O1308K7009m2475q9596r0975m8224k8914
8909a04977j7397K1062O7950o4576m0943R7393j3672J0396J2476j15857J20213
8898b7932K0322k329O6716N988m818m1913N5003K3317P6752o262j8465M275n7988
$$ plain form
8885 92666 79960 106557 94234 130141 71568 -14869 2771 13127 763 -33060 -34376 7654
8873 7654 -6203 -77709 -78937 -123726 -50589 124831 161094 139057 32725 17496 130395 140536
8861 140536 47172 16132 54123 100835 40676 43154 102956 50625 48188 101782 69556 103367
8849 103367 145202 112250 68580 71313 36395 -19497 41918 145884 96218 47599 122254 172595
8837 172595 155785 215045 218619 181516 157798 200391 211065 252909 348729 328573 327426 317010
8825 317010 250024 158070 164924 250338 336936 374041 326171 179896 150620 156831 180429 169298
8813 169298 194670 144380 132957 135328 179450 101751 -3387 89463 179825 180433 171971 84489
8801 84489 82182 72070 109512 192101 211679 110864 136721 128860 145378 282657 355380 315654
$$ packed form
8885I2666j2706K6597j2323L5907n8573q6437J7640J0356j2364l3823j316M2030
8873G654j3857p1506j228m4789P3137J75420L6263k2037j06332j5229J12899J0141
8861A40536r3364l1040L7991M6712o0159K478N9802n2331k437N3594l2226L3811
8849A03367M1835l2952m3670K733l4918n5892O1415J03966m9666m8619P4655N0341
8837A72595j6810N9260L574l7103k3718M2593J0674M1844R5820k0156j147j0416
8825C17010o6986r1954O854Q5414Q6598L7105m7870j46275k9276O211K3598j1131
8813A69298K5372n0290j1423K371M4122p7699j05138R2850R0362O08q462q7482
8801H4489k307j0112L7442Q2589J9578j00815K5857p861J6518J37279P2723l9726
$$ plain form
8789 315654 239519 284780 292703 287915 289751 251735 163817 107571 128861 144681 217674 236967
8777 236967 266731 254419 179720 158367 126206 98202 150790 149521 153598 72952 10405 27253
8765 27253 21603 79223 122864 130662 26300 49902 30884 -16346 -39107 59052 94920 153724
8753 153724 126326 53137 20848 68908 81174 66527 112185 104518 103291 146030 182244 136161
8741 136161 192395 253006 296865 313067 356977 358816 379638 342801 321611 232028 116121 164997
8729 164997 155147 65973 24636 103304 125543 89336 100911 163291 267852 295811 215500 169085
8717 169085 130074 90390 79014 107767 107924 43967 154995 134249 47861 139036 181766 140020
8705 140020 119994 136359 160777 238686 291636 267268 194990 233334 279559 155711 61056
$$ packed form
8789C15654p6135M5261P923m788J836l8016q7918n6246K1290J5820P2993J9293
8777B36967K9764j2312p4699k1353l2161k8004N2588j269M077q0646o2547J6848
8765B7253n650N7620M3641P798j04362K3602j9018m7230k2761R8159L5868N8804
8753A53724k7398p3189l2289M8060J2266j4647M5658p667j227M2739L6214m6083
8741A36161N6234O0611M3859J6202M3910J839K0822l6837k1190q9583j15907M8876
8729A64997r850q9174m1337P8668K2239l6207J1575O2380J04561K7959q0311m6415
8717A69085l9011l9684j1376K8753J57o3957J11028k0746q6388R1175M2730m1746
8705A40020k0026J6365K4418P7909N2950k4368p2278L8344M6225j23848r4655
$$ plain form
8694 61056 106937 92808 69239 164660 137295 170500 193197 96653 85937 112754 171628 247998
8682 247998 208969 199999 208770 328096 341664 239562 143263 42523 -55635 -71022 -43375
8671 -43375 -36124 -50921 -55194 -49188 -15584 1375 -62368 -75987 -27534 -40614 -22978 -6755
8659 -6755 -11756 -50487 -68536 -55326 -33123 50381 38788 44649 61876 92077 145681 145151 145303
8646 145303 116264 78356 31709 7387 -7450 46971 99628 84218 58838 37750 75031 14279
8634 14279 28949 15713 -13877 -9909 -6094 -4163 20773 27994 30830 73443 15942 -57729 2298
8621 2298 -5493 -42811 -21568 3326 14572 58424 62695 23114 -25310 -18199 -71225 -2839 47671
8608 47671 -62152 -110048 -72074 8252 31895 33811 -5971 19578 -24173 -15918 65963 120052
$$ packed form
8694F1056M5881j4129k3569R5421k7365L3205K2697r6544j0716K6817N8874P6370
8682B47998l9029q970Q771J19326J3568j02102r6299j00740r8158j5387K7647
8671d3375P251j4797m273O006L3604J6959o3743j3619M8453j3080J7636J6223
8659f755n001l8731j8049J3210K2203Q3504j1593N861J7227L0201N3604n30J52
8646A45303k9039l7908m6647k4322j4837N4421N2657j5410k5380k1088L7281o0752
8634A4279J4670j3236k9590L968L815J931K4936P221K836M2613n7501p3671O0027
8621B298p791l7318K1243K4894J1246M3852M271l9581m8424P111n3026O8386N0510
8608D7671j09823m7896L7974Q0326K3643J916l9782K5549m3751Q255Q1881N4089
$$ plain form
8596 120052 26594 -37664 -23526 -32427 -48724 10154 16914 8739 4372 -8416 9870 -8987
8584 -8987 -27636 -14188 36268 46921 3621 60989 -14164 -126752 -158120 -116980 -50902 -51870
8572 -51870 -7202 45805 12440 -35196 -29491 32552 -11039 -66647 -8784 28650 7129 -44141
8560 -44141 -2829 38460 -5939 -37103 -30933 796 -1750 -42186 -66985 -52142 -69570 -37118
8548 -37118 -79896 -101695 -130571 -106614 -62530 -17354 -48362 -87935 -151606 -185928 -204665 -170832
8536 -170832 -92861 -38664 36943 -18030 -90580 -7737 56918 27942 25005 41719 35392 31597
8524 31597 33088 26048 -12269 -59602 -3673 37713 -22242 99512 122963 119294 150826 182555
8512 182555 211336 54123 -78090 -62502 -153630 -124922 -2500 -6192 -103388 29836 109674
$$ packed form
8596A20052r3458o4258J4138q901j6297N8878O760q175m367j2788J8286j8857
8584h987j8649J3448N0456J0653m3300N7368p5153j12588l1368M1140O6078r68
8572e1870M4668N3007l3365m7636N705O2043m3591n5608N7863L7434k1521n1270
8560d4141M1312M1289m4399l1164O170L1729k546m0436k4799J4843j7428L2452
8548c7118m2778k1799k8876K3957M4084M5176l1008l9573o3671l4322j8737L3833
8536a70832P7971N4197P5607n4973p2550Q2843O4655k8976k937J6714o327l795
8524C1597J491p040l8317m7333N5929M1386n9955J21754K3451l669L1532L1729
8512A82555K8781j57213j32213J5588r1128K8708J22422l692r7196J33224P9838
$$ plain form
8501 109674 54077 -29231 -42393 8421 68054 99742 133729 141678 161720 212567 244534 231722
8489 231722 200196 173358 135767 107010 45688 42144 86938 116679 133804 95428 63737 44793
8477 44793 52343 81880 -26782 19828 33003 43321 128805 126977 159623 92979 -6003 -84662
8465 -84662 -99318 -77775 -60074 6105 160312 170559 40285 11498 35225 56411 160026
8454 160026 200654 191892 168748 228187 201564 148724 225298 282444 228112 189487 254139 316125
8442 316125 378022 333088 288603 288534 277115 324809 371308 354486 282312 237020 271997 278978
8430 278978 305273 168872 171557 209983 190711 144634 83020 57835 113559 196708 188611 210228
8418 210228 260372 264909 244234 206924 244142 218363 235815 165159 100935 72812 101706 109380
$$ packed form
8501A09674n5597q3308j3162N0814N9633L1688L3987P949K0042N0847L1967j2812
8489B31722l1526k6838l7591k8757o1322l544M4794K9741J7125l8376l1691j8944
8477D4793P550K9537j08662M6610J3175J0318Q5484j828L2646o6644r8982p8659
8465h4662j4656K1543J7701O6179J54207J0247j30274k8787K3727K1186J03615
8454A60026M0628q762k3144N9439k6623n2840P6574N7146n4332l8625O4652O1986
8442C16125O1897m4934m4485o9j1419M7694M6499j6822p2174m5292L4977O981
8430B78978K6295j36401K685L8426j9272m6077o1614k5185N5724Q3149q097K1617
8418B10228N0144M537k0675l7310L7218k5779J7452p0656o4224k8123K8894P674
$$ plain form
8406 109380 13794 92470 178682 300685 307228 275077 238463 237285 375077 403345 381772 382237
8394 382237 352798 305365 308093 373817 396973 267261 96077 91845 123053 184165 184431 137548
8382 137548 243210 223169 184969 217550 122717 104474 152420 203541 182992 158708 182313
8371 182313 176496 119697 7638 -3133 3106 97616 133463 198019 213782 323443 381375 351898
8359 351898 324623 276607 232588 352377 460747 448689 403960 296275 206091 299606 331358
8348 331358 393784 399785 362120 330365 328355 265507 151771 177531 211754 178625 155543 123201
8336 123201 173108 245593 286325 252834 106880 85642 118620 115845 84811 67574 79475 80344
8324 80344 118842 157119 289185 232262 154230 207689 241742 235336 266439 287146 172302 115080
$$ packed form
8406A09380r5586P8676Q6212J22003O543l2151l6614j178J37792K8268k1573M65
8394C82237k9439m7433K728O5724K3156j29712j71184m232L1208O1112K66m6883
8382A37548J05662k0041l8200L2581r4833j8243M7946N1121k0549k4284K3605
8371A82313n817n6799j12059j0771O239R4510L5847O4556J5763J09661N7932k9477
8359C51898k7275m8016m4019J19789J08370j2058m4729j07685r0184R3515L1752
8348C31358O2426O001l7665l1755k010o2848j13736K5760L4223l3129k3082l2342
8336A23201M9907P2485M0732l3491j45954k1238L2978k775l1034j7237J1901Q69
8324H0344L8498L8277J32066n6923p8032N3459L4053o406L1103K0707j14844n7222
$$ plain form
8312 115080 108364 152184 184190 134695 112162 119159 53272 48593 108399 150927 54286 42724
8300 42724 123410 121384 110075 83382 84569 57635 34298 25862 14733 -2747 46569 80796
8288 80796 70423 2156 -46021 -38603 6806 56553 76753 104626 66874 36239 38775 27300
8276 27300 -30331 -58631 -84166 -91708 -22654 1138 -29351 -33159 -6590 -60083 -42838 -5524
8264 -5524 17697 9376 -28488 844 56639 -25331 27336 -40970 -7654 33381 5441 -104376
8252 -104376 -118123 -22118 40199 -68355 -112531 -91 82632 -38387 -26874 79527 91914
8241 91914 23034 -49847 -45003 -30444 3089 -5961 -19039 -15085 -14959 -58376 -97591 -70934 -64464
8228 -64464 -77252 -171162 -150117 -124741 -76335 -98660 -135261 -176217 -140272 -32170 94472
$$ packed form
8312A15080o716M3820L2006m9495k2533O997o5887m679N9806M2528r6641j1562
8300D2724Q0686k026j1309k6693J187k6934k3337q436j1129j7480M9316L4227
8288H0796j0373o8267m8177P418M5409M9747K0200K7873l7752l0635K536j1475
8276B7300n7631k8300k5535p542O9054K3792l0489l808K6569n3493J7245L7314
8264e524K3221q321l7864K9332N5795q1970N2667o8306L3316M1035k7940j09817
8252a04376j3747R6005O2317j08554m4176J12440Q2723j21019J1513J06401J2387
8241I1914o8880p2881M844J4559L3533r050j3078L954J26m3417l9215K6657O470
8228f4464j2788r3910K1045K5376M8406k2325l6601m0956L5945J08102J26642
$$ plain form
8217 94472 71191 11981 -5967 30785 60273 45228 76534 60178 51862 -5249 -34608 -43306
8205 -43306 -11536 -37846 -33512 -13051 -44278 -685 52671 71158 76447 -5671 4459 67662
8193 67662 122220 83850 34810 34845 28867 18294 -48788 -49978 -137283 -159568 -137866 -27505 101872
8180 101872 47529 64105 107123 128022 45357 33257 29136 49188 52426 -24169 -42053 -54690
8168 -54690 -62267 -68280 -40992 -26460 -15498 -12516 12620 -58289 -79215 -39210 11572 37401
8156 37401 -9815 -185652 -226957 -176651 -155443 -108536 -125601 -97643 -37531 -73049 -27362 77963
8144 77963 78529 89983 89423 67546 -38073 -27161 -5282 24965 1234 64154 162955 128752
8132 128752 117420 113603 130046 119770 67814 -25231 -60072 -44410 -52524 -50925 -24262 19812
$$ packed form
8217I4472k3281n9210j7948L6752K9488j5045L1306j6356q316n7111k9359q698
8205d3306L1770k6310M334K0461l1227M3593N3356J8487N289q2118J0130O3203
8193F7662N4558l8370m9040L5n978j0573o7082j190q7305k2285K1702J10361J29377
8180A01872n4343J6576M3018K0899q2665j2100m121K0052L238p6595j7884j2637
8168e4690p577o013K7288J4532J0962K982K5136p0909k0926M0005N0782K5829
8156C7401m7216j75837m1305N0306K1208M6907j7065K7958O0112l5518M5687J05325
8144G7963N66J1454n60k1877j05619J0912K1879L0247k3731O2920R8801l4203
8132A28752j1332l817J6443j0276n1956r3045l4841J5662q114J599K6663M4074
$$ plain form
8120 19812 6659 -53626 -71557 -7156 19796 -54061 -128235 -160165 -148848 -153975 -150569 -137576
8108 -137576 -170635 -137329 -75217 -27834 -77551 -4965 31474 9326 -51595 -67785 -54221 -52939
8096 -52939 -40258 -76346 24143 46719 24725 96482 92665 66416 98389 -418 -9967 36105
8084 36105 100040 86309 134816 125935 40206 29042 -41891 -100836 -82316 -9093 -38253 -11727
8072 -11727 106502 67662 -29837 -39038 -12574 -87491 -33875 -8430 -47053 -94290 -57721 -98611
8060 -98611 -114379 -89987 -67303 -30829 4891 19243 58700 40561 437 -36648 -37088 40407
8048 40407 87377 33147 -11463 103502 139304 92087 107179 70058 52898 69292 15928 29494
8036 29494 -40949 -35318 -32178 44000 42752 38319 55203 15264 -59986 -42987 5037 -1700 17981
$$ packed form
8120A9812j3153o0285j7931O4401K6952p3857p4174l1930J1317n127L406J2993
8108a37576l3059L3306O2112M7383m9717P2586L6439k2148o0921j6190J3564J282
8096e2939J2681l6088J00489K2576k1994P1757l817k6249L1973r8807r549M6072
8084C6105O3935j3731M8507q881q5729j1164p0933n8945J8520P3223k9160K6526
8072a1727J18229l8840r7499r201K6464p4917N3616K5445l8623m7237L6569m0890
8060i8611j5768K4392K2684L6474L5720J4352L9457j8139m0124l7085m40P7495
8048D0407M6970n4230m4610J14965L5802m7217J5092l7121j7160J6394n3364J3566
8036B9494p0443N631L140P6178j248m433J6884l9939p5250J6999M8024o737J9681
$$ plain form
8023 17981 73129 45598 42499 13083 -3665 79359 39236 -16945 -22243 -24634 6538 42671
8011 42671 110955 74384 76570 68351 69739 -17150 -96262 -28457 4027 -26986 -49248 37903
7999 37903 103247 112901 99552 29782 6269 -8373 31817 43602 -571 11604 56740 61934
7987 61934 79249 68796 -6966 46161 120113 140808 138556 33326 18731 91850 140185 111307
7975 111307 157796 148592 113523 37344 -4938 68545 130774 154765 112806 39143 -18100 -18408
7963 -18408 1472 43065 -4755 -23166 -8200 -77012 -63968 -81082 -65202 -34692 46150 132291
7951 132291 105621 23825 17106 42324 -13608 -92058 -48310 42377 76682 77249 -13982 -52686
7939 -52686 -24948 22653 88867 98844 35958 -15940 8407 86599 48210 43979 29737 28189
$$ packed form
8023A7981N5148k7531l099k9416j6748Q3024m0123n6181n298k391L1172L6133
8011D2671O8284l6571K186q219J388q6889p9112O7805L2484l1013k2262Q7151
7999C7903O5344R654j3349o9770k3513j4642M0190J1785m4173J2175M5136N194
7987F1934J7315j0453p5762N3127P3952K0695k252j05230j4595P3119M8335k8878
7975A11307M6489r204l5069p6179m2282P3483O2229K3991m1959p3663n7243l08
7963a8408J9880M1593m7820j8411J4966o8812J3044j7114J5880L0510Q0842Q6141
7951A32291k6670q1796o719K5218n5932p8450M3748R0687L4305N67r1231l8704
7939e2686K7738M7601O6214R977o2886n1898K4347P8192l8389m231j4242j548
$$ plain form
7927 28189 51133 63114 12803 -39918 -128436 -38653 35887 -44497 -197774 -124601 -99054 -68026
7915 -68026 -32687 -50273 58185 106659 27217 30268 65540 67025 38585 -18144 85263 154965
7903 154965 36146 -73408 -150873 -124068 -80572 40555 16866 -29247 -25552 -10057 -70644
7892 -70644 -88164 -20621 -83013 -96563 -46343 9960 5181 33521 54990 80002 37320 39418
7880 39418 58969 52482 99484 43994 43701 59360 131677 158463 203793 233544 205019 91996
7868 91996 97318 106698 -14616 16773 64937 -84145 -102807 -89635 -70559 19884 21918 25527
7856 25527 6958 54534 85958 112138 81247 110861 175415 305951 348437 374026 438908 454187
7844 454187 446388 520964 573291 538803 483562 418426 355385 327246 244928 235330 269402 230408
$$ packed form
7927B8189K2944J1981n0311n2721q8518Q9783P4540q0384j53277P3173K5547L1028
7915f8026L5339j7586J08458M8474p9442L051L5272J485k8440n6729J03407O9702
7903A54965j18819j09554p7465K6805M3496J21127k3689m6113L695J5495o0587
7892g0644j7520O7543o2392j3550N0220N6303m779K8340K1469K5012m2682K098
7880C9418J9551o487M7002n5490k93J5659P2317K6786M5330K9751k8525j13023
7868I1996N322R380j21314L1389M8164j49082j8662J3172J9076R0443K034L609
7856B5527j8569M7576L1424K6180l0891K9614O4554J30536M2486K5589O4882J5279
7844D54187p799P4576N2327l4488n5241o5136o3041k8139q2318r598L4072l8994
$$ plain form
7832 230408 187681 162448 163928 165606 132201 177089 180074 164827 197308 281798 301730 223492
7820 223492 128334 131367 136138 107635 112676 159126 131704 154563 194634 260461 246763 173147
7808 173147 130720 161452 173009 174636 258831 287728 378117 571930 808448 913455 993454
7797 993454 1110931 1146477 1078790 1005035 800903 595903 473022 454063 421011 361260 278373
7786 278373 277529 243417 215080 221000 211972 268954 274099 297459 325690 329202 330460 307380 353751
7773 353751 340861 365242 364594 313527 332474 365081 361274 304921 311637 234262 188461 200555
7761 200555 213529 266831 303206 337199 281393 272371 309804 323473 282567 374883 486637 509810
7749 509810 512912 534146 412604 292910 279952 224112 270370 265297 301835 340363 301239 270110
$$ packed form
7832B30408m2727k5233J480J678l3405M4888K985j5247L2481Q4490J9932p8238
7820B23492r5158L033M771k8503N041M6450k7422K2859M0071O5827j3698p3616
7808A73147m2427L0732J1557J627Q4195K8897R0389J93813K36518J05007P9999
7797I93454J17477L5546o7687p3755k04132k05000j22881j8959l3052n9751q2887
7786B78373q44l4112k8337N920r028N6982N145K3360K8231L512J258k3080M6371
7773C53751j2890K4381o48n1067J8947L2607l807n6353O716p7375m5801J2094
7761B00555J2974N3302L6375L3993n5806r022L7433J3669m0906R2316J11754K3173
7749E09810L102K1234j21542j19694j2958n5840M6258n073L6538L8528l9124l1129
$$ plain form
7737 270110 271959 258556 238426 231895 198061 140402 177055 213117 180219 113512 49539 -21203
7725 -21203 18645 137524 177067 183275 126585 120491 92749 -31758 7583 11406 22247 10037
7713 10037 11667 20577 -14085 -48956 -41118 8029 51422 20990 -26611 13123 76151 106921
7701 106921 78113 42012 23411 84173 120664 98943 170940 129215 92224 52222 49221 20469
7689 20469 -30009 -36971 -48931 -118285 -158321 -17692 56363 67430 95040 79281 39304 -5594
7677 -5594 28451 23934 36151 -26930 34419 99569 82069 49735 7763 7453 -52302 -76492 -43288
7664 -43288 -66242 -30104 5623 -33837 -64455 -55801 -83117 -110025 -177136 -131062 -81304 14841
7652 14841 -5937 -30142 -3141 34845 79331 77548 -2836 37288 12600 -113545 -124716 -3019
$$ packed form
7737B70110J849j3403k0130o531l3834n7659L6653L6062l2898o6707o3973p0742
7725b1203L9848J18879L9543O208n6690o094k7742j24507L9341L823J0841j2210
7713A0037J630Q910l4662l4871P838M9147M3393l0432m7601L9734O3028L0770
7701A06921k8808l6101j8601O0762L6491k1721P1997m1725l6991m0002l001k8752
7689B0469n0478o962j1960o9354m0036J40629P4055J1067K7610j5759l9977m4898
7677e594L4045m517J2217o3081O1349O5150j7500l2334m1972l10n9755k4190L3204
7664d3288k2954L6138L5727l9460l0618Q654k7316k6908o7111M6074M9758R6145
7652A4841k0778k4205K7001L7986M4486j783q0384M0124k4688j26145j1171J21697
$$ plain form
7640 -3019 42900 12201 22697 53154 49832 -11763 -42233 -40136 -40518 -51581 -59014 -51908 -20847
7627 -20847 -70605 -58729 -42953 2304 58662 46625 -65610 -44427 10041 10880 -17146 -7314
7615 -7314 11409 -20390 -17106 -52861 -23406 28028 13433 -74645 -103640 -77605 -18745 -15440
7603 -15440 -78312 -45361 14096 -39917 -34599 40425 23135 56044 80342 96624 105364 125697
7591 125697 69750 -32395 -92450 -108773 -26360 71273 20056 -74952 -9663 58037 90585
7580 90585 96907 58236 -18988 10805 41545 37258 -43103 -23880 -10830 -63788 -57471 -21455
7568 -21455 -49593 -48044 -52117 -92305 -30351 -7895 42931 14368 55173 -9899 -77397 -54597
7556 -54597 -79146 -75202 -48572 -57899 -3767 -30545 -67014 -45989 -49469 -113714 -133741 -124697 -56638
$$ packed form
7640c019M5919l0699J0496L0457l322o1595l0470K097l82j1063p433P106L1061
7627b0847m9758J1876J5776M5257N6358j2037j12235K1183N4468Q39k8026R832
7615g314J8723l1799L284l5755K9455N1434j4595q8078k8995K6035N8860L305
7603a5440o2872L2951N9457n4013N318P5024j7290L2909K4298J6282Q740K0333
7591A25697n5947j02145o0055j6323Q2413R7633n1217r5008O5289O7700L2548
7580I0585O322l8671p7224K9793L0740m287q0361J9223J3050n2958O317L6016
7568b1455k8138J549m073m0188O1954K2456N0826k8563M0805o5072o7498K2800
7556e4597k4549L944K6630r327N4132k6778l6469K1025l480o4245k0027R044O8059
$$ plain form
7543 -56638 -24541 -47801 -43327 -59334 -111159 -74156 -113154 -90411 -6728 11996 -25325 -66621
7531 -66621 -115696 -69661 -46442 -88246 -88302 -81911 -116176 -105710 5241 26415 -105586 -164559
7519 -164559 -159795 -93389 -82802 -116477 -101420 -126149 -183456 -125283 -116818 -120401 -59807 -33131
7507 -33131 -29228 -66167 -85088 1259 33207 15772 -2021 -35118 -38580 24302 15375 -33222
7495 -33222 -87886 -28826 -13566 52983 -13841 -99322 -88106 -27422 -30760 26141 61741 69581
7483 69581 43644 -49952 -95547 -71851 23515 42884 -15698 -10496 46500 43951 -84471 -126669
7471 -126669 -110940 -68123 -43054 33285 82878 12943 7873 -3408 -38220 -144434 -119217 -95718
7459 -95718 -57831 -61594 -72803 7224 1070 -19486 -48024 -11862 -41319 -49297 -71308 -6586
$$ packed form
7543e6638L2097k3260M474j6007n1825L7003l8998K2743Q3683J8724l7321m1296
7531f6621m9075M6035K3219m1804n6O391l4265J0466J10951K1174j32001n8973
7519a64559M764O6406J0587l3675J5057k4729n7307N8173Q465l583O0594K6676
7507c3131L903l6939j8921Q6347L1948j7435j7793l3097l462O2882q927m8597
7495c3222n4664N9060J5260O6549o6824q5481J1216O0684l338N6901L5600P840
7483F9581k5937r3596m5595K3696R5366J9369n8582N202N6996k549j28422m2198
7471a26669J5729M2817K5069P6339M9593o9935n070j1281l4812j06214K5217K3499
7459i5718L7887l763j1209Q0027o154k0556k8538L6162k9457p978k2011O4722
$$ plain form
7447 -6586 2683 30945 -56270 -170635 -226087 -157677 -81945 -51824 -100935 -105208 -157997 -120150
7435 -120150 -96355 -99322 -74386 -1566 48808 38924 -30532 -58754 -29999 114569 109420 95636
7423 95636 87374 80106 68174 -4887 -54073 -34102 16944 -3744 -29319 -119592 -126180 -13010
7411 -13010 23663 31288 9171 -42678 -70881 -9521 -21144 18646 30140 -15552 -45489 -52800
7399 -52800 -55344 -5452 64580 19046 25459 100282 26685 -53446 -93907 -124711 -80213 -18626
7387 -18626 28334 45451 42707 35498 52271 24422 84718 28099 11811 -22743 -140959 -116305
7375 -116305 -58564 -63207 -42110 -40727 -137528 -206053 -218373 -260041 -189756 -110351 -146377 -104583
7363 -104583 -89283 -63887 28935 -57400 -184434 -110188 16085 57522 -55263 -134689 -147645
$$ packed form
7447f586R269K8262q7215j14365n5452O8410P5732L0121m9111m273n2789L7847
7435a20150K3795k967K4936P2820N0374r884o9456k8222K8755J44568n149j3784
7423I5636q262p268j1932p3061m9186J9971N1046k0688k5575r0273o588J13170
7411a3010L6673P625k2117n1849k8203O1360j1623L9790J1494m5692k9937p311
7399e2800k544M9892P0032m5534O413P4823p3597q0131m0461l0804M4498O1587
7387a8626M6960J7117k744p209J6773k7849O0296n6619j6288l4554j18216K4654
7375a16305N7741m643K1097J383r6801o8525j2320m1668P0285P9405l6026M1794
7363a04583J5300K5396R2822q6335j27034P4246J26273M1437j12785p9426j2956
$$ plain form
7352 -147645 -70129 -38132 18644 -9982 -33347 -51513 -18060 -47682 -99091 -147570 -64262 -86158
7340 -86158 -15888 25368 -1341 -45290 -34063 39236 12943 -66388 -9497 121710 129130 97913
7328 97913 41769 -18700 -43473 -67256 -35355 -77191 -47183 -13980 -5336 -45004 -122939 -75150
7316 -75150 28564 42303 14410 8872 -35886 -70370 -139373 -206936 -181088 -101444 -108535 -163344
7304 -163344 -136963 -141021 -124598 -128308 -108949 -75596 -36802 -12595 -17491 -38197 -23554 -18570
7292 -18570 21975 23821 46101 -61702 -61974 -4334 -58356 -75274 6446 9775 -11448 -29183
7280 -29183 -99144 -155661 -222892 -130569 20859 -17122 -124264 -163641 -102309 -84642 -50028
7269 -50028 21164 -31656 -43976 -98446 -104441 -53728 -58819 -21873 125498 113964 58047 9930
$$ packed form
7352a47645P7516L1997N6776k8626k3365j8166L3453k9622n1409m8479Q3308k1896
7340h6158P0270M1256k6709m3949J1227P3299k6293p9331N6891J31207P420l1217
7328I7913n6144o0469k4773k3783L1901m1836L0008L3203Q644l9668p7935M7789
7316g5150J03714J3739k7893n538m4758l4484o9003o7563K5848P9644p091n4809
7304a63344K6381m058J6423l710J9359L3353L8794K4207m896k0706J4643M984
7292a8570M0545J846K2280j07803k72N7640n4022j6918Q1720L329k1223j7735
7280b9183o9961n6517o7231R2323J51428l7981j07142l9377O1332J7667L4614
7269e0028P1192n2820j2320n4470n995N0713n091L6946J47371j1534n5917m8117
$$ plain form
7257 9930 -33555 -66464 -70456 -124273 -144033 -62397 31816 17388 -18331 -26713 6399 33667
7245 33667 -10946 -135703 -152018 -63700 -44364 -38315 -4299 56255 34462 25222 91705 38408
7233 38408 28656 30461 61720 39589 28855 42447 30165 60872 -32756 -114637 -52323 36140
7221 36140 80527 141927 129002 35403 24951 61865 47575 125230 55534 -28582 -20839 19106
7209 19106 50783 -706 -89253 -102416 -72195 -96083 -182495 -124323 -37754 44727 14502 -18990
7197 -18990 -20036 19012 71111 88472 93765 23793 -74736 -129477 -43938 -8670 -14607 -10476 -47304
7184 -47304 20745 144189 91656 80079 46722 39898 26707 27490 65226 -31701 12824 1111
7172 1111 -66225 -42638 -119726 -179288 -147779 -116995 -36411 45658 15279 -25276 -30268 -7881
$$ packed form
7257I930m3485l2909l992n3817j9760Q1636R4213j4428l5719q382L3112K7268
7245C3667m4613j24757j6315Q8318J9336O049L4016O0554k1793r240O6483n3297
7233C8408r752J805L1259k2131j0734J3592j2282L0707r3628q1881O2314Q8463
7221C6140M4387O1400j2925r3599j0452L6914j4290P7655o9696q4116P743L9945
7209A9106L1677n1489q8547j3163L0221k3888q6412N8172Q6569Q2481l0225l3492
7197a8990j046L9048N2099J7361N293o9972r8529n4741Q5539L5268n937M131l6828
7184d7304O8049J23444n2533j1577l3357o824j3191P83L7736r6927M4525j1713
7172A111o7336K3587p7088n9562L1509L0784Q0584Q2069l0379m0555m992K2387
$$ plain form
7160 -7881 -2616 -26188 38725 88199 179295 148645 71554 30735 42859 39451 27384 -40586
7148 -40586 -47586 -109927 -66105 65551 135382 98977 68007 35701 21147 12507 -12071 -12600
7136 -12600 56248 93270 51512 94962 57769 -49698 -90878 -78862 -109927 -103677 19852 11694
7124 11694 -26916 -55927 -85084 -67702 -80798 -92222 -94694 -95022 -27404 -32313 8539 14723 20988
7111 20988 53765 75447 -10043 -15821 16665 73820 -6937 -101842 -135007 -156321 -153464 -145510
7099 -145510 -110216 -96679 -153858 -166989 -136104 -85532 -130140 -94727 -104152 -67417 7312 47690
7087 47690 30924 4025 -66614 -73267 -8141 15414 -53195 -89004 -91612 -153107 -148398 -146327 -139309
7074 -139309 -78754 28325 4557 -44569 -29233 4791 -3782 -41905 -64418 -85121 -2493 -85094
$$ packed form
7160g881N265k3572O4913M9474R1096l0650p7091m0819J2124l408j2067o7970
7148d0586p000o2341M3822J31656O9831l6405l0970l2306j4554q640k4578n29
7136a2600O8848L7022m1758M3450l7193j07467m1180J2016l1065O250J23529q158
7124A1694l8610k9011k9157J7382j3096j1424k472l28O7618m909M0852O184O265
7111B0988L2777K1682q5490n778L2486N7155q0757r4905l3165k1314K857P954
7099a45510L5294J3537n7179j3131L0885N0572m4608L5413r425L6735P4729M0378
7087D7690j6766k6899p0639o653O5126K3555o8609l5809k608o1495M709K071P018
7074a39309O0555J07079k3768m9126J5336L4024q573l8123k2513k0703Q2628q2601
$$ plain form
7062 -85094 -201069 -185931 -109156 -142631 -178590 -118478 -124025 -151848 -80861 -111241 -136533 -128509
7050 -128509 -101009 -32178 -116272 -111369 -47862 -27138 103270 229242 250464 151003 102223
7039 102223 81758 94034 97528 93759 56096 125730 115571 146247 106093 25886 -12834 11449
7027 11449 -27168 32798 45397 88223 97651 90286 29679 -26919 -147313 -95764 -45942 26402
7015 26402 -25157 -100382 -111435 -104684 -113791 -140326 -27898 3672 21077 81019 10521 -12519
7003 -12519 -55463 -67958 -32000 -36594 -59403 -78089 42962 109412 41380 -115023 -149920 -36280
6991 -36280 51511 122414 143173 138371 97343 89236 19715 -28632 -91870 -102559 -140540 -107116
6979 -107116 -116195 -142621 -96324 -18719 44289 26703 6367 -66394 -137822 -194219 -71618 -48901
$$ packed form
7062h5094j15975J5138P6775l3475l5959O0112n547k7823P0987l0380k5292Q024
7050a28509K7500O8831q4094M903O3507K0724J30408J25972K1222r9461m8780
7039A02223k0465J2276L494l769l7663O9634j0159L0676m0154q0207l8720K4283
7027A1449l8617N9966J2599M2826R428p365o0607n6598j20394N1549M9822P2344
7015B6402n1559p5225j1053O751r107k6535J12428L1570J7405N9942p0498k3040
7003a2519m2944j2495L5958m594k2809j8686J21051O6450o8032j56403l4897J13640
6991c6280Q7791P0903K0759m802m1028q107o9521m8347o3238j0689l7981L3424
6979a07116r079k6426M6297P7605O3008j7586k0336p2761p1428n6397J22601K2717
$$ plain form
6967 -48901 -105700 -29725 101521 80873 86637 48560 38604 57177 112661 73969 29659 -8065
6955 -8065 -614 -28897 -145116 -185967 -149186 -88429 -92176 -95169 -70090 -63717 -110153 -193606 -209230
6942 -209230 -181220 -120037 -147531 -239099 -298639 -207344 -174036 -35960 44845 38498 -8984 -10467
6930 -10467 27980 38159 48455 -79694 -117672 -154023 -101628 -12612 37529 -12113 -48339 -14595
6918 -14595 27270 14792 19981 16413 44125 111795 86336 -4578 12174 -7880 -40738 -47178
6906 -47178 -17805 -26774 -80271 -45218 34487 18203 -56412 -74068 -136581 -126801 -123922 -119880 -138512
6893 -138512 -118911 -52713 -86301 -43240 -66983 -81309 -34051 -11263 -24911 40754 47455 67166
6881 67166 83908 80783 88749 80468 33689 46878 43805 -80078 -120871 -127172 -95307 -31866 -11654
$$ packed form
6967d8901n6799P5975J31246k0648N764l8077r956J8573N5484l8692m4310l7724
6955h065P451k8283j16219m0851L6781O0757l747k993K5079O373m6436q3453j5624
6942b09230K8010O1183k7494r1568n9540R1295L3308J38076Q0805o347m7482j483
6930a0467L8447J0179J0296j28149l7978l6351N2395Q9016N0141m9642l6226L3744
6918a4595M1865j2478N189l568K7712O7670k5459r0914J6752k0054l2858o440
6906d7178K9373q969n3497L5053P9705j6284p4615j7656o2513R780K879M042j8632
6893a38512J9601O6198l3588M3061k3743j4326M7258K2788j3648O5665O701J9711
6881F7166J6742l125P966q281m6779J3189l073j23883m0793o301L1865O3441K0212
$$ plain form
6868 -11654 -49824 -56671 -38752 -76836 -131131 -149035 -136333 -99247 -61171 -8673 8524 -7525
6856 -7525 5153 61760 10847 -41851 -92872 -139357 -155909 -83071 59650 7266 -45984 -26412
6844 -26412 -68865 -19781 12943 51565 10960 -53935 -111735 -99649 -142847 -103697 -66380 -26275
6832 -26275 -40122 -33088 -9264 -137755 -157469 -180152 -193989 -103914 -39311 -17209 -27320 -73188
6820 -73188 -107249 -91765 4614 -57572 -166527 -184936 -275331 -310952 -265851 -203942 -152341 -65797
6808 -65797 -35906 -31364 11314 14129 -20466 7881 -1081 -18999 15133 -32453 -1851 19120
6796 19120 38031 21264 -59978 -18495 -1135 -21335 2012 -8829 27410 75666 80027 19666
6784 19666 -14739 -43237 -55058 -24458 -37355 -69688 -32201 -63989 -19166 47921 97166 52692
$$ packed form
6868a1654l8170o847J7919l8084n4295j7904J2702L7086L8076N2498J7197j6049
6856g525J2678N6607n0913n2698n1021m6485j6552P2838J42721n2384n3250J9572
6844b6412m2453M9084L2724L8622m0605o4895n7800J2086m3198L9150L7317M0105
6832b6275j3847P034K3824j28491j9714k2683j3837R0075O4603K2102j0111m5868
6820g3188l4061J5484R6379o2186j08955j8409r0395l5621M5101O1909N1601Q6544
6808f5797K9891M542M2678K815l4595K8347q962j7918L4132m7586L0602K0971
6796A9120J8911j6767q1242M1483J7360k0200K3347j0841L6239M8256M361o0361
6784A9666l4405k8498j1821L0600j2897l2333L7487l1788M4823O7087M9245m4474
$$ plain form
6772 52692 26775 101248 178149 162331 52962 -36748 -88896 -100802 -110845 -96813 -63712 13203
6760 13203 509 -56765 -48492 2367 7940 36010 123947 135341 149128 96718 47123 53060
6748 53060 67896 167558 119364 105589 163352 123355 23887 -20467 -66764 -23809 37211 -35967
6736 -35967 10789 52926 6966 -38094 -2567 43937 -73990 -77731 -33454 -60316 -79331 -42875
6724 -42875 -38056 -60173 -18809 -20862 -82610 -156327 -142624 -91517 46004 121077 129365 147942
6712 147942 129899 133714 56179 -12507 -30961 -12773 -11915 -55451 -159182 -162673 -58234 -37839
6700 -37839 -112979 -72770 -41669 -26557 -133577 -146618 -160740 -114502 -64101 -1582 5641 56177
6688 56177 31164 -41648 -103699 -52706 47748 24922 -19642 -6936 25809 82070 62522 50299
$$ packed form
6772E2692k5917P4473P6901j5818j09369q9710n2148j1906j0043J4032L3101P6915
6760A3203j2694n7274Q273N0859N573K8070Q7937J1394J3787n2410m9595N937
6748E3060J4836R9662m8194j3775N7763l9997r9468m4354m6297M2955O1020p3178
6736c5967M6756M2137m5960m5060L5527M6504j17927l741M4277k6862j9015L6456
6724d2875M819k2117M1364k053o1748p3717J3703N1107J37521P5073Q288J8577
6712A47942j8043L815p7535o8686j8454J8188Q58m3536j03731l491J04439K0395
6700c7839p5140M0209L1101J5112j07020j3041j4122M6238N0401O2519P223N0536
6688E6177k5013p2812o2051N0993J00454k2826m4564J2706L2745N6261j9548j2223
$$ plain form
6676 50299 117969 103299 159668 190745 116249 69103 -18778 -44825 -15298 -20742 57442 59474
6664 59474 -17982 -38956 -63523 -19377 87016 157341 78953 36469 4154 -4249 49862 61750
6652 61750 151140 153731 111417 102338 31934 -5950 32106 44635 21805 21595 -32992 -31979 -31143
6639 -31143 -88552 -51917 -38401 -53754 -86682 -119750 -126903 -123268 -152361 -164399 -142696 -134227
6627 -134227 -182489 -124505 -130931 -150099 -100484 -48147 -13242 -36457 -109793 -66264 20267 -47093
6615 -47093 -72436 -33296 -54895 -34445 -58097 -64842 -94714 -62689 -6259 -28113 -74499 -181254
6603 -181254 -225541 -123869 -50231 -2471 66424 111040 4834 -107246 -59802 18972 53677
6592 53677 64886 -8902 -34362 -23191 -45981 -40111 60308 99636 -11303 -76513 -99921 -108270
$$ packed form
6676E0299O7670j4670N6369L1077p4496m7146q7881k6047K9527n444P8184K032
6664E9474p7456k0974k4567M4146J06393P0325p8388m2484l2315q403N4111J1888
6652F1750Q9390K591m2314r079p0404l7884L8056J2529k2830k10n4587J013Q36
6639c1143n7409L6635J3516j5353l2928l3068p153L635k9093j2038K1703Q469
6627a34227m8262N7984o426j9168M9615N2337L4905k3215p3336M3529Q6531o7360
6615d7093k5343L9140k1599K0450k3652o745k9872L2025N6430k1854m6386j06755
6603a81254m4287J01672P3638M7760O8895M4616j06206j12080M7444P8774L4705
6592E3677J1209p3788k5460J1171k2790N870J00419L9328j10939o5210k3408q349
$$ plain form
6580 -108270 -79837 -76032 47359 53890 42830 123647 85724 16371 74301 87193 105294 123315
6568 123315 102201 89592 63087 -6564 4371 23904 -13576 23008 119612 117996 38524 54831
6556 54831 10447 -62808 -53468 -46535 23266 84299 13662 -105920 -127623 -184925 -168500 -124011
6544 -124011 -136670 -231643 -145994 -61206 -38860 -29104 2172 149279 173482 64749 72425 56103
6532 56103 45994 38131 -43767 -102952 -80009 -3214 69771 102120 74896 -23732 -64202 -21211
6520 -21211 29216 -22069 -38495 21977 78335 64097 -12223 -82658 -53908 -82542 -103091 -26733
6508 -26733 -39626 -26782 50402 60944 -7317 -67749 -66608 -65167 -64821 -20052 -32774 -51286 -49679
6495 -49679 -152820 -249901 -111272 -22611 -6840 -42491 -57980 -102478 -79851 -125871 -169928
$$ packed form
6580a08270K8433L805J23391O531j1060Q0817l7923o9353N7930J2892J8101J8021
6568A23315k1114j2609k6505o9651J0935J9533l7480L6584R6604j616p9472J6307
6556E4831m4384p3255R340O933O9801O1033p0637j19582k1703n7302J6425M4489
6544a24011j2659r4973Q5649Q4788K2346R756L1276J47107K4203j08733P676j6322
6532E6103j0109p863q1898n9185K2943P6795P2985L2349k7224r8628m0470M2991
6520b1211N0427n1285j6426O0472N6358j4238p6320p0435K8750k8634k0549P6358
6508b6733j2893J2844P7184J0542o8261o0432J141J441L46M4769j2722j8512J607
6495d9679j03141r7081J38629Q8661J5771l5651j5489m4498K2627m6020m4057
$$ plain form
6484 -169928 -122004 -33890 -6507 -88093 -145115 -155627 -159726 -109185 -46808 -6664 -50929 7810
6472 7810 38605 -27873 -114000 -240164 -285584 -241805 -162068 -69849 -60158 -74238 -34696 37647
6460 37647 95329 108437 106624 45116 70226 57143 34903 -22374 -6214 2267 23712 12813
6448 12813 -12712 -30585 -59575 -70936 -7102 7573 -63224 -83853 -74117 7 -15072 57032
6436 57032 101932 27372 -35080 -21853 24107 2175 -1985 -31015 -74634 -79151 -65617 -34943
6424 -34943 -44566 -31490 -30387 -23496 -55088 -670 58738 53703 8248 -25320 -92870 -117064 -136768
6411 -136768 -40575 15582 71748 63432 5572 -26194 104839 118989 117923 109853 80801 35705
6399 35705 -6814 5153 54614 21998 35168 31155 -29701 -110004 -72200 -35466 -42350 -68987
$$ packed form
6484a69928M7924Q8114K7383q1586n7022j0512m099N0541O2377M0144m4265N8739
6472G810L0795o6478q6127j26164m5420M3779P9737R2219R691j4080L9542P2343
6460C7647N7682J3108j813o1508K5110j3083k2240n7277J6160Q481K1445j0899
6448A2813k5525j7873k8990j1361O3834J4675p0797k0629R736P4124j5079P2104
6436E7032M4900p4560o2452J3227M5960k1932m160k9030m3619m517J3534L0674
6424c4943r623J3076J103O891l1592N4418N9408n035m5455l3568o7550k4194j9704
6411a36768R6193N6157N6166q316n7860l1766J31033J4150j066q070k9052m5096
6399C5705m2519J1967M9461l2616J3170m013o0856q0303L7804L6734o884k6637
$$ plain form
6387 -68987 -98057 3434 19064 35035 -39467 -37884 13509 18024 -44564 -62070 -61074 -74843
6375 -74843 -137187 -130084 -86844 -100084 -161417 -169342 -97729 -104689 -73136 -65854 -43984 -4091 23960
6362 23960 3206 26718 51439 49445 37046 35820 19802 -38966 27390 21611 29659 33828 -14849
6349 -14849 40520 70042 96869 131775 81590 8482 8302 -15552 -65582 -90774 -114584 -126316
6337 -126316 -130216 -95157 -157020 -131485 -86054 -6687 -59226 -73420 -91667 -87932 -82906 -114493
6325 -114493 -87746 39429 55368 8614 15846 -34399 -73001 -64041 -45763 -64405 -81796 -89485
6313 -89485 -95105 -74837 -67653 -79761 -120229 -107774 -19709 25592 -12007 -72005 -37669 91952
6301 91952 166499 196015 166224 109711 62884 21691 -1296 -13828 50532 112120 126920 41977
$$ packed form
6387f8987k9070J01491J5630J5971p4502J583N1393M515o2588j7506R96j3769
6375g4843o2344P103M3240j3240o1333p925P1613o960L1553P282K1870L9893K8051
6362B3960k0754K3512K4721j994j2399j226j6018n8768O6356n779Q048M169m8677
6349a4849N5369K9522K6827L4906n0185p3108j80k3854n0030k5192k3810j1732
6337a26316l900L5059o1863K5535M5431P9367n2539j4194j8247L735N026l1587
6325a14493K6747J27175J5939m6754P232n0245l8602Q960J8278j8642j7391p689
6313h9485n620K0268P184j2108m0468J2455Q8065M5301l7599n9998L4336J29621
6301I1952P4547K9516k9791n6513m6827m1193k2987j2532O4360O1588J4800q4943
$$ plain form
6289 41977 -7587 6862 -31933 19199 46555 114111 110056 10397 -64693 -66310 -27226 -9626
6277 -9626 7616 -22910 -63379 -2066 -55709 -146448 -107004 -28351 73763 76864 -46792 -26401
6265 -26401 94057 102072 93398 64896 93414 31406 -15060 -92640 -122615 -81228 -61487 -63703
6253 -63703 -25136 -80412 -136743 -101770 16881 -10771 -52002 -51927 -28721 22924 78226 87431
6241 87431 98856 50727 26828 55542 116670 17445 1242 94702 80288 58792 26658 73689
6229 73689 60468 22570 -40751 -113115 -146301 -100283 -83909 -11439 21424 21563 6969 -91778
6217 -91778 -162889 -217582 -196113 -102740 -10430 41199 23643 -14783 -65538 -133808 -177081 -183562
6205 -183562 -140176 -45063 -60695 -35769 -27247 14630 104504 86101 80719 -29758 -86439 -75751
$$ packed form
6289D1977m9564J4449l8795N1132K7356O7556m055r9659p5090j617L9084J7600
6277i626J7242l0526m0469O1313n3643r0739L9444P8653J02114L101j23656K0391
6265b6401J20458Q015q674k8502K8518o2008m6466p7580k9975M1387J9741k216
6253f3703L8567n5276n6331L4973J18651k7652m1231P5K3206N1645N5302R205
6241H7431J1425m8129k3899K8714O1128r9225j6203R3460j4414k1496l2134M7031
6229G3689j3221l7898o3321p2364l3186M6018J6374P2470L2863J39j4594r8747
6217i1778p1111n4693K1469R3373R2310N1629j7556l8426n0755o8270m3273o481
6205a83562M3386R5113j5632K4926Q522M1877Q9874j8403n382j10477n6681J0688
$$ plain form
6193 -75751 -15710 -65885 -110409 -62723 -80860 -9140 94396 138755 84387 40851 71027 21530
6181 21530 -66380 -71388 -149015 -178985 -170331 -117035 -66492 -147773 -116169 34299 27615 34477
6169 34477 284 -56118 -91991 -82311 -71212 -178035 -196979 -135063 -91355 -62173 -53843 9690
6157 9690 18373 13371 8636 -3841 -25670 -31841 -61967 -79185 -21178 14740 -16470 -52127 -34514
6144 -34514 9521 -3139 -51897 -96765 -62395 -52671 -135256 -173038 -123686 -115468 -192749 -220624
6132 -220624 -183556 -172848 -154987 -170285 -180617 -86456 -58511 -9595 55744 125224 111410 50065
6120 50065 -2438 -12547 30257 -20973 -99891 -132687 -136698 -139701 -113261 -109772 -99074 -55586
6108 -55586 46776 18509 62877 85058 2838 -69219 14248 74726 1647 -49854 5201 57193
$$ packed form
6193g5751O0041n0175m4524M7686j8137P1720J03536M4359n4368m3536L0176m9497
6181B1530q7910n008p7627k9970Q654N3296N0543q1281L1604J50468o684O862
6169C4477l4193n6402l5873R680J1099j06823j8944O1916M3708K9182Q330O3533
6157I690Q683n002m735j2477k1829o171l0126j7218N8007L5918l1210l5657J7613
6144c4514M4035j2660m8758m4868L4370R724q2585l7782M9352Q218p7281k7875
6132b20624L7068J0708J7861j5298j0332R4161K7945M8916O5339O9480j3814o1345
6120E0065n2503j0109M2804n1230p8918l2796m011l003K6440L489J0698M3488
6108e5586J02362k8267M4368K2181q2220p2057Q3467O0478p3079n1501N5055N1992
$$ plain form
6096 57193 164562 69815 -73057 47440 70670 54261 84885 84033 54007 17987 674 106628
6084 106628 117043 51606 2727 -17096 7032 -68429 -38944 57260 29534 38953 27691 -45292
6072 -45292 -92488 -7619 -30578 -34339 -101007 -150109 -144252 -75602 89172 46962 -32439 -58639
6060 -58639 -38667 26937 31966 -40169 -54913 16734 -55913 -9469 -15109 -64317 -15861 16722
6048 16722 -43697 -45597 -59232 -44393 23793 27147 -24394 -45739 -43526 19780 43399 -36359
6036 -36359 -53478 -64460 -53719 -61948 5337 93752 127116 122284 30884 -5879 -56571 -143642
6024 -143642 -207171 -160911 -110084 -89666 -14006 -5662 -56142 -36869 7866 62277 48820 -16191
6012 -16191 -68417 -57227 -30800 -26561 76044 -58802 -121027 -66957 -92383 -154193 -64599 15716
$$ packed form
6096E7193J07369r4747j42872J20497K3230j6409L0624q52l0026l6020j7313J05954
6084A06628J0415o5437m8879j9823K4128p5461K9485R6204k7726R419j1262p2983
6072d5292m7196Q4869k2959l761o6668m9102N857O8650J64774m2210p9401k6200
6060e8639J9972O5604N029p2135j4744P1647p2647M6444n640m9208M8456L2583
6048A6722o0419j900j3635J4839O8186L354n1541k1345K213O3306K3619p9758
6036c6359j7119j0982J0741q229O7285Q8415L3364m832r1400l6763n0692q7071
6024a43642o3529M6260N0827K0418P5660Q344n0480J9273M4735N4411j3457o5011
6012a6191n2226J1190K6427M239J02605j34846o2225N4070k5426o1810Q9594Q0315
$$ plain form
6000 15716 -119647 -164230 -95407 -115923 -139496 -132092 -52273 -31470 -102309 -90599 -98700 -101123
5988 -101123 18904 67965 135523 198702 217143 116001 5365 62369 72193 41625 3303
5977 3303 -16549 -75438 -90770 19624 10433 -15013 -14133 55971 81872 49572 72213 48185
5965 48185 -20357 -39728 -75664 -55791 -8111 -14040 -22294 -103654 -154971 -173531 -166032 -98984
5953 -98984 -99465 -38150 -82096 -130374 -134239 -38124 33292 29639 14663 66798 34513 -11843 23336
5940 23336 -8795 -6071 -41285 -2487 9195 -26903 -62865 -16584 -9177 -36701 -76807 -75226
5928 -75226 -52259 -57190 -108122 -125618 -168248 -114884 -3851 44015 16457 26081 -24067 -39304
5916 -39304 -32437 -32582 -66855 -139168 -107805 -59136 -115823 -85365 -63320 -48332 -57832 -63999 20858
$$ packed form
6000A5716j35363m4583O8823k0516k3573P404P9819K0803p0839J1710q101k423
5988a01123J20027M9061O7558O3179J8441j01142j10636N7004R824l0568l8322
5977C303j9852n8889j5332J10394r191k5446Q80P0104K5901l2300K2641k4028
5965D8185o8542j9371l5936J9873M7680n929q254q1360n1317j8560P499O7048
5953i8984m81O1315m3946m8278l865R6115P1416l653j4976N2135l2285m6356L5179
5940B3336l2131K724l5214L8798J1682l6098l5962M6281P407k7524m0106J581
5928g5226K2967m931n0932j7496m2630N3364J11033M7866k7558R624n0148j5237
5916c9304O867j45l4273p2313L1363M8669n6687L0458K2045J4988r500o167Q4857
$$ plain form
5903 20858 30575 25099 -10613 -21530 -113057 -140607 -147930 -239344 -121258 -5552 70935 110995
5891 110995 211149 292811 198842 124493 147049 129282 95283 23764 48461 50997 -47546 -63719
5879 -63719 -26531 32021 70640 96635 120562 43915 35657 32352 116389 79272 67626 6545
5867 6545 -51439 -73432 -4316 41374 55682 111742 97374 135482 167706 94834 34105 -64485
5855 -64485 -113814 -58332 34103 81045 10706 -52198 -14647 107528 32614 -22770 9907 57935
5843 57935 79097 31803 -91850 -135025 -110080 -114445 -103852 -91586 -50111 -65051 -77445 6063
5831 6063 -1619 46129 38075 -101552 -97754 -41334 -130220 -134507 -70098 4384 73981 90562 58184
5818 58184 112820 97612 55769 13506 -8078 -13115 7485 13360 19757 -1636 -69363 -46091
$$ packed form
5903B0858R717n476l5712j0917r1527k7550p323r1414J18086J15706P6487M0060
5891A10995J00154Q1662r3969p4349K2556j7767l3999p1519K4697K536r8543j6173
5879f3719L7188N8552L8619K5995K3927p6647q258l305Q4037l7117j1646o1081
5867F545n7984k1993O9116M5690J4308N6060j4368L8108L2224p2872o0729r8590
5855f4485m9329N5482R2435M6942p0339o2904L7551J22175p4914n5384L2677M8028
5843E7935K1162m7294j23653m3175K4945m365J0593J2266M1475j4940j2394Q3508
5831F063p682M7748q054j39627L798N6420q8886m287O4409P4482O9597J6581l2378
5818E8184N4636j5208m1843m2263k1584n037K0600N875O397k1393o7727K3272
$$ plain form
5806 -46091 -26813 54485 34445 -49852 -53200 -10877 -108123 -190476 -169278 -80356 -61384 -11626
5794 -11626 1595 10417 4580 -6818 4454 69366 19061 49005 57758 44672 -6572 -52392
5782 -52392 31448 42064 62865 -24276 -147477 -166276 -139446 -94905 -96723 -101487 -47002 3372
5770 3372 -13674 61582 146173 176407 106287 39444 33592 69558 44923 16111 56207 127192
5758 127192 158879 131456 31063 -15340 4617 36255 123413 133299 79737 -11367 -84852 20692
5746 20692 45424 -34736 -73300 -96064 -68024 -88735 -76252 -73260 -42768 67975 -39148 -117356
5734 -117356 -112832 -144314 -88316 -57281 -9477 -25374 -9569 101806 90009 -714 -45670 -33751
5722 -33751 -50131 17028 30921 -11666 21321 84539 32038 9997 54000 128769 119514 35127
$$ packed form
5806d6091J9278Q1298k0040q4297l348M2323r7246q2353K1198Q8922J8972M9758
5794a1626J3221Q822n837j1398J1272O4912n0305K9944Q753j3086n1244m5820
5782e2392Q3840J0616K0801q7141j23201j8799K6830M4541j818m764N4485N0374
5770C372j7046P5256Q4591L0234p0120o6843n852L5966k4635k8812M0096P0985
5758A27192L1687k7423j00393m6403J9957L1638Q7158R886n3562r1104p3485J05544
5746B0692K4732q0160l8564k2764K8040k0711J2483K992L0492J10743j07123p8208
5734a17356M524l1482N5998L1035M7804j5897J5805J11375j1797r0723m4956J1919
5722c3751j6380O7159J3893m2587L2987O3218n2501k2041M4003P4769r255q4387
$$ plain form
5710 35127 46126 81728 26622 -65723 -60886 51422 69673 66573 46202 -92076 -58846 -57842
5698 -57842 -65596 -37416 17274 -15491 -35861 -55084 -1434 -22463 -58228 -49149 -124613 -248641
5686 -248641 -150737 -80216 -30426 61573 127960 31697 -50226 92 11275 -18452 34166 57742
5674 57742 54205 -1719 -111365 -101947 17640 164991 149492 139820 87671 55030 80996 78494
5662 78494 97976 105466 -5259 -7347 4016 111526 115305 22246 -6433 23973 -44759 21658
5650 21658 107773 67530 38457 -4978 -76847 -27150 27289 43604 -35820 -83045 -105695 -95419
5638 -95419 -60936 -26674 -20668 -79605 -70073 -90123 -122373 -93178 -39598 63319 112361 83248
5626 83248 23517 16699 -16027 -17038 -44339 -29214 -85571 -164259 -180251 -77515 1450 50125
$$ packed form
5710C5127J0999L5602n5106r2345M837J12308J8251l100k0371j38278L3230J004
5698e7842p754K8180N4690l2765k0370j9223N3650k1029l5765R079p5464j24028
5686b48641R7904P0521M9790R1999O6387r6263q1923N0318J1183k9727N2618K3576
5674E7742l537n5924j09646R418J19587J47351j5499r672n2149l2641K5966k502
5662G8494J9482P490j10725k088J1363J07510L779r3059k8679L0406o8732O6417
5650B1658Q6115m0243k9073m3435p1869M9697N4439J6315p9424m7225k2650J0276
5638i5419L4483L4262O006n8937R532k0050l2250K9195N3580J02917M9042k9113
5626H3248n9731o818l2726j011k7301J5125n6357p8688j5992J02736P8965M8675
$$ plain form
5614 50125 34071 78786 66300 -70582 -125984 -179392 -138974 -101860 -98497 -50637 -1423 -74447
5602 -74447 -140804 -123632 -59603 -38321 -20451 16457 23018 49809 46984 38246 63709 -8627
5590 -8627 -82467 -193750 -217987 -175200 -114407 -85010 -91846 -42007 -24207 34009 45468 7204
5578 7204 -18740 -39782 -59422 -6679 38335 60932 80815 103484 113203 71953 81349 62814
5566 62814 -22119 -45561 5358 -17244 90368 88966 -8853 59162 153071 130169 74766 65183
5554 65183 93159 77298 -22328 -60591 16873 93692 18264 -40558 -120488 -160497 -186789 -166422
5542 -166422 -105351 -50177 -44432 -59180 -89354 -128926 -111264 -93898 -38499 -49044 -95958 -106409
5530 -106409 -126029 -153723 -66203 -56244 -30268 19635 -25223 -109390 -34537 -40915 -21459 -17041
$$ packed form
5614E0125j6054M4715j2486j36882n5402n3408M0418L7114L363M7860M9214p3024
5602g4447o6357J7172O4029K1282J7870L6908O561K6791k825q738K5463p2336
5590h627p3840j11283k4237M2787O0793K9397o836M9839J7800N8216J1459l8264
5578G204k5944k1042j9640N2743M5014K2597J9883K2669R719m1250R396j8535
5566F2814q4933k3442N0919k2602J07612j402r7819O8015R3909k2902n5403r583
5554F5183K7976j5861r9626l8263P7464P6819p5428n8822p9930m0009k6292K0367
5542a66422O1071N5174N745j4748l0174l9572J7662J7366N5399j0545m6914j0451
5530a06409j9620k7694Q7520R959K5976M9903m4858q4167P4853o378J9456M418
$$ plain form
5518 -17041 -45380 -95725 -179306 -226516 -111712 -29767 3468 -35246 -81609 -57872 -506 -19267
5506 -19267 -63638 -12196 -16559 -20521 6801 -59566 -44268 -32681 -33607 15700 39781 3632 -27971
5493 -27971 -84656 -92786 -124120 -210538 -113262 -33985 20720 64478 73915 125007 87100 57864
5481 57864 40780 -37012 -88259 -41413 75685 95350 84040 82222 44909 -25720 64494 124021
5469 124021 -26350 -175723 -53000 60777 64882 66900 50281 1767 -32850 -18734 -62193
5458 -62193 -19043 -123878 -98510 53998 -1351 -49328 -100916 -71290 53828 85004 18024
5447 18024 -63199 -75577 -69406 -6522 43641 27220 -13784 -91128 -85347 -147106 -37231 45783
5435 45783 78043 54367 -5353 -50425 -71085 -69433 -29251 5164 -682 -20857 -39309 -40371
$$ packed form
5518a7041k8339n0345q3581m7210J14804Q1945L3235l8714m6363K3737N7366j8761
5506a9267m4371N1442m363l962K7322o6367J5298J1587r26M9307K4081l6149l1603
5493b7971n6685q130l1334q6418R7276P9277N4705M3758R437N1092l7907k9236
5481E7864j7084p7792n1247M6846J17098J9665j1310j818l7313p0629R0214N9527
5469A24021j50371j49373J22723J13777M105K018j6619m8514l4617J4116m3459
5458f2193M3150j04835K5368J52508n5349m7977n1588K9626J25118L1176o6980
5447A8024q1223j2378O171O2884N0163j6421m1004p7344N781o1759J09875Q3014
5435D5783L2260k3676n9720m5072k0660J652M0182L4415n846k0175j8452j062
$$ plain form
5423 -40371 -97028 -58286 41068 28064 -9175 -47633 -50821 -26787 -85770 -61253 -118567 -99761
5411 -99761 -52115 -63236 -113481 -95849 -90034 -132671 -202422 -139359 -77786 33159 66459 -7725
5399 -7725 -38558 -20753 29241 58428 10128 37526 -12591 34224 69144 47023 83599 91530
5387 91530 -13038 -54773 -50585 -120583 -120751 -75576 -73156 -96035 -162076 -255516 -233755 -154134
5375 -154134 -124408 -82450 -34957 -114473 -99551 -101178 -99551 -92648 -97357 -120185 -126381 -95524 -63626
5362 -63626 -122230 2174 62901 3530 -5358 -24097 52029 82001 158327 151916 25079 -41584
5350 -41584 -39839 -74208 -111482 1678 52348 72815 21282 -59039 33836 82175 92305 36929
5338 36929 25967 -12850 -22362 -45676 -125768 -74359 13797 -8844 -133253 -207786 -170424 -158897
$$ packed form
5423d0371n6657L8742R9354j3004l7239l8458l188K4034n8983K4517n7314J8806
5411i9761M7646j1121n0245J7632N815m2637o9751O3063O1573J10945L3300p4184
5399g725l0833J7805M9994K9187m8300K7398n0117M6815L4920k2121L6576P931
5387I1530j04568m1735M188o9998j68M5175K420k2879o6041r3440K1761P9621
5375a54134K9726M1958M7493p9516J4922j627J627O903m709k2828o196L0857L1898
5362f3626n8604J24404O0727n9371q888j8739P6126K9972P6326o411j26837o6663
5350d1584J745l4369l7274J13160N0670K0467n1533q0321R2875M8339J0130n5376
5338C6929j0962l8817r512k3314q0092N1409Q8156k2641j24409p4533L7362J1527
$$ plain form
5326 -158897 -125870 -121124 -115725 -118661 -32193 72481 91630 3487 -61912 -67569 -150786 -92578
5314 -92578 -115831 -113633 -114377 -100343 -110719 22638 103657 23722 -35523 -9007 -4970 28239
5302 28239 -80194 -110101 -29910 8443 -103323 -182564 -233135 -201573 -116598 -105278 -168911
5291 -168911 -59822 71041 44737 -1163 44618 125438 85194 -50560 -168284 -264186 -183489
5280 -183489 -151729 -137948 -122869 -121044 -118221 -27557 49631 99846 76867 -139522 -171831 -114316
5268 -114316 -118934 -122548 -141462 -106047 -133360 -174179 -21916 115935 30189 30719 22044 -56740
5256 -56740 -37801 20298 19248 -42501 -888 -8412 3716 10472 -12290 -13337 -2460 -26628 -5237
5243 -5237 -32269 -109747 -29162 -10526 55345 6942 -68467 -117259 10205 59035 21394 -2475
$$ packed form
5326a58897L3027M746N399k936Q6468J04674J9149q8143o5399n657q3217N8208
5314i2578k3253K198p44J4034j0376J33357Q1019p9935n9245K6516M037L3209
5302B8239j08433k9907Q0191L8353j11766p9241n0571L1562Q4975J1320o3633
5291a68911J09089J30863k6304m5900M5781Q0820m0244j35754j17724r5902Q0697
5280a83489L1760J3781J5079J825K823R0664P7188N0215k2979k16389l2309N7515
5268a14316m618l614j8914L5415k7313m0819J52263J37851q5746N30q675p8784
5256e6740J8939N8099j050o1749M1613p524J2128O756k2762j047J0877k4168K1391
5243e237k7032p7478Q0585J8636O5871m8403p5409m8792J27464M8830l7641k3869
$$ plain form
5231 -2475 -8580 -16856 23428 33082 -2394 -69452 -63253 18945 61851 -26876 -142646 -192467 -142080
5218 -142080 -110753 -72494 -51164 -121150 -146513 -111205 -123748 -86667 -34795 -14135 -13624 4338
5206 4338 -9843 -42281 -40660 -195281 -231580 -199831 -154158 -115100 -96693 4461 81998 8587
5194 8587 9261 8757 -20028 -11977 -52549 -149122 -73032 -202 -46709 -15338 -20955 -96838 -134354
5181 -134354 -9526 39692 -24094 -59508 -10246 35700 32159 78395 97408 89606 30765 35719
5169 35719 45150 22514 -36321 -12328 -12563 -28155 -829 28158 -53648 -49112 25112 -50588 -76556
5156 -76556 -20661 70927 125813 112139 685 -19781 77507 119907 123617 119647 76296 18601
5144 18601 -39632 -55269 -18548 32156 41875 -4589 9676 43584 -22521 -37154 -48404 -124854
$$ packed form
5231b475o105q276M0284R654l5476o7058O199Q2198M2906q8727j15770m9821N0387
5218a42080L1327L8259K1330o9986k5363L5308j2543L7081N1872K0660N11J7962
5206D338j4181l2438J621j54621l6299L1749M5673L9058J8407J01154P7537p3411
5194H587O74n04k8785Q051m0572r6573P6090P2830m6507L1371n617p5883l7516
5181a34354J24828M9218o3786l5414M9262M5946l541M6236J9013p802n8841M954
5169C5719R431k2636n8835K3993k35j5592K7326K8987q1806M536P4224p5700k5968
5156g6556N5895R1588N4886j3674j11454k0466R7288M2400L710l970m3351n7695
5144A8601n8233j5637L6721N0704R719m6464J4265L3908o6105j4633j1250p6450
$$ plain form
5132 -124854 -98232 -2167 117784 90627 116537 37697 -24483 -81604 -28312 55883 106375
5121 106375 89861 43943 68365 69651 99616 86539 68386 29910 103165 91460 40591 100357
5109 100357 63235 4436 -1967 54275 101970 68923 -22639 -31980 6426 -54350 -141936 -63962
5097 -63962 6960 -18230 -59253 -69849 -85400 -176396 -165269 -102483 -84976 -57390 -13455 -37053
5085 -37053 -22042 19837 4882 16396 4957 -3663 35284 114006 152494 127331 106744 61608
5073 61608 68194 35089 17077 100260 95585 57904 37827 38981 22329 -52967 -122527 -123466 -137815
5060 -137815 -132608 -122553 -56002 -203 91579 131914 50815 5652 -33269 82573 92783 19288
5048 19288 33018 -4621 38874 3125 -66708 -111304 -112311 -15336 -41379 -45897 55498 105336
$$ packed form
5132a24854K6622R6065J19951k7157K5910p8840o2180n7121N3292Q4195N0492
5121A06375j6514m5918K4422J286K9965j3077j8153l8476P3255j1705n0869N9766
5109A00357l7122n8799o403N6242M7695l3047r1562r341L8406o0776q7586P7974
5097f3962P0922k5190m1023j0596j5551r0996J1127O2786J7507K7586M3935k3598
5085c7053J5011M1879j4955J1514j1439q620L8947P8722L8488k5163k0587m5136
5073F1608O586l3105j8012Q3183m675l7681k0077J154j6652p5296o9560r39j4349
5060a37815N207J0055O6551N5799R1782M0335q1099m5163l8921J15842J0210p3495
5048A9288J3730l7639M3495l5749o9833m4596j007R6975k6043m518J01395M9838
$$ plain form
5036 105336 58380 83724 134409 101689 24139 8463 41990 48386 33231 -11633 -72239 -114348
5024 -114348 -166048 -192091 -129494 -27254 -19789 -13759 73137 36423 12572 -82033 -135543 -171922
5012 -171922 -148094 -125373 -123447 -59730 -10893 -16872 9331 -21803 -28505 49368 87872 51882
5000 51882 28272 -7054 -17038 -49072 -73463 -34154 -42748 -73010 -67092 -84362 -59252 -53765 -78359
4987 -78359 -6216 27221 66622 26444 -58256 21352 45422 -8723 -58653 -86197 -86712 -38506
4975 -38506 85944 170462 184446 36787 -31384 -31985 -63774 -45776 -23745 -47980 -18488 61584
4963 61584 8834 22348 5673 39299 89345 48010 24155 -25320 -53433 -30259 4707 -2466
4951 -2466 -21050 25237 21781 -40323 -24006 -4631 75148 120482 38812 7608 54053 82704
$$ packed form
5036A05336m6956K5344N0685l2720p7550j5676L3527O396j5155m4864o0606m2109
5024a14348n1700k6043O2597J02240P465O030Q6896l6714k3851r4605n3510l6379
5012a71922K3828K2721J926O3717M8837n979K6203l1134o702P7873L8504l5990
5000E1882k3610l5326r984l2034k4391L9309q594l0262N918j7270K5110N487k4594
4987g8359P2143L3437L9401m0178q4700P9608K4070n4145m9930k7544n15M8206
4975c8506J24450Q4518J3984j47659o8171o01l1789J7998K2031k4235K9492Q0072
4963F1584n2750J3514j6675L3626N0046m1335k3855m9475k8113K3174L4966p173
4951b466j8584M6287l456o2104J6317J9375P9779M5334q1670l1204M6445K8651
$$ plain form
4939 82704 143674 114191 -8484 -80346 7675 7690 -9330 81056 120177 64086 5853 41705
4927 41705 -9404 -50594 951 76552 40404 14021 -66488 -31389 -31028 -73353 -38363 39516
4915 39516 -21162 -20283 -39790 -70260 -14136 67941 42995 -10144 -82814 -104584 -110009 -96415
4903 -96415 -68953 39015 101293 93011 15158 13974 16824 -16038 -36953 -17596 -80001 -119646
4891 -119646 -102197 -12425 -47329 -66089 -32773 -52154 7020 41603 141046 98956 41161 36067
4879 36067 25610 -6293 18088 -80550 -93303 -25948 13435 34215 71613 11194 -65303 -37152
$$ packed form
4939H2704O0970k9483j22675p1862Q8021J5j7020R0386L9121n6091n8233L5852
4927D1705n1109m1190N1545P5601l6148k6383q0509L5099L61m2325L4990P7879
4915C9516o0678Q79j9507l0470N6124Q2077k4946n3139p2670k1770n425J3594
4903i6415K7462J07968O2278q282p7853j184K850l2862k0915J9357o2405l9645
4891a19646J7449Q9772l4904j8760L3316j9381N9174L4583R9443m2090n7795n094
4879C6067j0457l1903K4381r8638j2753O7355L9383K0780L7398o0419p6497K8151
$$ [...]
##END NTUPLES=NMR SPECTRUM
##END=
