##TITLE=Analysis number 315786
Compound Code mo 00750
Project Code adrs
Chemist Name ugmt
##JCAMPDX= 6.0         $$ Bruker NMR JCAMP-DX V2.0
##DATA TYPE= NMR SPECTRUM
##DATA CLASS= NTUPLES
##ORIGIN= Bruker BioSpin GmbH
##OWNER= NMR
$$ XWIN-NMR		Version 3.5
$$ Thu Dec  1 15:16:46 2005 GMT Standard Time (UT+0h)  MAYBRIDGE\NMR@NMR_250MHZ
##.OBSERVE FREQUENCY= 250.131544655141
##.OBSERVE NUCLEUS= ^1H
##.ACQUISITION MODE= SIMULTANEOUS (DQD)
##.ACQUISITION SCHEME= undefined
##.AVERAGES= 16
##.DIGITISER RES= 18
##SPECTROMETER/DATA SYSTEM= dpx250
##.PULSE SEQUENCE= zg30
##.SOLVENT NAME= CDCl3
##.SHIFT REFERENCE= (INTERNAL, CDCl3, 0, 16.4611)
##AUDIT TRAIL= $$ (NUMBER, WHEN, WHO, WHERE, WHAT)
$$ ##TITLE= Audit trail, XWIN-NMR		Version 3.5
$$ ##JCAMPDX= 5.01
$$ ##ORIGIN= Bruker BioSpin GmbH
$$ ##OWNER= NMR
$$ C:\u/data/dgb/nmr/ADRS/13320/pdata/1/auditp.txt
$$ ##AUDIT TRAIL=  $$ (NUMBER, WHEN, WHO, WHERE, WHAT)
(   1,<2005-12-01 15:16:10.37 +000>,<MAYBRIDGE\NMR>,<NMR_250MHZ>,
      <created by zg, POWCHK disabled, PULCHK disabled
       configuration hash MD5:
       62 19 C7 07 E1 42 D1 B7 37 6C 3D D0 77 39 F9 E6
       data hash MD5: 64K
       18 22 34 4E 37 EF EF 85 12 93 BA 7B F2 4B AE 52>)
(   2,<2005-12-01 15:16:27.20 +000>,<MAYBRIDGE\NMR>,<NMR_250MHZ>,
      <Start of raw data processing
       ef LB = 0.3 FT_mod = 6 PKNL = 1 SI = 32K 
       data hash MD5: 32K
       F1 D5 9C 9A 9A 4D 22 03 4C 76 A0 5F 43 AA 04 F8>)
(   3,<2005-12-01 15:16:32.51 +000>,<MAYBRIDGE\NMR>,<NMR_250MHZ>,
      <apk 
       data hash MD5: 32K
       12 1F 21 48 BF CF 92 30 EC EE 78 E0 80 EE A1 14>)
(   4,<2005-12-01 15:16:34.21 +000>,<MAYBRIDGE\NMR>,<NMR_250MHZ>,
      <abs ABSG = 5 
       data hash MD5: 32K
       38 2A B1 B8 3B A9 BE 3E 40 20 94 7C 77 97 92 14>)
$$ ##END=
$$ 
$$ hash MD5
$$ BD 49 5C 4A 27 B9 46 0F B7 CC 71 27 29 2C 90 4A
##$RELAX= 
##$RELAX= 
##$RELAX= 
##$RELAX= 
##$RELAX= 
##$RELAX= 
##$RELAX= 
$$ Bruker specific parameters
$$ --------------------------
##$DU= <C:\u>
##$EXPNO= 13320
##$NAME= <ADRS>
##$PROCNO= 1
##$TYPE= <nmr>
##$USER= <dgb>
##$AMP= (0..31)
100 100 100 100 100 100 100 100 100 100 100 100 100 100 100 100 100 100 
100 100 100 100 100 100 100 100 100 100 100 100 100 100 
##$AQSEQ= 0
##$AQ_mod= 3
##$AUNM= <au_zg>
##$AUTOPOS= <29 >
##$BF1= 250.13
##$BF2= 250.13
##$BF3= 250.13
##$BF4= 250.13
##$BF5= 500.13
##$BF6= 500.13
##$BF7= 500.13
##$BF8= 500.13
##$BYTORDA= 1
##$CFDGTYP= 0
##$CFRGTYP= 5
##$CHEMSTR= <none>
##$CNST= (0..31)
1 1 145 1 1 1 1 1 1 1 1 1 1 1 1 1 1 1 1 1 1 1 1 1 1 1 1 1 1 1 1 1 
##$CPDPRG= <>
##$CPDPRG1= <>
##$CPDPRG2= <>
##$CPDPRG3= <>
##$CPDPRG4= <mlev>
##$CPDPRG5= <mlev>
##$CPDPRG6= <mlev>
##$CPDPRG7= <mlev>
##$CPDPRG8= <mlev>
##$CPDPRGB= <>
##$CPDPRGT= <>
##$D= (0..31)
0 1 0 0 0 0 0 0 0 0.06 0 0 0 0 0 0 0.0002 0 0 0 0 0 0 0 0 0 0 0 0 0 0 
0 
##$DATE= 1133450168
##$DBL= (0..7)
120 120 120 120 120 120 120 120 
##$DBP= (0..7)
150 150 150 150 150 150 150 150 
##$DBP07= 0
##$DBPNAM0= <>
##$DBPNAM1= <>
##$DBPNAM2= <>
$$ [...]
##$SUBNAM7= <"">
##$SUBNAM8= <"">
##$SUBNAM9= <"">
##$SW= 20.6930455092707
##$SWIBOX= (0..15)
0 0 3 0 0 0 0 0 0 0 0 0 0 0 0 0 
##$SW_h= 5175.983436853
##$TD= 65536
##$TD0= 1
##$TE= 294.16
##$TE2= 300
##$TE3= 300
##$TEG= 300
##$TL= (0..7)
0 120 120 120 120 120 120 120 
##$TP= (0..7)
150 150 150 150 150 150 150 150 
##$TP07= 0
##$TPNAME0= <>
##$TPNAME1= <>
##$TPNAME2= <>
##$TPNAME3= <>
##$TPNAME4= <>
##$TPNAME5= <>
##$TPNAME6= <>
##$TPNAME7= <>
##$TPOAL= (0..7)
0.5 0.5 0.5 0.5 0.5 0.5 0.5 0.5 
##$TPOFFS= (0..7)
0 0 0 0 0 0 0 0 
##$TUNHIN= 0
##$TUNHOUT= 0
##$TUNXOUT= 0
##$USERA1= <user>
##$USERA2= <user>
##$USERA3= <user>
##$USERA4= <user>
##$USERA5= <user>
##$V9= 5
##$VALIST= <valist>
##$VCLIST= <CCCCCCCCCCCCCCC>
##$VD= 0
##$VDLIST= <DDDDDDDDDDDDDDD>
##$VPLIST= <PPPPPPPPPPPPPPP>
##$VTLIST= <TTTTTTTTTTTTTTT>
##$WBST= 1024
##$WBSW= 4
##$XGAIN= (0..3)
0 0 0 0 
##$XL= 0
##$YL= 0
##$YMAX_a= 580021
##$YMIN_a= -519263
##$ZGOPTNS= <>
##$ZL1= 120
##$ZL2= 120
##$ZL3= 120
##$ZL4= 120
##$ABSF1= 16.46105
##$ABSF2= -4.232122
##$ABSG= 5
##$ABSL= 3
##$ALPHA= 0
##$AQORDER= 0
##$ASSFAC= 0
##$ASSFACI= 0
##$ASSFACX= 0
##$ASSWID= 0
##$AUNMP= <proc_1d>
##$AZFE= 0.1
##$AZFW= 0.1
##$BCFW= 0
##$BC_mod= 0
##$BYTORDP= 0
##$COROFFS= 0
##$CY= 12.5
##$DATMOD= 1
##$DC= 0
##$DFILT= <>
##$DTYPP= 0
##$F1P= 14.0000005364418
##$F2P= -0.99999901652339
##$FCOR= 0.5
##$FTSIZE= 32768
##$FT_mod= 6
##$GAMMA= 0
##$GB= 0
##$INTBC= 1
##$INTSCL= 1
##$ISEN= 128
##$LB= 0.3
##$LEV0= 0
##$LPBIN= 0
##$MAXI= 10000
##$MC2= 0
##$MEAN= 0
##$ME_mod= 0
##$MI= 0
##$NCOEF= 0
##$NC_proc= -2
##$NLEV= 6
##$NOISF1= 0
##$NOISF2= 0
##$NSP= 0
##$NTH_PI= 0
##$NZP= 0
##$OFFSET= 16.46105
##$PC= 1
##$PHC0= 77.2877
##$PHC1= 12.61305
##$PH_mod= 1
##$PKNL= yes
##$PPARMOD= 0
##$PSCAL= 4
##$PSIGN= 0
##$REVERSE= no
##$SF= 250.130015243959
##$SI= 32768
##$SIGF1= 0
##$SIGF2= 0
##$SINO= 400
##$SIOLD= 32768
##$SREGLST= <1H.CDCl3>
##$SSB= 0
##$STSI= 32768
##$STSR= 0
##$SW_p= 5175.98343685301
##$SYMM= 0
##$S_DEV= 0
##$TDeff= 65536
##$TDoff= 0
##$TI= <Analysis number 999999
Compound Code 99
Book Reference 9
Project Code 9>
##$TILT= no
##$TM1= 0
##$TM2= 0
##$TOPLEV= 0
##$USERP1= <user>
##$USERP2= <user>
##$USERP3= <user>
##$USERP4= <user>
##$USERP5= <user>
##$WDW= 1
##$XDIM= 32768
##$YMAX_p= 331780140
##$YMIN_p= -63190
$$ End of Bruker specific parameters
$$ ---------------------------------
##NTUPLES= NMR SPECTRUM
##VAR_NAME=  FREQUENCY,     SPECTRUM/REAL,   SPECTRUM/IMAG
##SYMBOL=    X,             R,               I
##VAR_TYPE=  INDEPENDENT,   DEPENDENT,       DEPENDENT
##VAR_FORM=  AFFN,          ASDF,            ASDF
##VAR_DIM=   32768,         32768,           32768
##UNITS=     HZ,            ARBITRARY UNITS, ARBITRARY UNITS
##FACTOR=    0.157963299565203, 1,           1
##FIRST=     4117.40269582827, 0,            0
##LAST=      -1058.58074102474, 0,           0
##MIN=       -1058.58074102474, -63190,      0
##MAX=       4117.40269582827, 331780140,    0
$$ Real data points
##PAGE= N=1
##DATA TABLE= (X++(R..R)), XYDATA
$$ [...]
17220A0863j2162n344l365K1817n060p814K763O860N262R413j4025k4330P667
17207g455K297n496m065J5452N308J1239p242j9796J053L167k57N675R457M510
17193A3847q068O6o617n379n979p583o852R738R984j1451l608j341j0371o292
17179c9906L019M993L658M119J0653n810R844R835k305r103n030j6007J2265J481
17165a8294J3257j0114o709O809J2027L291n216k898O650r57k022L49J2091j274
17151F990j2181j0541R289J5219j151j4943J919N64L778q950P270M815n22k925
17137a369l509o755L05N937R255m371J156L984j5535R10k022j2231n78m358q907
17122c8088J2826J2560R345J1537J964j2592q852l966j9481M573J7830J6682j7617
$$ y = [10863, -1299, -6643, -10008, 11809, 6749, -1065, 1698, 8558, 13820, 23233, 9208, -15122, -7455, -5158, -10654, -14719, 733, 6041, 17280, 10038, -9758, -8705, -5538, -5795, -120, 9337, 13847, 5779, 5845, -772, -6151, -12130, -19713, -26565, -16827, -6843, -18294, -21902, -23243, -33614, -39906, -36887, -31894, -28236, -24117, -13464, -19274, -9430, 405, -1900, -11003, -16033, -32040, -19775, -18294, -5037, -15151, -21860, -15051, -3024, 267, -4949, -7847, -1197, -2154, -4176, -3827, 8264, 6990, -5191, -15732, -6443, 8776, 7625, -7318, -5399, -4835, -1057, -10007, -2737, 2078, 1556, -1369, -4878, -11633, -11328, -5391, 3864, -507, 649, 4633, -10902, -9992, -12014, -24245, -24823, -29181, -38088, -25262, -12702, -3357, 8180, 10144, -2448, -11300, -15266, -34747, -30174, -12344, 4338, -13279]
17109a3279o451J4584O273N891P56j4975J686j3492J484Q148L250M642n655K716
17095d422J666L967O897J0514M807n125j2758l288N925j9644O286K3221j2260
17082E786j386o4Q500l966n10j700j5016j3309L46Q187J0110L303n281j1601P877
17067h724m299j1787j2524Q094J1676r85K779k471m656n084j659L959J6230n124
17053a4575m413K047J4272J3615r44q720j0261q637M319J2616K943J6785J3710
17040C2757p547k838j9363j7648L395P3J225K895k432j827j27m741p564J956J2719
17025i067J721q39J2866K669j2902Q08k250l178N372L488L608N097J3204k213
17011A8384j2980j64O93j1452L681J5085m357p427K003P79j1340r345J4772P656
$$ y = [-13279, -19730, -5146, 1127, 7018, 7774, -7201, -5515, -19007, -17523, -9375, -6125, -1483, -7138, -4422, -2756, 1211, 8108, 18622, 23429, 18304, 5546, 2258, 8183, -11461, -5175, 18046, 5786, 4400, 4336, 12836, 8870, 8360, 6660, -8356, -21665, -21319, -13132, -3022, 281, -5000, -16601, -8724, -13023, -24810, -37334, -29240, -17564, -18549, -15770, -18241, -22897, -27981, -29640, -25681, -9451, -14575, -18988, -16941, -2669, 10946, 10002, 1282, -8979, -17616, -13297, -681, 2262, 19047, 32757, 25210, 22372, 3009, -14639, -11244, -11171, -9946, -7051, -9483, -11310, -11437, -16178, -23742, -21786, -9067, -7346, -8185, 4681, 7350, -5552, -4744, -6994, -10172, -4800, -1312, 2296, 7393, 20597, 18384, 5404, 5240, 5933, -5519, -1838, 13247, 8890, 1463, 3466, 4245, -7095, -16440, -1668, 5988]
16997E988j238K528N793o352r638M777J1517J1749K0967K1278m885j1466j4107
16984C6911k3120k0680J134M760M73J3816J1986J935l866R55j2166p024p945K528
16970c03L742K35k1851j1505J2559m006N680J3226j1073m323J5725J2284K263
16957A2653j958r109j1479M024L07J2744j0266j2279n739o757J1513O077Q180
16944b089N629l847j2438l444j19R11R512k052j6795p71P800M948J784N576r910
16929a5305L344O292j927r129J837N415N12M021K56M504j929N556K1127l555q739
16914A2280M311l367j1763k108O047O865l595p433j181m525p076O069M323m431
16900e584p411O701R7j653k203l527M613R268o979o023n630o571K656j83k254
$$ y = [5988, 4750, 7278, 13071, 6719, -2919, 1858, 13375, 25124, 46091, 67369, 62484, 51018, 36911, 13791, -6889, -5755, -995, -522, 13294, 25280, 27215, 23349, 24304, 12138, 5114, -2831, -303, 3439, 3674, -18177, -29682, -17123, -21129, -15449, -2223, -13296, -17619, -1894, 10390, 12653, 10695, 1586, -9893, -5869, -5562, 7182, -3084, -15363, -21102, -27859, -16346, -10269, -2089, 3540, -307, -12745, -16189, -16308, -15397, -5885, -7937, -24732, -25503, -17703, -12755, -10971, -5395, -15305, -11961, -5669, -7596, -16725, -14888, -9473, -8961, -4940, -4684, -180, -2109, 3447, 24574, 21019, 12280, 16591, 13224, 1461, -647, 5400, 12265, 8670, 1237, 56, -4469, -11545, -5476, -1153, -5584, -12995, -6294, -6197, -7850, -10053, -13580, -8967, 301, -6678, -12701, -18331, -24902, -22246, -22429, -24683]
16885b4683R419l052j776n610r014O114J8047R103K246j178p943r77O525m025
16871f804K733j3785j0189L41K1282l00L659m245l068M181L777r371q972j768
16857b2529r620N429J2904J9628M682p434r997p419J1537P229j1807l076K968
16844g505O915r274p574k197l202J2687J3571j1693k737O876M078l212K165J2856
16830A1754Q123k809r330n296n156j1290J577o580P30n588K737m386N161M208
16816a6145K671K734J4336N758k891J966Q061l91n332j4846r93K871R147R90q296
16801c60o931P465P989l865n114j833P225j3556j1125R422Q95L749L491R25l542
16786e165j1047r056K384K155O286O591o76N251K85L818j428k035n369l883O05
$$ y = [-24683, -15264, -18316, -20092, -25702, -34716, -28602, -10555, -1452, 794, -384, -8327, -9304, -2779, -6804, -4071, -17856, -28045, -27704, -6422, -6722, -3063, -7308, -10376, -6195, -2418, -11789, -20761, -22529, -32149, -26720, -13816, 5812, 10494, 3060, -6937, -14356, -2819, 4410, -7397, -10473, -7505, -590, -9864, -17438, -19635, -22837, -10150, 3421, -8272, -11009, -4133, -55, -3267, -1102, 11754, 19877, 17068, 7738, 2442, -2714, -14004, -12427, -19007, -18277, -23865, -21128, -25514, -20353, -16145, -13474, -10740, 3596, 9354, 6463, 8429, 16490, 16099, 10767, -4079, -5072, -2201, 6946, 7936, -360, -7291, 174, 8163, 4298, -816, -2649, 4576, -8980, -20105, -10683, -9788, -6039, -2548, -1623, -5165, -16212, -25268, -22884, -20729, -14443, -7852, -8528, -3277, -2992, 826, -602, -2637, -8006, -11889, -11284]
16771a1284m935O538P235R805J0964l838n816p115O79j144m972q236J1359M704
16757C944o848j1444L426J1434j893j2148N908M695j7245j0774P775J0835q515
16744b0850J4097J7376K504K779j1102j0767m029q774N26M684M087l453K430R376
16730a116n220m696P304N193j627p399l64M279r5n610L43q360j3100N989J1285
16715a3194L969n455j2387M593J710J2563J0107o641n254L741m252m385M654J2484
16701B253r388m291Q950J7008k377n887N998M129j3454o729L11q08r224J963O065
16686e481Q95N769p897p148J3204K913k361k718j6104J2865Q272n294O311r000
16672e774j7950J845J1381K3194P525q489j7130o832m173J658J3565N129k0844
$$ y = [-11284, -16219, -9681, -2446, 7359, 18323, 14485, 8669, 1554, 2233, 1089, -3883, -12119, -760, 3944, -2904, -14348, -10922, 512, -1381, -13529, -7621, -2926, -20171, -30945, -23170, -12335, -20850, -6753, 10623, 13127, 15906, 4804, -5963, -9992, -18766, -18240, -13556, -9469, -12922, -10492, -1116, -6336, -11032, -3728, 1465, -162, -7561, -7925, -3646, -3741, -9351, -9008, -17368, -30468, -24479, -13194, -9225, -14680, -27067, -22474, -20764, -8201, 1906, -4735, -9989, -6248, -10500, -14885, -10231, 2253, -7135, -11426, -2476, 14532, 12155, 6268, 12266, 16395, 2941, -3788, -3477, -4285, -13509, -11546, -5481, -4586, 1183, -6714, -13862, -658, 2255, -106, -2824, -18928, -6063, 2209, -3085, 3226, -5774, -23724, -21879, -10498, 12696, 20221, 11732, -5398, -12230, -16403, -14745, -1180, 3949, -16895]
16659a6895R54N014j584R054O663Q39K2695J1549j2106j2771m803N860p379l460
16645C630j1611N632j602M448p156q010J2529j109j9928J02K6105O717J802j5805
16631d256l946k375M637P862R15P029J6349J5377o77k1539k6386Q032O447n632
16617A837K943l80J530K484m676n077l58j4069R419J3483j0806P953J429m570
16603A142m537j4637j6925O778R829N535n496K046K021j9363N661J2127J6246
16590D27k51L018r109l0822o852J3377J6668K1662L265q68N029Q97m532m394L833
16575A1348M191n838j1785j872Q490P624k614j90j404r491M168Q786L204k407
16561A2210Q461q376M316p095k0530j3030q616K319O750L079l967J706l703K2759
$$ y = [-16895, -15941, -10927, -12511, -3457, 3206, 4045, 26740, 38289, 26183, 13412, 8609, 14469, 7090, 3630, -7981, -2349, -3951, 497, -6659, -14669, -2140, -3249, -23177, -23075, 3030, 9747, 11549, -4256, -8202, -10577, -5940, 1922, 2837, 9866, 26215, 41592, 40915, 19376, -7010, 1022, 7469, 1837, 4780, 4400, 5930, 8414, 3738, -1339, -1697, -15766, -6347, 7136, -3670, 4283, 5712, 1142, -3395, -18032, -34957, -28179, -18350, -12815, -18311, -16265, -14244, -33607, -27946, -15819, 427, 176, 3194, -5915, -36737, -43589, -30212, -13544, 8118, 11383, 10515, 15544, 16441, 11909, 7515, 11348, 15539, 9701, -2084, -3956, 4534, 12158, 9544, 9354, 7950, -1541, 2627, 11413, 14617, 12210, 20671, 12295, 16611, 9516, -11014, -24044, -32660, -30341, -23591, -20512, -24479, -22773, -26476, -3717]
16547c717R589Q056Q893q83j6909q894M068M371q796r115R106J6147o493M079
16533I502l948L828M267r596J711r17j0821k054o063n390J073J5814P418J6777
16519B1601J5761J671q483p255o617j0990k4567j129R523p4l706q876o58j463
16505b5262J9855J4262l379n937J255J870L541o693j3898m552N411J6290r609
16492f846r913R487l116j5321O795M171M525K930J1296L6j96j6935o5P376J149
16477d627M820J5279o817q086j3822l208m084O23J637J5386j103o978N613J1974
16463F607L63p694j704k24n746j903O111o87l52M715J7573N967j2089n751j5565
16448a0379j2152k342O22K880p433J2092J166p903N210J1880L133l814k497Q473
$$ y = [-3717, 5872, 13928, 22821, 21938, 5029, -3865, 203, 4574, -4222, -13337, -4231, 11916, 5423, 9502, 5554, 9382, 13649, 4053, 5764, 4847, -5974, -8028, -14091, -19481, -18408, -2594, 4824, 21601, 37362, 39033, 30550, 23295, 16678, 5688, -18879, -20008, -10485, -10559, -14265, -23141, -23799, -25262, -5407, 8855, 5476, -461, 794, 2664, 6205, -488, -14386, -18938, -13527, 2763, -6846, -16759, -7272, -10388, -25709, -18914, -14743, -10218, -7288, 4008, 4044, 3848, -13087, -13152, -5776, -4627, 193, 15472, 8655, 569, -13253, -16461, -20545, -19922, -18285, -2899, -4002, -10980, -5367, 6607, 6970, -724, -2428, -2652, -8398, -10301, -4190, -4877, -5229, -514, 17059, 23026, 10937, 5186, -10379, -22531, -24873, -24251, -21371, -28804, -16712, -15546, -23449, -18239, -6359, -3226, -7040, -9537, -1064]
16434a064J0750L055P951j1746l558r973k979K751j7269j2980J4875J9811M453
16421D077j472Q249l941j3546p882O27m632J5753O913r024j1777r373Q503K562
16407a4963q493K4013J3147J554j0136q404p365o122M857m43O292K550Q378J3541
16393A8406m345p358p992l352O040K526j9302L169Q348j798j0020J0705K5337
16380B0364K011p977P3N211j3674n031m130Q957J867j431L849P942j922Q697p740
16365A7066p717p675n016q813k454J0978Q417n943o437O453m693j2366N281J1304
16351a615j0548j4237j726P289M766L78L84Q254K596L382L11K596M48p127J067
16336c782j281m221p157l227o021k1799n610J8714J6321Q887j219j582o744m469
$$ y = [-1064, 9686, 12741, 20692, 8946, 5388, -4585, -7564, -4813, -22082, -35062, -20187, -376, 4077, 2605, 10854, 6913, -6633, -14515, -13888, -18520, -2767, 4146, -4878, -16655, -26028, -17525, -14963, -23456, 557, 13704, 15258, 5122, -3282, -10647, -16769, -11912, -12355, -6063, -3513, 4865, 18406, 14061, 6703, -1289, -4641, 1399, 3925, -15377, -12208, -3860, -5658, -15678, -4973, 20364, 22375, 14398, 14471, 19682, 6008, 977, -3153, 5804, 7671, 6240, 10089, 18031, 16109, 24806, 17066, 9349, 1674, -3342, -12155, -14609, -3631, 4786, -1157, -7594, -1141, -5834, -18200, -12919, -1615, -12163, -26400, -28126, -20837, -16071, -15693, -15309, -7055, -4459, -1077, -766, 1830, 2278, -4849, -3782, -5063, -9284, -16441, -19668, -25689, -47488, -53098, -34384, -18063, -9176, -10395, -11977, -18721, -23190]
16322b3190K4l107J0962J4182N789J175K891o170l626K881q399J1868l214n486
16308c420L003o297p470j795Q721j219n684P979Q463M875J0120q989j6581n291
16294a3585R822P131J850J4375k40l304n224j3043k2186l03K0980j866k921j845
16280a0359p684O911M921l728o239P131J6903q05q19M177J3719J1395j6144j4295
16266E084R68j1342r621R518O307J125n181j3605j3149l336L703M762J4738M49
16252i580j8414j904R015O363Q637k068P782L243o258p46Q286K733j221j700n813
16237a645J221k384m124p694l964J7950P460L589J1502J2352j7140l99P456p287
16223A6893j7607r162M371J1437l740j864l86K764J0973J090P665j4481q657q816
$$ y = [-23190, -23166, -26273, -15311, -1129, 4660, 5835, 8726, 2556, -1070, 1811, -6588, 5280, 2066, -3420, -417, -6714, -14184, -15979, -7258, -8477, -14161, -6182, 2281, 7156, 17276, 8287, -8294, -13585, -3763, 3368, 5218, 19593, 19353, 16049, 10825, -2218, -24404, -24707, -3727, -5593, -8514, -10359, -18043, -11132, -6211, -9939, -16178, -9047, 7856, 7051, 6232, 10409, 24128, 35523, 19379, 5084, 6052, -5290, -14911, -5393, 914, 2039, -3142, -16747, -29896, -33232, -29529, -24767, -10029, -9580, -27994, -29898, -20883, -14520, -5883, -7951, -169, 3074, -3184, -3930, 4356, 7089, 5868, 4168, -1645, -424, -2808, -6932, -14626, -18590, -640, 6820, 10409, 21911, 34263, 17123, 16724, 24180, 16893, -714, -9876, -5505, 5932, 2192, 328, -58, 2706, 13679, 14769, 22434, 7953, -704, -9520]
16209i520m196R163K431O050K574O527n121o781k69J127l868N274O020O43m438
16194E616k792M56j2849p54J0772n1L917P291N87o715M310N660K849P01r201j2178
16178b381L376O448j7646j2322q709J2434J3502J726O050J14J3884p578p047p681
16164e830M379P518k498n38J4179P543J776n914q990O003j3464j4881N924q47
16150e640L797j9p713J506J7342m479m884J5360N476j5541j1272l910k16k961
16136a3154O164P091M626p698P739P69O218M711j2685J003J853q504J0813k906
16122F040j4404J319O916k390M278J2451O765L040J206l835n240j3746p531J8176
16108A3045J1692j3052j1342M25j4840L295l849n917M190P792j376L177J0389
$$ y = [-9520, -13716, -4553, -2122, 3928, 6502, 13029, 7908, 1127, 858, 1985, -1883, 3391, 9411, 10054, 5616, 2824, 3280, -9569, -10323, 449, 398, 4315, 11606, 12193, 5478, 9788, 15448, 18297, 18998, 9797, -2381, 995, 7443, -10203, -22525, -31234, -18800, -5298, -3572, 2478, 2592, 16476, 8898, 1851, -5830, -1451, 6067, 3569, 3031, 17210, 24753, 26529, 20615, 11625, 17628, 4164, -10717, -4793, -5640, -1843, -1862, -9575, -8069, 9273, 4794, -90, 15270, 20746, 5205, -6067, -9977, -10193, -13154, -6990, 101, 4727, -2971, 4768, 5537, 11755, 16466, 3781, 4784, 6637, -1867, 8946, 6040, -8364, -7045, -129, -2519, 1759, 14210, 20975, 24015, 25221, 21386, 16146, 2400, -5131, 13045, 24737, 11685, 343, 768, -14072, -10777, -14626, -20543, -16353, -8561, -9937, -6760, 3629]
16095C629J8598L287j1845q294j5568N147k499m30P823N234k916j831K829K297
16081E461R23k880j7643P183J2440K540j1137L263K611Q178N636R840k613j1001
16067A2801j776l831l796q904j990J2817O977r165j9590p690K396L0924N908m619
16053A0462j0999j8875P110M518N111k957q411q848k026J0245J2307k484j245
16040f092R444l826J573L540J4524o066j6612o022N547N453j0296J527q47p261
16026a5414J0660M262j684j0244m275M748O080n85J9371N080o621m794j6639P746
16012b309j666j1746m712q404J875J0097P978J989k574K14q162K299J4655N021
15998D555n608j0124J998l112n94Q40l012m06q590K893J6214P871l23j8077j1819
$$ y = [3629, 22227, 25514, 13669, 5375, -10193, -5046, -7545, -7975, -152, 5082, 2166, 335, 3164, 5461, 6384, 3504, -14139, -6956, 5484, 8024, -3113, 150, 2761, 10939, 16575, 26415, 23802, 12801, 11025, 7194, 3398, -5506, -7496, 5321, 12298, 3133, -16457, -24147, -21751, 9173, 15081, 10462, -537, -19412, -12302, -7784, -2673, -5630, -14041, -22889, -24915, -14670, -2363, -4847, -6092, 3352, -474, 1099, 4639, 19163, 13097, -3515, -9537, -3990, 1463, -8833, -7306, -8153, -15414, -4754, -492, -2176, -12420, -16695, -11947, -5867, -6452, 12919, 17999, 11378, 6584, -10055, -2309, -3975, -15721, -20433, -28837, -26962, -16865, -8887, -6898, -9472, -9258, -17420, -15121, -466, 4555, -1053, -11177, -9179, -12291, -12885, -12045, -15057, -15463, -24053, -21160, -4946, 2925, 2602, -15475, -27294]
15983b7294l374K2972R879p505j667P78l909N357O832J761M51L661n387J2638
15969A5193N111j5065j8052P591L485l482N422j2265l872J7208N113R44J82l676
15955C837J044M045K155j3576j1513J5583J1437o381K416M48j6199j3792q33P764
15941a3565R276J615j571K3272j027p460n578n422k961O821N231o562O48O15J445
15926D777p003l555R109O091l674j216j649k146L1q016P480l247j213J2945m925
15911C789j2322l969K932Q50o870r124J1228j40q879l134n718R329J4725J7349
15897A0046J0229j0465p36p691r894j31J582J7363n219o633J054q593l200j688
15883a3976j161n736N820j168L266Q519J7104j086m678j2693l872Q399O025J0705
$$ y = [-27294, -30668, -7696, 2183, -5322, -6989, -6211, -10120, -4763, 2069, 3830, 4281, 7942, 2555, 15193, 20304, 5239, -12813, -5222, -1737, -5219, 203, -12062, -15934, 1274, 6387, 7331, 7513, 3837, 4881, 8926, 11081, -2495, -14008, 1575, 13012, 6631, 9047, 9495, -6704, -20496, -21329, -13565, -4289, -2674, -4245, 19027, 18000, 10540, 4962, -460, -3421, 3400, 8631, 2069, 2717, 3332, 4777, -2226, -5781, 3328, 9419, 5745, 4529, 2880, 734, 765, -7251, 229, -3018, -4231, 8714, 3789, -8533, -12502, -9570, -8720, -15590, -24714, -13486, -13626, -22505, -25639, -31357, -22028, -7303, 10046, 20275, 9810, 9074, 1383, -8511, -8642, -7060, 10303, 5084, -1549, -495, -9088, -12288, -13976, -15137, -20873, -15053, -16221, -12955, -4436, 12668, 11582, 6904, -5789, -9661, -1262, 4763, 15468]
15869A5468Q607o558o164q892p805l57l237L437N629J0517r4j233M005Q891O902
15854B9116j6300q924q722K31P573O414k0090o408m334L285L858R454m2j0993
15840a5882J7379j805j2094k138J0688j4249p195K975N406J0168R566M076j0294
15827c399q273L243o501J358n091R65o65k199J557k193R019o216k415R282J8389
15812F861k397j605q121k654N537O337O662j0426j149J8759J0585j2919K23n979
15798I714j1825j6581M046J6281R800j2008j890O641M002m169J116P466j0101
15785B492N222P982P508O981m156j6893k2252j1098O431O280K860r518J14Q478
15771i569j398K735K559r026o98rp873J1913J4231p56q430J486j1849j4056J2519
$$ y = [15468, 24075, 17517, 11353, 2461, -5344, -5701, -8938, -5501, 128, 10645, 10551, 9318, 13323, 22214, 29116, 12816, 3892, -4830, -4599, 2974, 9388, -10702, -17110, -21444, -18159, -14301, -4847, -4889, -15882, 1497, -308, -12402, -14540, -3852, -18101, -25296, -22321, -16915, -6747, 2819, 6895, -3399, -11672, -8429, -14930, -13572, -18663, -17698, -18363, -20562, -19005, -21198, -12179, -18395, -20810, -11528, 6861, 4464, 2859, -5262, -7916, -2379, 3958, 10620, 194, -955, 17804, 28389, 15470, 15693, 9714, -2111, -18692, -14646, 1635, 11435, -573, -2463, 4178, 8180, 4011, 5127, 12593, 2492, 7714, 15696, 23204, 30185, 26029, 9136, -13116, -24214, -17783, -11503, -8643, -18161, -18047, -9569, -10967, -8232, -5673, -14699, -15397, -15406, -23279, -11366, 2865, 2109, -6321, -4835, -16684, -30740, -18221]
15756a8221P231n926L440p64J0591J680K405J002j2667r095N98P564l455M945
15742a0672l216J553N637o178K013K372R34l21o401J2801P00K634o527k334N096
15727a909j4552j318P027n845m741K073J1323K411n391q412O642J055m419Q071
15713g985j2185k639J2812J2749N550P610o808O164K34j7462n928Q536j913RL825
15698B569M991k311J2132P77j2418j5181o743n47m873P156O620l426j1356m254
15684b6864R166O301Q247O802M882j2867N987K0479m310j2259o698o32j1541J758
15670a1549J2222k689j3173N125m971p433K347k452P503J3443J2370N79k266j7167
15656h111j3532M423J0603J4557p04J038o619o414J5619P716K447k769k33l027
$$ y = [-18221, -10990, -16916, -13476, -14240, -3649, -1969, 436, 1438, -11229, -20324, -19726, -12162, -15617, -10672, -13888, -12335, -6698, -12876, -10863, -8491, -7557, -7878, -14279, -1478, -778, 1856, -4671, -7005, -1909, -16461, -17779, -10752, -16597, -21338, -19265, -7942, -5531, -10922, -19334, -12692, -11637, -16056, -7985, -20170, -22809, -9997, 2752, 8302, 15912, 9104, 15268, 15502, -1960, -7888, 648, -1265, -1256, 2569, 7560, 5249, 17381, 18158, 5740, -9441, -16184, -16731, -21604, -14448, -7828, -11254, -22610, -26864, -17698, -11397, -3150, 3652, 8534, -4333, 1654, 22133, 17823, 5564, -1134, -1766, -13307, -11549, 673, -2016, -15189, -10064, -15035, -22468, -20121, -22573, -15070, -1627, 10743, 11322, 9056, -8111, -21643, -17220, -6617, 7940, 7236, 8274, 1655, -4759, 10860, 18576, 21023, 18254, 18021, 14994]
15642A4994J058Q02n788j5073j9538O806o9P410O068j5578m64j5553K678R478
15628b2769J1883O574k29o722P057q8n345M561R512R296l753L509Q060j0010j116
15613A0420K097o275l134j1903J880L114P962p133j1977J775j0519j4396k389
15600d0478R597J0047J83J0400Q766J3329r65k986l899m045q758k478n31J0143
15586a675r76m731p878Q673J4846k307o874J3799K414j2249N245K679j2588k037
15572c659J2833J3513K415p528j0498o437J169j3095j3922p80N453j843J0062
15559a2317J0108K497N646Q24q513k3767n164J1041J424J395K95J968M146J4067
15545C650J069J2036Q396J47K141k151M257n117j8979r471J3219O018r117j1698
$$ y = [14994, 16052, 16854, 11066, -4007, -23545, -16739, -16808, -9398, -3330, -18908, -19372, -34925, -32247, -22769, -10886, -4312, -4541, -11263, -4206, -4294, -9639, -5078, 4434, 13730, 9977, 13486, 21546, 11536, 10420, 12517, 6242, 3108, -8795, -6915, -3801, 4161, -2972, -14949, -13174, -23693, -38089, -40478, -30881, -20834, -20651, -10251, -1485, 11844, 10879, 7893, 3994, -51, -8809, -11287, -11818, -1675, -2651, -7382, -15260, -6587, 8259, 5952, -922, 12877, 15291, 3042, 8287, 10966, -1622, -3659, 9174, 22687, 25102, 17574, 7076, 639, 1808, -11287, -25209, -25989, -20536, -22379, -12317, -2209, 288, 5934, 6758, -1755, -25522, -30686, -19645, -18221, -16826, -16531, -14563, -10417, 3650, 4719, 16755, 25151, 25298, 27439, 25288, 29545, 24428, 5449, -4022, 9197, 15215, 6098, -5600]
15531e600K466l393m554Q799l876j4083K186K669J2014R587N144L715n112j423
15517H539j673j2413k884P035J44Q329j144M462J0697p817j2507j382J1962j650
15503I698r674k665j1752J1001N558j6670j1260P263M108j0304Q690L284JJ0841
15489a881R043m408j4347l898L235J6781j97j2949j803J8299J4885m629n101o395
15475F635j4797q662k433L805O23J1478J0285j6099l346l2o278n71Q619J0784
15461A1K1789K856j766m512P21P446k778j5544o298M283L844M680P486R693p011
15446B4900q305j6698n333J48L994J6401o11k927p052J200L961j4130l411R958
15432B095J2023M463m617n343j0922o757q70J1741m47l643O984J8011j0122j1758
$$ y = [-5600, -3134, -6527, -11081, -2282, -6158, -20241, -18055, -15386, -3372, 6215, 11359, 15074, 9962, 8539, 6866, -5547, -8431, -1396, -1252, 7077, 5933, 10395, 21092, 13275, 768, -614, 11348, 9698, 24, -2641, -14393, -3392, 2166, -14504, -25764, -18501, -14393, -24697, -16007, -12723, -12722, -1881, 7162, 2754, -11593, -15491, -12256, 4525, 4328, -8621, -10424, 7875, 22760, 18131, 13030, 6635, -8162, -16824, -19257, -15452, -14829, -3351, 6934, -9165, -12511, -12543, -18821, -19392, -10773, 11, 21800, 24656, 22890, 18378, 19099, 26545, 23767, 8223, 1925, 6208, 10052, 14732, 22218, 31911, 24900, 16595, -103, -5436, -5288, -1294, 15107, 14496, 11569, 4517, 5717, 9678, -4452, -7863, 2095, 14118, 18581, 13964, 8621, -2301, -9058, -9928, 1813, 1366, -2277, 4707, 22718, 12596, 838]
15418H38o066j6695m590l608J1051J0380j0410j0600Q280O181K729M610J664j943
15404h179m405Q715o325j1293j2218Q808q497L898J7094J5854o033o439m459J3421
15390e8J376l235O659j3739r247O173J714R919J2554r878n929N843k013n954j0090
15375a5905r094L115R661l32n298J6037J5649j0891j5407m030j3605m289K9829
15362d560P497j5965j2809P651R837l269k460O160j0293o966M361j251P540N382
15348i145L083O220k572J845Q921l068j9517j2908J1438J1744L607R167K369r566
15334A618m745L882k098j7895M823J6711O625j0405J929P318l155j6052o722o517
15320b4683M919J5378J0118R348r002j4170l635P405O890j408q955n460m020k787
$$ y = [838, -5228, -21923, -26513, -30121, -19070, -8690, -19100, -29700, -21420, -15239, -12510, -7900, -6236, -8179, -12584, -3869, -10194, -21487, -33705, -24897, -33394, -29496, -12402, 3452, -2581, -9020, -13479, -58, 1318, -1917, 4742, -8997, -18244, -12071, -10357, -438, 12116, 2238, -3691, 2152, 139, -5815, -15905, -24999, -21884, -12223, -12555, -17853, -1816, 13833, 2942, -12465, -16495, -30100, -34389, -4560, 2937, -13028, -25837, -18186, -8349, -11618, -14078, -7918, -18211, -25177, -20816, -22067, -14527, -9145, -6062, 158, -2414, -569, 8352, 5284, -14233, -27141, -15703, -3959, -352, 8815, 11184, 1618, -3127, 755, -1343, -19238, -14415, 2296, 8921, -1484, 445, 7763, 4608, -11444, -18166, -24683, -19764, -4386, 5732, 15080, 6078, -8092, -11727, -4322, 2568, 1160, -7795, -13255, -17275, -20062]
15306b0062J2556K8300J1762l34q129M56l682j020j1254p686O190O406l051l748
15292F704O082J0519j1496j0332K494R421K452q064o097j0154J244L66j21K1393
15278A4411O700q652n205n158j4881k620M424L701J0751j971N271N589O778m181
15264A4957K666j0708j6339l655J2696Q156L82q373k307K095P736L26n314L483
15250E801J0339K503K58j6553j6222j034q3M95j609J0482R209r939l621l628j044
15235a4646O979J5575O972j1267m036j282P85J6590j2004q558m827n708l193O636
15221a1984j0284m912O613N980J3882m831k556J60l051N07J506n474L642l487
15207a4289k808J1411J4131M627j4033j7493n656n343m378j954J1722J5335M013
$$ y = [-20062, -7506, 20794, 32556, 32222, 24093, 24549, 20867, 19847, 8593, 907, 7097, 13503, 10452, 6704, 12786, 23305, 11809, 1477, 3971, 13392, 15844, 7780, 1683, -8471, -7227, -6861, -6982, 14411, 21111, 12459, 7254, 2096, -12785, -15405, -10981, -7280, 3471, 1500, 6771, 12360, 19138, 14957, 17623, 6915, -9424, -13079, -383, 7773, 8155, -218, -2525, -430, 7306, 7632, 2318, 5801, 16140, 18643, 18901, 2348, -13874, -14908, -14991, -14496, -16105, -5623, 3586, -6353, -9974, -13602, -14646, -7667, 7908, 14880, 3613, -423, -1705, -920, 15670, 3666, -4892, -9719, -15427, -18620, -11984, -22268, -27180, -20567, -14587, -705, -5536, -8092, -7932, -10983, -10476, -8970, -14444, -10802, -14289, -17097, -5686, 8445, 13072, -961, -18454, -24110, -29453, -33831, -35785, -24063, -8728, -4715]
15194d715J0812J755N025J40n779k860O746m527n482j1842j1096k865J519J2684
15180a0485K512j2345J1194N984k994M13o883o532M281R51M619m692k084J1817
15166d244L9M098k424j4694N643j7004r55K955R344J2369M060K405Q396J4716
15152B4704J076r277p747l577n429l971q84j812l796j886P817K232J970r56k241
15137c777p890m225M025j403J989O416P078r046L777J372N608j045m114K493j063
15122A95O047J6800J0492o335j2455n751J501N099j3107j3575J1668R16m662o759
15108i926P892n976M494N18q698J5958J2230n595j1658j0218N759K957O514j0108
15094e857k747J4459R811j0296o111M422N325k10n25j1706n801J9799j4772j5331
$$ y = [-4715, 6097, 7852, 12877, 13017, 7238, 4378, 11124, 6597, 1115, -10727, -21823, -24688, -23169, -10485, -7973, -20318, -9124, -3140, -6134, -5721, -12604, -19136, -14855, -13904, -9285, -13977, -16061, -4244, -4205, -107, -2531, -17225, -11582, -28586, -29541, -26586, -17242, -4873, -813, 1592, 9988, 24704, 25780, 16503, 8756, 5179, -250, -4221, -5105, -6917, -10713, -12599, -4782, -2550, -580, -1536, -3777, -11667, -15892, -11867, -13270, -11281, -4865, 2213, -6833, -3056, -1684, 3924, 2879, -1235, 1258, 195, 6242, 23042, 33534, 27199, 14744, 8993, 10494, 15593, 2486, -11089, 579, 1495, -3167, -9926, -2034, -8010, -3516, -2998, -11696, 4262, 16492, 10897, -761, -10979, -5220, -2263, 4251, -5857, -8604, 5855, 15666, 5370, -741, 3681, 9006, 8796, 8271, -3435, -9236, 10563, -4209, -19540]
15080a9540P862J3128N350p848K7J8318L656n172k2595j6741J2431J2318l833
15067b639j1036k92k041O406O524M519q313j083J0957Q42N892N376L228p432j0365
15052E43O046k376o40K231j994j9597J349n35N564L321N576p420m174J3931J3221
15037A5046n184j6239R12r394n140P627M167R455J6422j786j7646j237Q358j387
15023C974m055P182m996J0117j0851K480k211j6891P406K1018K511r19N077o617
15009A3225j2877j2877P972J0420l347Q604R097Q662l904j5089j2139n267j26
14996g646J7601N447J890P168K3210J2919J9918r917j7398k2607j2756Q70M527
14983B3226r629N79J5417o702m218P87O361j0663J632J074K10k361j081R88m810
$$ y = [-19540, -11678, 1450, 6800, -1048, -1021, 17297, 20953, 15781, -6814, -23555, -11124, 1194, -2639, -13675, -13967, -16008, -9602, -3078, 1441, -6872, -7955, 3002, 3844, 9736, 15112, 18340, 10908, 543, 6589, 4213, 3573, 5804, 3810, -15787, -14438, -14973, -9409, -6088, -512, -7932, -12106, 1825, 15046, 9862, -6377, -5465, -14859, -19999, -12372, -8205, 1250, 17672, 15886, -1760, -2997, 5361, 3974, -81, 7101, 2105, 12222, 1371, 3851, 1640, -15251, -7845, 13173, 15684, 14765, 19842, 13225, 348, -12529, -4557, 5863, 2516, 11120, 20217, 28879, 24975, 9886, -2253, -7520, -7646, 9955, 15402, 17292, 24460, 47670, 60589, 80507, 70590, 53192, 30585, 17829, 18699, 23226, 13597, 14176, 29593, 22891, 18673, 19460, 25821, 15158, 16790, 17864, 18074, 15713, 14632, 15620, 10810]
14968A0810j0493M883M927n554J9863m513r544j0122l959k385P565n734o709J2514
14954A549Q839r286j6840P11J1149Q348J549K415j6943o955n303j0378k201K0402
14940a2944n917N587R636N745M956j8452o25o365J4241p45q882N346J0771R463
14926A1815N595j740J999n189j0110q685l382K284n57r686J914P443J1578J7811
14912B1090L732n585K797q681L993k672k949K940j3551L269j367L51L299L291
14898I957j163m394K0405j0594p942K0191N525o514k3265q303Q621J899l303Q476
14884I596P785j1493j0215l943J804J1944P699J1092l704J133L213j2667J470
14871A3714j5899j0065J4986J9984K41j7146k2307M432P357n049J1706J1241q407
$$ y = [10810, 317, 5200, 10127, 4573, 24436, 19923, 10379, 257, -3702, -6087, 1478, -4256, -10965, 1549, 10388, 1102, -15738, -15027, -3878, 4470, 6019, 8434, -8509, -15464, -20767, -31145, -33346, -12944, -18861, -13274, -3638, 2107, 7063, -11389, -12014, -18379, -4138, -4883, -13765, -8419, 2352, 11815, 17410, 15670, 17669, 12480, 2370, -6315, -9697, -7413, -7970, -17656, -15742, -8299, 3279, 21090, 24822, 19237, 22034, 13353, 17346, 14674, 11725, 14665, 1114, 4383, 3016, 3367, 6666, 9957, 8794, 4400, 24805, 14211, 6269, 26460, 31985, 25471, 2206, -6097, 2524, 4423, 1120, 9596, 17381, 5888, -4327, -8270, -6466, 5478, 13177, 24269, 20565, 21698, 24911, 12244, 13714, -2185, -12250, 2736, 22720, 22961, 5815, -16492, -12060, -4703, -9752, 1954, 13195, 4788]
14858D788M020o061k411M122O468m122o210J3670m56j380j2066j986J95o18j1031
14843a3078L713J233M974P310p211o866M225J6454j1270K586J6157O646n097j2354
14829G422j8832R13q823j528k599K449J6877P913P440J1021P406J1501j3921r759
14815A7480o648J531J524j6859j061J1092o926R839p010j2621Q035R69p854J6749
14801H240J1309p230j0758J390N923j8237j6011n646J3436J3841J3315j210j172
14788G190N78j5557P968K2542P958j6719k33r683J548o465R19J5089r73k894O272
14773A7540j0262o022J267K917Q45j18k969L800m19j919K1425K401j4848n856
14759G782J3193o668m516M148j17J15m801n318N592Q477J0796q192O766O38r588
$$ y = [4788, 8808, 2747, 336, 4458, 10926, 6804, 594, 14264, 13808, 12428, 362, -1624, -1429, -2047, -13078, -9365, -8132, -3158, 4152, -3059, -9925, -5700, 10754, -516, 2070, 18227, 24873, 19776, 7422, -11410, -10497, -19320, -20848, -23447, -20998, -4121, 3792, 11232, 22253, 29659, 41160, 27239, 17480, 10832, 12363, 13887, -2972, -4033, 7059, 133, 9972, 2962, -9659, -1624, -655, -8509, 8240, 19549, 12319, 1561, 2951, 8874, -9363, -25374, -31020, -17584, -3743, 9572, 8362, 7190, 7768, -7789, 179, 22721, 30679, 13960, 13727, 4044, 5592, -873, 46, 15135, 14162, 11268, 17540, 7278, 1256, 2523, 5440, 6285, 6167, 3198, 6998, 6579, 4660, 26085, 28486, 13638, 7782, 20975, 14307, 9791, 13939, 13822, 13937, 9136, 3818, 9410, 17887, 28683, 20491, 27257, 27895, 18307]
14744A8307k0465l96L398N584L625j3055k807j008n907P709R697L850K524J734
14730A2790M895L223O37m572k0642l839N65j553K685J4608n128M464q490J725
14716A368q452p18J6115J744l671o274O788M067N584K659q140j0492J2267J6148
14702B8993p906j1250k466j0640q52P40M958n516J275l910N940l511n388J6641
14688G108K3627j488j0014k451j4758n05J152N854m122k120K823N731K755r512
14674D080n172M225r387l580J7305k794J839N987P582r492j3304o318P689j0921
14660a2261J611J8603J1382P297L152j8741j2232m818j167r393M502J6359J040
14647E334p369j0161J3842L822r459l637N097k947R862J3972q498p459k699K670
$$ y = [18307, -2158, -2554, 844, 6428, 10053, -3002, -5809, -6817, -12724, -5015, 4682, 8532, 11056, 12790, 17685, 20908, 21545, 16973, -3669, -7508, -6943, -8496, -5811, 8797, 3669, 8133, -357, 1368, -7084, -7802, 8313, 10057, 6386, 112, 6900, 10967, 16551, 19210, 11070, 578, 12845, 28993, 21087, 9837, 7371, -3269, -4121, -3381, 1577, -3939, -2664, -6574, -634, -4145, -9533, 7108, 30735, 29247, 19233, 16782, 2024, 1519, 2671, 8525, 4403, 2283, 5106, 10837, 13592, 4080, -1092, 3133, -6254, -9834, 7471, 4677, 6516, 12503, 20085, 10593, -2711, -9029, -1340, -12261, -10650, 7953, 19335, 26632, 29784, 11043, -1189, -6007, -7174, -16567, -12065, 4294, 5334, -2035, -12196, 1646, 5468, -3991, -7628, -2531, -5478, 4384, 18356, 9858, 2399, -300, 2370]
14633B370L176K635P060q396M871P446j2630j8814j38Q100J2960N535q71J540
14619A4844o307q341j883M169L019m944K108k858P23N154P600P443O617L595Q43
14604C1782o607j9226K274J536M293r814j515R99O512K468J4506p279P558j312
14590B6175j5826J014Q384Q06Q369O693j447K763K967N569o910K993L538q740
14576C6348q016n885l412j0176p614l185m483m153K081L028J375J95N340J5651
14562A7094j613j1864N616m637J017L398K736O104N988J3985n485j2018p315N572
14548A8578j1118L975l687m4m076q699j5957K671K0007J5232p537r70j1434m189
14534g248j0185j208j0328r67L558M287L859K6479K1572N123Q76O169j2493q154
$$ y = [2370, 5546, 8181, 15241, 6845, 11716, 19162, 6532, -12282, -12420, -4320, 8640, 14175, 13304, 14844, 8537, 196, -1687, 2482, 5501, 557, 2665, -193, 530, 5684, 13284, 20727, 27344, 30939, 31782, 25175, 5949, 8223, 9759, 14052, 4238, 2723, 3722, 10234, 12702, 27208, 19929, 27487, 26175, 10349, 11363, 19747, 20553, 28922, 35615, 34168, 36931, 39898, 45467, 38557, 41550, 45088, 36348, 28332, 22447, 19035, 8859, 1245, -1940, -6423, -10576, -8495, -5467, -4092, -3897, 1443, 17094, 15481, 3617, 9233, 4596, 5613, 9011, 11747, 17851, 23839, 37824, 32339, 20321, 13006, 18578, 7460, 11435, 7748, 7704, 3628, -5071, -21028, -18357, 1650, 16882, 9345, 8375, -3059, -7248, -17433, -18641, -28969, -29936, -26378, -22091, -18232, 8247, 29819, 34942, 35818, 41987, 29494, 21340]
14520B1340l300K3N349l48p270m265o335k1593K384J6491l249r201j387k278J5152
14505A513m182K78R42j193P256j2195l078P960R159O535K86q177j174m936o258
14490g264P364M560L567J089L0j3226K080J4254J605r66m893j038j5006r039J1628
14475e255J3341L820J6140L004q253o292j298o338j0618N331q33J1605M239l218
14461A5375K237M483j8j1457O052R623K978k2k19j6326q692J067l012J769n225
14446a387K042o60K919M936r926K796K9114J266k5476K862R259J311j0108p345
14432A603O472k964n319l863K930P284o589L594Q790l962k002N751N093k980o004
14417G834p251R754J2158j219J141n750K095o865Q973J0090j5572n075j0198k661
$$ y = [21340, 18040, 18063, 23412, 23064, 15794, 11529, 5194, -16399, -14015, 2476, -773, -9974, -11361, -13639, 1513, -2669, -2391, -1449, -2642, 4614, -7581, -10659, -2699, 6460, 12995, 13281, 5104, 3930, -1006, -7264, 100, 4660, 8227, 9316, 9346, -3880, -1800, 12454, 14059, 13093, 8200, 7162, -7844, -16883, -5255, 8086, 11906, 28046, 31050, 22797, 16505, 15207, 8869, -1749, 3582, 2749, 14354, 18593, 15375, 17612, 22095, 22077, 10620, 16672, 26295, 29273, 29251, 29032, 12706, 4014, 5081, 2069, 3838, -1387, 655, -5, 2914, 7850, -2076, 720, 29834, 31100, 5624, 8486, 17745, 19056, 8948, 1603, 8075, 5111, -208, -4071, -1141, 6143, -446, 3148, 11938, 7976, 5974, 11725, 16818, 13838, 7834, 583, 10337, 22495, 21276, 22417, 16667, 18762, 11897, 20870, 30960, 15388, 10313, 115, -2546]
14403b546L61R013J1235K990K470m33j4153q200J221J2682L147Q964L225J904
14389C1880O63q317L703j619R48j1815M414M373P930j3562j1329j1093M051k137
14375a910K514m001M697J3745o282r681J85p90Q702k176p12n661l969P449Q860
14360A0970j05N540n953J609O231K470N237j1992N669R070J24K917O494R039O110
14345E3430K721k6706k7295Q077K2374J5612J5928J6656J3722L3137M3018L3476
14333B04150p458p452k9924l9360l3259k2489j8152r645J2672j3094o528Q500
14321C7961l471j0660r199K000M503n073J672M973J0825q913j2063m708J1308
14308A9155J688j995p576m678P410P011k060R119p492l972M855r223P304N200
$$ y = [-2546, -2185, 6828, 18063, 21053, 23523, 23090, 8937, 737, 1958, 14640, 17787, 26751, 29976, 31880, 32543, 24226, 27929, 26310, 27258, 15443, 19857, 24230, 32160, 18598, 7269, -3824, 227, -1910, 604, -3397, 1300, 15045, 8763, -918, -733, -1523, 7179, 5003, 4291, -1370, -5339, 2110, 10970, 10865, 16405, 10452, 12061, 18292, 20762, 25999, 14007, 19676, 28746, 28870, 31787, 38281, 47320, 53430, 56151, 29445, 2150, 10227, 32601, 48213, 64141, 80797, 94519, 127656, 170674, 204150, 196692, 189240, 159316, 119956, 86697, 64208, 46056, 36411, 49083, 35989, 29461, 37961, 34490, 23830, 14631, 16631, 21134, 16061, 17733, 22706, 33531, 24618, 12555, 7847, 19155, 20843, 18848, 11272, 6594, 14004, 21015, 18955, 28074, 20582, 16610, 21465, 12242, 19546, 24746]
14294B4746j2286k763J5721R545m443m907q078r164k27Q99L911K286j0020l330
14280A890K1601J4097o354j6920n499L151J1776j386P919O052P47r202J1632o514
14266C2990j6818m082K671J602r259K662Q469J5954N573M225j0520j9243j4757
14253e33o85R421K1969n340q925j318k659J314J027J263o513j354j313R444J6204
14238C2002M727k1379q726M564J0203n424m395R041N028m612L614j29k1113k246
14224A155J1663j4686O818J7457l041P387Q19p955k85J847j562k199l792r10q006
14209D710k2515k107P872P556J3900J0654n836M248K045n953k1250N234m752r09
14195g103J0597L012N199J1819N773j1152r693O237l670q138l506J974N703P863
$$ y = [24746, 12460, 9697, 25418, 34963, 30520, 25613, 17535, 8371, 8144, 9043, 12954, 15240, 5220, 1890, 23491, 37588, 31234, 14314, 8815, 11966, 23742, 22356, 30275, 36327, 37074, 27872, 39504, 32990, 16172, 12090, 14761, 16363, 7104, 9766, 18235, 34189, 39762, 43987, 33467, 14224, -533, -1218, 8203, 30172, 24832, 15907, 14589, 11930, 13244, 14271, 15534, 9021, 7667, 6354, 15798, 32002, 36729, 15350, 6624, 11188, 21391, 15967, 11572, 20613, 25641, 21029, 24643, 24514, 3401, 1155, 12818, -1868, 4950, 22407, 19366, 26753, 27572, 19617, 19332, 21179, 19617, 17418, 13626, 12716, 4710, -17805, -19912, -12040, -4484, 9416, 20070, 14234, 18482, 20527, 14574, -6676, -1442, -6194, -7103, 3494, 6506, 11705, 23524, 29297, 18145, 8452, 14689, 11019, 2881, -625, 1349, 7052, 14915]
14181A4915k334j0524p182K2799J4419j0694l167q167O7l978K062k232J1151L0543
14167D7678L923k0827q392K616K703j531q274k6074j3309Q047J9303M888N036
14154A5787q800P144N560j7834q645N142K1841jP47J4162o065K936J9188N842
14140E7004j0455p047n034R42j0483j7200p139J0101J3297m799j6331J0334J7844
14127C1034l921J5474m422j1960n80j993k3816p664R565K083J296O596P795Q133
14113B7620k226p756r160p018N278K534j1554l698J0245M384m138j40J1491M843
14099B0705m257J3651M636j8047L324P936P529L39j8117l448l878Q203j254j8019
14085f97k750N116N733M125N326J309n816K74O605K652N626L100P198j2841j2106
$$ y = [14915, 12581, 2057, -5125, 17674, 32093, 21399, 18232, 10065, 10132, 6154, 8216, 5984, 17135, 47678, 51601, 30774, 22382, 24998, 27701, 26170, 17896, -8178, -21487, -13440, 5863, 10751, 15787, 6987, 14131, 19691, 1857, -6788, -1646, 20195, 20194, 20941, 35103, 29038, 31974, 51162, 57004, 46549, 39502, 34468, 35410, 24927, 7727, 588, 10689, 23986, 19187, 2856, 13190, 31034, 27113, 42587, 38165, 26205, 25625, 23632, -184, -7848, 1717, 3800, 5096, 11692, 19487, 27620, 25394, 17638, 8478, 1460, 6738, 9272, -2282, -5980, 4265, 8649, 4511, 4371, 15862, 20705, 16448, 30099, 34735, 16688, 20012, 27948, 35477, 35816, 17699, 14251, 10373, 18576, 17322, -697, -3447, 1669, 7402, 11527, 16853, 18162, 12346, 12620, 19225, 21877, 27503, 30603, 37801, 24960, 12854]
14070A2854j0130k33O428p538j4723P404O598q953M413J6309O195L740q09M621
14056B6176J0743M730q64j0217j3566l980O68K157R151L196Q206o031k32k323
14042B7814L749R607k570m070j0987p4N560k700k999o654q229j845J7599J1543
14028C5744R137j0073j4298n53j712N833o263l546J71K780J5248j1511M911m424
14014B1444k278j1697J3223P909p637p83J9799O695j168q020K321P964j2142j1396
14000B4234M002n741R482Q267R040k146M636K663M449r983m708K987J4688R798
13986G1668j137J8190K0378K0054L6325Q282n746k4789l6520k6711K998r641j3427
13973E9924N263N523k384k913k5610n657J0880r824n957N950N346J6109m330p529
$$ y = [12854, 2724, 2491, 8919, 1381, -13342, -5938, 660, -8293, -3880, 12429, 18624, 22364, 21555, 26176, 36919, 41649, 40785, 30568, 17002, 13022, 13690, 15847, 24998, 28194, 36400, 30369, 30137, 27814, 31563, 41170, 38600, 34530, 23543, 23469, 29029, 26329, 23330, 16676, 8447, 6602, 24201, 35744, 44881, 34808, 20510, 19957, 18245, 24078, 17815, 14269, 14440, 17220, 32468, 20957, 25868, 21444, 19166, 7469, 20692, 28601, 20964, 20181, 39980, 46675, 45507, 37487, 39808, 47772, 35630, 24234, 28236, 22495, 31977, 40244, 49284, 47138, 51774, 54437, 58886, 48903, 44195, 47182, 61870, 71668, 70531, 88721, 109099, 129153, 165478, 173760, 168014, 143225, 106705, 79994, 82992, 73351, 59924, 65187, 70710, 68326, 65413, 39803, 34146, 45026, 35202, 29245, 35195, 40541, 56650, 52320, 44791]
13959D4791P30Q288J0994j4172M82L028j0195k191L227K265j483K310K3344J3123
13945H4541L862N286P430K1904K9944N0037P6670P8011N4642K3593k6347m2455
13933C67118o2080p2697o0236k1106o464k1480j3729o936n863n001N06o089j3555
13920G2388J500J3587L912j8225j7483n381N093N229J992K5j782m535l525L947
13906E6742N559J308R621Q731L720J237k581J6188J0315J8767L6370M0703P1120
13893B77800Q5886Q6518L3539j9170m7608p6193p4429n4645m6204m0781l2511
13882I2202l671O277p022P542J243n809j0210l635j3640L532P119o967N297Q848
13868H1106j6329j0526r039k54N348N527J0147O574p731p967R155J45K252K3798
$$ y = [44791, 45521, 53809, 64803, 50631, 51113, 54141, 43946, 41755, 44982, 47247, 45764, 48074, 71418, 84541, 88403, 93689, 101119, 123023, 152967, 203004, 279674, 357685, 412327, 435920, 409573, 367118, 305038, 232341, 172105, 150999, 144535, 123055, 109326, 102390, 96527, 91526, 92032, 85943, 72388, 73888, 87475, 91387, 73162, 55679, 50298, 55391, 60620, 62612, 62637, 60855, 56320, 52795, 56742, 62301, 63609, 73230, 81961, 85681, 86918, 84337, 100525, 110840, 129607, 165977, 206680, 277800, 363686, 450204, 483743, 464573, 416965, 340772, 266343, 211698, 165494, 124713, 92202, 88531, 94808, 87786, 95328, 96571, 90762, 80552, 76917, 63277, 66809, 73928, 66961, 72258, 81106, 64777, 54251, 45212, 44958, 50306, 55833, 65980, 72554, 64823, 56856, 66011, 66156, 68408, 92206]
13854I2206L601j7529j1493J0345J2704L4455K9724L3316J7797l771j5968k5293
13842A60094k5190j6467j2158j5068p81j5514k0955r989K263n700k619O777Q640
13829E3333J3554l104n119p179J1940J2348N03l538m080Q078J0833N819K2263
13816A15651R696k0298k3247O203k206r273j6042p60K951O478j0231o119l542
13803D9261k90J5260P305R902j306J83q408o422m336k786n598J3084j1346q228
13789D6275n739j0230K427R263O066j4978n704Q419O913J2448L866n349K058M214
13775E9949K966K173l350k983j0288J1939J74j3844k072N766J4112J1474j1226
13762F4790R490K1262K637r583j3428o304j322L375p481L619n141n157n85j171
$$ y = [92206, 95807, 78278, 66785, 77130, 89834, 124289, 154013, 187329, 205126, 201355, 185387, 160094, 134904, 118437, 106279, 91211, 90430, 74916, 53961, 43972, 46235, 40535, 37916, 44693, 53333, 66887, 63783, 58664, 51485, 63425, 75773, 76276, 72738, 68658, 76736, 87569, 93388, 115651, 125347, 105049, 81802, 88005, 85799, 76526, 60484, 59724, 62675, 69153, 58922, 52803, 49261, 48971, 64231, 71536, 81438, 80132, 80315, 71907, 65485, 61149, 58363, 52765, 65849, 54503, 46275, 40536, 30306, 32733, 41996, 48062, 33084, 27380, 35799, 42712, 55160, 59026, 53677, 55735, 59949, 62915, 65088, 61738, 58755, 48467, 60406, 60580, 46736, 44664, 50430, 64542, 76016, 64790, 74280, 95542, 98179, 88596, 75168, 68864, 67542, 70917, 63436, 67055, 61914, 56757, 56172, 55001]
13748E5001J463k632Q410J321j5354j2450j2948J6972J6313J424o189J3290M030
13735F8651J3520L455j306j0247j1637O313J8079J1438k986M466R603O255J043
13722A16647N231l579m871J658J0601k941j85N809L998N438k883j6868l502j244
13708A13309p664j9992m060M643j363J780O415j0231l659N822J789N762J1928
13695A04479M488J912N17l542J8494P578n873n396J2949K144j0161J0972J4058
13682A52619n498J2028M807n336L173j0110r083J14M635L72j5530j8520j708J7645
13668A29608J2237j0282M973P112K521N721j7810r567l450j2961O226K014J5518
13655A31860J4204L352J0723J4926K648J7203J8002L738J0289K0358K5224O89
$$ y = [55001, 56464, 53832, 62242, 63563, 48209, 35759, 22811, 39783, 56096, 57520, 51331, 64621, 68651, 82171, 85626, 84320, 74073, 62436, 68749, 86828, 98266, 95280, 99746, 109349, 115604, 116647, 121878, 118299, 113428, 115086, 125687, 122746, 122561, 128370, 132368, 137806, 134923, 118055, 114553, 113309, 105645, 85653, 81593, 86236, 84873, 86653, 93068, 82837, 79178, 85000, 86789, 92551, 104479, 108967, 110879, 111396, 107854, 126348, 133926, 128053, 122657, 135606, 137750, 127589, 138561, 152619, 147121, 159149, 163956, 158620, 161793, 151683, 142600, 142714, 147349, 147721, 132191, 113671, 111963, 129608, 141845, 131563, 136536, 143648, 146169, 151890, 134080, 124513, 121063, 108102, 114328, 116342, 131860, 146064, 149416, 160139, 175065, 177713, 194916, 212918, 216656, 226945, 247303, 272527, 273216]
13643B73216r422k4865j5466K1617M1665K6995p40k1536j7458j5603k0272k2276
13631B15855j0865p330j9328j8737m193J730j376J9935J9557K3277Q817l047L718
13618B28013O593K093n439n174o187l588J2364J7576L6841L3930K4807J0107L928
13605C55864N873J2693J0327L248J0760N445K2646P194k435P04m306p577J2458
13592D32894J3629j210l853l5645l3815l0846j2028r067j0136l496p005j0532
13580B88890p193R809K0563J0853L581N799J3581J5826J0311K4340L4924R694
13568D40978j0329j89J3696K7661J9553J3801K3802K2884K0329J2638k63P702
13556E92263K2636K4354J6927K5268L5258K5368n372j9174l611M40K595K3607
$$ y = [273216, 263794, 238929, 223463, 245080, 286745, 313740, 313000, 291464, 274006, 258403, 238131, 215855, 204990, 197660, 178332, 159595, 155402, 157132, 155756, 175691, 195248, 218525, 227342, 224295, 228013, 234606, 236699, 231260, 226086, 219899, 216311, 228675, 246251, 283092, 317022, 341829, 351936, 355864, 361737, 374430, 384757, 388005, 398765, 404210, 426856, 434050, 431615, 432319, 428013, 420436, 432894, 446523, 445313, 441460, 405815, 372000, 341154, 329126, 320059, 309923, 306427, 299422, 288890, 281697, 291506, 312069, 322922, 326503, 332302, 345883, 361709, 372020, 396360, 431284, 440978, 430649, 430460, 444156, 471817, 491370, 505171, 528973, 551857, 572186, 584824, 584561, 592263, 614899, 639253, 656180, 681448, 716706, 742074, 736702, 717528, 713917, 714357, 716952, 740559]
13544G40559J7647P442K6018M1450P7990P1441L1999N404K7903L5667N6164R6181
13532A235865J20494J46115J73018K20690L02307L67473M35674N22269O53659
13523D177564Q60079J218527J802200K719804M108271N402074M659859J350356
13515B6298734j406446l043640m380855m359883l216347k076096j317262q52519
13507E645686n56938m10014l20597k84279k78621k71472k46133k08012j61994
13498B907626j04719o2507j9979K2420N9951K5923M3015R1601J34034J82384K19260
13487C499009K81216L76711M80227O13011Q02673J002696J209045J485369J885432
13478A1635389K438198L394116M982954P597903J1669987J6474036J6825850O585154
$$ y = [740559, 758206, 765648, 791666, 833116, 911106, 982547, 1014546, 1019950, 1047853, 1083520, 1139684, 1235865, 1356359, 1502474, 1675492, 1896182, 2198489, 2565962, 3001636, 3523905, 4177564, 5037643, 6256170, 8058370, 10778174, 14886445, 20288519, 24948378, 26298734, 24892288, 21848648, 17467793, 13107910, 9891563, 7815467, 6498205, 5645686, 5088748, 4678734, 4358137, 4073858, 3795237, 3523765, 3277632, 3069620, 2907626, 2802907, 2740400, 2720421, 2742841, 2802792, 2828715, 2871730, 2963331, 3097365, 3279749, 3499009, 3780225, 4156936, 4637163, 5250174, 6052847, 7055543, 8264588, 9749957, 11635389, 14073587, 17467703, 22450657, 30048560, 41718547, 58192583, 75018433, 81603587]
13470H1603587m079755q786718j3598604j4837397j1103074o997141m360132k772860
13462A5067906j816913j274227r82007q72630q68183q85930q58299p61786o28498
13453F119433m94209l90660k95074k17343j79084j41595p9057k6888M3445Q6278
13443D425246J52560K25077L12155L96949N16017P00457R30809J148278J410721
13434A0218269J820002K353751L229159M731504P177207J1040318J5968659J7685491
13426G4224360Q876902l097237q388644j3192394j5478341j2164996p767664m819294
13418A8192692l026537j977664j393435j070962r24945r19254r32003r00152q18883
13409F228857o83050n52707m44571l77366l25299k68686k28311j82719j51764
$$ y = [81603587, 77523832, 68737114, 55138510, 40301113, 29198039, 22200898, 17840766, 15067906, 13250993, 11976766, 10994759, 10122129, 9253946, 8368016, 7509717, 6747931, 6119433, 5625224, 5234564, 4939490, 4722147, 4543063, 4401468, 4322411, 4295523, 4338968, 4425246, 4577806, 4802883, 5115038, 5511987, 6028004, 6728461, 7659270, 8807548, 10218269, 12038271, 14392022, 17621181, 22352685, 29529892, 40570210, 56538869, 74224360, 83101262, 80004025, 71615381, 58422987, 42944646, 30779650, 23011986, 18192692, 15166155, 13188491, 11795056, 10724094, 9799149, 8879895, 7947892, 7047740, 6228857, 5545807, 4993100, 4548529, 4171163, 3845864, 3577178, 3348867, 3166148, 3014384]
13400C014384j10648p4402m4700j8886K1096M5981J02560J66359K38255L26610
13390C666609M24260N62634P54239J035917J510523K286852L497285N044738N617300
13381B4400357L186215m75010k562270m161952m978944m165108k808951j798749
13373F635588j159616p64059n16303l98507l46344l20319l27236l38037l00864
13364B164303k52408j97666j74194j42939j25187j07137j04061q1896p3668o4775
13354H40372n9696n4483n2662n5747m7105m4191l0779j4911k2663k9536m3183
13343C85416n0451j8029j1103o202o767p849j2221k0474j1209p448j8762j4143
13331B00758l450N390m625k529r539p676q425r066q244o992p630o672j631R689
$$ y = [3014384, 2903736, 2829334, 2784634, 2765748, 2786844, 2832825, 2935385, 3101744, 3339999, 3666609, 4090869, 4653503, 5407742, 6443659, 7954182, 10241034, 13738319, 18783057, 24400357, 27586572, 27111562, 24549292, 20387340, 15408396, 11243288, 8434337, 6635588, 5475972, 4711913, 4195610, 3797103, 3450759, 3130440, 2803204, 2465167, 2164303, 1911895, 1714229, 1540035, 1397096, 1271909, 1164772, 1060711, 978815, 905147, 840372, 780676, 726193, 673531, 617784, 570679, 526488, 495709, 480798, 458135, 428599, 385416, 334965, 316936, 305833, 299631, 292864, 285015, 272794, 252320, 241111, 233663, 214901, 200758, 197308, 202698, 198073, 195544, 186005, 178329, 169904, 160838, 152594, 145602, 137972, 131300, 129669, 139358]
13317A39358J6642J9265j0840m057j5157l3803j0075L148N980P679o089j2231
13305I9820Q682o984N3K761r408m297k175j2126j5447r875P787j2806M426J0M955
13290E5376P185n094m790K808J0218Q63O393J3658M137j8916j5771k0291j4636
13277B1140j108M670O513Q257P524P472M026P573l178R15k325N356J001O396j732
13262G2500o250J3814M999j6885J012J2938j8760j7547K434K099k2111p091K331
13249B3483l863J1604n062j0505J0168J7642J1414k2015o064Q021J3312J0746
13237E8881R766j9075j3671p398j7197j4932p938n306J709J2772J5584N207j0203
13224H199n998R59J1748R099m605P52M102j673l38J999M327o16n550p280K344
$$ y = [139358, 156000, 175265, 164425, 160368, 145211, 111408, 101333, 104481, 110461, 118140, 112051, 99820, 108502, 101518, 101571, 104332, 94924, 90627, 88452, 76326, 60879, 51004, 58791, 45985, 50411, 50421, 55376, 62561, 57467, 52677, 55485, 65703, 66566, 72959, 86617, 90754, 71838, 56067, 35776, 21140, 20032, 24702, 31215, 39472, 46996, 54468, 58494, 66067, 62889, 63804, 61479, 66835, 67836, 74232, 72500, 66250, 80064, 85063, 68178, 69190, 82128, 63368, 45821, 48255, 50354, 28243, 21152, 23483, 19620, 31224, 26162, 15657, 25825, 43467, 54881, 32866, 26802, 34823, 48135, 58881, 68647, 49572, 35901, 28503, 11306, -3626, -11564, -16870, -15161, -2389, 13195, 18402, 8199, 2201, 3160, 14908, 24007, 19402, 20154, 24256, 22583, 22245, 24244, 28571, 27955, 22405, 15125, 17469]
13209A7469N572L720J823l976K588l180j0505k451P22j7575p991P776R880O791
13195A0663M819J2205j2764k5119j2894J6164N826n84k431M470J169l315M691
13182B900k061O235m47j3281n012o327M457N425R545o097O162J3972R518L1r453
13167A5567j176J8485p27p915r474K145N731P612q045q299n6L46J140o104p206
13152B024K254Q314j1140m108J0086l623R36l252L7k105r434j3143j0285P31J7471
13137a5237J7782R991k502p506j096l8r439m164J0123l422q924j3309J6353J073
13123a0315L216k369J1653J865o678n135l647N330N473K465O659K678m725j1764
13109e294j684l91N962Q027m158K635M740k623m92j5100m018K629K838K778j130
$$ y = [17469, 23041, 26761, 28584, 24608, 27196, 24016, 13511, 11060, 11782, -5793, -13784, -6008, 3872, 10663, 15482, 27687, 14923, -10196, -23090, -6926, -1100, -1684, -4115, 355, 1524, -1791, 2900, 839, 7074, 6627, -6654, -11666, -17993, -13536, -8111, 1434, -4663, 1499, 15471, 24989, 25020, 15567, 14391, 32876, 32149, 24234, 14760, 16905, 22636, 30248, 22203, 13904, 13848, 14194, 15334, 9230, 2024, 4278, 12592, 1452, -2656, 7430, 3807, 4743, 1491, 1528, -577, -10011, -23154, -33439, -32708, -15237, 2545, 12536, 10034, 2528, 1432, 1394, -8045, -12209, -2086, -5508, -14432, -27741, -11388, -10315, -7099, -9468, 2185, 4050, -2628, -7763, -11410, -6080, -607, 1858, 8517, 11195, 6470, -5294, -6978, -7369, -1407, 6620, 2462, 5097, 9837, 7214, 6722, -8378, -12396, -9767, -6929, -4151, -5281]
13094e281r9r82O089m25l829L815q972j4836K980R274P999n817M34m969m54J0277
13078d796Q462r596j310m94k922m298j7108J3831j567J485R496k619N373j554
13064g617o03q766r360J8260J7579J1464k882k2087n671J8652R660J9930J872
13051D0431k4030j345J624K1428J6816O888K6404L8437J9432l833j1353k6588
13039A04311k8416j7501q396J5075k499J473j7094j7423k141j7770j7592L338
13027d635L334R459J0277L63j3846j0788J227J0400K1592J1819k2368m807P324
13014A9351j7441J1299J683m468R17N093P498J7436o628J6009J8521J5409L0250
13001A14929L7252O4600Q4034Q7705L7766k2388n2352o4034p0609n6774l2423
$$ y = [-5281, -5380, -6362, -273, -698, -4527, -712, -9684, -24520, -21540, -12266, -4267, -10084, -9650, -14619, -15073, -4796, 3666, -5930, -7240, -7734, -10656, -14954, -32062, -18231, -19798, -18313, -8817, -11436, -6063, -7617, -8220, -16986, -26346, -8086, 9493, 20957, 18075, -4012, -9683, 8969, 18629, 38559, 40431, 16401, 15056, 16680, 38108, 54924, 61812, 88216, 126653, 146085, 142252, 130899, 104311, 75895, 58394, 49998, 65073, 62574, 64047, 46953, 29530, 27389, 9619, -7973, -4635, -1301, 8158, 18435, 18798, 4952, -5836, -4609, 5791, 27383, 39202, 16834, 12027, 19351, 1910, 13209, 14892, 10424, 11341, 16434, 23932, 41368, 34740, 50749, 69270, 84679, 114929, 152181, 216781, 300815, 388520, 426286, 403898, 351546, 287512, 216903, 160129, 127706]
12990A27706j3231j3257k0309l1611m689J453k261o266j4982m881j4820J0351
12978A3203M510l354P294p587j3086r3P645O667n629R693n858N976J3357J289
12964C4027o860O438q63R150J4661J7561J7600K8475N0461N4665P9833Q1435N7017
12951D43600n062l8095q3633q9844n8828n0709k7214k0196k0300j0784j310j583
12939C6042o261r486r73o903m728N515J2443M193q136K630o987j6436l683j0649
12925a3419j0658j933M422J8163N774l555P239N56m885M641J3240J683m403O055
12911B2920K8113K3469M0000K3202o24j516k860k4343j6051k7685k6177j5353
12899B3095j5623N221N33m030j3071N88L762m207j495l771L509M797n149Q065
$$ y = [127706, 114475, 101218, 80909, 49298, 44609, 46062, 43801, 37535, 22553, 17672, 2852, 13203, 17713, 14359, 21653, 14066, 980, 887, 8532, 15199, 9570, 19263, 13405, 19381, 32738, 34027, 27167, 33605, 32742, 41892, 56553, 74114, 91714, 120189, 170650, 225315, 305148, 386583, 443600, 438538, 400443, 316810, 226966, 168138, 117429, 90215, 70019, 49719, 38935, 37625, 36042, 29781, 20295, 19322, 12419, 7691, 13206, 25649, 29842, 21706, 24336, 17349, 913, -2770, -13419, -24077, -26010, -21588, -3425, 2349, -1206, 6033, 6589, 1704, 6345, 19585, 21268, 16865, 22920, 51033, 74502, 114502, 137704, 137080, 135564, 132704, 108361, 92310, 64625, 38448, 23095, 7472, 12693, 13226, 9196, -3875, -3287, 475, -3732, -5227, -8998, -5489, -692, -5841, 2224]
12885B224q49J166J0239R72k972L583o183q318j0373p305k736m553J609J7264
12871f232P980p128j2943r407j0759J7011O067J2871P936K015O563q865Q904k24
12857A3789j0533K686r19Q020j8923k1864k439N348J2987J251K404n808j944K004
12843a3941J1591L38j770j2130Q3K292O799m25L964k472J2727j956Q983p473r879
12828c269M194l28j3645J595R180p486r350j281Q089N897k071J085Q110O329j001
12813F048j4714o704N219J3444R235k8114j5581k853j109J0772K2560Q437O115
12800A2755J503j1446m910L50m409j603o422O114M354J2435j4514j1517k202l467
12786b2979j3602N355P560L711P592j985N512L294j1575J2190J7271P164K158
$$ y = [2224, 1375, 2541, 12780, 13752, 10780, 14363, 8180, -138, -10511, -17816, -20552, -25105, -23496, -6232, 1748, -5380, -18323, -27730, -38489, -21478, -15411, -2540, 5396, 7411, 13974, 5109, 14013, 13789, 3256, 5942, 5023, 13043, -5880, -27744, -30183, -24835, -11848, -10597, -8193, -14001, -15945, -13941, -2350, -2012, -3782, -15912, -15829, -13537, -6738, -7163, -3199, -5671, 7056, 5100, 14083, 6610, -3269, 925, 597, -13048, -11453, -2273, -9759, -19109, -20390, -12301, -6404, -8475, -7390, 720, 7049, 6048, -8666, -15370, -10151, 3293, 12528, -15586, -31167, -34020, -35129, -24357, -1797, 6640, 12755, 14258, 2812, -2098, -1748, -6157, -7760, -14182, -8068, -3714, 8721, -5793, -17310, -19512, -22979, -36581, -31226, -23666, -19955, -12363, -14348, -8836, -5542, -17117, -4927, 12344, 19508, 21666]
12773B1666q464n071L714M602r36j8787j8033J749j386m454M286K573l218J5418
12759f341Q041q277n315L49J5298J1012O932k1939j8062J545P678p23R303P743
12745G244k505p797m059K640m196J0278P778k259q763k632j376j409p994p666
12731b2716J7310k330l935L538O539Q578k422R94K1015O791r509Q240q152n046
12717A8895l93l211n868k398M346k407O965J1322j2291p350P476o01j8333j1014
12703a4862J1843K309O819k067q496j5494j5731L542L337Q73P600N127P876q859
12689a6183J146J0461j637O753M353r753n171o706J4298q249j689r279j329L354
12675a9631o207J628L992r688J2375J3412l225j5644J174J1062R916K862q312
$$ y = [21666, 13202, 8131, 11845, 16447, 15511, -3276, -21309, -19560, -20946, -25400, -21114, -18541, -21759, -6341, 1700, -6577, -11892, -11543, 3755, 14767, 21699, -240, -18302, -16757, -9079, -9802, -499, 7244, 4739, -3058, -7117, -4477, -8673, 1605, 9383, 7124, -1639, -4271, -5647, -7056, -15050, -22716, -5406, -7736, -11671, -8133, -1594, 6984, 4562, 5556, 26571, 33362, 23853, 32093, 23941, 18895, 18502, 15291, 9423, 7025, 11371, 8964, 15929, 27251, 14960, 7610, 15086, 14485, -3848, -14862, -3019, -710, 6109, 4042, -4454, -19948, -35679, -32137, -28800, -27927, -20327, -15200, -7324, -16183, -15037, -4576, -6213, 540, 4893, -4860, -10031, -16737, -2439, -10688, -12377, -21656, -22985, -19631, -25838, -24210, -20218, -29906, -17531, -4119, -7344, -22988, -21814, -10752, -836, 2026, -6286]
12662f286j7609L555R545O755j0634m734Q128J2962J225k237j1307k294O437l334
12648i828O041q720J372R172p169q120j0182j6170k195M553l659J6694K2961J1035
12634E785K889K722p230N683r788j0193J505n34r063J0615L430P50o030p510J4025
12619b944p376k098R944J601q289j1686L09J0294m079j546K986n335J2876k21
12605e564l635J2046J2525O033L72K202j0311j1903r31Q525o774L988J1421J0033
12591B8027R752o648j0320r604j3714o980N446m453p661J1155J3375L313J1911
12578B3599L771L486m490q934j3326K659p706n785J7827J3959n757j4730j3482
12565h909M692J0640l763q444m492k792k151J2234P062q171r811J2171j666P632
$$ y = [-6286, -23895, -20340, -10795, -4040, -14674, -19408, -11280, 1682, 2907, 670, -10637, -12931, -6494, -9828, -3787, -12507, -11135, -1963, -9132, -17252, -27434, -43604, -45799, -41246, -44905, -28211, -5250, 5785, 8674, 11396, 4166, 9849, 61, -10132, -8627, -9161, -18224, -7609, -4179, -3429, -9459, -16969, -2944, -10320, -12418, -2474, -873, -9162, -20848, -20539, -10245, -14324, -15870, -12884, -18219, -5343, -5564, -9199, 2847, 15372, 21405, 21777, 23979, 13668, 1765, 834, 9359, 2585, 6573, 17994, 28027, 37779, 31131, 20811, 11207, -2507, -9487, -4041, -8494, -16155, -5000, 8375, 11688, 23599, 27370, 30856, 26366, 17432, 4106, 6765, -941, -6726, 11101, 25060, 19303, 4573, -8909, -4217, 6423, 2660, -5784, -10276, -13068, -15219, -2985, 4077, -4094, -13905, -1734, -3400, 4232]
12551D232N584n58r485q269n95L108l8M687q009q787J0462l902P677J423j0240
12536a2710q761J1359m046n722K089m424K3744J2205k129m269j2479N81J3787
12523I225l734n851k824r292L137P913R966j7105j3353M777J5070J1950K352j2272
12509d1j3982K513P241N171P299J5391j3665q307n54K461J6Q337n622q069K922
12494A111j360k328O058J1550j5311j2600n756K139j047R353J9759P800m574k1337
12480f543j3881L165j927m316L346K557J8219O683m063m819J2906o089j2731J3611
12466F118N610r261p765j0066M865J5190L343n240k756n002m401R74J833J0047
12452C489j5975m030J17q36L886j653M499k347M342j375j1988J1915J3461M305
$$ y = [4232, 9816, 9258, -227, -8496, -9091, -5983, -6021, -1334, -9343, -18130, -7668, -11570, -3893, -2470, -12710, -21471, -10112, -14158, -19880, -17791, -22215, 1529, 13734, 11605, 7336, -5143, -4562, 9225, 5491, -360, -3184, -12476, -9339, -1426, 8540, -8565, -21918, -17141, -2071, 9879, 12231, -41, -14023, -11510, -4269, 902, 8201, 23592, 9927, 1620, 1066, 3527, 3543, 11880, 6258, -1811, 1111, -249, -2577, 3481, 15031, -280, -12880, -18636, -16497, -17544, -8191, 11568, 19368, 14794, -6543, -20424, -17259, -19186, -23502, -20156, -17599, 620, 7303, 3240, -1579, 11327, 5238, -7493, 6118, 11728, 2467, -5298, -15364, -10499, 4691, 8034, 2794, 38, -4964, -9365, -8391, -6558, 3489, -12486, -16516, -16399, -17235, -13349, -15002, -10503, -12850, -8508, -9883, -21871, -9956, 3505, 7810]
12438G810j6807k231J0772L459o90j2229J582J0000k521Q186J3715N420j913L011
12424B7564q123j096j977l242L725j407m914o77o343M600j5105J750K87O360J1895
12409A3297L536j5834J224P266n002k572L857M867M965o318j8206m188P313l359
12395i154N512J887n028k616P051J5418J1269J789j1444n360k9j197J466l007
12381F557J745k4819p853J3044N725O895J852M273R622q913n012J8072J884j2322
12367A0750j5329j3646Q271J7648J9192j3721m573J5600n905j0208n756j1556
12355i233J3042m763j2951P790L859N242m523j1625p221R229J1334L930j329j90
12341B591J0385m550j9376K72Q400J231m074j0291Q926q513K114K292o740R110
$$ y = [7810, -8997, -11228, -456, 3003, 2313, -9916, -8334, 1666, -855, 7331, 21046, 26466, 24553, 27564, 19441, 18345, 16368, 13126, 16851, 15444, 10530, 9853, 3510, 8110, -6995, -5245, -4958, 1402, 13297, 16833, 999, 2223, 9489, 4487, 1915, 5772, 10639, 15604, 9286, -8920, -13108, -5795, -9154, -3642, -1755, -6783, -9399, -2348, 13070, 24339, 26128, 14684, 9324, 9295, 8098, 9564, 6557, 8302, -16517, -24370, -11326, -5601, 1294, 3146, 7419, 17041, 8128, 3116, 21188, 23072, 10750, -4579, -18225, -9954, 7694, 26886, 13165, 8592, 24192, 18287, 8079, 2323, -9233, 3809, -954, -13905, -6115, -2256, 2986, -1537, -13162, -20383, -11154, 180, 4110, 2781, 2591, 12976, 8426, -10950, -10678, -2278, -1047, -5121, -15412, -6486, -14999, -12885, -10593, -17333, -8223]
12327h223P656P791J5149L650j2012r61q704p260J3999L3J947m001j883p726J895
12312A350l503O67M739J1678m707j1439O617l999q578m431m114k057K1606o520
12298b691l143J2032O143o871m539L395Q512o032n223M313K828r923P342n870
12284B73j87J1056O311l873j2788r610l261J2287N682M447N027k011M794n234
12270A2913k1376R466M865K010J33r211m856M425L92k234Q69Q816O504m41p916
12255D359J4472n447j0901K945k818Q854K070j3423J1688l915L520Q031L255j7010
12241E680n706j912J2433Q407R575j076j6789j0368l730J1315J4910M714r475
12228A7978j6405j8242j561K172K1537j322p733M334L908r40K258O383M479N106
$$ y = [-8223, -567, 7224, 22373, 26023, 14011, 13050, 4346, -2914, 11085, 11118, 13065, 9064, 7181, -545, 1350, -2153, -1486, 3253, 14931, 10224, -1215, 5402, 1403, -7175, -11606, -15720, -17777, 3829, -2691, -5834, 6198, 12341, 5470, 931, 4326, 12838, 6806, 1583, 5896, 8724, -1199, 6143, 273, 86, 11142, 17453, 13580, 792, -8818, -12079, 208, 5890, 10337, 15364, 13353, 18147, 12913, -8463, 1003, 5868, 7878, 8011, -1200, -6056, -1631, -1239, -3473, -2604, 6212, 12716, 12275, 4359, 18831, 13384, 2483, 5428, 2610, 11464, 13534, 111, 11799, 7884, 11404, 19435, 22690, 5680, -26, -1938, 10495, 18902, 28477, 27401, 10612, 244, -3486, 7829, 22739, 27453, 17978, 1573, -16669, -18230, -16058, 5479, 4157, -3576, 758, 4666, 3726, 5984, 12367, 16846, 21952]
12214B1952j1704j2683p667J2319J4439L800J7689n95j0249L626m687j3776j1998
12201D66J3735M138j596O535p075M792m311n810l586O379n588j5334Q318N842
12187F905k55L053o891k016N722P733N391p930O625J2911J1283l801j2309J77
12173B6598j429J254r333k986n738J3137k985q219p929l90O005k187P580k788
12159A0590m708j545N280l861m548J4638P800J886q352j5623n390N462J0955J3958
12145B6542q732j5758l998L883j318N972J7023K676o857q731l743J181r316m331
12131e507J6712J8694l095o855l067n531J296N519j071j2120J154q457O543L670
12117G885o62k335M223O708m147M610L897K950l617l287l685j3593q987J882R410
$$ y = [21952, 10248, -2435, -10102, 2217, 16656, 20456, 38145, 37550, 27301, 30927, 26240, 12464, 466, 14201, 18339, 16743, 23278, 16203, 20995, 16684, 10874, 7288, 13667, 8079, -7255, 1063, 6905, 6650, 9703, 2812, 796, 6518, 14251, 19642, 11712, 18337, 31248, 42531, 38730, 26421, 26598, 25169, 26423, 17090, 14104, 8366, 21503, 18518, 10299, 2370, 1980, 7985, 5798, 13378, 10590, 5882, 4337, 9617, 5756, 1208, 15846, 23646, 25532, 17180, 1557, -3833, 1629, 12584, 26542, 17810, 2052, -1946, 1937, 619, 6591, 23614, 26290, 19433, 10702, 6959, 8140, -1176, -5507, 11205, 29899, 26804, 19949, 16882, 11351, 12647, 18166, 17095, 4975, 6129, -2328, 4215, 7885, 7223, 4888, 9111, 15819, 11672, 16282, 20179, 23129, 19512, 16225, 12540, -1053, -10040, -8158, 1252]
12102A252O561K149N024j57j547l940M930O033K750p3k021O860j0835j3510J24
12087C600o262j473O0J7082R616m172l606P078Q977o083o43j0896j359k350p807
12072A762O572J1000R787o191j1422j245Q127J120q315q071L696K252K768Q768
12058B0608J0632m59p512j764j2908j7105R225J809J190R29M185Q153p79K17O326
12043B2747m179j1585J560q023o700P041l654J0098K783M341L296Q128r711o593
12029I549R726J165k603K911M966p514n032N522J4653N47m508N580M180o307K139
12014C4974l777q010k218N755j358M500l248k635j2895M590O390J1591L96p106
12000B6949j5831J3989P288J816m6J883m897l573k185j3154j0597Q937J8240j0023
$$ y = [1252, 7813, 9962, 14986, 14829, 13282, 9342, 14272, 20305, 23055, 22982, 20961, 27821, 16986, 3476, 3600, -2662, -4135, -4075, 13007, 22623, 18451, 14845, 21923, 30900, 24817, 24174, 13278, 11919, 9569, 1762, 8334, 19334, 29121, 22930, 11508, 10263, 18390, 19510, 11195, 3124, 6820, 9072, 11840, 20608, 31240, 30781, 23269, 21505, 8597, -8508, 717, 2526, 3716, 4645, 8830, 16983, 16204, 16421, 22747, 18568, 6983, 8543, 520, -6180, 861, -2793, 7305, 10088, 14429, 17725, 25853, 16142, 9549, 19275, 20440, 17837, 20748, 25714, 18200, 13168, 18690, 33343, 33890, 29382, 34962, 39142, 32835, 34974, 31197, 23187, 20969, 26724, 25366, 29866, 26618, 23983, 11088, 15678, 22068, 33659, 34055, 26949, 11118, 25107, 32395, 34211, 34165, 36048, 31151, 27578, 25393, 12239, 1642, 10579, 28819, 18796]
11986A8796l157k835n271k872p34N810J5044J0704L254J837M67l707q628J868
11972C0576L239O662p439l922l333m614j976M566n635K801M81j669k070J2514
11958C0181R500j349O641r321l203K291M282q284n176p26p615O68M047J2816N675
11943D0427J4924Q182j0619j6981j103k010K204m291p36P353P134r729j1420R28
11929B4263M146k388N830q900L430O849K99k985m83o67k004j2758k624L97L850
11914A6255K990Q550m939K271P764N714J803j1961j341J9382J8695n716m235j7099
11900C8133r688J2955L668q37L575m010j0389Q94P944q952j204J0493n61m435
11886C7586p33O72j0096p260L321M579M181j845M658O161r524L356N074M866L390
$$ y = [18796, 15639, 12804, 7533, 4661, 3927, 9737, 24781, 35485, 38739, 40576, 41043, 37336, 28708, 30576, 33815, 40477, 33038, 29116, 25783, 21169, 19193, 23759, 18124, 20925, 21406, 19737, 17667, 30181, 39681, 38332, 44973, 35652, 32449, 34740, 39022, 30738, 25562, 24836, 17221, 17889, 21936, 34752, 40427, 55351, 63533, 52914, 35933, 34830, 32820, 35024, 30733, 29997, 37350, 44484, 34755, 23335, 24263, 28409, 26021, 31851, 22951, 26381, 33230, 33529, 30544, 30061, 29394, 27390, 14632, 12008, 12405, 16255, 19245, 27795, 22856, 25127, 32891, 38605, 40408, 28447, 27106, 46488, 65183, 59467, 55232, 38133, 28445, 41400, 45068, 44231, 47806, 43796, 33407, 34301, 42245, 33293, 32089, 42582, 42021, 37586, 36853, 37525, 27429, 20169, 23490, 28069, 32250, 30405, 35063, 41224, 31700, 35056, 40130, 44996, 48386]
11871D8386l871R108K949n926j3270M24J609N995n070n175k431l610m864J1634
11857C5888J0491N597n948Q358J3490k418j969o549l456l535j0764Q88L513n712
11843C7874j8548J020N209p652N566K1948J8316P548j8335J865L073L502K699
11830F4085j7770o894J336p340p109M756N101N297p986Q65J3528q406K307R512
11816E1282P20l213m51l560r081M276K631k993m696l37L332r764J1000k828J3664
11801D9982J942J0233p760j2100J0548j4893M364Q624K71l55j604Q933J897o599
11787E3483J0446N735q408N87L211j193o145P352k150p665j846m797r793j0422
11773B8395Q009M629o787J5914k610o361K430L45J138L773P917K265N689j337
$$ y = [48386, 44515, 53623, 56572, 50646, 37376, 37800, 39409, 45404, 40334, 35159, 32728, 29118, 24254, 35888, 46379, 51976, 46028, 54386, 67876, 65458, 63489, 56940, 53484, 49949, 39185, 40073, 43586, 37874, 19326, 20346, 25555, 17903, 23469, 45417, 63733, 71281, 52946, 54811, 57884, 61386, 64085, 46315, 39421, 40757, 33417, 26308, 31064, 36165, 41462, 33476, 34341, 47869, 39463, 41770, 51282, 52002, 48789, 48338, 44778, 35697, 39973, 42604, 39611, 34915, 34578, 37910, 28146, 39146, 36318, 49982, 51924, 62157, 54397, 42297, 52845, 37952, 42316, 50940, 51211, 50856, 49252, 58185, 60082, 53483, 63929, 69664, 61256, 61843, 65054, 63861, 57716, 65068, 62918, 55253, 53407, 48610, 38817, 28395, 36404, 41033, 34246, 50160, 47550, 41189, 43619, 43964, 45102, 48875, 56792, 59057, 64746, 63409]
11759F3409m904n765K558P045k631L590P338J0871M186n027q350j2407m962J553
11745E6504L751j873l047J3507J8928k455j0238j3748J9162J728j3456n691J7049
11732H0121j215j691j4168p393J4784k010r202J1707r220L343J2542o827K1631
11719I2402M402j0943p133m118K075j0048l263J054J645J1205N749M342O67l508
11705H4528J5889J279r823m573k943j2452q902J300J3674N739J0009L762n586
11692I1901Q890o898r337k529N865N906O410K683j6811m33n58P732J2473j7472
11678H7822j2714R83m245M19L498P329J023j4824j5484L706J1462J4317j846L103
11664H4549J3265J3805O185r543j2219r838n378J0148o291j0317M032K941J6319
$$ y = [63409, 58505, 52740, 55298, 62343, 59712, 63302, 70640, 81511, 85697, 80670, 72320, 59913, 54951, 56504, 60255, 58382, 55335, 68842, 87770, 85315, 75077, 61329, 80491, 82219, 68763, 63072, 80121, 78906, 77215, 63047, 55654, 70438, 68428, 59226, 70933, 61713, 65056, 77598, 70771, 92402, 96804, 85861, 78728, 74610, 76685, 66637, 63374, 64428, 66073, 77278, 83027, 87369, 88036, 84528, 100417, 101696, 91873, 87300, 84357, 71905, 63003, 64303, 77977, 83716, 93725, 97487, 91901, 100791, 93893, 84556, 82027, 87892, 93798, 100208, 102891, 86080, 85647, 85089, 92821, 105294, 87822, 75108, 76091, 71846, 72265, 75763, 83092, 84115, 69291, 53807, 57513, 68975, 83292, 81446, 84549, 97814, 111619, 117804, 108261, 96042, 86204, 80826, 90974, 84683, 74366, 78398, 81339, 97658]
11651I7658K828j5273j2500J5635J7972m472m043m033J1461J968M993P27o367
11638A06554J950K707r988n192R32K296J0417J5022j022R50j0010j4211o901Q983
11624A02487P018R081L476O616K732k0643k2952r719N596J3379J5002N515O81
11611A18269o311O012J5906n881j7562J197J6943J4890N603L41j4171p329l74
11598A27533m626j490L905j0945j8371P92K4033J0237k012K171j991p391K411
11585A24256m224j247N924K852m178P123M133L378j1792O778R136M345O186Q030
11571A60700N015o685r614j6535J700Q425N921J180j464p325r288o090j468P839
11557A32311Q605R185J5j0308n712r266k1538J4243K0421l594q695m48r009J127
$$ y = [97658, 100486, 85213, 72713, 88348, 106320, 101848, 97805, 93772, 105233, 107201, 112194, 112921, 106554, 108504, 111211, 101223, 96031, 96963, 99259, 109676, 124698, 123676, 124626, 114616, 100405, 93504, 102487, 109505, 118586, 122062, 128678, 131410, 110767, 87815, 78096, 83692, 97071, 112073, 117588, 118269, 111958, 117970, 133876, 127995, 110433, 111630, 128573, 143463, 149066, 149407, 135236, 127907, 127533, 122907, 121417, 125322, 114377, 96006, 96798, 120831, 131068, 129056, 131227, 129236, 121845, 124256, 120032, 118785, 124709, 127561, 123383, 130506, 134639, 138017, 126225, 133003, 142139, 146484, 152670, 160700, 165715, 159030, 149416, 132881, 134581, 143006, 148927, 150107, 148643, 141318, 132030, 125940, 124472, 132311, 140916, 150101, 150116, 139808, 134096, 124830, 103292, 117535, 137956, 134362, 125667, 125219, 116210, 117337]
11543A17337J5106P937r438J2674K454j0645p817N192J3282J5372O73oj4580J5123
11529A62664j3008j1718L529J1549k021j654N394r720n477n734J6432J5917N208
11516A71361L913O016l326j077L71l659j815o69k947j2191l867P038k245q524
11502A48379j6401O773P004O482J284J4880J1154j3367j736J3592J4357j1709
11490A80692j0824j486j5098j7747Q745N330J3689j221L983J4284l472l069L778
11477A77584N480r548o712j3908M069L482j1514j4121n280J4835J1101j0497R23
11464A45894J8282J3212K467k397o692k356j340L148P137P415R353o628o445J6355
11450A97405L313m335j4883L083J0411n758o291k23r52Q19L866m286j3353m09
$$ y = [117337, 132443, 140380, 130942, 143616, 146070, 135425, 127608, 132800, 146082, 161454, 162127, 162121, 147541, 162664, 149656, 137938, 141467, 153016, 150995, 149341, 154735, 145015, 139538, 133804, 150236, 166153, 171361, 175274, 181290, 177964, 176887, 177258, 173599, 171784, 171115, 168168, 155977, 152110, 159148, 156903, 148379, 131978, 138751, 145755, 152237, 153521, 168401, 179555, 166188, 164452, 178044, 192401, 180692, 169868, 168382, 153284, 135537, 144282, 149612, 163301, 162080, 166063, 180347, 176875, 173806, 177584, 183064, 173516, 166804, 152896, 156965, 160447, 148933, 134812, 129532, 144367, 155468, 144971, 145894, 164176, 177388, 179855, 177458, 170766, 168410, 167070, 170218, 177355, 184770, 194123, 187495, 181050, 197405, 200718, 196383, 181500, 184583, 194994, 189236, 182945, 182722, 181770, 182589, 186455, 182169, 168816, 168407]
11436A68407M484P516M48R444m700K9O995J466M698m282N006n502m19L550K052
11421A99192l264q627M791q289J126p024n066J5824n48n258q017P85r656J4461
11407A80430Q560j0336l710l380j3490m263K392r21r90P439J7321Q808L316K748
11393A93924M654L663n155j6240p126k706j155M508J0894j3087n039p792J9176
11380A78519J1929j699Q786l801j0606M254L940j0498K563N924n016j6999m050
11367A63246l970O763R317O185J5334P333j8499o541r911j5474J060r742o920
11354A38181l313K70J7657J2071L300L257k493R3J0919N404n874Q273r956o342
11340A71447O883K408J708J0485J4764l077n019o723j3096q202P211J0830P128
$$ y = [168407, 172891, 180407, 180855, 190299, 185599, 185628, 192623, 194089, 198787, 194505, 199511, 194009, 193590, 197140, 199192, 195928, 187301, 192092, 183803, 184929, 177905, 172839, 188663, 188115, 182857, 174840, 175625, 165969, 180430, 188990, 178654, 174944, 171564, 158074, 153811, 156203, 155282, 154292, 161731, 179052, 187860, 191176, 193924, 198578, 202241, 197086, 180846, 173720, 171014, 169859, 174367, 185261, 172174, 167135, 159343, 178519, 190448, 188749, 197535, 193734, 183128, 187382, 191322, 180824, 183387, 189311, 184295, 167296, 163246, 159276, 166039, 175356, 181541, 196875, 204208, 185709, 179168, 169257, 153783, 154843, 145101, 138181, 134868, 135138, 152795, 164866, 168166, 171423, 168930, 169023, 179942, 185346, 179472, 187745, 177789, 171447, 178330, 180738, 182446, 192931, 207695, 204618, 199599, 192876, 179780, 171578, 178789, 189619, 196747]
11327A96747J858o117P880q871M292P818q949j6500p985r161J496J9118J5078
11314A96704J1957J8599m270K5325L8688L4010L0892L5267N1389Q8165J24181
11303F50907J83211L00976M21253L28630L6811j33345k48270l34409k97104k00116
11293G08544j27602p7947n1776m3784k2364k3759j7112m121j6019N71j9399l7629
11281B67603l1753j4980o368Q22J270p489p065m442l684P50q137j6494n385o854
11267A57794o925Q055J785r201j59j1974K857L338j1467P248Q382P21N6l733j2282
11252A34495n030k90R208Q446R294K159J6313q297k2051m997M449j31j144k529
11238A39895J1047O61n200J59J1961N821J6044N238r845L665K756p786R268J8173
$$ y = [196747, 198605, 192488, 200368, 191497, 195789, 203607, 194658, 178158, 170173, 161012, 162508, 181626, 196704, 208661, 227260, 222990, 248315, 287003, 321013, 351905, 387172, 438561, 526726, 650907, 834118, 1135094, 1556347, 1884977, 1921788, 1788443, 1540173, 1205764, 908660, 708544, 580942, 502995, 451219, 407435, 385071, 361312, 344200, 340079, 324060, 324631, 305232, 267603, 235850, 220870, 214502, 215324, 216594, 209105, 202040, 197598, 193914, 194664, 186527, 170033, 164648, 157794, 150869, 158924, 160709, 151508, 151349, 139375, 142232, 145570, 134103, 141351, 149733, 150454, 150510, 146777, 134495, 129465, 129175, 138383, 146829, 156123, 158282, 174595, 166298, 144247, 139250, 143699, 143568, 142424, 139895, 150942, 151603, 146403, 146562, 158523, 164344, 180388, 185626, 175781, 179446, 182202, 174416, 183684, 201857]
11224B01857J3598L742p791j0996l663J2125J1192o907r58J6712J6082N409J343
11211B51745Q424O232r23l433j8298k6828k3505k8730J41K100K3684j3k634o169
11197A81793k0464k7937r134J558L621L883Q453J0118J223n7J0509n40p234J7122
11183A72914N569k2625j8440L394J8864J4161P712n674o544j5126R49j148K147
11170A56153K720J345n89p305n305l458J3261P289J246J771O592N11l626r406
11156A61199k191R851O747K2642J1264n00K400J2632J259j7100j6140q907K5043
11143B08199K4904K8063Q262j1103j2151k5674j6515j3910k8154k7984n962J198
11131A29173J6913J9528J7573m89j8719j0035J0071j5005L980j855j5837n396
$$ y = [201857, 215455, 219197, 211406, 200410, 196747, 208872, 220064, 213157, 212199, 228911, 244993, 250402, 251745, 260169, 266401, 265478, 262045, 243747, 216919, 193414, 164684, 164825, 166925, 190609, 190596, 187962, 181793, 161329, 133392, 124258, 125816, 129437, 133320, 141773, 151891, 153114, 153057, 163566, 163026, 155792, 172914, 178483, 155858, 137418, 140812, 159676, 173837, 181549, 175875, 169331, 154205, 155154, 154006, 156153, 158873, 160218, 159629, 152324, 147019, 143561, 156822, 164111, 165357, 167128, 173720, 174231, 170605, 161199, 159008, 168859, 175606, 198248, 209512, 209012, 211412, 224044, 225303, 208203, 192063, 183156, 208199, 233103, 261166, 269428, 258325, 246174, 220500, 203985, 190075, 161921, 133937, 127975, 129173, 146086, 165614, 183187, 182698, 163979, 153944, 164015, 149010, 152990, 151135, 135298, 129902]
11119A29902J3436j003r670l464J3463K2545J2721J4940m468j2527j5004j7583
11107A43288j5074j9458l627K952l733r122l170R912J3896Q257L414J1702J7029
11094A56266k411R312j644p850J2182K5013K545n616l49N153N19k1086m5731n3068
11080G3235l3600l7302k0306K1385L7354L5619J7844J405q506k616Q371J3497
11068A06380Q854R10r396M398Q372j300k243K137j062j9752j7913M7M300M110
11054H7842J2396p854K033R141k499k1619k8014m0444j1887J3329J9249M1693
11042G3366N3945L5773J9428L3160J6796L258l941J6407L779p839k008K759J8520
11029B63403R646L052r755J3366N845J5413J2190L6998P3330Q9958R5361N4787
$$ y = [129902, 143338, 142335, 132665, 129201, 142664, 165209, 177930, 192870, 188402, 175875, 160871, 143288, 128214, 108756, 105129, 108081, 104348, 95226, 92056, 101968, 115864, 124121, 127535, 139237, 156266, 153855, 163167, 161523, 153673, 165855, 190868, 193413, 187797, 187448, 192601, 193120, 172034, 126303, 73235, 39635, 2333, -17973, 3412, 40766, 76385, 94229, 95634, 87128, 84512, 92883, 106380, 115234, 116144, 106748, 111146, 119518, 118218, 115975, 118112, 117050, 97298, 79385, 79432, 83732, 87842, 100238, 92384, 94417, 103558, 101059, 79440, 51426, 10982, -905, 12424, 31673, 73366, 127311, 163084, 182512, 215672, 232468, 235726, 231785, 248192, 251971, 244132, 242124, 244883, 263403, 273049, 276101, 266346, 279712, 285557, 300970, 313160, 350158, 423488, 513446, 608807, 663594]
11017F63594j0229p0837j02521j03290o0066l9854k7296k3003n614K4930K6377
11006B72191O928K494k903P901L709n534j2665j1477J2524Q340J0574K2359J9467
10993C33908J1261j086K896l214m550j3440j3524j127K6336K6375J9365P109N312
10980C95621k969q678K443J3615L169R007L1043K251J086N780K639K4092L8556
10967E17655K3126J3988K3353K3087J7170J9179K9738J1580K1023L6549J5951
10956G52399n78L664J4154M244J9763K0434K2955L0472L4114J8318L1129M3153
10944I94221K7135K1523M3463N4813M2660L3796N2982M4551N0268M1480M0101
10933A446993N2379Q4284J16619J32500J36573J44018J31849J49239J32509J24022
$$ y = [663594, 653365, 582528, 480007, 376717, 316651, 276797, 249501, 226498, 220884, 245814, 272191, 279119, 281613, 278710, 286611, 290320, 284786, 272121, 260644, 273168, 281508, 292082, 314441, 333908, 345169, 344083, 346979, 343765, 339215, 325775, 312251, 311124, 337460, 363835, 383200, 390309, 395621, 392652, 383974, 386417, 400032, 403201, 412208, 443251, 445502, 446588, 452368, 455007, 479099, 517655, 540781, 554769, 578122, 601209, 618379, 637558, 667296, 678876, 699899, 736448, 752399, 751821, 755485, 769639, 773883, 793646, 814080, 837035, 867507, 901621, 919939, 951068, 994221, 1021356, 1042879, 1086342, 1141155, 1183815, 1217611, 1270593, 1315144, 1365412, 1406892, 1446993, 1499372, 1583656, 1700275, 1832775, 1969348, 2113366, 2245215, 2394454, 2526963, 2650985]
10923B650985J33258J35856J41404J71050K14520K76056L83090N01939O63716
10914E271874Q00966P49298N24564M93696N29908N90670P94961J116512J524926
10905A2397375J952085K359172K730059L180633L932843M850620O180949Q377111
10897D5960847J1815049J7314603K6437787M1572391O4035341P9178516M5465606
10890C31780140q861710k8679767m9602669o4745749n2646456l3807335k1125014
10883G2311440j3475079q790764n868228l930433l050739l113641l327766l467520
10875B7287270l408458k960226k376276j874229j462649j101300q17225p94141
10867A2492766r71452r77665r74199r68644q75103p32584o27356n69792n02487
$$ y = [2650985, 2784243, 2920099, 3061503, 3232553, 3447073, 3723129, 4106219, 4608158, 5271874, 6072840, 6822138, 7346702, 7840398, 8370306, 8960976, 9755937, 10872449, 12397375, 14349460, 16708632, 19438691, 22619324, 26552167, 31402787, 37583736, 45960847, 57775896, 75090499, 101528286, 143100677, 207136018, 286314534, 331780140, 322918430, 294238663, 244635994, 179890245, 127243789, 93436454, 72311440, 58836361, 50045597, 44177369, 40246936, 37196197, 34082556, 30754790, 27287270, 23878812, 20918586, 18542310, 16668081, 15205432, 14104132, 13286907, 12492766, 11521314, 10543649, 9569450, 8600806, 7725703, 6993119, 6365763, 5795971, 5293484]
10858E293484m35791l78848l31842k92299k58773k21117j80332j15044o7281p6259
10848B935898j13668j35422j49627j78890j68830j62168j43123j31719j03789
10839A648662q0094p7848n0459m0772m2323l9041n3147m3625k8129j3853q809
10828A170562k6554k5159k6523l8062l7250n8592n2811m9005m1471m5507m4298
10817G25330k5993l8419k1337j0518k5795o582p927j1471q501q977l6837k1800
10805E01173j8914j3347n158j3418r355r493k0405j0052M492M264J356p993j1564
10792C91586r982j9848j9022n144j6431m003m546l442L756N205R173n38j3987
10779C12777n90j2628l467N323J6980J5441J1741J3308J5227J7295L997n036j1575
$$ y = [5293484, 4857693, 4478845, 4147003, 3854704, 3595931, 3374814, 3194482, 3079438, 3012157, 2935898, 2822230, 2686808, 2537181, 2358291, 2189461, 2027293, 1884170, 1752451, 1648662, 1568568, 1490720, 1440261, 1399489, 1357166, 1318125, 1264978, 1221353, 1193224, 1179371, 1170562, 1144008, 1118849, 1092326, 1054264, 1017014, 958422, 905611, 856606, 815135, 769628, 725330, 699337, 660918, 639581, 629063, 603268, 596686, 588759, 577288, 568787, 559810, 522973, 501173, 482259, 468912, 463754, 450336, 440981, 431488, 411083, 401031, 405523, 409787, 411143, 403150, 391586, 381604, 361756, 342734, 337590, 321159, 317156, 312610, 309168, 312924, 318129, 327302, 326764, 312777, 312187, 299559, 296092, 301415, 318395, 333836, 345577, 358885, 374112, 391407, 395404, 390368, 378793]
10766C78793P509q382o2621p6236n0489k1069K810k216J0316J6322J7170K0646
10754B32553j487l619k6056j7092r551J316j664j5063j210M50L537j473J295J0311
10740A72247n838K502M6386O8265N4467P850k1682k6079k3769l8183k4742k710
10728B08714K78j6821n371o162j8271L676q282J5939L931r202p320m271l352R028
10714A62514J2705J2673J0339K1087J3336Q002k395J4222L1897O0110N8501Q7683
10702D90674J38457J73829K02883J6992j06030j13354j87195j88536j13323o1600
10692B52797l7562j4808q846o375p148j0516K548P056r584J078J0553j3039k383
10679A63771q362j2037j0241j3622k7542j4128o058n183q463j0761N734P869j2852
$$ y = [378793, 386302, 377920, 315299, 239063, 188574, 167505, 170315, 168099, 178415, 194737, 211907, 232553, 231066, 227447, 201391, 184299, 174748, 176064, 174400, 159337, 158127, 158577, 162114, 160641, 161936, 172247, 166409, 168911, 215297, 283562, 338029, 345879, 324197, 298118, 274349, 236166, 211424, 208714, 208992, 192171, 186800, 180638, 162367, 166043, 157761, 173700, 177631, 168429, 161109, 156838, 153486, 162514, 175219, 187892, 198231, 219318, 232654, 240656, 238261, 252483, 284380, 344490, 402991, 490674, 629131, 802960, 1005843, 1022835, 916805, 803451, 616256, 427720, 314397, 252797, 215235, 200427, 191581, 185206, 178058, 167542, 170090, 177146, 167562, 168640, 179193, 166154, 163771, 155409, 143372, 133131, 119509, 91967, 77839, 71781, 66598, 58135, 47374, 53108, 60977, 48125]
10666D8125l32J1953J2804K8757J1170r848j3825l497N322P53m93j5039j0954
10653F4896j0171P584J6685J2334O105L815O89j0148j7629J3263J4046N220j317
10640A05372J5008K8733J6400M635m072j7121k1300k3035j8327q953j3985P295
10628G0650J8267J8784N569j1138k2115k1847l227J811j4739r598l050Q442M980
10615D2789M707J5875r967r459o951L46n195j542r229J434J1689M632k527o426
10601C0176m750K201J2444p100J791m305N51r09J2210j0701p706k247L1610L1914
10587H5179J3837P20Q916j8701j6620K371M150M983J3280O823j6045k152J1213
10574I7954J0776N121n197k665M952q400j3209r096j5415o523k931P995k023l943
$$ y = [48125, 47793, 59746, 72550, 101307, 112477, 102629, 88804, 85307, 90629, 91382, 90889, 75850, 64896, 54725, 62309, 78994, 91328, 97433, 101248, 101937, 91789, 74160, 87423, 101469, 106689, 105372, 120380, 149113, 165513, 170148, 166076, 148955, 127655, 104620, 86293, 77340, 63355, 70650, 88917, 107701, 113270, 102132, 80017, 58170, 54943, 56754, 42015, 32417, 29367, 37809, 42789, 47496, 63371, 53404, 43945, 36994, 37340, 32145, 30603, 21374, 22808, 34497, 39129, 36602, 30176, 25426, 27627, 40071, 32971, 34762, 30457, 31008, 30099, 42309, 31608, 23902, 21655, 53265, 85179, 99016, 99736, 108652, 89951, 73331, 75702, 79852, 84835, 98115, 104938, 88893, 86741, 97954, 108730, 113851, 108654, 105989, 110941, 102541, 89332, 80236, 64821, 58298, 55367, 63362, 61339, 57396]
10560E7396j904j6341q740L956R22j2784n93m403q776J140K3497K1910J3893k78
10546F8895j3658k6877m298J8192K271j6956L024n211n066N445l236K395J0292
10533C5212Q276J5165R048L320R305j0754k053r88q186j1790l745k608J1551N898
10519E7651o300p585m198j106n171q825K870q626m958M393l292n15J6584N696
10505C6618Q986m224j0422Q133R533o829M009J5354O190M184p36N440k149j0928
10491F3159R069J5376J2720K4525K4341K5709L2038L4736M8151Q0225J24850K00475
10479F95374L06066L99946L46701N8571j23701k30289l23251l14595k18275j39038
10469D57509q2743m7071l3645l7220l4609q478j1337r850k7412j9043j3670k2642
$$ y = [57396, 55492, 39151, 30411, 34367, 35289, 22505, 21912, 17509, 8733, 9873, 33370, 55280, 69173, 68895, 55237, 28360, 24062, 42254, 44525, 27569, 30593, 25382, 20316, 25761, 22525, 24920, 35212, 43488, 58653, 67701, 71021, 80326, 69572, 67519, 66531, 58345, 46555, 42810, 40202, 51753, 57651, 51351, 43766, 39568, 38462, 33291, 24466, 27336, 18710, 13752, 18145, 14853, 14338, 30922, 36618, 45604, 41380, 30958, 39091, 48624, 41795, 45804, 61158, 67348, 71532, 70796, 76236, 74087, 63159, 72228, 87604, 100324, 124849, 149190, 174899, 206937, 241673, 289824, 370049, 494899, 695374, 1001440, 1401386, 1748087, 1806658, 1682957, 1452668, 1129417, 814822, 596547, 457509, 374766, 327695, 294050, 256830, 222221, 213743, 202406, 192556, 165144, 146101, 132431, 109789]
10457A09789j8138j3138l844O708q565L936j2607j2159o443m94l38n772q554j3022
10443A7359j5610L504P379Q614N807n569r497q014J0070l346j64O9J793K333p445
10428G283J4333M013J773Q895K522k05k1334j2542k166K0648J1383R023J444m993
10414D0077p891L256K069j1141j0047m08q557n988L271P813K081j1300l451O375
10400F159R677J740L203J0073N031j297j285l058j316k129R46J545l64L682n013
10385B7594L253j107p64l663j0779r31m422O051n69m721p260K650q004J496J3060
10370A1884P903K598J0576P164J398j2202M266O45o419j3079K457J2392q724o510
10356A4349R624J2203M465q833k012N797o792k3063q845R04J2420m591j1283J81
$$ y = [109789, 91651, 78513, 74669, 81377, 72812, 76748, 64141, 51982, 45539, 45045, 44707, 38935, 30381, 17359, 1749, 5253, 12632, 21246, 27053, 21484, 11987, 3973, 14043, 10697, 10533, 10602, 12395, 14728, 7283, 21616, 25629, 27402, 36297, 38819, 38614, 17280, 4738, 2572, 23220, 34603, 43626, 45070, 40077, 32186, 35442, 37511, 26370, 16323, 15915, 7358, 1370, 4641, 12454, 14535, 3235, -216, 6159, 15836, 17576, 20779, 30852, 35883, 34586, 33301, 30243, 28927, 26798, 27744, 29289, 28925, 32607, 27594, 30847, 29740, 28976, 25313, 14534, 13603, 9181, 15232, 14663, 9942, 2682, 5332, -2672, -1176, 11884, 19787, 22385, 32961, 40125, 41523, 29321, 33587, 34232, 27813, 14734, 17191, 29583, 20859, 14349, 23973, 36176, 40641, 31808, 29796, 35593, 28801, 5738, -3107, -2203, 10217, 5626, -5657, -5476]
10342e476O161L704o886q36k861n333M019J6305M866J895r059N615Q44j1051m862
10327b955k26J0387O985K210N112j06j3768m881J5241j2102k354o939j955J0225
10313D874n990M658J7016Q753m074N88p041o089K123j3405k138J7259m644j265
10299A0625j3915m397J0877M362n178r205J3903P161K089N326N714l870n532j4249
10285C711j0265J838J2377Q388J560k736N128L374j2703n342L254K640P555K097
10271B0876N90o770k108N764J478l1493k4060N153R355L328j717l309K403R548
10257a0962O035j1084r38K1306J1731j271p496L431J4552J698n214j0900J431
10244A2319r2n367j4635j7059J886J3564O913O709K052k71L162M858P36k6215
$$ y = [-5476, 685, 4389, -2497, -3333, -6194, -11527, -7508, 8797, 13663, 15558, 6499, 12114, 12958, 1907, -2955, -3181, 7206, 14191, 16401, 21513, 21407, 7639, 2758, 17999, 5897, 3543, -3396, -5351, 4874, -1116, 3542, 20558, 29311, 25237, 25825, 18784, 12695, 14818, 1413, -725, 16534, 11890, 10625, -3290, -7687, 3190, 7552, 2374, -6831, 7072, 14233, 16322, 21648, 27362, 23492, 17960, 3711, -6554, -4716, 7661, 16049, 17609, 14873, 20001, 23375, 10672, 5330, 8584, 11224, 18779, 20876, 21466, 14696, 12588, 18352, 19830, -11663, -35723, -30570, -21215, -17887, -19604, -22913, -20510, -10962, -4927, -16011, -16949, 4357, 16088, 14817, 7321, 10752, 25304, 27002, 21788, 10888, 12319, 12227, 6860, -7775, -24834, -22948, -9384, -2471, 4238, 6290, 6019, 9181, 14039, 14775, -11440]
10230a1440L249K0438N2J2810k239o754m801k564K727M78k12o736k421L620m506
10215A701J0822K285L616l598M618R646l655j6204j6423k652P300O705J4113J2995
10201C1269j4622k967M800K927k361j2261R14n655j3996J3706R187r405J0019
10188A1555J5357l068r179P985j212j1540j0345M425J7569l910j2457K379r478
10175a919j3J1712j1367o376J2913L754m693P813k452n495K878l978p284m556
10161i063r54J142N396J860k0699O853R745M983J194J1790J91n771N38J2823O371
10146B6399j1133n967j1439j1626q47J8818J3824l953r065n370j825J0686m852
10133C650O54l764P893m468N367l286M299j538k537J214M113m448o728j9032j2205
$$ y = [-11440, -8191, 12247, 12299, 25109, 22870, 16116, 11315, 8751, 11478, 11956, 11744, 5008, 2587, 6207, 1701, 12523, 14808, 18424, 14826, 19444, 29090, 25435, 9231, -7192, -9844, -2544, 4161, 18274, 31269, 16647, 13680, 18480, 21407, 19046, 6785, 7699, 2044, -11952, 1754, 10941, 1536, 11555, 26912, 23844, 14665, 22650, 21438, 9898, -447, 3978, 21547, 17637, 5180, 7559, -1919, -1932, 9780, -1587, -7963, 4950, 8704, 4011, 11824, 9372, 3877, 6755, 2777, -4507, -9063, -10017, -8875, -3479, -1619, -22318, -15465, -5720, -737, 457, 12247, 12438, 6667, 7205, 20028, 26399, 15266, 9299, -2140, -13766, -14613, 4205, 18029, 14076, 5011, -359, -2184, 8502, 3650, 4304, 540, 8433, 3965, 9332, 6046, 10345, 8807, 6270, 7484, 11597, 7149, 421, -18611, -30816]
10118c0816J0941K0314K0389Q451j6176j7021l652N664N135J0774N986J7503j3447
10105B4045m408N443q349j7746K265M468L835j1098l704l979Q156N229q531j2634
10091a7008n577J5792O135J1326n028p80J0179j4780l661l179r737J0738J64L121
10077b295n763l617m184K020n846R634J686j722o896j0910k088M175n293O938
10063b4161l815j3285N264P808k684Q388J8624J7303j2856k0249Q849J875j2024
10050b0963l808L804J2324q513k427p97J415o264J0588J3915j270l425p990m371
10036a7782Q018L549m98J515R62O09O620O32j0437o322P990o463Q967P251j177
10021C434L908R89r876j3186m31P524J329L239m373j353R201J0018j2236k148
$$ y = [-30816, -19875, 439, 20828, 29279, 13103, -3918, -7570, -1906, 3229, 14003, 19989, 37492, 24045, 19637, 25080, 16731, -1015, 1250, 5718, 9553, -1545, -5249, -9228, -1072, 4157, -4374, -17008, -22585, -6793, -658, 10668, 5640, 4860, 15039, 259, -3402, -6581, -16318, -5580, -5416, -2295, -8058, -11675, -15859, -13839, -19685, -10051, -8365, -10087, -16983, -27893, -29981, -25806, -31099, -24161, -27976, -41261, -35997, -28189, -30873, -22485, -3861, 13442, 586, -19663, -10814, -8939, -20963, -24771, -20967, -8643, -17156, -19583, -20380, -18965, -25229, -14641, -726, -1996, -5421, -13411, -17782, -9764, -6215, -6713, -5198, -4236, -3627, 2993, 3625, -6812, -13134, -5144, -11607, -2640, 4611, 3434, 7342, 8331, -1545, -14731, -15162, -7638, -6309, -3070, -7443, -8796, 405, 10423, -1813, -3961]
10007c961Q621M693N397O975K81l575j0984m551o165k393O615O865r534O966L402
9992H652J1118N303n417m606j2207j4832M310N282m136M74L396Q313l572p251
9978e173k162O163M320Q575Q934j3136r369j3512l501L815k424N609j31L36m114
9963a5770P330L795N742L811q477k263K343q000j6049J0324J2635R81l926J2883
9949E359J8027r997m177n136l025Q948O90j1060O066O115l667L287J803M816m184
9934A3865j578R147q404m106l020J5323J3195N213J5055j4441k3018P534J9236
9921D4001K7732L8855K1106j7076k0217k6782q166j0662k1562m293n794N4m723
9908A2473j2717P770J0951r604j0179j209j6646j0172N413J5937Q431n146q605
$$ y = [-3961, 4660, 9353, 14750, 21725, 22006, 18431, 7447, 2896, -3269, -5662, 953, 7818, -1716, 5250, 8652, 19770, 25073, 19656, 15050, 2843, -11989, -7679, -2397, -6533, -6059, -2663, 5650, 2078, -5173, -7335, -1172, 3148, 11723, 20657, 7521, -1848, -15360, -18861, -15046, -17470, -11861, -11992, -11656, -15770, -8440, -4645, 1097, 4908, -3569, -5832, -3489, -11489, -27538, -17214, -4579, -3598, -7524, 5359, 23386, 13389, 9212, 4076, 1051, 9999, 10689, -371, 5695, 11810, 8143, 11430, 13233, 18049, 13865, 12287, 21434, 13030, 8924, 5904, 21227, 34422, 39635, 54690, 40249, 17231, 24765, 44001, 71733, 110588, 131694, 114618, 94401, 67619, 59453, 48791, 27229, 22936, 17142, 17196, 12473, -244, 7526, 18477, 8873, -1306, -2515, -19161, -29333, -23920, -7983, 448, -4698, -13303]
9895a3303k339l434p750K965Q533N953L684P67N669J0385M561j428m306M576P24
9880A5257p681L130m007p524L990J6870p74k97j488n314j6714J540P984Q297k087
9865A1182l435l284K743r412o094K851L130n754K138K011j015q296N785P437J4295
9850A4282M537j5647j1151P475O646k611k778O234l220M062m615j0308m811J453
9836a0452O525K819J3380M430r833j0352L499l359m248n167L075L370J4340J0198
9822A8225j1462j8593k439p270O648N11j247R827J1605j3596k037L167q216n938
9808b0815R923L492R2o864k758l515j0447L65K0800P617o620K562N603m76k030
9793c071k628J372J717N121P326j0041j1811j4028J280K109o404K835K523J638
$$ y = [-13303, -15642, -19076, -26826, -23861, -15328, -9375, -5691, -4924, 745, 11130, 15691, 14263, 9957, 14533, 15257, 7576, 10706, 6699, -825, 3165, 20035, 19261, 18964, 17476, 12162, -4552, -3012, 4972, 13269, 11182, 7747, 4463, 7206, -2206, -8300, -5449, -2319, -8073, -5935, -3924, -4939, -13235, -7450, -13, 14282, 18819, 3172, -7979, -504, 6142, 3531, 753, 6987, 3767, 7829, 3214, -7094, -11905, -10452, -3927, -1108, 12272, 16702, 6869, -3483, 16, -3343, -7591, -12758, -9683, -6313, 8027, 18225, 6763, -11830, -14269, -21539, -14891, -14380, -15627, -5800, 5805, -7791, -9828, -6661, -14877, -20815, -10892, -7400, -7308, -14172, -16930, -20445, -30892, -30527, -9727, -2110, -8730, -6168, -565, -1041, -3071, -5699, -4327, -2610, 2511, 9837, -204, -12015, -26043, -24763, -22654, -29058, -26223, -23700, -22062]
9779b2062J388K801j753J959P28J1902j95L814J273q676k5588N374J7828J4141
9765B934q265r594j927j833q137O370L985R973j408l327j100R369q546r590J536
9750a9560M093J4316L844Q07r660j1258N744J550q879R877L017J2049R105J219
9736A6264n414j8553n1j4849r552o53L062O188P627K465J1910K109j6563L625
9722a2385J0857P436J2323j8055k3558j327J2371J0784K34m134m289J6401Q298
9709A4956J0888L925o536p660j2805r797K3971J5933m44n891j207j4483J371O560
9695A8781r07m875M010p737o840K195n348m838m518j5022j2771P237l261J3981
9681a9913J0654L720L923p113q293j394K329J9076J2224O399L862m155O77O76
$$ y = [-22062, -20674, -17873, -19626, -17667, -16939, -5037, -5232, -1418, -145, -8821, -34409, -29035, -11207, 2934, -5331, -14925, -16852, -18685, -26822, -20452, -16467, -6494, -7902, -11229, -12329, -2960, -11506, -21096, -19560, -15467, -1151, 2693, 3500, -6160, -17418, -11674, -10124, -19003, -9126, -6109, 5940, 15045, 16264, 10850, -7703, -7754, -22603, -32155, -32808, -29746, -23558, -15931, -13466, -1556, 553, -16010, -12385, -1528, 5908, 18231, 176, -23382, -24709, -12338, -1554, -1320, -5454, -9743, 6658, 14956, 25844, 29769, 23233, 15573, 2768, -7029, 16942, 32875, 32431, 26540, 25333, 10850, 12221, 18781, 17874, 12999, 17009, 9272, 2432, 4627, -721, -5559, -10077, -25099, -37870, -30633, -33894, -19913, -9259, -5539, -1616, -8729, -17022, -18416, -16087, 2989, 15213, 21612, 25474, 21319, 21996, 22672]
9667B2672m765j3697n175M947M860Q985l380k767j484j5787n173j815n900r719
9653b8198K4847J0851o260K543N144J037L130R462j676j1546m095L07n96p542
9639b592L969Q15J3217m144j724m8K444p537m741J977q360j1723M714J6641o38
9624B270j742J4957N874k577j3023l608m635j910j396P449n592M753L409r571
9610e342j3142J5991P243R399J851m627j4025j4909n210P465M469O356J0581L506
9596I606J0074L385k339k0630j1654P64j1464Q558J4551j0080j140N717K62o04
9582d994J1099n440o09N280P26O649p256l332p52Q22j0749m387k43K400N557M713
9566e16J534N247R478q427j4914m653K737N728J3911J4791P082p305m489k595
$$ y = [22672, 17907, 4210, -965, 3982, 8842, 17827, 14447, 11680, 10196, -5591, -10764, -12579, -18479, -28198, -3351, 7500, 1240, 3783, 8927, 9964, 13094, 22556, 20880, 9334, 5239, 5546, 4950, -2592, 1377, 2192, 15409, 11265, 9541, 9493, 11937, 4400, -341, 1636, -6724, -18447, -13733, 2908, 2270, 528, 15485, 21359, 18782, 5759, 2151, -2484, -4394, -5790, 1659, -3933, 820, 4229, -5342, -18484, -2493, 4750, 14149, 16000, 11373, -2652, -17561, -22771, -15306, -10837, -4481, 6100, 9606, 19680, 23065, 20726, 96, -11558, -10794, -22258, -13700, 851, -9229, -10369, -4652, -4390, -4994, 6105, 665, 56, 5336, 6062, 12711, 5455, 2123, 1371, 2193, -8556, -12943, -13186, -10786, -5229, -516, 1018, 6265, 15743, 7316, -7598, -12251, -9514, -3786, 10125, 24916, 31998, 24693, 20204, 17609]
9552A7609r00m594l624p783j2642j2770j368K0267N322j609N7J0869R041J907
9538A9782j8288l774L378q278P810o257l896N764m722P299J304m29J1779J5942
9524B7414p80k2228O204m930J378n476m23j924o661o773o288l621J277Q029O471
9509h331J4830k131n281L117m059m703q077l639O545P045M650r046j5344M440
9495a9984J6042q016j5625M33J2855P523J4560J4819J464N14O035j0950n285J641
9481A6026j5491j6850J2757J0421Q382L908l746o966k977M47q23r175n493K798
9467f782k200j3636L922M486k847n974J3572L04M333n137n988M080P335m35J8748
9452A3781o396j2225M476N994q239p477r91M804j4494J0219J968l697k750J1829
$$ y = [17609, 16709, 12115, 8491, 708, -11934, -24704, -26072, -5805, -483, -2092, -2035, 8834, 17875, 19782, 1494, -2280, 1098, -7180, 630, -5627, -9523, -3759, -8481, -1182, 122, -307, 11472, 27414, 26634, 4406, 10610, 5680, 7058, 1582, 1159, -765, -7426, -14199, -20487, -24108, -22831, -14802, -8331, 6499, 4368, -913, 2204, -1855, -6558, -14635, -18274, -11729, -4684, -34, -9080, -24424, -19984, -3942, -11958, -27583, -27150, -14295, -6772, 7788, 22607, 24071, 24585, 30620, 19670, 14385, 16026, 535, -16315, -3558, 6863, 15245, 19153, 15407, 8441, 5464, 5911, 5088, -4087, -9580, -6782, -8982, -22618, -18696, -14210, -17057, -23031, -9459, -9155, -4822, -9959, -15947, -11867, -4532, -4967, 13781, 7385, -4840, -364, 5630, -2609, -10086, -11077, -6273, -20767, -10548, -8580, -12277, -15027, -3198]
9438c198O114J913P863m279r012j0208K6850J334j6085q420P131K072o777k816
9424g518k657o590K0375m294j9061M243O258N424o339m404L437m687J1873R230
9410E290j6548l285M259n856r107M27K5447M129L856j0589j2711Q201k985O496
9396b976R336O661r913j8126o73j951o574J233l071R81P517J879N664L35j380
9381a1058p472J395N162j0359R652Q909L415k996J758l40Q219K443j252n508p868
9366e900N889O945n511N989K408p145n533J4640K62j6983j136n06q021R840J3385
9351H623k499J211M452q545j0060k674P083l18r724o150k160J2562J5312l440
9337C673o487j4472n942J3128O847J4325M007j3793o218k368p152j387L915J4856
$$ y = [-3198, 2916, 4829, 12692, 8413, -599, -10807, 16043, 17377, 1292, -7128, 3, 2075, -4702, -7518, -10175, -16765, 3610, -684, -19745, -15502, -9244, -3820, -10159, -14563, -11126, -15813, -3940, 5290, -11258, -14543, -10284, -16140, -25247, -24820, 627, 4756, 8612, -1977, -14688, -6487, -9472, -2976, 6360, 13021, 3108, -15018, -15691, -17642, -24216, -22983, -26054, -25073, -17556, -15677, -10013, -9678, -11058, -18530, -17135, -11973, -22332, -12680, -3771, -356, -3352, -1594, -1934, 6285, 8728, 7476, 1968, -5900, -11, 6934, 1423, 7412, 9820, 2675, -2858, 11782, 12044, -4939, -6075, -6581, -14602, -4762, 8623, 6124, 7335, 11787, 3242, -6818, -9492, -2409, -2727, -12451, -18601, -20761, -8199, 7113, 3673, -2814, -17286, -23228, -10100, -3253, 11072, 15079, 1286, -4932, -7300, -14452, -15839, -11924, 2932]
9323B932M738Q368j823k919m906n138j737j5082o637J7866Q835r343O635o201
9309d412K016R306m175L414J0980m945o707N722R4R560O438l175j024L833J962
9294B8887k825p429M888M131p204o92r914j6510J262Q188m385N425j0775n450
9280a2403m056Q303K2101Q019j2638j5493n597K898r11N682J396j3645Q630L116
9266d598L359R145r515J0533J7178P638m242j5463k181k2383oJ4070k609p419
9252f493N39P312O126l10m507m881L694O337J0934m508p857m52J3337J3627n626
9237B7272L406j1139j3357N483J326L029N474M392j8052p640m5L126j3666p532
9223a7923J0834M952J1476N915N584P389j1105j0247n93J198K008J5160j977l154
$$ y = [2932, 7670, 16038, 14215, 11296, 6390, 1252, -485, -15567, -22204, -4338, 4497, -4846, 1789, -4412, -2396, 6910, 2735, 6149, 17129, 12184, 5477, 11199, 11293, 20853, 27291, 24116, 23092, 26925, 28887, 26062, 18633, 23521, 27652, 20448, 19756, 9842, -6668, -5406, 2782, -1603, 3822, -6953, -12403, -16459, -8156, 13945, 21964, 9326, -6167, -11764, -8866, -9777, -4095, -2699, -16344, -7714, -4598, -1239, 7906, -1609, 8924, 26102, 33740, 29498, 14035, 11854, -10529, -10535, 3535, 926, -6493, -5954, 1358, 7484, 7174, 2667, -2214, 1480, 7817, 18751, 14243, 6386, 5934, 19271, 32898, 27272, 30678, 19539, 6182, 11665, 12991, 16020, 21494, 25886, 7834, 194, 149, 3275, -10391, -17923, -7089, -2137, 9339, 15254, 20838, 28227, 17122, 6875, 6282, 7480, 9488, 24648, 22671, 19517]
9209A9517J0522K2655o55r079n52j1688J1542K0312J0053P116K1211K4523L8822
9196A64299P8221J01094R1754K9549j9118l8845o5419q1571q5711n2731k0378
9185A01144k3736j9196j7253M095k599j2994J8345J2981l363j9581J100M363j1710
9172C1596p989K26R531N521J3353m354m592K938J0945K766J341O267J0004L736
9158H1289J1064K4015M405K5217L5568N8708P7022R7436J58396K03140J28846
9147I05106j6483q0587j28491j65093j41296q5259m9309m3368m1924k1189k3926
9136A08181k0134j1335N881L103L946J5541j0414j8036K496l313j7206o351J3827
9123F6186K407j6054j2563o155n791P973N404m549q390q55J2380J5068J9011J4031
$$ y = [19517, 30039, 52694, 52039, 42960, 42408, 30720, 42262, 62574, 72627, 79743, 100954, 125477, 164299, 242520, 343614, 435368, 464917, 445799, 406954, 341535, 259964, 174253, 121522, 101144, 77408, 58212, 40959, 45054, 42455, 29461, 47806, 60787, 57424, 37843, 38943, 43306, 31596, 23607, 23833, 33364, 38885, 52238, 47884, 43292, 46230, 57175, 59941, 61282, 67549, 77553, 81289, 92353, 116368, 120773, 145990, 181558, 240266, 317288, 414724, 573120, 776260, 905106, 888623, 808036, 679545, 514452, 373156, 287897, 238588, 195220, 153296, 132107, 108181, 88047, 76712, 82593, 85696, 89642, 105183, 94769, 76733, 79229, 75916, 58710, 52359, 66186, 68593, 52539, 39976, 33821, 28030, 36003, 41407, 36858, 28468, 27613, 39993, 55061, 74072, 88103]
9109H8103r50J5464K8627N4764Q1134J02241O3043m620k8307m7079p8614q7193
9097A86613m9011j9617o027j4463j8184j0597J3984j021m433M257q113l812r668
9084E9908p323J503M80n065q778p766j569k2931m882N207K792J5244r56K469p098
9069B1235o881m983o783j6328K463J2829o463k0647j4943J3446R221K1295J4922
9056A8383p620J2504m370j4020r916P694P230m019M984O752K4107L501q09Q484
9042E2885K655J0780m867j2978j8271l605r682K113j797L03R970K226q883n981
9028A4868J0928N601m592l325n972O035J3355n409j293k324K673l063K753M554
9014C4789P539R443J2748Q85M31L245M912q057M966Q142p506j4663o236K2891
$$ y = [88103, 87153, 102617, 131244, 186008, 267142, 369383, 432426, 427806, 399499, 352420, 273806, 186613, 137602, 117985, 111958, 97495, 79311, 68714, 82698, 81677, 77244, 81501, 73388, 69576, 59908, 52585, 54088, 54568, 49503, 40725, 32959, 31390, 8459, 3577, 8784, 11576, 26820, 25864, 28333, 21235, 14354, 9371, 2588, -13740, -11277, 1552, -4911, -25558, -40501, -27055, -17834, 3461, 18383, 10763, 23267, 18897, 4877, -5039, 2655, 9885, 5866, 10850, 17602, 41709, 45210, 44401, 52885, 55540, 66320, 61453, 48475, 30204, 26599, 16917, 19030, 17233, 17536, 27506, 29732, 20849, 14868, 25796, 31397, 26805, 23480, 17508, 23543, 36898, 31489, 30196, 27872, 30545, 27482, 30235, 34789, 42328, 51771, 64519, 65404, 65835, 69080, 73992, 65935, 70901, 79043, 71537, 56874, 50638, 73529]
9000G3529O376J3679l419M730p073L362o989j6270j1338K0871R17r581p854n685
8986E5255J6864j6614k3270M481L414k4700j9426m91R763K059N515J1476J3596
8973C7922J4022P636K555l309n310J0066J6434j4845o513n44p828o15M170J7729
8959G1570m059j9012q46N125K1636P244k984j2431k0375j3834j411M929Q914J6605
8945F1071K7129K8457q363j4692K090r102j2277k6110l2237o503j338J2777J2877
8932C3779M388O718J0242K746J3850L439R316R148j970K0856M3352K5576o037
8919A75403r954j6799k0296j7552j7943k0298p305M49Q883M573k060L045j4734
8906F5412j6264j1327j3844j4500J7402L3301L5918M5104J6811P789Q263J7472
$$ y = [73529, 79905, 93584, 90165, 94895, 87822, 91184, 84195, 67925, 56587, 77458, 78375, 68794, 60940, 55255, 72119, 55505, 32235, 36716, 40130, 15430, -3996, -4487, 5276, 7335, 12850, 24326, 37922, 51944, 59580, 62135, 58826, 53516, 63582, 80016, 65171, 58658, 58114, 50286, 49671, 53841, 71570, 67511, 48499, 47653, 52778, 74414, 81658, 78674, 66243, 45868, 32034, 30623, 35552, 44466, 61071, 88200, 116657, 108294, 93602, 95692, 86590, 74313, 48203, 15966, 9463, 8125, 20902, 33779, 38167, 44885, 55127, 57873, 71723, 75162, 84478, 93626, 91656, 112512, 155864, 181440, 175403, 165449, 148650, 128354, 110802, 92859, 72561, 65256, 65705, 74588, 79161, 77101, 80146, 65412, 49148, 37821, 23977, 9477, 26879, 60180, 96098, 141202, 158013, 165802, 174065, 191537]
8894A91537O811j38p74J0163J3271R543L2915J5847J2059P704j972q386r925J0105
8880B88760K2165J0470K0436M9516N1854K4968j7605m2458n1629n1804l5340k876
8868B66457J2924K5801L8991K4309j0343j4501j2025q965o296j6744j4217J3935
8856B99326K289K353M6943L9774L1864L6023L1441J3881K901R221K5489L2696
8844E74201M9282M0381K9066J2013P194L100M264J0497Q757J9230M7976M9151
8832H55112N1434O6237M7369J3301J0834J7665K4837K6262N2011P2086O4577Q8030
8820A389755P2955M9015L9058M4180M5936P3400J13770J42050J77736K19608K88018
8809B655481L68504M73164N77594O20151O46370P58584R37701J217085J608498
$$ y = [191537, 198348, 198210, 197436, 207599, 220870, 230413, 263328, 279175, 291234, 298938, 296966, 288580, 278655, 288760, 310925, 321395, 341831, 391347, 443201, 468169, 450564, 408106, 356477, 304673, 269333, 266457, 279381, 305182, 344173, 368482, 358139, 343638, 331613, 322648, 316352, 299608, 285391, 299326, 301615, 303968, 350911, 390685, 422549, 458572, 490013, 503894, 506795, 516016, 541505, 574201, 623483, 663864, 692930, 704943, 712137, 715237, 719501, 729998, 738755, 757985, 805961, 855112, 906546, 972783, 1020152, 1033453, 1044287, 1061952, 1086789, 1113051, 1165062, 1237148, 1301725, 1389755, 1462710, 1511725, 1550783, 1594963, 1640899, 1714299, 1828069, 1970119, 2147855, 2367463, 2655481, 3023985, 3497149, 4074743, 4694894, 5341264, 6099848, 7037549, 8254634, 9863132]
8800I863132K196424L098966M516432O843833J0774864J6429599J9814643J1715691
8792H5253584j319184p329340j2745443j6043403j3167273q612641n427663l525619
8784A7083018k355993j602116j081379p90552o89368o56707o73907o73482n89172
8775G970342n11032m62156l83016k99165k43191j39168m6197L5269J27026K51798
8765F300510L74451N05998O94650Q73824R78707J055941J311453J682640K188013
8756A5966187K887289L920219N531446Q071337J2314250J9645882L1532600M2127954
8748A41997164K7583257j835257j3239292k4425049l3430048k7993245j8162739
8741E0494791j1343949p294616m830977l277054k250865j644088j386861j340847
$$ y = [9863132, 12059556, 15158522, 19674954, 26518787, 37293651, 53723250, 73537893, 85253584, 83934400, 76605060, 63859617, 47816214, 34648941, 26036300, 20608637, 17083018, 14727025, 13124909, 12043530, 11252978, 10563610, 9906903, 9232996, 8559514, 7970342, 7459310, 6997154, 6614138, 6314973, 6071782, 5932614, 5886417, 5921686, 6048712, 6300510, 6674961, 7180959, 7875609, 8749433, 9728140, 10784081, 12095534, 13778174, 15966187, 18853476, 22773695, 28305141, 36376478, 48690728, 68336610, 99869210, 141997164, 169580421, 167745164, 154505872, 130080823, 96650775, 68657530, 50494791, 39150842, 31856226, 27025249, 23748195, 21497330, 19853242, 18466381, 17125534]
8733A7125534j412127j480515j325152j143731j097544r60575q05650o93141n70623
8724G636476m52882l41614k27373j34114p9980J3412Q6650J95951L05755L74023
8714G376304M97030P06740R53670J304268J810999K563203L712338N615947Q778861
8705C3319360J3717108J8565190J5111569K022872n931798j0642007j5354631
8698E0807663j4321798r830770o181850l951056k606192j769100j229386r04767
8690A0012744p52740o96813p10873p35959p02651o02340n66134n23195m63180
8681D258859m06703l63449l03236k57441k15838j91372j62745j58456j51017j53020
8671A895582j35106j02786j08832r0624o9224p1295p2013p3891o2819n4971l8975
$$ y = [17125534, 15713407, 14232892, 12907740, 11764009, 10666465, 9705890, 8900240, 8207099, 7636476, 7183594, 6841980, 6614607, 6480493, 6400513, 6413925, 6500575, 6696526, 7002281, 7376304, 7873334, 8580074, 9533744, 10838012, 12649011, 15212214, 18924552, 24540499, 33319360, 47036468, 65601658, 80713227, 82736099, 76804301, 66162294, 50807663, 36485865, 26655095, 20473245, 16522189, 13915997, 12146897, 10917511, 10012744, 9260004, 8563191, 7852318, 7116359, 6413708, 5811368, 5245234, 4722039, 4258859, 3852156, 3488707, 3185471, 2928030, 2712192, 2520820, 2358075, 2199619, 2048602, 1895582, 1760476, 1657690, 1548858, 1458234, 1389010, 1317715, 1245702, 1171811, 1108992, 1054021, 1015046]
8660A015046k8180l1086m4117m4480k7306l6191k5914l8158j5117k1379l7928
8649F65190m1236k5979j0572n225j08k5666j3059j6466J339Q369j726k671k1194
8636E10996j4495j5207O803p001j2200j7399j2238j889m815L875R569K994p248
8623D41745p128r226l4552m0135k8103k0415L30L506m572M520k312j8320Q437
8610B93775J3442N913j659N255q676j0771m583j7392n24m763k1803p440j437r301
8596B30036q704K4820L9354L9580J3194k1797k3275j2666m319j1982o123J502
8584B59620P111J882m780p243J6506K1852K957j853q143j7635k1212j4705j3966
8571B20391o627k475J7615J4718j0646J617P997m303q173j732Q065J0785J4727
$$ y = [1015046, 986866, 955780, 911663, 867183, 839877, 803686, 777772, 739614, 724497, 703118, 665190, 623954, 597975, 587403, 582178, 582070, 556404, 543345, 526879, 528218, 536587, 534861, 532190, 510996, 496501, 481294, 488097, 481096, 468896, 451497, 439259, 437370, 432555, 436430, 445999, 448993, 441745, 434617, 425391, 390839, 350704, 322601, 302186, 302516, 306022, 301450, 305970, 303658, 285338, 293775, 307217, 313130, 311471, 316726, 308050, 297279, 292696, 275304, 274780, 270017, 248214, 240774, 239337, 230036, 221332, 246152, 285506, 325086, 338280, 316483, 293208, 280542, 276223, 264241, 258118, 259620, 266731, 268613, 263833, 256590, 273096, 294948, 297905, 296052, 287909, 270274, 249062, 234357, 220391, 213764, 211289, 228904, 243622, 232976, 234593, 242590, 238287, 230114, 228382, 236447, 247232, 261959]
8558B61959j9412k4676j1808j9522k1081j9834o942j875k429Q034J8696J8970
8546A80080p696j764j078j395j715l50m021j0914o317J3897l637m75q222q590
8532A37803n916m196j898q206j712k5458j4623p61M028J5266P412Q835J8513Q041
8518A37128q513K595O444n58l714J773j0560n336j0194r418j2131q138K752K32
8504H2362P027j3094o021P313j1609m435j2898l029K9314J6446l80K0168j72o345
8490A04647o510N051R42m029n606O41M896O092j816J832J457K043M274k242N610
8475A17282M744j6710o702j2753q588l650O354j2661p945J5495l496j3599m195
8462E3576J1766J2649J607m157K201P890n155k3541p368l97R393L001m627R808
$$ y = [261959, 242547, 217871, 206063, 186541, 165460, 145626, 138684, 136809, 134380, 142414, 161110, 180080, 172384, 170620, 169542, 168147, 166432, 166082, 162061, 151147, 144830, 158727, 155090, 154615, 146393, 137803, 131887, 127691, 125793, 117587, 115875, 90417, 75794, 75033, 79061, 94327, 101739, 110574, 129087, 137128, 128615, 131210, 137654, 137096, 133382, 135155, 124595, 119259, 109065, 99647, 87516, 79378, 82130, 82362, 89389, 76295, 70274, 77587, 65978, 61543, 48645, 45616, 74930, 91376, 90996, 111164, 110992, 104647, 98137, 103188, 104130, 100101, 94495, 95136, 100032, 106124, 104308, 106140, 107597, 109640, 113914, 111672, 117282, 122026, 105316, 98614, 85861, 77273, 73623, 79977, 67316, 59371, 74866, 71370, 57771, 53576, 65342, 77991, 79598, 75441, 77642, 85532, 80377, 56836, 49468, 49071, 58464, 61465, 56838, 66646]
8448F6646l096k913J6385K0970J918j176j2781m532N30p530k686L705L93J6049
8434I1882J3175l565K100j7152j1568J394O234J5773q384n090L275k587l59l298
8420H1830k318l787J555m748o567k839n889p409j103j2053l770J9268J4292p120
8406E9342n571Q577O225J3897m03j972N994K0644N611Q072l727p653J732L7846
8392A48614L6459M8103O7514Q3880R5526M2766j4601m7370o7917p4215n1661l5941
8380B31157l3002j3959j6046j8661j3447j6281j4104j5980m71L826n12j7993K1
8367G4548M077m522m079m076J3084J5992J4596m596p685p739Q017J3093J1673
8354A22383J3259n904j618N885N250K2551L2884M9831O6310J14446J70709K06025
$$ y = [66646, 63550, 60637, 77022, 97992, 99910, 98734, 85953, 81421, 81951, 74421, 71735, 75440, 75833, 91882, 105057, 101492, 103592, 86440, 74872, 76266, 82500, 98273, 89889, 84799, 88074, 85487, 85128, 81830, 79512, 75725, 77280, 72532, 65965, 63126, 57237, 49828, 48725, 36672, 32902, 52170, 66462, 59342, 53771, 62348, 68573, 82470, 82067, 80095, 86089, 106733, 112344, 120416, 116689, 109036, 110768, 148614, 185073, 233176, 300690, 384570, 480096, 522862, 508261, 460891, 392974, 318759, 267098, 231157, 198155, 184196, 168150, 149489, 136042, 119761, 105657, 89677, 89206, 93032, 92520, 74527, 74548, 78625, 74103, 70024, 65948, 79032, 95024, 109620, 105024, 97339, 89600, 97617, 110710, 122383, 135642, 129738, 128120, 134005, 139255, 161806, 194690, 244521, 310831, 425277, 595986, 802011]
8342H02011J26607k6915p6524j15304j65141j37361r5447o3802m5508k0586k2728
8331A59302q578p841k275j5771j2199n358r213P796p78N425K68p629m114r395
8317H9640l019L15j1426L74K568P341r069M502P52p095N39K019M330j183J9083
8302I9671K1108L4799P0487R1993R4647N3770M620l1875n5419r1088o9461n5675
8290A67577l2980j6607k433k0444N44J1241k1633j8817j2167N361Q880k012M178
8277G0688j3843r083O871l248m035k33R386M737k2451j2890J186K52o43k2229
8263D465q542Q253J233q499j0123J0159J4766O183j2781M24J2380J405L863L471
8249B6657p581J1243n841R309M053K720m536j5891r419L813R143J2086O803m879
$$ y = [802011, 928618, 901703, 825179, 709875, 544734, 407373, 311926, 248124, 202616, 182030, 159302, 150724, 142883, 140608, 124837, 112638, 107280, 98067, 105863, 105085, 110510, 110778, 103149, 99035, 89640, 86621, 86936, 75510, 75884, 78452, 85793, 76724, 81226, 81978, 74883, 75422, 77441, 81771, 80588, 99671, 120779, 155578, 226065, 318058, 412705, 466475, 471095, 439220, 383801, 292713, 223252, 167577, 134597, 117990, 115557, 95113, 95657, 106898, 85265, 66448, 54281, 59642, 68522, 66510, 70688, 56845, 47762, 54633, 51385, 47350, 47117, 56503, 61240, 38789, 25899, 27085, 27337, 26694, 4465, -4077, 4176, 5409, -3090, -13213, -3054, 11712, 17895, 5114, 5538, 17918, 19323, 23186, 26657, 19076, 30319, 24478, 33787, 37840, 40560, 36024, 20133, 10714, 14527, 23670, 35756, 42559, 37680]
8235C7680j4285q157O082R663O781J431j1108n643J667L927q174k644j5578p083
8221e441m572N364J177P779J0987J5492j33m177M860L16j4721q014o540o443J4210
8206A0144J2930P042r256p610K94P562K87m549Q409m253p621k295j106k179n549
8191B250m776J0347J1099Q497M448J2053j0301j9722m610q999j7K165O537j951
8177G020M592J8060J0146o214m458j486j0056k664K4088M044K632J306j3365k2273
8163A1372n261J442J597N674p314L850O475O930p73L940P110j4351j6265m860
8149d34O363R228Q88J044r677k37L539N88N750M999Q419J8944o280j2237M619
8134C5516n2o858m893m846j3995P705J649m818J3505R618q992k498m753R947K227
$$ y = [37680, 23395, 15238, 21320, 30983, 37764, 39195, 28087, 22444, 24111, 28038, 19864, 17220, 1642, -5441, -10013, -4649, -3472, 4307, 15294, 30786, 30653, 26476, 31336, 31652, 16931, 8917, 2377, -4066, 10144, 23074, 30116, 20860, 13250, 13544, 21106, 21393, 16844, 25253, 21000, 13379, 11084, 9978, 7799, 2250, -2526, 7821, 18920, 27417, 31865, 43918, 33617, 13895, 9285, 286, 269, 2434, 8971, 7020, 11612, 29672, 39818, 33604, 29146, 27660, 17604, 14940, 39028, 43072, 45704, 47010, 33645, 11372, 6111, 7553, 9150, 14824, 7510, 11360, 17835, 24765, 23992, 27932, 35042, 20691, 4426, -434, 5929, 15157, 16045, 17089, 7412, 7175, 10714, 11302, 17052, 22051, 30470, 49414, 43134, 30897, 35516, 35464, 28606, 23713, 18867, 4872, 12577, 14226, 9408, 22913, 32531, 23539, 21041, 16288, 26235, 28462]
8119B8462q939J1305j0981j2889k0007j434N275M175Q010R763R598M648L743j1842
8105A8887l23k528l401K2789R453j3047j9977J332l294k636q394Q713J0506q847
8091I233q753j90j433j054J3673j1644L115J4569J4601m425q706L238o226j0477
8077E521J0403Q809j072m935L290q49N729k975N306j00j2318n273o491M464j1520
8062b011J0611O171L898M268m385m421n626J146p0N565o817j0034P712R269O349
8047B1625Q560j0652j1166o75O231R116j098k693N909M537o574q579l488l035
8033H018l132N370L677r973M624K631K7J5989p758j2535m104m799J423j144k240
8018c926Q226J2022K011o252P632K244j3390q337r30m273O603K838K0211L367
$$ y = [28462, 19523, 30828, 19847, 6958, -13049, -14483, -9208, -5033, 2977, 12740, 22338, 26986, 30729, 18887, 18564, 16036, 12635, 35424, 44877, 31830, 11853, 13185, 9891, 7255, -1139, 7574, 18080, 9233, 480, 290, -1143, -2197, 11476, -168, 2947, 17516, 32117, 27692, 18986, 22224, 15998, 5521, 15924, 24733, 23661, 18726, 22016, 21167, 26896, 23921, 29227, 29127, 16809, 11536, 5045, 9509, -2011, 8600, 14771, 18669, 22937, 18552, 14131, 8505, 9651, 9581, 15146, 8329, -1705, 6007, 15276, 21625, 30185, 19533, 8367, 7692, 13923, 23039, 21941, 19248, 25157, 29694, 23120, 14541, 11053, 8018, 4886, 10256, 13933, 3960, 8584, 11215, 11242, 27231, 19473, 6938, 2834, -1965, -542, -1686, -3926, 4300, 16322, 18333, 12081, 19713, 21957, 8567, 230, -700, -4973, 1630, 4468, 24679, 28046]
8004B8046K554o608N906o51k689l590j0946l502j1652o342P165Q890P258Q838
7990B2677j192j1548O38p481j2270k567K6297R011L510M752Q220p073K531K580
7976C8085k684r650j3576J1815L013R020Q39N151K043j753j9720j8002L289R703
7962A7573R526M635j1060J3375p722m901O209M224m872K093J1475K372k542m484
7948C5901r452j135r580N657Q535L10N557k795l158M23q694j2975R388N306o961
7933A6327L290o166O800k159L003M156O419k575j7564l666o188O789O213n066
7919I613m527J5236R076j0683K517K372j258N212M277K209j982l66o322L57n679
7904B0052L801P60P067J281M829j7075l578M33R574j588K002J208n018j0521p177
$$ y = [28046, 30600, 23992, 29898, 29247, 26558, 22968, 12022, 8520, -3132, -9474, -2309, 6581, 13839, 22677, 21485, 9937, 10575, 3094, -9176, -11743, 14554, 23565, 27075, 31827, 40047, 32974, 35505, 38085, 35401, 25751, 12175, 23990, 27003, 36023, 36862, 42013, 44056, 42303, 22583, 4581, 7870, 17573, 27099, 31734, 20674, 34049, 26327, 21426, 27635, 31859, 26987, 29080, 40555, 42927, 40385, 35901, 26449, 25314, 15734, 21391, 29926, 30236, 35793, 32998, 29840, 30263, 21569, 8594, 17982, 23288, 16327, 19617, 13451, 20251, 18092, 21095, 25251, 31670, 29095, 11531, 7865, 1677, 8466, 14679, 9613, 5086, 20322, 29398, 18715, 21232, 23604, 22346, 27558, 31835, 34044, 32062, 31696, 25374, 25731, 20052, 23853, 24613, 31680, 32961, 37790, 20715, 17137, 17570, 27144, 25556, 27558, 28766, 23748, 13227, 6050]
7889F050J6570N571j1688r699j791J3364J1986K176J0749n53q367n867r93j0528
7875A6980k309R919J0789J0821q603k1192o258L016R23l375p732q431K816K5018
7861B2382O486K960j5227J4970K797m910j8503j7882n194J1729J8389q869k273
7848F855K4o815j675p345N290K4875k067r604j1616P688l699Q782l433J2482Q123
7833B7865q003k586J095m057N18N100n721n157j291J954j673l872Q594J1783J364
7818B5913j5621j3091j5032O336K6166J3660p21j8968j6020K709O554M676n519
7805A042l752l617J070N377L121J950l622l634m654m87J389j947M168m170p470
7790a5236P848K641j0716K991M189R563J2200r925j0377O049J7495k05p186q115
$$ y = [6050, 22620, 28191, 16503, 6804, 5013, 18377, 30363, 32539, 43288, 42735, 34368, 28501, 27508, 16980, 14671, 24590, 35379, 46200, 37597, 16405, 10147, 13163, 14086, 10711, 2979, -5452, -2636, 22382, 28868, 31828, 16601, 31571, 34368, 29458, 10955, -6927, -12121, -392, 17997, 9128, 6855, 6879, 64, -1611, -8956, -3666, 21209, 19142, 9538, -2078, 5610, 1911, 10693, 7260, 19742, 27865, 19862, 17276, 18371, 14314, 14832, 19932, 14211, 9054, 7763, 9717, 8044, 4172, 12766, 24549, 25913, 10292, -2799, -17831, -11495, 14671, 28331, 27610, 8642, -7378, -4669, 1885, 6561, 1042, -2710, -6327, -5257, 120, 3241, 5191, 1569, -2065, -6719, -7206, -5817, -7764, -3596, -7766, -15236, -7388, -4747, -15463, -12472, -8283, 1280, 13480, 3555, -6822, -773, 16722, 16517, 9331, 1216]
7776A216O70m564K288n531L547j2876m594J2735Q335n556k819j0277j856R042
7762a0240N560Q230q479k706M013J522m935K411N875P31j800o5N48m894N13r317
7746a3033L66J7507J763O393J1196P783M399r819j8776r256K261J525L578m787
7732A100k244m75p59j346k410R023o883J029N699l874J0772m359l2679P625J5699
7717d082J5892q523o197o140J0076O62j827o086m347O897L353O63K586l230l855
7702d158k96K429q292Q736O70K642P282O768L100j176n419r179l406O728P287
7687A3716N387Q542j5091r243m831p565J0688J6952j210m402l441j1135l926Q41
7673d718M67N73q612J1431J3473k395j8760J535j667l25M755J1893J2440j1212
$$ y = [1216, 1886, -2678, -390, -5921, -2374, -15250, -19844, -7109, 1226, -4330, -7149, -17426, -19282, -10240, -4680, 3550, -4929, -7635, -3622, -2100, -7035, -4624, 1251, 1982, 182, 117, 665, -4229, -3716, -13033, -12667, 4840, 6603, 12996, 24192, 31975, 36374, 26555, 7779, -1477, 784, 2309, 5887, 1100, -1144, -1619, -2378, -3724, -6134, 2889, -3994, -2965, 2734, -1140, 9632, 5273, -27406, -19781, -4082, 11810, 3287, -2910, -9050, 1026, 1688, -139, -6225, -10572, -3675, -322, 341, 2927, -303, -4158, -4454, -2025, -10317, -1581, -911, 1731, 9013, 15781, 18881, 17705, 12286, 3107, -299, 6429, 13716, 19103, 27645, 12554, 3311, -1520, -9085, 1603, 18555, 17345, 12943, 9502, -1633, -5559, -4718, -4251, -3678, -12290, -859, 12614, 10219, -8541, -7006, -8673, -8998, -4243, 7650, 20090, 8878]
7659H878o687O052k164q167p768k995m600M101J933L552m073J3323K5390K335
7645B9110n173N380J964p530l717R816o623r824r824l153Q22M081Q604n41K203
7630A5595J595o258k453k484l941l842J3274L005P768o708k096j8735o601J2319
7616D38l525l707L727O416r663j3497k501n934N162Q349K232k961J9053O364J0529
7601B0482J712r128j013n308q564L532l301N78J0085J555J5528L159k8092n056
7587c831J30Q568k400j3790l900l308J419J1885R91P783N950R534o723J078j4660
7572a274j5628L862J0570O444l207l086K961q626l380K616R137K310k423j716
7558a440O81J5640K0674J1144j4907j1402j7620o302k688O387P336J788r653j0761
$$ y = [8878, 2191, 8243, 6079, -2088, -9856, -12851, -17451, -13350, -11417, -7865, -11938, 1385, 26775, 29110, 23937, 29317, 31281, 23751, 20034, 29850, 23227, 13403, 3579, 426, 1248, 5329, 13933, 13392, 15595, 17190, 10932, 8479, 5995, 2054, -1788, 11486, 14491, 22259, 15551, 13455, -5280, -11881, 438, -3087, -6794, -3067, 3349, -6314, -19811, -22312, -28246, -23084, -14735, -12503, -15464, 3589, 9953, 20482, 22194, 13066, 12053, 6745, -1819, 1713, -1588, -1010, 9075, 10630, 26158, 29317, 1225, -3831, -3701, 4867, 2467, -11323, -15223, -18531, -17112, -5227, -4236, 3547, 9497, 19031, 12308, 13386, -1274, -16902, -13040, -2470, 3974, 767, -2319, 642, -7984, -11364, -8748, 389, 2699, 276, -1440, -759, 14881, 35555, 46699, 31792, 20390, 2770, -3532, -6220, 167, 7503, 9291, -362, -11123]
7544a1123m969L481q644L839m054O907J0736m116j9934k865J1181J1850O347J6117
7530A4753R519O749n013J410m060r636k290p883j406J0626J5411j52n028k0816
7516B184j7567P517n851j474r00R623R551m755k926j266l931j7276K002K336L559
7501a9174m18N164k877Q334J171N757k436o84P810J38m697K639L129k391R305
7486A0770n896n000j914J195M689k578l438L388Q219m8O450m431l904k594j2466
7471g558N264K20P422Q03N720o150l540p691j441p276J0286J3493m805n754J0178
7456I171J2719m2j037Q75n866m032j4217m092R505J4544P417j2474j0224P174
7442I421j0145j4363R904J6425J050K664p576p586J607j790M452L617k42J192
$$ y = [-11123, -16092, -12611, -21255, -17416, -21470, -14563, -3827, -7943, -27877, -30742, -19561, -7711, -1364, 14753, 24272, 31021, 26008, 27418, 23358, 13722, 11432, 3549, 2143, 12769, 28180, 28028, 23000, 2184, -15383, -7866, -13717, -15191, -16091, -6468, 3083, -1672, -4598, -5864, -9795, -27071, -25069, -22733, -19174, -19592, -14428, -17305, -8971, -7800, -2043, -4479, -5163, 2647, 2785, -1912, 727, 3856, 1465, 10770, 4874, -126, -2040, -845, 3844, 1266, -2172, 1216, 9435, 9387, 15837, 11406, 7502, 4908, -7558, -2294, -2074, 5348, 6151, 11871, 5721, 2181, -5510, -6951, -14227, -3941, 9552, 4747, -1007, 9171, 21890, 21848, 20811, 21686, 15820, 11788, -2429, -6521, 2984, 17528, 24945, 12471, 2247, 9421, -724, -15087, -5183, 11242, 12292, 14956, 7380, -206, 1401, -389, 4063, 7680, 7438, 8630]
7428H630p639Q3p38L114p347n978k017R623l750O778L788J185M611k081p782l159
7412b679J894K097n644j0258M060J0399Q774Q263J191n103o631l912J6831R037
7398B8319j520j1811k3870n905J4364N870J452k332R911J5772j752j0404n536
7385A2558n276Q570M956J464l464j362M767n307k1258m53L746j0325M281n188
7371a2291j1200P476J4250Q780j1606q145R410O139L961J299P718m269o040q940
7357c458N211M999J1567r069j1096P224j0825J776J950j609K214K2780K457l979
7343B0142o166r876o765m155Q91n201P375L914M595p346K359J0015K051m158k120
7328E555N23L811L649p266M191k3944p854K4576n28j529N023J65N111K466o551
$$ y = [8630, 991, 1074, 336, 3450, -3897, -9875, -11892, -2269, -6019, 759, 4547, 5732, 10343, 8262, 480, -2679, -785, 1312, -4332, -14590, -10530, -131, 8643, 16906, 18097, 12994, 6363, 2451, 19282, 28319, 26799, 14988, -8882, -14787, -423, 5447, 6899, 4567, 14478, 30250, 28498, 18094, 12558, 7282, 15852, 20808, 22272, 18808, 17446, 22213, 16906, -4352, -4805, -1059, -11384, -7103, -12291, -23491, -16015, -1765, 7015, -4591, -12736, -3326, 2813, 6774, 8073, 15791, 11522, 5482, -3458, 1753, 6752, 18319, 9250, -1846, 5378, -5447, -3671, -1721, -3330, -1116, 21664, 24121, 20142, 13976, 4100, -2665, -6820, -5929, -11130, -3755, 159, 4754, -2592, -233, 9782, 11833, 7675, 5555, 6078, 9889, 13538, 6272, 10463, -13481, -21335, 3241, 2713, 1184, 6207, 6372, 11483, 13949, 7398]
7313G398l71M913m364j740j4914l843R515J4955J097l338m193J785J339j2111
7299c872L229O542j1001M725P569O187Q181O935q447j3139O264J094r570k8Q724
7284A3393Q411L210m553l843j5116j824m087L932K867J973l625j3155j3170O80
7270b4907O408J2447Q463j002j3261k188M076J8299P56k518k2197j1373J0328
7257a6669P983r934Q396K962m047M785J5178L572q485l083l776O059M370j5793
7243h482l514J1451L765M583n066j3129R163P193p843j5363r310M973J899L165
7229a6515R93Q35R253J3060P804r016j68o137j1664j723J328n051P484n690K27
7214a4980L971P659j163J459o318j339k444L778j0723q113O296M571O361J488
$$ y = [7398, 7027, 11940, 7576, 5836, -9078, -12921, -3406, 11549, 12646, 9308, 5115, 6900, 8239, -3872, -643, 5899, -5102, -377, 7192, 13379, 21560, 28495, 20048, 6909, 13173, 14267, 4697, 4669, 13393, 21804, 25014, 20461, 16618, 1502, -322, -4409, -477, 2390, 4363, 738, -12417, -25587, -24907, -18499, -6052, 2411, 1409, -11852, -14040, -9964, 8335, 9091, 6573, -15624, -26997, -16669, -8686, -18620, -10224, -7262, -11309, -6524, 8654, 12226, 3741, 658, -3118, 2941, 7311, -8482, -11996, -545, 3220, 7803, 2737, -10392, -1229, 5964, -1879, -17242, -26552, -21579, -19680, -16515, -15522, -14687, -5434, 7626, 15430, 6414, 6246, 109, -11555, -13278, -11950, -17001, -9517, -15207, -14980, -11009, -3350, -4513, -3054, -9372, -10711, -13155, -9377, -20100, -28213, -21917, -17346, -10985, -9497]
7200i497n720k938R41M161q94J3774R167j6911r604K067j4612M471R538O818M414
7185d825O864J892q467J90j4230k0781j345Q600J5254P166l137r118J4531J0281
7171B875P164Q12K485l928L121N983k931k518o988q587J2674m025n656l919O177
7156B739R801L466O348J0819q044o927k200l191K442J002l395j902r928L557n323
7141g36k489M10l788J5553J1130K345j0672j0489j326K925K1355K382j5387j0046
7127A167j4335q516j3558J4938R668l154l518k137J329O44l77L027O506p199j2659
7112b8174K327J1689J0815K0400M272r117p039k2070j7130k338J1195N353O871
7099a2946k543l580J5086k41k212O416J1293O077k700j7124K109J0371l477n594
$$ y = [-9497, -15217, -18155, -17214, -13053, -13947, -173, 8994, -7917, -17521, -15454, -30066, -25595, -16057, -9239, -4825, 2039, 3931, -4536, -4346, -18576, -39357, -40702, -32102, -16848, -9682, -12819, -21937, -7406, 2875, 10039, 10851, 13336, 9408, 12529, 18512, 15581, 13063, 6075, -2512, 10162, 6137, 481, -3438, 2739, 12540, 16006, 22354, 33173, 25129, 18202, 16002, 12811, 15253, 16255, 12860, 10958, 1030, 4587, -736, -3225, -2815, -6603, 8950, 20080, 22425, 11753, 1264, -62, 2863, 24218, 26600, 11213, 1167, -13168, -21684, -35242, -20304, -10636, -13790, -17308, -19445, -18116, -17472, -17849, -14822, -8316, -15515, -28174, -25847, -14158, -3343, 17057, 21329, 12212, 5173, -16897, -34027, -36365, -25170, -19817, -12946, -15489, -19069, -3983, -4224, -6436, -20, 11273, 17350, 14650, -2474, -365, 10006, 6529, 935]
7085I35O857Q326J0376K419k1587n722k1465j5409J1427J2312J589R816j945k349
7071d420J0854J897P708m940l791p900M988j0701j2637R57K629J033J1131L268
7057G6M098O251p534l372j1532L931M356P421N198j0820j066P185p113n763k996
7042a1680P099J479k479j20j2306J024R989J6469J9910q376q399K218L284j0672
7028G440L005n546m293m029N97j5233q132M641l525J4172J5387k902j7031K798
7014a2651M190j3695o567R091J8792r901l761M784l094m151J813j2733o674J3646
7000b0911J5458M879o56J0795O29j327L001Q27p755j5285Q10m01j480R155R630
6985G369p770p811Q821o658k39j031k341Q061K1383M873p100j654n225j726o671
$$ y = [935, 7792, 16118, 26494, 28913, 7326, 1604, -19861, -35270, -23843, -11531, -9942, -126, -2071, -4420, 6434, 8331, 16039, 11099, 7308, -592, 4396, -6305, -18942, -17985, -15356, -14323, -3192, 76, 4174, 10425, 2891, -481, -12013, -8082, -3726, 3695, 8893, -1927, -2993, 4192, -2921, -8684, -11680, -4581, -3102, -5581, -5701, -18007, -16983, -6994, 9475, 29385, 21009, 12610, 14828, 18112, 7440, 10445, 4899, 606, -3423, -2826, -18059, -26191, -21550, -25075, -10903, 4484, 1582, -15449, -12651, -8461, -22156, -28723, -19632, -840, -10741, -14502, -9718, -12812, -16963, -15150, -27883, -34557, -20911, -5453, -574, -1230, 9565, 10194, 8867, 11868, 12695, 4940, -10345, -9535, -9936, -11416, -2261, 7369, -401, -8212, 609, -6049, -6288, -7319, -9660, -1599, 19784, 24657, 17557, 15903, 10678, 8952, 2281]
6970B281j4231K555P282p18L687k451O948n334M029K638n413P185K459L228q164
6955E981K605Q393q24o544n615P066j2746n045J50Q538P16j3178j353o372J1629
6940f599M715K938R706o508j5697O169J0563P510o283j2017m44j056j0773N805
6926a1971J1576q316L017J3754m582n530M529N889n398j4009q853J4603P654O370
6912H733M79j3845r269J2449j0685p211N454J0760J694N416P155r793l593j3566
6898a5822q983k814M860J1211N224P03P848l554l526k1120J684o254n455j89L955
6883c2232R306K0692j319J155J2248n398q722K073O874M9l378O190O727l85k0965
6868g085j0173R40J0818L35j741R34L244j252M007m071j2077J1341N342k208Q144
$$ y = [2281, -11950, -9395, -2113, -2831, 856, -1595, 5353, 19, 4048, 6686, 1273, 8458, 10917, 14145, 5981, 8586, 16979, 16155, 9611, 3996, 11062, -1684, -6729, -6579, 1959, 2675, -10503, -11856, -18228, -6599, -1884, 1054, 10760, 4252, -11445, -5276, 5287, 12797, 6514, -5503, -5947, -7003, -17776, -11971, -395, -8711, -5694, 8060, 3478, -2052, 2477, 8366, 2968, -11041, -19894, -5291, 2363, 8733, 9212, -4633, -13902, -1453, -12138, -19349, -13895, -3135, -1441, 3975, 11130, 1337, -2256, -15822, -24805, -27619, -22759, -11548, -6324, -5621, 2227, -1327, -4853, -25973, -24289, -30543, -35998, -36187, -32232, -22926, -2234, -3553, -2398, 9850, 4452, -4270, -2197, 4677, 4726, 1348, 7538, 14265, 13880, -7085, -17258, -16318, -5500, -5165, -6906, -5972, -2728, -3980, 27, -4044, -16121, -4780, 562, -1646, 6498]
6853F498j276j1999K116K703J0899J553l424J3318j9232m388n4m498J7992J1129
6839B1337j1828j0750k135L876P819n994m984j0212o940q257J5021L375O121J5837
6825A2286M03j1103J545J2991k416l509j0411j8258m735J2525L428o835j5997
6812c0086J80J3525K492n662J952P677J5089k485k2M951q887k0101q162J060P641
6797b0838J0187L203j5l802J4172M398n900o546k155P531m597j008p472L793r109
6782a8158j4720k229J4928P609Q048P25L892M628o355j1127j892L171J439Q081
6768a960Q263N114K18k357R779j642K325l484j1660J278K948M033n418r873j829
6753d265J018j271p571M155N290m969k085M025k729p779q412j75J1200K2449r599
$$ y = [6498, 5222, -6777, -4661, -1958, 8941, 10494, 7070, 20388, 1156, -3232, -3286, -7784, 10208, 21337, 9509, -1241, -3376, 500, 8319, 2325, -2659, -12871, -19811, -28068, -13047, -9672, -3551, 12286, 12689, 1586, 3131, 16122, 13706, 10197, -214, -18472, -23207, -10682, -7254, -14089, -30086, -29906, -16381, -13889, -19551, -17599, -9922, 5167, 2682, 2660, 7611, -1276, -21377, -29539, -28479, -20838, -10651, -7448, -7463, -11265, 2907, 7305, 1405, -5141, -7296, 235, -4362, -5370, -12842, -9049, -18158, -32878, -35107, -20179, -12570, -4522, -3797, 95, 4723, -1632, -12759, -14651, -11480, -10041, -1960, 6303, 11417, 11635, 9278, 19057, 17415, 19740, 16256, 4596, 5874, 8822, 12855, 7437, -2436, -4265, -3247, -4518, -12089, -7934, -2644, -7613, -9698, -5673, -8402, -16181, -24593, -24768, -13568, 8881, -718]
6738g18j6632J0259N902l675O89J756P832j881q654m737J307n50O389J3309O138
6723A6734R891l142r101L48m453j7673j0974Q210L365Q12M950J445R595J323N319
6708A6649K1346M669R778N359J6877K8454K3547l820k2892j4780j0709j1141k3551
6695C9786j8670n948j0846O174K660k528k358P465j1960q641j560p786Q909L600
6681a703o64M074r045J0647m509J592q408K882J115J703P108Q387l273j4398K650
6666a842J2787L507r706K692O252N944j4354j7591q026J3321N452p820K980o671
6652a3075L062n381j653J1170J2774l098O377R825O705n554p607n814j0675k124
6638e068m526K72J7337L368j0830l424J4717J1546j0491o563O660j660p603J252
$$ y = [-718, -17350, -7091, -1189, -4864, -4175, -2419, 5413, 3532, -5122, -9859, -8552, -9102, -2713, 10596, 16734, 26625, 23483, 14382, 14730, 10277, -7396, -18370, -10160, -6795, -5983, -1033, 412, 10007, 11330, 16649, 37995, 42664, 52442, 57801, 74678, 103132, 126679, 122859, 99967, 85187, 74478, 63337, 39786, 21116, 15168, 4322, 10496, 13156, 10628, 8270, 15735, 3775, -4866, -6426, -14212, -5303, -1703, -2367, 1707, -7338, 3309, -1200, 392, -8016, -5134, -4019, -2316, 4792, 13179, 9906, -4492, -1842, 10945, 14452, 4746, 7438, 13690, 19634, 5280, -12311, -20337, -7016, -1564, -9384, -6404, -13075, -10013, -15394, -17047, -5877, 6897, 3799, 10176, 20001, 26706, 21152, 13545, 7731, -2944, -5068, -9594, -9322, 8015, 11383, 553, -2871, 11846, 23392, 12901, 6338, 12998, 11338, 3735, 4987]
6624D987j900j4331k555N138J1223J5110q723k0311r680J6149L1837J4951n552
6611C6343j5271K239j3794k1376q315L678K0855J8944n369o486k681j1226K285
6598a74M985q40j4222m579J1426p8J3554J1579o080o466p501j034l933m078O69
6583f772n184k935J7563o255j1702q105k161P518O322J1816P919j8174l220J3844
6569D74N567n737J742Q888m464j1196j1270P626J0146k263j2342J514M929n01
6555f887M128o925r641M965L141O88l649K855m557j246J9036K735n126j399k890
6540d772O147R176N500j0801j0816L919J2424k619o304N431L91N94o184j2622
6526a0536L426K046J3006R34k204O861J913r597r953q004n064Q531n524l045K776
$$ y = [4987, 3087, -11244, -13799, -8661, 2562, 17672, 8949, -11362, -21042, -4893, 26944, 41895, 36343, 21072, 23311, 9517, -11859, -20174, -16496, 4359, 23303, 17934, 11448, 8767, -2459, -174, 4811, 3971, -10251, -14830, -3404, -3482, 10072, 21651, 15571, 9105, 1604, 570, -3363, -7441, -6772, -11956, -14891, 2672, -3583, -15285, -23390, -25551, -18033, -11711, 105, 8024, -10150, -13370, 474, 6041, 304, 2046, 10934, 6470, -4726, -15996, -8370, 1776, -487, -12829, -11315, -6386, -6887, -2759, -9684, -19325, -14360, -11219, -10531, -14180, -11325, -15882, -17128, 1908, 4643, -483, -1882, -4772, 1375, 10551, 16051, 5250, -5566, -1647, 10777, 8158, 1854, 7285, 7676, 8270, 2086, -10536, -7110, -5064, 7942, 8876, 6672, 13533, 15446, 5849, -4104, -12108, -17172, -8641, -14165, -17210, -14434]
6511a4434N107M40J7791R276j6552O027P011j847n196O906o331j4247j127J0247
6497C071J5613k623j2096r065O958p886O846p091q20J0449L328m702r286J3149
6483E845J1598j3945J48Q813o617l687Q803L294P880l377j5695K745J2787n185
6469A3407j7125m841L071m794p116J7639P832j8824l603R348m251O486j7641j582
6455b1994O440J1278R525k829O126R117p672m091p257L729N338Q07r132J701Q323
6440I409J0487K48J647M552k1494q984P182P566R027j443r923l701l613L041m760
6425g59M808m116n82p582q679j486l151J165J0695J9344N007n798r304l985K148
6410b275k087Q27R133n298J167M375M821O428r70k03J64m89M934J276q944P032
$$ y = [-14434, -9327, -8887, 8904, 18180, 1628, 7655, 14666, 12819, 7623, 14529, 8198, -6049, -7176, 3071, 18684, 16061, 3965, -5100, 1858, -6028, 818, -6273, -7093, 3356, 6684, 1982, -7304, 5845, 17443, 3498, 3646, 12459, 5842, 2155, 10958, 14252, 22132, 18755, 3060, 5805, 18592, 13407, -3718, -8559, -5488, -10282, -17398, 241, 8073, -10751, -14354, -5006, -9257, -2771, -20412, -21994, -15554, -4276, 5249, 2420, 8546, 17663, 9991, 5900, -1357, 2372, 7710, 8517, -615, 1086, 9409, 19896, 20144, 21791, 26343, 4849, -4135, 3047, 10613, 19640, 18197, 8274, 4573, 960, 4001, -759, 4049, -67, -649, -8231, -16910, -18396, -21547, -20382, -9687, 9657, 14664, 8866, -438, -4423, -2275, -4362, -3535, 5598, 300, 1467, 5842, 10663, 17091, 16121, 15918, 16082, 15593, 20527, 21803, 12859, 19891]
6394A9891l641O269J0633p685r815m517J0618l405j7023q109j933p924N986J0580
6380g5L557J432M876Q359j4780k035P664m684m977P465L913q360q711N90O466
6365G00J4538p55p711O544M34L48j8451n035M995l827k381J2943R592O817j0333
6350H418p348m963k649J064K419J4279N520j1380r360p607j246L878J339j1420
6336a9056K530J0821R292M268R98l297L538j1670l287j1135R352K139j2640J1277
6322f870J6620l690j3439P93o532J1624J2916n417j188M124M710J3614p813k0339
6308h87n970k261R5n24P198R290l825j1713M985R702L570k651m816O943J497n882
6292D751K709K904R33p909o176K334J081n708o315j0238M018Q913J2045J0936
$$ y = [19891, 16250, 22519, 33152, 25467, 15652, 11135, 21753, 18348, 1325, -6784, -8717, -16641, -10655, -75, 3482, 4914, 9790, 18149, 3369, 1334, 8998, 4314, -663, 6802, 10715, 2355, -6356, -5766, 700, 15238, 14483, 6772, 13316, 13750, 14098, -4353, -9388, -4393, -8220, -10601, 2342, 11934, 18751, 8418, 1070, -3893, -6542, -5478, -3059, 11220, 16740, 5360, -4000, -11607, -12853, -8975, -7636, -19056, -16526, -5705, 3587, 7855, 8853, 5556, 9094, -2576, -5863, -16998, -7646, -5507, -18147, -6870, 9750, 6060, -7379, -6586, -13118, -1494, 11422, 6005, 4817, 8941, 13651, 27265, 19452, -887, -6857, -9118, -9023, -9547, -2349, 6941, 3116, -8597, -3612, 6090, 9660, 7009, 2193, 9136, 10633, 4751, 7460, 10364, 11297, 3388, -2788, -454, 627, -5081, -11396, -21634, -17616, -8703, 3342, 14278]
6278A4278k685M594m311j2034m597n381q617l300O197O572O664j157m221N240
6264b758N456N148J1668l941r017N355L430J99j4118o766j545m578M098P813R104
6249I548k901L164P701o371o842k3653l137Q333r10J598J1678m813k908J0614
6235A101J6896K46N757l732J929j508j649m42J2751J289j5335n701R506Q36j1469
6220A0475j1771n781q669p45L007l323j528J6582Q07m213r422j1475J991K221
6206b1844n550K121J3630K2988Q0j5338r891L710r343N241J7591K271p474L008
6192A200M473k412j616M27o32m102n708J497O256N388j0396j1847N973L071N976
6177b452p311p751J0500N34K468n600j7791J71M094P859Q380m920K444l99M921
$$ y = [14278, 11593, 16187, 11876, -158, -4755, -10136, -18753, -22053, -15856, -9284, -2620, -3777, -7998, -2758, 2698, 7846, 19514, 15573, 6556, 11911, 15341, 15540, 1422, -5344, -6889, -11467, -7369, 444, 9548, 6647, 9811, 17512, 11141, 4299, -19354, -22491, -14158, -15068, -13470, -1792, -6605, -9513, 1101, 17997, 18243, 24000, 20268, 22197, 20689, 19040, 18598, 31349, 32638, 17303, 11602, 21108, 21944, 10475, -1296, -7077, -15746, -16491, -13484, -16807, -18335, -1753, -946, -5159, -14581, -26056, -24065, -21844, -27394, -25273, -11643, 11345, 11425, -3913, -13804, -10094, -19437, -14196, 3395, 5666, -1808, 1200, 5673, 3261, 1645, 2072, 1440, -2662, -8370, -6873, -617, 4771, -5625, -17472, -11499, -8428, -2452, -9763, -17514, -7014, -6480, -4012, -9612, -27403, -27232, -23138, -15279, -6899, -11819, -9375, -9774, -4853]
6162d853N617j508n960O747o078r127P466N172k26l525M205J0543j743j1169J453
6147b986J5595q722j2052q003K799l960K172M474m787j7194l098J4061J2014K824
6133f863K126n935P63l348K1969J1294n052r494j6865o318M887J311K045Q911
6119e69O142l326j6740J1012O348r455M930J3546q283j7398j3092r7J7993P526
6105a463n649q046k087r5J2215k86K426l568l978J253K2093n107k2405J249J2386
6090a062J318q723P74N872k624m663J6788K643R185O034o851j2222j1256m872
6076i659L516M971J1553n697j6246j594J8835O545n700m495k279L32L27O838N034
6061A2281P9R494l408l192o789p697k753P95O480O358q986J3530R631m784r176
$$ y = [-4853, 764, -744, -6704, 43, -6035, -15162, -7696, -2524, -2750, -6275, -2070, 8473, 6730, -4439, -2986, 12609, 3887, -8165, -16168, -13369, -17329, -15157, -10683, -15470, -32664, -35762, -21701, -9687, -6863, -4737, -10672, -9909, -13257, 8712, 20006, 14954, 5460, -11405, -17723, -12836, -11525, -9480, -569, 5573, 2247, -14493, -3481, 2867, -6588, -1658, 11888, 3605, -13793, -26885, -26982, -8989, -1463, -7112, -15158, -17245, -17340, -5125, -5411, -2985, -6553, -10531, -9278, 12815, 7708, -14697, -13448, -1062, 256, -8467, -7693, -1821, -4445, -9108, 7680, 10323, 19508, 25542, 18691, 6469, -4787, -9659, -6143, -1172, 10381, 4684, -11562, -13156, 5679, 12224, 6524, 2029, -250, 82, 409, 7247, 12281, 12360, 21854, 18446, 15254, 8465, 768, -1985, -1190, 5290, 11648, 2662, 16192, 25823, 21039, 11863]
6046A1863J1879o194j8967j1655J0088M486Q228o360J3213N033j7914j0623N595
6033a328n581q292O13P865K1748N868K615k675j3527j6437k715L494K841Q430
6019B919J1446J3188K185j1198L623k757k2365j4120M016n066m479P904k177P154
6005i727k894R955N341M607n458r680M920Q689l573r491J580Q741M019N546n148
5990G427p393p782k789o063Q515N771p592K592J3324%k817k886J1848K818p231
5975G742l767n754k314k949M453p231q545J3609P176j3915q238K716p253J3308
5961a0962J5028m236n218L250o764o180J5721N639P097O787n147r706o615L696
5947B390L658r033j9485k0333M35J5826P285k93P087L178J7438M169j2642p603
$$ y = [11863, 23742, 17548, -1419, -13074, -2986, 1500, 9728, 3368, 16581, 21614, 3700, -6923, -1328, -6909, -15201, -14588, -6723, 15025, 20893, 23508, 20833, 7306, -9131, -11846, -8352, -5511, 2919, 14365, 27553, 29738, 18540, 22163, 19406, -2959, -17079, -13063, -18129, -22608, -14704, -16881, -9727, -12621, -2666, 2675, 7282, 1824, -7856, -2936, 5753, 2180, -7311, -5731, 3010, 7029, 12575, 7427, 34, -7748, -10537, -16600, -8085, -2314, -9906, -7314, 6010, 6010, 3193, 307, 12155, 14973, 7742, 3975, -1779, -4093, -7042, -2589, -9820, -18365, -4756, 2420, -11495, -19733, -17017, -24270, -10962, 4066, -170, -5388, -2138, -8902, -15082, 639, 6278, 13375, 20162, 15015, 5309, -1306, 2390, 6048, -2985, -22470, -42803, -42368, -26542, -19257, -19550, -12463, -9285, 8153, 12322, -320, -7923]
5933g923r772K156Q382K094j0644n325L411j160N102O588j633j1183R779k248
5919a2376j8274l8J0462l017l497L605N838K767J5642N356q400J886p883m845
5905a2774K659Q103R925J303J7556o640M200r480p533n112K036J0892q130M973
5891A1978N353p093n184l412o105r934O28P917k776P078L980r194o94P776J0639
5876A0957n113L089l106j5619l1868J0089K0513l583q94o78Q461P429p266J241
5862f348m958J1043K819l267J779j853k38J6733R493l851M388N648j1000o792
5848A3596r444j958q508L275O976l511l768j3124k480J7127J4696L024j5381j721
5834a201J8892p920j6106m189k723P269j3059J288Q352O800O837j412J173l072
$$ y = [-7923, -17695, -15539, -7157, -5063, -15707, -21032, -17621, -18781, -13679, -7091, -8724, -19907, -10128, -12376, -30650, -30688, -20226, -23243, -26740, -23135, -17297, -14530, 1112, 6468, -1932, -46, -7929, -12774, -10115, -2012, 7913, 9216, 26772, 20132, 24332, 14852, 7319, 2207, 4243, 15135, 7005, 11978, 17331, 10238, 5054, 1642, -4463, -14397, -13769, -5852, -8628, -1550, 2430, -6764, -7458, 318, 10957, 5844, 8933, 5827, -9792, -41660, -31571, -11058, -14641, -15535, -16213, -7752, -323, -7589, -6348, -11306, -263, 2556, -711, 1068, -785, -1023, 15710, 25203, 21352, 25740, 31388, 20388, 13596, 4152, 2194, -6314, -3039, 3937, 426, -3342, -16466, -18946, -1819, 12877, 15901, 520, -1201, 17691, 9771, -6335, -10524, -13247, -5978, -19037, -17749, -9397, -2597, 4240, 2828, 4001, 929]
5820I29l745R157J0473L380Q428r008j0089R183K176k7752k1449K0528P962J0803
5806A0976J743n163j0133J1492k734j3177k213J1859l78N11J7813p22j2881j2429
5792e436K909j04N963o136K41J415K984j129O751L166r756n961n5J2129p373J2213
5776A1821M79j5700q380J3810r663j4536J3990J1097k753m209P931M420N950j7950
5762c693p913O326J2051n165q101K722R859n966L57O684J601J001o49l10m27r961
5746a584q772K798j5384n313J6408K77k670l92J2367N748MJ961p576r751r932
5731b1811M218Q48J3464N892k817K327j777N476J2924o001o270j676O8k131l801
5716a067n541j9006j1373J4177l96M882J9996P724J625Q854K101r186k4325o369
$$ y = [929, -2816, 6341, 16814, 20194, 28622, 19614, 9525, 18708, 20884, -6868, -28317, -7789, 173, 10976, 12719, 7556, -2577, 8915, 6181, -6996, -9209, 2650, 2272, 2783, 20596, 19874, 6993, -5436, -2527, -2631, 3332, -2804, -2563, -1148, 1836, 707, 7458, 10624, 868, -5093, -5148, 6981, -392, 11821, 12300, -3400, -11780, 2030, -7633, -22169, -8179, 2918, 165, -4044, 3887, 8307, 14257, -3693, -11606, -5280, 6771, 1606, -6495, -3773, 6086, 120, 477, 7161, 8762, 9763, 9114, 8804, 8377, -1584, -10356, -7558, -22942, -28255, -11847, -11570, -14240, -14632, -2265, 3483, 3487, 5448, -2128, -11879, -21811, -17593, -16745, -3281, 2611, -206, 2121, 344, 5820, 18744, 12743, 6473, 4797, 4865, 2734, -1067, -6608, -25614, -36987, -22810, -23206, -18324, 1672, 9396, 11021, 19875, 21976, 12790, -11535, -17904]
5702a7904l279J780j796J2607m04j3674o26K2603j581p257q370l734r962k730
5688c4327J9743O851J1323R549m531k1252J043R345N19L373j4746q038l873M109
5674b0912R523N110Q032R08q303q954P272J1071l683l299N572j8033J277R162
5660e257P83R377J931K817j1575o232r84J099l139l048n935L290J608J1360M636
5645G31p353j3419J0420O133J9354r93n617K366N013j2407l371k280l327l939
5631h689K660q38J1223m501o897m429p477j0296O533J0009N339L277R086j387
5617C613L457q092j0079p24k569O393l059k898N061J3523j461J5655m380n385
5603I055p588p423n619m183n613O999J4881J8504n345L869p464j913o702l288
$$ y = [-17904, -21183, -19403, -21199, -8592, -8996, -22670, -23296, -693, -2274, -9531, -17901, -21635, -31597, -34327, -14584, -7733, 3590, 13139, 8608, -12644, -11601, -2256, -1737, 1636, -13110, -21148, -25021, -20912, -11389, -6279, 1753, 2661, -5642, -14596, -7324, 3747, 64, -3235, 2337, -15696, -14419, -5257, -4474, 4903, 6834, 9651, -1924, -8156, -9140, -8041, -11180, -14228, -20163, -16873, -15265, -3905, 731, -6622, -20041, -9621, -3488, 15866, 14873, 9256, 11622, 16635, 4228, 857, -1423, -4750, -8689, -6029, -6867, 4356, -145, -7042, -11471, -18948, -29244, -22711, -12702, -7363, -4086, 5000, 3613, 7070, -1022, -11101, -11825, -14394, -8001, -11060, -13958, -8897, 4626, 3165, 18820, 14440, 9055, 1467, -5956, -11575, -15758, -21371, -14372, 509, 19013, 13668, 17537, 10073, 8160, 1458, -1830]
5589a830P390Q151j4958o383j1622j738J0421R990J8526l074k418r909J886Q717
5575A3149N539j1311j2087j534Q62l224p185P823Q304n276j1178Q084L380j566
5561f220m225o857Q762m564m414j325N968k821P09R014J679Q304J103m356m208
5546c451P938J776J859n929p267J739p871n897J0160J5600j1777j453N289M3K814
5531C573K655j4561j2719N953Q642k437n092k505o077J6460J351o287R681J0789
5517I426k013n34k660k395m853k881N226K303o663q373N330m605p524R618J1566
5502I68j294l770N155n671L308o96R038J540P901p475J0281J031l148n450o636
5487E082j4873N62K303p341J0393J2189o454k044J625M009q324n376j0510m764
$$ y = [-1830, 5560, 13711, -1247, -7630, -19252, -20990, -10569, -579, 17947, 14873, 12455, 2546, 4432, 13149, 18688, 7377, -4710, -6244, -5382, -8606, -15791, -7968, 336, -4940, -16118, -8034, -4654, -6220, -10445, -17302, -8540, -13104, -17518, -18843, -12875, -15696, -14987, -5973, -4294, 4010, 5113, 757, -3451, 4487, 6263, 8122, 2193, -5074, -3335, -11206, -17103, -6943, 8657, -3120, -4573, 716, 759, 3573, 6228, -8333, -21052, -15099, -6457, -8894, -13986, -16491, -22568, -6108, -4757, -11044, -1363, 9426, 7413, 6879, 4219, 1824, -3029, -5910, -684, 1619, -5044, -13417, -8087, -12692, -20216, -10598, 968, -326, -4096, 1059, -4612, -1304, -2000, 7038, 8578, 16479, 9004, 19285, 20316, 17168, 11718, 5082, -9791, -9229, -6926, -14267, -3874, 8315, 1861, -183, 1442, 5451, -2873, -8249, -18759, -23523]
5473b3523O166l741o896J3213J1923k633l190J906Q850J755l313j1073l133n715
5459a9404Q623J389j0660R994j780n118o249m332J3368J4421k120L327k119Q596
5445G936r54m556l901m907j271L267m746j949k170J0334q756k336l014l7N787
5430a1273J0349K226M75P284n996l91q512q826J1011R052j0761n329L291J268
5416f132K089n268r528j3465j0890Q148J5356J0425k306K666j3547J372L538O119
5402a1423j5492J6681J1903m938R302m491L040N719M222j1444k611N34m78l691
5388c167m309K388K547M026O708p612L873r811j3990P836J7500j972p44L795n667
5373A401o91P701j2801l368P226q812L211N719l630p509j0281J0063R97J3282
$$ y = [-23523, -17357, -21098, -27994, -14781, -2858, -5491, -8681, -6775, 2075, 3830, 517, -10556, -13689, -19404, -10781, -9392, -20052, -10058, -11838, -16956, -23205, -27537, -14169, 252, -1868, 1459, -660, 7936, 6982, 2426, -1475, -6382, -7653, -4386, -9132, -11081, -13251, -2917, -11673, -14009, -17023, -17060, -11273, -924, 1302, 1777, 9061, 3065, 2674, -5838, -14664, -3653, 5399, -5362, -10691, -7400, -6132, -4043, -9311, -18839, -32304, -43194, -35046, -19690, -9265, -11571, -8905, -22452, -21080, -17542, -11423, -26915, -10234, 1669, -3269, 6033, 1542, 4582, 10301, 14523, 3079, 468, 1002, 524, -3167, -7476, -5088, -2541, 1485, 8193, 581, 4454, -5357, -19347, -11511, 5989, 4017, 3273, 7068, 1401, 710, 8411, -4390, -7758, -532, -9344, -6133, -414, -4044, -11553, -21834, -11771, -10774, 2508]
5359B508K116j1792K788N121m138r815j123K153n790P489J0520R445K702L455
5345A5639k842p409o12l35k001Q102m200q14k676k969r916n457J2484J0298M003
5330A1295p77j0655L491K70l259L24l53j2952j3163Q717R888n699j2168M153o961
5315b7849O179J0663P219O938p248k450J6499O304P802r851k498j8878o209R502
5301c877J3384P269r061J235K764j253o125m755m458J409J302q338M877R067P140
5286A0580n445r285j0609j0458k989K998O926J2734O355P446P439P515o080m117
5272A3010r714j4661m520O354J1825k473j0386l706J1670J2088j76j919J634p319
5258A707j5156q947n920P85J8157N721r45N296K874k519o053L424J8134N294j3106
$$ y = [2508, 4624, -7168, -4380, 741, -3397, -13212, -14335, -12182, -17972, -10483, 37, 9482, 12184, 15639, 12797, 5388, 4776, 4441, 2440, 10542, 6342, 5528, 2852, -117, -10033, -15490, -3006, 7292, 11295, 10518, -137, 3354, 3624, 365, 689, 336, -12616, -25779, -17062, -7174, -12873, -25041, -20888, -27849, -21670, -11007, -3788, 3150, -4098, -6548, 9951, 16255, 24057, 14206, 11708, -7170, -13379, -3877, 9507, 16776, 7715, 8950, 11714, 10461, 4336, -419, -4877, -3468, -2166, -10504, -5627, 3440, 10580, 5135, -4150, -14759, -25217, -28206, -25208, -18282, -5548, 807, 8253, 15692, 23207, 17127, 13010, 3296, -11365, -15885, -9531, 2294, -179, -10565, -14271, -2601, 9487, 9311, 7392, 9026, 1707, -13449, -22396, -28316, -27531, -9374, -3653, -4598, 698, 3572, 1053, -5000, -1576, 16558, 21852, 8746]
5243H746O479Q578j140m302j6932j0820p524o121M552r726O11J2200Q507M176
5229b716N462j4581k956K85j0835o633J2721k980J0419M964J569q6j0413n017
5215b0797M768P106J0032p52N542L770j2819l41M938n878k136O65k691j301j26
5200a0020l086J594R64n1K714J3731l655k436J870R410k89p967K609J3724m206
5185A4906J445j167p982r49R487N17j432p133o522O496N310k59j2357k293N380
5170C447N383j5035L123N166n372r16M578k792k633j1796q937J8126J0227q135
5156e566j1859l579J3066L964J334j1893O068J2875R53k029n62m12M683K808M528
5141A4379q23M12r59K392j2746l111J0998Q58q992o005P306M495M583M164k223
$$ y = [8746, 15225, 23803, 22663, 18361, 1429, -9391, -16915, -23036, -18484, -28210, -27599, -15399, -6892, -2716, 2746, -11835, -14791, -14506, -25341, -31974, -19253, -22233, -11814, -6850, -5281, -5367, -15780, -20797, -16029, -8923, 1109, 357, 5899, 9669, -3150, -3491, 1447, -4431, -6567, -5902, -8593, -9894, -10020, -13106, -11512, -10548, -10599, -7885, 5846, 2191, -245, 1625, 11035, 10746, 2779, 5388, 19112, 14906, 16351, 15184, 7202, 6253, 15740, 16257, 14825, 7692, 1170, 7666, 12976, 12717, 360, -1933, 3447, 8830, -6205, -3082, 2084, -3288, -4204, 374, -2418, -5051, -16847, -25784, -7658, 2569, -5566, -17425, -21004, -7938, -3974, -2640, -14533, -8465, 4410, 5363, 3334, 2772, 2360, 7043, 9851, 14379, 13556, 13968, 13009, 15401, 2655, -456, 10542, 11400, 2408, -3597, 3709, 8204, 12787, 16951, 14728]
5126A4728N907l09j733o833j7456N818q20K795o274l881J0746J3142k001p507
5112F322o316K324M968r240K729j1351k297J1387J4874J1645p485j3699m357Q04
5098C08j72J140l091K851k839P190M431j5086q98j951p597P339M154r165M825
5083h561K843L140j1286M906O254j2216q76M901p224p464K848O06q854J2423K5723
5068G163O034r367R43L049k042P33K79m510m092m21O859J1353K96j1126N960P601
5052A8712j1043j5643j064M902m917R73k745L94r69J82k425j323j245j213n386
5037b2810J9148N116o451L784O607r503q509Q056J656K363j8069j86K6091j111
5023F182l884Pj731o794m74j176N065R958m75l616n230Q440J7118r643k584k98
$$ y = [14728, 20635, 20326, 18593, 11760, -5696, 122, -698, 2097, -4177, -8058, 2688, 15830, 13829, 6322, 6, 2330, 7298, -1942, 787, -10564, -12861, -1474, 13400, 25045, 17560, 3861, -496, 308, 136, 1276, -1815, 1036, -1803, 5387, 9818, -5268, -6166, -8117, -15714, -8375, -4221, -13386, -8561, -5718, -2578, -13864, -8958, -2704, -14920, -15796, -10895, -18119, -25583, -22735, -22129, -30983, -18560, 7163, 13197, 3830, 4773, 7822, 5780, 6513, 6792, 2282, -1810, -2231, 4628, 15981, 16277, 5151, 11111, 18712, 7669, -7974, -9038, -4136, -9053, -8080, -10825, -10431, -11400, -11218, -13643, -14966, -16211, -17424, -22810, -3662, 1454, -4997, -1213, 5394, -4109, -12618, -4562, -2906, -543, -18612, -18798, 7293, 6182, 2298, 2305, 574, -6220, -6694, -7870, -2805, 7153, 6678, 3062, -2168, 6272, 23390, 13747, 11163, 10865]
5007A0865j514K347j0910j7221p573Q900J6165O978k271m712J818j05K826j54
4993E439M751J5807J0901j5455j5082j085q203L844R765O241l342j490J6308L64
4979B8763k4426j1082J0599K1598j5389n899p154p061J34o303N720P451K594j11
4965e66J000K242n588r725K374O526N251J1773J3636o412r804o806k396M090M642
4950A0237o519J0722L239L703l437r908O42j6822j2704O054K712q2j0321o901
4936b9385l001N040L506J3436m206J499J5506J1594m270j2011j6519K504j429
4923a7736r661R538L926L44R521q683q55n335J3J0648l525R245R842P904m004
4908A1182r886O277K442K071p692q957r619n06Q773K234j3025l094J4480M158
$$ y = [10865, 9351, 11698, 788, -16433, -24006, -15106, 1059, 8037, 5766, 1054, 2872, 2767, 5593, 5439, 10190, 25997, 36898, 21443, 6361, 5276, -2927, 917, 10682, 16923, 13581, 12091, 28399, 28763, 4337, -6745, 3854, 25452, 10063, 4164, -2990, -10051, -9917, -16220, -10500, -3049, -455, -566, 434, 2676, -2912, -12637, -10263, -3737, 1514, 13287, 26923, 20511, 10707, 3901, 1505, 5595, 10237, 3718, 14440, 17679, 21382, 17945, 8037, 8679, -8143, -20847, -14793, -12081, -12163, -22484, -29385, -32386, -27346, -23840, -10404, -14610, -13111, 2395, 13989, 9719, -2292, -18811, -16307, -17736, -27397, -17859, -13933, -13589, -4068, -12751, -13606, -18941, -18928, -8280, -11805, -2560, 7282, 15186, 11182, 1296, 7573, 10015, 12086, 4394, -4563, -14182, -14688, -5915, -3681, -16706, -19800, -5320, -1162]
4894a162j1716Q370K3458r37j5602l747J125l790n045j0231N881J7299O094j0113
4880a16q836K242P234R827n215j5427j853M720J8662N448j4549j0526j0305p292
4866b5986l260J0614K164J227K2987k419n730M193n908p189Q133k233j2080m966
4852b0453k405k41J5573N597p495m988m129N961O787n779j2857R071m840m692
4838b4890J1613J0288P55Q966m61m036k600J373J15L710j113k0691r054k880R200
4823a9705J4246J3242p770r604m13J8785Q692j3018m011n43l775m793k104j0504
4809b1275j975R955Q482k695P601K752O609R560l419j45j4246L789R405o541n249
4794B608l403R731j870j9855j5931j0230O185J6126J0017j0595J127O726R880
$$ y = [-1162, -12878, -4508, 18950, 18013, 2411, -1336, -211, -4001, -9046, -19277, -13396, 3903, 9997, -116, -8952, -6710, 524, 10351, 5136, -10291, -12144, -7424, 11238, 16686, 2137, -8389, -18694, -25986, -29246, -18632, -16468, -15241, 7746, 5327, -403, 3790, -2118, -9307, -1174, -3407, -15487, -20453, -22858, -23099, -7526, -1929, -9424, -14412, -18541, -12580, -5793, -11572, -24429, -15358, -20198, -24890, -13277, -2989, -2234, 6732, 6271, 2235, -365, 1008, 1123, 4833, 3720, -16971, -26025, -28905, -19705, -5459, 7783, 13, -9591, -10004, 8781, 17473, 4455, 444, -99, -3874, -8667, -10771, -21275, -23250, -13295, -4813, -7508, 93, 2845, 9454, 19014, 15595, 15450, 1204, 4993, 14398, 7857, 2608, -795, 8936, 7066, -12789, -28720, -38950, -32765, -16639, -6622, -17217, -16090, -9364, 516]
4781E16K235j0021j792K194L153o2j479J3726l86P188L549r753P844l845j1909
4766A158n659j268K55j1611n081j4858O92J5529k33M990R022R446R96p704p055
4751a1381j841j1003M193L132R222j584N584L551j660p947n054j943J0449J5726
4737I444J1811p912j2347j3548o862O816K765J834J7474O676J381p218J396j5759
4723d049l441k220m52J161O130j1420J3057N336n582M387J0571j1043j5287o61
4709a3513N08l441N690q78m195R954P714p203q315M715j467n930J284n810j074
4694b1961Q394k339k198J1114K764L261R0K122n568Q010M871p408R789m901j6464
4679a0424p091L043j0432R26K774J2663J5963O983p655j7197q998R808J3021N707
$$ y = [516, 2751, -7270, -9062, -6868, -3715, -3777, -5256, 8470, 8084, 15272, 18821, 9068, 16912, 13067, 1158, -4501, -5769, -5514, -17125, -22206, -37064, -36372, -20843, -21076, -16086, -7064, 2382, 3378, -4326, -11381, -13222, -24225, -20032, -16900, -7678, -9262, -3678, -127, -1787, -9734, -14788, -16731, -6282, 9444, 21255, 13343, 996, -12552, -19414, -12598, -9833, -7999, 9475, 16151, 17532, 10314, 11710, -4049, -7490, -9710, -10162, -9001, -2871, -14291, -1234, 4102, -1480, 2907, 13478, 2435, -12852, -13513, -13005, -16446, -10756, -11634, -15829, -5875, 1839, -5364, -13679, -8964, -10431, -16361, -15077, -20887, -21961, -13567, -15906, -18104, -6990, -4226, -965, -875, 1247, -4321, 3689, 8560, 1152, 10941, 6040, -10424, -17515, -14472, -24904, -23978, -21204, -8541, 7422, 14405, 6750, -10447, -19445, -9637, 3384, 9091]
4665I091l481O651j105k649M190P48j4402k177j079L358n566l64q530L427K1099
4650I211o012m5P825j9940k471m954l726R897N327M181P442o456m465L158M511
4635C483L053L892o804M776O176L406K146j2958j7053R709O151p955O541O928
4621A1491r739j0935J916m569K413M172J4903Q741L82l20q427P543m23q528J2983
4606B1603P094n147j9195j8084J380l243N956m754K307J3973R259m039l334o903
4592c127P538O590p688k637q660o035R422N987L623L099r900j4051L294J0782
4578a763Q077q54j779j215m931O006K431J1239P961j0447o189P148Q817j0605
4564A3896j1195O673J4081j4270k1j0732m510P485J2061L700j3707N115O282j2915
$$ y = [9091, 5610, 12261, 11156, 8507, 12697, 13445, -957, -3134, -4213, -855, -6421, -6785, -15315, -11888, 9211, 3199, 3154, 10979, -8961, -11432, -16386, -20112, -10215, -4888, -707, 6735, 279, -4186, -1028, 3483, 6536, 10428, 3624, 8400, 14576, 17982, 20128, 7170, -9883, -174, 5977, -1978, 4563, 11491, 1752, -9183, -7267, -11836, -9423, -5251, 9652, 18393, 18775, 18455, 10028, 17571, 17148, 8620, 21603, 28697, 23550, 4355, -13729, -12349, -15592, -9636, -14390, -12083, 1890, 11149, 7110, 3776, -3127, 4411, 11001, 3313, 676, -7984, -14019, -4597, 1390, 5013, 8112, -1788, -15839, -12545, -1763, 6314, 5460, 3681, 2466, -2465, 3541, 5972, 17211, 25172, 14725, 8536, 15684, 24501, 13896, 2701, 9374, 23455, 9185, 9164, -1568, -6078, 1407, 13468, 17168, 3461, 8576, 14858, 1943]
4550A943m116o531p758J975M229j91Q53N244l543L887J236J132l403L222l649
4535e470J3493O435l936j04pJ1432P584m731j1985K511n954p339n499q235n336
4520a7141N196P216k98O776P420m938r981N16K367q257O017L935j5553q370j902
4505b6997j854J7241O004k326l08J1561J744j9441N9Q531l838L360K786J5356
4491A1878J975N964L53p424q669n03L739j4086l428R805J369Q280L299p70n715
4476F067J071o188j3541Q128J2645r363k166k063L537j99l397n345o920k757M107
4461a6384n6N290l975l890P236m275p994r240M727J5593J3145k934k829K951q426
4446a1061m246l860q224L550J0677L722M208j2755q597Q612j250k891K085M667
$$ y = [1943, -2173, -8704, -16462, -14487, -10258, -10449, -9596, -4352, -7895, -4008, -2772, -1640, -5043, -1821, -5470, 8023, 14458, 10522, 10418, 10411, 21843, 29427, 24696, 12711, 15222, 9268, 1929, -3570, -11805, -17141, -11945, -4729, -5027, 1749, 9169, 4231, -5750, -5234, -2867, -11124, -5107, -1172, -16725, -25095, -26997, -28851, -11610, -5606, -7932, -8240, 3321, 5065, -14376, -14317, -5786, -9624, -6264, -3478, 11878, 13853, 19817, 20170, 12746, 4077, 3574, 7313, -6773, -10201, -396, 973, 9253, 12552, 11782, 6067, 7138, 950, -12591, -4463, 8182, -1181, -3347, -5410, -1873, -2072, -5469, -10814, -17734, -20491, -16384, -16440, -11150, -15125, -19015, -11779, -16054, -24048, -33288, -28561, -12968, 177, -2757, -5586, -2635, -11061, -15307, -19167, -27391, -23841, -13164, -9442, -5234, -17989, -26586, -17974, -19224, -22115, -20030, -15363]
4432a5363k974N296J0243j503l147O962K704J994M706M194j3692j1343P133M777
$$ y = [-15363, -18337, -13041, -2798, -4301, -7448, -486, 2218, 4212, 8918, 13112, -580, -11923, -4790, -13]
$$ [...]
##END NTUPLES=NMR SPECTRUM
##END=
