##TITLE=Analysis number 314404
Compound Code mo 00820
Book Reference 444/32
Project Code adrs
Chemist Name howarde
##JCAMPDX= 6.0         $$ Bruker NMR JCAMP-DX V2.0
##DATA TYPE= NMR SPECTRUM
##DATA CLASS= NTUPLES
##ORIGIN= Bruker BioSpin GmbH
##OWNER= NMR
$$ XWIN-NMR		Version 3.5
$$ Tue Oct 18 08:58:33 2005 GMT Daylight Time (UT+1h)  MAYBRIDGE\NMR@NMR_250MHZ
##.OBSERVE FREQUENCY= 250.131544655141
##.OBSERVE NUCLEUS= ^1H
##.ACQUISITION MODE= SIMULTANEOUS (DQD)
##.ACQUISITION SCHEME= undefined
##.AVERAGES= 16
##.DIGITISER RES= 18
##SPECTROMETER/DATA SYSTEM= dpx250
##.PULSE SEQUENCE= zg30
##.SOLVENT NAME= CDCl3
##.SHIFT REFERENCE= (INTERNAL, CDCl3, 0, 16.522)
##AUDIT TRAIL= $$ (NUMBER, WHEN, WHO, WHERE, WHAT)
$$ ##TITLE= Audit trail, XWIN-NMR		Version 3.5
$$ ##JCAMPDX= 5.01
$$ ##ORIGIN= Bruker BioSpin GmbH
$$ ##OWNER= NMR
$$ C:\u/data/dgb/nmr/ADRS/10910/pdata/1/auditp.txt
$$ ##AUDIT TRAIL=  $$ (NUMBER, WHEN, WHO, WHERE, WHAT)
(   1,<2005-10-18 08:57:59.27 +100>,<MAYBRIDGE\NMR>,<NMR_250MHZ>,
      <created by zg, POWCHK disabled, PULCHK disabled
       configuration hash MD5:
       62 19 C7 07 E1 42 D1 B7 37 6C 3D D0 77 39 F9 E6
       data hash MD5: 64K
       22 14 21 51 5B 36 C8 F6 BA B0 F0 53 12 EA 5D A5>)
(   2,<2005-10-18 08:58:16.19 +100>,<MAYBRIDGE\NMR>,<NMR_250MHZ>,
      <Start of raw data processing
       ef LB = 0.3 FT_mod = 6 PKNL = 1 SI = 32K 
       data hash MD5: 32K
       D1 5F DD 3C 88 F7 1D 88 FF E2 78 B8 09 DD 0D 68>)
(   3,<2005-10-18 08:58:19.03 +100>,<MAYBRIDGE\NMR>,<NMR_250MHZ>,
      <apk 
       data hash MD5: 32K
       39 F0 31 66 0C 49 ED 9D 63 35 44 D0 0A 55 EA 35>)
(   4,<2005-10-18 08:58:20.46 +100>,<MAYBRIDGE\NMR>,<NMR_250MHZ>,
      <abs ABSG = 5 
       data hash MD5: 32K
       9F 1F CF CA 83 B0 07 8C CA E3 84 C1 40 8B B9 60>)
$$ ##END=
$$ 
$$ hash MD5
$$ F0 05 90 FB E1 06 89 2E 09 2D 08 71 38 BD E9 A4
##$RELAX= 
##$RELAX= 
##$RELAX= 
##$RELAX= 
##$RELAX= 
##$RELAX= 
##$RELAX= 
$$ Bruker specific parameters
$$ --------------------------
##$DU= <C:\u>
##$EXPNO= 10910
##$NAME= <ADRS>
##$PROCNO= 1
##$TYPE= <nmr>
##$USER= <dgb>
##$AMP= (0..31)
100 100 100 100 100 100 100 100 100 100 100 100 100 100 100 100 100 100 
100 100 100 100 100 100 100 100 100 100 100 100 100 100 
##$AQSEQ= 0
##$AQ_mod= 3
##$AUNM= <au_zg>
##$AUTOPOS= <5 >
##$BF1= 250.13
##$BF2= 250.13
##$BF3= 250.13
##$BF4= 250.13
##$BF5= 500.13
##$BF6= 500.13
##$BF7= 500.13
##$BF8= 500.13
##$BYTORDA= 1
##$CFDGTYP= 0
##$CFRGTYP= 5
##$CHEMSTR= <none>
##$CNST= (0..31)
1 1 145 1 1 1 1 1 1 1 1 1 1 1 1 1 1 1 1 1 1 1 1 1 1 1 1 1 1 1 1 1 
##$CPDPRG= <>
##$CPDPRG1= <>
##$CPDPRG2= <>
##$CPDPRG3= <>
##$CPDPRG4= <mlev>
##$CPDPRG5= <mlev>
##$CPDPRG6= <mlev>
##$CPDPRG7= <mlev>
##$CPDPRG8= <mlev>
##$CPDPRGB= <>
##$CPDPRGT= <>
##$D= (0..31)
0 1 0 0 0 0 0 0 0 0.06 0 0 0 0 0 0 0.0002 0 0 0 0 0 0 0 0 0 0 0 0 0 0 
0 
##$DATE= 1129622278
##$DBL= (0..7)
120 120 120 120 120 120 120 120 
##$DBP= (0..7)
150 150 150 150 150 150 150 150 
##$DBP07= 0
##$DBPNAM0= <>
##$DBPNAM1= <>
$$ [...]
##$SUBNAM7= <"">
##$SUBNAM8= <"">
##$SUBNAM9= <"">
##$SW= 20.6930455092707
##$SWIBOX= (0..15)
0 0 3 0 0 0 0 0 0 0 0 0 0 0 0 0 
##$SW_h= 5175.983436853
##$TD= 65536
##$TD0= 1
##$TE= 294.16
##$TE2= 300
##$TE3= 300
##$TEG= 300
##$TL= (0..7)
0 120 120 120 120 120 120 120 
##$TP= (0..7)
150 150 150 150 150 150 150 150 
##$TP07= 0
##$TPNAME0= <>
##$TPNAME1= <>
##$TPNAME2= <>
##$TPNAME3= <>
##$TPNAME4= <>
##$TPNAME5= <>
##$TPNAME6= <>
##$TPNAME7= <>
##$TPOAL= (0..7)
0.5 0.5 0.5 0.5 0.5 0.5 0.5 0.5 
##$TPOFFS= (0..7)
0 0 0 0 0 0 0 0 
##$TUNHIN= 0
##$TUNHOUT= 0
##$TUNXOUT= 0
##$USERA1= <user>
##$USERA2= <user>
##$USERA3= <user>
##$USERA4= <user>
##$USERA5= <user>
##$V9= 5
##$VALIST= <valist>
##$VCLIST= <CCCCCCCCCCCCCCC>
##$VD= 0
##$VDLIST= <DDDDDDDDDDDDDDD>
##$VPLIST= <PPPPPPPPPPPPPPP>
##$VTLIST= <TTTTTTTTTTTTTTT>
##$WBST= 1024
##$WBSW= 4
##$XGAIN= (0..3)
0 0 0 0 
##$XL= 0
##$YL= 0
##$YMAX_a= 401060
##$YMIN_a= -340355
##$ZGOPTNS= <>
##$ZL1= 120
##$ZL2= 120
##$ZL3= 120
##$ZL4= 120
##$ABSF1= 16.522
##$ABSF2= -4.171173
##$ABSG= 5
##$ABSL= 3
##$ALPHA= 0
##$AQORDER= 0
##$ASSFAC= 0
##$ASSFACI= 0
##$ASSFACX= 0
##$ASSWID= 0
##$AUNMP= <proc_1d>
##$AZFE= 0.1
##$AZFW= 0.1
##$BCFW= 0
##$BC_mod= 0
##$BYTORDP= 0
##$COROFFS= 0
##$CY= 12.5
##$DATMOD= 1
##$DC= 0
##$DFILT= <>
##$DTYPP= 0
##$F1P= 14.0000005364418
##$F2P= -0.99999901652339
##$FCOR= 0.5
##$FTSIZE= 32768
##$FT_mod= 6
##$GAMMA= 0
##$GB= 0
##$INTBC= 1
##$INTSCL= 1
##$ISEN= 128
##$LB= 0.3
##$LEV0= 0
##$LPBIN= 0
##$MAXI= 10000
##$MC2= 0
##$MEAN= 0
##$ME_mod= 0
##$MI= 0
##$NCOEF= 0
##$NC_proc= -3
##$NLEV= 6
##$NOISF1= 0
##$NOISF2= 0
##$NSP= 0
##$NTH_PI= 0
##$NZP= 0
##$OFFSET= 16.522
##$PC= 1
##$PHC0= -63.09797
##$PHC1= 5.227376
##$PH_mod= 1
##$PKNL= yes
##$PPARMOD= 0
##$PSCAL= 4
##$PSIGN= 0
##$REVERSE= no
##$SF= 250.13
##$SI= 32768
##$SIGF1= 0
##$SIGF2= 0
##$SINO= 400
##$SIOLD= 32768
##$SREGLST= <1H.CDCl3>
##$SSB= 0
##$STSI= 32768
##$STSR= 0
##$SW_p= 5175.98343685301
##$SYMM= 0
##$S_DEV= 0
##$TDeff= 65536
##$TDoff= 0
##$TI= <Analysis number 999999
Compound Code 99
Book Reference 9
Project Code 9>
##$TILT= no
##$TM1= 0
##$TM2= 0
##$TOPLEV= 0
##$USERP1= <user>
##$USERP2= <user>
##$USERP3= <user>
##$USERP4= <user>
##$USERP5= <user>
##$WDW= 1
##$XDIM= 32768
##$YMAX_p= 383339244
##$YMIN_p= -576547
$$ End of Bruker specific parameters
$$ ---------------------------------
##NTUPLES= NMR SPECTRUM
##VAR_NAME=  FREQUENCY,     SPECTRUM/REAL,   SPECTRUM/IMAG
##SYMBOL=    X,             R,               I
##VAR_TYPE=  INDEPENDENT,   DEPENDENT,       DEPENDENT
##VAR_FORM=  AFFN,          ASDF,            ASDF
##VAR_DIM=   32768,         32768,           32768
##UNITS=     HZ,            ARBITRARY UNITS, ARBITRARY UNITS
##FACTOR=    0.157963299565203, 1,           1
##FIRST=     4132.6476996994, 0,             0
##LAST=      -1043.33573715361, 0,           0
##MIN=       -1043.33573715361, -576547,     0
##MAX=       4132.6476996994, 383339244,     0
$$ Real data points
##PAGE= N=1
##DATA TABLE= (X++(R..R)), XYDATA
$$ [...]
$$ plain form
19927 -11876 -26248 -33049 -46417 -36296 -19837 -15146 -17784 -32486 -14437 -19035 -12588 14102 -3673
19914 -3673 -10263 -5005 29538 46521 56171 47183 23849 15698 -3239 -18556 -2659 20420 55866
19901 55866 35427 -62900 -54299 -3121 13441 -50861 -63560 -59803 -56151 -44724 -16351 -38645
19889 -38645 -61339 -16378 10819 7746 -17023 -10398 37258 29956 -839 6499 37608 57826
19877 57826 17360 -4898 21890 -178 -9987 -2999 13989 31517 10194 -8644 -6658 -23285
19865 -23285 3320 -37991 -50612 18153 42144 -13954 -20815 -36390 -40901 -25313 -24885 -79637
19853 -79637 -74325 -85898 -27674 13778 7087 -48024 -62244 -71578 -90780 -16947 29489 35664
19841 35664 21007 -17192 -26303 -30887 -49719 -31209 -31228 -17970 -26217 -37979 -58437 -63224 -64871
$$ packed form
19927a1876j4372o801j3368J0121J6459M691k638j4702J8049m598O447K6690j7775
19914c673o590N258L4543J6983R650q988k3334q151j8937j5317J5897K3079L5446
19901E5866k0439r8327Q601N1178J6562o4302j2699L757L652J1427K8373k2294
19889c8645k2694M4961K7197l073k4769O625M7656p302l0795P338L1109K0218
19877E7826m0466k2258K6788k2068r809O988J6988J7528k1323j8838J986j6627
19865b3285K6605m1311j2621O8765K3991n6098o861j5575m511J5588M28n4752
19853g9637N312j1573N8224M1452o691n5111j4220r334j9202P3833M6436O175
19841C5664j4657l8199r111m584j8832J8510j9J3258q247j1762k0458m787j647
$$ plain form
19828 -64871 -44122 -16262 10797 -13622 -30729 -5245 -15608 -40834 -21724 7867 23852 62088
19816 62088 29194 25891 35782 16024 -8229 -20531 -19651 -17769 16082 4589 39330 24641 18496
19803 18496 -33501 -45261 5748 33994 29319 -11237 -35542 -19007 -6608 53651 25506 -18644
19791 -18644 -12286 -1809 4853 -28156 -50944 -50440 -16078 -33879 -1967 28038 29140 21723 -10486
19778 -10486 13923 30181 8405 -46431 -52681 -15362 -12509 2589 -3552 9349 29079 17046
19766 17046 -12641 -30028 9213 53277 89947 55610 34128 43245 -6310 5646 43496 47522
19754 47522 60150 39140 33196 1751 -14967 4372 -2312 6915 26721 14905 21271 46001
19742 46001 59334 67755 71331 50618 -3681 8957 19355 -9641 403 46946 77877 54736
$$ packed form
19828f4871K0749K7860K7059k4419j7107K5484j0363k5226J9110K9591J5985L8236
19816F2088l2894l303R891j9758k4253j2302Q80J882L3851j1493L4741j4689o145
19803A8496n1997j1760N1009K8246m675m0556k4305J6535J2399O0259k8145m4150
19791a8644O358J0477O662l3009k2788N04L4362j7801L1912L0005J102p417l2209
19778a0486K4409J6258k1776n4836o250L7319K853J5098o141J2901J9730j2033
19766A7046k9687j7387L9241M4064L6670l4337k1482R117m9555J1956L7850M026
19754D7522J2628k1010n944l1445j6718J9339o684R227J9806j1816O366K4730
19742D6001J3333Q421L576k0713n4299J2638J0398k8996J0044M6543L0931k3141
$$ plain form
19730 54736 14225 15864 40605 60815 48449 28437 -12353 -79582 -75547 -58756 -67750 -1097
19718 -1097 16283 -14997 9565 29666 26248 45251 64441 57207 -7780 -2419 3889 7589 -10404
19705 -10404 20927 34489 36538 8594 41813 60814 27588 -1180 -3453 -3155 26630 42617
19693 42617 17308 10958 54360 82700 43400 7489 4836 150 -26432 -46261 -11766 8365
19681 8365 -23626 -5514 10846 -5280 6589 79704 62943 60947 44803 8580 -3753 -34283
19669 -34283 -27190 -12496 -31655 -23327 4369 34462 34384 41977 58560 8674 -27169 6879 8214
19656 8214 46097 36375 34451 11482 -781 -851 -5947 -47361 -56573 -14198 51499 79477 99950
19643 99950 86491 72595 57212 24948 -5650 -9861 -10020 679 -14916 -16840 3957 21724
$$ packed form
19730E4736m0511J639K4741K0210j2366k0012m0790o7229M035J6791q994O6653
19718a097J7380l1280K4562K0101l418J9003J9190p234o4987N361O308L700j7993
19705a0404L1331J3562K049k7944L3219J9001l3226k8768k273K98K9785J5987
19693D2617k5309o350M3402K8340l9300l5911k653m686k6582j9829L4495K0131
19681H365l1991J8112J6360j6126J1869P3115j6761j996j6144l6223j2333l0530
19669c4283P093J4694j9159Q328K7696L0093p8P593J6583m9886l5843L4048J335
19656H214L7883r722j924k2969j2263p0n096m1414r212M2375O5697K7978K0473
19643I9950j3459j3896j5383l2264l0598m211j59J0699j5595j924K0797J7767
$$ plain form
19631 21724 43821 46524 22329 21088 -16564 -9787 -28346 -26834 -13110 6753 3015 7585 25806
19618 25806 42904 25017 -12072 -12472 23189 47231 18109 11328 12137 -47833 -17862 24394 50149
19605 50149 64606 13246 -15463 -8922 8610 16480 91 -20588 -30772 -14513 -5999 20437
19593 20437 42805 53878 37424 36523 59909 87796 88405 36414 56 -6438 -8063 16656 43837
19580 43837 52237 15861 21183 -9613 -2815 20162 -10269 -31359 10226 42165 24437 -28726
19568 -28726 -129 1312 7936 25373 7559 3739 19227 10508 7059 -34168 -30134 24559 46260
19555 46260 33068 39609 37962 27499 27881 -8126 -18832 6217 -4948 -18850 -32925 -24757 -30404
19542 -30404 -40326 -15167 -9385 -3852 18314 -9652 -24861 -34362 -47775 -6429 19824 20921 51494
$$ packed form
19631B1724K2097K703k4195j241l7652O777j8559J512J3724J9863l738M570J8221
19618B5806J7098j7887l7089m00L5661K4042k9122o781Q09n9970K9971M2256K5755
19605E0149J4457n1360k8709O541J7532P870j6389k0679j0184J6259Q514K6436
19593B0437K2368J1073j6454r01K3386K7887O09n1991l6358o494j625K4719K7181
19580D3837Q400l6376N322l0796O798K2977l0431k1090M1585L1939j7728n3163
19568b8726K8597J441O624J7437j7814l820J5488q719l449m1227M034N4693K1701
19555D6260j3192O541j647j0463L82l6007j0706K5049j1165j3902j4075Q168n647
19542c0404r922K5159N782N533K2166k7966j5209r501j3413M1346K6253J097L0573
$$ plain form
19529 51494 60191 61879 80293 58527 41743 52176 42991 25955 61396 82931 92357 93143 64575
19516 64575 65934 45794 58447 82615 61079 42579 26018 47598 82383 38144 18084 57198
19504 57198 80112 95161 64214 -15784 15504 56190 29201 27597 31398 26390 71776 36377
19492 36377 1446 43084 52178 67871 89576 90150 106741 77374 37816 35764 12943 2735
19480 2735 14220 59824 117895 164126 148934 118476 71613 91605 108611 63332 29844 74976
19468 74976 104142 96800 82131 96990 94329 65950 27281 8884 30236 36598 11924 40348
19456 40348 39987 -5068 -20840 -15411 -9611 -20159 -8334 64760 47530 3644 -4422 -53012 -98625
19443 -98625 -91337 -65373 -10428 13346 6850 -25924 -41886 -49733 -39821 -38975 -59407 -51997 -98189
$$ packed form
19529E1494Q697J688J8414k1766j6784J0433r185j7036L5441K1535R426P86k8568
19516F4575J359k0140J2653K4168k1536j8500j6561K1580L4785m4239k0060L9114
19504E7198K2914J5049l0947p9998L1288M0686k6989j604L801n008M5386l5399
19492C6377l4931M1638R094J5693K1705N74J6591k9367l9558k052k2821j0208
19480B735J1485M5604N8071M6231j5192l0458m6863J9992J7006m5279l3488M5132
19468G4976K9166p342j4669J4859k661k8379l8669j8397K1352O362k4674K8424
19456D0348l61m5055j5772N429N800j0548J1825P3094j7230m3886q066m8590m5613
19443i8625P288K5964N4945K3774o496l2774j5962p847R912Q46k0432P410m6192
$$ plain form
19430 -98189 -98659 -47645 -7634 34935 22482 679 500 3352 12198 29561 75648 29314 20017
19417 20017 24277 -16648 -53947 -17278 21642 53544 54085 58555 11078 16202 43610 75149 108320
19404 108320 93364 83591 88733 78437 60511 27453 26430 33299 74561 64187 9346 -2993
19392 -2993 -950 17322 35173 47994 15002 7131 51607 81158 36971 15461 72907 91426
19380 91426 34454 639 31247 30975 36835 14136 -19552 -34309 4100 46069 35561 23752
19368 23752 24548 -18639 -36164 -39501 16444 52742 48460 27850 18343 22748 49191 2749 -6280
19355 -6280 15866 13388 13342 34306 39407 27418 17496 -13380 18696 14940 18177 7674 26581
19342 26581 6318 -10632 -11524 -42575 -29364 -20140 -3992 6221 -37056 -33050 -43955 -22480
$$ packed form
19430i8189m70N1014M0011M2569j2453k1803j79K852Q846J7363M6087m6334r297
19417B0017M260m0925l7299L6669L8920L1902N41M470m7477N124K7408L1539L3171
19404A08320j4956r773N142j0296j7926l3058j023O869M1262j0374n4841j2339
19392b993K043J8272J7851J2821l2992p871M4476K9551m4187k1510N7446J8519
19380I1426n6972l3815L0608k72N860k2699l3688j4757L8409M1969j0508j1809
19368B3752P96m3187j7525l337N5945L6298m282k0610r507M405K6443m6442r029
19355f280K2146k478m6K0964N101j1989r922l0876L2076l756L237j0503J8907
19342B6581k0263j6950q92l1051J3211R224J6148J0213m3277M006j0905K1475
$$ plain form
19330 -22480 16740 36699 40190 1141 -70340 -56308 -6453 6364 -18069 -2335 -6699 -50021
19318 -50021 -69156 -46027 -69107 -48703 9584 24530 29331 7670 -9661 -18903 -13832 -75320
19306 -75320 -68627 -36461 -20343 -16840 -14979 -19609 -37788 -59706 -8827 38561 56170 65528 70733
19293 70733 39958 28674 2142 1475 -32676 -20987 13318 33975 17262 9922 7491 5083 12426
19280 12426 -33584 -8427 24506 13753 -33182 -41181 -4034 50516 79357 38715 -14353 -20656
19268 -20656 -33587 -32586 -44652 -42755 -20400 -21017 3850 21687 8876 5219 9408 42493 52484
19255 52484 43459 14805 35872 3308 -4340 -19567 -6707 29276 9173 7268 9980 56381
19243 56381 45667 45861 21220 -5708 -45728 -32809 -32272 -12999 -33706 -38238 -10618 30459 14557
$$ packed form
19330b2480L9220J9959L491l9049p1481J4032M9855J2817k4433J5734m364m3322
19318e0021j9135K3129k3080K0404N8287J4946M801k1661j7331r242N071o1488
19306g5320O693L2166J6118L503J861m630j8179k1918N0879M7388J7609R358N205
19293G0733l0775j1284k6532o67l4151J1689L4305K0657j6713p340k431k408P343
19280A2426m6010K5157L2933j0753m6935p999L7147N4550K8841m0642n3068o303
19268b0656j2931J001j2066J897K2355o17K4867J7837j2811l657M189L3085R991
19255E2484r025k8654K1067l2564p648j5227J2860L5983k0103j905K712M6401
19243E6381j0714J94k4641k6928m0020J2919N37J9273k0707m532K7620M1077j5902
$$ plain form
19230 14557 46278 90420 135753 155994 126991 114196 82803 97259 117705 122923 93627 93949
19218 93949 70961 103727 150073 170822 165361 157920 168889 157548 149025 135276 87381 69269
19206 69269 96024 109722 96096 52077 57411 72405 30237 4773 22737 76189 127275 124739
19194 124739 79609 65790 98831 70576 73915 67571 81041 97727 58608 37263 81418 108559
19182 108559 99218 95275 112741 96833 48331 31670 46099 21764 -17501 2269 26249 69362
19170 69362 82311 79420 76657 93702 88870 97979 184829 260455 361138 469130 541389 587002
19158 587002 600593 561894 547435 519755 440386 386241 348805 340243 329915 347603 433750 534652
19146 534652 617342 660779 666661 656717 632366 545820 462872 434994 328049 279318 232719 203055
$$ packed form
19230A4557L1721M4142M5333K0241k9003j2795l1393J4456K0446N218k9296L22
19218I3949k2988L2766M6346K0749n461p441J0969j1341q523j3749m7895j8112
19206F9269K6755J3698j3626m4019N334J4994m2168k5464J7964N3452N1086k536
19194A24739m5130j3819L3041k8255L339o344J3470J6686l9119k1345M4155K7141
19182A08559r341l943J7466j5908m8502j6661J4429k4335l9265J9770K3980M3113
19170F9362J2949k891k763J7045m832R109Q6850P5626J00683J07992P2259M5613
19158E87002J3591l8699j4459k7680p9369n4145l7436q562j0328J7688Q6147J00902
19146E34652Q2690M3437N882r944k4351q6546q2948k7878j06945m8731m6599k9664
$$ plain form
19134 203055 179085 156457 149272 125485 156926 188212 191801 198294 244940 247527 272144 326891
19122 326891 446571 524316 620395 641998 621431 549870 450528 327652 254690 203600 183857
19111 183857 150033 120167 113851 101435 111562 110507 104061 94536 79257 73275 96147 111647
19099 111647 127266 137737 136448 145732 148776 179988 207298 191308 144837 133849 109966 74551
19087 74551 85408 99830 89365 117525 121305 100241 119437 163330 177715 164245 181200 148962
19075 148962 95681 145046 178097 239680 318323 360766 442763 561177 616259 633058 566382
19064 566382 453263 355467 284130 238242 204289 222536 267457 276430 246167 232646 196173
19053 196173 177872 144184 139408 151766 125977 94992 70207 104823 159129 201274 178681 122805
$$ packed form
19134B03055k3970k2628p185k3787L1441L1286L589O493M6646K587K4617N4747
19122C26891J19680P7745R6079K1603k0567p1561r9342j22876p2962n1090j9743
19111A83857l3824k9866o316j2416J0127j055o446r525j5279n982K2872J5500
19099A11647J5619J0471j289R284L044L1212K7310j5990m6471j0988k3883l5415
19087G4551J0857J4422j0465K8160L780k1064J9196M3893J4385j3470J6955l2238
19075A48962n3281M9365L3051O1583P8643M2443Q1997J18414N5082J6799o6676
19064E66382j13119r7796p1337m5888l3953J8247M4921Q973l0263j3521l6473
19053A96173j8301l3688m776J2358k5789l0985k4785L4616N4306M2145k2593n5876
$$ plain form
19041 122805 113306 103138 85101 76077 92533 71227 59216 92185 104203 98735 121712 140683
19029 140683 103154 77224 79597 74828 61076 10531 25889 54748 39354 29021 -2028 -7014
19017 -7014 -45881 -66162 -38323 -30814 -4441 -23541 -12568 38741 64224 93113 86922 41017
19005 41017 26929 14307 23658 35758 37218 40970 69371 86653 47653 36992 32946 59360
18993 59360 88091 53159 13036 40650 42236 8808 -10563 -9608 -18061 -27276 14915 5000 11134
18980 11134 54444 89451 69408 8794 7924 32284 31784 53657 87506 75551 69996 54962 65931
18967 65931 65454 24532 36859 46466 63155 54159 31896 33591 48906 41057 9138 -4284 -1467
18954 -1467 -6070 29835 74714 64058 83076 147529 166366 160982 131933 108384 117349 107776 71127
$$ packed form
19041A22805r499j0168j8037r024J6456k1306j2011L2969J2018n468K2977J8971
19029A40683l7529k5930K373m769j3752n0545J5358K8859j5394j0333l1049m986
19017g014l8867k0281K7839P509K6373j9100J0973N1309K5483K8889o191m5905
19005D1017j4088j2622R351J2100J460L752K8401J7282l9000j0661m046K6414
18993E9360K8731l4932m0123K7614J586l3428j9371R55q453r215M2191r915O134
18980A1134M3310L5007k0043o0614q70K4360n00K1873L3849j1955n555j5034J0969
18967F5931m77m0922J2327R607J6689q996k2263J695J5315p849l1919j3422K817
18954a467m603L5905M4879j0656J9018O4453J8837n384k9049k3549Q965r573l6649
$$ plain form
18941 71127 50504 31992 54458 68508 59839 40309 67757 156366 149356 118054 72333 30971
18929 30971 -9873 -41706 -32110 -19440 -26358 -33248 -38315 -26694 -19049 7286 16618 5772 24066
18916 24066 44042 38042 30073 -3577 -19950 -18318 16844 79915 101568 87753 99965 116774
18904 116774 138366 128725 114629 92566 86471 70173 82176 96412 90008 70536 24653 32385
18892 32385 32788 51123 48462 65004 100619 132851 114740 125399 137470 119709 141561 153387
18880 153387 89379 65692 72796 126293 160379 184067 201277 154794 134932 133175 145560 138914
18868 138914 101182 74250 73942 117375 150623 168898 161361 115072 156431 133416 98514 74776
18856 74776 33555 67914 109061 101071 61305 77029 70045 64604 113906 93378 20161 -3772
$$ packed form
18941G1127k0623j8512K2466J4050q669j9530K7448Q8609p010l1302m5721m1362
18929C0971m0844l1833R596J2670o918o890n067J1621P645K6335R332j0846J8294
18916B4066J9976o000p969l3650j6373J632L5162O3071K1653j3815J2212J6809
18904A16774K1592r641j4096k2063o095j6298J2003J4236o404j9472m5883P732
18892C2385M03J8335k661J6542L5615L2232j8111J0659J2071j7761K1852J1826
18880A53387o4008k3687P104N3497L4086K3688J7210m6483j9862j757J2385o646
18868A38914l7732k6932l08M3433L3248J8275p537m6289M1359k3015l4902k3738
18856G4776m1221L4359M1147p990l9766J5724o984n441M9302k0528p3217k3933
$$ plain form
18844 -3772 5327 63614 76260 91430 111298 84943 64177 64047 67685 39045 10630 -20326 7382
18831 7382 762 -20978 -69563 -91952 -59581 -20207 15642 46796 156141 233230 219173 190728
18819 190728 205041 211250 216373 189672 166490 146674 142191 179578 263604 310017 319159 330728
18807 330728 282962 254120 262995 268889 233311 229069 254174 290370 314152 292819 240049 277587
18795 277587 315823 315656 345307 317847 293061 294285 295422 299226 339497 375120 412772 424088
18783 424088 512281 609807 723499 795653 851679 928219 903675 824481 769499 706073 661694
18772 661694 626976 662152 734410 768705 815433 901604 1013220 1161325 1279624 1236388 1123739
18761 1123739 1004603 875453 733749 617943 552495 522064 493717 454623 452482 487464 476018
$$ packed form
18844c772R099N8287J2646J5170J9868k6355k0766j30L638k8640k8415l0956K7708
18831G382o620k1740m8585k2389L2371L9374L5849L1154J09345P7089j4057k8445
18819A90728J4313O209N123k6701k3182j9816m483L7387Q4026M6413R142J1569
18807C30728m7766k8842Q875N894l5578m242K5105L6196K3782k1333n2770L7538
18795B77587L8236j67K9651k7460k4786J224J137L804M0271L5623L7652J1316
18783D24088Q8193R7526J13692P2154N6026P6540k4544p9194n4982o3426m4379
18772F61694l4718L5176P2258L4295M6728Q6171J11616J48105J18299m3236j12649
18761A123739j19136j29150j41704j15806o5448l0431k8347l9094k141L4982j1446
$$ plain form
18750 476018 484867 463992 477399 521562 537023 439488 394610 377881 324636 355797 386200 407679
18738 407679 366050 340575 329996 329540 334548 360851 421295 510710 604762 699584 768609 828064
18726 828064 914140 919193 884664 828568 798661 775952 801250 884488 927851 937084 1007043 994409
18714 994409 950749 859665 765874 711996 665322 622305 568496 538579 518882 471279 434142
18703 434142 445693 455634 465564 470932 488599 537968 511704 474683 508945 572490 599900 608214
18691 608214 564688 517109 535861 545718 544135 503966 471846 507354 579893 618568 672878 726224
18679 726224 759131 797949 847349 914858 967169 1051474 1155725 1137870 1090649 1095824 1165459
18668 1165459 1271845 1367771 1451839 1608923 1733869 1825178 1911933 1995378 2185074 2388149
$$ packed form
18750D76018Q849k0875J3407M4163J5461r7535m4878j6729n3245L1161L0403K1479
18738D07679m1629k5475j0579m56N008K6303O0444Q9415R4052R4822O9025N9455
18726H28064Q6076N053l4529n6096k9907k2709K5298Q3238M3363R233O9959j2634
18714I94409m3660r1084r3791n3878m6674m3017n3809k9917j9697m7603l7137
18703D34142J1551R941R930N368J7667M9369k6264l7021L4262O3545K7410Q314
18691F08214m3526m7579J8752R857j583m0169l2120L5508P2539L8675N4310N3346
18679G26224L2907L8818M9400O7509N2311Q4305J04251j7855m7221N175O9635
18668A165459J06386R5926Q4068J57084J24946R1309Q6755Q3445J89696K03075
$$ plain form
18658 2388149 2581773 2816951 2933675 3058310 3223669 3380094 3580227 3849735 4253866
18649 4253866 4788844 5373742 6038450 6876635 7801809 8906749 10278979 12250352 15207391
18640 15207391 19893778 27359517 38224793 51012480 65461906 81053711 90424652
18633 90424652 94752325 95056671 86366054 76220086 66955865 58017991 52677630 52200362
18625 52200362 56813620 65842622 77161492 91159620 104271644 109600351 111341593 106057598
18617 106057598 92968654 79953863 66657666 54113951 44621120 37750098 32692283
18610 32692283 28997339 26299810 24279822 22737746 21547194 20550862 19656298 18802969
18602 18802969 18056428 17457374 17134944 17238014 17918003 19479054 22381366 27475010 36205946
$$ packed form
18658B388149J93624K35178J16724J24635J65359J56425K00133K69508M04131
18649D253866N34978N84898O64708Q38185R25174J104940J372230J971373K957039
18640A5207391M686387P465739J0865276J2787687J4449426J5591805R370941
18633I0424652M327673L04346q690617j0145968r264221q937874n340361m77268
18625E2200362M613258R029002J1318870J3998128J3112024N328707J741242n283995
18617A06057598j3088944j3014791j3296197j2543715r492831o871022n057815
18610C2692283l694944k697529k019988j542076j190552r96332q94564q53329
18602A8802969p46541n99054l22430J03070O79989J561051K902312N093644Q730936
$$ plain form
18593 36205946 50102138 68224579 86116203 96428918 96700797 86887066 71410591
18586 71410591 56282483 44324311 35767241 29610644 25087584 21722446 19248780 17426801
18578 17426801 16081816 15054656 14157646 13325681 12500982 11654867 10772880 9870953 9087665
18569 9087665 8480086 8027178 7702292 7420224 7160204 6892119 6649033 6372542 6001021
18560 6001021 5695336 5459264 5224589 5041215 4937080 4964581 5209924 5574349 6024320 6523495
18550 6523495 7162247 7942988 8918717 10185900 11962223 14623121 18717236 25106336 35471323
18541 35471323 52133310 75641152 101667304 121545966 127859936 120543723 101809577
18534 101809577 80782559 62741556 49481587 39992126 33166389 28235729 24632715
$$ packed form
18593C6205946J3896192J8122441J7891624J0312715K71879r813731j5476475
18586G1410591j5128108j1958172q557070o156597m523060l365138k473666j821979
18578A7426801j344985j027160q97010q31965q24699q46115q81987r01927p83288
18569I087665o07579m52908l24886k82068k60020k68085k43086k76491l71521
18560F001021l05685k36072k34675j83374j04135K7501K45343L64425M49971M99175
18550F523495O38752P80741R75729J267183J776323K660898M094115O389100J0364987
18541C5471323J6661987K3507842K6026152J9878662O313970p316213j8734146
18534A01809577k1027018j8041003j3259969r489461o825737m930660l603014
$$ plain form
18527 24632715 22017886 20098183 18643453 17505022 16482152 15397646 14232280 12993688
18519 12993688 11710974 10456682 9310065 8384278 7611734 6986516 6524640 6167065 5887203
18510 5887203 5643340 5342573 4975620 4601240 4240282 3914136 3592305 3313605 3015759
18501 3015759 2724349 2504143 2327982 2212501 2080580 1919976 1805004 1700531 1631019 1533945
18491 1533945 1389431 1251060 1151738 1048595 954859 927619 872515 804882 800064 806588 843376
18480 843376 877329 894521 864145 823604 806161 789784 779946 791664 750012 677318 657445 672475
18468 672475 704448 732197 739946 766470 759826 734300 695850 629724 590961 547335 477185 385912
18456 385912 405873 461316 476974 506072 628829 737017 755150 697631 634883 567771 491432
$$ packed form
18527B4632715k614829j919703j454730j138431j022870j084506j165366j238592
18519A2993688j282714j254292j146617r25787p72544o25218m61876l57575k79862
18510E887203k43863l00767l66953l74380l60958l26146l21831k78700k97846
18501C015759k91410k20206j76161j15481j31921j60604j14972j04473o9512r7074
18491A533945j44514j38371r9322j03143r3736k7240n5104o7633m818O524L6788
18480H43376L3953J7192l0376m0541j7443j6377r838J1718m1652p2694j9873J5030
18468F72475L1973K7749P749K6524o644k5526l8450o6126l8763m3626p0150r1273
18456C85912J9961N5443J5658K9098J22757J08188J8133n7519o2748o7112p6339
$$ plain form
18445 491432 461682 442416 427942 391549 429071 402312 339018 328929 298118 233258 229288 231635
18433 231635 224601 277807 346747 373514 427211 435730 425499 427247 449318 421689 402197 401447
18421 401447 385477 437820 508347 560789 568892 539098 551644 559884 571137 571510 603155 686845
18409 686845 691960 624853 567901 459305 359549 305898 284646 278610 225949 221746 290576 356298
18397 356298 428212 437451 408959 428305 462319 497202 469760 461811 464199 493729 462220 439361
18385 439361 446255 439332 467714 488711 502846 534504 602298 707812 747212 757845 730968 653580
18373 653580 604086 564739 498213 458857 480601 479277 494423 556727 619818 651966 726412 764444
18361 764444 778778 833441 870022 907951 930759 871692 783648 709306 609451 551206 476981
$$ packed form
18445D91432k9750j9266j4474l6393L7522k6759o3294j0089l0811o4860l970K347
18433B31635p034N3206O8940K6767N3697Q519j0231J748K2071k7629j9492p50
18421D01447j5970N2343P0527N2442Q103k9794J2546Q240J1253L73L1645Q3690
18409F86845N115o7107n6952j08596r9756n3651k1252o036n2661m203O8830O5722
18397C56298P1914R239k8492J9346L4014L4883k7442p949K388K9530l1509k2859
18385D39361O894o923K8382K0997J4135L1658O7794J05514L9400J0633k6877p7388
18373F53580m9494l9347o6526l9356K1744j324J5146O2304O3091L2148P4446L8032
18361G64444J4334N4663L6581L7929K2808n9067q8044p4342r9855n8245p4225
$$ plain form
18350 476981 394264 349665 344394 408894 464087 514474 554214 521442 502942 476184 425428 405925
18338 405925 342973 321348 335567 386812 387969 388660 404798 457857 460312 442960 442673 493725 518982
18325 518982 534037 541648 595229 603599 557155 513013 513743 549116 569909 577903 567058 527105
18313 527105 521418 499367 525260 526765 511654 480099 488519 481653 499267 470228 534068 552010
18301 552010 559176 593993 588448 630269 711664 810376 928147 1052192 1136496 1168144 1192568
18290 1192568 1201563 1147454 1150189 1163283 1223044 1330023 1468021 1661663 1835353 1951322 2069566
18279 2069566 2167798 2203840 2261661 2386743 2560690 2789891 3100032 3446658 3899314 4469737
18269 4469737 5159550 6110409 7370503 9148280 11861790 16150973 22927965 32484358
$$ packed form
18350D76981q2717m4599n271O4500N5193N0387L9740l2772j8500k6758n0756j9503
18338D05925o2952k1625J4219N1245J157O91J6138N3059K455j7352k87N1052K5257
18325E18982J5055P611N3581Q370m6444m4142P30L5373K0793P994j0845l9953
18313E27105n687k2051K5893J505j5111l1555Q420o866J7614k9039O3840J7942
18301E52010P166L4817n545M1821Q1395R8712J17771J24045Q4304L1648K4424
18290A192568Q995n4109K735J3094N9761J06979J37998J93642J73690J15969J18244
18279B069566R8232L6042N7821J25082J73947K29201L10141L46626M52656N70423
18269D469737O89813R50859J260094J777777K713510M289183O776992R556393
$$ plain form
18261 32484358 42203233 50814066 60247302 63594594 58716070 53706674 47299650 39532497
18253 39532497 33698974 30441279 29718858 31724587 36882701 44443106 51506699 58688354
18245 58688354 65445547 63980599 57874656 51935855 43735876 35244773 28710972 23913969
18237 23913969 20330658 17675956 15638005 14145249 13059035 12230007 11566496 10968962
18229 10968962 10351034 9751385 9194048 8585394 7982160 7453006 7006632 6649181 6397442
18220 6397442 6254352 6181997 6164659 6320627 6700427 7284091 8223539 9744007 12229115
18211 12229115 16145349 22115328 29332014 35633749 42374750 47798599 46116644 42147981
18203 42147981 38167473 32297495 26998448 23715608 22304047 22787439 25527128 30468356
$$ packed form
18261C2484358R718875Q610833R433236L347292m878524n009396o407024p767153
18253C9532497n833523l257695p22421K005729N158114P560405P063593P181655
18245E8688354O757193j464948o105943n938801q199979q491103o533801m797003
18237B3913969l583311k654702k037951j492756j086214q29028o63511n97534
18229A0968962o17928n99649n57337o08654o03234n29154m46374l57451k51739
18220F397442j43090p2355j7338J55968L79800N83664R39448J520468K485108
18211A2229115L916234N969979P216686O301735O741001N423849j681955l968663
18203D2147981l980508n869978n299047l282840j411561M83392K739689M941228
$$ plain form
18195 30468356 35983663 40942263 46796617 49006392 44992198 40646068 35300843 28530967
18187 28530967 22904767 18801172 15787425 13519613 11779002 10476347 9467362 8706366
18179 8706366 8138279 7610587 7083518 6585050 6095207 5612338 5131434 4676323 4250609
18170 4250609 3861583 3513574 3155439 2846538 2592557 2334449 2142497 2027739 1899532
18161 1899532 1758219 1689419 1647586 1570842 1454878 1380014 1287433 1225281 1143157 1048033 963805
18150 963805 896117 880166 823453 774264 760136 773994 739293 730018 706657 681148 649095 648080
18138 648080 624810 642443 693985 697676 682670 707187 714572 695582 695463 748998 848433 901306
18126 901306 899045 907278 984049 1109018 1302214 1483362 1683137 1886379 2089701 2373376
$$ packed form
18195C0468356N515307M958600N854354K209775m014194m346130n345225o769876
18187B8530967n626200m103595l013747k267812j740611j302655j008985p60996
18179H706366n68087n27692n27069m98468m89843m82869m80904m55111m25714
18170D250609l89026l48009l58135l08901k53981k58108j91952j14758j28207
18161A899532j41313o8800m1833p6744j15964p4864r2581o2152q2124r5124q4228
18150I63805o7688j5951n6713m9189j4128J3858l4701r275k3361k5509l2053j015
18138F48080k3270J7633N1542L691j5006K4517P385j8990j19N3535R9435N2873
18126I01306k261Q233P6771J24969J93196J81148J99775K03242K03322K83675
$$ plain form
18116 2373376 2774106 3238847 3828655 4764140 6131757 8098310 11171979 16476553 25978312
18107 25978312 42814584 65804993 72684206 55201831 39841066 30042595 23239164
18100 23239164 18524558 15153919 12744422 10935559 9563009 8500726 7804264 7317063
18092 7317063 7013978 6866918 6658663 6217167 5645920 5093342 4565598 4100733 3672171
18083 3672171 3296793 2943149 2683754 2418632 2119700 1883693 1694889 1555196 1453965
18074 1453965 1356249 1277490 1253165 1253172 1189935 1059992 984283 869493 775881 705296 664172 572763
18062 572763 517462 477964 416641 395776 398346 415051 420817 455753 489771 534189 571428 637954
18050 637954 727672 845569 935769 942357 910097 815527 658372 526382 491088 429933 410645
$$ packed form
18116B373376M00730M64741N89808R35485J367617J966553L073669N304574R501759
18107B5978312J6836272K2990409O879213j7482375j5360765r798471o803431
18100B3239164m714606l370639k409497j808863j372550j062283o96462m87201
18092G317063l03085j47060k08255m41496n71247n52578n27744m64865m28562
18083C672171l75378l53644k59395k65122k98932k36007j88804j39693j01231
18074A453965r7716p8759k4325Po3237j29943p5709j14790r3612p0585m1124r1409
18062E72763n5301l9498o1323k0865K570J6705N766L4936L4018M4418L7239O6526
18050F37954Q9718J17897R0200O588l2260r4570j57155j31990l5294o1155j9288
$$ plain form
18039 410645 397640 324134 306123 302375 291290 304550 330173 328772 367708 383384 369698 333407
18027 333407 314171 307945 293858 277529 264622 213200 161321 183269 254852 267094 273440 256411
18015 256411 278675 243835 224929 225883 275224 329828 276023 235976 177486 171716 177241 169498
18003 169498 169409 169917 178971 240349 316045 372673 456200 533372 583673 592806 516129 426427 355053
17990 355053 316184 284922 271639 227010 202556 206663 193776 220595 242393 239650 213658 209745
17978 209745 195126 165703 148952 93851 67024 45993 88047 131918 134660 133309 144063 158670
17966 158670 199410 203264 199592 188443 163139 154127 149831 174552 145920 94299 117354 114126
17954 114126 76727 73346 75449 66014 65564 22305 26390 67596 57526 52049 44791 57504 45704
$$ packed form
18039D10645j3005p3506j8011l748j1085J3260K5623j401L8936J5676j3686l6291
18027C33407j9236o226j4087j6329j2907n1422n1879K1948P1583J2242O346j7029
18015B56411K2264l4840j8906R54M9341N4604n3805m0047n8490n770N525p743
18003A69498q9N08R054O1378P5696N6628Q3527P7172N0301R133p6677q9702p1374
17990C55053l8869l1262j3283m4629k4454M107j2887K6819K1798k743k5992l913
17978B09745j4619k9423j6751n5101k6827k1031M2054M3871K742j351J0754J4607
17966A58670M0740L854l672j1149k5304r012m296K4721k8632n1621K3055l228
17954A14126l7399l381K103r435m50m3259M085M1206j0070n477p258J2713j1800
$$ plain form
17941 45704 22305 -4593 -45888 -9987 35247 33041 19199 858 -36484 1017 4649 -31212
17929 -31212 -33294 -17252 29047 44360 3334 -16414 -7544 -15031 16386 15698 -52336 -113390 -129662
17916 -129662 -101060 -26942 33993 65914 69640 90230 60260 64141 42453 67781 72908 56041
17904 56041 28372 7958 14992 -7963 -13600 -16201 9172 32767 49624 62836 51876 -3193
17892 -3193 -30102 -32983 6925 42643 53406 28679 -22050 -56154 -74279 -70052 -87081 -28530
17880 -28530 12094 15985 46434 61266 29028 28476 53152 57862 64710 66519 88849 82829 58685
17867 58685 43158 69679 45108 -5311 -20261 -876 19145 16563 1423 -1978 10302 50575
17855 50575 94725 93448 60451 88446 91763 95203 64950 26421 34765 90270 108410 77609
$$ packed form
17941D5704k3399k6898m1295L5901M5234k206j3842j8341l7342L7501L632l5861
17929c1212k082J6042M6299J5313m1026j9748Q870p487L1417o88o8034o1054j6272
17916a29662K8602P4118O0935L1921L726K0590k9970L881k1688K5328N127j6867
17904E6041k7669k0414P034k2955n637k601K5373K3595J6857J3212j0960n5069
17892c193k6909k881L9908L5718J0763k4727n0729l4104j8125M227j7029N8551
17880b8530M0624L891L0449J4832l2238n52K4676M710O848J809K2330o020k4144
17867E8685j5527K6521k4571n0419j4950J9385K0021k582j5140l401J2280M0273
17855E0575M4150j277l2997K7995L317L440l0253l8529Q344N5505J8140l0801
$$ plain form
17843 77609 61838 54068 33831 34605 26925 -9546 -20735 -17175 9010 39613 71009 23724 21311
17830 21311 14913 7157 -4909 -22367 -13802 -42210 -26254 -34644 -53772 -33105 34895 3531
17818 3531 -14605 31393 54916 56454 60880 58989 43668 36886 1688 4748 37232 59430 36222
17805 36222 21431 5665 26502 82296 64201 37859 33216 8046 25317 30927 15597 17694
17793 17694 -4464 -1817 3044 -31151 -65412 -63726 969 207 -12211 -26883 -36935 -54362 -75006
17780 -75006 -65038 -71959 -6440 18453 25599 43434 63264 39143 -1664 -1158 17088 -16386 -48249
17767 -48249 -52060 -19734 21139 23756 28405 44639 30999 -1255 12714 33 -23070 -6919
17755 -6919 21380 -27647 -62967 -54064 -29617 4468 38221 64562 106412 114400 32246 28688
$$ packed form
17843G7609j5771p770k0237P74p680l6471j1189L560K6185L0603L1396m7285k413
17830B1311o398p756j2066j7458Q565k8408J5956q390j9128K0667O8000l1364
17818C531j8136M5998K3523J538M426j891j5321o782l5198L060L2484K2198k3208
17805C6222j4791j5766K0837N5794j8095k6342m643k5170J7271N610j5330K097
17793A7694k2158K647M861l4195l4261J686O4695p62j2418j4672j0052j7427k0644
17780g5006R968o921O5519K4893P146J7835J9830k4121m0807N06J8246l3474l1863
17767d8249l811L2326M0873K617M649J6234j3640l2254J3969j2681k3103J6151
17755f919K8299m9027l5320Q903K4447L4085L3753K6341M1850P988q2154l558
$$ plain form
17743 28688 21468 47331 91642 145577 227881 285482 359299 421109 403492 343055 307846 228694
17731 228694 170384 139227 106305 125787 175665 239068 279885 362396 409160 384360 339241
17720 339241 281562 225324 158025 127654 78962 29115 55195 70652 101366 38498 28317
17709 28317 65420 66783 26277 51759 62591 57707 68334 49546 41231 48628 39934 38018 76624
17696 76624 52915 19616 -1038 60442 118142 121317 86212 69155 86353 132028 146209 195216
17684 195216 264551 293397 269698 172351 132422 143864 139501 150562 173771 204067 256264 245840
17672 245840 262434 267798 274068 270009 217460 187793 184565 179932 163493 93314 35069 29481 43419
17659 43419 59019 69527 55609 992 -47067 -11297 16695 53271 54033 35133 29165 48568
$$ packed form
17743B8688p220K5863M4311N3935Q2304N7601P3817O1810j7617o0437l5209p9152
17731B28694n8310l1157l2922J9482M9878O3403M0817Q2511M6764k4800m5119
17720C39241n7679n6238o7299l0371m8692m9847K6080J5457L0714o2868j0181
17709B8317L7103J363m0506K5482J0832m884J0627j8788q315P397q694j916L8606
17696G6624k3709l3299k0654O1480N7700L175l5105j7057J7198M5675J4181M9007
17684A95216O9335K8846k3699r7347l9929J1442m363J1061K3209L0296N2197j0424
17672B45840J6594N364O270m059n2549k9667l228m633j6439p0179n8245n588J3938
17659D3419J5600J0508j3918n4617m8059L5770K7992L6576P62j8900n968J9403
$$ plain form
17647 48568 68568 91196 98262 67375 49383 45447 27736 12797 59230 96617 94593 63118
17635 63118 48152 50027 61891 71024 60239 61912 8864 1485 35066 22054 9947 -8874
17623 -8874 33265 44845 65895 58495 -847 -18816 11410 22605 5214 -22189 -6622 -1994
17611 -1994 13695 44482 73332 102831 80737 59252 64883 40636 -5525 -10539 -28699 -27373
17599 -27373 19517 50459 59692 54411 32706 9210 7255 13801 17159 13060 32349 35446 -7462
17586 -7462 7321 49025 53943 32784 55881 85137 59166 34296 -2696 -24098 -68208 -103230
17574 -103230 -106684 -72454 -21847 -53196 -54151 -58747 -94277 -77192 -70177 -79274 -33307 -3117 -22542
17561 -22542 -13147 9466 39209 22346 -14211 -30465 -66093 -59979 14349 27555 16519 51350
$$ packed form
17647D8568K0000K2628P066l0887j7992l936j7711j4939M6433L7387k024l1475
17635F3118j4966J875J1864R133j0785J673n3048p379L3581j3012j2107j8821
17623h874M2139J1580K1050p400n9342j7969L0226J1195j7391k7403J5567M628
17611a994J5689L0787K8850K9499k2094k1485N631k4247m6161n014j8160J326
17599b7373M6890L0942R233n281k1705k3496j955O546L358m099J9289L097m2908
17586g462J4783M1704M918k1159K3097K9256k5971k4870l6992k1402m4110l5022
17574a03230l454L4230N0607l1349r55m596l5530J7085P015r097M5967L0190j9425
17561b2542R395K2613K9743j6863l6557j6254l5628O114P4328J3206j1036L4831
$$ plain form
17549 51350 45993 55317 8959 -22542 -36764 -12589 47106 67199 45972 48018 40998 27090
17537 27090 38640 72965 66288 49374 47755 61946 56258 10237 -6671 -4764 -22576 -12400
17525 -12400 -32581 -28244 -6640 -10183 9203 -9273 -32652 -20811 1747 24505 9525 -2787
17513 -2787 -37466 -55204 -84950 -77855 -52117 -53846 -16208 8780 16223 23884 26561 -662 -28115
17500 -28115 -65394 -75263 -64855 -53492 -45704 -27450 -20808 -65480 -46229 -20174 2473 -9825
17488 -9825 -15566 -33154 -36660 -17042 16502 -11283 -67953 -96341 -42697 660 -10209 -41606
17476 -41606 -61134 -49463 -55692 -45301 -33043 -13305 -3306 4481 -3970 -29257 -55001 -21484
17464 -21484 -5930 -20034 -30828 -60058 -76203 -104270 -73436 -60087 -69613 -73443 -89836 -83066
$$ packed form
17549E1350n357R324m6358l1501j4222K4175N9695K0093k1227K046p020j3908
17537B7090J1550L4325o677j6914j619J4191n688m6021j6908J907j7812J0176
17525a2400k0181M337K1604l543J9386j8476k3379J1841K2558K2758j4980j2312
17513b787l4679j7738k9746P095K5738j729L7638K4988P443P661K677k7223k7453
17500b8115l7279r869J0408J1363P788J8254O642m4672J9251K6055K2647j2298
17488i825n741j7588l506J9618L3544k7785n6670k8388N3644M3357j0869l1397
17476d1606j9528J1671o229J0391J2258J9738R999P787q451k5287k5744L3517
17464b1484J5554j4104j0794k9230j6145k8067L0834J3349r526l830j6393O770
$$ plain form
17452 -83066 -75611 -103890 -84011 -8964 21041 28288 26002 11030 45927 72109 94063 182110
17440 182110 302637 420142 347739 239604 194235 133356 90922 91552 129062 114074 75457
17429 75457 41093 29910 -16824 -6625 32356 62382 53458 52823 58986 42314 68960 68110 43112
17416 43112 -1433 -7986 -23278 35738 26060 6708 30505 34478 8865 -9930 -19469 22731
17404 22731 27732 3423 3494 -15109 4192 25685 14371 -5456 -51658 -44762 -38213 -24442 -31527
17391 -31527 -25541 -6876 5067 12000 5073 17983 4708 28863 39131 47518 39154 3599 -24853
17378 -24853 -38798 -35092 -21880 -15800 -16199 -23341 -2977 1711 -4627 1915 30763 49398 13215
17365 13215 27170 33126 38515 18512 27107 41121 31186 -8078 38562 81817 71676 673
$$ packed form
17452h3066P455k8279J9879P5047L0005P247k286j4972L4897K6182K1954Q8047
17440A82110J20527J17505p2403j08135m5369o0879m2434O30L7510j4988l8617
17429G5457l4364j1183m6734J0199L8981L0026q924o35O163j6672K6646q50k4998
17416D3112m4545o553j5292N9016r678j9352K3797L973k5613j8795r539M2200
17404B2731N001k4309P1j8603J9301K1493j1314j9827m6202O896O549J3771p085
17391c1527N986J8665J1943O933o927J2910j3275K4155J0268Q387q364l5555k8452
17378b4853j3945L706J3212O080l99p142K0364M688o338O542K8848J8635l6183
17365A3215J3955N956N389k0003Q595J4014r935l9264M6640M3255j0141p1003
$$ plain form
17353 673 -36388 -24477 -25816 -32348 5311 24294 27183 -14735 -53797 -7515 48779 25792 867
17340 867 -16391 -35704 -16900 -31683 -17896 -63948 -69459 8450 30675 20773 -11632 -12144 -5900
17327 -5900 42319 25443 8391 -31506 -62274 -69796 -41624 -42461 -24978 1058 10507 12141 -12009
17314 -12009 -36621 -18944 -12187 -4025 13697 32184 3193 -4429 35574 60239 70272 62232
17302 62232 37534 3215 14281 -9099 -35581 -27029 -6004 -9561 -32526 -10313 11204 47550
17290 47550 40841 8106 4153 -2791 -5935 -8249 21243 16210 -4468 7530 24517 28362 14043
17277 14043 -22575 -48959 -43370 -38534 -53677 -24764 -41860 -25783 -2731 -310 -36231 -54689
17265 -54689 -58291 -73404 -28710 54883 53009 7016 -23225 -58525 -118253 -101048 -101756 -104842 -78178
$$ packed form
17353F73l7061J1911j339o532L7659J8983K889m1918l9062M6282N6294k2987k4925
17340H67j7258j9313J8804j4783J3787m6052n511P7909K2225r902l2405n12O244
17327e900M8219j6876j7052l9897l0768p522K8172q37J7483K6036R449J634k4150
17314a2009k4612J7677O757Q162J7722J8487k8991p622M0003K4665J0033q040
17302F2232k4698l4319J1066k3380k6482Q552K1025l557k2965K2213K1517L6346
17290D7550o709l2735l953o944l144k314K9492n033k0678J1998J6987L845j4319
17277A4043l6618k6384N589M836j5143K8913j7096J6077K3052K421l5921j8458
17265e4689l602j5113M4694Q3593j874m5993l0241l5300n9728J7205p08l086K6664
$$ plain form
17252 -78178 -55833 -70889 -60767 -48590 -41855 -38992 -47545 -35229 -4830 19418 6638 -14045
17240 -14045 31564 18389 16339 -25936 -26968 -26410 -45954 -49818 5406 44250 38034 77266 51541
17227 51541 36660 40365 36846 51704 82289 74706 83233 40111 -12982 21397 27569 -26827 -45936
17214 -45936 -22559 15763 19646 9531 926 4567 25016 70202 80495 30800 -35267 -58296
17202 -58296 11843 22455 18105 663 -13081 -12652 -12796 -32290 -22421 -4761 -14040 -10076 -20306
17189 -20306 4487 7897 20854 2234 -31368 -93791 -117377 -114886 -113725 -140823 -134585 -112924
17177 -112924 -95338 -59313 -24436 -16875 -8297 7797 19365 15928 29377 31226 -24905 -33673
17165 -33673 -49537 -79204 -88336 -71633 -86764 -26477 16367 54213 31441 -245 -22804 -16704
$$ packed form
17252g8178K2345j5056J0122J2177O735K863q553J2316L0399K4248j2780k0683
17240a4045M5609j3175k050m2275j032N58j9544l864N5224L8844o216L9232k5725
17227E1541j4881L705l519J4858L0585p583Q527m3122n3093L4379O172n4396j9109
17214d5936K3377L8322L883j0115q605L641K0449M5186J0293m9695o6067k3029
17202e8296P0139J0612m350j7442j3744M29j44j9494R869J7660r279L964j0230
17189b0306K4793L410J2957j8620l3602o2423k3586K491J161k7098O238K1661
17177a12924J7586L6025L4877P561Q578J6094J1568l437J3449J849n6131q768
17165c3673j5864k9667r132J6703j5131O0287M2844L7846k2772l1686k2559O100
$$ plain form
17153 -16704 7571 -9862 -5947 -181 -9171 17432 -16459 -49403 -31080 -28977 -68742 -49270
17141 -49270 28124 23579 554 -6639 15761 30190 23109 40523 54967 23354 6066 24926
17129 24926 47697 69349 83612 39768 36939 126526 245897 325354 409845 527903 636373
17118 636373 808404 874486 794020 670310 539919 437799 340072 284888 215524 210282 185256
17107 185256 166562 185294 154360 150063 190116 204966 195504 178586 148766 104922 115826 96231
17095 96231 72699 70200 64191 53151 73252 65127 34655 34345 52450 34529 27296 1400 -2997
17082 -2997 8772 9036 6528 -8382 -8019 -2157 8331 25417 3154 -5702 -14699 -21422 -31550 -50616
17068 -50616 -40639 -27092 5482 5802 -17367 -39871 -62034 -57558 -44432 -39143 -64912 -76813 -85308
$$ packed form
17153a6704K4275j7433L915N766q990K6603l3891l2944J8323K103l9765J9472
17141d9270P7394m545k3025p193K2400J4429p081J7414J4444l1613j7288J8860
17129B4926K2771K1652J4263m3844k829Q9587J19371P9457Q4491J18058J08470
17118F36373J72031O6082q0466j23710j30391j02120r7727n5184o9364n242k5026
17107A85256j8694J8732l0934m297M0053J4850r462j6918k9820m3844J0904j9595
17095I6231k3532k499o009j1040K0101q125l0472l10J8105j7921p233k5896m397
17082b997J1769K64k508j4910L63N862J0488J7086k2263q856q997o723j0128j9066
17068e0616R977J3547L2574L20k3169k2504k2163M476J3126N289k5769j1901q495
$$ plain form
17055 -85308 -108949 -111178 -44682 21632 38909 25861 -839 7915 -18022 -27852 -27336 -57421 -79869
17042 -79869 -82517 -77762 -84647 -59829 -33583 -44230 -47264 -21971 -5974 11317 32834 33651 40663
17029 40663 -26902 -54007 -52009 8493 24115 23672 28962 61105 29831 -61680 -81609 -54787
17017 -54787 -4078 -11822 -18792 17765 24860 -21059 -17577 14627 -4126 -15538 -59171 -50571 -38072
17004 -38072 -35156 -49214 -35712 -16964 -24353 4648 18689 -19498 -21800 2916 -2223 -11170 -11551
16991 -11551 32891 40146 -6739 1439 8425 -16986 -14879 19577 32855 3626 -23560 -28262 -33161
16978 -33161 -13812 5311 31577 32471 20806 -8528 -13004 -16887 -20733 20593 11711 3663 22718
16965 22718 31096 -15256 -58384 -91171 -103923 -92363 -51027 -17821 -40357 -47734 -54459 -20680
$$ packed form
17055h5308k3641k229O6496O6314J7277j3048k6700Q754k5937r830N16l0085k2448
17042g9869k648M755o885K4818K6246j0647l034K5293J5997J7291K1517Q17P012
17029D0663o7565k7105J998O0502J5622m43N290L2143l1274r1511j9929K6822
17017e4787N0709p744o970L6557P095m5919L482L2204j8753j1412m3633Q600J2499
17004c8072K916j4058J3502J8748p389K9001J4041l8187k302K4716n139q947l81
16991a1551M4442P255m6885Q178O986k5411K107L4456J3278k9229k7186m702m899
16978c3161J9349J9123K6266Q94j1665k9334m476l883l846M1326q882q048J9055
16965B2718Q378m6352m3128l2787j2752J1560M1336L3206k2536p377o725L3779
$$ plain form
16953 -20680 -22186 -41437 8400 22990 21563 31185 -13341 -48569 -66564 -65815 -30241 17648 68004
16940 68004 87956 74896 48101 4084 -3080 -26083 -18365 26438 25571 23037 2745 -14730 -9489
16927 -9489 -31634 -57758 530 -6429 -18882 45626 39966 600 -43910 -60309 -57380 -55817 -13820
16914 -13820 26946 -4043 -24033 -35215 -54361 -42509 -4933 -19144 -41714 -9571 37693 39508
16902 39508 17565 34050 25057 3113 -13752 35225 44159 22108 -39835 -76504 -85284 -3811
16890 -3811 18825 -13147 -46560 -35393 -54007 -73259 -87157 -61035 -52824 -7952 49259 -4305
16878 -4305 -86093 -60031 -16110 -18364 -1037 32707 21776 -2020 18190 60226 56413 60615
16866 60615 47314 4760 -26378 -343 -12203 -32716 -19977 24124 47746 26305 2922 54528
$$ packed form
16953b0680j506j9251M9837J4590j427R622m4526l5228j7995P49L5574M7889N0356
16940F8004J9952j3060k6795m4017p164k3003P718M4803q67k534k0292j7475N241
16927i489k2145k6124N8288o959j2453O4508n660l9366m4510j6399K929J563M1997
16914a3820M0766l0989j9990j1182j9146J1852L7576j4211k2570L2143M7264J815
16902C9508k1943J6485q993k1944j6865M8977Q934k2051o1943l6669q780Q1473
16890c811K2636l1972l3413J1167j8614j9252j3898K6122Q211M4872N7211n3564
16878d305q1788K6062M3921k254J7327L3744j0931k3796K0210M2036l813M202
16866F0615j3301m2554l1138K6035j1860k0513J2739M4101K3622k1441k3383N1606
$$ plain form
16854 54528 74461 79965 60596 26101 55213 50057 51435 18790 -27876 -11561 15231 41111
16842 41111 41953 24347 -32668 -81329 -63228 -28679 -8281 11415 33383 68264 84952 38883
16830 38883 24388 35613 46437 17599 -901 -6795 -36943 -85706 -73706 -52385 -62105 -58319
16818 -58319 -50482 -34558 -26722 -34633 -47049 -28870 12771 39723 6523 -69490 -77884 -33525
16806 -33525 -26776 -60174 -74709 -74354 -18747 37400 40578 22636 -292 -12912 -3176 21999 18371
16793 18371 694 -22649 8377 66499 56245 5093 -40066 -45220 -31487 -28701 -7342 42254
16781 42254 56960 8183 -33873 27483 20843 -5947 -28703 -78362 -80066 -54512 -37591 -17708
16769 -17708 -20276 8092 3679 14102 22761 36201 13750 33879 3893 33492 74869 25870
$$ packed form
16854E4528J9933N504j9369l4495K9112n156J378l2645m6666J6315K6792K5880
16842D1111Q42j7606n7015m8661J8101L4549K0398J9696K1968L4881J6688m6069
16830C8883j4495J1225J0824k8838j8500n894l0148m8763J2000K1321r720L786
16818e8319P837J5924P836p911j2416J8179M1641K6952l3200p6013q394M4359
16806c3525O749l3398j4535L55N5607N6147L178j7942k2928j2620R736K5175l628
16793A8371j7677k3343L1026N8122j0254n1152m5159n154J3733K786K1359M9596
16781D2254J4706m8777m2056O1356o640k6790k2756m9659j704K5554J6921J9883
16769a7708k568K8368m413J0423Q659J3440k2451K0129k9986K9599M1377m8999
$$ plain form
16757 25870 -31995 -42775 -48267 -77519 -69414 -71088 -70837 -63980 -27860 -33468 -35846 -40624 -39230 2175
16743 2175 24355 56803 82438 80685 -1462 20947 78967 63391 41899 42058 38290 54626 44998
16730 44998 33092 -1274 -17816 -16551 17625 21344 39331 58888 46268 50885 47849 17217
16718 17217 -4254 6760 -11747 -66710 -98657 -63462 -24649 -60812 -55897 -11139 -4233 40121
16706 40121 56041 73950 60333 63335 33659 25382 14453 5215 -21201 -14894 -18459 -53508 -56651
16693 -56651 -33322 -73136 -84619 -52814 -30119 -32740 -30483 -70819 -59709 -56408 -98813 -118047
16681 -118047 -96327 -74737 -22670 3333 -3156 14459 12285 6806 27497 16925 -31499 -54549
16669 -54549 -37378 -19111 -34663 2733 26193 21608 -4658 -7837 4120 23671 17284 9836
$$ packed form
16757B5870n7865j0780n492k9252Q105j674K51O857L6120n608k378m778J394M1405
16743B175K2180L2448K5635j753q2147K2409N8020j5576k1492J59l768J6336r628
16730D4998j1906l4366j6542J265L4176L719J7987J9557j2620M617l036l0632
16718A7217k1471J1014j8507n4963l1947L5195L8813l6163M915M4758O906M4354
16706D0121J5920J7909j3617L002k9676q277j0929r238k6416O307l565l5049l143
16693e6651K3329l9814j1483L1805K2695k621K257m0336J1110L301m2405j9234
16681a18047K1720K1590N2067K6003o489J7615k174n479K0691j0572m8424k3050
16669e4549J7171J8267j5552L7396K3460m585k6266l179J1957J9551o387p448
$$ plain form
16657 9836 21630 16849 31686 55136 85685 82274 40858 22427 -2438 8906 21679 49746
16645 49746 54052 36139 -18256 -56796 -9948 -9171 -11593 -8698 -39000 -78779 -34238 25975 55947
16632 55947 17720 -24474 6341 6726 -20157 -4853 22749 68540 78250 68454 58763 45211 54736
16619 54736 64886 7344 -10343 7368 32980 43276 21339 38032 1554 -753 -13532 -25797
16607 -25797 -37470 2296 3039 -10979 -2202 42594 62119 32827 37111 72223 70250 54324 30497
16594 30497 -39250 1869 38289 26833 36257 39884 10661 -3529 -15161 2979 55587 57605
16582 57605 36507 48140 24634 18195 13571 211 -25550 -51864 -60884 -51093 4672 21674
16570 21674 24869 26036 23474 4690 38499 18842 3918 15962 2785 -3177 17288 -7412
$$ packed form
16657I836J1794m781J4837K3450L0549l411m1416j8431k4865J1344J2773K8067
16645D9746M306j7913n4395l8540M6848P77k422K895l0302l9779M4541O0213K9972
16632E5947l8227m2194L0815L85k6883J5304K7602M5791R710r796r691j3552R525
16619E4736J0150n7542j7687J7711K5612J0296k1937J6693l6478k307j2779j2265
16607b5797j1673L9766P43j4018Q777M4796J9525k9292M284L5112j973j5926k3827
16594C0497o9747M1119L6420j1456R424L627k9223j4190j1632J8140N2608K018
16582E7605k1098J1633k3506o439m624j3360k5761k6314r020R791N5765J7002
16570B1674L195J167k562j8784L3809j9657j4924J2044j3177n962K0465k4700
$$ plain form
16558 -7412 13919 36776 66912 56279 25804 40099 22249 26509 34538 66891 84884 56218
16546 56218 26357 820 8247 20988 -5973 -24269 -27029 -2902 41071 24675 -7334 -51021
16534 -51021 -69293 -55944 -56534 -70152 -50111 -21258 14744 6206 9353 28685 36008 12035 27993
16521 27993 40228 49176 -1112 -27734 -45367 -41346 44605 62837 23474 30763 47067 34941
16509 34941 47548 69988 70573 67517 57420 18052 7619 -1059 -15877 -20022 34157 44520 30810
16496 30810 -9676 22252 58720 42520 58062 50050 27856 -14894 -18659 18466 9215 -9583
16484 -9583 -8128 -17972 -36856 -33613 -2446 -30050 -36799 -17578 -38988 -26359 1074 -27821 -38658
16471 -38658 -37255 -49349 -46786 -52339 -69680 -85933 -88663 -80508 -56003 -6674 19443 8142 -48088
$$ packed form
16558g412K1331K2857L0136j0633l0475J4295j7850M260Q029L2353J7993k8666
16546E6218k9861k5537P427J2741k6961j8296k760K4127M3973j6396l2009m3687
16534e1021j8272J3349n90j3618K0041K8853L6002q538L147J9332P323k3973J5958
16521B7993J2235Q948n0288k6622j7633M021Q5951J8232l9363P289J6304j2126
16509C4941J2607K2440N85l056j0097l9368j0433q678j4818m145N4179J0363j3710
16496C0810m0486L1928L6468j6200J5542q012k2194m2750l765L7125r251j8798
16484i583J455r844j8884L243L1167k7604o749J9221k1410J2629K7433k8895j0837
16471c8658J403j2094K563n553j7341j6253k730Q155K4505M9329K6117j1301n6230
$$ plain form
16458 -48088 -123655 -108935 -72703 -56262 -15848 15664 -9154 -32021 -21826 -23349 -30913 3318
16446 3318 34900 78761 100612 93378 60091 29472 59665 45867 41349 39829 18896 13480 16517
16433 16517 -11769 -45560 -52265 -22409 12325 2439 -30684 -48466 -59798 -51972 -72182 -70058
16421 -70058 -43055 30883 38128 16957 -398 25525 59490 11626 -30189 -41630 -33214 -5842
16409 -5842 8368 8662 5618 -35044 -97745 -98867 -42114 -16572 -32565 -20909 -18028 -14926 -1046
16396 -1046 22136 19338 -23948 -28866 -7076 -6214 3397 18156 13882 -23816 -8386 24224 24389
16383 24389 29460 33807 21759 25747 56199 32228 -28980 -37673 -41413 -43454 -43685 -25829 7002
16370 7002 39641 24490 -26755 -49169 -50034 -62154 -41189 -4360 12362 20614 -151 -12095
$$ packed form
16458d8088p5567J4720L6232J6441M0414L1512k4818k2867J0195j523p564L4231
16446C318L1582M3861K1851p234l3287l0619L0193j3798m518j520k0933n416L037
16433A6517k8286l3791o705K9856L4734r886l3123j7782j1332P826k0210K124
16421g0058K7003P3938P245k1171j7355K5923L3965m7864m1815j1441Q416K7372
16409e842J4210K94l044m0662o2701j122N6753K5542j5993J1656K881L102J3880
16396a046K3182k798m3286m918K1790Q62R611J4759m274l7698J5430L2610J65
16383B4389N071M347j2048L988L0452k3971o1208q693l740k041k31J7856L2831
16370G002L2639j5151n1245k2414q65j2120K0965L6829J6722Q252k0765j1944
$$ plain form
16358 -12095 9759 15382 30542 -4288 -39571 -47011 -11697 34184 16794 -6133 -10379 624
16346 624 30669 35528 19449 58013 67570 13663 -13144 -42983 -27935 -10979 32402 9765
16334 9765 -7383 5234 -12518 -29101 -34599 -38978 -27165 -23183 -26509 -24111 -29519 -80532 -125727
16321 -125727 -106671 -51557 25468 62588 -11282 -71916 -70568 -22413 -31670 -49796 -52604 -74189
16309 -74189 -60527 -44858 -29472 24179 16701 667 -44240 -78671 -39920 -28495 -55373 -69739
16297 -69739 -63700 -23806 8367 29977 49116 31981 10322 -3856 -25200 -28864 5553 6810
16285 6810 33675 16042 -7735 16935 29300 -3772 -1312 2014 -4244 -19351 -7441 -24112
16273 -24112 -16387 47368 51026 -11909 -41321 -87407 -63718 985 1447 -10714 -35653 -47970
$$ packed form
16358a2095K1854N623J5160l4830l5283p440L5314M5881j7390k2927m246J1003
16346F24L0045M859j6079L8564R557n3907k6807k9839J5048J6956M3381k2637
16334I765j7148J2617j7752j6583n498m379J1813L982l326K398n408n1013m5195
16321a25727J9056N5114P7025L7120p3870o0634J348M8155r257j8126k808k1585
16309g4189J3662J5669J5386N3651p478j6034m4907l4431L8751J1425k6878j4366
16297f9739O039L9894L2173K1610J9139j7135k1659j4178k1344l664L4417J257
16285F810K6865j7633k3777K4670J2365l3072K460L326o258j5107J1910j6671
16273b4112P725O3755L658o2935k9412m6086K3689O4703M62j2161k4939j2317
$$ plain form
16261 -47970 -6733 7171 -18569 -37982 -13266 -15709 -51319 -40490 -12717 -5242 32856 60323
16249 60323 32336 -5405 457 5549 21192 36103 24334 14230 -2640 5956 5638 -17642 -14630
16236 -14630 24076 6002 -46950 -38933 11839 -803 -61976 -73382 -28159 -4253 13697 17290
16224 17290 11032 -10403 1223 15563 35880 30477 -6736 -36440 -60287 -59848 -30596 4176
16212 4176 28352 -134 -25853 1316 36942 21233 -39095 -4912 52510 6142 -33581 -27802
16200 -27802 -1814 34367 49376 62454 51061 40290 39797 24862 48606 90482 103743 93710
16188 93710 55681 39958 8588 -15738 -33421 -48347 -6472 29785 13573 -43717 -14740 -8724
16176 -8724 3666 46495 68322 43292 28394 12509 23592 53461 68735 70025 47455 23925
$$ packed form
16261d7970M1237J3904k5740j9413K4716k443l5610J0829K7773P475L8098K7467
16249F0323k7987l7741N862N092J5643J4911j1769j0104j6870Q596l18k3280L012
16236a4630L8706j8074n2952Q017N0772j2642o1173j1406M5223K3906J7950L593
16224A7290o258k1435J1626J4340K0317n403l7213k9704k3847M39K9252L4772
16212D176K4176k8486k5719K7169L5626j5709o0328L4183N7422m6368l9723N779
16200b7802K5988L6181J5009J3078j1393j0771m93j4935K3744M1876J3261j0033
16188I3710l8029j5723l1370k4326j7683j4926M1875L6257j6212n7290K8977O016
16176h724J2390M2829K1827k5030j4898j5885J1083K9869J5274J290k2570k3530
$$ plain form
16164 23925 29817 -3884 -31018 -17492 -14941 -4122 1257 -685 17503 47985 7120 -21445
16152 -21445 -65088 -57765 5825 20885 -33208 -87858 -72922 -4903 11104 -12115 -12606 -38350
16140 -38350 -24225 6672 20781 7679 30582 18361 5108 21521 -13502 -12193 -3989 10641
16128 10641 2237 -21050 -63477 -94063 -75787 -17929 17435 25333 19325 42375 22287 42120
16116 42120 12541 -20100 -25187 -33835 -38165 -40886 -40380 -5566 34769 61024 57419 31322 -25572
16103 -25572 -66928 -62576 -36048 10653 63765 76376 70739 35772 -14386 -10722 8403 -11334
16091 -11334 -6011 -11741 -37765 -22090 -13798 18045 31738 -13826 -59656 -54503 -44729 -55308 -73858
16078 -73858 -47058 -53850 -67387 -56565 -68036 -63824 -54715 -43573 -30983 -38243 -32446 -43814 -21525
$$ packed form
16164B3925N892l3701k7134J3526K551J0819N379j942J8188L0482m0865k8565
16152b1445m3643P323O3590J5060n4093n4650J4936O8019J6007k3219m91k5744
16140c8350J4125L0897J4109j3102K2903j2221j3253J6413l5023J309Q204J4630
16128A0641q404k3287m2427l0586J8276N7858L5364P898o008K3050k0088J9833
16116D2120k9579l2641n087q648m330k721N06L4814M0335K6255l605k6097n6894
16103b5572m1356M352K6528M6701N3112J2611n637l4967n0158L664J9125j9737
16091a1334N323n730k6024J5675Q292L1843J3693m5564m5830N153R774j0579j8550
16078g3858K6800o792j3537J0822j1471M212R109J1142J2590p260N797j1368K2289
$$ plain form
16065 -21525 -26305 -31765 -21060 -10129 -43227 -22200 -20081 -6613 11186 17512 42108 56457
16053 56457 2094 -11420 549 15354 30859 3402 -28253 -36322 -19918 -38197 -2193 22958
16041 22958 -20296 -43298 -54935 -40207 -17905 -20922 16769 48346 45888 18592 -13010 -32919
16029 -32919 -27539 -25606 -24100 -26671 -11941 28826 70416 79451 28623 16963 26065 10825 -16857
16016 -16857 7644 34138 38620 56315 62359 58267 97907 54381 28291 14348 541 -1896
16004 -1896 -44342 -76419 -71373 -18470 -14588 35979 77668 55515 4393 -14070 -29860 -15538
15992 -15538 -11821 -10145 -44177 -71256 -101295 -99689 -114185 -53935 4677 -1431 -26140 -21623 -34340
15979 -34340 -39133 9196 19216 -7683 15301 61413 17778 873 4601 -16963 -30951 -48484
$$ packed form
16065b1525m780n460J0705J0931l3098K1027K119J3468J7799O326K4596J4349
16053E6457n4363j3514J1969J4805J5505k7457l1655q069J6404j8279L6004K5151
16041B2958m3254k3002j1637J4728K2302l017L7691L1577k458k7296l1602j9909
16029c2919N380J933J506k571J4730M0767M1590R035n0828j1660R102j5240k7682
16016a6857K4501K6494M482J7695O044m092L9640m3526k6090j3943j3807k437
16004a896m2446l2077N046N2903L882N0567M1689k2153n1122j8463j5790J4322
15992a5538L717J676l4032k7079l0039J606j4496O0250N8612o108k4709M517j2717
15979c4340m793M8329J0020k6899K2984M6112m3635j6905L728k1564j3988j7533
$$ plain form
15967 -48484 -57228 -27576 9125 14076 -25206 -29941 -7561 18711 48379 59061 31504 -19532
15955 -19532 -70135 -78639 -44789 4626 29328 40319 42052 41124 19621 11463 11634 17241 23667
15942 23667 20953 48077 53771 61064 49474 39272 13257 -1708 16122 33762 -5951 -28076
15930 -28076 -23921 13832 40439 56287 35529 18726 20873 31770 23443 44499 494 -39587
15918 -39587 -21645 7203 -6314 -6328 -33900 -66766 -49743 -17243 -12725 -21081 -15040 -1626 10649
15905 10649 -5936 31133 32522 -22793 -33994 -3196 6791 -3304 7096 24599 51539 89122
15893 89122 63139 24553 -11532 -53031 -54284 -38069 -26944 5472 19570 56558 62911 52421
15881 52421 -6973 -54673 -31837 -9259 -18284 15804 35293 46809 12677 3164 19554 12078
$$ packed form
15967d8484q744K9652L6701M951l9282m735K2380K6272K9668J0682k7557n1036
15955a9532n0603q504L3850M9415K4702J0991J733r28k1503q158J71N607O426
15942B3667k714K7124N694P293j1590j0202k6015j4965J7830J7640l9713k2125
15930b8076M155L7753K6607J5848k0758j6803K147J0897q327K1056m4005m0081
15918c9587J7942K8848j3517j4k7572l2866J7023L2500M518q356O041J3414J2275
15905A0649j6585L7069J389n5315j1201L0798R987j0095J0400J7503K6940L7583
15893H9122k5983l8586l6085m1499j253J6215J1125L2416J4098L6988O353j0490
15881E2421n9394m7700K2836K2578r025L4088J9489J1516l4132r513J6390p476
$$ plain form
15869 12078 6796 -14451 -39311 -31013 -325 30605 57493 63272 60609 35307 17266 7546 -8279
15856 -8279 -35373 -28901 -33791 14613 -7623 -30695 -46368 -46488 -22975 -35677 -36784 -27635 -16624
15843 -16624 1227 10757 -4909 7787 15361 18393 -33079 -34522 -42064 -59570 -88987 -97412 -53106
15830 -53106 -22557 -32276 -34245 -51780 -25831 14587 14776 -582 14109 -7995 5085 -8263
15818 -8263 -16744 -32624 -54102 2621 41674 44864 46546 38690 51972 37976 4313 6231 -1709
15805 -1709 10575 36900 42313 37823 -16449 -36858 -10589 22053 26328 27233 39236 5329 13579
15792 13579 25324 -7147 -24659 -8925 -17348 -30150 -34743 -37500 -11311 24288 11572 -7787
15780 -7787 30675 41292 -32755 -70123 -71022 -89729 -75164 -51147 -46019 -69153 -73100 -57089 -30863
$$ packed form
15869A2078n282k1247k4860Q298L0688L0930K6888N779k663k5302j8041r720j5825
15856h279k7094O472m890M8404k2236k3072j5673j20K3513j2702j107R149J1011
15843a6624J7851R530j5666J2696P574L032n1472j443p542j7506k9417q425M4306
15830e3106L0549r719j969j7535K5949M0418J89j5358J4691k2104J3080j3348
15818h263q481j5880k1478N6723L9053L190J682p856J3282j3996l3663J918p940
15805a709J2284K6325N413m490n4272k0409K6269L2642M275R05J2003l3907Q250
15792A3579J1745l2471j7512J5734q423j2802m593k757K6189L5599j2716j9359
15780g787L8462J0617p4047l7368q99j8707J4565K4017N128k3134l947J6011K6226
$$ plain form
15767 -30863 13579 55703 49080 45450 53040 19025 19999 20189 10111 -24737 -55277 -22666 1678
15754 1678 37851 87333 73732 45581 -22463 -24422 -2155 29145 32648 39537 24424 -7484
15742 -7484 -35225 -58792 -36777 35794 32130 975 22702 -12717 -42480 -4022 8345 12475
15730 12475 26627 14462 530 9622 12941 -21410 -32654 -26400 -20169 -9143 -14352 -19660 7842
15717 7842 6369 -22109 -25472 -8381 -7932 -19515 -23877 13489 38378 37501 45176 28588 1772
15704 1772 -7571 17321 9344 9659 -4174 -21894 -43453 -56857 -19877 -37971 -45521 -27598 -18998
15691 -18998 -33599 -47881 -43231 -50505 -32366 -27748 -3907 12045 6559 -30710 -66400 -90730
15679 -90730 -74734 -53521 -66634 -49980 -7039 -4473 -19226 -30864 -6875 -4587 -26464 -57049
$$ packed form
15767c0863M4442M2124o623l630P590l4015R74J90j0078l4848l0540L2611K4344
15754A678L6173M9482j3601k8151o8044j959K2267L1300L503O889j5113l1908
15742g484k7741k3567K2015P2571l664l1155K1727l5419k9763L8458J2367M130
15730A2475J4152j2165j3932R092L319l4351j1244O254O231J1026n209n308K7502
15717G842j473k8478l363J7091M49j1583m362L7366K4889q77P675j6588k6816
15704A772r343K4892p977L15j3833j7720k1559j3404L6980j8094p550J7923Q600
15691a8998j4601j4282M650p274J8139M618K3841J5952n486l7269l5690k4330
15679i0730J5996K1213j3113J6654M2941K566j4753j1638K3989K288k1877l0585
$$ plain form
15667 -57049 -63445 -44007 -44587 -12872 -38347 -70678 -45864 5918 40293 75024 83947 53636
15655 53636 54624 69302 66927 61616 35902 11408 -10221 -16800 -11351 1598 20641 -12507 -56044
15642 -56044 -48277 -12942 -20725 8080 10040 15085 41538 67703 60770 44330 18872 -14579 -5888
15629 -5888 13322 -6408 -27931 -23119 -5106 -3649 -5517 32921 47628 40621 18345 5765 5686
15616 5686 13915 21880 -12925 -2854 14539 25896 43733 26437 48725 22158 1759 -17241
15604 -17241 -41555 -14859 12987 -23534 -38276 -44064 -44747 -16729 -3219 -17832 573 21647
15592 21647 -3689 -55707 -19894 31261 61054 16696 -15328 -41036 -32368 -6969 -25630 -21697
15580 -21697 -13557 -3791 -37046 -82568 -68872 -34953 -36867 5213 11784 -7411 -22473 -38721
$$ packed form
15667e7049o396J9438n80L1715k5475l2331K4814N1782L4375L4731Q923l0311
15655E3636R88J4678k375n311k5714k4494k1629o579N449J2949J9043l3148m3537
15642e6044P767L5335p783K8805J960N045K6453K6165o933j6440k5458l3451Q691
15629e888J9210j9730k1523M812J8013J457j868L8438J4707p007k2276j2580p9
15616E686Q229P965l4805J0071J7393J1357J7837j7296K2288k6567k0399j9000
15604a7241k4314K6696K7846l6521j4742n788o83K8018J3510j4613J8405K1074
15592B1647k5336n2018L5813N1155K9793m4358l2024k5708Q668K5399j8661L933
15580b1697Q140R766l3255m5522J3696L3919j914M2080O571j9195j5062j6248
$$ plain form
15568 -38721 -15243 21802 -22916 -20979 5038 -5376 -26352 -32635 -59339 -73060 -70289 -52520
15556 -52520 -13142 -27028 -83308 -93118 -47599 -20267 -10566 8241 -204 -43473 10065 19527
15544 19527 -8484 -46937 -46848 -20649 2049 -1400 -8400 -4161 86 -12892 -19935 -36855 19468
15531 19468 51216 62942 89820 74698 47600 52147 42325 9013 10234 -24528 -52588 -65204
15519 -65204 -56924 -36146 -2764 -31260 -47710 -28884 37095 84023 85034 39055 -11868 -17904
15507 -17904 39488 61569 25333 25368 4418 -19936 5242 4126 -12441 6026 30396 16267
15495 16267 6150 -33066 -22261 -12697 -27911 -28987 -49912 -44790 -32211 -53294 -90594 -56478
15483 -56478 -40344 -33243 -31980 -57310 -86305 -76669 -61150 -43472 -52529 -48853 -20130 10275 7988
$$ packed form
15568c8721K3478L7045m4718J937K6017j0414k0976o283k6704j3721K771J7769
15556e2520L9378j3886n6280r810M5519K7332R701J8807q445m3269N3538R462
15544A9527k8011l8453Q9K6199K2698l449p000M239M247j2978p043j6920N6323
15531A9468L1748J1726K6878j5122k7098M547r822l3312J221l4762k8060j2616
15519f5204Q280K0778L3382k8496j6450J8826O5979M6928J011m5979n0923o036
15507a7904N7392K2081l6236L5k0950k4354K5178j116j6567J8467K4370j4129
15495A6267j0117l9216J0805R564j5214j076k0925N122J2579k1083l7300L4116
15483e6478J6134P101J263k5330k8995R636J5519J7678r057L676K8723L0405k287
$$ plain form
15470 7988 -4243 -39537 -46298 -34031 -34213 -17067 3102 6698 -8076 -15944 -21877 -19718 -1885
15457 -1885 -13200 -25719 -8392 -22359 -78428 -93095 -61769 -18101 14806 5024 3049 -8456
15445 -8456 17098 7845 -23047 -25694 -39847 -65109 -52560 -55237 -56730 -25711 10530 -5687 -24695
15432 -24695 15778 35717 21261 -13575 -36895 -26348 -23020 7837 30510 -2710 5504 7013
15420 7013 40480 23301 -12852 -64045 -53531 -50015 -32367 -13454 19995 30180 28246 55759
15408 55759 32151 124 -6990 10160 67322 86866 86971 51520 31858 21839 -21873 -43557
15396 -43557 -45054 -24090 -3330 66339 122187 112515 71670 44296 3233 -24424 -26872 14032
15384 14032 35179 78831 86762 18166 -25834 -7710 25254 23009 -9570 -26852 -23322 -40237
$$ packed form
15470G988j2231l5294o761J2267j82J7146K0169L596j4774p868n933K159J7833
15457a885j1315j2519J7327j3967n6069j4667L1326M3668L2907r782j975j1505
15445h456K5554r253l0892k647j4153k5262J2549k677j493L1019L6241j6217j9008
15432b4695M0473J9939j4456l4836k3320J0547L328L0857K2673l3220Q214J509
15420G013L3467j7179l6153n1193J0514L516J7648J8913L3449J0185j934K7513
15408E5759k3608l2027p114J7150N7162J9544J05l5451j9662j0019m3712k1684
15396d3557j497K0964K0760O9669N5848r672m0845k7374m1063k7657k448M0904
15384A4032K1147M3652P931o8596m4000J8124L2964k245l2579j7282L530j6915
$$ plain form
15372 -40237 -46373 10902 34598 18793 15334 27912 56947 47506 57053 67986 7192 3019 10878
15359 10878 12604 -8588 -20007 -11670 -39206 -43482 -48362 -39743 31409 17383 -3594 40141 24383
15346 24383 41080 -4683 -34002 -23817 -15338 -3321 -37823 -30472 -34582 -22421 -18744 -31746
15334 -31746 -9326 -18659 -38786 5155 15186 -11468 17446 27134 30375 -6720 -30997 -16969
15322 -16969 4389 57919 93621 39735 -15981 -33090 -40644 -69969 -18388 -17537 -4658 25794
15310 25794 -39133 -31211 11721 11478 28065 35433 -8121 -48440 -30705 10874 33755 20856
15298 20856 -2284 2679 -11276 20378 33925 32693 48571 22117 -9193 -24867 -44163 -26362
15286 -26362 -4579 -4285 -23655 -29346 -9933 5630 -12235 -19838 11658 -14990 -14395 -41932 -66723
$$ packed form
15372d0237o136N7275K3696j5805l459J2578K9035r441R547J0933o0794m173P859
15359A0878J726k1192j1419Q337k7536m276m880Q619P1152j4026k0977M3735j5758
15346B4383J6697m5763k9319J0185Q479J2017l4502P351m110J2161L677j3002
15334c1746K2420r333k0127M3941J0031k6654K8914R688L241l7095k4277J4028
15322a6969K1358N3530L5702n3886n5716j7109p554k9325N1581Q51J2879L0452
15310B5794o4927P922M2932k43J6587P368m3554m0319J7735M1579K2881j2899
15298B0856k3140M963j3955L1654J3547j232J5878k6454l1310j5674j9296J7801
15286b6362K1783K94j9370n691J9413J5563j7865p603L1496k6648N95k7537k4791
$$ plain form
15273 -66723 -32523 9666 28230 3536 -7889 -18049 -21102 2002 -8278 -23695 -20028 -25926
15261 -25926 -57248 -67351 -17148 35920 47574 -304 25530 55971 55167 40876 22467 10612
15249 10612 19793 11458 376 47099 78543 15080 -4499 -3117 2269 2664 14384 61127 75978
15236 75978 55901 53233 67997 74414 82529 96906 79821 22113 14748 40200 43205 7266 -19980
15223 -19980 -18499 -11588 -18328 5388 -4821 7537 -36896 -37601 -571 13758 10165 16900 30169
15210 30169 -7726 2158 18005 52859 55924 55836 26906 2744 5436 -7949 -32988 -37208 -10152
15197 -10152 -2160 -11333 -54207 -82333 -68550 -44475 -32860 -22169 15326 7830 -24614 -59405
15185 -59405 -85584 -96044 -75340 -44716 -43335 -1682 30355 24865 34197 26761 72493 47933
$$ packed form
15273f6723L4200M2189J8564k4694j1425j0160l053K3104j0280j5417L667n898
15261b5926l1322j0103N0203N3068J1654m7878K5834L0441q04j4291j8409j1855
15249A0612R181q335j1082M6723L1444o3463j9579J382N386L95J1720M6743J4851
15236G5978k0077k668J4764O417Q115J4377j7085n7708p365K5452L005l5939k7246
15223a9980J481O911o740K3716j0209J2358m4433p05L7030J4329l593O735J3269
15210C0169l7895R884J5847L4854L065q8k8930k4162K692j3385k5039m220K7056
15197a0152P992r173m2874k8126J3783K4075J1615J0691L7495p496l2444l4791
15185e9405k6179j0460K0704L0624J381M1653L2037n490R332p436M5732k4560
$$ plain form
15173 47933 9226 -41457 -89912 -58293 -57967 -9695 25375 18361 -31701 -62001 -31491 15148
15161 15148 8371 -4542 -695 -8676 17198 34817 46815 -3318 -36115 -24807 -26843 -1447
15149 -1447 22099 -927 3399 16817 19720 27608 27830 -10697 -2403 21620 41216 9590 17158
15136 17158 33813 -7278 -50230 -82382 -43232 -25969 -41123 -48421 -6601 2998 -21102 -100172
15124 -100172 -136918 -89955 -72855 -20584 13031 66684 32724 25925 32245 41705 44462 22365
15112 22365 -118 -4383 11304 20705 22249 34413 14350 2060 10934 33057 25459 20162 717
15099 717 953 3789 -30177 -10249 14678 3849 -18531 -26529 25849 120797 166384 146070 93230
15086 93230 37796 -432 -22192 -14671 7178 11240 15272 40140 9664 -19247 4292 48098
$$ packed form
15173D7933l8707n0683m8455L1619L26M8272L5070p014n0062l0300L0510M6639
15161A5148o777j2913L847p981K5874J7619J1998n0133l2797J1308k036K5396
15149a447K3546k3026M326J3418K903P888K22l8527Q294K4023J9596l1626P568
15136A7158J6655m1091m2952l2152L9150J7263j5154p298M1820R599k4100p9070
15124a00172l6746M6963J7100N2271L3615N3653l3960o799O320R460K757k2097
15112B2365k2483m265J5687R401J544J2164k0063j2290Q874K2123p598n297j9445
15099G17K36K836l3966J9928K4927j0829k2380p998N2378R4948M5587k0314n2840
15086I3230n5434l8228k1760P521K1849M062M032K4868l0476k8911K3539M3806
$$ plain form
15074 48098 55998 61957 87132 69073 40462 1572 -20794 -14573 11118 31973 41433 14273
15062 14273 -51072 -36141 -11065 23924 29493 17226 -15588 -1912 -13306 -33856 -27033 16410
15050 16410 28243 -42474 -68475 -32165 -7202 -23124 6206 51019 77999 73509 59642 42095
15038 42095 -8375 -66173 -90707 -91418 -70832 -53778 -2457 39741 60190 44163 2586 27642
15026 27642 57409 46662 14710 -4644 -10780 -17116 21179 29476 10590 30807 43620 32305
15014 32305 -3116 -23 -435 -21160 -50233 -45057 4423 44467 35260 15966 33478 45832 1857
15001 1857 9848 22434 18330 55301 95948 68269 67561 67469 58321 71754 53611 33820 59894
14988 59894 76170 18866 7467 21864 -2193 -11174 -13510 -21479 -5808 33510 26985 10965
$$ packed form
15074D8098P900N959K5175j8059k8611l8890k2366O221K5691K0855R460k7160
15062A4273o5345J4931K5076L4989N569j2267l2814J3676j1394k0550O823M3443
15050A6410J1833p0717k6001L6310K4963j5922K9330M4813K6980m490j3867j7547
15038D2095n0470n7798k4534p11K0586J7054N1321M2198K0449j6027m1577K5056
15026B7642K9767j0747l1952j9354o136o336L8295Q297j8886K0217J2813j1315
15014C2305l5421L093m12k0725k9073N176M9480M0044r207j9294J7512J2354m3975
15001A857P991J2586m104L6971M0647k7679p08r2r148J3433j8143j9791K6074
14988E9894J6276n7304j1399J4397k4057q981k336p969J5671L9318o525j6020
$$ plain form
14976 10965 15774 17834 10477 -2390 846 -7189 8242 8605 25774 28389 23718 15827 23290 -17130
14962 -17130 -30928 -22323 37727 83792 56848 51784 27299 -26640 -27839 -30322 -9089 -16709 3188
14949 3188 28301 -82 -1089 23277 22747 23996 29817 54729 25413 37299 59011 53369 39595
14936 39595 24909 12480 -21829 -10733 -16432 5308 9942 24171 26340 24228 31602 33171 26547
14923 26547 -4865 -6822 4080 -11324 -43245 -31199 -11657 -4356 -14364 -10938 -22645 9259
14911 9259 18872 10097 31557 19191 -15295 37530 44052 19803 26917 11563 30524 31329 14615
14898 14615 27011 50812 38932 36704 72254 85142 73826 44907 -29043 -17218 10187 7045
14886 7045 8544 25057 43767 75191 55393 67566 71780 35776 28273 2321 -11853 -486
$$ packed form
14976A0965M809K060p357j2867L236q035J5431L63J7169K615m671p891P463m0420
14962a7130j3798Q605O0050M6065k6944n064k4485n3939j199k483K1233p620J9897
14949C188K5113k8383j007K4366n30J249N821K4912k9316J1886K1712n642j3774
14936C9595j4686j2429l4309J1096n699K1740M634J4229K169k112P374J569o624
14923B6547l1412j957J0902j5404l1921J2046J9542P301j0008L426j1707L1904
14911I259R613q775K1460j2366l4486N2825O522k4249P114j5354J8961Q05j6714
14898A4615J2396K3801j1880k228L5550J2888j1316k8919p3950J1825K7405l142
14886G045J499J6513J8710L1424j9798J2173M214l6004p503k5952j4174J1367
$$ plain form
14874 -486 -1132 -10684 15360 13095 -12938 -7687 -2447 -20536 -36948 -31924 -27363 -408 19101 -7800
14860 -7800 -52907 -40513 -28381 4287 17526 -45958 -44718 -42015 -25669 -15732 19363 35545
14848 35545 46279 19161 -27831 -36042 -11543 401 48897 80522 65136 44061 21958 25641
14836 25641 17829 47873 71321 74467 42584 43740 -5151 -42850 -41820 -33631 -22903 -10692 -30723
14823 -30723 -67975 -63658 -39940 -13055 -22164 -46414 -30987 -19238 7531 21540 -10779 26839
14811 26839 63266 44381 37926 19099 23779 19941 31474 27227 28821 33010 90612 125143 91276
14798 91276 38024 24346 46684 29320 32902 57410 60898 92863 57402 16553 61420 88716
14786 88716 115135 118029 143027 152970 229690 326499 444971 625358 829660 941324 992064
$$ packed form
14874d86o46r552K6044k265k6033N251N240j8089j6412N024M561K6955J9509k6901
14860g800m5107J2394J2132L2668J3239o3484J240K703J6346R937L5095J6182
14848C5545J0734k7118m6992q211K4499J1944M8496L1625j5386k1075k2103L683
14836B5641p812L0044K3448L146l1883J156m8891l7699J030Q189J0728J2211k0031
14823c0723l7252M317K3718K6885r109k4250J5427J1749K6769J4009l2319L7618
14811B6839L6427j8885o455j8827M680l838J1533m247J594M189N7602L4531l3867
14798I1276n3252j3678K2338j7364L582K4508L488L1965l5461m0849M4867K7296
14786H8716K6419K894K4998R943P6720R6809J18472J80387K04302J11664N0740
$$ plain form
14775 992064 963592 839191 691237 565070 453331 339786 263761 223097 227282 222383 225786
14764 225786 220608 194624 145876 179985 181226 133643 108637 93890 94394 110457 116522 95707
14752 95707 80869 76354 52740 73051 62025 49644 24137 10047 36107 41848 44133 52779
14740 52779 93645 54929 43966 85704 65648 61066 58957 71959 59366 53706 49768 59326 81403
14727 81403 63413 41912 27861 40540 4251 17251 48234 44065 58009 85936 81608 46770
14715 46770 24174 4121 -13435 3008 -3689 -21686 -16886 -5789 -2504 -2950 23837 33041 48311
14702 48311 37559 39454 52019 67842 102051 73928 24589 73687 139071 131124 100625 65651
14690 65651 78473 55832 55267 77059 80483 90755 109217 110520 115954 181647 216039 199572 238914
$$ packed form
14775I92064k8472j24401j47954j26167j11739j13545p6025m0664M185m899L403
14764B25786n178k5984m8748L4109J241m7583k5006j4747N04J6063O065k0815
14752I5707j4838m515k3614K0311j1026j2381k5507j4090K6060N741K285Q646
14740E2779M0866l8716j0963M1738k0056m582k109J3002j2593n660l938R558K2077
14727H1403j7990k1501j4051J2679l6289J3000L0983m169J3944K7927m328l4838
14715D6770k2596k0053j7556J6443o697j7997M800J1097L285m46K6787R204J5270
14702D8311j0752J895J2565J5823L4209k8123m9339M9098O5384p947l0499l4974
14690F5651J2822k2641n65K1792L424J0272J8462J303N434O5693L4392j6467L9342
$$ plain form
14677 238914 270819 288201 350999 446642 552584 741648 1006489 1288287 1601448 1888122
14667 1888122 1990846 1959428 1880251 1721984 1465018 1161250 941090 790361 719846 618830
14657 618830 548440 491105 430117 394579 375932 363448 322977 340857 341239 291947 258930 222892
14645 222892 175833 150756 125883 117182 125129 110887 128511 116103 117288 168095 207559 213870
14633 213870 212907 265322 288310 223036 178092 159902 158112 176982 188247 130247 128701 134799
14621 134799 140871 163827 132282 104669 119484 134110 175467 157235 133097 105104 117939 98664
14609 98664 59706 80883 96293 124956 130083 113804 152065 206456 228659 219956 225953 230109
14597 230109 211907 210139 177323 178360 180117 145570 119209 69925 65576 92846 77068 50363
$$ packed form
14677B38914L1905J7382O2798R5643J05942J89064K64841K81798L13161K86674
14667A888122J02724l1418p9177j58267k56966l03768k20160j50729p0515j01016
14657F18830p0390n7335o0988l5538j8647j2484m0471J7880L82m9292l3017l6038
14645B22892m7059k5077k4873q701P947j4242J7624j2408J185N0807L9464O311
14633B13870r63N2415K2988o5274m4944j8190j790J8870J1265n8000j546O098
14621A34799O072K2956l1545k7613J4815J4626M1357j8232k4138k7993J2835j9275
14609I8664l8958K1177J5410K8663N127j6279L8261N4391K2203q703N997M156
14597B30109j8202j768l2816J037J757l4547k6361m9284m349K7270j5778k6705
$$ plain form
14585 50363 71235 109056 95495 88985 117152 135970 150237 148932 97821 65706 62858 67586
14573 67586 83284 67132 83888 99455 85724 54736 47365 43747 77003 97069 75251 57177
14561 57177 66936 77971 71544 34542 56154 60774 50664 50927 28417 9666 23652 90007 115289
14548 115289 115467 111800 130243 100628 148815 193873 168057 123370 112321 110328 98567 90715
14536 90715 84044 93029 122650 188239 212591 222306 210719 181933 151723 141521 172499 179479
14524 179479 148634 66900 43574 62201 77820 116238 74924 61807 45607 7992 1157 34358
14512 34358 19789 6328 15953 -13462 -36214 -35006 -49405 -69675 -102143 -89613 -85094 -77593
14500 -77593 -57776 -26324 15069 16471 2578 -13506 -18851 34548 67722 90462 80884 54672
$$ packed form
14585E0363K0872L7821j3561o510K8167J8818J4267j305n1111l2115k848M728
14573F7586J5698j6152J6756J5567j3731l0988p371l618L3256K0066k1818j8074
14561E7177R759J1035o427l7002K1612M620j0110K63k2510j8751J3986O6355K5282
14548A15289J78l667J8443k9615M8187M5058k5816m4687j1049j993j1761p852
14536I0715o671Q985K9621O5589K4352R715j1587k8786l0210j0202L0978O980
14524A79479l0845q1734k3326J8627J5619L8418m1314j3117j6200l7615o835L3201
14512C4358j4569j3461R625k9415k2752J208j4399k0270l2468J2530M519P501
14500g7593J9817L1452M1393J402j3893j6084n345N3399L3174K2740r578k6212
$$ plain form
14488 54672 68079 116179 120369 98451 91657 90320 81351 86990 65806 45542 55216 114670 152476
14475 152476 154140 135989 118789 182094 211186 195229 244007 264000 244920 259973 233484 181137
14463 181137 178960 157132 136570 110449 97636 76185 87169 121411 137553 79681 37395 27857
14451 27857 17235 6500 30328 26961 41222 88300 83346 73728 67742 46651 23765 26705 47
14438 47 23564 10125 -39755 -67956 -34245 -33605 17345 87021 146249 109458 81669 96031 104800
14425 104800 86626 52865 32040 -25645 -15852 -12871 2937 22589 -35465 -101704 -156343 -194885
14413 -194885 -217437 -246079 -241199 -155735 -48065 79162 267880 425619 556237 653393 714964
14402 714964 732755 682963 623005 591002 594471 562461 559622 523718 495782 487931 491288 499338
$$ packed form
14488E4672J3407M8100M190k1918o794j337q969N639k1184k0264R674N9454L7806
14475A52476J664j8151j7200O3305K9092j5957M8778J9993j9080J5053k6489n2347
14463A81137k177k1828k0562k6121j2813k1451J0984L4242J6142n7872m2286r538
14451B7857j0622j0735K3828l367J4261M7078m954r618n986k1091k2886K940k6658
14438D7K3517j3439m9880k8201L3711O40N0950O9676N9228l6791k7789J4362Q769
14425A04800j8174l3761k0825n7685R793K981J5808J9652n8054o6239n4639l8542
14413a94885k2552k8642M880Q5464J07670J27227J88718J57739J30618R7156O1571
14402G14964J7791m9792n9958l2003L469l2010k839l5904k7936p851L357Q050
$$ plain form
14390 499338 515211 506150 449032 435221 473719 508112 519287 486061 473841 451042 413741 406592
14378 406592 411292 431608 450021 492878 460045 428934 417784 392710 357484 329589 333073 328529
14366 328529 306964 267464 252594 258550 264048 248720 247037 255399 261942 308082 321899 295731
14354 295731 295581 310589 351840 411820 448079 511411 573636 650139 718349 769291 792981 805627
14342 805627 808662 791457 755456 748688 741687 769989 701394 632300 608138 614892 585753 567733
14330 567733 519942 504280 460398 441491 445365 472718 514349 493241 484849 512990 543685 595901
14318 595901 632546 650106 617954 614857 645249 656289 619724 556406 544706 533874 560223 625849
14306 625849 656440 675876 675162 653552 643315 630389 624989 597011 603710 634347 613730 589215
$$ packed form
14390D99338J5873r061n7118j3811L8498L4393J1175l3226j2220k2799l7301p149
14378D06592M700K0316J8413M2857l2833l1111j1150k5074l5226k7895L484m544
14366C28529k1565l9500j4870N956N498j5328j683Q362O543M6140J3817k6168
14354B95731j50J5008M1251N9980L6259O3332O2225P6503O8210N0942K3690J2646
14342H05627L035j7205l6001o768p001K8302o8595o9094k4162O754k9139j8020
14330E67733m7791j5662m3882j8907L874K7353M1631k1108q392K8141L0695N2216
14318E95901L6645J7560l2152l097L0392J1040l6565o3318j1700j0832K6349O5626
14306F25849L0591J9436p14k1610j0237j2926n400k7978O699L0637k0617k4515
$$ plain form
14294 589215 623326 607039 597564 610772 656338 696730 687354 638937 625959 613907 652158 678842
14282 678842 708919 749433 796599 825164 829413 855847 912744 915081 937319 988728 1002886 1054820
14270 1054820 1085505 1077282 1085784 1122283 1183815 1236137 1295849 1390527 1532298 1640410 1711750
14259 1711750 1796052 1868221 1952683 2016638 2113947 2223638 2360795 2572181 2729742 2884636
14249 2884636 3033046 3217557 3433613 3671001 3906824 4279786 4660212 5084143 5626475
14240 5626475 6307177 7186441 8368694 9883820 11624943 13556763 15657327 17625090
14232 17625090 19463514 21222518 23137280 25523416 28811420 33694399 41029106 52140719
14224 52140719 69380936 96679210 138726376 194743636 254185713 311552729 359404544
$$ packed form
14294E89215L4111j6287r475J3208M5566M0392r376m8417j2978j2052L8251K6684
14282F78842L0077M0514M7166K8565M249K6434N6897K337K2238N1409J4158N1934
14270A054820L0685q223Q502L6499O1532N2322N9712R4678J41771J08112P1340
14259A711750Q4302P2169Q4462O3955R7309J09691J37157K11386J57561J54894
14249B884636J48410J84511K16056K37388K35823L72962L80426M23931N42332
14240E626475O80702Q79264J182253J515126J741123J931820K100564J967763
14232A7625090J838424J759004J914762K386136L288004M882979P334707J1111613
14224E2140719J7240217K7298274M2047166N6017260N9442077N7367016M7851815
$$ plain form
14217 359404544 383339244 377630554 346294056 302736689 252028711 200202842 159149842
14210 159149842 129556632 108215401 92788255 81670135 73808311 68257423 64153803
14203 64153803 60862491 57823323 54476485 50552643 46101887 41391605 36687694 32274911
14195 32274911 28380242 25039188 22214533 19828386 17809960 16091256 14587855 13262776
14187 13262776 12083689 11072202 10153436 9303552 8519122 7775885 7069922 6466961 5997916
14178 5997916 5505615 5067512 4704691 4345935 4003033 3667675 3345568 3090851 2865827
14169 2865827 2653534 2397312 2239322 2130258 1991959 1848653 1730582 1583838 1469115
14160 1469115 1374560 1281280 1186183 1169525 1153620 1155676 1174514 1177426 1186774 1138617 1093961 1021384
$$ packed form
14217C59404544K3934700n708690l1336498m3557367n0707978n1825869m1053000
14210A59149842k9593210k1341231j5427146j1118120p861824n550888m103620
14203F4153803l291312l039168l346838l923842m450756m710282m703911m412783
14195C2274911l894669l341054k824655k386147k018426j718704j503401j325079
14187A3262776j179087j011487r18766q49884p84430p43237p05963o02961m69045
14178E997916m92301m38103l62821l58756l42902l35358l22107k54717k25024
14169B865827k12293k56222j57990j09064j38299j43306j18071j46744j14723
14160A469115r4555r3280r5097j6658j5905K056J8838K912R348m8157m4656p2577
$$ plain form
14148 1021384 932570 885097 791824 714865 699701 701230 679540 656129 650090 678839 674763 668728
14136 668728 633194 626073 650587 667176 631646 558169 536601 543811 522804 499662 474019 485388
14124 485388 491367 481189 436832 433252 448884 404154 339689 319981 312122 293153 316366 326840
14112 326840 317833 289878 308164 342567 345691 299893 283614 258408 257618 243715 232340 228235
14100 228235 251704 317834 353342 381421 439581 479683 499774 488238 441383 443642 415874 347254
14088 347254 277745 225086 170029 146318 178529 171474 126031 94930 129146 142683 129528 155779
14076 155779 153515 163687 169978 125225 119943 115760 140362 181886 174544 109655 85793 82512 45312
14063 45312 34810 1997 432 8998 20506 14585 6092 26037 10464 -21058 -56313 -73539
$$ packed form
14148A021384q8814m7473r3273p6959j5164J529k1690k3411o039K8749m076o035
14136F68728l5534p121K4514J6589l5530p3477k1568P210k1007k3142k5643J1369
14124D85388N979j0178m4357l580J5632m4730o4465j9708p859j8969K3213J0474
14112C26840r007k7955J8286L4403L124m5798j6279k5206p90j3903j1375m105
14100B28235K3469O6130L5508K8079N8160M0102K0091j1536m6855K259k7768o8620
14088C47254o9509n2659n5057k3711L2211p055m5443l1101L4216J3537j3155K6251
14076A55779k264J0172O291m4753n282m183K4602M1524p342o4889k3862l281l7200
14063D5312j0502l2813j565Q566J1508n921q493J9945j5573l1522l5255j7226
$$ plain form
14051 -73539 -43799 -15076 -41593 -54669 -52734 -36389 -19885 -67364 -133240 -123433 -138533 -176775
14039 -176775 -177429 -231714 -294039 -306451 -337720 -371343 -454242 -523485 -576547 -574369 -501510 -364116
14027 -364116 -206920 -22720 161164 244150 268405 254642 272349 269296 266676 291215 289741
14016 289741 252243 246619 246532 180102 91430 127325 149910 142603 131594 189422 178315 165875
14004 165875 190822 219500 242156 226207 223100 218506 242725 227966 191200 220019 218478 180715
13992 180715 163967 134379 168881 204154 226854 190243 141462 103112 126638 113653 97555
13981 97555 89047 76586 98145 96283 149287 176535 126160 77548 98260 122591 120233 102405
13969 102405 89852 92164 112677 116513 122038 121112 142844 153800 162155 133091 111195 88712 66658
$$ packed form
14051g3539K9740K8723k6517j3076J935J6345J6504m7479o5876R807j5100l8242
14039a76775o54n4285o2325j2412l1269l3623q2899o9243n3062K178P2859J37394
14027c64116J57196J84200J83884Q2986K4255j3763J7707l053k620K4539j474
14016B89741l7498n624q7o6430q8672L5895K2585p307j1009N7828j1107j2440
14004A65875K4947K8678K2656j5949l107m594K4219j4759l6766K8819j541l7763
13992A80715j6748k9588L4502L5273K2700l6611m8781l8350K3526j2985j6098
13981I7555q508j2461K1559j862N3004K7248n0375m8612K0712K4331k358j7828
13969A02405j2553K312K0513L836N525r26K1732J0956Q355k9064k1896k2483k2054
$$ plain form
13956 66658 85674 137198 119535 118656 138139 182818 198539 189702 190744 156812 92463 98301 136752
13943 136752 140036 113129 118861 132076 105094 95533 121054 112574 73803 54078 58687 56534 79420
13930 79420 64533 74083 71691 125104 162395 162591 150845 149364 106905 77812 60919 99755 137406
13917 137406 158434 148974 149361 167972 168739 158607 128015 53752 -7918 -44346 -85501 -89240 -85545
13904 -85545 -109563 -120237 -136623 -101423 -78791 -88907 -90187 -74267 -40428 -9795 -11595 -26496
13892 -26496 7558 18538 5119 -5139 -13119 -41656 -24732 -18688 -36083 -56209 -73288 -60805
13880 -60805 -67441 -45043 -279 50457 86912 102188 71156 20365 25274 -1152 -2553 13838
13868 13838 22595 12857 6131 6405 -21919 -31287 -28423 -60904 -43270 -8989 22302 83825 88466
$$ packed form
13956F6658J9016N1524j7663q79J9483M4679J5721q837J042l3932o4349N838L8451
13943A36752L284k6907N732J3215k6982r561K5521q480l8771j9725M609k153K2886
13930G9420j4887R550k392N3413L7291J96j1746j481m2459k9093j6893L8836L7651
13917A37406K1028r460L87J8611P67j0132l0592p4263o1670l6428m1155l739L695
13904h5545k4018j0674j6386L5200K2632j0116j280J5920L3839L0633j800j4901
13892b6496L4054J0980j3419j0258p980k8537J6924O044j7395k0126j7079J2483
13880f0805o636K2398M4764N0736L6455J5276l1032n0791M909k6426j401J6391
13868A3838Q757r738o726K74k8324r368K864l2481J7634L4281L1291O1523M641
$$ plain form
13855 88466 87972 48532 38512 38911 34406 3656 6186 23663 4911 4690 45745 88826 102140
13842 102140 63027 45840 33916 26169 16969 23642 24844 7685 -54449 -39738 17750 24230
13830 24230 19206 12066 21996 27386 -5528 -24030 -999 -4784 38686 38014 54667 64025 80413
13817 80413 29352 13233 32993 23248 -38968 -50381 -17057 18470 65164 73162 49755 8249
13805 8249 -86 28471 24161 8638 57423 68297 103797 122107 79390 37966 -17426 15483
13793 15483 56244 61145 41151 43716 88830 136473 134574 119132 159141 162229 172934 203251
13781 203251 213309 219867 179235 191564 233302 264351 272657 270155 294711 379826 541471 770979
13769 770979 1038077 1370124 1739818 2125587 2495524 2832066 3071862 3129321 3079112 2855622
$$ packed form
13855H8466m94l9440j0020L99m505l0750K530J7477j8752k21M1055M3081J3314
13842A02140l9113j7187j1924p747r200O673J202j7159o2134J4711N7488O480
13830B4230n024p140R930N390l2914j8502K3031l785M3470o72J6653R358J6388
13817H0413n1061j6119J9760r745o2216j1413L3324L5527M6694P998k3407m1506
13805H249q335K8557m310j5523M8785J0874L5500J8310m2717m1424n5392L2909
13793A5483M0761M901j9994K565M5114M7643j899j5442M0009L088J0705L0317
13781B03251J0058O558m0632J2329M1738L1049Q306k502K4556Q5115J61645K29508
13769G70979K67098L32047L69694L85769L69937L36542K39796N7459n0209k23490
$$ plain form
13759 2855622 2513288 2140870 1795844 1472941 1211734 1020097 891567 778798 727297 697189
13749 697189 666459 632122 608851 517518 439818 380250 321226 334986 334322 285203 270769 236563
13737 236563 241127 222369 156841 155357 154281 124011 139087 125766 132429 116935 130624 93928
13725 93928 59591 68296 67751 67908 55909 78600 29902 -9296 -32125 -31493 -7183 10133 62356
13712 62356 76885 104994 81786 39488 -610 9350 41436 94873 73848 62231 59253 91915
13700 91915 128660 80638 31066 28261 46554 50149 46229 56440 25865 13129 19425 -47844
13688 -47844 -33982 1659 12535 2842 4058 13466 12326 57047 50927 -7492 19968 5111 -2166
13675 -2166 3511 22834 24496 31187 44074 60009 77951 43523 -9251 83 77019 114714 56556
$$ packed form
13759B855622l42334l72418l45026l22903k61207j91637j28530j12769n1501l0108
13749F97189l0730l4337k3271r1333p7700n9568n9024J3760o64m9119j4434l4206
13737B36563M564j8758o5528j484j076l0270J5076j3321O663j5494J3689l6696
13725I3928l4337Q705n45J57j1999K2691m8698l9198k2829O32K4310J7316N2223
13712F2356J4529K8109k3208m2298m0098R960L2086N3437k1025j1617k978L2662
13700I1915L6745m8022m9572k805J8293L595l920J0211l0575j2736O296o7269
13688d7844J3862L5641J0876r693J216R408j140M4721o120n8419K7460j4857p277
13675b166N677J9323J662O691J2887J5935J7942l4428n2774R334P6936L7695n8158
$$ plain form
13662 56556 24179 35193 44128 -2039 -21170 85 51301 33139 36019 55884 66172 15581
13650 15581 39271 97125 102706 94552 50531 -6267 8937 53889 51957 -6117 -25893 -22948
13638 -22948 -31544 -31622 -128 -41901 -74825 -89721 -50826 -24306 -39746 -47446 -41423 -36324 -24990
13625 -24990 23419 48692 44272 24481 34297 44448 32683 -13367 23739 53224 21623 -1897
13613 -1897 -39440 -11620 15705 46629 59402 9697 -19373 -11687 -17951 -13314 -2300 13320
13601 13320 24833 36455 55008 69225 40181 19764 -37698 -53464 -4549 33104 46282 87953
13589 87953 149851 135957 145450 97830 89451 97976 83085 30188 12701 24051 37949 46425
13577 46425 44046 21580 -6183 29902 16330 14473 10375 -4700 -12678 -15917 -67411 -45362 14979
$$ packed form
13662E6556l2377J1014Q935m6167j9131K1255N1216j8162K880J9865J0288n0591
13650A5581K3690N7854N581q154m4021n6798J5204M4952j932n8074j9776K945
13638b2948q596p8L1494m1773l2924j4896L8895K6520j5440p700O023N099J1334
13625b4990M8409K5273m420j9791R816J0151j1765m6050L7106K9485l1601k3520
13613a897l7543K7820K7325L0924J2773m9705k9070P686o264M637J1014J5620
13601A3320J1513J1622J8553J4217k9044k0417n7462j5766M8915L7653J3178M1671
13589H7953O1898j3894R493m7620q379Q525j4891n2897j7487J1350J3898Q476
13577D6425k379k2466k7763L6085j3572j857m098j5075p978l239n1494K2049O0341
$$ plain form
13564 14979 -2396 -47620 -56846 -13595 6633 12759 13454 43808 62723 77299 77260 55771 24369
13551 24369 -28472 -7812 33459 65030 56759 45822 74476 126001 108231 107071 104431 55032
13539 55032 23063 31835 84330 86704 97895 108316 72396 61932 43876 79781 84547 59427
13527 59427 17701 19592 50479 43381 20766 -32277 -59928 -53834 -78510 -78923 -35330 2914 34769
13514 34769 32424 25816 29629 4298 -28752 -68534 -52698 -25207 -38144 -47905 -49382 -17908 15732
13501 15732 5703 -9992 2031 9241 12240 24102 11979 17362 20940 36161 18468 -6631
13489 -6631 -35324 -13650 20838 7167 -18106 -22824 -10192 32791 3350 2188 17179 47099
13477 47099 36833 22440 276 -25855 -37524 -7438 41700 38025 6944 -14683 7740 4999
$$ packed form
13564A4979j7375m5224r226M3251K0228O126O95L0354J8915J4576l9k1489l1402
13551B4369n2841K0660M1271L1571q271j0937K8654N1525j7770j160k640m9399
13539E5032l1969Q772N2495K374J1191J0421l5920j0464j8056L5905M766k5120
13527E9427m1726J891L0887p098k2615n3043k7651O094k4676m13M3593L8244L1855
13514C4769k345o608L813k5331l3050l9782J5836K7491j2937r761j477L1474L3640
13501A5732j0029j5695J2023P210K999J1862j2123N383L578J5221j7693k5099
13489f631k8693K1674L4488j3671k5273m718J2632M2983k9441j162J4991K9920
13477D7099j0266j4393k2164k6131j1669L0086M9138l675l1081k1627K2423k741
$$ plain form
13465 4999 29205 40747 35874 50570 28615 -42681 -61391 -39089 -43176 -54529 -55282 -57224 -60217
13452 -60217 -30186 -15652 -10724 -7257 -15572 -4389 37030 50708 41538 178 -23707 -30037 -13463
13439 -13463 18902 37870 16585 -2854 30518 66995 105029 93691 21278 -40826 -7107 -4964
13427 -4964 15276 52891 43888 34812 24419 13354 24914 39560 48214 52828 10307 31304 66772
13414 66772 50885 43166 73557 78829 81571 78950 93041 27623 -20657 15626 41259 27517
13402 27517 -6951 -22059 -37923 -33482 -2255 -21447 11919 16054 -8868 -57819 -44721 -10891
13390 -10891 4172 40091 3489 -14321 15096 33617 29496 -3606 -41035 -78096 -64372 -189
13378 -189 46702 42924 -13878 21144 24776 52081 48425 35029 42422 43008 30878 27083 36283 1329
$$ packed form
13465D999K4206J1542m873J4696k1955p1296j8710K2302m087j1353p53j942k993
13452f0217L0031J4534M928L467q315J1183M1419J3678r170m1360k3885o330J6574
13439a3463L2365J8968k1285j9439L3372L6477L8034j1338p2413o2104L3719K143
13427d964K0240L7615r003r076j0393j1065J1560J4646Q654M614m2521K0997L5468
13414F6772j5887p719L0391N272K742k621J4091o5418m8280L6283K5633j3742
13402B7517l4468j5108j5864M441L1227j9192L3366M135k4922m8951J3098L3830
13390a0891J5063L5919l6602j7810K9417J8521m121l3102l7429l7061J3724O4183
13378a89M6891l778n6802L5022L632K7305l656j3396P393N86j2130l795R200l4954
$$ plain form
13364 1329 -12813 21037 11026 21785 37025 39039 9703 12388 25597 16004 21806 -9533 24153
13351 24153 -9459 -71385 -102281 -76286 -54535 -66361 -91570 -72394 -14460 4212 -31440 -13842
13339 -13842 -482 -11693 -1465 30949 67290 57266 48311 47172 43013 50747 46853 36977 9806
13326 9806 -11949 -19221 39566 87327 95672 74596 65518 35796 -4670 -18432 -37400 -21622
13314 -21622 -18457 8096 8765 6069 -30720 -37978 -24134 19946 42720 28068 20355 36195 20995
13301 20995 -11686 27781 14120 21681 21646 23732 474 19536 9939 -9108 -24937 -57744 -50151
13288 -50151 -41255 696 12292 -4765 10312 46481 30230 -22202 -31230 -47169 -40854 10720
13276 10720 62477 85749 65036 60275 61025 43081 56560 45812 9140 8907 4878 -59806 -43841
$$ packed form
13364A329j4142L3850j0011J0759J5240K014k9336K685J3209r593N802l1339L3686
13351B4153l3612o1926l0896K5995K1751j1826k5209J9176N7934J8672l5652J7598
13339a3842J3360j1211J0228L2414L6341j0024q955j139m159P734l894r876k7171
13326I806k1755p272N8787M7761Q345k1076r078k9722m0466j3762j8968J5778
13314b1622L165K6553O69k696l6789p258J3844M4080K2774j4652p713J5840j5200
13301B0995l2681L9467j3661P561l5K086k3258J9062r597j9047j5829l2807P593
13288e0151Q896M1951J1596j7057J5077L6169j6251n2432r028j5939O315N1574
13276A0720N1757K3272k0713m761P50j7944J3479j0748l6672k33m029o4684J5965
$$ plain form
13263 -43841 42431 46896 1016 -18078 -6690 4764 31007 12244 14060 7221 -16560 -19847
13251 -19847 -48676 -52686 -39192 -38471 -34136 -41590 -61679 -89764 -70670 -7780 11464 18759 5657
13238 5657 -25558 -24570 -5754 -47071 -61913 -37908 -804 -2326 25553 31277 43944 41835 2987
13225 2987 -25547 -7187 -15263 -14749 16771 72274 100156 50595 13666 35421 54595 50328 19116
13212 19116 -25915 -51154 -62061 -35070 423 26141 35160 22584 -23215 -24326 -36544 -79561
13200 -79561 -66551 -79212 -75398 -55721 -72323 -120965 -54107 22879 43126 75832 67983 70607
13188 70607 68715 40026 -2862 -35343 -3859 31401 15349 -17227 -13721 -18639 -5850 24168
13176 24168 42816 40970 31325 62369 58773 34865 51580 32219 21701 -20933 -54469 -83185
$$ packed form
13263d3841Q6272M465m5880j9094J1388J1454K6243j8763J816o839k3781l287
13251a9847k8829m010J3494P21M335p454k0089k8085J9094O2890J9244P295j3102
13238E657l1215R88J8816m1317j4842K4005L7104j522K7879N724J2667k109l8848
13225B987k8534J8360q076N14L1520N5503K7882m9561l6929K1755J9174m267l1212
13212A9116m5031k5239j0907K6991L5493K5718R019j2576m5799j111j2218m3017
13200g9561J3010j2661L814J9677j6602m8642O6858P6986K0247L2706p849K624
13188G0607j892k8689m2888l2481L1484L5260j6052l2576L506m918J2789L0018
13176B4168J8648j846r645L1044l596k3908J6715j9361j0518m2634l3536k8716
$$ plain form
13164 -83185 -105877 -55990 -19968 -15696 -50483 -38992 -41464 -49085 -83212 -60933 534 12916
13152 12916 45713 24184 -10752 -26642 -22448 4980 -22076 -36169 -22356 -9299 1855 -2101
13140 -2101 -54076 -79271 -48314 -2878 -5523 11497 33746 24234 -22921 -39715 -24677 5838
13128 5838 35091 26897 3131 -38387 -52806 -82519 -82643 -63669 -18359 40173 68643 81233
13116 81233 62837 16737 -9734 19069 17639 -28935 -60157 -83857 -66747 -64715 -58831 -65564
13104 -65564 -28559 -3004 17693 24119 -9960 -47009 7574 346 -37886 -43409 -31414 -48143
13092 -48143 -31645 -19532 -28818 -57101 -62447 -23839 4704 36518 -10313 -43237 -43205 -52378 -32108
13079 -32108 -20515 -26279 9341 -12248 -15700 -8472 -36664 -26864 -9314 -48880 -56864 -14104 -4120
$$ packed form
13164h3185k2692M9887L6022M272l4787J1491k472p621l4127K2279O1467J2382
13152A2916L2797k1529l4936j5890M194K7428k7056j4093J3813J3057J1154l956
13140b101n1975k5195L0957M5436k645J7020K2249r512m7155j6794J5038L0515
13128E838K9253q194k3766m1518j4419k9713j24J8974M5310N8532K8470J2590
13116H1233j8396m6100k6471K8803j430m6574l1222k3700J7110K032N884o733
13104f5564L7005K5555K0697O426l4079l7049N4583p228l8232n523J1995j6729
13092d8143J6498J2113r286k8283n346L8608K8543L1814m6831l2924L2r173K0270
13079c2108J1593n764L5620k1589l452P228k8192R800J7550l9566p984M2760R984
$$ plain form
13066 -4120 -28448 -50668 -61139 -23428 1927 -2418 27013 77008 82724 80062 61163 91142
13054 91142 90133 49012 41350 52990 99779 56071 -13750 -33376 -65513 -57916 -49866 -38804
13042 -38804 4932 683 -19510 -71132 -104583 -76957 -26040 -6798 -5691 -31409 -49247 -60913
13030 -60913 -41496 -48090 -45279 15480 15475 -49161 -75233 -40537 -34548 -54597 -56279 -42348 -16778
13017 -16778 2082 -4202 22170 4290 -27693 -6386 -32142 -57406 -42361 -713 25698 18779
13005 18779 6414 27499 40037 30658 -4239 -5276 -28698 -22164 57921 63390 51010 49147 61499
12992 61499 28919 12859 -19592 -62809 -28923 5175 -20493 11462 43200 65745 32290 9202
12980 9202 -25974 -62775 -77927 -32451 -19476 -23979 -26894 -44334 -70305 -100779 -83955 -62355
$$ packed form
13066d120k4328k2220j0471L7711K5355m345K9431M9995N716k662j8899K9979
13054I1142j009m1121p662J1640M6789m3708o9821j9626l2137P597Q050J1062
13042c8804M3736m249k0193n1622l3451K7626N0917J9242J107k5718j7838j1666
13030f0913J9417o594K811O0759no4636k6072L4696N989k0049j682J3931K5570
13017a6778J8860o284K6372j7880l1983K1307k5756k5264J5045M1648K6411o919
13005A8779j2365K1085J2538r379l4897j037k3422O534Q0085N469j2380j863J2352
12992F1499l2580j6060l2451m3217L3886L4098k5668L1955L1738K2545l3455k3088
12980I202l5176l6801j5152M5476J2975m503k915j7440k5971l0474J6824K1600
$$ plain form
12968 -62355 -50369 -20980 -41756 -68932 -69425 -88908 -44673 -13471 -16864 -67 14725 -1904
12956 -1904 -28110 -28178 -26862 4779 -16347 -27268 22910 49052 4447 -8357 -28443 -35267 -12022
12943 -12022 3418 -3269 7732 -62562 -71148 -44455 4612 -13585 -21117 -10012 -42180 -79575
12931 -79575 -74193 -89682 -64896 -17589 -23815 -35553 -21917 -19472 -23515 22804 7910 17573 3677
12918 3677 5972 40827 30140 37767 51049 60182 62731 13499 24793 13117 22908 17595 1584
12905 1584 358 15878 17324 17531 5703 -1356 997 9494 -8993 28721 69038 61551 12296
12892 12296 -8491 10633 -21312 -21538 -47587 -10725 -27007 -13805 -20648 -2618 20129 8106
12880 8106 25562 -5566 13703 52476 31025 -12776 -33146 -27865 3530 8844 21004 30310
$$ packed form
12968f2355J1986K9389k0776k7176m93j9483M4235L1202l393J6797J4792j6629
12956a904k6206o8J316L1641k1126j0921N0178K6142m4605j2804k0086o824K3245
12943a2022J5440o687J1001p0294q586K6693M9067j8197p532J1105l2168l7395
12931g9575N382j5489K4786M7307o226j1738J3636K445m043M6319j4894R663j3896
12918C677K295L4855j0687P627J3282R133K549m9232J1294j1676R791n313j6011
12905A584j226J5520J446K07j1828p059K353Q497j8487L7714M0317p487m9255
12892A2296k0787J9124l1945k26k6049L6862j6282J3202o843J8030K2747j2023
12880H106J7456l1128J9269L8773k1451m3801k0370N281L1395N314J2160R306
$$ plain form
12868 30310 -7176 -26577 4885 53691 41230 24028 13636 -14023 -15301 39639 72340 84501
12856 84501 67592 65138 87984 94792 107393 63177 18731 -14016 -24413 -45039 -26648 7098
12844 7098 16005 -1950 -5407 40243 48330 41424 49614 76467 129917 182798 277321 360316 490964
12831 490964 692012 860015 774251 566768 435817 346970 245120 188419 166147 185466
12821 185466 162562 110034 63095 22904 31594 44884 35670 31026 31619 136 -26553 -38133
12809 -38133 -43844 -24699 52869 85872 70443 43212 73941 85611 79453 58004 50659 36831
12797 36831 20468 19168 -25278 -51148 -55145 -44247 -20687 14645 24242 17094 22645 34019 13222
12784 13222 -18928 -17598 8364 37075 19910 -42795 -67825 -67321 -71705 -90195 -51576 3946
$$ packed form
12868C0310l7486j9401L1462M8806j2461j7202j0392k7659j278N4940L2701J2161
12856H4501j6909k454K2846O808J2601m4216m4446l2747j0397k0626J8391L3746
12844G098Q907j7955l457M5650Q087o906Q190K6853N3450N2881R4523Q2995J30648
12831D90964K01048J68003q5764k07483j30951q8847j01850n6701k2272J9319
12821A85466k2904n2528m6939m0191Q690J3290r214m644N93l1483k6689j1580
12809c8133n711J9145P7568L3003j5429k7231L0729J1670o158k1449p345j3828
12797C6831j6363j300m4446k5870l997J0898K3560L5332R597p148N551J1374k0797
12784A3222l2150J330K5962K8711j7165o2705k5030N04m384j8490L8619N5522
$$ plain form
12772 3946 25048 -13476 -5455 3681 -17663 -58177 -48793 -28942 -19628 -14913 -20375 -50953 -51758
12759 -51758 -54984 -51729 28761 28796 20450 29533 49616 48335 36521 60259 65694 49774 44594 43004
12745 43004 37498 -8714 -37906 -20651 -11026 -19033 -22475 23076 36806 35966 26398 -3344 18212
12732 18212 9217 9920 -2488 -3536 -12488 -42341 -78430 -38456 4393 16367 16806 56102 3141
12719 3141 -20810 15619 31242 39252 38230 18561 8168 12290 16398 47409 32744 9327 12208
12706 12208 -27435 -28391 34642 78343 13491 -1022 -26868 -82867 -44230 24756 84939 144740
12694 144740 222056 197303 148603 115141 25927 42244 69138 66495 60805 63928 51672 4200
12682 4200 -21024 -6333 15280 29684 25399 19002 -12463 -13501 -22471 -33784 -8417 39712 39847
$$ packed form
12772C946K1102l8524Q021R136k1344m0514R384J9851R314M715n462l0578q05
12759e1758l226L255Q0490L5q346R083K0083j281j1814K3738N435j5920n180j590
12745D3004n506m6212k9192J7255R625q007l442M5551J3730q40r568k9742K1556
12732A8212q995P03j2408j048q952k9853l6089L9974M2849J1974M39L9296n2961
12719C141k3951L6429J5623Q010j022j9669j0393M122M108L1011j4665k3417K881
12706A2208l9643r56O3033M3701o4852j4513k5846n5999L8637O8986O0183N9801
12694A44740P7316k4753m8700l3462q9214J6317K6894k643n690L123j2256m7472
12682D200k5224J4691K1613J4404m285o397l1465j038q970j1313K5367M8129J35
$$ plain form
12669 39847 21745 -26474 -10118 10610 -3114 18254 -11405 -4149 1307 8549 18570 23568
12657 23568 20356 47221 41778 -9647 -37457 -5876 33805 45281 -10201 -27332 -12769 -18043
12645 -18043 -10665 43612 32394 16798 -1714 -16973 -37145 -19903 25738 39021 -35782 -105986
12633 -105986 -88976 -39366 -23198 -28787 -10519 -44997 -34895 -47345 -70737 -28109 7411 -2983
12621 -2983 -20389 -26849 -58915 -39496 -19609 -34352 -17969 1999 23529 51 -15408 -23568
12609 -23568 25287 -10950 -8365 17562 31936 51254 15279 9699 9795 26151 30089 -1074 -65317
12596 -65317 -87895 -73712 -82134 -90558 -88809 -73683 -45671 -34255 -29089 -31746 11833 20742 1708
12583 1708 4806 23199 37176 10859 14277 26891 -1485 -12534 5979 -577 -24465 -17316 -10037
$$ packed form
12669C9847j8102m8219J6356K0728j3724K1368k9659P256N456P242J0021M998
12657B3568l212K6865n443n1425k7810L1581L9681J1476n5482j7131J4563n274
12645a8043P378N4277j1218j5596j8512j5259k0172J7242M5641J3283p4803p0204
12633a05986J7010M9610J6168n589J8268l4478J0102j2450k3392M2628L5520j0394
12621b983j7406o460l2066J9419J9887j4743J6383J9968K1530k3478j5459q160
12609b3568M8855l6237K585K5927J4374J9318l5975n580R6J6356L938l1163o4243
12596f5317k2578J4183q422q424J749J5126K8012J1416N166k657M3579Q909j9034
12583A708L098J8393J3977k6317L418J2614k8376j1049J8513o556k3888P149P279
$$ plain form
12570 -10037 -3727 -5887 13802 -1370 -9811 17454 44798 8758 -12215 -20248 -35156 -35006 23756
12557 23756 30433 4345 -25805 -45807 -21148 -1206 32246 16583 49517 15434 -55094 -54071
12545 -54071 -30775 -52445 -57307 -26134 -415 8185 -2390 -22406 -17378 -28807 -62207 -31177
12533 -31177 -31034 -13315 22936 16679 28563 32754 11442 -48024 -45253 -82948 -104006 -90545 -48752
12520 -48752 -2038 5951 9685 49686 62533 35702 -26729 -51149 -52481 -43771 1718 47169
12508 47169 50645 29488 34808 57234 30637 4268 -28427 -54837 -28071 -21202 -6552 -3934
12496 -3934 25507 23937 18425 52236 85995 31376 11176 6837 -10424 3732 22206 37384
12484 37384 8878 21518 -17694 -35793 -20602 16284 51271 50962 13908 10852 35237 8506
$$ packed form
12570a0037O310k160J9689j5172q441K7265K7344l6040k0973q033j4908J50N8762
12557B3756O677k6088l0150k0002K4659J9942L3452j5663L2934l4083p0528J023
12545e4071K3296k1670m862L1173K5719Q600j0575k0016N028j1429l3400L1030
12533c1177J43J7719L6251o257J1884M191k1312n9466K771l7695k1058J3461M1793
12520d8752M6714P989L734M0001J2847k6831o2431k4420j332Q710M5489M5451
12508D7169L476k1157N320K2426k6597k6369l2695k6410K6766O869J4650K618
12496c934K9441j570n512L3811L3759n4619k0200m339j7261J4156J8474J5178
12484C7384k8506J2640l9212j8099J5191L6886L4987l09l7054l056K4385k6731
$$ plain form
12472 8506 30532 61946 37156 13959 -16436 10779 33221 37800 40761 43462 44084 57997 13814
12459 13814 19560 19533 13900 9541 31198 12811 -30948 -31994 -16626 9034 -33584 -27962 -47813
12446 -47813 -73827 -52987 -20761 -29556 -8095 17281 5024 -26687 -28269 -14164 16773 -8945
12434 -8945 -68274 -51379 5565 3740 20193 53940 51966 64722 75335 85863 134758 128649
12422 128649 63116 42911 70719 144715 227813 316872 422356 457271 388198 287564 191585
12411 191585 114988 44608 49346 66222 36036 -7867 -19849 -7279 -17132 -545 31446 35612
12399 35612 9045 4912 -3565 8070 783 -445 37938 35815 38829 40698 31020 29597 37937 24201
12385 24201 27998 53271 57726 17973 20126 25689 23652 -6561 11424 32951 52773 59304 32051
$$ packed form
12472H506K2026L1414k4790k3197l0395K7215K2442M579K961K701O22J3913m4183
12459A3814N746k7n633m359K1657j8387m3759j046J5368K5660m2618N622j9851
12446d7813k6014K0840L2226q795K1461K5376j2257l1711j582J4105L0937k5718
12434h945n9329J6895N6944j825J6453L3747j974J2756J0613J0528M8895o109
12422A28649o5533k0205K7808P3996Q3098Q9059J05484L4915o9073j00634r5979
12411A91585p6597p0380M738J6876l0186m3903j1982J2570r853J6587L1991M166
12399C5612k6567m133q477J1635p287j228L8383k123L014J869r678j423Q340j3736
12385B4201L797K5273M455l9753K153N563k037l0213J7985K1527J9822O531k7253
$$ plain form
12372 32051 22999 4353 -44395 -51433 5875 -4330 -13893 -56996 -76238 -34475 39968 85522
12360 85522 61338 35358 8457 2152 11688 -2176 -13559 10773 -40584 -50220 -48317 -25239
12348 -25239 14325 29196 21150 -50186 -68320 -68244 -73392 -61261 -30608 6536 -14945 -23644 12761
12335 12761 25422 -1581 3983 33267 11933 -8982 -11430 -16318 -38182 -26791 -9378 11585
12323 11585 22338 32714 63569 46799 43088 11164 -61020 -76533 -57009 -48487 -34517 -49787
12311 -49787 -40850 -24034 -10447 -17142 11171 30323 29041 -37970 -73803 -82242 -92519 -78934
12299 -78934 -14588 42583 32188 11917 -4106 -31699 -70504 -49117 -18114 3116 14333 39461
12287 39461 33085 -351 -20824 31661 80382 74354 38634 33526 43542 24940 23625 -9237
$$ packed form
12372C2051r052j8646m8748p038N7308j0205r563m3103j9242M1763P4443M5554
12360H5522k4184k5980k6901o305R536j3864j1383K4332n1357r636J903K3078
12348b5239L9564J4871q046p1336j8134P6n148J2131L0653L7144k1481q699L6405
12335A2761J2661k7003N564K9284k1334k0915k448m888k1864J1391J7413K0963
12323A1585J0753J0376L0855j6770l711l1924p2184j5513J9524Q522J3970j5270
12311d9787Q937J6816J3587o695K8313J9152j282o7011l5833q439j0277J3585
12299g8934O4346N7171j0395k0271j6023k7593l8805K1387L1003K1230J1217K5128
12287C9461o376l3436k0473N2485M8721o028l5720n108J0016j8602j315l2862
$$ plain form
12275 -9237 -518 32527 52942 29484 37996 9394 -2543 -18192 -15951 -1358 -8371 -31872 -15687
12262 -15687 11879 9637 -33444 -39981 -25689 8911 11599 -7377 -19717 -49325 -40788 -18880
12250 -18880 -42797 -57627 -70264 -44256 -25897 -37655 -15760 -32484 -35378 -25056 -29885 29182
12238 29182 79629 41743 30768 20135 35641 37763 -172 -8241 -10539 -21560 -57720 -75633
12226 -75633 -48092 -51244 -37586 -21288 -46317 -48276 -9561 16401 -3161 -23581 -4708 -10428
12214 -10428 -21208 -13342 -59333 -68938 -68799 -71583 -49231 -23850 -24058 -44597 -29550 -16849 21204
12201 21204 18068 8447 12905 -7058 -34575 -32096 -50575 -70218 -25753 -22049 2689 -6254 3398
12188 3398 -51253 -70324 -44119 -37329 -79588 -73871 -20699 12647 9964 32637 55192 32011
$$ packed form
12275i237Q719L3045K0415k3458Q512k8602j1937j5649K241J4593p013k3501J6185
12262a5687K7566k242m3081o537J4292L4600K688j8976j2340k9608Q537K1908
12250a8880k3917j4830j2637K6008J8359j1758K1895j6724k894J0322m829N9067
12238B9182N0447l7886j0975j0633J5506K122l7935q069k298j1021l6160j7913
12226g5633K7541l152J3658J6298k5029j959L8715K5962j9562k0420J8873n720
12214a0428j0780P866m5991r605J39k784K2352K5381k08k0539J5047J2701L8053
12201B1204l136r621M458j9963k7517K479j8479j9643M4465L704K4738q943R652
12188C398n4651j9071K6205O790m2259N717N3172L3346k683K2673K2555k3181
$$ plain form
12176 32011 -10951 -75745 -82343 -70469 -75977 -85103 -46992 -39200 -72387 -66439 -41551 -45922 -65378
12163 -65378 -34994 -44169 -55970 -17708 17111 12626 26561 37633 14016 -10120 15605 25901
12151 25901 -53947 -21288 36801 31238 5315 -7233 -5077 21627 54456 36602 37752 30253
12139 30253 9075 -16864 5600 22928 32334 28788 27068 36806 37183 25562 -2442 -2317 5534
12126 5534 15431 41847 60415 69152 58164 -4948 -31491 -15544 2660 -4085 -15877 -16029 -16728
12113 -16728 -9933 -1922 -16713 -13489 -466 29273 64788 60276 21114 -18338 -12088 -3190 -962
12100 -962 9244 -21594 -16606 -4418 -6028 -40118 -50608 -23862 -28852 -26598 -12796 -11223 -39027
12087 -39027 -51430 -54155 -43700 -21738 -19914 12916 -37357 -69078 -42568 -5933 -7603 -23205
$$ packed form
12176C2011m2962o4794o598J1874n508r126L8111P792l3187N948K4888m371j9456
12163f5378L0384r175j1801L8262L4819m485J3935J1072k3617k4136K5725J0296
12151B5901p9848L2659N8089n563k5923j2548K156K6704L2829j7854J150p499
12139C0253k1178k5939K2464J7328R406l546j720R738L77j1621k8004J25P851
12126E534R897K6416J8568Q737j0988o3112k6543J5947J8204o745j1792j52o99
12113a6728O795Q011j4791L224J3023K9739L5515m512l9162l9452O250Q898K228
12100i62J0206l0838M988J2188j610l4090j0490K6746m990K254J3802J573k7804
12087c9027j2403k725J0455K1962J824L2830n0273l1721K6510L6635j670j5602
$$ plain form
12075 -23205 -22067 -6162 -32140 -39795 -13760 27780 23470 -576 5924 50598 84151 55687
12063 55687 50068 28379 11880 12395 -18251 -6064 2797 -64669 -105813 -80961 -17509 -3223
12051 -3223 -8694 -10250 -12452 -29117 -46609 -20312 36849 55371 11695 6726 -18510 -41546 -40045
12038 -40045 -50655 -10536 -39315 -61368 -21827 19659 27876 25525 30977 -636 -2448 14112
12026 14112 38420 19634 4857 -1201 16455 43797 38410 15630 1599 -40914 -46717 -51843
12014 -51843 -51225 -42971 9577 17540 -7173 -20471 -1231 1406 -17301 -44882 -54862 -23319 18775
12001 18775 22603 22984 7832 -11002 -4484 -26618 -43432 -61323 -27598 21242 45994 69301
11989 69301 62851 50845 29452 45397 92947 93129 128845 198030 265233 280327 236162 180164
$$ packed form
12075b3205J138J5905k5978p655K6035M1540m310k4046O500M4674L3553k8464
12063E5687n619k1689j6499N15l0646J2187Q861o7466m1144K4852O3452J4286
12051c223n471j556k202j6665j7492K6297N7161J8522m3676m969k5236k3036J501
12038d0045j0610M0119k8779k2053L9541M1486Q217k351N452l1613j812J6560
12026A4112K4308j8786j4777o058J7656K7342n387k2780j4031m2513n803n126
12014e1843O18Q254N2548P963k4713j3298J9240K637j8707k7581r980L1543M2094
12001A8775L828L81j5152j8834O518k2134j6814j7891L3725M8840K4752K3307
11989F9301o450j2006k1393J5945M7550J82L5716O9185O7203J5094m4165n5998
$$ plain form
11977 180164 148900 98558 108670 100565 73856 42804 69985 55038 50054 33890 43556 58239
11965 58239 49053 17152 -13918 5350 31890 69370 110179 91863 64756 84853 51899 41871
11953 41871 29531 -303 3665 -5759 -8827 -9020 -15304 -8694 13804 48146 66430 69493 75300
11940 75300 70920 71325 66753 48037 28329 -34834 -64137 11154 25873 54245 33520 27859 40273
11927 40273 15061 -25782 -29678 -23654 -39600 -54418 -44394 1599 30856 -31890 -71553 -68885
11915 -68885 -98026 -87874 -36781 36211 37699 17670 4210 -16214 2876 -5528 -15546 -9284
11903 -9284 -5963 1862 25754 -11605 -56037 -66930 -83317 -98348 -87203 -93075 -83759 -62270 -16613
11890 -16613 8999 28041 19347 7815 -22602 -65874 -58103 -33107 16935 11973 -19221 -40943
$$ packed form
11977A80164l1264n0342J0112q105k6709l1052K7181j4947m984j6164R666J4683
11965E8239r186l1901l1070J9268K6540L7480M0809j8316k7107K0097l2954j0028
11953D1871j2340k9834L968r424l068j93o284O610K2498L4342J8284L063N807
11940G5300m380M05m572j8716j9708o3163k9303P5291J4719K8372k0725n661J2414
11927D0273k5212m0843l896O024j5946j4818J0024M5993K9257o2746l9663K668
11915f8885k9141J0152N1093P2992J488k0029j3460k0424J9090q404j0018O262
11903i284L321P825K3892l7359m4432j0893j6387j5031J1145n872R316K1489M5657
11890a6613K5612J9042q694j1532l0417m3272P771K4996N0042m962l1194k1722
$$ plain form
11878 -40943 -41553 -30908 -15255 25035 11300 26585 7060 -2133 -31225 -14132 14211 40720
11866 40720 37384 -27533 -25868 11192 16777 51581 53574 102 -40003 -18085 7540 -16977
11854 -16977 -37127 -40651 -70135 -79984 -56582 15873 35987 55448 25406 -21153 -26629 -55692
11842 -55692 -63853 -60996 -27840 6511 15667 20489 -15587 -13769 -10208 -8701 -13215 -31916 -6918
11829 -6918 13095 24130 26287 25284 -45371 -56319 -28852 -3666 15213 4535 20400 7598
11817 7598 -12133 14329 19495 23131 41706 55817 56451 72862 60680 86344 88572 66444 58879
11804 58879 46536 42146 24164 7245 20195 32651 14813 -12635 -45577 -24553 -1588 14473
11792 14473 -29544 -60426 -61448 -29664 12468 13667 27735 67660 59834 67378 68342 38690 42148
$$ packed form
11878d0943o10J0645J5653M0290j3735J5285j9525r193k9092J7093K8343K6509
11866D0720l336o4917J665L7060N585L4804J993n3472m0105K1918K5625k4517
11854a6977k0150l524k9484r849K3402P2455K0114J9461l0042m6559n476k9063
11842e5692q161K857L3156L4351R156M822l6076J818L561J507m514j8701K4998
11829f918K0013J1035K157j003p0655j0948K7467K5186J8879j0678J5865j2802
11817G598j9731K6462N166L636J8575J4111O34J6411j2182K5664K228k2128p565
11804E8879j2343m390j7982j6919J2950J2456j7838k7448l2942K1024K2965J6061
11792A4473m4017l0882j022L1784M2132J199J4068L9925p826P544R64k9652L458
$$ plain form
11779 42148 90248 78220 49703 46908 73867 56298 13994 -33673 -49211 -37327 -1644 1048
11767 1048 -22385 14161 13164 34899 79630 76310 40468 36741 20185 -681 -741 -2777 8431
11754 8431 -40069 -59581 -31562 -24292 -21809 -5849 -30357 -37540 -7676 -25586 -41375 -53654
11742 -53654 6292 -2501 -35595 -40019 -21648 -25648 -21144 -247 -14187 -5405 -21423 26937 34262
11729 34262 -16261 -38585 -50487 -17602 10632 26443 -14679 -39316 -25006 -34219 -26987 -62912
11717 -62912 -68917 -18882 21762 -24569 -39101 -46033 -62755 -32504 22650 15586 1101 20582
11705 20582 40302 32918 26862 35038 28558 7393 -10120 -37631 -45434 -24722 -29314 7949 14178
11692 14178 -14821 -40850 -25066 -34250 -91741 -94236 -69505 -48559 -18337 -8382 -2670 5675 -47646
$$ packed form
11779D2148M8100j2028k8517k795K6959j7569m2304m7667j5538J1884L5683K692
11767A048k3433L6546r97K1735M4731l320l5842l727j6556k0866o0k036J1208
11754H431m8500j9512K8019P270K483J5960k4508p183K9864j7910j5789j2279
11742e3654N9946q793l3094m424J8371m000M504K0897j3940Q782j6018M8360P325
11729C4262n0523k2324j1902L2885K8234J5811m1122k4637J4310r213P232l5925
11717f2912o005N0035M0644m6331j4532o932j6722L0251N5154p064j4485J9481
11705B0582J9720p384o056Q176o480k1165j7513k7511p803K0712m592L7263O229
11692A4178k8999k6029J5784r184n7491k495K4731K0946L0222R955N712Q345n3321
$$ plain form
11679 -47646 -61697 -42692 -49547 -37118 -50629 -9033 -11393 -13149 32319 12486 -35915 -10690
11667 -10690 -689 39145 76923 46607 -4200 -37684 -13080 -8962 -7241 20368 24609 37212
11655 37212 -5591 -24682 -1511 1433 17116 20625 28367 35007 56737 25443 28321 14708 5218
11642 5218 390 -17444 -33084 -58259 -67606 -41794 -58774 -31906 3241 18066 4958 11998
11630 11998 4417 -15799 -55396 -84781 -55264 -37905 -51385 -55554 -40838 -17162 -68501 -75918
11618 -75918 141 39055 38490 -15586 -36020 -2681 4720 -31394 -25168 -43944 -34195 -13568 10328
11605 10328 -6274 -56130 -54559 -23238 -397 37074 51643 -149 -56986 -8441 20021 -10848
11593 -10848 -13487 -10863 23089 35304 19147 10940 61435 92788 76732 24637 -7521 -20715
$$ packed form
11679d7646j4051J9005o855J2429j3511M1596k360j756M5468j9833m8401K5225
11667a0690J0001L9834L7778l0316n0807l3484K4604M118J721K7609M241J2603
11655C7212m2803j9091K3171K944J5683L509P742O640K1730l1294K878j3613r490
11642E218m828j7834j5640k5175r347K5812j6980K6868L5147J4825j3108P040
11630A1998p581k0216l9597k9385K9517J7359j3480m169J4716K3676n1339p417
11618g5918P6059L8914n65n4076k0434L3339P401l6114O226j8776R749K0627K3896
11605A0328j6602m9856J571L1321K2841L7471J4569n1792n6837M8545K8462l0869
11593a0848k639K624L3952J2215j6157q207N0495L1353j6056n2095l2158j3194
$$ plain form
11581 -20715 -1536 -6493 -30360 -25460 -25529 6014 -14925 -88900 -89055 -8068 -6900 3101 44151
11568 44151 17952 6395 34462 21391 7499 2907 -30123 -12358 -38347 -32062 14570 31138
11556 31138 52845 40649 7149 2723 25162 3456 14387 2882 58645 69353 63001 45619
11544 45619 32650 14557 -39423 -7669 4997 -10545 2661 11064 13827 3979 -9506 -15217
11532 -15217 14186 30046 17329 17535 22920 10143 12721 -14861 -44275 -17448 -12707 -59803 -31067
11519 -31067 48659 43810 37389 31273 30420 5947 -45133 -63993 -47990 -39632 -53357 -46994 -22286
11506 -22286 27052 11594 -14018 -39271 -58142 -22612 21514 25363 13147 21314 63194 81584
11494 81584 77880 49116 21384 39393 45183 45035 5530 -28983 -65780 -56828 -48458 -26986 -30143
$$ packed form
11581b0715J9179m957k3867M900o9L1543k0939p3975j55Q0987J168J0001M1050
11568D4151k6199j1557K8067j3071j3892m592l3030J7765k5989O285M6632J6568
11556C1138K1707j2196l3500m426K2439k1706J0931j1505N5763J0708o352j7382
11544D5619j2969j8093n3980L1754J2666j5542J3206Q403K763r848j3485n711
11532a5217K9403J5860j2717K06N385j2777K578k7582k9414K6827M741m7096K8736
11519c1067P9726m849o421o116q53k4473n1080j8860J6003Q358j3725O363K4708
11506b2286M9338j5458k5612k5253j8871L5530M4126L849j2216Q167M1880J8390
11494H1584l704k8764k7732J8009N790j48l9505l4513l6797Q952Q370K1472l157
$$ plain form
11481 -30143 -15072 31823 24599 1364 -26383 -34504 -14816 6835 19858 -18106 -67643 -45467
11469 -45467 -4479 -3868 -38570 -11275 -2805 -39511 -2194 -29199 -103132 -105174 -81018 -79707 -72297
11456 -72297 -17785 -17543 -22081 -7949 -5768 -4280 -23106 -35160 -40891 -54674 -92785 -99571 -87009
11443 -87009 -106678 -128309 -110212 -95180 -57788 -48387 -48293 -26111 -7707 -2375 1280 -8701 -22744
11430 -22744 -21114 -18025 3586 48292 27608 22141 -3097 14245 538 7741 17477 -15731 -19310
11417 -19310 15796 47394 28474 -10123 -2619 12084 53734 40580 39514 20133 -12193 30327
11405 30327 68729 56206 46087 91014 62784 33923 17846 8128 36370 24442 -19313 -36154
11393 -36154 11843 72268 102694 116351 126019 62972 23047 -26975 -46618 -39371 -10098 12955
$$ packed form
11481c0143J5071M6895p224k3235k7747q121J9688K1651J3023l7964m9537K2176
11469d5467M0988O11l4702K7295Q470l6706L7317k7005p3933k042K4156J311P410
11456g2297N4512K42m538J4132K181J488j8826j2054n731j3783l8111o786J2562
11443h7009j9669k1631J8097J5032L7392R401R4K2182J8404N332L655r981j4043
11430b2744J630L089K1611M4706k0684n467k5238J7342j3707P203R736l3208l579
11417a9310L5106L1598j8920l8597P504J4703M1650j3154j066j9381l2326M2520
11405C0327L8402j2523j0119M4927k8230k8861j6077r718K8242j1928m3755j6841
11393c6154M7997O0425L0426J3657R668o3047l9925n0022j9643P247K9273K3053
$$ plain form
11381 12955 -9006 -24917 -21897 -45106 17561 18644 -33660 -14273 -6329 10335 5501 -30264
11369 -30264 -18408 -6053 -16007 -29985 -60085 -49684 -11967 21898 43410 62740 18443 -6264
11357 -6264 6929 8909 16285 4051 18914 -18797 -52174 -47278 -32762 -4490 24491 37835
11345 37835 26310 16990 -30993 -61298 -49094 -7568 -31694 -30339 3261 58492 72527 57302
11333 57302 21600 -41374 -66676 -31895 1392 16321 10958 1798 -5779 14443 -8522 -3210
11321 -3210 -40778 8943 27710 22333 26731 39336 60807 46931 13696 4928 7893 11055 43867
11308 43867 24834 11059 31799 37714 62929 -438 -32045 34299 73338 70561 62380 31803
11296 31803 38784 69055 36521 -10512 -42354 -33811 -7980 -30432 -67888 -69175 -84230 -56438
$$ packed form
11381A2955k1961j5911L020k3209O2667J083n2304J9387P944J6664m834l5765
11369c0264J1856J2355r954j3978l0100J0401L7717L3865K1512J9330m4297k4707
11357f264J3193J980P376j2234J4863l7711l3377M896J4516K8272K8981J3344
11345C7835j1525r320m7983l0305J2204M1526k4126J355L3600N5231J4035j5225
11333E7302l5702o2974k5302L4781L3287J4929n363r160p577K0222k2965N312
11321c210l7568M9721J8767n377M398J2605K1471j3876l3235q768K965L162L2812
11308D3867j9033j3775K0740N915K5215o3367l1607O6344L9039k777q181l0577
11296C1803O981L0271l2534m7033l1842Q543K5831k2452l7456j287j5055K7792
$$ plain form
11284 -56438 -53647 -62880 -26624 37241 14442 -15587 -48424 -77777 -67451 -44195 -29469 -25540
11272 -25540 -18582 29231 57888 90138 87570 77336 -1491 -53673 -69089 -86962 -81505 -27800
11260 -27800 -14225 -32045 -61685 -81222 -87267 -79057 -92637 -86350 -78075 -46259 -8381 -18966
11248 -18966 -64353 -56299 -35749 -31334 -56911 -46008 -13119 26368 58824 79860 91589 42582
11236 42582 -27168 -71165 -93780 -42871 -25477 26262 51281 9187 -36387 -49107 -57552 -30258
11224 -30258 10202 29800 -1393 -19537 24258 55743 32589 9459 12959 37927 49022 47965
11212 47965 3120 -33642 -29752 -31202 -23018 -4188 3014 -11300 -40501 -42713 12224 39423 29360
11199 29360 6760 -809 -3593 19126 43546 43624 17497 4605 2975 18903 45517 33063 59509
$$ packed form
11284e6438K791r233L6256O3865k2799l0029l2837k9353J0326K3256J4726L929
11272b5540O958M7813K8657L2250k568j0234p8827n2182j5416j7873N457N3705
11260b7800J3575j7820k9640j9537o045Q210j3580O287Q275L1816L7878j0585
11248a8966m5387Q054K0550M415k5577J0903L2889L9487L2456K1036J1729m9007
11236D2582o9750m3997k2615N0909J7394N1739K5019m2094m5574j2720q445K7294
11224c0258M0460J9598l1193j8144M3795L1485k3154k3130L500K4968J1095j057
11212D7965m4845l6762L890j450Q184J8830P202j4314k9201k212N4937K7199j0063
11199B9360k2600p569k784K2719K4420P8k6127j2892j630J5928K6614j2454K6446
$$ plain form
11186 59509 61367 59972 38151 12191 8376 -13592 20931 21540 -24514 -43381 -24783 -13031 6997
11173 6997 -12385 -34287 -12429 29045 29982 24386 851 -13139 -26965 -39642 -62801 -85644
11161 -85644 -58077 -12751 542 -33131 -28129 -43577 -35137 -26600 -54018 -63688 -47528 -66108
11149 -66108 -51348 -40323 -56677 -53790 -40135 -28337 -40901 -22469 -5336 26971 36925 -889
11137 -889 37908 82279 78787 51263 37903 -2260 -26505 -44235 -49848 14228 30876 41174
11125 41174 3488 3598 16649 -9779 -6459 49575 120776 120951 84827 46555 16099 40025 48768
11112 48768 65693 59707 27281 17343 22879 23920 36657 33349 57234 88399 85587 58593 4060
11099 4060 4749 7452 -6593 -31148 -24144 -7881 -16662 -41804 -9456 38842 50954 54112 68410
$$ packed form
11186E9509J858j395k1821k5960l815k1968L4523O09m6054j8867J8598J1752K0028
11173F997j9382k1902K1858M1474R37n596k3535j3990j3826j2677k3159k2843
11161h5644K7567M5326J3293l3673N002j5448Q440Q537k7418r670J6160j8580
11149f6108J4760J1025j6354K887J3655J1798j2564J8432J7133L2307R954l7814
11137h89L8797M4371l492k7524j3360m0163k4245j7730n613O4076J6648J0298
11125D1174l7686J10J3051k6428L320N6034P1201J75l6124l8272l0456K3926Q743
11112D8768J6925n986l2426r938N536J041J2737l308K3885L1165k812k6994n4533
11099D060O89K703j4045k4555P004J6263q781k5142L2348M8298J2112L158J4298
$$ plain form
11086 68410 114146 113170 102892 46892 -7766 -25909 -6097 56437 68960 50087 51512 100799
11074 100799 93494 42076 56159 47476 7747 24092 49756 41491 58322 89255 60698 40691
11062 40691 1784 14226 -6146 -13829 -48246 -37062 -28553 169 34035 33642 14047 -36670
11050 -36670 -46985 -22099 -24778 -39781 -3978 -15752 -75327 -120227 -100738 -44933 -11258 3551
11038 3551 -8805 -7574 -9831 34141 32177 53988 48372 21633 42602 34382 20034 -30860 -63153
11025 -63153 -59439 -25672 -27424 -51328 -21568 8291 6581 37882 46488 2487 -5308 -31182 -52251
11012 -52251 -45920 -34388 -4317 -3666 -6843 -15340 -35789 -9346 -5397 12590 22980 13296 15860
10999 15860 8239 -7811 -21518 -42282 -40540 -43502 -54805 -31528 -20811 15601 -7058 -36367
$$ packed form
11086F8410M5736r76j0278n6000n4658j8143J9812O2534J2523j8873J425M9287
11074A00799p305n1418J4083q683l9729J6345K5664q265J6831L0933k8557k0007
11062D0691l8907J2442k0372p683l4417J1184Q509K8722L3866l93j9595n0717
11050c6670j0315K4886k679j5003L5803j1774n9575m4900J9489N5805L3675J4809
11038C551j2356J231k257M3972j964K1811n616k6739K0969q220j4348n0894l2293
11025f3153L714L3767j752k3904K9760K9859j710L1301Q606m4001p795k5874k1069
11012e2251O331J1532L0071O51l177q497k0449K6443L949J7987J0390r684K564
10999A5860p621j6050j3707k0764J742k962j1303K3277J0717L6412k2659k9309
$$ plain form
10987 -36367 -46465 -39056 -43649 -21383 -9911 -7176 -14236 -4416 -20577 4978 -11216 -1771 -17368
10974 -17368 -30200 -50902 -68802 -55681 -28915 -8532 -9619 -22140 -48575 -53034 -25207 -2395
10962 -2395 -944 -3079 -22774 -14142 -2337 -38179 -70265 -65135 -31844 -41803 -17551 -24952 -59981
10949 -59981 -66377 -40601 -15643 -24268 -33509 -26118 -48717 -55036 -70673 -76255 -82305 -40818 -15871
10936 -15871 -31950 -39487 -16689 262 -16375 -37507 -14995 -13124 -80661 -105096 -98853 -33608
10924 -33608 24810 15188 18462 30136 -7223 -40501 -50004 -30226 -31252 -42257 -66802 -30277
10912 -30277 -1854 25497 13553 -17562 -49944 -45219 5212 18501 4556 -20688 -53468 -48975
10900 -48975 -17578 -5025 28059 48930 33190 27649 35995 20464 10825 -29824 -58616 -17491
$$ packed form
10987c6367j0098P409m593K2266J1472K735p060R820j6161K5555j6194R445j5597
10974a7368j2832k0702j7900J3121K6766K0383j087j2521k6435m459K7827K2812
10962b395J451k135j9695Q632J1805l5842l2086N130L3291r959K4252p401l5029
10949e9981o396K5776K4958q625r241P391k2599o319j5637n582o050M1487K4947
10936a5871j6079p537K2798J6951j6637k1132K2512J871o7537k4435O243O5245
10924c3608N8418r622L274J1674l7359l3278r503J9778j026j1005k4545L6525
10912c0277K8423K7351j1944l1115l2382M725N0431J3289j3945k5244l2780M493
10900d8975L1397J2553L3084K0871j5740n541Q346j5531r639m0649k8792M1125
$$ plain form
10888 -17491 14116 9630 -12483 -72012 -62700 -6516 -3285 -5715 -11335 -53148 -94667 -56183 -34327
10875 -34327 -56173 -94765 -85934 -54082 -5568 -1371 -28744 -15732 19121 40409 46618 75977
10863 75977 59679 50088 45472 44950 85448 16638 -5970 -7391 -70365 -73349 -108381 -66493 -18651
10850 -18651 -48389 -53616 -55407 -8229 1005 -58712 -66496 -38045 -70997 -100780 -83865 -27638
10838 -27638 -5678 -27005 -60002 -38797 -25699 -41860 -58983 -18885 -12195 -42760 -15371 4428
10826 4428 6447 -7555 -18039 -4043 -23402 -49906 -38411 -4363 -17792 -55514 -34660 -47431
10814 -47431 -67325 -47891 -56370 -69137 -37008 -32789 1892 -14398 -66646 -73689 -43723 -8710
10802 -8710 -9701 7273 15606 -14161 30766 50679 28579 13361 -11763 -31575 -39717 -33813 -16615
$$ packed form
10888a7491L1607m486k2113n9529R312N6184L231k430n620m1813m1519L8484K1856
10875c4327k1846l8592Q831L1852M8514M197k7373J3012L4853K1288O209K9359
10863G5977j6298r591m616n22M0498o8810k2608j421o2974k984l5032M1888M7842
10850a8651k9738n227j791M7178R234n9717p784K8451l2952k9783J6915N6227
10838b7638K1960k1327l2997K1205J3098j6161j7123M0098O690l0565K7389J9799
10826D428K019j4002j0484J3996j9359k6504J1495L4048j3429l7722K0854j2771
10814d7431j9894J9434q479j2767L2129M219L4681j6290n2248p043K9966L5013
10802h710r91J6974Q333k9767M4927J9913k2100j5218k5124j9812q142N904J7198
$$ plain form
10789 -16615 -30395 -50566 -75049 -53082 -54542 -67681 -48363 -14734 8699 23742 -31790 -119999
10777 -119999 -131720 -107925 -50412 -35762 -13655 -884 -17360 -27014 -10325 13155 19718 13093
10765 13093 -11518 -16552 -3415 458 -6503 -18660 12837 10064 -2265 -7200 -29768 -18472 -15395
10752 -15395 -47128 -32962 -47819 -73727 -69062 -43661 -60938 -70209 -67122 -49398 -87007 -81797
10740 -81797 -15014 19015 -10193 -47779 -51695 -13317 10598 14224 24913 38411 35191 -8467
10728 -8467 -42142 -7653 16606 -24565 -34493 -16865 18345 55968 39668 -16961 -41121 -46496
10716 -46496 -58281 -35830 -27371 -7932 -3185 -6675 18625 31530 -3936 -39060 -11124 -13019
10704 -13019 -27614 -37639 -25445 -27502 -88651 -109593 -71252 1575 52677 71875 45100 -2374
$$ packed form
10789a6615j3780k0171k4483K1967j460j3139J9318L3629K3433J5043n5532q8209
10777a19999j1721K3795N7513J4650K2107J2771j6476r654J6689K3480O563o625
10765A3093k4611n034J3137L873o961j2157L1497k773j2329m935k2568J1296L077
10752a5395l1733J4166j4857k5908M665K5401j7277r271L087J7724l7609N210
10740h1797O6783L4029k9208l7586l916L8378K3915L626J0689J3498l220m3658
10728h467l3675L4489K4259m1171r928J7628L5210L7623j6300n6629k4160n375
10716d6496j1785K2451Q459J9439M747l490K5300J2905l5466l5124K7936j895
10704a3019j4595j0025J2194k057o1149k0942L8341P2827N1102J9198k6775m7474
$$ plain form
10692 -2374 -26060 6683 41972 35142 8030 13400 49854 50787 57164 47221 29255 32499 56620
10679 56620 48143 4062 -33874 -46028 -28647 -57113 -44365 4446 44469 52673 79771 100556
10667 100556 83686 96441 49477 -2620 -17056 -44346 -68293 -52304 -21256 26207 60794
10656 60794 25085 -830 8693 -3736 36076 55352 45842 31276 23916 54759 90853 52365
10644 52365 47130 77437 72153 69042 71393 54548 31905 31129 -1283 -57667 -61306 -59684 -41502
10631 -41502 -13366 -4669 16176 -5847 -7464 -18784 -34448 9728 29854 51119 66558 77577
10619 77577 26420 -14668 -38537 -40747 -35464 -29573 -47133 -80543 -27897 4401 4838 -9733 32245
10606 32245 11404 -43695 -66056 -60863 -59307 -34315 -37925 -24943 -19847 -13872 -60685 -62014 -34337
$$ packed form
10692b374k3686L2743L5289o830k7112N370L6454R33O377r943j7966L244K4121
10679E6620q477m4081l7936j2154J7381k8466J2748M8811M0023Q204K7098K0785
10667A00556j6870J2755m6964n2097j4436k7290k3947J5989L1048M7463L4587
10656F0794l5709k5915R523j2429L9812J9276r510j4566p360L0843L6094l8488
10644E2365n235L0307n284l111K351j6845k2643p76l2412n6384l639J622J8182
10631d1502K8136Q697K0845k2023j617j1320j5664M4176K0126K1265J5439J1019
10619G7577n1157m1088k3869k210N283N891j7560l3410N2646L2298M37j4571M1978
10606C2245k0841n5099k2361N193J556K4992l610J2982N096N975m6813j329K7677
$$ plain form
10593 -34337 -2030 -12645 -11857 -20719 -1353 31487 42873 4338 15868 15442 -5705 91 33704
10580 33704 1136 -2656 -50668 -67717 -70471 -108452 -108447 -67693 -65432 -67062 -63244 -57304 -18065 -19846
10566 -19846 -44273 -21594 -28533 -52502 -30697 -29614 -38811 -80756 -105613 -45239 -44090 -42356 -35335
10553 -35335 -50897 -64345 -110579 -108806 -76261 -62286 -79547 -81403 -27113 -19441 -7803 25118
10541 25118 42681 37629 19711 3772 -33178 17390 56385 21625 4542 37801 281 -35400
10529 -35400 -7429 9901 -16504 -22801 -41843 -16636 -3424 -19615 -45700 -32529 -37834 -83326
10517 -83326 -66919 -55326 -54605 -19981 4766 10379 -5452 4492 11681 -10412 -3543 16172 5339
10504 5339 -36766 -44019 21360 35545 9397 30157 53095 48314 66329 33578 41811 2867
$$ packed form
10593c4337L2307j0615P88q862J9366L2840J1386l8535J1530m26k1147N796L3613
10580C3704l2568l792m8012j7049k754l7981NM0754K261j630L818N940L9239j781
10566a9846k4427K2679o939k3969K1805J083r197m1945k4857O0374J149J734P021
10553c5335j5562j3448m6234J773L2545J3975j7261j856N4290P672J1638L2921
10541B5118J7563n052j7918j5939l6950N0568L8995l4760j7083L3259l7520l5681
10529c5400K7971J7330k6405o297j9042K5207J3212j6191k6085J3171n305m5492
10517h3326J6407J1593P21L4624K4747N613j5831R944P189k2093O869J9715j0833
10504E339m2105p253O5379J4185k6148K0760K2938m781J8015l2751Q233l8944
$$ plain form
10492 2867 -60789 -46303 -18296 -7826 -19029 -22584 -15575 -12362 -6043 4982 -7064 -15207 -34111
10479 -34111 -66709 -101947 -81704 -71151 -94188 -71671 -68781 -68517 -67800 -67619 -36240 -25495 -62811
10466 -62811 -67425 -52796 -48096 -1680 25116 1624 6317 1111 -19867 -14211 -23556 -48279 13785
10453 13785 7834 9654 23966 3207 2812 -13854 -10065 -6833 -6708 -6461 -31239 -33770 -15832 30748
10439 30748 39275 44512 25134 48667 73581 28577 1796 324 16374 35466 40608 33891 62740
10426 62740 45551 -17749 -96061 -86036 -24725 31767 55895 39443 -17343 -31709 -42316 -98067
10414 -98067 -157301 -124461 -59425 -26845 -39147 -43328 -28529 -32628 -60292 -72190 -91951 -111119
10402 -111119 -90090 -52878 -52362 -59349 -12247 29301 3529 -21352 -15243 1498 -18541 574
$$ packed form
10492B867o3656J4486K8007J0470j1203l555P009L213O319J1025j2046q143j8904
10479c4111l2598l5238K0243J0553k3037K2517K890K64P17J81L1379J0745l7316
10466f2811m614J4629M700M6416K6796k3492M693n206k0978N656r345k4723O2064
10453A3785n951J820J4312k0759l95j6666L789L232J25K47k4778k531J7938M6580
10439C0748Q527N237j9378K3533K4914m5004k6781j472J6050J9092N142o717K8849
10426F2740j7189o3300p8312J0025O1311N6492K4128j6452n6786j4366j0607n5751
10414i8067n9234L2840O5036L2580j2302m181J4799m099k7664j1898j9761j9168
10402a11119K1029L7212N16o987M7102M1548k5772k4881O109J6741k0039J9115
$$ plain form
10390 574 -25 -4422 475 -20216 -35582 -32075 -41563 -48322 -45398 -26877 -46043 -22042 -20131 -54108
10376 -54108 -57466 -78316 -61782 -14616 24071 37436 31534 46259 49119 47982 7383 -45218
10364 -45218 -80802 -58353 -44384 -11351 10716 24460 18657 -22960 -48174 -61063 2315 13195
10352 13195 -14557 -6930 -7090 -34765 -51544 -41964 -59308 -36190 -32840 -51207 -26207 -20157 -29985
10339 -29985 -19348 9066 -29873 -68899 -55405 -39107 -1031 12319 5152 -3091 6541 42722
10327 42722 57714 34902 -716 8276 8568 3857 -29534 -1967 26690 2157 -2677 1675 -19187
10314 -19187 -3187 -9846 24608 60189 36231 13735 49406 52781 26577 -17974 -61094 -66432
10302 -66432 -80693 -90776 -85389 -79571 -36716 -293 -37722 -30583 -11576 -34640 -30959 -21371 -36685
$$ packed form
10390E74n99m397M897k0691j5366L507r488o759K924J8521j9166K4001J911l3977
10376e4108l358k0850J6534M7166L8687J3365n902J4725K860j137m0599n2601
10364d5218l5584K2449J3969L3033K2067J3744n803m1617k5214j2889O3378J0880
10352A3195k7752P627j60k7675j6779R580j7344K3118L350j8367K5000O050r828
10339b9985J0637K8414l8939l9026J3494J6298L8076J3350p167q243R632L6181
10327D2722J4992k2812l5618Q992K92m711l3391K7567K8657k4533m834M352k0862
10314a9187J6000o659L4454L5581k3958k2496L5671L375k6204m4551m3120n338
10302f6432j4261j0083N387N818M2855L6423l7429P139J9007k3064L681R588j5314
$$ plain form
10289 -36685 -33525 -42713 -71195 -55352 -59547 -81026 -38449 -6579 199 -6669 24709 7321 8976
10276 8976 3411 -9712 -8323 -3326 13237 51175 64516 76013 79494 103197 121569 100712 65048
10263 65048 27148 -18434 -23813 6643 38783 50581 52393 57365 15054 27178 57052 69873
10251 69873 40041 33318 106748 135612 102524 39258 12914 53358 115647 98017 40809 -29377
10239 -29377 -42412 -32438 -38912 -66843 -65765 -57805 -46936 -58505 -3163 -12735 -49143 -59716 -50727
10226 -50727 6524 33616 5941 16647 5216 15041 -9563 -51059 -39974 -45385 -14151 -40496
10214 -40496 -26697 -13959 -17298 -23812 -1644 29426 9404 -3352 -32610 -12143 15197 1344
10202 1344 -29877 -72190 -31152 -23094 -35480 5300 26439 29412 61268 79472 35278 -14649
$$ packed form
10289c6685L160r188k8482J5843m195k1479M2577L1870O778o868L1378j7388J655
10276H976n565j3123J389M997J6563L7938J3341J1497L481K3703J8372k0857l5664
10263F5048l7900m5582n379L0456L2140J1798J812M972m2311J2124K9874J2821
10251F9873k9832o723P3430K8864l3088o3266k6344M0444O2289j7630n7208p0186
10239b9377j3035R974o474k7931J078P960J0869j1569N5342r572l6408j0573Q989
10226e0727N7251K7092k7675J0706j1431R825k4604m1496J1085n411L1234k6345
10214d0496J3799J2738l339o514K2168L1070k0022j2756k9258K0467K7340j3853
10202A344l1221m2313M1038Q058j2386M0780K1139K973L1856J8204m4194m9927
$$ plain form
10190 -14649 -15491 1145 -15356 7352 53364 81355 44866 46496 77755 55838 9951 9267 5027
10177 5027 19237 40812 47894 35042 4645 -2571 1689 -34358 -33762 -24411 -12226 -17966 3902
10164 3902 -5745 5501 -2314 5814 21028 30808 20109 -13447 -16449 -21694 -38847 -27505 -7941
10151 -7941 14344 26734 -2928 -45860 -61554 -31756 36006 67580 33926 -18033 -71201 -61571
10139 -61571 -29271 -16441 -4873 16893 6494 5302 26923 2750 -41920 -61008 -10440 -11861
10127 -11861 -48000 -44342 -29537 18481 40843 32886 56628 41617 36042 37668 36900 55535 58396
10114 58396 31659 15079 30529 24219 -2690 -56944 -45386 -26100 -34176 -54901 -55037 -32187
10102 -32187 -42906 -65458 -37189 -44359 -47929 -47563 -10249 -18740 -11579 -37324 -31418 -30420 -31444 -58341
$$ packed form
10190a4649q42J6636j6501K2708M6012K7991l6489J630L1259k1917m5887o84m240
10177E027J4210K1575P082j2852l0397p216M260l6047N96R351J2185n740K1868
10164C902r647J1246p815Q128J5214R780j0699l3556l002n245j7153J1342J9564
10151g941K2285J2390k9662m2932j5694K9798O7762L1574l3654n1959n3168R630
10139f1571L2300J2830J1568K1766j0399j192K1621k4173m4670j9088N0568j421
10127a1861l6139L658J4805M8018K2362p957K3742j5011n575J626p68J8635K861
10114E8396k6737j6580J5450o310k6909n4254J1558J9286q076k0725j36K2850
10102c2187j0719k2552K8269p170l570L66L7314q491P161k5745N906R98j024k6897
$$ plain form
10088 -58341 -21806 19034 16068 -18045 6337 47361 53242 19843 -5316 -10225 -4831 14499
10076 14499 21699 33975 7557 -15493 -14315 -11946 -26931 -20539 -59360 -26803 2092 -21022
10064 -21022 -35010 -13270 8646 7935 6624 9088 23641 30996 33152 -14773 -33567 -33632 7897
10051 7897 51757 40540 -13163 -20 -4439 -485 10390 -13111 -144 -44304 -37001 -16178
10039 -16178 -42128 -52640 -53996 -22809 -12971 922 -29467 -32655 16835 17729 -3110 16068 15255
10026 15255 -16635 -42555 -19604 289 -16571 -29728 2532 -7725 -12396 -19370 6180 3384
10014 3384 -16111 -39127 -24429 -7990 -54184 -77395 -40265 2772 6149 8380 -8188 -52394
10002 -52394 -72884 -36764 -46287 -72383 -43141 5111 16625 -14299 -51299 -33423 -29126 -43655
$$ packed form
10088e8341L6535M0840k966l4113K4382M1024N881l3399k5159m909N394J9330
10076A4499P200J2276k6418k3050J178K369j4985O392l8821L2557K8895k3114
10064b1022j3988K1740K1916p11j311K464J4553P355K156m7925j8794o5M1529
10051G897M3860j1217n3703J3143m419L954J0875k3501J2967m4160P303K0823
10039a6178k5950j0512j356L1187R838J3893l0389l188M9490Q94k0839J9178q13
10026A5255l1890k5920K2951J9893j6860j3157L2260j0257m671o974K5550k796
10014C384j9495k3016J4698J6439m6194k3211L7130M3037L377K231j6568m4206
10002e2394k0490L6120r523k6096K9242M8252J1514l0924l7000J7876M297j4529
$$ plain form
9990 -43655 -31620 -63891 -18903 9373 8753 2408 11759 36259 51063 36462 13260 46426 66625
9977 66625 54633 31659 16709 12929 -21915 -33647 6905 48511 53448 75015 110770 174168
9965 174168 255782 324495 414083 469422 472412 412767 327705 229335 194910 169826 153019 181221
9953 181221 164656 155834 161739 171800 196195 219877 245712 329166 546735 869083 1026927
9942 1026927 805714 568953 431827 354196 261292 224800 217500 159971 111142 111233 153099 160983
9930 160983 163144 133580 86098 62198 66216 70666 62797 35091 15097 52444 66719 54138
9918 54138 22625 -10716 1884 20894 16699 8830 38817 84157 110905 97624 71480 32479
9906 32479 23920 31785 30598 28234 35859 16971 57872 86187 65663 52849 34212 27341 39149
$$ packed form
9990d3655J2035l2271M4988K8276o20o345R351K4500J4804j4601k3202L3166K0199
9977F6625j1992k2974j4950l780l4844j1732M0552M1606M937K1567L5755O3398
9965A74168Q1614O8713Q9588N5339K990n9645q5062r8370l4425k5084j6807K8202
9953A81221j6565q822N905J0061K4395K3682K5835Q3454K17569L22348J57844
9942A026927k21213k36761j37126p7631r2904l6492p300n7529m8829R1M1866P884
9930A60983K161k9564m7482k3900M018M450p869k7706j9994L7347J4275j2581
9918E4138l1513l3341J2600J9010m195p869K9987M5340K6748j3281k6144l9001
9906C2479q559P865j187k364P625j8888M0901K8315k0524j2814j8637o871J1808
$$ plain form
9893 39149 35800 21407 29405 30259 13235 13535 42330 28956 36449 12483 15361 29676 25237 48308
9879 48308 75891 53362 45765 32917 58185 121122 209316 353010 464973 492238 442593 362951
9867 362951 303416 278281 204891 159520 141885 109754 87401 101470 82399 95569 82311 33224
9855 33224 40973 95589 128080 99327 66525 58926 62292 79011 71197 62491 90028 74844 90458
9842 90458 85042 77880 41345 65386 62141 89584 95624 65247 55124 34201 23014 27 -11804
9829 -11804 2450 16074 15788 -9866 -17492 301 15852 -113 397 9016 -13240 18887 23200
9816 23200 26805 -10695 -5312 10120 42843 9930 -26699 -39235 -24260 -20348 -30207 -29084 -21724
9803 -21724 1960 11066 14709 21069 -4909 -6498 6369 -57969 -60438 -59452 -60855 -40982 -17880
$$ packed form
9893C9149l349j4393P998Q54j7024L00K8795j3374P493k3966K878J4315m439K3071
9879D8308K7583k2529p597j2848K5268O2937Q8194J43694J11963K7265m9645p9642
9867C62951n9535k5135p3390m5371j7635l2131k2353J4069j9071J3170j3258m9087
9855C3224P749N4616L2491k8753l2802p599L366J6719p814q706K7537j5184J5614
9842I0458n416p162l6535K4041l245K7443O040l0377j0123k0923j1187k2987j1831
9829a1804J4254J3624k86k5654p626J7793J5551j5965N10Q619k2256L2127M313
9816B3200L605l7500N383J5432L2723l2913l6629j2536J4975L912r859J123P360
9803b1724K3684R106L643O360k5978j589J2867o4338k469R86j403J9873K3102
$$ plain form
9790 -17880 -15924 -29704 -63300 -77206 -48476 -27620 -9177 35602 55407 36904 31305 10204
9778 10204 -4777 39193 41892 44871 64781 59045 59961 27789 3139 -8082 10408 -768 55339
9765 55339 35152 -26909 -29296 -1101 15227 54383 111430 117805 118107 84750 91584 118696 63366
9752 63366 27729 6896 22615 29820 13131 17913 31302 56631 90309 61458 6963 3142
9740 3142 -192 -11694 4246 38989 35545 -5488 -26659 -29759 8302 42799 169 -13541 -21060
9727 -21060 -1492 -18181 -58740 -80681 -59372 -38449 4905 20151 -22456 -81440 -45689 -14708
9715 -14708 -35156 -52232 -84022 -55555 -15987 6977 -37081 -39686 -5710 37522 28669 -30590
9703 -30590 -25089 4187 -10985 -38694 -29343 -43364 -52609 -68817 -45650 16712 60247 59512 71817
$$ packed form
9790a7880J956j3780l3596j3906K8730K0856J8443M4779J9805j8503n599k1101
9778A0204j4981M3970K699K979J9910n736R16l2172k4650j1221J8490j1176N6107
9765E5339k0187o2061k387K8195J6328L9156N7047O375L02l3357O834K7112n5330
9752F3366l5637k0833J5719P205j6689M782J3389K5329L3678k8851n4495l821
9740C142l334j1502J5940L4743l444m1033k1171l100L8061L4497m2630j3710p519
9727b1060J9568j6689m0559k1941K1309K0923M3354J5246m2607n8984L5751L0981
9715a4708k0448j7076l1790K8467L9568K2964m4058k605L3976M3232q853n9259
9703c0590N501K9276j5172k7709R351j4021r245j6208K3167O2362M3535p35J2305
$$ plain form
9690 71817 92610 76446 61819 21464 3058 14957 21077 2491 -1566 10182 -17523 -40871
9678 -40871 -23097 -38024 -39403 -26154 -24062 1872 31056 11530 31846 40158 27579 24052 33828
9665 33828 7760 15278 -5463 1517 13608 59206 78858 58955 41449 21404 5690 -5705
9653 -5705 3197 33150 68321 59618 43218 34640 5536 10714 7829 13087 20143 21904 3672 -17687
9639 -17687 -46931 -19684 23570 44876 6902 -21108 9511 27826 17825 24663 67181 40942
9627 40942 24962 56940 55011 92605 86504 27669 13091 14038 -7430 3438 20701 37923 34554
9614 34554 15936 24006 30834 -8303 10308 62336 52728 18097 29289 41528 -4226 -37077
9602 -37077 -38564 -4211 11363 18871 -31809 -74286 -50574 -27729 -18645 17439 19025 5223 23561
$$ packed form
9690G1817K0793j6164j4627m0355j8406J1899O120j8586m057J1748k7705k3348
9678d0871J7774j4927j379J3249K092K5934K9184j9526K0316Q312j2579l527R776
9665C3828k6068P518k0741O980J2091M5598J9652j9903j7506k0045j5714j1395
9653e705Q902K9953L5171q703j6400q578k9104N178k885N258P056J761j8232k1359
9639a7687k9244K7247M3254K1306l7974k8010L0619J8315j0001O838M2518k6239
9627D0942j5980L1978j929L7594o101n8835j4578R47k1468J0868J7263J7222l369
9614C4554j8618Q070O828l9137J8611N2028r608l4631J1192J2239m5754l2851
9602c7077j487L4353J5574P508n0680m2477K3712K2845R084L6084J586j3802J8338
$$ plain form
9589 23561 16455 56622 64356 37874 20340 22796 19111 8154 -17723 -41913 -37721 -18170 1667
9576 1667 66125 94810 73698 24564 39458 68899 59544 33618 34510 25804 9331 23300 16284
9563 16284 -8348 -16817 -13187 -26278 6759 39361 23373 13544 41207 16778 -21521 -23985 13262
9550 13262 56778 70088 91374 83753 53403 70754 125764 120869 88941 40163 80247 114772
9538 114772 77724 93799 73215 83562 86473 53164 36806 47714 49771 95222 102457 86394
9526 86394 79288 108611 82159 91369 88098 52734 17434 23057 49231 59357 57529 49243 67670
9513 67670 68581 54869 79094 75858 79717 107225 62766 3075 -7408 42230 76808 65240 80231
9500 80231 64124 41806 22028 46341 93078 80794 55277 29243 31497 27411 -4205 -15978
$$ packed form
9589B3561p106M0167P734k6482j7534K456l685j0957k5877k4190M192J9551J9837
9576A667O4458K8685k1112m9134J4894K9441r355k5926Q92q706j6473J3969p016
9563A6284k4632q469L630j3091L3037L2602j5988r829K7663k4429l8299k464L7247
9550A3262M3516J3310K1286p621l0350J7351N5010m895l1928m8778M0084L4525
9538A14772l7048J6075k0584J0347K911l3309j6358J0908K057M5451P235j6063
9526H6394p106K9323k6452R210l271l5364l5300N623K6174J0126j828q286J8427
9513F7670R11j3712K4225l236L859K7508m4459n9691j0483M9638L4578j1568J4991
9500H0231j6107k2318j9778K4313M6737j2284k5517k6034K254m086l1616j1773
$$ plain form
9488 -15978 43169 112856 141216 161988 123863 100723 106155 88481 82243 69529 74372 80958 93839
9475 93839 93142 95907 48737 22619 33850 23537 42293 82681 55075 37896 85870 56892
9463 56892 34316 45472 49268 83164 112412 80132 101835 152958 136051 101915 60128 54520
9451 54520 62970 63598 54876 37213 51231 66688 91729 81414 105869 119159 86171 51927 37862
9438 37862 34357 43958 97270 92347 81042 69172 70122 83153 99464 91461 101062 105484 108807 133508
9424 133508 146667 154555 147640 103282 66686 110422 109351 104278 75828 88771 121785 146389
9412 146389 132104 165413 123391 105103 83579 72267 124816 98750 97573 101328 66197 32220
9400 32220 4915 -9726 31590 61361 54668 82553 111753 130527 149689 142202 151595 177676
$$ packed form
9488a5978N9147O9687K8360K0772l8125k3140N432j7674o238j2714M843O586J2881
9475I3839o97K765m7170k6118J1231j0313J8756M0388k7606j7179M7974k8978
9463E6892k2576J1156L796L3896K9248l2280K1703N1123j6907l4136m1787n608
9451E4520Q450O28q722j7663J4018J5457K5041j0315K4455J3290l2988l4244j4065
9438C7862l505R601N3312m923j1305j1870R50J3031J6311q003R601M422L323K4701
9424A33508J3159P888o915m4358l6596M3736j071n073k8450J2943L3014K4604
9412A46389j4285L3309m2022j8288k1524j1312N2549k6066j177L755l5131l3977
9400C2220k7305j4641M1316K9771o693K7885K9200J8774J9162p487R393K6081
$$ plain form
9388 177676 192348 197329 140800 99357 86421 66443 50802 47941 83650 100218 114851 118216
9376 118216 90184 75452 113701 137624 144118 126387 141988 176016 194772 167991 160847 163164
9364 163164 181024 202955 208613 226792 236720 233319 203514 179271 209913 216426 191671 221439
9352 221439 252648 279113 264025 207074 180741 236192 256611 206368 132038 149465 147558 132186
9340 132186 168288 218825 239513 253493 212478 166085 163553 170693 188571 228357 238956 229813
9328 229813 213720 204618 193886 185268 196043 212845 235808 278250 322700 314930 322761 303876
9316 303876 284515 283204 300005 297842 293772 296266 309688 362479 387590 376872 369757 359077 372537
9303 372537 404659 428445 437692 439303 428348 439846 421905 440683 441366 412554 406041 397768 432713
$$ packed form
9388A77676J4672M981n6529m1443j2936j9978j5641k861L5709J6568J4633L365
9376A18216k8032j4732L8249K3923O494j7731J5601L4028J8756k6781p144K317
9364A63164J7860K1931N658J8179R928l401k9805k4243L0642O513k4755K9768
9352B21439L1209K6465j5088n6951k6333N5451K0419n0243p4330J7427j907j5372
9340A32186L6102N0537K0688J3980m1015m6393k532P140J7878L9786J0599r143
9328B29813j6093r102j0732q618J0775J6802K2963M2442M4450p770P831j8885
9316C03876j9361j311J6801k163m070K494J3422N2791K5111j0718p115j0680J3460
9303C72537L2122K3786R247J611j0955J1498j7941J8778O83k8812o513q273L4945
$$ plain form
9290 432713 468033 481203 522813 527939 498036 459342 454704 526499 545563 565205 595341 576720
9278 576720 556006 537401 540048 585035 637144 638350 645209 684364 676311 699828 701179 705779 750579
9265 750579 762572 743167 735899 729935 731636 789064 834972 847982 871706 870394 884495 906785
9253 906785 898017 901792 925996 985124 1041244 1036223 1095454 1168377 1145827 1134962 1181451 1244539
9241 1244539 1332171 1321839 1332583 1346786 1340430 1377178 1426536 1449752 1497478 1526465 1572280 1635624
9229 1635624 1708906 1768146 1762055 1778969 1804467 1837948 1853747 1866644 1941359 1998834 2043578 2090042
9217 2090042 2136778 2136316 2110696 2105043 2142311 2168528 2192901 2211156 2218174 2250907 2285740 2303222
9205 2303222 2320366 2339158 2321634 2325393 2377683 2365710 2321694 2282324 2272772 2247103 2222298 2218223
$$ packed form
9290D32713L5320J3170M1610N126k9903l8694m638P1795J9064J9642L0136j8621
9278E76720k0714j8605K647M4987N2109J206O859L9155q053K3517J351M600M4800
9265G50579J1993j9405p268n964J701N7428M5908J3010K3724j312J4101K2290
9253I06785q768L775K4204N9128N6120n021N9231P2923k2550j0865M6489O3088
9241A244539Q7632j0332J0744J4203o356L6748M9358K3216M7726K8987M5815O3344
9229A635624P3282N9240o091J6914K5498L3481J5799J2897P4715N7475M4744M6464
9217B090042M6736m62k5620n653L7268K6217K4373J8255P018L2733L4833J7482
9205B303222J7144J8792j7524L759N2290j1973m4016l9370r552k5669k4805m075
$$ plain form
9193 2218223 2184519 2122438 2156590 2185684 2141450 2079892 2047276 2009668 1995206 1991344 1977727 1935697
9181 1935697 1880610 1854930 1827909 1796275 1760202 1741432 1725269 1668383 1620302 1582350 1542052
9170 1542052 1451180 1411940 1394417 1415412 1430552 1397150 1345499 1310730 1306573 1314599 1263639 1163195
9158 1163195 1114494 1083921 1061110 1025526 1000792 985089 964881 964496 977611 924431 892610 918223
9146 918223 872956 845374 838698 834168 855192 836460 755386 693291 678922 701436 701371 669027 621044
9133 621044 631055 634444 610618 593619 603367 595258 588804 560918 485654 464446 471667 508110 554503
9120 554503 539584 527953 501084 505062 521497 542148 528096 505426 523895 487977 503120 506219
9108 506219 511640 470528 402292 374915 368167 370429 380060 400020 393250 333812 295394 325284 394364
$$ packed form
9193B218223l3704o2081L4152K9094m4234o1558l2616l7608j4462l862j3617m2030
9181A935697n5087k5680k7021l1634l6073j8770j6163n6886m8081l7952m0298
9170A542052r0872l9240j7523K0995J5140l3402n1651l4769m157Q026n0960j00444
9158A163195m8701l0573k2811l5584k4734j5703k0208l85J3115n3180l1821K5613
9146I18223m5267k7582o676m530K1024j8732q1074o2095j4369K2514o5l2344m7983
9133F21044J0011L389k3826j6999R748q109o454k7886p5264k1208P221L6443M6393
9120E54503j4919j1631k6869L978J6435K0651j4052k2670J8469l5918J5143L099
9108E06219N421m1112o8236k7377o748K262R631J9960o770n9438l8418K9890O9080
$$ plain form
9095 394364 378601 404312 434798 408738 360590 311678 256008 230159 268410 264783 228767 234246
9083 234246 254716 236953 226904 266510 253841 233862 235284 198840 178877 176157 244400 314623
9071 314623 349085 307752 245006 252710 250610 219759 210581 199808 175866 170163 152368 173618
9059 173618 153011 140587 162086 206235 209291 197751 160635 140906 146750 147097 149826 180282 201261
9046 201261 217224 180515 126209 130240 172343 179038 201705 172242 135724 138556 142978 145203 133293
9033 133293 119054 120228 136533 140842 125097 122379 149693 168021 152275 158009 195495 203877 166801
9020 166801 137275 137619 148586 93251 100268 113274 110956 120347 157171 134367 108393 61529 40965
9007 40965 16251 50933 64171 79384 75011 60507 32798 33814 53527 8372 32609 57082
$$ packed form
9095C94364j5763K5711L0486k6060m8148m8912n5670k5849L8251l627l6016N479
9083B34246K0470j7763j0049L9606j2669j9979J422l6444j9963k720O8243P0223
9071C14623L4462m1333o2746P704k100l0851r178j0773k3942n703j7795K1250
9059A73618k0607j2424K1499M4149L056j1540l7116j9729N844L47K729L0456K0979
9046B01261J5963l6709n4306M031M2103O695K2667k9463l6518K832M422K225j1910
9033A33293j4239J174J6305M309j5745k718K7314J8328j5746N734L7486Q382l7076
9020A66801k9526L44J0967n5335P017J3006k318R391L6824k2804k5974m6864k0564
9007D0965k4714L4682J3238J5213m373j4504k7709J016J9713m5155K4237K4473
$$ plain form
8995 57082 61811 83825 80400 68439 52795 34809 87510 118577 105087 92093 81568 61194
8983 61194 72599 65079 41389 90849 117283 105329 76084 48938 23169 41340 62446 66776
8971 66776 73713 38382 -29010 -46333 -14417 8152 22028 -1191 -13683 -7733 31742 79073
8959 79073 94222 77414 89424 68912 63553 43743 71471 73672 17156 -3435 64576 114898
8947 114898 82832 76550 43787 -27007 7533 17837 13959 57140 79591 71128 43294 -3010
8935 -3010 -13737 -22673 22682 25513 23402 15278 9288 31862 83684 113595 101270 41388 4477
8922 4477 17106 7165 43451 37230 31345 54425 73623 52252 2583 -600 26155 68594 71014
8909 71014 51234 41353 54925 51948 39346 39359 46466 78215 71093 38211 17111 23295 17509 7458
$$ packed form
8995E7082M729K2014l425j1961j5644j7986N2701L1067j3490j2994j0525k0374
8983F1194J1405p520k3690M9460K6434j1954k9245k7146k5769J8171K1106M330
8971F6776O937l5331o7392j7323L1916K2569J3876k3219j2492N950L9475M7331
8959G9073J5149j6808J2010k0512n359j9810K7728K201n6516k0591O8011N0322
8947A14898l2066o282l2763p0794L4540J0304l878M3181K2451q463k7834m6304
8935c010j0727q936M5355K831k111q124n990K2574N1822K9911j2325n9882l6911
8922D477J2629r941L6286o221n885K3080J9198k1371m9669l183K6755M2439K420
8909G1014j9780r881J3572k977j2602J3P107L1749p122l2882k1100O184n786j0051
$$ plain form
8895 7458 10267 8739 14765 45458 31113 22408 29427 51861 59167 58062 62416 76531 54471 47932
8881 47932 93360 95050 83684 61079 22439 21783 8353 -28079 1698 -22489 16485 92742
8869 92742 87872 -1436 -44921 -28429 -25863 -33204 -11808 -2065 4532 28330 21144 19755 12013
8856 12013 7907 -13009 -3712 7165 -18225 -32544 -25818 -26320 -11554 37707 63173 58907 9123
8843 9123 -11555 1515 6714 24177 89500 87665 20163 22362 16749 4807 42643 88917 97989
8830 97989 105696 96194 119693 73295 -3688 -24376 -15126 6377 23633 80436 47545 69883
8818 69883 48776 55377 38238 8303 26159 -6041 9976 15327 6694 -6548 -9651 -16249 -2441
8805 -2441 28919 28755 6929 10661 45942 63473 57380 43359 -5918 -2111 -1283 634 15860 37803
$$ packed form
8895G458K809j528O026L0693j4345q705P019K2434P306j105M354J4115k2060o539
8881D7932M5428J690j1366k2605l8640o56j3430l6432K9777k4187L8974P6257
8869I2742m870q9308m3485J6492K566p341K1396R743O597K3798p186j389p742
8856A2013m106k0916R297J0877k5390j4319O726n02J4766M9261K5466m266m9784
8843I123k0678J3070N199J7463O5323j835o7502K199n613j1942L7836M6274R072
8830I7989P707r502K3499m6398p6983k0688R250K1503J7256N6803l2891K2338
8818F9883k1107O601j7139k9935J7856l2200J6017N351q633j3242l103o598J3808
8805b441L1360j64k1826L732L5281J7531o093j4021m9277L807Q28J917J5226K1943
$$ plain form
8791 37803 85279 103400 90540 60934 50362 43511 10374 17472 34462 -3501 -31613 -19727
8779 -19727 -18123 2714 7019 85 -35406 -62454 -12474 35764 45886 27274 35982 5753 -22906
8766 -22906 -10900 4786 -35531 -26807 -23739 -44565 -40583 10672 31104 14727 52987 21193
8754 21193 4880 -52909 -97494 -56073 -15458 -35852 -42550 -19446 -10195 -9392 20659 52578 45243
8741 45243 49555 51617 48489 9602 -11362 -41226 -22811 33248 75262 105760 111431 77139 70783
8728 70783 61678 27031 16891 11142 34472 23708 -10731 14814 46209 67295 60745 14013
8716 14013 -24416 -10600 -4528 -1815 -1727 -16043 -9958 17012 39114 11860 -147 32651 35874
8703 35874 32232 39850 71331 71017 61835 29526 -17467 -15021 1513 -57739 -60320 1343 26042
$$ packed form
8791C7803M7476J8121j2860k9606j0572o851l3137P098J6990l7963k8112J1886
8779a9727J604K0837M305o934l5491k7048M9980M8238J0122j8612Q708l0229k8659
8766b2906J2006J5686m0317Q724L068k0826L982N1255K0432j6377L8260l1794
8754B1193j6313n7789m4585M1421M0615k0394o698K3104R251Q03L0051L1919p335
8741D5243M312K062l128l8887k0964k9864J8415N6059M2014L0498N671l4292o356
8728G0783r105l4647j0140n749K3330j0764l4439K5545L1395K1086o550m6732
8716A4013l8429J3816O072K713Q8j4316O085K6970K2102k7254j2007L2798L223
8703C5874l642P618L1481l14r182l2309m6993K446J6534n9252k581O1663K4699
$$ plain form
8690 26042 17735 -6488 -27394 -24220 431 -8720 26561 80104 97051 89475 57160 27802 34925
8677 34925 52438 63642 66133 66140 20308 36401 57198 45111 19120 14711 41647 65740 67888
8664 67888 61857 52061 72036 91194 46989 16166 33442 50945 55421 58885 49716 54406 39727
8651 39727 1105 12274 -21109 -63650 -69708 -53906 -47369 -46525 -25007 -12837 -5336 -19203 21308
8638 21308 18669 -1239 34739 82115 79244 28003 1807 1064 21373 30445 44015 21145 39602
8625 39602 42960 22374 1324 4789 34400 65291 65192 79068 48265 46385 28431 40131 65668
8612 65668 65552 64056 54964 21165 5067 14358 69489 61479 50435 55220 65216 29680 19748 24455
8598 24455 46702 100228 152250 121783 102690 70375 57428 49970 63072 44464 23236 31872
$$ packed form
8690B6042q307k4223k0906L174K4651r151L5281N3543J6947p576l2315k9358P123
8677C4925J7513J1204K491Pm5832J6093K0797j2087k5991m409K6936K4093K148
8664F7888o031r796J9975J9158m4205l0823J7276J7503M476L464r169M690j4679
8651C9727l8622J1169l3383m2541o058J5802O537Q44K1518J2170P501j3867M0511
8638B1308k639j9908L5978M7376k871n1241k6196p43K0309R072J3570k2870J8457
8625C9602L358k0586k1050L465K9611L0891r9J3876l0803j880j7954J1700K5537
8612F5668j16j496r092l3799j6098R291N5131q010j1044M785R996l5536r932M707
8598B4455K2247N3526N2022l0467j9093l2315j2947p458J3102j8608k1228Q636
$$ plain form
8586 31872 84433 105388 97108 66231 33275 31798 39302 24107 -9338 -11581 23227 12048 29848
8573 29848 32550 -24043 -41651 -46459 -45223 -34558 16678 11840 -17671 18081 15979 5397 11513
8560 11513 1345 -50428 -53732 -14134 -11927 -24835 -59913 -99161 -100198 -93725 -71801 -46762 -34807
8547 -34807 -24188 654 7240 23441 20122 40833 45835 26221 -16806 -43933 -59702 -54622 -67362
8534 -67362 -149102 -129573 -56110 -18659 8506 9041 5850 40168 25139 -18610 -39704 -40597 -25547
8521 -25547 -23030 -22131 -3002 -11835 -21390 7297 31531 40870 17160 16104 54926 78176 48777
8508 48777 58636 72603 91393 79680 48884 11893 2725 -9530 2310 26941 19495 67549
8496 67549 84424 54998 56990 45201 -15530 -47841 -32418 1025 13771 2138 -11914 -31247
$$ packed form
8586C1872N2561K0955q280l0877l2956j477P504j5195l3445k243L4808j1179J7800
8573B9848K702n6593j7608m808J236J0665N1236m838k9511L5752k102j0582O116
8560A1513j0168n1773l304L9598K207j2908l5078l9248j037O473K1924K5039J1955
8547c4807J0619K4842O586J6201l319K0711N002j9614m3027k7127j5769N080j2740
8534f7362q1740J9529P3463L7451K7165N35l191L4318j5029m3749k1094q93J5050
8521b5547K517Q99J9129q833r555K8687K4234R339k3710j056L8822K3250k9399
8508D8777R859J3967J8790j1713l0796l6991r168j2255J1840K4631p446M8054
8496F7549J6875k9426J992j1789o0731l2311J5423L3443J2746j1633j4052j9333
$$ plain form
8484 -31247 -35883 -24774 6749 36389 31184 24726 17046 37196 66614 25290 12829 14742 27183
8471 27183 47437 97817 91329 56734 42606 34109 24151 19949 32258 41589 15483 11030 29238
8458 29238 32203 45838 12036 -21489 -15568 -16014 -17698 -20581 5321 60378 80025 9018 1295
8445 1295 -5894 -2484 -7055 -5801 -5132 10845 8634 -27995 -24043 -31410 -31305 -26737 -28497 -1351 29088
8430 29088 1862 12863 3436 6857 -8291 2804 17113 26965 40957 26387 2426 10007 23894
8417 23894 27388 28625 3145 -26908 -76165 -46261 -3349 -8601 -7024 -6876 2331 38711 70419
8404 70419 74263 83342 96355 93025 78809 70867 63366 57056 26303 -17557 -3567 -34720 -45362
8391 -45362 -79764 -66651 -65247 -11649 22178 32305 33413 40206 35244 32117 -2737 -4757 15965
$$ packed form
8484c1247m636J1109L1523K9640n205o458p680K0150K9418m1324j2461J913J2441
8471B7183K0254N0380o488l4595j4128q497r958m202J2309R331k6106m453J8208
8458B9238K965J3635l3802l3525N921m46j684k883K5902N5057J9647p1007p723
8445A295p189L410m571J254O69J5977k211l6629L952p367J05M568j760K7146L0439
8430B9088k7226J1001r427L421j5148J1095J4309R852J3992j4570k3961P581J3887
8417B3894L494J237k5480l0053m9257K9904M2912n252J577J48R207L6380L1708
8404G0419L844R079J3013l330j4216p942p501o310l0753m3860J3990l1153j0642
8391d5362l4402J3113J404N3598L3827J0127J108O793m962l127l4854k020K0722
$$ plain form
8378 15965 28251 48707 56693 58082 -5258 -29638 -19036 -42129 -23536 -1875 -7373 -7022 -15506
8365 -15506 -2934 5622 -30687 -48649 -56298 -17049 -1317 3674 28609 23199 18245 19477 149
8352 149 20446 19741 -20084 -14342 -32541 -34211 -9332 9895 25286 30037 54221 33382 25248
8339 25248 35965 67150 43828 36587 9402 -29935 -5343 47759 40644 -5258 -40696 -56367
8327 -56367 -32457 -11503 -32139 -3660 16485 32251 12392 -8625 -6238 10643 3358 -43680
8315 -43680 -84326 -77710 -29712 -896 7969 -4727 23131 -4914 3901 13354 18615 6 -9088
8302 -9088 -7205 15174 38020 22590 13454 37996 31037 21963 26668 39519 29654 6676 -22107
8289 -22107 -11812 12779 -2515 -9749 -3444 3067 -16140 -46917 -42856 -25284 22890 39982 53314
$$ packed form
8378A5965J2286K0456P986J389o3340k4380J0602k3093J8593K1661n498L51q484
8365a5506J2572Q556l6309j7962p649L9249J5732M991K4935n410m954J232j9328
8352A49K0297p05l9825N742j8199j670K4879J9227J5391M751K4184k0839q134
8339B5248J0717L1185k3322p241k7185l9337K4592N3102p115m5902l5438j5671
8327e6367K3910K0954k0636K8479K0145J5766j9859k1017K387J6881p285m7038
8315d3680m0646O616M7998K8816Q865j2696K7858k8045Q815R453N261j8609r094
8302i088J883K2379K2846j5430r136K4542o959r074M705J2851r865k2978k8783
8289b2107J0295K4591j5294p234O305O511j9207l0777M061J7572M8174J7092J3332
$$ plain form
8276 53314 62270 32527 18028 22652 24310 19769 -17262 -37594 -46775 -18639 10242 12493 -20864
8263 -20864 -21529 2548 -4013 -41883 -38910 -8722 -12574 -29903 -15123 -33088 -41574 -41422 -50229 -31939
$$ packed form
8276E3314Q956k9743j4499M624J658m541l7031k0332r181K8136K8881K251l3357
8263b0864o65K4077o561l7870K973L0188l852j7329J4780j7965q486J52q807J8290
$$ [...]
##END NTUPLES=NMR SPECTRUM
##END=
