##TITLE=Analysis number 315227
Compound Code mo 00842
Book Reference 2
Project Code adrs
Chemist Name stores
##JCAMPDX= 6.0         $$ Bruker NMR JCAMP-DX V2.0
##DATA TYPE= NMR SPECTRUM
##DATA CLASS= NTUPLES
##ORIGIN= Bruker BioSpin GmbH
##OWNER= NMR
$$ XWIN-NMR		Version 3.5
$$ Fri Nov 11 13:44:43 2005 GMT Standard Time (UT+0h)  MAYBRIDGE\NMR@NMR_250MHZ
##.OBSERVE FREQUENCY= 250.131544655141
##.OBSERVE NUCLEUS= ^1H
##.ACQUISITION MODE= SIMULTANEOUS (DQD)
##.ACQUISITION SCHEME= undefined
##.AVERAGES= 16
##.DIGITISER RES= 18
##SPECTROMETER/DATA SYSTEM= dpx250
##.PULSE SEQUENCE= zg30
##.SOLVENT NAME= DMSO
##.SHIFT REFERENCE= (INTERNAL, DMSO, 0, 16.522)
##AUDIT TRAIL= $$ (NUMBER, WHEN, WHO, WHERE, WHAT)
$$ ##TITLE= Audit trail, XWIN-NMR		Version 3.5
$$ ##JCAMPDX= 5.01
$$ ##ORIGIN= Bruker BioSpin GmbH
$$ ##OWNER= NMR
$$ C:\u/data/dgb/nmr/ADRS/12260/pdata/1/auditp.txt
$$ ##AUDIT TRAIL=  $$ (NUMBER, WHEN, WHO, WHERE, WHAT)
(   1,<2005-11-11 13:43:52.75 +000>,<MAYBRIDGE\NMR>,<NMR_250MHZ>,
      <created by zg, POWCHK disabled, PULCHK disabled
       configuration hash MD5:
       62 19 C7 07 E1 42 D1 B7 37 6C 3D D0 77 39 F9 E6
       data hash MD5: 64K
       FA 37 2D CF D5 5F 3E 15 85 83 3B 93 97 5A F2 6A>)
(   2,<2005-11-11 13:44:12.78 +000>,<MAYBRIDGE\NMR>,<NMR_250MHZ>,
      <Start of raw data processing
       ef LB = 0.3 FT_mod = 6 PKNL = 1 SI = 32K 
       data hash MD5: 32K
       BF 48 36 98 42 9B 94 63 E6 E0 B4 82 DF FE 3C 0F>)
(   3,<2005-11-11 13:44:16.12 +000>,<MAYBRIDGE\NMR>,<NMR_250MHZ>,
      <apk 
       data hash MD5: 32K
       FF 5B 14 23 59 35 79 57 4F 0F 78 9A 32 1F 62 1E>)
(   4,<2005-11-11 13:44:17.62 +000>,<MAYBRIDGE\NMR>,<NMR_250MHZ>,
      <abs ABSG = 5 
       data hash MD5: 32K
       7F CD 44 A9 9E 4E DA 01 22 06 57 12 CD 40 7D 63>)
$$ ##END=
$$ 
$$ hash MD5
$$ 33 6D 1E DC 04 DC C5 10 F6 EE EA AE 2D 2F 21 4E
##$RELAX= 
##$RELAX= 
##$RELAX= 
##$RELAX= 
##$RELAX= 
##$RELAX= 
##$RELAX= 
$$ Bruker specific parameters
$$ --------------------------
##$DU= <C:\u>
##$EXPNO= 12260
##$NAME= <ADRS>
##$PROCNO= 1
##$TYPE= <nmr>
##$USER= <dgb>
##$AMP= (0..31)
100 100 100 100 100 100 100 100 100 100 100 100 100 100 100 100 100 100 
100 100 100 100 100 100 100 100 100 100 100 100 100 100 
##$AQSEQ= 0
##$AQ_mod= 3
##$AUNM= <au_zg>
##$AUTOPOS= <27 >
##$BF1= 250.13
##$BF2= 250.13
##$BF3= 250.13
##$BF4= 250.13
##$BF5= 500.13
##$BF6= 500.13
##$BF7= 500.13
##$BF8= 500.13
##$BYTORDA= 1
##$CFDGTYP= 0
##$CFRGTYP= 5
##$CHEMSTR= <none>
##$CNST= (0..31)
1 1 145 1 1 1 1 1 1 1 1 1 1 1 1 1 1 1 1 1 1 1 1 1 1 1 1 1 1 1 1 1 
##$CPDPRG= <>
##$CPDPRG1= <>
##$CPDPRG2= <>
##$CPDPRG3= <>
##$CPDPRG4= <mlev>
##$CPDPRG5= <mlev>
##$CPDPRG6= <mlev>
##$CPDPRG7= <mlev>
##$CPDPRG8= <mlev>
##$CPDPRGB= <>
##$CPDPRGT= <>
##$D= (0..31)
0 1 0 0 0 0 0 0 0 0.06 0 0 0 0 0 0 0.0002 0 0 0 0 0 0 0 0 0 0 0 0 0 0 
0 
##$DATE= 1131716631
##$DBL= (0..7)
120 120 120 120 120 120 120 120 
##$DBP= (0..7)
150 150 150 150 150 150 150 150 
##$DBP07= 0
##$DBPNAM0= <>
##$DBPNAM1= <>
$$ [...]
##$SUBNAM7= <"">
##$SUBNAM8= <"">
##$SUBNAM9= <"">
##$SW= 20.6930455092707
##$SWIBOX= (0..15)
0 0 3 0 0 0 0 0 0 0 0 0 0 0 0 0 
##$SW_h= 5175.983436853
##$TD= 65536
##$TD0= 1
##$TE= 295.16
##$TE2= 300
##$TE3= 300
##$TEG= 300
##$TL= (0..7)
0 120 120 120 120 120 120 120 
##$TP= (0..7)
150 150 150 150 150 150 150 150 
##$TP07= 0
##$TPNAME0= <>
##$TPNAME1= <>
##$TPNAME2= <>
##$TPNAME3= <>
##$TPNAME4= <>
##$TPNAME5= <>
##$TPNAME6= <>
##$TPNAME7= <>
##$TPOAL= (0..7)
0.5 0.5 0.5 0.5 0.5 0.5 0.5 0.5 
##$TPOFFS= (0..7)
0 0 0 0 0 0 0 0 
##$TUNHIN= 0
##$TUNHOUT= 0
##$TUNXOUT= 0
##$USERA1= <user>
##$USERA2= <user>
##$USERA3= <user>
##$USERA4= <user>
##$USERA5= <user>
##$V9= 5
##$VALIST= <valist>
##$VCLIST= <CCCCCCCCCCCCCCC>
##$VD= 0
##$VDLIST= <DDDDDDDDDDDDDDD>
##$VPLIST= <PPPPPPPPPPPPPPP>
##$VTLIST= <TTTTTTTTTTTTTTT>
##$WBST= 1024
##$WBSW= 4
##$XGAIN= (0..3)
0 0 0 0 
##$XL= 0
##$YL= 0
##$YMAX_a= 559021
##$YMIN_a= -358868
##$ZGOPTNS= <>
##$ZL1= 120
##$ZL2= 120
##$ZL3= 120
##$ZL4= 120
##$ABSF1= 16.522
##$ABSF2= -4.171173
##$ABSG= 5
##$ABSL= 3
##$ALPHA= 0
##$AQORDER= 0
##$ASSFAC= 0
##$ASSFACI= 0
##$ASSFACX= 0
##$ASSWID= 0
##$AUNMP= <proc_1d>
##$AZFE= 0.1
##$AZFW= 0.1
##$BCFW= 0
##$BC_mod= 0
##$BYTORDP= 0
##$COROFFS= 0
##$CY= 12.5
##$DATMOD= 1
##$DC= 0
##$DFILT= <>
##$DTYPP= 0
##$F1P= 14.0000005364418
##$F2P= -0.99999901652339
##$FCOR= 0.5
##$FTSIZE= 32768
##$FT_mod= 6
##$GAMMA= 0
##$GB= 0
##$INTBC= 1
##$INTSCL= 1
##$ISEN= 128
##$LB= 0.3
##$LEV0= 0
##$LPBIN= 0
##$MAXI= 10000
##$MC2= 0
##$MEAN= 0
##$ME_mod= 0
##$MI= 0
##$NCOEF= 0
##$NC_proc= -5
##$NLEV= 6
##$NOISF1= 0
##$NOISF2= 0
##$NSP= 0
##$NTH_PI= 0
##$NZP= 0
##$OFFSET= 16.522
##$PC= 1
##$PHC0= 65.78291
##$PHC1= 13.31117
##$PH_mod= 1
##$PKNL= yes
##$PPARMOD= 0
##$PSCAL= 4
##$PSIGN= 0
##$REVERSE= no
##$SF= 250.13
##$SI= 32768
##$SIGF1= 0
##$SIGF2= 0
##$SINO= 400
##$SIOLD= 32768
##$SREGLST= <1H.DMSO>
##$SSB= 0
##$STSI= 32768
##$STSR= 0
##$SW_p= 5175.98343685301
##$SYMM= 0
##$S_DEV= 0
##$TDeff= 65536
##$TDoff= 0
##$TI= <Analysis number 999999
Compound Code 99
Book Reference 9
Project Code 9>
##$TILT= no
##$TM1= 0
##$TM2= 0
##$TOPLEV= 0
##$USERP1= <user>
##$USERP2= <user>
##$USERP3= <user>
##$USERP4= <user>
##$USERP5= <user>
##$WDW= 1
##$XDIM= 32768
##$YMAX_p= 419399563
##$YMIN_p= -692842
$$ End of Bruker specific parameters
$$ ---------------------------------
##NTUPLES= NMR SPECTRUM
##VAR_NAME=  FREQUENCY,     SPECTRUM/REAL,   SPECTRUM/IMAG
##SYMBOL=    X,             R,               I
##VAR_TYPE=  INDEPENDENT,   DEPENDENT,       DEPENDENT
##VAR_FORM=  AFFN,          ASDF,            ASDF
##VAR_DIM=   32768,         32768,           32768
##UNITS=     HZ,            ARBITRARY UNITS, ARBITRARY UNITS
##FACTOR=    0.157963299565203, 1,           1
##FIRST=     4132.6476996994, 0,             0
##LAST=      -1043.33573715361, 0,           0
##MIN=       -1043.33573715361, -692842,     0
##MAX=       4132.6476996994, 419399563,     0
$$ Real data points
##PAGE= N=1
##DATA TABLE= (X++(R..R)), XYDATA
$$ [...]
19556A226040N5907r8225j9741j64773l3622O5342j20285J098N1941p6170m9182
19545H38330J5970j7462K5775J29810O9996n0662Q032J03149J19242l8045r0647
19534A113488N2277n7864j9691Q2225P1103o7794q80J35000R8688n117j21033
19523A280402M1672q0845l6910K0925K2204N3879j73618j0665J84980J58024K42281
19512A702329m1308k31708q9688l6743M4056j11124k13639p0663J9589J03685
19502A074786k8242O5022Q1224N3627J33137n6892K1221N2608j9551j63618j00110
19491A113212R3423P9855J33323L2012K6473r376M3713q7723j14314P252J14521
19480A432371P69K5032P0273m842j25820O7826R6833r4498Q869K6284k4082k5643
$$ y = [1226040, 1281947, 1183722, 1163981, 999208, 965586, 1030928, 910643, 911741, 963682, 887512, 838330, 854300, 836838, 862613, 992423, 1062419, 1011757, 1019789, 1122938, 1242180, 1204135, 1113488, 1165765, 1107901, 1088210, 1170435, 1241538, 1173744, 1172864, 1307864, 1406552, 1401435, 1280402, 1322074, 1241229, 1204319, 1225244, 1247448, 1301327, 1127709, 1117044, 1302024, 1460048, 1702329, 1661021, 1429313, 1339625, 1302882, 1346938, 1235814, 1022175, 951512, 971101, 1074786, 1046544, 1111566, 1192790, 1246417, 1379554, 1322662, 1343883, 1396491, 1376940, 1213322, 1113212, 1206635, 1286490, 1419813, 1451825, 1478298, 1468922, 1512635, 1424912, 1310598, 1317850, 1432371, 1433140, 1458172, 1528445, 1523603, 1397783, 1465609, 1562442, 1467944, 1476813, 1503097, 1479015, 1453372]
19468A453372J7848l4792K7858N8365L9125O4901r6720q7796K3591J69793K0742
19457A656287r9818l6135J11899o455l7079O8844o6828j0270M4541N7504o4076
19446A618414Q5419k4809k01478L616J21348m5076L8475R933K1519J37997L11456
19435B076814J52146j05991k55360j09495J8173M8847R4173J61142j6314J6231
19425B080366P6339J95060q2250q2594k7963q1444M6675k5635j284Q656j71478
19414A934448l8055R7063L5606j27694j637K41316M2649O6248J7960j9613O3144
19403B311435p6154N040Q5886O5078P3981j49207j53563J27359J17681n1627R1642
19392B447551J31876R5648J9852j48835k063q3914m0052J43001j9091j54936o9089
$$ y = [1453372, 1471220, 1436428, 1464286, 1522651, 1561776, 1626677, 1529957, 1442161, 1465752, 1635545, 1656287, 1556469, 1520334, 1632233, 1625778, 1588699, 1657543, 1590715, 1580445, 1624986, 1682490, 1618414, 1703833, 1679024, 1477546, 1481162, 1602510, 1557434, 1595909, 1605842, 1627361, 1765358, 2076814, 2228960, 2122969, 1867609, 1758114, 1776287, 1825134, 1919307, 2080449, 2064135, 2080366, 2156705, 2351765, 2269515, 2186921, 2158958, 2077514, 2124189, 2098554, 2097270, 2105926, 1934448, 1896393, 1993456, 2029062, 1901368, 1899731, 2141047, 2183696, 2249944, 2267904, 2248291, 2311435, 2235281, 2240321, 2326207, 2391285, 2465266, 2316059, 2162496, 2289855, 2407536, 2355909, 2447551, 2579427, 2675075, 2694927, 2546092, 2544029, 2460115, 2420063, 2563064, 2543973, 2389037, 2319948]
19381B319948J75915J41413n2243K7272J69584J21151m194N342m452l9574o1084
19370B799078M2615O5803J97026Q446J480O2794J04585N5514m7254J00706J37907
19359C528700q8379k10408P1264O6292J97645J64683j5239l1135M6088r5055O9397
19348C703853M9126Q8062O8169J72259J04255M2834p0978l3964N8813K9668O2679
19337D274776J08530M7075N052n45j64463J25389K93972K06187r554j17592P3862
19326D842689J33540j29886n5495K16070P3099m8738p1237k7165K07277K23086
19316E363240j8616j595j85180P6920R3146K78021K33327J11859K05349J40537
19306F297008J88111r33K6022K21985m5660K0988J91701P1505j2012k9044O9477
$$ y = [2319948, 2495863, 2637276, 2585033, 2612305, 2781889, 2903040, 2898846, 2904188, 2899736, 2860162, 2799078, 2841693, 2907496, 3104522, 3112968, 3114448, 3177242, 3281827, 3337341, 3290087, 3390793, 3528700, 3440321, 3229913, 3301177, 3367469, 3565114, 3729797, 3714558, 3683423, 3729511, 3634456, 3703853, 3752979, 3841041, 3909210, 4081469, 4185724, 4228558, 4157580, 4123616, 4182429, 4212097, 4274776, 4383306, 4430381, 4435433, 4434888, 4270425, 4395814, 4689786, 4895973, 4886419, 4768827, 4842689, 4976229, 4846343, 4790848, 5006918, 5080017, 5031279, 4960042, 4932877, 5140154, 5363240, 5344624, 5343029, 5157849, 5234769, 5327915, 5605936, 5839263, 5951122, 6156471, 6297008, 6485119, 6484186, 6510208, 6732193, 6686533, 6707521, 6899222, 6970727, 6958715, 6929671, 6999148]
19295F999148J52922P9731l6692K46172J86322n3995O6612J83390Q19k877J33979
19284G955531J66882J15240J96375M0614R3393K15681K22973K68894J45886r396
19274I412073J30873J17435K25310J58562J83858l0758M4594O6172K12382L36936
19264A0857437K95759q5803L0289J07782J63181J02477j03J63948K15262J15813
19254A1966042J0326Q4994K36694J34575J66794K63886J91445M2752J45786K74883
19244A3518177J41792j4738j04685R0994J65890J56309J27925K88720k8138j9362
19234A4322884J30509j15368m8065K17128K79218L15912K35473J10170P2672N3522
19224A5574055j64959n3323J79577Q2274M6249R3526m292j07079j40811J89247
$$ y = [6999148, 7152070, 7231801, 7195109, 7441281, 7627603, 7573608, 7640220, 7823610, 7824429, 7821552, 7955531, 8122413, 8237653, 8434028, 8474642, 8568035, 8783716, 9006689, 9275583, 9421469, 9412073, 9542946, 9660381, 9885691, 10044253, 10228111, 10197353, 10241947, 10308119, 10520501, 10857437, 11153196, 11067393, 11097682, 11205464, 11368645, 11471122, 11471019, 11634967, 11850229, 11966042, 11976368, 12061362, 12298056, 12432631, 12599425, 12863311, 13054756, 13097508, 13243294, 13518177, 13659969, 13645231, 13540546, 13631540, 13797430, 13953739, 14081664, 14370384, 14342246, 14322884, 14453393, 14338025, 14289960, 14507088, 14786306, 15102218, 15337691, 15447861, 15520533, 15574055, 15409096, 15355773, 15535350, 15617624, 15663873, 15757399, 15753107, 15646028, 15505217, 15694464]
19214A5694464J41362m2371L1291N2650J47750n2276m05529k37538J42387L5124
19204A5507314m7767j49321r8759p5808j05185Q1227r8373O9343J1342r7131k14204
19193A4782678j56933o3356r1554j18719P640o5472j62699j98469j60132j40958
19183A3632026k07441L9864j41099j12632k35356k68418j56156r7953r964K6629
19173A2469500j1761k04742j60038O408j16860m09597j01862j26840j98074n0639
19163A1095495j33154r7633k9108p1092k63407k49532j66342r1412j26939j04144
19153I762732j39813n0207k01551j14981n5920k24597j51671n8798j27653l4050
19143H603491j56349j51461p7764j19341r9264j35406n6537j67763k07204o9023
$$ y = [15694464, 15835826, 15793455, 15824746, 15877396, 16025146, 15972870, 15567341, 15329803, 15472190, 15507314, 15459547, 15310226, 15211467, 15135659, 15030474, 15111701, 15013328, 15082671, 15094013, 14996882, 14782678, 14625745, 14562389, 14470835, 14352116, 14359756, 14294284, 14131585, 13933116, 13772984, 13632026, 13424585, 13464449, 13323350, 13210718, 12975362, 12706944, 12550788, 12452835, 12442871, 12469500, 12457739, 12252997, 12092959, 12099367, 11982507, 11572910, 11471048, 11344208, 11146134, 11095495, 10962341, 10864708, 10835600, 10764508, 10501101, 10251569, 10085227, 9993815, 9866876, 9762732, 9622919, 9572712, 9371161, 9256180, 9200260, 8975663, 8823992, 8765194, 8637541, 8603491, 8447142, 8295681, 8217917, 8098576, 7999312, 7863906, 7807369, 7639606, 7432402, 7363379]
19133G363379R0283K0970o1866j49182j86655k05674M4855n3690k00770j34279
19123F527371j34452k7127k8113q9779j23357q7434N1334p352k10660j07932J105
19112E763604J85648m5017q6463p5552l24651j36653p8358J00525j14075j31150
19102E057858q4652n7743j3140K2994r1389o1848o0455N1099l3397o5157m5769
19091D618401j635q8027j19165r392m4654o971j8434l7279j17903n3258j23689
19080C997994J04750l8939o9572O1927l2375j52396j18325R044l7696k6999j6535
19069C680878n4341p0245l2618M809k8690m4431O7578J7810N9065n560j48372
19058C445883l11921j00798p5270p7123r4455m2424K18357J13341L6336J39554
$$ y = [7363379, 7453662, 7474632, 7412766, 7263584, 7076929, 6871255, 6916110, 6862420, 6661650, 6527371, 6392919, 6365792, 6337679, 6247900, 6124543, 6037109, 6088443, 6081091, 5870431, 5762499, 5763604, 5949252, 5904235, 5817772, 5742220, 5417569, 5280916, 5202558, 5303083, 5189008, 5057858, 4973206, 4915463, 4902323, 4925317, 4833928, 4772080, 4711625, 4762724, 4729327, 4664170, 4618401, 4616766, 4528739, 4409574, 4400182, 4355528, 4348557, 4330123, 4292844, 4174941, 4121683, 3997994, 4102744, 4063805, 3994233, 4056160, 4023785, 3871389, 3753064, 3762108, 3724412, 3697413, 3680878, 3626537, 3556292, 3523674, 3528483, 3499793, 3455362, 3522940, 3540750, 3599815, 3594255, 3445883, 3133962, 3033164, 2957894, 2880771, 2786316, 2743892, 2962249, 3075590, 3111926, 3251480]
19048C251480j8576r7086o9689j969k85468k38420J7620o3155k7989J58646J60781
19037B786175J04683j5527j36505l1232M6025q1072N5853m4811R0745O0870j9365
19026B815839J4384l182o6177r5285J27928L6149j17885j09783J9993n1001j38747
19015B432233r0375J3860O949j54837P8978j7048p6116J2246n7633l713J83005
19004B327549K7323j04908j16178l7007N4819Q9876k9712L6699M1786j43766o2406
18993B084075j49685Q0226J36895r9225j03397n4561M5275K9290J0339K92520
18983B271752J82976j63393j60789N0863j42632K7480n78q6926j33397l0740m8927
18972A765689j25271j6622J04538J38436J75755J0667q5655Q473j69972q3696
$$ y = [3251480, 3232904, 3135818, 3066129, 3064160, 2778692, 2540272, 2557892, 2494737, 2466748, 2625394, 2786175, 2890858, 2875331, 2738826, 2707594, 2753619, 2672547, 2728400, 2683589, 2774334, 2835204, 2815839, 2830223, 2827041, 2760864, 2665579, 2793507, 2829656, 2711771, 2601988, 2621981, 2570980, 2432233, 2341858, 2355718, 2362667, 2207830, 2286808, 2269760, 2193644, 2205890, 2148257, 2144544, 2327549, 2354872, 2249964, 2133786, 2096779, 2151598, 2241474, 2211762, 2248461, 2290247, 2146481, 2084075, 1934390, 2014616, 2151511, 2052286, 1948889, 1894328, 1939603, 1968893, 1979232, 2271752, 2454728, 2291335, 2130546, 2181409, 2038777, 2066257, 2065679, 1978753, 1845356, 1814616, 1765689, 1640418, 1623796, 1728334, 1866770, 2042525, 2053192, 1967537, 1976010, 1806038, 1722342]
18962A722342J02751K8204J1168n2443K5642R9807J7059j55034j12782J21003
18952A807717K2772J74874J34543J8862r2879m3441M0085J13871k2123j00596
18942B053685J5784Q2090q1910L0968l2382J9592l0138k7680m5667Q8817Q3769
18931B156928p9405O0666K485P7521j13652K6000J28975k5180m9280j48872j31229
18920A904957J12165N4427q8768q4442R7657J3673n0431l1161J09341k1900J01208
18909B116726j13797j86382o3894R5776o216J64032Q0679N033N7177K9839K04895
18898B383868L13236J38266k44613k08346J35927R8904J25048p091m8717n1372
18888B635110o2207k2541n2489K19362L3370k92124J04833j98477k26674j2393
$$ y = [1722342, 1825093, 1853297, 1864465, 1812022, 1837664, 1937471, 1954530, 1799496, 1686714, 1807717, 1830489, 2005363, 2139906, 2158768, 2065889, 2022448, 2062533, 2176404, 2154281, 2053685, 2069469, 2151559, 2069649, 2100617, 2068235, 2087827, 2057689, 2030009, 1984342, 2073159, 2156928, 2077523, 2138189, 2140674, 2218195, 2104543, 2130543, 2259518, 2234338, 2185058, 2036186, 1904957, 2017122, 2071549, 1982781, 1898339, 1995996, 2009669, 1959238, 1928077, 2037418, 2015518, 2116726, 2002929, 1816547, 1752653, 1848429, 1842213, 2006245, 2086924, 2091957, 2149134, 2178973, 2383868, 2697104, 2835370, 2590757, 2382411, 2518338, 2617242, 2742290, 2735199, 2686482, 2635110, 2572903, 2550362, 2497873, 2717235, 2750605, 2458481, 2563314, 2364837, 2138163, 2125770]
18878B125770o6091M1973o7161k02735j08257n7484j8608J56938J32085q4872
18868A851558p2014J36222O7089J84847J2820k20906Q5943M0715R4108M6978J32061
18857B359421J55464J31518J14802K66242L92165K09338P6993J62992q2028k76108
18847C510799k07381q9210j97467k36892r689M9227r3418n7537j84800q2118J98793
18836B600307k6518j45703m0201k66412j44782L4889p7422q6787m9439q5646k7826
18825A684460o9062k8211r8696j42655Q7292J25575P2518j2495N7648K15807O8347
18814A960528J5717M7380p0218J34003J27142K27489M29221L79611K42812M28027
18804C921712M08058M34541K95934J22770P8089j20751j40692j11577k87826k47102
$$ y = [2125770, 2059679, 2101652, 2034491, 1831756, 1723499, 1666015, 1647407, 1804345, 1936430, 1851558, 1779544, 1915766, 1982855, 2167702, 2180522, 1959616, 2045559, 2086274, 2180382, 2227360, 2359421, 2514885, 2646403, 2761205, 3027447, 3419612, 3628950, 3705943, 3868935, 3786907, 3510799, 3303418, 3214208, 3016741, 2779849, 2770160, 2819387, 2725969, 2668432, 2483632, 2401514, 2600307, 2573789, 2428086, 2387885, 2121473, 1976691, 2011580, 1934158, 1847371, 1797932, 1712286, 1684460, 1615398, 1587187, 1488491, 1345836, 1433128, 1558703, 1631221, 1618726, 1676374, 1892181, 1960528, 1976245, 2023625, 1953407, 2087410, 2214552, 2442041, 2871262, 3250873, 3493685, 3921712, 4329770, 4764311, 5060245, 5183015, 5261104, 5140353, 4999661, 4888084, 4600258, 4353156]
18794D353156l19089l72886l41366l93035k13988k0258k01603j5209j28335j97656
18784B149731p0465k05160k36272p4158L9090N0680L343j89283k05591K9156K0406
18773A311477J92848Q1169l1539N5455k3567m3857P8008j08023k52799j58174
18763A100998J41098K97625K78564M6147P6397J93923K32756L39651L27716K19669
18753C254544L60961J89459M9821L0708q2106j53315m1168j18514j10627l63969
18743C015794m07317k20803m0604r5468r7486l0885j18347j05309J10892j11725
18733A898742j77178m3111j46916k07087J8776M9948q2173j76099j40631M1527
18723A035798K830J45770J78227L9301O6662j31264o0812K6989M0514K13430J18690
$$ y = [4353156, 4034067, 3661181, 3319815, 2926780, 2712792, 2692534, 2490931, 2475722, 2347387, 2149731, 2079266, 1874106, 1637834, 1563676, 1602766, 1653446, 1656789, 1467506, 1261915, 1291071, 1311477, 1504325, 1585494, 1553955, 1609410, 1585843, 1541986, 1619994, 1511971, 1259172, 1100998, 1242096, 1539721, 1818285, 1864432, 1940829, 2134752, 2367508, 2707159, 3034875, 3254544, 3615505, 3804964, 3854785, 3885493, 3803387, 3650072, 3608904, 3490390, 3379763, 3015794, 2608477, 2387674, 2347070, 2251602, 2154116, 2123231, 2004884, 1899575, 2010467, 1898742, 1721564, 1678453, 1531537, 1324450, 1343226, 1393174, 1311001, 1134902, 994271, 1035798, 1038628, 1184398, 1362625, 1401926, 1468588, 1337324, 1276512, 1303501, 1344015, 1557445, 1676135]
18712A676135Q8279m8777j32772k2359J39029R660L3711J03207k3994m3963l7079
18701A741077M3511R7662K16801j9603j72607K0659P8565O7780K53619J63497
18691B490961J81415J77055L34710J44271k31172m40437l45474k82101q5347K735
18681A946616j53110M8312p4455j07604j34313l9551L4002m0794K9210M2425j4132
18670A536606j9074j22804K9815J87244j6809j78379j4078j5411p802J24568J14453
18659A618329o6513p5185N8968l5526m4241n687j10079m4669P9980K63803J91762
18648A830942n4762m8307j99719R6920j12476L6115K28228K46499J36340J32880
18638B292660L45468L94966L76551M54148J16107J21335P1155l39956l77377k55023
$$ y = [1676135, 1764414, 1715637, 1582865, 1560506, 1699535, 1709195, 1742906, 1846113, 1822119, 1778156, 1741077, 1784588, 1882250, 2099051, 2079448, 1906841, 1927500, 2006065, 2073845, 2327464, 2490961, 2672376, 2849431, 3184141, 3328412, 3097240, 2656803, 2311329, 2029228, 1943881, 1946616, 1793506, 1841818, 1767363, 1659759, 1525446, 1485895, 1519897, 1479103, 1508313, 1550738, 1536606, 1517532, 1394728, 1424543, 1611787, 1594978, 1416599, 1402521, 1387110, 1379308, 1503876, 1618329, 1551816, 1476631, 1535599, 1500073, 1455832, 1450145, 1340066, 1295397, 1375377, 1639180, 1830942, 1776180, 1727873, 1528154, 1625074, 1512598, 1548713, 1776941, 2023440, 2159780, 2292660, 2638128, 3033094, 3409645, 3863793, 3979900, 4101235, 4172390, 3832434, 3455057, 3200034]
18628C200034m61992n13628k81905j38505k5971j42972Q2409J97917N2982O3581
18618B031950J1082J12307K26752l0303j08563Q1777k8220K6068K0134N4056K3323
18607B420363j6171K8920O6443L9801Q2675M16236L28249L03740L06679L63033
18597D339968N03528O35395K98565J75676J57851J01903P6347J1028K7201m209
18587F323253J59449K1981M465P3575K41339M04072N84500R98018J045381J163162
18577A1019195J736541K477904L503187M295728M055929K510037R51061k6105
18569C0523477q80526j961456l093674l537873l237813l012840k429433j826602
18561A0543260j363345j163815q85973o28919k71269j83885j66931n1998m212
$$ y = [3200034, 2738042, 2224414, 1942509, 1804004, 1778033, 1635061, 1717470, 1915387, 1968369, 2031950, 2043032, 2155339, 2382091, 2351788, 2243225, 2325002, 2296782, 2322850, 2342984, 2397040, 2420363, 2404192, 2433112, 2499555, 2539356, 2622031, 3038267, 3366516, 3670256, 3976935, 4339968, 4843496, 5478891, 5777456, 5953132, 6110983, 6212886, 6289233, 6300261, 6327462, 6323253, 6482702, 6504683, 6509148, 6582723, 6824062, 7228134, 7812634, 8810652, 9856033, 11019195, 12755736, 15233640, 18736827, 23032555, 27088484, 29598521, 30549582, 30523477, 29642951, 27681495, 24587821, 21049948, 17812135, 14799295, 12369862, 10543260, 9179915, 8016100, 7130127, 6501208, 6229939, 6046054, 5879123, 5827125, 5822913]
18552E822913J42194J54292N29015O59144Q31016Q71456R22880Q29642M24067
18543A1186619K78291K01782k48623m78782m47116k64610j0065j34673R0175K93374
18533A0466372N87371J004805J563639K157470L173146M947018O717682Q841594
18525C9459097J0204477Q970291N472093J015602k693430m461752n413407o234091
18517D6318880o572522o433675n904445n084884l988763l007744k077299j485420
18509A1764128j107295p09694k08391k31807k43302R865k17838l76489k73852
18500H405325k90163j52423n4715K76041M55656L50196J78481K18472J70597J61228
18490I718695j6582j07334j67040o1769j4921K6391K01600L91697K71896L72265
$$ y = [5822913, 5965107, 6119399, 6648414, 7307558, 8138574, 9010030, 9932910, 10762552, 11186619, 11464910, 11666692, 11418069, 10939287, 10492171, 10227561, 10217496, 10082823, 10172998, 10466372, 11053743, 12058548, 13622187, 15779657, 18952803, 23899821, 30617503, 39459097, 49663574, 58633865, 64105958, 65121560, 62428130, 57966378, 52552971, 46318880, 39746358, 33312683, 27408238, 22323354, 18334591, 15326847, 13249548, 11764128, 10656833, 9947139, 9738748, 9506941, 9263639, 9273504, 9055666, 8679177, 8405325, 8115162, 7962739, 7908024, 8184065, 8639721, 8989917, 9168398, 9386870, 9557467, 9718695, 9702113, 9594779, 9427739, 9365970, 9351049, 9377440, 9579040, 9970737, 10242633, 10614898]
18480A0614898R17988J243601J717304K276475L247017M673302O347234P420000
18472C8457819O891150L650400k87478l267182m860173m849084l663514j665766
18464C0406172K50257K119403L549891M241638M351379L964008K756837J017392
18456E2656977J25788J5724O04237J815699L611067M963880N254772M756640M348661
18447G8153445L536812J883039l39916k216412k478851j867686p17256O03211
18439G6556386R19181j45990j289085k165365k496493k462208j878365j078149
18431F5959912j751902l080595l547791l386864l007447k140437n74387J070073
18423D9540562K497316L732669M385537N268547O552726Q409843Q690345O924795
$$ y = [10614898, 11532886, 12776487, 14493791, 16770266, 20017283, 24690585, 31037819, 38457819, 45348969, 48999369, 48711891, 45444709, 40584536, 35735452, 32071938, 30406172, 30656429, 32775832, 36325723, 40567361, 44918740, 48882748, 51639585, 52656977, 52782765, 52798489, 53402726, 55218425, 58829492, 63793372, 69048144, 73804784, 78153445, 81690257, 83573296, 83233380, 81016968, 78538117, 76670431, 75953175, 76556386, 77475567, 77329577, 76040492, 73875127, 71378634, 68916426, 67038061, 65959912, 64208010, 61127415, 57579624, 54192760, 51185313, 49044876, 48470489, 49540562, 52037878, 55770547, 60156084, 65424631, 71977357, 80387200, 89077545, 96002340]
18415I6002340O289907P788097R255380R790780J0073444J1199518J2694346J2439860
18407A75533672R132907N162543M945182N167665M159246O159120R581380R171931
18399B29013646O947720O291482P042336P405495O316261M671112K900870N57842
18391B71146764l285401q302448j0039628r200015q662290o164778l584922m004097
18383B17903185o185728p882008p301900l962228k551487o797253j2982495j6199739
18375A54040347j3999437r514693p255117q907807j1341903j2154855j1190033
18368G9676502q546875n398274k598494j096612j555676l287983m355126m010345
18360D8827117k807376j237018k34005M88493J366674K902277N035385N899437
$$ y = [96002340, 102292247, 110080344, 119335724, 129126504, 139199948, 150399466, 163093812, 175533672, 184666579, 189829122, 194774304, 199941969, 204101215, 210260335, 219841715, 229013646, 235961366, 242252848, 249295184, 256700679, 263016940, 267688052, 270588922, 271146764, 267861363, 259558915, 249519287, 240319272, 231656982, 225492204, 221907282, 217903185, 211717457, 203835449, 196533549, 192571321, 190019834, 183222581, 170240086, 154040347, 140040910, 130526217, 123271100, 114363293, 103021390, 90866535, 79676502, 71129627, 65731353, 63132859, 62036247, 60480571, 57192588, 52837462, 48827117, 46019741, 44782723, 44548718, 45037211, 46403885, 49306162, 54341547, 60240984]
18352F0240984L663964R23040J055353M233952R504092J6354456K2348621K3410105
18344A41734567J7716604J0975415J1278785J8113134K4827907K5860951J4738592
18337B65245955m616211j8110365k0183466j6835406j3179163j2654962j5426684
18330A64239698j6749367j3610634q952301o381191p300325r869339j0221390
18323I1155151q479551n394154l436993l957043n194381n871841n563155m513564
18315D8744469l831018l753914l208942k572120k263166j315128j38598J181193
18307C2842776L279679N930103Q628459R364235O140703J553863l48103J536743
18299F8928458N890695J0598988J2337059R475201N964209O039363R159983J2285209
$$ y = [60240984, 63904948, 64827988, 65883341, 70117293, 79621385, 95975841, 118324462, 141734567, 159451171, 170426586, 181705371, 199818505, 224646412, 250507363, 265245955, 260629744, 242519379, 222335913, 205500507, 192321344, 179666382, 164239698, 147490331, 133879697, 124927396, 118546205, 111245880, 101376541, 91155151, 82675600, 77281446, 73844453, 69887410, 64693029, 58821188, 53258033, 48744469, 44913451, 41159537, 37950595, 35378475, 33115309, 31800181, 31661583, 32842776, 36122455, 42052558, 50681017, 60045252, 66185955, 67739818, 67391715, 68928458, 74819153, 85418141, 97755200, 107230401, 113194610, 119233973, 128393956, 140679165]
18291A40679165J2344283Q781253M493760J226386j904347l643363l063139l043520
18283A55870478l668468m623758n555631m493541j581525N31296m50316m134159
18275A31894376p841219r548718q488589n724634l245322j887783k451143l177750
18267H9529218l170197l513554n495852p711647p268031m584722j406009J444382
18259E7823588K171439O52548j615696l736869m358509l613906k377357p04955
18251D4240283q8097r51368k147502l103730l019050j882188l68854J704166M142811
18242C8526471O555958R330102J0600621R026380P244300Q275836J0642738J2569031
18234A12771437J3270983J2544925R911816M262093l413601j1838279j7697330
$$ y = [140679165, 153023448, 161804701, 166298461, 167524847, 165620500, 161977137, 158913998, 155870478, 152202010, 147578252, 142022621, 137529080, 135947555, 136478851, 136028535, 131894376, 124053157, 114504439, 106015850, 100291216, 97045894, 95158111, 92706968, 89529218, 86359021, 82845467, 77349615, 69637968, 62369937, 57785215, 56379206, 57823588, 59995027, 60647575, 59031879, 55295010, 50936501, 47322595, 44945238, 44240283, 44152186, 43200818, 41053316, 37949586, 34930536, 33048348, 32679494, 34383660, 38526471, 45082429, 54412531, 65013152, 74039532, 81283832, 89559668, 100202406, 112771437, 126042420, 138587345, 148499161, 152761254, 149347653, 137509374, 119812044]
18227A19812044j9225210j8058915j5380713j2242007r600243p464568n925999
18220C1914389m814566l764393k933887k269120j591340r09275k51095L96868
18212A5777581Q76195J167350O50570j95176n53303k39410M74277J218286J682437
18203B0858807J277419J57379q54627p81564m12232O49956K293306L969632M983394
18194C2141470N561404M898217L673541L655126L567935L024708L488856K738193
18186F2749450Q58812n96983k505478l561856j609700K368114N585739N759045
18178F9047143K947556k670700q388182j0504876r960716q649129o923552n368562
18170A9528982m119140k937860k221097j651603j121464r37894q12546o97626
$$ y = [119812044, 100586834, 82527919, 67147206, 54905199, 45304956, 37840388, 31914389, 27099823, 23335430, 20401543, 18132423, 16541083, 15631808, 15380713, 15777581, 16653776, 17821126, 18471696, 18276520, 17723217, 17483807, 17958084, 19176370, 20858807, 22136226, 22293605, 21438978, 20657414, 20245182, 20895138, 23188444, 27158076, 32141470, 37702874, 42601091, 46274632, 49929758, 53497693, 56522401, 60011257, 62749450, 63608262, 63011279, 60505801, 56943945, 55334245, 57702359, 63288098, 69047143, 71994699, 69323999, 60935817, 50430941, 40470225, 31821096, 24897544, 19528982, 15409842, 12471982, 10250885, 8599282, 7477818, 6539924, 5727378, 5029752]
18162E029752n85281m66121l27605k51731k38845j46736o8072j53581J43024J66295
18152C101099J48290K59499L11625L60163L43196O93326R38961J566294K443223
18143A0165676K951350K437091M34814j210076j709745j299294n22673N72364
18135A1819507K216254M182507N219525L117953q58785k983807k903757k193627
18127A7615770r32582j075450k085585k642728k412194k067701j493655j068465
18119C837410m12296l85397n91584l26807p6902j40831k41740j45734j41310k17883
18109A156926p3117N1342J01250J35062Q3729J21718K66430j03153n0176J03151
18099A793162n2495Q2199j76256l09547j27178m0622r1566l3838j24378q2787
$$ y = [5029752, 4444471, 3978350, 3650745, 3399014, 3160169, 3013433, 2945361, 2791780, 2934804, 3101099, 3249389, 3508888, 3820513, 4180676, 4523872, 5217198, 6156159, 7722453, 10165676, 13117026, 15554117, 15988931, 14778855, 13069110, 11769816, 11247143, 11819507, 14035761, 18218268, 23437793, 26555746, 25696961, 22713154, 19809397, 17615770, 16683188, 15607738, 13522153, 10879425, 8467231, 6399530, 4905875, 3837410, 3425114, 3039717, 2448133, 2121326, 2044424, 1903593, 1661853, 1516119, 1374809, 1156926, 1083809, 1135151, 1236401, 1371463, 1455192, 1576910, 1843340, 1740187, 1690011, 1793162, 1740667, 1822866, 1646610, 1337063, 1209885, 1169263, 1077697, 1043859, 919481, 836694]
18089H36694J04035K65602O9889j04909R6716J9555k3236j27537p8115K6349L5143
18078A120186P5404J15325R9935k00486j01703o2246K60J07311J07404j88303
18068A073087j58550N377j04908j01262J19676P5984m0918J76075n8113p5922
18058I10526k5763q5698m2488N0034r801q6956P5227M7933j23640r8588J92131
18047H02917J22092J05359J8758j78926Q052L2981J61O8406J4133N4599J85457
18036A233989k0050j59927P8805N2752J52555M7332J39241J27372j4707J42259
18026A779621l1572j0352j76023k27896o0897k3615J09674K36940N0695j46927
18016A499648m2502J53464J03105J8776j38753k18961m6433p3074k06975j41672
$$ y = [836694, 940729, 1206331, 1276220, 1171311, 1268027, 1287582, 1264346, 1136809, 1058694, 1085043, 1120186, 1195590, 1310915, 1410850, 1210364, 1108661, 1046415, 1046675, 1153986, 1261390, 1073087, 914537, 919914, 815006, 713744, 833420, 909404, 868486, 1044561, 986448, 910526, 884763, 799065, 756577, 806611, 796810, 709854, 785081, 833014, 709374, 610786, 802917, 925009, 1030368, 1049126, 870200, 878252, 911233, 911394, 979800, 993933, 1048532, 1233989, 1213939, 1054012, 1132817, 1185569, 1338124, 1385456, 1524697, 1652069, 1637362, 1779621, 1748049, 1737697, 1561674, 1333778, 1272881, 1249266, 1358940, 1595880, 1646575, 1499648, 1457146, 1610610, 1713715, 1732491, 1593738, 1374777, 1328344, 1255270, 1048295, 906623]
18006I06623j9979K6548j32708K5096j3119l4138k0193m6803Q9953n0086p4358
17995F56836j29036J11069J45958Q5519O0252r3328k4932P2013O4259k38694J45797
17984H55713p3610j74976J21242M9686J4161K33582J10267L2565J291J85136R7569
17973A452626j99968p9837k2966O2230L43923N51309L34294J18008q3397k29856
17963B246366k17081j90608k19350j13434O2634j9257o6517j23604j66290N2474
17953A245333J97895J69625Q9160J80948K84383M20491M8900R1903j04938k75185
17943B348515k12130r4562q0911J2957J16917n6912k14936k3317N2896j33545
17933A714972j49702M692O6661m9079R1177l0628K1422j9595j14393k59425j45177
$$ y = [906623, 886644, 913192, 780484, 805580, 792461, 758323, 738130, 691327, 781280, 731194, 656836, 527800, 638869, 784827, 870346, 930598, 837270, 812338, 884351, 948610, 709916, 855713, 782103, 607127, 728369, 778055, 792216, 1025798, 1136065, 1168630, 1169921, 1355057, 1452626, 1252658, 1172821, 1149855, 1212085, 1556008, 2107317, 2441611, 2559619, 2476222, 2246366, 2029285, 1838677, 1619327, 1505893, 1568527, 1549270, 1482753, 1359149, 1192859, 1245333, 1443228, 1612853, 1702013, 1882961, 2167344, 2587835, 2636735, 2728638, 2623700, 2348515, 2136385, 2041823, 1960912, 1973869, 2090786, 2033874, 1818938, 1795621, 1848517, 1714972, 1565270, 1569962, 1636623, 1587544, 1678721, 1648093, 1669515, 1649920, 1535527, 1276102, 1130925]
17922A130925l3791M5818k1787k6073m2557l5133R4348j9971R5420P150k20887
17911I73462j78139q8507Q8497J97570R5326q6664K3045J47543N3379J1405J29135
17900A366052K07074O099L09681L80454L67973J99492l7333k40152k27834j32351
17890B199155j82955l10585j33086N3456N2374J55942n7261J06718L80956J63904
17880B428618J23482K51722K47698Q699k2441k12971m31007k61504p4257J7062
17870B075101J075j49295j38295j13204L7148q5184k48737j06489m4742q1806
17860A145572j82540j56648J38201L3530J29293L7645p9568p0062k5194Q0895
17850A051124m7734k39412j58197j31263P0758N8132j10779M6657O4967J8049
$$ y = [1130925, 1097134, 1142952, 1121165, 1095092, 1052535, 1017402, 1111750, 1091779, 1187199, 1194349, 973462, 795323, 706816, 795313, 992883, 1088209, 1001545, 1024590, 1172133, 1225512, 1236917, 1366052, 1573126, 1579225, 1888906, 2269360, 2637333, 2836825, 2799492, 2559340, 2331506, 2199155, 2016200, 1705615, 1572529, 1625985, 1678359, 1834301, 1777040, 1883758, 2264714, 2428618, 2552100, 2803822, 3051520, 3060219, 3037778, 2824807, 2393800, 2132296, 2058039, 2075101, 2076176, 1926881, 1788586, 1675382, 1712530, 1627346, 1378609, 1272120, 1227378, 1145572, 963032, 806384, 944585, 978115, 1107408, 1145053, 1065485, 995423, 970229, 1051124, 1003390, 763978, 605781, 474518, 545276, 603408, 492629, 539286, 604253, 622302]
17840F22302J36883J26560K04677J11745m1728p3829J678P9838o5337N0917K04903
17829A358609K08522J03562J00787m5431J18418M9480m6203k02606j07201K3655
17819A561592J9751p3857j34524k30666Q6237J27544L479K4464j80062r4827q3126
17808A026005n3965J0897J0733k2313Q0841j4832j56017q1156j20861k38609o3497
17797C77226J55978J77011O692J3025J30139J27866n7070m5506J92484Q1809K9691
17786A189345r8145j50883J73813J70034l0154k0904K1200j00066l3925j38135
17776I82180r6387o2568P8670J63917J3570j787J14416J46345j03546j26163k6263
17765A082384j65165q0473l7304J614K0268q0052j26961N1767K8374O153M7055
$$ y = [622302, 759185, 885745, 1090422, 1202167, 1160439, 1086610, 1088288, 1168126, 1102789, 1153706, 1358609, 1567131, 1670693, 1771480, 1726049, 1844467, 1893947, 1847744, 1645138, 1537937, 1561592, 1581343, 1507486, 1372962, 1142296, 1228533, 1356077, 1359556, 1384020, 1203958, 1109131, 1026005, 972040, 982937, 993670, 971357, 1052198, 1037366, 881349, 800193, 679332, 440723, 377226, 533204, 710215, 716907, 729932, 860071, 987937, 930867, 885361, 1077845, 1159654, 1189345, 1091200, 940317, 1114130, 1284164, 1254010, 1233106, 1254306, 1154240, 1120315, 982180, 885793, 823225, 901895, 1065812, 1079382, 1077595, 1192011, 1338356, 1234810, 1108647, 1082384, 917219, 836746, 799442, 801056, 821324, 741272, 614311, 666078, 694452, 700605, 747660]
17754G47660K7831k0791J45365J29897j1890n5373j98360N7520J08189o1523k59529
17743F08996q4459J37873J25184J07650P4820m3223J79791o8874o7591Q6524p0544
17732I86147Q561r8852m5716l531N1716L4694J36099o240R372j655M4311N1485
17720A166391j1159q3480J220J30518j4074j46881j35474q5122n8484k8596O8087
17709H02946J33967r0471j11134L7451L590J73665P5430p3008Q477n8671j35082
17698G67160n0585j0651J14546q7614m6257J61243P2419j15246L1611J74512M735
17687A015873j66677r2239j72486M3055O9130O6727J78068O2683R3727m7747j20682
17676I29432K3284P8281P3391q6736j57383j08941J35738K7815m1679j0473K70095
$$ y = [747660, 775491, 754700, 900065, 1029962, 1018072, 962699, 764339, 821859, 930048, 868525, 608996, 524537, 662410, 787594, 895244, 970064, 926841, 1106632, 1037758, 970167, 1056691, 986147, 994708, 895856, 850140, 846609, 898325, 933019, 1069118, 1062878, 1072250, 1070595, 1114906, 1166391, 1155232, 1071752, 1072972, 1203490, 1189416, 1042535, 907061, 821939, 763455, 734859, 802946, 936913, 846442, 735308, 772759, 776349, 950014, 1025444, 952436, 960913, 902242, 767160, 716575, 705924, 820470, 732856, 686599, 847842, 920261, 805015, 836626, 1011138, 1015873, 849196, 756957, 584471, 627526, 696656, 763383, 941451, 1004134, 1097861, 1050114, 929432, 952716, 1030997, 1104388, 1017652, 860269, 751328, 887066, 914881, 873202, 862729, 1132824]
17665A132824l1370l8915J20461j29387j06413l1498j04649j12911N7229K5615
17655G80986o4933N3650r4384j56487Q9946Q5323Q6181J61620J43640j79552K5603
17644I31593L9791p8244l2514J18721K07067Q6616o8385R4613P6892j36029R7560
17633A337681K36285J3141o9520r8419n2915R6007K98592J05494k4891P5080m2685
17622A873850R2766L2531N6543Q6991J80483J40892J84684K05903K82100L34498
17612C471241K77364N12858Q63083J370089J910981L278230M799740N751093N210942
17603B7445621L274170M70632k669558m483005m310192l496906k403716j072911
17595A2754135M67633J793886L706989O525662J0422351J3240266J2757533Q554698
$$ y = [1132824, 1101454, 1062539, 1183000, 1053613, 947200, 915702, 811053, 698142, 755371, 780986, 716053, 769703, 675319, 518832, 608778, 694101, 780282, 941902, 1085542, 905990, 931593, 971384, 893140, 860626, 979347, 1186414, 1273030, 1204645, 1299258, 1376150, 1240121, 1337681, 1573966, 1587107, 1517587, 1419168, 1366253, 1462260, 1760852, 1866346, 1841455, 1916535, 1873850, 1966616, 1999147, 2055690, 2142681, 2323164, 2464056, 2648740, 2854643, 3136743, 3471241, 3748605, 4261463, 5124546, 6494635, 8405616, 11683846, 16483586, 22234679, 27445621, 30719791, 31190423, 28520865, 24037860, 19727668, 16230762, 13827046, 12754135, 13221768, 15015654, 18722643, 25248305, 35670656, 48910922, 61668455, 70223153]
17587G0223153J701925n699476j0907674j2005829j0614254q215228n135443k914857
17579A6432317r24106P59733K742088N258123P684574Q193652N809936J618633
17571D7574950l134132o631842q043462p461691n838268m259586k896331j834221
17563G475417j423970j028050l89997j43091k61148q3147j00564O060j09417p1131
17553C870962j21183k9049q4196o9560j8788J53412P1572J17082R2656L27276
17543D310184K29227K41592K40925K49094O78580Q46781J118274J044596J068417
17534A0027670J687700K585556L653607M043676K580156N20753m89753l35027
17526B4274338J112895L609559P252369J2829953J9421131K2675812J8079494
$$ y = [70223153, 71925078, 66225602, 55317928, 43312099, 32697845, 24482617, 19347174, 16432317, 15508211, 16267944, 19010032, 24268155, 31952729, 40146381, 45956317, 47574950, 44440818, 37808976, 29765514, 22303823, 16465555, 12205969, 9309638, 7475417, 6051447, 5023397, 4633400, 4490309, 4229161, 4146014, 4045450, 4051510, 3942093, 3870962, 3749779, 3720730, 3636534, 3566974, 3548186, 3701598, 3773170, 3890252, 3982908, 4310184, 4539411, 4781003, 5021928, 5271022, 5949602, 6796383, 7914657, 8959253, 10027670, 11715370, 14300926, 17954533, 21998209, 24578365, 25099118, 24609365, 24274338, 25387233, 28996792, 36249161, 49079114, 68500245, 91176057, 109255551]
17519A09255551P692572p65558k555803k02896m12198m343685o328877k377361
17511I9961745M878616R413111M485545o086655j2597539j3361934j1981084j0017405
17503F4694400o403883k090529J888979K334075k111693p173887r543799r141140
17495C2452523p817537n799360l737714k329898j809036j245969p91755n09309
17487H411945l83329l23192k33988r3035R0701K26557K30294K96799O88390R88962
17477I900104R96154J073463J568136K401197L483407N622710Q294779R929650
17469D3269600Q686832N046322J442294M72543J896437L247861J471621l021812
17461F2511698o842751q228049o849662m033636k23621M363563Q706146J1188458
$$ y = [109255551, 116948123, 116182565, 113626762, 113423866, 113011668, 108667983, 102339106, 99961745, 104840361, 114253472, 118739017, 112652362, 100054823, 86692889, 74711805, 64694400, 58290517, 56199988, 58088967, 60423042, 58311349, 51137462, 41593663, 32452523, 24634986, 18835626, 15097912, 12768014, 10958978, 9713009, 8921254, 8411945, 8028616, 7705424, 7471436, 7378401, 7469102, 7695659, 7925953, 8222752, 8911142, 9900104, 10896258, 11969721, 13537857, 15939054, 19422461, 25045171, 33339950, 43269600, 51956432, 57002754, 58445048, 58917591, 60814028, 64061889, 65533510, 62511698, 55668947, 47440898, 40591236, 36557600, 36333979, 40697542, 49403688, 60592146]
17453F0592146J0868723P376268J628398k666822m062600m922678o601287q262161
17445E3949987q612704p382985n023009k071130J063820M160135P017379Q308727
17437E1410220O102364K35962n429794q354632q668894p435925n618171m114939
17429A8126191k782946k092207j612991j001991o54888o20438l65599k08159j51030
17420H635942k48818j5591J46408J78614M13877O14376P49076O36272J170262
17411A2280418K078632K764189M114107O094304O968263M597341R71201J59043
17403D0027498J949789M656958N492170K358048j547803l928587m964009m326239
17395C9717825k197877P75494M538999Q197242J0043311J0246034J1984205J5299270
$$ y = [60592146, 71460869, 78837137, 80465535, 77798713, 73736113, 68813435, 62212148, 53949987, 45337283, 37954298, 32931289, 30860159, 31923979, 36084114, 43101493, 51410220, 57512584, 57748546, 52318752, 43964120, 35295226, 27859301, 22241130, 18126191, 15343245, 13251038, 11638047, 10636056, 9981168, 9360730, 8995131, 8786972, 8635942, 8387124, 8371533, 8517941, 8696555, 9110432, 9724808, 10473884, 11110156, 12280418, 14359050, 17123239, 21237346, 27331650, 34299913, 38897254, 39868455, 40027498, 41977287, 46634245, 52126415, 54484463, 52936660, 49008073, 44044064, 39717825, 37519948, 38295442, 42834441, 51031683, 61074994, 71321028, 83305233, 98604503]
17387I8604503J6922505J4502142O700075l298828j1377110j6479978j8014149
17380H7559160j6549671j3591781j0150912o904940m356286k159861p03471L8801
17372C3181039n92855j378267j954634k175030k034969j751341j349331j224780
17364B0719832j200119j147469r69736m72505J2099R26235K192093L701773N874470
17355B9636673P742447P508207N839473M557803J995842q94935k598306m862944
17347D8924260o580779n375669k969165O41712M893541Q578358Q463707M779957
17339F1355922O8429m666628p277844o167440l389021j08209J236322J130914
17331D2182445K65875j927245m471002n252127m574283l448687k257526j740676
$$ y = [98604503, 115527008, 130029150, 136729225, 133430397, 122053287, 105573309, 87559160, 71009489, 57417708, 47266796, 40361856, 36005570, 33845709, 33142238, 33181039, 32588184, 31209917, 29255283, 27080253, 25045284, 23293943, 21944612, 20719832, 19519713, 18372244, 17402508, 16930003, 16942102, 17868337, 20060430, 23762203, 29636673, 37379120, 44887327, 50726800, 55284603, 57280445, 56385510, 53787204, 48924260, 42343481, 36967812, 33998647, 34640359, 39533900, 48112258, 56575965, 61355922, 61424351, 56757723, 49479879, 43312439, 39923418, 39815209, 41051531, 42182445, 42448320, 40521075, 36050073, 30797946, 26223663, 22774976, 20517450, 18776774]
17323A8776774j124441p62887j4718J171815K177815L489087N139526O769429
17315C5622400P674706P067464M120013j78471m136112o249965o518198n593029
17307C1808808l995181k482397p02886J354650L752653O132156R013754J0505656
17299E5387213P429598Q88575m440121o095115n098885l284160l995620n836483
17291C4955002o300987n340283l881123k193078j36095K077498L894749L851835
17283B6927518J130869j045120j211484k94418J027383M06997k235845l940665
17275B0765235m009441l676825k784324j830463r43026n93069m58641l55712m19874
17266E693860K7001J74967L6544o7563k44084J33032L06112K28570N37792N11622
$$ y = [18776774, 17652333, 16889446, 16874728, 18046543, 20224358, 23713445, 28852971, 35622400, 43297106, 50364570, 54484583, 54306112, 50170000, 43920035, 37401837, 31808808, 27813627, 25331230, 24628344, 25982994, 29735647, 35867803, 44881557, 55387213, 62816811, 63705386, 59265265, 53170150, 48071265, 44787105, 40791485, 34955002, 28654015, 23313732, 19432609, 17239531, 17103436, 19180934, 23075683, 26927518, 28058387, 27013267, 25801783, 25507365, 26534748, 26941745, 24705900, 20765235, 16755794, 13078969, 10294645, 8464182, 7521156, 6928087, 6469446, 6113734, 5693860, 5720861, 5895828, 5932372, 5864809, 5620725, 5753757, 6059869, 6288439, 6826231, 7337853]
17256G337853J68221N454l61318l72797l07410l99985l30277j94760J5070J03454
17246E663505M06142M12129L37883R0735j61394j18757n00803n53150n23639n84797
17236D467854m81321k20239l7530L8148J22131J38276k6033K6196k18419k87999
17226C521064l18771k48749k58133j13059k34099p8201q9475k29398l7278j70135
17216A743766J34737R7113J35266l3127j84032J9412Q2517J19416R2731k04393
17206B003406j45227P8492J05384J18597K183o3056m9643J76450J65814L88082
17196B780482L79456M74742K29805K84588J81913J47081O3660K89291J34879K99850
17186E265747N89105O26438N13767K37599Q8655R5179k22214k95536j63800k61375
$$ y = [7337853, 7506074, 7511528, 7150210, 6777413, 6470003, 6070018, 5739741, 5544981, 5560051, 5663505, 6069647, 6481776, 6819659, 6910394, 6749000, 6630243, 6129440, 5576290, 5052651, 4467854, 3986533, 3766294, 3728764, 3766912, 3889043, 4027319, 4001286, 4027482, 3809063, 3521064, 3202293, 2953544, 2695411, 2582352, 2348253, 2270052, 2180577, 1951179, 1913901, 1743766, 1878503, 1975616, 2110882, 2077755, 1893723, 1913135, 1995652, 2115068, 2207799, 2003406, 1858179, 1936671, 2042055, 2160652, 2162835, 2099779, 2050136, 2226586, 2392400, 2780482, 3159938, 3634680, 3864485, 4149073, 4330986, 4478067, 4541727, 4831018, 4965897, 5265747, 5854852, 6481290, 6995057, 7232656, 7321311, 7416490, 7194276, 6898740, 6734940, 6473565]
17176F473565l51292j96594k39777j66924J18166K56236M1634J20364q9640l27103
17166E638635m47573m07838n38701n90879m69941l58277j35345l36917j40311
17157B212853K9616J08888J29226j86783l06681k8485k8953k9537N4378k0429
17147A934093o6855j50868L7787J62572Q115N5664O9187j55318j84388J09747
17137A819736J22960m6429o5756M3238j1546j02810J29834L1779M1404k341j07719
17126A852350R5968r6461N0009P7143J00352J26304j86954j76984Q2597L0947
17116A955271L69852K81639J58042J5702J22529L97557M63807Q1992Q4380N784
17106C936555l86470j74718j31767j60128q3617o1625P5970L7763J55069L9816
$$ y = [6473565, 6122273, 5925679, 5685902, 5518978, 5637144, 5893380, 5935014, 6055378, 5965738, 5638635, 5191062, 4783224, 4244523, 3653644, 3183703, 2825426, 2690081, 2353164, 2212853, 2242469, 2351357, 2480583, 2293800, 1987119, 1958634, 1929681, 1900144, 1954522, 1934093, 1867238, 1716370, 1754157, 1916729, 1924844, 1980508, 2049695, 1894377, 1709989, 1819736, 1942696, 1896267, 1830511, 1873749, 1862203, 1759393, 1889227, 1921006, 1962410, 1960069, 1852350, 1948318, 1851857, 1901866, 1979009, 2079361, 2205665, 2018711, 1841727, 1924324, 1955271, 2325123, 2606762, 2764804, 2780506, 2903035, 3300592, 3764399, 3846391, 3930771, 3936555, 3550085, 3375367, 3243600, 3083472, 2999855, 2938230, 3014200, 3051963, 3207032, 3246848]
17096C246848K854L05306J11487j9520n1917j11038j14394j78241k90546k46443
17086B654396M7144J21072n0262m4491r258M4116J09090j38899k04485P4337J59792
17075B762552r4245j44065r7802J4318J19963J38448O6537P8458O272N3101r5785
17064B807752k03239o9925L7629n23J85619j2633p9147J50552J21173J63982j8475
17053C082765j12255n8129p7626J08114P8310R6948O1017j5275k8985J38845L00856
17042C574585K68571J79401L59998J67102P3456j6997q4242j22154k89919k46822
17032C862979j23540q4076k3653L3358N1936K72880J98445J18255N9203J63901
17022D529688J78067r8677l55099m08747l21220j53282m2137K1405J05789j04965
$$ y = [3246848, 3249702, 3555008, 3666495, 3646975, 3595058, 3484020, 3369626, 3191385, 2900839, 2654396, 2701540, 2822612, 2772350, 2727859, 2718601, 2762717, 2871807, 2732908, 2528423, 2602760, 2762552, 2668307, 2524242, 2426440, 2440758, 2560721, 2699169, 2765706, 2844164, 2850436, 2903537, 2807752, 2604513, 2534588, 2572217, 2571694, 2757313, 2744680, 2665533, 2816085, 2937258, 3101240, 3082765, 2970510, 2912381, 2834755, 2942869, 3021179, 3118127, 3179144, 3163869, 3134884, 3273729, 3574585, 3843156, 4022557, 4382555, 4549657, 4623113, 4606116, 4521874, 4399720, 4109801, 3862979, 3739439, 3655363, 3631710, 3665068, 3717004, 3989884, 4188329, 4306584, 4365787, 4529688, 4707755, 4609078, 4253979, 3845232, 3524012, 3370730, 3328593, 3349998, 3455787, 3350822]
17012C350822j59150N9691J24449P7258R3431j70j46016k93108J7146N0424O4036
17001C238813J22400K00419N779j47537o537Q2582J68053j25696k10144j44286
16991C183846j65494J07780j45311o7501n912J7077R2063L3952K1903j35791k6639
16980B909973Q4365j0137M235j76711q2791K5070L1391J09076K8571j16087m5810
16969B761145k5937l3946j27779p8410K56400R6551j04656J23292k6950p2664
16959B767046o4098m8045J08752J11427J76995M763P6936J22561J1154n5914j55045
16948C056532n6047J09894K1754j50104J3656J06950O6174j41747r372n9859N7894
16937C015725P5311k096N4966j6235q6591j02951m9084L8488Q2317r047j25254
$$ y = [3350822, 3191672, 3251363, 3375812, 3453070, 3546501, 3546331, 3400315, 3107207, 3124353, 3174777, 3238813, 3361213, 3561632, 3567411, 3419874, 3413337, 3495919, 3663972, 3538276, 3328132, 3183846, 3018352, 3126132, 2980821, 2913320, 2907408, 2924485, 3016548, 3050500, 3072403, 2936612, 2909973, 2994338, 2984201, 2988436, 2811725, 2728934, 2754004, 2785395, 2894471, 2923042, 2806955, 2761145, 2735208, 2701262, 2573483, 2495073, 2751473, 2848024, 2743368, 2866660, 2839710, 2767046, 2702948, 2654903, 2763655, 2875082, 3052077, 3056840, 3133776, 3256337, 3267491, 3211577, 3056532, 3000485, 3110379, 3132133, 2982029, 2995685, 3102635, 3168809, 3027062, 3017690, 2957831, 3015725, 3091036, 3088940, 3143906, 3127671, 3041080, 2938129, 2889045, 2927533, 3009850, 3000803, 2875549]
16926B875549r4724m6318j13259Q3281M617m7965k8603n5995P9557o3575k6075
16915B566490J7800o8693l0205r697K3013k280j76029r6352l4983K6523j20554
16904B095033n6209r9020M7124J05363J67982J96465j18134l6021k6265q2581
16894B193737J4964K62567j3152M3788o1180j56704j41708K2252J37668J63120
16884B465352j7201j15775O217J59926K3540M418N4477j45481O3861Q0829j24978
16873B455185r1096n5581P6690o4981n166j84436j31838Q3747L7758j7105j27902
16862A975275k1973J16127K24891P9708k3519j5356k00497p1100j95053p6540
16852A791963j15649l5152J47159N0132j06678n1449J51608K1957j8220j73246
$$ y = [2875549, 2780825, 2734507, 2621248, 2704529, 2709146, 2661181, 2632578, 2576583, 2656140, 2592565, 2566490, 2584290, 2515597, 2485392, 2475695, 2498708, 2496428, 2320399, 2224047, 2189064, 2215587, 2095033, 2038824, 1939804, 1986928, 2092291, 2260273, 2456738, 2338604, 2302583, 2276318, 2193737, 2208701, 2471268, 2458116, 2501904, 2440724, 2284020, 2142312, 2164564, 2302232, 2465352, 2448151, 2332376, 2338593, 2498519, 2522059, 2526477, 2580954, 2435473, 2499334, 2580163, 2455185, 2364089, 2308508, 2385198, 2320217, 2315051, 2130615, 1998777, 2082524, 2120282, 2103177, 1975275, 1953302, 2069429, 2294320, 2374028, 2350509, 2335153, 2134656, 2063556, 1868503, 1791963, 1676314, 1641162, 1788321, 1838453, 1731775, 1680326, 1831934, 1853891, 1835671, 1662425]
16842A662425l6560o0628k0207n2891j17357K3183J12441J04210L2647q3535j8777
16831A544951j9240J94806k1179M3716M9181K5023j20232j41986j6798j9187J01862
16820A620917K2413J1369m5376J00992J86116j08266r9279M4696l9762J69287
16810A863107J72128j29661j46836j32072n6545J40095M007K6775q2733j18044
16800A540221N1186Q4699j05758j02921N9679J5835j71181J30614o9593j82206
16790A250575m7887J15709J41068n7368j7295J42412q1047o452l7182r9806j09237
16779A193490l2361Q1484J50673k467j2189q7904M2034J61767J85263j69461j14171
16768A396158j63740k22723M5714J63234o6916r6890J974J05192J22592j08737
$$ y = [1662425, 1625865, 1565237, 1545030, 1492139, 1374782, 1397965, 1510406, 1614616, 1647263, 1563728, 1544951, 1525711, 1720517, 1699338, 1743054, 1792235, 1817258, 1697026, 1555040, 1538242, 1519055, 1620917, 1643330, 1654699, 1609323, 1710315, 1896431, 1788165, 1688886, 1733582, 1693820, 1863107, 2035235, 1905574, 1758738, 1626666, 1570121, 1710216, 1714223, 1740998, 1658265, 1540221, 1591407, 1676106, 1570348, 1467427, 1527106, 1542941, 1371760, 1502374, 1432781, 1250575, 1202688, 1318397, 1459465, 1402097, 1384802, 1527214, 1446167, 1439715, 1402533, 1302727, 1193490, 1161129, 1242613, 1393286, 1390819, 1378630, 1290726, 1332760, 1494527, 1679790, 1510329, 1396158, 1232418, 1009695, 1055409, 1218643, 1151727, 1054837, 1056811, 1162003, 1284595, 1175858]
16758A175858n6656p7905m3277k5044O2472k7652j71105L2778K86609j3792j73923
16747I68363n0649p8877k9972J43692j1689r0633j36775p1372Q9762J7936K2133
16736G71919n7708R5775O8715J38897O8743j91752k93498J0653R4132j33879l6009
16725E35988P2227L4121Q3435K00305n4108k58382L9175P9406K07446J15442L9241
16714A094296j52728j73174j6321r4362k2139J51988N0887Q6759N0522k5824n2962
16703H96942n0272j23811j58207j58252L1726N2045J45772J90198j0598M3929
16693H59472q2356N4420m6963k16884o6724q6147J64814K92298j25722l42394
16683D03814J08424Q6503K2165j7908N4297j2120R2088L1738J29142j86000j35845
$$ y = [1175858, 1119202, 1041297, 998020, 972976, 1035448, 1007796, 836691, 869469, 1156078, 1142286, 968363, 917714, 838837, 808865, 952557, 940868, 850235, 713460, 642088, 731850, 749786, 771919, 714211, 809986, 878701, 1017598, 1086341, 894589, 601091, 611744, 705876, 571997, 535988, 608215, 642336, 725771, 926076, 871968, 613586, 652761, 732167, 939613, 1055055, 1094296, 941568, 768394, 752073, 657711, 635572, 787560, 838447, 925206, 975728, 949904, 896942, 846670, 722859, 564652, 406400, 438126, 490171, 635943, 826141, 815543, 859472, 777116, 831536, 784573, 567689, 500965, 414818, 579632, 871930, 746208, 403814, 512238, 598741, 620906, 602998, 657295, 645175, 737263, 769001, 898143, 712143, 576298]
16672E76298j83523J1181K16116J35725j1054p5739j2213J5367m0607k2327p0610
16661E38614p4655J34947J25535o2536j40627l7930Q969o2004j39818K5339k5590
16650B90244K13055K4521j36455n1543L5647q9953j57906J684J44727J38062O1905
16639D73988K8883k3216L4787Q9265J8435m0610J6874O2725l573r5348k0512q8534
16627D53164N0292M8391q2504N4181R8507J42682l7463j42859q7856j3641l7280
16616D45614J51148j4227q0129j41428p6089j0758P2314j83407K13817J91605
16606E68460j07383j55158O523J72459j1831j65542R1438k5411N8450O8539j4153
16595D86391k4284J8490l0932J20522Q1735o4034j1656k32068J4991k3487K5420
$$ y = [576298, 392775, 403956, 620072, 755797, 744743, 669004, 656791, 672158, 631551, 609224, 538614, 463959, 598906, 724441, 661905, 521278, 483348, 492317, 430313, 290495, 315834, 290244, 503299, 527820, 391365, 339822, 375469, 285516, 127610, 129294, 274021, 412083, 473988, 502871, 479655, 514442, 603707, 622142, 581532, 598406, 661131, 657558, 562210, 541698, 453164, 503456, 551847, 469343, 523524, 622031, 764713, 727250, 584391, 496535, 482894, 445614, 596762, 582535, 502406, 360978, 284889, 274131, 346445, 163038, 376855, 568460, 461077, 305919, 312442, 484901, 473070, 307528, 398966, 373555, 432005, 500544, 486391, 462107, 480597, 449665, 570187, 651922, 587888, 576232, 344164, 359155, 335668, 361088]
16584C61088q405K08150J39037k11977l12356j36445m0180K58842j2560k0369
16574B24825l5440m9291Q3308k2279J07373J0702P1894j29615k18345P4730J17663
16563B35525O782o1487m6427K0669j0451Q4987n0345j40784o1407K27706K9734
16552B34502m2690N6974J18277J27122r6427n1920p0260P412J87129o7703j49950
16541B52466j78616J1401Q9415L7639Q1215J60786J9812j52775k9293K018J32557
16530D26625l5891K0423k7775n8559j36206j07437j03283r8114N2609N1477J25628
16519A09497J46327O0410j0088P283M112K9696P044k25035j36121L7912J42754
16508A73791N1365j57456J8157j8577J0342R8773M5938P2987j29341L1461l3765
$$ y = [361088, 352683, 560833, 699870, 487893, 175537, 39092, -1088, 257754, 245194, 224825, 189385, 140094, 223402, 201123, 308496, 319198, 391092, 261477, 43132, 117862, 235525, 242307, 180820, 134393, 155062, 144611, 229598, 179253, 38469, -22938, 204768, 234502, 191812, 248786, 367063, 494185, 397758, 345838, 275578, 282990, 470119, 402416, 252466, 73850, 85251, 174666, 212305, 293520, 454306, 474118, 321343, 292050, 294068, 426625, 390734, 411157, 383382, 324823, 188617, 81180, -22103, -120217, -67608, -16131, 109497, 255824, 316234, 306146, 313429, 317541, 347237, 354281, 129246, -6875, 31037, 173791, 225156, 67700, 85857, 67280, 77622, 176395, 222333, 295320, 165979, 197440, 163675]
16497A63675P2244J32691P8114O5007l15270k28174N401J22696J11219k6518N8162
16486B39247Q6029j37443j27048j16906m3670J50437J44710k2451m7187N7966
16476A83684M8550q199O2662j0937Q420J10345j2445L139j4490j41964o2745J7152
16464A83172o2649j48946M2052J57592L1978O7987J092K4101j0903L374R4773
16453C83623R9874J11464l02891k53776j9220P1856R131n0141j6811J23780J81828
16442C38717J45862L0450q6256j78330j65668R5157Q986J14835J5129P5144P3970
16431D67996q1591m6820r039m3541j38647j00125J24964J52770J1586j24373j1399
16420B01781K8874J0656j50475k8092R7834L6895j7525r9719m5506Q6827q6761
$$ y = [163675, 235919, 368610, 446724, 511731, 196461, -31713, -26312, 96384, 207603, 181085, 239247, 325276, 187833, 60785, -56121, -99791, 50646, 195356, 172905, 125718, 183684, 232234, 224035, 286697, 275760, 284180, 394525, 382080, 385219, 370729, 228765, 166020, 183172, 120523, -28423, 13629, 171221, 203199, 271186, 272278, 296379, 285476, 288850, 383623, 483497, 594961, 292070, 38294, 19074, 90930, 100061, 49920, 33109, 156889, 338717, 484579, 515029, 428773, 250443, 84775, 179932, 188918, 303753, 318882, 394026, 467996, 386405, 339585, 330546, 287005, 148358, 48233, 173197, 325967, 337553, 213180, 201781, 230655, 241311, 90836, 62744, 160578, 197473, 179948, 80229, 34723, 121550, 34789]
16409C4789L3698j00850j52060M9530K10617J84394m6379N6417Q6457O9528k28372
16398A97769J7297O8941p9312q4458L5747O584k10872j88567N8265J17664K13729
16387A52787n0326M0320O8526L033p9487n574j28093r0638J20608K09947k9504
16376B11599n2774j39144n4342Q2455l5105K3351K9490K1075J3558L3138m1559
16365I1742o2609L9888K5146J0662o6090j93016p474Q3981o7438m7190K5517K41956
16353G5075J20048r5496j09027m1908R9516J32339r2942j55186j05880n6179K3670
16342b05970l7881O5053M9992J9397J34858o1692j42152J28864K03621J12885
16332B66975j27832j2824J09268J78962m3500l21526j11550Q6861p853j00294
$$ y = [34789, 68487, -32363, -184423, -134893, 75724, 260118, 213739, 270156, 356613, 426141, 197769, 215066, 284007, 204695, 120237, 155984, 162568, -48304, -236871, -178606, -60942, 152787, 102461, 142781, 211307, 214340, 134853, 129279, 1186, -89452, 31156, 241103, 211599, 158825, 19681, -34661, 47794, 12689, 36040, 65530, 86605, 100163, 133301, 91742, 29133, 69021, 94167, 104829, 38739, -154277, -161751, -77770, -145208, -192398, -166881, 75075, 195123, 99627, -9400, -51308, 48208, 180547, 87605, -67581, -173461, -229640, -205970, -243851, -178798, -128806, -109409, 25449, -36243, -178395, -49531, 154090, 266975, 139143, 126319, 235587, 414549, 371049, 49523, -62027, 24834, 16981, -83313]
16322h3313Q1906r3457j56068Q2811P8492J17120R2885j6012j70731L1680J39415
16311A04728P6512j01805k18674o5576N5324p6926M2590P7316o331Q1488J69062
16300A37708R2016K0497o8293N6014j42546j77989k00667N4673R6446J11243R1835
16289G0937k942p5448J54715k1397l8033M0568Q3738j53257j33980R092m8734
16278a14741P8936P7263J0998P1125M518L695J35452J65631j62499k58804P445
16267A9019r4787j2025k2832k4101J25657N6279J50954m9314q2098q9444N3224
16256C0532K12566O4398j80801l6533J58784O0966p0403j19012P0320K8548j02291
16245A17074r9094m9105P0504M1619o9738J04265N7887p5701j21697p8856L2584
$$ y = [-83313, -1407, -94864, -250932, -168121, -89629, 27491, 120376, 104364, -66367, -34687, 104728, 181240, 79435, -139239, -204815, -149491, -226417, -183827, -106511, -112842, -31354, 137708, 229724, 250221, 181928, 237942, 95396, -82593, -283260, -228587, -132141, -20898, 70937, 67995, -7453, 147262, 125865, 87832, 128400, 212138, 58881, -75099, -66007, -114741, -35805, 41458, 52456, 123581, 128099, 131794, 267246, 432877, 270378, 11574, 19019, -75768, -87793, -110625, -134726, -9069, 47210, 198164, 148850, 66752, -22692, 30532, 243098, 307496, 126695, 90162, 248946, 309912, 239509, 120497, 190817, 219365, 117074, 17980, -31125, 39379, 80998, 11260, 115525, 173412, 97711, -23986, -102842, -70258]
16234g0258N9423L7529J0445L839p4862m0484o2422j04115J89071J17221j16702
16223e1315o0161J05245J12899K21741n6844j29913k1180L5458J03464k7K6003
16212B85370j15720q6370j39421J19045p660k8226P704Q237j35734n4498J68699
16201B1426K26856q1470r2632J5562p3537j2633k4825J09188l1645k5456J11460
16190A42294j55365l8854m0339k0309O2519K11939l8227p7447k5052o1337j64322
16179b04500Q5130J04750k0159r7256n7628j13788L096l220J28742J8140J30866
16168b5827O5892j12791j68164j45893j2142p2677K16172k2029p5501J6389J07348
16157b29223l0636m643M0229K70132J07543J31479j29462j14588m9222O3066j4974
$$ y = [-70258, -10835, 26694, 37139, 40978, -33884, -74368, -136790, -240905, -51834, 65387, -51315, -111476, -6231, 106668, 328409, 271565, 141652, 120472, 155930, 259394, 259367, 285370, 169650, 83280, -56141, 62904, 55244, 27018, 34722, 42959, -92775, -147273, 21426, 248282, 166812, 74180, 89742, 16205, 3572, -21253, 87935, 56290, 30834, 142294, -13071, -51925, -92264, -112573, -50054, 161885, 123658, 46211, 21159, -40178, -204500, -119370, -14620, -34779, -132035, -189663, -303451, -300355, -303575, -174833, -156693, -25827, 40065, -72726, -240890, -386783, -398925, -471602, -255430, -277459, -352960, -336571, -229223, -259859, -264502, -224273, 45859, 153402, 284881, 155419, 40831, -8391, 54675, 39701]
16146C9701m4856p7167L5054n4618j01434Q431K4427J31869K5982P0731j18581
16135f0461M8564J01562j25422m6677O6543P259J21787n2143J6684p6530Q0194
16124H1360J04432m2335o6941J42195M800j52530N1402Q5291J07962M040k36464
16113H3212l43350p0442r624J10228R3186m0331K8117O6942k882J5556P2433K1630
16101B4675l5432m8241N1983J8555j62140k31133p5190J31531J78829J70393j67882
16090a44052j01290M8081J3658K62331r4113j14284J609N0036N1763L0239j5601
16079a1623M3933o3876J768p2153J61252J90525j2549j24801j46993n5222N2116
16068c7623j4330M4335m1449Q9238M1714J27052j06971m9165p0781r8652Q8340
$$ y = [39701, -5155, -82322, -47268, -101886, -203320, -194889, -170462, -38593, -12611, 58120, -60461, -11897, 89665, -35757, -82434, -15891, -8632, 113155, 61012, 77696, 1166, 81360, 185792, 143457, 76516, 218711, 223511, 70981, 122383, 207674, 315636, 319676, 83212, -260138, -330580, -340204, -229976, -136790, -177121, -149004, -82062, -84944, -69388, 3045, 24675, -10757, -58998, -7015, 11540, -150600, -381733, -456923, -325392, -146563, 23830, -144052, -245342, -197261, -183603, 78728, -15385, -129669, -128060, -78024, -26261, 3978, -11623, 32310, -31566, -29798, -101951, 59301, 249826, 237277, 112476, -34517, -89739, -37623, -51953, -7618, -49067, 40171, 81885, 208937, 101966, 52801, -17980, -116632, -28292]
16057b8292m9093j66477L1800J4825O8077K0915r4909n1786m6166J14158J00148
16046h6800J16432q5979p1620J62968p9905k5038L7031m4278q0878j938o6409
16035b26414k2120j09146J03012K13569P9233o2192n5215J11382K0814m8083o5847
16024f1007j07420p288N8290J09202k9249j3771n5916k3846j3147q3855p7714
16013c05721J4507R3668n7759o3117J25642J79361L4489j16168o7414m4942j18028
16002c25482J65393K23999Q9748r5176j36504o8211J15503k3239r6107J57725
15992G649L6212q3999n9483R2578j23396r9717O7980K32637q2249K795Q6010k4028
15980E2989l6189j32J39466M055j19594J4184J05571n6924j02115l842k888q9467
$$ y = [-28292, -77385, -243862, -212062, -197237, -129160, -108245, -203154, -254940, -301106, -186948, -86800, 29632, -56347, -127967, 35001, -44904, -69942, -32911, -77189, -158067, -160005, -226414, -248534, -357680, -254668, -41099, 38134, -24058, -79273, 32109, 52923, 4840, -61007, -168427, -175715, -117425, -8223, -37472, -51243, -107159, -131005, -144152, -228007, -305721, -291214, -197546, -255305, -318422, -192780, -13419, 21070, -95098, -162512, -207454, -325482, -160089, 63910, 153658, 58482, -78022, -146233, -30730, -53969, -150076, 7649, 43861, -40138, -99621, -7043, -130439, -230156, -162176, 70461, -11788, -8993, 77017, 52989, 16800, 16668, 156134, 160189, 40595, 54779, 160350, 103426, 1311, -2531, -5419, -94886]
15968i4886N0610L7225K684m7793l7347o5852l6108l1093J74224K5530J40725
15957A17919r5047r6125k5421K1372N4902p4300k9659m6966R9394J90757K7392
15946A44218o9757j4046m8190j44603O9626P2393l3880L3618R6016n6250O5408
15935A14553J11515j36512L0096J8844k3973J53059j38685r5249J82135J15954
15925C31737n6507j61138L0139n0829j04186K0428n5612j52806j4409R1332O8427
15914e3424m740j5055P5525J17826l9632j2526j4748q6249l0039K31262L4273
15903B02473O3316j26998j25827q7645p5343M4475o8287O5858J79975r8296N6461
15892C0162J7439j14819j68228R1868J92794K3346M669M2786N2363l4035J0447
$$ y = [-94886, -44276, -7051, -4367, -52160, -89507, -155359, -191467, -222560, -48336, -22806, 117919, 22872, -73253, -98674, -77302, -22400, -96700, -126359, -173325, -73931, 116826, 144218, 74461, 60415, 12225, -132378, -62752, 9641, -24239, 9379, 105395, 49145, 114553, 226068, 89556, 119652, 138496, 114523, 267582, 128897, 33648, 215783, 331737, 275230, 114092, 144231, 93402, -10784, 9644, -45968, -198774, -213183, -121851, -53424, -58164, -73219, 2306, 120132, 80500, 67974, 53226, -33023, -63062, 168200, 202473, 265789, 138791, 12964, -74681, -150024, -105549, -173836, -107978, 71997, -26299, 30162, 47601, -67218, -235446, -143578, 49216, 72562, 77231, 120017, 172380, 138345, 148792]
15881A48792q7271j47365q3454K6767J0618O0700J55967K556N3290j54845j52780
15870a67025p6764j03169K04127K52778J7310J6083r6766j47026n3000j07105
15860b60557m0168J63077J36275j1090l0626J8766o8440L9030J71969J31947j67786
15849H2397j48767J1310K4147m6867j1271j0984O030j26319L0911J55281J9566
15838a4566k3710j2667r6874J4940M7524j2593R6564r6818J31296P0855J6800
15827A20751M025m8269Q7223P6975r3559q1658j79316k07776m4024J17090K37175
15816a1363N1476J6996j13191L2967J48430J27781k03607J7569m7000j276j37697
15805a18915j22028K6694k774m7859J34803J20605j10233R5584J42668m5527j06247
$$ y = [148792, 61521, -85844, -169298, -142531, -131913, -71213, 84754, 87310, 140600, -14245, -167025, -243789, -346958, -142831, 109947, 127257, 143340, 46574, -100452, -153452, -260557, -300725, -137648, -1373, -12463, -43089, -24323, -92763, -53733, 118236, 250183, 82397, -66370, -55060, -30913, -77780, -89051, -100035, -94005, -220324, -189413, -34132, -14566, -38276, -50943, -147817, -132877, -85353, -97946, -1382, -98200, 33096, 103951, 120751, 124776, 76507, 163730, 240705, 147146, 65488, -113828, -321604, -365628, -248538, -11363, 40113, 57109, -56082, -23115, 125315, 253096, 49489, 67058, 20058, 18782, -118915, -240943, -214249, -217023, -264882, -130079, -9474, -119707, -24123, 118545, 73018, -33229]
15794c3229j23997K2802L5721O2082Q0957K2559j65930L7966J86344l2691j6965
15783G5619j22957j10903p1576O8985L2692K3947K41350J2678k53959k5730k2883
15772a52737j86431J34747k0944J1738J01386L870m1665p6884M0400P5368j01403
15761b12555K3803O0645L8800r7437j30885N2315j25995n1327N9584Q2916r0219
15750c90355J29572R0691l2936Q9770M3803j3641j92608n6255Q7483N7608L3480
15739a53388J1205o2893k0378n4241n04P1663L1939P284M3563j03076R7371n7255
15727a88710r203J75204O5444k8875j722n4795j36172K8288P6136m6075l4897
15716a55377L8575j98845j2261K04470J39801o5437j75390K7497J63416L9968
$$ y = [-33229, -157226, -134424, -98703, -36621, 44336, 66895, -99035, -61069, 125275, 92584, 75619, -47338, -158241, -229817, -160832, -128140, -104193, 137157, 149835, -104124, -129854, -152737, -339168, -204421, -225365, -213627, -112241, -108371, -150036, -226920, -186520, -111152, -212555, -188752, -128107, -89307, -186744, -317629, -265314, -391309, -442636, -383052, -300136, -390355, -260783, -170092, -203028, -113258, -69455, -83096, -275704, -331959, -244476, -186868, -153388, -142183, -205076, -225454, -279695, -280199, -208536, -176597, -169313, -125750, -228826, -131455, -188710, -197913, -22709, 42735, 13860, 12138, -42657, -178829, -150541, -74405, -120480, -155377, -116802, -315647, -327908, -123438, 16363, -49074, -224464, -196967, -33551, 6417]
15706F417j03274Q1594j0690j55620j02370P5687J38024N5725Q0976M1916j48778
15695d0393j49221J119J25516n7208L5658j23701j25505n6665J49620R1287O9493
15684h0000M195j3236j4287K6311O2618J16868o8747n0891J5870j08341O729J92600
15672H9689o2718j29160m9860M7490m4232M3906p561o9007q6923o7734J952J87692
15660a46466J29325L9594J03406k2542o4063K2876r3006j62526l1773n939J40025
15649i1089K36900J03607k61391j42121l5167K4890J7640O068J39043M7407p6938
15638c1151l9498l5718m0750N9412K1485o5902p7310J0850J15252p8845p9787
15627b41962J9374K51421M7394l6407q3386j18300j28940o647J87139Q0007j73505
$$ y = [6417, -96857, -15263, -25953, -181573, -283943, -208256, -70232, -14507, 66469, 108385, -40393, -189614, -188495, -62979, -120187, -84529, -208230, -333735, -390400, -240780, -149493, -80000, -75805, -89041, -103328, -77017, -14399, 102469, 33722, -17169, -1299, -109640, -102911, 89689, 26971, -102189, -152049, -104559, -148791, -104885, -112446, -181453, -268376, -336110, -334158, -146466, -17141, 22453, 125859, 103317, 39254, 62130, -30876, -193402, -225175, -231114, -91089, 145811, 249418, -11973, -154094, -189261, -164371, -146731, -140663, -1620, 45787, -31151, -70649, -106367, -147117, -87705, -66220, -132122, -209432, -198582, -83330, -162175, -241962, -222588, 28833, 76227, 39820, -43566, -161866, -290806, -297453, -110314, -30307, -203812]
15616b03812m0211J39646P4685j10742K1989Q0166p380q398J2671l7089R844L766
15604f4865l2543j61923j09869M826J18386J01441p0978k7578K990J1720J02450
15593a25943j03566J06214J57408J09422K920k6238m3872j42708K3028O6954n2970
15582b9351M3231j6172j96272k7867Q9113J40036J12787j13484l9507N6745j06497
15571h7238M7455P0377K3994k02587m2724j42740M3400K75r606O0661J45969J8235
15559g4529L3711k584j05380p8882l5341o4511K02110J43145j04535j60638k963
15548b50397K867P8169p890j04215J07839K05220K37769o1399j60598R6387j25500
15537A8252r878l9491M0158M9213k71791j45273K62433J20436j31353J32935N7899
$$ y = [-203812, -244023, -104377, -29692, -140434, -118445, -38279, -45659, -54057, -41386, -78475, -68631, -64865, -97408, -259331, -369200, -364374, -245988, -144547, -215525, -243103, -240113, -228393, -125943, -229509, -123295, 34113, 143535, 146455, 120217, 76345, -66363, -43335, 23619, -29351, 13880, -2292, -198564, -226431, -137318, 2718, 115505, 2021, -37486, 19259, -87238, -39783, 30594, 54588, -147999, -190723, -333463, -290063, -289788, -299394, -238733, -92764, -74529, -40818, -43402, -148782, -227664, -263005, -327516, -125406, 17739, -86796, -247434, -250397, -247530, -169361, -177251, -281466, -173627, 31593, 269362, 207963, 47365, 143752, 18252, 8374, -31117, 9041, 58254, -213537, -358810, -96377, 24059, -107294, 25641, 83540]
15526H3540j61758o5730L9575P5211j39739j2048j1099j7412Q3200O1782j1345
15515g5823l6606O4305r4348K2485l2760o0959j23388Q0853l9693J56838Q5633
15504e3463j41677j6797r7836j55363J40470O6995m3394J9295R1771P26q497N8798
15492a38972j1411q2861O3474q0197L955J64683R906L8187K5640r8478k3517o5745
15480a95336j93280j0084O4152k7845q4365J56653J81405k05810q5814K75459
15470a24865N9264P5424q5683n1103J80144K26945j59361q9963J4685J15936k1896
15459A39527l7196P2944p3316q3112n7768J5825p3466l3723J83593K9433N8186
15448A40927J75786r6768j47115j92756l0168J4713j7007j75826l1912k0088K58049
$$ y = [83540, -78218, -143948, -104373, -29162, -168901, -180949, -192048, -209460, -126260, -64478, -75823, -112429, -48124, -142472, -119987, -152747, -213706, -337094, -256241, -295934, -139096, -53463, -195140, -211937, -309773, -465136, -324666, -257671, -301065, -281770, -189999, -189273, -197770, -138972, -150383, -233244, -169770, -249967, -246012, -81329, -71423, -33236, -7596, -106074, -129591, -195336, -388616, -398700, -334548, -362393, -446758, -290105, -108700, -314510, -400324, -124865, -65601, 9823, -75860, -126963, 53181, 280126, 120765, 30802, 45487, 161423, 139527, 102331, 175275, 101959, 18847, -38921, -23096, -96562, -130285, 53308, 82741, 140927, 316713, 219945, 72830, -119926, -150094, -135381, -152388, -328214, -360126, -380214, -122165]
15437a22165J71610M0255L398N8604o1456r3507o41n6304K1224M2628j94813o1087
15425b52254J42125K7741M3127O7202J25838L3475J9751j18121r7992m6589q781
15414f4478j09729K5410l6456J8948K8013j34128p8460J104J22678J42972N3008
15403c1118q5214K3623Q2247k80767q3666R4772J66530J25434o7512r9299k5038
15392a80008J14394R843j20310k8820k2626L02217L3316o5200j8240j56995n0702
15381a83131O4604P3302j2499M5831m6630J34131J10882j22108j20188j8138m2867
15370a16811J11024m8762j25052Q3674P0405J35444Q036o8222l2000o2710j87401
15359b32375k3878k1041N6921N5188K6599M4798J24124q5725j17240N7585J03255
$$ y = [-122165, 49445, 89700, 93098, 151702, 90246, -3261, -3902, -60206, -38982, 3646, -191167, -252254, -110129, -82388, -39261, 27941, 153779, 187254, 207005, 88884, -9108, -55697, -64478, -174207, -148797, -185253, -166305, -138292, -272420, -350880, -349776, -227098, -84126, -31118, -116332, -92709, -10462, -291229, -374895, -280123, -113593, 11841, -55671, -154970, -180008, -65614, -55771, -176081, -204901, -227527, 74690, 108006, 42806, 24566, -132429, -183131, -118527, -45225, -57724, -11893, -58523, 75608, 186490, 64382, -55806, -73944, -116811, -5787, -54549, -179601, -95927, -25522, 109922, 117958, 49736, 17736, -44974, -232375, -256253, -277294, -220373, -165185, -138586, -93788, 30336, -55389, -172629, -115044, -11789]
15348a1789R616K8175O7928m7134O2808l350j89420p3250K40745J7335J0281k0923
15336I1022r5263k5526m531j58665j0451M0050k8236j7950J06607O1061q9617
15325a31499p99J4934j28251j17242j6760J65265j5386L5132K11481R8256o3521
15314E1610K807j0425j37787M2459N5691j54459J41231n295q9092j1204J38631
15303B4167J50408k3848M3720M9493j54629m1539r800O5277j77718p301J02058
15292B0288K1724K2014p5004j16260o3209O799O6540L8221q2798O2993P9743N9326
15280D0377j2699r450j13636R132P1271J29902p083n6930O8983r2950L2869k4648
15268C5138j53351O6248K36883K9270k35879j21915j05910J15296Q8921J43543
$$ y = [-11789, -2173, 26002, 93930, 46796, 109604, 106254, -83166, -156416, 84329, 101664, 111945, 91022, -4241, -29767, -34298, -192963, -203414, -163364, -191600, -209550, -102943, -41882, -131499, -132298, -117364, -245615, -362857, -379617, -214352, -229738, -194606, 16875, 115131, 51610, 54417, 43992, -93795, -51336, 4355, -150104, -8873, -14168, -103260, -114464, 24167, 174575, 150727, 194447, 243940, 89311, 47772, 37972, 103249, -74469, -81770, 20288, 42012, 64026, -10978, -127238, -190447, -183648, -117108, -78887, -161685, -98692, -18949, 40377, 27678, 18228, -95408, -86276, -15005, 114897, 107814, 50884, 119867, 26917, 59786, 35138, -118213, -51965, 184918, 214188, -21691, -143606, -249516, -134220, -45299, 98244]
15258I8244q077k1803K4906o5845j19468n6763m1809M5361J09339K05864J72028
15247C41977m454j9755k01214k3509o6251r2300p9109J60531N0169j23245j50592
15236b07752J60816P9204n508N8407J09784K3217l9949P0531p1727q6242J7816
15225A08597M3685P2916n0908K3570j05148k28996J02287K63090K29610J64430
15215F23133R8197O5444J04874J51600J17050J8190M5159p0472l37355k13687
15205F02133p6701j7076r4383j26628p5397J18088J89142j18130j00751O5332
15195C65629Q2788J251p0572N8096J14627J28657L9604M8830Q0367P3173J11705
15184A034155K57617K23263L16837J51357l8170j06889k08639j82049l67026k33381
$$ y = [98244, 90167, 68364, 93270, 27425, -92043, -148806, -190615, -145254, -35915, 169949, 341977, 337523, 317768, 116554, 93045, 26794, -65506, -144615, 15916, 66085, -57160, -207752, -46936, 32268, 26760, 85167, 194951, 218168, 178219, 248750, 177023, 90781, 108597, 152282, 225198, 174290, 197860, 92712, -136284, -33997, 229093, 458703, 623133, 721330, 786774, 891648, 1043248, 1160298, 1178488, 1223647, 1153175, 815820, 602133, 525432, 508356, 413973, 287345, 211948, 330036, 519178, 401048, 300297, 365629, 448417, 449668, 379096, 437192, 551819, 680476, 720080, 768910, 849277, 922450, 1034155, 1291772, 1515035, 1831872, 1983229, 1945059, 1838170, 1629531, 1447482, 1080456, 847075]
15174H47075j18329o4549j94850j30747J7555K2547k58878o3736j1550P8674j7374
15163A05838o9253k10214J10900K6888m0632P3990P8487o5174r831k5508o7354
15152i1863K4643J38261J42831P4226r5423j30473j07683p4565J54932J04319
15142A39205m9748j90831j53379Q5446J29914O5098J57271M9102j08025j17015
15132G038L877j34800R955J73181N5548j32288J08826J27043q3073j48243J07995
15121I5059Q5223p9877J9932j20719l390J27690j0673o3464j39553R4046J89082
15110A93356L0449n0423q5477M4765N8673N0897k9240K0872o4671O6376o0378
15099A75199k6405q325j15622K4757o1026r850L1888j75810j04478K5378J05426
$$ y = [847075, 728746, 664197, 469347, 338600, 356155, 378702, 119824, 56088, 44538, 123212, 105838, 36585, -173629, -62729, -35841, -76473, -2483, 76004, 10830, 999, -24509, -91863, -67220, 71041, 213872, 288098, 192675, 62202, -45481, -120046, 34886, 139205, 89457, -101374, -254753, -169307, -39393, 25705, 182976, 232078, 124053, 7038, 10915, -123885, -113930, 59251, 114799, -17489, 91337, 218380, 135307, -12936, 95059, 180282, 100405, 120337, -382, -3772, 123918, 113245, 49781, -89772, 4274, 193356, 223805, 173382, 87905, 132670, 191343, 242240, 213000, 233872, 169201, 235577, 175199, 148794, 140469, 24847, 49604, -11422, -21272, 10616, -165194, -269672, -244294, -138868]
15088a38868M0274m8271o9803L6824P0823r8252j0098j0757N2470J59016J19316
15077A02674M6827L8816j8952o0880k3465L9337m6889M3316j3214j23269J5084
15066f15j1844j08813R8921K11434j6245j94693m1220L5672Q92n9459J1375L433
15054g1162q8292J51J24106N4387k2441J83717p4297j17192k548J46767J12240
15043B45436R3533k8524r5061j75608k7486R2945L0315j7325n2869J02156K589
15032A70101n5000O0250M1411k70308j61575J31058P1543j3568M9756N589n373
15021B3884K6615k8519Q4146j976j65821J87952J73918j67176m6755J06215l4740
15010A57743O3896J21075j6996l67138k04392K09507K56674R8580J17030j44824
$$ y = [-138868, -98594, -146865, -216668, -179844, -109021, -207273, -217371, -228128, -175658, -16642, 102674, 149501, 188317, 169365, 108485, 85020, 124357, 77468, 120784, 107570, -15699, -615, -12459, -121272, -22351, 189083, 172838, -21855, -63075, -27403, -26511, -85970, -74595, -71162, -159454, -159303, -35197, 19190, -3251, 180466, 106169, -11023, -13571, 133196, 245436, 338969, 310445, 215384, 39776, 12290, 105235, 135550, 118225, 65356, 167512, 170101, 115101, 175351, 216762, -53546, -215121, -84063, -12520, -26088, 23668, 29257, 23884, 50499, 21980, 106126, 104150, -61671, 126281, 300199, 133023, 86268, 192483, 157743, 221639, 342714, 325718, -41420, -245812, -36305, 220369, 318949, 435979, 291155]
15000B91155j69866R8818l7667j36555J63892K36472J6492j92295k78184k3665
14990c1403j2054P609N5886j01696N9466j25309J00608K06920K10169J62799J2762
14979E45757j68206M6345L1963J83722J0866j27203j81400k2299k643k00115l7492
14968G9295J8438J17830M1176p2622k2517N5493J06615j21067Q511L7400j19046
14957A29506r5076n7603K4018J9008M2440l4952O5649K3108j3781l9568m7980
14946A4769r3078j71229N4256O1285r8473m4239L6870K22626K62650J08483p6597
14935B77323j04703K5573L7137n1338J04079k8177j09829l480r5930j12572q126
14924g0043O7816L7615Q2116q2597j06305j27885j25089O8690J34720O5118m9150
$$ y = [291155, 121289, 220107, 182440, 45885, 209777, 446249, 462741, 270446, -7738, -31403, -43457, -35848, 20038, -81658, -22192, -147501, -46893, 160027, 370196, 532995, 545757, 377551, 423896, 455859, 639581, 650447, 523244, 341844, 319545, 316902, 116787, 79295, 97733, 215563, 256739, 184117, 161600, 217093, 323708, 202641, 211152, 248552, 129506, 34430, -23173, 845, 19853, 62293, 27341, 92990, 116098, 102317, 62749, 14769, -78309, -249538, -195282, -133997, -232470, -276709, -239839, -17213, 245437, 353920, 277323, 172620, 198193, 235330, 183992, 288071, 259894, 150065, 146585, 50655, -61917, -70043, -2227, 35388, 117504, 34907, -71398, -199283, -324372, -255682, -120962, -55844, -104994]
14913a04994j9723K9736J17520n6940L9121N7487j06727M6118J00505R3494P0309
14902B65906m1810j75705J03091K5627J00428J55311n32j39576J1047q717n851
14891B89219n5563L4389K1377P1546l2777M0933p2716l5735k18104j54470n4628
14880a66529J43594K05536J37169K1430M4792P6800K1407j33011j7807P4284M6374
14869D54039m264J6431l5069L5139P9219P5681r1784L6609j0278J49657k5255
14858F80125j52276k8664P4072j75473p5733J88926N6962M586J17091J58537J31242
14847I79395M4373p5302j39906j9572J46890k1050j5896J50343l013j08359J8783
14836I56686L9765r8618L207J95464L7093k6905K409Q8126J24805J48067L9133
$$ y = [-104994, -124717, -94981, 22539, -34401, 4720, 62207, -44520, 1598, 102103, 195597, 265906, 224096, 48391, 151482, 177109, 277537, 432848, 432316, 292740, 303787, 295070, 289219, 233656, 268045, 289422, 360968, 328191, 369124, 296408, 260673, 42569, -111901, -166529, -22935, 182601, 319770, 341200, 385992, 462792, 484199, 351188, 333381, 407665, 454039, 449775, 466206, 431137, 466276, 545495, 621176, 529392, 566001, 555723, 705380, 680125, 527849, 499185, 573257, 397784, 322051, 510977, 567939, 572525, 689616, 848153, 979395, 1023768, 948466, 808560, 788988, 935878, 914828, 898932, 1049275, 1046262, 937903, 956686, 996451, 897833, 901040, 1096504, 1133597, 1106692, 1109101, 1197227, 1322032, 1470099, 1509232]
14825A509232j03175o1973J15088J28787J18203k0736o2340p3518N4994J97862
14815A802424O2076L5525N776N059J1969J59857O5047K02116K4385o5211j04611
14804B204412p1574J67224K12281J61584O8642Q1755J85998K01156J97010J14383
14794C522871J59088J55316K50764P9790l8331r1528J13007K23282K08044K84697
14784D867000L61240K93028L75558M66508L69035L59957M79283P62358P27105
14775I061072N78690R17415R33343Q21102J161027J452474J797875K075970K652650
14766B1451618K864570L215432M043109M789962N852234P584528R860380J2959423
14758G2621256J6866214K1422936K5719169K8943898K9201906K6364955J9655923
$$ y = [1509232, 1406057, 1344084, 1459172, 1587959, 1706162, 1685426, 1623086, 1549568, 1604562, 1802424, 1864500, 1900025, 1905801, 1910860, 1922829, 2082686, 2147733, 2349849, 2374234, 2309023, 2204412, 2132838, 2300062, 2512343, 2673927, 2742569, 2824324, 3010322, 3211478, 3408488, 3522871, 3681959, 3837275, 4088039, 4167829, 4129498, 4037970, 4150977, 4374259, 4582303, 4867000, 5228240, 5521268, 5896826, 6363334, 6732369, 7092326, 7571609, 8333967, 9061072, 9639762, 10557177, 11490520, 12311622, 13472649, 14925123, 16722998, 18798968, 21451618, 24316188, 27531620, 31574729, 36364691, 42216925, 49801453, 59661833, 72621256, 89487470, 110910406, 136629575, 165573473, 194775379, 221140334, 240796257]
14751B40796257J0189654o81109j0703662j8325153k3216564k5196118k4415807
14744A48447498k1659051j8264729j4381337j0784851p753278n059450l215680
14737F7329122j599655M51464K481348M947068Q732434J4374010K2632969L2986840
14729A52335600M3352816N1857849N5702281N2477652M1003183K2424444K45738
14722D19399563k0992273l7436200m7368950n1214265m9609580m4236334l6489907
14715A32052054k7739402j9752579j3336177q640945n389772l457719k489727
14708E1245733j963928j616379j894446k453549k800348l254292l568739l711130
14700B9982922l333292l020737k764189k365558k086032j811010j419694j253232
$$ y = [240796257, 250985911, 250304802, 239601140, 221275987, 198059423, 172863305, 148447498, 126788447, 108523718, 94142381, 83357530, 75604252, 70544802, 67329122, 65729467, 66180931, 68662279, 73609347, 82341781, 96715791, 119348760, 152335600, 195688416, 247546265, 303248546, 355726198, 396729381, 419153825, 419399563, 398407290, 360971090, 313602140, 262387875, 212778295, 168541961, 132052054, 104312652, 84560073, 71223896, 62582951, 57193179, 53735460, 51245733, 49281805, 47665426, 45770980, 43317431, 40517083, 37262791, 33694052, 29982922, 26649630, 23628893, 20864704, 18499146, 16413114, 14602104, 13182410, 11929178]
14692A1929178j138246r53574p63046q83191m59372k70498m58333m76200l76325
14683F150393j82829k59669l38343m29497l45459j96684K1005j60560j36892N1111
14673D172576n961p9976j23675j81474o8909j40990j08002R8941j2715j21695
14663C428120o284J22792P2722N6991J21085J21894P8219K78948K07171L10244
14653D791902L87463O05717M88256P23359Q44470Q82541R71330O74815N30948
14644A0900801K23001k48560n36594p99978p77028q24689q94237j021867q28825
14635E192024q09712q97996n43140l25559p1702j06073k20732j60751j13959l8520
14625A903880p0754j00929k69288k21174o091R2661L0375q2254m1043M9325P9739
$$ y = [11929178, 10790932, 9837358, 9074312, 8191121, 7731749, 7461251, 7002918, 6526718, 6150393, 5967564, 5707895, 5369552, 4940055, 4594596, 4397912, 4418917, 4258357, 4121465, 4172576, 4166615, 4086639, 3962964, 3781490, 3712581, 3571591, 3463589, 3562530, 3549815, 3428120, 3421836, 3544628, 3617350, 3674341, 3795426, 3917320, 3995539, 4274487, 4481658, 4791902, 5179365, 5785082, 6273338, 6996697, 7841167, 8723708, 9695038, 10369853, 10900801, 11123802, 10875242, 10338648, 9538670, 8761642, 7936953, 7042716, 6020849, 5192024, 4382312, 3484316, 2941176, 2615617, 2543915, 2437842, 2217110, 2056359, 1942400, 1903880, 1833126, 1732197, 1462909, 1241735, 1235644, 1328305, 1358680, 1276426, 1235383, 1284708, 1364447]
14614A364447k74282j47866O8869q0796j75528r8709N1426L8134R0960L2272m8519
14603H20408J55590O1402p4762M9144q705r1037J9479J08942l4330j45183R1167
14592I52115O9783r2802j40381j90884j08545n0520M1464o890J64880L9394j2113
14581F65501j07185j53358J4861J12132j4555J28293J36007q8740l9721j1232
14571F42003L1045N960j01880j47243N2759j5634m4393j1614J36433R6634j8509
14560F25561J28715M0227j80m3827j8746J17352l9893l7601j7106K2874J60017
14549I37393K2101J17756K55623L47095K52515j19925j85060j62081k12690j85448
14539A067279j36914j15421j39425j46331o9151M1702q0473P0904L2981m0252
$$ y = [1364447, 1090165, 942299, 1011168, 930372, 754844, 656135, 707561, 745695, 836655, 868927, 820408, 975998, 1037400, 962638, 1011782, 1003077, 912040, 931519, 1040461, 1006131, 860948, 952115, 1021898, 929096, 788715, 597831, 489286, 438766, 480230, 473340, 638220, 677614, 665501, 558316, 404958, 419819, 531951, 517396, 645689, 781696, 692956, 653235, 642003, 673048, 679008, 577128, 429885, 482644, 467010, 422617, 411003, 547436, 644070, 625561, 754276, 794503, 794323, 750496, 731750, 849102, 809209, 771608, 754502, 777376, 937393, 959494, 1077250, 1332873, 1679968, 1932483, 1812558, 1627498, 1465417, 1252727, 1067279, 930365, 814944, 675519, 529188, 460037, 501739, 421266, 492170, 525151, 484899]
14529D84899J71335o1411k17346n0467q6390j2458J89290n5050L3933j14790J2859
14518B94404r9497K0441Q4689K2989p7719j02730r010R5062Q8747J8318o0445
14507B75249j05322o5038M3032J9457M9227J67238q1101j31671j2109r0443j90658
14496a22139j808K6051j69566Q8365J96815K279K8912l7557j5722N9876M9377
14485A04883J64583K4222j7073l4372j18210j13953J39863O4378k5782j44304
14475D4235j05566o4598J605l0456p1387M3769K11105J89331K9454j49290k8595
14464F9607l4894L2962M0385l0960O521j34722J28704L41415K4613q5219j22809
14453B35603k26042j21979J8271n3k0817J47002J00432N6539K1345j84073n4531
$$ y = [484899, 656234, 594823, 377477, 327010, 240620, 228162, 417452, 362402, 396335, 281545, 294404, 194907, 215348, 300037, 323026, 245307, 142577, 133567, 228629, 317376, 335694, 275249, 169927, 104889, 147921, 167378, 216605, 383843, 302742, 171071, 158962, 68519, -122139, -123947, -97896, -267462, -179097, 17718, 19997, 48909, 11352, -4370, 55506, 104883, 269466, 293688, 276615, 242243, 124033, 10080, 149943, 214321, 188539, 44235, -61331, -125929, -124324, -154780, -226167, -182398, 28707, 218038, 247492, 98202, 69607, 34713, 67675, 108060, 77100, 83621, -51101, 77603, 419018, 443631, 358412, 235603, 9561, -112418, -94147, -94200, -115017, 31985, 132417, 188956, 210301, 26228, -28303]
14442b8303j1650K1931N2418n540J42004K19105l423K7016p1653j71134j49850
14431B0921m6086r4738J27634J48338L6634j36814j35239J49130J51432O53j96780
14420B5085j43389J31630J30952R2357K2093m4583k09873k0428J6722J19103J65191
14409B84860k8205j98439l7854j43302p2236n3123q3998J80745K28167J78690
14399B55305l3898r1574n9121P133L2689K12856m4352j74326j56884p9850j04759
14388b36781O3049R8725Q5986n2750j2916q6147P1066o1447o5299O7904Q2568
14377d6042L2801n4898L528L4218p5928l354O744R8479J37038k6677j07274j28088
14365a29453N5773J94899L7013j64784j1860L6072m249K2819J25875R848o2506
$$ y = [-28303, -39953, -18022, 34396, 28856, 170860, 389965, 386542, 413558, 341905, 170771, 20921, -25165, -119903, 7731, 156069, 192703, 55889, -79350, 69780, 221212, 221865, 25085, -118304, 13326, 144278, 236635, 258728, 214145, 4272, -16156, 566, 119669, 284860, 256655, 58216, 20362, -122940, -195176, -248299, -332297, -151552, 76615, 255305, 221407, 129833, 70712, 77845, 110534, 323390, 279038, 104712, -52172, -132022, -236781, -173732, -75007, 10979, -41771, -54687, -140834, -69768, -131215, -196514, -128610, -46042, -13241, -68139, -64611, -30393, -106321, -109675, -102931, -4452, 132586, 105909, -1365, -129453, -73680, 121219, 158232, -6552, -18412, 17660, 13411, 36230, 162105, 171953, 109447]
14354A09447k9007k00620l036J18997P6926j12849j45983j42280N8059j12400
14344c82746P630L1089R5780J25335K08573J55635j11808j71525j50323j93266
14334c85626j0721K17602J59329j15415q3191K35016P4255j27921l6445l2590
14324a05707J72907q0023j24348R1883N5102P771N0050J01808K23807N6051j9377
14313D29924j63054p9841L8664j6848L2160R2936j84404q6919J8123R4992J05734
14302B81467r5807L0991N6883m8930l0369j30530j31806K00428K96640J87304
14292F16271K9011J22159J73526l0384q1686o1482j7627J55099J21071J63915
14282A189873j55546j62538L7559m1438n4269j84686j78055L8633P4337n1482
$$ y = [109447, 80440, -120180, -123216, -4219, 72707, -40142, -186125, -328405, -270346, -382746, -375116, -344027, -248247, -122912, 85661, 241296, 129488, -42037, -192360, -385626, -396347, -178745, -19416, -134831, -218022, 16994, 91249, -36672, -73117, -105707, 67200, -12823, -137171, -45288, 9814, 17585, 67635, 169443, 393250, 449301, 429924, 266870, 187029, 225693, 208845, 241005, 333941, 149537, 62618, 80741, 175733, 281467, 185660, 216651, 273534, 224604, 194235, 63705, -68101, 132327, 428967, 616271, 645282, 767441, 940967, 910583, 828897, 767415, 749788, 904887, 1025958, 1189873, 1034327, 871789, 909348, 867910, 813641, 628955, 450900, 489533, 563870, 512388]
14272E12388k38515P7091J46442R7201K03933P886n9491J68664M9988Q3581L73161
14261A422329K40031k4304K20161R7802r7355r0648k7723k10229j95363j29327
14251A205374j83045j71850k7127l24309k83701p618J03665P263K328N0698m8897
14240C22781o5648p9178P6297j27666m8339l9263K7959q5837j04446M5998j4456
14229i1798l5430l3326k3767P106K13929K5517l6551j204P4225l5895l4359J1956
14217D0403K444M5781j71076j02407J16517J13504J1971r717K2849O9892J14329
14206B54490l7312j31550J42858J1607j72282k9504M3786J43761r782m2668j24925
14195D8479j48085R3345m894N5869N3679q7816N8346n1439j13340j4691L314L4
$$ y = [512388, 273873, 350964, 497406, 594607, 798540, 806426, 746935, 915599, 965587, 1049168, 1422329, 1662360, 1638056, 1858217, 1956019, 1858664, 1768016, 1740293, 1530064, 1334701, 1205374, 1022329, 850479, 823352, 499043, 215342, 207724, 311389, 318652, 320980, 371678, 322781, 257133, 177955, 254252, 126586, 78247, 38984, 66943, -18894, -123340, -77342, -91798, -127228, -160554, -184321, -177215, 36714, 62231, 25680, 24476, 98701, 62806, 28447, 40403, 42847, 88628, -82448, -184855, -68338, 45166, 57137, 47420, 70269, 140161, 254490, 217178, 85628, 228486, 240093, 67811, 38307, 82093, 225854, 216072, 173404, 48479, -99606, -6261, -11155, 44714, 98393, 10577, 68923, 17484, -95856, -110547, -107233, -107199]
14183a07199r893R1636J68174m9982k49525m6026m3233k8920Q3215R3920J13424
14172A5591J8279J00356l253r3348k00576m4439L9538N1659N4215J72508j35728
14161b5198O8492O4255j08477j91007m0377J27284l4143p0305M0665N7352j47688
14150b59147K1014J35451J06369J8605m9361L071j17272P788k1433m4134R436
14139a89613K16792J79304l1417q8421r3849j93174P0624n7572j9860L8662q05
14128a69329o2928j20540K48179O1346J06702K1322k21029j03190K04855K10651
14118A76039j27617n5321o0228p440j77565P1552K04541L3986L4034o0385o3402
14107c1806Q5025l4215q5128K1547q901o1934J12529L0402J31224l853j20429
$$ y = [-107199, -117092, -25456, 142718, 92736, -156789, -202815, -246048, -274968, -191753, -97833, 15591, 33870, 134226, 130973, 37625, -162951, -207390, -167852, -116193, -61978, 110530, -25198, 43294, 107549, -928, -191935, -232312, -105028, -139171, -209476, -168811, -111459, -259147, -238133, -102682, 3687, 22292, -27069, -23998, -141270, -133482, -154915, -199049, -189613, 27179, 206483, 175066, 86645, -7204, -200378, -129754, -187326, -207186, -168524, -169329, -232257, -352797, -104618, -43272, 63430, 84752, -136277, -239467, -34612, 176039, 48422, -6899, -67127, -74567, -252132, -180580, 23961, 57947, 91981, 31596, -31806, 53219, 19004, -66124, -44577, -53478, -115412, -2883, 27519, 158743, 154890, 34461]
14096C4461l1350l8399N6877J3485l0005m0451M0537R1429o0071k5594L711j15115
14084a00485j06110J34937P6675P2959l9148m396j59433j4734k9206L0316k6003
14073a64628K60413J75559l8265n9455l6914k09671k70506R3476O098M1288N6194
14062a46411j9107l5683Q5102L5257n7992l2584o096q375P3480J14323P5348j36079
14050e8817j64241j36717R2350l7497r3317M2948J96872J12944j7553L8648Q0113
14039E5733j08357n9793J05860O120n1858l8558p8679J52494J29776j1041j20692
14028a8995J062N1102N8127p7564p0141J19117J09976j6704r9695q956j4642j27012
14016i4325j2464p2877j10996p0941m788J10159K60798J04285j630n8795j57091
$$ y = [34461, 3111, -35288, 21589, 35074, 5069, -35382, 5155, 96584, 36513, 10919, 14630, -100485, -206595, -71658, 5017, 77976, 38828, 34432, -125001, -139735, -168941, -138625, -164628, 95785, 271344, 233079, 173624, 136710, -72961, -343467, -249991, -243893, -202605, -146411, -165518, -201201, -116099, -80842, -138834, -171418, -177514, -185889, -112409, 1914, 77262, -58817, -223058, -359775, -267425, -304922, -398239, -355291, -158419, -45475, -63028, -24380, 55733, -52624, -112417, -6557, -437, -52295, -90853, -169532, -17038, 112738, 101697, -18995, -17933, 33169, 91296, 13732, -56409, 62708, 172684, 155980, 56285, 47329, 32687, -94325, -106789, -179666, -290662, -361603, -366391, -256232, 4566, 108851, 107221, 48426, -108665]
14005a08665j21758j09554J87945J03270o9613N9347J85046j59258L0807L9027
13995C6594P3275k1967j49515L1663j5084p7796N9147R3715Q6058L9202K0882
13984A76174K341j16115J4788J27630J81028r6652k88055o451j67636r6062J5821
13973b53189J51060P2973m9887j34530J74551j37891q650L7576L1981Q5997o52
13962c0661R0786j5651j50427J3590J24994q0200r3577R4467j11391O491J08159
13951d3420k3020r1696r3486j7686J87235J16704J15554j24579M4783R0918J35719
13940B97026j21518p2550M7629l833j30708j6564n1403J5638P0835m076J0321
13929D0797J2985J1958j17270N3498m5287n4093K1356Q839p5942j3881J67298
$$ y = [-108665, -230423, -339977, -152032, -48762, -118375, -59028, 126018, -33240, -2433, 36594, 109869, 87902, -61613, -29950, -45034, -122830, -63683, 30032, 116090, 155292, 176174, 178515, 62400, 77188, 204818, 385846, 289194, 1139, -5312, -172948, -269010, -253189, -102129, -29156, -79043, -213573, -39022, -176913, -185563, -147987, -116006, -30009, -30661, 60125, 44474, -105953, -92363, 32631, -47569, -141146, -46679, -158070, -151579, -43420, -66440, -158136, -251622, -269308, -82073, 34631, 150185, 25606, 70389, 161307, 297026, 175508, 102958, 150587, 146754, 16046, -518, -51921, -36283, 34552, 30476, 40797, 53782, 65740, -51530, 1968, -43319, -97412, -76056, -67217, -143159, -157040, 10258]
13918A0258J88138N5110j38446j71947j01597L5353J26226K9285n096r1459k40630
13907c04805j0383m3787J59186J79719m4433K0434j28813p3061J27462J7149p1878
13896a73210Q3128K0953M8651j86985L8924n445p7531o4672J46573J22538q3917
13885a30993o842K6777N8317O8399M360q2265l7057q4889l5297j00500r135R3612
13873b35513N9457l0463o7027P5974J93826R7596Q3159l2310o0548l1381p5694
13862b2924o2288j6718m5296m8771n1284j8088J61288J008K31257P7052j92865
13851A2371r3145K4929J07552m3932l9990Q1289J67929j02178q8949L9465n2610
13840A2731L949L2295k40656l3430O6796J5473P3478P6498Q2510M1439K2645m4148
$$ y = [10258, 198396, 253506, 115060, -56887, -158484, -123131, 3095, 32380, 27284, -64175, -304805, -315188, -358975, -199789, -20070, -64503, -44069, -172882, -245943, -118481, -101332, -173210, -90082, -69129, -20478, -207463, -168539, -173984, -251515, -316187, -169614, -47076, -130993, -137835, -111058, -52741, 15658, 20018, -62247, -99304, -184193, -219490, -319990, -329125, -235513, -176056, -206519, -273546, -197572, -3746, 93850, 177009, 144699, 84151, 52770, -22924, -85212, -101930, -147226, -195997, -247281, -265369, -104081, -103073, 128184, 205236, 12371, -80774, -55845, 51707, 7775, -32215, 49074, 217003, 114825, 25876, 65341, 12731, 16680, 48975, -191681, -225111, -158315, -142842, -69364, 7134, 89644, 131083, 153728, 109580]
13828A09580m3412R31M6645J7334j27617P5917m6283J41152J52439j98067J12776
13817B41395o7377r883l7192j06815P5133o4924n8488K872Q1918L7111K1295j15291
13805b46L6647J03748k46725j43786P4272R9515j8299P767J2211l6334L9026q7340
13793a59544o228J19662m9477j62223J01275J00095j48404p9384j64216N7100
13783c91344R1665J81616J09551N2425l0799r7376n2931J24764J12109O6225r8363
13772F7542M2358L6064J142l3138m8692J37494J00884M0468k37305l2701q7144
13761a3028j68885M9891n3012j7703M6794K22883Q9556r6322l7098J1589M9587
13750H4252j00262j36392Q4346P8364M0212j47106r9675J20783J72618J77080
$$ y = [109580, 66168, 67099, 113744, 131078, 3461, 79378, 33095, 174247, 326686, 128619, 241395, 174018, 164135, 126943, 20128, 95261, 30337, -28151, -25279, 56639, 93750, 115045, -246, 36401, 140149, -106576, -250362, -176090, -76575, -94874, -87107, -74896, -111230, -72204, -159544, -165772, -46110, -95587, -257810, -156535, -56440, -204844, -284228, -448444, -391344, -299679, -118063, -8512, 43913, 13114, -84262, -137193, -12429, 99680, 165905, 67542, 109900, 145964, 147106, 113968, 65276, 202770, 303654, 344122, 106817, 74116, -13028, -181913, -132022, -185034, -202737, -155943, 66940, 156496, 60174, 23076, 34665, 84252, -16010, -152402, -68056, 10308, 50520, -96586, -196261, -75478, 97140, 274220]
13740B74220o2397J08586K106M9903Q6637K8987J0938j1091R7850n8575Q700o7878
13728D67986k7356j13964l0974m8387K360J34643p8745j76581j05880J35449q0380
13717G8171k2497J49N1556M4251j79091J1045N3101L7122k61295r0136J78198
13706i9426J30925j05247j39489k67J65560l8247l005j7157O0980l6018J07602
13695B6211r2938j886l2496n0943n6433j5260J86551Q8951L0459N3720k13355
13684g7419j9500R4063j5296K631k6045J8108J3297j68888K7016P7324J06267
13673C1558j8459J39802J45559m1465J389M2869j12499m7835j28416P6729j2152
13662G7080o5664J26007O6026O5787M3045j34120j44964o6882J2290K2557k3870
$$ y = [274220, 211823, 320409, 322515, 372418, 459055, 488042, 498980, 487889, 585739, 527164, 535864, 467986, 440630, 326666, 295692, 247305, 249665, 384308, 305563, 128982, 23102, 158551, 78171, 55674, 55823, 107379, 151630, -27461, -16416, 36685, 73807, -187488, -277624, -99426, 31499, -73748, -213237, -213504, -47944, -86191, -89196, -106353, -45373, -81391, 26211, -66727, -68613, -101109, -152052, -208485, -223745, -37194, 51757, 82216, 135936, -77419, -96919, -2856, -18152, -15521, -41566, -23458, -10161, -179049, -152033, -74709, 31558, 13099, 152901, 298460, 256995, 258384, 301253, 188754, 140919, 12503, 89232, 77080, 11416, 137423, 203449, 269236, 312281, 178161, 33197, -33685, -21395, 1162, -22708]
13651b2708L4737N83k0213j23854j67086J05188J58013k0236J28739J62339j83554
13640E1948j69140Q3915n1400O7715J3835L0249j6483N7633M457J30198J21086
13629C24013j12747j53737l836o1686M5994K1323q6775J7942K270J743j28590
13618a34086L4236K26906J74612p1524j54372L3746N1039n5893r9457O1389K46475
13607C13071J27138p9006n1843J38356o6196j47462k27793n0918j2312L4240J35906
13596A13181P3746o0174k23294k4615N6960j3637K5644p7026O896J00332J14645
13585I2658k4780M8815n7917o8572j193K2892n5846n4515P8603Q3193M1250L3355
13573A37943M4947k5060j65208j03861j60194Q5225P0481j18325j08449N3123
$$ y = [-22708, 12029, 12612, -7601, -131455, -298541, -193353, -35340, -55576, 73163, 235502, 51948, -117192, -33277, -84677, -16962, -3127, 27122, 10639, 68272, 72729, 202927, 324013, 211266, 57529, 53693, -7993, 38001, 59324, -27451, -9509, -7239, -5496, -134086, -99850, 127056, 301668, 230144, 75772, 109518, 160557, 104664, 5207, 66596, 313071, 440209, 361203, 309360, 447716, 381520, 234058, 6265, -44653, -56965, -22725, 113181, 186927, 126753, -96541, -121156, -64196, -77833, -52189, -129215, -122319, -21987, 92658, 67878, 116693, 58776, -9796, -10989, 11903, -43943, -98458, -19855, 63338, 104588, 137943, 182890, 157830, -7378, -111239, -271433, -186208, -115727, -234052, -342501, -289378]
13563b89378J84209Q2966L7782P5660j594j16901O2882L9562J14115j5209n3326
13552A20768j14101o7581O641p3478Q1413J00469j6580m1240k3825L1313k8604
13541b4805K7775r404j22830L2480j9689o5905J84620K11751O3744j8942j47383
13530A11412j93620j87681P3095J95898q5248Q555J16198K184j54648q1135J41376
13519e3614N5119L3113J14382K4196j36333j60084P8532m09p9114L5112J08909
13508A9809J53808j3485l7842m5631K6505K35793k6511k46175o2837o3284j199
13497f1049J93149R3597o0009k18727Q171J03765j9916N1606m6126j02965l5980
13486i4484M1797O6021j32031q4936l3774J61965Q3311J09208J21834O8694K1592
$$ y = [-289378, -105169, -22203, 15579, 91239, 89645, -27256, 35626, 75188, 189303, 174094, 120768, 6667, -60914, -54273, -127751, -46338, 54131, 37551, -3689, -27514, 3799, -24805, 2970, -6434, -129264, -96784, -116473, -182378, 2242, 213993, 277737, 258795, 111412, -82208, -269889, -196794, -896, -86144, -77589, 38609, 40793, -113855, -194990, -53614, 1505, 34618, 149000, 173196, 36863, -123221, -44689, -45098, -124212, -89100, 19809, 173617, 160132, 122290, 76659, 103164, 338957, 312446, 66271, 3434, -59850, -61049, 132100, 225697, 165688, -53039, -44868, 58897, 38981, 90587, 44461, -58504, -94484, -52687, 13334, -118697, -203633, -237407, -75442, 7869, 117077, 238911, 307605, 329197]
13475C29197n4659k0187q1885k32672P4033J77701J23330J06241L0119j80744
13465B70474k39161j26072J30061M5904n5714n2223j26092p9105O9821m5987R113
13454a98981J24411J72308N1711J01909n1559o8409k05369J47328J35003m6618
13444A61734j8218M6014l4722l5976k9157q3914p9178r7284J05881k4489o530
13433i5839K5008J16744K930L5851J24863p9503j98579j44779J58420K68219R7087
13422C10422k86065q9836n1798O027J28788O7744k32420p9533Q2976Q2535j280
13411f2440P5115J9814j481j97445j9409J03224M2810P7786J6636l8573o6455
13400e0418n6372o1010M1847K42307M3876m24M8933j33366m2869j19179j50669
$$ y = [329197, 274538, 254351, 172466, -60206, 13827, 191528, 314858, 421099, 451218, 270474, 31313, -94759, 35302, 81206, 25492, -26731, -152823, -231928, -162107, -208094, -198981, -74570, 97738, 149449, 251358, 199799, 131390, -73979, 73349, 208352, 161734, 143516, 189530, 154808, 118832, 89675, 5761, -73417, -170701, -64820, -89309, -95839, -70831, 45913, 48843, 84694, 209557, 130054, -68525, -213304, -54884, 213335, 310422, 24357, -65479, -117277, -111250, 17538, 85282, -147138, -226671, -143695, -61160, -62440, 12675, 32489, 31008, -166437, -185846, -82622, -39812, 37974, 54610, 16037, -50418, -106790, -167800, -125953, 116354, 160230, 159806, 208739, 75373, 32504, -86675, -237344]
13389b37344O8961O4460J06601J15462K1914L064J1421m8482j24231l5600P9507
13378B5733J5058N682K0339j44407p2893n5010N6284O6693l4079n8325J07218
13367f7707J5000L0062M4828Q306p552n2161j06285k2535k8226J5685J65924M6352
13355D1691J15482n0749j90200o5084J72459j2834M5732k8776k0817j09747j15964
13344b18807Q1249Q7710J68319J9840m452O6024j08805j06813j99396j5073J45839
13333h4365J41557J65451j13064r3863J02577P6591M0284Q431j34571r2248j10655
13322i3875K881J13422l2366j43011J6717K9938k3519R7380M4226J9687O0528
13311I2008Q583j95943N0172J19739J88813m0090j91908J33825O0151p5662M1667
$$ y = [-237344, -168383, -103923, 2678, 118140, 140054, 143118, 154539, 106057, -18174, -53774, 25733, 40791, 46473, 66812, -77595, -150488, -205498, -149214, -82521, -116600, -174925, -67707, -52707, -22645, 22183, 30489, 22937, -29224, -135509, -158044, -186270, -170585, -4661, 41691, 157173, 106424, -83776, -148860, 23599, 10765, 56497, 27721, 6904, -102843, -218807, -137558, -49848, 118471, 138311, 133859, 199883, 91078, -15735, -215131, -230204, -84365, 57192, 222643, 109579, 15716, 118293, 194884, 235168, 243599, 109028, 16780, -93875, -90994, 22428, -9938, -152949, -136232, -106294, -129813, -32433, 11793, 31480, 92008, 100591, -95352, -45180, 74559, 263372, 223282, 31374, 165199, 225350, 149688, 191355]
13300A91355q3322K7036L3183J27641p9719j84701O7342n6137o1750L3383m6587
13289c2276J392j6407q7781j58043K9044L14097j8347j22278P094p3274l9541
13278a96320J01955p8994N651K35519j13319n6772K5817j05489J15927P3800l5709
13267b7934M8638K06021j26117j99583r7240K8970m0490p5988K30273K30935K8659
13256B06144r2104P5877k6634j32050o9430P6078j56983M2506N7609P9420q0295
13245a9862K7623k9329m5239q0899L0320L7389P062J33459O4131P2405j76427
13234B0633j03485j00338Q9374o2561m8442l129k12520J17807K53400N9040K01369
13223B11148J17581r8624q2492j68941j54035J00784k526J33339P4330N1286o6137
$$ y = [191355, 108033, 135069, 168252, 295893, 216174, 31473, 98815, 42678, -19072, 14311, -32276, -30884, -47291, -135072, -293115, -264071, 50026, 31679, -90599, -83505, -156779, -196320, -94365, -173359, -167708, 67811, -45508, -102280, -76463, -181952, -66025, 7775, -27934, 20704, 226725, 100608, -98975, -196215, -167245, -207735, -283723, -53450, 177485, 206144, 114040, 189917, 163283, 31233, -38197, 37881, -119102, -76596, -18987, 60433, -19862, 7761, -21568, -66807, -147706, -117386, -79997, -72935, 60524, 124655, 197060, 20633, -82852, -183190, -93816, -156377, -204819, -207948, -420468, -302661, -49261, 9779, 211148, 328729, 230105, 147613, -21328, -175363, -74579, -77105, 56234, 130564, 181850, 115713]
13212A15713N1055n6427p9262P7172K8465N5092j81166q4638O4406j02898j5283
13201a27771J02693J8143K9715n145Q1363L0328l1294M5785p3028n1916L3506
13190E2379R0146R2072o6020k36875O8812R4206Q0785J1852j60766M242J42863
13179A73696n9055j333j8792j3898R9855j59762j12367L8329m4167k6102J32263
13168H667L7678M0829m0728j4315k5312J26968K10708j04758j33282L9122J7197
13157A62774n5764R6738n3096q1310o3189J25946J22895J46377l3249k6737m9855
13146B91530o2849R4059o8351j33313J8834N9809j08333q8729o3461K6958J27812
13135I3966L7654l9531N16J5454J9313l0842M3270O0873m0748p7814k09144r3704
$$ y = [115713, 166768, 110341, 31079, 108251, 136716, 191808, 10642, -73996, -9590, -112488, -127771, -25078, -6935, 22780, 17635, 98998, 129326, 98032, 143817, 70789, 18873, 52379, 142525, 234597, 168577, -68298, 514, 94720, 175505, 187357, 26591, 30833, 173696, 114641, 113308, 94516, 80618, 180473, 20711, -91656, -53327, -97494, -123596, 8667, 46345, 87174, 46446, 32131, 6819, 133787, 344495, 239737, 106455, 145577, 162774, 107010, 203748, 150652, 69342, 6153, 132099, 254994, 401371, 368122, 341385, 291530, 228681, 322740, 254389, 121076, 139910, 199719, 91386, 2657, -60804, -33846, 93966, 131620, 92089, 92605, 108059, 127372, 96530, 139800, 200673, 159925, 82111, -127033, -220737]
13123b20737P7942l5978J59722Q4466l7854j02564N7489R3514K1131m9048j27370
13112g9287n2774M0536Q849j431J1782J0182j1425k8075N9369J4391j4345q1091
13100a23319P6490J2089q8924q2629J13982J49395N5314q927j67713k03796J44383
13089a23655O3479J0161J17935n7170q1681J4967j18032j3714N3157J62788J3098
13078D1333K3692N999J02481K455j42434j04084K3531J54210l4024j76908N6931
13067d6818K58351o3991p1178J227Q176k6529r4091k8428J13380Q0891l4084n5758
13055D1148j04660N6746L4643J17139j05570q9469N3837K11496P7375j68854o9487
13044E4344Q9082R7489J37023K3110j45296j15981Q3562m3028o3321l3190m8817
$$ y = [-220737, -142795, -178773, -19051, 65415, 27561, -75003, -17514, 76000, 97131, 48083, -79287, -132061, -91525, -82676, -84107, -72325, -62143, -73568, -101643, -42274, -27883, -42228, -123319, -46829, -34740, -123664, -206293, -92311, 57084, 112398, 103471, -64242, -268038, -123655, -60176, -50015, 67920, 10750, -70931, -55964, -173996, -187710, -134553, 28235, 41333, 65025, 71024, 173505, 175960, 33526, -70558, -47027, 107183, 73159, -103749, -46818, 211533, 147542, 76364, 77591, 85767, 59238, -34853, -63281, 50099, 130990, 96906, 41148, -63512, -6766, 27877, 145016, 39446, -50023, 3814, 215310, 292685, 123831, 54344, 143426, 240915, 377938, 401048, 255752, 139771, 223333, 180305, 116984, 83794, 34977]
13033C4977L12p2911o7889m1374M2060K3466M3733m3517l5430L8424J05254J11529
13021A38634M8908n1797o8021k5422p1645J8288n5837j2088J2326r80J74459M8795
13009A55620m3840q7424l2042k0069L3707J8481q8025J15022o2488L1029N0397
12998G0368N4191o6474M3320Q9367l6326L977R2855n5311Q5427j84314j34692
12987c7612L6986M2589n2758K7998R1134P9434r0514j86386q1921J98973J78n4180
12975b6079J42904Q3278j6944J7800j31886j57842j37193M8586J34748J49025
12965A06397J2362n1534J24965J20118q5865j33303o5655L47K01289R8335j54542
12954A72914j15536J1068J48012n8377k43052M4383K6146m2451j7223K7435L1808
$$ y = [34977, 35289, -37622, -105511, -146885, -104825, -81359, -37626, -81143, -116573, -78149, 27105, 138634, 187542, 135745, 67724, 42302, -29343, -11055, -66892, -78980, -66654, -67634, 106825, 155620, 111780, 24356, -7686, -27755, 5952, 24433, -63592, 51430, -11058, 19971, 70368, 124559, 58085, 101405, 190772, 154446, 158423, 251278, 195967, 281394, 97080, -37612, -626, 41963, -10795, 17203, 108337, 187771, 97257, -89129, -171050, 27923, 28101, -26079, 116825, 200103, 183159, 200959, 69073, -88769, -225962, -177376, -42628, 106397, 118759, 67225, 192190, 312308, 226443, 93140, 27485, 27832, 229121, 327456, 172914, 57378, 68446, 216458, 158081, -84971, -40588, -14442, -56893, -74116, -46681, -14873]
12943a4873M5133n5109Q3543j05356K6073J56576q5855J52841J7486q3419Q0335
12932B17375j7488j04832L2375m0819P12O8710m5428n1414R1080J80865K10113
12921E41249o6561k06576l2487J00350L0872j18317j14832O8856J05038k260j13907
12910A91425k16381r5089n7973J26340J64729N646J74836p7103M8929J30748J19755
12899E15862m8445j4546j17750j02972j34681N1993Q1594m3620l1237O617r123
12888A53692q6694J9976J08321j4263K8508m7207l0643j76401M2459k4445J27004
12877A00307Q5752r6740l0902p6928J05641N7166K53466P2660k17344l383J4694
12866B64389j18829p2929j3820O2526K28199n1582j22464J0831J30675R342j8239
$$ y = [-14873, 30260, -24849, 58694, -46662, -20589, 135987, 50132, 202973, 220459, 137040, 217375, 199887, 95055, 127430, 86611, 87323, 156033, 110605, 59191, 150271, 331136, 541249, 474688, 268112, 235625, 335975, 366847, 248530, 133698, 202554, 307592, 305332, 191425, -24956, -120045, -178018, -51678, 113051, 118697, 293533, 216430, 265359, 396107, 515862, 467417, 452871, 335121, 232149, 97468, 149461, 231055, 187435, 156198, 162815, 153692, 66998, 86974, 195295, 181032, 209540, 162333, 131690, -44711, -2252, -26697, 100307, 186059, 89319, 58417, -18511, 87130, 144296, 397762, 470422, 253078, 249695, 264389, 145560, 72631, 58811, 121337, 349536, 297954, 175490, 186321, 316996, 326338, 308099]
12855C08099N9060J432n1473j57429k3641Q3431k1642j5997j1645P7330m6634
12844B00891J15402m9942Q1967j10987j70359K42645K46336j33127k2439m668
12834C95719n2940R310n6066o4288m1257L1676R811n5397M3505k1267Q5580j63082
12822A21304o5813M6211J2456K6905j1593P6199J41m0378l2239r9868R1299K40236
12810C64860r0746j708L2254r7242n4286J35878J95601l947n255j47845n262q3657
12798B38645J05127J61664k6881j66474o5628O0933J02150J07946J31337j23026
12788E25793j83220m2260J3908Q2758Q5357J52278p9019N8991J32583L5315j69199
12777F13285k37970M2998K01199R49j2529J8335J15811n0231K7267r0510k4659
$$ y = [308099, 367159, 368591, 317118, 159689, 136048, 219479, 197837, 181840, 170195, 247525, 200891, 316293, 266351, 348318, 237331, 66972, 309617, 555953, 422826, 400387, 395719, 342779, 352089, 296023, 231735, 190478, 222154, 231965, 176568, 220073, 198806, 284386, 121304, 55491, 101702, 114158, 141063, 129470, 205669, 205810, 165432, 133193, 33325, 124624, 364860, 274114, 272406, 304660, 207418, 153132, 289010, 484611, 480664, 475409, 327564, 322302, 238645, 343772, 505436, 478555, 312081, 246453, 307386, 409536, 517482, 648819, 525793, 342573, 300313, 314221, 396979, 482336, 634614, 555595, 614586, 747169, 782484, 613285, 375315, 418313, 619512, 620461, 607932, 626267, 742078, 691847, 719114, 628604, 603945]
12766F03945Q2344j32006O2457l4004o2743j10503K1423l2895k4029N8544M7016
12755D79549L5362j05944m3687j15313P8467K61856L490M3070j33836k92377j41667
12744F8970j20357l1542J28097N2645J8249p3852L2529R3708o4699O8682q1645
12733I0785J28321J40765K8544o0572N4253O0150j1125P2440m5537j10549l4222
12722C13253j31227q0261k2715J00440r9193J20339J70373P5125o279l0669R9582
12711E08768P3611J06998n2295k00329p0797l9062P138J56175O2943J36010J3264
12700G02424k45021j72328j61316o3661N2151m326J11906m4402L9304J13790J16063
12689D44584Q4648p8818q6482O4247J4843j14361P8454J4389N0747J00849N0761
$$ y = [603945, 686289, 554283, 616740, 582736, 519993, 409490, 430913, 398018, 373989, 432533, 479549, 514911, 408967, 365280, 249967, 328434, 590290, 593780, 636850, 503014, 210637, 68970, -51387, -82929, 45168, 97813, 116062, 42210, 74739, 168447, 103748, 172430, 90785, 219106, 359871, 388415, 327843, 382096, 442246, 431121, 503561, 458024, 347475, 313253, 182026, 101765, 79050, 179490, 80297, 200636, 371009, 446134, 439855, 409186, 508768, 582379, 689377, 637082, 436753, 365956, 326894, 334032, 490207, 553150, 689160, 702424, 457403, 285075, 123759, 60098, 112249, 107923, 219829, 175427, 214731, 328521, 444584, 529232, 450414, 363932, 428179, 443022, 328661, 407115, 421504, 472251, 573100, 623861]
12678F23861j3279j07671m1331q7977j08666L6609k3540M2545J56821k5275j18847
12667C33250j30685R5409J1905l9327j630q5132K5421j1077n6433k7567n1613
12656F2521J07681K24301M2032j6425K41871j19122q7309k1601R5546j74132p4617
12645B80746o385n0557J35122J71410k1878k1417j01885j40197J3723J29356K4831
12634D12869J54753J40111q4898M4156k5935j02634o7281p4800j05942M2148K00249
12623E32796J0439j42577Q0870M3533R1566j87170o5554J22942J75157o8841j77468
12612D15693K5372l5533q9657m3712j46448M5017K24122O5592P0630P6442l8562
12601E68956j96837m7818r0680r7633N1049J79685J61312N6502q3923k2531J25015
$$ y = [623861, 610582, 502911, 461580, 373603, 264937, 301546, 278006, 320551, 477372, 452097, 333250, 202565, 297974, 309879, 270552, 268922, 183790, 209211, 198134, 141701, 114134, 62521, 170202, 394503, 436535, 420110, 661981, 542859, 455550, 433949, 529495, 355363, 280746, 274361, 223804, 358926, 530336, 508458, 487041, 385156, 244959, 258682, 388038, 412869, 567622, 707733, 622835, 666991, 641056, 538422, 471141, 396341, 290399, 332547, 532796, 543235, 400658, 481528, 525061, 616627, 429457, 363903, 486845, 662002, 593161, 415693, 441065, 405532, 315875, 272163, 125715, 170732, 394854, 460446, 531076, 607518, 568956, 372119, 324301, 233621, 135988, 187037, 366722, 528034, 584536, 500613, 478082, 603097]
12590F03097J8779l9341q9528j48115N7492J61126R7994j63302k688N7634R7643
12579F50791R6874L1885j83191j91786j54800P3064J79996K17321Q1633K1502
12569H23289O216j25041j95002o0439K2475j2617N1170m553o180O2811j54165
12558D07964J80533p4416l5006q4974r3511J17547K7758p9210J12275k5461J07067
12547E60566o363n9733J7432p4541J31577O2467j63597j65297M1080J54424Q7046
12536E85061N3995k7608m4464p1840j8122N5645k0707Q841M1092Q7544R4114K18949
12524I62500j6501j28781n6195j69211m1571O2938K09596m857m0011k8366Q5097
12513H34638m4346r1618k10403K2331R4170q517k0615K1335l7100q7513m2164
$$ y = [603097, 621876, 582535, 493007, 344892, 402384, 563510, 661504, 498202, 495514, 553148, 650791, 747665, 779550, 596359, 404573, 249773, 322837, 502833, 720154, 801787, 823289, 829505, 704464, 509462, 449023, 471498, 458881, 510051, 505498, 499318, 562129, 407964, 588497, 514081, 479075, 394101, 300590, 418137, 445895, 366685, 478960, 453499, 560566, 554203, 494470, 511902, 437361, 568938, 631405, 467808, 302511, 343591, 498015, 585061, 639056, 611448, 566984, 495144, 477022, 532667, 511960, 520801, 561893, 649437, 743551, 962500, 945999, 817218, 761023, 591812, 550241, 613179, 822775, 817918, 777907, 749541, 834638, 790292, 698674, 488271, 510602, 604772, 596255, 575640, 596975, 559875, 472362, 430198]
12502D30198J8087M4460M3757N1997n621J7792L0502k948J25009R1103k61843
12491E82493o1811J16688J75538l0847m3267j09331n8181J26332R4368M9010J5934
12480H56926k1400M4782j0036k9361J09481j1665p1246q0325L4897m0419j29212
12469F52422j3187O0242Q3281n4363n6366O3828m6116J56568K31516j71630j21871
12458G84324R273J08845L0177j40911q9467o1819J67814K75619J0705P9824j51077
12447A023307j44300J3950o7164J15051k261m9299J75703l7599J2695n1376L2905
12436A021612N8153r8958q7458p2353j59536L15534J30973j52145j29961J14077
12426I39938n9709q2834q4407p7011K1147J43607J38014N2977o7762j35116Q0396
$$ y = [430198, 448285, 492745, 536502, 588499, 582878, 600670, 631172, 628224, 753233, 844336, 582493, 520682, 637370, 812908, 782061, 738794, 629463, 571282, 697614, 791982, 840992, 856926, 835526, 880308, 870272, 840911, 950392, 938727, 867481, 787156, 822053, 781634, 652422, 639235, 699477, 782758, 728395, 672029, 735857, 689741, 846309, 1077825, 906195, 784324, 793597, 902442, 932619, 791708, 702241, 640422, 808236, 1083855, 1094560, 1174384, 1023307, 879007, 892957, 825793, 940844, 938583, 889284, 1064987, 1027388, 1040083, 988707, 1021612, 1079765, 980807, 893349, 820996, 661460, 976994, 1107967, 955822, 825861, 939938, 880229, 797395, 712988, 635977, 657124, 800731, 938745, 991722, 923960, 788844, 869240]
12415H69240P832j2438J78385P8748m542Q650L1514j27847j21441l4850j352n7868
12403H14031m8921m095j90746J81777J34348J8530P5669l3741j32757J39103L03462
12392A256660Q219k26714q7279n1633q3091R3788J4816J56052R8308J04280N863
12381A289269k3838N0218k7743o1333q2594N7878j63699P2327R4078L928q1127
12370A127364j42486J18647J21809K1930M4537m4081j4424J47287R9101k15473
12360A264211j67997L2173o5419N3863J3198R857J3371P2178n9049j14815J24442
12349A176013Q1666j48224J5433l3760N4984J96387O2201m3270L8355j1028K1602
12338A410359K3394o1957m2247K594q3380J8277P705K7494L6248R7951n3657J1366
$$ y = [869240, 877072, 864634, 1043019, 1121767, 1117225, 1125875, 1157389, 1029542, 908101, 873251, 871899, 814031, 765110, 761015, 570269, 752046, 886394, 904924, 980593, 946852, 814095, 953198, 1256660, 1264879, 1038165, 950886, 899253, 816162, 909950, 924766, 1080818, 1179126, 1283406, 1289269, 1265431, 1315649, 1287906, 1226573, 1143979, 1201857, 1038158, 1110485, 1204563, 1208491, 1127364, 984878, 1103525, 1225334, 1247264, 1291801, 1247720, 1233296, 1380583, 1479684, 1264211, 1096214, 1128387, 1062968, 1116831, 1130029, 1139886, 1153257, 1225435, 1166386, 1051571, 1176013, 1257679, 1109455, 1124888, 1091128, 1146112, 1342499, 1404700, 1361430, 1399785, 1388757, 1410359, 1433753, 1371796, 1329549, 1332143, 1248763, 1267040, 1274745, 1302239, 1338487, 1436438, 1382781, 1394147]
12326A394147J2869J70247J11303n442O2391k2701O8611J6344o9128q828j60769
12315A569044j15748M1368R844J30923q0588j37467K875l510k5589k3272m5753
12304A322127K63043J95574J54899M8237j22984M8116K6565L866q5583r7701J87729
12293A943888n4585j32320K2927k906J50289L2973J1454L1733p1556L5610J01207
12282B068714J11933k22665j38120M7544j327j18804j36190l1195M7474L0806
12272A658170J06380k8091n9634O8625K29090M1980J00563l9102k32100o8203
12262A777678R0992K3527P7327j53549j99088J14303J44054j35771l8895J73946
12252A874524O5749q302J63975J2581J6002L4993r7190O6599J27875J16229j19296
$$ y = [1394147, 1407016, 1577263, 1688566, 1683124, 1745515, 1722814, 1791425, 1807769, 1738641, 1729813, 1569044, 1453296, 1494664, 1504508, 1635431, 1554843, 1417376, 1420251, 1416741, 1391152, 1367880, 1322127, 1585170, 1780744, 1935643, 1983880, 1860896, 1909012, 1935577, 1939443, 1853860, 1756159, 1943888, 1889303, 1756983, 1779910, 1777004, 1927293, 1960266, 1971720, 2003453, 1931897, 1967507, 2068714, 2180647, 1957982, 1819862, 1867406, 1866079, 1747275, 1611085, 1579890, 1627364, 1658170, 1764550, 1736459, 1676825, 1745450, 1974540, 2016520, 2117083, 2077981, 1845881, 1777678, 1868670, 1892197, 1969524, 1815975, 1616887, 1731190, 1875244, 1739473, 1700578, 1874524, 1940273, 1931971, 2095946, 2108527, 2124529, 2159522, 2062332, 2128931, 2256806, 2373035, 2253739]
12241B253739P6416O8285j08686o5313J19190J79383P6280m0345R2855o0430L578
12230B594952n436j22635o0661O7413o1633P1740r6226r8600J13569O1381R2801
12219B556665J76355M8696r1655j25984l3913J38188L9774N121K0648M9168K2939
12208B806002O8550L5652j65463Q749M8780j36340p5434J1322J21956J13259R3185
12197B930218k7358j800j6079o8272P0134K002N3733P3567L3027N2547Q9770k7732
12185C163757R3401O9125M5412n1966r9787j5025K5817n6874J04211R4419K1855
12174C394345K2549Q6764j27112q8517J8511J62606R6967Q5216L2662j04066M0670
12163C620595J16802n4319Q9328N498j51479O0533J15577R4535q3303m839N6273
$$ y = [2253739, 2330155, 2398440, 2289754, 2224441, 2343631, 2523014, 2599294, 2558949, 2651804, 2591374, 2594952, 2589516, 2466881, 2406220, 2473633, 2412000, 2483740, 2387514, 2288914, 2402483, 2463864, 2556665, 2733020, 2781716, 2690061, 2564077, 2530164, 2668352, 2708126, 2713247, 2733895, 2783063, 2806002, 2874552, 2910204, 2744741, 2753490, 2802270, 2665930, 2590496, 2601818, 2723774, 2837033, 2930218, 2902860, 2901060, 2884981, 2816709, 2886843, 2888845, 2942578, 3016145, 3049172, 3101719, 3191489, 3163757, 3257158, 3326283, 3371695, 3319729, 3219942, 3204917, 3230734, 3173860, 3278071, 3372490, 3394345, 3416894, 3503658, 3376546, 3288029, 3306540, 3469146, 3566113, 3651329, 3683991, 3579925, 3620595, 3737397, 3683078, 3772406, 3777904, 3626425, 3686958, 3802535, 3897070, 3813767, 3808928, 3865201]
12152C865201R3500R0170N9452N4229J5007Q9591j07663j21417R1598k6858O37
12141D103447m4695n403J35877O8385J14974n8913Q8373J21377L6604q3446K6261
12130D502841N9436k3262K25980M1662m7035k7103p3491m2616k3435R8251J16645
12119D807873K1631J91558j1818j9493J25968P5086J3833O8487J9040n9254O9104
12108E302015N4748J16269J32420p1983j14469R6889N0777J3725J54631J72747
12098E907769K9381m4826J27738j203R9612J32831l1489m6517J0904M373j38865
12087F049708M7114L07179J69129j38201j33445J54112p5694j50041L9425K85308
12077F554594L57704J24979j2204K5590l3461J09122Q2041J7087n9357J08809
$$ y = [3865201, 3958701, 4048871, 4108323, 4162552, 4177559, 4267150, 4159487, 4038070, 4129668, 4102810, 4103447, 4058752, 4053349, 4189226, 4257611, 4372585, 4313672, 4402045, 4523422, 4560026, 4476580, 4502841, 4562277, 4539015, 4764995, 4806657, 4759622, 4732519, 4659028, 4616412, 4592977, 4691228, 4807873, 4829504, 5021062, 5009244, 4989751, 5115719, 5190805, 5204638, 5273125, 5292165, 5232911, 5302015, 5356763, 5473032, 5605452, 5533469, 5419000, 5515889, 5566666, 5580391, 5735022, 5907769, 5937150, 5892324, 6020062, 6018859, 6118471, 6251302, 6219813, 6173296, 6184200, 6188573, 6049708, 6096822, 6404001, 6573130, 6434929, 6301484, 6455596, 6379902, 6229861, 6269286, 6554594, 6912298, 7037277, 7025073, 7050663, 7017202, 7126324, 7208365, 7225452, 7166095, 7274904]
12067G274904J15889M1861J25532l9577M5869j1090Q0968N6935j8950m4087p5286
12056G552968j26861K249J18881K13038J24151J46210K1135m392M6926l6803j0092
12045H047410L40081L36736J11820j37379J11522M4449q7180p533J75459J39239
12035I074624J05225J09291P012K1083Q4928K3267o7973o4547J09120K59599N6685
12024I718314L0705P4316J33815J08507J14597P3208j3692P8099k4735j19137
12014A0173997j44919J83580J84542K01136J80294J46406N7807j34220k730M6040
12004A0891933j0217j58671m9539Q5176o1667K8443J38579K07297J30097o6172
11994A1135259n5270l7142k630O8929J29723Q3305J6908Q1374R7166K4983j33251
$$ y = [7274904, 7390793, 7432654, 7558186, 7518609, 7564478, 7553388, 7634356, 7691291, 7672341, 7628254, 7552968, 7426107, 7428356, 7547237, 7760275, 7884426, 8030636, 8051771, 8047379, 8094305, 8057502, 8047410, 8387491, 8724227, 8836047, 8698668, 8810190, 8854639, 8767459, 8759926, 8935385, 9074624, 9179849, 9289140, 9296152, 9317235, 9402163, 9425430, 9357457, 9292910, 9402030, 9661629, 9718314, 9749019, 9823335, 9957150, 10065657, 10180254, 10253462, 10239770, 10317869, 10293134, 10173997, 10029078, 10212658, 10397200, 10598336, 10778630, 10925036, 10982843, 10848623, 10845893, 10891933, 10881716, 10723045, 10673506, 10758682, 10697015, 10725458, 10864037, 11071334, 11201431, 11135259, 11079989, 11042847, 11040217, 11109146, 11238869, 11322174, 11339082, 11420456, 11517622, 11542605, 11409354]
11983A1409354R7386J41783l3051p1723Q4003K24591K05088o9712q2094j41364
11973A1764261n9213O1235K09844J16349m8746O293Q2495j87439k3800O6617P0842
11962A2058738k18962L5654P380J95391J83862j2730j74378j47378K4216O0568
11952A2012361N1813N2380K2427j40262j74236j49638Q3728n1268J9367O0011
11942A1786683j0821m9521l7226O8851K07986j77675Q9429J38072J9164k22761
11932A1812181j10182o2842k4332P3170j1295j48224J74253K4098j45169l7835
11922A1543823j847j62711m0362o5567j02550j26783m2159J5703j32019n2516
11912A0833012n0480q4889R7355K9993J52412p8689j90319J3361j11200k07455
$$ y = [11409354, 11506740, 11648523, 11615472, 11543749, 11627752, 11852343, 12057431, 11987719, 11905625, 11764261, 11705048, 11766283, 11976127, 12092476, 12043730, 12050023, 12132518, 11945079, 11921279, 11987896, 12058738, 11839776, 11875430, 11882810, 12078201, 12262063, 12249333, 12074955, 11927577, 11951793, 12012361, 12064174, 12116554, 12138981, 11998719, 11824483, 11674845, 11758573, 11707305, 11726672, 11786683, 11775862, 11726341, 11689115, 11757966, 11965952, 11788277, 11877706, 12015778, 12034942, 11812181, 11701999, 11639157, 11614825, 11687995, 11676700, 11528476, 11702729, 11726827, 11581658, 11543823, 11541976, 11379265, 11338903, 11273336, 11170786, 11044003, 11001844, 11017547, 10885528, 10833012, 10782532, 10697643, 10794998, 10824991, 10977403, 10898714, 10708395, 10721756, 10610556, 10403101]
11902A0403101r279j45598j67733j52190n1783j4132N1938r4416j74142o9231
11892I576535q3362n3231K248J97821M2356J954q3364j95559j78727m3041Q7067
11881I270697j11405j37473l17659j15819k8195r9970j05952m64j4409N2075L4388
11870H425814o1339l6621j13263J090p3983j41569j6555n1222k3996O301j6317
11859G898340m5859j10118n3154j2627K4237K9253j66212k17693j54258m5732
11849G146177r1127L0699k11989r1255P0782k5407k8094J03477o6999j14175k07991
11838F514098m4965m1288j8715j24174M9601k11953j03237J23442P6350O387P2258
11827F297804k7724k2149j75998k65684m42P3426Q9417j70132k75779k63194j41371
$$ y = [10403101, 10393822, 10248224, 10080491, 9928301, 9876518, 9862386, 9914324, 9819908, 9645766, 9576535, 9493173, 9439942, 9442190, 9640011, 9682367, 9684321, 9600957, 9405398, 9226671, 9183630, 9270697, 9159292, 9021819, 8704160, 8588341, 8560146, 8460176, 8354224, 8353760, 8339351, 8391426, 8425814, 8364475, 8327854, 8214591, 8215681, 8141698, 8000129, 7983574, 7932352, 7908356, 7914657, 7898340, 7852481, 7742363, 7689209, 7676582, 7700819, 7730072, 7563860, 7346167, 7191909, 7146177, 7055050, 7085749, 6873760, 6782505, 6853287, 6827880, 6799786, 6903263, 6836264, 6722089, 6514098, 6469133, 6427845, 6409130, 6284956, 6334557, 6122604, 6019367, 6142809, 6219159, 6225546, 6297804, 6270080, 6247931, 6071933, 5806249, 5805807, 5879233, 5968650, 5798518, 5522739, 5259545, 5118174]
11816E118174N4928K21049P2634n1592L4589k13806n9603J11653M6348j37375
11806E196999o2073k7989J19467l2243j43170j21983m7839j06728j41876k4340
11796D608225J82923J0496J08613r7989j98747L1549K29434j84718k90029m1795
11786D357962J55590J9619j6237n1644k9276m1538k27009j62884L222p7132Q4537
11775D015210Q8163K0849l4728r8712o422p5460J72558M3941k83750k19845q7778
11764C534026J64514K1642R5959R990o4493j77133N4901j9313o9446M5549j7704
11753C578492j70548p7994L5665j01381j04787K09472R8921o4472k03388m6908
11743C153072J32866r4294J23089Q6798l2792k16208j17065L6070o5744o7909
$$ y = [5118174, 5173102, 5394151, 5466785, 5415193, 5449782, 5235976, 5176373, 5288026, 5334374, 5196999, 5134926, 5106937, 5226404, 5194161, 5050991, 4929008, 4881169, 4774441, 4632565, 4608225, 4791148, 4801644, 4910257, 4812268, 4613521, 4645070, 4874504, 4689786, 4399757, 4357962, 4513552, 4533171, 4516934, 4465290, 4436014, 4394476, 4167467, 4004583, 4007805, 3930673, 4015210, 4103373, 4124222, 4089494, 3990782, 3984360, 3908900, 4081458, 4125399, 3841649, 3621804, 3534026, 3698540, 3720182, 3816141, 3826131, 3761638, 3584505, 3639406, 3620093, 3550647, 3596196, 3578492, 3407944, 3329950, 3365615, 3264234, 3159447, 3368919, 3467840, 3403368, 3199980, 3153072, 3285938, 3191644, 3314733, 3401531, 3368739, 3152531, 3035466, 3071536, 3005792, 2937883]
11733B937883k8318m8404Q1298n8923j35806N4581K8671l3222j4733M0818j38123
11722B685722j39764j0125m5080n0912o3579n1796Q1125N7512Q5834P753j09083
11711B447607J00160l5326j20963j88117q5929K9072J24831J32565L6430j37149
11701B303181j10813K06771J08562j6651n1946l5744K8829j54645k43708k7022
11691B006814J23470P8621J32115Q7774N3623j48798n1664r8304J1882p0802j73797
11680A950934j94250k34049O0773N7688o6410R8582l9222J7300J43205R5401J03971
11669A993923Q6001p202o9471L6172K8947o4167j5161P1440O2583r5162k55193
11658A772710l3525J23382J13130L4724l0960j28202j03752J26992q4458j11034
$$ y = [2937883, 2909565, 2861161, 2942459, 2883536, 2747730, 2802311, 2830982, 2797760, 2783027, 2823845, 2685722, 2545958, 2535833, 2490753, 2439841, 2376262, 2324466, 2405591, 2463103, 2548937, 2556690, 2447607, 2547767, 2512441, 2391478, 2203361, 2117432, 2146504, 2271335, 2403900, 2440330, 2303181, 2192368, 2399139, 2507701, 2491050, 2439104, 2403360, 2432189, 2277544, 2033836, 2006814, 2130284, 2208905, 2341020, 2428794, 2482417, 2333619, 2281955, 2183651, 2195533, 2124731, 1950934, 1756684, 1522635, 1583408, 1641096, 1574686, 1673268, 1634046, 1651346, 1794551, 1889952, 1993923, 2079924, 2072722, 2003251, 2039423, 2068370, 2004203, 1989042, 2060482, 2123065, 2027903, 1772710, 1739185, 1862567, 1975697, 2010421, 1979461, 1851259, 1747507, 1874499, 1790041, 1679007]
11648A679007n307P5216l9306j37747j16151R0741l5912m1647K1225k38897m8391
11637A202831J44451L8724n3608n255L5534q0495K8883O4591q613J06934r7666
11626A376311j55589Q9635q1119N0534J16724j0958l9214M4485o0367M6425r5845
11615A281022N1334P7547n7899K6971J2835P1004N1747m6424j42874j28297J35930
11604A332896M3213l3990j85560j56558K03247O8683K5433j12231J29023M6656
11594A360812j9625o3923R235N1634k23398m3981Q9489m0048m6501P4181J22466
11583A270341l7646M2924j04919n7214j22982m7123J64122J00049K9267K4041
11573A260860o8658j66907M20J06049R3523o2174j8373N212O9397K8285j42047
$$ y = [1679007, 1673700, 1748916, 1709610, 1571863, 1455712, 1546453, 1510541, 1468894, 1490119, 1251222, 1202831, 1347282, 1386006, 1332398, 1327143, 1362677, 1282182, 1311065, 1375656, 1367043, 1473977, 1376311, 1220722, 1310357, 1229238, 1279772, 1396496, 1385538, 1346324, 1390809, 1330442, 1376867, 1281022, 1332356, 1409903, 1352004, 1378975, 1391810, 1462814, 1514561, 1468137, 1325263, 1196966, 1332896, 1376109, 1342119, 1156559, 1000001, 1203248, 1271931, 1297364, 1185133, 1314156, 1360812, 1341187, 1277264, 1286499, 1338133, 1114735, 1070754, 1160243, 1120195, 1073694, 1147875, 1270341, 1232695, 1275619, 1170700, 1113486, 990504, 943381, 1107503, 1207552, 1236819, 1260860, 1192202, 1025295, 1025715, 1131764, 1225287, 1163113, 1144740, 1149952, 1219349, 1247634, 1105587]
11562A105587j00240R5846N2563j19049J09534j8911j57605J0933J04731o426
11552A076963r817q6939J1289R2778j33177p2026K6768Q2863J19383j33616j02950
11541H71519k7203R717K9858J16456p543j04622r954m2893M1412L4130j27532
11530G83345K8892M2190j9938k3871L7624M4387P1239l708q6317o1900J7191R1075
11518I20209q6495j52066q9375O8129L0744n6435Q6329N4197K6394M1009L3791
11507H76431N8242J2418j03223l6248m5290j61009l1499J3492r2065o3932J56072
11496E83389j23005r4008J07779m5692l125J87481J90185l6867j75448j01198
11486D89491L2801O7337K8895p4327o3537J00056J34060m2986N7415k7904l1746
$$ y = [1105587, 1005347, 1101193, 1153756, 1034707, 1144241, 1125330, 967725, 978658, 1083389, 1076963, 1067146, 980207, 991496, 1084274, 951097, 879071, 905839, 988702, 1108085, 974469, 871519, 844316, 854033, 883891, 1000347, 992804, 888182, 878228, 835335, 876747, 910877, 783345, 812237, 854427, 834489, 810618, 848242, 892629, 963868, 960160, 873843, 811943, 829134, 920209, 833714, 681648, 592273, 660402, 691146, 634711, 721040, 775237, 801631, 842640, 876431, 934673, 947091, 843868, 807620, 762330, 601321, 569822, 583314, 491249, 427317, 583389, 460384, 366376, 474155, 428463, 425338, 612819, 803004, 766137, 590689, 489491, 522292, 589629, 618524, 544197, 480660, 580716, 714776, 671790, 729205, 701301, 669555]
11475F69555L5092Q5411M593K9042R2763J3329l03250p7464R7225K53339j2933
11464H86702p7109j58698m0828l4080k5060n2058n7378l7705M0343J68255j40821
11453D71563l03459L1655J60947Q5558p1662M9559J07237J05714j87534m2683
11443D06895L0374J72327K15368N1656k1900n3190j23353j81618k7844m548p8748
11432C85419N1988J19394Q4301o7641p3030P538K1960P1242l6445l2041j80062
11421C52623M4703K06511j1613j19318k06662j9494L1575O6784k7603L8936m8423
11410C08019o5912M5843J25246j05149L3654M4976J5780J08416N4020k0237m3465
11399E01191n5278k11770q1334p2995j10886J20847K49987L05000j5120j94508
$$ y = [669555, 704647, 790058, 794651, 823693, 916456, 929785, 626535, 549071, 646296, 899635, 886702, 809593, 650895, 610067, 575987, 550927, 498869, 441491, 403786, 444129, 612384, 471563, 168104, 199759, 360706, 446264, 374602, 424161, 531398, 637112, 449578, 406895, 437269, 609596, 824964, 876620, 854720, 801530, 678177, 496559, 468715, 464167, 385419, 437407, 556801, 641102, 573461, 500431, 507969, 529929, 601171, 564726, 532685, 352623, 397326, 603837, 592224, 472906, 266244, 246750, 278325, 345109, 317506, 356442, 308019, 242107, 287950, 413196, 308047, 341701, 386677, 402457, 510873, 564893, 544656, 501191, 445913, 234143, 152809, 79814, -31072, 89775, 339762, 644762, 629642, 435134]
11389D35134r427j0966k7336K1223j41012q4043k4966l3295N2036J50005k3125
11378C04228N6291K2295N6990j14832n7301j7015K5353j09867j87133r7572O9056
11367d9507Q0000J09203J25224J4852N4851M2276q0743j87457p516J38964p172
11356B32975R0043J24634p935j24971K3832L9064M9044K8091K1626K7425N527
11345E09355O3735j88533j40788j6976l7544L0010R2948M0259o960r7813J66790
11334D14483Q8536n1716j1068q2418o7171q9243J6543k2624r4421P7737J76427
11323C55065M4549j44675k0573L3325k5557J5617j9455j06744o2211M7828J42157
11312B59326l596J02505M1110m3033j05168p8630J49734N9717O5165J9230j4040
$$ y = [435134, 425707, 414741, 387405, 408628, 267616, 183573, 158607, 125312, 177348, 327353, 304228, 360519, 382814, 439804, 324972, 267671, 250656, 276009, 166142, -20991, -118563, -49507, 30493, 139696, 264920, 279772, 334623, 376899, 296156, 108699, 101183, 240147, 232975, 323018, 447652, 439717, 314746, 338578, 377642, 426686, 454777, 476403, 503828, 509355, 573090, 384557, 243769, 226793, 189249, 219259, 312207, 352466, 345506, 247693, 414483, 503019, 451303, 440235, 357817, 290646, 201403, 217946, 195322, 100901, 178638, 355065, 399614, 254939, 234366, 267691, 242134, 257751, 238296, 131552, 69341, 117169, 259326, 255730, 358235, 399345, 356312, 251144, 172514, 322248, 381965, 447130, 466360, 452320]
11301D52320n7005j87332O3467L0894L2830j92352p2829l7159r338J2706O3325
11290I9527J71973j10766m6227K78763o7772j57425n1249K8620o9200r4014J25492
11279A07722R1805q2459j36574j6256J17315J55186J3533M3321N1599J07472p2476
11268C80188j66044M4095m1767r5625k8311J14059P220O1114p2480M3279J01346
11257C47074Q328j31868q8197M668j1489K6752O1032j25204R9687K08494k928
11246C96349p0703M0322O5371J1929P9717l6881r6280J730l6407j00190k6443
11235B28514n5278l5737O7408j03509R960k2345k7890k5798k344O2540l777N8324
11223A50068K03989K5983j09657j11377j72843M0356K1698l9346M4664k5837k5561
$$ y = [452320, 395315, 207983, 271450, 302344, 335174, 142822, 69993, 32834, 23496, 36202, 99527, 271500, 160734, 114507, 393270, 325498, 168073, 116824, 145444, 76244, -17770, 107722, 199527, 117068, -19506, -35762, 81553, 236739, 250272, 293593, 345192, 452664, 380188, 214144, 258239, 216472, 120847, 92536, 206595, 213815, 274929, 202449, 245728, 347074, 355402, 223534, 135337, 140005, 128516, 155268, 216300, 91096, 190783, 399277, 396349, 325646, 365968, 431339, 443268, 522985, 486104, 389824, 391554, 355147, 254957, 228514, 173236, 137499, 204907, 101398, 111358, 89013, 61123, 35325, 32981, 95521, 91744, 150068, 354057, 380040, 270383, 159006, -13837, 26519, 48217, 8871, 53535, 27698, 2137]
11212B137R2776l5753j04132J03698K4580J37301m4925j99305J68460J5110j34082
11201B5865j11539p676r6678n9479Q1286J38544m1619J64557Q8069j10376j61127
11190i0173j41677K20320J23429p6415o0119J46551j3785J01022o786n7381M8630
11179A93616j12378J5504r7403L9666J15137m9993n6719O6637J7637q962L8740
11168A61482q6848n2076p3659M828P0081J32485Q0281l0609l2469j52558M0525
11157F1463j9814j4348L6786J30458j46973j33318J5768j20421p1233J7118J53939
11146i0575J30591N0004K1561J17379K2250J1683l4104j15246Q978R294k7151
11135A04664p5693k20693j03955L01874K31597j86759q3138O9867j1269J45169
$$ y = [2137, 94913, 59160, -44972, 58726, 83306, 220607, 175682, -23623, 144837, 159947, 25865, -85674, -93350, -190028, -249507, -168221, -29677, -71296, 93261, 181330, 70954, -90173, -231850, -11530, 111899, 35484, -24635, 121916, 108131, 209153, 202367, 144986, 193616, 81238, 96742, -661, 39005, 154142, 104149, 47430, 114067, 131704, 122742, 161482, 74634, 22558, -51101, -46273, 23808, 156293, 236574, 205965, 173496, 20938, 61463, 41649, 27301, 64087, 194545, 47572, -85746, -69978, -190399, -261632, -244514, -90575, 40016, 90020, 111581, 228960, 251210, 262893, 228789, 113543, 122521, 131815, 104664, 28971, -191722, -295677, 6197, 237794, 51035, -32103, 37764, 26495, 171664]
11125A71664k1395r9250q5399L2242k4947Q737k3808N0805N1354k982j1204P270
11113E3087k1371p7954k2466J49748o1224K3100j61785O0954J50766k1229r0312
11102a8686O0735o3177O1939L6232k3195o2286P8583J89837P4881k03331j25335
11091F197R0566q561j5743K9505n1820R9981j02198j14307j1326M404M1072J1648
11079b0582O3455l5648j0768j08266o768K18249Q6695q5419j54413l2287Q0835
11068d917J3204J44836J76618j77998k03944j570J78070J83091p8073j97634j95447
11057a63764q6956j7202N1767N6410n318k3210J25069J32385n0639k13606p0162
11046b65226R6356K7456J15616P5069J62785N5955K250P1805J06227J54638r5369
$$ y = [171664, 150269, 51019, -34380, -2138, -27085, -18348, -42156, 8649, 60003, 57021, 45817, 53087, 31716, -46238, -68704, 81044, 19820, 42920, -118865, -57911, 92855, 71626, -18686, 42049, -21128, 40811, 77043, 53848, -8438, 70145, 259982, 334863, 131532, 6197, 96763, 88202, 72459, 101964, 50144, 150125, 47927, -66380, -77706, -73302, -32230, -20582, 42873, 7225, -3543, -111809, -118577, 99672, 186367, 100948, -53465, -85752, -4917, 8287, 153123, 329741, 151743, -52201, -53771, 124299, 307390, 229317, 31683, -163764, -250720, -267922, -216155, -159745, -165063, -188273, -63204, 69181, 18542, -195064, -265226, -168870, -141414, -25798, 49271, 212056, 268011, 270261, 342066, 448293, 602931, 507562]
11035E07562j16877j64275Q2646J94P2710J46688K18579j26682p8831J88584J24488
11024H54786o9845J41128Q43j97115j08276N3798J09068J61408J07797J94451
11014A248043K46019L748k09151j25999J3526j25072j79532k5903N1422j4339
11004H82762r4481Q7711k9747l9744P8295K5455p3297n6352J153l5939l67446
10993C78370j31433N5574Q2245K7884j12902j51164m6314j16888j38192J61925
10983I105J20471l3716K6307j18671N3929r7470j5722R4326n5901j20118J01829
10972c5631j5804P1099o5837k22566j48185J28604J93729M2148l8918K0751M011
10961f6599q5669L0664K1161n011m0190m4577q221N8102O1789M8036N589J8936
$$ y = [507562, 390685, 226410, 309056, 309250, 381960, 528648, 747227, 620545, 541714, 730298, 854786, 784941, 926069, 926912, 729797, 621521, 675319, 784387, 945795, 1053592, 1248043, 1494062, 1497810, 1288659, 1162660, 1176186, 1051114, 871582, 845679, 897101, 882762, 788281, 875992, 846245, 806501, 884796, 910251, 836954, 780602, 781755, 745816, 378370, 246937, 302511, 384756, 412640, 299738, 148574, 102260, -14628, -152820, 9105, 129576, 95860, 122167, 3496, 57425, -40045, -55767, 38559, -17342, -137460, -35631, -51435, 19664, -46173, -268739, -416924, -288320, -94591, -52443, -91361, -70610, -66599, -152268, -121604, -100443, -105454, -145644, -190221, -198442, -140340, -78551, -30515, -24926, -5990]
10949e990k353J4145Q9856j51216J9553N3243M4478l8347j4796j23473j30933
10938b45833J03824O3573o6641j27687o0623k0205P5290Q3684L0710Q3614Q1001
10927G07j03062r9994O3100J1638J2091k8584K2327J92290Q8821j21998j17197
10916g9861m4736q0914j5259J27730p8683k6915p0759Q7405j55874L1927J55209
10905a50730J0314j2526J9884N1766J03653J7557r528l1670j20162l972N0563
10894g4851k3824l5117N5063j4054j77517J04319J52064Q4756P8841j32384M2636
10883E9932K4125J04480o9144L6553J74759p5095k31085R4872l7329q338J48260
10872B21990p8454m4612o7447M843k6622o1652J2379L8688R4408j46363j19014
$$ y = [-5990, -8343, 5802, 95658, -55558, -36005, 17238, 61716, 23369, 8573, -114900, -245833, -142009, -78436, -145077, -272764, -333387, -353592, -278302, -194618, -163908, -80294, 707, -102355, -202349, -139249, -127611, -115520, -144104, -121777, 70513, 159334, 37336, -79861, -124597, -205511, -220770, -93040, -171723, -198638, -269397, -181992, -337866, -305939, -150730, -140416, -152942, -133058, -81292, 22361, 39918, 30390, -1280, -121442, -125414, -74851, -98675, -133792, -78729, -92783, -270300, -165981, -13917, 70839, 149680, 17296, 59932, 84057, 188537, 119393, 155946, 330705, 255610, 24525, 119397, 82068, 73730, 221990, 143536, 98924, 31477, 36320, 9698, -51954, -39575, -887, 93521, -52842, -171856]
10861a71856O5088l9501L8187J56000J06673l7949j23814j28021n7507J10044
10851h2656M6192r427r2580O4418J18469O1693N189l5735j05664K4943m2378J20819
10839G3283R4771O0915n1491n6958j7266Q6975K08018j327j26226j7067o2894
10828A90733j44864M8154L48038L4100r4105j58548k45803M0390M2069K6770j18936
10817c2002K9717N0380j48532j6754R3481K1037m3898p1601m9887m6395j43165
10806c57619J58905O2204J06987l4560j73626n0011J40975J14851m1290m2085
10796a15269q0292j96170K2179K9361M5376R1448N8404o823N563K0035q0405k5258
10784b31851l6452J39247O3187l0811j0019q222j14600j59003q8496p4690J37759
$$ y = [-171856, -106768, -146269, -108082, 47918, 154591, 116642, -7172, -135193, -192700, -82656, -36464, -45891, -138471, -74053, 44416, 106109, 111298, 75563, -30101, -5158, -47536, 73283, 168054, 228969, 177478, 120520, 103254, 190229, 398247, 396920, 270694, 253627, 190733, 45869, 94023, 442061, 476161, 382056, 223508, -22295, 18095, 60164, 86934, -32002, -2285, 48095, -100437, -117191, -23710, -2673, -46571, -118172, -168059, -214454, -357619, -198714, -136510, -29523, -64083, -237709, -287720, -146745, -31894, -73184, -115269, -195561, -391731, -369552, -340191, -294815, -203367, -144963, -151786, -146223, -126188, -206593, -231851, -268303, -129056, -65869, -96680, -106699, -114921, -229521, -388524, -477020, -551710, -413951]
10773d13951n8027J94720l7584o847J8152o8989Q173o7430j25455j35604J13061
10762e79781J95291J36253J4734j9050J12653O5386j0930l4285n5933m0568j10771
10751c27001j59056J6963J7819J66255M6248j2746R6311n5387r5097m9512m6701
10740d01904N698j139J76693J18084Q9832k0325j72364j18858J4891P0260O1935
10729a77197M7597L6607M4090k29776N1719J51303K9088l7434l3255m3477k5409
10718a86144j0031J8267K09827N6897j29602K8983q6346M9936J9299k2761J2075
10707c9600P8173n8277j11792l9358R2619Q9130J5461M9694M88n1990j48412M1393
10695h2471P6578l822p6160M8820J14879J9851j43521o6994l4383n3050R0791
$$ y = [-413951, -471978, -277258, -314842, -321689, -303537, -372526, -364353, -431783, -557238, -692842, -579781, -384490, -248237, -233503, -252553, -139900, -74514, -85444, -119729, -175662, -216230, -327001, -486057, -469094, -451275, -285020, -238772, -251518, -155207, -210594, -305691, -355203, -401904, -396206, -397345, -220652, -102568, -12736, -33061, -205425, -324283, -309392, -239132, -177197, -129600, -92993, -48903, -278679, -226960, -75657, -46569, -84003, -117258, -160735, -186144, -196175, -177908, 31919, 88816, -40786, -11803, -98149, -48213, -28914, -51675, -39600, 38573, -19704, -131496, -170854, -78235, 10895, 26356, 76050, 76538, 24548, -123864, -82471, -5893, -9715, -85875, -37055, 77824, 97675, -45846, -112840, -147223, -200273, -109482]
10684a09482O6120j2560q2272J15141m9209j22114K31385R8160m4549j26724J434
10673c4670p6130k42606J6481j9414n8645R7136o012J59173K23671J16060r4601
10662H0443O117O9635L3675l2239R909j05802l1321K344j20339j05740M5472J60289
10650A2443J51460M738J33897J4879j8653l8626N4994J58360J00028Q2324L1219
10639F87063N6488q5818m5655N1373J12593j00258Q2239P8412J88164J27575J40839
10628A293015J85308K26983L34732M67452L39814K74205N05050N81359N82194
10619D790112N19584Q05674J046151J426317K094241K913759M096382N767328
10611B3459548Q140568J0600581J2295044J1946948Q447768L304584j308420l728141
$$ y = [-109482, -43362, -55922, -138194, -23053, -72262, -194376, 37009, 135169, 90620, -36104, -34670, -110800, -353406, -336925, -356339, -414984, -317848, -323860, -164687, 58984, 175044, 80443, 86560, 156195, 189870, 157631, 167540, 61738, 30417, 32761, -87578, -193318, -147846, 12443, 163903, 168641, 302538, 317417, 298764, 260138, 315132, 473492, 573520, 655844, 687063, 743551, 657733, 612078, 663451, 776044, 675786, 758025, 836437, 1024601, 1152176, 1293015, 1478323, 1705306, 2040038, 2507490, 2847304, 3121509, 3626559, 4207918, 4790112, 5309696, 6115370, 7161521, 8587838, 10682079, 13595838, 17692220, 23459548, 31600116, 42200697, 54495741, 66442689, 74890457, 78195041, 76886621, 73158480]
10603G3158480l616875j424483K342771P357147J3513801K0279181K5119410K3452277
10595A60181709J3695879J40952j0204932j4631523j3677025q489437j287012
10588A25728611P613503J7343672K6720339L2103175K7507037J0967619r143246
10581B38840710k2938138k7999951k6191949j9707898j1236092k276139O289843
10574A34780386J3407284J6905980J2784648J042656j2169733k0631063k2739325
10567A23380833k0432270j5391652r535152m286066J26479L274049M075103K023449
10559H3234773k846098p737130j0906925j1727157j0629849q551241o572623m855176
10551A9408574l671652k535403j895318j623632j318322q44111p95698o62245
$$ y = [73158480, 69541605, 68117122, 70459893, 77817040, 91330841, 111610022, 136729432, 160181709, 173877588, 174018540, 163813608, 149182085, 135505060, 127015623, 125728611, 133342114, 150685786, 177406125, 209509300, 237016337, 247983956, 238840710, 215902572, 187902621, 161710672, 142002774, 130766682, 128490543, 134780386, 148187670, 165093650, 177878298, 178920954, 166751221, 146120158, 123380833, 102948563, 87556911, 78021759, 73735693, 73862172, 77136221, 81211324, 83234773, 80388675, 72651545, 61744620, 50017463, 39387614, 30836373, 24263750, 19408574, 15736922, 13201519, 11306201, 9682569, 8364247, 7520136, 6724438, 6062193]
10543F062193o30763o12439k30521k46871l93949l15754j7886j48279j72377p8613
10533C214741j20785J8004j81288K136j64511j97995k79944j30873p5474j96978
10523A887033K8454L0364k1865j2313r79k19626K2705k3255O700n9786j89964
10512A447468o2691r6754j73077Q508l8014p2021p6918l3273L0194J01114J90853
10501A225389J40860j55026k6756j16089j69345q2890P5665j65125k8074J32969
10491H31578m823L2587M459r8225P098j92685l3052Q6992R8595L891j74165Q6876
10479F49126M9850k362O7933j88729j92376M2058Q2159O2331J4465J53450Q4591
10468H22496k4316j62711j33283r2671N3281M7362m4347N9110J35738m7289l3853
$$ y = [6062193, 5431430, 4818991, 4588470, 4341599, 3947650, 3631896, 3614010, 3465731, 3293354, 3214741, 3093956, 3111960, 2930672, 2932808, 2768297, 2570302, 2290358, 2159485, 2084011, 1887033, 1915487, 1945851, 1923986, 1911673, 1910694, 1691068, 1713773, 1690518, 1697218, 1637432, 1447468, 1384777, 1288023, 1114946, 1123454, 1085440, 1013419, 936501, 903228, 933422, 1034536, 1225389, 1366249, 1211223, 1184467, 1068378, 899033, 816143, 891808, 726683, 698609, 831578, 826755, 859342, 863801, 765576, 772674, 579989, 546937, 633929, 732524, 736415, 562250, 649126, 698976, 696614, 764547, 575818, 383442, 425500, 507659, 569990, 584455, 737905, 822496, 798180, 635469, 502186, 409515, 462796, 510158, 465811, 524921, 660659, 613370, 579517]
10457E79517j00468l9813L9400P826k5663j43370o9171K0409L6036N9499j10163
10446B54039k6084J05455p9712j0517J03157k0884M4256j11350r0982K3195K4937
10435B15510j2475J26882M9191p0432O8636J41261J33889O5627N6444o9900M0198
10424G44831j1649l24247j67397p769p236K71249K6792o9503k425j0276p0464
10413C71906j74552j52805m3774o218Q4415J38245O9983R2506J70954J26921j46831
10402E30750j42353Q8462o7825j20629L8042O2016p8810k4944Q2356J34962K7985
10391E30012N8335j0577j51593n6548R3212o3793j41587q1987m6467M0317J48256
10380C17580M6617j03547j49669M3277R9207K4868Q0532j04804j0130J2220O2363
$$ y = [579517, 479049, 439236, 478636, 486462, 460799, 317429, 248258, 268667, 304703, 364202, 254039, 227955, 333410, 253698, 243181, 346338, 325454, 369710, 258360, 167378, 190573, 215510, 203035, 329917, 379108, 308676, 377312, 518573, 652462, 718089, 774533, 704633, 744831, 733182, 408935, 241538, 233769, 226533, 497782, 524574, 455071, 452646, 442370, 371906, 197354, 44549, 775, -5443, 78972, 217217, 287200, 379706, 550660, 677581, 530750, 388397, 476859, 409034, 288405, 326447, 388463, 309653, 284709, 367065, 502027, 530012, 588347, 577770, 426177, 369629, 462841, 399048, 257461, 175474, 129007, 169324, 317580, 364197, 260650, 110981, 154258, 253465, 278333, 358865, 254061, 243931, 256151, 318514]
10369C18514n3150j54497n4815M658P0019q8723r5065j4899R5419k5706m7804
10358d6049J65038J06395k111Q7289L4859j71447j0051m7327l4419J22959L1021
10347B36157J10820p0639j731L5951j50148j42645o927J14727O5843R3362k0548
10336B64222l2636P8337P8137J0840r195M2991o3141o9117j12662j41684J00390
10325A46482P1579m0966k6888K3350k9634q2838j92796l8208M4480K10884J45999
10314B31444R0166l3749m0262J00158j3213o9599l8832j7147j11167n551P3409
10303A65657j30010l0738J9737j41043Q9759K05928J11137o9951r8616j14619
10293G241j03731n3222J83988K61357m6231J14611j86439j14239J04350L6028
$$ y = [318514, 265364, 110867, 56052, 60710, 130729, 42006, -53059, -67958, 27461, 1755, -46049, 118989, 225384, 223273, 310562, 345421, 173974, 163923, 116596, 82177, 205136, 236157, 346977, 276338, 274607, 310558, 160410, 17765, 10838, 125565, 191408, 284770, 264222, 231586, 309923, 388060, 398900, 389705, 432696, 369555, 300438, 187776, 46092, 146482, 218061, 177095, 150207, 173557, 143923, 61085, -131711, -169919, -125439, 85445, 231444, 321610, 287861, 247599, 347757, 334544, 264945, 226113, 208966, 97799, 92248, 165657, 35647, 4909, 24646, -116397, -26638, 179290, 290427, 220476, 121860, 7241, -96490, -149712, 34276, 295633, 249402, 364013, 177574, 63335, 167685, 203713]
10283B03713J45674o3807L1271n9739j69405j53757J04034K56318K63612m730
10273E53184k02572j34475j40820J8646L2461p7847L8842r7810Q4419K160n792
10262G0396J37659K19823j55170j34806Q1647J35974j4535r6651L1228K191r8514
10251A79242p2967r6313O538k6016j9047k2788J84003J21901j15696r4292M6439
10240I1004j03409m1608K3545p4535J33137K15958l1077n9782n1184p3565Q6445
10229A14929l5072M9851L6146m8521N4381O7874J24136M9202j77679j43962j31498
10218d0213O6927m2697l4351Q4844J11797N979n6563j4069k3409p0036p4728P3771
10206a2748m3082K4479J41917N4708j551j80861O8554K4130Q561J30200j46640
$$ y = [203713, 349387, 285580, 316851, 257112, 87707, -66050, 37984, 294302, 557914, 553184, 350612, 216137, 75317, 93963, 126424, 48577, 87419, -10391, 74028, 76188, 70396, 208055, 427878, 272708, 137902, 219549, 355523, 340988, 244337, 275565, 277756, 179242, 106275, 9962, 16500, -9516, -28563, -51351, 132652, 254553, 138857, 44565, 91004, -12405, -54013, -30468, -105003, 28134, 244092, 213015, 153233, 102049, 28484, 114929, 79857, 129708, 165854, 117333, 171714, 239588, 363724, 412926, 235247, 91285, -40213, 26714, -15983, -50334, 34510, 146307, 152286, 95723, 81654, 58245, -11791, -86519, -12748, -55830, -31351, 110566, 165274, 163723, -17138, 51416, 75546, 84107, 214307, 67667]
10195F7667j27749o7976J21983K06629o3916j8077l3098l3547R2288j3848p2851
10184E7505P3357P1853L1088R2673r2031O1565Q8884l7348j04334N0154N4266
10173C47632J46798J23918P1033j8761O5401o9304p7853q2748n0015l847k2696
10162D29558k7646R5344K78397K19441J09268n7445j88692n1643N7526r257L328
10151H58179p393J18163J82771J97255j8576o179o8297P0972O195k74915j86563
10140H71612M3022K47655M9672k7899J51290L0502j74298k03221j50309l21579
10130E16447k78381n4176J0150R9213P7710M9826n9026M0361J72652p5258p5567
10119D23951q0722m4743j7242p0808J18038j23998p6528j07512J726p1050j5039
$$ y = [67667, -60082, -128058, -6075, 200554, 136638, 118561, 85463, 51916, 144204, 130356, 57505, 130862, 202715, 233803, 326476, 234445, 296010, 384894, 347546, 243212, 293366, 347632, 494430, 618348, 689381, 670620, 736021, 666717, 588864, 506116, 456101, 452254, 429558, 401912, 497256, 775653, 995094, 1104362, 1046917, 858225, 806582, 864108, 854851, 858179, 850786, 968949, 1151720, 1348975, 1330399, 1324220, 1255923, 1326895, 1333090, 1058175, 871612, 914634, 1162289, 1211961, 1184062, 1335352, 1365854, 1191556, 988335, 838026, 516447, 238066, 183890, 194040, 293253, 370963, 420789, 361763, 402124, 574776, 499518, 423951, 343229, 298486, 281244, 210436, 328474, 204476, 127948, 20436, 22162, -48888, -63927]
10108f3927J8641l4340n8000Q9159O2684K9561o7490L7372J23396J3280k2725
10097A27611j79011j9593N8188n2734j36117p7886k6479P7052K12748j7755K4348
10086i628j06284Q62j2281l4691R5729r0025p3057J41796P1500j18312m0965K1823
10074a53533K2560M3161l3781P7202J94127J5660m4707j69888j64357J80486R9687
10063F6617Q7809K05283j97823j97342J067Q4692K39451p4731j77754o9295J8117
10052a3909l675L3770J50490K8101o8146j24768p6606J4787J66116R1463N9065
10041B56688j11094p9143j3382J66989M9139L369o2918o5573q1415m3331j9082
10030B47J33917j12315n8342J04828P6360j35418J3140Q6730J52431k0839j10165
$$ y = [-63927, -45286, -79626, -137626, -48467, 14217, 43778, -23712, 13660, 137056, 150336, 127611, -51400, -70993, -12805, -65539, -201656, -279542, -306021, -228969, -16221, -33976, -9628, -115912, -115050, -127331, -162022, -66293, -156318, -229375, -87579, -16079, -134391, -175356, -153533, -130973, -87812, -121593, -44391, 149736, 165396, 120689, -49199, -213556, -33070, 66617, 154426, 359709, 161886, -35456, -34389, 50303, 289754, 215023, 37269, -32026, -13909, -17584, 16186, 166676, 194777, 126631, 1863, -74743, -59956, 106160, 197623, 256688, 145594, 66451, 53069, 220058, 269197, 272566, 209648, 144075, 62660, 19329, 247, 134164, 21849, -36493, 68335, 144695, 9277, 22417, 109147, 261578, 240739, 130574]
10019A30574m5817m6155N3350o3063K7116Q2853R0771Q41j02285j96053k7160
10008i5028K284M5299m0617n2699r3193L3947J48741M6452n6137K4683Q552j21959
9996a49675j11675N5327J75272L2648j84921j27292J29998J84850J81909n8050
9986A28391j73363q9633M7812Q9609k3117L3519k8350j08527l3580n7524r1543
9975c06306J6857J10618J87506K69586j12315r8278L5768O9926m8366K12076K4390
9964C61462j53616l7133p7893k28926q2847p1703R5517K838J1790k9742O3248
9953a47005N8803l6052k6109J19366k22454j28162J27204J23502Q4611n9534m096
9942a09926j39891J27381j20778l1704k3682J32951J83414o2950j44186l1545
$$ y = [130574, 84757, 38602, 91952, 28889, 56005, 138858, 229629, 230470, 128185, -67868, -95028, -92744, -47445, -88062, -140761, -233954, -200007, -51266, -4814, -60951, -36268, -27716, -149675, -261350, -206023, -30751, 1897, -183024, -310316, -180318, 4532, 186441, 128391, -44972, -134605, -86793, 2816, -20301, 13218, -15132, -123659, -157239, -214763, -306306, -289449, -178831, 8675, 278261, 165946, 67668, 103436, 173362, 124996, 337072, 361462, 207846, 170713, 92820, -136106, -218953, -290656, -195139, -192301, -180511, -210253, -147005, -88202, -124254, -150363, -30997, -253451, -381613, -254409, -130907, -46296, -105830, -109926, -249817, -122436, -243214, -274918, -298600, -165649, 17765, -45185, -189371, -220916]
9932b20916J10792K32504J37319j08566o8145r208p1000m3956j050k1645K30840
9921A66969l9499k75537l1552M1383l9871N7379O9910J34893r2006r279m0456
9910e7666l7625J79350J6355J598Q4343o3093j65929j30603r6131l3971p9670
9899c83042K30221J22190K7910l8733M2134Q623j46191k24831K3665J93658o5297
9888b09693j1865N8342Q6071j1313o3155N1654O9105J47o3506j02963p5375J1741
9876b60810J02824J45450n5716j53441J37428J07213k3087m8670j4048k0418k56859
9865c40134P692N2378o2137p7722K22382N7727O8220Q7392L1847M0187n1197R9230
9853A35865O5466n0237j17725o9056k6802j414J17789j85293J06184O9753O2481
$$ y = [-220916, -110124, 122380, 259699, 151133, 82988, 73780, 2780, -41176, -42226, -63871, 166969, 127470, -148067, -179619, -138236, -178107, -120728, -50818, 84075, -7931, -17210, -57666, -95291, 84059, 100414, 102012, 186355, 123262, -42667, -173270, -269401, -303372, -383042, -152821, -30631, -2721, -41454, 680, 9303, -136888, -361719, -338054, -144396, -209693, -221558, -163216, -77145, -88458, -151613, -99959, -30854, -30707, -94213, -197176, -272551, -260810, -157986, -12536, -68252, -221693, -84265, 22948, -139, -48809, -62857, -83275, -340134, -332442, -280064, -342201, -419923, -197541, -139814, -71594, 15798, 47645, 87832, 36635, 135865, 201331, 151094, 33369, -35687, -62489, -63903, 53886, -131407, -25223, 44530, 107011]
9842A07011J7323l9149j33141r2288J05039Q2017K2444q3564J37408j0925o9705
9831D2470p2335J1993L5060l231l9304K9443o5401M2473J37196J27913k3590r1407
9819A31280L2720m9795Q6256p3619n2885j49168q6167L7163o3481N335Q5710R1295
9807e356J17365L7298N4969L6557n7316r2122j08048J18040k0181j7083N325J5385
9795H4833j19492q4045j26248k4610J91154N0391p9843P874J61681o0986K7879
9784B8588n5054l9864J2502O5418K8150o9055n1058J57312J8801k8902k07740
9773a40902L3530J36154J01469m2912J74341P5259p63k08665j35312m8530J33205
9762G6874l0309j39607j57887N3389M4070K0535R7126K2882q0002O0046M8953
$$ y = [107011, 124334, 85185, -47956, -140244, -35205, 46812, 69256, -14308, 123100, 112175, 42470, -29865, -17872, 17188, 13957, -25347, 4096, -61305, -18832, 118364, 246277, 222687, 131280, 164000, 114205, 200461, 126842, 73957, -75211, -161378, -124215, -187696, -182361, -96651, -5356, 112009, 149307, 204276, 240833, 183517, 91395, -16653, 101387, 81206, 64123, 69448, 84833, -34659, -118704, -244952, -269562, -78408, -28017, -107860, -99986, 61695, 709, 28588, -26466, -66330, -53828, 11590, 39740, -29315, -80373, 76939, 95740, 66838, -140902, -107372, 28782, 130251, 87339, 261680, 336939, 336176, 127511, -7801, -56331, 76874, 46565, -93042, -250929, -197540, -153470, -132935, -35809, -12927, -92929, -32883, 16070]
9751A6070r5623L2193l037p0289J7926N5617N8747K5012P296k75083j39982J26458
9739b44695R7550n605q8680Q1441P9807o5956R6538J48203N3023Q5469m2254j16406
9727G8435n1550R371q7640o1265K9404l2170j48332J21729K60997Q4323j59242
9716D4060j15148j26309l59672n4126J58320J84317J92412P1512o2331n7148j24546
9705b48659M5480Q6050L4793J9867K1280R1285p015J51170J01473r1211L0372
9694B34885M5533P7109J3526J3213n2657o271j87631o9935J03269P0808J6014
9683B57863j75886o1159J17272n4082j13359q319Q7432l941Q7515Q2202J6751
9672B32289j32202l05456M3990J97738j1784J0668j15013M8127p469K6799j06468
$$ y = [16070, -79553, -47360, -50397, -120686, -102760, -47143, 11604, 36616, 43912, -231171, -371153, -244695, -147145, -152750, -241430, -159989, -80182, -146138, -49600, 98603, 151626, 237095, 194841, 78435, 26885, 36256, -51384, -112649, -83245, -115415, -263747, -142018, 118979, 203302, 44060, -71088, -197397, -557069, -611195, -452875, -268558, -76146, -4634, -66965, -124113, -248659, -203179, -117129, -82336, -62469, -41189, 50096, 43081, 194251, 295724, 204513, 234885, 280418, 357527, 371053, 384266, 331609, 325338, 137707, 67772, 171041, 241849, 257863, 81977, 20818, 138090, 84008, -29351, -37670, 49762, 45821, 133336, 215538, 232289, 100087, -205369, -161379, 36359, 24575, 35243, -79770, -31643, -39112, -12313, -118781]
9661a18781j1371r4772J19681J86454P7224J44030N7814j79247P6030n0316P0474
9650B77220J17017J39895K58703J29512L6413n7511l68401l16612k10429q3756
9640g7949M3219L2382J17365J61593N5186l4020j62028j8033j39510j23273J94952
9629D9884L7050J69499P9182m9976p2859p1488r9012j5314L4568m5978p3966j1325
9617f9735J51445Q1412j9503N3130l7059q3772p8077m3473O3796J5893N0739j00454
9605a5658K1164q9042p921N044k80133r664k965N6955k9215m441M1315P007m9174
9592c56728r1748K50435M41280J6993p3610N2233j43050l7767N267j1635j62619
9581a10949j98505R5612K71005N6295q4821j12160p8336q5181j57447K42971Q4167
$$ y = [-118781, -130152, -224924, -105243, 81211, 158435, 302465, 360279, 181032, 257062, 206746, 277220, 394237, 534132, 792835, 922347, 958760, 901249, 532848, 216236, 5807, -77949, -34730, -2348, 115017, 276610, 331796, 297776, 135748, 117715, -21795, -145068, 49884, 86934, 256433, 335615, 285639, 212780, 141292, 42280, 26966, 61534, 15556, -58410, -69735, 81710, 163122, 143619, 196749, 159690, 75918, -2159, -45632, 18164, 34057, 84796, -15658, 5506, -83536, -91457, -86413, -366546, -376210, -379175, -322220, -351435, -355876, -314561, -307554, -356728, -448476, -198041, 243239, 260232, 186622, 238855, 95805, 58038, 63305, 51670, -110949, -309454, -213842, 57163, 113458, 28637, -83523, -161859, -247040, -404487, -161516, -77349]
9570g7349j23872j02575r2933J1203N0489K091M2254K26517J3909l7584N1627
9559c6223J68387J31328l340j12107L4116p8737r0197O1580J38548j0743l4980
$$ y = [-77349, -201221, -303796, -396729, -385526, -335037, -332946, -290692, -64175, -50266, -87850, -36223, 132164, 263492, 260152, 148045, 182161, 103424, 13227, 74807, 213355, 202612, 167632]
$$ [...]
##END NTUPLES=NMR SPECTRUM
##END=
