##TITLE=Analysis number 317476
Compound Code mo 00860
Book Reference 447/160
Project Code qc-cat
Chemist Name bos
##JCAMPDX= 6.0         $$ Bruker NMR JCAMP-DX V2.0
##DATA TYPE= NMR SPECTRUM
##DATA CLASS= NTUPLES
##ORIGIN= Bruker BioSpin GmbH
##OWNER= nmr
$$ XWIN-NMR		Version 3.5
$$ Tue Feb 21 14:22:24 2006 GMT Standard Time (UT+0h)  MAYBRIDGE\nmr@NMR_250MHZ
##.OBSERVE FREQUENCY= 250.131544655141
##.OBSERVE NUCLEUS= ^1H
##.ACQUISITION MODE= SIMULTANEOUS (DQD)
##.ACQUISITION SCHEME= undefined
##.AVERAGES= 16
##.DIGITISER RES= 18
##SPECTROMETER/DATA SYSTEM= dpx250
##.PULSE SEQUENCE= zg30
##.SOLVENT NAME= CDCl3
##.SHIFT REFERENCE= (INTERNAL, CDCl3, 0, 16.4504)
##AUDIT TRAIL= $$ (NUMBER, WHEN, WHO, WHERE, WHAT)
$$ ##TITLE= Audit trail, XWIN-NMR		Version 3.5
$$ ##JCAMPDX= 5.01
$$ ##ORIGIN= Bruker BioSpin GmbH
$$ ##OWNER= nmr
$$ C:\u/data/dgb/nmr/ADRS/16550/pdata/1/auditp.txt
$$ ##AUDIT TRAIL=  $$ (NUMBER, WHEN, WHO, WHERE, WHAT)
(   1,<2006-02-21 14:22:03.64 +000>,<MAYBRIDGE\nmr>,<NMR_250MHZ>,
      <created by zg, POWCHK disabled, PULCHK disabled
       configuration hash MD5:
       84 BC 41 DB A1 6E 1D 46 DA 25 12 A5 C1 ED C5 3A
       data hash MD5: 64K
       0F 91 74 16 1E A7 75 BF 63 CE 90 87 9A 79 B5 A2>)
(   2,<2006-02-21 14:22:14.75 +000>,<MAYBRIDGE\nmr>,<NMR_250MHZ>,
      <Start of raw data processing
       ef LB = 0.3 FT_mod = 6 PKNL = 1 SI = 32K 
       data hash MD5: 32K
       4F 21 30 0B DE CA 92 C9 1F 97 FE B5 B7 68 A0 B9>)
(   3,<2006-02-21 14:22:16.66 +000>,<MAYBRIDGE\nmr>,<NMR_250MHZ>,
      <apk 
       data hash MD5: 32K
       7F 3F 0C B9 D8 35 14 7D D0 DC AA E5 34 24 3F 24>)
(   4,<2006-02-21 14:22:17.41 +000>,<MAYBRIDGE\nmr>,<NMR_250MHZ>,
      <abs ABSG = 5 
       data hash MD5: 32K
       01 2C 20 A0 6C 0C BB 25 B4 D8 73 C1 56 DA 3E 18>)
$$ ##END=
$$ 
$$ hash MD5
$$ A2 DA 0E 5C 08 1E A3 D8 9F 33 FF 3C DE 00 09 3E
##$RELAX= 
##$RELAX= 
##$RELAX= 
##$RELAX= 
##$RELAX= 
##$RELAX= 
##$RELAX= 
$$ Bruker specific parameters
$$ --------------------------
##$DU= <C:\u>
##$EXPNO= 16550
##$NAME= <ADRS>
##$PROCNO= 1
##$TYPE= <nmr>
##$USER= <dgb>
##$AMP= (0..31)
100 100 100 100 100 100 100 100 100 100 100 100 100 100 100 100 100 100 
100 100 100 100 100 100 100 100 100 100 100 100 100 100 
##$AQSEQ= 0
##$AQ_mod= 3
##$AUNM= <au_zg>
##$AUTOPOS= <43 >
##$BF1= 250.13
##$BF2= 250.13
##$BF3= 250.13
##$BF4= 250.13
##$BF5= 500.13
##$BF6= 500.13
##$BF7= 500.13
##$BF8= 500.13
##$BYTORDA= 1
##$CFDGTYP= 0
##$CFRGTYP= 5
##$CHEMSTR= <none>
##$CNST= (0..31)
1 1 145 1 1 1 1 1 1 1 1 1 1 1 1 1 1 1 1 1 1 1 1 1 1 1 1 1 1 1 1 1 
##$CPDPRG= <>
##$CPDPRG1= <>
##$CPDPRG2= <>
##$CPDPRG3= <>
##$CPDPRG4= <mlev>
##$CPDPRG5= <mlev>
##$CPDPRG6= <mlev>
##$CPDPRG7= <mlev>
##$CPDPRG8= <mlev>
##$CPDPRGB= <>
##$CPDPRGT= <>
##$D= (0..31)
0 1 0 0 0 0 0 0 0 0.06 0 0 0 0 0 0 0.0002 0 0 0 0 0 0 0 0 0 0 0 0 0 0 
0 
##$DATE= 1140531722
##$DBL= (0..7)
120 120 120 120 120 120 120 120 
##$DBP= (0..7)
150 150 150 150 150 150 150 150 
##$DBP07= 0
##$DBPNAM0= <>
##$DBPNAM1= <>
$$ [...]
##$SUBNAM7= <"">
##$SUBNAM8= <"">
##$SUBNAM9= <"">
##$SW= 20.6930455092707
##$SWIBOX= (0..15)
0 0 3 0 0 0 0 0 0 0 0 0 0 0 0 0 
##$SW_h= 5175.983436853
##$TD= 65536
##$TD0= 1
##$TE= 294.16
##$TE2= 300
##$TE3= 300
##$TEG= 300
##$TL= (0..7)
0 120 120 120 120 120 120 120 
##$TP= (0..7)
150 150 150 150 150 150 150 150 
##$TP07= 0
##$TPNAME0= <>
##$TPNAME1= <>
##$TPNAME2= <>
##$TPNAME3= <>
##$TPNAME4= <>
##$TPNAME5= <>
##$TPNAME6= <>
##$TPNAME7= <>
##$TPOAL= (0..7)
0.5 0.5 0.5 0.5 0.5 0.5 0.5 0.5 
##$TPOFFS= (0..7)
0 0 0 0 0 0 0 0 
##$TUNHIN= 0
##$TUNHOUT= 0
##$TUNXOUT= 0
##$USERA1= <user>
##$USERA2= <user>
##$USERA3= <user>
##$USERA4= <user>
##$USERA5= <user>
##$V9= 5
##$VALIST= <valist>
##$VCLIST= <CCCCCCCCCCCCCCC>
##$VD= 0
##$VDLIST= <DDDDDDDDDDDDDDD>
##$VPLIST= <PPPPPPPPPPPPPPP>
##$VTLIST= <TTTTTTTTTTTTTTT>
##$WBST= 1024
##$WBSW= 4
##$XGAIN= (0..3)
0 0 0 0 
##$XL= 0
##$YL= 0
##$YMAX_a= 390726
##$YMIN_a= -502123
##$ZGOPTNS= <>
##$ZL1= 120
##$ZL2= 120
##$ZL3= 120
##$ZL4= 120
##$ABSF1= 16.45036
##$ABSF2= -4.242813
##$ABSG= 5
##$ABSL= 3
##$ALPHA= 0
##$AQORDER= 0
##$ASSFAC= 0
##$ASSFACI= 0
##$ASSFACX= 0
##$ASSWID= 0
##$AUNMP= <proc_1d>
##$AZFE= 0.1
##$AZFW= 0.1
##$BCFW= 0
##$BC_mod= 0
##$BYTORDP= 0
##$COROFFS= 0
##$CY= 12.5
##$DATMOD= 1
##$DC= 0
##$DFILT= <>
##$DTYPP= 0
##$F1P= 14.0000005364418
##$F2P= -0.99999901652339
##$FCOR= 0.5
##$FTSIZE= 32768
##$FT_mod= 6
##$GAMMA= 0
##$GB= 0
##$INTBC= 1
##$INTSCL= 1
##$ISEN= 128
##$LB= 0.3
##$LEV0= 0
##$LPBIN= 0
##$MAXI= 10000
##$MC2= 0
##$MEAN= 0
##$ME_mod= 0
##$MI= 0
##$NCOEF= 0
##$NC_proc= -2
##$NLEV= 6
##$NOISF1= 0
##$NOISF2= 0
##$NSP= 0
##$NTH_PI= 0
##$NZP= 0
##$OFFSET= 16.45036
##$PC= 1
##$PHC0= -110.6957
##$PHC1= 5.25286
##$PH_mod= 1
##$PKNL= yes
##$PPARMOD= 0
##$PSCAL= 4
##$PSIGN= 0
##$REVERSE= no
##$SF= 250.130017916913
##$SI= 32768
##$SIGF1= 0
##$SIGF2= 0
##$SINO= 400
##$SIOLD= 32768
##$SREGLST= <1H.CDCl3>
##$SSB= 0
##$STSI= 32768
##$STSR= 0
##$SW_p= 5175.98343685301
##$SYMM= 0
##$S_DEV= 0
##$TDeff= 65536
##$TDoff= 0
##$TI= <Analysis number 999999
Compound Code 99
Book Reference 9
Project Code 9>
##$TILT= no
##$TM1= 0
##$TM2= 0
##$TOPLEV= 0
##$USERP1= <user>
##$USERP2= <user>
##$USERP3= <user>
##$USERP4= <user>
##$USERP5= <user>
##$WDW= 1
##$XDIM= 32768
##$YMAX_p= 356825276
##$YMIN_p= -146501
$$ End of Bruker specific parameters
$$ ---------------------------------
##NTUPLES= NMR SPECTRUM
##VAR_NAME=  FREQUENCY,     SPECTRUM/REAL,   SPECTRUM/IMAG
##SYMBOL=    X,             R,               I
##VAR_TYPE=  INDEPENDENT,   DEPENDENT,       DEPENDENT
##VAR_FORM=  AFFN,          ASDF,            ASDF
##VAR_DIM=   32768,         32768,           32768
##UNITS=     HZ,            ARBITRARY UNITS, ARBITRARY UNITS
##FACTOR=    0.157963299565203, 1,           1
##FIRST=     4114.72867757505, 0,            0
##LAST=      -1061.25475927796, 0,           0
##MIN=       -1061.25475927796, -146501,     0
##MAX=       4114.72867757505, 356825276,    0
$$ Real data points
##PAGE= N=1
##DATA TABLE= (X++(R..R)), XYDATA
$$ [...]
17154A5241N462O086J9836K7312j5621n5735j2518j9180M869L2168N463K1014
$$ 15241 20703 26789 46625 73937 58316 2581 -9937 -29117 -24248 7920 13383 34397
17142C4397O393n118l2415j6537J6110N76j848J2894j0310k929k0515P768n979
$$ 34397 40790 35672 3257 -13280 2830 3406 1558 14452 4142 1213 -19302 -11534 -17513
17129a7513K0418L565q999n931K805Q966J6624J9052k3551j739K1011k5020l0289
$$ -17513 2905 6470 -2529 -8460 -5655 3311 19935 38987 15436 13697 34708 9688 -20601
17116b0601j14K3976J4308o0397J0433P325m304l868r024p567K8144K5868J1947
$$ -20601 -20715 3261 17569 -42828 -32395 -25070 -29374 -33242 -42266 -49833 -21689 4179 16126
17103A6126j8185j3385o972J5714Q903l2911L943j1980M135O670K2539m258j4957
$$ 16126 -2059 -15444 -22416 -6702 2201 -30710 -26767 -38747 -34612 -27942 -5403 -9661 -24618
17090b4618J6596j4960K1361J1133R373Rl480k2718j804q822J132k2082j4337
$$ -24618 -8022 -22982 -1621 9512 18885 18894 15414 -7304 -9108 -17930 -16798 -38880 -53217
17077e3217L230n395J5945O371K0823J2619k2682k4519l1055j0343m818K4616
$$ -53217 -49987 -55382 -39437 -33066 -12243 376 -22306 -46825 -77880 -88223 -93041 -68425
17065f8425K0039J3593P946m941K2244L3833r734l591K1270M645m390k6835m7554
$$ -68425 -48386 -34793 -26847 -31788 -9544 24289 14555 10964 32234 36879 32489 5654 -41900
17052d1900J1685L4177K043k2535R714J7436P519l4311k5001L0915K5049P250
$$ -41900 -30215 3962 6005 -16530 -6816 10620 18139 -16172 -41173 -10258 14791 22041
17040B2041N661j3195j1597m267J887j1556j6994J1500j0088k2794K4918K9627
$$ 22041 27702 14507 2910 -1357 530 -11026 -28020 -16520 -26608 -49402 -24484 5143
17028E143K8079k8773k8797k3707j4215N358K8660N290J4376K1213K771L246J5854
$$ 5143 33222 4449 -24348 -48055 -62270 -56912 -28252 -22962 -8586 12627 15398 18644 34498
17015C4498k0239k8202l9293o657K5094M552K0325J5816m93j0548j7614K0519
$$ 34498 14259 -13943 -53236 -59893 -34799 -30247 -9922 5894 5401 -5147 -22761 -2242
17003b242r044R171j6402L2020l675m0826q992J8879l500j0012j49q88n080k6057
$$ -2242 -11286 -2115 -18517 13503 9828 -30998 -39990 -21111 -24611 -34623 -34772 -35660 -40740 -66797
16989f6797L1440K6638p99k4976J436Q080k666J8381l230m5533k129J3976L1052
$$ -66797 -35357 -8719 -9518 -34494 -33058 -24978 -27644 -9263 -12493 -58026 -60155 -46179 -15127
16976a5127J1174l500j2101j2731m784J2695Q670k3754J865K6482k279k1770J701
$$ -15127 -3953 -7453 -19554 -32285 -37069 -24374 -15704 -39458 -37593 -11111 -13390 -35160 -33459
16963c3459K1595J4212m173K2838m0887l9013K4081j09k5601l7151K4594j80Q835
$$ -33459 -11864 2348 -1825 21013 -19874 -58887 -34806 -34915 -60516 -97667 -73073 -73253 -64418
16950f4418J7899M3341J1323J0058R913r390k2077J1486L836k8756m779J4261
$$ -64418 -46519 -3178 8145 18203 28116 18726 -3351 8135 11971 -16785 -21564 -7303
16938g303K4674j0368j4027q001k8725j1030N027J3037N79j124P780N2543P939
$$ -7303 17371 7003 -7024 -15025 -43750 -54780 -49753 -36716 -36137 -37261 -29481 23062 31001
16925C1001r582l4160M614n89l2862o473K7498J144J2873J0953J2054j9821k5449
$$ 31001 21419 -12741 -8127 -8716 -41578 -48051 -20553 -19409 -6536 4417 16471 -3350 -28799
16912b8799l9391O497M8586P399k441j9130m9415l6718r842K7271J6172R332L2306
$$ -28799 -68190 -61693 -13107 -5708 -8149 -27279 -76694 -113412 -123254 -95983 -79811 -70479 -38173
16899c8173j712l970o565M999Q096K0522M2802O560q639K3374m5130l7453j1465
$$ -38173 -39885 -43855 -50420 -45421 -37325 -16803 25999 32559 23920 47294 2164 -35289 -46754
16886d6754L165m611r087N1682M1126J369j2207J0387O178m3650p038O127o77
$$ -46754 -43589 -48200 -57287 -5605 35521 36890 24683 35070 41248 -2402 -9440 -3313 -3990
16873c990k422K2665J3403k8799k8700k2509j7085K2812K1678k6173M352L9330
$$ -3990 -6412 16253 29656 857 -27843 -50352 -67437 -44625 -22947 -49120 -44768 -5438
16861e438J0538k8533o492M5806j4331p969L099l203k5325j5290J0312R470K657
$$ -5438 5100 -23433 -29925 15881 1550 -6419 -3320 -6523 -31848 -47138 -36826 -27356 -24699
16848b4699j9689k4216R717J3433k858j2115j558J5303j4491K3039n026L620J0509
$$ -24699 -44388 -68604 -58887 -45454 -48312 -60427 -61985 -46682 -61173 -38134 -43160 -39540 -29031
16835b9031j1992K354K6724p955J9178J1324J280j4854j4614L909J496k3920l3881
$$ -29031 -41023 -38669 -11945 -19900 -722 10602 11882 -2972 -17586 -13677 -12181 -36101 -69982
16822f9982k739K5331K4389J0315r667O928j3309j3620N430J1886l9025m2897
$$ -69982 -72721 -47390 -23001 -12686 -22353 -15425 -28734 -42354 -36924 -25038 -64063 -106960
16810a06960P456M6204J6352n505r481P462J9836J282J4420j0019k819k1121j6265
$$ -106960 -99504 -53300 -36948 -42453 -51934 -44472 -24636 -23354 -8934 -18953 -21772 -42893 -59158
16797e9158j9820j614K4285m724J9861O0648M3226m1972j7859o936o792M4567
$$ -59158 -78978 -80592 -56307 -61031 -41170 19478 62704 20732 2873 -4063 -10855 33712
16785C3712m580k3725l0633o599o567r306K801J6725J5807J6823L3552j5305j2560
$$ 33712 29132 5407 -25226 -31825 -38392 -47698 -44897 -28172 -12365 4458 38010 22705 10145
16772A0145K573l1347k4526J0625J2687k56o146K530J5583K4653J4937J4292k0278
$$ 10145 12718 -18629 -43155 -32530 -19843 -20099 -26245 -23715 -8132 16521 31458 45750 25472
16759B5472k3814K272J4083k469O296m191o051n760m0Q682K7308l6955j2291K8233
$$ 25472 1658 3930 18013 15544 21840 17649 11598 5838 5798 14480 41788 4833 -7458 20775
16745B0775K8563M755j2509J022p485j9505n422k6983j7479j3050p953P926J8586
$$ 20775 49338 54093 41584 42606 35121 15616 10194 -16789 -34268 -47318 -55271 -47345 -28759
16732b8759L1648N1j2657l4416k990J9715P978p418M4600J6820k3995j4624m2251
$$ -28759 2889 2940 -9717 -44133 -47123 -27408 -19430 -26848 17752 34572 10577 -4047 -46298
16719d6298J608O0678m6736m2765M2293K9580j5764j7773p110j4403J5561L7183
$$ -46298 -44690 15988 -30748 -73513 -31220 -1640 -17404 -35177 -42287 -56690 -41129 -3946
16707c946p769j7009p59j4795L346n263K558K6561Q711J9149J4326M184J8952
$$ -3946 -11715 -28724 -29483 -44278 -40932 -46195 -43637 -17076 -8365 10784 25110 29294 48246
16694D8246j1561o738q316k0164k1066Q459m070J82K269j4399j0964k347k8506
$$ 48246 36685 29947 21631 1467 -19599 -11140 -15210 -15028 -12759 -27158 -38122 -40469 -68975
16681f8975j6457J9796K0199K5310J7790j021l7440P754k9411j6790J1984K4114
$$ -68975 -85432 -65636 -45437 -20127 -2337 -3358 -40798 -33044 -62455 -79245 -67261 -43147
16669d3147K3321j6894J109p403L405L7723R928K6319l245m934j1762k6782k2823
$$ -43147 -19826 -36720 -35611 -43014 -39609 -1886 8042 34361 31116 26182 14420 -12362 -35185
16656c5185j6964L9759L0295J970K8728j293n550k5878m1319P297k878m236J0706
$$ -35185 -52149 -12390 17905 19875 48603 47310 41760 15882 -25437 -18140 -21018 -25254 -14548
16643a4548K246k8725k6060J2154J2546j2355J9221J4062P23j801J0986J2755
$$ -14548 -12302 -41027 -67087 -54933 -42387 -54742 -35521 -21459 -20736 -22537 -11551 1204
16631A204j5824m8342j7744J1911j449J2574K8070j6349j013K6125k493k6399
$$ 1204 -14620 -62962 -80706 -68795 -70244 -57670 -29600 -45949 -46962 -20837 -23330 -49729
16619d9729l3933J2120K6152O065j0911J9105K9973J4978l993O552n689k2637
$$ -49729 -83662 -71542 -45390 -39325 -50236 -31131 -1158 13820 9827 16379 10690 -11947
16607a1947j5179M2926J9833J530j7173n6727k9269J0450J7056j6373j771M8247
$$ -11947 -27126 15800 35633 37163 19990 -36737 -66006 -55556 -38500 -54873 -56644 -8397
16595h397L5236k0784j0997l698l5294J0688j7001N475R78L5544P29k6577K2260
$$ -8397 26839 6055 -4942 -8640 -43934 -33246 -50247 -44772 -43794 -8250 -7521 -34098 -11838
16582a1838K0308m226r83L953j74j3970j7201j7907j2304j4023N640J3284J0603
$$ -11838 8470 4244 3261 7214 7040 -6930 -24131 -42038 -54342 -68365 -62725 -49441 -38838
16569c8838J3008m776k9616j6474J7180j6629K322M1047L6866K7208j4186k3225
$$ -38838 -25830 -30606 -60222 -76696 -59516 -76145 -73823 -32776 4090 31298 17112 -6113
16557f113l4031j6989J3918J3840k1868q937j3471J7657J6264J5419R679k410
$$ -6113 -40144 -57133 -43215 -29375 -51243 -60180 -73651 -55994 -39730 -24311 -14632 -17042
16545a7042j8906K3443L0868K4600l3265j2591J4855K8221j8662k0444J123O918
$$ -17042 -35948 -12505 18363 42963 9698 -2893 11962 40183 21521 1077 2200 9118
16533I118K5620J6857l2958j5376j369L1949k074k0416k5210k9j4211J0404J3804
$$ 9118 34738 51595 18637 3261 1892 33841 31767 11351 -13859 -13888 -28099 -17695 -3891
16520c891k3950J5003M356k1004P255K6334J6496j2006j0413J2847J6799q435
$$ -3891 -27841 -12838 -8482 -29486 -22231 4103 20599 8593 -1820 11027 27826 19391
16508A9391l5088k7057K1777R059m946J2362p63j1519K467l8O118j3543m8993
$$ 19391 -15697 -42754 -20977 -11918 -16864 -4502 -5265 -16784 -14317 -14355 -8237 -21780 -70773
16495g0773j177L6816M6591K2750j3459j7570k0521p057j8670j3770P843k1345
$$ -70773 -71950 -35134 11457 34207 20748 3178 -17343 -24400 -43070 -56840 -48997 -70342
16483g0342P164P675J0657J8616J3995j3515p731L674L777j3627R637j8602k2479
$$ -70342 -63178 -55503 -44846 -26230 -12235 -25750 -33481 -29807 -26030 -39657 -30020 -48622 -71101
16470g1101m730J1476K6781R768j3046m3791m929L6613L7806n455j1968M544j3220
$$ -71101 -75831 -64355 -37574 -27806 -40852 -84643 -89572 -52959 -15153 -20608 -32576 -28032 -41252
16457d1252r027L2643N393M744q645J0393M927k4094N936P497K339R268L0956
$$ -41252 -50279 -17636 -12243 -7499 -16144 -5751 -824 -24918 -18982 -11485 -9146 122 31078
16444C1078k0567k4135n849K6940J6058K176K5314Q085j376j9660k0683k5822
$$ 31078 10511 -13624 -19473 7467 23525 25701 51015 59100 57724 38064 17381 -8441
16432h441m958O628P363j2576J7382J6337p329k9033k3913R717J3697j9926n063
$$ -8441 -13399 -6771 592 -11984 5398 21735 14406 -14627 -38540 -28823 -15126 -35052 -40115
16419d0115J307J4697j0822K0652M2802J7501p795N06j575j4590P52O545k1179
$$ -40115 -38808 -24111 -34933 -14281 28521 46022 38227 38733 37158 22568 23320 29865 8686
16406H686n263J8121J6168j3952k9808N306q101k222l2962j5149J0793J7432J5261
$$ 8686 3423 21544 37712 23760 -6048 -742 -8843 -11065 -44027 -59176 -48383 -30951 -15690
16393a5690J7574M89r637J4254J5617k6744O048R966K6205k2700k3126o377K0130
$$ -15690 1884 2373 -7264 6990 22607 -4137 1911 11877 38082 15382 -7744 -14121 6009
16380F009K8893J1332j9915k1707k7145P947k8089m1039j2623j5073K0351M7960
$$ 6009 34902 46234 26319 4612 -22533 -14586 -42675 -83714 -96337 -111410 -91059 -43099
16368d3099O0556P365j4360Q402k0968R937j2734n4904K0819K9567J4797R447
$$ -43099 17457 24822 10462 18864 -2104 7833 -4901 -59805 -38986 -9419 5378 14825
16356A4825Q529k9793p988J3910j9517k1280j5966q574K9516J0124P686L592k2019
$$ 14825 23354 -6439 -14427 -517 -20034 -41314 -57280 -65854 -36338 -26214 -18528 -14936 -36955
16343c6955L098J5055o493J363L043L8534K9152j1349m5289j6313j5447o515Q27
$$ -36955 -33857 -18802 -25295 -23932 -20889 17645 46797 35448 -9841 -26154 -41601 -48116 -47289
16330d7289J4786o150J1315p357n462K1498K1032P163l2356j4611J1356L1746
$$ -47289 -32503 -38653 -27338 -34695 -40157 -18659 2373 9536 -22820 -37431 -26075 5671
16318E671R848m538j2062R721q549N678m18j7791L017K9177K7589J2528j6375
$$ 5671 15519 10981 -1081 8640 91 5769 5351 -12440 -9423 19754 47343 59871 43496
16305D3496j6722o162n525l1298j5680K0009J3804j7670k0350l8606K5015L4894
$$ 43496 26774 20612 15087 -16211 -31891 -11882 1922 -15748 -36098 -74704 -49689 -14795
16293a4795j6375m819K1989J2464o72K812L486J4815J8897p038k5127j4321J1620
$$ -14795 -31170 -35989 -14000 -1536 -2208 604 4090 18905 37802 30764 5637 -8684 2936
16280B936K7343j6415p534j8330k8034p70J4740L502J2846k6623l121K3447L4876
$$ 2936 30279 13864 6330 -12000 -40034 -40804 -26064 -22562 -9716 -36339 -39460 -16013 18863
16267A8863O347k9826k5279j6573j1719J0441Q013J7971j4198l1117J7894O047
$$ 18863 25210 -4616 -29895 -46468 -58187 -47746 -39733 -21762 -35960 -67077 -49183 -43136
16255d3136r95O53J843j5728J1168L1734J2119K0013p693J6469k948k6941k4532
$$ -43136 -44131 -43478 -41635 -57363 -46195 -14461 -2342 17671 9978 26447 23499 -3442 -27974
16242b7974J7724L9223l6330k2634K4336L01m986j6843R381K4700L3972k1397
$$ -27974 -10250 28973 -7357 -29991 -5655 -5354 -10340 -27183 -17802 6898 40870 19473
16230A9473n2049q367J5552L1156k6622k0420J5305n603p969K2732o886l750M569
$$ 19473 -32576 -40943 -25391 5765 -20857 -41277 -25972 -31575 -39544 -16812 -23698 -27448 -22879
16217b2879J3436J3548p322K4626j9755J7383k541k499J5142k807J223J828j8843
$$ -22879 -9443 4105 -3217 21409 1654 19037 16496 13997 29139 26332 27555 29383 10540
16204A0540j5574N535J7409l2607j5118j5009j4335l72N890J7833J6765P127J9707
$$ 10540 -5034 501 17910 -14697 -29815 -44824 -59159 -59531 -53641 -35808 -19043 -11916 7791
16191G791J060q417M23J6499L842l0384l3267P374J9746J4719P136j7848j7003
$$ 7791 8851 434 857 17356 21198 -9186 -42453 -35079 -15333 -614 6522 -11326 -28329
16178b8329K403j8486Q221J2368K5737J7106j2141q415J6375k1973n615M144o616
$$ -28329 -25926 -44412 -36191 -23823 1914 19020 6879 -1536 14839 -7134 -12749 -8605 -15221
16165a5221Q659o368J199k1618l455K4008L1240K7033l9192o712k9735L163L1503
$$ -15221 -6562 -12930 -11731 -33349 -36804 -12796 18444 45477 6285 -427 -30162 -26999 4504
16152D504Q468m465k44L917J3659J5887p92k8851J0J522K514J0248p691R95J7730
$$ 4504 12972 8507 8263 12180 25839 41726 40934 12083 12093 13615 16129 26377 18686 19681 37411
16137C7411j2691k3421l664O998J4342j5173n767l1251J2847J9507j4891N923
$$ 37411 24720 1299 -2365 4633 18975 3802 -1965 -33216 -20369 -862 -15753 -9830
16125i830J3977j2295k477J4908l618R019J4902j2454j6934o910K3538J2959M741
$$ -9830 4147 -8148 -10625 4283 665 9684 24586 12132 -4802 -11712 11826 24785 29526
16112B9526l665l5880k8054J9273q750K9652J9022l4664l3024J491K3826j9116
$$ 29526 25861 -10019 -38073 -18800 -27550 2102 21124 -13540 -46564 -45073 -21247 -40363
16100d0363j6210J4205J4881M840J4695J732J5700K488j0005n802K0502j5652
$$ -40363 -56573 -42368 -27487 -22647 -7952 -6220 9480 11968 1963 -3839 16663 1011
16088A011N982M631K0255R023K1445K7288j3131r843k5352k6837J5211P070m458
$$ 1011 6993 11624 31879 40902 62347 89635 76504 66661 41309 14472 29683 36753 32295
16075C2295Q947M201l1775p937O8K1656K7937j0742j8571Q137j6049n5096J5658
$$ 32295 41242 45443 13668 5731 5799 27455 55392 44650 26079 34216 18167 -36929 -21271
16062b1271J4805M112K2525L967j4302n046J5016j5187M827Q976j7915N605J2090
$$ -21271 -6466 -2354 20171 24138 9836 4790 19806 4619 9446 18422 507 6112 18202
16049A8202n07k908l4294Q032j5051k432L7359J7437k4829k4442j4474J4801J0380
$$ 18202 17695 14787 -19507 -11475 -26526 -28958 8401 25838 1009 -23433 -37907 -23106 -12726
16036a2726k5446j6138o221K1277r299l232K2910K6076o066k6882K4020K576j4706
$$ -12726 -38172 -54310 -60531 -39254 -48553 -51785 -28875 -2799 -8865 -35747 -11727 -9151 -23857
16023b3857j5830P165R590J152J1834j6433j7943J4781K1590K1526K175k1848
$$ -23857 -39687 -32522 -22932 -21780 -9946 -26379 -44322 -29541 -7951 13575 15750 -6098
16011f098j0532J628L3599K6130j1671k7124j7681J4119R552j0176o55l386P131
$$ -6098 -16630 -15002 18597 44727 33056 5932 -11749 2370 11922 1746 1091 -2295 4836
15998D836L1048L1073J45m9213m4509p526L1125L350l9005L5017L4969j8481l7989
$$ 4836 35884 66957 67102 17889 -26620 -34146 -3021 329 -38676 -3659 31310 12829 -25160
15985b5160j2422o321K3802M3886K7000o085l5313j2262N368k3512j2570K1374
$$ -25160 -37582 -43903 -20101 23785 50785 44700 9387 -2875 2493 -21019 -33589 -12215
15973a2215K6330J8973j8819r455l670m662J7895n092k5942j0190P909j634M2
$$ -12215 14115 33088 14269 4814 1144 -3518 14377 9285 -16657 -26847 -18938 -20572 -20530
15960b0530j0677P812K6599J3117q061j8633J7238J7943j1762j844n085O481n458
$$ -20530 -31207 -23395 3204 16321 8260 -10373 6865 24808 13046 11202 6117 12598 7140
15947G140k1005k4860o681j3941j7848J4748J5054K1771L4496Q446l7927J6556
$$ 7140 -13865 -38725 -45406 -59347 -77195 -62447 -47393 -25622 8874 17320 -20607 -4051
15935d051J9248K0367J2401n181r863k2126R166n122r665j4067j3204L949L9314
$$ -4051 15197 35564 47965 42784 32921 10795 19961 14839 5174 -8893 -22097 -18148 21166
15922B1166J4449j0058l2407j5916r127J5895N615r591j2678p390j001K0794J7321
$$ 21166 35615 25557 -6850 -22766 -31893 -15998 -10383 -19974 -32652 -40042 -41043 -20249 -2928
15909b928J8407j7503R60j0220l4057j9931K5055P295j5124J8938J1786J4217
$$ -2928 15479 -2024 -1064 -11284 -45341 -65272 -40217 -32922 -48046 -29108 -17322 -3105
15897c105L455j6038j689L373L0888j257m6501J8636K7747K0466l2742j950n21
$$ -3105 350 -15688 -17377 -14004 16884 15627 -30874 -12238 15509 35975 3233 1283 762
15884G62p826K9531r007l524k6395k2531o124m476K2150K188K1687k5554m951
$$ 762 -7064 22467 13460 9936 -16459 -38990 -45114 -49590 -27440 -25252 -3565 -29119 -34070
15871c4070j9306J7600L2319K565j3470q126o057j6881L2385K856j0172p464k2138
$$ -34070 -53376 -35776 -3457 -892 -14362 -22488 -28545 -45426 -13041 -10185 -20357 -27821 -49959
15858d9959j0622k407K8473M934j9355M873K2327k341k3125K2596J6673J0679
$$ -49959 -60581 -62988 -34515 -29581 -48936 -44063 -21736 -24077 -47202 -24606 -7933 2746
15846B746j0538o516L1619R336k5571j3042O343L4354j836j2054j6496k4393K691
$$ 2746 -7792 -14308 17311 26647 1076 -11966 -5623 28731 26895 14841 -1655 -26048 -23357
15833b3357J1940L5176K2549j7985j7293k3458M78K0648r57k567L698j5329j4559
$$ -23357 -11417 23759 46308 28323 11030 -12428 -11950 8698 7741 5174 8872 -6457 -21016
15820b1016J7082J0786J4350j0997Q822k343j6639r976R823J2228O681k49k3661
$$ -21016 -3934 6852 21202 10205 19027 16684 45 -9931 -108 12120 18801 18552 -5109
15807e109q96l0431n85P323K2464k1734m3233J0366J9979K0602K164n093L0866
$$ -5109 -6005 -36436 -37021 -29698 -7234 -28968 -72201 -61835 -41856 -21254 -19090 -24183 6683
15794F683K8331J144j3933N640K6316j9120m3538j2974o91O208R317J5552q314
$$ 6683 35014 36158 22225 27865 54181 35061 -8477 -21451 -22142 -15934 -6617 8935 621
15781F21P549J8869O056j0946P733R70m550l3603O585n235j9625p576Q187K2308
$$ 621 8170 27039 33095 22149 29882 30852 26302 -7301 -716 -5951 -25576 -33152 -24965 -2657
15767b657o954J3488O549j9621k3981m639P918o088L8003J9673j0507N831O830
$$ -2657 -9611 3877 10426 -9195 -33176 -37815 -29897 -35985 2018 21691 11184 17015 23845
15754B3845K5071j0522j6568m3504j9370K6666J7642R029q59o272M2115o374j7980
$$ 23845 48916 38394 21826 -21678 -41048 -14382 3260 12289 11430 5158 47273 40899 22919
15741B2919j1307K8318J0230K4293l5208l7029j552J4419J395J4350K9963r088
$$ 22919 11612 39930 50160 74453 39245 2216 664 15083 16478 30828 60791 51703
15729E1703R411M896j3307l4805J5577Q647p669j6163o432R583o508k3874k2403
$$ 51703 61114 66010 52703 17898 33475 42122 34453 18290 11858 21441 14933 -8941 -31344
15716c1344K2457j4067J9458N489n084r199K5619N773P133j149l1998m441j7223
$$ -31344 -8887 -22954 -3496 1993 -3091 -12290 13329 19102 26235 25086 -6912 -11353 -28576
15703b8576J070J0178j2474k2108m47j0986J9855J5951q208K4576K5710l0758
$$ -28576 -27506 -17328 -29802 -51910 -52357 -63343 -43488 -27537 -35745 -11169 14541 -16217
15691a6217k5151j957j8792R136J6617K0672J2871K0214k865p265J8952j7129
$$ -16217 -41368 -43325 -62117 -52981 -36364 -15692 -2821 17393 14528 7263 26215 9086
15679I086r348J0181J1518K6608J054l3116j9704J1517P207O659n261m0433k3584
$$ 9086 -262 9919 21437 48045 49099 15983 -3721 7796 15003 21662 16401 -24032 -47616
15666d7616j8148K1739M7435M860k4276k3713l0716M939O526r869L4778R416J0058
$$ -47616 -65764 -44025 3410 8270 -16006 -39719 -70435 -65496 -58970 -68839 -34061 -24645 -14587
15653a4587P433K578J2581j0018L534j2998k5436L747J7331j2055N434M971k8123
$$ -14587 -7154 -4576 8005 -2013 1521 -11477 -36913 -33166 -15835 -27890 -22456 -17485 -45608
15640d5608J4092L2240j6119r93M9578L8527J172k4138k2113l9153n5940L1871
$$ -45608 -31516 724 -15395 -16388 33190 71717 72889 48751 26638 -12515 -68455 -36584
15628c6584J0063J7766K1479R034r831n6380Q951L6086K8425J8653m1683j3291
$$ -36584 -26521 -8755 12724 21758 11927 -44453 -35502 584 29009 47662 5979 -7312
15616g312J691L865K0497k742q563N086J2543k0310l5748m98J2748J4953j6371
$$ -7312 -5621 -1756 18741 15999 7436 12522 25065 4755 -30993 -31491 -18743 -3790 -20161
15603b0161J4460J9381k1694l2152k69N514R372J1761R080q206J1085j3061j1637
$$ -20161 -5701 13680 -8014 -40166 -40435 -34921 -25549 -13788 -4708 -12914 -1829 -14890 -26527
15590b6527K6745J5414j2807n449L3601P394K2410j5014n3927j2267K0602J7627
$$ -26527 218 15632 2825 -2624 30977 38371 60781 45767 -8160 -20427 175 17802
15578A7802M798m3867k3625l836J5504K6531K9370j5720k6631o912o480K3084
$$ 17802 22600 -21267 -44892 -48728 -33224 -6693 22677 6957 -19674 -26586 -33066 -9982
15566i982k417r35j771J6094L0877J6713j3422n0163j7060J0231M783j9459K1839
$$ -9982 -12399 -13334 -15105 989 31866 48579 35157 -15006 -32066 -21835 -17052 -36511 -14672
15553a4672K7240k2511j8500J5290K6508L038n4990M65J2859o407J6009j0748
$$ -14672 12568 -9943 -28443 -13153 13355 16393 -38597 -38132 -25273 -31680 -15671 -26419
15541b6419j998n321j7332P41L0178L1970j1833J1232P810j9347j1441J1551m67
$$ -26419 -28417 -33738 -51070 -50329 -20151 11819 -14 11218 19028 -319 -11760 -209 -676
15528f76l4924q173L0890K391j3344K0203K341J257J3171k806l0706m069K6612
$$ -676 -35600 -43773 -12883 -10492 -23836 -3633 -1292 -35 13136 10330 -20376 -24445 2167
15515B167j1149l8269j0930J4421K4730l897k1235P358N8834m022j6345k59K3831
$$ 2167 -8982 -47251 -58181 -43760 -19030 -22927 -44162 -36804 22030 18008 1663 1404 25235
15502B5235k6222q512o106j510J2759K6529L420Q772k4688m1595o955j2725n012
$$ 25235 -987 -9499 -15605 -17115 -4356 22173 25593 34365 9677 -31918 -38873 -51598 -56610
15489e6610M656k1002j598K8730K0063n73p002J017J6769j2394J5621O129M405
$$ -56610 -51954 -72956 -74554 -45824 -25761 -26334 -33336 -32319 -15550 -27944 -12323 -6194 -1789
15476a789K027J5421K6535k8832k1368j9278K227Q986R786J5448J3368p316r720
$$ -1789 238 15659 42194 13362 -8006 -27284 -25057 -16071 -6285 9163 22531 15215 5495
15463E495j4339R064J7464o353R981l403j5633j5073M199P073K6727p338J1363
$$ 5495 -8844 220 17684 11331 21312 17909 2276 -12797 -8598 -1525 25202 17864 29227
15450B9227j9479n846L3953l520k0283m8882j5908J4761K8043J774M889p752J8154
$$ 29227 9748 3902 37855 34335 14052 -34830 -50738 -35977 -7934 -6160 -1271 -9023 9131
15437I131p059N265J6734m447j1953k2769j3504j6145N074n14J483L233L3974
$$ 9131 2072 7337 24071 19624 7671 -15098 -28602 -44747 -39673 -40187 -38704 -35471 -1497
15424a497Q008m1610j4937J9574K5505K560j2265J7260M082j343j4886n806K2647
$$ -1497 6511 -35099 -50036 -30462 -4957 -2397 -14662 2598 6680 5337 -9549 -15355 7292
15411G292J2995K0381n037J310o996k6372j0918m809j7922L9414M0437J5370k9827
$$ 7292 20287 40668 35631 36941 29945 3573 -7345 -12154 -30076 9338 49775 65145 35318
15398C5318k5948L150k1758p921L1256P986N971k5929j6125k5248r56K013Q078
$$ 35318 9370 12520 -9238 -17159 14097 22083 28054 2125 -14000 -39248 -40204 -38191 -30113
15385c0113k321J818O151R882K76K820K096P817L4828j3091j5526j183J0453Q82
$$ -30113 -32434 -30616 -24465 -14583 -14307 -11487 -9391 -1574 33254 20163 4637 3454 13907 14789
15371A4789N523k3770j7596j943K316m078j514n902J7341K9631l1756j1190J1060
$$ 14789 20312 -3458 -21054 -22997 -20681 -24759 -26273 -32175 -14834 14797 -16959 -28149 -17089
15358a7089Q877K4712R154k1618j8526P615l920j592K426M416j0129j2081J0116
$$ -17089 -8212 16500 25654 4036 -14490 -6875 -10795 -12387 -9961 -5545 -15674 -27755 -17639
15345a7639R818k968l650q732j977j0951L4153K7576J9586k9187j2089p751O691
$$ -17639 -7821 -10789 -14439 -23171 -25148 -36099 -1946 25630 45216 16029 3940 -3811 2880
15332B880k925j1145m585p104J7067k4340q688J3616P399r23K153K4417J1049
$$ 2880 -45 -11190 -15775 -22879 -5812 -30152 -38840 -25224 -17825 -18748 -16595 7822 18871
15319A8871J4949j2460N076m668k826J9841j5350L207J667L638j5511l7716j1484
$$ 18871 33820 21360 26436 21768 18942 38783 23433 26640 28307 31945 16434 -21282 -32766
15306c2766J8007K2763k463k9370J5456Q568Q325K7743J2898k2712l3601J6771
$$ -32766 -14759 8004 5541 -23829 -8373 195 8520 36263 49161 26449 -7152 9619
15294I619O43j7855M753R062k7285P094K5422j859R876K7443K036q610k1690l5380
$$ 9619 10262 -7593 -2840 6222 -21063 -13969 11453 9594 19470 46913 48949 40339 18649 -16731
15280a6731J3407J7309O625o336k7244M638K9435j7263L0589j0998k1906n128
$$ -16731 -3324 13985 20610 14274 -12970 -8332 21103 3840 34429 23431 1525 -3603
15268c603P827M391q19k8661J8372LO670J7323n808l6136j3927J407l0495j7135
$$ -3603 4224 8615 7796 -20865 -2493 -2490 4180 21503 15695 -20441 -34368 -32961 -63456 -80591
15254h0591K6624L6191N322k7290j8569J8520k717K1771L2704P049L31J9774J1436
$$ -80591 -53967 -17776 -12454 -39744 -58313 -39793 -42510 -20739 11965 19014 19345 39119 50555
15241E0555m0427l2916k0421J6241M4222j0524J8933J3613K5927J3236l1416k2850
$$ 50555 10128 -22788 -43209 -26968 17254 6730 25663 39276 65203 78439 47023 24173
15229B4173k576p717l959j7625p943J263J3306j2190j6024K404J6933J4299J8337
$$ 24173 21597 13880 9921 -7704 -15647 -14384 -1078 -13268 -29292 -26888 -9955 4344 22681
15216B2681L462n239j6853q636m1618j810K3842O137m676M842J7073m2359j4364
$$ 22681 26143 20904 4051 -4585 -46203 -48013 -24171 -18034 -22710 -17868 -795 -43154 -57518
15203e7518J692J46L1671K8737m787l3733l4006k7855K1028M3712J7310K5585
$$ -57518 -55826 -55680 -24009 4728 -59 -33792 -67798 -95653 -74625 -30913 -13603 11982
15191A1982j0698j4410k0280J1928J4948Q046j1452J414M241p624K247J5741L3266
$$ 11982 1284 -13126 -33406 -21478 -6530 1516 -9936 -8522 -4281 -11905 -9658 6083 39349
15178C9349j2690k7861q47n063l990l233l440k3713O918J0501R75J6061k1968
$$ 39349 26659 -1202 -2049 -7112 -11102 -14335 -17775 -41488 -34570 -24069 -23094 -7033 -29001
15165b9001k1357j7581Q469K0024J1723o180k3362J525Q991L9176k8511M802J7045
$$ -29001 -50358 -67939 -59470 -39446 -27723 -33903 -57265 -55740 -46749 -7573 -36084 -31282 -14237
15152a4237j759L2129J9693L522n439J4781j314k9031k6107m0629J8695J580j4698
$$ -14237 -15996 16133 35826 39348 33909 48690 47376 18345 -7762 -48391 -29696 -28116 -42814
15139d2814Q32K9503Q838Q879L2914J2438j1903p854q115l5898k9403J3569J0848
$$ -42814 -41982 -12479 -3641 5238 38152 50590 38687 30833 22718 -13180 -42583 -29014 -18166
15126a8166K065R1K3084j893P543l3235Q44L2223M151k2377N476J8166k7361l9320
$$ -18166 -16101 -16010 7074 5181 12724 -20511 -19667 12556 16707 -5670 -194 17972 -9389 -48709
15112d8709K7249L5026L1895R204k9203k8938j3929Q713K0832J912K034k7250
$$ -48709 -21460 13566 45461 54665 25462 -3476 -17405 -8692 12140 14052 16086 -11164
15100a1164J1527K4643k967j1751q587j0991L3138J6559j9987k8600M39J7792
$$ -11164 363 25006 22039 10288 1701 -9290 23848 40407 20420 -8180 -7741 10051
15088A0051J5055R98j2936j3793k144r001j4951k652J3358P4174J8060k5526m4982
$$ 10051 25106 26104 13168 -625 -2769 -11770 -26721 -29373 -16015 58159 76219 50693 5711
15075E711m4318j7355N472M036K1493K4945L5465N862J1244j9970l0994n230n440
$$ 5711 -38607 -55962 -50490 -46454 -24961 -16 35449 41311 52555 32585 1591 -3639 -9079
15062i079Q941K0272J0023j3917N347k3879j104j7258k4640k2100J9108J9281
$$ -9079 -138 20134 30157 16240 21587 -2292 -3396 -20654 -45294 -67394 -48286 -29005
15050b9005O419O952p228q587K66k7398M276M3994J1037L144Q819J7836k302j1088
$$ -29005 -22586 -15634 -22862 -31449 -31183 -58581 -54305 -10311 726 3870 12689 30525 28223 17135
15036A7135j1431m5m0748j5068l208o137J6358M456P00K8437k5932K2762L513
$$ 17135 5704 5659 -35089 -50157 -53365 -59502 -43144 -38688 -37988 -9551 -35483 -12721 -9208
15023i208k0211l4026R617L4295L6609P320m259J4506k3074m0513k7602p49J25
$$ -9208 -29419 -63445 -53828 -19533 17076 24396 20137 34643 11569 -28944 -56546 -57295 -57170
15010e7170K0803R415R219J5996K6860J8963P320J3487N667k2938J428R232j8044
$$ -57170 -36367 -26952 -17733 -1737 25123 44086 51406 64893 70560 47622 49050 58282 40238
14997D0238j157j4560j7121k9315m5262l25K2718K8528k18K5402o495k4952o130
$$ 40238 39081 24521 7400 -21915 -67177 -67502 -44784 -16256 -16474 8928 2433 -22519 -28649
14984b8649O086M768K4254j3989j7841L8689K1484l3390j1637L974J4880r657
$$ -28649 -22563 -17795 6459 -7530 -25371 13318 34802 1412 -10225 -6251 8629 -1028
14972a028k7645K0959N4885m6063k7174j7063J4521O662J332l1273l039K662J6174
$$ -1028 -28673 -7714 47171 1108 -26066 -43129 -28608 -21946 -20614 -51887 -54926 -52264 -36090
14959c6090P662p15J4116n117J7333K4968L5404r506k6567J3146J607k2110l1153
$$ -36090 -28428 -29143 -15027 -20144 -2811 22157 57561 48055 21488 34634 36241 14131 -17022
14946a7022R095k0010K126J5255m132J622N453J1977l968k3875m565j5916l005
$$ -17022 -7927 -27937 -25811 -10556 -14688 -13066 -7613 4364 396 -23479 -28044 -43960 -46965
14933d6965l399L061r231O236P255J8378k2865j2081J306L5087K3766P740O869
$$ -46965 -50364 -47303 -56534 -50298 -43043 -24665 -47530 -59611 -58305 -23218 548 8288 15157
14920A5157O218j0801l7124j9909K0018k145o173M863J2049k383j5133L302K8623
$$ 15157 21375 10574 -26550 -46459 -26441 -28586 -34759 -29896 -17847 -20230 -35363 -32061 -3438
14907c438k474j2714l2891K322O5829m285m7696o694L1295L3058m8198l1912Q818
$$ -3438 -5912 -18626 -51517 -49195 16634 12349 -35347 -42041 -10746 22312 -25886 -57798 -48980
14894d8980K2588J4040n842P874k534O517N936O152k818p618o275l6792q713p40
$$ -48980 -26392 -12352 -18194 -10320 -12854 -6337 -401 5751 2933 -4685 -10960 -47752 -56465 -57205
14880e7205J2011K966J8170L5076J5033j5642l803j2416j4879P291J6565J870
$$ -57205 -45194 -42228 -24058 11018 26051 10409 6606 -5810 -20689 -13398 3167 5037
14868E037K39J8378J6934K1783k5767m2836k5782N397K0248J0839l106K1848r952
$$ 5037 5276 23654 40588 62371 36604 -6232 -32014 -26617 -6369 4470 1364 23212 13260
14855A3260l6059J6870r621l3775j193L326K8353J3246J7133J058k9723Q597k1361
$$ 13260 -22799 -5929 -15550 -49325 -50518 -47192 -18839 -5593 11540 12598 -17125 -8528 -29889
14842b9889M439K2196r51j3819K6413j9975j9934K9355J5608j7268j0631J0815
$$ -29889 -25450 -3254 -4205 -18024 8389 -11586 -31520 -2165 13443 -3825 -14456 -3641
14830c641K6240j3488j2182K5832q159j6967q862K7222J0921n466L1512J6052
$$ -3641 22599 9111 -3071 22761 14602 -2365 -11227 15995 26916 21450 52962 69014
14818F9014l422k0938m0806j0795J48M652O302K3579J0214k0774l1130k258j183
$$ 69014 65592 44654 3848 -6947 -6799 -2147 4155 27734 37948 17174 -13956 -16214 -17397
14805a7397J4784L807j2205N163R604R072j4093l0122O946J1348K1847L163m640
$$ -17397 -2613 1194 -11011 -5848 3756 12828 -1265 -31387 -24441 -13093 8754 11917 7277
14792G277k2599k9695M129K0602K4168L6935j8181j8502j2236P559K7284J4205
$$ 7277 -15322 -45017 -40888 -20286 3882 40817 22636 4134 -8102 -543 26741 40946
14780D0946K148R748n755k9081j2256J0404L263r731J328J5898k1393o896k2364
$$ 40946 43094 52842 47087 18006 5750 16154 19417 9686 11014 26912 5519 -1377 -23741
14767b3741l879R555J3293m580L4635l0141m9813q786J7898J4039j8341j4733
$$ -23741 -27620 -18065 -4772 -9352 25283 -4858 -54671 -63457 -45559 -31520 -49861 -64594
14755f4594R667K403K1318J5625l640j3480q076M9871Q944k8618l2472k013J8703
$$ -64594 -54927 -52524 -31206 -15581 -19221 -32701 -40777 9094 18038 -10580 -43052 -45065 -26362
14742b6362K0472J5057k0530j9273j0059L1146J3538n491o599m477L1617m398
$$ -26362 -5890 9167 -11363 -30636 -40695 -9549 3989 -1502 -8101 -12578 19039 14641
14730A4641j5263o054Q559J5961J5653o588j8407l663J3233J2369M764O891r899
$$ 14641 -622 -6676 1883 17844 33497 26909 8502 4839 18072 30441 35205 42096 32197
14717C2197j2816p535K2678q588r709j7873j0285j9366J2646M697o453n986l12
$$ 32197 19381 11846 34524 25936 16227 -1646 -11931 -31297 -18651 -13954 -20407 -26393 -26705
14704b6705M30J9104m472j1590m095q064J9794K7962r394j1147L3962n530k1609
$$ -26705 -26275 -7171 -11643 -23233 -27328 -35392 -15598 12364 2970 -8177 25785 20255 -1354
14691a354k1262k0480o064L3207J3309j3315j0838j9096L136j162L70j1663K0249
$$ -1354 -22616 -43096 -49160 -15953 -2644 -15959 -26797 -45893 -42757 -43919 -43549 -55212 -34963
14678c4963J7287N712M479k2870J2168M0201L6349k3501k9032j5722K402J0378
$$ -34963 -17676 -11964 -7485 -30355 -18187 22014 58363 34862 5830 -9892 -7490 2888
14666B888l1528R693K4757k2933m274k532j5357Q503J5988J5574J9861o970J7491
$$ 2888 -28640 -18947 5810 -17123 -21397 -23929 -39286 -30783 -14795 779 20640 13670 31161
14653C1161Q786l7452J099j4935M829n57K992J5589l368N601k383k46J4536J2644
$$ 31161 39947 2495 3594 -11341 -6512 -7069 -4077 11512 8144 13745 11362 11116 25652 38296
14639C8296J0452o019k8877j5804j3306Q734J2803j7026p479J5390K2375m362
$$ 38296 48748 42729 13852 -1952 -15258 -6524 6279 -10747 -18226 -2836 19539 15177
14627A5177J9421k0719k0788J5554l0524N504K2464j1897J0293J740j3621O907
$$ 15177 34598 13879 -6909 8645 -21879 -16375 6089 -5808 4485 6225 -7396 -489
14615d89j8866O271p98r995r864J6204J6364M460l96n021R555k228K613J509k260
$$ -489 -19355 -13084 -13882 -23877 -33741 -17537 -1173 3287 2891 -2130 7425 5197 7810 9319 7059
14600G059L5685j4403J1264q327m0833n841J3226m093l5498j9363K8790Q483l3977
$$ 7059 42744 28341 39605 31278 -9555 -15396 -2170 -6263 -41761 -61124 -32334 -23851 -57828
14587e7828M239K6615L000K564k451r245J7672K7566o973l16K3902j5250k8112
$$ -57828 -53589 -26974 -23974 -21410 -23861 -33106 -15434 12132 5159 4843 28745 13495 -14617
14574a4617J2697j5315J3040N960l397M002N812J1312J045L198O256j1621O49
$$ -14617 -1920 -17235 -4195 1765 -1632 2370 8182 19494 20539 23737 29993 18372 19021
14561A9021o888k1746l6946J2101J5377m085L361J997P457p523o558j8575K4341
$$ 19021 12133 -9613 -46559 -34458 -19081 -23166 -19805 -17808 -10351 -17874 -24432 -43007 -18666
14548a8666L0340k3684l622Q764j9059J098J920J7233J8583j9631m9027j6227
$$ -18666 11674 -12010 -15632 -6868 -25927 -24829 -22909 -5676 12907 -6724 -55751 -71978
14536g1978R917J0044L8063L3317j464J5219j0780j0291j352q866J4290P790m2604
$$ -71978 -62061 -52017 -13954 19363 17899 33118 22338 12047 10695 1829 16119 23909 -18695
14523a8695k6394L162K942J5480J1181J3782m5071k5771O659K2204L0460N306
$$ -18695 -45089 -41927 -38985 -23505 -12324 1458 -43613 -69384 -62725 -40521 -10061 -4755
14511d755k032L187k0966P782K4092n486R496J5978R520j4191m5107p96K0081
$$ -4755 -6787 -3600 -24566 -16784 7308 1822 11318 27296 36816 22625 -22482 -23278 -3197
14498c197r582j2213N998L066k234K5844M667j1482j6175P246q294l619J6543
$$ -3197 -12779 -24992 -18994 -15928 -18162 7682 12349 867 -15308 -8062 -16356 -19975 -3432
14485c432O350J9459M402Q588l824j5382k7876j1344J763m126K2024J0726j2101
$$ -3432 2918 22377 26779 35367 31543 16161 -11715 -23059 -21296 -25422 -3398 7328 -4773
14472d773r313L4595J9740k1390l1397k394m359k1901M40L4112L209k6J7137l163
$$ -4773 -14086 20509 40249 18859 -12538 -14932 -19291 -41192 -40752 -6640 -3431 -3457 13680 10517
14458A0517q560j1411j638N362k4791k5844K3314J1598j3606J4558J5246K8493
$$ 10517 1957 -9454 -11092 -5730 -30521 -56365 -33051 -21453 -35059 -20501 -5255 23238
14446B3238M221k4576j8117P187k72O716N648k3416J6959j8430l2561q764J3799
$$ 23238 27459 2883 -15234 -8047 -8319 -1603 4045 -19371 -2412 -20842 -53403 -62167 -48368
14433d8368K0818j980M094K505J1794L7173J3197j8052k646J9634o224q077k0421
$$ -48368 -27550 -29530 -25436 -22931 -11137 26036 39233 21181 18535 38169 31945 23868 3447
14420C447j8190R735J7511Q796j1203j1640Q27O303l968R078n315l4780j9886
$$ 3447 -14743 -5008 12503 21299 10096 -1544 -717 5586 1618 10696 5381 -29399 -49285
14407d9285k4358J0040M0100M0607P283j4093K547k5535j9955J5502J2112K8487
$$ -49285 -73643 -63603 -23503 17104 24387 10294 12841 -12694 -32649 -17147 -5035 23452
14395B3452p80n114p226L280J2k9508j0082M969O698j6277o224K1208J3713j19
$$ 23452 22672 17558 10332 13612 13624 -15884 -25966 -20997 -14299 -30576 -36800 -15592 -1879 -1998
14381a998j6319j2773k0506L6928J1043K5153L0755K455k7443j259k550j1959
$$ -1998 -18317 -31090 -51596 -14668 -3625 21528 52283 54738 27295 26036 23486 11527
14369A1527J832r451k3945Q596K0263L352K031n039n76o778J0325K0374L4552
$$ 11527 13359 3908 -20037 -11441 8822 12174 14205 9166 8590 1812 12137 32511 67063
14356F7063J1129j3214r281M500J805k0230l1506j9517J8332l531j6897q103l0853
$$ 67063 78192 64978 55697 60197 62002 41772 10266 -9251 9081 5550 -11347 -19450 -50303
14343e0303l2864K0339K2716J0290J4099J4349M766L222J584j5214n357O793q154
$$ -50303 -83167 -62828 -40112 -29822 -15723 -1374 3392 6614 8198 -7016 -12373 -5580 -13734
14330a3734L953L303l695J2090J5182n81N688k211L713k1891q1j0439J853J7586
$$ -13734 -9781 -6478 -10173 1917 17099 16518 22206 19995 23708 1817 1736 -8703 -6850 10736
14316A0736K1522j8766k8443o243J6604J2705j2532k2199p995p383j7927l4053
$$ 10736 32258 13492 -14951 -21194 -4590 8115 -4417 -26616 -34611 -41994 -59921 -93974
14304i3974K9999N2715j2106K463L7801L2146k4730n014j218J5323J262j8259
$$ -93974 -63975 -11260 -23366 -20903 16898 49044 24314 19300 18082 33405 34667 16408
14292A6408J5128M345k5014J903l256L950L9174j5152j5178q356o132M51O632
$$ 16408 31536 35881 10867 12770 9514 13464 52638 37486 22308 13952 7820 8271 14903
14279A4903j1803J7787k1687l3138j0548M79L0742J8615J4792j7172m7549j397
$$ 14903 3100 20887 -800 -33938 -44486 -44007 -13265 5350 20142 2970 -44579 -45976
14267d5976m502J8986L3879J5203k7392l5781K2722j6725p717L1787J1373N7375
$$ -45976 -50478 -31492 2387 17590 -9802 -45583 -22861 -39586 -47303 -15516 -4143 53232
14255E3232J1705l9024j2837l4554k155R658K1656J7658k2687J756J0483k0540
$$ 53232 64937 25913 13076 -21478 -23633 -13975 7681 25339 2652 4408 14891 -5649
14243e649k0910m32M375L457j1531j2182M900R402J0800J1586k9621P968M025
$$ -5649 -26559 -26991 -22616 -19159 -30690 -42872 -37972 -28570 -17770 -6184 -35805 -27837 -23812
14230b3812J2604J9852J0842J7178k7819p250o139J4301J0090j8179N912k5736
$$ -23812 -11208 8644 19486 36664 8845 1595 -4544 9757 19847 1668 7580 -18156
14218a8156j7002j1432K8364J5595j6616k2624j66l429k461M6588J4643j6811
$$ -18156 -35158 -46590 -18226 -2631 -19247 -41871 -42037 -45466 -47927 -1339 13304 -3507
14206c507j7576j0528M3831R592l5749k3461L4608K167j6737Q580P024k2188O673
$$ -3507 -21083 -31611 12220 21812 -13937 -37398 -2790 -623 -17360 -8780 -1756 -23944 -17271
14193a7271K3447J1531N81L089K501j4411N241M401Q117j2780j1571O635J436
$$ -17271 6176 17707 18288 21377 23878 9467 14708 19109 27226 14446 2875 9510 10946
14180A0946n595j2205M046K4668m630J7414m2615j6005o2k0434K1714L6090m528
$$ 10946 5351 -6854 -2808 21860 17230 34644 -7971 -23976 -24038 -44472 -22758 13332 8804
14167H804j527K367P652j2051l33K102J521j6468K42m585J775p647J1006j7088
$$ 8804 7277 9644 17296 5245 4912 7014 8535 -7933 -7691 -12276 -10501 -18148 -7142 -24230
14153b4230j8691K715K2341n028j6726J5619j1708n732K9118J2588K1756P198
$$ -24230 -42921 -40206 -17865 -22893 -39619 -24000 -35708 -41440 -12322 266 22022 29220
14141B9220k3099J3735J6947j6226m5895j0979K1090K3386j92k3772l9121J4745
$$ 29220 6121 19856 36803 20577 -25318 -36297 -15207 8179 7987 -15785 -54906 -40161
14129d0161L8474K2914P300J6154l3800l1793K408K3320K6830R582j9603O6p790
$$ -40161 -1687 21227 28527 44681 10881 -20912 -18504 4816 31646 41228 21625 21691 13901
14116A3901M318j9343j8752l4261L528K8593L0823J9696j4566K1040k2541q554
$$ 13901 18219 -1124 -19876 -54137 -50609 -22016 8807 28503 13937 34977 12436 3882
14104C882k432J5025K8192p699j7673K0416l2608j5660J5220L6550J2163q534
$$ 3882 1450 16475 44667 36968 19295 39711 7103 -8557 6663 43213 55376 46842
14092D6842j0951O873J442k2799m6474K1387J0710r896N530J7050j5368k4056
$$ 46842 35891 42764 44206 21407 -25067 -3680 7030 -2866 2664 19714 4346 -19710
14080a9710J3638P901Q734M159J9967k9900j5987K0304k727m24j0448O701K7456
$$ -19710 -6072 1829 10563 14722 34689 4789 -11198 9106 6379 5955 -4493 2208 29664
14067B9664J1139n020k3240j2849n006k8560j1655J9526L0509j3941j2023J5846
$$ 29664 40803 35783 12543 -306 -5312 -33872 -45527 -26001 4508 -9433 -21456 -5610
14055e610K1144j5199N173o880k9722j9218J4028J0185L0592N001r381J0958R629
$$ -5610 15534 335 5508 -1372 -31094 -50312 -36284 -26099 4493 9494 113 11071 20700
14042B0700k1502j5604K4065o933l900J7294k4345j5744P433J1730R052j3152
$$ 20700 -802 -16406 7659 726 -3174 14120 -10225 -25969 -18536 -6806 2246 -10906
14030a0906l6582O391M5081r272m287K4697P633k0203j0468J9483K7168r491k2145
$$ -10906 -47488 -41097 3984 -5288 -9575 15122 22755 2552 -7916 11567 38735 29244 7099
14017G099n996r768j4920K4603K4333K6955j055o141L787k9550j2147J0616J834
$$ 7099 1103 -8665 -23585 1018 25351 52306 51251 45110 48897 19347 7200 17816 19650
14004A9650K1945o792k6927l9125j7962K6427O203K4486J7067j9529l4065k747
$$ 19650 41595 34803 7876 -31249 -49211 -22784 -16581 7905 24972 5443 -28622 -31369
13992c1369k2945j0478o439K0763L2168j2175m778J0209J8789j4690M607J8275
$$ -31369 -54314 -64792 -71231 -50468 -18300 -30475 -35253 -25044 -6255 -20945 -16338 1937
13980A937N821M112J9029n385j9439K245m369P441j4438n984M107k1249J7266
$$ 1937 7758 11870 30899 25514 6075 8320 3951 11392 -3046 -9030 -4923 -26172 -8906
13967h906M9320J1538N341k931j5413j5570K3833K5737k5211k4788l6854j6970
$$ -8906 40414 51952 57293 54362 38949 23379 47212 72949 47738 22950 -13904 -30874
13955c0874L5807J7467L405L5791P652l9657l0226K1329o356l1865J3939M957
$$ -30874 4933 22400 25805 61596 69248 29591 -635 20694 14338 -17527 -3588 1369
13943A369j4292r73r389m966J5487K0698n033k9690J9380J0654R83J412q432m8250
$$ 1369 -12923 -13896 -23285 -28251 -12764 7934 2901 -26789 -7409 3245 4228 5640 -2792 -51042
13929e1042j7486L1504K512L174K4438q189q787Q20J017J2253J326L7566k1393
$$ -51042 -68528 -37024 -34512 -31338 -6900 -15089 -23876 -23056 -22039 -9786 -8460 29106 7713
13916G713l5010J025L868n43K271K505L567J3128o451j3664M476P665P088k3172
$$ 7713 -27297 -26272 -22404 -22947 -20676 -18171 -14604 -1476 -7927 -21591 -17115 -9450 -2362 -25534
13902b5534K547L0230J0159j2469k195k5467k4301L0755L7173k4153K010r670
$$ -25534 -22987 7243 17402 4933 2738 -22729 -47030 -16275 20898 -3255 -1245 -10915
13890a0915l0707K5095L5847J4536r4K289k2875L859J9257j6131m062J1583L828
$$ -10915 -41622 -16527 19320 33856 33762 36051 13176 17035 36292 20161 16099 27682 31510
13877C1510j1490j0781K101J124K81p020j2120K229j0821m471O462J093J7371
$$ 31510 20020 9239 11340 12464 12745 5725 -6395 -4166 -14987 -19458 -12996 -11903 5468
13864E468J3997j1629N429r962j1886j0916K2504O189J6507L5635p358k1747J0129
$$ 5468 19465 7836 13265 3303 -8583 -19499 3005 9194 25701 61336 53978 32231 42360
13851D2360m1912o817K5153O89k7575j5907J0552o173j3277J7662O020K7462j9822
$$ 42360 448 -6369 18784 19473 -8102 -24009 -13457 -19630 -32907 -15245 -9225 18237 -1585
13838a585o895J5896J310K5993l864m0316n57j2586k5073K2060m080r676L76K2354
$$ -1585 -8480 7416 8726 34719 30855 -9461 -10018 -22604 -47677 -25617 -29697 -39373 -38997 -16643
13824a6643r891l154J48M519J9778K6824m2328l8691L020L4328J08p686M095P997
$$ -16643 -26534 -29688 -29540 -25021 -5243 21581 -20747 -59438 -56418 -22090 -21982 -29668 -25573 -17576
13810a7576L627q751j6127m605j609N548J9586l419J8085o22j9547K5580J767
$$ -17576 -13949 -22700 -38827 -43432 -45041 -39493 -19907 -23326 -5241 -5863 -25410 170 1937
13797A937j7580j967M4420j6081m1824n859L923K790r52R994J8836J0795K3361
$$ 1937 -15643 -17610 26810 10729 -31095 -36954 -33031 -30241 -31193 -21199 -2363 8432 31793
13784C1793J4626k4043j6156p869o770O297K0627J4635o273J0236m62j0869J5941
$$ 31793 46419 22376 6220 -1649 -8419 -2122 18505 33140 26867 37103 36641 25772 41713
13771D1713j3802p601O79Q886K652k5963j6840J94R839j060m974M871l501j3142
$$ 41713 27911 20310 20989 29875 32527 6564 -10276 -10082 -243 -1303 -6277 -1406 -4907 -18049
13757a8049J3577J2169M114k4141K0481K5401j0790K6762p441k9475k8996n15
$$ -18049 -4472 7697 11811 -12330 8151 33552 22762 49524 42083 12608 -16388 -16903
13745a6903J980O548l2918j3750k0867K2417M3873r308q477J0645J6888M356J4604
$$ -16903 -14923 -8375 -41293 -55043 -75910 -53493 -9620 -18928 -27405 -16760 128 4484 19088
13732A9088j444l8065k8497K714J3463L478P194J7948Q801r719K0638K7332m0595
$$ 19088 17644 -20421 -48918 -46204 -32741 -29263 -22069 -4121 4680 -5039 15599 42931 2336
13719B336o38K8869J5475K5177N791k8794p827k1536j4521j1644j6521R797k4122
$$ 2336 1698 30567 46042 71219 77010 48216 40389 18853 4332 -7312 -23833 -14036 -38158
13706c8158K722L344M897K2278J3386j8885l374R739k0789j3717L2246N3595J1736
$$ -38158 -35436 -32092 -27195 -4917 8469 -10416 -13790 -4051 -24840 -38557 -6311 47284 59020
13693E9020m431k1839l0947m0514m155K4094o420M3856O117l9083J6355J569Q090
$$ 59020 54589 32750 1803 -38711 -42866 -18772 -25192 18664 24781 -14302 2053 3622 11712
13680A1712K1854J01k824j4237l777n994K176m0688l3610K6190L6023N3069l998
$$ 11712 33566 33667 30843 16606 12829 6835 9011 -31677 -65287 -39097 -3074 49995 45997
13667D5997p4684j8486L8947q104J5139O578K9802K0990k2441j7592L287L988
$$ 45997 -28687 -47173 -8226 -16330 -1191 5387 35189 56179 33738 16146 19433 23421
13655B3421j9841n92m249Q152M694j276k1648k9213J0498J9872l892L022N894
$$ 23421 3580 2988 -1261 6891 11585 10309 -11339 -40552 -30054 -10182 -14074 -11052 -5158
13642e158J6015J6342J8778O026j3253J0160J922j7768r205J1240O082J0188k4171
$$ -5158 10857 27199 45977 52003 38750 48910 50832 33064 23859 35099 41181 51369 27198
13629B7198j0977q812L224P064M5q984K0339k5851k7092J08K2975m513J025R091
$$ 27198 16221 7409 10633 17697 17742 8758 29097 3246 -23846 -23738 -763 -5276 -4251 4840
13615D840m17k3359P983J2220M573K893M063j7409k8647n831K3042L8179M641
$$ 4840 4423 -18936 -10953 1267 5840 8733 12796 -4613 -33260 -39091 -16049 22130 26771
13602B6771M824j0148N44K116l2403j3608J7533L870K4395l35l698j619J8152
$$ 26771 31595 21447 21991 24107 -8296 -21904 -4371 -501 23894 23559 19861 18242 36394
13589C6394n301j2447M967K0921m391k005K6961L2741k0835m6107k4062j0081
$$ 36394 31093 18646 23613 44534 40143 38138 65099 97840 77005 30898 6836 -3245
13577c245k5567J3039J6932J3049K0158j3067O171j7489P519m273j8218Q512J0855
$$ -3245 -28812 -15773 1159 14208 34366 21299 27470 9981 17500 13227 -4991 3521 14376
13564A4376k4719m538l0369k290J2040J4360K1028Q309J8072O129m035K285l8329
$$ 14376 -10343 -14881 -45250 -47540 -35500 -21140 -112 8197 26269 32398 28363 30648 -7681
13551g681r720P560j1116M1618J0575o384P045p541j7487N122k0246k4617J7096
$$ -7681 -17401 -9841 -20957 20661 31236 24852 31897 24356 6869 11991 -8255 -32872 -15776
13538a5776J0408J010k372J87l0585l787j3252O248K3605Q548J350M539K3257
$$ -15776 -5368 -4358 -6730 -6543 -37128 -40915 -54167 -47919 -24314 -15766 -14416 -9877 13380
13525A3380O045J1871k0545k4241J6116K1267j84n336K2596J7138l7750j9467
$$ 13380 19425 31296 10751 -13490 2626 23893 23709 18373 40969 58107 20357 890
13513H90K1304j8385j1830q814m865O379j8229j6315j9519O159L6098J1592k6307
$$ 890 22194 3809 -8021 -16835 -21700 -15321 -33550 -49865 -69384 -63225 -27127 -15535 -41842
13500d1842m076K1690N620k795K3987k2822j5267j7558p879K6849K0127J8991
$$ -41842 -45918 -24228 -18608 -21403 2584 -20238 -35505 -53063 -60942 -34093 -13966 5025
13488E025p367k0796N961J1208J1556l3963q376j262J9454L8040J7340m2399k547
$$ 5025 -2342 -23138 -17177 -5969 5587 -28376 -36752 -38014 -18560 19480 36820 -5579 -8126
13475h126J2363j4782k8488k9752J6525O3350K5721j2764k225N145j6770l61O504
$$ -8126 4237 -10545 -39033 -68785 -52260 11090 36811 24047 21822 26967 10197 9836 16340
13462A6340o174J1492l823k504j1479J2891J2868j0500p025M380K6952q618j1487
$$ 16340 10166 21658 17835 15331 3852 16743 29611 19111 12086 16466 43418 34800 23313
13449B3313j7687l0116l7169j224L9586O529K531K0911J501K5538l2066r625J1199
$$ 23313 5626 -24490 -61659 -62883 -23297 -16768 -14237 6674 8175 33713 1647 -7978 3221
13436C221l368N01j150Q07J8337P242l3020Q725r084m2381k2166j9140M5595J7531
$$ 3221 -147 354 -796 11 18348 25590 -7430 1295 -7789 -50170 -72336 -91476 -45881 -28350
13422b8350M097o105j4051r6O0871Q57j6597j1078L893o16J1124l847k1364J5488
$$ -28350 -24253 -30358 -44409 -44505 16366 17223 626 -10452 -6559 -7175 3949 102 -21262 -5774
13408e774M3986K3229k9844j8016p524k1967m8248k4293n613K3933L9426K504
$$ -5774 38212 61441 31597 13581 6057 -15910 -64158 -88451 -94064 -70131 -30705 -28201
13396b8201q370N775J6474J1142j2384M700J9822K6551J169k1886j9612K5515
$$ -28201 -36571 -30796 -14322 -3180 -15564 -10864 8958 35509 36678 14792 -4820 20695
13384B0695J4094K125j6681J073J8299k850l7394j7775j1521L0930n042p303L0400
$$ 20695 34789 36914 20233 21306 39605 36755 -639 -18414 -29935 995 -4047 -11350 19050
13371A9050M694j7751J9855M5237L3907l0050j7330l5427m3193q871K1689J3535
$$ 19050 23744 5993 25848 71085 104992 74942 57612 22185 -21008 -29879 -8190 5345
13359E345j9883M89J6717j3610J6749K0862N381P323j7389k6858k7253Q012j5250
$$ 5345 -14538 -14049 2668 -10942 5807 26669 32050 39373 21984 -4874 -32127 -24115 -39365
13346c9365j4418M6837J0673l1227j2088K202J3429J7607J5153J1005L5769k4502
$$ -39365 -53783 -6946 3727 -27500 -39588 -37386 -23957 -6350 8803 19808 55577 31075
13334C1075l2072P703K473J9606J2603q904R240K0724j0404l8959k2066J9214
$$ 31075 -997 6706 9179 28785 41388 32484 41724 62448 52044 13085 -8981 10233
13322A0233m764k6273l3323Q804K9606K0050N153j7119r949J8497N05L2375K1181
$$ 10233 5469 -20804 -54127 -45323 -15717 4333 9486 -7633 -17582 915 1420 33795 54976
13309E4976j6684j0639j9433k497K1681j1544j0832o220P291P125O619K294j1649
$$ 54976 38292 27653 8220 5723 27404 15860 5028 -1192 6099 13224 19843 22137 10488
13296A0488M264J382m523L242K1764j3736j9504L24K1011Q056J8745j2842m1503
$$ 10488 14752 16134 11611 14853 36617 22881 3377 3701 24712 32768 51513 38671 -2832
13283b832l0029K6108O727n15l311j8301L281m633N69K1135K5005J198m5786Q144
$$ -2832 -32861 -6753 -26 -541 -3852 -22153 -18872 -23505 -22936 -1801 23204 24402 -21384 -13240
13269a3240j820J4741L2134L1787M6893J692n7032j5757j4161l4343n047K2946
$$ -13240 -15060 -319 31815 63602 110495 112187 55155 39398 25237 -9106 -14153 8793
13257H793L1260n887o872j0816K4173j6239l6342K053L578J4114K6435l072K128
$$ 8793 40053 34166 27294 16478 40651 24412 -11930 -9877 -6299 7815 34250 31178 33306
13244C3306j7426j3580K1158j5859k7658L9686L2025Q115k0603l7752N153p315
$$ 33306 15880 2300 23458 7599 -20059 19627 51652 59767 39164 1412 6565 -750
13232g50j1959j6005K0159K7068J3625k791K936K2638j1233K571M5735j6241j4402
$$ -750 -12709 -28714 -8555 18513 32138 29347 32283 54921 43688 46259 91994 75753 61351
13219F1351l0057j4251j8377j6477K4442J6164l2491O992J5179k6124Q656J2961
$$ 61351 31294 17043 -1334 -17811 6631 22795 -9696 -2704 12475 -13649 -4993 7968
13207G968N899J0269k8869J4970K6235j676J195J447o971J5460J4675k2149k9907
$$ 7968 13867 24136 -4733 10237 36472 34796 35991 37438 30467 45927 60602 38453 8546
13194H546J4795k582k3220r729J8158J3849q386k007J5092K6194j7088j4075o163
$$ 8546 23341 20759 -2461 -12190 5968 19817 11431 9424 24516 50710 33622 19547 13384
13181A3384q21J1536n388L71k2272J7528O196m232J8658J4584l5399j4974j0362
$$ 13384 12563 24099 18711 19082 -3190 14338 20534 16302 34960 49544 14145 -829 -11191
13168a1191P761Q135j9489j5789J5812L1490O551J4880L0020N854L5954K4642
$$ -11191 -3430 4705 -14784 -30573 -14761 16729 23280 38160 68180 74034 109988 134630
13156A34630o178P977j9436l7672k3762J3366J1773Q099r060m62k5931j3372j1656
$$ 134630 128452 136429 116993 79321 55559 68925 80698 88797 79737 79275 53344 39972 28316
13143B8316k2316j4505Q429m123L8490K1469K629m758k613l0004j4340j3599Q865
$$ 28316 6000 -8505 -76 -4199 34291 55760 58389 53631 51018 21014 6674 -6925 1940
13130A940M026J9570L215k98r014M219P685K6529J4344J2016m7163n3311n521
$$ 1940 5966 25536 28751 28453 19439 23658 31343 57872 72216 84232 37069 -16242 -21763
13117b1763K6142J8890j9939M792J9330P6325L2581m967k1050l4142m5083j0347
$$ -21763 4379 23269 3330 8122 27452 103777 136358 131391 110341 76199 31116 20769
13105B0769N31j299j2744q138R385j098j0192l810J5944k585n234L4055k2080
$$ 20769 21300 20001 7257 -881 8504 7406 -2786 -6596 9348 6763 1529 35584 13504
13092A3504l044K4323k7221N542k6548r21O509j4296j5536m996J24J5526K3236
$$ 13504 10460 34783 7562 13104 -13444 -14365 -7856 -22152 -37688 -42684 -42560 -27034 -3798
13079c798J2310k5772K2829J0388R37R151j4j2781L0943l619j3582P211K9575
$$ -3798 8512 -17260 5569 15957 16894 26045 26031 13250 44193 40574 26992 34203 63778
13066F3778j3449m700j6827M160J0494o045q33j402j6168Q146j0879L433j6926
$$ 63778 50329 45629 28802 32962 43456 37411 36578 35176 19008 27154 16275 19708 2782
13053B782Q456J5966J4726j1768J6949K544j4270o040r675P052m99m125k1377
$$ 2782 11238 27204 41930 30162 47111 49655 35385 29345 19670 26722 26223 22098 721
13040G21j7066k4020R131J0651Q850L2033J8402m443l2066p02k898q283j610K2305
$$ 721 -16345 -40365 -31234 -20583 -11733 20300 38702 34259 2193 1491 -1407 -9690 -11300 11005
13026A1005q51J2759P002j9203p289K6516l39j9886j1003K1419m004p657j2023
$$ 11005 10154 22913 29915 10712 3423 29939 29600 9714 -1289 20130 16126 8469 -3554
13013c554m7677K458K9706j2309J4657K5482r69l264M381j4533j2332r272R504
$$ -3554 -51231 -48773 -19067 -31376 -16719 8763 7794 4530 8911 -5622 -17954 -27226 -17722
13000a7722K5962j43k8281m965J527M861K822m330j6730O643j434j4844k0716
$$ -17722 8240 8097 -20184 -25149 -23622 -18761 -15939 -20269 -36999 -30356 -31790 -46634 -67350
12987f7350K7901R581J7573K6172J4202k343r784J9481M964k0209l8109N896L2847
$$ -67350 -39449 -29868 -12295 13877 28079 25736 15952 35433 40397 20188 -17921 -12025 20822
12974B0822J1416j6850k8005l635L4777J8997K2587l2257l8545J3568L0927L79
$$ 20822 32238 15388 -12617 -16252 18525 37522 60109 27852 -10693 2875 33802 34181
12962C4181j3129J2955K8231J5857o736m0541m0431N726J4966j2453L936j2141
$$ 34181 21052 34007 62238 78095 71359 30818 -9613 -3887 11079 -1374 2562 -9579
12950i579k8704o259j7171P663L3442L933m9939k1003L4638N2573L1906m052j5409
$$ -9579 -38283 -44542 -61713 -54050 -20608 -16675 -66614 -87617 -52979 -406 31500 27448 12039
12937A2039j4803O631j2349l5067n84J5066J8290J9181j1536j3837n73J73K9974
$$ 12039 -2764 3867 -8482 -43549 -44133 -29067 -10777 8404 -3132 -16969 -17542 -17369 12605
12924A2605J1868k9686j5064J2512j3694r233K7734j1329k5972m888Q61N27M953
$$ 12605 24473 -5213 -20277 -7765 -21459 -30692 -2958 -14287 -40259 -45147 -44286 -43759 -38806
12911c8806J7825L383k2885J4312L6188K8698j9640l0854j3249n751q035J8156
$$ -38806 -20981 -17598 -40483 -26171 10017 38715 19075 -11779 -25028 -30779 -38814 -20658
12899b0658K8372n31J1072J0482R93p04J3653q400j9643J0017j7138j4261J1512
$$ -20658 7714 7183 18255 28737 29730 29026 42679 34279 14636 24653 7515 -6746 4766
12886D766L8656J4916l4223r145j6519p195k0633J7494J1269r116N907K1544l148
$$ 4766 43422 58338 24115 14970 -1549 -8744 -29377 -11883 -614 -9730 -3823 17721 14573
12873A4573k2382j1276O366O686M4816J5030m401q409r750K476k477k3550j2581
$$ 14573 -7809 -19085 -12719 -6033 38783 53813 49412 41003 31253 33729 31252 7702 -4879
12860d879R9K9931N2744k2044j1071J469j433Q671o281n943O71q067M602j0770
$$ -4879 -4780 25151 77895 55851 44780 46249 44816 53487 47206 41263 41934 33867 38469 27699
12846B7699k7625r243J0503J4403J4428l263K1870J8242j8002j4342j4973j3520
$$ 27699 74 -9169 1334 15737 30165 26902 48772 67014 49012 34670 19697 6177
12834F177J7374K8746k374r369K022j942j4226r578o3954j5448J4097K4922k747
$$ 6177 23551 52297 49923 40554 42576 40634 26408 16830 -47124 -62572 -48475 -23553 -26300
12821b6300J3625J1456L5529L6237J2916j5390J5458k289m6113r487Q208j041
$$ -26300 -12675 -1219 34310 70547 83463 68073 83531 81242 35129 25642 33850 32809
12809C2809j3220N952j1132n1635j7182L136K7964J0920j2868L1814j5022k6446
$$ 32809 19589 25541 14409 -37226 -54408 -51272 -23308 -12388 -25256 6558 -8464 -34910
12797c4910Q012O558L394J4989l714m411J0512n52K1335l78o908J15p565p270
$$ -34910 -26898 -20340 -16946 -1957 -5671 -10082 430 -122 21213 20835 13927 14042 6477 -793
12783g93n596J6099K1790j2045q903j319J1391J217J5550L9570j1285j8201K134
$$ -793 -6389 9710 31500 19455 10552 9233 20624 21841 37391 76961 65676 47475 49609
12770D9609l4879j9777J060L7495l4890n2579j1498J9690N449j119l006k1429
$$ 49609 14730 -5047 -3987 33508 -1382 -53961 -65459 -45769 -40320 -41439 -44445 -65874
12758f5874K5347K6286K1832M3231K7439n390m8836k762J0443j9828j6947o693
$$ -65874 -40527 -14241 7591 50822 78261 72871 24035 21273 31716 11888 -5059 -11752
12746a1752J514N704K2335K186O032j6303j9928O304M81l460p513K3290O4128
$$ -11752 -10238 -4534 17801 19987 26019 9716 -10212 -3908 -3427 -6887 -14400 8890 73018
12733G3018J2119j652k603k2381J7473r562m0514j4482j1183j9197l220J7302
$$ 73018 85137 83485 80882 58501 75974 66412 25898 11416 233 -18964 -22184 -4882
12721d882L4279k0552j3352l865o06J9414K5566O246K8440K9194K368l2629n5530
$$ -4882 29397 8845 -4507 -8372 -8978 10436 36002 42248 70688 99882 102250 69621 14091
12708A4091k7875m579N147j5811q276K9890J7579K537j5718o853K2204M1814R341
$$ 14091 -13784 -18363 -13216 -29027 -37303 -7413 10166 12703 -3015 -9868 12336 54150 63491
12695F3491m2157k4159m412K5509P566l2679M598L9370r56l0468r273R162P341
$$ 63491 21334 -2825 -7237 18272 25838 -6841 -2243 37127 36171 5703 -3570 5592 12933
12682A2933O02m1495o401l185qK2400Q342J8817j7365n549K4909j5963k227J1491
$$ 12933 13535 -27960 -34361 -37546 -37554 -15154 -6812 12005 -5360 -10909 14000 -1963 -4190 7301
12668G301k8672N950L5365J5568j077k6359j1480j072P00L1864J1720j5694k1064
$$ 7301 -21371 -15421 19944 35512 34435 8076 -3404 -4476 -3776 28088 39808 24114 3050
12655C050k0971j5556J8937R873j1160k4704K2090n647k8638q846j5976J6341
$$ 3050 -17921 -33477 -14540 -4667 -15827 -40531 -18441 -24088 -52726 -61572 -77548 -61207
12643f1207K987J4476K8326J0388k3317j9964P490L5958j8123r939K4855J1996
$$ -61207 -58220 -43744 -15418 -5030 -28347 -48311 -40821 -4863 -22986 -32925 -8070 3926
12631C926J7889K334K349k4305k5399j8852J7975J3669N160j5704K0718J2088
$$ 3926 21815 24149 26498 2193 -23206 -42058 -24083 -10414 -5254 -20958 -240 11848
12619A1848l679k4269o662r62J9844L1659j5336m1336J177n107o87J1665J3243
$$ 11848 8169 -16100 -22762 -23724 -3880 27779 12443 -28893 -27716 -32823 -33510 -21845 -8602
12606h602j2541P129P959P061J7537j16O447K3294j1717P280j1855k2121k3215
$$ -8602 -21143 -14014 -6055 1006 18543 18427 24874 48168 36451 43731 31876 9755 -13460
12593a3460j6883L327M6295J2655N308q659j5126n69j4352j4128L342k6428j305
$$ -13460 -30343 -27016 19279 31934 37242 28583 13457 12888 -1464 -15592 -12250 -38678 -39983
12580c9983J0679O504Q575K2360R29l1481L1293k3123k0723q943J4841L442L437
$$ -39983 -29304 -22800 -14225 8135 9064 -22417 8876 -14247 -34970 -43913 -29072 -25630 -22193
12567b2193M380J3554L1598j3248m3487Q809J8023M3726L2875j3750m6945l6688
$$ -22193 -17813 -4259 27339 14091 -29396 -20587 -2564 41162 74037 60287 13342 -23346
12555b3346j8671q781J1896P360L888J7228J2036K350J9270J3335j7498k8196
$$ -23346 -42017 -50798 -38902 -31542 -27654 -10426 1610 3960 23230 36565 19067 -9129
12543i129q047p729J4986J6941k6785j0209k2374j5045O717K7220J1819k754k9650
$$ -9129 -17176 -24905 -9919 7022 -19763 -29972 -52346 -67391 -60674 -33454 -21635 -24389 -54039
12530e4039M650K1851K5077K2847K2154l2570o389J3358O995k7417j4203l844
$$ -54039 -49389 -27538 -2461 20386 42540 9970 3581 16939 23934 -3483 -17686 -21530
12518b1530L4711K9780k4462k8902o55J0193K969m32L377N6082k859j3173j0397
$$ -21530 13181 42961 18499 -10403 -11058 -865 2104 1672 5049 61131 58272 45099 34702
12505C4702M177l508k8389m2010Q169K7134M752k4718J7152j384J7601j6018l473
$$ 34702 38879 35371 6982 -35028 -26859 275 5027 -19691 -2539 -3923 13678 -2340 -5813
12492e813j6511L648j7794K3882K3421J0868m643j2852J0967M638m0926l5247
$$ -5813 -22324 -18676 -36470 -12588 10833 21701 17058 4206 15173 19811 -21115 -56362
12480e6362J4449M5998L4660L4876j1530N647O7406Q7066R1090J08555J79938
$$ -56362 -41913 4085 38745 73621 62091 67738 135144 222210 313300 421855 601793
12469F01793J96235P0949n1764r8559j55549j48225r2374p9633n7094l6615n5005
$$ 601793 798028 868977 817213 718654 563105 414880 322506 242873 185779 149164 94159
12458I4159k9340J834k0376Q055J5379r399j1736j0267j7632J5006l879p788L499
$$ 94159 64819 66653 46277 54332 69711 60312 48576 38309 20677 35683 31804 24016 27515
12445B7515K2254K6507R503j2127l611J3837L0633O0517L3575J7764N1999N7273
$$ 27515 49769 76276 85779 73652 70041 83878 114511 175028 208603 226367 278366 335639
12433C35639M556l3407m3101O722L0320J6593J3869j4941k3256P820M6893O2157
$$ 335639 340195 306788 263687 270409 300729 317322 331191 316250 292994 300814 347707 409864
12421D09864R7213P3632K6308o022l464p4166j03857p4471m0244l1974j008J6368
$$ 409864 507077 580709 607017 600995 597531 523365 419508 345037 304793 272819 271811 288179
12409B88179K2406r07m945k7092k7127k4858m3287j265P1802M3659K870n5455
$$ 288179 310585 309678 304733 277641 250514 225656 182369 181104 252906 296565 299435 243980
12397B43980n0725j4210l4587l6422k5048m141M13Q62l307j6617J3633R293r722
$$ 243980 193255 179045 144458 108036 82988 78847 79260 80122 76815 60198 73831 83124 73402
12384G3402j2977K486J0437J478J9479K0623K0338m206Q06L3543L4836P2015R8024
$$ 73402 60425 62911 73348 74826 94305 114928 135266 131060 131866 165409 200245 272260 370284
12371C70284J55379J76384J42879O933r2993j48477j54655j16535j04522o0489
$$ 370284 525663 702047 844926 851859 758866 610389 455734 339199 234677 174188
12361A74188o2688n3015Q03L5647K1216q741n2343m6843k9963J6143O742R435
$$ 174188 111500 58485 59288 94935 116151 107410 55067 8224 -21739 -5596 1146 10581
12349A0581J3124k2974m104j5516K0845Q675r690L915J9325q945k1018q960J1168
$$ 10581 23705 731 -3373 -18889 1956 10631 941 4856 24181 15236 -5782 -14742 -3574
12336c574L354J9816P96j6268J166j8969O391Q627R300J5775L990M369l7259k6772
$$ -3574 -220 19596 20392 4124 5290 -13679 -7288 1339 10639 26414 30404 34773 -2486 -29258
12322b9258l1724J2808K637o315L8467L0232j0823j2744k1600r592J2336l474
$$ -29258 -60982 -48174 -45537 -51852 -13385 16847 6024 -6720 -28320 -37912 -25576 -29050
12310b9050r412k1196Q761K3504K3872j2016K5564J4940R334j4192k5745K4537
$$ -29050 -38462 -59658 -50897 -27393 -3521 -15537 10027 24967 34301 20109 -5636 18901
12298A8901q66j4720r38J9146J6698n290j4092r296J8163O219k5241q666L132
$$ 18901 18035 3315 2377 21523 38221 32931 18839 9543 27706 33925 8684 18 3150
12285C150j0362j7377k2216k0584R104M500j7613R885J6111L2247K4459J5403
$$ 3150 -7212 -24589 -46805 -67389 -58285 -53785 -71398 -61513 -45402 -13155 11304 26707
12273B6707J422r888j3069J6873K6790k3541j0459p345j0024J8637j7519j4746
$$ 26707 28129 18241 5172 22045 48835 25294 14835 7490 -2534 16103 -1416 -16162
12261a6162N832J1490J2976J1131j6676r632j7561j9934j8885P139J4639J9573
$$ -16162 -10330 1160 14136 25267 8591 -1041 -18602 -38536 -57421 -50282 -35643 -16070
12249a6070L0828J3937k2052n653m911J2076j7614L27k3771o171M088K9696J4507
$$ -16070 14758 28695 6643 990 -3921 8155 -9459 -9132 -32903 -39074 -34986 -5290 9217
12236I217J2857j1541p956P578J3593l5827j4029k5021o629m958J3964J8531L6982
$$ 9217 22074 10533 2577 10155 23748 -12079 -26108 -51129 -57758 -62716 -48752 -30221 6761
12223F761N040j7587k3028p608P17L0689Q776N985j6010q773p522P219O596j477
$$ 6761 11801 -5786 -28814 -36422 -35705 -5016 3760 9745 -6265 -15038 -22560 -15341 -8745 -10222
12209a0222k2346Q093m498J4504K478k2827J4208L0209J2563j0620J3607J5116
$$ -10222 -32568 -24475 -28973 -14469 -11991 -34818 -20610 9599 22162 11542 25149 40265
12197D0265m377j1004j399j3717j1342L3875K1162j8464o942k9607l0470J6073
$$ 40265 35888 24884 23485 9768 -1574 32301 53463 34999 28057 -1550 -32020 -15947
12185a5947m180J8233L2342K998J4783K5124l8957k6511K0802K7674k1018O477
$$ -15947 -20127 -1894 30448 33446 48229 73353 34396 7885 28687 56361 35343 41820
12173D1820l6793l4129J34j0439l4349J0144J8840K2746k0163K1253L7908k769
$$ 41820 5027 -29102 -28968 -39407 -73756 -63612 -44772 -22026 -42189 -20936 16972 14203
12161A4203J0467n71l48J2978j39N749O413p775l0561K0097L3922j1421j3645
$$ 14203 24670 24099 23751 36729 36590 42339 48752 40977 10416 30513 64435 53014 39369
12148C9369R890J2094k3849l5379j4817P702J7854M008P563P642j8238O940J4549
$$ 39369 49259 61353 37504 2125 -12692 -4990 12864 16872 24435 32077 13839 20779 35328
12135C5328J8864J9866M833k7306p112o03m4070k2776K746N716L2280N022r884
$$ 35328 54192 74058 78891 51585 44473 43870 -200 -22976 -20230 -14514 17766 22788 12904
12122A2904Q237Q54p365j0522l610q231Q154J700k3798p288l671K2689l6338P708
$$ 12904 21141 21995 14630 4108 498 -7733 421 2121 -21677 -28965 -32636 -9947 -46285 -38577
12108c8577K6475q230l4825N1928K2866m2251l7332K8946K558n187J5797J9290
$$ -38577 -12102 -20332 -55157 -3229 19637 -22614 -59946 -31000 -28442 -33629 -17832 1458
12096A458J5124N569K424j663p435k894J1243M105J1223j1114j687j896m6606
$$ 1458 16582 22151 24575 22912 15477 12583 23826 27931 39154 28040 26353 24457 -22149
12083b2149q739j1922O983J7013j0423k7346L2155O596j8792R406J4522j4397
$$ -22149 -30888 -42810 -35827 -18814 -29237 -56583 -24428 -17832 -36624 -27218 -12696 -27093
12071b7093K0818J7519l044j414j6176J8259P526j857n418M780M571r714j5525
$$ -27093 -6275 11244 8200 6786 -9390 8869 16395 14538 9120 13900 18471 8757 -6768
12058f768J5913R520j490O801j456k5638n312J1169j411Q87O058J828n020P500
$$ -6768 9145 18665 17175 23976 22520 -3118 -8430 2739 1328 2215 8273 10101 5081 12581
12044A2581M459m8524P422m948j9741P032K577n033p585K9228J1955P308K0324
$$ 12581 17040 -31484 -24062 -29010 -48751 -41719 -39142 -44175 -51760 -22532 -10577 -3269 17055
12031A7055r364p218r878K134k1588j8509j5412L316J3241J5326N310O818J3477
$$ 17055 7691 473 -9405 -7271 -28859 -47368 -62780 -59464 -46223 -30897 -25587 -18769 -5292
12018e292j9182m5593J0939L0961m201l382m7154J4758K9119j919K4212K9432
$$ -5292 -24474 -70067 -59128 -28167 -32368 -35750 -82904 -68146 -39027 -40946 -16734 12698
12006A2698k0023j8477K2359M7321l465r152L722j6646l0444k1987L75L328k9700
$$ 12698 -7325 -25802 -3443 43878 40413 31261 34983 18337 -12107 -34094 -33719 -30391 -60091
11993f0091m81K7846K2958m257j830N683K1107m056k6307k2084j9576L7525L1798
$$ -60091 -60572 -32726 -9768 -14025 -15855 -10172 10935 6879 -19428 -41512 -61088 -23563 8235
11980H235k1038k2671j2225N868N45J3867J8511K6106l139K735p418J710J6906
$$ 8235 -12803 -35474 -47699 -41831 -41286 -27419 -8908 17198 14059 16794 9376 11086 27992
11967B7992J9650K0972j9655n2274j389K3740J5056p688K458m790j2302o986k1067
$$ 27992 47642 68614 48959 -3315 -4704 19036 34092 26404 28862 24072 11770 4784 -16283
11954a6283l5282l15l708Q401K7706l415J9174M7317n769k5467K0609l288j1386
$$ -16283 -51565 -51880 -55588 -47187 -19481 -22896 -3722 43595 37826 12359 32968 29680 18294
11941A8294J5770o602j9314K2753P493J9762O282J3127k972r909l9701m6438j5147
$$ 18294 34064 27462 8148 30901 38394 58156 64438 77565 74593 64684 24983 -21455 -36602
11928c6602J5247L2982M408L0224q534l9619k8435J8470J1205K891m713L2453
$$ -36602 -21355 11627 16035 46259 37725 -1894 -30329 -11859 -654 2237 -2476 29977
11916B9977L6628j7664j1405J0795j4778J092j5250J37m982j0663L673M6711O75
$$ 29977 66605 48941 37536 48331 33553 34645 19395 19532 14550 3887 7560 54271 54946
11903E4946n833J461j7067l5150L34J5848K1193L280j5187l3871K823j0623K2717
$$ 54946 49113 50574 33507 -1643 -1309 14539 35732 39012 23825 -10046 -7223 -17846 4871
11890D871O498o705J4101k2367k4066P114k294M77J6091q003P375Q055L6662o003
$$ 4871 11369 4664 18765 -3602 -27668 -20554 -22848 -22371 -6280 -14283 -6908 1147 37809 31806
11876C1806l3739J228K5206J7028O75j694p657k139l567O150j8786j956K7775
$$ 31806 -1933 -705 24501 41529 42204 40510 32853 30714 27147 33297 14511 12555 40330
11863D0330Q275N06j8546K2151k6881j0959Q295r656k669m421K4252l975L300
$$ 40330 48605 49111 30565 52716 25835 14876 23171 13515 10846 6425 30677 26702 30002
11850C0002L537p071p269M565l1875Q450J952J7167j654o971J601j813K0631p599
$$ 30002 33539 26468 19199 23764 -8111 339 2291 19458 17804 10833 12434 10621 31252 23653
11836B3653k4754J0271J4611K6355K4545k9985r838M07J2180j1697l8566j2333
$$ 23653 -1101 9170 23781 50136 74681 44696 34858 35265 47445 35748 -2818 -15151
11824a5151K8190L0609m494j8485J3066j6556l5884J4635j3868L095K6342k30
$$ -15151 13039 43648 39154 20669 33735 17179 -18705 -4070 -17938 -14843 11499 11269
11812A1269j8122K6277M953q383J6339L3383P4k4387J054l90j0548J014k1033
$$ 11269 -6853 19424 24377 15994 32333 65716 65790 41403 42457 42067 31519 32533 11500
11799A1500l4318r683J3691J4002q810q837K8235L503J248k6178l607J2404J7556
$$ 11500 -22818 -32501 -18810 -4808 -13618 -22455 5780 9283 10531 -15647 -19254 -6850 10706
11786A0706J5570j3595k0610p988J9273q938L6170J0140l5814r327j2980O634
$$ 10706 26276 12681 -7929 -15917 3356 -5582 30588 40728 4914 -4413 -17393 -10759
11774a0759o745J6317P253K8910O618k2070m389l0035J8797K9727j0178q182k799
$$ -10759 -17504 -1187 6066 34976 41594 19524 15135 -14900 3897 33624 23446 15264 12465
11761A2465k667p618o017J1103j371j0377J0109n274r819N276K4075k1219R027
$$ 12465 9798 2180 -3837 7266 5895 -4482 5627 353 -9466 -4190 19885 -1334 7693
11748G693N149L090m241P524M028o692l6279J8304L8361K016k5972J447L7427
$$ 7693 12842 15932 11691 19215 23243 16551 -19728 -1424 36937 38953 12981 14428 51855
11735E1855j1575k4850l1377l4472l6804O649K0728J984L7361j4725m0259J5246
$$ 51855 40280 15430 -15947 -50419 -87223 -80574 -59846 -57862 -20501 -35226 -75485 -60239
11723f0239J2903L482K4216n007J7513M5039k8441k4067Q125K6182j247J585j0138
$$ -60239 -47336 -43854 -19638 -24645 -7132 37907 9466 -14601 -6476 19706 18459 20044 9906
11710I906j6684J9267J2400k1607r032p069K8221K032r454r717j519j9484J0296
$$ 9906 -6778 12489 24889 3282 -5750 -12819 15402 17434 7980 -1737 -3256 -22740 -12444
11697a2444J5864K982J3931j7232j2694j6816R173Q426J520J2581j6435j710K2814
$$ -12444 3420 6402 20333 3101 -9593 -26409 -17236 -8810 -7290 5291 -11144 -12854 9960
11684I960Q849K1928P186k308r108l0417k0170K768J7989j1480O841L135m396
$$ 9960 18809 40737 47923 45615 36507 6090 -14080 -11312 6677 -4803 2038 5173 777
11671G77k0066L3144P927N820p59P873J5752k8700j9662L241r071J406K1623M250
$$ 777 -19289 13855 21782 27602 26843 34716 50468 21768 2106 5347 -3724 -2318 19305 23555
11657B3555j3248n217j8956J6011R080k796k6137j7676p822J7779K6354J0102
$$ 23555 10307 5090 -13866 2145 11225 8429 -17708 -35384 -43206 -25427 927 11029
11645A1029K4619L8855n326j7594J4442K395m1096m4211J8301J9637j3479k424
$$ 11029 35648 74503 69177 51583 66025 68420 27324 -16887 1414 21051 7572 5148
11633E148J343K9589K0681k308J3294K5499Q25k2239j5424M765m913j6353L9344
$$ 5148 6491 36080 56761 54453 67747 93246 94071 71832 56408 61173 56260 39907 79251
11620G9251j2343j7750q72j8427k7218k2783l297L0297J1432j9738J6580K8166
$$ 79251 66908 49158 48286 29859 2641 -20142 -23439 6858 18290 -1448 15132 43298
11608D3298p86J8404J1465k7059j8839K7539j951p622j2539K2528L6192Q708K1155
$$ 43298 42512 60916 72381 45322 26483 54022 52071 44449 31910 54438 90630 99338 120493
11595A20493m586n0351l6652L321R687K2060j0343K0269j448k8174k6515n840
$$ 120493 115907 65556 28904 32225 41912 63972 53629 73898 72450 44276 17761 11921
11583A1921J9756K2594P642k656l1324J0581m035j814J0936K7308n306J3433p789
$$ 11921 31677 54271 61913 59257 27933 38514 34479 32665 43601 70909 65603 79036 71247
11570G1247K1230J1485j9576l4941k2339j3564N485J6139r179K5214J3345K11
$$ 71247 92477 103962 84386 49445 27106 13542 19027 35166 25987 51201 64546 64757
11558F4757J5112R844Q850L8993K726k1429k469O177K0570J8197j1121j6729j8182
$$ 64757 79869 89713 98563 137556 140282 118853 116384 122561 143131 161328 150207 133478 115296
11545A15296p809L1605K5197M7859P2900P7363J67487K98790N10433M88778J47223
$$ 115296 107487 139092 164289 212148 285048 362411 529898 828688 1339121 1827899 1975122
11534A975122j72702l56111m32932l65457k08948j20001o3773n8973l4637l2099
$$ 1975122 1802420 1446309 1013377 647920 438972 318971 255198 196225 161588 129489
11524A29489j3967k5498l4214J0443K8732J6127o204K0542o22m7648j7935q334
$$ 129489 115522 90024 55810 66253 94985 111112 104908 125450 124828 77180 59245 50911
11512E0911k7982N238K4855P77o512M3306J090J9702J7015l2693m5277j1368J7960
$$ 50911 22929 28167 53022 53799 47287 90593 91683 111385 128400 95707 50430 39062 57022
11499E7022l5045k1308J2744L7406N544Q735l093m8268Q526J8233l3012J4036
$$ 57022 21977 669 13413 50819 56363 65098 62005 13737 22263 40496 7484 21520
11487B1520P290K464K3231J3918J1618k503k7169R228K216k5445l3525O374J7276
$$ 21520 28810 31274 54505 68423 80041 77538 50369 59597 61813 36368 2843 9217 26493
11474B6493J1750J7935J1798r049k3657p224J4555L438O414K2349r346k0914p654
$$ 26493 38243 56178 67976 58927 35270 28046 42601 46039 52453 74802 65456 44542 36888
11461C6888O99n470j8088K1613J2947q166K3035j3122j8257J6945J4251l7158
$$ 36888 37587 32117 14029 35642 48589 40423 63458 50336 32079 49024 63275 26117
11449B6117j1865k4208J9035L766J0284o18M76K2804K3597l1349K0223j7180P767
$$ 26117 14252 -9956 9079 12845 23129 22511 22987 45791 69388 38039 58262 41082 48849
11436D8849k3403k8681J8478L9661Q512L032J4888r906j4952k6492J3141Q191
$$ 48849 25446 -3235 15243 54904 63416 66448 81336 71430 56478 29986 43127 51318
11424E1318K5723J771M217j8861l375L3259p482m3666j1725J1108J5863L3486
$$ 51318 77041 78812 83029 64168 60793 94052 86570 42904 31179 42287 58150 91636
11412I1636K5405m30o524m3145r641J6695J2676j883l5371m706M1656K5817J4426
$$ 91636 117041 116611 110087 66942 57301 73996 86672 84789 49418 44712 86368 112185 126611
11399A26611J6750K6827N3568O2069j0974o4010j2198l0671l1013k0774m4374
$$ 126611 143361 170188 223756 285825 274851 210841 198643 167972 136959 116185 71811
11388G1811k8646j9341J4126J7975L0740K5746J6910M2286N917O691N7417L1347
$$ 71811 43165 23824 37950 55925 86665 112411 129321 171607 177524 184215 241632 272979
11376B72979k8243j2576n4171o9104m1275J9768M7648L9797j1457k7104R772L315
$$ 272979 244736 232160 177989 108885 67610 87378 135026 174823 163366 136262 146034 149349
11364A49349K570j0975k0388k4135j5951J3441K3653J6287m595Q159M5056N6544
$$ 149349 151919 140944 120556 96421 80470 93911 117564 133851 129256 137415 182471 239015
11352B39015Q2920K1762n931K3224k2158n5438m0572m7119n6326k5454l6331k9179
$$ 239015 321935 343697 337766 360990 338832 283394 242822 195703 139377 113923 77592 48413
11340D8413J7114O5750K1060n727o495k8223J961j8313j9473l5579j0331J0621
$$ 48413 65527 131277 152337 146610 140115 111892 113853 95540 76067 40488 30157 40778
11328D0778K2062L1963L3973L5454j000o2023p3064j8312n3220j8212K7679L2999
$$ 40778 62840 94803 128776 164230 163230 101207 28143 9831 -43389 -61601 -33922 -923
11316i23Q7582P1238Q6332K6629q433Q323j146r040k4412j2346K6544L5473K6305
$$ -923 86659 157897 244229 270858 262425 270748 269602 260562 236150 223804 250348 285821 312126
11303C12126J6482L0415j8539o5263p0061l8755j5436m8568j8325l405J739M284
$$ 312126 328608 359023 340484 275221 205160 166405 150969 102401 84076 80671 82410 86694
11291H6694n324m61J0136j920K6665o957j9192l656j16j8937j6850K7062M5359
$$ 86694 81370 80909 91045 89125 115790 108833 89641 85985 85869 66932 50082 77144 122503
11278A22503m24p059j1421j9939Q159l3591N875J2862L9091J6720m441l549J3320
$$ 122503 122079 115020 103599 83660 91819 58228 64103 76965 116056 132776 128335 124786 138106
11265A38106L5618J4426l363o050L532J6420Q616k4107j6855l4652J1892k224
$$ 138106 173724 188150 184787 178737 182269 198689 207305 183198 166343 131691 143583 141359
11253A41359p208L4768N0910K77l5234j467j8038j1755k5038J6942M999k2868
$$ 141359 134151 168919 219829 220106 184872 183405 165367 153612 128574 145516 150515 127647
11241A27647k214j6564R264q608N406M3869M0538J06R359j0631l1449L5336N7505
$$ 127647 125433 108869 118133 109525 114931 158800 199338 199444 208803 198172 166723 202059 259564
11228B59564L891k1838l9006j7295l6356k202L6602M3623k221j9583j5875j2001
$$ 259564 263455 241617 202611 185316 148960 146758 183360 226983 224762 205179 189304 177303
11216A77303M394J6196J7230L3884P4339L9278J4096M767j4289k6897l5791j3547
$$ 177303 181697 197893 215123 249007 323346 362624 376720 381487 367198 340301 304510 290963
11204B90963O599J1121K604K1587K0721J8254Q234L8312M6077N8743J9597j1749
$$ 290963 297562 308683 311287 332874 353595 371849 380083 418395 464472 523215 542812 531063
11192E31063k873P691k4337J2021L9794N5736j821j004K3228J6383J0649r399
$$ 531063 528190 535881 511544 523565 563359 619095 617274 616270 639498 655881 666530 657131
11180F57131l0757L0724L3301P5374L1768L7257M4655J1582J5521L8738N4270
$$ 657131 626374 657098 690399 765773 797541 834798 879453 891035 906556 945294 999564
11169I99564O4091O8517O1377K8109P0473L0796J8721M2019N9978Q9457J01360
$$ 999564 1063655 1132172 1193549 1221658 1292131 1322927 1341648 1383667 1443645 1533102 1634462
11158A634462J27417J35244J03571J46227J53906J68376K27858K70738L14862
$$ 1634462 1761879 1897123 2000694 2146921 2300827 2469203 2697061 2967799 3282661
11149C282661M73145O53521Q33984O00883K73788K23198K12627M00010P37640
$$ 3282661 3755806 4409327 5243311 5844194 6117982 6341180 6553807 6953817 7691457
11140G691457J026000J387526J590395J514507J598728J950221K735099L944700
$$ 7691457 8717457 10104983 11695378 13209885 14808613 16758834 19493933 23438633
11132B3438633N662892Q108257J2208309J9984551L4717022O1355827R6400451
$$ 23438633 29101525 37209782 49418091 69402642 104119664 165475491 261875942
11125B61875942Q5442947R506387m1842110p8336720q1334098n5205051l1849698
$$ 261875942 347318889 356825276 314983166 236646446 155312348 100107297 68257599
11118F8257599j8350015j1298336p477420n244106l926126k927864k158015j929506
$$ 68257599 49907584 38609248 31131828 25887722 21961596 19033732 16875717 14946211
11110A4946211j851563j728288j564761j183073p56976m76763j99538k5391r7467
$$ 14946211 13094648 11366360 9801599 8618526 7861550 7384787 7185249 7159858 7062391
11101G062391m41130o63949p71502o77133n02433l69595l08543k95667k97584
$$ 7062391 6621261 5957312 5185810 4508677 4006244 3636649 3328106 3032439 2734855
11092B734855k79452k35792j68255j30546r9425j41141j62436j59575j46659j14657
$$ 2734855 2455403 2219611 2051356 1920810 1821385 1680244 1517808 1358233 1211574 1096917
11082A096917j05356r3238r9128m7125p8272j6726N555l5818o0706k8438Q277
$$ 1096917 991561 898323 799195 752070 673798 657072 662627 626809 566103 537665 545942
11071E45942L1823J6553l8520m6456k3898k1125j8678m6266j6328j4665l6450
$$ 545942 577765 594318 555798 509342 485444 464319 445641 399375 383047 368382 331932
11060C31932j7746L4599r557L918K9590k3074P976J1691J64J6200l0995l3374
$$ 331932 314186 348785 339228 343146 372736 349662 357638 369329 369493 385693 354698 321324
11048C21324Q720J5052j5576n4481l19k0711o144j59o521j1331p476J9450J4674
$$ 321324 330044 345096 329520 275039 274720 254009 247865 247706 241185 229854 222378 241828 256502
11035B56502L0109J05L1226R873k5529j5827q970J8056j6408k4585L0905N2070
$$ 256502 286611 286716 317942 327815 302286 286459 277489 295545 279137 254552 285457 337527
11023C37527j2406r685J3074k1658j6474O677L4209k2117l7314p747o4143l0383
$$ 337527 325121 315436 328510 306852 290378 297055 331264 309147 271833 264086 199943 169560
11011A69560L3319k5508k8127L155K9395J5721j4142N573J4507L6879K6093j8265
$$ 169560 202879 177371 149244 152399 181794 197515 183373 188946 203453 240332 266425 248160
10999B48160l6574K2807L4641R1313J31102R2506K6129k8336p6032j21960j10334
$$ 248160 211586 234393 269034 360347 491449 583955 610084 581748 505716 383756 273422
10988B73422o8089l0057j5091l5185n4888j7769K6681J7937j6411K687K7567K6371
$$ 273422 205333 175276 160185 125000 70112 52343 79024 96961 80550 83237 110804 137175
10976A37175j3612k1642k9880j5702k2977O236j6093P747J1129K4851L8584K8005
$$ 137175 123563 101921 72041 56339 33362 39598 23505 31252 42381 67232 105816 133821
10964A33821k3056k7253O944R130J5249J3173J4947K5968K658l962m2431k6213
$$ 133821 110765 83512 90456 99586 114835 128008 142955 168923 171581 167619 125188 98975
10952I8975N906j5639j9094o845m2310j9652J7960N069k0268j7063J659l9132
$$ 98975 104881 89242 70148 63303 20993 1341 19301 24370 4102 -12961 -11302 -50434
10940e0434k7988l7395j2077j3251n356J8404L6329Q0851J07009N8748K1406q144
$$ -50434 -78422 -115817 -127894 -141145 -146501 -128097 -91768 -10917 96092 154840 176246 168102
10928A68102n0818k3551j2368l4660m7252J0913o281L0904L1464L8993N962l097
$$ 168102 117284 93733 81365 46705 -547 10366 4085 34989 66453 105446 111408 108311
10916A08311k3197l53m639m462j4443J3685L1451L2553O761K7859K7971O7507
$$ 108311 85114 84761 80122 75660 61217 74902 106353 138906 145667 173526 201497 269004
10904B69004K5804p7376m2898l6540j0822J0123l5417j7825j01r999R995j5326
$$ 269004 294808 217432 174534 137994 127172 137295 101878 84053 83952 73953 83948 68622
10892F8622j611o168p135Q364k736P447j7890o723k3397j5878N976p61J9751L405
$$ 68622 67011 60843 53708 62072 59336 66783 48893 42170 18773 2895 8871 8110 27861 31266
10878C1266P014J1724M1880K6560j8633j3167k2954J3447k784o720P138J2634
$$ 31266 38280 50004 91884 118444 99811 86644 63690 77137 74353 67633 74771 87405
10866H7405o408j566k6183l2843j4725j018J2319J3895M357j3553L3096J1215
$$ 87405 80997 79431 53248 20405 5680 4662 16981 30876 35233 21680 54776 65991
10854F5991J1379k3055l220K704j4799K7263j048O095M1041J8949k6790N579p918
$$ 65991 77370 54315 51095 53799 39000 66263 65215 71310 112351 131300 104510 110089 102171
10841A02171k6425l2278j3582R860J1334k3018j8875L0J872n134k854K3689K4064
$$ 102171 75746 43468 29886 39746 51080 28062 9187 9217 11089 5955 3101 26790 50854
10828E0854L1303r99k3209M057P825L798O021j1024m866j7602j0609O4975R7784
$$ 50854 82157 81158 57949 62006 69831 73629 79650 68626 63760 46158 35549 100524 198308
10815A98308L7013l838l2443j9182n813k6244o986j0963M49l043J6133O4845J16214
$$ 198308 235321 231483 199040 179858 174045 147801 140815 129852 130301 127258 143391 208236 324450
10802C24450J69159J47786L4240k4991j47409j39903q6779n2864o0584j4114k362
$$ 324450 493609 641395 675635 650644 503235 363332 276553 223689 163105 148991 146629
10791A46629L769l8751k7031j3911K154l7968l2372P857L5464O980j818j7384
$$ 146629 150398 111647 84616 70705 72859 34891 2519 10376 45840 52820 51002 33618
10779C3618P083J53M1993P290k6591k8626p534L143m650K4917K8589K1724J7466
$$ 33618 40701 40854 82847 90137 63546 34920 27386 30529 25879 50796 79385 101109 118575
10766A18575J4192k722k4972M411J1645k937N040K034j823m281n820J1897K3920
$$ 118575 132767 130045 105073 109484 121129 118192 123232 125266 123443 119162 113342 125239 149159
10753A49159p061j1952q106L6947L5430J1407L5389O3343J25014K05673L09005
$$ 149159 142098 130146 122040 158987 194417 205824 241213 304556 429570 635243 944248
10742I44248L46414J09328j04573k30168l33478k55041j61080n7880m7374l8422
$$ 944248 1290662 1399990 1295417 1065249 731771 476730 315650 257770 210396 171974
10732A71974j3596k0377J3530P649l0080k2741K8178J2824J4167L6178K7304Q8
$$ 171974 158378 138001 151531 159180 129100 106359 134537 147361 161528 197706 225010 225098
10720B25098j2077j1042J7053J8718M4498Q0226P5448P7132J19700K95141N06972
$$ 225098 213021 201979 219032 237750 282248 362474 437922 515054 634754 929895 1436867
10709A436867N71587L27670j4057j97188k04086N8941L46570M00913M0150k89080
$$ 1436867 2008454 2336124 2322067 2124879 1920793 1979734 2326304 2727217 2767367 2478287
10699B478287n00987n13853m08627k60438j81713j18856r1212o7654o2520m6040
$$ 2478287 1977300 1463447 1054820 794382 612669 493813 402601 334947 272427 226387
10689B26387m1357M521k0527N024k496j5628N438j0711k7196J757j573j1895q247
$$ 226387 185030 189551 169024 174048 171552 155924 161362 150651 123455 125212 123639 111744 103497
10676A03497L6890J8596k0815m2057p78O505O025q026j4943j3213P298M8667J77
$$ 103497 140387 158983 138168 96111 95333 101838 107863 99837 84894 71681 78979 127646 127823
10663A27823j0988J6489j2834j3175K4406K5133L942K3647j6156p703j5847P979
$$ 127823 116835 133324 120490 107315 131721 156854 160796 184443 168287 160584 144737 152716
10651A52716L6313l666k9845m329N1970N4384M1116L6573J3119K4408K8932K7975
$$ 152716 189029 185363 155518 151189 203159 257543 298659 335232 348351 372759 401691 429666
10639D29666L4535N8964K9309L8921O2409Q6391Q7040Q2343Q0537J45061K10710
$$ 429666 464201 523165 552474 591395 653804 740195 827235 909578 990115 1135176 1345886
10628A345886K20424K84863M42094P03324J197863J991384L315738M143394K223067
$$ 1345886 1566310 1851173 2293267 2996591 4194454 6185838 9501576 13644970 15868037
10619A5868037j27613j437641j659224N6923K157711J627738q33651k434636l482602
$$ 15868037 15740424 14302783 12643559 12700482 14858193 16485931 15652280 13217644 9735042
10610I735042l129488k089742j254470p53997m85633l05356k00507j92817j80133
$$ 9735042 6605554 4515812 3261342 2507345 2021712 1716356 1515849 1323032 1142899
10601A142899j46353q4744l4892m9885o9655r8989r2321m0809l4163R323l5804
$$ 1142899 996546 911802 876910 827025 757370 658381 566060 525251 491088 500411 464607
10590D64607p3738j1514k3718o1700k3159j5621j7925j5444k5259k4021m057P939
$$ 464607 390869 379355 355637 293937 270778 255157 237232 221788 196529 172508 168451 176390
10578A76390N396M062p774k9844j0953k1407k9691m162j7292J6894K3749n851
$$ 176390 181786 185848 178074 148230 137277 115870 86179 82017 64725 81619 105368 99517
10566I9517J9304O013K105J4297K5938N890K2483R934n3297k6286N735j3737j5569
$$ 99517 118821 124834 126939 141236 167174 173064 195547 205481 152184 125898 131633 117896 102327
10553A02327N504j4811j7164j5673l1747K429R154j496K7k6910m904K1675M177
$$ 102327 107831 93020 75856 60183 28436 30865 40019 38523 38550 11640 6736 28411 32588
10540C2588k2969j461l222j0505L1911N3700J0324l055j8395k5902k6686j4272
$$ 32588 9619 8158 4936 -5569 26342 80042 90366 87311 68916 43014 16328 2056
10528B056J6965K0581J8080j2172l3552l202R395L0682J8830j8150l792j032K1025
$$ 2056 19021 39602 57682 45510 11958 8756 18151 48833 67663 49513 45721 44689 65714
10515F5714M14j3252k5485o032J8874r94q461N078K6759n647L049j7976J2951
$$ 65714 66128 52876 27391 21359 40233 39239 30778 35856 62615 56968 60017 42041 54992
10502E4992k2768m4160R945M2124J1483K6534o247K2841M1010J4702M732l5007
$$ 54992 32224 -11936 -1991 40133 51616 78150 71903 94744 135754 150456 155188 120181
10490A20181n4982k9769P646R415N55M313l4999k0648K2948Q856q502l5451N44
$$ 120181 65199 35430 43076 52491 53046 57359 22360 1712 24660 33516 25014 -10437 -9893
10477i893K0699m891p847J4719l6361K4773K6790J1780r777P074M387j954J735
$$ -9893 10806 5915 -1932 12787 -23574 1199 27989 39769 29992 37066 41453 39499 41234
10464D1234q500J1796J1583o309j0341j4545K2776Q183r856k0853j974J5914l6809
$$ 41234 32734 44530 56113 49804 39463 24918 47694 55877 46021 25168 23194 39108 2299
10451B299K5294K3661k4765j7761J5177q119r297j1941J3639L143M622J2917j8442
$$ 2299 27593 51254 26489 8728 23905 15786 6489 -5452 8187 11330 15952 28869 10427
10438A0427n835N2260J2525j1399n7547n0922N634L0187J0708j9038r03j1153
$$ 10427 4592 56852 69377 57978 431 -50491 -44857 -14670 -3962 -23000 -23903 -35056
10426c5056K328M679Q736J7444K3403M64k6060P479p413K855K8381P044k7551
$$ -35056 -32728 -28049 -19313 -1869 21534 21998 -4062 3417 -3996 -1141 27240 34284 6733
10413F733l0121M0863l094J5243J0392k6219j5090K3906l912k3639j8994J8126
$$ 6733 -23388 17475 14381 29624 40016 13797 -1293 22613 18701 -4938 -23932 -5806
10401e806K9171N134j2203j6750K7467J6205m5094m2240j9889M9935L7161P10
$$ -5806 23365 28499 16296 -454 27013 43218 -1876 -44116 -64005 -14070 23091 23801
10389B3801R483K8283l4387l7343J6592M917Q350J3142P183j2517K7505K731N368
$$ 23801 33284 61567 27180 -10163 6429 11346 19696 32838 40021 27504 55009 57740 63108
10376F3108k8252n825j7841k6555l0778k0353K2792L2090L2006J45q811m0390
$$ 63108 34856 29031 11190 -15365 -46143 -66496 -43704 -11614 20392 20537 11726 -28664
10364b8664N60l973J2911L1527k503p133M1265N680j6666M981l24K323Q107P636
$$ -28664 -28104 -32077 -19166 12361 9858 2725 43990 49670 33004 37985 37661 39984 48091 55727
10350E5727k470J3050J914K523J4728K2893n148l2972L191m539M179j7123J0740
$$ 55727 53257 66307 68221 70744 85472 108365 103217 70245 73436 68897 73076 55953 66693
10337F6693J7103J961P435L364K1253J5354J856J0793J8496r825j3749j0998K0013
$$ 66693 83796 85757 93192 96556 117809 133163 135019 145812 164308 154483 140734 129736 149749
10324A49749L9729L2551K4093Q3837R5300Q5875J46597K43629M15883N31669N21351
$$ 149749 189478 222029 246122 329959 425259 511134 657731 901360 1317243 1848912 2370263
10313B370263J27310k13009m19337n03473l91893k64880j57323r4343p6115q2756
$$ 2370263 2497573 2284564 1865227 1361754 969861 704981 547658 453315 377200 294444
10303B94444l2099j8583r494n986m8279o6430j7062J8812J1229j5281p238j0563
$$ 294444 262345 243762 234268 228282 180003 113573 96511 115323 126552 111271 104033 93470
10291I3470k236k3329j8938p513J3473K7131k4098J539L5306k2948k1593J4391
$$ 93470 91234 67905 48967 41454 54927 82058 57960 59499 94805 71857 50264 64655
10279F4655m988m6273l1414N0703N3587Q238o191n1886q576Q926M97p983j1434
$$ 64655 59667 13394 -18020 32683 86270 94508 88317 36431 27855 36781 37278 29295 17861
10266A7861J4116L1113P654O144J8860j2474m1190j0470J7639J0264j2267k8035
$$ 17861 31977 63090 70744 76888 95748 83274 42084 31614 49253 59517 47250 19215
10254A9215O5q522q152J43N556K0854J7467K3073j0432k210J6083J5809j4243
$$ 19215 19280 10758 2606 2749 8305 29159 46626 69699 59267 57057 73140 88949 74706
10241G4706l7059J5685N0067K1954o040o682k3288k8843l0657J8577m99k278k7446
$$ 74706 37647 53332 103399 125353 119313 112631 89343 60500 29843 48420 47921 45643 18197
10228A8197J0994k1226n88L2951M9919J2864l0790R904J1449j1846q218l1488
$$ 18197 29191 7965 7377 40328 90247 103111 72321 82225 93674 81828 73610 42122
10216D2122J7197J8758O782N4735J2527o595o404m138N45k7865j2577K5582n358
$$ 42122 59319 78077 84859 139594 152121 145526 139122 134984 135529 107664 95087 120669 115311
10203A15311j6463q614r960l5081j2656N534k6822Q13J8767j7j3847j4197P419
$$ 115311 98848 90234 80274 45193 32537 38071 11249 12062 30829 30812 16965 2768 10187
10190A0187L0112m4911j8226K7974J3980o892J0091k8125j1191j3419J3690K0930
$$ 10187 40299 -4612 -22838 5136 19116 12224 22315 -5810 -17001 -30420 -16730 4200
10178D200j499j814J2474l1731j8625M41J0476M6583K3329l5665Q382j3577k087
$$ 4200 2701 887 13361 -18370 -36995 -36554 -26078 20505 43834 8169 16551 2974 887
10165H87Q330P31J2872j617l0815l6575N049P291K4403J3917j195q402m072o156
$$ 887 9217 9948 22820 21203 -9612 -46187 -41138 -33847 -9444 4473 3278 -5124 -9196 -15352
10151a5352J1286j0855J367J1274k1566j7425J0669O180r953Q746K4514L6281
$$ -15352 -4066 -14921 -13554 -2280 -23846 -41271 -30602 -24422 -34375 -25629 -1115 35166
10139C5166q039k8024P664R124J4583R587J1006j134K6878P937j2795n598K4540
$$ 35166 27127 -897 6767 15891 30474 40061 51067 49933 76811 84748 71953 66355 90895
10126I0895M7297o418J54k4995m8599j2579n162R585K9151j4571m244j3312L383
$$ 90895 138192 131774 131928 106933 58334 45755 40593 50178 79329 64758 60514 47202 50585
10113E0585K2686J5844l1615l7111j5506k3783k2193J8400K5076K4253J1669k4604
$$ 50585 73271 89115 57500 20389 4883 -18900 -41093 -22693 2383 26636 38305 13701
10101A3701p093J5701k1193k9547k9611K7441K0656j3282o117J3164L1784j177
$$ 13701 6608 22309 1116 -28431 -58042 -30601 -9945 -23227 -29344 -16180 15604 14427
10089A4427k4583o465q272l968K2103K9319l042q564o720j1378K825O568n50K1319
$$ 14427 -10156 -16621 -24893 -28861 -6758 22561 19519 10955 4235 -7143 -4318 2250 1700 23019
10075B3019J4960p699j2799j1432l5523k7798O426K8852O865r201k5998R641k5634
$$ 23019 37979 30280 17481 6049 -29474 -57272 -50846 -21994 -15129 -24330 -50328 -40687 -66321
10062f6321o512L1883O131k778j4387O458o176M5003J4210K0320K3423p790j8946
$$ -66321 -72833 -40950 -34819 -37597 -51984 -45526 -51702 -6699 7511 27831 51254 43464 24518
10049B4518J0518K4510o547l1491k001M157R323p758k85j4539j1303k0637P105
$$ 24518 35036 59546 52999 21508 19507 23664 32987 25229 24944 10405 -898 -21535 -14430
10036a4430J8696J0024k4799n913J6960M110j4349M309j2517J9424Q637k2054
$$ -14430 4266 14290 -10509 -16422 538 4648 -9701 -5392 -17909 1515 10152 -11902
10024a1902J5201K9156o882l8790j7867n793J0358O387J0541Q628K505Q612k635
$$ -11902 3299 32455 25573 -13217 -31084 -36877 -26519 -20132 -9591 -963 1542 10154 7519
10011G519J476J2546N72k0809K1653J253O687R490J2376k1007p231m747j2209
$$ 7519 8995 21541 22113 1304 22957 24210 30897 40387 52763 31756 24525 19778 7569
9998G569O587k193L266J5490l254j8845k7442Q327o755K4212j267j8574J1459
$$ 7569 14156 11963 15229 30719 27465 8620 -18822 -10495 -17250 6962 5695 -12879 -1420
9985a420k9578J9373L5411n863n0218j2454L6199J4904j8800j5841k351j1669
$$ -1420 -30998 -11625 23786 17923 -32295 -44749 -8550 6354 -12446 -28287 -30638 -42307
9973d2307J3117K497K6641K6218k2473k539j3649l1000L6973J9884L908n552J637
$$ -42307 -29190 -26693 -52 26166 3693 1154 -12495 -43495 -6522 13362 17270 11718 13355
9960A3355q623P82j8554J5695J1797M178l446n696l2677k1223J5163J411L459
$$ 13355 4732 5514 -13040 2655 14452 18630 15184 9488 -23189 -44412 -29249 -27838 -24379
9947b4379R533k4593L478L8061K8539L1289o545q640j1276m7629j1145L5196L8749
$$ -24379 -14846 -39439 -35961 2100 30639 61928 55383 46743 35467 -12162 -23307 11889 50638
9934E0638K0024J5141K9564J6605K0313J2781j5370P143l6139l9965k2799l954
$$ 50638 70662 85803 115367 131972 152285 165066 149696 156839 120700 80735 57936 53982
9922E3982N567n809j3172k5066j1060K3645J4426j7459O89L3595m411l3748l5380
$$ 53982 59549 53740 40568 15502 4442 28087 42513 25054 25743 59338 54927 21179 -14201
9909a4201j5848J4032J6571R420R436r487M109K8447O1771J0691k4959N860J0253
$$ -14201 -30049 -16017 554 9974 19410 9923 14032 42479 104250 114941 89982 95842 106095
9896A06095J0114j834Q736P251N918k7170R747L7487K0611J412J3848N1661L4834
$$ 106095 116209 114375 123111 130362 136280 109110 118857 156344 176955 178367 192215 243876 278710
9883B78710L1220N6017Q35l3800k4240j0366k7970l3568k1606J433J573k3048
$$ 278710 309930 365947 366782 332982 308742 298376 270406 236838 215232 216665 218238 195190
9871A95190j5915M660J2297k2887p658P455M301M849J94O187j6626j2517k58j0466
$$ 195190 179275 183935 196232 173345 165687 173142 177443 182292 182486 188673 172047 159530 159272 148806
9857A48806M0113p035J1491O6488N2661R8272J82676J77415J07131o1103j75392
$$ 148806 188919 181884 193375 259863 312524 410796 593472 770887 878018 816915 641523
9846F41523j77550j43115o9540k6971j122j3740j5644o692K9297L8162Q5335P1464
$$ 641523 463973 320858 251318 224347 223225 209485 193841 187149 216446 254608 339943 411407
9834D11407N0414P7770M4178M5840O5k5305l2071n0960j01985j01652m6553n2699
$$ 411407 461821 539591 583769 629609 629674 604369 572298 521338 419353 317701 271148 218449
9822B18449j7089k2500k9556q789K3672K2576j4883l6393J0206K6730J9485J1284
$$ 218449 201360 178860 149304 140515 164187 186763 171880 135487 145693 172423 191908 203192
9810B03192l2188q4952M151Q88R120j7600n699J3885J8587M0856L1356r659L221
$$ 203192 171004 86052 90203 91091 100211 82611 76912 90797 109384 150240 181596 171937 175158
9797A75158k253q538j6373n457J4706j6465r959M5710O4977P676J4447J3947M2123
$$ 175158 172905 164367 147994 142537 157243 140778 130819 176529 241506 249182 263629 277576 319699
9784C19699O5343N2759L4171m2095j06887p9157m0236l8737r862r571k4256k6973
$$ 319699 385042 437801 471972 429877 322990 243833 203597 164860 154998 145427 121171 94198
9772I4198K9969M7539K5201L4145J9523k36k2018o5518k6838k0142j5930j0612
$$ 94198 124167 171706 196907 231052 250575 250339 228321 162803 135965 115823 99893 89281
9760H9281k3268k5536m377P610J6002k6140O146o611k0607j6259k9995Q652L0817
$$ 89281 66013 40477 36100 43710 59712 33572 39718 33107 12500 -3759 -33754 -25102 5715
9747E715K8035l694n302l163j16L8702J7734p741O770K4390R283M4097M2735L5799
$$ 5715 33750 30056 24754 21591 21475 60177 77911 70170 76940 101330 110613 154710 197445 233244
9733B33244R175r937k3265m4855m2575j3365m6333o5472m042K3146J4871j5845
$$ 233244 242419 232482 209217 164362 121787 108422 62089 -3383 -7425 15721 30592 14747
9721A4747N515J0826p146j3829j1944J2263K4956j9538r237J9054J3560o156k9058
$$ 14747 20262 31088 23942 10113 -1831 10432 35388 15850 6613 25667 39227 33071 4013
9708D013j6880J2062Q739L2198L7936n161l3765k6764q874L354k0304Q338M1377
$$ 4013 -12867 -805 7934 40132 78068 72907 39142 12378 3504 6858 -13446 -5108 36269
9695C6269p762k8946J3542R507K279J1434L6139K4749l119n481k0855k7430J0998
$$ 36269 28507 -439 13103 22610 24889 36323 72462 97211 94092 88611 67756 40326 51324
9682E1324K018P514j0949k89o06l178k9660l431K3982j5109J5539j4556k7989
$$ 51324 53342 60856 49907 49618 49012 45834 16174 12743 36725 21616 37155 22599 -5390
9669e390j9756p257K7020K0342j3834l0032K1631O723m20q619J2605O387j5065
$$ -5390 -25146 -32403 -5383 14959 1125 -28907 -7276 -553 -973 -9592 3013 9400 -5665
9656e665J2078K8539K7050l76k8183m7661k4733j4467L0250K3069L971k5390j697
$$ -5665 6413 34952 62002 61626 33443 -14218 -38951 -53418 -23168 -99 3872 -21518 -23215
9643b3215K09j0677L316L8820J6860K5141J1988j3160j1139L2526J3646j7740
$$ -23215 -23006 -33683 -30367 8453 25313 50454 62442 49282 38143 70669 84315 66575
9631F6575k2986l7978N413J971j5587l220K0654l835j1877J8522k2316J4522R154
$$ 66575 43589 5611 11024 12995 -2592 -5812 14842 11007 -870 17652 -4664 9858 19012
9618A9012l5095m6561K0946J7393J8914J5076q711P551J1768l89p409j4210m834
$$ 19012 -16083 -62644 -41698 -24305 -5391 9685 974 8525 20293 19904 12495 -1715 -6549
9605f549J1391j9275j5847j2986K2196J1029J2000M294j7147K704N719J3188o944
$$ -6549 4842 -14433 -30280 -43266 -21070 -10041 1959 6253 -10894 -8190 -2471 10717 3773
9592C773o357k2330K699J0182K3501L636o660K677N632J5462m467P564j2178J55
$$ 3773 -2584 -24914 -22215 -12033 11468 15104 8444 11121 16753 32215 27748 35312 23134 23289
9578B3289J9334M587r618R173k442l005L14q637J131K025Q357L0997j473m4251
$$ 23289 42623 47210 37592 46765 44323 41318 41632 32995 34126 36151 44508 75505 74032 29781
9564B9781P894K8137L251l1940j4029K3138L805j4675L722k7004l1681J3270j673
$$ 29781 37675 65812 69063 37123 23094 46232 50037 35362 39084 12080 -19601 -6331 -8004
9551h004j889j767L6029r00j0757K5236M6531j3194p453m663k971j9537K154j4435
$$ -8004 -9893 -11660 24369 23469 12712 37948 84479 71285 63832 59169 56198 36661 38815 24380
9537B4380M045q043L079O146l263J7593j435k7173m150Q420k1599j6968J7700
$$ 24380 28425 20382 23461 29607 26344 43937 42502 15329 11179 19599 -2000 -18968 -1268
9524a268M3988K8630k0891j0343q002J77R139m591n818K5206m347j9467q126m577
$$ -1268 42720 71350 50459 40116 32114 32291 41430 36839 31021 56227 51880 32413 24287 19710
9510A9710o19j9037l0799j2843K256J1985R635K1844q124l1197J6227J2395J0501
$$ 19710 19091 54 -30745 -43588 -41332 -29347 -19712 2132 -5992 -37189 -20962 -8567 1934
9497A934o192n2R999L7783J0046L680J3403j8848m2773j2256O825L921Q062j0559
$$ 1934 -4258 -4310 5689 43472 53518 57198 70601 51753 8980 -3276 3549 7470 15532 4973
9483D973K5387Q991J4767l1132l8079K1456J4176J2118k5676m86J8981k6776J1757
$$ 4973 30360 39351 54118 22986 -15093 6363 20539 32657 6981 6495 25476 -1300 10457
9470A0457K1218K3181p716j1137j7934J4736k5796L984J5769m395M6340J8016
$$ 10457 31675 54856 47140 36003 18069 32805 7009 10993 26762 22367 68707 86723
9458H6723L2664K3501K4601j6054k6086k2206K6167L0578j0671k8843k3645j0043
$$ 86723 119387 142888 167489 151435 125349 103143 129310 159888 149217 120374 96729 86686
9446H6686K3942K6371L2263J5555L1755J9673J3863o017j3381j1880j0382j1818
$$ 86686 110628 136999 169262 184817 216572 236245 250108 244091 230710 218830 208448 196630
9434A96630j4290k9441l4860k2043l6309K3671p373j6947l0797J083K0441L449
$$ 196630 182340 152899 118039 95996 59687 83358 75985 59038 28241 29324 49765 53214
9422E3214j2867J80j5213j0365M966j1546K5394N9785J4081k1161k0240j7266
$$ 53214 40347 40527 25314 14949 19915 8369 33763 93548 107629 86468 66228 48962
9410D8962L0261L0309k2655N034J0871M0161k72j7787P468j3223R516Q217l5457
$$ 48962 79223 109532 86877 91911 102782 142943 142671 124884 132352 119129 128645 136862 101405
9397A01405p407R224K0379j365k3611m2807J3733J8186L460l4650P09K2038N9
$$ 101405 93998 103222 123601 122236 98625 55818 69551 87737 91197 56547 57256 79294 79353
9384G9353j5689m658K9117J1209q378m524M7245k1586l0345J5538j8900k6051
$$ 79353 63664 59006 88123 99332 90954 86430 133675 112089 81744 97282 78382 52331
9372E2331R404P773p813J6444N983r325k458J59m477k689P065J8308L0824K2590
$$ 52331 61735 69508 61695 78139 84122 74797 72339 72498 68021 65332 72397 90705 121529 144119
9358A44119K9613O761j2890J5321J7464K7374J6595M658k6780l7636k7898j6811
$$ 144119 173732 180493 167603 182924 200388 227762 244357 249015 222235 184599 156701 139890
9346A39890l604Q063P074j1813M3939L5538k8955m8253k3623k30K9954k823j4557
$$ 139890 136286 144349 151423 139610 183549 219087 190132 141879 118256 118026 147980 145157 130600
9333A30600J5072L190l672k1029k3745p782J1248K3646L1106R108k0127j1354
$$ 130600 145672 148862 145190 124161 100416 92634 103882 127528 158634 167742 147615 136261
9321A36261l4794j6689K27J7714J1964M759J8111J7487L9777R361j0681p787L862
$$ 136261 101467 84778 85005 102719 114683 119442 137553 155040 194817 204178 193497 185710 189572
9308A89572j3994P811K3833M2895k531l8959r084J7428J1038R677k2770k9662
$$ 189572 175578 183389 207222 250117 247586 208627 199543 216971 228009 237686 214916 185254
9296A85254K1309K2410J8425N626k0940o89j4670n4370j0782O245M8921r10j0845
$$ 185254 206563 228973 247398 253024 232084 231395 216725 162355 151573 157818 206739 205829 194984
9283A94984J2908L2878j3930l3647M963m3389L5915J1930j3682j0359j0989J914
$$ 194984 207892 240770 226840 193193 198156 154767 190682 202612 188930 178571 167582 169496
9271A69496k1940k2284n38K0419N623l7980K4651K0501K2831O26l317J6249L626
$$ 169496 147556 125272 124734 145153 150776 112796 137447 157948 180779 181405 178088 194337 197963
9258A97963j0946R819L2317o288j3460k793l2675K34L957j0657k5469J8954J8820
$$ 197963 187017 196836 229153 222865 209405 206612 173937 174171 178128 167471 142002 160956 179776
9245A79776N9314L2861n674K7893J5653J85O01l5625k8948J2574J2708k6806m3114
$$ 179776 239090 271951 266277 294170 309823 310008 310609 274984 246036 258610 271318 244512 201398
9232B01398j3840n5083l5367P045q406l714L26K5282K3231m659j6159O131J2402
$$ 201398 187558 132475 97108 104153 95747 92033 92359 117641 140872 136213 120054 126185 138587
9219A38587K3167j1524k6585k9420k1395m503K5933p123n188M4055K3418l5951
$$ 138587 161754 150230 123645 94225 72830 68327 94260 87137 81949 126004 149422 113471
9207A13471J0548K7510P821J685K1687K0807J4344l018o133j7507j3248j0327
$$ 113471 124019 151529 159350 161035 182722 203529 217873 214855 208722 191215 177967 167640
9195A67640K5496K0865j0890q336M721J0696k2480l6494L81R849J2174j740K9564
$$ 167640 193136 214001 203111 194775 199496 210192 187712 151218 151599 161448 173622 171882 201446
9182B01446J0015J6320K3565J7989j1561l5925j4839J1650o312J9834j7542j8948
$$ 201446 211461 227781 251346 269335 257774 221849 207010 218660 212348 232182 214640 195692
9170A95692L0308O1545K2350J1242K6238j891J0916p346l9983K632l719O866P562
$$ 195692 226000 287545 309895 321137 347375 345484 356400 349054 309071 311703 307984 314850 322412
9157C22412j7522l9412J1704M4443N8638L9312K6345M853k0155J4208J4448n462
$$ 322412 304890 265478 277182 321625 380263 419575 445920 450773 430618 444826 459274 453812
9145D53812j1252j2294l027M9334M1955J7759j1955R476O4736M6378Q1139L5249
$$ 453812 442560 430266 427239 476573 518528 536287 524332 533808 598544 644922 726061 761310
9133G61310M7314M3255L5872J7899L2679N8314M8085O2325R2268P9283P6131J16578
$$ 761310 808624 851879 887751 905650 938329 996643 1044728 1107053 1199321 1278604 1354735 1471313
9121A471313J25716J26815Q7045O7582Q3264M2614J6513M4746L8922K2191L9025
$$ 1471313 1597029 1723844 1810889 1878471 1961735 2004349 2020862 2065608 2104530 2126721 2165746
9110B165746R820N6563L7374j0195j375p118J0181l2891m9137o7463n6798n9313
$$ 2165746 2175566 2232129 2269503 2259308 2257933 2250815 2260996 2228105 2178968 2111505 2054707 1995394
9098A995394n2708o6978p1452q2181p9618r0420o5191n9681n4918j5969k7566
$$ 1995394 1942686 1875708 1804256 1722075 1642457 1552037 1486846 1427165 1372247 1356278 1328712
9087A328712n7820q3197l2764l5318m2390l5912l1203m6740k6024k7141J1714
$$ 1328712 1270892 1187695 1154931 1119613 1077223 1041311 1010108 963368 937344 910203 921917
9076I21917N7125N9122L4971K8010K5371k5573m3799o9269p2850n7043p3925p2054
$$ 921917 979042 1038164 1073135 1101145 1126516 1100943 1057144 987875 915025 857982 784057 712003
9064G12003l7873k5937o3727m3234l0321m461j0185n9754k7912k7864m0569j4710
$$ 712003 674130 648193 584466 541232 510911 506450 496265 436511 408599 380735 340166 325456
9052C25456J1137k044j8665j1143j0304j3433k747J3084J2851r73m680K4242J5752
$$ 325456 336593 334549 315884 304741 294437 281004 278257 291341 304192 303219 298539 322781 338533
9039C38533K2130j0571J2963J948l2600m86M3805K9034K4174L0346L5577L7189
$$ 338533 360663 350092 363055 365003 332403 331917 375722 404756 428930 459276 494853 532042
9027E32042O2865O3138K6402L6887M7796l78j6942l6962o0786q5671p8871o8408
$$ 532042 594907 658045 684447 721334 769130 768752 751810 714848 654062 568391 489520 421112
9015D21112n0917m1972l8106k4984K2543n313j1538k7683l0630k5664N387K6350
$$ 421112 370195 328223 290117 265133 287676 282363 270825 243142 212512 186848 192235 218585
9003B18585j6082k5308n298k9877L028O645k797j8831J8164m452K1617K9280p02
$$ 218585 202503 177195 171897 142020 145048 151693 148896 130065 148229 143777 165394 194674 193972
8990A93972k6420k3550o951J044J4851M6012Q2J8474M5635M4112K4741J8182O5518
$$ 193972 167552 144002 137051 138095 152946 198958 199040 217514 263149 307261 332002 350184 415702
8977D15702M9856M6031k161n1863n1968n2347m9864k4237j1520l3083m2357j1166
$$ 415702 465558 511589 509428 457565 405597 353250 303386 279149 267629 234546 192189 181023
8965A81023j3242k3372K0575L5373J6427K9984k5621l9288l4757p482J3404k3144
$$ 181023 167781 144409 164984 200357 216784 246768 221147 181859 147102 139620 153024 129880
8953A29880J6056J0969p392n231L100k4272j1570M235q993K612M339m869l4480
$$ 129880 145936 156905 149513 144282 147382 123110 111540 115775 106782 109394 113733 108864 74384
8940G4384J5817L7301K8428L7024K5755j7246l1090j6701M1871O4081J0162K1462
$$ 74384 90201 127502 155930 192954 218709 201463 170373 153672 195543 259624 269786 291248
8928B91248M3362j797l5537k4281k3368m6057j1577K5442K6554m79j4405k0083
$$ 291248 334610 332813 297276 272995 249627 203570 191993 217435 243989 243510 229105 209022
8916B09022Q396k0802j9306L0191j238m168J063j8453K404q474l170j8498L735
$$ 209022 217418 196616 177310 207501 206263 202095 203158 184705 187109 178635 175465 156967 160702
8903A60702j9411k433m117n273j3603l2820P765L0480K4073L0332J2425J3315
$$ 160702 141291 138858 134741 129468 115865 83045 90810 121290 145363 175695 188120 201435
8891B01435m746k7583j6546j0242K2996O348J684j2581M5347J9797L5579o570
$$ 201435 196689 169106 152560 142318 165314 171662 173346 160765 206112 225909 261488 254918
8879B54918j0290k5074J7850L4395M1212J0856p915j1346J104J1917l4168Q408
$$ 254918 244628 219554 237404 271799 313011 323867 315952 304606 305710 317627 283459 291867
8867B91867J430M837J6426O5633N0154P023k690r183l8774n1573m8513O02j7635
$$ 291867 293297 298134 314560 380193 430347 437370 434680 425497 386723 335150 286637 287239 269604
8854B69604l0245m233k2677k8659j0937M204J0781J837p445q195K395J0769J5371
$$ 269604 239359 235126 212449 183790 172853 177057 187838 189675 182230 174035 176430 187199 202570
8841B02570J7406m033j0754K8446j9288Q102L1624J2599j0450j8244k074j510
$$ 202570 219976 215943 205189 233635 214347 222449 254073 266672 256222 237978 235904 234394
8829B34394m303R136J1647K3090l3254p576J848j4592K1862j5257Q135j769j1107
$$ 234394 230091 239227 250874 273964 240710 233134 234982 220390 242252 226995 235130 233361 222254
8816B22254j6566k5072J9332J3638l2964k2788l4014m526J8521j0714k6299J3524
$$ 222254 205688 180616 199948 213586 180622 157834 123820 119294 137815 127101 100802 114326
8804A14326K3339J3481p943j6881m648k2435J6789p459j808k382J3244j2817J1204
$$ 114326 137665 151146 143203 126322 121674 99239 116028 108569 106761 104379 117623 104806 116010
8791A16010J6056J5134J0501Q55K8995p123J2K154j7289r973M565J6682J3014
$$ 116010 132066 147200 157701 158556 187551 180428 180440 182594 165305 155332 159897 176579 189593
8778A89593J4707q666k3503K473p085J9922O626l0895l6811J4505L2473K2634
$$ 189593 204300 195634 172131 174604 167519 187441 194067 163172 126361 140866 173339 195973
8766A95973r253J15l1480k8041M4983J5126p155k9249k2242J9654l6880j7814
$$ 195973 186720 186835 155355 127314 172297 187423 180268 151019 128777 148431 111551 93737
8754I3737K5236k0230o980K3744J7347j8662j3994R302K0912j5868o033K1689
$$ 93737 118973 98743 91763 115507 132854 114192 100198 109500 130412 114544 108511 130200
8742A30200J7455J8549l2467j8686K4631o56j0408j1975k8941J6975l123j5003
$$ 130200 147655 166204 133737 115051 139682 139026 128618 116643 87702 104677 101554 86551
8730H6551j2901J2506O83j193o372J4421J3842L3838J1159M324q831j6091q257
$$ 86551 73650 86156 86839 85646 79274 93695 107537 141375 152534 156858 148027 131936 123679
8717A23679R906K298J8813j734j2110R79k8353k6983L657K9303J3243j5167P494
$$ 123679 133585 135883 154696 152962 140852 141831 113478 86495 90152 119455 132698 117531 125025
8704A25025k2467J4772Q889K6002k596j3448O965J7729j4016J2617j6941q042
$$ 125025 102558 117330 126219 152221 149625 136177 143142 160871 146855 159472 142531 134489
8692A34489j4319j5780N5505K1853q61k1051j5141L1970K2358Q018J7152l588
$$ 134489 120170 104390 159895 181748 180887 159836 144695 176665 199023 207041 224193 220605
8680B20605L467n256k0756j7615K787L1553N482k6742m830J1156m546l20L570
$$ 220605 224072 218816 198060 180445 183232 214785 220267 193525 188695 199851 195305 194985 198555
8667A98555L198j9900n504k7057O603J7062j0362M123J3868J5610J7457K358J452
$$ 198555 201753 181853 176349 149292 155895 172957 162595 166718 180586 196196 213653 216011 217463
8654B17463l326j5354j9275M5152N1508N8524M8748K4383k4268k8784l6954l9020
$$ 217463 214137 198783 179508 224660 276168 334692 383440 407823 383555 354771 317817 278797
8642B78797m509k337r405q420l0704p906K8738L6977K3169J3187k4538p675N922
$$ 278797 274288 271951 262546 254126 223422 215516 244254 281231 304400 317587 293049 285374 291296
8629B91296K3993L179j9147R652R978o043J5862K141J526L6659K5024j7940J7931
$$ 291296 315289 318468 299321 308973 318951 312908 328770 330911 332437 369096 394120 376180 394111
8616C94111K0570j0885K3873N3341L6097K3722J1748K9451K7712J2399O8826N5898
$$ 394111 414681 403796 427669 481010 517107 540829 552577 582028 609740 622139 690965 746863
8604G46863J05926J43985P3819J7449p915k0542L0688L5701m19O149L4814K0559
$$ 746863 852789 996774 1070593 1088042 1080127 1059585 1090273 1125974 1125555 1131704 1166518 1187077
8592A187077m3170l1809k2077l1022m7646j05784j10956n7839p1726r2520o4796
$$ 1187077 1143907 1112098 1090021 1058999 1011353 905569 794613 736774 665048 572528 507732
8581E07732Q2k6479l469q734l9358n1256n1853k2930l8155m1176j3222p432K8198
$$ 507732 507814 481335 477866 469132 429774 378518 326665 303735 265580 224404 211182 203750 231948
8568B31948J3576j0786k2261J4155L365q74K3627k929J2700N45K7644J5413j5273
$$ 231948 245524 234738 212477 226632 229997 229123 252750 249821 262521 263066 290710 306123 290850
8555B90850l5266m7177l3113l6028j3988j3202L3415q932L4121M985j1072j454
$$ 290850 255584 208407 175294 139266 125278 112076 145491 136559 170680 175665 164593 163139
8543A63139K4181o217l2643m659n209j1607O731J9797K8832K3039q799l3371j9206
$$ 163139 187320 181103 148460 143801 138592 126985 133716 153513 182345 205384 196585 163214 144008
8530A44008j7054J2066J8818L8001q264m7010j2976j621j5037J3560o492k5955
$$ 144008 126954 139020 157838 195839 187575 140565 127589 125968 110931 124491 117999 92044
8518I2044j4827P951o941r026j5961Q363N4573K7454j9103L0952J2724k2371j7878
$$ 92044 77217 85168 78227 69201 53240 61603 116176 143630 124527 155479 168203 145832 127954
8505A27954k5371j2492K7683M7491l0225k5315J2666J6335j8612k9479J1197J6764
$$ 127954 102583 90091 117774 165265 135040 109725 122391 138726 120114 90635 101832 118596
8493A18596n417k1250k1821k1583j1703J0670K1463N3110J2892k9089L627l408
$$ 118596 113179 91929 70108 48525 36822 47492 68955 122065 134957 105868 109495 106087
8481A06087k2562j2744k2549L034J0006K6447j9211k1646k410P793K16j4536J4019
$$ 106087 83525 70781 48232 51266 61272 87719 68508 46862 44452 52245 52461 37925 51944
8468E1944K0632P862K2672j2238k8150M0612K0350j1600k8820r007K1808j3039
$$ 51944 72576 80438 103110 90872 62722 103334 123684 112084 83264 74257 96065 83026
8456H3026k3973R916L8726m762k3034j3437K52J0866j3825K568O233r69K5433
$$ 83026 59053 68969 107695 102933 79899 66462 66714 77580 63755 66323 72556 71587 97020
8443I7020j0503j0254R263k7811K443K0763q568k1038J6902L3753L3258J656k9382
$$ 97020 86517 76263 85526 57715 60158 80921 72353 51315 68217 101970 135228 136884 107502
8430A07502j3329K4248M7111j6459n5155k7199j2939N101K2336p045k2572k4278
$$ 107502 94173 118421 165532 149073 93918 66719 53780 58881 81217 74172 51600 27322
8418B7322O303r54K9932j656l5993l5521M448M7152K2098m152l061n292k3513
$$ 27322 33625 32671 62603 60947 24954 -10567 -6119 41033 63131 58979 55918 50626 27113
8405B7113L707L5582J8863l4540n345K4019j4375R841N593r2k965q808k0800J3172
$$ 27113 30820 66402 85265 50725 45380 69399 55024 64865 70458 70366 67401 58593 37793 50965
8391E0965O126l3867j5462j5254N804K5509l465J1571J8079K7618k3576j1058
$$ 50965 57091 23224 7762 -7492 -1688 23821 20356 31927 50006 77624 54048 42990
8379D2990L3584K6840l997k7903k2146j9218K5906J5495j7220j9434k4090K5366
$$ 42990 76574 103414 99417 71514 49368 30150 56056 71551 54331 34897 10807 36173
8367C6173R558K1807K0163l2153P304n030o469Q586q534j8998J3065j3176j9185
$$ 36173 45731 67538 87701 55548 62852 57822 51353 59939 51405 32407 45472 32296 13111
8354A3111J706r328o386L7320R165j5337R470K6048J8021j8056k7090l4547n065
$$ 13111 14817 5489 -897 36423 45588 30251 39721 65769 83790 65734 38644 4097 -968
8341i68J8477P40j869N276J9085R697O85j0578L6731O615k7253K950L2529J8925
$$ -968 17509 18249 16380 21656 40741 50438 51123 40545 77276 83891 56638 59588 92117 111042
8327A11042j5527j6422K3956k5650j8705j6958j4752L612L8912L0340L473j2829
$$ 111042 95515 79093 103049 77399 58694 41736 26984 30596 69508 99848 103321 90492
8315I0492o345J6141l964k8355k7492n139K6886P553k2399j3562L228K437l900
$$ 90492 84147 100288 96324 67969 40477 35338 62224 69777 47378 33816 37044 39481 35581
8302C5581K332J0401J9125k5022K8856j2385O56J6865J1964M858j251J5307J0035
$$ 35581 37913 48314 67439 42417 71273 58888 59544 76409 88373 93231 91980 107287 117322
8289A17322J0786Q111o332j5226j1881K055j4023l8325j1712J7706J2174K377
$$ 117322 128108 136219 129887 114661 102780 104835 90812 52487 40775 58481 70655 73032
8277G3032j5607j2601L8994m133J0788o719j7813j15j2809k1136J9274K1205J2576
$$ 73032 57425 44824 83818 79685 90473 83754 65941 65826 53017 31881 51155 72360 84936
8264H4936Q452J0612q331j254R476j0401J150K0911K3396L5720J2832m265M9133
$$ 84936 93388 104000 95669 94415 103891 93490 94640 115551 138947 174667 187499 183234 232367
8251B32367J23318J23984J67567J84720K17531J90795J05676n6970j40035j81823
$$ 232367 355685 479669 647236 831956 1049487 1240282 1345958 1288988 1148953 967130
8241I67130k33738k09463j38001j14921m9993j6361r744k8571k5817O037J3095
$$ 967130 733392 523929 385928 271007 221014 204653 194909 166338 140521 146558 159653
8230A59653l52k9653P251O727o977K4446M613j4248l040j9909J0216K7540J3071
$$ 159653 159301 129648 136899 143626 136649 161095 165708 151460 148420 128511 138727 166267 179338
8217A79338P772K0925L29J8773R071J3634L6454j3843J2128M5055L4262K1199
$$ 179338 187110 208035 208364 227137 236208 249842 286296 272453 284581 329636 363898 385097
8205C85097J6285J31665K51039M24412N34820N17329K90296J8603k81245m50905
$$ 385097 401382 533047 784086 1208498 1743318 2260647 2550943 2569546 2288301 1837396
8195A837396m67301l84930k95903j51198p5673o9985n0155m2320k7191m3898n051
$$ 1837396 1370095 985165 689262 538064 462391 392406 342251 299931 272740 228842 223791
8184B23791K3531J5682P643M879L1382L2933R0909N6464j8160m1256l3974j3976
$$ 223791 247322 263004 270647 275526 306908 339841 430750 487214 469054 427798 393824 379848
8172C79848l6873m7643k235n068k3497k5897M458k540M9636K128o937M7L300L9017
$$ 379848 342975 295332 293097 288029 264532 238635 243093 240553 290189 292317 285380 285427 288727 327744
8158C27744P0107O7212J76298J96437J82470J44573K2180o4462r8242j95680k17339
$$ 327744 397851 465063 641361 837798 1020268 1164841 1187021 1122559 1024317 828637 611298
8147F11298j08567o6645o2192o6166k3940J5807j3117k1807j6186J0060m735P899
$$ 611298 502731 436086 373894 307728 283788 299595 286478 264671 248485 258545 253810 261709
8135B61709N6175Q2394J05679R7750P4476K3518j0702k4119n8613q4232r2739
$$ 261709 317884 400278 505957 603707 678183 701701 690999 666880 608267 524035 431296
8124D31296l4023K0730j69M787M5815O5988k3986l4345l4746o4621j4266k0065
$$ 431296 397273 418003 417834 422621 468436 534424 510438 476093 441347 376726 362460 342395
8112C42395l1808k7017o304j4241o264k0416m1605k2352q062K884o603L804K7347
$$ 342395 310587 283570 277266 263025 256761 236345 194740 172388 164326 167210 160607 164411 191758
8099A91758J8628N249n104p992J6928L5474J3292j730k4075J0236K8524L0979
$$ 191758 210386 215635 210531 202539 219467 254941 268233 266503 242428 252664 281188 312167
8087C12167M0764L2121K9149K1307k98l6461q119j4791L658J1711L2243R5868
$$ 312167 352931 385052 414201 435508 435210 398749 390630 375839 379497 391208 423451 519319
8075E19319J07934J21293O1728p923p7569p3627r2334j06070p5264l4106k5428
$$ 519319 627253 748546 810274 802351 724782 651155 558821 452751 377487 343381 317953
8064C17953k9337J6661j4246j6920N997Q639n628P262j8001l176j4953m1279j6381
$$ 317953 288616 305277 291031 274111 280108 288747 283119 290381 272380 269204 254251 212972 196591
8051A96591J1108M0912K1715m207J0161J8484r05L3212m952r771j6738J7036l033
$$ 196591 207699 248611 270326 266119 276280 294764 293859 327071 322119 312348 295610 312646 309613
8038C09613j4259k593j2285K6635O1862O4787O9949L6487L4996K8737J4592P849
$$ 309613 295354 292761 280476 307111 368973 433760 503709 540196 575192 603929 618521 626370
8026F26370k7693l7497m6104n6937m9068n026k4730k2495k3731j4150j2221J0478
$$ 626370 598677 561180 515076 458139 409071 404045 379315 356820 333089 318939 306718 317196
8014C17196K992l246m845K6361K0668L714j1817M381J1308M8811M2571M3035k304
$$ 317196 320188 316942 312097 338458 359126 362840 351023 355404 366712 415523 458094 501129 498825
8001D98825n502n040Q018K3095j9986l3905l6856k6854k3819L939J7999L8365
$$ 498825 493323 488283 496301 519396 499410 465505 428649 401795 377976 381915 399914 438279
7989D38279k0769j2697j4079j5545j7532k7732j3139n100m5599p642n869j1154
$$ 438279 417510 404813 390734 375189 357657 329925 316786 311686 266087 258445 252576 241422
7977B41422P133J170k25k4393p630R516N7778J8655k5710r2o394n064r190R136
$$ 241422 248555 249725 249500 225107 217477 226993 284771 303426 277716 277624 271230 266166 256976 266112
7963B66112p901J9453L6423J9908J8187L8181o14j4783J064n047J0086L474k8188
$$ 266112 258211 277664 314087 333995 352182 390363 389749 374966 376030 370983 381069 384543 356355
7950C56355j2494o042J0845K8878m3968m4385o4684j8187j7058n646k590J4782
$$ 356355 343861 337819 348664 377542 333574 289189 224505 206318 189260 183614 181024 195806
7938A95806l0991j8786O856j6739j3951K6768J0655j3462m0802j3036L0687M5816
$$ 195806 164815 146029 152885 136146 122195 148963 159618 146156 105354 92318 123005 168821
7926A68821j2455k4228k301j854j1463J7321M8908J6173n068l838p645j1627j2872
$$ 168821 156366 132138 129837 127983 116520 133841 182749 198922 193854 190016 182371 170744 157872
7913A57872j6159k4817Q440L7605K1706L507K6087k7603l1313k4127k3826k8459
$$ 157872 141713 116896 125336 162941 184647 188154 214241 186638 155325 131198 107372 78913
7901G8913m086r296o179m418R204J6155q180j8415L055R784j6382O88L272k3612
$$ 78913 74827 65531 59352 54934 64138 80293 72113 53698 56753 66537 50155 50843 54115 30503
7887C0503J1525L8978j4441j4468o798j0315o232L60N711L0286J1020R45p84l5236
$$ 30503 42028 81006 66565 52097 45299 34984 28752 29112 34823 65109 76129 77074 76290 41054
7873D1054K5007P912j3216j5674j4470J5306M567K745K1491J0544m0397m9170
$$ 41054 66061 73973 60757 45083 30613 45919 50486 53231 74722 85266 44869 -4301
7861d301J0524J1170n407M361J1751K953K0261R335k074l2072J7132K2992R067
$$ -4301 6223 17393 11986 16347 28098 31051 51312 60647 58573 26501 43633 66625 75692
7848G5692q279p328O841n087k1398j5637J5563m475m641J5339k5505j7189J5590
$$ 75692 67413 60085 66926 61839 40441 24804 40367 35892 31251 46590 21085 3896 19486
7835A9486l445J420P771q831o709O15j89N207L9184K4543k4721j0322l6894r711
$$ 19486 16041 17461 25232 16401 9692 10307 10118 15325 54509 79052 54331 44009 7115 -2596
7821b596J9593J9481j4455j9987m520J0395M0409k386l7745j8148o45J9305J4999
$$ -2596 16997 36478 22023 2036 -2484 7911 48320 45934 8189 -9959 -10604 8701 23700
7808B3700j8380R57k6834J4916J2851R136L516K1227o946o629Q28k1773j5751
$$ 23700 5320 6277 -20557 -5641 7210 16346 19862 41089 34143 27514 28342 6569 -9182
7795i182P542J7751K302p25j4234k486j1845M0648L4728r156r356O230j7002k4943
$$ -9182 -1640 16111 18413 17688 3454 968 -10877 29771 64499 55343 45987 52217 35215 10272
7781A0272p089O941M400j6169O606j1947P691J1416L0892m856j5300L0824K7795
$$ 10272 3183 10124 14524 -1645 4961 -6986 705 12121 43013 38157 22857 53681 81476
7768H1476Q58j6082J077J567k1723J992P398J6803L6776o468j0144r289k9371
$$ 81476 82334 66252 67329 68896 47173 49165 56563 73366 110142 103674 93530 84241 54870
7755E4870j1502o808j842k8417K257J9602L699l25q673k4141J1480M3675J2921
$$ 54870 43368 36560 34718 6301 8558 28160 31859 31534 22861 -1280 10200 53875 66796
7742F6796k9450k9939j2966J8706j3865m840j0412o620j4567K489p623J0802K9846
$$ 66796 37346 7407 -5559 13147 -718 -5558 -15970 -22590 -37157 -34668 -42291 -31489 -1643
7729a643O992j8558k5008K2810M5548J4511K080M763j9644j4089J5166K7363l2283
$$ -1643 5349 -13209 -38217 -15407 30141 44652 46732 51495 31851 17762 32928 60291 28008
7716B8008n3817j265l786k2633J5885M6185J9291j2259N715p285J7241K9327m474
$$ 28008 -25809 -27074 -30860 -53493 -37608 8577 27868 15609 21324 14039 31280 60607 56133
7703E6133l1315j179p052k1278O972J0885K31k940k131l8029k4728L4468N4833
$$ 56133 24818 23639 16587 -4691 2281 13166 13397 10457 8326 -29703 -54431 -19963 34870
7690C4870k2752J4916J8052l668k6348j9218l6746J7271J2756j191L460K0592
$$ 34870 12118 27034 45086 41418 15070 -4148 -40894 -23623 -10867 -12058 -8598 11994
7678A1994J3128Q026j2713j7327l2889j48J7733o879j3097J5244M0818J9831n6
$$ 11994 25122 33148 20435 3108 -29781 -29929 -12196 -19075 -32172 -16928 23890 43721 43665
7665D3665q759j9182m6470J7220J5827P265k2374K181K2271n798j2601K0268L9242
$$ 43665 34906 15724 -30746 -13526 2301 9566 -12808 -10627 11644 5846 -6755 13513 52755
7652E2755K3223k4813q020j3797M2r220l7964j7868N499L786J1081K0491q758
$$ 52755 75978 51165 43145 29348 29390 20170 -17794 -35662 -30163 -26377 -15296 5195 -3563
7639c563j6313l446r31J2969J7723L491K1465J0076j356j1954k299p778j102K3228
$$ -3563 -19876 -23322 -24253 -11284 6439 9930 31395 41471 40115 28161 25862 18084 16982 40210
7625D0210o99L088N041j8027l7164o643k2351k23n306J1573K5096J2836k0458
$$ 40210 39511 42599 47640 29613 -7551 -14194 -36545 -36768 -42074 -30501 -5405 7431 -13027
7612a3027o650K0394J9529O289q461p214J2085j0119O196Q481k8706j1197J0634
$$ -13027 -19677 717 20246 26535 18074 10860 22945 12826 19022 27503 -1203 -12400 -1766
7599a766N507j6269O471r290J0312J0562J9795k436j6539l518j2909l2520J4678
$$ -1766 3741 -12528 -6057 -15347 -5035 5527 25322 22886 6347 2829 -10080 -42600 -27922
7586b7922K4619J2561j5898k0290j2907K4828M794J1590K4083L6033j3987l7043
$$ -27922 -3303 9258 -6640 -26930 -39837 -15009 -10215 1375 25458 61491 47504 10461
7574A0461l6417q411K5511O779K535l192J214J2421j1799J040K787j2510l8761
$$ 10461 -25956 -34367 -8856 -2077 458 -2734 -1520 10901 -898 142 2929 -9581 -48342
7561d8342j8720J9626j2293J9590M6113K7387j622j6381J0396K1679L7531k500
$$ -48342 -67062 -47436 -59729 -40139 5974 33361 31739 15358 25754 47433 84964 82464
7549H2464m0452M590R170M755L331j9771k8659R012O715l2960j8164R325M157
$$ 82464 42012 46602 55772 60527 63858 44087 15428 24440 31155 -1805 -19969 -10644 -6487
7536f487k2574n868j8730j182M951J1138j559J6889M2136J5010j1125k1527J6583
$$ -6487 -29061 -34929 -53659 -54841 -49890 -38752 -40311 -23422 18714 33724 22599 1072 17655
7523A7655L32l1737j2103O807J937q693K148j686J1265J3134J763K486n578n716
$$ 17655 17987 -13750 -25853 -19046 -17109 -25802 -23654 -25340 -14075 -941 822 3308 -2270 -7986
7509g986k5884k3248J2205L5340J5527J5117n095R356K604j9505j2292O442p678
$$ -7986 -33870 -57118 -44913 -9573 5954 21071 15976 25332 27936 8431 -3861 2581 -5097
7496e097R494O79n2301J0890K320k4661J8620K1325l971k860J2994j0698R704
$$ -5097 4397 5076 -47225 -36335 -34015 -58676 -40056 -18731 -22702 -25562 -12568 -23266 -13562
7483a3562M802n573j0116K828m0111M459L1118K0562l631k1073N2928L7086l328
$$ -13562 -8760 -14333 -24449 -21621 -61732 -57273 -26155 -5593 -9224 -30297 22631 59717 56389
7470E6389j6779p336J1632l845L4528p100l5733J0435j7462m5896m48N592J9917
$$ 56389 39610 32274 43906 40061 74589 67489 31756 42191 24729 -21167 -21615 -16023 3894
7457C894K7226j6056l1207l1059j1190m006M4891K4767r515J5309L602L7106K8293
$$ 3894 31120 15064 -16143 -47202 -58392 -62398 -17507 7260 -2255 13054 16656 53762 82055
7444H2055j6331m0834m472m711q876o705j1257j9022k1028n668J9702q724m119
$$ 82055 65724 24890 20418 15707 6831 126 -11131 -30153 -51181 -56849 -37147 -45871 -49990
7431d9990K8976O083j8621K0562J5363K1066p004o166K5854Q941k9071j6618Q782
$$ -49990 -21014 -14931 -33552 -12990 2373 23439 16435 10269 36123 45064 15993 -625 8157
7418H157k7M847p267j6100L2556n005n709P538K33j3775j2402J9437j6967n630
$$ 8157 8130 12977 5710 -10390 22166 17161 11452 18990 19223 5448 -6954 12483 -4484 -10114
7404a0114L551R096R955j3396j3501n640J0028N227r35k3105m046K2367k3000
$$ -10114 -6563 2533 12488 -908 -14409 -20049 -10021 -4794 -5729 -28834 -32880 -10513 -33513
7391c3513k7073K3584r550j4708K4311L0164L3124p37j0855q240J6598j532p794
$$ -33513 -60586 -37002 -46552 -61260 -36949 -6785 26339 25602 14747 6507 23105 21573 13779
7378A3779k5197j4819J4675J5466o121n650r30J1176J5573Q651j9276M227L063
$$ 13779 -11418 -26237 -11562 3904 -2217 -7867 -8797 2379 17952 26603 7327 11554 14617
7365A4617j2897L7862j4507P318J0702P288k3305n5855j7086M380L5953O755l9330
$$ 14617 1720 39582 25075 32393 43095 50383 27078 -28777 -45863 -41483 -5530 1225 -38105
7352c8105K62L9422j1710j701Q084r271q890j5748m945n704J2630J1459J0835
$$ -38105 -37843 1579 -10131 -11832 -3748 -13019 -21909 -37657 -42602 -48306 -35676 -24217 -13382
7339a3382J2135j8901j772J1941R546j7050j0927m803j0622M332M685j473J2900
$$ -13382 -1247 -20148 -21920 -9979 -433 -17483 -28410 -33213 -43835 -39503 -34818 -36291 -23391
7326b3391L04N443R613L121Q720J0626J0460N424K9701K6801k6791J855k3779
$$ -23391 -23087 -17644 -8031 -4910 3810 14436 24896 30320 60021 86822 60031 61886 38107
7313C8107p277j6743j457J4800r405K085P895P714j949j5268k262j1730j4861
$$ 38107 30830 14087 12630 27430 18025 20110 28005 35719 33770 18502 16240 4510 -10351
7300a0351j1095j0276J4177K3636J5679N015k2366M959J1200m4103J3124J1294
$$ -10351 -21446 -31722 -17545 6091 21770 26785 4419 9378 20578 -23525 -10401 893
7288H93k3380O993J2559j0424j2310N384L383q906J0564q38J8744J8310o935j4754
$$ 893 -22487 -15494 -2935 -13359 -25669 -20285 -16902 -25808 -15244 -16082 2662 20972 14037 -717
7274g17j9675K611J9058J6130R917k4747l2336N063Q469L7237o703j4895P020
$$ -717 -20392 -17781 1277 17407 27324 2577 -29759 -24696 -16227 21010 14307 -588 6432
7261F432l054k1486Q229j1672q325o441N154Q282j5165k1223K8160J5783p443
$$ 6432 3378 -18108 -9879 -21551 -29876 -36317 -31163 -22881 -38046 -59269 -31109 -15326 -22769
7248b2769P794L5278j4042m384Q537N467J8073k278K3341M248k3055m6954j1682
$$ -22769 -14975 20303 6261 1877 10414 15881 33954 31676 55017 59265 36210 -10744 -22426
7235b2426k4695J990M7288K9662l647k332j5842J5134K7383k0780j9275j8561
$$ -22426 -47121 -45131 2157 31819 28172 25840 9998 25132 52515 31735 12460 -6101
7223f101K020J1376O984j6912J1281O538p808k6244K4741K5352O20j8360j0467
$$ -6101 -4081 7295 14279 -2633 8648 15186 7378 -18866 5875 31227 31847 13487 3020
7210C020j0213J737J0142K3516j2518l3247j1652J6051J154M057J6522n797j162
$$ 3020 -7193 -5456 4686 28202 15684 -17563 -29215 -13164 -12010 -7953 8569 2772 1610
7197A610q500p867K4000m707j7955r961J8341o784j9564J3848m000m995K2363
$$ 1610 -6890 -14757 9243 4536 -13419 -23380 -5039 -11823 -31387 -17539 -21539 -26534 -4171
7184d171k5152k701J7911j2781L730J6011K5296M380j8064j5398j1719J321r609
$$ -4171 -29323 -32024 -14113 -26894 -23164 -7153 18143 22523 4459 -10939 -22658 -21337 -30946
7171c0946j3384K3092L8265O050k0382l6767M288K8856j9847M849J0326k9337
$$ -30946 -44330 -21238 17027 23077 2695 -34072 -29784 -928 -20775 -15926 -5600 -34937
7159c4937k2204K8718J3963k121j90j5744k4245j0528M2751L1453J5489j4691
$$ -34937 -57141 -28423 -14460 -16581 -16771 -32515 -56760 -67288 -24537 6916 22405 7714
7147G714J5338k2964j9203j9890k2813K170L4657K8641J528n405k0574m298K4012
$$ 7714 23052 88 -19115 -39005 -61818 -59648 -24991 3650 5178 -227 -20801 -25099 -1087
7134a087O807L3932k681k8952o665K5749K9460k4896l5702j0566rJ7844R00q825
$$ -1087 5720 39652 36971 8019 1354 27103 56563 31667 -4035 -14601 -14610 3234 4134 -4691
7120d691o704L074J0924j4358O490K9733P726j0865j2559j2037j7250k1749n139
$$ -4691 -11395 -8321 2603 -11755 -5265 24468 32194 21329 8770 -3267 -20517 -42266 -47405
7107d7405Q372L7707J4805l9757l6532Q527K59J8633K4751N83O540O13j8968j4814
$$ -47405 -39033 -1326 13479 -26278 -62810 -54283 -54024 -35391 -10640 -10057 -3517 -2904 -21872 -36686
7093c6686o860l155N250J4915L6438n488k5848k2511L1263O795Q147J5939j5743
$$ -36686 -43546 -46701 -41451 -26536 9902 4414 -21434 -43945 -12682 -5887 2260 18199 2456
7080B456l4478n074J0048n391k6003J7778P420J0575M6897M331j1880m884q005
$$ 2456 -32022 -37096 -27048 -32439 -58442 -40664 -33244 -22669 24228 28559 16679 11795 3790
7067C790P79P574L708j9585Q563j5834n544J780M709P050J7752Q48k9232j5090
$$ 3790 4569 12143 15851 -3734 4829 -11005 -16549 -14769 -10060 -3010 14742 15590 -13642 -28732
7053b8732K1005L6372j0833P079K9038r646J1004k5465j4736j0771P60K0679k2953
$$ -28732 -7727 28645 17812 24891 53929 44283 55287 29822 15086 4315 5075 25754 2801
7040B801J2136p871j1951O528L8200j6953k0483r481j6666j1549j9258j0207R77
$$ 2801 14937 7066 -4885 1643 39843 22890 2407 -7074 -23740 -35289 -54547 -64754 -63777
7027f3777K2914O11j1069k0281K7404J6243K9970N360j7486M919J8506K2451m2872
$$ -63777 -40863 -40252 -51321 -71602 -44198 -27955 2015 7375 -10111 -5192 13314 35765 -7107
7014g107m0017J2520K7610J2059K5034K0986k7307r241J1915j1569Q47J0964m781
$$ -7107 -47124 -34604 -6994 5065 30099 51085 23778 14537 26452 14883 15730 26694 21913
7001B1913k5449k2539Q975k686j276j2194j860J0156r985n521J5341J4710O912
$$ 21913 -3536 -26075 -17100 -19786 -21062 -33256 -35116 -24960 -34945 -40466 -25125 -10415 -3503
6988c503J1813j2957R34k1478j7298K9153K744l6307j0172L8127K9156J7499L7518
$$ -3503 8310 -4647 -3713 -25191 -42489 -13336 -10592 -46899 -57071 -18944 10212 27711 65229
6975F5229j4276l0080P21j1830l4378j1983k427J3324N158k1692m566o859J4087
$$ 65229 50953 20873 21594 9764 -24614 -36597 -39024 -25700 -20542 -42234 -46800 -53659 -39572
6962c9572r776j9412J5042N266L298K8789J0665J6352K6693M656l8008k1549m223
$$ -39572 -49348 -68760 -53718 -48452 -45154 -16365 -5700 10652 37345 42001 3993 -17556 -21779
6949b1779K525J3824J6556Q868j1577j4123l877J6254K7098j9232j9301M618k1758
$$ -21779 -19254 -5430 11126 19994 8417 -5706 -9583 6671 33769 14537 -4764 -146 -21904
6936b1904R816J2812k3475J475M174l965M589m932o799j6494R206K7942o899l029
$$ -21904 -12088 724 -22751 -21276 -17102 -21067 -16478 -21410 -28209 -44703 -35497 -7555 -14454 -17483
6922a7483K434K541J4745O792J0389l443j7506l9543j6591K1357K6537R668L1484
$$ -17483 -15049 -12508 2237 9029 19418 15975 -1531 -41074 -57665 -36308 -9771 -103 31381
6909C1381p030k8075j5480J671J7090J4264O047k6710j3661j0J1891J3421L926
$$ 31381 24351 -3724 -19204 -17533 -443 13821 19868 -6842 -20503 -20513 -8622 4799 8725
6896H725O933k2280J661j2061l1176J5936O06J2146K9495L609j2573O798k7997
$$ 8725 15658 -6622 -4961 -17022 -48198 -32262 -31656 -19510 9985 13594 1021 7819 -20178
6883b0178J5174Q202j0209J1276O92J7738K4656l553L023Q973P751j9869m0781
$$ -20178 -5004 3198 -7011 4265 4957 22695 47351 43798 46821 55794 63545 43676 2895
6870B895l7108J7656o895m358Q193M2032J7326l2441p644j9715o792M5127j831
$$ 2895 -34213 -16557 -23452 -27810 -19617 22415 39741 7300 -344 -20059 -26851 18276 16445
6857A6445j7511j3434J7686N725j437J8164R725M047k0246k8154P508Q565J4903
$$ 16445 -1066 -14500 3186 8911 7474 25638 35363 39410 19164 -8990 -1482 7083 21986
6844B1986k8498l2873J006k052J0059K2862j2984k672M521L0221J9438j2989j049
$$ 21986 -6512 -39385 -38379 -40431 -30372 -7510 -20494 -23166 -18645 11576 31014 18025 16976
6831A6976M774R382k4913J3631k892k8248Q748K3408M026O626n23q810k9526j1736
$$ 16976 21750 31132 6219 19850 16958 -11290 -2542 20866 24892 31518 30995 22185 -7341 -19077
6817a9077J2228n178k0031l2840q610p006J3531K6670N474n2073l354o468L8109
$$ -19077 -6849 -12027 -32058 -64898 -73508 -80514 -66983 -40313 -34839 -86912 -90266 -96734 -58625
6804e8625L8742R033L176o638j7122L0464L2627j2492p378l84Q814N18k8486O205
$$ -58625 -19883 -10850 -7674 -14312 -31434 -970 31657 19165 11787 11403 20217 20735 -7751 -1546
6790a546j4931j9672j2084o332J0846N868J2919j1109K2239J9816K2009J4420
$$ -1546 -16477 -36149 -48233 -54565 -43719 -37851 -24932 -36041 -13802 6014 28023 42443
6778D2443j3857n5376l0606J721J4666K0910Q955L307J6950L4549k3314m4848
$$ 42443 28586 -26790 -57396 -55675 -41009 -20099 -11144 -7837 9113 43662 20348 -24500
6766b4500J768K4498r786J2082K0588R704j3305J123R962J5758P118q829o494
$$ -24500 -22732 1766 -8020 4062 24650 34354 21049 22172 32134 47892 55010 46181 39687
6753C9687J5821M0835k756l1646K2355n476j5015M5153M8771J3379m581J3150
$$ 39687 55508 96343 93587 61941 84296 78820 63805 108958 157729 171108 166527 179677
6741A79677j8970o954P563m33J630J4123L86l082M4180L5130K4751J2237p86Q0818
$$ 179677 160707 153753 161316 160883 162513 176636 177022 173940 218120 253250 278001 290238 289452 370270
6727C70270J07168J16743J62654K53714L89512O02515R58328J262555R13669n9048
$$ 370270 477438 594181 756835 1010549 1400061 2002576 2960904 4223459 5137128 5078080
6717E078080p41291j142083j048877p29423m02718k23681j64348j33637q1148
$$ 5078080 4336789 3194706 2145829 1416406 1013688 790007 625659 492022 410874
6708D10874n5376k5631l0237k7934j5989n2849j1861l4870l5106O721R379J485
$$ 410874 355498 329867 299630 271696 255707 202858 190997 156127 121021 127742 137121 138606
6696A38606K748J2689L016j3259m0633j6019K446N58j6180k8510k9317k2197R698
$$ 138606 141354 154043 157059 143800 103167 87148 89594 90152 73972 45462 16145 -6052 3646
6683C646J2032L2764J3459r928j5808L4051k480l9710m0613k8118K3469K1434
$$ 3646 15678 48442 61901 51973 36165 70216 67736 28026 -12587 -40705 -17236 4198
6671D198Q487j288j5979k9833J827J7132L7102J3107j2330l6400j2997J4488P658
$$ 4198 12685 11397 -4582 -34415 -32588 -15456 21646 34753 22423 -13977 -26974 -12486 -4828
6658d828j3913J6918K4448k6434j3174J4445j0082P948M631K8290j2333j5826
$$ -4828 -18741 -1823 22625 -3809 -16983 -2538 -12620 -4672 -41 28249 15916 90
6646I0J5080J6079m6765j890J5484N802L0572J0177k1849O676n880m0068k8927
$$ 90 15170 31249 -15516 -17406 -1922 3880 34452 44629 22780 29456 23576 -16492 -45419
6633d5419k0946L0109K1327M982j4251j3755n813R349J3679k1139j3997M64J6884
$$ -45419 -66365 -36256 -14929 -9947 -24198 -37953 -43766 -34417 -20738 -41877 -55874 -55410 -38526
6620c8526J1519L4000O038r460O598N297L397l0396j5351K0461K6136j595J8281
$$ -38526 -27007 6993 13031 3571 10169 15466 18863 -11533 -26884 -6423 19713 18118 36399
6607C6399l5633j4877k918K4667j820M181r44K7964j8794j5545j7082O45j3908
$$ 36399 766 -14111 -17029 7638 5818 9999 9055 37019 18225 2680 -14402 -13757 -27665
6594b7665K2278J0413L964J8096J6683R336n060m4682m5417j5722R805O795J0191
$$ -27665 -5387 5026 8990 27086 43769 53105 48045 3363 -42054 -57776 -47971 -41176 -30985
6581c0985J2708J8042K1371L721k45N333j2125k5330j1698K2248L052n503j8083
$$ -30985 -18277 -235 21136 24857 24612 29945 17820 -7510 -19208 3040 6092 589 -17494
6568a7494j0801q471K2237r468Q411K1434K1268n583l3147R209Q754K9066J3285
$$ -17494 -28295 -36766 -14529 -23997 -15586 5848 27116 21533 -11614 -2405 6349 35415 48700
6555D8700j2435k6983k4850l6694k298O694K2061J3054J0628n997m284Q375P070
$$ 48700 36265 9282 -15568 -52262 -54560 -47866 -25805 -12751 -2123 -8120 -12404 -4029 3041
6542C041k4418L6478k585m7920l963L7816r93k2317o50k5265j6661L4866L1761
$$ 3041 -21377 15101 12516 -35404 -39367 -1551 -2544 -24861 -25511 -50776 -67437 -32571 -810
6529h10K9323P694k5363k8880J2668l130O823R333J9435P008j9034m8398K6487
$$ -810 28513 36207 10844 -18036 -5368 -8498 -1675 7658 27093 34101 15067 -33331 -6844
6516f844N176J2480J5867j1967j8377k3193j6070m822K3597K5829P604p012l4447
$$ -6844 -1668 10812 26679 14712 -3665 -26858 -42928 -47750 -24153 1676 9280 2268 -32179
6503c2179m099K3637j5270l1179K0538K4932R657o522J2159J5940N159j9471N874
$$ -32179 -36278 -12641 -27911 -59090 -38552 -13620 -3963 -10485 1674 17614 22773 3302 9176
6490I176l205O624k3243k8863K3682L1704j817k0742k5126k6056M182R891P577
$$ 9176 5971 12595 -10648 -39511 -15829 15875 14058 -6684 -31810 -57866 -53684 -43793 -36216
6477c6216j2735K8329M7568j4348j1820J5567j6216K0853K814n824j1028O00J3881
$$ -36216 -48951 -20622 26946 12598 778 16345 129 20982 23796 17972 6944 7544 21425
6464B1425k0289q885r718j7266R20j8004o368r930K514K5605K8334K1412j0897
$$ 21425 1136 -7749 -17467 -34733 -33813 -51817 -58185 -68115 -65601 -39996 -11662 9750 -1147
6451a147k1177j1547j9350k0050J8212L684j6794k5700j4991K9438M0670K8187
$$ -1147 -22324 -33871 -53221 -73271 -55059 -51375 -68169 -93869 -108860 -79422 -38752 -10565
6439a0565M1858n997l4589j8628L251q622R384N4027J2256n0678j7270q550j3705
$$ -10565 31293 25296 -9293 -27921 -24670 -33292 -23908 30119 42375 -8303 -25573 -34123 -47828
6426d7828K8821L7463k7157j2509r80m511o276L626j2967J9971P360K943J4973
$$ -47828 -19007 18456 -8701 -21210 -22190 -26701 -32977 -29351 -42318 -22347 -14987 -12044 2929
6413B929r712m4820l277R084K0771R575o436O769O620k2016J6411K0171o723k6658
$$ 2929 -6783 -51603 -54880 -45796 -25025 -15450 -21886 -15117 -8497 -30513 -14102 6069 -654 -27312
6399b7312J8126l2999K660L8083L6380O282l1091M805J6255M431J943k8423k4969
$$ -27312 -9186 -42185 -39525 -1442 34938 41220 10129 14934 31189 35620 37563 9140 -15829
6386a5829P625k445k0694M997K6254l073j2628K0496J7332M390j9198l7266j4351
$$ -15829 -8204 -10649 -31343 -26346 -92 -3165 -15793 4703 22035 26425 7227 -30039 -44390
6373d4390J2474J1525L3471K5280r231k3549j5862K0907K000k5839K4325j39k6658
$$ -44390 -31916 -20391 13080 38360 29129 5580 -10282 10625 12625 -13214 11111 10972 -15686
6360a5686Q461k3799r421m528Q417J3228K33P777M4184n514k6119j5382J7892
$$ -15686 -7225 -31024 -40445 -44973 -36556 -23328 -23095 -15318 28866 23352 -2767 -18149 -257
6347b57J0772K825l5649J909O895L233M065N197r157k6564l4575J2533L8233j294
$$ -257 10515 13340 -22309 -20400 -13505 -10272 -6207 -1010 -10167 -36731 -71306 -58773 -20540 -21834
6333b1834J4397J68J2710K598m172L901j4619R88R621R293m1456l1351M4570L1126
$$ -21834 -7437 -7269 5441 8039 3867 7768 -6851 -5863 3758 13051 -28405 -59756 -15186 15940
6319A5940K2811k4980j4969k6795k0455L0754J6824J7443J275r373J4733k075
$$ 15940 38751 13771 -1198 -27993 -48448 -17694 -870 16573 17848 8475 23208 21133
6307B1133q02M227j1523j1153j0372J4473q99q636Q29n42n31J7298j2710j9395
$$ 21133 20331 24558 13035 1882 -8490 5983 5084 -3552 -2723 -3265 -3796 13502 792 -18603
6293a8603R997j3247O297J420j8145r935r617Q507L2610J6482o384j6164K413
$$ -18603 -8606 -21853 -15556 -14136 -32281 -42216 -51833 -43326 -10716 5766 -618 -16782 -14369
6280a4369j8122j0874P34K4320k6308j9321L7220k885l0166Q624J1453J7928j5907
$$ -14369 -32491 -43365 -42631 -18311 -44619 -63940 -26720 -29605 -59771 -51147 -39694 -21766 -37673
6267c7673j8588L0177L3667j483l1305k1696M771l065O411k989n154k0270K1595
$$ -37673 -56261 -26084 7583 6100 -25205 -46901 -42130 -45195 -38784 -41773 -46927 -67197 -45602
6254d5602J6591j2096l851K735J053k402L1245K4284l5226J635J2646j2317k3214
$$ -45602 -29011 -41107 -44958 -42223 -41170 -43572 -12327 11957 -23269 -21634 -8988 -21305 -44519
6241d4519n090J4426K640j9221j7876J6108K6482J5508O858K2755O116J5645n084
$$ -44519 -49609 -35183 -32543 -51764 -69640 -53532 -27050 -11542 -4684 18071 24187 39832 34748
6228C4748K302j4806j1259L7108k8366k0247k9478K1338Q289q570J0664J4637
$$ 34748 37050 22244 10985 48093 19727 -520 -29998 -8660 -371 -8941 1723 16360
6216A6360p240J5866p892O023J951M443k096k0004J1814Q920j9849j0268p494
$$ 16360 9120 24986 17094 23117 25068 29511 27415 7411 19225 28145 8296 -1972 -9466
6203i466l722J9943k5690j0803l38J5219M4279J570j9940k2252O951K1948k4342
$$ -9466 -13188 6755 -18935 -29738 -30076 -14857 29422 30992 11052 -11200 -4249 17699 -6643
6190f643j7486q568J1689k7355k0435P631L1603L8314j7347L897R55k0022j6306
$$ -6643 -24129 -32697 -21008 -48363 -68798 -61167 -29564 8750 -8597 -4700 -3745 -23767 -40073
6177d0073P585J3644J7547J9238j2066L234r608J2247j3258M800n289j6427J8210
$$ -40073 -32488 -18844 -1297 17941 5875 9109 -499 11748 -1510 3290 -1999 -18426 -216
6164b16J3069P447L7J3687j0434o3435k8464K1016M3766K3159m9076o73m361k7164
$$ -216 12853 20300 20337 34024 23590 -39845 -68309 -47293 -3527 19632 -29444 -30117 -34478 -61642
6150f1642K362K6635J3074o872L3356K704j5011J2191K1925j9367j7507J3551
$$ -61642 -59280 -32645 -19571 -26443 6913 9617 -5394 6797 28722 9355 -8152 5399
6138E399k1571k9236J1903R171J1538m276N210J8418n934M37j2081k0521q929
$$ 5399 -16172 -45408 -33505 -24334 -12796 -17072 -11862 6556 622 1059 -11022 -31543 -40472
6125d0472J9523L4508l173K3776O560l6467m637p585k0647j9999J4467J1433j6247
$$ -40472 -20949 13559 10386 34162 40722 4255 -382 -7967 -28614 -48613 -34146 -22713 -38960
6112c8960n144K1564Q528R259l664o830J0490r3n778O019p363J3701K3617J1145
$$ -38960 -44104 -22540 -14012 -4753 -8417 -15247 -4757 -4850 -10628 -4609 -11972 1729 25346 36491
6098C6491p331N212m519m2330r653K3129L64k3214q217M273J2537k1646r387K3293
$$ 36491 29160 34372 29853 -12477 -22130 999 1363 -21851 -30068 -25795 -13258 -34904 -44291 -20998
6084b0998J6774J8417K9587j8046k2992K256n135m3299k4564J9679M6397J905
$$ -20998 -4224 14193 43780 25734 2742 4998 -137 -43436 -68000 -48321 -1924 -19
6072a9R003J3011j6606j2237n595L0280J4032j0755q170p70p28q98j1423J2164
$$ -19 8984 21995 5389 -6848 -12443 17837 31869 21114 12944 12174 11446 10548 -875 11289
6058A1289K6678j0060j8716n448K1271J1783j9145m377j2813m1088J2364K8648
$$ 11289 37967 27907 9191 3743 25014 36797 17652 13275 462 -40626 -28262 386
6046C86J2586Q253J2983l507k3843j3840J2777j178J6167J9511r621l4049j8152
$$ 386 12972 21225 34208 30701 6858 -6982 5795 4617 20784 40295 30674 -3375 -21527
6033b1527j2244K5627J5088n823j1324N51k7618L4416N369N513k6338j7107J5993
$$ -21527 -33771 -8144 6944 1121 -10203 -9652 -37270 -2854 2515 8028 -18310 -35417 -19424
6020a9424q515J597L4089j1477k8610l4457Q428J7124J0371J8640q336m772l0055
$$ -19424 -27939 -26342 7747 -3730 -32340 -66797 -58369 -41245 -30874 -12234 -20570 -25342 -55397
6007e5397j4179L8228M0992K536J0870k8871J0808M0413J6924R907l515k9649
$$ -55397 -69576 -31348 9644 12180 23050 -5821 4987 45400 62324 72231 68716 39067
5995C9067k8210j1281J7279J0390Q228k8747J871R426j3400P044j3790l0470l794
$$ 39067 10857 -424 16855 27245 35473 6726 8597 18023 4623 11667 -2123 -32593 -36387
5982c6387J2684K012o065q136J3728L0469J6598n651P578k4280l2519M677n725
$$ -36387 -23703 -21691 -27756 -35892 -22164 8305 24903 19252 26830 2550 -29969 -25292 -31017
5969c1017J647J4523M858r815j7451o721J3738K2029j9182K4118M2052J3067j4926
$$ -31017 -29370 -14847 -9989 -19804 -37255 -43976 -30238 -8209 -27391 -3273 38779 51846 36920
5956C6920R08k831R406r426n080q8j2454K353m183J4595M280j5201k6113P124
$$ 36920 37828 34997 44403 34977 29897 29809 17355 19708 15525 30120 34400 19199 -6914 210
5942B10L2779p753m0635j6099J6044R488J0683n595j9621M489n027p929j8535
$$ 210 32989 25236 -15399 -31498 -15454 -5966 4717 -878 -20499 -16010 -21037 -28966 -47501
5929d7501r480J1448P632l0715q828R958N659N5468K8402J8401j7354l6321k2137
$$ -47501 -56981 -45533 -37901 -68616 -77444 -67486 -61827 -6359 22043 40444 23090 -13231 -35368
5916c5368J2885J5517k763o122L11j6542j0230J7887J8096L1580k9599l4941j3913
$$ -35368 -22483 -6966 -9729 -15851 -15540 -32082 -42312 -24425 -6329 25251 -4348 -39289 -53202
5903e3202j400L5296J0435p00k2663J3555K7714L9375K2835p729J870l8592j8832
$$ -53202 -54602 -19306 -8871 -9571 -32234 -18679 9035 48410 71245 63516 65386 26794 7962
5890G962k9273n776k602J3724L737K2950M820J5442K1430p200J0702j4085p221
$$ 7962 -21311 -27087 -29689 -15965 -12228 10722 15542 30984 52414 45214 55916 41831 34610
5877C4610m579J6975j2050j2438r260m297j2969L500M174J586k029q987J7683
$$ 34610 30031 47006 34956 22518 13258 8961 -4008 -508 3666 5252 3223 -5764 11919
5864A1919K772m3789j0153L00L5378K2314r663k6852j3299J6815K1400l9224J622
$$ 11919 14691 -29098 -39251 -38951 -3573 18741 9078 -17774 -31073 -14258 7142 -32082 -30460
5851c0460J9784k5703r138O800J2730L298k6799n798M2948M1507r482j9785j3810
$$ -30460 -10676 -36379 -45517 -38717 -25987 -22689 -49488 -55286 -12338 29169 19687 -98 -13908
5838a3908R273m080j5124P006O614K7721K361m42p878P220N934r17j2098J3456
$$ -13908 -4635 -8715 -23839 -16833 -10219 17502 19863 19421 11543 18763 24697 23780 11682 25138
5824B5138L6939P94l8324k0175k5270m3118r042M2197K9402K0564L205q839K3665
$$ 25138 62077 62871 24547 4372 -20898 -64016 -73058 -30861 -1459 19105 22310 13471 37136
5811C7136l665P934l5830k3670J9066j0649m982j8787M467Q902L6976j2k9454
$$ 37136 33471 41405 5575 -18095 971 -9678 -14660 -33447 -28980 -20078 16898 16886 -12568
5798a2568k2390O862K6273Q856j8823J7717j2972j1521k0774j3678Q405L453K7394
$$ -12568 -34958 -28096 -1823 7033 -11790 5927 -7045 -18566 -39340 -53018 -44613 -41160 -13766
5785a3766M461J958L2037j1065n666J1449J8677j1838K2026l7150m5109J703m072
$$ -13766 -9305 -7347 24690 13625 7959 19408 38085 26247 48273 11123 -33986 -32283 -36355
5772c6355O97K7342K331j1316j1948J0226K3484K093N173k3175n0664n148J8337
$$ -36355 -35658 -8316 -5985 -17301 -29249 -19023 4461 6554 11727 -11448 -62112 -67260 -48923
5759d8923k753L3978J7245j1816j8073N1L8364P14j2380j1048Q296K0006j0173
$$ -48923 -51676 -17698 -453 -12269 -30342 -30291 8073 8787 -3593 -14641 -6345 13661 3488
5746C488j2538M395J0387K0153K9657l1847n8782j6873J9861K7273J3975J444
$$ 3488 -9050 -4655 5732 25885 55542 23695 -35087 -51960 -32099 -4826 9149 10593
5734A0593j1986J1606j5536k774j4826k637J9461J1307q435j6374Q470R455P807
$$ 10593 -1393 10213 -5323 -8097 -22923 -25560 -6099 5208 -3227 -19601 -11131 -1676 6131
5721F131J0322m889l1675J3091K2939K2940M332n3782j1555L0177l3114q960J5686
$$ 6131 16453 11564 -20111 -7020 15919 38859 43191 -10591 -22146 8031 -25083 -34043 -18357
5708a8357L0696J2516J2880j2602j2428k2242k3169J3844M655p639l6308p396
$$ -18357 12339 24855 37735 25133 12705 -9537 -32706 -18862 -14207 -21846 -58154 -65550
5696f5550r48r572k1514l219J8189K6013K8842Q545J1712K4309L240M189M1923
$$ -65550 -66498 -76070 -97584 -100803 -82614 -56601 -27759 -19214 -7502 16807 20047 24236 66159
5683F6159K4064m7384k7569J0195l588j9107j6599J9086L2867K2995P102l7855
$$ 66159 90223 42839 15270 25465 21877 2770 -13829 5257 38124 61119 68221 30366
5671C0366l9028j9736p970l730L8712K0035j4863o430j6182K4279j7190J640j5195
$$ 30366 -8662 -28398 -36368 -40098 -1386 18649 3786 -2644 -18826 5453 -11737 -10097 -25292
5658b5292R111J3317j5360J7553K5581j2710j7161r734J2553j4881j9566R726
$$ -25292 -16181 -2864 -18224 -671 24910 12200 -4961 -14695 -2142 -17023 -36589 -26863
5646b6863K0267N290L0806J3854N814M125l2980m960n682j9997k3254K4497L4131
$$ -26863 -6596 -1306 29500 43354 49168 53293 20313 15353 9671 -10326 -33580 -9083 25048
5633B5048o696j227j1559o439j2024j4762K8614J7628k4487k906j6060J8435p917
$$ 25048 18352 17125 5566 -873 -12897 -27659 955 18583 -5904 -8810 -24870 -6435 -14352
5620a4352j4145o106j08J1454k1825q037K0434j509J9673m218K5918J2847j3429
$$ -14352 -28497 -34603 -34711 -23257 -45082 -53119 -32685 -34194 -14521 -18739 7179 20026 6597
5607F597Q367L7429m04k863n022l0278K2192Q13k2862j0909J2192K5125j5128
$$ 6597 14964 52393 51989 49126 44104 13826 36018 36831 13969 3060 15252 40377 25249
5594B5249j7767J8437L2734j6881k7006l5167n218P786j8283m637m68J9325K9215
$$ 25249 7482 25919 58653 41772 14766 -20401 -25619 -17833 -36116 -40753 -41221 -21896 7319
5581G319J0880m657Q40J9657K1447o757n4827r216J9273M580j9754p640J5913
$$ 7319 18199 13542 14382 34039 55486 48729 -6098 -15314 3959 8539 -11215 -18855 -2942
5568b942J9892j1642k3679o071k520K765K3003K0739n351p466m700N833K1574
$$ -2942 16950 5308 -18371 -24442 -26962 -24197 -1194 19545 14194 6728 2028 7861 29435
5555B9435M984j7200N88j2288J7032r056l0051J7068J0935l960k0730Q692q801
$$ 29435 34419 17219 17807 5519 22551 13495 -16556 512 11447 7487 -13243 -4551 -13352
5542a3352n792J9572M4J5969k2680Q29K737N98L1447M359j1257J4972J8047J4140
$$ -13352 -19144 428 472 16441 -6239 -5410 -2673 -2075 29372 33731 22474 37446 55493 69633
5528F9633m1833n0687J3816L1537l693j9914k618k2201k7092K9972K5267q567
$$ 69633 27800 -22887 -9071 22466 18773 -1141 -3759 -25960 -53052 -23080 2187 -6380
5516f380J7009j4789k2621r869K7712J8813l5285j8303K3718L407L436K7508J2784
$$ -6380 10629 -4160 -26781 -36650 -8938 9875 -25410 -43713 -19995 -16588 -13152 14356 27140
5503B7140K753N06o834k210k0138j9589j0316J7469l8366J2783J9222L0940J3190
$$ 27140 29893 30399 23565 21355 1217 -18372 -28688 -11219 -49585 -36802 -17580 13360 26550
5490B6550l5512R631L6047k8339l1176L0210K3155j2010p637L977P92m7870o207
$$ 26550 -8962 669 36716 8377 -22799 7411 30566 18556 10919 14896 15688 -32182 -38389
5477c8389L252J3617j0734j1295L0779J1992j5499l253L3327k0778o230l0074
$$ -38389 -35137 -21520 -32254 -43549 -12770 -778 -16277 -19530 13797 -6981 -13211 -43285
5465d3285N949j585K2799Q19j0456J7208K6616K2620M153n728l4876j1573j8917
$$ -43285 -37336 -38921 -16122 -15303 -25759 -8551 18065 40685 44838 39110 4234 -7339 -26256
5452b6256K0027M1949J4110l7424j5291q617K923o994L2951K2722k9436k4863
$$ -26256 -6229 35720 49830 12406 -2885 -11502 -8579 -15573 17378 40100 10664 -14199
5440a4199j657N993K1954P945L036P029J8067p574M161q458p440l1290l4870q659
$$ -14199 -15856 -9863 12091 20036 23072 30101 48168 40594 44755 36297 28857 -2433 -37303 -45962
5426d5962j0253k3218K770L8472Q682J8285r210L2235J9745k9168L030P140j6571
$$ -45962 -56215 -79433 -76663 -38191 -29509 -11224 -20434 11801 31546 2378 5408 12548 -4023
5413d023j6330N129M395k471K4353Q816j6366k7569k479Q852J4820j0501k7120
$$ -4023 -20353 -15224 -10829 -13300 11053 19869 3503 -24066 -26545 -17693 -2873 -13374 -40494
5400d0494k4562K3620K6938J4872j2174L363M0578M716j0696r151O825j9073r159
$$ -40494 -65056 -41436 -14498 374 -11800 -8437 32141 36857 26161 17010 23835 4762 -4397
5387d397l998o016q609p96K1866n44K829k0122m18k3019o276m593K715l889K6400
$$ -4397 -8395 -14411 -23020 -23816 -1950 -2494 335 -19787 -20205 -43224 -49500 -54093 -51378 -55267 -28867
5372b8867j79j4518J9215K5718J677J916j3671k4355K4997L2898j1571k3150j6755
$$ -28867 -29046 -43564 -24349 1369 3046 4962 -8709 -33064 -8067 24831 13260 -9890 -26645
5359b6645j8510M3336M6915k7439p819j8752M795L4554k7260L72l978j1535O52
$$ -26645 -45155 -1819 45096 17657 9838 -8914 -4119 30435 3175 3547 -431 -11966 -11314
5346a1314j3687j5268J4866j6885J0361M710N797J8573n161K2690j2511r003J2674
$$ -11314 -25001 -40269 -25403 -42288 -31927 -27217 -21420 -2847 -8008 14682 2171 -6832 5842
5333E842M881l760j812j4624k205n709N434J1216K1967j7744j9355j599R378J799
$$ 5842 10723 6963 5151 -9473 -11678 -17387 -11953 -737 21230 3486 -15869 -17468 -8090 -6291
5319f291J2288k458M465J3351Q619j7304q925L0833l4302k4499K8409m031m987
$$ -6291 5997 3539 8004 21355 29974 12670 3745 34578 276 -24223 4186 155 -4832
5306d832j8465K2510q896k057j413r703l593P466J4470k3911j6281L4595K0627
$$ -4832 -23297 -787 -9683 -11740 -13153 -22856 -26449 -18983 -4513 -28424 -44705 -10110 10517
5293A0517j806l7250j8589j557M810L734K4324j0831N566J2450j5497l5772J193
$$ 10517 8711 -28539 -47128 -48685 -43875 -40141 -15817 -26648 -21082 -8632 -24129 -59901 -58708
5280e8708N907M315m992q036R896K1953n592N05J6445J3790l370j9835q188j2534
$$ -58708 -52801 -48486 -53478 -61514 -51618 -29665 -35257 -34752 -18307 -4517 -7887 -27722 -35910 -48444
5266d8444q413M3967L143N890j127o476K982k2294J9429J2129q934J1262L5810
$$ -48444 -56857 -12890 -9747 -3857 -4984 -11460 -8478 -30772 -11343 786 -8148 3114 38924
5253C8924J5180l9872n657k588l9384J0442J2404O831j003m467k4432J5475j4950
$$ 38924 54104 14232 8575 5987 -33397 -22955 -10551 -3720 -4723 -9190 -33622 -18147 -33097
5240c3097o202K7640r940k1694K3581O999k2483R329Q932O20p591k831J5217J4124
$$ -33097 -39299 -11659 -21599 -43293 -19712 -12713 -35196 -25867 -16935 -16315 -23906 -26737 -11520 2604
5226B604q347j4320O842J7407L7182k0984k9179o344k980Q596L214q204k4446
$$ 2604 -5743 -20063 -13221 4186 41368 20384 -8795 -15139 -18119 -9523 -6309 -14513 -38959
5213c8959k3422J6610R129Q446k1557k1935j2688J3923O60r99K1330K3589j6654
$$ -38959 -62381 -45771 -36642 -28196 -49753 -71688 -84376 -70453 -69793 -70792 -49462 -25873 -42527
5200d2527j6541J5493M786K3321K4199q83m103K2743n422m084k4556r445K2601
$$ -42527 -59068 -43575 -38789 -15468 8731 7848 3745 26488 21066 16982 -7574 -17019 5582
5187E582J8742k1453J1611l871Q440M046J3230l9313K66J5267o954o139o512n859
$$ 5582 24324 2871 14482 10611 19051 23097 36327 -2986 -2720 12547 5593 -546 -7058 -12917
5173a2917j1330j5214j4614Q613L1472j9612q520L4360J3320j3952j6470j5798
$$ -12917 -24247 -39461 -54075 -45462 -13990 -33602 -42122 -7762 5558 -8394 -24864 -40662
5161d0662L042L0115Q166j0702K3690K439k9415l2965L3904N294k6708P985j9247
$$ -40662 -37620 -7505 661 -10041 13649 16088 -13327 -46292 -12388 -7094 -33802 -25817 -45064
5148d5064L116L1919L189r703l0457j8405Q202M429K997O182K463J3563J8654
$$ -45064 -41948 -10029 -6840 -16543 -47000 -65405 -57203 -52774 -49777 -43595 -41132 -27569 -8915
5135h915J9669j1330L126p459L267m784J4828J0750j2749j7978n136m72l625K1102
$$ -8915 10754 -576 2550 -4909 -1642 -6426 8402 19152 6403 -11575 -16711 -17183 -20808 294
5121B94L0640j6058K7389K2402k8684l7392j9811k7192J3025o12L3997M1054P886
$$ 294 30934 14876 42265 64667 35983 -1409 -21220 -48412 -35387 -35999 -2002 39052 46938
5108D6938J0353k655r060l2786l5400q91j480N663K7889N226q812J2358J3216
$$ 46938 57291 54636 45576 12790 -22610 -23501 -24981 -19318 8571 13797 4985 17343 30559
$$ [...]
##END NTUPLES=NMR SPECTRUM
##END=
