##TITLE=Analysis number 318294
Compound Code mo 00889
Project Code adrs
Chemist Name ugmt
##JCAMPDX= 6.0         $$ Bruker NMR JCAMP-DX V2.0
##DATA TYPE= NMR SPECTRUM
##DATA CLASS= NTUPLES
##ORIGIN= Bruker BioSpin GmbH
##OWNER= nmr
$$ XWIN-NMR		Version 3.5
$$ Wed Mar 22 16:10:49 2006 GMT Standard Time (UT+0h)  MAYBRIDGE\nmr@NMR_250MHZ
##.OBSERVE FREQUENCY= 250.131544655141
##.OBSERVE NUCLEUS= ^1H
##.ACQUISITION MODE= SIMULTANEOUS (DQD)
##.ACQUISITION SCHEME= undefined
##.AVERAGES= 16
##.DIGITISER RES= 18
##SPECTROMETER/DATA SYSTEM= dpx250
##.PULSE SEQUENCE= zg30
##.SOLVENT NAME= CDCl3
##.SHIFT REFERENCE= (INTERNAL, CDCl3, 0, 16.522)
##AUDIT TRAIL= $$ (NUMBER, WHEN, WHO, WHERE, WHAT)
$$ ##TITLE= Audit trail, XWIN-NMR		Version 3.5
$$ ##JCAMPDX= 5.01
$$ ##ORIGIN= Bruker BioSpin GmbH
$$ ##OWNER= nmr
$$ C:\u/data/dgb/nmr/ADRS/1240/pdata/1/auditp.txt
$$ ##AUDIT TRAIL=  $$ (NUMBER, WHEN, WHO, WHERE, WHAT)
(   1,<2006-03-22 16:09:56.41 +000>,<MAYBRIDGE\nmr>,<NMR_250MHZ>,
      <created by zg, POWCHK disabled, PULCHK disabled
       configuration hash MD5:
       84 BC 41 DB A1 6E 1D 46 DA 25 12 A5 C1 ED C5 3A
       data hash MD5: 64K
       B7 B1 5C 4E 3D 7B F6 50 CA 0B 8A 2E 0A DF BB 4D>)
(   2,<2006-03-22 16:10:16.76 +000>,<MAYBRIDGE\nmr>,<NMR_250MHZ>,
      <Start of raw data processing
       ef LB = 0.3 FT_mod = 6 PKNL = 1 SI = 32K 
       data hash MD5: 32K
       AE 10 D2 A0 97 E1 35 3F F1 04 46 BB 41 62 A2 6E>)
(   3,<2006-03-22 16:10:28.41 +000>,<MAYBRIDGE\nmr>,<NMR_250MHZ>,
      <apk 
       data hash MD5: 32K
       21 91 D7 5F E3 64 6E 5B 0B EE BF FC 85 60 F1 91>)
(   4,<2006-03-22 16:10:32.01 +000>,<MAYBRIDGE\nmr>,<NMR_250MHZ>,
      <abs ABSG = 5 
       data hash MD5: 32K
       60 26 AA 04 3B 1E 4D 1B 92 BB 80 7E A0 E2 BF 7B>)
$$ ##END=
$$ 
$$ hash MD5
$$ 98 BB 4A 1F E4 E8 D6 8B 6C 03 BD 9B 63 F9 0F 0B
##$RELAX= 
##$RELAX= 
##$RELAX= 
##$RELAX= 
##$RELAX= 
##$RELAX= 
##$RELAX= 
$$ Bruker specific parameters
$$ --------------------------
##$DU= <C:\u>
##$EXPNO= 1240
##$NAME= <ADRS>
##$PROCNO= 1
##$TYPE= <nmr>
##$USER= <dgb>
##$AMP= (0..31)
100 100 100 100 100 100 100 100 100 100 100 100 100 100 100 100 100 100 
100 100 100 100 100 100 100 100 100 100 100 100 100 100 
##$AQSEQ= 0
##$AQ_mod= 3
##$AUNM= <au_zg>
##$AUTOPOS= <52 >
##$BF1= 250.13
##$BF2= 250.13
##$BF3= 250.13
##$BF4= 250.13
##$BF5= 500.13
##$BF6= 500.13
##$BF7= 500.13
##$BF8= 500.13
##$BYTORDA= 1
##$CFDGTYP= 0
##$CFRGTYP= 5
##$CHEMSTR= <none>
##$CNST= (0..31)
1 1 145 1 1 1 1 1 1 1 1 1 1 1 1 1 1 1 1 1 1 1 1 1 1 1 1 1 1 1 1 1 
##$CPDPRG= <>
##$CPDPRG1= <>
##$CPDPRG2= <>
##$CPDPRG3= <>
##$CPDPRG4= <mlev>
##$CPDPRG5= <mlev>
##$CPDPRG6= <mlev>
##$CPDPRG7= <mlev>
##$CPDPRG8= <mlev>
##$CPDPRGB= <>
##$CPDPRGT= <>
##$D= (0..31)
0 1 0 0 0 0 0 0 0 0.06 0 0 0 0 0 0 0.0002 0 0 0 0 0 0 0 0 0 0 0 0 0 0 
0 
##$DATE= 1143043793
##$DBL= (0..7)
120 120 120 120 120 120 120 120 
##$DBP= (0..7)
150 150 150 150 150 150 150 150 
##$DBP07= 0
##$DBPNAM0= <>
##$DBPNAM1= <>
##$DBPNAM2= <>
##$DBPNAM3= <>
$$ [...]
##$SUBNAM7= <"">
##$SUBNAM8= <"">
##$SUBNAM9= <"">
##$SW= 20.6930455092707
##$SWIBOX= (0..15)
0 0 3 0 0 0 0 0 0 0 0 0 0 0 0 0 
##$SW_h= 5175.983436853
##$TD= 65536
##$TD0= 1
##$TE= 294.16
##$TE2= 300
##$TE3= 300
##$TEG= 300
##$TL= (0..7)
0 120 120 120 120 120 120 120 
##$TP= (0..7)
150 150 150 150 150 150 150 150 
##$TP07= 0
##$TPNAME0= <>
##$TPNAME1= <>
##$TPNAME2= <>
##$TPNAME3= <>
##$TPNAME4= <>
##$TPNAME5= <>
##$TPNAME6= <>
##$TPNAME7= <>
##$TPOAL= (0..7)
0.5 0.5 0.5 0.5 0.5 0.5 0.5 0.5 
##$TPOFFS= (0..7)
0 0 0 0 0 0 0 0 
##$TUNHIN= 0
##$TUNHOUT= 0
##$TUNXOUT= 0
##$USERA1= <user>
##$USERA2= <user>
##$USERA3= <user>
##$USERA4= <user>
##$USERA5= <user>
##$V9= 5
##$VALIST= <valist>
##$VCLIST= <CCCCCCCCCCCCCCC>
##$VD= 0
##$VDLIST= <DDDDDDDDDDDDDDD>
##$VPLIST= <PPPPPPPPPPPPPPP>
##$VTLIST= <TTTTTTTTTTTTTTT>
##$WBST= 1024
##$WBSW= 4
##$XGAIN= (0..3)
0 0 0 0 
##$XL= 0
##$YL= 0
##$YMAX_a= 425975
##$YMIN_a= -351640
##$ZGOPTNS= <>
##$ZL1= 120
##$ZL2= 120
##$ZL3= 120
##$ZL4= 120
##$ABSF1= 16.522
##$ABSF2= -4.171173
##$ABSG= 5
##$ABSL= 3
##$ALPHA= 0
##$AQORDER= 0
##$ASSFAC= 0
##$ASSFACI= 0
##$ASSFACX= 0
##$ASSWID= 0
##$AUNMP= <proc_1d>
##$AZFE= 0.1
##$AZFW= 0.1
##$BCFW= 0
##$BC_mod= 0
##$BYTORDP= 0
##$COROFFS= 0
##$CY= 12.5
##$DATMOD= 1
##$DC= 0
##$DFILT= <>
##$DTYPP= 0
##$F1P= 14.0000005364418
##$F2P= -0.99999901652339
##$FCOR= 0.5
##$FTSIZE= 32768
##$FT_mod= 6
##$GAMMA= 0
##$GB= 0
##$INTBC= 1
##$INTSCL= 1
##$ISEN= 128
##$LB= 0.3
##$LEV0= 0
##$LPBIN= 0
##$MAXI= 10000
##$MC2= 0
##$MEAN= 0
##$ME_mod= 0
##$MI= 0
##$NCOEF= 0
##$NC_proc= -3
##$NLEV= 6
##$NOISF1= 0
##$NOISF2= 0
##$NSP= 0
##$NTH_PI= 0
##$NZP= 0
##$OFFSET= 16.522
##$PC= 1
##$PHC0= 21.37173
##$PHC1= 4.966161
##$PH_mod= 1
##$PKNL= yes
##$PPARMOD= 0
##$PSCAL= 4
##$PSIGN= 0
##$REVERSE= no
##$SF= 250.13
##$SI= 32768
##$SIGF1= 0
##$SIGF2= 0
##$SINO= 400
##$SIOLD= 32768
##$SREGLST= <1H.CDCl3>
##$SSB= 0
##$STSI= 32768
##$STSR= 0
##$SW_p= 5175.98343685301
##$SYMM= 0
##$S_DEV= 0
##$TDeff= 65536
##$TDoff= 0
##$TI= <Analysis number 999999
Compound Code 99
Book Reference 9
Project Code 9>
##$TILT= no
##$TM1= 0
##$TM2= 0
##$TOPLEV= 0
##$USERP1= <user>
##$USERP2= <user>
##$USERP3= <user>
##$USERP4= <user>
##$USERP5= <user>
##$WDW= 1
##$XDIM= 32768
##$YMAX_p= 326651967
##$YMIN_p= -666194
$$ End of Bruker specific parameters
$$ ---------------------------------
##NTUPLES= NMR SPECTRUM
##VAR_NAME=  FREQUENCY,     SPECTRUM/REAL,   SPECTRUM/IMAG
##SYMBOL=    X,             R,               I
##VAR_TYPE=  INDEPENDENT,   DEPENDENT,       DEPENDENT
##VAR_FORM=  AFFN,          ASDF,            ASDF
##VAR_DIM=   32768,         32768,           32768
##UNITS=     HZ,            ARBITRARY UNITS, ARBITRARY UNITS
##FACTOR=    0.157963299565203, 1,           1
##FIRST=     4132.6476996994, 0,             0
##LAST=      -1043.33573715361, 0,           0
##MIN=       -1043.33573715361, -666194,     0
##MAX=       4132.6476996994, 326651967,     0
$$ Real data points
##PAGE= N=1
##DATA TABLE= (X++(R..R)), XYDATA
$$ [...]
$$ plain form
17120 25914 26878 22126 21289 26793 28587 27358 24633 17412 13380 10864 12405 13043 15037 16531 15288
17105 15288 17619 18385 17348 16058 14170 20186 21785 18729 20646 24128 20414 13021 8489 11275 12020
17090 12020 16958 17335 12272 9841 9598 9281 6794 7451 7234 8092 10009 14892 15735 14789 16324 13063
17074 13063 13253 15622 19341 19496 16015 11387 9594 8663 5842 3426 2070 8146 9141 11039 10899 10852
17058 10852 8546 6654 3477 4798 5106 4900 7262 6041 10144 14439 12634 12138 16366 18476 16617
17043 16617 13162 11897 10057 11367 7680 4163 5885 8674 10784 12111 6391 -898 -570 1172 5880
17028 5880 10347 12094 12793 14072 12263 7849 6943 3153 533 4048 6297 9681 8818 7328 4009
17013 4009 7238 12149 15424 14744 12755 11657 12434 18446 20019 17346 14941 16488 21135 25296 33929
$$ packed form
17120B5914R64m752q37N504J794j229k725p221m032k516J541O38J994J494j243
17105A5288K331P66j037j290j888O016J599l056J917L482l714p393m532K786P45
17090A2020M938L77n063k431k43l17k487O57k17Q58J917M883Q43r46J535l261
17074A3063J90K369L719J55l481m628j793r31k821k416j356O076R95J898j40m7
17058A0852k306j892l177J321L08k06K362j221M103M295j805m96M228K110j859
17043A6617l455j265j840J310l687l517J722K789K110J327n720p289L28J742M708
17028E880M467J747O99J279j809m414r06l790k620L515K249L384q63j490l319
17013D009L229M911L275o80j989j098P77O012J573k673k405J547M647M161Q633
$$ plain form
16998 33929 41841 42944 46416 50103 50413 52152 57086 65417 85537 114104 142826 170028 193120
16985 193120 206288 206044 203007 202473 204496 202792 192391 174204 159408 145381 141134 151097 166421
16972 166421 187909 215096 231627 239707 226463 199876 168948 141103 120443 104255 96024 90588
16960 90588 87803 81783 77878 78035 82026 84766 86907 89899 91161 87295 80132 72997 62285 55024
16946 55024 56222 53410 52181 53837 64092 77231 91007 105565 126345 148870 168394 186047
16934 186047 198140 200206 204808 209270 214360 210444 194876 174457 150423 127675 107749 97153
16922 97153 93556 95347 97249 103390 111838 124000 134947 157349 181078 199864 208059 208964 197560
16909 197560 173500 148647 121229 97679 81593 74045 67924 60467 51745 51170 50089 44467 39661
$$ packed form
16998C3929P912J103L472L687L10J739M934Q331K0120K8567K8722K7202K3092
16985A93120J3168k44l037n34K023j704j0401j8187j4796j4027m247R963J5324
16972A66421K1488K7187J6531Q080j3244k6587l0928k7845k0660j6188q231n436
16960I0588k785o020l905J57L991K740K141K992J262l866p163p135j0712p261
16946E5024J198k812j229J656J0255J3139J3776J4558K0780K2525J9524J7653
16934A86047J2093K066M602M462N090l916j5568k0419k4034k2748j9926j0596
16922I7153l597J791J902O141Q448J2162J0947K2402K3729J8786Q195R05j1404
16909A97560k4060k4853k7418k3550j6086p548o121p457q722n75j081n622m806
$$ plain form
16896 39661 37928 34817 28764 27989 28501 27693 24461 21946 23745 23068 20459 24145 26438 19625 12301
16881 12301 14529 11905 5455 -909 6884 20878 29090 21457 212 -21024 -24970 -16480 -12071 -6276
16867 -6276 3917 14820 28783 25722 9552 -2181 -875 5200 7137 8530 10113 11357 12883
16854 12883 12367 13035 12970 13420 10789 5643 3903 4803 6999 8930 10268 10205 9753 9007 10613 11546 4694
16837 4694 -915 -2900 -4101 -928 1099 1120 1790 1835 4692 6443 2189 117 1828 -636 -4462 -3029
16821 -3029 -5532 -5763 -1530 2989 5488 8218 8449 3152 281 -241 -592 -563 -2759 -1914 -587 -1170 -331
16804 -331 -937 -930 -1502 -2764 -4210 -5318 -3664 -5549 -8621 -8183 -6016 -3139 -1959 -386 224 -1771 -1840
16787 -1840 4901 1395 1730 3651 2282 -2043 -1648 483 3075 3139 2781 2744 840 -2244 -1624 -1136 478
$$ packed form
16896C9661j733l111o053p75N12q08l232k515J799o77k609L686K293o813p324
16881A2301K228k624o450o364P793J3994Q212p633k1245k1236l946Q490M409N795
16867f276J0193J0903J3963l061j6170j1733J306O075J937J393J583J244J526
16854A2883n16O68o5M50k631n146j740R00K196J931J338o3m52p46J606R33o852
16837D694n609j985j201L173K027K1O70M5K857J751m254k072J711k464l826J433
16821c029k503k31M233M519K499K730K31n297k871n22l51K9k196Q45J327n83Q39
16804c31o06Pn72j262j446j108J654j885l072M38K167K877J180J573O10j995o9
16787a840O741l506L35J921j369m325L95K131K592O4l58l7j904l084O20M88J614
$$ plain form
16770 478 -951 -70 403 2127 -620 1918 2634 1265 1564 -1193 -5373 -7184 -4220 -3557 -1852 -1817 -4362
16753 -4362 -3781 1527 4769 7176 8567 5343 1109 -967 -984 2792 5545 4642 2841 1231 2982 2872
16737 2872 210 1919 401 -2972 -3881 -6214 -3810 -585 0 -2459 382 2603 192 2378 2848
16722 2848 2830 -454 -2871 -3902 -2490 3198 6832 8105 3893 2594 1490 931 -72 993 -316
16707 -316 763 3029 2336 -441 -1820 -5786 -8843 -8690 -8911 -12995 -17289 -22529 -28598 -28526 -24564 -22263
16691 -22263 -21354 -18097 -13236 -8003 552 5558 7014 3397 1807 6124 6339 4215 4866 4867 694 -3028
16675 -3028 -6471 -7899 -9116 -4071 -2933 -685 3686 4960 4198 1616 -5989 -4620 -1534 -1824 -1263
16660 -1263 -1099 -4585 -1982 -2614 -7734 -8993 -6563 -8498 -7757 -2742 -2778 -1315 -580 1134 718 -2587
$$ packed form
16770D78j429Q81M73J724k747K538P16j369K99k757m180j811K964O63J705L5k545
16753d362N81N308L242K407J391l224m234k076j7L776K753r03j801j610J751j10
16737B872k662J709j518l373r09k333K404L225N85k459K841K221k411K186M70
16722B848j8l284k417j031J412N688L634J273m212j299j104n59j003J065j309
16707c16J079K266o93k777j379l966l057J53k21m084m294n240o069P2L962K301
16691b2263R09L257M861N233Q555N006J456l617j590M317K15k124O51Jm173l722
16675c028l443j428j217N045J138K248M371J274p62k582p605J369L086k90N61
16660a263J64l486K603o32n120j259K430j935P41N015l6J463P35J714m16l305
$$ plain form
16644 -2587 -617 -1268 -1383 323 1562 1614 3472 2116 626 2343 1655 -3541 -8961 -13284 -14796 -15453
16628 -15453 -9626 -5120 -5751 -5788 -5490 -6962 -7239 -5729 -6253 -3795 -1054 1161 1949 2974 -242 -8049
16612 -8049 -7905 -7953 -4776 -3145 -3712 -2129 1849 1807 -907 -6193 -8179 -6941 -7128 -8095 -9628 -11363 -8255
16595 -8255 -6746 -4163 -4255 -5253 -7868 -3868 432 980 3959 824 -2102 -5638 -5629 -4407 -491 2004
16579 2004 -900 1424 4319 5738 5212 4714 5513 1787 -4434 -4583 -8128 -4309 -16 -2231 -1943 -3496
16563 -3496 -5229 318 2777 2990 3776 3159 2134 -314 779 989 -2953 -7651 -7192 -6083 -7870 -7788
16547 -7788 -5118 -6710 -11363 -9340 -7669 -6787 -9428 -11840 -8264 -5089 -7925 -6782 -3564 -5173 -8656
16532 -8656 -6911 -6010 -3383 -1838 -327 2184 3068 -2544 -3765 -3906 -4623 -7470 -9679 -13500 -19825 -16464
$$ packed form
16644b587J970o51j15J706J239N2J858j356j490J717o88n196n420m323j512o57
16628a5453N827M506o31l7K98j472k77J510n24K458K741K215P88J025l216p807
16612h049J44m8L177J631n67J583L978m2k714n286j986J238j87r67j533j735L108
16595h255J509K583r2r98k615M000M300N48K979l135k926l536RJ222L916K495
16579B004k904K324K895J419n26m98P99l726o221j49l545L819M293k215K88j553
16563c496j733N547K459K13P86o17j025k448J093K10l942m698M59J109j787Q2
16547g788K670j592m653K023J671Q82k641k412L576L175k836J143L218j609l483
16532h656J745R01K627J545J511K511Q84n612j221j41p17k847k209l821o325L361
$$ plain form
16516 -16464 -13683 -11626 -7289 -6563 -3754 -1499 -3187 -666 -1879 -3666 -3769 -3734 -5377 -6897 -5400
16501 -5400 -3081 1870 2308 422 -5074 -9373 -9258 -6706 -9462 -13015 -8803 -7051 -8955 -9476 -11145
16486 -11145 -11158 -7856 -2295 -1639 -4106 -11144 -10657 -4331 -3009 -7059 -6860 -9993 -11896 -7441 -680 -355
16470 -355 -102 -2490 -2491 -3890 -5008 -6572 -6433 -1367 -1536 -1013 -3095 -2740 409 -1547 -5622 -5063 -2294
16453 -2294 -4330 -4265 -6277 -9000 -9873 -8368 -8094 -7886 -2492 -442 1562 864 -2343 -2990 -4334 -3148
16437 -3148 -2615 -2342 -3438 -809 -1412 -1878 -1044 951 -643 -2866 -3981 -3888 -1778 -3995 -8300 -7004
16421 -7004 -3337 -2873 -3338 -4338 -1385 -5646 -6595 -1360 -2276 -8676 -6869 -5641 -5512 -2765 -865 -1293
16405 -1293 -2837 -7031 -8834 -9070 -10481 -10894 -10048 -10960 -11925 -12812 -9644 -8063 -8037 -13638 -12065 -7796 -8047
$$ packed form
16516a6464K781K057M337P26K809K255j688K521j213j787j03L5j643j520J497
16501e400K319M951M38j886n496m299J15K552k756l553M212J752j904n21j669
16486a1145j3L302N561O56k467p038M87O326J322m050J99l133j903M455O761L25
16470c55K53k388jj399j118j564J39N066j69N23k082L55L149j956m075N59K769
16453b294k036O5k012k723q73J505K74K08N394K050K004o98l207o47j344J186
16437c148N33K73j096K629o03m66Q34J995j594k223j115R3K110k217m305J296
16421g004L667M64m65j000K953m261r49N235r16o400J807J228J29K747J900m28
16405a293j544m194j803k36j411m13Q46r12r65q87L168J581K6n601J573M269k51
$$ plain form
16388 -8047 -10711 -8141 -8814 -6799 -8637 -7123 -7871 -11441 -10458 -9116 -6346 -1556 -1143 -3528 -4097 -3369
16372 -3369 -3865 -9285 -9848 -9175 -7428 -11143 -14224 -12912 -13256 -13978 -8414 -3483 -6153 -1712 641 1384
16356 1384 -1485 -1014 -3510 -2813 626 2945 1243 -1025 -1576 -6128 -5682 -3217 1446 2815 230 -1540
16340 -1540 -2567 -2343 709 3349 4382 3323 2188 4855 2751 216 -5260 -7523 -4366 1069 36
16325 36 439 -879 -1793 -3015 -5294 -7639 -7668 -2935 1800 2397 3884 2558 -2353 -4691 1265 1288 -4594
16308 -4594 -8031 -7343 -5335 -4592 -6200 -6740 -7864 -6431 -3422 -2999 -5515 -10568 -14757 -13372 -10230 -12006
16292 -12006 -9820 -6327 -3867 -3657 -3250 -6085 -5207 -2608 -4426 -4571 -965 468 -3448 -4774 -4599 -2102
16276 -2102 -3613 -5869 -5655 -3515 -1285 -808 1602 2731 846 -2623 -3540 -3290 -4643 -5884 -3838 -2544
$$ packed form
16388h047k664K570o73K015j838J514p48l570R83J342K770M790M13k385n69P28
16372c369m96n420n63O73J747l715l081J312l44p22N564M931k670M441K353P43
16356A384k869M71k496O97L439K319j702k268n51m552M46K465M663J369k585j770
16340a540j027K24L052K640J033j059j135K667k104k535n476k263L157N435j033
16325C6M03j318r14j222k279k345k9M733M735N97J487j326m911k338N956K3n882
16308d594l437O88K008P43j608n40j124J433L009M23k516n053m189J385L142j776
16292a2006K186L493K460K10M07k835Q78K599j818j45L606J433l916j326J75K497
16276b102j511k256K14K140K230M77K410J129j885l469r17K50j353j241K046J294
$$ plain form
16260 -2544 -2519 -2577 -3784 -4437 -1207 -885 -2433 -2255 -3719 -4252 -2114 -571 -1076 -1321 -913 1986 1048 -2128
16242 -2128 -2966 -6455 -8789 -9836 -6041 -8869 -6751 -3947 -1459 -4417 -4943 -6281 -7610 -5792 -1457
16227 -1457 -884 -3920 -5308 -8775 -4716 -1717 -797 1391 -877 -7891 -11854 -11389 -9071 -10112 -11577
16212 -11577 -9046 -7552 -9131 -5075 -4572 -6621 -4333 -1354 -1649 -389 -2444 -3037 -475 246 -2697
16197 -2697 -9208 -8757 -5858 -3678 -4609 -6835 -7133 -4502 -1613 -2465 -1825 -1061 -2572 -3566 -4681 -4436 -4037
16180 -4037 -5297 -4144 -5881 -6448 -5204 -5106 -4970 -6897 -6025 -3680 -3638 -2190 -154 -476 1035 898 -3277
16163 -3277 -4206 -1694 245 1516 -3706 -4957 -6936 -6341 -4141 -3094 -2638 -3709 -2080 -3572 -6306
16148 -6306 -8069 -10721 -12423 -10692 -13467 -10247 -4880 -6493 -5927 -5119 -5478 -2124 -2715 -6730 -9023 -7605
$$ packed form
16260b544K5n8j207o53L230L22j548J78j464n33K138J543n05k45M08K899r38l176
16242b128q38l489k334j047L795k828K118K804K488k958n26j338j329J818M335
16227a457N73l036j388l467M059K999R20K188k268p014l963M65K318j041j465
16212a1577K531J494j579M056N03k049K288K979k95J260k055n93K562P21k943
16197b697o511M51K899K180r31k226k98K631K889q52O40P64j511r94j115K45L99
16180d037j260J153j737n67J244R8J36j927Q72K345M2J448K036l22J511j37m175
16163c277r29K512J939J271n222j251j979N95K200J047M56j071J629j492k734
16148f306j763k652j702J731k775L220N367j613N66Q08l59L354n91m015k293J418
$$ plain form
16132 -7605 -4255 -6143 -9170 -8553 -5381 -2106 -5634 -8933 -8371 -8523 -7377 -5804 -8649 -13832 -11350
16117 -11350 -9742 -7757 -2091 -3454 -502 811 -442 920 3975 3566 1975 4919 3455 -3424 -7351
16102 -7351 -8675 -7173 -7703 -8870 -8571 -8581 -4855 -3258 -2997 -4842 -10953 -13341 -8774 -4745 -5606 -6461
16086 -6461 -2287 -2360 -3965 -5110 -6535 -7361 -6018 -6207 -10423 -12016 -11292 -8660 -9177 -6894 -1631 -1602 -3172
16069 -3172 -5619 -10575 -10729 -5007 1226 -298 747 904 -5743 -10092 -13652 -13893 -7957 -4592 -4776 -3727
16053 -3727 -5545 -7186 -7483 -4527 -1785 -5444 -2119 2308 2964 -1099 -6066 -6258 -7524 -7822 -6474 -3808
16037 -3808 -2563 -4685 -5839 -4025 -5372 -7232 -6899 -5440 -5386 -3161 -2794 -3371 -7240 -4869 -3966 -7296
16021 -7296 -10412 -9092 -3531 -7868 -12770 -11122 -7290 -4989 -4642 -6818 -8056 -8263 -8343 -8221 -8437 -8690
$$ packed form
16132g605L350j888l027O17L172L275l528l299N62j52J146J573k845n183K482
16117a1350J608J985N666j363K952J313j253J362L055m09j591K944j464o879l927
16102g351j324J502n30j167K99j0L726J597K61j845o111k388M567M029q61q55
16086f461M174p3j605j145j425q26J343j89m216j593P24K632n17K283N263K9j570
16069c172k447m956j54N722O233j524J045J57o647m349l560k41N936L365j84J049
16053c727j818j641k97K956K742l659L325M427O56m063m967j92j266k98J348K666
16037c808J245k122j154J814j347j860L33J459N4K225L67n77l869K371R03l330
16021g296l116J320N561m337m902J648L832K301L47k176j238k07q0J22k16k53
$$ plain form
16005 -8690 -8677 -5347 -6582 -5671 -3988 -4227 -5001 -7741 -11446 -9502 -5663 -6897 -5780 675 828 -1825
15989 -1825 -2952 -3245 -5491 -7370 -7356 -4683 -4375 -7277 -8013 -10171 -9835 -7800 -6396 -6160 -934 -2918
15973 -2918 -10466 -9926 -8286 -9394 -7251 -6384 -5116 -6374 -8700 -5651 -4398 -5896 -3057 -2461 -1809 -1526
15957 -1526 -3287 -7071 -8952 -8842 -11653 -11149 -10209 -7266 -6958 -7635 -5058 -4695 -8885 -7338 -8882 -6608
15941 -6608 -4447 -5776 -8521 -7598 -4696 -5966 -5759 -5623 -3717 -1732 -5451 -5629 -3357 -2773 -2605 73
15925 73 7521 12830 16236 17852 15940 13612 7969 -1816 -1242 70 -318 -3725 -4957 -1062 -317 21
15909 21 971 1879 2271 1213 1697 941 2898 2147 -1612 -5712 -6452 -5320 -7115 -8780 -9570 -9124 -6796
15892 -6796 -8242 -9527 -6900 -7952 -12682 -13879 -7162 -4125 -3550 -484 2568 4721 32 -4632 -6451
$$ packed form
16005h690J3L330j235R11J683k39p74k740l705J944L839j234J117O455J53k653
15989a825j127k93k246j879J4K673L08k902p36k158L36K035J404K36N226j984
15973b918p548N40J640j108K143Q67J268j258k326L049J253j498K839N96O52K83
15957a526j761l784j881J10k811N04R40K943L08o77K577L63m190J547j544K274
15941f608K161j329k745R23K902j270K07J36J906J985l719j78K272N84J68K678
15925G3P448N309L406J616j912k328n643r785N74J312l88l407j232L895P45L38
15909B1R50R08L92j058M84p56J957p51l759m100p40J132j795j665p90M46K328
15892f796j446j285K627j052m730j197O717L037N75L066L052K153m689m664j819
$$ plain form
15877 -6451 -2360 -78 -1820 -3211 -808 1737 7368 10321 11713 10760 9516 8659 8452 3731 -4913
15862 -4913 -14000 -13992 -8961 -7339 -10743 -11579 -10190 -9853 -6687 -3155 -3497 -5623 -3993 -3268 -8277 -6629
15846 -6629 -7957 -10588 -11421 -10490 -7506 -3215 -883 -3080 -7344 -6743 -8707 -9231 -5083 -6289 -10193 -14268
15830 -14268 -13566 -9388 -5251 -5765 -9281 -8460 -8380 -7558 -6230 -3963 -3809 -3396 -3432 -2568 -513 -2145 -6026
15813 -6026 -4522 -3574 -4102 -4345 -5961 -5877 -6442 -6013 -3922 -2411 33 -1301 -265 -887 -1214 -2352 -3430
15796 -3430 -3329 -6845 -8900 -7990 -4332 -4381 -4322 -5155 -7325 -5759 606 965 -516 -3021 -1628 -2552 -6819
15779 -6819 -7861 -8553 -10316 -7783 -2016 -3023 -5079 -6309 -4913 -3441 -1429 -2369 -1515 -1534 2804 -307
15763 -307 -6313 -4394 -4395 -1675 459 -3358 -6860 -3972 -6945 -7168 -5992 -6240 -7618 -6219 -7118 -11045
$$ packed form
15877f451M091K282j742j391K403K545N631K953J392r53j244q57k07m721q644
15862d913r087QN031J622l404q36J389L37L166L532l42k126J630P25n009J648
15846f629j328k631q33R31K984M291K332k197m264O01j964n24M148j206l904m075
15830a4268P02M178M137n14l516Q21Q0Q22J328K267J54M13l6Q64K055j632l881
15813f026J504R48n28k43j616Q4n65M29K091J511K444j334J036o22l27j138j078
15796c430J01l516k055R10L658m9N9q33k170J566O365L59j481k505J393r24m267
15779f819j042o92j763K533N767j007k056j230J396J472K012r40Q54j9M338l111
15763c07o006J919jK720K134l817l502K888k973k23J176k48j378J399q99l927
$$ plain form
15747 -11045 -10926 -10168 -11241 -12695 -13884 -14340 -9476 -8644 -8218 -7783 -6861 -4468 -1667 1440 1650 712 597
15730 597 -5523 -11204 -12823 -12563 -8297 -8599 -11290 -8436 -3766 -2253 354 191 348 1359 1858 1903 1699
15713 1699 -1004 -3619 -2841 -6512 -6038 -5738 -2215 -3882 -4920 -2513 -3735 -6013 -1245 -1864 -5217 -7342
15697 -7342 -8664 -9442 -9679 -9743 -14125 -17639 -14233 -7563 -5588 -4356 -4665 -6912 -4907 -3787 -3459 -4283
15681 -4283 -7505 -5919 -7263 -9955 -8283 -6436 -7448 -11391 -10137 -8529 -6897 -7843 -1248 -654 -1412
15666 -1412 -3462 -3378 -3221 -5098 -5626 -8256 -3858 96 -2655 -5866 -7171 -8043 -6276 -11838 -12613 -8635
15650 -8635 -7141 -5352 -494 150 2137 4557 2172 479 -1221 -1889 -1330 -1773 -84 1878 -486 -2782
15634 -2782 -3850 -3401 -3331 -3809 -2662 -4520 -5988 -7861 -7296 -11240 -10258 -8096 -3459 -3768 -5451 -4851 -4217
$$ packed form
15747a1045J19P58j073j454j189m56M864Q32M26M35R22K393K801L107K10r38j15
15730E97o120n681j619K60M266l02k691K854M670J513K607j63J57J011M99M5k04
15713A699k703k615P78l671M74L00L523j667j038K407j222k278M768o19l353k125
15697g342j322p78k37o4m382l514L406O670J975J232l09k247K005J120L28q24
15681d283l222J586j344k692J672J847j012l943J254J608J632r46O595N94p58
15666a412k050Q4J57j877n28k630M398L954k751l211j305q72J767n562p75L978
15650h635J494J789M858O44J987K420k385j693j700o68N59m43J689J962k364k296
15634b782j068M49P0m78J147j858j468j873N65l944R82K162M637l09j683O00O34
$$ plain form
15617 -4217 -1274 -2345 -3779 -4340 -3236 -8450 -8893 -4384 -2791 -1596 -6853 -6629 -6885 -3923 295 1750
15601 1750 2889 -312 -667 -5008 -7933 -6199 -4135 -7838 -5675 -887 -439 -568 232 2416 1476 1355
15585 1355 -2822 -5423 -4297 -1096 2702 89 661 3506 -1995 -6136 -4116 -3116 -5601 -5703 -4609
15570 -4609 -3253 -1908 -3206 -2670 -6974 -7916 -5345 -2371 -677 -1861 -6343 -1778 -1386 -1940 -3992 -3885
15554 -3885 -3833 -1849 -6391 -10072 -12633 -8111 -1122 -3558 -5197 -4471 -2118 2633 4041 7044 2516
15539 2516 -3644 -4245 -3139 5290 7454 2574 -2583 -3545 -4812 -3891 -2384 -1693 -2867 -1595 -2142 -3840
15523 -3840 -6385 -2874 -1785 1514 1046 -961 -1895 -3813 -2701 707 893 -3837 -6269 -2905 -522
15508 -522 1020 -283 -2055 237 -1276 -3109 -3401 -6121 -7725 -8136 -6640 -4975 -6603 -8267 -5214
$$ packed form
15617d217K943j071j434n61J104n214m43M509J593J195n257K24k56K962M218J455
15601A750J139l201l55m341k925J734K064l703K163M788M48j29Q00K184r40j21
15585A355m177k601J126L201L798k613N72K845n501m141K020J000k485j02J094
15570d609J356J345j298N36m304r42K571K974J694j184m482M565L92n54k052J07
15554c885N2J984m542l681k561M522O989k436j639P26K353M751J408L003m528
15539B516o160o01J106Q429K164m880n157r62j267R21J507O91j174J272n47j698
15523c840k545L511J089L299m68k007r34j918J112L408J86m730k432L364K383
15508e22J542j303j772K292j513j833k92k720j604m11J496J665j628j664L053
$$ plain form
15493 -5214 -3622 -3036 -2315 -5404 -3029 16 -1191 -5688 -7165 -5107 -6167 -4487 -4485 -7384 -5801 -5098
15477 -5098 8 -579 -4386 -4414 -3219 -4809 -6543 -6481 -6296 -3758 -739 2470 -414 -492 -992 -3802 -3759
15460 -3759 -3819 -2706 -2348 -3730 -6047 -6256 -9762 -11220 -8681 -5147 880 753 -3666 -6059 -4647 -4993
15444 -4993 -6691 -2802 192 -2262 -2649 -3516 -6302 -10327 -15314 -17459 -19481 -17304 -14542 -13158 -8001
15429 -8001 -4132 -5108 -4805 -4020 -4979 -9667 -12122 -14820 -11422 -6279 -4979 -7613 -6233 -3352 -4699 -6155
15413 -6155 -1711 2387 -692 677 3082 3417 5121 8840 5022 -1535 -7271 -5127 -2520 -2507 -3646
15398 -3646 -9095 -12143 -12657 -12882 -12816 -10700 -5298 -3021 -5276 -4990 -5886 -9111 -5383 -1722 -107 798
15382 798 -3437 -5552 -7250 -8310 -8369 -6595 -6160 -8313 -8187 -12177 -15156 -14233 -10475 -6465 -6501 -10153 -11562
$$ packed form
15493e214J592N86P21l089K375L045j207m497j477K058j060J680Kk899J583P03
15477e098N106n87l807k8J195j590j734O2J85K538L019L209k884p8n00k810M3
15460c759o0J113L58j382k317k09l506j458K539L534O027j27m419k393J412l46
15444d993j698L889K994k454l87q67k786m025m987k145k022K177K762J384N157
15429h001L869r76L03P85r59m688k455k698L398N143J300k634J380K881j347j456
15413f155M444M098l079J369K405L35J704L719l818o557n736K144K607J3j139
15398c646n449l048n14k25O6K116N402K277k255K86q96l225L728L661J615R05
15382G98m235k115j698j060n9J774M35k153J26l990k979R23L758M010l6l652j409
$$ plain form
15365 -11562 -8760 -5563 -1887 -4605 -4229 927 402 -1581 -3065 -3264 -1094 -2964 -6242 -1312 1527
15350 1527 -1314 -2310 -3810 -2504 -1972 -7236 -10631 -2814 5007 16597 22378 17559 11973 7564 -700
15335 -700 -3777 -5917 -8028 -5713 -2844 -5225 -5085 -5436 -3001 -1373 -969 -6601 -10513 -12707 -15116 -13846
15319 -13846 -9726 -6256 -8065 -9176 -7918 -7827 -9437 -12993 -12953 -12140 -8726 -5121 -5460 -9994 -12267 -9231
15303 -9231 -8038 -6968 -7022 -6097 -3955 -1629 -1624 -2527 -2571 -6897 -8257 -5048 -5050 -8367 -10867 -4984 2359 11947
15285 11947 16992 14572 5027 -2121 -6701 -14188 -13339 -9337 -7179 -4725 -5319 -2275 -2437 -4823 -4026
15270 -4026 -7177 -9185 -9044 -6783 293 578 1666 -1445 -4505 -6158 -5662 -6495 -7841 -10848 -12880 -10906
15254 -10906 -9673 -10773 -9963 -9137 -8332 -8348 -4036 -5204 -5835 -2193 602 -1055 -3339 -2876 -2601 -1747 -3886
$$ packed form
15365a1562K802L197L676k718L76N156n25j983j484j99K170j870l278M930K839
15350A527k841r96j500J306N32n264l395P817P821J1590N781m819n586m409q264
15335g00l077k140k111K315K869k381J40l51K435J628M04n632l912k194k409J270
15319a3846M120L470j809j111J258R1j610l556M0Q13L414L605l39m534k273L036
15303i231J193J070n4R25K142K326Nr03m4m326j360L209kl317k500N883P343R588
15285A1947N045k420r545p148m580p487Q49M002K158K454n94L044j62k386P97
15270d026l151k008J41K261P076K85J088l111l060j653M96q33j346l007k032J974
15254a0906J233j100Q10Q26Q05j6M312j168o31L642K795j657k284M63K75Q54k139
$$ plain form
15237 -3886 -6153 -9033 -12315 -11299 -8458 -4553 -8286 -7793 -6294 -4426 -7667 -10300 -7095 -6382 -8372
15222 -8372 -9449 -2632 652 -1536 -32 -26 -2272 752 149 -2469 -3736 -4562 -320 -563 -2514 -2550 -3577
15205 -3577 -6074 -8594 -7751 -6292 -3984 -5553 -5104 -6690 -4749 -2607 -5371 -10013 -6111 -3352 -5678
15190 -5678 -5211 -6917 -9054 -6031 -5209 -6406 -5271 -8649 -7397 -7755 -4117 -2060 -3859 -8104 -11138
15175 -11138 -10393 -12086 -15403 -13546 -7572 -6080 -4518 -4999 -6065 -8724 -12867 -16229 -10395 -7277 -5143
15160 -5143 -7088 -7481 -4625 -1798 -3636 -1247 3534 6459 911 -6830 -7514 -4431 -4805 -4376 -1696 -3220
15144 -3220 -4528 -904 -1795 -4058 -5886 -1171 -3886 -4878 -3598 -7883 -7025 -2895 -6917 -7788 -4584 -1423
15128 -1423 -2443 -5302 -6627 -7233 -3671 -8202 -10673 -8324 -8963 -8055 -6923 -5823 -6445 -8873 -10504 -12590
$$ packed form
15237c886k267k880l282J016K841L905l733M93J499J868l241k633L205P13j990
15222h372j077O817L284k188J504Ok246L024o03k618j267q26M242k43j951l6j027
15205c577k497k520Q43J459K308j569M49j586J941K142k764m642L902K759k326
15190e678M67j706k137L023Q22j197J135l378J252l58L638K057j799m245l034
15175a1138P45j693l317J857N974J492J562m81j066k659m143l362N834L118K134
15160e143j945l93K856K827j838K389M781K925n548p741o84L083l74M29K680j524
15144c220j308L624q91k263j828M715k715r92J280m285Q58M130m022q71L204L161
15128a423j020k859j325o06L562m531k471K349o39R08J132J100o22k428j631k086
$$ plain form
15112 -12590 -13866 -10974 -8046 -7079 -14157 -13314 -12392 -9064 -6802 -7281 -8633 -4838 -3195 -5592 -9455
15097 -9455 -9162 -5403 -2825 -4799 -3524 3045 2422 733 -3529 -3024 -5939 -4311 -2306 -993 -354 70
15081 70 -3864 -4447 -1944 392 2579 3397 5024 6935 3712 3109 3607 3087 8822 17520 23126 26502
15065 26502 30690 32312 32234 31763 27065 20208 13050 10336 11734 10021 8255 6531 6657 6515 914 -351
15049 -351 -788 -239 2300 1704 -131 -2749 -7140 -5404 -2611 -4839 -5247 -1784 -3139 -6865 -7759 -5071
15033 -5071 -4103 -6718 -7596 -6230 -2406 -1713 -4073 -4535 -3037 -356 1504 4679 3574 -800 -120 -1358
15017 -1358 -1258 -2592 -2408 -4972 -7132 -6549 -4568 -1020 -3191 -4750 -587 1118 910 -693 -2956 -3296
15001 -3296 -2554 -3228 -6160 -8052 -6228 -4554 -821 230 -844 -1572 -731 -4451 -1877 -3218 -2904 -2375
$$ packed form
15112a2590j276K892K928R67p078Q43R22L328K262m79j352L795J643k397l863
15097i455K93L759K578j974J275O569o23j689m262N05k915J628K005J313O39M24
15081G0l934n83K503K336K187Q18J627J911l223o03M98n20N735Q698N606L376
15065B6502M188J622p8m71m698o857p158k714J398j713j766j724J26j42n601j265
15049c51m37N49K539n96j835k618m391J736K793k228m08L463j355l726q94K688
15033e071R68k615q78J366L824O93k360m62J498K681J860L175j105m374O80j238
15017a358J00j334J84k564k160N83J981L548k171j559M163J705k08j603k263l40
15001c296P42o74k932j892J824J674L733J051j074p28Q41l720K574j341L14N29
$$ plain form
14985 -2375 -3293 -1452 -885 -3725 -4416 -6565 -8174 -5942 -373 -2803 -6730 -5596 -4117 -6649 -10814
14970 -10814 -8383 -5430 -6603 -5179 -2386 -4208 -2646 -1987 -5930 -5408 -4972 -3891 -3015 -3149 -525 441
14954 441 2484 4239 4791 5251 2000 -3507 -6420 -5464 -4026 -950 1016 2226 -393 -2600 1417 12018
14938 12018 24396 28915 22573 15122 9510 4856 621 -7170 -7197 -4124 -141 3771 3673 1539 -2458
14923 -2458 -5293 -5547 -3062 -4901 -3393 -4964 -6608 -1949 1641 2481 -597 -3728 -6567 -8808 -7567
14908 -7567 -11495 -12031 -13000 -15389 -13176 -13033 -11656 -5655 -1633 521 1632 1131 269 856 1068 -1232
14892 -1232 -2544 -2898 -6446 -9243 -10151 -7194 -4414 -3158 -2175 -102 -5224 -10513 -9087 -7665 -9926
14877 -9926 -9827 -6533 -6444 -8705 -7580 -7550 -4888 -5503 -5508 -5967 -7006 -6824 -7658 -8241 -8951 -8839 -8450 -4108 -3166
$$ packed form
14985b375r18J841N67k840o91k149j609K232N569k430l927J134J479k532m165
14970a0814K431K953j173J424K793j822J562O59l943N22M36J081Q76j34K624R66
14954D41K043J755N52M60l251n507k913R56J438L076J966J210k619k207M017J0601
14938A2018J2378M519o342p451n612m654m235p791k7L073L983L912r8k134l997
14923b458k835k54K485j839J508j571j644M659L590Q40l078l131k839k241J241
14908g567l928n36r69k389K213J43J377O001M022K154J111n01q62N87K12k300
14892a232j312l54l548k797r08K957K780J256R83K073n122n289J426J422k261
14877i926R9L294Q9k261J125L0K662o15nm59j039J82q34n83p10J12L89M342R42
$$ plain form
14858 -3166 -3073 -3254 -4688 -6689 -6724 -5370 -6143 -5243 -5120 -2192 1463 -9 1723 782 -1706 -2242 -690
14841 -690 3812 533 -2372 585 1782 -2084 -2993 -2626 341 -2496 -4598 -6205 -7155 -5540 -4407 -4012
14825 -4012 -3151 -7322 -10862 -7977 -7625 -4864 -2970 -7897 -9935 -10852 -8341 -8162 -6620 -8938 -9480 -8638
14809 -8638 -5000 -1091 378 3377 4386 -2313 -8101 -8617 -5268 -4254 -4345 -8449 -12533 -14757 -12463
14794 -12463 -9415 -11903 -12327 -10770 -8390 -6427 -3902 -1225 -5329 -8274 -9373 -8190 -6546 -5786 -7278
14779 -7278 -5337 -3405 -1060 -1334 -2565 -3433 -2272 2088 1480 215 -2080 -5977 -7274 -4146 -2443
14764 -2443 -1978 -1527 -2984 -4695 -2196 -2518 -4707 -3430 -5956 -9033 -8615 -5801 -1654 -1743 -2446 -5082
14748 -5082 -9326 -8593 -6290 -4742 -3455 -1723 -5361 -7119 -3267 687 -5892 -14914 -14410 -8317 -8265 -24793
$$ packed form
14858c166R3j81j434k001l5J354p73R00J23K928L655j472J732r41k488n36J552
14841f90M502l279k905K957J197l866r09L67K967k837k102j607r50J615J133L95
14825d012Q61m171l540K885L52K761J894m927k038r17K511J79J542k318n42Q42
14809h638L638L909J469K999J009o699n788n16L349J014r1m104m084k224K294
14794a2463L048k488m24J557K380J963K525K677m104k945j099J183J644P60j492
14779g278J941J932K345k74j231q68J161M360o08j265k295l897j297L128J703
14764b443M65M51j457j711K499l22k189J277k526l077M18K814M147q9p03k636
14748e082m244P33K303J548J287J732l638j758L852L954o579r022N04O093N2j6528
$$ plain form
14732 -24793 -29543 -1370 46314 74551 73890 60022 32145 -7701 -39898 -40209 -20097 -4180 -673
14719 -673 -7259 -7526 -737 1014 -6390 -11784 -6511 -5296 -3745 -3691 -893 -2708 -5929 -5632 -3073 -1632
14703 -1632 -3673 -6604 -7833 -6892 -8990 -7603 -3429 -5614 -8277 -4070 -2298 -3037 -3509 -2175 -2181 -2632
14687 -2632 -4728 -5526 -6373 -7028 -4039 -386 632 2033 2628 3150 956 -4308 -8116 -9151 -8000 -5707
14671 -5707 -5994 -3580 -5409 -7093 -6619 -7952 -9249 -13314 -15400 -16653 -18988 -14607 -7498 -8794 -8799 -7365
14655 -7365 -2065 2091 -2084 -2416 -2385 -4549 -5860 -7933 -7229 -4334 -5055 -1407 282 792 2470 3798
14639 3798 1455 -1777 -1698 -2123 -2192 425 662 1525 -1744 -3930 -3853 -4809 -7573 -9818 -4393 -573 1358
14622 1358 3663 2525 3745 2525 1294 -360 -632 -1156 -2439 -2733 -1005 -618 -2766 -7100 -5968 -1577
$$ packed form
14732b4793m750K8173M7684K8237o61j3868k7877l9846l2197l11K0112J5917L507
14719f73o586k67O789J751p404n394N273J215J551N4K798j815l221K97K559J441
14703a632k041k931j229R41k098J387M174k185k663M207J772p39m72J334om51
14687b632k096p98q47o55K989L653J018J401N95N22k194n264l808j035J151K293
14671e707k87K414j829j684M74j333j297m065k086j253k335M381P109j296nJ434
14655g365N300M156m175l32L1k164j311k073P04K895p21L648J689N10J678J328
14639C798k343l232P9m25o9K617K37Q63l269k186P7r56k764k245N425L820J931
14622A358K305j138J220j220j231j654k72n24j283k94J728L87k148m334J132M391
$$ plain form
14606 -1577 -2 -608 1922 -211 -4592 -8245 -10718 -11622 -5287 -1024 -2949 -5049 -6260 -6089 -3642
14591 -3642 -4300 -1722 -1752 -1469 -182 -1430 -4683 -3911 -285 -1788 -4734 -3889 -3833 -3987 -2217 235 -145
14574 -145 66 -2273 -4910 -7050 -8132 -8446 -6910 -4445 -4172 -6590 -8762 -9983 -5532 -6124 -11357 -13182
14558 -13182 -3811 8724 17728 22816 31717 38124 37367 35694 28131 22905 20250 16898 7945 5054
14544 5054 72 -6214 -7120 -6201 -7487 -6430 -1104 487 1143 3430 -433 -3267 -4704 -2539 4332
14529 4332 5936 5945 4372 2588 2103 3909 3285 -1143 -3380 -1780 -1489 -386 2918 6634 6471 2120
14513 2120 265 -293 -450 -3595 -2053 -88 -482 -5518 -8736 -10596 -10827 -13554 -15282 -13599 -11344 -9505
14497 -9505 -10168 -12404 -11284 -9467 -7570 -8612 -9817 -10846 -7349 -2304 -1371 -1966 -2258 2002 803 -3699
$$ packed form
14606a577J575o06K530k133m381l653k473r04O335M263j925k100j211J71K447
14591c642o58K578l0K83J287j248l253P72L626j503k946Q45N6j54J770K452l80
14574a45K11k339k637k140j082l14J536K465K73k418k172j221M451n92n233j825
14558a3182R371J2535R004N088Q901O407p57j673p563n226k655l352q953k891
14544E054m982o286r06R19j286J057N326J591O56K287l863k834j437K165O871
14529D332J604Rj573j784m85J806o24m428k237J600K91J103L304L716j63m351
14513B120j855n58j57l145J542J965l94n036l218j860k31k727j728J683K255J839
14497i505o63k236J120J817J897j042j205j029L497N045R33n95k92M260j199m502
$$ plain form
14481 -3699 -5911 -9900 -9331 -4553 -2071 -3479 -4780 -4916 -413 1975 2204 5223 4586 3187 1006 -1661
14465 -1661 -3472 -5476 -4681 -7178 -6903 -851 4033 4753 5026 2438 -3220 -4372 -5304 -3356 -1881 -416
14449 -416 570 -1369 1049 402 2240 886 2638 64 -4586 -1847 -2405 -5726 -3635 -4347 -7114 -9155
14433 -9155 -10646 -7342 -4907 -7756 -6696 -2097 143 -2905 -8846 -6074 -1359 -926 -2022 174 3744
14418 3744 2010 1400 3787 5310 6156 3411 2430 6270 5616 4680 4257 1981 2055 1764 -164 446 1800
14401 1800 1895 -1453 -1912 -1206 -2149 -5549 -7267 -6437 -4126 -727 4205 1600 2889 -2475 -3595 -711
14385 -711 2169 1806 3122 3466 1273 232 -619 -1210 2535 4862 7931 12008 8154 5830 8253 2846
14369 2846 399 1087 552 -2802 -104 -328 -1260 -1285 698 775 -280 -1775 -1422 -341 -1194 -947 1204
$$ packed form
14481c699k212l989N69M778K482j408j301j36M503K388K29L019o37j399k181k667
14465a661j811k004P95k497K75O052M884P20K73k588n658j152r32J948J475J465
14449d16R86j939K418o47J838j354J752k574m650K739n58l321K091p12k767k041
14433i155j491L304K435k849J060M599K240l048n941K772M715M33j096K196L570
14418C744j734o10K387J523Q46k745r81L840o54r36m23k276P4k91j928O10J354
14401A800R5l348m59P06r43l400j718Q30K311L399M932k605J289n364j120K884
14385g11K880l63J316L44k193j041q51n91L745K327L069M077l854k324K423n407
14369B846k447O88n35l354K698k24r32k5J983P7j055j495L53J081q53K47K151
$$ plain form
14352 1204 106 59 3289 2105 -1521 -1424 -444 63 4748 1834 -915 -1394 93 358 -1022 -1220 -1595
14335 -1595 -4166 -6827 -8264 -9010 -6588 -5142 -1790 2942 7427 5609 1818 -2973 -3327 -3983 -5187
14320 -5187 -4044 -631 -3921 -4451 -951 -16 3260 4093 4435 3725 1404 3682 4276 -16 -4567 -4010
14304 -4010 -4371 -5268 -10581 -10786 -5389 -4820 -4195 -2854 -1323 -1558 -4275 -8941 -3826 976 5893 3024
14288 3024 -2799 -634 1625 2956 1861 -951 -2538 -1217 -500 -3168 -2913 559 -1106 -3829 -661
14273 -661 199 594 -1624 -1036 1524 2324 -1610 -6782 -6888 -8476 -6553 -4173 -187 -1260 564 -475
14257 -475 723 4214 4270 3222 4952 4534 226 -2603 126 3084 2489 3216 1310 4520 4376 2959
14241 2959 1659 714 1128 1767 8694 7965 5468 3205 669 -3706 -674 4119 4275 3041 4022 3955 -1757
$$ packed form
14352A204j098m7L230j184l626R7R80N07M685k914k749m79J487K65j380j98l75
14335a595k571k661j437p46K422J446L352M732M485j818l791m791l54o56j204
14320e187J143L413l290n30L500R35L276Q33L42p10k321K278N94m292m551N57
14304d010l61q97n313k05N397N69O25J341J531k35k717m666N115M802M917k869
14288C024n823K165K259J331j095k812j587J321P17k668K55L472j665k723L168
14273f61Q60L95k218N88K560Q00l934n172j06j588J923K380L986j073J824j039
14257d75J198L491N6j048J730m18m308k829K729K958n95P27j906L210j44j417
14241B959j300r45M14O39O927p29k497k263k536m375L032M793J56j234R81o7n712
$$ plain form
14224 -1757 -1123 -751 586 -802 -2952 -6073 -4520 -2576 2415 1378 -25 63 -920 -721 34 2077
14208 2077 3484 197 525 -2979 -2771 -2289 -2377 1351 -515 -1693 -2691 1149 1989 5555 6097 1671 2331
14191 2331 1965 -1267 -3851 -4919 -4369 -4883 -4323 1461 6862 5520 6637 5678 7334 7646 5291 4558
14175 4558 867 -1608 -2879 -1755 1034 4870 6450 5895 6040 2114 5281 10357 7093 5618 3790
14160 3790 -519 26 -644 -1307 898 1244 5117 4986 5078 7771 2735 -2118 -4867 -4003 -2799 -725 -1516
14143 -1516 -1205 2438 4302 6666 7307 6581 2914 1914 3385 671 10 1865 925 84 -52 -905 -1248
14126 -1248 -3250 -5378 -6183 -6661 -4743 -4055 -2718 -4429 -5870 -2225 -4153 968 4804 4398 1052 2006
14110 2006 6999 8222 6371 3521 -14 -859 -1602 -1899 206 1036 2522 1313 6542 9717 6361 4170
$$ packed form
14224a757O34L72J337j388k150l121J553J944M991j037j403Q8r83J99P55K043
14208B077J407l287L28l504K08M82q8L728j866j178r98L840Q40L566N42m426O60
14191B331l66l232k584j068N50n14N60N784N401j342J117r59J656L12k355p33
14175D558l691k475j271J124K789L836J580n55J45l926L167N076l264j475j828
14160C790m309N45o70o63K205L46L873j31R2K693n036m853k749Q64J204K074p91
14143a516L11L643J864K364O41p26l667j000J471k714o61J855r40q41j36q53l43
14126a248k002k128q05m78J918O88J337j711j441L645j928N121L836m06l346R54
14110B006M993J223j851k850l535q45p43k97K105Q30J486j209N229L175l356k191
$$ plain form
14094 4170 2597 3498 3637 1951 -1809 -2040 1351 2811 720 669 4220 4367 3084 2710 1271 -1476
14078 -1476 975 629 331 3797 7219 4083 1892 -2062 -5559 -5338 -1969 3532 6096 6342 7614 6989
14062 6989 5965 8042 4716 2038 3560 2830 2482 1258 -3131 -1686 -2597 -5021 -2497 1244 4970
14047 4970 7560 6954 6886 3418 2230 215 -402 -5421 -5551 2494 4844 2461 2111 165 1698 2432
14031 2432 7303 12236 4689 2064 3740 3574 -291 2888 7033 9236 8160 4714 5770 6658 6003
14016 6003 4819 8249 6872 3458 3064 4010 3897 3921 1516 265 2594 3180 4206 8784 9875 6184
14000 6184 2359 -1355 -1536 -1482 -1456 -560 794 1805 1748 1693 449 -337 2395 2666 4763 9134 7877 4816
13982 4816 6999 9306 10040 6000 5857 8596 7650 9241 7734 4066 1645 2082 4576 1169 -1097 -3263
$$ packed form
14094D170j573R01J39j686l760k31L391J460k091n1L551J47j283l74j439k747
14078a476K451l46k98L466L422l136k191l954l497K21L369N501K564K46J272o25
14062F989j024K077l326k678J522p30l48j224m389J445r11k424K524L741L726
14047D970K590o06o8l468j188k015o17n019j30Q045K350k383l50j946J533P34
14031B432M871M933p547k625J676j66l865L179M145K203j076l446J056Q88o55
14016F003j184L430j377l414l94R46j13K4k405j251K329N86J026M578J091l691
14000F184l825l714j81N4K6Q96J354J011n7n5j244p86K732K71K097M371j257l061
13982D816K183K307P34m040j43K739r46J591j507l668k421M37K494l407k266k166
$$ plain form
13966 -3263 -2293 691 -1459 -2112 -3789 -3061 2078 3187 -819 -411 -2995 -5713 -4310 -17 491 39
13950 39 -341 1592 1342 -3146 -1535 2392 3171 1200 -1453 377 2005 5088 8335 11686 11230 11437
13934 11437 12361 13571 12319 11409 9300 8034 3013 4007 3663 152 1249 3674 -678 223 5292 8928
13918 8928 10156 8419 6220 5262 1200 1981 4776 5739 7922 7068 10657 9630 5905 468 -2872 -4361
13902 -4361 -1000 2281 5512 7543 6354 5412 2816 1754 3399 3752 2270 5349 7261 6046 5663
13887 5663 9829 13639 15901 9785 9512 10439 8248 12035 11065 10662 8643 9478 5679 2917 6657 9900
13871 9900 6523 4789 2414 -886 -1500 -2402 -1435 485 2152 3915 4668 7635 9045 10051 8566 9818
13855 9818 13440 14651 14803 11319 6534 4078 506 1397 2771 10841 14275 11976 14107 16469 14625
$$ packed form
13966c263R70K984k150o53j677P28N139J109m006M08k584k718J403M293N08m52
13950C9l80J933k50m488J611L927P79j971k653J830J628L083L247L351m56K07
13934A1437R24J210j252r10k109j266n021R94l44l511J097K425m352R01N069L636
13918H928J228j737k199r58m062P81K795R63K183q54L589j027l725n437l340j489
13902d361L361L281L231K031j189r42k596j062J645L53j482L079J912j215l83
13887E663M166L810K262o116k73R27k191L787r70m03k019Q35l799k762L740L243
13871I900l377j734k375l300o14r02R67J920J667J763P53K967J410J006j485J252
13855I818L622J211J52l484m785k456l572Q91J374Q070L434k299K131K362j844
$$ plain form
13840 14625 11134 7795 11484 12034 13260 17680 21902 22125 25389 23402 26119 27480 28166 27702 34314
13825 34314 44410 48670 51062 60813 74066 89388 107761 132072 164013 205284 261347 336919
13813 336919 435894 550707 663190 774961 872010 943607 976859 964256 906121 822132 719251
13802 719251 605963 497013 402493 327756 276039 235951 211401 193968 181759 168642 154339
13791 154339 142730 135377 128004 121651 117794 113222 105653 99608 92163 83211 79594 71197 66648 64003
13777 64003 62310 62795 59452 53907 48205 44962 41540 37576 33598 32213 38413 38908 33628 29451 28269
13762 28269 28569 29096 29985 30198 27750 28240 28419 27848 25646 23899 17984 11724 11828 15872 15934 9030 9109
13745 9109 15226 21003 20197 19013 12822 10504 8621 11137 13023 11305 11954 16843 19244 15449 9756
$$ packed form
13840A4625l491l339L689N50J226M420M222K23L264j987K717J361O86m64O612
13825C4314J0096M260K392R751J3253J5322J8373K4311L1941M1271N6063P5572
13813C36919R8975J14813J12483J11771R7049P1597L3252j2603n8135q3989j02881
13802G19251j13288j08950r4520p4737n1717m0088k4550j7433j2209j3117j4303
13791A54339j1609p353p373o353l857m572p569o045p445q952l617q397m549k645
13777F4003j693M85l343n545n702l243l422l964l978j385O200M95n280m177j182
13762B8269L00N27Q89K13k448M90J79n71k202j747n915o260J04M044O2o904P9
13745I109O117N777q06j184o191k318j883K516J886j718O49M889K401l795n693
$$ plain form
13730 9756 13567 14846 9932 3565 -1259 -2208 -338 483 5095 10885 15404 13765 14413 14233 15631 14808
13714 14808 14007 14947 13661 17222 14674 11970 9067 8725 6088 11430 15069 15879 9113 4022 2514
13699 2514 1923 7003 8684 5091 8256 7381 9853 12368 14882 15861 14024 10309 6770 7484 8949 10013
13683 10013 12989 17555 16368 13072 13177 13651 13395 11790 10442 10694 12274 13461 11754 10879 13514 15049
13667 15049 13553 11358 10274 11583 13605 14976 14089 12728 11123 10962 10778 11273 12369 11153 12874
13652 12874 12609 12954 10459 10226 11149 10899 11432 14630 15225 14602 14201 15160 15238 11489 10104 10819 10699 8236
13634 8236 5637 8213 10685 15956 18323 17066 17775 13478 14201 14152 17763 19008 18279 18284 18334 19959 16509
13617 16509 13460 14077 14576 15725 13913 10560 7718 10656 14093 15920 12111 7779 8447 12624 15436
$$ packed form
13730I756L811J279m914o367m824r49J870Q21M612N790M519j639O48j80J398q23
13714A4808q01R40j286L561k548k704k903l42k637N342L639Q10o766n091j508
13699B514n91N080J681l593L165q75K472K515K514R79j837l715l539P14J465J064
13683A0013K976M566j187l296J05M74k56j605j348K52J580J187j707q75K635J535
13667A5049j496k195j084J309K022J371q87j361j605j61j84M95J096j216J721
13652A2874k65L45k495k33R23k50N33L198N95o23m01R59P8l749j385P15j20k463
13634H236k599K576K472N271K367j257P09m297P23m9L611J245p29NN0J625l450
13617A6509l049O17M99J149j812l353k842K938L437J827l809m332O68M177K812
$$ plain form
13602 15436 18149 20379 20706 19872 19280 23843 23412 19446 16077 13957 10535 10014 12045 10012 15120 17267
13586 17267 15161 12852 16285 18465 15932 16416 14843 11127 9671 10507 11100 11804 10696 7282 6696 10720
13570 10720 12952 12862 10731 12973 12773 13495 12904 13602 12318 8213 4322 6694 7398 10704 10675 12003 16173
13553 16173 19795 21313 18275 14103 13393 13352 14119 15619 17028 14982 14581 15805 13032 15672 20327 20639
13537 20639 19378 21184 25019 29831 30474 30953 33298 32460 32145 33550 31499 28190 26182 19350 13456
13522 13456 10460 13123 15629 20768 19653 19574 19070 22322 18001 12779 12235 16306 17501 16360 19440
13507 19440 23701 21611 19294 16971 14765 13699 13446 14068 15515 17035 15319 17511 19493 18092 16833
13492 16833 16131 19688 27049 21901 18045 16777 17434 24004 25078 20213 17433 16456 15675 17355 12754
$$ packed form
13602A5436K713K230L27q34n92M563m31l966l369k120l422n21K031k033N108K147
13586A7267k106k309L433K180k533M84j573l716j456Q36N93P04j108l414n86M024
13570A0720K232r0k131K242k00P22n91O98j284m105l891K372P04L306k9J328M170
13553A6173L622J518l038m172p10m1P67J500J409k046m01J224k773K640M655L12
13537B0639j261J806L835M812O43M79K345q38l15J405k051l309k008o832n894
13522A3456k996K663K506N139j115p9n04L252m321n222n44M071J195j141L080
13507A9440M261k090k317k323k206j066k53O22J447J520j716K192J982j401j259
13492A6833p02L557P361n148l856j268O57O570J074m865k780r77p81J680m601
$$ plain form
13477 12754 6650 6048 10142 13402 15308 18308 23355 18626 16513 12414 6327 9260 13933 16317 18012
13462 18012 15825 17559 22303 21381 18381 13719 10040 10986 11900 14051 15846 15504 17365 16833 17847 16782
13446 16782 17970 17202 14358 11805 9452 9365 7025 5135 5380 2602 3107 4961 7365 13918 16554 14731
13430 14731 12855 9350 8480 9903 10620 9401 8342 9612 10390 13222 13958 15666 14307 14567 12972 11075
13414 11075 9874 10267 8068 8107 14213 16048 17914 17359 14738 12466 11967 11635 14425 16523 18626 17545
13398 17545 15259 14928 13329 11492 11473 12268 13748 13810 11159 14661 18100 21535 21825 20378 20429 18419 15458
13381 15458 13154 14114 11879 10045 13125 11087 9771 8637 11025 11798 9775 8717 10651 13347 15569
13366 15569 17263 19575 19838 19712 21980 18917 19272 19112 18140 17533 18786 17791 18853 18830 19053 23167 19463
$$ packed form
13477A2754o104o02M094L260J906L000N047m729k113m099o087K933M673K384J695
13462A8012k187J734M744r22l000m662l679R46R14K151J795l42J861n32J014j065
13446A6782J188p68k844k553k353q7k340j890K45k778N05J854K404O553K636j823
13430A4731j876l505q70J423P17j219j059J270P78K832P36J708j359K60j595j897
13414A1075j201L93k199L9O106J835J866n55k621k272m99l32K790K098K103j081
13398A7545k286l31j599j837j9P95J480O2k651L502L439L435K90j447N1k010k961
13381A5458k304R60k235j834L080k038j316j134K388P73k023j058J934K696K222
13366A5569J694K312K63j26K268l063L55j60r72o07J253r95J062k3K23M114l704
$$ plain form
13349 19463 15357 12889 13922 17131 21075 19779 16362 15498 21426 23037 19926 19055 17608 15892 14290
13334 14290 15287 19575 25966 26326 22315 19851 17443 19476 21615 20459 18949 19482 18961 15243 15088 15545
13318 15545 16255 20702 21450 23928 22837 20157 16074 19325 22429 27209 27285 29182 29962 28134 24780 22931
13302 22931 21911 24316 23988 19144 13450 13129 13990 10096 13543 14524 15968 14448 12828 11338 13748
13287 13748 12799 14400 17641 22754 22773 21354 19627 18195 20590 24313 25022 23280 25143 24527 24464 22479
13271 22479 21954 22396 20883 21717 25017 28559 27792 24992 21254 23492 24494 19896 18461 13787 11812
13256 11812 14988 15627 13700 14755 16447 14958 13909 16179 14155 14385 19969 21065 18427 20024 22444
13241 22444 27103 25962 24426 24053 26067 28836 28682 27298 26371 24413 19421 14607 15520 17512 17334 17008
$$ packed form
13349A9463m106k468J033L209L944j296l417q64N928J611l111q71j447j716j602
13334A4290R97M288O391L60m011k464k408K033K139j156j510N33n21l718j55M57
13318A5545P10M447P48K478j091k680m083L251L104M780P6J897P80j828l354j849
13302B2931j020K405l28m844n694l21Q61l894L447R81J444j520j620j490K410
13287A3748r49J601L241N113J9j419j727j432K395L723P09j742J863o16o3j985
13271B2479n25M42j513Q34L300L542p67k800l738K238J002m598j435m674j975
13256A1812L176O39j927J055J692j489j049K270k024K30N584J096k638J597K420
13241B2444M659j141j536l73K014K769j54j384r27j958m992m814R13J992j78l26
$$ plain form
13225 17008 17743 18935 19619 20439 13681 15723 19673 19214 17425 22056 24608 25675 30959 27444 29133
13210 29133 28657 25772 27400 27212 25859 20353 22970 25688 24402 21191 14963 12816 11675 8522 9518
13195 9518 12714 20862 26651 25099 20115 22917 25397 22666 22159 19629 18377 20514 23678 25857 29127
13180 29127 26309 27788 29629 27218 26318 24253 25833 25539 27440 29435 26526 23905 22715 25393 26619
13165 26619 26907 26118 26871 27367 26776 27966 28814 28740 27020 27745 29930 36439 37279 34367 32651 29506 26940
13148 26940 32040 37708 36872 29126 26735 23820 20774 22990 25994 29300 36193 42573 42524 38488 37064
13133 37064 35407 38027 39026 35730 34206 35171 36395 38585 37615 38832 38217 36508 32436 27994 28527 30940
13117 30940 33931 32467 32341 34592 38077 38440 36188 36843 36855 38134 37557 38900 40512 41542 44022 51089
$$ packed form
13225A7008P35J192O84Q20o758K042L950m59j789M631K552J067N284l515J689
13210B9133m76k885J628j88j353n506K617K718j286l211o228k147j141l153R96
13195I518L196Q148N789j552m984K802K480k731n07k530j252K137L164K179L270
13180B9127k818J479J841k411r00k065J580k94J901J995k909k621j190K678J226
13165B6619K88p89P53M96n91J190Q48p4j720P25K185O509Q40k912j716l145k566
13148B6940N100N668q36p746k391k915l046K216L004L306O893O380m9m036j424
13133C7064j657K620R99l296j524R65J224K190r70J217o15j709m072m442N33K413
13117C0940K991j464j26K251L485L63k252O55J2J279n77J343J612J030K480P067
$$ plain form
13101 51089 54175 54509 50766 47969 46752 47342 47717 42080 34447 31036 30563 31860 33462 34393 34180 34828
13085 34828 35595 31625 29049 28769 27160 26929 27607 30080 30259 30235 35158 36941 36643 42154 47881 49335
13069 49335 47678 48903 52114 54773 59998 63421 62561 57177 55426 60262 62902 65146 67570 71800 74283
13054 74283 78966 89205 105221 124736 145345 164597 180933 198748 231680 278207 339206 423034
13042 423034 540634 709421 948817 1263248 1604169 1827914 1762763 1421734 1031001 754311
13032 754311 585347 481524 411522 359672 322489 294468 271135 256796 244580 233055 221953
13021 221953 208997 199845 195621 193025 184558 178170 170770 164811 154086 144881 137066 132545 131217 133882
13007 133882 132806 125975 116688 108442 101715 98514 90525 84711 82145 83410 82214 80627 82304 82308 85905
$$ packed form
13101E1089L086L34l743k797j217N90L75n637p633l411m73J297J602R31k13O48
13085C4828P67l970k576k80j609k31O78K473J79k4M923J783k98N511N727J454
13069D9335j657J225L211K659N225L423q60n384j751M836K640K244K424M230K483
13054G4283M683J0239J6016J9515K0609J9252J6336J7815L2932M6527O0999Q3828
13042D23034J17600J68787K39396L14431L40921K23745o5151l41029l90733k76690
13032G54311j68964j03823p0002n1850l7183k8021k3333j4339j2216j1525j1102
13021B21953j2956r152m224k596q467o388p400n959j0725r205p815m521j328K665
13007A33882j076o831r287q246o727l201p989n814k566J265j196j587J677ML597
$$ plain form
12992 85905 86337 84990 86591 85318 82906 80338 81362 81961 87447 89503 88496 87443 87889 85108 87449
12977 87449 88353 83899 82025 80341 79766 79945 77098 74743 79443 83427 85465 82359 79613 78188 78142 78397
12961 78397 79372 82185 79876 81199 88470 95969 97821 95961 92718 89862 90239 91341 95878 97613 96652
12946 96652 91266 85992 81281 80896 82630 81464 80880 82954 80017 81476 81346 83738 84545 84835 84219 84545
12930 84545 83703 84295 84591 87884 91226 93547 93105 89935 90028 92665 91325 87578 89138 92103 91867 92389
12914 92389 94770 98061 97603 93759 91792 90584 89377 89073 94074 94492 95544 94228 90251 82912 72837
12899 72837 62921 57253 47303 45735 52181 57761 64046 68116 71955 74417 76624 80290 83627 85635
12885 85635 87097 89946 91734 91315 88077 88613 85698 85068 89212 90188 95516 97278 97767 97913 96874 99121
$$ packed form
12992H5905M32j347J601j273k412k568J024N99N486K056j007j053M46k781K341
12977H7449R04m454j874j684n75J79k847k355M700L984K038l106k746j425m6K55
12961G8397R75K813k309J323P271P499J852j860l243k856L77J102M537J735r61
12946I6652n386n274m711l85J734j166n84K074k937J459j30K392Q07K90o16L26
12930H4545q42N92K96L293L342K321m42l170R3K637j340l747J560K965k36N22
12914I2389K381L291m58l844j967j208j207l04N001M18J052j316l977p339j0075
12899G2837r916n668r950j568O446N580O285M070L839K462K207L666L337K008
12885H5635J462K849J788m19l238N36k915o30M144R76N328J762M89J46j039K247
$$ plain form
12869 99121 104073 108199 111834 115354 116924 121523 126775 129252 130776 130435 135287 139227 148452 160433
12855 160433 176654 193610 208163 219398 231770 250526 266878 285713 310615 333148 352638
12844 352638 373859 395051 413202 422906 422128 422101 430192 446122 473024 513768 569851 643937 733275
12831 733275 816947 879483 909002 902894 866614 805435 726947 642832 556243 474140 404517 354895
12819 354895 317180 296718 282850 273819 268318 270621 275618 273455 264349 261809 263824 256125 249087
12806 249087 245196 235155 225360 217318 207685 195095 194602 197364 203767 212366 212767 208065 201845 198601
12792 198601 200862 198113 190352 183528 178954 169224 159911 157688 150677 139228 117423 84580 22630
12779 22630 -78914 -228743 -414238 -567206 -619240 -541491 -402619 -278456 -184942 -118265
$$ packed form
12869I9121M952M126L635L520J570M599N252K477J524l41M852L940R225J1981
12855A60433J6221J6956J4553J1235J2372J8756J6352J8835K4902K2533J9490
12844C52638K1221K1192J8151R704p78k7Q091J5930K6902M0744N6083P4086Q9338
12831G33275Q3672O2536K9519o108l6280o1179p8488q4115q6589q2103o9623m9622
12819C54895l7715k0462j3868r031n501K303M997k163r106k540K015p699p038
12806B49087l891j0041r795q042r633j2590m93K762O403Q599M01m702o220l244
12792A98601K261k749p761o824m574r730r313k223p011j1449k1805l2843o1950
12779B2630j01544j49829j85495j52968n2034P7749J38872J24163R3514O6677
$$ plain form
12769 -118265 -64089 -19002 14048 31597 43664 48279 50036 55468 67508 81163 93568 107922
12757 107922 118106 123231 128982 137240 148031 163081 177798 193975 206893 209732 209949 214366 215527
12744 215527 211655 192471 159882 119862 97737 93813 83674 63607 43570 37718 44068 56854
12732 56854 62465 71399 89031 110622 130949 153325 174013 196802 229534 269910 312476 354460
12720 354460 400197 440142 475081 499000 507522 506962 500364 483999 456194 421474 378814 333053
12708 333053 293276 266158 242202 223291 214327 215892 222538 226906 231171 234956 240753 245215 245686
12695 245686 247802 260581 280769 312897 346824 380923 409670 429237 444575 455720 463894 475107
12683 475107 481293 488976 500190 512910 521406 523669 522000 529355 542769 556341 573395 601505 633150
$$ packed form
12769a18265N4176M5087L3050J7549J2067M615J757N432J2040J3655J2405J4354
12757A07922J0184N125N751Q258J0791J5050J4717J6177J2918K839K17M417J161
12744B15527l872j9184l2589m0020k2125l924j0139k0067k0037n852O350J2786
12732E6854N611Q934J7632K1591K0327K2376K0688K2789L2732M0376M2566M1984
12720C54460M5737L9945L4939K3919Q522n60o598j6365k7805l4720m2660m5761
12708C33053l9777k7118k3956j8911q964J565O646M368M265L785N797M462M71
12695B45686K116J2779K0188L2128L3927L4099K8747J9567J5338J1145Q174J1213
12683D75107O186P683J1214J2720Q496K263j669P355J3414J3572J7054K8110L1645
$$ plain form
12670 633150 666523 704797 737669 763231 776151 784562 793037 798623 805759 815027 823630 827554 833233
12657 833233 845142 853337 867519 886269 916826 963431 1028341 1112675 1215712 1346562 1506108
12646 1506108 1704602 1946120 2212495 2392057 2343717 2104224 1860852 1728655 1669667 1639049
12636 1639049 1617140 1606089 1596529 1592623 1596211 1598930 1597462 1591211 1590374 1603438 1634777 1678627 1737037
12623 1737037 1813449 1903651 1989049 2058643 2128644 2220990 2341293 2493821 2689424 2939257
12613 2939257 3233600 3537362 3847198 4173484 4536871 4965302 5487801 6122237 6883084
12604 6883084 7798866 8929534 10382372 12291301 14770047 17776655 21232028 25356102
12596 25356102 30717836 37908307 47526849 60337530 77585439 101379307 134753848
$$ packed form
12670F33150L3373L8274L2872K5562J2920Q411Q475N586P136R268Q603L924N679
12657H33233J1909Q195J4182J8750L0557M6605O4910Q4334J03037J30850J59546
12646A506108J98494K41518K66375J79562m8340k39493k43372j32197n8988l0618
12636A639049k1909j1051r560l906L588K719j468o251q37J3064L1339M3850N8410
12623A737037P6412R0202Q5398O9594P0001R2346J20303J52528J95603K49833
12613B939257K94343L03762L09836L26286L63387M28431N22499O34436P60847
12604F883084R15782J130668J452838J908929K478746L006608L455373M124074
12596B5356102N361734P190471R618542J2810681J7247909K3793868L3374541
$$ plain form
12589 134753848 180751559 238561125 295840513 326651967 306587909 242393697 173867470
12582 173867470 126891505 98507478 80574686 68356844 59491760 52758015 47459040
12575 47459040 43224431 39876865 37180687 34769674 32407520 30244292 28510263 27268124
12567 27268124 26463766 25895800 25205082 24090768 22605107 20993725 19440352 18009283
12559 18009283 16723316 15577499 14548725 13577798 12645642 11769858 10979698 10267698 9618428
12550 9618428 9029842 8504010 8030058 7587410 7169999 6769308 6390489 6027114 5681746
12541 5681746 5368084 5081943 4814680 4563602 4343620 4150493 3982690 3831565 3676902
12532 3676902 3523620 3372519 3229089 3090374 2945918 2788590 2645433 2519550 2404609
$$ packed form
12589A34753848M5997711N7809566N7279388L0811454k0064058o4194212o8526227
12582A73867470m6975965k8384027j7932792j2217842q865084o733745n298975
12575D7459040m234609l347566k696178k411013k362154k163228j734029j242139
12567B7268124q04358n67966o90718j114314j485661j611382j553373j431069
12559A8009283j285967j145817j028774r70927r32156q75784p90160p12000o49270
12550I618428n88586n25832m73952m42648m17411m00691l78819l63375l45368
12541E681746l13662k86141k67263k51078k19982j93127j67803j51125j54663
12532C676902j53282j51101j43430j38715j44456j57328j43157j25883j14941
$$ plain form
12523 2404609 2303806 2214883 2124544 2033552 1947237 1860454 1772132 1681691 1595544 1520082 1455010
12512 1455010 1404256 1360935 1315423 1265533 1210128 1160309 1110472 1065583 1044269 1026710 1007865
12501 1007865 988894 968901 948105 921390 896564 873475 848681 822978 798358 780237 773045
12490 773045 766573 752101 741248 733957 729170 721869 717489 717344 718568 725096 731096 734580 736483 739260
12476 739260 736478 727071 723684 727325 738867 759555 783798 815521 848516 877549 895818 904599
12464 904599 917012 931155 943301 955694 967942 980724 990586 995760 989383 982497 983533 998941
12452 998941 1023903 1054399 1097633 1147655 1194195 1242471 1298374 1358867 1431442 1515045 1604473
12441 1604473 1706071 1824879 1963163 2132089 2323887 2534622 2771285 3046256 3371234
$$ packed form
12523B404609j00803q8923r0339r0992q6315q6783q8322r0441q6147p5462o5072
12512A455010n0754m3321m5512m9890n5405m9819m9837m4889k1314j7559j8845
12501A007865j8971j9993k0796k6715k4826k3089k4794k5703k4620j8121p192
12490G73045o472j4472j0853p291m787p301m380j45J224O528O000L484J903K777
12476G39260k782r407l387L641J1542K0688K4243L1723L2995K9033J8269Q781
12464I04599J2413J4143J2146J2393J2248J2782R862N174o377o886J036J5408
12452I98941K4962L0496M3234N0022M6540M8276N5903O0493P2575Q3603Q9428
12441A604473J01598J18808J38284J68926J91798K10735K36663K74971L24978
$$ plain form
12432 3371234 3781879 4296649 4928698 5694210 6598402 7652404 8867148 10254092 11847423
12423 11847423 13708103 15951092 18788875 22522518 27564013 34470859 43896274 56330491
12415 56330491 71626268 88649351 105651629 121049345 133436019 141282256 143042807
12408 143042807 138215928 127898345 114127442 98629240 82740832 67864392 55427585
12401 55427585 46160427 39758747 35362037 32227852 29853736 27889357 26104009 24422823
12393 24422823 22894038 21527754 20284541 19130241 18037698 16995396 16000286 15050416
12385 15050416 14136738 13242150 12373270 11538383 10751599 10026757 9358237 8737121 8164238
12376 8164238 7638696 7155839 6711953 6304258 5927801 5575635 5243714 4929931 4636778
$$ packed form
12432C371234M10645N14770O32049P65512R04192J054002J214744J386944J593331
12423A1847423J860680K242989K837783L733643N041495O906846R425415J2434217
12415E6330491J5295777J7023083J7002278J5397716J2386674P846237J760551
12408A43042807m826879j0317583j3770903j5498202j5888408j4876440j2436807
12401E5427585r267158o401680m396710l134185k374116j964379j785348j681186
12393B4422823j528785j366284j243213j154300j092543j042302r95110r49870
12385A5050416r13678q94588q68880q34887p86784p24842o68520o21116n72883
12376H164238n25542m82857m43886m07695l76457l52166l31921l13783k93153
$$ plain form
12367 4636778 4362064 4105360 3863664 3640600 3438816 3256265 3092355 2943994 2811886
12358 2811886 2695007 2586653 2486658 2386027 2286461 2190326 2094492 1998370 1911437 1824154 1736727
12347 1736727 1653179 1578613 1513036 1448426 1387469 1329378 1267475 1206885 1151639 1094243 1039443
12336 1039443 990613 944632 901477 862473 822594 786502 747701 714386 687755 664505 648175
12325 648175 626003 604588 585640 564345 538107 509882 483200 457443 431124 408973 390308
12314 390308 376412 362191 346470 331384 316110 306615 302853 299855 299356 300889 299262 300485 302048
12301 302048 306592 306864 307147 301450 293878 297682 306423 314386 323883 328875 333458 336828 336690 336514 333595
12286 333595 327169 319401 314028 305892 292630 277165 266568 259079 258089 260443 263556 258974 250037 239984
$$ packed form
12367D636778k74714k56704k41696k23064k01784j82551j63910j48361j32108
12358B811886j16879j08354r9995j00631r9566r6135r5834r6122q6933q7283q7427
12347A736727q3548p4566o5577o4610o0957n8091o1903o0590n5246n7396n4800
12336A039443m8830m5981m3155l9004l9879l6092l8801l3315k6631k3250j6330
12325F48175k2172k1415j8948k1295k6238k8225k6682k5757k6319k2151j8665
12314C90308j3896j4221j5721j5086j5274r495l762k998m99J533j627J223J563
12301C02048M544K72K83n697p572L804Q741P963R497M992M583L370j38j76k919
12286C33595o426p768n373q136j3262j5465j0597p489r90K354L113m582q937j0053
$$ plain form
12272 239984 238751 243240 247801 249700 255636 260792 267112 274109 282002 284129 283435 280758 278388 278221 278253
12257 278253 279571 279549 273560 257923 247280 241471 237107 228001 219319 212449 206777 211139 222082 231775
12243 231775 238420 244120 253616 266834 277078 286631 297635 311598 324153 331491 339184 340547 340577
12230 340577 343722 351711 369596 392650 424652 459007 495024 528676 552621 565818 566251 550411
12218 550411 517276 474050 426781 380144 338580 307348 282870 262856 242234 229030 217175
12207 217175 202070 190919 182937 174321 165843 157007 149314 142198 136231 130439 125710 119251 116042 114961
12193 114961 109035 105512 97729 89992 84823 82538 85381 87118 89565 90352 89494 84361 82149 86772 94962
12178 94962 100779 111819 120476 118029 107119 97416 90613 89920 88623 87790 88992 90173 92723 93098 93578
$$ packed form
12272B39984j233M489M561J899N936N156O320O997P893K127o94k677k370j67L2
12257B78253J318k2n989j5637j0643n809m364r106q682o870n672M362J0943R693
12243B31775O645N700R496J3218J0244R553J1004J3963J2555P338P693J363L0
12230C40577L145P989J7885K3054L2002L4355L6017L3652K3945J3197M33j5840
12218E50411l3135m3226m7269m6637m1564l1232k4478k0014k0622j3204j1855
12207B17175j5105j1151p982q616q478q836p693p116n967n792m729o459l209j081
12193A14961n926l523p783p737n169k285K843J737K447P87q58n133k212M623Q190
12178I4962N817J1040Q657k447j0910r703o803o93j297q33J202J181K550L75M80
$$ plain form
12163 93578 97612 97112 94160 96227 96690 94212 92296 90459 84754 80862 81384 81899 85302 85477 84089 89068
12147 89068 92923 90346 94149 99407 101839 115169 131210 147733 166162 190404 223472 265264 318041
12134 318041 394931 507428 666111 888427 1190125 1535629 1802373 1800920 1497798 1103132
12124 1103132 798175 607315 498084 431094 384632 355010 326542 297858 277684 265937 256769
12113 256769 247406 247153 243015 240898 243333 251124 263587 283683 309425 341301 387622 454599 554840
12100 554840 681185 802841 876277 855819 760710 644152 562117 530482 546293 605951 696353
12089 696353 795358 860290 843291 736433 592526 471172 382692 327391 291279 258867 233366
12078 233366 217217 208148 199408 191093 181989 166699 153601 144115 135954 133225 131225 124790 119685
$$ packed form
12163I3578M034n00k952K067M63k478j916j837n705l892N22N15L403J75j388M979
12147H9068L855k577L803N258K432J3330J6041J6523J8429K4242L3068M1792N2777
12134C18041P6890J12497J58683K22316L01698L45504K66744j453l03122l94666
12124A103132l04957j90860j09231o6990m6462k9622k8468k8684k0174j1747r168
12113B56769r363k53m138k117K435P791J2463K0096K5742L1876M6321O6977J00241
12100E54840J26345J21656P3436k0458r5109j16558q2035l1635J5811N9658R0402
12089F96353R9005O4932j6999j06858j43907j21354q8480n5301l6112l2412k5501
12078B33366j6149r069q740q315r104j5290j3098r486q161k729k000o435n105
$$ plain form
12065 119685 117318 115244 106187 101600 99867 97481 96117 90795 88088 82527 75257 67472 63479 60581
12051 60581 55662 46292 37174 36664 42399 39004 36214 39513 38360 32455 27276 29196 30235 28992 31911
12036 31911 37601 41016 44435 45724 50210 56009 54596 49487 40364 32914 34054 38909 40647 38258
12022 38258 33247 30416 25161 24648 29841 31828 29757 28228 24156 20228 20319 21633 25928 29401 36656
12007 36656 40305 39787 44514 53811 57696 59522 62412 68039 78645 91534 105551 118183 133861
11994 133861 157613 188309 230845 289604 364550 456887 549975 637905 710111 762747 785469
11983 785469 778834 734477 666240 585040 500001 419841 350630 296331 255575 225434 199493 178389
11971 178389 159711 151702 152103 148874 145232 138590 128458 119416 119754 122131 117144 111348 106455 102801
$$ packed form
12065A19685k367k074r057m587j733k386j364n322k707n561p270p785l993k898
12051F0581m919r370r118n10N735l395k790L299j153n905n179J920J039j243K919
12036C1911N690L415L419J289M486N799j413n109r123p450J140M855J738k389
12022C8258n011k831n255n13N193J987k071j529m072l928R1J314M295L473P255
12007C6656L649n18M727R297L885J826K890N627J0606J2889J4017J2632J5678
11994A33861K3752L0696M2536N8759P4946R2337R3088Q7930P2206N2636K2722
11983G85469o635m4357o8237q1200q5039q0160o9211n4299m0756l0141k5941k1104
11971A78389j8678q009M01l229l642o642j0132r042L38K377m987n796m893l654
$$ plain form
11957 102801 97110 89338 82381 78226 76904 75275 73975 68194 65054 68432 72004 71719 67891 64922
11943 64922 59726 51030 45605 42610 40848 39288 34689 30783 28062 28153 28229 26678 32156 35521 36974
11928 36974 38513 35938 32773 33205 34323 29965 29488 28571 26796 28254 33340 34808 39568 52457 55602
11913 55602 58684 61343 63338 69764 80829 88994 100606 114710 132313 160609 194482 234015 292063
11900 292063 365267 453102 544189 623787 691716 735183 753864 743532 706726 647410 571494
11889 571494 493697 415228 345382 290222 248672 215886 195466 181738 168768 157056 142655
11878 142655 137513 130754 121323 111341 103856 94568 87361 81656 77617 70372 68426 65256 55966 52748
11864 52748 52023 53065 54191 48707 41895 39864 35989 34687 36911 35560 38058 40127 39765 39267 37532
$$ packed form
11957A02801n691p772o957m155j322j629j300n781l140L378L572k85l828k969
11943F4922n196q696n425k995j762j560m599l906k721R1P6j551N478L365J453
11928C6974J539k575l165M32J118m358m77r17j775J458N086J468M760J2889L145
11913E5602L082K659J995O426J1065Q165J1612J4104J7603K8296L3873L9533N8048
11900B92063P3204Q7835R1087P9598O7929M3467J8681j0332l6806n9316p5916
11889E71494p7797p8469o9846n5160m1550l2786k0420j3728j2970j1712j4401
11878A42655n142o759r431r982p485r288p207n705m039p245j946l170r290l218
11864E2748p25J042J126n484o812k031l875j302K224j351K498K069l62m98j735
$$ plain form
11849 37532 33121 30161 32205 30914 29433 30771 33824 33801 35603 40784 49256 58537 67431 79046 98009
11834 98009 127500 169016 228529 301327 349115 323039 239016 165988 123138 97352 84542 74636
11822 74636 66644 58822 53713 43771 39429 36426 31402 32615 34729 34247 33306 33837 35747 31035 28524
11807 28524 24551 23273 22945 24398 29158 27191 22569 19250 21436 20967 21688 18432 17443 18978 20238
11792 20238 16085 13190 10935 8643 6875 5695 8411 8971 8899 8630 11001 12119 11194 11261 9455 12291
11776 12291 10503 7839 6666 7462 10646 13014 12545 10953 6963 2528 835 -1012 2007 5180 4635
11761 4635 4586 4848 2905 2077 3287 167 3241 3000 1696 -2405 -5011 -619 3674 4509 4317 3588 3187
11744 3187 6481 10513 13549 13074 8970 9952 8122 5439 6668 7258 7446 8156 4949 2590 2815 5667
$$ packed form
11849C7532m411k960K044j291j481J338L053k3J802N181Q472R281Q894J1615J8963
11834I8009K9491M1516N9513P2798M7788k6076q4023p3028m2850k5786j2810r906
11822G4636p992p822n109r942m342l003n024J213K114m82r41N31J910m712k511
11807B8524l973j278l28J453M760j967m622l319K186m69P21l256r89J535J260
11792B0238m153k895k255k292j768j180K716N60p2k69K371J118r25O7j806K836
11776A2291j788k664j173P96L184K368m69j592l990m435j693j847L019L173n45
11761D635m9K62j943q28J210l120L074k41j304m101k606M392M293Q35j92p29m01
11744C187L294M032L036m75m104R82j830k683J229N90J88P10l207k359K25K852
$$ plain form
11728 5667 5015 4657 5995 2474 -6410 -7044 -3197 3010 2896 2577 4795 2523 4709 6073 3731 788
11712 788 2025 6343 9892 11934 10886 10743 8912 9010 13183 10002 7728 9847 8840 4691 4322 3263
11696 3263 2065 3014 1271 338 -965 367 1828 3752 6410 7555 5719 5213 4927 5001 3534 -319
11680 -319 -1636 -3388 -3209 667 1983 1481 1457 5160 9465 9002 5470 4475 6920 5527 -2178 -1133
11664 -1133 492 2901 6462 10569 12288 8163 5752 5509 5299 3154 3312 5774 7023 6448 4124 2287
11648 2287 4425 7679 5691 5175 5292 5926 6640 4802 105 -1644 816 3139 4396 552 -5128 -7175
11632 -7175 -5365 -5741 -6567 -4664 -1038 1312 5793 6096 3856 -1301 -1587 3017 4078 3625 5110 2735
11616 2735 -233 -3318 -8225 -8577 -2926 2205 2206 2578 2523 1655 228 1878 1664 -1061 -821 4151 5647
$$ packed form
11728E667o52l58J338l521q884o34L847O207j14l19K218k272K186J364k342k943
11712G88J237M318L549K042j048j43j831R8M173l181k274K119j007m149l69j059
11696C263j198R49j743r33j303J332J461J924K658J145j836n06k86P4j467l853
11680c19j317j752J79L876J316n02k4L703M305m63l532r95K445j393p705J045
11664a133J625K409L561M107J719m125k411k43k10k145J58K462J249n75k324j837
11648B287K138L254j988n16J17O34P14j838m697j749K460K323J257l844n680k047
11632g175J810l76q26J903L626K350M481L03k240n157k86M604J061m53J485k375
11616B735k968l085m907l52N651N131JL72n5q68j427J650k14k725K40M972J496
$$ plain form
11599 5647 5022 3997 983 -1377 -2425 -5440 -2033 1356 3128 2490 733 -312 5073 5060 4994 4486
11583 4486 2127 4269 8291 6173 -203 -3992 -1268 895 -145 -995 1934 3216 6087 4830 2692
11568 2692 653 7947 11484 5968 4675 2414 935 94 -855 161 675 -2878 -2019 1358 3471 3324
11552 3324 -1664 -1257 -2942 -3617 -1006 4196 2978 -1676 -742 -2050 1954 3163 2839 3711 4926 6160
11536 6160 3595 408 323 -378 583 2951 190 -809 -802 4075 4344 -397 -2270 -4730 -5400 -5820 -6300 -7181
11518 -7181 -5666 -3046 1051 3812 6684 4963 5957 8608 4147 3204 2394 -203 -4467 -6354 -8023
11503 -8023 -9787 -8350 -4331 -4102 -949 2143 568 -3358 -5437 -4321 145 890 174 1479 -1808
11488 -1808 -6146 -6885 -6437 -6059 -2345 535 2501 6678 4719 4323 6847 6054 6552 8172 7714 7247 6582
$$ packed form
11599E647o25j025l014k360j048l015L407L389J772o38j757j045N385j3o6n08
11583D486k359K142M022k118o376l789K724K163j040q50K929J282K871j257k138
11568B692k039P294L537n516j293k261j479q41r49J016N14l553Q59L377K113j47
11552C324m988M07j685o75K611N202j218m654R34j308M004J209l24Q72J215J234
11536F160k565l187q5p01R61K368k761r99PM877K69m741j873k460o70m20m80q81
11518g181J515K620M097K761K872j721R94K651m461r43q10k597m264j887j669
11503h023j764J437M019K29L153L092j575l926k079J116M466P45p16J305l287
11488a808m338p39M48L78L714K880J966M177j959l96K524p93M98J620m58m67o65
$$ plain form
11471 6582 3243 2558 -2256 -4835 -3324 1694 3683 4364 2406 -340 445 -4371 -6852 -1065 -171 1698
11455 1698 4080 6136 5894 8815 7854 9956 8388 5951 477 -968 1400 1689 2287 -8 -1902 -2956
11439 -2956 -1961 -1022 5860 11578 9269 7250 9800 7124 5156 4536 2454 3868 4197 4078 1192 1232
11423 1232 1848 4846 7048 5869 4107 2132 -2911 -2711 -2355 -663 2024 1711 -2637 -6525 -8458 -8599
11407 -8599 -7599 -8476 -7970 -8221 -5551 -2509 2896 6760 8965 8674 6398 5100 4754 2469 1134 2162
11391 2162 7275 5841 478 -395 1122 -578 631 -2490 1317 5528 6473 5197 794 -1755 -959
11376 -959 1945 117 793 3480 5508 6255 5770 5467 5314 4671 1312 3608 657 -4338 -2495 149
11360 149 2531 1372 253 211 1914 5530 8725 5004 2217 5216 5342 3442 868 -677 -4122 -3893
$$ packed form
11471F582l339o85m814k579J511N018J989O81j958k746P85m816k481N787Q94J869
11455A698K382K056k42K921r61K102j568k437n474j445K368K89N98k295j894j054
11439b956R95R39O882N718k309k019K550k676j968o20k082J414L29j19k886M0
11423A232O16K998K202j179j762j975n043K00L56J692K687l13m348l888j933j41
11407h599J000q77N06k51K670L042N405L864K205k91k276j298l46k285j335J028
11391B162N113j434n363q73J517j700J209l121L807M211R45j276m403k549P96
11376i59K904j828O76K687K028P47m85l03j53o43l359K296k951m995J843K644
11360A49K382j159j119m2J703L616L195l721k787K999J26j900k574j545l445K29
$$ plain form
11344 -3893 -331 -1360 216 455 -1998 -2599 -5632 -3383 175 2393 -1680 -3592 -2200 -2483 -5256
11329 -5256 -3092 -1290 -2236 -3435 -3278 -3906 3704 5351 3882 2179 -201 2639 4389 3713 8321 8779
11313 8779 9481 5106 1813 1696 2196 5339 8327 9565 7847 7037 5867 7067 9010 9468 4263 2480
11297 2480 1289 -3211 -1337 1491 777 2100 862 3159 2503 518 -27 2453 3856 3286 781 -568
11281 -568 4836 6845 5751 3342 2871 5315 9567 12975 8758 6441 8477 8412 7734 8992 1592 -2412
11265 -2412 320 3487 3281 4005 5518 3718 5197 6018 8368 9873 10453 9322 10250 8760 6575 9495
11249 9495 6041 3301 5098 336 -2424 -3575 -4111 -4623 -5249 -4310 -965 1701 604 1021 4363 10339
11233 10339 13846 10844 10473 12263 11602 9550 4802 835 -646 -521 3201 6722 4291 6693 7340
$$ packed form
11344c893L562j029J576K39k453o01l033K249L558K218m073j912J392k83k773
11329e256K164J802r46j199J57o28P610J647j469j703k380K840J750o76M608M58
11313H779P02m375l293j17N00L143K988J238j718q10j170J200J943M58n205j783
11297B480j191m500J874K828p14J323j238K297o56j985n45K480J403n70k505j349
11281e68N404K009j094k409m71K444M252L408m217k317K036o5o78J258p400m004
11265b412K732L167k06P24J513j800J479Q21K350J505N80j131R28j490k185K920
11249I495l454k740J797m762k760j151n36n12o26R39L345K666j097M17L342N976
11233A0339L507l002l71J790o61k052m748l967j481J25L722L521k431K402O47
$$ plain form
11218 7340 8207 4924 8949 7421 4065 6068 9973 8055 3986 244 1545 54 -195 1816 4965
11203 4965 2902 979 -678 -873 -4306 -4116 -2441 293 3297 6672 6717 6006 5336 4383 5229 8567 10049
11186 10049 9104 11374 14488 15077 15191 12790 10736 8859 3858 7732 12061 14872 13875 14184 10289 6305
11170 6305 7995 6984 7224 8344 6956 5294 8737 4688 6821 10729 15565 17297 14760 13013 12323
11155 12323 12584 11589 12405 8130 4084 1301 1333 2599 2547 2322 1827 2027 346 -190 1451 8435 12945
11138 12945 12086 10462 10252 11118 12885 15043 15222 15149 12612 14578 12926 11750 12920 14854 12562 11898
11122 11898 10837 10876 9517 9529 8571 8600 9871 8992 11415 13724 14252 16277 16975 14039 13946 16952 18985
11105 18985 21759 23147 20780 23894 25119 25045 27832 28228 23875 27009 30005 30326 29145 28664 29387 27947
$$ packed form
11218G340Q67l283M025j528l356K003L905j918m069l742J301j491k49K011L149
11203D965k063j923j657j95l433J90J675K734L004L375M5p11o70r53Q46L338J482
11186A0049r45K270L114N89J14k401k054j877n001L874M329K811r97L09l895l984
11170F305J690j011K40J120j388j662L443m049K133L908M836J732k537j747o90
11155A2323K61r95Q16m275m046k783L2J266n2k25m95K00j681n36J641O984M510
11138A2945q59j624k10Q66J767K158J79p3k537J966j652j176J170J934k292o64
11122A1898j061L9j359J2r58K9J271q79K423K309N28K025O98k936r3L006K033
11105A8985K774J388k367L114J225p4K787L96m353L134K996L21j181m81P23j440
$$ plain form
11089 27947 28156 26663 18887 14699 16445 18774 18848 21523 21379 20622 17916 18448 20338 20339 16901 14808 13067
11072 13067 16533 19429 20596 22170 19766 20883 25495 27202 27749 25081 22702 20464 20548 25315 30296
11057 30296 29456 24458 27304 28488 23657 13888 11708 11136 11587 18724 23324 22427 23423 22379 22911 18714
11041 18714 18639 20065 19117 18458 20116 23977 22180 23955 22668 25990 33513 30927 24863 27283 27775 27117
11025 27117 30563 29640 29268 30015 26668 24358 26156 29244 31369 30646 31767 29786 28501 24795 19506
11010 19506 21557 20750 14698 14171 15784 25687 31302 29889 27977 25143 27048 29228 29669 30605 29290
10995 29290 21563 22391 28463 31664 35999 39772 38253 42543 41965 40048 38424 32403 29048 30095 29688
10980 29688 27661 24737 26656 26026 22092 21248 18340 20564 25247 28299 31492 31034 28351 30349 30176
$$ packed form
11089B7947K09j493p776m188J746K329P4K675j44p57k706N32J890Jl438k093j741
11072A3067L466K896J167J574k404J117M612J707N47k668k379k238Q4M767M981
11057C0296q40m998K846J184m831r769k180n72M51P137M600q97R96j044N32m197
11041A8714p5J426r48o59J658L861j797J775j287L322P523k586o064K420M92o58
11025B7117L446r23l72P47l347k310J798L088K125p23J121j981j285l706n289
11010A9506K051q07o052n27J613R903N615j413j912k834J905K180M41R36j315
10995B9290p727Q28O072L201M335L773j519M290n78j917j624o021l355J047m07
10980B9688k027k924J919o30l934q44k908K224M683L052L193m58k683J998j73
$$ plain form
10965 30176 28752 26529 25814 27781 31234 33855 34089 34686 34524 35340 32067 35236 36212 31680 27828 24472
10949 24472 20908 19781 16855 14460 11966 10954 8927 6019 10276 15887 17232 18727 19256 17128 20876
10934 20876 25369 24601 19463 14397 17654 23361 24596 24772 27800 27616 29734 33921 37494 36758 27900
10919 27900 24073 23661 24020 29039 31847 34493 32304 28648 29447 33249 44341 53907 51533 50532 48899
10904 48899 39358 41364 45668 41832 38406 36413 40243 41589 39846 38167 36803 39754 41407 42267 45596
10889 45596 48443 51212 57958 60848 63958 68080 73697 74568 73582 81003 87422 92509 100581 109515 121964
10874 121964 139897 165670 198146 239631 296233 361827 450657 582490 769928 1032161 1354398
10863 1354398 1662614 1792276 1611773 1230335 892511 675077 537399 443581 381440 338000
$$ packed form
10965C0176j424k223p15J967L453K621K34N97j62Q16l273L169R76m532l852l356
10949B4472l564j127k926k395k494j012k027k908M257N611J345J495N29k128L748
10934B0876M493p68n138n066L257N707J235J76L028j84K118M187L573p36q858
10919B7900l827m12L59N019K808K646k189l656P99L802J1092R566k374j001j633
10904D8899r541K006M304l836l426j993L830J346j743j679j364K951J653Q60L329
10889D5596K847K769O746K890L110M122N617Q71r86P421O419N087Q072Q934J2449
10874A21964J7933K5773L2476M1485N6602O5594Q8830J31833J87438K62233L22237
10863A354398L08216J29662j80503l81438l37824k17434j37678r3818o2141m3440
$$ plain form
10853 338000 304342 281072 259435 241962 227510 214078 203775 198496 194971 192915 193214 194567 191144
10840 191144 185101 176074 166123 156464 147308 137884 130461 126467 121376 115313 109976 105568 103961 100520
10826 100520 100452 100795 96291 94705 86909 84490 88611 93617 90626 87624 88353 90330 92208 90397 92138
10811 92138 92321 88301 87039 90910 92455 90083 87128 79059 72912 71702 66581 64584 64552 56046 55503
10796 55503 56979 58083 56495 57166 58919 62521 65044 64083 62962 66939 73931 79611 80121 76735 77133
10781 77133 67413 65752 71572 67453 61459 62787 64500 67241 68493 69056 68737 69614 70116 68357 67796 66815
10765 66815 68785 66605 68115 71705 67929 63148 59262 53706 47187 38605 28082 21975 26408 37183
10751 37183 44199 45704 42435 38001 38246 41121 47558 50189 52929 56353 63275 68838 71905 68145 67013
$$ packed form
10853C38000l3658k3270k1637j7473j4452j3432j0303n279l525k056K99J353l423
10840A91144o043r027r951r659r156r424p423l994n091o063n337m408j607l441
10826A00520o8L43m504j586p796k419M121N006k991l002P29J977J878j811J741
10811I2138J83m020j262L871J545k372k955q069o147j210n121j997l2q506n43
10796E5503J476J104j588O71J753L602K523r61j121L977O992N680N10l386L98
10781G7133r720j661N820m119n994J328J713K741J252N63l19Q77N02j759n61r81
10765F6815J970k180J510L590l776m781l886n556o519q582j0523o107M433J0775
10751C7183P016J505l269m434K45K875O437K631K740L424O922N563L067l760j132
$$ plain form
10736 67013 65297 65800 65729 65656 65243 62463 59610 60974 65468 70634 72768 74988 79845 83572 88653 92653
10720 92653 98716 105789 102987 101709 101826 109636 124659 136969 149520 158764 167772 178236 188727
10707 188727 198369 212455 232669 250595 269662 283188 296561 307719 306730 292914 273973 248473
10695 248473 224589 197555 172101 152512 140006 131342 125725 122364 117598 111164 108262 103608 100817
10682 100817 100861 105957 104134 99734 97237 97510 100764 99132 100210 101983 108843 118129 124368 125666 126773
10667 126773 127194 127363 121583 116593 111068 111469 108902 102951 100421 103124 114914 123496 126802 129151 123402
10652 123402 122679 126816 132602 134585 128134 122240 117272 111697 104946 98989 90116 74344 48359 5582
10638 5582 -59376 -160567 -308350 -486879 -631663 -666194 -580595 -446945 -330684 -239603 -166396
$$ packed form
10736F7013j716N03p1p3m13k780k853J364M494N166K134K220M857L727N081M000
10720I2653O063P073k802j278J17P810J5023J2310J2551R244R008J0464J0491
10707A88727R642J4086K0214J7926J9067J3526J3373J1158r89j3816j8941k5500
10695B48473k3884k7034k5454j9589j2506q664n617l361m766o434k902m654k791
10682A00817M4N096j823m400k497K73L254j632J078J773O860R286O239J298J107
10667A26773M21J69n780m990n525M01k567n951k530K703J1790Q582L306K349n749
10652A23402p23M137N786J983o451n894m968n575o751n957q873j5772k5985m2777
10638E582o4958j01191j47783j78529j44784l4531Q5599J33650J16261R1081P3207
$$ plain form
10627 -166396 -106698 -56028 -22507 10372 31750 43089 44158 47306 53335 56302 59768 66745 70251
10614 70251 73688 74091 80853 93349 105418 119476 136039 146736 148754 150393 154640 153198 144949
10601 144949 126479 94536 55403 31156 29326 24593 3648 -17951 -20793 -12578 -3733 2760 7876
10588 7876 21531 38504 62446 83099 101910 121771 151983 195595 242503 285133 329212 372199
10576 372199 406448 423562 428753 428905 417931 389387 349177 304207 257545 215939 181449 156054
10564 156054 139719 130087 129963 141636 152217 160851 167673 172622 173428 176063 180376 186913 197259 217099
10550 217099 247355 271061 288541 309923 333070 355317 371393 378435 384367 388585 392860 396440
10538 396440 400623 402260 402088 398885 397742 403998 410542 424141 439272 461361 486836 513084 536421
$$ packed form
10627a66396N9698N0670L3521L2879K1378J1339J069L148O029K967L466O977L506
10614G0251L437M03O762J2496J2069J4058J6563J0697K018J639M247j442q249
10601A44949j8470l1943l9133k4247j830m733k0945k1599k842Q215Q845O493N116
10588G876J3655J6973K3942K0653J8811J9861L0212M3612M6908M2630M4079M2987
10576C72199L4249J7114N191J52j0974k8544m0210m4970m6662m1606l4490k5395
10564A56054j6335r632j24J1673J0581Q634O822M949Q06K635M313O537J0346J9840
10550B17099L0256K3706J7480K1382K3147K2247J6076P042N932M218M275L580
10538C96440M183J637j72l203j143O256O544J3599J5131K2089K5475K6248K3337
$$ plain form
10525 536421 558176 572222 575282 580779 591107 606412 621709 636008 644495 654876 657974 658312 655143
10512 655143 654040 657146 665576 676547 680533 684511 689266 692613 688890 681148 676606 686868 716092
10499 716092 764252 822953 881879 950486 1031045 1111218 1175436 1224777 1257552 1283301 1308693
10488 1308693 1327321 1340360 1356101 1385338 1433352 1491592 1564731 1654614 1754055 1851715 1941519
10477 1941519 2034925 2148156 2290671 2473295 2708032 3002058 3326897 3660122 4009167 4386083
10467 4386083 4827631 5368116 6055599 6925152 7974550 9110043 10194831 11213763 12470945
10458 12470945 14358282 17049170 20596138 25128355 30910996 38357978 48086942 60886333
10450 60886333 78024338 101697130 134962926 180547787 236998150 291391654 317985019
$$ packed form
10525E36421K1755J4046L060N497J0328J5305J5297J4299Q487J0381L098L38l169
10512F55143j103L106Q430J0971L986L978M755L347l723p742m542J0262K9224
10499G16092M8160N8701N8926O8607Q0559Q0173O4218M9341L2775K5749K5392
10488A308693J8628J3039J5741K9237M8014N8240P3139Q9883R9441R7660Q9804
10477A941519R3406J13231J42515J82624K34737K94026L24839L33225L49045L76916
10467D386083M41548N40485O87483Q69553J049398J135493J084788J018932J257182
10458A2470945J887337K690888L546968M532217N782641P446982R728964J2799391
10450F0886333J7138005K3672792L3265796M5584861N6450363N4393504K6593365
$$ plain form
10443 317985019 293143959 227296274 164070337 122311225 96272586 79148727 67198297
10436 67198297 58460460 51790930 46454497 42069423 38506454 35669951 33426203 31658792
10428 31658792 30290386 29244193 28375765 27519894 26628857 25623637 24306338 22738071
10420 22738071 21122649 19580966 18135671 16817200 15650780 14604967 13625319 12687548
10412 12687548 11805579 11002748 10279798 9623566 9033738 8507165 8021436 7563145 7129305
10403 7129305 6714475 6315543 5932837 5568124 5238232 4940571 4665069 4418274 4206891
10394 4206891 4025179 3867119 3725094 3588587 3445223 3306671 3171628 3041019 2899671
10385 2899671 2744852 2597259 2461711 2342329 2230718 2123047 2023355 1929531 1837700 1742326
$$ packed form
10443C17985019k4841060o5847685o3225937m1759112k6038639j7123859j1950430
10436F7198297q737837o669530n336433m385074l562969k836503k243748j767411
10428C1658792j368406j046193q68428q55871q91037j005220j317299j568267
10420B2738071j615422j541683j445295j318471j166420j045813r79648r37771
10412A2687548q81969q02831p22950o56232n89828n26573m85729m58291m33840
10403G129305m14830l98932l82706l64713l29892k97661k75502k46795k11383
10394D206891j81712j58060j42025j36507j43364j38552j35043j30609j41348
10385B899671j54819j47593j35548j19382j11611j07671r9692r3824r1831r5374
$$ plain form
10375 1742326 1645347 1548225 1458079 1379584 1315161 1257187 1199256 1140037 1082408 1027306 975412
10364 975412 923324 882168 850661 828173 808848 790160 774456 750090 721836 694200 664414
10353 664414 634209 591563 549069 521162 496921 476692 453298 424835 402093 388609 384074 381966
10341 381966 383268 379989 380980 386864 387986 386633 381538 373601 364506 360196 363906 369337 381797 404326
10327 404326 426219 451550 469412 468405 450917 428518 401919 376417 346755 327691 310704 296700
10315 296700 280443 253982 228893 217886 219757 233874 245051 255743 265365 276000 284527 289309
10303 289309 299355 306007 318208 330370 330901 336947 350302 362492 369945 372880 361356 340393 320750
10290 320750 310729 307836 291526 270069 246289 229781 227675 228344 226595 224956 230044 241526 255629
$$ packed form
10375A742326r6979r7122r0146p8495o4423n7974n7931n9219n7629n5102n1894
10364I75412n2088m1156l1507k2488j9325j8688j5704k4366k8254k7636k9786
10353F64414l0205m2646m2494k7907k4241k0229k3394k8463k2742j3484m535k108
10341C81966J302l279R91N884J122j353n095p937r095m310L710N431J2460K2529
10327D04326K1893K5331J7862j007j7488k2399k6599k5502k9662j9064j6987j4004
10315B96700j6257k6461k5089j1007J871J4117J1177J0692R622J0635Q527M782
10303B89309J0046O652J2201J2162N31O046J3355J2190P453K935j1524k0963j9643
10290C20750j0021k893j6310k1457k3780j6508k106O69j749j639N088J1482J4103
$$ plain form
10277 255629 263595 270723 279433 287932 293925 305714 325236 343993 356968 360527 358479 360341 360242 362103
10263 362103 374990 405524 448197 503865 580341 675364 781108 890521 967308 943620 781617
10252 781617 559152 394731 309530 270586 256393 243970 234018 228872 225064 213302 200495 187152
10240 187152 177105 170205 165885 161743 155472 148849 140799 137828 136468 137601 134872 130959 123333 111572
10226 111572 97674 87436 79089 70897 63156 59535 59418 58639 60854 62542 65122 68770 70987 73035
10212 73035 73178 73519 69233 64312 64154 66093 68721 77587 85175 94718 109116 124466 134228 140317 150869
10197 150869 158972 156490 151694 152150 151177 147758 141944 131254 122952 116377 104264 95907 87282 82812
10183 82812 81188 75237 74187 70483 62483 54178 46876 36838 33969 37590 37429 36271 35314 32287 29790
$$ packed form
10277B55629P966P128Q710Q499N993J1789J9522J8757J2975L559k048J862r9J861
10263C62103J2887L0534M2673N5668P6476R5023J05744J09413P6787k3688j62003
10252G81617k22465j64421q5201l8944j4193j2423r952n146l808j1762j2807j3343
10240A87152j0047o900m320m142o271o623q050k971j360J133k729l913p626j1761
10226A11572j3898j0238q347q192p741l621j17p79K215J688K580L648K217K048
10212G3035J43L41m286m921j58J939K628Q866P588R543J4398J5350R762O089J0552
10197A50869Q103k482m796M56r73l419n814j0690q302o575j2113q357q625m470
10183H2812j624n951j050l704q000q305p302j0038k869L621j61j158r57l027k497
$$ plain form
10168 29790 29336 30879 28086 27948 33443 37812 41717 44681 47630 48931 52403 53030 51557 51698 48743
10153 48743 52073 51095 47632 50603 56069 58804 61210 59571 60730 69555 75978 73014 77639 80797 83917
10138 83917 88515 91648 97008 102909 102870 98545 93687 79540 73088 68123 66655 68803 73493 77661 80886
10123 80886 84205 85526 89710 98067 108377 114348 120627 135075 154726 170569 181600 206653 238975
10110 238975 270777 314478 376199 459946 568098 714849 915037 1197362 1587715 2093571
10100 2093571 2654088 3086706 3154608 2782465 2180187 1630488 1240108 983272 813284 695775
10090 695775 604412 535446 485132 446548 415302 392762 369935 350669 333847 322293 311577
10079 311577 301666 294917 287399 274570 257198 240823 223378 203039 191290 181847 175760 171994 165394
$$ packed form
10168B9790m54J543k793j38N495M369L905K964K949J301L472O27j473J41k955
10153D8743L330r78l463K971N466K735K406j639J159Q825O423k964M625L158L120
10138H3917M598L133N360N901l9m325m858j4147o452m965j468K148M690M168L225
10123H0886L319J321M184Q357J0310N971O279J4448J9651J5843J1031K5053L2322
10110B38975L1802M3701O1721Q3747J08152J46751K00188K82325L90353N05856
10100B093571N60517M32618O7902l72143o02278n49699l90380k56836j69988j17509
10090F95775r1363o8966n0314l8584l1246k2540k2827j9266j6822j1554j0716
10079C11577r911o749p518j2829j7372j6375j7445k0339j1749r443o087l766o600
$$ plain form
10066 165394 154714 144018 131860 124518 121841 116218 104695 101060 93880 90512 81724 73652 69013
10053 69013 67839 67661 68966 66390 64583 59833 52306 50059 51132 53346 60186 66466 62009 60782 63451
10038 63451 68539 74384 78418 81811 90693 106430 129577 155124 182921 216115 260411 316491 392342
10025 392342 498018 652058 878412 1176485 1510189 1754835 1734212 1415539 1029283 757365
10015 757365 587663 475164 397986 345601 306347 275978 250011 228972 215306 201965 191746
10004 191746 183821 175382 166926 160669 160115 158683 150535 139418 133018 127390 116847 106859 97808 92090
9990 92090 90226 89685 85808 79825 74587 68510 61967 54668 49434 47349 43952 46068 52978 52871 45501
9975 45501 41600 35441 34944 34582 33851 37192 34913 29612 26965 27709 29104 31654 36959 36211 38860 41644
$$ packed form
10066A65394j0680j0696j2158p342k677n623j1523l635p180l368q788q072m639
10053F9013j174j78J305k576j807m750p527k247J073K214O840O280m457j227K669
10038F3451N088N845M034L393Q882J5737K3147K5547K7797L3194M4296N6080P5851
10025C92342J05676J54040K26354K98073L33704K44646k0623l18673l86256k71918
10015G57365j69702j12499p7178n2385l9254l0369k5967k1039j3666j3341j0219
10004A91746p925q439q456o257n54j432q148j1117o400n628j0543r988r051n718
9990I2090j864n41l877n983n238o077o543p299n234k085l397K116O910j07p370
9975D5501l901o159m97l62p31L341k279n301k647P44J395K550N305p48K649K784
$$ plain form
9959 41644 41153 40996 32320 30105 30142 24161 22891 23280 25584 25558 26734 22729 20744 24813 25809 27118 25328
9942 25328 24861 24872 23383 23226 24928 23600 22545 19669 15528 14506 14551 13182 13656 11917 13591 15186
9926 15186 15245 13313 6093 4218 6865 7448 7936 8692 10724 10908 10269 10126 14732 18247 22602 22923 19117
9909 19117 14723 12976 8951 7949 9424 7895 5426 2431 195 2377 3276 6982 8943 5247 6136
9894 6136 11113 14770 23591 26587 26241 33812 40557 43910 54083 65762 80243 93452 107087 123705
9880 123705 151866 186814 220296 252023 276671 293618 292155 272348 243640 208115 180297 155962
9868 155962 135058 115920 101344 93397 87448 82688 77111 69754 68865 65636 63037 58062 56409 53415
9854 53415 51536 48603 45034 44081 42953 42781 38006 34562 33092 33826 34834 31559 27238 21417 20934 24311
$$ packed form
9959D1644m91j57q676k215L7n981j270L89K304k6J176m005j985M069R96J309j790
9942B5328m67J1j489j57J702j328j055k876m141j022M5j369M74j739J674J595
9926A5186N9j932p220j875K647N83M88P56K032J84o39j43M606L515M355L21l806
9909A9117m394j747m025j002J475j529k469k995k236K182Q99L706J961l696Q89
9894F136M977L657Q821K996l46P571O745L353J0173J1679J4481J3209J3635J6618
9880A23705K8161L4948L3482L1727K4648J6947j463j9807k8708l5525k7818k4335
9868A55962k0904j9138j4576p947n949m760n577p357q89l229k599m975j653k994
9854E3415j879k933l569r53j128j72m775l444j470P34J008l275m321n821m83L377
$$ plain form
9838 24311 25074 26044 27445 21823 17208 15335 15844 17549 16922 14872 15991 16416 17075 15822 14759 17555
9822 17555 13203 10136 12097 13736 12065 12764 11992 11498 10639 10327 10908 11626 10087 13242 13424 7481 1495
9805 1495 93 1685 1423 4565 4687 3441 4059 3364 2841 4656 963 -768 1380 -1573 -1581 -3348 -6091
9788 -6091 -8740 -7300 -4906 -538 387 389 -357 -2321 -3111 -2129 -2991 -7621 -7178 -2373 -5 1721 1852
9771 1852 4993 3113 5518 5156 365 -1385 538 2293 2511 2058 2900 1094 12 -1091 -1715 -3199
9755 -3199 -1697 838 2340 886 -3268 -4503 -1088 4132 8360 7808 4306 6003 5240 4797 8213 11704
9739 11704 16551 14319 8294 4950 7676 11013 10215 3929 -707 -2623 590 2514 4455 1332 508
9724 508 1588 1305 2401 1427 -2238 550 4251 1340 -2918 -7817 -5383 -326 30 -725 -1729 -3971
$$ packed form
9838B4311P63R70J401n622m615j873N09J705o27k050J119M25O59j253j063K796
9822A7555m352l067J961J639j671O99p72m94q59l12N81P18j539L155J82n943n986
9805A495j402J592k62L142J22j246O18o95n23J815l693j731K148k953qj767k743
9788f091k649J440K394M368R25Kp46j964p90R82q62m630M43M805K368J726J31
9771A852L141j880K405l62m791j750J923J755K18m53Q42j806j082j103o24j484
9755c199J502K535J502j454m154j235L415N220M228n52l502J697p63m43L416L491
9739A1704M847k232o025l344K726L337p98o286m636j916L213J924J941l123q24
9724E08J080k83J096r74l665K788L701k911m258m899K434N057L56p55j004k242
$$ plain form
9708 -3971 -3740 -2709 -2689 -697 -983 -1395 -4802 -6416 -5455 1767 4372 5896 4616 1920 4219 8093
9692 8093 8713 5510 1371 1758 4637 1686 -1108 1036 6405 9320 9275 6718 7139 9903 10783 9255
9676 9255 12201 12673 12802 15455 12178 4237 2507 3424 1580 1883 1984 2034 -2638 -3333 -3432 -1379 -2134 -4500
9658 -4500 -6907 -8367 -6045 -5953 -1343 1132 -282 -1205 1198 -27 -2212 -2808 -2097 -4348 -5309 -1687
9642 -1687 422 -876 -3750 -4987 -3607 -2265 -3123 -988 -261 -852 2089 3172 277 1043 4786 6015
9626 6015 4098 3823 2709 3005 3838 3512 1755 -3665 -5867 -1866 632 2104 5338 5662 2014 2269
9610 2269 1922 2781 2537 899 3590 2220 -352 27 2576 5207 5901 5570 4494 3196 5383 6717
9594 6717 6865 9744 11139 8233 6136 7279 7208 6620 6938 10038 9025 2403 271 3413 3223 1344
$$ packed form
9708c971K31J031K0J992k86m12l407j614R61P222K605J524j280k696K299L874
9692H093O20l203m139L87K879k951k794K144N369K915m5k557M21K764Q80j528
9676I255K946M72J29K653l277p941j730R17j844L03J01N0m672o95r9K053p55k366
9658d500k407j460K322R2M610K475j414r23K403j225k185n96P11k251r61L622
9642a687K109j298k874j237J380J342q58K135P27n91K941J083k895P66L743J229
9626F015j917k75j114K96Q33l26j757n420k202M001K498J472L234L24l648K55
9610B269l47Q59k44j638K691j370k572L79K549K631O94l31j076j298K187J334
9594F717J48K879J395k906k097J143p1n88L18L100j013o622k132L142j90j879
$$ plain form
9578 1344 1440 3008 2733 2340 -741 -1641 635 794 218 424 -1334 -3846 -626 678 2077 -242 -1291
9561 -1291 1439 5181 5447 6391 3649 1712 2605 -694 -4891 -4918 -653 -1329 -872 1695 2102 1823 2402
9544 2402 1890 -3269 -5367 3148 7063 4022 76 -973 -4530 -2849 -3678 -33 2005 513 -2711
9529 -2711 -1670 -2761 -4755 -1529 -208 -4892 -6779 -3206 -1652 -231 -1685 -2689 373 1320 1603
9514 1603 2548 49 -3591 -3454 -1026 520 756 -341 -1759 -1170 1131 5975 7636 6805 4203 2579
9498 2579 1213 1233 1601 297 -830 -1093 -2395 -2017 -427 1876 -563 1663 6071 8333 3377 -1328
9482 -1328 -3654 -1472 -1793 -1888 -3080 -3541 -286 3074 4333 4413 4761 2933 431 4248 7583 7925 9211
9465 9211 7403 5388 -1152 -286 -870 -3943 -3783 -565 3412 4872 655 -293 -3899 -2185 386 968
$$ packed form
9578A344R6J568k75l93l081r00K276J59n76K06j758k512L220J304J399k319j049
9561a291K730L742K66R44k742j937Q93l299m197k7M265o76M57K567M07k79N79
9544B402n12n159k098Q515L915l041l946j049l557J681q29L645K038j492l224
9529b711J041j091j994L226J321m684j887L573J554J421j454j004L062R47K83
9514A603R45k499l640J37K428J546K36j097j418N89K301M844J661q31k602j624
9498B579j366K0L68j304j127k63j302L78J590K303k439K226M408K262m956m705
9482a328k326K182l21r5j192m61L255L360J259Q0L48j828k502L817L335L42J286
9465I211j808k015o540Q66n84l073J60L218L977J460m217r48l606J714K571N82
$$ plain form
9449 968 4997 6842 8265 5228 2344 1164 -2952 -4053 -913 1405 1482 1878 3564 3165 2966 3962 5162
9432 5162 4235 4649 8563 7508 7889 9182 13536 12490 9139 6593 5268 4372 1478 -159 -1105 -601
9416 -601 -822 -813 1415 4875 5599 5393 8325 8108 4977 3423 1257 -2072 -1976 3558 8412 7378 3782
9399 3782 4201 8219 5276 556 -2762 -1728 277 239 3989 8300 10287 9577 7909 7089 7943 7428 3579
9382 3579 1402 2869 4371 6123 5665 8001 2306 208 3151 4260 5074 4904 191 -1572 1350 3559
9366 3559 2409 3603 4132 4108 2183 1936 3962 1963 906 1665 2368 3964 885 5173 4205 3084 -145
9349 -145 -855 152 1253 -1160 -716 422 4849 4753 6750 5036 5829 4471 4437 6182 6754 4169 -75
9332 -75 -1799 -876 -1944 -1912 2724 6017 8080 2635 -1344 117 2228 1780 1146 2668 1549 -271 1494
$$ packed form
9449I68M029J845J423l037k884j180m116j101L140K318P7L96J686l99j99R96J200
9432E162r27M14L914j055L81J293M354j046l351k546j325q96k894j637r46N04
9416f01k21RK228L460P24k06K932k17l131j554k166l329R6N534M854j034l596
9399C782M19M018k943m720l318J034K005l8L750M311J987p10j668q20Q54n15l849
9382C579k177J467J502J752m58K336n695k098K943J109Q14j70m713j763K922K209
9366C559j150J194N29k4j925k47K026j999j057P59P03J596l079M288r68j121l229
9349a45p10J007J101k413M44J138M427r6J997j714P93j358l4J745N72k585m244
9332g5j724R23j068L2M636L293K063n445l979J461K111m48o34J522j119j820J765
$$ plain form
9315 1494 2259 3017 9029 10414 8422 7591 2537 -2797 -1737 1859 5096 8183 5640 1961 4823 7132
9299 7132 8681 9747 7749 8923 8822 10106 12362 12496 10240 7780 9673 12346 10628 8008 6502
9284 6502 8613 11351 6805 3254 4777 12194 13332 7072 4643 6019 10266 6667 3762 6600 6206
9269 6206 5201 8364 6306 2223 290 2473 3588 1146 3906 6245 10705 9457 9004 6686 3268
9254 3268 5386 4148 4591 4349 3467 2505 5214 7761 10080 9187 8789 5308 4569 4452 3450 4439 7470
9237 7470 12446 13773 9620 10310 10432 13443 12972 10456 9000 8263 4639 8900 11371 11728 10668 12830
9221 12830 11905 14032 10182 5722 2913 5405 8572 11184 13601 12833 9098 8891 7143 9103 10292
9206 10292 14544 15515 17419 20944 21794 17394 15864 13214 14886 14892 14196 14519 15468 13950 13613 11454 8494
$$ packed form
9315A494P65P58O012J385j992q31n054n334J060L596L237L087k543l679K862K309
9299G132J549J066j998J174j01J284K256J34k256k460J893K673j718k620j506
9284F502K111K738m546l551J523P417J138o260k429J376M247l599k905K838l94
9269F206j005L163k058m083j933K183J115k442K760K339M460j248m53k318l418
9254C268K118j238M43k42q82r62K709K547K319q93l98l481p39j17j002R89L031
9237G470M976J327m153O90J22L011m71k516j456p37l624M261K471L57j060K162
9221A2830r25K127l850m460k809K492L167K612K417p68l735k07j748J960J189
9206A0292M252R71J904L525Q50m400j530k650J672Oo96L23R49j518l37k159k960
$$ plain form
9189 8494 8113 11082 11653 7860 12601 12964 15923 10587 511 -218 4992 10646 14222 18803 20323 20497
9173 20497 21277 18776 15677 13746 13823 12660 11950 13879 14150 9680 5505 5720 9221 7032 7279 11902
9157 11902 12446 12663 10622 13312 18776 15887 11511 13111 15008 18149 19923 21435 22540 22795 19169
9142 19169 18889 22069 18703 17977 17512 14231 14297 16668 14089 11579 9616 9379 9792 15049 13748 14761
9126 14761 14938 12516 12018 16191 18991 19787 22078 19467 17392 17404 17498 17149 18010 17656 18324 18247 18066 17230
9108 17230 17986 18079 14908 12578 11837 15039 20387 20518 18492 15934 14687 17469 20397 20165 16171 13359
9092 13359 17688 18962 19189 17893 17585 17042 14785 15446 15261 14065 18311 19411 15913 16142 14690 18888
9076 18888 18942 13509 13216 14172 15803 16287 19370 19661 17907 18264 22803 28395 26913 23847 20362 17779
$$ packed form
9189H494l81K969N71l793M741L63K959n336j0076p29N210N654L576M581J520J74
9173B0497P80k501l099j931P7j163p10J929K71m470m175K15L501k189K47M623
9157A1902N44K17k041K690N464k889m376J600J897L141J774J512J105K55l626
9142A9169k80L180l366p26m65l281O6K371k579k510j963k37M13N257j301J013
9126A4761J77k422m98M173K800P96K291k611k075J2R4l49Q61l54O68p7j81q36
9108A7230P56R3l171k330p41L202N348J31k026k558j247K782K928k32l994k812
9092A3359M329J274K27j296l08n43k257O61j85j196M246J100l498K29j452M198
9076A8888N4n433k93R56J631M84L083K91j754L57M539N592j482l066l485k583
$$ plain form
9060 17779 18462 19096 21038 22896 24333 28114 28894 25921 25761 28014 28702 27267 22630 20482 19076 20857
9044 20857 22440 24903 27056 26843 29398 30466 26665 24254 22858 18376 19562 24021 27634 29562 25878
9029 25878 24132 24320 27901 24782 24870 29600 33647 34985 33105 35230 36184 36011 34274 34098 32857 31947
9013 31947 32426 34656 32189 32418 34639 34902 33111 34625 38881 37490 35268 35532 35016 33428 36384 40037
8997 40037 37236 34249 31565 34020 37415 37648 34374 39552 44502 45555 44793 44015 43455 42218 41187 38622
8981 38622 39176 37320 37962 38787 35145 34112 36119 38648 40251 41719 43029 42809 44092 46366 46132 46440
8965 46440 50730 47599 45110 48305 46228 40702 39968 43362 46505 48641 50258 45325 39521 40956 42003
8950 42003 40142 40252 41290 43498 41997 35550 38604 45237 45514 43605 41028 39477 40167 43096 44561
$$ packed form
9060A7779O83O34J942J858J437L781P80k973j60K253O88j435m637k148j406J781
9044B0857J583K463K153k13K555J068l801k411j396m482J186M459L613J928l684
9029B5878j746J88L581l119Q8M730M047J338j880K125R54j73j737j76j241r10
9013C1947M79K230k467K29K221K63j791J514M256j391k222K64n16j588K956L653
8997D0037k801k987k684K455L395K33l274N178M950J053p62p78n60j237j031k565
8981C8622N54j856O42Q25l642j033K007K529J603J468J310k20J283K274k34L08
8965D6440M290l131k489L195k077n526p34L394L143K136J617m933n804J435J047
8950D2003j861J10J038K208j501o447L054O633K77j909k577j551O90K929J465
$$ plain form
8935 44561 47110 47553 47574 49971 55998 55728 52787 52688 50458 49455 48634 46352 46786 47229 48818 49201 49787
8918 49787 52078 52335 49908 48544 49945 51171 50512 47168 45507 49300 59715 64225 63007 58972 59022
8903 59022 56663 54358 51603 50581 53679 55077 55692 55904 57869 58639 56471 54598 54470 55903 54192 54877
8887 54877 55711 54288 47144 44374 47935 50947 55371 60322 63481 65836 68161 67326 63983 63053 64035 61706
8871 61706 62462 62038 66489 72108 72924 73415 76078 72597 69652 66276 65335 72537 78139 80661 76275 71171
8855 71171 70723 72576 76405 78439 81094 75321 73231 72318 72974 74202 71506 69475 74471 75906 75813 77365
8839 77365 77194 78960 83393 87217 87582 87274 86527 85131 86481 83529 85168 87735 86146 85907 89561 91663
8823 91663 87815 87130 88748 90251 87867 92569 90149 85325 87159 83446 79481 79881 84778 91872 96101
$$ packed form
8935D4561K549M43K1K397O027k70k941r9k230j003q21k282M34M43J589L83N86
8918D9787K291K57k427j364J401J226o59l344j661L793J0415M510j218m035N0
8903E9022k359k305k755j022L098J398O15K12J965P70k168j873j28J433j711O85
8887E4877Q34j423p144k770L561L012M424M951L159K355K325q35l343r30R82k329
8871F1706P56m24M451N619Q16M91K663l481k945l376r41P202N602K522m386n104
8855G1171m48J853L829K034K655n773k090r13O56J228k696k031M996J435r3J552
8839G7365j71J766M433L824L65l08p47j396J350k952J639K567j589k39L654K102
8823I1663l848o85J618J503k384M702k420m824J834l713l965M00M897P094M229
$$ plain form
8808 96101 93490 90219 89772 94998 97876 100243 101059 99807 100051 100227 98645 98960 101920 103053 103664 107382
8792 107382 109448 108388 111719 114934 117031 119378 118074 118346 119616 119973 122612 124649 124153 123433 128775
8777 128775 129056 126356 127598 128108 129466 134274 138581 142217 142501 146572 152142 152475 156176 155853 152883 152124
8761 152124 150154 149347 151219 154691 155756 155179 155054 155579 155919 157656 155986 155001 155953 157301 156613 157702
8745 157702 158367 159264 158755 160670 160499 163205 166732 168777 168225 169376 165989 164508 167449 165263 164431 165442
8729 165442 168843 169619 170009 173561 175126 172044 172952 173718 170087 166129 170887 178314 179015 181058 182625 186116
8713 186116 189212 189376 183837 181901 184081 185381 184423 185820 186253 186322 188171 188601 190237 190885 186203 185737
8697 185737 185629 183293 186240 188821 190871 196155 199277 201309 201853 203829 203770 209617 220882 227483 231547
$$ packed form
8808I6101k611l271m47N226K878K367Q16j252K44J76j582L15K960J133O11L718
8792A07382K066j060L331L215K097K347j304K72J270L57K639K037m96p20N342
8777A28775K81k700J242N10J358M808M307L636K84M071N570L33L701l23k970p59
8761A52124j970q07J872L472J065n77j25N25L40J737j670r85R52J348o88J089
8745A57702O65Q97n09J915j71K706L527K045n52J151l387j481K941k186q32J011
8729A65442L401P76L90L552J565l082R08P66l631l958M758P427P01K043J567L491
8713A86116L096J64n539j936K180J300r58J397M33O9J849M30J636O48m682m66
8697A85737j08k336K947K581K050N284L122K032N44J976n9N847J1265O601M064
$$ plain form
8682 231547 238331 239106 239092 240219 242558 243575 246637 250029 256760 261291 264715 269373 279974 285420 284802
8667 284802 287598 293350 300321 301711 306940 313608 315275 317546 324121 328895 331255 336332 339074 337463
8653 337463 344331 351450 357704 365474 375863 381089 385367 391839 397405 406806 416171 422643 431833 442001
8639 442001 445577 449366 459471 469060 473753 481160 488860 497799 507713 509729 518746 526618 533267 541502
8625 541502 549706 553250 563257 573437 584016 592779 597094 608807 623079 633597 642223 657328 669972
8612 669972 683173 697129 709043 723030 736031 749409 761834 777880 789807 802687 820139 839842
8600 839842 858773 878687 897795 914077 931857 952233 970939 989495 1008686 1032530 1056343 1073983
8588 1073983 1097506 1127087 1153471 1175176 1203369 1228567 1260955 1294504 1326612 1358951 1389659
$$ packed form
8682B31547O784P75j4J127K339J017L062L392O731M531L424M658J0601N446o18
8667B84802K796N752O971J390N229O668J667K271O575M774K360N077K742j611
8653C37463O868P119O254P770J0389N226M278O472N566R401R365O472R190J0168
8639D42001L576L789J0105R589M693P407P700Q939R914K016R017P872O649Q235
8625E41502Q204L544J0007J0180J0579Q763M315J1713J4272J0518Q626J5105J2644
8612F69972J3201J3956J1914J3987J3001J3378J2425J6046J1927J2880J7452J9703
8600H39842J8931J9914J9108J6282J7780K0376J8706J8556J9191K3844K3813J7640
8588A073983K3523K9581K6384K1705K8193K5198L2388L3549L2108L2339L0708
$$ plain form
8577 1389659 1423829 1461056 1495810 1534828 1577593 1619700 1662603 1708061 1752703 1801660 1848527
8566 1848527 1895440 1947840 2004876 2068973 2137247 2204644 2273175 2343641 2420252 2500776 2580706
8555 2580706 2664981 2756761 2858317 2962436 3070420 3178337 3295495 3423050 3555138 3692730
8545 3692730 3838619 3996233 4160430 4336293 4515653 4707720 4912074 5127230 5363153 5612853
8535 5612853 5871187 6143627 6430523 6737129 7064406 7414840 7780348 8167017 8580783 9016927
8525 9016927 9467612 9943131 10440661 10955788 11489817 12043844 12610122 13187172 13767187 14347787
8515 14347787 14919237 15482572 16029317 16542312 17015908 17440802 17812803 18123722 18366366
8506 18366366 18529406 18617557 18631171 18569485 18430770 18222702 17955011 17637633 17278408 16878040
$$ packed form
8577A389659L4170L7227L4754L9018M2765M2107M2903M5458M4642M8957M6867
8566A848527M6913N2400N7036O4097O8274O7397O8531P0466P6611Q0524P9930
8555B580706Q4275R1780J01556J04119J07984J07917J17158J27555J32088J37592
8545C692730J45889J57614J64197J75863J79360J92067K04354K15156K35923K49700
8535E612853K58334K72440K86896L06606L27277L50434L65508L86669M13766M36144
8525I016927M50685M75519M97530N15127N34029N54027N66278N77050N80015N80600
8515A4347787N71450N63335N46745N12995M73596M24894L72001L10919K42644
8506A8366366J63040Q8151J3614o1686j38715k08068k67691l17378l59225m00368
$$ plain form
8496 16878040 16445901 15992903 15518041 15033038 14544809 14060261 13575057 13099729 12630061
8487 12630061 12174388 11727385 11296438 10879962 10472089 10079836 9700813 9340582 8989898
8478 8989898 8649083 8322595 8010919 7710910 7421158 7145154 6879620 6627720 6384742 6150873
8468 6150873 5924579 5707143 5496984 5298435 5110788 4931282 4758655 4592251 4432108 4277334
8458 4277334 4131202 3989419 3852149 3721688 3598206 3479330 3367540 3254550 3150556 3051783
8448 3051783 2957640 2866888 2778213 2691075 2605829 2529304 2457827 2384351 2309203 2239671 2177235
8437 2177235 2115504 2054604 2000341 1941153 1882696 1827652 1777119 1726447 1682515 1639948 1599683
8426 1599683 1560400 1520306 1479871 1442884 1409741 1372063 1331327 1295874 1263422 1233718 1202794
$$ packed form
8496A6878040m32139m52998m74862m85003m88229m84548m85204m75328m69668
8487A2630061m55673m47003m30947m16476m07873l92253l79023l60231l50684
8478H989898l40815l26488l11676l00009k89752k76004k65534k51900k42978k33869
8468F150873k26294k17436k10159j98549j87647j79506j72627j66404j60143j54774
8458D277334j46132j41783j37270j30461j23482j18876j11790j12990j03994r8773
8448C051783r4143r0752q8675q7138q5246p6525p1477p3476p5148o9532o2436
8437B177235o1731o0900n4263n9188n8457n5044n0533n0672m3932m2567m0265
8426A599683l9283m0094m0435l6987l3143l7678m0736l5453l2452k9704l0924
$$ plain form
8415 1202794 1177915 1150301 1121936 1093863 1066954 1040213 1019311 1002457 986695 968423 946528
8404 946528 925286 907219 892677 870157 851839 834816 818364 803915 792945 780778 766951 754785
8392 754785 744146 728172 717516 705964 696548 682929 667177 654673 642825 630934 619147 607418
8380 607418 599185 587895 580272 570338 560994 553562 549478 546359 540922 534912 521477 509009 504660 500843
8366 500843 492460 486304 482669 478380 467933 459963 454258 447452 442360 437580 435924 431925 422540 418580
8352 418580 414604 414102 412277 406836 401798 398779 397149 396088 387685 377326 371362 366922 364520 363418
8338 363418 363934 365585 363400 360647 355420 349578 348186 350582 352031 350612 345905 341827 335100 328621 319686
8323 319686 318823 319544 320151 318332 317826 313509 310146 307977 306500 308724 302610 290950 284732 289760 290751
$$ packed form
8415A202794k4879k7614k8365k8073k6909k6741k0902j6854j5762j8272k1895
8404I46528k1242j8067j4542k2520j8318j7023j6452j4449j0970j2167j3827j2166
8392G54785j0639j5974j0656j1552r416j3619j5752j2504j1848j1891j1787j1729
8380F07418q233j1290p623r934r344p432m084l119n437o010j3435j2468m349l817
8366E00843q383o156l635m289j0447p970n705o806n092m780j656l999r385l960
8352D18580l976n02j825n441n038l019j630j061q403j0359n964m440k402j102
8338C63418N16J651k185k753n227n842j392K396J449j419m707m078o727o479q935
8323C19686q63P21O07j819n06m317l363k169j477K224o114j1660o218N028R91
$$ plain form
8308 290751 274718 253742 255698 287193 324718 335828 326104 302455 270679 236072 211523 214430
8296 214430 233558 239849 225738 216125 214990 213484 209217 204193 197819 197258 196651 197416 199659 203010 200498
8281 200498 194656 191274 187359 180489 176142 178003 178477 172016 170864 172433 171640 165852 161151 158304 157782
8266 157782 156896 153417 151871 145365 138727 141371 144456 149227 147946 146660 149301 148869 145391 138493 137543
8251 137543 138773 138437 134283 130635 131945 130560 127377 128417 130403 136425 135638 128552 121651 121307 128168
8236 128168 128498 122076 115190 113219 112727 113721 114743 110752 109739 110862 109310 106736 105657 109197 106328
8221 106328 105325 106345 108150 106721 105487 107392 109954 107111 102797 100796 96090 91274 91157 92893 97901
8206 97901 93855 94103 95216 93464 89278 88866 89289 87283 85573 83616 86733 88037 84971 79821 76748
$$ packed form
8308B90751j6033k0976J956L1495L7525J1110r724k3649l1776l4607k4549K907
8296B14430J9128O291j4111r613j135j506m267n024o374n61o07P65K243L351k512
8281B00498n842l382l915o870m347J861M74o461j152J569p93n788m701k847n22
8266A57782q86l479j546o506o638K644L085M771j281j286K641m32l478o898r50
8251A37543J230l36m154l648J310j385l183J040J986O022p87p086o901l44O861
8236A28168L30o422o886j971m92R94J022l991j013J123j552k574j079L540k869
8221A06328j003J020J805j429j234J905K562k843m314k001m706m816j17J736N008
8206I7901m046K48J113j752m186m12M23k006j710j957L117J304l066n150l073
$$ plain form
8191 76748 77451 78747 82613 81388 77255 77753 81123 83997 85464 88209 89038 85679 81336 84166 85302
8176 85302 82789 82020 76299 72767 75947 77139 73990 77563 75875 75431 76460 76061 70944 71291 72887 69797
8160 69797 63962 64571 63115 64420 62940 65096 65481 64508 62150 62453 57987 56783 58521 61872 64615 63990
8144 63990 60596 58082 56066 55807 57901 59286 58742 57474 57247 61889 62472 61492 52331 50502 47035 40033
8128 40033 36353 33510 33196 36233 33093 36314 42118 46168 48662 52686 56200 58159 57604 54538 51623
8113 51623 50011 50891 52060 50855 44208 39202 40234 45148 45827 44521 43209 42468 40407 38351 34972
8098 34972 39208 38756 40546 44585 43661 41436 40343 40718 41160 43752 44508 41479 37887 38320 39928 42510
8082 42510 41230 40514 43216 40592 41041 39451 38148 39084 39908 36938 34747 36353 37276 37518 36995 36241 34670
$$ packed form
8191G6748P03J296L866j225m133M98L370K874J467K745Q29l359m343K830J136
8176H5302k513p69n721l532L180J192l149L573j688m44J029l99n117L47J596l090
8160F9797n835O09j456J305j480K156L85r73k358L03m466j204J738L351K743o25
8144F3990l394k514k016k59K094J385n44j268k27M642N83r80r161j829l467p002
8128D0033l680k843l14L037l140L221N804M050K494M024L514J959n55l066k915
8113E1623j612Q80J169j205o647n006J032M914O79j306j312p41k061k056l379
8098C4972M236m52J790M039r24k225j093L75M42K592P56l029l592M33J608K582
8082D2510j280p16K702k624M49j590j303R36Q24k970k191J606R23K42n23p54j571
$$ plain form
8065 34670 35723 34709 37374 40895 37146 34473 35115 32297 31830 38576 42862 44104 42363 39486 38762
8050 38762 37504 38522 39367 38640 33947 31352 28371 25244 24835 26325 29108 29405 25497 24995 26538 24302
8034 24302 28927 34396 34540 32992 35291 34379 29224 27217 28997 31139 26559 26224 26948 25907 24131 25842
8018 25842 28601 30446 32602 34892 25189 16844 21410 24570 26249 28627 29462 26661 25471 23481 22994
8003 22994 28578 30418 30653 32416 30325 25123 21328 21434 16418 15953 23608 29366 27115 22703 22671 22662 23567
7986 23567 21747 24229 25313 23476 22242 23648 25332 23114 21530 21606 21221 28045 28591 25691 21824 19435
7970 19435 16666 17693 15633 13654 12545 9945 11420 13332 14971 13908 17143 20485 19713 19745 23416
7955 23416 23852 24735 25590 25677 25046 26835 27297 28847 29406 28126 25680 28429 25666 21635 22182 22426 20110
$$ packed form
8065C4670J053j014K665L521l749k673O42k818m67O746M286J242j741k877p24
8050C8762j258J018Q45p27m693k595k981l127m09J490K783K97l908n02J543k236
8034B4302M625N469J44j548K299r12n155k007J780K142m580l35P24j041j776J711
8018B5842K759J845K156K290r703q345M566L160J679K378Q35k801j190j990m87
8003B2994N584J840K35J763k091n202l795J06n016m65P655N758k251m412l2rR05
7986B3567j820K482J084j837j234J406J684k218j584P6l85O824N46k900l867k389
7970A9435k769J027k060j979j109k600J475J912J639j063L235L342p72L2L671
7955B3416M36Q83Q55Q7o31J789M62J550N59j280k446K749k763m031N47K44k316
$$ plain form
7938 20110 19984 21730 21869 18924 16469 17701 19470 22772 23034 23235 22321 22549 23484 19919 14981 16239
7922 16239 18110 16396 13537 11761 12139 7919 4983 8979 12892 12992 19240 20679 19374 16344 14929
7907 14929 15242 17549 20634 22845 19814 18327 21951 24837 21800 19242 15441 17319 16758 13835 16807
7892 16807 17378 11003 10705 11396 8418 12920 13120 13282 16255 17606 13251 11500 11444 9686 11418 9664
7876 9664 7640 9886 7279 6404 10424 13739 16421 18632 18302 18182 15272 8809 7350 9288 10196 10464
7860 10464 16531 17011 15128 13546 11055 10648 14603 12109 10638 13046 17149 17868 17384 17164 10265 6943
7844 6943 7584 8831 9070 11869 12088 8791 4947 8591 10938 11601 16314 19462 15923 8905 10802 12440
7828 12440 13491 12761 14027 18198 16685 13886 11743 10990 8791 8049 7542 10807 14269 14237 10527 6897
$$ packed form
7938B0110j26J746J39k945k455J232J769L302K62K01r14K28R35l565m938J258
7922A6239J871j714k859j776L78m220k936L996L913J00O248J439j305l030j415
7907A4929L13K307L085K211l031j487L624K886l037k558l801J878n61k923K972
7892A6807N71o375k98O91k978M502K00J62K973J351m355j751n6j758J732j754
7876I664k024K246k607q75M020L315K682K211l30j20k910o463j459J938R08K68
7860A0464O067M80j883j582k491m07L955k494j471K408M103P19m84k20o899l322
7844F943O41J247K39K799K19l297l844L644K347O63M713L148l539p018J897J638
7828A2440J051p30J266M171j513k799k143p53k199p42n07L265L462l2l710l630
$$ plain form
7812 6897 12650 14407 19487 17171 13279 8271 3325 1113 1981 5409 6386 8491 7055 7648 10181 10596
7796 10596 6964 3331 810 2874 6807 8021 6316 4164 4044 4653 4836 6815 10800 12382 8711
7781 8711 8274 8814 10745 8466 9634 8769 6976 4789 1919 2105 4990 3621 4953 5237 5408 9151
7765 9151 11308 10999 11111 13051 13327 11764 10298 10879 10030 10335 8147 10375 7246 5469 3228 2997 1627
7748 1627 7097 10347 10515 5166 1091 3515 5684 6996 6489 7855 10473 11249 8882 6948 7232 6297
7732 6297 4461 1305 847 2127 3708 8017 1875 -2305 773 2135 3413 4752 1169 1366 3804
7717 3804 6988 4697 1985 -821 -4509 -4719 2360 3737 3941 4725 5612 5762 3345 1384 3882 6937
7701 6937 7116 6073 5036 10568 13534 10915 7249 6022 7875 10892 13015 13770 12763 5810 1884
$$ packed form
7812F897N753J757N080k316l892n008m946k212Q68L428R77K105j436N93K533M15
7796A0596l632l633k521K064L933J214j705k152j20O09J83J979L985J582l671
7781H711m37N40J931k279J168q65j793k187k870J86K885j369J332K84J71L743
7765I151K157l09J12J940K76j563j466N81q49L05k188K228l129j777k241k31j370
7748A627N470L250J68n349m075K424K169J312n07J366K618P76k367j934K84r35
7732F297j836l156m58J280J581M309o142m180L078J362J278J339l583J97K438
7717C804L184k291k712k806l688k10P079J377K04P84Q87J50k417j961K498L055
7701F937J79j043j037N532K966k619l666j227J853L017K123P55j007o953l926
$$ plain form
7686 1884 4329 12948 11784 5988 3278 2372 2607 1142 1345 4265 3742 4958 7752 5955 4013 2911
7670 2911 5350 1252 -716 3571 6182 5036 2964 1115 4907 7358 4842 2348 3660 2875 822
7655 822 1676 -728 358 6637 6289 3938 2048 2407 10476 8513 3717 3183 4759 3471 4424 3679 4291
7638 4291 4567 5638 1643 -3892 -2894 -2671 -2540 -632 3507 4784 3357 3175 4643 6803 5812 5657 3839
7621 3839 4601 4354 284 -276 -1651 321 2853 3908 1461 -103 5102 5724 6453 4214 4822 6428
7605 6428 3754 1907 2963 5298 6610 6226 6312 6400 5250 2423 -1305 -1392 -2159 808 6692 7571 7173
7588 7173 3691 -596 -2995 -2522 -3756 623 4186 5633 5058 5640 5377 3439 3795 635 2164 497
7572 497 1221 1732 2441 3750 2155 1990 -217 -2181 -2081 -1598 -1542 -931 481 -819 -1016 1904 4401 4737
$$ packed form
7686A884K445Q619j164n796k710r06K35j465K03K920n23J216K794j797j942j102
7670B911K439m098j968M287K611j146k072j849L792K451k516k494J312p85k053
7655H22Q54k404J086O279l48k351j890L59Q069j963m796n34J576j288R53p45O12
7638D291K76J071l995n535R98K23J31J908M139J277j427j82J468K160r91j55j818
7621C839P62k47m070n60j375J972K532J055k447j564N205O22P29k239O08J606
7605F428k674j847J056K335J312l84Q6Q8j150k827l728q7p67K967N884Q79l98
7588G173l482m287k399M73j234M379L563J447n75N82k63j938L56l160J529j667
7572D97P24N11P09J309j595j65k207j964J00M83N6O11J412j300j97K920K497L36
$$ plain form
7554 4737 4931 6519 2578 -629 -2786 1418 4070 1827 2041 4433 5700 3299 2851 3552 139 -4307
7538 -4307 -4857 -2464 -3795 -6638 -3923 1478 3610 3942 4489 1135 947 608 -2261 -2314 1510 4410 1594
7521 1594 -1004 231 1789 1588 316 -1918 -1414 1693 4767 506 -163 -3765 -2918 -1654 427 427 -430
7504 -430 -2566 -1618 295 -426 -736 3953 4305 5353 9094 8653 6722 1016 1751 5311 3948 5657 7152
7487 7152 7733 3924 -2779 -3302 1832 151 1131 8 265 -1162 -2770 3177 4051 -1602 -5745 -2875
7471 -2875 -278 -926 -99 -2174 -2840 -3102 -4314 -6159 -5922 -7277 -8570 -6094 -3812 -3419 -3969 -4560 -1901
7454 -1901 -4258 -1665 3644 5417 3417 789 -488 -5950 -6377 -3029 -4842 -4335 -1783 -2029 -810 -5995
7438 -5995 -6987 -1324 1123 -2208 -1987 -2253 -2430 -325 118 1329 1289 -838 -878 -1228 829 -2518 -2794 -1698
$$ packed form
7554D737J94J588l941l207k157M204K652k243K14K392J267k401m48P01l413m446
7538d307n50K393j331k843K715N401K132L32N47l354j88l39k869n3L824K900k816
7521A594k598J235J558k01j272k234N04L107L074m261o69l602Q47J264K081%q57
7504d30k136R48J913p21l10M689L52J048L741m41j931n706P35L560j363J709J495
7487G152N81l809o703n23N134j681R80j123K57j427j608N947Q74n653m143K870
7471b875K597o48Q27k075o66k62j212j845K37j355j293K476K282L93n50n91K659
7454a901k357K593N309J773k000k628j277n462m27L348j813N07K552k46J219n185
7438e995r92N663K447l331K21k66j77K105M43J211m0k127m0l50K057l347k76J096
$$ plain form
7420 -1698 -2909 -1286 -56 -478 3463 5760 3610 3778 2407 3415 370 -2068 -1323 693 235 -2618
7404 -2618 -771 1417 -518 -5599 -8173 -6506 -5005 -9914 -10084 -2235 -3213 -3746 -1900 471 -1686 -903
7388 -903 -627 367 -2611 -5486 -8288 -8187 -4224 623 252 -4283 -1951 -1803 -1444 -1564 -7053 -5865 -2380
7371 -2380 -2441 -4202 -3089 -2471 -2487 -215 -1531 -806 -1465 -2138 -6696 -6114 -5504 -5995 -3187 -602 -846 -1401
7353 -1401 -3315 -731 1310 2072 3244 3287 1718 3571 1733 173 1340 1574 1673 5078 2579 2472 6739
7336 6739 6672 2604 -2303 -2141 -148 3480 2005 -694 -938 1148 1473 265 699 -1516 -6249 -5829 -3679
7319 -3679 -1875 -549 -68 1043 179 1578 5921 760 -3344 -5129 -8451 -8615 -8871 -9313 -7542 -6583
7303 -6583 -5838 -6216 -7314 -9587 -10221 -9400 -6921 -3846 -506 -1734 -2552 -4118 -3445 -1606 1145 39
$$ packed form
7420a698j211J623J230m22L941K297k150J68j371J008l045k438P45K016m58k853
7404b618J847K188j935n081k574J667J501m909j70P849r78n33J846K371k157P83
7388i03K76R94k978k875k802J01L963M847l71m535K332J48L59j20n489J188L485
7371b380o1j761J113O18j6K272j316P25o59o73m558N82O10m91K808K585k44n55
7353a401j914K584K041P62J172M3j569J853j838j560J167K34R9L405k499j07M267
7336F739o7m068m907J62J993L628j475k699k44K086L25j208M34k215m733M20K150
7319c679J804J326M81J111q64J399M343n161m104j785l322j64k56m42J771R59
7303f583P45l78j098k273o34Q21K479L075L340j228q18j566O73J839K751j106
$$ plain form
7287 39 -1329 -7008 -8751 -5837 -1652 121 2090 1383 3017 3444 3553 2461 554 196 -2282 -5643
7271 -5643 -2924 -2237 -6692 -5570 -1094 399 -335 512 -903 -1026 -49 1964 2462 5330 2698 -398
7255 -398 -1750 -4442 -4126 1593 3273 3113 2495 1852 1629 10015 9235 7118 6130 6830 8121 7884 3664
7238 3664 437 794 -4179 -3374 610 -3386 -7812 -8126 -4631 -1632 -2055 -4902 -5336 -1377 -1465 450 -2058
7221 -2058 -2775 -832 -2850 -4552 -4941 -5721 -7472 -9846 -8712 -7624 -4502 -3229 -5830 -4346 -4087 -6231
7205 -6231 -5271 -3922 -2940 -4019 -4640 -2473 -2769 -5507 -3842 -1075 -3215 -4914 -2652 -2773 -616 2566
7189 2566 -131 -4994 -6878 -4243 -171 -108 -2402 -2351 -2697 913 3352 2636 2866 3028 1890 4444 2622
7172 2622 -2223 -2522 -52 -497 220 3066 2593 -433 330 -851 1479 4401 2107 -1240 -1807 -2065 -3615
$$ packed form
7287C9j368n679j743K914M185J773J969p07J634M27J09j092j907l58k478l361
7271e643K719O87m455J122M476J493p34Q47j415j23R77K013M98K868k632l096
7255c98j352k692L16N719J680j60o18o43k23Q386p80k117r88P00J291k37m220
7238C664l227L57m973Q05L984l996m426l14L495K999m23k847m34L959q8J915k508
7221b058p17J943k018j702l89p80j751k374J134J088L122J273k601J484K59k144
7205f231R60J349R82j079o21K167k96k738J665K767k140j699K262j21K157L182
7189B566k697m863j884K635M072O3k294N1l46L610K439p16K30J62j138K554j822
7172B622m845k99K470m45P17K846m73l026P63j181K330K922k294l347n67k58j550
$$ plain form
7155 -3615 -4615 -4752 -4992 -644 3159 5283 8440 4241 3253 3093 3731 3464 2926 4928 5631 5184 5095 6222
7137 6222 2296 2389 1498 -4993 -6307 -5384 -1904 -3460 -4356 -3826 -1222 256 286 -119 -676 1193 1655 678
7119 678 -429 -4130 -8317 -9696 -4277 2087 2024 -477 -3105 -4137 -4263 -3144 -94 3188 6105 1663
7103 1663 -2409 -1954 -4787 -6345 -2064 3057 2895 -306 -2161 1420 3522 5325 4086 3729 769 -5446
7087 -5446 -8369 -8612 -4718 -91 1691 585 -1002 -5069 -8621 -8909 -9509 -2872 2245 556 -579 -1868
7071 -1868 -2873 -5020 -3819 -297 152 -3682 -7479 -7383 -5614 -4262 -3288 -5688 -3060 271 685 277
7055 277 8 -1583 -729 -2350 -4017 -1273 -394 -1309 -1929 -7425 -9036 -5739 -3273 -3412 -2472 -2581 -1428
7038 -1428 -1197 -4194 -7598 -10421 -12496 -10964 -6693 -2754 -6049 -9271 -7009 -3503 1650 1537 1564 1057
$$ packed form
7155c615j000j37k40M348L803K124L157m199r88j60O38k67n38K002P03m47q9J127
7137F222l926R3q91o491j314R23L480j556q96N30K604J478L0m05n57J869M62r77
7119F78j107l701m187j379N419O364o3k501k628j032j26J119L050L282K917m442
7103A663m072M55k833j558M281N121j62l201j855L581K102J803j239l57k960o215
7087e446k923k43L894M627J782j106j587m067l552k88o00O637N117j689j135j289
7071a868j005k147J201L522M49l834l797R6J769J352R74k400K628L331M14m08
7055B77k69j591Q54j621j667K744Q79r15o20n496j611L297K466j39R40j09J153
7038a428K31k997l404k823k075J532M271L939l295l222K262L506N153j13K7n07
$$ plain form
7022 1057 -2987 -7022 -4532 -7080 -5659 -3320 -5089 -7950 -7564 -9499 -9910 -12625 -10276 -5346 -5907 -4759
7006 -4759 1481 3775 871 -4997 -8533 -10556 -5176 -3705 -3438 -1450 -2512 -5211 -1788 603 -1574
6991 -1574 -834 601 -2696 -2186 -1027 -944 1101 4057 2717 -1833 -779 282 2280 3893 -724 -5834
6975 -5834 -3000 -1926 -5666 -8320 -5050 -1161 2177 1232 -2360 -5088 -2466 1579 2971 -30 -5016
6960 -5016 -4204 -3475 -1764 -1140 -2547 -5038 -6832 -1720 2356 -1088 -440 3015 2784 3655 4851 3973 3564
6943 3564 5302 -584 -4635 -1745 -1295 -543 1840 -1183 -939 787 1365 3164 2238 1640 1458 -843 -1672
6926 -1672 -3698 -5051 -8790 -6777 -6400 -7087 -10273 -4575 -1267 -2366 -2012 -1594 -3067 -2894 -5592 -4221
6910 -4221 -208 -576 753 -1439 -3635 -1087 449 -3256 -7706 -7314 -4122 -4212 -6673 -6414 -4479 -154
$$ packed form
7022A057m044m035K490k548J421K339j769k861L86j935m11k715K349M930n61J148
7006d759O240K294k904n868l536k023N380J471K67J988j062k699L423K391k177
6991a574P40J435l297N10J159Q3K045K956j340m550J054J061J998J613m617n110
6975e834K834J074l740k654L270L889L338r45l592k728K622M045J392l001m986
6960e016Q12P29J711O24j407k491j794N112M076l444O48L455k31Q71J196q78m09
6943C564J738n886m051K890M50P52K383l023K44J726N78J799r26n98j82k301q29
6926a672k026j353l739K013L77o87l186N698L308j099L54M18j473J73k698J371
6910d221M013l68J329k192k196K548J536l705m450L92L192r0k461K59J935M325
$$ plain form
6894 -154 -2782 -4604 -2087 1057 2032 -626 -3632 -2599 -3936 -5271 -1844 -544 -7796 -9560 -6176
6879 -6176 -3593 -5030 -7043 -7738 -6213 -7144 -3567 -5928 -7942 -6840 -8788 -10013 -8962 -8056 -8166 -4689
6863 -4689 -313 -182 -226 -670 -2430 -6706 -3702 368 1112 543 -559 -1815 -1035 -1301 -7535 -8384 -6258
6846 -6258 -2436 -4087 -6877 -4495 -3509 -3626 -661 2275 4530 238 507 2670 2385 -1530 -5967 -8525
6830 -8525 -6391 -2573 -297 -1509 -2868 -3520 -1053 -2263 -334 -782 -291 169 -628 -1999 -4312 -5552
6814 -5552 -5531 -2010 -1994 -1655 -2513 398 3338 2003 558 5 -2311 -4792 -3956 -4124 -4209 -3382 -4754 -4632
6796 -4632 -2660 -2708 -2474 -1816 -7466 -10675 -8335 -3703 -5834 -12344 -11385 -7877 -7290 -5858 -7864 -10401
6780 -10401 -8318 -7327 -3624 -3124 475 905 -1810 -846 -1381 -2595 -3040 1686 3190 1431 -3648 -3990
$$ packed form
6894a54k628j822K517L144R75k658l006J033j337j335L427J300p252j764L384
6879f176K583j437k013o95J525r31L577k361k014J102j948j225J051R06j10L477
6863d689M376J31m4m44j760m276L004M070P44n69j102j256P80k66o234q49K126
6846f258L822j651k790K382R86j17K965K936K255m292K69K163k85l915m437k558
6830h525K134L818K276j212j359o52K467j210J929m48M91M60p97j371k313j240
6814e552K1L521J6L39q58K911K940j335j445n53k316k481Q36j68q5Q27j372J22
6796d632J972m8K34O58n650l209K340M632k131o510R59L508N87J432k006k537
6780a0401K083R91L703N00L599M30k715R64n35j214m45M726J504j759n079l42
$$ plain form
6764 -3990 -3999 -4633 -1561 1340 1627 -7 -295 -1487 1102 -1703 1841 3919 791 1460 3074 2391 2367
6747 2367 3435 4815 5362 2105 2447 2465 439 -1584 -3847 -4083 -1012 -325 2620 4439 6142 6947 7419
6730 7419 7999 8078 12501 15498 15943 12104 6144 5646 6963 10197 12397 9077 7722 -509 -4683 -378
6714 -378 3730 3554 2489 1398 -3126 -5881 -4279 -1060 1002 -558 -759 -1864 -877 2474 1200 797
6698 797 872 1116 -1880 -7327 -8895 -5988 -6590 -8149 -7929 -4116 -1949 -2269 -1292 -1611 -3758 -4462 -7156
6681 -7156 -9769 -13609 -12857 -5337 -5265 -7449 -4042 -4252 -6293 -6863 -5277 -1890 -2213 -559 -2246 -6785
6665 -6785 -8271 -8508 -8446 -8378 -9131 -8773 -3804 -2573 -1904 -2790 -7681 -7386 -4420 -7825 -9122 -11392 -11519 -11263
6647 -11263 -5233 -2034 91 1080 -436 -2081 -3874 -2789 -1178 -3466 -3071 -578 3166 3516 3072 4052
$$ packed form
6764c990ro34L072K901K87j634k88j192K589k805L544K078l128O69J614o83k4
6747B367J068J380N47l257L42J8k026k023k263k36L071O87K945J819J703Q05M72
6730G419N80P9M423K997M45l839n960m98J317L234K200l320j355q231m174M305
6714c78M108j76j065j091m524k755J602L219K062j560k01j105R87L351j274m03
6698G97P5K44k996n447j568K907o02j559K20L813K167l20R77l19k147p04k694
6681g156k613l840P52P520P2k184L407k10k041n70J586L387l23J654j687m539
6665f785j486k37O2O8p53L58M969J231O69q86m891K95K966l405j297k270j27K56
6647a1263O030L199K125R89j516j645j793J085J611k288L95K493L744L50m44R80
$$ plain form
6631 4052 723 -3960 -5156 -4293 -7478 -9264 -5222 -316 -2413 -2574 -1968 -6787 -9062 -6834 -1846 -733
6615 -733 -1705 -3145 -3074 -1680 -1130 -1010 -315 180 1195 1694 562 -2291 -4764 -3758 -2908 -2346 -2868 -3158
6597 -3158 -2636 -648 1047 -194 -1563 -5164 -4703 -2856 -3889 -441 5176 1861 -480 -3270 -7314
6582 -7314 -7765 -4014 -6352 -5888 -3317 -1828 -2054 -1574 -4446 -5739 -8013 -7395 -7579 -4940 -219 3633
6566 3633 209 -3952 -3075 305 1222 1061 1436 1934 1313 294 -2177 -2516 -2068 -1969 1617 -1632 -4199
6549 -4199 -209 -2104 -3570 -6128 -6146 -7115 -3906 -2620 -2781 -4120 -5109 -6064 -6260 -3600 -3281 -2106 -4294
6532 -4294 -7019 -3645 -3237 -1819 87 274 -2918 -689 -256 3560 2781 -3086 -2287 682 -36 -1455
6516 -1455 -3894 -6390 -4302 -1112 -4476 -7864 -4911 -1969 753 4689 5864 4208 -379 34 -560
$$ packed form
6631D052l329m683j196Q63l185j786M042M906k097j61O06m819k275K228M988J113
6615g33r72j440P1J394N50J20O95M95J015M99j132k853k473J006Q50N62n22k90
6597c158N22J988J695j241j369l601M61J847j033L448N617l315k341k790m044
6582g314m51L751k338M64K571J489k26M80k872j293k274O18j84K639M721L852
6566C633l424m161Q77L380R17j61L75M98o21j019k471l39M48R9L586l249k567
6549d199L990j895j466k558j8r69L209J286j61j339r89r55j96K660L19J175k188
6532d294k725L374M08J418J906J87l192K229M33L816p79n867P99K969p18j419
6516a455k439k496K088L190l364l388K953K942K722L936J175j656m587M13n94
$$ plain form
6501 -560 2323 1693 -1287 -1182 -2346 -4258 -3757 -3721 -3799 -2753 -4081 -3610 -3730 -1210 6021 5948 -1335 -5245
6483 -5245 13 -3199 -8971 -7568 -7396 -6137 -5342 -6566 -8689 -3343 706 3640 2364 -2516 -4342
6468 -4342 -2853 -4651 -6708 -3426 -4583 -9805 -13378 -10522 -4004 -471 -284 464 -1380 1737 5158
6453 5158 3388 44 108 -399 -1868 -4784 -10379 -11015 -12485 -11983 -9668 -8670 -6280 -5252 -3003 -2784 -6551
6436 -6551 -7615 -5774 -2123 294 1858 5221 -383 -3244 -1046 -2292 -6957 -7795 -5307 -4737 -1179
6421 -1179 -175 -5078 -6599 -8140 -11764 -10843 -11775 -14447 -12233 -8435 -3491 -2962 -4000 -2668 1094 1998
6405 1998 -1354 2654 1350 1214 1193 -1749 -2428 -4272 -8163 -7232 -8883 -7504 -3660 -2349 -1040 -4146
6389 -4146 -4600 -2257 -2270 -1255 423 -5190 -3490 -802 -1186 -2155 -5278 -8525 -8501 -9467 -11311 -4387 -2698
$$ packed form
6501e60K883o30k980J05j164j912N01L6p8J046j328M71j20K520P231p3p283l910
6483e245N258l212n772J403J72J259P95j224k123N346M049K934j276m880j826
6468d342J489j798k057L282j157n222l573K856O518L533J87P48j844L117L421
6453E158j770l344O4n07j469k916n595o36j470N02K315R98K390J028K249K19l767
6436f551j064J841L651K417J564L363n604k861K198j246m665q38K488N70L558
6421a179J004m903j521j541l624R21r32k672K214L798M944N29j038J332L762R04
6405A998l352M008j304j36k1k942o79j844l891R31j651J379L844J311J309l106
6389d146m54K343j3J015J678n613J700K688l84r69l123l247K4r66j844O924J689
$$ plain form
6372 -2698 -5200 -4830 -1710 150 213 -2083 -5354 -4453 -2246 232 2224 -983 -933 -1416 -2997 -982 954
6355 954 -209 -3165 1025 1377 -775 -3009 -2756 386 2016 2628 -1411 -6065 -7721 -6562 -5387 -4683
6339 -4683 -2788 -3089 -1785 -714 -2023 -2440 -707 -1923 -6315 -2181 469 -1898 -965 3176 1871 223
6323 223 -899 -5262 -7987 -3979 -2971 -2190 -3146 3462 2519 -3174 -10204 -10494 -8837 -7543 -5912 -3418
6307 -3418 1348 1236 2206 4304 2701 1065 -2963 -1114 3513 2367 4465 5255 167 -16 152 619
6291 619 57 1948 3208 3922 965 1940 -2263 -4205 -2736 -1618 -622 791 1555 2513 2880 4006 4068
6274 4068 3285 2304 944 -3924 -4459 -2903 -4163 -6572 -7011 -5220 -3723 -2266 -3426 -3283 -608 1895
6258 1895 4449 3322 -2616 -3803 -5331 -5448 -6458 -6765 -3636 -2779 -902 -1917 -7605 -11445 -10746 -8055
$$ packed form
6372b698k502L70L120J860O3k296l271R01K207K478J992l207N0m83j581K015J936
6355I54j163k956M190L52k152k234K53L142J630O12m039m654j656J159J175P04
6339d683J895l01J304J071j309m17J733j216m392M134K650k367R33M141j305j648
6323B23j122m363k725M008J008P81r56O608r43n693p030k90J657J294J631K494
6307c418M766j12R70K098j603j636m028J849M627j146K098P90n088j83J68M67
6291F19n62J891J260P14k957R75m203j942J469J118R96J413P64R58L67J126O2
6274D068p83r81j360m868n35J556j260k409m39J791J497J457j160J43K675K503
6258A895K554j127n938j187j528j17j010l07L129Q57J877j015n688l840O99K691
$$ plain form
6242 -8055 -4009 -4431 -6495 -7723 -4807 -5837 -8740 -9206 -7628 -4507 -6027 -8551 -6476 -6416 -9114 -11193
6226 -11193 -10313 -4644 -1967 -1678 -4288 -289 -1367 -5848 -5777 -5970 -5649 -3436 -3794 -3626 -2838 -1706 779
6209 779 2404 1011 -1334 -3447 1147 1091 -1889 -3921 -4935 -6361 -5035 -2583 -3828 -6145 -8345 -8293
6193 -8293 -6955 -8612 -7686 -6183 -2440 -1040 -127 916 -794 -4792 -5643 -4660 -5226 -4838 -5983 -8997
6177 -8997 -4115 -3692 -10046 -9914 -8178 -1421 4953 -158 -8493 -11709 -6623 4329 8774 -6092 -23078
6162 -23078 -28952 -24588 -21949 -22411 -17054 -3530 11038 16672 2243 -12661 -14562 -6920 1444 3646
6148 3646 -2571 -5781 -1102 1590 5939 2460 -1143 -5470 -8256 -6678 -2960 -2528 -2804 -3358 -7646 -6337
6132 -6337 -6834 -7495 -7761 -8311 -5740 -3526 -5401 -4704 -4383 -2035 -388 622 753 -4260 -5584 -1819 89
$$ packed form
6242h055M046m22k064j228K916j030k903m66J578L121j520k524K075O0k698k079
6226a1193Q80N669K677K89k610L999j078m481P1j93L21K213l58J68P88J132K485
6209G79J625j393k345k113M594n6k980k032j014j426J326K452j245k317k200N2
6193h293J338j657R26J503L743J400R13J043j710l998q51R83n66L88j145l014
6177h997M882M23o354J32J736O757O374n111q335l216N086J0952M445j4866j6986
6162b3078n874M364K639m62N357J3524J4568N634j4429j4904j901P642Q364K202
6148C646o217l210M679K692M349l479l603m327k786J578L718M32k76n54m288J309
6132f337m97o61k66n50K571K214j875O97L21K348J647J010J31n013j324L765J908
$$ plain form
6115 89 -1335 1005 -570 -523 -714 970 -153 -4162 -4225 -1649 -1722 -4046 -4803 -2667 -840 -2502 -4385
6098 -4385 -9465 -9701 -5208 -7371 -8763 -4894 -860 -1695 -6206 -6359 -3695 -1771 -947 -1078 -626 -3033
6082 -3033 -4047 -3199 -6348 -10002 -10829 -7093 -3071 -2344 -1127 2781 3224 2692 420 -6711 -7576 -3082
6066 -3082 -1624 -3616 -2622 -1638 -1939 -6581 -9923 -10113 -10629 -10947 -9658 -5333 1988 -2136 -5099 -2769
6050 -2769 -1351 -6523 -6894 -7330 -4828 -3077 -2732 -4529 -6909 -8404 -10400 -12846 -15419 -14247 -9153 -3697
6034 -3697 -2753 -6890 -4984 -3615 -3428 -1889 -2428 -5076 -5836 -7176 -8772 -4712 -4287 -6042 -1123 601
6018 601 -81 -3101 -5303 -7734 -5729 950 1998 -1457 1077 -1798 -7453 -7706 -6353 -10809 -10475 -6151
6002 -6151 -2117 -2098 -830 -1965 -1746 -5280 -8506 -7624 -8297 -9063 -9448 -2110 819 6772 5072 -478 1199
$$ packed form
6115H9j424K340j575M7j91J684j123m009o3K576p3k324p57K136J827j662j883
6098d385n080k36M493k163j392L869M034q35m511j53K664J924Q24j31M52k407
6082c033j014Q48l149l654q27L736M022P27J217L908M43n32k272p131q65M494
6066c082J458j992R94R84l01m642l342j90n16l18J289M325P321m124k963K330
6050b769J418n172l71m36K502J751L45j797k380j495j996k446k573J172N094N456
6034c697R44m137J906J369J87J539n39k648p60j340j596M060M25j755M919J724
6018F01o82l020k202k431K005O679J048l455K534k875n655k53J353m456L34M324
6002f151M034J9J268j135K19l534l226Q82o73p66l85P338K929N953j700n550J677
$$ plain form
5985 1199 9625 10237 9634 9379 5129 516 -2793 -4491 -4079 -6817 -5818 -5144 -4052 -8852 -8825 -6925 -6262
5968 -6262 -6141 -3466 -5253 -6211 -812 -1730 -5829 -6616 -3085 -1853 -3877 -5309 1285 963 -1567 -2646
5952 -2646 -5056 -3863 -3240 -4236 -7208 -4430 -1762 -2576 -3048 -2965 -3216 -4013 -4759 -6235 -8704 -10338 -5492
5935 -5492 -2699 -1145 -3000 -4302 -3943 -790 0 -1912 -1186 -1733 -2221 -6092 -6822 -7695 -7676 -3818 -3047
5918 -3047 -388 -2140 -1769 775 4029 507 -921 -6057 -6129 -6377 -5049 -2467 -2366 -2629 2142 2518 3237
5901 3237 2521 3278 2797 2912 1859 139 606 1100 3823 4296 4546 1726 2444 -404 123 -4743 -10093
5884 -10093 -8976 -6562 -5769 -4368 -3141 -1989 -330 -1376 -2175 -3543 -848 -487 -3961 -4693 37 -999
5868 -999 -4681 -5852 -5405 -4495 308 379 758 294 -1297 -113 1955 3406 4130 5034 9491 12512 12140
$$ packed form
5985A199Q426O12o03k55m250m613l309j698M12k738R99O74J092m800K7J900O63
5968f262J21K675j787r58N399r18m099p87L531J232k024j432O594l22k530j079
5952b646k410J193O23r96k972K778K668q14m72Q3k51p97p46j476k469j634M846
5935e492K793J554j855j302L59L153P90j912P26n47m88l871p30q73J9L858P71
5918c047K659j752L71K544L254l522j428n136p2k48J328K582J01k63M771L76P19
5901C237p16P57m81J15j053j720M67M94K723M73K50k820P18k848N27m866n350
5884a0093J117K414P93J401J227J152J659j046p99j368K695L61l474p32M730j036
5868i99l682j171M47R10M803P1L79m64j591J184K068J451P24R04M457L021l72
$$ plain form
5851 12140 10453 6860 4730 1119 369 624 930 1089 -2045 -3512 -3198 -3585 -4132 -4266 -3558 2576 4681
5834 4681 3413 1295 7273 5894 3482 1030 1410 629 -1927 -2230 -2258 1153 1437 -483 3195 5704
5818 5704 4848 3726 147 -2187 -2244 -3284 -5260 -6864 -7504 -6909 -6638 -8704 -12761 -12964 -10804 -5706 -3283
5801 -3283 -1889 -4167 -4108 -496 3887 5869 7791 3545 -756 -3229 -1640 -1324 -5822 -3960 -3354 -6514
5785 -6514 -3877 -4549 -5651 -4372 -2135 -4403 -3411 -4484 -5002 -2621 1825 -1215 -735 452 -414 -1932
5769 -1932 -3176 -4249 -167 705 654 -3204 -3736 2151 6591 3204 1138 -1926 -6085 -2018 880 932
5753 932 1274 677 -1428 -1008 -3109 -2677 -1423 -21 -1412 -1122 -238 -2920 -4679 -7228 -8638 -6189 -2348
5736 -2348 -3495 -7007 -7029 -4999 -5382 -4747 -2986 -997 -3797 -9961 -9545 -5533 -2524 -2644 -4121 -3635 -61
$$ packed form
5851A2140j687l593k130l611p50K55L06J59l134j467L14l87n47j34P08O134K105
5834D681j268k118N978j379k412k452L80p81k556l03k8L411K84j920L678K509
5818E704q56j122l579k334n7j040j976j604o40N95K71k066m057k03K160N098K423
5801c283J394k278N9L612M383J982J922m246m301k473J589L16m498J862O06l160
5785f514K637o72j102J279K237k268R92j073n18K381M446l040M80J187q66j518
5769a932j244j073M082Q72n1l858n32N887M440l387k066l064m159M067K898N2
5753I32L42n97k105M20k101M32J254J402j391K90Q84k682j759k549j410K449L841
5736b348j147l512k2K030l83O35J761J989k800o164M16M012L009j20j477M86L574
$$ plain form
5719 -61 -167 -362 410 -1637 -5192 -4989 -4290 -6251 -5841 -3658 -859 -6210 -7551 -2739 -4567 -5783 -5214
5702 -5214 -4313 -2691 -3911 -7085 -4099 -1858 -1300 -662 6087 4012 554 1298 2459 2026 544 -2634
5686 -2634 -5183 -1217 -641 56 1215 -2949 -4309 -4676 -3828 -1702 -1879 -2910 -4405 -1052 154 -1655
5670 -1655 -3230 -5465 -3319 -1317 -352 4277 4622 -2032 -1561 1137 1881 -1283 117 185 -960 -1664 1936
5653 1936 2494 1364 2310 4247 -1404 -7415 -8905 -8185 -5596 -2237 -2366 514 -60 -980 779 32 1380
5636 1380 945 -1103 -2694 -5547 -6849 -4158 971 5713 3547 2701 -757 -2551 -438 -2447 -1060
5621 -1060 -350 -767 -1428 -876 3146 3331 4298 2179 -3771 -6115 -5879 -2705 272 737 5569 13418 15660
5604 15660 14142 10516 5080 805 -2703 -6067 -4618 -5159 -5697 -4525 906 7297 11503 9320 1628
$$ packed form
5719f1j06j95P72k047l555K03O99j961M10K183K799n351j341M812j828j216N69
5702e214R01J622j220l174K986K241N58O38O749k075l458P44J161m33j482l178
5686b634k549L966N76O97J159m164j360l67Q48K126j77j031j495L353J206j809
5670a655j575k235K146K002R65M629L45o654M71K698P44l164J400O8j145p04L600
5653A936N58j130R46J937n651o011j490P20K589L359j29K880n74r20J759p47J348
5636A380m35k048j591k853j302K691N129M742k166q46l458j794K113k009J387
5621a060P10m17o61N52M022J85R67k119n950k344K36L174K977M65M832P849K242
5604A5660j518l626n436m275l508l364J449n41n38J172N431O391M206k183p692
$$ plain form
5589 1628 -3565 -8268 -12197 -10543 -8311 -3574 -4466 -1764 3047 4817 6217 -651 -2817 168 -2901
5574 -2901 -1884 1558 3443 -2438 -3872 -7300 -6252 1425 3798 5710 2914 -2444 -3003 -1756 -740
5559 -740 -5339 -6405 -3607 -792 2752 7302 9596 11889 17728 25733 25795 18649 13092 1863 -6376
5544 -6376 -7780 -3501 -1407 3219 1388 1110 4997 6613 2112 -1337 -3596 -4776 -4346 -3180 -410
5529 -410 -473 -2940 -2624 -1133 -1452 -799 603 2061 1325 -2241 1305 6435 5370 2953 1078 -256 -713
5512 -713 -3550 -4017 -4381 -4887 -4269 -4069 -5093 -4825 -5033 -4059 -1866 -1413 -2376 -1554 -2052 -6738 -8103 -8969
5494 -8969 -4395 820 -1387 -6321 -7281 -6257 -5094 -3290 -4654 -3961 -676 -3155 -4543 -4574 -1692 120
5478 120 383 564 -742 -2516 -6749 -7530 -2730 2168 7714 8675 8690 7160 6046 4028 1011 -82 -1182
$$ packed form
5589A628n193m703l929J654K232M737q92K702M811J770J400o868k166K985l069
5574b901J017L442J885n881j434l428J048P677K373J912k796n358n59J247J016
5559g40m599j066K798K815L544M550K294K293N839Q005O2p146n557j1229q239
5544f376j404M279K094M626j831k78L887J616m501l449k259j180M30J166K770
5529d10o3k467L16J491l19O53J402J458p36l566L546N130j065k417j875j334m57
5512g13k837m67l64n06O18K00j024K68k08R74K193M53r63Q22m98m686j365q66
5494h969M574N215k207m934r60J024J163J804j364O93L285k479j388l1K882J812
5478A20K63J81j306j774m233p81M800M898N546R61J5j530j114k018l017j093j100
$$ plain form
5461 -1182 898 -114 -1627 -1670 -2524 -6904 -5599 -2387 -2185 -2800 -217 533 -1275 -4847 -5338 -3654 -4746
5444 -4746 -7027 -6854 -4526 -1293 -1137 -3388 -2167 2145 4272 1980 1377 -391 935 4041 1926 -2465
5428 -2465 -2939 -1791 652 1575 3796 3614 6708 4903 1102 1987 3674 3119 6426 6980 4551 2257
5412 2257 4252 5219 3811 -1716 -2938 -2495 -3850 -4396 -3711 -2657 -5841 -4544 -5915 -6711 -2185 -648
5396 -648 361 137 -1965 -890 2549 2399 -524 1239 1623 -621 -1162 -244 1014 3537 2401 -3938
5380 -3938 -8128 -8038 -7031 -5836 -5481 -2244 4182 5620 3137 3229 -3282 -6775 -6383 -1803 3853 3977 -79
5363 -79 -1107 -3965 -3310 -1323 1328 550 -5028 -6034 -4681 -7260 -8660 -5458 -4040 -3841 -443 310
5347 310 -663 -2168 -3321 -3207 -136 -1398 -1205 -3091 1600 171 -502 953 -584 1431 2093 3094
$$ packed form
5461a182K080j012j513m3q54m380J305L212K02o15K583P50j808l572m91J684j092
5444d746k281J73K328L233J56k251J221M312K127k292o03j768J326L106k115m391
5428b465m74J148K443R23K221j82L094j805l801Q85J687n55L307N54k429k294
5412B257J995R67j408n527j222M43j355n46O85J054l184J297j371p96M526J537
5396f48J009k24k102J075L439j50k923J763L84k244n41R18J258K523j136o339
5380c938m190R0J007J195L55L237O426J438k483R2o511l493L92M580N656J24m056
5363g9j028k858O55J987K651p78n578j006J353k579j400L202J418J99L398P53
5347C10r73j505j153J14L071j262J93j886M691j429o73J455j537K015O62J001
$$ plain form
5331 3094 -478 -3829 -1258 -657 2178 2386 -949 119 1587 -982 -2222 -2106 -2653 -5308 -5800 -2649
5315 -2649 -3091 -7157 -8360 -2721 773 626 -2096 -1593 -2224 -1822 -5935 -3746 -2024 -2208 -4526 -3715 -5199
5298 -5199 -9128 -9273 -7366 -7000 -8057 -6939 -2315 62 -1299 1548 3537 3917 4394 783 -704 -515
5282 -515 -2308 874 1218 76 -1179 -1977 -3259 -7355 -10150 -8641 -7205 -3867 -5727 -7425 -7308 -5970
5266 -5970 -2951 2624 -1272 -7077 -8901 -6329 -1824 -233 -272 2558 3939 3577 785 -251 -3201 -816
5250 -816 -1540 1430 2084 821 776 -103 -2536 -2290 -511 -1203 -4315 -7835 -6399 -5628 -4756 -8786 -6646
5233 -6646 -3002 -2733 -4104 -4083 -4701 -5783 -6546 -5817 1275 1561 520 -2914 -3920 -5578 -5157 -3555 -2742
5216 -2742 -2493 -3556 -3980 -2978 639 3444 1882 3070 4940 4577 3350 2471 348 -2691 -4487 -7416
$$ packed form
5331C094l572l351K571O01K835K08l335J068J468k569j240J16n47k655m92L151
5315b649m42m066j203N639L494j47k722N03o31M02m113K189J722j84k318Q11j484
5298e199l929j45J907L66j057J118M624K377j361K847J989L80M77l611j487J89
5282e15j793L182L44j142j255p98j282m096k795J509J436L338j860j698J17J338
5266e970L019N575l896n805j824K572M505J591l9K830J381l62k792j036k950K385
5250h16p24K970O54j263m5q79k433K46J779o92l112l520J436P71Q72m030K140
5233f646L644K69j371K1o18j082p63P29P092K86j041l434j006j658M21J602Q13
5216b742K49j063m24J002L617K805j562J188J870l63j227q79k123l039j796k929
$$ plain form
5200 -7416 -9036 -9517 -7860 -10003 -10850 -7610 -1848 487 1213 3794 4885 6106 2038 -1812 -754 -2067
5184 -2067 -2880 -2743 -1451 966 -898 -2383 442 349 -868 2962 6202 5959 -288 -2901 111 -4619
5168 -4619 -6872 -11226 -9653 -6719 -4731 -2790 -3429 -5667 -5969 -7667 -7095 -5751 -6145 -7105 -5599 -6264
5152 -6264 -7326 -5591 -5228 -6125 -8871 -8584 -11258 -9147 -7366 -7016 -6011 -9187 -9566 -4823 -1420 -1846
5136 -1846 -707 -2867 -6065 -7478 -5702 -7964 -5281 -559 1386 -79 -1187 -428 -1560 -2731 -2967
5121 -2967 -4810 -4239 -3165 -2386 -1454 -4101 -117 -242 -3581 1996 6800 6431 -305 -5182 -5230 -3540 -4472
5104 -4472 -6955 -3662 -2975 291 1594 4794 4937 1190 -3246 -1074 4939 6602 4522 5719 2839
5089 2839 -522 -1999 359 -995 -2404 3 -1529 2021 7373 7444 1812 2467 352 -727 -3243 -2913
$$ packed form
5200g416j620m81J657k143q47L240N762K335P26K581J091J221m068l850J058j313
5184b067q13J37J292K417j864j485K825r3j217L830L240k43o247k613L012m730
5168d619k253m354J573K934J988J941o39k238l02j698N72J344l94r60J506o65
5152f264j062J735L63q97k746K87k674K111J781L50J005l176l79M743L403m26
5136a846J139k160l198j413J776k262K683M722J945j465j108P59j132j171k36
5121b967j843N71J074P79R32k647L984j25l339N577M804l69o736m877m8J690r32
5104d472k483L293O87L266J303L200J43l747m436K172O013J663k080J197k880
5089B839l361j477K358j354j409K407j532L550N352P1n632O55k115j079k516L30
$$ plain form
5073 -2913 -2642 1437 3929 1809 -252 930 -213 -4747 -4012 -3750 -3615 1556 -1089 -961 -215 -308 -81
5056 -81 2066 11 -4061 -1408 2538 -1385 -2693 -2689 -4310 -4203 -4559 -2868 -519 -7028 -8592 -5960 -5671
5039 -5671 -7671 -5432 -4208 -2357 1901 -588 -2634 -4530 -6609 -7298 -6017 -923 6101 6924 5073
5024 5073 7072 9320 9758 11167 8732 8203 3941 -2000 -659 -2026 -4959 -2332 -3396 -2152 -449
5009 -449 3893 5317 7885 7366 5329 -1942 -9186 -6705 -3480 -2831 -3231 -1481 -834 -2240 -4748 -1767
4993 -1767 -4385 -1477 -871 -2710 -6636 -3697 -744 -105 -518 -306 1645 826 -141 -340 -1736 1501 1624
4976 1624 469 -4636 -6409 -2999 1683 3887 2658 6922 8047 5819 8610 7604 3543 -2200 -4565
4961 -4565 -1949 3244 493 -318 -2845 -5845 -7317 -6346 -1097 -196 476 -3794 -5134 -2530 3952 4931
$$ packed form
5073b913K71M079K492k120k061J182j143m534P35K62J35N171k645J28P46r3K27
5056h1K147k055m072K653L946l923j308Mj621J07l56J691K349o509j564K632K89
5039e671k000K239J224J851M258k489k046j896k079o89J281N094P024Q23j851
5024E073J999K248M38J409k435n29m262n941J341j367k933K627j064J244J703
5009d49M342J424K568n19k037p271p244K481L225O49m00J750O47j406k508K981
4993a767k618K908O06j839l926K939K953O39m13K12J951q19r67j99j396L237J23
4976A624j155n105j773L410M682K204j229M264J125k228K791j006m061n743k365
4961d565K616N193k751q11k527l000j472R71N249R01O72m270j340K604O482R79
$$ plain form
4945 4931 5207 2996 -3819 -3385 -87 -455 560 1010 -3496 -2885 -4625 -8165 -3055 619 -4961 -12158
4929 -12158 -11231 -12558 -9451 -4605 -1834 -430 -268 -4344 -2322 4961 3693 887 3006 2803 150
4914 150 -2995 325 3165 2829 616 -650 -1680 1595 5942 7416 7375 4925 -1213 -167 3453 3501
4898 3501 1792 -826 -2828 -4893 -2581 689 992 3357 4906 6198 1869 345 -1473 -2424 -1774 -2163
4882 -2163 -3406 -656 2612 5839 4947 2261 5109 4151 3456 4390 1465 -2045 -1962 50 2695 3000 1347
4865 1347 -669 -804 773 1713 2265 2773 6657 4384 1774 3435 2666 2427 1508 1129 -984 -2953 -763
4848 -763 -237 754 2133 637 -2157 -2878 -1500 -3874 -5734 -7642 -6309 -6094 -4855 -357 2606 526
4832 526 -898 -28 -2004 -2985 -6046 -9406 -3189 334 -891 -2659 -2493 -2695 1409 5031 4860 3864 2372
$$ packed form
4945D931K76k211o815M34L298l68J015M50m506O11j740l540N110L674n580p197
4929a2158R27j327L107M846K771J404J62m076K022P283j268k806K119k03k653
4914A50l145L320K840l36k213j266j030L275M347J474m1k450o138J046L620M8
4898C501j709k618k002k065K312L270L03K365J549J292m329j524j818r51O50l89
4882b163j243K750L268L227q92k686K848r58o95R34k925l510Q3K012K645L05j653
4865A347k016j35J577R40N52N08L884k273k610J661p69k39r19l79k113j969K190
4848g63N26R91J379j496k794p21J378k374j860j908J333K15J239M498K963k080
4832E26j424Q70j976r81l061l360O217L523j225j768J66k02M104L622j71r96j492
$$ plain form
4815 2372 807 -422 732 1937 1427 -1209 -3723 -4104 2394 4234 3702 5011 6748 9478 10258 8778
4799 8778 4082 -1118 -2780 -4104 -3465 -4219 -6724 -9106 -9042 -8165 -8766 -4863 -531 525 -892 -892 1130
4782 1130 2678 2039 91 -1465 -2515 -1948 -4408 -3811 -2405 -867 -1785 -961 36 -5 -326 5090 6460
4765 6460 5838 4443 3379 1719 -3164 -1003 1457 -3560 -5003 -1504 -912 -1447 -3927 -640 1608 59
4749 59 -2084 -1389 -3148 -4595 -3818 -2328 -3624 -2584 -915 -3482 -4515 -6622 -3552 -3421 -4128 -5132
4733 -5132 -6298 -3919 -4802 -3415 -2512 -231 4655 6586 7059 3694 1405 4531 9644 8428 2784 104
4717 104 -1586 -2653 -4112 -3714 -1575 -3341 1318 1830 991 1919 -1414 479 6307 7297 2091 1665 2967
4700 2967 5902 1637 522 4994 4869 6807 4618 873 -2256 -1890 -2850 -3592 -2498 547 -1023 778
$$ packed form
4815B372j565j229J154J205n10k636k514l81O498J840n32J309J737K730P80j480
4799H778m696n200j662j324O39p54k505k382O4Q77o01L903M332J056j417%K022
4782A130J548o39j948j556j050N67k460N97J406J538r18Q24R97m1l21N416J370
4765F460o22j395j064j660m883K161K460n017j443L499N92n35k480L287K248j549
4749E9k143O95j759j447P77J490j296J040J669k567j033k107L070J31p07j004
4733e132j166K379q83J387R03K281M886J931M73l365k289L126N113j216n644k680
4717A04j690j067j459L98K139j766M659N12q39R28l333J893N828R90n206m26J302
4700B967K935m265j115M472j25J938k189l745l129L66r60p42J094L045j570J801
$$ plain form
4684 778 32 -6035 -5654 -1928 1638 559 -2817 -3783 -652 -67 -2342 -716 -5450 -9603 -10605 -7087
4668 -7087 -7303 -8987 -3494 1113 3655 6062 4429 -1403 -2323 -1756 152 -4876 -7130 -2359 87 1069
4652 1069 -571 -2477 -2572 -7466 -8569 -6037 -4933 -4644 -2927 -3365 -6084 -6313 -4288 -4693 -2492 -4173
4636 -4173 -5766 -5605 -1776 616 2322 3811 1424 -2047 -5031 -6052 -4704 -4689 -1081 1975 -1635 -5361
4620 -5361 -5448 -7011 -9346 -9093 -5784 -5556 -5035 -1696 -15 -2034 -6728 -1464 208 -1832 -3961 -3704
4604 -3704 -6656 -5636 -700 -353 -2295 2021 3825 161 -3845 -4106 -2695 -3759 -2119 -3684 -2256
4589 -2256 -1130 2338 3672 4874 4359 2750 1346 -64 -2380 -3402 -3639 -3487 -2450 677 1852 -3030
4573 -3030 -543 2801 -443 128 5928 6577 3609 -52 669 -800 -3783 -2552 -5783 -7544 -6987 -2525
$$ packed form
4684G78p46o067L81L726L566j079l376r66L131N85k275J626m734m153j002L518
4668g087k16j684N493M607K542K407j633n832r20N67J908n028k254M771K446R82
4652A069j640j906r5m894j103K532J104K89J717m38k719k29K025m05K201j681
4636d173j593J61L829K392J706J489k387l471k984j021J348J5L608L056l610l726
4620e361q7j563k335K53L309K28N21L339J681k019m694N264J672k040k129K57
4604c704k952J020M936L47j942M316J804l664m006k61J411j064J640j565J428
4589b256J126L468J334J202n15j609j404j410k316j022k37J52J037L127J175m882
4573c030K487L344l244N71N800O49k968l661P21j469k983J231l231j761N57M462
$$ plain form
4557 -2525 -1327 -32 1339 178 1018 -713 -4561 -6024 -1202 691 -728 -476 -2400 -8074 -7591 -5895
4541 -5895 -3541 392 1211 3584 7147 3261 -1071 407 -1683 -3417 -4854 -5118 646 977 -2538 559
4525 559 667 1253 -3906 -4908 -4830 -3718 486 3196 -251 -2245 -4147 -6801 -5521 -2888 -36 4883
4509 4883 1969 -964 -2474 -717 -3 1230 624 -434 676 152 1957 3458 3506 2310 3022 3977 2178
4492 2178 -2507 -4733 -4545 -4195 -5308 -6808 -3538 -1966 -1144 -2090 -4675 -4811 -3833 -1715 -636 2449
4476 2449 4165 239 -4914 -3960 -3333 -6499 -10718 -10165 -3732 233 -2132 -1409 3219 7368 4769 1349
4460 1349 3457 2710 -282 890 1515 788 -1078 -89 5190 4988 1538 2845 3742 3537 5752 6230 2764
4443 2764 886 -637 2503 318 -1241 -277 618 8 -5715 -4515 259 4174 3651 -478 565 1572
$$ packed form
4557b525J198J295J371j161Q40j731l848j463M822J893j419K52j924n674M83J696
4541e895K354L933Q19K373L563l886m332J478k090j734j437k64N764L31l515L097
4525E59J08N86n159j002P8J112M204K710l447j994j902k654J280K633K852M919
4509D883k914k933j510J757P14J233o06j058J110n24J805J501M8j196P12R55j799
4492B178m685k226J88L50j113j500L270J572Q22r46k585j36R78K118J079L085
4476B449J716l926n153R54O27l166m219N53O433L965k365P23M628M149k599l420
4460A349K108p47k992J172O25p27j866R89N279k02l450J307Q97k05K215M78l466
4443B764j878j523L140k185j559R64Q95o10n723J200M774L915n23m129J043J007
$$ plain form
4427 1572 4003 3987 2890 208 -1724 -2801 -2574 -3291 -4446 -5291 -5022 -1229 -1307 -4192 -5540 -3795 -1025
4410 -1025 1228 -1083 -2449 -3358 -944 -2404 -3042 -4129 -4435 -2921 -2725 -5111 -4750 -4572 -7202 -2688
4394 -2688 -3578 -3443 -5538 -1842 2430 3866 7 -702 -294 272 252 1750 2812 2261 -919 221 -2446
4377 -2446 -8853 -9367 -2906 -2316 -13 7315 5488 3789 1696 -1065 532 3482 1644 1949 -721 -807
4361 -807 -4091 -2282 1804 6322 12406 12089 5331 5215 4615 778 -1573 -1646 -6223 -4018 -1254 -1172 1864
4344 1864 3840 3878 1471 551 -1252 -3913 -661 2776 -116 -4023 -5759 -9989 -8137 -7378 -11006 -13491
4328 -13491 -13159 -11456 -10962 -11106 -8565 -4136 -1053 -2100 -2314 444 3002 4625 3166 1550 -366 -3421
4312 -3421 -3117 -3716 -5267 -4460 -2681 540 833 -1881 -3630 -4232 -124 354 -2636 -1589 3104 1633
$$ packed form
4427A572K431j6j097k682j932j077K27p17j155q45K69L793p8k885j348J745K770
4410a025K253k311j366r09K414j460o38j087l06J514J96k386L61J78k630M514
4394b688q90J35k095L696M272J436l859p09M08N66k0J498J062n51l180J140k667
4377b446o407n14O461N90K303P328j827j699k093k761J597K950j838L05k670q6
4361h07l284J809M086M518O084l17o758j16o00l837k351p3m577K205K764Q2L036
4344A864J976L8k407r20j803k661L252L437k892l907j736m230J852P59l628k485
4328a3491L32J703M94j44K541M429L083j047k14K758K558J623j459j616j916l055
4312c421L04n99j551Q07J779L221K93k714j749o02M108M78k990J047M693j471
$$ plain form
4296 1633 -353 360 1238 -3416 -6229 -7109 -2786 2694 4077 4952 -2079 -6042 -4346 267 -2556 -6409
4280 -6409 -9134 -7262 -6644 -5436 -4052 -1788 -1028 1799 2588 3199 540 530 4150 3679 4351 5607 2016
4263 2016 316 -1581 -3769 -1865 6 2310 3855 221 -5257 -10800 -10150 -6131 -3776 -1012 873
4248 873 -1901 -814 84 209 3192 4552 6413 3945 -298 127 1933 -799 -3822 -3704 506 933
4232 933 3244 7196 2442 2794 5128 6444 9029 8379 5548 2012 2016 3897 5293 3681 5349 1722
4216 1722 -1782 3334 4797 3101 5048 5106 3476 -1010 356 -1273 -1914 -4092 -3685 511 3730 2119
4200 2119 4951 7383 8294 3983 3846 6880 2314 2402 3654 1037 -2792 1326 5795 5108 1997 412
4184 412 4811 6417 3230 3340 7036 5200 6388 6464 3490 1027 2157 144 -5044 -4071 -4633 -4778 -3650
$$ packed form
4296A633j986P13Q78m654k813q80M323N480J383Q75p031l963J696M613k823l853
4280f409k725J872O18J208J384K264P60K827P89O11k659j0L620m71O72J256l591
4263B016j700j897k188J904J871K304J545l634n478n543O50M019K355K764J885
4248H73k774J087Q98J25K983J360J861k468m243M25J806k732l023J18M210M27
4232I33K311L952m754L52K334J316K585o50k831l536MJ881J396j612J668l627
4216A722l504N116J463j696J947N8j630m486J366j629o41k178M07M196L219j611
4200B119K832K432R11m311j37L034m566Q8J252k617l829M118M469o87l111j585
4184D12M399J606l187J10L696j836J188P6k974k463J130k013n188R73n62j45J128
$$ plain form
4167 -3650 -3482 -2756 -1062 -821 -2215 3560 4106 1552 -950 -4533 -3041 35 4298 3097 2228 -34
4151 -34 1032 5167 7983 3927 2881 6996 6086 2210 -898 -4758 -7030 -6988 -8297 -4788 1147 1571
4135 1571 -1992 608 2981 4029 3862 4243 4883 2367 1038 1101 -1270 -454 2751 1400 -416 3216
4119 3216 2814 1383 2404 -34 1446 1801 3631 3507 1303 -2365 -3553 -1437 2743 7470 7210 2862
4103 2862 2090 2103 3302 3302 1563 1780 -689 -85 -2782 -1972 139 4661 9558 8426 5763 8342 9516
4086 9516 6019 3972 2401 1353 1104 -796 2186 2517 3167 3132 -339 3691 4353 2925 4207 7431
4070 7431 7459 11504 10701 5840 -1473 -1977 -261 3571 5058 3776 2229 3875 3381 9093 8734 7177
4054 7177 3555 -1130 -1005 -515 -4599 -8760 -8503 -8463 -9327 -6638 1271 4006 -302 -2914 -2375 -4669 -2525
$$ packed form
4167c650J68P26J694K41j394N775N46k554k502l583J492L076M263j201q69k262
4151c4J066M135K816m056j046M115r10l876l108l860k272M2j309L509N935M24
4135A571l563K600K373J048j67L81O40k516j329O3k371Q16L205j351j816L632
4119C216m02j431J021k438J480L55J830j24k204l668j188K116M180M727k60m348
4103B862p72J3J199%j739K17k469O04k697Q10K111M522M897j132k663K579J174
4086I516l497k047j571j048k49j900K982L31O50l5l471M030O62j428J282L224
4070G431K8M045q03m861p313n04J716L832J487j282j547J646m94N712l59j557
4054G177l622m685J25M90m084m161K57M0q64K689P909K735m308k612N39k294K144
$$ plain form
4037 -2525 5250 9614 9208 6499 6443 5300 3188 1506 2257 8388 9222 4008 -4909 -9610 -3200 6312
4021 6312 14233 11954 14224 11389 7102 2972 626 -4414 -5630 -733 7543 6736 6683 2675 -2618 2004
4005 2004 6166 1596 -358 -1581 -743 1278 -689 -2356 244 5886 7205 5039 891 -2570 -2455
3990 -2455 1465 5267 217 -573 3810 8995 6744 3491 3658 1839 -1613 -7798 -9656 -6256 -3173
3975 -3173 110 4923 5006 4459 4236 1025 2414 4197 3762 4643 350 -932 845 1333 -227 -2876 -5090
3958 -5090 -2987 -1905 -2698 -3893 -2955 -3715 -5991 -6406 -2796 1545 4467 6349 5906 3881 2187 -2787
3942 -2787 -244 4503 5939 6656 6446 4913 3652 -1269 -2540 -1710 -2164 -4205 -5138 -1219 -2199 -1370 -398
3925 -398 1017 2544 2531 2307 3423 4964 3899 4646 4044 3986 1042 -4182 -2590 1498 872 2587 3649
$$ packed form
4037b525P775M364m06k709n6j143k112j682P51O131Q34n214q917m701O410R512
4021F312P921k279K270k835m287m130k346n040j216M897Q276q07n3m008n293M622
4005B004M162m570j954j223Q38K021j967j667K600N642J319k166m148l461J15
3990b455L920L802n050p90M383N185k251l253J67j819l452o185j858L400L083
3975c173L283M813Q3n47k23l211J389J783m35Q81m293j282J777M88j560k649k214
3958e090K103J082p93j195R38p60k276m15L610M341K922J882m43k025j694m974
3942b787K543M747J436P17k10j533j261m921j271Q30m54k041r33L919r80Q29R72
3925c98J415J527j3k24J116J541j065P47o02n8k944n224J592M088o26J715J062
$$ plain form
3908 3649 4784 4318 4382 3736 6341 8758 5170 2131 4541 5403 5588 2085 996 263 3132 -51 1488
3891 1488 5556 1330 -4553 13 3152 3791 479 1667 3595 1926 4840 5194 4508 -1365 -5315 -5699
3875 -5699 -3364 2756 5114 1452 -2504 -5276 -6269 -4711 423 972 507 2340 3034 7028 4981 -1199
3859 -1199 -2100 -5130 -4948 -271 2458 -368 367 1413 4472 5461 3893 2392 -2393 -4375 -7324 -9850
3843 -9850 -11323 -9354 -5297 -1155 1821 5864 6682 5233 2712 -966 -1443 -2358 -703 1168 -600 -1181
3827 -1181 -2503 -6026 -6706 3390 7735 5901 2779 1132 -3649 615 6541 5815 2888 74 -2201
3812 -2201 -5066 -5750 -1686 3656 3277 3544 2517 90 4516 7457 858 -3008 -2750 668 -425 -2216
3796 -2216 -2069 -5835 -4122 -920 2151 1105 331 -3775 -3841 -4724 458 2000 2993 3628 -1003 -7355 -8511
$$ packed form
3908C649J135m66O4o46K605K417l588l039K410Q62J85l503j089p33K869l183J539
3891A488M068m226n883M566L139O39l312J188J928j669K914L54o86n873l950l84
3875e699K335O120K358l662l956k772r93J558N134N49m65J833O94L994k047o180
3859a199r01l030J82M677K729k826P35J046L059R89j568j501m785j982k949k526
3843i850j473J969M057M142K976M043Q18j449k521l678m77r15J655J871j768n81
3827a181j322l523o80J0096M345j834l122j647m781M264N926p26k927k814k275
3812b201k865o84M064N342l79K67j027k427M426K941o599l866K58L418j093j791
3796b216J47l766J713L202L071j046p74m106o6q83N182J542R93O35m631o352j156
$$ plain form
3779 -8511 -2897 2548 4358 6057 6038 7587 6217 3772 7279 6238 510 794 3918 5313 4352 7258
3763 7258 6480 1135 1551 6762 5280 784 1043 4324 5741 6291 247 -1780 -2139 -80 -1718 -3474
3747 -3474 -2203 3063 6547 6682 5140 3662 4443 4098 1431 1908 3079 931 -527 -4 2960 6026
3731 6026 5935 1284 -1146 1643 1359 -3274 -3830 -2370 -3690 -1441 791 -1980 -1716 -893 -3045 -255
3715 -255 1140 -3305 -1930 3778 792 2574 2857 4965 2979 -1436 -1256 -2378 248 1364 3988 338
3699 338 -1683 736 2141 -1216 -4077 1811 2759 -737 -2787 -3192 -4965 -9393 -6433 -3175 -1855 -4257
3683 -4257 -2741 -2796 453 4414 5365 2554 3943 5500 1835 -2109 -2481 -785 3409 3244 101 3000
3667 3000 2511 133 1809 -309 855 3395 -1276 -1295 480 22 -2717 -1343 -956 -168 -1609 -2487 -608
$$ packed form
3779h511N614N445J810J699j9J549j370k445L507j041n728K84L124J395r61K906
3763G258p78n345M16N211j482m496K59L281J417N50o044k027l59K059j638j756
3747c474J271N266L484J35j542j478P81l45k667M77J171k148j458N23K964L066
3731F026r1m651k430K789k84m633n56J460j320K249K232k771K64Q23k152K790
3715b55J395m445J375N708k986J782K83K108j986m415J80j122K626J116K624l650
3699C38k021K419J405l357k861N888R48l496k050m05j773m428K960L258J320k402
3683d257J516n5L249L961R51k811J389J557l665l944l72J696M194j65l143K899
3667C000m89k378J676k118J164K540m671j9J775m58k739J374L87P88j441q78J879
$$ plain form
3650 -608 -3033 -877 -89 -1269 -986 -279 -992 -3573 -6453 -6572 -5333 -2648 19 753 909 132 -912
3633 -912 1101 1656 4556 806 -1652 -3364 2281 6255 4784 1014 -1834 -2558 -1630 -2288 -4649 -4721 -1371
3616 -1371 2326 2514 195 560 1825 -1622 -4876 -5532 -4208 -3765 -4225 -6964 -8331 -4128 703 879
3600 879 2147 2135 2082 1648 1524 -33 2677 4168 2367 -937 -8491 -11431 -10885 -11872 -8520 -2763 748
3583 748 -9 -791 -4212 -3492 -2784 1239 3120 5184 2830 1983 5123 5095 756 393 465 -2388 -3401 -5408
3565 -5408 44 2412 2069 41 2090 5626 6829 5602 4119 5645 9194 10330 7419 5181 1175
3550 1175 -1201 -1408 2645 1805 3526 3939 -1503 -3848 1153 2315 2140 5105 3099 -1097 -3374 -7669
3534 -7669 -6160 -1855 1186 710 1134 2089 -616 -6302 -9125 -8987 -7598 -8028 -6419 -2296 -124 -3068
$$ packed form
3650f08k425K156P88j180K83P07p13k581k880j19J239K685K667P34J56p77j044
3633i12K013N55K900l750k458j712N645L974j471l770k848p24R28o58k361p2L350
3616a371L697J88k319L65J265l447l254o56J324M43m60k739j367M203M831J76
3600H79J268j2n3m34j24j557K710J491j801l304p554k940N46r87L352N757L511
3583G48p57p82l421P20P08M023J881K064k354q47L140k8m339l63P2k853j013k007
3565e408N452K368l43k028K049L536J203j227j483J526L549J136k911k238m006
3550A175k376k07M053q40J721M13n442k345N001J162j75K965k006m196k277m295
3534g669J509M305L041m76M24R55k705n686k823J38J389m30J609M123K172k944
$$ plain form
3518 -3068 1010 2782 -1354 -4733 -5922 -4703 -3440 -10174 -9729 -3020 -1934 -2957 -3164 -1906 911
3503 911 2674 1981 1979 2978 1623 2977 6268 6972 6720 2585 -3793 -5249 -2560 -4293 -4776 -2541 -2723
3486 -2723 -4117 -1967 -3810 -7865 -7567 -5484 -2403 329 4533 4750 3924 4250 3576 -1832 2157 5251
3470 5251 6881 7315 5390 1873 2854 3448 3811 4089 2869 2397 1887 3572 2633 3950 2851 1878 -1136
3453 -1136 -3796 -2625 -3375 -6706 -3120 352 -1084 -1621 261 -133 -526 901 -2083 -2420 1063 1203
3437 1203 1874 -689 -2492 663 -253 -1577 192 -788 -962 -2218 -4145 -3650 -5574 -5175 -1606 -2189 -1428
3420 -1428 -2617 -4363 -3948 -2466 -613 -481 562 4603 4882 1240 2368 1377 4666 8638 9057 3120
3404 3120 1934 5545 6332 4082 3620 -2872 -8098 -5134 1170 1909 2548 916 -2903 -1281 -2108 -1374
$$ packed form
3518c068M078J772m136l379j189J219J263o734M45O709J086j023k07J258K817
3503I11J763o93kR99j355J354L291P04k52m135o378j456K689j733m83K235j82
3486b723j394K150j843m055K98K083L081K732M204K17q26L26o74n408L989L094
3470E251J630M34j925l517R81N94L63K78j220m72n10J685r39J317j099r73l014
3453a136k660J171p50l331L586L472j436n37J882l94l93J427k984l37L483J40
3437A203O71k563j803L155r16j324J769r80j74j256j927M95j924L99L569n83P61
3420a428j189j746M15J482J853J32J043M041K79l642J128r91L289L972M19n937
3404C120j186L611P87k250m62o492n226K964O304P39O39j632l819J622q27P34
$$ plain form
3388 -1374 2296 6853 2406 -2943 -4441 -1026 293 482 -939 -3613 1286 1860 -1622 1213 5247
3373 5247 2477 -1528 1605 1367 -349 -1943 -2887 -300 -1331 -1972 -763 645 -98 154 563 1355 1290
$$ packed form
3388a374L670M557m447n349j498L415J319J89j421k674M899N74l482K835M034
3373E247k770m005L133k38j716j594r44K587j031o41J209J408p43K52M09P92o5
$$ [...]
##END NTUPLES=NMR SPECTRUM
##END=
