##TITLE=Analysis number 316222
Compound Code mo 00897
Project Code adrs
Chemist Name fudan
##JCAMPDX= 6.0         $$ Bruker NMR JCAMP-DX V2.0
##DATA TYPE= NMR SPECTRUM
##DATA CLASS= NTUPLES
##ORIGIN= Bruker BioSpin GmbH
##OWNER= nmr
$$ XWIN-NMR		Version 3.5
$$ Thu Jan  5 13:32:19 2006 GMT Standard Time (UT+0h)  MAYBRIDGE\nmr@NMR_250MHZ
##.OBSERVE FREQUENCY= 250.131544655141
##.OBSERVE NUCLEUS= ^1H
##.ACQUISITION MODE= SIMULTANEOUS (DQD)
##.ACQUISITION SCHEME= undefined
##.AVERAGES= 16
##.DIGITISER RES= 18
##SPECTROMETER/DATA SYSTEM= dpx250
##.PULSE SEQUENCE= zg30
##.SOLVENT NAME= CDCl3
##.SHIFT REFERENCE= (INTERNAL, CDCl3, 0, 16.522)
##AUDIT TRAIL= $$ (NUMBER, WHEN, WHO, WHERE, WHAT)
$$ ##TITLE= Audit trail, XWIN-NMR		Version 3.5
$$ ##JCAMPDX= 5.01
$$ ##ORIGIN= Bruker BioSpin GmbH
$$ ##OWNER= nmr
$$ C:\u/data/dgb/nmr/ADRS/14280/pdata/1/auditp.txt
$$ ##AUDIT TRAIL=  $$ (NUMBER, WHEN, WHO, WHERE, WHAT)
(   1,<2006-01-05 13:31:55.57 +000>,<MAYBRIDGE\nmr>,<NMR_250MHZ>,
      <created by zg, POWCHK disabled, PULCHK disabled
       configuration hash MD5:
       62 19 C7 07 E1 42 D1 B7 37 6C 3D D0 77 39 F9 E6
       data hash MD5: 64K
       84 57 2E 9E D9 44 F4 EC C0 A9 86 FE DA 93 CE 5F>)
(   2,<2006-01-05 13:32:08.99 +000>,<MAYBRIDGE\nmr>,<NMR_250MHZ>,
      <Start of raw data processing
       ef LB = 0.3 FT_mod = 6 PKNL = 1 SI = 32K 
       data hash MD5: 32K
       DD 30 7E E8 B6 39 04 34 AB 43 05 F0 F8 58 AE 0D>)
(   3,<2006-01-05 13:32:10.79 +000>,<MAYBRIDGE\nmr>,<NMR_250MHZ>,
      <apk 
       data hash MD5: 32K
       D0 E2 AA 12 1B 40 1D 22 C2 EA 3C A3 D4 29 49 9E>)
(   4,<2006-01-05 13:32:11.82 +000>,<MAYBRIDGE\nmr>,<NMR_250MHZ>,
      <abs ABSG = 5 
       data hash MD5: 32K
       D4 53 C1 76 FA 00 AB C6 61 96 1E 56 52 2F 67 89>)
$$ ##END=
$$ 
$$ hash MD5
$$ 7B A6 C9 F8 79 16 40 6A D4 30 85 12 C3 8E F0 69
##$RELAX= 
##$RELAX= 
##$RELAX= 
##$RELAX= 
##$RELAX= 
##$RELAX= 
##$RELAX= 
$$ Bruker specific parameters
$$ --------------------------
##$DU= <C:\u>
##$EXPNO= 14280
##$NAME= <ADRS>
##$PROCNO= 1
##$TYPE= <nmr>
##$USER= <dgb>
##$AMP= (0..31)
100 100 100 100 100 100 100 100 100 100 100 100 100 100 100 100 100 100 
100 100 100 100 100 100 100 100 100 100 100 100 100 100 
##$AQSEQ= 0
##$AQ_mod= 3
##$AUNM= <au_zg>
##$AUTOPOS= <47 >
##$BF1= 250.13
##$BF2= 250.13
##$BF3= 250.13
##$BF4= 250.13
##$BF5= 500.13
##$BF6= 500.13
##$BF7= 500.13
##$BF8= 500.13
##$BYTORDA= 1
##$CFDGTYP= 0
##$CFRGTYP= 5
##$CHEMSTR= <none>
##$CNST= (0..31)
1 1 145 1 1 1 1 1 1 1 1 1 1 1 1 1 1 1 1 1 1 1 1 1 1 1 1 1 1 1 1 1 
##$CPDPRG= <>
##$CPDPRG1= <>
##$CPDPRG2= <>
##$CPDPRG3= <>
##$CPDPRG4= <mlev>
##$CPDPRG5= <mlev>
##$CPDPRG6= <mlev>
##$CPDPRG7= <mlev>
##$CPDPRG8= <mlev>
##$CPDPRGB= <>
##$CPDPRGT= <>
##$D= (0..31)
0 1 0 0 0 0 0 0 0 0.06 0 0 0 0 0 0 0.0002 0 0 0 0 0 0 0 0 0 0 0 0 0 0 
0 
##$DATE= 1136467914
##$DBL= (0..7)
120 120 120 120 120 120 120 120 
##$DBP= (0..7)
150 150 150 150 150 150 150 150 
##$DBP07= 0
##$DBPNAM0= <>
##$DBPNAM1= <>
##$DBPNAM2= <>
$$ [...]
##$SUBNAM7= <"">
##$SUBNAM8= <"">
##$SUBNAM9= <"">
##$SW= 20.6930455092707
##$SWIBOX= (0..15)
0 0 3 0 0 0 0 0 0 0 0 0 0 0 0 0 
##$SW_h= 5175.983436853
##$TD= 65536
##$TD0= 1
##$TE= 294.16
##$TE2= 300
##$TE3= 300
##$TEG= 300
##$TL= (0..7)
0 120 120 120 120 120 120 120 
##$TP= (0..7)
150 150 150 150 150 150 150 150 
##$TP07= 0
##$TPNAME0= <>
##$TPNAME1= <>
##$TPNAME2= <>
##$TPNAME3= <>
##$TPNAME4= <>
##$TPNAME5= <>
##$TPNAME6= <>
##$TPNAME7= <>
##$TPOAL= (0..7)
0.5 0.5 0.5 0.5 0.5 0.5 0.5 0.5 
##$TPOFFS= (0..7)
0 0 0 0 0 0 0 0 
##$TUNHIN= 0
##$TUNHOUT= 0
##$TUNXOUT= 0
##$USERA1= <user>
##$USERA2= <user>
##$USERA3= <user>
##$USERA4= <user>
##$USERA5= <user>
##$V9= 5
##$VALIST= <valist>
##$VCLIST= <CCCCCCCCCCCCCCC>
##$VD= 0
##$VDLIST= <DDDDDDDDDDDDDDD>
##$VPLIST= <PPPPPPPPPPPPPPP>
##$VTLIST= <TTTTTTTTTTTTTTT>
##$WBST= 1024
##$WBSW= 4
##$XGAIN= (0..3)
0 0 0 0 
##$XL= 0
##$YL= 0
##$YMAX_a= 447834
##$YMIN_a= -504035
##$ZGOPTNS= <>
##$ZL1= 120
##$ZL2= 120
##$ZL3= 120
##$ZL4= 120
##$ABSF1= 16.522
##$ABSF2= -4.171173
##$ABSG= 5
##$ABSL= 3
##$ALPHA= 0
##$AQORDER= 0
##$ASSFAC= 0
##$ASSFACI= 0
##$ASSFACX= 0
##$ASSWID= 0
##$AUNMP= <proc_1d>
##$AZFE= 0.1
##$AZFW= 0.1
##$BCFW= 0
##$BC_mod= 0
##$BYTORDP= 0
##$COROFFS= 0
##$CY= 12.5
##$DATMOD= 1
##$DC= 0
##$DFILT= <>
##$DTYPP= 0
##$F1P= 14.0000005364418
##$F2P= -0.99999901652339
##$FCOR= 0.5
##$FTSIZE= 32768
##$FT_mod= 6
##$GAMMA= 0
##$GB= 0
##$INTBC= 1
##$INTSCL= 1
##$ISEN= 128
##$LB= 0.3
##$LEV0= 0
##$LPBIN= 0
##$MAXI= 10000
##$MC2= 0
##$MEAN= 0
##$ME_mod= 0
##$MI= 0
##$NCOEF= 0
##$NC_proc= -2
##$NLEV= 6
##$NOISF1= 0
##$NOISF2= 0
##$NSP= 0
##$NTH_PI= 0
##$NZP= 0
##$OFFSET= 16.522
##$PC= 1
##$PHC0= -65.42141
##$PHC1= 4.529769
##$PH_mod= 1
##$PKNL= yes
##$PPARMOD= 0
##$PSCAL= 4
##$PSIGN= 0
##$REVERSE= no
##$SF= 250.13
##$SI= 32768
##$SIGF1= 0
##$SIGF2= 0
##$SINO= 400
##$SIOLD= 32768
##$SREGLST= <1H.CDCl3>
##$SSB= 0
##$STSI= 32768
##$STSR= 0
##$SW_p= 5175.98343685301
##$SYMM= 0
##$S_DEV= 0
##$TDeff= 65536
##$TDoff= 0
##$TI= <Analysis number 999999
Compound Code 99
Book Reference 9
Project Code 9>
##$TILT= no
##$TM1= 0
##$TM2= 0
##$TOPLEV= 0
##$USERP1= <user>
##$USERP2= <user>
##$USERP3= <user>
##$USERP4= <user>
##$USERP5= <user>
##$WDW= 1
##$XDIM= 32768
##$YMAX_p= 332227513
##$YMIN_p= -258135
$$ End of Bruker specific parameters
$$ ---------------------------------
##NTUPLES= NMR SPECTRUM
##VAR_NAME=  FREQUENCY,     SPECTRUM/REAL,   SPECTRUM/IMAG
##SYMBOL=    X,             R,               I
##VAR_TYPE=  INDEPENDENT,   DEPENDENT,       DEPENDENT
##VAR_FORM=  AFFN,          ASDF,            ASDF
##VAR_DIM=   32768,         32768,           32768
##UNITS=     HZ,            ARBITRARY UNITS, ARBITRARY UNITS
##FACTOR=    0.157963299565203, 1,           1
##FIRST=     4132.6476996994, 0,             0
##LAST=      -1043.33573715361, 0,           0
##MIN=       -1043.33573715361, -258135,     0
##MAX=       4132.6476996994, 332227513,     0
$$ Real data points
##PAGE= N=1
##DATA TABLE= (X++(R..R)), XYDATA
$$ [...]
##PAGE= N=2
##DATA TABLE= (X++(I..I)), XYDATA
15941a69809L738l58j874n46o66r5J254K108m47k165J427L223Q8n99K016o9j227
15924a64001o37l150J752L038J285L90j891r69O21R05N36K889J109J20o67m27
15908a59097O07J288M24K084J537J960k460k20j989p56O13K169J610J477L15l272
15892a53710J165J574j603N90J126k637j212R10K383N60k042J144L936K316q36
15877a46336k605j95J286j310K005L54o53J100j339J101K680j187N89J208J489
15862a41813j562j818L83J368J279K201N48j977j241L207J40L002R02j389k780
15847a39550q88J771J624j23p86M72j441K311Q71P52j278P10J604K60K88J255
15831a32148L26J131J471r12j131P83J883R1N49k117j831N51M74J565K969N77
$$ plain form
15941 -169809 -166071 -166429 -168303 -168849 -169515 -169610 -168356 -166248 -166695 -168860 -167433 -164210 -164122 -164721 -162705 -162774 -164001
15924 -164001 -164638 -167788 -166036 -162998 -161713 -161323 -163214 -164183 -163562 -162657 -162121 -159232 -158123 -158003 -158670 -159097
15908 -159097 -158490 -157202 -156778 -154694 -153157 -151197 -153657 -153877 -155866 -156622 -156009 -153840 -152230 -150753 -150438 -153710
15892 -153710 -152545 -150971 -152574 -151984 -150858 -153495 -154707 -153797 -151414 -150854 -152896 -151752 -147816 -145500 -146336
15877 -146336 -148941 -149136 -147850 -149160 -147155 -146801 -147454 -146354 -147693 -146592 -143912 -145099 -144510 -143302 -141813
15862 -141813 -143375 -145193 -144810 -143442 -142163 -139962 -139414 -141391 -142632 -139425 -139285 -136283 -135381 -136770 -139550
15847 -139550 -140438 -138667 -137043 -137166 -137952 -137480 -138921 -136610 -135739 -134987 -136265 -135555 -133951 -133691 -133403 -132148
15831 -132148 -131822 -130691 -129220 -130132 -131263 -130480 -128597 -128506 -127957 -130074 -131905 -131354 -130880 -129315 -126346 -125769
15815a25769l952N00J604K063K864L83j426j765J48J143K890J395R79R09j302
15800a19336o49k109J945j282j17J153K037J093J587j374JJ09P65L54l53p22q07
15783a17705J770q0o34K21j145J648J528K912J463j8j820j359j320N10N35Q01
15767a12693J832L699J167n05j030J80R22J076Q02p47j018k345J233L368K176
15752a01883O87M84j244L82P99K49j323j703j577j490J123O16J031L821J210l57
15736i9175Q99K52Q43R8k532r02o49l366J515K473k04J138R51K472K298o69M74
15719i4084j8K324J905j71J360r76j558J296R36k658q61k239l29L398M746M5r71
15702h7855n55nj128l961M01K773J417K184L660J008j708l691k543J506J571L23
$$ plain form
15815 -125769 -129721 -129221 -127617 -125554 -122690 -122307 -123733 -125498 -125350 -124207 -121317 -119922 -118943 -118034 -119336
15800 -119336 -119985 -122094 -120149 -121431 -121548 -120395 -118358 -117265 -115678 -117052 -117051 -116942 -116177 -115823 -116176 -116898 -117705
15783 -117705 -115935 -116015 -116649 -116428 -117573 -115925 -114397 -111485 -110022 -110040 -111860 -113219 -114539 -114029 -113494 -112693
15767 -112693 -110861 -107162 -105995 -106500 -107530 -107350 -106428 -105352 -104550 -105297 -106315 -108660 -107427 -104059 -101883
15752 -101883 -101196 -100712 -101956 -101574 -100775 -100526 -101849 -103552 -105129 -106619 -105496 -104880 -103849 -100028 -98818 -99175
15736 -99175 -98276 -98024 -97181 -97083 -99615 -100517 -101166 -104532 -103017 -100544 -100748 -99610 -98659 -96187 -93889 -94558 -94084
15719 -94084 -94102 -91778 -89873 -90044 -88684 -89660 -91218 -89922 -88986 -91644 -92505 -94744 -95073 -91675 -86929 -86884 -87855
15702 -87855 -88410 -88415 -89543 -93504 -93103 -90330 -88913 -86729 -83069 -82061 -83769 -87460 -90003 -88497 -86926 -86603
15686h6603J316J417o01j838j398j773M84O261K791K30k056q81J156k21K944K6
15670g8746L44J076n93J090R15l1l748k814M42L085N73K31J489j138o92J594L285
15653g3638Q29j483K41j351q21k46k033k9J349J33L135O84Q93Q70Q95K277J112
15636f7183l365k108M59J247J451J023j306R75M280K153j571n08o06l36J260J69
15620f3966j169M11J167L48r36j92l83J209J789n3R15O7K22q6m11P74K044O4N17
15601e7669J421K05J820o56j420N7j452l19J036J017j100m13P84j94l50J245P66
15584e5222L12K285J501R43l39o36j3l56J688M80k5r07Q21j088K906L725O40q46
15566d4131m30j551m26L341J532J45j540r09j121j224R86P35j672p29q91N72J248
$$ plain form
15686 -86603 -85287 -83870 -84471 -86309 -87707 -89480 -88996 -82735 -79944 -79714 -81770 -82651 -81495 -81716 -78772 -78746
15670 -78746 -78402 -77326 -77919 -76829 -75914 -75945 -79693 -82507 -82065 -78980 -78407 -78176 -76687 -77825 -78517 -76923 -73638
15653 -73638 -72809 -74292 -74051 -75402 -76223 -76469 -78502 -78531 -77182 -77049 -73914 -73230 -72337 -71467 -70572 -68295 -67183
15636 -67183 -70548 -72656 -72197 -70950 -69499 -68476 -69782 -68807 -64527 -62374 -63945 -64453 -65059 -65395 -64135 -63966
15620 -63966 -65135 -64724 -63557 -63209 -64145 -64337 -64720 -63511 -61722 -61775 -60860 -60793 -60571 -60657 -61068 -60294 -58250 -58186 -57669
15601 -57669 -56248 -56043 -54223 -54879 -56299 -56242 -57694 -58013 -56977 -55960 -57060 -57473 -56689 -56883 -57233 -55988 -55222
15584 -55222 -54910 -52625 -51124 -50181 -50520 -51156 -51169 -51525 -49837 -49357 -49382 -50289 -49468 -50556 -47650 -43925 -43285 -44131
15566 -44131 -44561 -46112 -46538 -43197 -41665 -41520 -43060 -43969 -45090 -46314 -45328 -44593 -46265 -46994 -47885 -47313 -46065
15549d6065k40L97L74k68P33K299j044j698J03L273R49R39J18j135N26K764K506
15532c5469k98N04J50l93J57K528j54k760m13J439K145J105R18j030j675n40J170
15515c2616J178K37M69J251J075j17k761j450L362K574J718k29j149j170J213
15500b6415K60K43j379J420J659l65p84q19J71J247M840o6j733P24O81R70L51
15483a8995J251k154j906J73j590l469k99L889L81N98rk613J562J905K249L75
15467a8652K479j247L98P25rJ05J86q40l23K067R21k203j176J765Q3O48L62J484
15449a3227J528M66q93r52J671Q68J84J507J336O97j128J94K620N64k699j485
15433h749m00Q36Q66j0L09n95j406n70K084Q65J597q84J0K910J062j5P19J942
$$ plain form
15549 -46065 -46305 -45908 -45534 -45802 -45069 -42770 -43814 -45512 -45409 -42136 -41187 -40248 -40130 -41265 -40739 -37975 -35469
15532 -35469 -35767 -35263 -35113 -35506 -35349 -32821 -32975 -35735 -36148 -34709 -32564 -31459 -30541 -31571 -33246 -33786 -32616
15515 -32616 -31438 -31201 -30732 -29481 -28406 -28523 -31284 -32734 -29372 -26798 -25080 -25309 -26458 -27628 -26415
15500 -26415 -26155 -25912 -27291 -25871 -24212 -24577 -25361 -26180 -26009 -24762 -19922 -19988 -21721 -20997 -20316 -19346 -18995
15483 -18995 -17744 -19898 -21804 -21631 -23221 -26690 -26989 -23100 -22719 -22121 -22130 -24743 -23181 -21276 -19027 -18652
15467 -18652 -16173 -17420 -17022 -16297 -16306 -16201 -16015 -16855 -17178 -15111 -14190 -16393 -17569 -15804 -15721 -15073 -14711 -13227
15449 -13227 -11699 -11233 -12126 -13078 -11407 -10539 -10355 -8848 -7512 -6815 -7943 -7749 -5129 -4565 -7264 -8749
15433 -8749 -9149 -8313 -7447 -7457 -7148 -7743 -9149 -9719 -7635 -6770 -5173 -6057 -6047 -3137 -2075 -2090 -1371 571
15415E71K473k118J141J252q96K744n40k104l836j767N8J853j67R74J687J071
15399B396J15j127p76Q01j02j222R09P42K109r18J307K414J125P37M47k608j23
15382F226P67L50M64K565m9r40L93j300r2J061L51K84n18k0J394o92j695j133
15364G416J022n27J668J261N82K148J299j520J756Q24k337n8J975q08r9K785K898
15347B0285k348m906O57K981K045P59k089J68P27K266K21l81j65O71j56j791l52
15330A8592J838J167J627J855j3k450j221L019J639k31l09j38L032j434k38O28
15314B7363J953J670k146k72J052j089O11J539r12k945p97K649K860J075O23O9
15298C3303j611n56J73j60M28R14k76m8J473N27M51j814R46J465J1q03L243K459
$$ plain form
15415 571 3044 926 2067 3319 2423 5167 4627 2523 -1313 -3080 -3022 -1169 -1336 -362 1325 2396
15399 2396 2511 1384 608 1409 1307 85 994 1736 3845 2927 4234 6648 7773 8510 8957 6349 6226
15382 6226 6993 7343 7807 10372 10323 9383 9776 8476 8384 9445 9796 10080 9562 9542 10936 10244 8549 7416
15364 7416 8438 7911 9579 10840 11422 13570 14869 13349 15105 15929 13592 13534 15509 14701 14602 17387 20285
15347 20285 17937 13031 13688 16669 18714 19473 17384 17552 18279 20545 20766 20385 20220 20891 20735 18944 18592
15330 18592 20430 21597 23224 25079 25066 22616 21395 24414 26053 25822 25513 25375 28407 26973 26735 27363
15314 27363 29316 30986 28840 28568 29620 28531 29142 30681 29769 26824 26027 28676 31536 32611 33234 33303
15298 33303 31692 31136 31309 31149 31577 32491 32215 32167 33640 34167 34618 32804 33750 35215 35226 34423 37666 40125
15280D0125R96J42j929o37J143K724J246j259j736K610J420k025N76p18j015J420
15264D3083k03j019j085J165J222m57j107L90O00j17p44P32J656J467L10l62l85
15247D5146o15k57J307J664J736l0k175n85N80M54K075P23j920j163J733M332
15231E3005N19o11L432R44j95k38j994o70r63j488o60K74L13j792K732K342Q29
15214E5779j000j120O73K147J649n0K13k485P90K580j228P22Q03K313J733n40
15198F2979k103m20N60M97l19L54j006L73M099J722J592J93j32m2L7j76J584K880
15180G2672o23l90J99j80O39O49K23k05j621R14K432L42n81j731K295L632j699
15163G6967j497K088M65j53m30K341K245R0j402Q27j084n47K173J577n75j820
$$ plain form
15280 40125 41121 41263 39334 38697 39840 42564 43810 42551 40815 43425 44845 42820 43396 42678 41663 43083
15264 43083 42880 41861 40776 41941 43163 42706 41599 41989 42589 42472 41728 42460 44116 45583 45893 45531 45146
15247 45146 44531 44274 45581 47245 48981 48951 46776 46191 46771 47225 49300 50023 48103 46940 48673 53005
15231 53005 53524 52913 56345 57289 57094 56856 54862 54192 53229 51741 51081 51355 51668 49876 52608 54950 55779
15214 55779 54779 53659 54332 56479 58128 58078 58291 55806 56596 59176 57948 58670 59473 61786 63519 62979
15198 62979 60876 60456 61016 61513 61194 61548 60542 60915 65014 66736 68328 68521 68389 68347 68384 68208 69792 72672
15180 72672 72049 71659 71858 71678 72317 72966 73189 72984 71363 72277 74709 75051 74470 72739 75034 78666 76967
15163 76967 75470 77558 78023 77870 77440 79781 82026 82116 80714 81541 80457 79910 82083 83660 83085 81265
15147H1265Q50J461j58N27J900J954l33m55l78J561L69j450r15L800L092j88N81
15130I3483j165j864J342M374J169J234j781L94J507K146M695J384P80j63K506
15115A10041J386K312M20p54Q93K055J030m43K643J513J933K309L689L638M603
15100A37268L069K352K146O201N630O790P684Q525J1270J0396M349j616r180k0390
15086A74494l0866l9313m1854l6671k8124k0301j3352k464N691J0830J1651J0594
15074C15P787P155N570M928M848N852K671M91J7M346L591M223L144K963L29R9
15058E8329j317O40K510K524L871L428K602J142O33o17o25J520J797J424P89K737
15042H1387j713k098M539K571k020n74K28P64R58J731j213j379J361L396j355
$$ plain form
15147 81265 82115 83576 83418 83945 85845 87799 87466 87011 86633 88194 88563 87113 86198 89998 93090 92902 93483
15130 93483 92318 90454 91796 96170 97339 98573 96792 97186 98693 100839 105534 106918 107698 107535 110041
15115 110041 111427 113739 114159 113405 114298 116353 117383 116940 119583 121096 123029 125338 129027 132665 137268
15100 137268 140337 142689 144835 151036 156666 163456 171140 179665 190935 201331 205680 204064 194884 174494
15086 174494 143628 104315 62461 25790 -2334 -22635 -35987 -38451 -32760 -21930 -10279 315
15074 315 8102 15257 20827 25755 30603 36455 39126 39617 39634 43980 47571 51794 54938 57901 58230 58329
15058 58329 57012 57652 60162 62686 66557 69985 72587 73729 74362 73745 73120 74640 76437 77861 78650 81387
15042 81387 79674 77576 82115 84686 82666 82092 82320 83084 84042 85773 84560 83181 84542 87938 86583
15027H6583q03N34j185j892J363L216L524Q97QJ036J707J190l73j019O13j719
15011I3680k981p71J861J557K66N88K113P65j043J122M28R65K48K125J33J639
14995A02695j3j265n75K163J882k20J5K230J426m56k113j523O28R96n1j397R75
14978A05397k31P47R59J246J831Q28j486j724l25P53L085L823J656J034k595j741
14962A13257j5m56k98L031J243N59Q74k93q26R70j858k120J608L337K009J061
14946A22083j528j703j576j071L8J544j48j878J009O1j5K062J888J756m14K96
14930A22404L610l45j35q67j603O76K298L743J30l007j892L607n3j599J061M32
14914A28460j72K282p55k081l4K776J489q93M27j801j008J016P54J305j11p64
$$ plain form
15027 86583 85780 86314 85129 83237 84600 87816 91340 92237 92245 93281 94988 96178 95805 94786 95399 93680
15011 93680 90699 89928 91789 93346 93612 94200 96313 97078 96035 97157 97585 98550 98798 100923 101056 102695
14995 102695 102682 101417 100842 103005 104887 104667 104682 106912 108338 107882 105769 104246 104874 105870 105819 104422 105397
14978 105397 105166 105913 106872 108118 109949 110777 109291 107567 107242 107995 111080 114903 116559 117593 114998 113257
14962 113257 113242 112786 112488 115519 116762 117321 118195 117902 117076 118046 116188 114068 115676 119013 121022 122083
14946 122083 120555 118852 117276 116205 116243 117787 117639 115761 116770 116831 116816 118878 120766 122522 122108 122404
14930 122404 126014 125669 125534 124667 123064 123740 126038 129781 129911 126904 125012 128619 128566 126967 128028 128460
14914 128460 128288 130570 129815 127734 127700 130476 131965 131072 131499 129698 128690 129706 130460 131765 131654 130890
14898A30890K049QJ525J73j39k042K05K528n05K136J067j83k568n77L34j791M429
14881A37539L744j107J868O31J139J263K24o44L01k06p81j665k424j917j1R35
14865A38889K160J389L80R96l71j77M030P4q17j805k210K379Q88J365n40M540
14849A51170p89j610j622K788o23N54J017l9L580J103k593O45J472k235K356L593
14833A58767k077k73p01j93l251p10L901N26k085k581j463J246L453O6J265N98
14817A56488j605p12J936Q22P73P20R02J073Q51J813j336M14J943q22j070J818
14801A64008J694Q47n28j736k819J147J839K032K460j399L44J426L83o21q91J868
14785A70054N5o63R01Q54J635J042k130k236J636J939R57j199J693J639Q29j028
$$ plain form
14898 130890 132939 132947 134472 134645 134506 132464 132669 135197 134692 136828 137895 137712 135144 134567 134901 133110 137539
14881 137539 141283 140176 142044 142675 143814 145077 145301 144657 144958 144752 143971 142306 139882 137965 137954 138889
14865 138889 141049 142438 142818 143814 143443 143266 147296 147370 146553 144748 142538 144917 145805 147170 146630 151170
14849 151170 150381 148771 147149 149937 149314 149868 150885 150846 154426 155529 152936 153581 155053 152818 155174 158767
14833 158767 156690 156417 155716 155523 152272 151562 155463 155989 153904 151323 149860 151106 154559 154625 155890 156488
14817 156488 154883 154171 156107 156929 157702 158422 159324 160397 161248 163061 161725 162139 164082 163260 162190 164008
14801 164008 165702 166549 166021 164285 161466 162613 164452 166484 168944 167545 167889 169315 169698 169077 168186 170054
14785 170054 170109 169446 170347 171201 172836 173878 171748 169512 171148 173087 174044 172845 174538 176177 177006 175978
14769A75978O34j269k677q35Q58J379r06N82R38J472N12K247j219J063n53j638
14753A76566M1m21K0q23O81L403J008j81q22J544P89J46J369P09r93K2j042j149
14735A80867P03J382m16R39l78q1K036K94q5L63K310r14n02p70L58j024J532J823
14717A88437J361K148N71k7q07j704k328m76M770m04j539l41J386r80J400M848
14701A96315M57n725r80L8Q19J090k31J292R46j130L51L235K03J141q62J93J420
14684A98572q8k076r20n25J307n57Q64J66l02K599M74m8J492j614k675j56L41
14667A96854L449L735j408j860J212R58l03J322R0J632r8J48k83J604N72m75P57
14650B07906L05J487L36j338R6m53l20J979J497j504j093J494j406K46J690J792
$$ plain form
14769 175978 176612 175343 172666 171831 172689 174068 173162 173744 174682 176154 176666 178913 177694 178757 178204 176566
14753 176566 176607 176186 176206 175383 176064 179467 180475 180294 179472 181016 181805 181951 183320 184029 183036 183058 182016 180867
14735 180867 181570 182952 182536 183475 183097 183016 185052 185346 185261 185624 187934 187020 186518 185748 186106 185082 186614 188437
14717 188437 189798 191946 192517 192490 191683 189979 187651 187175 191945 191541 190002 189661 191047 190067 191467 196315
14701 196315 196772 191047 190067 190105 190924 192014 191783 193075 194021 192891 193242 196477 196680 197821 196959 197152 198572
14684 198572 198484 196408 195488 194963 196270 195713 196577 196743 196441 199040 199514 199466 200958 199344 196669 196513 196854
14667 196854 200303 204038 202630 200770 201982 202940 202637 203959 204049 205681 205583 205731 205448 207052 207624 207149 207906
14650 207906 208211 209698 210034 208696 208792 208339 208019 209998 211495 209991 208898 210392 208986 209232 210922 212714
14634B12714k0J866M69j068j591k119J18N56K931J326L90L13p99k212r54p34N11
14617B11697J492R80j380Q75K848J421j012k71l53L420J271J43r41j861K293R72
14601B21594J366j374q64J819M10j301K580J147l39K328J359K5J357P66j942k123
14585B26808j075j07J14O50O35m9K034J196l06j151Q12K860j448Q81J925k483
14569B31296M87J712L68r24K18R74K062j48r2j694k56J792m88R95Q22r32j050
14552B35142J801k74j160M12J712L873q39m046k009M094K707J765J289J758p1
14537B46154O98j895L65J169k306M99J812l38j188K84j176J182K217Q10k398q16
14521B45073Q56K546r3J217p13J132J137n02J762J043Q45O43M25n2k637l08R8
$$ plain form
14634 212714 212694 214560 215029 213961 212370 210251 210369 210925 213856 215182 215572 215885 215086 212874 211920 211186 211697
14617 211697 213189 214169 212789 213664 216512 217933 216921 216650 216297 219717 220988 221131 220190 218329 220622 221594
14601 221594 222960 221586 220722 222541 222951 221650 224230 225377 225038 227366 228725 228750 230107 230873 228931 226808
14585 226808 225733 225626 225740 226390 227025 226976 229010 230206 229900 228749 229561 232421 230973 231854 233779 231296
14569 231296 231783 233495 233863 232939 233157 234131 236193 236045 235953 234259 234003 235795 235307 236302 237124 236192 235142
14552 235142 236943 236669 235509 235921 237633 241506 240667 236621 234612 238706 241413 243178 244467 246225 246154
14537 246154 246852 244957 245322 246491 244185 244684 246496 246158 244970 245254 244078 245260 247477 248287 245889 245073
14521 245073 245929 248475 248382 249599 248886 250018 251155 250653 252415 253458 254303 254946 255371 255319 252682 252374 252472
14504B52472K85J829k08p14k94n91J223K584p27n81q75J490N58o22J885j261j90
14487B56263J499J721L30N03K670m06r89O78J49r53r27J211J326N41J71K095J373
14470B67255j82L81R60J929M07j019n97l257l525k061N07k134M09K347K797J892
14454B66109r61M57Q66J145JK187K530m69N12K241l62l890j58J561J599R28K05
14437B74501j69l759j815p71L109K986J694K075K152j566k382J116Q70K813J847
14422B82701j103l235n86J270P96k70J199L588J390k160j402J510J245J405K51
14407B86599P76k127k070n24J914J353k81m43M3J833r17J543l8j384R6K107N060
14390B93540j849p98l26K685K104p47j99j856J51J694L568L388m094k114K45j84
$$ plain form
14504 252472 252757 254586 254378 253664 253370 252779 254002 256586 255859 255278 254403 255893 256451 255829 257714 256453 256263
14487 256263 257762 259483 259813 260316 262986 262580 261591 262269 262418 261465 260538 261749 263075 263616 263787 265882 267255
14470 267255 267073 267454 268414 270343 270750 269731 269134 265877 262352 260291 260798 258664 259073 261420 264217 266109
14454 266109 265148 265605 266471 267616 267617 269804 272334 271865 272377 274618 274256 270366 270208 271769 273368 274296 274501
14437 274501 274332 270573 268758 267987 271096 274082 275776 277851 280003 278437 276055 277171 278041 280854 282701
14422 282701 281598 278363 277777 279047 279843 279573 280772 284360 285750 283590 282188 283698 284943 286348 286599
14407 286599 287375 285248 283178 282654 284568 285921 285640 285197 285240 287073 286156 287699 287661 286277 286373 288480 293540
14390 293540 291691 290893 290567 293252 295356 294609 294410 292554 292705 294399 297967 301355 297261 295147 295392 295208
14374B95208L276j806O2J287J91K789l6p62J110N93j608j740O56L11J199k34J813
14357C02309J198k01J410J047j87J10r94j866J609K79N55j853k394J253J546P90
14341C04611J313P7k42j531K053l79J061J126J075M69O57K914J815J157p69k642
14325C12765k418K554N55r66J662K274j028J47O68o22O81k080M39J034p89r67
14309C13909o70O21L300K283J996l80j86P29O93j532m37J158J347o60k351q84
14293C18936J286M645K9p54K974O21j899k39K30P78K38J381j175R19J539M64K27
14276C30200J231K436j807j931J679j427k193j777p69n91J630K737K331J850J075
14261C34674j150k373J343K657n71J032K154J721j938j788J59R22K629j03m26
$$ plain form
14374 295208 298484 296678 296740 298027 298218 301007 300971 300209 301319 301912 300304 298564 299220 299531 300730 300496 302309
14357 302309 303507 303306 304716 305763 305576 305686 304692 302826 304435 304714 305269 303416 301022 302275 303821 304611
14341 304611 305924 306001 305759 304228 306281 305902 306963 308089 309164 309633 310290 313204 315019 316176 315407 312765
14325 312765 310347 312901 313456 312490 314152 316426 315398 315545 316213 315591 316272 314192 314631 315665 314876 313909
14309 313909 313239 313860 317160 319443 321439 321059 320873 321602 322295 320763 320326 321484 322831 322171 319820 318936
14293 318936 320222 324867 324896 324142 327116 327737 325838 325599 325829 326607 326845 328226 327051 327970 329509 329973 330200
14276 330200 331431 333867 332060 330129 331808 330381 328188 326411 325642 325051 326681 329418 331749 333599 334674
14261 334674 333524 331151 332494 335151 334580 335612 337766 339487 337549 335761 335920 336842 339471 339368 338942
14246C38942J633O47P76K4j745j684K105K832J357K32p63K114R00j505j970N34
14230C44429N84K805K26J695P46Q3J307J941o26n91k750k508K307R42J739K44
14214C52573N89R10m18k785j86J673k05O46P16J095J070J023K44j535l13J22O27
14197C55846P23j166r00K86P22J289n71J940K453J157P98J98O31K28K014O04J77
14180C66429L17k92M62N78l63K137K859j721j63K009J151j351q93l25Q99J756
14164C73489K991j740O07q93k507J984L710r60j938N71j396j25j81k3K652J606
14148C77847K264M209j934l577N87L57p35J523r67N60J788K818j164l74J561K710
14132C87473k91l54j275M88N97m3j461r66L682o54j531J114K131o40J585J070
$$ plain form
14246 338942 340575 341222 341998 342022 340277 338593 340698 343530 344887 345119 344356 346470 347370 345865 343895 344429
14230 344429 345013 347818 348044 349739 350485 350568 351875 353816 353190 352599 349849 347341 349648 350590 352329 352573
14214 352573 353162 354072 353654 350869 350683 352356 352151 352797 353513 354608 355678 356701 356945 355410 355097 355219 355846
14197 355846 356569 355403 354503 354789 355511 356800 356229 358169 360622 361779 362577 362775 363406 363634 365648 366252 366429
14180 366429 366746 366454 366916 367494 367131 369268 372127 370406 370243 372252 373403 372052 371159 370834 371733 373489
14164 373489 376480 374740 375347 374454 371947 373931 377641 376681 374743 375314 373918 373793 373612 373589 376241 377847
14148 377847 380111 384320 382386 378809 379396 379753 379018 380541 379574 380134 381922 384740 383576 383202 384763 387473
14132 387473 387182 386828 385553 386041 386638 386595 385134 384168 387850 387196 385665 386779 388910 388270 389855 390925
14116C90925J252L092M9k300q46n77K098J691O69j445K087J635L73j287q51J639
14100C98204Q05k051J813L569k216k488J547j147R1K100K708m45J455O12k154
14085D02403q33n39j848N04K483J346M89M97J517J003m44k436J871L289k71k71
14069D08760J41K988K381l67k08j443K523O96J717O7K020p1k902J090M11N92j49
14052D18246J559J359K15J525J157J000l346j63K940J71j947k366r86J765K251
14037D23380l42N50M512L276J525L10j477J608J328J27j17R34N2L05j45M96R6
14020D36418J799j76k208m11R32k287Q24K092J014J341J670R05j657j62J31K319
14004D42544K263J34P34J823J772J819j129j087J53o25M68L439J855k152j287
$$ plain form
14116 390925 392177 395269 395318 393018 392172 391595 393693 395384 396053 394608 396695 398330 398703 397416 396565 398204
14100 398204 399009 396958 398771 402340 400124 397636 399183 398036 398127 400227 402935 402490 403945 404557 402403
14085 402403 401570 401031 399183 399687 402170 403516 404005 404502 406019 407022 406578 404142 406013 409302 409031 408760
14069 408760 408901 411889 414270 413903 413695 412252 414775 415471 417188 417255 419275 419204 416302 417392 417803 418395 418246
14052 418246 419805 421164 421379 422904 424061 425061 421715 421552 424492 424663 422716 420350 419364 421129 423380
14037 423380 423038 423588 428100 431376 432901 433211 431734 433342 434670 434797 434680 435614 435666 435971 435826 436322 436418
14020 436418 438217 438041 435833 435422 436354 434067 434891 436983 437997 439338 441008 441913 440256 440094 440225 442544
14004 442544 444807 444941 445675 447498 449270 451089 449960 448873 449026 448401 448869 452308 454163 452011 450724
13989D50724j452j08J045N35L49M92P46M584p56r64P22K766O86K449N24J394R73
13972D64709J469j218n35j014Qj546k77L513K470J592R96K363J037N28j950mJ24
13955D72265J74J76j485J219K710M60J589n17J323L119M1k19K584P02q09J183
13939D84515R49J153L18j674K326K961J471J571l9k181k739k23J442L493K137
13924D95480J026N24J602K214l70J919K114M65J274K153J158p96k171j58K023
13909E08457L045j470l88p26L444J453K0K845K302J327j787r75J709J284L88K888
13893E23816L096M734R71K837K415N62J116K957K587J049L185R45N44q18L93O19
13877E51008M351N710J516L50R42L677N33L472O561O386J839J414N079M389K571
$$ plain form
13989 450724 449272 449164 450209 450744 451093 451585 452331 456915 456159 455195 455917 458683 459369 461818 462342 463736 464709
13972 464709 466178 464960 464425 463411 463419 461873 461596 465109 467579 469171 470167 472530 473567 474095 472145 472141 472265
13955 472265 472439 472615 471130 472349 475059 475519 477108 476591 477914 481033 481074 480855 483439 484141 483332 484515
13939 484515 485464 486617 486935 485261 487587 490548 492019 493590 493551 491370 488631 488408 489850 493343 495480
13924 495480 496506 497030 498632 500846 500476 502395 504509 504974 506248 508401 509559 508763 506592 506434 508457
13909 508457 511502 510032 509644 508918 512362 513815 513835 516680 518982 520309 518522 517547 519256 520540 520928 523816
13893 523816 526912 531646 532617 535454 537869 538431 539547 542504 545091 546140 549325 550270 550814 549996 550389 551008
13877 551008 555359 561069 562585 562935 563877 567554 568087 571559 578120 584506 586345 587759 592838 597227 599798
13862E99798P99J759M029N863L714L096M469O861O916L743N201P712P744R943
13848F71647J0299Q351J0777J3729J0397J3048J6587J4368J4224J7807K1977K3878
13836H47089K6380L0623L6615M5681N2419M1616p747o6388r9191j25897j70715
13825F10485k04192j99885j47596j13834p6626j0824M1024O3231O4641N3508M1722
13814A21654L5276K8729K4022J9139J7172J5643J1602J1215J3186J4429R050R994
13802C31111R913P931O986L535N907N963K544L522N885P504O124M124M778L816
13788D09643K810J027J904M102K232K864K390J127K025N572K948K835K836J834
13774D46149o80K189M182K952J532q50M86K990K760K246L96J918L489K62j457
$$ plain form
13862 599798 600597 602356 606385 612248 615962 619058 623527 630388 637304 641047 646248 653960 661704 671647
13848 671647 681946 690297 701074 714803 725200 738248 754835 769203 783427 801234 823211 847089
13836 847089 873469 904092 940707 986388 1038807 1080423 1072676 1006288 907097 781200 610485
13825 610485 406293 206408 58812 -55022 -131648 -142472 -101448 -38217 26424 79932 121654
13814 121654 156930 185659 209681 228820 245992 261635 273237 284452 297638 312067 321117 331111
13802 331111 341024 348955 355941 359476 365383 371346 373890 377412 383297 390801 396925 401049 405827 409643
13788 409643 412453 413480 415384 419486 421718 424582 426972 428099 430124 435696 438644 441479 444315 446149
13774 446149 445469 447658 451840 454792 456324 455474 455960 458950 461710 463956 464352 466270 469759 470021 468564
13759D68564K85K531J598J831J45N81L199L951Q34J127J174J581Q8J558J297L154
13743D93498J995P91J177J064K09L414J245M30r74J606N013P28k43J777j27q62
13727E10741j742n29j581O41K351J075J728q76R29Q25J781J972K67M198J978N45
13711E24303J354j162M92J761Q75J903K811J926J72Q71M57J282O68J176j166l732
13695E33991j423K693M263K654J816l60n0J010K523J377q85m49K59K644K426j242
13679E51247j908j955Q75J200J338L308K344o17K759j011j26J652K211L242K930
13664E67489n42j279j586j205R80K989K268J171L367N34j909k033j573J732K423
13649E72826j048J679J555K147J323K530m93N84Q52J567k52K14k2L707J554K1
$$ plain form
13759 468564 468849 471380 472978 474809 474954 475535 478734 482685 483519 484646 485820 487401 487489 489047 490344 493498
13743 493498 495493 496284 497461 498525 498734 502148 503393 503823 502849 504455 509468 510196 509953 511730 511603 510741
13727 510741 508999 508470 506889 507530 509881 510956 512684 511808 512737 513562 515343 517315 517582 521780 523758 524303
13711 524303 525657 524495 524987 526748 527623 529526 532337 534263 534435 535306 535763 537045 537713 538889 537723 533991
13695 533991 532568 535261 539524 542178 543994 543634 543584 544594 547117 548494 547609 547160 547419 550063 552489 551247
13679 551247 549339 547384 548259 549459 550797 554105 556449 555832 558591 557580 557454 559106 561317 564559 567489
13664 567489 566947 565668 564082 562877 563857 566846 569114 570285 573652 574186 572277 570244 568671 570403 572826
13649 572826 571778 573457 575012 577159 578482 581012 580519 581103 581955 583522 583270 583484 583462 587169 588723 588744
13633E88744j005j100j352N86J2J865J430j357J437K362K247J532j997l739j129
13618E88536J228K998r17J118J78k230j032k975R46K131q41L843M302J241k821
13603E95705L055J328M16R88K278J2n08j506N26K712N59j460j839K341J479K541
13587F08627R45J852J141n89L06K217K648J285P9N01J196P52J560K69O49O58m75
13570F23621K223O07q68k18R99m60L825j365p82J62K453L669L25r12N94j450M7
13553F32470Q21K473K570J558J021p03M90k54J691Kj431j752J648L775L897Q55
13537F49131J212j046J989J600n52K35k21J489K495r73j087J870J387k474K24
13522F55279L008L351J850O71J331j143Q46J240k571J473L212K471J787M88j516
$$ plain form
13633 588744 587739 586639 585287 585873 585885 587750 589180 587823 589260 591622 593869 595401 593404 589665 588536
13618 588536 589764 592762 591845 592963 593141 590911 589879 586904 587850 589981 589140 592983 597285 598526 595705
13603 595705 598760 600088 600504 601492 603770 603782 603274 601768 602294 605006 605565 604105 602266 604607 606086 608627
13587 608627 609572 611424 612565 611976 612282 614499 617147 618432 618511 619012 620208 620960 622520 622789 623438 624096 623621
13570 623621 625844 626451 625583 625365 626364 625904 629729 628364 627582 627744 630197 633866 634191 633279 633873 632423 632470
13553 632470 633291 635764 638334 639892 640913 640210 640700 640446 642137 642139 640708 638956 640604 644379 648276 649131
13537 649131 650343 649297 651286 652886 652334 652569 652348 653837 656332 655359 654272 656142 657529 655055 655279
13522 655279 658287 661638 663488 664159 665490 664347 665193 666433 663862 665335 668547 671018 672805 673293 671777
13507F71777K74k37j16m53L521K089J405O69K00o93J033J518K763R21j749j192
13491F81730j166J310L614q88m11j85R59J210O93l1k70J416K670L788J572J566
13475F97577L12L08Q76K331O39o6j482N09N75K633J192p8j56J435K393q48k713
13458G05437M58J244Q15L957p1m44K18K23m53R57o10L235K428J887j064j14R17
13441G19020J101J899K018K916N17J900O97n2K823J909j90j280j094L349M73K35
13425G36241J85J542J762M91J904k125k105J129L299J987j298j838L630L544l13
13410G48035J182L72L71J798K516Q31j704K99J999K758M148J622j992M68Q49J80
13394G63732k89j484J597M702K532P33L258J365P28J412R90J373J260j19j436
$$ plain form
13507 671777 672051 671814 671698 671245 674766 676855 678260 678929 679129 678436 679469 680987 683750 684671 682922 681730
13491 681730 680564 681874 685488 684600 684189 684004 684963 686173 686866 686835 686565 687981 690651 694439 696011 697577
13475 697577 697889 698197 699073 701404 702043 701977 700495 701004 701579 704212 705404 705326 705170 706605 708998 708150 705437
13458 705437 705895 707139 707954 711911 711840 711396 711614 711837 711384 712341 711731 714966 717394 719281 718217 718103 719020
13441 719020 720121 722020 724038 726954 727471 729371 730068 730016 732839 734748 734558 733278 732184 735533 736006 736241
13425 736241 736426 737968 739730 740221 742125 740000 737895 739024 742323 744310 743012 741174 744804 748348 748035
13410 748035 749217 749589 749960 751758 754274 755105 753401 753700 755699 758457 762605 764227 762235 762703 763552 763732
13394 763732 763443 761959 763556 768258 770790 771523 774781 776146 776874 778286 779276 780649 781909 781790 780354
13379G80354P9L95K292K137l68Oj82J107q85k136j83R03J768K686P11L2M133J909
13361G94758j77J157R93J500k478r17K471J169J944J779J045J353J118j83K333
13346H07865M22J334L210R98j780K280J528K781P03M07j080J507R5J36J686K570
13330H24662j994J54K282p11l57J226R5K589L889K981k13q64K386K597J263k231
13314H37754O22M46N02K658o60K558L669J677J635o21J593j609J492J331P67J317
13298H55131R48Q17K017K293L01P11l13K380K023P33K806J516k000j54O72k5k49
13281H69607L978M193l02o31M018M96J13L299J517J438j937j21K279k74J32n12
13265H87293J017Q35M88n75O17J911K744P99L971L692Q40M56O69J958K998P38
$$ plain form
13379 780354 780433 780828 783120 785257 784889 784895 784713 785820 784935 782799 782616 783519 785287 787973 788684 788716 792849 794758
13361 794758 794581 795738 796731 798231 795753 794836 797307 798476 800420 802199 803244 804597 805715 805532 807865
13346 807865 808287 809621 812831 813829 812049 814329 815857 818638 819341 819748 818668 820175 820270 820406 822092 824662
13330 824662 822668 822822 825104 824393 824036 825262 825357 827946 831835 834816 834603 833739 836125 838722 839985 837754
13314 837754 838376 838822 839324 841982 841322 843880 847549 849226 850861 850240 851833 850224 851716 853047 853814 855131
13298 855131 856079 856896 858913 861206 861507 862218 861905 864285 866308 867041 869847 871363 869363 869209 869881 869856 869607
13281 869607 873585 877778 877476 876845 880863 881359 881472 884771 886288 887726 885789 885668 887947 887673 887805 887293
13265 887293 888310 889145 889633 889058 889675 891586 894330 895129 899100 902792 903632 904088 904757 906715 909713 910451
13249I10451L26k45Q27K326K364L580o96J136L6P0K862N14n0K445L93n55R69P86
13231I27539J862L708R21j895j81M125L463J453J723L629K949J047J030J478K62
13216I53113Q31J13P92K661J796l51l7j495M10K798R58K995O16N65R21N87j30
13199I67143l1Q60L472L986J941L722J451p75k058M19J377J028J848K416K197
13184I88996L051K878K782r74K578J428K449j250Q81L936K253J301j610o78p44
13169A007277K404J77P12J328K922M072J547K191L456J153R79K44J128K344L069
13154A035003K912j140J121K642K465K537k69R43J419J951K432J601J259L009
13140A057885J636j142j575K77J825M046L701J498J808M15j163j283K751L466
$$ plain form
13249 910451 910777 910532 911359 913685 916049 919629 918933 920069 920105 920175 923037 923551 923501 925946 926339 925784 926753 927539
13231 927539 929401 933109 934030 932135 931954 936079 939542 940995 942718 946347 949296 950343 951373 952851 953113
13216 953113 953944 954057 954849 957510 959306 958955 958918 957423 957833 960631 961589 964584 965200 965765 966686 967273 967143
13199 967143 967112 967972 971444 975430 977371 981093 982544 981769 979711 980130 981507 982535 984383 986799 988996
13184 988996 992047 994925 997707 996733 999311 1000739 1003188 1001938 1002819 1006755 1009008 1010309 1008699 1008021 1007277
13169 1007277 1009681 1009858 1010570 1011898 1014820 1018892 1020439 1022630 1026086 1027239 1028218 1028462 1029590 1031934 1035003
13154 1035003 1037915 1036775 1037896 1040538 1043003 1045540 1045271 1046214 1047633 1049584 1052016 1053617 1054876 1057885
13140 1057885 1059521 1058379 1056804 1057081 1058906 1062952 1066653 1068151 1069959 1070374 1069211 1067928 1070679 1074145
13126A074145JP44k88L213R07K149J665J426L369N42k23Q58N031M381k98O82K109
13109A100413J592R42K362L558M262K174K188j67J059K061L425R19J93R53J439
13094A127373J529n96K414K069J894K371J309j944M35K514K178O13N54M142N351
13079A152206M223J208K442J579K593K539k98Q41Q25K064J476j478O6K661L967
13064A176914L421K570K551J094L987L572j78p5j071K787L739M816K398J141k450
13049A205216P78M346L396L689K905J844L506J692L721J424K526L133Q87j35L625
13034A242553J993J923J065J945K277J279J611L159l99J153K971J739L644L295
13020A270208L574K666K831k63K933K926L354L462j248L043N547L207K045L598
$$ plain form
13126 1074145 1074146 1074890 1074602 1077815 1078722 1080871 1082536 1083962 1087331 1087873 1087650 1088508 1093539 1097920 1097622 1098304 1100413
13109 1100413 1102005 1102947 1105309 1108867 1113129 1115303 1117491 1117324 1118383 1120444 1123869 1124788 1124981 1125934 1127373
13094 1127373 1128902 1128306 1130720 1132789 1134683 1137054 1138363 1136419 1136854 1139368 1141546 1142159 1142713 1146855 1152206
13079 1152206 1156429 1157637 1160079 1161658 1164251 1166790 1166492 1167333 1168158 1170222 1171698 1170220 1170286 1172947 1176914
13064 1176914 1180335 1182905 1185456 1186550 1190537 1194109 1193931 1193856 1192785 1195572 1199311 1204127 1206525 1207666 1205216
13049 1205216 1205994 1210340 1213736 1217425 1220330 1222174 1225680 1227372 1231093 1232517 1235043 1238176 1239063 1238928 1242553
13034 1242553 1244546 1246469 1247534 1249479 1251756 1253035 1254646 1257805 1257406 1258559 1261530 1263269 1266913 1270208
13020 1270208 1273782 1276448 1279279 1279016 1281949 1284875 1288229 1291691 1290443 1293486 1299033 1302240 1304285 1307883
13006A307883L234N40l16J581L496K693L683R9J17K275J046K117L849M158K662
12991A339117K534K070K787J606J692N28L120L023L106M677L885P02J877J366
12977A372090N632L617J358q22J17L049N529L354m13M495N136L516J948L501J033
12962A413140J826J113M054L302L726K764N021M494L723N606L678J560K911Q24
12948A457742L685M532L079M744N672J943M013L207J068M381L570O023N202K053
12934A510914M922K155M538L666N274K268L825N323K721J744N613O554N336P217
12920A572070R100Q902P544L672J310M268J395l831k516l260k567j673m908J97
12906A589703O867N351J600N068O448Q513Q323J1087J0378J0000J1360R490P346
$$ plain form
13006 1307883 1311117 1311657 1311341 1312922 1316418 1319111 1322794 1322893 1323010 1325285 1326331 1328448 1332297 1336455 1339117
12991 1339117 1341651 1343721 1346508 1348114 1349806 1350334 1353454 1356477 1359583 1364260 1368145 1368847 1370724 1372090
12977 1372090 1377722 1381339 1382697 1381875 1381992 1385041 1390570 1393924 1393511 1398006 1403142 1406658 1408606 1412107 1413140
12962 1413140 1414966 1416079 1420133 1423435 1427161 1429925 1434946 1439440 1443163 1448769 1452447 1454007 1456918 1457742
12948 1457742 1461427 1465959 1469038 1473782 1479454 1481397 1485410 1488617 1489685 1494066 1497636 1503659 1508861 1510914
12934 1510914 1515836 1517991 1522529 1526195 1531469 1533737 1537562 1542885 1545606 1547350 1552963 1559517 1564853 1572070
12920 1572070 1581170 1590072 1597616 1601288 1602598 1606866 1608261 1604430 1601914 1598654 1596087 1594414 1589506 1589703
12906 1589703 1596570 1601921 1603521 1608589 1615037 1623550 1631873 1642960 1653338 1663338 1674698 1684188 1691534
12893A691534Q784R981O683J1743J4882J4335J3130J2980J1692J2729J2018J0914
12881A831405J1969J4160J6256K0889K6233L1439L9429M2221M0367L0083l655
12870B100796n2224r3857j29290j58040j64169j44781j07992o0471o836L1374
12860A214510M9707N3129M6275L9976L1126K4535K1795K0332J9003J1935J1161
12849A543484J3597J2866J0013J2237J3304J0795J1461J2019Q228J0612R848O303
12837A674767O469P578O761Q344Q456N900O164N830O120P855M779O660N801N801
12823A767285L218M153O512P338M265N336R234R271Q437P941P477N854O756O798
12809A859875O530N892O174M853N122L192L766L773M991M420K244K913P751Q444
$$ plain form
12893 1691534 1700318 1710299 1716982 1728725 1743607 1757942 1771072 1784052 1795744 1808473 1820491 1831405
12881 1831405 1843374 1857534 1873790 1894679 1920912 1952351 1991780 2034001 2074368 2104451 2100796
12870 2100796 2048572 1954715 1825425 1667385 1503216 1358435 1250443 1189972 1183136 1214510
12860 1214510 1264217 1317346 1363621 1403597 1434723 1459258 1481053 1501385 1520388 1532323 1543484
12849 1543484 1557081 1569947 1579960 1592197 1605501 1616296 1627757 1639776 1648004 1658616 1668464 1674767
12837 1674767 1681236 1688814 1695575 1703919 1712375 1718275 1724439 1730269 1736389 1744244 1749023 1755683 1761484 1767285
12823 1767285 1770503 1774656 1781168 1788506 1792771 1798107 1807341 1816612 1825049 1832990 1840467 1846321 1853077 1859875
12809 1859875 1866405 1872297 1878471 1883324 1888446 1891638 1895404 1899177 1904168 1908588 1910832 1913745 1921496 1929940
12795A929940P012M851L259M953P675Q917R637Q312R291N495O204N789M255O166
12781B021756O185M648M755O447N792N835L252L235M467N843O497N428P380M690
12767B096210N679N645P034Q018N230M835R617O556M301K411N286R123R120R417
12753B188482J1744J4208J6910J0658J0439Q409N014J368K754M964O975M807M580
12740B291312N881M592Q768O074O570Q534Q413J0154R666J0655J0234R179R863
12727B399895R104J1447J0520J1368J1914J1188R407J0057Q784M139N834N048
12715B508705O602J1181J2324J0225J1049J1837Q461O952P801P575P834R160R845
12702B629551O748N879Q280P912O581L613N330R142J0309J0288J1293J2038J3798
$$ plain form
12795 1929940 1936952 1941803 1945062 1950015 1957690 1966607 1976244 1984556 1993847 1999342 2005546 2011335 2015590 2021756
12781 2021756 2027941 2032589 2037344 2043791 2049583 2055418 2058670 2061905 2066372 2072215 2078712 2084140 2091520 2096210
12767 2096210 2101889 2107534 2114568 2122586 2127816 2132651 2142268 2148824 2153125 2155536 2160822 2169945 2179065 2188482
12753 2188482 2200226 2214434 2231344 2242002 2252441 2260850 2265864 2267232 2269986 2274950 2281925 2286732 2291312
12740 2291312 2297193 2301785 2310553 2316627 2323197 2331731 2340144 2350298 2359964 2370619 2380853 2390032 2399895
12727 2399895 2408999 2420446 2430966 2442334 2454248 2465436 2474843 2484900 2493684 2497823 2503657 2508705
12715 2508705 2515307 2526488 2538812 2549037 2560086 2571923 2580384 2587336 2595137 2602712 2610546 2619706 2629551
12702 2629551 2636299 2642178 2650458 2658370 2664951 2668564 2673894 2683036 2693345 2703633 2714926 2726964 2740762
12689B740762J5416J2868J1858R190J4179J6456J4024J2560J3694J3311J3526
12678B887844J1896J1970J1181J1307J2587J4104J2034J2289J7696J9456K2643
12667C045007K7713K9935L2649K7338J2671o423k1197k5311k6530k8865j9823
12656C047164j2933J155J4925K0972K4600K3730K0633K0783J9552J9678K2970
12645C223229K3076J9966K0084K2153K1900K1165K2813K1309K1129J9822J9339
12634C455985J9576K0907J9932J6155J5127J7444J7315J7081J7987J9587K2917
12623C660013K2950J9129K0084K1079K2191J9670K1109J8869K0447K0913J7887
12612C884341J8714J9829K0106K1389J7071J1824M606J080M60N263R593J6140
$$ plain form
12689 2740762 2756178 2769046 2780904 2790094 2804273 2820729 2834753 2847313 2861007 2874318 2887844
12678 2887844 2899740 2911710 2922891 2934198 2946785 2960889 2972923 2985212 3002908 3022364 3045007
12667 3045007 3072720 3102655 3135304 3162642 3175313 3168890 3147693 3122382 3095852 3066987 3047164
12656 3047164 3034231 3035386 3050311 3071283 3095883 3119613 3140246 3161029 3180581 3200259 3223229
12645 3223229 3246305 3266271 3286355 3308508 3330408 3351573 3374386 3395695 3416824 3436646 3455985
12634 3455985 3475561 3496468 3516400 3532555 3547682 3565126 3582441 3599522 3617509 3637096 3660013
12623 3660013 3682963 3702092 3722176 3743255 3765446 3785116 3806225 3825094 3845541 3866454 3884341
12612 3884341 3903055 3922884 3942990 3964379 3981450 3993274 3997880 3998960 3999420 4004683 4014276 4030416
12600D030416K4112K9192L7312M5193M6483M4195L8887L6796L5289M0853M3049
12589D451777M2170M4734M2601M0263L5365L1622K2701J2071K332j0669j4048
12578D700919j2258p386O511K0180M0639N2463O2905O8764O8054O1837N1628M2447
12566E156703L4956K9021L1975L6212M4454N4985O5967P3505P8028Q0316P9525
12555E765647P4904O7643O4895N9662N9934N8059N6377N7039O0467O3400O1443
12544F449470O1371O1761O4166O9369P1458O9109P0095P2603P6770P9917Q4093
12533G230182Q3895Q4718Q6556R0380R3320R3007R4118R8871J00695J03288J04746
12522H263776J09428J15901J18123J19944J22137J26175J30775J37570J39920
$$ plain form
12600 4030416 4054528 4083720 4121032 4166225 4212708 4256903 4295790 4332586 4367875 4408728 4451777
12589 4451777 4493947 4538681 4581282 4621545 4656910 4688532 4711233 4723304 4725636 4714967 4700919
12578 4700919 4688661 4681275 4687786 4707966 4748605 4801068 4863973 4932737 5000791 5062628 5114256 5156703
12566 5156703 5191659 5220680 5252655 5288867 5333321 5388306 5454273 5527778 5605806 5686122 5765647
12555 5765647 5840551 5908194 5973089 6032751 6092685 6150744 6207121 6264160 6324627 6388027 6449470
12544 6449470 6510841 6572602 6636768 6706137 6777595 6846704 6916799 6989402 7066172 7146089 7230182
12533 7230182 7314077 7398795 7485351 7575731 7669051 7762058 7856176 7955047 8055742 8159030 8263776
12522 8263776 8373204 8489105 8607228 8727172 8849309 8975484 9106259 9243829 9383749
12513I383749J41772J43710J46222J50370J53427J56684J61671J70545J79265
12504A0787415J84512J89039J96872J99554K03532K13118K22172K34610K47211
12495A2678035K60689K71983K87994L08085L24622L42082L63858L86475M10097
12486A5633920M37551M61784M87263N18092N44927N71599N99444O29859O62733
12477B0547172O94578P40173P92661Q57212R31692J013396J103115J197472J295061
12468B9172532J401353J504185J568200J565638J521132J519207J606920J801087
12460D1660254K118395K571928L163888L926317M865533N902477O731705O466947
12452G7407444L503109k859661j0347761j6298407k1104043k5383072k7461166
$$ plain form
12513 9383749 9525521 9669231 9815453 9965823 10119250 10275934 10437605 10608150 10787415
12504 10787415 10971927 11160966 11357838 11557392 11760924 11974042 12196214 12430824 12678035
12495 12678035 12938724 13210707 13498701 13806786 14131408 14473490 14837348 15223823 15633920
12486 15633920 16071471 16533255 17020518 17538610 18083537 18655136 19254580 19884439 20547172
12477 20547172 21241750 21981923 22774584 23631796 24563488 25576884 26679999 27877471 29172532
12468 29172532 30573885 32078070 33646270 35211908 36733040 38252247 39859167 41660254
12460 41660254 43778649 46350577 49514465 53440782 58306315 64208792 70940497 77407444
12452 77407444 80910553 78050892 67703131 51404724 30300681 4917609 -22543557
12445b2543557k5216217j9834992j3963953o880561J004232O542716Q492855Q110820
12437f4288657O896383N610685M509263L624542K917250K364598J964377J721636
12429c4679923J577042J484425J433472J407944J369203J295662J200465J102899
12421b3808811J013639R32762Q58616P90620P33015O77677O25403N74541N32827
12412a7069711M89917M57465M27034M01348L81426L63757L45753L30776L20111
12403a3552124L10396K95813K85627K80559K69386K62160K55415K50946K42846
12394a1098976K33220K26158K15485K08149J96055J84011J78093J70221J61475
12385i326109J57337J52666J47023J43748J36731J34038J31187J24028J22918
$$ plain form
12445 -22543557 -47759774 -67594766 -81558719 -88439280 -87435048 -80892332 -72399477 -64288657
12437 -64288657 -57392274 -51781589 -47272326 -43647784 -40730534 -38365936 -36401559 -34679923
12429 -34679923 -33102881 -31618456 -30184984 -28777040 -27407837 -26112175 -24911710 -23808811
12421 -23808811 -22795172 -21862410 -21003794 -20213174 -19480159 -18802482 -18177079 -17602538 -17069711
12412 -17069711 -16579794 -16122329 -15695295 -15293947 -14912521 -14548764 -14203011 -13872235 -13552124
12403 -13552124 -13241728 -12945915 -12660288 -12379729 -12110343 -11848183 -11592768 -11341822 -11098976
12394 -11098976 -10865756 -10639598 -10424113 -10215964 -10019909 -9835898 -9657805 -9487584 -9326109
12385 -9326109 -9168772 -9016106 -8869083 -8725335 -8588604 -8454566 -8323379 -8199351 -8076433
12376h076433J19595J14025J08290J07046J07359J02077R8927R3990R3614Q9441
12366g042069Q3284Q2553Q6053Q4014Q1398P8662P3470P3974P7483P6460P5204
12355f169514P2435P1937O8926O9177P1229O6689O2943O5037O4014O4195O2639
12344e430293N8133N9703N4240N1074M9733M5752L7573K9195K4311K1510J9449
12333d979620K1767K6819L6176M3165M9682N2175N1561N0480L9699K9432J8439
12322d560225J2907Q328J1108J7627K7522M3073N3812O3775P4218P7525P1410
12311d098920O6464N7116M3011L4213L1521K4463K0499J8726J5072J5391J8044
12300c754400J9546J8535J3446J0208J3421J8559K1123K2329L1274M0505M6591
$$ plain form
12376 -8076433 -7956838 -7842813 -7734523 -7627477 -7520118 -7418041 -7319114 -7225124 -7131510 -7042069
12366 -7042069 -6958785 -6876232 -6790179 -6706165 -6624767 -6546105 -6472635 -6398661 -6321178 -6244718 -6169514
12355 -6169514 -6097079 -6025142 -5956216 -5887039 -5815810 -5749121 -5686178 -5621141 -5557127 -5492932 -5430293
12344 -5430293 -5372160 -5312457 -5258217 -5207143 -5157410 -5111658 -5074085 -5044890 -5020579 -4999069 -4979620
12333 -4979620 -4957853 -4931034 -4894858 -4851693 -4802011 -4749836 -4698275 -4647795 -4608096 -4578664 -4560225
12322 -4560225 -4547318 -4538990 -4527882 -4510255 -4482733 -4439660 -4385848 -4322073 -4247855 -4170330 -4098920
12311 -4098920 -4032456 -3975340 -3932329 -3898116 -3866595 -3842132 -3821633 -3802907 -3787835 -3772444 -3754400
12300 -3754400 -3734854 -3716319 -3702873 -3692665 -3679244 -3660685 -3639562 -3617233 -3585959 -3545454 -3498863
12289c498863M8948M9004M8307M5213L4781K6693K7425K5869K3389K4350K4508
12278c120376K3041J8804K1080K1555K0538K0546K0013K0194K0605K0587J9942
12267b893471J8926J8586J7852J8344J8935J6978K1928K2446J8151J4539J3106
12256b693680J3982J4563J5105J4679J2647J5331J5305J3231J3428J4164J4735
12245b536510J6501J7711J9479J8397J8129J7787J7261J7140J4913J5483J5122
12234b348587J2131J0950R822J0178J0128Q314Q868R819P712J1291Q241J1142
12222b229991J2489J3533J0027J0446J6257J3946J2625J3286J3479J3178J2662
12211b088063J3086J0478J2775J0284R375R567R411M587N740Q408Q202P409P149
$$ plain form
12289 -3498863 -3449915 -3400911 -3352604 -3307391 -3272610 -3245917 -3218492 -3192623 -3169234 -3144884 -3120376
12278 -3120376 -3097335 -3078531 -3057451 -3035896 -3015358 -2994812 -2974799 -2954605 -2934000 -2913413 -2893471
12267 -2893471 -2874545 -2855959 -2838107 -2819763 -2800828 -2783850 -2761922 -2739476 -2721325 -2706786 -2693680
12256 -2693680 -2679698 -2665135 -2650030 -2635351 -2622704 -2607373 -2592068 -2578837 -2565409 -2551245 -2536510
12245 -2536510 -2520009 -2502298 -2482819 -2464422 -2446293 -2428506 -2411245 -2394105 -2379192 -2363709 -2348587
12234 -2348587 -2336456 -2325506 -2315684 -2305506 -2295378 -2287064 -2278196 -2268377 -2260665 -2249374 -2241133 -2229991
12222 -2229991 -2217502 -2203969 -2193942 -2183496 -2167239 -2153293 -2140668 -2127382 -2113903 -2100725 -2088063
12211 -2088063 -2074977 -2064499 -2051724 -2041440 -2032065 -2022498 -2013087 -2008500 -2002760 -1994352 -1986150 -1978741 -1971592
12198a971592R100J0331J3062J2194R666P447R237J2200J2346J2776Q222R432
12186a845579R091N806P384P953R978J1247J1888J3044J3547J3458R720O040O840
12173a719583R122J1227O605M307M781O077M703O218P673L077Q912Q990O725Q821
12159a622345Q819N915Q175R954P050Q604J2180J1040J0461Q570J1354J4074J1637
12146a494512R972J1020Q881L210p79K370L181K77N00M094J321K960P786Q696
12132a431023Q752P950R616J0651Q191L079K898L910J878N310R675J0195J1152
12119a337766P128O069Q832Q537R543P145P594N805O497N294O510O852L431M495
12105a244034M388N364M594O665P886O463M291M709O291N098N039P989O343R111
$$ plain form
12198 -1971592 -1962492 -1952161 -1939099 -1926905 -1917239 -1909792 -1900555 -1888355 -1876009 -1863233 -1855011 -1845579
12186 -1845579 -1836488 -1830682 -1823298 -1815345 -1805367 -1794120 -1782232 -1769188 -1755641 -1742183 -1732463 -1726423 -1719583
12173 -1719583 -1710461 -1699234 -1692629 -1688322 -1683541 -1677464 -1672761 -1666543 -1658870 -1655793 -1646881 -1637891 -1631166 -1622345
12159 -1622345 -1613526 -1607611 -1599436 -1589482 -1582432 -1573828 -1561648 -1550608 -1540147 -1531577 -1520223 -1506149 -1494512
12146 -1494512 -1484540 -1473520 -1464639 -1461429 -1462208 -1459838 -1456657 -1456380 -1455880 -1451786 -1450465 -1447505 -1439719 -1431023
12132 -1431023 -1422271 -1414321 -1404705 -1394054 -1385863 -1382784 -1379886 -1375976 -1374098 -1368788 -1359113 -1348918 -1337766
12119 -1337766 -1330638 -1324569 -1315737 -1307200 -1297657 -1290512 -1282918 -1277113 -1270616 -1265322 -1258812 -1251960 -1248529 -1244034
12105 -1244034 -1239646 -1234282 -1229688 -1223023 -1215137 -1208674 -1204383 -1199674 -1193383 -1188285 -1183246 -1175257 -1168914 -1159803
12091a159803Q302Q098R256P361M557O602O625M480M846J223N194N363K803M119
12077a080974L652N055P661M936O359Q348Q608O981L776N449J0020Q073O995P825
12063i87236P350Q572P916Q315P630O881O565P585P192O865P220P717P452O076
12049h83900Q908O417L995O814Q187J1192Q952J1534J4617J3190J4258J4679J2826
12036g48331J4490J5998J5706J5904K0095K3892K6750L4733M0385L8898K8060
12025d73420M162k9430o4024r2872j21990j44662j42256j17845q1299m8940j3191
12014a325767K3864M2948M7950M5675L8225L1584K3635K0980K1008J5498J5374
12003i99026J1446Q887Q560Q917J0951J0703R213R186Q550R179O917O790P435
$$ plain form
12091 -1159803 -1151501 -1143403 -1134147 -1126786 -1122229 -1115627 -1109002 -1104522 -1099676 -1098453 -1093259 -1087896 -1085093 -1080974
12077 -1080974 -1077322 -1072267 -1064606 -1059670 -1053311 -1044963 -1036355 -1029374 -1025598 -1020149 -1010129 -1002056 -995061 -987236
12063 -987236 -979886 -971314 -963398 -955083 -947453 -940572 -934007 -926422 -919230 -912365 -905145 -897428 -889976 -883900
12049 -883900 -874992 -868575 -864580 -857766 -849579 -838387 -829435 -817901 -803284 -790094 -775836 -761157 -748331
12036 -748331 -733841 -717843 -702137 -686233 -666138 -642246 -615496 -580763 -540378 -501480 -473420
12025 -473420 -469258 -498688 -562712 -655584 -777574 -922236 -1064492 -1182337 -1263636 -1312576 -1325767
12014 -1325767 -1301903 -1258955 -1211005 -1165330 -1127105 -1095521 -1071886 -1050906 -1029898 -1014400 -999026
12003 -999026 -987580 -978693 -970133 -961216 -950265 -939562 -930349 -921163 -912613 -903434 -896517 -889727 -882292
11990h82292Q450Q131Q325J1049J0717J0845J3703J4058J2697J2174J1025J0151
11978g50967J1849R458O220K091M409K444k360r10L855O213P699Q437M465M945
11964f82152O706O529M949M016M832P429Q484O371M062N019R213P705O414O754
11950e93669O538O508P271Q995R363Q424Q099O315O712Q385J0565J3535J0654
11937d82305R082J0350J2317J3551J2429J3524J6350J4816J7146K0001K1310K7055
11925b94374L1124L5722L9805M0318K9577R067k2702o2425r9565j32463j54570
11914e80486j61102j46029j11716p2915k8657Q179L2328M7358M8499M6092M0839
11903h77610L0857K7068K3050J8121J7286J4112J2072J5648J3261J0129J1380
$$ plain form
11990 -882292 -873842 -865711 -857386 -846337 -835620 -824775 -811072 -797014 -784317 -772143 -761118 -750967
11978 -750967 -739118 -729660 -723440 -721349 -716940 -714496 -716856 -717766 -713911 -707698 -699999 -691562 -687097 -682152
11964 -682152 -675446 -668917 -663968 -659952 -655120 -647691 -639207 -632836 -628774 -623755 -614542 -606837 -600423 -593669
11950 -593669 -587131 -580623 -573352 -564357 -554994 -546570 -538471 -532156 -525444 -517059 -506494 -492959 -482305
11937 -482305 -473223 -462873 -450556 -437005 -424576 -411052 -394702 -379886 -362740 -342739 -321429 -294374
11925 -294374 -263250 -227528 -187723 -147405 -117828 -108761 -131463 -193888 -293453 -425916 -580486
11914 -580486 -741588 -887617 -999333 -1072248 -1100905 -1092726 -1060398 -1013040 -964541 -918449 -877610
11903 -877610 -846753 -819685 -796635 -778514 -761228 -747116 -735044 -719396 -706135 -696006 -684626
11892f84626J2636J1505R537J0238J0234J1917Q896P139N455P925Q021P901Q432
11879e64790P736L444O823O435O758P467N482M124O008N777N889N930P004Q453
11865d77460Q324M550N569O663O833M730O458O839Q865P607P060O089P655Q014
11851c82204Q661Q702P836J0019O510P950J2062M958P934J2581J1360J3325J4050
11838b56256J6299J7282J8271J3260Q430J4297J7379J9618J8760K2833L0031L6541
11826b3255M2484M8459N6042O4797P7769J03465J32496J59052J27002k26840r18831
11815c57360j000038m00939N1051J83117J77765J41858J07370Q3645O9402N6218
11805h87911M5670L7746L3176K9175K1953J8009J9580J8780J5910J3305J2190
$$ plain form
11892 -684626 -671990 -660485 -650948 -640710 -630476 -618559 -609663 -602524 -597069 -589144 -581123 -573222 -564790
11879 -564790 -557054 -553610 -546787 -540352 -533594 -526127 -520645 -516521 -510513 -504736 -498847 -492917 -485913 -477460
11865 -477460 -469136 -464586 -459017 -452354 -445521 -440791 -434333 -427494 -418629 -411022 -403962 -397873 -390218 -382204
11851 -382204 -373543 -364841 -357005 -346986 -340476 -332526 -320464 -315506 -307572 -294991 -283631 -270306 -256256
11838 -256256 -239957 -222675 -204404 -191144 -182714 -168417 -151038 -131420 -112660 -89827 -59796 -23255
11826 -23255 19229 67688 123730 188527 266296 369761 502257 661309 788311 561471 -357360
11815 -357360 -1357398 -1758337 -1707286 -1524169 -1346404 -1204546 -1097176 -1013531 -944129 -887911
11805 -887911 -842241 -804495 -771319 -742144 -720191 -702182 -682602 -663822 -647912 -634607 -622417
11794f22417J3423J3677J1195R327P834P700R158R678J1921P783O649O424P005
11781e00643P496Q554N866K104O779O329K796J891M774O145M814N350L996L594
11767d30155K801L239M385M502L766N046M806N186M610L398L890K093L667L012
11753c75754L590L291K101L128L084L914L477M831L763K759K504J279J964M023
11739c32046O111M472J496M245K292R01J004K095O33K780K307K950J619J45J541
11724b97455M744L322K399L447K36L816L262M043K308K906K818J173K767L565
11710b56649K184q25M30L162L397J479J64Q91J870L777J050o4K173L605K455K848
11694b28053L174K809M461K594M007K691j190K652L307K912J789J736p7L749n72
$$ plain form
11794 -622417 -608994 -595317 -584122 -574795 -566961 -559261 -550103 -540425 -528504 -520721 -514072 -507648 -500643
11781 -500643 -493147 -484593 -478727 -476623 -469844 -463515 -460719 -458828 -454054 -447909 -443095 -437745 -433749 -430155
11767 -430155 -427354 -424115 -419730 -415228 -411462 -406416 -401610 -396424 -391814 -388416 -384526 -382433 -378766 -375754
11753 -375754 -372164 -368873 -366772 -363644 -360560 -356646 -353169 -348338 -344575 -341816 -339312 -338033 -336069 -332046
11739 -332046 -325935 -321463 -319967 -315722 -313430 -312529 -311525 -309430 -308797 -306017 -303710 -300760 -299141 -298996 -297455
11724 -297455 -292711 -289389 -286990 -283543 -283307 -279491 -276229 -272186 -269878 -266972 -264154 -262981 -260214 -256649
11710 -256649 -254465 -255290 -254860 -251698 -248301 -246822 -246658 -245767 -243897 -240120 -239070 -239134 -236961 -233356 -230901 -228053
11694 -228053 -224879 -222070 -217609 -215015 -211008 -208317 -209507 -206855 -203548 -200636 -198847 -197111 -197188 -193439 -194011
11679a94011J488K160K721J397K161L001K233K386J153K196K159J362R03K852
11665a65839L859m07R45K241K801L655O28K960K972L810L445K73P69j102j28K726
11649a36392L054K414K743L034J607o32J552L261K811K540R14K334M875L859L154
11634i8872K699j564j474K753K791K989J584K331R01R86K18q58K424K696L174
11619g7222k38J370L278J046K121K421KJ890K045L370L140l0O52K931J025K511
11603d9688M390J344n79J023L244K158J771K53K001K057K971L476K050R96K329
11588b0204N24j18K369N14K325L424J190j522L70J395J420J911L629J917p62Q25
11572g93L583K554M073M2L070L023J419J533O07J686J095L802K255j29L00K287
$$ plain form
11679 -194011 -192523 -190363 -187642 -186245 -184084 -181083 -178850 -176464 -175311 -173115 -170956 -169594 -168691 -165839
11665 -165839 -161980 -162387 -161442 -159201 -156400 -152745 -152117 -149157 -146185 -142375 -138930 -138657 -137888 -138990 -139118 -136392
11649 -136392 -133338 -130924 -128181 -125147 -123540 -124172 -122620 -119359 -116548 -114008 -113094 -110760 -105885 -102026 -98872
11634 -98872 -96173 -97737 -99211 -96458 -93667 -90678 -89094 -86763 -85862 -84876 -84658 -85516 -83092 -80396 -77222
11619 -77222 -77460 -76090 -72812 -71766 -69645 -67224 -67222 -65332 -63287 -59917 -56777 -56807 -56155 -53224 -52199 -49688
11603 -49688 -45298 -43954 -44533 -43510 -40266 -38108 -36337 -36084 -34083 -32026 -29055 -25579 -23529 -22533 -20204
11588 -20204 -19680 -19798 -17429 -16915 -14590 -11166 -9976 -11498 -11128 -9733 -8313 -6402 -2773 -856 -1618 -793
11572 -793 2790 5344 9417 9459 12529 15552 16971 18504 19111 20797 21892 25694 27949 27820 28120 30407
11556C0407M350J122j30K014K874L084N000J820n38R44J982J287R45L706L032
11541F1899L174J274o82j85n60J977K643J907R42P36J327J053L876J799J345l6
11525H2489j044K734N214J797L50J962O57O19J915K609J122L011J449K679K471
11510A10034K182L55J379O78O48l43K981L364J596L766K055R45K685M640Q86J606
11494A39457K74j411j169R2L99P23J508L503K126L788K128j92o78R05Q44K961
11478A55258K026J587Q15L422N89L77k94L230L017K755L553R88O23L035J907J156
11462A84044K029K892J687M37K070O1J352J158K628J633K007K646M973K303N20
11447B12440n25K99N050K925j129J648K791k53J91J492J624K477P46K82J493K541
$$ plain form
11556 30407 34757 35879 35749 37763 40637 43721 48721 50541 50003 50947 52929 54216 55161 58867 61899
11541 61899 65073 66347 65665 65480 64920 66897 69540 71447 72389 73125 74452 75505 79381 81180 82525 82489
11525 82489 81445 84179 89393 91190 91540 93502 94159 94778 96693 99302 100424 103435 104884 107563 110034
11510 110034 112216 112571 113950 114628 115276 114933 117914 121278 122874 126640 128695 129640 132325 136965 137851 139457
11494 139457 139731 138320 137151 137243 137642 138365 139873 143376 145502 149290 151418 151226 150548 151453 152297 155258
11478 155258 157284 158871 159686 163108 163697 164074 163780 167010 170027 172782 176335 177323 177946 180981 182888 184044
11462 184044 186073 188965 190652 191089 193159 193220 194572 195730 198358 199991 201998 204644 209617 211920 212440
11447 212440 211915 212214 217264 220189 219060 220708 223499 223246 223437 224929 226553 229030 229776 230058 231551 234092
11431B34092O016J309J10K044L244K332J724K860r57k021M11K949L288M17J357
11416B59175O11J086J868K460L060j12J029L672N507k31m88J249K586L925q1K234
11400B87550J433Q38J93J237L210M394M499K599J252j057L3J092J58K842L71J245
11384C11889M279N752L90o84j184J603J004L650L885j03J803J958j083K765M852
11369C40776J642J686M371L275K28J135J876l28j250k999k805J197O657N137K551
11354C63149N333K70j260K432m66J260J422Q19J431J480L449M40N75L643L160
11339C87137o96R77J132J398L853L255K566O70K35K550L378O28L267O218J543
11324D18111r55O85K349M114K681L564o5n86J074L992J514J444J841J012L770
$$ plain form
11431 234092 240108 241417 241527 243571 246815 249147 250871 253731 252774 250753 251164 254113 257401 257818 259175
11416 259175 259786 260872 262740 265200 268260 268148 269177 272849 278356 278125 277637 278886 281472 285397 285316 287550
11400 287550 288983 289821 290014 291251 294461 298855 303354 305953 307205 306148 306181 307273 307431 310273 310644 311889
11384 311889 316168 321920 322310 321626 320442 322045 323049 326699 330584 330481 332284 334242 333159 335924 340776
11369 340776 342418 344104 348475 351750 351978 353113 354989 354661 353411 350412 347607 348804 355461 360598 363149
11354 363149 368482 368752 367492 369924 369458 370718 372140 372959 374390 375870 379319 379759 380334 383977 387137
11339 387137 386441 387418 388550 389948 393801 397056 399622 400292 400527 403077 406455 407083 410350 416568 418111
11324 418111 417156 417841 420190 424304 426985 430549 430484 429898 430972 434964 436478 437922 439763 440775 444545
11309D44545M87j674J311J07R33L139L699J072m83L398J681O09K000P8K898M635
11293D68435O43N03L085L484L528K427L654K540O74K566L525K784q93j786K086
11278D97255M726M042Q06j167j962M331O601K641l61R15J774M56K193K556M273
11263E29079R35p32J373J46K338K206K462K568L754J573J180J156M24J407J951
11248E51820m42L591n19J885N035J565J600K058K087M778L290K507O51J909p46
11233E81069L36K472M309J856L983K957L147K201J552L37K371J597o62J733J508
11218F10766L492J064Q00J642M61P4J658N362M269j290K624L945K186j392K299
11203F37960M521N001M115M149M51P74K317L273R73J869R43J763L142J789L548
$$ plain form
11309 444545 445032 443358 444669 444776 445709 448848 452547 453619 453136 456534 458215 458824 460824 460902 463800 468435
11293 468435 469078 469581 472666 476150 479678 482105 485759 488299 488973 491539 495064 497848 496955 495169 497255
11278 497255 501981 506023 506829 505662 503700 508031 514632 517273 516912 517827 519601 520057 522250 524806 529079
11263 529079 530014 529282 530655 530801 533139 535345 537807 540375 544129 545702 546882 548038 548462 549869 551820
11248 551820 551378 554969 554450 556335 561370 562935 564535 566593 568680 573458 576748 579255 579906 581815 581069
11233 581069 581405 583877 588186 590042 594025 596982 600129 602330 603882 604219 606590 608187 607525 609258 610766
11218 610766 614258 615322 616122 617764 618225 618299 619957 625319 629588 628298 630922 634867 637053 635661 637960
11203 637960 642481 647482 651597 655746 656197 656971 659288 662561 663534 665403 666346 668109 671251 673040 676588
11188F76588M97K92K257L588L073J103J82N069K982L14J972K731K054K134K441
11173G07277L159K611J428j096K930J668J251K883L401K798K948M372L679J266
11159G40575L21K142j78p25K926J818K608M145L574L038L557N02j37J168K664
11144G67998L601N329L914L008K261J830J160K829M689M540N225J05J497L407
11130H11393J028J883L488L647J627j297L67J135K073O066M336P66J890L999K607
11115H45008M677M031K849J445J452l2l32N704K248K679K711K483L516K36J280
11100H79955K924J898L156P94P83L481M589K094J913K818J584O96J480J122l69
11085I08918K918K133J175O58J060L259L811K850O90L548J405J823K009J853M982
$$ plain form
11188 676588 677085 677377 679634 683222 686295 687398 687580 692649 695631 695945 697917 700648 702702 704836 707277
11173 707277 710436 713047 714475 713379 716309 717977 719228 722111 725512 728310 731258 735630 739309 740575
11159 740575 740896 743038 742860 742135 745061 746879 749487 753632 757206 760244 763801 764303 764166 765334 767998
11144 767998 771599 776928 780842 783850 786111 787941 789101 791930 796619 801159 806384 806489 807986 811393
11130 811393 812421 814304 817792 821439 823066 821769 822136 823271 825344 831410 835746 836512 838402 842401 845008
11115 845008 849685 853716 856565 858010 859462 859430 859098 864802 867050 869729 872440 874923 878439 878675 879955
11100 879955 882879 884777 887933 888727 889510 892991 897580 899674 901587 904405 905989 906685 908165 909287 908918
11085 908918 911836 913969 915144 915802 916862 920121 923932 926782 927472 931020 932425 934248 936257 938110 943092
11070I43092M672O07L191M637M282P20L634Q93L709O777L339M33L006M042L123
11055I90157L487J413K960l47K266R04J642M856N341jL782O801N146L584N10J856
11039A034357K07K231N377N742N252N113J690K065J352M345N846M234j54J643
11025A079300M764N679K580K045L000L281K339M044R781N794J296J648K502K108
11011A130161m14J710M690L699K672M147L910K641J515K565M581L699L105M703
10997A173384N069O162N483K540L208M294K951P90L798L824N593N916L294P27
10983A227033j567J961K872L526L172O631K145K229N961P341L468J433J633M093
10969A271931L879O536M719L703L493K701L381N173M309M906M413M283L436M659
$$ plain form
11070 943092 947764 948371 951562 956199 960481 961201 964835 965728 969437 976214 979553 979986 982992 987034 990157
11055 990157 993644 995057 998017 997670 999936 1000840 1002482 1007338 1012679 1012678 1016460 1023261 1028407 1031991 1032501 1034357
11039 1034357 1034564 1036795 1042172 1047914 1053166 1058279 1059969 1062034 1063386 1067731 1073577 1077811 1077657 1079300
11025 1079300 1084064 1089743 1092323 1094368 1097368 1100649 1102988 1107032 1116813 1122607 1123903 1125551 1128053 1130161
11011 1130161 1129747 1131457 1136147 1139846 1142518 1146665 1150575 1153216 1154731 1157296 1161877 1165576 1168681 1173384
10997 1173384 1178453 1184615 1190098 1192638 1195846 1200140 1203091 1203881 1207679 1211503 1217096 1223012 1226306 1227033
10983 1227033 1225466 1227427 1230299 1233825 1236997 1243628 1245773 1248002 1253963 1261304 1264772 1266205 1267838 1271931
10969 1271931 1275810 1282346 1287065 1290768 1294261 1296962 1300343 1305516 1309825 1314731 1319144 1323427 1326863 1331522
10955A331522N294L990L850N236M597K693L540N603J751K520N774N506M325M773
10941A390974O346N303N966N990L852M998M732L595M188N429M492L568L876M090
10927A457399N896O187Q182N279N686N102M722N625M486M300N873P771O788P464
10913A540760P079O905N133M306K012O067R678J0471Q876Q756J1146J2708J1837
10900A645734J1606J1918L205m989r215q734o999o946p949p2K773N117P434J3169
10886A656052J2443J3302J3013J3858J5097J4604J3953J0343R882R835J1709J0745
10874A804836J4277J4941J6975K1800K2194J8953J9866J7016J4723J4380J9942
10863A999903K3314K5864L1726L6473L7765M3298M4266N4646P0024Q5958J04552
$$ plain form
10955 1331522 1336816 1340806 1344656 1349892 1354489 1357182 1360722 1366325 1368076 1370596 1376370 1381876 1386201 1390974
10941 1390974 1397320 1402623 1408589 1414579 1418431 1423429 1428161 1431756 1435944 1441373 1445865 1449433 1453309 1457399
10927 1457399 1463295 1469482 1477664 1482943 1488629 1493731 1498453 1504078 1508564 1512864 1518737 1526508 1533296 1540760
10913 1540760 1547839 1554744 1559877 1564183 1566195 1572262 1581940 1592411 1601287 1610043 1621189 1633897 1645734
10900 1645734 1657340 1669258 1672463 1667474 1658259 1649525 1642526 1635580 1627631 1627559 1630332 1635449 1642883 1656052
10886 1656052 1668495 1681797 1694810 1708668 1723765 1738369 1752322 1762665 1772547 1782382 1794091 1804836
10874 1804836 1819113 1834054 1851029 1872829 1895023 1913976 1933842 1950858 1965581 1979961 1999903
10863 1999903 2023217 2049081 2080807 2117280 2155045 2198343 2242609 2297255 2367279 2453237 2557789
10852B557789J08595N2862j90649o02649p27728m19598p2885R4843J35046J20363
10842A055989J00203Q0826O5102N3493M7819M1508L3918L1980K8267K8659J9949
10831A587713J6832J8032J8577J7139J6314J4846J0649J1432J2957J5715J5885
10820A756091J5548J2131R296Q722R097J0534J1649J1202J1618J2277R255P501
10808A884921R122N775N047M919P777J1192J1930J1777J0162J1575R062Q786J4506
10795B006551J5474J0960O860R136O772P664R985Q239P202P171L595L651N911
10782B109171P512J2076J0877P505O772R470Q725J0964J1490J1807J3047J1117
10770B230533J0443Q946O549Q441J0272J0453Q464P264R847Q818P368P389O582
$$ plain form
10852 2557789 2666384 2719246 2528597 1925948 1198220 778622 705737 800580 935626 1055989
10842 1055989 1156192 1237018 1302120 1355613 1403432 1444940 1478858 1510838 1539105 1567764 1587713
10831 1587713 1604545 1622577 1641154 1658293 1674607 1689453 1700102 1711534 1724491 1740206 1756091
10820 1756091 1771639 1783770 1793066 1801788 1810885 1821419 1833068 1844270 1855888 1868165 1877420 1884921
10808 1884921 1894043 1899818 1904865 1909784 1917561 1928753 1940683 1952460 1962622 1974197 1983259 1992045 2006551
10795 2006551 2022025 2032985 2039845 2048981 2055753 2063417 2073402 2081641 2088843 2096014 2099609 2103260 2109171
10782 2109171 2116683 2128759 2139636 2147141 2153913 2163383 2172108 2183072 2194562 2206369 2219416 2230533
10770 2230533 2240976 2249922 2256471 2264912 2275184 2285637 2294101 2301365 2311212 2320030 2327398 2334787 2341369
10757B341369N115M870N883Q563J2268R933Q846Q663Q056R094M765M948J1281
10744B443654J3077J1671J3938J3102O635J342L853J2714K6054L4324L2772K3178
10732B636314J5570O482k429o237k710N226J1585J0080P545P249J0779J1323J0818
10719B721595J0321J0906J1259J2304J4141J4151J3829J8804J7181J4728J4614
10708B873833J5478J6464J6519J8622J4796J2680R080N860O435Q952J2456J3950
10696C025125J7128K0952J7379J5892J3442P655O183J1791J6847J9127J2530O968
10684C191019M517J772N562P517J0154J1311J4593J7571J7240J1776J2878J6555
10672C322465J9394K0846K2267K1268K2520J7971J7703J6555J2319J1898J9775
$$ plain form
10757 2341369 2346484 2351354 2357237 2365800 2378068 2388001 2396847 2405510 2413566 2422660 2427425 2432373 2443654
10744 2443654 2456731 2468402 2482340 2495442 2502077 2503419 2507272 2519986 2546040 2580364 2613136 2636314
10732 2636314 2651884 2658366 2655937 2649700 2646990 2652216 2663801 2673881 2681426 2688675 2699454 2710777 2721595
10719 2721595 2731916 2742822 2754081 2766385 2780526 2794677 2808506 2827310 2844491 2859219 2873833
10708 2873833 2889311 2905775 2922294 2940916 2955712 2968392 2977472 2983332 2989767 2998719 3011175 3025125
10696 3025125 3042253 3063205 3080584 3096476 3109918 3117573 3123756 3135547 3152394 3171521 3184051 3191019
10684 3191019 3195536 3197308 3202870 3210387 3220541 3231852 3246445 3264016 3281256 3293032 3305910 3322465
10672 3322465 3341859 3362705 3384972 3406240 3428760 3446731 3464434 3480989 3493308 3505206 3524981
10661C524981K2146J9214J1346O577P659J1891J6332J4973J5497K0873K4945K8405
10649C724839L1495L1844L2523L1705K5889K0651J9986K4054K4700K1822J7420
10638D006928J6792J8819J6137J4438J2372J4514J7403J8090J9733K4589L0325
10627D210140L9835M2208L4137K2201J4584J2361K4981L6583M0803M0881L4179
10616D552893K8199J7614N448N570J5547K9705L7828M5700L7653K4888K1300K1251
10604D843596K5344L3133M0807M0689L3764K6580K4915J9643K1521K7979L4738
10593E172709L9851L8772L2939K8974J9454o117m6638p3449l1504M1521R3969
10582E310481J04600R2142O9422N1488N2076N2952N5317N7752O0352O6462P1429
$$ plain form
10661 3524981 3547127 3566341 3577687 3584264 3591923 3603814 3620146 3635119 3650616 3671489 3696434 3724839
10649 3724839 3756334 3788178 3820701 3852406 3878295 3898946 3918932 3942986 3967686 3989508 4006928
10638 4006928 4023720 4042539 4058676 4073114 4085486 4100000 4117403 4135493 4155226 4179815 4210140
10627 4210140 4249975 4292183 4326320 4348521 4363105 4375466 4400447 4437030 4477833 4518714 4552893
10616 4552893 4581092 4598706 4604154 4609724 4625271 4654976 4692804 4738504 4776157 4801045 4822345 4843596
10604 4843596 4868940 4902073 4942880 4983569 5017333 5043913 5068828 5088471 5109992 5137971 5172709
10593 5172709 5212560 5251332 5284271 5313245 5332699 5326582 5279944 5206495 5174991 5216512 5310481
10582 5310481 5415081 5507223 5576645 5628133 5680209 5733161 5788478 5846230 5906582 5973044 6044473
10571F044473P8808P8597O8338N9622N7274L5546O175j8311m0871n8299o2509
10560F248843n6454k1283M2751J03241J43859J58129J40179J07052P8653O3137
10550G008107N2400K6335J1426J3377K7126O3610J12603J39954J50605J47084
10540G752627J32557J12815R8672R3818Q8670Q5834Q6053Q6643Q1193Q0274Q6003
10529H785159R2237R4589R2233R1603R2030R6223J06500J10220J07716J10266
10519I778776J17784J20077J22978J30055J31610J34640J39086J43664J43419
10510A0962089J44807J47767J48232J50581J55946J59684J69615J85620J94671
10501A2419012J96033J93020J99424K01425K00723K11015K22302K27141K28445
$$ plain form
10571 6044473 6123281 6201878 6270216 6329838 6387112 6422658 6428833 6410522 6369651 6311352 6248843
10560 6248843 6192389 6171106 6213857 6317098 6460957 6619086 6759265 6866317 6944970 7008107
10550 7008107 7060507 7086842 7098268 7111645 7138771 7202381 7314984 7454938 7605543 7752627
10540 7752627 7885184 7997999 8096671 8190489 8279159 8364993 8451046 8537689 8618882 8699156 8785159
10529 8785159 8877396 8971985 9064218 9155821 9247851 9344074 9450574 9560794 9668510 9778776
10519 9778776 9896560 10016637 10139615 10269670 10401280 10535920 10675006 10818670 10962089
10510 10962089 11106896 11254663 11402895 11553476 11709422 11869106 12038721 12224341 12419012
10501 12419012 12615045 12808065 13007489 13208914 13409637 13620652 13842954 14070095 14298540
10492A4298540K36356K48459K63724K77537K86792K84897K79977K81848K89415
10483A6747545L00434L10459L26464L48172L68781L88780M18815M53052M77172
10474B0139674M93039N19372N51173N84465O20105O65031P22465P74581Q02227
10465B5872132Q04829Q29285Q98531R44698Q85136Q01846Q80955J073983J255499
10456C4246894J402831J531498J644632J779052J949454K122530K244392K244016
10448D9165299K059514K047424K523586L184701L769229M288339M845075N453457
10440G7336624O028594O675857P784268R530544J1786312J4200328J5896646J2695392
10432A61934565r305684o3344565j11387823j01114357n1797850o628830J5362032
$$ plain form
10492 14298540 14534896 14783355 15047079 15324616 15611408 15896305 16176282 16458130 16747545
10483 16747545 17047979 17358438 17684902 18033074 18401855 18790635 19209450 19662502 20139674
10474 20139674 20632713 21152085 21703258 22287723 22907828 23572859 24295324 25069905 25872132
10465 25872132 26676961 27506246 28404777 29349475 30234611 31036457 31917412 32991395 34246894
10456 34246894 35649725 37181223 38825855 40604907 42554361 44676891 46921283 49165299
10448 49165299 51224813 53272237 55795823 58980524 62749753 67038092 71883167 77336624
10440 77336624 83365218 90041075 97825343 107355887 119142199 133342527 149239173 161934565
10432 161934565 152628881 89284316 -22103507 -123217864 -175015714 -181644544 -166282512
10425a66282512K0304425J8432805J5160395J2269744J0004790Q260786O918756
10418g4930811N916908N167956M554163M017677L459844K713915J949855J677118
10410d5473375J802170J895080J847548J739079J608953J469287J344491J264217
10402c2502550J210519J137455J041739R37858Q38359P74395P45084P06377O40485
10393b4470279N78040N51645N37730N17225M95659M81108M66966M52051M31407
10384a9958448M11811L99994L93549L87808L79502L74460L66825L52476L35220
10375a6556803L19122L04640K89225K63729K41394K33616K31436K30366K29235
10366a4214040K22431K07389K01570K02159J97323J86405J76305J65755J59226
$$ plain form
10425 -166282512 -145978087 -127545282 -112384887 -100115143 -90110353 -81849567 -74930811
10418 -74930811 -69013903 -63845947 -59291784 -55274107 -51814263 -49100348 -47150493 -45473375
10410 -45473375 -43671205 -41776125 -39928577 -38189498 -36580545 -35111258 -33766767 -32502550
10402 -32502550 -31292031 -30154576 -29112837 -28174979 -27336620 -26562225 -25817141 -25110764 -24470279
10393 -24470279 -23892239 -23340594 -22802864 -22285639 -21789980 -21308872 -20841906 -20389855 -19958448
10384 -19958448 -19546637 -19146643 -18753094 -18365286 -17985784 -17611324 -17244499 -16892023 -16556803
10375 -16556803 -16237681 -15933041 -15643816 -15380087 -15138693 -14905077 -14673641 -14443275 -14214040
10366 -14214040 -13991609 -13784220 -13582650 -13380491 -13183168 -12996763 -12820458 -12654703 -12495477
10357a2495477J55589J54384J55876J57702J55492J52571J44802J36824J30618
10348a1151619J24696J20326J18836J19414J14855J14929J17136J14537J13654
10339a0093236J12262J10403J06482J01873J03395J04525J02487R5479R0685R0514
10329i075131R3905R1359R1075Q6793Q2330P6751P5732P1679O2286M3705K1855
10318h277661M820m511o36K9893O9061R4099J11624J17664J01034P6452N5765
10307g622396L9481J4905q773k5129l2520j1681M1141Q4354J24214J54312J57987
10296g084105J36929J14595Q9566O9481N3324M1883L0973K4060K0361K0881K6378
10285f455674K5480K2020K1557K6448L3219L0944J4921n105j9036m693N7116J18288
$$ plain form
10357 -12495477 -12339888 -12185504 -12029628 -11871926 -11716434 -11563863 -11419061 -11282237 -11151619
10348 -11151619 -11026923 -10906597 -10787761 -10668347 -10553492 -10438563 -10321427 -10206890 -10093236
10339 -10093236 -9980974 -9870571 -9764089 -9662216 -9558821 -9454296 -9351809 -9256330 -9165645 -9075131
10329 -9075131 -8981226 -8889867 -8798792 -8711999 -8629669 -8552918 -8477186 -8405507 -8343221 -8299516 -8277661
10318 -8277661 -8272841 -8277352 -8277988 -8248095 -8179034 -8084935 -7973311 -7855647 -7754613 -7678161 -7622396
10307 -7622396 -7582915 -7568010 -7576783 -7601912 -7634432 -7646113 -7604972 -7520618 -7396404 -7242092 -7084105
10296 -7084105 -6947176 -6832581 -6743015 -6673534 -6620210 -6578327 -6547354 -6523294 -6502933 -6482052 -6455674
10285 -6455674 -6430194 -6408174 -6386617 -6360169 -6326950 -6296006 -6281085 -6286190 -6305226 -6309919 -6252803 -6134515
10273f134515J38523J17120Q2647N1356M0576L2728L1315K9982L2038L4214M2947
10262e501069M6324M1696L3025K5789K0744K0217K7545L4692M1228M0118K9080
10251e140611J5330J1650J6726K8221M3437N2227M7995L3351K1633J5617J2258
10240d842166J5127J8963K8367L1275L0247K7729J3582J0504J1240J4488K7968
10229d612676L1330K7482K3959K6921L2121K9245K4862K6018K7315K6310J9506
10218d317607J9548J9086K2255K0552J8311J3777P235M727N517J1517J8026J7479
10206d139577J6350K0053K1836J9135J8390K1803K4334K2130J7816J9086K0802
10195c917842K3271K2809J9643J7065J6863J3075J0445J2338R628Q486J0403J4547
$$ plain form
10273 -6134515 -5995992 -5878872 -5796225 -5744869 -5704293 -5671565 -5640250 -5610268 -5578230 -5544016 -5501069
10262 -5501069 -5454745 -5413049 -5380024 -5354235 -5333491 -5313274 -5285729 -5251037 -5209809 -5169691 -5140611
10251 -5140611 -5125281 -5113631 -5096905 -5068684 -5025247 -4973020 -4925025 -4891674 -4870041 -4854424 -4842166
10240 -4842166 -4827039 -4808076 -4779709 -4748434 -4718187 -4690458 -4676876 -4666372 -4655132 -4640644 -4612676
10229 -4612676 -4581346 -4553864 -4529905 -4502984 -4470863 -4441618 -4416756 -4390738 -4363423 -4337113 -4317607
10218 -4317607 -4298059 -4278973 -4256718 -4236166 -4217855 -4204078 -4196843 -4192116 -4186599 -4175082 -4157056 -4139577
10206 -4139577 -4123227 -4103174 -4081338 -4062203 -4043813 -4022010 -3997676 -3975546 -3957730 -3938644 -3917842
10195 -3917842 -3894571 -3871762 -3852119 -3835054 -3818191 -3805116 -3794671 -3782333 -3772705 -3764219 -3753816 -3739269
10183c739269J6976J3836J5323J5686J3714J4431J8121K0360K1344J9899J6568
10172c553011J4774J4801J6217J5428J4916J3295J2296J4587J4251J6678J7181
10161c388587K1168K4253K1482K0317J5074J1982Q075P967P547J2414J4371J1607
10149c212330J5587J4818J5622J6427J4776J4550J6087J4961J9141J8103J8484
10138c033774K0444K1117J9654J9142J8386J9793K6618L2416L7012L4254K7196
10127b757742J3708N795n03k096N645K0193L4424M0109L1003K5582K6233L2432
10115b525217L3995L5310L6527L9361M0500M1458L9309M2253N1455O0432P0103
10104b034514Q1988R7204J13617J30562J47795J77800K13188K26018J41425k09989
$$ plain form
10183 -3739269 -3722293 -3708457 -3693134 -3677448 -3663734 -3649303 -3631182 -3610822 -3589478 -3569579 -3553011
10172 -3553011 -3538237 -3523436 -3507219 -3491791 -3476875 -3463580 -3451284 -3436697 -3422446 -3405768 -3388587
10161 -3388587 -3367419 -3343166 -3321684 -3301367 -3286293 -3274311 -3266236 -3258269 -3250722 -3238308 -3223937 -3212330
10149 -3212330 -3196743 -3181925 -3166303 -3149876 -3135100 -3120550 -3104463 -3089502 -3070361 -3052258 -3033774
10138 -3033774 -3013330 -2992213 -2972559 -2953417 -2935031 -2915238 -2888620 -2856204 -2819192 -2784938 -2757742
10127 -2757742 -2744034 -2738239 -2738742 -2740838 -2735193 -2715000 -2680576 -2640467 -2609464 -2583882 -2557649 -2525217
10115 -2525217 -2491222 -2455912 -2419385 -2380024 -2339524 -2298066 -2258757 -2216504 -2165049 -2104617 -2034514
10104 -2034514 -1952526 -1855322 -1741705 -1611143 -1463348 -1285548 -1072360 -846342 -704917 -914906
10094i14906q42148j372280j267181o68073q7187K07594K80281K54351K06395
10085d203154J68811J40469J17625R8933Q6592P5862O5210N5848M6226L9628L6060
10074c271890L6713L5726L3037L1867L0971L0900K8714K6893K3253J9262J9810
10063b954744J9220J6976J5268J7400J3054J6515J7253J5037J6156J5534J4399
10052b777932K0055J6658J3388J4849J4013J5292J3796J4600J5530J6299J8670
10041b604782J7788J4901J1490J1107J3299J8510J9572J6239J6781J5043J5915
10030b434137J6047J6534J6004J8460K1079K0360K2656K1654K0030K3708K6407
10019b211198K7947L0348L0187L6281M1610M6712N0591O1131P8237R4073J08316
$$ plain form
10094 -914906 -1757054 -3129334 -4396515 -5064588 -5151775 -4944181 -4663900 -4409549 -4203154
10085 -4203154 -4034343 -3893874 -3776249 -3677316 -3590724 -3514862 -3449652 -3393804 -3347578 -3307950 -3271890
10074 -3271890 -3235177 -3199451 -3166414 -3134547 -3103576 -3072676 -3043962 -3017069 -2993816 -2974554 -2954744
10063 -2954744 -2935524 -2918548 -2903280 -2885880 -2872826 -2856311 -2839058 -2824021 -2807865 -2792331 -2777932
10052 -2777932 -2757877 -2741219 -2727831 -2712982 -2698969 -2683677 -2669881 -2655281 -2639751 -2623452 -2604782
10041 -2604782 -2586994 -2572093 -2560603 -2549496 -2536197 -2517687 -2498115 -2481876 -2465095 -2450052 -2434137
10030 -2434137 -2418090 -2401556 -2385552 -2367092 -2346013 -2325653 -2302997 -2281343 -2261313 -2237605 -2211198
10019 -2211198 -2183251 -2152903 -2122716 -2086435 -2044825 -1998113 -1947522 -1886391 -1808154 -1714081 -1605765
10008a605765J03279n905l37111p03884o48479k78824J1367J23974J35418J13736
9998c092194Q9540P4373O3936N5641M5518L8200L4765L1863K3193J7308J4119
9987b603738J5082J5748J5538J3548J4865J3502J0995J2553R569P416P796Q368
9975b458758J0763Q849N810R895J3272J4473J5241J8572K1453J8325J9118K2948
9963b280039K5864J7911J0776L347q07j042J883L148L572L653L847M767O481Q352
9949b188287P061P213O426L030M606M331O218N818M028M860L661M714O745K516
9935b117060J863J133J053K31M081O514N646P407R474P392M707M749M63K065N034
9920b055248L686J474M811P948O249M063M910N662M446M673N261L731L245M819
$$ plain form
10008 -1605765 -1502486 -1508391 -1845502 -2549386 -3197865 -3476689 -3465322 -3341348 -3205930 -3092194
9998 -3092194 -3002654 -2928281 -2864345 -2808704 -2763186 -2724986 -2690221 -2658358 -2635165 -2617857 -2603738
9987 -2603738 -2588656 -2572908 -2557370 -2543822 -2528957 -2515455 -2504460 -2491907 -2482338 -2474922 -2467126 -2458758
9975 -2458758 -2447995 -2439146 -2433336 -2423441 -2410169 -2395696 -2380455 -2361883 -2340430 -2322105 -2302987 -2280039
9963 -2280039 -2254175 -2236264 -2225488 -2222141 -2222948 -2223990 -2222107 -2218959 -2215387 -2211734 -2207887 -2203120 -2196639 -2188287
9949 -2188287 -2181226 -2174013 -2167587 -2164557 -2159951 -2155620 -2149402 -2143584 -2139556 -2134696 -2131035 -2126321 -2119576 -2117060
9935 -2117060 -2115197 -2114064 -2113011 -2112780 -2108699 -2102185 -2096539 -2089132 -2079658 -2072266 -2067559 -2062810 -2062347 -2060282 -2055248
9920 -2055248 -2051562 -2050088 -2045277 -2037329 -2031080 -2027017 -2022107 -2016445 -2011999 -2007326 -2002065 -1998334 -1995089 -1990270
9906a990270O028N170L201K037L883O760N711O246N578M125L335M791M239J979
9892a927187J379J687J941M852O219P496L060N310N571L285m4K079M380N604K955
9877a871413K333J786M376R157N230N504L871N36O165N405L214M373J951L016
9863a814496M725L050J34J716M776K600K834O21J601K874K859M221L267O361L931
9848a768926L537L617M296M472L692M372J870J867L280K626L648J987N88L041
9834a726033M373K261M260K279J259L315N460K380J400L259N243M137M708L484
9820a678215J117L497K685M395K888K068O55O51L484O520P033L785K926j611M708
9805a633414K963N71L773M560M291K734K133K158R71J114K433N451L971L068K292
$$ plain form
9906 -1990270 -1984242 -1979072 -1975871 -1973834 -1969951 -1963191 -1957480 -1951234 -1945656 -1941531 -1938196 -1933405 -1929166 -1927187
9892 -1927187 -1925808 -1924121 -1922180 -1917328 -1911109 -1903613 -1900553 -1895243 -1889672 -1886387 -1886431 -1884352 -1879972 -1874368 -1871413
9877 -1871413 -1869080 -1867294 -1862918 -1853761 -1848531 -1843027 -1839156 -1838620 -1832455 -1827050 -1823836 -1819463 -1817512 -1814496
9863 -1814496 -1809771 -1806721 -1806587 -1804871 -1800095 -1797495 -1794661 -1794040 -1792439 -1789565 -1786706 -1782485 -1779218 -1772857 -1768926
9848 -1768926 -1765389 -1761772 -1757476 -1753004 -1749312 -1744940 -1743070 -1741203 -1737923 -1735297 -1731649 -1729662 -1729074 -1726033
9834 -1726033 -1721660 -1719399 -1715139 -1712860 -1711601 -1708286 -1702826 -1700446 -1699046 -1695787 -1690544 -1686407 -1681699 -1678215
9820 -1678215 -1677098 -1673601 -1670916 -1666521 -1663633 -1661565 -1660910 -1660259 -1656775 -1650255 -1643222 -1639437 -1636511 -1638122 -1633414
9805 -1633414 -1630451 -1629880 -1626107 -1621547 -1617256 -1614522 -1612389 -1610231 -1609260 -1608146 -1605713 -1600262 -1596291 -1593223 -1590931
9790a590931L066K975K501L54J195K375M196K341K004L366L402M362K314O92J999
9775a553789K168M709K114N69J544J032L528L302L059K860L436K118K728P74J970
9760a517878J532K565M347O46J596M198K670l04L067N051N475K852l41J973o34
9745a483185M761N259M422L870K647K615L331J134J484k96J582O84R27N77K922
9730a447266K241K087L800M700K746J560J280R83K102L460N579K049L476K030
9716a409173j1L81J963K646J447L32K425J106K94L488L523L517N563K045K638
9701a377816L743J483K440J543K432L022K960J533q2L25J377K709M704K254Q67
9686a346506L458K632K936R02J129K031O39J814M759L215N765K161J639K406Q75
$$ plain form
9790 -1590931 -1587865 -1584890 -1582389 -1582035 -1580840 -1578465 -1574269 -1571928 -1569924 -1566558 -1563156 -1558794 -1556480 -1555788 -1553789
9775 -1553789 -1551621 -1546912 -1544798 -1544229 -1542685 -1541653 -1538125 -1534823 -1531764 -1528904 -1525468 -1523350 -1520622 -1519848 -1517878
9760 -1517878 -1516346 -1513781 -1509434 -1508788 -1507192 -1502994 -1500324 -1500628 -1497561 -1492510 -1487035 -1484183 -1484524 -1482551 -1483185
9745 -1483185 -1478424 -1473165 -1468743 -1464873 -1462226 -1459611 -1456280 -1455146 -1453662 -1453958 -1452376 -1451692 -1450765 -1450188 -1447266
9730 -1447266 -1445025 -1442938 -1439138 -1434438 -1431692 -1430132 -1428852 -1427869 -1425767 -1422307 -1416728 -1414679 -1411203 -1409173
9716 -1409173 -1409184 -1408803 -1406840 -1404194 -1402747 -1402415 -1399990 -1398884 -1398590 -1395102 -1391579 -1388062 -1382499 -1380454 -1377816
9701 -1377816 -1374073 -1372590 -1370150 -1368607 -1366175 -1363153 -1360193 -1358660 -1358742 -1358417 -1357040 -1354331 -1349627 -1347373 -1346506
9686 -1346506 -1343048 -1340416 -1337480 -1336578 -1335449 -1333418 -1332779 -1330965 -1326206 -1322991 -1317226 -1315065 -1313426 -1311020 -1310145
9671a310145j154j720l10o21Q78p08J084J474J898L318M852K558M216M991K475
9656a286914M81j693O03j43M39J902L564K679K021L125K725M278K910J100J883
9641a261040M218K921K739L879o05k127P1K270K177J685K349J500J518M138M331
9626a229976M143k02J200L550k25N78J383K856L859K478p70K588L18J597J844
9611a204779j438Q87L624Q54L553M266L519L756K301J65J973j163r41J123L567
9596a178733L515L114J291j85M31m7L871K466L64L585K595L007P8K919L86M606
9580a146737K094J056j05j838K293R47K220L125L664J867J112J114Q07Q89R32
9565a126560K575J592j91Q36K880J519L859K922j613k42L481N500N980J631J5
$$ plain form
9671 -1310145 -1311299 -1313019 -1313329 -1313950 -1313072 -1313780 -1312696 -1311222 -1309324 -1306006 -1301154 -1298596 -1294380 -1289389 -1286914
9656 -1286914 -1286433 -1288126 -1287523 -1287666 -1287227 -1285325 -1281761 -1279082 -1277061 -1273936 -1271211 -1266933 -1264023 -1262923 -1261040
9641 -1261040 -1256822 -1253901 -1251162 -1247283 -1247888 -1250015 -1249944 -1247674 -1245497 -1243812 -1241463 -1239963 -1238445 -1234307 -1229976
9626 -1229976 -1225833 -1226035 -1224835 -1221285 -1221510 -1220932 -1219549 -1216693 -1212834 -1210356 -1211126 -1208538 -1208220 -1206623 -1204779
9611 -1204779 -1206217 -1205330 -1201706 -1200852 -1197299 -1193033 -1189514 -1185758 -1183457 -1183292 -1181319 -1182482 -1183423 -1182300 -1178733
9596 -1178733 -1175218 -1172104 -1170813 -1170998 -1170567 -1170614 -1166743 -1164277 -1163913 -1160328 -1157733 -1154726 -1154648 -1151729 -1151343 -1146737
9580 -1146737 -1144643 -1143587 -1143692 -1145530 -1143237 -1142290 -1140070 -1136945 -1133281 -1131414 -1130302 -1129188 -1128381 -1127492 -1126560
9565 -1126560 -1123985 -1122393 -1122584 -1121748 -1118868 -1117349 -1113490 -1110568 -1112181 -1112423 -1108942 -1103442 -1097462 -1095831 -1095816
9550a095816o83M51r54O5K836K176J469L096L482R04J093J749O19n71r08k99L165
9533a078126M781J497k68J002L273K490L101N035L497j386N30K162J496K029J756
9518a047131L83M196K219N10J960O43R30k85P05m6L301K866k07J939J150M85K340
9501a024042J134J506J023J119J893L350K990J068k172P15O28J853L447K085O81
9486a002722J723L417r20J080N104L960J697K99N0K149M403Q41n14R35J295R47
9470i76256j771J120K561L252K437J979J405J816K98K232J498P10J817M41K065
9455i54396L228J771O99l76k67j489J083J734K748M385N583K9k183J594K352J859
9439i31646K406L003L489L117J663k78J13r20J919M241N4Q71K888P29L44J491
$$ plain form
9550 -1095816 -1096499 -1096048 -1097002 -1096937 -1094101 -1091925 -1090456 -1087360 -1083878 -1082974 -1081881 -1080132 -1079513 -1080084 -1080992 -1081291 -1078126
9533 -1078126 -1073345 -1071848 -1072116 -1071114 -1067841 -1065351 -1062250 -1057215 -1053718 -1055104 -1054574 -1052412 -1050916 -1048887 -1047131
9518 -1047131 -1046748 -1042552 -1040333 -1039823 -1037863 -1037220 -1036290 -1036575 -1035870 -1035916 -1032615 -1029749 -1029956 -1028017 -1026867 -1026382 -1024042
9501 -1024042 -1022908 -1021402 -1020379 -1019260 -1017367 -1014017 -1011027 -1009959 -1012131 -1011416 -1010788 -1008935 -1005488 -1003403 -1002722
9486 -1002722 -1000999 -997582 -998502 -997422 -992318 -988358 -986661 -986362 -986312 -984163 -979760 -978919 -979433 -978498 -977203 -976256
9470 -976256 -978027 -976907 -974346 -971094 -968657 -966678 -965273 -963457 -963159 -960927 -959429 -958719 -956902 -956461 -954396
9455 -954396 -951168 -949397 -948698 -949074 -949341 -950830 -949747 -948013 -945265 -940880 -935297 -935268 -937451 -935857 -933505 -931646
9439 -931646 -929240 -926237 -922748 -919631 -917968 -918246 -918133 -919053 -917134 -912893 -912839 -911968 -909080 -908351 -908007 -906516
9423i06516L113J673o72L709N85l70K656K3k93N66J464K926J397o76j164J807
9407h89772K874M027L839K657l24k46M048j421j032L045L542L018J664J520M94
9392h62067j874N69J665L63K569n73j38N75M859L049L135K755N69j60o65m54K4
9375h45799n92K556M373K314J386J271K932J621M59l06J770K813r22m88K868M018
9359h19726o0k480L615K970J738K629k21J039K885j59K37R1J668M312P85M6M930
9342g95701K427k90J380L959J097Q24J999l88O8J545J765l49K81J402L104K358
9326g74519J316R50L331M39k076J832K375N1K411p86J566K965K402P13K145J178
9310g53707K114K547j74n33J658L700J659j005K276J244J64J130L023J555j837
$$ plain form
9423 -906516 -903403 -901730 -902402 -898693 -898108 -898478 -895822 -895799 -896092 -895526 -894062 -891136 -889739 -890415 -891579 -889772
9407 -889772 -886898 -882871 -879032 -876375 -876699 -876945 -872897 -874318 -875350 -872305 -868763 -865745 -864081 -862561 -862067
9392 -862067 -863941 -863372 -861707 -861344 -858775 -859348 -859486 -858911 -854052 -851003 -847868 -845113 -844544 -844704 -845369 -845823 -845799
9375 -845799 -846391 -843835 -839462 -837148 -835762 -834491 -831559 -829938 -829479 -829785 -828015 -825202 -826124 -826612 -823744 -819726
9359 -819726 -819786 -822266 -818651 -815681 -813943 -811314 -811535 -810496 -807611 -807770 -807533 -807442 -805774 -801462 -800677 -800631 -795701
9342 -795701 -793274 -793564 -792184 -788225 -787128 -786304 -784305 -784693 -784625 -783080 -781315 -781664 -781383 -779981 -776877 -774519
9326 -774519 -773203 -772253 -768922 -768483 -770559 -768727 -766352 -766301 -763890 -764676 -763110 -760145 -757743 -757030 -754885 -753707
9310 -753707 -751593 -749046 -749220 -749753 -748095 -744395 -742736 -743741 -741465 -740221 -740057 -738927 -735904 -734349 -736186
9295g36186J748J834J398J102K715K575l0J457L847L051L838r32q34J997M06J903
9279g10111J105m80k248K604L023K382J457R95M22J580J500J747J199K363L587
9264f88875L886J95O49J151o00m2j602j529J771L804K719J311K267K532L761M18
9248f68184J142O34M232L744j00p59M94L21N68L298M024J778j232K312j10R47
9232f46891K111K369J17J314J516K819P60L574K880R89n25k087K195J83M70L262
9216f24944J504K388L432J607k489K71K076J923K242r1m17K209N782M311J664
9201e98532j199j186K584J73K068L19O98L187J422Q07K740J677r21j424K525M447
9185e80615M07p93J673K143J581J445M386M509J211J0K803j232J808J332k00K18
$$ plain form
9295 -736186 -734438 -732604 -731206 -730104 -727389 -724814 -724844 -723387 -719540 -716489 -712651 -713583 -714417 -712420 -712014 -710111
9279 -710111 -709006 -709486 -711734 -709130 -706107 -703725 -702268 -701273 -700851 -699271 -697771 -696024 -694825 -692462 -688875
9264 -688875 -684989 -684794 -684145 -682994 -683594 -683636 -685238 -686767 -684996 -681192 -678473 -677162 -674895 -672363 -668602 -668184
9248 -668184 -667042 -666408 -662176 -658432 -658532 -659291 -658797 -658476 -657908 -654610 -650586 -648808 -650040 -647728 -647838 -646891
9232 -646891 -644780 -642411 -642294 -640980 -639464 -636645 -635885 -632311 -629431 -628442 -628967 -631054 -628859 -628676 -628206 -624944
9216 -624944 -623440 -621052 -617620 -616013 -618502 -618231 -616155 -614232 -611990 -612081 -612498 -610289 -604507 -600196 -598532
9201 -598532 -599731 -600917 -598333 -598160 -596092 -595773 -595075 -591888 -590466 -589659 -586919 -585242 -586163 -587587 -585062 -580615
9185 -580615 -580208 -581001 -579328 -577185 -575604 -574159 -569773 -565264 -564053 -564043 -561240 -562472 -560664 -559332 -559532 -559314
9169e59314K359L007K750J475k486K6J947K867L968K604m50J475J720J366J617
9154e35069J193L469J081P13J030K254L086J48J560n47J148M57J804N230K952
9139e09491j289J160J826O17m41J398M42Q25J065J417n41J701N208J750O58K474
9123d91221K16J122R70K998P95J951K395r58J278L133K738J466k92k325L203N177
9107d67354K486k95l4J258K964M088L089L026M617J558J156J212J079K276O60
9092d38214q89o73K114L56L558L539J283K261J668J938O94J702K103J746P77J706
9076d14331J592K780L015L380j817L97K095K050R78J184J231K800R13q3K255M153
9060c87408N837K812O79l5J432J276J844K037k46q28J57M591M019J836J569K875
$$ plain form
9169 -559314 -556955 -553948 -551198 -549723 -552209 -552183 -550236 -547369 -543401 -540797 -541247 -539772 -538052 -536686 -535069
9154 -535069 -533876 -530407 -529326 -528613 -527583 -525329 -522243 -522095 -520535 -521082 -519934 -519477 -517673 -512443 -509491
9139 -509491 -510780 -509620 -507794 -507177 -507618 -506220 -505778 -504953 -503888 -502471 -503012 -501311 -496103 -494353 -493695 -491221
9123 -491221 -491005 -489883 -488913 -485915 -485120 -483169 -480774 -481732 -480454 -477321 -474583 -473117 -473409 -475734 -472531 -467354
9107 -467354 -464868 -465163 -465197 -463939 -460975 -456887 -453798 -450772 -446155 -444597 -443441 -442229 -441150 -438874 -438214
9092 -438214 -439103 -439776 -437662 -437306 -433748 -430209 -428926 -426665 -424997 -423059 -422365 -420663 -418560 -416814 -416037 -414331
9076 -414331 -412739 -409959 -406944 -403564 -405381 -404984 -402889 -400839 -399861 -398677 -397446 -394646 -393733 -393816 -391561 -387408
9060 -387408 -381571 -378759 -378080 -378115 -376683 -375407 -373563 -371526 -371772 -372600 -372443 -367852 -363833 -361997 -360428 -357553
9044c57553j496L82L392K668J243J187K568K816K577K676K894P48m08K980K108
9029c31218J638L23L667L438J545K239J086N01P12J273Q18J053J823K460K854
9014c05788K040K331N326L082j283N66J310N16M710M980J391J789J576J112N33
8999b75809P17j227K347M999K602K609K707L460J562R07J589J26K358K993K793
8984b45267Q21K14K757K250K246J397M315J372k83K191L260M004L451K918P30
8969b13624L907K508R95L349J064K054K338J536M733L474J804J465M14K575K165
8954a79243M728K670J629K065O24J184L505L372J311K109J575L646K941K707K291
8939a42886L718L833P85n82L59K230K529L470K751N293M693J956p4M98J611J123
$$ plain form
9044 -357553 -359049 -358667 -355275 -352607 -351364 -350177 -347609 -344793 -342216 -339540 -336646 -335898 -336306 -333326 -331218
9029 -331218 -329580 -329257 -325590 -322152 -320607 -318368 -317282 -316781 -316069 -314796 -313978 -312925 -311102 -308642 -305788
9014 -305788 -303748 -301417 -296091 -293009 -294292 -293726 -292416 -291900 -287190 -282210 -280819 -279030 -277454 -276342 -275809
8999 -275809 -275092 -276319 -273972 -268973 -266371 -263762 -261055 -257595 -256033 -255126 -253537 -253411 -251053 -248060 -245267
8984 -245267 -244446 -244232 -241475 -239225 -236979 -235582 -231267 -229895 -230178 -227987 -224727 -220723 -217272 -214354 -213624
8969 -213624 -209717 -207209 -206214 -202865 -201801 -199747 -197409 -195873 -191140 -187666 -185862 -184397 -183983 -181408 -179243
8954 -179243 -174515 -171845 -170216 -168151 -167527 -166343 -162838 -159466 -158155 -156046 -154471 -150825 -147884 -145177 -142886
8939 -142886 -139168 -135335 -134550 -135132 -134773 -132543 -130014 -126544 -123793 -118500 -113807 -111851 -111925 -111427 -109816 -108693
8923a08693L871M925L176J755K942L493J969Q03J914N053L701N76J775O424L098
8908f3218K081K015K187J618M752K708j20J591L816L749O386N826K170J58J04
8893b4177N52J238M114M175N217O305K120K705K676O182K012j830j470L454M712
8878A7985N974L974K745L062N164M297L068L298K964K995K844L094J603K752O925
8863G2744N429K484L179L362K146K775L642N569L034N465L697K166M526L585J967
8848A25770o80J404L751M423M992N852M210J460M427O183M546L728K699K830K885
8833A78480K611O157N574L538M993N291L718O076M393N966M654J957K098M382
8819B39888N020O634O273M834M376J456M158K561M397L097L965M986O096O919
$$ plain form
8923 -108693 -104822 -99897 -96721 -94966 -92024 -88531 -86562 -85759 -83845 -78792 -75091 -74515 -72740 -66316 -63218
8908 -63218 -61137 -59122 -56935 -55317 -50565 -47857 -47977 -46386 -42570 -38821 -32435 -26609 -24439 -24281 -24177
8893 -24177 -23625 -22387 -18273 -14098 -8881 -2576 -456 2249 4925 11107 13119 11289 9819 13273 17985
8878 17985 23959 27933 30678 33740 38904 43201 46269 49567 52531 55526 58370 61464 63067 65819 72744
8863 72744 78173 80657 83836 87198 89344 92119 95761 101330 104364 109829 113526 115692 120218 123803 125770
8848 125770 125090 126494 130245 134668 139660 145512 149722 151182 155609 161792 166338 170066 172765 175595 178480
8833 178480 181091 187248 192822 196360 201353 206644 210362 216438 220831 226797 231451 233408 235506 239888
8819 239888 244908 251542 257815 262649 267025 268481 272639 275200 279597 282694 286659 291645 297741 304660
8805C04660P186L560O481M428M725M875M278M892L316O042N520K212K778O526
8791C71479O154N401M284K939M687L597M485Q213N091N876P454P419M517L420
8777D45016N638O696O741L671N472P641P471N145N460M886P308Q206R606Q179
8763E37136L567N863O775R117O049P665N145O706Q841N976N799P434N430Q962
8749F30465Q579N925M854R330R170O610O566R292J1192R072N346O931O489P503
8735G37324R194Q133Q702R434R238Q399Q293P574R471J2079J0237Q633N787O942
8721H59440P438R726J0601R807R304J1487J0008R395P923Q490J0450R255J0728
8708I84052J0579J0246J1013J2933J1791R961R020J3364J0688J1348Q076J0804
$$ plain form
8805 304660 311846 315406 321887 326315 331040 335915 340193 345085 348401 354443 359963 362175 364953 371479
8791 371479 377633 383034 387318 390257 394944 398541 403026 411239 416330 422206 429660 437079 441596 445016
8777 445016 450654 457350 464091 467762 473234 480875 488346 493491 498951 503837 511145 519351 528957 537136
8763 537136 540703 546566 553341 562458 568507 576172 581317 588023 596864 602840 608639 616073 621503 630465
8749 630465 639044 644969 649823 659153 668323 674933 681499 690791 701983 711055 716401 723332 729821 737324
8735 737324 746518 754651 763353 772787 782025 790424 798717 806291 815762 827841 838078 846711 852498 859440
8721 859440 866878 876604 887205 897012 906316 917803 927811 937206 945129 953619 964069 973324 984052
8708 984052 994631 1004877 1015890 1028823 1040614 1050575 1059595 1072959 1083647 1094995 1103071 1113875
8696A113875J2064J0989J4118J3705J4339J2974J2701J3790J3780J2940J1975
8685A257250J2452J6293J8247J5027J3551J2364J4178J2749J4993J6468J6194
8674A419766J6584J8812J7233J4262J5838J6836J9295J8734K0400J8078J6108
8663A611946K0632K1873J9824K0468J9583J9983K0842K4555K3144K2527K3082
8652A848459K4878K2497K3295K9083K6992K1912K4875K8799K5852K3251K9257
8641B129150K9190K7937K7010K9652L1926L0554L1030L2947L1002L0764L1131
8630B462293K9055L1648L5566L8362L6048L5330L6770L5493M0774M0846M0782
8619B862967M1762L8816L8085M4242M5515M5002M4711M5993M7452M8751M9077
$$ plain form
8696 1113875 1125939 1136928 1151046 1164751 1179090 1192064 1204765 1218555 1232335 1245275 1257250
8685 1257250 1269702 1285995 1304242 1319269 1332820 1345184 1359362 1372111 1387104 1403572 1419766
8674 1419766 1436350 1455162 1472395 1486657 1502495 1519331 1538626 1557360 1577760 1595838 1611946
8663 1611946 1632578 1654451 1674275 1694743 1714326 1734309 1755151 1779706 1802850 1825377 1848459
8652 1848459 1873337 1895834 1919129 1948212 1975204 1997116 2021991 2050790 2076642 2099893 2129150
8641 2129150 2158340 2186277 2213287 2242939 2274865 2305419 2336449 2369396 2400398 2431162 2462293
8630 2462293 2491348 2522996 2558562 2596924 2632972 2668302 2705072 2740565 2781339 2822185 2862967
8619 2862967 2904729 2943545 2981630 3025872 3071387 3116389 3161100 3207093 3254545 3303296 3352373
8608C352373M7719N0676N0011M9563N1138N3164N4845N4421N5993N9612N8275
8597C937790O0945O1428O1575O2513O3039O2969O5565O3514O6041O4898O4717
8586D634994O7811O6705O6259O5572O3395O4365O0963N8918N9619N2156M6130
8575E306887M1710L7826L6275L4823L7022K5793J3547O728l558j2695k6086m2277
8563E455995n5527p6937r8571j18771j41622j64794j93066k21714k51466k78069
8553C855458l08002l37586l67502l94078m21121m44403m63447m80771m92754n02261
8543c56467n08351n08692n03491m94240m78195m61357m40603m18434l91553l61650
8533d923033l32092l02909k73140k41631k14062j87831j60980j33470j10588r2113
$$ plain form
8608 3352373 3400092 3450768 3500779 3550342 3601480 3654644 3709489 3763910 3819903 3879515 3937790
8597 3937790 3998735 4060163 4121738 4184251 4247290 4310259 4375824 4439338 4505379 4570277 4634994
8586 4634994 4702805 4769510 4835769 4901341 4964736 5029101 5090064 5148982 5208601 5260757 5306887
8575 5306887 5348597 5386423 5422698 5457521 5494543 5520336 5533883 5540611 5537053 5524358 5498272 5455995
8563 5455995 5400468 5323531 5224960 5106189 4964567 4799773 4606707 4384993 4133527 3855458
8553 3855458 3547456 3209870 2842368 2448290 2027169 1582766 1119319 638548 145794 -356467
8543 -356467 -864818 -1373510 -1877001 -2371241 -2849436 -3310793 -3751396 -4169830 -4561383 -4923033
8533 -4923033 -5255125 -5558034 -5831174 -6072805 -6286867 -6474698 -6635678 -6769148 -6879736 -6971849
8523f971849p5157n2460l8165k4248r975K768J2946K1970K8605L3337M0004M4183
8511f988041N1846N7816N9306O0513O1269O2736O5004O5857O6847O4667O5222
8500f306958O8527O8504O7013O6550O2879O3582O7204O4735O2894N9509O0627
8489e594934O1941O2364N8047N8220N4750N3920N3919N1439M9069N2770N2979
8478d985516N0305N1304M6826M3607M4591M6671M6333M2691M2541M3964M0882
8467d485801L8947M0681L8050L6262L6900L6976L5089L7942L8204L5383L0919
8456d080448L2152L3367L3672L0177K8539L0219K8674K7810K7270L1364K8127
8445c749077K4683K4922K6994K7361K3159K6284K5300K4024K1534K1925K2190
$$ plain form
8523 -6971849 -7047006 -7099466 -7137631 -7161879 -7171854 -7169086 -7156140 -7134170 -7105565 -7072228 -7032224 -6988041
8511 -6988041 -6936195 -6878379 -6819073 -6758560 -6697291 -6634555 -6569551 -6503694 -6436847 -6372180 -6306958
8500 -6306958 -6238431 -6169927 -6102914 -6036364 -5973485 -5909903 -5842699 -5777964 -5715070 -5655561 -5594934
8489 -5594934 -5532993 -5470629 -5412582 -5354362 -5299612 -5245692 -5191773 -5140334 -5091265 -5038495 -4985516
8478 -4985516 -4935211 -4883907 -4837081 -4793474 -4748883 -4702212 -4655879 -4613188 -4570647 -4526683 -4485801
8467 -4485801 -4446854 -4406173 -4368123 -4331861 -4294961 -4257985 -4222896 -4184954 -4146750 -4111367 -4080448
8456 -4080448 -4048296 -4014929 -3981257 -3951080 -3922541 -3892322 -3863648 -3835838 -3808568 -3777204 -3749077
8445 -3749077 -3724394 -3699472 -3672478 -3645117 -3621958 -3595674 -3570374 -3546350 -3524816 -3502891 -3480701
8434c480701K1079K1457K2638K1424K1977K2264K0281J8191J8288K1838J7560
8423c253704J9114K1545K4357J6889K0325K2962J8300J2331R339P461R918J1735
8411c059428J3304J6632J8490J6582J8738K1786J7451J3913J5471J7657J7305
8400b872099J7108J6012J3248J2561J1995J2518J4005J4761J3251J3737J3383
8389b719520J5083J3042J1290J3347J6246J2625J0541J4043J5469J1975J1408
8378b574451R903J1739J1813R518J2097J2483R309R111J0719J0662R206Q009J0402
8365b439480J0760J1465R699J0731R840Q080J1034J2466R140O413Q710J0441R322
8352b311379O709N666O634P209J1303J0289J0189R732P779N144Q525P573R290
$$ plain form
8434 -3480701 -3459622 -3438165 -3415527 -3394103 -3372126 -3349862 -3329581 -3311390 -3293102 -3271264 -3253704
8423 -3253704 -3234590 -3213045 -3188688 -3171799 -3151474 -3128512 -3110212 -3097881 -3088542 -3081081 -3071163 -3059428
8411 -3059428 -3046124 -3029492 -3011002 -2994420 -2975682 -2953896 -2936445 -2922532 -2907061 -2889404 -2872099
8400 -2872099 -2854991 -2838979 -2825731 -2813170 -2801175 -2788657 -2774652 -2759891 -2746640 -2732903 -2719520
8389 -2719520 -2704437 -2691395 -2680105 -2666758 -2650512 -2637887 -2627346 -2613303 -2597834 -2585859 -2574451
8378 -2574451 -2564548 -2552809 -2540996 -2531478 -2519381 -2506898 -2497589 -2488478 -2477759 -2467097 -2457891 -2449882 -2439480
8365 -2439480 -2428720 -2417255 -2407556 -2396825 -2386985 -2378905 -2367871 -2355405 -2346265 -2339852 -2331142 -2320701 -2311379
8352 -2311379 -2304670 -2299004 -2292370 -2285161 -2273858 -2263569 -2253380 -2243648 -2235869 -2230725 -2222200 -2214627 -2205337
8339b205337P987N081O112P684P895P762O074O013P348Q957P764P587M894P617
8325b106562N144P824P159M218N132P398L579K935M292Q739P882P378N706P034
8311b022142L215N169N668O806N122N457M702P048O448K890O567M239O534N131
8297a947146O671K942M356M463O212O374N424O618N606O270K591L044M500M396
8283a877679N738P431L297L661P795Q230L811L661O249O011M156O228L460J548
8269a806403l963o419j851M332L060M963O467R477O482L439J801L356O110P859
8255a761290M155K140K763L424K793L752M368N449L573M370M196P80M933N958
8241a708636L964K519O798N393J297J507L095P301M460M940M464N236J258k438
$$ plain form
8339 -2205337 -2197350 -2192269 -2186157 -2178473 -2170578 -2162816 -2156742 -2150729 -2143381 -2134424 -2126660 -2119073 -2114179 -2106562
8325 -2106562 -2101418 -2093594 -2086435 -2082217 -2077085 -2069687 -2066108 -2063173 -2058881 -2050142 -2042260 -2034882 -2029176 -2022142
8311 -2022142 -2018927 -2013758 -2008090 -2001284 -1996162 -1990705 -1986003 -1978955 -1972507 -1969617 -1963050 -1958811 -1952277 -1947146
8297 -1947146 -1940475 -1937533 -1933177 -1928714 -1922502 -1916128 -1910704 -1904086 -1898480 -1892210 -1889619 -1886575 -1882075 -1877679
8283 -1877679 -1871941 -1864510 -1861213 -1857552 -1849757 -1841527 -1837716 -1834055 -1827806 -1821795 -1817639 -1811411 -1807951 -1806403
8269 -1806403 -1810366 -1816785 -1818636 -1814304 -1811244 -1806281 -1799814 -1790337 -1783855 -1780416 -1778615 -1775259 -1769149 -1761290
8255 -1761290 -1757135 -1754995 -1752232 -1748808 -1746015 -1742263 -1737895 -1732446 -1728873 -1724503 -1720307 -1719527 -1714594 -1708636
8241 -1708636 -1704672 -1702153 -1695355 -1689962 -1688665 -1687158 -1684063 -1676762 -1672302 -1667362 -1662898 -1657662 -1656404 -1658842
8227a658842p942o823K461L277N969N691L530O811M757L545M178L193M113K507
8213a623575L700J581K854K783L757K447K300J843L554N941K80K730M617L060
8199a582128N646M883L138K048M9K546K948O23L471P047N823N37M34R39K401K679
8183a536916K626M504P100K409M34K51K803K869J710J693K091K312M986L813K814
8168a494501L394O19n71M64J841M618N193K547M75L189L249M660K610j727k08
8153a464148m65L263N071K777Q35L604L841N46J06J686M258L948J309J36K443
8138a430790J824L530L412L023M38K360M900P32k331J055L217L230K588J812P66
8123a400234J137J959N185M830J215n50M27K895K193J125J969K121L407L873J277
$$ plain form
8227 -1658842 -1666784 -1673607 -1671146 -1667869 -1661900 -1656209 -1652679 -1645868 -1641111 -1637566 -1633388 -1630195 -1626082 -1623575
8213 -1623575 -1619875 -1618294 -1615440 -1612657 -1608900 -1606453 -1604153 -1602310 -1598756 -1592815 -1592535 -1589805 -1585188 -1582128
8199 -1582128 -1576482 -1571599 -1568461 -1566413 -1566364 -1563818 -1560870 -1560247 -1556776 -1549729 -1543906 -1543369 -1542935 -1541996 -1539595 -1536916
8183 -1536916 -1534290 -1529786 -1522686 -1520277 -1519843 -1519592 -1516789 -1513920 -1512210 -1510517 -1508426 -1506114 -1501128 -1497315 -1494501
8168 -1494501 -1491107 -1490488 -1491059 -1490595 -1488754 -1484136 -1478943 -1476396 -1475921 -1472732 -1469483 -1464823 -1462213 -1463940 -1464148
8153 -1464148 -1464613 -1461350 -1456279 -1453502 -1452667 -1449063 -1445222 -1444676 -1444570 -1442884 -1438626 -1434678 -1433369 -1433233 -1430790
8138 -1430790 -1428966 -1425436 -1422024 -1419001 -1418563 -1416203 -1411303 -1410571 -1412902 -1411847 -1408630 -1405400 -1402812 -1401000 -1400234
8123 -1400234 -1399097 -1397138 -1391953 -1387123 -1385908 -1386458 -1386031 -1383136 -1380943 -1379818 -1377849 -1375728 -1372321 -1368448 -1367171
8108a367171j856K180L576J418K540K354J397K396R98P99J353K725K874K174k050
8093a344293K701L882L293L30j727J509K736K862K286K182R09K399K002L24K910
8078a315695M16L380N113M444l13k497n18K866K304M41R04K665K552K490J925
8063a289523K849r63J697R12Q41M159L309K855K14P97J339J263M35J524K063l76
8047a266605J600J446P98P25M764M126M022M07j725P3K155M601K898J82q93J868
8031a239558J048o88J032M052K162PK168J332Q5j598M93L550K549J124J573q24
8015a221493r42N64Q03R69K276N93n80K413L865L266K350K381l32j288K479K328
7999a200348K555L442l42m39J670J0J082L298j280J513K964L045K292K249O98
$$ plain form
8108 -1367171 -1369027 -1366847 -1363271 -1361853 -1359313 -1356959 -1355562 -1353166 -1352168 -1351369 -1350016 -1347291 -1344417 -1342243 -1344293
8093 -1344293 -1341592 -1337710 -1334417 -1334087 -1335814 -1334305 -1331569 -1328707 -1326421 -1324239 -1323330 -1320931 -1318929 -1318605 -1315695
8078 -1315695 -1315279 -1311899 -1306786 -1302342 -1302655 -1305152 -1305670 -1302804 -1300500 -1300059 -1299155 -1296490 -1293938 -1291448 -1289523
8063 -1289523 -1286674 -1287637 -1285940 -1285028 -1284187 -1280028 -1276719 -1273864 -1273650 -1272853 -1271514 -1270251 -1269816 -1268292 -1266229 -1266605
8047 -1266605 -1265005 -1263559 -1262761 -1262036 -1257272 -1253146 -1249124 -1248717 -1250442 -1250369 -1248214 -1243613 -1240715 -1240533 -1241426 -1239558
8031 -1239558 -1238510 -1239198 -1238166 -1234114 -1231952 -1231945 -1229777 -1228445 -1228360 -1229958 -1229465 -1225915 -1223366 -1222242 -1220669 -1221493
8015 -1221493 -1222435 -1221871 -1221068 -1220099 -1217823 -1217230 -1217810 -1215397 -1211532 -1208266 -1205916 -1203535 -1203867 -1205155 -1202676 -1200348
7999 -1200348 -1197793 -1194351 -1194693 -1195132 -1193462 -1193452 -1192370 -1189072 -1190352 -1188839 -1185875 -1182830 -1180538 -1178289 -1177591
7984a177591k535o01K800R14k980q92R36K007l89j01k28K088N386J985K95L62
7968a168544L116J274O22J012K254L941q59j098k95R35L358K811P93P34M41J077
7952a148428j438M69K641N32J485n90R22J482K097L343J68J067k05J901J442p84
7936a133896J527J323j05K23J32j637K156O36L337J887l45L57J645l47N58J107
7920a121442K347K226J377O8L726O02P72P18K87J258O5K77K290L322K824j230
7904a100513n83Q73K518k18j588J867M01L848N43J302P75k072q33N82J020K061
7888a090017K515K620J347J613J286j244r61J771J214K398K422K394P38J169J009
7873a069726J717P12M46k60L9J35J415J72m27J84O9p57R32L671J581J230M85p4
$$ plain form
7984 -1177591 -1180126 -1180727 -1177927 -1177013 -1179993 -1180885 -1179949 -1177942 -1178331 -1178432 -1178660 -1176572 -1171186 -1169201 -1168906 -1168544
7968 -1168544 -1165428 -1164154 -1163532 -1162520 -1160266 -1156325 -1157184 -1158282 -1158577 -1157642 -1154284 -1151473 -1150680 -1149946 -1149505 -1148428
7952 -1148428 -1149866 -1149397 -1146756 -1146224 -1144739 -1145329 -1144407 -1142925 -1140828 -1137485 -1137317 -1136250 -1136455 -1134554 -1133112 -1133896
7936 -1133896 -1132369 -1131046 -1131151 -1130928 -1130796 -1132433 -1130277 -1129641 -1126304 -1124417 -1124762 -1124405 -1122760 -1123107 -1122549 -1121442
7920 -1121442 -1119095 -1116869 -1115492 -1115424 -1111698 -1111096 -1110324 -1109606 -1109319 -1108061 -1107996 -1107719 -1105429 -1102107 -1099283 -1100513
7904 -1100513 -1101096 -1100223 -1097705 -1097923 -1099511 -1097644 -1097243 -1093395 -1092852 -1091550 -1090775 -1092847 -1093680 -1093098 -1092078 -1090017
7888 -1090017 -1087502 -1084882 -1083535 -1081922 -1080636 -1081880 -1082841 -1081070 -1079856 -1077458 -1075036 -1072642 -1071904 -1070735 -1069726
7873 -1069726 -1068009 -1067297 -1066851 -1067111 -1067072 -1066937 -1065522 -1065350 -1065777 -1065593 -1065524 -1066281 -1065349 -1061678 -1060097 -1058867 -1058382 -1058456
7855a058456K931R36R88K420K304j866j586k178k039j834K445M651K985Q41m49
7840a047907l58L231O28R33N2J110L372K513J275J768o61r46l57L31R17L180L388
7823a027531L19l621l29p79J089J037P01J340P27O90P29p69L193K692J902k228
7807a020838j8J315J012M73j789n75O53L912J414j023N43L034M004L193J317j383
7791a004756p80k94l37J193N05P4j23J345j368J144K255R79j217j099K672o53
7775a000460R92J717K46J085Q61Q57Q34J829K276R38q30J368j699q1J531L7J651
7758i86848J461K118J142j345O69J67L36J290J488J680k083j386q71J139j94M755
7742i76482J814j434QO38R77J666J364J071J444N60K356K681j103r28p47N09M10
$$ plain form
7855 -1058456 -1055525 -1054589 -1053601 -1051181 -1048877 -1050743 -1052329 -1054507 -1056546 -1058380 -1055935 -1051284 -1048299 -1047458 -1047907
7840 -1047907 -1048265 -1045034 -1044406 -1043473 -1043421 -1042311 -1038939 -1036426 -1035151 -1033383 -1034044 -1034990 -1035347 -1035016 -1034099 -1030919 -1027531
7823 -1027531 -1027212 -1030833 -1031162 -1031941 -1030852 -1029815 -1029114 -1027774 -1027047 -1026357 -1025628 -1026397 -1023204 -1020512 -1018610 -1020838
7807 -1020838 -1020856 -1019541 -1018529 -1018056 -1019845 -1020420 -1019767 -1015855 -1014441 -1015464 -1014921 -1011887 -1007883 -1004690 -1003373 -1004756
7791 -1004756 -1005536 -1005830 -1006167 -1004974 -1004469 -1004395 -1004518 -1003173 -1004541 -1003397 -1001142 -1000163 -1001380 -1002479 -999807 -1000460
7775 -1000460 -999468 -997751 -997505 -996420 -995559 -994702 -993868 -992039 -989763 -988825 -989655 -988287 -989986 -990067 -988536 -988499 -986848
7758 -986848 -985387 -983269 -982127 -983472 -982803 -982636 -982300 -981010 -979522 -977842 -979925 -981311 -982182 -981043 -981237 -976482
7742 -976482 -974668 -976102 -976094 -975456 -974479 -972813 -971449 -970378 -968934 -968374 -966018 -963337 -964440 -965368 -966115 -965606 -965196
7725i65196l787k05K593Q27J357O87J840j322k21N74J844n38j13L05K456J549
7709i57350o0K84K755J878k99j180L794K516m78j543n56J839J304l2r74K867J424
7692i43811Q22r8j43Q44J545j809l02j481L106K395K46q71q36M03J060K349P50
7675i35831J10J772n22Q97J737j201n09J901K782N89j514J092N20m81K19K941
7659i25498m42O6j805j003K031M172K174O75o95j644k373J320Q34m77Q68M073
7643i17724K813P48o55q81K472K055rj570r20r15K723J592J038L80L299J45j039
7626i06448J126l17o63K43L061Q59N28K67j013O69P47k151M77L313M009K88j93
7609h95198k67K450J19j968l058j881n28K380L288J200J880J989J159K63k0l33
$$ plain form
7725 -965196 -968983 -969188 -966595 -965768 -964411 -963724 -961884 -963206 -963427 -962853 -961009 -961547 -961660 -961355 -958899 -957350
7709 -957350 -957410 -957126 -954371 -952493 -952792 -953972 -950178 -947662 -948140 -949683 -950239 -948400 -947096 -947128 -948102 -945235 -943811
7692 -943811 -942989 -943087 -943230 -942386 -940841 -942650 -942952 -944433 -941327 -938932 -938686 -939557 -940393 -939990 -938930 -936581 -935831
7675 -935831 -935721 -933949 -934471 -933574 -931837 -933038 -933547 -931646 -928864 -928275 -929789 -928697 -928177 -928658 -928439 -925498
7659 -925498 -925940 -925874 -927679 -928682 -926651 -922479 -920305 -919630 -920325 -921969 -924342 -923022 -922188 -922665 -921797 -917724
7643 -917724 -914911 -914163 -914818 -915699 -913227 -911172 -911181 -912751 -913671 -914586 -911863 -910271 -909233 -908853 -905554 -905409 -906448
7626 -906448 -905322 -905639 -906302 -906059 -902998 -902139 -901611 -901344 -902357 -901688 -900941 -903092 -902615 -899302 -895293 -895005 -895198
7609 -895198 -895465 -893015 -892896 -894864 -897922 -899803 -900331 -897951 -894663 -893463 -891583 -889594 -888435 -888172 -888192 -888525
7593h88525j405j89l04m96O34j67J809J22L23M96L336K973J358J033l437k597
7577h85036p18J939J416K355K560O34k147l135j505O70J132J929N178P83k008
7562h75953K5Q09k930J621L255P41K91l21j13J161N43K207r13o68K099K182m81
7545h66445j39m57n63K508J75j010O10j472l90j807N66J372K018M485J466j496
7529h60579m0J910K085J072l75j180o33r85m23J386O31M32J394J675J81j89q0
7512h53718m55j639J714R42J30J456O97J300P6P91j89J60L318J786J180J05j417
7495h43763j703K352J414k18L402O31q4J798k641l097R44j149p08J333J584M72
7479h39433K29K77O40J958Q26p18j156j870J260J435m07Q35M09Q80k503k442J878
$$ plain form
7593 -888525 -889930 -890119 -890423 -890919 -890285 -890452 -888643 -888521 -888198 -887702 -884366 -881393 -880035 -879002 -882439 -885036
7577 -885036 -885754 -883815 -882399 -880044 -877484 -876850 -878997 -882132 -883637 -882967 -881835 -879906 -874728 -873945 -875953
7562 -875953 -875928 -875119 -878049 -876428 -873173 -872432 -872141 -872462 -872575 -871414 -870871 -868664 -869577 -870245 -868146 -865964 -866445
7545 -866445 -866584 -867041 -867604 -865096 -864921 -865931 -865321 -866793 -867183 -868990 -868424 -867052 -865034 -860549 -859083 -860579
7529 -860579 -860619 -858709 -856624 -855552 -855927 -857107 -857740 -858725 -859148 -857762 -857131 -856699 -855305 -853630 -853449 -853638 -853718
7512 -853718 -854173 -855812 -854098 -853156 -853026 -851570 -850873 -849573 -849497 -848706 -848895 -848735 -845417 -843631 -842451 -842346 -843763
7495 -843763 -845466 -843114 -841700 -841918 -838516 -837885 -837969 -836171 -838812 -841909 -840965 -842114 -842822 -841489 -839905 -839433
7479 -839433 -839204 -838927 -838287 -836329 -835503 -836221 -837377 -839247 -837987 -836552 -836959 -836124 -835715 -834835 -837338 -839780 -837902
7462h37902K825M326L235J156k09j235J85O48L98j740Q4K063J028o72m77Ko78
7445h26963j728K92K791L182L491P15j803k308n05K587q3P25K71J732R30R50q6
7428h15810m67J760j512l65O05J787Q55o34m42k407J141K382r28O68L295k24l91
7411h10687K126K03r34K81q09j873p71J038K008m00P10J841k96Q88J341J109k353
7394h06578K76L838K134K62j11p43j038n04O85J160P46j458j215P39K651J282
7378g97874J672K39k051J636o05R09j14M93J46o50oJ87n52J218M21j306r41O16
7360g96562J042K169j122k107L204K784Q94M01M64M97l39L26K717k570j281J167
7344g88316n84J592J994k49q92j078O3K032j827j628J425K878M99k695J773N54
$$ plain form
7462 -837902 -835077 -830751 -827516 -826360 -826569 -827804 -827619 -826971 -826573 -828313 -828229 -826166 -825138 -825810 -826287 -826285 -826963
7445 -826963 -828691 -828399 -825608 -822426 -818935 -818220 -820023 -822331 -822836 -820249 -820332 -819607 -819336 -817604 -816674 -815724 -815810
7428 -815810 -816277 -814517 -816029 -816394 -815789 -814002 -813147 -813781 -814223 -816630 -815489 -813107 -814035 -813367 -810072 -810296 -810687
7411 -810687 -808561 -808358 -809292 -809011 -809820 -811693 -812464 -811426 -809418 -809818 -809108 -807267 -807563 -806675 -805334 -804225 -806578
7394 -806578 -806302 -802464 -800330 -800068 -800179 -800922 -801960 -802464 -801779 -800619 -799873 -801331 -802546 -801807 -799156 -797874
7378 -797874 -796202 -795963 -798014 -796378 -796983 -796074 -796188 -795695 -795549 -796199 -796205 -796018 -796570 -795352 -794931 -796237 -797178 -796562
7360 -796562 -795520 -793351 -794473 -796580 -793376 -790592 -789698 -789297 -788833 -788336 -788675 -788349 -785632 -788202 -789483 -788316
7344 -788316 -788900 -787308 -785314 -785563 -786455 -787533 -787470 -785438 -787265 -788893 -787468 -784590 -784091 -786786 -785013 -784459
7328g84459N27K368J889J405Q34j95n22m95j626p02J333K584q66J945N59j130
7312g76551m098o74L401M282J634j452J076J688k77k835K62J903M77n32q4j951
7296g73731k298O9J454L53L3J410n03K636J588K570K488J180j869N32O88j297
7280g64697r84Q62L464J244q6l143j532O96L420J32l052P02P1K489K879m07k753
7263g60695Q57K91O54O19j373k214J238K799O60J220J128k974j256j431N14J581
7247g58382J308N22J720J160P04K42q77p17j69K15L06J570K64J539n49j13n26
7230g51783J834q32k364J998J5K4J071J429J71J163O77r25k406o77K520l2J326
7213g46791K18P53M70J7j30R63M14k9K076K651M40j703j947k59L953J049k03k618
$$ plain form
7328 -784459 -783932 -781564 -779675 -778270 -777436 -777631 -778153 -778648 -780274 -780976 -779643 -777059 -777925 -775980 -775421 -776551
7312 -776551 -780649 -781323 -777922 -773640 -772006 -773458 -772382 -770694 -770971 -773806 -773544 -771641 -771164 -771696 -771780 -773731
7296 -773731 -776029 -775960 -774506 -774153 -774120 -772710 -773213 -770577 -768989 -766419 -763931 -762751 -764620 -764088 -763400 -764697
7280 -764697 -765681 -764819 -761355 -760111 -760197 -763340 -764872 -764176 -760756 -760624 -763676 -762974 -762903 -760414 -757535 -757942 -760695
7263 -760695 -759838 -759547 -758893 -758274 -759647 -761861 -760623 -757824 -757164 -755944 -754816 -757790 -759046 -760477 -759963 -758382
7247 -758382 -757074 -756552 -754832 -753672 -752968 -752726 -753603 -754320 -754489 -754274 -753968 -752398 -752134 -750595 -751144 -751257 -751783
7230 -751783 -749949 -750781 -753145 -751147 -751132 -751108 -750037 -748608 -748437 -747274 -746597 -747522 -749928 -750605 -748085 -748117 -746791
7213 -746791 -746573 -745820 -745350 -745333 -745463 -744500 -744086 -744115 -742039 -739388 -738948 -740651 -742598 -742857 -738904 -737855 -738058 -740676
7195g40676j38P12j99J240M75j21J126J80k86j737R09J362K91j156p23j845J858
7178g38728O08J141Q09L356J003q87k12J919o58k695R4N02J305R44K852J929j4
7161g26732n22Q36q4p3j027l84J975L236j416r20j054O29k176j379J158K416L71
7144g25146n26L51k56l6K96K061J568Q73J578j026k169j66K911L25L908K264m707
7127g17897k604K350j29j549J011K164P80l633l904M87k29J655R09r44l30L949
7111g17914j168q03j97O99J230J053J840K14K95J534M42J292k35K88j159j614
7095g14203J52R5j318l38q84J391J125K70R44J089J839j371j32K22j511R9n29
7078g13060J590J110K93J407J059j684O1J085K210L69J179j168r69J072R78J025
$$ plain form
7195 -740676 -740814 -740102 -740301 -739061 -738586 -738707 -737581 -737401 -737687 -739424 -738515 -737153 -736862 -738018 -738741 -740586 -738728
7178 -738728 -738120 -736979 -736170 -732814 -731811 -732698 -732910 -730991 -731649 -734344 -734250 -733748 -732443 -731499 -728647 -726718 -726732
7161 -726732 -727254 -726418 -726502 -726575 -727602 -727986 -726011 -722775 -724191 -725111 -726165 -725536 -727712 -729091 -727933 -725517 -725146
7144 -725146 -725672 -725321 -725577 -725613 -725317 -723256 -721688 -720815 -719237 -720263 -722432 -722598 -719687 -719362 -715454 -713190 -717897
7127 -717897 -720501 -718151 -718280 -719829 -718818 -716654 -715874 -719507 -723411 -722924 -723153 -721498 -720589 -721533 -721863 -717914
7111 -717914 -719082 -719885 -720082 -719383 -718153 -717100 -715260 -715046 -714751 -713217 -712775 -711483 -711718 -711430 -712589 -714203
7095 -714203 -714051 -713956 -715274 -715612 -716496 -715105 -713980 -713710 -712766 -711677 -709838 -711209 -711341 -711119 -712630 -712531 -713060
7078 -713060 -711470 -710360 -710067 -708660 -707601 -709285 -709224 -708139 -705929 -705560 -704381 -705549 -706518 -705446 -704468 -703443
7062g03443J520K01k78k929J843N69j03J933o3l180L22J514K032k5o93j904J079
7045g01605K398J509n71j82j059J73P64P81q38k320M782K385l04j466j877P69
7029f96661k25R38K171j142J465L540j436k023j108o21m22K00R58J991M31L51
7013f91593L9P33M55J594P25j191n25J48J509J025J132j200l68o18N75J452J662
6996f84446j4J914j852m007k895N45Q98L4J913K493K128j856k185J957J388M92
6980f83493r79R95J515Q75K098J296j811k113J196J71j500q18k8K4m42J216J525
6963f80273J6R7J269J434j239j168OL96J255L06Q72J260J257N11j133K753N05
6946f71876m45j206J194K996Q71j242j166J645o81l98l66J77j245K540N84j761
$$ plain form
7062 -703443 -701923 -701722 -702000 -704929 -703086 -702517 -702620 -700687 -700750 -703930 -703608 -702094 -700062 -700087 -700780 -702684 -701605
7045 -701605 -699207 -697698 -698269 -698451 -699510 -699337 -698573 -697792 -698630 -700950 -696168 -693783 -694087 -695553 -697430 -696661
7029 -696661 -696886 -695948 -693777 -694919 -693454 -689914 -691350 -693373 -694481 -695102 -695524 -695324 -694366 -692375 -691944 -691593
7013 -691593 -691554 -690821 -690366 -688772 -688047 -689238 -689763 -689615 -688106 -687081 -685949 -687149 -687517 -688135 -687560 -686108 -684446
6996 -684446 -684460 -682546 -684398 -688405 -691300 -690755 -689857 -689823 -687910 -685417 -683289 -685145 -687330 -685373 -683985 -683493
6980 -683493 -684472 -683477 -681962 -681087 -678989 -677693 -679504 -681617 -680421 -680250 -681750 -682568 -682596 -682572 -683014 -681798 -680273
6963 -680273 -680257 -680160 -678891 -677457 -678696 -679864 -679858 -679462 -678207 -677901 -677029 -675769 -674512 -674001 -675134 -672381 -671876
6946 -671876 -672321 -673527 -672333 -669337 -668466 -669708 -670874 -669229 -669910 -670308 -670674 -670497 -671742 -669202 -668618 -670379
6930f70379Q8j707j89J936p3o80j123J663J046J227j340L09k62L91l68J66M09
6913f68886k34L930K19K852M96l432q13J651J478R19k291j180J57k84J708R12
6897f62798k07n42l37j395j673L147K065k771o63K240K82j55k40p36K129K430
6881f59224L23k091k26K291O57J56P9n38j393J978K244J160j720j533o30l758
6865f62225P75M349K802k478K104K545j188j160J158J79m81j520j686J15j14J07
6849f56718j552l584K045K513L268L94j059N08N44K565J588k279j321n92M75K21
6833f52984n06n45N72J944J001J198J892J262o90l99L32O67J229J256l255k633
6817f49659L47K755K137j045r64Q65J187R25m33j066oJ405p09k228K091r34j163
$$ plain form
6930 -670379 -670291 -671998 -672187 -670251 -670324 -671004 -672127 -670464 -669418 -668191 -669531 -669222 -669484 -669093 -669461 -669295 -668886
6913 -668886 -669120 -665190 -664971 -662119 -661623 -665055 -665868 -664217 -662739 -661820 -664111 -665291 -665134 -665418 -663710 -662798
6897 -662798 -663005 -663547 -663884 -665279 -666952 -663805 -661740 -664511 -665174 -662934 -662652 -662807 -663047 -663783 -661654 -659224
6881 -659224 -658901 -660992 -661218 -658927 -658270 -658114 -658035 -658573 -659966 -657988 -655744 -654584 -656304 -657837 -658467 -662225
6865 -662225 -661450 -657101 -654299 -656777 -654673 -652128 -653316 -654476 -653318 -653139 -653620 -655140 -656826 -656711 -656825 -656718
6849 -656718 -658270 -661854 -659809 -657296 -654028 -653634 -654693 -654185 -653641 -651076 -649488 -651767 -653088 -653680 -653205 -652984
6833 -652984 -653490 -654035 -653463 -651519 -650518 -649320 -647428 -646166 -646856 -647255 -646923 -646256 -645027 -643771 -647026 -649659
6817 -649659 -649312 -646557 -644420 -645465 -646429 -645564 -644377 -643452 -643885 -644951 -644957 -643552 -644261 -646489 -644398 -645332 -646495
6800f46495L009k095O51K557K857n15J222J029n92m868n86L162K678M07P82R73
6784f35824L73K57j148k394j520q67J146Q46j732P90J351K320K73j870p3j292
6768f39364O0K833j299k830n67r87k16l06r69P48L506N56K258M251K08k859J187
6751f33790J198N63O72o37P90m5k299k303N23O38K369K019K07q33J62k389j0K18
6733f32947R48L93j313k126J310J497J141J734j105L79J17k533l31M7j334J727
6717f32396K036l01k105j270K125L017n81j672L49J716J539J502J413J872j792
6702f24548j197J043k421O00p42o73R30m27O83M32K140J352j222j770q32K09P84
6685f25659M187R88j131j291J047l22P01j75P06P72J208J824k57K42k02k916J729
$$ plain form
6800 -646495 -643486 -645581 -644930 -642373 -639516 -640031 -638809 -637780 -638372 -643240 -643826 -640664 -637986 -637579 -636797 -635824
6784 -635824 -635451 -635194 -636342 -638736 -640256 -641123 -639977 -639131 -640863 -640073 -638722 -636402 -636129 -637999 -638072 -639364
6768 -639364 -639304 -636471 -637770 -640600 -641167 -642154 -642370 -642676 -643645 -642897 -639391 -638835 -636577 -632326 -632118 -634977 -633790
6751 -633790 -632592 -632029 -631357 -631994 -631204 -631249 -633548 -635851 -635328 -634690 -632321 -630302 -630095 -630928 -630766 -633155 -633165 -632947
6733 -632947 -631999 -631606 -632919 -635045 -633735 -632238 -631097 -629363 -630468 -630089 -629972 -632505 -632836 -632789 -634123 -632396
6717 -632396 -630360 -630661 -632766 -634036 -631911 -628894 -629475 -631147 -630798 -629082 -627543 -626041 -624628 -622756 -624548
6702 -624548 -625745 -624702 -627123 -626523 -627265 -627938 -627008 -627435 -626752 -626320 -624180 -622828 -624050 -625820 -626652 -626443 -625659
6685 -625659 -621472 -620484 -621615 -622906 -621859 -622181 -621480 -621655 -620949 -620177 -618969 -617145 -617402 -617160 -617362 -620278 -618549
6668f18549K336P47j228K42K23j058j367R52K707j181J47M30J022K66n60Q34J923
6651f12114N88j378k249J272J508RJ603m017l695K652j334j154N29K552K667j764
6635f14325j672J554J77n26m8L23J90O14m61O45N90K680k064J20j376K126L116
6618f08337M5q18L524P74j367n34m52J07J736j289k133j153n8P9N57j483o90P2
6600f11420j77P00J270Q03l23P03O76j70r61r88k47K370R30K178L09K211r73l903
6582f07012J513n77J517J644L151k71k785j487J031J795O01j17j417j81l70n84
6566f03549j288m76j026J360K976J437L10J100K187K080N23Q78K1l723k047L52
6550e98885N29L155k51P91j857K99p0j110k673k14J768J45l30K738Q24k183P45
$$ plain form
6668 -618549 -616213 -615466 -616694 -616452 -616229 -617287 -618654 -617702 -614995 -616176 -616029 -615599 -614577 -614311 -614871 -614037 -612114
6651 -612114 -611526 -612904 -615153 -613881 -612373 -612364 -610761 -614778 -618473 -615821 -617155 -618309 -617780 -615228 -612561 -614325
6635 -614325 -615997 -614443 -614266 -614792 -614840 -614517 -614327 -613713 -614174 -613529 -612939 -610259 -612323 -612203 -613579 -611453 -608337
6618 -608337 -608292 -609110 -605586 -604812 -606179 -606713 -607165 -607058 -605322 -606611 -608744 -609897 -609955 -609876 -609319 -610802 -611492 -611420
6600 -611420 -611597 -610897 -609627 -608824 -609147 -608444 -607768 -607938 -608899 -609887 -610134 -607764 -606834 -604656 -604347 -602136 -603109 -607012
6582 -607012 -605499 -606076 -604559 -602915 -599764 -600035 -602820 -604307 -603276 -601481 -600880 -600997 -602414 -602595 -602965 -603549
6566 -603549 -604837 -605313 -606339 -604979 -602003 -600566 -600256 -599156 -596969 -594889 -594366 -593488 -593467 -597190 -599237 -598885
6550 -598885 -598356 -595201 -595452 -594661 -596518 -596219 -596289 -597399 -600072 -600286 -598518 -598373 -598703 -595965 -595141 -597324 -596579
6533e96579J385L05j092k93P42j322r89J773M89j508J063j677q88J574R06P2j643
6516e97682K670J465J173q70m11k427P27L522R66j04J016j147J394o39j707N57
6500e91497M50K169L09J012K569l752k922M10K265K068k57j783j991J235J526
6485e88189J265m33p70m72q49J896K426k49l117l473l86J412J843L205j00m38
6469e86429J351J078j725m00j298R87O85J86K517Q90q66J540q07K3j997k792L95
6452e86662L519N5j844J415J178K988K317J60j218j293n5j182M88j25J268p12
6436e79703M95O30l99J378p4o25k270J409R34O31n74j611k65K751k362j547O40
6419e80562N36M6m80L44k37J558J38k561n86J433l04j589M38J560m4J163J82q13
$$ plain form
6533 -596579 -595194 -594889 -595981 -596274 -595532 -596854 -597843 -596070 -595581 -597089 -596026 -597703 -598591 -597017 -596111 -596039 -597682
6516 -597682 -595012 -593547 -592374 -593244 -593655 -596082 -595355 -591833 -590867 -590971 -589955 -591102 -589708 -590347 -592054 -591497
6500 -591497 -591047 -588878 -588569 -587557 -584988 -588740 -591662 -591252 -588987 -586919 -587176 -588959 -590950 -589715 -588189
6485 -588189 -586924 -587357 -588127 -588599 -589448 -587552 -585126 -585375 -588492 -591965 -592351 -590939 -589096 -585891 -585991 -586429
6469 -586429 -585078 -584000 -585725 -586125 -587423 -586436 -585751 -585565 -583048 -582158 -583024 -581484 -582291 -582268 -584265 -587057 -586662
6452 -586662 -583143 -583088 -584932 -583517 -582339 -579351 -577034 -576874 -578092 -579385 -579440 -580622 -580134 -580259 -578991 -579703
6436 -579703 -579208 -578578 -578977 -577599 -577673 -578298 -580568 -579159 -578225 -577594 -578168 -579779 -580044 -577293 -579655 -581202 -580562
6419 -580562 -580026 -579980 -580460 -580116 -580353 -578795 -578657 -581218 -581804 -580371 -580675 -582264 -581826 -580266 -580310 -579147 -578965 -579778
6401e79778j978L171L854J874K291J688l50k00J843L664R00o30k538l604k524
6386e72317j121K24K63K765J482j889j064J493k010r99Q96J132J795j716n98m85
6370e72149J384j660k112O44M22O40r93P48nj898J410K087K619J401j037J196
6354e67303j065j78k129j722J777L196P28j218j27j69j789n08J87J703P79j546
6338e69384m51N96q40J13j65m83J828J161j184J127L76J708m75q03M74J345K79
6321e64778j997J231J786K715J13q93j03J29k175j482n29J329K895J21k205j767
6305e65610n52K943M141J575j507J252J31p07j288r45r25p3J561J994L461J485
6289e53064l46l799k213J42L554K147k662o85L55k701j724J147J225q00K675k15
$$ plain form
6401 -579778 -581756 -578585 -574731 -572857 -570566 -568878 -569228 -569428 -567585 -563921 -563021 -563651 -566189 -569793 -572317
6386 -572317 -573438 -573214 -572951 -570186 -568704 -570593 -571657 -570164 -572174 -573173 -572277 -571145 -569350 -571066 -571664 -572149
6370 -572149 -570765 -572425 -574537 -573893 -573471 -572831 -573824 -573076 -573081 -574979 -573569 -571482 -568863 -567462 -568499 -567303
6354 -567303 -568368 -568546 -570675 -572397 -570620 -567424 -566696 -567914 -568041 -568210 -569999 -570507 -570320 -568617 -567838 -569384
6338 -569384 -569835 -569239 -570079 -569966 -570131 -570614 -568786 -567625 -568809 -567682 -567306 -565598 -566073 -566876 -566402 -565057 -564778
6321 -564778 -566775 -565544 -563758 -561043 -560930 -561823 -561926 -561797 -563972 -565454 -565983 -564654 -561759 -561638 -563843 -565610
6305 -565610 -566162 -563219 -559078 -557503 -559010 -557758 -557627 -558334 -559622 -560567 -561492 -561565 -560004 -558010 -554549 -553064
6289 -553064 -553410 -557209 -559422 -559280 -555726 -553579 -556241 -556926 -556571 -559272 -560996 -559849 -558624 -559424 -556749 -556964
6273e56964l86k16O25K632R72k80J931k170j798m35Q72L838J199M80j0Q43q38
6256e49705k025q04Q3L96j682J77o72j46l29M91L613K905k3j223j412l1k933n57
6238e53877k38k943m97j024K988J291m66K613K663k60L395q49k563J013J88l031
6222e51597Q90l84m124J815K459J102p24j068J086J156J074J687J553k286l923
6207e51284L37L420M73J165p30O03n34j58j613p32p80J675L07p6J490m03r69j083
6189e48892N8k341j680J253O94N06K835k31j837J923J990n40n7R53K70P61L08
6172e44027j739j071n88K402K178J636r50q26k8J001L01R65p26j163j080k965
6156e46680J371K905J339j170j717K475N570K902k488K29K014J22o39j876k650
$$ plain form
6273 -556964 -557350 -557566 -556941 -554309 -553337 -553617 -551686 -553856 -555654 -556089 -555217 -551379 -550180 -549700 -549710 -548867 -549705
6256 -549705 -551730 -552534 -552451 -552055 -553737 -553560 -554232 -554378 -554707 -554216 -550603 -547698 -547721 -548944 -550356 -550387 -553320 -553877
6238 -553877 -554115 -557058 -557555 -558579 -555591 -554300 -554766 -552153 -549490 -549750 -546355 -547204 -549767 -548754 -548566 -551597
6222 -551597 -550707 -551091 -555215 -553400 -550941 -549839 -550563 -551631 -550545 -549389 -548315 -546628 -545075 -547361 -551284
6207 -551284 -550947 -547527 -547054 -545889 -546619 -546016 -546550 -546708 -548321 -549053 -549833 -548158 -547851 -547927 -546437 -546840 -547809 -548892
6189 -548892 -548834 -551175 -552855 -551602 -550908 -550402 -547567 -547798 -549635 -547712 -545722 -546262 -546319 -545366 -545096 -544335 -544027
6172 -544027 -545766 -546837 -547425 -545023 -542845 -541209 -542159 -542985 -543013 -542012 -541711 -540746 -541472 -542635 -543715 -546680
6156 -546680 -545309 -542404 -541065 -542235 -543952 -541477 -535907 -533005 -535493 -535264 -533250 -533128 -533767 -535643 -538293
6141e38293P91J333q07q4J999P31j259j434J69L58M22J678j355M3N68m3j735j486
6123e38404N3n14k049P16J122J118K883J263j241J93m55n60J051L189K575j909
6107e30969j860l28k62j957j454J830K436p56J082P19o87j095j233O97q56J403
6091e33290Ok474j204L081J78K82K389m09J881K719N61j799r2m6j91p65j529j023
6073e31725j91J696p65J981p62J170L28l702m59o01j463K091L017M459R50q09
6057e24785l533K04j168K49R16N65p2j267m16L290O92J375j418j903O20n15j396
6040e28562j79j505J142k017p2K721K124J817J915j362j044J007J17n73O46r05
6024e24730J619j780j52K055J351k148j302m8L86R38K761j102k985J931K801L14
$$ plain form
6141 -538293 -537502 -536169 -536976 -537060 -535061 -534330 -535589 -537023 -536854 -536496 -536074 -534396 -535751 -535708 -535140 -535183 -536918 -538404
6123 -538404 -538351 -538865 -540914 -540198 -539076 -537958 -535075 -533812 -535053 -534860 -535315 -535875 -534824 -531635 -529060 -530969
6107 -530969 -532829 -533157 -533419 -535376 -536830 -535000 -532564 -533320 -532238 -531519 -532206 -533301 -534534 -533837 -534693 -533290
6091 -533290 -533284 -535758 -536962 -533881 -533703 -533421 -531032 -531441 -529560 -526841 -526280 -528079 -528171 -528217 -528408 -529173 -530702 -531725
6073 -531725 -531916 -530220 -530985 -529004 -529766 -528596 -528268 -531970 -532429 -533030 -534493 -532402 -529385 -524926 -523976 -524785
6057 -524785 -528318 -528114 -529282 -529033 -528117 -527552 -527624 -528891 -529307 -526017 -525325 -523950 -525368 -527271 -526651 -527166 -528562
6040 -528562 -528741 -530246 -529104 -531121 -531193 -528472 -526348 -524531 -522616 -523978 -525022 -524015 -523898 -524471 -523825 -524730
6024 -524730 -523111 -524891 -525043 -522988 -521637 -523785 -525087 -525135 -524749 -523811 -521050 -522152 -525137 -523206 -520405 -520091
6008e20091k81P08r21j116j182J3j883M264K367j887j416j291l27J644O53J22
5992e20624N57j250l39J479j529J165K38r95k490j112P91j9J549o8J154j62q30
5975e22485J680L579q60j878M98j163J373K449K847J100r16p78O44k26k665j031
5959e17832m31j107J883K441l08p81K425p28N49j228r73J552K33r16j096J204
5943e15113J528k116J79N61q69p19J495m12J614k8k938n41K217j58n30j636k35
5926e17701K360P96J26n71j990L911K140l38k907j327J835L567Q63k53l405M43
5910e12451K651j231j425J827J111m46J758P71k453j316J387K171q51j556N96
5895e09457J96N02k436K47M28r33J08K10M89Q89o27j156J543l27M07j158K05J444
$$ plain form
6008 -520091 -520372 -519664 -520585 -521701 -522883 -522870 -524753 -520489 -518122 -520009 -521425 -522716 -523043 -521399 -520746 -520624
5992 -520624 -520067 -521317 -521656 -520177 -521706 -520541 -520303 -521298 -523788 -524900 -524109 -524128 -522579 -522647 -521493 -521655 -522485
5975 -522485 -520805 -517226 -518086 -519964 -519466 -520629 -519256 -516807 -513960 -512860 -513776 -514554 -513910 -514136 -516801 -517832
5959 -517832 -518263 -519370 -517487 -515046 -515354 -516135 -513710 -514438 -513889 -515117 -516090 -514538 -514305 -515221 -516317 -515113
5943 -515113 -513585 -515701 -515522 -514961 -515830 -516549 -515054 -515466 -513852 -513880 -516818 -517359 -515142 -515300 -515830 -517466 -517701
5926 -517701 -515341 -514545 -514419 -514990 -516980 -513069 -510929 -511267 -514174 -515501 -513666 -510099 -509236 -509489 -512894 -512451
5910 -512451 -509800 -511031 -512456 -510629 -509518 -509964 -508206 -507435 -509888 -511204 -509817 -507646 -508497 -510053 -509457
5895 -509457 -509261 -508759 -511195 -510948 -510520 -511453 -511345 -511135 -510646 -509757 -510384 -511540 -509997 -510324 -509917 -511075 -510870 -509426
5877e09426j60k13o1o57j177K188K207j647j81J713L05j285J435J030K88k78m69
5860e06388O88J783j5K098J508k363l533l027J143k64L65O96M06N98p85J140N61
5843e05389j424K23J83K312J038k706L44L042N57m14k40p20k865l26r65Q16J402
5826e05132j4n46j072J281K435M46j449J852K385J585N17R04j572j425n20r65
5810e01290l86r58p46R54M008Q95j416J604J674O14p67J454j56j755l034j955
5794e01260K074J090m89m6mJ735J192J198l72l174k97J113n53K40m125j660M98
5777e02840L81R21j213o02K853J107K323J23j478R73j064n00K202j51j586p50
5761d99301J071J466n5N70O01n30o80o44l63q03p09M490P04J606n25j646m93m19
$$ plain form
5877 -509426 -509586 -509799 -509860 -510517 -511694 -509506 -507299 -508946 -509127 -507414 -507109 -508394 -506959 -505929 -505641 -505919 -506388
5860 -506388 -505700 -503917 -503932 -501834 -500326 -502689 -506222 -509249 -508106 -508370 -508005 -507309 -506903 -506305 -507090 -505950 -505389
5843 -505389 -506813 -506590 -506407 -504095 -503057 -505763 -505419 -502377 -501820 -502234 -502474 -503194 -506059 -506385 -507350 -506534 -505132
5826 -505132 -505146 -505692 -506764 -505483 -503048 -502602 -504051 -502199 -499814 -498229 -497712 -496808 -498380 -499805 -500325 -501290
5810 -501290 -501676 -502634 -503380 -502426 -498418 -497523 -498939 -497335 -495661 -495047 -495814 -494360 -494516 -496271 -499305 -501260
5794 -501260 -499186 -498096 -498585 -498631 -498635 -496900 -495708 -494510 -494882 -498056 -498353 -497240 -497793 -497553 -501678 -503338 -502840
5777 -502840 -502459 -501538 -502751 -503353 -500500 -499393 -497070 -496947 -498425 -497452 -498516 -499016 -496814 -496965 -498551 -499301
5761 -499301 -498230 -496764 -496819 -496249 -495648 -496178 -496858 -497502 -497865 -498668 -499377 -494887 -494183 -492577 -493102 -494748 -495241 -495660
5743d95660l444J431K676J642j676l25J079K226K270r05j131L56m25k382P04K341
5727d91223m13q51j378r15R93j516j598L504j21l69j433J52M339J101j33O87j04
5710d89278k04o08j486K38j43N1j201j642J626m70O03K235N15n34jJ773J987k70
5692d86809l578L52j028J12j540J425K379m46j835q88K057L107L466m52k607j102
5676d87387p51j165j460K401K953o35q65K058j355j942M87K75k407r49J300J071
5660d88371O62J277j914j110K68m77K82K635J169n55J43m60o70J828j87K635K228
5643d80617l043j528l45L66k777K250J618K061K553P22K37k835r77M3j615M79
5627d83408P13J664j208j064R10J784r7j036l12O54p89J99l88J655k03P67o50
$$ plain form
5743 -495660 -499104 -497673 -494997 -493355 -495031 -495356 -494277 -492051 -489781 -490686 -491817 -491461 -491886 -494268 -493564 -491223
5727 -491223 -491636 -492487 -493865 -494780 -493787 -495303 -496901 -493397 -493518 -493887 -495320 -495168 -490829 -489728 -489861 -489174 -489278
5710 -489278 -489482 -490090 -491576 -491338 -491481 -491430 -492631 -494273 -492647 -493117 -492514 -490279 -489764 -490298 -490299 -488526 -486539 -486809
5692 -486809 -490387 -490035 -491063 -490951 -492491 -491066 -488687 -489133 -490968 -491856 -489799 -486692 -483226 -483678 -486285 -487387
5676 -487387 -488138 -489303 -490763 -488362 -485409 -486044 -486909 -484851 -486206 -488148 -487661 -487386 -489793 -490742 -489442 -488371
5660 -488371 -487709 -486432 -488346 -489456 -489188 -489665 -489383 -486748 -485579 -486134 -485991 -486451 -487121 -485293 -485480 -482845 -480617
5643 -480617 -483660 -485188 -485533 -485167 -487944 -485694 -484076 -482015 -479462 -478740 -478503 -481338 -482315 -482272 -483887 -483408
5627 -483408 -482695 -481031 -482239 -483303 -482393 -480609 -480706 -481742 -482054 -481400 -482189 -481990 -482378 -480723 -480926 -480159 -480809
5610d80809L87l9J217K151J324N16j10k061o15r05k348m16M29K751J208j534k030
5593d80884R84O84m92k598q30p04m05M76j88p33K326K827K861p36J030J731L62
5576d74289q7k125j005O09O2m81n12k70j521K568L454R42j939m92j86P77l140
5559d77635k877J065J717K879J298j269n17K095K902j316l128j554N3K452k648
5544d76483o76J74J460J592K100K58k179N82J184j437o6Q21p69j121N07K102j912
5527d73863j239J18k525J846J667K416n73k29l99J059J842k009j637M97J461J716
5511d69852k054k13N89N98M58j052k109o60L742J741j489k733o18J647J469j216
5495d71752J284l78M00K877j715k896K61J178J740K79k372k497J920L350K684
$$ plain form
5610 -480809 -480422 -480461 -479244 -477093 -475769 -475253 -475363 -477424 -478039 -478944 -481292 -481708 -481279 -478528 -477320 -478854 -480884
5593 -480884 -479900 -479216 -479708 -482306 -483136 -483840 -484245 -483769 -483957 -484690 -482364 -479537 -476676 -477412 -476382 -474651 -474289
5576 -474289 -474376 -476501 -477506 -476897 -476835 -477316 -477828 -478098 -479619 -477051 -473597 -472655 -474594 -475086 -475272 -474495 -477635
5559 -477635 -480512 -479447 -477730 -474851 -473553 -474822 -475339 -473244 -470342 -471658 -474786 -476340 -476287 -473835 -476483
5544 -476483 -477159 -476985 -475525 -473933 -471833 -471575 -473754 -473172 -471988 -473425 -473491 -472670 -473439 -474560 -474053 -471951 -473863
5527 -473863 -475102 -474984 -477509 -475663 -473996 -471580 -472153 -472382 -472781 -471722 -469880 -471889 -473526 -473029 -471568 -469852
5511 -469852 -471906 -472119 -471530 -470932 -470474 -471526 -473635 -474295 -470553 -468812 -470301 -473034 -473652 -472005 -470536 -471752
5495 -471752 -470468 -470846 -470446 -467569 -469284 -472180 -471919 -470741 -469001 -468722 -471094 -473591 -471671 -468321 -465637
5480d65637P90m4N76n36n33p47j976l692Q72K062J343J359J85j607q48M51j371
5463d69353N84J998J836J386r4k512k60J409J476M86n94k051L8P30K178l26J611
5446d61458k698r83N90J698m12j715J405J695n78j979m73l0r79r22K339K079n03
5429d62924j370O80J365R80l02j225o94n78p01J390K015K259M55j819j219L323
5413d58365K940r73j332j169J206q18o36P10O91j243j973j73L86l16r09L130K330
5396d56514j767j683j276L883K962j165j765k394k10j252n24O91N5P71q02K026
5380d58964K243K448j965j077l251j058K263M350J831j099j874K90R83N16J065
5365d53299o69l516k718N28j765L87K37K235P67M68j186n19J454J886j459k487
$$ plain form
5480 -465637 -464847 -464891 -464315 -464851 -465384 -466131 -468107 -471799 -470927 -468865 -467522 -466163 -465978 -467585 -468433 -467982 -469353
5463 -469353 -468769 -466771 -464935 -463549 -463643 -466155 -466415 -465006 -463530 -463044 -463638 -465689 -465651 -464921 -462743 -463069 -461458
5446 -461458 -464156 -465139 -464549 -462851 -463263 -464978 -463573 -461878 -462456 -464435 -464908 -464938 -465917 -466839 -464500 -462421 -462924
5429 -462924 -464294 -463614 -462249 -461269 -461571 -462796 -463490 -464068 -464769 -463379 -461364 -459105 -458650 -460469 -461688 -458365
5413 -458365 -455425 -456398 -457730 -458899 -457693 -458511 -459147 -458437 -457746 -458989 -460962 -461135 -460749 -461065 -461974 -458844 -456514
5396 -456514 -458281 -459964 -461240 -457357 -454395 -455560 -457325 -459719 -459929 -461181 -461705 -461014 -460959 -460188 -460990 -458964
5380 -458964 -456721 -454273 -456238 -457315 -460566 -461624 -459361 -455011 -453180 -454279 -456153 -455863 -454880 -454364 -453299
5365 -453299 -453968 -457484 -460202 -459674 -461439 -461052 -460815 -458580 -457813 -457345 -458531 -459050 -457596 -455710 -457169 -459656
5349d59656J403j167P74K448j700j075J055K206L45k50j213M78m73O78j132k21
5333d57500J68p49Q66p09J063P48n65j085n66J701R19p0J460j022R36K267J65
5316d51973k690j047K93J53O57j100J512M21r60n38j96o18M59J443k84J034J025
5299d52409M01K52J019j774q15L21J180J243J758n60m21J490j856Q21J287l29
5283d48392l862j386j72J057O30J85N13J23k93J569j821k32J77o17Q59J688n37
5266d50511R02L21j77j91J481J119n3j208r50L95q44Q07r24K86J308J63M89k16
5248d47803j246k70q00j167J547K303J909k62o50q5j075M82O94k587N92j01j292
5231d49811j190L996L917o97l149J175J812O0j843K35L97j779j285J852Q89J767
$$ plain form
5349 -459656 -458253 -459420 -458646 -456198 -457898 -458973 -457918 -455712 -455367 -455617 -456830 -456352 -456825 -456147 -457279 -457500
5333 -457500 -457332 -458081 -457215 -457924 -456861 -456113 -456678 -457763 -458329 -456628 -455709 -455779 -454319 -455341 -454405 -452138 -451973
5316 -451973 -454663 -455710 -455417 -455264 -454607 -455707 -454195 -453774 -454734 -455272 -455468 -456086 -455627 -454184 -454468 -453434 -452409
5299 -452409 -452008 -451756 -450737 -452511 -453326 -453005 -451825 -450582 -448824 -449384 -449805 -448315 -450171 -449350 -448063 -448392
5283 -448392 -452254 -453640 -453812 -452755 -452125 -451940 -451427 -451304 -451597 -450028 -451849 -452081 -451904 -452521 -451662 -449974 -450511
5266 -450511 -449609 -449288 -449465 -449656 -448175 -447056 -447109 -448317 -449267 -448872 -449716 -448909 -449833 -449547 -448239 -448076 -447587 -447803
5248 -447803 -449049 -449319 -450119 -451286 -449739 -447436 -445527 -445789 -446439 -446524 -447599 -447117 -446423 -449010 -448418 -448519 -449811
5231 -449811 -451001 -447005 -443088 -443785 -446934 -445759 -443947 -443887 -445730 -445495 -445098 -446877 -448162 -446310 -445421 -443654
5215d43654J329J57j487j044l5J94j594l169L45L350P50L11N10k41j267j80J00
5198d45625K61o87l35Q00q05J302J75m77k336r95K848R35j170L91j048L74J840
5181d44552k817K14R93p58k20J474J274K765N47k624k391J568K616K14K02j629
5165d43124j454j31J582K516N70R07k50P93P74k591j660N80O94j185J314P71J007
5148d38887m50J508p00o30j819q33Q31J570J336j91L89K818n03l102J214L162
5132d34287k787j608M94J971J368l58k878j118J871p92M33k164j638J472L000
5117d37021K590K483k48j321k21j586l826J498k76N8J549k00j28l47J790J969
5101d33237o75l881j610O09K015J388n16k100L00O30k593RL032n77k70j218j474
$$ plain form
5215 -443654 -442325 -442168 -443655 -444699 -444734 -444540 -446134 -449303 -448958 -445608 -444858 -444547 -444037 -444278 -445545 -445725 -445625
5198 -445625 -445364 -446051 -446386 -445586 -446391 -445089 -444914 -445391 -447727 -448722 -445874 -444939 -446109 -445718 -446766 -446392 -444552
5181 -444552 -447369 -447155 -446162 -446920 -447140 -445666 -444392 -441627 -441080 -443704 -446095 -444527 -441911 -441697 -441495 -443124
5165 -443124 -444578 -444709 -443127 -440611 -440041 -439134 -439384 -438591 -437817 -440408 -442068 -441488 -440794 -441979 -440665 -439894 -438887
5148 -438887 -439337 -437829 -438529 -439159 -440978 -441811 -440980 -439410 -438074 -438265 -437876 -435058 -435561 -438663 -437449 -434287
5132 -434287 -437074 -438682 -438188 -436217 -434849 -435207 -438085 -439203 -437332 -438124 -437691 -439855 -441493 -440021 -437021
5117 -437021 -434431 -431948 -432196 -433517 -433738 -435324 -439150 -437652 -437928 -437870 -436321 -436521 -436649 -436996 -435206 -433237
5101 -433237 -433912 -437793 -439403 -438794 -436779 -435391 -435907 -438007 -437707 -437077 -439670 -439661 -436629 -437206 -437476 -438694 -440168
5084d40168K625K838j554p0j263J240P56j465n21P33J52p91k320r33K316K306
5068d36119J010q06j44p81J859L249J43j4o03k61k148N54j144K31J233J374J198
5051d31169J08j502J482j059K33n12K678K233j282k553l064o12K163K135k80j42
5035d31143j531K353K070k73l432k016l43R0J84P13K29q5m01j91l53Q98l2J13
5017d33150J548J009r84k313o46K996M22l46o79M76K758r15p05l35J203R23K353
5000d26385O8k386q44J140L77K60J656k086J91M20k58k57k235j73J806O17o34
4983d28723M7o96J134n02j289J398J636J326P21j049J363j962k006J187J636k368
4967d28147J150R29K77j147r75Q18k32o12j346J500J854L28M96p99J004M32q83
$$ plain form
5084 -440168 -437543 -434705 -436259 -436329 -437592 -436352 -435596 -437061 -437582 -436849 -436697 -437488 -439808 -440741 -438425 -436119
5068 -436119 -435109 -435915 -436059 -436840 -434981 -431732 -431589 -431603 -432206 -432467 -434615 -434061 -435205 -434974 -433741 -432367 -431169
5051 -431169 -431061 -432563 -431081 -432140 -431907 -432419 -429741 -427508 -428790 -431343 -434407 -435019 -432856 -430721 -431001 -431143
5035 -431143 -432674 -430321 -428251 -428524 -431956 -433972 -434315 -434225 -434041 -433328 -433099 -433184 -433585 -433776 -434129 -433231 -433263 -433150
5017 -433150 -431602 -430593 -431577 -433890 -434536 -431540 -431118 -431464 -432143 -431667 -428909 -429824 -430529 -430864 -429661 -428738 -426385
5000 -426385 -426317 -428703 -429547 -428407 -428030 -427770 -426114 -428200 -428009 -427589 -427847 -428104 -430339 -430512 -428706 -428089 -428723
4983 -428723 -428676 -429372 -428238 -428740 -430029 -428631 -426995 -425669 -424948 -425997 -424634 -426596 -428602 -427415 -425779 -428147
4967 -428147 -426997 -426068 -425791 -426938 -427913 -427095 -427327 -427939 -429285 -427785 -425931 -425603 -425107 -425906 -424902 -424470 -425353
4950d25353J059j219N31j165K07r9j203P32l6j336l79K061l82l55r02O93JJ340
4932d25805j199l55K941J211o28j94J26Q07l458K359M180L42l086l970q31L111
4916d24449pj924K68K031R88K25Q81K885J804L94O32o13j218J70l390k758j048
4899d25129j379oN86K878l0K61J248R60m92q88l015K096J477o19K58N60J269j135
4881d21100j479J069K325K363j69j799mN67J635J076k802p20P87l205k874L230
4865d21100K17r45J004O55j024R29K15n98J319j708j450K336O1P65J334J647P63
4848d15580j76k723k486J841J699j443k960o99N79K751o67n16J106N42o67o9J998
4831d17470Q14R48o8L92L37J869M165O10l322j615O12o26k266k72M306J207p02
$$ plain form
4950 -425353 -424294 -425513 -424982 -426147 -425940 -426039 -427242 -426510 -426546 -427882 -428261 -426200 -426582 -426937 -427839 -427146 -427145 -425805
4932 -425805 -427004 -427359 -424418 -423207 -423835 -424029 -423903 -423096 -426554 -424195 -420015 -419673 -422759 -426729 -427560 -424449
4916 -424449 -424456 -426380 -426112 -424081 -423093 -422868 -421987 -419102 -417298 -416904 -416272 -416885 -418103 -417933 -421323 -424081 -425129
4899 -425129 -426508 -426514 -425928 -423050 -423080 -422819 -421571 -420611 -421103 -421991 -425006 -422910 -421433 -422052 -421794 -421234 -419965 -421100
4881 -421100 -422579 -421510 -419185 -416822 -416991 -418790 -418794 -418227 -416592 -415516 -418318 -419038 -418251 -421456 -424330 -421100
4865 -421100 -420883 -421828 -420824 -420169 -421193 -420264 -420049 -420647 -419328 -421036 -422486 -420150 -420089 -419324 -417990 -416343 -415580
4848 -415580 -415756 -418479 -420965 -419124 -417425 -418868 -421828 -422527 -421948 -419197 -419864 -420380 -419274 -418732 -419399 -419468 -417470
4831 -417470 -416656 -415708 -415776 -415384 -415047 -413178 -409013 -408403 -411725 -413340 -412728 -413354 -415620 -415892 -411586 -410379 -411081
4814d11081k153K271K795J171j488k028l475j761l385j980j363J072K855K28K89
4799d18033J106J38m73O42L435o87n79J346j217K54K134J786k19J063P85j423
4783d09942j259m35k545k673L87j374l948j910K480K075L59Q4r56l97J09L272
4767d16673M115J339l751l847K20N86j232J079M756K276K280J858k365k738j07
4752d12204K11k910n70K872R60j018J774J145j428k143n1p95K498J058k910k724
4736d16235J588K303m85J520J381p69j407J57J58K109k29j866Q5Q41j161j812
4720d13822J023J962K218p31l16j30J737N34q54J20j555J877l942l72K206J786
4704d08259L313j270n59m65P74J276k844k673J915j090j398r1j82j003J449J903
$$ plain form
4814 -411081 -413234 -410963 -408168 -406997 -408485 -410513 -413988 -415749 -419134 -421114 -422477 -421405 -418550 -418322 -418033
4799 -418033 -416927 -416789 -417262 -416620 -413185 -413872 -414451 -413105 -414322 -414068 -411934 -410148 -410367 -409304 -408519 -409942
4783 -409942 -411201 -411636 -414181 -416854 -416467 -417841 -421789 -423699 -421219 -419144 -418785 -418701 -419657 -420054 -419945 -416673
4767 -416673 -412558 -411219 -414970 -418817 -418597 -418011 -419243 -418164 -413408 -411132 -408852 -406994 -409359 -412097 -412204
4752 -412204 -411993 -414903 -415473 -412601 -411641 -412659 -410885 -409740 -411168 -413311 -413362 -414157 -411659 -410601 -413511 -416235
4736 -416235 -414647 -412344 -412829 -411309 -409928 -410697 -412104 -411947 -411789 -409680 -409909 -411775 -411690 -410849 -412010 -413822
4720 -413822 -412799 -410837 -408619 -409350 -409666 -409796 -408059 -407525 -408379 -408259 -409814 -407937 -411879 -412251 -410045 -408259
4704 -408259 -404946 -406216 -406775 -407240 -406466 -405190 -408034 -410707 -408792 -409882 -411280 -411371 -411553 -412556 -411107 -409204
4688d09204P90QJ790K03L26p01N8m17m68j325l00k97j327J358J34j584n39j185
4670d12680l011L67L327M357M844m3k235N09l18j82j289k8J775K74j845K02r02
4653d06878j766J007L68q18O01J480o29j29L179l27j857M86O61K408L78l319k585
4636d07740M46K409J04K31K312J550p8j701L96K14J587j135j707J350p63K07J840
4619d00478k66j360R10K00j144k140j272K392r35R74k76J191n49j647j40j180
4603d05720J476K227m30J851K690L79N79j327k064j280Q26o2j229r90N17P99k374
4586d04132m48J257J113o04j998K995J763M63r43J95n93l60j75l256k787J107
4570d06403N54L91K521K040J294M308K49j736r11r68O19j175M00j97k028r13N29
$$ plain form
4688 -409204 -408414 -408406 -406616 -406413 -406087 -406788 -406730 -407147 -407615 -408940 -409240 -409537 -410864 -409506 -409372 -410956 -411495 -412680
4670 -412680 -415691 -415324 -411997 -407640 -402796 -402839 -405074 -404565 -404883 -405065 -406354 -406382 -404607 -404333 -406178 -405976 -406878
4653 -406878 -408644 -407637 -407269 -408087 -407486 -406006 -406635 -406764 -403585 -403912 -405769 -405283 -404622 -402214 -401836 -405155 -407740
4636 -407740 -407294 -404885 -404781 -404550 -402238 -400688 -400766 -402467 -402071 -401857 -400270 -401405 -403112 -401762 -402525 -402318 -400478
4619 -400478 -400744 -402104 -401194 -400994 -402138 -404278 -405550 -403158 -404093 -403119 -403395 -402204 -402753 -404400 -404540 -405720
4603 -405720 -404244 -402017 -402447 -400596 -397906 -397527 -396948 -398275 -400339 -401619 -400793 -400855 -402084 -403074 -402557 -401758 -404132
4586 -404132 -404580 -403323 -402210 -402814 -404812 -401817 -400054 -399591 -400534 -400339 -400932 -401292 -401467 -404723 -407510 -406403
4570 -406403 -405849 -405458 -402937 -400897 -399603 -395295 -395046 -396782 -397693 -398661 -398042 -399217 -398817 -399014 -401042 -401955 -401426
4553d01426Q14k88L208L122r57r85O06o40J405k041j102J101J56N50N79j66j536
$$ plain form
4553 -401426 -400612 -400900 -397692 -394570 -395527 -396512 -395906 -396546 -395141 -397182 -398284 -397183 -397027 -396477 -395898 -396064 -397600
$$ [...]
##END NTUPLES=NMR SPECTRUM
##END=
