##TITLE=Analysis number 314033
Compound Code mo 00924
Book Reference 444/14
Project Code adrs
Chemist Name howarde
##JCAMPDX= 6.0         $$ Bruker NMR JCAMP-DX V2.0
##DATA TYPE= NMR SPECTRUM
##DATA CLASS= NTUPLES
##ORIGIN= Bruker BioSpin GmbH
##OWNER= NMR
$$ XWIN-NMR		Version 3.5
$$ Tue Oct  4 08:47:22 2005 GMT Daylight Time (UT+1h)  MAYBRIDGE\NMR@NMR_250MHZ
##.OBSERVE FREQUENCY= 250.131544655141
##.OBSERVE NUCLEUS= ^1H
##.ACQUISITION MODE= SIMULTANEOUS (DQD)
##.ACQUISITION SCHEME= undefined
##.AVERAGES= 16
##.DIGITISER RES= 18
##SPECTROMETER/DATA SYSTEM= dpx250
##.PULSE SEQUENCE= zg30
##.SOLVENT NAME= CDCl3
##.SHIFT REFERENCE= (INTERNAL, CDCl3, 0, 16.522)
##AUDIT TRAIL= $$ (NUMBER, WHEN, WHO, WHERE, WHAT)
$$ ##TITLE= Audit trail, XWIN-NMR		Version 3.5
$$ ##JCAMPDX= 5.01
$$ ##ORIGIN= Bruker BioSpin GmbH
$$ ##OWNER= NMR
$$ C:\u/data/dgb/nmr/ADRS/10250/pdata/1/auditp.txt
$$ ##AUDIT TRAIL=  $$ (NUMBER, WHEN, WHO, WHERE, WHAT)
(   1,<2005-10-04 08:46:42.71 +100>,<MAYBRIDGE\NMR>,<NMR_250MHZ>,
      <created by zg, POWCHK disabled, PULCHK disabled
       configuration hash MD5:
       62 19 C7 07 E1 42 D1 B7 37 6C 3D D0 77 39 F9 E6
       data hash MD5: 64K
       37 F9 F8 98 83 49 49 D3 78 6A 84 AA 0F 1F E3 C1>)
(   2,<2005-10-04 08:47:01.71 +100>,<MAYBRIDGE\NMR>,<NMR_250MHZ>,
      <Start of raw data processing
       ef LB = 0.3 FT_mod = 6 PKNL = 1 SI = 32K 
       data hash MD5: 32K
       4F 82 81 11 66 26 6D 2E 9F 32 1F B1 E2 E2 35 39>)
(   3,<2005-10-04 08:47:06.74 +100>,<MAYBRIDGE\NMR>,<NMR_250MHZ>,
      <apk 
       data hash MD5: 32K
       CB 63 FE 69 6E 29 E6 7F 4A 4D EE 66 8E 04 13 8B>)
(   4,<2005-10-04 08:47:08.52 +100>,<MAYBRIDGE\NMR>,<NMR_250MHZ>,
      <abs ABSG = 5 
       data hash MD5: 32K
       A5 23 6A 37 A9 9D 21 C1 F7 52 4D 12 67 3F 58 24>)
$$ ##END=
$$ 
$$ hash MD5
$$ 78 D2 4E FF 9F 1A 2B A9 01 33 E9 A7 56 17 02 89
##$RELAX= 
##$RELAX= 
##$RELAX= 
##$RELAX= 
##$RELAX= 
##$RELAX= 
##$RELAX= 
$$ Bruker specific parameters
$$ --------------------------
##$DU= <C:\u>
##$EXPNO= 10250
##$NAME= <ADRS>
##$PROCNO= 1
##$TYPE= <nmr>
##$USER= <dgb>
##$AMP= (0..31)
100 100 100 100 100 100 100 100 100 100 100 100 100 100 100 100 100 100 
100 100 100 100 100 100 100 100 100 100 100 100 100 100 
##$AQSEQ= 0
##$AQ_mod= 3
##$AUNM= <au_zg>
##$AUTOPOS= <1 >
##$BF1= 250.13
##$BF2= 250.13
##$BF3= 250.13
##$BF4= 250.13
##$BF5= 500.13
##$BF6= 500.13
##$BF7= 500.13
##$BF8= 500.13
##$BYTORDA= 1
##$CFDGTYP= 0
##$CFRGTYP= 5
##$CHEMSTR= <none>
##$CNST= (0..31)
1 1 145 1 1 1 1 1 1 1 1 1 1 1 1 1 1 1 1 1 1 1 1 1 1 1 1 1 1 1 1 1 
##$CPDPRG= <>
##$CPDPRG1= <>
##$CPDPRG2= <>
##$CPDPRG3= <>
##$CPDPRG4= <mlev>
##$CPDPRG5= <mlev>
##$CPDPRG6= <mlev>
##$CPDPRG7= <mlev>
##$CPDPRG8= <mlev>
##$CPDPRGB= <>
##$CPDPRGT= <>
##$D= (0..31)
0 1 0 0 0 0 0 0 0 0.06 0 0 0 0 0 0 0.0002 0 0 0 0 0 0 0 0 0 0 0 0 0 0 
0 
##$DATE= 1128412001
##$DBL= (0..7)
120 120 120 120 120 120 120 120 
##$DBP= (0..7)
150 150 150 150 150 150 150 150 
##$DBP07= 0
##$DBPNAM0= <>
##$DBPNAM1= <>
$$ [...]
##$SUBNAM7= <"">
##$SUBNAM8= <"">
##$SUBNAM9= <"">
##$SW= 20.6930455092707
##$SWIBOX= (0..15)
0 0 3 0 0 0 0 0 0 0 0 0 0 0 0 0 
##$SW_h= 5175.983436853
##$TD= 65536
##$TD0= 1
##$TE= 296.16
##$TE2= 300
##$TE3= 300
##$TEG= 300
##$TL= (0..7)
0 120 120 120 120 120 120 120 
##$TP= (0..7)
150 150 150 150 150 150 150 150 
##$TP07= 0
##$TPNAME0= <>
##$TPNAME1= <>
##$TPNAME2= <>
##$TPNAME3= <>
##$TPNAME4= <>
##$TPNAME5= <>
##$TPNAME6= <>
##$TPNAME7= <>
##$TPOAL= (0..7)
0.5 0.5 0.5 0.5 0.5 0.5 0.5 0.5 
##$TPOFFS= (0..7)
0 0 0 0 0 0 0 0 
##$TUNHIN= 0
##$TUNHOUT= 0
##$TUNXOUT= 0
##$USERA1= <user>
##$USERA2= <user>
##$USERA3= <user>
##$USERA4= <user>
##$USERA5= <user>
##$V9= 5
##$VALIST= <valist>
##$VCLIST= <CCCCCCCCCCCCCCC>
##$VD= 0
##$VDLIST= <DDDDDDDDDDDDDDD>
##$VPLIST= <PPPPPPPPPPPPPPP>
##$VTLIST= <TTTTTTTTTTTTTTT>
##$WBST= 1024
##$WBSW= 4
##$XGAIN= (0..3)
0 0 0 0 
##$XL= 0
##$YL= 0
##$YMAX_a= 476558
##$YMIN_a= -440187
##$ZGOPTNS= <>
##$ZL1= 120
##$ZL2= 120
##$ZL3= 120
##$ZL4= 120
##$ABSF1= 16.522
##$ABSF2= -4.171173
##$ABSG= 5
##$ABSL= 3
##$ALPHA= 0
##$AQORDER= 0
##$ASSFAC= 0
##$ASSFACI= 0
##$ASSFACX= 0
##$ASSWID= 0
##$AUNMP= <proc_1d>
##$AZFE= 0.1
##$AZFW= 0.1
##$BCFW= 0
##$BC_mod= 0
##$BYTORDP= 0
##$COROFFS= 0
##$CY= 12.5
##$DATMOD= 1
##$DC= 0
##$DFILT= <>
##$DTYPP= 0
##$F1P= 14.0000005364418
##$F2P= -0.99999901652339
##$FCOR= 0.5
##$FTSIZE= 32768
##$FT_mod= 6
##$GAMMA= 0
##$GB= 0
##$INTBC= 1
##$INTSCL= 1
##$ISEN= 128
##$LB= 0.3
##$LEV0= 0
##$LPBIN= 0
##$MAXI= 10000
##$MC2= 0
##$MEAN= 0
##$ME_mod= 0
##$MI= 0
##$NCOEF= 0
##$NC_proc= -2
##$NLEV= 6
##$NOISF1= 0
##$NOISF2= 0
##$NSP= 0
##$NTH_PI= 0
##$NZP= 0
##$OFFSET= 16.522
##$PC= 1
##$PHC0= -62.34247
##$PHC1= 7.116147
##$PH_mod= 1
##$PKNL= yes
##$PPARMOD= 0
##$PSCAL= 4
##$PSIGN= 0
##$REVERSE= no
##$SF= 250.13
##$SI= 32768
##$SIGF1= 0
##$SIGF2= 0
##$SINO= 400
##$SIOLD= 32768
##$SREGLST= <1H.CDCl3>
##$SSB= 0
##$STSI= 32768
##$STSR= 0
##$SW_p= 5175.98343685301
##$SYMM= 0
##$S_DEV= 0
##$TDeff= 65536
##$TDoff= 0
##$TI= <Analysis number 999999
Compound Code 99
Book Reference 9
Project Code 9>
##$TILT= no
##$TM1= 0
##$TM2= 0
##$TOPLEV= 0
##$USERP1= <user>
##$USERP2= <user>
##$USERP3= <user>
##$USERP4= <user>
##$USERP5= <user>
##$WDW= 1
##$XDIM= 32768
##$YMAX_p= 402023753
##$YMIN_p= -297408
$$ End of Bruker specific parameters
$$ ---------------------------------
##NTUPLES= NMR SPECTRUM
##VAR_NAME=  FREQUENCY,     SPECTRUM/REAL,   SPECTRUM/IMAG
##SYMBOL=    X,             R,               I
##VAR_TYPE=  INDEPENDENT,   DEPENDENT,       DEPENDENT
##VAR_FORM=  AFFN,          ASDF,            ASDF
##VAR_DIM=   32768,         32768,           32768
##UNITS=     HZ,            ARBITRARY UNITS, ARBITRARY UNITS
##FACTOR=    0.157963299565203, 1,           1
##FIRST=     4132.6476996994, 0,             0
##LAST=      -1043.33573715361, 0,           0
##MIN=       -1043.33573715361, -297408,     0
##MAX=       4132.6476996994, 402023753,     0
$$ Real data points
##PAGE= N=1
##DATA TABLE= (X++(R..R)), XYDATA
$$ [...]
##PAGE= N=2
##DATA TABLE= (X++(I..I)), XYDATA
14174b496952L0733L4079L4049L0432L5940K9994K8472J4946Q805M476L935q905
14162b249996K117J7711J1888P440J3887J5274K1991K3111J8870K0882K4848K1704
14150b050273J5598J9707J8003J8691R472J6748J6826J6040J2524P143J319J1907
14138a886295J2667M107L888J6557J5557J5075K1030J8348J1349J9902K1563J6189
14126a710063J4061J1233J2439O506O586J0226J2319J3131R623N958J731J0310
14114a595940J8811P376Q623J2134P868R808J2454J0742K045Q383N169M795R513
14101a478219J5671J1699K2021J2853J4892J7971P057N870J0127J4802J0119J2077
14089a323060O797L429J2310K2079J7923R519K2380J4966J1754J4602J0588J7347
$$ plain form
14174 -2496952 -2466219 -2432140 -2398091 -2367659 -2331719 -2301725 -2273253 -2258307 -2249502 -2245026 -2241091 -2249996
14162 -2249996 -2247879 -2230168 -2218280 -2210840 -2196953 -2181679 -2159688 -2136577 -2117707 -2096825 -2071977 -2050273
14150 -2050273 -2034675 -2014968 -1996965 -1978274 -1968802 -1952054 -1935228 -1919188 -1906664 -1899521 -1898202 -1886295
14138 -1886295 -1873628 -1869521 -1865633 -1849076 -1833519 -1818444 -1797414 -1779066 -1767717 -1747815 -1726252 -1710063
14126 -1710063 -1696002 -1684769 -1672330 -1665824 -1659238 -1649012 -1636693 -1623562 -1613939 -1607981 -1606250 -1595940
14114 -1595940 -1577129 -1569753 -1561130 -1548996 -1541128 -1531320 -1518866 -1508124 -1506079 -1497696 -1492527 -1487732 -1478219
14101 -1478219 -1462548 -1450849 -1428828 -1415975 -1401083 -1383112 -1376055 -1370185 -1360058 -1345256 -1335137 -1323060
14089 -1323060 -1316263 -1312834 -1300524 -1278445 -1260522 -1251003 -1228623 -1213657 -1201903 -1187301 -1176713 -1159366
14077a159366J8766Q337P922m37j2581k2110k7360k6467j7704j7627j7216j2030
14065a277873k663j188K898J2028J8732J9021J2100J5279O884P094J2861J0412
14053a164415P968Q064J5432O557M391M819N681M820N462N022P936J4404J2149
14040a061710M322N871J0099J0966J2461N967N668L029J90N614P741J1400J296
14027i77086N130O210K226R131R598M914N182J751J1361J4675J1371P630J2993
14014h74914J0716J621j712n58m084o241m681q846j7965j1620j1267p878L211
14001i34218j64Q395J4369Q711J8308J0387M172P056L031j245R788M686Q787J3216
13987h24721L839P87L296N925j668J231J2175Q349N229R135N194K071o076J0327
$$ plain form
14077 -1159366 -1140600 -1132263 -1124341 -1124778 -1137359 -1159469 -1186829 -1213296 -1231000 -1248627 -1265843 -1277873
14065 -1277873 -1280536 -1281724 -1278826 -1266798 -1248066 -1229045 -1216945 -1201666 -1194782 -1187688 -1174827 -1164415
14053 -1164415 -1156447 -1148383 -1132951 -1126394 -1122003 -1117184 -1111503 -1106683 -1101221 -1096199 -1088263 -1073859 -1061710
14040 -1061710 -1057388 -1051517 -1041418 -1030452 -1017991 -1012024 -1006356 -1003327 -1003137 -997523 -989782 -978382 -977086
14027 -977086 -971956 -965746 -963520 -954389 -944791 -939877 -934695 -932944 -921583 -906908 -895537 -887907 -874914
14014 -874914 -864198 -862577 -864289 -864847 -868931 -875172 -879853 -888699 -906664 -918284 -929551 -937429 -934218
14001 -934218 -934382 -925987 -911618 -902907 -884599 -874212 -870040 -862984 -859953 -861198 -851410 -846724 -837937 -824721
13987 -824721 -820882 -820095 -816799 -810874 -812542 -811311 -799136 -790787 -785558 -776423 -771229 -769158 -775234 -764907
13973g64907J6534J0737J0178Q79j0596l562L805J0519P747J0125O449L231J860
13960f97001J526k602k148N701P349K409Q86M493K650Q893j530l83J4715O422
13946f48620q24l105O58L491O759k317R16R999N590L615N933O955m694J854J4213
13931e99577Q789M855J331N375J0102O910J701K792O355P175J0989N386J234O246
13917e20337O389K598P846N874O925J4016Q024J849O362J1772R599N180N259M619
13903d24025M165N381J1178J7594N039K483J1134J3991J2555J3500J4852O844
13891c05309J0802J3096K1313J2498J0859K1481K1179K2148K3346K2526L0291
13880i5770L6264L6152L8670N7275Q1083Q5593P8801P6362N0602k580q5578j76334
$$ plain form
13973 -764907 -748373 -737636 -727458 -726579 -737175 -740737 -736932 -726413 -718666 -708541 -702092 -698861 -697001
13960 -697001 -695475 -698077 -700225 -694524 -687175 -684766 -683880 -679387 -676737 -667844 -669374 -669757 -655042 -648620
13946 -648620 -649444 -652549 -651891 -648400 -641641 -643958 -643042 -633043 -627453 -623838 -617905 -610950 -615644 -613790 -599577
13931 -599577 -590788 -585933 -584602 -579227 -569125 -562215 -560514 -557722 -551367 -544192 -533203 -527817 -526583 -520337
13917 -520337 -513948 -511350 -503504 -497630 -490705 -476689 -468665 -466816 -460454 -448682 -439083 -433903 -428644 -424025
13903 -424025 -419860 -414479 -403301 -385707 -380668 -378185 -367051 -353060 -340505 -327005 -312153 -305309
13891 -305309 -294507 -281411 -260098 -247600 -236741 -215260 -194081 -171933 -148587 -126061 -95770
13880 -95770 -59506 -23354 15316 72591 153674 239267 318068 394430 445032 442452 356874 180540
13868A80540k45874k97613l07982k79475k16226j34936p1125j6542K5349N9180
13858a304704P7217Q4627Q0585O5632N0719M2028L9209L4893L2452L8532L0969
13847g27841L3178M5827M3832L0959K1061L076j6298l9265m9990n5800o1006m9973
13835h22240l5107j8589m379R245J0477K1556K3058K7123K9586K3629J5303J1380
13823g08958J2180J3610J3606J0061J0713Q213J2040R171J0012J4787J9406N265
13811e69894O055R126Q399M313R066J7034J4177N865P192J3061R897J4276J3928
13798d37505J4792J5258J6006K4640K4696K9089K0979R16j8022k1982l7095p0889
13786d39117r3828q8746o9702n2092l3186j6087j0852K182J6034K5141J5586K1511
$$ plain form
13868 180540 -65334 -362947 -670929 -950404 -1166630 -1301566 -1372691 -1389233 -1363884 -1304704
13858 -1304704 -1227487 -1142860 -1062275 -996643 -945924 -903896 -864687 -829794 -797342 -758810 -727841
13847 -727841 -694663 -648836 -605004 -574045 -552984 -549908 -566206 -605471 -655461 -711261 -772267 -822240
13835 -822240 -857347 -875936 -880315 -871070 -860593 -839037 -815979 -788856 -759270 -735641 -720338 -708958
13823 -708958 -696778 -683168 -669562 -659501 -648788 -640575 -628535 -619364 -609352 -594565 -575159 -569894
13811 -569894 -563839 -554713 -546314 -542001 -532935 -515901 -501724 -495859 -488667 -475606 -465709 -451433 -437505
13798 -437505 -422713 -407455 -391449 -366809 -342113 -313024 -292045 -291129 -309151 -331133 -368228 -439117
13786 -439117 -532945 -621691 -691393 -743485 -776671 -792758 -803610 -801428 -785394 -760253 -744667 -723156
13774g23156K3893K0898K1363P216J2121Q453R208O679J2627O296O805J1785J592
13761e74220K211R679Q631K66j798P745J4510J738R684J298n170j750Q270L983
13747e14923O181N520O599M594N412P575O007N64l11J562L215J849K725L707L605
13732d56119j92j22j30K039l532N500N69Q150J1220M424M429N087N467J264k962
13717d14908n977L813P172P45q436J367L097P617J0141M395l131o865j567K486
13703d00051m764m139n91n739J250N05L236O155O353J4l540q604L861J3330L662
13688c89062N133N169l038M046L755O016P91L311P374k826M592M283N731J916
13674c42809m440M373n63J027r07L993M585L754l070M009M237M583J4424K053
$$ plain form
13774 -723156 -699263 -678365 -657002 -649786 -637665 -629212 -620004 -613325 -600698 -594402 -587597 -575812 -574220
13761 -574220 -572009 -562330 -553699 -553433 -555231 -547486 -532976 -531238 -521554 -520256 -525426 -527176 -518906 -514923
13747 -514923 -508742 -503222 -496623 -492029 -486617 -479042 -473035 -472471 -472782 -471220 -468005 -466156 -463431 -459724 -456119
13732 -456119 -456311 -456433 -456563 -454524 -458056 -452556 -451987 -443837 -432617 -428193 -423764 -418677 -413210 -411946 -414908
13717 -414908 -420885 -417072 -409900 -409155 -417591 -416224 -413127 -405510 -395369 -390974 -394105 -400970 -402537 -400051
13703 -400051 -404815 -408954 -409545 -415284 -414034 -413529 -410293 -404138 -397785 -397771 -401311 -409915 -406054 -392724 -389062
13688 -389062 -383929 -378760 -381798 -377752 -373997 -367981 -367190 -363879 -356505 -359331 -354739 -350456 -344725 -342809
13674 -342809 -347249 -342876 -343439 -342412 -343319 -339326 -334741 -330987 -334057 -330048 -325811 -321228 -306804 -304751
13660c04751o94l85k21K571j984N83K800p6L465L306K914R420J1387P049J0849
13645b53767J0318Q10L494O038P443N441P133J3625K1135J8252J6486N546q101
13632a46147k4438k5227l2401m0687m3200m0059l3280j8313j7717j3225o051J226
13620d39519J1640J1750J6577Q339L38Q129Q961K155k807L093J1717J1777P152
13607c40698Q7M038Q685J1440N498o01R915k087j068M885O068J1827k188n352
13593b89551J0158J2074J0588J274m784M536R578J4219J1011o08L852Q830R016
13580a99807R096J982J1185J3636K0159J1059R816P686J43j0121j3002k6396l8415
13567b02979m8158m9666m6109m0933m1885j8719J428R879Q677M869M603J7761
$$ plain form
13660 -304751 -305445 -305830 -306051 -303480 -305464 -304881 -302081 -302157 -298692 -295386 -292472 -283052 -271665 -264616 -253767
13645 -253767 -243449 -242639 -239145 -233107 -225664 -220223 -213090 -199465 -178330 -160078 -143592 -138046 -146147
13632 -146147 -170585 -195812 -228213 -268900 -312100 -352159 -385439 -403752 -421469 -434694 -440745 -439519
13620 -439519 -427879 -416129 -399552 -391213 -390875 -382746 -373785 -371630 -374437 -371344 -359627 -347850 -340698
13607 -340698 -340611 -336573 -327888 -316448 -310950 -311551 -301636 -303723 -304791 -299906 -293838 -282011 -284199 -289551
13593 -289551 -279393 -267319 -256731 -255457 -260241 -255705 -246127 -231908 -220897 -221505 -217653 -208823 -199807
13580 -199807 -190711 -188729 -177544 -163908 -143749 -132690 -122874 -115188 -115045 -125166 -138168 -164564 -202979
13567 -202979 -251137 -300803 -346912 -387845 -429730 -448449 -447021 -437142 -428465 -423596 -418993 -401232
13555d01232K0383J0225M33R092J2622M995N154Q378J0123L095L148k646L23J962
13541c13945O049P315P53n786k859M223N750P357N596R035j0J447J077n747j233
13526b80978M85P118L136k94k437P582J547O532k197r875M192K888K842K743P260
13511b49456q32J227N622O928n40L663P563M546j788n421J343O930m758m115N528
13496b23560l926O526P772P139n098m081O829O523J84p849n252M447K139k665
13482b10872n313k261J1074M170M945L994J930O1M674j873l5m355o921K93N342
13467a95147m192m617J740L940l090rL04J833l996n43K261N416M615j688L412
13452a89761O493K358N578N296n070K526O068O065j790Q84o672m631M334N689
$$ plain form
13555 -401232 -380849 -370624 -370191 -361099 -348477 -343482 -338328 -329950 -319827 -316732 -313584 -316230 -315907 -313945
13541 -313945 -307896 -300581 -299828 -305614 -308473 -304250 -298500 -291143 -285547 -276512 -276522 -275075 -273998 -279745 -280978
13526 -280978 -280493 -273375 -270239 -270533 -272970 -265388 -263841 -257309 -259506 -269381 -265189 -262301 -259459 -256716 -249456
13511 -249456 -250288 -249061 -243439 -236511 -237051 -233388 -225825 -221279 -223067 -228488 -227145 -220215 -224973 -229088 -223560
13496 -223560 -227486 -220960 -213188 -206049 -211147 -215228 -208399 -201876 -201692 -209541 -214793 -210346 -208207 -210872
13482 -210872 -216185 -218446 -207372 -203202 -198257 -194263 -192333 -192272 -187598 -189471 -189506 -193861 -200782 -200489 -195147
13467 -195147 -199339 -203956 -202216 -198276 -201366 -201375 -201071 -199238 -203234 -203777 -201516 -196100 -191485 -193173 -189761
13452 -189761 -183268 -180910 -175332 -170036 -175106 -172580 -166512 -160447 -162237 -161353 -168025 -172656 -168322 -162633
13438a62633n078m017j275j883J366l470k253M649K758j07O87k178O753K278L578
13423a60825J755l000P7P337k380q495q00P380P780P019J946l28m566n119r11
13408a53130M403m152j369k407O280Q208J2676J249J06n878K696n722k689p1O322
13393a33478N944O029L946K024l760J38N759m530o052o426j142J029O87j307j397
13378a32536N777J593l664M365J911Q25L24J84M406O59P426Q567J482j477O74
13363i9484M002K411m167J86O423L636M256M092k616q136l539j300K435N968K459
13348h3374J216l626j145j230m970j448Q705N374K115L716l81K886j007N525N909
13333f1735K678N934k083j174J794N056M442O004j844K578P282l06j620n154p03
$$ plain form
13438 -162633 -167711 -171728 -173003 -174886 -173520 -176990 -179243 -174594 -171836 -171943 -171256 -173434 -166681 -164403 -160825
13423 -160825 -159070 -162070 -161993 -154656 -157036 -165531 -166331 -158951 -151171 -144152 -142206 -142534 -147100 -152219 -153130
13408 -153130 -148727 -152879 -154248 -156655 -150375 -142167 -129491 -128242 -128136 -134014 -131318 -137040 -139729 -139800 -133478
13393 -133478 -127534 -121505 -117559 -115535 -119295 -119157 -113398 -117928 -123980 -130406 -131548 -130519 -129832 -131139 -132536
13378 -132536 -126759 -125166 -128830 -124465 -122554 -121729 -121405 -121221 -116815 -116156 -108730 -100163 -98681 -100158 -99484
13363 -99484 -95482 -93071 -97238 -97052 -90629 -86993 -82737 -78645 -81261 -89397 -92936 -94236 -91801 -85833 -83374
13348 -83374 -82158 -85784 -86929 -88159 -93129 -94577 -85872 -80498 -78383 -74667 -75048 -72162 -73169 -67644 -61735
13333 -61735 -59057 -53123 -55206 -56380 -54586 -49530 -45088 -39084 -40928 -38350 -31068 -31374 -32994 -38148 -38851
13318c8851J217q79m618m908P798J1277J0855m592K968Q739J1031P474J0664J1988
13304C0163q4J967M501Q522J3381J3931J5025R937P873J1904K9415K7208J6707
13291A90450J3693J3530l928k0152m4636p1441q7616r3280r0135q1526o5428m4784
13279c85253k8067r661J7886J4365K2405K3911J5909K2471K0457R541J4774J1709
13267b49553P127P748L112K380N201L993N129N690J0046J2006L606k435Q862J1338
13253a65750O260N972K25P95K444O03N655P358M804q4k709O749O694J669K351
13238a16964K858j222k674O419J865q587K409N174N154P742K167K16L754J923
13224h9766q228n709O835R682p348K862K009N400M896L483M003n360j346r946
$$ plain form
13318 -38851 -37634 -38513 -43131 -48039 -40241 -28964 -18109 -22701 -19733 -10994 37 7511 18175 30163
13304 30163 30079 32046 36547 45069 58450 72381 87406 97343 105216 117120 146535 173743 190450
13291 190450 204143 217673 213745 193593 148957 77516 -10100 -103380 -193515 -275041 -340469 -385253
13279 -385253 -413320 -422981 -405095 -390730 -368325 -344414 -328505 -306034 -285577 -276036 -261262 -249553
13267 -249553 -242426 -234678 -231566 -229186 -223985 -219992 -214863 -209173 -199127 -187121 -183515 -185950 -177088 -165750
13253 -165750 -159490 -153518 -153293 -152498 -150054 -149451 -143796 -136438 -131634 -131718 -134427 -127678 -120984 -119315 -116964
13238 -116964 -114106 -115328 -118002 -111583 -109718 -118305 -115896 -110722 -105568 -97826 -95659 -95443 -91689 -89766
13224 -89766 -97994 -103703 -96868 -87186 -94534 -91672 -89663 -84263 -79367 -75884 -71881 -77241 -78587 -88533
13210h8533p781o990o722L39K439J226N863N520M495K960k791n383L474K381N495
13195h4008O01k424j560m10Q592N742P551J619m154M527N405p436o87M482m113
13180f6273l165J0733P626m34J557K981M074J29K805J2381J9855P348k657j3092
13166a6132k0587k5598r152j4947j0254r705k160L981K833K029O653Q790J1996
13153g2253N844L692N010o074n13p36K582J327k363m690J41P370O640L023J654
13138d9346K075K811L7n83M929L736K068M485P310J109R008P369L014Q098P469
13123A3589o500j1453r996j6334j3071j5001j3679n727L92n04N86N525J0082L767
13109e8324K412K608K177J3026J611p085m019m799j462O730L981R343K78j424
$$ plain form
13210 -88533 -96314 -103304 -110026 -109687 -107248 -106022 -100159 -94639 -90144 -87184 -89975 -95358 -91884 -89503 -84008
13195 -84008 -83407 -85831 -87391 -87801 -79209 -73467 -65916 -64297 -68451 -63924 -58519 -65955 -66642 -62160 -66273
13180 -66273 -69438 -58705 -51079 -51513 -49956 -46975 -42901 -42772 -39967 -27586 -7731 -383 -3040 -16132
13166 -16132 -36719 -62317 -71469 -86416 -96670 -106375 -108535 -104554 -101721 -99692 -93039 -84249 -72253
13153 -72253 -66409 -62717 -57707 -63781 -64294 -65030 -62448 -61121 -63484 -68174 -68033 -60663 -54023 -51000 -49346
13138 -49346 -47271 -44460 -44423 -45006 -40077 -36341 -34273 -29788 -22478 -21369 -12361 -4992 -1978 6120 13589
13123 13589 7089 -4364 -14360 -30694 -43765 -58766 -72445 -78172 -77780 -78284 -77698 -72173 -62091 -58324
13109 -58324 -55912 -53304 -51127 -38101 -36490 -43575 -47594 -52393 -53855 -47125 -43144 -33801 -33523 -34947
13095c4947J881J581k58k061O320N49O23r66O920k221k731j909k4M450j66N257
13079a7702L196j150P69n31p883k614L65o368j749K632m185j428J0139Q528l535
13064b1516m158K969N785m323j914P13l764n042P691P692O13l294n066O19j557
13049b4552L052L188M400J934m79n074L717L593O787N598j628l607M479L607o471
13034a456L330j960N692N743k314n876L4M473l447j037O661O401l210p24L326
13019A5636o600m133M6R667J0943J679k392j205p349J753N145N695n62O281j065
13004C3539j416k705K612K902L233q044l122L740N185K16m344N82J018J095l446
12989C1045O836Q547K625n93k444r28j002m831j946P19L930O966j878m549N465
$$ plain form
13095 -34947 -33066 -31485 -31743 -33804 -27484 -26935 -26312 -27278 -20358 -22579 -25310 -27219 -27243 -22793 -22959 -17702
13079 -17702 -14506 -15656 -14887 -15418 -23301 -25915 -25550 -31918 -33667 -31035 -35220 -36648 -26509 -17981 -21516
13064 -21516 -25674 -22705 -16920 -21243 -23157 -22444 -26208 -31250 -23559 -15867 -15254 -18548 -23614 -22995 -24552
13049 -24552 -21500 -18312 -13912 -11978 -12457 -17531 -13814 -10221 -3434 2164 536 -3071 1408 5015 -1456
13034 -1456 1874 -86 5606 11349 9035 3159 3193 7666 4219 3182 9843 16244 13034 12310 15636
13019 15636 9036 4903 4949 14616 25559 27238 24846 23641 16292 18045 23190 28885 28323 34604 33539
13004 33539 32123 29418 32030 34932 38165 30121 26999 30739 35924 36140 31796 32378 33396 34491 31045
12989 31045 37881 46428 49053 48460 46016 45088 44086 39255 37309 38028 41958 48924 47046 42497 47962
12974D7962Q542K655K133O928O077j466K530k940K931l167J549N584O428K172
12960H7918P184J907L726N651J675k37R10O953Q190L091o309K818J2028P503J075
12945A44083P424O829M550J0417J0891J0633N688P031K3171K3111K2890J9016
12933B95734J7767K8192K2416Q932j8422l2080n7024q8683r5520r5907r3076p8605
12921a86276n4966l4688j3491r037J2003K2082K0551K4742J7388J9983J5929Q923
12909a56857J3539J1963P415j054J0628K0830J5017M258l448L360M14P058M187
12896f2690K77L071m56M141P613J2117P357M479j715p686l892j106P768M977L873
12881b1872Q24J1612j135o395J788P586M987l834K039L526O41L74N796M951J795
$$ plain form
12974 47962 56504 59159 61292 68220 74297 72831 75361 72421 75352 72185 73734 79318 85746 87918
12960 87918 95102 97009 100735 106386 108061 107824 108734 115687 123877 126968 120659 123477 135505 143008 144083
12945 144083 151507 158336 162886 173303 184194 194827 200515 207546 230717 253828 276718 295734
12933 295734 313501 341693 364109 373041 354619 322539 265515 176832 81312 -14595 -107671 -186276
12921 -186276 -241242 -275930 -289421 -298458 -286455 -264373 -243822 -219080 -201692 -181709 -165780 -156857
12909 -156857 -143318 -131355 -123940 -124994 -114366 -93536 -78519 -74261 -77709 -74349 -73935 -66877 -62690
12896 -62690 -62413 -59342 -59798 -55657 -48044 -35927 -28570 -24091 -25806 -33492 -37384 -38490 -30722 -25745 -21872
12881 -21872 -21048 -9436 -10571 -16966 -15178 -7592 -2605 -6439 -4400 -874 -233 141 5937 10888 12683
12866A2683j664j965k660J371L541j529N9L76O614P24j880N341m39k031M557M937
12850B8035K416j747j07L546k318J173Q69l969L558M753L498l253l750L44J734
12835C4782n15K081l892o4K848J064m300L175N567N740n27Q27L810N808J999o554
12819E1849m481J834M444L047L524R312K527k754l236m831m475R13K607l041J40
12804E7379Q034M044j619J092P481M757M228J326M752P193P330J2385J2076n42
12790A29916k8931m2402l5648r109j946j9820j5148J111O686R628L598R141O827
12777A3903N916N254J144L584j264L860j395k007m681N02L549Q007R045N453O409
12762E7279k718r649j636O334L443M96n935l824L027O365l493M460q74Q10K076
$$ plain form
12866 12683 11019 9054 6394 7765 11306 9777 9836 10212 16826 17550 15670 21011 20572 18541 23098 28035
12850 28035 30451 28704 28597 32143 29825 30998 31867 27898 31456 36209 39707 36454 32704 33048 34782
12835 34782 34267 36348 32456 32392 35240 36304 32004 35179 40746 46486 45959 46786 50596 56404 58403 51849
12819 51849 47368 49202 53646 56693 60217 69529 72056 69302 66066 61235 56760 57673 60280 57239 57379
12804 57379 65413 69457 67838 68930 76411 81168 85396 86722 91474 98667 105997 118382 130458 129916
12790 129916 100985 58583 22935 13826 11880 -7940 -23088 -21977 -15291 -5663 -2065 7076 13903
12777 13903 19819 25073 26217 29801 28537 32397 31002 28995 24314 24816 28365 36372 45417 50870 57279
12762 57279 54561 44912 43276 49610 53053 53549 47614 43790 46817 53182 49689 54149 53275 54085 56161
12747E6161N076j837k737J973J847o89k059j41L906L33N490P048M84j1254L390
12732F6991L423j485N669J4026o45l602J17p94m458n357l984l983j531N220J660
12717G1267J2N222P312J090j930k661l423J708o63j974K63Q25L339L848m691L113
12701H2657M047m902k99L316l372k883O17L798k68p05M977k649k653K492L839
12686H8012Q042M258J544p456j000K712L033L776j972l645Q69M30J654J110M400
12671A05767L042l2n039o16M977l366k910N887l88l903L17P93k728L719O758j417
12655A10861n272l072J264J234O160j541m008l150j624M610q08p38L30L897K19
12640A08362m445l701J1504k728r63o4P34N808K623m296J091o807j135K252N918
$$ plain form
12747 56161 61237 59400 56663 58636 60483 59794 57735 57594 61500 61833 67323 74371 74855 63601 66991
12732 66991 70414 68929 74598 88624 87979 84377 84494 83700 79242 73885 69901 65918 64387 69607 71267
12717 71267 71279 76501 83813 84903 82973 80312 76889 78597 77934 75960 76223 77048 80387 84235 79544 82657
12701 82657 86704 81802 81503 84819 81447 78564 79181 82979 82711 82006 86983 84334 81681 84173 88012
12686 88012 96054 100312 101856 94400 93400 96112 99145 102921 100949 97304 98173 98603 100257 101367 105767
12671 105767 108809 108777 103738 103122 108099 104733 101823 107710 107322 103419 103736 104529 101801 105520 112278 110861
12655 110861 105589 102517 103781 105015 111175 109634 105626 102476 100852 105462 104654 103916 104246 108143 108362
12640 108362 103917 100216 111720 108992 108029 107965 108699 114507 117130 112834 113925 107118 105983 108235 114153
12625A14153j242N55p308n586L745Q411P773j138k984k227j021j268L477J1087
12611A26427J750l004J021J55N86k428m136M350O468M088k109j490P889M696K616
12596A46879j000j237l627r915n729r8k947o806p557j89K718k600P823N313L330
12581A24358L85L324O964p30p253k934L290M56n560K305m15M901O139k567K106
12566A34769p23P185P18j606q84o26J489p88P54J870n30l062k083K488j751r5
12550A37125N625L653J086j812j366J130L507n93r60J407K398K938k07q278p19
12535A44934N09N30K754o961J160J465J056K413L235K045j391j309q62K411O702
12520A58691p45m989r64O875J861k87P90m569Q701P556o254k209P811j143j570
$$ plain form
12625 114153 112911 113466 106158 100572 104317 112728 120501 119363 116379 114152 113131 111863 115340 126427
12611 126427 128177 125173 126194 126349 126935 124507 120371 124721 131189 135277 133168 131678 139567 144263 146879
12596 146879 145879 144642 141015 131100 125371 125273 122326 115520 107963 107774 110492 107892 115715 121028 124358
12581 124358 124743 128067 135031 134301 127048 124114 127404 127860 122300 124605 124190 129091 135230 132663 134769
12566 134769 134046 141231 141949 140343 139459 138833 140322 139534 140288 142158 141628 138566 136483 138971 137220 137125
12550 137125 142750 146403 147489 145677 144311 145441 148948 148355 147395 148802 151200 154138 153931 145653 144934
12535 144934 145443 145973 148727 141766 142926 144391 145447 147860 151095 153140 151749 150440 149578 151989 158691
12520 158691 157946 152957 151993 158868 160729 160442 161232 156663 165364 172920 166666 164457 172268 171125 169555
12505A69555j777l311q799q5k095N283P657O568o197l721M582J233r365k772N680
12490A62436O805P27k416j17M675o446K113j622O245Q218K96K624j729m533J280
12475A78556Q729j522l971K905N692o345q744M827M624j634r74l80k540L450O838
12460A89511m76K081L056n318l602J583M454K733K665k013r640o53P519K610n093
12445A89417l81L254J1812J2450k62q204k99J589l416J784q43J978L026k51R07
12430B12561J649J318P929K600m099k93P02O420R199l719o791o277N863O093N984
12415B39139l203M490J1317J2893Q575J0057J4575L127j7191m2767m9728l6118
12403A55166k4513j8876j3711q48N301Q29N761J7402J6504J641l41O780R075N48
$$ plain form
12505 169555 167778 164467 155668 155583 153488 158771 166428 172996 166799 163078 167660 168893 159528 156756 162436
12490 162436 169241 169968 167552 167435 172110 165664 167777 166155 172400 180618 180914 183538 181809 177276 178556
12475 178556 187285 185763 181792 184697 190389 184044 175300 180127 184751 183117 182143 181763 179223 182673 189511
12460 189511 189035 191116 194172 188854 185252 186835 191289 194022 196687 194674 185034 184381 191900 194510 189417
12445 189417 189036 192290 204102 216552 216290 208086 207787 209376 205960 207744 206901 208879 211905 211654 212561
12430 212561 214210 215528 223457 226057 221958 221665 222367 228787 237986 234267 227476 221199 227062 233155 239139
12415 239139 235936 240426 251743 264636 273211 283268 297843 300970 283779 241012 191284 155166
12403 155166 130653 111777 98066 97218 102519 103348 109109 126511 143015 144656 144315 151095 160170 160718
12389A60718p60j266l498J244q405o962j516j301n352q239J876Q284L804J914
12375A40541N158L547L902n080q41M860P631N882m125l856j03M062N514L208L12
12360A70612n741k445l368k985M191J654K860N390P527O181K317j035O833j042
12346A90949m219J737q26N141J287n967j571K776o05r83pj250K252m770k994R67
12330A81917m68r02P52L580M677M016M632K091m457M782L799m190k7L728J69N565
12314B09664j433p24K931K813L295m588j2855K779K646l21o14L373o111J113k794
12299A99174m728l263J24j282l041K684L382J909l797l82p56N559K550O597K402
12284B07132r71j038L239Q193O702M89M74m517n242m108o676N094Q969k064j226
$$ plain form
12389 160718 159958 158692 155194 156438 148033 141071 139555 138254 132902 124663 126539 134823 138627 140541
12375 140541 145699 149246 153148 148068 147227 152087 159718 165600 161475 157619 157516 161578 167092 170300 170612
12360 170612 164871 162426 159058 156073 160264 161918 164778 170168 177695 183876 186193 185158 191991 190949
12346 190949 186730 188467 187641 192782 194069 188102 186531 189307 188702 187719 187712 186462 188714 183944 180950 181917
12330 181917 181449 180547 181299 184879 189556 193572 198204 200295 195838 200620 204419 200229 200202 203930 204099 209664
12314 209664 208231 207507 210438 213251 216546 211958 199103 201882 204528 204207 203593 206966 200855 201968 199174
12299 199174 194446 191183 191307 190025 186984 189668 193050 194959 191162 190780 190024 195583 198133 204730 207132
12284 207132 206161 205123 208362 216555 223257 223746 224220 219703 214461 210353 203677 208771 217740 215676 214450
12269B14450L282M469K550O09k351l234m290l49P280J214j847n290m018j91L287
12254B15571N077O058M424j929l977L104K189k393j107L308r09o40o25p23k334
12239B25094J800P654K281p843L264n417K309K773p82j773L873M164n74L069J501
12224B41393m828o512K016P161j692o885J035N894K760j159L415r21k644P143
12210B46176M624k283l049n263j425Q19P675O615J315J895k087J919k102m703
12196B50126N835L778l441n719J180J779k804J882O29L649J082k983K573K557
12182B60123L126j0808L29L501J22J871m678O08Q068O699M168K115J382k871n750
12167B68005L187p83K104L643j40j942L345P398j317m985m615p43K191P27k589
$$ plain form
12269 214450 217732 222201 224751 225360 223009 219775 215485 215136 222416 223630 221783 216493 212475 212284 215571
12254 215571 220648 226706 231130 229201 225224 228328 230517 228124 227017 230325 229416 228776 228151 227428 225094
12239 225094 226894 234548 236829 228986 232250 226833 229142 231915 231133 229360 233233 237397 236823 239892 241393
12224 241393 236565 230053 232069 239230 237538 230653 231688 237582 240342 239183 242598 241677 239033 246176
12210 246176 250800 248517 245468 240205 238780 239599 247274 253889 255204 257099 255012 256931 254829 250126
12196 250126 255961 259739 256298 250579 251759 253538 250734 252616 253245 256894 257976 254993 257566 260123
12182 260123 263249 252441 252770 256271 256393 258264 253586 254194 262262 268961 273129 275244 276626 273755 268005
12167 268005 271192 270409 272513 276156 276016 274074 277419 284817 283500 278515 273900 273157 275348 276075 273486
12152B73486o27k54O521J2362P74k724l435M267J677K87M8K161J060M603N565
12137C05771n351m438J034K146j689O667j0J20N873O315j810n212M255m36L445
12122C16680M045l295K461N24J051N201Q336L835n004L177q724k840L578J199
12108C30224M90O297N773l5J748k508K406l27m345N761O791N528J2069J0055J3016
12093C92943J0852P325L557P392M893N48r783p852M679J1337J2435N098K624J4254
12079D60302L0732K8169K3647L4379N4532N9178O4141O9966K4676j15704k81471
12068D52547k60887j23646n6462p5681q7873l2210K0550N2261N5468M7513L3622
12057B5202K6767K0526J3883N497J2151K0215J4932L157J2696J7847Q470L77J390
$$ plain form
12152 273486 272859 272605 279126 291488 292262 289538 286103 290370 292047 292334 292382 294543 295603 300206 305771
12137 305771 300420 295982 297016 299162 297473 304140 304130 304250 310123 316438 314628 309416 313671 313235 316680
12122 316680 320725 317430 319891 320415 321466 326667 335003 338838 333834 337011 328287 325447 329025 330224
12108 330224 330714 337011 342784 342749 344497 341989 344395 344068 339723 345484 352275 357803 369872 379927 392943
12093 392943 403795 411120 414677 422069 426962 427510 417727 409875 414554 425891 438326 443424 446048 460302
12079 460302 491034 519203 542850 577229 631761 690939 755080 825046 849722 734018 452547
12068 452547 191660 68014 11552 -64129 -152002 -184212 -163662 -111401 -55933 -8420 25202
12057 25202 51969 72495 86378 91875 104026 124241 139173 142330 155026 172873 181343 181720 183110
12044A83110L996O048J2864P613r3O978Q439m81k329N82K545L281Q029N822L836
12029B50240M512N910R801N785j227J517l041p9Q323R375k024m135J537M027N249
12014B95770O019M881L588j3k722P190J4338R052O667Q264R039R95p169O317J0655
11999C72871K922M112J3484Q224N724J5427J1185R904J1765J3597J089Q466J2387
11986D91157J8429K4224L6129L4859M5071M7834O0568P4671R4123O3479m8475
11975I42069j84117k59483k72805k26514j61994j14919p8707m0568R052N2108
11965c35878O3518O4620M6865L9065M0106K9025J9362J8848J9504J3179O370L615
11953B8199J2693J1089O769J1352Q106Q862J2855J0992O816K814k09M822J1852
$$ plain form
12044 183110 187106 193154 206018 213631 213538 220516 228955 228474 226145 226727 229272 232553 240582 246404 250240
12029 250240 254752 260662 270463 276248 275021 276538 273497 273418 281741 291116 289092 284957 286494 290521 295770
12014 295770 301789 306670 310258 310245 307523 314713 329051 338103 344770 353034 362073 363068 355899 362216 372871
11999 372871 375793 379905 393389 401613 407337 422764 433949 443853 455618 469215 470304 478770 491157
11986 491157 509586 533810 569939 604798 649869 697703 758271 832942 927065 990544 942069
11975 942069 757952 498469 225664 -850 -162844 -277763 -356470 -397038 -387986 -335878
11965 -335878 -272360 -207740 -160875 -121810 -81704 -52679 -33317 -14469 5035 18214 24584 28199
11953 28199 40892 51981 58750 70102 78208 87070 99925 110917 117733 120547 120338 125160 137012
11940A37012P754J987M344M557m30K093M95J929M191N873K457J349N824N534k808
11925A82161M415P116J600P14n540Q49O36J486Q25L17k411l808l848Q16O21R562
11909A95511R226K514Q014M984k311M551Q561O434k731j70K258k382j589l611
11895B29259k584M654Q523j197o866j513K18P643l094O991P238n621k617J65O752
11880B47951J26J15N455J281j128M641J78l567J761O71k716k373m8K72l105N82
11864B50096L349k089k749n134P213P782K072j439l014p20o072P036J004k977
11850B54358R12n586j078l49P352J0499Q81M864K298l860K811k107l629j509P068
11835B72925L670j3904j16N571R179J08n038o721L115L503P654L593k746k300
$$ plain form
11940 137012 144766 146753 151097 155654 155224 157317 157812 159741 163932 169805 172262 173611 179435 184969 182161
11925 182161 186576 193692 195292 196006 190466 191315 191951 193437 194262 194579 192168 188360 184512 185328 185949 195511
11909 195511 204737 207251 215265 220249 217938 222489 231050 237484 234753 234583 236841 234459 232870 229259
11895 229259 226675 231329 239852 238655 231789 230276 230494 238137 235043 242034 249272 243651 241034 241199 247951
11880 247951 248077 248192 253647 254928 253800 258441 258619 255052 256813 257484 254768 252395 252347 252619 249514 250096
11864 250096 253445 251356 248607 243473 250686 258468 260540 259101 256087 255367 249295 256331 257335 254358
11850 254358 255270 249684 248606 248257 255609 266108 266989 271853 274151 270291 273102 270995 267366 265857 272925
11835 272925 276595 262691 262575 268146 277325 277433 272395 265674 268789 272292 279946 283539 280793 278493
11821B78493K999o99K246M736j468k402m300n027k411N763P25J122J694P99k373
11806B79897K096O78m430K582J69N045K756k58J203M570k26J19J358L384m339
11791B94604j266M477R1q367q716K681K447M390O627l563L85L09L019M993q18
11776C01293N72j821n105J062J60J031N769n18j06o789j086N304O894P885r26
11761C13619r55j242k09r356q26p6M426j007K631J392O638l414p34L387R7Q72
11745C15243k381m918j602M156Q434N673J675j63q39p323k423k799J163k467N214
11730C16643R399R19l633k741k165oN04N956K314q17J390p59l418k987J613m47
11714C21765k369j889P529N877J31m16j281n685j0396Q26N392O844K890K457j899
$$ plain form
11821 278493 281492 280793 283039 287775 286307 283905 279605 274578 272167 277930 278655 279777 281471 282270 279897
11806 279897 281993 282671 278241 280823 280992 286037 288793 288535 289738 294308 294082 294201 295559 298943 294604
11791 294604 293338 297815 297906 289539 280823 283504 285951 290341 296968 293405 293790 294099 297118 302111 301293
11776 301293 301865 300044 294939 296001 296161 297192 302961 302443 302337 295548 294462 299766 306660 314545 313619
11761 313619 312664 311422 311213 301857 301031 300955 305381 304374 307005 308397 315035 311621 310887 314274 314371 315243
11745 315243 312862 307944 306342 310498 318932 324605 326280 326117 325278 317955 315532 312733 313896 311429 316643
11730 316643 326042 326961 323328 320587 318422 318416 318920 324876 327190 326373 327763 327004 323586 320599 322212 321765
11714 321765 319396 317507 325036 330913 331044 330628 329347 323662 313266 314092 319484 326328 329218 331675 329776
11699C29776Q78K590J542l524P69P292J722N155p263o439l012r76n051l720K326
11684C22065O611P087O831o828k241K817j552l87l743L304N211Q22l37N454j350
11669C43764j832J860O192K696K252N80j655l73J216p418q747P1R780K627j0019
11654C40994o723M123L553L404J122K511m248o092l794L002M243L578J300N371
11640C52344J325J27n336k067J85R227L787L504L539n575l329P35Q13j478l839
11625C53962J183L106J02m548K018N401k787n017L942M671J533J263M413j73o86
11610C68383o50l165o603M91M400n903o740n865M915Q223M579P259L870M029K603
11595C79826m082l649l427N879j268n274j345j979J33J674K516K123L826n30j358
$$ plain form
11699 329776 330654 333244 334786 331262 332031 339323 341045 346200 338937 332498 329486 328510 323459 319739 322065
11684 322065 328676 335763 342594 335766 333525 336342 334790 334403 330660 333964 339175 339997 339660 345114 343764
11669 343764 341932 343792 349984 352680 354932 355512 353857 353484 354700 347282 338535 338606 348386 351013 340994
11654 340994 334271 338394 341947 345351 346473 348984 344736 338644 334850 337852 342095 345673 346973 352344
11640 352344 353669 353796 348460 346393 346578 355805 359592 363096 366635 361060 357731 358466 359279 357801 353962
11625 353962 355145 358251 358353 353805 355823 361224 358437 353420 357362 362033 363566 364829 369242 369069 368383
11610 368383 367733 364568 357965 358456 362856 356953 350213 344348 349263 357486 362065 369324 373194 377223 379826
11595 379826 375744 372095 368668 374547 373279 368005 366660 364681 364814 366488 369004 371127 374953 374423 373065
11580C73065O821K855J051p72m407l207J605O782j020N14m317k287J234M783m245
11565C78455M874P414k388n840p514l878j473K663N776N053J568k118k213L400
11551C83779r95j139j413L14L198M719L349J634L894L67p493K916P620k984o685
11536C91081K099l93J47M014k144L777k400m072p17N592R807K304r437q346p018
11521C84294O4q20L730m4j712j18k903K424O801k37n254J61Q929Q205L7L976J551
11504D09084r55o933m72N578j538p958k431O306N293K393J234j926N293K818q972
11489D06814q237M408K184J800L215K064m068J028N735K180k155o813m447n43
11475D03165k370L795P577K482j802m012N420K716k877o19R105K659m519k027
$$ plain form
11580 373065 379886 382741 383792 383020 378613 375406 377011 383793 382773 383287 378970 376683 377917 382700 378455
11565 378455 383329 390743 388355 382515 375001 371123 369650 372313 378089 383142 384710 382592 380379 383779
11551 383779 382784 381645 380232 380546 383744 388463 391812 393446 397340 397707 390214 393130 400750 397766 391081
11536 391081 393180 392787 392934 396948 394804 398581 396181 392109 391392 396984 406791 409095 399658 391312 384294
11521 384294 384358 383538 387268 387224 385512 385394 382491 384915 391716 391479 386225 386386 395315 403520 403557 407533 409084
11504 409084 408129 401196 400724 406302 404764 396806 394375 400681 405974 408367 409601 407675 412968 415786 406814
11489 406814 398577 402985 405169 406969 410184 412248 408180 409208 414943 417123 414968 408155 403708 403165
11475 403165 400795 404590 412167 414649 412847 408835 414255 416971 414094 413475 422580 425239 420720 418693
11461D18693p039j194j484o712L33L330L388M848N47O817M627K056n220j1314
11447D11676J052J1338J164P524K757r930p271o589M254R760L746j3321l409L652
11433D16403M506N666j741n659l877l261o67K832L951K511M57r85L153K149K660
11418D28098M169Q95l314K306L565O156j985l132R3O338k980n886o538K593K816
11403D33194K824j642k48L363P47O79o503m847N461L845l65l596M674L211K363
11388D43160l424J958J54R1J39N926N856O5J160k17l381J259J14k486k156o8m161
11371D43989j858p35N850j81k545p31L591K012p091N809O894l30O826P347j433
11356D67414o923o538m362p96n303J80J280L164J0361q410m891Q616P481N299
$$ plain form
11461 418693 411654 410460 408976 402264 402597 405927 409315 414163 414710 421527 426154 428210 422990 411676
11447 411676 412728 424066 425230 432754 435511 425581 418310 411721 415975 425735 429481 416160 412751 416403
11433 416403 420909 426575 424834 419175 415298 412037 411370 414202 418153 420664 421121 420136 423289 425438 428098
11418 428098 432267 433162 429848 432154 435719 441875 439890 436758 436851 443189 440209 434323 427785 430378 433194
11403 433194 436018 434376 434128 437491 438238 438917 432414 427567 433028 436873 436508 432912 437586 440797 443160
11388 443160 439736 441694 441848 441939 442078 448004 453860 453925 455085 454868 451487 452746 452860 450374 448218 448150 443989
11371 443989 442131 441396 447246 447065 444520 443789 447380 449392 442301 448110 455004 454674 461500 468847 467414
11356 467414 460491 453953 449591 448795 443492 443672 444952 448116 458477 450067 445176 453792 461273 466572
11342D66572L13j932o867l599K569J066J403Q786L067l816l987m751O681j597
11328D63908o522j546l518j28R863r08o979n00P720M200J840N29k319m316j635
11313D59689L458K597L064M464O42K85l907J022Q205M794K094l211o254M44J252
11298D78638j289o652k596n46M651J618J144n026n927N55M82L06O381J2560O29
11283D84928q249j0558j514J974J743Q18M06L372l78m591n79K986J2525N618k235
11268D86266n874l365N005J542P36J180j702j032K686j530J43J96O7K375K819
11253D89512k840K189k252M43K477M846N591l046j4039p157l18r48L646Q010j237
11238D84877L023M767k985j341K200o91j253L021M850n24m689M864R677k4j941
$$ plain form
11342 466572 466885 464953 458086 454487 457056 458122 459525 468311 471378 467562 463575 458824 465505 463908
11328 463908 457386 455840 452322 452194 462057 461149 454170 453670 461390 465590 467430 467959 465640 461324 459689
11313 459689 463147 465744 468808 473272 473914 474199 470292 471314 479519 484313 486407 483196 476942 477386 478638
11298 478638 477349 470697 468101 467555 472206 473824 474968 469942 464015 464570 465052 465358 471739 484299 484928
11283 484928 476679 466121 464607 466581 468324 469142 469548 472920 472542 467951 467372 470358 482883 488501 486266
11268 486266 480392 477027 482032 483574 484310 485490 483788 482756 485442 483912 484055 484251 484318 486693 489512
11253 489512 486672 488861 486609 487052 489529 494375 499966 496920 482881 475724 475406 474458 478104 486114 484877
11238 484877 487900 492667 489682 488341 490541 489850 488597 491618 496468 495944 491255 496119 505796 505772 503831
11223E03831L92l969M451j717j504m61K684M557k709J683j907J887j476K067M073
11208E11882M913l266j783K402Q579J313r26m525J931k566l158K66K444k012K076
11193E17570N010l762q51L713k186k912l572n795o011m034L25n89K767Q902O452
11178E15027Q99p082l381j755L795L695P204J297M33r75k438n146m26O130o77
11163E16600n462R46J971k688O037J0057P199l092j422K92L848n121n281j00L296
11148E27080N263m021m891K347j202q04M639K539J699k324o644n15O074N251k996
11133E31495n024M236m066L414P20L389m373M179N551j024j0373K037J039J920
11119E33120N610M370m085o85m004n24l84O336J894m416J498O360j955j027N552
$$ plain form
11223 503831 504223 500254 504705 502988 501484 501023 503707 508264 505555 507238 505331 507218 505742 507809 511882
11208 511882 516795 513529 511746 514148 522727 524040 523114 518589 520520 517954 514796 515062 517506 515494 517570
11193 517570 522580 518818 517967 521680 519494 516582 513010 507215 501204 497170 497495 496906 499673 508575 515027
11178 515027 515926 508844 505463 503708 507503 511198 518402 519699 520132 519157 516719 511573 511147 517277 516600
11163 516600 511138 512084 514055 511367 517404 527461 534660 531568 530146 530438 534286 529165 523884 523784 527080
11148 527080 532343 528322 523431 525778 524576 523772 528411 530950 532649 530325 523681 523166 529240 534491 531495
11133 531495 526471 530707 526641 530055 530775 534164 529791 533970 539521 538497 528124 530161 531200 533120
11119 533120 538730 543100 539015 538330 534326 533802 533418 539754 541648 537232 538730 545090 543135 542108 547660
11104E47660M000N10J699m906q919k068L740L121O18j357l41L128k869j530O444
11089E48930K021r59r40Q53J491L558L277p295n65Q059l901p441q785O349J0074
11074E54726k216N422n416m640L224n127m473K430K699N6R333O606R026J930j406
11059E72174K140o837n059p75N661N064M880O580n006j2220l680Q35L431n30J441
11044E68099k751K570P001M436J1o160k608k583k760o287l498O108J0274L165
11030E75017k859M135k201j445R612J072k262n393J513P86l022J312R26k077M354
11015E79468N803m16p93k655O181K37K749j645M35M489m115l477l223l81M672
11000E87329M683R69O0l969M566p79o164j094J281K134P042K843L17n086K83K184
$$ plain form
11104 547660 551660 552170 553869 548963 540044 537976 541716 544837 545455 544098 543757 546885 544016 542486 548930
11089 548930 550951 549992 549052 549905 551396 554954 558231 550936 550371 558430 554529 547088 538303 544652 554726
11074 554726 552510 557932 552516 547876 551100 545973 541500 543930 546629 546685 556018 562624 571650 573580 572174
11059 572174 574314 567477 562418 561643 567304 572368 577248 583828 578822 566602 562922 563757 567188 566658 568099
11044 568099 565348 567918 574919 579355 579366 573206 570598 568015 565255 558968 555470 561578 571852 575017
11030 575017 572158 576293 574092 572647 582259 583331 581069 575676 577189 577975 574953 576265 577191 575114 579468
11015 579468 585271 584855 584062 581407 587588 587825 590574 588929 589364 593853 589738 586261 583038 582657 587329
11000 587329 592012 592981 593041 589072 593638 592859 586695 585601 586882 589016 596058 598901 599218 594132 594415 596599
10984E96599N10Q25N353O639Q03m840K03k528j230J982P22m335L778L488K264
10969F10233n938M108M899m246K198M8J016r56k879m155J257J437N24M44R454
10954F17444O880K393j5193o524K155j890m160p5R189k74k5K06K756J1047M8l966
10938F20011n215M090k093L264O026L133l086J85l803l910j793K374J347K41j76
10923F20595P134n124l108j3P492K373n106l89k94J851M848N765m257q83Q471
10908F39355O615J094j0909k265K013K976J274m895O127l514j907l690p283l248
10894F21743Q039L099M573m096L060P428R103r50n780n790j202n92m97p32m110
10879F33296M83O428Q82M568j327K090J669j014j3K754n04n842m824J020J1076
$$ plain form
10984 596599 597109 597934 603287 609926 610729 605889 606092 603564 602334 604316 605038 600703 604481 607969 610233
10969 610233 604295 608403 613302 609056 611254 611302 612318 611362 608483 604328 605585 607022 607546 607990 617444
10954 617444 624324 626717 611524 605000 607155 605265 601105 601030 610219 609945 609920 610126 612882 623929 623977 620011
10938 620011 614796 618886 616793 620057 626083 629216 626130 626315 622512 618602 616809 619183 620530 620771 620595
10923 620595 627729 622605 619497 619484 626976 629349 624243 623854 623560 625411 630259 636024 631767 630884 639355
10908 639355 645970 647064 636155 633890 635903 638879 640153 635258 641385 637871 635964 632274 624991 621743
10894 621743 629782 632881 637454 633358 636418 643846 652949 651999 646219 640429 639227 638635 638138 637406 633296
10879 633296 633779 640207 641089 645657 644330 646420 648089 647075 647062 649816 649312 643470 638646 639666 650742
10864F50742M636M091K855j418L529J076l24K81l377l367L179M508q26m670L03
10849F61218P494L595j508l353O795L039k034r855o001j013N939M736N409p63
10835F73698m68m12l202P69N957k022n991k61M321J261J429j191o396n163l334
10820F58995N886O050M967J492J604l672j949L106M605k328j920l33k539P42L262
10805F77968J1807M444p997l399o8J252K791J136k18k413J374l229M119R21P087
10790F95575L074n404q52Q805J387m475M02j572k036J608K907j64j186m294j248
10775F92527M869j588N647L896l97J81O430N80L286L009j1268j959Q256k249o893
10760G04327N777O35N81N986K971k292J755k532m895L835L607o630M457J057m388
$$ plain form
10864 650742 655378 659469 662324 660906 664435 665511 665187 665468 662091 658724 661903 666411 665585 660915 661218
10849 661218 668712 672307 670799 667446 674241 677280 675246 665391 659390 658377 664316 669052 674461 673698
10835 673698 673230 672818 669616 670385 676342 674320 668329 668068 672389 673650 675079 673888 667492 662329 658995
10820 658995 664881 670931 675898 677390 678994 675322 673373 676479 681084 678756 676836 676503 673964 674706 677968
10805 677968 689775 694219 686222 682823 682755 684007 686798 687934 687716 685303 686677 683448 687567 688488 695575
10790 695575 698649 693245 692393 701198 702585 698110 698512 696940 694904 696512 699419 699255 698069 693775 692527
10775 692527 697396 695808 701455 705351 704954 705135 711565 712145 715431 718440 707172 705213 713469 711220 704327
10760 704327 710104 710739 711320 717306 720277 717985 719740 717208 712313 716148 719755 713125 717582 718639 714251
10745G14251n050N203K308n630m431J387J51k44q45O804O969n298l97P02O458
10730G22338J2918O964m911l087Q50L647Q34J520P82l625q94o654p754j729N828
10715G27027L803J793l137l489L185N496L327n338K528P921K263o178q135Q97
10701G31963O097M045L724j757k108n884J342L701L514k807M939J1215K465K819
10687G63268j561O77M072p881k439j869k071K008m548M15p61M373M6m091K877
10672G52515M555j240k669M03M427K637r11n229o263J170M885L193P660Q535o276
10657G67392k84m152k064O036K898J182N62l449m167k855O561M718M275K108j225
10642G77536L631L214l948n748k245L918Q461J0044q08o55K167j945M484l683
$$ plain form
10745 714251 709201 714404 716712 711082 706651 708038 708189 707945 707100 713904 720873 715575 715178 715880 722338
10730 722338 735256 742220 737309 734222 735072 738719 739553 741073 741855 738230 737336 730682 722928 721199 727027
10715 727027 730830 732623 729486 725997 729182 734678 738005 732667 735195 743116 745379 739201 731066 731963
10701 731963 738060 742105 745829 744072 741964 736080 737422 741123 744637 741830 746769 757984 760449 763268
10687 763268 761707 762384 766456 758575 756136 754267 752196 754204 749656 750071 749310 753683 753729 749638 752515
10672 752515 757070 755830 753161 753564 757991 760628 759717 754488 748225 749395 754280 757473 765133 773668 767392
10657 767392 767108 762956 760892 766928 769826 771008 771570 768121 763954 761099 767660 772378 776653 778761 777536
10642 777536 781167 784381 780433 774685 772440 776358 784819 794863 794055 793400 795567 793622 798106 794423
10628G94423Q73K753J841n934k743k729k334K177j673m197j878J486M198N098
10614G91361J872j473j016Q04Q046M384L92K898K338m361r989l501O989J287M281
10599H04312K593M691k259m242M304M585R0j1545k459J4524P704n479n149k056
10585H09614L381k166K714K018L571Q131J2555L266j1381m498j275n414m288J693
10571H17921M698M717O277r76K207N144r160j1389M230N092N088l292J893l28
10557H32122N434k943n137Q777R23m554j300P093M656r04J177k828M787P663N161
10542H60127p783m249k204K15P475M447j370l044q4K990L95J706L532P03k15o518
10526H56123k233l386j992M46k759j515L345M504J743k818l971L500n21j951N812
$$ plain form
10628 794423 795296 798049 799890 793956 791213 788484 786150 788327 786654 782457 780579 782065 786263 791361
10614 791361 793233 791760 790744 791548 799594 803978 804370 807268 809606 805245 795256 791755 798744 800031 804312
10599 804312 806905 811596 809337 805095 809399 813984 814074 802529 800070 814594 822298 816819 811670 809614
10585 809614 812995 810829 813543 815561 819132 827263 839818 843084 831703 827205 825930 820516 816228 817921
10571 817921 822619 827336 833613 832637 834844 839988 830828 819439 823669 828761 833849 830557 832450 832122
10557 832122 837556 834613 829476 838253 839176 834622 833322 840415 845071 844167 845344 842516 847303 854966 860127
10542 860127 852344 848095 845891 846106 853581 858028 856658 853614 853530 856520 856915 858621 862153 862856 862641 856123
10526 856123 853890 850504 848512 848958 846199 844684 848029 852533 854276 851458 847487 850987 850466 848515 854327
10511H54327M419j828m540K362P341M991k913N648K114J767N445R97m477J016
10497H76669p914m865L760O579N589j935N143K300O538P387K488j956o53j125
10483H98005M6p037L43O323Q38M659O809j673J300l199P7l002k570O382Q163m380
10467I11084n663o45P158L448N96K495m971O902J836k520r11k31p1N818j375n237
10451I17713K897P780J939P86P418O274K265M000O140N749L491O495O318k02l453
10436I75610j09J535R24n783o771o462m724j1916j0459m101j0554m587M5j096
10422I11552J379m392m494J164N849Q341O624M302L23K911l452J901N782n885
10408I31905K176M904j583q337p95j509J934P8m870K071P328N480j141o169L125
$$ plain form
10511 854327 858746 856918 852378 854740 862081 867072 864159 869807 871921 873688 879133 880130 875653 876669
10497 876669 868755 863890 867650 874229 879818 877883 883026 885326 891864 899251 901739 899783 899130 898005
10483 898005 898051 891014 891357 897680 898518 903177 909986 908313 909613 906414 906491 903489 900919 907301 915464 911084
10467 911084 905421 904776 911934 915382 915978 918473 913502 920404 922240 919720 918809 918578 918507 924325 922950 917713
10451 917713 920610 928390 930329 931115 938533 944807 947072 951072 957212 962961 966452 972947 979265 979063 975610
10436 975610 975501 977036 977960 972177 965406 958944 954220 942304 931845 927744 917190 912603 912648 911552
10422 911552 912931 908539 904045 905209 911058 919399 926023 930325 930648 933559 930107 932008 937790 931905
10408 931905 934081 938985 937402 929065 928270 926761 928695 928773 923903 925974 933302 938782 937641 931472 934597
10393I34597M048Q273J482j666k856j958l599l43L415N729P568J3556J342r083
10379I60505P06J2278M421l545M199k280k054l977K167L243K968L716k445l338
10365I76564L985O024O884M550M946K720k492r529l767O91M675O014K698p60k904
10350A000299M917l659L032L769J859j449q8o61J408N749J7266P03r692k4586
10336I98867j7418o244l721m804o991k186M136M753P914M936Q428L338J758k47
10322I92519l37J1546M953k992k964Q60j993L891J0933J943m883o074L100Q901
10308A019403O723K430N455j86l336K124O769M595K376q339m189N694J318J50
10294A040987k723N355L155j0782n373L671Q401L709k863m2J660K240o45L624
$$ plain form
10393 934597 938645 946918 948400 946734 943878 941920 938321 937978 941393 947122 954690 968246 969588 960505
10379 960505 961211 973489 977910 974365 978564 976284 974230 970253 972420 975663 978631 982347 979902 976564
10365 976564 980549 986573 993457 998007 1002953 1005673 1003181 993652 989885 990576 995251 1001265 1003963 1003203 1000299
10350 1000299 1005216 1001557 1004589 1008358 1010217 1008768 1008680 1008019 1009427 1015176 1032442 1033145 1023453 998867
10336 998867 981449 975205 971484 966680 959689 957503 961639 966392 974306 979242 987670 991008 992766 992519
10322 992519 992182 1003728 1008681 1005689 1002725 1003585 1001592 1005483 1016416 1018359 1013476 1007402 1010502 1019403
10308 1019403 1026126 1028556 1034011 1033825 1030489 1032613 1039382 1043977 1046353 1038014 1033825 1039519 1040837 1040987
10294 1040987 1038264 1043619 1046774 1035992 1030619 1034290 1042691 1046400 1043537 1043495 1045155 1047395 1046750 1050374
10280A050374K73L353N937j677m323n327O407J1314L12M936M416L762m488k398
10266A072871K887n088M117R367N375n10o662M748k063J470L749N760j85j827
10252A094009R43L272r61m033K592J0774L542m65Q96r489J80O615K254m122j226
10237A104781N565R042k967j74o766P427P129K427N260O909P578j700m761l290
10223A136460j269o24J820O592M276k509n60m833M264M419K662K727j331O214
10209A158308K100N350M159p19J547K078k617R9q83O136N453J126m188L534K673
10194A184156o338n181P04L65m111P144J1032K015K7K145K435O03M109J13J558
10179A200776M265k328R80K449K37K045m646O734P023K827m742J097N299P486
$$ plain form
10280 1050374 1050647 1054000 1059937 1058260 1053937 1048610 1055017 1066331 1066643 1071579 1075995 1079757 1075269 1072871
10266 1072871 1075758 1070670 1074787 1084154 1089529 1089019 1082357 1087105 1085042 1086512 1090261 1096021 1095836 1094009
10252 1094009 1094952 1098224 1097263 1093230 1095822 1106596 1110138 1109673 1110569 1101080 1101260 1107875 1110129 1106007 1104781
10237 1104781 1110346 1119388 1116421 1116247 1109481 1116908 1124037 1126464 1131724 1138633 1146211 1144511 1139750 1136460
10223 1136460 1135191 1134567 1136387 1142979 1147255 1144746 1144186 1139353 1143617 1148036 1150698 1153425 1152094 1158308
10209 1158308 1160408 1165758 1169917 1169198 1170745 1172823 1170206 1170305 1169422 1175558 1181011 1182137 1177949 1181483 1184156
10194 1184156 1177818 1172637 1173341 1173706 1169595 1176739 1187771 1189786 1189813 1191958 1194393 1194996 1199105 1199218 1200776
10179 1200776 1205041 1202713 1203693 1206142 1206379 1208424 1203778 1210512 1217535 1220362 1215620 1216717 1222016 1229502
10165A229502n16n398M558J653M58N472N979j143m78Q67N562P846k083j02j866
10150A250311K470N973J1099N302k452L273r332j0493L82O836J2448M098K067
10137A281982Q840O835L403l33n530l741k613L136L668J362J718K010O874J645
10123A309256K875M541m32Q30J647M200N108l563M078J2604O878K268J950k659
10109A349581m559O243N105J0996R777j25k171K96o005K596L688J763M642R464
10095A391291P998j342J102O080O170N510L642k899l588m104l432K329Q829R033
10081A426619K228O706j379l051m615R53P982J2126L252L019O686q06j035L387
10067A462072K275R839P243O055M303K114N385K779J2514R607R522R252L997O091
$$ plain form
10165 1229502 1228986 1223588 1228146 1229799 1230257 1235729 1241708 1240565 1240087 1240954 1246516 1254362 1252279 1252177 1250311
10150 1250311 1252781 1258754 1269853 1275155 1272703 1275976 1266644 1256151 1256533 1263369 1275817 1279915 1281982
10137 1281982 1290822 1297657 1301060 1300727 1295197 1291456 1288843 1291979 1295647 1297009 1298727 1300737 1307611 1309256
10123 1309256 1312131 1316672 1316240 1317070 1318717 1322917 1328025 1324462 1328540 1341144 1348022 1350290 1352240 1349581
10109 1349581 1345022 1351265 1356370 1367366 1377143 1377018 1374847 1375143 1369138 1371734 1375422 1377185 1381827 1391291
10095 1391291 1399289 1397947 1399049 1405129 1411299 1416809 1420451 1417552 1413964 1409860 1406428 1408757 1417586 1426619
10081 1426619 1428847 1435553 1434174 1431123 1426508 1427461 1435443 1447569 1450821 1453840 1460526 1459720 1458685 1462072
10067 1462072 1464347 1474186 1481429 1487484 1491787 1493901 1499286 1502065 1514579 1524186 1533708 1542960 1546957 1553048
10053A553048P656Q836J485K37M938O475L735P177L130P147L78r05L642J1233
10039A618212P450N900Q704O424K175M787N378R453J4225R586M291M951O933K020
10025A710489J3822J4703Q748J0754Q425J2184J1824J625j614O833J3303K0059
10013A831155J5958Q457j428l732O841K682J575J4434J7039J9456L528m841n593
10000A905531P177J3385J6127J6266J6790J9707J7252K2487K5712L0450K0299
9989B111183K7261L1720L1595L6495K7748L5248M9206M9767N7154N4118P1278
9978B582773P9011Q9631J15236J26990J06147M506j93298l59273l25686j79235
9968B046802q3768p3883o2789N350R2983J32095J45865J45903J43003J52028J59607
$$ plain form
10053 1553048 1560704 1569540 1571025 1571262 1576200 1582675 1586410 1593587 1596717 1603864 1604242 1603337 1606979 1618212
10039 1618212 1625662 1631562 1640266 1646690 1648865 1653652 1659030 1668483 1682708 1692294 1696585 1701536 1708469 1710489
10025 1710489 1724311 1739014 1747762 1758516 1766941 1779125 1790949 1792574 1790960 1797793 1811096 1831155
10013 1831155 1847113 1855570 1854142 1850410 1857251 1859933 1861508 1875942 1892981 1912437 1915965 1911124 1905531
10000 1905531 1912708 1926093 1942220 1958486 1975276 1994983 2012235 2034722 2060434 2090884 2111183
9989 2111183 2138444 2170164 2201759 2238254 2266002 2301250 2350456 2400223 2457377 2511495 2582773
9978 2582773 2661784 2751415 2866651 2993641 3099788 3104294 2910996 2551723 2226037 2046802
9968 2046802 1963034 1889151 1826362 1831712 1924695 2056790 2202655 2348558 2491561 2643589 2803196
9957B803196J72100J87808J79334P4874j71123l67945l20455j40537l9620l4590
9947B343042m052Q9201J81015K14647J99775J96224K34320K78825L21055L67929
9937D421981M41088N51768O82247Q24784R05893N58769p53395k675780l467575
9928A489780k575867j340026r65363j070288p82416p0395M86359O66903O18156
9919c543157N13719M20607L39035K85078K41899K07802J91094J60918J48110J34877
9909i00018J13975R3759P4687O5884O7822P3577O6312N8996N4264N9060O2205
9898a09477M7511M1534L4695L7689L8576L9184L9089L4277L0056K6542K8711K9590
9886C17977K6335K6919K5746K6432J6691J6499J8301K1264K1099J8911J8649K0873
$$ plain form
9957 2803196 2975296 3163104 3342438 3417312 3246189 2878244 2557789 2417252 2377632 2343042
9947 2343042 2338990 2428191 2609206 2823853 3023628 3219852 3454172 3732997 4054052 4421981
9937 4421981 4863069 5414837 6097084 6921868 7827761 8386530 7633135 4957355 1489780
9928 1489780 -1086087 -2426113 -3391476 -4461764 -5244180 -5314575 -4828216 -4161313 -3543157
9919 -3543157 -3029438 -2608831 -2269796 -1984718 -1742819 -1535017 -1343923 -1183005 -1034895 -900018
9909 -900018 -786043 -692284 -617597 -551713 -483891 -410314 -344002 -285006 -230742 -171682 -109477
9898 -109477 -61966 -20432 14263 51952 90528 129712 168801 203078 233134 259676 288387 317977
9886 317977 344312 371231 396977 423409 440100 456599 474900 496164 517263 536174 554823 575696
9874E75696J8008J4204J8055K2486K0913K3125J2915J0281J0562K4614K3503K5482
9862G99844K5778K9604L2139L9967L6798L0598j5148q4714j07581p8362m2315
9851F66608j6464k4838j7022P869K5229K7143K4640K4102J7853P653J5056J1468
9839G69297J2157J5368J7421Q757J0123J1321K0755R664j634J3221J0795J3323
9827I10568O454J0279R944K552N202O939J0740O699J429M014P763O326M434M161
9813I97504R681L117M40P461P229J3117K659k712R901J3489O579M56n7N103K836
9798A076803k52K376k493M94N933N815K816K290N444Q983k301N555P653J603N753
9783A126472K428K519J063M585N995R369N310N418L543K830J469N007Q424k855
$$ plain form
9874 575696 593704 607908 625963 648449 669362 692487 705402 715683 726245 750859 774362 799844
9862 799844 825622 855226 887365 927332 964130 994728 979580 894866 787285 708923 666608
9851 666608 650144 625306 608284 616153 641382 668525 693165 717267 735120 742773 757829 769297
9839 769297 781454 796822 814243 823000 833123 844444 865199 874863 873229 886450 897245 910568
9827 910568 917022 927301 937245 939797 944999 951938 962678 969377 970806 974820 982583 988909 993343 997504
9813 997504 1007185 1010302 1010742 1018203 1025432 1038549 1041208 1038496 1048397 1061886 1068465 1068921 1068864 1073967 1076803
9798 1076803 1076551 1078927 1076434 1076928 1082861 1088676 1091492 1093782 1099226 1108209 1105908 1111463 1119116 1120719 1126472
9783 1126472 1128900 1131419 1132482 1137067 1143062 1152431 1157741 1163159 1166702 1169532 1171001 1176008 1184432 1181577
9769A181577P79R081O445O810J103N418R496m917l266K899O676O227Q849o19n606
9754A230952J0037R810k406K612O993L576K083N603l024j926P633R319M644K100
9740A288006J102K228L534j084L309M095K938M905P878L933k334n503N801O754
9726A325562M121J150K772k625j218K409M099N187O521P403K701N908L543J552
9712A369085K254J190N757M233N193L476j402M913j126L818K280m320K986M998
9698A403335L453N181k65J172L536m27K387J0837O583M8M40L375J415J0056N603
9683A456729k042K524p24O397K205k128K905K139K261R679J2091R87k839j79K235
9668A492240M024j206K601k914k212O96Q958N053M199J680Q083N437K795K537
$$ plain form
9769 1181577 1182356 1191437 1197882 1204692 1205795 1211213 1220709 1215792 1212526 1215425 1222101 1228328 1237177 1236558 1230952
9754 1230952 1240989 1250799 1248393 1251005 1257998 1261574 1263657 1269260 1266236 1264310 1271943 1281262 1285906 1288006
9740 1288006 1289108 1291336 1294870 1293786 1297095 1301190 1304128 1309033 1316911 1320844 1318510 1313007 1318808 1325562
9726 1325562 1329683 1330833 1333605 1330980 1329762 1332171 1336270 1341457 1347978 1355381 1358082 1363990 1367533 1369085
9712 1369085 1371339 1372529 1378286 1382519 1387712 1391188 1389786 1394699 1393573 1397391 1399671 1395351 1398337 1403335
9698 1403335 1406788 1411969 1411704 1412876 1416412 1415985 1418372 1429209 1435792 1435840 1436280 1439655 1441070 1451126 1456729
9683 1456729 1454687 1457211 1456487 1462884 1465089 1462961 1465866 1468005 1470266 1479945 1492036 1493023 1490184 1490005 1492240
9668 1492240 1496264 1495058 1497659 1494745 1492533 1493229 1502187 1507240 1511439 1513119 1521202 1526639 1529434 1531971
9654A531971Q6K356N262O896q89K121j958M014J0571L262Q627M59k041j537M714
9639A573914K210j487k98M684M792J741M342J1841M506Q637O316L341l864o286
9625A614389K740M570N989J163L482P268Q723L062J632m598K34O594n088l778
9611A646382l651J212K573Q518L883l19M368J133N279R144N225J440l441J949
9597A683695L707J253P444J0878J923L821O206J98K081O075N643Q718Q473j676
9583A748439K643l372N643r93J301Q003J0427N469j7m824K994K782O539K810J500
9568A789344M392J569l072L029J5381R952N710m325n429K843n316m135K984M941
9554A817868M778Q935J046M51P530P635O048N543J042O664Q31K659l845j759O589
$$ plain form
9654 1531971 1532057 1534413 1539675 1546571 1545682 1547803 1545845 1549859 1560430 1563692 1572319 1572778 1570737 1569200 1573914
9639 1573914 1576124 1574637 1574339 1579023 1583815 1585556 1589898 1601739 1606245 1614882 1621198 1624539 1620675 1614389
9625 1614389 1617129 1621699 1627688 1628851 1632333 1639601 1648324 1651386 1653018 1648420 1648654 1655248 1650160 1646382
9611 1646382 1642731 1643943 1646516 1655034 1658917 1658598 1662966 1664099 1669378 1678522 1683747 1685187 1681746 1683695
9597 1683695 1687402 1688655 1696099 1706977 1708900 1712721 1718927 1719125 1721206 1727281 1732924 1741642 1750115 1748439
9583 1748439 1751082 1747710 1753353 1752360 1753661 1761664 1772091 1777560 1777543 1772719 1775713 1778495 1785034 1787844 1789344
9568 1789344 1793736 1795305 1792233 1795262 1810643 1820595 1826305 1821980 1816551 1819394 1814078 1809943 1812927 1817868
9554 1817868 1822646 1831581 1832627 1833078 1840608 1848243 1854291 1859834 1860876 1867540 1868371 1871030 1867185 1865426 1872015
9539A872015l230n62K853L998K647K71n0N121M913J0457J0749O840N779O253J0006
9524A938060L573J895R599Q564K587M11q370j0711j7772q579k777m308k756k184
9510A907232J0027O879J3995J2919L524J772Q327O065L51k463O948O952R309J865
9496A993702k145J215R837Q492K070j848J93N737P683O024K316O075M028N418
9482B048797O539J0137j93J803M347K576m756k615L949J0377K045l985J285O493
9468B086799N653R38L119M387N312Q909M193O646K866P147P346J133P804R016
9454B161268k308L804P537J418J1312N185J582o40n630R316K635P41L796J108
9440B201124M888J1295k062m437J225O576P737j863K511Q771L110N226N729J0778
$$ plain form
9539 1872015 1868785 1868223 1871076 1875074 1877721 1877992 1877942 1883063 1887976 1898433 1909182 1916022 1921801 1928054 1938060
9524 1938060 1941633 1943528 1953127 1961691 1964278 1964689 1956319 1945608 1927836 1919257 1916480 1912172 1909416 1907232
9510 1907232 1917259 1924138 1938133 1951052 1954576 1956348 1964675 1970740 1971091 1968628 1975576 1982528 1991837 1993702
9496 1993702 1991557 1992772 2002609 2011101 2013171 2011323 2011516 2017253 2024936 2030960 2033276 2039351 2043379 2048797
9482 2048797 2055336 2065473 2065280 2067083 2071430 2074006 2069250 2066635 2070584 2080961 2083006 2079021 2080306 2086799
9468 2086799 2092452 2093390 2096509 2100896 2106208 2115117 2119310 2125956 2128822 2135969 2143315 2144448 2152252 2161268
9454 2161268 2158960 2162764 2170301 2171719 2183031 2188216 2189798 2189158 2183528 2192844 2195479 2196220 2200016 2201124
9440 2201124 2206012 2217307 2215245 2210808 2212033 2218609 2226346 2224483 2226994 2235765 2238875 2244101 2249830 2260608
9426B260608N004l596m00Q689L381K818K987N965N551J3179J2327M831N402L685
9412B330431O56J680K231N436J3149P913N234L027p69j370P200K130M185j602
9398B379531N005M944M050l204J087J0620J1542Q892Q039q74N211J0692J135N149
9384B451819J0749M903N08j568O3j202Q013Q612P626N066J519L168J368M271J0182
9369B515097M517P481N325L31N974M390K094J1079Q108J2388P090K288Q457J4826
9355B609445J2420N536K071O706P915J3685J091j0561m195k602N544M230L020
9342B654305j629O742L913p61Q956Q177J1170Q319K535j553L556J854P233Q045
9328B720862N643P039R809J1992J729J174J0481J255K266N558K257P141J1071
$$ plain form
9426 2260608 2265612 2262016 2261616 2270305 2273686 2276504 2279491 2285456 2291007 2304186 2316513 2321344 2326746 2330431
9412 2330431 2331087 2332767 2334998 2340434 2353583 2361496 2366730 2369757 2368988 2367618 2374818 2376948 2381133 2379531
9398 2379531 2384536 2389480 2393530 2390326 2391413 2402033 2413575 2422467 2430506 2429632 2434843 2445535 2446670 2451819
9384 2451819 2462568 2467471 2467979 2466411 2466474 2465272 2473285 2481897 2489523 2494589 2496108 2499276 2500644 2504915 2515097
9369 2515097 2519614 2527095 2532420 2532751 2538725 2543115 2545209 2556288 2564396 2576784 2583874 2586162 2594619 2609445
9355 2609445 2621865 2627401 2629472 2636178 2644093 2657778 2658869 2648308 2644113 2641511 2647055 2651285 2654305
9342 2654305 2652676 2659418 2663331 2662570 2671526 2679703 2690873 2699192 2701727 2700174 2703730 2705584 2712817 2720862
9328 2720862 2726505 2733544 2743353 2755345 2757074 2758248 2768729 2769984 2772250 2777808 2780065 2787206 2798277
9315B798277O047P046O583K548P260J296K688N250q94L288J8224Q604j339n66
9301B864312M516J2913Q234M177J686O086J3446P751J157j943M354L238N583M885
9287B940395J597J93Q422O792N849O500M783P957Q076O029M529M751Q738M102
9273C018713L073K060j843j872O993J3346Q260k748m324J305n26J851o514m87
9259C037287O826M368M48j012J397L425o74L087O103R983Q103J0014L92M896R826
9244C104469M318j146K726J0039J3195J757j64L967l005O210J3883O893K699o67
9230C165174O490J697J544P439J2886R173N794R222R576R750J8007J1280m287
9217C263745l97N160l42k721j125L122R324J1049J5210J4369J1364L699O621J2397
$$ plain form
9315 2798277 2804324 2811370 2817953 2820501 2827761 2829057 2831745 2836995 2836101 2839389 2857613 2866217 2864878 2864312
9301 2864312 2868828 2881741 2889975 2894152 2895838 2901924 2915370 2923121 2924278 2922335 2926689 2929927 2935510 2940395
9287 2940395 2941992 2942185 2950607 2957399 2963248 2969748 2974531 2982488 2990564 2996593 3001122 3005873 3014611 3018713
9273 3018713 3021786 3023846 3022003 3020131 3027124 3040470 3048730 3045982 3041658 3042963 3042437 3044288 3037774 3037287
9259 3037287 3044113 3048481 3048929 3047917 3049314 3052739 3052065 3055152 3061255 3071238 3079341 3089355 3089747 3094643 3104469
9244 3104469 3108787 3107641 3110367 3120406 3133601 3135358 3135194 3139161 3136156 3142366 3156249 3163142 3165841 3165174
9230 3165174 3171664 3173361 3174905 3182344 3195230 3204403 3210197 3219419 3228995 3238745 3256752 3268032 3263745
9217 3263745 3263348 3268508 3268166 3265445 3264320 3267442 3276766 3287815 3303025 3317394 3328758 3332457 3339078 3351475
9203C351475O652J5387J3595J0698M198N197J0796O092N272P353O625J1141J6659
9190C471140Q854K113J2967J1320R248O942J0764J5742J3991J1842J6082J3220
9178C604225J2628J3167J7719J4489J0934J4697J6475J4477J3337K0150J1038
9167C763336J88J602P282P540J3226J5082J8697J6105J7213J4815J3929K2627
9155C911642K9331J6536J2586K7735K5270K3156J6987K1401K4065K5947K4927
9144D159583K3808L3955L4934L2660L8943L8376M7042M5052N0469N8452O1707
9133D624981O9391P2538P0282M7407J7372k4861q8113j39689k01455k20989k23237
9122D003627k06024j84218j45221r6717n1957n116K9096N4870O5616P1407O7390
$$ plain form
9203 3351475 3358127 3373514 3387109 3397807 3402005 3407202 3417998 3424090 3429362 3436715 3443340 3454481 3471140
9190 3471140 3479994 3482107 3495074 3506394 3515642 3522584 3533348 3549090 3563081 3574923 3591005 3604225
9178 3604225 3616853 3630020 3647739 3662228 3673162 3687859 3704334 3718811 3732148 3752298 3763336
9167 3763336 3763524 3765126 3772408 3779948 3793174 3808256 3826953 3843058 3860271 3875086 3889015 3911642
9155 3911642 3940973 3957509 3970095 3997830 4023100 4046256 4063243 4084644 4108709 4134656 4159583
9144 4159583 4183391 4217346 4252280 4284940 4323883 4362259 4409301 4454353 4504822 4563274 4624981
9133 4624981 4694372 4766910 4837192 4884599 4901971 4877110 4788997 4649308 4447853 4226864 4003627
9122 4003627 3797603 3613385 3468164 3371447 3319490 3314374 3343470 3398340 3463956 3535363 3602753
9111C602753O2886O2486M7113M9714L9980L3160K5753K9472K0276J1430J2380
9100C997403J1292M730R931O895J194J3557K0120K1413K2530K3418K2719K9939
9088D185141L0528L0156K8291K8453K4781K3355K3254J5948J4845J7596J8034
9077D440382J1952R454K1064K3925J6217K8079K2218J6082J5927K0362J8115K7415
9065D671192L0265J9771J4962J6801J9185K3156J9046K4179K8106K4580K7280
9054D918523K2700K1727K1886K8375K3238J9636K7267K4783J3522L2371K5970
9043E179998J1715J3182K4166K4114K4971K3218K1839K3605K6295K2163K8645
9032E423911K6604L3593K9749L3302K6227K5521L2430M3783L6049L8503M0992
$$ plain form
9111 3602753 3665639 3728125 3775238 3824952 3864932 3898092 3923845 3953317 3973593 3985023 3997403
9100 3997403 4008695 4013425 4023356 4030251 4031445 4045002 4065122 4086535 4109065 4132483 4155202 4185141
9088 4185141 4215669 4245825 4274116 4302569 4327350 4350705 4373959 4389907 4404752 4422348 4440382
9077 4440382 4452334 4461788 4482852 4506777 4522994 4551073 4573291 4589373 4605300 4625662 4643777 4671192
9065 4671192 4701457 4721228 4736190 4752991 4772176 4795332 4814378 4838557 4866663 4891243 4918523
9054 4918523 4941223 4962950 4984836 5013211 5036449 5056085 5083352 5108135 5121657 5154028 5179998
9043 5179998 5191713 5204895 5229061 5253175 5278146 5301364 5323203 5346808 5373103 5395266 5423911
9032 5423911 5450515 5484108 5513857 5547159 5573386 5598907 5631337 5675120 5711169 5749672 5790664
9021E790664M3637M0817M4863N0066L1463j1013m0876l2433Q96J0961J919Q012
9009E938976K1870L9294N0318N5156N4218N0385M0521N0637N2988M7017M7218
8998F448598M7618N6114N5418N5529N6446O6953O4497P0689P8729Q4397Q6662
8987G171650Q2213P4144J14138J96259J63158J23148J07986P6500o1490l47258
8977G700448n51725m59812k19508j06929j16283j09490R76J21208J77848J81789
8967F618522J66359J44229J29278J24207J31929J45547J45162J35710J60480J92829
8957H094252K20750K50773K98756L45355L89947M05432K91751j75701r69176j477880
8947G674259j326568q31845n29130m84707l94567j07323J82665L25357L48631
$$ plain form
9021 5790664 5834301 5875118 5919981 5970047 6001510 5990497 5949621 5917188 5918084 5929045 5930964 5938976
9009 5938976 5960846 6000140 6050458 6105614 6159832 6210217 6250738 6301375 6354363 6401380 6448598
8998 6448598 6496216 6552330 6607748 6663277 6719723 6786676 6851173 6921862 7000591 7084988 7171650
8987 7171650 7253863 7328007 7442145 7638404 7801562 7924710 8032696 8109196 8047706 7700448
8977 7700448 7148723 6688911 6469403 6362474 6246191 6136701 6137677 6258885 6436733 6618522
8967 6618522 6784881 6929110 7058388 7182595 7314524 7460071 7605233 7740943 7901423 8094252
8957 8094252 8315002 8565775 8864531 9209886 9599833 10005265 10297016 10121315 9152139 7674259
8947 7674259 6347691 5515846 4986716 4502009 4107442 4000119 4182784 4508141 4856772
8938D856772L12776K71479K24079J77187J49062J51867J36883J28924J00359Q5999
8928F595387R3461P8630O2833L9579L3078M4163N2454O1474M9451L9194M9760
8917G199464Q6517J27247J67645J52521R0125J8204m3859o8264m5011j863J4050
8906G696776J9952L8666N6029Q0685R4626J07274J07274J08109R2144P7266O8843
8895H547644P2901Q1746P5279P5148O8780O5451O4510P0809Q6362Q9048P5627
8884I373305N9250N1409N1085M4368N9315P3260P3352O7422O0033O3208P9962
8873A0055969Q7036R1987R8721Q5573P5452Q2121Q6126Q0086P4585O8608O9470
8862A0955734Q0472P8065Q3782J14493J93452K78441K28762J39642J10881J28351
$$ plain form
8938 4856772 5169548 5441027 5665106 5842293 5991355 6143222 6280105 6409029 6509388 6595387
8928 6595387 6688848 6767478 6830311 6869890 6902968 6947131 6999585 7061059 7110510 7149704 7199464
8917 7199464 7285981 7413228 7580873 7733394 7823519 7841723 7797864 7729600 7684589 7682726 7696776
8906 7696776 7716728 7755394 7811423 7892108 7986734 8094008 8201282 8309391 8401535 8478801 8547644
8895 8547644 8620545 8702291 8777570 8852718 8921498 8986949 9051459 9122268 9208630 9297678 9373305
8884 9373305 9432555 9483964 9535049 9579417 9638732 9711992 9785344 9852766 9912799 9976007 10055969
8873 10055969 10143005 10234992 10333713 10419286 10494738 10576859 10662985 10743071 10817656 10886264 10955734
8862 10955734 11036206 11114271 11198053 11312546 11505998 11784439 12013201 12152843 12263724 12392075
8852A2392075J99850J89091L4255q458M5290P7970P9796J04199J05600J10945
8842A3330613J15375J19960J31970J32306J30749J38755J45035J49494J49252
8833A4543509J46764J49055J46130J50435J54199J46821J53500J45114J47246
8824A5882773J54322J71499J95996J84722J69821J65904J73259J95907K15349
8815A7509552K13603K22186K32490K45554K40524K30854K38832K50829K61218
8806A9645642K60709K58955K76902K78542K74201K84911L02246L18741L21745
8797B2222594L36993L30080L21720L32292L62377L93924M19570M35350M56859
8788B5611759M77372M99162N03059M96762N07699N36905N67987N88883N94408
$$ plain form
8852 12392075 12591925 12781016 12815271 12806813 12852103 12930073 13009869 13114068 13219668 13330613
8842 13330613 13445988 13565948 13697918 13830224 13960973 14099728 14244763 14394257 14543509
8833 14543509 14690273 14839328 14985458 15135893 15290092 15436913 15590413 15735527 15882773
8824 15882773 16037095 16208594 16404590 16589312 16759133 16925037 17098296 17294203 17509552
8815 17509552 17723155 17945341 18177831 18423385 18663909 18894763 19133595 19384424 19645642
8806 19645642 19906351 20165306 20442208 20720750 20994951 21279862 21582108 21900849 22222594
8797 22222594 22559587 22889667 23211387 23543679 23906056 24299980 24719550 25154900 25611759
8788 25611759 26089131 26588293 27091352 27588114 28095813 28632718 29200705 29789588 30383996
8779C0383996O33320O99298P83411Q63612R32591J013592J118272J242565J322180
8770C8992837J150719J79331j248313j387431l38441N15374N52859M25393Q09526
8761C9651854J435228J789518J910932J945086J972417K004894K080795K187544
8753E4978268K321081K465598K644067K887611L171425L481246L738974L943247
8745G9631517M225037M621561M992701N189841N362466O247527Q020369J0117036
8737A28408055J2280233J4861812J8145988K1988635K5670403K5180060N984062
8730B52519248n2161616j11536701j06350474n9246356k7962317l1851115l9022994
8723a75612325k1319556N539911J9170432K1319721J9203700J6120025J2849798
$$ plain form
8779 30383996 31017316 31716614 32500025 33363637 34296228 35309820 36428092 37670657 38992837
8770 38992837 40143556 40322887 39074574 37687143 37348702 37864076 38416935 38842328 39651854
8761 39651854 41087082 42876600 44787532 46732618 48705035 50709929 52790724 54978268
8753 54978268 57299349 59764947 62409014 65296625 68468050 71949296 75688270 79631517
8745 79631517 83856554 88478115 93470816 98660657 104023123 110270650 118291019 128408055
8737 128408055 140688288 155550100 173696088 195684723 221355126 246535186 252519248
8730 252519248 200357632 88820931 -17529543 -76775899 -104738216 -136589331 -175612325
8723 -175612325 -196931881 -191391970 -172221538 -150901817 -131698117 -115578092 -102728294
8716a02728294R846100P346068N750181N528388O002180O376561O335442N091854
8708e0451520N93386n195666n897509l380547k800337l826020l462359q23862
8700g5244434J603709K452440K902939L392389L541077L315564K970991K699670
8692e2365655K487599K277173K106482K031090J971019J582047P91981L51570
8684c8766694M39642L40725j18773m54623n38876k68012J49164M71970O55638
8675c8089839P37560Q60673J017356J054609R82649Q94290Q14410P12408O18384
8666c0397500N59204N28306N29991N33164N23294M94884M92379M91961M81939
8657b5762378M69930M39402L94078L68027L58256L62218L49288L37011L30587
$$ plain form
8716 -102728294 -92882194 -85536126 -79785945 -74257557 -68255377 -61878816 -55543374 -50451520
8708 -50451520 -49858134 -55053800 -60951309 -64331856 -67132193 -70958213 -74420572 -75244434
8700 -75244434 -73640725 -71188285 -68285346 -64892957 -61351880 -58036316 -55065325 -52365655
8692 -52365655 -49878056 -47600883 -45494401 -43463311 -41492292 -39910245 -39118264 -38766694
8684 -38766694 -38327052 -37986327 -38105100 -38559723 -39098599 -39366611 -39217447 -38745477 -38089839
8675 -38089839 -37352279 -36491606 -35474250 -34419641 -33436992 -32542702 -31728292 -31015884 -30397500
8666 -30397500 -29838296 -29309990 -28779999 -28246835 -27723541 -27228657 -26736278 -26244317 -25762378
8657 -25762378 -25292448 -24853046 -24458968 -24090941 -23732685 -23370467 -23021179 -22684168 -22353581
8648b2353581L22729L09794L04017L01712K98442K87444K68608K62158K58776
8639a9739901K54965K36339K08908J82103J83976K04062K08789J99922J97482
8630a7863355K09317K21843K23083K26573K22376K10601J94184J75870J75709
8621a6003799J79008J68955J70193J54683J40031J34258J40411J36809J30247
8612a4649204J16073R0310M1971M3230P8933R2760R2327R5156J25668J23464O0940
8601a3688372k108m954L7338O6278O4771N0873N7316R9325J21224J12753J16794
8590a2968762J26598J32046J27932J12082J13590J10059J00954R6034R0135P7045
8580a1882287O7680O7588O0204N0727M4667N9393O1265L6836M5655P2577R5233
$$ plain form
8648 -22353581 -22030852 -21721058 -21417041 -21115329 -20816887 -20529443 -20260835 -19998677 -19739901
8639 -19739901 -19484936 -19248597 -19039689 -18857586 -18673610 -18469548 -18260759 -18060837 -17863355
8630 -17863355 -17654038 -17432195 -17209112 -16982539 -16760163 -16549562 -16355378 -16179508 -16003799
8621 -16003799 -15824791 -15655836 -15485643 -15330960 -15190929 -15056671 -14916260 -14779451 -14649204
8612 -14649204 -14533131 -14442821 -14400850 -14357620 -14278687 -14185927 -14093600 -13998444 -13872776 -13749312 -13688372
8601 -13688372 -13690480 -13695434 -13658096 -13591818 -13527047 -13476174 -13418858 -13319533 -13198309 -13085556 -12968762
8590 -12968762 -12842164 -12710118 -12582186 -12470104 -12356514 -12246455 -12145501 -12049467 -11959332 -11882287
8580 -11882287 -11814607 -11747019 -11686815 -11636088 -11591421 -11532028 -11470763 -11433927 -11388272 -11315695 -11220462
8569a1220462J15515J09436Q7510O8697N9061O0973O9154P3971P1105N9609N0335
8558a0395096N6956O1830O6277O5556O4653N9759M6402N6221N8044O0956O2078
8547i736364O0370N2501M1134M8614M3550M5088L6921L3306M7865L8478J9941
8536i268596N0894P0820P7066O9213N8253O3692N8630M6481M8634O0652N6531
8525h607730M8439M5967M9559N2054N0701L7797L8530M2923L5941L8765L6152
8514h130902M1268L9718L8386L3626L1786L3408L4436K6258K5926L9273L9557
8503g747260L8870L6670K0634K3634L1349L2116L2145L4451L7597L7858L3220
8492g388716L9792M5184M1586L2225L3238L2413K5074J8640L1043L6994K8551
$$ plain form
8569 -11220462 -11104947 -10995511 -10908001 -10839304 -10780243 -10719270 -10650116 -10576145 -10505040 -10445431 -10395096
8558 -10395096 -10338140 -10276310 -10210033 -10144477 -10079824 -10020065 -9973663 -9917442 -9859398 -9798442 -9736364
8547 -9736364 -9675994 -9623493 -9582359 -9533745 -9490195 -9445107 -9408186 -9374880 -9327015 -9288537 -9268596
8536 -9268596 -9217702 -9146882 -9069816 -9000603 -8942350 -8878658 -8820028 -8773547 -8724913 -8664261 -8607730
8525 -8607730 -8559291 -8513324 -8463765 -8411711 -8361010 -8323213 -8284683 -8241760 -8205819 -8167054 -8130902
8514 -8130902 -8089634 -8049916 -8011530 -7977904 -7946118 -7912710 -7878274 -7852016 -7826090 -7786817 -7747260
8503 -7747260 -7708390 -7671720 -7651086 -7627452 -7596103 -7563987 -7531842 -7497391 -7459794 -7421936 -7388716
8492 -7388716 -7348924 -7303740 -7262154 -7229929 -7196691 -7164278 -7139204 -7120564 -7089521 -7052527 -7023976
8481g023976K9583K3404J9378K7459L6084K7573K2735L0364L4034K9286K1082
8470f722994K9840L0994L0977K6658K1237K3994K2407K8335K7563J6448K7664
8459f436877K3834K1504J5539K0045J8706K3526K0914K7708L2529K6740K1135
8448f184697K6054K2854K6970K5684K1023J6712K1956K5242K6003K0587J9971
8437e931641K4628K0814J6085K7498J5040J8313K0904J7052J3306K0112J8729
8426e719160J3187J5576J9245K3212J8195J9173K1265J5665K2165J5912J2804
8415e522761J9391K6521K4149J4873J6553K6303K1916J8228J8691K3432K3826
8404e288878J4146P387O670K0830K2038Q774J2219K1633K7999K0646J1905J1275
$$ plain form
8481 -7023976 -6994393 -6970989 -6951611 -6924152 -6888068 -6860495 -6837760 -6807396 -6773362 -6744076 -6722994
8470 -6722994 -6693154 -6662160 -6631183 -6604525 -6583288 -6559294 -6536887 -6508552 -6480989 -6464541 -6436877
8459 -6436877 -6413043 -6391539 -6376000 -6355955 -6337249 -6313723 -6292809 -6265101 -6232572 -6205832 -6184697
8448 -6184697 -6158643 -6135789 -6108819 -6083135 -6062112 -6045400 -6023444 -5998202 -5972199 -5951612 -5931641
8437 -5931641 -5907013 -5886199 -5870114 -5842616 -5827576 -5809263 -5788359 -5771307 -5758001 -5737889 -5719160
8426 -5719160 -5705973 -5690397 -5671152 -5647940 -5629745 -5610572 -5589307 -5573642 -5551477 -5535565 -5522761
8415 -5522761 -5503370 -5476849 -5452700 -5437827 -5421274 -5394971 -5373055 -5354827 -5336136 -5312704 -5288878
8404 -5288878 -5274732 -5267345 -5260675 -5239845 -5217807 -5209033 -5196814 -5175181 -5147182 -5126536 -5114631 -5103356
8392e103356J7674J7860J2903J7453K4313K0896J1941O382J0203J8884K3048K5711
8380d896088J6252J6067K2336J9793J8692J7208K4507K7592J6128J5807J9323
8369d682383Q281O351J2490J9528J6601J6556J8385J8177J6616K1586K1915K6214
8357d479683K3673J6523K1445J8210J5174K3120K4817K2247L1167L0638K9376
8346d223293L4883L8899K9407L0100L7114L8320M3673O1100O9538O6189O9587
8335c704483O9508O7044N4941J6563k4415q5386j41480j91028k16498k30452k15422
8324d601108j88057j50352j02735m8967j0193K5283N3170O7046O7375O3251N5567
8313d769720N0982N1969M5018L9600L1241J9042J5264R721O020R88K770J2786
$$ plain form
8392 -5103356 -5085682 -5067822 -5054919 -5037466 -5013153 -4992257 -4980316 -4973934 -4963731 -4944847 -4921799 -4896088
8380 -4896088 -4879836 -4863769 -4841433 -4821640 -4802948 -4785740 -4761233 -4733641 -4717513 -4701706 -4682383
8369 -4682383 -4674102 -4667751 -4655261 -4635733 -4619132 -4602576 -4584191 -4566014 -4549398 -4527812 -4505897 -4479683
8357 -4479683 -4456010 -4439487 -4418042 -4399832 -4384658 -4361538 -4336721 -4314474 -4283307 -4252669 -4223293
8346 -4223293 -4188410 -4149511 -4120104 -4090004 -4052890 -4014570 -3970897 -3909797 -3840259 -3774070 -3704483
8335 -3704483 -3634975 -3567931 -3512990 -3496427 -3520842 -3606228 -3747708 -3938736 -4155234 -4385686 -4601108
8324 -4601108 -4789165 -4939517 -5042252 -5091219 -5101412 -5076129 -5022959 -4955913 -4888538 -4825287 -4769720
8313 -4769720 -4718738 -4666769 -4621751 -4582151 -4550910 -4531868 -4516604 -4506883 -4500863 -4499875 -4497105 -4484319
8301d484319M954j748J831J6564J5008K8404K2794K1775K8222K0832K5038J7681
8289d282964J9534J4686J3447J8223K3442J1321J4184J0281K942R565J1093J1795
8277d122451J0500J4945L665J718J2218J7990J1045J0541J6557Q769R272R184
8265c996047J5873J8184J9725J6097J6373N762O711Q425J3402J6725J0384J3940
8253c834446J1319N021M643J1513J5104N257M288R852O452Q461O849R618J4416
8240c721653O702J0335J1755Q016N761N129O811N132L084M823Q145P466K452J0762
8226c625280J2763P432P883J5910O184Q027N385P911J3778N214O861Q913Q127
8213c510892Q704Q099o46K132J2384J8194J1248J569o82J661N228O149J0886J2310
$$ plain form
8301 -4484319 -4479365 -4481113 -4479282 -4462718 -4447710 -4419306 -4396512 -4374737 -4346515 -4325683 -4300645 -4282964
8289 -4282964 -4263430 -4248744 -4235297 -4217074 -4193632 -4182311 -4168127 -4157846 -4154904 -4145339 -4134246 -4122451
8277 -4122451 -4111951 -4097006 -4093341 -4091623 -4079405 -4061415 -4050370 -4039829 -4023272 -4014503 -4005231 -3996047
8265 -3996047 -3980174 -3961990 -3942265 -3926168 -3909795 -3904033 -3897322 -3888897 -3875495 -3858770 -3848386 -3834446
8253 -3834446 -3823127 -3818106 -3813463 -3801950 -3786846 -3781589 -3777301 -3767449 -3760997 -3752536 -3745687 -3736069 -3721653
8240 -3721653 -3714951 -3704616 -3692861 -3684845 -3679084 -3673955 -3667144 -3662012 -3658928 -3654105 -3645960 -3638494 -3636042 -3625280
8226 -3625280 -3612517 -3605085 -3597202 -3581292 -3575108 -3567081 -3561696 -3553785 -3540007 -3534793 -3527932 -3519019 -3510892
8213 -3510892 -3502188 -3494089 -3494735 -3492603 -3480219 -3462025 -3450777 -3449208 -3449890 -3448229 -3443001 -3436852 -3425966 -3413656
8199c413656J0150p68N418L461K643J4237K0893J7177m366O037N401J0168R455
8186c313750N017Q120L511J806P619K27O296P024K348O718R223R09P004R542M102
8171c234284R9M554R909l385J995L346J5011J3026J4117N778N061L742M375P158
8157c149498P835O381Q760Q812O006K168m277l607L736Q317J0399J1375J1487
8144c072106J2741K971m530Q103K729R29Q546L853M341J0157J3425J3015N033
8131b990793M658N69M648L393L320P077J534K286L083M890N102P087N542L089
8117b934515P290Q916N455M386K586M19O091O584K709N675J1937J1037M180k834
8103b860084N244P935k924J843O881J3016O903K544O491k371l113O064N663J052
$$ plain form
8199 -3413656 -3403506 -3404274 -3398856 -3395395 -3392752 -3378515 -3357622 -3340445 -3344811 -3338774 -3333373 -3323205 -3313750
8186 -3313750 -3308733 -3300613 -3297102 -3295296 -3287677 -3287450 -3281154 -3274130 -3271782 -3265064 -3255841 -3254932 -3247928 -3238386 -3234284
8171 -3234284 -3234185 -3229631 -3219722 -3223107 -3221112 -3217766 -3202755 -3189729 -3175612 -3169834 -3164773 -3161031 -3156656 -3149498
8157 -3149498 -3141663 -3135282 -3126522 -3117710 -3111704 -3109536 -3113813 -3117420 -3113684 -3105367 -3094968 -3083593 -3072106
8144 -3072106 -3059365 -3056394 -3060924 -3052821 -3050092 -3049163 -3040617 -3036764 -3032423 -3022266 -3008841 -2995826 -2990793
8131 -2990793 -2986135 -2985566 -2980918 -2977525 -2974205 -2967128 -2965594 -2963308 -2960225 -2955335 -2950233 -2943146 -2937604 -2934515
8117 -2934515 -2927225 -2918309 -2912854 -2908468 -2905882 -2905463 -2899372 -2892788 -2890079 -2884404 -2872467 -2861430 -2857250 -2860084
8103 -2860084 -2854840 -2846905 -2849829 -2847986 -2841105 -2828089 -2821186 -2818642 -2812151 -2814522 -2817635 -2811571 -2805908 -2804856
8089b804856N652R148R102J4880K541K333R201Q623j615P129Q715M335L106j493
8075b723199M793J057L660L368K19Q536J3066K149m040R137N439O735J0659J2804
8061b645617J935n00L820Q605Q364O71p42j617P06K931n87n247N470N117K933
8046b613758J205j364P005O142P02o04N174J1462J3763L626n832K221M848M575
8032b560835J1558N282m865k388P447J4260J1548K49q94M855J0969Q898J255N701
8018b486960L831J918L703K009p927o579m774j4478j2175j0110j2998p946p91
8005b553277N341M53m641M501K476O076O405J284l789P200R067Q238R756J5214
7991b485696O921K724L232L769J0698O358N908Q236N089Q919M765J922N28K992
$$ plain form
8089 -2804856 -2799204 -2790056 -2780954 -2766074 -2763533 -2761200 -2751999 -2743376 -2744991 -2737862 -2729147 -2724812 -2721706 -2723199
8075 -2723199 -2718406 -2717349 -2713689 -2710321 -2710102 -2701566 -2688500 -2686351 -2690391 -2681254 -2675815 -2669080 -2658421 -2645617
8061 -2645617 -2643682 -2644182 -2640362 -2631757 -2623393 -2622722 -2623464 -2625081 -2624375 -2621444 -2622031 -2627278 -2621808 -2616691 -2613758
8046 -2613758 -2612553 -2613917 -2606912 -2600770 -2600068 -2600672 -2595498 -2584036 -2570273 -2566647 -2572479 -2570258 -2565410 -2560835
8032 -2560835 -2549277 -2543995 -2548860 -2551248 -2543801 -2529541 -2517993 -2517744 -2518638 -2513783 -2502814 -2493916 -2492661 -2486960
8018 -2486960 -2483129 -2481211 -2477508 -2475499 -2483426 -2490005 -2494779 -2509257 -2521432 -2531542 -2544540 -2552486 -2553277
8005 -2553277 -2547936 -2547483 -2552124 -2547623 -2545147 -2539071 -2532666 -2531382 -2535171 -2527971 -2518904 -2510666 -2500910 -2485696
7991 -2485696 -2478775 -2476051 -2472819 -2469050 -2458352 -2451994 -2446086 -2437850 -2432761 -2423842 -2419077 -2417155 -2416627 -2413635
7977b413635K250J691L017P174N63J641o939n075o716N66L260q021j3925j2378
7963b446527j2403l683l844j618J207m138N344J0474J5382J0572p12n657l689
7950b439292R199M119O172P610J1163J3204q94J16M406L695j88Q213P999M254
7936b360224P034L509o296q535l4O661M034k240l462k537k506J50P326K89n996
7921b362827L82j566N338J301j044N123O964M652l85r7K600L963N81O727M574
7906b323714m342K778O277J3017M392m679p63r74L571P178Q405N239J822N459
7892b276334P063j866J390M587J40K224O72k382J052L901O437L053R130P785J799
7877b231349m137m520M687O643N661P275n944K754O020M031M506M845m143O164
$$ plain form
7977 -2413635 -2411385 -2409694 -2406677 -2399503 -2398940 -2397299 -2404238 -2409313 -2416029 -2415463 -2412203 -2420224 -2434149 -2446527
7963 -2446527 -2458930 -2462613 -2466457 -2468075 -2466868 -2471006 -2465662 -2455188 -2439806 -2429234 -2429946 -2435603 -2439292
7950 -2439292 -2430093 -2425974 -2419802 -2412192 -2401029 -2387825 -2388719 -2388603 -2384197 -2380502 -2380690 -2372477 -2364478 -2360224
7936 -2360224 -2353190 -2349681 -2355977 -2364512 -2364546 -2357885 -2353851 -2356091 -2359553 -2362090 -2364596 -2364446 -2357120 -2356831 -2362827
7921 -2362827 -2362445 -2364011 -2358673 -2357372 -2358416 -2353293 -2346329 -2341677 -2342062 -2342159 -2339559 -2335596 -2335015 -2328288 -2323714
7906 -2323714 -2328056 -2325278 -2319001 -2305984 -2301592 -2306271 -2307034 -2308008 -2304437 -2297259 -2288854 -2283615 -2281793 -2276334
7892 -2276334 -2269271 -2271137 -2269747 -2265160 -2265020 -2262796 -2262124 -2264506 -2263454 -2259553 -2253116 -2250063 -2240933 -2233148 -2231349
7877 -2231349 -2235486 -2240006 -2235319 -2228676 -2223015 -2215740 -2221684 -2218930 -2212910 -2208879 -2204373 -2199528 -2203671 -2197507
7863b197507Q016r5J374J440J429J993R20J408Q87M281M188J292N032P502O538
7848b151302M025l371O0O702N267M930K348j888j055N783M290K15J170m680N885
7833b121621O663j517N66M397M7K251P326q0R352M089m923L95r78K472K24K531
7817b088806J942O734R388j350N001Q116N046n036k012P021K387P974L675n04
7803b040424j078L548J3099j037r504K160N64J729N698N239M010J662K257m644
7789b016721L571K088k302l693N902J0805Q852K836K53N357o325m436P000N017
7775a981796J91k93O304O385m771L348J2442N906O80L553O41j345l80M362J536
7760a943237N028J039P249N380j925K231l230K404K710l34n18R5L660L198J1734
$$ plain form
7863 -2197507 -2189491 -2189586 -2188212 -2186772 -2185343 -2183350 -2182430 -2181022 -2180135 -2175854 -2171666 -2170374 -2165342 -2157840 -2151302
7848 -2151302 -2147277 -2150648 -2150588 -2143886 -2138619 -2133689 -2131341 -2133229 -2134284 -2128501 -2124211 -2123996 -2122826 -2127506 -2121621
7833 -2121621 -2114958 -2116475 -2115909 -2111512 -2111465 -2109214 -2101888 -2101968 -2092616 -2088527 -2093450 -2093055 -2094033 -2091561 -2091337 -2088806
7817 -2088806 -2086864 -2080130 -2070742 -2072092 -2067091 -2058975 -2053929 -2058965 -2060977 -2053956 -2051569 -2043595 -2039920 -2040424
7803 -2040424 -2041502 -2037954 -2024855 -2025892 -2035396 -2033236 -2032672 -2030943 -2025245 -2020006 -2015996 -2014334 -2012077 -2016721
7789 -2016721 -2013150 -2011062 -2013364 -2017057 -2011155 -2000350 -1991498 -1988662 -1988409 -1983052 -1989377 -1993813 -1986813 -1981796
7775 -1981796 -1981605 -1981898 -1975594 -1969209 -1973980 -1970632 -1958190 -1952284 -1951604 -1948051 -1947410 -1948755 -1949135 -1944773 -1943237
7760 -1943237 -1938209 -1937170 -1929921 -1924541 -1926466 -1924235 -1927465 -1925061 -1922351 -1922685 -1923203 -1923108 -1919448 -1916250 -1904516
7745a904516R900L506q95M702p349j0969k175m839j517k013k707n3K63K625M976
7730a911061j364J347L079J0297L936M796j539J959Q24m221M632R113J63L180
7716a874859R948J3397P741k432o02p579o09Q173j312j047R643J2905M583R10
7702a821140O875m50N736N600O035M109R465L131j7039j7953r296o963j3373k715
7688a847978l219q195k797N465O559N198L025K605J0771O095j917K437J1268k368
7674a813051p200J608J364M614L813J999M316K087N814P637K574l553l139m46
7660a791563M049P245J2513R174N49J163k562K468O690R865N18k515N317j557
7646a738646j0863m142o158m273M14l106L311O950L480j468k555r4Q973N414J849
$$ plain form
7745 -1904516 -1894616 -1891110 -1892005 -1887303 -1894652 -1905621 -1907796 -1912635 -1914152 -1916165 -1918872 -1918925 -1918662 -1916037 -1911061
7730 -1911061 -1912425 -1911078 -1907999 -1897702 -1893766 -1888970 -1890509 -1888550 -1887726 -1891947 -1887315 -1878202 -1878039 -1874859
7716 -1874859 -1864911 -1851514 -1843773 -1846205 -1846807 -1854386 -1854995 -1846822 -1848134 -1849181 -1839538 -1826633 -1822050 -1821140
7702 -1821140 -1814265 -1814715 -1808979 -1803379 -1797344 -1793235 -1783770 -1780639 -1797678 -1815631 -1824927 -1831890 -1845263 -1847978
7688 -1847978 -1851197 -1859392 -1862189 -1856724 -1850165 -1844967 -1841942 -1839337 -1828566 -1822471 -1824388 -1821951 -1810683 -1813051
7674 -1813051 -1820251 -1818643 -1817279 -1812665 -1808852 -1806853 -1802537 -1800450 -1794636 -1786999 -1784425 -1787978 -1791117 -1791563
7660 -1791563 -1787514 -1780269 -1767756 -1758582 -1758033 -1756870 -1759432 -1756964 -1750274 -1740409 -1739891 -1742406 -1737089 -1738646
7646 -1738646 -1749509 -1753651 -1759809 -1764082 -1763668 -1766774 -1763463 -1756513 -1753033 -1754501 -1757056 -1757150 -1748177 -1742763 -1740914
7631a740914q62k160J435K507J766o33M956P480j622J294R983L734o967J508N634
7616a712861R93K519K99m993r239J216O573L563Q873P375k134j814p34K622M969
7601a692773L776O646n066q45J475j096J452L874j927n801K624J0691N849J291
7587a669830m912L487M671P489K77o295l49J406m663N44N227N141k575K120n8
7572a658320K305J1099L737M319q32j231Q81J063j82m391J400l910L036R37N133
7557a634956Q888k43m719J590J934M579L095j641P480K570j838L139L314J666
7543a605142O840k014k546n564l185K037K186K50P45M203O998J670M572M575L416
7528a580959o56o261m25P147k594k095L506M614J640l531j449M440K337j735K393
$$ plain form
7631 -1740914 -1741776 -1743936 -1742501 -1739994 -1738228 -1738861 -1733905 -1726425 -1728047 -1726753 -1716770 -1713036 -1720003 -1718495 -1712861
7616 -1712861 -1711868 -1709349 -1709050 -1714043 -1723282 -1722066 -1715493 -1711930 -1703057 -1695682 -1697816 -1699630 -1700364 -1697742 -1692773
7601 -1692773 -1688997 -1682351 -1687417 -1688262 -1686787 -1687883 -1686431 -1682557 -1684484 -1690285 -1687661 -1676970 -1671121 -1669830
7587 -1669830 -1674742 -1671255 -1666584 -1659095 -1658818 -1665113 -1665462 -1664056 -1668719 -1668175 -1662948 -1657807 -1660382 -1658262 -1658320
7572 -1658320 -1656015 -1644916 -1641179 -1636860 -1637692 -1638923 -1638042 -1636979 -1637161 -1641552 -1640152 -1644062 -1641026 -1640089 -1634956
7557 -1634956 -1626068 -1626311 -1631030 -1629440 -1627506 -1622927 -1619832 -1621473 -1613993 -1611423 -1613261 -1610122 -1606808 -1605142
7543 -1605142 -1598302 -1600316 -1602862 -1608426 -1611611 -1609574 -1607388 -1607138 -1606393 -1602190 -1595192 -1593522 -1588950 -1584375 -1580959
7528 -1580959 -1581615 -1587876 -1588301 -1581154 -1583748 -1585843 -1582337 -1577723 -1576083 -1579614 -1581063 -1576623 -1574286 -1576021 -1573628
7513a573628K054J268N391Q762L598m906R37L17J921j097m663n807j732J063N698
7498a560824k459R54Q105P126P698M69k045J744M844K458J040k438k977o278L868
7483a538715J691J645K820N495m73m336M84M436J697L813J03J384O818j840L798
7468a511180j116l579n285j60K024o08P23J559R534J953m718l599Q762O435j658
7453a500913l963l008j168J0996P970J390K25n513l359J941K65k953J312P37j488
7438a497529N634J967L231O030p77m245k072L569N52M601J731L812m293N219Q786
7423a463784L920j955j930J538m551j34N75J419J683R61M290J548J716l992J163
7408a457533l47M80k977J788N50K233q31k932M277O539K115n99L481L175l496
$$ plain form
7513 -1573628 -1571574 -1570306 -1564915 -1556153 -1552555 -1557461 -1556524 -1556207 -1554286 -1555383 -1560046 -1565853 -1567585 -1566522 -1560824
7498 -1560824 -1563283 -1562329 -1554224 -1547098 -1539400 -1538931 -1540976 -1539232 -1534388 -1531930 -1530890 -1533328 -1536305 -1542583 -1538715
7483 -1538715 -1537024 -1535379 -1532559 -1527064 -1527537 -1531873 -1531389 -1526953 -1525256 -1521443 -1521340 -1519956 -1513138 -1514978 -1511180
7468 -1511180 -1512296 -1515875 -1521160 -1521320 -1519296 -1519904 -1519181 -1517622 -1508088 -1506135 -1510853 -1514452 -1505690 -1499255 -1500913
7453 -1500913 -1504876 -1507884 -1509052 -1498056 -1490086 -1488696 -1488471 -1493984 -1497343 -1495402 -1495137 -1498090 -1496778 -1496041 -1497529
7438 -1497529 -1491895 -1489928 -1486697 -1480667 -1481444 -1485689 -1487761 -1484192 -1483640 -1479039 -1477308 -1473496 -1477789 -1472570 -1463784
7423 -1463784 -1459864 -1461819 -1463749 -1462211 -1466762 -1466896 -1466321 -1464902 -1463219 -1462258 -1457968 -1456420 -1454704 -1458696 -1457533
7408 -1457533 -1457880 -1457400 -1460377 -1458589 -1458039 -1455806 -1456637 -1459569 -1455292 -1448753 -1446638 -1447237 -1443756 -1440581 -1444077
7393a444077m216k303M26M164N081M764p00R245J417K684J582n122j645J2675
7379a416025k70q189k404K238L347L663j107K566j24o42m658N101k675k9J1468
7364a407740L395M91J106j219L017n20J775L182l99k790L10p110M500P327M521
7349a390154r60J72k067k299O197N299O34j460N90k251L361L375k408M83k29J747
7333a379970J247K697Q49o27L099J702r67j873Lr7K277L665M930j905j160N154
7317a360976J130J227K581l39j0k763k912l27n235q50K739Q233J3086P662m463
7302a341217q310P91L350M487p729o137K449N528m358j508M582p69M659K458N51
7287a341173N06k623K840Q59j312L475K095P127M631k483q92K048l263K522N566
$$ plain form
7393 -1444077 -1448293 -1450596 -1450170 -1446006 -1440925 -1436161 -1436861 -1427616 -1426199 -1423515 -1421933 -1427055 -1428700 -1416025
7379 -1416025 -1416295 -1424484 -1426888 -1424650 -1421303 -1417640 -1418747 -1416181 -1416305 -1416947 -1421605 -1416504 -1419179 -1419208 -1407740
7364 -1407740 -1404345 -1403854 -1402748 -1403967 -1400950 -1401470 -1399695 -1396513 -1396912 -1399702 -1399392 -1406502 -1402002 -1394675 -1390154
7349 -1390154 -1391114 -1390942 -1393009 -1395308 -1389111 -1383812 -1383178 -1384638 -1384048 -1386299 -1382938 -1379563 -1381971 -1381488 -1381717 -1379970
7333 -1379970 -1378723 -1376026 -1375177 -1375804 -1372705 -1371003 -1371970 -1373843 -1373840 -1373937 -1371660 -1367995 -1363065 -1364970 -1366130 -1360976
7317 -1360976 -1359846 -1358619 -1356038 -1356377 -1356387 -1359150 -1362062 -1362389 -1367624 -1368474 -1365735 -1357502 -1344416 -1336754 -1341217
7302 -1341217 -1349527 -1348736 -1345386 -1340899 -1348628 -1354765 -1352316 -1346788 -1351146 -1352654 -1348072 -1348841 -1344182 -1341724 -1341173
7287 -1341173 -1340667 -1343290 -1340450 -1339591 -1340903 -1337428 -1335333 -1328206 -1323575 -1326058 -1326950 -1324902 -1328165 -1325643 -1320077
7272a320077n04o211r75N638k42L409J098j0025j1302O046Q314N815n27n041k2
7257a324606L16K609N913r99K181P889K645l461m036N253p60k609J95N252J188
7242a303030n67R533j087p365o75r4k074N7O920o2K90M203m491j339J039l560
7226a302302P533N999M004L448K401o349n032N039K427K830L44r5n82J731j013
7211a279617K607L393m442j122j381L219J648M377Q083k760k089M413K681M583
7197a256407M298m243n055J154m327k720L901L293l750m424O673L957M720K269
7183a250661j869L045M76l089m345Q405J062r045l92N815L382r21q66M111l099
7168a247991M007J741R73k44L676L288N69P14j606N89m385j088k59K543J742K762
$$ plain form
7272 -1320077 -1320581 -1326792 -1327767 -1322129 -1322371 -1318962 -1317864 -1327889 -1339191 -1333145 -1324831 -1319016 -1319543 -1324584 -1324606
7257 -1324606 -1324290 -1321681 -1315768 -1316767 -1314586 -1306697 -1304052 -1307513 -1311549 -1306296 -1307056 -1309665 -1309470 -1304218 -1303030
7242 -1303030 -1303597 -1294064 -1295151 -1302516 -1303191 -1303285 -1305359 -1305302 -1298382 -1298444 -1298154 -1293951 -1298442 -1299781 -1298742 -1302302
7226 -1302302 -1294769 -1288770 -1284766 -1281318 -1278917 -1285266 -1290298 -1285259 -1282832 -1280002 -1279658 -1279753 -1280335 -1278604 -1279617
7211 -1279617 -1277010 -1273617 -1278059 -1279181 -1280562 -1277343 -1275695 -1271318 -1263235 -1265995 -1268084 -1263671 -1260990 -1256407
7197 -1256407 -1252109 -1256352 -1261407 -1260253 -1264580 -1267300 -1263399 -1260106 -1263856 -1268280 -1261607 -1257650 -1252930 -1250661
7183 -1250661 -1252530 -1249485 -1249009 -1252098 -1256443 -1248038 -1246976 -1256021 -1256413 -1250598 -1247216 -1248137 -1249003 -1244892 -1247991
7168 -1247991 -1243984 -1242243 -1241270 -1241514 -1237838 -1234550 -1233981 -1233267 -1234873 -1234284 -1238669 -1239757 -1240016 -1237473 -1235731 -1232969
7152a232969M3m376N062M940L165K979J026k109l330m950l429J648K418j864J363
7137a230383K141J495N441M641L967M197j635l533p81L787M90n545j415M951k175
7122a214357M08j70J232j436J526J535o41j347K406J097K767P36P45K334l80j164
7106a204709L862q252K78M224N350K416M916L413r00L973r58j466J43l30j529
7091a189569P91L12j29K256K985m839J44R60o691j626P26J2510k480L174M312
7076a177164M137j666N027J631r70m323k577o664n886L050K974j775Q78N864J317
7061a176147j689K269j255J775P306L912k218q507Q08L18N061K342l929O053N627
7046a158274K665J346n3p497M730J706J452Q77j539m11Q506n7k424M411K305K669
$$ plain form
7152 -1232969 -1232926 -1237302 -1232240 -1227300 -1224135 -1221156 -1220130 -1222239 -1225569 -1230519 -1233948 -1232300 -1229882 -1231746 -1230383
7137 -1230383 -1228242 -1226747 -1221306 -1216665 -1212698 -1208501 -1210136 -1213669 -1214450 -1210663 -1210173 -1215718 -1217133 -1212182 -1214357
7122 -1214357 -1213949 -1214119 -1212887 -1214323 -1212797 -1211262 -1211903 -1213250 -1210844 -1209747 -1206980 -1206244 -1205499 -1203165 -1203545 -1204709
7106 -1204709 -1200847 -1209099 -1208821 -1204597 -1199247 -1196831 -1191915 -1188502 -1189402 -1185429 -1186387 -1187853 -1187710 -1188040 -1189569
7091 -1189569 -1188778 -1188466 -1188595 -1186339 -1183354 -1188193 -1188049 -1187089 -1193780 -1195406 -1194680 -1182170 -1184650 -1181476 -1177164
7076 -1177164 -1173027 -1174693 -1169666 -1168035 -1169005 -1173328 -1175905 -1182569 -1188455 -1185405 -1182431 -1184206 -1183328 -1177464 -1176147
7061 -1176147 -1177836 -1175567 -1176822 -1175047 -1167741 -1163829 -1166047 -1174554 -1173746 -1173428 -1168367 -1166025 -1169954 -1163901 -1158274
7046 -1158274 -1155609 -1154263 -1154316 -1161813 -1157083 -1155377 -1153925 -1153048 -1154587 -1154998 -1146492 -1146549 -1148973 -1144562 -1142257 -1139588
7030a139588m853l921o074l782N398R28M270J685l257P15O467L759n400P952J593
7015a134108j685N454l820k525O449K008P74k808R30O96j873P96p856k600m07
7000a140575L979L891L359J793R202K580j318l889m134j424J083K129o135n029
6986a134488Q77N869M501K423M802j905r33N198P714j867p110n250M847K972K225
6971a110125M368K549J176K674P08n839m341m31R222J016J41j123O116j911j153
6956a096953o489l832j737L112N182L916q96m448n708l507O349P696l423n996
6942a106734J998N682K913l826o91M53M324M196J835K891l813J553m31K32R216
6927a080202Q662J554n142m821l571l2J863o173l419N306K822m271L169L579P214
$$ plain form
7030 -1139588 -1144441 -1148362 -1154436 -1158218 -1152820 -1151892 -1147622 -1145937 -1149194 -1148479 -1142012 -1138253 -1143653 -1135701 -1134108
7015 -1134108 -1135793 -1130339 -1134159 -1136684 -1130235 -1128227 -1127453 -1130261 -1129331 -1128635 -1130508 -1129712 -1137568 -1140168 -1140575
7000 -1140575 -1136596 -1132705 -1129346 -1127553 -1118351 -1115771 -1117089 -1120978 -1125112 -1126536 -1125453 -1123324 -1129459 -1134488
6986 -1134488 -1133611 -1127742 -1123241 -1120818 -1116016 -1117921 -1118854 -1113656 -1105942 -1107809 -1114919 -1120169 -1115322 -1112350 -1110125
6971 -1110125 -1105757 -1103208 -1102032 -1099358 -1098650 -1104489 -1108830 -1109261 -1100039 -1099023 -1098882 -1100005 -1093889 -1095800 -1096953
6956 -1096953 -1103442 -1107274 -1109011 -1105899 -1100717 -1096801 -1097697 -1102145 -1107853 -1111360 -1105011 -1097315 -1100738 -1106734
6942 -1106734 -1104736 -1099054 -1096141 -1099967 -1100658 -1100205 -1095881 -1091685 -1089850 -1086959 -1090772 -1089219 -1089650 -1089418 -1080202
6927 -1080202 -1071540 -1069986 -1075128 -1079949 -1083520 -1083552 -1081689 -1087862 -1091281 -1085975 -1083153 -1087424 -1084255 -1080676 -1073462
6912a073462J575J289m06o86n855L653P367L193m508Q37K238p166n233P59l98
6897a076803N614P273j261m084m800j625j864K648O089J167L485j811l648l62
6883a069982N784q22J768K043N507N558N346n608p940j495L372j434L605L246
6869a051052p03n570K295K786N163M993j843J478K550j97q769P35m569L442p84
6854a050045l166R149J599P64O90J200J448j875J290M780r13J682n106r135N553
6839a042085O704K02J423o113r702l84o16q21l98R026R215Q147n682q392J711
6824a037765M28L433J373m673N560J567n39M985N885K660J726K748n138l262J700
6809a019312M908J188K728k354k116N137L7K215L1K378M750j087k704J252r81
$$ plain form
6912 -1073462 -1071887 -1070598 -1071004 -1071690 -1077545 -1073892 -1066525 -1063332 -1067840 -1067003 -1064765 -1071931 -1077164 -1076405 -1076803
6897 -1076803 -1071189 -1063916 -1065177 -1069261 -1074061 -1075686 -1077550 -1074902 -1068813 -1067646 -1064161 -1065972 -1069620 -1069982
6883 -1069982 -1064198 -1065020 -1063252 -1061209 -1055702 -1050144 -1044798 -1050406 -1058346 -1059841 -1056469 -1057903 -1054298 -1051052
6869 -1051052 -1051755 -1057325 -1055030 -1052244 -1047081 -1042088 -1043931 -1042453 -1039903 -1040100 -1048869 -1048134 -1052703 -1049261 -1050045
6854 -1050045 -1053211 -1044062 -1042463 -1041699 -1041009 -1039809 -1038361 -1040236 -1038946 -1034166 -1035079 -1033397 -1038503 -1047638 -1042085
6839 -1042085 -1035381 -1035179 -1033756 -1039869 -1049571 -1049955 -1050571 -1051392 -1051790 -1042764 -1033549 -1025402 -1031084 -1039476 -1037765
6824 -1037765 -1037337 -1033904 -1032531 -1037204 -1031644 -1030077 -1030616 -1025631 -1019746 -1017086 -1015360 -1012612 -1017750 -1021012 -1019312
6809 -1019312 -1014404 -1013216 -1010488 -1012842 -1014958 -1009821 -1009784 -1007569 -1007538 -1005160 -1000410 -1001497 -1004201 -1002949 -1003930
6794a003930p400L27M739q111k333O166M78M460k613k94L76N396k713m724R70
6779a009206L056L734Q407p52o188K893N605j084n104L223N596n174l738K108
6765i96624O264L306J664M139O85L483J797n10N599j251j775k033l101q013j731
6750i88101O109J987L882M582K908P810L115q467n262m915J403M690k299j1001
6736i83559j0549j3461p969o023j3056j2836k447J0674R003J049L141Q573K668
6723a014792N157J585Q225J096r242l937L696J362K005N538O647K553l390r148
6709a002645k318M982O624M69l462Q365J574J919L385M14k785n937m590J510P380
6694i85115j0j371j685K729N694j149m428j506o421K695P603P999l211k078l025
$$ plain form
6794 -1003930 -1011330 -1011003 -1006264 -1014375 -1016708 -1010542 -1010064 -1005604 -1008217 -1008511 -1008135 -1002739 -1005452 -1010176 -1009206
6779 -1009206 -1006150 -1002416 -994009 -994761 -1000949 -998056 -992451 -993535 -998639 -995416 -989820 -994994 -998732 -996624
6765 -996624 -990360 -987054 -985390 -981251 -980566 -977083 -975286 -975796 -970197 -971448 -973223 -975256 -978357 -986370 -988101
6750 -988101 -981992 -980005 -976123 -971541 -968633 -960823 -957708 -966175 -971437 -976352 -974949 -970259 -972558 -983559
6736 -983559 -994108 -1007569 -1015538 -1021561 -1034617 -1047453 -1049900 -1039226 -1030223 -1029174 -1026033 -1017460 -1014792
6723 -1014792 -1009635 -1008050 -999825 -998729 -1007971 -1011908 -1008212 -1006850 -1004845 -999307 -992660 -990107 -993497 -1002645
6709 -1002645 -1004963 -999981 -993357 -992888 -996350 -987985 -986411 -984492 -981107 -980693 -983478 -989415 -994005 -992495 -985115
6694 -985115 -985125 -986496 -988181 -985452 -979758 -980907 -985335 -986841 -993262 -990567 -982964 -974965 -978176 -980254 -983279
6679i83279k749Q208J550o971l033R52J505N725L358j745q349K770K047K186j109
6664i78934o074J365J4535N250J091J917n388q09q70L442P916l705n569L212j453
6649i64074l15m337l022M831k726m047Q931J870j207o75J203o431K241J0282L804
6634i53672N067K671k147J866M457P04j446j14J857L772q5l027l464N180m466
6619i42847K377p57l002m139O992m606n880N03k08M861J464k013Q664O439O247
6604i25905p868j811J213k788j792O547o97o351l468k324K943n234O676J0353
6590i30506J058o853O534K258k989m79m978J134J336M719L704q5m647P937R446
6575i12411j0638j2156K018R804K104m567k21K364o595r16M275j520Q72K26L336
$$ plain form
6679 -983279 -986028 -977820 -976270 -983241 -986274 -985322 -983817 -978092 -974734 -976479 -984828 -982058 -980011 -977825 -978934
6664 -978934 -985008 -983643 -969108 -963858 -962767 -960850 -966238 -967047 -967917 -964475 -956559 -960264 -965833 -962621 -964074
6649 -964074 -964389 -968726 -971748 -966917 -969643 -973690 -964759 -962889 -964096 -964771 -963568 -969999 -967758 -957476 -953672
6634 -953672 -948605 -945934 -948081 -946215 -941758 -941054 -942500 -942614 -940757 -936985 -937070 -940097 -943561 -938381 -942847
6619 -942847 -940470 -941227 -944229 -948368 -941376 -945982 -951862 -951359 -951567 -946706 -945242 -947255 -938591 -932152 -925905
6604 -925905 -933773 -935584 -934371 -937159 -938951 -932404 -933101 -939452 -942920 -945244 -942301 -947535 -940859 -930506
6590 -930506 -929448 -936301 -929767 -927509 -930498 -930977 -935955 -934821 -933485 -928766 -925062 -925147 -929794 -921857 -912411
6575 -912411 -923049 -935205 -933187 -923383 -921279 -925846 -926067 -923703 -930298 -931214 -926939 -928459 -927587 -927361 -924025
6560i24025K215k024l265n639n19Q2q67L660r56K710N022P152m099o310j027O597
6544i21293M351Q23L818j638N494N827q82o331O83j758k996j992N856K55k758
6529i12541J790K410O068l483q947M128l103N01M513M757M679Q81M73l786q72
6514i02532l749J830N219n413j822o22j822n97J237J1383O026k789K543J750l456
6499h92814l945k128J747L931R15m657M550j530j298k751L143J892J712K344O21
6484h88268J535j109J600k374m828N388l328q373O29L239l884M720J062p942Q78
6469i01055N36M761K930j632p21K294k42M028N454R029M157K964r8m652k431m831
6453h79509J331P97K599J808k09j030j064o250n983N577J833K586K404J814p76
$$ plain form
6560 -924025 -921810 -923834 -927099 -932738 -933257 -933175 -934042 -930382 -931338 -928628 -923606 -916454 -920553 -926863 -927890 -921293
6544 -921293 -916942 -916119 -912301 -913939 -908445 -902618 -903500 -909831 -909148 -910906 -913902 -915894 -910038 -909783 -912541
6529 -912541 -910751 -908341 -902273 -905756 -914703 -910575 -913678 -913177 -908664 -903907 -899228 -898347 -897874 -901660 -902532
6514 -902532 -906281 -904451 -899232 -904645 -906467 -907089 -908911 -909508 -908271 -896888 -890862 -893651 -891108 -889358 -892814
6499 -892814 -896759 -898887 -897140 -893209 -892294 -896951 -892401 -893931 -895229 -897980 -894837 -892945 -891233 -888889 -888268
6484 -888268 -886733 -887842 -886242 -888616 -893444 -888056 -891384 -899757 -899128 -895889 -899773 -895053 -893991 -901933 -901055
6469 -901055 -900519 -895758 -892828 -894460 -895181 -892887 -893129 -889101 -883647 -874618 -870461 -867497 -867595 -872247 -874678 -879509
6453 -879509 -878178 -877381 -874782 -872974 -873183 -874213 -875277 -881527 -887510 -881933 -880100 -877514 -875110 -873296 -874072
6438h74072q30N757j513k903J039j451m538j546l544K315L051J549n241J017O705
6423h74205P017M448M32k43k601j1033k505J514K123n693P102R393o250j1093
6409h81594o035J1469P564j696o09L483P65n975J989R88j581k624L554j672k349
6394h74323N814M851J149p214l786l173M176M198k239l43P515K572J141j008j478
6379h62148R05L272k229n47L242L231O08J365l607l434O25K906o973J684Q97J727
6363h58476L55N491l784n110j899M298K283O124O858j565l657O50O346P917L01
6348h33868p699K801l883o617J639N571L178K741j1554o427N194l198N741O261
6334h40120K387M063j1725j455N085K174l97Q21n316o580M473k108N06m150l231
$$ plain form
6438 -874072 -874902 -869145 -870658 -873561 -872522 -873973 -878511 -880057 -883601 -881286 -878235 -876686 -881927 -880910 -874205
6423 -874205 -867188 -862740 -862308 -862551 -865152 -876185 -878690 -877176 -875053 -880746 -873644 -864251 -870501 -881594
6409 -881594 -887629 -876160 -868596 -870292 -870901 -867418 -866653 -872628 -870639 -869651 -871232 -873856 -870302 -871974 -874323
6394 -874323 -868509 -863658 -862509 -869723 -873509 -876682 -872506 -868308 -870547 -870890 -863375 -860803 -859662 -860670 -862148
6379 -862148 -861243 -857971 -860200 -860747 -857505 -854274 -853666 -852301 -855908 -859342 -858717 -855811 -862784 -861100 -860203 -858476
6363 -858476 -858121 -852630 -856414 -861524 -863423 -859125 -856842 -850718 -843860 -845425 -849082 -848432 -842086 -834169 -833868
6348 -833868 -841567 -838766 -842649 -849266 -847627 -842056 -838878 -836137 -847691 -854118 -848924 -852122 -846381 -840120
6334 -840120 -837733 -833670 -845395 -846850 -841765 -839591 -839988 -839167 -844483 -851063 -846590 -848698 -848192 -852342 -855573
6319h55573J709Q236J3052K206k353n59j070L826n696j365P242k24K749p529O30
6304h34719o0j71M131k59m184n291J729L427M649L040k383o488k49L852J353n42
6288h32165L60J554n230o374j107L130l089N32R823O647L217K446n281N07P805
6273h17225J229k720l578J088J05P606K995q105o437L78J0876p54p330n157K949
6258h24080k96J535P002P209j302J287j222o279J645K966k580p744k518k201P78
6243h25800M106P786M747O795m015p542J257Q53n468N359J466m041K400j721O8
6228h13750j291j416M85N25P157N263q59m656n754J717J859L37M956k476o210
6213h14113n934M909K155M49M715o4L11Q562L289m167L135n802j601j431k596
$$ plain form
6319 -855573 -853864 -845628 -832576 -830370 -832723 -833282 -834352 -830526 -836222 -837587 -830345 -830569 -827820 -835349 -834719
6304 -834719 -834779 -834950 -830819 -831078 -835262 -840553 -838824 -835397 -830748 -827708 -830091 -836579 -836828 -832976 -831623 -832165
6288 -832165 -831805 -830251 -835481 -841855 -842962 -839832 -842921 -842389 -832566 -825919 -822702 -820256 -825537 -825030 -817225
6273 -817225 -815996 -818716 -822294 -821206 -821101 -813495 -810500 -818605 -825042 -824664 -813788 -814542 -821872 -827029 -824080
6258 -824080 -824376 -822841 -815839 -808630 -809932 -808645 -809867 -816146 -814501 -811535 -814115 -821859 -824377 -826578 -825800
6243 -825800 -821694 -813908 -809161 -802366 -806381 -813923 -812666 -811813 -817281 -811922 -810456 -814497 -812097 -813818 -813750
6228 -813750 -815041 -816457 -815972 -815447 -808290 -803027 -803886 -808542 -814296 -812579 -810720 -810383 -805427 -807903 -814113
6213 -814113 -820047 -815138 -812983 -812534 -807819 -807883 -807572 -799010 -795721 -799888 -796753 -802555 -804156 -805587 -808183
6198h08183K79j637q8K535N772K65O406k796m576q81P84J409P19P156L849l460
6182g92447m382J922K314m006L91K127N847m819r887m098O294J136k70n81N996
6167g94463K969K374l111j666M737P860P89o742k568J912l076J208Q85n010N643
6152g88259k913n294O122k189K45o718l880L679P894O99m707k799l886M354L628
6137g94024J951O390Q84l008l774M378L281K246j590j612P615N525j577m817J118
6122g77014J064m688J182L458M52k201n639N197J010k426l917L919M634P237q227
6107g75959k000O138K167m165J753L059k271j294M152n19M4L341J562j379L661
6092g61710k265k705q31L003m392o509L675N518k081l920K532l602k418o761m85
$$ plain form
6198 -808183 -807904 -809541 -809629 -807094 -801322 -801057 -794651 -797447 -802023 -802904 -802120 -800711 -799992 -792836 -788987 -792447
6182 -792447 -796829 -794907 -792593 -796599 -796208 -794081 -788234 -793053 -802940 -807038 -800744 -799608 -799878 -800459 -794463
6167 -794463 -791494 -789120 -792231 -793897 -789160 -781300 -780511 -787253 -789821 -787909 -790985 -789777 -788892 -793902 -788259
6152 -788259 -791172 -796466 -790344 -792533 -792288 -799006 -802886 -799207 -791313 -790614 -795321 -798120 -802006 -797652 -794024
6137 -794024 -792073 -785683 -784799 -787807 -791581 -787203 -783922 -781676 -783266 -784878 -777263 -771738 -773315 -778132 -777014
6122 -777014 -775950 -780638 -779456 -775998 -775546 -777747 -783386 -778189 -777179 -779605 -783522 -779603 -774969 -767732 -775959
6107 -775959 -777959 -771821 -769654 -773819 -772066 -769007 -771278 -772572 -768420 -768939 -768895 -765554 -763992 -765371 -761710
6092 -761710 -763975 -766680 -767511 -764508 -768900 -775409 -771734 -766216 -768297 -772217 -769685 -773287 -775705 -782466 -782951
6077g82951Q803Q621R28j0480J678Q28m580P81l823k012M061R891Q33k202Q53
6062g68771P64l286j157L076j467q4L65m37M297j795L279k032J066M818K184l500
6046g62680R224k091K423L577l424m156m257o98K820l983q01q29N024N075n006
6031g59782l115J234K799O007N906M976k946j518L853o894j3417K893N273K361
6017g52370p63j336J323o32J98L890j758P245L309k429k268m787j929K899O76
6002g48732M692m620r428p665l882J1808k944J838P219L659J1232o32n314o606
5988g49375k384J163J541K697j473m650M639k081M849L865k002m604M63J0341
5974g37011K554o627l969q99N575L376k455J742k274k262l454j002J932k806o28
$$ plain form
6077 -782951 -774148 -765527 -764599 -775079 -773401 -772573 -777153 -776372 -780195 -782207 -778146 -768255 -767422 -769624 -768771
6062 -768771 -768007 -771293 -772450 -769374 -770841 -770925 -770560 -770997 -766700 -768495 -765216 -767248 -766182 -761364 -759180 -762680
6046 -762680 -753456 -755547 -753124 -749547 -752971 -757127 -761384 -762082 -759262 -763245 -764046 -764875 -759851 -754776 -759782
6031 -759782 -762897 -761663 -758864 -752857 -746951 -741975 -744921 -746439 -742586 -749480 -762897 -760004 -754731 -752370
6017 -752370 -753133 -754469 -753146 -753778 -753580 -749690 -751448 -744203 -740894 -743323 -745591 -750378 -752307 -749408 -748732
6002 -748732 -744040 -748660 -758088 -765753 -769635 -757827 -760771 -758933 -751714 -748055 -736823 -737455 -742769 -749375
5988 -749375 -751759 -750596 -749055 -746358 -747831 -752481 -747842 -749923 -745074 -741209 -743211 -747815 -747352 -737011
5974 -737011 -734457 -741084 -745053 -745952 -740377 -737001 -739456 -737714 -739988 -742250 -745704 -746706 -744774 -747580 -748208
5959g48208J458k672K094N748M205r90K350K169K237m292p721J157P117o517J536
5944g40329k010j986j594l784o72P23M334L838L249N981p36K529j395o061j291
5929g39204M25R829K084m21k644j919n757J479P119J084j977P54m971l516o361
5914g43996J040j502k174O275j182K777K291l13M91j864J238M065L699L662m515
5899g30008L31N217m902n545O143J0702K441P19J965l247j0162j3388k070M779
5885g37025K479L504L52K387j242J337M811J0001J0368J132l416p619r717o979
5871g29627k238O396n34j179K254k54O491M723j902j0846J655J202M306N845l024
5856g16732j752m070J092j863m572k68K941L875L646K560j223K541K44m605l344
$$ plain form
5959 -748208 -746750 -749422 -747328 -741580 -737375 -738365 -736015 -733846 -731609 -735901 -743622 -742465 -735348 -741865 -740329
5944 -740329 -742339 -744325 -745919 -749703 -750375 -749652 -745318 -741480 -738231 -732250 -732986 -730457 -731852 -737913 -739204
5929 -739204 -738779 -728950 -726866 -727287 -729931 -731850 -737607 -736128 -729009 -727925 -729902 -729148 -734119 -737635 -743996
5914 -743996 -742956 -744458 -746632 -740357 -741539 -738762 -736471 -736784 -736293 -738157 -736919 -732854 -729155 -725493 -730008
5899 -730008 -729677 -724460 -729362 -734907 -728764 -718062 -715621 -714902 -712937 -716184 -726346 -739734 -741804 -737025
5885 -737025 -734546 -731042 -730690 -728303 -729545 -728208 -723397 -713396 -703028 -701896 -705312 -712931 -722648 -729627
5871 -729627 -731865 -725469 -726003 -727182 -724928 -725182 -718691 -713968 -715870 -726716 -725061 -723859 -719553 -713708 -716732
5856 -716732 -718484 -722554 -721462 -723325 -727897 -728165 -725224 -721349 -717703 -715143 -716366 -713825 -713581 -718186 -721530
5841g21530M288N143k086o51N497O889j525m52J764k460l926j594m300m02J419
5826g13926P548L183m865m260k743L601O95l323m949l211P807O036N692Q299P59
5811f93657J990K78m31k253l71N091n544o451o332L95K638L328K438l328l82O285
5795f96306J725n351n087N571N863K027k166q676j432L232l610k877M045N694
5781f97348k684k280j435K962M149Q867M881j475n52n962k976k852Q32L558o728
5766f99043o450J712K440j552l934k686L441r87q54L537j504j484n06M374L265
5751g00231N425K562J872l233n263o870Q934K560k97K395p183p960P005K820P044
5736f90420O221k031N88k649j980J339J454m31m492L953K637Jm76K925O189L645
$$ plain form
5841 -721530 -717242 -712099 -714185 -714836 -709339 -702450 -703975 -704427 -702663 -705123 -709049 -710643 -714943 -715345 -713926
5826 -713926 -706378 -703195 -708060 -712320 -715063 -711462 -710767 -714090 -719039 -722250 -714443 -708407 -702715 -694416 -693657
5811 -693657 -691667 -691389 -691820 -694073 -694444 -689353 -694897 -701348 -707680 -707285 -704647 -701319 -698881 -702209 -702591 -696306
5795 -696306 -694581 -699932 -705019 -699448 -693585 -691558 -693724 -702400 -703832 -700600 -704210 -707087 -703042 -697348
5781 -697348 -700032 -702312 -703747 -700785 -696636 -687769 -682888 -684363 -684915 -690877 -693853 -696705 -695873 -692315 -699043
5766 -699043 -705493 -703781 -701341 -702893 -706827 -709513 -706072 -707059 -707913 -704376 -705880 -707364 -707870 -703496 -700231
5751 -700231 -694806 -692244 -690372 -693605 -698868 -705738 -696804 -694244 -694541 -692146 -699329 -707289 -700284 -697464 -690420
5736 -690420 -684199 -686230 -685642 -688291 -690271 -688932 -687478 -687909 -692401 -688448 -685811 -685810 -686286 -683361 -677172 -673527
5720f73527k270o791q694n228KO315j88M54j779K060j562p063L466O273l146L704
5704f87974J699L452L29l215l396R612M023l760j475L042p069p944Q305J0639
5690f73732O049p81o136k364k632p40R18k11N13j086N891j046l517K27L882P735
5674f67030O438r470o536P55K127k627L507j708k249N771k358K00k780R18N433
5659f69609L003J119Q136L857q112n603Q48K083n387k189J602j1010m297J880
5645f83679L277K645j350K243M730m00J919P174j807j858K224j550J526j109k792
5630f68807k653l60n47n882p339R844R118n39L099M665J076m790Q847k160j0087
5615f66515n376J707K557j267Q697L12k4k822r68K206j952nk925j058K59L385
$$ plain form
5720 -673527 -675797 -682588 -691282 -696510 -696508 -690193 -690381 -689927 -691706 -689646 -691208 -698271 -694805 -688532 -691678 -687974
5704 -687974 -686275 -682823 -682494 -685709 -689105 -679493 -675470 -679230 -680705 -677663 -684732 -692676 -684371 -673732
5690 -673732 -667683 -668464 -674600 -676964 -679596 -680336 -679418 -679629 -679116 -680202 -674311 -675357 -678874 -678647 -674765 -667030
5674 -667030 -660592 -670062 -676598 -675843 -673716 -676343 -672836 -674544 -676793 -671022 -673380 -673180 -675960 -675042 -669609
5659 -669609 -666606 -665487 -657351 -653494 -661606 -667209 -666361 -664278 -669665 -671854 -670252 -681262 -685559 -683679
5645 -683679 -680402 -677757 -679107 -676864 -672134 -672534 -670615 -663441 -665248 -667106 -664882 -666432 -664906 -666015 -668807
5630 -668807 -671460 -671820 -672367 -678249 -685588 -675744 -666626 -667165 -664066 -659401 -658325 -663115 -654268 -656428 -666515
5615 -666515 -671891 -670184 -667627 -668894 -660197 -659885 -659909 -662731 -663699 -661493 -663445 -663450 -666375 -667433 -667174 -663789
5599f63789O695o5j956l061j2317Q2K376O668n2o389O213O761J597n546n095j18
5583f67996N80j209p08K949P609M688k833l973l039j912J624l75J819K135J822
5568f58819L752L880J917n029j294N897J723q725l282K891n80M484O9n712p886
5553f66714Q493J2190L293M589k016l018m115j908L812k015P95j920l435m192
5539f56161j219J108P597O494J124l232L25j177k763Q44k087k915P781M534L8
5524f39709J132k401J89o99J383J035j936o916o173O487M01n273Q153O451k193
5509f40069j0178K439N571O52r57n479n210M044j475l117K612L118L404N429j855
5494f41071l984J71l682n811O075J195m363J613M52J508L691O056m567j639j348
$$ plain form
5599 -663789 -657094 -657159 -659115 -662176 -674493 -674411 -672035 -665367 -665419 -671808 -665595 -658834 -657237 -662783 -667878 -667996
5583 -667996 -667416 -668625 -669333 -666384 -658775 -654087 -656920 -660893 -663932 -665844 -664220 -664595 -662776 -660641 -658819
5568 -658819 -655067 -651187 -649270 -654299 -655593 -649696 -647973 -656698 -659980 -657089 -657669 -653185 -653116 -658828 -666714
5553 -666714 -658221 -646031 -642738 -638149 -640165 -643183 -647298 -649206 -645394 -647409 -646614 -648534 -651969 -656161
5539 -656161 -657380 -656272 -648675 -642181 -641057 -644289 -643964 -645141 -647904 -647060 -649147 -652062 -644281 -639747 -639709
5524 -639709 -638577 -640978 -640789 -641488 -640105 -639070 -641006 -647922 -654095 -647608 -647207 -652480 -644327 -637876 -640069
5509 -640069 -650247 -647808 -642237 -641585 -642542 -648021 -653231 -649187 -650662 -653779 -651167 -648049 -644645 -639216 -641071
5494 -641071 -645055 -644884 -648566 -654377 -648302 -647107 -651470 -649857 -649405 -647897 -644206 -638150 -642717 -644356 -645704
5479f45704j201M868M456j0836q6j122O59M047j767k231K8J06L505L759J304J853
5463f38362o13j077L827O128l271P69k682q046N048p68l833M228O456n427r37
5448f38560J146m25N981j237m389J693O555K015o87n57o094n490J004P337N412
5433f26296J791o140n980r077L401O776j529k239N445K93M59K417K989N693J876
5418f20121k32m718p279m399M488L431j755n199K480J052n696K374N714p94n911
5403f36565J699J697Q26L43K538k221j65n78j8l10Q69L88K008m429l882j209J1251
5386f27758L010r22n942n613J60O774K680j935j466n486N176Q085k247k084m80
5371f28048K687J0571N879o794k809O71K643o025J781J444P13m028m048M284l329
$$ plain form
5479 -645704 -646905 -642037 -637581 -648417 -648503 -649625 -648966 -644919 -646686 -648917 -648889 -648783 -645278 -641519 -640215 -638362
5463 -638362 -638975 -640052 -636225 -630097 -633368 -632599 -635281 -643327 -638279 -639047 -642880 -638652 -632196 -637623 -638560
5448 -638560 -637414 -637839 -631858 -633095 -637484 -635791 -629236 -627221 -627908 -628465 -634559 -640049 -639045 -631708 -626296
5433 -626296 -624505 -630645 -636625 -645702 -642301 -635525 -637054 -639293 -633848 -633555 -633096 -630679 -627690 -621997 -620121
5418 -620121 -620353 -625071 -632350 -636749 -632261 -628830 -630585 -635784 -633304 -632252 -637948 -635574 -629860 -630654 -636565
5403 -636565 -634866 -633169 -632343 -632000 -629462 -631683 -631848 -632426 -632444 -632754 -631885 -631497 -629489 -633918 -637800 -639009 -627758
5386 -627758 -624748 -625670 -631612 -637225 -637065 -630291 -627611 -629546 -631012 -636498 -631322 -623237 -625484 -627568 -628048
5371 -628048 -625361 -614790 -608911 -615705 -618514 -617843 -615200 -621225 -619444 -618000 -617287 -621315 -625363 -621079 -624408
5356f24408j85Q723J560n669m452N366j40q319K946P121M578L968O637q450j2104
5341f22828P88J377p8j705O77M958M24k149l600l527j629M18P28M411p4k462J496
5324f22775n700k74M133J143J1239j904m634J048Q626k06m267m713K353N30K160
5309f13241K158j265J518n862N021J418m59q215K268L643K390P925N983K278r617
5294f04057k417l768n015K730J935L532N63l012o036j239P074J386q37L93m170
5279f12938J544L229j67L105p025p100J830K659R43P031L698N43r10K60j693K748
5263f02243n541p403J68M985Q740j208l772j136m128o490Q39L642L66L34l781
5248f16628Q83K400N646L321K674J72m803n67P200L056k2l498Q40J748n763l809
$$ plain form
5356 -624408 -624593 -615870 -614310 -619979 -624431 -619065 -619205 -627524 -624578 -617457 -612879 -608911 -602274 -610724 -622828
5341 -622828 -622040 -620663 -620741 -622446 -621769 -616811 -616387 -618536 -622136 -625663 -627292 -626874 -626146 -621735 -621809 -624271 -622775
5324 -622775 -628475 -628749 -624616 -623473 -612234 -614138 -618772 -617724 -609098 -609304 -613571 -618284 -615931 -615401 -613241
5309 -613241 -611083 -612348 -610830 -616692 -611671 -610253 -610712 -618927 -616659 -613016 -610626 -602701 -596718 -594440 -604057
5294 -604057 -606474 -610242 -615257 -612527 -610592 -607060 -606497 -609509 -615545 -616784 -609710 -608324 -609161 -608768 -612938
5279 -612938 -611394 -608165 -608332 -605227 -612252 -619352 -617522 -614863 -613920 -606889 -603191 -602648 -603558 -603298 -604991 -602243
5263 -602243 -607784 -615187 -615019 -610034 -601294 -602502 -606274 -607410 -611538 -618028 -617189 -613547 -613181 -612847 -616628
5248 -616628 -615745 -613345 -607699 -604378 -601704 -601532 -606335 -606902 -599702 -596646 -596668 -600166 -599326 -597578 -603341 -607150
5232f07150N126N295M71q1N23p533o181n279o14Q327Q571P79l916N179j901p228
5216f05612n58J453M787M711J02P592K74n764J837l754q212K115M064K128k091
5201e96928p61O90j461J198L582P51n58o26j799J185q749J674M523K75p186k889
5185f07079L528O888m02R91K609j272N80Q29L724M006N2j0927l022L264L504P66
5169e91961m46l051O598L35N46L451n440k912K459O663m83J273J579j2020j640
5154e95049O332m71M20j954M83K735L407L139l47q0j0851l874J2923M924j619
5139e79882L695Q73n764m574j325r81k37l77m699j041L806L0J966O365M758K469
5123e74918q39M380J290j0191r737J127N088j872L17j649L641Q225J616o470l330
$$ plain form
5232 -607150 -602024 -596729 -596258 -596339 -595816 -603349 -609530 -614809 -615423 -607096 -598525 -597746 -601662 -596483 -598384 -605612
5216 -605612 -606170 -604717 -599930 -595219 -595117 -587525 -587251 -593015 -591178 -594932 -603144 -601029 -596965 -594837 -596928
5201 -596928 -597689 -596999 -598460 -597262 -593680 -592929 -593487 -594113 -595912 -594727 -603476 -601802 -597279 -597004 -604190 -607079
5185 -607079 -603551 -596663 -597065 -596074 -593465 -594737 -594157 -593328 -589604 -585598 -585546 -596473 -599495 -596231 -592727 -591961
5169 -591961 -592407 -595458 -588860 -588525 -587979 -584528 -589968 -592880 -590421 -583758 -584241 -582968 -581389 -593409 -595049
5154 -595049 -588717 -589188 -588768 -590722 -590239 -587504 -584097 -580958 -581305 -581385 -592236 -596110 -583187 -578263 -579882
5139 -579882 -576187 -575314 -581078 -585652 -586977 -587958 -588195 -588572 -593271 -594312 -590506 -590476 -588510 -582145 -577387 -574918
5123 -574918 -575757 -571377 -570087 -580278 -590015 -588888 -583800 -585672 -585355 -587004 -583363 -575138 -573522 -579992 -583322
5108e83322m132m038Q186N453r57q970n20J585k685K718P464M194m475o922p678
5093e94099p028J619R647J861R05j58K389M091L467j0280m914P253P258K842J937
5078e73210n669p812l842L544N567N607k534j347K358M493m975Q95M840o828n879
5063e84792M03K967k008Q871O714l549m139J751Q48P64j0173p448j009J1672M289
5048e74839l601l256M50O801K560j818M849l70k640q38m033m248l068K13P148
5033e76690k136k809K650K596J251K575J158n344O195J54p543k003M745M53k389
5018e77137k640N948K073J915n635m34R298M397p100p302p03j30N007l657k871
5003e78971R262j139l930J388K281n076j062L074o56P090M051l775l419O68k887
$$ plain form
5108 -583322 -587454 -591492 -583306 -577853 -578810 -587780 -588300 -586715 -589400 -586682 -579218 -575024 -579499 -586421 -594099
5093 -594099 -601127 -599508 -589861 -588000 -587095 -587253 -584864 -580773 -577306 -587586 -592500 -585247 -577989 -575147 -573210
5078 -573210 -578879 -586691 -590533 -586989 -581422 -575815 -578349 -579696 -577338 -572845 -577820 -576925 -572085 -578913 -584792
5063 -584792 -584389 -581422 -583430 -574559 -567845 -571394 -575533 -573782 -572934 -572170 -582343 -589791 -590800 -579128 -574839
5048 -574839 -578440 -581696 -581246 -574445 -571885 -573703 -568854 -569224 -571864 -572702 -576735 -580983 -584051 -583838 -576690
5033 -576690 -578826 -581635 -578985 -576389 -575138 -572563 -571405 -576749 -570554 -570400 -577943 -579946 -575201 -574748 -577137
5018 -577137 -579777 -573829 -571756 -569841 -575476 -575910 -566612 -562215 -569315 -576617 -577320 -577450 -572443 -576100 -578971
5003 -578971 -569709 -570848 -574778 -573390 -571109 -576185 -577247 -574173 -574829 -567739 -563688 -567463 -570882 -570214 -573101
4988e73101k861q1k328J330Q272m596p377R41P302L760k760k948q3J566M931L554
4972e64479N563K365K810l019n385q36r532q298l061j058O455R0L70M222K775
4957e71018L062N493q17L23R864K394m567l461p636o027O13O223M807j530n351
4942e67628K919R885M522n090l458N246o622k943K618l397N590K588K46j129K974
4927e53679N59j605k616j687L398O756j55k433p159o036M00M288M901l510k72
4912e58850k166m708l889n91O036N448J127j137n782J442L505N91r05l985Q185
4897e55679Q879M330m351m365j607l521m579j203L704M052P048L637j1297k095
4883e57047m69m349J169K07P858O033K818k762k773N670l187n898L05o502J758
$$ plain form
4988 -573101 -575962 -576043 -578371 -577041 -568769 -573365 -580742 -579801 -572499 -568739 -571499 -574447 -574530 -572964 -568033 -564479
4972 -564479 -558916 -556551 -553741 -556760 -562145 -562981 -572513 -580811 -583872 -584930 -578475 -578385 -578015 -573793 -571018
4957 -571018 -567956 -562463 -563280 -562957 -553093 -550699 -555266 -558727 -566363 -572390 -571777 -565554 -560747 -562277 -567628
4942 -567628 -564709 -554824 -550302 -555392 -558850 -553604 -560226 -563169 -560551 -563948 -558358 -555770 -555524 -556653 -553679
4927 -553679 -553120 -554725 -557341 -559028 -555630 -548874 -549029 -551462 -558621 -564657 -564257 -559969 -555068 -558578 -558850
4912 -558850 -561016 -565724 -569613 -570204 -564168 -558720 -557593 -558730 -564512 -563070 -559565 -558974 -559879 -563864 -555679
4897 -555679 -546800 -542470 -546821 -551186 -552793 -556314 -560893 -562096 -558392 -554340 -547292 -543655 -554952 -557047
4883 -557047 -557516 -561865 -560696 -560489 -552631 -546598 -543780 -546542 -549315 -543645 -546832 -552730 -552425 -558927 -557169
4868e57169j267k325J625P294o63K291O466L103O28k950n223l784Q21J648m524
4853e54029m087p11M648l202o685M391K566J29J876K205n709l297N869M276l686
4838e55446J5q78K338m56Q44j615J695l389l443M673J137m347m784M887J048l803
4822e61524O84K569L298R795j52J811O915J216k002L083J84j515L510j796p607
4807e41531p153L312n678N99j737P47J2k882L970N779L000j580P5L681K945M70
4791e35971J676l834n187q191q328L226O627O828K89M666M887q956M0N251K2k181
4775e39136j129k839p84J216j883j904k707p62N946N893M90l480k549m539J258
4760e46909k911O198J64N51O641P63k167O51O09m975j289J681L606L216M39j0327
$$ plain form
4868 -557169 -558436 -560761 -559136 -551842 -552505 -550214 -543748 -540645 -540017 -542967 -548190 -551974 -551153 -549505 -554029
4853 -554029 -558116 -558827 -554179 -557381 -564066 -559675 -557109 -556980 -555104 -552899 -558608 -561905 -556036 -551760 -555446
4838 -555446 -555431 -556309 -553971 -554427 -553583 -555198 -553503 -556892 -560335 -555662 -554525 -558872 -563656 -558769 -557721 -561524
4822 -561524 -560840 -558271 -554973 -545178 -545330 -543519 -536604 -535388 -537390 -534307 -534123 -535638 -532128 -533924 -541531
4807 -541531 -548684 -545372 -551050 -550451 -552188 -551441 -551429 -554311 -550341 -544562 -541562 -543142 -543067 -539386 -536441 -535971
4791 -535971 -534295 -538129 -543316 -551507 -559835 -556609 -549982 -543154 -542865 -538199 -533312 -542268 -542228 -536977 -536955 -539136
4775 -539136 -540265 -543104 -543888 -542672 -544555 -546459 -549166 -549928 -543982 -538089 -537599 -541079 -543628 -548167 -546909
4760 -546909 -549820 -543622 -543458 -542907 -536266 -535503 -537670 -537019 -536410 -541385 -542674 -540993 -537387 -534171 -533732 -544059
4744e44059j484k701L133L697P590K872k819J58m074N624J051l176k363r11K297
4729e35165M968l78M221m539rL85j755K126k062k029L842P444M56q16j863j3836
4713e39010Q26M951M270l212q824M3N010J874m99O84l535n03k218k589K25J611
4697e40896R07m420P29J291P125M639o413J736M594m107r368k892P790L593L900
4682e31792K980j207L91k886l074Q22O906k405l609J797M602M282L642q05K498
4667e17858J040l616m594m447l838L975l789n444M05M310L034N404j390o439K169
4652e31078L419M586n918k84k413m276N889N736J49j21k767N19L897j507j99M885
4636e19483K917n479k471N422N390J988l914p254m069J823P865k384N505J860
$$ plain form
4744 -544059 -545543 -548244 -545111 -541414 -533824 -530952 -533771 -533613 -537687 -532063 -531012 -534188 -536551 -537462 -535165
4729 -535165 -530197 -530575 -526354 -530893 -530902 -530517 -532272 -530146 -532208 -534237 -530395 -522951 -522495 -523311 -525174 -539010
4713 -539010 -538184 -533233 -528963 -532175 -540999 -540956 -535946 -534072 -534571 -533887 -537422 -537925 -540143 -542732 -542507 -540896
4697 -540896 -539989 -544409 -543680 -542389 -535264 -530625 -537038 -535302 -530708 -534815 -544183 -547075 -539285 -535692 -531792
4682 -531792 -528812 -530019 -529628 -532514 -535588 -534766 -527860 -530265 -533874 -532077 -527475 -523193 -519551 -520356 -517858
4667 -517858 -516818 -520434 -525028 -529475 -533313 -529338 -533127 -538571 -538166 -533856 -530822 -525418 -526808 -533247 -531078
4652 -531078 -527659 -523073 -528991 -529275 -531688 -535964 -530075 -524339 -524190 -524311 -527078 -526559 -522662 -524169 -524368 -519483
4636 -519483 -516566 -522045 -524516 -519094 -513704 -511716 -515630 -522884 -526953 -525130 -517265 -519649 -514144 -512284
4622e12284p014k187k739M686l56k563K43J407m555Q74K102j292O107N03P75p66
4606e17059M727L741o852j0599m474N995l762k605P644O175k707p342m600O054
4592e25664j10l97N010M048o245M639Q175o645J511N030j019m509Q47j172P43
4577e15758K709j061M86M93j278J251J066J485m416j990l340L378L63j459M77
4562e17594l084J471K847J76Q8J482m281J93q837J109O463L479O31o810j814j161
4546e25642l81K096L879J1178O353j0811k239J1161o62o264N928L606k708j211
4532e05717k75n506J638J741N158K032o010o172L283M219m185N41k350l197L481
4517e11319K901O407o035l545M016j839j974K266j703j167O301j338m760l8r39
$$ plain form
4622 -512284 -519298 -521485 -524224 -519538 -519894 -522457 -522214 -520807 -525362 -524488 -522386 -523678 -517571 -517068 -516293 -517059
4606 -517059 -512332 -508591 -515443 -526042 -530516 -524521 -528283 -530888 -523244 -517069 -519776 -527118 -531718 -525664
4592 -525664 -525774 -526171 -521161 -517113 -523358 -518719 -510544 -517189 -515678 -510648 -511667 -516176 -515329 -516501 -515758
4577 -515758 -513049 -514110 -513624 -513131 -514409 -513158 -512092 -510607 -515023 -517013 -520353 -516975 -516612 -518071 -517594
4562 -517594 -520678 -519207 -516360 -516184 -516096 -514614 -518895 -518702 -527539 -526430 -519967 -516488 -515857 -522667 -524481 -525642
4546 -525642 -526023 -523927 -520048 -508870 -502517 -513328 -515567 -504406 -505068 -511332 -505404 -501798 -504506 -505717
4532 -505717 -505992 -511498 -509860 -508119 -502961 -500929 -506939 -513111 -509828 -505609 -509794 -509253 -511603 -514800 -511319
4517 -511319 -508418 -502011 -508046 -511591 -507575 -509414 -511388 -509122 -510825 -511992 -505691 -507029 -511789 -511827 -512766
4502e12766q1n741nL974j191l011j99L12R105N974m014m796k423m450J063K205
4486e16044r58r98L559P023K917J456J579n8k515K898k433l966n690n651n12M980
4470e14413k719L353M732M842K389o784n978N52N981M674L413n218k999o1n842
4455e14078j248J096K504M84M875J035l545q550o01k008J403K655N409K70o13
4440e10912l98M357J167p56L091K265J831m312l379N555J391J206l519m346j240
4425e07999k715J401q3R208J809o80R71l441j155L459j348m868p70j104j847l425
4409e12587K484N099L067J399K77L309R61k581P57P361Q7k093R13j50m585n966
4393e02248j698N718J166L608M28o650l835L164o446M474Q330n225j023P712P040
$$ plain form
4502 -512766 -512847 -518588 -518593 -514619 -515810 -518821 -519020 -518708 -509603 -503629 -507643 -512439 -514862 -519312 -518249 -516044
4486 -516044 -517002 -518000 -514441 -507418 -504501 -503045 -501466 -501524 -504039 -501141 -503574 -507540 -513230 -518881 -519393 -514413
4470 -514413 -517132 -513779 -509047 -504205 -501816 -508600 -514578 -514026 -508045 -503371 -499958 -505176 -508175 -508236 -514078
4455 -514078 -515326 -514230 -511726 -511242 -506367 -505332 -508877 -517427 -518028 -520036 -518633 -515978 -510569 -510299 -510912
4440 -510912 -511310 -506953 -505786 -506542 -503451 -501186 -499355 -503667 -507046 -501491 -500100 -498894 -502413 -506759 -507999
4425 -507999 -510714 -509313 -509396 -500188 -498379 -499059 -498088 -501529 -502684 -499225 -500573 -505441 -506211 -507315 -509162 -512587
4409 -512587 -510103 -505004 -501937 -500538 -500261 -496952 -495991 -498572 -497815 -490454 -490367 -492460 -491547 -491697 -496282 -502248
4393 -502248 -503946 -498228 -497062 -493454 -493026 -499676 -503511 -500347 -506793 -502319 -493989 -499214 -500237 -492525 -485485
4378d85485p931l459N195k114n38j06J506L626m961j982K811K147K544M097n563
4363d90213m098j928J616k062K47M10n70J130L222Q564r14k74o178q40J201k468
4347d93155l477k318J711K79M292N857N152l618n293k715l616M323N380O647L582
4332d76969K987m77p417o405l613J435M024O498K027n859m262M81M177k892j636
4317d87901K727L082k026M923m353j311k343P046O392L376l754l246m923k454
4303d84765l93R99K18M86j091n273k279M562M076r725k346k458K569L216J326
4288d90878k352M369J851q83R11o161k603K744M659l863k366N678j91L644j502
4273d86943n632m02N385N839l208m866j982K415M991K322L345k319l642m217k904
$$ plain form
4378 -485485 -493416 -496875 -491680 -493794 -494332 -494438 -492932 -489306 -494267 -496249 -493438 -491291 -488747 -484650 -490213
4363 -490213 -494311 -496239 -494623 -496685 -496438 -496028 -496598 -495468 -492246 -483682 -484596 -484870 -491048 -491888 -490687 -493155
4347 -493155 -496632 -498950 -497239 -496960 -492668 -486811 -481659 -485277 -490570 -493285 -496901 -492578 -487198 -480551 -476969
4332 -476969 -473982 -474459 -481876 -488281 -491894 -490459 -486435 -479937 -477910 -483769 -488031 -487550 -483373 -486265 -487901
4317 -487901 -485174 -482092 -484118 -479195 -483548 -484859 -487202 -480156 -473764 -470388 -474142 -477388 -482311 -484765
4303 -484765 -485158 -484159 -483941 -483455 -484546 -489819 -492098 -487536 -483460 -493185 -495531 -497989 -495420 -492204 -490878
4288 -490878 -493230 -488861 -487010 -487893 -486982 -493143 -495746 -493002 -488343 -492206 -494572 -488894 -489085 -485441 -486943
4273 -486943 -492575 -492977 -487592 -481753 -484961 -489827 -491809 -489394 -484403 -482081 -478736 -481055 -484697 -488914 -491818
4258d91818J765O19k305M449l743J445K001o265j755j766J535Q691M306p814j3279
4243e03934J194J5849O275l957k562n970O567K824j185K710Q648j675r059l887
4229d88162k63K888o21l558n824j15K635M89L982O731p554j0544k028P449K20
4214d94275L421J2795M992j953m188k830n136J713K378o96K933m46J084L726K177
4199d74305n189k728k831P045l930L664k801K537O375l742k146K203j350l863
4185d81061K980K657j1762O84K060j198n904N118p76J378Q508N558L225n465q616
4170d82614m565O981O235n641o073l750P36k335J105L148J915J431K132Q503L862
4155d68930p876p261m273j617J0982N035L327K932m212n890m472n249j09P221
$$ plain form
4258 -491818 -490053 -489434 -491739 -487290 -491033 -489588 -487587 -493852 -495607 -497373 -495838 -487147 -482841 -490655 -503934
4243 -503934 -502740 -486891 -480616 -484573 -487135 -493105 -486538 -483714 -484899 -482189 -473541 -475216 -484275 -488162
4229 -488162 -488425 -485537 -486158 -489716 -495540 -495655 -493020 -492531 -488549 -481818 -489372 -499916 -501944 -494495 -494275
4214 -494275 -490854 -478059 -473067 -475020 -479208 -482038 -487174 -485461 -483083 -483779 -480846 -481292 -480208 -476482 -474305
4199 -474305 -479494 -482222 -485053 -478008 -481938 -478274 -481075 -478538 -472163 -475905 -478051 -475848 -477198 -481061
4185 -481061 -478081 -475424 -487186 -486502 -484442 -485640 -491544 -486426 -487202 -485824 -477316 -471758 -468533 -473998 -482614
4170 -482614 -487179 -480198 -473963 -479604 -485677 -489427 -488691 -491026 -489921 -486773 -484858 -483427 -481295 -472792 -468930
4155 -468930 -476806 -484067 -488340 -489957 -478975 -473940 -470613 -467681 -471893 -477783 -482255 -487504 -487613 -480392
4141d80392N506M243n388l267J538Q066M345J280r64l763j467k430n502J590N080
4126d71525L236l789m322L003K416l204m69k896J091m317N086L354q5J303O539
4111d64579K098K163K41j1162m19J562p455l144K667J083m48j894K009J619P53
4096d74906j448k482K078L221Q96N54L314j525r19j129q30l779k961K035R946
4081d67935M804L675l085l027L40k324m118J344J747P07N452k387j1551k253R292
4066d69319N744r082r91N020R53l467M61M803J202J475J04N880l972n584p940
4051d74713o763M685k103l437N909O630N085n901j462O796K116l545J898l12O029
4036d59088K55k900N441r46l415j47J120n414L619j865j84j988L53M861O268M44
$$ plain form
4141 -480392 -474886 -470643 -476031 -479298 -477760 -469694 -465349 -464069 -465033 -468796 -470263 -472693 -478195 -476605 -471525
4126 -471525 -468289 -472078 -476400 -473397 -470981 -474185 -474654 -477550 -476459 -480776 -475690 -472336 -472421 -471118 -464579
4111 -464579 -462481 -460318 -460077 -471239 -471658 -470096 -477551 -480695 -478028 -476945 -477393 -479287 -477278 -475659 -474906
4096 -474906 -476354 -478836 -476758 -473537 -472641 -472087 -468773 -470298 -471217 -472346 -473176 -476955 -479916 -477881 -467935
4081 -467935 -463131 -459456 -462541 -465568 -465228 -467552 -471670 -470326 -468579 -467872 -462420 -464807 -476358 -478611 -469319
4066 -469319 -463575 -472657 -473648 -468628 -467675 -471142 -470681 -465878 -464676 -463201 -463097 -457217 -461189 -466773 -474713
4051 -474713 -481476 -476791 -478894 -482331 -476422 -469792 -464707 -470608 -472070 -465274 -463158 -466703 -464805 -465117 -459088
4036 -459088 -458833 -461733 -456292 -457238 -460653 -460800 -459680 -465094 -461475 -463340 -463524 -465512 -465159 -460298 -454030 -453586
4020d53586n71k985j27m717o8M793M866o25j085k371l206p595j193M024O031K483
4004d55932l106J670K486m288Pj891m905p613j778L447L283M717k918l279R774
3989d60326N925O41J517L975j587p973j279K656P031L172k222l740l607l433N30
3974d58720l250n09N519l303L718L913q36l470k111k714pP13M288O28l316k635
3958d62092M68j304K128J774M065P41j268L720n189Q87L444J189K340l167n754
3943d58018L063O658j276o374j0030L207K739Q467j041o593K158N42O020m687
3929d55165l087M005N642k481m754J745N38p398j700M118K47M29L014l369l298
3914d61514J885j75K678r23K156m373N16P849J447K049J159n656j074k831L528
$$ plain form
4020 -453586 -454157 -457142 -457269 -461986 -462054 -457261 -452395 -453020 -454105 -456476 -459682 -467277 -468470 -464446 -458415 -455932
4004 -455932 -459038 -457368 -454882 -459170 -459163 -461054 -465959 -473572 -475350 -471903 -468620 -463903 -466821 -470100 -460326
3989 -460326 -454401 -453760 -452243 -448268 -449855 -457828 -459107 -456451 -449420 -446248 -448470 -452210 -455817 -459250 -458720
3974 -458720 -461970 -462479 -456960 -460263 -456545 -452632 -453468 -456938 -459049 -461763 -461770 -461057 -456769 -456141 -459457 -462092
3958 -462092 -461624 -462928 -460800 -459026 -454961 -454220 -455488 -451768 -456957 -456070 -452626 -451437 -449097 -452264 -458018
3943 -458018 -454955 -448297 -449573 -455947 -465977 -462770 -460031 -451564 -452605 -459198 -457040 -456498 -450478 -455165
3929 -455165 -458252 -454247 -448605 -451086 -455840 -454095 -453557 -460955 -462655 -458537 -458290 -457861 -454847 -458216 -461514
3914 -461514 -459629 -459804 -457126 -458049 -455893 -460266 -459750 -451901 -450454 -448405 -447246 -452902 -453976 -456807 -453279
3899d53279l786L264N147L32N197L980k698n564o873o275k375K572N672n62J701
3884d53547L008k204o29Q33M794N679m20r00p202n266N811L2n814J12L725l226
3868d55214m993K815K384j186m055O109J0845K602j187k444J327J0202j47l872
3854d36814n813r75L420l08p086n306j023j555M730m443o143j616Q025M549j233
3839d51591K766l515J619M578K864K683m534p97m595K053M528q23m98k51m142
3824d49655p227M95O732o733O480Q034p441l678P389L567q48M286r46o920k234
3809d48699k668M982K247l292n823L542P193K06K33j151L444l801r603J525J3391
3794d38274k992p633K206R546J95l17r320k937P76L270j045j816j563M220K678
$$ plain form
3899 -453279 -457065 -453801 -448654 -448322 -443125 -439145 -441843 -447407 -454280 -460555 -462930 -460358 -454686 -455248 -453547
3884 -453547 -450539 -452743 -453372 -452539 -447745 -442066 -442486 -443386 -450588 -455854 -450043 -450011 -455825 -455713 -451988 -455214
3868 -455214 -460207 -457392 -455008 -456194 -460249 -454140 -443295 -440693 -441880 -444324 -442997 -432795 -432942 -436814
3854 -436814 -442627 -443602 -440182 -440490 -447576 -452882 -453905 -455460 -450730 -455173 -461316 -462932 -454907 -450358 -451591
3839 -451591 -448825 -452340 -450721 -446143 -443279 -440596 -445130 -445927 -450522 -448469 -443941 -444764 -445262 -445513 -449655
3824 -449655 -456882 -456387 -449655 -456388 -449908 -441874 -449315 -452993 -445604 -442037 -442885 -438599 -439545 -446465 -448699
3809 -448699 -451367 -446385 -444138 -447430 -453253 -449711 -442518 -442312 -442079 -443230 -439786 -443587 -453190 -451665 -438274
3794 -438274 -441266 -448899 -446693 -437147 -436952 -437269 -446589 -449526 -448750 -445480 -446525 -448341 -449904 -445684 -443006
3779d43006q287J248K01L358k30j476K304o385K185L181n23m83Q484m34m405r68
3763d45236o30L872j385N878O480q39k755K476l929p076l130k987k92Q961P292
3748d33300r38n974L598j47K595o414J030J059j715j060j815n759O3l47j580K770
3732d47934j056n11J308j189J81M452M690L98K365j1m477J159L147L869r21m806
3716d39336m018K779R69k463L598J105L372n161L017N189J442Jm272R88j352o457
3700d40599j492k541j983l482j226j095k466L389L701j143m09j340L313K509K814
3685d42050M813J575r337m891l91p17J147N492j015J245P81L023j270N932j287
3670d36950m258J76j246L629l229K92J131J15k856q61p425L056P984O888J025
$$ plain form
3779 -443006 -451293 -450045 -449844 -446486 -446716 -448192 -445888 -452273 -450088 -446907 -447430 -447913 -439429 -439863 -444268 -445236
3763 -445236 -445866 -441994 -443379 -437501 -431021 -431860 -434615 -432139 -436068 -443144 -446274 -449261 -449553 -440592 -433300
3748 -433300 -434238 -440212 -436614 -436761 -434166 -440580 -439550 -438491 -440206 -441266 -443081 -448840 -448777 -449124 -450704 -447934
3732 -447934 -448990 -449501 -448193 -449382 -449201 -444749 -440059 -439661 -437296 -437307 -441784 -440625 -437478 -433609 -434530 -439336
3716 -439336 -443354 -440575 -439606 -442069 -438471 -437366 -433994 -439155 -436138 -430949 -429507 -429506 -433778 -432790 -434142 -440599
3700 -440599 -442091 -444632 -446615 -450097 -451323 -452418 -454884 -451495 -447794 -448937 -449346 -450686 -447373 -444864 -442050
3685 -442050 -437237 -435662 -444999 -449890 -450281 -450998 -449851 -444359 -445374 -444129 -443348 -440325 -441595 -435663 -436950
3670 -436950 -441208 -441032 -442278 -438649 -441878 -441586 -440455 -440340 -443196 -444057 -451482 -448426 -440442 -433554 -432529
3655d32529j076K887r63o311O8k061m028L407N280L343P4l061K294n91q037m755
3639d46059Q013O969J75l879K224M970R14n389O95l668M503K643j661n706l745
3624d39001r28m38N795N692M821J991m779o886N46k464M779J690M19n284k727
3609d36774q95K267m826j871l306M030R156L82k601J289k081n592m130J809L165
3594d39978K886P735O77r26J078M947N186l594n300M653n227q067m255r92N180
3579d35997K364l149p37J479L814N009J394K080N37L090k738k021k086k815J356
3564d28420n69m783L00q04j364k38k542R76R145m934m061N753R348k369j1718
3549d36280J882L741N605L093p162k119M682J195l515k398j68J206l73n671N802
$$ plain form
3655 -432529 -433605 -430718 -431681 -437992 -437924 -439985 -444013 -440606 -435326 -431983 -431909 -434970 -432676 -433267 -441304 -446059
3639 -446059 -438046 -431077 -430902 -434781 -432557 -427587 -426673 -432062 -431367 -435035 -430532 -427889 -429550 -435256 -439001
3624 -439001 -439929 -440367 -434572 -428880 -424059 -422068 -426847 -433733 -433187 -435651 -430872 -429182 -428763 -434047 -436774
3609 -436774 -437669 -435402 -440228 -442099 -445405 -441375 -432219 -431837 -434438 -433149 -435230 -440822 -444952 -443143 -439978
3594 -439978 -437092 -429357 -428680 -429606 -428528 -423581 -418395 -421989 -427289 -422636 -427863 -435930 -440185 -441177 -435997
3579 -435997 -433633 -436782 -437519 -436040 -432226 -427217 -425823 -423743 -423206 -420116 -422854 -424875 -426961 -429776 -428420
3564 -428420 -428989 -433772 -433472 -434276 -435640 -435878 -438420 -437444 -428299 -433233 -437294 -431541 -422193 -424562 -436280
3549 -436280 -434398 -430657 -425052 -421959 -429121 -431240 -426558 -425363 -428878 -431276 -431444 -430238 -430611 -436282 -430480
3534d30480J460q953r40Q563O865k48l042k220k421R53j96R3R379O649J85o680
3518d21033m211n970o756K82P66n039j057Q274M849j494K276K580J807P905j611
3503d18432n77J607j168N0k753o238l818L790Q240M742o308n766L978R198J203
3488d12252o571j727L518P957l270j421p7j863n727n102n87P604J872k311l782
3473d23739l101K650J2907j104m948o61M614Q991K713p544j4401r663L814O902
3459d22570R68j62j955j851L974k378j617O679J39l223l144k367P3L983Q532P484
3443d07435l561o446j510L45l157k933O358J222L557N552j158l371j882o605R71
3428d20053j125p7k37n588K857N097k855j229l564L70J330l657j697j002l04N638
$$ plain form
3534 -430480 -429020 -437973 -438913 -430350 -423485 -423733 -426775 -428995 -431416 -430463 -430659 -430566 -421187 -414538 -414353 -421033
3518 -421033 -425244 -431214 -437970 -437688 -436922 -441961 -443018 -434744 -429895 -431389 -429113 -426533 -424726 -416821 -418432
3503 -418432 -419009 -417402 -418570 -418520 -421273 -427511 -431329 -427539 -419299 -414557 -420865 -426631 -422653 -413455 -412252
3488 -412252 -418823 -420550 -417032 -409075 -412345 -413766 -413843 -415706 -421433 -426535 -427122 -419518 -417646 -419957 -423739
3473 -423739 -426840 -424190 -411283 -412387 -417335 -417996 -413382 -404391 -401678 -409222 -423623 -433286 -429472 -422570
3459 -422570 -421602 -421764 -423719 -425570 -421596 -423974 -425591 -418912 -418773 -421996 -425140 -427507 -427434 -423451 -414919 -407435
3443 -407435 -410996 -417442 -418952 -418607 -421764 -424697 -418339 -417117 -413560 -408008 -409166 -412537 -414419 -421024 -420053
3428 -420053 -421178 -421255 -421492 -427080 -424223 -419126 -421981 -423210 -426774 -426404 -425074 -428731 -430428 -431430 -431734 -426096
3412d26096N769O03k029Q49K658K204L435n487l196J216Q065N984l711m517p121
3397d21374o461Q07J1122P421n080k816n094J702K079Q571K99j3526j750J474
3383d22626k323N087Q295L589j0777k328O364M357j92p12k115o221M135j409l709
3368d20585N4k331p56K821O514J162P895K336j112m440l624n581L945K894n335
3353d16143p800j098m437j097O351P574J1548j31l923j223p344O16L698L350J634
3338d08425p200L990J160k07j40q46k409J225j270Q10J469K15p938J795M594O98
3322d12479O464O20n880l799n051O056M092j126L550M282l674o052m94M204K126
3307d07161q03k500l467k850O969R73j257k49l003J391J547j225j236q82l83O23
$$ plain form
3412 -426096 -420327 -419724 -421753 -420904 -418246 -416042 -412607 -418094 -421290 -420074 -412009 -406025 -409736 -414253 -421374
3397 -421374 -427835 -427028 -415906 -408485 -413565 -416381 -421475 -419773 -417694 -409123 -408824 -422350 -424100 -422626
3383 -422626 -424949 -419862 -411567 -407978 -418755 -421083 -414719 -410362 -410554 -411266 -413381 -419602 -415467 -416876 -420585
3368 -420585 -420531 -422862 -423618 -420797 -414283 -413121 -405226 -402890 -404002 -408442 -412066 -417647 -413702 -410808 -416143
3353 -416143 -423943 -425041 -429478 -430575 -424224 -416650 -405102 -405233 -409156 -410379 -417723 -417107 -413409 -410059 -408425
3338 -408425 -415625 -411635 -410475 -410682 -410822 -411668 -414077 -412852 -414122 -413312 -411843 -411628 -419566 -417771 -413177 -412479
3322 -412479 -406015 -405395 -411275 -415074 -420125 -414069 -409977 -411103 -407553 -403271 -406945 -412997 -413491 -409287 -407161
3307 -407161 -407964 -410464 -413931 -416781 -409812 -408839 -410096 -410345 -413348 -411957 -410410 -411635 -412871 -413753 -414136 -413513
3291d13513j471l958P91P95r16k082J266J1527P48l392O8M387J78n956q437M080
3275d15885P225N842n415o978Q87J520N515R20k625k26l64N851R063k809M6J995
3259c95438r30K951L3r422o247K989J0150L90n951j225L83J16m719J507Q06M198
3243d00409k975m093j273k385M724M778J37m34j188N8L305L201j824o302q482
3228d13162K906l580p0M094J874K801J2659K028j207l857j883l553o610q028J328
3213d14260M108M353J876L826L593M790o674k651N771J781M942k703l663l310
3199c98221R03r8k873L233L320l987m670l535pp03R94L523k076l012O976J969
3183c98264m513k274k12O48N497j228m579m239k485J28l816R693J1818J1246P298
$$ plain form
3291 -413513 -414984 -418942 -418151 -417356 -418272 -420354 -419088 -407561 -406813 -410205 -410137 -405750 -405572 -411528 -419965 -415885
3275 -415885 -408660 -402818 -408233 -415211 -414324 -412804 -407289 -406369 -408994 -409220 -409584 -403733 -394670 -397479 -397433 -395438
3259 -395438 -396368 -393417 -393384 -402806 -409053 -406064 -395914 -395524 -401475 -402700 -402317 -402201 -406920 -405413 -404607 -400409
3243 -400409 -403384 -407477 -408750 -411135 -406411 -401633 -401496 -401930 -403118 -403060 -399755 -396554 -398378 -404680 -413162
3228 -413162 -410256 -413836 -413906 -409812 -407938 -405137 -392478 -390450 -391657 -395514 -397397 -400950 -407560 -415588 -414260
3213 -414260 -410152 -405799 -403923 -400097 -396504 -391714 -398388 -401039 -395268 -393487 -388545 -391248 -394911 -398221
3199 -398221 -397318 -397416 -400289 -397056 -393736 -397723 -402393 -405928 -405935 -406638 -405644 -402121 -404197 -407209 -400233 -398264
3183 -398264 -402777 -405051 -405263 -404615 -399118 -400346 -404925 -409164 -411649 -411521 -415337 -405644 -393826 -382580 -375282
3168c75282K123R8q136k936q092r463N78m2n447M287N99j47l356m332q56p63m100
3151d15267k555N217P273R88j097n544j719j804k11M989M967N078P89p333m411
3136d10640M425j285l44M383J769m293q310l183m639k000M914O83K165J0000m73
3121d06828J632K928Kl153j255K458K479J868k590q036L243r60m824O095L885
3106d03056k008R35P57L571M033P69k200m068O188K202q420q447M189R64J038
3091d03553K285J328r0o59n653j627K202J41K139J0078L110o30m552k067k017
3076c99565J815M973J285N51R327K404m686p245m337k962l14M382P85o3l001j335
3060c97986P85K864J092K654M247j036r779j818J285K322k129k130K813j674p161
$$ plain form
3168 -375282 -373159 -373061 -381197 -384133 -392225 -401688 -401110 -401152 -406599 -402312 -401713 -401860 -405216 -409548 -410404 -411167 -415267
3151 -415267 -417822 -412605 -405332 -404344 -405441 -410985 -412704 -414508 -414719 -409730 -404763 -399685 -398896 -406229 -410640
3136 -410640 -406215 -407500 -407844 -403461 -401692 -405985 -414295 -417478 -422117 -424117 -419203 -418520 -416355 -406355 -406828
3121 -406828 -405196 -402268 -402266 -405419 -406674 -404216 -401737 -399869 -402459 -410495 -407252 -408212 -413036 -406941 -403056
3106 -403056 -405064 -404129 -403372 -399801 -395768 -394999 -397199 -401267 -395079 -392877 -401297 -409744 -405555 -404591 -403553
3091 -403553 -401268 -399940 -400030 -400689 -406342 -407969 -405767 -405626 -403487 -393409 -390299 -390929 -395481 -397548 -399565
3076 -399565 -397750 -392777 -391492 -390941 -381614 -379210 -383896 -391141 -395478 -398440 -398754 -394372 -393587 -393650 -396651 -397986
3060 -397986 -397201 -394337 -393245 -390591 -386344 -387380 -397159 -398977 -397692 -395370 -397499 -399629 -396816 -398490 -405651
3045d05651R192N988o195M775k742n855m02l489J316K57L745K499M17K41K282
3030c93622l912L130L114l655k264o312l661Q0P022j834o007J55q02M701M442
3015c99425K869K803J906k240l639k836M421L530M320j532L2M98j961j31m506
3000c95891j072k599p644N300P513L964K719L291j839j342q94K37K686k41J29
2985c85683k378q51M24l557m282L754P91r58P588L794n959o546M180j448p380
$$ plain form
3045 -405651 -396459 -390471 -396666 -391891 -394633 -400488 -400890 -404379 -403063 -402806 -399061 -396562 -396145 -395904 -393622
3030 -393622 -397534 -394404 -391290 -394945 -397209 -403521 -407182 -407102 -400080 -401914 -407921 -407766 -408568 -403867 -399425
3015 -399425 -396556 -393753 -391847 -394087 -397726 -400562 -396141 -392611 -388291 -389823 -389791 -389293 -391254 -391385 -395891
3000 -395891 -396963 -399562 -407206 -401906 -394393 -390429 -387710 -384419 -386258 -387600 -388494 -388257 -385571 -385812 -385683
2985 -385683 -388061 -388912 -388488 -392045 -396327 -392573 -391782 -392740 -385152 -381358 -387317 -393863 -389683 -391131 -398511
$$ [...]
##END NTUPLES=NMR SPECTRUM
##END=
