##TITLE=Analysis number 314740
Compound Code mo 00970
Book Reference 378/180/3
Project Code adrs
Chemist Name benw
##JCAMPDX= 6.0         $$ Bruker NMR JCAMP-DX V2.0
##DATA TYPE= NMR SPECTRUM
##DATA CLASS= NTUPLES
##ORIGIN= Bruker BioSpin GmbH
##OWNER= NMR
$$ XWIN-NMR		Version 3.5
$$ Tue Oct 25 13:22:30 2005 GMT Daylight Time (UT+1h)  MAYBRIDGE\NMR@NMR_250MHZ
##.OBSERVE FREQUENCY= 250.131544655141
##.OBSERVE NUCLEUS= ^1H
##.ACQUISITION MODE= SIMULTANEOUS (DQD)
##.ACQUISITION SCHEME= undefined
##.AVERAGES= 16
##.DIGITISER RES= 18
##SPECTROMETER/DATA SYSTEM= dpx250
##.PULSE SEQUENCE= zg30
##.SOLVENT NAME= CDCl3
##.SHIFT REFERENCE= (INTERNAL, CDCl3, 0, 16.522)
##AUDIT TRAIL= $$ (NUMBER, WHEN, WHO, WHERE, WHAT)
$$ ##TITLE= Audit trail, XWIN-NMR		Version 3.5
$$ ##JCAMPDX= 5.01
$$ ##ORIGIN= Bruker BioSpin GmbH
$$ ##OWNER= NMR
$$ C:\u/data/dgb/nmr/ADRS/11370/pdata/1/auditp.txt
$$ ##AUDIT TRAIL=  $$ (NUMBER, WHEN, WHO, WHERE, WHAT)
(   1,<2005-10-25 13:22:11.39 +100>,<MAYBRIDGE\NMR>,<NMR_250MHZ>,
      <created by zg, POWCHK disabled, PULCHK disabled
       configuration hash MD5:
       62 19 C7 07 E1 42 D1 B7 37 6C 3D D0 77 39 F9 E6
       data hash MD5: 64K
       64 88 93 00 7B 4C 18 60 ED 3D BA 3B 92 60 5C 41>)
(   2,<2005-10-25 13:22:22.16 +100>,<MAYBRIDGE\NMR>,<NMR_250MHZ>,
      <Start of raw data processing
       ef LB = 0.3 FT_mod = 6 PKNL = 1 SI = 32K 
       data hash MD5: 32K
       FC 2A 27 DE 68 9D EA 4D E9 2E AE 75 E0 B7 44 00>)
(   3,<2005-10-25 13:22:23.88 +100>,<MAYBRIDGE\NMR>,<NMR_250MHZ>,
      <apk 
       data hash MD5: 32K
       7F A9 67 A0 96 6B E4 7B F5 3B 3D CC 94 FD 3A C0>)
(   4,<2005-10-25 13:22:24.57 +100>,<MAYBRIDGE\NMR>,<NMR_250MHZ>,
      <abs ABSG = 5 
       data hash MD5: 32K
       3D 40 7C 65 A6 1A 4A FD 6D 2F BD 06 4E 1A 2A E9>)
$$ ##END=
$$ 
$$ hash MD5
$$ 36 42 43 A8 1C 67 CC AE 68 FD 4F A9 AC F1 70 08
##$RELAX= 
##$RELAX= 
##$RELAX= 
##$RELAX= 
##$RELAX= 
##$RELAX= 
##$RELAX= 
$$ Bruker specific parameters
$$ --------------------------
##$DU= <C:\u>
##$EXPNO= 11370
##$NAME= <ADRS>
##$PROCNO= 1
##$TYPE= <nmr>
##$USER= <dgb>
##$AMP= (0..31)
100 100 100 100 100 100 100 100 100 100 100 100 100 100 100 100 100 100 
100 100 100 100 100 100 100 100 100 100 100 100 100 100 
##$AQSEQ= 0
##$AQ_mod= 3
##$AUNM= <au_zg>
##$AUTOPOS= <25 >
##$BF1= 250.13
##$BF2= 250.13
##$BF3= 250.13
##$BF4= 250.13
##$BF5= 500.13
##$BF6= 500.13
##$BF7= 500.13
##$BF8= 500.13
##$BYTORDA= 1
##$CFDGTYP= 0
##$CFRGTYP= 5
##$CHEMSTR= <none>
##$CNST= (0..31)
1 1 145 1 1 1 1 1 1 1 1 1 1 1 1 1 1 1 1 1 1 1 1 1 1 1 1 1 1 1 1 1 
##$CPDPRG= <>
##$CPDPRG1= <>
##$CPDPRG2= <>
##$CPDPRG3= <>
##$CPDPRG4= <mlev>
##$CPDPRG5= <mlev>
##$CPDPRG6= <mlev>
##$CPDPRG7= <mlev>
##$CPDPRG8= <mlev>
##$CPDPRGB= <>
##$CPDPRGT= <>
##$D= (0..31)
0 1 0 0 0 0 0 0 0 0.06 0 0 0 0 0 0 0.0002 0 0 0 0 0 0 0 0 0 0 0 0 0 0 
0 
##$DATE= 1130242930
##$DBL= (0..7)
120 120 120 120 120 120 120 120 
##$DBP= (0..7)
150 150 150 150 150 150 150 150 
##$DBP07= 0
##$DBPNAM0= <>
##$DBPNAM1= <>
$$ [...]
##$SUBNAM7= <"">
##$SUBNAM8= <"">
##$SUBNAM9= <"">
##$SW= 20.6930455092707
##$SWIBOX= (0..15)
0 0 3 0 0 0 0 0 0 0 0 0 0 0 0 0 
##$SW_h= 5175.983436853
##$TD= 65536
##$TD0= 1
##$TE= 296.16
##$TE2= 300
##$TE3= 300
##$TEG= 300
##$TL= (0..7)
0 120 120 120 120 120 120 120 
##$TP= (0..7)
150 150 150 150 150 150 150 150 
##$TP07= 0
##$TPNAME0= <>
##$TPNAME1= <>
##$TPNAME2= <>
##$TPNAME3= <>
##$TPNAME4= <>
##$TPNAME5= <>
##$TPNAME6= <>
##$TPNAME7= <>
##$TPOAL= (0..7)
0.5 0.5 0.5 0.5 0.5 0.5 0.5 0.5 
##$TPOFFS= (0..7)
0 0 0 0 0 0 0 0 
##$TUNHIN= 0
##$TUNHOUT= 0
##$TUNXOUT= 0
##$USERA1= <user>
##$USERA2= <user>
##$USERA3= <user>
##$USERA4= <user>
##$USERA5= <user>
##$V9= 5
##$VALIST= <valist>
##$VCLIST= <CCCCCCCCCCCCCCC>
##$VD= 0
##$VDLIST= <DDDDDDDDDDDDDDD>
##$VPLIST= <PPPPPPPPPPPPPPP>
##$VTLIST= <TTTTTTTTTTTTTTT>
##$WBST= 1024
##$WBSW= 4
##$XGAIN= (0..3)
0 0 0 0 
##$XL= 0
##$YL= 0
##$YMAX_a= 291160
##$YMIN_a= -316803
##$ZGOPTNS= <>
##$ZL1= 120
##$ZL2= 120
##$ZL3= 120
##$ZL4= 120
##$ABSF1= 16.522
##$ABSF2= -4.171173
##$ABSG= 5
##$ABSL= 3
##$ALPHA= 0
##$AQORDER= 0
##$ASSFAC= 0
##$ASSFACI= 0
##$ASSFACX= 0
##$ASSWID= 0
##$AUNMP= <proc_1d>
##$AZFE= 0.1
##$AZFW= 0.1
##$BCFW= 0
##$BC_mod= 0
##$BYTORDP= 0
##$COROFFS= 0
##$CY= 12.5
##$DATMOD= 1
##$DC= 0
##$DFILT= <>
##$DTYPP= 0
##$F1P= 14.0000005364418
##$F2P= -0.99999901652339
##$FCOR= 0.5
##$FTSIZE= 32768
##$FT_mod= 6
##$GAMMA= 0
##$GB= 0
##$INTBC= 1
##$INTSCL= 1
##$ISEN= 128
##$LB= 0.3
##$LEV0= 0
##$LPBIN= 0
##$MAXI= 10000
##$MC2= 0
##$MEAN= 0
##$ME_mod= 0
##$MI= 0
##$NCOEF= 0
##$NC_proc= -3
##$NLEV= 6
##$NOISF1= 0
##$NOISF2= 0
##$NSP= 0
##$NTH_PI= 0
##$NZP= 0
##$OFFSET= 16.522
##$PC= 1
##$PHC0= -67.25126
##$PHC1= 9.969774
##$PH_mod= 1
##$PKNL= yes
##$PPARMOD= 0
##$PSCAL= 4
##$PSIGN= 0
##$REVERSE= no
##$SF= 250.13
##$SI= 32768
##$SIGF1= 0
##$SIGF2= 0
##$SINO= 400
##$SIOLD= 32768
##$SREGLST= <1H.CDCl3>
##$SSB= 0
##$STSI= 32768
##$STSR= 0
##$SW_p= 5175.98343685301
##$SYMM= 0
##$S_DEV= 0
##$TDeff= 65536
##$TDoff= 0
##$TI= <Analysis number 999999
Compound Code 99
Book Reference 9
Project Code 9>
##$TILT= no
##$TM1= 0
##$TM2= 0
##$TOPLEV= 0
##$USERP1= <user>
##$USERP2= <user>
##$USERP3= <user>
##$USERP4= <user>
##$USERP5= <user>
##$WDW= 1
##$XDIM= 32768
##$YMAX_p= 452957052
##$YMIN_p= -171257
$$ End of Bruker specific parameters
$$ ---------------------------------
##NTUPLES= NMR SPECTRUM
##VAR_NAME=  FREQUENCY,     SPECTRUM/REAL,   SPECTRUM/IMAG
##SYMBOL=    X,             R,               I
##VAR_TYPE=  INDEPENDENT,   DEPENDENT,       DEPENDENT
##VAR_FORM=  AFFN,          ASDF,            ASDF
##VAR_DIM=   32768,         32768,           32768
##UNITS=     HZ,            ARBITRARY UNITS, ARBITRARY UNITS
##FACTOR=    0.157963299565203, 1,           1
##FIRST=     4132.6476996994, 0,             0
##LAST=      -1043.33573715361, 0,           0
##MIN=       -1043.33573715361, -171257,     0
##MAX=       4132.6476996994, 452957052,     0
$$ Real data points
##PAGE= N=1
##DATA TABLE= (X++(R..R)), XYDATA
$$ [...]
14614B5819l04K3184k3247p619j8310L2112l289o915L297K3421K4478k2980l3173
$$ 25819 25515 48699 25452 17833 -477 31635 28346 21431 24728 48149 72627 49647 16474
14601A6474k2411j0562j4082R33L5706P645k7078j4956J1414J0156K5816M761
$$ 16474 -5937 -16499 -30581 -29648 6058 13703 -13375 -28331 -16917 -6761 19055 23816
14589B3816L707n910n309K874L8385n2609l4774K8564j9962k487J5739O3102M2148
$$ 23816 27523 21613 16304 19178 57563 4954 -29820 -1256 -21218 -23705 -7966 55136 97284
14576I7284j13925n5994N3756J4567K5161l9065J6606J5093J9281q270N1548N1839
$$ 97284 -16641 -72635 -18879 -4312 20849 -18216 -1610 13483 32764 24494 76042 127881
14564A27881L0293l4372o0249m5501L141M975j378L9979J0460o1q109j8106n1336
$$ 127881 158174 123802 63553 18052 21193 26168 24790 64769 75229 75168 67059 48953 -2383
14551b383j3418j0906k0025K4880K6503K9572k6402P811L194J5366p2646l5745
$$ -2383 -15801 -26707 -46732 -21852 4651 34223 7821 15632 18826 34192 -38454 -74199
14539g4199J2732O0379l9692J619J6692k9533L5717J6412j3556j4384L1305L4452
$$ -74199 -61467 -1088 -40780 -39161 -22469 -52002 -16285 127 -13429 -27813 3492 37944
14527C7944N1081O6805M379m4303p9712n9070N7072N4442j6387p918l8633O616
$$ 37944 89025 155830 160209 115906 36194 -22876 34196 88638 72251 64333 25700 32316
14515C2316M3951o3828l3485L243j5516l5419J0889M2428M2590j4606j4325L8108
$$ 32316 76267 12439 -21046 -17803 -33319 -68738 -57849 -15421 27169 12563 -1762 36346
14503C6346K1327l2104J883P8966K0756k4756M1759L1080J4674n5868k5117k3482
$$ 36346 57673 25569 27452 106418 127174 102418 144177 175257 189931 134063 108946 85464
14491H5464l541o459K7280N2176J5617M5949N0672K420J3563J5524M7780J22792
$$ 85464 81923 75464 102744 154920 170537 216486 267158 269578 283141 298665 346445 469237
14479D69237L0845P3359R1737J03900J54609K62607K95563L75319M23381L89312
$$ 469237 500082 573441 665178 769078 923687 1186294 1481857 1857176 2280557 2669869
14469B669869L90912J79647q7345k23981l72023n07184m20328l16042k32216j37700
$$ 2669869 3060781 3240428 3153083 2929102 2557079 2049895 1629567 1313525 1081309 943609
14459I43609j08818j38633q2939p8213k1437j9093n114M008m4859p076p1484o8853
$$ 943609 834791 696158 613219 535006 513569 494476 489362 493370 448511 441435 369951 301098
14447C01098j9001l2605p160J5712q1781m5522j9687l9045k1173M671L9469N1400
$$ 301098 282097 249492 242332 258044 176263 130741 111054 72009 50836 55507 94976 146376
14435A46376j4677J738k3071o3790k749L6194N633j1684j0062k3905l2647L9812
$$ 146376 131699 133437 110366 46576 43827 80021 85654 73970 63908 40003 7356 47168
14423D7168l3997M2244K4302k0896O850L2138m6899n2695P270M3903O980M083
$$ 47168 13171 55415 79717 58821 65671 97809 50910 -1785 5485 49388 56368 60451
14411F0451j0065K0388M387n7105p6531J260j256K7220j0709N997M2760O1532
$$ 60451 50386 70774 75161 18056 -58475 -57215 -58471 -31251 -41960 -35963 6797 68329
14399F8329R691N991l1819k0756j928k4683M7582L4455n6672o2658k1274J7182
$$ 68329 78020 84011 52192 31436 29508 4825 52407 86862 30190 -32468 -53742 -36560
14387c6560K4421m5172K9418N7479Q345n415k0883k8568K2515j020J5418j6400
$$ -36560 -12139 -57311 -27893 29586 37931 32516 11633 -16935 5580 4560 19978 3578
14375C578K818K1399k6288l2888K9875j5901l111M492k4759N7640j713n3442K622
$$ 3578 6396 27795 1507 -31381 -1506 -17407 -20518 -16026 -40785 16855 15142 -38300 -35678
14362c5678K5837k7724R480j1689J4269N930j6470j4003l7306K365M8648O2468
$$ -35678 -9841 -37565 -28085 -39774 -25505 -19575 -36045 -50048 -87354 -84989 -36341 26127
14350B6127P939m949k9700J8442j265n5657m2667K5556P798k1550J0792N870o548
$$ 26127 34066 29117 -583 17859 16594 -39063 -81730 -56174 -48376 -69926 -59134 -53264 -59812
14337e9812O0125J6745k0720P989j3606m5940k380M0871J4940o3469L632M6453
$$ -59812 313 17058 -3662 4327 -9279 -55219 -57599 -16728 -1788 -65257 -61625 -15172
14325a5172R083J3325o650j6039m065K6341L4447K7116K1111K7404k3735R518
$$ -15172 -6089 7236 586 -15453 -19518 6823 41270 68386 89497 116901 93166 102684
14313A02684j7988p834O812j0370l4267O345L7546K8129k5636o4310k1057K301
$$ 102684 84696 76862 83674 73304 39037 45382 82928 111057 85421 21111 54 2355
14301B355N021K9034k9434j4806k251J486k3467j4607N788J570L74k0960L5866
$$ 2355 7376 36410 6976 -7830 -10081 -8595 -32062 -46669 -40881 -39311 -38937 -59897 -24031
14288b4031K8593k9703k3K8199Q562n383m7958n4547O7585P5185n2199j9764L8992
$$ -24031 4562 -25141 -25164 3035 11597 6214 -41744 -96291 -28706 46479 -5720 -25484 13508
14275A3508J6219l4985q8230M6046j2801j1255J3828L6425M0601M4425l701p3029
$$ 13508 29727 -5258 -93488 -47442 -60243 -71498 -57670 -21245 19356 63781 60080 -12949
14263a2949k8096J1311O1647J8389j1840k9328j476K0749K155j5203J9755l152
$$ -12949 -41045 -29734 31913 50302 38462 9134 7658 28407 30562 15359 35114 31962
14251C1962j9946l1998L1701K1863L5447N0j0663M791O807j6089n0698K2570k399
$$ 31962 12016 -19982 11719 33582 69029 69079 58416 63207 70014 53925 3227 25797 23398
14238B3398k2049m9807j0140O3823L7563k042K249m9868R877P1727n364l4809
$$ 23398 1349 -48458 -58598 5225 42788 40746 42995 -6873 3004 74731 69367 34558
14226C4558j4760n1096j1073k6779L6235M895J0173N6809J2959k8844k6255k7754
$$ 34558 19798 -31298 -42371 -69150 -32915 -28020 -17847 38962 51921 23077 -3178 -30932
14214c0932L9583K8245k903k8233Q567k3265K9711p676J1999J8881J6872K2167
$$ -30932 8651 36896 33993 5760 14327 -8938 20773 13097 25096 43977 60849 83016
14202H3016l7463j9590L8441M11l308m4334m4880K9157K6485k6683J6995j3469
$$ 83016 45553 25963 64404 64815 61507 17173 -27707 1450 27935 1252 18247 4778
14190D778q97M5012j7400j6268L4011K2047m2897J392o3725K1599L9774K6891
$$ 4778 3881 48893 31493 15225 49236 71283 28386 29778 -33947 -12348 27426 54317
14178E4317n708j3224J8885Q581K1016m735K3343m598j6845o311K098M2801k1121
$$ 54317 48609 35385 54270 62851 83867 79132 102475 97877 81032 74721 76819 119620 98499
14165I8499l4468l5155j4293L940K9231l917Q998j5312j2903J6363k2033K091
$$ 98499 64031 28876 14583 18523 47754 43837 52835 37523 24620 40983 18950 21041
14153B1041K2041m8987n0474l4101L2852L3888J858n4921Q083M3986L7956k0815
$$ 21041 43082 -5905 -56379 -90480 -57628 -23740 -21882 -76803 -68720 -24734 13222 -7593
14141g593k1191q211R408M8216N4057j2918k0170l2112J7763J3019j0360M095
$$ -7593 -28784 -36995 -27587 20629 74686 61768 41598 9486 27249 40268 29908 34003
14129C4003K4294m6829J9039k3970l2817J039m992k0998n915O3826L6546m9129
$$ 34003 58297 11468 30507 6537 -26280 -25241 -30233 -51231 -57146 6680 43226 -5903
14117e903o907o26j5742J0542J2174l817K6255k187m6547M1384O1347k0476n8017
$$ -5903 -12810 -13436 -29178 -18636 -6462 -10279 15976 13789 -32758 8626 69973 49497 -8520
14104h520M5537M9185J3823J073k4060j1176k3413k436l2533l6905K3299J2941
$$ -8520 37017 86202 100025 101098 77038 65862 42449 40013 7480 -29425 -6126 6815
14092F815P246M317r109k5440P385k7350l421q19M6517L1102M202K8710k0718
$$ 6815 14061 18378 9269 -16171 -8786 -36136 -39557 -40376 6141 37243 41445 70155 49437
14079D9437p520k7985o1815j9918j9978M590M3139M6716p483j7431n383j9849
$$ 49437 41917 13932 -47883 -67801 -87779 -83189 -40050 6666 -817 -18248 -23631 -43480
14067d3480J1242j624n362l8796K2763K4068R139J0593K1325N22N5830K2375o9614
$$ -43480 -32238 -33862 -39224 -78020 -55257 -31189 -22050 -11457 9868 10390 66220 88595 18981
14054A8981p862J1792k7567R781M5211L93o5530k2999M7580N899J5406k1156L5114
$$ 18981 11119 22911 -4656 5125 50336 50729 -14801 -37800 9780 15679 31085 9929 45043
14041D5043L6211K0863J9282o666J8053L2538l6690o0012j4847j7322P010k5545
$$ 45043 81254 102117 121399 114733 132786 165324 128634 68622 53775 36453 43463 17918
14029A7918m937n656J9729j2753J3706K9368m7009l7413o010L4500R483L0836
$$ 17918 12981 7325 27054 14301 28007 57375 10366 -27047 -33057 1443 10926 41762
14017D1762o7256p1918j4609O8463M4015k0847j8343K7358J0180k5903R255N4141
$$ 41762 -25494 -97412 -112021 -43558 457 -20390 -38733 -11375 -1195 -27098 -17843 36298
14005C6298K8635J4811n506R60k1047m3474N656M9753p224p9973o9903n7322j2863
$$ 36298 64933 79744 74238 75198 54151 10677 16333 66086 58862 -21111 -91014 -148336 -161199
13992a61199O5093J3049L3459M4739L8280J2789o6558m6752r218J2646q064m5044
$$ -161199 -96106 -83057 -49598 -4859 33421 46210 -20348 -67100 -76318 -63672 -71736 -116780
13980a16780n423N9078L3295K8445K8488J6935J9384m0191k0284L4800J4846n12
$$ -116780 -122203 -63125 -29830 -1385 27103 44038 63422 23231 2947 37747 52593 52081
13968E2081l1112K7386K2285m720K9799k9893k0382k0146l7086l6541Q651P252
$$ 52081 20969 48355 70640 65920 95719 65826 45444 25298 -11788 -48329 -39678 -32426
13956c2426L5541r871j4659m080J2528L907j8473O2077M6342j3472n9513m3432
$$ -32426 3115 -6756 -21415 -25495 -12967 -9060 -27533 34544 80886 67414 7901 -35531
13944c5531L8835J9392J7313o122O849l6114n483m98j1388J461K2050l1781J1653
$$ -35531 3304 22696 40009 33887 40736 4622 -861 -1359 -12747 -11286 10764 -21017 -9364
13931i364p253k4353O520J3820l2666J9982L5640j2004K4580M9395n5612p3897
$$ -9364 -16617 -40970 -34450 -20630 -53296 -33314 2326 -9678 14902 64297 8685 -65212
13919f5212r617N5345L0477Q743j8509J3583l0799L9076m689n1346K0636J9136
$$ -65212 -74829 -19484 10993 19736 1227 14810 -15989 23087 18398 -32948 -12312 6824
13907F824j909J0773O9617k2853j8070m8034o4330k0614J3601j4007j9253n6283
$$ 6824 4915 15688 85305 62452 44382 -3652 -67982 -88596 -74995 -89002 -108255 -164538
13895a64538J7006M0116L9947J6042O710K4902l9906j690N4033L7484M5689p848
$$ -164538 -147532 -107416 -67469 -51427 -44717 -19815 -59721 -61411 -7378 30106 75795 67947
13883F7947m0056n6081j3697P948J8340K4825J7402R837n050m1252l4890N6276
$$ 67947 27891 -28190 -41887 -33939 -15599 9226 26628 36465 31415 -9837 -44727 11549
13871A1549M2686j5751j8401N6974K8825j1993l4392o680l2565k5221K7478k2470
$$ 11549 54235 38484 20083 77057 105882 93889 59497 52817 20252 -4969 22509 39
13859C9n3833M600K7607M9593N0110K5185n2553l1482L8228L01m2586k5202j6538
$$ 39 -53794 -49194 -21587 28006 78116 103301 50748 19266 57494 57795 15209 -9993 -26531
13846b6531j7102L8741J9483M2004L5043o8379k7739O879k2862p524L2722K3514
$$ -26531 -43633 -4892 14591 56595 91638 23259 -4480 2399 -20463 -27987 4735 28249
13834B8249j0399N205j2673K2261k7091k8998n00k0150J819J0053M2178K3173
$$ 28249 17850 23055 10382 32643 5552 -23446 -23946 -44096 -42277 -32224 9954 33127
13822C3127L967Q458J922M986K1932K611m6854j2775l504K6317q982m8518r912
$$ 33127 37094 45552 47474 52460 74392 77003 30149 17374 13870 40187 31205 -17313 -27225
13809b7225n42j3721j2065k1511P0490J3617J7393J1333k4545j5593l3788J3952
$$ -27225 -27767 -41488 -53553 -75064 -4574 9043 26436 37769 13224 -2369 -36157 -22205
13797b2205K0354K2474J884K2900M119m6827r279m6858k0188O0965N3660K0682
$$ -22205 -1851 20623 22507 45407 49526 2699 -6580 -53438 -73626 -12661 40999 61681
13785F1681M538k1548m1016j2204N656J0128k0321j0871q342m379j5577K0178
$$ 61681 66219 44671 3655 -8549 -2893 7235 -13086 -23957 -32299 -36678 -52255 -32077
13773c2077Q1415K6569n7727k0304J794p315K709J5874K0117m0697o754M152l0336
$$ -32077 49338 75907 18180 -2124 -330 -7645 -4936 10938 31055 -9642 -16396 -12244 -42580
13760d2580J9308L9755J4214J3665j2682r577L8638J8742k7978m2906J0110K6173
$$ -42580 -23272 16483 30697 44362 31680 22103 60741 79483 51505 8599 18709 44882
13748D4882l939j2307P594k7717k7294K5324l6079j7715J2866J6402n0168j0333
$$ 44882 40943 28636 36230 8513 -18781 6543 -29536 -47251 -34385 -17983 -68151 -78484
13736g8484J8462M7466Q0538J356m3511n4782k3538j2714K0915J5875M8400K4905
$$ -78484 -60022 -12556 67982 69338 25827 -28955 -52493 -65207 -44292 -28417 19983 44888
13724D4888o473O743m2623M005m266j276j7676m1681p572K8956j6217l474J2131
$$ 44888 38415 45158 2535 6540 2274 998 -16678 -58359 -65931 -36975 -53192 -56666 -44535
13711d4535N557l1869j2521M5028J2650n9401j1230P7359j5009R294J0850m51
$$ -44535 -38978 -70847 -83368 -38340 -25690 -85091 -96321 -18962 -33971 -24677 -13827 -14278
13699a4278j5722j1736l40N0476M749l8516l3262J9811K0166O0544n3113p894
$$ -14278 -30000 -41736 -42076 8400 13149 -25367 -58629 -38818 -18652 41892 -11221 -19115
13687a9115L0455J9379K730j8173k9746j4465N2563j5362N792p331K2381M9650
$$ -19115 11340 30719 33449 15276 -14470 -28935 23628 8266 14058 6727 29108 78758
13675G8758j717n7140m7956N1092k4065m6113M219L5971j5281k018k2036j466
$$ 78758 77041 19901 -28055 23037 -1028 -47141 -42922 -6951 -22232 -24250 -46286 -47752
13663d7752k6871j0113N030K1586R3130K8097N699j5693l0763J4552J8020J5696
$$ -47752 -74623 -84736 -79706 -58120 35010 63107 68806 53113 22350 36902 54922 70618
13651G0618L1697l3327k2855l5694J1616k3813k037J4934M1301N2778k2927P81
$$ 70618 102315 68988 46133 10439 22055 -1758 -3795 11139 52440 105218 82291 83072
13639H3072n8595q8857P5381M1617l2578K959J8968k9739n0413M5324M4867J5720
$$ 83072 24477 -64380 11001 52618 20040 22999 41967 12228 -38185 7139 52006 67726
13627F7726r293r781Q892p410k8562j8108J3090o8916m2948K0232K9178K6169
$$ 67726 58433 48652 57544 50134 21572 3464 16554 -52362 -95310 -75078 -45900 -19731
13615a9731M2423J5651k0796k5037Q44j6911K6125J1129l0012m172K9076K8424
$$ -19731 22692 38343 17547 -7490 -6646 -23557 2568 13697 -16315 -20487 8589 37013
13603C7013K6700k9848l6068m8960l3986J8529P4020O6422k890J0947k1878J4994
$$ 37013 63713 33865 -2203 -51163 -85149 -66620 7400 73822 70932 81879 60001 74995
13591G4995m5657p68l0298n0805K2777K6356k1700P344K9023l7804J5310j1984
$$ 74995 29338 28570 -1728 -52533 -29756 -3400 -25100 -17756 11267 -26537 -11227 -23211
13579b3211j4304J2453J3235M0783K179o583l005l0509o7117n530Q709k1707l8085
$$ -23211 -37515 -25062 -11827 28956 31135 24552 21547 -8962 -76079 -81609 -72900 -94607 -132692
13566a32692j757L525O0969O2442L6562J2226Q96n9164J9415m7568j926p237K943
$$ -132692 -134449 -130924 -69955 -7513 29049 41275 42171 -16993 2422 -45146 -47072 -54309 -51366
13553e1366j6594J0288M7054K4997J0730k3320n6052J0378M4516J5853k6106L8278
$$ -51366 -67960 -57672 -10618 14379 25109 1789 -54263 -43885 631 16484 -9622 28656
13541B8656Q2265j8947q3984j0287L7073j5071j9343l381N489J6140j6399M5602
$$ 28656 110921 91974 7990 -2297 34776 19705 362 -3019 2470 18610 2211 47813
13529D7813j778o759j8443m1850J4836n929O164K062J875K8390j2058m4006q4555
$$ 47813 46035 39276 20833 -21017 -6181 -12110 -5946 -3884 -2009 26381 14323 -29683 -114238
13516a14238L9511M1586j7041K1868j9639o818R2480J6156j905j3421p9880n7333
$$ -114238 -74727 -33141 -50182 -28314 -47953 -54771 37709 53865 51960 38539 -41341 -98674
13504i8674j1834M6390q456K1855M1716M5227k4913o8138J4916N3440j1505j2278
$$ -98674 -110508 -64118 -72574 -50719 -9003 36224 11311 -56827 -41911 11529 24 -12254
13492a2254J326K1021k4403L707J8937j633o866K0363l6809k2852M9279L3026
$$ -12254 -10928 10093 -14310 -10603 8334 6701 -165 20198 -16611 -39463 9816 42842
13480D2842k3498k8415j2564O413K813P279J2627L3799k2740n0626P545o089q728
$$ 42842 19344 -9071 -21635 -15222 -12409 -5130 7497 41296 18556 -32070 -24525 -30614 -39342
13467c9342Q418Q062K9454n8N049J8171j0911l4261L6079K8698q400k660k3993
$$ -39342 -30924 -22862 6592 6534 11583 29754 18843 -15418 20661 49359 40959 38299 14306
13454A4306o5587m9522M3923O8320L9073P646L63J2169M0954l3376M521j9020
$$ 14306 -51281 -100803 -56880 11440 50513 58159 58522 70691 111645 78269 82790 63770
13442F3770J0880K0932k2172j9847l5011L5314r278n4720J1639n4161K4519J687
$$ 63770 74650 95582 73410 53563 18552 53866 44588 -10132 1507 -52654 -28135 -26448
13430b6448L5510L7610j9463K9190K1824O808J4444l8641l3242O502l0182Q872
$$ -26448 9062 46672 27209 56399 78223 85031 99475 60834 27592 34094 3912 12784
13418A2784K6566J4022n2224j7616L3981L0486n420j1113j2951k2359n4427J6821
$$ 12784 39350 53372 1148 -16468 17513 47999 42579 31466 18515 -3844 -58271 -41450
13406d1450l741O5382L0586P181n8024n7409K1181J208j1905M899j0363j7732
$$ -41450 -45191 20191 50777 57958 -66 -57475 -36294 -35086 -46991 -42092 -52455 -70187
13394g0187j3740O9059N3898k4680J7425L9416j5075l8835O6149k033o425k2295
$$ -70187 -83927 -14868 39030 14350 31775 71191 56116 17281 83430 81397 74972 52677
13382E2677m6486k7059L7802J0585J654l1315N179K4215j361J7711L7704J2298
$$ 52677 6191 -20868 16934 27519 29173 -2142 3037 27252 25891 43602 81306 93604
13370I3604k2485m444K885J4870k968N4038J5517n4110j6205k1539m0058L0450
$$ 93604 71119 66675 69560 84430 81462 135500 151017 96907 80702 59163 19105 49555
13358D9555J0296m5299J0039J4439k8522m3076J8939K2521J8059N9273K4599K5664
$$ 49555 59851 14552 24591 39030 10508 -32568 -13629 8892 26951 86224 110823 136487
13346A36487j4040m4911p165J5584L0556o1869p8888L5847N3824N5491N5073M6896
$$ 136487 122447 77536 70371 85955 116511 54642 -24246 11601 65425 120916 175989 222885
13334B22885L7316K7138J10753J69448P6749K7777k28p1559j54952j22753n1678
$$ 222885 260201 287339 398092 567540 644289 672066 671838 600279 445327 322574 270896
13323B70896o0147r0528q887j7954M3645o197L34L7268m5137m383J2599n200m676
$$ 270896 210749 120221 111334 93380 137025 130828 131162 168430 123293 118910 131509 126309 121633
13310A21633l6235l9011K4856k9499L6262M0635o5433m700N5920J9745p801p3290
$$ 121633 85398 46387 71243 41744 78006 118641 53208 48508 104428 124173 116372 43082
13298D3082l7899J8048M5945K7211k1179j9544k7982j5727m7327k3478j044j79
$$ 43082 5183 23231 69176 96387 75208 55664 27682 11955 -35372 -58850 -59894 -60073
13286f0073M7478O6659M4897J1292j5217L5726m3626n9480j042l61J4963q256
$$ -60073 -12595 54064 98961 110253 95036 130762 87136 27656 26614 26253 41216 32960
13274C2960k460L4318l0127m1351K5590P941k6622n2453l7533J4847O4203M3748
$$ 32960 30500 64818 34691 -6660 18930 26871 249 -52204 -89737 -74890 -10687 33061
13262C3061J4897J6472K5568k1998k8087p4867j9850P5216O606j0664k1835l6541
$$ 33061 47958 64430 89998 68000 39913 -34954 -54804 20412 27018 16354 -5481 -42022
13250d2022J3202j3878j837K2660K5218K2658J4114m1015k0422J0569K3548m77
$$ -42022 -28820 -42698 -44535 -21875 3343 26001 40115 -900 -21322 -10753 12795 12318
13238A2318O642q78M5316m2149n4982J4249L8922J8385l6224j5091J1165P558
$$ 12318 18960 18082 63398 21249 -33733 -19484 19438 37823 1599 -13492 -2327 5231
13226E231l8180j0078J2371O2746N3398l0383k1499J1210L0340J5326r362j9942
$$ 5231 -32949 -43027 -30656 32090 85488 55105 33606 44816 75156 90482 81120 61178
13214F1178m5242n27K9443J0065J0140k1615l6014J9418L0299J987l0200M688
$$ 61178 15936 15409 44852 54917 65057 43442 7428 26846 57145 59132 28932 33620
13202C3620l0318L7244K1857K1507K8719l7791o4187j9910Q037J8398m318L043
$$ 33620 3302 40546 62403 83910 112629 74838 10651 -9259 -1222 17176 12858 15901
13190A5901j8984k9935J0479L5815R230o757K400k5781m2190Q758l090Q645j0827
$$ 15901 -3083 -33018 -22539 13276 22506 15749 18149 -7632 -49822 -41064 -44154 -35509 -46336
13177d6336k3555J373N5113M4333j4314R261J9840k3010q549K926K829M2688K5227
$$ -46336 -69891 -68518 -13405 30928 16614 25875 45715 22705 14156 17082 19911 62599 87826
13164H7826m170K1616l8100j6313O169K9462K4940k3924j9558K2338j8873l9671
$$ 87826 83656 105272 67172 50859 57028 86490 111430 87506 67948 90286 71413 31742
13152C1742j6957k1567j7859q374J1811J2690K4952J8145m651J9671j9018n46
$$ 31742 14785 -6782 -24641 -33015 -21204 -8514 16438 34583 29932 49603 30585 30039
13140C0039k4151J4162p300o4086K6493M1972K494j5614r28j2759l6995J4945
$$ 30039 5888 20050 12750 -51336 -24843 17129 19623 4009 3081 -9678 -46673 -31728
13128c1728K5576N9306o814L522M0432J755K2724K0900j2316J995J6203n5867
$$ -31728 -6152 53154 46340 49862 90294 92049 114773 135673 123357 125352 141555 85688
13116H5688p8295j45N0887L4147O0420l2586q70J0510j3925k6600o1873n1700
$$ 85688 7393 7248 58135 92282 152702 120116 119246 129756 115831 89231 27358 -24342
13104b4342m931L8589k464j819L4428m2576K377J090L025p430j0642j923j3176
$$ -24342 -29273 9316 6852 5033 39461 -3115 -738 352 3377 -4053 -14695 -16618 -29794
13091b9794m9721R742M4684l874J6610M8969q199m9710M8382M9339k8836J2280
$$ -29794 -79515 -69773 -25089 -28963 -12353 36616 28417 -21293 27089 76428 47592 59872
13079E9872M2899J9526j3675l5803o7417m465N2770k0875L2724m2743j4584J8342
$$ 59872 102771 122297 108622 72819 5402 937 53707 32832 65556 22813 8229 26571
13067B6571J3827j8997q816K5896j3798K321J1027r978J6239j0907l1589K2349
$$ 26571 40398 21401 12585 38481 24683 27004 38031 28053 44292 33385 1796 24145
13055B4145k9840K2279k3095j3030L228L3935P2039J4667k3280j3334O381L2048
$$ 24145 -5695 16584 -6511 -19541 -16313 17622 89661 104328 81048 67714 74095 106143
13043A06143m199m217J9498j5276R36j4878o858J4229m7465l4704N100K5807j396
$$ 106143 101944 97727 117225 101949 102885 88007 81149 95378 47913 13209 18309 44116 42720
13030D2720J0689K6812J2896L1800J8184l5803l9417p704P836j4452J0762K0229
$$ 42720 53409 80221 93117 124917 143101 107298 67881 60177 68013 53561 64323 84552
13018H4552K5065J2634m3775q835N0118R008n932l4263K1156M9660J6735k8355
$$ 84552 109617 122251 78476 69641 119759 128767 122835 88572 109728 159388 176123 147768
13006A47768L0570L1087O4484o7934R757O1783n4575M109K5224k705m9682j3972
$$ 147768 178338 209425 273909 205975 215732 277515 222940 227049 252273 249568 199886 185914
12994A85914L3948J8298L9537k3750L2791K1024o8242m6218J1030k2645j6934
$$ 185914 219862 238160 277697 253947 286738 307762 239520 193302 204332 181687 164753
12983A64753J4415p548K636j5602j1554k482K8230L5491O3878J9126l5163k5435
$$ 164753 179168 171620 174256 158654 147100 144618 172848 208339 272217 291343 256180 230745
12971B30745j3423J4831K8927q2035L025N8007p79J4842N0530q23Q027L1516J7065
$$ 230745 217322 232153 261080 179045 182070 240077 239298 254140 304670 303847 311874 343390 360455
12958C60455r436j2700l4147l6412M930O5892N4323L873M1571K9696R354n7715
$$ 360455 351019 338319 304172 267760 272690 338582 392905 396778 438349 468045 477399 419684
12946D19684m293M1679P579j546O992J2934K7743M0082j9105n7141k5906L4128
$$ 419684 415391 457070 464649 463103 470095 483029 510772 550854 531749 474608 448702 482830
12934D82830J4865J2527j3873P69M5275K1940M2406P702L8599k1826j0674L2084
$$ 482830 497695 510222 496349 497118 542393 564333 606739 614441 653040 631214 620540 652624
12922F52624L9007O6544P5931J8855M5358R5435O5828P4359J00207J34913J98381
$$ 652624 691631 758175 834106 852961 898319 993754 1059582 1133941 1234148 1369061 1567442
12911A567442J96967K55904M14460N05265N62896N32978J64105j21620k59793
$$ 1567442 1764409 2020313 2434773 2940038 3502934 4035912 4200017 4078397 3818604
12902C818604m26064l67577k00056j12751o1660L5480J03133J53325K00709K50201
$$ 3818604 3392540 3024963 2824907 2712156 2650496 2685976 2789109 2942434 3143143 3393344
12892C393344K35436J96578K21243K47748K92451L18691M17705N07288O18329
$$ 3393344 3628780 3825358 4046601 4294349 4586800 4905491 5323196 5830484 6448813
12883F448813O90237Q78378J071406J234214J400682J530458J757713K147737
$$ 6448813 7139050 8017428 9088834 10323048 11723730 13254188 15011901 17159638
12875A7159638K716846L582483M816697O485971R037044J2977865J8549718K4420852
$$ 17159638 19876484 23458967 28275664 34761635 43798679 56776544 75326262 99747114
12867I9747114K3911168J1393581l348098j4704501k3086526k3756272j7517145
$$ 99747114 123658282 135051863 131703765 116999264 93912738 70156466 52639321
12860E2639321j1421671p535297n053826l384005k267596j479249q63013m15504
$$ 52639321 41217650 33682353 28628527 25244522 22976926 21497677 20634664 20219160
12852B0219160P2541O42767J167592J534871J109910m61033j822181k822521l465635
$$ 20219160 20291701 20934468 22102060 23636931 24746841 24285808 22463627 19641106 16175471
12843A6175471l058577k201324j543632j130099q49018o05412n69435m98499l83337
$$ 16175471 13116894 10915570 9371938 8241839 7392821 6787409 6217974 5719475 5336138
12834E336138l21331l10471k78314k95241k91763k42157k91411k75780k05320
$$ 5336138 5014807 4704336 4426022 4130781 3839018 3596861 3305450 3029670 2824350
12825B824350j64758j89443j34333j89835k12858j16779j57332j39580p9722n4018
$$ 2824350 2659592 2470149 2335816 2145981 1933123 1816344 1659012 1519432 1439710 1385692
12815A385692q8330p0190m9287R818m8575r9498j16172o9609k3881m3537n7492
$$ 1385692 1297362 1227172 1177885 1187703 1139128 1039630 923458 853849 829968 786431 728939
12804G28939j7410k1062k3380o7789k8028p6464j01340L2672K5913p155j9504
$$ 728939 711529 690467 667087 599298 571270 494806 393466 426138 452051 444896 425392
12793D25392k3936L907o4178l8267L4650N2875l7514o2348R60k660J9809j8617
$$ 425392 401456 405363 341185 302918 337568 390443 352929 290581 291541 288881 308690 290073
12781B90073m5861j1720o303k1211n5637m0156L5821M5730O648r983J3696J4514
$$ 290073 244212 232492 226189 204978 149341 109185 145006 190736 197384 187401 201097 215611
12769B15611M491p112J0781k0072K4447k2159n0338M1756j9779o2335o3321O181
$$ 215611 220102 212990 223771 203699 228146 205987 155649 197405 177626 115291 51970 58151
12757E8151L6747L6704l466r712l0296M0420L3965k0219l6164K6178O3744Q521
$$ 58151 94898 131602 128136 118424 88128 128548 162513 142294 106130 132308 196052 204573
12745B04573m5646n3014n056Q816j2957j3436k5503j4359P930k2651M0032L9753
$$ 204573 158927 105913 100857 109673 96716 83280 57777 43418 51348 28697 68729 108482
12733A08482L958p387J9402K170l7934N4676M4651m2873o8147l6655N1088j0038
$$ 108482 112440 105053 124455 126625 88691 143367 188018 145145 76998 40343 91431 81393
12721H1393j15K2004j9058K0455O210Q520j7606q326K110J7130j5427K2517N9523
$$ 81393 81278 103282 84224 104679 110889 119409 101803 93477 95587 112717 97290 119807 179330
12708A79330O2873m7750l3823j5366l0405j5892J5809P0883K2060j15409n8111
$$ 179330 242203 194453 160630 145264 114859 98967 114776 185659 207719 92310 34199
12697C4199J5832J248L0617L9930k8436n6275J9792P3468M0800k207J7776l5695
$$ 34199 50031 51279 81896 121826 93390 37115 56907 130375 171175 168968 186744 151049
12685A51049o7803m812j971l9586k8509O4744J0862l3148J1305l119m526K7902
$$ 151049 83246 78434 76463 36877 8368 73112 83974 50826 62131 59012 54486 82388
12673H2388j3862J3321j390m9552N8421P349O609p870O320k5739K196M07r546
$$ 82388 68526 81847 80457 30905 89326 96675 103284 95414 101734 75995 78191 78598 69052
12660F9052J4997Q569j9606K0514j6620o0388n937m626L24N3759j5105P353K7499
$$ 69052 84049 92618 73012 93526 76906 16518 10581 5955 6279 60038 44933 52286 79785
12647G9785J8503o6143n8446j1405K0298j5263O6627N3205K5857J718l2682J750
$$ 79785 98288 32145 -26301 -37706 -17408 -32671 33956 87161 113018 114736 82054 83804
12635H3804k3741m845M8866m4493j5477J2154k9754n0976P23J2386l1387K0023
$$ 83804 60063 55218 104084 59591 44114 56268 26514 -24462 -23739 -11353 -42740 -22717
12623b2717N5163j8614O055k2064n081L2737P511K484K213P133J8697L3391m569
$$ -22717 32446 13832 19887 -2177 -7258 25479 32990 35474 37687 44820 63517 96908 92339
12610I2339m6310J1608M6847K0599K0469j1588o3501R423M3869n7072o8899J5969
$$ 92339 46029 57637 104484 125083 145552 133964 70463 79886 123755 66683 -2216 13753
12598A3753K7931r409k2210n253L1274m0333m3123j2149O2046M4578l677K439
$$ 13753 41684 32275 10065 4812 36086 -4247 -47370 -59519 2527 47105 43428 45867
12586D5867J987J6348m433k0004n8986q5308L8856N3396K7054R301J8633q276
$$ 45867 47854 64202 59769 39765 -19221 -104529 -65673 -12277 14777 24078 42711 34435
12574C4435r880p0468P370Q621j1580P172J3216p5760K3239N0045l9745l453O798
$$ 34435 24555 -45913 -38543 -29922 -41502 -34330 -21114 -96874 -73635 -23590 -63335 -66788 -59990
12561e9990L341p397J5640K9094L0965N4871Q009N237l0059n2560o830L7482M0224
$$ -59990 -56649 -64046 -48406 -19312 11653 66524 74533 79770 49711 -2849 -9679 27803 68027
12548F8027k4441n1529l1132L0174k394p143O858l7629K4935K6570j9312P95K1550
$$ 68027 43586 -7943 -39075 -8901 -11295 -18438 -11580 -49209 -24274 2296 -17016 -16221 5329
12535E329p749m0952j9612l5648N187P1227j4788N484R769N3171J9339m433J9332
$$ 5329 -2420 -43372 -62984 -98632 -93445 -22218 -37006 -31522 -21753 31418 50757 46324 65656
12522F5656J859N598n2095j0439m4436r579j5314L099M8111N2042p220P489L3084
$$ 65656 67515 73113 21018 10579 -33857 -43436 -58750 -55651 -7540 44502 37282 44771 77855
12509G7855O014R993J8930m5447n9163j3524j116J49M6692N014l6754m6838j1316
$$ 77855 83869 93862 112792 67345 8182 -5342 -6458 -6309 40383 45397 8643 -38195 -49511
12496d9511J4235j2646j339N1520L7623K6714j8183J2795L6644l3904n0993K4010
$$ -49511 -35276 -47922 -49261 2259 39882 66596 48413 61208 97852 63948 12955 36965
12484C6965j3976m8302k302K4773k6521J1934O6526L843m2554R516N666P565K6527
$$ 36965 22989 -25313 -27615 -2842 -29363 -17429 49097 52940 10386 19902 25568 33133 59660
12471E9660k4055k8142N0062n4035l6875L8353P0353k3146l6010R450o327P273
$$ 59660 35605 7463 57525 3490 -33385 4968 75321 52175 16165 25615 19288 26561
12459B6561K9755L1921l488k8593k251P824j4462l6874M807k2501r424K3773M0600
$$ 26561 56316 88237 84749 56156 53905 61729 47267 10393 15200 -7301 -16725 7048 47648
12446D7648K1934K7802j7355k6235K1605k4336m8531k6254r819K606n2374P714
$$ 47648 69582 97384 80029 53794 75399 51063 2532 -23722 -33541 -30935 -83309 -75595
12434g5595M6334J254K459M0584K4338m4958m1066O654M1323j9489J1167K3090
$$ -75595 -29261 -28007 -25548 15036 39374 -5584 -46650 -39996 1327 -18162 -6995 16095
12422A6095n1j4256k5439L059L8438K4511P1611L1998k6770n3712M084K941M3851
$$ 16095 16044 1788 -23651 -20592 17846 42357 113968 145966 119196 65484 69568 72509 116360
12409A16360J2067k8856k72M5074L3763K1810k1943l1166L2045R4980L1256Q1163
$$ 116360 128427 99571 99299 144373 178136 199946 178003 146837 178882 273862 305118 386281
12397C86281J42119J67231P9080n8331j33658j03391p0618r0187j08454q7085
$$ 386281 528400 695631 774711 716380 582722 479331 408713 318526 210072 122987
12387A22987o114M4262J3585m6959l3078k42J9817J1327K0308M243J328q144l9966
$$ 122987 116873 161135 174720 127761 94683 94441 114258 125585 145893 150136 151464 143320 103354
12374A03354n4395l2857N874r742K081L3001r640J9706K6487j4556q4202n3520
$$ 103354 48959 16102 21976 12234 14315 47316 37676 57382 83869 69313 -14889 -68409
12362f8409q912J2948J7489L0695M1830M5845m3839n2820k12n167O1705K4671
$$ -68409 -77321 -64373 -46884 -16189 25641 71486 27647 -25173 -25385 -30552 31153 55824
12350E5824K9117j0821m1566k4521m0853j8583m7763P508N0476J2233L3715M7001
$$ 55824 84941 74120 32554 8033 -32820 -51403 -99166 -91658 -41182 -28949 4766 51767
12338E1767m664j5817l8769L3738N0871j646j3746j1562M9823M685k2792l4338
$$ 51767 47103 31286 -7483 26255 77126 75480 61734 50172 99995 104680 81888 47550
12326D7550k8801k786N2884J7618l1250L4012k5807l7791l7659j5785M175j870
$$ 47550 18749 15963 68847 86465 55215 89227 63420 25629 -12030 -27815 -23640 -25510
12314b5510k0149L6712J680n3552l4434l4440J7959L3916K3571M3254k8489k7711
$$ -25510 -45659 -8947 -7267 -60819 -95253 -129693 -111734 -77818 -54247 -10993 -39482 -67193
12302f7193j6692M641K4027L3497O1270m8925l8898L4940L2565O231J4415M3465
$$ -67193 -83885 -79244 -55217 -21720 39550 -9375 -48273 -13333 19232 25463 39878 83343
12290H3343l9366l5386J9905J9463K1891l432n4329o8457K587N9266J0740m3414
$$ 83343 43977 8591 28496 47959 69850 66418 12089 -56368 -53781 5485 16225 -27189
12278b7189j2569L9442M3838k0947L715k9160m9836Q063L2877M8735L771l1218
$$ -27189 -39758 -316 43522 22575 26290 -2870 -52706 -44643 -11766 36969 40740 9522
12266I522j3048R746j7227J1063k3304p381L7695k9971J2211J1980j3060n600
$$ 9522 -3526 6220 -11007 56 -23248 -30629 7066 -22905 -10694 1286 -11774 -17374
12254a7374p095j4787o015k8827k805K1764M8491K9415R262q114k4260K6616J3592
$$ -17374 -24469 -39256 -45271 -74098 -76903 -55139 -6648 22767 32029 23915 -345 26271 39863
12241C9863l4208m523j5236k51K2432m204K3768k8461M3965K7385m051p550L5323
$$ 39863 5655 1132 -14104 -14355 8077 3873 27641 -820 43145 70530 66479 58929 94252
12228I4252K6986J8678j4417n3013j09668l1102Q0491L8657k6918R612N383l5791
$$ 94252 121238 139916 125499 72486 -37182 -68284 12207 50864 23946 33558 38941 3150
12216C150n889m946L223Q50l8411J3492L9772L5325k0412k4759j0583n3718j8546
$$ 3150 -2739 -7685 -4462 -3612 -42023 -28531 11241 46566 26154 1395 -9188 -62906 -81452
12203h1452N0051R767K6304K2808j0218k2438j4839N0323M5763l4082l6410k6948
$$ -81452 -31401 -21634 4670 27478 17260 -5178 -20017 30306 76069 41987 5577 -21371
12191b1371N4298Q3993j3544m7363n3060k595O105J7163r595n3621m2190K8382
$$ -21371 32927 116920 103376 56013 2953 358 6463 23626 14031 -39590 -81780 -53398
12179e3398J7097m658J2752M3596K0545j4517l8952m4535J9863N930o800j7739
$$ -53398 -36301 -40959 -28207 15389 35934 21417 -17535 -62070 -42207 -36277 -43077 -60816
12167f0816L4944J8318j525L635J8435J1542l4020l1629L544j7262q727K4640
$$ -60816 -25872 -7554 -9079 -5444 12991 24533 -9487 -41116 -37572 -54834 -63561 -38921
12155c8921P315J2303J9557l4872K5087M220M1174K6994j5049r0739M2572K755
$$ -38921 -31606 -19303 254 -34618 -9531 -5311 35863 62857 47808 -42931 -359 2396
12143B396j5600j6006j3727M3399L363N0778l1035J7449k9665k4319k6813O866
$$ 2396 -13204 -29210 -42937 462 3825 54603 23568 41017 11352 -12967 -39780 -32914
12131c2914L5511K2119l2224k784J5502K6011k5106k5412l063J9567j7129n885
$$ -32914 2597 24716 -7508 -10292 5210 31221 6115 -19297 -22360 -2793 -19922 -25807
12119b5807J3037M0306j0837J2192l1597l0557K1641j945m8102O427O5012j6687
$$ -25807 -12770 27536 16699 28891 -2706 -33263 -11622 -13567 -61669 -55242 9770 -6917
12107f917k0822k2525K81N9417p010k0784j9607J0420j6517J4184N394j4131j1420
$$ -6917 -27739 -50264 -49983 9434 2424 -18360 -37967 -27547 -44064 -29880 -24486 -38617 -50037
12094e0037l2027O160J9544M940L7973P691k6867J6974L133K5733M9183m3575
$$ -50037 -82064 -75904 -56360 -51420 -13447 -5756 -32623 -15649 -12516 13217 62400 18825
12082A8825J8063Q6791o8114j8034o569k6090j9155k4583k2208Q118m6154L7641
$$ 18825 36888 123679 55565 37531 30962 4872 -14283 -38866 -61074 -52956 -99110 -61469
12070f1469j0051J4860J3784j7920k7610J7448M2824j4386k0227L5316L7514N72
$$ -61469 -71520 -56660 -42876 -60796 -88406 -70958 -28134 -42520 -62747 -27431 10083 10655
12058A0655o403q730O563m6181m7695k0045N0143M3060N5151J0091m1314M514
$$ 10655 4252 -4478 2085 -44096 -91791 -111836 -61693 -18633 36518 46609 5295 9809
12046I809k0076P552j9019J077L6460M902j9618r143L8780l483K6361J0304j6562
$$ 9809 -10267 -2715 -21734 -20657 15803 20705 1087 -8056 30724 27241 53602 63906 47344
12033D7344J2802K993k1038n9109k6177j3072N896r270M2891p478n30O308j8045
$$ 47344 60146 63139 42101 -17008 -43185 -56257 -50361 -59631 -16740 -24218 -24748 -18440 -36485
12020c6485K3519j0315k9147j1804J8075K8959K0258l400j5858L6131K2450j9492
$$ -36485 -12966 -23281 -52428 -64232 -46157 -17198 3060 -340 -16198 19933 42383 22891
12008B2891k3122o672k7672j0541O3685J4149p180J2462K875n1362l6681Q244
$$ 22891 -231 -6903 -34575 -45116 18569 32718 25538 38000 40875 -10487 -47168 -38924
11996c8924L1990K87K8223N744j1477L7345J0387M219J7993k5657M753k356l8406
$$ -38924 -6934 -6647 21576 27320 15843 53188 63575 67794 85787 60130 64883 62527 24121
11983B4121l1220k0537J09248N5562o5286l9213k2918n2101K6398O1758j0505
$$ 24121 -7099 -27636 81612 137174 71888 32675 9757 -42344 -15946 45812 35307
11972C5307m4161k5781N5399k0814k7099j5853m2589N3053N9124k120J9419K374
$$ 35307 -8854 -34635 20764 -50 -27149 -43002 -85591 -32538 26586 24466 43885 46259
11960D6259R836o36j6044l3097o123M9033l9580m9367J2890k3751k5785J8264
$$ 46259 56095 55459 39415 6318 195 49228 9648 -39719 -26829 -50580 -76365 -58101
11948e8101K8489M703r691J6870J0572l1868K4692K3304M266l5889m798k7778
$$ -58101 -29612 -24909 -34600 -17730 -7158 -39026 -14334 8970 13236 -22653 -27451 -55229
11936e5229O768j1304p109L3341L2391l6596m1929k5301K6470N772K403j4262
$$ -55229 -48461 -59765 -66874 -33533 -1142 -37738 -79667 -104968 -78498 -72726 -70323 -84585
11924h4585L6850M6550M9935Q235k9489p055K0215j3692Q080M1461P780k4142
$$ -84585 -47735 -1185 48750 56985 27496 20441 40656 26964 35044 76505 84285 60143
11912F0143M5874j7360l8080J4595L3156n9389q1142k0034J700J0003L9565K9262
$$ 60143 106017 88657 50577 65172 98328 38939 -42203 -62237 -60537 -50534 -10969 18293
11900A8293l782n775k095M702J5960L6619K1612k9394m1458M832J6401l9705k3264
$$ 18293 14511 8736 6641 11343 27303 63922 85534 56140 14682 19514 35915 -3790 -27054
11887b7054N5521K062k1268L7773k4508k9343l816j9655j1238J682K6065p685
$$ -27054 28467 30529 9261 47034 22526 -6817 -10633 -30288 -41526 -39844 -13779 -21464
11875b1464K547L2046R264k5169k5421M3469J8195l5179J3129L979k0887J7004
$$ -21464 -18917 13129 22393 -2776 -28197 15272 33467 -1712 11417 15396 -5491 11513
11863A1513K3105j3909n4951O421m9621j3097K1025N7183N7833R655k8632l9517
$$ 11513 34618 20709 -34242 -27821 -77442 -90539 -69514 -12331 45502 55157 26525 -12992
11851a2992j6122K3114J6901p8561m4688M4900N4705m618J2772J9288k6822k6487
$$ -12992 -29114 -6000 10901 -67660 -112348 -67448 -12743 -17361 -4589 14699 -12123 -38610
11839c8610J7145J6977J0832k0116k3171m8176O719L1834K6637K1161k5115l8739
$$ -38610 -21465 -4488 6344 -13772 -36943 -85119 -78400 -46566 -19929 1232 -23883 -62622
11827f2622K0159K8125R941N3256j2297J2012k7484m1253J8636l042Q35k4647
$$ -62622 -42463 -14338 -4397 48859 36562 48574 21090 -20163 -1527 -4569 -3734 -28381
11815b8381n4616L1331O3213l3849J0228M8551J7196P219o1630J3145O6245K7756
$$ -28381 -82997 -51666 11547 -22302 -12074 36477 53673 60892 -738 12407 78652 106408
11803A06408m5712l6155K0453k1978n0740L0349K3240K774J4964k3699q210k974
$$ 106408 60696 24541 44994 23016 -27724 2625 25865 28639 43603 19904 11694 8720
11791H720l0141j5320K3818K0900O082J0911K0834k4681q432k0164k2606L0221
$$ 8720 -21421 -36741 -12923 7977 14059 24970 45804 21123 12691 -7473 -30079 142
11779A42q421l818K6522o054m7501o2022J0534N0985K4379N1485L1471K8512k482
$$ 142 -8279 -12097 14425 8371 -39130 -101152 -90618 -39633 -15254 36231 67702 96214 93732
11766I3732m6266k7938k307k5301m94N633o212K2441K087m2056j6062R071p763
$$ 93732 47466 19528 17221 -8080 -8574 -2941 -9153 13288 15375 -26681 -42743 -33672 -41435
11753d1435k6367J9377J222k4591L3709N1837m1542l5852K3183N3729m1L0603
$$ -41435 -67802 -48425 -47203 -71794 -38085 13752 -27790 -63642 -40459 13270 13229 43832
11741D3832j8950l9809J0501k1636l0170q367K1934R688J2047o545k9082l7678
$$ 43832 24882 -14927 -4426 -26062 -56232 -64599 -42665 -32977 -20930 -27475 -56557 -94235
11729i4235k4370k048N596J8643N2463l3299m7880k4892J9818N1412q393j5340
$$ -94235 -118605 -120653 -115057 -96414 -43951 -77250 -125130 -150022 -130204 -78792 -87185 -102525
11717a02525l8847M0042L7288j3691l558o936J1982j6313K9770R933j905J5522
$$ -102525 -141372 -101330 -64042 -77733 -81291 -88227 -76245 -92558 -62788 -52855 -54760 -39238
11705c9238N7219M2386J6878k0351q1198j3947N3377j4741l6338m5676L1415N0009
$$ -39238 17981 60367 77245 56894 -24304 -38251 15126 385 -35953 -81629 -50214 -205
11693b05j7804L6139k734P8j7111l806J1880J6658R145L4016L726l4528k6705
$$ -205 -18009 18130 15396 15474 -1637 -5443 6437 23095 32240 66256 69982 35454 8749
11680H749l1656P2081j6308p1948j4066L8692m5082j3798J2533M0037O4786J5491
$$ 8749 -22907 49174 32866 -39082 -53148 -14456 -59538 -73336 -60803 -20766 44020 59511
11668E9511j2215j7307K324k6489k1351N2169J4748k0568o5820k3144L9559O3187
$$ 59511 47296 29989 32313 5824 -15527 36642 51390 30822 -34998 -58142 -18583 44604
11656D4604J2216l2281J1371Q785p546M504m6753m3609N246M3391J7338N8r478
$$ 44604 56820 24539 35910 44695 37149 41653 -5100 -48709 -43463 -72 17266 17324 7846
11643G846J7221O2602L4408l7585k2209L855j7317j1615k6035l371m5488m0360
$$ 7846 25067 87669 122077 84492 62283 66138 48821 37206 11171 7800 -37688 -78048
11631g8048j4976K94R2792L0344n8195k3261k3810m3873j1780N8413L3763K0558
$$ -78048 -93024 -92730 62 30406 -27789 -51050 -74860 -118733 -130513 -72100 -38337 -17779
11619a7779R339O9316N4127q27o5778k6203K2792J311j334k4303j4750J1802n913
$$ -17779 -8440 60876 115003 114176 48398 22195 44987 46298 44964 20661 5911 17713 11800
11606A1800q349n778J5111j4494j9266M1255K4893M914j8453L5185o5286l6964
$$ 11800 3451 -2327 12784 -1710 -20976 20279 45172 50086 31633 66818 1532 -35432
11594c5432N5186N8821k945m7074j7629j3328l1517J8782J8836K270Q043P918
$$ -35432 19754 78575 75630 28556 10927 -2401 -33918 -15136 3700 5970 14013 21931
11582B1931k1489p006M830L203N1521K1185m6611k5940K4959L1497k2370K5274
$$ 21931 442 -6564 -1734 1469 52990 74175 27564 1624 26583 58080 35710 60984
11570F0984J0850k4589K8434l1143p145K461o827m027M537m7282l0225J3513q543
$$ 60984 71834 47245 75679 44536 37391 39852 33025 28998 33535 -13747 -43972 -30459 -39002
11557c9002l6029J8588K5102J1115k7843k6636j5355p938K638n97L7891L5407
$$ -39002 -75031 -56443 -31341 -20226 -48069 -74705 -90060 -97998 -95360 -95957 -58066 -22659
11545b2659K8610J7060M9704p936o2892j0384M9077m4279m6797m8J3877J1504
$$ -22659 5951 23011 72715 64779 1887 -8497 40580 -3699 -50496 -50544 -36667 -25163
11533b5163J3600K7537k4045M2065J2769k2745m7656l6092L4547L6983P896q367
$$ -25163 -11563 15974 -8071 33994 46763 24018 -23638 -59730 -25183 11800 19696 11329
11521A1329m0766k9624j0517j0986J961M8306k2322j5996M1754j8772J5296o719
$$ 11329 -29437 -59061 -69578 -80564 -78603 -30297 -52619 -68615 -26861 -45633 -30337 -37056
11509c7056K5662M7157m785J6759j0274o3708k9829L6758R165J3816l1713N280
$$ -37056 -11394 35763 30978 47737 37463 -26245 -56074 -19316 -10151 3665 -28048 -22768
11497b2768M6963l6602l1263J1557M0682O8734O0264l9620k8207k3428n1435l5778
$$ -22768 24195 -12407 -43670 -32113 8569 77303 137567 97947 69740 46312 -5123 -40901
11485d0901m3497K0523J70p44j7823K405P435M2151m0350n8874L055J8763J137
$$ -40901 -84398 -63875 -63705 -64449 -82272 -79867 -72432 -30281 -70631 -129505 -126450 -107687 -106550
11472a06550l160K3527M8252k0034q215M3295J8542m7485J6724J2918k5553k2801
$$ -106550 -109710 -86183 -37931 -57965 -66180 -22885 -4343 -51828 -35104 -22186 -47739 -70540
11460g0540j9928J4302L0879l2757j8536R832J9177M2955N7160l973r512M9914
$$ -70540 -90468 -76166 -45287 -78044 -96580 -86748 -67571 -24616 32544 28571 19059 68973
11448F8973j153o6769K798K0930O781Q345K385Q719l0045q2636L7473J7222K6144
$$ 68973 67820 1051 3849 24779 31560 39905 42290 51009 20964 -61672 -24199 -6977 19167
11435A9167L1609N691r198j118J3091p753k9786k5578l6000n533k6836J6885j3402
$$ 19167 50776 56467 47269 46151 59242 51489 21703 -3875 -39875 -45408 -72244 -55359 -68761
11422f8761l4016K3323r939k3655n719o032L9062J1140N2237N9307k2483l1249
$$ -68761 -102777 -79454 -89393 -113048 -118767 -124799 -85737 -74597 -22360 36947 14464 -16785
11410a6785m0289L0487O5348J5243j7414p4357j9868k9664j683N9352M5227P996
$$ -16785 -57074 -26587 38761 54004 36590 -37767 -57635 -87299 -88982 -29630 15597 23593
11398B3593k3573l8901k2317j4861r160N5258r551k5349m7262K2771M262r593
$$ 23593 20 -38881 -61198 -76059 -85219 -29961 -39512 -64861 -112123 -89352 -85090 -94683
11386i4683K4422J0911j2608L9305m2726p202M176K0591N6262K8552J6115j7715
$$ -94683 -70261 -59350 -71958 -32653 -75379 -82581 -78405 -57814 -1552 27000 43115 25400
11374B5400r199J4360L95j6915o902K7885N4542K4244L516P762m2837p8861l2357
$$ 25400 16201 30561 30956 14041 7139 35024 89566 113810 117326 125088 82251 3390 -28967
11361b8967j5343L2591J6032l6533l8074J4524K437m5519j660K7567L3193r030
$$ -28967 -44310 -11719 4313 -32220 -70294 -55770 -53333 -98852 -100512 -72945 -39752 -48782
11349d8782k8856N3174P6443J3969j7490k3229l7024L2743K7510n7737m0527m977
$$ -48782 -77638 -24464 51979 65948 48458 25229 -11795 20948 48458 -9279 -49806 -54783
11337e4783N8434r014l7604K1019K1096N552k1747m510j6302n4059L9951O825
$$ -54783 3651 -5363 -42967 -21948 -852 4700 -17047 -21557 -37859 -91918 -51967 -45142
11325d5142j2527m0562N5207N4444k4729M4106l5050l8934M6096J4985K230j645
$$ -45142 -57669 -98231 -43024 11420 -13309 30797 -4253 -43187 2909 17894 20124 18479
11313A8479m4652m8319K9566J5900n2257j8310K9028j5821m307r12k4432K9539
$$ 18479 -26173 -74492 -44926 -29026 -81283 -99593 -70565 -86386 -90693 -91605 -116037 -86498
11301h6498N2465j0427j2455q468K0969M3392J5293L346Q511K6525J6143M680
$$ -86498 -34033 -44460 -56915 -65383 -44414 -1022 14271 17617 26128 52653 68796 73476
11289G3476J2713l6193m9643J426K2116n0395m2528K1989J4606Q629M6399K6272
$$ 73476 86189 49996 353 1779 23895 -26500 -69028 -47039 -32433 -23804 22595 48867
11277D8867q866l4975l7892j7590M3806L5536j1989J8867j0913n4665k184M9809
$$ 48867 40001 5026 -32866 -50456 -6650 28886 16897 35764 24851 -29814 -31998 17811
11265A7811K3205k9398o2399l0910K876k856J7062N0092k541Q831J4467j8373
$$ 17811 41016 11618 -50781 -81691 -78815 -81671 -64609 -14517 -17058 -8227 6240 -12133
11253a2133K7286M7143k3807l881k2564p836k6350k3631k8090J1854L3863j155
$$ -12133 15153 62296 38489 34608 12044 4208 -22142 -45773 -73863 -62009 -28146 -29301
11241b9301j5835j5530p135M3603p21L1160J4225n0165n1186p645m937j1532J7015
$$ -29301 -45136 -60666 -67801 -24198 -24919 6241 20466 -29699 -80885 -88530 -93467 -104999 -87984
11228h7984L1479J3435j6264j0222J7989J1430K6196M91j3745k4316P910K1687
$$ -87984 -56505 -43070 -59334 -69556 -51567 -40137 -13941 -13450 -27195 -51511 -43601 -21914
11216b1914K2808J9134k8297l407j8816K5770K5699l678k3177l963k9650p382
$$ -21914 894 20028 -8269 -11676 -30492 -4722 20977 17299 -5878 -9841 -39491 -46873
11204d6873o492l1091L3j5832l134M737L7476J5725j2114p031N362K0429N5268
$$ -46873 -53365 -84456 -84423 -100255 -103389 -98652 -61176 -45451 -57565 -64596 -59234 -38805 16463
11191A6463J8157k0979o2498j6635L3001P8652K2641J2729J1918j7343J7142N525
$$ 16463 34620 13641 -48857 -65492 -32491 46161 68802 81531 93449 76106 93248 98773
11179I8773K7888k5015m7381P231J5070P309K0492K4001j5651p3231l1490m1170
$$ 98773 126661 101646 54265 61496 76566 83875 104367 128368 112717 39486 7996 -33174
11167c3174O163M1757L4816J7406L498q4529j5135M6659R216j0382O220O684j9539
$$ -33174 -27011 14746 49562 66968 70466 -14063 -29198 17461 26677 16295 22515 29199 9660
11154I660l892R161M791k5368j7334M0447N2182N360j8050K4647j2009l8476k4906
$$ 9660 5768 14929 19720 -5648 -22982 17465 69647 75007 56957 81604 69595 31119 6213
11141F213l6406k0771k9764M0726J2673J2681n418q04M4776J8451o781k2110K105
$$ 6213 -30193 -50964 -80728 -40002 -27329 -14648 -20066 -20870 23906 42357 35576 13466 15571
11128A5571l7402m1624j2776O1276M6648j2700l8883p4590q324N1844O038J2851
$$ 15571 -21831 -63455 -76231 -14955 31693 18993 -19890 -94480 -102804 -50960 -44922 -32071
11116c2071J3469K4272J911j9267k3270M5034K0227R579j3967m4166q877O33l8926
$$ -32071 -18602 5670 7581 -11686 -34956 10078 30305 39884 25917 -18249 -27126 -26493 -65419
11103f5419K1259N2760K0866j7975j2984M046p501M40q892J5301J0217J123j4642
$$ -65419 -44160 8600 29466 11491 -1493 2553 -4948 -4508 -13400 1901 12118 13241 -1401
11090a401k9277k3541K8152K0073k1155K833p8K9192J663M4221M1094j9466M968
$$ -1401 -30678 -54219 -26067 -5994 -27149 -24316 -24394 4798 6461 50682 91776 72310 77278
11077G7278J778k1208j5006K033j5398R905j8053l3267o027M364J8092K879m310
$$ 77278 79056 57848 42842 44875 29477 39382 21329 -11938 -17965 -13601 4491 7370 3060
11064C060j2034L0649M1559q09l1268l7009L2074K5921j3949k2408k5454l5644
$$ 3060 -8974 21675 63234 62425 31157 -5852 26222 52143 38194 15786 -9668 -45312
11052d5312j0184j6171j0545L2212L669J6785M0695j733l9800k3497J865N6752
$$ -45312 -55496 -71667 -82212 -50000 -46331 -29546 11149 9416 -30384 -53881 -52016 4736
11040D736J9697k0078M4869p200n7391j2232K5299j1616k9921M3130K0498j091
$$ 4736 24433 4355 49224 42024 -15367 -27599 -2300 -13916 -43837 -707 19791 18700
11028A8700j1330L78J0131n842p386k6287q641P1898l1041k3048n040J3101n7454
$$ 18700 7370 7748 17879 12037 4651 -21636 -30277 41621 10580 -12468 -17508 -4407 -61861
11015f1861k0520K2144O0702J6262m6399k9259r914J7904J4441j8629K6348K5155
$$ -61861 -82381 -60237 465 16727 -29672 -58931 -68845 -50941 -36500 -55129 -28781 -3626
11003c626j1439o9321N5411N8261K0319l648k9480m0236k7270j2920N777J0005
$$ -3626 -15065 -84386 -28975 29286 49605 45957 16477 -23759 -51029 -63949 -58172 -48167
10991d8167J2595j6934J1502M2310J7916j6736j2611m1220R956J7371n1486j5625
$$ -48167 -35572 -52506 -41004 1306 19222 2486 -10125 -51345 -41389 -24018 -75504 -91129
10979i1129J6766K4118J3179J7057k7193K358l591j7935l110N602M3169O6883
$$ -91129 -74363 -50245 -37066 -20009 -47202 -44844 -48435 -66370 -69480 -63878 -20709 46174
10967D6174L4725l2441j6086M7194j4144l6233k6755k0915L1178p825J7919m814
$$ 46174 80899 48458 32372 79566 65422 29189 2434 -18481 12697 4872 22791 17977
10955A7977n682j2240k9883J5484L3597O667j0411J6758p32j2989J9665Q69J8558
$$ 17977 12295 55 -29828 -14344 19253 25920 15509 32267 31535 18546 38211 39080 57638
10942E7638k368J2061Q415p8685k663L9816r198m9955o5992M37J4302M0556N1584
$$ 57638 55270 67331 75746 -2939 -5602 34214 25016 -24939 -90931 -90494 -76192 -35636 15948
10929A5948J3093N803j629k1404J0080J7615j1833R380L5823l6337j9533J7477
$$ 15948 29041 34844 33215 11811 21891 39506 27673 37053 72876 36539 17006 34483
10917C4483K2334l8047l9418K0208R658k1393k307j5595J2391j8803n7039k101
$$ 34483 56817 18770 -20648 -440 9218 -12175 -14482 -30077 -17686 -36489 -93528 -95629
10905i5629M470J6787L7694K1243N229K0190J7240n324m0108k2679l3160J0484
$$ -95629 -91159 -74372 -36678 -15435 -10206 9984 27224 21900 -18208 -40887 -74047 -63563
10893f3563o983k4627k8494j556L6919P9634L9238j2151j1706N789m6054k3593
$$ -63563 -70546 -95173 -123667 -125223 -88304 -8670 30568 18417 6711 12500 -33554 -57147
10881e7147K0439R223o602O8207O2869j5205l2683J3068o736J1658j487j9005
$$ -57147 -36708 -27485 -34087 34120 96989 81784 49101 62169 55433 67091 65604 46599
10869D6599j1233J267k0285k5826m5404j9042K8775Q6359n395l109M038m5409
$$ 46599 35366 36633 16348 -9478 -54882 -73924 -45149 41210 35815 32706 36744 -8665
10857h665m0327n4902N18M3547J4681k514j1770L1215J211K0814K9122K6535k0551
$$ -8665 -48992 -103894 -103376 -59829 -45148 -47662 -59432 -28217 -27006 -6192 22930 49465 28914
10844B8914k5301m7105m1870R278k6798J5028j3938M5980K040L3059K9947l7406
$$ 28914 3613 -43492 -85362 -76084 -102882 -87854 -101792 -55812 -53772 -20713 9234 -28172
10832b8172J3532J0788O900J6759k4516J2621L427K6443J9910k7329j7115l0277
$$ -28172 -14640 -3852 3048 19807 -4709 7912 11339 37782 57692 30363 13248 -17029
10820a7029J4838K6315o5L2778n27j8663j5748n737K356Q98Q949K6534L7573j4685
$$ -17029 -2191 24124 24059 56837 56310 37647 21899 16162 18518 19416 28365 54899 92472 77787
10806G7787o2690q027O7493M4993l4968l604j7112o7860o4873J4732J8766J65
$$ 77787 15097 7070 74563 119556 84588 80984 63872 -3988 -68861 -54129 -35363 -35198
10794c5198K2328J0523k1673q7648l9410J4428L6889L0695k2645k4149j7452N1854
$$ -35198 -12870 -2347 -24020 -111668 -151078 -136650 -99761 -69066 -91711 -115860 -133312 -81458
10782h1458J7714K6063k157m6921k0344J1467n101P118J898O5077J8883r957k1153
$$ -81458 -63744 -37681 -39838 -86759 -107103 -95636 -100737 -93619 -91721 -26644 -7761 -17718 -38871
10769c8871j5109J0971l7835m1666L232K154J4717O4178L3543L689j0628l0910
$$ -38871 -53980 -43009 -80844 -122510 -119278 -117124 -102407 -38229 -4686 -997 -11625 -42535
10757d2535N032j1614p2693n538K7163L7203K0981j0416L9610K5319m1481L6031
$$ -42535 -37503 -49117 -121810 -127348 -100185 -62982 -42001 -52417 -12807 12512 -28969 7062
10745G062K5002L9566q139n4231o9650L2478J6595l3803n568k90l592O4382n264
$$ 7062 32064 71630 63491 9260 -60390 -27912 -11317 -45120 -50688 -50978 -54570 9812 4548
10732D548l4192m1127K522L5554n8013n1935K1799q389Q614q653N2153L6081N458
$$ 4548 -29644 -70771 -68249 -32695 -90708 -142643 -120844 -129233 -120619 -129272 -77119 -41038 -35580
10719c5580p662K2879L946J0089M9834j4615n0520k6559r874j8638K2131m881
$$ -35580 -43242 -20363 -16417 -6328 43506 28891 -21629 -48188 -58062 -76700 -54569 -59450
10707e9450L3585O6192K4822l7886m4192P679P7594K0822m8388k0908K5792K2851
$$ -59450 -25865 40327 65149 27263 -16929 -9250 68344 89166 40778 19870 45662 68513
10695F8513p0442o719K767L6257q949o3941l6372j5780M3009J9749L6211J9326
$$ 68513 -1929 -8648 -5881 30376 21427 -42514 -78886 -94666 -51657 -31908 4303 23629
10683B3629k4411m6302L6692j137N691l4502j1761M375p057j139j3894J5528l5774
$$ 23629 -782 -47084 -10392 -11529 -5838 -40340 -52101 -47726 -54783 -55922 -69816 -54288 -90062
10670i0062k9481j3063N7338N9256K9406J4508r134k5278l7950k487M4447N543
$$ -90062 -119543 -132606 -75268 -16012 13394 27902 18768 -6510 -44460 -46947 -2500 3043
10658C043J7958L6052m1126q917O889L0819K3146k7757L2548J4293J1868J7376
$$ 3043 21001 57053 15927 7010 13899 44718 67864 40107 72655 86948 98816 116192
10646A16192k1408n6202m7808k9809N6953k160l8423k1963j8548J3052L1297l7673
$$ 116192 94784 38582 -9226 -39035 17918 15758 -22665 -44628 -63176 -50124 -18827 -56500
10634e6500j0760M0183p530o370m3307m0286O7562L7549K2411M3871o773j6627
$$ -56500 -67260 -27077 -34607 -40977 -84284 -124570 -57008 -19459 2952 46823 40050 23423
10622B3423q591p4735j5241J8031p621J901R218K8678K9985n31m2321r466R697
$$ 23423 14832 -59903 -75144 -57113 -64734 -62833 -53615 -24937 5048 4517 -37804 -47270 -37573
10609c7573L7518j1290j5169J8963o217K2817j3064n0051P18L9548J3854P303
$$ -37573 -55 -11345 -26514 -7551 -13768 9049 -4015 -54066 -53348 -13800 54 7357
10597G357l0635P901L4633n393Q863k4366l7167j0934k1464p0j615L7672N132
$$ 7357 -23278 -15377 19256 13863 22726 -1640 -38807 -49741 -71205 -71275 -72890 -35218 -30086
10584c0086L8117j9602J6524L1097j4163j3202q527L1308r582j1995L574M662
$$ -30086 8031 -11571 4953 36050 21887 8685 158 31466 21884 9889 13463 18125
10572A8125p8614n9533j2892n945K7377K5781O0611R147J0840N4065K7255m1625
$$ 18125 -60489 -120022 -132914 -138859 -111482 -85701 -25090 -15943 -5103 48962 76217 34592
10560C4592n9879O723M9273M8860R760l6913k6131J8066m7383l7038J487j5297
$$ 34592 -25287 -18564 30709 79569 89329 52416 26285 44351 -3032 -40070 -38583 -53880
10548e3880j362K9964L508l1895J8377N1198K955k2165j221P196O588M0694J3086
$$ -53880 -55242 -25278 -21770 -53665 -35288 15910 18865 -3300 -4521 2675 9263 49957 63043
10535F3043l9629k056K1556k220Q878K9118l5795l2695J8065r796n8775J2725
$$ 63043 23414 21358 42914 40694 49572 78690 42895 10200 28265 18469 -40306 -27581
10523b7581j153L0948K0401K8894N2698j6675n0457m8015m7008M4683O9029K3796
$$ -27581 -28734 2214 22615 51509 104207 87532 37075 -10940 -57948 -13265 55764 79560
10511G9560m7678M936k8039n723K1832l2484k4451n4235J498O2390j48r245j3208
$$ 79560 31882 36818 8779 3056 24888 -7596 -32047 -86282 -84784 -22394 -22542 -31787 -44995
10498d4995Q289K1172K0602j3318j7724O485l5255k5470J331j1096L0587N9941
$$ -44995 -36706 -15534 5068 -8250 -25974 -19489 -54744 -80214 -78883 -89979 -59392 549
10486E49L7338J5290N3152K2568m5329l2405l0059m0998p3007M229k0990J8603
$$ 549 37887 53177 106329 128897 83568 51163 21104 -19894 -92901 -88672 -109662 -91059
10474i1059M1636j585K4004M888l4498J1191L881j618J7898M1766J7789l4555
$$ -91059 -49423 -51008 -27004 -22116 -56614 -45423 -41542 -43160 -25262 16504 34293 -262
10462b62n1619q140m208j8470j9407K9952J0269k0634O9780N0809L7775K7425
$$ -262 -51881 -60021 -64229 -82699 -102106 -72154 -61885 -82519 -12739 38070 75845 103270
10450A03270L49p7787l8516j9917k3334J4457L0748L0202N640m0465m2304k0711
$$ 103270 103619 25832 -12684 -32601 -55935 -41478 -10730 19472 25112 -15353 -57657 -78368
10438g8368N29K1424J8371O3240K0023j3792k4152j4237J4255n93K9103J0880
$$ -78368 -77839 -56415 -38044 25196 45219 31427 7275 -6962 7293 6700 35803 46683
10426D6683k2647j9934l8578J2867O7348L0994K7017k1702j7123L3063j2828o1124
$$ 46683 24036 4102 -34476 -21609 45739 76733 103750 82048 64925 97988 85160 24036
10414B4036R043L8443m6345k6971k0408O612N0131l682P908p391j536j8994n1707
$$ 24036 33079 71522 25177 -1794 -22202 -15590 34541 30859 38767 31376 29840 10846 -40861
10401d0861q6M1232m3577J4670M4705k4223K7209Q885j9723k846k9834j3233K1720
$$ -40861 -40947 285 -43292 -28622 16083 -8140 19069 27954 8231 5385 -24449 -37682 -15962
10388a5962N806J1932K3274n174l8538O43j8265L3692J8879O671k9538k4950l8202
$$ -15962 -10156 1776 25050 19876 -18662 -18019 -36284 -2592 16287 22958 -6580 -31530 -69732
10375f9732K530L0889k1238j9468J5502k4283J8339M5547p990N948O6054J5265
$$ -69732 -67202 -36313 -57551 -77019 -61517 -85800 -67461 -21914 -29904 -23956 42098 57363
10363E7363k5183J7974R679k1940l7873j5287K7239K1601r1975j4037O72Q73r862
$$ 57363 32180 50154 59833 37893 20 -15267 11972 33573 -58402 -72439 -71767 -70894 -80756
10350h0756O59k5440O890M5149N283m675N438J315L4799N4470k4312l0929k175
$$ -80756 -80097 -105537 -98647 -53498 -48215 -52890 -47452 -46137 -11338 43132 18820 -12109 -14284
10337a4284j0222J5829M3512M241k7969k1637k2951j7179o167M79j8903L1884
$$ -14284 -24506 -8677 34835 39076 11107 -10530 -33481 -50660 -56827 -56348 -75251 -43367
10325d3367k3574K0027M9634M4977N3571l4611n9271k6252J0001Q928m122l456
$$ -43367 -66941 -46914 2720 47697 101268 66657 7386 -18866 -8865 63 -4059 -7515
10313g515o715n745j2881P390m2868k1093N427M6990M655j3466J4226n680J049
$$ -7515 -14230 -19975 -32856 -25466 -68334 -89427 -84000 -37010 -32355 -45821 -31595 -37275 -36226
10300c6226J6416n235O428J3472o203N2704L3078K793K0251o7054p2253j664J7883
$$ -36226 -19810 -25045 -18617 -5145 -11348 41356 74434 77227 97478 30424 -41829 -43493 -25610
10287b5610N4127P191j4655J0861m4896j6863p051J8677N3058j0164J0731j1405
$$ -25610 28517 35708 21053 31914 -12982 -29845 -36896 -18219 34839 24675 35406 24001
10275B4001K8589j8292Q71K2801k3012k5771j22K8801j5532r2031j5238K9803
$$ 24001 52590 34298 35169 57970 34958 9187 9065 37866 22334 -69697 -84935 -55132
10263e5132J8595J6420O3842L130j8807l3332K4667K204q233K0050K0177J5639
$$ -55132 -36537 -20117 43725 46855 28048 -5284 19383 21587 13354 33404 53581 69220
10251F9220K2858l5185l5553R64M624M5446m3807j6006L4050k5559j9059m8798
$$ 69220 92078 56893 21340 22304 26928 72374 28567 12561 46611 21052 1993 -46805
10239d6805j5336J1834K962j4044K5715k1514M1351r292r591O493L3891p7270
$$ -46805 -62141 -50307 -47345 -61389 -35674 -57188 -15837 -25129 -34720 -28227 5664 -71606
10227g1606K1131L6342k8215k2299K146L281k3795K1776K0931J4232K0485L082
$$ -71606 -50475 -14133 -42348 -64647 -62501 -59220 -83015 -61239 -40308 -26076 -5591 -2509
10215b509l0546j0933k1185K5944k1269M683L0427J6511L2946M454o686k8874
$$ -2509 -33055 -43988 -65173 -39229 -60498 -55815 -25388 -8877 24069 28523 21837 -7037
10203g037k5945j6133R484J8712P347J0544J0616q854J4238K6168L4492k4684
$$ -7037 -32982 -49115 -39631 -20919 -13572 -3028 7588 -1266 12972 39140 73632 48948
10191D8948k8425l2149p67j0971r251J4604K9426n393L093N5713J596o2744R484
$$ 48948 20523 -11626 -12393 -23364 -32615 -18011 11415 6022 9115 64828 66424 3680 13164
10178A3164K6013k7002o5587j4001K2911M438n0545l4947N8124N2980l1891o3986
$$ 13164 39177 12175 -53412 -67413 -44502 -40064 -90609 -125556 -67432 -14452 -46343 -110329
10166a10329K0267M7644J9560M0752r929O5304M8738l1803o9081k2919K014Q133
$$ -110329 -90062 -42418 -22858 17894 7965 73269 122007 90204 21123 -1796 218 8351
10154H351L4664Q893R447l2270k688j8310p550q940r703K2517k9563K1027O456
$$ 8351 43015 51908 61355 29085 26397 8087 537 -8403 -18106 4411 -25152 -4125 2331
10141B331J3013L3143J8964O07k5551n1091k0613q163J5021j587J5259N3057N2032
$$ 2331 15344 48487 67451 68058 42507 -8584 -29197 -37360 -22339 -23926 -8667 44390 96422
10128I6422J974j8794l7241l7692j6425K7390N0448n9647l0920Q353j7681j55
$$ 96422 98396 79602 42361 4669 -11756 15634 66082 6435 -24485 -16132 -33813 -33968
10116c3968L3191m2429L5486O1564K7567l211k8993k2147n6334m361L6838P456
$$ -33968 -777 -43206 -7720 53844 81411 78200 49207 27060 -29274 -33635 3203 10659
10104A0659J6621k1028n2507k4705r815M6442L8977J6415M4134J7993L0757j552
$$ 10659 27280 6252 -46255 -70960 -80775 -34333 4644 21059 65193 83186 113943 112391
10092A12391j8700l4234l0956n1773j1004q3816K2500O6123O9035j9209j8857
$$ 112391 93691 59457 28501 -23272 -34276 -118092 -95592 -29469 39566 20357 1500
10081A500J3925L5871L1486o2856k3319K0785j9631k3913J8315l2493n573K79
$$ 1500 15425 51296 82782 19926 -3393 17392 -2239 -26152 -7837 -40330 -45903 -45624
10069d5624k259O0634P9484K1955q120j7805j0864K0217n530l2768j9927m1198
$$ -45624 -47883 12751 92235 114190 106070 88265 77401 97618 92088 59320 39393 -1805
10057a805j6901o87J3413J7627L9884j0035J9163l447m8772n9758K1622L4732
$$ -1805 -18706 -19393 -5980 11647 51531 41496 60659 57212 8440 -51318 -29696 5036
10045E036K2055J5773q212j7390k208r818K53J4791M5645l527o5958m0519L5150
$$ 5036 27091 42864 34652 17262 15054 5236 5489 20280 65925 62398 -3560 -44079 -8929
10032h929N2259o6563K05M6018J143n3407j7715L3480O4486j932m8712j3844J1405
$$ -8929 43330 -23233 -23028 22990 24133 -29274 -46989 -13509 50977 49045 333 -13511 -2106
10019b106N6609j6353p2823M0428L6046L0787n9466k1102k7450p255N553o608
$$ -2106 54503 38150 -34673 5755 41801 72588 13122 -7980 -35430 -42685 -37132 -43740
10007d3740L5457M1793N586k1464l6620p0467O084K1316N328R0080M4656n692
$$ -43740 -8283 33510 39096 17632 -18988 -89455 -83371 -62055 -56727 33353 78009 72317
9995G2317p982m3733n4138M380Q482j5870Q268L5292k838k2196l0549k8509L8943
$$ 72317 64335 20602 -33536 -29156 -20674 -36544 -28276 7016 4178 -18018 -48567 -77076 -38133
9982c8133p755n636M8927L4730l8960n0956n4784J055K8852K3799j5468L4241
$$ -38133 -45888 -51524 -2597 32133 -6827 -57783 -112567 -111512 -82660 -58861 -74329 -40088
9970d0088Q6856M1309K7270o2150p119K2638K3896K748j0835J9246o2098Q90j5241
$$ -40088 46768 88077 115347 53197 46078 68716 92612 95360 84525 103771 41673 42563 27322
9957B7322l215k8032k0959l2418J6749L194q207J2054k8533n325l615K6506j856
$$ 27322 24107 -3925 -24884 -57302 -40553 -37359 -45566 -33512 -62045 -67370 -70985 -44479 -46335
9944d6335R47q558l714m727R551M390j0106q996M0195K7357n14M1646k2113p706
$$ -46335 -45388 -53946 -57660 -62387 -52836 -48446 -58552 -67548 -27353 4 -510 41136 19023 11317
9930A1317j5873l6733k4449K173j8719j5346J9137J1450N6930K8161q833l1923
$$ 11317 -4556 -41289 -65738 -63565 -82284 -97630 -78493 -67043 -10113 18048 9215 -22708
9918b2708l9715j2730J726J9615J3925K2888M302J5951j297j0316n604k8232j1724
$$ -22708 -62423 -75153 -73427 -53812 -39887 -16999 -12697 3254 1957 -8359 -13963 -42195 -53919
9905e3919j301m460k098m302m7613J9908K4236N2418P3727r020l5397j0567j9827
$$ -53919 -55220 -59680 -61778 -66080 -113693 -93785 -69549 -17131 56596 47576 12179 1612 -18215
9892a8215K232J072n0590o400J0476P501N4290L0112N5939n3461n919l0567J306
$$ -18215 -15983 -14911 -65501 -71901 -61425 -53924 366 30478 86417 32956 27037 -3530 -2224
9879b224M1384P869k7535m4408J2845K2350k3103R237M5141j7152k2436p88K4520
$$ -2224 39160 47029 19494 -24914 -12069 10281 -12822 -3585 41556 24404 1968 1180 25700
9866B5700J0863j0648k0140j8535K9148L7383M6703o903j339l0182n4050j1198
$$ 25700 36563 25915 5775 -12760 16388 53771 100474 93571 92232 62050 8000 -3198
9854c198P2437M8936l1633L9135m7453m5345l2119k1815q903R351J6322k436J3
$$ -3198 69239 118175 86542 125677 78224 32879 760 -21055 -29958 -20607 -4285 -6721 -6708
9841f708J2957L3869K0546l5226k3329k6793j1838L891J0502l8467M8448L1817
$$ -6708 6249 40118 60664 25438 2109 -24684 -36522 -32631 -22129 -60596 -12148 19669
9829A9669m4701j9088K1236j4695J522p969k9686j5176J7277L5432P690Q688o6782
$$ 19669 -25032 -44120 -22884 -37579 -36057 -44026 -73712 -88888 -71611 -36179 -28489 -19801 -86583
9816h6583k4429K8836K6575K0044J4849N995k2420j6539k1692K8568L3348N8717
$$ -86583 -111012 -82176 -55601 -35557 -20708 -14713 -37133 -53672 -75364 -46796 -13448 45269
9804D5269l29l6042l3372O479m077k9086l514J8641J9554o560p118K7723J4024
$$ 45269 44940 8898 -24474 -17995 -22072 -51158 -54672 -36031 -16477 -23037 -30155 -2432 11592
9791A1592L688j4895K1389N00m6057M486J2217k3386l5592J0847J9585l6263j8825
$$ 11592 15280 385 21774 22274 -23783 -19297 -7080 -30466 -66058 -55211 -35626 -71889 -90714
9778i0714L1816K2080j7505p033K9141P181n25L1233J0539k572j7620J7162l6753
$$ -90714 -58898 -36818 -54323 -61356 -32215 -25034 -25559 5674 16213 13641 -3979 13183 -23570
9765b3570l9266l2243q275n269K1502N197n050N000J7626M728J4444O060n1775
$$ -23570 -62836 -95079 -103354 -108623 -87121 -81924 -86974 -81974 -64348 -59620 -45176 -39116 -90891
9752i0891K0391L3939J6218j2994J5497K0051K08J607j9455k2373j9818K9868
$$ -90891 -70500 -36561 -20343 -33337 -17840 2211 2419 4026 -15429 -37802 -57620 -27752
9740b7752L0144j0240l3811m5258j038N5500L7238k9541r583r269q77N3128O4758
$$ -27752 2392 -7848 -41659 -86917 -87955 -32455 4783 -24758 -34341 -43610 -44487 8641 73399
9727G3399j0452k2463n0047m4215k0947K8617J0027j5913j4774L2170j5758q016
$$ 73399 62947 40484 -9563 -53778 -74725 -46108 -36081 -51994 -66768 -34598 -50356 -58372
9715e8372M4553N203r35j2544j3915q178j0795k3243M7189O947Q718O779M874
$$ -58372 -13819 -8616 -9551 -22095 -36010 -44188 -54983 -78226 -31037 -24090 -15372 -8593 -3719
9702c719j1290K7721l4913r222n2657J755Q4440P2252m0009l411N1039n66n0988
$$ -3719 -15009 12712 -22201 -31423 -84080 -82325 2115 74367 34358 30947 81986 81420 30432
9689C0432n8812r309l5725j1799L4555j0560K0280O1830j3660n448k223M147k545
$$ 30432 -28380 -37689 -73414 -85213 -50658 -61218 -40938 20892 7232 1784 -439 3708 1163
9676A163k0230k8745J0075M0240m2268N5295j9850K0255L6013j8708p759Q308
$$ 1163 -19067 -47812 -37737 2503 -39765 15530 -4320 15935 51948 33240 25481 33789
9664C3789P407r12k022k108k8751k3099R403J2427J4662j002K2289m7692r506
$$ 33789 41196 40284 38262 36154 7403 -15696 -6293 6134 20796 19794 42083 -5609 -15115
9651a5115K740N5867j721k1916j3600l7968k0418L9459M5759P94m9484k130j028
$$ -15115 -12375 43492 41771 19855 6255 -31713 -52131 -12672 33087 33881 -15603 -17733 -18761
9638a8761m317K5297K4384m8352m4687j638K4637K9694O406j0751M4994K5105
$$ -18761 -23078 2219 26603 -21749 -66436 -68074 -43437 -13743 -7337 -18088 26906 52011
9626E2011J5189k5503k0040Q436k4883k5120M6609K1285r492k9909l0455l3692
$$ 52011 67200 41697 21657 30093 5210 -19910 26699 47984 38492 8583 -21872 -55564
9614e5564L6446K8629M4539K0885r486m9608r076j6140N637L525j1220j2661K2796
$$ -55564 -19118 9511 54050 74935 65449 15841 6765 -9375 -3738 -213 -11433 -24094 -1298
9601a298o850Q561K38J0369J5676k5366m749q649j8041n5253j131p426L7306M0379
$$ -1298 -8148 413 651 11020 26696 1330 -3419 -12068 -30109 -85362 -86493 -93919 -56613 -16234
9587a6234k980J4295L6045L0893n6062m3182J1854L6781J7847j9382p661L0166
$$ -16234 -19214 -4919 31126 62019 5957 -37225 -25371 11410 29257 9875 2214 32380
9575C2380j8711k8669J7974j6254L0296L4846k8057n7728k6021m8375k2448M4510
$$ 32380 13669 -15000 2974 -13280 17016 51862 23805 -33923 -59944 -108319 -130767 -86257
9563h6257O3647O6803J7327J6265r386M447k618j7357j1470J829J1676q202p4385
$$ -86257 -22610 44193 61520 77785 68399 72846 70228 52871 41401 43230 54906 46704 -27681
9550b7681n122J4645j457N750K5487o036o5879K1184P2074k8395q5456J0678P8210
$$ -27681 -32803 -18158 -19615 -13865 11622 5586 -60293 -39109 32965 4570 -80886 -70208 8002
9537H002K0159p246l2584K2043m1991J9985J9180p5682l3206J9011M0681L9200
$$ 8002 28161 20915 -11669 10374 -31617 -11632 7548 -68134 -101340 -82329 -41648 -2448
9525b448N3724l4672k0072K1253K7363k4923M243j0967J8339k132q906P109m5733
$$ -2448 51276 16604 -3468 17785 45148 20225 24468 13501 31840 29708 20802 27911 -17822
9512a7822L7986Q624o527m2083j9870O248L4172j7489l0934K757O0178L3349K872
$$ -17822 20164 28788 22261 -19822 -39692 -33444 728 -16761 -47695 -44938 15240 48589 51461
9499E1461n5654j4495L8781J0197P297K448R510o388m3015j1854Q788j904K905
$$ 51461 -4193 -18688 20093 30290 37587 40035 49545 43157 142 -11712 -2924 -4828 -1923
9486a923j0085J0992j030j6420q1423k7019L6771N1269L7042j714m7836l7961
$$ -1923 -12008 -1016 -2046 -18466 -99889 -126908 -90137 -38868 -1826 -3540 -51376 -89337
9474h9337M3777K2710Q903L5598l6726K0964J3322K2543j3386L3236O325K643
$$ -89337 -45560 -22850 -13947 21651 -15075 5889 19211 41754 28368 61604 67929 70572
9462G0572l3867n157J8113l3233j0617J1595K2708r119Q226N0100J0834n3680
$$ 70572 36705 31548 49661 16428 5811 17406 40114 30995 39221 89321 100155 46475
9450D6475l3534l130j3476M5797K3868k1438L9665l3287k0964r605p151j0998
$$ 46475 12941 9811 -3665 42132 66000 44562 84227 50940 29976 20371 13220 2222
9438B222N3925q236l9280J7707k0621k96l848r0J8752q055k0502m9021R582N1560
$$ 2222 56147 47911 8631 26338 5717 5421 1573 1483 20235 12180 -8322 -57343 -47761 3799
9424C799k5423j5493O1120L1110o2874k6846Q9961L5528k6075n5792j811Q317
$$ 3799 -21624 -37117 24003 55113 -7761 -34607 55354 90882 64807 9015 7204 15521
9412A5521n0153k5576L133K8044m787J5123q530M3001R633k0758M0444L15J3259
$$ 15521 -34632 -60208 -57075 -29031 -33818 -18695 -27225 15776 25409 4651 45095 45410 58669
9399E8669O511p2628l4162P786L3382M5542k2035l8865N921K2621O0362M4811
$$ 58669 65180 -7448 -41610 -33824 -442 45100 23065 -15800 -9879 12742 73104 117915
9387A17915j2094m5357n1220Q139J9611n5642n758O304N304L3989K8351L8026
$$ 117915 105821 60464 9244 17383 36994 -18648 -24406 -18102 -12798 21191 49542 87568
9375H7568l9392l2152K4518Q719m2183J551k703L1238q086j0068J3893L3281m3918
$$ 87568 48176 16024 40542 49261 7078 8629 5926 37164 29078 19010 32903 66184 22266
9362B2266N459P687q363m844j3071J6412m9505N921N2546j6828N967n190o196
$$ 22266 27725 35412 27049 22205 9134 25546 -23959 -18038 34508 17680 23647 18457 12261
9349A2261K297M0194j2871j6995j3374l149K2808o670q427M9505L5484j92m9535
$$ 12261 14558 54752 41881 24886 11512 8363 31171 24501 16074 65579 101063 100871 51336
9336E1336l9778l2010k606L9058r466J6035L9433O928j9750j6201j8901l6263
$$ 51336 11558 -20452 -23058 16000 6534 22569 62002 68930 49180 32979 14078 -22185
9324b2185n466j0516J6626L0927K2069K2279l1065n5183K4573J7799N8000l57
$$ -22185 -27651 -38167 -21541 9386 31455 53734 22669 -32514 -7941 9858 67858 67501
9312F7501o5178j4329q253L9106R030N459j1537L440J30J0755n411L7073J6759
$$ 67501 2323 -12006 -20259 18847 27877 33336 21799 25239 25369 36124 30713 67786 84545
9299H4545j4060l4463j0172K5531j579M2586m160o1833m1307j1283P325R5693
$$ 84545 70485 36022 25850 51381 49802 92388 88228 26395 -14912 -26195 -18870 76823
9287G6823M0582k9932o2041N0808J2141n6753O867P801K6693p418k1171L815n45
$$ 76823 117405 87473 25432 76240 88381 31628 38495 46296 72989 65571 44400 48215 47670
9274D7670j4356m1238k0368K5292J4784N1035J6398k5390Q917N4214k4311l3036
$$ 47670 33314 -7924 -28292 -3000 11784 62819 79217 53827 62744 116958 92647 59611
9262E9611O42q588J187J4159q742R200l566j0019K9525M7468k5037l996j7685
$$ 59611 60253 51665 52852 67011 58269 67469 63903 53884 83409 130877 105840 101844 84159
9249H4159l0370J2055l4073m361J0192k5296J5233K4914j5197j2207k357l1794
$$ 84159 53789 65844 31771 27410 37602 12306 27539 52453 37256 25049 22692 -9102
9237i102j4028M3805P1801L6389m160j160Q531L760M735J9815o409o6052N521
$$ -9102 -23130 20675 92476 128865 124705 123545 132076 135836 140571 160386 153977 87925 93446
9224I3446M7619K2172p235k7628m4366J3242N8969J408k8695O4290L8189J3576
$$ 93446 141065 163237 156002 128374 84008 97250 156219 157627 128932 193222 231411 244987
9212B44987K7347K7884r217k2518L202J8121Q1455Q1864Q202L713K0206O2028
$$ 244987 272334 300218 291001 268483 271685 289806 371261 453125 461327 465040 485246 547274
9200E47274R9220J20374J22405J47094J20731J55625J51618J07678J38145J08248
$$ 547274 646494 766868 889273 1036367 1157098 1312723 1464341 1572019 1710164 1818412
9190A818412M9537o3665p4346j37591j89987j78129j58214j47721q1934p1759
$$ 1818412 1867949 1804284 1729938 1592347 1402360 1224231 1066017 918296 836362 764603
9180G64603q0769p7836m2139j2116J203k5305m6368J022l5446j8244j2755n8936
$$ 764603 683834 605998 563859 551743 552946 527641 481273 482295 446849 428605 415850 356914
9168C56914o0034l5237k2919J7917N2321m760k1507K014n1507l9355L6399J9458
$$ 356914 296880 261643 238724 256641 308962 304202 282695 284709 233202 193847 230246 249704
9156B49704J3693J3044m2573o9419p2056J4904l182L474L292M9337J2554p368
$$ 249704 263397 276441 233868 164449 92393 107297 104115 107589 110881 160218 172772 165404
9144A65404m2950p715j5709L4701j1183q197J3871K5843M7877m385k9124n6976
$$ 165404 122454 114739 99030 133731 122548 114351 128222 154065 201942 197557 168433 111457
9132A11457K284K0865q148k0816M7430K0936n78M879l98K0391K1315j897n343
$$ 111457 113741 134606 126458 105642 153072 174008 173430 178309 177911 198302 219617 217720 212377
9119B12377K8209N1652K8613j009J0745J5833n141J981P72K1191M3072Q2737J9993
$$ 212377 240586 292238 320851 319842 330587 346420 341279 343260 344032 365223 408295 491032 511025
9106E11025P9469P8516L1897Q8122J11130N6888J35274J63509J35025J17440J17961
$$ 511025 590494 669010 700907 789029 900159 957047 1092321 1255830 1390855 1508295 1626256
9095A626256K02848L00545K97174L98627M97458O17012Q78232J108134J356006
$$ 1626256 1829104 2129649 2426823 2825450 3322908 3939920 4818152 5926286 7282292
9086G282292J820721K156092K048710J247501M2140j034174j793175k093499j967300
$$ 7282292 9103013 11259105 13307815 14555316 14597456 13563282 11770107 9676608 7709308
9077G709308j517688j087790q10762n77723m56331l26939k25666j91708j54260
$$ 7709308 6191620 5103830 4293068 3715345 3259014 2932075 2706409 2514701 2360441
9068B360441j71165j86650j22562j22796j65198j23717j08698j16820r8198n7657
$$ 2360441 2189276 2002626 1880064 1757268 1592070 1468353 1359655 1242835 1144637 1086980
9058A086980p6680p5882j7684l1463o2053o256k3836l7662m0142M738j4495m5068
$$ 1086980 1010300 934418 916734 885271 823218 816962 793126 755464 715322 720060 705565 660497
9046F60497l2997o5156q104L1352K5821j5497p2015m2966J2182m4745o9783o1920
$$ 660497 627500 562344 554240 585592 611413 595916 523901 480935 493117 448372 378589 316669
9034C16669q798J597p343l5879j7363K6555M3281J2549m0707j3362l4595o301
$$ 316669 307871 309468 302125 266246 248883 275438 318719 331268 290561 277199 242604 236303
9022B36303j6933k7069M6477M1907L895j0891j11805p0643k565K0945J7166j6750
$$ 236303 219370 192301 238778 280685 284580 273689 161884 91241 88676 109621 126787 110037
9010A10037r88m3310K7542O7522N4104R131n9260J6888P68j0290J0136k7381l6777
$$ 110037 109049 65739 93281 160803 214907 224038 164778 181666 182434 172144 182280 154899 118122
8997A18122P5516O9611n0424J3707N9336M0212K5717k6041o8192k2420l8051m2498
$$ 118122 193638 263249 212825 226532 285868 326080 351797 325756 257564 235144 197093 154595
8985A54595k5984M9034K6304l0093p865M4600P6494j4483J6738K2147o631l56
$$ 154595 128611 177645 203949 173856 165991 210591 287085 272602 289340 311487 304856 304500
8973C04500o089p991j6021N1822L2907m2198j2749m7666n4213j2855L9696j6710
$$ 304500 298411 290420 274399 326221 359128 316930 304181 256515 202302 189447 229143 212433
8961B12433o3811k2578L9398L7573l7468n885M1890J0101j1245r29P1349L2546
$$ 212433 148622 126044 165442 203015 165547 159662 201552 211653 200408 199479 270828 303374
8949C03374l6400M5050N0463P596p634m1562o300R308j1087J1022j7341m2188
$$ 303374 266974 312024 362487 370083 362449 320887 314587 323895 312808 323830 306489 264301
8937B64301N638m583l7932J6989J11470M2276j427P380K8985J2193q970N4130
$$ 264301 269939 265356 227424 244413 355883 398159 396732 404112 433097 445290 436320 490450
8925D90450N9175R6235M1907J0908K5656L7835r824J9241L3055j5682n2221m38
$$ 490450 549625 645860 687767 698675 724331 762166 752342 771583 804638 788956 736735 736297
8913G36297j2018j6249j6937k2622k8316j7648J6098m154L005N594K3342Q4685
$$ 736297 724279 708030 691093 668471 640155 622507 638605 634451 637456 643050 666392 751077
8901G51077N8739K9503K4491K8075P8363r6m7443l3297J4076K1400P9622L4012
$$ 751077 809816 839319 863810 891885 970248 970152 922709 889412 903488 924888 1004510 1038522
8889A038522k3935N1738K4291M9996O4375M2028M3382O6402M9973j1103J1165
$$ 1038522 1014587 1066325 1090616 1140612 1204987 1247015 1290397 1356799 1406772 1395669 1406834
8878A406834L7720j8852J8437O0750P4412O6294M4787N8348J96805J31354M3262
$$ 1406834 1444554 1425702 1444139 1504889 1579301 1645595 1690382 1748730 1945535 2076889 2120151
8867B120151m9454p5717p2734j8082O826l0945k2470P749l263l8363Q331L9151
$$ 2120151 2070697 1994980 1922246 1904164 1910990 1880045 1857575 1865324 1862061 1823698 1832029 1871180
8855A871180Q6689P7791M8181M0313J5821O0846P9868L197o72K747J07543J04988
$$ 1871180 1957869 2035660 2083841 2124154 2139975 2200821 2280689 2283886 2283214 2285961 2393504 2498492
8843B498492J23293J20997K8440Q7820Q0742J34378J46625J60709J32308J73670
$$ 2498492 2621785 2742782 2771222 2859042 2939784 3074162 3220787 3381496 3513804 3687474
8833C687474K64275L26399L86869L93988L72138M07614M67423N30455N65201O82257
$$ 3687474 3951749 4278148 4665017 5059005 5431143 5838757 6306180 6836635 7401836 8084093
8823H084093P22435P52758Q82049R90177J124119J163214J252764J298774J478412
$$ 8084093 8806528 9559286 10441335 11431512 12555631 13718845 14971609 16270383 17748795
8814A7748795J705467K050751K414480K833602L203678L771428M474160N211072
$$ 17748795 19454262 21505013 23919493 26753095 29956773 33728201 38202361 43413433
8806D3413433N981699O806339P779108R029603J0862228J3573788J7600734K3436260
$$ 43413433 49395132 56201471 63980579 73010182 83872410 97446198 115046932 138483192
8798A38483192L1539953M2607236N6329219O8600669O7651359M3105228M640196
$$ 138483192 170023145 212630381 268959600 337560269 405211628 448316856 452957052
8791D52957052l1646655n8497305o9110676o1850120m6865954l3408380k3726919
$$ 452957052 421310397 362813092 293702416 231852296 184986342 151577962 127851043
8784A27851043j7029990j2344911r102928o913516n435359m480844l937659m071989
$$ 127851043 110821053 98476142 89373214 82459698 77024339 72543495 68605836 64533847
8776F4533847m573945m918436m844399m546535m165670l743991l326941k989358
$$ 64533847 59959902 55041466 50197067 45650532 41484862 37740871 34413930 31424572
8768C1424572k684828k369599k140405j858967j662702j526645j401188j251193
$$ 31424572 28739744 26370145 24229740 22370773 20708071 19181426 17780238 16529045
8760A6529045j155584j027519r45478q55202p66938o57769o55138n80237n45109
$$ 16529045 15373461 14345942 13400464 12545262 11778324 11120555 10465417 9885180 9340071
8751I340071n09681l95948m12306m74114m21573l58825l53104l56012l00468k66385
$$ 9340071 8830390 8434442 8022136 7548022 7126449 6767624 6414520 6058508 5758040 5491655
8741E491655k63572k56144j99913k21894j81072j46288j81698k54445j79152j41661
$$ 5491655 5228083 4971939 4772026 4550132 4369060 4222772 4041074 3786629 3607477 3465816
8731C465816j63544j51641j39628j50050j59371j21015p6177r3879j38407j30636
$$ 3465816 3302272 3150631 3011003 2860953 2701582 2580567 2504390 2410511 2272104 2141468
8721B141468o5966o1795n3685p1919o9316l4417m8737q5174q6362m304R105o4518
$$ 2141468 2075502 2013707 1960022 1888103 1818787 1784370 1735633 1650459 1564097 1559793 1568898 1504380
8709A504380m4545l1064o0365m9954o0039l1994J4814k4931l3310l8120j8026
$$ 1504380 1459835 1428771 1368406 1318452 1258413 1226419 1241233 1216302 1182992 1144872 1126846
8698A126846k1526j7917j2934P515k56m2736l4053o6450k3980j0140P919k853
$$ 1126846 1105320 1087403 1074469 1081984 1081728 1038992 1004939 938489 914509 904369 912288 909435
8686I09435k9510J9000J724K7341M1014J2109n321o583L4969J003K3571M2792
$$ 909435 879925 898925 900649 927990 969004 981113 975792 969209 1004178 1005181 1028752 1071544
8674A071544r566j2207M6051k8529m8000L13l6173j3823J9767j0271l8187n3452
$$ 1071544 1061978 1049771 1095822 1067293 1019293 1019606 983433 969610 989377 979106 940919 887467
8662H87467M644L5672n0471k0616l410n5378j2700l177K0366M6901m6102n3903
$$ 887467 892111 927783 877312 856696 853286 797908 785208 782031 802397 849298 803196 749293
8650G49293N4388J9461m518j1157J8071N46M7700R536l166m6717n9350l590K3063
$$ 749293 803681 823142 818624 807467 825538 826084 873784 883320 880154 833437 774087 770497 793560
8637G93560N7230K8802N6021M8584j3389j6710j9819n680lN0368P7048Q5572O3883
$$ 793560 850790 879592 935613 984197 970808 954098 934279 928599 928596 978964 1056012 1141584 1205467
8624A205467P4671L5729n6285l4001n8552m5793p3741r583j4673j6956P3k8814
$$ 1205467 1280138 1315867 1259582 1225581 1167029 1121236 1047495 1037912 1023239 1006283 1006356 977542
8612I77542k2296J484l8734l7868m7052K0339J4910k2031J0570p082j8966o4770
$$ 977542 955246 956730 917996 880128 833076 853415 868325 846294 856864 849782 830816 766046
8600G66046l9448L5789l5135n9774o6490k3093J0534K3843L0105q8626m9000l501
$$ 766046 726598 762387 727252 667478 600988 577895 588429 612272 642377 553751 504751 501250
8588E01250K496j281l642J9858L1435l589k1189j6912K2869M687r158j5337j2119
$$ 501250 503746 502465 498823 518681 550116 546527 525338 508426 531295 535982 526824 511487 499368
8575D99368J1217k8244j0968Q395j058l7405k0376j3161o065l1023Q68l1292J8348
$$ 499368 510585 482341 471373 479768 478710 441305 420929 407768 401703 370680 371548 340256 358604
8562C58604j3164j759k2966l9507R192j2179l1263r836K1565O193l0023j5655
$$ 358604 345440 343681 320715 281208 290400 278221 246958 237122 258687 264880 234857 219202
8550B19202k3903L422L7292M0993O7173p461l8395k3972l6040l4822M3546J3420
$$ 219202 195299 198721 236013 277006 344179 336718 298323 274351 238311 203489 247035 260455
8538B60455j2369l1812K7645k4987m4009j0020O695l2151l5683J8581N0455N9495
$$ 260455 248086 216274 243919 218932 174923 164903 171598 139447 103764 122345 172800 232295
8526B32295K4189J6801N0324J6928k750m7789l7370q258K1239m966k8970l3456
$$ 232295 256484 273285 323609 340537 337787 289998 252628 244370 265609 260643 231673 198217
8514A98217K096k4251K8043M6733J177Q354p934P2663n38k5900m9568o2691n338
$$ 198217 200313 176062 204105 250838 252015 260369 252435 325098 324560 298660 249092 186401 181063
8501A81063o756m623O79m0971L5888j3891j3051j093Q031l8340k4543K0584j6621
$$ 181063 174307 169684 170363 129392 165280 151389 138338 137245 145276 106936 82393 102977 86356
8488H6356k4217l3838j5642N5320P1600M3391P3727P637j4690M0521M518p5534
$$ 86356 62139 28301 12659 67979 139579 182970 256697 264334 249644 290165 294683 219149
8476B19149k8898l2978l470K207JN2269O808k760k5078l9614m522O7712M0710
$$ 219149 190251 157273 153803 156010 156011 208280 215088 212328 187250 147636 143114 210826 251536
8463B51536m1357r453K1977l6325m6676M4160J8992l0083l6690l5807r292Q7134
$$ 251536 210179 200726 222703 186378 139702 183862 202854 172771 136081 100274 90982 178116
8451A78116J6620J7840j9414j9752J6724l8357K761o2015m8408J6514O2778J3921
$$ 178116 194736 212576 193162 173410 190134 151777 154538 92523 44115 60629 123407 137328
8439A37328M3072J311J624M977J527l7609K2396L3738l5480m1368O5626K0162
$$ 137328 180400 181711 183335 188312 189839 152230 174626 208364 172884 131516 197142 217304
8427B17304j0385j0175l6546M475P269J8724l1573k2247J2734L9631N703K7551
$$ 217304 206919 196744 160198 164673 171942 190666 159093 136846 149580 189211 194914 222465
8415B22465M0044j1422q0431N68K2461N5973M1104J4122J5479N5975L2934Q348
$$ 222465 262509 251087 170656 171224 193685 249658 290762 304884 320363 376338 409272 417620
8403D17620L6255L1065N195P1450Q8290R5340R5740J00542P5225J11281J91014
$$ 417620 453875 484940 490135 561585 649875 745215 840955 941497 1016722 1128003 1319017
8392A319017K00852J53341J15397N9519k0599l8787q4011j57771j86094j93771
$$ 1319017 1519869 1673210 1788607 1848126 1827527 1788740 1704729 1546958 1360864 1167093
8382A167093j55517p1689r3415r1525j05320o3865l0115o8489n8338m5602j8658
$$ 1167093 1011576 939887 846472 754947 649627 585762 555647 487158 428820 383218 364560
8371C64560K230l4526J5877J8337k5226o6056k5235k6149q532J5902J4009J9554
$$ 364560 366790 332264 348141 366478 341252 275196 249961 223812 215280 231182 245191 264745
8359B64745j5504n3081q9061l5485J7766J3569K6529L7081J0128j9539j7439k3044
$$ 264745 249241 196160 107099 71614 89380 102949 129478 166559 176687 157148 139709 116665
8347A16665K5350K2017K0489M4768n369m6720M027L4331k9914K4516j9579k4609
$$ 116665 142015 164032 184521 229289 223920 177200 181227 215558 185644 210160 190581 165972
8335A65972P240l782M0205J3401p892K1701l9947o2596m8295m6226M6529J5847
$$ 165972 173212 169430 209635 223036 215144 236845 196898 134302 86007 39781 86310 102157
8323A02157k6392k3118L3516L1200J329l910J6504k5177L518L0553M0771k067
$$ 102157 75765 52647 86163 117363 118692 114782 131286 106109 109627 140180 180951 178884
8311A78884K238k2135j2717J7758k2931j6335L8803M9151m6073k9261m6309K7418
$$ 178884 181122 158987 146270 164028 141097 124762 163565 212716 166643 137382 91073 118491
8299A18491q232k6077k6221j4588K1239R375j1855k811p409r668M095Q139J4925
$$ 118491 110259 84182 57961 43373 64612 73987 62132 59321 51912 42244 46339 54478 69403
8286F9403L244L2030K0051L5378q237J5512k9729m5685l6308N1290L4070l1775
$$ 69403 72647 104677 124728 160106 151869 167381 137652 91967 55659 106949 141019 109244
8274A09244l9899m2203K1701M3795j4394j3025m1218J7858K0313j4704K7632O28
$$ 109244 69345 27142 48843 92638 78244 65219 24001 41859 62172 47468 75100 75728
8262G5728j0923k0613l3488r032L9423j3380k6544L2333K8599L3512J4580o643
$$ 75728 64805 44192 10704 1672 41095 27715 1171 33504 62103 95615 110195 103552
8250A03552j5539M5044k598j2611j5179J4564L6893n3858l4706J9607o910J725
$$ 103552 88013 133057 130459 117848 102669 117233 154126 100268 65562 85169 78259 79984
8238G9984l691k8300L0233J6298m7944J7473M2659L3995l165n821J2526k228J9749
$$ 79984 76293 47993 78226 94524 46580 64053 106712 140707 137542 131721 144247 142019 161768
8225A61768k0346L821J8406K1685m5168n7313p094L3536P68j6732l0734k8419
$$ 161768 141422 145243 163649 185334 140166 82853 75759 109295 110063 93331 62597 34178
8213C4178j7459J1836l4233l960Q200n690M2542p752R380L2852p305j0939l3560
$$ 34178 16719 28555 -5678 -9638 -1438 -7128 35414 27662 37042 69894 62589 51650 18090
8200A8090J2722L9010j5639L9064K4099k6696M035k1018k2658j3688K8100k3492
$$ 18090 30812 69822 54183 93247 117346 90650 94685 73667 51009 37321 65421 41929
8188D1929l7634l3590L4009M0126R156P171L7609r702K3478l70J4033j572l8992
$$ 41929 4295 -29295 4714 44840 53996 61167 98776 89074 112552 112182 126215 124643 85651
8175H5651k0981k2554k7879k0846K4261K0553P382K9393M507J9924O7683j7345
$$ 85651 64670 42116 14237 -6609 17652 38205 45587 74980 79487 99411 167094 149749
8163A49749p0706O576P8462J3530j3230j8842J1696P955j0289l6756k9207n8929
$$ 149749 79043 85619 164081 177611 164381 145539 157235 165190 154901 118145 88938 30009
8151C0009J7022p287J8879L1898L3995M2168k9574q4462l1972l2673P942P6404
$$ 30009 47031 39744 58623 90521 124516 166684 137110 52648 20676 -11997 -4055 72349
8139G2349l609k2320K5037m8660j39q785L715N3614J6768l76N9783j8606n2651
$$ 72349 68740 46420 71457 22797 22658 13873 17588 71202 87970 87594 147377 128771 76120
8126G6120L5306M3092o244J4704L4413L5621j0493P771j3629J239r496n5156l8319
$$ 76120 111426 154518 148274 162978 197391 233012 222519 230290 216661 217900 208404 153248 114929
8113A14929M2460k9184n6909l9023K6518O80m0167J5434K214J8593k1993m2492
$$ 114929 157389 128205 71296 32273 58791 59471 19304 34738 36952 55545 33552 -8940
8101h940m5392J1086J7650M4950K5306k3544k1505j7285O7230P8957J3782k7524
$$ -8940 -54332 -43246 -25596 19354 44660 21116 -389 -17674 49556 128513 142295 114771
8089A14771m0877j739K1308o95k8678K2151K3371L4441n2712j4599P827L6247
$$ 114771 73894 72155 93463 92768 64090 86241 109612 144053 91341 76742 84569 120816
8077A20816j8460k6997m5322P242k2422j2201L5221O584L0287j9626N3434l446
$$ 120816 102356 75359 30037 37279 14857 2656 37877 44461 74748 55122 108556 105110
8065A05110k5763m2402M1292J2604J4804J9286J7730L776R516M4844L924L6632
$$ 105110 79347 36945 78237 90841 105645 124931 142661 146437 155953 200797 204721 241353
8053B41353J616k0482L346k4608L552N275k0348m772p606K1532L0867J2140K6261
$$ 241353 242969 222487 225833 201225 204777 210052 189704 184932 177326 198858 229725 241865 268126
8040B68126O4287m9901n0025j6610n290o312l0345J2131l4760j2258L1269L7789
$$ 268126 332413 282512 232487 215877 210587 204275 173930 186061 151301 139043 170312 208101
8028B08101j7428l8481L8446M6204J3665k1759k3635M7389Q567K778N545J7788
$$ 208101 190673 152192 190638 236842 250507 228748 205113 252502 261069 263847 269392 287180
8016B87180N0599J4986M51L0531N7765N8749J11334J10274K5661l0584m2767j63131
$$ 287180 337779 352765 353216 383747 441512 500261 611595 721869 747530 716946 674179 511048
8004E11048p3680j2836K0701K990J4815J2055L7352M5901K2049m387m7590j268
$$ 511048 437368 424532 445233 448223 463038 475093 512445 558346 580395 576008 528418 527150
7992E27150j04287p9642m6532m8926k2720J4948K8785l931j025N6395O551m1452
$$ 527150 422863 343221 296689 247763 225043 239991 268776 264845 263820 320215 326766 285314
7980B85314R30q055k1604k8120Q336k3525M6890P1884P1804k1207m2089K1785
$$ 285314 286244 278189 256585 228465 236801 213276 260166 332050 403854 382647 340558 362343
7968C62343M4418P7314R5745R5101M8847n0444p4492l1334m7227l5483j123N6644
$$ 362343 406761 484075 579820 674921 723768 673324 598832 567498 520271 484788 483665 540309
7956E40309N7833J5204k2568j5292k3297n2201l4601m4164n4341m3247k3920m8740
$$ 540309 598142 613346 590778 575486 552189 499988 465387 421223 366882 323635 299715 250975
7944B50975k0848j0888o8940m4706M5592j1381p5521N2036Q1433K0818j7481j8179
$$ 250975 230127 219239 150299 105593 151185 139804 64283 116319 197752 218570 201089 182910
7932A82910l0719j3620K1361J3769N1940L8156l0411L839K3082K7790n505J377
$$ 182910 152191 138571 159932 173701 225641 263797 233386 237225 260307 288097 282592 283969
7920B83969l5455r1953n486J5677J0139l9967K642J7263L157o863l6200l7509
$$ 283969 248514 156561 151075 166752 176891 136924 139566 156829 159986 153123 116923 79414
7908G9414N9410K0497o1489m9310J239k9702k5029L8396L1013k843k3684R810
$$ 79414 138824 159321 97832 48522 49761 20059 -4970 33426 64439 61596 37912 47722
7896D7722N449M494K9864L9762j035l2288m3741J2676L917l9755J3100K708p983
$$ 47722 53171 57665 87529 127291 126256 93968 50227 62903 66820 27065 40165 42873 34890
7883C4890K1007M2721K5094k507O271K0057J0462k4539M6962q349M301m7531p0602
$$ 34890 55897 98618 123712 121205 127476 147533 157995 133456 180418 172069 176370 128839 58237
7870E8237l4923J7443N0845K6557j4631o2602k5643l7556L7370L6675m5279m3962
$$ 58237 23314 40757 91602 118159 103528 40926 15283 -22273 15097 51772 6493 -37469
7858c7469R659K868J9716M7108J9687l7228M114J9179K6090M5710l4442j8740
$$ -37469 -27810 -24942 -5226 41882 61569 24341 28455 47634 73724 119434 84992 66252
7846F6252n1536k0278K6700m609L4135L1666K611J488m1908p4449o1238J0748
$$ 66252 14716 -5562 21138 16529 50664 82330 84941 86429 44521 -29928 -91166 -80418
7834h0418K7601j7805K5523N3064L8808l6471l7253J8606k158m986j2664o950
$$ -80418 -52817 -70622 -45099 7965 46773 10302 -26951 -8345 -10503 -15489 -28153 -35103
7822c5103j7803m1553M39L8753R967M5373K9046J6118j0341K0835J4387J6035
$$ -35103 -52906 -94459 -94020 -55267 -45300 73 29119 45237 34896 55731 70118 86153
7810H6153j9864l4614K5684O3096k5070l5870K1187q843k2681k9416l4150L1203
$$ 86153 66289 31675 57359 120455 95385 59515 80702 71859 49178 19762 -14388 16815
7798A6815l2143K106N6564k4502R962J2452M962k6842k196P634j4124m2468p4227
$$ 16815 -15328 -13222 43342 18840 28802 41254 46216 19374 17178 24812 10688 -31780 -106007
7785a06007k929J00621Q0879o579j9633K6510K1876k8475j1902j7007m936M3909
$$ -106007 -108936 -8315 72564 65985 46352 72862 94738 66263 54361 37354 32418 76327
7773G6327N755k6251m1132j8909L5023J0002K0564J1202J288o0598n38M9302K5279
$$ 76327 82082 55831 14699 -4210 30813 40815 61379 72581 73869 13271 12733 62035 87314
7760H7314k1608k0286O93m4725p3632M219O3841R8017J2069O894l8252l0396l0808
$$ 87314 65706 45420 46113 1388 -72244 -68025 -4184 93833 105902 112796 74544 44148 13340
7747A3340r0974M7278M9796K7094r288R794J5103N157l6344j0134l1086j1913
$$ 13340 -77634 -30356 19440 46534 37246 47040 62143 67300 30956 20822 -10264 -22177
7735b2177j9164O018R807l0066K1306L9037L0542j985k2698J0194J4366O5273
$$ -22177 -41341 -35323 -25516 -55582 -34276 4761 35303 33318 10620 20814 35180 100453
7723A00453R06o6951j7349N346j9999P756n348j0699j9605L1679m1459J4772J2703
$$ 100453 101359 34408 17059 22405 2406 10162 4814 -5885 -25490 6189 -35270 -20498 -7795
7710g795p679k1509M4977M55M1207k3235K26k1057j4707j5933K7596j5884l330
$$ -7795 -15474 -36983 7994 8449 49656 26421 26647 5590 -9117 -25050 2546 -13338 -16668
7697a6668L0580M16J30Q631L1211l0816m0223O051R773L273j280l8642m0563n585
$$ -16668 13912 14328 14458 23089 54300 23484 -16739 -10688 -915 2358 1078 -37564 -78127 -83712
7683h3712L5307J3088j0217R8327P4945j6945o8296l2482J2356O8535J5956j8858
$$ -83712 -48405 -35317 -45534 52793 127738 110793 42497 10015 22371 90906 106862 88004
7671H8004n0838p3529n581J2689K8303K6404n5511j2117k609m304L6738L5141
$$ 88004 37166 -36363 -41944 -29255 -952 25452 -30059 -42176 -44785 -49089 -12351 22790
7659B2790L1842k1444o0509K6948K8041K0249m91Q231n1703n241L7460k4120J1533
$$ 22790 54632 33188 -27321 -373 27668 47917 47426 55657 3954 -1287 36173 12053 23586
7646B3586m297j01609l6997P2845O6295K1398r02J7389n1535m324k241l8669M3330
$$ 23586 19289 -82320 -119317 -46472 19823 41221 40319 57708 6173 1849 -392 -39061 4269
7633D269L7371J1799n9073k1482p738J2458L792K1214j9348p9211J3711K6858
$$ 4269 41640 53439 -5634 -27116 -34854 -22396 -18604 2610 -16738 -95949 -82238 -55380
7621e5380L6225O1733L293m6666l6556m0845l6612N5164L8361J9146K5244K743
$$ -55380 -19155 42578 45871 -795 -37351 -78196 -114808 -59644 -21283 -2137 23107 25850
7609B5850q300m243J8751L996j797j8395M1645K6768J3257j0293p1965k7949O338
$$ 25850 17550 13307 32058 36054 34257 15862 57507 84275 97532 87239 15274 -12675 -6337
7596f337K1638r893L7017M8615k9115j5835j4317J4171L5787m8641k6424k0617
$$ -6337 15301 5408 42425 91040 61925 46090 31773 45944 81731 33090 6666 -13951
7584a3951N109M1349K3792m71n8436j575p342m748K6363J3102n607K5987L3036
$$ -13951 -8842 32507 56299 55828 -2608 -4183 -11525 -16273 10090 23192 17585 43572 76608
7571G6608J8395L431p198j3469j3924m2813K886j3757K6663j4712r992n206l9180
$$ 76608 95003 98434 91236 77767 63843 21030 23916 10159 36822 22110 12118 6912 -32268
7558c2268Q67M0797l0375l2261Q73Q051k7929J4879O2797N5451k356q979l4012
$$ -32268 -31401 9396 -20979 -53240 -52367 -44316 -72245 -57366 5431 60882 58526 49547 15535
7545A5535M544K6303p942k4754l328J3796l1713m6950K5648L2577K2361k2746
$$ 15535 20079 46382 38440 13686 10358 24154 -7559 -54509 -28861 3716 26077 3331
7533C331J5058J4957l409j094Q321n04L4872K1783k5136q959m6936m6489J3498
$$ 3331 18389 33346 29937 28843 37164 36660 71532 93315 68179 59220 12284 -34205 -20707
7520b0707Q1003n567k9788k2016k3585n7787l9369j8234M1709L1749O5766O12
$$ -20707 60296 54729 24941 2925 -20660 -78447 -117816 -136050 -94341 -62592 3174 3786
7508C786j2099K8219K6902P344q1917J0308K1660k4905J2192M7175k3008J1231
$$ 3786 -8313 19906 46808 54152 -27765 -17457 4203 -20702 -8510 38665 15657 26888
7496B6888K918j0309Q687o771l0027M5455K0713j3801j5640N279m6270o7976J6530
$$ 26888 29806 19497 28184 21413 -8614 36841 57554 43753 28113 33392 -12878 -80854 -64324
7483f4324P8341R205k9521N4503J5439m6135N273j5724m7510L3996L007P430q51
$$ -64324 14017 23222 -6299 48204 63643 17508 22781 7057 -40453 -6457 -3450 3980 3129
7470C129l7552J6374j921k6498Q177L4620M4740j6808j0026j9927K854j7830j6449
$$ 3129 -34423 -18049 -19970 -46468 -38291 -3671 41069 24261 14235 -5692 -2838 -20668 -37117
7457c7117J8708J7955j1209K3623K4967n1542J5685J5919k6694L3674j83q208
$$ -37117 -18409 -454 -11663 11960 36927 -14615 1070 16989 -9705 23969 23786 15578
7445A5578l7110j7447L2332q740k7580j6057l5425J6458J8690O7246j5427k5613
$$ 15578 -21532 -38979 -6647 -15387 -42967 -59024 -94449 -77991 -59301 7945 -7482 -33095
7433c3095P837J01147K0176k0672P572m5136j0236N0432k86j7169l1839M470R786
$$ -33095 -25258 75889 96065 75393 82965 37829 27593 78025 77739 60570 28731 33201 42987
7420D2987j7657N912l3856k9575l3527q652K3710K176l6429J2552n853Q1144K2334
$$ 42987 25330 31242 -2614 -32189 -65716 -74368 -50658 -48482 -84911 -72359 -78212 2932 25266
7407B5266p233k4947O862K1891m4719q083L5765J9187n0342j8670L501K0716O2211
$$ 25266 18033 -6914 -52 21839 -22880 -30963 4802 23989 -26353 -45023 -41522 -20806 41405
7394D1405L6056J5232l7300j7648n529j0075J0148k3645j1711o578R661K7612
$$ 41405 77461 92693 55393 37745 32216 22141 32289 8644 -3067 -9645 16 27628
7382B7628L9890k389l2218l1869K6202j1537k1935J3088K4288m271j9729K5227
$$ 27628 67518 65129 32911 1042 27244 15707 -6228 6860 31148 26877 7148 32375
7370C2375K6810k5592j3582K857K3552J2921M3981j6770l6895k5947J4259L4921
$$ 32375 59185 33593 20011 22868 46420 59341 103322 86552 49657 23710 37969 72890
7358G2890k5554m7862L1112l3037J6165J1852O628J4516J8797l8043n5288n0425
$$ 72890 47336 -526 30586 -2451 13714 25566 32194 46710 65507 27464 -27824 -78249
7346g8249n130n333K3218k853Q616M2916K9620L0688l5948k3957L8990O36L3602
$$ -78249 -83379 -88712 -65494 -68347 -59731 -16815 12805 43493 7545 -16412 22578 23214 56816
7333E6816j2244n4206M040L8218q213l852R213m6289M1457m1671k9294L0993N2948
$$ 56816 44572 -9634 -5594 32624 24411 20559 29772 -16517 24940 -16731 -46025 -15032 37916
7320C7916j3734J967j1838o9706J836L1020Q705K7193J4307p817n1429L3738l6560
$$ 37916 24182 26149 14311 -55395 -53559 -22539 -13834 13359 27666 19849 -31580 2158 -34402
7307c4402k0801j1440L2105K6013k586J2350L2721J1770l7942j5806j9037L5227
$$ -34402 -55203 -66643 -34538 -8525 -11111 1239 33960 45730 7788 -8018 -27055 8172
7295H172L0570N221j79j6448n9895l8475j3304J9724N0404j2291N10J0184M0352
$$ 8172 38742 43963 43784 27336 -32559 -71034 -84338 -64614 -14210 -26501 -25991 -15807 24545
7282B4545j6893o2515k5550L4930L0647K8678L3956M678N136o3086k940K2020
$$ 24545 7652 -54863 -80413 -45483 -14836 13842 47798 52476 57612 -5474 -8414 13606
7270A3606m5888Q571J8252k6491J2043L9688M6950K8590J32p3969K1359J3803
$$ 13606 -32282 -23711 -5459 -31950 -19907 19781 66731 95321 95453 21484 42843 56646
7258E6646m8493o545M8617j1094l7723k8222N8410N495j0800O95K3403L2809L833
$$ 56646 8153 1608 50225 39131 1408 -26814 31596 37091 26291 26986 50389 83198 87031
7245H7031m2903n222j884n5852k1537m526L1300Q7088n639q2933j8917K4408J2597
$$ 87031 44128 38906 37022 -18830 -40367 -44893 -13593 73495 67856 -15077 -33994 -9586 3011
7232C011R317l709j1569J0944K7855K7158K098p221n3939j9357K0596J768O229
$$ 3011 12328 8619 -2950 7994 35849 63007 65105 57884 3945 -15412 5184 6952 13181
7219A3181R644k3628j8961K5385j1650k8298p879L0275Q121L720J5009m5644q397
$$ 13181 22825 -803 -19764 5621 -6029 -34327 -42206 -11931 -3810 -90 14919 -30725 -39122
7206c9122K9365J8202k6755k4780M9338K8880M0512Q070k8442k8996p688j1892
$$ -39122 -9757 8445 -18310 -43090 6248 35128 75640 83710 55268 26272 18584 6692
7194F692j0693j6250K0528k7487m4376J1415L3462L3825K5745J0491J0613k6809
$$ 6692 -4001 -20251 277 -27210 -71586 -60171 -26709 7116 32861 43352 53965 27156
7182B7156j5328m1701l7606N3584L6751l2512K5485p375k3492N7336L6553k6619
$$ 27156 11828 -29873 -67479 -13895 22856 -9656 15829 8454 -15038 42298 78851 52232
7170E2232l9723m3310k50K1535N969M3300K4504k6926k3926q60K1764Q501l2065
$$ 52232 12509 -30801 -31051 -9516 -3547 39753 64257 37331 13405 12545 34309 42810 10745
7157A0745K9896j185L593O5979K8899m3132o3834n7247L0798R622L0015j5157
$$ 10745 40641 39456 43049 109028 137927 94795 30961 -26286 4512 14134 44149 28992
7145B8992j3812M589l2884L6273L3787m8312o5196O0418P2505l9424m8557k0519
$$ 28992 15180 19769 -13115 23158 56945 8633 -56563 3855 76360 36936 -11621 -32140
7133c2140k4329J0984m3401j0536P198J3333J9826L6775K534j2602K4418J5062
$$ -32140 -56469 -45485 -88886 -99422 -92224 -78891 -59065 -22290 -19756 -32358 -7940 7122
7121G122J468L2442p9790k9115N7890N9368J297j0993j5006l641l305m417k5975
$$ 7122 8590 41032 -38758 -67873 -9983 49385 50682 39689 24683 21042 17737 13320 -12655
7108a2655N119Q828K1541p550O188K7256K5894l2070l6225k0807j5238J0561N9694
$$ -12655 -7536 1292 22833 15283 21471 48727 74621 42551 6326 -14481 -29719 -19158 40536
7095D0536J4318k0375k8178K3591M7151L6834n7684m3889k656n4751J8759j8777
$$ 40536 54854 34479 6301 29892 77043 113877 56193 12304 9648 -45103 -26344 -45121
7083d5121k47J1365K2227j1278j9182J3947L6774M956J8571K8267j4425m7208
$$ -45121 -45368 -34003 -11776 -23054 -42236 -28289 8485 13441 32012 60279 45854 -1354
7071a354k5679j5463k6700J1983K4428Q2456k715n0304l3144k3538J4449j0295
$$ -1354 -27033 -42496 -69196 -57213 -32785 49671 46956 -3348 -36492 -60030 -45581 -55876
7059e5876j8533j642J2929L087K6095K2036P95K5863J1686j0079j9881l8476K6935
$$ -55876 -74409 -76051 -63122 -60035 -33940 -11904 -11109 14754 26440 16361 -3520 -41996 -15061
7046a5061M3864l3130k3053k5081K3634K3043k9755m1609m0942L7382P4631J670
$$ -15061 28803 -4327 -27380 -52461 -28827 -5784 -35539 -77148 -118090 -80708 -6077 -4407
7034d407l2601Q731K4109J9048P48k7067n721J4648k2358j9039j9650k868J7582
$$ -4407 -37008 -28277 -4168 14880 15628 -11439 -17160 -2512 -24870 -43909 -63559 -66427 -48845
7021d8845L1087j033K5779j4091k9230n681L4165P050L4676o3857O644Q1336k47
$$ -48845 -17758 -18791 6988 -7103 -36333 -42014 -7849 -799 33877 -29980 -23336 58000 57753
7008E7753l2386j6350j9911j3260k0880J4524L6947k2397j1912K8052J1092J2653
$$ 57753 25367 9017 -10894 -24154 -45034 -30510 6437 -15960 -27872 180 11272 23925
6996B3925m5184m68j2863L6165p965L7631m654k1340M2918M6415n3024k5628j0852
$$ 23925 -21259 -21727 -34590 1575 -6390 31241 26587 5247 48165 94580 41556 15928 5076
6983E076k3945M3508K3068j4248L982K9766O9789M1362M6799m7153n7822r5184
$$ 5076 -18869 24639 47707 33459 37441 67207 136996 178358 225157 178004 120182 24998
6971B4998j4436P338q659q758k7961k0354J3917P734K4493N012j7118j2992k8675
$$ 24998 10562 17900 9241 483 -27478 -47832 -33915 -26181 -1688 3324 -13794 -26786 -55461
6958e5461q556M211M0900j3916k5933K0085l6206j0801K0314k9711K6487J3886
$$ -55461 -64017 -59806 -18906 -32822 -58755 -38670 -74876 -85677 -65363 -95074 -68587 -54701
6946e4701J9973L0924K3774l6937r872j2082m74L5666L2569l4372k8285R769N8686
$$ -54701 -34728 -3804 19970 -16967 -26839 -38921 -39395 -3729 28840 -5532 -33817 -24048 34638
6933C4638P3477j3507J3264k877m8324j6936k4518j6854m118K8318P061K5497
$$ 34638 108115 94608 107872 104995 56671 39735 15217 -1637 -5755 22563 29624 55121
6921E5121M9581q973m0715r755j030j9440m3504k2094j5502J2443N801K6970O3618
$$ 55121 104702 95729 55014 45259 44229 24789 -18715 -40809 -56311 -43868 -38067 -11097 52521
6908E2521L2253J6837k8932o8845j2951K9878j023n4713N121l9871J7220J1853
$$ 52521 84774 101611 72679 3834 -9117 20761 19738 -34975 -29854 -69725 -52505 -40652
6896d0652p174J7677L6649M6156k961j4552l2700R073K4771R171R370k8487j5164
$$ -40652 -47826 -30149 6500 52656 49695 35143 2443 11516 36287 45458 54828 26341 11177
6883A1177j4542N532j7767K8108K208J8706J8389j1389J4067K6542J738l013l2834
$$ 11177 -3365 2167 -15600 12508 14716 33422 51811 40422 54489 81031 82769 79756 46922
6870D6922K9n1577J5421K188p103j4044q409l3828m6475o547O3105n8823k7927
$$ 46922 46951 -4626 10795 12983 5880 -8164 -16573 -50401 -96876 -103423 -40318 -99141 -127068
6857a27068M1753N1392J2123k3393j3155k979K0007J0269N4585j003J2665N4183
$$ -127068 -85315 -33923 -21800 -45193 -58348 -61327 -41320 -31051 23534 22531 35196 89379
6845H9379k40k1284K8894j6674j9338l349R173l1425k0512k1118K53m426q291
$$ 89379 89139 67855 96749 80075 60737 57388 66561 35136 14624 -6494 -6241 -10667 -18958
6832a8958M3105J2792n868m1045J6057j2816L3444L043j6899j3035l475o840M3401
$$ -18958 24147 36939 31071 -9974 6083 -6733 26711 29754 12855 -180 -3655 -10495 32906
6819C2906M7497k2371n1869k1337M9360n242q388j9588K8387k9678m1409L9212
$$ 32906 80403 58032 6163 -15174 34186 28944 20556 968 29355 -323 -41732 -2520
6807b520N2659l3187l2997K7689O893K1621J1588J7816k4711O343l2017J5034
$$ -2520 50139 16952 -16045 11644 18537 40158 51746 69562 44851 51194 19177 34211
6795C4211j9181k6142J7386j8012l5456o334K2025j2567l666j6566p684K8941
$$ 34211 15030 -11112 6274 -11738 -47194 -53528 -31503 -44070 -47736 -64302 -71986 -43045
6783d3045j5748J3049p529j549N649J5151L1611l086j9222k6005o240J0964L3804
$$ -43045 -58793 -45744 -53273 -54822 -49173 -34022 -2411 -5497 -24719 -50724 -56964 -46000 -12196
6770a2196L9677J390k2957k6063K0126N736l1402K6441J7473k0988l7597M8875
$$ -12196 27481 28871 5914 -20149 -23 5713 -25689 752 18225 -2763 -40360 8515
6758H515L4045n5733n6882J897M641j7785K7892K2866P4195j9146j1344n6977
$$ 8515 42560 -13173 -70055 -68158 -63517 -81302 -53410 -30544 43651 24505 13161 -43816
6746d3816j6919N142K1693J506P126l1024p32k611K6145L3046l3662K785r28K5948
$$ -43816 -60735 -55593 -33900 -32394 -25268 -56292 -57024 -59635 -33490 -444 -34106 -31321 -32249 -6301
6732f301L1065l4074n7162k562K7426p308K66p990K2282L5615J9214P2634K7856
$$ -6301 24764 -9310 -66472 -69034 -41608 -48916 -48650 -56640 -34358 1257 20471 93105 120961
6719A20961j07680k291m0060l8715j8301M9407M4514k2l5580m038q163k2236K1094
$$ 120961 13281 10990 -29070 -67785 -86086 -36679 7835 7813 -27767 -31805 -39968 -62204 -41110
6706d1110L6378Q364K1751k0509o1727l4009N2052M8103K3754l1219l3658m3233
$$ -41110 -4732 3632 25383 4874 -56853 -90862 -38810 9293 33047 1828 -31830 -75063
6694g5063K5300K5387M968k3150N4325p341l1644m7557J7020N8552J7619J2140
$$ -75063 -49763 -24376 -19408 -42558 11767 4426 -27218 -74775 -57755 797 18416 30556
6682C0556M631l8802l266L327N8995N5803l903k8448n3884n063P757k1111o617
$$ 30556 35187 -3615 -6881 -3554 55441 111244 107341 78893 25009 19946 27703 6592 -25
6669b5j342J3088o2895k2962j8938P192M7647m607L2787J089l1641L140M8420
$$ -25 -1367 11721 -51174 -74136 -93074 -85882 -38235 -42842 -10055 -8966 -40607 -37467 10953
6656A0953J0521l7519q5835k2785O3271J8439K6858k6772j7437J4802N3190K8073
$$ 10953 21474 -16045 -101880 -124665 -61394 -42955 -16097 -42869 -60306 -45504 7686 35759
6644C5759J8757P743k0663n7669Q116L4134j815k543J1222j8186k1285n0738k4365
$$ 35759 54516 62259 41596 -16073 -7957 26177 24362 21819 33041 14855 -6430 -57168 -81533
6631h1533J9766p767K4842J0122K3940j3518m6773m5395L1649K1955L1003j5164
$$ -81533 -61767 -69534 -44692 -34570 -10630 -24148 -70921 -116316 -84667 -62712 -31709 -46873
6619d6873Q675k6068j7063m2669M8191L9351K3411K6769L0466j6281j8551j2276
$$ -46873 -38198 -64266 -81329 -123998 -75807 -36456 -13045 13724 44190 27909 9358 -2918
6607b918J0723J4280o78l2404N4816P8172m605q6428m2714K8513R118l044L7441
$$ -2918 7805 22085 21407 -10997 43819 121991 117386 30958 -11756 16757 25875 22831 60272
6594F0272N452J452L1653l7269n8226l6756j7173L17k2448P707J5341J8265N9176
$$ 60272 65724 67176 98829 61560 3334 -33422 -50595 -50278 -72726 -65019 -49678 -31413 27763
6581B7763j9612j523J9257K15o423j0647k9656l2331M8594L5650J1815k3050K888
$$ 27763 8151 6628 25885 26100 19677 9030 -20626 -52957 -4363 31287 43102 20052 22940
6568B2940N86l0893l9374k6861N1111L5380M4590J7527n5183j7694N2144j6544
$$ 22940 23526 -7367 -46741 -73602 -22491 12889 57479 75006 19823 2129 54273 37729
6556C7729j04603m61O3161j9232o278M6472j650J8453J4675M49o341l2381p829
$$ 37729 -66874 -67335 -4174 -23406 -29684 16788 15138 33591 48266 48715 42374 9993 2164
6543B164K2478n333J628M269K0468r489k8063j5908K8730N3851M4384l8368k5035
$$ 2164 24642 19309 20937 25206 45674 36185 8122 -7786 20944 74795 119179 80811 55776
6530E5776j6559p759j4008J6459k249k5935l8831m8554m730J9093L2780N2193
$$ 55776 39217 31458 17450 33909 31660 5725 -33106 -81660 -86390 -67297 -34517 17676
6518A7676K0536j6981L9538K4367Q957n89k7281l4319m5933k2936j255K5229k0614
$$ 17676 38212 21231 60769 85136 94093 93504 66223 31904 -14029 -36965 -38220 -12991 -33605
6505c3605J4549J2869j3889O981P3890J577k8498n8123Q683K1323R917L7581J4086
$$ -33605 -19056 -6187 -20076 -13095 60795 62372 33874 -24249 -15566 5757 15674 53255 67341
6492F7341m6725o6712K0823M3467M4332N207k6957j1072m2522k8033j4015m0810
$$ 67341 20616 -46096 -25273 18194 62526 67733 40776 29704 -12818 -40851 -54866 -95676
6480i5676K0247R954k8063O112N2368J0534k7059L2780l783L3558o445J0195M4007
$$ -95676 -75429 -65475 -93538 -87426 -35058 -24524 -51583 -18803 -22586 10972 4527 14722 58729
6467E8729K269k474L650o3896J7210N1396l3358n1188m0186R387M6690L5175K3513
$$ 58729 60998 58524 62174 -1722 15488 66884 33526 -17662 -57848 -48461 -1771 33404 56917
6454E6917J9474J5853r479K468o0299N046R128K7193K3501n1592j5198K4403p3910
$$ 56917 76391 92244 82765 85233 24934 29980 39108 66301 89802 38210 23012 47415 -26495
6441b6495J1243O6692m0137k5853k570l4171l2709K1713j407L2092J9604l2694
$$ -26495 -15252 51440 11303 -14550 -17120 -51291 -84000 -62287 -63694 -31602 -11998 -44692
6429d4692L1139O8646M7340k0102n5633l8488R062l399R02J5450O288K5790k8723
$$ -44692 -13553 55093 102433 82331 26698 -11790 -2728 -6127 -5225 10225 16513 42303 13580
6416A3580J7045k5985q067p698k6259J0942N5108m466J0007k4462l1373J9831
$$ 13580 30625 4640 -3427 -11125 -37384 -26442 28666 24200 34207 9745 -21628 -1797
6404a797J4993J7686P784l7440j6499O7269j3365m5643L0393N3890k6183q4816
$$ -1797 13196 30882 38666 1226 -15273 51996 38631 -7012 23381 77271 51088 -33728
6392c3728n6210k8594J5935N6958J5902o4134L9326O252M6167K3461q952J1051
$$ -33728 -89938 -118532 -102597 -45639 -29737 -93871 -54545 -48293 -2126 21335 12383 23434
6380B3434l8727j1211L6287p2j6506j5530L0308j9435k382L7695j3087k13K2958
$$ 23434 -15293 -26504 9783 9711 -6795 -22325 7983 -11452 -13834 23861 10774 10561 33519
6367C3519r272o7867j9833J5488k0567l4796J928L6426O2391K6303m0913j34J073
$$ 33519 24247 -43620 -63453 -47965 -68532 -103328 -101400 -64974 -2583 23720 -17193 -17327 -16254
6354a6254o0550N6528N913K8979Q8481j4309l2240n6628J1347M2333k4656M4485
$$ -16254 -76804 -20276 -14363 14616 103097 88788 56548 -80 11267 53600 28944 73429
6342G3429j6716m72j2018J0572k4734R01M281k9751M790M461P331M0229j1019
$$ 73429 56713 56241 44223 54795 30061 30962 35243 5492 10282 14743 22074 62303 51284
6329E1284j6274p498m5475J9408j2918K5359L0040o4114r1261l6239M4350M0628
$$ 51284 35010 27512 -17963 1445 -11473 13886 43926 -20188 -111449 -147688 -103338 -62710
6317f2710O098j3040M2638M1710L5907k5575l2549k7820j334j3218l0718J7743
$$ -62710 -56612 -69652 -27014 14696 50603 25028 -7521 -35341 -36675 -49893 -80611 -62868
6305f2868K8879K8014J3420k307J8077k8029j1785l9421k2061K5789M6000K7446
$$ -62868 -33989 -5975 7445 5138 23215 -4814 -16599 -56020 -78081 -52292 -6292 21154
6293B1154j2580q313K4539K3373j4060P577l2295j9988K3651k2039j4134J6800
$$ 21154 8574 261 24800 48173 34113 41690 9395 -10593 13058 -8981 -23115 -6315
6281f315K8648M749p695K1498r432K7424L6180j1701p5126m4940l3318J5534R298
$$ -6315 22333 27082 19387 40885 31453 58877 95057 83356 8230 -36710 -70028 -54494 -45196
6268d5196N56K2859J3576l7732L345O016J2939k1751K6584n039J8220J9577R424
$$ -45196 -44640 -21781 -8205 -45937 -42592 -36576 -23637 -45388 -18804 -23843 -5623 13954 23378
6255B3378k8152K2605K7369N435l9615L0329L5668j1956r359J8543j545n6328
$$ 23378 -4774 17831 45200 50635 11020 41349 77017 65061 55702 74245 72700 16372
6243A6372l5316M32N0150k6395j6699L0971K4740O912j8388K061l3506q077k5717
$$ 16372 -18944 -18512 31638 5243 -11456 19515 44255 51167 32779 34840 1334 -6743 -32460
6230c2460J4707L8755O4217M3561q042n0695k6554n0537j0133L0294k7970j833
$$ -32460 -17753 21002 85219 128780 120738 70043 43489 -7048 -17181 13113 -14857 -16690
6218a6690L0487l5553m5871J829L1753L5571J7064L368J6556K3O933m1994j4748
$$ -16690 13797 -21756 -67627 -65798 -34045 1526 18590 21958 38514 38537 45470 3476 -11272
6205a1272N296L4367J4693r750j1094k2261J4470j9303j6761l7485l988O063L5264
$$ -11272 -5976 28391 43084 33334 22240 -21 14449 -4854 -21615 -59100 -63088 -57025 -21761
6192b1761j9655l3576K3777J2391l8096J8879Q6042k8165m4987m420M166J0652
$$ -21761 -41416 -74992 -51215 -38824 -76920 -58041 28001 -164 -45151 -49571 -45405 -34753
6180c4753N9143L0325M465O576l8505k4057l0330k6343R508K9584L2055K4010
$$ -34753 24390 54715 59180 65756 27251 3194 -27136 -53479 -43971 -14387 17668 41678
6168D1678Q831J0076J1726J4167K7737k3886m0474j6861j2989j9287J9220l1701
$$ 41678 50509 60585 72311 86478 114215 90329 49855 32994 20005 718 19938 -11763
6156a1763o195m9585J619L9383K5406J7649N503j0916k5596N112o989N5943j1324
$$ -11763 -17958 -67543 -65924 -26541 -1135 16514 22017 11101 -14495 -9383 -16372 39571 28247
6143B8247n3805j5426K6676K9508J0486k0274P726J2188j5441K0820L4803k9849
$$ 28247 -25558 -40984 -14308 15200 25686 5412 13138 25326 9885 30705 65508 35659
6131C5659j6446j8358k3538k8435R749O5700L4747L204n6152l7492M277J1187
$$ 35659 19213 855 -22683 -51118 -41369 24331 59078 62282 6130 -31362 -27085 -15898
6119a5898L1955O464m4682n5935j3782K2222M9645J9788J5230j5315m3751l0266
$$ -15898 16057 22521 -22161 -78096 -91878 -69656 -20011 -223 15007 -308 -44059 -74325
6107g4325K0478N7057K4125r937R766q550J247j2220k7953J2868K1793j1710N608
$$ -74325 -53847 3210 27335 17398 27164 18614 19861 7641 -20312 -7444 14349 2639 8247
6094H247J3076L6081N63J193j5645k6799l9122L0481O109j4461K7387L1910n4418
$$ 8247 21323 57404 57967 59160 43515 16716 -22406 8075 14184 -277 27110 59020 4602
6081D602o1195j3819J6261q3767J2898l854j4704J9973M9957L8758L4329k3989
$$ 4602 -56593 -70412 -54151 -137918 -125020 -128874 -143578 -123605 -73648 -34890 -561 -24550
6069b4550n8222q225O3795L8211j7995n3890j299O9704L4168N460J8800J4973
$$ -24550 -82772 -90997 -27202 11009 -6986 -60876 -62175 7529 41697 47157 65957 80930
6057H0930J9670p527k6688m0634l3084K1396K9915L9439L180m7403l7382j8615
$$ 80930 100600 93073 66385 25751 -7333 14063 43978 83417 86597 39194 1812 -16803
6045a6803l2571k3535O2615M1706k369J7311L600k0628J5193P8057k7912n4203
$$ -16803 -49374 -72909 -10294 31412 29043 46354 49954 29326 44519 122576 94664 40461
6033D0461j7649l1756r82k3866m8307N581N0686l6980l7628L4684L7218K5078
$$ 40461 22812 -8944 -9926 -33792 -82099 -76518 -25832 -62812 -100440 -65756 -28538 -3460
6021c460K1738o799K5723j4845n1899r855M6538l511K3740J9332n6378N251k3832
$$ -3460 18278 11479 37202 22357 -29542 -39397 7141 3630 27370 46702 -9676 -4425 -28257
6008b8257K4172m466k8606l064j3049R615j8471P631L5301L8576k2200n9339N1058
$$ -28257 -4085 -8551 -37157 -40221 -53270 -43655 -62126 -54495 -19194 19382 -2818 -62157 -11099
5995a1099N4720m005n8440j1669m4376L5346M3312J5907j8872j234l3492Q820
$$ -11099 43621 39616 -18824 -30493 -74869 -39523 3789 19696 824 -410 -33902 -25082
5983b5082P7338N880m3134o0678m508m80j6266j0775K5911M9817j4566n1389O9402
$$ -25082 52256 58136 15002 -45676 -50184 -50664 -66930 -77705 -51794 -1977 -16543 -67932 1470
5970A470L0587p946j4597l0449l267J3770l5019L7996l832l1219P194j2031K9035
$$ 1470 32057 24111 9514 -20935 -24202 -10432 -45451 -7455 -11287 -42506 -35312 -47343 -18308
5957a8308J9256l7618K1684J713m0415l6020Q1668N3818j5231P790j5855J5330
$$ -18308 948 -36670 -14986 -13273 -53688 -89708 -8040 45778 30547 38337 22482 37812
5945C7812l9934k0029Q759J3441L9706O907k4074L9009L354K4329J9226k4677
$$ 37812 -2122 -22151 -13392 49 39755 46662 22588 61597 64951 89280 108506 83829
5933H3829n7016J7948n038j9499K6531J3397j3506J8946l3850j9007k7485j1783
$$ 83829 26813 44761 39723 20224 46755 60152 46646 65592 31742 12735 -14750 -26533
5921b6533k5063J9177O052l1850J4314k893k4617M0875J0346R357K2699o168m9834
$$ -26533 -51596 -32419 -26367 -58217 -43903 -46796 -71413 -30538 -20192 -10835 11864 5696 -44138
5908d4138K9817K4309k0259m756K6724J9750k784k9378K5891L283l7678L196J5562
$$ -44138 -14321 9988 -10271 -15027 11697 31447 28663 -715 25176 28459 -9219 -6023 9539
5895I539L4536j2429M093m333j4168n1555K5888R893j0061L9959J8113L5921l5163
$$ 9539 44075 31646 35739 31406 17238 -34317 -8429 1464 -8597 31362 49475 85396 50233
5882E0233m9662N2202m8539k2722P2568J5444O858J2099m3756l6601K9144K8647
$$ 50233 571 52773 4234 -18488 54080 69524 76382 88481 44725 8124 37268 65915
5870F5915j3767m8837K965O207k5010j7806k1509n0032O0113L7451m454L5371
$$ 65915 52148 3311 6276 12483 -12527 -30333 -51842 -101874 -41761 -4310 -8764 26607
5858B6607J8086K832l1262m3620j8542k2542j8434L7076k47J3675K1740j0812
$$ 26607 44693 47525 16263 -27357 -45899 -68441 -86875 -49799 -50046 -36371 -14631 -25443
5846b5443R151J3056J0507J7553J1619j5393m2952j0049J482J6466L6341L691
$$ -25443 -16292 -3236 7271 24824 36443 21050 -21902 -31951 -30469 -14003 22338 26029
5834B6029j1422j1737o039j5257J3684K4076q790M443M068j1864k087J1452M0941
$$ 26029 14607 2870 -3169 -18426 -4742 19334 10544 14987 19055 7191 5104 16556 57497
5821E7497J8290m0902K751K4362O787K6604m6522l1021j9480L6154N2684k0784
$$ 57497 75787 34885 37636 61998 68785 95389 48867 17846 -1634 34520 87204 66420
5809F6420J607j0256q462l7527k2871K1876m660p200p7548K4145K443M934Q201
$$ 66420 68027 57771 49309 11782 -11089 10787 6127 -1073 -78621 -54476 -52033 -47099 -38898
5796c8898L901J8409K8264k4038l946j2594L1901j2699o2901K5240J6104j5370
$$ -38898 -34997 -16588 11676 -12362 -16308 -28902 2999 -9700 -72601 -47361 -31257 -46627
5784d6627O924L8039j6491J7789k9426l491L1127M3858K2387L0916O077K6067
$$ -46627 -39703 -1664 -18155 -366 -29792 -33283 -2156 41702 64089 95005 101082 127149
5772A27149M4522j1784k8849o6486k6228L5554n576k1382m0727N719k1132P102
$$ 127149 171671 159887 131038 64552 38324 73878 68302 46920 6193 11912 -9220 -2118
5760b118J670J7660k5699l0768j0110J872j7769q403k6978k5007N2514O8835k2587
$$ -2118 -448 17212 -8487 -39255 -49365 -47493 -65262 -73665 -100643 -125650 -73136 -4301 -26888
5747b6888n0434l377K9612j8814m7746m369M2873P1059L1429j1677M7139L476
$$ -26888 -77322 -80699 -51087 -69901 -117647 -122016 -79143 -8084 23345 11668 58807 62283
5735F2283k2392m0180o1597k3003j76M1945k2031J2411J0969m759K8014M7481
$$ 62283 39891 -289 -61886 -84889 -85065 -43120 -65151 -52740 -41771 -46530 -18516 28965
5723B8965j9377l0249o760l9810l2409P7567L8229P70l5344r676L7160L5288J971
$$ 28965 9588 -20661 -27421 -67231 -99640 -22073 16156 16926 -18418 -28094 9066 44354 46325
5710D6325j7750k2017j4079m4938L612o963j0650j6963k6536L5549K9218m448
$$ 46325 28575 6558 -7521 -52459 -48847 -55810 -66460 -83423 -109959 -74410 -45192 -49640
5698d9640J548J072M9062k548n4834K0876M1825p537j0733l3483M0103N1965L1896
$$ -49640 -48092 -47020 2042 -506 -55340 -34464 7361 -176 -10909 -44392 -4289 47676 79572
5685G9572k9641l3304k9616J9327J247j1995J2292M2807k2480o001J5284k0075
$$ 79572 49931 16627 -12989 6338 7585 -4410 7882 50689 28209 22208 37492 17417
5673A7417m3237l5330J0541j7631p740q051M8510O7541M3720j2311m3764j7559
$$ 17417 -25820 -61150 -50609 -68240 -75980 -84031 -35521 32020 75740 63429 19665 2106
5661B106J2725j261k5980p636j137L927k3115L331m115R39p285k407J8953j6634
$$ 2106 14831 13570 -12410 -20046 -21183 -17256 -40371 -37040 -41155 -40216 -47501 -49908 -30955 -47589
5647d7589R61L8522J2609L5251j1716n5319K7785K4231j0189k732J0113j6758
$$ -47589 -46628 -8106 4503 39754 28038 -27281 504 24735 14546 11814 21927 5169
5635E169J8225j349p4877j6761r775J5712K2477k6732K0088l644j6705L3494l3972
$$ 5169 23394 22045 -52832 -69593 -79368 -63656 -41179 -67911 -47823 -51467 -68172 -34678 -68650
5622f8650j9476J8649L2843J233K8471j3882J271k0915L21J5296R847k0714k7027
$$ -68650 -88126 -69477 -36634 -35401 -6930 -20812 -19541 -40456 -40135 -24839 -14992 -35706 -62733
5609f2733J062K2571K8801J7476o976n2950K7869R7596M1017n1499o7860j9927
$$ -62733 -61671 -39100 -10299 7177 201 -52749 -24880 72716 113733 62234 -5626 -25553
5597b5553n689j4783J6782L550K9900J3968K4769k013l0992k8752K685L0119n386
$$ -25553 -31242 -46025 -29243 -25693 4207 18175 42944 40931 9939 -18813 -16128 13991 8605
5584H605L717j9249m3351m3985M4272J9528K7255j1393k5369J0656J7381J7901
$$ 8605 12322 -6927 -50278 -94263 -49991 -30463 -3208 -14601 -39970 -29314 -11933 5968
5572E968O829O311j8448L0567o2133n0920J8544k913K1412L707j5679J8045L6375
$$ 5968 12797 19108 660 31227 -30906 -81826 -63282 -66195 -44783 -41076 -56755 -38710 -2335
5559b335L5796J5889k1422J0934J0612m1574m5015n972N2001M9289J7354m4796
$$ -2335 33461 49350 27928 38862 49474 7900 -37115 -43087 8914 58203 75557 30761
5547C0761J6033j6532o0262J3962J6864k2507o3956j975K7471J1103M843M6467
$$ 30761 46794 30262 -30000 -16038 826 -21681 -85637 -87612 -60141 -49038 -44195 2272
5535B272K8784M7179q787l3992o9339j3600R234r700j35j8747p048M7851Q5230
$$ 2272 31056 78235 69448 35456 -33883 -47483 -38249 -47949 -48084 -66831 -73879 -26028 59202
5522E9202k9068m6298j8000o2892j0720Q366O0757P398k6130J2897R844J9021
$$ 59202 30134 -16164 -34164 -97056 -107776 -99410 -38653 -31255 -57385 -44488 -34644 -15623
5510a5623l336k6565l6746l3464J9829O8124K1426L7571J3264Q451n3742k1199
$$ -15623 -18959 -45524 -82270 -115734 -95905 -27781 -6355 31216 44480 52931 -811 -22010
5498b2010j8930k5909J9343J2606J6809J3170M124k148k4304j9963k1091k6680
$$ -22010 -40940 -66849 -47506 -34900 -18091 -4921 -797 -2945 -27249 -47212 -68303 -94983
5486i4983L9343R732L912K6079j9577l2069O9470K2143k3525n753J5753n0222
$$ -94983 -55640 -45908 -41996 -15917 -35494 -67563 1907 24050 525 -5228 10525 -39697
5474c9697l5089L410m085m162K0439P2090N3367n2639l6807l3048j9892L3500
$$ -39697 -74786 -71376 -75461 -79623 -59184 12906 66273 13634 -23173 -56221 -76113 -42613
5462d2613M2993j0067j7607R966L4588J0887K2445j4663q637J9820k3469m3012
$$ -42613 380 -9687 -27294 -17328 17260 28147 50592 35929 27292 47112 23643 -19369
5450a9369L6102L2507j4240Q67k2797m8525l9400j4046J2737L8064K6821K516
$$ -19369 16733 49240 35000 35867 13070 -35455 -74855 -88901 -76164 -38100 -11279 -8763
5438h763O3039k6167j3502O203M4802J4845l3047q4610n7222N9088N6702O526
$$ -8763 54276 28109 14607 20810 65612 80457 47410 -37200 -94422 -35334 21368 27894
5426B7894l1821o087j0296l325k8788j7802J7094j4059K4221N4467j0096k0178
$$ 27894 -3927 -10014 -20310 -23635 -52423 -70225 -53131 -67190 -42969 11498 1402 -18776
5414a8776N658j2480l601N3086K9024k1324o2999k144M29K6360J1747l0652Q285
$$ -18776 -13118 -25598 -29199 23887 52911 31587 -31412 -33556 -33127 -6767 4980 -25672 -17387
5401a7387J7750j0783K0561J818J9741P019j8134J48j9711m6207p214J768j0379
$$ -17387 363 -10420 10141 11959 31700 38719 20585 20733 1022 -45185 -52399 -50631 -61010
5388f1010K584K4990P141K5938M5360L5311p0708R342M3986J1560J6583J2504
$$ -61010 -58426 -33436 -26295 -357 45003 80314 9606 18948 62934 74494 91077 103581
5376A03581j6413n8813k6459J9632Q690q663k3886J0572K2258k2930K184J9848
$$ 103581 87168 28355 1896 21528 30218 21555 -2331 8241 30499 7569 9753 29601
5364B9601m5876K8149M5700N866j1564m450J2776l0431m6351j9078k4671m6110
$$ 29601 -16275 11874 57574 63440 51876 47426 60202 29771 -16580 -35658 -60329 -106439
5352a06439R214l21k0890K0827N1773J6948r788l5170J6495J7192l6292k1864
$$ -106439 -97225 -97546 -118436 -97609 -45836 -28888 -38676 -73846 -57351 -40159 -76451 -98315
5340i8315K285P2390L2531L5344M569k4894j2451o3576k9965o3O1901L3588j7795
$$ -98315 -96030 -23640 8891 44235 48804 23910 11459 -52117 -82082 -82145 -20244 13344 -4451
5327d451j1756L2424M5876J173m0067N9179j3266p2192k1806j8869K3447r863
$$ -4451 -16207 16217 62093 63266 23199 82378 69112 -3080 -24886 -43755 -20308 -30171
5315c0171l2528l7097O2954k6301N806L759P4051L7789M011l9986m4387J8078
$$ -30171 -62699 -99796 -36842 -63143 -57337 -53578 20473 58262 62273 22287 -22100 -4022
5303d022J25K6016J2585m2924P395N313N390K2110J4188l396k3518o0429k1203
$$ -4022 -3897 22119 34704 -8220 -825 4488 9878 31988 46176 42780 19262 -41167 -62370
5290f2370K9526J6237k2818O9642M1087K8146k241j4924m3561m3526p204l1105
$$ -62370 -32844 -16607 -39425 30217 71304 99450 97209 82285 38724 -4802 -12006 -43111
5278d3111J5731N7699j7707m3424l849L4568K5152K5143k7312J732j0769l5319
$$ -43111 -27380 30319 12612 -30812 -34661 -93 25059 50202 22890 24622 13853 -21466
5266b1466n690J2249K4430N7266K288k691r533j3641k0920K6139j1413r983O852
$$ -21466 -27156 -14907 9523 66789 69077 66386 56853 43212 22292 48431 37018 27035 33887
5253C3887K83j3076L5427r673m5590O512L5928N81m1605m5673N679M1499J4382
$$ 33887 34170 21094 56521 46848 1258 7770 43698 44279 2674 -42999 -37320 4179 18561
5240A8561j314p7455l6060L6232N5314m973k2925L2608N3455Q268p632j0394o480
$$ 18561 17247 -60208 -96268 -60036 -4722 -9695 -32620 -12 53443 61711 54079 43685 37205
5227C7205L6443N09l2541j4008J2424j9404j376J6713j5731m0528j8006M809K0996
$$ 37205 73648 74157 41616 27608 40032 20628 19252 35965 20234 -20294 -38300 -33491 -12495
5214a2495P2247K0522k9461p715m8476q358L4694K4426J6806m8687l0605j7645
$$ -12495 59752 80274 50813 43098 -5378 -13736 20958 45384 62190 13503 -17102 -34747
5202c4747Q184j0652l86M2642q770j5894L080J1856Q117J240k7936l9184Q278
$$ -34747 -26563 -37215 -37601 5041 -3729 -19623 -16543 -4687 3430 4670 -23266 -62450 -54172
5189e4172M5713K9715K264k2973J160k406k426l467l6616j0106l177l3955J3905
$$ -54172 -8459 21256 23520 547 1707 -699 -3125 -6592 -43208 -53314 -56491 -90446 -76541
5176g6541N0839k1560K2617L1893j6641k3932k6538L3823k0238J4580k1418k0462
$$ -76541 -25702 -47262 -24645 7248 -9393 -33325 -59863 -26040 -46278 -31698 -53116 -73578
5164g3578r766L9163K5806L58J2913j0884K4101L8700k5202l7434K9051Q353r856
$$ -73578 -83344 -44181 -18375 -18017 -5104 -15988 8113 46813 21611 -15823 13228 21581 11725
5151A1725j5048j0048K5871J547k705r131L8752M3216j8463j4533q0025L9174
$$ 11725 -3323 -13371 12500 14047 11342 2211 40963 84179 65716 51183 -28842 10332
5139A0332J7730k4146p081M1333p57l5692J6425O606q608K1297K5910k1160j3645
$$ 10332 28062 3916 -3165 38168 37411 1719 18144 24750 16142 37439 63349 42189 28544
5126B8544k4604m376P02p1328j0829J00175K6954o16r493J0090L3998n6694n0653
$$ 28544 3940 -436 266 -71062 -81891 18284 45238 44622 35129 45219 79217 22523 -28130
5113b8130j1397O1697J7834m8689o5897k187K0765L9812M9069N6893K7705j6771
$$ -28130 -39527 22170 40004 -8685 -74582 -76769 -56004 -16192 32877 89770 117475 100704
5101A00704o4442m2043o736K1524j4715k7706K891l5045P974P1307K6910l1808
$$ 100704 36262 -5781 -12517 9007 -5708 -33414 -30523 -65568 -57594 13713 40623 8815
5089H815j2468k5879j6566j794R229j6330N324J0219J1378J0818k0327J6926k679
$$ 8815 -3653 -29532 -46098 -47892 -38663 -54993 -49669 -39450 -28072 -17254 -37581 -20655 -23334
5076b3334k1126J9125L7427K9165m8954k6172J2881K1015L3619k1404l975l2111
$$ -23334 -44460 -25335 12092 41257 -7697 -33869 -20988 27 33646 12242 8267 -23844
5064b3844k4022N0055M4010j330n5545o159M9263J9467J9521j3617j2536l9417
$$ -23844 -47866 2189 46199 44869 -10676 -16835 32428 51895 71416 57799 45263 5846
5052E846K936j4849q791p659k127n691O886J423j3823j7308q394j949P1250K1836
$$ 5846 8782 -6067 -14858 -22517 -24644 -30335 -23449 -22026 -35849 -53157 -61551 -63500 7750 29586
5038B9586j6487K3700O971K6564k3711k3030K9699l6372j0244m6936o7962J498
$$ 29586 13099 36799 43770 70334 46623 23593 53292 16920 6676 -40260 -108222 -106724
5026a06724L4247L9218j5323K6693M9528N475l3444o330J2235k949L9586O5060
$$ -106724 -72477 -33259 -48582 -21889 27639 33114 -330 -6660 5575 2626 42212 107272
5014A07272j4510p119j2094j5609o8086k8324J0895O7856k903O657P862O999L1836
$$ 107272 92762 85643 73549 57940 -10146 -38470 -27575 40281 37378 44035 51897 58896 90732
5001I0732J5175k1826l063Q969n7904l8606J1475N016K3860p894j3574K5496N0982
$$ 90732 105907 84081 81018 89987 32083 -6523 4952 9968 33828 25934 12360 37856 88838
4988H8838J5484m3897k8003L7972q012j91n7783m8127j0224j2610M1855N3880
$$ 88838 104322 60425 32422 70394 62382 62191 4408 -43719 -53943 -66553 -24698 29182
4976B9182O761m86l6198J3767j9027K8834K7495j6836j9662q832K6617r234J7925
$$ 29182 35943 35457 -741 13026 -6001 22833 50328 33492 13830 4998 31615 22381 40306
4963D0306l741p718k1722o1014l1628M6711K193M6718J8460q049J3275k1280K7553
$$ 40306 36565 28847 7125 -53889 -85517 -38806 -36613 10105 28565 20516 33791 12511 40064
4950D0064M1230O0091k1140o1684o7006l3120o091P47L2624L8980l8631K2649
$$ 40064 81294 141385 120245 58561 -8445 -41565 -47656 -46909 -14285 24695 -13936 8713
4938H713K2389k9044k0476K121l6892k4498Q303M9501P763K2321L2616m8242p4550
$$ 8713 31102 2058 -18418 -16297 -53189 -77687 -69384 -19883 -12120 10201 42817 -5425 -79975
4925g9975J3941P287M0689M191k5612m295K0240L3407l5146n4898J8183Q4189
$$ -79975 -66034 -58747 -18058 -13867 -39479 -43774 -23534 9873 -25273 -80171 -61988 22201
4913B2201L7911j2863j5605N967l0624l1912k951J9873k4724p844L9113L1086
$$ 22201 60112 47249 31644 37611 6987 -24925 -27876 -8003 -32727 -40571 -1458 29628
4901B9628J065k7035j0685r476k2785k5503j1588k9345M0225L2658J7623m18K3561
$$ 29628 30693 3658 -7027 -16503 -39288 -64791 -76379 -105724 -65499 -32841 -15218 -15636 7925
4888G925j5224j6K3066m2945k0353L8267O0227q447m809p705k8837M9024M5185
$$ 7925 -7299 -7315 15751 -27194 -47547 -9280 50947 42500 37691 29986 1149 50173 95358
4875I5358p2047r8377l119K3418P36l4663J5987O3382J1169k1766J2702L0809
$$ 95358 23311 -75066 -78185 -54767 -54031 -88694 -72707 -9325 1844 -19922 -7220 23589
4863B3589l0106o4294l7924L2833j215o344o657N1529N5079J2232m5826M8291
$$ 23589 -6517 -70811 -108735 -75902 -77117 -83461 -90118 -38589 16490 28722 -17104 31187
4851C1187N2940m19n6m1894m9614r882M9533k0418k3909O884j880L2104K8951
$$ 31187 84127 83708 83652 41758 -7856 -17738 31795 11377 -12532 -5648 -7528 24576 53527
4838E3527q233J5293p7233P894L4657R605J7825J19158m67j19680o7072m1140
$$ 53527 45294 60587 -16646 -8752 25905 35510 53335 172493 172026 52346 -14726 -55866
4826e5866k5099K9336O269p982J0270P753P570k2360k587K1554Q0445L4649m686
$$ -55866 -80965 -51629 -45360 -53342 -43072 -35319 -27749 -50109 -52696 -31142 49303 83952 79266
4813G9266n3989o3991j4402J0220l479l2156m1533K566L5559J1658r968k4235
$$ 79266 25277 -38714 -53116 -42896 -46375 -78531 -120064 -117498 -81939 -70281 -80249 -104484
4801a04484O3283j194l6562m510M7862p40k081r564M7481P1392K9572j6568l9772
$$ -104484 -41201 -42395 -78957 -83467 -35605 -36345 -38426 -47990 -509 70883 100455 83887 44115
4788D4115p0592n8065K748j4147q249N9574K9904O8K5512l2716j0614L4584n787
$$ 44115 -26477 -84542 -81794 -95941 -104190 -44616 -14712 -14644 10868 -21848 -32462 2122 -3665
4775c665Q7L0405L8303j1925r7262k2144K9345K1708m2811r438K4450K2066n305
$$ -3665 -3578 26827 65130 53205 -44057 -66201 -36856 -15148 -57959 -67397 -42947 -20881 -26186
4762b6186n1063O0083L069M8628j8123j6612K2614j0248m459K1251K6357j9506
$$ -26186 -77249 -17166 -14097 34531 16408 -204 22410 12162 7703 28954 55311 35805
4750C5805k514L971n4333j1259M2167K2313J9038J3445J6784l3974j0275o5577
$$ 35805 33291 37262 -17071 -28330 13837 36150 55188 68633 85417 51443 41168 -24409
4738b4409J9969j8376n4681j1974P489K224m438k4308O170N0754L0977K0206k5066
$$ -24409 -4440 -22816 -77497 -89471 -81982 -79758 -84196 -108504 -102334 -51580 -20603 -397 -25463
4725b5463k3891N7017N4706L5840M822K722l0398P112K1244k0873n7152l5736
$$ -25463 -49354 7663 62369 98209 103031 105753 75355 82467 103711 82838 25686 -10050
4713a0050j8359r410P177M7927M7149J3247O091K1861J5187Q602j338k5356j5956
$$ -10050 -28409 -37819 -30642 17285 64434 77681 83772 105633 120820 129422 128084 102728 86772
4700H6772k8731l142k8839n2964l0271J4167K1127M3191r13k5447j3109j3531
$$ 86772 58041 54899 26060 -26904 -57175 -43008 -21881 21310 20397 -5050 -18159 -31690
4688c1690J7579m3024K0091M0850J6897N114J5648j8516o3526L64k479Q947J1435
$$ -31690 -14111 -57135 -37044 3806 20703 25817 41465 22949 -40577 -40213 -42692 -33745 -22310
4675b2310O0685K9642L562j7314j0624k2891J6959J2607l5219l6714L396M7642
$$ -22310 38375 68017 71579 54265 43641 20750 37709 50316 15097 -21617 -18221 29421
4663B9421M127l9599q178M879k1702j2448N7854K184l4092P376K3660J8693L2646
$$ 29421 33548 -6051 -14229 -9350 -31052 -43500 14354 16538 -17554 -10178 13482 32175 64821
4650F4821j2175n2969l7240l001O4520O316j8414J6065J1844l1174M81Q443j957
$$ 64821 52646 -323 -37563 -40564 23956 30272 11858 27923 39767 8593 9074 17517 15560
4637A5560o394p941K2168K1649l8388r843J1694q222j4319N8998O279o7164L0233
$$ 15560 9166 1225 23393 45042 6654 -3189 8505 283 -14036 44962 51241 -15923 14310
4624A4310l5394k4750K0316l7067l7626k6511L0210N2118R4137K3579m8455K6027
$$ 14310 -21084 -45834 -25518 -62585 -100211 -126722 -96512 -44394 49743 73322 24867 50894
4612E0894Q125K5321m619o4190k0385q266J055k2475J5620k5799o779J6595P3933
$$ 50894 59019 84340 79721 15531 -4854 -13120 -12065 -34540 -18920 -44719 -51498 -34903 39030
4599C9030N2097J0010l1637j9845k4469K6951J3336m150P6021k7916o7061n8027
$$ 39030 91127 101137 69500 49655 25186 52137 65473 61323 137344 109428 42367 -15660
4587a5660l2333L9378K9056q955m1606j2320o332k4193l2696K563O7967J5868
$$ -15660 -47993 -8615 20441 11486 -30120 -42440 -48772 -72965 -105661 -103098 -35131 -19263
4575a9263q164J8490k7909M9274J5747m3183l5660O2888N8976n5401p3702l3702
$$ -19263 -27427 -8937 -36846 12428 28175 -15008 -50668 12220 71196 15795 -57907 -91609
4563i1609O6414L9808Q445j0482n940L1940q911L193K5949l0224j4473J7912J4051
$$ -91609 -25195 14613 23058 12576 6636 38576 29665 32858 58807 28583 14110 32022 46073
4550D6073k3186j4317J2702l3819J3268q357J8203K9486K4001j4723m2215J253
$$ 46073 22887 8570 21272 -12547 721 -7636 10567 40053 64054 49331 7116 8369
4538H369K4122J9566n1999k5676R710j4660K3842j8642m9744J9098L2627k4570
$$ 8369 32491 52057 58 -25618 -15908 -30568 -6726 -25368 -75112 -56014 -23387 -47957
4526d7957j1373n159J440N987M3998j2340L7227R964k3135J2844J0378q073k7443
$$ -47957 -59330 -64489 -63049 -57062 -13064 -25404 11823 21787 -1348 11496 21874 13801 -13642
4513a3642K1220m832n8343L8615L7508m8864j2149K6808O6372L356k7731N107
$$ -13642 7578 2746 -55597 -16982 20526 -28338 -40487 -13679 52693 56049 28318 33425
4501C3425l3042K8971n2280k4362L5898J9423J6242M2149l9558m7188k4813m9573
$$ 33425 383 29354 -22926 -47288 -11390 8033 24275 66424 26866 -20322 -45135 -94708
4489i4708M003K2480l9071Q488P8973L5120L4523l2660m1179j9337N666N5740
$$ -94708 -90705 -68225 -107296 -98808 -19835 15285 49808 17148 -24031 -43368 -37702 18038
4477A8038J8990l1338J5047j8772l2608j6379p215K3960J0305P2657j6368k0103
$$ 18038 37028 5690 20737 1965 -30643 -47022 -54237 -30277 -19972 52685 36317 16214
4465A6214m3123k774k2447M58l8973M2724O3061n2379J0233L3251L3035l394P771
$$ 16214 -26909 -29683 -52130 -51672 -90645 -47921 15140 -37239 -27006 6245 39280 35886 43657
4452D3657j8439J323J1990O696l0264k3354M6144j1928k7724j1167l6545l1549
$$ 43657 25218 26541 38531 45227 14963 -8391 37753 25825 -1899 -13066 -49611 -81160
4440h1160P2990N4562J9302q943m6353j5028l6250l2292j3400K1824m9984J7124
$$ -81160 -8170 46392 65694 56751 10398 -4630 -40880 -73172 -86572 -64748 -114732 -97608
4428i7608J7333K886K5165P3255J319k013K7985j9363O831l2504O298j2075K2923
$$ -97608 -80275 -77389 -52224 21031 22350 20337 48322 28959 35790 3286 9584 -2491 20432
4415B0432k044j2256j5816j0514n887q375j0319q239P209J3593J5066K6390l2934
$$ 20432 18388 6132 -9684 -20198 -26085 -34460 -44779 -53018 -45809 -32216 -17150 9240 -23694
4402b3694k8414N4149o800J7660K3565J1852n6299n6251K7043K4294m7676j8089
$$ -23694 -52108 2041 -4759 12901 36466 48318 -7981 -64232 -37189 -12895 -60571 -78660
4390g8660O2211P7898L839o826j608K7991l0297p6645m3935K6823K3583j3386
$$ -78660 -16449 61449 65288 58462 56854 84845 54548 -22097 -66032 -39209 -15626 -29012
4378b9012N0231R656l5011j6946k8864k456L2644K9461l7719l1489M6334k0030
$$ -29012 21219 30875 -4136 -21082 -49946 -52402 -19758 9703 -28016 -59505 -13171 -33201
4366c3201M045J4485J4857l0776K7408j8339n320k8740l1645J3707K3197K0675
$$ -33201 -29156 -14671 186 -30590 -3182 -21521 -26841 -55581 -87226 -73519 -50322 -29647
4354b9647O2520L355n5720p0319J9556O5330O0008M258P29k7977m8511n8812K7643
$$ -29647 32873 36228 -19492 -89811 -70255 -4925 55083 59341 60070 32093 -16418 -75230 -47587
4341d7587K5812m35j6348q532N380N6954P4729j4634n6458o3153K1700L2391m1828
$$ -47587 -21775 -22210 -38558 -47090 -41710 15244 89973 75339 18881 -44272 -22572 9819 -32009
4328c2009K40K2053P318j9506K8965k5184j4984M754J2778j6900n147j6109l7
$$ -32009 -31769 -9716 -2398 -21904 7061 -18123 -33107 -28353 -15575 -32475 -37622 -53731 -53768
4315e3768R836M778M6045L7007l7912n0789l5444K3638K3850L1416J1998m655
$$ -53768 -43932 -39154 6891 43898 5986 -44803 -80247 -56609 -32759 -1343 10655 6000
4303F000R735j9187j4386j7789k1676k7668r18J7617o071R764J4539J1032J9732
$$ 6000 15735 -3452 -17838 -35627 -57303 -84971 -85889 -68272 -74343 -64579 -50040 -39008 -19276
4290a9276k2426l4285J9353N4552K6723k1395K416l3024m9668L6431K9931j098
$$ -19276 -41702 -75987 -56634 -2082 24641 3246 5662 -27362 -77030 -40599 -10668 -11766
4278a1766l0530N5463M8387j7575l2861k4759q573K7238J3250k3585J4834j7527
$$ -11766 -42296 13167 61554 43979 11118 -13641 -22214 5024 18274 -5311 9523 -8004
4266h004Q293l7641k1909M8639l349r947j1555o774K4683M3579M939p6424j5689
$$ -8004 289 -37352 -59261 -10622 -13971 -23918 -35473 -42247 -17564 26015 30954 -45470 -61159
4253f1159l366R906K9048L6719J7339L1764j9677p2200k5195M566L1502K7392
$$ -61159 -64525 -54619 -25571 11148 28487 60251 40574 -31626 -56821 -52255 -20753 6639
4241F639k3123R675j0469J1591J4421L4661j317J9560L0164k5317N1536j9160
$$ 6639 -16484 -6809 -17278 -5687 8734 43395 42078 61638 91802 66485 118021 98861
4229I8861k7173o3358j05J8726l0113r3118K1758J5841L4110K2230L5248j3814
$$ 98861 71688 8330 8225 26951 -3162 -96280 -74522 -58681 -24571 -2341 32907 19093
4217A9093N396N295m5405r548J0898j0662p0502J558J4160L1800O416k041J0638
$$ 19093 24489 29784 -15621 -25169 -14271 -24933 -95435 -93877 -79717 -47917 -41501 -43542 -32904
4204c2904L8798N908k1572k7523j5981J1110L10K048k3964K4862L7755R678k0170
$$ -32904 5894 11802 -9770 -37293 -53274 -42164 -41854 -39806 -63770 -38908 -1153 8525 -11645
4191a1645M3298N4113J6952L366q1065l1106j6591J7726O209j2053K7521q015
$$ -11645 31653 85766 102718 106084 25019 -6087 -22678 -4952 1257 -10796 16725 8710
4179H710j7778L8941J7637J0281j3278n3273j6849L6072N6857k8158K9724M0581
$$ 8710 -9068 29873 47510 57791 44513 -8760 -25609 10463 67320 39162 68886 109467
4167A09467L4253j7997k3748o3459j5896l942n3231p6603j803M7319L4369M774
$$ 109467 143720 125723 101975 38516 22620 18678 -34553 -111156 -112959 -65640 -31271 -26497
4155b6497K7306j4195l7408p450P354R706N1668M572j580K1550J6841k1040n7957
$$ -26497 809 -13386 -50794 -58244 -50890 -41184 10484 15056 13476 35026 51867 30827 -27130
4142b7130j6271P543k5855j9618K0483M655L4004N690K949l608l5074J5040J4544
$$ -27130 -43401 -35858 -61713 -81331 -60848 -56193 -22189 -16499 -13550 -17158 -52232 -37192 -22648
4129b2648M1654K5366o7870m2527m9477m0549L6837K1143j138j3437K0742M123
$$ -22648 19006 44372 -23498 -66025 -115502 -156051 -119214 -98071 -99209 -112646 -91904 -87781
4117h7781O9912K0408p819j760J564Q90L8536K7156j8921j1747R063k311J7609
$$ -87781 -17869 2539 -5280 -7040 -5476 -4586 33950 61106 42185 30438 39501 37190 54799
4104E4799k1003p2113n0288J6317Q8201K5417j0270q263K443k5950L6129L3446
$$ 54799 33796 -38317 -88605 -72288 15913 41330 31060 22797 25240 -710 35419 68865
4092F8865q459n407o152k836k7717q570m6571J434K6257J8027k1064l700K1574
$$ 68865 60406 54999 48847 46011 18294 9724 -36847 -35413 -9156 8871 -12193 -15893 5681
4079E681j7402N0890k5729j4417j1977Q093J4530q569M0741l0101k0394j9541
$$ 5681 -11721 39169 13440 -977 -12954 -4861 9669 1100 41841 11740 -8654 -28195
4067b8195J560K7102J91n3167K8838L9747J9329K1781j6918p1447k104K4268j013
$$ -28195 -26635 467 658 -52509 -23671 16076 35405 57186 40268 -31179 -33283 -9015 -10028
4054a0028k1094N7348q677n8316L2876L8920m1044j1159O114J8771N093K0440
$$ -10028 -31122 26226 17549 -40767 -7891 31029 -10015 -21174 -15060 3711 8804 29244
4042B9244p574l7637M4489K3807m9373m6123j6579J2310L7458J1420M900j3004
$$ 29244 21670 -15967 28522 52329 2956 -43167 -59746 -47436 -9978 1442 6342 -6662
4030f662M3221P116j6842J8189m4997k4179k997n430k0934J099k603O786N9840
$$ -6662 36559 43675 26833 45022 25 -24154 -27151 -32581 -53515 -52416 -55019 -48233 11607
4017A1607L6968k001l288l0512j6463K2887p521k7555l2596J7291Q0363j0083
$$ 11607 48575 46574 43286 12774 -3689 19198 11677 -15878 -48474 -31183 49180 39097
4005C9097o7533Q59K0218n1n22l7782N2249J1502N632o59l6514K2475J532m5696
$$ 39097 -28436 -27577 -7359 -7410 -7932 -45714 6535 18037 23669 23010 -13504 8971 10503 -35193
3991c5193r924M2306L2464j7070k6941L3761J6509j8717j8388M717K372j1847
$$ -35193 -45117 -2811 29653 12583 -14358 19403 35912 17195 -1193 3524 5896 -5951
3979e951L7695K932k9126K718L7996M6850p419m4021m3008Q37J6568J9013n066
$$ -5951 31744 34676 5550 8268 46264 93114 85695 41674 -1334 -497 16071 35084 30018
3966C0018k0048o181M6586J6791l3981Q856K8506m0924m2986j125M3129k6157
$$ 30018 9970 3789 50375 67166 33185 42041 70547 29623 -13363 -14488 28641 2484
3954B484j3894l4355K3901K6998J4367m2990n9462K5653j7985k8546K4531l254
$$ 2484 -11410 -45765 -21864 5134 19501 -23489 -82951 -57298 -75283 -103829 -79298 -82552
3942h2552J0735R564P565r47j1941j7477J4051k6463k3216O7698O2995L9139j2687
$$ -82552 -71817 -62253 -54688 -55635 -67576 -85053 -71002 -97465 -120681 -52983 10012 49151 36464
3929C6464m9967K3046r35M279L040K8061k419L328O692k8205k0863L919K38m0042
$$ 36464 -13503 9543 8608 12887 15927 43988 41569 44897 51589 23384 2521 6440 6678 -33364
3915c3364k4569J7722N1006O242M969l170K326K0644K2193r070k6193l0336j2877
$$ -33364 -57933 -40211 10795 17037 22006 18836 21162 41806 63999 54929 28736 -1600 -14477
3902a4477j2411Q873N261m044L9960j801N757k7144o4638J2926M7779L0823K5496
$$ -14477 -26888 -18015 -12754 -16798 23162 21361 27118 -26 -64664 -51738 -3959 26864 52360
3889E2360j4898l1010k5869m4887K554L8446k8476m1713K5778m4073n651P5221
$$ 52360 37462 6452 -19417 -64304 -61750 -23304 -51780 -93493 -67715 -111788 -117439 -42218
3877d2218K7382R235r795k9876r625j4875J634K1255l5262j2452M5036K6596l3380
$$ -42218 -14836 -5601 -15396 -45272 -54897 -69772 -68138 -46883 -82145 -94597 -49561 -22965 -56345
3864e6345j6100O8231K9353n0350k6131j0319Q299L8051k1103j4123n0667k3205
$$ -56345 -72445 -4214 25139 -25211 -51342 -61661 -53362 -15311 -36414 -50537 -101204 -124409
3852a24409L0583K9299K8807J3499N9325J2931n0141P806L6466N295Q459J6800
$$ -124409 -93826 -64527 -35720 -22221 37104 50035 -106 7700 44166 49461 57920 74720
3840G4720j3788n8953L753J7347M207j8947o7107K4405j355k9130P4425N0277
$$ 74720 60932 1979 5732 23079 27286 8339 -58768 -34363 -35718 -64848 9577 59854
3828E9854j3109q311n410p401k8534J2489j4369l1602j4401M544J8821K3971q062
$$ 59854 46745 38434 33024 25623 -2911 9578 -4791 -36393 -50794 -46250 -27429 -3458 -11520
3815a1520n6092j1264J7751m251L8713K2091l953j7543M633M925K2897M5482K8168
$$ -11520 -67612 -78876 -61125 -65376 -26663 -4572 -8525 -26068 -21435 -16510 6387 51869 80037
3802H0037k0678k7480j590p2376J4463n251j7488L5034L0492K0088l9556j7636
$$ 80037 59359 31879 30289 -42087 -27624 -32875 -50363 -15329 15163 35251 -4305 -21941
3790b1941N9443N8064J1132m5782q3792J4791L2958N5128l2564l5497J7472n6385
$$ -21941 37502 95566 106698 60916 -22876 -8085 24873 80001 47437 11940 29412 -26973
3778b6973J8448L5302J1423r8210J8287J5050K1946j2467n0642J3247J7470J688
$$ -26973 -8525 26777 38200 -60010 -41723 -26673 -4727 -17194 -67836 -54589 -37119 -35431
3766c5431M7489J8754j5212j2945L466k1176M44K6608k7532m4459n000J9521p347
$$ -35431 12058 30812 15600 2655 6121 -15055 -14611 11997 -15535 -59994 -64994 -45473 -52820
3753e2820l6769J7993O2734J2650o443k984K0198J6826J5930j8712j9853l507
$$ -52820 -89589 -71596 -8862 3788 -2655 -5639 14559 31385 47315 28603 8750 5243
3741E243j6298l0181j1719K027J0326J9358o31j8417J7012p031r102k0040K611
$$ 5243 -11055 -41236 -52955 -50928 -40602 -21244 -21875 -40292 -23280 -30311 -39413 -59453 -56842
3728e6842M6561M6066L028J1987l0266o749J9264r263j809l3318l5230j4449J6987
$$ -56842 -10281 35785 38813 50800 20534 13785 33049 23786 21977 -11341 -46571 -61020 -44033
3715d4033k9320K3181P4310N0377j3768n1745l5647j5131J1723J5865o809m0934
$$ -44033 -73353 -50172 24138 74515 60747 9002 -26645 -41776 -30053 -14188 -20997 -61931
3703f1931j1557N3504N5261K5411J9239L52l7403m9161n489J9870k1785n1545
$$ -61931 -73488 -19984 35277 60688 79927 80279 42876 -6285 -11774 8096 -13689 -65234
3691f5234J175P3730J0271j6590Q743M439k3830j4906q098L9056L9646n300m2977
$$ -65234 -64059 9671 19942 3352 12095 16534 -7296 -22202 -30300 8756 48402 43102 125
3678A25J2349m09J8251J7975K2622o655n6853k3044K9892K8217R961K5597j5321
$$ 125 12474 12065 30316 48291 70913 64258 7405 -15639 14253 42470 52431 78028 62707
3665F2707o5070J0841p901O275k0108O548k7835q3k9l9942j3823P870N7221l993
$$ 62707 -2363 8478 577 6852 -13256 -6708 -34543 -34626 -34655 -74597 -88420 -80550 -23329 -27322
3651b7322o1124k5135O0594P2548l8451m4428K389k3007K4512K7543J2463j1062
$$ -27322 -88446 -113581 -52987 19561 -18890 -63318 -60929 -83936 -59424 -31881 -19418 -30480
3639c0480l0767M4137L9463J0414O643K0694k9054l8386k0224K3155j3344k1396
$$ -30480 -61247 -17110 22353 32767 39410 60104 31050 -7336 -27560 -4405 -17749 -39145
3627c9145P133M5770J2921k180J9445j5875o542L0219j1625j3859o656P177j444
$$ -39145 -32012 13758 26679 24499 43944 28069 21527 51746 40121 26262 19606 26783 25339
3614B5339n4552m8832N582p832R562N3916N8288j304p393K7474m176J8110r805
$$ 25339 -29213 -78045 -72463 -80295 -70733 -16817 41471 40167 32774 60248 56072 74182 64377
3601F4377j0025j6340j9541J3944l7665R689k166K8885M3974Q704J6687j6732
$$ 64377 54352 38012 18471 32415 -5250 4439 2273 31158 75132 83836 100523 83791
3589H3791l9740k0191K6208J2025m575k6409m6650Q861J0621K8578J4116m4565
$$ 83791 44051 23860 50068 62093 57518 31109 -15541 -6680 3941 32519 46635 2070
3577B070l4882L8944j8403L0147j860J00l593L5365J0990n2384n2612O685L204
$$ 2070 -32812 6132 -12271 17876 16016 16116 12523 47888 58878 6494 -46118 -39433 -36229
3564c6229J0043J8233j2210m0760M183K9413k2312K2139J5877l3805k6367J03700
$$ -36229 -26186 -7953 -20163 -60923 -56740 -27327 -49639 -27500 -11623 -45428 -71795 31905
3552C1905J6849j8043j070j8490j5961m8773O62K4303M668L7779N4333k4111m1833
$$ 31905 48754 30711 29641 11151 -4810 -53583 -52921 -28618 -23950 13829 68162 44051 2218
3539B218q945m7337K7654M8106l6504p4950J938L7995K9209J0564k4259k191K1731
$$ 2218 -6727 -54064 -26410 21696 -14808 -89758 -87820 -49825 -20616 -10052 -34311 -36502 -14771
3526a4771J291J8844J2213M5516q303l7427Q267J3991n202j8515k2063N629L017
$$ -14771 -13480 5364 17577 63093 54790 17363 25630 39621 34419 15904 -6159 -530 2487
3513B487M3969N3174j2616k5094j6137j4336M500l0493P770M2077j8023J4795
$$ 2487 46456 99630 87014 61920 45783 31447 35947 5454 13224 55301 37278 52073
3501E2073J6694J6719l3492n2744L7277K1331J2981o6269j5183J8641J7934j3968
$$ 52073 68767 85486 51994 -750 36527 57858 70839 4570 -10613 8028 25962 11994
3489A1994J8817J0789p625p132j9013k7195P4139l2092k6687N8021N8237R777
$$ 11994 30811 41600 33975 26843 7830 -19365 54774 22682 -4005 54016 112253 122030
3477A22030n0175k6539Q421m9889k131O792N598j5965Q552k0815L0619j6942k8904
$$ 122030 71855 45316 53737 3848 1717 8509 14107 -1858 6694 -14121 16498 -444 -29348
3464b9348J0142N412m7275j0575O6698Q2836K3982M9056m2628o0049L348M479
$$ -29348 -19206 -13794 -61069 -71644 -4946 77890 101872 150928 108300 48251 51599 56078
3452E6078P009K9364k8637m9707p041J6164J0867K1987J1811k8309k3420j2953
$$ 56078 63087 92451 63814 14107 7066 23230 34097 56084 67895 39586 16166 3213
3440C213J2223N976m7712j2673N3601j060k5225L1617J3190K8371K275l6183j8141
$$ 3213 15436 21412 -26300 -38973 14628 13568 -11657 19960 33150 61521 63796 27613 9472
3427I472K9447p281j0756K8851k5599n3978J1093j5606j5482J0209k3045K492
$$ 9472 38919 31638 20882 49733 24134 -29844 -18751 -34357 -49839 -39630 -62675 -60183
3415f0183N8543L1846k8960l4120L289J20478l1224m0278l5838r38q275L917J0507
$$ -60183 -1640 30206 1246 -32874 -29585 90893 59669 19391 -16447 -17385 -25660 -21743 -11236
3402a1236j5817p654M5191k3772k4919l8745j5634J0205k1522l1242J3011J9362
$$ -11236 -27053 -34707 10484 -13288 -38207 -76952 -92586 -82381 -103903 -135145 -122134 -102772
3390a02772j9780L62Q6507N9477K4643J892l2144l0780Q146M1733j8573N381L4786
$$ -102772 -122552 -122190 -35683 23794 48437 50329 18185 -12595 -4449 37284 18711 24092 58878
3377E8878j8446l6384J6087J1476j7927l1979R907N871J2479k1907L1812j310
$$ 58878 40432 4048 20135 31611 13684 -18295 -8388 -2517 9962 -11945 19867 18557
3365A8557r674K0153K1534N734l6118n41j1766L5788k3246l5351m5363j53l9343
$$ 18557 8883 29036 50570 56304 20186 19645 7879 43667 20421 -14930 -60293 -60446 -99789
3352i9789j6885M9046N3211L4112L632j0739j007J7546l0650O0751N2295k7768
$$ -99789 -116674 -67628 -14417 19695 23327 12588 11581 29127 -1523 59228 111523 83755
3340H3755R654M1766l1836k7394L5621p352q8021m7537j1259K4955n9556J3750
$$ 83755 93409 135175 103339 75945 111566 104214 16193 -31344 -42603 -17648 -77204 -63454
3328f3454J8199L3413l1558M8228O296j8550l8392n9345K437K7150K0105L5646
$$ -63454 -45255 -11842 -43400 4828 11124 -7426 -45818 -105163 -102726 -75576 -55471 -19825
3316a9825J1564J9193K42m5172j6037J9393M8666n1596n3412P0023J1139k5541
$$ -19825 -8261 10932 11174 -33998 -50035 -30642 18024 -33572 -86984 -16961 -5822 -31363
3304c1363N0631J478K853O301M3556q212K426j9397m6118k1495l7208M3933M5938
$$ -31363 19268 20746 23599 29900 73456 65244 67670 48273 2155 -19340 -56548 -12615 33323
3291C3323k3105k9948k5239L5929K1964p147l8855n070N0040O0620m8313m8052
$$ 33323 10218 -19730 -44969 -9040 12924 5777 -33078 -38148 11892 72512 24199 -23853
3279b3853l1550m0268k6439M2530N4425M2923K5451k6603o3020m2582O0636O0958
$$ -23853 -55403 -95671 -122110 -79580 -25155 17768 43219 16616 -46404 -88986 -28350 32608
3267C2608k681k1811l5854k2998O8128L5603j546n5477J6269K7741J4875M0154
$$ 32608 29927 8116 -27738 -50736 17392 52995 51449 -4028 12241 39982 54857 95011
3255I5011l4906q5069J5429Q614J7798r360j6806l6853m951K0632M3627M2433
$$ 95011 60105 -24964 -9535 -921 16877 7517 -9289 -46142 -51093 -30461 13166 55599
3243E5599J8480J4420l7255m9341k2338n1673k0285k0921j7628M1434O1093J8169
$$ 55599 74079 88499 51244 1903 -20435 -72108 -92393 -113314 -130942 -89508 -28415 -10246
3231a0246J458l4992q968o7691j5498L6460J6216P6720L8140J9046m6169l4695
$$ -10246 -8788 -43780 -52748 -120439 -135937 -99477 -83261 -6541 31599 50645 4476 -30219
3219c0219J1151L807L5492N0665j635j5340N355M9384K732q1517n1112J1541l5950
$$ -30219 -19068 -15261 20231 70896 69261 53921 59276 108660 111392 29875 -21237 -9696 -45646
3206d5646J435J087K3411m6233j1682O7084r261l3218J6921K4757L346n649N652
$$ -45646 -44211 -43124 -19713 -65946 -77628 -10544 -19805 -53023 -36102 -11345 -7999 -13648 -7996
3193g996p210L9770m458k2130l3058m2188Q953K8670L6918l1791n161K8779l2371
$$ -7996 -15206 24564 20106 -2024 -35082 -77270 -68317 -39647 -2729 -34520 -39681 -10902 -43273
3180d3273J6970O628j2449l383M0099L2402j0436r665R480n1827m3167k7203j4724
$$ -43273 -26303 -19675 -32124 -35507 4592 36994 26558 16893 26373 -25454 -68621 -95824 -110548
3167a10548K9129M4239M7360M9972M4993j080n161l9371q0007m955K7451J3144
$$ -110548 -81419 -37180 10180 60152 105145 104065 98904 59533 -20474 -25429 2022 15166
3155A5166N20J1077k8643m5159j9288K587K6941k883N353K9485j7269n0616l3878
$$ 15166 15686 26763 -1880 -47039 -66327 -63740 -36799 -39682 -34329 -4844 -22113 -72729 -106607
3142a06607M196M9956O054k3844j8581M975O0556O208m93J5553J393o4693l0263
$$ -106607 -102411 -52455 -46401 -70245 -88826 -83851 -23295 -17087 -17580 -2027 -634 -65327 -95590
3129i5590J2318M8358K7220O0449j4990L468o1189l8572P6852K4779j4295L1545
$$ -95590 -83272 -34914 -7694 52755 37765 41233 -19956 -58528 18324 43103 28808 60353
3117F0353R064J4650J6545L0424l213m7719n7270m8166n6183j2497K9657N7627
$$ 60353 69417 84067 100612 131036 127823 80104 22834 -25332 -81515 -94012 -64355 -6728
3105f728j2992j7458L9844O883m113n3820R143J606r456l8976o728N5810N5152
$$ -6728 -19720 -37178 2666 9549 5436 -48384 -39241 -37635 -47091 -86067 -92795 -36985 18167
3092A8167l5570k9872J2177P2992L7600L526M124o061l3839j3352l4750l0295
$$ 18167 -17403 -47275 -35098 37894 75494 79020 83144 77083 43244 29892 -4858 -35153
3080c5153J2941Q436j7968k282K1926J5615L6672K6203m5891n1651J5495M7739
$$ -35153 -22212 -13776 -31744 -34026 -12100 3515 40187 66390 20499 -31152 -15657 32082
3068C2082l8017o3421J3782J7349M0401J4754R701j7458j0222K2524j9793J431
$$ 32082 -5935 -69356 -55574 -38225 2176 16930 26631 9173 -1049 21475 1682 3113
3056C113l1571j1028K1853K6094k6045m1959o659K5996M1476J9997p5919k9273
$$ 3113 -28458 -39486 -17633 8461 -17584 -59543 -66202 -40206 1270 21267 -54652 -83925
3044h3925P0649K4461K8144M4452m5869m6515m1322J2452M5070l197K5690M9838
$$ -83925 -13276 11185 39329 83781 37912 -8603 -49925 -37473 7597 4400 30090 79928
3032G9928k3874l0837k3992p667O714K2867L6512j6861j3175l2176Q188N0152
$$ 79928 56054 25217 1225 -6442 272 23139 59651 42790 29615 -2561 5627 55779
3020E5779R844j940O939k1020j3594K1347J7231l5367l2419J5620M5220K3761
$$ 55779 65623 63683 70622 49602 36008 57355 74586 39219 6800 22420 67640 91401
3008I1401k0895k6688k2579n7859l1570J7378K1894q972j2301J3555N9704L2884
$$ 91401 70506 43818 21239 -36620 -68190 -50812 -28918 -37890 -50191 -36636 23068 55952
2996E5952o8430l0152N8379k6901J1586L1764K2231j4057l4226l3867l3664K9625
$$ 55952 -12478 -42630 15749 -11152 434 32198 54429 40372 6146 -27721 -61385 -31760
2984c1760P4579L1469l3083k8978J6160N50K8783L7271l8842j1305k9870k4763
$$ -31760 42819 74288 41205 12227 28387 28937 57720 94991 56149 44844 14974 -9789
2972i789R98J0045k4201L9240Q566p263K9525N4295M434q468k3155K0672K356
$$ -9789 -8791 1254 -22947 16293 24859 17596 47121 101416 105850 97382 74227 94899 97255
2959I7255l4424j2413J2454p203o0405J1560M2392j491l2024j9678j3117J9459
$$ 97255 62831 50418 62872 55669 -4736 6824 49216 47725 15701 -3977 -17094 2365
2947B365L8513j8689K9241p30l5521j3900k1654k9514L1840L1105K1864P383j6166
$$ 2365 40878 22189 51430 50700 15179 1279 -20375 -49889 -18049 13056 34920 42303 26137
2934B6137j192k9078P026L597n047k679J6215K50j8475M697m56j1832k6315k7021
$$ 26137 24945 -4133 2893 6490 1443 -1236 14979 15229 -3246 1451 995 -10837 -37152 -64173
2920f4173K6636M2586K4571K2123L1395j0668k5253k2349N3392L492m9646n4885
$$ -64173 -37537 5049 29620 51743 83138 72470 47217 24868 78260 81752 32106 -22779
2908b2779m342p153k5702m343L1152N814j8067Q945J048p21K2873L5099Q140L271
$$ -22779 -27121 -34274 -59976 -64319 -33167 -27353 -45420 -36475 -35427 -36148 -13275 21824 29964 33235
2894C3235K8354P0419o240l0988l2387j5427K1289L1790k7532m6659j5305J6976
$$ 33235 61589 132008 125768 94780 62393 46966 68255 100045 72513 25854 10549 27525
2882B7525j9209j729l0629l5052j7801K0722L2713j3953L3933K364j8093l8184
$$ 27525 8316 6587 -24042 -59094 -76895 -56173 -23460 -37413 -3480 -1116 -19209 -57393
2870e7393n1257O1581Q6924L7984j6047r822r055J5539q140j3729k8l8385m6789
$$ -57393 -108650 -47069 39855 77839 61792 51970 42915 58454 50314 36585 36557 -1828 -48617
2857d8617J194K1016L0111J7643N4761m525j0036q805k6030o7353O197O3107K1689
$$ -48617 -47423 -26407 3704 21347 76108 71583 61547 52742 26712 -40641 -34444 28663 50352
2844E0352J4881k4256k667N5260l738m1934k3626j9205J4325O26K7059k8163n018
$$ 50352 65233 40977 38310 93570 89832 47898 24272 5067 19392 20018 47077 18914 13896
2831A3896k0664j6894J1669J1330j4211n525Q316J1333M551o628l472J4195k603
$$ 13896 -6768 -23662 -11993 -663 -14874 -20399 -12083 -750 3801 -2827 -6299 7896 5293
$$ [...]
##END NTUPLES=NMR SPECTRUM
##END=
