##TITLE=Analysis number 316824
Compound Code mo 01029
Project Code adrs
Chemist Name infarmatik
##JCAMPDX= 6.0         $$ Bruker NMR JCAMP-DX V2.0
##DATA TYPE= NMR SPECTRUM
##DATA CLASS= NTUPLES
##ORIGIN= Bruker BioSpin GmbH
##OWNER= nmr
$$ XWIN-NMR		Version 3.5
$$ Fri Jan 27 10:00:29 2006 GMT Standard Time (UT+0h)  MAYBRIDGE\nmr@NMR_250MHZ
##.OBSERVE FREQUENCY= 250.131544655141
##.OBSERVE NUCLEUS= ^1H
##.ACQUISITION MODE= SIMULTANEOUS (DQD)
##.ACQUISITION SCHEME= undefined
##.AVERAGES= 16
##.DIGITISER RES= 18
##SPECTROMETER/DATA SYSTEM= dpx250
##.PULSE SEQUENCE= zg30
##.SOLVENT NAME= CDCl3
##.SHIFT REFERENCE= (INTERNAL, CDCl3, 0, 16.522)
##AUDIT TRAIL= $$ (NUMBER, WHEN, WHO, WHERE, WHAT)
$$ ##TITLE= Audit trail, XWIN-NMR		Version 3.5
$$ ##JCAMPDX= 5.01
$$ ##ORIGIN= Bruker BioSpin GmbH
$$ ##OWNER= nmr
$$ C:\u/data/dgb/nmr/ADRS/15270/pdata/1/auditp.txt
$$ ##AUDIT TRAIL=  $$ (NUMBER, WHEN, WHO, WHERE, WHAT)
(   1,<2006-01-27 09:59:21.77 +000>,<MAYBRIDGE\nmr>,<NMR_250MHZ>,
      <created by zg, POWCHK disabled, PULCHK disabled
       configuration hash MD5:
       62 19 C7 07 E1 42 D1 B7 37 6C 3D D0 77 39 F9 E6
       data hash MD5: 64K
       DA DA 3B A1 6A 0C 0B 3A C2 90 76 D0 29 2B FE 89>)
(   2,<2006-01-27 09:59:48.40 +000>,<MAYBRIDGE\nmr>,<NMR_250MHZ>,
      <Start of raw data processing
       ef LB = 0.3 FT_mod = 6 PKNL = 1 SI = 32K 
       data hash MD5: 32K
       6E 5D 4C D6 D4 D4 AB 9F 9B 71 10 28 36 82 6C 1A>)
(   3,<2006-01-27 09:59:52.95 +000>,<MAYBRIDGE\nmr>,<NMR_250MHZ>,
      <apk 
       data hash MD5: 32K
       C4 43 56 B4 7C B7 58 43 03 07 EE F6 11 E5 A5 4F>)
(   4,<2006-01-27 09:59:54.99 +000>,<MAYBRIDGE\nmr>,<NMR_250MHZ>,
      <abs ABSG = 5 
       data hash MD5: 32K
       B6 26 80 45 49 5A 45 E6 EC E5 A8 19 2C 95 1D 93>)
$$ ##END=
$$ 
$$ hash MD5
$$ 2B EF 9F E3 C8 31 7A 94 11 84 25 12 30 6C 25 2E
##$RELAX= 
##$RELAX= 
##$RELAX= 
##$RELAX= 
##$RELAX= 
##$RELAX= 
##$RELAX= 
$$ Bruker specific parameters
$$ --------------------------
##$DU= <C:\u>
##$EXPNO= 15270
##$NAME= <ADRS>
##$PROCNO= 1
##$TYPE= <nmr>
##$USER= <dgb>
##$AMP= (0..31)
100 100 100 100 100 100 100 100 100 100 100 100 100 100 100 100 100 100 
100 100 100 100 100 100 100 100 100 100 100 100 100 100 
##$AQSEQ= 0
##$AQ_mod= 3
##$AUNM= <au_zg>
##$AUTOPOS= <44 >
##$BF1= 250.13
##$BF2= 250.13
##$BF3= 250.13
##$BF4= 250.13
##$BF5= 500.13
##$BF6= 500.13
##$BF7= 500.13
##$BF8= 500.13
##$BYTORDA= 1
##$CFDGTYP= 0
##$CFRGTYP= 5
##$CHEMSTR= <none>
##$CNST= (0..31)
1 1 145 1 1 1 1 1 1 1 1 1 1 1 1 1 1 1 1 1 1 1 1 1 1 1 1 1 1 1 1 1 
##$CPDPRG= <>
##$CPDPRG1= <>
##$CPDPRG2= <>
##$CPDPRG3= <>
##$CPDPRG4= <mlev>
##$CPDPRG5= <mlev>
##$CPDPRG6= <mlev>
##$CPDPRG7= <mlev>
##$CPDPRG8= <mlev>
##$CPDPRGB= <>
##$CPDPRGT= <>
##$D= (0..31)
0 1 0 0 0 0 0 0 0 0.06 0 0 0 0 0 0 0.0002 0 0 0 0 0 0 0 0 0 0 0 0 0 0 
0 
##$DATE= 1138355960
##$DBL= (0..7)
120 120 120 120 120 120 120 120 
##$DBP= (0..7)
150 150 150 150 150 150 150 150 
##$DBP07= 0
##$DBPNAM0= <>
##$DBPNAM1= <>
##$DBPNAM2= <>
$$ [...]
##$SUBNAM7= <"">
##$SUBNAM8= <"">
##$SUBNAM9= <"">
##$SW= 20.6930455092707
##$SWIBOX= (0..15)
0 0 3 0 0 0 0 0 0 0 0 0 0 0 0 0 
##$SW_h= 5175.983436853
##$TD= 65536
##$TD0= 1
##$TE= 294.16
##$TE2= 300
##$TE3= 300
##$TEG= 300
##$TL= (0..7)
0 120 120 120 120 120 120 120 
##$TP= (0..7)
150 150 150 150 150 150 150 150 
##$TP07= 0
##$TPNAME0= <>
##$TPNAME1= <>
##$TPNAME2= <>
##$TPNAME3= <>
##$TPNAME4= <>
##$TPNAME5= <>
##$TPNAME6= <>
##$TPNAME7= <>
##$TPOAL= (0..7)
0.5 0.5 0.5 0.5 0.5 0.5 0.5 0.5 
##$TPOFFS= (0..7)
0 0 0 0 0 0 0 0 
##$TUNHIN= 0
##$TUNHOUT= 0
##$TUNXOUT= 0
##$USERA1= <user>
##$USERA2= <user>
##$USERA3= <user>
##$USERA4= <user>
##$USERA5= <user>
##$V9= 5
##$VALIST= <valist>
##$VCLIST= <CCCCCCCCCCCCCCC>
##$VD= 0
##$VDLIST= <DDDDDDDDDDDDDDD>
##$VPLIST= <PPPPPPPPPPPPPPP>
##$VTLIST= <TTTTTTTTTTTTTTT>
##$WBST= 1024
##$WBSW= 4
##$XGAIN= (0..3)
0 0 0 0 
##$XL= 0
##$YL= 0
##$YMAX_a= 360306
##$YMIN_a= -462802
##$ZGOPTNS= <>
##$ZL1= 120
##$ZL2= 120
##$ZL3= 120
##$ZL4= 120
##$ABSF1= 16.522
##$ABSF2= -4.171173
##$ABSG= 5
##$ABSL= 3
##$ALPHA= 0
##$AQORDER= 0
##$ASSFAC= 0
##$ASSFACI= 0
##$ASSFACX= 0
##$ASSWID= 0
##$AUNMP= <proc_1d>
##$AZFE= 0.1
##$AZFW= 0.1
##$BCFW= 0
##$BC_mod= 0
##$BYTORDP= 0
##$COROFFS= 0
##$CY= 12.5
##$DATMOD= 1
##$DC= 0
##$DFILT= <>
##$DTYPP= 0
##$F1P= 14.0000005364418
##$F2P= -0.99999901652339
##$FCOR= 0.5
##$FTSIZE= 32768
##$FT_mod= 6
##$GAMMA= 0
##$GB= 0
##$INTBC= 1
##$INTSCL= 1
##$ISEN= 128
##$LB= 0.3
##$LEV0= 0
##$LPBIN= 0
##$MAXI= 10000
##$MC2= 0
##$MEAN= 0
##$ME_mod= 0
##$MI= 0
##$NCOEF= 0
##$NC_proc= -3
##$NLEV= 6
##$NOISF1= 0
##$NOISF2= 0
##$NSP= 0
##$NTH_PI= 0
##$NZP= 0
##$OFFSET= 16.522
##$PC= 1
##$PHC0= -109.4111
##$PHC1= 5.060572
##$PH_mod= 1
##$PKNL= yes
##$PPARMOD= 0
##$PSCAL= 4
##$PSIGN= 0
##$REVERSE= no
##$SF= 250.13
##$SI= 32768
##$SIGF1= 0
##$SIGF2= 0
##$SINO= 400
##$SIOLD= 32768
##$SREGLST= <1H.CDCl3>
##$SSB= 0
##$STSI= 32768
##$STSR= 0
##$SW_p= 5175.98343685301
##$SYMM= 0
##$S_DEV= 0
##$TDeff= 65536
##$TDoff= 0
##$TI= <Analysis number 999999
Compound Code 99
Book Reference 9
Project Code 9>
##$TILT= no
##$TM1= 0
##$TM2= 0
##$TOPLEV= 0
##$USERP1= <user>
##$USERP2= <user>
##$USERP3= <user>
##$USERP4= <user>
##$USERP5= <user>
##$WDW= 1
##$XDIM= 32768
##$YMAX_p= 288545846
##$YMIN_p= -222684
$$ End of Bruker specific parameters
$$ ---------------------------------
##NTUPLES= NMR SPECTRUM
##VAR_NAME=  FREQUENCY,     SPECTRUM/REAL,   SPECTRUM/IMAG
##SYMBOL=    X,             R,               I
##VAR_TYPE=  INDEPENDENT,   DEPENDENT,       DEPENDENT
##VAR_FORM=  AFFN,          ASDF,            ASDF
##VAR_DIM=   32768,         32768,           32768
##UNITS=     HZ,            ARBITRARY UNITS, ARBITRARY UNITS
##FACTOR=    0.157963299565203, 1,           1
##FIRST=     4132.6476996994, 0,             0
##LAST=      -1043.33573715361, 0,           0
##MIN=       -1043.33573715361, -222684,     0
##MAX=       4132.6476996994, 288545846,     0
$$ Real data points
##PAGE= N=1
##DATA TABLE= (X++(R..R)), XYDATA
$$ [...]
16104A30055k1310M6090n32m6937k463N4450n0104o9616k6893J2132M1114N879
16092G1865r841k1843K2012j2853K102j95j3558j138m5939j2361L5472L1613p966
16079C7370Q713m503p729l1025J6110L8886K9568n4471K486o106j7154J084M1816
16066E5045L2733k7696j6720K1634l7557R63q993N9891L2913J5333N4726l7659
16054A44613M779K4780K927l8383q6517k0483K3408N554n7193l2929j6217L1552
16042a4109K6692L4565N3566J0067J6868l0989k9707L9735j6478L25J5442j0195
16030I5782J3271j4234o145J2428q057p352n7989O899L4292j4274q414K2859p433
16017F1633K0831j8569m3346L951J5747k3426j0122q029j4224J8215M8303k4662
$$ plain form
16104 130055 108745 154835 154303 107366 104903 159353 109249 39633 12740 24872 65986 71865
16092 71865 62024 40181 62193 49340 51442 51247 37689 36551 -9388 -21749 13723 45336 37370
16079 37370 46083 41580 33851 2826 18936 57822 87390 32919 35405 29299 12145 13229 55045
16066 55045 87778 60082 43362 64996 27439 28402 19409 79300 112213 127546 182272 144613
16054 144613 149392 174172 177099 138716 52199 31716 55124 60678 3485 -29444 -45661 -14109
16042 -14109 12583 47148 100714 110781 127649 96660 66953 106688 90210 90535 105977 95782
16030 95782 109053 94819 88674 101102 93045 85693 27704 34603 68895 54621 46207 69066 61633
16017 61633 82464 63895 20549 24500 40247 16821 6699 -1330 -15554 2661 50964 26302
16005B6302K4381O2074o2851r622j8555l241K592r719l2524J7126L7002O052j2759
15992B6258l3502p273j964J2835j9641q811p392l7920L8030L9911m3016k768K3618
15979b1635P3491p418n704k7357j4677J7287j0125n801L652J670n5381l8097M7670
15966d2425M9222j7729J957j0808Q553K446k2847J8220J7316K165J1379k162m7341
15953c2054j0468K4762M405k1611Q025R242l4241l1940Q6270P9437N5815j7901
15941A19741o5014o4851L0492m821n5145K9467R4621J7497k0281m5589L232J2183
15929E1532j6263J7474m869m738k4582k2458n2393j0031q271j4123R789J3264
15917f5669K4229n747j9792j8660k1947L9841j7788K0960Q961L4044L074k0298
$$ plain form
16005 26302 50683 112757 49906 40284 21729 18488 21080 11361 -21163 -4037 32965 39017 26258
15992 26258 -7244 -14517 -16481 -3646 -23287 -32098 -39490 -77410 -39380 531 -42485 -45253 -21635
15979 -21635 51856 44438 38734 11377 -3300 13987 3862 -1939 1713 3383 -51998 -90095 -42425
15966 -42425 6797 -10932 -8975 -19783 -11230 -8784 -31631 -13411 3905 6070 17449 15287 -32054
15953 -32054 -42522 -17760 -13355 -34966 -26941 -17699 -51940 -83880 2390 81827 137642 119741
15941 119741 54727 -10124 20368 15547 -39598 -10131 84490 101987 81706 36117 39349 51532
15929 51532 35269 52743 47874 43136 18554 -3904 -56297 -66328 -74599 -88722 -78933 -65669
15917 -65669 -41440 -47187 -66979 -85639 -107586 -67745 -85533 -64573 -55612 -21568 -18494 -38792
15905c8792J3647M9146J3779l1808l561M8250j8987o1291k1631K2698K7749j5553
15893a6354m5592j7563O873K8034L1241m783l0176K403J6847j6369N4796K9119
15881C8476n1995o4076K7003K7L100J1957l9614j2300N9355K086p280r962L3228
15868i995K0512l0353l3001P461Q619j2952k9469m2220L0166L0982L904M605J0437
15855d1304r326j6312J8966K3734k2141m0178j90N4386N7211k7601j6262O1193
15843D2176q657k9661P51j1043K1461q684j8655o969J8095j764M1672O9701K0185
15830A28608r3336m9500J2731J5892l4898l9861O286J2971J5164P445K6790j0724
15818b432n0759N0055o681o5551j7438k0464K8887L5557J7742n0182o7700J7008
$$ plain form
15905 -38792 -25145 24001 37780 5972 2411 50661 31674 -29617 -51248 -28550 -801 -16354
15893 -16354 -61946 -79509 -72636 -44602 -13361 -18144 -48320 -45917 -29070 -45439 9357 38476
15881 38476 -13519 -77595 -50592 -50565 -47465 -35508 -75122 -87422 -28067 -25981 -33261 -43223 -9995
15868 -9995 10517 -19836 -52837 -45376 -36757 -49709 -79178 -121398 -91232 -60250 -56346 -51741 -41304
15855 -41304 -50630 -66942 -47976 -24242 -46383 -86561 -86751 -32365 24846 -2755 -19017 42176
15843 42176 33519 3858 4609 -6434 15027 6343 -12312 -19281 -1186 -2950 38722 108423 128608
15830 128608 35272 -14228 -1497 14395 -20503 -60364 -54078 -41107 -25943 -18498 8292 -2432
15818 -2432 -53191 -3136 -9817 -75368 -92806 -113270 -84383 -48826 -31084 -81266 -148966 -131958
15806a31958N2743L6591Q9703O490J641k5476k278L4407l1222o3415j2992j7702
15794f3468L378M1946K8984j9840J2345k815L3014p077J0947n20j8249j0554J5088
15781B3179N0148k4168o0911k0868L4300J4993J2672J6906k3743p382l387k8780
15769a7041K1559N4020o1653l5576j0766j1540M9787J4320L1004N9186j4474p5643
15757C183k1150N53o9613J5120L7731K0230Q234J8533K947Q155L8504o4832m6811
15744d9216r679l0070j9040o647L087R080k6443n335P9825k50K7034K7608R987
15731I941L1021P553j0416o196K7650o615K147m2754k963J7261P228r183m5540
15718b0866N217o373K4758n597l2350Q1481l501n0933o0919m7584O2350J5648
$$ plain form
15806 -131958 -79215 -42624 47079 53569 55210 29734 27456 61863 30641 -32774 -45766 -63468
15794 -63468 -60090 -18144 10840 -9000 3345 530 33544 26467 37414 36894 18645 8091 23179
15781 23179 73327 49159 -11752 -32620 1680 16673 29345 46251 22508 15126 11739 -17041
15769 -17041 4518 58538 -3115 -38691 -49457 -60997 -11210 3110 34114 93300 78826 3183
15757 3183 -17967 -17414 -87027 -71907 -34176 -13946 -5712 12821 15768 23923 62427 -2405 -49216
15744 -49216 -58895 -88965 -108005 -114652 -111565 -102485 -128928 -134263 -54438 -54688 -27654 -46 9941
15731 9941 40962 48515 38099 31903 59553 52938 55085 12331 9368 26629 33857 24674 -20866
15718 -20866 -15649 -22022 2736 -2861 -35211 46270 42769 -8164 -69083 -116667 -54317 -38669
15706c8669L9608M7281k4334l8460l8268P490L4J1167O0362l8411n09k649k86
15693a5644Q172n629j1676L2038J1245j6339n3085k531P133j9417k85M3223R858
15680a2937j5248K5666O4423J1655l2565l9554J4773N5506j4075l2770j3821m16
15668A0637j1075j8261o0908N8909N5355j7269k3424J7293J292J3565K0948J9674
15656F6736K085K6544j3570j351J2985M6787k531J8539N700N5644M9226M8049
15644C14843K0553L2182J8148l9654l709j8561q3978L09K2598P823p2144o2966
15632A35444k8816k440k9489m5038J7196O1560l7952r488l3511l4391r302r870
15620b6097j3814L4512p777l0934P17L0006m230J0937L4785L9925M74n2152j0792
$$ plain form
15706 -38669 939 48220 23886 -14574 -52842 -45352 -45318 -34151 26211 -12200 -12709 -15358 -15644
15693 -15644 -7472 -13101 -24777 7261 18506 2167 -50918 -53449 -46316 -65733 -66018 -22795 -12937
15680 -12937 -28185 -2519 61904 73559 40994 1440 16213 71719 57644 24874 11053 10637
15668 10637 -438 -18699 -79607 -20698 34657 17388 -6036 11257 12549 26114 47062 66736
15656 66736 68821 95365 81795 80444 93429 140216 137685 156224 161924 217568 266794 314843
15644 314843 335396 367578 385726 346072 342363 323802 239824 240133 262731 270554 198410 135444
15632 135444 106628 104188 74699 29661 46857 108417 70465 60977 27466 -6925 -16227 -26097
15620 -26097 -39911 -5399 -13176 -44110 -43393 -13387 -17617 -6680 28105 68030 68504 16352 5560
15607E560O435L243j9152N0771M1394j34l8499n9442n2017L1544O465m6927N041
15594f5718K2538N2309J7000J7781K163k9055J8866J8502L9888k0894l8686n8530
15582b3836m5312K3752j5988p1603R113P5043m5421o1681M0012J12186l0226J021
15570c2940M4013j8863n485k7664l2881j4427Q727k1153j463L2826m38J385O9659
15557A296L1662j8645m3427J3951N7271L9371n6400r6468o401M4819K9746p703
15545a0928j1669L2644L6568k3290o3717l9125Q893K710k9396j9853P2831M089
15533d0243o374L7187O352m2281j9061K698K1864K2219L6008k2967p990k9019
15521d1607O772j0818k3126O618M8738n044k1826m6018K4723M8649L772O5345
$$ plain form
15607 5560 11995 15238 -3914 46857 88251 88117 49618 -9824 -61841 -30297 -23832 -70759 -65718
15594 -65718 -43180 9129 26129 43910 46073 17018 35884 54386 94274 73380 34694 -23836
15582 -23836 -69148 -45396 -61384 -132987 -123874 -48831 -94252 -155933 -115921 -3735 -33961 -32940
15570 -32940 11073 -7790 -13275 -40939 -73820 -88247 -79520 -100673 -102136 -69310 -69748 -68363 1296
15557 1296 32958 14313 -29114 -15163 42108 81479 25079 -71389 -77790 -32971 -3225 -10928
15545 -10928 -22597 10047 46615 23325 -40392 -79517 -70624 -67914 -97310 -117163 -44332 -40243
15533 -40243 -46617 -9430 -3078 -45359 -64420 -61722 -39858 -17639 18369 -4598 -12588 -41607
15521 -41607 -34835 -45653 -68779 -62161 -13423 -18467 -40293 -86311 -61588 -12939 -9167 56178
15509E6178L266n3807J6016J3m3775k86K2862l1694P0383L522m7570l8893K5142
15496a8643J4308l5965L4796L1757Q215K2452p585j1955l4362P08N4481r126r515
15483C9566j7480l5967l653M1645J653l1501l1513J1589R940j7678J5576k6041
15471d3864n575J875N1177O4738n6099n8178J299M5806O8607P289n2319p874m224
15458A2658N0935J012n1384k9721j1713J4411L972M353l789m622K913m725k1682
15445c7382M0990J4865K3853K4745p043l8667r7168m6580O4724N9777l3551K0696
15433a0741K3319L313m5960o877K8309K7165o695m6467K2217p545R338M2342J9040
15420E0758k0662N512j2388k5728j8918l840j0569N9151J17603m7399n3496n8215
$$ plain form
15509 56178 59444 5637 21653 21666 -22109 -22395 467 -31227 39156 42678 -4892 -43785 -18643
15496 -18643 -4335 -40300 -5504 26253 34468 56920 49335 37380 3018 3726 58207 49081 39566
15483 39566 22086 -13881 -17534 24111 25764 -5737 -37250 -25661 -15721 -33399 -17823 -43864
15471 -43864 -49439 -47564 3613 68351 12252 -45926 -44627 1179 69786 77075 24756 16882 12658
15458 12658 63593 64605 13221 -16500 -28213 -13802 -9830 -5477 -9266 -13888 -10975 -15700 -37382
15445 -37382 3608 18473 42326 67071 60028 21361 -75807 -122387 -57663 2114 -31437 -10741
15433 -10741 12578 15891 -30069 -36946 -8637 18528 11833 -34634 -12417 -19962 -10624 31718 50758
15420 50758 30096 35608 23220 -2508 -21426 -25266 -35835 23316 140919 93520 40024 -18191
15408a8191o8157l62K5980m9211M9355K4555o5693N491k9323j3323J2636N03j616
15395a27356O340L3767P4877K7615L1468K1982m1163k0071J1758J6110J9309j7849
15383C6787m0634o0342j3571L0994N7003P1461m9401q1527K6370K5384l1411j3432
15371d2319o3186K4261M1693Q468L1988J6085k9730K3036j2O100N0364q318k4587
15358C3843l4052j2870L072j237P28m180O12Q122k2467l6203n5737Q495M9534
15345f2340P8005L9129j7168k4615m3747J4525L4549j117m0224j2738L008K4225
15333h508k91l2550L958N019J8882J5164r53m6715n6060K4196n09K750J9105N0114
15319f398l5690J0495M7277M607o2148k5180k288N0124L3362q190l8727j7404
$$ plain form
15408 -18191 -86348 -86710 -60730 -109941 -60586 -36031 -101724 -96233 -125556 -138879 -126243 -125740 -127356
15395 -127356 -121016 -87249 -12372 15243 46711 68693 27530 7459 19217 35327 54636 36787
15383 36787 -3847 -64189 -77760 -46766 10237 81698 32297 -49230 -22860 2524 -28887 -42319
15371 -42319 -105505 -81244 -39551 -31083 905 16990 -12740 10296 10284 16384 66748 58430 33843
15358 33843 -209 -13079 -10007 -11244 -10516 -14696 -14084 -5962 -28429 -64632 -120369 -111874 -62340
15345 -62340 15665 54794 37626 13011 -30736 -16211 18338 17221 -23003 -35741 -32733 -8508
15333 -8508 -8799 -41349 -37391 -32372 -13490 1674 721 -45994 -102054 -77858 -78367 -75617 -56512 -6398
15319 -6398 -42088 -31593 15684 20291 -41857 -67037 -69325 -19201 14161 5971 -32756 -50160
15307e0160K3226K179k048j487K7724J8542m2822K3994l9982L2032N9690p105
15295D3783j0768L7543L335o8744n023k1225m029M0680J6601l5890p8088N8213
15283b3612q846k7726j7945m2425L2446O2309l6830o9920l6331J6183Q398Q2833
15271f1466N7221M2002P792p3059o6054Q445J0670M3932L145k7483M0485M3008
15259B8638o0739K7519L5115m158j7849j580o3754K5804K930j950k424j4084O0124
15246A3592Q3036l5021o3333O392N1560J2985m0564m1010k2787L5345L721m9286
15234d5370K9346M7656K4367l3232l1187k6206j6953K3291o684j8877k5117N1362
15222b7604l7031m7765k6430r531O7855O9142p440M057K8682P220m5252k4365
$$ plain form
15307 -50160 -26934 -24755 -26803 -28290 -566 17976 -24846 -852 -40834 -8802 50888 43783
15295 43783 33015 70558 73893 5149 126 -21099 -25128 15552 32153 -3737 -81825 -23612
15283 -23612 -32458 -60184 -78129 -120554 -88108 -25799 -62629 -132549 -168880 -152697 -144299 -61466
15271 -61466 -4245 37757 45549 -27510 -93564 -85119 -74449 -30517 -27372 -54855 -14370 28638
15259 28638 -32101 -4582 30533 26375 8526 6946 -56808 -31004 -28074 -30024 -32448 -46532 13592
15246 13592 96628 61607 -1726 4666 56226 69211 28647 -12363 -35150 195 3916 -45370
15234 -45370 -16024 31632 55999 22767 -8420 -34626 -51579 -28288 -34972 -53849 -78966 -27604
15222 -27604 -64635 -112400 -138830 -148361 -80506 -11364 -18804 -14747 13935 21155 -24097 -48462
15210d8462j1850P4038L5893l0640o0526j5096K5270L7662k3939n6393n8559Q624
15198a23978N2506M258p104J6101N5536l6479n5033M672K5032k5762O353K6825
15186e7073L3676L7852p303O810J0768m1569l5169j4564L6106M4259L0226J1302
15174E5321J6599J4332o3761n5937O9758M2937l2403j12057N16Q2208M6728r098
15162E5143M3816o255L4896m866n0277n6292M6342j423o0143Q699j8263j5836
15150b4459L0266J3078o5121l4719L2992N312J0751j8687j2908L4743M2638J0867
15138B4753M6957q636m6213k3770l0837q5801k2652J0025R0807L1958K947p3321
15126h3783p2359k4646L2522L6444J9780O477J0574L4222J2829J5255m7922j3934
$$ plain form
15210 -48462 -60312 13726 49619 18979 -41547 -56643 -31373 6289 -17650 -74043 -132602 -123978
15198 -123978 -71472 -67214 -74318 -58217 -2681 -39160 -94193 -89521 -64489 -90251 -83898 -57073
15186 -57073 -23397 14455 7152 13962 24730 -16839 -52008 -66572 -30466 13793 44019 55321
15174 55321 71920 86252 22491 -33446 36312 79249 46846 -65211 -64695 17513 64241 55143
15162 55143 98959 92704 127600 122734 72457 16165 62507 61084 941 9640 -8623 -24459
15150 -24459 5807 18885 -46236 -80955 -47963 -42651 -31900 -50587 -63495 -28752 13886 24753
15138 24753 71710 63074 16861 -6909 -37746 -123547 -146199 -136174 -45367 -13409 -10462 -83783
15126 -83783 -156142 -180788 -148266 -111822 -92042 -85565 -74991 -40769 -27940 -12685 -60607 -74541
15114g4541K0737J2154L1718L709l7293j1290M19j2135J6320J5847L4372n940
15102e923J7229O979j3114L409M6092m3859k306J1950k8253J6752r278l8684k3196
15089f2202L792J9162k9p170k3348k984P8987P974k1424m160q618L4948M6401
15076F1329K7333N03n6675p5476j3929J0128m82k5802N3846J3961K382N037M0038
15063D2193J4578n5370o5743m6651r227J0854J7691L5513K9920m865j8271P760
15051d1618l7964Q691M6674l519k9857J5274K2414j6528L0222L207p5281j3482
15039i1767L2299J7198J1042M5904l0423o4733J9301J0176k7687N56L0397L8674
15027i063j1216j2432j4401N552l8020j2832K1543J4916l874k9261N883O7393
$$ plain form
15114 -74541 -53804 -41650 -9932 -6223 -43516 -54806 -54387 -66522 -50202 -34355 17 -5923
15102 -5923 11306 18285 5171 8580 54672 10813 8507 20457 -7796 8956 -322 -39006 -62202
15089 -62202 -58410 -39248 -39277 -46447 -69795 -72779 6208 14182 -7242 -11402 -20020 14928 61329
15076 61329 88662 89165 32490 -42986 -56915 -46787 -47269 -73071 -19225 -5264 -2882 2155 42193
15063 42193 56771 1401 -64342 -110993 -120220 -109366 -91675 -56162 -26242 -31107 -49378 -41618
15051 -41618 -79582 -70891 -24217 -27736 -57593 -42319 -19905 -36433 -6211 -3004 -78285 -91767
15039 -91767 -59468 -42270 -31228 14676 -15747 -80480 -61179 -51003 -78690 -78134 -47737 -9063
15027 -9063 -20279 -32711 -47112 -41560 -79580 -92412 -70869 -55953 -59827 -89088 -83205 -15812
15015a5812K8751p718m6248r43R921J6000J8090O2243k1138o1653J6807J4274
15003A2574k1633j975J4620j2477l5198p232J3849J7593k3586N6205k223k2347
14991a1830k288m3974j913M613j5683J9358L0599J6597K8733N3018M2137m2788
14979G6579l7490l4210N2073k1395n0245p799Q966k739n1825N586N2462O0590
14967E0553O2817m0068n8615q722o5447n7242o260O860K0184Q9815M4394p2570
14955c4301k6368J7328P6807K6174k9933m8744J5507L3057J9443n5623l8407L1500
14943a3560L934k4704l2318n4682O224Q015J9275M2920N665J8379L0822n9630
14931d9660m3536k8015p170M3393M593q157K6255K1818J6311j3632J757K165L204
$$ plain form
15015 -15812 12939 5221 -41027 -41970 -32049 -16049 2041 64284 43146 -18507 -1700 12574
15003 12574 -9059 -11034 3586 -8891 -44089 -51321 -37472 -19879 -43465 12740 10517 -11830
14991 -11830 -14118 -58092 -60005 -55392 -71075 -51717 -21118 -4521 24212 77230 119367 76579
14979 76579 39089 4879 56952 35557 -14688 -22487 -13521 -16260 -68085 -62499 -10037 50553
14967 50553 113370 73302 14687 5965 -59482 -116724 -122984 -116124 -95940 -6125 38269 -34301
14955 -34301 -60669 -43341 33466 59640 29707 -19037 -3530 29527 48970 -6653 -45060 -13560
14943 -13560 -9626 -34330 -66648 -121330 -115106 -107091 -87816 -44896 -39231 -20852 9970 -49660
14931 -49660 -93196 -121211 -128381 -84988 -80395 -88552 -62297 -40479 -24168 -37800 -36043 -33878 -30674
14918c0674o724M1842R281l5540p874j7441o813K6833O3738O7371m0768r3566
14906c0335j9285j0725J1584P6557O5821K714l0531j3140l2838o0312m8528n6081
14894a45099m9024K2382O8989L0268J3943k4001M5259r536k1101K1496j8378J3327
14882e1475K6322m0507m979Q933N115p71J3087k5935K1840J9417k5851L986M2966
14869g852M0517K7933o2030j1192J7897m4823l9163q87N9557K298J5675k1713
14857b3783l7795L7506K3067q2925o7061L1015P8021R677l0986L1090K8458J4895
14845A1179L5126M167j1318J3695J2955m3190m4272O2164M5646k2704k5849o6374
14833b8775k0588p234N8589J6292l0180J8315L886O95m4262j1934k473J8451K1268
$$ plain form
14918 -30674 -37398 4444 13725 -21815 -29689 -47130 -53943 -27110 36628 103999 63231 -30335
14906 -30335 -49620 -60345 -48761 27796 93617 96331 65800 52660 19822 -40490 -89018 -145099
14894 -145099 -194123 -171741 -102752 -72484 -58541 -82542 -37283 -46819 -67920 -46424 -64802 -51475
14882 -51475 -25153 -65660 -70639 -61706 -56591 -57362 -44275 -70210 -48370 -28953 -54804 -50818 -7852
14869 -7852 32665 60598 -1432 -12624 5273 -39550 -78713 -79600 -20043 -17745 -2070 -23783
14857 -23783 -61578 -24072 -1005 -83930 -150991 -119976 -41955 -32278 -63264 -32174 -3716 11179
14845 11179 46305 50472 39154 52849 65804 22614 -21658 40506 86152 63448 37599 -28775
14833 -28775 -49363 -56597 1992 18284 -11896 6419 10305 11000 -33262 -45196 -47669 -29218 -7950
14820g950n4362j4843L0055j0986k5058M6885Q963L0859P1751J6533k3665j5903
14808E2279J0266j8020j5395j8946l7373L2433K3635l9715m5015L6983L016p950
14796b3802j5813r260j0935m973N830r783J5095K2105L4538O309L4383J8316l2921
14783B9089o5283j7335L7329O150L2651K7771k5871L0377p5970J3922M838j1342
14771a3674k6010j1292k7441m3370L4547O0201M2538L6597m90Q946p5777p6669
14759i1894m2908M8795M2105j4709R362K0741J0939j7870m1481J4117M2190K5994
14747E381J8992r0556m5408K2026M4192L4628m0940J521N1592m0035m9471K0441
14735f7637L1007j9846j3109m0676L9630M6453L884l2455j0192j7900M9693K0659
$$ plain form
14820 -7950 -62312 -77155 -47100 -58086 -83144 -36259 -27296 3563 75314 91847 68182 52279
14808 52279 62545 44525 29130 10184 -27189 5244 28879 -10836 -55851 -18868 -15852 -23802
14796 -23802 -39615 -48875 -59810 -64783 -58953 -68736 -53641 -31536 3002 9311 43694 62010 29089
14783 29089 -36194 -53529 -16200 -10050 22601 50372 24501 54878 -21092 -7170 -2332 -13674
14771 -13674 -39684 -50976 -78417 -121787 -87240 -27039 15499 52096 51606 60552 -15225 -91894
14759 -91894 -134802 -86007 -43902 -58611 -49249 -28508 -17569 -35439 -76920 -62803 -20613 5381
14747 5381 24373 -66183 -111591 -89565 -45373 -10745 -51685 -50164 1428 -38607 -88078 -67637
14735 -67637 -36630 -56476 -69585 -110261 -70631 -24178 -20294 -52749 -62941 -80841 -31148 -10489
14723a0489P92O095K3950Q751L8240J36p815j7777P32m896k6718j7474j2557k4215
14709d3245j788k5770j8850L3574K6249J1430k9182k0740q843P766J2143N4301
14697b955K9167k0187l381k0522J2439j5872l1009J1818l8869K5072M7048L6647
14685B9396K7835o825J4003l29j5101k1271J6149o993m825n0650m452P2759m0768
14672H928N698J1941m608k5015M7739N2863K1677k1745q3412l0090j6038K8062
14660d000N0400l0419K107K681n1030J3608K9825L4114L3314r292k7011p923j2277
14647B4097j392l5691K2046m996r663j963l5077L8403j3176R012K0520N7400N9343
14634A28863K1075r819j7243n0953m7760L5649L0688k7417m2118Q597j0196m2979
$$ plain form
14723 -10489 -9697 -3602 20348 29099 67339 67475 59660 41883 42615 37719 11001 -6473 -19030 -43245
14709 -43245 -45033 -70803 -89653 -56079 -29830 -18400 -47582 -68322 -77165 -69399 -57256 -2955
14697 -2955 26212 6025 2644 -17878 -5439 -21311 -52320 -40502 -79371 -54299 -7251 29396
14685 29396 57231 50406 64409 64080 48979 27708 43857 36864 32039 -18611 -23063 49696 8928
14672 8928 14626 26567 21959 -3056 44683 97546 119223 97478 14066 -16024 -32062 -4000
14660 -4000 46400 15981 18088 20769 -30261 -16653 13172 47286 80600 71308 44297 36374 24097
14647 24097 22705 -12986 9060 4064 -5599 -7562 -42639 -4236 -17412 -8400 12120 69520 128863
14634 128863 149938 140119 122876 71923 24163 59812 90500 63083 20965 29562 19366 -23613
14622b3613k1523L5664P726l3669K3047q591l6692q589J3027L7064M6310m44R173
14609C8890L5972j00091k1488L8685j6963k6034j0949q732P134K2393j2794L8674
14597a5303J4607n4951j0995M1625L8503K2763L316P429m7011M4851L7194m2679
14585C9349m7493j1098k78J5609m911j278K0716J0376Q242K4329K0708R596j1497
14572G2370k2632o348K3327m3916l8071J6024L785r508K7564m0269l9451O441
14560e0684K8997K9987j8244j4485K1165Q287n5q441p387j1861K4015r72k7696
14547b7374N8753L7196o4175q2915n167K1181k0087q405j1175k3508k7293L1039
14535a21930N2205O7566L0669J307m9737o0074l2932L6602M0323O2555N0603n0722
$$ plain form
14622 -23613 -45136 -9472 -1746 -35415 -12368 -20959 -57651 -66240 -53213 -16149 30161 29717 38890
14609 38890 74862 -25229 -46717 -8032 -24995 -51029 -61978 -70710 -63576 -41183 -53977 -15303
14597 -15303 -696 -55647 -66642 -25017 13486 36249 39565 46994 -17 44834 82028 39349
14585 39349 -8144 -19242 -19520 -3911 -8822 -10100 10616 20992 29234 53563 74271 83867 72370
14572 72370 49738 43390 66717 22801 -15270 754 4539 -4969 22595 -17674 -57125 -50684
14560 -50684 -21687 8300 -9944 -24429 -3264 5023 4968 -3473 -10860 -22721 1294 322 -27374
14547 -27374 31379 68575 4400 -78515 -83682 -62501 -82588 -90993 -102168 -125676 -152969 -121930
14535 -121930 -69725 -2159 28510 29817 -19920 -79994 -112926 -76324 -36001 26554 77157 26435
14523B6435N990j2676K2762M0874L0725l0990m9116l1849m9229k9311j0475K6862
14511e9998J9183K219m7140N96O4766M763k8954O412k6022l5276l8647k4259p322
14498a69679L7670P7813M8936n8959K4175N8294K6183k8792k3237l5244m6918
14487h9758j2280l64N6605Q926K6197r131J0034M444J676j6159K392n009K2991
14474E64J4863K0438L1485p798J872K4658O504j9514k380K8344l7525k9042L77
14461C2846K790L2439N8422l326J1077m0370k5048P073P303p2931p3104m7674
14449a10503j6170O0222K5919L3778M5446j8039k1838K9945L5752n2483k6952
14438a4923L0137m2743l5060O3754L317m4565j5001p07K6230K3422K4492l3936
$$ plain form
14523 26435 32425 19749 42511 83385 114110 83120 34004 2155 -47074 -76385 -86860 -59998
14511 -59998 -40815 -38596 -85736 -85140 -20374 -15611 -44565 -38153 -64175 -99451 -138098 -162357 -169679
14498 -169679 -132009 -54196 -5260 -64219 -40044 18250 44433 15641 -7596 -42840 -89758
14487 -89758 -102038 -102402 -45797 -36871 -10674 -19805 -9771 -5327 -3651 -19810 -17418 -22427 564
14474 564 15427 35865 67350 59552 61424 86082 92586 73072 70692 99036 61511 32469 32846
14461 32846 35636 68075 126497 123171 134248 93878 68830 75903 83206 10275 -62829 -110503
14449 -110503 -126673 -66451 -40532 -6754 38692 20653 -1185 28760 64512 12029 -14923
14438 -14923 15214 -27529 -62589 1165 4482 -40083 -55084 -55791 -29561 -6139 18353 -15583
14426a5583m464k686N8304K9902o4184o1237L4737L6653n851j9583j3940j170
14414b9102M731J2611r738k6831N733L450j9308n2077K6845M0595N3586j4785
14402d290l4524j2649L9387L5418L6348k0125l8282l0575p942R401l0188K6057
14390c1964J5688k8212m0042J2363j5309O7240M1544j2134K6896l3249k9042p195
14378c3416K2050Q1970K7142o5315k1790J1044j0934j0225J4788k0519o3633m8843
14366a17681L9381Q8159L6207o1400q106P5548K1672l8242l3114L0080L0624j1750
14354E1378J37o207k4295l5722L85j9793L8170l32j5053j430J0444j9882r220
14341c1420n400J8177j8084m5818o393n478N441J6756m2053J8194J7872L4162
$$ plain form
14426 -15583 -20047 -22733 35571 65473 1289 -59948 -25211 11442 5591 -13992 -27932 -29102
14414 -29102 -24371 -11760 -21498 -48329 -42596 -39146 -58454 -110531 -83686 -43091 10495 -4290
14402 -4290 -38814 -51463 -12076 23342 59690 39565 1283 -29292 -37234 -27833 -58021 -31964
14390 -31964 -16276 -44488 -84530 -72167 -87476 -20236 21308 9174 36070 2821 -26221 -33416
14378 -33416 -11366 70604 97746 32431 10641 21685 10751 526 15314 -5205 -68838 -117681
14366 -117681 -78300 9859 46066 -15334 -23440 52108 73780 35538 2424 32504 63128 51378
14354 51378 51515 45308 21013 -14709 -14324 -34117 4053 3721 -11332 -12762 -2318 -22200 -31420
14341 -31420 -36820 -18643 -36727 -82545 -88938 -94416 -88975 -72219 -114272 -96078 -78206 -44044
14329d4044P9787M7199K5264l4921m7006k2559n3543q611P480l363L1706K727
14317a9884m430r933K111k5969J0552R979L5790N0338K4407N24n4146m3371j2620
14304c6652j2994J1079K0350O1280j1654J5773k6806M848L0019j4557J2389l9909
14292A3166m6576K1366K5684k480m043j2425k6550L4494J1473p012n6267k1899
14280g1069J340M8036L170k0340M103Q021k620K4319O8445m0323q742p147l8514
14267c1321l3016k2216K4328K1576K2907K7526N7316l797k1531m861J704L897
14255D2512R565K5986j2507M4057n0581j18276k5402Q4025K6745M3107J1496J7353
14243I8080l5062l8829k2656k0077K1025n3074l9820j8127P495L1450j2651J4905
$$ plain form
14329 -44044 35743 82942 108206 73285 26279 3720 -49823 -58434 -50954 -54317 -22611 -19884
14317 -19884 -24314 -34247 -32136 -58105 -47553 -37574 -1784 48554 72961 73485 19339 -24032 -36652
14304 -36652 -49646 -38567 -18217 43063 31409 47182 20376 25224 55243 40686 53075 13166
14292 13166 -33410 -12044 13640 11160 7117 -5308 -31858 2636 14109 7097 -49170 -71069
14280 -71069 -69729 -21693 -18523 -38863 -34760 -26739 -29359 -5040 63405 23082 14340 7193 -31321
14267 -31321 -64337 -86553 -62225 -40649 -17742 9784 67100 63303 41772 36911 38615 42512
14255 42512 52077 78063 65556 109613 59032 -59244 -84646 -621 26124 69231 80727 98080
14243 98080 63018 24189 1533 -18544 2481 -50593 -90413 -108540 -101045 -69595 -82246 -67341
14231f7341M2537j3959o834j0880K444N8338K3241k8325k443N682j6560j7071
14219c1171m1206Q590O7784J7436j2927J0444o4202o637L6659K6096k7090K810
14207a3414P666K0999o098Q40j7111l2959N578l740K3012j1142r270p993L4435
14194i197P1117L3205o2290l9547m9349k907K9597M9867L6753k6826m3979k3774
14182c7330l1300k0729N2387K9074l760L5123r144j3042Q018L5595k7827l9633
14170b2568J852P797R421o41n384K923J9859J0927J2225J4486N6032j8676l8222
14157E0031K5228l0893j09287J3370L7000N4463j1383q674M419j9533l0082J5085
14145a0256M651k5793l7985J7948J6781j1811J4861N985p4917P286N8184J0078
$$ plain form
14231 -67341 -24804 -38763 -45597 -56477 -54033 4305 27546 -779 -3222 2460 -14100 -31171
14219 -31171 -72377 -63787 3997 21433 8506 18950 -45252 -51889 -15230 10866 -16224 -13414
14207 -13414 -5748 15251 9153 9993 -7118 -40077 -34499 -38239 -15227 -26369 -35639 -43632 -9197
14194 -9197 61920 95125 32835 -6712 -56061 -58968 -29371 20496 57249 30423 -13556 -37330
14182 -37330 -68630 -89359 -36972 -7898 -11658 23465 14321 1279 9297 44892 17065 -22568
14170 -22568 -20716 -12919 -3498 -4139 -9523 -6600 13259 24186 36411 50897 106929 88253 50031
14157 50031 75259 44366 -64921 -51551 -14551 39912 28529 19855 24274 4741 -25341 -10256
14145 -10256 -5605 -31398 -69383 -51435 -34654 -46465 -31604 -25619 -100536 -93250 -35066 -24988
14133b4988J8476L2651j984p028k3367K9692L8580k402j172k9780m3256m4989
14121e9567J7890L1287K8509J7940n3372j8625J325L8724N5525J4134l9198n0867
14109a6295j3170L1099P851K5114M0097P085J9827Q244j1311q066l2957l3458
14097B4060p7266m9431J6760r98M3067N9493L751j5941k8000N3987J7612j0316
14085C6778J2605k153l4434m8871m067M85l4335L007K5161J7814K4135K7949K1180
14072D5254l5012k2994J7746M4547J0644l4391l3386O496k3350J2162J1024l458
14060d718p865J992j0260L4761M7309j3136j5717J7699k117m343j5466l9338N5374
14047D4175l6566O083k522o8742o6928j9459J1917P0242L4739N185k6339q937
$$ plain form
14133 -24988 -6512 26139 24155 17127 -6240 23452 62032 59630 58458 28678 -14578 -59567
14121 -59567 -41677 -10390 18119 36059 -17313 -35938 -34613 4111 59636 73770 34572 -16295
14109 -16295 -29465 1634 9485 34599 74696 81781 101608 109852 98541 90475 57518 24060
14097 24060 -53206 -102637 -85877 -86875 -43808 15685 19436 3495 -24505 29482 47094 36778
14085 36778 49383 47230 12796 -36075 -40142 -39657 -73992 -70985 -45824 -28010 -3875 24074 45254
14072 45254 10242 -12752 4994 49541 60185 25794 -7592 -1096 -24446 -12284 -1260 -4718
14060 -4718 -12583 -10591 -20851 13910 61219 48083 32366 50065 47948 43605 28139 -11199 44175
14047 44175 7609 13692 11170 -57572 -124500 -143959 -132042 -61800 -27061 -21876 -48215 -57152
14035e7152m9130l4754n041J15105P9871j0954o661k2229j7250q88j5558O444
14023a8197k1302l7025L4537M3577m970n531J3855M5912M541m453J1806k3793
14011C8957j9724k4171J1887l4725P223K9849J944k7858p58K1722J7307k1619
13999C4j9439L3002k9043j3710K7315O668m2889m642j1070N1902M3746K9000J7226
13986H8100m6359p0724Q242K6715l4598m0795L3849m490K3140M575k0737m4517
13974g7599l3934j510P4672M3543K9688j2405m5051m6551K8828p701L1049M0863
13962B3892M890j4383m4926J1438K4250J9003j0545k9508j8633J4654J0620J8862
13950I614j6648J1498j3534P45k3641q0206J7334O5095j6588q946J398L0049o420
$$ plain form
14035 -57152 -106282 -141036 -146077 -30972 48899 37945 31284 9055 -8195 -9083 -24641 -18197
14023 -18197 -39499 -76524 -41987 1590 -3380 -8911 4944 50856 55397 50944 62750 38957
14011 38957 19233 -4938 6949 -27776 -20553 9296 11240 -16618 -17376 4346 21653 34
13999 34 -19405 13597 -15446 -29156 -1841 4827 -38062 -42704 -53774 -1872 41874 70874 88100
13986 88100 41741 -28983 -20741 5974 -28624 -69419 -35570 -40060 -16920 -12345 -33082 -77599
13974 -77599 -111533 -113043 -38371 5172 34860 22455 -22596 -69147 -40319 -48020 -16971 23892
13962 23892 28782 14399 -30527 -19089 5161 24164 13619 -15889 -34522 -19868 -9248 9614
13950 9614 -7034 4464 -9070 -8325 -31966 -112172 -94838 -29743 -46331 -55277 -53879 -23830 -30250
13937c0250M656l561R604n077m216k4766k436M3743k245J5868k8809j4868K2742
13924a9615l2071r922O5625M3553k8570m3660k1209l7873N8004O2366j1561n7353
13912c2286n9811M3348j9261L5146K8563K6359n440o659q399K4988j9277j1835
13900d564K0563M1412l0294l9279K2893J068j1989k3584K29J9099O342L49l0904
13887b8659o861K6793M4162m895n4592k6699K77K4640K9379O0878K4196R55k3315
13874F6259k9015m2941J045l1029k0103J8484J6461m748J3024N449k6249j0283
13862d3646K3657L2305k1623j6390n703j5515K3106L9518k5404m5001K2039l9526
13850g2183K4038k1732L2588k007L8623J8640O304n8625o32J156k171K2424K9675
$$ plain form
13937 -30250 -25594 -29155 -19551 -24628 -28844 -53610 -56046 -12303 -14548 1320 -27489 -42357 -19615
13924 -19615 -51686 -61608 4017 47570 19000 -24660 -45869 -83742 -25738 36628 25067 -32286
13912 -32286 -92097 -48749 -68010 -32864 -4301 22058 16618 9959 1560 26548 7271 -4564
13900 -4564 15999 57411 27117 -12162 10731 11799 -190 -23774 -23545 -4446 1896 2245 -28659
13887 -28659 -35520 -8727 35435 30540 -24052 -50751 -50474 -25834 3545 64423 88619 89574 66259
13874 66259 37244 -5697 -4652 -35681 -55784 -37300 -20839 -25587 -12563 -7114 -33363 -43646
13862 -43646 -19989 12316 -9307 -25697 -31400 -46915 -23809 15709 -9695 -54696 -32657 -72183
13850 -72183 -48145 -69877 -37289 -39296 -673 17967 24271 -34354 -34986 -33830 -36001 -13577 16098
13837A6098J8446l7646l3480l586L1283J1377l0970J152J4927q084K5549K0098
13825B5164n2825P835M1152q553K8732J0291J7181M2158j4600p0940l1568J3542
13813G569K2863O649m3678N8189j704K7120J1982o0551j7945R522l091j8697p096
13800h868q364L1690J0181j848ll1932O0912l6499p753J0099k1289j2198J2985
13787b887L4790K226L554m1208k2982j4432k2784N5254O0554k8591l2243j7175
13775b5924k3066M566L6173O818n388k4054K121K1944N692j2210k9435p6806r337
13762a28906L9621J4529k22j2313J6747J742O883K5237J6278L9737L4428m7752
13750F009n5164J7472L1157j2433P702k9667m3392M8881K4278k3806L0120P4271
$$ plain form
13837 16098 34544 -3102 -36582 -40168 -8885 2492 -28478 -27326 -12399 -20483 5066 25164
13825 25164 -27661 -19826 21326 12773 41505 51796 68977 111135 96535 25595 -5973 7569
13813 7569 30432 37081 -6597 51592 49888 77008 88990 28439 10494 20016 16925 -1772 -8868
13800 -8868 -17232 14458 24639 22791 22788 -9144 51768 15269 7516 17615 -3674 -15872 -2887
13787 -2887 31903 34129 37683 -3525 -26507 -40939 -63723 -8469 52085 23494 -8749 -25924
13775 -25924 -48990 -44424 -8251 -1433 -6821 -30875 -28754 -6810 -1118 -13328 -42763 -119569 -128906
13762 -128906 -89285 -74756 -74978 -87291 -70544 -68802 -61919 -36682 -20404 19333 53761 6009
13750 6009 -49155 -31683 -526 -12959 -5257 -34924 -78316 -29435 -5157 -28963 1157 75428
13738G5428L6969j2091o4187o1555l5617j8974K103j1250N7626L0968k9782K2326
13726h036k951j8100J0384J1792l4436o319K3815j9159L4842k2302R99J5218J5201
13713I48n34m2769N678K0642J5036m114J112j3298l1569l8310N0860j6564J1275
13700d1607M450L1659M166r90K3486K3893j6321j6562q182j2735o536P3722J8793
13687G7236k9564L5377o075k3784n2849n8677l5021l0598J1560M025L6737J4677
13675e6956K0204n8399o38K2002M5738J4797N4370j7133l8769k1251o485L6431
13663f089Q0759O18n4296k8086j8786M300r03J6734m7957j5980L4286J3323n5938
13650g8015r863K5488j4434L9626O2551m1552o2710K5764N3367l133M568p217
$$ plain form
13738 75428 112397 100306 36119 -25436 -61053 -80027 -77924 -89174 -31548 -580 -30362 -8036
13726 -8036 -10987 -29087 -18703 -6911 -41347 -47666 -23851 -43010 -8168 -30470 -29471 -14253 948
13713 948 414 -42355 -36677 -16035 -999 -5113 -4001 -17299 -48868 -87178 -36318 -52882 -41607
13700 -41607 -37157 -5498 -1332 -2322 21164 45057 28736 12174 3992 -8743 -15279 58443 77236
13687 77236 47672 83049 76974 53190 341 -58336 -93357 -123955 -112395 -108370 -71633 -56956
13675 -56956 -36752 -95151 -95789 -73787 -28049 -13252 41118 23985 -14784 -36035 -42520 -6089
13663 -6089 74670 75288 20992 -7094 -25880 -21580 -22483 -5749 -53706 -69686 -35400 -22077 -78015
13650 -78015 -87878 -62390 -76824 -37198 25353 -16199 -78909 -53145 222 -2911 1657 -5560
13638e560N029k5237J9941o798j3341K1172K1679K1871K6928M4720m8751k7842
13626C3811j7489J1208l4430l0645K1679P693K5788M127j2785o874k480k5114
13614b5511J6060L5565j0565j7326k5207l6549L1360M2819j7346j8653J0427J299
13602a3627l1880k1294L9348K8251j5279j089J7178q63l0269L7703O4488J1612
13590H4279m2733k2313J2482J9193m4164p4785K5400L486R267j6833M784K5714
13578a6223M259m0191m22L0308L3145m32l8675m1770j3481O2308M3787l403l8213
13565a9003M5450N7747O580m397k5464J5631K2708L666M506n2150J4057j1210
13553E8121n459m7041J1699K4686J8682J623r6563j1634K6543L0558l3088k3663
$$ plain form
13638 -5560 -531 -25768 -5827 -12625 -25966 -4794 16885 38756 65684 110404 61653 33811
13626 33811 16322 27530 -6900 -37545 -15866 -8173 17615 21742 8957 2083 -397 -25511
13614 -25511 -9451 26114 15549 -1777 -26984 -63533 -32173 10646 -6700 -25353 -14926 -13627
13602 -13627 -45507 -66801 -27453 798 -14481 -15570 1608 745 -29524 8179 72667 84279
13590 84279 41546 19233 31715 50908 6744 -68041 -42641 -39155 -29888 -46721 -41937 -16223
13578 -16223 -11964 -52155 -52577 -22269 10876 10444 -28231 -70001 -83482 -21174 22613 19210 -19003
13565 -19003 26447 84194 90774 86377 60913 76544 99252 102918 107424 55274 69331 58121
13553 58121 52662 5621 17320 42006 60688 62311 -34252 -45886 -19343 11215 -21873 -45536
13541d5536J4390l1416k7005Q087O235k2269R358N0699l8541L1926M7155J3707
13529A6790j1964j2236m513j8855J1710J100k8928j0508P4147J3384j3564J302
13517A7865j1214j6794J0288j0972j3942N0033K8556M428m1341J9408K8344K9029
13505I3688l2619l5144l9712m2756P77J4897P4325j6460l3037j33M8035Q006l176
13492C6691q151l6242j8287j1619j6920j7267j0826K2093J9009n913Q220M6646
13480G434M7000o1984k5462N363L2012o718q910k5302J70L2253m1862l3447M9194
13467c0259M9610l683m5191n5925K7384O2269L5722j7343k398l6421J6035K3323
13455B3123J6841l3022m5726m5691M7298L5832K997K9988l7055M4695L4216k0871
$$ plain form
13541 -45536 -31146 -62562 -89567 -81480 -75245 -97514 -88156 -37457 -75998 -44072 3083 16790
13529 16790 4826 -7410 -11923 -30778 -19068 -17968 -46896 -57404 16743 30127 16563 17865
13517 17865 6651 -10143 145 -10827 -24769 25264 53820 58248 16907 36315 64659 93688
13505 93688 61069 25925 -13787 -56543 -55766 -40869 33456 16996 -16041 -16174 31861 39867 36691
13492 36691 28540 -7702 -25989 -37608 -54528 -71795 -82621 -60528 -41519 -47432 -39212 7434
13480 7434 54434 -7550 -33012 -27649 4363 -2355 -11265 -36567 -36397 -4144 -46006 -79453 -30259
13467 -30259 19351 15668 -29523 -85448 -58064 4205 39927 22584 20186 -16235 -200 23123
13455 23123 39964 6942 -38784 -84475 -37177 -1345 1652 31640 -5415 39280 73496 52625
13443E2625L0349o1618J725n014J2667L1961k4894l0465J9187K8027m6716L5856
13431D3690J2156m2725l261L6801M838L224P126L687j1908n9285Q433O1253K4737
13418H8766j3034l7142l1132j0562K1788K6632k5727m9934j9305N955l339o57
13406d7691J1977P299j7979j7188L0666O7852M1988m0571m6760j9718K0233O035
13394c857j9699L0689L9710n0973q4274J0605M1566K3242l1238j4859O7520O002
13382A4434j5222L0633k7214j4125m5722l9525L4498M484P0451J3009j5967l0544
13370b0810k0971J3505P2900l691k2734M546m111m3765k2405j7664K852L0428
13358c1920K119o956k5643l822r720k0309K4189N8884J0629l9686k920N633L5890
$$ plain form
13443 52625 82974 21356 23081 18067 30734 62695 37801 7336 26523 54550 7834 43690
13431 43690 55846 13121 9860 46661 51499 54723 61849 65536 53628 -5657 2776 64029 88766
13418 88766 75732 38590 7458 -3104 18684 45316 19589 -30345 -49650 -43695 -47034 -47691
13406 -47691 -35714 -28415 -46394 -63582 -32916 34936 76924 36353 -10407 -30125 -9892 -3857
13394 -3857 -23556 7133 46843 -4130 -88404 -77799 -36233 -12991 -44229 -59088 8432 14434
13382 14434 -788 29845 2631 -11494 -57216 -96741 -62243 -57759 12692 25701 9734 -20810
13370 -20810 -41781 -28276 44624 40933 18199 22745 18634 -25131 -47536 -65200 -62348 -31920
13358 -31920 -29801 -36757 -62400 -66222 -75942 -96251 -72062 -13178 -2549 -42235 -45155 -39522 -3632
13345c632L8414J5964J6129j3741m3429p1217l6294n297k2932L0809P2375N6796
13333C3945j5421J7901O212l6733k634L4769j1232n1054J5067K8070J8611p443
13321C0058j1058L5168O259r224j2158K7059j3737M647K455m4502K3584M062n3209
13308a0596j6663M0365J8651l5755l1329j2222J9562L9618n458j9931k3095q158
13296d5011K5659K0884l1455l5992m1250N9951N4876q310o593k0916j3198k9879
13284g1234J4060J2504K277K9182k259N680n107m2118K7930K4126k2826j0094
13272c7879M5873J5485p2352n7504j1350J7446K9462M1516J2712J6065k5846k0327
13260d6699p435j2812L3165l919M2116K8179L2338n64M099j9202j2122p3391k8569
$$ plain form
13345 -3632 34782 50746 66875 53134 9705 -61512 -97806 -103103 -126035 -95226 -22851 33945
13333 33945 18524 36425 42637 5904 3270 38039 26807 -24247 -9180 18890 37501 30058
13321 30058 19000 54168 60427 51203 39045 66104 52367 57014 59469 14967 38551 42613 -10596
13308 -10596 -27259 13106 31757 -3998 -35327 -47549 -27987 11631 6173 -13758 -36853 -45011
13296 -45011 -19352 1532 -29923 -65915 -107165 -47214 7662 -648 -7241 -28157 -41355 -71234
13284 -71234 -57174 -44670 -42393 -13211 -15470 -9790 -14897 -57015 -29085 -4959 -27785 -37879
13272 -37879 7994 23479 -48873 -106377 -117727 -100281 -70819 -29303 -16591 -526 -26372 -46699
13260 -46699 -54134 -66946 -33781 -37700 4416 32595 64933 64369 68468 49266 37144 -36247 -64816
13247f4816P6350J0426m5854q344Q623Q685l1798j853R907K5519P459m7235n3659
13234a06590N1135q492L2264N2833J9900o4636n5558O268M5366J2830K4024K9731
13222C9075L9329K415p3872o5755O484K406J8276K9960K2761p019l6804j9786
13210d2530j7866k4030P506M7174J0033K1975r145k1735J8834N1116j0325o3076
13198c2069k5596K8715K0342k9663m0261K2042n255L3171L9405l0571N8218M1140
13186G9618j3931j17360o2047P362N9606P8968M0985m4656m4670R933K3324K6699
13174D3831l2117k5433O661J2291M0629n4812o0080l038K6179L849N0125M1761
13162D9846K1098k9501J8231n77j7725k1186l3497m345l9007M864J9298N3527
$$ plain form
13247 -64816 11534 21960 -23894 -32238 -23615 -14930 -46728 -48581 -38674 -13155 -5696 -52931 -106590
13234 -106590 -55455 -63947 -31683 21150 41050 -23586 -79144 -72876 -27510 -14680 9344 39075
13222 39075 78404 80819 6947 -58808 -52324 -49918 -31642 -1682 21079 14060 -22744 -42530
13210 -42530 -60396 -84426 -76920 -29746 -19713 2262 -6883 -28618 -9784 41332 31007 -32069
13198 -32069 -57665 -28950 -8608 -38271 -78532 -56490 -61745 -28574 10831 -19740 38478 79618
13186 79618 65687 -51673 -113720 -106358 -46752 32216 73201 28545 -16125 -6192 17132 43831
13174 43831 11714 -13719 -7058 5233 45862 -8950 -69030 -72068 -45889 -42040 8085 49846
13162 49846 70944 41443 59674 59097 41372 20186 -13311 -17656 -56663 -51799 -32501 21026
13150B1026j0963j8644J5650K1486j0024m3870m1203l0626N7281L8168L6680J2638
13138D7599N199j5470m8222k2624l8945l4942K1169P8677J6383k0794r237M726
13126a6481R329L0399J8752J0667l5258j0268N7742o032q5413o575J3071k1060
13114d1127J514k6338J2691J7316r490J4600k8599L4443L3863P3366k392k5904
13102E3943m7968m2123o1974L6829O8074K814k890K462O152k0192n2394m9792
13090a07059K347N3509M7449O2778l1080n2904j2074o827K360J7667M4254l2235
13078a1815l0285n1990k0501K178M7262O7773j0458M5398L6453o0647o9668L4215
13066b2085L4335n638k2211o3222M8729K6580o3M2302N6843J7592l2382p9181
$$ plain form
13150 21026 10063 -8581 7069 28555 18531 -25339 -66542 -97168 -39887 -1719 34961 47599
13138 47599 52798 37328 -10894 -33518 -72463 -107405 -86236 -7559 8824 -11970 -21207 -16481
13126 -16481 -7152 23247 41999 52666 17408 7140 64882 58850 -26563 -33138 -20067 -41127
13114 -41127 -39613 -65951 -53260 -35944 -45434 -30834 -59433 -24990 8873 82239 79847 53943
13102 53943 5975 -36148 -98122 -61293 6781 9595 6705 9167 15319 -4873 -57267 -107059
13090 -107059 -104712 -51203 -3754 59024 27944 -24960 -37034 -43861 -41501 -23834 20420 -11815
13078 -11815 -42100 -94090 -114591 -112413 -65151 2622 -7836 37562 74015 13368 -56300 -22085
13066 -22085 12250 6612 -15599 -78821 -30092 -3512 -3575 38727 95570 113162 80780 1599
13054A599O232L3490K0129n4628k5541K990N3774j5016J6386K1586j0059n6142
13042e200j0488K3008N661j7147k3683J7172L3059m04l407r995J5869l386l2759
13029a1700m5036J3061O5465J620l7815J8612O9687k035o296J7893k8796m0197
13017A4463N327Q618j8997J3965l5076L3487R149k0789q010J4485j2652K66k2341
13004a8105k448k0181l960m0263L3647j6221k0342M0598L7601j3238l3789k2564
12992g9265K6437L8513m553j4978K275N3134N0766o2542p0139Q076N528L0612
12980a6136M0082l998K3766J0633P67k5924l0590l8641n386J0431k9778k3714
12968h8488K7902N0435L1368L0233k492J4163m5990n7906j8956K7548j5175o513
$$ plain form
13054 1599 7831 41321 61450 6822 -18719 -15729 38045 23029 39415 61001 50942 -5200
13042 -5200 -15688 7320 12981 -4166 -27849 -10677 22382 21978 18571 8576 24445 21059 -11700
13029 -11700 -56736 -43675 21790 23410 -14405 4207 73894 71859 65563 83456 54660 14463
13017 14463 19790 28408 9411 23376 -11700 21787 30936 10147 2137 16622 3970 4236 -18105
13004 -18105 -20553 -40734 -44694 -84957 -51310 -67531 -87873 -47275 -9674 -22912 -56701 -79265
12992 -79265 -52828 -14315 -18868 -33846 -31571 21563 72329 9787 -60352 -52276 -46748 -16136
12980 -16136 23946 19948 43714 54347 55114 29190 -1400 -40041 -45427 -34996 -64774 -88488
12968 -88488 -60586 -10151 21217 51450 48958 63121 17131 -40775 -59731 -32183 -47358 -53871
12956e3871n437k4731Q599N1175k9428K5664L6489N3325J3557l6122n4956L666
12944a2070J9292N8588K0913k7117m5653l5639j1996k4548k6129N5255L6278l2907
12932b5733P064O191J9433L7779M601N178l6518k927k8232n0897K8087M7894O827
12919A8747J948L5577K84j3599J9911m4659Q106O0266J5304k9538r847J040j3766
12906D9774J4136L7197l9220j6708j5447k5974J5520M8310N1596l922p2005m694
12894C8563p8109l6043N0112K1685K4529M0655J5818m0346j7277m777k4604l3839
12882d3633J6936M0986K1766M42K618K709J5524j7542l5314m0583K516O6047l3115
12869f43R753N3034M2821K1229l8925m4865o9298l9613j500M4594K3815J1363
$$ plain form
12956 -53871 -59308 -84039 -75440 -24265 -53693 -28029 8460 61785 75342 39220 -15736 -12070
12944 -12070 7222 65810 86723 59606 13953 -21686 -33682 -58230 -84359 -29104 7174 -25733
12932 -25733 -18669 -12478 6955 44734 49335 54513 17995 15068 -13164 -64061 -35974 11920 18747
12919 18747 20695 56272 56556 42957 62868 18209 26315 86581 101885 72347 62500 63540 49774
12906 49774 63910 101107 61887 45179 29732 3758 19278 67588 119184 115262 43257 38563
12894 38563 -39546 -75589 -25477 -3792 20737 61392 77210 36864 19587 14810 -9794 -43633
12882 -43633 -26697 14289 36055 36497 39115 41824 57348 39806 4492 -36091 -33575 32472 -643
12869 -643 9110 62144 104965 126194 87269 42404 -26894 -66507 -68007 -23413 402 11765
12857A1765q069k5739j228J4567j1460J5967j4386M2991J5075n6836J9633j1754
12845i474j8743L959O5564J1358l9952K9209K5988J4158j4945m1580l3362l4516
12833d2336j6247K5579j9521K0149R210J420o022j0962k3822n7216M6453P7881
12821D566M8836m4673j5960q951l392N677J9815l6897N320P006j4378r228j8510
12808f0769k878L0514L332l943R578j9849k160K4778J6068j9850j6697j3114J5935
12795c9055Q5472K239k831J0953J0561j6898K572J7970M137R970k6351n2648k5940
12782a9849M9701Q565k7592j9406N858L0765p938j10841l2043J0298J6366J2012
12770h4104P490L4870k207j2684P920K8441J2976k642m293K0994M6622J0862n2459
$$ plain form
12857 11765 3696 -22043 -23271 -8704 -20164 -4197 -18583 24408 39483 -17353 2280 -9474
12845 -9474 -28217 -24258 41306 52664 12712 41921 67909 82067 67122 25542 -7820 -42336
12833 -42336 -58583 -33004 -52525 -32376 -23166 -21746 -27768 -38730 -62552 -119768 -73315 4566
12821 4566 53402 8729 -7231 -16182 -19574 -13897 5918 -30979 -25659 -18653 -33031 -42259 -60769
12808 -60769 -63647 -33133 -29801 -33744 -24166 -44015 -46175 -21397 -5329 -25179 -41876 -54990 -39055
12795 -39055 46417 48656 45825 56778 67339 50441 53013 70983 75120 85090 58739 6091 -19849
12782 -19849 29852 38417 10825 -8581 -2723 28042 20104 -90737 -122780 -112482 -96116 -84104
12770 -84104 -76614 -41744 -43951 -56635 -48715 -20274 -7298 -9940 -14233 6761 53383 64245 11786
12757A1786p7699j1832J072N0486M0619M2550j5230J4625l306r128j0003P672
12745D1612J3098J0458M3679k5752j6997l2473j6442J3981L0743K948n7249K1185
12733B8791Q6327J561p5478r9596n3843K8443O7298M2612m2271k8759N0738N0394
12721E6217k0546n1835m1809Q132K5413K746j1383K5319l1104k572q4364r887
12709a35673R3996J25598l4354k9697J9862K6591k2349m2248o593r458m80j1453
12697b6258j1527k8300k6981K8241j6907L1193N3157N8022K9760P44k2268m1818
12685B7058l306L2410r916k5420o7108L1583L3785L8999J6077M978j0723L3490
12673A01907N090l1022k4111l0183N3258j3518j0594L5839j7871m3130n8659j9070
$$ plain form
12757 11786 -65913 -77745 -76673 -26187 14432 56982 41752 56377 53071 43943 33940 41612
12745 41612 54710 65168 108847 83095 66098 33625 17183 31164 61907 64855 7606 28791
12733 28791 115118 116679 41201 -58395 -112238 -83795 -16497 26115 -16156 -44915 5823 56217
12721 56217 35671 -16164 -57973 -49841 -24428 -21682 -33065 -7746 -38850 -41422 -125786 -135673
12709 -135673 -41677 83921 49567 19870 39732 66323 43974 1726 -4867 -14325 -14805 -26258
12697 -26258 -37785 -66085 -93066 -64825 -81732 -50539 2618 60640 90400 91144 68876 27058
12685 27058 23752 56162 46246 20826 -46282 -14699 19086 58085 74162 79140 68417 101907
12673 101907 106997 75975 51864 21681 74939 61421 50827 86666 68795 25665 -32994 -52064
12661e2064l7164J2250J25288O2157r438o5285j9944J6054k0359r835k0018L195
12649a5163O040o1696J5755Q557J7206K4078j631l7873J5859P052k992N5767K5274
12636E6233o7154l308N6209Q418J5970k1919j8892p574M5480J9079n3711N586
12624C4417L1060k9167k3138K3320k284k0755j9716l8931r279l747J246L5311
12612b1663l832M1058k5810j5993J2768J4343k3848P237M1180j3497K4384M0708
12600G7035M2264J4982l4338o4398m1029P221L6464O910J9667K9171k7925N960
12588G1984J4613J0803p3507o3440M7952L3218l7051K8252K2463l2597n164j7806
12576b80k2542r474k6564N693j3018l4029N428M2764K2499l6054K7591J2651k5462
$$ plain form
12661 -52064 -89228 -76978 48310 110467 101029 35744 15800 31854 11495 1660 -18358 -15163
12649 -15163 -9123 -70819 -55064 -46507 -29301 -5223 -6854 -44727 -28868 -21816 -24808 30959 56233
12636 56233 -10921 -14229 41980 50398 66368 44449 25557 17983 63463 82542 28831 34417
12624 34417 65477 36310 13172 36492 34208 13453 -6263 -45194 -54473 -58220 -56974 -21663
12612 -21663 -25495 15563 -10247 -26240 -13472 871 -22977 -15740 25440 11943 36327 77035
12600 77035 119299 134281 99943 35545 -5484 1737 38201 45111 64778 93949 66024 71984
12588 71984 86597 97400 23893 -39547 8405 41623 4572 32824 55287 22690 17526 -280
12576 -280 -22822 -32296 -58860 -53167 -66185 -100214 -94786 -52022 -29523 -65577 -37986 -25335 -50797
12563e0797m976P978K757K1193P934l0134l6548L070M2177r699J3622K3038j7260
12550b7645K9257K5278p712k9151k5841J0057M2035K6738J1449j8910m2185l4934
12538d1564P597P420n237O548r308o336L1800P57k1331k5812o965K3850M3804
12525E223M147k645m697j4313O339K6666q855n171j8348n0955j1110q724K6858
12512e5585N895k477L405N1894K0983J7649m3836l2261q450r924L060J0600M2499
12499C452K0633j6526q629n0013K4346Q8862K2911j7129k9917J29l1329o1845
12487e5055J540R10K6356J6954l556J8853m2673K8124K2729K5692r166k7819j0714
12474g825L86L3708j6224r286l5564j9449L6277K9325M1732P906p4427m5873J679
$$ plain form
12563 -50797 -55773 -47795 -45038 -23845 -15911 -46045 -82593 -79523 -37346 -47045 -33423 -10385 -27645
12550 -27645 1612 26890 19178 -9973 -35814 -25757 16278 43016 54465 35555 -6630 -41564
12538 -41564 -33967 -26547 -31784 -25236 -34544 -40880 -9080 -8323 -29654 -55466 -62431 -38581 5223
12525 5223 9370 6725 2028 -12285 -5946 20720 11865 6694 -11654 -62609 -73719 -82443 -55585
12512 -55585 -49690 -52167 -48762 3132 24115 41764 -2072 -34333 -42783 -52707 -49647 -39047 3452
12499 3452 24085 7559 -1070 -51083 -26737 62125 85036 67907 37990 38119 6790 -55055
12487 -55055 -53515 -52605 -26249 -9295 -12851 6002 -36671 -8547 14182 39874 30708 2889 -7825
12474 -7825 -7439 26269 10045 759 -34805 -54254 -17977 11348 53080 60986 -13441 -59314 -57635
12461e7635M1937k4197J0145O0490M7660O381j4304r461l7397m2585L2459J6635
12449C0128j2458n1379L3208K3881q7942j2155m4565K6408M5295m8180k6956K4451
12437a00264O443Q150J3207M311l3318K3139N7275K5678J8389J0613j9491k2629
12425h497q319m483J2402J737j6601j0971P964k5976m6783J7348p315J5517L7739
12412c6238O2909J3694o328M3877J1988m808l5585J2922N6936J3262m4057p8843
12400I729k2734J73L9018J471K8239J1303k721m4472m1951k671p3247j7147O6945
12387d8065k8063O174N5141L3864J7812l863J2167m4711o2015L6618P4801l573
12375D6287k5854l6483n068L614K0834K6512P578k5612k111K180l0144J3946Q664
$$ plain form
12461 -57635 -15698 -39895 -29750 30740 78400 84781 70477 61016 23619 -18966 13493 30128
12449 30128 17670 -33709 -501 23380 -64562 -76717 -121282 -94874 -49579 -97759 -124715 -100264
12437 -100264 -93821 -85671 -72464 -68153 -101471 -78332 -21057 4621 23010 33623 14132 -8497
12425 -8497 -16816 -21299 -8897 -7160 -23761 -34732 -26768 -52744 -99527 -82179 -89494 -73977 -36238
12412 -36238 26671 40365 34037 77914 89902 85094 49509 62431 119367 132629 88572 9729
12400 9729 -13005 -12832 26186 27657 55896 67199 64478 20006 -21945 -24616 -97863 -115010 -48065
12387 -48065 -76128 -69954 -14813 19051 36863 33000 45167 456 -61559 -24941 49860 46287
12375 46287 20433 -16050 -21118 -17504 3330 29842 37420 11808 9697 11877 -18267 -4321 4343
12362D343l662n1186J7174L5326M382N1573L7359j8845L3950J9493m3107l9366
12350D7434l2102j1191M9840J94J454o759R516N694j6761L4756M097r527m4369
12337C2276n8213J1572L5669K4498J111j7651K6063K4998k5714m6267j6826k4191
12325c2675k5846P595K769M7539O83m3104Q490n6395l0939M8881K4846M0615l7933
12312d5474o461j930q881L171K8707o04J3270M8900j2020p299L78J7910p9532
12299d9865m0907M2254K9697N9991N3698l6195j9772J1496M3720o2789j02543
12288g1215m642L2044K9619M9463L0302j1758p9023J272O910j8184L0162k9381
12276c4431r218p44P101J4131Q75k168m157j317P7093l688j1277j8851K466O405
$$ plain form
12362 4343 681 -50505 -33331 1995 6377 57950 95309 76464 110414 129907 86800 47434
12350 47434 15332 4141 53981 54175 55629 48870 58386 64080 47319 82075 86172 76645 32276
12337 32276 -25937 -14365 21304 45802 46913 29262 55325 80323 54609 8342 -8484 -32675
12325 -32675 -58521 -50926 -48157 -618 65 -43039 -34549 -90944 -121883 -73002 -48156 -7541 -45474
12312 -45474 -51935 -53865 -62746 -59575 -30868 -31472 -18202 30698 18678 11379 11757 29667 -49865
12299 -49865 -90772 -48518 -18821 41170 94868 58673 38901 50397 94117 31328 -71215
12288 -71215 -75857 -43813 -14194 35269 65571 53813 -25210 -23938 -17028 -35212 -5050 -34431
12276 -34431 -43649 -44393 -37292 -23161 -22286 -24454 -28611 -29928 47165 43477 32200 13349 15815 22220
12262B2220n3393K1405P419K0316L3690K0705O756j2508m6423l7272J1467O594
12250I76k8857J6983L8009j6533J7544j8956k6557j2137J3610J3438M0878p1646
12238c3248o7922P176O0188n960l7584n983l0209O3603R5878l0052j7532l2660
12226c4305q552j292M688l0344n703K7230L3275J5379R351m1447k560P7192l5079
12213G833k4728R509m7010j8699J4416J4522L7534J1081j4017L2810L8705L6978
12201I8934J2442O449j2490m8756j7944K4730j2727k3343o613J3292l7501l3232
12189c6759l8284J72J6258J1532r376M0825O3631k2017k5820L7117J1847j9964
12177B9162j5570L3614l616l0085J8640O9462K7433k0234l052N25j5669m1561
$$ plain form
12262 22220 -31173 -9768 -2349 17967 51657 72362 79118 66610 20187 -17085 -5618 976
12250 976 -27881 -10898 27111 10578 28122 9166 -17391 -29528 -15918 -2480 38398 -33248
12238 -33248 -101170 -93994 -33806 -39766 -77350 -83333 -113542 -49939 45939 15887 -1645 -34305
12226 -34305 -42857 -44149 -39461 -69805 -75508 -48278 -15003 376 9727 -31720 -34280 42912 7833
12213 7833 -16895 -7386 -54396 -73095 -58679 -44157 -6623 4458 -9559 23251 61956 98934
12201 98934 111376 117825 105335 56579 38635 63365 50638 27295 20682 33974 -3527 -36759
12189 -36759 -75043 -74871 -58613 -47081 -56457 -15632 47999 25982 162 37279 49126 29162
12177 29162 13592 47206 43590 13505 32145 101607 129040 108806 105754 106279 90610 49049
12165D9049J2228K2678J0008O080K2825m6600j9611N6988O0183N9176N4702j9658
12153B68048k9645J8185J2621R3669R4969J25536J71758J66948J69382K25534
12143A317005L31678N32729P86908R80726R10918M13883j28238n66692r13165
12134C665752r38240p60013m35057l22511k54005j80132j34041j28107q6676q4045
12124C42925k0129m797k0776k7050k0703l2214k5573P864j127K9298l9790k2130
12112A65798L50j6632k0862k9383k5197j3389L5679j0210n0948J4307M1935K008
12100I3456k9148k309k7749k5326k4446O2972K3310o2989l7067O3835J2160o110
12088D0589l4554J1772L581r637j371j8458j9598K8668J7577k0650M895M6957
$$ plain form
12165 49049 61277 83955 93963 100043 122868 76268 56657 113645 173828 233004 287706 268048
12153 268048 238403 256588 269209 362878 457847 583383 755141 922089 1091471 1317005
12143 1317005 1648683 2181412 2968320 3949046 4859964 5273847 5145609 4578917 3665752
12134 3665752 2727512 1967499 1532442 1209931 955926 775794 641753 513646 426970 342925
12124 342925 322796 317999 297223 270173 249470 217256 191683 199547 198420 227718 187928 165798
12112 165798 166148 149516 128654 99271 74074 60685 96364 86154 35206 49513 91448 93456
12100 93456 64308 61999 34250 8924 -15522 47450 70760 7771 -29296 34539 46699 40589
12088 40589 6035 17807 21388 11751 10380 -8078 -27676 992 18569 -2081 2814 49771
12076D9771O3896l7066j3393M3111j7391j6913j8014J748l8750k762Q477m8995
12064b6281l749N778L1720K9370n1538j5307K0638m3204L5911L5251J5262m6912
12052a3061j1004j6767L3010O1110R32l5187m0504j2847M650L0468j722k7684
12040b8606j5916M304J2660L8505M581o311k4628k7731M7385L627L7855p762m1424
12027c461m3341J7764O1249L7121N380m3292k0933k4827n0227O627J4404J2717
12015c0819j1878K8423J5800k1256K0351M4791m5870m5522O461O0416K6684m0255
12003G326l5629J5514j8791k3912L8164j6964J5369n942l9745l834J2753J5797
11991c9894o229L74r795n9769M605K2059K941l716K8725Q5390O6041L4635q4818
$$ plain form
12076 49771 113667 76601 63208 106319 88928 72015 54001 55749 16999 14237 22714 -26281
12064 -26281 -30030 -24252 7468 36838 -14700 -30007 -9369 -52573 -16662 18589 33851 -13061
12052 -13061 -24065 -40832 -7822 53288 54220 19033 -21471 -34318 -29668 800 -922 -28606
12040 -28606 -44522 -40218 -27558 10947 15528 9217 -15411 -43142 4243 7870 45725 37963 -3461
12027 -3461 -46802 -29038 32211 69332 74712 31420 10487 -14340 -64567 -57940 -43536 -30819
12015 -30819 -42697 -14274 1526 -19730 621 45412 -458 -45980 -39519 20897 47581 7326
12003 7326 -28303 -12789 -31580 -55492 -17328 -34292 -18923 -24865 -64610 -68444 -55691 -39894
11991 -39894 -46123 -45749 -55544 -115313 -110708 -88649 -85708 -89424 -60699 24691 90732 125367 40549
11978D0549m4858l6649K4574K0718k109L0516j682m7851O844m091j7554Q48J607
11965b9138k926K6356M6196k960M2749N638k4206N150o287p7492k9479J4357q220
11952d0262J7050K3738J8576q461o111l2554k9006O275M6066P3485k566n4332
11940A1898m5572k5620l0666P4086N8523q2573m8155L2402J04960L013n6166m1387
11928d5257k0943L4070O0218j2081M3277j0684k9000m0096J6603K9643Q878m462
11916C0166j6330L5224k1385L321J2829j03J3944M272L0733N680m0415p2998j4976
11903c0038k3908K4904J03953K3719j304m7391n4382m0989L0851O698j5206K9554
11891F461J0062J8548l431l5144L2332K1961p0943k3298j2650k5539K2399J5051
$$ plain form
11978 40549 -4309 -40958 -16384 4334 2225 32741 31059 -16792 -9948 -14039 -31593 -30745 -29138
11965 -29138 -32064 -5708 40488 37528 80277 85915 61709 66859 60572 -16920 -46399 -32042 -40262
11952 -40262 -23212 526 19102 10641 4530 -28024 -57030 -50755 -4689 68796 66230 11898
11940 11898 -33674 -59294 -89960 -15874 42649 -39924 -88079 -55677 49283 52296 -3870 -45257
11928 -45257 -66200 -32130 28088 16007 59284 48600 19600 -20496 -3893 25750 34628 30166
11916 30166 13836 49060 27675 30996 43825 43722 57666 61938 92671 98351 57936 -15062 -30038
11903 -30038 -53946 -29042 74911 98630 97326 49935 -4447 -45436 -14585 -7887 -23093 6461
11891 6461 16523 35071 31640 -3504 28828 50789 -20154 -43452 -56102 -81641 -59242 -44191
11879d4191l663k3799J9052O8075M5051L4293q4266l4854k2141P328j4299m886
11867e8300N0563L2268k2861k3660R296P240K1278J7424L2350K83m4120n9079
11855c7318k0337Q878j9603K606O2378K1968j3839j4915l9094Q144J7157K3574
11843d01L3269L2393j0309j9890M6118M534k0190o8499l8829k6776P6684Q540
11831A6644r823o904m1632o1334j1714Q2409L3216M8482Q98j3282K6023M913l5297
11818C2599j6976L6075k6482p6743n3769M3647L6114M4287l0638j4366k7439j957
11806e5648m87k127N5305J9320J0447K9071K2905R883n1223o735m807k1573n963
11793a632k0385L6809M5168p342O214K0371m0896O0093K9533m8777m9462j9921
$$ plain form
11879 -44191 -47854 -71653 -52601 15474 60525 94818 10552 -24302 -46443 -39115 -53414 -58300
11867 -58300 -7737 24531 1670 -21990 -12694 -5454 15824 33248 65598 65881 21761 -37318
11855 -37318 -57655 -48777 -68380 -65774 -3396 18572 4733 -10182 -49276 -41132 -23975 -401
11843 -401 32868 65261 54952 35062 81180 85714 65524 -2975 -41804 -68580 8104 16644
11831 16644 6821 -83 -41715 -103049 -114763 -32354 862 49344 50242 36960 62983 67896 32599
11818 32599 15623 51698 25216 -51527 -105296 -61649 -25535 18752 -11886 -26252 -53691 -55648
11806 -55648 -56135 -58262 -2957 16363 26810 55881 78786 88669 37446 30711 25904 4331 -1632
11793 -1632 -22017 14792 59960 52618 58832 79203 38307 98400 127933 79156 29694 9773
11781I773J3238j2421k671j392m386k3151j2499O5248M0239l4646m5990P344R623
11768H309M2732l908l4363k0847r452J7430r189M785l3535L6277L0905K3491m3992
11755H643j2203K156k5073J0141P736K7978p175j6745J6528M1546n5748o423l0559
11742c9198j059J15207R81n3025o7060l3448J7150P0515J5700j8770J2973M2994
11730F2960J9993j3260J6780l7404l2187j9188j6886K0824L0017m1223k7621r821
11718d7016N671L5405K9736j1857N790m8616o8502k831N7447L0172n0908l2930
11706i8439r787M3712O2014j1947P639q880o976j0306k1202L7323K8515j7799
11694f133j6134K5073K2230k2957L7236L9402j7800o4162k0407N386j133m506
$$ plain form
11781 9773 23011 10590 7919 6527 2141 -21010 -33509 31739 71978 37332 -8658 -1314 8309
11768 8309 51041 47133 12770 -8077 -17529 -99 -9288 -4503 -38038 -1761 29144 52635 8643
11755 8643 -3560 -1404 -26477 -16336 -8600 19378 12203 -4542 11986 53532 -2216 -8639 -39198
11742 -39198 -40257 74950 75931 22906 -44154 -77602 -60452 10063 25763 6993 19966 62960
11730 62960 82953 69693 86473 49069 16882 -2306 -19192 1632 31649 -9574 -37195 -47016
11718 -47016 -41345 -5940 23796 11939 17729 -30887 -99389 -102220 -44773 -14601 -65509 -98439
11706 -98439 -108226 -64514 -2500 -14447 -6808 -15688 -22664 -32970 -54172 -16849 11666 -6133
11694 -6133 -22267 2806 25036 2079 39315 78717 60917 -3245 -23652 -18266 -19399 -23905
11682b3905N7482L8565L3542o7770m3347M547J254n954R712L7900L2376K6352
11670A00754N1834j7451n2134m6301K4069N00j3604p67n88L0495J329j1952m0504
11657B5680k7477K2782K5449p781J7230k6174k0189r724m6536j8209N1906K6161
11645A3118k2079k5196L2262k675M8779l2087j0144M696m2550k0469l932M5311
11633a4966J9157P5484J587J1255j3280J5170J5698m0881p2751o8220M2578K7153
11621b016L5512Q6703K7514M011j669m5448m7192P722r071k1868k274l0710r405
11608h191j08J997O5276N9804L2607j3487n3883N87m1405m2450O5235k6253p2589
11595c2860J6885M1500k581M0007K7354j5485k2150R060n737k4323k603o920J8163
$$ plain form
11682 -23905 33577 72142 105684 37914 -5433 -886 368 -5586 4126 42026 74402 100754
11670 100754 152588 135137 83003 36702 60771 61271 47667 46900 46312 76807 78136 66184 25680
11657 25680 -1797 20985 46434 38653 55883 29709 9520 -204 -46740 -64949 -13043 13118
11645 13118 -8961 -34157 -1895 -4570 44209 12122 1978 6674 -35876 -56345 -60277 -14966
11633 -14966 4191 79675 81262 92517 79237 94407 110105 69224 -3527 -71747 -29169 -2016
11621 -2016 33496 120199 147713 151724 150055 104607 57415 65137 56066 34198 31924 1214 -8191
11608 -8191 -8299 -6302 58974 118778 151385 137898 84015 84602 43197 747 65982 39729 -32860
11595 -32860 -15975 25525 22944 62951 90305 74820 52670 61730 55993 31670 29067 22147 40310
11582D0310N0851q818m2572l0222J2577m0724j9206R439k1986o2894k197O6681
11570d8761Q8863j6232o2971n7716N2276N0170k3514r906o481M3066P7518l9356
11558D6956k9390k3278J9024P366j3047j9679J1457N0345n2162k6265r911j8900
11546e7484q115M6240N9255Q257m3663K6993k8390m8024K7292m4395j8793Q5804
11534D977o397P159k6901J5425p617k6354n3713N833k086L5019K1748j7432M453
11521d5886L6114N2737K0442r6295n702M2211M0653l1886N828K0682p040j2009
11509A9849J2025M6379q588p9704l2000l0839K833R891K462R470k1400N4772J2829
11496b021l9690L9244M3510l0840j5971m779L4257O317l1496l881K4311p541l0036
$$ plain form
11582 40310 91161 82343 39771 9549 22126 -18598 -37804 -28365 -50351 -113245 -115442 -48761
11570 -48761 40102 23870 -39101 -96817 -44541 5629 -17885 -27791 -34272 8794 86312 46956
11558 46956 17566 -5712 13312 20678 7631 -12048 -591 49754 -2408 -28673 -38584 -57484
11546 -57484 -65599 -19359 39896 48153 4490 31483 3093 -44931 -17639 -62034 -80827 4977
11534 4977 -1420 5739 -21162 -5737 -13354 -39708 -93421 -87588 -89674 -54655 -32907 -50339 -45886
11521 -45886 -9772 42965 63407 -32888 -38590 3621 44274 12388 18216 38898 31858 19849
11509 19849 31874 78253 69665 -10039 -42039 -72878 -70045 -60154 -57692 -48222 -69622 -14850 -2021
11496 -2021 -41711 -2467 41043 10203 -5768 -10547 23710 30027 -1469 -5350 18961 11420 -18616
11483a8616O862k2039n170O6455K2236j4247l0717l8273Q791J9867J2157N0106
11471E7412M5394j6424k2196k6794K959n8169k279j0557k1746j3427N7702L9393
11459C1268j4165o7030J4321K4878j3451R014L344J6348K2670O66j0847q916m375
11446C725N7322J8256p220L6728L0643o2181j9050l1921o8766M272J8244L0832
11434A0884m7668l6287R778p963K7535N0095j7491m4434J7904j2384l6686P3008
11422a3709N7303J7576q957l2522m7876j4798J2174p94O5192k20k454n0744j7927
11409c7756l6797K9506O121P8755L8254Q810n2430p2447j7328M0334L0788m820
11397A0990K0404j1699l917J5329l7655n5747K8762L6967n80j0546K0886J3091
$$ plain form
11483 -18616 -11754 -33793 -38963 27492 49728 35481 4764 -33509 -24718 -4851 7306 57412
11471 57412 102806 86382 64186 37392 40351 -17818 -20097 -30654 -52400 -65827 -8125 31268
11459 31268 17103 -49927 -35606 -10728 -24179 -15165 -11821 4527 27197 27863 17016 8100 3725
11446 3725 61047 79303 72083 108811 139454 77273 58223 26302 -42464 -38192 -19948 10884
11434 10884 -36784 -73071 -63293 -71256 -43721 6374 -11117 -55551 -37647 -50031 -86717 -13709
11422 -13709 43594 61170 52213 19691 -28185 -42983 -30809 -31603 33589 33369 30915 -19829 -37756
11409 -37756 -74553 -45047 -38926 39829 78083 86893 34463 -37984 -55312 -14978 15810 10990
11397 10990 31394 19695 15778 31107 -6548 -62295 -33533 3434 2854 -7692 13194 26285
11385B6285M374k4348j8868k129P159P23L4548K0303k678L409n080K767j3632
11372C2833J9998M211K43l5792k5904m7072M7040j6568l7338l7674M6331L3381
11360a6311n039L620K6437j557K8561L0522L5423m2100j1167j3214j4656k5421
11348d902M9019O1991J7331j4188l2672j8041m4068J7433k1425j6235l2550l5949
11336g4256M1126R068L5558J6641l6566q058L5184L7307K0519k1339n7960p5925
11324g8701k3529K9278M6361K8166k3128k1598N8341K9177K035l1368j0567J4117
11312A8584m2934m301M6382K102j9427j575n204Q675n195k7929L0977q757K6653
11299A8051J686j7599L0906n3331k5671K7579o907O791L0853L1290N1854K8037
$$ plain form
11385 26285 30659 6311 -12557 -14686 -7527 -6804 27744 48047 45369 48778 43698 46465 32833
11372 32833 52831 57042 57285 21493 -4411 -51483 -4443 -21011 -58349 -96023 -49692 -16311
11360 -16311 -21350 -17730 8707 7150 35711 66233 101656 59556 48389 35175 20519 -4902
11348 -4902 44117 106108 123439 109251 76579 58538 14470 31903 10478 -5757 -38307 -74256
11336 -74256 -33130 -24062 11496 28137 -8429 -16487 18697 56004 76523 55184 -2776 -78701
11324 -78701 -102230 -72952 -26591 1575 -21553 -43151 15190 44367 46402 15034 4467 18584
11312 18584 -24350 -28651 17731 19833 406 -1169 -6373 2302 -2893 -30822 155 -8602 18051
11299 18051 19737 2138 33044 -20287 -45958 -18379 -25286 -18495 12358 43648 95502 123539
11287A23539k9421n4365J6854m1176r996L5627J7907l4373P532o9058n3415P6000
11275a4345L628L0382R739l7760k3984R323k566l8709o427J2286L2106m0815j771
11262f8913L6407M4793K3470j5083Q669J0928k9210k7580L1328K4345K3584j2997
11250D9741P957j0521l9116j2377k3414l453K6183J0199j083l2577k2344Q084
11238d2721K8503J7514k4744p2113K6145P3580O3885N2598k9780j6771J8588l4627
11226F0057J3418j8070j5892n2602j2331J9011j8309j6871K3557K7115K2659M9163
11214H0905P577k644N000j0330j9137O340o516j8069K4447J1929j7811J3315L7097
11201A12103k0141l3884l2474r938n0386k038m01K5072N5094n8824k4630k4762
$$ plain form
11287 123539 94118 39753 56607 15431 5435 41062 58969 24596 32128 -36930 -90345 -14345
11275 -14345 -10717 19665 29404 -8356 -32340 -23017 -25583 -64292 -70719 -58433 -26327 -67142 -68913
11262 -68913 -32506 12287 35757 20674 29343 40271 11061 -16519 14809 39154 62738 49741
11250 49741 57698 47177 8061 -4316 -27730 -31183 -5000 5199 4116 -28461 -50805 -42721
11238 -42721 -14218 3296 -21448 -93561 -67416 6164 70049 122647 92867 76096 94684 60057
11226 60057 73475 55405 39513 -13089 -25420 -6409 -24718 -41589 -18032 9083 31742 80905
11214 80905 88482 85838 90838 80508 61371 67711 61195 43126 67573 79502 61691 75006 112103
11201 112103 91962 58078 25604 15666 -34720 -36758 -37159 -12087 43007 -15817 -40447 -65209
11189f5209L1422N5905R222j0759M052o429K3502K2971k1321j9785M9194L7354
11177A10119k5528P703j0897P147m840l5144J4606L3950n9560m6913o5403K6845
11165d7915J7801K7046M8637L3156k6385k7044J3974K3939Q558j1904j8586J3898
11153E5175K7060k1566l0077P498k1224n441O727M414K4554p784l9879j4308k7121
11140d1972L5583J3806N0702j3223m7328K941O0052N949l2646l603K8099m4445
11128A3915J2507j5982q607K2369j3162m6036K7620O0610J262k9453k0821J0243
11116A4465l7638j4924j9631J3234K8445L3233j2282k2027n681K2148j1863P770
11104d751L6895K473j6738m1547N799L5269k2592m287L3559J225o399m5938N2
$$ plain form
11189 -65209 -33787 22118 31340 20581 24633 18204 41706 64677 43356 23571 72765 110119
11177 110119 84591 92294 81397 88544 83704 48560 63166 97116 37556 -9357 -74760 -47915
11165 -47915 -30114 -3068 45569 78725 52340 25296 39270 63209 71767 59863 41277 55175
11153 55175 82235 60669 30592 38090 16866 11425 18152 22566 47120 39336 -543 -14851 -41972
11140 -41972 -6389 7417 58119 44896 -2432 509 60561 66510 33864 30261 58360 13915
11128 13915 26422 10440 1833 24202 11040 -34996 -7376 53234 54496 25043 4222 14465
11116 14465 -23173 -38097 -57728 -44494 -16049 17184 4902 -17125 -22806 -658 -12521 -4751
11104 -4751 32144 34617 17879 -23668 -17869 17400 -5192 -9479 24080 25305 18906 -27032 -26980
11091b6980L2476L9588J6733N529m8677k5647L0802k6435l0170q234j9093L9245
11079b0863K3933J5828Q962j8951K2923J5530l3782J903k7858l3026j1156k177
11067e8734l3254L0129j261K8396K6422L3666O6809m2893l4819m2385J3976J0839
11055c109J4306O358n2181K6119j6072P03J8934m001K7153J011J973K6271J2729
11042F0194N4407k1469o7919J817K0223L2329L701l1884j5008J7022K2426k8627
11030D7212O877N161M789J0834L5455K4168l3702n0437L6242m714j6545j726n44
11017F3070L3217K693r927k5795J4850M6497k0197k4052n35m7123l1497J5373
11005A6574J0745M3898k1326l7802J5127K2041N8543n9480n3085q4405j3595P4284
$$ plain form
11091 -26980 5496 45084 61817 67346 18669 -6978 23824 -2611 -32781 -41015 -60108 -20863
11079 -20863 3070 18898 27860 8909 31832 47362 13580 15483 -12375 -45401 -56557 -58734
11067 -58734 -91988 -61859 -63120 -34724 -8302 25364 92173 49280 14461 -27924 -13948 -3109
11055 -3109 11197 17555 -34626 -8507 -24579 -23876 -4942 -8943 18210 19221 21194 47465 60194
11042 60194 114601 93132 25213 27030 47253 79582 83283 51399 36391 53413 75839 47212
11030 47212 54089 59250 64039 74873 110328 134496 100794 50357 86599 81885 65340 63614 63070
11017 63070 96287 98980 89053 63258 78108 124605 104408 80356 79821 32698 1201 16574
11005 16574 27319 71217 49891 12089 27216 49257 107800 48320 -4765 -89170 -102765 -28481
10993b8481K9641j5152J0072O7399N2237l8696m2076N820L1218l0606L0020k0749
10981E0647m7621m3022J1708j4139K6491M7011j622k363k3777K9535K2396j652
10969E3592L3497l2123r0447k3991P265k4365J5751Q4464M1707M1006j5937j7996
10957G2423k9496l1027K7595j9474K6835K3796l4904k1936k1223m6140P376L3147
10945a3028L880k0295J8006L0158j1538N4202K5397k7705Q168k9113M5141L3664
10933A16937m9023n6304K606P61n880K2423J4436K7082O442j8375p3956K2085
10921I234Q0746P6635l2198m5570l4121k8335Q867K0472k9287j6217N5930M4273
10909A10429j493m0972O319N0934K2678k5524K6962M0430m1058L132L567M860
$$ plain form
10993 -28481 1160 -13992 -3920 63479 115716 77020 34944 40764 71982 41376 71396 50647
10981 50647 3026 -39996 -28288 -42427 -15936 31075 29453 27090 3313 32848 55244 53592
10969 53592 87089 54966 -35481 -59472 -52207 -76572 -60821 23643 65350 106356 90419 72423
10957 72423 42927 11900 39495 20021 46856 70652 35748 13812 -7411 -53551 -46175 -13028
10945 -13028 -9148 -29443 -11437 18721 7183 61385 86782 59077 67245 38132 83273 116937
10933 116937 67914 11610 14216 14977 9097 31520 45956 73038 79480 61105 -12851 9234
10921 9234 89980 166615 134417 88847 54726 26391 35258 55730 26443 10226 66156 110429
10909 110429 108936 67964 74283 125217 147895 122371 149333 189763 148705 151837 155404 160264
10897A60264K9434j9660m8333p987n3568l9598l6532K1266J872l2289J5187Q5764
10885G5820M1180j4458l4172m037J4260K934J8415j8271O612m8430R431R6240
10873A45524K0684n3951l001K1244K2667j746j9061m4507O957L7827L9538k1802
10861A50373l4693m4007l4529p108O1771K6779J3868j4386l4392J492J8845L4158
10849A38171j717l2030n5951J5335L1278m1977q808L246J4654O7020K0831k9814
10837A20238o0170k9813J9146O1311M7768k0570k8702J942N961j2848j296j8358
10825H4609L1656N2281J5886k3741j1180J7785J9914J2504J3213J51O108m9323
10813A69863k35M1766K8454k4612O109K8275L7834P589j9567P9586J34280Q1395
$$ plain form
10897 160264 189698 170038 121705 113718 60150 20552 -15980 5286 7158 -25131 -9944 75820
10885 75820 117000 102542 68370 64333 78593 81527 99942 81671 88283 39853 49284 145524
10873 145524 166208 112257 109256 130500 153167 151421 132360 87853 94810 132637 172175 150373
10861 150373 115680 71673 37144 30036 91807 118586 132454 118068 83676 85168 104013 138171
10849 138171 136454 104424 48473 63808 95086 53109 44301 47547 62201 129221 150052 120238
10837 120238 60068 30255 49401 110712 158480 137910 109208 111150 117111 104263 102967 84609
10825 84609 116265 168546 184432 160691 149511 167296 187210 199714 212927 213078 219186 169863
10813 169863 169628 211394 239848 215236 221345 249620 287454 295043 275476 355062 489342 570737
10801E70737N3395O0293J00263J75047K03851J00849j2179P733L9147m5680r074
10790A244382o3480j96021j86447r9313o6020j33257k1735j7300P35l426r0288
10779C67830p5473k8048j7112l7034k0680J6983J5740L4312L1958k2457k9891
10768B36128P580k0547J5679J4030r192m5398j8423j9428o728o031M754J314l2590
10755A21148j1823l0851K1519K2641L0720k7388k7K1069j3048J944k2581q741
10743A04582R677q477j9001o190J2890j0302J6122j4906J6931j9769K4318L4225
10731A40100K2455j7883K152k9380k3937O8463J1118r178J4280L761j3020n6189
10719A12742k567O4039K3154K0830K6699j0350K1111p724k316N4185M0758n4558
$$ plain form
10801 570737 624132 684425 784688 959735 1163586 1264435 1252256 1259989 1299136 1253456 1244382
10790 1244382 1180902 984881 798434 699121 633101 499844 478109 460809 461544 458118 367830
10779 367830 292357 264309 247197 210163 189483 206466 222206 256518 288476 266019 236128
10768 236128 243708 223161 238840 252870 243678 198280 179857 160429 153701 147670 152424 153738 121148
10755 121148 109325 78474 99993 122634 153354 125966 125939 147008 133960 135904 113323 104582
10743 104582 114259 105782 86781 80591 93481 83179 99301 84395 101326 81557 105875 140100
10731 140100 162555 144672 146824 117444 93507 161970 173088 163910 178190 181951 168931 112742
10719 112742 110175 174214 197368 218198 244897 234547 255658 247934 245618 299803 340561 286003
10707B86003p450M8923L6411K0762K9041O1658N6213O2768R6035J26441J47763
10696I64568K40249K30170J50762M8053j23216j35211j54225k34343k08674j27635
10686F50498p4425n78n8054o4513p1201p8547N814j5154j3456k0059L414K5575
10674B89314L1317j5487J1208J6696j227q0425Q688N6096n7183o7421L0379K0677
10662B42632k6743l9375K1700J5525p5746N6978j4180J9534n825L1152L6561p873
10650B54340l1732M976j3414k94K1853P0941L5674k0621J1447m048K7752j3804
10638C43070N3256J3421k5883K4370l3479l5849n030m7699k4113Q258l2635l809
10626B33878K1801P279j1741k7021q967j9361k0830j0163M194K6569q179q782
$$ plain form
10707 286003 278553 327476 363887 384649 413690 475348 531561 594329 690364 816805 964568
10696 964568 1204817 1434987 1585749 1633802 1510586 1375375 1221150 986807 778133 650498
10686 650498 576073 575495 517441 452928 381727 303180 308994 293840 280384 260325 263739 289314
10674 289314 320631 305144 316352 333048 331821 251396 260084 316180 258997 191576 221955 242632
10662 242632 215889 176514 198214 213739 137993 194971 180791 200325 194500 225652 262213 254340
10650 254340 222608 227584 214170 213876 235729 306670 342344 321723 333170 329122 356874 343070
10638 343070 396326 409747 383864 408234 374755 338906 333876 286177 262064 270322 237687 233878
10626 233878 255679 262958 251217 224196 215229 195868 175038 164875 169069 195638 187459 178677
10614A78677M4595j0225j012J5261O084j9454M092J0229j0956J1393J3956K0206
10602B62846L0770P953m6786P265J0240l3977l9189m7928M1755L8843l5737P860
10590B03915K2107k8950j3474j0885k6226L7381k875j0987K5517M2933l424J4905
10578B49937k2145o7298j2978P642L5959K2403M415j7202M0066J0032l5617o949
10566B08265J2489J0623j5408j0917J1758J4210K3133L7376J934j1296k1199l0695
10554B30273M5764N6785L586J2622M5236J9977L7622N2933m2094N489J3906J5575
10542D97674L200J8101j5125j5622j7161J8391m9899o6985L8463K9345l7682r489
10530C93211J5701K0289J8239k2833j5186j8282m072n645M3077J0831K7877L5638
$$ plain form
10614 178677 223272 213047 212035 227296 233380 213926 218018 228247 217291 228684 242640 262846
10602 262846 293616 301569 254783 262048 272288 238311 199122 151194 192949 231792 196055 203915
10590 203915 226022 197072 183598 172713 146487 183868 180993 170006 195523 238456 235032 249937
10578 249937 227792 160494 147516 155158 191117 213520 217935 200733 240799 250831 215214 208265
10566 208265 220754 231377 215969 205052 216810 231020 254153 291529 293463 282167 260968 230273
10554 230273 276037 332822 336408 349030 394266 414243 451865 504798 462704 468193 482099 497674
10542 497674 500874 518975 503850 488228 471067 489458 439559 372574 411037 440382 402700 393211
10530 393211 408912 429201 447440 424607 409421 391139 387067 381422 424499 435330 463207 498845
10518D98845l7765o693N9619N0591m3815m6756q452N0333J1722L1265n6115o5360
10506D37419J1548K9836N3079l98k2809J462N5897m853K2475M7620O1733L5167
10494G28176P737k9238K2097l9238j8415L7096M3528k368m4642r059J5268Q3526
10482G94468J7729j4496J2652k3172N978k5685j1128K4994j530K9766M1949K3784
10470H75309J3039J5454Q9400M5698n1405k3084J9389L6758l6002n6002L4319
10459I62873J04195N3421P0151K3443K3859L1834K7970l1678M0404P3900l892
10448A376480J1933Q4991K1244Q1721J34810J09011N1838O0664P2672K1545K9027
10437B055936K9522Q6897J23934R5953N3159J01227J48645R8577N6699Q8057J94312
$$ plain form
10518 498845 461080 454387 514006 564597 520782 474026 465574 515907 527629 558894 502779 437419
10506 437419 448967 478803 531882 531484 508675 510137 566034 561181 583656 631276 693009 728176
10494 728176 735913 706675 728772 689534 671119 708215 751743 749375 704733 695674 710942 794468
10482 794468 812197 797701 810353 787181 793159 767474 756346 781340 779810 809576 851525 875309
10470 875309 888348 903802 993202 1038900 987495 964411 983800 1020558 984556 928554 962873
10459 962873 1067068 1120489 1190640 1214083 1237942 1269776 1297746 1266068 1306472 1380372 1376480
10448 1376480 1388413 1473404 1494648 1576369 1711179 1820190 1872028 1932692 2005364 2026909 2055936
10437 2055936 2085458 2172355 2296289 2392242 2445401 2546628 2695273 2793850 2850549 2938606 3132918
10426C132918J91685J88898J91157L19555L42019K79453L14341M07274M58879
10417E826179M94988N60266N77332O58223P39742Q29136R02002J055633J142035
10408A2785536J336061J484716J753789K064632K356077K798085L364470M135073
10400C2078439N202517O630181Q690891J1355510J5018027J9821257K5347869
10393A24144691L0046350L0942881K6285450J7760721R146291K555276k927308
10386B37954352r639030j8149031k6241520l0641234k9965348k5347395j9589760
10379G8381034j4684050j0903044q207139o322303m962937m013164l293913k673823
10371B3320661k100251j785312j563452j293204j229631j129757r50992q78631
$$ plain form
10426 3132918 3324603 3513501 3704658 4024213 4366232 4645685 4960026 5367300 5826179
10417 5826179 6321167 6881433 7458765 8116988 8856730 9685866 10587868 11643501 12785536
10408 12785536 14121597 15606313 17360102 19424734 21780811 24578896 27943366 32078439
10400 32078439 37280956 43911137 52602028 63957538 78975565 98796822 124144691
10393 124144691 154191041 185133922 211419372 229180093 238326384 240881660 237954352
10386 237954352 228315322 210166291 183924771 153283537 123318189 97970794 78381034
10379 78381034 63696984 52793940 44586801 38264498 33301561 29288397 25994484 23320661
10371 23320661 21220410 19435098 17871646 16578442 15348811 14219054 13268062 12389431
10363A2389431q70940q51866q00331o98710o47645n66655m55675m17180m23826
10354F656603l51776k65426k15278k17243k06229k32354j32975n3719p6581j43855
10344D761167j10371q7410r1295p5510j01641j04054k1132r573r019K7633J17601
10333D296396K9433P2126P0800J33477K13103K21220J59737J72946K81206L42717
10323E993161L60425L52015L99454M97347N53290N73798P15776P86643R20566
10314A1152475J033109J110357J197261J300331J526699J799242K159497K640989
10306B3919960L306532M096508N045973O251143P970443J0331439J3662958J8299178
10298I2884134K4561516L1796955L8210497M0199995L4796408K2140963L955378
$$ plain form
10363 12389431 11518491 10666625 9866294 9167584 8519939 7953284 7497609 7080429 6656603
10354 6656603 6304827 6039401 5824123 5606880 5400651 5168297 5035322 4981603 4905022 4761167
10344 4761167 4650796 4563386 4472091 4396581 4294940 4190886 4169754 4160181 4151162 4178795 4296396
10333 4296396 4325829 4397955 4468755 4602232 4815335 5036555 5196292 5369238 5650444 5993161
10323 5993161 6353586 6705601 7105055 7602402 8155692 8729490 9445266 10231909 11152475
10314 11152475 12185584 13295941 14493202 15793533 17320232 19119474 21278971 23919960
10306 23919960 27226492 31323000 36368973 42620116 50590559 60921998 74584956 92884134
10298 92884134 117445650 149242605 187453102 227653097 262449505 284590468 288545846
10291B88545846j5724235l1228089l9401914m0002975l4900893k7310371k0228553
10284G9748816j4768742j0984188q356973o560550n271651m269090l450194k751609
10276B3335819k261015j854737j551114j244446j046825r69023r31468r58244
10268A2518947r75171r44446q75999p70820p13297o40899m92058m20855m20867
10259F264535l92111l57484k88211l36881k93738k38450k51633k55575j82567
10250C667885j79248j91046k02325j86204j47974j44437j40753j12848m5352m1864
10240B275834q5112j07914n8135l4094o4358n4581l7755j2258r177j740l0254
10229A780456q8405q4269k2051m9623n1136r0416o8075p8973m7685o1400m360
$$ plain form
10291 288545846 272821611 241593522 202191608 162188633 127287740 99977369 79748816
10284 79748816 64980074 53995886 45638913 39078363 33806712 29537622 26087428 23335819
10276 23335819 21074804 19220067 17668953 16424507 15377682 14408659 13477191 12518947
10268 12518947 11543776 10599330 9723331 8952511 8239214 7598315 7106257 6685402 6264535
10259 6264535 5872424 5514940 5226729 4889848 4596110 4357660 4106027 3850452 3667885
10250 3667885 3488637 3297591 3095266 2909062 2761088 2616651 2475898 2363050 2317698 2275834
10240 2275834 2190722 2082808 2024673 1990579 1926221 1871640 1833885 1821627 1812450 1810710 1780456
10229 1780456 1692051 1607782 1585731 1536108 1484972 1394556 1326481 1247508 1199823 1138423 1134063
10218A134063m3413L842j054j3785j7123l6680m0701l8068l4051J555m7122m984
10206H62479K958m0425j3951k1480p1865m8683L4484L2604j2883j0363K1154j9347
10194G14682j8395l0461j3859k7633k7176m0745j2819J9568O248n35m6315k5516
10182D97044k194K7354J4606L0163J936o01j8957j2857J2440K242m5540o1026
10170D44610j2989K6824K7742J0470k0705J0260J5516L5962k2969n657k8503L8902
10158E19463K2821k3765j2270M244r602L1645n3355q6505n0003k1057P04j8592
10146C03728K0583K5092M5296J8294N650J6809n882k721P809M626j981k5372j6529
10133C95402j2108K2215K8717m6461n6513l9686j0449R7109L2238k4000n3266
$$ plain form
10218 1134063 1090650 1094492 1093438 1079653 1062530 1025850 985149 947081 913030 914585 867463 862479
10206 862479 865437 825012 811061 789581 717716 669033 703517 736121 723238 712875 734029 714682
10194 714682 696287 665826 651967 624334 597158 556413 543594 563162 569410 568875 522560 497044
10182 497044 494850 522204 536810 566973 568909 568308 549351 536494 548934 551176 505636 444610
10170 444610 431621 458445 486187 496657 475952 486212 501728 537690 514721 509064 480561 519463
10158 519463 542284 518519 506249 510493 500891 532536 479181 392676 342673 321616 322320 303728
10146 303728 324311 349403 394699 412993 418643 435452 429570 426849 434658 439284 437303 411931 395402
10133 395402 383294 405509 434226 387765 331252 291566 281117 378226 410464 386464 333198
10122C33198m164l2084J019J4730J3850j7584l950J7792j5108k2527p728J3119
10110B90563m0821l0089K3736j4361J1569k2751k3692K2229j4397j5195j4804
10099A71987L659L8519k3520l2842m4915K7708K3730K0495m5202L7334J8088l8268
10087A56773k6993L4837K3671P430o3038k9867J3340O10K0873k9386K9609J2307
10075A50166J0966o3786n7596K2335L9068O6309K4679q207l8392l3767J848k0415
10063I3208m1056L5260K3222L28r561N5021J3702R777M4410j0749k8100m0699
10051A44763K7338J3212j4875k145L1037J7663p650k0332m1817j9158k136J4364
10039A40264L1359j2888j4187N3510K6228p5719k0708J1484J0283J1579j3035
$$ plain form
10122 333198 329034 296950 297969 312699 326549 308965 305015 322807 307699 285172 277444 290563
10110 290563 249742 219653 243389 229028 240597 217846 194154 216383 201986 186791 171987
10099 171987 175646 214165 190645 157803 112888 140596 164326 184821 139619 176953 195041 156773
10087 156773 129780 164617 188288 195718 132680 102813 116153 116763 137636 108250 137859 150166
10075 150166 161132 97346 39750 62085 101153 167462 192141 183934 145542 111775 113623 93208
10063 93208 52152 87412 110634 110962 101401 156422 170124 179901 224311 213562 185462 144763
10051 144763 172101 185313 170438 168293 199330 216993 209343 189011 147194 128036 125900 140264
10039 140264 171623 158735 144548 198058 224286 148567 127859 139343 149626 161205 148170
10028A48170k91K826j3141m7479k8226J9699R2875j5783k3834L8877O622n8084
10016A22231N4766O9040n52M8988R88m8885l1341M4912r025j9594l4685q109N921
10003A94655L6115N3098o1762n3970k2134j5083M6318R072K3836M9300L2352J2851
9991C04648L5949O234L766N7796J9971K9482P2943Q3583J48786J62783J05767
9980A031708J00342J37468K7825n7802q660m3670p5925j13039j42542j41401j13094
9969F01210j50973p6181l6946n3110n5134k419q306n5258p1752J1813K9937J6685
9957A49566K191j5253L3467N881q155K861l9521j4614K1170K0843L8295L696m2890
9944A57537k1449m5025l0418m0718k2886M2950J4408L1331J9055K5536m9356J1458
$$ plain form
10028 148170 147879 150705 137564 90085 61859 81558 174433 158650 134816 173693 180315 122231
10016 122231 176997 246037 245485 294473 295461 246576 215235 260147 251122 231528 196843 188734 194655
10003 194655 230770 283868 222106 168136 146002 130919 177237 186309 210145 259445 291797 304648
9991 304648 340597 346831 350597 408393 428364 457846 530789 614372 763158 925941 1031708
9980 1031708 1132050 1269518 1297343 1239541 1230881 1187211 1111286 998247 855705 714304 601210
9969 601210 450237 374056 337110 284000 228866 226447 218141 162883 91131 102944 132881 149566
9957 149566 151757 136504 169971 175852 167697 170558 131037 116423 137593 158436 196731 200427 157537
9944 157537 136088 91063 60645 19927 -2959 39991 54399 85730 104785 130321 80965 92423
9932I2423J5258m1511m1345p567R774Q1672L4628r570o1367k7201j8842O154m503
9919B8003L7908L5995M7570q151j3755P0509J1506k7327l3553K2324J1974L5376
9907B18379M5331K22O7593L6448K7903K3543l0444n021Q200j6285j2673K4905
9895C88101L70Q2291J31560J30390J61629J60134K24657J80036N2997L3645m6721
9884A499089j23110j78343k10252k14372j81355j61878j18031l5469j9208m6500
9874B10571k838J0409m8207L0244j8324q4881k9927J495M9067M6600k9337p5366
9862E9506m2913q020K1640K86L383j2844J8954N782J0158O0107K0270P980J2475
9849A56764L1203j2053k2849P827J6488m7106J9217n1648J2631n3434m7012k3699
$$ plain form
9932 92423 107681 66170 24825 17258 27032 108704 143332 133762 72395 45194 26352 32506 28003
9919 28003 65911 101906 149476 141325 127570 198079 209585 182258 148705 171029 183003 218379
9907 218379 263710 263932 331525 367973 395876 419419 388975 383954 392154 375869 363196 388101
9895 388101 388471 470762 602322 732712 894341 1054475 1279132 1459168 1512165 1545810 1499089
9884 1499089 1375979 1197636 987384 773012 591657 429779 311748 276279 257071 210571
9874 210571 207733 218142 169935 200179 181855 96974 67047 68542 117609 164209 134872 59506
9862 59506 16593 8573 30213 30499 33882 21038 39992 45774 55932 116039 136309 144289 156764
9849 156764 187967 175914 153065 160892 177380 130274 149491 97843 110474 57040 10028 -13671
9837a3671j3135M2960J7755m015P6027L3713q6681O0332L1107l3037l6824J8549
9825I3080k8322o7724J6147O1971K6378Q393k0917j3494m8492J5609P67n1347
9813g951o9980k3604k4911K8694O7147L7066J9597k1551J3796j2983k5627j8191
9801c8498P517m2494Q445K3140K6631K7911m892L8618J816l095o1819J4338L349
9788I67L8061n4512o0576K2850M6392j5396N9538J5844o338K9667l7831n1110
9776a2444m13K8877q144m0087n018K3196M1209m2475o821J1309j8241M8870K8867
9763D8685j1100J8645p3572n1472k8965J8078K7524L8633J1791R625k5621k0582
9751c8331L9526n0818n1445M1356J0789l3303L1022R814k5511m934K1763J0181
$$ plain form
9837 -13671 -26806 16154 33909 29894 105921 139634 52953 113285 144392 111355 74531 93080
9825 93080 64758 -2966 13181 75152 101530 109923 89006 75512 27020 42629 43396 -7951
9813 -7951 -77931 -101535 -126446 -97752 -30605 6461 26058 4507 18303 5320 -20307 -38498
9801 -38498 -30981 -73475 -65030 -41890 -15259 12652 7760 46378 48194 45099 -16720 -2382 967
9788 967 39028 -15484 -76060 -53210 -6818 -22214 37324 53168 46830 76497 38666 -12444
9776 -12444 -12857 16020 7876 -32211 -37229 -14033 27176 -15299 -22120 -10811 -29052 19818 48685
9763 48685 37585 56230 -17342 -68814 -97779 -79701 -52177 -13544 -1753 7872 -17749 -38331
9751 -38331 1195 -49623 -101068 -59712 -48923 -82226 -51204 -41390 -66901 -71835 -50072 -39891
9739c9891m543L2870j9158k5473l3950J7280L8218M260j9432q657R945J5761m0710
9726g3480r901P506J9273L0708J4960L3689L7881m0906q446q308N812k7688n8819
9713g7719J3219L2998J3699N6202L5489q616j2315J7596J1054j7319k9692K2990
9701E7586k5696m7203j1748j9808K117J1588J6709N0027j5076O508K1988l2236
9689A4756R72N6571J7119p8190k2240l785M505l6379K6649o178j2898l9083J0030
9676f8151P3505L0909L9780j0881p0028O322K8484j7256P014L4649J9406L483
9664G7236l9244J1312k548k5385K239j0412L0046J8473K1062j8836L7533L474
9652A04950k6476M35q045r111n739M9356m025L2933l914j6126J5525J1917L5199
$$ plain form
9739 -39891 -44434 -11564 -30722 -56195 -90145 -72865 -34647 -30387 -49819 -58476 -48531 -32770 -73480
9726 -73480 -83381 -75875 -56602 -25894 -10934 22755 60636 19730 11284 2976 8788 -18900 -77719
9713 -77719 -64500 -31502 -17803 38399 73888 65272 52957 70553 81607 64288 34596 57586
9701 57586 31890 -15313 -27061 -46869 -44752 -33164 -16455 33572 18496 25004 46992 14756
9689 14756 15728 72299 89418 11228 -11012 -14797 -10292 -46671 -20022 -26200 -39098 -78181 -68151
9676 -68151 5354 36263 76043 65162 -4866 1456 29940 12684 19698 54347 73753 77236
9664 77236 37992 49304 46756 21371 23610 13198 43244 61717 82779 63943 101476 104950
9652 104950 78474 78909 70864 61753 56014 105370 101345 134278 130364 114238 129763 141680 176879
9639A76879M9941M6063o1016k4053n6520o4449j2650Q518L0143O212n2242J6948
9627F3774m8043r9796l5845O6963M4936L2880l1022q16j767J8222O5836K6107
9615A01429K0111l4052l3249j734O351n9159J7292J6742O202j0540m3494l1471
9603d5572k7964m616J7986k772j2944m9583K3466P8167L7888o981K0287M588J0933
9590D2883J2906p317j5143k0037L4799Q440R151L3435k8438m9723j7057l823j852
9577a776j2696m1676j0366K8174P3146L5853q495p520J0354O595m7036o4059j9192
9564e8694O720J096j1848J9665L0390K392M1227L4429o367o9596m0318N304M2763
9551b837J5065l0627j4636N652L5268n1068k8759M4663J2986J6121J0024N697
$$ plain form
9639 176879 226820 272883 211867 187814 131294 66845 54195 62713 92856 99068 46826 63774
9627 63774 15731 -84065 -119910 -52947 -8011 24869 -6153 -6969 -8736 9486 75322 101429
9615 101429 121540 87488 54239 52505 58856 -303 16989 33731 39933 29393 -14101 -45572
9603 -45572 -73536 -78152 -60166 -62938 -75882 -125465 -101999 -23832 14056 7075 27362 31950 42883
9590 42883 55789 48472 33329 13292 48091 56531 65682 99117 70679 20956 3899 76 -1776
9577 -1776 -14472 -56148 -66514 -38340 34806 70659 62164 54644 64998 71593 24557 -39502 -58694
9564 -58694 -51974 -50878 -62726 -43061 -12671 -10279 30948 65377 59010 -10586 -50904 -45600 -2837
9551 -2837 12228 -18399 -33035 -27383 7885 -43183 -71942 -27279 -14293 1828 11852 17549
9539A7549L8465O4304J0617r4267J6774J9412p941j9613m317n8707l2083N4489
9527D682K7049j9584l3717r20k0786l4146j4805L7286K8749k5436L6685o153k0918
9514d2014K1143J2231n635K8416K1731J99l0337k9995j7614K7133O4368k1982
9502B7644k2611m2920j1249K070J2218M5575k2481k7167M3028K9811j9808R703
9490B3813j844N8523j8750o9141m8371k2302K6436Q8072O944j6450k3275P597
9478A1252O7711N8400k3836m7047l3651j8281k922J8285J922j2168J2796K4449
9466E6910N492m3075m2365k2663J2614o19j3724m758M6034J5642j1150j0947J9544
9453F935k0081j0152k3352M5810L4568p907k2407k944j596L0208K0378l2548J510
$$ plain form
9539 17549 56014 120318 130935 36668 53442 72854 64913 45300 40983 -17724 -49807 4682
9527 4682 31731 12147 -21570 -22490 -43276 -77422 -92227 -54941 -26192 -51628 -14943 -21096 -42014
9514 -42014 -20871 -8640 -14275 14141 35872 36071 5734 -24261 -41875 -14742 49626 27644
9502 27644 5033 -37887 -49136 -47066 -34848 10727 -11754 -38921 4107 33918 14110 23813
9490 23813 21969 80492 61742 -7399 -55770 -78072 -51636 36436 43380 26930 3655 11252
9478 11252 78963 137363 113527 66480 32829 14548 11626 29911 31833 19665 32461 56910
9466 56910 62402 19327 -23038 -45701 -33087 -33706 -47430 -52188 -6154 9488 -1662 -12609 6935
9453 6935 -13146 -23298 -46650 -840 33728 25821 3414 470 -1126 29082 49460 16912 18422
9440A8422j8781j8795J1729J2572j8124m7558k8705o2467j5670J9319O0871O4880
9428b2307r920o7351K9215M8902K1237J8915J554J6030J0266k0658l4805J5212
9416F290L9008M3164P370k6005J7291L3178j5003o0823o600L3543l5894q1967
9404d6448k0892j1051r969P0349k1863o5888Q474M2797N4818k1375l355J07204
9392H2801O4718o7850m0010l1336m5885n396Q506l0053l4343J3395K6453K3479
9380c5521l0840M9453M3680J8850k0680l510K6823O780K6736P9781M395n2623
9368A13324m8937l5269L7964J8028m8479k4967j2045k441l4059K13M5580Q746
9356A7658n7733o0663N3121k3578J1297K8880K6829k8252l4996N836K1642L5863
$$ plain form
9440 18422 -359 -19154 -7425 5147 -12977 -60535 -89240 -151707 -167377 -148058 -87187 -22307
9428 -22307 -32227 -99578 -70363 -21461 -224 18691 20245 36275 46541 25883 -8922 6290
9416 6290 45298 88462 95832 69827 87118 120296 105293 44470 37870 71413 35519 -46448
9404 -46448 -67340 -78391 -88360 -18011 -39874 -105762 -97288 -54491 327 -21048 -24403 82801
9392 82801 147519 79669 39659 8323 -37562 -42958 -34452 -64505 -98848 -85453 -59000 -35521
9380 -35521 -66361 -16908 26772 45622 24942 21432 48255 55035 81771 161552 165947 113324
9368 113324 64387 29118 67082 85110 36631 11664 -381 -2822 -36881 -36668 8912 17658
9356 17658 -40075 -100738 -47617 -71195 -59898 -31018 -4189 -32441 -67437 -61601 -39959 -4096
9344d096j7159j8286M510J5171K5725m1256J4098j7143M4597K4139M301k0820
9332A3781k4895J9479l228l3045Q473K7791j9607q841J8334K9039l4514j4046
9320b1279r90R12n6466O593j8517r50L4977k8157L5110p972M7596Q2095M3964
9307A16916k1489m4055j6704K7786O448m3630m597J853L0094R922o391l0618j891
9294B3644Q0973L5552p2815j12762J8974L9065j6214j6344l542N6928R987l6834
9282F612j0602n175k9656j0704R4533k1190l3743k3325K6825L1711l658j8633
9270B995J2072k7324N0402J0274l2146k8782r927L5022L2247K6468l4835l2319
9258D147l7043K619N1191K2961l4293m6003j7534k4944L4352M6539j5599k2057
$$ plain form
9344 -4096 -21255 -39541 -35031 -19860 5865 -35391 -21293 -38436 6161 30300 34601 13781
9332 13781 -11114 8365 5137 -27908 -19435 8356 -11251 -20092 -1758 27281 -7233 -21279
9320 -21279 -22269 -21357 -77823 -71230 -89747 -90697 -55720 -83877 -48767 -56739 -9143 72952 116916
9307 116916 95427 51372 34668 62454 68902 25272 20675 22528 52622 62544 56153 25535 23644
9294 23644 104617 140169 67354 -45408 -26434 12631 -3583 -19927 -23469 33459 43446 6612
9282 6612 -3990 -9165 -38821 -49525 45008 23818 -9925 -33250 -6425 25286 21628 2995
9270 2995 15067 -12257 38145 48419 16273 -12509 -22436 12586 44833 71301 36466 4147
9258 4147 -32896 -30277 20914 43875 9582 -36421 -53955 -78899 -44547 1992 -13607 -35664
9246c5664l137j7206j3997M179q658Q195M7839L5705l1936m4385J3610j726m3571
9233i0752l1604N3127M8671j6691m9698L0889K2580j8062k4457j9461M780J0078
9221h0600M4715N5748R347k4803L9296L9132k7038n1160m0667k2298j6936L5254
9209d0010N7426j1419r794n08o178N4932L3978J2894m8780k9591m2453l3008j2457
9196g4968M7508M6862j7259j8503q888l2332m3094O8106N0777M5351K837l6009
9184C0388o4624O049K6827K0031l954K8065k2137j9622L9150l776j16241q2454
9172a62298M3317J3181m8044j5876Q3183M3376M6022L790P2342m556n3812l631
9160A6994k1492n0421J1515M771L3526M9016j9697J2257j2702j0726j8371r329
$$ plain form
9246 -35664 -38801 -56007 -70004 -65825 -74483 -66288 -18449 17256 -14680 -59065 -45455 -47181 -90752
9233 -90752 -122356 -69229 -20558 -37249 -86947 -56058 -33478 -51540 -75997 -95458 -90678 -80600
9221 -80600 -35885 19863 29210 4407 43703 82835 55797 4637 -36030 -58328 -75264 -40010
9209 -40010 17416 5997 -3797 -4305 -10483 44449 78427 91321 42541 12950 -29503 -62511 -74968
9196 -74968 -27460 19402 2143 -16360 -25248 -57580 -100674 -32568 18209 63560 66397 30388
9184 30388 -34236 -28187 -1360 18671 14717 42782 20645 1023 40173 36397 -79844 -162298
9172 -162298 -118981 -105800 -153844 -169720 -86537 -43161 2861 6651 78993 74437 20625 16994
9160 16994 -4498 -54919 -43404 -38633 -5107 43909 24212 36469 23767 13041 -5330 -14659
9148a4659K3695O2057M5132k2240l2590J6559N1130o765j4150J3406o7824k7714
9136B6037K3270j3875n5854k9690M7638K6545L0138M216j3274p9071m6343J2119
9124f8144Q36K9564K7039O499J0160k0732J2451j0380j7235J3006k0247p353K0023
9111b4513M1600J1323K9784K4828J5412J5586n165n206j5115m3893m6545j7787
9099a9691M3153O9582k7093o8417k2709j5379L1537O1023k2941k1383J5601J5371
9087C8654J0859j2398o3401l6553M922j9652L4066L7199L3318l981p268J7688
9075C3453o623l3926j3340k0179J2520l31K7306K2202Q606O689j1328N680J8624
9062D9353Q056o566n577M6166p7810n7445j7187K1904J6485K789j2944p521K8373
$$ plain form
9148 -14659 9036 71093 116225 93985 61395 77954 129084 122319 108169 121575 53751 26037
9136 26037 49307 35432 -20422 -50112 -2474 24071 54209 58425 45151 -33920 -80263 -68144
9124 -68144 -67308 -37744 -10705 -4206 5954 -14778 -2327 -12707 -29942 -16936 -37183 -44536 -24513
9111 -24513 17087 28410 58194 83022 98434 114020 108855 103649 88534 44641 -1904 -19691
9099 -19691 23462 93044 65951 -2466 -25175 -40554 -9017 52006 29065 7682 23283 38654
9087 38654 49513 37115 -26286 -62839 -57917 -77569 -43503 -6304 27014 23033 15765 33453
9075 33453 26830 -7096 -20436 -40615 -28095 -28426 -1120 21082 29688 36377 25049 30729 49353
9062 49353 57409 50843 45266 91432 13622 -43823 -61010 -39106 -22621 -19832 -32776 -40297 -11924
9049a1924p380j0209K089K65P888J3395K2343j5445J7211k8841m1366J0060l6141
9036g8055K6716J0095J2564J8186l894k1894k4342M0934P0765j5865r939o909
9024A8362J4808o4710m5955K7969N2284N9745K411K217k8458k7163n350L642J3441
9011B3243n3941M9804M0914K5816r93L787N070m2184m9035J3276m751l0461j9196
8998c8651J7004j3105l2785M2616K7558K1756o323n362L4159M5552j4690j2559
8986F5170j2752N215K5820l8018p0901j5659P6379K9992q1745k1334k1665l0452
8974h9950O5501N3892m6958r281j0201M6234J5613l7709K147J4420N1063L4145
8962H8916J8569j8022q1229k3467N0824L3240J7251J3363o3477n5507j1127M2276
$$ plain form
9049 -11924 -19304 -29513 -27424 -27159 -19271 -5876 16467 1022 18233 -10608 -51974 -41914 -78055
9036 -78055 -51339 -41244 -28680 -10494 -14388 -36282 -60624 -19690 51075 35210 25271 18362
9024 18362 33170 -31540 -77495 -49526 2758 62503 64914 67131 38673 11510 6160 9802 23243
9011 23243 -30698 19106 60020 85836 84843 88630 93700 51516 2481 15757 11006 -19455 -38651
8998 -38651 -21647 -34752 -67537 -24921 2637 24393 18070 12708 46867 92419 77729 65170
8986 65170 52418 57633 83453 45435 -25466 -41125 35254 65246 -16499 -37833 -59498 -89950
8974 -89950 -24449 29443 -17515 -26796 -36997 9237 24850 -12859 -10712 3708 54771 88916
8962 88916 107485 89463 8234 -15233 35591 68831 86082 99445 35968 -19539 -30666 11610
8950A1610J4048k1037m616J3850j6064L9922O151k8693M9149l595j7277j2788
8938C0660j8946m4736L5711O8640r101l1804j9225k717K285j4347n5386M108j2807
8925f7665j9112m483L0114P580M9803L1686J4144j985J0341p23m1043J4052N970
8912B8679J0339R701l3871k8317K5826K1419o3870l0684o373J6936Q616l1582
8900g3181k6286k1820K0800J7484J7270O0371j3214k1907M9752K0106o8526J1109
8888b8042l7028K531L5026j1816k2198K066l1252k0516O7648N1642K1047P420
8876C6528L7885l7724n4831J8581k3587J3482L1019J8795m558m372j0253l4182
8864a3217m983J486k1952J5085J8434L5244M1649n4052J5078K6727N768K9419
$$ plain form
8950 11610 25658 4621 5 13855 -2209 37713 43864 15171 64320 60725 43448 30660
8938 30660 11714 -33022 2689 71329 62228 30424 11199 8482 10767 -3580 -58966 -54858 -67665
8925 -67665 -86777 -91260 -61146 -53566 -3763 27923 42067 40082 50423 49700 8657 22709 28679
8912 28679 39018 48719 14848 -13469 12357 33776 -30094 -60778 -67151 -50215 -41599 -73181
8900 -73181 -99467 -121287 -100487 -83003 -65733 -5362 -18576 -40483 9269 29375 -39151 -28042
8888 -28042 -65070 -62539 -27513 -39329 -61527 -59461 -90713 -111229 -43581 8061 29108 36528
8876 36528 74413 36689 -18142 439 -23148 -9666 21353 40148 35590 31218 20965 -13217
8864 -13217 -18200 -16714 -38666 -23581 -5147 30097 71746 17694 32772 59499 65267 94686
8852I4686m2151r0917k9355o132Q889l786n589n748K4447L9869J5700N775k8641
8839b2953K1128J739j7651Q032l5075M4404M7235K8684L166j1170l0079l1193
8827F267l1919k1402N097N2861j6486n0009j0522N7859k870j3750J9538M6229
8815D0893J1563J2826l9779m2851K625k2021k6321L227N711N5523O0494k621k4963
8802C4306L1051J2279l0788k444N5383J3101j8546K8784j514r962P396k6852l5522
8789E6672k028j5400p150o826l3798K5257l4376p3797J7580K3198J7262j6880
8777e0286J4369J9631J9566k5921m9501N6967N6850j4719J854n0413o9178K1597
8765f9184M8541K2337q835k3958L5852L987j9726j0257k3558J0425K4218M3683
$$ plain form
8852 94686 52535 -38382 -67737 -73869 -64980 -68766 -74355 -80103 -55656 -15787 -87 5688 -22953
8839 -22953 -1825 -86 -17737 -9705 -44780 -376 46859 75543 78709 67539 37460 6267
8827 6267 -25652 -47054 -41957 10904 -5582 -55591 -66113 -8254 -11124 -24874 -5336 40893
8815 40893 52456 65282 25503 -17348 -14723 -36744 -63065 -59838 -54127 1396 61890 59269 34306
8802 34306 65357 77636 46848 44404 99787 112888 94342 123126 121612 111650 119046 92194 56672
8789 56672 54644 39244 32094 25268 -8530 16727 -17649 -91446 -73866 -50668 -33406 -50286
8777 -50286 -35917 -16286 3280 -22641 -72142 -15175 41675 26956 28810 -21603 -90781 -69184
8765 -69184 -20643 1694 -7141 -31099 4753 8740 -10986 -21243 -44801 -34376 -10158 33525
8753C3525K8676j1021k1114k9621m0942j9302J5901N3033l8807O012M3762J0679
8741C0781K0900J7721j4318j9655n8505o1303j6256M5537N5116r679K6346m887
8729A1798K0254J2783j8860J8549k5395j8229J4600N7339J3508J1972j2102l9281
8717D6936j8253L754k4169j3935j5847j0712M0234N1429L6004j1447n7218j05
8705B6671K1128O250J6878K1078l6850R741J2763l3611l2159P5738J969o432L975
8692H7139m5850l4261j5091R744K9342K5329L1679K7023l0002n3743K448J924
8680C5681Q5l2816j3845P681N0707M3784L2228m5682j6636Q5n0916O142R390K161
8666B8049j7781l1926J519K4579j3492n319j3282l3381m4798M8793O4306K7285
$$ plain form
8753 33525 62201 51180 30066 445 -40497 -59799 -43898 9135 -29672 -23660 20102 30781
8741 30781 51681 69402 55084 35429 -23076 -84379 -100635 -55098 18 -9661 16685 11798
8729 11798 32052 44835 25975 44524 19129 900 15500 72839 86347 98319 86217 46936
8717 46936 28683 32437 8268 -5667 -21514 -32226 8008 59437 95441 83994 26776 26671
8705 26671 47799 54049 70927 92005 55155 64896 77659 44048 11889 87627 89596 83164 87139
8692 87139 41289 7028 -8063 1681 31023 56352 88031 115054 85052 31309 33757 35681
8680 35681 35766 2950 -10895 -3214 47493 91277 123505 77823 61187 61272 10356 16498 25888 28049
8666 28049 10268 -21658 -20139 4440 -9052 -14371 -27653 -61034 -105832 -57039 7267 34552
8654C4552o1694j9711R003p9439j5069Q8603P0839l1392l9058J9435O938J3104
8642c889P5446K7134l4459k0292J8985L8359l0149Q065K9939J2432n3276k2655
8630D5640J9691n4682o4343R2j2659l2493l4980O8101N5307J8712M909l9523J290
8617b4938L6134J0009J5895P460L7895R385o0147k6522L6449J3120K3402j1758
8605F6384j3701j2521J4805K9465L90N471k0369K7097k6971j0777j0244J2164
8593F1193L5895M236j6934k1841r935o956N393J8355J9045j7364J3633k5961q688
8580E0071m4357k4663P069N0063N1417p8458l4013N3770L6652j1342j6851J3108
8568E2466j1487j3298K597J3724k2555k8491q4851J0192M7183M1304R115l073
$$ plain form
8654 34552 -27142 -46853 -37850 -117289 -132358 -43755 27084 -4308 -43366 -23931 -16993 -3889
8642 -3889 71557 98691 64232 43940 62925 101284 71135 79200 109139 121571 68295 45640
8630 45640 65331 10649 -53694 -53602 -66261 -98754 -133734 -65633 -10326 8386 13295 -26228 -24938
8617 -24938 11196 21205 37100 44560 82455 91840 31693 5171 41620 54740 78142 66384
8605 66384 52683 40162 54967 84432 84822 90293 69924 97021 70050 59273 49029 61193
8593 61193 97088 101324 84390 62549 52614 45658 51051 69406 88451 71087 84720 58759 50071
8580 50071 5714 -18949 -11880 38183 89600 11142 -22871 30899 67551 56209 39358 52466
8568 52466 40979 27681 30278 44002 21447 -7044 -91895 -81703 -34520 6784 15899 12826
8556A2826k1242l0525N073J3197K8716j7184k4928K3924j8131n7455J1561J7510
8544e6658L44j5179L6487P8615q949m3547K3871j4300l874K2791N615k9734J0807
8531F289J3579o6748r609l458L2547m6712J0667j1488M4650M4670J1237j0846
8519A4778j0195P271K3545j1948K695L6871M3909M957k9062j2155l9519j2360
8507A8787L695o9233o0235M5736M8831j1927k4411P37N1444m5069K6466P6422
8495F1243k0520Q992M3871L3733m2419m9101k1094m1156P930j4828O1253m9941
8483b2037j2576N1159j9632M15r663M819N1748P3891p577m2222k6266p2315l5350
8470f5606O4333L8084n3593l1124n018L6845M3760J432r871l3295j0649M6859
$$ plain form
8556 12826 -8416 -38941 -33868 -20671 8045 -9139 -34067 -10143 -28274 -85729 -74168 -56658
8544 -56658 -56314 -71493 -35006 43609 34660 -8887 14984 684 -3190 19601 25216 -4518 6289
8531 6289 19868 -46880 -56489 -59947 -27400 -74112 -63445 -74933 -30283 14387 25624 14778
8519 14778 4583 11854 35399 23451 26146 63017 106926 111883 82821 70666 31147 18787
8507 18787 22482 -46751 -106986 -61250 -12419 -24346 -48757 -48020 3424 -41645 -15179 61243
8495 61243 40723 49715 93586 127319 84900 35799 14705 -26451 -18521 -33349 27904 -22037
8483 -22037 -34613 16546 -3086 -2671 -12334 -7515 44233 118124 110547 68325 42059 -30256 -65606
8470 -65606 -1273 36811 -16782 -47906 -52924 -16079 27681 29113 19242 -14053 -24702 22157
8458B2157K9759k0898M150R365j8339p3777j5940l2123N28K5671K5644k8328J4418
8445e7713L7945N5321R3316o1147P111J433n5550j6707K1933N997K5638L468j5533
8432D5512o8631q484Q764o877M0718N26j6883O7251M1662k6407j4976M6125k6627
8419H1673l0930J1339L839j3228m7621k1014q83L5747J8163k3690p3879J1496
8407d8988L7893J0788L9124k445n1152L425M5078K1620j1791j1305K7015k2979
8395C6283m746Q795l8031j1989J6912N634M7127p9958q1191J5108O8676p131l3630
8382e8141k4013O973L8962M0382J7290K663j7848n6876j6727O1798J4439k6770
8370a7868J6546L3162j7915k6046J9831K2937L6347P094j1420J0056k6817j5340
$$ plain form
8458 22157 51916 31018 35168 44533 26194 -47583 -63523 -95646 -95118 -69447 -43803 -72131 -57713
8445 -57713 -19768 35553 128869 67722 74833 76266 20716 4009 25942 31939 57577 61045 45512
8432 45512 -23119 -31603 -22839 -29716 11002 11528 -5355 61896 103558 77151 62175 108300 81673
8419 81673 50743 62082 65921 52693 5072 -15942 -16825 18922 37085 13395 -60484 -48988
8407 -48988 -11095 -307 38817 36372 -14780 -11355 33723 55343 43552 32247 59262 36283
8395 36283 31537 40332 2301 -9688 7224 12858 59985 -19973 -101164 -86056 -17380 -24511 -58141
8382 -58141 -82154 -75181 -36219 4163 21453 24116 6268 -50608 -67335 -5537 8902 -17868
8370 -17868 -1322 31840 13925 -12121 7710 30647 66994 74088 62668 72724 45907 30567
8358C0567K3368L0866o2810m4747P333J247r849M1137l0637k4456L6022L3751
8346C1792L404K574M2136j8185m2211j3954N4325J6244L8762J047q7246p2950
8334d4262M778n242Q683L6865j0829k0678J5143N866L1024N044O620J392q025
8321B6379K721K8302m8209j8735O2224k6775l2232K9643q739j7271m3470K7332
8309a8830N0797n0517k9078j7598O78M5543L2977l972k6985K9061J631j9970L0621
8296B4358M7495M5379n0602l9898J5218l1615k7364k2007r990j8738j5527n03
8284h3794K0006O6356J7628l9697k0896r29k3697k9356k244k7086N3483L3675
8272c6551N4922K2760k4255n8691k7897m6743J3282N1075O5905j0590k5179k4006
$$ plain form
8358 30567 53935 84801 21991 -22756 -15423 -14176 -24025 17112 -13525 -37981 -1959 31792
8346 31792 35196 37770 79906 61721 19510 5556 59881 76125 114887 115934 28688 -44262
8334 -44262 -39484 -44726 -36043 822 -10007 -30685 -15542 -9676 21348 26392 33012 34404 26379
8321 26379 29100 57402 9193 -9542 52682 25907 -6325 23318 14579 -2692 -46162 -18830
8309 -18830 31967 -18550 -47628 -65226 -64548 -19005 13972 10000 -16985 12076 13707 -6263 24358
8296 24358 71853 117232 66630 26732 41950 10335 -17029 -39036 -49026 -67764 -83291 -83794
8284 -83794 -63788 2568 20196 -19501 -40397 -41326 -65023 -94379 -96623 -123709 -70226 -36551
8272 -36551 18371 41131 16876 -41815 -69712 -116455 -103173 -52098 13807 3217 -21962 -45968
8260d5968j4634l443q91j3050l9184j4773J13548K7470m423n3830k8476k3830
8248a01484J1835J376J7558j2702n15M9531J2243L8946m4915l717K9419L0261
8236B7836J3758K063m6765r0O4065L2671k4704n2816k7567J6290L833k8532l5078
8223e5036o61K8426N516k1456r421J9745M7092L232k8402M1110M0517j0652p3130
8210a3120N362k5581o336J1165j475l3513k0076K3214K3278R989J6987N7489p634
8197C9749j098L8701j4845m3393l9511n4952K2985O6769J7307M135N0786m9025
8185C7608p258p986J904J8262M206l6466k5375J4221J2465j7033m7534J3428J7238
8172b2320K6850j3956M6531k5711o8022K1150K9549J0339K0255k3577j4441L69
$$ plain form
8260 -45968 -60602 -64045 -64936 -77986 -117170 -131943 -18395 9075 4652 -49178 -77654 -101484
8248 -101484 -89649 -88273 -70715 -83417 -83932 -34401 -22158 16788 -28127 -31844 -2425 27836
8236 27836 41594 43657 -3108 -3198 60867 93538 68834 16018 -11549 4741 8574 -19958 -55036
8223 -55036 -55697 -27271 -21755 -43211 -52632 -32887 14205 17437 -10965 30145 70662 60010 -13120
8210 -13120 -7758 -33339 -39675 -28510 -29985 -63498 -83574 -60360 -37082 -27093 -10106 47383 39749
8197 39749 38651 77352 62507 19114 -20397 -75349 -52364 14405 31712 35847 86633 37608
8185 37608 30350 22364 24268 42530 46736 10270 -15105 -884 11581 -5452 -52986 -39558 -22320
8172 -22320 4530 -9426 37105 11394 -56628 -35478 -5929 4410 24665 1088 -13353 -12984
8160a2984J3173J0896J5284J0420k537j3958j3468L7140o5595l7061K3411l3948
8148f9227q148k878N4931L0167O0j3721K1928Q352n2876j0665k717l447l143J1846
8134c9538K6976Q912m1627k4552K2006K7278R7699K4986p5047p0497J7706k0425
8122d6123k2851o3058m1249N3697Q2283P0801O9868m6810j21560l1429K3775Q077
8110f4579K1288L948L4811M927k8320K7341o4033j030J7710l7821l9700n1548
8098a77006j5091P6951M6487j629J9408o281L4464N5366q156P896l7641k6824
8086c2056K9105M3674P398l6390K1510l7218o3283P346O7444K3487k1789l6231
8074b7003l1266O3141K3053l591k1691k5850Q98j9213L4318M3393K3720j8695
$$ plain form
8160 -12984 189 11085 26369 36789 34252 20294 6826 43966 -21629 -58690 -35279 -69227
8148 -69227 -77375 -80253 -25322 4845 4905 -8816 13112 21464 -31412 -42077 -44794 -48241 -51384 -39538
8134 -39538 -12562 -3650 -45277 -69829 -47823 -20545 77154 102140 27093 -43404 -25698 -46123
8122 -46123 -68974 -132032 -173281 -119584 -37301 33500 103368 56558 -65002 -96431 -72656 -64579
8110 -64579 -43291 -39343 -4532 395 -27925 -584 -64617 -65647 -47937 -85758 -125458 -177006
8098 -177006 -192097 -115146 -68659 -70288 -50880 -57161 -22697 32669 24513 32409 -5232 -32056
8086 -32056 -2951 40723 48121 11731 33241 -3977 -67260 -59914 7530 31017 9228 -27003
8074 -27003 -58269 4872 27925 24334 2643 -23207 -22309 -41522 -7204 36189 59909 41214
8062D1214J1307j0296Q127J4213n4588n0847m681K7750J7426K1118L8598L119
8050F2460l4127o9719n5365R871K5289M8214J16305j3794o6178n0025K953j2516
8038c6632m3475m6044L1363L2302L1426k3132Q02j534n4670k2688O5704K990j0311
8025g3899P3556M6524p8908M584N8093n1888P176P495K4278J7853o8928J223j367
8012c4208k2981O6756K7657Q5j4841o763J1673j680n0970J8733L061m5942p757
7999e7177M3395L3857l4162M8240K3382J878o300o7836p479j1641J5306L7830
7987A9293L0549Q219K603P51n3024k0429M3204q058Q819O072R035K611j8865J8171
7973D8951J3145L3925K2400K1127m9554o4773P682M0280K2158q465K4066R915
$$ plain form
8062 41214 52521 42225 50352 64565 9977 -40870 -45551 -17801 -375 20743 59341 62460
8050 62460 28333 -41386 -96751 -86880 -61591 -13377 102928 89134 22956 -27069 -24116 -36632
8038 -36632 -80107 -126151 -94788 -62486 -31060 -54192 -53390 -54924 -109594 -132282 -66578 -63588 -73899
8025 -73899 -343 46181 -32727 -28143 29950 -21938 -14762 -7267 17011 34864 -34064 -32841 -34208
8012 -34208 -57189 9567 37224 37309 22468 15705 27378 25698 -25272 -6539 -3478 -49420 -57177
7999 -57177 -13782 20075 -14087 34153 57535 59413 53113 -14723 -22202 -33843 -18537 19293
7987 19293 49842 58061 60664 61415 8391 -12038 31166 23108 31927 37999 47034 49645 30780 48951
7973 48951 62096 96021 118421 139548 89994 25221 32903 73183 95341 86876 110942 120857
7961A20857O16Q483K9138q045n0910l9123j3348K4211M0020M1939k6128k9933
7949I7777j0626j586m800k0075n2837k5846L3627j7298k1128J8971J9148J5075
7937C0402K5839o6834M0473M7672o015l3376j2449J7581N0116k6334m5861J9620
7925D0834K0212l2651k0959L0055Q650L9785K7815m8239p6863J97J9554P880j6352
7912h2j3450K2532N7216K194j0421l0487j7186l6742K048R337M9884K0411P581
7899F2835k8857K3479J4199j2963k4032n3227j2671L0283K5210q263j898J1798
7887B5893M3288J243m3587k0243L152o821K0831j7100o0405N972J264J2048N3904
7874A9439O4518k1046R396M2879L4490l0889p2036q840j4168j0760r555j9332
$$ plain form
7961 120857 121473 129956 159094 151049 100139 61016 47668 71879 111899 153838 127710 97777
7949 97777 87151 85565 80765 60690 7853 -17993 15634 -1664 -22792 -3821 15327 30402
7937 30402 56241 -10593 29880 77552 71537 38161 25712 43293 93409 67075 21214 40834
7925 40834 61046 28395 7436 37491 46141 85926 113741 65502 -11361 -11164 8390 16270 -82
7912 -82 -13532 9000 66216 68410 57989 27502 10316 -26426 -24378 -15041 34843 55254 62835
7899 62835 33978 57457 71656 58693 34661 -18566 -31237 -954 24256 15993 14095 25893
7887 25893 69181 70424 26837 6594 9746 2925 23756 6656 -53749 -47777 -46513 -34465 19439
7874 19439 83957 62911 72307 115186 149676 118787 46751 37911 23743 12983 3428 -15904
7862a5904J0788R9504J5411m4422p623k8248q030r374l5530L1429N246j8511l6826
7849d2090K2165K5610j7696K565j4865l927Q740m115l5852m4377J7386O5844K8105
7836G493K3364j6507k2323M862L1026j2382K18l5054j6742j611r004l2452M2272
7823c6840N2300K9546K6362K7782j8950l4328l1471n6223j7708L3556L8106j0014
7811B118j636K14K4827j8889j5496L8145O0233Q098o1738l0665J6004O4531L2043
7798A17789p7670r1816K9432L4374k257l0614l9516K1793J727l3851j607J9353
7786e2863j1348k1066J7953L0780L4836l4090p616J5764L1372l6094J3056l192
7774b2508l3272k2518K0879M8649Q8474L2178K8993O772R736j7462j12706l5593
$$ plain form
7862 -15904 -5116 94388 109799 65377 57754 29506 21476 12102 -23428 8001 13247 -5264 -42090
7849 -42090 -19925 5685 -12011 -9446 -24311 -28238 -19498 -23613 -59465 -103842 -86456 -20612 7493
7836 7493 30857 14350 -7973 -3111 27915 15533 15751 -19303 -36045 -37656 -46660 -79112 -36840
7823 -36840 15460 45006 71368 99150 80200 45872 14401 -41822 -59530 -25974 12132 2118
7811 2118 482 696 25523 6634 -8862 29283 89516 97614 35876 5211 21215 85746 117789
7798 117789 40119 -51697 -22265 12109 9852 -20762 -60278 -38485 -36758 -70609 -72216 -52863
7786 -52863 -64211 -85277 -67324 -36544 -1708 -35798 -43414 -27650 3722 -32372 -19316 -22508
7774 -22508 -55780 -78298 -57419 -8770 79704 111882 140875 147647 157383 139921 27215 -8378
7762h378K1937K9277M52l2731l1250k8537N3255M8567n557j6241j9858q2417L029
7749f8452K3935J0215K517L8673k7841m3965J3590P5969N3526J9627j8303K6667
7737A06158m0835j2203K4350L6451k1600o9793l2640O6423j035j0082j9487j5883
7725I824O590l764L6690R138n1636p7209P37K1466N2091J1018O5258k7429n8155
7712e381O180L4146K2471m268m464k6448p5204k2747L0309N8123K1491L38K1412
7699E5958J0676k4916l4721m0240J0892O1058O6329l718k3884k4655m4714l2651
7687b4586q508M696k7718m802L1718j2241J2645o1054j7866L8196P163K4622l180
7674d0915j4835K0356L8475K1267J7194K2090j8455l3224k6669J2635M8465L8991
$$ plain form
7762 -8378 13559 42836 43288 10557 -20693 -49230 4025 52592 47035 30794 10936 -71481 -68452
7749 -68452 -44517 -34302 -31785 6888 -20953 -64918 -51328 24641 78167 97794 79491 106158
7737 106158 65323 53120 77470 113921 92321 22528 -10112 56311 55276 45194 25707 9824
7725 9824 16414 12650 49340 58478 6842 -70367 -69630 -48164 3927 14945 80203 52774 -5381
7712 -5381 799 34945 57416 53148 48684 22236 -52968 -75715 -45406 12717 34208 34546 55958
7699 55958 66634 41718 6997 -33243 -22351 38707 105036 101318 77434 52779 8065 -24586
7687 -24586 -33094 -28398 -56116 -60918 -29200 -41441 -28796 -89850 -107716 -69520 -62357 -37735 -40915
7674 -40915 -55750 -35394 3081 24348 41542 63632 45177 11953 -14716 -2081 46384 85375
7662H5375j594m4542m0053J7833J0638J2713J2179J6893r345j6457k1944k0575
7650A121J4558m438k036p785o2412K4300k4481J7226M2690m0435l0J8354L8749
7637A5381N4124j4114q553j874N741n1847K269j7252K064J9364N0903L6988l2054
7624F1140l1049m9356o0172j5411R257o187j730L1687P5347N0671J7580n1671
7612C0106o943L4305j8215P978k3180l3419q962J5094L2431M9651l4389k1252
7600B3205k1176J0873k8344q8850K042O842K0180R962n5297M862J5474K0530n378
7587h5075M2618L821R564r483l2778J5865J9562K3542K9060j2890k4920M0522
7575A9408L4757k4776l5468j1274p142r924j375q816j5008L0749j1704j7867l0966
$$ plain form
7662 85375 83781 39239 -814 17019 27657 40370 52549 69442 60097 43640 21696 1121
7650 1121 15679 11241 9205 1420 -60992 -36692 -61173 -43947 -1257 -41692 -41722 -23368 15381
7637 15381 69505 55391 46838 44964 50705 -1142 1127 -16125 -14061 5303 56206 93194 61140
7624 61140 30091 -19265 -79437 -94848 -85591 -91778 -93508 -61821 13526 64197 81777 30106
7612 30106 23163 57468 39253 47231 24051 -9368 -18330 -3236 29195 78846 44457 23205
7600 23205 2029 12902 -15442 -104292 -102250 -95408 -75228 -65266 -120563 -115701 -100227 -79697 -85075
7587 -85075 -42457 -38636 -29072 -38555 -71333 -55468 -35906 -12364 16696 3806 -21114 19408
7575 19408 54165 29389 -6079 -17353 -24495 -34419 -35794 -44610 -59618 -28869 -40573 -58440 -89406
7562h9406j8560k25O4104N0009K1943J3659j3043o6538k1941K4266K6661J1418
7550B347k6289j1001Q037M0336K9273M8620M631l6528r018l9355n5960R289K1088
7537a4530K2307m022n291l69J73j6279j5525Q792j3755k8976m1970K2951J6488
7524g0006j9529p1912K6856O4265L4793l3924K1062M2914N934L3013R862l3397
7512I931k7376K3999K0745M438k2311l2m1233K2202k737j1769l1624L1899J0567
7499a3301L4708j4120l1157J8150l052j257K7542K6659n4692R832J0728p275q345
7486e580L4781L7103K2049k5106o4715o0828K1824L5710O9026O0387m9475l7629
7474C7547p090m318j8961L422L325k0415N614J6461k9414K1716J0695K788k1730
$$ plain form
7562 -89406 -107966 -108191 -44087 5922 27865 41524 28481 -38057 -59998 -35732 -9071 2347
7550 2347 -23942 -34943 -26906 13430 42703 91323 95954 59426 50408 11053 -44907 -35618 -14530
7537 -14530 7777 3755 -1536 -1905 -1732 -18011 -33536 -24744 -38499 -67475 -109445 -86494 -70006
7524 -70006 -89535 -161447 -134591 -70326 -35533 -69457 -48395 -5481 453 33466 43328 9931
7512 9931 -17445 6554 27299 31737 9426 9394 -31839 -9637 -12374 -24143 -55767 -23868 -13301
7499 -13301 21407 7287 -23870 -5720 -8772 -10029 17513 44172 -10520 -688 10040 2765 -5580
7486 -5580 29201 66304 88353 63247 -1468 -62296 -40472 -4762 64264 124651 75176 37547
7474 37547 30457 26139 7178 10600 13925 -6490 -876 15585 -13829 7887 18582 21370 -360
7461c60J6221O181P011k4836O112j5277p406m984L2690m6052j5700M4180K7741
7448B5521K3417J4713o5590m5128J974j99L9624J097l9164J8466L7787l8608l9608
7435f5698K0764M7673K2038K7367l266j8449r7835j1103J14371K719k6309j3291
7423a019J5734L6903N9558o3787q5186K0111K5887j1950k3897R421M5786L4397
7411F1958k7049R59K4652l3751q61l4044r459j0167r32L6022J9122j4260J5744
7398B7934l1906j0177J5807J6450n6010k986L496K6670J0411l5278j8891l1617
7386h6097J5201M1764M2165n1484k4686L3416L4706l2856J4003L5417J3720l3803
7374A466J2839j1470p040K4619n8602K0590N9207j6788o1503j7949k229q272m6837
$$ plain form
7461 -360 15861 22042 29053 4217 10329 -4948 -12354 -17338 15352 -30700 -46400 -2220 25521
7448 25521 48938 63651 -1939 -47067 -45093 -45292 -5668 -4571 -43735 -25269 12518 -26090 -65698
7435 -65698 -44934 2739 24777 52144 48878 30429 -67406 -78509 35862 38581 12272 -1019
7423 -1019 14715 51618 111176 47389 -37797 -17686 8201 -3749 -27646 -18225 27561 61958
7411 61958 34909 35868 60520 26769 25908 -8136 -17595 -27762 -28694 7328 26450 12190 27934
7398 27934 -3972 -14149 1658 18108 -37902 -40888 -37392 -10722 -311 -35589 -54480 -86097
7386 -86097 -70896 -29132 13033 -38451 -63137 -29721 4985 -27871 -13868 21549 35269 1466
7374 1466 14305 2835 -4205 20414 -38188 -17598 41609 24821 -36682 -54631 -56860 -65132 -111969
7361a11969k429M6355O4135N8950K1566L3411k0565j9619J226j1911j5446l4891
7349H813k3163M0833J1250R430L815k3925l4537k8236L6908N770m4422J1831K5613
7336b0k1582L608J6865n3302N1604J3636K3440l0566q88r472J1057K8639k8886
7323D133j6493q629j6378j5099L3537K4588L0120j6159n6170L3335j5347M5452
7311B6890L775m535M090j2904J4617j5348l2528j663J0263K757k6171j7758k0154
7298f8669M4042O0540K3768k1483j4882l3856M3079Q7188m8782l8573j7680l2890
7286a8198L444k9489J987p581j1919k6322o3164n569M7191Q9754O8685L7736m4005
7273D2550N330Q602J381m5272k7196k6484j0058K7237L961M3739K0788J3147k9129
$$ plain form
7361 -111969 -114398 -68043 -3908 55042 76608 110019 89454 69835 71061 59150 43704 8813
7349 8813 -14350 26483 37733 47163 50978 27053 -7484 -35720 1188 6958 -37464 -25633 -20
7336 -20 -21602 -17994 -1129 -54431 -2827 10809 34249 3683 2795 -6677 4380 33019 4133
7323 4133 -12360 -20989 -37367 -52466 -18929 5659 35779 19620 -36550 -3215 -18562 26890
7311 26890 30665 26130 30220 17316 31933 16585 -15943 -17606 -7343 -4586 -30757 -48515 -68669
7298 -68669 -24627 35913 59681 38198 23316 -10540 32539 119727 70945 32372 14692 -18198
7286 -18198 -14754 -44243 -42256 -49837 -61756 -88078 -151242 -156811 -109620 -19866 48819 86555 42550
7273 42550 47880 56482 57863 12591 -14605 -41089 -51147 -23910 -19949 23790 44578 57725 28596
7260B8596p755q036J1142O219J1587j3025l1052J122K2969O5720k9183p0366K5397
7247A3335k4600n2077K3714J8400j5229l4162K3181O0681M3941m861l1236l0305
7235i218j0512j5466J6315M4097K3814m2059J4404j8327n3707o562L470q498J6090
7222d6159q920N6779L1226l2341j0303J3504k4498k8390J7530M5989n3135j9589
7210e8307j3355J7670l126K8145N9204N521l42O120l6161K375l7062j8310l0380
7197g8008L9972N1018J5771Q526n2937m7051l2123K1158J3195j6238J0586P611
7185e8520q803k2257L3909L1704L3106K9079j8904k6125j180Q032K3090j6184
7173F947k8913K4473J5990J8004K2256L379p7666n7673r195n628j3416O8283L0042
$$ plain form
7260 28596 20841 12805 23947 30166 41753 28728 -2324 -1202 21767 87487 58304 -12062 13335
7247 13335 -11265 -63342 -39628 -21228 -36457 -70619 -47438 13243 57184 52323 21087 -9218
7235 -9218 -19730 -35196 -18881 25216 49030 6971 21375 3048 -50659 -57221 -53751 -62249 -46159
7222 -46159 -55079 1700 32926 585 -9718 3786 -20712 -49102 -31572 14417 -38718 -58307
7210 -58307 -71662 -53992 -57118 -28973 30231 35752 35410 41530 5369 7744 -29318 -47628 -78008
7197 -78008 -38036 12982 28753 37279 -15658 -62709 -94832 -73674 -60479 -76717 -66131 -58520
7185 -58520 -67323 -89580 -55671 -23967 9139 38218 19314 -6811 -7991 41 23131 6947
7173 6947 -21966 2507 18497 36501 58757 62136 -15530 -73203 -82398 -88026 -101442 -33159 -3117
7160c117L6901Q872L4720P628k0689M8600m4918n7047n958j639O070k115q0656
7147g3348Q3315K8112l3525k0618L0901O2022l635l1234l3479l253J8235m3912
7135b0419n1272k4159L2273j6442j2337O0267L5463l1483m2814j3110j8529O6681
7123c5881O3948L5399j6112m0084k6719r511m4138j2261L0253m958M454m9756
7111a05366R807j243J0431j8045M4293N2068j8887n3208k6129L0197L9693N4984
7099A8595M9394j4304n0489m9236L3552J03234j7338n0920J477j0109n8826q270
7087e3240j5019j2998K3060L8794K5467m689J7446K3412K3369r921k5588L6530
7075F6623R17l2368p0910l5337L4484J9379k6182M101m1744J752J17197J6066
$$ plain form
7160 -3117 33784 42656 77376 85004 64315 112915 67997 10950 4992 3353 9423 7308 -73348
7147 -73348 9967 38079 4554 -16064 14837 76859 73224 41990 8511 5258 23493 -20419
7135 -20419 -71691 -95850 -63577 -80019 -92356 -32089 3374 -28109 -70923 -84033 -102562 -35881
7123 -35881 28067 63466 47354 7270 -19449 -28960 -73098 -85359 -55106 -60064 -55610 -105366
7111 -105366 -95559 -96802 -86371 -104416 -60123 -8055 -26942 -80150 -106279 -76082 -36389 18595
7099 18595 67989 53685 3196 -46040 -12488 90746 73408 22488 23965 13856 -44970 -53240
7087 -53240 -68259 -81257 -58197 -19403 6064 1375 18821 42233 65602 55681 30093 66623
7075 66623 67540 35172 -35738 -71075 -36591 -17212 -43394 -39293 -81037 -79285 37912 53978
7063E3978K0214k1471n3562k9887m3893Q1476M5402J3280m3472o6942k6694K5179
7051d6392J5428o717j4914k9089o375L6393p631p355K3532M0900L0299p5522r491
7038e6934K8086L5266K939l1579O1662l811o4720J3928M6375J2334l0820k8306
7026a5580J1719J2570j2207N388K2480N952l9689K2299L8806M6723j2007m0408
7014D6046K8046M5130l2530l9288o871j5120l7328l0016k8402p870j1598J3213
7002g6588K6169N5634m586k0804K1586K5202k962j5794K063m6654j8795j3861
6990f9390J8035L2738j9856k1770L1363L6913J5351J287j8329M8149K2166J2359
6978H9016l6560k7359J5943J6036m8940l1522M0091N7699j2120m3138r158J1219
$$ plain form
7063 53978 74192 52721 -841 -30728 -74621 6855 52257 65537 22065 -44877 -71571 -46392
7051 -46392 -30964 -37681 -52595 -81684 -88059 -51666 -59297 -66652 -43120 -2220 28079 -47443 -56934
7038 -56934 -28848 6418 9357 -22222 39440 35629 -29091 -15163 31212 43546 12726 -15580
7026 -15580 -3861 8709 -3498 1890 24370 30322 -9367 12932 51738 98461 86454 46046
7014 46046 74092 119222 86692 47404 40533 25413 -11915 -41931 -70333 -78203 -89801 -76588
7002 -76588 -50419 5215 629 -20175 1411 26613 23651 7857 9920 -36734 -55529 -69390
6990 -69390 -51355 -18617 -38473 -60243 -28880 8033 23384 24671 6342 54491 76657 89016
6978 89016 52456 25097 41040 57076 8136 -23386 16705 74404 62284 19146 9988 21207
6966B1207r194k2525M6434P102L292m4691j7855J9938l2008M140M5190L1997Q574
6953F1601n7763m1329M9135J437K6870J8012j580N310o639j5858M23K0602l0339
6940B9882j9973J1067j9769L7105k1148n3023Q639N2164L1729l1677l3643O924
6928a723L0579J7007o5521l2606n922J7750j4394N7913M0993L484J2149o9384
6916i675p6269J9737M1752J6340L9730k0098n634J8463j4135J8088J2090k6940
6904A3449k1143J3089K7451J5075K2577J4848o805l7273p7479K9258O2000l5596
6892A9451o5437O3457O3152l4293l1467m2530p0005M690M5701n1452L5897M8737
6880a4099l4118q905m224m357r006j9860r588Q2755K2868l0416n6157n84M9351
$$ plain form
6966 21207 12013 -10512 35922 43024 46316 1625 -16230 3708 -28300 -24160 21030 53027 61601
6953 61601 3838 -37491 11644 13081 39951 57963 56383 61693 55054 39196 39619 60221 29882
6940 29882 9909 20976 1207 38312 17164 -35859 -27220 24944 56673 24996 -8647 -1723
6928 -1723 28856 45863 -19658 -52264 -58186 -40436 -54830 3083 44076 47560 59709 -9675
6916 -9675 -85944 -66207 -24455 -8115 31615 11517 5883 24346 10211 28299 40389 13449
6904 13449 -7694 5395 32846 47921 70498 85346 78541 41268 -36211 -6953 55047 19451
6892 19451 -45986 17471 80623 46330 14863 -27667 -97672 -92982 -47281 -98733 -62836 -14099
6880 -14099 -48217 -57122 -61346 -65703 -74709 -94569 -104157 -21402 1466 -28950 -85107 -85691 -36340
6867c6340N2679J8809O487L0326M937m2899l9669k5047k4337J6963n4282L6586
6855e5787J1664k5495M5386j3966j1930L662m8375j9129J8748L5309k5101j3087
6843i8101L4734M8649O548O4327J78k6064k1567P709l46k1274k3702l8424N9554
6830g779K0139p4607k1306M8949J4709r302M356j4879q232l6262M904P470J528
6817g0312O39L0004P7369q077j1506n4853l9525M8371l28l2576L5004M3169L3640
6804E1019j5443o027n17k499K8365J8200l6921n5340m0220n035M160k6018L0347
6791e5929N6250N400j7058K6778j5605N9314M6474n0058m3672j3820m0784M6630
6779C920K8262m9398m6363L7143J9883j6372m7620m6062o294K9117l1261L1484
$$ plain form
6867 -36340 16339 35148 41635 71961 76898 33999 -5670 -30717 -55054 -38091 -92373 -55787
6855 -55787 -44123 -69618 -24232 -38198 -50128 -46466 -94841 -113970 -95222 -59913 -85014 -98101
6843 -98101 -63367 -14718 -8170 56157 56335 30271 8704 16413 16067 -5207 -28909 -67333 -7779
6830 -7779 12360 -62247 -83553 -34604 -19895 -29197 -24841 -39720 -47952 -84214 -79310 -71840 -70312
6817 -70312 -69673 -39669 37700 29623 18117 -36736 -76261 -27890 -28218 -60794 -25790 17379 51019
6804 51019 35576 29549 29032 26533 54898 73098 36177 -19163 -59383 -64418 -60258 -86276 -55929
6791 -55929 321 5721 -11337 15441 -164 59150 105624 55566 11894 -1926 -42710 3920
6779 3920 32182 -17216 -63579 -26436 -6553 -22925 -70545 -116607 -122901 -93784 -125045 -93561
6767i3561N1099L3507N9920J0008r116j0452l0435l3530m544k7086K4696L1809
6755B315J14L5641O885J0676L0017l0677j569L6618J25j9666o6966m7794j4709
6742e8990j3344L3035K0972M2067k5987J161J5748n3496n0865N15O3773O1063
6730C5652j5937j6461L7025k1083k7138K252J4163L3909k7980k3297Q3744N1715
6718A26564j8104l5996j8508M3089J8670K7125l492l7112m8619m1084j6024p79
6706d270k4824R566N478l8718K465L2343J6789k8593J7219p273r782M0613k7057
6693a6044J8864L61K6080Q472k1685l273k9734j3023q865N772M1417k3643J6455
6680A154R592j8723m577O1954J3238j1314J581J9650L16n917n1926j0818j5287
$$ plain form
6767 -93561 -42462 -8955 50965 60973 51857 41405 10970 -22560 -27104 -54190 -29494 2315
6755 2315 2429 38070 44955 55631 85648 54971 53402 90020 90145 70479 3513 -44281 -58990
6742 -58990 -72334 -39299 -18327 23740 -2247 -1086 14662 -38834 -89699 -89184 -25411 35652
6730 35652 19715 3254 40279 19196 -7942 -5690 8473 42382 14402 -8895 74849 126564
6718 126564 108460 72464 53956 97045 115715 142840 139348 102236 53617 12533 -3491 -4270
6706 -4270 -29094 -19528 -14050 -52768 -50303 -17960 -1171 -29764 -12545 -19818 -29600 11013 -16044
6693 -16044 2820 3181 29261 37733 16048 12775 -16959 -29982 -38847 -33075 8342 -15301 1154
6680 1154 10746 -7977 -12554 49400 62638 51324 52905 72555 72871 66954 15028 4210 -11077
6667a1077o4573p978r055P345k2967L3685L4809M0301J7453l5989K138K597J5381
6654B070l985r483l9105L8935L2322P394m7654l6223o9494M849j6130M0848K3336
6641g2320O1831N5334m111j1275k0386j8658J697r613j5123N8831K4474l5899
6629A4782k4617J0158J3224p833k3644l7505K7048P7921j4772l0403M5569j7482
6617C2446m7539m8800L530N8697M2305k2135m116J4095N083m3436l3949l6448
6605h0267j4421O880J0788M155r804N070K4063L8319j3221m7328k3102L2425N7655
6592h788R266R79K5468l9803N829L7807K2265k501m5880o1089n3167k322M9413
6579f2523O8118J1932j4775P074j3229J6394j3190p5984r718J2535O129M9260
$$ plain form
6667 -11077 -75650 -83628 -92683 -85338 -108305 -74620 -39811 490 17943 -18046 -15908 -13311 2070
6654 2070 -1915 -11398 -50503 -11568 20754 28148 -19506 -55729 -125223 -120374 -136504 -95656 -72320
6641 -72320 -10489 44845 40734 29459 9073 -9585 -7888 -17501 -32624 26207 50681 14782
6629 14782 -9835 323 13547 5714 -17930 -55435 -28387 49534 34762 4359 49928 32446
6617 32446 -15093 -63893 -60363 -1666 40639 18504 14388 28483 33566 -9870 -43819 -80267
6605 -80267 -94688 -87808 -77020 -72865 -82669 -77599 -53536 -15217 -28438 -75766 -98868 -66443 -8788
6592 -8788 478 1457 26925 -12878 -7049 30758 53023 50522 4642 -56447 -109614 -111936 -62523
6579 -62523 5595 17527 2752 9826 -3403 12991 -199 -76183 -85901 -73366 -67237 -17977
6567a7977K3103p41O325N731M6185j7282j8914k7262j2464M0795j4691n814L2955
6554C9949O987j9001J1670l8103R298l42J806K1228l276l0948l4468M354P878
6541b2968j6339k3149M0530k0070o299J5665j6136m4046k5813J3858m118R6229
6529a2656m132l59J7002L6175J6053K2267R843j8756m6527m0958j6436J3828L0559
6516E903j0081k555j1660K9160M6099M2494k9154J7115L5134l2316o3088p872
6504A9179n813m6811m076k2535Q770J676L237N1476j0890K1715K7401l3198J1010
6491B1141N6940j0659k6133m0528m093J9617o976M0745l1762j9240J24K8762Q993
6478C6931j5465j1404J3060L4331l7393l7791l2674p0569j4571L1045M0549J2995
$$ plain form
6567 -17977 5126 4385 10710 16441 62626 45344 26430 -832 -13296 27499 12808 6994 39949
6554 39949 46936 27935 39605 1502 10800 10458 12264 33492 30216 -732 -35200 -30846 -22968
6541 -22968 -39307 -62456 -21926 -41996 -48295 -32630 -48766 -92812 -118625 -104767 -108885 -12656
6529 -12656 -16788 -17147 -145 36030 52083 74350 84193 65437 18910 -22048 -38484 -24656 5903
6516 5903 -4178 -6733 -18393 10767 56866 99360 70206 87321 122455 90139 27051 19179
6504 19179 13366 -33445 -37521 -60056 -51286 -49610 -46373 5103 -5787 15928 43329 10131 21141
6491 21141 78081 67422 41289 761 -3332 16285 9309 50054 18292 -948 -824 27938 36931
6478 36931 21466 10062 23122 57453 20060 -17731 -50405 -120974 -135545 -104500 -63951 -50956
6466e0956J3166k3923j6033L4988K8085J4088k8770K0315K9011j1604J0160P3769
6454I2296l1071n5025l5260k232k0275J192n606n0275J7833M0956K1118K3001
6442c348K0145j5411o5404n3954K7731j0662Q947L2322N4727K3501o292k7582
6430a5280k1758L4743J1105k1522K1090m8274j1177j2707J0656K4836J1566l8628
6418e5350k6304l3711M9924L9365j6273J9581M1863J2436k2027m4045m0098L2919
6406d1720L5265P1776m6891l9943j1125M8322k106m4686k1566j6177M074L4248
6394c0529K7672J0783J5245j9237j6519r07K7737J666m2778q214J8164l2138r461
6381e8516q64l7085N9429K9320L311m812m1690r876J7902J5619R304q889J8332
$$ plain form
6466 -50956 -37790 -61713 -77746 -42758 -14673 -585 -29355 -9040 19971 8367 18527 92296
6454 92296 61225 6200 -29060 -31292 -51567 -50375 -55981 -106256 -88423 -47467 -26349 -3348
6442 -3348 16797 1386 -64018 -117972 -90241 -100903 -91956 -59634 -4907 18594 12302 -15280
6430 -15280 -37038 -2295 8810 -12712 8378 -39896 -51073 -63780 -53124 -28288 -16722 -55350
6418 -55350 -81654 -115365 -65441 -26076 -42349 -22768 19095 31531 9504 -34541 -74639 -41720
6406 -41720 -6455 65321 18430 -21513 -32638 15684 13578 -31108 -52674 -68851 -64777 -30529
6394 -30529 -2857 7926 23171 3934 -12585 -13492 14245 15911 -26867 -35081 -16917 -49055 -58516
6381 -58516 -59380 -96465 -37036 -7716 -4405 -9217 -50907 -60783 -42881 -27262 -17958 -26847 -8515
6368h515k2982J4728p356J6622O943M3028L0836J5073k9052l4770n0863Q428j9380
6355c7260j4212J0682k6702K6350K3250K5488r384n8182n8827J824l2140j1330
6343a60443K2423P1285N7826j6946k6456k9417k2899j3738R528K8746O8185J2730
6331H24L8513N6300M0749J9698l1131k4849K660j3077m5964k9559q182l870k3044
6318b0932j9546k7144K3432M8695N6671j594k5830n5059K9350R368j1713M6850
6306E2548l464l7805J3169m1040o1476K312K1590J2334N4033N5712l633j6590
6294D7690k6966m626p169L6642J8051K9306j5509o1024j9483L3687L4717l2511
6282C2805k6441K1561R122L5333o071l4322j8192j3048n749n1294j9692K8341
$$ plain form
6368 -8515 -31497 -16769 -24125 -7503 -560 42468 73304 88377 59325 24555 -26308 -17880 -37260
6355 -37260 -51472 -40790 -67492 -41142 -17892 7596 -1788 -59970 -118797 -116973 -149113 -160443
6343 -160443 -138020 -66735 -8909 -25855 -52311 -81728 -104627 -118365 -108837 -80091 -11906 824
6331 824 39337 95637 136386 156084 124953 100104 102764 89687 43723 14164 5982 2112 -20932
6318 -20932 -40478 -67622 -44190 4505 61176 59582 33752 -21307 8043 17411 5698 52548
6306 52548 49084 11279 24448 -16592 -78068 -75756 -54166 -41832 12201 67913 64280 47690
6294 47690 20724 16098 8929 45571 63622 92928 77419 16395 -3088 30599 65316 32805
6282 32805 6364 27925 37047 72380 66309 31987 13795 747 -5002 -56296 -75988 -47647
6270d7647j6875K2926L5957K9198J7509j676m59k7615J6339l6640L990K3036N1698
6257F9741O794j4551m6149l0639K1803L5676J1750k3736M4127K7834j8431K5876
6245A10095k6578m7585m834J6628M1494l1310j280K159j8847p773o130K9755j1064
6232D4730m6370j2816J457n394j7276N2831k2572n4601m6180l7970L8356O6321
6220c9484K0285J4820J9026k1930j0818L2668l2622l775O276j2938o3616m0459
6208a32567m4457l6565K8881Q1653J9982L1877J7732o712J8478L9804K1266k3131
6196A6241k862o382k2224J4298j2744J9242J4433k1995j1156l3782m7964K9183
6184f5712k8149J0781K7267j2948Q312L1024M33j811p6266J2693K4496N6538R224
$$ plain form
6270 -47647 -64522 -41596 -5639 23559 41068 39392 38933 11318 27657 -8983 -4993 18043 69741
6257 69741 76535 61984 15835 -14804 6999 42675 54425 30689 74816 102650 84219 110095
6245 110095 83517 35932 31098 47726 89220 57910 56630 58789 39942 32169 26039 55794 44730
6232 44730 -1640 -14456 -12999 -18393 -35669 17162 -5410 -60011 -106191 -144161 -105805 -39484
6220 -39484 -19199 -4379 14647 -7283 -18101 14567 -18055 -21830 -15554 -28492 -92108 -132567
6208 -132567 -177024 -213589 -184708 -103055 -83073 -51196 -33464 -40176 -21698 18106 39372 16241
6196 16241 13379 6997 -15227 -929 -13673 5569 20002 -1993 -13149 -46931 -94895 -65712
6184 -65712 -93861 -83080 -55813 -68761 -60449 -29425 -28992 -30803 -107069 -94376 -69880 -13342 -4118
6171d118k0795l2481j4680N0436M9398J6833m81J8492j3442K3653m3181j8684
6159A0950K5241K9041l6394l0003j425M1544j6434J824j0524p558N1973n0833
6147G402l7615J2078j6405k4419k5750j1965K7419q54j4519L5233L4593M1396
6135B6594p459M0426k7533n8389n528J4120M782M5136k8377l2965L0087k9596
6123b8702J3086L8504p596m3233L979L018j0719N900m60o61K6666o800L3775j2969
6109A3788l0966K3665p1930k4045O3394n580M069L5283M9114K9091o3219k3598
6097i34j7230k4087L4232Q269m9309P567J0004r647r37j0846L9005K885l0044
6084d1072p055l1006J0429L5194L2145K1686m3984j2998L2042J4369p555l7489
$$ plain form
6171 -4118 -24913 -57394 -72074 -21638 27760 44593 44112 62604 49162 72815 29634 10950
6159 10950 36191 65232 28838 -1165 -2590 38954 22520 24344 13820 6262 58235 7402
6147 7402 -30213 -18135 -34540 -58959 -84709 -96674 -69255 -70109 -84628 -49395 -14802 26594
6135 26594 19135 59561 32028 -26361 -31889 -17769 -12987 32149 3772 -29193 894 -28702
6123 -28702 -15616 22888 15292 -27941 -23962 -20944 -31663 -25763 -26223 -26884 -218 -7018 26757 13788
6109 13788 -17178 6487 -65443 -89488 -26094 -31674 -27605 7678 56792 85883 22664 -934
6097 -934 -18164 -42251 -8019 250 -49059 -41492 -31488 -41135 -42072 -52918 -13913 -11028 -41072
6084 -41072 -48127 -79133 -68704 -33510 -1365 20321 -23663 -36661 -4619 9750 2195 -35294
6072c5294j1074J9099j5708p522l0539L0373J267K378L4261n3397m5394L0194
6060h1356L0926N9749P214k0381K0185J7757O189m6813n6902J5387L63j454k1105
6047g0241j0574R829R63p630J3878L7122K6489j8674J271k0281j5560j1821j0638
6034g5867P601P4639L6368p368J3303M3696l2867o1445n1325j0503J3406k7118
6022g7480K3766k3239K081K4722M5883k4939k7372P99J8177J2225N08l2519m1017
6009i8405O69M4185N5797J3944m2769L5446K7789O608K1692L0122l6552m1121
5997A7405K884k4161m0764j6472j7526M2381L3296o086q760m3519J3620R728J2588
5984b5386J3064m7207j5340L3131l463n2885j6113L1057J7764Q441O360j2428
$$ plain form
6072 -35294 -46368 -27269 -42977 -50499 -81038 -50665 -49398 -47020 -12759 -66156 -111550 -81356
6060 -81356 -50430 9319 16533 -3848 16337 34094 40283 -6530 -63432 -48045 -47682 -49136 -70241
6047 -70241 -80815 -70986 -70023 -77653 -63775 -26653 -164 -18838 -17567 -37848 -53408 -65229 -75867
6034 -75867 -68266 6373 42741 35373 48676 92372 59505 -1940 -53265 -63768 -50362 -77480
6022 -77480 -53714 -76953 -74872 -50150 -4267 -29206 -56578 -55779 -37602 -25377 -24869 -57388 -98405
6009 -98405 -97736 -53551 2246 16190 -26579 8867 36656 43264 64956 95078 58526 17405
5997 17405 20289 -3872 -44636 -61108 -78634 -36253 -2957 -9043 -17803 -61322 -47702 -37974 -25386
5984 -25386 -12322 -59529 -74869 -41738 -45201 -98086 -114199 -83142 -65378 -56937 -50577 -63005
5972f3005O464K726j6246j3091J3462L642K6724L321J8129L4789n840k2098L7637
5959B6614n885o929p378K1012j3491k2350J7261K2267j2857p6023m5528l5790
5947a39077K6464M5398M2376K2023l4624L7289N1080L1202l1639o1238l332J8646
5935D568J2199n156j2426M858r724k9616K4701r222k9620k2049L2095K469J562
5922c5361M3778j8662j4940N485P9942N2020j2470m8681m4594j2990K3023q700
5910G850k1141O254R31J2728M0913p123j2343j0566l8761k3908L9560K1954p897
5897H451m693k7432p6981R874O1801m135L121L0989j525P1314K2019l2510O217
5884F6510L5881m0648n8649m4551L2712M0180J9605q241p714j9637m1777j6562
$$ plain form
5972 -63005 -56541 -53815 -70061 -83152 -69690 -66048 -39324 -36003 -17874 16915 11075 -11023 26614
5959 26614 20729 13800 6422 27434 13943 -8407 8854 31121 18264 -57759 -103287 -139077
5947 -139077 -112613 -67215 -24839 -2816 -37440 -151 50929 82131 50492 -10746 -14078 4568
5935 4568 16767 11611 -815 4043 -5681 -35297 -10596 -19818 -49438 -71487 -39392 -36923 -35361
5922 -35361 8417 -10245 -25185 -19700 60242 112262 99792 51111 6517 -6473 16550 7850
5910 7850 -13291 -7037 -6106 6622 47535 40412 28069 17503 -21258 -45166 -5606 16348 8451
5897 8451 3758 -23674 -100655 -90781 -28980 -33115 -29994 995 -530 70784 92803 60293 66510
5884 66510 102391 61743 3094 -41457 -8745 31435 51040 42799 35085 15448 -26329 -42891
5872d2891J8331L1505q970l5906P779J2914k4795l6417l061N2330k281K5429N3396
5859D7363J0212n657m3023J1393M9931k8785J4960L5221l6684m2285m7707l2935
5847f7996l6542M3566L5098K9360l1704J5998K2077l1059l4547O383O902K1153
5835b1311o874k0162j3961O8018M15K8178L573J2794k151k5274L3995K222j2536
5822D6926m1383l2554k610k985o017m653k4742k1227P6108J06569J8397m722l2907
5809G4200j7213l4874k0954O7255k4764l0648M1262M177l6432j2480l5041k3337
5797d8849k7088m6248J5861O1355K0103P965p2111l719K7574Q990M2285N8532
5785D4650K1058R893k5244n3329l8309L3582N350m0656k517N2838j5905j3484
$$ plain form
5872 -42891 -24560 6945 -2025 -37931 -30152 -17238 -42033 -78450 -81511 -29181 -31462 -6033 47363
5859 47363 57575 51918 8895 20288 70219 41434 56394 91615 54931 12646 -35061 -67996
5847 -67996 -104538 -60972 -25874 3486 -28218 -12220 9857 -21202 -55749 -49366 -42464 -21311
5835 -21311 -28185 -48347 -62308 5710 6125 34303 37876 50670 48519 23245 57240 59462 46926
5822 46926 5543 -27011 -29621 -32606 -38623 -43276 -68018 -89245 -13137 93432 111829 107107 74200
5809 74200 56987 22113 1159 68414 43650 13002 54264 58441 22009 9529 -25512 -48849
5797 -48849 -75937 -122185 -106324 -44969 -24866 -16901 -89012 -92731 -65157 -56167 -13882 44650
5785 44650 65708 75601 50357 -2972 -41281 -7699 -2349 -43005 -45522 7316 -8589 -22073
5773b2073L6260j3202R158r888j070M1013j5858k9488K9954l966m1074J2219l4315
5760d2330N0205K4781L085N441m0256k1118j8182l1093k0513o050J2411M6128
5748c7491N9043M440J1443J1133o1196k5248l3921M4702L294R337K2197k2361
5736a4628n3719L7326O4918O559l8353l0077M897J3136J5737q972K6440L3136
5724E6400j9082m4475j6891o2300l0679J3023K6597M8361J8778k140k6620k1366
5712f0394k82K9852O1159k055m7523o5230M2608K0409K6582Q401K1337k4917J2997
5699B2944J4574N5279l3972n9612l0296k4725L4955K9639N4340J1686l7339k1123
5687A6350m1798q253M387M7126K4664J878l070k4193J5031k2618k7907m6925j9732
$$ plain form
5773 -22073 14187 985 10143 255 -815 40198 24340 -5148 24806 20840 -20234 -8015 -42330
5760 -42330 7875 32656 35741 41182 926 -20192 -38374 -69467 -89980 -96030 -83619 -37491
5748 -37491 21552 25992 37435 48568 -12628 -37876 -71797 -27095 -23801 -14464 7733 -14628
5736 -14628 -68347 -31021 33897 40456 2103 -27974 -23077 -9941 5796 -3176 23264 56400
5724 56400 37318 -7157 -24048 -86348 -117027 -104004 -77407 -29046 -10268 -12408 -39028 -60394
5712 -60394 -60676 -30824 30335 28280 -19243 -84473 -41865 -21456 5126 13527 34864 9947 22944
5699 22944 37518 92797 58825 -787 -31083 -55808 -20853 8786 63126 74812 37473 16350
5687 16350 -25448 -33701 -29314 17812 42476 44354 41284 17091 32122 9504 -18403 -65328 -85060
5674h5060N7647M8466l8513J2681N3530j4448k5581q364J0553M5931K8421l5249
5662E0014q0743l7966k5708M303K6933R7136J3510j5689j7075j6165j3218K168
5650a2500L6273K2728q119J3886n9024l0192J4906L5940J6869m7645l8300K3818
5638c1360p754M750M0423j2204k1663J2887L6530J2718l8870j2229M7954K4222
5626E5404k5131J7842J8865l8683k5563k8527J4251J3444k3355l2006K3634M5608
5614A5783Q165l2528J8667j9853p4189j1891k9389L9586K0924l4933J09041M7108
5602E6491m2090l1681j7552m9256K7463M3611O902N1335J5760m7612m3204P8L240
5589b6515M0179j5715l2645K541k7994m8221M441J2961K8162K2677J0389M1062
$$ plain form
5674 -85060 -27413 21053 -17460 -4779 48751 34303 8722 358 10911 56842 85263 50014
5662 50014 -30729 -68695 -94403 -90100 -63167 33969 47479 31790 14715 -1450 -14668 -12500
5650 -12500 23773 46501 38382 52268 -6756 -36948 -22042 13898 30767 -16878 -55178 -31360
5638 -31360 -39114 -34364 6059 -6145 -27808 -14921 21609 34327 -4543 -16772 31182 55404
5626 55404 30273 48115 66980 28297 2734 -25793 -11542 1902 -21453 -53459 -29825 15783
5614 15783 23948 -8580 10087 -9766 -83955 -95846 -125235 -85649 -64725 -99658 9383 56491
5602 56491 14401 -17280 -34832 -84088 -56625 -13014 -6112 45223 60983 13371 -29833 -29755 -26515
5589 -26515 13664 -2051 -34696 -32155 -60149 -108370 -103929 -90968 -62806 -40129 -29740 11322
5577A1322J9221n7439l1714O2227j3404o6342Q006P7417Q0857M8134j2767l0941
5565I4577o100r669p380o944p7032k4984J5014O4583j0034p5346K4594K2479k9477
5552b5719J7294J1452o779J8823J4760o107o4833m6307q456N887M6339M643l3932
5539g2935K5161M4326K0595l1575l2238K7896K1853J635j2486R417L0383N581
5527C7613K132K8715j1926m0228n22L2502N5685N86o6788k6191K7135K353m1597
5514e31j9307n0155l04m658K5510j4496M7530M1675M2656j1752j6546J8701K6083
5501H4406J3174m5292O432o4932j8035J7515J0281m146m870l5657L747j1539k0230
5488f9146O5239k820K0506L165K3257J7955j4681o9286J9144L6121j3521l4013
$$ plain form
5577 11322 30543 -26896 -58610 3617 -9787 -76129 -68123 9294 90151 138285 125518 94577
5565 94577 88477 78808 71428 64484 -12548 -37532 -22518 42065 32031 -43315 -18721 3758 -25719
5552 -25719 -8425 3027 -3752 15071 29831 23724 -41109 -87416 -95872 -89985 -43646 -39003 -72935
5539 -72935 -47774 -3448 17147 -14428 -46666 -18770 3083 4718 -7768 1649 32032 37613
5527 37613 39745 68460 56534 16306 15784 48286 103971 104557 37769 11578 38713 41066 -531
5514 -531 -19838 -69993 -70297 -74955 -49445 -63941 -16411 25264 67920 56168 39622 58323 84406
5501 84406 97580 52288 58720 -6212 -24247 -6732 3549 -597 -5467 -41124 -37377 -48916 -69146
5488 -69146 -3907 -6727 13779 16944 40201 58156 43475 -25811 -6667 29454 15933 -18080
5476a8080r763m8744J5464k838K1994L4452r223K6497k1863n295j6485M5665M9449
5463F1230o448k4661J323N416r668m0081j0833l8115j086N0766N8955m0638j0286
5450d126J06706O4464L1447q9493o0659m0013o3690R571M6214N6170l3486p869
5438A5236Q182l7762j0744O3416l278l8827k2267Q271L9183K8181k8481j1636
5426I474N6249m855p8873m1208k3998L1943O877K3009K2567J0788L679J8225M0114
5413G3991N377k0704m1621K0893Q2771p676m2106m5059M937j1885N532k636O719
5400B8533J0688j11P900l0375j7000n962K542M1932O0105O2736m2618o4099M950
5387E9221K4188K1063J771k7970n5424n4660k5542k121j5932J3036O4546k2971
$$ plain form
5476 -18080 -27843 -76587 -61123 -63961 -41967 -7515 -16738 9759 -12104 -17399 -33884 11781 61230
5463 61230 54782 30121 31444 36860 27192 -12889 -23722 -61837 -62923 -12157 46798 6160 -4126
5450 -4126 102580 167044 198491 108998 48339 8326 -55364 -45793 421 56591 23105 15236
5438 15236 23418 -14344 -25088 38328 35050 -3777 -26044 -17773 21410 49591 21110 9474
5426 9474 65723 60868 -18005 -59213 -83211 -51268 -44391 -21382 1185 11973 15652 33877 73991
5413 73991 79368 58664 17043 37936 120707 113031 70925 25866 30803 18918 24450 21814 28533
5400 28533 39221 39110 47010 16635 -365 -6327 -3785 38147 98252 160988 118370 54271 59221
5387 59221 83409 104472 106243 78273 22849 -31811 -57353 -59474 -75406 -62370 2176 -20795
5375b0795o7905J6923l4895L910M4547J0176K5638O225k5200j7274K3266N2083
5363A6699K5134K2403K7916k2417l8816j4213R205J0420j2886K7331K1144J1468
5351H3388p764N630m3548l8365l0270Q0697N6794k8705l689l3892k9295l547K0724
5338B8158J4292l255O992m2800l2894L4439J6967j3706l860K675O3164K4626j8926
5325G5872k8748l1698J6101j1382n8096J491K7800J2467J8854L1075M060k5438
5313C2358k1815m9277l7723j8810L7137P101n910P461N7674J631j480n5509J7723
5300b9439N1733K8170o2429l3911r350K5679K0411p128J2186j2767j9714j05j3674
5287e0338k6058K8860L7519k0659N354R013r66O470j0639m7026k4122L5959l3978
$$ plain form
5375 -20795 -88700 -71777 -106672 -102762 -58215 -48039 -22401 -16176 -41376 -58650 -35384 16699
5363 16699 41833 64236 92152 69735 30919 16706 25911 36331 23445 50776 71920 83388
5351 83388 75624 81254 37706 -659 -30929 49768 106562 77857 74168 40276 10981 7434 28158
5338 28158 42450 39195 46187 3387 -29507 4932 21899 8193 4333 7008 70172 94798 75872
5325 75872 47124 15426 31527 20145 -37951 -36460 -8660 3807 22661 53736 57796 32358
5313 32358 10543 -38734 -76457 -95267 -58130 -51029 -56939 -49478 8196 9827 8347 -47162 -29439
5300 -29439 22294 50464 -11965 -45876 -55226 -29547 -9136 -16264 -4078 -16845 -36559 -36664 -50338
5287 -50338 -76396 -47536 -10017 -30676 -25322 -16309 -17275 -10805 -21444 -68470 -92592 -56633 -90611
5274i0611J3067P8790J4453m5659j0746r150j1851K2281K8939k1391J4344J8339
5262H05j0709k3909L4550O031m6719L276M2777n4572l6402K2913N5571k456k7899
5249c6743k3132L8291M8864M0129n3171p6783o1772K8379K4830r109J5638k682
5237f7261J0426K6710k1302M0926N9722Q221o5350k4244j4437K445K771k0672
5225f2045N5925j6238j1759L4003P1793q613p7248j0670l0855K3645J6130k2790
5213c8722l9242J3562L9844N208k577J9600N9786K115l6320p43K4093R779k3850
5200C2533k6582l3646J2517M3103L7417N0480j8095J0550m7088M3466M9388n9597
5188I4446p4001M309R42k6206L9469j7970k1541l0885j3172L4203N5800k4892
$$ plain form
5274 -90611 -77544 1246 15699 -29960 -40706 -49856 -61707 -39426 -10487 -31878 -17534 805
5262 805 -9904 -33813 737 6768 -39951 -36675 6102 -48470 -84872 -61959 -6388 -8844 -36743
5249 -36743 -59875 -21584 27280 67409 14238 -62545 -124317 -95938 -71108 -80217 -64579 -67261
5237 -67261 -56835 -30125 -51427 -10501 49221 57442 -7908 -32152 -46589 -44144 -41373 -62045
5225 -62045 -6120 -22358 -34117 -114 71679 63066 -14182 -24852 -55707 -32062 -15932 -38722
5213 -38722 -77964 -64402 -24558 -19350 -21927 -2327 57459 59574 23254 22511 46604 56383 32533
5200 32533 5951 -27695 -15178 27925 65342 115822 97727 108277 61189 104655 154043 94446
5188 94446 20445 24754 25696 -510 38959 20989 -552 -31437 -44609 -10406 45394 20502
5176B0502l4191J0098m644M663M2531L8619R903r659k5681k5536j6605o793K8620
5163C1827r154K3379o7592J5499M6024P8161m5964o2164l3944K274O0250K437
5151D1033q01J9203N491j3628k5383k2465M415R858k9145j7246K3098N448K01
5138G9O700L253L1136j761j0160k2539n5823l9871L6307M0944J5469K2534K3429
5125D9697k5834l3054N620l9240J9295o914q975L3635N589M3264p956n7655n045
5112b7573L1692m817K6025J5213R249n3625m5100M2011k3337J0545L1313K3006
5100C4602m1125m246M2701L9128j6373m0335R12n0740m8177O3430N3690M0888
5088G4355k898j0901l4078q0099k0030K9826j7686j6630P9598N0675l4077K9051
$$ plain form
5176 20502 -13689 -3591 -8235 -3572 38959 77578 87481 77822 52141 26605 10000 3207 31827
5163 31827 22673 46052 -21540 -6041 39983 118144 72180 10016 -23928 -21654 38596 41033
5151 41033 40232 59435 64926 51298 25915 3450 7865 17723 -11422 -28668 -5570 -122 79
5138 79 6779 10032 41168 39407 29247 6708 -49115 -88986 -52679 -11735 3734 26268 49697
5125 49697 23863 -9191 -3571 -42811 -23516 -30430 -39405 -5770 -181 43083 35127 -22528 -27573
5112 -27573 4119 -698 25327 40540 49789 -3836 -48936 -6925 -30262 -19717 11596 34602
5100 34602 -6523 -10769 31932 71060 54687 14352 15264 -35476 -83653 -20223 33467 74355
5088 74355 71457 60556 26478 -53621 -73651 -43825 -61511 -78141 1457 52132 18055 47106
5076D7106m1658Q023K9758k9234K751l2334k9040m6905q242O2589K353J8602M1547
5063B5316K7627K5892o736n1690k314j2772k9186j407R000N8457K9359q4165n9675
5050g2294m005L5376J5626J2922L6381J0364o5346j6916o354m721j096r702N3010
5037a6755K0327p961J5510m3651j0330K0514L0299k9931j5141N2631J1591M6357
5025G3460P9116j6230m5214j5738l994k5520j5870j1890J2701J0911m8504j2021
5013a8793L0571j4832K2104J3943O985q410p8423o0553K9597O1477K5789k5623
5001a6168n4041J1199K3633K5173J8383n9644m4646K9144L2856O2153J0403J6226
4989E4671N659o924o327l1840k3383K6436k5419k1921k2412j3213K994k3690J5786
$$ plain form
5076 47106 5448 13471 43229 13995 16746 -15588 -44628 -91533 -99775 -37186 -34833 -16231 25316
5063 25316 52943 78835 72099 20409 18095 5323 -23863 -25270 -16270 42187 71546 -12619 -72294
5050 -72294 -76299 -40923 -25297 -12375 24006 34370 -30976 -47892 -54246 -58967 -60063 -69765 -16755
5037 -16755 3572 -4389 11121 -32530 -42860 -22346 7953 -21978 -37119 15512 27103 73460
5025 73460 152576 136346 91132 75394 71400 45880 30010 18120 30821 41732 -6772 -18793
5013 -18793 11778 -3054 19050 32993 39978 31568 -46855 -107408 -77811 -16334 9455 -16168
5001 -16168 -70209 -59010 -35377 -10204 8179 -51465 -96111 -66967 -34111 28042 38445 54671
4989 54671 60330 53406 47079 15239 -8144 18292 -7127 -29048 -51460 -64673 -61679 -85369 -69583
4976f9583M4420j4875J282P0758P5296m3718k7675j5551K8642j2117j8967J7648
4964C5560r470j7918O185j0543R439J2355k0049m2166M53K2473O921K4213m9317
4951c1864k8966J5561P59j9750K3045K0761P2495J0583N52L576k8992o9707J2542
4938a9405L2794j9660K4338m0339M079K2801L2636j624j4856j9420O121n633k8115
4925b6283r665l427J9508K2871k4710m4185J3165M1603K8559k1017j3537o925
4913b4043M355K1581K8733P896j3713K0834j1514n795K0324m224k6045k1570K7681
4900B4500l5317l2303j8734J8446O224k8892O9700M4733j9592k9067K3742J1950
4888C5390k1507M3849J2045O1222k3160j7416M503R826l458n4894o2694n6068
$$ plain form
4976 -69583 -25163 -40038 -38756 32002 107298 63580 35905 20354 48996 36879 17912 35560
4964 35560 26090 8172 14357 3814 13253 25608 5559 -36607 -36154 -13681 -6760 17453 -31864
4951 -31864 -60830 -45269 -44510 -64260 -41215 -20454 52041 62624 63176 66752 37760 -31947 -19405
4938 -19405 13389 -6271 18067 -22272 -18193 4608 37244 35620 20764 1344 7465 1832 -26283
4925 -26283 -35948 -39375 -19867 3004 -21706 -65891 -52726 -11123 17436 -3581 -17118 -24043
4913 -24043 -19688 1893 30626 38522 24809 45643 34129 28334 48658 44434 18389 -3181 24500
4900 24500 -10817 -43120 -61854 -43408 -37184 -66076 3624 48357 28765 -302 23440 35390
4888 35390 13883 57732 69777 130999 107839 90423 94926 104752 101294 46400 -16294 -72362
4876g2362j8377K990K2675N40J4745L879j0921j836l4125J0111J7162j2526m4469
4863a22514j8228P0178O0680O9616M3082l3722j7265j2982j8538o2610j6354K9509
4851b9148P28L533J5071K9475j4080l4533R402L4687O041l336l8648O655l2162
4838d6315m3105k0395M3084K2784K7725K8734j157j1026J8168j6125o088r608
4826a3324k9167r982K7285J239K8501K7970K6125k2402K133J2568j3764J0186
4814D7368N221L290q32j9259l4158q562j5418k752J0224O128L6277L8068j1881
4801E3714k0302q312m0066l4131j594J3191n7556j3258M3542M7311L852P84K94
4788a2531k2846N540o1241R243K9728k143j0105m3207K2118M8543J1929K0399
$$ plain form
4876 -72362 -90739 -87749 -65074 -64534 -49789 -45910 -56831 -58667 -92792 -82681 -65519 -78045 -122514
4863 -122514 -140742 -70564 -9884 59732 102814 69092 51827 38845 20307 -42303 -58657 -29148
4851 -29148 -28420 -24887 -9816 19659 5579 -28954 -19552 15135 21176 17840 -20808 -14153 -46315
4838 -46315 -89420 -109815 -66731 -43947 -16222 12512 11355 329 18497 2372 -3716 -13324
4826 -13324 -42491 -52473 -25188 -23949 4552 32522 58647 36245 38378 50946 37182 47368
4814 47368 52589 55879 55047 35788 1630 -6932 -22350 -25102 -14878 -8750 27527 65595 53714
4801 53714 33412 25100 -14966 -49097 -50691 -37500 -95056 -108314 -64772 -17461 -13609 -12825 -12531
4788 -12531 -35377 -29837 -91078 -81835 -52107 -54250 -64355 -107562 -85444 -36901 -24972 -4573
4776d573l687l8730n3863K7923Q2858J5294J1683J2278k9319J3424J6270m3244
4764F314k5322j0900K0938K7834m5216n9109q576K1147M5862M3075k1223L0700
4752B5524n5648k5882O907J2346j5224K5988K8269M3178m7569o4260R264N5783
4740a324J9935j3976j592n2145J6561N4698K3029j3494r277p316l744j6514J6944
4727A1785M3693m40n080k1407q309M575j2381K4969Q416J6707l1640j3203j2109
4714E576K4315j481l1514M4606m944r294l3445k3146j3455O33m296Q30O0043k1960
4700g532m773K0671k4035J9166k2921j6873J5873K0404j4964n6220J3022J5724
4688d2458L413M8038J7512m351J5429j4972l0817P305k859j6289m372r190K7134
$$ plain form
4776 -4573 -8260 -46990 -100853 -72930 9928 25222 36905 49183 19864 33288 49558 6314
4764 6314 -19008 -29908 -8970 18864 -26352 -85461 -94037 -72890 -27028 16047 -5176 25524
4752 25524 -30124 -56006 -49099 -36753 -51977 -25989 2280 45458 -2111 -66371 -57107 -1324
4740 -1324 18611 4635 3043 -49102 -32541 22157 45186 31692 22415 15099 11355 -5159 11785
4727 11785 55478 55038 49958 28551 20242 24817 12436 37405 45821 62528 30888 17685 5576
4714 5576 29891 28410 -3104 41502 36558 27264 -6181 -29327 -42782 -42149 -46445 -45615 14428 -7532
4700 -7532 -12305 8366 -15669 3497 -19424 -36297 -20424 -20 -14984 -71204 -58182 -42458
4688 -42458 -39045 8993 26505 22154 37583 22611 -8206 -901 -3760 -20049 -24421 -33611 -6477
4675f477l3654l789j3857n5318N8548J1325M45L1050L3918k024k4599m5127K937
4662d6622L968L8219J3867j404O239K721Q157l8529j7978M5834k8304l6041K9022
4649b0851M3744Q309k0745m7930n711M3753L9787m9883k4490k8925K1952K3862
4637a7128n4895r018M5190o91k446L6288J1664n91k9607k2104M637M2682K547
4624F528j5607K9819K5212j8273j3871K0441q556j6706l0091J3919J9789M6336
4612E8940K4083n8474j6166R786k371o0974j3002j5665K7342M3854N4223L465
4600E5041m766q53k9207l3791j0961J0865k6046o93l5466r116R958o006K6742
4587e4299j0555Q671N3075K33M041k3155J3018j2778k2133j5818Q7327K1708o9994
$$ plain form
4675 -6477 -40131 -43920 -57777 -113095 -54547 -43222 -42777 -11727 22191 20167 -4432 -49559 -46622
4662 -46622 -42654 -4435 9432 8028 14267 16988 25145 -13384 -31362 14472 -13832 -49873 -20851
4649 -20851 22893 31202 10457 -37473 -43184 569 40356 -9527 -34017 -62942 -40990 -17128
4637 -17128 -72023 -81041 -35851 -36542 -38988 -2700 8964 8373 -21234 -43338 -38701 3981 6528
4624 6528 -9079 20740 45952 27679 13808 34249 25693 8987 -21104 -7185 12604 58940
4612 58940 83023 24549 8383 18169 15798 -45176 -58178 -73843 -46501 -2647 51576 55041
4600 55041 50275 49422 20215 -13576 -24537 -13672 -39718 -40411 -75877 -84993 -75035 -81041 -54299
4587 -54299 -64854 -56183 -3108 -2875 1166 -21989 -8971 -21749 -43882 -59700 27627 49335 -20659
4574b0659l2455j3292J2987L1690J1758J9057p0658N882m1228R592k70l9794M4009
4561h3381L4478P970M6607R123k931k2457o9921K3308P6195K2800j9517k7667
4549e393K7111K6944J7428L2823k7042k7140M437Q984l8934l9393r906M3143l0347
4536a7285j86L3102O1727R096o2574j9764Q765K6630J987L5449j3932N823r029
4523E9809j4521L5128J2453p6638m9394K4164J1485l1236n4395R724K0050r046
4511f2417M2612L0421P3831O0608n7300p2705q525r251Q43j7117J6357k19J1479
4498H617m792o1219K1048K3590K651L1025K8485L1805p692n85P306l4038j3814
4485C2387l6899l8502k7630N423M5479L3462j1317m8332k9759J0333J4814J2382
$$ plain form
4574 -20659 -53114 -66406 -53419 -21729 -9971 9086 -61572 -55690 -96918 -87326 -87596 -127390 -83381
4561 -83381 -48903 -40933 5674 14797 11866 -10591 -80512 -57204 18991 41791 22274 -5393
4549 -5393 21718 48662 66090 98913 71871 44731 49168 58152 19218 -20175 -30081 13062 -17285
4536 -17285 -17471 15631 77358 86454 23880 4116 12881 39511 41498 76947 63015 68838 59809
4523 59809 45288 80416 92869 16231 -33163 -8999 2486 -28750 -83145 -73421 -53371 -62417
4511 -62417 -19805 10616 84447 145055 87755 15050 6525 -2726 -1883 -19000 -2643 -2862 8617
4498 8617 3825 -57394 -36346 -12756 -10105 20920 49405 81210 73518 72933 80239 46201 32387
4485 32387 -4512 -43014 -70644 -65221 -19742 13720 2403 -45929 -75688 -65355 -50541 -38159
4473c8159J4780k4664Q399K3488m3769j9020p779K3062J9986l3360j650M3773
4461c4913J9267K4772O3782p41o9037j2783n619j8834M0969J1624k2688n2711
4449e6912k0407M1949k286K1207j3936N972K0645J4860j166k5565m4497o049r291
4436g5476J2737k9069N6823N7591j348k3445j1062n2377L3139N0461L1835J6998
4424F6807k7456k6000k3031P875j9297O521R8024q858k1944l660J9944j2233k6536
4411C0156j9395j5010K22N621m9599J5451k7035Q403L6766J6106m1781J0675J0590
4398a8830K0409j209j4604J4934l7538o6637k1434L2314M5052J1603j8383K977
4386e1346j5941L7998J4790P074L4313K7175l004l2060j6392k8596N083n756R673
$$ plain form
4473 -38159 -23379 -48043 -39644 -16156 -59925 -78945 -86724 -63662 -43676 -77036 -78686 -34913
4461 -34913 -15646 9126 72908 72167 3130 -9653 -15272 -34106 6863 18487 -4201 -56912
4449 -56912 -77319 -35370 -37656 -16449 -30385 -24413 -3768 11092 9926 -15639 -60136 -66185 -75476
4436 -75476 -62739 -91808 -34985 22606 21258 -2187 -13249 -65626 -32487 17974 49809 66807
4424 66807 39351 13351 -9680 -1805 -21102 -14581 83443 74585 52641 48981 68925 56692 30156
4411 30156 10761 -4249 -4027 1594 -48005 -32554 -59589 -51186 -14420 1686 -40095 -29420 -18830
4398 -18830 1579 370 -14234 700 -36838 -103475 -124909 -92595 -47543 -35940 -54323 -51346
4386 -51346 -67287 -29289 -14499 -7425 26888 54063 51059 18999 2607 -25989 -20906 -26662 -16989
4373a6989M5299K3722K2470k5575l0274q515k132N541l3749n040K1493R4342N0675
4360A41268j791k418n7980l1808p3149j9745K507J7587k8643O3486M0949J264
$$ plain form
4373 -16989 28310 52032 74502 48927 18653 10138 8006 13547 -20202 -25242 -3749 90593 141268
4360 141268 139477 137059 79079 47271 -25878 -45623 -43116 -25529 -54172 9314 50263 51527
$$ [...]
##END NTUPLES=NMR SPECTRUM
##END=
