##TITLE=Analysis number 317928
Compound Code mo 01104
Project Code adrs
Chemist Name fudan
##JCAMPDX= 6.0         $$ Bruker NMR JCAMP-DX V2.0
##DATA TYPE= NMR SPECTRUM
##DATA CLASS= NTUPLES
##ORIGIN= Bruker BioSpin GmbH
##OWNER= nmr
$$ XWIN-NMR		Version 3.5
$$ Wed Mar  8 10:40:03 2006 GMT Standard Time (UT+0h)  MAYBRIDGE\nmr@NMR_250MHZ
##.OBSERVE FREQUENCY= 250.131544655141
##.OBSERVE NUCLEUS= ^1H
##.ACQUISITION MODE= SIMULTANEOUS (DQD)
##.ACQUISITION SCHEME= undefined
##.AVERAGES= 16
##.DIGITISER RES= 18
##SPECTROMETER/DATA SYSTEM= dpx250
##.PULSE SEQUENCE= zg30
##.SOLVENT NAME= CDCl3
##.SHIFT REFERENCE= (INTERNAL, CDCl3, 0, 16.4591)
##AUDIT TRAIL= $$ (NUMBER, WHEN, WHO, WHERE, WHAT)
$$ ##TITLE= Audit trail, XWIN-NMR		Version 3.5
$$ ##JCAMPDX= 5.01
$$ ##ORIGIN= Bruker BioSpin GmbH
$$ ##OWNER= nmr
$$ C:\u/data/dgb/nmr/ADRS/260/pdata/1/auditp.txt
$$ ##AUDIT TRAIL=  $$ (NUMBER, WHEN, WHO, WHERE, WHAT)
(   1,<2006-03-08 10:39:20.06 +000>,<MAYBRIDGE\nmr>,<NMR_250MHZ>,
      <created by zg, POWCHK disabled, PULCHK disabled
       configuration hash MD5:
       84 BC 41 DB A1 6E 1D 46 DA 25 12 A5 C1 ED C5 3A
       data hash MD5: 64K
       D4 22 B4 7D 53 B2 6A CC 6A 90 C6 CE 3A 36 92 6B>)
(   2,<2006-03-08 10:39:42.15 +000>,<MAYBRIDGE\nmr>,<NMR_250MHZ>,
      <Start of raw data processing
       ef LB = 0.3 FT_mod = 6 PKNL = 1 SI = 32K 
       data hash MD5: 32K
       37 45 D1 8C 0D 9E 97 4C FB D9 D5 F5 7C 93 FB 69>)
(   3,<2006-03-08 10:39:48.78 +000>,<MAYBRIDGE\nmr>,<NMR_250MHZ>,
      <apk 
       data hash MD5: 32K
       7D 0F F9 53 25 6A D9 BA A7 09 4D 80 84 7B B1 1F>)
(   4,<2006-03-08 10:39:50.29 +000>,<MAYBRIDGE\nmr>,<NMR_250MHZ>,
      <abs ABSG = 5 
       data hash MD5: 32K
       03 E1 68 18 43 8C B6 C5 EA A0 31 DE 25 53 47 F4>)
$$ ##END=
$$ 
$$ hash MD5
$$ CA 90 5E E6 29 78 35 C5 38 0E F0 88 76 D3 66 7D
##$RELAX= 
##$RELAX= 
##$RELAX= 
##$RELAX= 
##$RELAX= 
##$RELAX= 
##$RELAX= 
$$ Bruker specific parameters
$$ --------------------------
##$DU= <C:\u>
##$EXPNO= 260
##$NAME= <ADRS>
##$PROCNO= 1
##$TYPE= <nmr>
##$USER= <dgb>
##$AMP= (0..31)
100 100 100 100 100 100 100 100 100 100 100 100 100 100 100 100 100 100 
100 100 100 100 100 100 100 100 100 100 100 100 100 100 
##$AQSEQ= 0
##$AQ_mod= 3
##$AUNM= <au_zg>
##$AUTOPOS= <9 >
##$BF1= 250.13
##$BF2= 250.13
##$BF3= 250.13
##$BF4= 250.13
##$BF5= 500.13
##$BF6= 500.13
##$BF7= 500.13
##$BF8= 500.13
##$BYTORDA= 1
##$CFDGTYP= 0
##$CFRGTYP= 5
##$CHEMSTR= <none>
##$CNST= (0..31)
1 1 145 1 1 1 1 1 1 1 1 1 1 1 1 1 1 1 1 1 1 1 1 1 1 1 1 1 1 1 1 1 
##$CPDPRG= <>
##$CPDPRG1= <>
##$CPDPRG2= <>
##$CPDPRG3= <>
##$CPDPRG4= <mlev>
##$CPDPRG5= <mlev>
##$CPDPRG6= <mlev>
##$CPDPRG7= <mlev>
##$CPDPRG8= <mlev>
##$CPDPRGB= <>
##$CPDPRGT= <>
##$D= (0..31)
0 1 0 0 0 0 0 0 0 0.06 0 0 0 0 0 0 0.0002 0 0 0 0 0 0 0 0 0 0 0 0 0 0 
0 
##$DATE= 1141814358
##$DBL= (0..7)
120 120 120 120 120 120 120 120 
##$DBP= (0..7)
150 150 150 150 150 150 150 150 
##$DBP07= 0
##$DBPNAM0= <>
##$DBPNAM1= <>
##$DBPNAM2= <>
##$DBPNAM3= <>
$$ [...]
##$SUBNAM7= <"">
##$SUBNAM8= <"">
##$SUBNAM9= <"">
##$SW= 20.6930455092707
##$SWIBOX= (0..15)
0 0 3 0 0 0 0 0 0 0 0 0 0 0 0 0 
##$SW_h= 5175.983436853
##$TD= 65536
##$TD0= 1
##$TE= 294.16
##$TE2= 300
##$TE3= 300
##$TEG= 300
##$TL= (0..7)
0 120 120 120 120 120 120 120 
##$TP= (0..7)
150 150 150 150 150 150 150 150 
##$TP07= 0
##$TPNAME0= <>
##$TPNAME1= <>
##$TPNAME2= <>
##$TPNAME3= <>
##$TPNAME4= <>
##$TPNAME5= <>
##$TPNAME6= <>
##$TPNAME7= <>
##$TPOAL= (0..7)
0.5 0.5 0.5 0.5 0.5 0.5 0.5 0.5 
##$TPOFFS= (0..7)
0 0 0 0 0 0 0 0 
##$TUNHIN= 0
##$TUNHOUT= 0
##$TUNXOUT= 0
##$USERA1= <user>
##$USERA2= <user>
##$USERA3= <user>
##$USERA4= <user>
##$USERA5= <user>
##$V9= 5
##$VALIST= <valist>
##$VCLIST= <CCCCCCCCCCCCCCC>
##$VD= 0
##$VDLIST= <DDDDDDDDDDDDDDD>
##$VPLIST= <PPPPPPPPPPPPPPP>
##$VTLIST= <TTTTTTTTTTTTTTT>
##$WBST= 1024
##$WBSW= 4
##$XGAIN= (0..3)
0 0 0 0 
##$XL= 0
##$YL= 0
##$YMAX_a= 487515
##$YMIN_a= -480469
##$ZGOPTNS= <>
##$ZL1= 120
##$ZL2= 120
##$ZL3= 120
##$ZL4= 120
##$ABSF1= 16.4591
##$ABSF2= -4.234072
##$ABSG= 5
##$ABSL= 3
##$ALPHA= 0
##$AQORDER= 0
##$ASSFAC= 0
##$ASSFACI= 0
##$ASSFACX= 0
##$ASSWID= 0
##$AUNMP= <proc_1d>
##$AZFE= 0.1
##$AZFW= 0.1
##$BCFW= 0
##$BC_mod= 0
##$BYTORDP= 0
##$COROFFS= 0
##$CY= 12.5
##$DATMOD= 1
##$DC= 0
##$DFILT= <>
##$DTYPP= 0
##$F1P= 14.0000005364418
##$F2P= -0.99999901652339
##$FCOR= 0.5
##$FTSIZE= 32768
##$FT_mod= 6
##$GAMMA= 0
##$GB= 0
##$INTBC= 1
##$INTSCL= 1
##$ISEN= 128
##$LB= 0.3
##$LEV0= 0
##$LPBIN= 0
##$MAXI= 10000
##$MC2= 0
##$MEAN= 0
##$ME_mod= 0
##$MI= 0
##$NCOEF= 0
##$NC_proc= -3
##$NLEV= 6
##$NOISF1= 0
##$NOISF2= 0
##$NSP= 0
##$NTH_PI= 0
##$NZP= 0
##$OFFSET= 16.4591
##$PC= 1
##$PHC0= 175.3161
##$PHC1= -3.516223
##$PH_mod= 1
##$PKNL= yes
##$PPARMOD= 0
##$PSCAL= 4
##$PSIGN= 0
##$REVERSE= no
##$SF= 250.130015732335
##$SI= 32768
##$SIGF1= 0
##$SIGF2= 0
##$SINO= 400
##$SIOLD= 32768
##$SREGLST= <1H.CDCl3>
##$SSB= 0
##$STSI= 32768
##$STSR= 0
##$SW_p= 5175.98343685301
##$SYMM= 0
##$S_DEV= 0
##$TDeff= 65536
##$TDoff= 0
##$TI= <Analysis number 999999
Compound Code 99
Book Reference 9
Project Code 9>
##$TILT= no
##$TM1= 0
##$TM2= 0
##$TOPLEV= 0
##$USERP1= <user>
##$USERP2= <user>
##$USERP3= <user>
##$USERP4= <user>
##$USERP5= <user>
##$WDW= 1
##$XDIM= 32768
##$YMAX_p= 291305669
##$YMIN_p= -133605
$$ End of Bruker specific parameters
$$ ---------------------------------
##NTUPLES= NMR SPECTRUM
##VAR_NAME=  FREQUENCY,     SPECTRUM/REAL,   SPECTRUM/IMAG
##SYMBOL=    X,             R,               I
##VAR_TYPE=  INDEPENDENT,   DEPENDENT,       DEPENDENT
##VAR_FORM=  AFFN,          ASDF,            ASDF
##VAR_DIM=   32768,         32768,           32768
##UNITS=     HZ,            ARBITRARY UNITS, ARBITRARY UNITS
##FACTOR=    0.157963299565203, 1,           1
##FIRST=     4116.91512285076, 0,            0
##LAST=      -1059.06831400225, 0,           0
##MIN=       -1059.06831400225, -133605,     0
##MAX=       4116.91512285076, 291305669,    0
$$ Real data points
##PAGE= N=1
##DATA TABLE= (X++(R..R)), XYDATA
$$ [...]
13619F717450p9528p2263o6794q5031j15154n8678o9614q6107q5727p8522n1864
13608E868168m8006p3894q7910q7758q1512p6911q9390p2779l1455l8661o4745
13597E115147o4891l7248k9960p1998j01483j10902n3997l2987o3034n4881l4244
13586D459522n1395n5449m6169l2399n524m3696o7105o5232l5447k9757l7520
13575C989829l8345m4463n1430n0826m4942k4150m0088l4974n0332k6058n9954
13564C524267p0042l2311r575k5829k9284m2119o4493pk2129j5154n301n7856
13552C150167p0788k2047k4855n4427m6784J1562k4582l4768l9489O721J7325
13541B868035r027n6852l5142k1712l817k2786r499j0433k9380n0952o0610m2095
$$ plain form
13619 6717450 6637922 6565659 6498865 6413834 6298680 6240002 6170388 6084281 5998554 5920032 5868168
13608 5868168 5820162 5746268 5658358 5570600 5489088 5412177 5322787 5250008 5218553 5179892 5115147
13597 5115147 5050256 5013008 4983048 4911050 4809567 4698665 4644668 4611681 4548647 4493766 4459522
13586 4459522 4408127 4352678 4306509 4274110 4268586 4224890 4157785 4092553 4057106 4027349 3989829
13575 3989829 3951484 3907021 3855591 3804765 3759823 3735673 3695585 3660611 3610279 3584221 3524267
13564 3524267 3454225 3421914 3412339 3386510 3357226 3315107 3250614 3250607 3228478 3213324 3208023 3150167
13552 3150167 3079379 3057332 3032477 2978050 2931266 2942828 2918246 2883478 2843989 2850710 2868035
13541 2868035 2859008 2802156 2767014 2745302 2741485 2718699 2709200 2698767 2669387 2618435 2557825 2515730
13529B515730m8138j9822o962l1222N779m759k979k6818k0560n3665m3571k6993
13517B236020J599k6276J752j5187k0875K3650q128m1137k8022J1106l4599k4702
13505B075201k0836l1762k583q88o644j6433j442j1717q0097o3381j6382M889
13493A827925P52J0334K8741m9139l6495O159j2312j2313J9717n932p924j1064
13481A758449r435m3998n3101k8911P198K0389P445K5181j6460k3953k8494p815
13469A606495r624j2349l1515K2178J1318l1527K2484l10j2522O81j0461k636
13457A552212J6874J8555J021K393n119n205j2578j2362j5293J4435q063n8443
13445A488427k4206O593r138j8847m1345k3570o740k8479m4245l7063l117j096
$$ plain form
13529 2515730 2467592 2447770 2440808 2409586 2415365 2410606 2407627 2380809 2360249 2306584 2263013 2236020
13517 2236020 2237619 2211343 2213095 2197908 2177033 2200683 2192555 2151418 2123396 2134502 2099903 2075201
13505 2075201 2054365 2022603 2020020 2019132 2012488 1996055 1994613 1982896 1902799 1839418 1823036 1827925
13493 1827925 1828677 1839011 1867752 1818613 1782118 1788277 1775965 1763652 1783369 1777437 1769513 1758449
13481 1758449 1749014 1705016 1651915 1623004 1630202 1650591 1658036 1683217 1666757 1642804 1614310 1606495
13469 1606495 1596871 1584522 1553007 1575185 1586503 1554976 1577460 1577150 1564628 1565309 1554848 1552212
13457 1552212 1569086 1587641 1588662 1591055 1585936 1580731 1568153 1555791 1540498 1554933 1546870 1488427
13445 1488427 1464221 1470814 1461676 1442829 1401484 1377914 1371174 1342695 1298450 1261387 1258270 1257174
13433A257174J318k4901k0296P560J9123P370k8704k0313J1106j224j4157j8538
13421A175518Q026R729J9035l937k1833j0356o470o933j5467l5538k6027j3604
13409A072143n2210k7819R208K726k3869O699K9045K761N619q339l695J02k0574
13396I91797M156q476K709o212k9634n3240k4236R337J5291K2132J0298N985J8338
13383I58245q31l0320M0589o594k6935N728j9596m5472l1865J3897j8470o591
13371H31785Q967j4747j2858j4945q068n341K1078Q60j0077j0928j5268M810K2991
13358G98259m1748l0803j4256K5558K1929M537k2247j6309n909K1104K1177k9838
13346G31454p147J172J7059J7218n6j5643K1145l1623m3658k5068k7198R405K0682
$$ plain form
13433 1257174 1258492 1233591 1213295 1220855 1239978 1247348 1218644 1198331 1209437 1208213 1194056 1175518
13421 1175518 1183544 1193273 1212308 1208371 1186538 1176182 1169712 1162779 1147312 1111774 1085747 1072143
13409 1072143 1019933 992114 1001322 1004048 980179 986878 1015923 1018684 1024303 1015964 1012269 1012371 991797
13396 991797 995953 987477 990186 983974 954340 901100 876864 886201 901492 923624 933922 939907 958245
13383 958245 957414 927094 967683 961089 934154 939882 920286 874814 842949 856846 838376 831785
13371 831785 840752 826005 813147 798202 790134 784793 805871 806731 796654 785726 770458 775268 798259
13358 798259 756511 725708 711452 737010 758939 763476 741229 724920 719011 740115 761292 731454
13346 731454 724307 725479 742538 759756 759700 744057 765202 733579 689921 664853 637655 647060 667742
13333F67742o66n001j7767Q66L1153L6988k6081j9035J9960j3395j8491N20k0828
13320F35965M099l1142m534j6417J977j575j8911j5633K7390N422j2253n77J0949
13307E84760K6458J9368N879O218j767j7121j6343k6786N939k3878k5931L3507
13295E70303K9062k8998l9967q427k0291J5079L3394K2783J293L042j9666J2444
13283E70051j0255l1946l4432K024k152P03J5763J0711j1542L75p164k7483O178
13270D80831J4495n858k927r276l0833j3544K735K6318K9204J1564j1768K319
13258D93260J5130l4835k5847k1993j3378L8571M3175o106J8799j0031n0295l5395
13246D11055K5520N912o355L718l6281J9341L0365K9468P145k9977j3468p007
$$ plain form
13333 667742 667076 662075 644308 645174 676327 713315 687234 668199 688159 674764 656273 656793 635965
13320 635965 640064 608922 604388 587971 589948 588373 569462 553829 581219 586641 574388 573811 584760
13307 584760 611218 630586 636465 642683 640916 623795 607452 580666 586605 562727 536796 570303
13295 570303 599365 570367 530400 521973 501682 516761 550155 572938 574231 577273 557607 570051
13283 570051 559796 527850 493418 495442 493290 493993 509756 520467 508925 509300 502136 474653 480831
13270 480831 495326 489468 486541 477265 446432 432888 435623 461941 491145 502709 490941 493260
13258 493260 508390 473555 447708 425715 412337 450908 494083 487977 506776 496745 446450 411055
13246 411055 436575 442487 436132 439850 403569 422910 453275 482743 489888 459911 446443 439436
13234D39436k4776K5031K1435j1715n026O97o348o574K13R290L78j800o252P5
13220D34064l2212n2464M971K7028J2891J609k4347l29J5591K5313k926N9K4975
13207D34223J4221j0490k6364J5947q764k4839J7007l378m697r694L1116M840
13195D29128k9337n1013J928n49J8491K1007K0319n255k0829j4677k2338L038
13183C49913Q290J1247j3047k6486k6863m377O69l0133J1664P765k3780J6961
13171B81823K5029J6577L8337K4029j3318q801l14l0961k2055R233K4327K4174
13159C68080L708l044J0421m533l9381k9751l3101j1088J4511J6165J583k3529
13147B70041J4933j2010M370J4262l2457J5297K0515m24N340K7645J8939k452
$$ plain form
13234 439436 414660 439691 461126 449411 444385 445082 438734 432160 432373 441663 442041 440241 433989 434064
13220 434064 401852 349388 354359 381387 394278 395887 371540 371211 386802 412115 409189 409248 434223
13207 434223 448444 437954 411590 427537 418773 393934 410941 407563 402866 393172 424288 429128
13195 429128 399791 348778 350706 350157 368648 389655 409974 404719 383890 369213 346875 349913
13183 349913 358203 369450 356403 329917 303054 298677 299346 269213 280877 288642 264862 281823
13171 281823 306852 323429 361766 385795 372477 363676 363362 332401 310346 319579 343906 368080
13159 368080 371788 368744 379165 374632 335251 305500 272399 261311 275822 291987 293570 270041
13147 270041 284974 272964 277334 291596 259139 274436 294951 294527 299867 327512 346451 343999
13135C43999l2399J0362K2056m2404k5173j6772r901K3723N409k949J0304m3406
13123B42849N096J565L602L2271J6616m570n322O441p664k560j0474q885K7680
13110B96645k8408l7705J5904M1500J2956M847m098k0208l0976K5938J4189J428
13098B92012k484k3602j8024k32M025k4313l9279j8007j2463L3229M0385P787
13086B39034o968j51N186q846l648J2213M0571N597j3158l1324K5252L4566k7400
13073B70924k2222K7990K2218m3412p010K3783j1280l2185Q341n706P862K334
13061B41637j1974J0345j8364j1038k0926j3515O146J9560J5537J1140L7538L2729
13049B98815m636l4574j7566j5685K527K7788m1003K590q419q509j6872j8498
$$ plain form
13135 343999 311600 321962 344018 301614 276441 259669 249768 273491 278900 275951 286255 242849
13123 242849 247945 249510 253112 285383 301999 297429 292107 298548 290884 288324 277850 268965 296645
13110 296645 268237 230532 246436 287936 300892 305739 301641 281433 250457 276395 290584 292012
13098 292012 289528 265926 247902 247670 251695 227382 188103 170096 157633 190862 231247 239034
13086 239034 232066 231915 237101 228255 224607 236820 277391 282988 269830 238506 263758 298324 270924
13073 270924 248702 276692 298910 255498 248488 272271 260991 228806 237147 231441 239303 241637
13061 241637 229663 240008 221644 210606 189680 176165 182311 201871 217408 228548 266086 298815
13049 298815 294179 259605 242039 226354 228881 256669 215666 218256 209837 201328 184456 165958
13037A65958K3138K3696k443J1492j5293k6475K0299P267J4968N028m0062n414
13025A82159K7871p566k6284o572L3199p275k513K212l4300r536J5248K7832J1828
13012B06303J4893L686O015q648k7017r972K3661K0919k9060N98j5861j8241K4934
12999A92210M5622J3239k2663k1808j4331J3254L894M286j9273M203K5989J0385
12987B35007l987p349k1403K98k3202n3222K0355K8159l5730o643J1579L9211
12975A83073O905j7617k0412K0821K2846k3514j9361L435J2847N781q18k999K4497
12962A95484p820l2649K1093k2425J8262K9721j3409k7956P178J7137r602l087
12950A71927M683P882k972l0302j4806m284R473k621J2103j4123j3241J9123K850
$$ plain form
13037 165958 189096 212792 210349 221841 206548 180073 200372 207639 222607 227635 187573 182159
13025 182159 210030 202464 176180 169608 202807 195532 193019 195231 160931 151395 166643 194475 206303
13012 206303 221196 224882 230897 222249 195232 185260 208921 229840 200780 201378 185517 167276 192210
12999 192210 237832 251071 228408 206600 192269 205523 209417 213703 194430 198633 224622 235007
12987 235007 231020 223671 202268 202566 179364 126142 146497 174656 138926 132283 143862 183073
12975 183073 189978 172361 151949 172770 195616 172102 152741 156176 169023 174804 173986 170987 195484
12962 195484 187664 155015 176108 153683 171945 201666 188257 160301 167479 184616 175014 171927
12950 171927 176610 184492 181520 151218 136412 132128 141601 138980 151083 136960 123719 142842 145692
12937A45692j1654m067k928K1192M774j170Q053Q594o439k3801P603J4211L809
12924A63869j048r025l0515R792M610m156j4098q391J0286q578L985J2198J2220
12911A41149r424J8002l626j2279r011Q128K0287j4450n929Q205o564N509j6789
12898A23208p739K7927K4883n748J2495J5090l926k4196k879J292Q162j5632p38
12885A52199J1011r043j2582N177O816J17k2499p079J440j131q309m451o522J0594
12871A15738J5248J1044k827O747k357p482n965k3458Q408J9616k4504l4799O873
12858H2282L4650J3950j3829J6096o432J4083n696J3758O497R603k1843j7169
12846A25950J566L8554L647J5311N057K3560n66j7106k5130j1958k021k9591j8315
$$ plain form
12937 145692 134038 129971 127043 148235 153009 151839 159892 168486 162047 138246 145849 160060 163869
12924 163869 162821 153796 123281 133073 137683 133527 119429 111038 121324 112746 116731 128929 141149
12911 141149 131725 149727 146101 133822 124811 132939 153226 138776 132847 141052 134488 139997 123208
12898 123208 115469 143396 168279 162531 175026 190116 186190 161994 159115 160407 168569 152937 152199
12885 152199 163210 154167 141585 146762 153578 153695 131196 124117 125557 124426 116117 111666 105144 115738
12871 115738 130986 142030 139203 145950 143593 136111 130146 106688 115096 134712 110208 75409 82282
12858 82282 116932 130882 117053 133149 126717 140800 135104 148862 155359 164962 143119 125950
12846 125950 127516 166070 169717 185028 190085 213645 213079 195973 170843 158885 156864 127273 108958
12833A08958Q498j986J3748J992j0064j7797l770n502L0697J5205l6663n3754
12821D9562l557o507J8408J2491K3356Q041j8288k0017J3028O519K2125L2696
12809A37857k60p672j0817j2143K0585P046n663K0911Q632k3464l5211k8334k187
12796F9280J233K6269O016k002k6561j6611L493N209q952K5738K5647O069l0920
12783H3908J1003L9467M406k9512j1375j0556K68K4087K411L0459n122M479K086
12770A46009j4709k0471K0570J2397j6834l4369P586j4323p842K5643J1000L3487
12758A48144l0357l6983p670j0513k5535Q988L1702K7010l770k2491k0795K6141
12746H3871L116l2038R134L0908P855k2667K507l938k4316p369K2249K0318L1814
$$ plain form
12833 108958 117456 115470 129218 131210 121146 103349 99579 94077 124774 139979 103316 49562
12821 49562 46005 39498 57906 70397 93753 101794 83506 63489 76517 83036 105161 137857
12809 137857 137597 129925 119108 106965 127550 134596 128933 149844 158476 135012 99801 71467 69280
12796 69280 70513 96782 102798 100796 74235 57624 61117 66326 57374 83112 108759 114828 83908
12783 83908 94911 134378 138784 109272 97897 87341 87609 111696 114107 144566 139444 143923 146009
12770 146009 131300 110829 131399 143796 126962 92593 100179 85856 78014 103657 114657 148144
12758 148144 117787 80804 73134 62621 37086 46074 77776 104786 101016 78525 57730 83871
12746 83871 86987 54949 64083 94991 102846 80179 82686 78748 54432 47063 69312 89630 121444
12733A21444L191k000m5369m54K7071j5667j5980L1678J6194l2024P54l082P707
12720I3463R253j2070K4394L7238j1495l7507l1687N87Q413K1379K1015J3766
12708A36749j3723k2838j7284k3961K1840J5472n930j9070k25k113J9354k3419
12696F4852K0686P281k825j0687p294J8258o112l1486j1993J8161O60j6563J179
12683D4117R909J6312J0741K1571P909k5107p58K2496j8494R779L2274k5821k3688
12670H1240Q154Q78O017J0943J04o753j8317k5562J1366k190N554J6204J7013
12657A04651j1968k4608P482k0948R845kk386q105J7059q264P3K8684j8259o911
12643F6343J3790j0160o509J386J3476R933P757J1378j3011k2065o597j3845j0989
$$ plain form
12733 121444 124635 122635 77266 76812 103883 88216 72236 103914 120108 88084 88838 85756 93463
12720 93463 102716 90646 115040 152278 140783 103276 71589 72176 80589 101968 122983 136749
12708 136749 123026 100188 82904 58943 80783 96255 90325 71255 71030 68917 88271 64852
12696 64852 85538 92819 89994 79307 72013 90271 84159 52673 40680 58841 59501 42938 44117
12683 44117 54026 70338 81079 102650 110559 85452 84694 107190 88696 98475 130749 104928 81240
12670 81240 89394 90272 96289 107232 107336 100583 82266 56704 68070 65880 71434 87638 104651
12657 104651 92683 68075 75557 54609 64454 64452 62066 53961 71020 62756 62829 91513 73254 66343
12643 66343 80133 69973 63464 64850 78326 88259 96016 107394 94383 72318 65721 51876 40887
12630D0887k2028j2632O167L1708K8083j5009j7695o911o304J0202J4702p702
12618D3468j5679k8287n626K5538O332J169K6771j5698j3010J9062N862K7707
12606G7609K2179o068j7393o956j7881n911K243q640j267K8137L1086k2897k3797
12593E0444r517K001Q503p979k2741k1511o449K8298J6756N729J3759K0955o857
12580G1391J0450r454j6437N549J1241M037m5054r213M5914r725Q115K5573j1403
12567H0984q622j4002j2869K5370K6718m190j1317q545O734l8950r326M3208M308
12554G9501L2533l098m1675k1410k33j563Q096j8655j8107j0953M0629K9349J0707
12541H5121r574l3885l4727K259Q071M944J2105m317K4009k9162l2994L334R465
$$ plain form
12630 40887 18859 6227 12394 44102 72185 57176 39481 32570 26266 36468 51170 43468
12618 43468 27789 -498 -6124 19414 25746 26915 53686 37988 24978 44040 49902 77609
12606 77609 99788 93720 76327 69371 51490 45579 47822 39182 37915 66052 97138 74241 50444
12593 50444 40927 42928 51431 43452 20711 -800 -7249 21049 37805 43534 57293 78248 71391
12580 71391 81841 72387 55950 61499 72740 76777 31723 22510 68424 58699 66814 92387 80984
12567 80984 72362 58360 45491 70861 97579 93389 82072 73527 80261 41311 31985 75193 79501
12554 79501 112034 108936 67261 45851 45618 44055 52151 33496 15389 4436 45065 74414 85121
12541 85121 75547 41662 6935 9194 17265 22209 34314 29997 54006 24844 -8150 -4816 4649
12528D649N823j2418j3100L2654L2439N25l9549N506n283n459M063K8974L6450
12515G5274J0886J502j2235r314k541p893L237r275k7315j3925k108N37J9302
12502B6132J7769J1681k469j3333K5733p992J1704j905j6248j2121j9252K3141
12490D2840L3790m516j5151J512j5538q361j9627l523k678k296K365M4348J0869
12477F4034k3997k532J1627J7093J5279K2837J4650j5505m6996l1448J3813K7012
12465F5867K1145m108k2105l2288k7234P665K5405J380M3405N692j271l0640k0590
12452C2323k025k5819k108j024O700K8935J8687o482j7143j4472j1454j15Q954
12439A4957M0016K3306o126k3526l4703j8852p154J6560J5221J3135J5928P29
$$ plain form
12528 4649 10472 -1946 -15046 17608 50047 50572 11023 16529 11246 5787 9850 38824 75274
12515 75274 86160 87662 75427 66113 63572 55679 58916 49641 22326 8401 6293 6830 26132
12502 26132 43901 55582 53113 39780 65513 57521 69225 67320 51072 38951 19699 42840
12490 42840 76630 72114 56963 58475 42937 34576 14949 11426 8748 6452 8817 53165 64034
12477 64034 40037 37505 49132 66225 81504 104341 118991 103486 56490 25042 38855 65867
12465 65867 87012 82904 60799 28511 1277 8942 34347 35727 79132 84824 83553 52913 32323
12452 32323 30298 4479 2371 1347 8047 36982 55669 49187 32044 17572 6118 6003 14957
12439 14957 54973 78279 72153 48627 13924 -4928 -12082 4478 19699 32834 48762 49491
12427D9491k0287r931j652J2005J8694j5724l7424m6748r879L3155L6902K0236
12415B8838j7407P079J0586J6903k4081N260K2451J3956J8611J3296j2361k4282
12403E8849k038L252n564j178j6529j9885q582R233J7734p360j2711K0729K8458
12390F4408l15o347k2960j182K630l291j0948J4730N878j4588P774K2490M782
12377F3061J3364k4640k0164k893k0718j3110j542J386L965P235J059K3347j0389
12364A9961K7350l8744P06P016J2067J6136j1380j8139J3916L0194K6465l352
12352H2196q679M60j8672j5574Q726k325J6902r583m311J0502k1413j9189R383
12339B8423n11k5630n312n179j7835l183N1323L8753j8149k0635o957J6033m752
$$ plain form
12427 49491 29204 19273 17621 29626 48320 32596 -4828 -51576 -61455 -28300 8602 28838
12415 28838 11431 18510 29096 45999 21918 27178 49629 63585 82196 95492 83131 58849
12403 58849 56811 60063 54499 53321 36792 16907 8325 17558 35292 27932 15221 35950 64408
12390 64408 64093 57746 34786 33604 36234 32943 21995 36725 42603 28015 35789 58279 63061
12377 63061 76425 51785 31621 28728 8010 -5100 -6642 -5256 -1291 5944 7003 30350 19961
12364 19961 47311 8567 9273 16289 28356 44492 33112 14973 28889 59083 85548 82196
12352 82196 73517 73977 55305 39731 48457 46132 63034 53451 49140 59642 38229 19040 28423
12339 28423 27912 2282 -3030 -8209 -26044 -29227 22096 60849 42700 22065 15108 31141 26389
12326B6389l1330j3408K1713J5204N588J1331k4339n562O967n002k5512k3925
12314d1886J4141L3714r26M694L8932q664k5025J5260K0335n834j7659k7857j5952
12301a6727L9882l138j604O548J4J2383Q425q339l1240N636k963Q325j817J257
12287A6642K5969J7724l9296k0444M36J3564J6873K7226N64j8896l3833J981j9626
12274a1116K6413R794q75j6238R24P45j8360j0049N611n631K0718N926K8826K3933
12260F0621P867m305K7178J3643k8505j5857k1370j4698N239Q904R530Q319q971
12247D7595n0715k4488o497M0540r292p346N427J2732o777R818K9142J7176k6951
12234C0364n174R527J9098n775K315l18R914j157m2120q41K4543j1540l0596j0218
$$ plain form
12326 26389 -4941 -18349 3364 18568 24156 35487 11148 5586 12553 7551 -17961 -41886
12314 -41886 -27745 5969 5043 9737 48669 40005 14980 30240 50575 44741 27082 -775 -16727
12301 -16727 23155 20017 18413 24961 24975 37358 45783 37444 6204 11840 8877 17202 15385 16642
12287 16642 42611 60335 21039 595 1031 14595 31468 58694 59258 40362 6529 8510 -11116
12274 -11116 15297 25091 24216 7978 8902 9647 -8713 -18762 -13151 -18782 1936 7862 36688 60621
12260 60621 68488 64183 91361 105004 76499 60642 39272 24574 29813 38717 48247 56566 47595
12247 47595 -3120 -27608 -34105 6435 -2857 -10203 -4776 7956 1179 10997 40139 57315 30364
12234 30364 25190 34717 53815 48040 50355 50037 59951 58794 16674 15833 40376 28836 -1760 -11978
12220a1978J1137N8j5948k184q877j793L4747J5549k1159J7651K1224j1034j868
12207B5525M902j1543k4881J2922K2122j9399O005N831J0597j829l703j159L322
12194B8712n753k5028k1569P675J250J5282J1519j9397l6572l3819J5191J8082
12182d4427M6951L1860l2553n794K0430P217k3118l4815j539J6336L7523k8328
12170a0257j7765n249J1153L5365K0756O27k6613j4379k9063j8363J2887L5677
12158e224J5487K4355J6485j1126r171J996k50j2472k117k114L8078R413k765
12145F0575m874j6806n184k5622j4188K167K6575K9080J1395J27L4273L7562k327
12132A32753P073l1633k8205l0269J8159n137k3252O897M833m2575q883m648J7152
$$ plain form
12220 -11978 -841 -783 -16731 -18915 -27792 -29585 5162 20711 -448 17203 38427 27393 25525
12207 25525 30427 18884 -5997 6925 29047 9648 15653 21484 32081 30252 26549 25390 28712
12194 28712 22959 -2069 -23638 -15963 -14713 569 12088 -7309 -43881 -77700 -62509 -44427
12182 -44427 2524 34384 1831 -3963 16467 23684 566 -34249 -35788 -19452 18071 -10257
12170 -10257 -28022 -33271 -22118 13247 34003 34630 8017 -6362 -35425 -53788 -40901 -5224
12158 -5224 10263 34618 51103 39977 30806 32802 32552 20080 17963 15849 53927 63340 60575
12145 60575 55701 38895 33711 8089 -6099 -3932 22643 51723 63118 63245 97518 135080 132753
12132 132753 139826 108193 79988 49719 67878 62741 39489 46386 51219 8644 -239 -4887 12265
12119A2265L3643J5348M41j73j6155m0569J1045R792o153K964j0232M979J1555
12106B8750j4520l073R94j8006k4115j3321K1594K037J4176J3668j1224q281M7908
12093C6587L548Q940K2248R318M4537J9194n335J708m7901k8184j1172l1649j5533
12080F306j4559J5596J0856l572k1206L5450J690k2397K19l232Q5K0405J5969
12067D1610J4857M871l747p293n664q095Q155K3512J4097J5435M7100O5517R5449
12054C05804J05007J06221R6665r142q0559o8557n5143o9228o2135k1634l0589
12043B16710l1174l9746N387M815l5171j5631R75J6084m061j2316N876n1224j3451
12030D7073p946N779K475m639J8624M2047Q852l9826l1377J2681L2778R515K4549
$$ plain form
12119 12265 45908 61256 61697 61524 45369 4800 15845 25637 19484 22448 12216 17195 28750
12106 28750 14230 11157 12151 -5855 -29970 -43291 -21697 -19660 -5484 8184 -3040 -11321 36587
12093 36587 40135 49075 71323 80641 125178 144372 139037 140745 92844 64660 53488 21839 6306
12080 6306 -8253 7343 18199 14627 -6579 28871 30561 8164 8383 5151 5236 25641 41610
12067 41610 56467 61338 57591 50298 44634 36539 44694 68206 82303 97738 144838 210355 305804
12054 305804 410811 517032 613697 604555 523996 455439 400296 331068 268933 247299 216710
12043 216710 185536 145790 151177 155992 120821 105190 106165 122249 118188 105872 111748 60524 47073
12030 47073 39127 44906 47381 42742 61366 103413 112265 72439 41062 53743 86521 96036 120585
12017A20585N1503M2769K8481L153N1159Q8705J36532J51576K10933K65290L52639
12006A503325L37265J15595j37152k89961k97024k45531j87928j26425r8044q5478
11996D88642o8422r6389o0706j5507J0265l2767l6885j0276k3456k2670j4324
11985A17505j2777o496K783K1582l522l2104J0391L0572J2443Q547m872o30J4256
11972A57678N563J7920K8323M2332M3381N0052R5995J30685J68383K52421L07440
11961A300173K89982K92415R2410j46958l18510l03357k47041j76388j19609r9950
11951E63167r1303r0722n5899n2905o7787k7534n163l0112k8886j4638n496O146
11939I8868J0220K994o611q794O566j8557k7777q850K4260L2297r161k4246l8381
$$ plain form
12017 120585 172088 214857 243338 246491 297650 386355 522887 674463 885396 1150686 1503325
12006 1503325 1840590 1956185 1819033 1529072 1232048 986517 798589 672164 574120 488642
11996 488642 420220 323831 263125 247618 257883 225116 188231 177955 154499 131829 117505
11985 117505 104728 98232 101015 122597 119075 86971 97362 127934 140377 148924 144052 143422 157678
11972 157678 163241 181161 209484 251816 295197 345249 441244 571929 740312 992733 1300173
11961 1300173 1590155 1882570 1974980 1828022 1509512 1206155 959114 782726 663117 563167
11951 563167 471864 381142 325243 272338 204551 177017 171854 141742 112856 98218 92722 98868
11939 98868 109088 112082 105471 96677 103243 84686 56909 48059 72319 104616 95455 71209 32828
11926C2828k3282J6751K8176L9618N7108K0486O349N2269N6427L7361J00323J30944
11914E55358Q2690K0301l0362p8580j07594j17543m6597k5132j1387l1652o2236
11903A47266j6913k5648l2894l064k3456J7348J7521k0918l3546j2261K2889J3054
11891D9378l888k3046o682N888o373n4835j5429K4400O3321N2060o165j7231j9399
11878D1999m472M143J4769j1926j9955K0185M650n694j2806j6730m8672o64J2250
11865b2923J7417k988j0439L6642k27j736J7345P04j9948j6375K0381K4201k7735
11852A4319J4597M3161j0573k1837J8852J5541R273K7612J6631j3655k8791m5329
11840C9801j7752m550m85o263k8779m937R996M0682P725J064j9501J6187j5246
$$ plain form
11926 32828 9546 26297 54473 94091 151199 171685 178034 230303 286730 324091 424414 555358
11914 555358 638048 658349 627987 549407 441813 324270 277673 252541 241154 209502 147266
11903 147266 130353 104705 71811 68747 45291 62639 80160 59242 25696 13435 36324 49378
11891 49378 45490 22444 15762 21650 15277 -39558 -54987 -30587 32734 84794 78629 61398 41999
11878 41999 37527 41670 56439 44513 24558 44743 49393 43699 30893 14163 -34509 -35173 -22923
11865 -22923 -5506 -8494 -18933 17709 17482 15746 33091 33795 13847 -2528 17853 42054 14319
11852 14319 28916 72077 61504 39667 58519 74060 83333 110945 127576 113921 85130 39801
11840 39801 22049 17499 17014 10751 -18028 -22965 -12969 27713 35438 36502 17001 33188 17942
11827A7942m190n6o209J7961K2729J516k9855j6261k864l170M634j3072k4618
11814c5513l282o890M1203J9205P00K6606J106j2030j3749L3050L8776L0185r21
11801A18446k1937l9435j8817m443K724K8258J1618k992k7294j2672k6121j0446
11789c111K4075L327k677k539p457M111J5604K0136O46l7049l6934k0061O341
11776c5588J4656J2283L8531l4569K7669J6393r276k7609j0487M8224M9916l6482
11764E3661k6806n627K4318K0989J6618j9251J6699J4307O717q132r821l0151
11752E3521J594k0492j2505k2107N323l6940r141J4594N222M07M381L6133N516
11739B5506r089K0517k1850O184j842r905K2354R539j5933j4161J515j3610k7985
$$ plain form
11827 17942 13752 13696 7487 25448 48177 49693 19838 3577 713 -2457 2177 -10895 -35513
11814 -35513 -38795 -45685 -4482 14723 15423 42029 43135 31105 17356 50406 89182 119367 118446
11801 118446 96509 57074 38257 33814 36538 64796 76414 73422 46128 33456 7335 -3111
11789 -3111 20964 24291 21614 19075 11618 15729 31333 51469 52115 15066 -21868 -41929 -35588
11776 -35588 -20932 -8649 29882 -4687 22982 39375 30099 2490 -7997 40227 90143 53661
11764 53661 26855 21228 45546 66535 83153 63902 80601 94908 101625 93493 83672 53521
11752 53521 55115 34623 22118 11 5334 -31606 -40747 -26153 -20931 -20524 -16143 19990 25506
11739 25506 16417 36934 15084 21268 19426 9521 31875 41414 25481 11320 12835 -775 -28760
11726b8760J6048J7555J9007K0044l2819l7502K5156L3883K6503j1577k1771k830
11714B2937l4498O985J1503p58j8038n83K6723L745l46p792j4031j1349j8694
11701c4196o166j431N056K1208J4623R543r92j4368N854J3212q466j5502j3796
11688b5421K775Q829j1026q925n218K5024o367k6160J0070L0919L429n600k823
11675a0494p021n461Q910j564j6477l1987m4004j2455J8025M0290N6567J1333
11663E662q800j5461M698J9005P308k745J126L7158P779l4866j1072Q90k315J346
11649I713K527J9320j0647m1385j3542J2027n302j2536j0916O653K6338N328J6235
11636C813J9217L8943J3490l6380j6230N993k9682k2848k233k5264j5493L1330
$$ plain form
11726 -28760 -12712 4843 23850 43894 11075 -26427 -1271 32612 59115 47538 25767 22937
11714 22937 -11561 -4576 6927 6169 -11869 -12452 14271 18016 17670 9878 -4153 -15502 -34196
11701 -34196 -40362 -41793 -36737 -15529 -906 8637 7645 -6723 -869 12343 3877 -11625 -25421
11688 -25421 -22646 -13817 -24843 -33768 -38986 -13962 -20329 -46489 -36419 -5500 -2071 -7671 -10494
11675 -10494 -17515 -22976 -14066 -15630 -32107 -64094 -108098 -120553 -102528 -62238 -5671 5662
11663 5662 -3138 -18599 -13901 5104 12412 9667 10793 47951 55730 20864 9792 10682 8367 9713
11649 9713 12240 31560 20913 -20472 -34014 -21987 -27289 -39825 -50741 -44088 -17750 -12422 3813
11636 3813 23030 61973 75463 39083 22853 28846 -836 -23684 -25917 -51181 -66674 -35344
11624c5344Q688J2560l337L992J2993j4281l8046l34K7045K46K025l2669j4801
11611g1263J2519J0847J4694K9346J4603K5119L324k567j156k4158k0048O91K6447
11598A8398J9403m0176J0472P240m261P30j2268L35Q79l1797r784n196J3288J1980
11584b0757p296M528j8869k3533N875M7182L4056j1958o079R07J4969j7045j9474
11571a7494K140m041N002K218P50Q23j2946J4207K702k5199k0797L7502L5611
11558B0478m847j5698o69r470j8906j8272K5709M8511J1707L475R272n0444P711
11545H557K523j1276j8179l0450J104M9130L149p007K9091K175j9120j7275j4238
11532b1816Q862r517j1449l4059j2794L5518L9479L572N558j3290l624N892K0117
$$ plain form
11624 -35344 -26656 -14096 -17433 -13441 -448 -14729 -52775 -53109 -26064 -25818 -23793 -56462 -71263
11611 -71263 -58744 -47897 -33203 -3857 10746 35865 39189 36622 35466 11308 -8740 -8049 18398
11598 18398 37801 -2375 8097 15337 11076 11806 -462 -127 752 -31045 -40829 -46025 -32737 -20757
11584 -20757 -28053 -23525 -42394 -65927 -60052 -12870 21186 9228 3149 4056 19025 1980 -17494
11571 -17494 -15354 -19395 -14393 -12175 -11425 -10602 -23548 -9341 -6639 -31838 -52635 -15133 20478
11558 20478 15631 -67 -736 -10206 -29112 -47384 -21675 26836 38543 42018 51290 846 8557
11545 8557 11080 -196 -18375 -48825 -47721 1409 4558 -2449 26642 28817 9697 -7578 -21816
11532 -21816 -12954 -22471 -33920 -67979 -80773 -45255 -5776 -2204 3354 -9936 -13560 -7668 12449
11519A2449O264n765l0011j0643L6629K8k0732J1744O895J1593M597R137j1034
11506B1151l505l193J2708O706l999m956N670K6401o69j0805j5587k4463j4173
11493h714K151L2162J1480J265K264j0185k8719K54M0171L0637r642K4074L8525
11480A25723J6087j6832n841M738n7786k3344M6928K8910K3402m364l7191k6219
11468G4211J5371K2567O599k3625m0820l2782l896K8515J0600K9003L677j5867
11456G3553j2330r833K600L7091K4323l5704J4284J5783k4156J7971L3958j866
11444A35674J4042M124k0806j3402N4163N2591L0266j7282m557k1L5445M4605
11432C14842J1875q709l3075m0289o116O820j3867q211l355j5118o756m9451k0826
$$ plain form
11519 12449 18713 12948 -17063 -27706 8923 8951 -11781 -37 6858 18451 23048 32185 21151
11506 21151 17646 14453 27161 33867 29868 24912 30582 56983 56314 45509 29922 5459 -8714
11493 -8714 -6563 25599 37079 38344 40608 30423 1704 1958 42129 72766 63124 87198 125723
11480 125723 141810 124978 119137 123875 66089 42745 89673 118583 141985 137621 100430 74211
11468 74211 89582 112149 118748 95123 54303 21521 17625 46140 56740 85743 89420 73553
11456 73553 61223 51390 53990 91081 115404 79700 93984 109767 85611 103582 137540 135674
11444 135674 149716 153840 133034 119632 173795 226386 256652 239370 234813 234792 270237 314842
11432 314842 326717 318008 284933 244644 238528 245348 231481 223270 219915 204797 198041 148590 127764
11419A27764k5148m748L512J4059J6511l2105k4802j5433K42p706K7350J7078
11407I6574J5994K2178P200J2326j6275j1680k1064j1387K1932Q592J5174J4831
11395A54395K3803k988M455K0269J5018l607K7133M3998M0913n77j2014j1769
11383B99029K7636L0933R03l5192n0164k0129l3853j3038k3845l0675K818j2458
11371A41965l510r356j261o335J8942p070n9875m1953L478P875L0187J7418j3483
11358G7022m3508j4266k264N832j4177J7398J4384K033n22K8091J7289j2871j4991
11345E9450J0790M880R625J5225o821J4637J7768k718j0840K1291K3018k0199
11333A36106j6192k5020j5041m982l056j7371k4887m4531J1222O6214K3137j3519
$$ plain form
11419 127764 102616 97868 101380 115439 131950 99845 75043 59610 59852 52146 79496 96574
11407 96574 112568 134746 141946 154272 137997 126317 105253 93866 115798 124390 139564 154395
11395 154395 178198 175210 179665 199934 214952 211345 238478 282476 323389 322812 310798 299029
11383 299029 326665 357598 358501 323309 273145 253016 219163 206125 182280 151605 154423 141965
11371 141965 138455 129099 127838 121503 140445 133375 73500 31547 35025 42900 73087 90505 77022
11358 77022 33514 19248 16984 22816 8639 26037 40421 42454 41932 70023 87312 74441 59450
11345 59450 70240 75120 84745 99970 93149 107786 125554 122836 111996 133287 156305 136106
11333 136106 119914 94894 79853 74871 71815 54444 29557 -14974 -3752 62462 85599 72080
11321G2080k3535k155K4129j3474M852k5542k0075J227j7367r627Q957j9985j7682
11308c8197P303l174J0738J0243k062L673M782n454M395O385j1344K0794J9292
11295B7374m001K8251m5139j8390j318j3125R03K9893K829J7069j2652n110k549
11282D035P842l6474m0453k3151j6328K0076K0144M547K888K4478M8260N859j9348
11269B375k8043k4600j0485K4450K3914k5502J7864N535N507r981q688L1973k1495
11256a7176l8373K1684j9920M757K0561R823K1574k411n565J6742j2926J1615
11244A0385J8044p640L0594K206j9082n5664k0527K1891J0059J5599J0892Q839
11232B5596K7956k8025m1019k0734O809L0214r228j542N058J9462j5585R156p207
$$ plain form
11321 72080 48545 46390 70519 57045 61897 36355 16280 17507 140 -9487 -530 -20515 -38197
11308 -38197 -30894 -34068 -23330 -13087 -15149 -11476 -6694 -12148 -7753 -1368 -12712 8082 27374
11295 27374 23373 51624 6485 -11905 -13223 -26348 -25445 4448 7277 24346 11694 6584 4035
11282 4035 11877 -24597 -65050 -88201 -104529 -84453 -64309 -59762 -56874 -32396 15864 21723 2375
11269 2375 -25668 -50268 -60753 -36303 -12389 -37891 -20027 -14492 -8985 -18966 -27654 4319 -17176
11256 -17176 -55549 -33865 -53785 -49028 -28467 -18644 2930 519 -5046 11696 -1230 10385
11244 10385 28429 20789 51383 53589 34507 -21157 -41684 -19793 -9734 5865 16757 25596
11232 25596 53552 25527 -15492 -36226 -29417 797 -8431 -9973 -4915 14547 -1038 8118 911
11219I11k199j8997m059R475J1288M047j425M365p363N00J5771o950p397j242
11205c275o774j8844M124j0040l2565J6066M5864j7160K6573j4194M031q595k526
11192a7315M112J740K571L035j3113m480j1540j8929L0674J8038o958J116k2715
11179c3764j2750L458p78R205n708j472J7338O657N592O889m139J5503R585l1571
11165a5955l6535K2343P457J3728N476j0052j5129k392p089M818J2380L5435L246
11152A7731j7541j827Q373M217k0377k604k3419k3612j0206O899L969M379n471
11139e9489J8850J9504K0464J4540J5386l2467m002j773O854j249m416j2375J2835
11126g338o116k4885j9229J7458P524j682j5945J9172K3955k4998o962M7965K5900
$$ plain form
11219 911 -1288 -20285 -24344 -14869 -3581 466 -959 3406 -3957 -3457 12314 5364 -2033 -3275
11205 -3275 -10049 -28893 -24769 -34809 -67374 -51308 -5444 -22604 3969 -10225 -6194 -14789 -17315
11192 -17315 -13203 -11463 -8892 -5857 -18970 -23450 -34990 -53919 -23245 -5207 -12165 -11049 -33764
11179 -33764 -46514 -43056 -43834 -34629 -40337 -41809 -24471 -17814 -12222 -5333 -9472 6031 15616 -15955
11165 -15955 -52490 -30147 -22690 -8962 -3486 -13538 -28667 -31059 -38148 -33330 -20950 14485 17731
11152 17731 190 -1637 6736 10953 -9424 -12028 -35447 -59059 -69265 -62366 -58397 -54018 -59489
11139 -59489 -40639 -21135 -671 13869 29255 -3212 -7214 -8987 -2133 -3382 -7798 -20173 -7338
11126 -7338 -13454 -38339 -57568 -40110 -32586 -34268 -50213 -31041 -7086 -32084 -39046 8919 34819
11113C4819j9511j7121J15R327o436J982K3661K5656j4581m2592k9296R871L3185
11100I079j0959k7658l5139l568J8645K1145j3162J133k7780j593M3982Q640J3581
11087c654m659j440N318M8683M63m3207j4680K9232P445k1818j5994k9548Q903
11074c4956J3490J0740k4994O075q044j2292K4174L0049k846n346N336P54l255
11061a115J395J3200r357N30N215J1714P025l3755j2038j8457m51K1326J3456
11048a312O380K0258j5876P076O590n6053j2310Q747Q489j5813P593L7693K1845
11035B3307m318j3283j5360j0711Q607j1017l3993o773j1038M774J045J5851k4432
11022g7341P81M2224k7086R334j4136k1868k186K9708M0712p567j9994j3711J146
$$ plain form
11113 34819 15308 -1813 -1698 7629 1193 3175 26836 52492 37911 -4681 -33977 -24106 9079
11100 9079 -1880 -29538 -64677 -68245 -49600 -28455 -41617 -40484 -68264 -69857 -25875 -17235 -3654
11087 -3654 -8313 -9753 -4435 44248 44711 1504 -13176 16056 23501 1683 -14311 -43859 -34956
11074 -34956 -21466 -10726 -35720 -29645 -37689 -49981 -25807 4242 1396 -3950 1386 2140 -1115
11061 -1115 280 13480 4123 4653 9868 21582 28607 -5148 -17186 -35643 -36094 -14768 -1312
11048 -1312 5068 25326 9450 16526 23116 -32937 -45247 -36500 -28011 -43824 -36231 1462 23307
11035 23307 18989 5706 -9654 -20365 -11758 -22775 -56768 -63541 -74579 -69805 -68760 -52909 -77341
11022 -77341 -76560 -34336 -61422 -52088 -66224 -88092 -90278 -60570 -19858 -27425 -47419 -61130 -59984
11009e9984L176J7519r630k621J9020Q98M649K4990q195O559k5284j6300j0027
10996e5230J7474J0781k3059j0719q306k104L1263Q810K24j1316k0439j5434J4966
10983f3089L8987K2711l9342j5728k9553k8474j9117M2559L0242L898R272J9839
10971b7795J1037k5000k6911m861J4283j2334K8868K05j4163J651J4242L0144
10959a0634k856o774M874M671J4919j7905j4678j2623J0588q426P703K6259j1146
10946a6028k3522K0061K1458o999k2925l2915n802K635J8202j4902j0202J2300
10934e8639J0247N79J7029K0122p893n041o114J437r658j7307N4080K7307l3641
10921g492k1336J5658k7437q47K0398j655n287J7162J358k5392k811j5484k4188
$$ plain form
11009 -59984 -56808 -39289 -48919 -51540 -32520 -31622 -26973 -1983 -10178 -3619 -28903 -45203 -55230
10996 -55230 -37756 -26975 -50034 -60753 -69059 -71163 -39900 -31090 -30866 -42182 -62621 -78055 -63089
10983 -63089 -24102 -1391 -40733 -56461 -86014 -114488 -133605 -91046 -60804 -56906 -47634 -27795
10971 -27795 -16758 -41758 -68669 -73530 -59247 -71581 -42713 -42508 -56671 -55020 -40778 -10634
10959 -10634 -13490 -20264 -15390 -10719 4200 -13705 -28383 -41006 -30418 -38844 -31141 -4882 -16028
10946 -16028 -39550 -19489 1969 -5030 -27955 -60870 -66672 -64037 -45835 -60737 -70939 -58639
10934 -58639 -48392 -47813 -30784 -10662 -18555 -23596 -29710 -28273 -37931 -55238 -1158 26149 -7492
10921 -7492 -28828 -13170 -40607 -41454 -21056 -22711 -27998 -10836 -9478 -34870 -37681 -53165 -77353
10908g7353L0769l793k1089J4048N859j7497K273K6241J1994L2129R215J779l3921
10895a9346j7549J5002J0868P541J8022K6801l642m4083j8537K792J3100R534
10883E03p009r104r202j3084L695p930k9183n881j6916J0599N4083J7883o645
10870a8191q924r598J534r917J2381J8057L705j6971j2427P961K6346J643j5262
10857a9663l1263j6603l524L6935J2379p276P46J0380N0m515k0625j6312O564
10844e2727q078j1958J9153J409j4697q656K9826k386j6118J1348J5561L5474
10832a849k4074m5593K0475M7398m110l4126r868J712L272O679m224p511L767
10819d8052j9246K0637J1804j0623o395j2908n534K8852N037l0421m1482J2740
$$ plain form
10908 -77353 -46584 -50377 -71466 -57418 -51559 -69056 -66783 -40542 -28548 3581 12796 14575 -19346
10895 -19346 -36895 -21893 -11025 -3484 14538 41339 37697 -6386 -24923 -22131 -9031 503
10883 503 -6506 -15610 -24812 -37896 -34201 -42131 -71314 -77195 -94111 -83512 -29429 -11546 -18191
10870 -18191 -27115 -36713 -35179 -45096 -32715 -14658 -10953 -27924 -40351 -32390 -6044 -4401 -19663
10857 -19663 -50926 -67529 -71053 -34118 -21739 -29015 -28269 -17889 -17839 -22354 -42979 -59291 -52727
10844 -52727 -60805 -72763 -53610 -52201 -66898 -75554 -45728 -48114 -64232 -52884 -37323 -1849
10832 -1849 -25923 -71516 -51041 -3643 -7753 -41879 -51747 -50035 -46763 -40084 -44308 -51819 -48052
10819 -48052 -67298 -46661 -34857 -45480 -51875 -64783 -70317 -41465 -36428 -66849 -108331 -95591
10807i5591L8784L0997L0739J5407j17l2653j8416l341m9963r59K0346K2844R766
10794c2157Q283P704r990m4699j3972r226O677L3229J7672j3347J786j783J8120
10781c1703J0869J4505N771k1708P179K5918J1770k7879j4370j6963k457K8783
10769a0285M200l162j9369j2086O296j3622l177r952J97R875J1429K4723L1n913
10755b0815R120j6233o718P930O720Q47K0255r109K801p276L537L764j6379R408
10741a2148p736j1106K985k3302L4634K8258L4788n6170k5182n616o826k7266
10729g4687M245L1149J4034j0784l163q183L0464o666r083J8774n804k3089j75
10716d2968o256n729L6819K9203j8331Q57j7681l6483k0867K996K1567K195j2227
$$ plain form
10807 -95591 -56807 -25810 4929 20336 20219 -12434 -30850 -34191 -84154 -85113 -64767 -41923 -32157
10794 -32157 -23874 -16170 -26160 -70859 -84831 -94057 -87380 -54151 -36479 -49826 -48040 -49823 -31703
10781 -31703 -20834 -6329 -558 -22266 -15087 10831 22601 -5278 -19648 -36611 -39068 -10285
10769 -10285 -6085 -9247 -28616 -40702 -34406 -48028 -51205 -61157 -60960 -51085 -39656 -14933 -14902 -20815
10755 -20815 -11695 -27928 -34646 -26716 -19996 -19149 1106 -8003 -5202 -12478 -8941 -5177 -21556 -12148
10741 -12148 -19884 -30990 -28005 -51307 -16673 11585 46373 -9797 -34979 -40595 -47421 -74687
10729 -74687 -70442 -39293 -25259 -36043 -39206 -47389 -16925 -23591 -32674 -13900 -19704 -42793 -42968
10716 -42968 -49224 -54953 -18134 11069 -7262 -6405 -24086 -60569 -81436 -78440 -56873 -54678 -66905
10703f6905j5718L3880J1192J2648N321K4224O450k3598R096M857j8842p964J604
10690b3755m498j2043K1610j0098Q29l201r209j1084q256M239K4275J2205M1143
10677B2157k374k0395k2737o748k4139M956N053j052m579L0025J2093j928L073
10664f595j3043r128J9633J7261n8171o42K8230J7378J1657n154K3031R427j4718
10651A9166J6842k3172l9551j0659R777M866l5862k0189L516j3877J9538N8524
10639a1081J3510l341m4023j8162J4502J2383J2739k3132k796O371r015k8161
10627h0206J62K7488K8118M1737J4714Q63N330j3916l5393J2224n474J58l4042
10614c8237J4458j0763j0925J4347J5982M335k0157n69L8055m894r855J7950J0165
$$ plain form
10703 -66905 -82623 -48743 -37551 -24903 -19582 4642 11092 -12506 -3410 1447 -17395 -25359 -23755
10690 -23755 -28253 -40296 -18686 -28784 -27955 -31156 -40365 -51449 -59705 -55466 -31191 -18986 22157
10677 22157 19783 -612 -23349 -30097 -54236 -49280 -44227 -45279 -49858 -19833 -7740 -9668 -6595
10664 -6595 -19638 -28766 -9133 8128 -50043 -50685 -22455 -5077 6580 1426 24457 33884 19166
10651 19166 36008 12836 -26715 -37374 -27597 -22731 -58593 -78782 -75266 -89143 -69605 -11081
10639 -11081 2429 -912 -44935 -63097 -48595 -36212 -23473 -46605 -49401 -43030 -52045 -80206
10627 -80206 -80044 -52556 -24438 17299 32013 32876 38206 24290 -11103 1121 -4353 -4195 -38237
10614 -38237 -23779 -34542 -45467 -31120 -15138 -10803 -30960 -31529 6526 1632 -8223 9727 19892
10601A9892j6597l4979k1387K6859J7736K3077j5456m3727j162R466j7171n926
10589e9375M1272R538K4222J7840J8036P382r913O528k032l0277k4202j4461J4508
10576i34L84j2863l5199j0056L4198p215Q585K7179n31M224j6937n5098m2123
10563a06386P298K2205J1336L248l2597J0906K9766J7148J5861m2371j3495N09
10551g6572K1773K9152M873j3992k3796K808K3862M9428o417j1760j5580l1464
10539d7685k4340P197R062K2751n239j9458K4114K6909q14l245l3526k0194k3673
10526h8141P947L6136K8492m81l3635J6323J8720P285J5980K4998j6426j3780
10514C418l0448O394J491P332j4516o941J9822O896J4278M165j1959l2804J0779
$$ plain form
10601 19892 3295 -31684 -53071 -26212 -8476 14601 -855 -44582 -45744 -36278 -53449 -59375
10589 -59375 -18103 -8565 15657 33497 51533 58915 49002 55530 53498 23221 -981 -15442 -934
10576 -934 -550 -13413 -48612 -58668 -24470 -31685 -23100 4079 3548 7772 -9165 -64263 -106386
10563 -106386 -99088 -76883 -65547 -62299 -94896 -83990 -54224 -37076 -21215 -63586 -77081 -76572
10551 -76572 -54799 -25647 -20774 -34766 -58562 -55754 -31892 17536 11119 -641 -16221 -47685
10539 -47685 -72025 -64828 -55766 -33015 -38254 -57712 -33598 -6689 -7503 -10748 -44274 -64468 -88141
10526 -88141 -80194 -44058 -15566 -16047 -49682 -33359 -14639 -7354 8626 33624 17198 3418
10514 3418 -27030 -20636 -19145 -11813 -26329 -33270 -13448 -6552 7726 11891 -68 -32872 -22093
10501b2093L8343K244j3769k6922J5611j2909j2459J0185J8496Q754j6489K454
10489h554J0408N213m884L584k251k857j65j3003k7085j1351N968k849j5220J565
10475f1481L8366K629k2004k95L0591J6770r771k513m494K1133n251O903L80O157
10461A7120j070J716j6131k3605K713K5119k714q767N540M03K7027j9648P637
10448A5340j2562J067k7644k1647q938K0747J6089k1106P299K9184k534r393L331
10435a0767J3909l3501l7376P74K1231R166O368Q398l223J0057J2797M035k9406
10422b7538j5952L191n390J1800j2857J6845N433l0941q575J9282M908L1548N901
10409b345J2881j8988r105K4003J090k1949Q49j1446j8175k746j2634J2325K2529
$$ plain form
10501 -22093 16250 18494 4725 -22197 -6586 -19495 -31954 -21769 -3273 5481 -11008 -8554
10489 -8554 1854 7067 2183 5767 3516 659 494 -12509 -39594 -50945 -44977 -47826 -63046 -61481
10475 -61481 -23115 -20486 -42490 -42785 -12194 4576 -5195 -7708 -12202 8931 3680 10583 10963 17120
10461 17120 16050 17766 1635 -21970 -19257 5862 3148 -5619 -79 324 27351 7703 15340
10448 15340 2778 3845 -23799 -45446 -54384 -33637 -17548 -38654 -31355 -2171 -4705 -14098 -10767
10435 -10767 3142 -30359 -67735 -66961 -45730 -36564 -30196 -21798 -25021 -14964 -2167 1868 -27538
10422 -27538 -43490 -40299 -45689 -33889 -46746 -29901 -24468 -55409 -63984 -44702 -39794 -8246 -2345
10409 -2345 10536 -8452 -17557 6446 7536 -14413 -13564 -25010 -43185 -45931 -58565 -46240 -23711
10396b3711J7163n461o772L4514n641j6575p020K7861n050j7865j8529O263J6730
10383d093j067K543P229n052j2449N237K356J2896l4387l3578J6948K3137j4139
10370c4419j4576L990J8568K5096J7195n939k7463k3101O930j9672P000J3666
10358c2725L315j981N0682L0123k6627j9990J8193q095q934j2711k241J3202m7935
10345d5724j1316K3619P88J020r916k058j204K1828J2127j4727J7953k7539j479
10332c6628J6637k0847j1827q448J9914J6540J2196J850j6865j4879K4617j4252
10320c1992J3089J8211J3149n751j740r664r285J611m912q032j5153k0188M387
10307e6270M7031L6949k0797j9004l113L047p971j3793p801K2786J4876Q950J3747
$$ plain form
10396 -23711 -6548 -12009 -18781 15733 10092 -6483 -13503 14358 9308 -8557 -27086 -20823 -4093
10383 -4093 -5160 -2617 4612 -440 -12889 -7652 -5296 7600 -26787 -60365 -43417 -20280 -34419
10370 -34419 -48995 -45005 -26437 -1341 15854 9915 -17548 -40649 -33719 -53391 -46391 -32725
10358 -32725 -29410 -31391 19291 49414 22787 2797 20990 12895 3961 -8750 -10991 2211 -45724
10345 -45724 -57040 -33421 -32633 -31613 -41529 -43587 -44791 -22963 -10836 -25563 -7610 -35149 -36628
10332 -36628 -19991 -40838 -52665 -61113 -41199 -24659 -12463 -10613 -27478 -42357 -17740 -31992
10320 -31992 -18903 -692 12457 6706 4966 -4698 -13983 -12372 -17284 -25316 -40469 -60657 -56270
10307 -56270 -9239 27710 6913 -12091 -15204 -12157 -20128 -33921 -41722 -18936 -4060 4890 18637
10294A8637m2914k503K5213J0233l54l655J5971k5387k4239N069M343K2143K3437
10281B5994J6218Pl3348j8516J6388j280N218o488j3855r661O587J9929j8231
10268a1038M731K0836j793n2562m65M5442M2853K7441k4020m9265k6379K9164
10256D945J0651m1918r880R777n02J0640L089j0769k881J6627K8398Q874J4476
10243D1527j3600n184M162j4941k7384k8522J9252O670k5465O464j2662L130M0870
10230e683K9416l7894k8514O526l006j2512K1918l778m64j55L0643j1442l886
10217a8831l045k6744n016K4984J3084J7184J2562n255p301k6611J8844j236j1065
10204a8446k5689l2445R41J842K1577J1409j560J4685K868k0549J9089J1855k4270
$$ plain form
10294 18637 -24277 -26780 -1567 8666 8312 4657 20628 -4759 -28998 -23929 -19586 2557 25994
10281 25994 42212 42219 8871 -9645 6743 5463 10681 4193 -9662 -19323 -12736 7193 -11038
10268 -11038 -6307 14529 12736 -39826 -40291 5151 48004 75445 51425 2160 -24219 4945
10256 4945 15596 -26322 -36202 -26425 -26927 -16287 -13198 -23967 -26848 -10221 18177 27051 41527
10243 41527 27927 22743 26905 11964 -15420 -43942 -24690 -18020 -43485 -37021 -49683 -46553 -5683
10230 -5683 23733 -14161 -42675 -36149 -39155 -51667 -29749 -33527 -33991 -34146 -3503 -14945 -18831
10217 -18831 -21876 -48620 -53636 -28652 -15568 1616 14178 8923 1622 -24989 -6145 -7381 -18446
10204 -18446 -44135 -76580 -75639 -73797 -52220 -40811 -42371 -27686 -24818 -45367 -26278 -14423 -38693
10191c8693L711K0595k9900J2906N309J1548O873K3690K1960j5384J502J0076
10179C4193Q034k1493k0688j0082l8526p62J2437j1844j1607j6312L6766K1444
10167a8440J5435K5849J8665j8288n1658k4283K3135L3849L5954l6524m3857J5212
10155b4951K4397l7425j5926R460L5314Q549J3993K4493n3652k5836L370j164
10143c9378K939l28J366r373K7397P436j3948l9234L640j316J5349j2719j459
10130e9628N7815J0117l142k7900n36N776k5948j2281P358j3810J8073L1478J277
10117a1351l6247m085j2219L2954J7549O357m474k313j8740j6018M625P939M217
10104c1806J8931j7467J2806J2262k2567k588j1792n609J0254P307P287k1520
$$ plain form
10191 -38693 -34982 -14387 -44287 -31381 -26072 -14524 -7651 16039 37999 22615 24117 34193
10179 34193 42227 20734 46 -10036 -48562 -49324 -36887 -48731 -60338 -76650 -39884 -18440
10167 -18440 -3005 22844 41509 23221 -28437 -52720 -29585 4264 40218 3694 -40163 -24951
10155 -24951 -554 -37979 -53905 -44445 -9131 -582 13411 37904 -15748 -41584 -38214 -39378
10143 -39378 -36439 -36767 -35401 -44774 -17377 -9941 -23889 -63123 -59483 -60799 -45450 -58169 -59628
10130 -59628 -1813 8304 5162 -22738 -23274 -17498 -43446 -55727 -48369 -62179 -44106 -12628 -11351
10117 -11351 -47598 -51683 -63902 -30948 -13399 -7042 -11516 -13829 -32569 -48587 -43962 -36023 -31806
10104 -31806 -12875 -30342 -17536 -5274 -27841 -30429 -42221 -47830 -37576 -30269 -22982 -44502
10092d4502K009n225l86K4110K8126j1819k7821O001K8598n475k2415k2517N161
10079d6155j1837n878K2593J655j3706K5288K3421L179Q416o389K147K7943K448
10066C3125l7273j1741J1023Q244P461m821n003p92o295k6286l5134L0249K7301
10053i942r29r900K1839l409j4769j3552J0476M0211L1439O3659J5101m8938m9934
10040C1352L552P941j1487m8072l06L2771k0453k9171j4526k517K1956J4471j0411
10027b4900l2042J2904K4208L8756j3098l5231k6555K4296M498J0724J0684Q642
10015B886K8551K943k7343Q180M913k4389M1641L3261j6297j8753k8966l0127
10003b3500J6355J7038J4132j7990m4038J7029J0332J2247Q245K4452M6738k9292
$$ plain form
10092 -44502 -42493 -47718 -48104 -23994 4132 -7687 -35508 -29507 -909 -6384 -28799 -51316 -46155
10079 -46155 -57992 -63870 -41277 -39622 -53328 -28040 -4619 -1440 6976 587 2734 30677 33125
10066 33125 -4148 -15889 -4866 3378 10839 6018 1015 223 -6072 -32358 -67492 -37243 -9942
10053 -9942 -10871 -20771 1068 -2341 -17110 -30662 -20186 20025 51464 115123 130224 81286 31352
10040 31352 34904 42845 31358 -16714 -17020 15751 -4702 -33873 -48399 -50916 -28960 -14489 -24900
10027 -24900 -56942 -44038 -19830 18926 5828 -29403 -55958 -31662 -27164 -16440 -5756 2886
10015 2886 31437 34380 7037 15217 20130 -4259 37382 70643 54346 35593 6627 -23500
10003 -23500 -7145 9893 24025 6035 -38003 -20974 -10642 1605 9850 34302 81040 51748
9991E1748p6894n815J456l9131m478l290K4808K2021J6679J081j7921K2049J1475
9978C788p596J7684Q750l7433k3514N335j1571J398N441j683k4515l953k922J1123
9964e9668J5794J740k8887J2976M4233J7172j4336p62K2592N098j0309l5000j2509
9951d1866J1274J8217J9970J3250j1660j3171l8765j4333K5463k0547j7871N0894
9939a9145M2227l219r943j9668j0182L344Q089k3933K2309J5146p646n342k7156
9926c5119J9415J1048j50j2349J3991j071j2111M534l969J4071J2242j3271k059
9913d798K9477L0481j3888k4083m816J6112J6076K9114J3634M4027O3061L5799
9901B30196N7631K8006P4918J60833L21073O20053J038428J090020K20693q55070
$$ plain form
9991 51748 -25146 -30961 -29505 -68636 -73114 -76404 -51596 -29575 -12896 -11815 -29736 -7687 3788
9978 3788 -3808 13876 22626 -14807 -38321 -32986 -44557 -43159 -37718 -39401 -63916 -67869 -70791 -59668
9964 -59668 -43874 -42134 -71021 -58045 -13812 3360 -10976 -11738 10854 15952 5643 -29357 -41866
9951 -41866 -30592 -12375 7595 20845 9185 -3986 -42751 -57084 -31621 -52168 -70039 -19145
9939 -19145 23082 19863 9920 -9748 -19930 -16586 -8497 -32430 -10121 5025 -2621 -7963 -35119
9926 -35119 -15704 -4656 -4806 -17155 -3164 -4235 -16346 -11812 -15781 -1710 10532 -2739 -4798
9913 -4798 24679 55160 41272 17189 12373 28485 44561 73675 87309 131336 194397 230196
9901 230196 287827 315833 390751 551584 872657 1492710 2531138 3621158 3841851 2986781
9891B986781j075855o92516m23267k19585j02922q4117n8903o3511o9529m6619
9881A49957k5010r84j8870p902J7119j98l2692l8313k178l951j4140j7902L0327
9868C5263K0006r987M498J1914Q435k0450l6418J3759k2751m3993l63M0329L988
9855D230l7417m1079Q98M8569J2758j112j4603Q096M2294J5403O671j245k7308
9842A6155k1645p517R082M986l2928k921R245j958M715o954j305L2244R92j2228
9828a0037J4049L954r309R435j5100n669R028m684j6845k4072K641K3924k0274
9815d2959l9369J4670L1063q956J4949L4299J0231j6388N153j7636k1796k6940
9803f3679j1984o85K412K8215K5720J0980O257J8342k0372k2359n127P787L7911
$$ plain form
9891 2986781 1910926 1218410 795143 575558 472636 388519 329616 266105 196576 149957
9881 149957 124947 123963 105093 97191 114310 114112 81420 43107 40929 36978 22838 4936 35263
9868 35263 55269 45282 49780 61694 70129 49679 13261 27020 4269 -39724 -40087 242 4230
9855 4230 -33187 -74266 -73368 -24799 -12041 -13153 -27756 -19660 22634 38037 44708 43463 16155
9842 16155 -5490 -13007 -3925 1061 -31867 -34788 -25543 -27501 -22786 -29740 -31045 1199 2191 -10037
9828 -10037 4012 7966 -1343 8092 -7008 -12677 -3649 -8333 -25178 -49250 -46609 -22685 -42959
9815 -42959 -82328 -67658 -36595 -45551 -30602 3697 13928 -2460 2693 -14943 -36739 -63679
9803 -63679 -75663 -76348 -73936 -45721 -20001 -9021 -2764 15578 -4794 -27153 -32280 -24493 13418
9790A3418R145n269j969j5783O041L3404J6221l0514J7315K3655l4914M140j1013
9777B3877J8766P250k7712j4618L571J8945l3800j2090M448k2886J1086J277K4512
9764B626n049k6133l938J2162L283J361n948M557j4143L958K5425j9577m9N543
9750a5922O473M75J9266M891n088n751k2797j820L4202k4238j6988K6563J4526
9737A3792j943M796q458R707L825j0082j6977r701K5964M1997M2536L1427P8578
9724B05461R5539R6750P7504L6715n4464j15388r6893n7799o2654k3321j9985
9713H1465k8784l5707m0492j3189J6819J001l031R420K1772K0642j3350j7637
9701a071j7034K272j5499j376k0625M210R334M274j726R731K3131N043k8335r549
$$ plain form
9790 13418 22563 17294 15325 -458 5583 38987 55208 24694 42009 65664 30750 34890 23877
9777 23877 42643 49893 22181 7563 11134 30079 -3721 -15811 -11363 -34249 -23163 -21886 2626
9764 2626 -2423 -28556 -32494 -20332 -17049 -15688 -21636 -17079 -31222 -27264 -1839 -21416 -21465 -15922
9750 -15922 -9449 -8974 10292 15183 10095 4344 -18453 -20273 13929 -10309 -27297 -734 13792
9737 13792 11849 16645 8187 17894 21719 11637 -5340 -15041 10923 52920 95456 126883 205461
9724 205461 301000 397750 475254 511969 457505 342117 245224 187425 124771 101450 81465
9713 81465 52681 16974 -23518 -36707 -19888 -18887 -21918 -12498 9274 29916 16566 -1071
9701 -1071 -18105 -15833 -31332 -32708 -53333 -49123 -39789 -35515 -37241 -27510 -4379 664 -27671 -37220
9687c7220o071j895j7539k3248P93L0906N307n626O980K6097M0433p516k8367
9674a6966j5512j9157J3701j2197j776J2283J8926K5571l4092l8674K1909K1184
9662b4800O891m519J4749J5890J0375j3376j9354J5126N338j4633l4055K0453
9650b1915J9130K138K1110O035l917p994n3624J0459J0417K823P772r539k8408
9637d5513O773J5172L2229j415k6568R540o914l540J5484p957n299n93K2409J0322
9623A4130m871p250m424k8167j2195J90j0957L5501J7545N246k1975l6425L4410
9610a9242m508J7201O927k5676R16J6039r122J8896K2822j0803l0532M311j4919
9597b7690R07j0966O183j962j4486n796L8719L5763n862o293l270j8893k5962
$$ plain form
9687 -37220 -43291 -45186 -62725 -85973 -85180 -54274 -48967 -54593 -47613 -21516 18917 11401 -16966
9674 -16966 -32478 -51635 -37934 -50131 -51907 -39624 -20698 4873 -29219 -67893 -45984 -24800
9662 -24800 -17909 -22428 -7679 8211 18586 5210 -14144 982 6320 -8313 -42368 -21915
9650 -21915 -2785 -647 20463 26498 22581 14587 -39037 -28578 -18161 -15338 -7566 -17105 -45513
9637 -45513 -38740 -23568 8661 7246 -19322 -9782 -16696 -20236 -4752 -12709 -18008 -18601 3808 14130
9623 14130 9259 2009 -2415 -30582 -42777 -42587 -53544 -18043 -498 4748 -17227 -53652 -19242
9610 -19242 -23750 -6549 378 -25298 -24382 -8343 -17465 1431 24253 13450 -17082 -12771 -27690
9597 -27690 -26783 -37749 -31566 -33528 -48014 -53810 -15091 20672 14810 8517 5247 -13646 -39608
9584c9608q539J7662L0494J6837l38j7986J1676J8462k428l2039m5088J0927P365
9571c2603K8116M059j7843o040n36k7686K6415K4928L5844j0104j929O473j4597
9558A4497m504M634N276j7532q088K3270q429k0252n754j4873M684J3372j5660
9545b9359R550K0576l6867k0830r333K7607j0687J6388P91o232N073K9656l692
9532g359l338j9676j0204O400j0812j2585K202P594K0946L3604J62J8935N392
9519C1261J3884k8987j7406j5265J6406q123l614l141j3577K5642J4513k5961
9507a4368k1937r61J3642J3352J7006J496K1670J3137n943O222R857L143j9342
9494C6974k4569n136R825j4416p952k1002J704J4738j7162j8814o724r876o075
$$ plain form
9584 -39608 -48147 -30485 9 16846 16508 -1478 10198 28660 26232 -5807 -50895 -39968 -32603
9571 -32603 -4487 -428 -18271 -24311 -24847 -52533 -26118 -1190 34654 24550 22621 29094 14497
9558 14497 9993 14627 19903 2371 -5717 17553 9124 -11128 -16882 -31755 -27071 -13699 -29359
9545 -29359 -19809 767 -36100 -56930 -66263 -38656 -49343 -32955 -32164 -38396 -33323 -3667 -7359
9532 -7359 -10697 -30373 -40577 -34177 -44989 -57574 -55372 -47778 -26832 6772 6934 25869 31261
9519 31261 45145 16158 -1248 -16513 -107 -8230 -11844 -14985 -28562 -2920 11593 -14368
9507 -14368 -36305 -37266 -23624 -10272 6734 8230 29900 43037 37094 43316 53173 56316 36974
9494 36974 12405 7269 17094 2678 -5274 -26276 -24572 -9834 -26996 -45810 -52534 -62410 -68485
9481f8485P811P406L155L399J631l785j1567K2969j7521J2931O136L1557j3361
9468a7724j1490M7751L9075J3375K5021j834l263M720j7655m2626l275K4399K9306
9455H5780J2590l2055k2378j4008j3745L319M8115M4247j3511k8740L4953o288
9443I8279l5258j9877j1413o511J0235J0944p13J013K4036j1078n167m655L822
9430E3657k1275r530K1321J6624m2918o513l7811j2821M5316M4826N461j2475
9418D3862p704N668J358M0548J7285L3486O7780J12665R0623J208p5078r5790
9406B35911r5253o3176k8261j130o536l381j0355j5095L579j4825k740R362J1435
9393A9535n828N3646M2006l0513k6247j7843l4973j8254Q149J4667L7034Q553
$$ plain form
9481 -68485 -60674 -53268 -50113 -46714 -45083 -48868 -60435 -37466 -54987 -42056 -35920 -4363 -17724
9468 -17724 -29214 18537 57612 70987 96008 94174 90911 95631 77976 35350 32075 56474 85780
9455 85780 98370 66315 43937 29929 16184 19503 67618 111865 98354 69614 104567 98279
9443 98279 63021 43144 31731 25220 35455 46399 45686 46699 70735 59657 54490 49835 53657
9430 53657 32382 22852 44173 60797 17879 11366 -26445 -39266 6050 50876 56337 43862
9418 43862 36158 41826 43184 83732 101017 134503 202283 314948 405571 406779 331701 235911
9406 235911 140658 77482 49221 48091 41555 38174 27819 12724 16303 1478 -1262 8100 19535
9393 19535 13707 67353 109359 78846 52599 34756 -217 -18471 -10322 4345 41379 49932
9381D9932k3149Q571J3310K5356M2266R399j1457O218l400j9257n790K9958k3122
9368I8835l5959l322P153N993L7116N716k146j7094q648J5736j5603k8539l5930
9355B3308j9897M024M123k157J5854j0518l5802L734j5202J0974J3715M258K1811
9342A8225k4095l4252l3338J5197M9674J6997k2607l61J8426Q523L3732J993O967
9329E5081k033k7650j5872M9162N1754K8143l4132m8190J494j4129l5186j030
9317G412J0575l570p143J0948l9j2956O426J345j704j3912l6053O679L4228K4975
9303B7211J837L7472p126j9692p351n2046l1413J9328L1040j856k5839m050O47
9290c1838O81J0686k0758J0002J3153M920J015o830j6515l6295l524K1736K7209
$$ plain form
9381 49932 26783 35354 48664 74020 116286 125685 114228 120446 117046 97789 91999 121957 98835
9368 98835 62876 59554 66707 72700 109816 115532 113386 96292 87644 103380 87777 59238 23308
9355 23308 3411 7435 11558 9401 25255 14737 -21065 -17331 -32533 -21559 -7844 -3586 18225
9342 18225 -5870 -40122 -73460 -58263 -8589 8408 -14199 -14560 3866 12389 46121 48114 55081
9329 55081 53048 25398 9526 58688 110442 138585 104453 56263 57757 43628 8442 7412
9317 7412 17987 14417 7274 18222 18183 5227 11653 12998 11294 -2618 -38671 -31992 2236 27211
9303 27211 29048 66520 59394 39702 32351 -19695 -51108 -31780 -740 -2596 -28435 -32485 -31838
9290 -31838 -31157 -20471 -41229 -31227 -18074 -13154 -12139 -18969 -35484 -71779 -75303 -53567 -26358
9277b6358K1126r575q12k0150p611Q210r829M603L6668K6195m7408l3446J4666
9264d3721J8979J1606q486R971l3576J4820O943O07Q503k3862l3013J0217J6331
9251d4681M940J8720J4614J157j161J5903o76k5358k4964k6624m733J8151n017
9238e9729R803K3585M1894j2659o283P586K704k501j0620L585k8174k8964m275
9225f4048K965K623K8707K1170k514l343R49l350l481q786J2877M73R637n126
9211a1247j847R860J2539J1488o936k1148P79j396L5729K0656q972j9466j1022
9198I017j5062l2512n88M4694J6488K031m633k2896J761j0844L3686j3838j587
9185E717k276M044k5639P907M059q561L7162m1k2030j5864J3678K2971J5690j2602
$$ plain form
9277 -26358 -5232 -14807 -15619 -35769 -43380 -35170 -44999 -40396 -3728 22467 -24941 -58387 -43721
9264 -43721 -24742 -13136 -21622 -11651 -45227 -30407 -23464 -22857 -14354 -38216 -71229 -61012 -44681
9251 -44681 -39741 -21021 -6407 -5250 -6411 9492 8816 -16542 -41506 -68130 -72863 -54712 -59729
9238 -59729 -49926 -26341 15553 2894 -3389 4197 6901 4400 -6220 -2635 -30809 -59773 -64048
9225 -64048 -61083 -58460 -29753 -8583 -11097 -14440 -13491 -16841 -20322 -29108 -16231 -15758 -6121 -11247
9211 -11247 -13094 -3234 9305 20793 13857 -7291 -6512 -7908 27821 48477 39505 20039 9017
9198 9017 -6045 -38557 -39145 5549 22037 24068 19435 -3461 -1700 -12544 21142 7304 5717
9185 5717 3441 7485 -18154 -10247 -6188 -14749 22413 22372 342 -15522 -1844 21127 36817 24215
9171B4215O542l522L1448J1799O855k8035j9602J0690N361R573l5905k5738j6998
9158b3317P29K2214P80j8378J642K4727K7513J4278k942n925J5853m030Q709M043
9144F5896K169l3425k3038r24k1577J0182J6444Q040k2018J5945L7644J0823j3004
9131E3157p078k2237J7007J1862j5498K0367p380J7070l6147k2576L2184k6588
9119A4143k2339K9714K0231P57q254q229L445J2735k3401j8351j3131J3749K3909
9106B4978J8206k33k829k3019N747k3751j8149q357j760m450r884p589L8238L5522
9092B2670K0107M867J0676L602L535J1164k6093j8197j8981j6462j4251L495J3676
9079a92J5930N488l0603k3603l825M628J3770K0228K5612r64j0278j7243j2603
$$ plain form
9171 24215 30757 27235 58683 70482 77337 49302 29700 40390 45751 55324 19419 -6319 -23317
9158 -23317 -22588 -374 406 -17972 -16330 8397 35910 50188 47246 41321 57174 53144 61853 65896
9144 65896 68065 34640 11602 10678 -10899 -717 15727 23767 1749 17694 55338 66161 53157
9131 53157 46079 23842 40849 52711 37213 57580 50200 67270 31123 8547 40731 14143
9119 14143 -8196 21518 41749 42506 34252 26023 29468 42203 18802 451 -12680 1069 24978
9106 24978 43184 42951 40122 17103 22850 -901 -19050 -27407 -29167 -33617 -43501 -51090 -12852 22670
9092 22670 42777 47644 58320 61922 65457 76621 50528 32331 13350 -3112 -17363 -13868 -192
9079 -192 15738 21226 -9377 -32980 -36805 -32177 -18407 1821 27433 26469 16191 -1052 -13655
9066a3655n682l3968K4371J8200J5855l3623J7093K5495J215q620Q3k0342j1461
9053b5039p169J0755j1970J4545p298P831L0838j2583J8451j1448k149L3959Q31
9040C9554l6888l173j0908k1703m446J2294J2634J6667K6538l406j7690N563L8385
9027E3421K7585J4411j8499k6894r792J6649K3592K7318L5116M8956P7252J9016
9015B88131p6232p0988o654L92N662k1292m8934J8367L1727K105J0369K4251Q273
9002A65177J0762L747J5831j3391j2729L8956P5644R3457Q2263R4431J35031J46092
8990H35271K29260L29294M74117O63628J145313J995856L320847M286624K635145
8981A5915355j355731l906216l498416k119119j169383o60003l93670k49091k07916
$$ plain form
9066 -13655 -19337 -53305 -28934 -10734 5121 -28502 -11409 14086 15301 6681 6764 -13578 -25039
9053 -25039 -32208 -21453 -33423 -18878 -26176 -18345 12493 -90 18361 6913 4764 38723 39554
9040 39554 2666 -507 -11415 -33118 -37564 -25270 -12636 4031 30569 27163 9473 15036 53421
9027 53421 81006 95417 76918 50024 40232 56881 80473 107791 142907 191863 269115 288131
9015 288131 211899 140911 134257 134649 140311 119019 70085 88452 120179 122284 132653 156904 165177
9002 165177 175939 179686 195517 182126 169397 208353 283997 377454 459717 554148 689179 835271
8990 835271 1064531 1393825 1867942 2531570 3676883 5672739 8993586 13280210 15915355
8981 15915355 14559624 10653408 7154992 5035873 3866490 3206487 2812817 2563726 2355810
8972B355810j97213k21082k37070k38506j60739j16368j21284l5236j1323k3249
8962I93740J4139M4765R8701J58545J84062K63188M46222O02979Q02404J111716
8952D720461J804521L118245M410537L914719N12746k523076k241385L18579L082245
8943A7117592L836232O89503l329810m158207k481703o05423J127624L282313
8935A5478121N599969N779816K236973j049501k362577l776291m842494m253500
8927A2810516k884780j775105j101349p23178m99395l24704j45497J11211N25677
8918E993396J261854K482354M110071M713421J988846k511864m489766l449706
8910A0098606j942842r55238m50802k14002J5879L05335P08704J297004K061734
$$ plain form
8972 2355810 2158597 1937515 1700445 1461939 1301200 1184832 1063548 1028312 1016989 993740
8962 993740 1007879 1052644 1151345 1309890 1493952 1757140 2203362 2806341 3608745 4720461
8952 4720461 6524982 9643227 14053764 17968483 18481229 15958153 13716768 14035347 17117592
8943 17117592 20953824 21643327 18313517 14155310 11673607 11068184 12195808 15478121
8935 15478121 21078090 26857906 29094879 28045378 25682801 21906510 17064016 12810516
8927 12810516 9925736 8150631 7049282 6326104 5826709 5502005 5356508 5467719 5993396
8918 5993396 7255250 9737604 13847675 18561096 20549942 18038078 13548312 10098606
8910 10098606 8155764 7200526 6749724 6535722 6551601 6856936 7565640 8862644 10924378
8901A0924378L202398N369799R191672J4354422J7259535J0960716m445069j5988236
8893E0829615j6090325j0593220o061900l411653j994298j369902j128305j011052
8885I168960q20377o44340l64096J18451Q26745K005845L943096N288236K910303
8876B2432823k467238n345384m277234k337479j098821m08410o003L07876P05927
8867G506057J520685K842379M501943M907889J867643k605574m189997k624122
8859A3726903l15455K032815M425179M867177J064419l551709m278037j784168
8851A6187124J387225M475774N810539K514429k097695k432263r8853n49027l504071
8842B1693182n043344m199480k751813j675673j051127q00708p40744p56352o36714
$$ plain form
8901 10924378 14126776 19496575 28688247 43042669 60302204 71262920 66817851 50829615
8893 50829615 34739290 24146070 18084170 14672517 12678219 11308317 10180012 9168960
8885 9168960 8348583 7704243 7340147 7458598 8285343 10291188 14234284 19522520 22432823
8876 22432823 19965585 14620201 10342967 8005488 6906667 6498257 6492254 6800130 7506057
8867 7506057 9026742 11869121 16371064 21278953 23146596 20541022 16351025 13726903
8859 13726903 13411448 15444263 19869442 24736619 25801038 22249329 17971292 16187124
8851 16187124 17574349 22050123 27860662 30375091 28277396 25845133 25746280 25197253 21693182
8842 21693182 16649838 12450358 9698545 8022872 6971745 6171037 5430293 4673941 4037227
8833D037227m90301m14093l38626k45773j92739j17414l1533j4911N0077J27504
8823B369418J47672O1086o5196o9372K9610K12185M10722O30259R04370J394058
8813F024812K383364M030729N576875M267418q12856n049495n190224l319379
8805G911244j896020j141013p19898m63800m69387m85888l81907l36736k48120
8796A768475k07871j91323j32741j02363q9949p1822o6190n3704m9043M3102O0690
8785I07261J1120R569q174k3462J4248K8481L8091Q7485J89880K92180L05588
8774A852267K99202L49474L43796Q0525k43959m01099l34315j99310j27107p1325
8764A548149K4138K7400K3692K4337k4440p2521j08938j39501j43929j32271p9359
$$ plain form
8833 4037227 3546926 3132833 2794207 2548434 2355695 2238281 2206748 2191837 2241914 2369418
8823 2369418 2517090 2578176 2512980 2443608 2473218 2685403 3096125 3726384 4630754 6024812
8813 6024812 8408176 12438905 18015780 22283198 21470342 16420847 11230623 7911244
8805 7911244 6015224 4874211 4154313 3690513 3221126 2735238 2353331 2016595 1768475
8796 1768475 1560604 1369281 1236540 1134177 1044228 972406 906216 852512 803469 846571 907261
8785 907261 918381 927950 919776 896314 910562 939043 977134 1064619 1254499 1546679 1852267
8774 1852267 2151469 2500943 2844739 2925264 2681305 2280206 1945891 1746581 1619474 1548149
8764 1548149 1572287 1599687 1623379 1647716 1623276 1550755 1441817 1302316 1158387 1026116 946757
8753I46757p7684q9193k7954j9246n7798r4917o0035J0471O54k0530j9094m223
8741D87208Q926k759M9136J2289L6773L5569N2093L0510R1476J91415K39486L86980
8729A619102O00489Q54609J056133Q72844J37611o62380r91133q54612n72140
8720B060523l49243k22308j30343j01872n6406l8457l6290m2292p5347p9327n9904
8709H68734r4816q2657q8724n1758p1258n9405l6983L422J5410l679j2120p278
8697C78888k0818j6715j5769J3151M858J4639J901O916K4387K9799N4275Q6774
8685E62286J22023J74844K57458L65598M20829L52352M3249k71311m23629l68769
8675A234930k58735k05840j63722j02882m4751m2350l6431k9793j8355m1551l3220
$$ plain form
8753 946757 869073 779880 751926 732680 674882 579965 519930 530401 531055 510525 491431 487208
8741 487208 496134 493375 542511 554800 591573 627142 679235 709745 801221 992636 1232122 1619102
8729 1619102 2219591 3074200 4130333 5003177 5140788 4478408 3487275 2632663 2060523
8720 2060523 1711280 1488972 1358629 1256757 1200351 1161894 1125604 1083312 1007965 928638 868734
8709 868734 773918 691261 602537 550779 479521 420116 383133 386555 401965 398286 386166 378888
8697 378888 358070 341355 325586 338737 343595 358234 360135 367051 391438 421237 475512 562286
8685 562286 684309 859153 1116611 1482209 1903038 2255390 2298639 2027328 1603699 1234930
8675 1234930 976195 770355 606633 503751 459000 416650 380219 350426 332071 290520 257300
8664B57300n0395k4623j778J2203k2181j1243k0783k2591k2788k481K9903l26
8652A20217J6337K1013J3168j3841r327k5578m6514J744L5568M2686K0791n3463
8640A22801j7233l626j985K0459N765K584k1184k9299k1536j094O1290j7164j6654
8627H3124j0325j4408L118J4295k4475j2251J5352q146J8779N958L200K2036L593
8614I9850l4118j6060K5896J7749L9537L3611j0251k9852L39o963j6557q668J6805
8601A11318R363J492q88M187J4644k258J7368K5885J3273J3932O50R908k988m11
8587B15475J0145j4502K8457L2182M1047K142J545K2320J8540k15m0582l4559
8575B81995l9545j5882j8408l5574j6046k2035J1859P919J3798L4200n851n57
$$ plain form
8664 257300 206905 182282 180504 192707 170526 159283 138500 115909 93121 90640 120543 120217
8652 120217 136554 157567 170735 156894 147567 121989 75475 77219 112787 155473 176264 122801
8640 122801 105568 101942 99957 120416 126181 128765 107581 78282 56746 55652 116942 99778 83124
8627 83124 72799 58391 61509 75804 51329 39078 54430 46284 65063 71021 74221 96257 99850
8614 99850 65732 49672 75568 93317 132854 166465 156214 126362 126701 119738 103181 94513 111318
8601 111318 120681 122173 121285 125472 140116 137858 155226 181111 194384 208316 208966 218874 215886 215475
8587 215475 225620 211118 239575 271757 312804 314946 316491 338811 357351 357136 316554 281995
8575 281995 242450 226568 208160 172586 156540 134505 146364 154283 168081 202281 196430 195873
8563A95873k7856j7724O392n286J6860J4160J0862l9834l7460P186J4382K418
8551A39973j6306j9280l0463J805L2344P062k660j8986N977K56l1066j2783j332
8538E4541J8598K6548j3747r895Q243J0105n411j8247r394K5824L7179l451m4578
8525G6315j0876N600p324N463L145m481K7354M108J2929O4070O8165Q4032M1331
8512C69831m3694q7758m4262l2860n6455M875M694k0024o157J8476J794j6427
8500I2033m115l502J118O670k7650k8348J209R286n81K8126j896j5577L240L1316
8486I1329j4761k7572m801L662n88O831o251J950N595J2734N3151Q66J1763k3032
8472A10876O835K8460K5478P660N127q830M565j4172l9098M405l5996k4894J8907
$$ plain form
8563 195873 168017 150293 156685 151399 168259 182419 193281 153447 115987 123173 137555 139973
8551 139973 123667 104387 73924 75729 108073 115135 112475 93489 99466 99722 68656 55873 54541
8538 54541 73139 99687 85940 76045 84288 94393 88982 70735 61341 87165 124344 120893 76315
8525 76315 65439 71039 63715 69178 72323 67842 95196 99304 112233 176303 244468 328500 369831
8512 369831 326137 238379 194117 161257 104802 109677 114371 94347 88190 106666 108460 92033
8500 92033 87918 84416 85534 92204 64554 36206 37415 46701 46120 74246 72350 56773 60013 91329
8486 91329 76568 48996 44195 47857 47269 54100 47849 49799 55394 68128 121279 122145 133908 110876
8472 110876 117711 146171 171649 179309 184436 175606 180171 165999 126901 131306 95310 70416 89323
8459H9323J3103J1327J2175l3489j898N987K0553k3681k0177Q995J3234M7353
8447A42805O5298M7097R35r826m0742o4417l6858J4218M0263j6877k6940O508
8435A21464L3476M2859p136l3357k3920J0218n979Q442K4815R214Q753j0286q507
8422A70056j2437o061k641O296j0021K4181L3176O1241K1074l1908n5941j3093
8410A83922j5444j6146K7267o999k2106K349L5490L082K7240O3378J06691O3996
8398D52720J0978m2852r5487j06686m3283p477k3759k7227p799L312k7867J6907
8386A01480K1550K0899J4356K3857M0699L7604N4910O5045P537r198m0622n6173
8374B81944l0034k2296k7960L3417M5324M5416P0447Q4729J6307p9585m1072M001
$$ plain form
8459 89323 102426 113753 125928 92439 90541 96528 117081 93400 73223 82218 95452 142805
8447 142805 208103 255200 256135 246309 205567 141150 104292 118510 158773 141896 114956 121464
8435 121464 154940 197799 190663 157306 133386 143604 137625 146067 170882 180096 188849 178563 170056
8422 170056 157619 151558 148917 155213 145192 169373 202549 263790 284864 252956 197015 183922
8410 183922 168478 152332 179599 172600 150494 152843 188333 191415 218655 282033 388724 452720
8398 452720 463698 420846 325359 218673 175390 167913 144154 116927 109128 112440 84573 101480
8386 101480 123030 143929 158285 182142 222841 260445 315355 380400 387937 378739 338117 281944
8374 281944 251910 229614 201654 235071 280395 325811 396258 480987 497294 417709 376637 380638
8362C80638M4276N4500J24384K8798r9598j08568j07233l9926J7948N518k3898
8351B76839l2260k2283J0596n496N3086K2009j2915m6407m1628k6114J0857L123
8339A89407r66J3748L9584j1195J1818N6414Q6059P9158L5817j7149n3548j1157
8327D17990k7454p305K3017O19l414k8907j4632N2993J06111J03409J53374J49066
8315I24867J29618J01892j8732j24664r8173j6758n7605q8330j25787j40254r0440
8304C95634l3813p921M0338M6919K7879J8717n4649j00875k8743o496J6609N5647
8292C69246K9252K7150l299j0386m4784n6203j0368J105j1398K8194L0216K6643
8280C75368K1308O929K7658P7545N7554j5478p2433o1278n2618k9827M184O5588
$$ plain form
8362 380638 424914 479414 603798 632596 532998 424430 317197 277271 295219 300737 276839
8351 276839 244579 222296 232892 227396 280482 302491 289576 243169 201541 175427 186284 189407
8339 189407 188441 202189 241773 230578 242396 298810 384869 464027 499844 482695 429147 417990
8327 417990 390536 383231 406248 406867 403453 374546 359914 412907 519018 622427 775801 924867
8315 924867 1054485 1156377 1137645 1012981 914808 898050 840445 752115 626328 486074 395634
8304 395634 361821 353900 394238 441157 469036 487753 433104 332229 303486 296990 313599 369246
8292 369246 398498 425648 422349 411963 367179 310976 300608 301713 290315 318509 348725 375368
8280 375368 396676 403605 431263 508808 566362 550884 478451 417173 364555 334728 338912 404500
8268D04500Q0717J53779J88472J80392J55674Q6312n5966j85068k07106j13701
8258F88005j0057l2735q7803j07873o3029l1365n7809j8891O9980O3208m1806
8247C69825m4616j8460R667l5331k9690j4844m981J5248j1985k39L8191Q1390
8235C54175Q5221K7336j5744n2403p5025j1123M7338P9004O9183J1999o2711m9928
8223D07322l3509p578m8686l7652j4342K1563J5455J2920R2161J25336J58200
8212F91190J24315k181r5109m7355l1030O7040J11539L2404n7378r4018j28572
8201E70845j11148r6400m5230k4007l1509k8695O232L3832L6410M4259Q2284J03873
8189E40746J61460K11577J66842m1714j63443j38788j5725J5684j5244n2795l1076
$$ plain form
8268 404500 485217 638996 827468 1007860 1163534 1249846 1193880 1008812 801706 688005
8258 688005 677948 645213 557410 449537 386508 355143 297334 278443 348423 411631 369825
8247 369825 325209 306749 316416 281085 251395 236551 231570 246818 234833 234594 272785 354175
8235 354175 439396 466732 450988 398585 323560 312437 359775 438779 507962 519961 457250 407322
8223 407322 373813 366235 317549 279897 265555 287118 302573 315493 407654 532990 691190
8212 691190 815505 813324 718215 670860 639830 706870 818409 850813 793435 699417 570845
8201 570845 459697 363297 318067 294060 262551 233856 240088 273920 310330 354589 436873 540746
8189 540746 702206 913783 1080625 1038911 875468 736680 720955 736639 721395 668600 637524
8178F37524N5566Q4550J7528j50444j33460q1128j00627l5094l4552K4322N6320
8167C40505P0041Q3694R1040M3219j6864M5951N6118Q1184J01797M0815l2745
8156I04755j70053k19673j50898p4372m8771k0070k3862n018l3222K1549K0775
8145B01140k867R012J4531Q064K1335Q749L8950O0733J6516j0768j2550j0126
8133C42719k4103m1830l9195m0269k1388n557j3333N330P965R296J4221J2964
8121B06820R025R156k6001l0737j7379L299K2028K8592k5478l0914j0870q4p208
8108A30249q779q722j884M677J0528l1990P856K6532L2600l606l8267k9211q882
8095H1101K6495P614N472R231j054M507J2350Q365J2202J8411M96k1069r856j1116
$$ plain form
8178 637524 693090 777640 795168 644724 511264 430136 329509 294415 259863 284185 340505
8167 340505 410546 494240 585280 628499 611635 657586 713704 794888 896685 937500 904755
8156 904755 734702 515029 364131 289759 240988 220918 197056 192038 158816 180365 201140
8145 201140 198273 207285 221816 229880 251215 259964 298914 359647 376163 365395 352845 342719
8133 342719 318616 276786 237591 197322 175934 170377 157044 162374 170339 179635 193856 206820
8121 206820 215845 225001 199000 168263 150884 154183 176211 204803 179325 148411 137541 137457 130249
8108 130249 121470 112748 110864 115541 126069 94079 101935 128467 161067 157461 119194 89983 81101
8095 81101 107596 115210 120682 129913 128859 133366 145716 154081 166283 184694 185190 164121 154265 143149
8081A43149j9753n497k6859R242Q269Q43L4101L8106K341k0461q588L899O6700
8068B25492K6501m965k6538k1361k5272K4773K1405l7101k9263l868j9760L5510
8056A65553L8896p57m159K0419J8775N8431K1179j3016K7415N599k7999j2033
8044B98303k156j9389J41k4215k5382k0333K9902R307J0739k7880J1513P06k4941
8031B16315L2960M7614P692m0216j7898J9878n513k9077J3921K2817L186p188
8019B64491J1362J0618K2017k1689k6822k4242j8413L900P089K3563M186J8739
8007B74799J6583j4056m3206K1961L1496J6867r126k4077j342L6360K7751N2876
7995C86886N0681K8401J3833L5064m2929n1649j0417j6275n0453j9013m6135r1239
$$ plain form
8081 143149 123396 117899 91040 100282 108551 109394 143495 181601 183942 163481 154893 158792 225492
8068 225492 251993 247028 220490 199129 173857 198630 220035 182934 153671 149803 130043 165553
8056 165553 204449 203692 199533 219952 238727 297158 318337 305321 332736 338335 310336 298303
8044 298303 296147 276758 276899 252684 227302 206969 236871 246178 256917 229037 240550 241256 216315
8031 216315 249275 296889 304581 264365 246467 266345 260832 231755 245676 268493 271679 264491
8019 264491 275853 286471 308488 286799 259977 235735 217322 221222 228311 251874 256060 274799
8007 274799 291382 277326 234120 256081 287577 304444 295318 271241 269899 306259 334010 386886
7995 386886 437567 465968 479801 514865 471936 420287 409870 393595 343142 324129 277994 186755
7983A86755m2857O961Q842K2768N073J2170j6873K239Q701r839n259l7145k861
7970A38675r398j5110n734J9673L1352n641k9349L3468L6624K2779Q750L1484
7958B57573J5854k665k8784k3563k4118j1753N0601N3816L1843j2436l3063j7227
7946B56078m790j4980k3354k2726j7687J7272k974K2978l88Q759J9657K4635K4024
7933B86504K8041J3494l0582o3230n2730k2478P222r077J199o380K3079K0626
7921A95688m883k1315j2264J5166N1095L1198M0664P1209P5557L9217m653j3402
7909D63277n2666l8877k0848k523q432j9286k7328k2495M516P086J0086J9382
7897C11892L3013K4276K3048L7962P7186J42981K03703K34794J74659K2358j65655
$$ plain form
7983 186755 143898 150859 159701 182469 187542 199712 182839 185078 193779 183940 178681 141536 138675
7970 138675 129277 114167 108433 128106 159458 153817 124468 157936 194560 217339 226089 257573
7958 257573 273427 270762 241978 218415 194297 182544 233145 286961 318804 306368 273305 256078
7946 256078 251288 236308 212954 190228 172541 189813 186839 209817 209429 218188 237845 262480 286504
7933 286504 314545 328039 297457 234227 181497 159019 166241 157164 158363 151983 175062 195688
7921 195688 190805 169490 157226 172392 223487 254685 295349 366558 442115 481332 476679 463277
7909 463277 410611 371734 350886 348363 339931 320645 293317 270822 275338 282424 292510 311892
7897 311892 344905 369181 392229 430191 507377 650358 854061 1088855 1263514 1285872 1120217
7886A120217k16775j29753l7796L4723P2050N3602j4896r2239p9140q50L0123
7875G39266K6747J17466J83317K92372M33694M25035J82364k46188m27298k77501
7865A449274o8315O9117Q6418L8925m8792j04067j53210j32844n6046j7179M5288
7854A108569P2833J03199J7223l4142p0872m2064J5186O8944R0419J21245J34845
7843A585385J76422K44480K82737K90977K04379J96433K47569L49040M34183O55009
7833D666614J067728J500354J273356L99380l81698q47492p76467j48693M01907
7824G154989N41569M22206N14639R25084J677455K795618L978149M050331K877283
7815B4937323K792717M360211M293550J829978J597258L639324K942535O10516
$$ plain form
7886 1120217 903442 773689 735893 770616 842666 896268 881372 789133 709993 709143 739266
7875 739266 766013 883479 1066796 1359168 1792862 2217897 2400261 2154073 1726775 1449274
7865 1449274 1380959 1450076 1536494 1575419 1526627 1422560 1269350 1136506 1080460 1063281 1108569
7854 1108569 1181402 1284601 1301824 1267682 1196810 1154746 1169932 1238876 1329295 1450540 1585385
7843 1585385 1761807 2006287 2289024 2580001 2784380 2980813 3228382 3577422 4011605 4666614
7833 4666614 5734342 7234696 8508052 8907432 8525734 7678242 6901775 6753082 7154989
7824 7154989 7696558 8118764 8633403 9558487 11235942 14031560 18009709 22060040 24937323
7815 24937323 27730040 32090251 36383801 38213779 39811037 43450361 46392896 47003412
7807D7003412J714636P392919J6414260K8063292L6260876L0045596J6316690
7800A83211681J8560067L5278238L7170028J7085655l908276k0736396l4630309
7793B32030688l1180547j2518343n690236k0038647l2255519k7845373j5573425
7786H6928598m562626L239011N375778J842733p12054J250947R50172m040049
7778I0272510n269248j970344l948844r933720j0679457n679549O24357P563169
7770F0978874J6346289K4479418K2557842O994230p051680j1184020j3916832
7763I9204121j5024670q253258K667407P906171L454888l801622j0384422j4136663
7755F1631952j2253421o813883j694751L252514R850532J8071448J9737921M923517
$$ plain form
7807 47003412 48718048 56110967 72525227 100588519 136849395 166894991 183211681
7800 183211681 201771748 237049986 274220014 291305669 287397393 266660997 232030688
7793 232030688 200850141 188331798 182641562 162602915 130347396 102502023 86928598
7786 86928598 82365972 85604983 90980761 92823494 92111440 93362387 94312559 90272510
7778 90272510 85003262 83032918 79084074 69150354 58470897 52791348 53415705 60978874
7770 60978874 77325163 101804581 124362423 131356653 124304973 113120953 99204121
7763 99204121 84179451 75926193 78593600 86499771 89954659 86153037 75768615 61631952
7755 61631952 49378531 42564648 40869897 44122411 53972943 72044391 91782312 96705829
7747I6705829j2820460j4848678m027967Q766023J9312380K2627204J6697416
7740A32411747K471660j6362688k7500829k4572022j5453376p876768k756987
7733D0360737J255711M965987O739577L793481o6622M04459R37071k434738n511764
7724E0443899p557258r107355q376821n838270l654972k499871j816797j419326
7716A0173229j157554j017101r06429p90137o61125n13987m20075l63432k87702
7707D055687k11753j28720o0455q4425j26227q7012r0413k6463q5117k49251k88349
7696B617502k28066j55545j57643j02420l5628M7009K6590p9268j00603n8460
7686A773468n1630l6326L0753Q9006J97079L40361O47616J103161J422128P37987
$$ plain form
7747 96705829 83885369 69036691 65008724 73774747 93087127 115714331 132411747
7740 132411747 134883407 118520719 91019890 66447868 50994492 43117724 40360737
7733 40360737 41616448 46582435 53322012 57115493 57048871 57453330 58390401 55955663 50443899
7724 50443899 42886641 33779286 25402465 19564195 15909223 13409352 11592555 10173229
7716 10173229 9015675 7998574 7092145 6302008 5640883 5126896 4706821 4343389 4055687
7707 4055687 3843934 3715214 3654759 3570334 3444107 3357095 3266682 3240219 3155102 2905851 2617502
7696 2617502 2389436 2233891 2076248 1973828 1938200 1985209 2011799 1932531 1831928 1773468
7686 1773468 1721838 1685512 1716265 1805271 2002350 2342711 2990327 4093488 5515616 6253603
7676F253603p52705j506018j153231o44698l29518k06409j44653q7532n9994m8468
7666A320377j05311q0410r1683o0319n3644k0881j3228P726O037l1239k3130k3188
7654H31107n2787k6570j8207l7088p396k6528l6764l4682j4947j4686j654r54
7642E58844j3796j99P50O513L8136L60J070m2443k1752K9206L4221K53n796P3436
7628F58803Q6083Q2163J8214l9434q9476q7072l7591l5407J7923P852J3024L3952
7616F29034N319j4818l3240o8504m4840k4912K7179j1182p2252r5813n6335k8040
7604B11596J1467Q637j008k5179p39Q860M2878J0134Q62K5745K4127j9177j6460
7591B81743j5477j7568Q510L0638J8449J5832O669K222l316j1711p207j5548k2210
$$ plain form
7676 6253603 5500898 3994880 2841649 2196951 1867433 1661024 1516371 1428839 1368845 1320377
7666 1320377 1215066 1134656 1042973 982654 929010 908129 894901 902627 908664 877425 854295 831107
7654 831107 778320 751750 733543 696455 689059 662531 625767 591085 576138 561452 559798 558844
7642 558844 545048 544849 545599 552112 590248 590608 591678 549235 527483 556689 590910 591163 585367 658803
7628 658803 744886 827049 845263 805829 716353 629281 591690 556283 574206 582058 595082 629034
7616 629034 634353 619535 586295 517791 472951 448039 475218 464036 391784 295971 239636 211596
7604 211596 223063 231700 230692 205513 204774 213634 256512 266646 267508 293253 317380 298203 281743
7591 281743 266266 248698 257208 287846 306295 322127 328796 331018 327702 315991 308784 293236 271026
7578B71026k7939l0890k0608J643n8572j4318M0181L3555K1420j0502l0749K131
7566A76378m416J7395l646K5314K1616J9396m2071l5750l3558J0966J4644j537
7554A64731j950J9718J3903j3808j9396J1911r214j0685k0318k7908Q405J1223
7542A26612P934J073j8840j0531j0022j196N101k5523p254J7569K0898J2516j0939
7529A07398j8706J5075J6989j1409L3871j4063l5606l517L7411J6127N416j9728
7517A29258n1848k1778P162L4794L8058R671j6481k5393q37L1862j3023n5064
7505F6381l7270j2176m218n722K4127L7941Q626j473j8884j3494J7493L0797K1640
7492A13768k7723R787j1397Q823q993r112p724k013L3078K3532J4448R092k1300
$$ plain form
7578 271026 243087 212197 191589 193232 134660 120342 160523 194078 215498 204996 174247 176378
7566 176378 171962 189357 185711 211025 232641 252037 209966 174216 140658 151624 166268 164731
7554 164731 162781 182499 196402 182594 163198 175109 165895 155210 134892 106984 115389 126612
7542 126612 134546 135619 116779 106248 96226 95030 100131 74608 67354 84923 105821 118337 107398
7529 107398 88692 103767 120756 109347 143218 129155 93549 90032 127443 143570 148986 129258
7517 129258 77410 55632 62794 97588 135646 145317 128836 103443 102606 134468 121445 66381
7505 66381 29111 16935 12717 6995 31122 69063 77689 76216 57332 43838 61331 92128 113768
7492 113768 86045 95832 84435 93258 84265 75153 67429 65416 98494 122026 136474 145566 124266
7479A24266l8878j9537l0473j045L3036K637k5510N503j2622L472K2714K8261
7467I1824j0287k9013p613j602L2622J9378p565j3288q407J9j9369j8389J5450
7454D3760K4200j2625q082j74j0522p153K4634k735Q883k400l6785M598p67J4300
7440C9132K0611r116k731p238K8850q532k2562j7519l4096j1443L9261L2057Q527
7427E5201q649j414j3328Q1J1535J7058K562L972k7304j7517O520J6010p133j9820
7413A7774j9943q365K2746K6589k6439J4695L8530K048l6941j2436M043K6345
7401D8646j719l9815k4252N221J0829l3102k4142K3465L1168M3011J4140R210
7389F2660l386j6375l2544J6042K2440J0592p101J192P122r540p485J6133n781
$$ plain form
7479 124266 85388 65851 35378 34333 67369 70006 44496 49999 37377 40849 63563 91824
7467 91824 81537 52524 44911 43309 75931 95309 87744 74456 66049 66068 46699 28310 43760
7454 43760 67960 55335 47253 47079 36557 29404 54038 51303 60186 57786 21001 25599 24832 39132
7440 39132 59743 50627 47896 40658 69508 60976 38414 20895 -13201 -24644 14617 46674 55201
7427 55201 46552 45138 31810 31891 43426 60484 63046 67018 39714 22197 28717 44727 37594 17774
7413 17774 -2169 -10534 12212 38801 12362 27057 65587 67635 30694 18258 22301 48646
7401 48646 46927 7112 -17140 -11919 -1090 -34192 -58334 -34869 -3701 39310 53450 62660
7389 62660 59274 42899 10355 26397 48837 59429 52328 53520 60642 51102 43617 59750 53969
7376E3969k4255K4802n24J3283k4211L729r325J3725L495J0329l0887k4966k9587
7363b0423L7412M8141L1699L385L0683M2841m8914k9883j9219j1177K6447k0288
7351G0704j8211j731j2494j107O138j9342J7314J5839j1377k69L2169L0277J403
7338A09313j2646K785P89M9049L5467l775K2133R2310J15891J26961L8106j2606
7326E63777K6378P6767k3021j23494j36933r8582m2152m9530l5512J8619K4746
7315B01063k7054m3952k8719j7271q804L5700J7277p172l9120m582J4442K0330
7303A12138J0345J3641J0213R504K3774K4628P8378R7894J28934M2450q2768r3157
7291C75974j6606L2194m905p3764o6418R752L0820N6191K3431J635L0625M4276
$$ plain form
7376 53969 29714 54516 53992 67275 43064 46793 37468 51193 54688 65017 34130 9164 -20423
7363 -20423 16989 65130 96829 100214 130897 173738 124824 94941 75722 64545 90992 70704
7351 70704 52493 50762 38268 37161 43299 23957 41271 57110 45733 45464 77633 107910 109313
7338 109313 96667 99452 100241 149290 184757 180982 203115 295425 411316 538277 576383 563777
7326 563777 590155 666922 643901 520407 383474 284892 242740 193210 157698 176317 201063
7315 201063 174009 130057 101338 84067 75263 110963 128240 121068 81948 77366 91808 112138
7303 112138 122483 136124 146337 155841 179615 204243 282621 380515 509449 551899 469131 375974
7291 375974 359368 391562 386657 312893 246475 256227 287047 343238 366669 368304 398929 443205
7279D43205P9292R3205J14751N0152o1163l0938N6680M8549J6735k1239o3721
7268G25508n5775m8689r8335j14626p4292n3233p816J1241k2746k9880j8498n695
7256B07164K0773N6037K2415k5151o3253k3391j1364j4286J1770K3054R569L1186
7244B44523N798L5673M0830N4397O4098K4014k3650n4148l9256m1408j4297L9611
7232C36185Q6619L7912l2069m8387l5730L5697N3718O6005R8727K5754o1627k9725
7220E33079k1123m9607m3879j7803k5028j9453m2972q8301n0959o0586k6203J2445
7208I9610J0907r183Q58l697o842l45j8359N723J6579q998L5096J05334Q9737
7195C16420L7401k2923o2966n1898l9244k6135k2071K9968K2616j3344q647l5858
$$ plain form
7279 443205 522497 615702 730453 780605 719442 688504 745184 793733 810468 789229 725508
7268 725508 669733 621044 522709 408083 333791 280558 272742 283983 261237 231357 212859 207164
7256 207164 227937 283974 306389 281238 217985 194594 183230 168944 180714 203768 213337 244523
7244 244523 250321 285994 326824 381221 445319 469333 445683 391535 352279 310871 296574 336185
7232 336185 422804 460716 428647 380260 344530 380227 433945 499950 598677 624431 562804 533079
7220 533079 511956 462349 418470 400667 375639 356186 313214 224913 173954 113368 87165 99610
7208 99610 110517 101334 102192 98495 91653 91308 72949 78672 95251 86253 121349 226683 316420
7195 316420 353821 330898 267932 216034 176790 150655 128584 158552 181168 167824 159177 123319
7183A23319k0272j6569k9106k1077l4674k2103K3266M6160K0962J1010O3924O3810
7171B08650O1801K3191q1282n2428j8521l082o0809m8817l2645K2877K215j3576
7159G574o926J4245Q921k5837J5203J1498l0186j9876l0025N611O7029L0757k6384
7146B1604j7827J9894K6587M409k9851K9935J5807k3318j9199P0j066r75K2056
7133D8126O857J3827j3845j8002o429r749j2774p894j0659P094J5970k0379O973
7120h84n588j0950J123p905K3102K2658j2887k1452P966L979n904J9256l219J5129
7106B4424J9402j3914j8535J5485j1697m767k0827J3095J06N500r724K616m399
7093c235J979J0506j2723K645N944j232L8127L909j1158k5977j7750K5915L5743
$$ plain form
7183 123319 103047 86478 57372 36295 1621 -20482 2784 48944 69906 80916 144840 208650
7171 208650 270451 293642 212360 159932 141411 138329 77520 28703 -3942 18935 21150 7574
7159 7574 648 14893 23814 -2023 13180 24678 -5508 -25384 -55409 -49798 17231 47988 21604
7146 21604 3777 23671 50258 54667 24816 54751 70558 47240 28041 28111 27045 26070 48126
7133 48126 54983 68810 54965 36963 30534 20785 8011 117 -10542 -3448 12522 -7857 -884
7120 -884 -6472 -17422 -16299 -24204 -1102 21556 8669 -12783 -4817 -838 -6742 12514 9295 24424
7106 24424 43826 29912 11377 26862 15165 10398 -10429 2666 2772 8272 -1452 1164 -3235
7093 -3235 -1256 9250 -3473 -828 5116 3884 42011 45920 34762 8785 -8965 16950 52693
7080E2693p398l3106j7155J6217P480K7203L2152r229j5339l6980p472j7375J5880
7067G571k8209m8604M874K9303k363L3406L8233J9459j1784l0448n227P803J0339
7054B4353L001j0870J6293r099J111J1359k0080j1556P861k0085K9566k6062l3386
7041c7594j9002P353l705J3860J5529o868J4513O066K3935L673l817O628K8580
7028D9151J3367n946K3004K7651k4940m3344l3938K6614J0734k0108J878j7829
7016F294o861j5432J8521j1192m886K7865M720J892L828k1463L9773K4605j4198
7003E3466k8460k7906K3403m038J055j1881P729J2383k7410j5877J1794P026K1662
6990B2946k9881j9076L902K6907L49q207j9270n183J6173K5506k2437O12j8389
$$ plain form
7080 52693 45295 12189 -4966 11251 18731 45934 78086 68857 53518 16538 9066 -8309 7571
7067 7571 -20638 -69242 -64368 -35065 -37428 -4022 34211 53670 41886 11438 6211 14014 24353
7054 24353 27354 16484 32777 23678 24789 36148 16068 4512 12373 -7712 21854 -4208 -37594
7041 -37594 -56596 -49243 -52948 -39088 -23559 -30427 -15914 -9848 14087 17760 13943 20571 49151
7028 49151 62518 56572 79576 107227 82287 38943 5005 31619 42353 22245 24123 6294
7016 6294 -567 -15999 2522 -8670 -13556 14309 19029 20921 24749 3286 43059 67664 53466
7003 53466 25006 -2900 20503 16465 17520 5639 13368 25751 -1659 -17536 -5742 1284 22946
6990 22946 -6935 -26011 -22109 4798 5147 -3060 -22330 -27513 -11340 14166 -8271 -7659 -26048
6977b6048J0672J1635K4136j0571K1985R527r639j9132j0994P927O18p293p989
6964e166K0341R380L098k5491j1761l084o109K6863K6918J6983J017K7149r854
6951G0284l9421n542K3386k448J4597k3442n988M442L1686L418j3178j206k4718
6938C1870k9684J0980K1805J5004j19j1994j8974l366k2806j9713M634K7148K1919
6925B6704p356k1338r978K5385J9141j7396k3884K57P775o939n504M7822J155
6912C5844k3114j9115j0101K8275K8441Q441K7095k0666j5572j6425k1475l2867
6900c1239o273R943J2594J2103Q760J3202j379k847l727r463K1148J5287k1479
6887A6630k7894o620J6466P313j346k5507P842Q319J4384m259r352P890j1266
$$ plain form
6977 -26048 -15376 -3741 20395 9824 31809 41336 31697 12565 1571 9498 10116 2823 -5166
6964 -5166 15175 24555 27653 2162 -9599 -12683 -18792 8071 34989 51972 52989 80138 70284
6951 70284 30863 25321 48707 46259 60856 37414 31426 35868 67554 70972 57794 56588 31870
6938 31870 2186 13166 34971 49975 49856 37862 18888 15522 -7284 -26997 -22363 4785 26704
6925 26704 19348 -1990 -11968 13417 32558 15162 -8722 -8465 -690 -7629 -13133 34689 35844
6912 35844 12730 -6385 -16486 11789 40230 48671 75766 55100 39528 23103 1628 -31239
6900 -31239 -37512 -27569 -14975 -2872 5888 19090 17711 14864 11137 1674 22822 38109 16630
6887 16630 -11264 -17884 -1418 5895 4549 -20958 -13116 -4797 9587 5328 -4024 3866 -7400
6874g400m1286j9313K8865K0383K075Q213J8599j2269k7738j6776J8489K013J924
6861b4221k43K8019J9100j4624m6584j3136K6672n540k6468k429L7262M4050K886
6848B4744j7002m414K5953j4251O042j9563M33K0854J5649K2437J2780k2442l9593
6835A1627m3136j9235K360M8079J6242K2241K986j4944N216j0441J12j4704j1437
6822e034L110J714j0979J2540j4313l3919L2505L0496J1193k8207o366l1531r430
6809d8221L3485j8472l2160O890L1158K7688J0031j5983J0027L8712k0330m1241
6797a8416J8419L626m435r337n133j2638j9132o618m216K0753J0926J5894J4082
6784C775J125k0831p698J3654J4731r457J6924Q070l6705r847K182q351j274K2934
$$ plain form
6874 -7400 -48686 -67999 -39134 -18751 -16676 -8463 10136 -2133 -29871 -46647 -28158 -26145 -24221
6861 -24221 -24464 3555 22655 8031 -38553 -51689 -25017 -30557 -57025 -59454 -22192 21858 24744
6848 24744 7742 3328 29281 15030 21072 1509 1942 22796 38445 60882 73662 51220 11627
6835 11627 -31509 -50744 -48384 -305 15937 38178 41164 26220 31436 20995 21107 6403 -5034
6822 -5034 -1924 -210 -11189 1351 -12962 -46881 -14376 16120 27313 -894 -7260 -38791 -48221
6809 -48221 -14736 -33208 -65368 -58478 -27320 368 10399 -5584 4443 43155 22825 -18416
6797 -18416 3 3629 -806 -10143 -15276 -27914 -47046 -53664 -57880 -37127 -26201 -10307 3775
6784 3775 4900 -15931 -23629 -9975 4756 -4701 12223 20293 -16412 -26259 -24077 -32428 -33702 -10768
6770a0768K812L6074P395k2125N570j4568q016L5706L1660p028l66M792k305K937
6756F1770j1065R672k0318k9484J5085j0336q692k750k8887J5282K1117k156J7415
6743B6653K8122j6405o356N897j6935j4275k0210r331K1882J3410p697O58Q357
6730A3770j773l535M3061J6490j2538R671J0832J7521n789m3560j8923K1425K1341
6717F7993k7391J826J5755Q259L129j7771r159N2195J25654J40356J46401K22651
6705G29898J55828m6869k14673j96744j03767q2493o1902k6353r883j3819q223
6694A21000k0388k0801k0268l8879n0064r170P764J3009K3972K4378K54j5197
6682A5610j867J6685J4863m1450k9734k0470J7687J7175L2646K5481L1397j6722
$$ plain form
6770 -10768 -7956 28118 35513 13388 18958 4390 -3626 32080 63740 56712 56346 61138 58833 61770
6756 61770 50705 60377 40059 10575 25660 15324 6632 3882 -25005 -9723 11394 9238 26653
6743 26653 54775 38370 32014 37911 20976 6701 -13509 -22840 -958 12452 4755 5413 13770
6730 13770 11997 8462 51523 68013 55475 65146 75978 93499 87710 44150 25227 46652 67993
6717 67993 40602 42428 58183 66442 69571 51800 42641 94836 220490 360846 507247 729898
6705 729898 885726 838857 624184 427440 323673 241180 179278 152925 143042 129223 121000
6694 121000 100612 79811 59543 20664 -29400 -38570 -30806 -17797 6175 30553 30807 15610
6682 15610 13743 30428 45291 3841 -25893 -46363 -28676 -11501 21145 46626 78023 61301
6670F1301m1444j4997K5112L9322J1102l4385j8904j4742j8707K1531R887j0573
6658A4503j8056J878j1277m583L179j5964j7240K2005L7748L0005L665l0155m773
6645A0935p380K112K676k638K541K2307l4856m4942k458M97l6543J9615K1169
6632d6965m823L8488K4958P932N905o535j7282N214q947k3549j5996K0345L5573
6619A4318j087J4346n412l1501k0719K9647L9494k490k0825J0959J2320j2085
6607B6965o435k1284k5763p304K5469J0399L759J606K5442M391k0434k8820R939
6594b070K2539J0767j8460M335j7272m4847p557L8468K4025p943M3406R093k5188
6581B9296j9848O52K7642K7273K7173k742k6450r913m6222l6785J0172L646P621
$$ plain form
6670 61301 19857 4860 29972 69294 80396 46011 27107 12365 -6342 15189 25076 14503
6658 14503 -3553 -1675 -12952 -17535 -14356 -30320 -47560 -25555 12193 42198 45863 15708 10935
6645 10935 3555 5667 8343 5705 8246 30553 -4303 -49245 -51703 -51206 -87749 -68134 -46965
6632 -46965 -51788 -13300 11658 19590 25495 18960 1678 6892 -2055 -25604 -41600 -21255 14318
6619 14318 13231 27577 22165 -9336 -30055 -408 39086 36596 15771 26730 39050 26965
6607 26965 20530 -754 -26517 -33821 -8352 2047 5806 7412 32854 37245 16811 -12009 -2070
6594 -2070 20469 31236 12776 17111 -161 -45008 -52565 -14097 9928 1985 45391 54484 29296
6581 29296 9448 10100 37742 65015 92188 89446 62996 53083 6861 -29924 -19752 -16106 -8485
6568h485m1624J7867K6587J2357l3710Q932J7903m438r784L6685j110j0447l408
6555G325k1938j8712j446k1282J4898L9314J1058o71k3290j3305p240L087K4415
6542g787j6244P883K8109j3881J2052j8577n700J7910K4598K259k116L471L98
6529C2375j1319j6428O411K0602q823p631N208M2591r250l9040J2024K3402K7851
6516G7973j3110k5631l6035r862L9606l985j264k380N456j7524j6050l7066P596
6503c2276K6653J6104R748P29l0259K632k7744j408k1402l0132K9307K9588L3797
6490E337p288j4571N352N809j0498P125J1943J1223j6635l9555l7823o11K0401
6477e9791k975L4669J1012J2885K4445n094j3088k4248l659l844k8131r173K2867
$$ plain form
6568 -8485 -50109 -32242 -5655 6702 -27008 -18076 -173 -4611 -14395 22290 21180 10733 7325
6555 7325 -14613 -33325 -34771 -56053 -41155 -1841 9217 8546 -14744 -28049 -35289 -32202 -7787
6542 -7787 -24031 -16148 11961 -1920 10132 -8445 -14145 3765 28363 30622 28506 31977 32375
6529 32375 21056 4628 11039 31641 22818 15187 20395 62986 53736 14696 26720 50122 77973
6516 77973 64863 39232 3197 -6665 32941 28956 27692 25312 30768 13244 -2806 -39872 -32276
6503 -32276 -5623 10481 20229 20958 -9301 -6669 -34413 -35821 -57223 -87355 -58048 -28460 5337
6490 5337 -1951 -16522 -11170 -5361 -15859 -8734 3209 14432 -2203 -41758 -79581 -80192 -59791
6477 -59791 -62766 -28097 -17085 -4200 20245 15151 2063 -22185 -25844 -29688 -57819 -66992 -44125
6464d4125K6563l702L239Q590k4596k0395J4337O1j6804M0941L372l66K0780J0781
6450A8676k9242k3320J0755L0273q639K4325L220k7998J5204Q212j4819m8403
6438d1756l3163O5J3566Q682k5601j9532L1826Q653J5898N2343j3334O798K5726
6425C0171n675j6071j3861N744Q771r927r059p085q715R35K0231l8541j1306M1515
6411a2873J8983O174J2739o602m1289j0164M2555P125l4143m895k2042R042L6946
6398A556K9272j3620l150k826l5632j8206j7246M4513M6426p940k8034J1764J0331
6385A7208p520j3941p281K2950k1374j1381j6111K1111r753p354o101J8747L3729
6372A2929k2685L083J0582J0932k2701m5342j0097K4987K9792N061M516L0058
$$ plain form
6464 -44125 -17562 -21264 -18025 -9435 -34031 -54426 -40089 -40028 -56832 -15891 -12519 -12885 7895 18676
6450 18676 -10566 -33886 -23131 7142 -1497 22828 26048 -1950 13254 21466 6647 -41756
6438 -41756 -74919 -74854 -61288 -52606 -78207 -97739 -65913 -57260 -41362 10981 -2353 4445 30171
6425 30171 24496 8425 -5436 308 9079 -848 -9907 -16992 -25707 -24772 -4541 -43082 -54388 -12873
6411 -12873 6110 12284 25023 18421 -22868 -33032 9523 16648 -17495 -22390 -44432 -35390 1556
6398 1556 30828 17208 14058 11232 -24400 -42606 -59852 -15339 31087 23147 -4887 6877 17208
6385 17208 9688 -4253 -11534 11416 -9958 -21339 -37450 -16339 -26092 -33446 -39547 -20800 12929
6372 12929 -9756 -6673 3909 14841 -7860 -53202 -63299 -38312 -8520 -3459 1057 31115
6360C1115L019j1701j2524l0227n973K1636J623j5467k3381O744K0092m898n300
6347b5242q735P4j6086J5043M1066K413m458j3338j9364J5062J1677j3268k7928
6334d3084P43P819K622p570M4088K7101Q194J0228K1630j8147k7143J2781K5972
6321F5234J9250k9370m9990N733L678k8850J8328J8073Q138l6687j8574p112J6694
6308a5455j2865K1933N0737k905k9893l0927M147K8556K47j7157k3868k617k143
6295c2210J54L9261J4668J3385j4395k5868K360M0491L5486K1253l5130k0377
6283C9078l4445l189j5371k2726j985J1056L5m128J1132j552L871J2197p028j504
6269a4559R652l3544L673J7023K943l2811J5524K9131Q549k7334l9726p369l280
$$ plain form
6360 31115 34134 22433 9909 -20318 -26291 -4655 -3032 -18499 -41880 -35136 -15044 -19942 -25242
6347 -25242 -33977 -33903 -49989 -34946 6120 8533 4075 -9263 -28627 -13565 -1888 -15156 -43084
6334 -43084 -42341 -34522 -31900 -39470 4618 31719 39913 50141 71771 53624 26481 39262 65234
6321 65234 84484 55114 5124 10857 14535 -14315 4013 22086 30224 -6463 -25037 -32149 -15455
6308 -15455 -28320 -6387 44350 41445 11552 -19375 -15228 13328 13575 -3582 -27450 -30067 -32210
6295 -32210 -32056 7205 21873 35258 20863 -5005 -2645 37846 73332 94585 59455 39078
6283 39078 4633 1444 -13927 -36653 -38638 -27582 -27547 -31675 -20543 -22095 -18224 -6027 -13055 -14559
6269 -14559 -4907 -38451 -34778 -17755 -14812 -47623 -32099 -2968 5581 -21753 -61479 -68848 -72128
6256g2128K0355K2478k007N0049M1451l0480l4898J4697j4832j5978R116J3040
6244H63L135l286J751N706q090r279j5519r268M0392n65n198O334K5750l5303
6230b577n0517R862L6815j2180k7641j8035J8231L1018j294l6111R844J6452J1553
6217a4580K2577J9853J249K588J69J8310j880k1541j230m0269k7207J6380J5932
6204i649j0253Q513J2201J2124j5446p959k1917K6108L0768K830k1625j2843j6375
6191b3523j8449N062R031K550M4597P434k2138r720m830j2729J4600M4616L4527
6178G1028k5506l0695j1949j7136k8108j9764O99k5424K6277N5094P01p709j8280
6165c0772M522L7125N239J2063J855l7239j7891n773M1352p132q555J8386o221
$$ plain form
6256 -72128 -51773 -29295 -31302 18747 60198 29718 -5180 9517 -5315 -21293 -12177 863
6244 863 3998 712 2463 8169 79 -9200 -24719 -33987 6405 5840 642 6976 32726 -2577
6230 -2577 -53094 -43232 -6417 -18597 -46238 -64273 -46042 -15024 -16318 -52429 -42585 -26133 -14580
6217 -14580 7997 27850 29099 31687 31856 50166 48286 26745 25515 -14754 -41961 -25581 -9649
6204 -9649 -19902 -11389 812 12936 -2510 -10469 -32386 -6278 24490 27320 5695 -7148 -23523
6191 -23523 -41972 -36910 -27879 -25329 19268 26702 4564 -5156 -9986 -22715 -8115 36501 71028
6178 71028 45522 14827 2878 -14258 -42366 -62130 -61431 -86855 -60578 -5484 -4783 -12492 -30772
6165 -30772 -26250 10875 16114 28177 30032 -7207 -25098 -30871 10481 3349 -5206 13180 6959
6152F959M359J369n407J494k7446k0344K0489K2628L333o137p65J457l3362J6475
6138a4898K5748j3026j3311N553j2231k7882J6508K2475j6234j6571J1925O753
6126b5191j3945K2213N306j5559R486M8774K4676k3823j5678p974O841J0563j9692
6113E997p447J226P233p665j9195m561L676J5383K3688J7805j1157l4026M611
6100d432j4144j2341M5658j2369k2815J2945Q464l576Q915K9768j1952j3987p166
6087B968k4704j2183J3771J9167j0445O900m243L916j0123j1657n080j0339K8746
6074a3306L3313K0266J3926K575m7234l1936M404j2322J4972p273J2835q706J3171
6061e315P234j0116r984N91l333j2901J7834J9029O565q379j5489m4833j3480
$$ plain form
6152 6959 11318 12687 7280 8774 -18672 -39016 -18527 4101 7434 1297 532 1989 -31373 -14898
6138 -14898 10850 -2176 -15487 -9934 -22165 -50047 -33539 -11064 -27298 -43869 -31944 -25191
6126 -25191 -39136 -16923 -11617 -27176 -17690 31084 55760 31937 16259 8285 15126 25689 5997
6113 5997 -1450 -224 7009 -656 -19851 -24412 -20736 -5353 18335 36140 24983 -9043 -4432
6100 -4432 -18576 -30917 14741 2372 -20443 -7498 966 -2610 6305 36073 24121 10134 2968
6087 2968 -21736 -33919 -20148 -981 -11426 -4526 -8769 -4853 -14976 -26633 -31713 -42052 -13306
6074 -13306 20007 40273 54199 56774 9540 -22396 -17992 -30314 -15342 -22615 -9780 -18486 -5315
6061 -5315 1919 -8197 -18181 -17590 -20923 -33824 -15990 3039 9604 1225 -14264 -59097 -72577
6048g2577K1642J7651m550J3539l19O13J3901N031j0998Q346l643j0302p374L6999
6034G959J5001j4496m48n789K653j4297k2701M95K2479j2445L3560P583O538J3426
6020C9518k215m3151o124K5400J2818k3008r193R171N598j1303O630q999J678
6007c180J6858K3290j267P04m1368L487j6050j4694k5388J1558M4422R968J2509
5994B0849O563q251l0246k835J9378M6846k7612o6045j5485P764J5172L526q038
5981c8414J8887N0012Q965j4257l549j1253k9770p417J1344J668N342K626j1188
5968a7004p07P185P867J60l0988K1382q00q050j6301k4041L5082L6363L1759J7153
5954E9060l2212j6091N303k4924J3146J0087j0314l751J384k015J6564M333j8942
$$ plain form
6048 -72577 -50935 -33284 -37834 -24295 -24614 -24001 -10100 -5069 -16067 -7721 -11364 -21666 -29040 7959
6034 7959 22960 8464 8016 2227 4880 -9417 -32118 -31623 -9144 -21589 11971 19554 26092 39518
6020 39518 37303 -5848 -11972 13428 26246 3238 -5955 3216 8814 -2489 4141 -4858 -3180
6007 -3180 13678 36968 35701 36405 -4963 -1476 -17526 -32220 -57608 -46050 -1628 8340 20849
5994 20849 27412 19161 -11085 -13920 5458 52304 24692 -41353 -56838 -49074 -33902 -30376 -38414
5981 -38414 -19527 30485 39450 25193 21644 10391 -19379 -26796 -15452 -13784 -8442 -5816 -17004
5968 -17004 -17711 -10526 -2659 -2499 -33487 -12105 -12905 -20955 -37256 -61297 -26215 10148 41907 59060
5954 59060 26848 10757 16060 -8864 4282 14369 4055 304 1688 -327 16237 20570 1628
5941A628l5618r447J0637J1650L6013j4818O809r809j32N677K6415j1472k2784
5928e251J7581J0916j9524N227O255j5561k342K4577k0450m11m538o502J4233
5915D210L846J0152j368j6634k5917K4789l539k3013O893L1970q270k206Q85m0537
5901c8739l3279L7260J8967J0733L111k2070m13j1519r234J3843K9867J224p687
5888g936l1037j3598K9155M2672k554l131j6612o527K4404J2058j6806j9951J0151
5875B88q035J716N260k188K254J4169q266k5734j1733j817J750O58K8341J4042
5861A0705P213J0340j407k5808j8626J2762N778J6624K8414k2835r417l488R274
5848A9529Q979j4029j9867k0045j2276j532J3099l97j5968j811j7315K4034K8690
$$ plain form
5941 1628 -33990 -43437 -32800 -21150 14863 45 6854 -2955 -3087 2590 29005 17533 -5251
5928 -5251 12330 23246 3722 8949 15204 -357 -2699 21878 1428 1017 -3521 -10023 4210
5915 4210 8056 18208 16840 206 -25711 -922 -4461 -27474 -20581 11389 3119 913 1798 -38739
5901 -38739 -72018 -34758 -15791 -5058 -1947 -24017 -24430 -35949 -45183 -31340 -1473 -249 -7936
5888 -7936 -38973 -52571 -23416 19256 16702 13571 -3041 -9568 14836 26894 10088 -9863 288
5875 288 -7747 -6031 -771 -2959 -705 13464 5198 -20536 -32269 -34086 -32336 -31678 -3337 10705
5861 10705 17918 28258 26851 1043 -17583 -4821 957 17581 45995 23160 13743 10255 19529
5848 19529 28508 14479 -5388 -25433 -37709 -39241 -26142 -26539 -42507 -44318 -61633 -37599 -8909
5835h909n495J5067J7628k4581j1147J522j8745o122j3011L8332K652j2380K2519
5822b670M4821l0935m2177n806R120K0092J5813m420J1251j0839j7705K0269K7314
5809C4128l1234j6268j0690J3663J9567k6754k3241l1095J7373L3033j4256m393
5797d0167K1314K885j3483n296N944K8270Q856j1962K7337K0840o89l8658k8894
5784b3703J4197M5257K698k5081j0106j0783J9830k835m2230k2722l984r179L7949
5771c0692N2921n817k1270j7657J8661M3121k2725j8054J779j1685p416j2167
5759c1001R909k0299K1984K1742K647J151K1162K5145k3528m325l0820r657q11
5746a6701J3356J0718M0609m877l4684l1090M6480K30k1191l032j7060P991k4703
$$ plain form
5835 -8909 -14404 663 18291 -6290 -17437 -15915 -34660 -40782 -53793 -15461 -12809 -25189 -2670
5822 -2670 42151 11216 -30961 -36767 -27647 -7555 8258 3838 15089 4250 -13455 6814 34128
5809 34128 2894 -13374 -24064 -10401 9166 -17588 -40829 -71924 -54551 -21518 -35774 -40167
5797 -40167 -18853 -15968 -29451 -34747 -28803 -533 8323 -3639 23698 44538 43849 5191 -23703
5784 -23703 -9506 35751 38449 13368 3262 -7521 12309 9474 -32756 -55478 -59462 -68641 -30692
5771 -30692 22229 16412 -4858 -22515 -3854 39267 16542 -1512 267 -11418 -18834 -31001
5759 -31001 -21092 -41391 -19407 2335 4982 6133 27295 52440 28912 24587 -6233 -15890 -16701
5746 -16701 -3345 7373 47982 43105 8421 -22669 23811 24041 2850 -182 -17242 -9251 -33954
5733c3954J4588L1694K1094N599R35J320k6566q531K3966M053k0860j2205m691
5720c558L100K2927k336n832P127J1448l1830j967J5101L7914p258l1971j7234
5707d369m8j5259K1479L0322j3843l086J0321j1288L6096L1528k5784k2979k0816
5694A2274m267J1657l885O616j2789m477j0553o148L959J016M488J1939j0058
5681b28J1592J1953J7962J6891k4792l6428j3290k5269M314k251l15J689J1377
5668b6795K1637K1612K13J6211k3798n258J7742r531j1738q292M539j4045j4152
5655c1655j3454l056K6076J4113k9374k1384L5491J0014k8763j1635J9277K3564
5643a0786M682K2729K6873o171j2331m7833k8584P094J4541M852m307J6263R860
$$ plain form
5733 -33954 -19366 12328 33422 39021 39956 41276 14710 6179 30145 34198 13338 1133 -3558
5720 -3558 -458 22469 20133 14301 21428 32876 1046 -921 14180 52094 44836 12865 -4369
5707 -4369 -4417 -19676 1803 32125 18282 15196 25517 14229 50325 81853 56069 33090 12274
5694 12274 8007 19664 15779 22395 9606 5129 -5424 -11572 -7613 -6597 -2109 9830 -228
5681 -228 11364 23317 41279 58170 33378 -3050 -16340 -41609 -37295 -39546 -39861 -38172 -26795
5668 -26795 -5158 16454 16667 32878 9080 3822 21564 12033 295 -7997 -3458 -17503 -31655
5655 -31655 -45109 -48165 -22089 -7976 -37350 -58734 -23243 -13229 -41992 -53627 -34350 -10786
5643 -10786 -6104 16625 43498 37327 24996 -22837 -51421 -44327 -29786 -24934 -29241 -12978 -3118
5630c118J2019j9562J5911J5119K9655K4102M734j3498J277j9757k330Q070n865
5617D6757j8604j4066j9814J962P627K7827P854J730k2300k9951J2799L153j5726
5604a0752N19L4268J5596k664k9637j9901P419j2945k413R446j5771k2532j5393
5591f4760p979J645m245O138M688L4742M3416L7878p508q471k2481l240l9326
5578b9503m0754J8455L4107L6560M3720J0399j4626j3103j8155M416j63J447Q194
5565D0994k0713J9366k553p0016j6523K5374Q124J6917J5787o516j7265j4195
5553b1219j9279k376m715M480J0119K9327M332q651k509Q468P992j898K2885j787
5539B5169j7646L4180J8202k2394j2169m7816k1400K3791L2901L101N550k1264
$$ plain form
5630 -3118 8901 -10661 5250 20369 50024 74126 78860 65362 66639 46882 44552 52622 46757
5617 46757 28153 14087 -5727 -3765 3862 31689 39543 41273 18973 -10978 1821 4974 -10752
5604 -10752 -10233 24035 39631 36967 7330 -12571 -5152 -18097 -20510 -11064 -26835 -49367 -64760
5591 -64760 -72739 -71094 -75339 -69201 -64513 -29771 13645 51523 44015 35544 13063 9823 -29503
5578 -29503 -70257 -51802 -17695 18865 62585 72984 58358 45255 27100 31516 31353 32800 40994
5565 40994 20281 39647 37094 -32922 -49445 -24071 -15947 970 16757 10241 -7024 -21219
5553 -21219 -40498 -42874 -47589 -43109 -32990 -3663 669 -7982 -10491 -2023 5969 4071 26956 25169
5539 25169 7523 41703 59905 37511 25342 -22474 -43874 -20083 12818 15919 21469 205
5527B05M646n037j0444j0535J5432j1375j6348J6371Q971j5811q76o483L1669
5514C85J0936Q267J5071J4125l3207j0769k0848J4244Q164j3792p648n468L2168
5501A1628K6152K546k734m460k484P842M980k3352k3983Q2k0254j1989K058J7371
5487a6597K7191n921k1703J6803M1789m0514l9574o137j1530j4741J0776k895
5475f3053L0049N5955L8916j0338n63q373k8233j0932m610M17N871J22R554J321
5461A6103k0382j6570J4221K4249k509q000j8621J9964n518j6204R510j1293Q313
5448f737J0437p065N376j8135o388k0523K1763R468R263j8368J8657j6250j6462
5435c4964j7328k703K5300J6466M77J0473J9781m3993k361L20J6156K4188O286
$$ plain form
5527 205 4851 -186 -10630 -21165 -5733 -17108 -33456 -17085 -8114 -23925 -24801 -31284 385
5514 385 11321 19588 34659 48784 15577 4808 -16040 -1796 6368 -7424 -15072 -20540 11628
5501 11628 37780 40326 37592 33132 30648 38490 43470 20118 -3865 -3783 -24037 -36026 -33968 -16597
5487 -16597 10594 4673 -17030 -227 41562 1048 -38526 -44663 -56193 -70934 -60158 -63053
5475 -63053 -33004 22951 61867 51529 50966 42593 14360 3428 -1182 -765 5106 5228 14782 16103
5461 16103 -4279 -20849 -6628 17621 15112 7112 -11509 8455 2937 -13267 -3757 -15050 -6737
5448 -6737 3700 -3365 2011 -16124 -22512 -43035 -21272 -11804 -2541 -20909 -2252 -18502 -34964
5435 -34964 -52292 -54995 -29695 -13229 -12752 -2279 17502 -26491 -28852 -28532 -12376 11812 18098
5422A8098o735n942j983q094J3944q069R304J4241l2746P372K1210j4123l0670
5409b4193N076K3989m885j6521Q522K3089K2502J0819p231j6321p256j5493q070
5396e973J4142K25k718J1502k2915o5162L959K8550J2419K1854P20K738O230n895
5382c24j6127k1952m371q085p899M5986j2587k0174o002K310R831L1920P350n835
5368e959J4233K5212j5220K925j6780l1843K450K7139K306K1222L4181k5731J0289
5355D4424j0651p051j7844j0689k6479m4312m36P173M0800K1729K7856J2901o321
5342C1100k068q065p372n887l4930K2701O421o274K8138j1602j0710J6239K032
5329A9723j7052O098M202K3889J5500j6098j5905m986k992k9897L82o209p050
$$ plain form
5422 18098 11363 5421 3438 -4656 9288 1219 10523 24764 -7982 -610 20600 6477 -24193
5409 -24193 -19117 4872 -13 -16534 -8012 15077 37579 48398 41167 24846 17590 2097 -5973
5396 -5973 8169 8394 5676 17178 -5737 -70899 -66940 -38390 -25971 -4117 -3397 -659 5571 -324
5382 -324 -16451 -38403 -42774 -50859 -58758 -12772 -25359 -45533 -51535 -49225 -39394 -7474 -124 -5959
5368 -5959 8274 33486 18266 21191 4411 -27432 -24982 2157 4463 25685 59866 34135 44424
5355 44424 33773 26722 8878 -1811 -28290 -72602 -73038 -65865 -25065 -3336 24520 37421 31100
5342 31100 29032 20967 13595 7708 -27222 -4521 1900 -4374 23764 12162 1452 17691 19723
5329 19723 2671 8769 12971 36860 52360 36262 20357 15371 12379 -17518 -17136 -23345 -30395
5316c0395L396m674O759m274p530L6026P852J6325Q590r280j923J4320k5428j4374
5302d610j026j1629J3915J6574J0651k5567N930O833o015J5444k4447q941j4503
5289b7391k3953M393K8861m158m845J2321J2585n303k372K0604k1413J8959Q242
5276A6530J4972j4889L583J2512j2321j2142n437J4961N843j3839j0987k674n106
5263h994K8904R201q020J5107j796j1091j4633j7258J564j2213j6027j0211K6608
5250a8859j855j989J6171K3962M1666j2955k5311m066Q124j906k4691M771j2257
5237i195k0314K6470L5087j8435j0820R768K3480o938N568o467j5572M709L1046
5224D8387P773k4127j5960K1578L3736r570l2564J5020j0319k7521j5582m00K6645
$$ plain form
5316 -30395 -26999 -31673 -24914 -29188 -36718 -692 7160 23485 32075 22795 20872 35192 9764 -4610
5302 -4610 -5636 -17265 -3350 13224 23875 -1692 4238 11071 5056 20500 -3947 -12888 -27391
5289 -27391 -51344 -46951 -18090 -22248 -27093 -14772 -2187 -7490 -9862 10742 -10671 8288 16530
5276 16530 31502 16613 20196 32708 20387 8245 2808 17769 23612 9773 -1214 -3888 -8994
5263 -8994 19910 29111 21091 36198 34402 23311 8678 -8580 -7016 -19229 -35256 -45467 -18859
5250 -18859 -20714 -22703 -6532 17430 59096 46141 20830 16764 24888 22982 -1709 3062 -9195
5237 -9195 -29509 -3039 32048 13613 2793 12561 36041 29103 34671 28204 12632 17341 48387
5224 48387 56160 32033 16073 37651 71387 61817 29253 44273 33954 6433 -9149 -9549 17096
5211A7096k7440m2606K582K1536O750q581K8492k3356j490J6225O773J9611k1509
5198e917k5094m29L4355P769k0518n920R610K697L789L4153P533k7557q608P573
5184A3436n912j8503q398r76L8441j262l1638k1740k237K38k2133k3768j9474
5171a03926o047J7698N2883K1130O131K3603J1727j7102j3167K471J9098k2010
5159g511k8311O745l34k3333r978j8613K833K4275J7577K4035l970k2254o123
5146d4962K8279K3057k0772j4237L0317K2182N689k454q311j0961m905O173k0747
5133a1652o192j6233m581J0525J4767L3523J1132j0101Q720j3190j8859O21j7701
5120a9221r84o624L782n788M927K5484L0675P364q205l2294m541J2680p825j5602
$$ plain form
5211 17096 -10344 -52950 -50368 -28832 -22082 -30663 -2171 -25527 -27017 -10792 -4019 15592 -5917
5198 -5917 -31011 -31440 2915 10684 -9834 -15754 -6144 -3447 342 34495 42028 14471 5863 13436
5184 13436 7524 -10979 -19377 -20353 18088 16826 -14812 -36552 -38789 -38551 -60684 -84452 -103926
5171 -103926 -109973 -92275 -39392 -18262 -12131 11472 23199 6097 -7070 -4599 14499 -7511
5159 -7511 -35822 -29077 -29411 -52744 -62722 -81335 -78502 -54227 -36650 -12615 -16585 -38839 -44962
5146 -44962 -16683 6374 -14398 -28635 1682 23864 29553 27099 18788 7827 2922 9095 -11652
5133 -11652 -17844 -34077 -38658 -28133 -13366 20157 31289 21188 29908 16718 -2141 -1520 -19221
5120 -19221 -20205 -26829 -23047 -28835 -23908 1576 32251 39615 31410 -884 -5425 7255 -570 -16172
5106a6172o123L62M780k145N057j554j1984k709m501K8076J311M0359K191K4360
5092F1308R44m2045k5958Q31L2752j0569m8327J1525j4815J3722K5613j458j0973
5079g450M515J3925N650O083j5197m505K487j587K0583K2713J0868j8086j8344
5066B1655J0510r384j8351P170J5300j9489j0722m674J5870o225J7482L538l3335
5053a0655n30J1137p31j3248J0112r189K1503j5820j4030k3510J6970j0319m0216
5040g8526L5010L3192K2383J0921J7873k5793k8059k2991J786o576J8955J3571
5028h254j4705m633J5097L3908j6350M566K0934k2535j9658p993K1903J0173K772
5015A5225N226K2329j3788o114r12J456r35j1807k0781l6251l2365R697K3687
$$ plain form
5106 -16172 -22295 -21933 -17153 -19298 -14241 -15795 -27779 -30488 -34989 -6913 -5602 34757 36948 61308
5092 61308 62252 20207 -5751 -4920 27832 17263 -31064 -19539 -34354 -20632 4981 3523 -7450
5079 -7450 -2935 10990 16640 22723 7526 3021 5508 3921 24504 47217 58085 39999 21655
5066 21655 32165 22781 4430 11600 26900 7411 -3311 -7985 7885 1660 19142 22680 -10655
5053 -10655 -11185 -48 -779 -14027 -3915 -13104 8399 -7421 -21451 -44961 -27991 -38310 -78526
5040 -78526 -43516 -10324 12059 22980 40853 15060 -12999 -35990 -34204 -40780 -21825 -8254
5028 -8254 -22959 -27592 -12495 21413 5063 9629 30563 8028 -11630 -19623 2280 12453 15225
5015 15225 20451 42780 28992 22878 21966 23422 22487 10680 -10101 -46352 -78717 -69020 -45333
5002d5333J7184J7713o242p812N825L2232r15l890k2450k4141J2328M0353R530
4989B4382j1783J5264K178Q559r631k3320k1057o248L201K7627N582N006o327
4976A3433k9727P935J4908K3062L1506l8260k9531O959l620j9951j1748O129r77
4963b9882K3071J866o275n479L1645J0764k1264m0071N842j4911K3518l767k9168
4950e4111L907K9238o139K9960R210K328k733j4393j7435J5993P406N596M918
4937A3745k6513O340J2052Q089P854j2053J345J854Q627q779j3907k0657j0468
4924c2471J0892j2381m171J4229L8992k3j9711k3228p264k347K0900K5180K4088
4911C2685K9875k6025j8035k0892j2792L3586J7170k2638k1213j0143M824L0189
$$ plain form
5002 -45333 -28149 -10436 -16678 -24490 -18665 13567 12652 8762 -13688 -37829 -25501 14852 24382
4989 24382 12599 27863 30041 38600 28969 5649 -15408 -21656 -18455 9172 14754 19760 13433
4976 13433 -16294 -8359 6549 29611 61117 22857 -6674 285 -3335 -23286 -35034 -28905 -29882
4963 -29882 -6811 -4945 -11220 -16699 14946 25710 4446 -35625 -29783 -44694 -21176 -24943 -54111
4950 -54111 -50204 -20966 -27105 2855 12065 14393 11660 -2733 -20168 -4175 3231 8827 13745
4937 13745 -12768 -6428 5624 13713 21567 9514 10859 12713 21340 12561 -1346 -22003 -32471
4924 -32471 -21579 -33960 -38131 -23902 15090 15067 -4644 -27872 -35136 -37483 -16583 8597 32685
4911 32685 62560 36535 18500 -2392 -15184 18402 35572 12934 -8279 -18422 -13598 16591
4899A6591k403k7540L1765J7548j2567j2554L038J7497Q596k3845l1364j0789
4887b6027O656J919P126Q969K1747K3000l673p892k8850l891j0649j2750j3147
4874c7462j740K0262L0380L699K5155k3598k7961r577q114k9386p348L4837L8831
4861G978K0291n324k7225j8292J3959P49j111M950j5699k5648J6275J9988L986
4848e123J472p047J2307n134j7565n474O619L6509J3038l4549K352J4742k171
4835I976O094R977l3076j4153M7331K6627j3386k2192m3416K2091M2175K184j0885
4822B9347k923j1430j8967j5125J2288M333k856m509J7226m991K4174r006k4017
4809f456K206N752R84K576k3863k1638k421l54J3884J6133k5592J3759Q882k7560
$$ plain form
4899 16591 14188 -13352 18413 35961 23394 10840 13878 31375 39971 16126 -15238 -26027
4887 -26027 -19371 -17452 -10326 -1357 20390 43390 39717 31825 2975 -916 -11565 -24315 -37462
4874 -37462 -39202 -18940 11440 15139 40294 16696 -11265 -20842 -28956 -58342 -65690 -30853 7978
4861 7978 28269 22945 -4280 -22572 -8613 -7864 -8975 -4025 -19724 -45372 -29097 -9109 -5123
4848 -5123 -3651 -10698 1609 -3525 -21090 -26564 -19945 16564 29602 -4947 -2595 12147 9976
4835 9976 16070 26047 -7029 -21182 26149 52776 39390 17198 -26218 -4127 38048 40232 29347
4822 29347 26424 14994 -3973 -19098 -6810 -2477 -5333 -9842 7384 2393 26567 17561 -6456
4809 -6456 -4250 1502 2486 5062 -18801 -40439 -42860 -43214 -29330 -13197 -38789 -25030 -16148 -43708
4795d3708L367L2433P187K048j5297J314j5746q856R787J2318K333K4945J7157
4782B9282K0140J1663j2072k9673j7048j7370o961o54k5729k6849K7928M9749
4770B406j9555j8544k306r977L595l158O171L4k4326K8705K4836Q64P005J7250
4756A3000O873j5174r382J2028p757j0145L975M19K1571L3143k3939k5164l756
4743d308j614q110j3886J4073Q496J8368k0028j5383j6809K467K6767J9195O320
4730A5548l6910P207O545j4475k7500r451J4120P443O326M299N738K6571K2529
4717B7990K8739k6784j7421K403k5198j4752j781O562k5144K536K3297j2132J2334
4704a9351K1668J7359m854J3122l271l7874k2418P243K2754n924j0757l67J8797
$$ plain form
4795 -43708 -40341 -7908 -721 1327 -13970 -12656 -28402 -37258 -27471 -15153 -12820 12125 29282
4782 29282 49422 61085 49013 19340 2292 -15078 -22039 -22693 -48422 -75271 -47343 2406
4770 2406 -17149 -35693 -37999 -47976 -44381 -47539 -41368 -41334 -65660 -36955 -12119 -11255 -4250 13000
4756 13000 19873 4699 -4683 7345 -412 -10557 -6582 -6163 15408 48551 24612 -552 -4308
4743 -4308 -5922 -14032 -27918 -13845 -5349 13019 -7009 -22392 -39201 -36734 -9967 9228 15548
4730 15548 -21362 -14155 -7610 -22085 -49585 -59036 -44916 -37473 -31147 -26848 -21110 5461 27990
4717 27990 56729 29945 12524 14927 -10271 -25023 -26804 -20242 -45386 -42850 -19553 -31685 -19351
4704 -19351 2317 19676 14822 27944 24673 -13201 -35619 -28376 -5622 -11546 -22303 -22670 -3873
4691c873J899R949K704p136P775O1M405j6856k5187j5286J7094J7341K0723J0229
4677B3842k9130K1827J6629j2344k9981J9615J4963l951l2222J4979k480r279
4665g532j9946K5663j5690j2700j1541K820J3931j8326k6263K1872J8994O123
4653b2595j697r466J6130J3917J30K843K9088j131j575j8037k8850k637J117J9559
4639c204m178o549K4804M219J7392J3326n423k135j9435j4630j0450o319K7095
4626A4513Q164k7122j7234M3963J9619j3645m365j0573P99j210M64j9567k598
4613h792J8733n958k6489j0334j1630J7319R528M701M449p254L0702j3446k320
4600g91J4158j1373k219k0174P594j5701J136J6290m182N42q540K561J1941R431
$$ plain form
4691 -3873 -1974 7975 10679 3543 11318 11379 15784 -1072 -26259 -41545 -24451 -7110 13613 23842
4677 23842 -5288 16539 33168 20824 -9157 10458 25421 21470 -10752 4227 1747 -7532
4665 -7532 -27478 -1815 -17505 -30205 -41746 -38926 -24995 -43321 -69584 -47712 -28718 -22595
4653 -22595 -24292 -33758 -17628 -3711 -3581 -738 28350 27219 25644 7607 -21243 -23880 -22763 -3204
4639 -3204 -7382 -13931 10873 15092 32484 45810 40387 38252 18817 4187 -6263 -12582 14513
4626 14513 22677 -4445 -21679 22284 41903 28258 23893 13320 14119 12909 13373 -6194 -8792
4613 -8792 9941 3983 -22506 -32840 -44470 -27151 -17623 -12922 -8473 -15727 14975 1529 -791
4600 -791 13367 1994 -225 -20399 -12805 -28506 -27370 -11080 -15262 -14720 -23260 -20699 -8758 673
4586F73P028l1379n361N804L3635J0134j9938k0412m084K5887R097J3538p672
4573A6950k6427J3426K3057R169J0430J4490j8462q899k5664m4296k0437L8895
4561a7768K5991J1659J0980N05r03k4370k9790m0379K1403K3255J6533J9700l732
4548A3084k9611j9535j5346J480J6782L3128R986J8146n014k150L82l2345J2692
4535A679l906k739j4181J7496J0677j1945J7397O109k6343J31j8483j9133J1942
4522c1299K5773L0468l9126j8194K0553N989L403K7961J8089l299L46j2824M188
4509C2028r973Q233K6597M188j5732j4035k247p651j4933o977Q080j3107K302
4496c227J1969j429R538m226n905K8542M941j2421j7440L1217R850j581j6908
$$ plain form
4586 673 7701 -23678 -29039 -23235 10400 20534 596 -19816 -23900 1987 11084 24622 16950
4573 16950 -9477 3949 27006 36175 46605 61095 42633 33734 8070 -36226 -56663 -17768
4561 -17768 8223 19882 30862 31367 30464 6094 -23696 -64075 -42672 -19417 -2884 16816 13084
4548 13084 -16527 -36062 -51408 -49928 -33146 -18 9968 28114 23100 20950 21332 -11013 1679
4535 1679 -2227 -4966 -19147 -1651 9026 -2919 14478 20587 -5756 -5625 -24108 -43241 -31299
4522 -31299 -5526 24942 -14184 -32378 -11825 -5836 -2433 25528 43617 40318 40664 27840 32028
4509 32028 22055 30288 56885 61073 45341 31306 29059 21408 6475 -502 7578 -5529 -3227
4496 -3227 8742 7313 16851 12625 6720 35262 40203 27782 10342 41559 51409 49828 32920
4483C2920o983K135j0594P101K8386l087j9765l0295m853K152k9770m437M0376
4470C286K6770k2798r163l20L662k417m78K2825j9948m123K4538J5571k5029m6576
4456c4200J6717L2600J8642k1784j8587J3803k1478j4936M746K6408q083k882
4444i034K4668l681p1K459j9641K4254M2560p970l1002l9768l3893k6223K7101
4431e0241k86J7401j326K509R21J599p71Q747P850n020M212K9425k0887l187M539
4416d515L4240P802L989k9910r571j6269j4601J9856M0834L2497k8329n1931K9009
4403A3101J0635j3218J1263M561p649k9774j3170K2732o296j115m19K083J2592
4390E326L3093M630j1980j1148k8854l0654R297O843M1444R294O121J3084j0766
$$ plain form
4483 32920 25937 28072 17478 24579 52965 49878 30113 -182 -5035 -2883 -32653 -37090 3286
4470 3286 30056 7258 -1905 -2225 1437 -980 -1458 21367 1419 -2704 21834 37405 12376 -34200
4456 -34200 -17483 15117 33759 11975 -6612 7191 -14287 -29223 -24477 1931 -6152 -9034
4444 -9034 15634 11953 11882 14341 -5300 18954 61514 53544 22542 -17226 -51119 -77342 -50241
4431 -50241 -50527 -33126 -34452 -31943 -31022 -29423 -30194 -21447 -13597 -18617 -14405 15020 -5867 -9054 -4515
4416 -4515 29725 37527 41516 11606 2035 -14234 -28835 -8979 31855 64352 36023 -15908 13101
4403 13101 23736 10518 21781 26342 18693 -11081 -24251 -1519 -7815 -8930 -9349 -7266 5326
4390 5326 38419 43049 31069 19921 -8933 -39587 -30290 -23447 17997 27291 33412 46496 35730
4377C5730k5296k0838j0479Q260K9391K408j215J2841j6921j191J326p199K638
4364I455K1454J9287Q922q66l3585r578L2734Q407j0793k0462j702j4939l8600
4351c0266j0875J8122R165J1337K401k62J8743n00J2682p734l6532q898P532K9768
4337A4683M1j0232q247K2127J8389J5907J0467j4534J9275n268J3420j6508n4574
4324D946k4642R363P744j1223j6687K1131Q443J360M157J532n367m1070k0172
4311f0485m943K5556K8544k484K4359L6440J4603J8162n817p007m3610p459j5789
4298G0j1844L197K0202O960j2193J532k3390J9398K5775j8536n545J9159k1081
4285C704m830Q61m616J8890K8397j2580m829m5818L012K2133j52j8520N629n79
$$ plain form
4377 35730 10434 -10404 -20883 -12623 16768 19176 17961 30802 13881 12690 14016 6817 9455
4364 9455 30909 50196 59118 58252 24667 15089 47823 56230 45437 24975 23273 8334 -30266
4351 -30266 -41141 -23019 -13854 -2517 -116 -378 18365 17865 30547 22813 -13719 -22617 -15085 14683
4337 14683 14724 4492 -3755 18372 36761 52668 63135 48601 67876 62608 76028 59520 4946
4324 4946 -19696 -10333 -2589 -13812 -30499 -9368 -925 435 4592 6124 757 -40313 -60485
4311 -60485 -65428 -39872 -11328 -13812 10547 46987 61590 79752 73935 66928 23318 15859 70
4298 70 -11774 -8577 11625 18585 6392 7924 -15466 3932 29707 11171 5626 24785 3704
4285 3704 -1126 -265 -4881 14009 42406 29826 24997 -20821 -17809 4324 4172 -14348 -8719 -9298
4271i298k0762k8111p974J2401L2409K6397J0270j2376J9964R048l6288j2010
4259a6330K4614J6245N110l8563p19M0381J174l1435k4539l812J0741j2529k895
4246c2557K914J5954P271J517N082K6722j3472r757l0108P590r549J5131N759
4233g503R47L1952j9742j9288J3310K7279J6561k3836k0050o442l89M044o2306
4220f5463J025N4345K6685J6788k7677j5813o957K1296J3443L183M570o893P205
4207B5737M073p19j5515o74Q339Q442J4659k4482L8483K0343l4936k3643m5095
4194b4988Q709P022K1511J3870Q228J61m1984n132j059K0099K7152j2414J6056
4181C7231J5185j4271M429k832k1932N086J8391q764l7071j077K443q939J3144
$$ plain form
4271 -9298 -30060 -58171 -66145 -53744 -21335 5062 15332 2956 22920 31968 -4320 -16330
4259 -16330 8284 24529 29639 -8924 -9643 30738 31912 477 -24062 -27874 -17133 -29662 -32557
4246 -32557 -29643 -13689 -6418 -4901 181 26903 13431 3674 -26434 -18844 -28393 -13262 -7503
4233 -7503 -6556 25396 5654 -13634 -324 26955 43516 19680 -370 -6812 -7201 -3157 -65463
4220 -65463 -64438 -10093 16592 33380 5703 -10110 -17067 4229 17672 20855 25425 18532 25737
4207 25737 29810 29091 13576 12902 21241 29683 44342 19860 58343 78686 43750 20107 -24988
4194 -24988 -16279 -9257 12254 26124 34352 34513 -7471 -12603 -13662 6437 33589 21175 37231
4181 37231 52416 38145 42574 39742 17810 22896 41287 32523 -4548 -5625 -3182 -12121 1023
4168A023J1570K497L1276K2844k5044j4350l3211j1075n54J4995q392j4465l2930
4155e5816N174K9068j6395l23K0840J3837j3247m07J3915N236j4427M430O770
4142a345M017Q506L6402N668k078j7570k2735N280l036L131k3143N05M645o216
4128g969K3529p738j1052m2341J83M0822K6368k4022k6291l251K9127J2301j0435
4115g69r541J0283O960o299J8604k525k3752n200q316J6456j5243k1935K4692
4102a6585K3927J5831K905K2741j0963j5758m1629O064K5067N29J7363j3183q983
4089G326L2986m844k6124l2654q647K456J0707j2937J1845J5120M456j2475l779
4076a6564J4456k5064K111m99J5880M940j818L5257J7820K0226j9883j8334o258
$$ plain form
4168 1023 12593 15090 46366 69210 44166 29816 -3395 -14470 -15024 -29 -8421 -22886 -55816
4155 -55816 -50642 -21574 -37969 -38292 -17452 -3615 -16862 -17269 -3354 1882 -12545 -8115 -1345
4142 -1345 2672 11178 47580 53248 51170 33600 10865 16145 13109 16240 -6903 -6398 -1753 -7969
4128 -7969 15560 7822 -3230 -45571 -45388 -4566 21802 -2220 -28511 -31762 -2635 9666 -769
4115 -769 -10310 -27 6933 634 19238 16713 -7039 -12239 -20555 -4099 -19342 -41277 -16585
4102 -16585 7342 23173 26078 48819 37856 22098 -19531 -13467 11600 12129 29492 16309 7326
4089 7326 40312 35468 9344 -23310 -31957 -29501 -18794 -31731 -19886 -4766 -310 -12785 -16564
4076 -16564 -2108 -27172 -25061 -25560 -9680 -4740 -6558 28699 46519 66745 46862 28528 22270
4063B2270K6430k171k9725o120J3111K2322k504j0417k050j1701m0878j6761Q934
4050b9260l418J0452n860J1387Q639K2761K3564k9470l688j997j1233J6088J6140
4037B4105k2553n290J1235q170M008K0280k1118k0258J638k1395m455j838K349
4024d1462N78l592k56O318J9449K9350R13n858p182k8053r48n661j3941K4956
4010b5389K871J621K3357J5115j7965j2311l6305J7574K0726K1265j5920j0550
3998a5911K8037J0192j6425K8993K9227j0932l9015k5039J348K2904m592k0614
3986a1827o897J9723K030L40O678K6762k398l6106k205L606j1469j8271K7990
3973b044J7990j9858Q233j4341l5863L450k14K2914L422l4686m864J9682J0299
$$ plain form
4063 22270 48700 46529 16804 10684 23795 46117 43613 33196 31146 19445 -21433 -38194 -29260
4050 -29260 -32678 -22226 -28086 -16699 -8060 14701 38265 8795 5107 3110 -8123 7965 24105
4037 24105 1552 -3738 7497 -673 3335 23615 2497 -17761 -16123 -37518 -41973 -43811 -41462
4024 -41462 -40884 -44476 -44732 -38414 -18965 10385 11298 5440 -1742 -29795 -30743 -36404 -50345 -25389
4010 -25389 -22518 -20897 2460 17575 -390 -12701 -49006 -31432 -10706 10559 -5361 -15911
3998 -15911 12126 22318 5893 34886 64113 53181 14166 -10873 -9525 13379 8787 -11827
3986 -11827 -18724 999 3029 3369 10047 36809 34411 -1695 -3900 -294 -11763 -30034 -2044
3973 -2044 15946 -3912 4321 -10020 -45883 -42433 -42647 -19733 -16311 -50997 -55861 -36179 -25880
3960b5880J5514k0494j1180j5080P610L41j8196J3652K2851N715p928j301j2006
3947d6382K0884M2360j228l6686j2931K3408p84N100P43J4944j5811j8740j4728
3934c9851J0691K8861L4327k371l1872l746J129l0575j376J310M818K5911K8646
3921B5902L9109j6874l5380r837L46O202j9609K2201R67q685L5583n497k2266
3908A2162m129J1828l2172j0434J574j831K1692Q070j3858n839l2K823J710O79
3894g757j0857J3079L5091m233n898k367L798J3374J4830Q90j23j290j3503j557
3880C3477r937J7000J2648k0472q966k1481m417m289J5839J2193J3662j3536l5517
3867a3796k1339j3623J4972J7213L649j2442o573N724K0405L5554J9841j9005
$$ plain form
3960 -25880 -10366 -30860 -42040 -57120 -49510 -49169 -67365 -53713 -30862 -25147 -33075 -34376 -46382
3947 -46382 -25498 16862 15634 -21052 -33983 -10575 -11359 -6259 -5516 9428 -6383 -25123 -39851
3934 -39851 -29160 -299 34028 31657 -215 -3961 -2832 -33407 -34783 -33473 -28655 -2744 25902
3921 25902 65011 48137 12757 2920 3266 9468 -10141 12060 13027 4342 39925 34428 12162
3908 12162 8033 19861 -12311 -22745 -21171 -23002 -1310 6760 -7098 -12937 -12969 -10146 -8436 -7757
3894 -7757 -18614 -5535 29556 25323 19425 17058 20856 34230 49060 49950 49827 48537 35034 33477
3880 33477 23540 40540 53188 32716 23750 2269 -2148 -6437 9402 21595 35257 21721 -13796
3867 -13796 -35135 -48758 -33786 -16573 -12924 -25366 -31939 -26215 -5810 29744 49585 30580
3855C0580m68o535r5J8462k7392k6130K111M884q598r944L5075R406l0015k1264
3841b9923l357J2358Q782O110K4219J5909j29k0841J0099J0075K0029J9762J31
3828G3224k5776k3814K3813j6320r935L555m049j3543j8044K982O651Q777j5443
3815g922k6797J4364K778K3937J4084o342j37k1225j910J5772J0451J2624K9392
3802E9069o874l5884j2142J7020N072k9867J0277J4709m071O471j6482N369j0337
3789B330L0050K4054m4460l1359M1598r045j8808J9582j6282m3655o716L1781
3777b0930q72k0513P995Q847J0972J0804p909m256l408K4601L9639J1676N180
3764F1826j1932j5494k0959j5281J631j1536l2085n015K7249J5825q26q648P954
$$ plain form
3855 30580 30112 23577 23482 41944 14552 -11578 -9467 -4583 -13181 -23125 11950 21356 -8659 -29923
3841 -29923 -33280 -20922 -12140 -6030 18189 34098 33969 13128 23227 33302 53331 73093 73224
3828 73224 47448 23634 47447 31127 21192 24747 20698 7155 -10889 -7907 -1256 7521 -7922
3815 -7922 -34719 -20355 -17577 6360 20444 14102 13965 -7260 -9170 6602 17053 29677 59069
3802 59069 52195 16311 4169 21189 26261 -3606 6671 21380 17309 23780 7298 12667 2330
3789 2330 32380 56434 11974 -19385 22213 13168 -5640 13942 -2340 -45995 -52711 -20930
3777 -20930 -21802 -42315 -34320 -25473 -14501 -3697 -11606 -15862 -19270 5331 44970 56646 61826
3764 61826 49894 34400 13441 -1840 -209 -11745 -43830 -48845 -21596 -5771 -6597 -15245 -7291
3751g291K8003J229j2200m367J1177J555l3109n109l6389J8159k779p006K3406
3738b4721K9465K2312k5370j5844Q017j1972J6642l556j7497k2498l815k990l2037
3725h3864J5636J5801j4039J2615j957R74J7281l339K3545l947l335Q343L3107
3712A6821j7641n4701j1639M531J5880J5467J3759M214N042J0953Q394N022r997
3699F105o719l325l2246k3264j8703o624K5696K6232J1540M2363q818p816M430
3686H851K558k7550j492l474J7778N0180J8819k9055k3573Q824J0661l896k2130
3673F501J2495N6358k153l2098L152k0029k8001j2969J5544J701k3516J1869M6634
3660C5488j6514l34J2872j8043j4605l733k0222J6023N31j1445k4877K690J9444
$$ plain form
3751 -7291 20712 21941 9741 5374 16551 18106 -15003 -20112 -56501 -38342 -41121 -48127 -24721
3738 -24721 4744 27056 1686 -14158 -6141 -18113 -1471 -5027 -22524 -45022 -48837 -51827 -83864
3725 -83864 -68228 -52427 -66466 -53851 -55808 -54834 -37553 -40892 -17347 -21294 -24629 -16286 16821
3712 16821 -820 -55521 -67160 -62629 -46749 -31282 -17523 -13309 -8267 2686 11080 16102 6105
3699 6105 -614 -3939 -36185 -59449 -78152 -84776 -59080 -32848 -21308 21055 12237 4421 8851
3686 8851 11409 -16141 -17633 -21107 -3329 46851 65670 36615 13042 21866 32527 28631 6501
3673 6501 18996 75354 73201 41103 44255 24226 -3775 -16744 -1200 501 -23015 -11146 35488
3660 35488 18974 18640 31512 13469 -1136 -4869 -25091 -9068 -8537 -19982 -44859 -42169 -22725
3647b2725J2466J8442K7174m2197k2304P844j272J1543K7533K6044J6149J0904
3635F9601l9075m9396o500L6477K137k694o385M195Q316n469j6334J2297J2128
3622A9298r334O3K2918j9133J6287J3402n756k3637k8445j3854K9699k099k0987
3609b1578R55j11P36K791l260J8753j2786Q582r31L1531K2199k0724n18j4478
3595A1161m016J4209P60J51K458l838J3963j832j0963l8232r462j0502k1160n18
3581e7821K841J9J8823M6412k3270m257K1269J7769N209j2870j9124J0538j6278
3568a0740K246m570J9200o008n453P906r102j187J6717o559M296J9319J231k9160
3554a864K164J2603k526J6443O063K4213Q94o231m612j9386j7532r86j9617J755
$$ plain form
3647 -22725 -10259 8183 35357 -6840 -29144 -21300 -22572 -11029 16504 42548 58697 69601
3635 69601 30526 -18870 -25370 11107 13244 10550 4165 8360 16676 11207 -5127 7170 19298
3622 19298 9964 10027 32945 13812 30099 43501 37745 14108 -14337 -28191 1508 -591 -21578
3609 -21578 -20623 -20734 -19998 -17207 -20467 -1714 -14500 -5918 -6849 24682 46881 26157 25639 11161
3595 11161 7145 21354 22114 22265 24723 20885 34848 33016 22053 -16179 -25641 -36143 -57303 -57821
3581 -57821 -54980 -54961 -36138 10274 -12996 -17253 4016 21785 26994 14124 -5000 5538 -10740
3568 -10740 -8494 -13064 6136 128 -5325 2581 -6521 -7708 9009 2450 6746 26065 27296 -1864
3554 -1864 300 12903 10377 26820 32883 57096 57990 51759 47147 27761 10229 9243 -10374 -8619
3540h619L2883J7925q896o707k2379l91J488N884J3166J6042O413j3608J2028
3527D5229R02k4037k4836k1345k10K2829M789j8353l257r712o508J0395J2003
3514a2111n371k6919M004J5082Q631L3713O988K2503k312k2320K2331m437j3808
3501B5974O627L815l0707l4587l034k0957J4914K6197j072L6565j3272k3996K384
3488a1149J9931N054K672j0649r761n630j7574J9976L7190q142j2660k4575L392
3475a1925K091l688L615J7331K377n49Q366p089j490J020j7964j3657j8911J4546
3461b5927O584L574r164K2860M4029L4032M180l705r132K826m1994k8802j9016
3448a9655J7233m362k9647k9971K0239J4379L1019K0462l301J9145Q117K6984
$$ plain form
3540 -8619 24264 42189 33293 26586 4207 3816 5304 11188 24354 40396 46809 33201 45229
3527 45229 46131 22094 -2742 -24087 -24297 -1468 3321 -15032 -18289 -28001 -34509 -24114 -12111
3514 -12111 -17482 -44401 -40397 -25315 -16684 17029 24017 46520 44208 21888 44219 39782 25974
3501 25974 32601 36416 5709 -28878 -31912 -52869 -37955 -11758 -12830 23735 10463 -13533 -11149
3488 -11149 8782 13836 16508 5859 -3902 -9532 -27106 -7130 30060 21918 9258 -15317 -11925
3475 -11925 -9834 -13522 -9907 7424 9801 9252 17618 10529 9039 10059 -7905 -21562 -40473 -25927
3461 -25927 -19343 -15769 -24933 -2073 41956 75988 80168 76463 67331 70157 28163 -639 -19655
3448 -19655 -2422 -6784 -36431 -66402 -46163 -31784 -765 19697 16396 35541 43658 70642
3436G0642j9475k5183k4046m1214p893K3107J7095n928P882J410J5252J5364k2350
3423D663m051K7927L8090p352m3215m1092j0353J39p236J8358o952J8766Q330
3410c978q082j9195K0152J193O187J3319K0286R399j8871k301K7113K8825j5509
3397E8538n1443l0526l5711k4955K8149N3409L4475Q815Q368j4934q392k621J4802
3384C7974n925j3742J0079M75l5812J4603r639n5593n756K0893J7533L956k5237
3371d6191K0256M1246n86l1281p678j1493J033L4018j7956m089L290J1413J60
3358g858P608n423k2473P183J8984k364j5149L830L2496J4626k5476j510J0482
3345A4956o827l2463j9916J0069M2887j7822Q129L013r718K2391J4912n369p338
$$ plain form
3436 70642 51167 25984 1938 -39276 -47169 -24062 -6967 -12895 -5013 -3603 11649 27013 4663
3423 4663 612 28539 66629 59277 16062 -25030 -35383 -35244 -42480 -24122 -31074 -12308 -3978
3410 -3978 -12060 -31255 -11103 -9910 -3723 9596 29882 39281 20410 18109 45222 74047 58538
3397 58538 7095 -23431 -59142 -84097 -55948 -2539 31936 40751 49119 34185 25793 23172 37974
3384 37974 32049 18307 28386 28861 -6951 7652 -1987 -57580 -63336 -42443 -24910 -20954 -46191
3371 -46191 -25935 15311 14725 -16556 -24234 -35727 -34694 -676 -18632 -22721 -19431 -8018 -7858
3358 -7858 -250 -5673 -28146 -20963 -1979 -4343 -19492 -15662 16834 31460 5984 4474 14956
3345 14956 8129 -24334 -44250 -34181 8706 -9116 -987 2026 -7692 14699 29611 24242 16904
3332A6904j523k4560j7874k9485p050J591K946K9193K5675K4568j972j1258Q36
3319G991J8817n555j0503k8658q662K9320L8377J9000k7679j5946q962M62J5489
3306B3491k1403n467n283q9J5064J6607K1078k7633k6406P806o032J5969K9474
3293C7176k1088l2318K6361M2032J1451l2617l7010Q285K6224R580k1643l0004
3281a3571j6567P949L9884j170k8562l0238J8553M0005K6763l783j1402k5487
3269B374j3832M266K4005q273j3932P811J1059k2348j4314j1026J811P748J3206
3256a1445k471n813l4775j4785J2251K9663K9979J8983m436l5968j9746O945O696
3243b4922K3114L5240q954k6603J1554L772J2355n13k1544l140R705J1425k1858
$$ plain form
3332 16904 15381 -9179 -27053 -56538 -63588 -61997 -59051 -29858 -4183 20385 18413 7155 7991
3319 7991 26808 21253 10750 -17908 -26570 2750 41127 60127 32448 16502 7540 8002 23491
3306 23491 2088 -3379 -8662 -8751 6313 22920 43998 16365 -10041 -2235 -8267 7702 37176
3293 37176 16088 -16230 10131 52163 63614 30997 -6013 2272 28496 38076 16433 -13571
3281 -13571 -30138 -22189 17695 16525 -12037 -42275 -23722 16283 43046 39263 27861 2374
3269 2374 -11458 -7192 16813 8540 -5392 2419 13478 -8870 -23184 -34210 -32399 -24651 -11445
3256 -11445 -13916 -19729 -54504 -69289 -57038 -27375 2604 21587 17151 -18817 -38563 -31618 -24922
3243 -24922 -1808 33432 24478 -2125 9429 13201 25556 25043 3499 359 10064 21489 -369
3230c69l515K623l156J0726O920J1972j2006q444J7388N358m875J053N8J393P225
3215C2351j272l4068J6727R38q85k0287J697L390q914R932j2168J0115K7115j7440
3201G231l504p202r795J3398J8466j7370j5126L091J7983n222k638k6567j1738
3188c8993Q878Q330k790J1722N5477r338J1007j5466r664L470L5130k079k333
3175E3351l3861j8740k1463k515K9949P816k161R237J0491j4435P83J3821l4714
3162b441j4243M733j2428J4675M0080p864k9222M984J0428M2961p946k4277J399
3149B0839P223p736k7985l000n975k2315L063l332j6947J7207K9667K944m385
3136a0732P097M105J3064l1257J9453O099j0214K0274K579j3798P171K6024M947
$$ plain form
3230 -369 -3884 -1261 -4417 6309 13229 25201 13195 4751 22139 27497 22622 23675 23733 25126 32351
3215 32351 31079 -2989 13738 14676 13791 -6496 -4799 -1409 -10323 -391 -12559 -2444 24671 7231
3201 7231 3727 -3475 -13270 128 18594 1224 -13902 -10811 7172 1950 -688 -27255 -38993
3188 -38993 -30115 -21785 -24575 -12853 42624 33286 44293 28827 19163 22633 57763 55684 53351
3175 53351 19490 750 -20713 -23228 6721 14537 12376 21613 32104 17669 18452 32273 -2441
3162 -2441 -16684 -11951 -24379 -9704 30376 22512 -6710 -1726 8702 51663 43717 19440 20839
3149 20839 28062 20326 -7659 -10659 -16634 -38949 -35886 -39218 -56165 -38958 -9291 -6347 -10732
3136 -10732 -3635 470 13534 -17723 1730 7829 -2385 17889 20468 6670 13841 39865 44812
3123D4812l6456j1030R407J4383n382k6028o183l0153P254L4919J7224n23R575
3110B1819j6442k520k2010r574M333K0021R296M3637P983j3971j5450l2743l0512
3097c6133j3195K0430J3493j2767P731M990K0179M194J6577R503j3676k0194J3624
3084A4756j4699j3049K118K2320N966k602J3317J0713l0787k339K6670j7140l272
3071A1972L8059K9397j0255j9417j2494k8884l3866j7012L4966K6120L083n233
3059A6436k0627L807J2744J6257K473J3448L006j7786k1223j6383O585O81l9001
3046c9583k0166K7781J1199j6360Q221M9141J7892j0023n519J98J448n232j5329
3033C668l751k1018j9815M3564K3660L476k4K766J4485Q472N611J0575k6803m7155
$$ plain form
3123 44812 8356 -2674 6733 21116 15734 -10294 -16477 -46630 -39376 -4457 12767 12244 21819
3110 21819 5377 2857 -19153 -28727 -24394 -4373 4923 48560 56543 42572 27122 -5621 -36133
3097 -36133 -49328 -28898 -15405 -28172 -20441 -15451 4728 8922 25499 35002 21326 1132 14756
3084 14756 57 -12992 -10874 11446 17412 14810 28127 38840 8053 5714 32384 15244 11972
3071 11972 50031 79428 69173 49756 37262 8378 -25488 -42500 -7534 18586 21669 16436
3059 16436 -4191 -384 12360 28617 31090 44538 47544 29758 8535 -7848 -1263 -582 -39583
3046 -39583 -59749 -31968 -20769 -37129 -28908 20233 38125 28102 22583 22781 24229 18997 3668
3033 3668 -83 -21101 -40916 2648 26308 29784 29760 32526 47011 55483 61094 71669 44866 -2289
3019b289m0784J0525J3737n471J563L1103J7393j8382k0070n191J301j1895J103
3006b7357J6677J9780K6847l468m3387p857L9419R567J8706k259m427L191l6570
2993H862L851R798J2175j2765j0174j7724O64Q796r203r569k0763k303K7320L0387
2979A9352k458l0081J1999J2062Q445O457K843l266k4677k1000r274M457R696
2966a5445K6018J6925j1450O956M001k0808k6612L5743J9983P670j0746k5676
2954F559Q811j5238k448k61k0243k2706N753J0485L4703J2649R037k4381l1372
2941b8652j7750P94K9921K6593k216j4535J4413k6883j8889K8600J1284k438R347
2928I589r084J7854p310m049n631J1119k7187L660M9453L9649n927p626j9523
$$ plain form
3019 -2289 -43073 -32548 -18811 -24282 -22719 8384 25777 7395 -12675 -17866 -16565 -28460 -27357
3006 -27357 -10680 9100 35947 32479 -10908 -18765 20654 30221 48927 46668 42241 45432 8862
2993 8862 12713 22511 34686 21921 11747 -5977 -5313 3483 -5720 -15289 -36052 -38355 -11035 19352
2979 19352 16894 -13187 -1188 10874 19319 25776 28619 25353 676 -20324 -29598 -25141 -15445
2966 -15445 10573 27498 16048 23004 27005 6197 -20415 15328 35311 42981 32235 6559
2954 6559 15370 132 -2316 -2577 -22820 -45526 -39773 -29288 5415 18064 27101 2720 -28652
2941 -28652 -46402 -45608 -15687 10906 8690 -5845 8568 -18315 -37204 -8604 2680 242 9589
2928 9589 505 18359 11049 7000 1369 12488 -14699 -11039 38414 78063 72136 64510 44987
2915D4987m4028j2649O433k3515p633J3615p540J924Q108J2562J9934M2807K5612
2902H0617k0254j9904m684p614N797J2873m712J6261J3196k237q464k8507k2677
2889I691q88J1829K065j6925k6382j205J4611L3869j0230k1831K54J213j6529
2876b0458j4508r189J5235R730J4107o792j6629K527M1p674M692J3348J9316K3225
2862B6971J513N718j7311k8591n589J4450k881j7062J8600K027k989k0541m024
2849b9709J3241J5669J4034J7581L4370J5149j3662j9599P676k4959k0888m624
2837D279n249k4268J5067j2465P844K3998j307n862K2118R294l7829r252K21l637
2823a7048j3205p537J4658J7627J2750n549M953M2387J3819k7153j6568J3933
$$ plain form
2915 44987 959 -11690 -5257 -28772 -36405 -22790 -30330 -28406 -20298 -7736 12198 55005 80617
2902 80617 60363 40459 35775 28161 33958 46831 42119 58380 71576 69339 60875 32368 9691
2889 9691 8803 20632 22697 5772 -20610 -21815 -7204 26665 16435 -5396 -5142 -3929 -20458
2876 -20458 -34966 -44155 -28920 -19190 -5083 -11875 -28504 -25977 -25936 -33610 -28918 -15570 3746 26971
2862 26971 28484 34202 16891 -11700 -17289 -2839 -5720 -22782 -4182 -2155 -5144 -25685 -29709
2849 -29709 -16468 -799 13235 30816 65186 80335 66673 47074 54750 29791 8903 4279
2837 4279 -970 -25238 -10171 -22636 -14792 9206 7899 2037 24155 33449 -4380 -13632 -13411 -17048
2823 -17048 -30253 -37790 -23132 -5505 7245 1696 6649 49036 62855 35702 19134 33067
2811C3067p753j8485M720N758K474K7217j7749k944L957k5232j388L7110k1995
2798A8757m3831o006J3028M1848K0158J153j8361r341k0636q473P228J2763P483
2785A5770j1623j6354l864o380q907J0143N914J814K510K9071R044k8199k6793
2772b7854K451K2855k480O0O044J2878q884l2398R763K3021K0652R13J8819k0689
2758B5151m0301q046J1182p452k0451k9962j1646R756L8362J7512K212K980J9447
2745H744m466L088p265k1429k2891Q275J4146L439k6136r340j4131K1327L7368
2732i271L9171l16P159p018j5518k026j0191K8596Q639j5223R308j6769n333L5669
2718D6877k9193q674j8455j8360K0947k927l2136J7753K7072J1336m33K0104J7108
$$ plain form
2811 33067 25314 6829 11549 17307 19781 46998 29249 26305 30262 5030 3642 40752 18757
2798 18757 -25074 -31080 -18052 23796 43954 45107 26746 17405 -3231 -11704 -4476 8287 15770
2785 15770 4147 -12207 -16071 -22451 -31358 -21215 -15301 -13487 -10977 18094 27138 -1061 -27854
2772 -27854 -25403 -2548 -5028 -4968 1076 13954 5070 -27328 -17565 5456 26108 27021 45840 25151
2758 25151 -15150 -23196 -12014 -19466 -39917 -69879 -81525 -71769 -33407 -15895 -13683 -10703 8744
2745 8744 4278 7366 101 -21328 -44219 -35944 -21798 -18359 -44495 -53835 -67966 -46639 -9271
2732 -9271 29900 29584 36743 29725 14207 12181 1990 30586 39225 24002 33310 16541 11208 46877
2718 46877 17684 9010 -9445 -27805 -6858 -9785 -41921 -24168 2904 14240 13807 33911 51019
2705E1019j1747n357r382j840r062N799J1686k9074M636L0922K5384o971J138
2692E7151l2719j7986J083k8376o365J7276N069J6372j6770k8811m407J3437L0781
2679E735J2215l7058M02J6248J1822m568P535m3362k907N793J2653N749J3189
2666C446J7761K2737l1537j8009j385Q841j2655R129K0843j3336k1918J6425K9555
2653B9897k0842l4005J3560K3066N636k2833j5518l8079Q28L0522L1417K1828
2641B5477j6246k0097q393q462J758L919J7964k2245n15K5602j3537k2029J0427
2628b6377J262j0903k0603M8914O236J2652M754k2987N118N946J3109R92J6039
2615C4152K0145J508j2095q877k976j0284j1507j1806k938j0640j3377Q577Q708
$$ plain form
2705 51019 39272 33915 24533 22693 13631 19430 31116 2042 6678 37600 62984 56013 57151
2692 57151 24432 6446 7529 -20847 -27212 -9936 -4867 11505 -5265 -34076 -38483 -25046 5735
2679 5735 17950 -19108 -18706 -2458 9364 4796 12331 -31031 -33938 -28145 -15492 -9743 3446
2666 3446 21207 43944 12407 -5602 -6987 1854 -10801 -1672 19171 5835 -16083 342 29897
2653 29897 9055 -24950 -11390 11676 17312 -5521 -21039 -59118 -58290 -27768 3649 25477
2641 25477 9231 -10866 -19259 -27721 -25963 -22044 -4080 -26325 -26840 -1238 -14775 -36804 -26377
2628 -26377 -25115 -36018 -56621 -7707 -1471 11181 15935 -7052 -1934 4012 17121 18113 34152
2615 34152 54297 55805 43710 34833 31857 21573 10066 -1740 -4678 -15318 -28695 -20118 -11410
2602a1410j1262P601J2440j0124j844R768j4656m3207Q307K9071o416j0328J6165
2589b5895K708k2265J2791Q299j3628n649r856j016L4481J8241K136J9662j6219
2576C790p547J5359L6053K2613l6511k2036Q795j2566P305K0465o288j9124J8577
2563B8885O716k6601q110O157J4997p153M4968j1468j5246j7049O304N43l598
2550A9345K012j0168o560p308M2704J7244J1905j8075l6806j2200K147L7700L772
2537D5712l7272j370J4828j1772r488j3371m692J3838o266J9550J5050l695J1299
2524C2351k0162k0945M0158L3961k2673l6129J996j2325m774L4120M6237k7493
2512D4322m1752m650o870m498J4173l573N613O07p958K0065L6593k3614l5620
$$ plain form
2602 -11410 -22672 -15071 -2631 -12755 -14599 -4831 -19487 -62694 -54387 -25316 -31732 -42060 -25895
2589 -25895 -23187 -45452 -32661 -24362 -37990 -43639 -53495 -54511 -20030 -1789 347 20009 3790
2576 3790 -3757 11602 47655 70268 33757 11721 20516 7950 15255 35720 29432 10308 28885
2563 28885 35601 9000 890 7047 22044 14891 59859 48391 33145 16096 22400 22943 19345
2550 19345 21357 11189 4629 -2679 40025 57269 69174 51099 14293 2093 4240 41940 45712
2537 45712 8440 7070 21898 10126 638 -12733 -17425 -3587 -9853 9697 24747 21052 32351
2524 32351 12189 -8756 31402 65363 42690 6561 8557 -3768 -8542 25578 71815 44322
2512 44322 2570 -2080 -8950 -13448 725 -2848 2765 3372 -4586 15479 52072 28458 -7162
2499g162r839k0363L942K0322q161L3419M965k083M083k506r78j633M637k5702
2485g059k1637j4904J5980K753J7284l259q974J8427J7459l465J6374o889k221
2472A9869p232k14l0657K2377k512k3258j6806l6711M888O4844J2051l4303j2954
2459d0618P309K7505m035k6735j2139k456K1408J2949J1053m945k2424j5577L0517
2446a8188K2297J3870K2102q365j6216k5941O778K2041n222J2393J0689j8841
2434A7397j3909j8189j1p932J2906K0771j0713k481J0332Q775j4178l524l7916
2421c8672L098L4607J1700J0240j9446l2261p978K0625L210J0273L3952J0367
2409C9715j6886m0587o859p606l8K1929O823R998K1369N154l0152K10K731q280
$$ plain form
2499 -7162 -17001 -37364 -33422 -13100 -21261 12158 17123 15040 19123 16617 15639 14006 18643 -7059
2485 -7059 -28696 -43600 -27620 -24867 -7583 -10842 -19816 -1389 16070 12605 28979 22090 19869
2472 19869 12637 12423 -18234 4143 1631 -21627 -38433 -75144 -70256 -5412 6639 -27664 -40618
2459 -40618 -33309 -5804 -9839 -36574 -48713 -51169 -29761 -16812 -5759 -10704 -33128 -48705 -18188
2446 -18188 4109 17979 40081 31716 15500 -10441 -3663 18378 13156 25549 36238 17397
2434 17397 3488 -14701 -14712 -22644 -9738 11033 320 -2161 8171 16946 2768 -756 -38672
2421 -38672 -35574 -967 10733 20973 1527 -30734 -38712 -18087 -14877 -4604 29348 39715
2409 39715 22829 -17758 -24617 -32223 -32261 -10332 -3509 6489 27858 33012 2860 3070 5801 -2479
2395b479m0760L3413J2282m2253N531L0419R307j0929p070J6938K3036O013m1850
2382h402m199K587K0955n38l8899k0451l926N304K4332K1136K3824J7328p915
2369C1136o851k693k6681K410M5833O362k9360o196J4394J1460l4076j052J4507
2356A9193R381m952k5406k2056K3406p490J2388J8575K4434j2898l6483j6081
2344a7989k2144k0503K1958Q968J67K9452K5175j1600R175K0132Q068m2315p012
2331A532r985n122R378j4125M953K1285j8576J382j734k5190L1295N9275N862
2318F0230j3992m5578p349p20L600J9950J6266J3977J803L600p511j4154m766
2305B5356k9121r378m872L1073P104K047k0534j314O431J9004J316P535L41k2483
$$ plain form
2395 -2479 -43239 -9826 2456 -39797 -34266 -3847 5460 -5469 -12539 4399 27435 33448 -8402
2382 -8402 -12601 -10014 10941 10403 -28496 -48947 -52873 -47569 -23237 -2101 21723 39051 31136
2369 31136 24285 21592 -5089 -2679 43154 49516 20156 13960 28354 39814 5738 4686 19193
2356 19193 28574 23622 -1784 -23840 -434 -7924 4464 23039 47473 34575 -1908 -17989
2344 -17989 -40133 -60636 -38678 -29710 -29543 -91 25084 13484 22659 42791 50859 8544 1532
2331 1532 -8453 -13575 -4197 -18322 -13369 7916 -10660 -9278 -11012 -36202 -4907 54368 60230
2318 60230 46238 660 -6689 -7409 -3809 16141 32407 46384 48187 51787 44276 30122 25356
2305 25356 -3765 -13143 -18015 13058 20162 22209 1675 361 6792 25796 27112 34647 34988 12505
2291A2505k0576K6917R914l3250j5879J5083J6481k4094N794J4330J9162J2660
2279C9047l0550k3623o311J9488m511j1057L0713K4050l028m080n491m976p589
2266A2082K753O350k720J9117J0022q02o338J3590m299j0233l1183j6836K8336
2253A9839J788l884q77r3J0827K1723J8190k7554l1653k075M186M579Q366J8889
2239D2251n308m350o042k7561k9886o490L1951J6459q944j2043j5227J803N243
2226a8144J7074m807j3900r569J3430J8982O928j446j2352m4O953K4622J1226
2213C8953j6161N359P619j4710j9961j6335J53K8456o029l536p144p791K513j340
2199i954K6518K4282j084m3762j4497k0537P39K0835R189R795P226J9380L432
$$ plain form
2291 12505 -8071 18846 28760 -4490 -20369 -5286 11195 -12899 -7105 7225 26387 39047
2279 39047 8497 -15126 -21437 -1949 -6460 -17517 13196 37246 34218 30138 24647 19671 12082
2266 12082 14835 21185 18465 37582 47604 46802 40464 54054 49755 39522 8339 -8497 19839
2253 19839 21627 17743 16866 16773 27600 49323 67513 39959 8306 6231 10417 14996 23362 42251
2239 42251 36943 32593 26551 -1010 -30896 -37386 -5435 11024 2080 -9963 -25190 -23387 -18144
2226 -18144 -1070 -5877 -19777 -29346 -15916 3066 9994 8548 -3804 -3848 3105 27727 38953
2213 38953 22792 28151 35770 21060 1099 -15236 -15083 13373 7344 3808 -3336 -11127 -8614 -9954
2199 -9954 16564 40846 39762 -4000 -18497 -39034 -38295 -17460 -8271 1524 8750 28130 31562
2186C1562J2331p951R97J2130J4058J2229K1761r613J4235J1455j421o585k2843
2173H2345l7653k0865L427j0297r091J2810J2888l4812j9339R782j3270k8024
2161e2099O154K4224J4813J7453L372j8923K4362m216l2904q923N704k80J3882
2148g381k10J1985J8419l8521j5344L6640K304j4071M822k557r129J4882p40O293
2134G392J4788M834K8962o821r761n7644j288K8099l0436l970J6531m31P547J7364
2120A5166l8222j481L9863K1873O06k0167j7380r629p598k296k913K3743J1247
2107A2812j9780p052K1064K9106o391k3007M418k737r848P942K9201Q217j7218
2094B6727q345M094j9212j1780j8855n012K6981J1298J3061M395k8755j2599k1131
$$ plain form
2186 31562 43893 35942 36939 49069 63127 75356 97117 87504 101739 113194 111773 105188 82345
2173 82345 44692 23827 27254 16957 7866 20676 33564 -1248 -20587 -10805 -24075 -52099
2161 -52099 -45945 -21721 -6908 10545 13917 -5006 19356 15140 -17764 -26687 -20983 -21263 -7381
2148 -7381 -7591 4394 22813 -15708 -31052 5588 7892 -6179 -1357 -3914 -13043 1839 1099 7392
2134 7392 22180 27014 55976 49155 39394 -18250 -19538 8561 -21875 -25845 -9314 -9745 -2198 15166
2120 15166 -23056 -24537 15326 37199 37805 17638 258 -9371 -16969 -19265 -22178 1565 12812
2107 12812 -6968 -14020 7044 36150 29759 6752 11170 8433 -1415 6527 35728 43945 26727
2094 26727 18382 22476 3264 -8516 -27371 -32383 -5402 5896 18957 23352 -5403 -18002 -39133
2081c9133q706j128k1639L193M0700R838k5941O625J860r066P152J7699N269J4890
2067A613r158k8571j2129K0745J2550p008Q221N1673J1688Q800p271j3555j745
2054C5853l210m725p455j1629k5343m911k2911J0527K6006J1355k7910j1778P144
2041b8987K3102l684J539J8192N203J2878k9189j0844j6259J0808J5190j01J5450
2028A3298K2765m212k9506q246K6308J9447l6772Q27p78k3050N071L8028j2081
2015A1099j1956K7004k5623j6750k6369l034M7640K8349j2570k9414j2748K2879
2003a493K293j5503M949r737p827J8564q255k5016k1575P510J4666M481O206j7496
1989d8233j0889M4506j3490J4071O972P610J7883J5965l111l948j1372L5122J8143
$$ plain form
2081 -39133 -47839 -48967 -70606 -67413 -26713 -16875 -42816 -36191 -34331 -43397 -36245 -18546 -13277 1613
2067 1613 -7545 -36116 -48245 -27500 -14950 -21958 -13737 37936 49624 58424 51153 37598 35853
2054 35853 32643 27918 20463 8834 -16509 -21420 -44331 -33804 -7798 3557 -24353 -36131 -28987
2041 -28987 -5885 -9569 -8030 10162 15365 28243 -946 -11790 -28049 -17241 -2051 -2152 13298
2028 13298 36063 31851 2345 -5901 20407 39854 3082 3909 3131 -19919 -14848 23180 11099
2015 11099 -857 26147 524 -16226 -42595 -45629 2011 30360 17790 -11624 -24372 -1493
2003 -1493 800 -14703 -9754 -19491 -27318 -8754 -17009 -42025 -63600 -56090 -41424 -36943 -30737 -48233
1989 -48233 -59122 -14616 -28106 -14035 -7063 547 18430 34395 31284 27336 15964 51086 69229
1976F9229k9417k7232n292j2580K758K2859q22J2881Q92L142P208k2131q132R998
1962B3361J5332k2965j4800k3960j1946O5544P536k509k986m7784J1763K9325
1950B5911l6600j5961p567N566K245L420K206J6059j8762o452n452q39n469J1863
1936b9832J7913p51J0810j8831R60O245l005J7304L3660p665k7715R63R441k230
1922G267K963M810J2247j8904k0746J0021J9990M93m0008l6787L168j4830L3126
1909c7190J9751K6241J0220N378l2886r555p412L6670K5278k7985j4051o017k9607
1896d1165r572N5770M0351j0469j3787O135J9111J295m693l508j8464k376j2097
1883F531l4200q678N182K7716r476r388k5040J9042L465J5654m976J0605R079
$$ plain form
1976 69229 39812 12580 7288 -5292 -2534 20325 19503 32384 33276 36418 43626 21495 13363 23361
1962 23361 38693 15728 928 -23032 -34978 30566 38102 35593 32607 -15177 -3414 25911
1950 25911 -10689 -26650 -34217 -28651 -26406 -22986 -20780 -4721 -23483 -29935 -35387 -36226 -41695 -29832
1936 -29832 -11919 -12670 -1860 -20691 -19731 -13486 -16491 813 34473 26808 -907 56 9497 7267
1922 7267 10230 15040 27287 8383 -12363 -2342 17648 18141 -21867 -58654 -55486 -70316 -37190
1909 -37190 -17439 8802 19022 24400 -8486 -18041 -25453 11217 36495 8510 -5541 -11558 -41165
1896 -41165 -50737 5033 45384 34915 21128 27263 46374 47669 42976 39468 21004 18628 6531
1883 6531 -27669 -36347 -31165 -3449 -12925 -22313 -47353 -28311 -24846 -9192 -14168 -3563 5516
1870E516p343j7911k538N643l219j0417J6591l741K3743j924l4986J6521L5281
1857B1216n792k3315p710K7612K253j6694j692J6973J3227k667m0702j6450K4085
1844i656J1519q228M5669J0285k6621Q103k2091j0499P517M929l396K9782j6764
1831B0549r329J0602l3408j9378K3142J1721J6844n637j5406J9418k835k4044
1819g761j3541L1414L6878j3045n839K3193l4251J6681j345l1897k3922M753O287
1806a2395k629R002J3408r091K557J2651l1459l2383m101R462J2856M4551n842
1793F587j7009J4503k4925k58K032J6485Q119k1687q99k358J1649k75l281j8394
1779b9711k284k4166J8667J1494p01J1414L459J1019k236j1195k1932j3580k1255
$$ plain form
1870 5516 -1827 -19738 -22276 -16633 -19852 -30269 -13678 -17419 6324 4400 -30586 -14065 21216
1857 21216 15424 -7891 -15601 12011 14264 -2430 -4122 12851 26078 23411 -17291 -33741 -9656
1844 -9656 1863 -6365 39304 49589 22968 31071 8980 -1519 5998 10927 7531 37313 20549
1831 20549 11220 21822 -11586 -30964 -7822 3899 20743 15106 -300 19118 16283 -7761
1819 -7761 -21302 10112 46990 33945 28106 51299 17048 33729 32384 487 -23435 -18682 -12395
1806 -12395 -15024 -6022 7386 -1705 852 13503 -17956 -50339 -54440 -44978 -32122 12429 6587
1793 6587 -10422 4081 -20844 -21102 -19070 -2585 5534 -16153 -17052 -19410 -7761 -8036 -11317 -29711
1779 -29711 -31995 -56161 -37494 -26000 -26701 -15287 -11828 -809 -3045 -14240 -36172 -49752 -71007
1766g1007R441M959J1634K3602K5046P730K4112m98k1189j2389r187R026J220
1753B500J3368q722k82J5967k0376q632j4903L6382J890K560k7383r609N104K5139
1739A3003R574J617K408k4926K2856j6304l3303K693N057l877P973J5064o70j6838
1725a5673p10l6123m1963K2539L0686O642R41J011K7497j5769P509M0015l9016
1712a2414k2284j1656j743j2507k8445J3708J8808J9658J6844L4220k5689k9664
1700d1164J0834O789M837J4222k0159k4231q61P861n12R269O183l895q499j0686
$$ plain form
1766 -71007 -61566 -56607 -44973 -21371 3675 11405 35517 35019 13830 1441 -7746 1280 2500
1753 2500 15868 7146 6864 22831 2455 -6177 -21080 15302 17192 19752 -7631 -17240 -12136 13003
1739 13003 22577 24194 26602 1676 24532 8228 -25075 -22382 -17325 -21202 -13229 1835 1165 -15673
1725 -15673 -16383 -52506 -94469 -71930 -41244 -34602 -33661 -32650 -5153 -20922 -13413 26602 -12414
1712 -12414 -34698 -46354 -48097 -60604 -89049 -75341 -56533 -36875 -20031 14189 -11500 -41164
1700 -41164 -30330 -23541 -18704 -4482 -24641 -48872 -49733 -41872 -42384 -33115 -26932 -30827 -39326 -50012
$$ [...]
##END NTUPLES=NMR SPECTRUM
##END=
