##TITLE=Analysis number 319081
Compound Code mo 01135
Project Code adrs
Chemist Name fudan
##JCAMPDX= 6.0         $$ Bruker NMR JCAMP-DX V2.0
##DATA TYPE= NMR SPECTRUM
##DATA CLASS= NTUPLES
##ORIGIN= Bruker BioSpin GmbH
##OWNER= nmr
$$ XWIN-NMR		Version 3.5
$$ Fri Apr 28 12:54:06 2006 GMT Daylight Time (UT+1h)  MAYBRIDGE\nmr@NMR_250MHZ
##.OBSERVE FREQUENCY= 250.131544655141
##.OBSERVE NUCLEUS= ^1H
##.ACQUISITION MODE= SIMULTANEOUS (DQD)
##.ACQUISITION SCHEME= undefined
##.AVERAGES= 16
##.DIGITISER RES= 18
##SPECTROMETER/DATA SYSTEM= dpx250
##.PULSE SEQUENCE= zg30
##.SOLVENT NAME= DMSO
##.SHIFT REFERENCE= (INTERNAL, DMSO, 0, 16.522)
##AUDIT TRAIL= $$ (NUMBER, WHEN, WHO, WHERE, WHAT)
$$ ##TITLE= Audit trail, XWIN-NMR		Version 3.5
$$ ##JCAMPDX= 5.01
$$ ##ORIGIN= Bruker BioSpin GmbH
$$ ##OWNER= nmr
$$ C:\u/data/dgb/nmr/ADRS/3470/pdata/1/auditp.txt
$$ ##AUDIT TRAIL=  $$ (NUMBER, WHEN, WHO, WHERE, WHAT)
(   1,<2006-04-28 12:53:40.47 +100>,<MAYBRIDGE\nmr>,<NMR_250MHZ>,
      <created by zg, POWCHK disabled, PULCHK disabled
       configuration hash MD5:
       84 BC 41 DB A1 6E 1D 46 DA 25 12 A5 C1 ED C5 3A
       data hash MD5: 64K
       9C B3 54 24 B3 7B 1D 0A A5 85 EA DF 6A 56 8E 43>)
(   2,<2006-04-28 12:53:55.63 +100>,<MAYBRIDGE\nmr>,<NMR_250MHZ>,
      <Start of raw data processing
       ef LB = 0.3 FT_mod = 6 PKNL = 1 SI = 32K 
       data hash MD5: 32K
       20 C0 20 E8 90 2B 5A 34 DA 99 41 94 4C EC 6C 0E>)
(   3,<2006-04-28 12:53:57.19 +100>,<MAYBRIDGE\nmr>,<NMR_250MHZ>,
      <apk 
       data hash MD5: 32K
       52 6D F4 8B CA F8 A2 D7 4D AD B7 5A 5E C5 93 DF>)
(   4,<2006-04-28 12:53:58.05 +100>,<MAYBRIDGE\nmr>,<NMR_250MHZ>,
      <abs ABSG = 5 
       data hash MD5: 32K
       C8 94 AB 84 C7 D4 A7 4C B5 62 94 E3 85 55 BF D8>)
$$ ##END=
$$ 
$$ hash MD5
$$ 28 5D 02 8F 19 54 19 60 FC 6A 0C 8A 63 C4 FB 32
##$RELAX= 
##$RELAX= 
##$RELAX= 
##$RELAX= 
##$RELAX= 
##$RELAX= 
##$RELAX= 
$$ Bruker specific parameters
$$ --------------------------
##$DU= <C:\u>
##$EXPNO= 3470
##$NAME= <ADRS>
##$PROCNO= 1
##$TYPE= <nmr>
##$USER= <dgb>
##$AMP= (0..31)
100 100 100 100 100 100 100 100 100 100 100 100 100 100 100 100 100 100 
100 100 100 100 100 100 100 100 100 100 100 100 100 100 
##$AQSEQ= 0
##$AQ_mod= 3
##$AUNM= <au_zg>
##$AUTOPOS= <34 >
##$BF1= 250.13
##$BF2= 250.13
##$BF3= 250.13
##$BF4= 250.13
##$BF5= 500.13
##$BF6= 500.13
##$BF7= 500.13
##$BF8= 500.13
##$BYTORDA= 1
##$CFDGTYP= 0
##$CFRGTYP= 5
##$CHEMSTR= <none>
##$CNST= (0..31)
1 1 145 1 1 1 1 1 1 1 1 1 1 1 1 1 1 1 1 1 1 1 1 1 1 1 1 1 1 1 1 1 
##$CPDPRG= <>
##$CPDPRG1= <>
##$CPDPRG2= <>
##$CPDPRG3= <>
##$CPDPRG4= <mlev>
##$CPDPRG5= <mlev>
##$CPDPRG6= <mlev>
##$CPDPRG7= <mlev>
##$CPDPRG8= <mlev>
##$CPDPRGB= <>
##$CPDPRGT= <>
##$D= (0..31)
0 1 0 0 0 0 0 0 0 0.06 0 0 0 0 0 0 0.0002 0 0 0 0 0 0 0 0 0 0 0 0 0 0 
0 
##$DATE= 1146225218
##$DBL= (0..7)
120 120 120 120 120 120 120 120 
##$DBP= (0..7)
150 150 150 150 150 150 150 150 
##$DBP07= 0
##$DBPNAM0= <>
##$DBPNAM1= <>
##$DBPNAM2= <>
##$DBPNAM3= <>
$$ [...]
##$SUBNAM7= <"">
##$SUBNAM8= <"">
##$SUBNAM9= <"">
##$SW= 20.6930455092707
##$SWIBOX= (0..15)
0 0 3 0 0 0 0 0 0 0 0 0 0 0 0 0 
##$SW_h= 5175.983436853
##$TD= 65536
##$TD0= 1
##$TE= 295.16
##$TE2= 300
##$TE3= 300
##$TEG= 300
##$TL= (0..7)
0 120 120 120 120 120 120 120 
##$TP= (0..7)
150 150 150 150 150 150 150 150 
##$TP07= 0
##$TPNAME0= <>
##$TPNAME1= <>
##$TPNAME2= <>
##$TPNAME3= <>
##$TPNAME4= <>
##$TPNAME5= <>
##$TPNAME6= <>
##$TPNAME7= <>
##$TPOAL= (0..7)
0.5 0.5 0.5 0.5 0.5 0.5 0.5 0.5 
##$TPOFFS= (0..7)
0 0 0 0 0 0 0 0 
##$TUNHIN= 0
##$TUNHOUT= 0
##$TUNXOUT= 0
##$USERA1= <user>
##$USERA2= <user>
##$USERA3= <user>
##$USERA4= <user>
##$USERA5= <user>
##$V9= 5
##$VALIST= <valist>
##$VCLIST= <CCCCCCCCCCCCCCC>
##$VD= 0
##$VDLIST= <DDDDDDDDDDDDDDD>
##$VPLIST= <PPPPPPPPPPPPPPP>
##$VTLIST= <TTTTTTTTTTTTTTT>
##$WBST= 1024
##$WBSW= 4
##$XGAIN= (0..3)
0 0 0 0 
##$XL= 0
##$YL= 0
##$YMAX_a= 368052
##$YMIN_a= -494077
##$ZGOPTNS= <>
##$ZL1= 120
##$ZL2= 120
##$ZL3= 120
##$ZL4= 120
##$ABSF1= 16.522
##$ABSF2= -4.171173
##$ABSG= 5
##$ABSL= 3
##$ALPHA= 0
##$AQORDER= 0
##$ASSFAC= 0
##$ASSFACI= 0
##$ASSFACX= 0
##$ASSWID= 0
##$AUNMP= <proc_1d>
##$AZFE= 0.1
##$AZFW= 0.1
##$BCFW= 0
##$BC_mod= 0
##$BYTORDP= 0
##$COROFFS= 0
##$CY= 12.5
##$DATMOD= 1
##$DC= 0
##$DFILT= <>
##$DTYPP= 0
##$F1P= 14.0000005364418
##$F2P= -0.99999901652339
##$FCOR= 0.5
##$FTSIZE= 32768
##$FT_mod= 6
##$GAMMA= 0
##$GB= 0
##$INTBC= 1
##$INTSCL= 1
##$ISEN= 128
##$LB= 0.3
##$LEV0= 0
##$LPBIN= 0
##$MAXI= 10000
##$MC2= 0
##$MEAN= 0
##$ME_mod= 0
##$MI= 0
##$NCOEF= 0
##$NC_proc= -4
##$NLEV= 6
##$NOISF1= 0
##$NOISF2= 0
##$NSP= 0
##$NTH_PI= 0
##$NZP= 0
##$OFFSET= 16.522
##$PC= 1
##$PHC0= 161.6121
##$PHC1= 7.947938
##$PH_mod= 1
##$PKNL= yes
##$PPARMOD= 0
##$PSCAL= 4
##$PSIGN= 0
##$REVERSE= no
##$SF= 250.13
##$SI= 32768
##$SIGF1= 0
##$SIGF2= 0
##$SINO= 400
##$SIOLD= 32768
##$SREGLST= <1H.DMSO>
##$SSB= 0
##$STSI= 32768
##$STSR= 0
##$SW_p= 5175.98343685301
##$SYMM= 0
##$S_DEV= 0
##$TDeff= 65536
##$TDoff= 0
##$TI= <Analysis number 999999
Compound Code 99
Book Reference 9
Project Code 9>
##$TILT= no
##$TM1= 0
##$TM2= 0
##$TOPLEV= 0
##$USERP1= <user>
##$USERP2= <user>
##$USERP3= <user>
##$USERP4= <user>
##$USERP5= <user>
##$WDW= 1
##$XDIM= 32768
##$YMAX_p= 295283862
##$YMIN_p= -447721
$$ End of Bruker specific parameters
$$ ---------------------------------
##NTUPLES= NMR SPECTRUM
##VAR_NAME=  FREQUENCY,     SPECTRUM/REAL,   SPECTRUM/IMAG
##SYMBOL=    X,             R,               I
##VAR_TYPE=  INDEPENDENT,   DEPENDENT,       DEPENDENT
##VAR_FORM=  AFFN,          ASDF,            ASDF
##VAR_DIM=   32768,         32768,           32768
##UNITS=     HZ,            ARBITRARY UNITS, ARBITRARY UNITS
##FACTOR=    0.157963299565203, 1,           1
##FIRST=     4132.6476996994, 0,             0
##LAST=      -1043.33573715361, 0,           0
##MIN=       -1043.33573715361, -447721,     0
##MAX=       4132.6476996994, 295283862,     0
$$ Real data points
##PAGE= N=1
##DATA TABLE= (X++(R..R)), XYDATA
$$ [...]
23746 76925 -5708 -40556 -51569 -80267 162161 304609 220934 85481 -44889 -73690 -116160
23735 -116160 -78474 -88494 -61915 -150140 -148477 -84115 3563 -17773 -123789 -215646 -193722
23724 -193722 -304093 -322630 -243411 -139514 -181717 -48123 -3461 91828 7293 -180914 -54600
23713 -54600 45807 83729 -40991 -78364 105280 118724 62909 70600 99883 21696 -37499
23702 -37499 -36488 64511 119791 22274 -144838 -243977 -97026 -18522 25011 49458 112005
23691 112005 61247 4397 67066 117770 96980 24199 -36265 32660 11762 61710 73383
23680 73383 73812 136315 190929 134763 -9789 31386 -32001 -91992 -80096 -104054 -105649 -119039
23668 -119039 -143129 -98181 -13552 42524 93173 124253 101085 -9020 -30421 -10891 46478
23657 46478 106966 131861 170537 95105 121113 210886 101636 22932 -144475 -199659 -175394
23646 -175394 -99198 -47474 51259 40963 -67659 -50714 61375 89434 9871 84451 61408
23635 61408 24160 25052 83860 97277 33360 112572 80489 40937 -100095 -91004 -59401 15803
23623 15803 57980 9133 54955 42150 -14807 -32986 -42624 -34529 16790 106557 133380 38626
23611 38626 -604 -26959 -49781 47491 215132 170461 114572 118938 222941 289658 226830
23600 226830 141311 163535 129479 170395 127335 37943 24111 47083 48876 6582 -56127 -110173
23588 -110173 -97035 -145684 -81595 -98157 -133478 -161354 -110291 -44540 16127 -100149 -177988
23577 -177988 -183401 -96084 87195 150723 122337 55158 21397 61758 -53161 -94853 -180204
23566 -180204 -167022 -58058 98728 136495 -29913 -47960 10808 89881 129949 201653 141304
23555 141304 32384 -50836 -65115 -13048 -7510 80717 69993 69725 27088 -111421 -310545
23544 -310545 -262858 -169769 -131789 -85760 -15084 -34339 -83511 -157194 -163127 -184384 -68900
23533 -68900 -7846 63228 51532 86454 114863 92814 98576 26973 12609 12257 78521 184836
23521 184836 282335 208859 112568 26883 -116043 -150065 -100787 -75397 -91142 -122674 -107293
23510 -107293 -104433 -112498 -99431 -103206 -136056 -72263 -485 -7816 -68888 -168995 -96055 -22036
23498 -22036 -81905 -10171 -31400 -134865 -149044 -213465 -212809 -163419 -27352 -40804 -130580 -223650
23486 -223650 -18720 28759 -88577 -140756 -119530 -44629 -109240 -200722 -196357 -102671 -34980
23475 -34980 63237 52127 -62689 -117230 50575 93882 145964 104531 183554 106607 -3285
23464 -3285 25358 139823 102730 51437 -83510 23473 39302 -35236 -67114 -45385 -138611
23453 -138611 -162550 -88312 -14810 -54798 -41914 50513 58852 21830 -24562 -51504 -49032 36908
23441 36908 29410 -25840 -58780 -90951 -98510 -176801 -106115 44520 56440 -68102 -115634 -133272
23429 -133272 -118670 -15743 60852 35127 44873 28861 -19073 -97900 21790 144269 65785
23418 65785 24930 -59399 -67119 -53284 102179 261326 141854 -58644 -25110 82301 13466
23407 13466 -67801 -111189 -98857 -136795 -158740 -205467 -180003 -50213 76708 -26002 -69880
23396 -69880 -14981 -15553 39972 6458 -102440 -60895 23860 -222846 -300457 -226259 -183058 -205800
23384 -205800 -161521 -74595 6139 -27240 -99761 -96432 -10000 88963 139870 105135 -37237
23373 -37237 -68150 -72146 -23109 5122 -59534 29727 30597 -26297 -45891 -124850 -254998 -215790
23361 -215790 -224594 -181758 -100681 -9002 66421 52182 12813 -32145 -114354 -38142 -23869 80847
23349 80847 25225 25344 -21361 3620 65513 91104 130784 125735 174096 172459 -27481 -72369
23337 -72369 39316 29772 55844 50096 94633 148573 279990 250063 185677 127658 174953 195919
23325 195919 144822 121301 104049 197809 154874 180336 152718 185692 93277 5883 -36855
23314 -36855 19980 99531 142408 128628 127439 66873 49715 49812 231862 223949 141233 42493
23302 42493 38978 2344 -26964 34553 58592 30345 4760 -60418 -79153 119209 308264
23291 308264 234889 -6813 -75080 -57023 -24229 -91214 -180961 -189036 -48962 26529 77240
23280 77240 -21111 -86359 -53056 -46133 -89488 -71127 -126118 -250566 -159022 6549 158564
23269 158564 51951 34262 82017 1843 -109171 -130027 -87674 -88804 -77293 -111333 123616
23258 123616 183814 81702 -90717 -116472 -58013 -67577 -62150 -118126 -191652 -158085 -122522
23247 -122522 -163751 -66311 -57457 -89314 -124547 -58347 -83381 -27204 28788 -53264 -88841 -193377
23235 -193377 -191537 -170010 -101340 -31974 -69729 -87927 -74371 -173576 -164082 -115873 -89010 27627
23223 27627 153806 178956 217114 226536 165056 98887 -13478 -136216 -270147 -354705 -341907
23212 -341907 -241409 -135588 -61702 -88535 -116104 -32353 -5076 95556 214530 110777
23202 110777 111534 75530 -6461 -85774 -166850 -178086 -189956 -79276 -13730 51085 61841 13453
23190 13453 10934 -89544 -84418 -71138 -98160 -148521 -195084 -170712 -188363 -245755 -307017 -310346
23178 -310346 -264096 -156199 -111575 -171089 -167903 -31574 -99768 -100583 -69317 -53402 89362
23167 89362 1360 -142583 -119087 -163457 -89173 -82860 -115520 -60877 -77232 -131052 -84923 -42334
23155 -42334 -91548 -103435 -132137 -167169 -176279 -136033 -41909 3972 -2432 59933 33602 70899
23143 70899 272160 262747 208687 112456 -22895 -13750 -11038 -28523 16624 -23374 -39458 -76308
23131 -76308 -191276 -169117 -45339 -6653 -40771 40472 46021 79349 70199 -7349 -7946 10549
23119 10549 8138 -70443 -98121 -146402 -48838 -61173 -160294 -219135 -164705 -56413 68142
23108 68142 70418 54552 9254 -74717 12676 58684 44196 85261 7179 13034 23233 30373
23096 30373 78209 111964 112441 147549 57782 47769 65179 86314 -99564 -146948 -185562 -274231
23084 -274231 -335786 -229792 -115246 -10429 -10737 -15382 -38090 -36813 -65782 -72806 13952 -96679
23072 -96679 -42427 4607 25277 -24327 -92666 -113923 -59757 -122962 -259897 -380266 -336806
23061 -336806 -271910 -194479 -189837 -92950 5875 42054 73876 26834 15195 93675 232649
23050 232649 165893 88828 87937 2148 -41058 -17208 -19814 5553 82468 82097 6527 81316
23038 81316 93577 91369 5090 -142648 -179599 -150384 -150404 -116759 -18369 110199 23720 -79571
23026 -79571 -261920 -325943 -244494 -228061 -180633 5902 29612 -83334 -141395 -138745 -139103 -173383
23014 -173383 -127916 -73611 -16370 71102 88767 34733 15300 -35206 -4491 43917 21326
23003 21326 16267 124348 2980 -103190 20196 -35447 51274 90685 127051 122731 -2211
22992 -2211 -83932 -71316 -162858 -213585 -95508 -127750 -174293 -202342 -74046 -65577 13487 22557
22980 22557 17952 39789 119683 70516 42836 47771 57715 36966 -105115 -128023 -25228 3237
22968 3237 19501 149570 96373 137438 158557 46476 72069 127880 16090 39033 41611
22957 41611 76979 91023 7284 -38084 -34049 -44949 76254 24160 -35343 39627 17544 -81541
22945 -81541 -175478 -111444 7248 65313 3055 98694 101454 52205 42055 -41683 -83290 -68609
22933 -68609 -118723 -126755 -84498 -38474 36452 74928 -36477 -126210 -188489 -93687 19109
22922 19109 134812 150926 56313 35475 45040 -30078 3574 29389 -40599 8811 5076 -46082
22910 -46082 -115253 -76982 48752 57151 72469 77362 81997 83462 64400 -14277 -102620 -123424
22898 -123424 -11479 50192 53477 22525 79622 100680 -34111 -146303 -160785 -133533 -220837
22887 -220837 -160372 -29130 -14268 -77082 -68655 -27899 -35950 -60597 -26497 10195 -68200 27626
22875 27626 224376 282103 297920 294283 266562 244173 182439 137424 -750 -87701 27200
22864 27200 47066 104745 127603 174815 87313 4285 -11027 -83535 -51218 -64136 -116515 -56359
22852 -56359 -118580 -159318 -175851 -146234 -38726 60224 31090 41102 78995 42972 100638
22841 100638 205397 87432 15245 56164 120794 126488 136035 217783 68615 -103952 -92997
22830 -92997 -45168 -44242 62418 211256 159317 93577 9569 -227600 -298785 -234752 -239032 -246672
22818 -246672 -209554 -190181 -93037 -33420 21836 -10187 18593 19406 26631 47009 -15178 2610
22806 2610 57108 85072 -50264 -99755 -106654 -116553 -179076 -150982 7739 147220 90109 33208
22794 33208 -9602 570 14457 -14327 -37759 -50753 -83471 -120904 -166780 -74751 -36284 30467
22782 30467 70265 89374 -560 -26656 -38560 -38400 -1004 -7370 -91864 -97963 -68392 60899
22770 60899 34956 -36706 44359 -5486 -94550 -242205 -258502 -270929 -223699 -167445 -173102 -171233
22758 -171233 -210729 -165660 -149860 -91060 38084 135280 136591 114470 148831 141686 7301
22747 7301 -56818 -76469 -45716 -56880 -43630 27523 75885 52660 165380 201006 315406
22736 315406 285977 143813 129434 209604 205817 137236 78276 -38461 -81041 -111669 -206184
22725 -206184 -251663 -105295 42951 40594 95237 44069 -51052 -124733 -87030 64043 21305
22714 21305 -168282 -196129 -148811 -161814 -26342 95917 156739 115881 5494 -83641 -39336
22703 -39336 -43529 -49249 59354 180271 85155 -15997 -54626 -140583 -275621 -169374 -96086
22692 -96086 -72942 -67926 -119819 -145068 -94161 -132708 -145215 8048 78933 69490 127352 62513
22680 62513 -63949 -183574 -167528 -194688 -196339 -195982 -130133 -70544 25845 20732 39912 23051
22668 23051 -79952 -132191 -166059 -96048 -20948 -143014 -167089 -128360 -73114 38719 104535
22657 104535 11434 -137876 -93515 -79489 -60972 -150676 -109920 5120 -74121 -172222 -163930
22646 -163930 -109037 -117245 -52277 -74040 -73281 10472 -12229 -117863 -127927 -67870 -150452 -263679
22634 -263679 -132024 49986 113185 102257 209623 139786 70719 -4235 44990 75918 -35288
22623 -35288 -116248 -119155 -165466 -52186 40362 -41666 10661 130561 79938 32415 -427
22612 -427 29150 71386 34373 78527 32251 14701 -67691 -206115 -165086 -132478 -132551 -127537 -23068
22599 -23068 -95450 -107963 -12545 62297 95628 55481 107686 217857 167659 166682 124048 161732
22587 161732 149077 79544 13311 76209 112772 26002 16103 133895 131254 127768 163802 107324
22575 107324 39816 38665 -50209 -100626 -205218 -103395 11812 89788 196679 136046 -15574
22564 -15574 -29620 -20733 -18883 -12587 44154 -14160 -29803 -91299 -76540 92857 135807 -6016
22552 -6016 -141257 -95449 36528 50930 91390 76338 62637 13449 -67528 -51618 65033
22541 65033 -8847 -192821 -207611 -216749 -271387 -280604 -183978 -51960 -115300 -97761 -41681 -17406
22529 -17406 -60355 -59490 74430 38348 22465 -39936 88252 137731 5013 -101569 -69135
22518 -69135 61890 21579 -6371 -55902 -142728 -179322 -106097 -37518 -33845 -54360 -6280 24872
22506 24872 -22757 -143446 -95660 -91447 -114473 -133752 -85448 -42699 -54231 29430 62370 100310
22494 100310 12896 76119 229347 257264 126762 77283 -8437 3858 177110 211079 185607
22483 185607 126370 111484 111857 64595 -7152 -51207 -71735 -77944 -122510 -125287 -120187 -89197
22471 -89197 -161870 -198778 -152062 -104610 -115638 -112668 -62986 24303 103580 129621 164637 91110
22459 91110 -88033 35690 78491 38607 29329 58854 688 -102282 -141598 -174164 -99305
22448 -99305 118688 223459 256126 227222 121320 -6486 16143 -21583 -21884 28461 8814
22437 8814 -46303 -69465 88186 184135 39849 77133 87015 16157 -4397 70777 53397 3699
22425 3699 125892 184843 145316 55006 -38076 -137024 -173602 -179743 -94474 -186245 -346657 -249158
22413 -249158 -101307 -9837 10462 -36576 -41632 -89617 -143796 -40267 65386 62726 38317
22402 38317 32696 66402 89579 -24756 -58872 -8116 -46631 -37321 -57627 86487 132380 131307
22390 131307 112054 90408 102574 118149 14373 -2355 9763 -24989 -98024 -68526 -101190
22379 -101190 -192776 -245872 -161222 -62829 105987 150475 144777 40026 62014 -12505 -126676
22368 -126676 -96173 -37935 65634 176069 190340 134453 9950 22555 159670 188106 170269
22357 170269 123588 97756 -8605 -81077 -40183 -11066 36692 52545 -99145 -147094 -156940
22346 -156940 -42535 -48955 -1581 -96419 -184471 -155766 -183267 -244618 -197745 -18149 23816
22335 23816 36823 127 1005 36880 55508 75032 -1547 5679 8031 -28736 -65635 -8000
22323 -8000 -15212 -76757 -68581 25142 121297 76185 -1524 -59427 -63702 -69177 -36436 -42982 -122893
22310 -122893 -65853 -42479 -40696 18867 -17476 29336 21985 93523 152177 92663 -70782 21732
22298 21732 16101 -159769 -162461 -30510 -32686 -19429 -35450 19963 36430 -102161 -203218
22287 -203218 -106270 -14210 -49934 -86584 -150783 -221701 -281571 -279897 -254630 -173939 -109634 -243770
22275 -243770 -125187 65968 117911 142767 80505 -70149 -220489 -341304 -335327 -184372
22265 -184372 -107698 -61487 5463 96901 119584 -10682 -58510 -96077 -181348 -116014 -6178
22254 -6178 37211 32535 6208 35417 221988 127096 42803 96434 80365 -52256 -153267
22243 -153267 -120715 -88387 -129464 -123552 -193925 -141638 42323 188542 162679 83761 -67427
22232 -67427 -129 -59786 -144132 -173614 -58463 54714 -15370 18983 64784 -21618 -141534
22221 -141534 -109363 -59785 -63050 14425 130190 81764 1351 -81650 -40784 71348 21367
22210 21367 -64328 -58581 58093 15044 -101512 -229878 -253684 -131542 7448 96322 55757
22199 55757 -33979 -130502 -88128 -150846 -242672 -160801 -269560 -166266 -60484 74021 38091
22188 38091 31610 61650 -57833 -93620 -131642 -178642 -43967 58769 76265 51191 98620
22177 98620 29028 -3250 3275 -21572 12515 7602 18154 23542 -10679 -38489 -71401 -86761
22165 -86761 -127606 -99491 2769 108174 130989 21878 23045 71680 103066 81116 3879
22154 3879 -120388 -179106 -68171 47302 13532 18330 30004 -14704 9991 -11594 -76906
22143 -76906 -109823 -97443 -6963 -80612 -47382 -44273 55669 138475 8995 -64560 -154408 -154640
22131 -154640 -36745 18429 33366 100430 91168 233987 243340 78118 -26694 6324 40217
22120 40217 -120001 -219856 -100687 -105257 -72195 -23346 -84123 -48613 95825 175505 99391
22109 99391 -23524 -37234 33174 25339 43327 4655 91932 185159 171795 84587 100782 108961
22097 108961 75112 76856 103912 109135 23663 19195 -17038 -46540 -51341 1567 5527 -35444
22085 -35444 -16365 65385 114982 -8627 -117693 -94604 -56345 64756 113894 172102 234702
22074 234702 120090 83500 178070 284754 239610 186745 134486 168216 201036 56962 84602
22063 84602 165927 107290 46173 44883 14519 -38578 30389 2842 -76759 -192952 -121609 38867
22051 38867 26836 -124704 -20517 48146 149319 93757 139693 89886 41255 3865 38358
22040 38358 99286 90331 7040 -50983 -37292 66977 55895 70972 88449 -92244 -275858
22029 -275858 -133443 48153 39951 64031 57525 41235 134614 127930 -42102 -68296 136201
22018 136201 281367 194104 151204 56903 -17914 50935 -42254 -144837 -152645 -47520 65980
22007 65980 66851 175137 160437 85045 14636 153201 217464 152628 15911 -76596 -62422
21996 -62422 -135761 -82986 -105657 -169377 -166618 -88646 18767 104400 -42793 -81882 -121243
21985 -121243 -78919 53298 80668 -126273 -201680 -194337 -240545 -336084 -287825 -245000 -40526
21974 -40526 31370 -14379 -69109 36234 142380 167718 152937 162742 134090 108692 6022
21963 6022 13480 -20614 -78895 -53003 -103504 -25071 85113 -4280 -71156 -126199 -144967 -42931
21951 -42931 10088 -60973 -46909 -26357 7058 -36257 -113628 -125058 -122173 -52202 -51363 -106180
21939 -106180 -125296 -8492 822 7758 -92830 -14766 -63463 -181537 -107122 -70826 -80042
21928 -80042 -69333 4069 90144 26746 102674 164035 253706 101568 -8395 19569 -38049
21917 -38049 -49076 -74967 60724 28946 -25568 -4312 -56846 -37011 -64572 -61086 -80153 -90665
21905 -90665 -60148 -105112 -229966 -290096 -183631 -92598 -7802 7709 90865 45251 -15803
21894 -15803 -212367 -271733 -40161 -63871 -32254 -66802 -163275 -214373 -101172 -47833 -85149
21883 -85149 -37778 61789 184681 149726 9062 24062 -15297 -3222 -37579 -18624 -42783
21872 -42783 35046 98932 207991 139790 100432 166340 72582 53490 188023 156573 126637
21861 126637 145611 39771 59880 68481 80443 74866 39020 -7598 -6608 67735 41579 -67198
21849 -67198 12789 -54177 -109413 17069 47037 87160 130285 167377 174931 236432 211316 225167
21837 225167 366032 198277 110131 79801 -35127 -71837 -64445 -127800 -113043 -100136 -190462
21826 -190462 -207617 -187918 44963 178390 152775 117533 213172 211854 105396 -42284 23222
21815 23222 21890 -102778 -152582 -109336 -41736 -31724 -65860 -41401 5760 13839 35333 46894
21803 46894 66874 -14096 6564 -35365 -74139 -115463 -84579 876 -43810 -23841 81003
21792 81003 51925 -3665 484 31706 53225 -30669 -116960 -38155 55691 35573 -87539 -55658
21780 -55658 -26406 -3502 112621 190173 157668 185787 208867 213016 199425 104631 95151 159194
21768 159194 167681 78237 33873 64804 18165 46608 -68376 -74282 -70958 -53375 -115127 -139658
21756 -139658 -145845 -71236 -100016 -174028 -196316 -199921 -174092 -127119 -54494 44020 97265 65154
21744 65154 -15764 -111812 -58592 -29320 15974 132438 102605 144924 151582 50583 -52411
21733 -52411 3798 -34871 88994 149598 57382 -23458 4872 -32779 -33609 -103167 -222635 -118399
21721 -118399 -115620 -207483 -91143 -20619 -29884 -123478 -205626 -23119 -10533 -54575 -32707
21710 -32707 -70519 -44701 10860 60909 5769 -158221 -225332 -177503 -27254 44936 93808
21699 93808 101286 53202 43112 -52204 -130191 -87184 -109708 -99277 -114405 -94809 93102 184347
21687 184347 110680 79749 -4501 -105806 -11909 -7493 -112004 -234232 -269418 -243877 -142954
21676 -142954 -38653 7264 47193 1192 23784 -35548 -191166 -160527 -46438 -88234 -26075
21665 -26075 4231 -32749 -106416 -57186 -65644 -67585 -14752 58357 -75397 -234429 -213762 -133858
21653 -133858 -10226 62446 45854 -26839 -4128 -2997 -57828 -164475 -94291 -79459 -73140
21642 -73140 -29064 55337 119542 134773 63927 33949 66775 49575 1204 -33179 -22225 -54560
21630 -54560 -127658 -118680 -70794 -82116 -152783 -182789 -58239 37595 127993 172587 258612 253844
21618 253844 138594 89616 114077 140226 43572 -88890 -156962 -174594 -81196 -2570 -95778
21607 -95778 -110770 -8696 56036 39243 -38998 22937 18094 -42585 -29416 15869 118891
21596 118891 156448 171807 279497 274597 221309 109160 68548 -30267 -77967 -3078 50428
21585 50428 -30434 137336 114202 64359 14856 -6602 -25475 111261 150513 112115 -14981
21574 -14981 -73378 -69472 -9231 87079 76836 102920 83537 131749 210528 218632 227335 250009
21562 250009 219853 190763 116461 161986 112287 89712 59820 -15824 65180 136707 93417
21551 93417 134646 182319 300011 264347 177361 130084 99409 81739 64663 57020 72702 124298
21539 124298 1954 -151819 -165666 22210 32855 61168 93445 86047 43996 99447 168461
21528 168461 301044 221177 125404 6274 -44939 -75927 -67176 -38657 -177751 -273608 -156633
21517 -156633 -2173 35692 17615 -6996 12715 30189 37127 34612 63495 -13467 -90633 -24488
21505 -24488 6148 -7972 -33716 -46577 -24967 -12199 5265 103220 256034 212014 143747
21494 143747 118358 187022 54663 69137 148221 73020 85134 25279 -134534 -154598 24084
21483 24084 -33263 -44368 76022 154119 52195 -125628 -142648 -50746 31251 -17890 -12433
21472 -12433 -80806 -36429 14668 27038 72694 42998 -69004 -141842 -192115 -211946 -108959
21461 -108959 -28660 -1554 32906 -3705 -94142 -157271 -97788 -11314 60325 397 1366 26294
21449 26294 -2734 1970 -11113 -17220 27035 271 34505 48509 75851 54040 -53174 -47322
21437 -47322 -47158 -71174 -59374 -197262 -192525 -140515 -127337 -141648 -16876 -17412 -42744 25799
21425 25799 -108598 -90077 -16640 13511 -29394 -8259 92508 80422 69934 -32527 -149434
21414 -149434 -239626 -259870 -259306 -183933 -39012 61259 112570 88760 93634 51718 -13339 88449
21402 88449 96366 175002 97878 27451 27117 100040 12814 -71145 -33816 28278 47542 -26801
21390 -26801 -32846 -54682 -112379 -301491 -182778 -113303 59787 125125 89991 9458 80844
21379 80844 119026 49110 83974 132503 35031 54711 64566 21769 60859 -30345 -29734 89790
21367 89790 7362 -106145 -64517 -18995 139316 110679 -19694 -108755 -38898 40424 149313
21356 149313 172705 163925 92440 101788 27144 13752 -83492 -102653 -76758 -141832 -245073 -284332
21344 -284332 -216480 -135184 -90057 -52178 -27285 48864 90692 49458 100224 184283 63018
21333 63018 89633 63773 -82528 -172428 -106119 -46598 -46308 -14685 -7301 50095 16011 -17203
21321 -17203 -72249 -183370 -199674 -159641 -188998 -186888 -130840 -159568 -65521 -40043 -67490 81224
21309 81224 152977 181995 171492 118324 103885 185350 212789 73810 138666 157214 220218
21298 220218 178019 89482 -16468 -57303 -33647 3023 59191 -41179 -67960 -65016 -48743
21287 -48743 123413 329068 202247 141589 71595 -24227 -42866 382 -70947 -8052 195805
21276 195805 204801 119244 66698 101215 107672 39301 95433 91742 15418 -49067 8831 106118
21264 106118 211199 293858 98627 14361 -52846 -34288 -156296 -235159 -170048 -209251 -130362
21253 -130362 7606 -22216 -38074 38026 50750 65156 5599 -19458 125156 203370 71696
21242 71696 88670 -5228 -143030 -159303 -126198 -170926 -91947 -43692 -37789 -31776 -36561 -22527
21230 -22527 62541 75639 60351 -3282 31455 64319 73564 -16560 -32340 2774 126126 215228
21218 215228 120819 -66557 -147008 -277450 -197362 -190539 -149697 -163829 -36770 83155 16629
21207 16629 -42381 -49178 -10746 35196 99607 38947 115722 96191 51522 -61861 -128269 -142345
21195 -142345 -239874 -205859 -87303 -46016 -67596 -46151 -35002 -84428 -99438 -56311 -24407
21184 -24407 62100 177052 164384 169338 26875 119871 272209 256601 85399 -12373 67080
21173 67080 194023 191954 120027 124761 25376 -48991 -134454 -182191 -196856 -136636 -79143 14338
21161 14338 61561 38855 -30978 80776 84639 33047 18629 -1335 -34237 -47042 11264 67733
21149 67733 7635 55502 91261 10249 2219 -14079 43947 146561 195118 183555 154551 64572
21137 64572 11170 -37014 -6333 13760 -17071 -19293 3974 -40087 -72863 64154 180478
21126 180478 163821 188162 147059 130055 150309 176482 212585 207700 170168 152657 17729
21115 17729 -148575 -274047 -147502 -71880 -1644 99107 -1011 -14722 -42256 -26233 -56613
21104 -56613 -193485 -151833 9095 74991 20459 -67532 -46193 -58215 -47776 -139515 -211130
21093 -211130 -245543 -196493 -122485 -72144 56202 18458 26734 -56436 -20680 -82705 -33812
21082 -33812 38302 31171 -35025 -111652 -102775 4056 57744 -15710 4034 40170 45978 68413
21070 68413 51937 18377 -10626 27226 39853 18002 8318 200437 290245 192610 130014 15441
21058 15441 16801 57375 82648 99976 174941 210717 194935 50743 -34212 -63295 12833 57829
21046 57829 27121 -1820 -85017 -79311 98796 137415 176639 173189 106211 -11225 -61997 -57529
21034 -57529 -18240 174 -18376 -64266 -32051 819 -32335 -39750 27525 86374 -10156 67476
21022 67476 174402 173810 72700 24997 -6083 -63995 -71807 -21050 -4213 65632 -52463 -86763
21010 -86763 -61756 -53481 -53761 109505 105456 86478 137509 19827 -32453 -61915 -28792 -13163
20998 -13163 111329 179743 177089 213628 277978 196984 140547 12853 -182111 -177849 -30343
20987 -30343 -94332 -51470 -116988 -140296 -87904 -23529 27077 3670 -50031 -160844 -26018
20976 -26018 101029 -48098 -30476 9913 -45072 30977 88093 -4247 -14651 99237 183397
20965 183397 12352 44366 33570 42541 21909 56704 33272 -66889 -34844 30835 -66185
20954 -66185 -178312 -140781 -44153 54439 70130 53431 6725 8013 65439 117627 37042 -57038
20942 -57038 34242 19456 -20478 -43454 -15132 -102600 -213644 -146793 -47637 112571 111167
20931 111167 106509 33118 -31670 -23717 -95285 -65136 15827 125635 137666 167135 91940 117600
20919 117600 105754 21939 7723 62960 34687 141448 87290 -104077 -116969 -98466 9353
20908 9353 20657 -89977 -56192 124908 181088 122744 919 -140472 -108686 -44029 77478
20897 77478 64015 78875 83725 83491 94046 -94846 -164309 -58897 74129 -4327 -59176 -5993
20885 -5993 4429 69174 -27313 -102546 -160270 -190364 -224269 -152829 -240283 -226177 -119068 -57358
20873 -57358 61826 2014 -56565 -53138 -12065 1750 96359 139057 90431 55029 191399
20862 191399 185595 133578 138129 44264 12077 96300 228376 229407 175924 155310 155552 133619
20850 133619 19459 -132709 -65518 -6706 55095 55841 36962 85386 105628 48837 39699 22646
20838 22646 66577 152515 171441 77018 66608 89100 38474 -44161 11207 78851 -104464
20827 -104464 -197765 -48551 6629 13720 42770 -81296 -229299 -198152 -69159 -93643 -63938
20816 -63938 -29063 25178 146899 155808 88017 42085 2226 -32760 25259 69377 73324 59011
20804 59011 102857 124774 120299 91312 128317 100176 113098 139019 69016 7968 -12677 -3155
20792 -3155 -28833 -18391 12230 46985 -100321 -197644 -212798 -148113 6765 15425 -40199 -51073
20780 -51073 -93616 -140494 -47591 47066 148356 168435 160647 123611 75120 56189 39853 12014
20768 12014 66665 -198 -65208 -85542 -47821 -45538 13956 114599 140922 92899 59263 93105
20756 93105 85135 68345 50992 -31899 -31910 82678 74278 126445 93073 123737 107508 135045
20744 135045 92159 4597 -28789 -74344 -58979 -16729 27072 10793 75159 183121 129503
20733 129503 -36142 -79864 -167626 -149444 -88380 -93879 2577 162799 149019 14599 -56338
20722 -56338 33813 30702 -70505 -87409 -58718 16363 -52399 -48606 -88525 -17261 79542 65704
20710 65704 -4950 -66443 -126529 -82201 -121021 -158577 -133507 -194305 -87278 24444 92670
20699 92670 25755 -66357 -179470 -92162 -27243 -4857 -37321 1477 24576 -441 65685
20688 65685 161373 197167 108956 55482 -52577 -199196 -18059 94822 60404 -1249 27970
20677 27970 79862 -55854 -151723 -96239 -103063 -179177 -220530 -288511 -138201 -17041 27113
20666 27113 7122 -63032 -52100 -58139 -62749 -41564 -144667 -109313 -136263 -90797 -56063 -13483
20654 -13483 45841 -97792 -137610 -149635 -194548 -172697 -58436 17278 -69109 -78005 -159746
20643 -159746 -238797 -254594 -115389 -107593 -61367 95823 134351 193729 239196 209545 212277
20632 212277 145966 49600 -54187 48472 202123 178105 97984 106889 150372 220638 218750
20621 218750 133614 54526 -8994 39704 93972 -15573 92439 131040 50912 -30581 -176389
20610 -176389 -249751 -194897 -146993 -65979 -26528 -79182 -96499 -51382 -98216 -105232 19875
20599 19875 90689 37004 39077 18855 -20417 -75824 -75481 -154583 -100516 10302 42898 -93318
20587 -93318 -2350 41312 126641 115543 134759 84366 -71751 -24707 23041 51784 47224 78444
20575 78444 99843 10994 -63989 -109794 16841 95756 160764 202883 146574 75205 -29817
20564 -29817 -30853 -14922 16835 -45707 -100396 -36878 -80671 -144430 -118818 -48399 41245 70256
20552 70256 -16846 -228103 -268256 -166180 -58393 -14346 -58103 -55548 15209 12436 62293
20541 62293 110691 153387 84897 53946 -33569 -53873 -29567 33635 -10449 -23464 100683
20530 100683 175597 18302 -104969 -2558 23580 6923 59423 -69171 -14632 111975
20520 111975 47248 -40440 6888 137329 149814 149320 95293 87575 136456 220342 83009 9961
20508 9961 77389 37797 25662 -27652 -4204 12477 71602 48792 26049 4784 21040 109359
20496 109359 199618 210434 178967 161207 126342 84063 -37453 -94186 -70430 68783 166505
20485 166505 100198 99274 232422 205312 45458 -8516 146164 303591 290098 148714 27306
20474 27306 29237 -52595 -83796 -14580 23203 101831 32007 50138 26863 82656 94255 -77749
20462 -77749 14801 115478 23135 -100668 -185085 -176886 -161938 -114287 -141746 -131434 -105978
20451 -105978 -69471 -89314 -183100 -190887 -20184 82318 83492 -16877 -64229 -15411 -124328
20440 -124328 -176929 -93618 61035 56604 94120 177949 131112 62943 34092 16957 -1706
20429 -1706 -47381 -42566 -14730 19926 80688 70095 7219 -20613 22388 218093 208640 143377
20417 143377 142680 126130 106168 140834 209760 261971 306874 301775 205688 156136 78571 47338
20405 47338 19047 -30119 -138184 -242599 -210193 -119628 -56846 -100376 -50431 -18861 -37812
20394 -37812 -97001 -131188 -129288 -78675 53001 19082 2791 190138 351576 136974 -54562
20383 -54562 -37232 70855 97166 51531 143618 154889 114636 47617 -71788 -146408 44423
20372 44423 127428 62106 141763 204275 133239 77250 -139 2188 -20310 -102560 -63578 23458
20360 23458 96272 79396 177005 196066 205247 236582 138277 25204 55321 37519 92635 204840
20348 204840 228394 142184 74923 59213 -10440 -79640 -3981 -19802 55210 132264 175153
20337 175153 141895 84583 42501 78566 21504 59428 113571 135956 128608 130428 87839 92926
20325 92926 156401 129277 185057 75694 -83145 -104634 -46446 9178 -20499 -18575 100088
20314 100088 223328 223099 246812 309574 274542 154721 30165 30843 153524 314308 367911
20303 367911 230259 150142 227985 262412 159636 119561 98877 41362 13598 38060 -122464
20292 -122464 -166232 -33553 71164 110284 100513 -31987 -74420 -87614 -134888 -123834 -67697
20281 -67697 -967 40630 7101 -49144 29881 108181 96870 29412 133632 159841 262894
20270 262894 177462 3951 -45662 -6749 20736 71628 68648 6485 63678 65515 24704 60109
20258 60109 98171 16320 36420 53159 171971 192955 127620 -15324 -25038 18046 65217
20247 65217 120754 84754 78037 27789 9898 -65306 -153771 -139541 -78144 -35350 76102 111972
20235 111972 64952 97416 87445 59086 34772 107645 138427 74746 40239 138342 126163 49255
20223 49255 -49187 -34113 -405 82882 115756 98520 160980 171511 185976 126489 26616 63206
20211 63206 174490 234831 161000 219037 300137 162026 28545 99423 62452 59470 79904
20200 79904 -5076 -110451 27636 18908 40055 54490 180186 263086 197358 199820 131868
20189 131868 114997 154233 62876 -24487 -33379 56050 92179 40858 196987 339209 258473
20178 258473 218780 69428 -4612 43650 87407 115286 180276 181596 78347 81422 148407
20167 148407 162933 79675 6619 8452 111901 136082 -22646 -62347 97679 138989 69070
20156 69070 48945 124427 124006 165739 204623 276442 167464 39788 54088 51829 49285 198234
20144 198234 273386 184025 100061 67417 153391 190186 162703 47603 23791 25500 54005
20133 54005 149696 207865 178358 135868 27469 89117 136949 131337 121370 130975 210518 248358
20121 248358 226671 155411 138342 111406 62390 176905 340236 404484 361871 329842 332685
20110 332685 245414 177932 157247 249461 239243 211734 187626 105263 104187 96445 39100 89929
20098 89929 173347 260179 220236 204192 141099 32766 70235 55340 174555 244487 160488
20087 160488 138534 92227 130440 212999 224693 221106 205968 101839 93528 119164 118553 166094
20075 166094 255966 261727 281836 398658 503827 390985 304020 250611 180328 122020 186446
20064 186446 228778 240194 326308 335161 331424 205427 168847 181340 193516 256226 310508 289622
20052 289622 254143 167334 108061 229249 319977 273832 277126 158652 15197 -127511 -107286
20041 -107286 52151 137931 40187 156837 232191 140431 39987 150948 210161 272724 373225
20030 373225 382876 169742 32444 96950 117546 184301 214860 216004 223201 307423 204414
20019 204414 120415 217113 293549 248691 214546 204894 113912 127680 81258 87112 107203 50187
20007 50187 13397 -7710 64913 82436 157520 211477 236151 210182 74734 -2908 4478 -23606
19995 -23606 -64220 -19660 218167 381428 384588 456084 431034 325378 277981 252561 196501
19984 196501 97731 153180 179655 182955 317034 383454 276256 139334 254907 243376 270634
19973 270634 187706 208120 298537 343360 320025 210519 176975 155365 69155 98219 155246
19962 155246 273852 428890 417598 361609 289198 204747 163303 100867 162519 264250 293571
19951 293571 228684 228667 227856 64889 101630 160661 241254 303353 286536 285609 304528 152643
19939 152643 23733 49054 140857 102925 100640 232020 301242 239790 334394 405757 269229
19928 269229 20259 -5577 88336 28647 2150 75904 18069 79088 210037 426878 415346
19917 415346 309529 274446 316462 293945 259514 329009 447174 452341 314728 350210 291414
19906 291414 215502 248682 218477 175199 182538 326732 418005 398663 377137 387368 327549
19895 327549 276573 319486 322993 286939 198577 110948 113715 187200 274441 366877 254778 92414
19883 92414 98620 134300 117289 205838 356247 351034 318385 361045 384687 369705 431316 499200
19871 499200 447829 273776 169805 284526 416539 409415 375708 333367 316317 271975 230877
19860 230877 273254 443620 467718 471370 368235 349831 367155 317025 267933 208216 246408
19849 246408 367773 389159 427761 367303 291296 270645 402660 426203 393868 482132 444092
19838 444092 373059 380473 410165 472107 525962 502307 396000 347290 340247 198834 115362
19827 115362 83787 203867 357252 374789 311009 284977 303289 289620 217831 240437 281564
19816 281564 282650 259850 196484 135667 98739 86375 146039 140339 200891 285588 338575 363111
19804 363111 327641 168073 151912 272867 360748 306257 218704 206837 214897 300354 409897
19793 409897 473897 371509 342313 252398 253752 309228 202033 255765 284729 370806 301885
19782 301885 122941 46271 71243 49408 55888 140823 247462 354721 443563 479877 427313
19771 427313 347085 333440 357446 374863 452687 379488 416567 515840 518128 543044 563711 596669
19759 596669 655673 688794 654045 714455 789493 828324 799855 818541 848278 797123 825265
19748 825265 908750 804581 759817 784774 729381 862432 963406 948827 915631 819550 752240
19737 752240 880296 941183 731846 645127 733331 837495 988807 1060879 1155491 1240379 1237284
19726 1237284 1154101 1070416 1177123 1203958 1137185 975288 920842 910746 721882 623350 647766
19715 647766 623882 634887 575319 599428 676747 590721 524910 706418 673976 564959 527651
19704 527651 501484 489525 497967 464685 449281 532532 467086 559024 537669 419639 412326 328738
19692 328738 283846 445835 652282 689348 669032 563314 574882 680721 654787 557545 544219
19681 544219 582344 632687 593297 506555 602788 647258 571279 533857 576841 659403 675896
19670 675896 581191 551758 634520 657149 644718 620483 601070 612095 624383 547358 501818
19659 501818 542173 659303 761799 899451 913910 833555 800371 749669 604696 547408 577301
19648 577301 668011 606435 639865 685655 719942 689587 684367 669012 693286 620855 774804
19637 774804 764142 730413 715585 682185 686675 642490 508937 441566 400306 482842 586412
19626 586412 534628 558910 794518 828958 718466 699026 819046 809910 802353 852013 939051
19615 939051 926619 864365 827845 717338 605269 560221 685867 685883 766973 895231 905322
19604 905322 784919 742164 701414 716747 748382 707535 733786 703349 633946 694303 604626
19593 604626 577042 556465 552979 615137 665762 707544 576540 472499 377639 296271 405508
19582 405508 540816 561233 514017 449059 527365 499888 498810 476996 453687 488122 570351
19571 570351 516136 555743 600432 528019 496420 511147 595332 487529 412224 492210 600058
19560 600058 599608 621099 541947 595894 700566 777252 729234 650815 636806 707934 818137
19549 818137 855867 870564 771683 865432 821420 827533 666975 614624 697702 823774 877376
19538 877376 915595 918181 898068 897789 773125 658160 636866 727055 904698 997222 960809
19527 960809 957843 817973 796839 769088 828015 897352 1038344 923273 828227 912372 916165
19516 916165 830574 793246 832091 812086 811039 790942 713305 746566 843594 896407 964717 1027679
19504 1027679 967256 912538 765439 762048 895682 1107963 1124890 1079753 1103279 1056811 1021468
19493 1021468 920895 835309 945349 1002371 1120979 1069206 1046511 1073011 954761 961989 983999
19482 983999 832909 757559 820562 917355 1149384 1182928 1029727 1040905 1120791 1143534 1207996
19471 1207996 1171949 1086953 973283 1020509 1065093 1081095 1043582 1061631 1038072 982082 1045249
19460 1045249 1125074 1148494 1050286 1020900 957839 943415 913167 1009793 1087797 1112591 1161036
19449 1161036 1106730 1099107 1117138 1216291 1194469 1185709 1075260 1081547 1081783 1051902 1040339 1263025
19437 1263025 1312083 1252932 1240493 1195519 1151785 1221343 1166975 1104081 1233491 1226858 1218028
19426 1218028 1273470 1304935 1293517 1292104 1256311 1288855 1331321 1435487 1476760 1440210 1397067
19415 1397067 1356247 1263310 1125264 1172591 1265647 1234249 1431237 1548564 1587859 1417813
19405 1417813 1304356 1340605 1355619 1335030 1314988 1465582 1608934 1602362 1592759 1515950 1298371
19394 1298371 1326487 1438279 1434305 1439421 1627646 1638693 1537417 1494288 1539029 1509254 1445453
19383 1445453 1540690 1648684 1707631 1665353 1602474 1536974 1608476 1766628 1786995 1873626 1945293
19372 1945293 2005966 1937486 1981507 2020686 1960798 1981666 1871879 1904010 1968554 2200240 2154603
19361 2154603 2134282 2254665 2347526 2345365 2456662 2567273 2498101 2526866 2508523 2613724 2655689
19350 2655689 2552049 2534538 2507137 2400745 2209856 2177914 2183881 2197346 2247049 2272827 2271508
19339 2271508 2242882 2354711 2488906 2435856 2294452 2352026 2434356 2523869 2493538 2388651
19329 2388651 2384367 2402655 2526941 2614490 2610962 2544442 2536372 2598915 2711791 2685966 2525885
19318 2525885 2467099 2560465 2667222 2727699 2725029 2592489 2519179 2547403 2539155 2542734 2635274
19307 2635274 2770547 2867840 2906151 2933797 2927584 3015344 2966009 3020365 3096782 3197776 3173982
19296 3173982 3213120 3220657 3249648 3220057 3233136 3293861 3398685 3501938 3399301 3367376 3282944
19285 3282944 3230786 3318398 3502357 3584018 3637446 3713126 3778338 3812237 3811481 3772144 3719090
19274 3719090 3707619 3736646 3847382 3975669 4066443 3973499 4087105 4284848 4347385 4425791
19264 4425791 4461562 4622878 4747148 4859614 4962965 5130026 5322015 5518952 5772006 5897182
19254 5897182 6104316 6401647 6791711 7311526 7850229 8430191 9059486 9615035 10465566
19245 10465566 11791063 13652569 16190976 19505509 22903160 25613513 28388770 31902288
19237 31902288 36352443 40083098 41661362 42403787 44972092 50903594 58966102 65210363
19229 65210363 68173253 71560376 77591505 84218995 86415013 82207411 75925228 71630002
19221 71630002 68998699 66275602 63344782 60608876 58366680 57758244 59910862 63461707
19213 63461707 65415092 62893747 57590650 52675847 48437637 42976930 36562597 30896371
19205 30896371 26955639 24436021 22672642 21336550 20407003 19779908 19355896 18995902 18564267
19196 18564267 18278677 17940962 17547182 17170208 16763055 16525637 16376529 16242367 16026126
19187 16026126 15877673 15768121 15709074 15711350 15720169 15515925 15540325 15665183 15868268 15967252
19177 15967252 16092976 16424334 17033348 17979919 19464658 21825303 25154744 29073293 32066728
19168 32066728 33696521 35372444 37402991 38718476 37708902 34573627 31803585 31352623
19160 31352623 33507859 37410030 42164088 46920355 50440747 52715756 54195466 54169975
19152 54169975 51801851 46386477 39664910 34204971 30959537 29955154 31022987 33289808
19144 33289808 35666729 37084636 37867520 39031641 40441654 40483113 38303837 35225365
19136 35225365 32739123 31626622 31521452 32314218 33747256 36014949 39586011 45381246
19128 45381246 54373196 66497715 80316524 95065387 112044709 133340098 155992735
19121 155992735 172151071 180423257 185729195 190817556 191693017 182833100 167732234 153238059
19113 153238059 139803528 124522039 108960288 96519372 87168546 78260025 69903209
19106 69903209 63992496 61347668 61426678 62340596 62427527 62107397 62361139 62626271 61452620
19097 61452620 57493789 52158937 47681323 44551439 42411283 40877921 39717029 38678067
19089 38678067 37903758 37303284 36684362 36296368 35971424 35600509 35300353 34988050 34705531
19080 34705531 34292598 33807815 33397480 33110924 32877429 32567350 32308592 32207056 32232594
19071 32232594 32219896 32145828 32105647 32155118 32212809 32388164 32582906 32743061 32960838 33066374
19061 33066374 33010115 32701860 32322839 32046960 31740326 31228254 30745459 30237855 29791700
19052 29791700 29538287 29442181 29282149 29052279 28781931 28640945 28531527 28388168 28246908
19043 28246908 28150404 27991588 27757433 27512795 27242599 27229591 27297424 27043209 26816068 26619450
19033 26619450 26494213 26366450 26034623 25794353 25702574 25489062 25295796 25237199 25077685 24787833
19023 24787833 24562113 24420457 24210663 23974328 23723858 23488177 23294597 23239179 23180349 23036872
19013 23036872 22709415 22436387 22153632 22020451 21921778 21776635 21687317 21414382 21054797 20751804
19003 20751804 20575236 20512452 20368528 20299911 20291512 20309678 20239789 20216632 20129822 20045625 20162017
18992 20162017 20155708 19963450 19762312 19448399 19145862 18881176 18696703 18348377 17922911 17719240
18982 17719240 17476647 17273820 17081677 16783305 16656481 16441510 16199198 16039074 16016138
18973 16016138 15793624 15687048 15505459 15192598 14815509 14643596 14611506 14493027 14196350
18964 14196350 13852894 13678147 13552140 13397222 13250041 13061353 12942770 12870774 12777091 12647420
18954 12647420 12483431 12318653 12177989 12084927 11900200 11832211 11593118 11422462 11241505 11180663
18944 11180663 11128011 11030430 10909494 10938457 10870151 10723445 10596602 10518889 10485193 10392441
18934 10392441 10252486 10212656 10066122 9870279 9755518 9587259 9439942 9342376 9202486 9105924
18924 9105924 9058197 9081242 8920841 8802670 8729399 8687374 8546596 8402353 8285303 8278579
18914 8278579 8325598 8068116 7942750 7855413 7912255 7810519 7756396 7767588 7654330 7623844
18904 7623844 7599486 7445270 7333967 7345635 7263019 7233568 7120327 7081654 7132118 7022865
18894 7022865 6925897 6817733 6691493 6599515 6590057 6513163 6432516 6474691 6448829 6390813 6330741
18883 6330741 6236237 6328167 6226706 6042537 5803221 5619888 5599626 5643910 5587643 5601364
18873 5601364 5642436 5505968 5337983 5395711 5441709 5421434 5215099 5299688 5325128 5308839 5266125
18862 5266125 5127065 5086927 4961176 4922814 4869566 4898798 4908684 4720997 4688281 4688111 4784751
18851 4784751 4729867 4597132 4540988 4553412 4366492 4259827 4280960 4232690 4272859 4207381 4138324
18840 4138324 4132083 4094411 3983195 3941303 3836988 3719331 3851004 3919405 3861258 3896827 3881057
18829 3881057 3905187 3910516 3879766 3726436 3658424 3667225 3579892 3572024 3585362 3610060 3470408
18818 3470408 3393773 3353693 3486294 3362411 3217701 3319770 3442271 3523632 3474997 3293499
18808 3293499 3186114 3208065 3251729 3237177 3226290 3163329 3166211 3093120 2914798 2805301 2837458
18797 2837458 2833280 2814873 2847657 2833820 2946288 3025380 2906860 2781907 2857723 3018251 3046066
18786 3046066 2909264 2824735 2784119 2755119 2914938 2982328 2835209 2798690 2829971 2820724 2715577
18775 2715577 2734212 2837591 2840820 2896882 2999040 3000337 3041584 3047613 3020127 2946110 2805423
18764 2805423 2765425 2547760 2344134 2245969 2287694 2267297 2192264 2109223 2121286 2120322 2204648
18753 2204648 2274574 2338945 2267438 2342381 2443689 2536013 2689270 2704636 2566016 2371984
18743 2371984 2345233 2441412 2638883 2667326 2648677 2758828 2861679 2988082 3133562 3195442
18733 3195442 3154630 3123910 3096702 2932993 2832143 2777134 2762891 2682116 2467816 2422689 2403898
18722 2403898 2475566 2564439 2526820 2544834 2553565 2535419 2569572 2591996 2513012 2562372 2675352
18711 2675352 2686646 2438959 2441652 2380566 2344473 2452279 2493232 2453043 2436011 2423843 2384419
18700 2384419 2396069 2437430 2597927 2719009 2831549 2854626 2890679 3018349 3122772 3245155
18690 3245155 3248417 3280012 3285572 3233460 3107135 3010931 2805297 2669035 2733375 2752607 2829932
18679 2829932 2855094 2898783 2910412 2891450 3056851 3430638 4020240 4646745 5164987 5327737
18669 5327737 5633512 5958715 6004673 5903018 5564376 5424253 5670732 6596882 8033335
18660 8033335 10011645 11739815 12628316 13262099 13928301 14469455 14180389 12398264 10254072
18651 10254072 8747949 8020671 8124408 9045044 10272168 11226078 11768610 12245549 12850822
18642 12850822 13217774 12495890 10863607 9305729 8219765 7624443 7262971 7043416 6985301
18633 6985301 7130230 7576997 8027782 8602709 9438292 10443850 11747233 13366333 15830072
18624 15830072 19582001 25090413 32413914 39803472 44927373 48927664 53410027 58351369
18616 58351369 61623386 61106460 60547574 65030828 75472701 88987916 103024486 117099786
18608 117099786 131666240 144694921 151139081 147596963 136510514 122794086 108977085
18601 108977085 94995728 80039877 66769229 58363767 55352580 55695066 56173691 55770453
18593 55770453 55669346 56163428 55785458 51678234 44412458 37031134 31558850 27927694
18585 27927694 25678115 24083106 22837374 21784812 20904393 20186272 19683960 19292517 19233050
18576 19233050 19344629 19587548 20315999 21672821 23976205 27690091 33361587 39894700
18568 39894700 45493763 50956664 57867773 65007953 68778494 67242256 63123747 59508975
18560 59508975 55605724 48920381 40629863 33586722 28868531 25426550 22728489 20585165
18552 20585165 18974938 17802689 16823950 15763853 14840635 13817101 12941358 12322638 11971573
18543 11971573 11684896 11285077 10954794 10726858 10549830 10465544 10184837 9812655 9496474
18534 9496474 9413918 9258990 8910797 8662403 8553888 8444581 8447674 8342383 8161390 8003322
18524 8003322 7909119 7957879 8432017 9069396 10104526 11603348 13278253 14717422 15988375
18515 15988375 17661337 19454976 20152515 19139112 17483844 16301800 15405526 13681450
18507 13681450 11528395 9746344 8551716 7951395 7441896 6904656 6564286 6275325 5931943
18498 5931943 5689108 5543821 5405554 5297814 5333953 5218105 5149423 4969902 4809443 4645725
18488 4645725 4594973 4515207 4424549 4413253 4518838 4580810 4675625 4776267 4852198 4968209 4781815
18477 4781815 4543417 4387792 4221797 4040887 3893559 3711603 3568332 3458235 3377954 3122810
18467 3122810 3081265 3144865 3185877 2939039 2839256 2947731 2825975 2572395 2424883 2521863
18457 2521863 2625522 2668666 2559630 2545979 2500418 2455670 2363402 2363369 2303087 2299273 2192839
18446 2192839 2150179 2137586 2001035 2005698 2163734 2261503 2328826 2307382 2198724 2204603 2303665
18435 2303665 2346015 2283121 2216863 2220409 2218365 1980669 1818983 1773997 1670188 1599883 1544759
18424 1544759 1574256 1674597 1720368 1615199 1536916 1450562 1352721 1309196 1291730 1288805 1217071
18413 1217071 1256584 1270984 1255683 1240169 1194305 1191354 1085447 926784 963200 1018960 1059014
18402 1059014 1101461 1123500 1077847 1038144 1061789 1028237 970835 972918 885849 790762 869422
18391 869422 972589 964946 1052185 1074847 1048982 974581 939250 952809 932160 873037 768854
18380 768854 802219 746834 836846 892045 706709 490422 474402 523943 582801 682375 672724
18369 672724 628276 592983 536642 598299 756685 745983 740737 769762 692271 633229 601729
18358 601729 680638 709719 625469 611689 680333 617350 535799 455394 488371 528460 579152
18347 579152 606318 605360 669147 724178 643589 675821 620708 671538 659048 460054 464611 498690
18335 498690 542664 623051 719522 745744 725951 713122 667443 560715 541842 648059 664664
18324 664664 600826 424789 155686 61642 241072 399469 468802 621075 696036 809764
18314 809764 718387 456715 351857 388696 464437 600424 578958 447279 372151 349218 377600
18303 377600 359743 335235 294334 162430 118698 293255 290956 358020 286435 261895 249000
18292 249000 269962 363934 359661 208481 185939 281485 334027 316608 236512 256615 291211
18281 291211 490857 538491 306868 141785 184855 334320 345631 380963 249635 159739
18271 159739 276832 433745 488800 445936 415995 329537 324925 346195 361932 175321 145315
18260 145315 145292 170424 186678 273154 322965 426426 250923 151677 226521 240370 272109 301993
18248 301993 244573 192449 275803 382638 466796 465801 333600 276641 280473 264490 182560 160632
18236 160632 253538 268872 268484 488014 500735 344757 287039 287222 263090 236175 86881 -2760
18224 -2760 70652 114054 156632 182424 136261 139618 137854 240817 345975 264882 162239 262843
18212 262843 236228 221211 269657 335319 302021 253448 160201 152552 175365 144157 153701 179842
18200 179842 264728 322771 294234 236053 233054 236569 122945 63266 70814 98234 134777 148329
18188 148329 192756 166870 204687 304206 233360 163276 315965 318104 238519 126330 13479
18177 13479 77524 221960 182663 149981 167016 160365 125129 189959 145437 122531 168671 245471
18165 245471 214992 16155 46604 51601 82303 124475 193494 127799 165045 124801 188567
18154 188567 239630 230141 194410 204774 165520 169699 211753 325196 252909 256461 128265 19813
18142 19813 10969 139429 93702 -10244 25362 3991 72024 185673 139348 121274 130771
18131 130771 9250 119806 219962 274572 224776 206957 59576 64550 201725 207529 222284
18120 222284 166720 191967 315481 370121 428061 426383 342254 335279 297313 392200 389919 383610
18108 383610 329901 298503 267843 315653 221740 183333 174130 154337 263062 432962 506496
18097 506496 446358 462684 446165 346712 240474 62862 89909 186636 199189 294651 317453
18086 317453 341176 161923 121537 93640 50964 20658 81957 80109 36614 82965 263780
18075 263780 348993 199381 174634 100544 162267 277832 415404 501304 415038 340629 360690
18064 360690 356602 348745 419636 403945 376367 289121 310443 353994 370958 407924 493495 426604
18052 426604 316687 312124 351207 440401 493476 485043 485850 557910 624215 640388 518809 504529
18040 504529 453912 166637 125538 183634 153480 156931 110072 103207 187494 199906 174201 144754
18028 144754 262904 333408 154264 186819 156959 42565 29856 42793 -38208 37782 158387
18017 158387 158505 136210 166739 162095 213933 245959 115323 90501 109047 38772 57020 106257
18005 106257 116541 -40013 -139737 -73989 -37526 6457 82459 145761 213674 220841 317737
17994 317737 252850 240136 275986 288351 330166 361232 278715 193015 41144 36349 44186 70066
17982 70066 49327 51374 106223 29389 -44308 58433 91338 129220 107622 -13983 -58207
17971 -58207 50350 161768 167700 245169 257146 153980 191095 271616 282401 91367 -7716
17960 -7716 29035 -67485 -65142 24216 135705 73894 -85102 -86377 11076 94603 11768 -152967
17948 -152967 -174995 -88950 39484 74836 7738 -38818 53449 30371 54064 96468 189612
17937 189612 180000 103964 50818 36018 -43822 1159 82393 78334 18425 -85018 -66426 -99948
17925 -99948 -87364 -112921 -65682 25190 163096 260925 236889 158572 163724 55133 -80594
17914 -80594 -38407 48576 41674 706 -8318 29723 53307 58450 12188 75933 115733 -134367
17902 -134367 -292900 -172716 -57073 95713 144384 136769 120646 133079 100553 145857 237254
17891 237254 207928 147313 185024 365089 368283 231725 97580 72711 52447 16840 42566
17880 42566 154185 10672 -80717 -82381 27930 -94717 -176643 -80922 14525 37733 169209
17869 169209 263621 360485 266673 60296 -15003 -59776 -116166 -241870 -253664 -227443 -107379
17858 -107379 -37362 51703 29464 -5855 -103687 -111814 38765 255165 186006 172663 190164
17847 190164 89821 65975 122046 205726 147047 -10742 -54923 63517 73105 -23538 -79067
17836 -79067 -1322 76290 -11690 -48637 69868 89042 38684 19290 6664 28682 -17725
17825 -17725 -122490 -98245 -51863 58606 166226 158386 166499 179537 171257 170164 154670 123858
17813 123858 110222 55611 -1995 17983 -43408 -105338 -126002 -90778 90834 63780 17406
17802 17406 -40674 -36980 -21210 -39859 -12777 29692 31206 95783 12862 -49501 45738 -1192
17790 -1192 10962 43291 92739 204397 210199 100434 79676 65220 43047 61946 -76258
17779 -76258 -204538 -181803 -205709 -181889 -24633 75914 153856 253671 282877 226394 190213
17768 190213 178164 24017 23646 107606 127602 155099 105484 44231 30145 -25211 -133779
17757 -133779 -186061 -240934 -144257 -130802 -104597 79754 59220 -42519 -101764 -109799 -128657
17746 -128657 -41118 154702 196763 175977 167464 147558 155560 59774 -57171 -16056 -78510
17735 -78510 -29705 -11098 -41476 29902 36886 60623 105167 86376 92965 76540 19387 2341
17723 2341 -49384 33345 196082 230317 138888 93650 120194 48571 -51150 -107073 -106583 -80868
17711 -80868 -46861 -67586 -36302 -101234 -84326 -27266 -20161 67395 104972 -21258 -168415
17700 -168415 -129762 -49352 -98977 -50534 48015 25064 -49972 -29470 -76882 -128219 -51607
17689 -51607 -35151 -65504 -120592 -139979 -71103 46569 55812 95143 93144 -50152 -57347 -33852
17677 -33852 -192 -71699 -142968 -6524 -48881 -65836 -43457 -49163 115991 149929 110747
17666 110747 66228 65702 29754 -78245 -52019 -7512 -60228 -46183 -12423 15813 9784 70880
17654 70880 96925 85287 12929 -44488 -74410 -146740 -44221 -56098 -96114 -81012 -12108
17643 -12108 47799 -95166 -251877 -173110 -127838 -186 53635 81996 128235 55658 -54247
17632 -54247 50303 86448 51312 16274 14949 -3884 32881 -80313 -113642 -67930 109826
17621 109826 34063 -40020 -69621 -92190 -162104 -116777 -102428 -186258 -273453 -226870 -86211
17610 -86211 -40904 -22062 48997 -60176 -107405 -93198 -118331 -69517 33949 -44858 -142489
17599 -142489 -189182 -187906 -208665 -282444 -252582 -119037 -13533 40586 41224 65895 -40761
17588 -40761 -132715 -67708 -65965 -120452 -146997 -215273 -131628 -14621 -59548 -138922 -211550 -179925
17576 -179925 -6270 90804 68249 154290 287240 313297 115022 101695 158407 88616 39135
17565 39135 -35007 93877 112152 90782 70511 -1833 -60924 -124011 -109925 -149410 -74758
17554 -74758 -40067 -121420 -31518 -8051 77455 137117 161994 272788 133775 35067 113958
17543 113958 174156 99411 112199 -21132 -32067 138036 30799 -128687 -119446 -48805 -167914
17532 -167914 -135841 -134275 -110847 -87351 -103406 -160165 -166425 -128198 -97396 -128333 -91634 -125574
17520 -125574 -23568 -54741 -88840 -83909 -124358 -115616 -742 28581 -25558 64958 154827
17509 154827 170149 60349 96281 48125 -62216 -200512 -245769 -110661 9779 56726
17499 56726 92964 178439 51400 -203935 -239213 -252433 -231244 -333874 -255531 -32440 80246
17488 80246 77379 -75121 -159864 -72627 -134546 -163305 -127023 -68133 79098 83461 53861 -11468
17476 -11468 62721 124390 162772 83989 -35067 -169195 -131988 -19845 41465 92594 37451
17465 37451 -54196 -1892 22055 -61960 -209834 -133652 -85014 -198867 -190748 -134983 -37931
17454 -37931 103185 58197 -28158 -41599 -156196 -266203 -196737 -193886 -167651 -267410 -199058
17443 -199058 -204417 -272256 -225520 -147490 -150001 51450 182570 135992 106348 111428 70983 -47398
17431 -47398 -22513 -36774 -9314 38340 34350 43278 -8753 -6743 -49615 -48439 -149349 -156004
17419 -156004 -170021 -104823 21699 25265 84247 52906 71895 79684 -29932 -107844 -95223
17408 -95223 -30817 -24206 -126766 -244339 -103766 -108191 -136320 -84396 -59145 15259 3341
17397 3341 -83096 -163979 -162258 -109342 -144392 -141727 24775 39408 -58483 -109379 -105866 -194012
17385 -194012 -137727 -8911 -131165 -174998 -62027 33816 4870 -8466 -29167 86796 169533
17374 169533 141587 119327 -5962 -20887 50987 -66775 -149643 -151586 -116848 -118818 48915
17363 48915 -36097 57518 147386 139590 106264 22243 -34737 65027 40375 133152 84257 52225
17351 52225 -29671 -72906 -41663 17188 -47211 85673 131618 76997 -25551 -58488 -49699
17340 -49699 -47531 88162 151607 102102 60080 129328 14045 -201793 -264561 -403095 -377093
17329 -377093 -335776 -323776 -222677 -59286 99430 117616 65697 22357 43682 65963 66363
17318 66363 113422 -5630 -47073 1161 26252 150036 203614 181802 117660 93100 234765
17307 234765 253525 262216 227517 171222 75284 80782 1344 -72961 6993 -9313 -78199 -104158
17295 -104158 -75841 -66663 15113 68558 26772 14406 24592 39660 55283 116569 157074 166446
17283 166446 194279 243229 221829 81204 81509 74846 472 -98780 -191825 -134718 -119062 -225087
17271 -225087 -140010 -108516 -92809 -29869 17585 -99372 -119695 -86116 -63513 -117180 -164807
17260 -164807 -44544 -32745 -18400 -11576 78255 106913 76543 66399 31617 -64442 -142727
17249 -142727 -30962 124143 99064 -15301 -141 18087 -45475 -78483 -166652 -94749 -53061
17238 -53061 10639 78687 82152 93970 66373 -63122 -232914 -247041 -113846 -76838 107258
17227 107258 -11138 -154456 -120942 -86556 20661 114605 111594 53929 -26600 -38676 83170
17216 83170 145795 65308 -35663 -14920 -36906 67059 99520 7865 -75739 -109182 -45719
17205 -45719 -142375 -185656 -66976 26183 -14892 -122936 -77456 93224 80774 -33162 -49062
17194 -49062 10107 105687 207584 258253 131594 -8476 12576 -96252 -136745 -91038 -60352
17183 -60352 -54154 -89851 -104573 -112745 -139448 -173652 -68030 -55102 -115902 -69755 -15825 42232
17171 42232 52192 48885 -36530 -25833 86210 164991 155535 9312 41825 -17298 -72449 -75995
17159 -75995 -69760 -224295 -379297 -298846 -201012 -172966 -236368 -245120 -236793 -107659 -33276 -81155
17147 -81155 -41765 -20019 -87028 -165103 -130140 -71172 -33910 -45601 -93429 -31018 60271 51081
17135 51081 -98028 -97317 -34830 -65192 -66396 -150087 -164956 -101993 -55470 -68103 -61284 33748
17123 33748 -50793 -84672 -100638 -15246 -128833 -117093 -73183 30442 -27981 -41721 55121
17112 55121 84180 20614 -18037 -68249 -67063 -40853 -25906 -32648 -128666 7999 55585 -14073
17100 -14073 -80048 -71666 2116 -14977 53300 23714 65325 44289 -26799 -23064 -76391 -15229
17088 -15229 -87194 -169941 -128171 -58535 -66994 6459 143236 209403 199108 147895 7206
17077 7206 -42263 -41115 -86207 -69988 -69928 -43597 -55573 3412 23640 -19772 -10524 -100654 -164076
17064 -164076 -124831 -151022 -233441 -192785 -251224 -356598 -199414 -86240 -130304 -106389 10026
17053 10026 93252 132264 136961 148220 112524 86964 -63603 -125330 -120955 -169825 -221470 -103995
17041 -103995 49877 86575 138218 131503 -5901 -52649 -101392 3912 84473 163498 153502
17030 153502 77786 82531 97506 23098 -714 -86352 -204345 -193179 -150958 -278876 -394642
17019 -394642 -312610 -215984 -132000 -41655 -85695 -87338 -2434 56623 11549 -53170 -7430 35033
17007 35033 -13870 -44634 -184498 -302498 -301524 -247697 -152326 -174203 -262104 -252168 -214035 -34226
16995 -34226 -67414 -196300 -291463 -282132 -208904 -37946 -105355 -104119 -185194 -139530 51622
16984 51622 130666 50140 -9099 25331 42620 -16533 -63037 -17552 -86112 -179527 -304811
16973 -304811 -221370 -129606 -150867 -87202 -64681 -81857 -34618 8581 -133583 -59992 67812
16962 67812 -26353 -9936 362 64166 21248 78144 131950 61737 188927 266004 238893
16951 238893 170825 151605 143811 65861 33050 72619 37381 5481 -9246 -13721 -111010 -200937
16939 -200937 -144560 -46663 -31640 -3810 -137737 -102564 48000 19432 -66942 -49106 -117460
16928 -117460 -147576 -42948 -56995 -141454 -102478 -33650 55127 155677 81830 -10977 30001
16917 30001 -67088 -91009 62238 93974 -54990 -129179 -167686 -113699 -58033 -78431 -75065
16906 -75065 -83263 -131884 -86479 -127206 -83555 -18794 -66139 -35449 49867 79828 58244 34098
16894 34098 5506 60203 123974 76218 -39377 -24426 -60586 -17903 39509 -52021 -107856
16883 -107856 -106936 -31241 -10252 -23018 -61114 -135174 -67582 18934 -24499 -8813 77026 113136
16871 113136 53424 -12525 20325 25728 -76279 -54940 -73079 -77607 24419 55909 -17151
16860 -17151 -27993 37553 58856 131959 128491 165411 142069 -51017 -188295 -64831 -5047
16849 -5047 30694 -6749 -45851 -25917 -56207 -53222 -61634 -8866 75213 -3791 -57217 -93130
16837 -93130 -55081 -3940 168348 136295 110804 69386 57530 -6097 -163808 -125587 -16832
16826 -16832 11006 -137779 -174242 -79951 48806 -41561 -121551 -47197 -59221 26178 165653
16815 165653 158859 43723 -10565 -44399 -112558 -120935 -98770 22057 8885 -139603 -87640
16804 -87640 116217 -11650 -6874 23126 52409 179868 273282 117361 -65543 -70474 -80181
16793 -80181 -47807 69879 91556 1354 -107650 -132049 -154545 -115384 -149577 -242812 -168640
16782 -168640 -83510 -56771 -27382 67499 56238 -71499 -251707 -249612 -119076 -107956 -166662
16771 -166662 -134260 -158176 -174873 -57448 39611 -3537 8352 -35038 -73126 -30592 63065
16760 63065 68945 124630 56981 1067 -87263 -188291 -155122 -89799 -100492 -11738 8076 -105249
16748 -105249 -140356 -213207 -284803 -146820 -47895 -95043 -205325 -179552 -150045 -119836 -46616
16737 -46616 -35183 1479 -76606 25913 80619 94316 72364 -4124 -153208 -251107 -239895
16726 -239895 -205933 -185652 -70359 -78262 -37769 -39813 -52939 -72901 -44797 73052 108558
16715 108558 243092 263165 371076 361544 257417 140215 552 -31370 -68737 -57740 -130358
16704 -130358 -137068 -34779 22704 -19609 -69346 -135890 -129318 -168732 -143622 -90906 -63365 5420
16692 5420 61727 67704 22813 -60224 -264048 -242149 -126288 -103012 -12724 98399 50156
16681 50156 -9991 -88993 -148900 -114836 35392 144821 133384 158401 204506 39225 -18164
16670 -18164 -35253 -130087 -98413 -65534 -65590 -22370 -115364 -177282 -181542 -173271 -12594 44340
16658 44340 -17217 -78837 -88562 -116380 -170977 -220726 -243924 -335151 -311521 -235139 -168099 -108326
16646 -108326 -64874 -17141 25130 42567 -125078 -120049 -49277 -47624 -82206 -85625 -61528 -134910
16634 -134910 -179976 -125212 -110116 -180319 -195178 -54650 64730 -65225 -98348 -64062 64483
16623 64483 102314 78846 135420 128991 25290 -40683 -149381 -30512 44713 -17082 -88682
16612 -88682 -246965 -163166 -217162 -242797 -132224 -67109 -135495 -184032 -255181 -132970 58864
16601 58864 155128 131339 80419 120939 72404 -28829 -24545 -5892 36972 26614 104944 109733
16589 109733 4806 -19622 -8304 -2718 -77760 -80612 11488 5931 35809 31765 47071 76175
16577 76175 31021 -25474 6837 74011 31820 -32898 2592 135462 130262 106080 58813 -101066
16565 -101066 -115582 -144080 -127191 -116033 -29007 32215 -42363 -144336 -234186 -186836 -148208
16554 -148208 -135583 -114698 -55861 -22481 39770 106184 222959 265485 111997 -58030 -14448
16543 -14448 61568 -57672 -171645 -141716 -101765 -63934 -84044 -111744 -123289 -147167 -152229
16532 -152229 -128037 -6483 -41890 -108916 -103070 -31928 -89586 -90973 -78309 25442 -27749
16521 -27749 -52379 86405 148109 41390 1467 -127963 -119337 -121349 -159764 -167944 -127788 -121541
16509 -121541 -197271 -273031 -167134 -108974 -113071 -209477 -214925 -123876 -64939 -29889 -47823 47930
16497 47930 64527 24832 -13535 68422 60240 41385 111686 -11417 33402 122140 152689 94381
16485 94381 1047 -48524 11977 51725 70815 54038 -5107 81001 30652 -8310 -1492 20675
16473 20675 175351 218965 199148 157606 92234 66487 42157 25018 -24328 18761 -4324
16462 -4324 -37566 -100301 1687 61654 152105 149622 100113 46073 -46385 -127968 -233113 -225249
16450 -225249 -191538 -210884 -251288 -169544 -147085 -119583 -107780 -104966 -165454 -196169 -72900
16439 -72900 12994 83820 192062 225675 113335 54000 7075 86000 147101 239694 63543
16428 63543 -9907 -17381 -42497 -166712 -143537 -146211 -242026 -104324 95538 112222 86230
16417 86230 102144 6608 -58556 12890 23803 -45784 -16060 -66241 -96062 -321754 -280072
16406 -280072 -110085 -99584 -128245 -152485 -122419 -20887 129573 91332 20054 25370 53922
16395 53922 54697 124896 80409 -3192 8333 50768 108011 51602 -49472 12473 94929 7183
16383 7183 67427 38716 34643 12830 -8304 23324 -55222 -81172 -153419 -52795 -40691 -26231
16371 -26231 -29402 -24677 7685 31751 67726 -5853 -51544 -31622 -93023 -265908 -326737 -268995
16359 -268995 -133374 -62635 -109993 -92046 -56188 -15692 -31283 79797 -27637 -96445 -116487
16348 -116487 -68355 -67536 -16948 73279 15222 -123723 -215236 -146848 50702 30332 -159140
16337 -159140 -129396 -131674 -88748 22190 124234 33674 107385 29332 -79699 -124718 -43978
16326 -43978 22987 -55155 -105779 -146745 -98592 -17496 71975 124977 77460 64286 -29082 -128472
16314 -128472 -134511 -80885 -20737 -166285 -204933 -123694 -105198 -171138 -236770 -273934 -250094
16303 -250094 -205461 -131320 -69491 -93290 -68013 75738 76244 52785 -73345 27767 80019
16292 80019 58655 -12617 -45044 -8594 -37501 -40709 -31002 49229 34465 28966 -1291 35236
16280 35236 -30822 2687 43195 95759 99700 141440 170512 106047 56608 -56356 -33176 -44285
16268 -44285 -96154 -118758 -31197 -24617 -96763 -171857 -139208 -21382 43410 19507 -25720 -54404
16256 -54404 -151424 -106552 6867 6743 17771 -46419 -38521 20700 -103122 -157142 -149518 -172285
16244 -172285 -220760 -241556 -141167 -105897 -125069 -164393 -155229 -63944 -35907 -16934 -18764 -39932
16232 -39932 -6499 -62470 -82153 -172783 -105063 35445 50767 -13087 -129661 -250175 -212223
16221 -212223 8902 69347 11405 49174 266213 384655 241306 60234 -7403 30015
16211 30015 172785 132601 54698 -96700 -72231 -15971 -27882 24399 65209 18986 -18753
16200 -18753 -75923 -296229 -264802 -56366 -65907 -67930 -86732 -68505 -75022 1380 -14335 25896
16188 25896 95340 -7390 -94814 -128133 -289688 -316269 -152265 -108658 -211441 -374865 -333582
16177 -333582 -173095 -35149 -57438 -145414 -203069 -164295 -159355 -132933 -82151 -97577 -80248
16166 -80248 -61161 -163921 -153138 -85760 -85913 -46300 121365 18930 53148 -35507 -12189
16155 -12189 -13890 -93248 -185387 -154372 -149836 -144061 -166075 -199787 -188569 -81351 -102502 -83089
16143 -83089 -35075 -6647 -166117 -207244 -156598 -83746 -69277 -10522 -106578 -43924 -55830
16132 -55830 46007 -21271 -20311 -12830 -67395 9987 -63512 -112259 -198690 -195132 -153102 -88592
16120 -88592 -72134 -197108 -179625 -147288 -44675 15778 -131512 -180774 -97098 -48803 41217
16109 41217 150571 155061 125348 83806 100211 27504 -47347 -112151 46650 119333 -67921
16098 -67921 -106925 -23091 -7660 44644 71833 25120 -64044 -157990 -193164 -42297 25744
16087 25744 49229 91217 142314 115006 49116 163601 159998 34773 28327 -50369 3282 -24610
16075 -24610 -77618 -17954 78981 91210 41403 -21288 -61156 -125681 -80703 33333 101823
16064 101823 157912 240846 133344 147877 99591 11765 -38856 29336 150590 136550 52845
16053 52845 -17310 -76121 -149435 -105583 -31403 15027 -86377 -162295 -71348 -167798 -273643
16042 -273643 -264263 -212562 -146690 -92274 -117153 -108791 -108707 -240743 -277885 -131261 -80002 -159506
16030 -159506 -111070 -118589 -254475 -351603 -388968 -367345 -125211 -38068 -2188 -60405 54
16019 54 60581 -501 -2524 50554 80227 36148 -67082 924 23467 116754 131925 44223
16007 44223 57678 13613 -42121 58330 67332 -45341 -56729 -112900 85409 59409 -117109
15996 -117109 -118956 -103454 -7386 -49442 -69457 -73487 -59713 22896 33689 -4569 -59911 -184346
15984 -184346 -83338 -1438 -53647 -104430 -215361 -265738 -231934 -242706 -203644 -168461 -177105
15973 -177105 -220424 -223012 -258616 -127501 -93294 -14485 147102 126635 35447 93241 77665
15962 77665 -38711 -3178 -9229 -46941 -33433 30509 116560 71570 24902 -34030 -80646 -165277
15950 -165277 -253805 -191944 -117773 -81333 -38082 14303 2420 -115355 -177537 -141868 -120744
15939 -120744 -65224 -112389 -150644 -165351 -132831 -114439 -24848 -67670 -132408 20085 121978
15928 121978 83242 60816 92430 183769 145340 -46427 -25084 61309 91371 68455 53083
15917 53083 27575 -75435 -149885 -68339 -16105 -49915 -3446 52410 83973 114898 103588
15906 103588 65602 55415 13780 -80177 -93048 -49360 -28063 15724 -63982 -44573 61419
15895 61419 159182 215690 29718 -141236 -143728 -174147 -143495 -154760 -81100 17137 -36904
15884 -36904 -127356 -138602 -29237 -47031 -27961 -20115 -78310 -92394 -116538 14956 9209 -124975
15872 -124975 -75936 -12289 -4247 -21669 -26714 15396 92967 205803 244639 168858 -11182
15861 -11182 -18861 -141275 -153078 -110900 -210462 -51872 38506 -137055 -313552 -277168 -245389
15850 -245389 -167635 -142038 -150475 -30852 -4437 -56208 21085 53127 78961 74983 35550 -48586
15838 -48586 31306 73374 62914 81239 165742 126001 -26173 -34126 17357 -106606 -145017
15827 -145017 -131091 -63690 -118786 -330156 -364897 -286618 -289609 -181911 -33853 -13525 -42871
15816 -42871 -23077 16812 98516 -14613 -169556 -137650 -146775 -150251 -173750 -111082 -61370 -108914
15804 -108914 -36887 56294 -33299 -13605 -51860 -68693 3066 33691 -1505 -3813 -94774 -158867
15792 -158867 -64091 -32635 -37835 -60188 -132874 36952 7451 40867 42290 -143684 -211753
15781 -211753 -143384 -80421 -56413 61597 79230 9587 112008 21991 7543 50821 73117
15770 73117 158488 61319 97695 137027 117714 88155 150540 121044 40800 39177 12978 -58891
15758 -58891 -49767 -86272 -144978 -219643 -242802 -219129 -174775 -131242 -194838 -171140 -64796 -43448
15746 -43448 50538 173247 150535 -22466 -99410 -157979 -190130 -262990 -220196 -241050 -199395
15735 -199395 -73801 -93143 -155494 -79502 -12019 -91323 51803 185563 126853 147210 56138
15724 56138 97156 95550 29527 26104 65858 59121 49127 32358 155137 159242 14634 -74803
15712 -74803 -61141 -220076 -265674 -302965 -293386 -232055 -223573 -188763 -99672 -27450 -105028 -195707
15700 -195707 -222104 -223386 -242852 -168724 -111458 34748 88362 -13043 -86383 -93235 30042
15689 30042 102112 -17383 -88597 -31882 -133868 -231162 -250694 -169471 -68933 8501 -7409
15678 -7409 -53672 -164428 -210409 -269420 -288393 -234821 -184740 -118525 -124477 -117786 -86484 -108184
15666 -108184 -21564 5138 55348 -1282 -158559 -127185 -32326 -62349 -52041 100698 170632
15655 170632 143665 139811 94845 2022 -65511 -112946 -192682 -187654 -257887 -283147 -161617 -178200
15643 -178200 -194933 -123004 -24447 32749 -111412 -123814 -152125 -73363 177630 270812 166973
15632 166973 -65427 -111674 -123189 21414 84871 -3197 21676 -23928 38167 92026 120767
15621 120767 66416 60802 15176 30225 44077 -40043 -43737 -37433 -20778 -30291 -23823 41681
15609 41681 32285 -26631 -52971 13630 27016 14076 17411 -54988 -93786 -126147 -251578 -73432
15597 -73432 16933 -47950 -71081 27218 10520 17859 -26103 -116359 -129389 -73136 -110049 -207189
15585 -207189 -214393 -131182 -62689 -90033 -24263 -71060 -154867 -186102 -125009 -37235 -12177 4921
15573 4921 121055 180586 74260 -21358 44375 82593 18864 -79071 -143824 -136471 -72364 -132528
15561 -132528 -177350 -172582 -214687 -144618 -120890 -74899 -142110 -23093 98958 -71060 -142501
15550 -142501 -124677 -87996 -27163 -16354 -30531 -71204 44411 109704 53200 59363 75145
15539 75145 182222 172843 70475 50285 52667 36546 13943 -32716 -34907 -8930 46666 50768
15527 50768 -7283 -68298 -39902 28804 40105 57301 -7197 -105555 -34432 142988 246799
15516 246799 151144 47668 -94104 -132855 -171412 -279925 -282097 -101626 -49922 -121745 -68875
15505 -68875 -17682 -53871 -112964 -24935 27078 -52326 -104109 -81972 -73447 -87318 -126649 -66356
15493 -66356 -146751 -212067 -159730 -50146 86294 149802 94884 -52528 -111240 -80002 -22207
15482 -22207 9706 18630 125289 49803 -35231 4368 -7769 72769 87786 72599 19778 32939
15470 32939 190896 129905 -1600 30026 63033 -45257 -104123 -102368 -22907 60650 46215
15459 46215 -69392 -120358 30589 230353 326292 206610 73154 37538 -28154 -36121 -87656
15448 -87656 34891 99353 129202 149312 72452 33660 94282 113430 118865 139783 129931 163285
15436 163285 43146 -59165 -50100 -104029 -60858 -88771 -95685 -78869 -18321 -4038 -53076
15425 -53076 -168446 -52640 -4407 -45728 -83493 -143540 -179348 -72146 98342 170827 142215
15414 142215 106215 30413 -54075 -126148 -83561 -190590 -220201 -161385 -100818 -149855 -140297
15403 -140297 -175481 -207367 -148901 -83782 -3214 101621 106932 21981 -19651 -22323 -4715 -35265
15391 -35265 -77922 -98249 -83751 -56272 -130692 -225266 -143781 -115820 -32384 22818 -62410 -64378
15379 -64378 -84109 -164501 -226451 -28579 151723 141371 70367 70330 -65541 -33945 -72227 -180785
15367 -180785 -143461 -70987 -26486 46689 10638 -1693 -69663 -84204 -21459 -6241 730 17961
15355 17961 23809 69348 132407 97314 123293 125502 38648 1691 5102 -33143 -21966 84300
15343 84300 41596 -50904 29103 8060 -54067 -64268 15223 -50443 -22093 55439 35466 43674
15331 43674 86353 113926 2015 -8488 -762 -99507 -161817 -114235 -57641 -93655 -139321 -91820
15319 -91820 75860 246128 118908 13099 -38510 -4317 43540 62778 41365 35681 16575
15308 16575 16038 22976 -393 125917 142384 43454 60744 44631 -6388 23194 -31909 -32692
15296 -32692 55694 50454 -48538 -138619 -77214 21868 -12265 -72284 -71499 40944 77726 125474
15284 125474 12325 -108314 -69189 -53058 -69786 -46698 -19273 53444 89138 47330 -37783
15273 -37783 -6673 -75153 -99964 27229 171255 81710 55206 134619 19180 -60153 -76233
15262 -76233 30564 -2219 -69953 9643 15141 51153 57219 -14647 -101768 -41263 -42310 -187947
15250 -187947 -130791 -37116 56075 60314 8906 -88486 -183372 -78869 4244 30755 96689
15239 96689 170038 223950 119215 1189 -136329 -192111 -71447 64570 108542 16602 -86549
15228 -86549 -163493 -149463 -80405 -3818 -90223 -110104 -60514 16680 9777 18297 23419 17766
15216 17766 -79475 -120721 -116617 -4372 60750 53576 21341 56743 28561 128719 128278 96526
15204 96526 219958 302916 180845 19338 56235 138433 36539 -65079 36792 -6134
15194 -6134 41993 54541 72500 56120 5452 4600 -19519 -22406 -36569 -20640 113763 68119
15182 68119 84641 131808 -31529 -117908 8551 75584 -20236 6384 -27189 -54497 -77132
15171 -77132 -76809 -32295 -15992 14573 67296 129833 82631 150460 193204 169590 120385 87605
15159 87605 -8771 -163588 -169375 -151185 -151734 -175158 -173279 -172001 -84251 25515 101492 68929
15147 68929 -131417 -199074 -106216 -45054 -100598 -196592 -146625 -52455 -100519 -213997 -158305
15136 -158305 -84745 44769 84771 19771 -52174 -11797 -38429 -38274 -119802 -250316 -247171 -175596
15124 -175596 -79022 -101855 -128342 -91968 -55509 -66282 -19115 -32592 -88585 -178090 -207029
15113 -207029 -134708 -962 63139 102049 95113 57439 82027 28556 -8397 88648 95007 96360
15101 96360 26914 -20739 -64464 -131768 -56166 92567 160758 121184 133141 29980 -43107
15090 -43107 -48288 -12971 -118452 -93001 -37019 -37321 50115 -46282 -204956 -190792 -107377 -103410
15078 -103410 -123572 -91868 -3465 -9614 21352 97195 53065 -57984 -60849 -27243 46881 58667
15066 58667 -4514 -31145 52082 40626 -61679 -33844 -83111 -81335 -45716 -77327 -125027 -112971
15054 -112971 -112194 -203629 -258198 -191145 -87622 34779 47681 63994 47450 74429 116760
15043 116760 69257 14625 -21428 8397 9121 49145 112326 186125 143359 107031 117296 47049
15031 47049 -8246 32706 31153 98561 73113 -24791 -78044 3678 29597 -16449 -33035 50990
15019 50990 182542 125301 132913 114680 147594 234565 208948 45641 -71580 -78695 -107807
15008 -107807 -240382 -73960 54038 114406 46173 73383 143332 126141 -3908 -61640 29244
14997 29244 65958 87079 103516 38391 -70500 -141827 -165927 -172581 -38842 17754 -70209
14986 -70209 -157267 -245485 -110381 8758 -86643 -197431 -171285 -90059 -62741 64556 61464
14975 61464 99426 39834 -98361 -124722 -153941 -114631 11859 160140 134953 43787 -699
14964 -699 52960 68684 26235 -25643 19321 53828 -48169 -84603 24174 135831 161566
14953 161566 122890 164448 93853 9666 74526 68857 -11292 -60916 7631 -98915 -166581
14942 -166581 -130155 -33019 -54524 -157558 -98682 5359 -28069 -6378 -2287 54228 -12123
14931 -12123 -188903 -160190 -36046 -24191 97451 180700 66741 164870 178093 1792 17002
14920 17002 -71975 -162194 -152031 -78177 -86770 -64531 54743 36143 -72537 -50791 -67304
14909 -67304 -71743 31609 -20367 -1795 15659 29654 -9987 13761 54546 103426 152256 240094
14897 240094 164623 -38554 -109328 25610 -23714 -129494 -130226 -90927 -77462 78869 128211
14886 128211 117418 98137 28748 -20179 44530 49950 -17363 -63452 -40605 36789 47975 -3850
14874 -3850 -46343 75024 163422 76586 81789 98125 158165 208460 99822 -1307 74450
14863 74450 84748 93667 140899 204997 300856 356161 402402 514480 717159 980439 1242818
14852 1242818 1474794 1664750 1638011 1541306 1430362 1272968 1219442 1008150 848362 746830
14842 746830 622462 445197 331847 335365 352523 203180 216001 270833 151555 186532 177001
14831 177001 213210 163149 136774 69994 15319 53022 90100 101660 95400 64126 73231 134414
14819 134414 41153 -15565 -4727 48797 122408 108194 25414 12896 25870 29257 -7645 -66585
14807 -66585 -23872 27356 -7155 -112292 -134107 -222616 -215380 -60871 21866 34213 -25742
14796 -25742 88263 147702 94009 -13679 -26954 64254 100906 -85647 -145386 -26794 -32821
14785 -32821 -16672 96233 110997 146241 41628 -28525 -41728 37666 30414 82800 237588
14774 237588 253468 148407 207425 126776 31967 35598 102052 16148 -117621 -238445 -307522
14763 -307522 -219575 -117387 -27699 -23875 -60907 -92515 -42531 -90808 -206658 -124690 18890
14752 18890 -5826 -83088 -159894 -134449 23229 110158 4969 -52438 13715 103632 37405
14741 37405 -96672 -117383 -36523 -88217 -117092 -126027 -90990 -167355 -23221 -38843 -93683
14730 -93683 -125873 -127205 -81290 -69462 98768 165880 118039 158820 44209 54062 110749 77850
14718 77850 129973 189608 112336 -53294 -118091 -65739 -64015 52745 98336 68417 141034
14707 141034 189902 155651 87444 7716 -59892 44641 56793 388 -24749 -9809 25324
14696 25324 41079 219100 217714 108753 27717 88261 176976 129864 24433 24085 -67493 -89119
14684 -89119 44331 177915 144407 -10920 -111357 451 63296 53795 17430 -72249 -177102
14673 -177102 -204597 -123064 -223067 -176863 -93150 51508 71859 48373 104302 30452 -68930
14662 -68930 -47313 -50769 -62715 -143819 -83493 35521 -29386 18094 155051 331999 243870
14651 243870 126008 166813 227116 263037 210817 118874 96663 98911 101609 13613 -63022 -72472
14639 -72472 -96 20647 30974 34189 38407 126887 341946 383755 244245 107191 152468
14628 152468 175797 143258 208494 184628 90305 105025 169681 264400 383749 448847 432254
14617 432254 270333 257776 203753 258715 256170 183418 123540 -12715 -15821 -49874 -33070
14606 -33070 -26351 -67403 35559 -65502 -145537 -163768 -25360 36584 -57350 -126602 -112793
14595 -112793 -82672 25892 22896 -58674 -74390 -52722 -299 -26650 59324 51359 125022 42128
14583 42128 -54877 -85641 -106671 -73394 -26869 21424 20691 -58874 -13197 53813 148468 186341
14571 186341 115385 58385 -70811 -177911 -127167 -8119 15907 17978 137380 157072 118143
14560 118143 113288 73073 78184 104691 -32491 -51710 53461 80128 54412 132633 63840
14549 63840 52075 188005 199446 201972 208003 133700 135312 175386 111248 86772 103412 99605
14537 99605 84761 -44773 -86666 -161355 -95579 6983 21550 64731 67679 -81300 -170244
14526 -170244 -209615 -153317 -48419 -55650 -48511 -69577 -11094 22718 -57623 -22591 138400
14515 138400 209051 262769 238267 162736 65372 122150 171170 171700 220697 114627 99170 238973
14503 238973 392392 407233 432748 608104 831796 1090431 1314168 1532778 1844854 2196074
14493 2196074 2339247 2476659 2495857 2451696 2285910 2096221 1836545 1564919 1338897 1216638
14483 1216638 1130965 1006800 854657 783603 787830 680307 552233 531172 548736 569551 505252
14472 505252 467941 612231 719062 745641 653532 684408 694850 638450 542359 552774 537387
14461 537387 653902 688655 665320 655997 610968 517392 598710 749379 730486 702814 722161
14450 722161 679711 615685 610512 594217 603400 673337 726612 778872 692846 691956 694112 685678 697116
14437 697116 626163 629935 860393 1002549 865461 875051 999099 888369 925413 933895 939035
14426 939035 1037852 1060857 996354 988045 982945 1044745 1057178 1128131 1147922 1197928 1286035 1349973
14414 1349973 1382658 1434628 1458976 1473742 1608291 1663628 1839848 2026624 2085364 2146141 2290178
14403 2290178 2449071 2654313 2749287 2759493 2837478 2895288 3120726 3430384 3808473 4165048
14393 4165048 4382767 4638569 5088408 5681225 6342798 6980893 7784205 8791490 9912355
14384 9912355 11109611 12688191 14427116 16646849 19265375 22286087 25911046 30882960
14376 30882960 37725993 47864664 63244042 85893179 116299733 150320708 182631065
14369 182631065 214988560 249990312 280775733 295283862 289025270 270030468 247692590
14362 247692590 220349904 183703926 144361012 111731628 88789048 73516890 63157689
14355 63157689 55821616 50522351 46469564 43124227 40063782 37288700 34903324 32781858
14347 32781858 30807018 28872679 27252954 25853894 24488679 23223100 22255280 21209682
14339 21209682 20200394 19420195 18757598 18154567 17621892 17049943 16424317 15762994 15095868
14330 15095868 14479417 13952021 13507520 13046470 12631910 12335192 12085431 11793576 11451663
14321 11451663 11224272 10909746 10491353 10165774 9840845 9601180 9412192 9203179 9001996
14312 9001996 8717153 8398314 8148257 7970771 7856955 7733783 7572762 7387113 7201584
14303 7201584 6907729 6719899 6550589 6367717 6194391 6013097 5853641 5620884 5407312
14294 5407312 5239291 5167267 5147063 5033603 4891781 4811763 4647703 4487599 4246960 4124871
14284 4124871 4044549 4057000 4066232 3974372 3918320 3761374 3695593 3708041 3599904 3533920 3495014
14273 3495014 3320529 3169239 3143904 3116246 3000822 2932690 2802315 2628534 2626752 2623454 2775820
14262 2775820 2824711 2604775 2643649 2812453 2851166 2744654 2632189 2571938 2416930 2408845
14252 2408845 2462924 2435649 2461627 2488276 2465623 2505201 2642061 2760036 2939020 3213928
14242 3213928 3558826 3884029 4174303 4388476 4455679 4221655 3980889 3751520 3535755 3138116
14232 3138116 2900435 2709677 2474283 2325285 2267434 2279747 2154661 1947684 1789373 1764262
14222 1764262 1722865 1794947 1806104 1702038 1539841 1561396 1578311 1398779 1346478 1392973 1443122
14211 1443122 1465125 1371618 1301876 1334270 1349954 1380664 1292674 1317815 1336354 1257457 1126699
14200 1126699 1190076 1243034 1206520 1101046 1075459 892386 807663 810299 820525 894801 839820
14189 839820 828098 760616 723038 732112 778353 730026 723860 749310 703659 656987 719272 733229
14177 733229 748422 745029 763179 806010 868387 763619 685924 540930 509480 493496 552556
14166 552556 679893 716909 544890 595877 722928 673405 587801 597486 578161 544391 649307
14155 649307 657720 650634 627723 544306 546249 562292 529885 512199 451512 398745 404631 412581
14143 412581 379010 497280 470773 380960 330982 276828 294864 389322 367060 290550 283004
14132 283004 243275 267814 216815 163504 187095 156975 111621 170669 369778 437555 448857
14121 448857 475559 497427 446183 450165 428709 432456 399389 379067 285793 224342 228948 221981
14109 221981 228969 315113 403379 370521 314033 282456 256479 266916 265702 248627 280057 362469
14097 362469 392946 321244 242457 217350 143857 25713 16921 122494 179110 297124 275541
14086 275541 228957 277761 222422 118878 78449 139364 181978 155640 105490 129808 151190
14075 151190 239250 245692 308594 335203 234209 123601 34869 -37854 -99051 24325 168144
14064 168144 179244 174014 109755 22007 55982 107592 97106 120595 80454 87120 66493 110718
14052 110718 142157 69193 -42264 -60943 82477 232679 239903 102245 134919 223111 157282
14041 157282 126207 116568 111480 131350 29476 -50609 12506 127796 191920 189051 212162 195949
14029 195949 92528 143285 160012 147460 250698 141396 129575 175578 64570 49123 5368
14018 5368 -59207 -56564 23675 106895 108147 112407 126716 173638 70870 -80274 -25452 -5312
14006 -5312 90427 118411 82512 99258 99816 58217 38676 85886 76688 172673 190674 128756
13994 128756 135695 189866 248772 210295 68090 30402 -9540 -7864 -14845 -45476 18071 -72346
13982 -72346 -135340 -75422 -29352 86538 128149 97267 -405 -34864 42223 54500 29144
13971 29144 144385 200571 35612 -78281 48728 102369 43495 -7363 2289 -8524 -84036
13960 -84036 -54108 145062 186573 108620 145505 192263 131786 186457 273480 286841 192391
13949 192391 121379 17433 149775 229602 283946 364245 511328 466667 322351 234288 201351
13938 201351 220679 339382 345072 257840 168855 74853 -118832 -168335 -45756 124751 161971
13927 161971 73523 12891 24490 44250 2844 -73904 -119942 -75355 -9846 116832 162465
13916 162465 179967 274788 237802 175002 95517 64153 30323 63709 31140 27068 81006 151520
13904 151520 162588 114921 142502 168044 139022 45004 38617 -30600 -109577 -54592 36707 98529
13892 98529 53515 103824 126060 86680 182489 299836 328662 383253 464309 530674 660572
13881 660572 835597 1118086 1296999 1642216 1929619 2229337 2378860 2442077 2360416 2134257
13871 2134257 2055501 1960997 1646439 1457703 1218254 1005907 880241 617890 380649 242213
13861 242213 265266 350654 442410 432691 303305 246541 307165 308036 225000 171528 146722 46249
13849 46249 61946 164476 205899 191887 90903 102266 -9659 -4705 62639 144226 40069
13838 40069 -24105 41053 89378 29344 -16810 -2290 162541 263189 180279 101914 118430
13827 118430 185839 160915 226149 234126 132696 83937 67730 153649 168928 80180 -67094
13816 -67094 -78263 -72580 -41338 86751 72056 86602 -25207 -44109 -15896 -3125 31688
13805 31688 39894 115368 91798 89626 16588 -104797 -61677 -38377 24435 19629 -5163 26917
13793 26917 74198 174830 56100 -93904 -160731 -127707 -44575 -5279 16351 126673 267738
13782 267738 83756 -131731 -35220 100592 216616 251781 119703 -9908 -20186 4775
13772 4775 6502 -51996 -117085 -39788 -23429 6633 102141 154596 79974 139232 288981 288390
13760 288390 249138 93200 30580 -200441 -258074 -221732 -217923 -166695 -23796 -13787 -62589
13749 -62589 -10722 -22797 -75275 -118064 -116932 -143351 -163466 -148161 -40367 -6083 -132456
13738 -132456 -113292 -103760 -91981 -74102 -55992 40783 65010 36994 -8148 -146691 -289810
13727 -289810 -191389 -127687 -2445 61016 -76292 -48966 -47838 -91138 86245 264158 165947
13716 165947 115672 -47124 -140296 -107937 7455 36894 -77179 -78917 22487 120438 147686
13705 147686 32144 -72868 -161096 -167162 -207973 -100516 1603 -50531 -56703 -91806 -43229
13694 -43229 -72554 -181530 -189557 -172080 -182405 -87443 46853 59077 -13709 -16874 38120 44412
13682 44412 29684 113150 184638 124138 43931 -15364 -17052 -50294 -129590 -139921 -71998 -53489
13670 -53489 -89532 -113023 -96061 -143098 -124790 -141111 -12983 152706 227288 156959 101137
13659 101137 145801 185319 67326 28313 77995 -23879 -85785 63150 170996 144959 154967
13648 154967 60474 -75766 -176430 -120891 28447 75670 58376 -28064 -91836 -135219 -218423
13637 -218423 -273042 -163405 -84323 -51873 -52155 -79598 -89031 -75701 -104778 -102268 -105166 -121047
13625 -121047 -47345 -5143 -1709 -41279 -63306 -18054 45185 110753 64232 -11201 -93941 -29567
13613 -29567 69190 45617 35944 -25934 57587 -51302 -30478 -121709 -297751 -251610 -248939 -206629
13601 -206629 -210844 -235528 -306533 -235733 -43041 -4813 66776 9508 -32708 -129952 -188167
13590 -188167 -67534 40338 -3843 52437 40925 -70378 -175271 29720 160993 230390
13580 230390 123484 74083 98390 90072 51388 -56979 -11489 -51801 -54089 -12341 11872
13569 11872 -50035 9356 51757 -36644 -1349 20814 88637 65359 62600 -21270 -35199 -16154
13557 -16154 -69154 -91779 -88389 -117535 1248 -12005 -101037 -145056 -122882 -120785 -44866 55798
13545 55798 79449 -529 -64331 -272 -46552 -129780 -142877 32821 116372 131944 24025
13534 24025 56924 9553 -23265 -33350 -72528 -116405 -13775 -79131 -178677 -115706 -24873
13523 -24873 42722 3551 -134416 -189904 -239145 -159100 -143139 -155850 -108015 -22016 59600
13512 59600 94309 -35931 -112663 -75056 -135390 -71615 -109561 -173738 -254095 -217547 -182250
13501 -182250 -168288 -177056 -179846 -124768 -17934 162615 295890 327010 346285 185245 82303
13490 82303 135468 94400 188901 222055 243596 22708 26240 85923 79191 132119 91524 26749
13478 26749 -62040 -35970 11622 86157 46999 -27940 92742 111507 -48145 -40605 22643
13467 22643 -50913 -85200 -893 111883 118109 76512 79382 81904 57483 128561 233710 227103
13455 227103 173913 208739 235550 322323 350686 349706 320533 258574 169417 95126 56656 72409
13443 72409 -52254 -35831 -62038 -102662 -34554 -36646 -183835 -119732 -125777 20489 150928
13432 150928 196129 210564 197923 70299 -44818 -11943 52116 69311 71060 197424 256478
13421 256478 128138 122049 49784 -10563 100018 168954 133041 -6424 -78493 -173355 -135553
13410 -135553 -69902 -39123 -27777 -110875 -148152 -139959 -174712 -165672 -83961 -15062 -32336 -9363
13398 -9363 -82560 14949 -5593 -16665 25807 25174 72437 208888 179902 113222 -19725 -69801
13386 -69801 -101186 -27836 34596 -7133 -15973 -30565 -122219 -179801 -133891 -102139 -194050 -111356
13374 -111356 51749 63429 -57926 -31327 8555 -79683 52054 101364 46220 -61234 -92735
13363 -92735 -9281 108132 143254 100658 -1360 -48774 -68354 -45601 63445 86813 134949
13352 134949 130386 119346 67016 103976 57106 30310 -14213 -20605 22610 -56576 -33397 27191
13340 27191 85102 41566 -55166 59701 129669 154903 42212 -88029 -157430 -188128 -254027
13329 -254027 -194223 -169950 -173215 -98811 -139797 -94710 -155675 -115511 -154128 -230818 -233530 -220927
13317 -220927 -154950 -118686 -106249 21366 10661 126193 108309 44080 -49896 -92989 -29100
13306 -29100 -81572 -112220 -43401 -123626 -49196 82368 213825 57907 -28262 -3919 -12350
13295 -12350 10726 90016 94986 10051 -92949 -67597 28282 5153 -41905 -40329 17030 195446
13283 195446 220662 86949 27829 86622 13708 12193 3094 -46375 -44993 -21292 736 -44728
13271 -44728 -76937 63163 12115 -112341 -164356 -158939 -129286 -53424 -84883 -83122 -81336 -22183
13259 -22183 153840 183738 193323 125657 168029 111159 102510 18942 13972 4828 -36343 13510
13247 13510 43613 56198 46478 -2709 11315 21686 104950 14381 6935 47250 92304 83202
13235 83202 78142 120458 113290 55307 49287 -15300 -8304 -10823 -75617 -155914 -197321 -127563 -86733
13222 -86733 -215204 -226376 -132741 -118841 -135657 -253400 -229475 -274651 -310652 -324365 -247325
13211 -247325 -165944 -162419 -285298 -299641 -218875 -141251 -183699 -227830 -220664 -140030 -85178 -44688
13199 -44688 -89508 10490 -111858 -215628 -127079 -134338 -71459 -84697 -136590 -101929 -35505
13188 -35505 122074 64189 -122879 -149335 -33219 62459 67032 73308 97938 115186 138538
13177 138538 251196 285016 217819 51113 174539 219570 93712 -924 -29568 90099
13167 90099 188127 131772 -106993 -139459 -67805 -123699 -51812 -3763 -81942 -30756 -66302
13156 -66302 -52421 7595 147410 207659 186172 158298 190948 -62484 -297108 -304840 -160495
13145 -160495 9255 211386 252658 218612 206564 114211 -20621 -61658 -5472 124662 129438
13134 129438 -10086 72669 35425 81722 -8857 -155449 -281352 -268505 -70853 8792 -27449
13123 -27449 -147074 -178997 -211979 -171701 -113353 46092 17522 5763 -48724 -137836 -75951
13112 -75951 -53433 -207770 -165221 -42697 12472 -54276 -65739 -122874 -181554 -242746 -192801
13101 -192801 -87001 89103 199679 193871 222206 198314 127930 43734 -43491 -50597 -74311
13090 -74311 32398 169590 289147 254388 225320 216562 216110 150827 13589 -127599 -174885
13079 -174885 -175847 -164991 -46723 609 58615 82931 -11671 -33547 46991 15842 -14257 6064
13067 6064 -8184 -37004 13247 36727 49723 88292 112194 103257 68376 53194 77825 153504
13055 153504 218671 145419 14688 -86133 -129175 -88777 -81968 -29730 -68270 -42830 -31034
13044 -31034 75301 -6718 14371 -44898 -33540 -15073 53159 174546 289227 251269 170118
13033 170118 257028 367819 472918 479801 408066 470165 464592 342155 319768 427706 328807
13022 328807 237429 267908 303183 225402 292523 316251 322381 415114 410019 340212 355284 321251
13010 321251 302066 280303 247096 38673 -9609 68172 59010 64312 118724 209881 161890 169593
12998 169593 87048 -127958 -117919 -46051 80194 106645 57847 39199 69512 19502 -9887
12987 -9887 15009 -16266 -33066 -118289 -127261 7183 173815 207700 135027 62596 25428 94332
12975 94332 164485 253651 302868 321976 385756 381652 352141 315737 201093 82419 22488
12964 22488 -9792 -9627 -6078 -76122 -24293 63585 86870 95891 14816 -123132 -143128 -47721
12952 -47721 94658 68066 62890 140262 155094 287518 291642 315064 334036 353976 321063 232320
12940 232320 126566 106070 148155 102447 17247 19938 56806 64422 143585 91555 36050 -56208
12928 -56208 20981 51248 36828 87398 22704 90255 -21965 -9290 -58228 -43123 -47518 -61968
12916 -61968 39302 93374 17199 25756 75757 264798 279476 179240 87586 26537 -71497
12905 -71497 71146 171624 132402 15618 131692 170446 193290 80895 -62948 -160220
12895 -160220 -242799 -182325 -72243 13167 84044 161536 249206 190402 154389 179953 181210
12884 181210 259965 255972 143874 28623 -62753 -86843 -96729 -39170 -34051 67870 21387
12873 21387 -29066 10061 79917 -5233 -31156 -51236 -22523 17368 64287 65898 99520 13194
12861 13194 -69239 -91834 6461 -33137 -107006 -36253 -106410 -16440 67773 -15396 -86456 -90218
12849 -90218 -74529 -117824 -92247 -28980 -63206 -18136 -21911 110579 115436 -64322 -76089 -47989
12837 -47989 -56641 -40006 -89751 -85738 -59177 -68713 -94428 -138051 -139823 -102392 -105353 -71530 -113372
12824 -113372 -77036 13304 32955 29152 -57295 -73345 -156076 -70604 14550 -30612 -34118 15003
12812 15003 -31640 -14073 32859 13146 637 -90178 -107824 -31719 -69574 -33867 -6650 18254
12800 18254 -60101 -112502 50130 230855 338338 340255 323682 243122 105836 22470 -92308
12789 -92308 -374 33462 -9130 -20752 -3838 76879 103790 52503 5383 -89830 -190838
12778 -190838 -231422 -204896 -221705 -200917 -165836 -232434 -202118 -214922 -251925 -301503 -166996
12767 -166996 -97428 -101022 -53565 39785 72472 3462 -96014 -34432 30586 36592 67715 90814
12755 90814 99698 128786 97167 35843 133134 222210 239344 300383 333134 300644 265602 257125
12743 257125 195037 151746 90933 94883 145042 143686 -1663 -23854 117424 175788 71988
12732 71988 47931 -4163 92553 204657 108450 71133 272210 383223 355269 347635 167421
12721 167421 31150 32675 122290 184021 83988 4139 -53143 -77287 -57674 -121893 -170966
12710 -170966 -185608 -169578 -134880 -84217 -101871 -192332 -254903 -159443 -114984 -183334 -137104
12699 -137104 -99983 -80784 -64375 -75721 23688 149334 210320 120038 50448 112234 125521
12688 125521 98277 105648 -31767 -86116 -37979 -23234 71174 67257 -12755 -115165 -205527
12677 -205527 -211261 -158280 42340 131072 126858 97067 44303 -12404 -46016 -79733 -147670 -194916
12665 -194916 -280660 -288961 -139063 -14360 181602 79203 59403 105764 12668 -103642 -211871
12654 -211871 -154560 -52785 35372 71239 116674 33695 -40097 -140745 -154703 -103529 -71541
12643 -71541 -22058 60443 -2293 53441 -22620 39771 63038 10960 -178609 -229877 -279297
12632 -279297 -117449 61770 -12770 -98732 -200696 -276680 -116221 -89528 -48282 -26008 -107750
12621 -107750 -229993 -198331 -173896 -47709 20673 38890 -23601 20862 40473 1697 54284
12610 54284 100593 132402 80563 42179 248070 282208 154416 11117 -117831 -160267 -178432
12599 -178432 -87719 -8339 89321 145815 140293 86421 28505 -40146 -52039 72857 154241
12588 154241 91851 -48078 -67028 -37722 -55592 -146005 -237707 -220170 -41351 84670 150188
12577 150188 147743 106584 87552 -37352 -100650 -127455 -89407 -69762 -114500 -211658 -223279
12566 -223279 -269462 -290483 -258083 50677 205198 174652 119002 72624 134018 -35680 -168149
12555 -168149 -208211 -203970 -145070 -51774 71272 116193 38529 -5109 99506 177099 117287
12544 117287 22447 -71411 -110325 -76140 -8213 21886 -36677 316 10322 29807 9625
12533 9625 38593 122220 61001 229333 228974 29791 44191 155246 189394 149989 93880 27217
12521 27217 -10872 66937 204268 175047 -4294 -99935 55681 110984 287285 248509 76871
12510 76871 -8848 63810 66399 140781 125230 138836 206140 114662 115428 52312 -36521 75122
12498 75122 31492 -82958 -84290 -146443 -243090 -136000 -93080 -93566 -156857 -172051 -121845 -13280
12486 -13280 23215 -24950 17918 209127 149578 45665 -36674 17830 1559 -103395 -73160
12475 -73160 -82236 -154821 -264089 -284969 -154131 -47933 -99540 -57556 126484 149028 61553
12464 61553 33566 11571 138224 203959 62464 118321 162442 168486 107084 70391 38743
12453 38743 29130 40735 21488 -72803 -97904 -152837 -164147 -147488 -72942 7877 36818 145241
12441 145241 257886 75297 23736 -1111 45295 90063 6123 -52286 -9993 -50809 -117873
12430 -117873 -125112 -44521 -17190 -101498 -228970 -52352 98180 291959 213086 41527 -1426
12419 -1426 14917 42004 31654 -5401 17244 100778 103079 103823 104382 161494 210572 182070 170074
12406 170074 93500 7780 -676 28128 2340 -22917 -21049 -133455 -118461 -152462 -191392 -68010
12394 -68010 -10213 34509 19470 -89718 -103977 -15746 16407 -24764 -92912 -28158 75582
12383 75582 125278 308424 294651 41110 -1035 3305 -10279 15658 100032 -91017 -110489
12372 -110489 -11751 20677 37400 -23238 -109308 -61071 -58016 -48237 64403 132714 20660
12361 20660 -54063 -91927 -37391 -63467 -243476 -317370 -249963 -157921 -113626 -202959 -66003
12350 -66003 -129223 -97262 122904 200527 239975 330208 277358 158507 119030 188092 129483
12339 129483 197646 97197 -72475 -141425 -54719 -3764 50693 211367 234674 196725 82589
12328 82589 115754 206632 197777 162103 174650 219415 225681 214618 138437 39492 -125630 -161347
12316 -161347 20999 216152 264937 152852 -44265 19081 -23662 86797 109001 69057
12306 69057 24792 56843 137197 -57315 -109794 -130090 -76223 -110088 -150607 -178382 -53173
12295 -53173 3109 9983 28133 -5222 -43424 103906 281550 293729 308241 293684 316230
12284 316230 299350 240396 158039 233785 281884 254574 260605 247995 181836 257314 343588 209991
12272 209991 10403 -137241 -127042 -75583 64202 63238 -14363 86614 170549 213881 189356
12261 189356 68026 -136204 -238969 -182193 -187764 -144705 -4408 142112 136568 82628 58258
12250 58258 104577 80553 69325 116762 158626 302880 376015 391221 425413 636534 770896
12239 770896 728595 569171 406727 254496 234645 329017 288208 290015 327176 272896 173813
12228 173813 40284 60859 112647 45775 -62283 -68024 -41342 -75741 -173633 -216094 -122708
12217 -122708 -16150 1822 -43401 -119771 -211697 -149160 -54251 -1663 51964 52565 113536 212485
12205 212485 144312 40903 -10138 63368 150014 213311 245355 350890 292251 136023 45585
12194 45585 8006 -51987 63025 174193 215631 108255 -24684 -226189 -180028 -50031
12184 -50031 38294 96208 153591 61128 -8135 40022 40401 12235 75677 128689 25109 5224
12172 5224 46353 -47483 -6348 -11093 -169474 -231697 -163667 -89962 -109991 -93210 -126999 -40585
12160 -40585 47770 94727 -17421 -154415 -180141 -136769 -145477 -170358 -130699 20268 173958
12149 173958 212867 197106 33684 -62209 -60938 -101073 -132968 -113599 -14874 -13878 36084 185751
12137 185751 177012 135353 89522 -47775 -83119 -120677 -123989 -16249 118791 222592 185502
12126 185502 202779 130629 93398 169148 59040 -48052 -148451 -61950 -126426 -167982 -245806
12115 -245806 -98531 51300 38990 67161 -87012 -216216 -236675 -133280 33042 97654
12105 97654 81364 89944 122124 163563 215582 140799 169239 123593 -13530 -168744 -236979
12094 -236979 -235164 -180586 -132233 3844 100664 24645 -19586 48870 155181 341194 341058
12083 341058 435938 495268 501591 394194 240965 274774 260882 168385 119020 145322 82411
12072 82411 126072 90565 75299 135703 123897 79245 24621 -77783 -208232 -84956 30792
12061 30792 76927 80656 41482 -41802 -72024 -142392 -112972 -42716 89636 108304 66068 140052
12049 140052 210172 228985 211230 263172 197991 177143 121886 147350 255438 386888 412555
12038 412555 443514 436308 375924 300647 167972 133094 132109 178145 150905 25014 12149 7091
12026 7091 -16909 -20481 42841 76266 143723 98300 23086 -8376 -11475 127942 112104 58021
12014 58021 36288 -9134 61874 167545 182369 68347 116662 235367 199059 62258 94945
12003 94945 85365 140798 142063 181440 196106 99241 153876 123195 70478 73047 129353 81681
11991 81681 -95846 -198779 -122578 -56528 -57554 -188487 -250713 -229115 -176433 -102468 -84261
11980 -84261 -31089 -59918 -105066 -78486 -40892 -29149 -78252 -105094 -11418 123574 139701
11969 139701 200816 133548 136406 86765 102756 -21907 -113058 -244940 -269253 -211211 -111526
11958 -111526 -91074 19430 80627 -13298 -89687 -27859 -9570 26409 83341 210016 160240
11947 160240 163550 128664 -94619 -164951 -14976 82669 117922 57149 68836 64298 -52695
11936 -52695 92201 119553 -69478 -187515 -110057 32247 -53939 -143783 -161931 -107568 -75622
11925 -75622 -151369 -97741 -63674 -76240 -103588 -131855 -16439 -10052 30526 47091 -116824
11914 -116824 -155929 -158956 -159943 -117192 -73122 -85002 -54749 -47377 -97040 -144551 -210643 -292865
11902 -292865 -234643 -64462 -3189 -40107 -128041 -4585 -36311 -94971 -107459 -65465 -24684
11891 -24684 -6769 56690 37526 31033 48095 93677 85527 18641 -6976 41928 -25867 -99322
11879 -99322 -41051 -86175 -139586 -116686 -97395 -115570 -152167 -154179 -54977 -926 -22454 -82680
11867 -82680 -79099 -37557 -82607 -136058 -181734 -47567 42466 11516 7477 -129205 -190830 -80130
11855 -80130 -93311 -77881 -73054 -66051 -106725 -74498 38813 16797 -205592 -200777 -53446 -62328
11843 -62328 -11606 -61621 -86437 -165592 -268855 -281364 -188059 -110611 -159427 -48625 88495
11832 88495 78775 85867 118463 193646 78475 -30505 -161894 -233066 -194780 -270749 -329253
11821 -329253 -257533 -173653 -96729 54411 50636 -112714 -128356 -73501 -138889 -93068 -5876
11810 -5876 71475 102454 82854 35688 36935 118601 60490 -22650 -92719 -54541 -130644 -186823
11798 -186823 -109426 -60480 -65763 -27997 26027 -73915 -98481 -65517 -74616 -199895 -207266 -155685
11786 -155685 -91552 -37576 -24719 28200 -15622 24857 61037 12649 -9622 -79348 -263138
11775 -263138 -129466 -535 -23923 -37932 51807 42839 -13891 -205642 -319690 -301015 -224015
11764 -224015 -69799 -97886 -20661 63175 142683 67658 -593 18054 -187997 -347160 -313199
11753 -313199 -295021 -177417 -77643 -62221 -92960 -18065 -5536 146078 220465 103408 -33277
11742 -33277 -79413 -148229 -325848 -368630 -303196 -178251 -105934 -110828 -70783 -89229 -202631
11731 -202631 -283637 -323106 -150721 -169981 -138837 -28214 -91451 -44943 -38070 -49930 19106
11720 19106 67882 -1103 -25391 -108502 -57526 29511 -36459 -124768 -197699 -339726 -405484
11709 -405484 -417432 -268313 -161856 -195887 -172394 -183801 -133609 -118374 -206407 -227446 -82958
11698 -82958 -73569 -75669 -64268 35162 18314 -79846 -99627 -107621 -162471 -200286 -82075 -14536
11686 -14536 36590 -102388 -224209 -176839 -77887 -196231 -210364 -128243 -121139 -68084 -16942
11675 -16942 1270 -9385 -63841 -38883 26981 58590 166184 -11650 -130107 -45108 -33374
11664 -33374 -116923 -106862 -150131 -260792 -292740 -256313 -204561 -90220 20069 63498 103928
11653 103928 76240 110271 76501 -109308 -50640 100285 57521 68800 122351 151904 91913
11642 91913 80304 83020 -70017 -175016 -172119 -157103 -127397 -27017 71659 46065 97191
11631 97191 161265 155692 43819 -20324 58681 137051 185420 25539 -107240 -146584 -51918
11620 -51918 10985 -34528 -130724 -201647 -229282 -258451 -292792 -265402 -261029 -323171 -160030 -71665
11608 -71665 -189257 -152603 -145766 -74628 -95113 -164972 -154711 -205951 -181938 -83865 -94001 -168437
11596 -168437 -106231 68669 113364 80287 36537 40632 -25893 -125331 -177608 -137883 -84340
11585 -84340 -70819 -88975 -2262 -53171 -114927 -135833 -82361 -24430 -10652 -35041 37575 -2498
11573 -2498 -138315 -222168 -308326 -152227 -16072 55507 91336 20613 -69124 -144169 -236612
11562 -236612 -252204 -181174 -112174 -78961 -58091 -128770 -133401 -94285 -87479 -73508 -45822 56478
11550 56478 -57169 -168630 -35143 56695 63267 -38457 -134996 -116174 -145690 -137013 -80138
11539 -80138 -158261 -140926 -136068 -25273 30565 39993 23488 -52960 14678 2428 -1300 21935
11527 21935 -20483 -91763 -195114 -222805 -153892 -125201 -112055 -91521 -103856 -49341 40723
11516 40723 -22459 -97589 -93924 -74307 -121757 -127557 69516 44020 21890 31682 43609 36035
11504 36035 83506 -29036 -49933 -11730 46642 31552 -10205 39579 -79433 -82432 -49090
11493 -49090 18643 -27281 -77932 -95542 -101148 -46203 -111327 -120909 -69930 -129214 -122453 -150026
11481 -150026 -171231 -287627 -353207 -196680 -71640 -1470 -54658 -80410 -25799 -41981 -40383
11470 -40383 -48512 -47160 -33093 -134549 -185772 -125389 40293 57479 179275 192052 170435
11459 170435 135646 163233 -21995 -126446 -113361 -156592 -2603 11423 -60760 -46861 -120829
11448 -120829 -87267 16213 43721 -43705 -80941 -10409 -56546 -85797 -33895 64730 37105
11437 37105 53838 73087 138561 227204 178171 85423 73732 118713 141452 190682 34063
11426 34063 -52543 -28050 -131483 -217416 -78309 18761 -30323 -92748 -179805 -49596 118918
11415 118918 214578 266160 174886 52968 -9049 -54925 17257 -11813 -49787 -76452 -176900
11404 -176900 -148010 -102550 -123563 -217582 -221480 -145022 -52159 -9102 -54980 6887 77567 115041
11392 115041 61940 -63560 -107884 -164420 -192567 -178312 -127402 -113564 21153 18075 -190290
11381 -190290 -241843 -187237 -199903 -141492 -82073 4408 -5001 -38252 -25566 57510 -75269
11370 -75269 -76770 -36715 -70745 -126108 -129849 -117841 -68966 -52864 -89632 -139480 -155617 -64062
11358 -64062 78928 104718 -65051 -90998 -60098 -72522 -14752 44078 -43205 -14132 -13873 87657
11346 87657 109276 25833 65180 -66443 -97938 -65970 -82119 -87617 -97356 -27791 90708 164379
11334 164379 94446 -47365 -44312 -118737 -69970 -33151 -101205 81870 137335 121834 53810
11323 53810 33143 -88785 -254455 -192468 -49327 -79473 -16049 -56565 -962 14860 -31267
11312 -31267 114207 167759 172308 200835 240409 160076 14450 131929 110331 -13609 46586
11301 46586 28840 -91172 -66764 -5612 80954 37063 -4795 -16355 62455 63720 56318 40052
11289 40052 -534 -72327 -35540 -24134 -106744 -81253 21472 3487 -9777 -20265 26881
11278 26881 132220 110077 20826 -1911 59769 65985 46806 -52510 -96546 5862 21423
11267 21423 -4828 -157990 -163638 -139963 -150227 -87375 19845 39231 2427 65434 46160
11256 46160 173965 220230 146502 154928 108767 99058 105014 138668 71001 100765 -69003 -290273
11244 -290273 -342314 -258143 -2043 28625 -55634 -140104 -116113 -57549 51168 98326 77064
11233 77064 167728 80152 80086 22663 -38917 -118866 -157132 -162201 -115429 -152784 -139252 -40653
11221 -40653 42170 130728 103982 159576 161460 87855 50208 112426 77655 -61107 -62166 7670
11209 7670 5579 20141 -92635 -231790 -218293 -92918 -43473 -159038 -172675 -107323 69420
11198 69420 207975 165350 30177 39361 119144 104167 190960 242441 273043 258239 -2429
11187 -2429 -188296 -152751 -178635 -244236 -198100 -112570 -5815 164437 97899 -78434 25250
11176 25250 45314 25293 -2194 -50479 7409 22084 36885 19901 10962 -7004 15363 -77073
11164 -77073 -40906 89636 13330 -91919 -123215 -116319 -89517 28704 86641 21480 13282
11153 13282 -72278 -86490 -23078 87523 152115 104062 67462 79277 175883 225284 76470
11142 76470 -17207 -15944 9496 -14375 69970 111890 37867 -69868 -88935 -118927 -51335 -30678
11130 -30678 21341 112768 198942 131989 156296 241681 239122 183316 -2207 -43653 4876 96935
11118 96935 168538 132803 158692 111718 51054 -1594 -96998 -67900 28609 159233 100563
11107 100563 73128 194442 118090 -84306 -64907 -51195 -39484 -145475 -187113 -33568 71414
11096 71414 164255 209756 162842 162371 154324 144520 62744 40493 149913 40435 -33542 -723
11084 -723 -90641 -114452 -10917 -10536 -64177 14406 142931 147575 118678 86255 3948 8185
11072 8185 73513 205922 270971 336252 373429 333074 428127 318385 70243 49101 34731
11061 34731 -64025 31370 131403 71226 63489 69774 61996 129087 120889 118534 89264 -35901
11049 -35901 18739 93869 130110 219862 236187 110813 128973 200761 210220 178626 175716 185485
11037 185485 180049 145109 286909 447005 502475 519248 561775 596988 592133 599896 572086 607888
11025 607888 650720 773274 799145 857221 815808 771935 851073 921662 1018928 1131567 1143255
11014 1143255 1229521 1262003 1207127 1235201 1139575 1015034 967795 879298 928394 1060057 1110035
11003 1110035 1117885 1114999 1123805 997471 821116 641832 477763 422778 447554 443591 463411
10992 463411 511078 579488 580436 532912 508097 557019 615400 429632 310151 233788 201923
10981 201923 267463 230482 281939 321147 271584 320136 318713 201301 143291 150131 154170 43875
10969 43875 -37865 19452 138086 161090 28066 -119246 -56858 -9932 -63467 -6429 48046
10958 48046 133917 76199 87712 148072 150895 -971 -52799 4987 175007 209778 218090 193921
10946 193921 -24101 -143654 -250587 -152739 -33790 22094 87670 113078 85898 93197 45015
10935 45015 187850 292577 271222 74874 29463 29797 37860 99289 52551 -125689 -166510
10924 -166510 3018 27400 92762 82540 39064 15615 81307 65748 39550 -37734 -56328
10913 -56328 -111380 -22688 14878 -17800 48319 -17424 -78718 -6108 25032 70660 -9619 -57686
10901 -57686 44776 113223 -56802 -4422 47928 -23152 -98278 -5180 59589 33299 56532
10890 56532 126348 168977 96949 10382 74743 58760 -16400 -11620 63238 105651 18425 2039
10878 2039 80757 89215 159333 166495 227375 173532 43700 -53758 23663 28791 21502 9517
10866 9517 57799 114736 124315 33956 -108622 -112509 -36081 -3300 37951 48812 77991 153583
10854 153583 264621 303269 218608 26086 23793 -11219 -125435 8217 133794 181609 279442
10843 279442 324412 215127 275940 353678 275494 184299 170729 203179 120733 118576 221544
10832 221544 114991 48182 87172 87213 232986 220468 330917 328955 261737 245179 186349 2656
10820 2656 91267 122872 173567 162470 148396 126945 134244 64694 25052 66932 -52212 -1787
10808 -1787 59423 -20945 -87852 -63293 41823 90815 87267 103919 13703 -29270 112875 113426
10796 113426 -21097 -84729 68757 125895 106684 61250 44261 144451 186106 128552 152302
10785 152302 204500 82990 84231 179253 197871 79854 -5561 -25912 60599 74521 78253
10774 78253 63787 25671 14587 35350 75273 92434 28783 -39941 -73282 -98419 -92647 -52442
10762 -52442 -56168 -82885 -91643 38686 84833 112627 94970 32194 48623 114122 146457 210657
10750 210657 294325 117634 -115249 -49610 47034 179493 204670 313501 331357 312730 244676
10739 244676 163599 260849 293107 375970 549954 605038 683130 743567 636779 678098 674711
10728 674711 622278 611727 805224 1007566 1143387 1241486 1292361 1145288 1104239 1139737 1159787
10717 1159787 1113406 1214559 1287715 1364128 1459349 1505483 1498911 1651127 1896171 1951479 1915675
10706 1915675 1744292 1625858 1604934 1581051 1594169 1647785 1759019 1742147 1756794 1749158 1698398
10695 1698398 1551646 1433482 1403237 1407742 1360935 1371116 1321146 1261604 1177188 1136775 1170341
10684 1170341 1195085 1189516 1146906 991089 947323 893735 859302 839811 810953 746325 801471
10673 801471 971222 946017 837992 836330 878414 923456 922607 887594 811245 902143 1073463
10662 1073463 1139927 957033 840507 876160 1006542 1130968 1165399 1110620 1095776 1069195
10652 1069195 1070338 1163024 1174742 1266285 1405275 1390455 1496365 1644770 1815095 2025441
10642 2025441 2205236 2359972 2405277 2359530 2373886 2454854 2467961 2343303 2322849 2501559
10632 2501559 2576828 2785179 3178534 3505806 3958243 4526401 5151835 5750926 6341841 6853790
10622 6853790 7460898 7997207 8494434 9113947 9934301 11305514 13161863 15760668 19332517
10613 19332517 23860545 29667090 36510745 43803926 50812247 57122081 62845411 67811523
10605 67811523 71677866 73873424 75005619 76798050 80765497 88345011 99149711 111371527
10597 111371527 123043441 133108451 141670873 148444662 151924172 150760001 146088374 142105387
10589 142105387 142601616 149021698 160671435 174535089 187244025 197383225 204940296
10582 204940296 209110632 207348026 197992089 183141726 168221070 157753745 153500204
10575 153500204 154623547 158198862 161656471 163945235 164625106 163065132 157327108 146464644
10567 146464644 132423243 118861622 108663082 102253919 98951560 97428660 96113507
10560 96113507 94234063 91872073 88408978 83056851 75767452 67414885 59198794 51995348
10552 51995348 46332067 42037475 38626512 35896100 33593875 31881143 30251521 28727783
10544 28727783 27489900 26454815 25378251 24440816 23635994 22970928 22237231 21395206 20651857
10535 20651857 19985006 19443528 19066421 18524598 17886377 17368401 16916440 16456579 15969511
10526 15969511 15446374 14943044 14647411 14286763 13913913 13448542 13112505 12740854 12326652
10517 12326652 12037504 11850754 11555907 11221635 10918203 10746899 10545769 10295349 10034394
10508 10034394 9627853 9303438 9105866 8970206 8846017 8656277 8423929 8098652 7866528
10499 7866528 7867928 7780085 7475778 7241253 7071800 6984569 6928084 6855299 6747084 6620163
10489 6620163 6373235 6290227 6276031 6226284 6159740 6255067 6202114 6089610 5935435 6030219 5921198
10478 5921198 5959408 5909682 5755556 5634170 5602391 5526203 5550411 5672756 5580161 5418817
10468 5418817 5507839 5622905 5728240 5708164 5571116 5491229 5386624 5363924 5401286 5495043
10458 5495043 5570130 5639408 5647923 5531299 5487998 5558113 5418041 5299674 5031549 4937840 4852418
10447 4852418 4756414 4672906 4527879 4484434 4483271 4338161 4268322 4236784 4092927 3951827 3817030
10436 3817030 3817552 3683480 3558464 3455967 3458247 3416949 3282715 3071036 2992691 2988443 2864856
10425 2864856 2618077 2439358 2467847 2473246 2344332 2239657 2191916 2112639 2147009 2078942 2104474
10414 2104474 2009363 1971771 1985929 2034395 2094541 2032294 1896652 1835168 1908593 2042431 1997508
10403 1997508 1797695 1685947 1696115 1639281 1566163 1577840 1402440 1267668 1293487 1176840
10393 1176840 1156949 1275091 1322437 1225931 1183991 1246059 1192437 1100389 1047658 988489 1057788
10382 1057788 1204887 1219242 1181924 1079237 1000186 1027477 1125038 1270373 1253568 1236577 1259639
10371 1259639 1311718 1170545 1001955 917982 923918 922163 928081 884462 834014 749721 657961
10360 657961 717203 803302 717319 607726 645444 712186 737243 690141 639610 764105 802179
10349 802179 713183 695020 686282 713779 715370 643064 624872 718948 670278 576135 634591 725045
10337 725045 652697 593406 627541 738774 641872 606788 703150 709647 624596 504326 466162
10326 466162 429980 377941 419188 485457 415017 468346 407509 368425 460464 427247 348650
10315 348650 366367 431276 500681 526349 495122 385161 294498 332121 358778 412846 400107
10304 400107 375197 361518 285719 198739 230555 237800 150863 133133 256230 347390 325904
10293 325904 292947 266987 285135 156096 110935 148597 199089 265031 205504 234385 224234
10282 224234 176793 249911 235225 190918 252848 134762 95593 141481 133993 155238 239737
10271 239737 196751 164294 242492 204484 235861 216179 116971 -27421 73073 106259 101873
10260 101873 153098 59757 -58070 -112456 11078 14915 34306 113035 163581 237770 199350
10249 199350 142993 89453 110334 156864 173281 246945 276718 177991 195117 306419 170810
10238 170810 123524 146695 153562 187617 235967 245382 303275 150200 144858 233201 239123 197683
10226 197683 91436 99713 197808 282523 266211 216447 296524 205989 203160 274218 276365 205727
10214 205727 111415 121214 10363 -2634 -78676 -52090 75710 68589 59651 108893 114533 125162
10202 125162 184752 61873 -44076 -75640 -71018 35702 129945 136928 46778 62287 169623
10191 169623 186683 131290 117455 181145 179246 118451 -27236 -82407 40628 152100 177070
10180 177070 187411 223743 235758 231414 249189 202169 262764 474150 535717 373319 387819
10169 387819 577064 484383 406469 464203 492231 431567 411182 453068 595437 700665 639874
10158 639874 696480 711634 704743 708261 762993 764760 702828 823440 998151 1029039 1031916 970746
10146 970746 1036720 1159407 1186216 1171848 1024544 873411 829543 900571 1081889 1011432 940123
10135 940123 816389 810264 941877 965842 918046 742901 642294 578849 582580 546751 585352
10124 585352 592243 565437 531472 507627 601493 581367 452255 410706 362866 273792 246262
10113 246262 159027 132653 220679 311960 255098 91006 145453 281586 242664 290994 300380
10102 300380 317310 312832 272788 149663 38357 67826 171822 90333 123643 154027 45575
10091 45575 -20254 -26778 55377 136961 137524 161333 264124 245573 248063 164913 116447 90177
10079 90177 50938 48065 129144 111720 65133 30723 210595 323200 354861 303467 206420
10068 206420 175995 176792 63675 24451 43743 1430 43534 93514 169975 202163 222095 329499
10056 329499 322896 197932 187137 255371 281667 257028 168313 256236 165020 69333 -5652
10045 -5652 10167 -7086 100723 187321 145641 15618 -27222 -80127 -52552 440 -37348
10034 -37348 -88482 -21611 -96080 -147588 -94974 -11783 -50971 -56751 -21208 61956 67065 -60138
10022 -60138 -44574 89303 214026 222208 181822 81280 10192 -61069 -48375 -35739 54954
10011 54954 108994 40218 143414 251826 89555 26210 67186 30298 30714 78754 38732
10000 38732 -122436 -98501 -173991 -94338 56524 141564 143812 -126301 -229678 -156656 -112411
9989 -112411 -13084 33612 67681 34892 50681 139513 171709 204408 168797 107906 163754 99567
9977 99567 55516 150307 196227 166553 230332 78526 -3361 56365 63180 68501 76655 11975
9965 11975 47175 30540 37469 53862 27957 133432 244550 276249 320804 426387 453885
9954 453885 512432 568763 538880 459755 313550 152875 80679 177037 212545 217168 105831
9943 105831 116424 161628 203526 145291 192575 180425 169979 260318 250952 241084 219624 192145
9931 192145 239822 169540 240631 344381 299065 276722 231390 129181 73417 138648 55131
9920 55131 20213 50565 77093 76191 59605 102359 47195 20128 67385 34224 76903 101952
9908 101952 37150 -39959 -24233 80062 91800 50466 56922 123974 130109 80603 217494 291381
9896 291381 74040 79877 57725 -10035 42601 -14411 -44861 19589 33836 -54146 -32149 3910
9884 3910 7545 -13109 -89012 -194770 -131396 -98694 -129410 40398 110302 120779 60947 112284
9872 112284 61797 -35797 43034 15197 -64855 -64917 127076 158606 51055 108410 24357 -4296
9860 -4296 -57909 33879 96340 149003 158221 171467 114292 88964 162986 239116 178300 329579
9848 329579 299697 346380 345634 280208 298881 231967 110484 116436 186953 132847 105916 47030
9836 47030 10931 1418 -8900 37360 4692 -103402 -68772 -3931 44585 24954 -63916 -44881
9824 -44881 74443 92097 130056 62456 46865 74899 114436 87056 -147628 -235301 -274648
9813 -274648 -288060 -160554 -79307 -110401 -185157 -126547 -113056 -82802 -52818 -91467 -66463
9802 -66463 -7822 53156 75529 62042 9025 -99593 -169935 -163889 -134645 -98094 -34672 76505
9790 76505 133354 98920 80272 145402 164669 246948 284715 340839 197866 128543 27189
9779 27189 -102043 -57346 -56876 -72685 68815 213577 205554 180119 281507 534216 639118
9768 639118 841586 1032637 1144318 1275750 1442845 1405061 1339462 1106744 799171 500889
9758 500889 318072 277543 200147 82339 -6857 18688 -26921 -132370 13545 18781 28458
9747 28458 -300 -4006 -8145 41502 131021 206300 372958 310057 196974 132423 106200 107133
9735 107133 148395 127546 220930 243831 142123 71822 155226 269075 160008 65056 142173
9724 142173 174706 124399 75078 3342 -105733 -230541 -63663 61451 -9658 3949 38766
9713 38766 51772 39598 173126 291157 297658 340631 245595 114726 7503 102074 186177
9702 186177 120834 25672 -50387 -57758 109303 182775 57773 80297 160411 219863 206801
9691 206801 56591 -17649 6824 -59043 -77312 -82995 -148598 -133192 -106985 17999 14376 82214
9679 82214 61356 -30169 77381 109269 80874 17083 50254 121108 424 -46126 36694
9668 36694 8333 64255 16916 44178 -25844 -60970 -149243 -134013 -85261 3224 133822 146809
9656 146809 182880 184180 167908 116989 143800 247451 243477 317085 385827 602797 945855
9645 945855 1506615 1857144 1977111 2090692 2340522 2459386 2173820 1542440 1005780 568067
9635 568067 370958 318042 338294 335401 314975 313606 275707 187284 235181 214868 235739 252837
9623 252837 288286 318979 320892 226105 291884 326954 267997 166025 198773 120362 147727 249552
9611 249552 253605 205445 86951 42207 68444 173186 226678 228911 245981 226621 227082 81385
9599 81385 -71599 31486 124530 204060 247762 160264 34886 26388 170845 180008 76185
9588 76185 68906 219997 207810 114155 148867 129113 82661 -57613 -346 43480 8203 86397
9576 86397 104320 62124 147066 59286 -61308 -90264 -19183 135808 242756 154290 28354
9565 28354 -65297 60425 41901 -21587 -51854 9461 -15991 17080 56584 -4973 -101823 -148763
9553 -148763 -94004 2623 75423 57667 -72655 -87253 -45455 105333 165730 101487 -6594
9542 -6594 11370 125464 18167 35251 107645 114540 266853 286192 104388 -122491 -31651
9531 -31651 -46763 -211181 -210142 -291469 -249707 -254625 -210870 -158936 -173079 -113157 -13900 53900
9519 53900 86237 -7829 -90436 -155261 -199091 -155356 -52013 74969 37230 25152 -79164
9508 -79164 -50306 18652 94772 63473 109432 60157 -17319 11961 -74980 -181469 -173985 -281073
9496 -281073 -255788 -286063 -135228 -68899 26128 62479 114208 93269 -18994 -30793 -107420
9485 -107420 -110204 34681 24381 -66018 -86918 37420 83997 -24156 -234391 -301495 -279973
9474 -279973 -178459 -159472 3101 110037 96818 50321 -136155 -30662 41014 58622 87653
9463 87653 75457 52166 56821 135697 79296 -81026 -21957 18181 -16510 2300 -75669 -136835
9451 -136835 -12616 132540 128394 126107 54239 17649 16745 164416 70435 -41429 -49037 -19080
9439 -19080 42549 75391 -14925 -124734 -80861 -75052 -56817 -153746 -184362 -158064 -82843 -5414
9427 -5414 -54400 -25965 -36527 -84774 -91798 -206670 -166669 -140766 34281 37228 14969 39669
9415 39669 25122 42747 -94566 -132645 -163484 -152679 -59250 -35320 -93578 -194818 -209017
9404 -209017 -101395 -11925 118711 95754 39687 90081 35075 61936 81762 4599 -28766
9393 -28766 -89908 -56679 19636 20587 -87065 -74499 8459 -11413 34150 30213 28431 -58175
9381 -58175 -99935 -63096 -29096 -42117 -48642 38252 15767 -50930 -115307 -44017 -42406 22872
9369 22872 6895 -34120 -85300 -94834 -88322 -17384 114884 100162 15945 -35009 -76233 -80313
9357 -80313 127152 190166 86705 71697 95945 79298 95079 -12346 -15360 83724 175545
9346 175545 89818 12634 7842 -22090 -69883 -25006 5920 127802 116894 125769 17137 -4873
9334 -4873 -55768 -96560 -5146 104174 33994 13655 66791 94350 19290 53141 38160 -41769
9322 -41769 -96011 -132993 -124054 -140981 -61886 30623 113655 109311 34314 40934 -5099 -80905
9310 -80905 -53203 -51176 -961 73359 106295 59081 44542 14898 198295 176699 18186 -145920
9298 -145920 -177349 -115700 -49482 -33469 -46512 76364 73331 74601 12169 33008 42624 -62212
9286 -62212 -136298 -190603 -154049 -118183 34705 164662 180492 112734 117546 177279 197543 72963
9274 72963 47570 101877 89842 43903 48913 61283 65629 104214 62806 104281 133967 85348
9262 85348 167069 185103 221424 217727 179719 64010 -93325 -138895 -55782 -51273 -155865 -183117
9250 -183117 -13179 -42500 -159152 -104236 -39392 -37649 1860 115762 104901 -5729 69183
9239 69183 33886 -63549 -7523 71344 69764 -66934 -118513 5736 73311 123681 49055 95173
9227 95173 87821 -73130 -139154 -93546 -47344 -70717 14991 -11403 -84460 -125194 -150653 -121371
9215 -121371 -13126 59778 72179 -21159 52859 23824 -126203 -197907 -57247 40222 40212 -56030
9203 -56030 -101800 -138159 -164440 -43955 153554 202923 111827 82480 5200 85883 96957
9192 96957 36267 8985 75770 -10259 -113789 -136763 -206835 -187252 -55465 107213 105012
9181 105012 38803 -112722 -245330 -184058 -76703 -32234 -41944 -150604 -65356 48172 28441
9170 28441 64298 10871 -59327 -68414 -53108 -98826 -9419 17330 59807 75707 13296 -26573
9158 -26573 -54381 -26558 23538 2030 -80063 -480 -17988 -169704 -200398 -52168 107267
9147 107267 102870 -4374 -58835 -51895 -96148 -7969 -54851 -141989 -138986 -98909 -18094 -26666
9135 -26666 -21127 2588 67661 95597 -12026 -178337 -72276 13921 56557 102548 98271 141634
9123 141634 87226 9158 -46167 -15189 99326 101966 23868 -31057 64407 106794 -19569
9112 -19569 -136842 -93958 -31562 -36085 -80467 -49073 -10344 -96529 -132180 -31823 -39646 13211
9100 13211 46966 -92025 -93803 -92787 -31084 34236 -67746 -71828 -46345 39025 -85841 -77438
9088 -77438 82216 191356 210949 91598 59298 36478 -15513 -110831 -121357 -122462 -8437
9077 -8437 53050 32894 33292 -10253 5900 -61284 -60505 70095 148869 153272 174119 197093 35075
9064 35075 -49712 20807 -74454 -63947 6112 -87944 -104067 -81311 7595 54136 38159 -99420
9052 -99420 -47830 97506 58145 -16481 -79974 14784 130622 160887 194582 87150 -21755
9041 -21755 -72879 -78510 21253 -65406 -44164 -78122 -30513 -7449 44529 -49433 -166266 -157318
9029 -157318 -127330 -83961 -58230 20105 38579 44718 -12219 -3490 -16165 -58031 -10630 8298
9017 8298 28972 85197 65371 92541 87156 111188 122168 -43324 -43154 60523 48710 -7000
9005 -7000 -47277 31734 -62515 -82050 -56068 53680 -76894 -188253 -177677 12200 61559
8994 61559 1821 786 -13829 164708 157990 134398 76499 -36815 -83557 -146130 -179225 -111877
8982 -111877 -138575 -172544 -119850 -92910 78131 113218 -34252 -213332 -157214 -173730 -155044
8971 -155044 -160402 -79472 -40727 15671 20998 63361 25469 -7797 22171 74462 13700 56782
8959 56782 -7702 -53462 -31652 -87787 -69823 -17796 -110602 -46337 53897 -21312 -35988 144316
8947 144316 221089 259122 136602 70633 72533 60866 25384 -147250 -185338 -74065 46287
8936 46287 107799 98722 67023 28190 36111 4611 39201 72954 34240 51694 88207 39130
8924 39130 22445 -50061 -106428 -19385 50314 15104 -91327 -145503 -160608 -89681 -43743 -115671
8912 -115671 -100746 -65830 -35473 -102149 -123024 -108217 -10397 101522 91691 73867 63690 23143
8900 23143 82318 47503 -40770 -70497 98817 121443 46998 -11496 -82165 -82821 -157804 -127747
8888 -127747 -32831 -8095 157957 232034 158161 188475 111185 58019 41800 -2911 63161
8877 63161 138430 99843 61549 46871 -22286 -13505 -126196 -225769 -125714 -68249 123921
8866 123921 125349 92964 164458 189606 176281 97784 36115 -18235 -145372 -55887 27148 57823
8854 57823 18837 -9800 -16216 -11045 -19557 20469 25851 88341 56572 -72243 -5474 38493
8842 38493 137242 130377 18678 3532 -25603 71181 150387 205170 265010 210401 287484 408491
8830 408491 436204 529151 670256 730634 777407 796316 737335 740308 655548 505068 457290
8819 457290 357519 191531 48484 87625 7936 -86881 44177 193067 171566 81796 60207
8808 60207 24145 -29070 -53992 16691 57299 73210 52237 -87098 -98729 31365 102408
8797 102408 86444 42610 10778 -77016 -192467 -204280 -163493 -182538 -89962 -81010 -70982 -13275
8785 -13275 11332 124216 44746 202114 263448 193565 83887 130977 66426 66826 139859 38214
8773 38214 -99450 1189 57598 34000 -17445 -46639 -61197 16917 76 88340 34049
8762 34049 -65345 14912 56974 86508 89635 95649 -2 -7458 -25694 19058 47880 58148
8750 58148 166147 185324 109402 25757 3918 -50909 -45139 -81146 -12605 122644 138294 36662
8738 36662 23257 62454 141721 74017 138106 250882 222214 231842 155031 113059 83113 44995
8726 44995 -2274 9046 71792 16922 -118415 -257463 -194357 -55182 -41796 -153668 -65267
8715 -65267 60951 69568 131179 72416 -2959 67931 120761 49430 40437 -44511 -125831 -98819
8703 -98819 -7975 -5580 42065 71435 33684 123391 169023 143312 82287 17663 126155 130451
8691 130451 92516 215555 198850 80598 45167 -63239 -142269 -167404 -148769 -96221 -100626
8680 -100626 -55147 -74646 -86163 -142453 -151921 -123211 -90371 -64995 -80640 -64115 -29396 -143914
8668 -143914 -256075 -231171 -60216 74972 130627 90212 -12428 13060 -9547 -12199 8712
8657 8712 46055 47151 81901 151061 67577 18123 19368 103177 119195 42768 -105000 -64208
8645 -64208 157023 224302 184481 88568 107503 31928 89043 164229 67229 -29548 -49088 -5820
8633 -5820 -34584 -61748 -20669 91018 70617 -37813 -77273 -115274 -47149 90501 130523
8622 130523 90885 35506 112317 31304 -41489 -35878 78560 66675 -142587 -196693 -209909
8611 -209909 -160894 -229594 -216249 -112136 -92796 -45144 32657 233954 208129 93357 42071
8600 42071 78910 123368 138924 42360 24753 -9001 -69936 -156687 -83557 -101532 184 -9740
8588 -9740 9073 55007 150899 94647 -15504 -33885 -124667 -214724 -167959 -148420 -74450 -11124
8576 -11124 -28729 29174 11175 16736 105442 115743 54170 -52321 -97259 -103696 -78781 26793
8564 26793 104164 88534 118679 63127 25934 36908 -64001 -104455 -67433 -25468 9384 -43163
8552 -43163 -24794 49120 130998 129338 130287 33622 20572 -26200 43596 129466 159501 190529
8540 190529 187555 283076 246665 106914 37394 -12646 59034 82448 159422 136984 90968 104303
8528 104303 52589 93333 194888 315085 324458 234997 282282 502345 551733 588265 635775
8517 635775 658803 663164 609078 544087 438828 474677 579402 644284 516203 407436 421577
8506 421577 489669 367838 263597 237856 373988 338081 269572 427871 423507 223051 208357
8495 208357 110126 -70693 -212653 -28370 46714 161630 70001 97123 42879 80803 92231
8484 92231 71454 99132 98604 -30828 32702 78040 108552 353970 449859 612150 736757
8473 736757 785134 825843 1015131 1120198 1133913 1083652 981901 1032830 1154651 1211139 1056322
8462 1056322 919761 707327 463880 394651 441007 386919 364869 360203 318033 212150 213833
8451 213833 219297 235690 203025 157578 204954 197679 205097 195491 141491 180638 303330 218918
8439 218918 170358 146379 125724 178207 257605 215148 186902 135172 242126 320023 405961
8428 405961 537337 581092 572172 622067 664684 717982 593581 626479 562939 516612 394303
8417 394303 330041 234491 304117 282337 313322 224562 223969 319260 290240 181629 57520 79671
8405 79671 173502 273334 285310 230900 144467 135250 130717 47112 75766 -25201 -84577 -122483
8393 -122483 -78801 40274 130692 156183 25488 -15536 61905 182903 118354 25646 -74802
8382 -74802 6679 -5604 -42199 -71364 -95999 -67868 -37208 -150397 -196298 -140403 -87999 66690
8370 66690 126713 171572 86223 29747 -19523 -29624 133020 90493 -40729 -100544 18589
8359 18589 12617 82340 67248 68251 73465 105743 113926 100113 -15628 37860 124634 71378
8347 71378 -34494 -134161 -61841 -58748 -111354 -67006 79754 207899 287207 315256 228633
8336 228633 207040 153020 169995 233340 355498 268705 161912 194554 166028 168652 83939
8325 83939 -28218 -89071 -64341 65173 177356 88726 26783 -30481 -143073 -96672 -33118
8314 -33118 -53113 -3354 105543 121972 62242 -33034 22199 55830 9237 46636 191169
8303 191169 285593 190530 159634 177909 86887 75850 15247 -42864 13215 49708 222585
8292 222585 366760 315402 322177 433746 554456 630434 655326 800174 816311 823809 761609
8281 761609 571755 321836 152326 89851 46876 152106 277732 256854 35153 -14533
8271 -14533 -11175 36056 14077 30621 -1715 3781 59787 41039 2712 -70540 -17771 44743
8259 44743 32475 -33126 -189097 -266568 -172388 -118712 15836 228876 242457 210863 265595
8248 265595 256424 226045 167788 162321 105327 46402 86260 230536 271135 432984 520757 413377
8236 413377 233615 -53025 16754 117937 143495 142649 145995 150907 174942 220677 130956 148352
8224 148352 99844 5943 87272 42822 -26504 -76433 -61132 -37272 -70984 14688 224837
8213 224837 276474 316515 277750 147367 51425 128458 292674 218630 42956 -49603 -146411
8202 -146411 -130625 -63988 -60205 -42743 -26370 45654 105643 16392 -135891 -155280 -62453 -49802
8190 -49802 -83285 -108674 -68752 30009 39126 7998 -90159 -89048 -101192 -36410 -49904 -39776
8178 -39776 -89602 -125763 -206232 -258147 -116124 -92218 12762 11509 147804 112665 43731
8167 43731 -12937 32642 -89064 -139121 -62531 28121 102483 50637 -129776 -143333 19078
8156 19078 11743 55221 170398 227163 182781 210602 143817 78629 98820 -32920 -126133 -140408
8144 -140408 -90968 2330 105215 79497 172102 172774 55102 49430 85597 69352 -59901 6402
8132 6402 158234 161634 114073 28711 61356 79842 83923 42866 36416 102424 -44160 -102810
8120 -102810 -57534 -165254 -256522 -184507 -99314 -146799 -32427 40444 81173 106510 -31979
8109 -31979 -23435 -29894 -82748 -57848 -59839 -120500 -188523 -173400 -46680 -1299 -57889 -52866
8097 -52866 -35831 -85416 -119396 -81891 -74453 -131748 -92288 -4413 12863 -11259 43967 172955
8085 172955 240330 195728 -18524 -82394 -1476 88833 69717 -18552 -7131 -59538 -28000
8074 -28000 -3355 -19024 -72805 -64621 -34517 -79373 -5337 -10797 30086 504 27664 104860
8062 104860 99373 143839 106812 55379 -4832 1725 5112 60148 103084 123468 -12434 -137606
8050 -137606 -150900 -139611 -49401 -104692 -192656 -105228 96746 48018 -108410 -166556 -169235
8039 -169235 -101674 -44396 13321 -37972 -94579 -39365 -9608 -109125 -179226 -17983 56739
8028 56739 76117 19844 -83352 -197924 -123145 -71508 -97124 -181668 -223483 -112283 -98646
8017 -98646 -151580 -134370 18206 -21447 47653 15568 -62569 -178921 -140518 -83133 -35807
8006 -35807 16199 -6326 -82961 -153906 -112985 8898 28563 -61785 -86031 -30664 -62196 -129301
7994 -129301 -82752 -104825 -60633 -64810 3044 56454 146463 182529 220667 122917 19560 -59271
7982 -59271 -131547 -126469 -228018 -200590 -187785 -159326 -126108 -180490 -192457 -68794 -59280 -86795
7970 -86795 -13567 -8086 -6271 67446 107765 111765 130797 181039 145887 55202 145503 216638
7958 216638 60902 -53697 -42318 92554 24182 -65161 -40862 23290 138361 49618 -50655
7947 -50655 -10805 -19874 -41122 -70410 -111014 -143592 -163540 -207267 -325155 -223710 49739
7936 49739 183219 143977 43711 -12439 37145 -14343 -90450 -15827 30346 634 -55368
7925 -55368 -33709 65384 107584 18435 -122460 -140281 -70453 -71691 4944 5728 16852 19234
7913 19234 8323 83471 217741 166371 91743 57109 79240 31377 -29971 -122281 -113012 -88070
7901 -88070 -134325 -143475 -77064 -64282 -83025 -1248 82471 26198 102108 48353 -51207 29623
7889 29623 -7166 6606 74991 94959 101033 136543 82428 60845 131564 74964 -36194 -49818
7877 -49818 92658 204568 190308 192536 206948 295364 232268 146897 125371 116123 99263 46821
7865 46821 -78449 -68795 -103924 -153118 14158 139343 58598 6371 -86095 -20492 26040
7854 26040 18942 23581 37952 26666 -51668 -46589 5254 73582 -42552 -4506 -45284 -50451
7842 -50451 75968 17321 -157491 -226695 -220209 -168189 -84481 -141893 -97308 -28634 -10804 61773
7830 61773 -44300 -68395 -31527 -68972 -44995 -56619 -97914 -53932 164255 214772 97068
7819 97068 10643 -18816 -68331 -24566 -53543 -77893 -79442 -25747 -15446 -11915 77607 175017
7807 175017 145326 112935 89312 38377 -36287 -96823 -136377 -91080 -112346 -120831 36440 146359
7795 146359 91759 -14075 -33311 13618 92484 61652 39333 31485 102299 78779 -20573 31189
7783 31189 50092 -82192 -77174 -72292 -124583 -203446 -164232 -159350 -76314 -55882 -12265 9657
7771 9657 28426 5807 108254 206341 188547 145659 56399 -2952 -20228 -43189 -58059 -52300
7759 -52300 27413 51344 31479 8895 -24712 -46303 -14414 61342 173995 43866 49079 46700
7747 46700 87924 185282 184644 83473 102368 63097 49736 -83253 -145271 -46070 25105 3016
7735 3016 -2326 60358 14611 -56024 -51623 38751 20145 -16529 -54639 -96762 -9077 88671
7723 88671 155672 118091 -54450 16275 97034 157610 -68401 -113366 10721 -30159 43718
7712 43718 76518 -12418 25489 50942 50152 36757 -105848 -122032 -113649 -26041 -6356 -35035
7700 -35035 -94643 -40536 91547 109011 20824 -78248 -243909 -241036 -133231 -35458 -3210
7689 -3210 -102991 -55163 -68900 -24109 164510 182669 72683 -31492 -81427 -40101 -24096
7678 -24096 49154 126273 183268 78336 -106366 -120095 -76420 -203541 -290682 -233082 -136598
7667 -136598 -135498 -167128 -264661 -324843 -260584 -240160 -271781 -178785 -108812 -145889 -62787 -85547
7655 -85547 -98244 130535 10636 -156190 -132664 -157908 -179530 -125734 -95103 -211568 -102251
7644 -102251 -25506 17710 -77703 -228259 -255289 -141725 -41170 -79249 -76505 14721 69246
7633 69246 83048 21084 -91643 -38553 60304 66948 -42992 -41355 -16210 -7948 73994 177778
7621 177778 164288 210333 189280 135869 184525 243680 233108 37979 -93427 -203342 -118526
7610 -118526 -123240 -117988 36615 103331 -4481 -22939 23081 98786 139831 89022 -3402 93308
7598 93308 151518 141672 138318 256112 217687 23904 -84330 -71921 -154815 -153296 -129058 -116073
7586 -116073 -55782 22246 24137 -35395 -104404 -127822 7250 -91884 -224795 -233020 -151340 -47144
7574 -47144 -22157 -141018 -122294 -14540 119235 89714 -3091 -120795 -246357 -163014 -64682
7563 -64682 -56378 -81893 -117062 -114044 -139915 -71341 22153 105262 163367 62149 -3177 -20373
7551 -20373 -50386 -42592 86323 -44975 -180637 -233159 -257758 -263434 -119068 -117214 -138631 -107140
7539 -107140 28532 75483 -31698 -126523 -54173 -10370 -47095 -136116 -263721 -183406 -108974
7528 -108974 -102094 -89305 -132797 -2014 136349 106874 49765 121926 72351 121280 85755
7517 85755 -93141 -96178 -19662 -78550 -82450 -121133 -135306 -174954 -144406 -113776 -131912 -215926
7505 -215926 -204701 -252813 -164143 -85283 28345 140740 200578 147300 135423 114584 33363
7494 33363 -33609 -84332 -54001 9023 -21797 -39682 8021 15544 21944 91772 142588 110006
7482 110006 28516 -15166 84284 -54142 -161295 -162879 -75392 -50651 -62271 -18966 -25299 -39640
7470 -39640 -94763 38562 118797 62977 122879 70789 35378 -54702 -116290 -48515 -37368 -15361
7458 -15361 26953 -940 -28990 11062 -85959 -104013 -64433 -27508 -139069 -213176 -142040 -14037
7446 -14037 170390 196604 129979 96190 -4804 2358 111914 240512 206685 187245 150403
7435 150403 164394 89035 117463 105581 75831 -5560 13188 7582 140330 214541 186379 176857
7423 176857 125630 120197 172538 136793 76004 106870 153946 132672 105396 92275 68875 165208
7411 165208 136091 -25459 -2226 23513 -12837 -38511 -169718 -143304 -34358 -21568 -2968
7400 -2968 -17492 2131 63684 73617 189660 134622 141142 161509 89636 -74237 -10686 26249
7388 26249 -34035 -63437 -65249 -152068 -230968 -178064 -152196 -44828 -23403 -38280 -72812 -58644
7376 -58644 65900 12878 -3462 46235 114201 128015 -5813 -32532 138129 113455 114355 231289
7364 231289 196739 44380 -59010 7655 -101273 -149942 -104756 56696 142970 6804 -35518
7353 -35518 47892 -7121 80519 4056 -51447 86445 72186 29445 120898 50707 -11466 -66644
7341 -66644 -108665 -135587 -160588 -189953 -157747 -107974 -108661 -49753 -9798 37979 149734 166650
7329 166650 244285 158233 90726 11989 -59598 -211219 -137307 -71353 11614 12519 18643 36508
7317 36508 106754 122231 115613 -47052 -77399 -49695 -20909 -16537 -100941 -87493 -174340 -133758
7305 -133758 -34128 -24991 83401 114492 138834 17825 -44752 -123784 -185074 -216981 -100982
7294 -100982 19259 11886 -18738 -17378 63159 226873 228922 63705 -158722 -146679 -56044
7283 -56044 -8175 -166582 -117948 73580 108436 -83166 -168426 -84375 -60939 -27337 27184
7272 27184 120852 29502 -33223 58954 119811 -2485 -58203 -72672 -126637 -73516 23974 33676
7260 33676 122157 219585 95837 -21512 30461 92461 32122 42054 80932 58911 84950 102615
7248 102615 18587 -180286 -270743 -223737 -176668 -240084 -209430 -138359 -146777 -112653 -90992 -82133
7236 -82133 -38254 -78696 -42307 47093 136249 89727 50171 -60616 -128908 -127586 -112868 -13223
7224 -13223 83486 122363 115746 5153 64031 69164 7482 60220 118905 135577 69440 44314
7212 44314 128065 184145 91267 -23952 -30378 17344 32214 -13723 -70183 72409 38979 -35171
7200 -35171 74126 21780 -180330 -182332 -146545 -94152 -61270 -145170 -68242 75750 178624
7189 178624 83444 37444 16309 -29065 -24443 2963 -24064 33111 10212 18620 -19696 -112247
7177 -112247 74086 81868 -30213 -63268 33320 179314 55884 -55865 -20812 -128970 -168264
7166 -168264 -84980 42543 158154 137877 38622 -50098 -80657 -147148 -58571 21587 65755
7155 65755 167203 106516 141161 192169 272649 168685 -30626 -162831 -234835 -271587 -177294
7144 -177294 -69830 -18617 49873 111711 152658 164278 61375 -50132 -87408 -79968 -140616
7133 -140616 -109885 -68687 -49064 -123893 -236359 -203733 -181378 -156112 -124684 -115507 -100231 -16523
7121 -16523 5566 168948 176883 3396 76509 86007 92347 -95437 -25233 234015 317879 275470
7109 275470 180716 48548 -47302 -51506 1622 -24248 -73340 -32132 -60180 58115 116462
7098 116462 -27653 -95559 -100048 -45849 56291 122810 155828 145101 162861 123148 27455
7087 27455 -2786 28238 6256 -14668 -142116 -175942 -100013 -60892 14531 58455 -60532
7076 -60532 -42622 33855 85673 111746 72787 73840 99471 49785 -15557 -150060 -115946 -157399
7064 -157399 -205644 -183742 -82355 74429 109603 123565 71165 78398 125847 36083 -74405
7053 -74405 -142534 -86652 -65158 -57907 -134830 -151841 -165560 -194384 -224492 -205440 -179921 -182139
7041 -182139 -208927 -202737 -283230 -188830 -90272 32285 -6358 -138952 -198646 -190357 -113863 -110531
7029 -110531 -163847 -182322 -92938 -63508 -82304 -119512 -117357 -140388 -106522 -8888 54905 74194
7017 74194 40569 134060 156758 -54367 -120956 21998 40640 59888 127599 83815 68336
7006 68336 145627 66828 -45635 121593 116110 215283 205143 102163 -33793 2908 461
6995 461 7455 35807 19779 -68327 -5791 8275 -43522 -101015 -180108 -174398 -140921 -148912 -194915
6982 -194915 -107271 15442 38385 3928 -19402 22825 32452 -34024 -150866 -58155 -37743
6971 -37743 -142285 -302941 -236515 -114953 -86236 -124653 -33980 143005 177895 158994 29823
6960 29823 20955 141820 146353 151281 205290 185062 56297 -1158 4725 17607 3332 -63917
6948 -63917 -108140 -80406 11744 -9708 6772 40426 -24147 -444 -17742 -19361 -69817 -154425
6936 -154425 -104602 14088 88111 19896 56244 76737 18640 -29275 4555 48260 -84360
6925 -84360 -242259 -190097 -142187 -93153 -90126 -82950 -54373 -134072 -76948 47269 -650 -6675
6913 -6675 19154 -62686 -78764 -51933 -108067 -50818 -41373 36322 44731 -50444 -13355 -38839
6901 -38839 -88955 -2347 70473 120921 172233 97473 -4071 13839 95133 72824 15487 -30935
6889 -30935 -80905 -111596 -130188 -149317 -103255 -82105 -173342 -216301 -177864 -130316 -101977 -8347
6877 -8347 139911 63957 -107535 -109351 42327 -87810 -179523 -277160 -271365 -174079 -172742 -227734
6865 -227734 -187360 -103639 34069 104657 75694 -7205 -53374 -12371 -66095 -30661 -49138
6854 -49138 -111802 -80364 -75082 -81137 -147134 -200940 -235328 -154980 -21545 103435 115987 91787
6842 91787 104385 106998 193203 267348 253240 209780 62874 -81173 -57738 -11037 -26027 -108844
6830 -108844 -189452 -286256 -230401 -163633 -166051 -134119 -134065 -53452 -29351 -69002 -44156 -11387
6818 -11387 44963 54180 -45743 -89358 -146569 -150895 -116005 -135344 -31451 126729 49131 -26339
6806 -26339 -60103 -98016 -152200 -84184 -66420 -117662 -78807 -41294 -119697 -145666 -77852 -25065
6794 -25065 -77369 -52401 74660 142885 158057 78562 96809 91422 -12636 -93925 -77412 -34620
6782 -34620 -32178 -56966 -156080 -175497 -138955 -162037 -119370 -53809 -73698 -20824 149988 188955
6770 188955 84057 65075 83481 69633 183684 273848 257139 232719 220211 181739 165923
6759 165923 109214 9278 10401 -43760 -154541 -237533 -160856 -6196 -26726 -80344 -94387
6748 -94387 -65845 30816 183122 183785 95504 86285 3156 -61081 -191777 -231929 -154894 -158172
6736 -158172 -209163 -312070 -220644 8904 -38888 -103082 -182142 -214926 -205831 -122993 -193077
6725 -193077 -89209 -98224 -114435 -97520 37648 -52742 -90705 -131944 119201 183857 176107
6714 176107 110090 84772 113514 -3510 -38818 -128769 -100551 -77121 -65005 -7757 7652
6703 7652 -117802 -127428 -93648 -166077 -117568 -10876 -14622 56166 -7003 -154541 -248848 -262101
6691 -262101 -157237 -31708 7811 -288 81781 54151 -15771 -54766 -38567 -73155 -83921
6680 -83921 -80799 45093 103443 124497 105742 -39166 -54910 -98553 -102389 -169013 -95786 -15102
6668 -15102 -39746 20292 -42156 44521 156399 177479 160644 68251 10525 73919 88416 82825
6656 82825 117550 -24230 -111226 -119087 -137200 -154204 -102774 -56431 -75842 -163304 -123871 42022
6644 42022 85909 91764 48179 23062 -29208 -101175 -216440 -207556 -45453 60272 85658 175232
6632 175232 101535 124963 110537 75535 -39131 -28644 26896 21512 -17435 -67327 -9400 -23645
6620 -23645 -3054 27802 -65199 -72490 -49986 46228 38290 35070 16 18578 -33732 -66108
6608 -66108 6553 -24216 -60093 56038 33152 28373 100161 75173 21820 33907 39099 37380
6596 37380 52848 35382 -37224 -55493 -131700 -225145 -223406 -125685 -24664 -106805 -154323 -230119
6584 -230119 -277465 -247623 -168737 -137444 -137064 -272001 -390741 -428207 -265025 -166894 -136968
6573 -136968 -165457 -148746 -104892 -85222 -56634 -52955 -165888 -180121 -89002 -91770 -104281 -24739
6561 -24739 65504 33145 33121 80860 147921 173417 178145 98997 11367 -45383 11757 79471 64280
6548 64280 97517 136978 160363 39772 -55856 -28491 -33962 -93628 -47834 15023 -64031 -93718
6536 -93718 28408 159722 257558 256105 113711 20854 -28428 49570 175718 130014 38683
6525 38683 -75518 -155776 -42492 -3770 -16606 -41101 29246 136269 176712 38459 -135131
6514 -135131 -86745 20633 8313 63401 -20751 -74771 -169159 -157547 -107456 -79664 -8445
6503 -8445 -46367 -22821 -25560 -33047 -130120 -179114 -37518 -20354 57117 24270 -67014 -67964 18133
6490 18133 -3783 6799 32153 -23790 859 -113676 -201483 -205154 -222655 -237261 -275192 -282161
6478 -282161 -140004 -52740 -40679 -90773 -150041 -107408 -86151 -68429 -82477 -128177 -180192
6467 -180192 -240484 -244897 -104458 -60277 -49670 -195540 -113176 -80992 -166936 -149707 -105753
6456 -105753 -82529 -51855 75805 64007 56539 58952 58400 -3185 2075 18105 20641 138378
6444 138378 157849 161906 153659 36183 -68420 -142072 -175096 -117508 -64966 -75726 -15592 3899
6432 3899 30757 -17801 -40777 128378 142755 33956 -111976 -237575 -153538 -134625 -217852
6421 -217852 -253597 -138854 -117904 -216893 -254611 -226996 -195220 -124652 -66651 25902 -10550
6410 -10550 -13039 28153 185285 191863 206407 97347 102590 87724 39122 58180 41877 92534
6398 92534 144531 -63851 -84213 -85 -37816 -26239 -104035 -135592 -119221 -133717 -58084 -136204
6386 -136204 -150677 -142588 -168879 -78018 -32389 -45970 49047 90686 107244 218736 257041 169345
6374 169345 133701 108384 157591 170104 -38337 -175064 -121594 -95672 -2709 124312 131809
6363 131809 108442 127913 104548 28159 -31731 9812 28421 -34848 -136241 -173616 -54468
6352 -54468 -152336 -188686 -60691 -69674 -20612 37112 12745 -148404 -264723 -242702 -119600
6341 -119600 -125671 -119144 -106947 -85231 -68048 -104601 -42855 124194 131310 172307 209121 365398
6329 365398 372615 252077 195964 190233 118926 72941 75424 2842 -51773 -15354 -76821 -96339
6317 -96339 99432 104832 62979 -52409 -43643 22467 -158467 -306112 -193605 -116889 -196486
6306 -196486 -231313 -128442 -108811 -37394 12649 36105 114228 173233 72684 28282 40242
6295 40242 -69041 -142520 -169622 -110968 14393 12402 95709 95054 51097 -37090 -60486 -43442
6283 -43442 -85110 -58819 92666 166642 220039 93497 12473 -104509 -143773 -95286 67548
6272 67548 191629 182905 -17791 -80967 -47088 -22529 -15031 8487 64141 27991 20963 142264
6260 142264 130676 33152 89162 20646 17211 9699 2101 114134 69469 -14616 43370 -46390
6248 -46390 -57332 -72334 -34826 -37746 92287 156583 88708 14513 53179 11288 -100690 -158895
6236 -158895 -311948 -328340 -307851 -346651 -317081 -297087 -163397 -138570 -178978 -153015 -204386
6225 -204386 -202592 -153841 -159320 -18991 2915 -73398 -80548 -62096 11771 6038 -80530 32386
6213 32386 129060 188412 123705 -52943 -72345 -3926 -19062 18527 -119172 -166802 623
6202 623 9661 -4660 -108756 -85539 -104805 -103218 -87230 -132922 -58963 -65441 -40483 -111273 -40052
6189 -40052 -37977 -44349 46285 -23264 -53556 -23449 4106 -80147 -83779 -56330 -21747 25743
6177 25743 98225 70279 131358 209425 93263 66594 -29817 16707 90287 28001 -9954 117445
6165 117445 189059 159619 137094 42971 -1428 22650 18787 -81985 -36635 93587 211153
6154 211153 243465 59930 -5172 46570 35458 -91111 -184914 -237711 -153231 104764 52440
6143 52440 -85395 36229 105857 117546 195476 29731 -84478 -35788 -120934 -112461 -102331
6132 -102331 -82696 -2709 46511 -3504 -113607 -113439 -153389 -133018 -15414 -45077 -40104 -2986
6120 -2986 12364 5876 -41125 61471 117067 211156 243703 215417 46768 84013 92745 2952
6108 2952 27725 57808 74965 77380 38843 -53385 17680 131532 128348 39697 -305 -68105
6096 -68105 -131397 -222752 -243147 -98023 14011 58483 67927 -11886 26463 -32252 -37230 23986
6084 23986 -67310 -14222 8115 36247 18993 25985 -13642 -68344 -124309 -82852 -26334 11272
6072 11272 109284 98578 108790 130380 86785 -14554 18017 -17096 -80283 -84259 -174419 -136043
6060 -136043 -15415 23112 130139 126607 75082 2693 15254 -92290 -53632 100670 154250
6049 154250 72502 75207 106357 93354 182194 287520 267982 100220 -80160 -194157 -240847
6038 -240847 -166475 -48978 43886 62943 -86833 -168467 -86685 31602 95873 89516 117793
6027 117793 90481 147073 140472 25004 47182 71359 -60349 -97124 -135385 -124508 -91707
6016 -91707 43344 112687 93131 -5613 -78573 -90749 -28934 15367 -57857 -111264 -99917 -121104
6004 -121104 -120606 -154884 -37438 79509 -34210 15420 153005 62839 84299 196086 121672
5993 121672 121844 181855 232821 167935 121280 27377 21666 81087 146839 203223 167222 164811
5981 164811 141002 44741 6001 8796 -155862 -226971 -186449 -165882 -77241 -90889 -87802 51011
5969 51011 -1626 -84105 -51521 -59475 60432 53846 17630 36096 51335 10349 55635 1432
5957 1432 -59154 -85144 -72380 -18414 56826 -41716 -45777 -102895 -145862 -104959 -149094 -103782
5945 -103782 -65336 2747 -29074 -99372 -3519 -100097 -75289 23763 99416 109868 68481 130179
5933 130179 180759 110691 -48342 -58631 -10527 20226 62267 92614 87104 106962 202000 198049
5921 198049 62278 -15565 59609 51366 -4355 -46575 5563 60149 29231 115858 190507 143661
5909 143661 86360 188095 231986 182608 75610 100595 62173 25377 -43595 35522 71310
5898 71310 60878 25685 23810 -106705 -97202 -14358 129162 183370 97086 -52916 -62729 -3779
5886 -3779 23976 -209515 -194078 89271 67256 -872 78044 95895 146901 110323 74007 70770
5874 70770 10785 -141357 -169862 -24328 -25803 -55122 186353 250630 203334 103263 -43275
5863 -43275 21518 124033 62088 132191 99108 -40322 -74114 -2195 -14929 -77082 -151071
5852 -151071 -185503 -191778 -209967 -133294 -187142 -177227 -158375 -126657 -59092 -73407 -32111 24790
5840 24790 95733 100011 154213 242414 250096 157606 111078 60182 25648 -38220 -124246 -204120
5828 -204120 -205682 -3715 107149 56327 79700 106512 153200 159694 113953 21659 -53503 -90655
5816 -90655 -25722 63313 184699 205343 24453 -110335 -117767 -14938 -23024 -62650 -2173
5805 -2173 24719 -29244 -44751 -28830 63202 84827 51252 51173 5691 72561 35834 -115234
5793 -115234 -25789 -95894 -111456 -69852 -43645 -75899 -155308 -162217 -167970 -58318 -62760 -85119
5781 -85119 -16021 4714 -63756 -115125 -105234 -180423 -29400 49925 -24750 -2796 101293 66682
5769 66682 -43248 -73472 -91100 -111002 -16746 27318 59811 -14612 40214 186694 242973
5758 242973 159188 134975 124824 33343 31342 92239 -35853 -31577 31187 -23860 -30163 32007
5746 32007 101586 166840 133733 36269 -11813 -75458 -49623 -65693 39822 -49636 -128638 -106450
5734 -106450 -123748 -39842 11917 -15480 26026 26540 -31885 -69865 14181 21813 74632 111195
5722 111195 2657 14355 6957 847 88194 205821 190027 152665 96118 37713 -21705 -57421
5710 -57421 -79288 -142731 -96163 -112698 -107721 -26894 -21016 -51985 -4903 125277 121702 130024
5698 130024 -4376 -180790 -156457 -10618 24616 14761 20467 -19385 -207 34076 25710 -2998
5686 -2998 112463 182728 36775 13300 -21931 -14688 4470 -30140 -66198 -84252 -106330 -145056
5674 -145056 -123487 -108842 -4348 10718 -61759 -118069 -182451 -201419 -100310 -25151 -27658
5663 -27658 -33791 -131688 -251076 -260446 -257571 -181600 -53275 -71098 -22727 -13166 -47579 -142505
5651 -142505 -152529 -38216 -84185 -65992 -70146 -143717 -120815 -67602 -128004 -140727 -79823 -22322
5639 -22322 36107 155323 197018 192404 198107 258064 96744 -9305 107950 140360 92029
5628 92029 145196 154653 -2046 -173684 -42915 -44246 -235 96457 97279 113051 176177 190657
5616 190657 113593 32256 8825 -67024 -125009 -154764 -63663 41683 80809 27259 64503
5605 64503 -12721 -25112 -45064 -91904 -144119 -238293 -219031 -37924 52966 37330 65021 -69768
5593 -69768 -170465 -132995 -82926 -23671 -77178 -145059 -23457 50151 84272 186189 98205
5582 98205 74867 -8160 -113864 -106926 -64842 -36787 -33843 3536 160878 160505 80538 20555
5570 20555 -47207 -94426 -155876 -132820 -212908 -187434 -28284 32887 65822 54291 75214 63163
5558 63163 95601 54901 2230 -60693 -86120 -91148 -55633 -136660 -106807 -50824 -59823 -10836
5546 -10836 -53138 -47996 10691 -83773 -132187 -147782 -85622 67943 31695 12410 -53655 -49050
5534 -49050 -29329 90821 4788 -39537 -69089 65652 189904 168521 -19490 46257 64472
5523 64472 72906 155307 237873 278242 230294 115679 -71272 -180030 -99132 65346 95996
5512 95996 106541 188397 184197 173083 182117 159280 30313 -582 102267 158873 213485 241252
5500 241252 231197 151000 151913 240845 243355 201128 157344 112821 95793 128842 116415 96062
5488 96062 12922 -104852 -144968 -128738 -40154 -114673 -309790 -272943 -259007 -284507 -259863
5477 -259863 -265360 -302494 -202705 -186165 -91979 -52042 21132 -8967 -11855 11362 -58351 -62717
5465 -62717 132273 165949 226694 196246 168818 63261 20814 -50917 14848 90681 -6544
5454 -6544 -68480 -116382 -60452 -132507 -149842 -132073 -19001 39218 13512 -25306 -12624 91015
5442 91015 91451 90632 29818 -18755 -64953 -67164 71588 54329 27583 113951 227346 220340 293665
5429 293665 265651 193631 118797 2947 -24620 -34472 13352 100012 -2169 -127211 -45598
5418 -45598 36519 42311 -85507 -105811 -2358 105465 35967 -95257 -88095 -80709 -214595
5407 -214595 -225659 -145806 -84425 -80035 -42679 -52204 14641 46851 -116930 -187864 -92346 -62296
5395 -62296 -70864 -61895 -75360 42193 82736 14386 -35913 -78476 -181362 -187894 -69703 85124
5383 85124 138546 87354 25220 -187 -46187 76981 215319 334084 278159 124336 68438
5372 68438 -64707 -32811 112553 200926 86200 -30240 -61078 -148993 -171547 -89046 -42068
5361 -42068 -235913 -132718 -86454 -145467 -216394 -229377 -48345 81708 233807 187900 67683
5350 67683 70836 39528 -117245 -236015 -99809 2076 -224257 -204146 -9346 69486 -25552
5339 -25552 55386 77848 48882 53182 30770 -60649 -81168 -83678 33531 43387 36101 50969
5327 50969 69874 60511 -6366 -88646 -161736 -170639 -57944 -79744 -25596 40622 -7413 67436
5315 67436 167384 112430 17801 19663 -43538 -35654 -123487 -224264 -107918 53847 145494 86234
5303 86234 -2273 -24465 37997 100899 15239 9981 49281 8517 64459 64984 -66434 -244495
5291 -244495 -223740 -31609 -45298 -191966 -136741 -91510 -18884 27664 86521 73359 -57544
5280 -57544 -68498 -3807 16054 -5772 -85908 -10808 -39757 -72278 -68514 -1873 38403 38582
5268 38582 -96309 -205523 -87953 -26114 112727 37204 31472 41473 8809 -10984 -125118
5257 -125118 -172827 -121168 -147379 -129876 -56252 -34358 -11805 22671 83777 67265 -18756 -63204
5245 -63204 -5237 62382 -71604 -240882 -273974 -249055 -89892 -51376 -25165 -60931 -18708
5234 -18708 9962 5078 -96553 -124201 -132557 -106999 -114194 17319 93105 198280 147352 95457
5222 95457 90482 158864 145133 35060 5353 56636 18059 38510 175511 237600 206195 209835
5210 209835 198641 201465 56594 31810 5557 30438 59585 53831 45472 -44515 -56569 -71078
5198 -71078 31800 105662 52826 56888 49142 -17188 -20078 -73077 -88773 5340 -23220 27039
5186 27039 49285 -5282 -61791 -123694 -72834 -51612 -69439 -79709 5069 70167 -22721 -38793
5174 -38793 46251 76830 84283 13215 18223 31691 128569 219966 218449 203198 170411 41467
5162 41467 -25123 -65677 -27112 -67383 -32667 -43488 -105933 -97562 -217597 -252878 -155837 -35033
5150 -35033 7817 -145272 -239302 -163058 -68815 -112814 -164572 -209321 -272319 -183212 -207962 -187887
5138 -187887 -77263 233 134684 78255 114719 127992 85125 -4197 13077 63834 65760
5127 65760 78144 7331 -169712 -232062 -196346 -87746 -52155 -115822 8548 -10212 25346
5116 25346 22919 -92860 -80657 -43149 13555 21783 11771 -8963 -22910 11851 -37864 -30373
5104 -30373 -33713 -58748 -50617 -89483 -132441 -45455 42149 39093 83619 31314 6212 -19046
5092 -19046 -17037 109569 202045 115214 -24803 -71699 -45325 -18389 22046 59852 170175
5081 170175 33576 -99286 -63656 -77818 -133935 36968 126031 102690 80955 -39212 -152799
5070 -152799 -150849 -105475 -25587 -91 -74232 -130125 -165615 -128837 -123494 -194398 -232841 -155072
5058 -155072 -29752 -67024 -101462 -67540 -49909 -103708 -65882 -6436 11414 -8668 -130771
5047 -130771 -204602 -181251 -113136 -31029 31111 71269 144365 95355 -78181 -190082 -33596
5036 -33596 143856 82528 173110 125648 35703 -69349 -71585 -12071 -40938 -20502 -36095 -78520
5024 -78520 -133799 -187759 -71948 -81639 -104810 -172473 -214885 -129949 -20883 40764 106539 130397
5012 130397 13901 -46592 -52423 -46090 -20590 -2395 61260 -35427 -63153 8356 55025 -4295
5000 -4295 22986 34233 -73208 -128733 -24228 65534 66778 -30455 -172554 -170576 -135133 -133675
4988 -133675 -72869 -21779 -26162 -146999 -335688 -198830 -13309 -35453 -108744 -52697 -79049
4977 -79049 1262 -47304 -15871 111652 121267 93676 61707 -16871 -125716 -111729 -10589
4966 -10589 22582 82626 23147 81350 91916 68894 -62337 -70909 2636 -10704 -67391 -73782
4954 -73782 -69410 -7109 58366 -20577 78680 135419 162951 33098 -64546 10258 103306 31145
4942 31145 -49485 -70471 40772 133452 129656 18629 -138887 -73480 -99840 -199111 -234388
4931 -234388 -173684 -122167 -142571 -106797 -122951 72999 82802 97316 106552 58589 235893 156749
4919 156749 -43278 -105354 34176 191409 114021 106687 55541 30665 -45985 -180994 -135787
4908 -135787 -86669 -50073 -76050 -93478 -10401 83011 53466 61260 -1261 -50274 11205 -34781
4896 -34781 42328 -30263 -41382 54403 225355 311296 314601 282077 39700 -117466 -155020
4885 -155020 -106465 5913 30086 -27688 -13261 115010 63946 11774 23915 15557 -27324
4874 -27324 79207 215831 245231 233935 167001 -15889 -97912 -99158 -150152 -182154 -94934
4863 -94934 -6822 -20745 -69716 -29456 -43547 -146297 -57992 25411 67460 82693 47680 24198
4851 24198 24526 5539 -101793 4625 22109 9706 39990 -69381 2498 32334 39939 113387
4839 113387 79406 -42802 -42143 309 154124 230985 118652 12336 84466 107092 69539
4828 69539 158117 124215 163842 248975 134753 115762 67762 -47627 -19470 59527 108249
4817 108249 48825 -39024 -47629 -108835 -176324 -169714 -87530 43552 89137 98513 117498 46524
4805 46524 -13206 50248 70030 86038 50577 -49668 -30443 -1496 -135074 -216659 -85690
4794 -85690 8529 141643 196980 68219 -41121 -62028 -40407 43799 -53345 -102429 57931
4783 57931 82043 53354 -65291 -12823 -58662 -258061 -282091 -196344 -60302 81361 155017
$$ [...]
##END NTUPLES=NMR SPECTRUM
##END=
