##TITLE=Analysis number 318602
Compound Code mo 01145
Project Code adrs
Chemist Name fudan
##JCAMPDX= 6.0         $$ Bruker NMR JCAMP-DX V2.0
##DATA TYPE= NMR SPECTRUM
##DATA CLASS= NTUPLES
##ORIGIN= Bruker BioSpin GmbH
##OWNER= nmr
$$ XWIN-NMR		Version 3.5
$$ Wed Apr  5 15:05:47 2006 GMT Daylight Time (UT+1h)  MAYBRIDGE\nmr@NMR_250MHZ
##.OBSERVE FREQUENCY= 250.131544655141
##.OBSERVE NUCLEUS= ^1H
##.ACQUISITION MODE= SIMULTANEOUS (DQD)
##.ACQUISITION SCHEME= undefined
##.AVERAGES= 16
##.DIGITISER RES= 18
##SPECTROMETER/DATA SYSTEM= dpx250
##.PULSE SEQUENCE= zg30
##.SOLVENT NAME= CDCl3
##.SHIFT REFERENCE= (INTERNAL, CDCl3, 0, 16.522)
##AUDIT TRAIL= $$ (NUMBER, WHEN, WHO, WHERE, WHAT)
$$ ##TITLE= Audit trail, XWIN-NMR		Version 3.5
$$ ##JCAMPDX= 5.01
$$ ##ORIGIN= Bruker BioSpin GmbH
$$ ##OWNER= nmr
$$ C:\u/data/dgb/nmr/ADRS/2120/pdata/1/auditp.txt
$$ ##AUDIT TRAIL=  $$ (NUMBER, WHEN, WHO, WHERE, WHAT)
(   1,<2006-04-05 15:05:17.16 +100>,<MAYBRIDGE\nmr>,<NMR_250MHZ>,
      <created by zg, POWCHK disabled, PULCHK disabled
       configuration hash MD5:
       84 BC 41 DB A1 6E 1D 46 DA 25 12 A5 C1 ED C5 3A
       data hash MD5: 64K
       DD F6 81 71 87 B4 19 BD C3 C8 4C 16 72 35 00 1C>)
(   2,<2006-04-05 15:05:35.41 +100>,<MAYBRIDGE\nmr>,<NMR_250MHZ>,
      <Start of raw data processing
       ef LB = 0.3 FT_mod = 6 PKNL = 1 SI = 32K 
       data hash MD5: 32K
       4A AF D0 89 78 4B 0E B9 F5 06 5A DF 76 D4 A3 69>)
(   3,<2006-04-05 15:05:37.62 +100>,<MAYBRIDGE\nmr>,<NMR_250MHZ>,
      <apk 
       data hash MD5: 32K
       3C 99 78 47 EA 55 67 A6 95 2B F5 2A B5 56 51 B3>)
(   4,<2006-04-05 15:05:38.54 +100>,<MAYBRIDGE\nmr>,<NMR_250MHZ>,
      <abs ABSG = 5 
       data hash MD5: 32K
       A8 F0 FC 4B 51 AC 15 97 70 44 CC E0 D7 A4 25 07>)
$$ ##END=
$$ 
$$ hash MD5
$$ 5D 4C E6 24 19 BB DA 87 E9 90 EC 76 21 44 8D 44
##$RELAX= 
##$RELAX= 
##$RELAX= 
##$RELAX= 
##$RELAX= 
##$RELAX= 
##$RELAX= 
$$ Bruker specific parameters
$$ --------------------------
##$DU= <C:\u>
##$EXPNO= 2120
##$NAME= <ADRS>
##$PROCNO= 1
##$TYPE= <nmr>
##$USER= <dgb>
##$AMP= (0..31)
100 100 100 100 100 100 100 100 100 100 100 100 100 100 100 100 100 100 
100 100 100 100 100 100 100 100 100 100 100 100 100 100 
##$AQSEQ= 0
##$AQ_mod= 3
##$AUNM= <au_zg>
##$AUTOPOS= <47 >
##$BF1= 250.13
##$BF2= 250.13
##$BF3= 250.13
##$BF4= 250.13
##$BF5= 500.13
##$BF6= 500.13
##$BF7= 500.13
##$BF8= 500.13
##$BYTORDA= 1
##$CFDGTYP= 0
##$CFRGTYP= 5
##$CHEMSTR= <none>
##$CNST= (0..31)
1 1 145 1 1 1 1 1 1 1 1 1 1 1 1 1 1 1 1 1 1 1 1 1 1 1 1 1 1 1 1 1 
##$CPDPRG= <>
##$CPDPRG1= <>
##$CPDPRG2= <>
##$CPDPRG3= <>
##$CPDPRG4= <mlev>
##$CPDPRG5= <mlev>
##$CPDPRG6= <mlev>
##$CPDPRG7= <mlev>
##$CPDPRG8= <mlev>
##$CPDPRGB= <>
##$CPDPRGT= <>
##$D= (0..31)
0 1 0 0 0 0 0 0 0 0.06 0 0 0 0 0 0 0.0002 0 0 0 0 0 0 0 0 0 0 0 0 0 0 
0 
##$DATE= 1144245916
##$DBL= (0..7)
120 120 120 120 120 120 120 120 
##$DBP= (0..7)
150 150 150 150 150 150 150 150 
##$DBP07= 0
##$DBPNAM0= <>
##$DBPNAM1= <>
##$DBPNAM2= <>
$$ [...]
##$SUBNAM7= <"">
##$SUBNAM8= <"">
##$SUBNAM9= <"">
##$SW= 20.6930455092707
##$SWIBOX= (0..15)
0 0 3 0 0 0 0 0 0 0 0 0 0 0 0 0 
##$SW_h= 5175.983436853
##$TD= 65536
##$TD0= 1
##$TE= 295.16
##$TE2= 300
##$TE3= 300
##$TEG= 300
##$TL= (0..7)
0 120 120 120 120 120 120 120 
##$TP= (0..7)
150 150 150 150 150 150 150 150 
##$TP07= 0
##$TPNAME0= <>
##$TPNAME1= <>
##$TPNAME2= <>
##$TPNAME3= <>
##$TPNAME4= <>
##$TPNAME5= <>
##$TPNAME6= <>
##$TPNAME7= <>
##$TPOAL= (0..7)
0.5 0.5 0.5 0.5 0.5 0.5 0.5 0.5 
##$TPOFFS= (0..7)
0 0 0 0 0 0 0 0 
##$TUNHIN= 0
##$TUNHOUT= 0
##$TUNXOUT= 0
##$USERA1= <user>
##$USERA2= <user>
##$USERA3= <user>
##$USERA4= <user>
##$USERA5= <user>
##$V9= 5
##$VALIST= <valist>
##$VCLIST= <CCCCCCCCCCCCCCC>
##$VD= 0
##$VDLIST= <DDDDDDDDDDDDDDD>
##$VPLIST= <PPPPPPPPPPPPPPP>
##$VTLIST= <TTTTTTTTTTTTTTT>
##$WBST= 1024
##$WBSW= 4
##$XGAIN= (0..3)
0 0 0 0 
##$XL= 0
##$YL= 0
##$YMAX_a= 624297
##$YMIN_a= -370886
##$ZGOPTNS= <>
##$ZL1= 120
##$ZL2= 120
##$ZL3= 120
##$ZL4= 120
##$ABSF1= 16.522
##$ABSF2= -4.171173
##$ABSG= 5
##$ABSL= 3
##$ALPHA= 0
##$AQORDER= 0
##$ASSFAC= 0
##$ASSFACI= 0
##$ASSFACX= 0
##$ASSWID= 0
##$AUNMP= <proc_1d>
##$AZFE= 0.1
##$AZFW= 0.1
##$BCFW= 0
##$BC_mod= 0
##$BYTORDP= 0
##$COROFFS= 0
##$CY= 12.5
##$DATMOD= 1
##$DC= 0
##$DFILT= <>
##$DTYPP= 0
##$F1P= 14.0000005364418
##$F2P= -0.99999901652339
##$FCOR= 0.5
##$FTSIZE= 32768
##$FT_mod= 6
##$GAMMA= 0
##$GB= 0
##$INTBC= 1
##$INTSCL= 1
##$ISEN= 128
##$LB= 0.3
##$LEV0= 0
##$LPBIN= 0
##$MAXI= 10000
##$MC2= 0
##$MEAN= 0
##$ME_mod= 0
##$MI= 0
##$NCOEF= 0
##$NC_proc= -5
##$NLEV= 6
##$NOISF1= 0
##$NOISF2= 0
##$NSP= 0
##$NTH_PI= 0
##$NZP= 0
##$OFFSET= 16.522
##$PC= 1
##$PHC0= 16.72892
##$PHC1= 8.011583
##$PH_mod= 1
##$PKNL= yes
##$PPARMOD= 0
##$PSCAL= 4
##$PSIGN= 0
##$REVERSE= no
##$SF= 250.13
##$SI= 32768
##$SIGF1= 0
##$SIGF2= 0
##$SINO= 400
##$SIOLD= 32768
##$SREGLST= <1H.CDCl3>
##$SSB= 0
##$STSI= 32768
##$STSR= 0
##$SW_p= 5175.98343685301
##$SYMM= 0
##$S_DEV= 0
##$TDeff= 65536
##$TDoff= 0
##$TI= <Analysis number 999999
Compound Code 99
Book Reference 9
Project Code 9>
##$TILT= no
##$TM1= 0
##$TM2= 0
##$TOPLEV= 0
##$USERP1= <user>
##$USERP2= <user>
##$USERP3= <user>
##$USERP4= <user>
##$USERP5= <user>
##$WDW= 1
##$XDIM= 32768
##$YMAX_p= 452942723
##$YMIN_p= -172837
$$ End of Bruker specific parameters
$$ ---------------------------------
##NTUPLES= NMR SPECTRUM
##VAR_NAME=  FREQUENCY,     SPECTRUM/REAL,   SPECTRUM/IMAG
##SYMBOL=    X,             R,               I
##VAR_TYPE=  INDEPENDENT,   DEPENDENT,       DEPENDENT
##VAR_FORM=  AFFN,          ASDF,            ASDF
##VAR_DIM=   32768,         32768,           32768
##UNITS=     HZ,            ARBITRARY UNITS, ARBITRARY UNITS
##FACTOR=    0.157963299565203, 1,           1
##FIRST=     4132.6476996994, 0,             0
##LAST=      -1043.33573715361, 0,           0
##MIN=       -1043.33573715361, -172837,     0
##MAX=       4132.6476996994, 452942723,     0
$$ Real data points
##PAGE= N=1
##DATA TABLE= (X++(R..R)), XYDATA
$$ [...]
19440E837782j16881j13907q3891q7682r9931r1586o2224l3432m4296m1256n0843
19429E011853n9556n0737o1197n7154p4870q0945p1031n7523n8425o5810m5810
19418D328795k9988l9105o5755p8136o5293o9310o6317n2259p0511q4549r6646
19407C610926p4630o2668n1625m4120j2248j8824k4266K516M766n699j4275j1016
19395C298837m9583n7023n8273m5931k8447j8327j6544j6966k7818k4843l4918
19384B920164m6198m2558m9824n3978o3203n3382n7160m5638n6649p1747p2602
19373B307225n5853m8816l4624k6002k2807l1104j3523j5242k4741k4290j2338
19362A997885l2352m0085l3738n4713m2430l4168j4483m46k9696l2614k0358k3537
$$ y = [5837782, 5720901, 5606994, 5523103, 5435421, 5335490, 5243904, 5181680, 5148248, 5103952, 5062696, 5011853, 4952297, 4901560, 4840363, 4783209, 4708339, 4627394, 4556363, 4498840, 4440415, 4374605, 4328795, 4298807, 4259702, 4193947, 4115811, 4050518, 3981208, 3914891, 3862632, 3792121, 3707572, 3610926, 3536296, 3473628, 3422003, 3377883, 3365635, 3346811, 3322545, 3325061, 3329827, 3324128, 3309853, 3298837, 3249254, 3192231, 3133958, 3088027, 3059580, 3041253, 3024709, 3007743, 2979925, 2955082, 2920164, 2873966, 2831408, 2781584, 2727606, 2664403, 2611021, 2553861, 2508223, 2451574, 2379827, 2307225, 2251372, 2202556, 2167932, 2141930, 2119123, 2088019, 2074496, 2059254, 2034513, 2010223, 1997885, 1965533, 1925448, 1891710, 1836997, 1794567, 1760399, 1745916, 1745470, 1715774, 1683160, 1662802, 1639265]
19350A639265m5929l8804l0391k1273k3761k0959k7978m9251k4239k8060j9775
19339A308845k0674j618K633m552k1825o274R795j3988k2449l7579m7052j6810
19327A128452m164j7801k7281j0680R780P026j3169k5097p760j8490k4508m0220
19315I56088k6178j8354k6521l7950k6837j0625r424j1635l257j7781k9083k3450
19303G14993j6086j6807N608j3870P90N1j9657k0662p124j9381p297n211j6104
19290E79243k5487p232o875k1186k8138q20N594Q949m577k518l981M16m85j5146
19276D77757o339k764j1182R695k344j1105L345n064J526l3407k3060Q45J63J2731
19262D10797K2037L8152K9290K1416J7318J7865l277k3044p610j2030k6610j0025
$$ y = [1639265, 1593336, 1554532, 1524141, 1502868, 1479107, 1458148, 1430170, 1380919, 1356680, 1328620, 1308845, 1288171, 1286553, 1289186, 1284634, 1262809, 1256535, 1266330, 1252342, 1229893, 1192314, 1145262, 1128452, 1124288, 1106487, 1079206, 1068526, 1078306, 1085332, 1072163, 1047066, 1039306, 1020816, 996308, 956088, 929910, 911556, 885035, 847085, 820248, 809623, 800199, 788564, 785307, 767526, 738443, 714993, 698907, 682100, 687708, 673838, 674628, 674679, 655022, 634360, 627236, 607855, 600558, 595347, 579243, 553756, 546524, 539649, 518463, 490325, 489505, 495099, 504048, 499471, 496953, 492972, 493388, 492903, 477757, 471418, 468654, 457472, 467167, 464823, 453718, 457063, 451999, 453525, 420118, 397058, 397903, 398066, 410797, 432834, 470986, 500276, 521692, 539010, 556875, 553598, 530554, 522944, 510914, 484304, 474279]
19250D74279J4045K4496M281L997J6901J6156O671k2494l0636k0148l9266l3908
19238D14374j4174k0250j9455n102o126q110p64R326J9823L3589K8188K9414L5819
19225D96552J2780m910l3542k8765k6149j9201j4372L08P106O113L3365J8916
19213D48201J4917J6529m842j7755k4895m3958l2885k2952j8215k3898j5017J5461
19201B90691o099j9749j1971k5007l958J2383o97j6962k687M560j428M955p311
19188B16720j6057l854N290o222n189o356N538j1335k389l456L25m825k502j2734
19174A52954k257l623n098m510n992J315J3745r31N317O378p609j1811N430j2583
19160A30725n894p288k769o852o821j7814m51p338R98P961l957j6330O85J804
$$ y = [474279, 488324, 512820, 517101, 521098, 537999, 554155, 560826, 538332, 507696, 487548, 448282, 414374, 400200, 379950, 360495, 355393, 349267, 341157, 340393, 349719, 369542, 403131, 431319, 460733, 496552, 509332, 504422, 470880, 442115, 415966, 396765, 382393, 382701, 389807, 395920, 429285, 448201, 463118, 479647, 474805, 457050, 432155, 388197, 355312, 332360, 314145, 290247, 275230, 290691, 284592, 264843, 252872, 227865, 223907, 236290, 235593, 218631, 215944, 220504, 219076, 224031, 216720, 200663, 196809, 202099, 195877, 190688, 184332, 189870, 178535, 176146, 172690, 173015, 168190, 165688, 152954, 150697, 147074, 141976, 137466, 131474, 132789, 146534, 145603, 150920, 157298, 149689, 137878, 143308, 130725, 124831, 117543, 114774, 107922, 101101, 83287, 82836, 75498, 76496, 84457, 80500, 64170, 64855, 66659]
19146F6659O411J2338N078k083P904J5102k2675j3716p886j0914l663P854m128
19133E6281k481m912m016k0045P137J4997J323J2397j7789J604P498j802M198
19120E4390J637q681P713J0719q049k0747j078J5046j259j1198m465j049p028
19107B5951R95m08P3k52O86J5818K5324k941m161R704j821j8046J253K762j620
19092E3317r377J131n925j2684j324m652M515J4791K231j3259p986m948P458P693
19078C0981R14O776j947J1799R710j740j5052r535K095J36j890p067K5447K5855
19064G6482K5902L0075L7277N2080L0789L2716J7016L6573K4821K2583J6636o406
19052C96544k8845r857k834j8295o568N042J0661M19J1992L6217P598o314l6428
$$ y = [66659, 73070, 85408, 90486, 88403, 96307, 111409, 88734, 75018, 67132, 56218, 52555, 60409, 56281, 53800, 48888, 44872, 24827, 31964, 46961, 48284, 60681, 42892, 44496, 51994, 50192, 54390, 56027, 47346, 55059, 65778, 57729, 36982, 35904, 50950, 49691, 38493, 34028, 32979, 25951, 26946, 26538, 26611, 26359, 27045, 42863, 68187, 65246, 61085, 70789, 68968, 50922, 52175, 54937, 53317, 43940, 45071, 39146, 26462, 25138, 20486, 25001, 39792, 42023, 28764, 20778, 15830, 23288, 30981, 31895, 38671, 36724, 48523, 58233, 56493, 41441, 31906, 34001, 34137, 32247, 25180, 50627, 76482, 102384, 132459, 169736, 221816, 252605, 285321, 302337, 338910, 363731, 386314, 402950, 396544, 367699, 357842, 355008, 336713, 330145, 335187, 345848, 346267, 358259, 394476, 402074, 395760, 359332]
19039C59332l8565j2003m6518l8001k6240k1415j9665M387k626k1686n223m315
19027A27462L694Q107J3699j1625k9817O60K0720P036j9452J1789J4621J8911
19015A65805J1874L2363K5659M3231N9360M5130L1951L5233J1904j2477k5203
19004D24830p043j4940o855K4513K9712J4208K7076M5408K4597K069j5435k1177
18992E26963J0478K0561K6727K6716m289p352j406j8413m3571m4573l6010k47
18980D55584j3765O001L5001L9007L0671L3218J0028m0766m5725n2404n8545o3143
18968C35162m3143k8521j8969j7519M897K9352K9056L3090L5209N6517P1467M4594
18956E31192J1341N351k5450k5122m1484j5385j985j0580J8068M6001L7529K6560
$$ y = [359332, 320767, 308764, 262246, 224245, 198005, 176590, 156925, 161312, 158686, 137000, 131777, 127462, 131156, 139263, 152962, 141337, 111520, 112180, 132900, 139936, 120484, 132273, 146894, 165805, 177679, 210042, 235701, 278932, 338292, 383422, 415373, 450606, 462510, 450033, 424830, 417787, 402847, 395992, 420505, 450217, 464425, 491501, 536909, 561506, 563575, 548140, 526963, 537441, 558002, 584729, 611445, 607156, 599804, 598398, 579985, 536414, 491841, 455831, 455584, 441819, 447820, 482821, 521828, 552499, 585717, 595745, 554979, 509254, 456850, 398305, 335162, 292019, 263498, 244529, 227010, 231907, 261259, 290315, 323405, 358614, 415131, 486598, 531192, 542533, 547884, 522434, 497312, 455828, 440443, 438458, 427878, 445946, 491947, 529476, 556036]
18944E56036O960l201k0537m7421o5762o8437o7904l3016j4135l553l1901k0006
18932A87123m71k75r803j1645j8543p551p381j9169j402j465R405P136j1457j5008
18918I9494N56j5067m978O743j084m351J7336J3977N786n925m022j4986j6231
18905G7248l282K900O671K408m674j2911m862n029J3425J0505o659J1539k558
18892H4721n25j563k574p024J2591Q467o81o000q697q697O762R886n841o748l956
18877G0121j0580M048J154L587J2121k528j7106p81L279R474k430j7331k719J5130
18863F5439J249k953J0890K170m460L644j5577l414j6356l506M002J148R538m657
18849D7157o504q44n022J5144K9960O287J267n095R955q568j0390J4413J2590
$$ y = [556036, 562996, 559795, 539258, 491837, 426075, 357638, 289734, 256718, 242583, 239030, 207129, 187123, 186652, 186377, 176574, 164929, 146386, 138835, 131454, 112285, 110883, 109418, 118823, 125959, 114502, 99494, 100050, 84983, 80005, 86748, 85664, 81313, 98649, 112626, 118412, 112487, 108465, 93479, 77248, 73966, 76866, 83537, 85945, 81271, 68360, 63498, 58469, 71894, 82399, 75740, 87279, 84721, 84196, 82633, 80059, 73035, 85626, 94093, 93412, 87412, 78715, 70018, 76780, 86666, 80825, 74077, 70121, 59541, 63589, 64743, 68330, 80451, 77923, 60817, 60036, 63315, 72789, 70359, 53028, 50309, 65439, 66688, 63735, 74625, 76795, 72335, 75979, 60402, 56988, 40632, 37126, 41128, 42276, 51814, 47157, 40653, 39809, 34787, 49931, 79891, 86178, 87445, 82350, 92305, 83737, 73347, 87760, 100350]
18836A00350o733j9783p748R562P546j168j8097j800J5618n335o620J4128L278
18823H3198k193j9575j1360m547Q934N211J120J4114K5569K3948J5424K3247P388
18810A70478J9615K2734K0842J426j6759p629O410N357M750J1562J3145N057M66
18797B57454M107R966J3841l667j3847j2810r448J664r744k3460q750M366r626
18784B00046j2873p371n209j4782k8857j2769m387J230N533m539k171J7436J7592
18771A48879L541J3109L6368M1843N7492L4259o029k4289o556K3032J9618R91
18759C42258j1345l431k208J08P633R361p749L420P587R85j1112p192k0657k8854
18745B78804k4357l4989l2511o530J0597N971k1883l4109k087q346k0963j1780
$$ y = [100350, 93617, 73834, 66086, 75648, 83194, 82026, 63929, 62129, 77747, 72412, 65792, 79920, 83198, 81005, 61430, 50070, 45523, 54457, 59668, 60788, 74902, 100471, 124419, 139843, 163090, 170478, 190093, 212827, 233669, 235095, 218336, 210707, 217117, 222474, 227224, 238786, 251931, 256988, 257454, 261561, 271527, 285368, 281701, 267854, 255044, 245596, 247260, 237516, 214056, 205306, 209672, 200046, 187173, 179802, 174593, 159811, 130954, 118185, 113798, 115028, 120561, 116022, 113851, 131287, 148879, 152420, 165529, 201897, 243740, 301232, 335491, 329462, 305173, 298617, 321649, 341267, 342258, 330913, 327482, 325274, 325382, 333015, 342376, 334627, 338047, 345634, 346619, 335507, 328315, 307658, 278804, 254447, 219458, 186947, 180417, 191014, 196985, 175102, 140993, 138906, 130560, 109597, 97817]
18733I7817j2390j8600j9771O535K971l452p24K2475J8901K4301J0938j096k815
18720A25090J3489J4699Q479q71q2L041P531J5000j8413j4229K168O788j1125
18707A51565j3102o396j3438K030M921m793J7061K541k6808j4920j5424K19J0456
18694I3912j3975k592N148j4695l756K0863J2855K2743K0866K4605K2613K4559
18682B13146L7875P7911N0671J4014J733J5134K1199K2314R058J1392J7373J6932
18670E08752J8958N426l201J9926L728l512o761p988j7235q989J693l566m499
18657E02732j4048k9647l272K464q586N179J0619J3247J0849J2560r702j3970
18645D78425j4179r58K1282K1394J342J5075K9954K8174K9612M2482M9762K5967
$$ y = [97817, 85427, 66827, 47056, 53591, 56562, 53110, 52386, 74861, 93762, 118063, 129001, 127905, 125090, 138579, 153278, 161757, 160886, 160804, 163845, 171376, 186376, 167963, 153734, 155902, 162690, 151565, 138463, 132067, 118629, 120659, 125580, 120787, 137848, 140389, 113581, 98661, 83237, 83456, 93912, 79937, 77345, 82493, 67798, 64042, 84905, 97760, 120503, 141369, 165974, 188587, 213146, 251021, 328932, 379603, 393617, 395350, 410484, 431683, 453997, 463055, 474447, 491820, 508752, 527710, 533136, 529935, 549861, 553589, 550077, 543316, 535328, 518093, 509104, 510797, 507231, 502732, 488684, 459037, 455765, 458229, 449643, 454822, 465441, 478688, 489537, 502097, 492395, 478425, 464246, 463288, 484570, 505964, 507306, 522381, 552335, 580509, 610121, 652603, 702365, 728332]
18633G28332Q780J3903J3277J9588L9155J8742P941P656j409J1738L4222J7149
18621I19074J4089l189j0128J0128K4282J5161P07J2940J3091j6907j5064K9370
18609I93554M2734K6301J036j8754m138J2272L2492M7331J1524j3092l428R160
18597A136992N0914M8540J3759j5403l211K365K4174K0772Q168K5798J9610M9576
18585A382054P1389R0185J10784J38751J50847J39661J43799J65157J18384O1131
18575B572142N8901J13218J76583K10292K72228L15939L54634M37942N27369O72134
18565E711382Q55847J122400J599708K512468L961857N946813P761780Q291934
18557C7764189P464425O673139Q318072R319101O644941j68468o150491m253768
$$ y = [728332, 737112, 751015, 764292, 783880, 823035, 841777, 849718, 857374, 855965, 867703, 901925, 919074, 933163, 929974, 919846, 929974, 954256, 969417, 970124, 983064, 996155, 979248, 964184, 993554, 1036288, 1062589, 1063625, 1044871, 1040733, 1053005, 1085497, 1132828, 1144352, 1131260, 1127832, 1136992, 1187906, 1236446, 1250205, 1234802, 1231591, 1233956, 1258130, 1278902, 1287070, 1312868, 1332478, 1382054, 1453443, 1543628, 1654412, 1793163, 1944010, 2083671, 2227470, 2392627, 2511011, 2572142, 2631043, 2744261, 2920844, 3131136, 3403364, 3719303, 4073937, 4511879, 5039248, 5711382, 6567229, 7689629, 9289337, 11801805, 15763662, 21710475, 29472255, 37764189, 45228614, 51901753, 60219825, 69538926, 76183867, 76015399, 69864908, 65611140]
18549F5611140j188559K20431K31730M36424J193735J789110M299007O703328
18541G9296346N066767q02523q284603p843311n490437n381017p099157p946918
18533D1515147o565071m655747l171087k231901j692717j340183j022163q10299
18525B0025979o39371n17260m13505k75579j35363J3343K10489M43322P16443
18516A9428498J189494K125652L673101N869302P975622Q758727Q016455O975028
18508F4011879Q641925J0400659P991547J053633o925886n570544j900645j18610
18500G7583958k99648l60797O87995J545103M001846O909110N756631K75243q133508
18491H7965933q986742o485896o041062p738130r008980p820818n699136l954049
$$ y = [65611140, 64422581, 64643012, 64874742, 65311166, 66504901, 68294011, 72593018, 79296346, 84363113, 83560590, 75275987, 67432676, 61942239, 56561222, 49462065, 41515147, 34950076, 30294329, 27123242, 24891341, 23198624, 21858441, 20836278, 20025979, 19386608, 18869348, 18455843, 18180264, 18044901, 18058244, 18268733, 18712055, 19428498, 20617992, 22743644, 26416745, 32286047, 40261669, 49020396, 57036851, 64011879, 72653804, 83054463, 91046010, 92099643, 85173757, 79603213, 77702568, 77583958, 77284310, 76923513, 77611508, 79156611, 83158457, 90067567, 95824198, 96099441, 87965933, 78979191, 72493295, 66452233, 58714103, 49705123, 41884305, 36185169, 32231120]
18483C2231120k819375k124209j707330j401141j196620j038291r37053q81106
18475B0125995p86829p24455o67868o18563n84806n34412n53513n53353n35369
18466A4566827n02411m66072m52112m48742m03801l82186l47499l25754l03818
18457A0934432k78145k56382k59299k54478k51611k45212k21704k08612k01721
18448H757268j80009j83632j99246j71231j50296j61134j68593j49727j48551
18439G244849j59256j34396j37780j20822j20437j15054j00988q0872r7334j02913
18429F074997q3380r6941r2739p4638o9817p8979r4522r7358r3459q1421r9745
18418E111998q6820q3461q5698r4230q6177p1359n9209o6453q8601r0532j01234
$$ y = [32231120, 29411745, 27287536, 25580206, 24179065, 22982445, 21944154, 21007101, 20125995, 19339166, 18614711, 17946843, 17328280, 16743474, 16209062, 15655549, 15102196, 14566827, 14064416, 13598344, 13146232, 12697490, 12293689, 11911503, 11564004, 11238250, 10934432, 10656287, 10399905, 10140606, 9886128, 9634517, 9389305, 9167601, 8958989, 8757268, 8577259, 8393627, 8194381, 8023150, 7872854, 7711720, 7543127, 7393400, 7244849, 7085593, 6951197, 6813417, 6692595, 6572158, 6457104, 6356116, 6275244, 6177910, 6074997, 5991617, 5894676, 5801937, 5727299, 5657482, 5578503, 5483981, 5386623, 5293164, 5211743, 5111998, 5025178, 4941717, 4856019, 4761789, 4675612, 4604253, 4545044, 4478591, 4389990, 4299458, 4198224]
18407D198224j01912q4667p9245q1743p8148o6883p5989q2454o4347o1746n4884
18396C366206m7773n3741n1485m9663o5052o9936m4685l5843l2072j4135k5047
18385B876774k6755k0261j3715o798n0k2168j5184j6207j5372k2349k1464l4743
18373B661708k8210k7788m1932j7799l3068l2620j2104j9628j3790k3277r015
18362B402477m3806o4466o0638n4120n7967m4677l1732l2293k7952k5706l9189
18351A919931n5638m7705l8262n3828l5870m2067n9301j7790p851l4089l3988
18340A493542j5141j0935l1872l2791l9780k7196k5416j8632j5166m0817l1652
18329A204144k5284m358p966j9941j2120m22j6440j0702j9062k5264Q536j1499
$$ y = [4198224, 4096312, 4011645, 3932400, 3850657, 3772509, 3705626, 3629637, 3547183, 3482836, 3421090, 3366206, 3318433, 3264692, 3213207, 3163544, 3098492, 3028556, 2983871, 2948028, 2915956, 2901821, 2876774, 2850019, 2829758, 2816043, 2809245, 2809195, 2787027, 2771843, 2755636, 2740264, 2717915, 2696451, 2661708, 2633498, 2605710, 2563778, 2545979, 2512911, 2480291, 2468187, 2448559, 2434769, 2411492, 2402477, 2358671, 2294205, 2233567, 2179447, 2121480, 2076803, 2045071, 2012778, 1984826, 1959120, 1919931, 1864293, 1816588, 1778326, 1724498, 1688628, 1646561, 1587260, 1569470, 1561619, 1527530, 1493542, 1478401, 1467466, 1435594, 1402803, 1363023, 1335827, 1310411, 1291779, 1276613, 1235796, 1204144, 1178860, 1174502, 1166536, 1146595, 1134475, 1134053, 1117613, 1106911, 1087849, 1062585, 1071121, 1059622]
18317A059622j4211J576j5789l4299l1869j2124j1541k3859j0425j3685q247q422
18305H76727o645K734j6106l9101k1717k9293l1797l9201k8527j7688K271M028
18293F55685j0663q641k6153m504j642j0901k2161k7695N44J0343j5068j3707
18281E25437j1535j8484j7106o161p910J908J4798q513M304L365k7842k2809o089
18268D23363j4646k2486k1941j430M649j0862P386J157j1201p450M391m269M768
18255C51429K783k7682k8736N297M955m855k1701k7205M218q45N737k621J1999
18242B72773Q07j2031k1096l198Q889J1579L806P801J0296J4562L480j0691q507
18229B78470r556L691J3564n931j5873L380j8096K385l343o814J605k951j830
$$ y = [1059622, 1045411, 1046987, 1031198, 996899, 965030, 952906, 941365, 917506, 907081, 893396, 885149, 876727, 870082, 872816, 856710, 817609, 795892, 766599, 734802, 695601, 667074, 649386, 651657, 655685, 645022, 636381, 610228, 605724, 604082, 593181, 571020, 543325, 543869, 554212, 539144, 525437, 513902, 495418, 478312, 472151, 464241, 466149, 480947, 472434, 476738, 480103, 452261, 429452, 423363, 408717, 386231, 364290, 362860, 367509, 356647, 364033, 365190, 353989, 346539, 350930, 346661, 351429, 354212, 326530, 297794, 303091, 308046, 303191, 281490, 254285, 258503, 257658, 263395, 260774, 272773, 273580, 261549, 240453, 237255, 246144, 257723, 261529, 269330, 279626, 294188, 297668, 286977, 278470, 268914, 272605, 286169, 280238, 264365, 267745, 249649, 252034, 248691, 241877, 243482, 240531, 238701]
18216B38701Q94j2144j3324j1568j2519R277M462m652p506j2774n564p572j1803
18203A53908l48j4141r40J5870M142m243k3106j7531J1042n712J355M592l372
18190A21516l876K999N134J207O728M115K95J0904R511J4137l43r419n361k538
18176A55009M892J0769J5149O70K482r260J0018j5669j213j1377p176q890l641
18163A41763Q805J8109j2291o711K812k5368j8128j5908K778J975R452j066Q21
18150A07043J302j2511m570K463l474q700O192K1760J4431K84n635k0604N069
18137A03050j146J0275K9271l221j1392o293N742L417j2533j294L7436K5649P791
18124A86752K0350J7644J8161K4974L4322N2018P8927J07009J32038K05555K49091
$$ y = [238701, 239595, 227451, 214127, 202559, 190040, 199317, 203779, 199127, 191621, 178847, 173283, 165711, 153908, 153560, 139419, 138479, 154349, 158491, 154248, 131142, 113611, 124653, 118941, 120296, 124888, 121516, 117640, 120639, 125773, 126980, 133708, 137823, 138118, 149022, 158533, 172670, 172327, 162908, 157547, 155009, 159901, 170670, 185819, 186489, 188971, 179711, 189729, 174060, 172847, 161470, 154294, 145404, 141763, 150568, 168677, 156386, 149675, 152487, 127119, 108991, 93083, 95861, 97836, 107288, 106222, 107043, 108345, 95834, 91264, 93727, 90253, 81553, 87745, 109505, 123936, 124220, 118585, 97981, 103050, 101904, 112179, 141450, 138229, 126837, 120544, 126286, 129703, 117170, 115876, 153312, 178961, 186752, 207102, 224746, 242907, 267881, 302203, 354221, 433148, 540157, 672195, 877750, 1126841]
18113A126841L58773O21433J195216K534217M848923N368798L597586j547172
18105A8104615o313917m240559k347770j268069o88113l97750k31884j27718q2159
18096B406676q5888j01184j53300j73543j77665j51808j06602o5099r2896p3745
18086A224946o2809n3052m7045o0628m6531k1573k7665j9098j6593k2852k0216
18075H26884k1308j5616r059N654K5107K4967M8378O8554Q8531O6698N1907j8704
18063A141993n8560o5356p3834q3923l3322l1318j5274r966p274J922L1819Q2375
18051H79282J20373J02042N4986K2515j5374k3886n2703o4113p9226o1038m1476
18040H41382j2239m030k3790k0597p610K2962R207j114j9228l9964l5677l4885
$$ y = [1126841, 1485614, 2107047, 3302263, 5836480, 10685403, 16054201, 19651787, 18104615, 11790698, 7550139, 5202369, 3934300, 3246187, 2848437, 2616553, 2488835, 2406676, 2320788, 2219604, 2066304, 1892761, 1715096, 1563288, 1456686, 1391587, 1298691, 1224946, 1162137, 1109085, 1062040, 1001412, 954881, 933308, 905643, 886545, 869952, 847100, 826884, 805576, 789960, 780901, 786555, 811662, 836629, 885007, 953561, 1042092, 1108790, 1160697, 1141993, 1083433, 1018077, 944243, 860320, 826998, 795680, 780406, 770440, 763166, 765088, 796907, 879282, 999655, 1101697, 1156683, 1179198, 1163824, 1139938, 1087235, 1023122, 943896, 882858, 841382, 829143, 825113, 801323, 780726, 773116, 796078, 805285, 804171, 784943, 744979, 709302, 674417]
18028F74417j7943k0956l6352l4716J9464L0608K5154M0336N1560N8308K9833
18017H19713M448n9561r3513p7020n9732n1608k8790k2265k0649J007L030P87
18005D15847L4020K2967L6044L8842M3670L4755L7223L6271R445q960k5353r878
17993F64893j063j9502j778J0910L947J9878K6571K1555l657k6039l9322l3353
17981F23040m0682l9748n1323m0164k5747l3365k2756k5223j2874q119q09k8594
17969B93636l2852l596J5377L587j0630k813r132k1266l2534l871J3015P603p941
17956B08583J7469j750j0221q318j7683K445n51R888m206j8396k749M842m598
17943A74755j9078M35K6305L15q215k669m394j7721l278r245J5708K049O576J1372
$$ y = [674417, 656474, 635518, 599166, 564450, 583914, 614522, 639676, 680012, 731572, 789880, 819713, 824161, 764600, 671087, 594067, 534335, 482727, 453937, 431672, 411023, 412030, 415060, 415847, 449867, 472834, 508878, 547720, 591390, 626145, 663368, 699639, 709084, 700124, 674771, 664893, 663830, 644328, 642550, 653460, 657407, 677285, 703856, 725411, 721754, 695715, 656393, 623040, 582358, 542610, 491287, 451123, 425376, 392011, 369255, 344032, 331158, 323039, 322230, 293636, 260784, 257188, 272565, 276152, 265522, 262709, 253577, 232311, 199777, 195906, 208921, 216524, 208583, 226052, 224302, 214081, 205763, 188080, 190525, 189974, 199862, 195656, 177260, 174511, 179353, 174755, 155677, 156112, 182417, 182732, 174517, 171848, 167454, 149733, 146455, 137210, 152918, 154967, 161543, 172915]
17929A72915j5611k1203j7364j770R375Q932j569N360J1851q15J8231K2825j2610
17916A78547k2949k2161L498m702j0950l445j4701p072Q82M557j2866O971J7882
17903A13491J971m381m662j0383p977JK384K314j5753K403J3457J4667l363O92
17889A04861R26k382r797n979m906N478M291m58J4428R010Q86o139j3003o603
17875I0613L787K1615R083M737j8556j2219o46j134J5215O843J8182L185l320
17862A37385N90P484m471n323J411j932m317J0225L730K7872m835j6838J881j142
17848A51720Q012O313J7912r754R218J2702Q053k6777j9504m990n681J6121P654
17835A70999l817l135r330N549J7071j1648J429J1473L401k807r778K232j6267
$$ y = [172915, 157304, 136101, 118737, 116967, 126342, 135274, 133705, 139065, 150916, 150101, 168332, 191157, 178547, 155598, 133437, 136935, 132233, 121283, 117838, 103137, 96065, 96947, 101504, 88638, 95609, 113491, 115462, 111081, 106419, 96036, 88059, 88060, 90444, 92758, 77005, 79408, 92865, 107532, 104169, 104861, 105787, 103405, 93608, 87629, 82723, 88201, 92492, 92034, 106462, 115472, 116358, 110219, 97216, 90613, 94400, 116015, 125098, 129835, 111279, 99060, 98414, 97280, 112495, 119338, 137520, 140705, 137385, 137975, 145459, 140988, 135665, 137076, 135144, 130827, 141052, 144782, 172654, 167819, 150981, 152862, 151720, 159732, 166045, 183957, 174203, 183421, 196123, 204176, 177399, 157895, 152905, 147224, 163345, 170999, 167182, 164047, 154717, 160266, 177337, 165689, 167118, 178591, 181992, 179185, 169407, 171639, 155372]
17822A55372j4006m773J3827J6064J0330o445p534j778Q648J4305L597P692q192
17809A87107q807L11j768L449K555K3641p836j183L803J9162J0285n577j3692
17796B11450P773M213N226k270j6317j5099o870l575j0020o761n707m674m678
17783A52691j1824K706Q154j1539j7193M068n176q155j7198j4672j0209j6874
17771E4779k0346p580r923J4302L3103R560J4789P022J0776K3501l574k251N110
17758A29268j2215m469k620k431M8J1530M9399J0284j1954r576o537m690j7157
17745A28880n245L596j9691j9728j0881l3592k4977k53O496P632K6545R107P241
17732G5130Q22L231j8947j1393P081j742O306j0159k0015j6678j5127J3826K349
$$ y = [155372, 141366, 136593, 150420, 166484, 176814, 170369, 162835, 161057, 169705, 184010, 187607, 195299, 187107, 178300, 178611, 176843, 180292, 182847, 206488, 198652, 197469, 201272, 220434, 230719, 225142, 211450, 219223, 223436, 228662, 226392, 210075, 194976, 188106, 184531, 174511, 167750, 162043, 157369, 152691, 140867, 143573, 151727, 140188, 122995, 127063, 121887, 113732, 96534, 81862, 71653, 54779, 34433, 26853, 16930, 31232, 64335, 73895, 88684, 95706, 106482, 129983, 126409, 124158, 129268, 117053, 112584, 109964, 107533, 107581, 119111, 168510, 178794, 166840, 157264, 150727, 146037, 128880, 123635, 127231, 107540, 87812, 76931, 43339, 18362, 18109, 24605, 32237, 58782, 67889, 75130, 75952, 79183, 60236, 48843, 55924, 54182, 60488, 50329, 30314, 13636, -1491, 12335, 14684]
17719A4684K2752L7318K9019J8284J3431J6932K6820L8362L9117O3559O3912N2646
17707D36836L1426J3744n066j1799k6321m4741k6057j2997l0788k4911M062n829
17695B97559k1032l6863m1612k6177j3073J0024M0604K3124R905L0602K0957K062
17683B96080K1107J1984K9497M0680O3030N2573L1655L1835L2768R683k0900m0382
17671E59610m1480j4724R24N309J4441J9527K2968K5670K8067J9303K7005L2864
17659F99484K3685N593Q953R569m036k2699k5903k8586j1287l1882l0235k165
17647E90491K4379K4101M632N641J876Q003j1998q309j674J4209L3414O379K2173
17634G13317L3341L8609M9549L7860M1764L3442n334k823J8029R268j3824n907
$$ y = [14684, 37436, 74754, 103773, 122057, 135488, 152420, 179240, 217602, 256719, 320278, 384190, 436836, 468262, 482006, 476940, 465141, 438820, 394079, 368022, 355025, 324237, 299326, 303388, 297559, 276527, 239664, 198052, 171875, 158802, 168826, 209430, 232554, 242459, 273061, 294018, 296080, 317187, 329171, 358668, 399348, 462378, 514951, 546606, 578441, 611209, 620892, 599992, 559610, 518130, 503406, 504330, 509639, 524080, 543607, 566575, 592245, 620312, 639615, 666620, 699484, 723169, 728762, 737715, 747284, 743248, 720549, 694646, 666060, 654773, 622891, 592656, 590491, 614870, 638971, 643603, 649244, 651120, 659123, 647125, 638816, 637142, 651351, 684765, 691144, 713317, 746658, 785267, 834816, 872676, 914440, 947882, 942548, 939725, 957754, 967022, 953198, 947291]
17622I47291j1822j9469l808M458P159M2504L8525L2209J4698N761J1501L0045
17610A099052M1944P4321P2132P0572J08891J34732J60405J76446J56642J31425
17600B226562J03914O9842O6364Q6853J58428K23300L16644M69454O62602R00351
17590E284314J201477J604289K183135L133422M839076P880597J2559670J7990451
17582E6676431K2046444J9938757J0787142l078210j6072963j9519637j7572026
17575E3205938j2740470q279312n278343l486701k359480j675766j258390j011859
17567A7115617q19050o69901n61960m21786k16200N5516L20114N87052Q45153
17558A6234555J170909J737097K722455M470272P437974J1897902J7040289K0881958
$$ y = [947291, 935469, 916000, 912192, 916650, 923809, 966313, 1004838, 1037047, 1051745, 1057506, 1069007, 1099052, 1140996, 1215317, 1287449, 1358021, 1466912, 1601644, 1762049, 1938495, 2095137, 2226562, 2330476, 2400318, 2466682, 2553535, 2711963, 2935263, 3251907, 3721361, 4383963, 5284314, 6485791, 8090080, 10273215, 13406637, 18245713, 26126310, 38685980, 56676431, 78722875, 98661632, 109448774, 106370564, 90297601, 70777964, 53205938, 40465468, 32186156, 26907813, 23421112, 21061632, 19385866, 18127476, 17115617, 16296567, 15626666, 15064706, 14642920, 14426720, 14482236, 14802350, 15389402, 16234555, 17405464, 19142561, 21865016, 26335288, 33773262, 45671164, 62711453, 83593411]
17550H3593411J8808859J0060135l242488j5499003j8654202j6628078j1780467
17543D6658167p210245m007717j790924O4277K199358N241559R615706J4725634
17535F5495815J8847864J7927321J0111485j795236j4127162j7928057j6629589
17528F1902441j2602757q543271n676811l865708k722332j992699j543954j258068
17520B3696841j066963r15530p97397o38450m51833k50261P634K49462M63468
17511B0296971P43994J181412J988897L475181O065443J0098905J4988300J8996408
17503G7835511J7986366J0168169j706373j4026790j7644705j6308850j2202132
17496D4101196q087373n279820l575335k507336j847137j428908j165114r87634
$$ y = [83593411, 102402270, 112462405, 109219917, 93720914, 75066712, 58438634, 46658167, 39447922, 35440205, 33649281, 33713558, 35912916, 41154475, 50770181, 65495815, 84343679, 102271000, 112382485, 110587249, 96460087, 78532030, 61902441, 49299684, 40756413, 35079602, 31213894, 28491562, 26498863, 24954909, 23696841, 22629878, 21714348, 20916951, 20278501, 19826668, 19576407, 19584041, 19833503, 20296971, 21040965, 22222377, 24211274, 27686455, 33751898, 43850803, 58839103, 77835511, 95821877, 105990046, 104283673, 90256883, 72612178, 56303328, 44101196, 36013823, 30734003, 27158668, 24651332, 22804195, 21375287, 20210173, 19222539]
17488A9222539q86682q04371p22758o38661n52798m76803m62972m97327n55424
17479A3624743n60293n23450m67804m02542l70156l36563l05308k86136k54989
17470A0117502k59120k57054k47478k17675k20085k13794j98846j87251j68869
17461H147330j63569j65851j36967j31501j33139j25107j14688j01205j03070
17452F972233r6733j06941j15539j40191j45431j18783j00134j26167j28159j34919
17442E759236j32040j01204q9760r1923j16277j43966j19619j03020j07415j13997
17432D640015r4120n4013m4001m7234o2474q7099o3594j1513o262k5401l0564
17421D113740k0666m0217o1135p1181n2217m7288n8053n7828p4833p2186o1163
$$ y = [19222539, 18335857, 17531486, 16808728, 16170067, 15617269, 15140466, 14677494, 14180167, 13624743, 13064450, 12541000, 12073196, 11670654, 11300498, 10963935, 10658627, 10372491, 10117502, 9858382, 9601328, 9353850, 9136175, 8916090, 8702296, 8503450, 8316199, 8147330, 7983761, 7817910, 7680943, 7549442, 7416303, 7291196, 7176508, 7075303, 6972233, 6875500, 6768559, 6653020, 6512829, 6367398, 6248615, 6148481, 6022314, 5894155, 5759236, 5627196, 5525992, 5436232, 5344309, 5228032, 5084066, 4964447, 4861427, 4754012, 4640015, 4545895, 4491882, 4447881, 4400647, 4338173, 4251074, 4187480, 4175967, 4169705, 4144304, 4113740, 4093074, 4052857, 3991722, 3920541, 3868324, 3821036, 3762983, 3705155, 3630322, 3558136, 3496973]
17410C496973n4186k4489j3873J5591K0996M8468M2312M302m5337r1548r4000
17399C305209j00261j03736j18191j10846o7219o3982m8434m2970k2011k6131
17389B601428n7100p0494o9358n9520l9593l8369j5474j5956k7944j7570l032
17378B187018q05J8504K7654L1377L7223K2050K4304K0971k127n4607o1710q6373
17366B163479j02543q6632n5856l4695k2468N546L4797N1007j0104m7185l8514
17355A856832o4892p9593q0103p6555p2129m9706l6974j4568j6403j9244o689
17344A339976k3645l6300l8590l2557m0968l0740k2595m9202k3108l002p839j0690
17332A020740k558J6551L3197L0599N4384O1740M0686J0079l7202q7115q0753
$$ y = [3496973, 3442787, 3418298, 3404425, 3420016, 3441012, 3489480, 3531792, 3536094, 3490757, 3399209, 3305209, 3204948, 3101212, 2983021, 2872175, 2804956, 2740974, 2692540, 2649570, 2627559, 2601428, 2544328, 2473834, 2404476, 2344956, 2305363, 2266994, 2251520, 2235564, 2207620, 2190050, 2187018, 2186213, 2204717, 2232371, 2263748, 2300971, 2323021, 2347325, 2368296, 2366169, 2311562, 2249852, 2163479, 2060936, 1974304, 1918448, 1883753, 1861285, 1866831, 1901628, 1952635, 1942531, 1895346, 1856832, 1791940, 1712347, 1632244, 1555689, 1483560, 1433854, 1396880, 1382312, 1365909, 1346665, 1339976, 1316331, 1280031, 1241441, 1208884, 1167916, 1137176, 1114581, 1065379, 1042271, 1039269, 1031430, 1020740, 1018182, 1034733, 1067930, 1098529, 1152913, 1214653, 1255339, 1265418, 1228216, 1141101, 1060348]
17321A060348q5342o8341m2668k4528q096j2465J2640P024J5953l396l9651n7576
17309G53902l4208m3827k5646k8609q272p616J3149N1j4580j9095j1967o273r442
17296E57567O431J1517j5290l0194k9596k3003j2023j3295k4180j4002J2011J5143
17284D41086l581J3011K838k102j9323n228r794j0344k5300l2976p946o92K647
17271C42296j6251j4825o650j3160K575k0231n902j0789j2901K0986M818k0036
17259B49930j2892k600P488N750M29j2822J3973L3167L419j1687o597p537l0453
17246B29568j6618j052j2641j5034k1034j1960j4515j4248m262o766J5319n305
17234A21452p513p627J0282J3422j0886n627M510J1942L798k1462j8982j0814
$$ y = [1060348, 975006, 906665, 863997, 839469, 831373, 818908, 831548, 838572, 854525, 851129, 811478, 753902, 719694, 675867, 650221, 621612, 613340, 605724, 618873, 618924, 604344, 585249, 573282, 567009, 557567, 563998, 575515, 560225, 530031, 500435, 477432, 465409, 452114, 427934, 413932, 425943, 441086, 437505, 450516, 453354, 451252, 431929, 426701, 416907, 406563, 381263, 348287, 340341, 339649, 342296, 326045, 311220, 304570, 291410, 293985, 273754, 267852, 257063, 244162, 265148, 269966, 249930, 237038, 234438, 241926, 247676, 248105, 235283, 249256, 282423, 285842, 274155, 267558, 260021, 229568, 212950, 211898, 199257, 184223, 163189, 151229, 136714, 122466, 118204, 111438, 126757, 121452, 113939, 106312, 116594, 130016, 119130, 113503, 118013, 129955, 133753, 112291, 93309, 82495]
17222H2495J530n163r509m529J2160M504m811m821j1017p110m166K630k258j9209
17208C0726K280J2040N44r874j6535k665J0985j1722k858J3911L82l661n713m507
17194A3333j1924Q959K320j2183o65M357j6123M833R823p095j4528m806m71N889
17180a8281P128N715p609j3881M011K5344m584j1526j9086p876J8129J92K362
17167a9962j239j4306O936K533R68n813K0951j1298j9683Q685K4560J2560p485
17154b593j4616j7281N255Q983j3963j7504j5598r142o361K975R156j651J1522
17141f0818J3368L695p017j3727r997j588j559o629n423m360O855J6263J5979
17128e4958o070o429n041p311j0713L928K4107Q8j3651l616j6339Q450J3912r524
$$ y = [82495, 84025, 78862, 69353, 64824, 76984, 81488, 76677, 71856, 60839, 53729, 49563, 52193, 49935, 30726, 33006, 45046, 45590, 35716, 19181, 16516, 27501, 15779, 12921, 26832, 27214, 23553, 17840, 13333, 1409, 10368, 12688, 505, -160, 4197, -11926, -7093, 2730, -4365, -18893, -23699, -24170, -18281, -11153, -5438, -13047, -26928, -22917, 2427, -2157, -13683, -32769, -40645, -22516, -22324, -19962, -21201, -35507, -28571, -26038, -25070, -30883, -9932, -21230, -40913, -32228, -7668, 4892, -2593, -17209, -34490, -29235, -20252, -34215, -51719, -67317, -76459, -82820, -79845, -70689, -72340, -60818, -47450, -43755, -50772, -64499, -74496, -76084, -77643, -84272, -89695, -94055, -87200, -70937, -54958, -61028, -67457, -72498, -79809, -90522, -86594, -62487, -62399, -76050, -79666, -96005, -87555, -73643, -83167]
17114h3167k8931J7763Q280L062M463k4849j3260l983O783K0406J7975l99r188
17101h5045m566j436P443R291P436j1970q881L348j7305j7236J2490K8329J3160
17088f4942N61J226L707q579k6704j1679J8680J1738P08P406r273R592N283p821
17074g0097m800k1567M075J2243J4400P487o127R268M914R386N2K4890M5237P6347
17060A05708R2507J01133P6032L6036q507n3581r3806o7792n8788n4766k8517
17049D5659j9330q652j787R034l841o318j0723o001M710l149J19J3987R128O1
17035B2897Q892M068J0011K9357M3100M9122P5341R2798Q1490L6561j2476o6094
17023C75067q8714o7606m3231n2187j3022J1953L623n117N727M4549Q5986R0882
$$ y = [-83167, -112098, -94335, -86055, -82993, -78530, -103379, -116639, -120622, -113839, -93433, -75458, -75857, -85045, -89611, -91047, -83604, -74313, -66877, -78847, -87728, -84380, -101685, -118921, -106431, -78102, -64942, -64381, -63155, -59448, -68027, -94731, -106410, -87730, -75992, -75284, -67878, -77151, -67559, -62276, -70097, -74897, -96464, -92389, -80146, -65746, -58259, -64386, -55118, -50204, -40818, -40766, -15876, 29361, 105708, 198215, 299348, 375380, 411416, 402909, 349328, 255522, 187730, 128942, 74176, 45659, 26329, 17677, 15890, 24924, 21083, 14765, 4042, -1959, 2751, -398, -279, 13708, 22836, 22897, 31789, 35857, 45868, 75225, 118325, 167447, 242788, 335586, 417076, 453637, 441161, 375067, 286353, 218747, 175516, 123329, 110307, 122260, 125883, 120766, 126493, 171042, 257028, 347910]
17011C47910Q0361K4602k5944o8015p3272p1509o1729k5017j0721p883j8207k6175
16999F4401j2038n198j2211k328q444o321J7140J9154j17J1137N740j3122o060
16986E1733J513K7715L6740M2089P5996Q1427P4612M1062l574o5560r3760p3953
16974A96040n8716k2312j4625m6065m5546j6687L614m67J0638l092j1886l233
16962a2337L092o542J705N846l264k4524m924J5572m322l850r079j0734J308N936
16948d6117P487K889K420K433n417p881J6522p224J766P235j0249j2221p123N501
16934d9979p987j6005K399L080j7814m949k536j3815O824P407N69p246K71q77
16920a00658L506Q196J2799M029p88j484P660Q871N204J2798l013L801N027m567
$$ y = [347910, 428271, 452873, 426929, 358914, 285642, 214133, 152404, 127387, 116666, 108783, 90576, 64401, 52363, 47165, 34954, 32626, 24182, 17861, 35001, 54155, 54038, 65175, 70915, 57793, 51733, 53246, 80961, 117701, 159790, 235786, 317213, 391825, 432887, 429313, 363753, 269993, 196040, 137324, 115012, 100387, 54322, 8776, -7911, -4297, -4764, 5874, 2782, -9104, -12337, -9245, -15787, -14082, -8236, -11500, -36024, -40948, -25376, -29698, -33548, -42627, -53361, -52053, -46117, -38630, -35741, -33321, -30888, -36305, -44186, -27664, -34888, -33122, -25887, -36136, -48357, -55480, -49979, -57966, -73971, -71572, -68492, -86306, -91255, -93791, -107606, -100782, -93375, -92806, -100052, -99781, -100658, -97152, -88956, -76157, -72128, -72916, -74400, -66740, -57869, -52665, -39867, -42880, -39079, -34052, -38619]
16906c8619n285o537k518K373j3011j5408p382k551K4387N937j0800K461L635
16893f3318j7340m115K4771k55j9702k2726o85J1954K466q876O975R987Q75J3150
16879f6839K1746K596j4307j3092k047J2193R578o1k029j1931k502J4838j268
16866e3125L496j1592m151q467j7229Q658j1626L820r116K084P24k785k565M849
16852i7025q524k8125l045L768J7378L1346Q394r917k0085J889J5550J3480K841
16839g2075l219j6036j8391J1199l198J0265j0797K562k319j631L526J3567Q776
16826g7771k038k5210k0311j5667O014k099j793M546p542k345J5893J2972O741
16813a08610o468m556J3130Q981J7542m525j3351m128j0262k0396R485O218R542
$$ y = [-38619, -43904, -50441, -52959, -50586, -63597, -79005, -86387, -88938, -64551, -58614, -69414, -66953, -63318, -80658, -84773, -60002, -60257, -79959, -102685, -103370, -91416, -88950, -97826, -90851, -80864, -79989, -66839, -45093, -42497, -56804, -69896, -71943, -59750, -50172, -50233, -52262, -64193, -66695, -51857, -53125, -49629, -61221, -65372, -73839, -91068, -82410, -94036, -90216, -99332, -97248, -96524, -99309, -101874, -97025, -105549, -133674, -136719, -132951, -115573, -84227, -75833, -85750, -105835, -103946, -88396, -74916, -72075, -75294, -91330, -109721, -98522, -101720, -91455, -102252, -99690, -102009, -103640, -100114, -86547, -77771, -79809, -105019, -125330, -140997, -134983, -137082, -138875, -134329, -141871, -144216, -128323, -115351, -108610, -115078, -119634, -106504, -97523, -79981, -84506, -97857, -101985, -112247, -132643, -123158, -116940, -107398]
16800a07398m501r134J040k5483j5454M495Q092J7140J4108K0509q264k244J3891
16787i3203P098J6870K015q178j7639j7465j4975q438N437J7256P582P13k3230
16774a26157r649K3942J9355k2513k54j3037n819q87K1615n14N717J4138j0226
16761a04289l154P316l367K1858J5643j1452l2548r628P529J0265K0783L5203
16749d5841K1710j83j2330j3606r120M683r732j0644j3040k703n700J4422J4206
16736f7878M596J3680j1203k6012O176J5378o39j2264j4654r463L18J6663P62
16723h4540j0213q994M429K9126K2886L494J6251J8029M812k0745l185J0325Q0
16710a8245n205L449j0761n816M056Q622L991k642j0967q657N63k7150j2655n444
$$ y = [-107398, -111899, -121033, -119993, -145476, -160930, -156435, -148343, -131203, -117095, -96586, -104850, -107094, -93203, -86105, -69235, -67220, -75398, -93037, -110502, -125477, -133915, -128478, -111222, -103640, -102927, -126157, -135806, -111864, -92509, -115022, -115276, -128313, -134132, -135019, -113404, -113918, -108201, -94063, -104289, -107443, -100127, -103494, -81636, -65993, -77445, -109993, -119621, -112092, -101827, -81044, -45841, -24131, -24314, -36644, -50250, -59370, -54687, -64419, -75063, -88103, -90806, -96506, -82084, -67878, -63282, -49602, -60805, -86817, -80641, -65263, -65902, -78166, -92820, -102283, -101965, -85302, -84540, -94753, -103747, -99318, -70192, -47306, -43812, -27561, -9532, -4720, -25465, -28650, -18325, -18245, -23450, -20001, -30762, -36578, -32522, -23900, -19909, -22551, -33518, -42175, -41612, -68762, -81417, -86861]
16696h6861j5110p166l634n318J5741l516K0013m169j3227n707P162J30j247J0124
16682i2785j9939k0708j977J4183J0734o527Q982J8303q074K2052L0269j202L701
16669d2988o514j6123j6660k6072l837j2184j4149L63J3908J4001K2084J0671
16657g7500J1853K4539J350o314L72J4649L2058O398k1461j2594K228j5496j5117
16644e5035k4690k9586l454n316o510n608l167j0518n420J4843O975J1595L278
16631a12613j3792J2177r693j0705L392J0846R637N103N412N751J1831J1752l949
16618g4851j8245P253Q154J0794P436M123O387n179P572K611n159j3570k1756
16605h4430j2446j811m425k310n350q868q905o949N560J6888L1117N223L073J012
$$ y = [-86861, -101971, -109137, -112771, -118089, -102348, -105864, -85851, -90020, -103247, -108954, -101792, -101662, -102909, -92785, -112724, -133432, -135409, -121226, -110492, -117019, -108037, -89734, -97808, -75756, -45487, -46689, -42988, -49502, -65625, -82285, -108357, -112194, -124378, -138527, -138164, -124256, -110255, -88171, -77500, -65647, -41108, -39758, -46072, -45700, -31051, 1007, 7405, -14056, -26650, -24422, -39918, -55035, -79725, -109311, -112765, -118081, -124591, -130199, -133366, -143884, -149304, -134461, -127486, -115891, -112613, -126405, -114228, -123921, -134626, -131234, -120388, -110751, -105648, -100236, -94485, -82654, -70902, -74851, -93096, -85843, -77689, -66895, -59459, -55336, -48949, -54128, -46556, -43945, -49104, -62674, -84430, -96876, -98687, -103112, -105422, -110772, -119640, -128545, -135494, -129934, -113046, -81929, -76706, -73633, -72621]
16591g2621q144Q69J274j5672l675L715J0410o418m436O000j3878j6938o685N119
16577a21080J1972J311r788j0315j5727j2156j2039k514k317j84K868K0418J5835
16564a33716J7908K2520J2733q579k4290j1385P295J4530p498k4067N086p167
16552a36630j0369l834J3415L085l969l234j0398J1845P902K667O529N26k3704
16539a46169j412J5328J4046N991p116o966L218N542k221P49J8086P374J0836
16526h2714J6224r746k2604q244L950L891q240k2905j355J8395j4962n43M761
16513a24092R397n370j6741r775K145J6827M158J3278J3308P00P188r407m561
16500a02945n244J672j4867M874M000Q971K41j1787P795l10L885M469M384m229
$$ y = [-72621, -80765, -79896, -78622, -94294, -97969, -94254, -83844, -90262, -94698, -88698, -102576, -119514, -126199, -121080, -109108, -107797, -117585, -127900, -143627, -155783, -167822, -170336, -172653, -172837, -169969, -149551, -133716, -115808, -93288, -80555, -89134, -113424, -124809, -117514, -102984, -110482, -134549, -129463, -136630, -146999, -150833, -137418, -134333, -138302, -141536, -151934, -140089, -132187, -129520, -122991, -122465, -146169, -147581, -132253, -118207, -112216, -119332, -126298, -123080, -117538, -119759, -119010, -100924, -93550, -82714, -66490, -76236, -98840, -107084, -103134, -99243, -107483, -130388, -131743, -113348, -128310, -128853, -124092, -114695, -120065, -136806, -146581, -144436, -127609, -123451, -110173, -96865, -96165, -88977, -98384, -102945, -108189, -106517, -121384, -116510, -112510, -103539, -103298, -115085, -107290, -107600, -103715, -99246, -94862, -99091]
16486i9091k0810r777j1209L0724J6993K013m263o97K057J635j2972o155j1712
16473a23264R453j2029R928J684M013Q375j2784K311N466l924J2562M818j223
16460i4614K181K577l423J533j4892J923J0424j2925j4794q187j3674N166Q825
16447a29880M786R415O049P341K260K665R531q186j1541l644l358q947l810P128
16433a20191K0179j833p470J3633P129q609j0933R241j0352k300j0690m580K246
16420a24530Q003O352J0742j1076P35J0232o125k1577k6J4653J6308J543J197
16407i3569N458L825k510q871j495O146J2715j1385j3519M953k679R785j5413
16394a06559J0006o89m612M364p409l992J2235P935o987p010l719J2375L06j5882
$$ y = [-99091, -119901, -129678, -140887, -110163, -93170, -91157, -95420, -96117, -94060, -92425, -105397, -111552, -123264, -113811, -125840, -115912, -114228, -110215, -101840, -114624, -112313, -106847, -110771, -98209, -93391, -94614, -92433, -89856, -93279, -91746, -106638, -104715, -94291, -107216, -122010, -130197, -143871, -138705, -129880, -125094, -115679, -109630, -102289, -100029, -97364, -87833, -96019, -107560, -111204, -114562, -123509, -127319, -120191, -100012, -101845, -109315, -95682, -88553, -97162, -108095, -98854, -109206, -111506, -122196, -126776, -124530, -116527, -110175, -99433, -110509, -109774, -99542, -105667, -127244, -127270, -112617, -96309, -94766, -93569, -88111, -84286, -86796, -95667, -97162, -91016, -78301, -89686, -103205, -98252, -100931, -91146, -106559, -96553, -97242, -101854, -97490, -104899, -108891, -96656, -88721, -95708, -102718, -106437, -94062, -93756, -109638]
16380a09638L520j2026m882k417J567Q356K1285J0969q12K215P472j0336r840
16367i4567O301r077j5521l341n15j2775O877J1654K0486J5254J668p680j2436
16354i3672p668j2857R195J6785m569n758j993Q985Q23o09N165N094O914j4722
16340h8887j9818j0418l223l203m254Q560P793L334K1136k124n548k207J2082
16327h6777J3952K135r458Q236N110q849l669q196j515k564J1214o175j8246m496
16313a09298P305K991P784J452J2504q543j1460j1247P584J2513n511j7880Q511
16300a03295L626l912l58P144j0651P678J5153P895P771J1934m260j5697l4746
16287a11718l126J162p52J1998j5770N3m555J3462Q172J6983K915p974m056k521
$$ y = [-109638, -106118, -118144, -123026, -125443, -123876, -115520, -94235, -83266, -84078, -81863, -74391, -84727, -94567, -88266, -97343, -112864, -116205, -116720, -129495, -122618, -110964, -90478, -75224, -73556, -81236, -93672, -101340, -114197, -105002, -88217, -92786, -98544, -100537, -91552, -90729, -91338, -86173, -81079, -74165, -88887, -108705, -119123, -122346, -125549, -129803, -121243, -113450, -110116, -88980, -91104, -96652, -98859, -86777, -72825, -70690, -80148, -71912, -66802, -75651, -79320, -87516, -89031, -91595, -80381, -86556, -104802, -109298, -101993, -99002, -91218, -89766, -77262, -85805, -97265, -108512, -100928, -88415, -93926, -111806, -103295, -99669, -103581, -103939, -96795, -107446, -99768, -84615, -76720, -68949, -57015, -61275, -76972, -111718, -114844, -113682, -114434, -102436, -118206, -118153, -122708, -109246, -101074, -84091, -81176, -89150, -93206, -95727]
16273i5727J5144k761q444O597j0389l1234j006P87m568J7549J727j555J3784
16260a00096J0411m76j305j7597P941J040n967p030K6105P223Q931K440o765J9615
16246e5530l090j0544Lj862j5514p14k403J7735K460m146p030k3982j2099M295
16232a12421J1320R155N347J848R84Q714K509m360O449m080J955K723j406r175
16218h0438j0678r450J841r888R742L164q798p280M339P077j950N437j761o69
16204i9312R264J281j4174j2797L230J0472n078j6365k305l586J2317J7087R838
16191i0128j3254L243o06j7400J4278J5286J597K163l291J030Q608l557j1370
16178i3401j0463m963J385O641l140R040K128M075R524j2490j6702r972o70M342
$$ y = [-95727, -80583, -83344, -91788, -85191, -95580, -126814, -127820, -127033, -131601, -114052, -112325, -113880, -100096, -89685, -90161, -91466, -109063, -101122, -100082, -106049, -113079, -86974, -79751, -70820, -68380, -75145, -55530, -58620, -69164, -69161, -71023, -86537, -87251, -89654, -71919, -69459, -73605, -80635, -104617, -116716, -112421, -101101, -91946, -86599, -84751, -83767, -75053, -72544, -76904, -70455, -74535, -72580, -69857, -71263, -80438, -91116, -100566, -98725, -108613, -98871, -95707, -104505, -111785, -107446, -100369, -102319, -96882, -98643, -99312, -90048, -88767, -102941, -115738, -112508, -102036, -107114, -123479, -125784, -129370, -117053, -99966, -90128, -103382, -100139, -100745, -118145, -103867, -88581, -86984, -84821, -88112, -87082, -78474, -82031, -93401, -103864, -108827, -107442, -100801, -103941, -94901, -92773, -88698, -79174, -91664, -108366, -118338, -119008, -114666]
16164a14666J3517r486J0928P032R669l357N23J3449K962n948n730p534j0084
16151i8725n530Q367R123j5354r764K424K639J870K868m144n959N095n498L896
16137a08692p77L30K1649M811R45o756j4166N587L158j2239J598L817N586J2673
16123h2476j5783N607J1726n136n644o036l394O209Q319n601k971j456J2326N342
16109g8968j281J0080O356P517R78M149K806m998j2385q188k3776k745N607J1473
16095h3375J824o115N2K911j1876k489q880Q324r728J6761K6089J2650R433j932
16081d6351L951J4941k174k793q746M591L530p78K365j7795j246j1172J463K1433
16067c8781k892p683j0468o864L68j4540j5024O039Q099J829K113k935R404R119
$$ y = [-114666, -101149, -110635, -99707, -92675, -83006, -86363, -85840, -72391, -69429, -75377, -81107, -88641, -98725, -104255, -95888, -86765, -102119, -111883, -109459, -106820, -104950, -102082, -106226, -112185, -107090, -112588, -108692, -109469, -109139, -87490, -82679, -81734, -88490, -102656, -97069, -93911, -106150, -104552, -100735, -95149, -82476, -98259, -92652, -80926, -86062, -91706, -97742, -101136, -94927, -86608, -92209, -95180, -96636, -84310, -78968, -80249, -70169, -63813, -56296, -55318, -51169, -48363, -53361, -65746, -73934, -97710, -100455, -94848, -83375, -81551, -87666, -87614, -84703, -96579, -99068, -107948, -99624, -109352, -92591, -66502, -53852, -44419, -46351, -42400, -27459, -29633, -32426, -41172, -36581, -33051, -33829, -31464, -49259, -50505, -61677, -60214, -38781, -41673, -49356, -59824, -66688, -66320, -80860, -95884, -89845, -81746, -79917, -77804, -80739, -71335, -62216]
16053f2216K389l672N328O278k0100p848Q246j0442M968J9184R748o843l227K3107
16039c5100J7882j9176p043j5068k6640j1333j331P006J1208N133J1179Q670j052
16026e5665m764j0443Q035j295j7810l672J4398Q505J087M943m813l084J506j8284
16012h1356Q01L883N466j676K259J627j4808j3648j2075J2545J709J705J7688
15999g5880K0216J262r270j9483J6931J5125N333o166j8114j6999L060R148q496
15986h3333q623J740K1005J4372q03q065j7859O139Q687J302j3804j3310j0491
15973a03043p185J309k678j3J017J1318K0278J1678M71L463m850J925o722k5640
15959i8672q772j7456j2950N237R037J3680J7268J8279P10j467J0015J8818j4025
$$ y = [-62216, -59827, -63499, -58171, -51893, -71993, -79841, -71595, -82037, -77069, -57885, -48137, -54980, -58207, -35100, -17218, -36394, -43437, -58505, -85145, -96478, -97809, -90803, -79595, -74462, -63283, -54613, -55665, -60429, -70872, -62837, -64132, -81942, -85614, -71216, -62711, -61624, -56681, -61494, -64578, -63072, -81356, -80555, -76672, -71206, -72882, -70623, -68996, -83804, -97452, -109527, -96982, -95273, -93568, -75880, -55664, -54402, -63672, -83155, -66224, -51099, -45766, -51932, -70046, -87045, -83985, -74837, -83333, -91956, -90216, -69211, -54839, -55642, -63707, -81566, -75427, -66740, -65438, -79242, -92552, -103043, -110228, -108919, -111597, -111610, -110593, -99275, -78997, -67319, -66848, -63385, -68235, -66310, -73032, -98672, -107444, -124900, -137850, -132613, -123576, -109896, -92628, -74349, -73639, -75106, -65091, -46273, -60298]
15946f0298j5308L787p736N75p992O333M861r962j0606J1635N350r56J0594p225
15932g6948L284J4023k266M620j8972k1388j0109n63j276j471L0008n549j9565
15919a06172N024J6972J0999K344K656K606j0303l457L46m829M615J210K453j1746
15905h7282r90J4801K2112O552q653N156J442j4008K1487P243j5276o082l497
15892e6995q650n209J4653Q725o095l708n044j4J3550j057p271o385o434M34p174
15877g6674O647j2697q042m735p034J1710K1393K0513j145k3515n92m475L679
15864g4967n477Q067P668J2039n676k1053P021L4748J2859j3352m551k7806j1453
15851h1933L369J2999J3119M240r737n531P657M802L428j1717p703J861q701j1996
$$ y = [-60298, -75606, -71819, -79555, -78980, -86972, -80639, -75778, -85740, -96346, -84711, -79361, -80317, -69723, -76948, -73664, -59641, -61907, -57287, -76259, -97647, -107756, -108319, -109595, -111066, -81058, -86607, -106172, -101148, -84176, -73177, -70833, -68177, -65571, -75874, -79331, -78985, -83814, -79199, -77989, -75536, -87282, -88272, -73471, -51359, -44807, -53460, -48304, -46862, -60870, -39383, -32140, -47416, -53498, -56995, -65645, -70854, -56201, -47476, -53571, -57279, -62323, -62337, -48787, -49844, -57115, -63500, -69934, -69500, -76674, -70027, -82724, -90766, -95501, -102535, -90825, -69432, -48919, -50064, -73579, -74171, -78646, -74967, -80444, -72377, -64709, -52670, -58346, -79399, -72378, -37630, -24771, -38123, -42674, -70480, -81933, -78564, -65565, -52446, -48206, -57943, -63474, -55817, -51015, -47587, -59304, -67007, -65146, -73847, -85843]
15837h5843J2604J2331K47J1143J1579r085l941q967l488J4262l183K798J0717
15824c8826J425l842R963O914J2796J3934P236k0389p767k0298j4665P386r079
15811e5212j9663P356J2546K683M400k527n436Q363j7959r709K049J0882R743
15798e2484P269P558N71j0345R637m670n503k113j7970L033J6980M539M061n049
15784d4486j2017q43p687J1162K389j58K811L455R00n31L73P263j294n720n414
15769d9797O926J3893l563j0422k0137n583M33J1747M788J9426L095j8882k322
15756e0398L652k084l828J0074J0080n062p180O395j4670J5420R894j5318K689
15743d0336J1525j046J5928n232j0024p401j0051k344L878J6711P354j1040o627
$$ y = [-85843, -73239, -60908, -60661, -49518, -37939, -47024, -50965, -59932, -63420, -49158, -52341, -49543, -38826, -37401, -41243, -31280, -24366, -11570, 2364, 9600, -10789, -18556, -38854, -53519, -46133, -55212, -74875, -67519, -54973, -52290, -47890, -50417, -55853, -47490, -65449, -75158, -73109, -62227, -52484, -45215, -37657, -37086, -47431, -37794, -42464, -47967, -50080, -68050, -65017, -48037, -43498, -39437, -44486, -56503, -57346, -65033, -53871, -51482, -51640, -48829, -45374, -44474, -45005, -44632, -37369, -38663, -44383, -49797, -42871, -28978, -32541, -42963, -63100, -68683, -68250, -56503, -51715, -32289, -29194, -48076, -50398, -46746, -48830, -52658, -42584, -32504, -37566, -44746, -38351, -53021, -37601, -27707, -43025, -40336, -28811, -29857, -13929, -19161, -29185, -36586, -46637, -48981, -45103, -28392, -21038, -32078, -38705]
15730c8705J5993J5688o436m000n55j5523n967j00N671j3442j3326m85K1656O663
15716c2868l894l132J6139J9323q25L535j2966j6029L758P157o036O687J464P01
15702a6986J8745n316j2112n724k701J1559o524p93m608n148j0456P386N554n327
15688c2451J4740j829j4289p689k251L057J2618Q130J6275J6581l467j3179j1647
15675a5401Q957R309k357p137k488o743q864j6200j183R554R262m290j956j0243
15661c9780l823n0o88J0710J0926K178J3921L665l326n972O579j1988J449j97
15647a6396K608r929J113L1273L371j2281j3379k089L626o521M194Q544M467K0222
15633A8823K879j0798n742j1475J525L868J326M572R436P88J681q353l1552j90
$$ y = [-38705, -22712, -7024, -13460, -17460, -18015, -33538, -39505, -39605, -33934, -47376, -60702, -61187, -39531, -32868, -36762, -39894, -23755, -4432, -5257, -1722, -14688, -30717, -26959, -19802, -25838, -19151, -17687, -16986, 1759, -3557, -15669, -21393, -24094, -12535, -19059, -19852, -24460, -29608, -40064, -32678, -27124, -32451, -17711, -19540, -33829, -41518, -43769, -40712, -28094, -19964, -3689, 12892, 9425, -3754, -15401, -6444, 2865, 508, -6629, -9117, -15860, -24724, -40924, -42107, -32553, -23291, -27581, -29537, -39780, -43603, -43653, -44341, -33631, -22705, -20527, -6606, -2941, -6267, -12239, -5660, -17648, -16199, -16396, -13788, -23717, -22604, 8669, 12040, -241, -13620, -15709, -12083, -18604, -14410, -5866, -1399, 18823, 21702, 10904, 5162, -6313, -4788, -920, 406, 4978, 14414, 15202, 16883, 8530, -23022, -23212]
15619b3212O386m010J3503P531M904l869j3609J4915j1154j5916k329J1255J0304
15606e301r850j0143J2882O105j1310K797j666K67N297K859p319J078R454J0454
15592E604j57o219J4737J1727j2079J2533q151r822j2050j675q407L114J5758
15579D913N646l443J8349M875l461k4011q522K1132O787k379q73P583J2645n749
15565C3492l463j8330j6697q393Q881J0187J776L762J2928N55j1109k863j1947
15552a221r999P186J1088O002P666J1458J8033Q904m118j7983l109J702o10N829
15538D0828M272l392K71K22j5999M61Q517J914q758R286J1469K22J038n321J882
15523D6912J7341j4852k2505j364J5972r410M43K0601N539P665R700j1317j0947
$$ y = [-23212, -16826, -20836, -7333, 198, 5102, 1233, -12376, 2539, -8615, -24531, -26860, -15605, -5301, -15151, -25294, -12412, -6307, -17617, -14820, -16486, -16219, -10922, -8063, -15382, -14304, -4850, 5604, 5447, -772, 13965, 25692, 13613, 26146, 17995, 8173, -3877, -5552, -13959, -10845, 4913, 10559, 7116, 25465, 30340, 26879, 2868, -5654, 15478, 22265, 19886, 19013, 26596, 39241, 33492, 30029, 11699, -4998, -13391, -4510, 5677, 7453, 11215, 24143, 24698, 13589, 10726, -1221, -11220, -4034, 7054, 13056, 20722, 32180, 50213, 59117, 54999, 37016, 33907, 35609, 34999, 40828, 45100, 41708, 41979, 42201, 26202, 26663, 35180, 37094, 28336, 37622, 49091, 49313, 50351, 45030, 46912, 64253, 49401, 26896, 25532, 41504, 32094, 32537, 53138, 58677, 66342, 76042, 64725, 53778]
15510E3778k663p46j0207j300P891j1061j2481M281M118P044O942Q765M172j0015
15496D8518j6809j4927J150R076J0263R557N422R242J6704R51m756J2747K56m20
15482H6974n887j2200p597O409n588r344K73J2349Q284K356m28P666P750j2362
15468G8655J694r545q81R514r540p632P697R534R110m9j1565k2439j0877o438
15454C7238Q439O971J1847K2178Q153J2614L111k1809M062N352r268K765Q290
15441I9943j418L711M106j2878K938J8309k273M764r943Q25R068p577k5115j993
15427H2467q028N34J8705J8105J4587j889n629j8801n454K743O774K0467J02O367
15413A31050j2073j0816R076J548j6273P362P553P600J82N167l286m589M914M956
$$ y = [53778, 51115, 50369, 40162, 38862, 46753, 35692, 23211, 27492, 31610, 38654, 45596, 54361, 58533, 48518, 31709, 16782, 17932, 27008, 37271, 46828, 52250, 61492, 78196, 79147, 74391, 87138, 87394, 86974, 81087, 68887, 61290, 67699, 62111, 52767, 53040, 65389, 73673, 76029, 75601, 83267, 91017, 78655, 80349, 70804, 69923, 79437, 69897, 62265, 69962, 79496, 88606, 88557, 76992, 54553, 43676, 37238, 45677, 52648, 64495, 86673, 94826, 107440, 110551, 88742, 92804, 98156, 88888, 91653, 99943, 98525, 102236, 106342, 93464, 96402, 114711, 112438, 117202, 107259, 108084, 117152, 109575, 84460, 82467, 74439, 74973, 93678, 111783, 126370, 124481, 118852, 100051, 94597, 97340, 104114, 124581, 124683, 131050, 118977, 108161, 117237, 118785, 102512, 109874, 117427, 125027, 125209, 130376, 127090, 122501, 127415, 132371]
15399A32371j262O269j487J6713J5867j0356j3731o385J201j2780L175j4137j1034
15386A04424M929L9162J9021O826k99L532j2222k3583p761J0162L423J892J3682
15373A63188J1900N791k5520j7651O754J2289R870J57l246m489p569J0310J5158
15360A76942m627l101o200j6084K180L1474q65p063P027L42N810j4159L854J5726
15346A91256j470J604Q927j7367j9449J1078J5375Q387O621j4294o946m150J1637
15333A91209j8214M404K1299J5743Q64J6528r104r197L660N612O340O248L836
15320B39228l318j0704p494j2627L274R261P23O364J0345n212j278k90K0121o9
15306B48324j2917J663M507J712j0780j843M833M044M334J76l653K260J329N586
$$ y = [132371, 131109, 137378, 135891, 152604, 168471, 158115, 144384, 137999, 139200, 126420, 129595, 115458, 104424, 109353, 148515, 167536, 174362, 174063, 177595, 165373, 141790, 134029, 144191, 147614, 149506, 163188, 175088, 180879, 155359, 137708, 144462, 156751, 166621, 166778, 163532, 159043, 151474, 161784, 176942, 172315, 169214, 163014, 146930, 149110, 180584, 179719, 172656, 179683, 180025, 185835, 171676, 175530, 191256, 189786, 191390, 200317, 182950, 163501, 174579, 189954, 198341, 204962, 190668, 183722, 179572, 191209, 172995, 177399, 198698, 214441, 215305, 231833, 222729, 213532, 217192, 222804, 229144, 235392, 239228, 235910, 225206, 217712, 205085, 208359, 217620, 218343, 224707, 235052, 229840, 228562, 228272, 248393, 248324, 235407, 237070, 241577, 243289, 232509, 230666, 235499, 239543, 243877, 244053, 240400, 242660, 243989, 249575]
15292B49575J0162K864J0992M580o569j1310K238K1652R831j5642k4320P242J8000
15279B79295N120L42R877j4238r484N538J3140K932N543n982j7845K937J3428
15266B90603l441N805M488k979L715l051M764J7675L520j1488l813j4408q309
15253B83081P795n381K3563K8556o956p382J2038P853j4203q738N288m412M988
15240C26090J2465J4129K687j6246r362J3724n738j0755P796J1764J2805p494
15228C51865L755Q638n58r681j2060L307J1615J4077R96P950j01r85l843j9480
15214C55495o849N659J2424K372O180J4672J0450J2411J6478M784k096j3015j210
15201D17755J2676n769j8248j0186R800Q326q908O343K504j1798R65J0554K0387
$$ y = [249575, 259737, 262601, 273593, 278173, 271604, 260294, 262532, 284184, 294015, 278373, 254053, 261295, 279295, 284415, 284757, 294634, 280396, 270912, 276450, 289590, 292522, 298065, 292083, 274238, 277175, 290603, 287162, 292967, 297455, 294476, 298191, 295140, 299904, 317579, 321099, 309611, 305798, 291390, 283081, 290876, 285495, 309058, 337614, 330658, 323276, 335314, 343167, 328964, 320226, 325514, 321102, 326090, 338555, 352684, 355371, 339125, 329763, 343487, 337749, 326994, 334790, 346554, 359359, 351865, 355620, 364258, 363700, 354019, 341959, 345266, 356881, 370958, 371954, 379904, 379803, 378818, 374975, 355495, 348646, 354305, 366729, 369101, 375281, 389953, 400403, 412814, 429292, 434076, 431980, 418965, 417755, 430431, 424662, 406414, 396228, 406028, 414354, 405446, 411789, 414293, 402495, 403460, 414014, 434401]
15188D34401J0748R576P956l460j5286O970J2161O192j2542j1563Q63q340Nl424
15174D34257R318J4268O516K986K0240K862Q890k380k39m078J1706j4505K103
15161D91944L121k259j5177N911k753K0100K0775J2708N406p140M171K40l375
15148E33672o693m055p049N673P510J9927P607j0798K809n247k298Q719M884R573
15134E64234K2940J9030J3733O227q599j2326P140k002J986K0093l389m851J6132
15121F40348R153l511K943j337N366L071J2002j003L447L705J7329K0272O886
15108G18671M898P728j854j08l225J1943R920o470J289N765K1516J5193j240O57
15094G84683R321J7462R537j1954O917P126L647K1428M449q226l747J5530K254
$$ y = [434401, 445149, 454725, 462681, 459221, 443935, 450905, 463066, 469258, 456716, 445153, 446016, 437676, 437681, 434257, 443575, 457843, 464359, 467345, 487585, 490447, 499337, 496957, 496718, 492640, 504346, 489841, 491944, 495065, 492806, 477629, 483540, 480787, 500887, 521662, 534370, 539776, 532636, 536807, 537047, 533672, 526979, 522924, 515875, 521548, 529058, 548985, 556592, 545794, 548603, 543356, 541058, 549777, 554661, 564234, 587174, 606204, 619937, 626164, 617565, 605239, 612379, 610377, 612363, 632456, 629067, 624216, 640348, 649501, 645990, 648933, 647596, 652962, 656033, 668035, 667032, 670479, 674184, 691513, 711785, 718671, 723569, 731297, 729443, 729335, 726110, 738053, 747973, 741503, 742792, 748557, 770073, 785266, 784026, 784683, 794004, 811466, 821003, 809049, 815966, 823092, 826739, 848167, 852616, 844390, 840643, 856173, 858427]
15081H58427P013L917l966p256J5898n7R819M519P667m902J0012J1584L775M843
15067I21293J4278n753r055K4535K0345M510K3014K1851R575K575N68q405J0326
15054A029657J8653R466K16OJ0096J0752J3310k195J2855J2701K568J0616j4924
15041A113777j8864P047K1025L3826J2232k971Q072N979K4088J1679K7004J225
15029A244119N611J2942l396L0841K6461M162K614k511J2946J9761R834K1294
15017A384678p51L996K4248L2705L717j8114o740K827K0135J0547K5403P190L91
15004A490232K4927K8580J8837N25J2938K6488J6065K893O745O170q528K7648
14992A653520K5095K5232J7823R45J3755K4253R484J0702M445K2774K9250L5679
$$ y = [858427, 865440, 869357, 865391, 858135, 874033, 873976, 883795, 888314, 895981, 891079, 901091, 912675, 916450, 921293, 935571, 929818, 920763, 945298, 965643, 970153, 993167, 1015018, 1024593, 1027168, 1027736, 1019331, 1029657, 1048310, 1057776, 1057992, 1057998, 1068094, 1078846, 1092156, 1089961, 1102816, 1115517, 1118085, 1128701, 1113777, 1094913, 1101960, 1122985, 1156811, 1169043, 1166072, 1174144, 1180123, 1204211, 1215890, 1242894, 1244119, 1249730, 1262672, 1259276, 1290117, 1316578, 1320740, 1323354, 1320843, 1333789, 1353550, 1363384, 1384678, 1383927, 1387923, 1412171, 1444876, 1448593, 1430479, 1423739, 1426566, 1446701, 1457248, 1482651, 1489841, 1490232, 1515159, 1543739, 1562576, 1563101, 1576039, 1602527, 1618592, 1621485, 1628230, 1634400, 1625872, 1653520, 1678615, 1703847, 1721670, 1722615, 1736370, 1760623, 1770107, 1780809, 1785254, 1808028, 1837278, 1872957]
14980A872957P489J288K0189K4412L0542J7027K6872L0320J3360k189J9594L2874
14968B094735Q951j925L2769K4185J7519J3724J1745L8463K4275M763r39l937
14956B264328J9394J8702P099P992L8085L7020M7527L4905K9714K8499K3068K8819
14944B585152M0116K8838L1821M0991K7834K8638K6877K6226L2351K7823Q998
14933B905665K5314J1296K1253L7908L5096L1830K7318J7323M4919M9318L0853
14922C238093L6248M8917M4585M7630L7131J2157K7129K9921M1090O2486M1376
14911C666763K3694M6825L4652L1381P6349P1412O5686O7679P3216K0939K7672
14900D206268K7280M2822N4697M7404L9924M9991M4688N2966N1446N9023O2293
$$ y = [1872957, 1880446, 1881734, 1901923, 1926335, 1956877, 1973904, 2000776, 2031096, 2044456, 2042267, 2061861, 2094735, 2103686, 2101761, 2134530, 2158715, 2176234, 2189958, 2201703, 2240166, 2264441, 2269204, 2268265, 2264328, 2283722, 2302424, 2309523, 2317515, 2355600, 2392620, 2440147, 2475052, 2504766, 2533265, 2556333, 2585152, 2625268, 2654106, 2685927, 2726918, 2754752, 2783390, 2810267, 2836493, 2868844, 2896667, 2905665, 2930979, 2942275, 2963528, 3001436, 3036532, 3068362, 3095680, 3113003, 3157922, 3207240, 3238093, 3274341, 3323258, 3367843, 3415473, 3452604, 3464761, 3491890, 3521811, 3562901, 3625387, 3666763, 3690457, 3737282, 3771934, 3803315, 3879664, 3951076, 4016762, 4084441, 4157657, 4178596, 4206268, 4233548, 4276370, 4331067, 4378471, 4418395, 4468386, 4513074, 4566040, 4617486, 4676509, 4738802]
14889D738802O1409N9057M7315N7990N5453N4122M2787N9055O4910O9724P8821
14878E389445P2999P2570P6003P7707O7465P3429O8197Q2197R5273P0988O3059
14867F209332N8629O5855P2955O7550R4001R3142J11309J05759R3402J05738J01980
14856G179652Q4159R9506J15476R3539R2004J04191Q6005Q7128J10015R8160J00796
14845H250631J17014J24387J17215J12301J24640J17001J21886J11824J22520
14836I319419J30069J24711J44543J47945J54388J49287J35566J18165J48830
14827A0572923J52288J40827J55284J50264J57028J55879J59075J77056J74921
14818A1995545J36363J65373J78699J82594J60344J68933J78477J73662J89916
$$ y = [4738802, 4800211, 4859268, 4906583, 4964573, 5020026, 5074148, 5116935, 5175990, 5240900, 5310624, 5389445, 5462444, 5535014, 5611017, 5688724, 5756189, 5829618, 5897815, 5980012, 6075285, 6146273, 6209332, 6267961, 6333816, 6406771, 6474321, 6568322, 6661464, 6772773, 6878532, 6971934, 7077672, 7179652, 7263811, 7363317, 7478793, 7572332, 7664336, 7768527, 7854532, 7941660, 8051675, 8149835, 8250631, 8367645, 8492032, 8609247, 8721548, 8846188, 8963189, 9085075, 9196899, 9319419, 9449488, 9574199, 9718742, 9866687, 10021075, 10170362, 10305928, 10424093, 10572923, 10725211, 10866038, 11021322, 11171586, 11328614, 11484493, 11643568, 11820624, 11995545, 12131908, 12297281, 12475980, 12658574, 12818918, 12987851, 13166328, 13339990, 13529906]
14809A3529906J95878J78638J81410K00167K04088J92416J90919J93154J88522
14800A5255098J86830J88952J94431J91615J84344J78049J89409K01372K02155
14791A6972255K07934J99654J91141J76110J79630J73229J89883J93770J93659
14782A8677265J87252J69346J81032J94183J65065J47275J50001J37209J48534
14773B0157162J58993J52864J39173J48624J20747J16794J26060J32390J10721
14764B1363528R4054R0528P1402N8219P4261P1872N5838O7253N9355L4237K5695
14753B2066242N0329K4038J884J488j0482j2736r262j2217l8927l8564m0842l5110
14741B1945841n1051q2105o6417q7804q1574q5123q1760r4821j01967j00379j06744
$$ y = [13529906, 13725784, 13904422, 14085832, 14285999, 14490087, 14682503, 14873422, 15066576, 15255098, 15441928, 15630880, 15825311, 16016926, 16201270, 16379319, 16568728, 16770100, 16972255, 17180189, 17379843, 17570984, 17747094, 17926724, 18099953, 18289836, 18483606, 18677265, 18864517, 19033863, 19214895, 19409078, 19574143, 19721418, 19871419, 20008628, 20157162, 20316155, 20469019, 20608192, 20756816, 20877563, 20994357, 21120417, 21252807, 21363528, 21457582, 21548110, 21619512, 21677731, 21751992, 21823864, 21879702, 21946955, 22006310, 22040547, 22066242, 22116571, 22140609, 22142493, 22143981, 22133499, 22120763, 22111501, 22099284, 22060357, 22021793, 21980951, 21945841, 21894790, 21812685, 21746268, 21658464, 21576890, 21491767, 21410007, 21315186, 21213219, 21112840, 21006096]
14730B1006096r4315j11954j22136j24121j17899j19657j43474j33163j28648
14721A9910729j31740j36599j42502j50325j39834j43639j52735j65446j81838
14712A8566071j51782j29628j46712j70748j58001j60942j56488j59800j62616
14703A7169354j59952j50942j64528j66769j44768j40420j51949j61487j62291
14694A5766248j70553j53054j53441j43401j36421j35837j49455j53168j55191
14685A4415727j50899j66155j59897j33922j19481j38947j50150j41820j37772
14676A3116684j20952j17199j26418j32240j15693j20987j31700j34560j06664
14667A2010271j15469j26709j21384j07991j12954j18883j16644j23696j21029
$$ y = [21006096, 20911781, 20799827, 20677691, 20553570, 20435671, 20316014, 20172540, 20039377, 19910729, 19778989, 19642390, 19499888, 19349563, 19209729, 19066090, 18913355, 18747909, 18566071, 18414289, 18284661, 18137949, 17967201, 17809200, 17648258, 17491770, 17331970, 17169354, 17009402, 16858460, 16693932, 16527163, 16382395, 16241975, 16090026, 15928539, 15766248, 15595695, 15442641, 15289200, 15145799, 15009378, 14873541, 14724086, 14570918, 14415727, 14264828, 14098673, 13938776, 13804854, 13685373, 13546426, 13396276, 13254456, 13116684, 12995732, 12878533, 12752115, 12619875, 12504182, 12383195, 12251495, 12116935, 12010271, 11894802, 11768093, 11646709, 11538718, 11425764, 11306881, 11190237, 11066541, 10945512]
14658A0945512j25570j19823j18423j09206r7312j13678j15185r6199j11714r7332
14648I841070r0475p8516q7099r9108r3878r5403q9794r4418r2929j01528q2386
14637H835536o8349p5775q5506q1965q6741o6728p3432j00344j02911q4655q2498
14626G926632q0266p5651q7259r1810p5231p0085n4599o8364n6105o6742q4893
14615G115627p1160n8125m8363o7409n6053n1937q4110p5455p0246n1705m8312
14604F432752n5812m9608m9944o6405m2626m8198o5217o8162o0241m7912n2121
14593E826506n0735l4511l8804o7934p4250m7798n4246m8076m9892m1426m7858
14582E270976n8090n6486l9172l6775m0410l8253m3027m9977l1714l5706l4171
$$ y = [10945512, 10819942, 10700119, 10581696, 10472490, 10375178, 10261500, 10146315, 10050116, 9938402, 9841070, 9750595, 9672079, 9584980, 9485872, 9391994, 9296591, 9206797, 9112379, 9019450, 8917922, 8835536, 8767187, 8691412, 8605906, 8523941, 8437200, 8370472, 8297040, 8196696, 8093785, 8009130, 7926632, 7846366, 7770715, 7683456, 7591646, 7516415, 7446330, 7391731, 7323367, 7267262, 7200520, 7115627, 7044467, 6986342, 6937979, 6870570, 6814517, 6762580, 6678470, 6603015, 6532769, 6481064, 6432752, 6376940, 6327332, 6277388, 6210983, 6168357, 6120159, 6054942, 5986780, 5926539, 5878627, 5826506, 5775771, 5741260, 5702456, 5634522, 5560272, 5512474, 5458228, 5410152, 5360260, 5318834, 5270976, 5212886, 5156400, 5117228, 5080453, 5040043, 5001790, 4958763, 4908786, 4877072, 4841366, 4807195]
14571D807195k1906l0302k4394m0392k6263l2903m9461m9287k9950k6692m0851
14560D434794m5721l8992m0367m1645n6187l7453m4904m1180k9115k9748k6375
14549D003107m8032j2879k9271m2104m7353m7542l0494m3261l3017k2564l0044
14538C616546j8486l7628l3073k7007j7555k9671l5710k2924k9207l5172k7133
14527C302980j5250j3834j6560k4997l3595l4882k3787l4272k9155l2670k8534
14516C015444l1978K702L989j9973l4248l0771r889k0095l4125m0588p869m906
14504B787693m501k4144k3496k6326k3039j3776j9165l9099k2457j2704j4951
14493B564035k6848k0819k5559j0452l4490j9855j0440p537J4450j1110j8511
$$ y = [4807195, 4785289, 4754987, 4730593, 4690201, 4663938, 4631035, 4581574, 4532287, 4502337, 4475645, 4434794, 4389073, 4350081, 4309714, 4268069, 4211882, 4174429, 4129525, 4088345, 4059230, 4029482, 4003107, 3955075, 3942196, 3912925, 3870821, 3823468, 3775926, 3745432, 3702171, 3669154, 3646590, 3616546, 3598060, 3560432, 3527359, 3500352, 3482797, 3453126, 3417416, 3394492, 3365285, 3330113, 3302980, 3287730, 3273896, 3257336, 3232339, 3198744, 3163862, 3140075, 3105803, 3076648, 3043978, 3015444, 2983466, 2986168, 2990157, 2970184, 2935936, 2905165, 2895276, 2875181, 2841056, 2800468, 2792599, 2787693, 2783192, 2759048, 2735552, 2709226, 2686187, 2672411, 2653246, 2614147, 2591690, 2578986, 2564035, 2537187, 2516368, 2490809, 2480357, 2445867, 2426012, 2415572, 2408035, 2422485, 2411375, 2392864]
14482B392864j4718j2281j4908k4058l2894j5780k208j5443j4139j3451j4025
14471B218959k2683j9744j7710j4217l684j2733l966k1038p135N916j0978j3546
14459B077441j7140M817j7206m2643j9477k5479j1587K045n717m487n488P504
14447A942583J1310O590n922p045j425k537m48M767J7738K1536K9348K6542L7409
14434B080446N3836O9753P4598J14988J57976J75764K32821K20546J94229J87291
14424C562248J61001R3806K8194n6325j07738j48208j67491k04058j99504j81774
14414B780151j66400j37474j03264p6036q0841o2409o6596o0628m8110n7333m7660
14403A873400k5219j6186l6508l3029j8472l1251k2173k8270k4362k0120j4226
$$ y = [2392864, 2378146, 2365865, 2350957, 2326899, 2294005, 2278225, 2276017, 2260574, 2246435, 2232984, 2218959, 2196276, 2176532, 2158822, 2144605, 2140921, 2128188, 2124222, 2103184, 2096049, 2101965, 2090987, 2077441, 2060301, 2065118, 2047912, 2005269, 1985792, 1960313, 1948726, 1950771, 1945054, 1940567, 1935079, 1942583, 1953893, 1960483, 1954561, 1947516, 1946091, 1943554, 1943106, 1947873, 1965611, 1987147, 2016495, 2043037, 2080446, 2134282, 2204035, 2278633, 2393621, 2551597, 2727361, 2960182, 3180728, 3374957, 3562248, 3723249, 3817055, 3845249, 3788924, 3681186, 3532978, 3365487, 3161429, 2961925, 2780151, 2613751, 2476277, 2373013, 2296977, 2216136, 2153727, 2087131, 2026503, 1978393, 1921060, 1873400, 1848181, 1831995, 1795487, 1762458, 1743986, 1712735, 1690562, 1662292, 1637930, 1617810, 1603584]
14392A603584q881l688m111j9928k3020j2139k0874k0445o724r72j9807j6040
14380A446955o025o948j4243j8773j3704M688j0120j5864k1703r887N449j2770
14368A327055j9420j9460p367q092j4193J4359J1518j5487j4487p150j1656M627
14356A240247o419p714j0050j0381M027J486k3733k3975r436r076j0302j049K136
14343A135761N229K915r97m252k2817j1539j2821j5104k763M800j5156q079R979
14330A065156K1797J248j7374q301N602r397k624K45M280j2429k7439p011P74
14317A014527m120q516j8358j4725R068P161L269l791r711j2465M93K92O53p904
14303I55873j575J598J2842m017q593k1720j8630J144J0811J1081N355J0910k5560
$$ y = [1603584, 1594703, 1591015, 1586904, 1566976, 1543956, 1531817, 1510943, 1490498, 1483774, 1482802, 1462995, 1446955, 1440930, 1433982, 1419739, 1400966, 1387262, 1391950, 1381830, 1365966, 1344263, 1334376, 1339825, 1327055, 1307635, 1288175, 1280808, 1272716, 1258523, 1272882, 1284400, 1268913, 1254426, 1247276, 1235620, 1240247, 1233828, 1226114, 1216064, 1205683, 1209710, 1211196, 1187463, 1163488, 1154052, 1144976, 1134674, 1133625, 1135761, 1140990, 1143905, 1142908, 1138656, 1115839, 1104300, 1091479, 1076375, 1073612, 1078412, 1063256, 1055177, 1065156, 1086953, 1088201, 1070827, 1062526, 1068128, 1058731, 1056107, 1056352, 1060632, 1048203, 1020764, 1013753, 1014527, 1010407, 1001891, 983533, 968808, 977876, 985037, 988306, 984515, 974804, 962339, 962832, 963124, 963777, 955873, 954298, 955896, 968738, 964721, 956128, 934408, 915778, 916922, 927733, 938814, 944169, 955079, 929519]
14290I29519J3377K4593J9299J537j1038j306o963k4041P277J0907k4408j8860
14278I19893J452Q284o43P6J1985n352n756m620j632J581k1262J05k541k122O618
14263I06066J8471j0369j7436j7534j4007j7513p523r190j5317j0352J831P852
14251H14979J4252Q712j9052M024r152j8721K771J19R200L854K0920K9582J6924
14238H78412J7337J803k492J0462J4017J8554L1508L0349J4470J4778R132K0029
14226A058359J6620o448j0095m2K361k5m490j2438j2617r480j2781n066J0485
14213A014343O991j5060o890L547j6831j1606j3628j7076j2298r069k6926j4522
14201H80975K695Q722j117j0642j5172O452J9361j189L492K6471k977j8443j2114
$$ y = [929519, 942896, 967489, 986788, 988325, 977287, 975981, 969018, 944977, 952254, 963161, 938753, 919893, 921345, 929629, 928986, 929062, 941047, 935695, 929939, 925319, 923687, 925268, 904006, 904111, 901570, 899448, 906066, 924537, 914168, 896732, 879198, 865191, 847678, 840155, 830965, 815648, 805296, 807127, 814979, 829231, 837943, 818891, 822915, 813763, 795042, 797813, 797932, 807132, 810986, 831906, 861488, 878412, 895749, 897552, 895060, 905522, 919539, 938093, 969601, 999950, 1014420, 1029198, 1038330, 1058359, 1074979, 1068531, 1058436, 1058394, 1060755, 1060730, 1056240, 1043802, 1031185, 1021705, 1008924, 1003858, 1014343, 1021334, 1006274, 999384, 1002931, 986100, 974494, 960866, 943790, 931492, 922423, 895497, 880975, 883670, 892392, 891275, 880633, 865461, 871913, 891274, 890085, 893577, 920048, 917071, 898628, 886514]
14188H86514j7941K825N272O520J0928J5451k527o103q154q873l208j3009l0011
14175H37684j5270q139j9529k1941k1406l6008n2725m7157m4023o2286n4004l9089
14163D16107k9861k5445p788R776K0761M1636L0002M4397L6692L0736K7633L0518
14151F25164J2192J0446Q795J5122R632J7829K8551L517N822J5700l732J4576
14139G63614L4832J6972M087j1212R887R500J0132K932K001R876O616j5165K119
14126H46191M736l997q729l328L856k05J014K1237L7024K6472K5344N832K0424
14113I75871L8694M8347P2233Q4728Q7226J27175J42480J60280J76111J89001
14103B102146K11113J79712J61867J69706J29776P5016M6875R938k1737m2964
$$ y = [886514, 868573, 871398, 876670, 883190, 894118, 909569, 907042, 900939, 892785, 883912, 880704, 867695, 837684, 822414, 814275, 794746, 772805, 751399, 715391, 662666, 615509, 571486, 509200, 455196, 416107, 386246, 360801, 353013, 362789, 383550, 425186, 455188, 499585, 536277, 567013, 594646, 625164, 637356, 647802, 656597, 671719, 681351, 699180, 727731, 731248, 737070, 752770, 749038, 763614, 798446, 815418, 819505, 808293, 818180, 827680, 837812, 840744, 842745, 852621, 859237, 844072, 846191, 850927, 846930, 838201, 834873, 838729, 838524, 839538, 860775, 897799, 924271, 949615, 955447, 975871, 1014565, 1062912, 1135145, 1219873, 1307099, 1434274, 1576754, 1737034, 1913145, 2102146, 2313259, 2492971, 2654838, 2824544, 2954320, 3029336, 3076211, 3086149, 3064412, 3021448]
14093C021448p0761o5718p8447r1490o9276n5755o6805m3978l4218l0950k3482
14082B390568j438K0802J6496J3674K5405K0562j663M12k393Q015K358R950j2382
14069B490366N745j171r233P408J1983n978j281k400L482K6657J1797k766K6486
14056B561095L1269M883q743k861O963J2199J0869L6255K9764M3057N2282K0552
14044B797584J2026L7094M0343M8950M7282M5168K9927L7562L5116J7408J4837
14033C163297L0786M9533N6079P3876P8645P8034Q1328J03349J13460J33334J47379
14022D109100J56120J31491J43488J62519J64745J73777J98903K05913K03936
14013E649992K36519K72508K93943L24682L40687L43458L78971M13601M47610
$$ y = [3021448, 2950687, 2884969, 2806522, 2715032, 2645756, 2590001, 2523196, 2479218, 2445000, 2414050, 2390568, 2389130, 2409932, 2426428, 2440102, 2465507, 2486069, 2484406, 2484818, 2482425, 2490440, 2492798, 2502748, 2490366, 2496111, 2494940, 2485707, 2493115, 2505098, 2499120, 2497839, 2495439, 2498921, 2525578, 2537375, 2534609, 2561095, 2592364, 2597247, 2588504, 2585643, 2592606, 2604805, 2615674, 2651929, 2681693, 2724750, 2777032, 2797584, 2809610, 2846704, 2887047, 2935997, 2983279, 3028447, 3058374, 3095936, 3131052, 3148460, 3163297, 3194083, 3243616, 3299695, 3373571, 3452216, 3530250, 3611578, 3714927, 3828387, 3961721, 4109100, 4265220, 4396711, 4540199, 4702718, 4867463, 5041240, 5240143, 5446056, 5649992, 5886511, 6159019, 6452962, 6777644, 7118331, 7461789, 7840760, 8254361, 8701971]
14004H701971M94375N41807N88448O53636P16463P79731Q94918J039845J207981
13995A5619175J438601J685054J979833K407419K911128L469236M121398M887397
13987C8519241N845333P079550Q738291J1022279J4355980J9136240K5640910
13980A30337824L3470546M1028917M6386744M8153572M6396971M1907281L4019373
13973D21701228K2532556Q708939n751232j8853484k9164866l6386710m0554118
13966C22232313m1741698l9599805l4066336k7209755k1059473j6294408j2845138
13959A29415700j0469250q824473p630522o743736o056018n449933m913279m431003
13951G4897486l968064l578435l236832k934766k661464k450531k259940k056216
$$ y = [8701971, 9196346, 9738153, 10326601, 10980237, 11696700, 12476431, 13371349, 14411194, 15619175, 17057776, 18742830, 20722663, 23130082, 26041210, 29510446, 33631844, 38519241, 44364574, 51444124, 60182415, 71204694, 85560674, 104696914, 130337824, 163808370, 204837287, 251224031, 299377603, 345774574, 387681855, 421701228, 444233784, 452942723, 447191491, 428338007, 399173141, 362786431, 322232313, 280490615, 240890810, 206824474, 179614719, 158555246, 142260838, 129415700, 118946450, 110121977, 102491455, 95747719, 89691701, 84241768, 79328489, 74897486, 70929422, 67350987, 64114155, 61179389, 58517925, 56067394, 53807454, 51751238]
13943E1751238j921772j807385j684009j567924j467959j409713j309471j225252
13935C9357753j168192j112163j048320j001357r64620r00617q55284q09673p76806
13926C0720721p60695p24020o97786p06250o53667o28657o26084n97445n61493
13917B4764624n58815n40058n21895m88227m67995m58651m55008m33268m40673
13908B0400034m37347m36506m12537l89208l76526l74614l82999l49388l35553
13899A6905356l30950l23365l23245l28933l22763k94341k78926k80944k85420
13890A4136469k77333k62912k45257k57370k52404k57107k38858k33197k43410
13881A1868621k40574k15913k11980k06962j87544j70856j61982j63382j38968
$$ y = [51751238, 49829466, 48022081, 46338072, 44770148, 43302189, 41892476, 40583005, 39357753, 38189561, 37077398, 36029078, 35027721, 34063101, 33162484, 32307200, 31497527, 30720721, 29960026, 29236006, 28538220, 27831970, 27178303, 26549646, 25923562, 25326117, 24764624, 24205809, 23665751, 23143856, 22655629, 22187634, 21728983, 21273975, 20840707, 20400034, 19962687, 19526181, 19113644, 18724436, 18347910, 17973296, 17590297, 17240909, 16905356, 16574406, 16251041, 15927796, 15598863, 15276100, 14981759, 14702833, 14421889, 14136469, 13859136, 13596224, 13350967, 13093597, 12841193, 12584086, 12345228, 12112031, 11868621, 11628047, 11412134, 11200154, 10993192, 10805648, 10634792, 10472810, 10309428, 10170460]
13872A0170460j09454r1033o3329l4299j0012n777j1784j0688k6076n0518p3242
13861I684248r1427j21225j33514j63282j61597j59395j36060r7143q7082m1942
13851H491581k98M2775K1543J7078R460Q175j3784l9557q8754j28273j61585j74634
13839G983727k08593k06961j95442j91737j79871j59360j30187j17045j28038
13830F466493j38862j01002q9140q9449j11565j01025j15015j14058j04810j10390
13820E391177j13338j10070q3699j00287j02511r1503q1472n9838n9939p5572
13810D512948r7399q3404l8637o3474o2645p3198o7518n2872n7234n3462o2816
13799C800289n2404n7960n2121m1692l1923m4781m0921j5331k3907j5465j8180
$$ y = [10170460, 10061006, 9969973, 9906644, 9872345, 9862333, 9856556, 9844772, 9834084, 9808008, 9757490, 9684248, 9592821, 9471596, 9338082, 9174800, 9013203, 8853808, 8717748, 8620605, 8533523, 8491581, 8491283, 8534058, 8555601, 8572679, 8582139, 8590314, 8576530, 8536973, 8448219, 8319946, 8158361, 7983727, 7775134, 7568173, 7372731, 7180994, 7001123, 6841763, 6711576, 6594531, 6466493, 6327631, 6226629, 6137489, 6048040, 5936475, 5835450, 5720435, 5606377, 5501567, 5391177, 5277839, 5167769, 5084070, 4983783, 4881272, 4789769, 4708297, 4648459, 4588520, 4512948, 4415549, 4332145, 4293508, 4230034, 4167389, 4094191, 4026673, 3973801, 3916567, 3863105, 3800289, 3747885, 3689925, 3637804, 3596112, 3564189, 3519408, 3478487, 3463156, 3439249, 3423784, 3405604]
13788C405604o919J3958J1892J3807l0934o4118o8804o5368n8484q7286q8577
13777B974771q8759p4641o5013o0835n7029n8228n3264n9120m9416l5721m5060
13766B327685n1081l2355m2777m3125l1181j8638k8475k5973j9191k3630r432
13755B001827k7145k8454j9779l2737l6411l5004k8766l0297k7507j9130p950
13744A708647n547j6082l9254m8204l8862k1879j4655k2164j2718k1587j3775
13733A453920k5487j2590o956j648L864L20L634r787j0108j1109m417j9725p946
13720A351965j962j1035n54K4988Q897m679j4116j0995j568n161k9754j4298j5353
13707A276375k4713m3782m6466l3567l4696j0918n464k5251p671j5755j9058j9162
$$ y = [3405604, 3398685, 3412643, 3424535, 3438342, 3407408, 3343290, 3274486, 3209118, 3150634, 3063348, 2974771, 2886012, 2811371, 2746358, 2685523, 2628494, 2570266, 2517002, 2457882, 2408466, 2372745, 2327685, 2276604, 2244249, 2201472, 2158347, 2127166, 2108528, 2080053, 2054080, 2034889, 2011259, 2001827, 1974682, 1946228, 1926449, 1893712, 1857301, 1822297, 1793531, 1763234, 1735727, 1716597, 1708647, 1703100, 1687018, 1647764, 1599560, 1560698, 1538819, 1524164, 1502000, 1489282, 1467695, 1453920, 1428433, 1415843, 1408887, 1407239, 1411103, 1411423, 1415057, 1405270, 1395162, 1384053, 1379636, 1359911, 1351965, 1350003, 1338968, 1338414, 1363402, 1372299, 1367620, 1353504, 1342509, 1340941, 1335780, 1306026, 1291728, 1276375, 1251662, 1207880, 1161414, 1127847, 1093151, 1082233, 1076769, 1051518, 1043847, 1028092, 1009034, 989872]
13695I89872j5932k3380k2535j7950k4498k8168j4883j1298j7027k7484j6784
13684G69933k3888l6701k6003r193j3366k0725k2875r830o213k0182J3822P375
13672F02154J020R187k361m827J559k0845k0901q205j4378o151n061J109j7566
13659E14734m368o125J4763J6517K566j4189n930M779L144j689N162k013j375
13646E25976n578n408o035j5738k5300j2916J0694N404m248r634j7016j3572n508
13633D21121j3084l273K1177l121j4121j5372J0970o386p998k5526J1581o949
13621C69019j1797l6L341M891j2429o891N776j0163j155j4078O303j102j4373
13608C17306k572n333m744J0380l485j1584n891j7218j5742L162k1953m030M537
$$ y = [989872, 973940, 950560, 928025, 910075, 885577, 857409, 842526, 831228, 814201, 786717, 769933, 746045, 709344, 683341, 674148, 660782, 640057, 617182, 607352, 601139, 580957, 594779, 602154, 603174, 612361, 610000, 605173, 606732, 585887, 564986, 556781, 542403, 536252, 531191, 532300, 514734, 510366, 504241, 519004, 535521, 538087, 523898, 517968, 522747, 525891, 524202, 529364, 527351, 525976, 520398, 514990, 508955, 493217, 467917, 455001, 465695, 471099, 466851, 457217, 440201, 426629, 421121, 408037, 404764, 425941, 422820, 408699, 393327, 404297, 397911, 389913, 364387, 375968, 369019, 357222, 357186, 360527, 365418, 352989, 346098, 351874, 341711, 340556, 326478, 332781, 331679, 317306, 314734, 309401, 304657, 315037, 311552, 299968, 294077, 276859, 261117, 264279, 242326, 238296, 242833]
13595B42833J3724K2782L225J0118P280j5253L645o455j2477R914O092J508j1411
13582B75525q132k45P003M935n445k195j8232j1723k907j3518k447o464k1368
13569A94787K585J0523l273j798K116Q67N220J0320p642J3227O840m190M519O395
13555B40496J4506j8201J135L3272R643K0755K3640J1371p557j6060R93j94n671
13542C08128j1349j0109j5854j0126o453J2251Q502P058M1088R4574J02944J03666
13530F24320N3297K1393j7394n830L1921P3898J15302J55725K09419K38588K57276
13519A757915K34436K23347J68012J13576N7160j7018j13472j74952j90718k07929
13509A850357k18232k05198j86085j43242j14362q6240p1947n4906l8113m0187
$$ y = [242833, 256557, 279339, 282564, 292682, 299962, 284709, 288354, 281899, 269422, 279336, 285428, 286936, 275525, 267393, 267148, 274151, 279086, 273641, 271446, 253214, 241491, 238584, 225066, 222619, 216155, 194787, 197372, 207895, 204622, 202824, 204940, 205807, 211027, 221347, 213705, 226932, 233772, 229582, 234101, 240496, 255002, 236801, 237936, 271208, 280851, 301606, 325246, 336617, 329060, 313000, 313993, 313799, 308128, 296779, 286670, 270816, 260690, 254237, 266488, 274990, 282048, 323136, 417710, 520654, 624320, 677617, 699010, 681616, 675786, 707707, 781605, 896907, 1052632, 1262051, 1500639, 1757915, 1992351, 2215698, 2383710, 2497286, 2554446, 2537428, 2423956, 2249004, 2058286, 1850357, 1632125, 1426927, 1240842, 1097600, 983238, 896998, 825051, 770145, 732032, 691845]
13499F91845m0394l2191k6120P602j3785k2164j113J7594K2734L9652J02056J69307
13487I15023K21869J96829N7708j53088k51100j97145j32103r0814m7399k8498
13477D91282j6321k7351l0645q974J119j1913j1023N66j0722j4499j5565j7293
13465C28661k1822r392K415p63L819O60j7405j4313j1897l797P978J5034M825
13452B84003j5089o289k791L3545L7328M2762L3053P3722J29659K04045K38464
13441A052412J87985J2873k21457k46844j65761j10011p8827o1390l0795j4412
13431C23773j9658k1660j7605q978O485k1242j1513J2936J8052j3399k8565k2647
13419A95979O694J8306O926m649K295L635j210O12J7977J2437n175k2953j4358
$$ y = [691845, 651451, 619260, 593140, 600742, 586957, 564793, 563680, 581274, 604008, 643660, 745716, 915023, 1136892, 1333721, 1391429, 1238341, 987241, 790096, 657993, 567179, 519780, 491282, 474961, 447610, 416965, 407991, 409110, 397197, 386174, 386740, 376018, 361519, 345954, 328661, 306839, 297447, 299862, 299099, 302918, 303578, 286173, 271860, 259963, 256166, 264144, 279178, 284003, 268914, 262625, 259834, 293379, 330707, 373469, 406522, 480244, 609903, 813948, 1052412, 1240397, 1253270, 1031813, 784969, 619208, 509197, 430370, 368980, 338185, 323773, 304115, 282455, 264850, 255872, 262357, 241115, 229602, 242538, 260590, 247191, 218626, 195979, 202673, 220979, 227905, 223256, 225551, 229186, 227976, 228588, 246565, 259002, 253827, 230874, 216516]
13406B16516j2310p877J3802J1069j684J0200K5706P7783Q9527N6223J6844m5814
13394D49985p5129n2500o3014k7949j4422j5938j1395p535M65j7945j3113o390
13382A45120n215k92N069m246J319j3444q394O376r698K572O596j471O12P641
13368A32545J3698R881n296l295J4258N933j5346k1239j1966O776O88k1856k6678
13355G8103l884m144O224K457M356m584n537j0237K955l944j4598M593K6306p65
13341G7301j798P393Q073J6580n501j2233n327l278m194k39q150J9013M85j4794
13327G3331j1048n602n620J078J3763K6545R834q696J716M692j1696K31o449j3238
13313F8841o499j0024n34N779J230P092o630k20N713q789j2860P610O586K224
$$ y = [216516, 204206, 196329, 210131, 221200, 219516, 229716, 255422, 333205, 422732, 478955, 495799, 449985, 374856, 322356, 259342, 231393, 216971, 201033, 189638, 182103, 182568, 164623, 151510, 145120, 139905, 139613, 144682, 140436, 141755, 128311, 119917, 126293, 116595, 119167, 125763, 124292, 124904, 132545, 146243, 156124, 150828, 147533, 161791, 167724, 152378, 131139, 119173, 125949, 126637, 104781, 78103, 74219, 70075, 76299, 78756, 83112, 78528, 72991, 62754, 65709, 61765, 47167, 51760, 78066, 77301, 75503, 82896, 90969, 107549, 102048, 89815, 84488, 81210, 77016, 76777, 68627, 87640, 88125, 73331, 62283, 56681, 51061, 52139, 65902, 92447, 102281, 93585, 95301, 99993, 88297, 88528, 82079, 68841, 62342, 52318, 51784, 57563, 58793, 65885, 59255, 59035, 64748, 55959, 43099, 50709, 57295, 59519]
13299E9519k775k589q722j0036J789l728j692P933Q704n600J637J3317J2991L691
13285G4439q839j6975O66O754L371J607r573r065K529k190k841J0083J3887J1955
13271G5808J445j7077p122J543q035r590p035n800j4343k867J2234Q691l369j3728
13257A0755j489J1343l852M287O017J532j7440R667l28r596P36J3260l477j5703
13243E712n40K2317J4814J5549N545k1791j0702o328m70l059O296L691r518j1200
13229A0316j586K181j3621J555P522m669M325O342K802r088K302K316P715j690
13215A6722r098n736J0134Q034p144J69n170L225O879l882L44m528O052j29O78
13200A6550j3716j0699Q544J201J4477J401Q512J8257Q373l37r047j7839j5631
$$ y = [59519, 56744, 54155, 45433, 35397, 37186, 33458, 31766, 39699, 48403, 42803, 44440, 57757, 70748, 74439, 65600, 48625, 49291, 56045, 59416, 61023, 51450, 42385, 44914, 42724, 39883, 49966, 63853, 75808, 77253, 60176, 53054, 54597, 46562, 36972, 29937, 24137, 9794, 6927, 19161, 27852, 24483, 10755, 9266, 20609, 16757, 21044, 27061, 28593, 11153, 20820, 20492, 10896, 11632, 24892, 21415, 5712, 5172, 27489, 42303, 57852, 63397, 41606, 30904, 24576, 24106, 21047, 27343, 31034, 21516, 10316, 8730, 10911, -2710, -1155, 6367, 1698, 6023, 12365, 15167, 6079, 8381, 10697, 18412, 16722, 7624, 1888, 12022, 20056, 12912, 13081, 7911, 11136, 18015, 14133, 14477, 9949, 16001, 15872, 16550, 2834, -7865, 679, 1880, 16357, 17758, 26270, 44527, 52900, 52563, 43516, 25677, 10046]
13187A0046k2491l155J0073k920j403J8702P614j5202p925L86o53o59J4726L58
13173G497O526R875N510Q057J1244K414j6897q013K839j142K463l920j8179L682
13159A1956K6240J0597j385q946j0265j496r6j0052j0502Q66J1383N735J223j1570
13145A3688j6150q036J4332m893q559N940O145M964K260Q681p656M614Q448J2853
13131C6631n606l071O884j479j52j2241r496M981J453J1379J756M096k0530j9630
13117e025q87J3343J4857r128r189J2662J8396p674K98P494o499m405K014p112
13103A9145Q614k831j8810j3098J106J3465O779p551o434R573R970J1563N807
13090C7298n537l081o714l538P258P616j2833k274M994r309j527P119J148K352
$$ y = [10046, -12445, -15600, -5527, -8447, -9850, 8852, 16466, 1264, -6661, -6275, -6928, -7587, 7139, 7497, 14023, 23898, 29408, 37465, 48709, 51123, 34226, 26213, 29052, 27910, 30373, 26453, 8274, 11956, 38196, 48793, 47408, 38462, 28197, 26701, 26605, 16553, 6051, 6917, 18300, 24035, 25258, 13688, -2462, -10498, 3834, -1059, -9618, -3678, 2467, 7431, 9691, 18372, 10716, 15330, 23778, 36631, 31025, 27954, 34838, 33359, 33207, 20966, 11470, 16451, 17904, 29283, 31039, 35135, 14605, -5025, -5912, 7431, 22288, 13160, 3971, 16633, 35029, 27355, 27653, 35147, 28648, 24243, 26257, 19145, 27759, 24928, 6118, -6980, -5874, 7591, 14370, 6819, 385, 9958, 19928, 31491, 37298, 31761, 28680, 21966, 18428, 25686, 33302, 20469, 18195, 23189, 13880, 12353, 19472, 20620, 22972]
13076B2972M020k368j480m2J8169J6309l606j3204j570K546J7061L1405M3897
13063A34109M3402m238k4847k3886k2358j9455p801k0166q082o447j451k0155
13051A8625k773J1157J691R299k310j8416k826q239K3494O890o067l676k356j2342
13037A2151K722K616P465J6162M476j2065n352p514K406M927j0484l274J0491
13024B4727Q501L001j8772p375j89R054K691O315K1832q38j1447j9276m742N013
13010A8495K042O674q533m849m002L15k2488k455R550J3405J9131M115j1533n622
12996A4245m958j1681M643m721M836Q384N75K6033J5439j2389p807L285R752j9676
12982B5960j4015K289r070p140J0145J2414q360K388m821Q940J0097M540J656
$$ y = [22972, 26992, 24624, 23144, 23102, 41271, 57580, 53974, 40770, 39200, 41746, 58807, 90212, 134109, 177511, 173273, 148426, 124540, 102182, 82727, 74926, 54760, 46678, 40231, 38780, 18625, 15852, 27009, 28700, 37999, 35689, 17273, 14447, 6208, 29702, 36592, 30525, 26849, 24493, 12151, 14873, 17489, 24954, 41116, 45592, 33527, 28175, 20661, 23067, 27994, 17510, 14236, 24727, 33228, 36229, 17457, 10082, 9893, 18947, 21638, 27953, 49785, 48947, 37500, 18224, 13482, 18495, 20537, 27211, 18678, 13829, 9827, 10142, -12346, -14801, -5251, 8154, 27285, 31400, 19867, 14245, 9287, -2394, 2249, -2472, 2364, 10748, 11323, 37356, 52795, 40406, 32599, 35884, 45636, 25960, 11945, 14234, 5164, -1976, 8169, 20583, 12223, 14611, 9790, 18730, 28827, 33367, 35023]
12969C5023J1753O956k969J43p966P656r43j6345k7797k472n305j4021j922J1463
12955f746L458J2840N100Q957r883j6277Q016j3423p14P089J2103p109J4240J1792
12941B9443q088j8600o875J890J553O38K514J4151J144j0983J4490J6723O83n751
12927C2932j6562L928J2456j521j3599n807N171j8250J2878J5412K636k609o318
12914B0747M399j1597p249j903J9197Q149P63J0221k1089j3925p963J3493J2225
12901B5468Q782M231j2333n214m138J860O818k003k856M602M007j6744P90j675
12887A1595J666q613J17j012q267J466J4123n287p641j960L449M803J3149L352
12873B0940l226j0209J8335K250j395p423L539l215N31k556n230K0170P169J0163
$$ y = [35023, 46776, 53732, 50763, 50906, 42940, 50596, 49653, 33308, 5511, 3039, -2266, -16287, -18209, -6746, -3288, 9552, 14652, 23609, 13726, -2551, 5465, -7958, -8672, -1583, 10520, 3411, 17651, 29443, 21355, 2755, -4120, -2230, -677, -39, 2475, 16626, 17770, 6787, 21277, 38000, 38683, 32932, 16370, 20298, 32754, 31233, 17634, 11827, 16998, -1252, 11626, 27038, 29674, 27065, 20747, 25146, 13549, 6300, 4397, 23594, 31743, 32506, 42727, 21638, 7713, -250, 13243, 25468, 34250, 38481, 26148, 20934, 16796, 18656, 25474, 23471, 20615, 25217, 29224, 12480, 13270, 11595, 13261, 4648, 4765, 3753, -4514, -3048, 11075, 5788, -1853, -3813, -364, 4439, 17588, 20940, 17714, 7505, 25840, 28090, 26695, 19272, 22811, 19596, 20127, 17571, 12341, 32511, 39680, 49843]
12859D9843N556J912L868o215o970Q823j6335l947J1865l583n561q413m177j1613
12845A5053j3625J213J2149Q366K1379K4734p797j3842p522q009j3155l023Q682
12832B4603j356j37K3557J6j185j7088j787P094K292j951j0078N528J3476N796
12818D8780Q653o027j8311p487R344L023L382K064Q770J712j2358M364m071o453
12804C5385j4514l503J0115K738N600m27J4474O325m061p761q438Q462k872l9
12790D1484j708J0912J0965o956N332J84P939q194j7693P608k675N41j5690j1537
12776B0512o49k150K0134J1012n140k652k566Q266Q138j6098j5723j4837J065
12763I312J3714J7901j944j0999o998L535N323K828j364l431J5006m40j5778K0169
$$ y = [49843, 55399, 57311, 61179, 54964, 47994, 56817, 40482, 36535, 48400, 44817, 39256, 30843, 26666, 15053, 1428, 2641, 14790, 23156, 44535, 69269, 61472, 47630, 40108, 32099, 18944, 15921, 24603, 23247, 23110, 46667, 46683, 45498, 28410, 26623, 33717, 36009, 34058, 23980, 29508, 42984, 48780, 57433, 51406, 33095, 25608, 34952, 37975, 41357, 43421, 52191, 53903, 41545, 45909, 41838, 35385, 20871, 17368, 27483, 30221, 35821, 35394, 49868, 56193, 52132, 44371, 35933, 44395, 41523, 41484, 39776, 50688, 61653, 54697, 60029, 60213, 68152, 59958, 42265, 49873, 47198, 47739, 32049, 20512, 19863, 17713, 37847, 48859, 43719, 41067, 38501, 46767, 54905, 38807, 23084, 8247, 9312, 23026, 40927, 38983, 27984, 20986, 24521, 29844, 32672, 31308, 27877, 42883, 42443, 26665, 46834]
12749D6834J4521j3148k1241j280k455n163Q012k927J7384J6038j461j484j202
12736E2428k3903j5804J956N473J0235o904K638J2306P045j3387k8078o886J2215
12723I334J0544J4261m818q132M502n239O928J0071M275J330m075P135J2818q418
12709E0516m883o879k897R143q502j8484j2032R539O443n492N179N928J0516l556
12695C4539J0944o387j4536L457L405n8P144N927l484j7954k645j1012l803N048
12681A0585J4026K1781O24r697p364o864q545Q007J0015M387P687r054K661j2246
12667B6003n338J9505J6636p118J275O701P176P933O968j1310k866j5012j4378
12654C6175k411J3677Q552n195m296k230p417n083J3420J4650j138o259m748Q568
$$ y = [46834, 61355, 48207, 26966, 25686, 23231, 18068, 26080, 23153, 40537, 56575, 55114, 53630, 52428, 28525, 12721, 14677, 20150, 30385, 23481, 26119, 38425, 45470, 32083, 4005, -2881, 9334, 19878, 34139, 29321, 21189, 25691, 20452, 27380, 37451, 41726, 43056, 38981, 46116, 58934, 50516, 45633, 38754, 35857, 45000, 36498, 18014, 5982, 15521, 21964, 16472, 21651, 27579, 38095, 34539, 45483, 39096, 24560, 28017, 31422, 31364, 38508, 44435, 40951, 22997, 20352, 9340, 5537, 10585, 24611, 46392, 47016, 37319, 29955, 23091, 14546, 22553, 32568, 36955, 44642, 35588, 38249, 26003, 20665, 40170, 56806, 49688, 50963, 57664, 64840, 72773, 79741, 68431, 65565, 50553, 36175, 33764, 47441, 55993, 50798, 46502, 44272, 36855, 31772, 45192, 59842, 58704, 52445, 47697, 56265]
12640E6265m211P63L912j1190J20L661L698l002k7947k2064M881J5098J2159J2426
12626D4569m437J709J9373J4479n280l21M275j4367K204L736K460p027j5870J0685
12612E6188J1352j5731p584K062j652R662J1842j5064q675p19M852q01m34R503
12598E4801j08J3725L100J7299K5978L5180L0111J0768O170k3812k8864l082j4501
12585A26765j7362n85M115j2097j1076l706R099P652N30l030m455o340K801m0
12571I2271o774o060k330M624J0693O757k677J676L8314J2545J4187L2058K6429
12558B21713L0100M6963R828M674j117j3170k4487k0841k0030l2390l4212k9265
12546A37766P725N028j124k2523Q37K0470J0576J734Q4Q706q415m888Q520O726
$$ y = [56265, 52054, 52817, 56729, 45539, 45659, 49320, 53018, 50016, 22069, 5, 4886, 19984, 32143, 44569, 40132, 41841, 61214, 75693, 70413, 70092, 74367, 60000, 62204, 65940, 68400, 61373, 45503, 56188, 67540, 51809, 44225, 46287, 44635, 54297, 66139, 51075, 42400, 41681, 46533, 45732, 45298, 54801, 54693, 68418, 71518, 88817, 114795, 149975, 180086, 190854, 197024, 173212, 144348, 141266, 126765, 109403, 108818, 112933, 100836, 89760, 86054, 95153, 102805, 103335, 100305, 95850, 89510, 92311, 92271, 85497, 79437, 77107, 81731, 92424, 99181, 96504, 98180, 136494, 149039, 163226, 195284, 221713, 251813, 298776, 308604, 313278, 312161, 298991, 274504, 253663, 233633, 201243, 167031, 137766, 145491, 150519, 149395, 126872, 127709, 148179, 158755, 160489, 160573, 169279, 160864, 155976, 164496, 171222]
12532A71222n940j3692O33K83o725o423J2668q87J314Q149J0343K6201K9866K4586
12518B51598J4143m735j3089k5241j8458j5668l2130j6910J5721J0161j4182j1082
12506A40128J6287R27k905m170j1609j3220J0346k156J3497J9422J967J5457M755
12493A88726P793p007j2857O681p767k3688n149L244K4053L0026K7602J2491J1243
12480B55391j546j6008J3366L1052J9889J0765j4831r841m419k4040R163L3248
12468C02189P1580P5863N6659K7380Q504l2004L69P1277R5535J62331K77938L62660
12456A480281L17701J33385k11285k04250n9290M5381L2147p6889j52367j29938
12446A174876r3408m3923m3K3785R5739J36938J09444O199o6797n4465K1954M8919
$$ y = [171222, 165282, 151590, 152223, 152506, 145781, 139358, 152026, 151139, 152453, 160602, 170945, 197146, 227012, 251598, 265741, 261006, 247917, 222676, 204218, 188550, 156420, 139510, 155231, 165392, 151210, 140128, 156415, 157342, 154437, 150267, 138658, 125438, 135784, 133628, 147125, 166547, 168514, 183971, 188726, 196519, 189512, 176655, 183336, 175569, 151881, 146732, 149976, 174029, 204055, 231657, 244148, 255391, 253845, 237837, 251203, 282255, 302144, 312909, 298078, 288237, 283818, 259778, 268941, 302189, 373769, 449632, 506291, 533671, 542175, 510171, 510540, 581817, 677352, 839683, 1117621, 1480281, 1797982, 1931367, 1720082, 1515832, 1456542, 1501923, 1534070, 1457181, 1304814, 1174876, 1081468, 1037545, 1037502, 1061287, 1157026, 1293964, 1403408, 1409607, 1342810, 1288345, 1310299, 1359218]
12434A359218N3434K5633Q6751J61103J61887R5282k3983q7449n4586K328R3011
12423A872629J54997K24323K57812K58769K81097K32669K22729L49911O37604
12414D492540O68487L00349m30430q12137n98370l19501j68207j45514j75216
12405B812001j59186j57064j38929j02420M772R4259J22492M7897n7937j75675
12395B290210j78171j05293l7461l2066m2981j0591L9325N8948L4091n2846j18963
12384A844202j15068m5750K8426J02144J83263K56976L40970M28774M89868M99629
12374D013434L72436J71656r5277l03273n28299o74844n02947l43262k18187j13046
12364A778391o4996k2271j6613k6135m7178n3859q3215j00820p9929n5121n1761
$$ y = [1359218, 1412652, 1438285, 1525036, 1686139, 1848026, 1943308, 1919325, 1831876, 1777290, 1779618, 1872629, 2027626, 2251949, 2509761, 2768530, 3049627, 3282296, 3505025, 3854936, 4492540, 5161027, 5461376, 5030946, 4218809, 3620439, 3300938, 3132731, 2987217, 2812001, 2652815, 2495751, 2356822, 2254402, 2259174, 2353433, 2475925, 2523822, 2465885, 2290210, 2112039, 2006746, 1969285, 1937219, 1894238, 1883647, 1922972, 1981920, 2016011, 1963165, 1844202, 1729134, 1683384, 1711810, 1813954, 1997217, 2254193, 2595163, 3023937, 3513805, 4013434, 4385870, 4557526, 4462249, 4158976, 3630677, 2955833, 2452886, 2109624, 1891437, 1778391, 1713395, 1691124, 1674511, 1648376, 1601198, 1547339, 1464124, 1363304, 1283375, 1228254, 1176493]
12353A176493j6338j0778k2786m0108l5455j3358j6562K939j3330l0514l2054
12342I48149l826L79J1600K0018L8769M3352O8401J20722J75275K62896M00678
12331B086413M82228M13843J57578k12808m57582m28018k90583j51015n6382j2315
12321A531359j5642l7023n6135o4828p4949q5671o6756l6640k9882k3741l016
12310A037076J2001o182j8304J995K834p030o850N468J2306Q047M355j761O321
12297A050276J9490J069J5450J1219J0697K2958N2544P4037J40102J92746K62265
12286A852853L33950K81083R6148q3509j88085k27000k18659j93408j45330j27552
12276A380491q9683k7205l5576m1830k4737j5471J2153p365l1618l3871k5130
$$ y = [1176493, 1160155, 1149377, 1126591, 1086483, 1051028, 1037670, 1021108, 1024047, 1010717, 980203, 948149, 944323, 944702, 956302, 976320, 1015089, 1058441, 1126842, 1247564, 1422839, 1685735, 2086413, 2568641, 2982484, 3140062, 2927254, 2469672, 2041654, 1751071, 1600056, 1543674, 1531359, 1515717, 1478694, 1422559, 1357731, 1282782, 1197111, 1130355, 1093715, 1063833, 1040092, 1037076, 1049077, 1042895, 1024591, 1026586, 1029420, 1022390, 1015540, 1021008, 1033314, 1041361, 1045716, 1043955, 1050276, 1069766, 1070835, 1086285, 1097504, 1108201, 1131159, 1183703, 1257740, 1397842, 1590588, 1852853, 2186803, 2467886, 2564034, 2480525, 2292440, 2065440, 1846781, 1653373, 1508043, 1380491, 1290808, 1263603, 1228027, 1186197, 1161460, 1145989, 1158142, 1150777, 1119159, 1085288, 1060158]
12265A060158j6512k4130j6670j7518m146j4377k0773k5069j6100k9048j7222
12254H58593j1721O75J1048J6467L1250N1291M0697M6914J4632k6357p2416o8195
12242H92878o9270n9222l6644l7656k4485j1944k0981k2452l2276j1466p015j0741
12230E48726J1383j568J2083O198N806j4401O704R91P46j1174o777j6716k2457
12217E19544k6532k4663k212j1839J454k5176k3993N1p734L761R145k0145j3768
12204C77893N770R899L604Q60j3100p827k4732O368n216r261O673o026k4877P40
12190C20768J1225M731O776k31m481K5625J4055j6855n984j4031j6157K319M263
12177C32023k157r627r421p106j1623l073o939O374j2751K761o955q972Q36Q385
$$ y = [1060158, 1043646, 1019516, 1002846, 985328, 981182, 966805, 946032, 920963, 904863, 875815, 858593, 846872, 847547, 858595, 875062, 906312, 957603, 998300, 1045214, 1059846, 1033489, 961073, 892878, 823608, 764386, 727742, 690086, 665601, 653657, 632676, 610224, 577948, 566482, 559467, 548726, 560109, 558541, 570624, 576822, 582628, 568227, 574931, 575922, 576668, 565494, 558717, 542001, 519544, 493012, 468349, 466137, 454298, 455752, 430576, 406583, 406634, 398900, 402661, 411806, 391661, 377893, 383663, 393562, 397166, 398026, 384926, 377099, 352367, 358735, 353519, 344258, 350931, 344905, 320028, 320768, 331993, 336724, 343500, 343269, 338788, 364413, 378468, 361613, 355629, 341598, 325441, 327760, 332023, 329866, 320239, 310818, 303712, 292089, 289016, 282077, 288451, 275700, 278461, 271506, 262534, 263370, 271755]
12163B71755P577r962n48l219l7009r593K1317J3351J915o993j690r30J670j101
12149B46540q442n308k294j7913o62N484L721q605k84R788K527j5601j613J0899
12135B18237K4010L333k2653j5460p272j5512q503O175J9537J2089L219j3306
12123B03894J521N368o20j2660j2832O419M32L106O175O170K0744J2494p59j0858
12109B28594j8352q268M713P108L513J2837P224n496j1047J0495K272m407j6823
12096B12363j7804l016J1362l790r860J4606R230o210K043P605j1027r511L436
12083A99427J3057J4083L928k5523p359J76o504m581P763J2800P346j703r633
12070B03277q424p227K706m27j887l726J6962J0399o015M580J0239J0862m342
$$ y = [271755, 279332, 269370, 268822, 265603, 228594, 219001, 240318, 253669, 255584, 248591, 246901, 245971, 247641, 246540, 238098, 232790, 230496, 212583, 211921, 217405, 221126, 212521, 212237, 222025, 224552, 208951, 207338, 218237, 242247, 245580, 222927, 207467, 200195, 184683, 176180, 182355, 201892, 213981, 217200, 203894, 205415, 210783, 210163, 197503, 184671, 191090, 191522, 194628, 200803, 206973, 227717, 240211, 239452, 228594, 210242, 201974, 206687, 213795, 217308, 230145, 237369, 231873, 220826, 231321, 233593, 229186, 212363, 194559, 191543, 202905, 199115, 189255, 203861, 213091, 206881, 208924, 216529, 205502, 195991, 199427, 212484, 226567, 230495, 204972, 197613, 197789, 191285, 186704, 194467, 207267, 214613, 212910, 203277, 194853, 187626, 190332, 189905, 188018, 184292, 201254, 211653, 205638, 210218, 220457, 231319, 226977]
12057B26977l02Q595p091q848p07p567l406O636R310O064R39k446M588Q316R800
12042B50858j0682L893N637m051j63J0920j62l889K87L49J340J1765j3037k436
12028B50629p446p836n999q980m670L4385J4458k7J0813p877m370R699J2269P599
12014B92647M973q777j1518J633o474j0135j4431q744L61P537k196J3583L2953
12001B91412M574r94O620K473o422l525k2540k3975J0869K256j044K0030N411
11988B85145K1013J2483K883K387k69L625M153k744L097j7151j0012Q741q913
11975C04438j5114L719L467J7510J5028L62Q504J247m081l394k278j991m588J8522
11961C41351J1994j1521k598p46n61l782q036k841O931J0108M159J2912J1417
$$ y = [226977, 226675, 235270, 228179, 219331, 218624, 211057, 207651, 214287, 223597, 229661, 230600, 228154, 232742, 241058, 250858, 240176, 244069, 249706, 245655, 245492, 256412, 256250, 252361, 252648, 252997, 254337, 266102, 253065, 250629, 243183, 235347, 229348, 220368, 215698, 250083, 264541, 264514, 275327, 267450, 263080, 272779, 285048, 292647, 297620, 288843, 277325, 278958, 272484, 262349, 247918, 239174, 239535, 247072, 244876, 258459, 291412, 295986, 294992, 301612, 304085, 297663, 294138, 271598, 247623, 258492, 260748, 259704, 279734, 285145, 306158, 318641, 321524, 323911, 323642, 327267, 331420, 328676, 331773, 314622, 304610, 313351, 304438, 289324, 293043, 296510, 314020, 329048, 329410, 337914, 339161, 335080, 331686, 329408, 327417, 322829, 341351, 353345, 341824, 339226, 338480, 337919, 334137, 326101, 323260, 330191, 340299, 344458, 357370, 368787]
11948C68787K554k0888q323j2029k1681j1461J1062K1785l944J6211J831K152
11936C46056J0954J5400o396j0009q345K314J5447J1919K563M804J1039J5854
11924D11600j906o190n974j4196K127J6728R201j2321j5506O487L423l751J8567
11911D08289L9208L1943O866L3976N5384P5120R8519Q5787J00909J07109R7221
11900A140331P7987L8073K0514r174n3104p7274j06526j21430q3585o5790n5973
11889G04049n0746m2024k3389k0139j1398k3621o764p846j4152o910N702r913
11877D92849j3622j9679j1778L419j2012o574M04O248j93n928p673r792K836K95
11863D18800l188j0926j5070o658p005J0598l846R672P477j2685j1673J1316K183
$$ y = [368787, 371341, 350453, 342130, 330101, 308420, 296959, 308021, 329806, 325862, 342073, 343904, 346056, 357010, 372410, 366014, 356005, 347660, 349974, 365421, 377340, 379903, 384707, 395746, 411600, 409694, 403504, 397530, 383334, 385461, 402189, 411390, 399069, 383563, 390050, 393473, 389722, 408289, 447497, 479440, 486306, 520282, 575666, 650786, 749305, 835092, 936001, 1043110, 1140331, 1218318, 1256391, 1276905, 1267731, 1214627, 1137353, 1030827, 909397, 825812, 760022, 704049, 653303, 611279, 587890, 567751, 556353, 532732, 525968, 518122, 503970, 497060, 502762, 492849, 479227, 459548, 447770, 451189, 439177, 432603, 433007, 439255, 439062, 433134, 425461, 415669, 418505, 418800, 415612, 404686, 389616, 382958, 375953, 386551, 382705, 392377, 399854, 387169, 375496, 386812, 388995]
11850C88995r524j2494L25M45p24J7291p6j2809J2820K2590k703j196Q91j243
11836D02588k120j5534N447M989O581J0084P50q49o361j5195o933j3058J229J129
11822C72747p857Q41J2254J3882L097K4331J48o746p270R312J447J2660J6157
11809D45003N198K708J4776O336R742J4987J6811L2988M2945L0200L1073J0310
11797F63077K4116N4345O7133Q3391R4098P5202O6419O2273M1064L6075L1397
11786A298590j778k9793j9076l6836l9100k6615m7716j5976L53O848j3091j0204
11774A065606R047J9029K4618K7530N0082M8582L2880M2989O2940N3580M6437
11763A483320L9333N0068M4174M7368L4671K4736K1471Q965j933j3423j2422l8799
$$ y = [388995, 379471, 366977, 367302, 367747, 367023, 384314, 384238, 371429, 384249, 406839, 404136, 402940, 403831, 402588, 400468, 384934, 390381, 395370, 401951, 412035, 412785, 411936, 405575, 390380, 383447, 370389, 371618, 372747, 364890, 365731, 377985, 391867, 394964, 419295, 419443, 412697, 405427, 414739, 416186, 428846, 445003, 450201, 452909, 467685, 474021, 483763, 498750, 515561, 548549, 591494, 621694, 652767, 663077, 687193, 741538, 808671, 892062, 986160, 1061362, 1127781, 1190054, 1231118, 1267193, 1298590, 1296812, 1267019, 1247943, 1211107, 1172007, 1145392, 1097676, 1081700, 1082053, 1088901, 1075810, 1065606, 1074653, 1093682, 1118300, 1145830, 1195912, 1244494, 1277374, 1320363, 1383303, 1436883, 1483320, 1522653, 1572721, 1616895, 1664263, 1698934, 1723670, 1745141, 1754106, 1752173, 1738750, 1726328, 1687529]
11751A687529m7431l9268m4351m0767l8051m3085r722j8050m6905n2535j4526
11740A292838q534k1625k4463J37j4597k3892o911j23J6461K7916J0751K820L5527
11727A286305P0652P9837Q7337Q2249N2942L1374j402m323l4271o0239p8086j06259
11715A406116r2989r3950p8554n7356o0832n0786m0650m6346m2443l7954j8490
11704G85766r999l4765j7020r123J249j242k4323j0511j6640k2166p249j4098
11692F19879k066k3504k3567r598R367J2031m06n717n675j7104j9403J335N45
11679E36117J5528N803R9n40l186k5713J332O620R854r110J3734n060k2900j5403
11665E07175M697P847j4333N457M833R264J6662n932o618l230L077J1720p74j719
$$ y = [1687529, 1640098, 1600830, 1556479, 1515712, 1477661, 1434576, 1424854, 1406804, 1359899, 1307364, 1292838, 1284304, 1262679, 1238216, 1238353, 1223756, 1199864, 1192953, 1192830, 1209291, 1237207, 1247958, 1250778, 1286305, 1356957, 1436794, 1524131, 1606380, 1659322, 1690696, 1689294, 1684971, 1650700, 1590461, 1512375, 1406116, 1313127, 1219177, 1140623, 1083267, 1022435, 971649, 930999, 884653, 842210, 804256, 785766, 775767, 741002, 723982, 714859, 716108, 714866, 690543, 680032, 663392, 641226, 633977, 619879, 617813, 594309, 570742, 561144, 570511, 582542, 582136, 576419, 570744, 553640, 534237, 535572, 536117, 551645, 557448, 557547, 557007, 553821, 528108, 529440, 536060, 545914, 536804, 550538, 545478, 522578, 507175, 511872, 519719, 505386, 510843, 515676, 524940, 541602, 535670, 529052, 525822, 528899, 540619, 539845, 538126]
11651E38126n077r457O77M205o219J276N850P345q164p249j624K710L575m453
11637E21521J811p337J6968l130j1507q953J7016J2183P542J35Q254J0382J0485
11624E75370K1299J2199j2186qQ035J0804J8853o91K86Q008J2943J4300J6673
11611F85885J8169M279j1444J712l181M205J5232J940j1556j3586l165J5062K0493
11598G24045m340n9R656J187J1989J9785M238K5818J7712J1209q36j790m651J0864
11584H24827J8184J6535Q828N690J0299m119j4016j8048J2264o98k2137l956P101
11571H40754j927j556m470j912r58m91j1700L773k663j887L291j9747j2568P255
11557G95194J288p260j5853q960j4230Q934K401J5794J4401Q395J3974J4641K699
$$ y = [538126, 533049, 523592, 524269, 528474, 522255, 523531, 529381, 536726, 528562, 521313, 519689, 522399, 525974, 521521, 523332, 515995, 532963, 529833, 518326, 509373, 526389, 538572, 546114, 546249, 554503, 564885, 575370, 596669, 608868, 596682, 596674, 604709, 615513, 634366, 633675, 633961, 641969, 654912, 669212, 685885, 704054, 708333, 696889, 698601, 695420, 699625, 714857, 716797, 705241, 691655, 688490, 703552, 724045, 719705, 719646, 729302, 730489, 742478, 762263, 766501, 792319, 810031, 821240, 820404, 818614, 813963, 824827, 843011, 859546, 868374, 874064, 884363, 880244, 866228, 848180, 860444, 859746, 837609, 833653, 840754, 838827, 837271, 832801, 830889, 829931, 829440, 817740, 821513, 818850, 816963, 820254, 800507, 787939, 795194, 796482, 789222, 773369, 764409, 750179, 759113, 761514, 777308, 791709, 800104, 814078, 828719, 831418]
11544H31418l149L335J1946J3473N288J2601n200k2264p040n379l3376m705K669
11531G99617p4j0604k3569j6294j4254k3841j4616J0740R803p078j7358j210l922
11518F87340j321J5470K0778K6958P948M839K2968K3636J4288J6039J2737L1903
11506H83583J5793K8701M6230M7547N3727N1540M8934M8748N9304N1821N7247
11495A393175N5419O6225P7956R4145O6216O0152N2988M7919L3295L0500K255
11484A980245q467N051K9057K4509K567J4839J480J2225L2551K4172L2866L1872
11472B182967K8199N6228P2417N2617O0293N0387M7734O9432P6212P1663O4152
11461B832301O4918O6505P3460O7765N0366N1178L9415L1834L7040L8295q73q902
$$ y = [831418, 828269, 831604, 843550, 857023, 862311, 874912, 869712, 847448, 840408, 835029, 801653, 796948, 799617, 799543, 788939, 765370, 749076, 734822, 710981, 696365, 707105, 716908, 709830, 692472, 691262, 687340, 686019, 701489, 722267, 749225, 757173, 762012, 784980, 808616, 822904, 838943, 851680, 883583, 899376, 928077, 974307, 1021854, 1075581, 1127121, 1176055, 1224803, 1284107, 1335928, 1393175, 1448594, 1514819, 1592775, 1686920, 1753136, 1813288, 1866276, 1914195, 1947490, 1977990, 1980245, 1971778, 1976829, 2005886, 2030395, 2032962, 2047801, 2049281, 2061506, 2094057, 2118229, 2151095, 2182967, 2211166, 2267394, 2339811, 2392428, 2452721, 2503108, 2550842, 2620274, 2696486, 2768149, 2832301, 2897219, 2963724, 3037184, 3104949, 3155315, 3206493, 3245908, 3277742, 3314782, 3353077, 3352204, 3343302]
11449C343302J2544J8361j2960J2497J9369p893j9140n110K1648J5987K1601K0630
11437C440836K9568K8620J6796L6605N0759O5523L6685N0553O5074R4368J13536
11426D028923J20904J05498J03271J00028Q6819J00355Q0292M2601L7527K2709
11416D828927K3645K6789K1585K3473L6623L9924M7160P8212Q5300R7360J22575
11405E431573J52868J52727J76255J82063J85009K06123K36059K32937K39241
11396G194855K50417K83133L05307L24076L70386M30832M87005N52667N98118
11387A0796796O84669P88100R07529J077949J254897J459122J718434J994068
11379B0681564K310797K635959L018029L485704M064787M744210N576661O537759
$$ y = [3343302, 3355846, 3374207, 3361247, 3373744, 3393113, 3385220, 3366080, 3360970, 3382618, 3398605, 3420206, 3440836, 3470404, 3499024, 3515820, 3552425, 3603184, 3668707, 3705392, 3755945, 3821019, 3915387, 4028923, 4149827, 4255325, 4358596, 4458624, 4545443, 4645798, 4726090, 4768691, 4806218, 4828927, 4852572, 4879361, 4900946, 4924419, 4961042, 5000966, 5048126, 5126338, 5211638, 5308998, 5431573, 5584441, 5737168, 5913423, 6095486, 6280495, 6486618, 6722677, 6955614, 7194855, 7445272, 7728405, 8033712, 8357788, 8728174, 9159006, 9646011, 10198678, 10796796, 11481465, 12269565, 13177094, 14255043, 15509940, 16969062, 18687496, 20681564, 22992361, 25628320, 28646349, 32132053, 36196840, 40941050, 46517711, 53055470]
11371E3055470P710752R206566J1103740J3462259J6128658J8600195J9966357
11364A49233997J9148750J5707243J0218332M174351j049781m823482p163550
11357A85445860q336481q661138q373848p671317o587421n144147l502243j827334
11349A35341931k32585J186991K419443L537058M618239N753893P061116Q538688
11341A68224774R974879J1060337J1593516J1521070J0970941J0193657R368773
11334B42907947Q712540Q232436P648261O561427M620091J840434j327812m223993
11326B74971331o252400p195223p245029o777217o207410n938481o132932o671233
11318B22551406p200619p403756p244168o893649o586223o306056n914939n334915
$$ y = [53055470, 60766222, 69972788, 81076528, 94538787, 110667445, 129267640, 149233997, 168382747, 184089990, 194308322, 198482673, 197432892, 192609410, 185445860, 177109379, 168448241, 160074393, 152403076, 145815655, 140671508, 137169265, 135341931, 135109346, 136296337, 138715780, 142252838, 146871077, 152624970, 159686086, 168224774, 178199653, 189259990, 200853506, 212374576, 223345517, 233539174, 242907947, 251620487, 259852923, 267501184, 274062611, 278682702, 280523136, 279195324, 274971331, 268718931, 261523708, 254278679, 247501462, 241294052, 235355571, 229222639, 222551406, 215350787, 207947031, 200702863, 193809214, 187222991, 180916935, 175001996, 169667081]
11310A69667081m632221l909835l178030k340773j208597L08801K256285M587673
11302A61550384P347826J0527474J3895059J7073973J9544334K0753044J9993676
11295B70685770J6334903Q901151j886884j3467303k2239712k6095163k5600064
11288B06632698k2659808j8977908j5554032j2750383j0528063q820222p520161
11281A09822121o501910n659122m983630m476138m072755l736697l503308l287489
11273G3601072l046080k836012k624184k428409k240499k063633j905007j775393
11265E4681855j658822j576371j462744j398329j339086j244204j187096j153829
11257D3661374j088333j030094r69954r37338r17341q74491q41148p99034p67812
$$ y = [169667081, 165034860, 161125025, 157946995, 155606222, 154397625, 154706426, 156962711, 161550384, 168898210, 179425684, 193320743, 210394716, 229939050, 250692094, 270685770, 287020673, 295921824, 294034940, 280567637, 258327925, 232232762, 206632698, 183972890, 164994982, 149440950, 136690567, 126162504, 117342282, 109822121, 103320211, 97661089, 92677459, 88201321, 84128566, 80391869, 76888561, 73601072, 70554992, 67718980, 65094796, 62666387, 60425888, 58362255, 56457248, 54681855, 53023033, 51446662, 49983918, 48585589, 47246503, 46002299, 44815203, 43661374, 42573041, 41542947, 40572993, 39635655, 38718314, 37843823, 37002675, 36203641, 35435829]
11248C5435829p59020p25563o63655o45709o40118o31779o17773n74019n36120
11239B9642073n12633n08820n04977m61894m32469m63536m66826m59768m54307
11230B5376843m51856m66713m43406m38686m14022m00143l72629l40037k75742
11221B1773609k27186k22866k75434m09125m00470l60532l24456k86142k85429
11212A8981969k78343k70491k51759k29330k32455k39716k11193k29455k27273
11203A6811954k05934k08459k39533k29066k24560k22804k14866k23479k14750
11194A4828503j87731k08512k21311j95577j94742k04009j91028j80733j60986
11185A3083874j57559j42367j39046j27233j14312j24938j22825j20297j17010
$$ y = [35435829, 34676809, 33951246, 33287591, 32641882, 32001764, 31369985, 30752212, 30178193, 29642073, 29129440, 28620620, 28115643, 27653749, 27221280, 26757744, 26290918, 25831150, 25376843, 24924987, 24458274, 24014868, 23576182, 23162160, 22762017, 22389388, 22049351, 21773609, 21546423, 21323557, 21048123, 20638998, 20238528, 19877996, 19553540, 19267398, 18981969, 18703626, 18433135, 18181376, 17952046, 17719591, 17479875, 17268682, 17039227, 16811954, 16606020, 16397561, 16158028, 15928962, 15704402, 15481598, 15266732, 15043253, 14828503, 14640772, 14432260, 14210949, 14015372, 13820630, 13616621, 13425593, 13244860, 13083874, 12926315, 12783948, 12644902, 12517669, 12403357, 12278419, 12155594, 12035297, 11918287]
11176A1918287j14035r3196q6102q7557n3036n9783n7582n5735p5744j18744j29424
11165A0987349j30515j67541j81255j78093j92015k05140j96003j90337j76385
11156I370065j65441j55267j60356j44674j35300j21040j15113j00458j20496
11147H151920j31873j15085j08024j19743j17818j01143j02323j12520j15810
11138G127581j24315j21289j12851j08624j14546j13497j12464q7006r9602r6894
11128F036493p1619p7148q0794r0867j10148o8560p2439q3657q0550o5598n7580
11117E177533p5036p6918p4592o9060n1940n5764n0374n1265m6711j2612k4519
11106D588742l6073m9121o1774o5972p2067o7561q8819n1632n7012o7679p7647
$$ y = [11918287, 11804252, 11711056, 11624954, 11537397, 11484361, 11424578, 11366996, 11311261, 11235517, 11116773, 10987349, 10856834, 10689293, 10508038, 10329945, 10137930, 9932790, 9736787, 9546450, 9370065, 9204624, 9049357, 8889001, 8744327, 8609027, 8487987, 8372874, 8272416, 8151920, 8020047, 7904962, 7796938, 7677195, 7559377, 7458234, 7355911, 7243391, 7127581, 7003266, 6881977, 6769126, 6660502, 6545956, 6432459, 6319995, 6232989, 6133387, 6036493, 5964874, 5887726, 5806932, 5716065, 5605917, 5537357, 5464918, 5381261, 5300711, 5235113, 5177533, 5102497, 5025579, 4950987, 4881927, 4829987, 4774223, 4723849, 4672584, 4625873, 4613261, 4588742, 4552669, 4503548, 4441774, 4375802, 4303735, 4236174, 4147355, 4095723, 4038711, 3971032, 3893385]
11095C893385o6197o1260o3337n2259n1001m7079n8096m3590l4212m0361k9186
11084C346807k2897l9693n2484n0432k7761m3504m3079k0734k5719m0494l3841
11073B946169m6431l7536k4317k9200l7432m1230m3423l3737j3961l7045k6665
11062B575192k0940l2805m4596l1403k3281j3628o071j2867l7984k8363k3155
11051B300099k5724l1228l4800k4160j3278r083l2367k3847k7374k3701j5349
11040B039188o215l3433k6697j8978j719o080n617j5892k0608k5215j6544j456
11028A860734J1518j9899k2858k3065j5958m569l246P226L342k8913l1389l9346
11016A693577k5599M115P47j5976k0392j4513j2788n698p405j8177q990r854j5533
$$ y = [3893385, 3827188, 3765928, 3702591, 3650332, 3599331, 3552252, 3494156, 3450566, 3416354, 3375993, 3346807, 3323910, 3284217, 3231733, 3181301, 3153540, 3110036, 3066957, 3046223, 3020504, 2980010, 2946169, 2899738, 2862202, 2837885, 2808685, 2771253, 2730023, 2686600, 2652863, 2638902, 2601857, 2575192, 2554252, 2521447, 2476851, 2445448, 2422167, 2408539, 2402468, 2389601, 2351617, 2323254, 2300099, 2274375, 2243147, 2208347, 2184187, 2170909, 2161826, 2129459, 2105612, 2078238, 2054537, 2039188, 2032973, 1999540, 1972843, 1953865, 1952146, 1946066, 1940449, 1924557, 1903949, 1878734, 1862190, 1860734, 1872252, 1852353, 1829495, 1806430, 1790472, 1785903, 1782657, 1789883, 1793225, 1764312, 1732923, 1693577, 1667978, 1672093, 1672840, 1656864, 1636472, 1621959, 1609171, 1603473, 1596068, 1577891, 1568901, 1559047, 1543514]
11003A543514k3369k6410j2778l310k596l130l04p77j386k738Q919K0446O578
10990A502659p604P645N613J4343K8280O6681P4711N4126k2503q4636o6439n6276
10978A516600j9974j1930R11K4752P055m732l589k698j5609L767J0448l023r481
10965A492497J0039J4938Q816j4623r971l720P239R620k431j3367n226K620K3281
10952A519712J7998O640K4047J2645J4226J5718J6006M7109L6955K3676L3848
10941A768580J6096L1357L7652L7544N4539O0280P3734P8180P9733P5538O6036
10930B379269N4707M3971K6105j4950m0264k8229k4926l9190n3381m5093m2673
10919B215346n6740k3295J02J95J1820K8245K8960L5608J5212L5245L7237L8606
$$ y = [1543514, 1520145, 1493735, 1480957, 1477647, 1475051, 1471921, 1471617, 1470840, 1469454, 1466716, 1475635, 1496081, 1502659, 1495055, 1502700, 1508313, 1522656, 1550936, 1617617, 1692328, 1746454, 1723951, 1639315, 1572876, 1516600, 1496626, 1484696, 1485607, 1510359, 1517414, 1512682, 1509093, 1506395, 1490786, 1494553, 1505001, 1501978, 1492497, 1502536, 1517474, 1526290, 1511667, 1501696, 1497976, 1505215, 1514835, 1512404, 1499037, 1493811, 1496431, 1519712, 1537710, 1544350, 1568397, 1581042, 1595268, 1610986, 1626992, 1674101, 1711056, 1734732, 1768580, 1784676, 1816033, 1853685, 1891229, 1945768, 2006048, 2079782, 2157962, 2237695, 2313233, 2379269, 2433976, 2477947, 2504052, 2489102, 2448838, 2420609, 2395683, 2356493, 2303112, 2258019, 2215346, 2158606, 2135311, 2135413, 2135608, 2147428, 2175673, 2204633, 2240241, 2255453, 2290698, 2327935, 2366541]
10907B366541N0093M9500L8308L4302L1702L8112L6787K5735L6348L5400K1941
10896B764769K879j2048j6311k6236l4229m2623l5006n4824n0799l8987n1101
10885B405484k7576k5172n3722m8035j4214j8887j9298j9372k7691k7746j4994
10874B108777j9531j1034q763N539J9752L5242N1531O3166P2808R1153J16166
10863B524806Q8309N4782M3727l331o6343r5896j07866j35495j16560r6641q7826
10852B001666o9557m9902m5514m2931l3712l7512l7110j7903k2580j1559j0685
10841A622701k8703k5018l2553j8985J4291K1889p149k3481k5122k2520q695J1976
10829A478631O312J0973j4360j8704N164j3572m327p497k726k285l476l021j822
$$ y = [2366541, 2416634, 2466134, 2504442, 2538744, 2570446, 2608558, 2645345, 2671080, 2707428, 2742828, 2764769, 2767648, 2755600, 2739289, 2713053, 2678824, 2636201, 2601195, 2546371, 2495572, 2456585, 2405484, 2377908, 2352736, 2299014, 2250979, 2236765, 2217878, 2198580, 2179208, 2151517, 2123771, 2108777, 2089246, 2078212, 2069449, 2074988, 2094740, 2129982, 2181513, 2244679, 2317487, 2408640, 2524806, 2613115, 2667897, 2711624, 2708293, 2641950, 2546054, 2438188, 2302693, 2186133, 2089492, 2001666, 1932109, 1882207, 1836693, 1793762, 1760050, 1722538, 1685428, 1667525, 1644945, 1633386, 1622701, 1593998, 1568980, 1536427, 1517442, 1531733, 1553622, 1546473, 1522992, 1497870, 1475350, 1466655, 1478631, 1484943, 1495916, 1481556, 1462852, 1468016, 1454444, 1450117, 1442620, 1439894, 1437609, 1434133, 1431112, 1429290]
10816A429290J92K883O623K717q313l747Q373j4132j3719J496n543J093K2543
10803A429756J2754n682j2446L970K6718j6484l4185j8896L103K3455K5302R088
10791A446453j3408j1178j045m524l006j369J7893L690j5299N258P366k204j9564
10778A409063j5923m889L742o763j3816J009J1388L196N266r340R489N29j9014
10765A373937R435L874O693P957j7776j9283R380N427J0419M200M838K3576k125
10752A420552q571m930q257k0509J610J427o0J682J4959j3517j4025J4084o476
10739A377969M13r402j2091j955R649K9707n033j9188q122J25m057r784j169Q495
10725A355557J0841Q824o471j496k62j9965J3041L700K164j2384J0014j283N772
$$ y = [1429290, 1429482, 1432365, 1438988, 1441705, 1433392, 1429645, 1438018, 1423886, 1410167, 1411663, 1406120, 1407213, 1429756, 1442510, 1436828, 1424382, 1428352, 1455070, 1438586, 1404401, 1385505, 1388608, 1412063, 1437365, 1446453, 1433045, 1421867, 1420822, 1416298, 1413292, 1411923, 1429816, 1433506, 1418207, 1423465, 1430831, 1428627, 1409063, 1393140, 1388251, 1391993, 1385230, 1371414, 1372423, 1383811, 1387007, 1392273, 1382933, 1392422, 1392951, 1373937, 1383372, 1387246, 1393939, 1401896, 1384120, 1364837, 1374217, 1379644, 1390063, 1394263, 1399101, 1422677, 1420552, 1411981, 1407051, 1398794, 1378285, 1379895, 1381322, 1381262, 1382944, 1397903, 1384386, 1370361, 1384445, 1377969, 1378382, 1368980, 1356889, 1354934, 1364583, 1394290, 1389257, 1370069, 1361947, 1362072, 1358015, 1348231, 1347062, 1355557, 1366398, 1375222, 1368751, 1367255, 1366993, 1347028, 1360069, 1363769, 1365933, 1353549, 1363563, 1362280, 1368052]
10712A368052j1649k163o983r734O557R180K633l765m176N559m023l1777J992
10699A319703o02k388J4339P352O779N254N68M406j5248j8788J4194P535j4392
10686A328712l181Q377O58P498n72J669R592l151k5836k2928J8415J8826L83j0853
10672A327609j438M323j1492o463J2935O105k2434j5319j576j2458Q065O520L389
10659A297766Q993j6541J3906O874M312M406q519j1192J001J4067L403j2924j5117
10646A290435k1809r547O554O910L754L553n014Q958R324k973K22N888r740O667
10632A293182l470k995n847j3609l511p700J2647O786P68p310j180o785K031j0950
10618A252057j5893J404J17k611p604n395q624l621J051m261k737O74R86J2253
$$ y = [1368052, 1356403, 1354240, 1347257, 1337523, 1344080, 1353260, 1355893, 1352128, 1347952, 1353511, 1349488, 1317711, 1319703, 1319101, 1316713, 1331052, 1338404, 1345183, 1350437, 1351005, 1355411, 1340163, 1321375, 1335569, 1343104, 1328712, 1325531, 1333908, 1334566, 1342064, 1341492, 1343161, 1352753, 1349602, 1323766, 1300838, 1319253, 1338079, 1338462, 1327609, 1326171, 1330494, 1319002, 1312539, 1325474, 1331579, 1309145, 1293826, 1292250, 1279792, 1287857, 1294377, 1297766, 1306759, 1290218, 1304124, 1310998, 1315310, 1319716, 1311197, 1300005, 1301006, 1315073, 1318476, 1305552, 1290435, 1268626, 1259079, 1265633, 1272543, 1276297, 1279850, 1274836, 1283794, 1293118, 1290145, 1290367, 1296255, 1286515, 1293182, 1289712, 1286717, 1280870, 1267261, 1263750, 1256050, 1268697, 1275483, 1276251, 1268941, 1267761, 1260976, 1263007, 1252057, 1236164, 1237568, 1237685, 1235074, 1227470, 1222075, 1213451, 1209830, 1210881, 1206620, 1203883, 1204557, 1205543, 1217796]
10604A217796J4561m446R034k899j2573r984j8735R491O856K6707K3900J4424
10592A274132J1334j2173k9692l0258j2589j445M719o186r588J0933k544j2559
10580A184084l000p723l557n000j5695J3883K763j7672l885m524q176p593k487
10567A121418M534k033j7418j4740M215j6474l161J863J2234K259m923K275o717
10554A083332j5956m166J0391M29K012P033o898q416o454j4130M939K6954J2690
10541A091760j2483j5916j8390j8967l098R261n999K0673J1755p272j4187j8048
10529A019089Q674O222L962o86j1154o875n486l780K207k2498j805j591j3954
10516I72325p382m666K34q884k5254o03J1188q546R941J3597j1963p518q440k176
$$ y = [1217796, 1232357, 1227911, 1236945, 1234046, 1221473, 1211489, 1192754, 1202245, 1209101, 1235808, 1259708, 1274132, 1285466, 1273293, 1243601, 1213343, 1200754, 1199309, 1204028, 1197842, 1188254, 1199187, 1196643, 1184084, 1181084, 1173361, 1169804, 1164804, 1149109, 1162992, 1165755, 1148083, 1144198, 1139674, 1131498, 1123905, 1121418, 1125952, 1123919, 1106501, 1091761, 1095976, 1079502, 1076341, 1078204, 1090438, 1092697, 1087774, 1090049, 1083332, 1067376, 1063210, 1073601, 1074030, 1076042, 1083075, 1076177, 1067761, 1061307, 1047177, 1052116, 1079070, 1091760, 1079277, 1063361, 1044971, 1026004, 1022906, 1032167, 1026168, 1046841, 1058596, 1051324, 1037137, 1019089, 1027763, 1033985, 1037947, 1037261, 1026107, 1019232, 1013746, 1009966, 1012173, 989675, 987870, 986279, 972325, 964943, 960277, 960511, 951627, 926373, 925770, 936958, 928412, 938353, 951950, 939987, 932469, 924029, 921853]
10502I21853K5285Q203j0877j738J979n300j0757k330q268r745k278N322N925
10489I17274l006p315j4304R628J6908j8352j2215j812p295n886q095J664J398
10476H68592n3j8080j8337K627j3095o761J6257N231n491L207K931o668p282M303
10462H27381J0182o388j2723k2250j8101m699K321L465j2898j1851K389J9953
10450G76781J282J1988J094J2784l362j018J72r128l152r895o150o78l335j2496
10436G54887q441j2523r433o841P419O101l972j3510k350O246J0471n680l023
10423G19351J8484p35j4072j448l780L01J3859Q164L843L632R62l310k771q936
10409G33544j0611o285j5706o475l087j0034j0985R74Q250j3840M004J4846J0067
$$ y = [921853, 947138, 955341, 944464, 942726, 944705, 939405, 928648, 926318, 918050, 908305, 906027, 911349, 917274, 914268, 906953, 892649, 902277, 919185, 900833, 888618, 886806, 879511, 873625, 865530, 867194, 868592, 868539, 850459, 832122, 834749, 821654, 814893, 831150, 836381, 830890, 834097, 837028, 830360, 823078, 827381, 837563, 831175, 818452, 796202, 778101, 773402, 775723, 779188, 766290, 754439, 756828, 776781, 778063, 790051, 791145, 803929, 800567, 799549, 799721, 790593, 787441, 777546, 771396, 770718, 767383, 754887, 746446, 733923, 724490, 717649, 725068, 731169, 727197, 713687, 711337, 717583, 728054, 722374, 719351, 737835, 737100, 723028, 721580, 717800, 718101, 731960, 740124, 743967, 747599, 748561, 745251, 742480, 733544, 722933, 716648, 700942, 694467, 691380, 681346, 670361, 671335, 679585, 665745, 669749, 684595, 694662]
10396F94662J0542J1161J060m078j8763j8861M226J2526K710l796r993q157j318
10383F71921q944k9081r359k218J177O298J5461k020p733o868J7422J7998m615
10370F59439J8514K6675q09k807p906K653K749J194q332k5315k1792k453R134
10357F50944o248k0905m298J6915N481j3979p687j846N76k1744k181K2309K823
10344F20160L018J5191K8486j2998k263N519J373j2952j4624J561j5703l066k712
10331F10990o55L839j1453P03K7633J7491J6771K2688J1939O547J2149J761J1523
10318G31926J2292n706K946O388K460J4653K4088Q55J1489O354J5133K229J491
10305H26598M030r582l828m961j3776j90J031K868q80j9412L736R732R104J1676
$$ y = [694662, 705204, 716365, 717425, 713347, 694584, 675723, 679949, 692475, 695185, 691389, 681396, 673239, 671921, 662977, 633896, 624537, 622319, 623496, 629794, 645255, 643235, 635502, 628634, 646056, 664054, 659439, 677953, 704628, 703819, 701012, 693106, 695759, 698508, 699702, 691370, 666055, 644263, 641810, 650944, 644696, 623791, 619493, 636408, 641889, 627910, 620223, 618377, 618953, 597209, 595028, 617337, 620160, 623178, 638369, 666855, 653857, 651594, 657113, 658486, 645534, 630910, 632471, 616768, 613702, 610990, 610335, 614174, 602721, 603424, 631057, 648548, 665319, 688007, 699946, 706493, 718642, 720403, 731926, 744218, 738512, 741458, 747846, 750306, 764959, 789047, 789902, 801391, 807745, 822878, 825107, 826598, 830628, 821046, 817218, 812257, 798481, 798291, 799322, 802190, 801310, 781898, 785634, 795366, 804470, 816146]
10291H16146R753O622R38K017o584K0236M1941K1225J3475K682R50R81p13j5484
10277I14185p43O723Q302k244r009P959j4875K300J4136P63j1706j6796j2725
10264H86270L128K76O19n029J3305k2383j6701k517m941j1586j9491j6453N900
10251H10397J4089P686L472j6593k993Q374Q093o90q210j0505j341o818k0986
10238G83975m67J821j3908k66N309M475q733k4669l2999j9458R27L278r254k1207
10224F68824j7582j5504j0987M670k118l404k7636j6880Q94K613j1105m700l587
10211E63498Q217J2834L920r752k68Q524J1464r203j0469K900J0216J020j2697
10198E80204M43K482P764L735j7000p48J5603K1148J4394O286n85r175j8623k2681
$$ y = [816146, 825899, 832521, 833459, 835476, 828892, 849128, 891069, 912294, 925769, 928451, 929401, 930382, 929669, 914185, 913442, 920165, 928467, 926223, 917214, 925173, 910298, 912598, 926734, 927497, 915791, 898995, 886270, 889398, 889674, 890293, 885264, 898569, 876186, 859485, 856968, 852027, 840441, 820950, 804497, 810397, 824486, 832172, 835644, 819051, 816058, 824432, 832525, 831835, 823625, 813120, 811779, 804961, 783975, 783508, 785329, 771421, 771155, 776464, 780939, 772206, 747537, 714538, 695080, 696007, 699285, 690031, 668824, 651242, 635738, 624751, 629421, 627303, 623899, 596263, 579383, 580277, 582890, 571785, 567085, 563498, 571715, 584549, 588469, 578717, 578449, 586973, 598437, 589234, 578765, 581665, 591881, 592901, 580204, 580647, 583129, 590893, 594628, 577628, 576880, 592483, 613631, 628025, 634311, 633726, 624551, 605928, 583247]
10184E83247k6982k3820k0781m508j4197J3058j4162n220n526Q386L955q065l683
10171D81702j0483J1221j515k226l744O493M119M992p84j0660J0365k4912J040
10158D65608r672m296M441K778m073n467L491m980o151j352Q598J3625K6905K0002
10144E09457J0429K1847K0123O139p511l4091m6844k0711j5538j3071l264r006
10132D17959j4697p627o038L301K5401K5773q158k532Q75N707K1867J4692O318
10119D82841J0250L3372M7479L7578K4650K0351K2610K6015M3212K6162k1993
10108G52527k3604k7835l2976l0989m5555l0420j6298K9807N5606P0413P6044
10097G76720Q6566P9816R8334R3637P9449M5882j0291n8359q4987p1523q3135
$$ y = [583247, 556265, 532445, 511664, 507156, 492959, 506017, 491855, 486635, 481109, 489495, 493450, 485385, 481702, 471219, 482440, 480925, 478699, 474955, 481448, 485567, 490559, 489775, 479115, 489480, 464568, 465608, 455936, 451640, 456081, 458859, 454786, 449319, 452810, 447830, 441679, 440327, 448925, 462550, 489455, 509457, 519886, 541733, 561856, 567995, 560484, 526393, 479549, 458838, 443300, 430229, 426965, 417959, 403262, 395635, 389597, 392898, 418299, 444072, 435914, 433382, 434257, 439964, 461831, 476523, 482841, 493091, 526463, 573942, 611520, 636170, 656521, 679131, 705146, 748358, 774520, 752527, 728923, 701088, 668112, 637123, 591568, 561148, 544850, 574657, 630263, 700676, 776720, 863286, 943102, 1041436, 1135073, 1214522, 1260404, 1250113, 1191754, 1106767, 1035244, 952109]
10086I52109r4372r8236p4312n8107n3350l9584k2881r535j0558j0685m184l267
10074D73038k4541j0595j5188n71J017M921Q353Q901N706j5364M095n328n909
10061D28535l227j7888j7721j3359j0833J991J5878m279j8528k976k665n511L47
10048C49764L615j1349l632J2318O467k0629j4637j2457n260j4734L122J6016
10036C08604P922J454m561j214j6861j3941J2799J3377M824K861q4J5331M085
10023C34596l175J5652j6670p220N135L0426J8856J1256J7436l303k2708k0311
10011C59970k9266l1343K0510M026l5355m437j239k004L527R235j1305m094j778
9998B76447j1764p552J1262J0450J0362Q058q535R315L1943J0238L241j4606j0323
$$ y = [952109, 857737, 759501, 685189, 627082, 573732, 534148, 511267, 501732, 491174, 480489, 476305, 473038, 448497, 437902, 422714, 422143, 423160, 428081, 436434, 445335, 451041, 435677, 439772, 434444, 428535, 425308, 407420, 389699, 376340, 365507, 367498, 383376, 379097, 360569, 357593, 354928, 349417, 349764, 353379, 342030, 338398, 350716, 357183, 336554, 321917, 309460, 304200, 289466, 292588, 308604, 316526, 317980, 313419, 312205, 295344, 281403, 294202, 307579, 312403, 315264, 315180, 330511, 334596, 331421, 347073, 330403, 323183, 328318, 358744, 377600, 388856, 406292, 402989, 380281, 359970, 330704, 299361, 319871, 323897, 288542, 284105, 282866, 280862, 284389, 293624, 282319, 278225, 276447, 264683, 257131, 268393, 278843, 289205, 297263, 288728, 298043, 329986, 340224, 343465, 328859, 318536]
9985C18536q398J313n249j4721j2796o126o724J0412J5967m512j0647R31l942
9972B74044R217J256j2717j1329m307j5774Q158J0972k355k058k485p0j066o682
9958B44804n447Q316j3939l654J4643l81q054J2337J1351P786J5641K0556O850
9945C10809r325j3850j4581j7526j4076j2369l288J2692J1993K208k7204j0317
9933B15166o661Q572J0015J1662J89p526o606j414L468N429k2515K778J4019j299
9919B25277M950l161K66Q561R946J1823P711j3217n03q909j8117m591J3460j205
9905B32291J126N366J371j3474k1123J0563j220N529O652P272n577j0266j3422
9892B05088J1591O287K3496L013o558k0648L9J1733O74j1346L534J1027R831k9064
$$ y = [318536, 310138, 311451, 306202, 291481, 278685, 272559, 265835, 276247, 292214, 287702, 277055, 277986, 274044, 283261, 284517, 271800, 260471, 256164, 240390, 248548, 259520, 257165, 255107, 252622, 252552, 251486, 244804, 239357, 247673, 233734, 230080, 244723, 244342, 236288, 248625, 259976, 267762, 283403, 303959, 310809, 301484, 287634, 273053, 255527, 241451, 229082, 225794, 238486, 250479, 252687, 225483, 215166, 208505, 217077, 227092, 238754, 238943, 231417, 224811, 223397, 226865, 232294, 209779, 212557, 226576, 225277, 230227, 227066, 227332, 235893, 245839, 257662, 265373, 252156, 251653, 242744, 224627, 220036, 233496, 232291, 233417, 238783, 240154, 226680, 205557, 216120, 214900, 220429, 227081, 234353, 228776, 218510, 205088, 216679, 222966, 246462, 249475, 242917, 222269, 222308, 234041, 234715, 223369, 226903, 237930, 247761, 218697]
9878B18697j4855Q899P094J2145o397n442m870m329n552k239l02j07K42Q858l180
9863B08662j839j25P612j19j643j855L424L799m071P348j64j0277p169N828J2920
9848B22331L09j9611J6299J274J0097J5469k994o808j8540l002J6989L196n710
9835B29299m381J3082J447J131j4701j6034J1121j512j8485j5041O903K4498j0160
9822B07167j614J2411L36l278k545j33r127J5382k76r760N13N576J269J2981O829
9807B35731l040R039Q015k7989k8437j036Q782L476J1164Q434J3638l924j5497
9794B18356P509J7601k731q787k731N13k569L307j1928o34K275n314M058k693
9780B16232J0607J4167o37j2513j727M01m99N395O802J512O143j2475m335R176
$$ y = [218697, 203842, 212741, 219835, 231980, 225583, 220141, 215271, 210942, 205390, 203151, 202849, 202742, 202984, 211842, 208662, 206823, 206698, 214310, 214191, 212548, 210693, 214117, 217916, 213845, 221193, 221029, 210752, 203583, 209411, 222331, 222640, 203029, 219328, 220602, 230699, 246168, 243174, 236366, 217826, 214824, 231813, 235009, 229299, 224918, 238000, 239447, 240578, 225877, 209843, 220964, 219452, 200967, 185926, 192829, 217327, 207167, 205553, 217964, 218300, 215022, 212477, 212344, 203217, 218599, 218323, 208563, 209076, 214652, 215921, 228902, 235731, 232691, 241730, 249745, 221756, 193319, 192283, 201065, 204541, 215705, 224139, 237777, 233853, 218356, 225865, 243466, 240735, 231948, 229217, 229730, 227161, 230468, 218540, 217906, 220181, 214867, 218925, 216232, 226839, 241006, 240369, 227856, 226129, 226530, 226031, 231426, 238228, 239740, 245883, 233408, 229073, 238249]
9766B38249K437r624l336P728p609m978J610J247j0518j7915l928K7823l471o5
9752B17650O288R047J8566M14K047l860n8Q697R966M731j021k414o272r352m933
9737B49496o616Q483Q572k438k229J5082M284p492k376k81l052K332p885j0267
9723B45613M980J0705N909n584J4927o090o748qJ037K567j3470Q861J7956J2272
9709B92927J8421j1321J4441J8038j4222O601K5723J6289K0941L3257L2878M6308
9697E00281N0999L2717J1470J0900j7146m2382k8481j7636j9219k3812j4770q944
9685D33977K5850K7594j0211O855J3687M518n193j676Q497K2732J9603J2645L3483
9672E92361K5412M1470L4011J045Q628M4645M3519J3296J7489L9473K3163J5100
$$ y = [238249, 240686, 231062, 227726, 235454, 227845, 222867, 224477, 225724, 215206, 197291, 193363, 221186, 217715, 217650, 223938, 232985, 251551, 251965, 254012, 250152, 250094, 258791, 268757, 273488, 272467, 270053, 263781, 254429, 249496, 242880, 251363, 259935, 257497, 255268, 270350, 274634, 267142, 264766, 264485, 261433, 263765, 255880, 245613, 250593, 261298, 267207, 261623, 276550, 270460, 263712, 263704, 264741, 267308, 253838, 262699, 280655, 292927, 311348, 300027, 314468, 332506, 318284, 324885, 350608, 366897, 387838, 421095, 453973, 500281, 551280, 583997, 595467, 606367, 589221, 546839, 518358, 500722, 481503, 457691, 442921, 433977, 459827, 487421, 477210, 484065, 497752, 502270, 497077, 495401, 503898, 526630, 546233, 558878, 592361, 617773, 659243, 693254, 694299, 702927, 747572, 791091, 804387, 821876, 861349, 884512, 899612]
9660H99612K9116L2670J6366N178N109L014m600k0081n262M167N711N455Q688
9647I85143J237j2534j2799j4927j7358j1433P815J1939P634N755J5058J8457
9635I83987J4174O033K5670L6110L6173J9715O1671N4425M9059P0405O5567M9831
9623A472820K1551N27j8001m3105m8177m6305m8211l0401j9903l6788l4877j5043
9611A154087P11q877k4572j6948l455J8482J1990k770k089m712o036m801m700
9598A106310p684K2988K5159J3359j252o365K0732L4110K2410J1369J1165P932
9586A260233m432k7144j9493k2732k6145l2625l3108j9715k5989j8711o808k9763
9574I93568m1377l7088m315j9346k1812j8515k3094j3707q84q760O857j8864l0329
$$ y = [899612, 928728, 961398, 977764, 982942, 988051, 991065, 986465, 966384, 961122, 965289, 971000, 976455, 985143, 986380, 973846, 961047, 946120, 928762, 917329, 925144, 937083, 944717, 950472, 965530, 983987, 998161, 1004194, 1029864, 1065974, 1102147, 1121862, 1183533, 1237958, 1287017, 1357422, 1422989, 1472820, 1494371, 1494898, 1476897, 1433792, 1385615, 1339310, 1291099, 1260698, 1240795, 1204007, 1169130, 1154087, 1154798, 1145921, 1121349, 1104401, 1100946, 1119428, 1131418, 1128648, 1126559, 1121847, 1115811, 1111010, 1106310, 1098626, 1121614, 1146773, 1160132, 1158880, 1152515, 1173247, 1207357, 1229767, 1241136, 1252301, 1260233, 1255801, 1228657, 1209164, 1186432, 1160287, 1127662, 1094554, 1074839, 1048850, 1030139, 1023331, 993568, 952191, 915103, 910788, 891442, 869630, 851115, 828021, 814314, 813430, 804670, 811527, 792663, 762334]
9561G62334L909K3427K0270J0220j847N465K7251K4094J8787J2573K9500K194
9549I38177k2913j5938l5706l5751j3565k6840k6446j1526J694J540J283r113
9537G44896p028j132n826k1025k4654R847m548j3404N929n266p517J596P845M089
9523F83802K160J1948n380J4263L3704K628J0527J6273K3460L3485L4734J8268
9511H79872O106L813J1281l570j7632j8742l2147j1630J914J467j216j8398K397
9498H03515J2584M836m025J2313Q026O366R156O684J9404J8801K1990K3736J2424
9485I55810K2216L4078M0871L3485N7521O5810P5224M5888R134Q838R212L4544
9473A392631O3168Q5750J50215L06051L98360L29919J14848k04882j95462j21605
$$ y = [762334, 766243, 789670, 809940, 820160, 818313, 823778, 851029, 875123, 893910, 906483, 935983, 938177, 915264, 899326, 863620, 827869, 814304, 787464, 761018, 749492, 751186, 752726, 754009, 744896, 737868, 736736, 730910, 709885, 685231, 695078, 690530, 677126, 683055, 677789, 670272, 671868, 679713, 683802, 685962, 697910, 692530, 706793, 740497, 743125, 753652, 769925, 793385, 826870, 861604, 879872, 885978, 889791, 901072, 897502, 879870, 861128, 828981, 817351, 819265, 820732, 819516, 801118, 803515, 816099, 820935, 816910, 829223, 837249, 843615, 852771, 859455, 878859, 897660, 919650, 943386, 955810, 978026, 1012104, 1052975, 1086460, 1143981, 1209791, 1285015, 1330903, 1340037, 1348875, 1358087, 1392631, 1455799, 1541549, 1691764, 1997815, 2396175, 2726094, 2840942, 2636060, 2440598, 2318993]
9463B318993j24263j39552j39126j01777r3641o7885j8066N2584J06321J60706
9453A954294K08744J98624J85824K08528J98568J67500J4223m7813p2574l6621
9443B979297l9797n9330m2090l3393k701K3620k7868o5315m3799l7605L5880J50515
9431B837414K35664L82212N66446Q61230J087061R03285K93749o77057j053562
9422E436442q38174n86394l94749k68881j89356q7402P946N3714P8209M5761l753
9411C253363J4788O9246J18123J20252J04366J03154J09017R4393L1986l8567
9401C980121j21367j79520j84119j86758k16800j57854p2979k4232J7779M7408
9391B901679J04698J59063J67955J56641J50735J68889K45566K18233O9908k32349
$$ y = [2318993, 2194730, 2055178, 1916052, 1814275, 1720634, 1652749, 1634683, 1687267, 1793588, 1954294, 2163038, 2361662, 2547486, 2756014, 2954582, 3122082, 3136305, 3088492, 3015918, 2979297, 2939500, 2880170, 2838080, 2804687, 2801986, 2825606, 2797738, 2732423, 2688624, 2651019, 2686899, 2837414, 3073078, 3455290, 4021736, 4882966, 5970027, 6873312, 7167061, 6490004, 5436442, 4598268, 4011874, 3617125, 3348244, 3158888, 3071486, 3079432, 3133146, 3211355, 3257116, 3253363, 3268151, 3337397, 3455520, 3575772, 3680138, 3783292, 3892309, 3986702, 4018688, 3980121, 3858754, 3679234, 3495115, 3308357, 3091557, 2933703, 2860724, 2836492, 2854271, 2901679, 3006377, 3165440, 3333395, 3490036, 3640771, 3809660, 4055226, 4273459, 4343367, 4111018]
9381D111018l86281k71901j63260q5778m8133P321P601J7001J1380k5563o8112
9370C105293o2140n1937l9300k5377m802M090K1463K3183K8297L3124K5317L9973
9358C097184M5448N1259M0726L1743N0458N3603M5072O3081L9027K7459L6010
9347C581070K6304J4400K3158N835J2038L9003K2837K6618K8054L6128K2126K252
9335C839823Q555K3376K9594M8021O6008Q5072Q1068Q6272J03790J08903J11793
9324D592275J04030J11398J55525J83684K06137K41141K77168L22137L91753M46053
9314G031301N42891O55658Q20032J009285J212833J365248J540145J718813J893071
9305A7789277K123046K387079K628960K844309K992853L058323K949154K619021
$$ y = [4111018, 3724737, 3452836, 3289576, 3203798, 3155665, 3162986, 3170587, 3187588, 3198968, 3173405, 3105293, 3043153, 2991216, 2951916, 2926539, 2921737, 2925827, 2947290, 2970473, 2998770, 3031894, 3057211, 3097184, 3142632, 3193891, 3234617, 3266360, 3316818, 3370421, 3415493, 3478574, 3517601, 3545060, 3581070, 3607374, 3621774, 3644932, 3650767, 3662805, 3701808, 3724645, 3751263, 3779317, 3815445, 3837571, 3839823, 3848378, 3871754, 3901348, 3949369, 4015377, 4100449, 4181517, 4267789, 4371579, 4480482, 4592275, 4696305, 4807703, 4963228, 5146912, 5353049, 5594190, 5871358, 6193495, 6585248, 7031301, 7574192, 8229850, 9049882, 10059167, 11272000, 12637248, 14177393, 15896206, 17789277, 19912323, 22299402, 24928362, 27772671, 30765524, 33823847, 36773001, 39392022]
9297C9392022K063204J283134L31272o21788j438445j901612j949238j667056
9289C5491493j276560q10477k96284K55986P96495J231226J547613J708159J801789
9280D0449440J980689K250356K658956L110565L575673L925231M176518M338378
9272F6465806M411869M444518M452293M409319M378744M305685M154420L888816
9264A00911470L512433L009084K438733J799076J169702O78072L60586J93489
9256A14072645K04000L49971N44471P27822R00230R74365R69423Q74352O77498
9247A20294777M35637K51975K33386M90222R99248J597139K078232K371672K548469
9238A31300757K750542L172098L871407M863993O065129P328927Q284686Q701374
$$ y = [39392022, 41455226, 42738360, 43069632, 42447844, 41009399, 39107787, 37158549, 35491493, 34214933, 33404456, 33108172, 33364158, 34160653, 35391879, 36939492, 38647651, 40449440, 42430129, 44680485, 47339441, 50450006, 54025679, 57950910, 62127428, 66465806, 70877675, 75322193, 79774486, 84183805, 88562549, 92868234, 97022654, 100911470, 104423903, 107432987, 109871720, 111670796, 112840498, 113518570, 113879156, 114072645, 114276645, 114626616, 115171087, 115898909, 116799139, 117773504, 118742927, 119617279, 120294777, 120730414, 120982389, 121215775, 121705997, 122705245, 124302384, 126380616, 128752288, 131300757, 134051299, 137223397, 141094804, 145958797, 152023926, 159352853, 167637539, 176338913]
9230A76338913Q480966P755044O602215N006867K957681N53024j819565l820850
9222B02054295n276669o214060o639713o599251o084095n040481l704915k249192
9214A60245919r14466J51388Q40083J148502J155269R67289O66209M24966K65415
9205A64950574K33000L54452O48342J101847J669858K292257K786578L113443
9197A77150351L174718K930860K357138J466214L31999r53844k299800l550991
9189A80606645m542124n099999n107464m584350l670135k516830j416857n88623
9181A53080263k91937o48618j545707k754960l947043m843917n286677n246611
9173A28514793m760801m032177l158395k332412j557468q43983j82376L74092
$$ y = [176338913, 184819879, 192574923, 199177138, 204184005, 207141686, 207694710, 205875145, 202054295, 196777626, 190563566, 183923853, 177324602, 171240507, 166200026, 162495111, 160245919, 159331453, 159482841, 160322924, 161471426, 162626695, 163593984, 164260193, 164685159, 164950574, 165183574, 165538026, 166186368, 167288215, 168958073, 171250330, 174036908, 177150351, 180325069, 183255929, 185613067, 187079281, 187411280, 186457436, 184157636, 180606645, 176064521, 170964522, 165857058, 161272708, 157602573, 155085743, 153668886, 153080263, 152788326, 152139708, 150594001, 147839041, 143891998, 139048081, 133761404, 128514793, 123753992, 119721815, 116563420, 114231008, 112673540, 111829557, 111647181, 112021273]
9165A12021273P50112Q62096O82658L29893q7369m61235q00483j199508j681213
9156A10416224k118611k384989k451928k430062k517908k754690l076992l414969
9148H9266075l633878l697601l694197l617323l507699l373734l201873k992568
9140F1547202k717360k414497k120440j898582j744333j624871j537201j472922
9132D6016996j358602j206837j044274r22545p96686o76946n71162m82941l52846
9123C8604157k08497r6378L5084K33742M75507P29634R44419J100613J143720
9114D2962001J041879R29399Q72532Q47473R07573J026332J123385J186483J159480
9105E2056537J034861Q48706O14991M09913L20445L13215M40506O50954R76335
$$ y = [112021273, 112771385, 113633481, 114316139, 114646032, 114558663, 114097428, 113296945, 112097437, 110416224, 108297613, 105912624, 103460696, 101030634, 98512726, 95758036, 92681044, 89266075, 85632197, 81934596, 78240399, 74623076, 71115377, 67741643, 64539770, 61547202, 58829842, 56415345, 54294905, 52396323, 50651990, 49027119, 47489918, 46016996, 44658394, 43451557, 42407283, 41484738, 40688052, 40011106, 39439944, 38957003, 38604157, 38395660, 38299282, 38334366, 38568108, 39043615, 39773249, 40717668, 41818281, 42962001, 44003880, 44933279, 45805811, 46653284, 47560857, 48587189, 49710574, 50897057, 52056537, 53091398, 53940104, 54555095, 54965008, 55285453, 55598668, 56039174, 56690128, 57666463]
9096E7666463J426947J957410K446908K719810K649965K141921J240336J68556
9088G2418316p71416j292144j293742r23545l63625K16916P18410J067939J187309
9079G0964418J009582N21657j40116o68825q79563p63615m80074j41143L15947
9070F9738268Q99003J590472K378834L176185L858369M324232M572002M499970
9062I5037335M084936L275242K160777R24433k01978r90753j329467j318600j128632
9053A00513293j010265j059272j169466j206870j174693j230724j466314j764034
9045I0431655j992650k097246k032268j802734j484213j055119n80270n3121N01242
9036G9835276J016267J544920K135338K785704L345448L651388L577489L013847
$$ y = [57666463, 59093410, 61050820, 63497728, 66217538, 68867503, 71009424, 72249760, 72418316, 71646900, 70354756, 69061014, 68137469, 67773844, 67990760, 68709170, 69777109, 70964418, 71974000, 72495657, 72355541, 71686716, 70807153, 70043538, 69563464, 69422321, 69738268, 70637271, 72227743, 74606577, 77782762, 81641131, 85965363, 90537365, 95037335, 99122271, 102397513, 104558290, 105482723, 105280745, 104289992, 102960525, 101641925, 100513293, 99503028, 98443756, 97274290, 96067420, 94892727, 93662003, 92195689, 90431655, 88439005, 86341759, 84309491, 82506757, 81022544, 79967425, 79387155, 79334034, 79835276, 80851543, 82396463, 84531801, 87317505, 90662953, 94314341, 97891830, 100905677]
9028A00905677K039963Q73175k69289j238364j898023k215214k212277j973409
9020I4012239j576470j157402q98810p91650q29585j008296j213076j460684j641871
9011H3434395j727965j665406j451394j096356q17534p46327r87622j528447k056734
9002G1356610k377034k333518j961004j396221p66299k04589K03485L63712L02020
8993F3187162J7754l99600p93954j074036j220400j178924j007568p25790m29398
8984E6375246j30282J37776L66353N13011M47585J02863n27142j321426k055120
8975E3908864k585066k820131k763716k528427k235154j932019j660009j419229
8967C5965113j215104j011674p89816n52442k77628n091K42944L79780L01795
$$ y = [100905677, 102945640, 103818815, 103549526, 102311162, 100413139, 98197925, 95985648, 94012239, 92435769, 91278367, 90379557, 89587907, 88758322, 87750026, 86536950, 85076266, 83434395, 81706430, 80041024, 78589630, 77493274, 76675740, 75929413, 74941791, 73413344, 71356610, 68979576, 66646058, 64685054, 63288833, 62522534, 62317945, 62521430, 62885142, 63187162, 63204916, 62805316, 62011362, 60937326, 59716926, 58538002, 57530434, 56804644, 56375246, 56244964, 56382740, 56749093, 57262104, 57709689, 57812552, 57285410, 55963984, 53908864, 51323798, 48503667, 45739951, 43211524, 40976370, 39044351, 37384342, 35965113, 34750009, 33738335, 32948519, 32396077, 32118449, 32113358, 32356302, 32736082, 33037877]
8958C3037877q6330o68877j174288j399123j327119j079110p99301n25767k30713
8949B5747249O0022K44793L23381K03080j13125n43202r47107j206869j271079
8940B2497143j186825j014327q62856p24853o21253n39928m82966m48183m20286
8931A6195666l84422l70058l41790l34095l20622l07913k90782k78761k92982
8922A3274241k75746k42051k25080k26613k09502k08211k14001j91679j85656
8913A1295702j78982j73433j81375j81558j51891j49627j37734j42705j35026
8904I863371j26478j17428j23541j20828j24946j25162j33208j23773j35512j22451
8894H610044j10096j18873j29064j12820q8244p4510q0339o9337q0933j00213
$$ y = [33037877, 32951547, 32282670, 31108382, 29709259, 28382140, 27303030, 26503729, 25977962, 25747249, 25807271, 26052064, 26375445, 26578525, 26465400, 25922198, 24975091, 23768222, 22497143, 21310318, 20295991, 19433135, 18708282, 18087029, 17547101, 17064135, 16615952, 16195666, 15811244, 15441186, 15099396, 14765301, 14444679, 14136766, 13845984, 13567223, 13274241, 12998495, 12756444, 12531364, 12304751, 12095249, 11887038, 11673037, 11481358, 11295702, 11116720, 10943287, 10761912, 10580354, 10428463, 10278836, 10141102, 9998397, 9863371, 9736893, 9619465, 9495924, 9375096, 9250150, 9124988, 8991780, 8868007, 8732495, 8610044, 8499948, 8381075, 8252011, 8139191, 8050947, 7976437, 7896098, 7826761, 7745828, 7645615]
8884G645615r3522q8480q5507r2020q9990r0445r0190j06190j05159q2628r2215
8873F629269q7000q2304o6068o5792p0305o5289n1771m5764n1698o0353m0321
8862E942604n2971n1367n3507m4454m8091n2535m1337l1246l7326l7290k8587
8851E463893l0840m0646l4991k8153k9807k3135l0798l0290m5635n2327p7845
8840E039426p1885m2023m6477o4230m3902k4887k9431n8462o2395n2659o1305
8829D481770m8024m4906l7720l8516l4505j9501l2576l61R474R3L221J2013K6831
8816D277293J9074J2584k299n0226o8468o3002p4477p4719o1065l7572n5353m9873
8804C771897m1731l8428n8807n5799n7640m5384k2158k4731k5823n7217k2420
$$ y = [7645615, 7552093, 7463613, 7378106, 7286086, 7196096, 7105651, 7015461, 6909271, 6804112, 6721484, 6629269, 6542269, 6459965, 6393897, 6328105, 6257800, 6192511, 6140740, 6094976, 6043278, 5982925, 5942604, 5889633, 5838266, 5784759, 5740305, 5692214, 5639679, 5598342, 5567096, 5529770, 5492480, 5463893, 5433053, 5392407, 5357416, 5329263, 5299456, 5276321, 5245523, 5215233, 5169598, 5117271, 5039426, 4967541, 4925518, 4879041, 4814811, 4770909, 4746022, 4716591, 4658129, 4595734, 4543075, 4481770, 4433746, 4388840, 4351120, 4312604, 4278099, 4258598, 4226022, 4225661, 4235135, 4235228, 4238449, 4250462, 4277293, 4296367, 4308951, 4306652, 4256426, 4187958, 4124956, 4050479, 3975760, 3914695, 3877123, 3821770, 3771897, 3730166, 3691738, 3632931, 3577132, 3519492, 3474108, 3451950, 3427219, 3401396, 3344179, 3321759]
8793C321759j3193m090l058n11j5302k5755J0094L9541P9176J35455K48306M47092
8781D219514O97375P72550N09173o3616o82708p41536n34989l58423k43304j71231
8771C402805j39353j42836r5742o4960n6012p5328o7904p4410n4792n5924n5101
8760B520443k9701m0828l3333j7478j9164j4944O259O4656J60775K43739K39728
8749C080152J13438j17377k79416k55515j44295p6836o5524n9084o3525p0612
8739B061406n8589n1506m4655m1713l3169l2464k8993k9726l0422m6236k9269
8728A634664j3569l402k0009l4649l4941l126n549k4608j1791j321j3047q984
8716A459668j3923J2997J1305j0276K5183N9054Q6557J29929K05706L83588N54481
$$ y = [3321759, 3308566, 3304476, 3301418, 3300907, 3285605, 3259850, 3269944, 3309485, 3388661, 3524116, 3772422, 4219514, 4916889, 5689439, 6198612, 6134996, 5452288, 4710752, 4175763, 3817340, 3574036, 3402805, 3263452, 3120616, 3024874, 2959914, 2903902, 2828574, 2760670, 2686260, 2631468, 2575544, 2520443, 2490742, 2449914, 2416581, 2399103, 2379939, 2364995, 2371254, 2435910, 2596685, 2840424, 3080152, 3193590, 3076213, 2796797, 2541282, 2396987, 2320151, 2254627, 2195543, 2132018, 2061406, 2002817, 1951311, 1906656, 1864943, 1831774, 1799310, 1770317, 1740591, 1710169, 1663933, 1634664, 1621095, 1617693, 1597684, 1563035, 1528094, 1524968, 1519419, 1494811, 1483020, 1481699, 1468652, 1459668, 1445745, 1458742, 1470047, 1459771, 1484954, 1544008, 1630565, 1760494, 1966200, 2349788, 2904269]
8705B904269M56940J73117l44828n09909l70118k04953j15374r0499j01385j06439
$$ y = [2904269, 3361209, 3534326, 3189498, 2679589, 2309471, 2104518, 1989144, 1898645, 1797260, 1690821]
$$ [...]
##END NTUPLES=NMR SPECTRUM
##END=
