##TITLE=Analysis number 328835
Compound Code cc 64504
Book Reference 510/60
Project Code adrs
Chemist Name jimp
##JCAMPDX= 6.0         $$ Bruker NMR JCAMP-DX V2.0
##DATA TYPE= NMR SPECTRUM
##DATA CLASS= NTUPLES
##ORIGIN= Bruker BioSpin GmbH
##OWNER= nmr
$$ XWIN-NMR		Version 3.5
$$ Mon Jul  9 10:11:42 2007 GMT Daylight Time (UT+1h)  MAYBRIDGE\nmr@NMR_250MHZ
##.OBSERVE FREQUENCY= 250.131544655141
##.OBSERVE NUCLEUS= ^1H
##.ACQUISITION MODE= SIMULTANEOUS (DQD)
##.ACQUISITION SCHEME= undefined
##.AVERAGES= 16
##.DIGITISER RES= 18
##SPECTROMETER/DATA SYSTEM= dpx250
##.PULSE SEQUENCE= zg30
##.SOLVENT NAME= CDCl3
##.SHIFT REFERENCE= (INTERNAL, CDCl3, 0, 16.522)
##AUDIT TRAIL= $$ (NUMBER, WHEN, WHO, WHERE, WHAT)
$$ ##TITLE= Audit trail, XWIN-NMR		Version 3.5
$$ ##JCAMPDX= 5.01
$$ ##ORIGIN= Bruker BioSpin GmbH
$$ ##OWNER= nmr
$$ C:\u/data/dgb/nmr/ADRS/580/pdata/1/auditp.txt
$$ ##AUDIT TRAIL=  $$ (NUMBER, WHEN, WHO, WHERE, WHAT)
(   1,<2007-07-09 10:11:17.23 +100>,<MAYBRIDGE\nmr>,<NMR_250MHZ>,
      <created by zg, POWCHK disabled, PULCHK disabled
       configuration hash MD5:
       76 6E 9A 78 1E 09 19 81 EC 84 63 8F B0 6A 59 2D
       data hash MD5: 64K
       58 BA C5 5D 0D E1 7B 2A 10 7C 4C DB E2 0B ED CA>)
(   2,<2007-07-09 10:11:31.00 +100>,<MAYBRIDGE\nmr>,<NMR_250MHZ>,
      <Start of raw data processing
       ef LB = 0.3 FT_mod = 6 PKNL = 1 SI = 32K 
       data hash MD5: 32K
       A1 40 00 CB 70 73 11 49 3E 67 CF 88 C7 EC 52 43>)
(   3,<2007-07-09 10:11:32.84 +100>,<MAYBRIDGE\nmr>,<NMR_250MHZ>,
      <apk 
       data hash MD5: 32K
       2F 52 7D A8 4E F9 00 83 6C DF 4A 9F 87 C4 2A 8D>)
(   4,<2007-07-09 10:11:33.59 +100>,<MAYBRIDGE\nmr>,<NMR_250MHZ>,
      <abs ABSG = 5 
       data hash MD5: 32K
       C5 4E 22 F7 E1 9A CB A7 CD 0C C8 BC B8 C3 3B 3F>)
$$ ##END=
$$ 
$$ hash MD5
$$ 64 05 E2 41 2F CF BF 92 84 48 C6 D8 89 86 0E 28
##$RELAX= 
##$RELAX= 
##$RELAX= 
##$RELAX= 
##$RELAX= 
##$RELAX= 
##$RELAX= 
$$ Bruker specific parameters
$$ --------------------------
##$DU= <C:\u>
##$EXPNO= 580
##$NAME= <ADRS>
##$PROCNO= 1
##$TYPE= <nmr>
##$USER= <dgb>
##$AMP= (0..31)
100 100 100 100 100 100 100 100 100 100 100 100 100 100 100 100 100 100 
100 100 100 100 100 100 100 100 100 100 100 100 100 100 
##$AQSEQ= 0
##$AQ_mod= 3
##$AUNM= <au_zg>
##$AUTOPOS= <24 >
##$BF1= 250.13
##$BF2= 250.13
##$BF3= 250.13
##$BF4= 250.13
##$BF5= 500.13
##$BF6= 500.13
##$BF7= 500.13
##$BF8= 500.13
##$BYTORDA= 1
##$CFDGTYP= 0
##$CFRGTYP= 5
##$CHEMSTR= <none>
##$CNST= (0..31)
1 1 145 1 1 1 1 1 1 1 1 1 1 1 1 1 1 1 1 1 1 1 1 1 1 1 1 1 1 1 1 1 
##$CPDPRG= <>
##$CPDPRG1= <>
##$CPDPRG2= <>
##$CPDPRG3= <>
##$CPDPRG4= <mlev>
##$CPDPRG5= <mlev>
##$CPDPRG6= <mlev>
##$CPDPRG7= <mlev>
##$CPDPRG8= <mlev>
##$CPDPRGB= <>
##$CPDPRGT= <>
##$D= (0..31)
0 1 0 0 0 0 0 0 0 0.06 0 0 0 0 0 0 0.0002 0 0 0 0 0 0 0 0 0 0 0 0 0 0 
0 
##$DATE= 1183972276
##$DBL= (0..7)
120 120 120 120 120 120 120 120 
##$DBP= (0..7)
150 150 150 150 150 150 150 150 
##$DBP07= 0
##$DBPNAM0= <>
##$DBPNAM1= <>
$$ [...]
##$SUBNAM7= <"">
##$SUBNAM8= <"">
##$SUBNAM9= <"">
##$SW= 20.6930455092707
##$SWIBOX= (0..15)
0 0 3 0 0 0 0 0 0 0 0 0 0 0 0 0 
##$SW_h= 5175.983436853
##$TD= 65536
##$TD0= 1
##$TE= 296.16
##$TE2= 300
##$TE3= 300
##$TEG= 300
##$TL= (0..7)
0 120 120 120 120 120 120 120 
##$TP= (0..7)
150 150 150 150 150 150 150 150 
##$TP07= 0
##$TPNAME0= <>
##$TPNAME1= <>
##$TPNAME2= <>
##$TPNAME3= <>
##$TPNAME4= <>
##$TPNAME5= <>
##$TPNAME6= <>
##$TPNAME7= <>
##$TPOAL= (0..7)
0.5 0.5 0.5 0.5 0.5 0.5 0.5 0.5 
##$TPOFFS= (0..7)
0 0 0 0 0 0 0 0 
##$TUNHIN= 0
##$TUNHOUT= 0
##$TUNXOUT= 0
##$USERA1= <user>
##$USERA2= <user>
##$USERA3= <user>
##$USERA4= <user>
##$USERA5= <user>
##$V9= 5
##$VALIST= <valist>
##$VCLIST= <CCCCCCCCCCCCCCC>
##$VD= 0
##$VDLIST= <DDDDDDDDDDDDDDD>
##$VPLIST= <PPPPPPPPPPPPPPP>
##$VTLIST= <TTTTTTTTTTTTTTT>
##$WBST= 1024
##$WBSW= 4
##$XGAIN= (0..3)
0 0 0 0 
##$XL= 0
##$YL= 0
##$YMAX_a= 234124
##$YMIN_a= -170631
##$ZGOPTNS= <>
##$ZL1= 120
##$ZL2= 120
##$ZL3= 120
##$ZL4= 120
##$ABSF1= 16.522
##$ABSF2= -4.171173
##$ABSG= 5
##$ABSL= 3
##$ALPHA= 0
##$AQORDER= 0
##$ASSFAC= 0
##$ASSFACI= 0
##$ASSFACX= 0
##$ASSWID= 0
##$AUNMP= <proc_1d>
##$AZFE= 0.1
##$AZFW= 0.1
##$BCFW= 0
##$BC_mod= 0
##$BYTORDP= 0
##$COROFFS= 0
##$CY= 12.5
##$DATMOD= 1
##$DC= 0
##$DFILT= <>
##$DTYPP= 0
##$F1P= 14.0000005364418
##$F2P= -0.99999901652339
##$FCOR= 0.5
##$FTSIZE= 32768
##$FT_mod= 6
##$GAMMA= 0
##$GB= 0
##$INTBC= 1
##$INTSCL= 1
##$ISEN= 128
##$LB= 0.3
##$LEV0= 0
##$LPBIN= 0
##$MAXI= 10000
##$MC2= 0
##$MEAN= 0
##$ME_mod= 0
##$MI= 0
##$NCOEF= 0
##$NC_proc= -5
##$NLEV= 6
##$NOISF1= 0
##$NOISF2= 0
##$NSP= 0
##$NTH_PI= 0
##$NZP= 0
##$OFFSET= 16.522
##$PC= 1
##$PHC0= -42.90439
##$PHC1= 3.932507
##$PH_mod= 1
##$PKNL= yes
##$PPARMOD= 0
##$PSCAL= 4
##$PSIGN= 0
##$REVERSE= no
##$SF= 250.13
##$SI= 32768
##$SIGF1= 0
##$SIGF2= 0
##$SINO= 400
##$SIOLD= 32768
##$SREGLST= <1H.CDCl3>
##$SSB= 0
##$STSI= 32768
##$STSR= 0
##$SW_p= 5175.98343685301
##$SYMM= 0
##$S_DEV= 0
##$TDeff= 65536
##$TDoff= 0
##$TI= <Analysis number 999999
Compound Code 99
Book Reference 9
Project Code 9>
##$TILT= no
##$TM1= 0
##$TM2= 0
##$TOPLEV= 0
##$USERP1= <user>
##$USERP2= <user>
##$USERP3= <user>
##$USERP4= <user>
##$USERP5= <user>
##$WDW= 1
##$XDIM= 32768
##$YMAX_p= 486695445
##$YMIN_p= -759718
$$ End of Bruker specific parameters
$$ ---------------------------------
##NTUPLES= NMR SPECTRUM
##VAR_NAME=  FREQUENCY,     SPECTRUM/REAL,   SPECTRUM/IMAG
##SYMBOL=    X,             R,               I
##VAR_TYPE=  INDEPENDENT,   DEPENDENT,       DEPENDENT
##VAR_FORM=  AFFN,          ASDF,            ASDF
##VAR_DIM=   32768,         32768,           32768
##UNITS=     HZ,            ARBITRARY UNITS, ARBITRARY UNITS
##FACTOR=    0.157963299565203, 1,           1
##FIRST=     4132.6476996994, 0,             0
##LAST=      -1043.33573715361, 0,           0
##MIN=       -1043.33573715361, -759718,     0
##MAX=       4132.6476996994, 486695445,     0
$$ Real data points
##PAGE= N=1
##DATA TABLE= (X++(R..R)), XYDATA
$$ [...]
23183b63492J20149Q93j6300q5362o5538J93222J20320Q9347K7282n1327k18932
23172a49738j77968L7546J26943Q2020K7980J15791J11038j49895r9558J76514
23162A00673J15481L3134L7338j71285j09472R0919j38526j95114K53626N4009
23152G0783k29789q3531J38018J84968j09209p1705j4900O4940k8191l4398p3841
23141a86855O7683q4085R5625J88044K00860j31734n7205l7227k19860r5761n3336
23130c13851J12319R3119Q06k0636J01975n8404j74133J23170L35821k5912J01355
23119B75629N9119q4896j02601L2856K06121k6096j11975J531P4971k38421J07590
23108A93828N3393Q9632R196K826K48715N11257P16414Q11004j32932q30035n99505
$$ y = [-263492, -143343, -142450, -158750, -244112, -309650, -116428, 3892, 93239, 120521, 69194, -149738, -327706, -290160, -163217, -81197, -53217, 62574, 173612, 23717, -75841, 100673, 216154, 249288, 286626, 115341, 5869, 96788, -41738, -236852, 16774, 70783, -159006, -242537, -104519, 80449, -28760, -100465, -115365, -50425, -78616, -113014, -186855, -119172, -203257, -107632, 80412, 281272, 149538, 92333, 55106, -164754, -260515, -313851, -201532, -108413, -107607, -128243, -26268, -84672, -258805, -135635, 200186, 174274, 275629, 334748, 249852, 147251, 180107, 386228, 360132, 248157, 249688, 324659, 86238, 193828, 247221, 336853, 346049, 348875, 597590, 1108847, 1825261, 2636265, 2503333, 1673298, 1073793]
23097A073793k54638j19191J1160k08226j48198J1912j45814J29808J36126j63836
23087C22896k23549r0939N9487k30386k57358M7659J20569J22094O1953J50731
23077H3157K9433j05653j25063J57132J22324J53240m6218j23028j26501q824
23067I999N6652P433J12566m599j55147J09868p8122J24573m5955J82788J8473
23056C38529o6671Q2842L5568j46607p1768k3150J96496p291k05604j38418j719
23045g793R0002k9542J9734k45642k11909J72026R4988J13572J31232J9325n8927
23034H7066j49342l3165m4400m843k7743P1722j09878j30874j85956M3670K72714
23023b11029L47371R0356J6907P1561m059j46794Q3648j44308j8386P3400K08457
$$ y = [1073793, 819155, 699964, 711124, 502898, 354700, 366612, 220798, 350606, 486732, 322896, 99347, 8408, 67895, -162491, -419849, -372190, -251621, -129527, -67574, 83157, 112590, 6937, -118126, 39006, 161330, 314570, 268352, 145324, 18823, 9999, 66651, 74084, 186650, 182051, 26904, 136772, 58650, 183223, 137268, 320056, 338529, 271858, 354700, 390268, 243661, 171893, 148743, 345239, 337948, 132344, -6074, -7793, 82209, 52667, 72401, -173241, -385150, -213124, -118136, -4564, 126668, 145993, 87066, -62276, -95441, -139841, -144684, -172427, -100705, -210583, -341457, -527413, -483743, -211029, 136342, 226698, 243605, 315166, 311107, 164313, 247961, 103653, 85267, 158667, 367124]
23012C67124m3463k08427m4461p5551O0701N9319K5362j3858O5935r83o3208j38143
23000i653m9336R5660j20188q8222M5318L18468p9302m7512M7516j10945O8306
22989G0110J2466j39994j46914J2044J80998J36646J18637j60424j37189l6001
22979h9621J03507j31768J41728Q5457L8676q7420R6884J61860L634l1467k29357
22968F2113l4338J35179J22541j51198j00878R2842j11524k18331l534K5806N2219
22957a29103n4139L1098j2083j0657K142k45471o1550K97267J59203o6845L0116
22946f0022J95601J25045J7060j19631k02960n8717r8340j04911J32869j6772
22936a90778K7407J12601q9287j1414k44979k40589L08378J37436J62817J10998
$$ y = [367124, 323661, 115234, 70773, -4778, 55923, 115242, 140604, 126746, 192681, 191698, 128490, -9653, -58989, 36671, -83517, -171739, -126421, 192047, 112745, 65233, 112749, 1804, 70110, 82576, -57418, -204332, -192288, -11290, 125356, 243993, 83569, -53620, -89621, 13886, -117882, 23846, 109303, 147979, 60559, 157443, 319303, 322937, 291470, 62113, 27775, 162954, 285495, 134297, 33419, 126261, 14737, -203594, -207128, -181322, -129103, -183242, -152144, -164227, -174884, -172742, -418213, -479763, -182496, -23293, -90138, -60022, 135579, 260624, 277684, 158053, -44907, -103624, -201964, -306875, -174006, -190778, -163371, -50770, -140057, -151471, -396450, -637039, -328661, -191225, -28408, 82590]
22926H2590O4707P0778l9155K0004K0365j42080J5780j28682j74927j82700j7113
22915d10433M94K44199L57493K17606r2356k45597q7475r1666l4447P7584O2312
22904b286P7399m4810j08704p3133J73402K2389j34117J05106N4601p4223j44539
22893a48915j3768J871Q7847J53304L9907j05252m997J59840N365l3486R3573
22882B35289q2680j09761k0823r9661j35793o7914N7413Q4575Q3295K00937O4386
22871B09263j4597j45246j12449l9634m7888K3441K71580N1106j39214m6841O9115
22860G8636L6528J302o3865K20619J20226J50432P123r6135j04412j33711n8979
22849A57764j2226J32046J13920q7073k06070j68013j45591O7233K07043k7204
$$ y = [82590, 147297, 218075, 178920, 198924, 219289, 77209, 92989, -35693, -210620, -393320, -410433, -409939, -165740, 191753, 409359, 317003, 71406, -16069, -107735, -142182, -64598, -2286, 75113, 30303, -78401, -151534, 21868, 44257, -89860, 15246, 69847, -4376, -148915, -162683, -160812, -72965, 80339, 120246, 14994, 9997, 169837, 175202, 141716, 235289, 152609, 42848, 22025, -77636, -213429, -281343, -223930, -139355, -56060, 144877, 209263, 194666, 49420, -63029, -102663, -150551, -127110, 144470, 195576, 56362, 9521, 78636, 115164, 116466, 52601, 273220, 393446, 543878, 551001, 454866, 350454, 216743, 157764, 145538, 277584, 391504, 304431, 98361, -69652, -215243, -148010, 59033, 31829]
22839C1829L490J65098j76621J15930J70347j33214r6674L027K079Q2028Q6946
22828B54265J42743j43726k51615q5099l0584M2927m4391r5753J9260J15622J08697
22817C2346R7335J1152r0314p1101r5563n448N8081P7920J05158r0603o7841J12044
22805G3166n4185P2740j63668N1614j36362p1246M3464J88862P6041R8886j68236
22794A1076l3247K7654j23155j21065k3896o5289j4444J16988L5768N8130j729
22783a33209N1650m1310J3851J71255M3786l3245k26109j61641J37467K16984
22773C9479J71372k0226J75458j27368j64212j82185L9758Q8547j07497P6047
22763a0827R7636K3430n0620M9876o758L05477J26510l17759k18795r489Q35j21615
$$ y = [31829, 35319, 200417, 23796, 139726, 310073, 176859, 80185, 83212, 85291, 167319, 254265, 397008, 253282, 1667, -83432, -114016, -71089, -115480, -211233, -191973, -76351, 32346, 129681, 140833, 50519, -20582, -116145, -121593, -63512, 14408, 119566, 28963, -38878, 73166, 18981, 91721, -71947, -20333, -156695, -227941, -184477, 4385, 80426, 179312, 11076, -22171, 5483, -117672, -238737, -262633, -327922, -342366, -225378, -189610, -131480, -133209, -81559, -122869, -109018, 62237, 106023, 72778, -153331, -314972, -177505, 39479, 210851, 190625, 366083, 238715, 74503, -107682, -67924, 20623, -86874, -10827, 86809, 110239, 59619, 109495, 102737, 408214, 534724, 216965, -1830, -11319, -10484, -132099]
22751a32099L2574l3341J22109P1445J22885o9093q6315j60160j33655l5111K68562
22740c2199J10239k4984M2107J21731J09043j42683M8453r1335k67173J18861
22730g940K40642R4698j81136k28848j48548m3057N8975J08619o5393j50129J1598
22719c10519M3843J0290n3393L5086M9555J14172J08018L31033K04480j47766
22709C84799j28525k17486o1777J26851k37658r0473O9564j0174r3799o0914r4099
22698d13691J07452L01254o1198j52871K414j29179k01878n7444Q3303J79194
22688c42644J92632J6594r4981j00239k2777J89453K21793K12592L6641N2980
22678C62044m3242K57k13j77676j31955J8886J4821k98j01225m9503J39046J11291
$$ y = [-132099, -99525, -132866, -10757, 60688, 183573, 114480, 28165, -131995, -265650, -300761, -32199, 78040, 53056, 95163, 216894, 325937, 183254, 231707, 140372, -126801, -7940, 232702, 327400, 146264, -82584, -231132, -274189, -215214, -106595, -171988, -322117, -310519, -266676, -256386, -309779, -274693, -225138, -110966, -2948, 328085, 532565, 384799, 256274, 38788, -22989, 103862, -133796, -224269, -154705, -164879, -258678, -319592, -413691, -306239, -4985, -66183, -219054, -216640, -345819, -547697, -605141, -521838, -342644, -150012, -133418, -228399, -328638, -351415, -161962, 59831, 272423, 309064, 362044, 318802, 319059, 318846, 141170, 9215, 28101, 42922, 42624, -58601, -108104, 30942, 142233]
22666A42233R042J62172p7172l9701M2139k3849k4206o915k03816j24204K70619
22655A26342j4773j81014k00566J81606J73367l19629j66245J62566J35065J62966
22645E9685N6142m8883J45757R7356n538Q158l1470j45666M2749J53503K07843
22634E39636O0214k65357n5948Q4532m1858J13308k29603k44564J0296J7317j6110
22623b8137K27703r462j90049l5422J47426L7144J09980J1560o4104k05745j881
22612i87J88650j2524o8595J52018L4044J3650J19369J47029O9142J64989K4293
22601H31078K67956N76438Q71590M84859o49531r23635n74637l00456k14151r8176
22591B71335r3244q4657J58965J40635j39985j17937j38060O9356R8951J11576
$$ y = [142233, 151275, 313447, 236275, 196574, 238713, 214864, 190658, 183743, -20073, -144277, 126342, 111569, -69445, -270011, -88405, 84962, -234667, -400912, -238346, -103281, 59685, 115827, 66944, 212701, 310057, 304519, 312677, 281207, 135541, 178290, 331793, 539636, 599850, 334493, 278545, 363077, 321219, 434527, 204924, -39640, -29344, -12027, -28137, 199566, 190104, 55, -35367, 112059, 149203, 259183, 270743, 206639, 894, -987, 187663, 175139, 106544, 258562, 292606, 306256, 425625, 572654, 641796, 806785, 831078, 1099034, 1675472, 2547062, 3031921, 2382390, 1458755, 884118, 583662, 369511, 271335, 178091, 93434, 252399, 393034, 253049, 135112, -2948, 66408, 165359, 276935]
22581B76935j58677J16527l2455J0914J6600R6566j50554N9003k5999O9351Q8755
22570C66966k04191o1379J23965K35962L13463J26987R5763n9156N3208J1454
22560A003042j25436m6799p1230j02229m9301R181K17041j8232k351Q4920m1616
22549H56990k40565k6486J18616m1325J48842L2211J09074J26071L24062K85409
22539A692899K05400J7271J95627P7362J82686N63418K27775r2204J80442L74280
22529C624956M95918M51830Q50118R99815J008117J291984J714238K487635L206318
22520A6130929M445028O708432J0186847J6889399K8201780M5279793P3324650
22513B01166858J22871481J48213763L783592j57044700j39791019p5848271l8282252
$$ y = [276935, 118258, 234785, 202330, 213244, 229844, 326410, 175856, 234859, 208860, 278211, 366966, 162775, 101396, 225361, 461323, 774786, 901773, 997536, 938380, 991588, 1003042, 877606, 830807, 759577, 657348, 608047, 617228, 834269, 816037, 813686, 898606, 856990, 616425, 589939, 708555, 667230, 816072, 848283, 957357, 1083428, 1407490, 1692899, 1898299, 1915570, 2111197, 2188559, 2371245, 2934663, 3162438, 3070234, 3250676, 3624956, 4120874, 4572704, 5422822, 6422637, 7430754, 8722738, 10436976, 12924611, 16130929, 20575957, 27284389, 37471236, 54360635, 82562415, 127842208, 201166858, 324038339, 472252102, 476035694, 318990994, 179199975, 103351704, 65069452]
22506F5069452j9519815j1173755p866006o368046m836461l161424k028736j655962
22498H459247j510196j044760p86831n23713l11022k04040l88090n24268p07700
22489B458627m32004k51786l54400j30489m9692o6077j16461J41612J11707j30492
22479A180545q0356j4676o8579k49465k29591L4988R4113P9079j13749j44535
22469D87774j40114J74531K8232n7824j66635j43592n7478P4372K19950J86424
22459F05640q4529j2443j14121o8790O6728N3586j43012m8565M7705q3330p9885
22448A38984P3366J16927R8449J322j60525M808O093j70378j60486k3790J22280
22437D7050K69302Q5720k1614p4639j50816Q8149K80613J4403J5231J28263K13984
$$ y = [65069452, 45549637, 34375882, 26509876, 20141830, 15305369, 12143945, 10115209, 8459247, 6949051, 5904291, 5117460, 4593747, 4282725, 4078685, 3690595, 3166327, 2458627, 2026623, 1774837, 1420437, 1289948, 1240256, 1174179, 1057718, 1199330, 1311037, 1180545, 1100189, 1085513, 1016934, 767469, 537878, 572866, 666979, 746058, 632309, 487774, 347660, 522191, 550423, 492599, 325964, 182372, 124894, 199266, 419216, 605640, 521111, 508668, 394547, 325757, 392485, 446071, 303059, 254494, 302199, 218869, 138984, 212350, 329277, 427726, 429048, 268523, 273331, 279424, 109046, -51440, -75230, 47050, 316352, 402072, 380458, 305819, 155003, 243152, 523765, 538168, 553399, 681662, 895646]
22426H95646L55992N21050P52862M42048p69406r72554m72388l09838j35467n1223
22416B56722Q1527j7866j51850n3957J86423O0055j59396R2914R1440L5640r0000
22405C31652j13914k36744J03595m7304R0058J36953N0972k52096o1627k7648
22395b6103J17262r0998j11873j34445J93521K86280J75074L9218j34136j49263
22385A64537q0908k16851L0972K9160N0505n0868j5195P3361O2711k4604J0062
22374C2882J31229M1045K8341K40230k42981k26206O9600P9482j62701j865k4350
22363c5294K13928J16791j8259o4492o197j54105p8534m9304j17515M1407O5147
22352h6427P8017k56194r9653J7612J97520J09005N5356J57834K180K971m3291
$$ y = [895646, 1251638, 1772688, 2525550, 2967598, 2198192, 1225638, 753250, 443412, 307945, 256722, 338249, 320383, 168533, 114576, 300999, 361054, 201658, 294572, 386012, 421652, 331652, 217738, -19006, 84589, 37285, 127343, 264296, 315268, 63172, 1545, -26103, 91159, 161, -111712, -246157, -52636, 233644, 408718, 447936, 313800, 164537, 83629, -133222, -102250, -73090, -22585, -73453, -88648, -15287, 47424, 22820, 32882, 164111, 205156, 233497, 473727, 230746, 4540, 74140, 153622, -9079, -10944, -35294, 178634, 295425, 277166, 212674, 206477, 52372, -26162, -75466, -192981, -151574, -86427, -8410, -264604, -364257, -346645, -149125, -40120, 15236, 173070, 175250, 178221, 134930]
22341A34930k22172j12337J14257j9445o5349M0946N4114j9662l0858m317j63446
22330b93339N6925L23732l4654J06287n9514j51302k8992J14756J97887j22747
22320A09039k33106r5481L03893l843j84650N2593O7513k31203j28697J81384
22310a62558P306r0583p0816j4759L1613J71980j11294L24382J44326j32112K05280
22299C02765P213j21636l8215j83610k01443K64077o2377l48m7674p3035K41246
22288H6963K65739N862j58554R8469J6947r6468r4300M7429l94799j86052K21904
22277a86860J21532p8989J89948L08974j23934k6069K12567N32k83449j17885
22267A6367K9328K40499J08010j55471p9600N91j39462o6001L609N9456J8449
$$ y = [134930, -87242, -199579, -85322, -104767, -170116, -129170, -75056, -94718, -125576, -129893, -293339, -236414, 87318, 52664, 158951, 99437, -51865, -80857, 33899, 231786, 109039, -124067, -219548, 84345, 80502, -104148, -51555, 15958, -215245, -343942, -162558, -155252, -245835, -316651, -331410, -299797, -127817, -239111, 85271, 229597, 97485, 302765, 309978, 188342, 150127, -33483, -234926, 29151, -33226, -33574, -81248, -154283, 86963, 352702, 358564, 200010, 298479, 315426, 218958, 124658, 172087, -222712, -408764, -186860, -65328, -144317, 45631, 354605, 230671, 204602, 417169, 417701, 134252, 16367, 45695, 286194, 394204, 238733, 159133, 159724, 20262, -45739, -42130, 17326, 35775]
22256C5775J86931j48557P2552K05105L1895j63958k14590j34477K9541J5553
22246h4230J62120P8530K1493N0984K6715k31970q6264j65581J59173K02157N4664
22235A87791Q5884m4021k78908j53970K21781K8027N3951N1311j0392N1735j16222
22224G6967l9407M8651m9898Q1302m4748j11115j6639j39887N050R4434J55424
22213F0134J34082J3914J24292j58319j89497R047J01908J05412J00377j03524
22203A97826k00298M2039K1421o0579r3057J480J4648P0309L7476O7383L934R244
22191A11826j57812k87539q8959l3180n6613J68510J09525p7653K4157J28071
22181a59667m6099Q7883P1973l5494q383J9388N4569j0007l7218m2296j04116
$$ y = [35775, 222706, 74149, 146701, 351806, 383701, 219743, 5153, -129324, -99783, -84230, 77890, 156420, 177913, 228897, 255612, 23642, -62622, -228203, -69030, 133127, 187791, 273675, 229654, -49254, -203224, 18557, 46584, 100535, 151846, 141454, 193189, 76967, 37560, 86211, 36313, 117615, 72867, -38248, -54887, -194774, -189724, -95290, 60134, 194216, 208130, 332422, 174103, -15394, -6347, 95561, 200973, 301350, 197826, -2472, 39567, 60988, 409, -92648, -91168, -76520, -6211, 31265, 98648, 102582, 111826, -45986, -333525, -422484, -455664, -512277, -343767, -234242, -311895, -287738, -159667, -205766, -117883, -45910, -81404, -89787, -70399, -15830, -25837, -63055, -105351, -209467]
22170b09467N6370J83218J37698L5452n7298q221j45030p2517l0614r0145p9281
22159b79835R9777L1179J30635n316j67200k44736j69884J17514K14418l6112
22149c09560j25140K58890J12824l010l5897M2606o1606N4635P2722j43782j17051
22138b54369j46797j22964J73826K8545J37393J20798j90944M5938L6999N5645
22128a15930l5007J39543J09115p816J8488J08452M1935M5597K4054q7046n0781
22117A90604n1128k7876M7188o969r5082o8183p4022p5133P7891O8525j42721
22106a56906K3692K73071m3928o3324j6141q9668q2549j24803L3679l8531K537
22095b82871L626N9137R465Q0244j80094J61545J28980j41875k76490O0355J37724
$$ y = [-209467, -153097, 30121, 167819, 203271, 145973, 137752, -7278, -79795, -110409, -200554, -279835, -180058, -148879, -18244, -23560, -190760, -435496, -605380, -487866, -273448, -309560, -434700, -175810, -62986, -65996, -101893, -59287, -120893, -66258, 6464, -137318, -254369, -401166, -524130, -350304, -321759, -184366, -63568, -254512, -208574, -171575, -115930, -150937, -11394, 97721, 89905, 108393, 216845, 258780, 304377, 328431, 241385, 190604, 139476, 111600, 158788, 151819, 56737, -11446, -85468, -160601, -82710, -14185, -156906, -133214, 139857, 95929, 32605, 16464, -73204, -155753, -280556, -246877, -285408, -282871, -279245, -220108, -210643, -130399, -310493, -148948, -19968, -161843, -438333, -377978, -240254]
22084b40254J555K0087J62402k3857q8068J52784J7892j16191o7172O3120K2326
22073i5376N5940K09650m3014n1347j1340L357j32088j28508j1985K7503P6591
22062a00617l6119l0637j316K30248J36771K14m3452o1203M1490P4756n5525o7299
22050H7311k48430j02712K66529L3261R4382r7472k29932j40520R2450N4551j3266
22039b03848M7819P8105L4934P4515j3849k34236j51667J20799o3090J69079M6770
22028i4669j2008j7644Q071L081Q3547n2659k09871O5221K28531M8751J63599
22017B13950r0352q753o7004N6042N6008J2656n3458M2718O4706k06764j0477
22006I272p7648m5572Q6919M5710q0498p4303o8683m9041M4720M7931o6768o1573
$$ y = [-240254, -238699, -218612, -56210, -80067, -168135, -15351, 2541, -113650, -180822, -117702, -95376, -39436, 170214, 127200, 75853, 64513, 67870, -64218, -192726, -204711, -177208, -100617, -136736, -167373, -168689, 61559, 198330, 198544, 155092, 93889, 135379, 210135, 154610, 87311, -161119, -263831, 2698, 35959, 130341, 32869, -197063, -337583, -245133, -190582, -203848, -156029, -77924, -42990, 31525, 17676, -216560, -368227, -247428, -310518, -141439, -94669, -106677, -124321, -116250, -113169, -29622, -82281, -292152, -226931, 1600, 50351, 213950, 123598, 114845, 47841, 103883, 159891, 172547, 119089, 161807, 226513, 19749, 9272, -68376, -113948, -27029, 18681, -61817, -136120, -204803, -253844, -209124, -161193, -227961, -289534]
21994b89534J85114l0906K2080O2398K2635o6176J40458K0327k65749L3589J94061
21983B8297j02208R8230r378l9693o1534o6092j04671q8925L7913R5486J24664
21972h7911N8690M412J07432J71409j99327n005L2871k02714k13448J1399L1800
21961b90392J73177K13553m8201K5142J88304M6840j83676J2944J67998O779j18434
21950A94034j88073k72562o4177K38077J20708n3695k02100j7183r0683n2183
21940c87837R1473Q6559m9503j41597L1664k25P6054J04679K46681m348j25221
21929g1621L5543N737Q0460J23043K6442o3510K15285K11031j20273j76171k0270
21918B45696M2610J85290M54169M16881R09360M24437o05103q45025n05874l64944
$$ y = [-289534, -104420, -135326, -113246, -50848, -28213, -94389, 46069, 66396, -199353, -165764, 28297, -73911, 24319, 14941, -24752, -86286, -152378, -257049, -345974, -308061, -212575, -87911, -29221, -24809, 82623, 254032, 54705, 49700, 82571, -120143, -333591, -322192, -290392, -117215, 96338, 48137, 73279, 261583, 308423, 124747, 137691, 305689, 312468, 194034, 5961, -266601, -330778, -92701, 28007, -25688, -227788, -244971, -335654, -387837, -296364, -209805, -259308, -400905, -369241, -369466, -293412, -188733, 57948, 53600, -71621, -36078, -30341, 50119, 173162, 199604, 136094, 351379, 562410, 442137, 265966, 245696, 288306, 473596, 927765, 1344646, 2254006, 2678443, 2073340, 1228315, 722441, 357497]
21908C57497k11501o0630j7565j73919l9648m517P9412P797P410j32774j12131
21897c00569Q6020N7389K25819k0077N652j35308Q9016m7572M0926k2641n7716
21886g9061J69165K23157j16641j90114P3883L3069J18578K1558O0725k1943j28341
21875A64035K4517j42064j01266L2940r484J99908M4424q3179l5771J1740l385
21864A02415j4372N0558N486p3719N1166J67464k9248k77664j03561N5589j11259
21853a77145j48291m4587J94097K04413O3441O1467j98128J17850R106j56904
21843g4681r3749j50842l5413m6504M9653M4566N0544K25607L5095r3681j04452
21832a93857J31081J3066L82894k4872k85113k17144J8102P1137K6697o8256J23121
$$ y = [357497, 145996, 85366, 67801, -106118, -145766, -150283, -70871, -63074, -55664, -188438, -300569, -214549, -157160, 68659, 48582, 54234, -81074, 7942, -39630, 1296, -21345, -79061, 90104, 313261, 196620, 6506, 80389, 113458, 232036, 253594, 314319, 292376, 164035, 188552, 46488, -54778, -21838, -31322, 168586, 213010, 129831, 94060, 105800, 102415, 88043, 138601, 144087, 70368, 121534, 288998, 259750, -17914, -121475, -65886, -177145, -325436, -370023, -175926, 28487, 91928, 153395, -44733, 73117, 82223, -74681, -168430, -319272, -354685, -401189, -351536, -306970, -256426, -30819, 4276, -89405, -193857, -62776, -49710, 333184, 308312, 23199, -193945, -175843, -104706, -78009, -146265, -23144]
21821b3144k45307m2604L00709K58759N665j28938j07591L1937O1546j52560j52932
21810a94460K1815O9680K27049J11137j80583J9176Q4483J17200q8774o2060m3027
21799H1636j26033j01382J7199P3624m7235J05216j0193o4075J49781P1148j73995
21788b4309j80293J58854j8131k01317n603O4299P8690n5265p4814J20824R6486
21777d0579J65039N5533j12727j29189R1377p2490k72804K62473J47162M6798
21767A40593K4830M2811j19415R4034Q1868j34195j1346K7858j61694J4561K0654
21756B0559l2178M2890N9023J20739P3972j23255j29948j62069j6354K02012Q0206
21745A35597L06637q7273k54637j24184k606O748j6797j12372j34103m7192J97115
$$ y = [-23144, -268451, -311055, -10346, 248413, 254078, 125140, 17549, 49486, 111032, -41528, -194460, -172645, -102965, 124084, 235221, 54638, 73814, 158297, 275497, 186723, 124663, 81636, -44397, -145779, -128580, -54956, -102191, 3025, -7168, -71243, 78538, 149686, -24309, -204602, -45748, -63879, -265196, -270799, -206500, -127810, -183075, -257889, -137065, -40579, 124460, 179993, 67266, -61923, 29454, -43036, -315840, -53367, 93795, 140593, 165423, 208234, 88819, 182853, 264721, 130526, 119180, 147038, -14656, -95, 20559, -11619, 31271, 90294, 211033, 285005, 161750, 31802, -130267, -146621, 55391, 135597, 442234, 354961, 100324, -23860, -26466, -19718, -36515, -148887, -282990, -330182, -133067]
21734a33067l74224P8034L14981J55471J16208J73795q9574r7874l16829M2526
21724a30553K26957L2828j76456j87538j86096J53039K75497J6310j25408p8325
21714a79745j1292J88384K50463P392N2526j81415j25101j395J02251p4768l4549
21703g249J46958j93314m5396J7932m248N8733M6006j94634o1333J46531J25022
21692C5008Q7141R4276J95188j07780m59656j78624K34805J13856P5520P7309
21682A67043l8569q4901L4271l9965J2692J9362J46075q1750k22863J15269P9992
21671A06656q6978n8137j19107j31775P7503K76225j30630l06425M9881R0053
21661b32734J31665J77893K47018j55963l17478j23001j23026o2956J09176Q9925
$$ y = [-133067, -507291, -429257, -114276, 41195, 157403, 331198, 241624, 143750, -173079, -130553, 96404, 129232, -47224, -234762, -420858, -267819, 7678, 23988, -101420, -179745, -191037, -2653, 247810, 255202, 307728, 126313, 1212, -183, 102068, 27300, -7249, 139709, -53605, -99001, -81069, -85317, -26584, 19422, -175212, -236545, -90014, 35008, 122149, 216425, 411613, 303833, -155823, -334447, -99642, 14214, 89734, 167043, 128474, 43573, 77844, 37879, 50571, 69933, 216008, 134258, -88605, 26664, 106656, 19678, -38459, -157566, -289341, -211838, 64387, -66243, -372668, -322787, -232734, -101069, 76824, 323842, 167879, -149599, -272600, -395626, -458582, -349406, -259481]
21651b59481j00236p067R3106M361K0867J80770K12147K3928p6340j40705J18182
21640F9532m7876j59042j25724N7616Q8979J04066J27921q1473j48579K34145
21630A19565Q8645j76474p8074J73061J12999k30860j60259q041R0505O9394n7289
21619e6828j25462j28234k3235q8961j3357J5719P3310J79004J75885m271K1495
21608B5065P3064j64427q3127p70j19979o4601q285j64320q8544K60453R1165
21597b44306l7595O0621M4828J68240j13151j53824R828K77170K80584o7037M5134
21586B70492Q7121j09636j03548j37125r4663R6434k5855P6486J02035j35213
21576B6528k0767j86381M2688J19757o9032o9821j36378J45120M6910M3585m2468
$$ y = [-259481, -359717, -366784, -273678, -269317, -248450, -67680, 144467, 168395, 92055, -48650, 69532, 21656, -137386, -263110, -205494, -116515, -12449, 115472, 33999, -114580, 119565, 208210, 31736, -46338, 126723, 239722, 8862, -151397, -159438, -68933, 461, -56828, -182290, -310524, -333759, -422720, -436077, -420358, -347048, -168044, 7841, 3570, 25065, 98129, -66298, -149425, -150195, -270174, -334775, -343060, -507380, -595924, -335471, -244306, -281901, -221280, -176452, -8212, -121363, -275187, -265359, 11811, 292395, 225358, 270492, 357613, 247977, 144429, 7304, -87359, 9075, -16780, 59706, 161741, 26528, 5761, -180620, -137932, -18175, -87207, -157028, -293406, -148286, -101376, -57791, -100259]
21565a00259n1511j35697J75990J19322j37434J69627L4707j8330K9895r6560
21555a0250j76695J1526N3002J57095Q3230j16762j53765J43334R0704N5555k00098
21544f3124L566J58932K25840J8897K732Q3638K59825r9046j03045p8070j65371
21533B44774p4915k48091j30677K64197J76961j07824j66954P7046K10591L4677
21523B79785j06839l7269k51699j26282J47307O3501k10720k47553L23286K18860
21513E2377p3597K15467k6678q3265K03551J20373k73839j69901n278p9429j61912
21502b82131j51761P8646K66718J11197j5819M1814J9424j94434J516R7708m1
21491b7163R9194r6296n0115l4733O0392J44511p918q7197l5303j7506J41674
$$ y = [-100259, -151770, -287467, -111477, 7845, -129589, 40038, 74745, 56415, 86310, -10250, -186945, -175419, -122417, 34678, 117908, 1146, -152619, -9285, 81419, 136974, -63124, -59558, 99374, 325214, 344111, 346843, 430481, 690306, 591260, 488215, 410145, 244774, 169859, -78232, -208909, 55288, 232249, 124425, -42529, 34517, 245108, 279785, 172946, 135677, -116022, -242304, -94997, -31496, -242216, -489769, -166483, 52377, -21220, 194247, 167569, 84304, 287855, 408228, 134389, -35512, -40790, -120219, -282131, -433892, -355246, -88528, 22669, 6850, 48664, 68088, -126346, -124830, -27122, -27163, 72031, -24265, -74380, -109113, -48721, 95790, 87872, 675, -34628, -52134, 89540]
21480H9540l5993K8199j36529j23580J9338p4758j80771K5496K76842J5261m1431
21469a38386m4450P484J99084K76011q6120p5852Q1471j82605O2185J17005J1644
21458B27471M856p0691o1895m2224j33603R6708n3644J20621P4142j00787k47418
21447a86464N0325j3659M3707K49635J08302k3310k59838q6644O9265l543q6648
21436a38872J64074O7769L9575j22488j20995Q5286m3122m4325M9334L3060J35723
21425A05019J42142j64649k17273o3383o0907L16278J50989j8208J0929j43715
21415E7222j62220o0254J24576J6008p4100J26716m4329q0832R1601q6124J39529
21404D7793K80011p57m2838N2784K184k74737k25410l0241L2605M24620L7192
$$ y = [89540, 53547, 81746, -54783, -178363, -159025, -233783, -414554, -389058, -112216, -96955, -138386, -182836, -175352, 23732, 299743, 213623, 137771, 219242, 36637, 98822, 215827, 227471, 232327, 161636, 99741, 57517, -76086, 20622, -33022, 87599, 161741, 60954, -186464, -136139, -149798, -106091, 143544, 251846, 228536, -31302, -117946, -48681, -52224, -138872, 25202, 92971, 132546, 10058, -110937, -25651, -68773, -113098, -63764, -30704, 105019, 247161, 82512, -134761, -198144, -259051, 57227, 208216, 190008, 200937, 57222, -104998, -165252, -40676, -24668, -98768, 27948, -16381, -97213, -5612, -91736, 47793, 327804, 327047, 284209, 336993, 339177, 64440, -160970, -191211, -158606, 266014, 303206]
21393C03206j84249J4202l5443k73861J2817P6041J24700J51329j018K0133j19402
21382H8455j15641r850k4110o808m7441K0022K065Q8526n1850P8011J32450l7163
21370A16666P2705J0502j43295r4295P4342J37290m6960j51672k6536L04276r419
21359B43604j36689j21726r6302j36279N9593j5758J9860M8354n4082j63453j95179
21348e48057P5619L50666Q2321J13201O0866j08702L9939k12332j20769Q5751
21338a81497J04722R154m9826K02998J3937q5230j2690q7619n3176k8945J31794
21327c6378J03348j4493r571J25354K18554J48529k94203k11519R8369J06903
21317B34893l5247j09124q9885r1691J25967K19233N3707J16636L2420l14719
$$ y = [303206, 118957, 133159, 97716, -176145, -163328, -87287, 37413, 188742, 187724, 207857, 88455, -27186, -37036, -61146, -67954, -115395, -95373, -93308, -4782, -56632, 21379, 153829, 116666, 189371, 199873, 56578, -37717, 36625, 173915, 126955, -24717, -51253, 253023, 243604, 106915, -14811, -111113, -247392, -187799, -203557, -183697, -135343, -189425, -352878, -548057, -472438, -121772, -39451, 73750, 134616, 25914, 65853, -146479, -267248, -181497, -76775, -67621, -117447, 85551, 99488, 14258, 1568, -86051, -139227, -168172, -36378, 66970, 52477, 42906, 168260, 386814, 535343, 241140, 29621, 127990, 234893, 199646, 90522, 637, -91054, 34913, 254146, 307853, 424489, 456909, 142190]
21307A42190k82427N1871n0688R4660r5838J01248Q8668L2236L1409j56008p1663
21296a14342j17812p6957J0266J62559J56685k4222m5227j98979p2619J21694
21286a98954J24528K28014P429j03920k7281m5020n8802o4632j48566j42715J92214
21275b37705Q0010L8885K9337O2991r4159j09442K5972K9369L3779j05306j12659
21264c58928m890J7808K9087J05796j47822J47370P9361J71490n9857n9583P7563
21253b605m6514J02631m0623r123j73782n2384R8459k5262k3608J18910o4952
21242a18853j6735J51673O8092r163O7665J20206k60290j95636R9613J34210n0116
21231i334m0958J77657m4667l06322j4956J22280J76764J93715j2930k76569r5887
$$ y = [142190, -140237, -88366, -139054, -44394, -140232, -38984, 49684, 81920, 113329, -42679, -114342, -232154, -309111, -298845, -136286, 20399, -3823, -49050, -248029, -320648, -198954, -74426, 153588, 161017, 57097, 29816, -15204, -74006, -138638, -287204, -429919, -237705, -157695, -118810, -89473, -26482, -120641, -230083, -204111, -174742, -140963, -246269, -358928, -363818, -346010, -316923, -211127, -358949, -211579, -132218, 39272, -20585, -80168, -2605, -49119, 53512, 12889, 3766, -170016, -222400, -123941, -149203, -172811, -53901, -118853, -135588, 16085, 84177, 75014, 142679, 262885, 2595, -193041, -93428, 40782, -9334, -50292, 127365, 82698, -223624, -238580, -116300, 60464, 254179, 241249, -35320, -131207]
21220a31207Q8702q3664O2799J57110j4419k31915l25958J49545R1815M110n6984
21209b90066o7242o2811p711J98237K61155M8350j0732J28379j60014L6224p2693
21198A076N1079j2203p202k61373j22915Q5732L9835L7914j37683J76540J14053
21187c5147M5348P0466J2250j12544j74047j924M2983K22464J16553p2414k0782
21176I3206j47795O7725j59688j10858J11214M1648l8968N9982K02532p4466J79241
21165B23773K39766m889k56299m4972M3702o8234j27372j12430P2473P1951n5326
21154a7857J02361J12044N8366l48439k42229J28130J30554N7603L9088k7141
21144g520m9050k9915k0678M2913p8226K9887P9749p3428j8403J54563N6380K2672
$$ y = [-131207, -42505, -126169, -63370, 93740, 79321, -152594, -478552, -329007, -237192, -233082, -290066, -357308, -420119, -427830, -229593, 31562, 79912, 69180, 197559, 37545, 73769, 1076, 52155, 39952, 32750, -228623, -351538, -265806, -225971, -188057, -325740, -149200, -35147, 10201, 80667, 92917, -19627, -193674, -195598, -152615, 69849, 186402, 113988, 93206, -54589, 13136, -146552, -257410, -146196, -104548, -143516, -83534, 118998, 44532, 223773, 463539, 458650, 202351, 157379, 201081, 132847, 5475, -106955, -34482, 37469, -17857, 84504, 196548, 254914, -93525, -335754, -207624, -77070, -19467, 19621, -7520, -56570, -86485, -107163, -64250, -142476, -112589, -32840, -106268, -124671, 29892, 86272, 108944]
21132A08944l9345p4254m314r4191m9170K977J89278J12920r8587q0432r1226
21121a17400k04953Q24J63330K9298j6404J34816L0354k3874p9531j90077j57297
21110d30914r2528k2683J14555J74278J07145n325J5248j04316J9682J47007J3177
21099f4674J22338M9035p675L1340p2997j31259p330k52832j28715J3751J05142
21088c43876L21435o8975q193j16385j9509J29569L3492M0311m8364J24140l2204
21077A1441R4913j59760m1703J48526Q9339j0001K1769j2247m030J32273O5031
21066C35551l626J20475j71007o9045n7016j36282K2660J89154j46162M271J55375
21055B44348p7717j83614k62131N6011N6458P1058L4393j48499p8428J75444K03266
$$ y = [108944, 69599, -4655, -8969, -103160, -152330, -149353, 39925, 152845, 54258, -26174, -117400, -322353, -321529, -158199, -128901, -145305, -10489, 19865, -4009, -83540, -273617, -430914, -523442, -546125, -431570, -257292, -150147, -155472, -140224, -244540, -224858, -77851, -64674, 57664, 106699, 99024, 130364, 57367, -73892, -81222, -334054, -462769, -449018, -343876, -22441, -91416, -99609, -215994, -235503, -105934, -72442, -32131, -80495, 43645, 11441, 106354, -53406, -95109, 53417, 142756, 132755, 154524, 142277, 138247, 270520, 335551, 331925, 452400, 281393, 212348, 155332, 19050, 41710, 230864, 84702, 88973, 244348, 166631, -16983, -279114, -223103, -166645, -95587, -61194, -209693, -288121, -112677, 90589]
21044I0589j40638j9085K57807q7788k5906p5282o2037j86639m6886j04207J66098
21033b33974L14144K3229j45834j47149R8314J0895j06932j57330r1558m0234
21023d76429J13407R6551M4767o3893J03804K4172o0776j030N3751R3503j29900
21012b02073k1770Q4413j7436P2389o2005j458J90033J67112n1666j43252q6771
21001g2484m2880O9618J24810K23861J35186j48666k73067k20985j18594j4008
20991c37209R4117p7952k4310J47255K0444Q2143J08942J52011k34607j20853
20981a90019J85978J04014J39615r2909P3165P349m8886j88041l940k76057J7113
20970b72618J51233k2476J02969J28115J48765R6416j05855l77553j1896J26752
$$ y = [90589, -50049, -69134, 188673, 100885, 74979, -303, -62340, -248979, -295865, -400072, -233974, 80170, 103399, -42435, -189584, -91270, -80375, -187307, -344637, -436195, -476429, -363022, -266471, -221704, -285597, -181793, -157621, -218397, -219427, -165676, -72173, -202073, -223843, -139430, -156866, -84477, -146482, -147940, 42093, 209205, 157539, 14287, -72484, -115364, -45746, 79064, 302925, 438111, 289445, 16378, -204607, -323201, -337209, -243092, -321044, -345354, -198099, -177655, -95512, 13430, 165441, -69166, -190019, -4041, 99973, 239588, 146679, 219844, 227193, 178307, -9734, -13674, -289731, -272618, -121385, -143861, -40892, 87223, 235988, 332404, 226549, -151004, -162900, -36148]
20960c6148K47354q1362j02535m71N1362l63677k99275J38756K37471J08112J43326
20949D2913j07743K1038j2261o4178J03206l9655L6940J57943R681l1351j33474
20938a6941Q3589q0777m7445r0022m5767j64408J58309L07863O7515k0538j37326
20927A4052j02985O7318N1542k5044Q3657J190J7372J7238j38026n5265J06071
20916C7120o1180l23192L0831J72586k14719j74341K57199J32527j04738j13525
20906c61432L8175J02991L65243j2055p403k18219l1807J46673K6754R0593k20300
20895h0787n1881J16290K6148p8005l4385K28514R3307O1167R2122k02629j53365
20884A6496p0889Q9520P3245J05780j11398q9468O0319L373K7932m9889n8592
$$ y = [-36148, 211206, 129844, 27309, 26838, 78200, -285477, -584752, -445996, -208525, -100413, 42913, -64830, -43792, -56053, -120231, -17025, -56680, -19740, 138203, 147884, 116533, -16941, 66648, -14129, -61574, -151596, -197363, -361771, -203462, 104401, 171916, 151378, 14052, -88933, -21615, 29927, 4883, 88540, 89730, 107102, 124340, -13686, -68951, 37120, -24060, -347252, -316421, -143835, -358554, -532895, -275696, -143169, -247907, -361432, -323257, -220266, 144977, 132922, 125519, -92700, -124507, 22166, 48920, 139513, -80787, -132668, -16378, 9770, -68235, -102620, 125894, 219201, 280368, 372490, 169861, 16496, -54393, 35127, 108372, 214152, 102754, 13286, 73605, 76978, 104910, 55021, -3571]
20873c571K2711r2832k91546o9811J4851P3680J49246J76211J00233n5324j04016
20862h0168J02851R5302P0588o303o0341j90341j14956J25106J96436K9763j54687
20851A3250r8671j3048q1926j9834j5894J5522q018m5320K17532N1828L9026J2091
20839F6538j41044K9096L0816O9766j36909j07238K806N7921P2767j12982K02861
20828C4398J34713k0784j53703j86988N4076p351q6952J79502J72507r0275l9417
20817a0274Q0846N9820k81432j76916J50070K56528o036l812j6664J13957J3201
20806A79288k6170r9535j22450q0744m16L2565P5333K17559J21484j31095l7765
20795A28054L4199j09399l704k3458J40548m2871M3803K8490q859j90098k10875
$$ y = [-3571, 19140, -73692, -365238, -435049, -420198, -346518, -197272, -21061, 79172, 23848, -80168, 22683, 117985, 188573, 182270, 121929, -68412, -183368, -58262, 138174, 167937, 13250, -85421, -98469, -180395, -200229, -216123, -200601, -208619, -253939, -36407, 15421, 54447, 66538, -74506, -45410, -14594, 55172, -81737, -188975, -186169, -128248, -55481, -168463, 34398, 169111, 148327, -5376, -192364, -138288, -145639, -232591, -53089, 119418, 29143, -10274, 70572, 130392, -151040, -327956, -177886, 78642, 72606, 68794, 52130, 166087, 179288, 153118, 53583, -68867, -149611, -150027, -117462, -42129, 175430, 296914, 165819, 128054, 162253, 52854, 49150, 25692, 166240, 123369, 167172, 195662, 186803, -3295, -214170]
20784b14170j55469o1399j7192L32333J65958j13811k58087j93982J94171L797
20774c17851K7594O1827K4770p8773J37976J29125M1940J75115p4123K19238J04391
20763D51229k00116j60426r4730q9863j5901Q191P4907J22271p6801l0986j8642
20752c0867j83363J75969l8835j32521J90476Q8857m616p6702J3790k52176j7670
20741b67658P0121K86475J33775j63916J1108J28786J7591R876r6878m01475l7031
20730c09226J11068P6557O1058R7535m8618k41613j1725K90634J44918j05585
20720F5003N2698Q2084Q6960l28929J48461l3096j57296Q460N3219K4439J19245
20709A21248k64220P4138J15508j68867j6096R778j7110P3820J46961N5907j22704
$$ y = [-214170, -369639, -431038, -448230, -115897, 50061, -63750, -321837, -515819, -321648, -317851, -290257, -228430, -203660, -282433, -144457, -15332, 26608, 201723, 127600, 346838, 451229, 251113, 90687, -4043, -93906, -109807, -101616, -26709, 95562, 18761, -12225, -30867, -214230, -38261, -77096, -209617, -19141, 69716, 65100, -11602, 2188, -249988, -267658, -197537, 88938, 222713, 58797, 69905, 198691, 216282, 226158, 129280, -272195, -309226, -198158, -121601, -60543, 36992, -11626, -253239, -264964, 25670, 170588, 65003, 117701, 199785, 286745, -42184, 106277, 73181, -84115, -75655, -22436, 2003, 121248, -142972, -68834, 46674, -122193, -138289, -128511, -145621, -71801, 75160, 131067, 8363]
20698H363j20907m8819m5358P7397m2809K3444l654j04067n2748K27599Q9855
20687H296q7260j31880o7143J28882J11731k8384k7858J19298l13j79303j24403
20676b78337J481K45016J40845r3085J28278J6316j08590j62693l3882j93173
20666c37824J68280L04568j20566n2556l0196m1234J8856l2750q5198Q4472q5145
20655b09293K9121o9919j56097o45J38464N9260m3750k28281j50636Q7449K24537
20644c19790Q6854R476K7807O4859j806j31688j492K19650J78903J75634J28526
20633D36933k0303q3430j37729l9314J11572R7620o9594j99676j28853J02313
20623F9539J72602J20677J5357n4504P0296j97011m29063j47815Q6769J45848
$$ y = [8363, -112544, -161363, -206721, -129324, -172133, -148689, -152343, -256410, -309158, -81559, 8296, -78964, -210844, -277987, -149105, -37374, -65758, -93616, 25682, 25369, -153934, -278337, -276856, -31840, 109005, 15920, 144198, 160514, 51924, -110769, -144651, -337824, -169544, 135024, 14458, -38098, -68294, -109528, -90672, -123422, -208620, -124148, -209293, -180172, -250091, -406188, -406833, -268369, -209109, -252859, -481140, -631776, -544327, -319790, -232936, -223460, -195653, -130794, -132600, -264288, -265780, -46130, 132773, 308407, 436933, 416630, 333200, 195471, 156157, 267729, 365349, 295755, 96079, -32774, 69539, 242141, 362818, 378175, 323671, 393967, 196956, -232107, -379922, -293153, -147305]
20613a47305l6144n7651N6579P444j52978J0362J8906J01159R7749K18739K2887
20602A39747k7324j3666n1809n0068J30955k27029p0376J7747O647J84553p8928
20591c9551K7737K19997M9374j586j47619k3470j70630j23461K30018j13313k63202
20580c55706N3445N9260k1283J09602J55430j76077j94131J23651J48624j45064
20570b42249j33245J23168L15633m3293l6785J15369J07035j99407j85147J09222
20560f9699R2983M0544O808j38471n5699M7498P8198m2105k12399R8q7218P689
20548c31773q0263K41361Q6199N5691K8629R7512J00229j74075M5781j9403l1333
20537A8555j31498k32875P7455M09142K70617j86228l439l1779n3659m5677k14011
$$ y = [-147305, -183449, -241100, -184521, -177077, -330055, -319693, -300787, -199628, -101879, 116860, 139747, 112423, 98757, 46948, -3120, 127835, -99194, -169570, -151823, -145176, 39377, -39551, -11814, 208183, 257557, 255971, 108352, 84882, -85748, -209209, 20809, -92504, -355706, -302261, -243001, -264284, -154682, 748, -175329, -369460, -245809, -97185, -242249, -375494, -252326, 63307, 20014, -16771, 98598, 205633, 6226, -178921, -69699, 23284, 63828, 70636, -67835, -123534, -76036, 2162, -39943, -252342, -252244, -339462, -331773, -412036, -170675, -84476, -28785, -156, 97356, 197585, 23510, 69291, 49888, 18555, -112943, -345818, -268363, 140779, 411396, 225168, 221729, 189950, 136291, 90614, -123397]
20526a23397k9549Q7242j41382Q2884K30426j3974j84142o2347K7927L25456J26882
20515C26026k74004R4228j12352r8890q4532o5523K98514m9476l6883l7549j44816
20504a85257j38216j474M6879M4468j15617J55217J8737j0004k0885M3388N652
20493a57112J28618K55525j45524j22196J24244k6879m0625K6227p769j9231o171
20482I107K28769j01109k02956j0648J37090J8700k4880L8533j0684j2269j73280
20471a03627K2553N3641k5938K2138J13760J35361J12121q3655j10843k45331
20461a09820j68452r4159m2777Q5972K43098K3217L3471J19066N9523J6615k6962
20450A38792J0535j69784j56601N9541J12889J29177K18879L883j44388k42876
$$ y = [-123397, -152946, -65704, -207086, -124202, 106224, 92250, -91892, -154239, -126312, 199144, 326026, 52022, 146250, 33898, -64992, -149524, -215047, 83467, 33991, -2892, -40441, -185257, -323473, -324947, -278068, -233600, -349217, -194000, -175263, -185267, -206152, -162764, -157112, -28494, 227031, 81507, -40689, 83555, 56676, 16051, 42278, 34509, 15278, 9107, 237876, 136767, -66189, -76837, 60253, 78953, 54073, 92606, 81922, 69653, -103627, -81074, -27433, -53371, -31233, 82527, 217888, 330009, 246354, 135511, -109820, -278272, -372431, -415208, -329236, -86138, -62921, -29450, 89616, 149139, 165754, 138792, 149327, -20457, -177058, -117517, -4628, 124549, 343428, 347311, 202923, -39953]
20440c9953j65776J29534K04392m2678l566J65991J808j43881n8876j65083K5266
20429i2822J42304n3162M7907J15531J77037p9195q4099j41676q2103j46757K21451
20418B4416K14873L27o2966k25392R7427P644o4785P4805J16216L7947L9047L9946
20406B99505J4279K9805j38679k93820N266K7427j11153L5045O5205m919j3522
20395h5561o2514K1406l6206k1486J25618L2759R1518O8121k09968j11286j44343
20384c31942K1154q9333J44130Q5108m7017k7064j85693n3417J04986J27214L0155
20373b21719J36266K3689j19804r0194k38253k8860J61413M2646o315K98712K91596
20362B49177j75278P4686j05897j00578k5208J61665q9370r8145J96335J21758
$$ y = [-39953, -205729, -76195, 128197, 85519, 81953, 247944, 249752, 105871, 46995, -118088, -92822, 49482, -3680, 44227, 159758, 336795, 257600, 173501, 31825, -50278, -197035, 24416, 239289, 239616, 176650, -48742, 48685, 56329, -8456, 66349, 182565, 220512, 259559, 299505, 313784, 343589, 204910, -88910, -83644, -56217, -167370, -132325, -67120, -72039, -85561, -148075, -126669, -162875, -184361, -58743, -25984, 65534, 133655, -76313, -187599, -331942, -310788, -400121, -255991, -170883, -217900, -244964, -430657, -484074, -379088, -251874, -221719, -85453, -61764, -181568, -271762, -510015, -538875, -377462, -334816, -341131, -42419, 249177, 73899, 148585, 42688, -57890, -83098, 78567, -10803, -108948, 87387, 209145]
20352B09145r8146l4409M429k3297j80220n9732M8275K3974R6220N7579j06846
20341f3028L8452O3147q4896R773J60770p3756q5456R1800P067k6012o9300j1796
20329d3235J68198J00566o9392o8964p4646J60025J85283L4274n2364r5844m08599
20318a64698l46883K30271K16170L0767R6371J0086j99957k03567j5033r1710
20308d38183l2754K10937L5917n5880Q7386j0755M235P2141k4996L4444J11153
20297f355Q8222j20350p4555J53106q4640O4550o268k7178J02769r4519K7581
20286B2363J75808J05849j54357m6466k23129o6403K49018P8431J3137J27722
20276B81973j41665q0423P549m2837k4472J1080P3753k23946L7605j07611L3555
$$ y = [209145, 110999, 76590, 81019, 57722, -122498, -182230, -133955, -109981, -13761, 43818, -63028, -24576, 38571, -46325, -36552, 124218, 50462, -34994, 56806, 63873, 37861, -31439, -43235, 124963, 225529, 156137, 87173, 12527, 172552, 357835, 392109, 339745, 243901, -164698, -511581, -281310, -65140, -34373, 61998, 72084, -127873, -331440, -346473, -438183, -470937, -260000, -224083, -279963, -192577, -203332, -199097, -126956, -151952, -117508, -6355, 81867, -38483, -113038, 40068, -44572, 19978, 13710, -13468, 89301, -5218, 22363, 198171, 304020, 149663, 103197, -119932, -186335, 62683, 141114, 154251, 281973, 140308, 59885, 67434, 24597, 125, 11205, 84958, -138988, -101383, -208994, -175439]
20265a75439O8223m3199k9051K25181m2692L0615J27674Q220j26083Q5308j11467
20254A7290j66507k59605K1111K34954P4827J43479J33669k08520j09915j4317
20244a33534J12441J66262p341j85742p480K05714j18242n8791K4572J16992Q8697
20233B03548j23017Q1331p6963K2970M0674N7788R8689r2731j16409K554k1663
20222G6771j2061J1632j13514j58062l5597J30152J94470Q2234J42612j40950
20212A77687j58145n7306j05271R3596J55046N810n0705r0956o0860j5277J79804
20201G3423O4870l4836J77437k48137j13879L8709Q9629j23498j1591J3907K1897
20190e2069J48960Q5878o9341j27618r6641O9481K31372P0992J54195J14562k32336
$$ y = [-175439, -107216, -150415, -179466, 45715, 3023, 33638, 161312, 169532, 43449, 128757, 17290, -149217, -408822, -387711, -152757, -77930, 65549, 199218, -9302, -119217, -133534, -21093, 145169, 137828, -47914, -55394, 150320, 32078, -26713, -2141, 114851, 203548, 80531, 161862, 84899, 107869, 148543, 206331, 305020, 212289, 95880, 98434, 76771, 64710, 76342, -37172, -195234, -230831, -100679, 93791, 176025, 318637, 177687, 19542, -37764, -143035, -49439, 105607, 111417, 60712, -30244, -91104, -106381, 73423, 138293, 103457, 280894, 32757, -81122, -42413, 47216, -76282, -87873, -73966, -52069, 96891, 182769, 113428, -14190, -110831, -41350, 190022, 261014, 415209, 529771, 297435]
20179B97435N3413J47480J02193o9537j98788j77014k17817j31166P3704K17905
20169I7808J08990K5418k35361n3627o1504r4537m5857O8479L8842J02194J17852
20158F8697J05102k20321k02410k9691N2780k0614k11331j24006J70783J23695
20148b87316m3697J31949M4317O2994J37090m8177m6899j55534o8744M4816J0723
20137b18478J42333l2382K5528m8282j642O7638M3306j05280Q649J3274l6064
20126a41400o3205q4762j1825J29089J72851m192m9117k30074O8693m2124K31585
20115b4481J66715J30860J04238l20289j92956p877N6446J89986j39500r4847
20105a31705O3860j13931M1753R9933n4289N3766J50807M9573l27657k03364K58615
$$ y = [297435, 350848, 498328, 600521, 530984, 332196, 155182, -62635, -193801, -120097, 97808, 206798, 232216, -3145, -56772, -118276, -212813, -258670, -190191, -151349, -49155, 68697, 173799, -46522, -248932, -278623, -225843, -246457, -457788, -581794, -411011, -287316, -331013, -199064, -154747, -91753, 45337, -2840, -49739, -205273, -274017, -229201, -218478, -76145, -108527, -82999, -131281, -132923, -65285, -21979, -127259, -118610, -105336, -141400, -204605, -289367, -301192, -172103, 748, -3444, -52561, -282635, -213942, -256066, -24481, 142234, 273094, 377332, 57043, -135913, -143790, -87344, 102642, -36858, -131705, -67845, -181776, -140023, -40090, -94379, -40613, 110194, 159767, -167890, -371254, -112639]
20094a12639M8280j17153j21936p9305n0572p2973J39159J98609J9389Q5617Q8899
20083B5375p7144K67848J83550o435q6285j07793k34047p7156L59389L04171n6847
20072D94626l1871j90644j19098J6219M939K8975M6049l01464j57182K8191M0892
20061a40368K9903J20778p4302p7081l5971j11830n928L01824Q7291m9994r8556
20050e4234J50110J3780J22980m271j02013J75863l1720k12543j22950o058Q829
20039f2227J27188K54742n8552j62088L9839J5006m2819L8693r8226j2113j7291
20028B2152J0239p6044j31527j18243R5241K09543J52150N1155j4558R4546j98149
20017I6505j04723L21000Q1363m5926k23151k23835q4690R2499r7337p7297M5187
$$ y = [-112639, -64359, -181512, -303448, -382753, -433325, -506298, -367139, -168530, -149141, -63524, 25375, -51769, 216079, 399629, 393194, 306909, 199116, -34931, -112087, 247302, 551473, 494626, 462755, 272111, 153013, 169232, 174171, 203146, 249195, -52269, -209451, -181260, -140368, -110465, 10313, -63989, -141070, -177041, -288871, -294799, 7025, 94316, 44322, -54234, 95876, 109656, 232636, 228365, 126352, 302215, 270495, 57952, -64998, -71056, -62227, 64961, 319703, 261151, 99063, 138902, 153908, 111089, 149782, 51556, 39443, 22152, 32391, -43653, -175180, -293423, -198182, 11361, 163511, 214666, 200108, 294654, 96505, -8218, 312782, 394145, 348219, 125068, -98767, -183457, -90958, -188295, -265592, -220405]
20006b20405M8868j6019m2988P4852J61352N2243J7960o706j8157J4608m3263
19995B2345k02567k30467j09292P4483P7141K61537J50515k17306k8815P570J8976
19984a75880K440K7659P9202q0763M683J06904j40010P6064J72391p899J46186
19973B10977m0490j72271N8632O7304P2482L253j74859j45489o4826K5304j39746
19962b99729n727K33313P1270P5581J52855k52625p3833l1390O6115J15242J41220
19951A92292j36630J54842R0060j43648j20858j15086p9722Q0335p4534Q6961
19941f5988L1416q5595K0643K8790j90973n0674K0896Q7080Q3272l071Q496Q7083
19929b8625q2545J0576J21505N3360J6271j8062k31546N5591N4736j67093r7940
$$ y = [-220405, -171537, -187556, -230544, -155692, 5660, 57903, 75863, 69157, 51000, 65608, 22345, -180222, -410689, -519981, -445498, -368357, -106820, 43695, -173611, -202426, -194856, -175880, -173440, -145781, -66579, -147342, -142659, -35755, -175765, -99701, 72690, 64791, 210977, 170487, -1784, 56848, 124152, 196634, 199887, 25028, -120461, -185287, -159983, -299729, -305456, -72143, -873, 74708, 227563, -25062, -98895, -130285, -64170, 51072, 192292, 55662, 210504, 300564, 156916, 36058, -79028, -158750, -78415, -152949, -65988, -34572, -120167, -99524, -70734, -261707, -312381, -291485, -204405, -121133, -124204, -115708, -28625, -111170, -100594, 20911, 74271, 90542, 72480, -159066, -103475, -48739, -215832, -313772]
19918c13772m9723K48347L94037q0863k09906l0568O877r474o5339J12654j29493
19907a27223K21933J68285R1986p3537j66124o5868Q1559p8552k05428j5694K89123
19896A20460K86167j31170k67590j49199J61849j3327k27277J12304J09780J10435
19886A12432N5039L8215j0862m7802j60956k10284o9421L7234O5702J74833J41279
19875A25409L2859p9163k45626j93275m7558R3460J65148J94896r1696K15099
19865A69553R942N9625n9427j54024r3970o6782k7086j60349P340K20268J84275
19854H9365j74016r5241M9944L036R0179q3953j21075j60881J20365M5046Q9231
19843a48000J27862P8679J09779l4304q6488m3557J51672p9035O2595j10753k52291
$$ y = [-313772, -363495, -115148, 278889, 198026, -11880, -42448, -35571, -45045, -110384, 2270, -127223, 94710, 262995, 354981, 281444, 115320, 49452, 131011, 52459, -152969, -168663, 120460, 406627, 275457, 7867, -141332, 20517, 7190, -220087, -107783, 1997, 112432, 167471, 205686, 194824, 147022, -13934, -224218, -293639, -256405, -190703, -15870, 125409, 158268, 79105, -166521, -359796, -407354, -313894, -148746, 46150, -45546, 169553, 179495, 239120, 179693, 25669, -68301, -135083, -162169, -322518, -315178, -94910, 89365, -84651, -179892, -129948, -126912, -36733, -120686, -241761, -402642, -282277, -237231, -148000, -20138, 58541, 168320, 134016, 47528, 3971, 155643, 76608, 139203, 28450, -223841]
19832b23841o8620R3276R0615P6228O3220j20507n4434j3092j64192R4535K85144
19821E8332J7717J27391J35742j27027q0654q7652j26871j31460P381Q711O3869
19810a34521N6684K93222J79474k68723l96171J40184K02760N5225o1494J5578
19800H2218j10626n8621m1045j2029J1185J03291J64804R2347l0585k17044j08296
19789a24401J8018K0551L5482K02906K856k5863Q5386j08928m8651k2058N2908
19778H8206p808n7076R8534Q9860K27366k589j86168l59430j37638M25841J71415
19767C50513j77528j31525K6477m4417M2772j29799l4037k2865K9626P0432m2788
19756f3139J20476J34042l2138k4689j10751j38646j66830o3581N7836n2805j13014
$$ y = [-223841, -292461, -199185, -108570, -32342, 30878, -89629, -144063, -157155, -321347, -226812, 58332, 76049, 203440, 339182, 212155, 131501, 43849, -83022, -214482, -207101, -198390, -134521, -77837, 215385, 394859, 126136, -270035, -129851, 72909, 128134, 66640, 82218, -28408, -87029, -128074, -140103, -128918, -25627, 139177, 231524, 200939, -16105, -124401, -106383, -85832, -50350, 152556, 155412, 129549, 214935, 106007, 57356, 35298, 88206, 80398, 23322, 121856, 211716, 439082, 436493, 250325, -109105, -246743, 179098, 350513, 172985, 41460, 67937, 23520, 66292, -63507, -97544, -120409, -90783, -20351, -63139, 57337, 191379, 159241, 134552, 23801, -114845, -281675, -345256, -287420, -340225, -453239]
19745d53239k13091K8106L38564J73617j57242R4934J7590J22617n4078K025j3349
19734a13546J72455L3551r9924r6013J06650N3389J43122Q8337j55004m5582K17457
19723C04892L7190K1678P4352j22636k23740k39524K1019J47276J95417M3120
19713B59044l5950k31136Q1938j93761O7453n2346p9547j2004J54985p0739k53820
19702c65883J8643K17065L18772j23207k74976j73227Q6047J80826Q2459j29388
19692a62869j37922P6742N8413J30347J18832o8584n8667J76120k2090K1249q5583
19681D5988j48040k7737j80128O036K29627J85508p8198j4707n9597k42868J12278
19670a71838R7366R1396J11615k0507N5490R985l1920P089j45369j14550K0828
$$ y = [-453239, -666330, -638224, -299660, -126043, -283285, -188351, -170761, -48144, -102222, -100197, -113546, 58909, 92460, -7464, -103477, 3173, 56562, 199684, 288021, 133017, 87435, 304892, 342082, 363760, 438112, 315476, 91736, -147788, -126769, 20507, 215924, 259044, 223094, -8042, 73896, -119865, -52412, -104758, -184305, -196309, -41324, -112063, -365883, -347240, -130175, 188597, 65390, -209586, -382813, -296766, -115940, -33481, -162869, -300791, -224049, -165636, -35289, 83543, 14959, -43708, 132412, 110322, 131571, 45988, -102052, -129789, -309917, -303881, -74254, 111254, 33056, 18349, -41248, -284116, -171838, -74472, 16924, 128539, 108032, 163522, 173507, 141587, 148676, 3307, -111243, -90415]
19659i0415M6204p7341j36648j39884J25262J14845N6915J46821J31907K17082
19649C94748k4131j11023k45024q9534R8959R8442J0821L8521j18427j16055j03329
19638a66032K53091R0382k30478j69343K6512M21405J791J9174k28342J2115j22415
19627i2140k93314J08751L08365Q7932O8797k81588j12113L5215J06608K03558
19617A40071k2831j38701j46990k4188P5582K38499K24337P4635M9700j56840
19607C13274l9880m5373j52951j117Q0736J87229k8675l09244l5874J65056J11404
19596B44585K81005L67447J47481k99313j17143k30607o3822J37255k6973k03265
19586B36650q5787O5K14594J30326K122j36503j75848j12166J88563J48835l8913
$$ y = [-90415, -44211, -121552, -258200, -398084, -272822, -157977, -101062, 45759, 177666, 394748, 370617, 259594, 14570, -74964, 23995, 122437, 133258, 171779, 53352, -62703, -166032, 87059, 177441, -53037, -222380, -195868, 225537, 227328, 246502, 18160, 30275, -92140, -385454, -276703, 31662, 119594, 188391, -93197, -205310, -170095, -63487, 140071, 117240, -21461, -168451, -192639, -117057, 121442, 345779, 420414, 470114, 313274, 273394, 228021, 75070, 73953, 154689, 341918, 313243, 3999, -31875, 133181, 244585, 525590, 893037, 1040518, 741205, 624062, 393455, 329633, 466888, 439915, 236650, 150863, 150928, 365522, 495848, 497970, 361467, 185619, 73453, 262016, 410851, 371938]
19575C71938N8975J8202Q0478R8277o3748q9992k00781j0412j6396R6470m2074
19564C00937N7029J56131K9948k27586l1302M652L9733J52505R7064j9143j18210
19553D41758J6368k450M8564j0388N9455o828O796Q3109P9917J82049k93028k54747
19541C50575j36388o9505J63619K94141j91009j62511o0364K22217J97275m8891
19531E59159j78051q5887J13975R3599m387N4124J71242m4827K0502J32668M2025
19520H74142l25324l18122m3201l9638k9940Q1620L599J34414J1573p5667j38316
19509A35140j82114J73415k8789m0231m3457L8726L7639l8023m3162j89536K25067
19498D4675K06763k2857J23029o7693j10626k6202n4967p4382J32235L9353j10706
$$ y = [371938, 430913, 449115, 529593, 627870, 564122, 474130, 273349, 262937, 246541, 343011, 300937, 357966, 514097, 544045, 316459, 285157, 289809, 329542, 482047, 579111, 559968, 441758, 458126, 455676, 504240, 493852, 553307, 546479, 553275, 636384, 716301, 898350, 605322, 350575, 214187, 144682, 308301, 602442, 411433, 248922, 188558, 410775, 608050, 559159, 381108, 295221, 409196, 502795, 498408, 552532, 723774, 678947, 699449, 832117, 874142, 548818, 230696, 187495, 147857, 117917, 199537, 203136, 337550, 349123, 273456, 135140, -46974, 126441, 97652, 57421, 13964, 52690, 90329, 52306, 9144, -180392, 44675, 251438, 228581, 351610, 283917, 173291, 147089, 92122, 17740, 149975, 189328, 78622]
19487G8622O6972l0508l730m1491J6563J14241J89495N3565l09167j93942n340
19476f4720p1955K33288N0221q2935K6695J3633m6835r0659j87455K9121K54955
19465F3354J71457O5325j52233l9818p9972k3444J7840q2823J38L6450J03420
19454G9694m7890N6256J7148j48087j07299M9285K01158O9196J55796j2298j009
19443C11950J22054j39361j95829O2844K5197p0015P0341Q8993K0711k36905j62992
19432a03012P1781M0667R381n3119p192M4939j1656J00832L3438J17855R5066
19421C38980j27430j00451j18851o0615L400P28J01265m4890j5227K36686q728
19410B04867l2469R7174j8133m2572J3012j1341j19404K35966r4573j52536k8218
$$ y = [78622, 145594, 115086, 111356, 69865, 86428, 200669, 390164, 443729, 134562, -59380, -64720, -136675, 96613, 146834, 63899, 90594, 104227, 57392, -33267, -220722, -191601, 63354, 234811, 300136, 147903, 108085, 28113, 4669, 22509, -60314, -60176, -23726, 79694, 31804, 88060, 105208, -42879, -150178, -100893, 100265, 169461, 325257, 312959, 311950, 434004, 294643, 98814, 161658, 186855, 116840, 187181, 276174, 296885, 59980, -103012, -31231, 9436, 18817, -34302, -41494, 3445, -8211, 92621, 126059, 243914, 338980, 211550, 111099, -7752, -68367, -64967, -64239, 37026, -7864, -23091, 213595, 204867, 172398, 269572, 251439, 208867, 221879, 210538, 91134, 327100, 232527, 79991, 51773]
19399E1773J62968j92254L3774J04382l824M5800J55718j84927k05524l059J20490
19388H5317J90250J57909J05092k3858l5338J9801j01928j60221l2678K8160m5186
19377A87320k04451J35536O8221m1485l0351N4596J89704J3456o725j8638J73824
19366E21007N36k30136k17473N326J87354J17962k9217l05727l22060l0303K50023
19355e2708J16502J36369Q9667L9115j90814j80533J7046O5390L3845q5256l8245
19344d9622P3342N0592j25952l5209M1163O7970K23551k6601r6815j797O2133
19333A82755o0453j25218m7766k22740k9687J93745O593n3962K55047Q3311J53133
19322C34758j60001j28896Q7768Q0369n0727k59692P5201J96522j40813j61110
$$ y = [51773, 214741, 22487, 56261, 160643, 156819, 202619, 358337, 173410, -32114, -35173, 85317, 275567, 433476, 538568, 514710, 479372, 499173, 397245, 237024, 204346, 232506, 187320, -17131, 118405, 186626, 145141, 114790, 169386, 359090, 372546, 365821, 347183, 521007, 521543, 291407, 73934, 79260, 266614, 384576, 355359, 49632, -272428, -302731, -52708, 63794, 200163, 289830, 328945, 138131, -42402, -25356, 40034, 73879, -11377, -49622, 23720, 74312, -51640, -86849, -45686, 22284, 245835, 219234, 122419, 120622, 182755, 122302, -2916, -50682, -273422, -303109, -109364, -102771, -156733, 98314, 181625, 334758, 174757, 45861, 133629, 213998, 163271, -96421, -21220, 175302, 34489, -126621]
19312a26621q1060r9412j13540K61066K05143J21101J40827j82550j12781L9620
19302E1793J07005L6197l532k33811J50670q652p2702j33112K0518J56552j914
19291F9012J98503J03054j15681J7277j17127l8288N2037j11142m2894N4503R216
19280G8470j26027j24829P8573j29716j01125n2872M8415K88658K12528K23947
19270C96022p7146j31243P8472J322j79041J2876r9435j41315J86452J56527k42558
19259c9067O2232K19314j9628K3300N851N4196P4942J90458m11206j82225L2435
19248A0602n5577N0851m1683J07320O8231j98363O63O5290J14020K86862P1735
19237D79951p4661j13090j38590k44851p6319J6938M741Q5461K57494r5317j3564
$$ y = [-126621, -207681, -307093, -420633, -159567, 45576, 166677, 307504, 124954, 12173, 51793, 158798, 194995, 191463, -42348, 108322, 99670, 26968, -106144, -85626, 70926, 69012, 267515, 370569, 254888, 272165, 155038, 116750, 168787, 57645, 14751, 69254, 78470, -47557, -172386, -93813, -223529, -324654, -377526, -329111, -40453, 172075, 396022, 318876, 187633, 266105, 267427, 88386, 101262, 1827, -139488, 46964, 203491, -39067, 23165, 242479, 222851, 246151, 252002, 306198, 381140, 571598, 160392, -21833, 10602, -44975, 5876, -35807, 71513, 139744, -58619, -57956, 7334, 121354, 408216, 479951, 405290, 292200, 153610, -91241, -167560, -150622, -145881, -60420, 197074, 101757, 88193]
19226H8193J42451K76733K00006o218k27242m26291j45458R8310K59615K20288
19216D80387k51637R1144J26625k0713J05988j73153O6787O2426R7212j11378
19206D73688j53596l8726j08949n0140J39334J83235j38205j72030J00298N9232
19196B94141O231j33609J42197l8663o962J04762k44884o6794j2822J98540O5408
19185C07545j70911O502J34888m4059r0426M491R4273J15102l08252P239K11386
19174B67778j6444J3738j9611M2127M5729J29556K2036k7597j51933L9167R1952
19163D36498J57664n3973j57213O2347J05059N284j35509k54790J08155M47759
19153G21281J75164q05j79668j38677q2824j04851l079J18980R7991K9620J50170
$$ y = [88193, 230644, 507377, 707383, 701165, 473923, 47632, -97826, 484, 260099, 480387, 228750, 319894, 446519, 425806, 531794, 358641, 425428, 487854, 585066, 473688, 320092, 281366, 172417, 122277, 261611, 444846, 306641, 134611, 234909, 294141, 300372, 166763, 308960, 270297, 263335, 368097, 123213, 56419, 43597, 242137, 307545, 136634, 143136, 278024, 233965, 143539, 148030, 242303, 357405, 49153, 56392, 267778, 251334, 265072, 245461, 287588, 333317, 462873, 484909, 457312, 305379, 344546, 436498, 594162, 540189, 382976, 445323, 550382, 555666, 420157, 165367, 273522, 721281, 896445, 895640, 715972, 577295, 494471, 389620, 386541, 505521, 603512, 633132, 783302]
19142G83302o0474L8403L354j86076j9433J272N4398j7681J06333O3907j50775
19131F16530l4919L74558P9534J5768K19710K87595K46308L28425N66677P09445
19121C409631L10532k35448o0527L81480M95439R87392J119217M51189m5742P18346
19111G531509J379048R24155p75890j444230j287619m29883L90060P96645J723647
19102H807442K328443J892425J423769J074435j744533k336094j127405r2179
19094A0226303R47617K137647L456351N244117P739509R457379Q764899J0740731
19086E8714553J9186989K8419418J1889332k1970305k7040900j9655436j0887820
19079C8655831l986391R38889N661387J1182896J3841219J411760o576125p27295
$$ y = [783302, 722828, 761231, 764585, 578509, 559076, 560348, 614746, 597065, 703398, 767305, 616530, 581611, 956169, 1035703, 1051471, 1271181, 1558776, 1805084, 2133509, 2700186, 3409631, 3720163, 3484715, 3424188, 3805668, 4301107, 5288499, 6407716, 6858905, 6813163, 7531509, 8910557, 9834712, 9058822, 7614592, 6326973, 5897090, 6287150, 7083795, 8807442, 11135885, 13028310, 14452079, 15526514, 13781981, 11445887, 10318482, 10226303, 11173920, 13311567, 16767918, 22012035, 29751544, 39208923, 47973822, 58714553, 77901542, 106320960, 118210292, 96239987, 69199087, 49543651, 38655831, 34669440, 35608329, 41269716, 52452612, 66293831, 67705591, 61129466, 60402171]
19071F0402171P114569Q303669J872247L081074J2394287J0649890j2892736k1148342
19063F9776829j2815906o677597j011212N600705J1973480J5963805Q570164r916298
19055H1463970j7991026j1303939l197917L142048R597252J6968763J9730180
19048I8409331L262133j5022389j1068359J711604J4685263J8029743p02943j7981909
19040I1322474j5354886m249483K990089j582119r337769p718706p15611P455845
19032F2809834R957174m836723j3255760o818354J798998R394030J4082462J7095036
19024I0226697K6196287K5782671j3915165l8590143k8006386j3531837m309247
19017D3852877j278890l894801o301920l487018j3351J068280l429514n559743
$$ y = [60402171, 67516740, 75820409, 77692656, 80773730, 93168017, 103817907, 90925171, 69776829, 56960923, 50283326, 49272114, 54872819, 66846299, 82810104, 91380268, 81463970, 63472944, 52169005, 48971088, 52113136, 61710388, 78679151, 98409331, 101671464, 86649075, 75580716, 77292320, 91977583, 110007326, 109304383, 91322474, 75967588, 71718105, 74708194, 73126075, 63788306, 56069600, 55353989, 62809834, 72767008, 67930285, 54674525, 47856171, 49655169, 59049199, 73131661, 90226697, 116422984, 142205655, 128290490, 89700347, 61693961, 48162124, 43852877, 42573987, 38679186, 32377266, 28890248, 28876897, 29945177, 26515663, 20955920]
19009B0955920m026467k192499j082805j91107j95160q42537n68060N60602J599212
19000A4017099J726421J207754K076899K454511q17824m189144m057687k254896
18992A0163133j031185l89677k64107j97138o84003m33475L32755Q90513P02596
18983I089412J27747j97346o00240r93793j212704o94811j27017K05634K32045
18974E828927M5546l98371p36548p89326l50083k93912p0171P310K11195N41233
18964C995800K79456J76295N23359N58890R53582J273237P7800j238144j016024
18955E584251n58705k75861m17673n90358n54173k23948L35391K79549N53855
18946D132328O79050J018452J153142J02952j170764j397951r56271o83817m95521
$$ y = [20955920, 16929453, 14736954, 13654149, 13463042, 13267882, 12425345, 11857285, 12417887, 14017099, 15743520, 16951274, 19028173, 21482684, 20664860, 16475716, 12418029, 10163133, 9131948, 8742271, 8478164, 8281026, 7597023, 7163548, 7496303, 8386816, 9089412, 9217159, 9019813, 8419573, 7425780, 6213076, 5518265, 5391248, 5596882, 5828927, 5874473, 5476102, 4739554, 3950228, 3600145, 3306233, 3236062, 3243372, 3454567, 3995800, 4275256, 4451551, 4974910, 5533800, 6487382, 7760619, 7838419, 6600275, 5584251, 5025546, 4749685, 4332012, 3741654, 3187481, 2963533, 3298924, 3578473, 4132328, 4811378, 5829830, 6982972, 7085924, 5915160, 4517209, 3560938, 2877121, 2381600]
18937B381600m40122j95598r6788j2587j18247K1553j19918n0978L4984N2335
18927A456234r3414k74358r7359J28241L03681J68815q1176k1465P2985j70565
18917A391619l15499k50686m2440o9848o9190K80460P6743M9063L2532j53130
18907I29624J2556K8511k71105m7098J6098J15826P8556N9261K5755j6556J34396
18896A065824j74504j85651l09004p2715J99305j15419j88431J8650R0417q543
18886C19929j25904L5257M0593q0260m0518Q352J05938R2795m0196n2891m71J99327
18874D61951J8420J1664Q3541j05812j08075l2717l559K1520J13812k9412q5462
18863C45871r0935l7351J29538j1417o2264j3745l9914K06770l0135j00829J0920
$$ y = [2381600, 1941478, 1745880, 1649092, 1636505, 1518258, 1539811, 1419893, 1368915, 1403899, 1456234, 1362820, 1088462, 991103, 1119344, 1423025, 1591840, 1510664, 1489199, 1562184, 1391619, 1076120, 825434, 782994, 713146, 643956, 924416, 1001159, 1050222, 1082754, 929624, 942180, 970691, 699586, 652488, 668586, 784412, 862968, 922229, 947984, 931428, 1065824, 891320, 705669, 396665, 323950, 523255, 407836, 219405, 238055, 328472, 319929, 194025, 229282, 269875, 189615, 149097, 157449, 263387, 356182, 315986, 263095, 262624, 461951, 480371, 492035, 575576, 469764, 361689, 328972, 325413, 346933, 460745, 431333, 345871, 254936, 217585, 347123, 335706, 273442, 259697, 219783, 426553, 396418, 295589, 306509]
18852C06509p5029L2732q7266n2394L268k4448j14712R0388j0706l6104O0962
18841I3200J29062j30854j08241l4803m3495K80114K11064j57391j46548P7235
18831A69343m1518j75130J12533n2731k15070o840L14377K63835J57651J01085
18821F27535J07096k37666k18151J20973m8954j51569j30676J14614K29686P092
18811D19980k01413j1644K7059j0273j2278n8583m2380P6216J08266q3117j46848
18800F4985P6519o0217r9941k0286j2107J41948Q5976L4715j28790M1258J2492
18789A36552l011J32825O2492K4698j013j25461n3352q1841N7711R3823k7839
18778B15584m3743k10792K8485L66892Q6447P1642L3054J43558K05103K38480
$$ y = [306509, 231480, 264212, 176946, 124552, 127820, 103372, -11340, 79048, 68342, 32238, 93200, 222262, 91408, -16833, -51636, -95131, 184983, 396047, 238656, 92108, 169343, 127825, -47305, 65228, 12497, -202573, -209413, 104964, 368799, 526450, 627535, 734631, 496965, 278814, 399787, 350833, 199264, 68588, 183202, 412888, 419980, 218567, 206923, 233982, 223709, 211431, 152848, 110468, 186684, 294950, 211833, 64985, 141504, 81287, -18654, -38940, -51047, 90901, 176877, 211592, 82802, 124060, 136552, 133541, 266366, 328858, 353556, 352543, 227082, 173730, 91889, 149600, 243423, 215584, 171841, -38951, -10466, 356426, 442873, 514515, 547569, 691127, 896230, 1134710]
18768A134710K34719N67949P93505P2382q07889o31324m79751j85438P6105j01766
18758F73202j89087j00533j29434N8020N4713J33221P4484j06954M2535J51679
18748F61846k46232k13093J36074J52603L1400J13178K95590N72452O95809P20614
18738B920241L74008m77376q59104o19855m75836j68400m4000m5183k82410o2042
18728B60043R2767J47338N5428j50589J10128J51197o6873k13509M7765J02464
18718E36159m2251r823k7130K5383k67792j26827q4664J38566J07539r8022M1931
18707A93069M04892R6201k16324k1167J53104J69665m5444m9284k95516j17576
18697B71620k9319L4075j3298J09937M2653j31692O0634M6063K35841J26567O8946
$$ y = [1134710, 1369429, 1937378, 2730883, 2803265, 1995376, 1364052, 884301, 698863, 774968, 673202, 484115, 383582, 254148, 312168, 366881, 500102, 574586, 467632, 510167, 661846, 415614, 202521, 338595, 491198, 522598, 635776, 931366, 1503818, 2199627, 2920241, 3294249, 2816873, 1957769, 1337914, 862078, 693678, 649678, 604495, 322085, 260043, 352810, 500148, 555576, 404987, 515115, 666312, 599439, 385930, 433695, 536159, 493908, 484085, 456955, 482338, 214546, 87719, 3055, 141621, 249160, 151138, 193069, 597961, 694162, 477838, 456671, 609775, 779440, 733996, 684712, 389196, 271620, 242301, 276376, 263078, 373015, 415668, 283976, 344610, 390673, 626514, 753081, 822027]
18686H22027n1325k56666l44903j19866J65310R8721O4775j66192L3898N3312
18676B99091J19050J16593M8172J87280m5356o146j3913j11348l4092k842J064
18665E57553J06605m8213o4318p2591M3619N0849K0976j61789J7608O2930j38950
18654C74279k7889J84201M7882P3103K9824k19934k04090J06059l9294L2735J98021
18643E54897r7875j38065m9326R8355K36081J99693j05860P4388K96252j73920
18633H94620j67276j09997J88559O2695m4347j24107r5112J5416J63697M698J03941
18622H92787n0315m9846j22146q7927l4014J6920J35010j73961M6270J79483o4275
18611F87986q8962n8968Q2191J22959R5796o1934o0965K87679J15296n4007L4785
$$ y = [822027, 770702, 514036, 169133, 49267, 214577, 313298, 378073, 211881, 245779, 299091, 418141, 534734, 582906, 770186, 724830, 718684, 704771, 593423, 559331, 556489, 557553, 664158, 615945, 551627, 479036, 522655, 573504, 594480, 432691, 450299, 513229, 374279, 346390, 530591, 578473, 651576, 681400, 461466, 257376, 363435, 324141, 356876, 554897, 457022, 318957, 269631, 367986, 604067, 803760, 697900, 772288, 1068540, 894620, 727344, 617347, 805906, 868601, 824254, 700147, 605035, 620451, 784148, 788846, 892787, 842472, 792626, 670480, 582553, 548539, 565459, 700469, 526508, 572778, 752261, 687986, 599024, 540056, 622247, 745206, 841002, 779068, 718103, 1005782, 1121078, 1067071, 1101856]
18600A101856M62L8208L5672p0269j40869L9551J18213J73430O0862O4320K16561
18589A637997L48824J69089O926j15499m8040J9688n9159q1929J8054K04459J66746
18578B267156J45358j85601j79541j42788K297j8256K0410l1149L30423K11032
18568B419341M0851J67627J15176M18765R4846j47619L27381Q96969Q21073P6067
18558E230477k63720L2123L94679R72110J341949J124496M39296N70429J511189
18549A1353028K681486L847975N609223N785313J393376l522977m112385j884560
18541B1150479q32712j571049j141852j86855R85071K701156N070671P961536
18533C4136445J2113729J5417837J3419781P580355j326127l973595n991196l39167
$$ y = [1101856, 1102318, 1140526, 1176198, 1105929, 965060, 1004611, 1122824, 1296254, 1357116, 1421436, 1637997, 1986821, 2155910, 2162836, 2047337, 1999297, 2018985, 1959826, 1877897, 1895951, 2100410, 2267156, 2412514, 2226913, 2047372, 1904584, 1906881, 1888625, 1909035, 1877886, 2208309, 2419341, 2460192, 2627819, 2742995, 3161760, 3256606, 3108987, 3436368, 4333337, 5154410, 5230477, 4966757, 4998880, 5393559, 6365669, 7707618, 8832114, 9271410, 9841839, 11353028, 14034514, 17882489, 23491712, 29277025, 30670401, 27147424, 23035039, 21150479, 20317767, 18746718, 17604866, 17418011, 18403082, 21104238, 26174909, 34136445, 46250174, 61668011, 75087792, 82668147, 81342020, 77368425, 71377229, 71038062]
18525G1038062J1434084K5824963M4123799O5800263N9636543K868048n3881982
18518B26843780o8409815m7252404k3102415p115489L213079J2687213K2205027
18511A19068976J7044217o278964j1576244J354291J1576961M968847k869586
18504A33288498O616029K6002296M6692400M2715614j2585092m6031167l8182715
18497A58515863k8532288j3343051O09461L063025K508024m585897j4694397j0116636
18489I3424104P97129M282795p854237j2300920l641431P877937K0333053L5501525
18481A38419955M5445386L4972681J2539059l4546068o2670329m6823420k5712680
18474F1624584j2590347m650879N23256R94416l046073k008561K283169L049242
$$ y = [71038062, 82472146, 108297109, 152420908, 218221171, 277857714, 280725762, 226843780, 158433965, 111181561, 88079146, 80963657, 84176736, 96863949, 119068976, 136113193, 129834229, 118257985, 119612276, 131189237, 136158084, 133288498, 139904527, 165906823, 212599223, 255314837, 242729745, 196698578, 158515863, 129983575, 116640524, 117249985, 120313010, 122821034, 118235137, 103540740, 93424104, 94221233, 98504028, 90649791, 78348871, 74707440, 82585377, 102918430, 138419955, 183865341, 218838022, 231377081, 196831013, 134160684, 87337264, 61624584, 49034237, 44383358, 44906614, 45901030, 42854957, 40846396, 43129565, 46178807]
18466D6178807P50009J520542l097394r307372o713791l542796l233232l264686
18458A9290087k087665p54685M49963J859754K593765M85419k319607k424336
18450A7092695r48645N65887J148291l89409j474621j933823k016874j380263
18442A0663238n64401K63499K93521p77018j332789q83160n12500l17203J69163
18433G002350L86359P6224k42599n84497j97795L43539M87616N56624L70725J367687
18423I566233K025972J687466M29239m57776q77102j279440j135971r70977k84504
18414H703140l48837j288846j336287p28704k90510L41139Q66611J494305J819014
18405I231025K372498K201405n48849k953926k618691j907637j197484l71860
$$ y = [46178807, 46928816, 48449358, 45351964, 36044592, 29330801, 25788005, 22554773, 19290087, 17202422, 16447737, 16897700, 18757454, 21351219, 21836638, 19517031, 17092695, 16144050, 16709937, 17858228, 17468819, 15994198, 14060375, 12043501, 10663238, 10098837, 10362336, 10655857, 9878839, 8546050, 7662890, 7150390, 6833187, 7002350, 7388709, 7464933, 7222334, 6637837, 6440042, 6783581, 7271197, 7827821, 8198546, 9566233, 11592205, 13279671, 13708910, 13251134, 12374032, 11094592, 9958621, 8987644, 8703140, 8354303, 7065457, 5729170, 5000466, 4709956, 5051095, 5917706, 7412011, 9231025, 11603523, 13804928, 13256079, 10302153, 7683462, 5775825, 4578341, 4206481]
18397D206481l53983n37914m03175k09438j57569k39201k92622j53821j65549
18388A693209j66215j58054j70247j58207l0384k142k3617J89412L30742L85615
18378A890112j72621k77663k39537k86551j15114j10296j04759M2913O4354m0447
18368F50391L1973k8013j2973j11146L3886J72930N8619J6552l17758j48479J48532
18357D94514q8817J02227K00984N2248p2677k92432k52895N411k02665j24500
18347a78602J50753J18485J37627l6705J66342o8159K37423J93398j63101n9960
18337D97501o5306R9477Q1349r5281k59229r9855J58032J5778n865n8181Q3722
18326C52142K5258r5347n7186Q8512Q3251R273P0603o4681P823K34686M7561j82205
$$ y = [4206481, 3852498, 3314584, 2911409, 2701971, 2544402, 2305201, 2012579, 1858758, 1693209, 1526994, 1368940, 1198693, 1040486, 1010102, 1007960, 984343, 1173755, 1504497, 1890112, 1717491, 1439828, 1200291, 913740, 798626, 688330, 583571, 626484, 690838, 650391, 682364, 654351, 641378, 530232, 564118, 737048, 795667, 812219, 494461, 345982, 494514, 405697, 507924, 708908, 761156, 688479, 396047, 143152, 148563, -54102, -178602, -27849, 90636, 228263, 191558, 357900, 289741, 527164, 720562, 557461, 497501, 432195, 531672, 613021, 517740, 258511, 158656, 316688, 332466, 326601, 268420, 352142, 377400, 282053, 224867, 313379, 396630, 405903, 476506, 411825, 419648, 654334, 701895, 519690]
18314E19690k8553o9274j19612q2198M7111P9012j09755j49704p9984r393K19046
18303B16386K04239J78097K2188o0809j24460k66588o1885j9772K41447o41j98148
18292A30054j79393J07251J04170K2873K85414J50558j669n4018q2513K01986
18282F84713k4717j75525M7394L7343J70411k3076l02380j59812J25095K6454
18272D05900L1464P8615N9818J2306m6000M2969j08954k04587j23257M1950P1904
18261B62128P4200k23368J52841K54613o7517o3557j12963M4193P2433j59641
18251B33362k55382J07423J34037j22360P1853n4347j1519k6634L4892J57355
18241B68680J60647J36526O6232J495O2118Q5698p0803p0883n6806m9282j74744
$$ y = [519690, 491137, 421863, 302251, 220053, 267164, 346176, 236421, 86717, 6733, -2660, 216386, 420625, 598722, 620910, 560101, 435641, 169053, 107168, 87396, 328843, 328202, 130054, -49339, 57912, 162082, 184955, 470369, 620927, 619258, 565240, 482727, 684713, 659996, 484471, 531865, 569208, 739619, 716543, 414163, 254351, 379446, 405900, 437364, 515979, 575797, 588103, 542103, 585072, 476118, 271531, 148274, 190224, 262128, 336328, 112960, 265801, 520414, 452897, 389340, 276377, 320570, 393003, 233362, -22020, 85403, 219440, 97080, 168933, 114586, 103067, 76433, 111325, 268680, 429327, 565853, 632085, 633580, 695698, 781396, 710593, 639710, 582904, 533622, 358878]
18230C58878r8419K88397K77170R9110k7866k05385J37357j82240p3259M000l8951
18219E38792J01640K0966n3941l084j04737j25626j6447q0818P5938L86225Q8793
18208H27701O4076k4872p5710K28194P8855k43755j53980k9136K54053J55519
18198A080945M1181j30909Q2265L04987K11316J78044K21146K02593q651K46129
18188B429046O30746P89425P31128R4311o53331n37404k11349K1470l3681J69392
18178C429753N80887O75733O93201R41519J203498J570294J569444Q43072Q48636
18169A2356037J674898K551124L918837O217911J0456249J8323440K9776624M6149147
18161A31424267P2459078J18904215J43850169J0381172j49062117j40612104
$$ y = [358878, 260459, 548856, 826026, 925136, 897270, 691885, 829242, 647002, 573743, 577743, 538792, 640432, 661398, 607457, 604373, 499636, 374010, 357563, 276745, 352683, 738908, 827701, 891777, 866905, 791195, 1019389, 1098244, 854489, 700509, 671373, 925426, 1080945, 1122126, 991217, 1073482, 1378469, 1589785, 1767829, 1988975, 2191568, 2182917, 2429046, 3059792, 3849217, 4580345, 4674656, 4021325, 3483921, 3272572, 3294042, 3260361, 3429753, 4010640, 4686373, 5379574, 6321093, 7524591, 9094885, 10664329, 11507401, 12356037, 14030935, 16582059, 20500896, 26718807, 37175056, 55498496, 85275120, 131424267, 203883345, 322787560, 466637729, 477018901, 327956784, 187344680]
18155A87344680p8007678m0361835k1802783j2768895q641748n943444m068589
18148A5749708k745719j883286j236673n85081m5860j82146r72436j124668q58583
18139F115256p77212n02004j95431j52701k236l7530J11015J90365M90472O76756
18129E916750P94309J05995m34484l03014J57434K51891M58945N04679Q89399
18120H341904J046984J321215K029058K625370L632764N419484R294189J5784019
18112D9494987K6240502M1196827O4699698J07737057J60787534L6538840j65579597
18105C21115848j42438436p5545322l8378420k0148492j1621169p905923n834765
18098A9243321m068755k814214k299258j872220j200760q97987o85734o51891
$$ y = [187344680, 109337002, 68975167, 47172384, 34403489, 25761741, 19818297, 15749708, 13003989, 11120703, 9884030, 9298949, 9253089, 9070943, 8098507, 6973839, 6115256, 5338044, 4836040, 4640609, 4487908, 4485672, 4448142, 4559157, 4749522, 5239994, 5916750, 6711059, 6817054, 6382570, 6079556, 6236990, 6488881, 6947826, 7452505, 8341904, 9388888, 10710103, 12739161, 15364531, 18997295, 24416779, 33710968, 49494987, 75735489, 116932316, 181632014, 289369071, 450156605, 486695445, 321115848, 178677412, 103132090, 64753670, 44605178, 32984009, 25078086, 19243321, 15174566, 12360352, 10061094, 8188874, 6988114, 6090127, 5404393, 4752502]
18090D752502m71261m51647m46005m34300l68042l93399m38419M9564J25203j65690
18080A758506j31441r4424r1500j03920j71282j40718M6258q860j11369K5743
18070I76993m62J49475m3232k49560j62858j47139J29960K28847j23938q3430
18060F74656K54707K12876j99799k61259r0094q1866m2322r6772K786N1545L6872
18049D61330k0169n1464J57971K12571P3808r4973J9811p6029Q7742M3725L4318
18038H48641m0193K72623J77944J67080K08802j45444l43193l24384j32642r5798
18028E93436J42241j11162j43233k4062P0131j3155m7082n0603j03852j2503j33578
18017A66578O2355J08787O3558Q8785J12807K5046k8921k67511j70722O860j13098
$$ y = [4752502, 4281241, 3829594, 3383589, 2949289, 2581247, 2187848, 1749429, 1798993, 1924196, 1758506, 1627065, 1532641, 1441141, 1337221, 1165939, 1025221, 1071479, 1062619, 951250, 976993, 976531, 1126006, 1082774, 833214, 670356, 523217, 653177, 882024, 758086, 674656, 929363, 1142239, 942440, 681181, 591087, 509221, 466899, 370127, 372913, 424458, 461330, 441161, 389697, 547668, 760239, 834047, 739074, 758885, 682856, 770598, 814323, 848641, 808448, 1081071, 1259015, 1426095, 1634897, 1489453, 1146260, 821876, 689234, 593436, 735677, 624515, 481282, 457220, 527351, 514196, 467114, 416511, 312659, 300156, 166578, 228933, 337720, 401278, 490063, 602870, 627916, 598995, 331484, 160762, 167622, 54524]
18006E4524j18625K1408J02548J61616O5153Q7480J57383J05523j01199N0208
17996E86019L8698l6811J83407J3919J10348p5000J2098K62540K56325k8788p8802
17985A243953k65945k12982K91728K4797l25591m3813r5917j2440r0647k05362
17975C07781m2140M2500K8433p7448J39237j16037k4414J30623L1762q8343j56467
17964A75487j23063k6086o2649J87602o6009j50560J94817k1256L1077K18334
17954C57694M2541P7932j77955r3815J12471K8122k4752J62492J77728j58924
17944E03534p8009j1558m3540P636m8480J423J825k7059M8123M8832j63660k08397
17932C0670m6627J70333R3677j10053j61166n3646n0857O2556p577j23687r550
$$ y = [54524, -64101, -42693, 59855, 221471, 286624, 374104, 531487, 637010, 535811, 586019, 624717, 587906, 771313, 785232, 895580, 820580, 832678, 1095218, 1351543, 1322755, 1243953, 978008, 765026, 1056754, 1081551, 755960, 712147, 616230, 603790, 513143, 307781, 265641, 308141, 336574, 259126, 398363, 282326, 257912, 388535, 420297, 331954, 175487, 52424, 26338, -36311, 151291, 85282, -65278, 129539, 108283, 139360, 357694, 400235, 478167, 300212, 206397, 318868, 346990, 322238, 484730, 662458, 503534, 425525, 413967, 370427, 378063, 329583, 331006, 332831, 305772, 353895, 402727, 239067, 30670, -15957, 154376, 248053, 138000, -23166, -76812, -127669, -65113, -72690, -196377, -205927]
17921b05927k315J84573P8692k5523k6053K777j56248j06394K54127L1779o6674
17910c7186j53018J26048J88286q6257K3607J08126n3090j20378O9682R3055L11
17899A59186j04036N4843Q776Q3K1604J40188n5320j54999j08036l4685j43828
17888b16224j00774L9789R354k65771Q4127L48477K14620p3082m4074n3059N9530
17877B913J86036j56207L9374m6726q1898j58866p1550N9974P9739l8562J29356
17866e6417k6036j40789J10699J96469J7816o0160n2618j73343j52336K74368
17856f2347j1896k91679r2586K41928K66424j43146j08226K1177M9926n3963Q3234
17845a01154J15681J57418k2228l70561J1933K09659K78595j33812m40616k34590
$$ y = [-205927, -208242, -23669, 55023, 29500, 3447, 6224, -150024, -256418, -2291, 29488, -37186, -190204, -64156, 124130, 37873, 61480, 169606, 116516, -3862, 65820, 158875, 159186, 55150, 109993, 118769, 118852, 140456, 280644, 225324, 70325, -37711, -72396, -216224, -316998, -277209, -267855, -533626, -449499, -101022, 113598, 40516, -3558, -56617, 2913, 188949, 32742, 72116, 25390, -56508, -215374, -286924, -226950, -147211, -185773, -56417, -82453, -223242, -112543, 83926, 101742, 41582, -11036, -184379, -336715, -62347, -74243, -365922, -458508, -216580, 49844, -93302, -201528, -180351, -130425, -184388, -101154, 14527, 171945, 149717, -220844, -208911, 748, 279343, 145531, -295085, -529675]
17835e29675l6656J27824J42542K15357J00486j16821k5549k02249k75742j00013
17825g00496K31186K00099M6924K11683K26750n5846j1533r3258j96216q0064
17815b20771n7392Q8350M6651R7880J5215O1105j92800k13851n0276J4273L0676
17804c80940J46218M31588R6378j0935j29260P948n3893K0363j00713l6399o893
17793a6538K1685J32055k25174j53245p1002J47620p3097M9158n7267J79786K30832
17782A64813j03139j74504l2473J177k31041L5847J73449L5621j44734J57540
17772a17444n5438L7892J26440R4669q7061j05830k00138n3896O0526o8338p5604
17761d44222K61764l1931K16182O5648P7630j09975j48734K46J019q40K05388
$$ y = [-529675, -566331, -438507, -295965, -80608, 19878, -96943, -122492, -324741, -600483, -700496, -469310, -269211, -222287, -10604, 216146, 160300, 148767, 55509, -140707, -220771, -278163, -189813, -143162, -45282, -30067, 31038, -161762, -375613, -425889, -411616, -380940, -234722, 196866, 293244, 282309, 153049, 160997, 107104, 127467, 26754, -9645, -16538, 5147, 137202, -87972, -241217, -312219, -164599, -237696, -188538, -245805, -66019, 164813, 61674, -112830, -145303, -144126, -375167, -339320, -165871, -130250, -274984, -117444, -172882, -134990, -8550, 86119, -942, -106772, -306910, -360806, -300280, -368618, -444222, -182458, -214389, 1793, 67441, 145071, 35096, -113638, -113392, -112373, -113213, 92175]
17750I2175N7991p5197j65838m4762J20179j32274j2788M8959L20258o8377k21667
17739h1341l5347j96293q4733J74903K14844K22070J26254j51055j85763j42534
17729a38995r5686K25427J36129l5653j1951p679K5515R3512K29r3145j03577
17718e874m7081P3589k9017j0831K01245M9414j89551j34699J6805p3986J03811
17707d6175O1953o7510K751n1094K6031M6669L2993J2134O296j65858j45602j726
17695b89138K45901l0996j26841J51704N2060j27684P1700o4506n8281q4432o6113
17684c26626r0321K01483P2935K7476k09631k49300j0269O7480M20214J29457
17674C2898J5401K3982P8706k7727r0483j15230j10509J30274o7952j4690M7770
$$ y = [92175, 150166, 74969, -90869, -135631, -15452, -147726, -160514, -111555, 208703, 140326, -81341, -116688, -312981, -397714, -222811, -7967, 214103, 340357, 189302, 3539, -138995, -234681, -9254, 126875, 91222, 79271, 71592, 97107, 190619, 190848, 97703, -5874, -52955, 20634, -8383, -19214, 182031, 231445, 41894, -92805, -76000, -149986, -46175, 15778, -51732, -48981, -100075, -74044, -27375, 5618, 17752, 24048, -141810, -287412, -289138, -43237, -74233, -201074, -49370, 2690, -124994, -53294, -117800, -176081, -260513, -326626, -416947, -215464, -142529, -115053, -324684, -573984, -584253, -516773, -96559, 32898, 48299, 72281, 150987, 123260, 32777, -82453, -192962, -62688, -130640, -145330, -97560]
17663i7560J9374M8646Q0203R8613P8082Q3748N4253k48587m5133o0048j29104
17652a17513j31640O7526O0916J57700p5993m0654N9926j84356j67807K3879p486
17641c55502j78487m7976J80178J68487P6984O4934J73484j46519j59368j62757
17631c86542Q1505J64048J88573q5137j86519m227K42342J43382j67602P2629
17621F2452j8030r3508j36623R9495r7683N4280Q7523J2180k37819j00341J39398
17610b28676K0976L4748K48226K35960p7927k37128n0022P410k0006O6373J19246
17599A19180J65572L721r7790q9739j36975J60437K3445k4876L2014Q624j725
17588A61888n5183n3725M79J39297M6303K7752j84398q8000K94225J15718J02906
$$ y = [-97560, -78186, -29540, 50663, 149276, 227358, 311106, 365359, 116772, 71639, 11591, -117513, -249153, -181627, -120711, 36989, -39004, -79658, -19732, -204088, -371895, -348016, -355502, -533989, -581965, -401787, -233300, -156316, -91382, 82102, -64417, -223785, -386542, -305037, -140989, 47584, -37553, -224072, -228299, 14043, 157425, -10177, 62452, 44422, -49086, -185709, -86214, -183897, -129617, -42094, -29914, -267733, -368074, -228676, -207700, -172952, 75274, 311234, 233307, -3821, -53843, -46433, -66439, -66, 119180, 284752, 288473, 190683, 100944, -36031, 124406, 147851, 122975, 154989, 163613, 161888, 106705, 52980, 53459, 192756, 239059, 266811, 82413, -5587, 288638, 404356, 507262]
17577E07262M6509K10013N42632N81887O23024K0050o85926n54027l13326k42699
17567G35399p9556k94k74552j86247j65942j10027p0203k8647O4515J08879K16306
17556B09631O283j69609k73530j38215J28562j0737J62685m2490p4523K9406J98264
17545B5727J19879K0002O2964P7632k35769j50814J07786M3725N0969R8429k28232
17534g702j73217j93331K43175J24485j5608J99153R1162m8184k01617j76446
17524a58130O0551l2522J3719M9835n8293j56892o8621o0695P9421Q6368j1128
17513b56387j13019K51883K5193j60009j60949Q4173J50645q3488K2496P8889
17503a60573K28479j27124J00713k87923j60541l401l4638K07717J28896J00629
$$ y = [507262, 553771, 763784, 1306416, 1888303, 2511327, 2531377, 1845451, 1291424, 978098, 735399, 655843, 655549, 380997, 194750, 28808, -81219, -151422, -180069, -115554, -6675, 209631, 215914, 46305, -227225, -365440, -236878, -247615, -84930, -127420, -201943, -172537, 25727, 145606, 165608, 228572, 306204, 70435, -80379, 27407, 71132, 122101, 220530, -7702, -180919, -374250, -131075, -6590, -22198, 176955, 268117, 219933, 18316, -158130, -97579, -130101, -116382, -66547, -124840, -281732, -350353, -411048, -331627, -245259, -256387, -369406, -117523, -92330, -252339, -413288, -329115, -178470, -261958, -239462, -160573, 67906, -59218, 41495, -246428, -406969, -410370, -445008, -237291, -108395, -7766]
17493g766k9137P6751L33607p4010j85285J20766j45520q2922j79066p6552p4262
17482c23396q5508j42814K59026o1972N7764Q0854L8720r6738o0050M6547J54241
17471a33326K20450j9727j00851k61132k4252J22964K38208O421o2323J6889j41022
17460a37701O59J32125j7496J07053m197k9803j52824j52846j59031Q1339K2240
17449c10482J39317K3909J48763L94382L12016K32057L63376P87012M68079n10749
17439B047680o55035n95294k77792p7299j90824m8986k46886k08583j29472K83424
17429i9067K78203j07473j74259k0390P1584O9520L6073j69880m2146Q7413L8409
17418c2013N2854O8263o7078k7065P1557l8146j23423M0717K959Q2657o310J89499
$$ y = [-7766, -36903, 39848, 373455, 299445, 114160, 234926, 89406, 6484, -172582, -249134, -323396, -408904, -551718, -292692, -354664, -296900, -216046, -177326, -274064, -334114, -287567, -133326, 87124, 67397, -33454, -294586, -318838, -195874, 42334, 48755, -13568, 3321, -137701, -137042, -4917, -22413, 84640, 80443, 50640, -102184, -255030, -414061, -332722, -310482, -171165, -147256, 1507, 395889, 707905, 939962, 1303338, 2090350, 2558429, 2047680, 1392645, 797351, 519559, 442260, 251436, 202450, -44436, -253019, -382491, -99067, 179136, 71663, -102596, -122986, -51402, 18118, 54191, -115689, -157835, -70422, -32013, 20841, 89104, 22026, -5039, 66518, 28372, -95051, -54334, -51375, 31282, 24972, 214471]
17406B14471r178o9927o7556N0283J33582K5327j53187q9787k00086P7936N4132
17395c3990r0502L3683O2786L4273l771R3783j944p8365j01573J5576M0008j76142
17383b06178p7530q5866j5554L32373J81349p0067q1478r9133j42182J74208p9724
17372a69782L6653Q1373L927k5140n1056j10772P0194K32447o3735j15129M6701
17361f4319j12149j82042r7881J20900l8810K30681J02064Q3309o451r2251r0412
17350a47361o079j00303J00708N5193K6463j26750m5899M9085N1046o2010j1860
17339b17767J99189J64068O8738J24098j252P8827j42450n314K04259L9994k25540
17328B86850o4161n192l0454j81655k3881m4599j62164o1587M04522K57702J6126
$$ y = [214471, 205293, 135366, 67810, 118093, 251675, 277002, 123815, 34028, -166058, -88122, -33990, -124492, -90809, -28023, 6250, 2479, 96262, 94318, 15953, -85620, -70044, -30036, -206178, -283708, -369574, -385128, -52755, 128594, 58527, -22951, -122084, -264266, -90058, -169782, -133129, -51756, -47829, -72969, -124025, -234797, -164603, 67844, 4109, -111020, -64319, -176468, -358510, -456391, -335491, -374301, -143620, -41556, 41753, 35302, -56949, -147361, -153440, -253743, -153035, -97842, -71379, -198129, -244028, -194943, -143897, -205907, -217767, -18578, 145490, 214228, 338326, 337074, 415901, 273451, 268137, 472396, 512390, 286850, 222689, 217497, 187043, 5388, -18493, -63092, -225256, -286843, 117679, 375381, 391507]
17317C91507n6327j85248p9588j02072M9988j17320j27399J26448N8096o1063
17307a02978J18403j5918o042L7163j55927L6382K0753k8736k10657J52062o124
17296a61619l8392Q1216J6961N1849j5863j17530J94960P7448k5274j59694N6996
17285c8942p953k11946J8455L08273K92279j17418j92795P8696R9712R9533q5071
17274B42823j69938L3534K46849J31775r4674L65817L37575p1996j92347K09563
17264A038981p339P161k25958n4457k92281m9058m1415k94956j74914o9477R4727
17253f8986Q0156J7061K6475k14397j69414o6752K20239K35001Q0095K04891P4441
17242D18810k20448j71266K011m6384j7044O7058p6247j23049l8329j43306R6971
$$ y = [391507, 335180, 149932, 70344, -31728, 18260, -99060, -226459, -100011, -41915, -102978, 15425, -493, -6535, 30628, -125299, -88917, -68164, -96900, -307557, -155495, -161619, -200011, -118795, -101834, -49985, -65848, -183378, 11582, 89030, 63756, -95938, -38942, -46895, -258841, -240386, 67887, 360166, 242748, 49953, 128649, 228361, 327894, 242823, 72885, 106419, 353268, 485043, 390369, 756186, 1093761, 1021765, 829418, 1038981, 1031642, 1038803, 812845, 758388, 466107, 417049, 375634, 80678, -94236, -163713, -68986, 11170, 28231, 54706, -159691, -329105, -395857, -175618, 59383, 139478, 344369, 418810, 198362, 27096, 29107, -17277, -34321, 32737, -43510, -166559, -204888, -348194, -251223]
17231b51223J26777J30421k74493k20720J70093K62746k4030K51028N506j89586
17221a3481o2049m7699j88832N0229l0906p6245P0044J25001M4105L0452N3881
17210d5500J29949o7957j5649O2661k5927K59945j07441P5907j08241j8426J53374
17199B92695j83065j02465J18318J23194j03288k74228L2402P8550l0003M5774
17189b116N1859j76730q0220J28001J80847P1877K5284j84193j31913l4404M535
17178a47173j0220m2436K0152l7114n3603N1844n8095J74326J58766j50269j18619
17167b12441O5855L19786j01585K0983R244J77846J22840J35570R4316O8037M4930
17156G45381o0582k6297J71278J09404J31974j00161k32695J47574j90927l88979
$$ y = [-251223, -124446, 5975, -268518, -489238, -319145, -56399, -80429, 170599, 176105, -13481, -75530, -123229, -312061, -261832, -292738, -368983, -298939, -173938, -129833, -99381, -45500, 84449, 16492, 843, 63504, 37577, 297522, 190081, 265988, 157747, 139321, 292695, 109630, 7165, 125483, 248677, 145389, -128839, -96437, -17887, -47890, -2116, 49743, -126987, -207207, -79206, 101641, 173518, 198802, 14609, -117304, -151708, -147173, -157393, -199829, -179677, -216791, -270394, -218550, -276645, -102319, 56447, -93822, -212441, -146586, 173200, 71615, 92598, 101842, 279688, 402528, 538098, 632414, 700451, 745381, 684799, 658502, 829780, 939184, 1071158, 970997, 738302, 885876, 694949, 305970]
17146C05970j03016j53782o9639J05961p3804n9072Q9733K00613J5945k17432
17136D1477j8151K4149k2747K6653q2640o7072j29203J79040o5358J26905L3213
17125D6266L9325k28781k68476O1433L547J14398O8689q4636O3673k40204J01807
17114c22959K06879O7269o409j55597L6719K23549j44943n3338P9417k14206k62624
17103e46243K55534m6683k46078P2695J88978L12115P1362q455R8958N9901p3867
17092A38217N72n3693n8026J04854R7114m0012j51722m5948Q5574J58614J19526
17081C55070p6713k60506j15988J54369P6552j67146J4516l9142j24225p6229
17071b59442N4626J31789j67940k62084o0754M14960L48010j2789k5057j28990
$$ y = [305970, 202954, 49172, -20467, 85494, 11690, -47382, 42351, 242964, 258909, 41477, 23326, 47475, 24728, 51381, -31259, -98331, -227534, -48494, -113852, 13053, 46266, 85591, -143190, -411666, -350233, -346686, -232288, -163599, -248235, -184562, -424766, -322959, -116080, -48811, -55220, -210817, -174098, 49451, -95492, -148830, -69413, -283619, -546243, -290709, -337392, -583470, -510775, -321797, -9682, 61680, 53225, 152183, 212084, 138217, 138789, 85096, 27070, 131924, 229038, 189026, 37304, -8644, 76930, 235544, 355070, 278357, 17851, -98137, 56232, 132784, -34362, -19846, -58988, -183213, -259442, -204816, -73027, -240967, -503051, -563805, -148845, 199165, 186376, 161319, 32329]
17061C2329j05956o9108J54375M9745q4766J02970M9459J26779M4940J47202k7690
17050D20279l7538k19852j02681J24922K17748J19460L277M6935O9361K20802
17040H62713J38238N90590Q75086J513469J796902R70072m81243P7659J273019
17031G616505K649604O17251k650417k064122n10829M74737m88622j844579j565043
17022B234485r74165n43846j80351q652j09429o6903k5605k78443q8590M4374
17012B875m28L6261k1223Q9327K58975M470j61136m406j8521k2386j24534m1618
17000b344J15652J55883P3592j46518j14666j99226o87J78031j13955L6528k1776
16989c9486K21628j4346k88070o9909K64043K67769n5813k13852J50946J15298
$$ y = [32329, -73627, -142735, 11640, 61385, -23381, 79589, 129048, 255827, 300767, 447969, 420279, 382741, 162889, 60208, 185130, 402878, 522338, 525615, 572550, 641911, 862713, 1000951, 1591541, 2466627, 3980096, 5776998, 6747070, 6265827, 6343486, 7616505, 10266109, 10883360, 8232943, 6168821, 5657992, 6132729, 5644107, 3799528, 2234485, 1260320, 716474, 536123, 527471, 418042, 351139, 325534, 47091, -41499, 2875, 2447, 38708, 17485, 106812, 365787, 370257, 209121, 204715, 186194, 163808, 39274, -2344, 113308, 269191, 342783, 196265, 81599, -117627, -118314, 59717, -54238, -17710, -39486, 182142, 167796, -120274, -190183, 73860, 341629, 285816, 71964, 222910, 338208]
16979C38208j29047L6710K3457k27057o3330Q0557j16221J72341K99784p4935
16969C40467k3157K9614m8458l1777k05686j42881r8263o4528J56520J74174K5917
16958A11942q2148k6507J16301j66839L8904P0988l7315k54014R8829N8688J45871
16947G4700Q9524j25952p4902j43151J44460J83299J3420k20077j39125J04692
16937i3112l991n6866K8789J48026K11809j56906N940R2681k5642j74962L2103
16926G869j21186j91893J21659J08318J7439M7095J01709j09087k7491P7920j16941
16915h4589J56308J35239J31967o3417j00665j68318Q4998Q1292j02147k63624
16905a92956k4159j31356K20834L8094M6191J1583O0020p3023J06009J18110j03269
$$ y = [338208, 209161, 245871, 269328, 42271, -21059, 59498, -56723, 115618, 415402, 340467, 317310, 346924, 298466, 266689, 61003, -81878, -180141, -244669, -88149, 86025, 111942, 29794, 3287, 119588, -47251, -8347, 62641, 25326, -228688, -129859, -71171, 74700, 164224, 38272, -36630, -179781, -35321, 147978, 161398, -58679, -197804, -93112, -97103, -153969, -125180, 22846, 234655, 77749, 83689, 176370, 150728, -24234, 7869, -113317, -305210, -183551, -75233, -57794, -10699, 91010, -18077, -45568, 32352, -84589, 71719, 206958, 338925, 275508, 174843, 6525, 91523, 172815, 70668, -192956, -217115, -348471, -127637, -89543, -43352, -31769, 28251, -44772, 61237, 179347, 76078]
16894G6078J08321l1189j03624L8176K31496j69870k81365p8534R8588J45272
16884C3349j04190j75208r394J64804R6673J9086Q555j9841N035J4244L4955m5765
16872B2303k22512k05405J63975K37629Q8690q7288k2875O380R9972P6704j74209
16861a6636j93259m6527J87427j2454j03767j961k058O9028n47j5433j52542j34984
16849d23713o6507J74022J78389J36195p0848p3257j7801j25597j10313L8106
16839c61324J18350J40133K37065j27167N6881j35283K3540k1474q1195p0284
16829b20758o3970J16821j09924J45200l9539r2835j35663M0141M252l6785K4978
16818c68082J53673Q3330J6239J14519r539L2858j3662p7260j5056p893O4691
$$ y = [76078, 184399, 153210, 49586, 87762, 319258, 149388, -131977, -210511, -111923, 33349, -70841, -246049, -255443, -90639, 6034, 25120, 33675, 13834, 18869, 33113, 68068, 22303, -200209, -405614, -241639, -4010, 84680, -2608, -25483, -19103, 80869, 157573, -16636, -209895, -256422, -68995, -81449, -185216, -187177, -189235, -120207, -120754, -136187, -288729, -423713, -490220, -316198, -137809, -1614, -72462, -145719, -163520, -289117, -399430, -361324, -242974, -102841, 134224, 7057, 63938, -71345, -47805, -69279, -150474, -220758, -284728, -167907, -277831, -132631, -172170, -265005, -400668, -360527, -356275, -393060, -368082, -214409, -131079, -114840, -321, -9860, 22998, 9336, -67924, -82980, -90873, -26182]
16807b6182P6346j39115l5177q7418j0954R3165J3732J80918P3065j78569p8097
16796a18286J2209J42492P9528j40290O4642q6592N0443k0551M393L7619p2632
16785d7025k1836M5977j7106n9485n9934R221N4354P8924M6168M0326J53109j14426
16773A08267k59216L5274J45415J6190M4229J60397K49662j88423k76095j24873
16763h9173k66541J68527J50823j46524r2165l7213O2609J88936j09668o2912
16753b33301J72119J58734j84653P4016J8085J14459k05404L2374J88501K3341
16743A58271O4406O4260P7651J6654J40066m5225l5284R299k17095k14243o6872
16732d8112q1683k2661J54837J19685K1435j45257j71224m8595P0767m5386j07497
$$ y = [-26182, 50164, -88951, -124128, -211546, -222500, -129335, -115603, 65315, 138380, -40189, -118286, -106077, 36415, 115943, -24347, 40295, -46297, 4146, -16405, -12012, 25607, -47025, -68861, -22884, -39990, -99475, -159409, -150188, -95834, -16910, 29258, 69584, 222693, 108267, -150949, -115675, 29740, 45930, 90159, 250556, 500218, 311795, 35700, -89173, -355714, -187187, -36364, -182888, -275053, -312266, -249657, -60721, -170389, -233301, -61182, 97552, -87101, -13085, 5000, 119459, -85945, -53571, 134930, 158271, 222677, 286937, 364588, 381242, 521308, 476083, 440799, 450098, 233003, 18760, -48112, -129795, -152456, 2381, 122066, 143501, -1756, -172980, -221575, -150808, -196194, -303691]
16721c03691j26220o0333N1288J92351K81765L9247j12758l39828j35164J87246
16711c26097n372K04808M2243k01985K03900J64m4770L6498M5318k9379j01177
16700a75849o6294l125O1442K1932o4132j29048N3779J41238n9285q9945N3323
16689b55964J18315J13689m0312q5452P0011k13973r0769J83288R6012j41587
16679b46742k28746j50334K12112J69695J02225R7298o6199O1764k2708l4558
16669a06193l9663o5228l8810R0285j6469M1265n9711m8844l3235j39844K56520
16658a59927J76049j32547p6516N0871q143p2927j18583Q9092J54518L4847Q9695
16647B6429r892j00023n8412J69237p7995o2943J08224J27493k8377K32847K32034
$$ y = [-303691, -429911, -490244, -438956, -246605, 35160, 74407, -38351, -378179, -513343, -326097, -331469, -126661, -84418, -286403, -82503, -82339, -127109, -90611, -45293, -74672, -175849, -242143, -245268, -183826, -161894, -226026, -355074, -301295, -160057, -219342, -309287, -255964, -137649, -23960, -64272, -149724, -79713, -293686, -384455, -201167, -105155, -246742, -475488, -625822, -413710, -244015, -141790, -44492, -110691, -48927, -71635, -106193, -145856, -211084, -249894, -159609, -176078, -134813, -194524, -243368, -276603, -416447, -159927, 16122, -116425, -192941, -142070, -150213, -223140, -341723, -252631, -98113, -63266, 26429, 16537, -83486, -141898, 27339, -50656, -113599, -5375, 122118, 93741, 326588, 558622]
16636E58622l02332j75395q2227q8920M7556J02990K02175p0985l0600j16200
16626D4684O6375j98947j79813K4897K72920J79482k61654m8133K0156q663n5791
16615a44487j102n9801j9626j66894k59000J95407K00012R5843M6041J01834p31
16604a2504j53195q1022N147J79496Q1438o3835n3857j08948J33842m3366Q818
16593a07986J92114J17867p0221r4744q7053J26353k8185O9806R9111J06497j07714
16582B15845n9229n9142m7951J9942J79579m4573M2748m4843m7411m8858j13152
16571g045M7688j14780j83523j55351J7479J13187J63792n9439k68745k1225L34359
16560a33603K63898J3554p2855n2219J52585O4994j04208J3262n9683k71342j87005
$$ y = [558622, 256290, 80895, -1332, -90252, -42696, 60294, 262469, 191484, 160884, 44684, 111059, -87888, -267701, -242804, 30116, 209598, -52056, -100189, -80033, -88696, -144487, -145589, -205390, -225016, -391910, -650910, -455503, -255491, -159648, -113607, -11773, -12504, -165699, -246721, -241574, -62078, 19360, -44475, -98332, -207280, -73438, -116804, -107986, 84128, 201995, 131774, 37030, -50023, 76330, 48145, 117951, 217062, 323559, 215845, 156616, 97474, 49523, 69465, 249044, 204471, 247219, 202376, 154965, 106107, -7045, 40643, -74137, -257660, -413011, -395532, -282345, -118553, -177992, -446737, -467962, -133603, 130295, 143849, 70994, 18775, 171360, 236354, 132146, 145408, 85725, -185617, -372622]
16549c72622J73078J57794j99438j72443J15908K04398P6504j61424j48318n2628
16539c79191L4288J04217Q3824O7716J49885J34314j93376j70060j8822r312n0848
16528b47365R4460N5942J76680N5894j63355p0427o1286Q9768J39207N2872K4010
16517A46400j5210j54958j38836O250K30237J20361o4834K2511N124j7630P8522
16506B17937p3524o6966j14988m1471o0983J27172j73680J04807K04979P0318
16496A93601J08296J3301J2450k93808r6639k7737o0255L45563J67935P9727j76464
16485B65970j08624j53490k76100M2805j24048n8575r0928J52053K66386M2047
16475d2504k5195J76002n8410j35527J8638j25165K78501J27700l44906j06073
$$ y = [-372622, -199544, -41750, -241188, -413631, -297723, -93325, -16821, -178245, -326563, -379191, -344903, -240686, -156862, -89146, 60739, 195053, 1677, -168383, -187205, -196517, -247365, -152905, -96963, 79717, 135611, -27744, -98171, -159457, -69689, 69518, 122390, 146400, 131190, -23768, -162604, -156354, 73883, 194244, 129410, 151921, 157045, 139415, 217937, 144413, 77447, -37541, -79012, -139995, -12823, -186503, -81696, 123283, 193601, 301897, 315198, 327648, 33840, -62799, -90536, -150791, 194772, 362707, 442434, 265970, 157346, 3856, -272244, -229439, -353487, -412062, -502990, -350937, -84551, -42504, -67699, 108303, 49893, -85634, -66996, -192161, 86340, 214040, -130866, -236939]
16465b36939j1608L1083K09750p4390j87675K8974j0126O7762J56687K5123J02576
16454A01217J84918m1767k38182l24728r6896K79246N09l9490L2359N5456j41058
16443b28416m2394l1636j40281R1736q8386j7966P1231P8727J38389J36453O3650
16432C1107M8594Q3715L6848j18569k56159J8396L0255P3917L5505K43077J48821
16421C75507j26596l2909M4062O2782n2582m5947j97457j45531n5970P7442K50180
16410A52981K10441j19242p5327l9026k0291j45834k05158k06024K00347J71866
16400g5267Q0787r0896K7828P9982L5161L3972N4762o1005q6227k6652M8605J24953
16388A46003j05717j71957J378J23614J07777r9358k3232l386J58758J73724j10789
$$ y = [-236939, -248547, -217464, -7714, -82104, -269779, -240805, -250931, -183169, -26482, -1359, 101217, 286135, 244368, 6186, -318542, -415438, -136192, -135683, -175173, -142814, -87358, -228416, -270810, -302446, -442727, -350991, -439377, -457343, -386112, -307385, -168996, -32543, 31107, 79701, 163416, 200264, 81695, -174464, -156068, -125813, -51896, -16391, 226686, 375507, 248911, 216002, 260064, 322846, 270264, 224317, 26860, -118671, -174641, -97199, 152981, 363422, 244180, 168853, 129827, 109536, -36298, -241456, -447480, -247133, -75267, 5520, -85376, -57548, 22434, 57595, 91567, 146329, 85324, -903, -27555, 21050, 146003, 40286, -131671, -130293, -6679, 101098, 1740, -21492, -24878, 133880, 307604, 196815]
16377A96815o0233L6497R6878J72899l0413j0127o6270l35776q1711P7826R2242
16366H8627p4265Q7439K6791j22489j29237j22498o7745P7451K23872J29575L8595
16355A56116j85778j12793J3416J25024q3463L9019j41177l7602l2729p4227J92979
16344a41215J02561J458Q4520P4598J02447J675n4855j11226J40030J43130M886
16333C48009l13490j10664j4048N8451K1381L2333l5539j59537J02737J04269
16323C3902p149R1636n3321j57697j82052o510k0286K14370K00696k455J7101
16312A28235j98037M8300j56009j5965M7300R9984J10488O7114k3341k8106j65036
16301h5073L5545q226q8467j868R1211K39874J384j27020K2939P4601j1798N1944
$$ y = [196815, 136582, 173079, 269957, 442856, 412443, 402316, 336046, 270, -81441, -3615, 88627, 14362, 101801, 128592, 6103, -123134, -245632, -313377, -235926, -12054, 117521, 156116, -29662, -142455, -129039, -4015, -87478, -48459, -189636, -227238, -259967, -334194, -141215, -38654, -37196, 47324, 121922, 224369, 226044, 171189, 59963, 199993, 343123, 348009, 34519, -76145, -90193, -31742, -10361, 21972, -13567, -173104, -70367, 33902, 26753, 118389, 65068, -92629, -274681, -281191, -301477, -87107, 113589, 111134, 128235, -69802, -21502, -177511, -193476, -146176, -46192, 64296, 131410, 108069, 79963, -85073, -49528, -57754, -146221, -148089, -56878, 182996, 184380, 57360, 80299, 154900, 143102, 195046]
16289A95046N9066j13422j66319j17077J36689J80976n1277j80072k38748j0850
16279c05988q8642j0325m9438J56309J44488r663J02156K69189q1235j04630N7134
16268G9355K05062M2511j13488j44640o8146j27695O5641j19783k6530J2718R6844
16257i8151l5848l6602Q6339j78812J97872J97023Q82J5146j87650j22120O0157
16246a01764J63577j74644j42829J21331J55532J21360j26888N9147K35371k9010
16236B81183p4354o8242j4950j18196K8254M8707m7435J94889J81400l0419j72260
16225B08577K1998J16386k56872r8343P3448o0030q8843M5659N4346J57153J08087
16214B81566j06873j13947J22474k3930o5663r0665J20014M5656K4522j86909
$$ y = [195046, 254112, 140690, -25629, -142706, -6017, 174959, 123682, -56390, -295138, -305988, -394630, -404955, -454393, -298084, -153596, -163259, -61103, 208086, 126851, 22221, 79355, 284417, 326928, 213440, 68800, 654, -127041, -61400, -181183, -207713, -194995, -98151, -133999, -170601, -84262, -263074, -65202, 131821, 132703, 147849, -39801, -161921, -101764, 61813, -112831, -255660, -134329, 21203, 142563, 15675, 74822, 310193, 281183, 206829, 138587, 123637, 5441, 33695, 82402, 34967, 229856, 411256, 380837, 208577, 230575, 346961, 90089, -8254, 65194, 5164, -83679, -38020, 16326, 173479, 281566, 174693, 60746, 183220, 159290, 93627, 2962, 122976, 168632, 193154, 6245]
16204F245j2242o1730l7314l7864k5377K31064R3483n2426p5087M8661M2472k08868
16192h8983l3409L1236J64940r1920k33003J59877J77929j77629o2149R406L4969
16181a08736J7426J2886J58891p9340p8727m5932l34586J68692L4310j7587K22870
16170d9833l2028L8145j19951n6148o0109K19836L1090N278N2520p5141J721J1960
16158c2660L2584M2732o7236J3912J35758N2011k25856j75342o8916J47055k5313
16147a71271r5014r5423O3075J69871P8665J4409m669M7716p1998K41206q670
16136A67897l9510r5953j55002N5187J24934m9324Q8053K42804l1674k05896k2963
16125G8553K1634k5020J76325M3664n7387J13617j11471l7280k75458j50291J49248
$$ y = [6245, -5997, -67727, -105041, -142905, -168282, 62782, 156265, 103839, 28752, 77413, 119885, -88983, -122392, -91156, 73784, -18136, -251139, -91262, 86667, -90962, -153111, -143705, -108736, -91310, -78424, 80467, 1127, -77600, -123532, -458118, -289426, -255116, -272703, -49833, -81861, -43716, -163667, -219815, -279924, -60088, -28998, -23720, 28800, -46341, -44620, -32660, -76, 42656, -24580, -10668, 125090, 177101, -48755, -224097, -293013, -145958, -171271, -266285, -361708, -298633, -128762, -50097, -35688, -40357, 7359, -64639, 176567, 167897, 128387, 32434, -122568, -67381, 57553, 8229, 96282, 339086, 307412, 101516, 78553, 100187, 75167, 251492, 295156, 237769, 351386, 239915, 202635, -72823, -223114, -73866]
16114g3866J58157j1503j21754l17974m4524J94811J99559Q1760p027Q6384k43987
16103i9964l30465J33210O5939r747p9764J9884L7683K02198K22242R1701O5708
16092C18625j94032j55043k4710K65768J69512M843j61455p6790j80042j06033
16082a39357P4422K41226J28279P0748Q9710J08548K4260j44237k36185k18068
16072f54o6131j2830N4573L8387J48809K41754j15029j44579k51825k84398m2463
16061d34386r7061J31351K67726J95826o6891k3118m7860j07798k27373k49539
16051f59123J92278K04122J0633J49918J16767P1434n8040J3063Q5208k2169k83868
16040a79777j54612M989J53670J77493q3201J04327J60675p0365j2070O5422j16740
$$ y = [-73866, 84291, 72788, -48966, -366940, -411464, -216653, -17094, 64666, 57639, 144023, -99964, -430429, -297219, -231280, -241027, -320791, -300907, -263224, -61026, 161216, 252917, 318625, 124593, -30450, -55160, 210608, 380120, 384963, 223508, 146718, -33324, -139357, -64935, 176291, 304570, 375318, 465028, 573576, 597836, 453599, 217414, -654, -66785, -79615, -25042, 13345, 162154, 403908, 288879, 144300, -107525, -391923, -434386, -531447, -400096, -132370, 63456, -3435, -26553, -74413, -182211, -409584, -659123, -466845, -262723, -252090, -102172, 14595, 86029, 27989, 41052, 126260, 104091, -179777, -334389, -329400, -175730, 1763, -81438, 22889, 183564, 113199, 101129, 166551, 49811]
16029D9811n1613Q0083L231l9798j44615p1023K24632J71826n7763M0594n9524
16018A45841k36877j24453J9832M546R6042K57050j0187n3860j90866j68950j34026
16007c95908R4628N9775m8349n7952j72965q2041L99341J42099L0639j3059Q411
15996c5381J1224q9809k1842J4591j83547J5522P5626R209N8449J62181K5576
15985D1799m4884j1379K6954p9868j17451N0448K1669o1335l3212J22492J20062
15974C5295N5387K39010k01700k91679o8115K41445K19460J98167k453j2377j23671
15963B88769n1269J8464q6032m9316j49210j30947j2253J26827J16161L4497j21047
15952a5356K601p5916J10078J63617J13133k1223k37864j8769J72178K8989m5240
$$ y = [49811, -1802, 78281, 81512, 41714, -102901, -173924, 50708, 222534, 164771, 205365, 145841, -91036, -215489, -195657, -191111, -95069, 161981, 151794, 97934, -92932, -261882, -395908, -301280, -241505, -289854, -347806, -520771, -602812, -203471, -61372, -30733, -43792, -35381, -24157, -113966, -135808, -121217, -304764, -289242, -213616, -204407, -145958, 16223, 41799, -3085, -14464, 12490, -67378, -184829, -134381, -112712, -174047, -207259, -84767, 35295, 90682, 329692, 127992, -163687, -231802, 9643, 229103, 427270, 424817, 412440, 288769, 237500, 255964, 169932, 120616, -28594, -159541, -171794, -44967, 71194, 105691, -15356, -12755, -88671, 21407, 185024, 298157, 276934, 39070, 20301, 192479, 221468, 176228]
15941A76228K2337j46447k27458n9224J58380p8908P4524m2957P1061K4870J49485
15930A21891P6129j51985q7772J54025Q3871j13935l09818k03127n094K76677
15920a59138M9306m0197n322k34542K9649j45388J92080K12361J07305j1260K4592
15909A9446r901o2249J45054J676j27309O7190k9227l519J18180K37941J0093
15898C67375j17135K0416j33512J1677J12699j17856l07236q4559J27591M3635
15888g6905j7864R4503j23093j0234M097j84688R3476j70631p3152p7175N4657
15877d87009L06153N3581k03734n9153O7117N6501J98094K1560j33915j46439
15867c27244K8058J96435K53122K54238J05796p4475k43543k57209N3016Q8588
$$ y = [176228, 198565, 52118, -175340, -234564, -76184, -155092, -80568, -123525, -52464, -27594, 121891, 198020, 46035, -41737, 112288, 196159, 82224, -227594, -430721, -435815, -159138, -109832, -150029, -155351, -389893, -360244, -505632, -313552, -101191, 6114, -5146, 19446, 9545, -52704, 92350, 94026, -33283, 33907, 4680, 1161, 119341, 357282, 367375, 250240, 270656, 137144, 148821, 261520, 143664, -163572, -248131, -120540, -76905, -94769, -266, -123359, -133593, -129496, -314184, -220708, -391339, -464491, -541666, -487009, -180856, -127275, -331009, -390162, -323045, -266544, -68450, -46890, -180805, -327244, -299186, -102751, 150371, 404609, 510405, 435930, 192387, -64822, -11806, 76782]
15857G6782o919j72794L2774l2771J95566J80840L7714k49621j6561n8054J9084
15846F040j77988O5629l0695q5549Q761J38207R6406O1474J03650j73027k8528
15835a5620J26008q064l58773q8650J39354j31686p8420K76651K03074J50199
15825B14073j56576q7989k26229l294j2688j50001r47K71098J45078q5844L8236
15814e5083J20248P1786j25870j38250J36655K19160r2790m1483o6441o3282J04259
15803F8909k92931k58971O3040J60986p8125o5355K59030J69356J56403k3374
15793A58968o839M0654o0483K37145R9483j75569j86412k54498j27003J0867N8013
15782b05674m9521J01696K0169K7440J88822L0465j67087k7465l2501J23837N6715
$$ y = [76782, 69863, -102931, -70157, -102928, 92638, 273478, 311192, 61571, 45010, -13044, 6040, -171948, -106319, -137014, -222563, -213802, -75595, 20811, 82285, 185935, 12908, -15620, 110388, 102324, -256449, -345099, -205745, -337431, -415851, -139200, 63874, 214073, 57497, -30492, -256721, -260015, -272703, -422704, -423651, -152553, -7475, -93319, -55083, 65165, 136951, 11081, -127169, 9486, 228646, 135856, 94373, 27932, -35350, 68909, -224022, -482993, -419953, -258967, -337092, -402447, -143417, 25939, 182342, 158968, 152129, 192783, 132300, 369445, 468928, 293359, 106947, -147551, -274554, -263687, -205674, -255195, -153499, -133330, -105890, 82932, 113397, -53690, -81155, -113656, 10181, 66896]
15771F6896l68820J77847J49819l5980j92386j7094J08237J07882L1197j01134
15761g3536L2467Q187P1218o1766k09524k627J97536j06566j48983J77659P2595
15750d3340j36803j19178P2851q8886O2535R9848K16246N4666J02541J0410q538
15739B22352j10601l5270j72397j04187L6373j10654j7383J90966J91100J62373
15729B52672J5370j35655j68973m0622J1052p265Q1033O183o2653Q2386K01476
15718B35004M0893K7627j26104N59Q499j86726P4192k4252L6016p1741N4188o7039
15706A116l09989p3019K03343Q6123k13168J4703Q7067q3369K67075K13664J1644
15695B05190j76801j5587J92777l5821K919j02242L3709J04351J02549o7018k48900
$$ y = [66896, -301924, -124077, 25742, -10238, -202624, -219718, -111481, -3599, 27598, -73536, -41069, -32882, 38336, -23430, -232954, -235581, -38045, -144611, -293594, -115935, -43340, -180143, -299321, -226470, -315356, -252821, -152973, 63273, 117939, 220480, 230890, 222352, 111751, 76481, -95916, -200103, -163730, -274384, -291767, -100801, 90299, 252672, 268042, 132387, -36586, -77208, -66156, -73421, 7612, 13795, -48858, 33528, 235004, 275897, 303524, 177420, 177979, 186478, -248, 73944, 49692, 85708, 13967, 68155, 1116, -308873, -381892, -178549, -92426, -305594, -290891, -203824, -287193, -20118, 193546, 205190, 28389, 12802, 205579, 169758, 172677, 70435, 104144, 208495, 311044, 244026, -4874]
15684d874k727J48149K2567q3337K1614M0397j65523J3840K3958m8611j43148
15673a77695J7759O1832J7329j05389J80120J21626j0149k39480N4861Q9048M4628
15662E4490o0580k18993N9776J03766O8293j64074J23887P91L2590m0058M1995
15651A883M6600J21871o4607l32900o2481J73599Q410R137J24700K54810O5254
15640C46276j38028n5118p1962l21630j84210J42189J78835l0276n1629o5175
15630b50728L8055M71764l0165k00385n3212N8627o4913Q3003n4290P8336l8745
15619C7347j0515J26984K58213k996n1664m5646j79301M9519l5501q9006q444
15608D8990j18869N9743n7265M8793l71p8237q9563O841J50578J61083L00888
$$ y = [-4874, -7601, 140548, 163115, 79778, 101392, 141789, -23734, -9894, 14064, -34547, -177695, -159936, -98104, -80775, -186164, -6044, 115582, 105433, -134047, -79186, 9862, 54490, -6090, -225083, -165307, -61541, 6752, -157322, -33435, -32644, -54, -40112, 1883, 48483, 170354, 105747, -227153, -289634, -116035, -107625, -98488, 26212, 281022, 346276, 208248, 153130, 81168, -240462, -424672, -282483, -103648, -133924, -185553, -250728, -212673, 259091, 228926, 28541, -24671, 33956, -30957, 52046, -2244, 76092, 37347, 26832, 153816, 412029, 409033, 357369, 311723, 132422, 181941, 146440, 57434, 48990, -69879, -10136, -67401, -18608, -18979, -97216, -186779, -179938, -29360, 131723, 432611]
15597D32611K75929k84106k53613Q5282k02268j01306J31940r2716R1300p6737
15587F316r7998L3595N3024p4479j2692p434j20797K56071k0343o879j22177R0739
15575b3054R9771q5161P022o916j18194k5031Q4367k5721Q4765j11326j67018
15564b86496j19687L4855j41255j1128n6917L9276J55264K2705L5104p1234J84779
15553b14734J61216m8392j54475P4296R7715j11176l1139K38473J37344J10177
15543B59305j15038j02692L3459Q1411j51993q745K50997p3371r8860J65021l2652
15532B06842l5849O2461l5878O8703j23205o3311o1072j47746j102r2000r6898
15521c19055R9415K42511L26098O1651q7271j87064l0118J06156k12132O29J78405
$$ y = [432611, 708540, 424434, 170821, 256103, 53835, -47471, 84469, -8247, 83053, 6316, -91682, -58087, -5063, -79542, -92234, -99668, -220465, 35606, 15263, 8384, -113793, -23054, 76717, -8444, -1422, -8338, -126532, -151563, -67196, -92917, -8152, -119478, -286496, -406183, -371328, -512583, -523711, -580628, -541352, -386088, -363383, -328279, -399513, -214734, -53518, -101910, -256385, -182089, -84374, -195550, -226689, 11784, 149128, 259305, 144267, 41575, 75034, 156445, 4452, -4293, 246704, 173333, 74473, 239494, 206842, 170993, 233454, 197576, 266279, 143074, 79763, 18691, -129055, -130157, -222157, -319055, -219640, 22871, 348969, 410620, 323349, 136285, 106167, 212323, 191, 820, 179225]
15510A79225M5715L5517j65352K7245K6665j27239q9299R5799o3423q7859J58461
15499C5455Q7577J34538R4766k8987L297j7795P2617j00210j42935n1286k2649
15488F4388J20457n9205J22175K6719l12350k78524N9177M0396P2310J28236L9745
15477B3524o5477L9531J1455R9016J23564p5499o7306n2115O7400j27789Q0329
15466E6633k9520j10263j9952O3131J97737l4573j24238p3930k5710M5859K54091
15455A99265L6668k42038k20802J7585K15291K99176n5069j92804K238k96641
15445b37131m330J10511K89531k0544k57193j80760K45592K16263j40087j20394
15435i8542j17871K3135J01787J29745q2835K214M9386L31197J77605k31532j80473
$$ y = [179225, 224940, 260457, 95105, 122350, 149015, 21776, -67523, 28276, -35147, -123006, 35455, 123032, 257570, 352336, 323349, 326646, 308851, 381468, 281258, 138323, 87037, 64388, 184845, 125640, 247815, 274534, -37816, -316340, -257163, -216767, -144457, -16221, 23524, -41953, -2422, 9033, 108049, 231613, 156114, 88808, 36693, 104093, -23696, 56633, 27113, -83150, -103102, -39971, 157766, 123193, -1045, -74975, -100685, -54826, 199265, 235933, -6105, -226907, -209322, 5969, 305145, 250076, 57272, 59510, -237131, -241461, -130950, 158581, 138037, -119156, -299916, -54324, 161939, 21852, -98542, -216413, -193278, -91491, 38254, -44581, -42367, 7019, 338216, 515821, 284289, 103816]
15424A03816k16579k86669M4354P0333J309k1927j16398L6919P2983L0729J05023
15413a76107j77948m6167o7018L6674J3357K542J76603J81324M1391k55425P8488
15402a92286l4239j2892J45971K5707R5308K96356K54103L3388j46768o658m1834
15391D16156m0546Q7088k39105j88828Q4319L1297k25482J1302M2352L7572Q3746
15380I9871m4697n5816J12552P9721k7146q2712Q3252J80154R1242L0067O7580
15369E34068k53286k04428k26262l7147j0577O992L9413J02159k8562N9717R2101
15358G4188j46266p8250J06195J25338R7491q7117r395J26134l9211k75324L1946
15347g4271l2532J2464J83587r8212k08400n8629J04345J03016O5539J9292M526
$$ y = [103816, -112763, -399432, -355078, -284745, -283436, -305363, -421761, -384842, -311859, -281130, -176107, -354055, -400222, -467240, -430566, -417209, -414667, -238064, -56740, -15349, -270774, -192286, -226525, -239417, -93446, -67739, 27569, 323925, 578028, 611416, 464648, 457990, 416156, 375610, 462698, 223593, 34765, 119084, 150381, -75101, -63799, -21447, 16125, 99871, 55174, -642, 111910, 191631, 164485, 81773, 165025, 345179, 436421, 466488, 534068, 280782, 76354, -149908, -187055, -197632, -190640, -151227, -49068, -77630, -17913, 74188, -72078, -150328, -44133, 81205, 178696, 91579, 82184, 208318, 169107, -106217, -74271, -106803, -94339, 89248, -8964, -217364, -275993, -171648, -68632, -3093, 16199, 20725]
15336B0725J10005j2341j30965k6208R0006j03213j99922N5554o1393j9571J59636
15325a17687P5208n9882n2006J54848j1547j4785P3887N0195Q4538M1716M4372
15314B68857k36662l08643K22461m3445j16811P5130l4564j48144k27425p0273
15304f19519M15472K13485Q3994K2869k99006k22547L344r6877J11626K26259
15294a60900K12855J48691N5635m2391k65745j48943N3810J29622p195N1045l17642
15283b91158J7061J89136l9096j63849M7734L0662J25582J27517J4591j30212
15273g2032l4175k8314O6556K01331K0155j67296R5195k6872j17559J57955J9296
15262A14240j06744j86470n3007j40089R0661J04841J56363k7536p7090j5168
$$ y = [20725, 130730, 118389, -12576, -38784, 51222, -51991, -251913, -196359, -257752, -277323, -117687, -42479, -102361, -154367, 481, -11066, -25851, 48036, 98231, 182769, 224485, 268857, 32195, -276448, -53987, -97432, -214243, -139113, -173677, -321821, -549246, -619519, -204047, 9438, 93432, 116301, -182705, -405252, -401908, -498785, -387159, -160900, 51955, 200646, 256281, 213890, -51855, -200798, -146988, -17366, -24561, 26484, -291158, -274097, -84961, -124057, -287906, -240172, -209510, -83928, 43589, 58180, -72032, -106207, -134521, -67965, 133366, 153521, -13775, 81420, 54548, -63011, 94944, 114240, 7496, -178974, -231981, -372070, -281409, -176568, -20205, -47741, -124831, -139999]
15252a39999j73508O474P4824K2163K85067K09543K0185j77212j837j28924k28679
15241b31903J12401J31433j21727j5490r3434R572J43809N1952n9143K7950q0531
15230a25111M6879j23629j18078J21741K43454j44483j54877J02338J89758K44036
15220B82028J24051j47363J67336K1569l2019j53786K4025j04309j34594j01501
15210e4563L5544j4088J57806J45247J31215l0563n7480O0583k03031j90304o3316
15199h2950j55503L2356K09183J79479K44j00859Q6424o4414k9887P0128n467
15188A38734j54306p7134J53198k2822l3247j37496K42488K21292j66478J20730
15178B84959R2353j35580k25947j20297R992O8770J18430K34142j34057j31438
$$ y = [-139999, -313507, -307033, -232209, -210046, 75021, 284564, 304749, 127537, 125700, -3224, -231903, -119502, 11931, -109796, -125286, -218720, -209148, -65339, -13387, -72530, -44580, -125111, -78232, -201861, -319939, -198198, 45256, -99227, -254104, -151766, 37992, 282028, 406079, 258716, 426052, 447621, 415602, 261816, 285841, 181532, 46938, -54563, -19019, -33107, 124699, 269946, 401161, 370598, 313118, 373701, 170670, -19634, -82950, -238453, -206097, 3086, 182565, 182809, 81950, 168374, 103960, 74073, 144201, 138734, -15572, -92706, 60492, 37670, 4423, -133073, 109415, 330707, 164229, 284959, 377312, 241732, 15785, -104512, -94520, -25750, 92680, 326822, 192765, 61327]
15168F1327j49904q830l3685J92927p224j58999k46101j08919k7366J64644p3621
15157c95751j55253K08401K91545K55289j66932j33868j9491j978p7285m854J84435
15146a5742K09860m3588j59141O9606J29807L0831m2450p0768q3571p81J31110
15135A55173J83263Q0618l1246L8734j43325j76405j13272J1022J14059J42275
15125B60896J5635p4694j27653m7887k45366m0778l8940k4290J05166R4420J48250
15114B4759N7772M9270k3156M301p2663K19602O8316j39194o2818L9236l3245
15103A32180q3433K23483J09074j20637j68943j94021l4321N9127k1389J47485
15093D8605J55915k0910n8542j19555p5686J40710J46293n4153j06116j07647
$$ y = [61327, -88577, -97407, -131092, 61835, 54611, -104388, -350489, -459408, -486774, -322130, -395751, -551004, -342603, -51058, 204231, 37299, -96569, -116060, -118038, -195323, -200177, -15742, 194118, 150530, -8611, 60995, 190802, 221633, 179183, 108415, 24844, 24063, 155173, 338436, 419054, 387808, 426542, 283217, 106812, -6460, 4562, 118621, 260896, 276531, 201837, 74184, 26297, -219069, -259847, -298787, -323077, -217911, -123491, 24759, 82531, 131801, 108645, 112946, 40283, 259885, 328201, 189007, 126189, 165425, 132180, 48747, 272230, 381304, 260667, 91724, -102297, -136618, -77491, -98880, 48605, 204520, 183610, 125068, 5513, -70173, 70537, 216830, 162677, 56561, -51086]
15083e1086Q6484N1064J11149N7079J00780Q0101L0232K0730j62274o5365q7181
15072A71713p0042q3792J0203j07897P8834j22196K16201Q4298m1177q0863J39350
15061A94632k36880j81159L16829J66742L9952K5888n225r4099j04274J37416
15051B59822R9818j5012j30854k81428J91743N9460M342J07125p0763j32152q9549
15040B552m415Q28n5088J61629L7899j33698j39839J7894M5568L0379m0869P4038
15028c122l5717K3185J00707k25407o3289j34506N0497O9850Q2138K9848J06568
15017G52l1345M742o8930r472J74737K30813R0211j84315r6581p8957j62679j75259
15005c06283M8351P0804J01074r7566j8328Q2874K67956J28489Q781l389j612
$$ y = [-51086, 35398, 86462, 197611, 254690, 355470, 435571, 465803, 486533, 324259, 258894, 171713, 101671, 17879, 28082, -79815, -981, -123177, 93024, 177322, 136145, 55282, 194632, -42248, -223407, 93422, 260164, 300116, 326004, 320779, 226680, 122406, 259822, 359640, 344628, 213774, -67654, 124089, 183549, 187891, 295016, 224253, 92101, 2552, -1863, -1035, -56123, 105506, 143405, 9707, -130132, -112238, -66670, -36291, -77160, -3122, -38839, -15654, 85053, -140354, -203643, -338149, -287652, -217802, -135664, -105816, 752, -30593, -25851, -94781, -104253, 70484, 301297, 391508, 207193, 110612, 31655, -131024, -306283, -257932, -187128, -86054, -183620, -201948, -119074, 148882, 277371, 286152, 282763, 281151]
14994B81151n2610k4024M6444L5257M6217j10974j37945k05707k9265Q7766J36888
14983G3198p6914j4674j61957j76845J7389L40144Q5136L50899j31907j44561
14973A59908P3386k29787J01459K12916J26781j19758k18252j62141L8151j13143
14963a30480Q602j14714M6292n4916j83507K18058Q6499N1597Q1655k5588m2400
14952e8902M2694J74244J3633r2357j16826p2226O4726L2428j3520J50845o7927
14941E6812j29197p421j4681j10176K498O7734L03337K90800L9313r8005j55369
14930B45645j50611l24138k1516L8630L47668P0184m1710j34006j98806J45707
14920b2953o4860m4668L9753J34759j67670j96859n4797J74925K37802J22283
$$ y = [281151, 228541, 204517, 250961, 286218, 332435, 221461, 83516, -122191, -151456, -63690, 73198, -3716, -18390, -180347, -357192, -339803, 341, 85477, 436376, 304469, 159908, 233294, 3507, 104966, 317882, 444663, 324905, 106653, -55488, -17337, -130480, -121878, -236592, -190300, -245216, -428723, -210665, -124166, -72569, 9086, -16502, -58902, -16208, 158036, 171669, 79312, -37514, -109740, -45014, -12586, -26106, 124739, 56812, -72385, -79806, -94487, -204663, -202165, -134431, 168906, 459706, 499019, 401014, 245645, 95034, -229104, -250620, -211990, 135678, 205862, 164152, 30146, -168660, -22953, -87813, -132481, -92728, 42031, -125639, -322498, -377295, -202370, 35432, 157715]
14910A57715M3884j17409k39112r9043L55853J45292j46835l0456K5529L3726
14900A29144q1167Q400J18058j46525K588J56224Q6885j00324j26601k2416K05252
14889B29518J30718j89947k65445K4691M803R1071K24703m8757l3791j75284J14603
14878A06883J23292o3009j08073J20051m0138j05776n2184j16622J9777j603J62342
14867D4940L66335J40813m6477l74149j28442m4130J49650J18313p5022k7353
14857A24478J7943j14678l67436k57613J14798K71287J64184K9056P5266P3547
14847A30832j07170j04784r3974J4473K56859J0263l6597k40205k3544L6574j31380
14836b88653L5196J6634m7817L6693J62784J31939L8804J9373P8930j91169J0638
$$ y = [157715, 201599, 84190, -154922, -253965, 101888, 247180, 100345, 69889, 95418, 129144, 47977, 56377, 174435, 27910, 30498, 186722, 273607, 173283, 46682, 24266, 229518, 360236, 170289, -95156, -70465, -65662, 25409, 250112, 201355, 167564, -7720, 106883, 230175, 167166, 59093, 179144, 139006, 33230, -18954, -135576, -115799, -117402, 44940, 411275, 552088, 505611, 131462, 3020, -41110, 108540, 226853, 151831, 124478, 142421, 27743, -339693, -597306, -482508, -211221, -47037, -17981, 57285, 130832, 23662, -81122, -175096, -160623, 96236, 106499, 69902, -170303, -193847, -157273, -288653, -253457, -236823, -284640, -247947, -85163, 46776, 85580, 104953, 183883, -7286, 3352]
14825C352J41438r4136j14296o3931M2544K1385P8523J45139o8528j22872j01009
14814a32391k1989K03975J34468p8512L0770O8602k27817r6603R0853R6183J12340
14803A79879K76496p6799Q4526j45705j18978j96032J04750o1068j78700l3367
14793a64998j15721J36845J11881l3818J7733J25512J33650J04578P05J2664k72286
14782E6745o4433Q6434J4574K7688J20125J4662j65757o9179J19548K39064k9464
14771C50007j6807j92910k01677k40737M8893M07668L6530K20264K5323k46784
14761A89770q5316K26069j1658j85491j06138O9150j15556n387q0695N6751K04541
14750A56040q1368k59378j63624P375J25963J13806j24143j85569R1884J22378
$$ y = [3352, 144790, 50654, -63642, -127573, -85029, -63644, 14879, 160018, 91490, -31382, -132391, -154380, 49595, 184063, 105551, 136321, 204923, -22894, -119497, -28644, 67539, 179879, 456375, 379576, 464102, 318397, 199419, 3387, 108137, 47069, -131631, -164998, -280719, -143874, -31993, -65811, -48078, 77434, 211084, 315662, 316367, 329031, 56745, -7688, 78746, 93320, 121008, 241133, 255795, 90038, 20859, 140407, 379471, 350007, 333200, 140290, -61387, -302124, -253231, 154437, 190967, 411231, 436554, 189770, 104454, 330523, 318865, 133374, 27236, 96386, -19170, -24557, -105252, -48501, 156040, 74672, -184706, -348330, -340955, -214992, -101186, -225329, -410898, -319014, -196636]
14740a96636r1840J87080K77450P5390J26701l9969J66804M8827k23204k05459
14730A25144m7195J36627J88328j5338k29427k88062j16313j48925K0282K55893
14720a18986J55274q3356J0451K40573k85122o1488J82442n6759m3620J13326
14710E2735M0754o9215r1508J78578R2899j45728j73428q2476J64874J51342k01465
14699h2638l4299K18331J11848k18596j54906j51382P5664Q0617J08980K8196
14689a8185k5785n4900K0937J44046J68413q1643r6026J06243j05816j44320j37053
14678b24089j43295j4478N2090J26486J21570O1940n5776k9484p3759J77029P8415
14667G6649q3543r8288l0059m98j12937J1235J85288K03254J37j71702j28484
$$ y = [-196636, -288476, -101396, 176054, 251444, 378145, 338176, 504980, 553807, 330603, 125144, 77949, 214576, 402904, 387566, 158139, -129923, -246236, -395161, -374879, -118986, 36288, -47068, -36617, 203956, -81166, -142654, 39788, -16971, -60591, 52735, 93489, 24274, -67234, 111344, 204243, 58515, -114913, -197389, -32515, 118827, -82638, -116937, 101394, 213242, -5354, -160260, -311642, -235978, -155361, -46381, -18185, -43970, -98870, -77933, 66113, 234526, 152883, 56857, 163100, 57284, -87036, -224089, -367384, -381862, -329772, -203286, -81716, -19776, -75552, -105036, -178795, -1766, 76649, -6894, -105182, -135241, -135739, -248676, -237441, -52153, 151101, 151238, -20464, -148948]
14656a48948o2791N2766N1545M7027m0758M9070k3893l9125O584J45895Q6286
14645A23658j88291j63073M6335J03218K4977P1378K2782K4821j748M8606J45646
14634B58309K8792K764J0025k11527N6068l2518j3308J7933N4389q7391p5286
14623H250O8584J53353J27237k09315j52643o5018j5090K755K8216j44130J27191
14612g0610K06488o4898j0931m255j9134J00248M3544o7601o4870o3296L0763
14601A5448Q1091M1505j51590J48278q1853j61588j99332p5298p6190J12132J86600
14590a60797k5324q1621J5548J73539K32719j4666j28159n6720M516J51240R952
14579A20227k04072J40183P2757j42674p7478k2931k29656l9395K7604P294K66785
$$ y = [-148948, -211739, -158973, -107428, -60401, -101159, -52089, -75982, -115107, -108523, 37372, 123658, -64633, -227706, -181371, -78153, -53176, 18202, 40984, 65805, 64057, 112663, 258309, 287101, 289865, 299890, 88363, 144431, 111913, 98605, 116538, 170927, 83536, 8250, 76834, 230187, 357424, 148109, -4534, -69552, -84642, -81887, -53671, -197801, -70610, 135878, 70980, 60049, 55794, 36660, 136908, 180452, 112851, 47981, -15315, 15448, 96539, 138044, -13546, 134732, 52879, -108709, -308041, -383339, -459529, -347397, -160797, -186121, -267742, -252194, -78655, 154064, 139398, 11239, -45481, -40965, 110275, 120227, -83845, 56338, 129095, -13579, -91057, -113988, -343644, -383039, -355435, -348141, -81356]
14568h1356L2290j88938o9277J69626K13139k0978q3009l5025k4437K6938q9426
14557a50453P2965K04442n6984O89o330l1216j35337j47348o5703P9911J26355
14546a09009J1342p4697k5072N3865K40053K48133P3109q667j17405l7615k42094
14535A1943j89338J68070J04292j26111j08302J89575Q9176j55531j31182K5206
14525a22202J59854M6307p4507N9001j35096k25081Q8745q6696J01721K21110
14515C3156J41984o5689j3047O041k53274P0962K67833q1487P4091L2052m6007
14504A66615j21526L1344J31517K43857P2281K65620K51227K41406K703J5149
14494A300193l5360p0118P7260k9691j98602k06972k90376j77250j87902L9137
$$ y = [-81356, -49066, -238004, -307281, -137655, 75484, 54506, -28503, -63528, -87965, -61027, -150453, -77488, 126954, 69970, 70659, 64329, 33113, -102224, -249572, -315275, -235364, -109009, -97667, -172364, -197436, -143571, 96482, 344615, 417724, 409057, 291652, 254037, 11943, -177395, -9325, 94967, -31144, -139446, 50129, 139305, -16226, -147408, -122202, 37652, 83959, 9452, 68453, -66643, -291724, -202979, -289675, -187954, 33156, 175140, 109451, 96404, 102445, -150829, -79867, 187966, 106479, 180570, 212622, 166615, 45089, 76433, 207950, 451807, 524088, 789708, 1040935, 1282341, 1285044, 1300193, 1264833, 1194715, 1271975, 1242284, 1043682, 836710, 546334, 369084, 181182, 220319]
14484B20319j37299q8008n9647Q1903J05868l0018k21508m1362J20843O6155O6291
14473H3537J55453P1961l20390N8184J23923N887j80737j13193k6381K1999p93
14462a20550k89486k8325J90961M7463K4471j17989o2659J60406J11871J65137
14452H1300O1969j0372j54118n5880K3575K7410O8436j7132j05733J47891j02338
14441c4992o8784K46647N7506J56000P0063J09247r2494j61612k87468j61544
14431a67431R3895K2995J52484Q3694P252l848K21259j63037o0506o7359j72593
14420e3195L5234O3203n9823K0284j70959O9443J47123L8720R5793r452r1988
14409H4383k00861p14p1126O4724J68625r1318l1036J67423N5085r8774k15395
$$ y = [220319, 83020, -4988, -64635, 17268, 123136, 93118, -128390, -169752, -48909, 17246, 83537, 238990, 310951, -9439, 48745, 172668, 178555, -2182, -115375, -141756, -119757, -120550, -410036, -438361, -247400, -199937, -175466, -293455, -356114, -195708, -83837, 81300, 143269, 132897, -21221, -77101, -53526, -26116, 42320, 25188, -80545, 67346, -34992, -103776, 142871, 200377, 356377, 426440, 535687, 443193, 281581, -5887, -167431, -73536, -50541, 101943, 185637, 192889, 189041, 410300, 247263, 186757, 119398, -53195, -17961, 45242, -14581, 5703, -165256, -95813, 51310, 90030, 185823, 176371, 84383, -116478, -117192, -188318, -123594, 45031, -46287, -77323, 90100, 145185, 46411, -168984]
14398a68984Q3271J98959J55112l14536J6193j11289p1651J22323P5504r889O1449
14387C6462o4640P5457J33860P8877R0216k57285j91161K0375J66219j19564o8405
14376i9589j17216J92946J46208N8209K3584o9333j47710J28700J45183j48090
14366A12892k01678j95236k0200o5164J66920J73661K6816n8100n9384L615J13227
14355b631j03578j26383j14473J88450K51396J47762j23092O7772p0480k4420
14345I0323p6832J37330J78368p8891k25793r9961J24154J09118p7618J54000
14335B34198J51664J32088L6346k8071n1616o9387j12768m3951P9157P6579J66647
14324E70886n4067o873J35282M144L021N5755J90318l68603k38772j0062K54993
$$ y = [-168984, -85713, 113246, 268358, -46178, -29985, -141274, -212925, -90602, -15098, -24987, 36462, -28178, 47279, 181139, 260016, 350232, 92947, -98214, -77839, 88380, -31184, -99589, -216805, -23859, 122349, 180558, 204142, 134809, -12901, 115799, 260982, 112892, -88786, -284022, -304222, -369386, -202466, -28805, -1989, -60089, -119473, -115858, -2631, -106209, -232592, -347065, -158615, 92781, 240543, 117451, 185223, 114743, 90323, 13491, 150821, 329189, 250298, 24505, -75456, 48698, 157816, 80198, 234198, 385862, 517950, 554296, 526225, 474609, 405222, 292454, 248503, 327660, 404239, 570886, 516819, 509946, 645228, 649372, 652393, 708148, 898466, 529863, 291091, 281029, 536022]
14313E36022J14460N5124J17730J54062L02863J11556K63914J50344L38711O17359
14303B762145N56940M42877M38749L21718J23649O2516l5861J02945K59214J68048
14293E202940j25345k52489k18465l68889n12658j95158Q24j72667k74036k18909
14283B865148j88426R4481j33750m4831J96230q0292p3449l5630K3195J38202
14273B760878L1905l0726K50011J91687K33433J73790L06926L64781J91443K18170
14263D692298R2057M1848Q7877J53105K5707j54922k64269l26966n12169l28959
14253C505607l09942l23274m03913k71909j49072m06585k30042q1900j68064k64960
14243H95946q8850k51815j35439j35531J41638J42089m1817P4469j75613k55800
$$ y = [536022, 650482, 705606, 823336, 977398, 1280261, 1391817, 1655731, 1806075, 2144786, 2762145, 3319085, 3761962, 4200711, 4522429, 4646078, 4708594, 4672733, 4775678, 5034892, 5202940, 5077595, 4825106, 4606641, 4237752, 3725094, 3529936, 3530760, 3358093, 3084057, 2865148, 2676722, 2771203, 2637453, 2592622, 2788852, 2708560, 2635111, 2599481, 2622676, 2760878, 2792783, 2762057, 3012068, 3203755, 3437188, 3610978, 3917904, 4282685, 4474128, 4692298, 4784355, 4826203, 4914080, 5067185, 5092892, 4937970, 4673701, 4346735, 3834566, 3505607, 3195665, 2872391, 2468478, 2196569, 2047497, 1640912, 1410870, 1328970, 1160906, 895946, 807096, 555281, 419842, 284311, 425949, 568038, 526221, 600690, 425077, 169277]
14233A69277J61044l0189p667Q3229p3859L0515j02619P5558J54603k3518N2321
14222D88695L0134j8764j88613k8894J34390J16364J6875k65275p1069n8062k7736
14211A28045k08440J04155n7577K66926o2517m7433K0287J9288p4528q8011j3974
14200a3779j18332r5081M3634Q2977J26331J69875j4436O1048J2950k29728j47718
14189a22259J93066K02361m3420J44176L7309j11566Q0825J25554j29190j14984
14179B61872l9159j91628j36981J08881J10770j22750J78139q0255j07033l4332
14169e2476j43961J4327K77657J76405n1445k36049L893Q4113K22637p373j54388
14158A33340j88485N6074R4120J32303N1887r5446O1531k02957k05716J77932
$$ y = [169277, 330321, 300132, 292465, 375694, 301835, 332350, 229731, 305289, 459892, 436374, 488695, 518829, 500065, 311452, 282558, 416948, 533312, 550187, 284912, 213843, 155781, 128045, -80395, 23760, -33817, 233109, 170592, 123159, 143446, 162734, 88206, 195, -13779, -132111, -227192, -183558, -100581, 25750, 195625, 181189, 242237, 255187, 25459, -122259, 70807, 273168, 229748, 373924, 411233, 299667, 380492, 506046, 376856, 261872, 222713, 31085, -105896, 2985, 113755, -8995, 169144, 88889, -18144, -52476, -196437, -182110, 95547, 271952, 220507, -15542, -11649, 72464, 295101, 287728, 133340, -55145, 929, 95049, 227352, 279239, 183793, 245324, 42367, -163349, 14583]
14148A4583J94088r837M5805N0613R8067K00845j87292j13856k2468J785J66987
14137D39320p1005k65624k23268J00974J32890j15337j01279r8378k4080J92551
14127c3236K62687j08688m8993K8991j78493j93978o4146O3844L4714p0581K3205
14116b84674J50425M8880l604P650k15330j63861J20498L40765Q4056r3559k2687
14105c1441J68573o8261j74552P0760J33400J40931Q5330J44824R5519Q6593k2920
14094F28756N2100m6377k65224K428q1141j35097j84004m7771K68464J40857J20060
14083D53051j09646j30486n1543J07446K910j53144m2410Q4291o2885J7456O4757
14072A79797q0440K67720J24454k17055j94020J23354Q9755J50233J18795j40418
$$ y = [14583, 208671, 198834, 244639, 295252, 393319, 594164, 406872, 293016, 270548, 272333, 439320, 368315, 102691, -120577, -19603, 113287, -2050, -103329, -201707, -225787, -33236, 229451, 120763, 71770, 100761, -77732, -271710, -335856, -272012, -237298, -307879, -284674, -134249, -85369, -88973, -81323, -296653, -460514, -340016, 749, 84805, -8754, -31441, 137132, 68871, -105681, -34921, 98479, 239410, 324740, 469564, 565083, 651676, 628756, 680856, 634479, 369255, 371683, 290542, 155445, -28559, -76330, 192134, 332991, 453051, 343405, 212919, 161376, 268822, 271732, 118588, 76178, 160469, 97584, 115040, 179797, 99357, 367077, 491531, 274476, 80456, 203810, 293565, 443798, 562593, 422175]
14062D22175j97879N9492N5004k1460j59115l7382l8448j4085L5008m7883J2859
14051F8286n234J20741j4681k89571k72427L2331L20591l8812p145O4856N7682
14040C6617M1391o613P407O9265J48747j12283k62422k79365L654l4568J09177
14029b78993N8360M9526j5356L524J48003J13018J1646j01176j46369q778N6548
14018a10047R3602K71851O3107j06709m2490r6787j0578P2437J5923N5113m9833
14007A55589j35161l5622p3789q0940K87643J47453j34733j66656J24421J63428
13997B51633M1996J19689j33989j05687o7633R6492q1748j42594k27679K22615
13987b6905M2523J56909L2805Q6119j08362k18408k6920J37966O9879j22586J46422
$$ y = [422175, 224296, 283788, 338792, 317332, 158217, 120835, 82387, 68302, 103310, 55427, 68286, 63052, 183793, 169112, -120459, -392886, -360555, -39964, -78776, -85921, -21065, 36617, 78008, 71395, 78802, 148067, 296814, 184531, -77891, -357256, -353602, -388170, -278993, -220633, -171107, -186463, -182939, -34936, 78082, 89728, -11448, -157817, -166595, -110047, -16445, 255406, 318513, 211804, 169314, 72527, 61949, 134386, 150309, 205422, 155589, 20428, -15194, -88983, -169923, 117720, 265173, 130440, -36216, 88205, 251633, 293629, 413318, 279329, 173642, 106009, 202501, 120753, -21841, -249520, -26905, 15618, 172527, 205332, 291451, 183089, -35319, -62239, 75727, 145606, 23020, 169442]
13976A69442Q2913J9154o5548k10506j34846j13763J41023j79401j45180K29474
13966b07238L46110o5255j85813j0746J37460M0681J63570j22167n496Q3693K7389
13955B02188N227m8568K5312M687M0321j8159k41458j13730J29474Q3886n0942
13944A8238L3446J58122P8487o9922j13583N9583Q1853n3416J50328k79335l4060
13933B9741k30800j7510o3597j3378K69193m2564J11679L390r0769j22826M2916
13922a24525j04389N5687Q4575N9755p228J5820j39636K36528J3994o5233l08474
13911b83126J20583J23761J5885J15397p312J00699m925j534l9657N8831J20297
13900C18899J3575j72387j73873q5958j11262j16251P8721J65005Q0724J8927
$$ y = [169442, 252355, 271509, 205961, -4545, -139391, -253154, -112131, -291532, -436712, -207238, 138872, 73617, -112196, -122942, 14518, 55199, 218769, 96602, 91106, 174799, 202188, 207415, 158847, 184159, 188846, 229167, 211008, -30450, -144180, -14706, 69180, 18238, 51684, 209806, 288293, 218371, 104788, 164371, 246224, 192808, 343136, 63801, 29741, -201059, -218569, -282166, -295544, -26351, -68915, 42764, 46154, -44615, -167441, -124525, -228914, -173227, -88652, -28897, -36125, -20305, -159941, 76587, 90581, 25348, -283126, -162543, -38782, -22897, 92500, 85188, 185887, 180962, 179428, 139771, 198602, 318899, 332474, 160087, -13786, -99744, -211006, -327257, -248536, -83531, -2807, 16120]
13890A6120j07866N6211O124J2331M4255N1457K90912J27615j29554l3628k05839
13879A28138k22152o2214k6588L20435L42905j94225k80342j01265j08337P1329
13869a32316m9020r2928J50147J50951Q0745l701Q3588l1326p4612j71230J24195
13858C4493J68722o2722k9264o6372m2582n579j30590K57683K34288m3096j33146
13847A81835R4737J14799L0176k60704l13799K3449J9640j80397K1240K38959
13837c0065L05703O8832j56137M4224R0852R3708j56164j26238l52944q2435J11721
13826a88943J19907P5868M0103N7425j60211k07298J54806J72195J60361o0826
13816A63387J47067J07305j91189r7502o733n7331j79400O5073O9892j8879N4973
$$ y = [16120, -91746, -35535, -29411, -17080, 27175, 78632, 369544, 497159, 367605, 333977, 128138, -94014, -156228, -182816, 137619, 480524, 286299, 5957, -95308, -203645, -132316, -181336, -274264, -124117, 26834, 107579, 103878, 187466, 156140, 81528, -89702, 34493, 203215, 140493, 111229, 44857, 2275, -3304, -133894, 123789, 358077, 314981, 181835, 276572, 391371, 421547, 160843, -152956, -129507, -109867, -290264, -269024, -30065, 275638, 344470, 188333, 232557, 323409, 417117, 260953, 134715, -218229, -300664, -188943, -69036, 6832, 46935, 104360, -55851, -263149, -108343, 63852, 224213, 163387, 310454, 417759, 226570, 129068, 122335, 65004, -114396, -49323, 20569, 1690, 56663]
13805E6663K35610p870k40576K0518N7091n3605j7402N579n3769K9024n3451j53261
13793a75449n4047R2453o2953o0077J03231J41994P0520L1175o1263j34824r8854
13782b08094Q0856k3545P8100L58k5505O5662K23761j41487j67563L9787N2793
13771b4877J97001r0525j15505J96419J78556r3317l72614n1742J17487q014J96016
13760A28885k0495J59334N9298J0694k2796K2971K5178Q2094k45245j83240K12015
13749B28693J10483k46255k80637m7099J67912J98608k5162J7266o6349j15568
13739e8108q2309j03174L6362j3074M7019J10178J07686J08993o2091p4660j59126
13728a42304N1045P7931J41892r8491l7791N569K42523K10455j00927l45568J57
$$ y = [56663, 292273, 284403, 43827, 64345, 121436, 67831, 50429, 56008, 2239, 31263, -22188, -175449, -229496, -137043, -199996, -260073, -156842, -14848, 55672, 86847, 25584, -109240, -208094, -127238, -150783, -72683, -72325, -97830, -32168, 191593, 50106, -117457, -77670, -24877, 172124, 81599, -33906, 162513, 341069, 247752, -124862, -176604, -59117, -67131, 128885, 108390, 267724, 327022, 337716, 314920, 337891, 363069, 445163, 199918, 16678, 228693, 339176, 92921, -187716, -234815, -66903, 131705, 106543, 123809, 57460, -58108, -140417, -243591, -207229, -220303, -173284, -63106, 44580, 153573, 91482, 16822, -142304, -91259, -13328, 128564, 30073, -7718, -2149, 240374, 450829, 349902, 4334, 4491]
13717D491j5559K18472J36761Q814j50818j33124n8896Q7640K6393N7021j23642
13706E7553K4676k0079O775q3997k0103J07694j16837n7011J1477j4508J17785
13695A3425J81858j25337j14591j33452k5225l2866K09646J37620k2973r3350
13685e245L6184N9311j62180q5838J47243J91866j18523M7319Q2634n4931m2702
13674I5138m045m338L261j67469j95967L10185N831J6766r3590j43815K9913J91995
13662D3865J37341J87760r206j17684k51001j34594M7150J52727j17070j7767
13652g8479m9369j45872J07459J75864K32898o7638j61099q132K4158K49719J89485
13641D68994k21050j79785L51177J18562l09146k0916K2124l31824J95085J87172
$$ y = [4491, -11068, 207404, 344165, 352979, 202161, 69037, 10141, 97781, 124174, 181195, 57553, 82229, 62150, 68925, -15072, -35175, 72519, -44318, -101329, -89852, -104360, 13425, 195283, 69946, -44645, -178097, -203322, -236188, -26542, 111078, 88105, -5245, 30939, 90250, -71930, -157768, -10525, 181341, 62818, 110137, 192771, 137840, 95138, 91093, 86755, 90016, -77453, -273420, 36765, 42596, 59362, -34228, -178043, -148130, 43865, 181206, 368966, 359760, 242076, -8925, -143519, -96369, 56358, -60712, -78479, -127848, -273720, -166261, 9603, 242501, 174863, 13764, 5632, 29790, 279509, 468994, 247944, 68159, 419336, 537898, 228752, 207836, 229960, -101864, 93221, 280393]
13631B80393k04816j09398L0249M0673m3770k6480Q5620r8703P4216j0840q4048
13620f6904r881K09983M6803J24365M2398L5050m2928j90563j50737j37412j91185
13609c31011J75489J13008j54549r9563J08024P2237o5532J42217n9127K8490
13599g0317k1324j2703l3007j2038J06406J30727K7182P9490J13012k08720R2342
13588A91050l7244p4670L5972j30740J21114R572P5071j16626O4782N8348k25395
13577b8766q7708J76681k8538p2070j1333R4805k79128N2211J54974k23007N3172
13566a98707q1054p478P7379K71006J78240j80590l36894m3430O3325K0281N0264
13555a87658o2201k03247M1399J59653J06317N8165J06078j54947o6537j40318
$$ y = [280393, 75577, -33821, -3572, 37101, -6669, -33149, 52471, -46232, 27984, 17144, -66904, -76785, 133198, 180001, 304366, 346764, 381814, 338886, 148323, -2414, -139826, -331011, -155522, -42514, -197063, -296626, -188602, -116365, -181897, -39680, -98807, -70317, -91641, -104344, -137351, -149389, -42983, 87744, 114926, 194416, 307428, 98708, 191050, 153806, 79136, 115108, -15632, 105482, 115054, 190125, 73499, 138281, 196629, -28766, -116474, 60207, 31669, -40401, -51734, 43071, -236057, -183846, -28872, -251879, -198707, -279761, -287239, -209860, 61146, 239386, 58796, -278098, -321528, -258203, -237922, -187658, -249859, -453106, -411707, -252054, -145737, -87572, 18506, -136441, -202978, -343296]
13545c43296o174J56733J76937J8728M7892j4413O222Q6201r7606j07257J8761
13534e7272N1657j60382K26177J29151j18362m9853k1906p2241q2472L8567J04634
13523a2302R4946J23023J8319j49043j61217Q9179K14932j31955j84024j07679
13513b05821P1581J81601K0155k4871l7532Q522m2779k5665Q4994J25253J94531
13502C49969J15162L4945j92673O8388l9710k03309n1782J46198j61103l12585
13492b46500L60200L24463K2745k17024k00673o2416K913K9358J22834j89297
13482e3397j20543M8516L43574l4858r2141n7891L561O6513j36709o894p2562
13471a12831J3425J9812J2502j7128M7391J62972j07823o7579j79482J41631K38485
$$ y = [-343296, -349470, -192737, -15800, 2928, 50820, 36407, 42629, 128830, 31224, -76033, -57272, -5615, -165997, 60180, 189331, 70969, 21116, -790, -73031, -155503, -116936, -12302, 82644, 205667, 223986, 74943, -86274, 2905, 217837, 85882, -98142, -205821, -134240, 47361, 67516, 42645, 5113, 13635, -29144, -54809, 30185, 155438, 349969, 465131, 500076, 307403, 375791, 336081, 132772, 80990, 227188, 66085, -246500, 113700, 438163, 460908, 243884, 43211, -19205, -16292, 13066, 135900, -53397, -173940, -125424, 218150, 183292, 91151, 33260, 36821, 103334, -33375, -40269, -112831, -99406, -79594, -67092, -84220, -36829, 126143, 18320, -49259, -228741, -87110, 151375]
13460A51375j43283k44105P1078J33838j1158J78631j35481o3317l1938j80386
13450b74746l062J22952q7739j59783J16269J29136J34076J46649O8834o6026
13440A26560r3451L7639k1781q5471k46312j54127J61324P7823p4448J46376j7430
13429a43298J1080j01055J3330J87451N4729k42466k5246J31335N194Q133J38510
13418C7697j01319j30585J96600K44250p3638q4087n917l3850q8163K36145J9041
13407B16174l4059k8675j91877j2295j1059j31747l6995l359J54891j24021l0303
13396b33325L00448J65506j41428r747l0386J07652j09677j34982J39798p6913
13386b3054k2024K9097k13916l7619J67851k7085J05656K08521j67868l20893
$$ y = [151375, 8092, -236013, -164935, -31097, -42255, 136376, 895, -62422, -94360, -274746, -277808, -154856, -242595, -402378, -286109, -156973, -22897, 123752, 192586, 126560, 33109, 70748, 48967, -36504, -282816, -436943, -275619, -197796, -272244, -125868, -143298, -132218, -233273, -219943, -32492, 22237, -220229, -245475, -114140, -108946, -100813, 37697, -63622, -194207, 2393, 246643, 173005, 88918, 83001, 49151, -39012, 197133, 216174, 182115, 153440, -38437, -50732, -61791, -193538, -230533, -233892, -79001, -203022, -233325, 67123, 232629, 91201, 81454, 51068, 158720, 49043, -85939, 53859, -23054, -45078, -15981, -229897, -267516, -99665, -126750, -21094, 187427, 19559, -301334]
13376c01334J5675K37308Q6898K42482P881j77915r5110J76635J85494j91613
13366A86401k28701n3972j0227J11524J05163q5656j0862Q2043J07724K29788
13356D33225j15398l33321k95091N23L26417N605o4730l8007j12169M3702l1354
13345a80598p1470l4126J00980O8776n3174L0045n1533J0440J53159k27523n6270
13334c11294P3987K1742M5801K0914K814k05265M610K29972J80246J26757o3911
13323A26373n4380N5816j9374J3236p5897j15298Q3107n7498k32983J1037j1262
13312b77123K39627J22914R1445Q4162p237m5508j9469k37886N0345Q8163J11680
13301B01113q7629l20312j81424N8547j9235L095J86291J52290M1717J68716j1025
$$ y = [-301334, -285659, -48351, 38547, 281029, 288910, 110995, 15885, 192520, 378014, 186401, -42300, -96272, -106499, 5025, 110188, 24532, 13670, 95713, 203437, 433225, 317827, -15494, -310585, -310062, 16355, 21960, -42770, -80777, -192946, -149244, -180598, -252068, -286194, -185214, -116438, -169612, -139567, -191100, -180660, -27501, -255024, -311294, -237307, -215565, -169764, -148850, -146036, -351301, -346691, -116719, 63527, 190284, 126373, 71993, 127809, 108435, 121671, 45774, -69524, 13583, -43915, -276898, -265861, -277123, -37496, 85418, 176863, 261025, 253788, 208280, 188811, -49075, 1270, 89433, 201113, 113484, -206828, -388252, -329705, -348940, -345845, -159554, -7264, 34453, 203169, 192144]
13290A92144l3489p7927j67429P9737O4025j11283K4511P6507P8983M4955j82342
13279a1608l0820L42221K20005j71996m38436j15252J74378O8428j4309j70862
13269a48251L8077m4425j37774m5964K89711J00122j58211j78743j77493Q5152
13259c77799K02695J63800k04211j50065J28229N9947K67482J45147J43386p2848
13249C05763j34294j27232j14534j4262m6013j42905j61198J04699K29917L13310
13239B13251O3219L6812k07059q1041l9683K7122k52950q25L0178j3556p4124
13228b98656J22442K45471J65728p6822j79553M345J2812l3741M5524j26969J03041
13217a6378J60553K9980k4326j97182j27896j09303m4608R5390M926k9263k0378
$$ y = [192144, 158655, 80728, -86701, -6964, 57061, -54222, -29711, 46796, 125779, 170734, -11608, -42428, 299793, 519798, 347802, -90634, -205886, -31508, 36920, 22611, -148251, -110174, -154599, -292373, -338337, -48626, 51496, -106715, -285458, -462951, -377799, -175104, -11304, -215515, -365580, -237351, -177404, 90078, 235225, 378611, 305763, 171469, 44237, -70297, -84559, -130572, -273477, -434675, -329976, -100059, 213251, 276470, 313282, 106223, 25182, -14501, 12621, -240329, -241154, -210976, -224532, -298656, -176214, 69257, 234985, 158163, -21390, -17045, -4233, -37974, 7550, -119419, -16378, 144175, 174155, 149829, -47353, -175249, -284552, -329160, -233770, -228844, -258107, -278485]
13206b78485J12568J14758J15816k2265j63325J31096k0559n1706o5456k14340
13196c41898K53684L24051k8763q9628j07310J48614m0423P2117r3492j39323
13186d2371L9984o0111o2610j46814l6571r3218q9955j33628J99619Q2488K23673
13175a19514M43884K49096j17436j80598j20184l8943j3432L9538O7387j1387
13165A98411J32608K4434l18403K8788j2870p0451P6109o6759J31663R0655j43788
13154G0397p5409k3296K80614K12124M4273k5205p424m9445j29785j99189l17861
13143b20206J12655K74446n3352r6673J26678J47367k11261L8318o2809k788Q8368
13132A40743m2286k81966q2756J06153J55347O2641N7042K16958L3979j79553
$$ y = [-278485, -165917, -51159, 64657, 42392, -120933, 10163, -10396, -62102, -127558, -341898, -88214, 235837, 207074, 117446, 10136, 158750, 118327, 190444, 96952, -42371, -2387, -62498, -125108, -271922, -308493, -401711, -491666, -625294, -425675, -343187, -119514, 324370, 573466, 456030, 275432, 155248, 116305, 102873, 142411, 209798, 198411, 331019, 355453, 37050, 65838, 52968, -17483, 58626, -8133, 123530, 214185, 70397, -5012, -28308, 252306, 464430, 508703, 483498, 476074, 426629, 296844, 97655, -220206, -107551, 166895, 113543, 16870, 143548, 290915, 79654, 117972, 55163, 52375, 140743, 98457, -183509, -266265, -160112, -4765, 57876, 114918, 331876, 365855, 186302]
13122A86302n3406j46629k90721j30708J59716O8035L9780r8793l5505P5446k4112
13111b50595j75627J15595J4206k2291k5152k114J94947Q1783M499J7005k65119
13100c12863j13646M7656K67699J33388J13477k83674j39802J74309J65445J10626
13090A62615O2509O1884l9494j59612j02861Q074J89106J01590j68560L606p9277
13079C9580K3346m7443p57m5594l7056J22827O6428K4374J67019n2602j98264
13068F1858L7425J17580j0156M8122j36118j19068j74571l408J28301K11231J40052
13057C01248k40549j24395J53451L46469j05404j69265l3789q1750J75265J10162
13047C31443j2883N1672j31719J2981N3706J52870k00117r1576j15211j47440
$$ y = [186302, 132896, -13733, -304454, -435162, -275446, -207411, -167631, -266424, -301929, -226483, -250595, -426222, -310627, -296421, -318712, -343864, -345978, -151031, -69248, -64749, -47744, -312863, -426509, -378853, -111154, 22234, 135711, -147963, -287765, -113456, 51989, 162615, 225124, 287008, 247514, 87902, -14959, -6885, 182221, 283811, 115251, 118857, 39580, 62926, 15483, 14726, -30868, -67924, 54903, 121331, 145705, 312724, 260122, 61858, 99283, 216863, 206707, 254829, 118711, -357, -174928, -178336, -50035, 161196, 301248, 60699, -63696, 89755, 436224, 330820, 161555, 127766, 46016, 221281, 331443, 318560, 370232, 238513, 251494, 305200, 458070, 257953, 166377, 51166, -96274]
13037i6274j67344Q8097K01269L0531M4495m2690j81663l1280k6409L14980J01031
13026B34743j35475N7614p3959k04239n0495j72911J69785M6270k4588J15578
13016c7677O9714L6029j64730j31313l9759o8213J57555J20311L8720K09j59658
13005a78812J4996j16929j24825N1007L657Q3003J4167J25990k3463R8954J31543
12994G9288O732k9772K07836j12879L3418O7974O8501j62045k31690j74999J05934
12983a41702m4204L72843k0870l33708K9172Q8165Q9397j12680L9886L40467K67970
12972E74736l8677j06185o6652j08396m7033j80434j48461j52902L2179p9587
12962c21412J02934J63827n094o8854r2483N8149K02343J72269j10157k74826
$$ y = [-96274, -263618, -175521, 25748, 56279, 100774, 58084, -123579, -154859, -181268, 133712, 234743, 99268, 156882, 82923, -121316, -171811, -344722, -174937, -128667, -153255, -37677, 32037, 68066, -96664, -227977, -267736, -335949, -178394, -58083, -19363, -19154, -178812, -163816, -280745, -405570, -354563, -350906, -267903, -253736, -127746, -151209, -52255, 79288, 86020, 56248, 264084, 151205, 184623, 252597, 321098, 159053, -72637, -247636, -141702, -185906, 186937, 166067, -167641, -138469, -50304, 39093, -73587, -33701, 306766, 574736, 536059, 429874, 363222, 254826, 207793, 27359, -121102, -274004, -241825, -321412, -218478, -54651, -59745, -128599, -221082, -162933, 39410, 211679, 101522, -173304]
12952a73304j01583J78658N5020J44460j26386p159J31720k29678j07245Q4424
12942a51073Q8622P1329J39156k183j65063j30809k9474J64042J58854j67848
12932b4447O8450O7796n09J24617k0840k72441m5778K7736J20041j67951l1552
12921a54878J69703r5511m4476J18058J49015n294r4475j3957m9016j16483l0551
12910a67865j14174L554l431P615J29576O9218O3048j20896j7923J17877K63221
$$ y = [-173304, -274887, -96229, -41209, 103251, -23135, -30294, 101426, -128252, -235497, -151073, -62451, 8878, 148034, 145851, -19212, -150021, -179495, -15453, 143401, -24447, 44003, 111799, 111290, 235907, 215067, -57374, -103152, -75416, 44625, -123326, -154878, 14825, -80686, -125162, -7104, 141911, 136617, 42142, 28185, -20831, -137314, -167865, -282039, -278485, -281916, -274301, -144725, -75507, -12459, -133355, -151278, -33401, 229820]
$$ [...]
##END NTUPLES=NMR SPECTRUM
##END=
