##TITLE=Analysis number 329124
Compound Code cc 64546
Book Reference 510/76
Project Code adrs
Chemist Name jimp
##JCAMPDX= 6.0         $$ Bruker NMR JCAMP-DX V2.0
##DATA TYPE= NMR SPECTRUM
##DATA CLASS= NTUPLES
##ORIGIN= Bruker BioSpin GmbH
##OWNER= nmr
$$ XWIN-NMR		Version 3.5
$$ Mon Aug  6 10:27:11 2007 GMT Daylight Time (UT+1h)  MAYBRIDGE\nmr@NMR_250MHZ
##.OBSERVE FREQUENCY= 250.131544655141
##.OBSERVE NUCLEUS= ^1H
##.ACQUISITION MODE= SIMULTANEOUS (DQD)
##.ACQUISITION SCHEME= undefined
##.AVERAGES= 16
##.DIGITISER RES= 18
##SPECTROMETER/DATA SYSTEM= dpx250
##.PULSE SEQUENCE= zg30
##.SOLVENT NAME= CDCl3
##.SHIFT REFERENCE= (INTERNAL, CDCl3, 0, 16.522)
##AUDIT TRAIL= $$ (NUMBER, WHEN, WHO, WHERE, WHAT)
$$ ##TITLE= Audit trail, XWIN-NMR		Version 3.5
$$ ##JCAMPDX= 5.01
$$ ##ORIGIN= Bruker BioSpin GmbH
$$ ##OWNER= nmr
$$ C:\u/data/dgb/nmr/ADRS/210/pdata/1/auditp.txt
$$ ##AUDIT TRAIL=  $$ (NUMBER, WHEN, WHO, WHERE, WHAT)
(   1,<2007-08-06 10:26:34.49 +100>,<MAYBRIDGE\nmr>,<NMR_250MHZ>,
      <created by zg, POWCHK disabled, PULCHK disabled
       configuration hash MD5:
       76 6E 9A 78 1E 09 19 81 EC 84 63 8F B0 6A 59 2D
       data hash MD5: 64K
       AC A5 00 86 EE 15 67 9B 47 EF 52 30 3C A1 F9 5C>)
(   2,<2007-08-06 10:26:58.85 +100>,<MAYBRIDGE\nmr>,<NMR_250MHZ>,
      <Start of raw data processing
       ef LB = 0.3 FT_mod = 6 PKNL = 1 SI = 32K 
       data hash MD5: 32K
       EF 24 5A C3 42 2E 46 5E 4B 1C 02 83 64 36 5F 4A>)
(   3,<2007-08-06 10:27:00.86 +100>,<MAYBRIDGE\nmr>,<NMR_250MHZ>,
      <apk 
       data hash MD5: 32K
       3C 0A 4E E9 59 9D 1C 17 D7 73 21 06 02 AE A5 E4>)
(   4,<2007-08-06 10:27:01.65 +100>,<MAYBRIDGE\nmr>,<NMR_250MHZ>,
      <abs ABSG = 5 
       data hash MD5: 32K
       B0 7F FC 6B F6 3C A1 8C D0 8C 9F 8D 4F 03 2C 0D>)
$$ ##END=
$$ 
$$ hash MD5
$$ B9 CB 59 C1 91 CF B1 CC CF D4 F2 58 D2 FD 99 49
##$RELAX= 
##$RELAX= 
##$RELAX= 
##$RELAX= 
##$RELAX= 
##$RELAX= 
##$RELAX= 
$$ Bruker specific parameters
$$ --------------------------
##$DU= <C:\u>
##$EXPNO= 210
##$NAME= <ADRS>
##$PROCNO= 1
##$TYPE= <nmr>
##$USER= <dgb>
##$AMP= (0..31)
100 100 100 100 100 100 100 100 100 100 100 100 100 100 100 100 100 100 
100 100 100 100 100 100 100 100 100 100 100 100 100 100 
##$AQSEQ= 0
##$AQ_mod= 3
##$AUNM= <au_zg>
##$AUTOPOS= <39 >
##$BF1= 250.13
##$BF2= 250.13
##$BF3= 250.13
##$BF4= 250.13
##$BF5= 500.13
##$BF6= 500.13
##$BF7= 500.13
##$BF8= 500.13
##$BYTORDA= 1
##$CFDGTYP= 0
##$CFRGTYP= 5
##$CHEMSTR= <none>
##$CNST= (0..31)
1 1 145 1 1 1 1 1 1 1 1 1 1 1 1 1 1 1 1 1 1 1 1 1 1 1 1 1 1 1 1 1 
##$CPDPRG= <>
##$CPDPRG1= <>
##$CPDPRG2= <>
##$CPDPRG3= <>
##$CPDPRG4= <mlev>
##$CPDPRG5= <mlev>
##$CPDPRG6= <mlev>
##$CPDPRG7= <mlev>
##$CPDPRG8= <mlev>
##$CPDPRGB= <>
##$CPDPRGT= <>
##$D= (0..31)
0 1 0 0 0 0 0 0 0 0.06 0 0 0 0 0 0 0.0002 0 0 0 0 0 0 0 0 0 0 0 0 0 0 
0 
##$DATE= 1186392390
##$DBL= (0..7)
120 120 120 120 120 120 120 120 
##$DBP= (0..7)
150 150 150 150 150 150 150 150 
##$DBP07= 0
##$DBPNAM0= <>
##$DBPNAM1= <>
$$ [...]
##$SUBNAM7= <"">
##$SUBNAM8= <"">
##$SUBNAM9= <"">
##$SW= 20.6930455092707
##$SWIBOX= (0..15)
0 0 3 0 0 0 0 0 0 0 0 0 0 0 0 0 
##$SW_h= 5175.983436853
##$TD= 65536
##$TD0= 1
##$TE= 296.16
##$TE2= 300
##$TE3= 300
##$TEG= 300
##$TL= (0..7)
0 120 120 120 120 120 120 120 
##$TP= (0..7)
150 150 150 150 150 150 150 150 
##$TP07= 0
##$TPNAME0= <>
##$TPNAME1= <>
##$TPNAME2= <>
##$TPNAME3= <>
##$TPNAME4= <>
##$TPNAME5= <>
##$TPNAME6= <>
##$TPNAME7= <>
##$TPOAL= (0..7)
0.5 0.5 0.5 0.5 0.5 0.5 0.5 0.5 
##$TPOFFS= (0..7)
0 0 0 0 0 0 0 0 
##$TUNHIN= 0
##$TUNHOUT= 0
##$TUNXOUT= 0
##$USERA1= <user>
##$USERA2= <user>
##$USERA3= <user>
##$USERA4= <user>
##$USERA5= <user>
##$V9= 5
##$VALIST= <valist>
##$VCLIST= <CCCCCCCCCCCCCCC>
##$VD= 0
##$VDLIST= <DDDDDDDDDDDDDDD>
##$VPLIST= <PPPPPPPPPPPPPPP>
##$VTLIST= <TTTTTTTTTTTTTTT>
##$WBST= 1024
##$WBSW= 4
##$XGAIN= (0..3)
0 0 0 0 
##$XL= 0
##$YL= 0
##$YMAX_a= 439340
##$YMIN_a= -357174
##$ZGOPTNS= <>
##$ZL1= 120
##$ZL2= 120
##$ZL3= 120
##$ZL4= 120
##$ABSF1= 16.522
##$ABSF2= -4.171173
##$ABSG= 5
##$ABSL= 3
##$ALPHA= 0
##$AQORDER= 0
##$ASSFAC= 0
##$ASSFACI= 0
##$ASSFACX= 0
##$ASSWID= 0
##$AUNMP= <proc_1d>
##$AZFE= 0.1
##$AZFW= 0.1
##$BCFW= 0
##$BC_mod= 0
##$BYTORDP= 0
##$COROFFS= 0
##$CY= 12.5
##$DATMOD= 1
##$DC= 0
##$DFILT= <>
##$DTYPP= 0
##$F1P= 14.0000005364418
##$F2P= -0.99999901652339
##$FCOR= 0.5
##$FTSIZE= 32768
##$FT_mod= 6
##$GAMMA= 0
##$GB= 0
##$INTBC= 1
##$INTSCL= 1
##$ISEN= 128
##$LB= 0.3
##$LEV0= 0
##$LPBIN= 0
##$MAXI= 10000
##$MC2= 0
##$MEAN= 0
##$ME_mod= 0
##$MI= 0
##$NCOEF= 0
##$NC_proc= -3
##$NLEV= 6
##$NOISF1= 0
##$NOISF2= 0
##$NSP= 0
##$NTH_PI= 0
##$NZP= 0
##$OFFSET= 16.522
##$PC= 1
##$PHC0= -47.91118
##$PHC1= 8.039378
##$PH_mod= 1
##$PKNL= yes
##$PPARMOD= 0
##$PSCAL= 4
##$PSIGN= 0
##$REVERSE= no
##$SF= 250.13
##$SI= 32768
##$SIGF1= 0
##$SIGF2= 0
##$SINO= 400
##$SIOLD= 32768
##$SREGLST= <1H.CDCl3>
##$SSB= 0
##$STSI= 32768
##$STSR= 0
##$SW_p= 5175.98343685301
##$SYMM= 0
##$S_DEV= 0
##$TDeff= 65536
##$TDoff= 0
##$TI= <Analysis number 999999
Compound Code 99
Book Reference 9
Project Code 9>
##$TILT= no
##$TM1= 0
##$TM2= 0
##$TOPLEV= 0
##$USERP1= <user>
##$USERP2= <user>
##$USERP3= <user>
##$USERP4= <user>
##$USERP5= <user>
##$WDW= 1
##$XDIM= 32768
##$YMAX_p= 372488812
##$YMIN_p= -102422
$$ End of Bruker specific parameters
$$ ---------------------------------
##NTUPLES= NMR SPECTRUM
##VAR_NAME=  FREQUENCY,     SPECTRUM/REAL,   SPECTRUM/IMAG
##SYMBOL=    X,             R,               I
##VAR_TYPE=  INDEPENDENT,   DEPENDENT,       DEPENDENT
##VAR_FORM=  AFFN,          ASDF,            ASDF
##VAR_DIM=   32768,         32768,           32768
##UNITS=     HZ,            ARBITRARY UNITS, ARBITRARY UNITS
##FACTOR=    0.157963299565203, 1,           1
##FIRST=     4132.6476996994, 0,             0
##LAST=      -1043.33573715361, 0,           0
##MIN=       -1043.33573715361, -102422,     0
##MAX=       4132.6476996994, 372488812,     0
$$ Real data points
##PAGE= N=1
##DATA TABLE= (X++(R..R)), XYDATA
$$ [...]
$$ plain form
16572 -12923 1655 -2809 12132 16680 28694 19819 7053 5620 19135 15125 1818 3753 -2526
16559 -2526 -13047 -8025 -15409 -20479 -7311 5405 17093 -5508 -19129 -15886 -8021 -4764 -2410
16546 -2410 2610 29547 41066 11037 -34802 -38617 -15762 5108 38844 45622 26810 -5341
16534 -5341 -19584 -14100 -14460 -17317 19917 23591 16556 -3843 -271 13240 36136 21905 5319
16521 5319 10744 10842 25614 29615 -10165 -10394 559 16953 31172 13892 3566 -3031 -15348
16508 -15348 -16756 -28039 -15476 -22572 -7379 29279 7310 -14514 -6131 10518 1005 3873 5373
16495 5373 -34450 -38699 -25792 -13081 -12011 -15156 -19864 -2541 4761 13241 14203 1242 -4150 -10504
16481 -10504 831 -3733 -19863 -6938 -2942 -5297 -1409 14214 14895 -5025 -13101 -14754 -19231
$$ packed form
16572a2923J4578m464J4941M548J2014q875j2766j433J3515m010j3307J935o279
16559b526j0521N022p384n070J3168J2716J1688k2601j3621L243P865L257K354
16546b410N020K6937J1519l0029m5839l815K2855K0870L3736O778j8812l2151
16534e341j4243N484l60k857L7234L674p035k0399L572J3511K2896j4231j6586
16521E319N425R8J4772M001l9780k29J0953J6394J4219j7280j0326o597j2317
16508a5348j408j1283J2563p096J5193L6658k1969k1824Q383J6649r513K868J500
16495E373l9823m249J2907J2711J070l145m708J7323P302Q480R62j2961n392o354
16481a0504J1335m564j6130J2925L996k355L888J5623O81j9920q076j653m477
$$ plain form
16468 -19231 -12808 6788 -19890 -35193 -25595 -1992 -2304 12530 17877 9094 14162 10160 -19244
16455 -19244 -12982 -4863 -14260 -16156 -25901 9487 4094 -4880 10231 7310 -22433 -14979 -8923 -22396
16441 -22396 -8498 11595 1522 6341 18696 28826 24200 18385 23004 3917 20443 12294 7792
16428 7792 9597 -4515 3732 -16019 -21687 -26654 -16231 15528 20209 3920 2188 12205 -2621
16415 -2621 -12689 -5341 -16982 -27552 -36379 -41256 -34360 -45836 -44227 -14668 -2222 3056 5892
16402 5892 34296 44934 28476 6563 8210 7484 8458 23531 16420 -9995 3846 4092 -5888 -4437
16388 -4437 5553 14894 -14865 -42226 -20847 -13583 -43351 -57993 -65432 -53792 -44701 -15060 -7608
16375 -7608 -675 16828 17277 10633 -21969 -31327 -35278 -26926 11634 26693 26722 4316 -21999 -30574
$$ packed form
16468a9231O423J9596k6678j5303R598K3603l12J4834N347q783N068m002k9404
16455a9244O262Q119r397j896r745L5388n393q974J5111k921k9743P454O056j3473
16441b2396J3898K0093j0073M819J2355J0130m626n815M619j9087J6526q149m502
16428G792J805j4112Q247j9751n668m967J0423L1759M681j6289j732J0017j4826
16415b621j0068P348j1641j0570q827m877O896j1476J609K9559J2446N278K836
16402E892K8404J0638j6458k1913J647p26R74J5073p111k6415J3841K46r980J451
16388d437R990R341k9759k7361K1379P264k9768j4642p439J1640R091K9641P452
16375g608O933J7503M49o644l2602r358l951Q352L8560J5059K9k2406k6315q575
$$ plain form
16361 -30574 -35256 -17024 -19294 -50830 -38086 -28203 -8039 5902 28392 39294 25048 2649
16349 2649 -31048 -23195 3669 7357 6572 -2351 1827 -6418 -14975 -27003 -12427 -3244 740 886
16335 886 20993 37195 26853 7779 -3422 -5564 3483 4819 11131 27003 9060 2052 -10140
16322 -10140 -9988 -15437 -20524 -926 26888 4682 -2580 -15517 199 19044 69346 122929 187222
16309 187222 244486 306283 343855 374018 417106 500376 494645 405294 334338 290056 284198 262449
16297 262449 193920 133652 84017 49551 56592 66380 86972 97497 103765 111689 62382 35979
16285 35979 41352 61775 59257 18958 42936 66871 55937 51615 46328 15538 16076 31395 1560
16272 1560 1164 -812 11536 21380 21237 4126 10620 3548 -10147 -30268 -24179 -11516 -1043 -3833
$$ packed form
16361c0574m682J8232k270l1536J2744R883K0164J3941K2490J0902j4246k2399
16349B649l3697P853K6864L688p85q923M178q245q557j2028J4576R183L984J46
16335H86K0107J6202j0342j9074j1201k142R047J336O312J5872j7943p008j2192
16322a0140J52n449n087J9598K7814k2206p262j2937J5716J8845N0302N3583O4293
16309A87222N7264O1797L7572L0163M3088Q3270n731q9351p0956m4282n858k1749
16297B62449o8529o0268m9635l4466P041R788K0592J0525O268P924m9307k6403
16285C5979N373K0423k518m0299K3978K3935j0934m322n287l0790N38J5319k9835
16272A560l96j976J2348R844j43j7111O494p072j3695k0121O089J2663J0473k790
$$ plain form
16258 -3833 -24437 -34361 -26176 -20848 12758 8566 32305 41023 31841 21482 6996 4886 -11610
16245 -11610 -24749 -34571 -17862 -688 16356 -13109 -19376 -26362 -16700 -27543 -29433 -29836 -10348
16232 -10348 6941 -899 -39285 -24710 -22899 -16735 -4617 8368 15703 15577 -11554 -13614 -7088
16219 -7088 20390 43452 27750 2875 1037 -6567 -4491 -21402 -17211 -15883 -5827 -15158 -20551
16206 -20551 -20223 -2765 25720 17351 1621 14600 31197 1442 -36543 -21988 -9198 2458
16194 2458 3573 1089 -15591 -16778 9179 3012 -22304 -14604 14345 17461 18581 3216 -7116
16181 -7116 9290 26899 22148 10403 6009 -6294 -26108 -22083 780 -16774 -46187 -36521 -25573
16168 -25573 -24448 -57189 -64602 -66275 -84960 -83921 -83655 -67038 -31234 -11363 -23595 -45847 -38923
$$ packed form
16258c833k0604r924Q185N328L3606m192K3739Q718r182j0359j4486k110j6496
16245a1610j3139r822J6709J7174J7044k9465o267o986R662j0843j890m03J9488
16232a0348J7289p840l8386J4575J811O164J2118J2985P335j26k7131k060O526
16219g088K7478K3062j5702k4875j838p604K076j6911M191J328J0056r331n393
16206b0551L28J7458K8485q369j5730J2979J6597k9755l7985J4555J2790J1656
16194B458J115k484j6680j187K5957o167k5316P700K8949L116J120j5365j0332
16181g116J6406J7609m751j1745m394j2303j9814M025K2863j7554k9413R666J0948
16168b5573J125l2741p413j673j8685J039K66J6617L5804J9871j2232k2252O924
$$ plain form
16155 -38923 -29526 -12451 -8634 -21973 -41288 -58889 -35091 -18102 -4724 6534 23354 18405
16143 18405 15459 6348 3084 -16604 -22959 -20254 -29921 -16511 -14945 -22321 -18059 -29998 -14655
16130 -14655 -4539 16065 6692 8876 24071 32360 23081 7717 8370 2984 -16908 -6626 -7920
16117 -7920 5566 5304 -25118 -26384 -26173 -40714 -37593 -47684 -34084 -6737 -12802 -1923 -17981
16104 -17981 -40571 -15868 19932 37608 21164 -20973 -29206 -15864 -27452 -57061 -69950 -62579
16092 -62579 -37079 -25742 -26802 -52280 -60955 -37811 -16667 -14474 -36994 -42999 -46714 -57665 -58972
16079 -58972 -35999 -29706 -47052 -59970 -50761 -30772 -17511 -12378 -26094 -32484 -50472 -40576 -32786
16066 -32786 -19573 -14887 -983 1142 16459 23106 13716 -11957 -23659 -9959 -16802 -32166 -37181
$$ packed form
16155c8923R397J7075L817j3339j9315j7601K3798J6989J3378J1258J6820m949
16143A8405k946r111l264j9688o355K705r667J3410J566p376M262j1939J5343
16130a4655J0116K0604r373K184J5195Q289r279j5364O53n386j9892J0282j294
16117g920J3486k62l0422j266K11j4541L121j0091J3600K7347o065J0879j6058
16104a7981k2590K4703L5800J7676j6444m2137q233J3342j1588k9609j2889P371
16092f2579K5500J1337j060k5478q675K3144K1144K193k2520o005l715j0951j307
16079e8972K2973O293j7346j2918R209J9989J3261N133j3716o390j7988R896P790
16066c2786J3213M686J3904K125J5317O647r390k5673j1702J3700o843j5364n015
$$ plain form
16053 -37181 -12798 -8869 -13525 -16340 -7963 3175 -15756 -26768 -6349 -36115 -62816 -29289
16041 -29289 -4012 11541 31942 18159 -11290 -35175 -18743 -29879 -56592 -42368 -36295 -58721
16029 -58721 -60095 -79187 -82903 -52861 -49762 -50420 -53482 -40345 -53056 -56739 -21574 -40255 -42941
16016 -42941 -35726 -41363 -62319 -45055 -9060 -1733 -4815 -4212 -8916 -16330 -21168 -31846 -57003
16003 -57003 -67416 -69870 -32213 7640 493 -34352 -20033 -15126 -16290 -31297 -36313 -34043 -45622
15990 -45622 -32570 -16833 -30236 -36726 -46418 -22651 32529 40401 -15247 -33367 -18516 -16404
15978 -16404 -24505 -32722 -21449 -4594 17229 14651 35224 40208 26586 5628 -10837 -34519
15966 -34519 -35766 -14383 -6576 -21441 -21902 -12011 -14461 -39680 -42360 -28654 -17558 -12353 -6107
$$ packed form
16053c7181K4383L929m656k815Q377J1138j8931j1012K0419k9766k6701L3527
16041b9289K5277J5553K0401j3783k9449k3885J6432j1136k6713J4224O073k2426
16029e8721j374j9092l716L0042L099o58l062J3137j2711l683L5165j8681k686
16016d2941P215n637k0956J7264L5995P327l082O03m704p414m838j0678k5157
16003e7003j0413k454L7657L9853p147l4845J4319M907j164j5007n016K270j1579
15990d5622J3052J5737j3403o490r692K3767N5180P872n5648j8120J4851K112
15978a6404q101q217J1273J6855K1823k578K0573M984j3622k0958j6465k3682
15966c4519j247K1383P807j4865m61R891k450k5219k680J3706J1096N205O246
$$ plain form
15953 -6107 -5360 -21651 -29709 -30461 -54085 -55122 -40461 -48762 -38024 -43774 -42054 -28991 3375 3254
15939 3254 -16330 -19704 -30394 -17668 3070 10588 -16214 -4524 23939 18644 6419 -3113 -19202
15926 -19202 -8033 -22055 -29105 -37758 -48415 -38988 -64059 -70463 -57288 -38432 -26298 7632
15914 7632 6826 -7500 -31977 -34933 -28352 -34524 -39132 -42165 -33924 -30349 -32093 -28808 -24916 -8164
15900 -8164 -4866 -410 -6289 -6818 -14940 -32942 -36476 -16431 -31074 -26200 -5372 12478 16180 9123
15886 9123 4196 -23190 -18381 -14389 -23892 -28665 -18230 -25728 -11423 85 -4680 -15506 -26147
15873 -26147 -45873 -26159 -25763 -11124 17070 11705 -20157 -45152 -33899 -12316 -21836 -20139 -13596
15860 -13596 -21945 -52574 -45050 -23975 -15170 -25823 -30189 -16982 -9930 12897 7676 -18867 -28459
$$ packed form
15953f107P47j6291q058p52k3624j037J4661q301J0738n750J720J3063L2366j21
15939C254j9584l374j0690J2726K0738P518k6802J1690K8463n295j2225r532j6089
15926a9202J1169j4022p050q653j0657R427k5071o404J3175J8856J2134L3930
15914G632q06j4326k4477k956O581o172m608l033Q241L575j744L285L892J6752
15900h164L298M456n879n29q122j8002l534K0045j4643M874K0828J7850L702p057
15886I123m927k7386M809L992r503m773J0435p498J4305J1508m765j0826j0641
15873b6147j9726J9714L96J4639K8194n365l1862k4995J1253K1583r520J697O543
15860a3596q349l0629P524K1075Q805j0653m366J3207P052K2827n221k6543r592
$$ plain form
15847 -28459 -48750 -28846 -12896 -9566 -4302 -6157 -3381 -13324 -15692 -24469 -37760 -42572 -79986
15834 -79986 -99010 -68503 -46224 -24871 -22395 -58883 -29867 3782 4470 -12684 -29987 -35558
15822 -35558 -27134 -56696 -45169 -11144 -13362 -20622 -26045 -47090 -28824 -904 5988 -9447 -1840
15809 -1840 14674 26827 -11477 -16760 -19031 -10699 -33347 -25681 -30681 -37991 -36753 -46771 -40078
15796 -40078 -45271 -22564 10553 12098 13233 18970 2281 -51012 -37037 -15015 -9435 -5224 -12987
15783 -12987 -28359 -28145 -30630 -32233 -60931 -63331 -50297 -41574 -30048 -31788 -37662 -40548 -72048
15770 -72048 -67321 -63471 -58265 -37848 -4037 13869 3818 27228 45148 14157 -5334 -131
15758 -131 -12921 -21337 -15526 -15669 -12322 -21575 -12093 3878 13269 17416 18662 21980 29551 21427 2087
$$ packed form
15847b8459k0291J9904J5950L330N264j855K776r943k368q777j3291m812l7414
15834g9986j9024L0507K2279K1353K476l6488K9016L3649O88j7154j7303n571
15822c5558Q424k9562J1527L4025k218p260n423k1045J8266K7920O892j5435P607
15809a840J6514J2153l8304n283k271Q332k2648P666n000p310J238j0018O693
15796d0078n193K2707L3117J545J135N737j6689n3293J3975K2022N580M211p763
15783a2987j5372K14k485j603k8698k400J3034Q723J1526j740n874k886l1500
15770g2048M727L850N206K0417L3811J7906j0051K3410J7920l0991j9491N203
15758a31j2790q416N811j43L347r253R482J5971R391M147J246L318P571q124j9340
$$ plain form
15743 2087 -19917 -35360 -60649 -46714 -35834 -13766 670 -22472 -57380 -59825 -41937 -36134
15731 -36134 -53879 -35721 -11997 11315 7415 -21059 -33455 6794 29606 5487 -14825 -47017
15719 -47017 -46028 -30020 -1573 10954 14437 4015 3105 15821 18426 7641 9963 4560 -9085
15706 -9085 -17487 -3627 -13891 -22380 -13741 9937 14185 22274 12459 -1962 -15005 -3519 -15926
15693 -15926 -3455 -7581 7780 6790 -4036 -10661 -5702 -19587 935 25122 19741 23586 32463
15680 32463 22624 33552 39954 51744 65577 36153 14100 10951 -1060 -709 -16556 -10416 -3382
15667 -3382 2393 -7730 -5775 -832 -32843 -49106 -43509 -44249 -19622 -19702 -32871 -25712 -13647 -21109
15653 -21109 -42496 -39385 -15416 22923 10290 -1143 18480 20554 5864 -3925 -7018 -11259 -18188
$$ packed form
15743B087k2004j5443k5289J3935J0880K2068J4436k3142l4908k445J7888N803
15731c6134j7745J8158K3724K3312l900k8474j2396M0249K2812k4119k0312l2192
15719d7017R89J6008K8447J2527L483j0422r10J2716K605j0785K322n403j3645
15706i085q402J3860j0264q489Q639K3678M248Q089r815j4421j3043J1486j2407
15693a5926J2471m126J5361r90j0826o625M959j3885K0522K4187n381L845Q877
15680C2463r839J0928O402J1790J3833k9424k2053l149j2011L51j5847O140P034
15667c382N775j0123J955M943l2011j6263N597p40K4627q0j3169P159J2065p462
15653b1109k1387L111K3969L8339j2633j1433J9623K074j4690r789l093m241o929
$$ plain form
15640 -18188 -32622 -30036 -25199 -30747 -24340 -22703 8523 29949 -14819 -42555 -36974 -14993 -16390
15627 -16390 -23247 -15617 -12492 -861 188 2563 7300 -3145 -19421 -3020 4088 -8452 -200
15614 -200 11932 -4422 -23427 -18123 -40817 -57907 -54183 -70258 -48424 -43727 -50976 -49773 -18773
15601 -18773 18042 17569 7300 14077 3430 -3676 -11495 -14984 -15845 -12012 -11453 -11439 -12772 -54080 -56701
15586 -56701 -32767 -26156 -24395 -26281 -17269 -3163 7153 14853 15767 23539 21796 21793 8672 -8563
15572 -8563 10066 -4607 -8228 -7327 -8268 -10469 4919 16760 9159 4141 15290 21994 -1615 -16070
15558 -16070 -9945 6420 9616 41559 51113 37252 26938 42898 86437 85058 62220 46801
15546 46801 17464 14902 26044 31400 8630 -25185 -31488 -46135 -41206 -11104 10486 28516
$$ packed form
15640a8188j4434K586M837n548O407J637L1226K1426m4768k7736N581K1981j397
15627a6390o857P630L125J1631J049K375M737j0445j6276J6401P108j2540Q252
15614b00J2132j6354j9005N304k2694j7090L724j6075K1834M697p249J203L1000
15601a8773L6815m73j0269O777j0647p106p819l489q61L833N59J4j333m1308k621
15586e6701K3934O611J761j886R012J4106J0316P700R14P772j743lj3121j7235
15572h563J8629j4673l621R01r41k201J5388J1841p601n018J1149O704k3609j4455
15558a6070O125J6365L196L1943R554j3861j0314J5960M3539j379k2838j5419
15546D6801k9337k562J1142N356k2770l3815o303j4647M929L0102K1590J8030
$$ plain form
15534 28516 37720 34962 30091 19913 10743 2362 -13692 -24136 3310 13507 1369 -14564 -30924
15521 -30924 -14300 737 18573 43927 62389 81329 95740 71563 41334 42482 58656 33301
15509 33301 401 -19756 -5724 -2321 21970 30322 17750 18933 1423 -10596 1169 21375
15497 21375 3758 -21676 -41566 -44280 -45147 -26825 -14285 -21512 -25576 -26207 -25529 -9990 8308
15484 8308 26241 -21887 -31167 -15497 -2104 18847 30632 6734 -4688 -18092 5858 19636
15472 19636 20433 38244 17071 3926 19212 15734 -27705 -45819 -60922 -56113 -45032 -47366 -6858
15459 -6858 -734 -22520 -25099 -32289 -24585 -10571 -18178 -17943 -21555 -4047 -1633 414 10376 33411
15445 33411 41212 39362 45824 18966 -11953 -32893 3420 22386 19667 -1421 -6180 1375 -5501
$$ packed form
15534B8516R204k758m871j0178r170q381j6054j0444K7446J0197j2138j5933j6360
15521c0924J6624J5037J7836K5354J8462J8940J4411k4177l0229J148J6174k5355
15509C3301l2900k0157J4032L403K4291Q352j2572J183j7510j2019J1765K0206
15497B1375j7617k5434j9890k714q67J8322J2540p227m064o31O78J5539J8298
15484H308J7933m8128r280J5670J3393K0951J1785k3898j1422j3404K3950J3778
15472A9636P97J7811k1173j3145J5286l478m3439j8114j5103M809J1081k334M0508
15459f858O124k1786k579p190P704J4014p607K35l612J7508K414K047R962K3035
15445C3411P801j850O462k6858l0919k0940L6313J8966k719k1088m759P555o876
$$ plain form
15432 -5501 -187 19331 24474 23033 -10672 -32834 -14013 -13287 19562 11420 9059 10332 20697
15419 20697 895 10538 16953 4347 -21311 -11286 10740 35399 15625 -15320 -45300 -32824
15407 -32824 -12481 19247 16300 -9573 6876 7671 3690 -5320 1566 -10347 -29306 -37683 -19288
15394 -19288 -9134 1024 -986 -1260 -6862 9728 34369 42612 20242 -1675 -28076 999 19804
15381 19804 21721 -3060 -14444 -23026 -4734 25592 20879 12381 25634 13978 9849 16619 27113
15368 27113 13728 4603 -4384 15831 5186 -20675 -19818 -40302 -37268 -4847 7593 -8669 -8379
15355 -8379 -37741 -51492 -41257 -26774 942 9787 -12888 -19347 -340 11198 18234 27949 23681
15342 23681 21773 8571 8408 25914 35528 24506 -14778 -39154 -37872 -18950 11065 7347 7228
$$ packed form
15432e501N314J9518N143j441l3705k2162J8821P26L2849q142k361J273J0365
15419B0697j9802R643O415j2606k5658J0025K2026K4659j9774l0945k9980J2476
15407c2824K0343L1728k947k5873J6449P95l981r010O886j1913j8959q377J8395
15394a9288J0154J0158k010k74n602J6590K4641Q243k2370k1917k6401K9075J8805
15381A9804J917k4781j1384q582J8292L0326m713q498J3253j1656m129O770J0494
15368B7113j3385r125q987K0215j0645k5861Q57k0484L034L2421J2440j6262K90
15355h379k9362j3751J0235J4483K7716Q845k2675o459J9007J1538P036R715m268
15342B3681j908j3202j63J7506R614j1022l9284k4376J282J8922L0015l718j19
$$ plain form
15329 7228 -9816 -5402 -13363 -12467 19386 37098 47347 22622 -19507 -8506 10153 1330 12669
15316 12669 16151 33926 27904 3230 -8705 -5751 20081 34772 9131 1624 -9939 -8080 -15375
15303 -15375 698 6026 2985 -24969 -18148 -5841 -31634 -61577 -73683 -81151 -73589 -58991 -50642
15290 -50642 -47165 -49423 -23657 -13065 -21167 -14177 -6237 -7932 -8256 -9708 -42218 -47330 -36714 -34014
15276 -34014 -38119 -18883 3842 -1567 18970 27825 3991 -14399 -18284 -11326 -14280 -995 4414
15263 4414 -9570 -22297 -27332 -11469 -9776 -32788 -13293 -1329 -219 -7388 -23541 -34272 -16548
15250 -16548 -39444 -46867 -19593 8328 37960 47269 23255 -31172 -59953 -71887 -88683 -52221
15238 -52221 -19198 -13443 -5000 -1570 20715 30063 -16132 -37531 -25923 -35945 -45681 -59872 -23638
$$ packed form
15329G228j7044M414p961Q96L1853J7712J0249k4725m2129J1001J8659q823J1339
15316A2669L482J7775o022k4674j1935K954K5832J4691k5641p507j1563J859p295
15303a5375J6073N328l041k7954O821J2307k5793k9943j2106p468P562J4598Q349
15290e0642L477k258K5766J0592q102O990P940j695l24j452l2510n112J0616K700
15276c4014m105J9236K2725n409K0537Q855k3834j8390l885O958k954J3285N409
15263D414j3984j2727n035J5863J693k3012J9495J1964J110p169j6153j0731J7724
15250a6548k2896p423K7274K7921K9632R309k4014n4427k8781j1934j6796L6462
15238e2221L3023N755Q443L430K2285R348m6195k1399J1608j0022r736j4191L6234
$$ plain form
15225 -23638 34665 50045 35238 21594 11981 -8635 -13159 -32926 -28698 -30452 -60014 -68032 -53397
15212 -53397 -47753 -22217 -28246 -35261 -12176 415 4505 1910 -2466 12307 -9619 -41709 -12263
15199 -12263 19775 -4449 -39385 -61363 -68825 -40664 -14005 4408 25202 40798 39928 28857
15187 28857 11145 3225 -20344 -14612 -14004 7420 26833 34016 29033 13562 8652 22761 18367
15174 18367 40530 57998 43065 48964 59811 38015 39709 66279 57976 29447 8485 -7200
15162 -7200 -15105 -4242 8239 -439 -17190 -8380 16722 29012 395 8789 15633 -2153 1160
15149 1160 10180 -4996 -22319 -26750 -28557 -22200 -44386 -49669 -60488 -80706 -66711 -38135 -18495
15136 -18495 -31012 -37106 -46690 -31795 -22606 -39275 -19858 -19032 -2472 -28254 -41709 -41539 -48480
$$ packed form
15225b3638N8303J5380j4807j3644r613k0616m524j9767M228j754k9562q018J4635
15212e3397N644K5536o029p015K3085J2591M090k595m376J4773k1926l2090K9446
15199a2263L2038k4224l4936k1978p462K8161K6659J8413K0794J5596q70j1071
15187B8857j7712p920k3569N732O08K1424J9413P183m983j5471m910J4109m394
15174A8367K2163J7468j4933N899J0847k1796J694K6570q303k8529k0962j5685
15162g200p905J0863J2481q678j6751Q810K5102J2290k8617Q394O844j7786L313
15149A160R020j5176j7323m431j807O357k2186n283j0819k0218J3995K8576J9640
15136a8495j2517o094r584J4895R189j6669J9417Q26J6560k5782j3455J70o941
$$ plain form
15123 -48480 -38679 -39148 -35042 -722 18559 25129 17666 548 -5463 -12559 11706 57925 40342
15110 40342 11149 -17201 -27217 -22327 -11241 -20664 -21948 10683 5240 19543 29393 39097 41833
15097 41833 67012 88116 95114 73563 40810 8179 17146 19104 40806 40145 21151 15184 11435
15084 11435 5082 21708 28265 8614 -17634 1217 -11327 -34235 -35887 -31316 -44874 -36280 -354
15071 -354 -1383 -12522 -3240 263 -27662 -10381 -10719 -6028 8302 36771 53082 38970 26575
15058 26575 23145 11062 1640 29483 31685 20590 13170 9782 24963 46035 68813 58051 69643
15045 69643 40135 37781 36108 29147 32816 31987 28935 25079 18111 45354 59604 75679 69146 21957
15031 21957 7172 13473 13774 1960 -6514 11173 17427 37189 45516 43411 73494 76322 82016
$$ packed form
15123d8480R801m69M106L4320J9281O570p463j7118o011p096K4265M6219j7583
15110D0342k9193k8350j0016M890J1086r423j284L2631n443J4303R850R704K736
15097D1833K5179K1104O998k1551l2753l2631Q967J958K1702o61j8994n967l749
15084A1435o353J6626O557j9651k6248J8851j2544k2908j652M571j3558Q594L5926
15071c54j029j1139R282L503k7925J7281l38M691J4330K8469J6311j4112j2395
15058B6575l430j2083r422K7843K202j1095p420l388J5181K1072K2778j0762J1592
15045F9643k9508k354j673o961L669q29l052l856o968K7243J4250J6075o533m7189
15031B1957j4785O301L01j1814q474J7687O254J9762Q327k105L0083K828N694
$$ plain form
15018 82016 88009 92704 108617 135464 145945 155520 179041 200360 230105 251931 267177 328372
15006 328372 393438 449953 518960 630682 770388 962129 1260148 1672677 2308083 3279212
14996 3279212 4771605 7154622 10746738 14764648 15597147 11484681 7528784 5310864
14988 5310864 4048442 3238048 2674241 2290361 1989344 1756788 1578458 1476288 1426021
14979 1426021 1364679 1250730 1138305 1033850 897843 768774 692556 646413 597508 519784
14969 519784 474854 437832 395745 360251 324510 309229 287833 269003 261254 236481 185954 162518
14957 162518 151429 142393 114823 97450 125208 123085 140990 126497 113915 105232 67908 19956
14945 19956 25673 62075 87736 98072 90030 94417 87571 82433 52388 21596 18822 41653 40470
$$ packed form
15018H2016N993M695J5913K6847J0481R575K3521K1319K9745K1826J5246O1195
15006C28372O5066N6515O9007J11722J39706J91741K98019M12529O35406R71129
14996C279212J492393K383017L592116M017910Q32499m112466l955897k217920
14988E310864j262422q10394n63807l83880l01017k32556j78330j02170n0267
14979A426021o1342j13949j12425j04455j36007j29069p6218m6143m8905p7724
14969E19784m4930l7022m2087l5494l5741j5281k1396j8830p749k4773n0527k3436
14957A62518j1089r036k7570j7373K7758k123J7905j4493j2582q683l7324m7952
14945A9956N717L6402K5661J0336q042M387o846n138l0045l0792k774K2831j183
$$ plain form
14932 40470 11246 4694 26749 53099 38640 20594 11425 14586 -27327 -49684 -51343 -35137
14920 -35137 -9236 -11091 -26930 -16633 -3409 18525 18281 -617 -37105 -53272 -37462 -28065
14908 -28065 -14387 3929 -6997 -27922 -32903 -50885 -40385 -38315 -28639 -22184 -505 -3663 21754
14895 21754 48646 50341 37006 18333 5409 18815 -7009 -24202 -43447 -29589 -16998 -36367
14883 -36367 -45447 -55101 -39727 -23965 -16671 -5018 -17490 -22898 -18676 -20682 -11838 -4293 6560
14870 6560 -1651 7305 -11329 -23837 -36129 -28999 -12127 -5310 -12414 -15056 -37447 -43644 -22146
14857 -22146 -13000 -11874 10258 9042 -5602 -837 -1450 12010 -8858 -20566 -4608 3192 -26069
14844 -26069 -45898 -47793 -59676 -40952 -14317 -3422 -25867 -29496 -28753 -18795 2001 28909 49664
$$ packed form
14932D0470k9224o552K2055K6350j4459j8046r169L161m1913k2357j659J6206
14920c5137K5901j855j5839J0297J3224K1934k44j8898l6488j6167J5810R397
14908b8065J3678J8316j0926k0925m981j7982J0500K070R676O455K1679l158K5417
14895B1754K6892J695j3335j8673j2924J3406k5824j7193j9245J3858J2591j9369
14883c6367r080r654J5374J5762P294J1653j2472n408M222k006Q844P545J0853
14870F560q211Q956j8634j2508j2292P130J6872O817p104k642k2391o197K1498
14857b2146R146J126K2132j216j4644M765o13J3460k0868j1708J5958P800k9261
14844b6069j9829j895j1883J8724K6635J0895k2445l629P43R958K0796K6908K0755
$$ plain form
14831 49664 35888 34468 29129 17349 17158 13692 15756 -3213 8030 17895 18629 19678 4431 -22601
14817 -22601 -16580 8641 24258 23227 22498 7900 9551 4582 -17209 -14627 -18522 -39370 -7743
14804 -7743 26772 21651 9967 8967 -6320 -8696 2861 11977 5408 -20948 -23606 -44001 -46483
14791 -46483 -34360 -31956 -34158 -28329 -23969 -40764 -57912 -79875 -86135 -61794 -19743 11671 11493
14778 11493 -3070 -35864 -50686 -21530 -7650 -7178 -26030 -12104 4701 16891 33166 18886
14766 18886 6688 15397 18317 8847 35771 21795 -13597 -8581 10304 -1450 -14168 -17147 4413
14753 4413 -1266 9008 31693 1481 -132 9336 -8947 -26674 -61416 -40942 -13488 17843
14741 17843 19987 20395 18365 155 -602 17083 25465 40317 40921 -14660 -24679 -5216 2939 -17888
$$ packed form
14831D9664j3776j420n339j1780j91l466K064j8969J1243R865P34J049j5247k7032
14817b2601O021K5221J5617j031p29j4598J651m969k1791K582l895k0848L1627
14804g743L4515n121j1684j000j5287k376J1557R116o569k6356k658k0395k482
14791d6483J2123K404k202N829M360j6795j7148k1963o260K4341M2051L1414j78
14778A1493j4563l2794j4822K9156J3880M72j8852J3926J6805J2190J6275j4280
14766A8886j2198Q709K920r470K6924j3976l5392N016J8885j1754j2718k979K1560
14753D413n679J0274K2685l0212j613R468j8283j7727l4742K0474K7454L1331
14741A7843K144M08k030j8210p57J7685Q382J4852O04n5581j0019J9463Q155k0827
$$ plain form
14727 -17888 -38537 -36296 -17891 -11010 14643 3788 -1443 -6779 -7148 -22545 -23192 -24234 -25940 -29241
14713 -29241 -14507 3065 10706 20126 -14822 -22642 -6690 12037 -3254 -31152 -44666 -32715
14701 -32715 -19447 -14139 -10450 4214 7055 -10703 -14833 -19147 -23744 -12245 -3612 -23481 -2051
14688 -2051 22144 27158 47609 36655 27868 34395 47247 52744 22435 -6188 9929 4153 -34345
14675 -34345 -44981 -23192 -32052 -30981 -45967 -68157 -53321 -43799 -26339 -38435 -50899 -47200
14663 -47200 -46017 -37193 -19324 8642 15608 9468 6278 -11523 -14041 -11841 -28635 -38793 -52881
14650 -52881 -56226 -66114 -49004 -43765 -45736 -27288 -5512 -33147 -35342 -28483 -39140 -15358 7870
14637 7870 24855 21026 24693 31886 -2677 -42169 -56578 -39623 -41065 -24781 -22669 -46031 -36770
$$ packed form
14727a7888k0649K241J8405O881K5653j0855n231n336l69j5397o47j042j706l301
14713b9241J4734J7572P641R420l4948p820J5952J8727j5291k7898j3514J1951
14701c2715J3268N308L689J4664K841j7758m130m314m597J1499Q633j9869K1430
14688b051K4195N014K0451j0954q787O527J2852N497l0309k8623J6117n776l8498
14675c4345j0636K1789q860J071j4986k2190J4836R522J7460j2096j2464L699
14663d7200J183Q824J7869K7966O966o140l190j7801k518K200j6794j0158j4088
14650e2881l345r888J7110N239j971J8448K1776k7635k195O859j0657K3782K3228
14637G870J6985l829L667P193l4563l9492j4409J6955j442J6284K112k3362R261
$$ plain form
14624 -36770 -12857 14587 35930 35071 25040 30868 24286 19375 9237 -6676 -29757 -38542 -18594
14611 -18594 -5943 9233 6578 2623 5009 5006 3087 -25653 -19327 -23857 -5345 -10363 -14746 -18019
14597 -18019 -2476 -7056 -18839 -33897 -48722 -43605 -59337 -17692 14399 6300 23227 30519
14585 30519 6752 1098 -4528 -11960 -31622 -15933 -2039 -37566 -12292 15867 33193 1712
14573 1712 -20133 -30910 -31885 -26542 -31946 -24705 -4547 -109 -25772 -29977 -33623 -39977 -23563 -7369
14559 -7369 -19934 -24675 -17206 -2569 2228 606 -2627 -1017 22786 27915 4672 -11891 -3454
14546 -3454 3485 16730 24339 20427 41118 58573 27053 12111 41596 46330 31854 8407 11584
14533 11584 26571 23612 12572 9814 -17795 -17142 -24885 -11730 4203 -597 -2796 16577 16174
$$ packed form
14624c6770K3913K7444K1343q59j0031N828o582m911j0138j5913k3081q785J9948
14611a8594J2651J5176k655l955K386lj919k8740O326m530J8512n018m383l273
14597a8019J5543m580j1783j5058j4825N117j5732M1645L2091q099J6927P292
14585C0519k3767n654n626p432j9662J5689J3894l5527K5274K8159J7326l1481
14573A712k1845j0777r75N343n404P241K0158M438k5663m205l646o354J6414J6194
14559g369j2565m741P469J4637M797j622l233J610K3803N129k3243j6563Q437
14546c454O939J3245P609l912K0691J7455l1520j4942K9485M734j4476k3447L177
14533A1584J4987k959j1040k758k7609O53p743J3155J5933m800k199J9373m03
$$ plain form
14520 16174 -19447 -33807 -4284 11705 4812 -13687 -13294 5217 11876 -14021 -28328 -41608
14508 -41608 -68461 -76755 -64180 -38532 -42906 -27865 -1692 -12200 -8017 988 4093 -20385 -31191
14495 -31191 -35138 -48868 -44124 -15029 -7924 14527 17148 9205 -4333 -10312 -16845 -5902 -4791
14482 -4791 -23326 -19530 10324 18932 7228 7462 -18345 -35683 -3852 -2540 -34171 5622 15990
14469 15990 27313 -2475 7688 15164 -4916 -14865 -14115 -30061 -14807 14611 18393 12208 -3445
14456 -3445 7443 -17720 -18543 -4764 4785 5931 9003 10913 12843 22564 32611 50740 32098
14443 32098 19320 21482 1705 3100 22572 14793 -7564 -32039 -54809 -68036 -44230 -30800
14431 -30800 -16516 -11214 -4383 42224 88832 96259 82711 62956 26220 19929 -7197 -9625 23309
$$ packed form
14520A6174l5621j4360K9523J5989o893j8499L93J8511O659k5897j4307j3280
14508d1608k6853q294J2575K5648m374J5041K6173j0508M183R005L105k4478j0806
14495c1191l947j3730M744K9095P105K2451K621p943j3538n979o533J0943J111
14482d791j8535L796K9854Q608j1704K34k5807j7338L1831J312l1631L9793J0368
14469A5990J1323k9788J0163P476k0080r949P50j5946J5254K9418L782o185j5653
14456c445J0888k5163q23J3779R549J146L072J910J930R721J0047J8129j8642
14443C2098j2778K162j9777J395J9472p779k2357k4475k2770j3227K3806J3430
14431c0800J4284N302O831M6607M6608P427j3548j9755l6736o291k7126k428L2934
$$ plain form
14418 23309 23342 29820 -3639 -3919 -22103 -60857 -72836 -59964 -37576 -29281 -19077 -18158 -38726
14405 -38726 -41758 -37180 -37419 -28520 12608 1767 5439 15039 -3583 -22569 -29288 -43184 -46381
14392 -46381 -40373 -42012 -25263 -6411 21506 39131 10243 -9495 -22993 -18112 -18139 -26883 -23406
14379 -23406 -18460 -24319 -32515 -50745 -57193 -46891 7164 27493 34345 19402 -2377 3511 -19585
14366 -19585 -44005 -31017 -24515 -11933 22711 12252 3773 21975 40208 36855 34137 29661 19416
14353 19416 15417 5758 3102 7857 -950 -3144 -2775 -492 -9740 -19724 -16408 -34401 -43181 -36154
14339 -36154 -20313 -10668 -9044 7221 9819 23236 29252 22100 26206 7320 3351 -2225 12141
14326 12141 26234 33664 10207 -18071 -32810 -26640 -1063 -2824 -10849 -22449 -47722 -42867 -25798
$$ packed form
14418B3309L3O478l3459k80j8184l8754j1979J2872K2388Q295J0204R19k0568
14405c8726l032M578k39Q899M1128j0841L672R600j8622j8986o719j3896l197
14392d6381O008j639J6749J8852K7917J7625k8888j9738j3498M881k7q744L477
14379b3406M946n859q196j8230o448J0302N4055K0329O852j4943k1779N888k3096
14366a9585k4420J2988O502J2582L4644j0459q479J8202J8233l353k718m476j0245
14353A9416l999r659k656M755q807k194L69K283r248r984L316j7993q780P027
14339c6154J5841R645J624J6265K598J3417O016p152M106j8886l969n576J4366
14326A2141J4093P430k3457k8278j4739O170K5577j761q025j1600k5273M855J7069
$$ plain form
14313 -25798 1145 16811 33081 42610 15998 -3930 68 -2085 13333 40188 27191 15760
14301 15760 -15948 -37223 -9419 29759 30955 35004 28007 29083 36634 21183 2502 -1551 -802
14288 -802 16167 18924 9337 -802 24984 33487 28397 -3368 -9816 21880 7969 -10827 -16021
14275 -16021 -29643 -18813 1232 18778 31671 -2891 -7129 -17387 -11154 1790 -533 3166
14263 3166 16184 33100 9111 -12858 -3029 3402 312 -2508 -19915 -23039 -5974 19395 54844
14250 54844 63021 72544 74829 37692 29051 33092 17471 -15193 -12000 -9102 -18176 -6137 31243
14237 31243 7311 -13918 -9288 -9813 -19915 -22442 -39562 -14601 -7861 -20266 -24498 -24301 -28215
14224 -28215 -37255 -45557 -6649 24011 40811 24551 36523 83014 122039 163821 166526 151608
$$ packed form
14313b5798K6943J5666J6270R529k6612j9928L998k153J5418K6855j2997j1431
14301A5760l1708k1275K7804L9178J196M049o997J076P551j5451j8681m053P49
14288h02J6969K757r587j0139K5786Q503n090l1765o448L1696j3911j8796n194
14275a6021j3622J0830K0045J7546J2893l4562m238j0258O233J2944k323L699
14263C166J3018J6916k3989k1969R829O431l090k820j7407l124J7065K5369L5449
14250E4844Q177R523K285l7137q641M041j5621l2664L193K898r074J2039L7380
14237C1243k3932k1229M630n25j0102k527j7120K4961O740j2405m232J97l914
14224b8215r040q302L8908L0660J6800j6260J1972M6491L9025M1782K705j4918
$$ plain form
14212 151608 150580 137397 154831 146563 101025 76934 73257 78119 62188 18267 4630 -709
14200 -709 -4598 -13946 12713 10167 -2229 -23075 -11187 -294 5707 -8008 927 10975 11187
14187 11187 20252 9357 9492 4801 -918 -7815 9672 9960 2448 4451 6747 1892 -15194 -35554
14173 -35554 -37325 -36764 -24614 -2165 33009 22501 6294 13500 21548 20143 18146 9252 -8353
14160 -8353 -19662 -6680 13630 10161 855 -4735 -10953 -17752 -8474 16193 81 -11497 -1496
14147 -1496 40579 41710 16990 736 7764 10100 35010 62859 38590 768 -14068 1261
14135 1261 27287 29849 9654 31426 3926 -15518 -26408 -13391 -19989 -766 8893 12894 12553
14122 12553 3684 9051 -32197 -20375 -7758 8253 13353 11012 -27862 -53719 -37052 -20749
$$ packed form
14212A51608j028j3183J7434q268m5538k4091l677M862j5931m3921j3637n339
14200g09l889r348K6659k546j2396k0846J1888J0893O001j3715Q935J0048K12
14187A1187R065j0895J35m691n719o897J7487K88p512K003K296m855j7086k0360
14173c5554j771N61J2150K2449L5174j0508j6207P206Q048j405j997q894j7605
14160h353j1309J2982K0310l469r306n590o218o799R278K4667j6112j1578J0001
14147a496M2075J131k4720j6254P028K336K4910K7849k4269l7822j4836J5329
14135A261K6026K562k0195K1772k7500j9444j0890J3017o598J9223R659M001l41
14122A2553q869N367m1248J1822J2617J6011N100k341l8874k5857J6667J6303
$$ plain form
14110 -20749 -21245 17328 26876 21378 -1942 -20579 -17399 -16885 2686 31300 37537 19574 5385
14097 5385 -22035 -23393 -25055 -25635 -3251 -1281 -26064 -9273 24200 34624 44498 43029 33620
14084 33620 14139 -2744 4246 -14674 -27550 -9374 6499 26011 27289 54333 65168 68213
14072 68213 23049 -23236 -16326 -553 782 4255 18108 13804 -16774 -10680 -8149 -15051 -18484
14059 -18484 -12559 -457 -22816 -37669 -35793 -43051 -34689 -16640 3413 28270 17151 -1800
14047 -1800 22292 46441 29841 37440 15935 -1121 10373 626 10715 306 -42270 -17927
14035 -17927 31505 33102 4096 1550 -26296 -58201 -42006 -21201 3093 -18509 -9550 19874
14023 19874 10999 -34642 -24136 -946 5472 14020 14546 23086 17426 48983 57755 40643 4964
$$ packed form
14110b0749m96L8573R548n498k3320j8637L180N14J9571K8614O237j7963j4189
14097E385k7420j358j662n80K2384J970k4783J6791L3473J0424R874j469r409
14084C3620j9481j6883O990j8920j2876J8176J5873J9512J278K7044J0835L045
14072F8213m5164m6285O910J5773J335L473J3853m304l0578O094K531o902l433
14059a8484N925J2102k2359j4853J876p258Q362J8049K0053K4857j1119j8951
14047a800K4092K4149j6600P599k1505j7056J1494r747J0089j0409m2576K4343
14035a7927M9432J597k9006k546k7846l1905J6195K0805K4294k1602Q959K9424
14023A9874q875m5641J0506K3190O418Q548N26Q540n660L1557Q772j7112l5679
$$ plain form
14010 4964 -2809 6080 -7379 -21048 -3144 -3057 -10754 12817 11449 -16571 -10199 -1295 5932 -1723
13996 -1723 -6427 -13518 -5442 -13230 -4778 -29976 -31186 -34679 -35318 -30587 -6570 22074 2697 -4742
13982 -4742 2163 -15931 -21907 -45803 -29999 1356 -3661 -28345 -32726 -14426 -32557 -46731 -38620
13969 -38620 -48094 -25801 -19211 -10659 -5331 -16932 -30746 -22068 9344 11555 -5821 -2060 -4466
13956 -4466 -28222 -18669 600 2982 -2368 8684 11192 24871 21153 7124 -15509 -42455 -66175
13943 -66175 -64051 -36058 -20425 -5962 309 -5212 -15710 -40924 -44972 -25847 -22894 818 52125
13930 52125 61058 63650 64377 60726 15472 -10440 -3246 23385 10278 12366 22384 6376 -8073
13917 -8073 13820 20509 10496 -21052 -3670 19298 23138 31271 45415 33687 47250 54636 62561
$$ packed form
14010D964p773Q889j3459j3669J7904Q7p697K3571j368k8020O372Q904P227p655
13996a723m704p091Q076p788Q452k5198j210l493o39M731K4017K8644j9377p439
13982d742O905j8094n976k3896J5804L1355n017k4684m381J8300j8131j4174Q111
13969c8620r474K2293O590Q552N328j1601j3814Q678L1412K211j7376L761k406
13956d466k3756R553J9269K382n350J1052K508J3679l718j4029k2633k6946k3720
13943f6175K124K7993J5633J4463O271n521j0498k5214m048J9125K953K3712N1307
13930E2125Q933K592P27l651m5254k5912P194K6631j3107K088J0018j6008j4449
13917h073K1893O689j0013l1548J7382K2968L840Q133J4144j1728J3563P386P925
$$ plain form
13904 62561 42865 27628 36372 34768 44391 63716 67366 51386 69055 56830 56396 15351 6348
13891 6348 1367 17167 40336 52133 47070 26384 15691 15892 5365 3901 1907 -22425 -19350
13878 -19350 3266 8670 5588 11051 -2309 1946 10677 -1177 16776 23093 21485 191 -30372
13865 -30372 -55938 -49131 -18949 -35242 -23343 -24095 -44462 -8213 10852 24219 27461 34814 27522
13852 27522 29255 40261 27090 11624 13816 11753 -16352 -24556 -17313 12270 10825 -14817 -12128
13839 -12128 -171 2712 -18273 6348 13697 15712 28414 24631 15719 15150 37663 25636 17893
13826 17893 13041 -22049 -10164 -926 -6091 12057 27610 31521 72139 78437 68147 56321 25192
13813 25192 23617 13900 9063 4033 -8747 -36236 -30075 -10698 3903 1883 -27594 -31817 -25944
$$ packed form
13904F2561j9696j5237Q744j604R623J9325L650j5980J7669j2225m34m1045r003
13891F348m981J5800K3169J1797n063k0686j0693K01j0527j464j994k4332L075
13878a9350K2616N404l082N463j3360M255Q731j1854J7953O317j608k1294l0563
13865c0372k5566O807L0182j6293J1899p52k0367L6249J9065J3367L242P353p292
13852B7522J733J1006j3171j5466K192k063k8105q204P243K9583j445k5642K689
13839a2128J1957K883k0985K4621P349K015J2702l783q912n69K2513j2027p743
13826A7893m852l5090J1885R238n165J8148J5553L911M0618O298j0290j1826l1129
13813B5192j575r717m837n030j2780k7489O161J9377J4601k020k9477m223N873
$$ plain form
13800 -25944 -22890 -9000 -15849 -27236 -5742 16713 27914 6355 -11171 -17811 -29410 -42830
13788 -42830 -60021 -58713 -40155 -23721 -13751 -24976 -51523 -19889 -15913 -14178 -13463 2044 -9856
13775 -9856 -31705 -14154 -2944 -28841 -31584 -28909 -12957 -6590 3107 8305 7956 -25536 -29496
13762 -29496 -19000 -20240 -9154 10714 16774 32341 19437 3907 -21792 -35423 -11156 -1907
13750 -1907 -28315 -39217 -16162 2540 1507 -4311 -7613 6260 6285 26411 16202 -26718 -27035
13737 -27035 -25786 -47181 -48996 -46374 -39542 -43478 -11605 -2017 -5097 72 29726 31709 -1333
13724 -1333 -25481 -51145 -44606 -16067 4466 12716 22888 21562 -563 -9759 21822 30859 30853 -40
13710 -40 -34998 -60848 -48353 -19569 4243 14336 15511 2695 -5320 -12437 -26179 -19103 -10671
$$ packed form
13800b5944L054J3890o849j1387K1494K2455J1201k1559j7526o640j1599j3420
13788d2830j7191J308J8558J6434R970j1225k6547L1634L976J735P15J5507j1900
13775i856k1849J7551J1210k5897k743K675J5952O367R697N198l49l3492l960
13762b9496J0496j240J1086J9868O060J5567j2904j5530k5699j3631K4267R249
13750a907k6408j0902K3055J8702j033n818l302J3873K5K0126j0209m2920l17
13737b7035J249k1395j815K622O832l936L1873R588l080N169K9654J983l3042
13724a333k4148k5664O539K8539K0533Q250J0172j326k2125r196L1581R037ol0893
13710d0l4958k5850J2495K8784K3812J0093J175j2816q015p117j3742P076Q432
$$ plain form
13697 -10671 20725 12290 26463 16818 -1225 -25359 -24748 -19280 -21745 -11566 4733 6461 5708
13684 5708 -4108 -23825 -25114 -1439 12753 -10757 -17371 -1189 -1575 -7819 -8014 -1490 -5653 19898
13670 19898 50005 50936 40803 18190 17969 12361 16190 13319 10970 13656 26534 15824 8684 16885
13656 16885 12144 -1313 -1301 7666 -14994 -34248 -24166 -35600 -20977 7512 4470 4662 9447
13643 9447 -11690 -25502 -25927 4926 -1340 -13256 -13007 -12305 -698 7674 1553 -9691 -15280 -11533
13629 -11533 -11018 -5767 4473 -8723 -18449 -33106 -32971 -42414 -32296 -21498 -15879 -4506 4600
13616 4600 513 -14366 -1880 -10222 -14138 -26421 -12070 11129 29008 35446 9816 6544 7699
13603 7699 11845 1543 1550 6720 -10959 -39016 -46524 -26976 -3103 23910 33976 22060 4709
$$ packed form
13697a0671L1396q435J4173r645j8043k4134O11N468k465J0179J6299J728p53
13684E708r816j9717j289K3675J4192k3510o614J6182l86o244j95O524m163K5551
13670A9898L0107R31j0133k2613k21n608L829k871k349K686J2878j0710p140Q201
13656A6885m741j3457J2Q967k2660j9254J0082j1434J4623K8489l042J92M785
13643I447k1137j3812m25L0853o266j1916K49P02J1607Q372o121j1244n589L747
13629a1533N15N251J0240j3196r726j4657J35r443J0118J0798N619J1373R106
13616D600m087j4879J2486q342l916j2283J4351K3199J7879O438k5630l272J155
13603G699M146j0302PN170j7679k8057p508J9548K3873K7013J0066j1916j7351
$$ plain form
13590 4709 -4654 14864 7212 3610 15842 22093 -13477 -32387 -14729 -7442 -17912 -28491 -25102
13577 -25102 8229 702 9205 -5167 -34577 -46599 -30764 2546 20065 21808 6228 -5832
13565 -5832 -5237 -9125 -18296 -15909 546 5726 19672 10003 12113 -711 3756 18465 111 23571
13551 23571 39950 3265 -25111 -28627 -18153 -3848 -4666 -27349 -25925 -39501 -26241 -4036
13539 -4036 -4396 -1944 -6166 5835 7538 15934 23553 13881 5993 -10576 -20164 7871 -10459 -14334
13525 -14334 -18676 9973 28434 33126 20777 3423 3107 134 14952 26356 36108 -5795 -39816
13512 -39816 -16169 -2713 1336 9751 29196 49401 56322 42106 8647 -30324 -7856 8318
13500 8318 9390 13776 8383 -11090 -32000 -51531 -43075 -49037 -63316 -69197 -46626 -30046 -21664
$$ packed form
13590D709r363J9518p652l602J2232O251l5570j8910J7658P287j0470j0579L389
13577b5102L3331p527Q503j4372k9410j2022J5835L3310J7519J743j5580j2060
13565e832N95l888r171K387J6455N180J3946r669K110j2824M467J4709j8354K3460
13551B3571J6379l6685k8376l516J0474J4305q18k2683J424j3576J3260K2205
13539d036l60K452m222J2001J703Q396P619r672p888j6569r588K8035j8330l875
13525a4334m342K8649J8461M692j2349j7354l16k973J4818J1404R752m1903l4021
13512c9816K3647J3456M049Q415J9445K0205O921j4216l3459l8971K2468J6174
13500H318J072M386n393j9473k0910j9531Q456n962j4279n881K2571J6580Q382
$$ plain form
13487 -21664 -29992 -12277 5171 -7947 -18728 -19861 -7965 -19350 -50142 -56880 -39136 -46172
13475 -46172 -22548 7321 -17741 -42905 -40325 -23269 -12170 -10698 0 -8004 18845 -13022
13463 -13022 -39811 -20041 -939 8564 -5442 -9863 -28572 -49918 -67199 -73040 -58500 -49086
13451 -49086 -16939 -10006 -1103 -5101 -8029 -16980 -14914 -14482 -17782 -28421 -8136 -14818 -2083 10074
13437 10074 23413 11911 -18968 -49948 -42314 8923 37710 33356 24443 12000 -10159 9938
13425 9938 31195 21085 34026 20337 10836 4932 -6028 -3885 -11971 -16920 -16496 -2340 31213
13412 31213 23148 -6816 -29811 -18672 20968 48764 35524 24525 36467 33591 489 -19773
13400 -19773 13699 453 -17970 -9625 -880 5233 -650 17998 5175 -7947 13925 -10196
$$ packed form
13487b1664q328J7715J7448j3118j0781j133J1896j1385l0792o738J7744p036
13475d6172K3624K9869k5062k5164K580J7056J1099J472J0698q004K6849l1867
13463a3022k6789J9770J9102R503j4006m421j8709k1346j7281n841J4540R414
13451d9086L2147O933Q903l998k928q951K066M32l300j0639K0285o682J2735J2157
13437A0074J3339j1502l0879l0980P634N1237K8787m354q913j2443k2159K0097
13425I938K1257j0110J2941j3689r501n904j0960K143q086m949M24J4156L3553
13412C1213q065k9964k2995J1139L9640K7796j3240j0999J1942k876l3102k0262
13400a9773L3472j3246j8423Q345Q745O113n883J8648j2823j3122K1872k4121
$$ plain form
13388 -10196 606 8771 -10064 -24803 -13205 -8798 3814 -2080 -9060 -9716 -3626 12067 14158
13375 14158 -6518 -3875 -328 11874 15308 15912 17835 17359 7348 -5245 -2466 -14676 6387
13362 6387 -3069 -19005 -25602 -2821 -3347 2245 14614 26222 6126 -14675 10664 21581 8497
13349 8497 1100 -25120 -24735 18089 70910 39315 -19575 -42636 -44221 -21845 -10896 -15949 4907
13336 4907 17841 -20438 -51819 -35566 -37975 -27765 15437 11700 -14659 -4153 -1764 -22876
13324 -22876 -21129 -26060 -37162 -58506 -47100 -42900 -37482 -29221 -16013 -12800 -6386 13287 30372
13311 30372 13104 19603 962 -9521 16012 22074 12208 16332 13725 21181 8977 7629 31257
13298 31257 19931 18630 11753 23094 34893 27128 10106 34374 23324 37196 54913 66174
$$ packed form
13388a0196J0802Q165j8835j4739J1598M407J2612n894o980o56O090J5693K091
13375A4158k0676K643L547J2202L434O04J923m76j0011j2593K779j2210K1063
13362F387r456j5936o597K2781n26N592J2369J1608k0096k0801K5339J0917j3084
13349H497p397k6220L85M2824N2821l1595n8890k3061j585K2376J0949n053K0856
13336D907J2934l8279l1381J6253k409J0210M3202l737k6359J0506K389k1112
13324b2876J747m931j1102k1344J1406M200N418Q261J3208L213O414J9673J7085
13311C0372j7268O499j8641j0483K5533O062r866M124k607P456j2204j348K3628
13298C1257j1326j301o877J1341J1799p765j7022K4268j1050J3872J7717J1261
$$ plain form
13286 66174 75193 74541 67778 76755 101280 151255 184798 196210 243340 333228 442109 599615
13274 599615 735346 845195 881760 839050 805717 844994 857437 772955 663860 536767 426004
13263 426004 337630 274061 220716 221720 202127 196793 195595 178425 179832 173819 163086 153075
13251 153075 134729 120506 110497 75804 71169 80870 71850 55266 57991 71717 60502 44844
13239 44844 40037 37839 41468 44720 37194 48462 9939 -10019 -14058 3781 3729 20386 20700 42665
13225 42665 64303 55844 49120 76274 91186 51725 33771 18927 -1476 15768 13854 514
13213 514 5482 -1219 5801 -26021 -46261 -38411 -38187 -38491 -10126 4326 1517 -6144 4340 35409
13199 35409 45462 39593 5452 -9042 -5803 3841 1035 2051 21395 32131 47561 60513 57146
$$ packed form
13286F6174R019o52o763Q977K4525M9975L3543J1412M7130Q9888J08881J57506
13274E99615J35731J09849L6565m2710l3333L9277J2443q4482j09095j27093j10763
13263D26004q8374o3569n3345J004j9593n334j198j7170J407o013j0733j0011
13251A53075j8346j4223j0009l4693m635R701r020j6584K725J3726j1215j5658
13239D4844m807k198L629L252p526J1268l8523j9958m039J7839n2J6657L14K1965
13225D2665K1638q459o724K7154J4912l9461j7954j4844k0403J7244j914j3340
13213E14M968o701P020l1822k0240P850K24l04K8365J4452k809p661J0484L1069
13199C5409J0053n869l4141j4494L239R644k806J016J9344J0736J5430J2952l367
$$ plain form
13186 57146 15397 -6189 -18441 -19686 -2376 25717 47821 48796 36017 11526 -2438 23022
13174 23022 43994 25599 7906 14999 20887 20899 37647 44558 44432 9114 -7123 -6134 11854 21526
13160 21526 27544 5635 -15844 -28112 -59727 -56477 -46857 -38926 -39672 -7684 17555 40809 52580
13147 52580 67411 70255 57496 48636 26900 42228 50305 42968 38839 -9033 -22265 -3701 14769
13134 14769 -4808 -32722 -6006 -18252 -9218 19761 36404 60838 57150 42561 41256 54325
13122 54325 41816 41539 35452 13645 13785 27442 17274 35126 54664 66709 58606 63522 42733
13109 42733 38018 57907 37267 47923 58836 60012 54726 62716 98960 92937 57769 53399 52091
13096 52091 65441 75528 78704 89773 96517 105526 82234 89519 97433 81219 70499 49251 24219
$$ packed form
13186E7146m1749k1586j2252j245J7310K8093K2104R75j2779k4491j3964K5460
13174B3022K0972j8395j7693P093N888J2J6748O911j26l5318j6237R89J7988R672
13160B1526O018k1909k1479j2268l1615L250R620P931p46L1988K5239K3254J1771
13147E2580J4831K844j2759q860k1736J5328Q077p337m129m7872j3232J8564J8470
13134A4769j9577k7914K6716j2246R034K8979J6643K4434l688j4589j305J3069
13122E4325j2509k77o087k1807J40J3657j0168J7852J9538J2045q103M916k0789
13109D2733m715J9889k0640J0656J0913J176n286P990L6244o023l5168m370j308
13096E2091J3350J0087L176J1069O744R009k3292P285P914j6214j0720k1248k5032
$$ plain form
13083 24219 26555 26650 39024 49509 55799 35442 20772 4013 3426 30864 34249 18987 43536
13070 43536 52506 43509 87784 119701 95275 71367 84173 91685 101184 120666 85430 66525
13058 66525 88861 101366 83147 68050 55561 68596 72228 78160 91830 83872 84446 87999 94819
13045 94819 109425 126858 138113 102790 82236 90306 92975 74180 48793 30753 36893 53522
13033 53522 28837 15591 6026 -8931 -28516 -20647 -25875 -39641 -21251 4637 32873 21998
13021 21998 41727 47546 48819 52988 41031 70553 75620 70515 52286 43138 53247 68500 63248
13008 63248 48899 64662 48584 42232 52718 70270 69639 78632 66859 61285 56135 25749 25435
12995 25435 33540 -1110 -25976 -15798 10762 17819 37980 84322 154588 213654 227872 222170
$$ packed form
13083B4219K336R5J2374J0485O290k0357j4670j6759n87K7438L385j5262K4549
13070D3536Q970q997M4275L1917k4426k3908J2806P512R499J9482l5236j8905
13058F6525K2336J2505j8219j5097j2489J3035L632N932J3670p958N74L553O820
13045I4819J4606J7433J1255l5323k0554Q070K669j8795k5387j8040O140J6629
13033E3522k4685j3246r565j4957j9585P869n228j3766J8390K5888K8236j0875
13021B1998J9729N819J273M169j1957K9522N067n105j8229r148J0109J5253n252
13008F3248j4349J5763j6078o352J0486J7552o31Q993j1773n574n150l0386l14
12995B5435Q105l4650k4866J0178K6560P057K0161M6342P0266N9066J4218n702
$$ plain form
12983 222170 218818 204712 190646 181399 158975 113753 87094 89270 86885 119348 134797 150823
12971 150823 193007 225038 263091 307148 341301 370811 388273 363856 350913 310175 254942
12960 254942 221994 226092 232500 255240 269291 256730 259985 265675 285326 298337 297215 294163 291463
12947 291463 278056 290164 286406 275428 252735 249854 246854 254084 291119 324461 304936 287847
12935 287847 288496 319855 305567 299999 326826 330687 321523 315612 327731 355159 355769 344665 329748
12922 329748 320043 299113 303977 325081 333297 327722 305393 295080 307069 331588 342701 308151
12910 308151 300669 318054 304890 314093 278301 307204 372949 394387 399121 398347 423764 474760
12898 474760 525395 550065 577524 586208 573968 603699 672034 672166 675818 715581 742134 738133
$$ packed form
12983B22170l352j4106j4066r247k2424m5222k6659K176k385L2463J5449J6026
12971A50823M2184L2031L8053M4057L4153K9510J7462k4417j2943m0738n5233
12960B54942l2948M098O408K2740J4051j2561L255N690J9651J3011j122l052k700
12947B91463j3407J2108l758j0978k2693k881l000P230L7035L3342j9525j7089
12935B87847O49L1359j4288n568K6827L861r164n911J2119K7428O10j1104j4917
12922C29748r705k0930M864K1104Q216n575k2329j0313J1989K4519J1113l4550
12910C08151p482J7385j3164R203l5792K8903O5745K1438M734p74K5417N0996
12898D74760N0635K4670K7459Q684j2240K9731O8335J32L652L9763K6553m001
$$ plain form
12886 738133 750494 771756 806912 861949 938103 978047 1048894 1114742 1171968 1249725 1336835
12875 1336835 1451957 1556923 1655843 1801525 1976021 2153405 2335655 2531610 2734925 2963569
12865 2963569 3266495 3663833 4144164 4754025 5487279 6317483 7154105 8015297 9020231
12856 9020231 10260808 11768513 13565242 15789824 18667627 22648249 28270818 36360004
12848 36360004 48115081 64978794 87960294 115601411 141358159 156208424 158657214
12841 158657214 157700315 160330745 161888091 152337431 129930535 103583026 81648144 65912050
12833 65912050 55021305 47447255 42047166 37922180 34505625 31586327 29109525 26935731
12825 26935731 24925114 22937579 21000878 19147608 17368095 15666046 14065128 12596264
$$ packed form
12886G38133J2361K1262L5156N5037P6154L9944P0847O5848N7226P7757Q7110
12875A336835J15122J04966R8920J45682J74496J77384J82250J95955K03315K28644
12865B963569L02926L97338M80331O09861P33254Q30204Q36622Q61192J004934
12856I020231J240577J507705J796729K224582K877803L980622N622569Q089186
12848C6360004J1755077J6863713K2981500K7641117K5756748J4850265K448790
12841A58657214r56899K630430J557346r550660k2406896k6347509k1934882j5736094
12833F5912050j0890745p574050n400089m124986l416555k919298k476802k173794
12825B6935731k010617j987535j936701j853270j779513j702049j600918j468864
$$ plain form
12817 12596264 11327027 10249914 9305126 8443529 7734690 7146697 6643314 6199656 5760588
12808 5760588 5381410 5044047 4737622 4490670 4300458 4131772 3992639 3897406 3846425 3807347
12798 3807347 3740123 3618725 3470078 3290560 3090045 2850743 2577781 2284972 2052872 1866296
12788 1866296 1687638 1522871 1399998 1338203 1262358 1189867 1114556 1066460 1016454 961177 921142
12777 921142 895330 874649 792219 778070 747472 720038 719555 705031 666313 587787 560968 549926
12765 549926 525186 531735 499083 478777 462514 463958 464109 450258 442016 404814 385117 396202
12753 396202 400707 400085 368704 351684 344863 326532 328329 326237 311353 305376 292047 276677 292363
12740 292363 277731 284753 303432 270241 244959 222315 196992 189664 186709 193752 175036 200978
$$ packed form
12817A2596264j269237j077113r44788q61597p08839n87993n03383m43658m39068
12808E760588l79178l37363l06425k46952j90212j68686j39133r5233n0981l9078
12798C807347o7224j21398j48647j79518k00515k39302k72962k92809k32100j86576
12788A866296j78658j64767j22873o1795p5845p2491p5311m8096n0006n5277m0035
12777I21142k5812k0681q2430j4149l0598k7434m83j4524l8718p8526k6819j1042
12765E49926k4740O549l2652k0306j6263J444J51j3851q242l7202j9697J1085
12753C96202M505o22l1381j7020o821j8331J797k092j4884n977j3329j5370J5686
12740B92363j4632P022J8679l3191k5282k2644k5323p328k955P043j8716K5942
$$ plain form
12728 200978 237097 243372 237571 239949 234256 233465 226716 205014 195512 175347 176607 209130 237942
12715 237942 249021 295834 327540 308825 313369 311026 308433 304612 309140 292180 305082 318361
12703 318361 300876 300953 302306 300023 271986 283306 310056 329223 342987 324191 313686 297050
12691 297050 312631 347966 349041 312422 284703 273741 268594 271267 265034 249252 242093 197324
12679 197324 172729 212255 213459 226926 228169 206835 179582 177180 199997 206104 193337 189586
12667 189586 154388 102710 118048 117099 89596 93687 121732 125750 116563 105434 135848 150485
12655 150485 141484 128456 116688 124901 148054 130445 123269 118723 129087 104783 77660 63024
12643 63024 77759 71930 60791 52716 17702 -11482 15977 33751 36348 36299 70662 66357 77415
$$ packed form
12728B00978L6119O275n801K378n693p91o749k1702r502k0165J260L2523K8812
12715B37942J1079M6813L1706j8715M544k343k593l821M528j6960J2902J3279
12703C18361j7485P7J353k283k8037J1320K6750J9167J3764j8796j0505j6636
12691B97050J5581L5335J075l6619k7719j0962n147K673o233j5782p159m4769
12679A97324k4595L9526J204J3467J243k1334k7253k402K2817O107j2767l751
12667A89586l5198n1678J5338r49k7503M091K8045M018r187j1129L0414J4637
12655A50485r001j3028j1768Q213K3153j7609p176m546J0364k4304k7123j4636
12643F3024J4735n829j1139q075l5014k9184K7459J7774K597m9L4363m305J1058
$$ plain form
12630 77415 80237 57592 45858 52082 50320 9138 -10158 -16222 -6973 -6472 5943 -3661 -16668
12617 -16668 -36183 -50834 -40982 -13630 11665 21371 4966 -245 17880 28145 42682 15682
12605 15682 6515 -1671 19372 25728 23903 7970 16209 39859 54660 71873 49423 3275 -7367
12592 -7367 14034 23683 34622 26805 27343 15449 23467 16114 20302 47402 59964 77549 62827
12579 62827 32328 35490 53877 28944 26853 32954 11397 9115 15748 18233 31124 50400 46758
12566 46758 48103 46227 23040 17378 42061 31512 34832 48227 65709 82616 88417 92825 96272
12553 96272 85301 63026 67057 70569 48590 68578 90998 109197 127997 152156 175270 175499
12541 175499 185035 213692 247500 304776 376674 448102 499052 503798 484749 480938 499047 545798
$$ packed form
12630G7415K822k2645j1734O224j762m1182j9296o064R249N01J2415r604j3007
12617a6668j9515j4651R852K7352K5295R706j6405n211J8125J0265J4537k7000
12605A5682r167q186K1043O356j825j5933Q239K3650J4801J7213k2450m6148j0642
12592g367K1401R649J0939p817N38j1894Q018p353M188K7100J2562J7585j4722
12579F2827l0499L162J8387k4933k091O101k1557k282O633K485J2891J9276l642
12566D6758J345j876k3187n662K4683j0549L320J3395J7482J6907N801M408L447
12553I6272j0971k2275M031L512k1979J9988K2420J8199J8800K4159K3114K29
12541A75499R536K8657L3808N7276P1898P1428N0950M746j9049l811J8109M6751
$$ plain form
12529 545798 535376 482297 402937 321109 267592 228354 168471 139466 156947 166428 142207 122632
12517 122632 95007 85855 83510 91691 101732 98656 95667 73692 35370 23511 43351 59882
12505 59882 63580 64101 51463 57044 51919 44718 21269 -875 21722 22841 18943 12268 -49
12492 -49 -11650 15710 26138 35016 41581 62295 57551 58597 79349 50734 37513 21861 44995
12479 44995 68537 65158 43219 9634 11241 3385 7233 18147 -2530 -11267 13136 25596 30361
12466 30361 60920 74324 83164 78075 58883 30787 38328 49326 46311 42534 48509 34366 -796
12453 -796 14675 37100 59881 76931 80478 75851 94546 112239 137182 139938 135474 176083 223284
12440 223284 287399 324029 391272 457594 483748 474800 496092 474724 450962 398803 334388 286906
$$ packed form
12529E45798j0422n3079p9360q1828n3517l9238n9883k9005J7481R481k4221j9575
12517A22632k7625r152k345Q181J0041l076k989k1975l8322j1859J9840J6531
12505E9882L698N21j2638N581n125p201k3449k2144K2597J119l898o675j2317
12492d9j1601K7360J0428Q878O565K0714m744J046K0752k8615j3221j5652K3134
12479D4995K3542l379k1939l3585J607p856L848J0914k0677q737K4403J2460M765
12466C0361L0559J3404Q840n089j9192k8096P541J0998l015l777N975j4143l5162
12453g96J5471K2425K2781J7050L547m627J8695J7693K4943K756m464M0609M7201
12440B23284O4115L6630O7243O6322K6154q948K1292k1368k3762n2159o4415m7482
$$ plain form
12428 286906 264988 244332 233212 213877 179297 156199 141444 119347 126468 142757 163070 172046
12416 172046 175638 160540 199000 279212 352264 426113 547048 660905 766564 861979 896557
12405 896557 902784 915447 907126 827400 699835 573913 466469 358230 299661 273384 246773
12394 246773 241932 258980 268946 247158 199769 167229 142553 135949 122875 131637 148838 119890
12382 119890 97951 70208 44340 3256 6962 28366 57924 59403 55507 32535 20136 1385
12370 1385 8429 36763 48258 37111 21517 18217 21548 6036 12144 41566 65677 86549 69303
12357 69303 76774 79742 74918 62742 38233 32377 4184 -13823 -23547 -25281 -8104 31049 49550
12344 49550 56341 44972 45813 60659 78591 52970 36234 29689 33423 31601 15979 -1862 8397
$$ packed form
12428B86906k1918k0656j1120j9335l4580k3098j4755k2097P121J6289K0313Q976
12416A72046L592j5098L8460Q0212P3052P3849J20935J13857J05659R5415L4578
12405H96557O227J2663q321p9726j27565j25922j07444j08239n8569k6277k6611
12394B46773m841J7048R966k1788m7389l2540k4676o604j3074Q762J7201k8948
12382A19890k1939k7743k5868m1084L706K1404K9558J479l896k2972j2399j8751
12370A385P044K8334J1495j1147j5594l300L331j5512O108K9422K4111K0872j7246
12357F9303P471K968m824j2176k4509n856k8193j8007r724j734J7177L9153J8501
12344D9550O791j1369Q41J4846J7932k5621j6736o545L734j822j5622j7841J0259
$$ plain form
12331 8397 12428 3548 -8230 5848 32309 51563 42623 36140 16809 13024 28409 12591 -9479
12318 -9479 20114 31195 36800 38030 33194 30263 20350 22239 42314 33449 2294 -1907 7763 22613
12304 22613 23500 -3738 -27511 -15340 -17590 -11379 5192 15261 -3861 15841 38102 40011 35981
12291 35981 47601 49969 71723 51942 59003 71065 47928 46448 64404 56333 39181 27106
12279 27106 14344 26668 26985 18078 1117 14903 -9208 -1186 10115 11096 4061 20401 29645
12266 29645 28211 42624 40884 33211 20974 42860 59148 34167 23308 25355 25972 26298 28616
12253 28616 26323 21608 -1546 -20230 1393 8531 14207 -2683 -6089 -259 -13984 -29077 -32205
12240 -32205 -32241 -34663 -15032 2610 15978 11413 4816 -28217 -50459 -19913 -3879 -9629 -30045
$$ packed form
12331H397M031q880j1778J4078K6461J9254q940o483j9331l785J5385j5818k2070
12318i479K9593J1081N605J230m836k931r913J889K0075q865l1155m201R670J4850
12304B2613Q87k7238k3773J2171k250O211J6571J0069j9122J9702K2261J909m030
12291C5981J1620K368K1754j9781P061J2062k3137j480J7956q071j7152j2075
12279B7106j2762J2324L17q907j6961J3786k4111Q022J1301R81p035J6340R244
12266B9645j434J4413j740p673j2237K1886J6288k4981j0859K047O17L26K318
12253B8616k293m715k3154j8684K1623P138N676j6890l406N830j3725j5093l128
12240c2205l6k422J9631J7642J3368m565o597l3033k2242L0546J6034n750k0416
$$ plain form
12227 -30045 -31479 -5394 8489 -23605 -44710 -33283 -28568 -14692 -11978 4383 32753 19942
12215 19942 19731 16914 12233 9031 12516 -1549 -30186 -7414 21251 27997 27426 15649 -4345
12202 -4345 -5327 73 -10287 8141 496 -4608 -3955 -23650 -56574 -77616 -70035 -43893 -16853
12189 -16853 -15936 -21444 -10137 -17995 -17518 23230 41715 28726 11802 -4339 -21772 -7944 9709
12176 9709 -16371 -13596 -7274 -37297 -65121 -51038 -27533 -16046 -43022 -54662 -18474 -1249
12164 -1249 -8592 -26157 -41704 -47392 -34750 -26081 -24256 -33356 -57407 -59581 -16849 9335 13541
12151 13541 32213 5767 -1431 4533 -895 -15141 5160 47958 44170 11820 1710 -30242
12139 -30242 -28776 -14419 33144 24214 -9 -16993 -55616 -48575 2319 15975 34353 39737
$$ packed form
12227c0045j434K6085J3883l2094k1105J1427M715J3876K714J6361K8370j2811
12215A9942k11k817m681l202L485j4065k8637K2772K8665O746n71j1777j9994
12202d345r82N400j0360J8428p645n104O53j9695l2924k1042P581K6142K7040
12189a6853R17n508J1307p858M77M0748J8485j2989j6924j6141j7433J3828J7653
12176I709k6080K775O322l0023k7824J4083K3505J1487k6976j1640L6188J7225
12164a249p343j7565j5547n688J2642Q669J825r100k4051k174M2732K6184M206
12151A3541J8672k6446p198N964n428j4246K0301M2798l788l2350j0110l1952
12139c0242J466J4357M7563q930k4223j6984l8623P041N0894J3656J8378N384
$$ plain form
12127 39737 27286 22372 -2917 -32381 -13600 19434 20943 23516 22726 10001 14934 72746 113046
12114 113046 117096 90867 50439 11517 -7504 1614 1196 13324 4390 7339 21694 46854 23355
12101 23355 -9867 -360 23023 14565 4439 30585 38290 22934 10255 20684 18077 16833 11732
12088 11732 22392 7725 9644 7424 32045 41641 44121 39616 22740 -7302 3069 25632 1403
12075 1403 -6457 -14920 -253 12775 9480 -4131 -14767 5226 3125 17204 22513 19232 22375
12062 22375 32381 23030 -4163 4819 36846 33314 16034 -10647 -27341 -25242 -34483 -55110 -34812
12049 -34812 -10534 -14423 3430 14756 2276 4011 -9661 -14827 -29422 -38806 -45181 -43369 -24610
12036 -24610 2910 14705 7741 5808 -3077 -29909 -33091 -12932 11763 34342 39596 34786 21499
$$ packed form
12127C9737j2451m914k5289k9464J8781L3034J509K573p90j2725M933N7812M0300
12114A13046M050k6229m0428l8922j9021R118m18J2128q934K949J4355K5160k3499
12101B3355l3222R507K3383q458j0126K6146P705j5356j2679J0429k607j244n101
12088A1732J0660j4667J919k220K4621R596K480m505j6876l0042J0371K2563k4229
12075A403p860q463J4667J3028l295j3611j0636J9993k101J4079N309l281L143
12062B2375J0006r351k7193Q982L2027l532j7280k6681j6694K099r241k0627K0298
12049c4812K4278l889J7853J1326j2480J735j3672n166j4595r384o375J812J8759
12036b4610K7520J1795o964j933q885k6832l182K0159K4695K2579N254m810j3287
$$ plain form
12023 21499 1642 4977 11282 6652 8047 -7222 -18666 -12506 -10054 -17483 -26200 -13384 9742
12010 9742 4434 -11983 -24749 -16267 -16420 -26428 -23887 -40868 -33360 -19120 -40368 -44938 -60811
11997 -60811 -51526 -26986 -22092 -12513 3547 5093 2986 -6637 -22439 -22976 -20903 -32205 -40879 -42174
11983 -42174 -61136 -60481 -32631 -34730 -48257 -40551 -35023 -25945 -44549 -74585 -73044 -57432 -45461
11970 -45461 -20843 -15811 749 -632 -21580 -28402 -8353 -11076 -20075 3224 24333 25690 28605
11957 28605 42240 7932 -10483 -9669 9000 9493 -502 -3556 -3036 -19262 -10616 22002 52106
11944 52106 45972 35449 35044 44277 40580 7250 -7414 16363 9926 5082 5817 -4056 14404 23556
11930 23556 19258 36284 49468 34320 27036 19933 37790 61446 56090 25604 21979 22935 33654
$$ packed form
12023B1499j9857L335O305m630J395j5269j1444O160K452p429q717J2816K3126
12010I742n308j6417j2766Q482j53j0008K541j6981P508J4240k1248m570j5873
11997f0811R285K4540M894R579J6060J546k107r623j5802n37K073j1302q674j295
11983d2174j8962O55K7850k099j3527P706N528R078j8604l0036J541J5612J1971
11970d5461K4618N032J6560j381k0948o822K0049k723q999K3299K1109J357K915
11957B8605J3635l4308j8415Q14J8669M93r995l054N20j6226Q646L2618L0104
11944E2106o134j0523m05R233l697l3330j4664K3777o437m844P35r873J8460R152
11930B3556m298J7026J3184j5148p284p103J7857K3656n356l0486l625R56J0719
$$ plain form
11917 33654 50228 68516 87669 62702 56087 46585 65447 54144 47614 56260 24862 5196
11905 5196 8689 22285 20947 32009 27687 17310 -6589 6517 -4567 -8964 22207 28406 -14851
11892 -14851 -23979 -13018 -244 -26104 -33241 -22922 -36943 -53038 -37779 -14640 -23473 -11804
11880 -11804 13595 11915 -17087 5892 13625 -13275 -15385 -30089 -26739 1186 5434 24136 16176
11867 16176 4715 894 -8089 -40516 -39327 -22940 -29447 -52168 -20270 -1935 -22049 -20603 3433
11854 3433 13504 121 -19042 -17971 4123 31352 26399 20335 8152 -13410 -38946 -17384
11842 -17384 -14734 -12657 9191 -21144 -28510 -16740 4926 19305 30167 24472 -4864 -24243
11830 -24243 -28829 -11661 8346 32089 49941 34706 6235 -15689 6059 4939 3034 7241
$$ packed form
11917C3654J6574J8288J9153k4967o615r502J8862j1303o530Q646l1398j9666
11905E196L493J3596j338J1062m322j0377k3899J3106j1084m397L1171O199m3257
11892a4851r128J0961J2774k5860p137J0319j4021j6095J5259K3139q833J1669
11880a1804K5399j680k9002K2979P733k6900k110j4704L350K7925M248J8702p960
11867A6176j1461l821q983l2427J189J6387o507k2721L1898J8335k0114J446K4036
11854C433J0071j3383j9163J071K2094K7229m953o064j2183k1562k5536K1562
11842a7384K650K077K1848l0335p366J1770K1666J4379J0862n695k9336j9379
11830b4243m586J7168K0007K3743J7852j5235k8471k1924K1748j120j905M207
$$ plain form
11818 7241 -5350 -25829 -29718 -31265 -13483 -5736 -13394 -12727 9186 11304 -1281 -26724 -26875 -37853
11804 -37853 -59711 -64544 -49591 -16637 -15178 -19167 -22327 171 25901 39214 30200 9956 20439
11791 20439 46538 50641 32473 40977 46976 35961 4246 -24742 -52683 -35269 -18390 -16487
11779 -16487 -28834 -41030 -42882 -40219 -27779 -59552 -62040 -28043 -11683 -23084 -17701 -6984
11767 -6984 -18193 -34569 -45383 -51536 -52336 -31145 -35969 -42947 -22186 -14754 -7946 -10026 -7834 -5317
11753 -5317 18453 18131 34024 32078 8273 29113 37021 46498 67732 68265 54517 58265 40446
11740 40446 25025 35913 51149 43236 20810 12687 6352 10548 1424 -14644 -3736 12459 32393
11727 32393 50130 38882 33642 37160 17641 38145 40189 27357 15479 17765 39598 37060 -1250
$$ packed form
11818G241j2591k0479l889j547J7782P747p658O67K1913K118j2585k5443j51j0978
11804c7853k1858m833J4953L2954J459l989l160K2498K5730J3313r014k0244J0483
11791B0439K6099M103j8168Q504N999j1015l1715k8988k7941J7414J6879J903
11779a6487j2347j2196j852K663J2440l1773k488L3997J6360j1401N383J0717
11767f984j1209j6376j0814o153q00K1191m824o978K0761P432O808k080K192K517
11753e317K3770l22J5893j946k3805K0840P908R477K1234N33j3748L748j7819
11740D0446j5421J0888J5236p913k2426q123o335M196r124j6068J0908J6195J9934
11727C2393J7737j1248n240L518j9519K0504K044j2832j1878K286K1833k538l8310
$$ plain form
11714 -1250 862 6393 2026 34789 31137 9458 -29817 -19219 -20495 -6227 -6880 -37060 -4705
11701 -4705 21952 5833 -327 -21771 -23487 -23073 -20273 3853 15670 12921 -24945 -28329 -16861
11688 -16861 8663 21053 13688 16064 16617 7302 2005 -31015 -24856 -17148 -32365 -26419 -7852
11675 -7852 -809 25000 47757 39925 26783 11150 -24943 -25479 -32022 -26066 6259 2801 -13621
11662 -13621 -12784 -9689 -36323 -24978 -22854 -42382 -55512 -12808 -8942 3876 22326 15651 34135
11649 34135 15568 -2167 -18270 -13516 4815 30604 43500 42307 68838 55832 8010 -15414
11637 -15414 -20931 -33150 -39684 -26229 -9317 13426 15994 15584 20759 13202 -8850 -22299 -31390
11624 -31390 -34797 -34366 -36333 -41125 -24597 -48764 -53155 -71363 -59471 -27309 6903 32299 37554
$$ packed form
11714a250K112N531m367L2763l652k1679l9275J0598j276J4268o53l0180L2355
11701d705K6657j6119o160k1444j716M14K800K4126J1817k749l7866l384J1468
11688a6861K5524J2390p365K376N53r315n297l3020O159P708j5217N946J8567
11675g852P043K5809K2757p832j3142j5633l6093n36o543N956L2325l458j6422
11662a3621Q37L095k6634J1345K124j9528j3130M2704L866J2818J8450o675J8484
11649C4135j8567j7735j6103M754J8331K5789J2896j193K6531j3006m7822k3424
11637a5414n517j2219o534J3455J6912K2743K568m10N175p557k2052j3449r091
11624c1390l407M31j967m792J6528k4167m391j8208J1892L2162L4212K5396N255
$$ plain form
11611 37554 32953 18470 17200 38446 60552 38492 30315 10446 3506 9662 31688 10341 11103
11598 11103 15844 27936 48278 108286 144884 170039 181946 212190 256859 308732 416839 573766
11586 573766 729208 823075 856892 795741 699296 596481 464299 348348 277485 217952 238150
11575 238150 244037 214049 208079 199053 183541 133277 113889 94853 82238 92903 110471 95170
11563 95170 81239 81316 64142 56750 56457 49332 51533 46072 40364 51894 56615 55639 46074 46037 44355
11548 44355 66576 78007 69029 68297 43959 11881 25451 47635 43573 24248 -728 -652 -2924
11535 -2924 -17662 -22870 -16253 -16419 -28333 -10692 -2351 -3007 3831 27507 27561 23176 8870 2709
11521 2709 -17508 -3062 1455 -26908 -36784 -44422 -35535 -20218 -18485 -26752 -19953 -26740 -29549 -12486
$$ packed form
11611C7554m601j4483j270K1246K2106k2060q177j9869o940O156K2026k1347P62
11598A1103M741J2092K0342O0008L6598K5155J1907L0244M4669N1873J08107J56927
11586E73766J55442R3867L3817o1151r6445j02815j32182j15951p0863n9533K0198
11575B38150N887k9988n970r026j5512n0264j9388j9036j2615J0665J7568j5301
11563I5170j3931P7j7174p392k93p125K201n461n708J1530M721r76r565l7j682
11548D4355K2221J1431q978p32k4338l2078J3570K2184m062j9325k4976P6k272
11535b924j4738n208O617j66j1914J7641Q341o56O838K3676N4m385j4306o161
11521B709k0217J4446M517k8363r876p638Q887J5317J733q267O799o787k809J7063
$$ plain form
11507 -12486 -5511 13867 43947 61230 63779 36660 2288 -13634 -21880 -30492 -17800 -7830 11071
11494 11071 7689 -18736 -20123 -2448 6185 -8521 -13175 73 9678 14084 -6264 -17797 -27761
11481 -27761 -25544 -3959 817 2801 -2527 5640 12121 -448 -32869 -48145 -20133 -8931 -2221
11468 -2221 13151 27293 40860 38684 53594 48105 12236 22478 9729 -15739 -8754 23768
11456 23768 34764 24110 -20802 -23182 -28378 -44152 -31074 -32135 -51820 -40280 -38423 -26408
11444 -26408 698 31571 31286 6449 9743 25739 58547 58190 42018 34436 9480 -2849 17467
11431 17467 -346 -17671 -21031 10831 34487 46236 44674 25462 24245 15199 12544 17333 10219
11418 10219 30395 33188 24916 -1340 -21265 -6569 -5284 -20938 -30703 -41737 -29074 6111
$$ packed form
11507a2486O975J9378L0080J7283K549k7119l4372j5922q246q612J2692R970J8901
11494A1071l382k6425j387J7675Q633j4706m654J3248R605M406k0348j1533r964
11481b7761K217K1585M776J984n328Q167O481j2569l2421j5276K8012J1202O710
11468b221J5372J4142J3567k176J4910n489l5869J0242j2749k5468O985L2522
11456B3768J0996j0654m4912k380n196j5774J3078j061j9685J1540J857J2015
11444b6408K7106L0873k85k4837L294J5996L2808l57j6172p582k4956j2329K0316
11431A7467j7813j7325l360L1862K3656J1749j562j9212j217r046k655M789p114
11418A0219K0176K793q272k6256j9925J4696J285j5654r765j1034J2663L5185
$$ plain form
11406 6111 19872 57563 77019 73718 96889 137342 137707 127005 114704 102204 79469 65468
11394 65468 30118 37873 60094 50452 36560 13295 20926 6995 -20844 -3601 7450 -13672
11382 -13672 -19690 -23497 -36824 -29253 -9245 5564 26555 41313 47238 75797 91412 93090 126717
11369 126717 160913 125063 75867 48064 7311 13241 55272 71141 50606 42220 12753 4702
11357 4702 17366 34796 22478 2226 -11130 -3546 17188 33785 20505 30168 58469 78696
11345 78696 24486 8672 15342 13280 5394 -1232 26550 5482 -30243 -15169 18496 45369
11333 45369 47393 34875 31179 22198 -12740 -15617 2039 38399 45891 24720 -7925 -25882 -47336
11320 -47336 -25833 2119 -4664 1732 10544 11491 11319 15028 24505 33375 37504 43973 31266 26171
$$ packed form
11406F111J3761L7691J9456l301K3171M0453L65j0702j2301j2500k2735j4001
11394F5468l5350P755K2221r642j3892k3265P631j3931k7839J7243J1051k1122
11382a3672o018l807j3327P571K0008J4809K0991J4758N925K8559J5615J678L3627
11369A26717L4196l5850m9196k7803m0753N930M2031J5869k0535q386k9467q051
11357D702J2664J7430j2318k0252j3356P584K0734J6597j3280R663K8301K0227
11345G8696n4210j5814O670k062p886o626K7782k1068l5725J5074L3665K6873
11333D5369K024j2518l696q981l4938k877J7656L6360P492k1171l2645j7957k1454
11320d7336K1503K7952o783O396Q812R47j72L709R477Q870M129O469j2707n095
$$ plain form
11306 26171 16747 -5130 452 15717 12307 -7721 5205 35537 38395 21310 35762 64328
11294 64328 41643 13686 37285 55938 18711 -3913 -19725 -6619 10652 14043 28365 15815
11282 15815 -11875 -26267 -10469 5578 15774 39480 62492 41724 10778 6149 -2025 -15234
11270 -15234 -1928 32113 32216 31036 30609 38842 49246 51597 60341 42851 37536 16030 -20745
11257 -20745 14138 17621 10141 3411 5510 12980 -3643 -17696 -19020 -9271 14383 26382 11655
11244 11655 -10112 -3010 25715 25803 15330 -754 -7539 -24749 -13800 -6490 5258 11562 3464
11231 3464 -17524 11157 30349 11320 6296 12607 8780 6628 11913 783 -24167 -4463 11316
11218 11316 3771 -10287 -28254 -8611 -8242 15946 16322 14961 4784 -5815 8566 8940 6400
$$ packed form
11306B6171r424k1877N582J5265l410k0028J2926L0332K858j7085J4452K8566
11294F4328k2685k7957K3599J8653l7227k2624j5812J3106J7271L391J4322j2550
11282A5815k7690j4392J5798J6047J0196K3706K3012k0768l0946m629q174j3209
11270a5234J3306L4041J03j180m27Q233J0404K351Q744j7490n315k1506l6775
11257b0745L4883L483p480o730K099P470j6623j4053j324R749K3654J1999j4727
11244A1655k1767P102K8725Q8j0473j6084o785j7210J0949P310J1748O304q098
11231C464k0988K8681J9192j9029n024O311l827k152N285j1130k4950J9704J5779
11218A1316p545j4058j7967J9643L69K4188L76j361j0177j0599J4381L74k540
$$ plain form
11205 6400 19512 39227 32030 22977 35976 21288 8259 22673 31428 37403 28498 22683 33114
11192 33114 20364 25083 14895 -6415 19204 49293 20188 20278 29678 13325 7962 15733 14582
11179 14582 675 -5369 -24885 -29192 -10390 -7767 -10564 2039 9248 10855 16117 18031 11756
11166 11756 31134 22634 -17812 -6584 -1806 -12212 -36574 -44208 -20004 2543 41115 54475
11154 54475 63228 59985 28429 11579 22855 26967 14786 14974 30026 50254 49823 31665 40197
11141 40197 41495 14222 5658 18837 17084 8622 19530 33675 44315 36426 38139 18647 11714
11128 11714 -627 1005 4880 -607 4815 20974 21575 13266 14642 12469 9130 26613 58644 81850
11114 81850 76224 70710 106903 122497 166254 195175 197183 169361 140147 124435 109736 101859
$$ packed form
11205F400J3112J9715p197r053J2999j4688j3029J4414Q755N975q905n815J0431
11192C3114j2750M719j0188k1310K5619L0089k9105R0R400j6353n363P771j151
11179A4582j3907o044j9516m307J8802K623k797J2603P209J607N262J914o275
11166A1756J9378q500m0446J1228M778j0406k4362p634K4204K2547L8572J3360
11154E4475Q753l243l1556j6850J1276M112j2181J88J5052K0228m31j8158Q532
11141D0197J298k7273q564J3179j753q462J0908J4145J0640p889J713j9492o933
11128A1714j2341J632L875n487N422J6159O01q309J376k173l339J7483L2031K3206
11114H1850n626n514L6193J5594M3757K8921K008k7822k9214j5712j4699p877
$$ plain form
11102 101859 74310 50941 39979 13641 24044 38643 9489 14742 58814 66555 62682 73366
11090 73366 88976 73179 52366 37311 42992 60475 69006 84667 114446 139836 186572 230830
11078 230830 216704 199857 177738 121668 75430 63650 39489 12587 30529 57673 48442 20023
11066 20023 28146 15178 -1491 22892 24786 12980 -2356 -37652 -29358 -28059 -12476 27006
11054 27006 30933 28568 42691 34092 43057 63919 70351 61077 19651 16184 15900 -9143 15890
11041 15890 34284 35488 46501 59056 55283 44323 34711 46455 65048 68522 61173 59717 67606
11028 67606 48504 13664 17311 44571 72960 101706 121353 125155 139779 166782 206272 256829
11016 256829 309602 392990 498913 647884 887549 1225571 1608258 1875059 1885388 1604338
$$ packed form
11102A01859k7549k3369j0962k6338J0403J4599k9154N253M4072P741l873J0684
11090G3366J5610j5797k0813j5055N681J7483Q531J5661K9779K5390M6736M4258
11078B30830j4126j6847k2119n6070m6238j1780k4161k6902J7942K7144r231k8419
11066B0023Q123j2968j6669K4383J894j1806j5336l5296Q294J299J5583L9482
11054B7006L927k365J4123q599Q965K0862O432r274m1426l467k84k5043K5033
11041A5890J8394J204J1013J2555l773j0960r612J1744J8593L474p349j456P889
11028F7606j9102l4840L647K7260K8389K8746J9647L802J4624K7003L9490N0557
11016B56829N2773Q3388J05923J48971K39665L38022L82687K66801J0329k81050
$$ plain form
11006 1604338 1238360 940793 729382 585108 493162 430296 354491 278897 235174 214272
10996 214272 191510 184516 192462 209781 207848 193773 167769 138692 115404 65235 66939 58449
10984 58449 36027 38406 50133 72052 76534 38490 31071 38718 40199 40176 33473 29275 23078 27755
10970 27755 83135 68344 58739 62508 58541 68527 71592 59868 43969 23370 31240 48565 47577
10957 47577 27791 15383 -5492 -27925 -18275 -4852 17413 2841 -23389 -26477 13629 30549
10945 30549 31679 24587 39578 53683 28193 30746 28248 76040 70438 12361 13116 35141 55494
10932 55494 52361 21195 17033 38884 40433 15023 14064 21131 16122 19768 34737 39267 67815
10919 67815 41586 17791 33374 55727 56982 48006 68393 78735 43191 17961 22544 38569
$$ packed form
11006A604338l65978k97567k11411j44274r1946o2866p5805p5594m3723k0902
10996B14272k2762o994P946J7319j933j4075k6004k9077k3288n0169J704q490
10984E8449k2422K379J1727K1919M482l8044p419P647J481k3o703m198o197M677
10970B7755N5380j4791r605L769l967R986L065j1724j5899k0599P870J7325r88
10957D7577j9786j2408k0875k2433R650J3423K2265j4572k6230l088M0106J6920
10945C0549J130p092J4991J4105k5490K553k498M7792n602n8077P55K2025K0353
10932E5494l133l1166m162K1851J549k5410r59P067n009L646J4969M530K8548
10919F7815k6229k3795J5583K2353J255q976K0387J0342l5544k5230M583J6025
$$ plain form
10907 38569 23359 -22523 -23766 -32670 -36977 -59067 -46114 -24582 -14202 8450 43371 33218
10895 33218 22462 43295 63294 65997 49421 47436 68250 62768 87835 111605 93101 90197
10883 90197 67735 53076 42661 24612 39234 20394 12024 39408 53109 46773 45571 50485
10871 50485 39868 29366 -8072 -30149 4656 5425 3325 53681 81180 77881 84814 101720 100308
10858 100308 67745 60973 67262 79849 81317 76605 93255 105717 101092 105641 98827 95692 67882
10845 67882 84245 120121 138200 128144 131222 165212 181104 185254 154116 138294 142564 141837 137512
10832 137512 124682 101751 81973 83744 66382 69496 77525 81009 61580 67929 61264 58955 63135
10819 63135 41965 67653 107581 124191 115629 129058 128383 122058 88974 99625 132199 127789 95942
$$ packed form
10907C8569j5210m5882j243q904m307k2090J2953K1532J0380K2652L4921j0153
10895C3218j0756K0833J9999K703j6576j985K0814n482K5067K3770j8504k904
10883I0197k2462j4659j0415j8049J4622j8840q370K7384J3701o336j202M914
10871E0485j0617j0502l7438k2077L4805P69k100N0356K7499l299O933J6906j412
10858A00308l2563o772O289J2587J468m712J6650J2462m625M549o814l135k7810
10845F7882J6363L5876J8079j0056L078L3990J5892M150l1138j5822M270p27m325
10832A37512j2830k2931j9778J771j7362L114Q029L484j9429O349o665k309M180
10819F3135k1170K5688L9928J6610q562J3429o75o325l3084J0651L2574m410l1847
$$ plain form
10806 95942 109327 114201 86938 105851 102634 122105 114505 99439 88465 81251 94732 110746
10794 110746 105667 102533 101949 119457 134283 151626 120065 118748 103936 77007 40933 -10414
10782 -10414 -30552 -41961 -75161 -70008 -43268 7590 32119 26387 30549 56885 46312 17265
10770 17265 25997 51754 63002 38039 24170 36178 39645 22294 4506 -1488 -28398 -19155
10758 -19155 11041 10304 41606 60047 61231 58740 79995 99018 114129 130720 88937 69090
10746 69090 69616 47501 9398 -47177 -63174 -37371 -10037 11434 12650 5090 -2859 -18904 -7177
10733 -7177 6406 31671 37592 39994 49618 40080 59858 58024 47341 56406 35179 25323 32437
10720 32437 49439 98715 201185 342023 435322 525339 591421 638328 640321 575333 484319
$$ packed form
10806I5942J3385M874k7263J8913l217J9471p600j5066j0974p214J3481J6014
10794A10746n079l134n84J7508J4826J7343l1561j317j4812k6929l6074n1347
10782a0414k0138j1409l3200N153K6740N0858K4529n732M162K6336j0573k9047
10770A7265Q732K5757J1248k4963j3869J2008L467j7351j7788n994k6910R243
10758a9155L0196p37L1302J8441J184k491K1255J9023J5111J6591m1783j9847
10746F9090N26k2115l8103n6575j5997K5803K7334K1471J216p560p949j6045J1727
10733g177J3583K5265N921K402R624r538J9778j834j0683R065k1227r856P114
10720C2437J7002M9276J02470J40838R3299R0017O6082M6907J993o4988r1014
$$ plain form
10709 484319 411802 370655 368830 384996 374466 372647 348208 336202 352301 361746 374502 401529
10697 401529 411570 430328 440531 431042 411553 409767 410929 417612 434927 430021 469058 493479
10685 493479 486431 491399 455365 441982 473734 502850 511957 533171 554772 535853 510319 522736
10673 522736 576527 601946 592472 587636 567795 527624 505953 528217 542107 526861 486695 494218
10661 494218 482602 451423 439257 421721 412483 387828 373452 420274 461937 499527 503560 525147
10649 525147 567466 603494 654824 691323 723319 775892 829844 876686 899648 903199 938035 1009349
10637 1009349 1039081 1025673 1007847 993307 1012981 1089893 1163631 1230109 1285263 1354212 1439892
10626 1439892 1517218 1610161 1710555 1798567 1921961 2091375 2302080 2561144 2797000 3069311
$$ packed form
10709D84319p2517m1147j825J6166j0530j819k4439j2006J6099R445J2756K7027
10697D01529J0041J8758J0203r489j9489j786J162O683J7315m906L9037K4421
10685D93479p048M968l6034j3383L1752K9116R107K1214K1601j8919k5534J2417
10673E22736N3791K5419r474m836j9841m0171k1671K2264J3890j5246m0166P523
10661D94218j1616l1179j2166j7536r238k4655j4376M6822M1663L7590M033K1587
10649E25147M2319L6028N1330L6499L1996N2573N3952M6842K2962L551L4836P1314
10637A009349K9732j3408j7826j4540J9674P6912P3738O6478N5154O8949Q5680
10626A439892P7326R2943J00394Q8012J23394J69414K10705K59064K35856K72311
$$ plain form
10616 3069311 3381008 3691178 4032372 4420535 4876082 5416495 6096879 6905558 7782474
10607 7782474 8769129 9719662 10545548 11342365 12371928 13843139 15813207 18357121 21604830
10598 21604830 25850164 31612884 39661907 51073655 67521129 91575494 127103623
10591 127103623 178863482 248501657 324573258 372488812 355566208 286790724 213965471
10584 213965471 160774559 125543440 101959734 85610577 73769158 64829931 57920042
10577 57920042 52623324 48676739 45599710 42663053 39494845 36193965 33071436 30234749
10569 30234749 27547887 24864149 22276156 19940952 17904368 16131948 14583294 13217465
10561 13217465 12026911 11010277 10149712 9406530 8747885 8175054 7627883 7096502 6586014
$$ packed form
10616C069311L11697L10170L41194L88163M55547N40413O80384Q08679Q76916
10607G782474R86655R50533Q25886P96817J029563J471211J970068K543914L247709
10598B1604830M245334N762720Q049023J1411748J6447474K4054365L5528129
10591A27103623N1759859O9638175P6071601M7915554j6922604o8775484p2825253
10584B13965471n3190912l5231119k3583706j6349157j1841419q939227o909889
10577E7920042n296718l946585l077029k936657l168208l300880l122529k836687
10569C0234749k686862k683738k587993k335204k036584j772420j548654j365829
10561A3217465j190554j016634q60565p43182o58645n72831n47171n31381n10488
$$ plain form
10552 6586014 6123914 5730931 5368143 5045450 4767820 4469219 4166851 3898864 3637337
10543 3637337 3366876 3126177 2897108 2657091 2473188 2301395 2123268 1946694 1841431
10534 1841431 1742009 1656662 1601126 1534224 1473416 1445010 1402275 1379050 1351188 1333089 1325035
10523 1325035 1314487 1325502 1363173 1437194 1540914 1690372 1908490 2092202 2104464 1940265
10513 1940265 1646922 1411447 1248449 1134884 1087582 1026164 959913 895744 873068 872977 856738
10502 856738 818846 759327 715472 715637 703465 696593 653760 627325 617330 594679 555443 518568
10490 518568 453756 456266 465603 474496 478336 488737 479905 457382 402231 358010 342204 340225 338230
10477 338230 343853 349694 346178 358901 354610 360568 343059 337582 359835 408291 442521 437224 434782
$$ packed form
10552F586014m62100l92983l62788l22693k77630k98601l02368k67987k61527
10543C637337k70461k40699k29069k40017j83903j71793j78127j76574j05263
10534A841431r9422q5347n5536o6902o0808k8406m2735k3225k7862j8099q054
10523A325035j0548J1015L7671P4021J03720J49458K18118J83712J2262j64199
10513A940265k93343k35475j62998j13565m7302o1418o6251o4169k2676r1j6239
10502H56738l7892n9519m3855J65j2172o872m2833k6435r995k2651l9236l6875
10490E18568o4812K510R337Q893L840J0401q832k2523n5151m4221j5806j979j995
10477C38230N623N841l516J2723m291N958j7509n477K2253M8456L4230n297k442
$$ plain form
10464 434782 420158 440498 467166 536603 611869 715747 785235 818520 829376 804502 768831
10453 768831 704175 617290 572322 569531 562716 541609 536149 537896 576391 613496 641955 656442
10441 656442 666491 618326 550885 542914 543260 561113 590439 607877 587950 553284 527449 496358
10429 496358 440883 432162 437230 393667 372675 403498 409910 403246 399417 414861 394281 378384
10417 378384 383794 380501 364106 372656 395333 401498 393167 401430 405495 397244 424714 454518 471535
10404 471535 501749 506524 556900 678324 832439 984165 1199109 1485340 1813060 2139136
10394 2139136 2456235 2631754 2588213 2315147 1982426 1650527 1352663 1122379 980973 888172
10384 888172 775004 689597 632589 593429 554433 515886 468556 453257 433094 436364 379827
$$ packed form
10464D34782j4624K0340K6668O9437P5266J03878O9488L3285J0856k4874l5671
10453G68831o4656q6885m4968k791o815k1107n460J747L8495L7105K8459J4487
10441F56442J0049m8165o7441p971L46J7853K9326J7438j9927l4666k5835l1091
10429D96358n5475q721N068m3563k0992L0823O412o664l829J5444k0580j5897
10417C78384N410l293j6395Q550K2677O165q331Q263M065q251K7470K9804J7017
10404D71535L0214M775N0376J21424J54115J51726K14944K86231L27720L26076
10394B139136L17099J75519m3541k73066l32721l31899k97864k30284j41406r2801
10384H88172j13168q5407n7008l9160l8996l8547m7330j5299k0163L270n6537
$$ plain form
10373 379827 316611 284200 266932 237408 206885 182486 165881 157691 158245 194401 185699 184159
10361 184159 167079 158526 161003 142701 156935 166991 163692 179605 200415 197683 183696 186889
10349 186889 173840 180252 185583 217569 252622 273159 301622 314930 357330 463276 571577
10338 571577 688573 896923 1173339 1536918 1893396 2118687 2108459 1855822 1504264 1188150
10328 1188150 970693 803015 658466 563468 507095 469599 448852 441914 439431 421972 378706
10317 378706 332539 337759 309509 279111 242619 218063 208883 224400 235740 227528 213316 224887
10305 224887 225906 203593 191272 168375 158463 175655 170953 165180 166395 158118 155555 153728 168885
10292 168885 152423 119830 115036 147443 168177 161662 138338 110853 75075 65485 72003 98117
$$ packed form
10373C79827o3216l2411j7268k9524l0523k4399j6605q190N54L6156q702j540
10361A84159j7080q553K477j8302J4234J0056l299J5913K0810k732j3987L193
10349A86889j3049O412N331L1986L5053K0537K8463J3308M2400J05946J08301
10338E71577J16996K08350K76416L63579L56478K25291j0228k52637l51558l16114
10328A188150k17457j67678j44549r4998n6373l7496k0747o938k483j7459m3266
10317C78706m6167N220k8250l0398l6492k4556r180J5517J1340q212j4212J1571
10305B24887J019k2313j2321k2897r912J7192m702n773J215q277k563j827J5157
10292A68885j6462l2593m794L2407K0734o515k3324k7485l5778r590O518K6114
$$ plain form
10280 98117 109101 114522 98297 92460 121939 131512 139320 145033 145168 133491 109376 92357 115979
10267 115979 120105 79537 65326 88186 99979 95297 80339 98154 86677 64064 77692 80827
10255 80827 88471 120466 112919 77851 54305 74557 81956 84068 71387 68128 66156 50240 46636
10242 46636 45020 32005 14478 6972 20664 46733 40035 35555 44654 50871 85718 76338 61197
10229 61197 88674 82585 52218 85296 125460 117265 83754 78984 66282 67696 92152 100985 76314
10216 76314 53371 51168 59689 42579 25993 24249 22964 23162 46925 54172 79281 60712 28042
10203 28042 37515 48246 49173 36782 50515 66693 66797 58478 55895 52596 42051 68328 114590
10190 114590 98244 80178 86475 98865 91032 63774 51076 46311 81576 119999 120000 139138 123477
$$ packed form
10280I8117J0984N421j6225n837K9479R573P808N713J35j1677k4115j7019K3622
10267A15979M126m0568j4211K2860J1793m682j4958J7815j1477k2613J3628L135
10255H0827P644L1995p547l5068k3546K0252P399K112j2681l259j972j5916l604
10242D6636j616j3015j7527p506J3692K6069o698m480R099O217L4847r380j5141
10229F1197K7477o089l0367L3078M0164q195l3511m770j2702J414K4456Q833k4671
10216G6314k2943k203Q521j7110j6586j744j285J98K3763P247K5109j8569l2670
10203B8042R473J0731R27j2391J3733J6178J04q319k583l299j0545K6277M6262
10190A14590j6346j8066O297J2390p833k7258j2698m765L5265L8423JJ9138j5661
$$ plain form
10177 123477 117549 141367 140625 138592 129082 153521 175686 207958 271529 314239 374087 478327
10165 478327 648727 911037 1296650 1679973 1955241 1915715 1573358 1189319 903876 731072
10155 731072 635105 539772 463066 409159 374667 354640 314101 268672 245756 272637 250535
10144 250535 225994 215909 212442 209650 190120 156576 150028 134726 122331 120061 96478 106860
10132 106860 114863 104485 60089 37486 65727 70007 77152 75099 82081 92491 94985 106420 106772
10119 106772 117218 101440 76246 73339 77438 64739 51402 62183 56711 65519 58347 60159 64128
10106 64128 67351 69025 65302 45515 23786 19313 -1291 8139 14595 31015 55543 65044 60227
10093 60227 34869 35853 50574 55787 51424 50200 49090 41902 34372 28946 29250 24187 18896 32997
$$ packed form
10177A23477n928K3818p42k033r510K4439K2165L2272O3571M2710N9848J04240
10165D78327J70400K62310L85613L83323K75268l9526l42357l84039k85443j72804
10155G31072r5967r5333p6706n3907l4492k0027m0539m5429k2916K6881k2102
10144B50535k4541j0085l467k792j9530l3544o548j5302j2395k270k3583J0382
10132A06860Q003j0378m4396k2603K8241M280P145k053O982J0410K494J1435L52
10119A06772J0446j5778k5194k907M099j2699j3337J0781n472Q808p172J812L969
10106F4128L223J674l723j9787k1729m473k0604R430O456J6420K4528R501m817
10093F0227k5358R84J4721N213m363j224j110p188p530n426L04n063n291J4101
$$ plain form
10079 32997 29009 36482 49001 30922 50798 36560 31926 41708 72922 41105 -2082 4350 14893
10066 14893 14364 22761 31860 2720 17232 61618 66838 48413 32291 33769 43520 52709 47956
10053 47956 52580 45036 43951 28068 21723 29271 57192 69649 63849 58113 74927 101740 151995
10040 151995 206341 192921 164116 125386 98476 83367 87347 82317 74471 35681 -3198 -30120
10028 -30120 -15203 11827 9580 2142 12689 17966 12929 26972 21012 13490 24832 29525 58394
10015 58394 68755 73377 79193 79289 57856 46638 43093 49939 35043 13085 20809 22808 46965
10002 46965 48139 48081 40524 29546 22450 23186 10816 538 -1924 15078 29394 22931 889 -5559
9988 -5559 -6962 -34150 -41293 -42428 -25299 -9392 -7164 9796 24575 59629 62957 48709 42796
$$ packed form
10079C2997l988P473J2519j8079J9876j4238m634R782L1214l1817m3187O432J0543
10066A4893n29Q397R099k9140J4512M4386N220j8425j6122J478R751R189m753
10053D7956M624p544j085j5883o345P548K7921J2457n800n736J6814K6813N0255
10040A51995N4346j3420k8805l8730k6910j5109L980n030p846l8790l8879k6922
10028c0120J4917K7030k247p438J0547N277n037J4043n960p522J1342M693K8869
10015E8394J0361M622N816R6k1433j1218l545O846j4896k1958P724J999K4157
10002D6965J174n8p557j0978p096P36j2370j0278k462J7002J4316o463k2042o448
9988e559j403k7188p143j135J7129J5907K228J6960J4779L5054L328j4248n913
$$ plain form
9975 42796 31216 57905 61914 29426 16882 54508 90735 61752 15167 35753 52241 33980
9963 33980 19949 13068 23476 39675 50535 76976 87025 67857 62886 78850 66083 49606
9951 49606 50864 62640 35815 17158 2204 -13570 10077 29210 14914 25963 62248 64361
9939 64361 64974 52817 21550 1066 -7894 13140 46862 42266 31475 17348 -18482 -18469 -30353
9926 -30353 -28800 -25725 -34350 3754 38548 43289 41814 36412 13083 1061 12853 22016 12595
9913 12595 35594 53578 48478 23456 12616 21375 19087 18581 32749 47718 49261 43687 43653 48664
9899 48664 73373 50168 14112 -7891 7184 29138 14152 27235 35122 25679 -7014 -12032
9887 -12032 30558 61634 71209 68620 62599 50080 22979 13197 11477 34616 41873 9464 -5107
$$ packed form
9975D2796j1580K6689M009l2488j2544L7626L6227k8983m6585K0586J6488j8261
9963C3980j4031o881J0408J6199J0860K6441J0049j9168m971J5964j2767j6477
9951D9606J258J1776k6825j8657j4954j5774K3647J9133j4296J1049L6285K113
9939F4361O13j2157l1267k0484q960K1034L3722m596j0791j4127l5830J3j1884
9926c0353J553L075q625L8104L4794M741j475n402k3329j2022J1792R163r421
9913A2595K2999J7984n100k5022j0840Q759k288n06J4168J4969J543n574l4N011
9899D8664K4709k3205l6056k2003J5075K1954j4986J3083P887r443l2693n018
9887a2032M2590L1076R575k589o021j2519k7101r782j720K3139P257l2409j4571
$$ plain form
9874 -5107 -6013 23824 58734 33207 -11794 -30780 1679 29712 27105 18033 35020 46038 47477
9861 47477 52414 57860 42449 21805 19631 17770 7690 14178 35113 51014 54974 41786 23254
9848 23254 49012 73325 60658 30787 20685 42671 22202 8925 8942 -8679 8071 18105
9836 18105 9506 -10411 -10605 5714 27424 -136 -4851 1759 832 -20895 -32670 -22456 11469
9823 11469 46209 71277 85225 66812 58669 44096 19544 33743 26861 32392 23846 25984 60198
9810 60198 59972 49899 34654 7249 -1923 -6334 -8172 4768 14476 -1632 -20458 -22385 -22336 -35570
9796 -35570 -20235 9422 12782 49925 68481 70846 58504 46076 32836 49839 75964 73247
9784 73247 91144 77073 72461 59779 34797 5949 -5311 -15702 -22268 -30190 -7066 13497
$$ packed form
9874e107r06K9837L4910k5527m5001j8986L2459K8033k607r072J6987J1018J439
9861D7477M937N446j5411k0644k174j861j0080O488K0935J5901L960j3188j8532
9848B3254K5758K4313j2667k9871j0102K1986k0469j3277J7j7621J6750J0034
9836A8105q599j9917j94J6319K1710k7560m715O610r27k1727j1775J0214L3925
9823A1469L4740K5068J3948j8413q143j4573k4552J4199o882N531q546K138L4214
9810F0198k26j0073j5245k7405r172m411j838J2940R708j6108j8826j927M9j3234
9796c5570J5335K9657L360L7143J8556K365j2342j2428j3240J7003K6125k717
9784G3247J7897j4071m612j2682k4982k8848j1260j0391o566p922K3124K0563
$$ plain form
9772 13497 10636 2927 17844 21422 28306 16602 21318 21040 2721 -17926 -40752 -31909 -8202
9759 -8202 17319 18313 9925 18998 37640 15890 20969 22133 21099 30556 20860 8402 35006 40264
9745 40264 31198 16239 7393 418 4320 9127 7076 16012 13681 8630 40759 37339 63835 55986
9731 55986 21827 11631 23642 6507 -9270 -11021 -17480 3064 -18743 -10128 -16094 -9802 8288
9718 8288 28057 34062 30840 40271 27365 6751 1808 -13763 -26298 -16310 1261 11386 17254
9705 17254 567 -2181 11237 20334 26138 -4244 -7206 -1250 11947 21946 19272 18122 11004 20222
9691 20222 3761 -10174 1231 24973 25225 33688 35566 19394 -7370 19258 35270 23533 21355
9678 21355 22403 28728 34101 38827 32289 47266 51254 21833 19788 16071 29537 28603 9011 2465
$$ packed form
9772A3497k861p709J4917L578O884j1704M716k78j8319k0647k2826Q843K3707
9759h202K5521R94q388R073J8642k1750N079J164j034R457r696j2458K6604N258
9745D0264r066j4959q846o975L902M807k051Q936k331n051L2129l420K6496p849
9731E5986l4159j0196J2011j7135j5777j751o459K0544k1807Q615n966O292J8090
9718H288J9769O005l222R431j2906k0614m943j5571j2535R988J7571J0125N868
9705A7254j6687k748J3418R097N804l0382k962N956J3197R999k674j150p118R218
9691B0222j6461j3935J1405K3742K52Q463J878j6172k6764K6628J6012j1737k178
9678B1355J048O325N373M726o538J4977L988k9421k045l717J3466r34j9592o546
$$ plain form
9664 2465 5239 9612 -28969 -32208 1992 24887 39099 44496 26262 15313 23845 31376 34957
9651 34957 57381 85217 70359 40511 32641 35446 11357 40825 63788 49986 23101 -5658
9639 -5658 -3092 6939 -11587 4198 3148 -8347 -11577 -10928 -5091 -4476 -18720 -42675 -33175 -18125
9625 -18125 -18659 -18685 218 16747 24806 50661 49748 44439 33012 19191 31595 26198 38799 22653
9611 22653 8510 18162 44920 27694 24718 37341 25585 30595 24341 36081 26552 25549 51014
9598 51014 55916 36673 -1919 -15099 2828 28539 55994 65077 64802 30971 30328 35122 40422
9585 40422 49453 43176 50312 35305 31628 42083 43665 71926 57114 57146 57600 72022 86133 102318
9571 102318 110394 95864 57574 44976 45081 49887 30156 50725 57851 57277 57770 53998 46464 59885
$$ packed form
9664B465K774M373l8581l239L4200K2895J4212N397j8234j0949Q532P531L581
9651C4957K2424K7836j4858k9848p870K805k4089K9468K2963j3802k6885k8759
9639e658K566J0031j8526J5785j050j1495l230O49N837O15j4244k3955R500J5050
9625a8125n34k6J8903J6529Q059K5855r13n309j1427j3821J2404n397J2601j6146
9611B2653j4143R652K6758j7226k976J2623j1756N010o254J1740r529j003K5465
9598E1014M902j9243l8592j3180J7927K5711K7455R083k75l3831o43M794N300
9585D0422R031o277P136j5007l677J0455J582K8261j4812L2M54J4422J4111J6185
9571A02318Q076j4530l8290j2598J05M806j9731K0569P126n74M93l772p534J3421
$$ plain form
9557 59885 62242 64862 51348 31160 31894 49117 82290 90316 113748 119575 106427 64750 35014
9544 35014 31971 40362 25577 28611 34918 36192 31911 43539 41800 22388 -3215 -2658 -6563 -18617
9530 -18617 -18322 -3131 21192 49994 50849 60041 55185 49625 41748 33938 13368 16557 27373 48445
9516 48445 58794 68111 57893 32056 41207 88626 87025 91170 104353 109667 78971 64099 54049
9503 54049 31593 22112 30623 74901 86042 82921 58006 49797 37252 25462 24047 36393 53576
9490 53576 66188 101318 120940 87924 76608 59586 82069 111575 103325 77372 82432 91898
9478 91898 60777 30361 22363 31318 18871 13951 36515 38474 21254 30730 46979 34348 33794
9465 33794 41420 43043 50444 58902 72912 90099 93449 98141 85545 87896 107894 135627 147454
$$ packed form
9557E9885K357K620j3514k0188P34J7223L3173Q026K3432N827j3148m1677k9736
9544C5014l043Q391j4785L034O307J274m281J1628j739j9412k5603N57l905j2054
9530a8617K95J5191K4323K8802Q55R192m856n560p877p810k0570L189J0816K1072
9516D8445J0349R317j0218k5837R151M7419j601M145J3183N314l0696j4872j0050
9503E4049k2456r481Q511M4278J1141l121k4915q209j2545j1790j415J2346J7183
9490E3576J2612L5130J9622l3016j1316j7022K2483K9506q250k5953N060R466
9478I1898l1121l0416p998Q955j2447m920K2564J959j7220R476J6249j2631n54
9465C3794P626J623P401Q458J4010J7187L350M692j2596K351J9998K7733J1827
$$ plain form
9452 147454 139404 126711 126096 145168 154755 134679 107623 88614 84146 55834 37625 53886 54276
9439 54276 61321 69223 65974 46347 48728 45155 48832 58716 60684 70944 69628 57657 45313 58409
9425 58409 76738 94268 77655 66685 75970 94535 119854 106839 73322 90121 104689 98040
9413 98040 56669 90770 99656 107983 80313 87837 98567 100799 98126 127977 152243 150382 131873
9400 131873 120957 131169 130871 135591 122280 88546 76462 76415 64268 65622 82487 87800 81859
9387 81859 105339 109489 102211 85143 76737 96414 110428 118597 99493 77685 96823 96698 92913
9374 92913 92507 116079 137033 131367 139039 142665 107871 92590 87765 95234 104329 104150 137501 138697
9360 138697 115532 101203 126922 148558 159365 162716 162711 178018 166353 152685 155155 159843 166784
$$ packed form
9452A47454q050j2693o15J9072R587k0076k7056j9009m468k8312j8209J6261L90
9439E4276P045P902l249j9627K381l573L677R884J968J0260j316j1971j2344J3096
9425E8409J8329J7530j6613j0970R285J8565K5319j3015l3517J6799J4568o649
9413I8040m1371L4101Q886Q327k7670P524J0730K232k673K9851K4266j861j8509
9400A31873j0916J0212k98M720j3311l3734j2084m7j2147J354J6865N313n941
9387H1859K3480M150p278j7068q406J9677J4014Q169j9104k1808J9138j25l785
9374I2913m06K3572K0954n666P672L626l4794j5281m825P469R095j79L3351J196
9360A38697k3165j4329K5719K1636J0807L351nJ5307j1665j3668K470M688O941
$$ plain form
9347 166784 162603 154153 158098 136231 132493 149573 150680 138916 163277 184670 179033 181048 183752
9334 183752 183124 175894 200088 186127 138459 141531 189614 212614 209496 209187 222199 254411 230262
9321 230262 209124 189428 196654 204392 227502 232596 224027 205495 205007 215624 231347 234792 226953
9308 226953 208546 214850 242745 257603 244681 268563 261310 249008 246182 265711 265435 262299 255542
9295 255542 246495 249784 245886 245485 276559 302347 332456 328779 291095 250787 239489 266334 274130
9282 274130 275359 284948 278700 266311 264119 256181 263528 273599 300424 287650 274447 307218 296036
9269 296036 307175 311501 305305 296394 284632 280667 303343 331372 352701 353470 363316 351088 339953
9256 339953 334160 365694 370096 354375 366010 393059 407600 379921 400948 406212 417225 409391
$$ packed form
9347A66784m181q450L945k1867l738J7080J107j1764K4361K1393n637K015K704
9334A83752o28p230K4194j3961m7668L072M8083K3000l118l09J3012L2212k4149
9321B30262k1138j9696P226P738K3110N094q569j8532m88J0617J5723L445p839
9308B26953j8407O304K7895J4858j2922K3882p253j2302k826J9529k76l136o757
9295B55542r047L289l898m01L1074K5788L0109l677l7684m0308j1298K6845P796
9282B74130J229R589o248j2389k192p938P347J0071K6825j2774j3203L2771j1182
9269B96036J1139M326o196q911j1762l965K2676K8029K1329P69R846j2228j1135
9256C39953n793L1534M402j5721J1635K7049J4541k7679K1027N264J1013p834
$$ plain form
9244 409391 397730 402979 415020 425574 442952 437997 428898 454745 474647 524402 535829 524319
9232 524319 532888 516092 512770 509912 533450 560234 580806 568095 544265 558916 584335 616920
9220 616920 605282 578037 586159 624809 640948 648578 668864 692383 687055 701114 720312 735563
9208 735563 744468 747549 754653 770355 785653 808740 854219 886878 896632 908277 933545 951538
9196 951538 979585 993713 1008453 970647 987061 984214 984362 1010296 1017344 1051718 1090013 1117578
9184 1117578 1152188 1167018 1175004 1201874 1216953 1231470 1218993 1249378 1307610 1321757 1371703 1403383
9172 1403383 1403522 1417715 1415583 1460935 1510987 1576229 1611420 1678518 1751183 1762469 1761102 1807391
9160 1807391 1845480 1883955 1927604 1957040 2028194 2104747 2172186 2238560 2286325 2331155 2411020
$$ packed form
9244D09391j1661N249J2041J0554J7378m955r099K5847J9902M9755J1427j1510
9232E24319Q569j6796l322k858K3538K6784K0572j2711k3830J4651K5419L2585
9220F16920j1638k7245Q122L8650J6139P630K0286K3519n328J4059J9198J5251
9208G35563Q905L081P104J5702J5298K3087M5479L2659R754J1645K5268J7993
9196I51538K8047J4128J4740l7806J6414k847J48K5934P048L4374L8295K7565
9184A117578L4610J4830P986K6870J5079J4517j2477L0385N8232J4147M9946L1680
9172A403383J39J4193k132M5352N0052O5242L5191O7098P2665J1286j367M6289
9160A807391L8089L8475M3649K9436P1154P6553O7439O6374M7765M4830P9865
$$ plain form
9149 2411020 2496706 2594693 2691622 2750587 2808779 2907795 3014372 3098136 3199633 3335916 3453594
9138 3453594 3555269 3687859 3806054 3940411 4080464 4244016 4417526 4581539 4765447 4967248
9128 4967248 5164241 5357413 5578097 5813698 6078621 6331576 6593862 6867503 7161760 7499170
9118 7499170 7835723 8169459 8528192 8926405 9380253 9843795 10305050 10803735 11344805 11903889
9108 11903889 12461019 13044381 13646770 14269193 14915444 15587706 16250069 16929341 17612698
9099 17612698 18282902 18940007 19513349 20108914 20663269 21155490 21551099 21863915 22107465
9090 22107465 22279903 22413435 22404692 22331858 22177487 21922984 21607071 21242374 20838932 20378699
9080 20378699 19858563 19325975 18764725 18157771 17571476 16978881 16395146 15796827 15199380
$$ packed form
9149B411020Q5686R7987R6929N8965N8192R9016J06577Q3764J01497J36283J17678
9138C453594J01675J32590J18195J34357J40053J63552J73510J64013J83908K01801
9128D967248J96993J93172K20684K35601K64923K52955K62286K73641K94257L37410
9118G499170L36553L33736L58733L98213M53848M63542M61255M98685N41070N59084
9108A1903889N57130N83362O02389O22423O46251O72262O62363O79272O83357
9099A7612698O70204O57105N73342N95565N54355M92221L95609L12816K43550
9090B2107465J72438J33532q743p2834j54371k54503l15913l64697m03442m60233
9080B0378699n20136n32588n61250o06954n86295n92595n83735n98319n97447
$$ plain form
9071 15199380 14626325 14063005 13501334 12967294 12491856 12020947 11537420 11078887 10638368
9062 10638368 10207291 9787669 9371679 8973195 8611334 8263145 7940713 7633053 7369101
9053 7369101 7063612 6753811 6499762 6248092 6003250 5751028 5545917 5376541 5199805 5015795
9043 5015795 4817675 4661882 4482491 4318427 4166282 4039578 3920101 3799368 3662857 3552640
9033 3552640 3441680 3323046 3221955 3091499 2977949 2874475 2786041 2706749 2649919 2596970
9023 2596970 2519795 2480539 2425543 2354486 2269519 2201889 2146034 2059907 1997055 1959705 1919661
9012 1919661 1880751 1868011 1811983 1739898 1716847 1683766 1660620 1620071 1583188 1530508 1501262
9001 1501262 1475441 1440514 1432769 1392390 1327837 1302544 1288188 1273540 1251700 1228880 1224899 1223879
$$ packed form
9071A5199380n73055n63320n61671n34040m75438m70909m83527m58533m40519
9062A0638368m31077m19622m15990l98484l61861l48189l22432l07660k63952
9053G369101l05489l09801k54049k51670k44842k52222k05111j69376j76736j84010
9043E015795j98120j55793j79391j64064j52145j26704j19477j20733j36511j10217
9033C552640j10960j18634j01091j30456j13550j03474q8434p9292n6830n2949
9023B596970p7175l9256n4996p1057q4967o7630n5855q6127o2852l7350m0044
9012A919661l8910j2740n6028p2085k3051l3081k3146m0549l6883n2680k9246
9001A501262k5821l4927p745m0379o4553k5293j4356j4648k1840k2820l981j020
$$ plain form
8989 1223879 1207239 1172937 1133005 1069295 1047219 1028659 1011809 1007728 990134 966621 956366 957616
8977 957616 933351 926611 944401 944206 877421 843171 843632 861352 831503 793970 751779 738372 748131
8964 748131 733624 740197 753824 743761 728506 742769 732355 727618 732650 730013 697995 683540
8952 683540 659619 629699 610411 632577 635756 624917 630643 635836 628140 609251 620717 621023 620788
8939 620788 623219 614068 600866 588617 579300 531277 531135 538021 538040 523669 505192 503561 493573 492942
8925 492942 505064 484893 471155 467749 477053 460707 468105 459240 441727 425212 410764 424642
8913 424642 424993 439536 454936 434463 419388 403407 410519 415712 403684 400635 383726 376932 366800
8900 366800 362120 333707 326481 324185 319475 337629 361978 345580 309692 288299 271076 275055 275583
$$ packed form
8989A223879j6640l4302l9932o3710k2076j8560j6850m081j7594k3513j0255J250
8977I57616k4265o740J7790j95o6785l4250M61J7720k9849l7533m2191j3407R759
8964G48131j4507O573J3627j0063j5255J4263j0414m737N032k637l2018j4455
8952F83540k3921k9920j9288K2166L179j0839N726N193p696j8889J1466L06k35
8939F20788K431r151j3202j2249r317m8023j42O886J9j4371j8477j631r988o31
8925D92942J2122k0171j3738l406R304j6346P398q865j7513j6515j4448J3878
8913D24642L51J4543J5400k0473j5075j5981P112N193j2028l049j6909o794j0132
8900C66800m680k8413p226k296m710J8154K4349j6398l5888k1393j7223L979N28
$$ plain form
8887 275583 273556 259870 242499 255264 246400 256672 241423 237029 266098 283407 286439 294734 297985
8874 297985 285869 289940 299752 285135 266235 238909 217673 224252 236751 234277 241229 219347 212297
8861 212297 228178 216799 210138 220065 215779 196915 195919 230699 223013 214803 209131 203115 211456 203905
8847 203905 200318 186310 169264 144265 146076 135784 156980 162678 193898 215964 232070 235502
8835 235502 215679 178890 190803 205761 226982 223976 199734 182001 188422 219353 213458 199210
8823 199210 189795 192645 183516 164260 154272 166852 165610 184748 201420 188409 177834 178742 172648
8810 172648 154425 115951 117716 119918 115101 137841 136150 115481 106120 87923 104904 122012 147001
8797 147001 140108 136912 129288 142235 171620 184251 181036 148321 147860 160845 147665 134521 107523
$$ packed form
8887B75583k027j3686j7371J2765q864J0272j5249m394K9069J7309L032Q295L251
8874B97985j2116M071R812j4617j8900k7326k1236O579J2499k474O952k1882p050
8861B12297J5881j1379o661R927m286j8864r96L4780p686q210n672o016Q341p551
8847B03905l587j4008j7046k4999J811j0292K1196N698L1220K2066J6106L432
8835B35502j9823l6789J1913J4958K1221l006k4242j7733O421L0931n895j4248
8823A99210r415K850r129j9256r988J2580j242J9138J6672j3011j0575R08o094
8810A72648j8223l8474J765K202m817K2740j691k0669r361j8197J6981J7108K4989
8797A47001o893l196p624J2947K9385J2631l215l2715m61J2985j3180j3144k6998
$$ plain form
8784 107523 92406 92629 79433 99918 124756 126249 126384 128210 142706 150637 141732 158339 158092 158954
8770 158954 149553 142357 100178 75110 57339 70664 78709 78133 85381 96571 136743 167185 151892
8757 151892 118606 105202 113686 88933 106287 114654 91419 84763 92199 88486 95399 108196 118192
8744 118192 108338 96876 104836 116221 101711 72519 71339 75063 77395 89185 101854 103271 93260
8731 93260 77713 65482 62125 52761 60239 76426 87792 127465 125176 78721 75517 75281 82372
8718 82372 78181 80814 84080 93882 63832 49107 79733 104181 119192 129525 143321 130795 113002
8705 113002 122260 107925 94792 91066 92733 97701 90698 74914 71759 78076 96182 107769 102868
8692 102868 97247 87924 88137 77715 77708 87310 80473 64958 70429 82353 81214 71972 112214 126224
$$ packed form
8784A07523j5117K23j3196K0485K4838J493J35J826J4496P931q905J6607k47Q62
8770A58954r401p196m2179k5068j7771J3325Q045n76P248J1190M0172L0442j5293
8757A51892l3286j3404Q484k4753J7354Q367k3235o656P436l713O913J2797R996
8744A18192r854j1462P960J1385j4510k9192j180L724K332J1790J2669J417j0011
8731I3260j5547j2231l357r364P478J6187J1366L9673k289m6455l204k36P091
8718H2372m191K633L266R802l0050j4725L0626K4448J5011J0333J3796j2526j7793
8705A13002R258j4335j3133l726J667M968p003j5784l155O317J8106J1587m901
8692A02868n621r323K13j0422pR602o837j5515N471J1924j139r242M0242J4010
$$ plain form
8678 126224 165146 171321 162748 147074 125724 121772 129182 108427 95705 80853 80239 85990 84908
8665 84908 77403 77462 64633 53843 68430 77869 106434 113209 117201 125817 97419 77174 93623
8652 93623 101530 91554 96563 97743 61022 33551 61971 45921 29553 13089 10209 28708 58784
8639 58784 73584 73358 70954 54383 50836 58678 59495 69547 72748 58077 48953 27060 25051 31237
8625 31237 48207 64581 54363 57888 69449 57638 49372 71815 73421 65063 46037 54149 93500
8612 93500 89314 76168 46967 48240 59768 53119 64906 70414 92430 120597 133852 104569 98532
8599 98532 108950 126832 152538 137902 109817 128934 139782 138895 130960 125967 132466 135987 132650
8586 132650 134956 121562 98465 85253 108656 125632 89243 74137 92863 95578 60961 28584
$$ packed form
8678A26224L8922O175q573j5674k1350l952P410k0755j2722j4852o14N751j082
8665H4908p505N9j2829j0790J4587R439K8565O775L992Q616k8398k0245J6449
8652I3623P907r976N009J180l6721k7471K8420j6050j6368j6464k880J8499L0076
8639E8784J4800k26k404j6571l547P842Q17J0052L201j4671r124k1893k009O186
8625C1237J6970J6374j0218L525J1561j1811q266K2443J606q358j9026Q112L9351
8612I3500m186j3146k9201J273J1528o649J1787N508K2016K8167J3255k9283o037
8599I8532J0418J7882K5706j4636k8085J9117J0848q87p935m993O499L521l337
8586A32650K306j3394k3097j3212K3403J6976l6389j5106J8726K715l4617l2377
$$ plain form
8574 28584 44007 52556 52674 51622 58421 49989 42376 45420 62678 72774 51919 34009 29283 34447
8560 34447 24822 37516 72763 74992 88958 83846 99117 108963 101131 108357 83515 77380 72304
8547 72304 74787 69418 78919 61941 60310 70633 48320 42765 39736 40875 32798 17266 12795 27892
8533 27892 51859 58364 46326 28148 18246 24733 44580 57761 79462 78073 60424 51437 59079
8520 59079 54478 41343 27189 41697 58172 66323 69398 64276 43957 53542 58795 84255 54252
8507 54252 53050 50712 34102 36447 44510 43036 19538 8838 11219 8930 56996 78570 82319
8494 82319 53147 25055 12367 4346 7131 1383 -17878 -14597 9289 14942 43245 69448 72135
8481 72135 67863 57437 44598 49946 53114 34174 29314 40986 36444 48072 50320 54339 56921
$$ packed form
8574B8584J5423Q549J18j052O799q432p613L044J7258J0096k0855j7910m726N164
8560C4447r625J2694L5247K229J3966n112J5271R846p832P226k4842o135n076
8547G2304K483n369R501j6978j631J0323k2313n555l029J139q077j5532m471J5097
8533B7892K3967O505j2038j8178r902O487J9847J3181K1701j389j7649q987P642
8520E9079m601j3135j4154J4508J6475Q151L075n122k0319R585N253K5460l0003
8507E4252j202k338j6610K345Q063j474k3498j0700K381k289M8066K1574L749
8494H2319k9172k8092j2688q021K785n748j9261L281K3886N653K8303K6203K687
8481G2135m272j0426j2839N348L168j8940m860J1672m542J1628K248M019K582
$$ plain form
8468 56921 70904 75041 61610 67407 60202 41707 47154 51614 71935 66924 63091 73038 78791 66516
8454 66516 9248 8515 41831 61311 47300 44029 38139 17429 9244 23911 41202 36389 -770
8441 -770 -22407 -582 16780 23464 796 -1039 19243 28521 23504 44549 50920 50172 63291 67468
8427 67468 62223 56522 36253 52452 73482 83480 89739 61302 56012 58955 23940 7345 13812
8414 13812 19639 14977 35175 60291 39286 45785 37862 8870 16615 56311 52436 41693 25004
8401 25004 26256 23075 -3038 -14020 -10857 2201 -6026 1818 6558 4542 -10125 -31176 -17726
8388 -17726 -914 2983 -2282 -26826 -31190 2701 656 4911 57866 67829 60474 38884 51895
8375 51895 49786 45953 56289 40336 29540 36589 41901 38320 32379 35491 9288 3385 15321
$$ packed form
8468E6921J3983M137j3431N797p205j8495N447M460K0321n011l833R947N753j2275
8454F6516n7268p33L3316J9480j4011l271n890k0710q185J4667J7291m813l7159
8441g70k1637K1825J7362O684k2668j835K0282R278n017K1045O371p48J3119M177
8427F7468n245n701k0269J6199K1030R998O259k8437n290K943l5015j6595O467
8414A3812N827m662K0198K5116k1005O499p923k8992P745L9696l875j0743j6689
8401B5004J252l181k6113j0982L163J3058q227P844M740k016j4667k1051J3450
8388a7726J6812L897n265k4544m364L3891k045M255N2955R963p355k1590J3011
8375E1895k109l833J0336j5953j0796P049N312l581n941L112k6203n903J1936
$$ plain form
8362 15321 15938 -178 -9090 15158 27428 46039 62735 65614 59348 40983 43211 28155 25898
8349 25898 23754 28670 17974 18724 24513 37680 33063 3679 -16014 13812 19277 5975 47180
8336 47180 78245 93600 88351 72537 46146 38801 30584 26449 37820 33637 14152 6327 44570
8323 44570 75648 94498 92660 62936 71665 82952 63682 39873 31065 12648 6824 44908 38954
8310 38954 23151 25617 31191 25348 22493 39302 32826 32387 26588 13158 18658 -2747 -7753 -16889
8296 -16889 7219 30727 38063 47870 44763 37730 35261 13319 14921 23772 8906 10781 -16622
8283 -16622 -32482 -24500 -14217 -2484 28732 51485 29481 17054 10160 37318 63622 68555
8271 68555 41484 3370 12793 28051 37550 53287 44475 34268 42575 54069 32348 9219 7108
$$ packed form
8362A5321O17j6116q912K4248J2270J8611J6696K879o266j8365K228j5056k257
8349B5898k144M916j0696P50N789J3167m617k9384j9693K9826N465j3302M1205
8336D7180L1065J5355n249j5814k6391p345q217m135J1371m183j9485p825L8243
8323D4570L1078J8850j838k9724Q729J1287j9270k3809q808j8417n824L8084n954
8310C8954j5803K466N574n843k855J6809o476m39n799j3430N500k1405n006r136
8296a6889K4108K3508P336R807l107p033k469k1942J602Q851j4866J875k7403
8283a6622j5860P982J0283J1733L1216K2753k2004j2427o894K7158K6304M933
8271F8555k7071l8114R423J5258R499J5737q812j0207Q307J1494k1721k3129k111
$$ plain form
8258 7108 3926 24236 31393 23145 26573 16498 1035 11647 23397 33452 26293 2281 -1059
8245 -1059 5227 22658 42095 20986 24290 37782 39475 9050 -5748 -4289 -9598 -19943 -3145
8232 -3145 8611 8752 26681 9055 -6726 -3846 -424 -15140 -10934 -11467 -26537 -19591 -15607 1998
8218 1998 18414 25732 9110 -9921 -17911 3489 4289 8114 -4925 -1167 7777 -9977 -24866
8205 -24866 -14244 -9963 2665 -15986 -16128 2569 11942 29500 32963 18668 -28248 -23244 11223
8192 11223 687 25606 28743 30927 616 -19129 -17701 -18084 14008 20109 3933 962 23295
8179 23295 32053 12804 -8637 -4978 -5294 -4221 -10778 -4646 -140 -31826 -42703 -23657 -14953 2302
8165 2302 29363 41679 50006 43366 14881 1574 -12198 3109 23367 3004 13836 21882 18916
$$ packed form
8258G108l182K0310P157q248L428j0075j5463J0612J1750J0055p159k4012l340
8245a059O286J7431J9437k1109L304J3492J693l0425j4798J459n309j0345J6798
8232c145J1756J41J7929j7626j5781K880L422j4716M206n33j5070O946L984J7605
8218A998J6416P318j6622j9031p990K1400Q00L825j3039L758Q944j7754j4889
8205b4866J0622M281J2628j8651j42J8697R373J7558L463j4295m6916N004L4467
8192A1223j0536K4919L137K184l0311j9745J428l83L2092O101j6176k971K2333
8179B3295Q758j9249k1441L659l16J073o557O132M506l1686j0877J9046Q704J7255
8165B302K7061J2316Q327o640k8485j3307j3772J5307K0258k0363J0832Q046k966
$$ plain form
8152 18916 14670 9542 35126 56447 35095 24175 17248 4470 5398 -25223 -24276 -7038 813
8139 813 13919 20322 9106 19079 21100 23417 28287 21620 3989 2945 14788 37043 52709 37068
8125 37068 30187 26632 26333 9265 -8026 11902 28168 17438 2275 1067 -1726 -2943 1962
8112 1962 -23166 -31565 -22975 -1301 34935 49127 40232 24754 24178 25797 12826 22356 20838 -3038
8098 -3038 138 23196 52013 47724 14992 -20367 -1738 1534 21186 30933 8327 -21365 -13239
8085 -13239 2600 21763 14267 -8970 -11691 -19250 -949 23195 13401 17400 25259 40689 25377
8072 25377 -3866 -23742 -43259 -52731 -15991 3127 -25486 -25826 -4683 10802 15686 1692 -3994
8059 -3994 -6917 251 4389 -1701 -8671 14154 18417 13793 33428 59421 36675 25035 9874
$$ packed form
8152A8916m246n128K5584K1321k1352j0920o927j2778R28l0621R47J7238P851
8139H13J3106O403j1216R973K021K317M870o667j7631j044J1843K2255J5666j5641
8125C7068o881l555k99j7068j7291J9928J6266j0730j5163j208k793j217M905
8112A962k5128q399Q590K1674L6236J4192q895j5478n76J619j2971R530j518k3876
8098c038L176K3058K8817m289l2732l5359J8629L272J9652R747k2606k9692Q126
8085a3239J5839J9163p496k3237k721p559J8301K4144r794L999P859J5430j5312
8072B5377k9243j9876j9517r472L6740J9118k8613l40K1143J5485M884j3994n686
8059c994k923P168M138o090o970K2825M263m624J9635K5993k2746j1640j5161
$$ plain form
8046 9874 12815 22587 50780 58078 36834 35033 47741 35111 1396 -1238 -3288 -24961 -13399
8033 -13399 -19925 17300 43733 33129 17578 11584 5054 3896 3130 -18291 -31675 -3199 53980
8020 53980 51117 46294 29304 14682 28775 15770 -3989 1681 13183 40463 46951 51280 34356
8007 34356 10433 17454 7582 -1469 19794 37444 30294 35893 32332 24956 37234 18470 29773
7994 29773 28523 21994 347 -10885 8273 19672 16393 20456 13595 7498 18977 25595 27313
7981 27313 485 -31614 -22644 -6087 1912 19659 35348 40609 34544 33919 59622 55156 26389
7968 26389 10410 42929 39190 58178 84547 87788 93297 101093 85797 67932 61167 48096 67810
7955 67810 70895 60651 51477 60176 87284 92352 76960 87786 94992 81025 80431 76644 48233
$$ packed form
8046I874K941R772K8193P298k1244j801J2708j2630l3715k634k050k1673J1562
8033a3399o526L7225K6433j0604j5551n994o530j158p66k1421j3384K8476N7179
8020E3980k863m823j6990j4622J4093j3005j9759N670J1502K7280O488M329j6924
8007C4356k3923P021r872r051K1263J7650p150N599l561p376J2278j8764J1303
7994B9773j250o529k1647j1232J9158J1399l279M063o861o097J1479O618J718
7981B7313k6828l2099Q970J6557P999J7747J5689N261o065o25K5703m466k8767
7968B6389j5979L2519l739J8988K6369L241N509P796j5296j7865o765j3071J9714
7955F7810L085j0244r174Q699K7108N068j5392J0826P206j3967n94l787k8411
$$ plain form
7942 48233 54020 54564 57804 49322 52863 52046 43904 30863 20165 26642 40886 39087 21710 20666
7928 20666 14953 625 14573 37504 37567 33125 48671 47876 50935 49600 50332 37099 38606 45672
7914 45672 56969 45884 48349 46146 48304 48295 52203 23760 11476 25172 55055 77034 60289
7901 60289 58319 10667 16721 23864 37763 36045 21037 3880 4758 15746 -3046 -14819 -19999
7888 -19999 -10432 -5144 700 670 13891 20698 28772 27951 34927 33423 1964 -7791 668 9652 15511
7873 15511 9602 27517 33418 18976 15036 22821 55467 71620 61628 37776 26530 19104 4622
7860 4622 365 27162 51013 52954 57528 41518 9631 12506 4604 -13343 -6576 9867 14316
7847 14316 12872 9690 -11462 -3386 17187 8073 31238 43835 60714 53483 41356 24195 24568
$$ packed form
7942D8233N787N44L240q482L541q17q142j3041j0698O477J4244j799j7377j044
7928B0666n713j4328J3948K2931O3m442J5546p95L059j335P32j3233J507P066
7914D5672J1297j1085K465k203K158rL908k8443j2284J3696K9883K1979j6745
7901F0289j970m7652O054P143J3899j718j5008j7157Q78J0988j8792j1773n180
7888a9999R567N288N844l0J3221O807Q074q21O976j504l1459r755Q459Q984N859
7873A5511n909J7915N901j4442l940P785L2646J6153r992k3852j1246p426j4482
7860D622m257K6797K3851J941M574j6010l1887K875p902j7947O767J6443M449
7847A4316j444l182k1152Q076K0573r114K3165J2597J6879p231j2127j7161L73
$$ plain form
7834 24568 12852 8608 -18326 -2727 -14284 -6574 10115 42061 22702 -3176 -1874 -10368 -33939
7821 -33939 -38537 -44030 -44839 -28822 -17888 -16212 -1060 -1386 -3837 3869 9284 -1056 -5000 -4165
7807 -4165 -21670 -38276 -25089 -20511 -8653 -621 12577 26608 7615 15870 24873 26882 4148
7794 4148 -10059 -3236 -8975 4860 1202 10481 10546 -29169 -24045 -10179 24444 11604 -7831 -18478
7780 -18478 -24281 -51255 -77126 -58701 -40944 -26260 -13582 18298 26622 2886 4105 -11129
7768 -11129 -8660 7450 22814 36857 29264 12044 24164 8283 -10291 -8684 -17393 -23014 -20605
7755 -20605 4346 17783 -2685 -19140 -37529 -27713 -19903 21254 37177 29633 26862 39028 53169
7742 53169 36194 13609 -695 -6918 8901 -6195 -14635 -4642 -14127 -4865 515 -2382 -481
$$ packed form
7834B4568j1716m244k6934J5599j1557P710J6689L1946j9359k5878J302q494k3571
7821c3939m598n493q09J6017J0934J676J5152l26k451P706N415j0340l944Q35
7807d165j7505j6606J3187M578J1858Q032J3198J4031j8993Q255R003K009k2734
7794D148j4207O823n739J3835l658R279O5l9715N124J3866L4623j2840j9435j0647
7780a8478n803k6974k5871J8425J7757J4684J2678L1880Q324k3736J219j5234
7768a1129K469J6110J5364J4043p593j7220J2120j5881j8574J607q709n621K409
7755b0605K4951J3437k0468j6455j8389R816P810M1157J5923p544k771J2166J4141
7742E3169j6975k2585j4304o223J5819j5096q440R993r485R262N380k897J901
$$ plain form
7729 -481 -33928 -37656 -42750 -62364 -28644 -42167 -40042 -36132 -39181 -14616 12358 24549 39089
7716 39089 46604 50063 67452 44301 34701 20505 16663 37795 7171 8696 23661 23266 28577
7703 28577 19182 -10286 -15759 6973 -8953 -7277 -39530 -57066 -26972 -14107 -10203 -28052 -30064
7690 -30064 -2003 18398 1115 -11963 -29391 -27554 -12678 16443 11479 94 -22988 -24279
7678 -24279 636 -10707 -17134 -12014 -22321 -34614 -18961 15712 28838 10663 -4359 -28688
7666 -28688 -32127 -28959 -5260 9200 15015 40363 5853 3593 13611 6935 1315 -15705 -10972
7653 -10972 -5702 -204 27190 35113 51523 59878 58395 38165 15666 2594 -7458 6595 14691
7640 14691 38787 25136 12098 17026 -79 13138 33681 12182 10069 24037 15227 33187
$$ packed form
7729d81l3447l728n094j9614L3720j3523K125L910l049K4565K6974J2191J4540
7716C9089P515L459J7389k3151r600j4196l842K1132l0624J525J4965l95N311
7703B8577r395k9468n473K2732j5926J676l2253j7536L0094J2865L904j7849k012
7690c0064K8061K0401j7283j3078j7428J837J4876K9121m964j1385k3082j291
7678b4279K4915j1343o427N120j0307j2293J5653L4673J3126j8175j5022k4329
7666b8688l439L168K3699J4460N815K5348l4510k260J0018o676n620j7020M733
7653a0972N270N498K7394P923J6410Q355j483k0230k2499j3072j0052J4053Q096
7640A4691K4096j3651j3038M928j7105J3217K0543k1499k113J3968q810J7960
$$ plain form
7628 33187 36784 34534 40051 18690 -6443 -27471 -20090 3268 222 -1815 -11557 -40272 -50225
7615 -50225 -62253 -66018 -48170 -43073 -34350 -26527 -27086 -11063 7379 -7111 1234 -4827 -608 16646
7601 16646 294 -2206 4133 -4597 -36475 -55375 -42642 -38872 -28802 12053 26057 11474 -19636
7588 -19636 -27625 -24848 -40989 -54209 -35342 -13824 -10436 -11514 -33925 -28442 -13251 -11866 -15687
7575 -15687 -14845 -759 17924 -4372 -19729 -25182 -45124 -45441 -67177 -48470 -35221 -18360 -10093
7562 -10093 13814 -806 -53523 -43687 -41398 -67365 -67320 -31372 -22777 -36617 -42558 -47961 -16680
7549 -16680 -5652 26376 30415 34936 54990 39907 32671 28000 16648 30646 17477 -4564 -31412
7536 -31412 -35896 -23513 8856 21898 11713 25297 16675 16662 10267 -14937 -21979 13969 25633
$$ packed form
7628C3187L597k250N517k1361k5133k1028P381K3358l046k037r742k8715r953
7615e0225j2028l765J7848N097Q723P823n59J6023J8442j4490Q345o061M219J7254
7601A6646j6352k500O339q730l1878j8900J2733L770J0070M0855J4004j4583l1110
7588a9636p989K777j6141j3220J8867K1518L388j078k2411N483J5191J385l821
7575a5687Q42J4086J8683k2296j5357n453j9942l17k1736J8707J3249J6861Q267
7562a0093K3907j4620n2717R836K289k5967M5L5948Q595j3840n941n403L1281
7549a6680J1028L2028M039M521K0054j5083p236m671j1352J3998j3169k2041k6848
7536c1412m484J2383L2369J3042j0185J3584q622j3o395k5204p042L5948J1664
$$ plain form
7523 25633 2406 -21391 -25301 -7805 601 -29529 -41937 -6308 8645 15717 1311 -12756
7511 -12756 7796 10297 -5766 18846 26590 37646 37331 28414 15662 928 -3453 -18674 -9738
7498 -9738 -18551 -23731 -27364 -29833 -9803 -15659 -29091 -15489 -728 -23053 -22900 -9815 -24523
7485 -24523 -19530 -34267 -46726 -24518 -9799 20208 5811 -4375 951 -30686 -35996 -52349
7473 -52349 -42292 -50851 -64526 -78806 -62894 -20817 17883 -678 -29344 -28324 -5606 10115
7461 10115 2847 -34739 -3734 16822 6375 11376 5866 -13775 -17866 -15818 -22210 -49218 -54195
7448 -54195 -18950 16318 9783 913 7819 13888 17076 -6631 -9089 -10248 -15321 -19837 -2529 3128
7434 3128 13451 17404 34148 25252 13789 16206 13318 14559 -630 -14708 -35010 -11614 35891
$$ packed form
7523B5633k3227k3797l910J7496Q406l0130j2408L5629J4953P072j4406j4067
7511a2756K0552K501j6063K4612P744J1056l15q917j2752j4734m381j5221Q936
7498i738q813n180l633k469K0030n856j3432J3602J4761k2325J53J3085j4708
7485b4523M993j4737j2459K2208J4719L0007j4397j0186N326l1637n310j6353
7473e2349J0057q559j3675j4280J5912M2077L8700j8561k8666J020K2718J5721
7461A0115p268l7586L1005K0556j0447N001n510j9641m091K048o392k7008m977
7448e4195L5245L5268o535q870O906O069L188k3707k458j159n073m516J7308N657
7434C128J0323L953J6744q896j1463K417k888J241j5189j4078k0302K3396M7505
$$ plain form
7421 35891 48014 12193 6261 32688 29647 22863 3727 -6054 -4412 10833 6695 -4029 -17094
7408 -17094 -21260 -46616 -34385 -12290 -14227 -35344 -43889 -42536 -43755 -31839 -19863 -11538 -3519
7395 -3519 24464 19295 -3077 -5745 6324 13332 27321 24501 14281 17014 7563 -8565 17898
7382 17898 48795 33701 21678 -5257 -20079 -17593 6543 6759 26246 8660 -11431 -49
7370 -49 8477 5168 5217 -399 2723 -4212 -2216 1211 -24361 -19477 -13887 -34551 -13627 -8948 -9374
7355 -9374 -13283 -32433 -17726 -8431 -1807 -12519 -17950 169 2723 -14287 -9887 -15863 1013
7342 1013 -3241 7970 26013 2198 -21561 -16071 -8007 -23672 -32217 4304 12898 15634 21644
7329 21644 27647 20749 32931 59131 74992 51042 35491 41428 46454 35377 25818 4463 27498
$$ packed form
7421C5891J2123l5821n932K6427l041o784j9136r781J642J5245m138j0724j3065
7408a7094m166k5356J2231K2095j937k1117q545J353j219J1916J1976Q325Q019
7395c519K7983n169k2372k668J2069P008J3989k820j0220K733r451j6128K6463
7382A7898L0897j5094j2023k6935j4822K486K4136K16J9487j7586k0091J1382
7370d9Q526l309M9n616L122o935J996L427k5572M884N590k0664K0924M679m26
7355i374l909j9150J4707R295O624j0712n431J8119K554j7010M400n976J6876
7342A013m254J1211J8043k3815k3759N490Q064j5665q545L6521Q594K736O010
7329B1644O003o898J2182K6200J5861k3950j5551N937N026j1077r559k1355K3035
$$ plain form
7316 27498 24592 -12755 -9587 17509 29518 40540 35051 -1765 -29791 -23666 -36407 -18066 3556
7303 3556 -9825 -18286 -21657 -29114 -25167 -7257 -19400 -25562 -18728 -39234 -29218 -3809 32409
7290 32409 36748 32767 29797 16698 9176 26835 14449 19089 12735 38330 45531 -4569 -28821
7277 -28821 -13300 2889 -5450 -43733 -43371 -31507 -19208 -6676 -17066 -26219 -30291 -32572 -35803
7264 -35803 -29927 -4193 8687 4706 -8699 -11500 -5450 7445 -8809 -11101 -3933 -13427 -38319
7251 -38319 -35697 -22494 -9464 3933 15850 29075 23480 12821 22340 28013 28255 16915 9457
7238 9457 8774 -23773 -47008 -20789 9324 -533 -10309 -45992 -60958 -37730 -1770 -15479 -29077
7225 -29077 -24151 -15163 17 11642 19880 8111 -1420 14826 16392 9779 3010 -10739 -16836
$$ packed form
7316B7498k906l7347L168K7096J2009J1022n489l6816k8026O125j2741J8341K1622
7303C556j3381q461l371p457L947J7910j2143o162O834k0506J0016K5409L6218
7290C2409M339l981k970j3099p522J7659j2386M640o354K5595P201n0100k4252
7277b8821J5521J6189q339l8283L62J1864J2299J2532j0390r153m072k281l231
7264c5803N876K5734J2880l981j3405k801O050J2895j6254k292P168r494k4892
7251c8319K622J3203J3030J3397J1917J3225n595j0659R519N673K42j1340p458
7238I457o83l2547k3235K6219L0113r857r776l5683j4966K3228L5960j3709j3598
7225b9077M926Q988J5180J1625Q238j1769r531J6246J566o613o769j3749o097
$$ plain form
7212 -16836 -1685 1306 -25158 -36165 -40396 -52380 -44501 -54930 -73057 -49806 -47897 -53061 -46301
7199 -46301 -29489 -6824 -1288 20012 -14363 -32663 -22663 -14734 -32114 -66042 -70515 -51243
7187 -51243 -31886 -48721 -40403 -18202 -11917 -46248 -91130 -102404 -96747 -68127 -8672 -15243 -9428
7174 -9428 -16569 -4143 2098 34775 15589 -2894 12285 21858 27621 23164 10873 -23840 -28322
7161 -28322 -19856 -9529 283 -21217 -27691 -18988 -3316 -457 -18600 -43176 -43885 -28861 -46013
7148 -46013 -57378 -60570 -63144 -45431 -35569 -70602 -73942 -56774 -33732 -6190 896 -5142 -37924
7135 -37924 -46394 -25885 -30373 -26823 -8529 -29379 -18955 -9285 5150 10647 -10532 -25860 -15961
7122 -15961 -49924 -58360 -43958 -28333 -19705 -26731 -457 -302 -17366 -13757 -21744 -7812 22241
$$ packed form
7212a6836J5151K991k6464j1007m231j1984P879j0429j8127K3251J909n164O760
7199d6301J6812K2665N536K1300l4375j8300J0000P929j7380l3928m473J9272
7187e1243J9357j6835Q318K2201O285l4331m4882j1274N657K8620N9455o571N815
7174i428p141J2426O241L2677j9186j8483J5179R573N763m457j2291l4713m482
7161b8322Q466J0327R812k1500o474Q703J5672K859j8143k4576p09J5024j7152
7148d6013j1365l192k574J7713R862l5033l340J7168K3042K7542P086o038l2782
7135c7924q470K0509m488L550J8294k0850J0424R670J4435N497k1179j5328R899
7122a5961l3963q436J4402J5625Q628p026K6274J55j7064L609p987J3932L0053
$$ plain form
7109 22241 34595 37860 20060 -10122 -2235 963 11082 17668 13862 3711 -31530 -44036 -45164
7096 -45164 -38911 -23027 1635 -9327 -1263 -1981 -8613 7104 18455 -3923 -23149 -26889 -25316
7083 -25316 5561 3815 2209 -4397 -4722 -30323 -29070 -20090 -31675 -36221 3682 779 8624 33012
7069 33012 26583 51 -21224 -19202 -23796 -4920 -7941 -50101 -43573 -31129 -49916 -35721 -42073
7056 -42073 -40083 -33831 -29894 -34985 -59385 -76593 -54274 -28573 2521 5767 -1111 -29099 -7558
7043 -7558 -17926 -13556 -10238 -18300 -28793 -21526 -22301 -65597 -80385 -69114 -49038 851 7957
7030 7957 -2423 -18147 -32526 -33458 -48285 -27316 -40139 -45162 -42448 -38621 -47686 -49294 -26481
7017 -26481 -13287 -12755 -42838 -10350 -2868 -18749 -24189 -16958 -30701 -25678 327 13334 5968
$$ packed form
7109B2241J2354L265j7800l0182P887L198J0119O586l806j0151l5241j2506j128
7096d5164O253J5884K4662j0962Q064p18o632J5717J1351k2378j9226l740J573
7083b5316L0877j746j606o606l25k5601J253Q980j1585m546L9903k903P845K4388
7069C3012o429k6532k1275K022m594J8876l021m2160O528J2444j8787J4195o352
7056d2073J990O252L937n091k4400j7208K2319K5701L1094L246o878k7988K1541
7043g558j0368M370L318q062j0493P267p75m3296j4788J1271K0076M9889P106
7030G957j0380j5724j4379r32j4827K0969j2823n023K714L827r065j608K2813
7017b6481J3194N32l0083L2488P482j5881n440P231j3743N023K6005J3007p366
$$ plain form
7004 5968 -1624 -9868 -10333 -10693 -6823 -13039 -21751 -26673 -5710 -332 -21350 -16617 -13895 5603 -2303
6989 -2303 534 9989 25193 12327 14434 14573 -10602 -23262 -5640 1407 751 -8050 5762 -6859
6975 -6859 -13852 1576 -12029 -24427 19507 18544 -37627 -38580 -25325 -20505 5776 9866 7996 894
6961 894 10578 27134 -22083 -43042 -32197 7096 -20310 -27213 12808 18476 -6875 -38746 -54305
6948 -54305 -27187 -3648 10640 18941 13103 -16355 -33809 -7456 4489 4287 -8487 -6582 -487
6935 -487 -457 -10793 -25228 -34388 -31142 -19633 -41532 -15791 12995 35739 52663 35132 45620
6922 45620 57745 57184 7968 -42130 -48140 -33568 -18051 -1548 9385 821 -18416 -21219 -23818
6909 -23818 -14658 -11875 9853 -12067 -22488 -18761 -16136 16197 25919 11352 23273 10693 -9807
$$ packed form
7004E968p592q244m65l60L870o216q712m922K0963N378k1018M733K722J9498p906
6989b303K837R455J5204j2866K107J39k5175j2660J7622P047o56q801J3812j2621
6975f859o993J5428j3605j2398M3934r63n6171r53J3255M820K6281M090j870p102
6961H94R684J6556m9217k0959J0845L9293k7406o903M0021N668k5351l1871j5559
6948e4305K7118K3539J4288Q301n838k9458j7454K6353J1945k02j2774J905O095
6935d87L0j0336j4435r160L246J1509k1899K5741K8786K2744J6924j7531J0488
6922D5620J2125n61m9216n0098o010J4572J5517J6503J0933q564j9237k803k599
6909b3818R160K783K1728k1920j0421L727K625L2333R722j4567J1921j2580k0500
$$ plain form
6896 -9807 1569 6870 -7746 -14177 20326 11409 6099 1744 -18123 -14417 -24591 -34587 -8717
6883 -8717 19886 -9329 3379 34617 17991 7364 -9971 -26680 -44469 -49253 -48607 -48421 -33142
6870 -33142 -12616 7230 29630 57375 47426 6985 -10622 -26918 -18519 -17691 -34063 -37458 -11923
6857 -11923 -7492 3983 -148 7385 4325 -11851 -15098 -5908 25396 17639 -30565 -48951 -43160
6844 -43160 -12990 21834 4890 9938 44279 51867 29946 2175 19766 845 -22009 -9168
6832 -9168 22794 17809 3015 -10195 -19451 -2366 -16670 -13861 12094 -4201 -17348 -27966 -12216
6819 -12216 -17532 -21268 -16304 -15693 -2801 30883 26340 12222 14272 18859 -5265 -18125 -13001 9006
6805 9006 -17122 -60452 -58092 -53799 -54497 -35608 -22241 -34134 -43633 -42454 -38128 -35616 -40272 -36239
$$ packed form
6896i807J1376N301j4616o431L4503q917n310m355j9867L706j0174r996K5870
6883h717K8603k9215J2708L1238j6626j0627j7335j6709j7789m784O46J86J5279
6870c3142K0526J9846K2400K7745r949m0441j7607j6296Q399Q28j6372l395K5535
6857a1923M431J1475m131P533l060j6176l247R190L1304p757m8204j8386N791
6844d3160L0170L4824j6944N048L4341P588k1921k7771J7591j8921k2854J2841
6832i168L1962m985j4794j3210r256J7085j4304K809K5955j6295j3147j0618J5750
6819a2216n316l736M964O11J2892L3684m543j4118K050M587k4124j2860N124K2007
6805I006k6128m3330K360M293o98J8889J3367j1893r499J179M326K512m656M033
$$ plain form
6791 -36239 -26840 -14891 -11249 -27412 12114 26080 -6067 -41489 -61817 -36409 -48469 -62779
6779 -62779 -16895 16122 47106 19454 14588 30373 11883 303 14201 21397 -4608 -3843 -5740
6766 -5740 -18382 -13808 -41651 -48518 -37711 -18777 3971 11865 5132 1946 9754 30582 34604
6753 34604 25864 24526 27837 11621 -14170 -21210 7199 33907 45578 29734 18722 20589 37605
6740 37605 39254 32448 35925 35137 45112 40366 26339 4700 8068 19264 33291 2917 3403 12486
6726 12486 33510 69502 110643 101906 91036 93073 68918 55731 65156 62933 56280 38636 21138
6713 21138 12015 34740 35628 -7210 -15472 -21332 -6122 2425 -471 -40265 -46012 -35887 -25027
6700 -25027 -14651 -32825 -13023 1161 -26923 -24863 -5017 4927 -4597 -13058 -12005 -7340 -1924
$$ packed form
6791c6239R399J1949L642j6163L9526J3966l2147l5422k0328K5408j2060j4310
6779f2779M5884L3017L0984k7652m866J5785j8490j1580J3898P196k6005P65j897
6766e740j2642M574k7843o867J0807J8934K2748P894o733l186P808K0828M022
6753C4604q740j338L311j6216k5791p040K8409K6708J1671j5844j1012J867J7016
6740C7605J649o806L477p88R975m746j4027k1639L368J1196J4027l0374M86R083
6726A2486K1024L5992M1141q737j0870K037k4155j3187R425k223o653j7644j7498
6713B1138r123K2725Q88m2838q262n860J5210Q547k896l9794n747J0125J0860
6700b5027J0376j8174J9802J4184k8084K060J9846R944r524q461J053M665N416
$$ plain form
6687 -1924 6339 3728 5447 9463 -19855 -45019 -13325 1719 7964 -12715 -14433 -14362 -25331 -10899
6673 -10899 8584 3415 -7450 -20027 -3703 -3535 10324 -16688 -47946 -25044 -10861 -28665
6661 -28665 -38396 -29867 610 9374 -7748 -24924 -32794 -27100 -29712 -25765 -29882 -59067 -60753 -22516
6647 -22516 -16419 -19150 -17055 -26491 -28453 -49472 -40608 -18914 -6363 -102 4729 18479 26626 19887
6633 19887 29709 17351 12397 -5111 -4518 -22753 -24112 -26108 -59048 -71947 -44848 -27262 76
6620 76 3799 20345 19891 4326 14177 6214 -21255 -7900 3833 -7497 -7224 7271 28362 5774
6606 5774 -40559 -68076 -36216 -1151 19174 10485 12151 4258 -6032 -19174 -36531 -27595 -38927
6593 -38927 -39084 -50319 -43260 -39966 -19141 9744 8706 -25002 -29422 -10702 -3698 -17031 -14020
$$ packed form
6687a924Q263k611J719M016k9318k5164L1694J5044O245k0679j718P1j0969J4432
6673a0899J9483n169j0865j2577J6324J68J3859k7012l1258K2902J4183j7804
6661b8665r731Q529L0477Q764j7122j7176p870N694k612L947m117k9185j686L8237
6647b2516O097k731K095r436j962k1019Q864K1694J2551O261M831J3750Q147o739
6633A9887R822j2358m954j7508N93j8235j359j996l2940j2899K7099J7586K7338
6620G6L723J6546m54j5565R851p963k7469J3355J1733j1330K73J4495K1091k2588
6606E774m6333k7517L1860L5065K0325q689J666p893j0290j3142j7357Q936j1332
6593c8927j57j1235P059L294K0825K8885j038l3708m420J8720P004j3333L011
$$ plain form
6580 -14020 11367 -1515 -29212 -47953 -51167 -37248 -40628 -46411 -27176 -23570 -36471 -49474 -69873
6567 -69873 -60612 -37294 -16493 8132 6353 25683 27680 10976 -27969 -18562 -19101 -3913 12288
6554 12288 9260 6593 26174 26063 3826 -16243 -16331 -5521 -23871 -21616 2640 11308 -7058 -21152
6540 -21152 -19446 7566 33168 35940 17306 11967 8738 -3231 -36594 -45521 -55341 -35884 -16854
6527 -16854 -10278 -9512 -29417 -32337 -47914 -57027 -39863 -12587 -12412 -9790 -16955 -1701 -15436 -20497
6513 -20497 -33463 -35255 -35813 -25538 -3424 11141 15828 -163 3698 -12212 -8439 7880 412
6500 412 10095 -1538 1719 35041 60388 38250 -9034 -46671 -29066 -8461 -8833 -34712 -52280
6487 -52280 -21964 -9093 -17843 -36036 -24343 9138 13736 -15600 -23005 -6236 9969 37933
$$ packed form
6580a4020K5387j2882k7697j8741l214J3919l380n783J9235L606j2901j3003k0399
6567f9873R261K3318K0801K4625j779J9330J997j6704l8945R407n39J5188J6201
6554A2288l028k667J9581j11k2237k0069q8J0810j8350K255K4256Q668j8366j4094
6540b1152J706K7012K5602K772j8634n339l229j1969l3363q927r820J9457J9030
6527a6854O576P66j9905k920j5577r113J7164K7276J75K622p165J5254j3735n061
6513b0497j2966j792n58J0275K2114J4565M687j5991L861j5910L773J6319p468
6500D12R683j1633L257L3322K5347k2138m7284l7637J7605K0605l72k5879j7568
6487e2280L0316J2871q750j8193J1693L3481M598k9336p405J6769J6205K7964
$$ plain form
6475 37933 44226 10628 -3540 -31904 -1007 22950 21040 29294 31926 15417 -4136 924 -18004
6462 -18004 -33173 -35203 -17021 -6991 18751 650 -5579 -14208 -23027 -29490 -16138 -23051 -34276
6449 -34276 -55151 -21240 -533 -4033 -29841 -26743 966 19931 27398 20202 25268 19077 3210
6436 3210 5034 -2399 -20913 -30950 -26475 -20150 -2744 10243 -16935 -9702 -24878 -18424 -11302
6423 -11302 9525 -5863 -17999 -6602 -1584 17944 -15539 -26649 20800 35275 14383 14981
6411 14981 23827 29331 17076 5276 12932 46266 38265 11024 24113 17872 -9367 -18835 -19617
6398 -19617 4974 892 -12678 8816 31471 148 -19568 -8711 -287 -297 -1895 -6190 -13005
6385 -13005 -18196 -2818 -343 -1693 11379 -46 -16123 -27171 -5275 26995 49849 46507 36351
$$ packed form
6475C7933O293l3598j4168k8364L0897K3957j910Q254K632j6509j9553N060j8928
6462a8004j5169k030J8182J0030K5742j8101o229q629q819o463J3352o913j1225
6449c4276k0875L3911K0707l500k5808L098K7709J8965P467p196N066o191j5867
6436C210J824p433j8514j0037M475O325J7406J2987k7178P233j5176O454P122
6423a1302K0827j5388j2136J1397N018J9528l3483j1110M7449J4475k0892N98
6411A4981Q846N504j2255j1800P656L3334q001k7241J3089o241k7239r468p82
6398a9617K4591m082j3570K1494K2655l1323j9716J0857Q424j0j598m295o815
6385a3005n191J5378K475j350J3072j1425j6077j1048K1896L2270K2854l342j0156
$$ plain form
6372 36351 13987 -5574 3287 -6008 -6407 -11845 5249 -1517 15789 21327 19873 10885 -14476 -2011
6358 -2011 -14471 -14619 -7344 -13764 5079 28057 38667 1121 -10828 -23249 1578 37042 39053
6345 39053 23780 -5732 -19016 -13778 -549 38078 56240 42258 38578 31435 16633 -4762
6333 -4762 18917 23169 13540 -12278 -1612 2507 -6502 -20279 -13411 18237 31230 25968 13628
6320 13628 21496 39096 10127 -25554 -33787 -6600 15221 20427 -14606 -40610 -43842 -30500 -24750
6307 -24750 -35003 -32892 -30367 -33163 -19353 -19850 -43358 -50849 -16376 -22954 -21337 28084 39482
6294 39482 -7661 -8353 -9338 -5433 -11 14247 6087 15284 6763 -23727 -27634 -9621 -10740 -14558
6280 -14558 -12761 -13746 -8720 -9411 -23896 -31420 -8143 21798 -4790 -25029 -13681 -33433 -20540
$$ packed form
6372C6351k2364j9561Q861r295l99n438J7094o766J7306N538j454q988k5361J2465
6358b011j2460j48P275o420J8843K2978J0610l7546j1949j2421K4827L5464K011
6345C9053j5273k9512j3284N238J3229L8627J8162j3982l680p143j4802k1395
6333d762K3679M252r629k5818J0666M119r009j3777O868L1648J2993n262j2340
6320A3628P868J7600k8969l5681q233K7187K1821N206l5033k6004l232J3342N750
6307b4750j0253K111K525k796J3810m97k3508p491L4473o578J617M9421J1398
6294C9482m7143o92r85L905N422J4258q160R197q521l0490l907J8013j119l818
6280a4558J797r85N026o91j4485p524K3277K9941k6588k0239J1348j9752J2893
$$ plain form
6267 -20540 -15004 -6535 11585 -462 -647 -19413 -20455 8981 28963 -3305 -14217 -22493 -18054
6254 -18054 8672 -517 6176 8691 34895 30478 13263 -8111 -18886 -22450 -36407 -32042 -33085
6241 -33085 -23456 -26455 -25448 -9355 -21320 -30681 -18153 -16677 -31118 -22519 -24857 -12295 -2353
6228 -2353 2139 -29144 1252 -2836 -20617 -582 2366 -1009 -6363 -7126 4807 -313 -10374 -7227
6214 -7227 -12028 3378 6012 13832 28397 20149 31304 20980 9120 7062 8350 4794 6674 -21702
6200 -21702 -46224 -54557 -35651 -12609 10124 -9972 4458 -4720 -11301 -24041 -41495 -47891 -34591
6187 -34591 -38699 -36930 -46600 -12798 34456 49756 39978 16026 -24867 -45842 -21129 -35664 -42070
6174 -42070 -32496 -42705 -55399 -47437 -30141 -19019 -22754 -40577 -34588 -777 36348 19692 742
$$ packed form
6267b0540N536Q469J8120j2047j85j8766j042K9436J9982l2268j0912q276M439
6254a8054K6726r189O693K515K6204m417j7215k1374j0775l564j3957M365j043
6241c3085R629k999J007J6093j1965r361J2528J476j4441Q599k338J2562R942
6228b353M492l1283L0396m088j7781K0035K948l375n354p63J1933n120j0061L147
6214g227m801J5406K634P820J4565q248J1155j0324j1860k058J288l556J880k8376
6200b1702k4522q333J8906K3042K2733k0096J4430r178o581j2740j7454o396J3300
6187c4591m108J769r670L3802M7254J5300r778k3952m0893k0975K4713j4535o406
6174d2070R574j0209j2694P962J7296J1122l735j7823N989L3811L7125j6656j8950
$$ plain form
6161 742 -13972 -23291 11681 20631 35293 29826 -2460 -33400 -48058 -20252 2928 13424 12933
6148 12933 3181 -11840 -6889 10666 17432 6435 31978 33103 1970 -34281 -50648 -48622 -41567
6135 -41567 -40532 -33505 -60704 -30649 -23803 -53131 -65768 -73228 -65959 -48403 -24887 -17386 -15584
6122 -15584 12293 22910 23596 8659 -46844 -44700 -14308 -21020 -17969 -6207 -29861 -35810 -11077
6109 -11077 -300 18584 -1338 3101 22255 -9260 -11145 -29200 -30781 -29108 -33311 -32363 -38058
6096 -38058 -32606 -40370 -26965 -16551 -16748 -2273 24069 21501 14323 1586 -11611 -35673 -57739
6083 -57739 -43291 -8197 -1450 -7918 -9814 6964 12219 -3662 -9957 11400 17571 8415 16978
6070 16978 22789 33214 37646 29685 -797 17094 -16565 -32990 -22082 -3440 657 -5167 -22072
$$ packed form
6161G42j4714r319L4972Q950J4662n467l2286l0940j4658K7806K3180J0496m91
6148A2933r752j5021M951J7555O766j0997K5543J125l1133l6251j6367K026P055
6135d1567J035P027k7199L0055O846k9328j2637p460P269J7556K3516P501J802
6122a5584K7877J0617O86j4937n5503K144L0392o712L051J1762k3654n949K4733
6109a1077J0777J8884j9922M439J9154l1515j885j8055j581J673m203R48n695
6096c8058N452p764J3405J0414j97J4475K6342k568p178j2737j3197k4062k2066
6083e7739J4448L5094O747o468j896J6778N255j5881o295K1357O171r156Q563
6070A6978N811J0425M432p961l0482J7891l3659j6425J0908J8642M097n824j6905
$$ plain form
6057 -22072 -10404 -16277 -13036 -4670 -14864 -4233 -9790 -31698 -26403 -594 6439 12833 -1649
6044 -1649 -8123 -1085 30394 14872 -7787 -18425 -25550 -48560 -70510 -60357 -39351 -30860 -36938
6031 -36938 -15618 -4880 2717 -9308 18149 33171 26504 11569 -15437 -18343 20201 38120
6019 38120 34719 -133 -24202 -29018 -45108 -33228 -28515 -29298 -7940 -13751 -23180 -30381 -5854
6006 -5854 23177 3757 -30684 -27095 -17413 -10491 -12786 5486 6584 12747 10160 11791 -18971 -4502
5992 -4502 7620 -6374 -27208 -18260 1595 -7762 11678 10430 32848 47466 30454 31375 31320 16854
5978 16854 25003 43273 73790 74171 42885 20552 5416 -6794 9481 -25146 -55297 -54000 -30955
5965 -30955 -16466 -519 382 25171 17396 954 16855 13626 -15972 -41931 -39893 -20544 15916
$$ packed form
6057b2072J1668n873L241Q366j0194J0631n557k1908N295K5809P033O394j4482
6044a649o474P038L1479j5522k2659j0638p125k3010k1950J0153K1006Q491o078
6031c6938K1320J0738P597j2025K7457J5022o667j4935k7006k906L8544J7919
6019C8120l401l4852k4069m816j6090J1880M713p83K1358n811r429p201K4527
6006e854K9031j9420l4441L589R682O922k295J8272J098O163k587J631l0762J4469
5992d502J2122j3994k0834Q948J9855r357J9440j248K2418J4618j7012R21n5j4466
5978A6854Q149J8270L0517L81l1286k2333j5136j2210J6275l4627l0151J297K3045
5965c0955J4489J5947R01K4789p775j6442J5901l229k9598k5959K038J9349L6460
$$ plain form
5952 15916 25603 16279 9618 4874 15297 7709 -412 -4403 -19333 -24554 -26900 -19924 -6952 -26594
5938 -26594 -27454 -21064 -29828 -42414 -36924 -23001 -2811 16409 -10216 -23155 -11984 -3335 4137
5925 4137 15381 21721 3261 -7733 3178 4755 3550 5314 -15187 -30909 -44259 -47363 -29001
5912 -29001 -5583 10040 221 3169 -34393 -45759 -23127 -10969 3262 15556 23747 20148 -4802
5899 -4802 6691 -21792 -35294 -47844 -45942 -33875 -2786 9176 -3239 -14076 -12611 -14102 292
5886 292 -22879 -28329 -48996 -46147 -28647 -2082 -5658 -24959 -42948 -46924 -40857 -21570 -32487
5873 -32487 -31020 -45338 -26772 -3294 -3878 7900 14785 55887 69746 28526 9305 4296 1819
5860 1819 6877 3539 -9690 -25357 -31724 -42378 -14099 -11928 -30153 -28554 8194 17857 11919
$$ packed form
5952A5916R687r324o661m744J0423p588q121l991j4930n221k346O976J2972j9642
5938b6594q60O390q764j2586N490J3923K0190J9220k6625j2939J1171Q649P472
5925D137J1244O340j8460j0994J0911J577j205J764k0501j5722j3350l104J8362
5912b9001K3418J5623r819K948l7562j1366K2632J2158J4231J2294Q191l599k4950
5899d802J1493k8483j3502j2550J902J2067L1089J1962j2415j0837J465j491J4394
5886B92k3171n450k0667K849J7500K6565l576j9301j7989l976O067J9287j0917
5873c2487J467j4318J8566K3478n84J1778O885M1102J3859m1220j9221n009k477
5860A819N058l338j3229j5667o367j0654K8279K171j8225J599L6748R663n938
$$ plain form
5847 11919 6138 -18943 -7532 5664 5203 -6480 -12633 -36490 -51944 -67789 -58534 -43100 -20055
5834 -20055 -28423 -40062 -5972 -8759 -7156 -12822 -12512 6807 23388 49101 25393 -4581 -13678
5821 -13678 -19413 -6027 19455 14126 -14102 -25662 -20032 1551 -5242 -18324 -24361 -36753 -39931
5808 -39931 -33237 -24422 7338 22577 -23994 -69595 -83106 -45519 -9582 2468 33178 14476
5796 14476 -672 -20080 -30033 -56328 -63463 -59570 -49821 -49537 -77315 -78724 -36659 -18517 -3183
5783 -3183 6688 5666 2600 2404 4850 569 -27347 -31001 -3505 -18184 -36169 -33418 -1472 4314
5769 4314 17112 8232 -23361 -13136 -3057 3503 17187 45661 58458 25239 25979 5137 -6301
5756 -6301 -4040 6981 4979 6927 2540 -1791 -13331 -14794 -32512 -24857 2122 1636 -16212 -44269
$$ packed form
5847A1919n781k5081J1411J3196m61j1683o153k3857j5454j5845R255J5434K3045
5834b0055q368j1639L4090k787J603n666L10J9319J6581K5713k3708k9974r097
5821a3678n735J3386K5482n329k8228j1560N630K1583o793j3082o037j2392l178
5808c9931O694Q815L1760J5239m6571m5601j3511L7587L5937J2050L0710j8702
5796A4476j5148j9408r953k6295p135L893R749K84k7778j409M2065J8142J5334
5783c183R871j022l066j96K446m281k7916l654K7496j4679j7985K751L1946N786
5769D314J2798q880l1593J0225J0079O560J3684K8474J2797l3219P40k0842j1438
5756f301K261J1021k002J948m387m331j1540j463j7718P655K6979m86j7848k8057
$$ plain form
5742 -44269 -47099 -41781 -36820 -39905 18253 40880 5320 -10539 -26477 -43913 -33191 -23199 -1946
5729 -1946 2935 -22398 -29507 -15897 -24709 -32800 -39542 -43595 -15480 11865 7697 23434 59174
5716 59174 39197 11585 -1802 2621 1918 -21625 -18584 5169 239 -35297 -25798 -26709 -24191 -16729
5702 -16729 -5796 -17873 -12423 -21327 -18119 1929 18189 14611 -13023 -27615 -34991 -34516 -22169
5689 -22169 -4240 9407 16881 3368 -14756 -31825 -25291 -9833 29093 23487 -11549 240
5677 240 24375 33831 46325 52932 33330 15986 37285 58872 53289 27469 -3166 -20664 -50890
5664 -50890 -45725 -4529 -12262 -39726 -24944 -11414 -26093 -36891 -41156 -12279 -5230 -14293 -21466
5651 -21466 -23462 -21095 -44360 -38802 -34904 -32452 -16683 -23273 -7425 2928 -6846 -8283 -8832 -14417
$$ packed form
5742d4269k830N318M961l085N8158K2627l5560j5859j5938j7436J0722R992K1253
5729a946M881k5333p109J3610q812q091o742m053K8115K7345m168J5737L5740
5716E9174j9977k7612j3387M423p03k3543L041K3753m930l5536R499r11K518P462
5702a6729J0933j2077N450q904L208K0048J6260l578k7634j4592p376M75J2347
5689b2169J7929J3647P474j3513j8124j7069O534J5458L8926n606l5036J1789
5677B40K4135R456J2494O607j9602j7344K1299K1587n583k5820l0635j7498l0226
5664e0890N165M1196p733k7464J4782J3530j4679j0798m265K8877P049r063p173
5651b1466j996K367k3265N558L898K452J5769o590J5848J0353r774j437n49n585
$$ plain form
5637 -14417 -16327 -19864 -14545 -4520 -12230 -19149 -6157 -18239 -9921 -13797 -24091 -24891 -17079 -15543
5623 -15543 -5676 -5533 -23374 -46103 -47914 -31446 8360 29681 26215 13583 5975 -2463 -17047
5610 -17047 -16619 -9357 -23571 -56284 -58030 -29833 465 3808 -14475 -22572 -36833 -44854 -34758
5597 -34758 -40393 -45713 -35645 -32677 -28610 -30768 -7340 10500 1440 -1164 13179 21690 11058
5584 11058 -25511 -33607 -25125 -2512 18980 29480 24506 7767 -21715 4466 11442 28279 20892
5571 20892 18374 -909 -18445 -13038 -11900 -8897 9963 -18269 -50538 -51763 -65766 -50890 -25368
5558 -25368 -32579 -40644 -32943 -5218 -27601 -17452 -896 14177 4038 -1227 -4568 -21368 -42389
5545 -42389 -46447 -35056 -44802 -14784 29782 29947 16601 -3768 -20338 -33849 -32438 -21461 -27091
$$ packed form
5637a4417j910l537N319J0025p710o919J2992j2082Q318l876j0294q00P812J536
5623a5543R867J43j7841k2729j811J6468L9806K1321l466j2632p608q438j4584
5610a7047M28P262j4214l2713j746K8197L0298L343j8283q097j4261q021J0096
5597c4758n635n320J0068K968M067k158K3428J7840r060k604J4343Q511j0632
5584A1058l6569q096Q482K2613K1492J0500m974j6739k9482K6181O976J6837p387
5571B0892k518j9283j7536N407J138L003J8860k8232l2269j225j4003J4876K5522
5558b5368p211q065P701K7725k2383J0149J6556J5073j0139n265l341j6800k1021
5545d2389m058J1391r746L0018M4566J65j3346k0369j6570j3511J411J0977n630
$$ plain form
5532 -27091 -32913 -20935 -6363 6153 2453 4170 -12587 -26354 -3911 13149 16039 16598 23521
5519 23521 18831 25116 21610 10993 -14961 -24396 -1499 -22134 -25445 -10587 -5464 -1823 -13852
5506 -13852 -12843 -12334 -22506 -35399 -44335 -37800 -18985 -30334 -24841 -4141 20841 47673 44405
5493 44405 35839 32542 16974 2918 949 27520 14934 -22148 -4684 -4043 -262 7872 2751
5480 2751 12259 33217 20494 12786 -33126 -54537 -24605 6809 18555 18049 8193 -2748 -22809
5467 -22809 -34615 -35399 -45144 -31021 -46586 -56266 -27793 4364 26397 21096 18560 -3447 -34705
5454 -34705 -30944 11776 11499 12773 25999 45469 31843 -8 4966 10893 27694 13648 -10077
5441 -10077 -28165 -44674 -48336 -65757 -56752 -27295 7208 2617 -16424 -16531 -35028 -13804 10779
$$ packed form
5532b7091n822J1978J4572J2516l700J717j6757j3767K2443J7060K890N59O923
5519B3521m690O285l506j0617k5954r435K2897k0635l311J4858N123L641j2029
5506a3852J009N09j0172j2893q936O535J8815j1349N493K0700K4982K6832l268
5493D4405q566l297j5568j4056j969K6571j2586l7082J7464O41L781Q134n121
5480B751R508K0958j2723p708m5912k1411K9932L1414J1746n06r856j0941k0061
5467b2809j1806p84r745J4123j5565r680K8473L2157K2033n301k536k2007l1258
5454c4705L761M2720k77J274J3226J9470j3626l1851M974N927J6801j4046k3725
5441a0077j8088j6509l662j7421R005K9457L4503m591j9041j07j8497K1224K4583
$$ plain form
5428 10779 13548 3860 8297 9552 350 1107 -19128 -10234 13023 19509 226 -495 3574 -13748
5414 -13748 -10503 11650 11446 -27410 -24852 11097 27896 3793 -48034 -16816 25306 35121 39240
5401 39240 18411 -10443 -29005 -29123 -12618 5932 10713 -11687 -7466 15871 8002 -1484 -360
5388 -360 325 16735 21411 20833 20287 -4728 -27343 -30010 -23536 -27039 -27448 -18079 -9692 -18652 -44002
5373 -44002 -59055 -73647 -79175 -88098 -75974 -74381 -74949 -72105 -48468 -41296 -32417 -14509 -1635
5360 -1635 9623 16942 21098 17330 5588 7821 -20385 -53358 -33669 -18264 -29863 -30315 -42218
5347 -42218 -39722 -11252 -23167 -31108 -20505 -38167 -28062 -40539 -60014 -49827 -44694 -45265 -24021
5334 -24021 5608 12460 -14643 -31 11048 -28427 -20674 -29042 -20020 20467 31722 14427 -5805
$$ packed form
5428A0779K769r688M437J255r202P57k0235Q894K3257O486j9283p21M069j7322
5414a3748L245K2153k04l8856K558L5949J6799k4103n1827L1218M2122R815M119
5401C9240k0829k8854j8562j18J6505J8550M781k2400M221K3337p869r486J124
5388c60O85J6410M676n78n46k5015k2615k667O474l503m09R369Q387q960k5350
5373d4002j5053j4592n528q923J2124J593n68K844K3637P172Q879J7908J2874
5360a635J1258P319M156l768j1742K233k8206l2973J9689J5405j1599m52j1903
5347d2218K496K8470j1915p941J0603j7662J0105j2477j9475J0187N133n71K1244
5334b4021K9629O852k7103J4612J1079l9475P753q368R022M0487J1255j7295k0232
$$ plain form
5321 -5805 -12324 6271 13791 -11758 15816 32795 2548 -1474 -17233 -32629 -34149 -36528 -43669
5308 -43669 -40597 -8925 17969 17227 35289 33377 3136 -1298 11038 6738 11498 28650 33051
5295 33051 4671 18630 41295 53852 46890 37625 8187 -13577 -41500 -12389 2878 -16358
5283 -16358 -17916 -2606 23169 25577 -18672 -42738 -25399 -7861 -20684 -34531 -28046 -41492
5271 -41492 -35183 -24437 -40549 -10971 -1870 2161 -27282 -55672 -46402 -40432 -60744 -49259 -11639
5258 -11639 -9124 104 2901 2372 4498 -6369 -4504 -25288 -29219 16906 22896 -2759 -13631 -18933
5244 -18933 -21691 -20367 -23617 -23311 -13817 -10391 -12984 -6635 6088 3449 -3182 -4453 1819 -8026 5686
5229 5686 14110 -4349 -4525 -32472 -56294 -64649 -59753 -53067 -25950 -19392 -10067 -34151 -21495 -19211
$$ packed form
5321e805o519J8595P520k5549K7574J6979l0247m022j5759j5396j520k379p141
5308d3669L072L1672K6894p42J8062j912l0241m434J2336m300M760J7152M401
5295C3051k8380J3959K2665J2557o962r265k9438k1764k7923K9111J5267j9236
5283a6358j558J5310K5775K408m4249k4066J7339J7538j2823j3847O485j3446
5271d1492O309J0746j6112K9578R101M031k9443k8390R270N970k0312J1485L7620
5258a1639K515R228K797n29K126j0867J865k0784l931M6125N990k5655j0872n302
5244a8933k758J324l250L06R494L426k593O349J2723k639o631j271O272r845J3712
5229E686Q424j8459j76k7947k3822q355M896O686K7117O558R325k4084J2656K284
$$ plain form
5215 -19211 -28769 -18156 -27595 -21114 -8944 -18332 -17946 23669 29390 8012 -11063 -15851 -8143 -3072
5201 -3072 4050 -15542 -39061 -44884 -5407 -37987 -45727 -19781 24461 33768 34616 19046 28902
5188 28902 28632 33836 19859 1034 -19899 -725 1636 9499 5098 -3876 -14475 -35580 -21812
5175 -21812 -4659 2812 31473 43426 56222 80463 55085 2767 -12301 -22854 -3094 10534
5163 10534 -16311 -17415 -20855 -31277 -14198 -16135 -29733 -18767 11180 -10723 -3280 12169 35324
5150 35324 30199 7224 1100 -6383 -2662 4739 -12783 -1076 26243 1680 -8069 -22163 -40501
5137 -40501 -6668 -3617 -24274 -25682 7847 17510 11106 -359 -22797 -32868 -31461 -47736 -85048
5124 -85048 -100433 -86879 -46629 -37869 -15649 11365 27437 16027 -23070 -17816 -8731 228 17942
$$ packed form
5215a9211r558J0613r439O481J2170r388L86M1615N721k1378j9075m788P708N071
5201c072P122j9592k3519n823L9477l2580p740K5946M4242R307Q48j5570R856
5188B8902k70N204j3977j8825k0933J9174K361P863m401q974j0599k1105J3768
5175b1812J7153P471K8661J1953J2796K4241k5378n2318j5068j0553J9760J3628
5163A0534k6845j104l440j0422J7079j937j3598J0966K9947k1903P443J5449K3155
5150C5324n125k2975o124p483L721P401j7522J1707K7319k4563r749j4094j8338
5137d0501L3833L051k0657j408L3529R663o404j1465k2438j0071J407j6275l7312
5124h5048j5385J3554M0250Q760K2220K7014J6072j1410l9097N254R085Q959J7714
$$ plain form
5111 17942 -16593 -26484 -28590 -33010 -19859 -15660 -11883 -10469 -15957 -24560 -23773 -36966 -29886 -13314
5097 -13314 -1888 -13102 4234 25373 29443 -1919 -17799 -24989 -52560 -28188 1345 -2126
5085 -2126 1605 -9551 -38241 -35065 -23512 -36624 -31203 -27304 -5812 -8729 -19347 -17588 -1501
5072 -1501 -6166 -6859 -8367 -12225 -16328 -20665 -21135 -5879 20950 22903 37140 49451 60881 40103
5058 40103 30879 23525 7597 3858 15058 31760 18097 7480 -13478 -31014 -39438 -40184 -23285
5045 -23285 -18495 -13001 -28267 -18439 -3554 1670 -33369 -49553 -35370 -17149 -5351 25446 21328
5032 21328 21701 33059 6295 -1320 8 -11565 -34733 -23956 -4695 991 -14051 -8413 6639
5019 6639 7035 -1599 -9908 27501 24363 -770 -14868 -32190 -14111 14122 27585 6501 -1687
$$ packed form
5111A7942l4535r891k106m420J3151M199L777J414n488q603P87j3193P080J6572
5097a3314J1426j1214J7336K1139M070l1362j5880p190k7571K4372K9533l471
5085b126L731j1156k8690L176J1553j3112N421L899K1492k917j0618J759J6087
5072a501m665o93j508l858m103m337m70J5256K6829J953J4237J2311J1430k0778
5058D0103r224p354j5928l739J1200J6702j3663j0617k0958j7536q424p46J6899
5045b3285M790N494j5266R828J4885N224l5039j6184J4183J8221J1798L0797m118
5032B1328L73J1358k6764p615J328j1573k3168J0777J9261N686j5042N638J5052
5019F639L96q634q309L7409l138k5133j4098j7322J8079K8233J3463k1084q188
$$ plain form
5006 -1687 -14752 -4017 4149 14687 23906 9018 9279 16287 15543 13049 1825 13266 34046 39815
4992 39815 45231 37677 28618 23760 19123 -348 -9559 -36219 -36311 -24424 -2686 -3508 -29996 -26622
4978 -26622 -135 -7399 -31624 -37423 -34108 -24509 -16016 -7319 -3734 -18541 -18941 -32704 -27548 -26736
4964 -26736 -21781 8516 3160 -18431 -10390 -15978 -13502 7704 -22587 -13812 13716 43727 34541
4951 34541 2250 6821 16104 35497 40058 24085 11730 21571 49210 67888 40260 16235 -2850
4938 -2850 -4173 3636 22547 25416 8499 -12230 -5919 -5333 -9381 3257 23968 53962 51667 24753
4924 24753 13818 5466 1325 4693 -14979 8787 28775 6967 -18738 -18035 -20995 -13098 -13602 5256
4910 5256 2767 -22955 -15847 8688 -437 -14476 -3052 4613 -16621 -31746 -31795 -12514 8387
$$ packed form
5006a687j3065J0735Q166J0538R219j4888K61P008p44k494j1224J1441K0780N769
4992C9815N416p554r059m858m637j9471r211k6660r2J1887K1738q22k6488L374
4978b6622K6487p264k4225n799L315R599Q493Q697L585j4807m00j3763N156Q12
4964b6736M955L0297n356k1591Q041n588K476K1206l0291Q775K7528L0011r186
4951C4541l2291M571R283J9393M561j5973j2355R841K7639J8678k7628k4025j9085
4938b850j323P809J8911K869j6917k0729O311N86m048J2638K0711K9994k295k6914
4924B4753j0935q352m141L368j9672K3766J9988k1808k5705P03k960P897n04J8858
4910E256k489k5722P108K4535r125j4039J1424P665k1234j5125m9J9281K0901
$$ plain form
4897 8387 8671 -7779 -20738 -33017 -27303 1351 7997 4362 7856 20900 34404 11775 -9846
4884 -9846 -10599 -15907 -10780 -5985 11422 -24632 -47328 -46270 -63568 -62522 -73951 -80518 -76140 -84142
4870 -84142 -90615 -78198 -56045 -48864 -41843 -36863 -55844 -87194 -90333 -43348 -23995 -17738 6080
4857 6080 13736 -37060 -53629 -35012 -16091 2741 32632 39896 19184 -1735 10033 20897
4845 20897 10465 4168 13194 26234 9203 -47317 -67174 -72339 -80969 -59853 -48789 -43440 -21154
4832 -21154 -11062 6231 680 4576 -10031 -17174 -37793 -32333 -2736 -1560 -21871 -39873 -46128
4819 -46128 -29742 -37364 -32422 -43939 -44934 -27187 -26757 -39236 -15011 -6792 -29522 -48705 -45008
4806 -45008 -35375 -46988 -37386 -35761 -23656 -13405 -31384 -25837 -21409 -17956 -12788 -1152 27654
$$ packed form
4897H387K84j6450j2959j2279N714K8654O646l635L494J3044J3504k2629k1621
4884i846p53n308N127M795J7407l6054k2696J058j7298J046j1429o567M378q002
4870h4142o473J2417K2153P181P021M980j8981l1350l139M6985J9353O257K3818
4857F080P656n0796j6569J8617J8921J8832K9891P264k0712k0919J1768J0864
4845B0897j0432o297R026J3040j7031n6520j9857n165q630K1116J1064N349K2286
4832b1154J0092J7293n551L896j4607p143k0619N460K9597J176k0311j8002o255
4819d6128J6386p622M942j1517r95J7747M30j2479K4225Q219k2730j9183L697
4806d5008R633j1613R602J625J2105J0251j7979N547M428L453N168J1636K8806
$$ plain form
4793 27654 46482 30529 -4184 -30390 -25108 -20287 -13747 5452 -843 29383 47751 44820 50998
4780 50998 41528 34926 41178 37750 24656 -6171 -29145 -15800 -32555 -29008 -31068 -19267 -18730
4767 -18730 -33644 -36274 -21988 -4045 -30506 -34940 -10013 13256 -12617 -17188 6154 -5114
4755 -5114 -15807 -27259 -27977 -45885 -29687 -18776 15276 16243 -247 2166 -19031 -315 -16572
4742 -16572 -24015 -27242 -23958 -37308 -41506 -42426 -34020 -17565 13393 14135 28499 14118 6326 15178
4728 15178 -1734 -12240 -4759 -8766 -27563 -50202 -53923 -27965 -9558 5568 11550 17675 4293
4715 4293 8900 7949 6046 2252 -5126 970 20511 41103 15714 2232 -1124 -2633 -387 -5031
4701 -5031 -9221 31545 42121 44993 31430 9748 -15019 -17794 -16750 -25009 -20105 -18020 -33305
$$ packed form
4793B7654J8828j5953l4713k6206N282M821O540J9199o295L0226J8368k931O178
4780E0998r470o602O252l428j3094l0827k2974J3345j6755L547k060J1801N37
4767a8730j4914k630J4286J7943k6461m434K4927K3269k5873m571K3342j1268
4755e114j0693j1452p18j7908J6198J0911L4052R67j6490K413k1197J8716j6257
4742a6572p443l227L284j3350m198r20Q406J6455L0958P42J4364j4381p792Q852
4728A5178j6912j0506P481m007j8797k2639l721K5958J8407J5126N982O125j3382
4715D293M607r51j903l794p378O096J9541K0592k5389j3482l356j509K246m644
4701e031m190M0766J0576K872j3563k1682k4767k775J044q259M904K085j5285
$$ plain form
4688 -33305 -44210 -29708 -25824 -4854 21440 22142 28031 15454 -5445 -22731 -10090 -10979 1429
4675 1429 -1976 -15385 -23296 -8307 8175 18067 17489 -3229 2840 16760 20440 -1680 -6376 -11434
4661 -11434 -19556 -10434 -6934 7956 7059 -3939 -30875 -49377 -15361 5352 8780 7550 21075
4648 21075 10530 4692 4101 -13731 -18497 -5045 25861 29258 39815 7432 -20559 -8932 3245
4635 3245 -11929 -24377 -16066 -2328 4348 -12271 -29711 -2181 25189 689 9759 28308 12243
4622 12243 -14604 -36449 -39094 -17669 7613 16164 6475 -9179 -18004 -14641 -18401 5596 10048
4609 10048 -1242 5479 16119 27470 13886 15463 24517 5691 -15664 -21756 -21523 -1252 -7473
4596 -7473 -7718 -15738 -237 3388 6794 -18665 -32566 -55508 -42335 -2677 8244 26575 16257
$$ packed form
4688c3305j0905J4502L884K0970K6294P02N889j2577k0899j7286J2641q89J2408
4675A429l405j3409p911J4989J6482R892n78k0718O069J3920L680k2120m696n058
4661a1434q122R122L500J4890q97j0998k6936j8502L4016K0713L428j230J3525
4648B1075j0545n838n91j7832m766J3452L0906L397J0557l2383k7991J1627J2177
4635C245j5174j2448Q311J3738O676j6619j7440K7530K7370k4500R070J8549j6065
4622A2243k6847k1845k645K1425K5282Q551r689j5654q825L363l760K3997M452
4609A0048j1290O721J0640J1351j3584J577R054j8826k1355o092K33K0271o221
4596g473k45q020J5501L625L406k5459j3901k2942J3173L9658J0921J8331j0318
$$ plain form
4583 16257 -36767 -43033 -25760 -2899 35461 41826 289 -17764 -33875 -50056 -51325 -48829 -31491
4570 -31491 -18904 -11310 1364 48990 47164 43343 35087 18447 28268 -2404 412 1963 -10710
4557 -10710 -33240 -7712 21775 -6560 6772 13961 17108 11694 -5300 25493 38543 26640
4545 26640 12552 -28310 -58962 -28305 4490 15924 24695 16135 25270 29970 38512 26972 17526
4532 17526 25923 26390 -2288 -6597 10045 12529 33258 -2826 -39068 -33928 -15169 -3286 -13446
4519 -13446 -26801 -33564 -48830 -54008 -49266 -21077 -11438 -8897 -2991 -8015 -9160 3082 -20061
4506 -20061 -53046 -43792 -18752 -15000 -19614 -13659 3204 16156 14390 26348 31084 -2349 -9599
4493 -9599 33143 42489 42027 21871 18102 11280 -4768 -11854 -15874 -24317 -4129 14779 24858 22198
$$ packed form
4583A6257n3024o266J7273K2861L8360O365m1537j8053j6111j6181j269K496J7338
4570c1491J2587P594J2674M7626j826l821q256j6640R821l0672K816J551j2673
4557a0710k2530K5528K9487k8335J3332P189L147n414j6994L0793J3050j1903
4545B6640j4088m0862l0652L0657L2795J1434Q771q560R135M700Q542j1540r446
4532A7526Q397M67k8678m309J6642K484K0729l6084l6242N140J8759J1883j0160
4519a3446j3355o763j5266n178M742K8189R639K541N906n024j145J2242k3143
4506b0061l2985R254K5040L752m614N955J6863J2952j766J1958M736l3433p250
4493i599M2742R346m62k0156l769o822j6048p086m020q443K0188J8908J0079k660
$$ plain form
4479 22198 12370 -27001 -38306 -18606 -8953 -1399 -8094 -2517 -9030 -6372 3446 3034 -11831 -7325
$$ packed form
4479B2198r828l9371j1305J9700R653P554o695N577o513K658R818m12j4865M506
$$ [...]
##END NTUPLES=NMR SPECTRUM
##END=
