##TITLE=Analysis number 329776
Compound Code cc 64722
Book Reference 544/98/1
Project Code adrs
Chemist Name stuartg
##JCAMPDX= 6.0         $$ Bruker NMR JCAMP-DX V2.0
##DATA TYPE= NMR SPECTRUM
##DATA CLASS= NTUPLES
##ORIGIN= Bruker BioSpin GmbH
##OWNER= nmr
$$ XWIN-NMR		Version 3.5
$$ Thu Sep 27 10:03:31 2007 GMT Daylight Time (UT+1h)  MAYBRIDGE\nmr@NMR_250MHZ
##.OBSERVE FREQUENCY= 250.131544655141
##.OBSERVE NUCLEUS= ^1H
##.ACQUISITION MODE= SIMULTANEOUS (DQD)
##.ACQUISITION SCHEME= undefined
##.AVERAGES= 16
##.DIGITISER RES= 18
##SPECTROMETER/DATA SYSTEM= dpx250
##.PULSE SEQUENCE= zg30
##.SOLVENT NAME= CDCl3
##.SHIFT REFERENCE= (INTERNAL, CDCl3, 0, 16.522)
##AUDIT TRAIL= $$ (NUMBER, WHEN, WHO, WHERE, WHAT)
$$ ##TITLE= Audit trail, XWIN-NMR		Version 3.5
$$ ##JCAMPDX= 5.01
$$ ##ORIGIN= Bruker BioSpin GmbH
$$ ##OWNER= nmr
$$ C:\u/data/dgb/nmr/ADRS/2590/pdata/1/auditp.txt
$$ ##AUDIT TRAIL=  $$ (NUMBER, WHEN, WHO, WHERE, WHAT)
(   1,<2007-09-27 10:03:07.75 +100>,<MAYBRIDGE\nmr>,<NMR_250MHZ>,
      <created by zg, POWCHK disabled, PULCHK disabled
       configuration hash MD5:
       76 6E 9A 78 1E 09 19 81 EC 84 63 8F B0 6A 59 2D
       data hash MD5: 64K
       5C 81 29 3E 34 BF 42 F3 E8 F1 2C 24 4B EC 25 EE>)
(   2,<2007-09-27 10:03:22.55 +100>,<MAYBRIDGE\nmr>,<NMR_250MHZ>,
      <Start of raw data processing
       ef LB = 0.3 FT_mod = 6 PKNL = 1 SI = 32K 
       data hash MD5: 32K
       5A D1 75 EE 80 C3 CD 08 1C 51 21 E1 37 84 CC 62>)
(   3,<2007-09-27 10:03:24.08 +100>,<MAYBRIDGE\nmr>,<NMR_250MHZ>,
      <apk 
       data hash MD5: 32K
       3B 71 0E EB 1D ED 8A 6D 3D 9B 09 70 A0 8D 34 56>)
(   4,<2007-09-27 10:03:24.89 +100>,<MAYBRIDGE\nmr>,<NMR_250MHZ>,
      <abs ABSG = 5 
       data hash MD5: 32K
       69 C9 3F 33 A0 C0 63 3D A0 44 77 A6 D3 C5 CC 96>)
$$ ##END=
$$ 
$$ hash MD5
$$ C6 34 4E 6C F8 79 46 EF 61 46 0F C6 F8 E1 F1 5F
##$RELAX= 
##$RELAX= 
##$RELAX= 
##$RELAX= 
##$RELAX= 
##$RELAX= 
##$RELAX= 
$$ Bruker specific parameters
$$ --------------------------
##$DU= <C:\u>
##$EXPNO= 2590
##$NAME= <ADRS>
##$PROCNO= 1
##$TYPE= <nmr>
##$USER= <dgb>
##$AMP= (0..31)
100 100 100 100 100 100 100 100 100 100 100 100 100 100 100 100 100 100 
100 100 100 100 100 100 100 100 100 100 100 100 100 100 
##$AQSEQ= 0
##$AQ_mod= 3
##$AUNM= <au_zg>
##$AUTOPOS= <50 >
##$BF1= 250.13
##$BF2= 250.13
##$BF3= 250.13
##$BF4= 250.13
##$BF5= 500.13
##$BF6= 500.13
##$BF7= 500.13
##$BF8= 500.13
##$BYTORDA= 1
##$CFDGTYP= 0
##$CFRGTYP= 5
##$CHEMSTR= <none>
##$CNST= (0..31)
1 1 145 1 1 1 1 1 1 1 1 1 1 1 1 1 1 1 1 1 1 1 1 1 1 1 1 1 1 1 1 1 
##$CPDPRG= <>
##$CPDPRG1= <>
##$CPDPRG2= <>
##$CPDPRG3= <>
##$CPDPRG4= <mlev>
##$CPDPRG5= <mlev>
##$CPDPRG6= <mlev>
##$CPDPRG7= <mlev>
##$CPDPRG8= <mlev>
##$CPDPRGB= <>
##$CPDPRGT= <>
##$D= (0..31)
0 1 0 0 0 0 0 0 0 0.06 0 0 0 0 0 0 0.0002 0 0 0 0 0 0 0 0 0 0 0 0 0 0 
0 
##$DATE= 1190883786
##$DBL= (0..7)
120 120 120 120 120 120 120 120 
##$DBP= (0..7)
150 150 150 150 150 150 150 150 
##$DBP07= 0
##$DBPNAM0= <>
##$DBPNAM1= <>
$$ [...]
##$SUBNAM7= <"">
##$SUBNAM8= <"">
##$SUBNAM9= <"">
##$SW= 20.6930455092707
##$SWIBOX= (0..15)
0 0 3 0 0 0 0 0 0 0 0 0 0 0 0 0 
##$SW_h= 5175.983436853
##$TD= 65536
##$TD0= 1
##$TE= 295.16
##$TE2= 300
##$TE3= 300
##$TEG= 300
##$TL= (0..7)
0 120 120 120 120 120 120 120 
##$TP= (0..7)
150 150 150 150 150 150 150 150 
##$TP07= 0
##$TPNAME0= <>
##$TPNAME1= <>
##$TPNAME2= <>
##$TPNAME3= <>
##$TPNAME4= <>
##$TPNAME5= <>
##$TPNAME6= <>
##$TPNAME7= <>
##$TPOAL= (0..7)
0.5 0.5 0.5 0.5 0.5 0.5 0.5 0.5 
##$TPOFFS= (0..7)
0 0 0 0 0 0 0 0 
##$TUNHIN= 0
##$TUNHOUT= 0
##$TUNXOUT= 0
##$USERA1= <user>
##$USERA2= <user>
##$USERA3= <user>
##$USERA4= <user>
##$USERA5= <user>
##$V9= 5
##$VALIST= <valist>
##$VCLIST= <CCCCCCCCCCCCCCC>
##$VD= 0
##$VDLIST= <DDDDDDDDDDDDDDD>
##$VPLIST= <PPPPPPPPPPPPPPP>
##$VTLIST= <TTTTTTTTTTTTTTT>
##$WBST= 1024
##$WBSW= 4
##$XGAIN= (0..3)
0 0 0 0 
##$XL= 0
##$YL= 0
##$YMAX_a= 543981
##$YMIN_a= -613261
##$ZGOPTNS= <>
##$ZL1= 120
##$ZL2= 120
##$ZL3= 120
##$ZL4= 120
##$ABSF1= 16.522
##$ABSF2= -4.171173
##$ABSG= 5
##$ABSL= 3
##$ALPHA= 0
##$AQORDER= 0
##$ASSFAC= 0
##$ASSFACI= 0
##$ASSFACX= 0
##$ASSWID= 0
##$AUNMP= <proc_1d>
##$AZFE= 0.1
##$AZFW= 0.1
##$BCFW= 0
##$BC_mod= 0
##$BYTORDP= 0
##$COROFFS= 0
##$CY= 12.5
##$DATMOD= 1
##$DC= 0
##$DFILT= <>
##$DTYPP= 0
##$F1P= 14.0000005364418
##$F2P= -0.99999901652339
##$FCOR= 0.5
##$FTSIZE= 32768
##$FT_mod= 6
##$GAMMA= 0
##$GB= 0
##$INTBC= 1
##$INTSCL= 1
##$ISEN= 128
##$LB= 0.3
##$LEV0= 0
##$LPBIN= 0
##$MAXI= 10000
##$MC2= 0
##$MEAN= 0
##$ME_mod= 0
##$MI= 0
##$NCOEF= 0
##$NC_proc= -1
##$NLEV= 6
##$NOISF1= 0
##$NOISF2= 0
##$NSP= 0
##$NTH_PI= 0
##$NZP= 0
##$OFFSET= 16.522
##$PC= 1
##$PHC0= 157.4533
##$PHC1= 8.022128
##$PH_mod= 1
##$PKNL= yes
##$PPARMOD= 0
##$PSCAL= 4
##$PSIGN= 0
##$REVERSE= no
##$SF= 250.13
##$SI= 32768
##$SIGF1= 0
##$SIGF2= 0
##$SINO= 400
##$SIOLD= 32768
##$SREGLST= <1H.CDCl3>
##$SSB= 0
##$STSI= 32768
##$STSR= 0
##$SW_p= 5175.98343685301
##$SYMM= 0
##$S_DEV= 0
##$TDeff= 65536
##$TDoff= 0
##$TI= <Analysis number 999999
Compound Code 99
Book Reference 9
Project Code 9>
##$TILT= no
##$TM1= 0
##$TM2= 0
##$TOPLEV= 0
##$USERP1= <user>
##$USERP2= <user>
##$USERP3= <user>
##$USERP4= <user>
##$USERP5= <user>
##$WDW= 1
##$XDIM= 32768
##$YMAX_p= 321807787
##$YMIN_p= -66756
$$ End of Bruker specific parameters
$$ ---------------------------------
##NTUPLES= NMR SPECTRUM
##VAR_NAME=  FREQUENCY,     SPECTRUM/REAL,   SPECTRUM/IMAG
##SYMBOL=    X,             R,               I
##VAR_TYPE=  INDEPENDENT,   DEPENDENT,       DEPENDENT
##VAR_FORM=  AFFN,          ASDF,            ASDF
##VAR_DIM=   32768,         32768,           32768
##UNITS=     HZ,            ARBITRARY UNITS, ARBITRARY UNITS
##FACTOR=    0.157963299565203, 1,           1
##FIRST=     4132.6476996994, 0,             0
##LAST=      -1043.33573715361, 0,           0
##MIN=       -1043.33573715361, -66756,      0
##MAX=       4132.6476996994, 321807787,     0
$$ Real data points
##PAGE= N=1
##DATA TABLE= (X++(R..R)), XYDATA
$$ [...]
19499D189K995M454r93o933k189R73P03O977K979n750m685k240l660O87J383N898
$$ 4189 7184 11638 10645 3712 1523 2496 3199 10176 13155 7405 2720 480 -3180 -2493 -1110 4788
19483D788K050k198K458k318J485L194o8p655k531n994J766K965m688m15k64N003
$$ 4788 6838 4640 7098 4780 6265 9459 9391 1736 -795 -6789 -5023 -2058 -6746 -7161 -7425 -2422
19467b422Q96k94k878l781M774k628o510L380L998l671Q680L779k719N36J088
$$ -2422 -1526 -1820 -4698 -8479 -3705 -6333 -12843 -9463 -5465 -9136 -456 3323 604 1140 2228
19452B228m730m303N099k43j669L424L62r39N706J362L535k151q467m37K593k156
$$ 2228 -2502 -6805 -1706 -1949 -3618 -194 168 -771 4935 6297 9832 7681 -786 -1223 1370 -786
19436g86k737j535J756K509j066j202L308L320o684l846L89n473j490M707N916
$$ -786 -3523 -5058 -3302 -793 -1859 -3061 247 3567 -3117 -6963 -6574 -12047 -13537 -8830 -2914
19421b914M095l920o380K048P194N95j0037L198l38N691J0092j0887o596j1083
$$ -2914 1181 -2739 -9119 -7071 123 718 -9319 -6121 -6459 -768 9324 -1563 -8159 -19242
19407a9242n430O771N815L773N156k392l233L535Q089L401j497j211l401j1031
$$ -19242 -24672 -17901 -12086 -8313 -3157 -5549 -8782 -5247 2842 6243 4746 3535 134 -10897
19393a0897m223K421M414M005O825K533k36M590m444j077Q52P555K472q216j0324
$$ -10897 -15120 -12699 -8285 -4280 2545 5078 4842 9432 4988 3911 4763 12318 14790 6574 -3750
19378c750l072J683O040J946o526k818m672Q360J198M839N752j581n022n349R32
$$ -3750 -6822 -5139 901 2847 -3679 -6497 -11169 -2809 -1611 3228 8980 7399 2377 -2972 -2040
19363b040m652L679O834r79j382p560j1220M280R680k83M283O260k422k979K319
$$ -2040 -6692 -3013 3821 2842 1460 -6100 -17320 -13040 -3360 -3643 640 6900 4478 1499 3818
19348C818K710k27k661m714q57J675l73k139K764L186l718j490k223K915k679
$$ 3818 6528 6301 3640 -1074 -1931 -256 -629 -2768 -4 3182 -536 -2026 -4249 -1334 -4013
19333d013m943J541R059J537n013L249L083M49q77K352k585J318K83K871k476
$$ -4013 -8956 -7415 1644 3181 -1832 1417 4500 4949 4072 6424 3839 5157 5440 8311 5835
19318E835j450p066j1415M077O072K038k550l834K169Q967l29k90L121o295p558
$$ 5835 4385 -2681 -14096 -10019 -3947 -1909 -4459 -8293 -6124 2843 2514 2224 5345 -950 -8508
19303h508M756J1373k194K04L062J019O809j286N61k735k206r88l472k275M272
$$ -8508 -3752 7621 5427 5631 8693 9712 16521 15235 15796 13061 10855 9867 6395 4120 8392
19288H392M409K51o242m987O194j733l796n258j024K302o574j49K398J024N176
$$ 8392 12801 13052 6810 1823 8017 6284 2488 -2770 -3794 -1492 -8066 -8215 -5817 -4793 383
19273C83P448j488p298l76j544o76o251p215M859L401O518O10O986O138k882J109
$$ 383 7831 6343 -955 -1331 -2875 -3551 -9802 -17017 -12158 -8757 -2239 -1629 5357 11495 8613 9722
19257I722O615M86m270j1015l746oN131p41J01j608K024j022k071N304J781J636
$$ 9722 16337 16823 12553 1538 -2208 -2214 2917 2176 2277 669 2693 1671 -400 4904 6685 8321
19241H321k774o338j711K133O88k461k332L493P731j111n822P63J0426M308o006
$$ 8321 5547 -791 -2502 -369 319 -2142 -4474 -981 6750 5639 -183 580 11006 15314 9308
19226I308n819q647R81M332m94l901Q01R30J142o29j152M086J07K850K637L318
$$ 9308 3489 -5158 -4177 155 -339 -4240 -3439 -2509 -1367 -1996 -3148 938 1045 3895 6532 9850
19210I850L293J795k159l270n911p549m923k631k1M513J704j885N430N118k032
$$ 9850 13143 14938 12779 9509 3598 -3951 -8874 -11505 -11526 -7013 -5309 -7194 -1764 3354 1322
19195A322m303L502j167l97j366N564M803q60k605l99P909l324j703P725P5r46
$$ 1322 -2981 521 -646 -1043 -2409 3155 7958 7098 4493 4094 12003 8679 6976 14701 14776 13830
19179A3830k901P70n192n152o636Q88P717L294J24L414m185m590n712M67R564
$$ 13830 10929 11699 6507 1355 -5281 -4393 3324 6618 6742 10156 5971 1381 -4331 -3864 5700
19164E700R081%n308r814M204j713j1461n116L764l183k016l062Q776O119J080
$$ 5700 14781 14781 9473 -341 3863 2150 -9311 -14427 -10663 -13846 -15862 -18924 -10148 -4029 -2949
19149b949O524K196k698o687n19P122K736m632n986M935M953M352l734r26L359
$$ -2949 3575 5771 3073 -3614 -4133 2989 5725 1093 -4893 42 4995 9347 5613 4687 8046
19134H046R70m069l896o476O66K043L95m484M641J6609P104r962j2839q290j1673
$$ 8046 9016 4947 1051 -5425 -4759 -2716 -2321 -6805 -2164 14445 21549 11587 -1252 -9542 -21215
19119b1215K585P706j116k369O297P065J640m143m066L586J897M94N444l243m541
$$ -21215 -18630 -10924 -12040 -14409 -8112 -1047 593 -3550 -7616 -4030 -2133 -1639 3805 562 -3979
19104c979O896O757J2048O720m242p675m981K500K881j2195l911l1l95L354o561
$$ -3979 2917 9674 21722 28442 24200 16525 11544 14044 16925 4730 819 788 393 3747 -2814
19089b814K39M506r544j646J142j525M028K840J259L989K688l292k227N178O299
$$ -2814 -2575 1931 -7613 -9259 -8117 -9642 -5614 -2774 -1515 2474 5162 1870 -357 4821 11120
19074A1120o236M384K122j0805k960P175K459J64M908N132o503m364n000l36J529
$$ 11120 4884 9268 11390 585 -2375 4800 7259 7423 12331 17463 10960 6596 1596 1260 2789
19059B789J618n622r81M369K599J0675J2388k062p928p60J7O443P908q8N596P234
$$ 2789 4407 -1215 -2196 2173 4772 15447 27835 25773 17845 17085 17102 23545 31453 31365 36961 44195
19043D4195O210P933J3124K6045L2705M5275N5326N6617L8983j9397p1412o0910
$$ 44195 50405 58338 71462 97507 130212 175487 230813 287430 326413 307016 235604 174694
19031A74694l9952k5645j8153r161O074K3533L6055M7911N5700M7605N640n2490
$$ 174694 134742 109097 90944 81783 87857 111390 147445 195356 251056 298661 304301 251811
19019B51811p2549m7271l4198l1984j9781p962n567j1999r708J998l682N94M992
$$ 251811 179262 131991 97793 65809 46028 38066 32499 20500 10792 12790 9108 9702 14694
19006A4694L040p133k031l02M727J345k741k024p683R042M148j866o484L641l552
$$ 14694 17734 10601 8570 8268 12995 14340 11599 9575 1892 10934 15082 13216 6732 10373 6821
18991F821n948K209O793L663n797m313L712J125L041l247k10j458J271N83n124
$$ 6821 873 3082 9875 13538 7741 3428 7140 8265 11306 8059 7849 6391 7662 8245 3121
18976C121m138L000m91k262M098j745j565L279K60j772k605J171O076k234K493
$$ 3121 -1017 1983 1492 -770 3328 1583 18 3297 3557 1785 -820 351 6427 4193 6686
18961F686l114r807P62J11L058k626O451O267k767O356K997l382n838j663L057
$$ 6686 3572 -6235 -5473 -5362 -2304 -4930 1521 7788 5021 11377 14374 10992 5154 3491 6548
18946F548k391j150M400q93J796l60j675m211K241J620K974J2235o739j4399J491
$$ 6548 4157 3007 7407 6514 8310 7950 6275 2064 4305 5925 8899 21134 14395 -4 1487
18931A487n675j1227L693J1817N354j882M005o654J867J349K516K860q946L611
$$ 1487 -4188 -15415 -11722 95 5449 3567 7572 918 2785 4134 6650 9510 564 4175
18917D175K274r588j0309R15K927O153O120o2N359P27K69l010p10r535k560j785
$$ 4175 6449 -3139 -13448 -12533 -9606 -3453 2667 2605 7964 8691 8960 5950 5240 -4295 -6855 -8640
18901h640L307n35k003j385J953l17N294l028m12K787O261P661j611k525L645
$$ -8640 -5333 -5868 -7871 -9256 -7303 -7620 -2326 -5354 -5766 -2979 3282 10943 9332 6807 10452
18886A0452p571k740l202M248J644J990m384p757L087L740O748N924j28J093j311
$$ 10452 2881 141 -3061 1187 2831 4821 437 -7320 -4233 -493 6255 12179 12051 13144 11833
18871A1833L492J524k499k882n347l148l70l016l746K170K908J512l800P928P197
$$ 11833 15325 16849 14350 11468 6121 2973 2603 -413 -4159 -1989 919 2431 -1369 6559 13756
18856A3756r91j320j0305n362O990J4149O761j813l338J205r106r255j08k36j094
$$ 13756 12765 11445 1140 -4222 2768 16917 23678 21865 18527 19732 10626 1371 1263 1027 -67
18841f7J93k882m772M962N217l606J109J187K889P638j263o499K878P843l2l570
$$ -67 126 -2756 -7528 -2566 2651 -955 154 1341 4230 11868 10605 4106 6984 14827 14795 11225
18825A1225R35l189O499K156p415j2387o27M991L710K4K108K942K635L059m581
$$ 11225 12160 8971 15470 17626 10211 -2176 -2803 2188 5898 5922 8030 10972 13607 16666 12085
18810A2085j1094l651l253M908J23k665l21l991l144M86K025R02Q259R965l870
$$ 12085 991 -2660 -5913 -1005 -882 -3547 -3868 -7859 -11003 -10517 -8492 -7590 669 10634 6764
18795F764p264J327l446o705M734M737M17K7l38o93k95M268J1839L048l929m592
$$ 6764 -500 827 -2619 -9324 -4590 147 564 591 253 -440 -735 3533 15372 18420 14491 9899
18779I899p17l07j052k106k039J613Q93l294N573J3836J2547J8082J1999J129
$$ 9899 9182 8875 7823 5717 3678 5291 6184 2890 8463 22299 34846 52928 64927 66056
18765F6056j998j6403j4816j1769l410n582M785R47j099j078L067m62o124l367
$$ 66056 64058 47655 32839 21070 17660 12078 16863 17810 16711 15633 18700 18238 12114 8747
18751H747O294N07j532n911n515M58Q212p29j0428n225L546N722M794j852l216
$$ 8747 15041 15548 14016 8105 2590 3048 11260 10531 103 -5122 -1576 4146 8940 7088 3872
18736C872M480r89P27m757o144O443K828j099n851P42Q120K231k660J845m263
$$ 3872 8352 7363 8090 3333 -2811 3632 6460 5361 -490 252 8372 10603 7943 9788 5525
18721E525l717K202M828m446m967k093Q040K977J586J632P685O450k109j878q184
$$ 5525 1808 4010 8838 4392 -575 -2668 5372 8349 9935 11567 19252 25702 23593 21715 13531
18706A3531o721m576L430N904K541n263n130J904P325M808m794j0401j0572p63
$$ 13531 6810 2234 5664 11568 14109 8846 3716 5620 12945 17753 12959 2558 -8014 -8777
18692h777P757K809l871k963l330l47L551P251J857k282m157j022j0203p11J1124
$$ -8777 -1020 1789 -2082 -5045 -8375 -8722 -5171 2080 3937 1655 -2502 -3524 -13727 -14438 -3314
18677c314m366r88J079N325N308N635L016k661k84p961q212P84J0124O629Q258
$$ -3314 -7680 -8668 -7589 -2264 3044 8679 11695 9034 8750 789 -7423 -6639 3485 10114 18372
18662A8372k851M61K57l702M964L345N36q23m662j424o132r473M517k326l228
$$ 18372 15521 15982 16239 12537 17501 20846 21382 20559 15897 14473 8341 -1132 3385 1059 -2169
18647b169O633j429o008K059M272K579K620n407M983J6051J4024k655R13j915
$$ -2169 4464 3035 -2973 -914 3358 5937 8557 3150 8133 24184 38208 35553 36466 34551
18633C4551j326P753P947p63o562j3255o368N85M001J327p595M072J0016J0869
$$ 34551 33225 40978 48925 48162 41600 28345 21977 22562 26563 27890 20295 24367 34383 45252
18619D5252L107L176n597j000j2570k656q041n320N1o815q797l578M203J0155
$$ 45252 48359 51535 45938 44938 32368 29712 21671 16351 16402 9587 790 -2788 1415 11570
18605A1570Q720q37m911O11O56K268K388m071n660q242J929R971R19L667n671
$$ 11570 20290 19453 14542 15153 15809 18077 20465 16394 10734 2492 4421 14392 15311 18978 13307
18590A3307j371N129J057J818n326o280L852J348K188j568n307J748M211p846
$$ 13307 11936 17065 18122 19940 14614 8334 12186 13534 15722 14154 8847 10595 14806 6960
18576F960n861o37K072Q160P367P022L378j815Q617O682k184r072k286l00q475
$$ 6960 1099 462 2534 10694 18061 25083 28461 26646 35263 41945 39761 30689 28403 28103 19628
18561A9628j177n154n847N010J286j163M944j633P39l645J277l222J975o164j418
$$ 19628 18451 13297 7450 12460 13746 12583 17527 15894 16633 12988 14265 11043 13018 6854 5436
18546E436J0397K735K763N957L458Q55Q92l739M02k49j562K286J2121J1382l854
$$ 5436 15833 18568 21331 27288 30746 31601 32493 28754 29156 28907 27345 29631 41752 53134 49280
18531D9280k262Q40p364j0442n826k378N398P787n887n923n572R648J0704J393
$$ 49280 47018 47858 40494 30052 24226 21848 27246 35033 29146 23223 17651 27299 38003 39396
18517C9396M48L94l847m373J404j807m735k662n056j852J041J3188J3073M462
$$ 39396 39844 40238 36391 32018 33422 31615 26880 24218 19162 17310 18351 31539 44612 49074
18503D9074N883J0821J1282L83n412p165p509q636m223l032P89J2702Q784O904
$$ 49074 54957 65778 77060 77443 72031 64866 57357 48721 44498 41466 42255 54957 63741 70645
18489G0645j072k227k954q824o761l278k228J110J797O338K707N50J32l171j706
$$ 70645 69573 67346 64392 55568 48807 45529 43301 44411 46208 52546 55253 55803 55935 52764 51058
18474E1058J446L45m836R111P597p329m173J0250O641J997L840k095r89k870J576
$$ 51058 52504 52849 48013 57124 64721 57392 53219 63469 70110 72107 75947 73852 72863 69993 71569
18459G1569M359R261Q168O598N466R65J985Q36j60l539L623P535M966m571Q788
$$ 71569 75928 85189 93357 99955 105421 106386 108371 109207 109047 105508 109131 116666 121632 117061 125849
18444A25849J903k200J58m68k426n013n973K359J0008Q811N735P753J4331J6446
$$ 125849 127752 125552 125710 125242 122816 117803 111830 114189 124197 133008 138743 146496 160827 177273
18430A77273K567L904J2577K1231L353k007O438J8231K3786M8798O4677O1350
$$ 177273 179840 183744 196321 217552 220905 218898 225336 243567 267353 316151 380828 442178
18418D42178O1117L7415m025l7260l4975j0646J4673J9462M5338N4996Q6473J23292
$$ 442178 503295 540710 536685 499425 464450 453804 468477 487939 533277 588273 674746 798038
18406G98038J27018J28506J04982L6507n5537o1857J1454P7202J05834J35243
$$ 798038 925056 1053562 1158544 1195051 1139514 1077657 1089111 1166313 1272147 1407390
18396A407390J56829J52937J71980K72678L83486M80266N49327N60387O12279
$$ 1407390 1564219 1717156 1889136 2161814 2545300 3025566 3574893 4135280 4747559
18387D747559P88698J110007J586893K314627L568501N619271P926147R473452
$$ 4747559 5536257 6646264 8233157 10547784 14116285 19735556 27661703 37135155
18379C7135155J0364322Q515907j511404j2279499j2529355p983167m410589k098907
$$ 37135155 47499477 56015384 54503980 42224481 29695126 21711959 17301370 15202463
18371A5202463m20681J220976L348231O010075Q265600R466233R790944M282256
$$ 15202463 14781782 16002758 19350989 25361064 33626664 43092897 52883841 57166097
18363E7166097q183895j4796143j1554241p191579m485633k993664k041031j376064
$$ 57166097 48982202 34186059 22631818 15440239 10954606 7960942 5919911 4543847
18355D543847r17239o22499m66884l22422j92808j51582j71423j49492j12482
$$ 4543847 3626608 3004109 2537225 2214803 2021995 1870413 1698990 1549498 1437016
18346A437016j03739j44525j69069j19681n5438l740K8378M3222O0948L0145m4086
$$ 1437016 1333277 1188752 1019683 900002 844564 840824 869202 912424 973372 1003517 959431
18335I59431j33950j53499j19318q2306n7740l5785j1886J1512J2830J8858L0752
$$ 959431 825481 671982 552664 470358 412618 376833 364947 376459 389289 408147 438899
18324D38899L2620K5426l72n2493p6353n6588m9363m3907k6207k2981j0280n936
$$ 438899 471519 496945 496573 444080 367727 311139 261776 217869 191662 168681 158401 152465
18312A52465r287n670k714J879O838j244K650o620j3850j9314q140o016m893n434
$$ 152465 143178 137508 134794 136673 143511 142267 144917 138297 124447 105133 96993 90977 86084 80650
18298H0650q732L298J574l641q725r27j97K939j723n199k7O525M223n895k624
$$ 80650 71918 75216 76790 73149 64424 63497 63300 66239 64516 59317 59290 65815 70038 64143 61519
18283F1519k864j741j429q346k056L490K055L628k538o569O565P29o701M482l983
$$ 61519 58655 56914 55485 47139 45083 48573 50628 54256 51718 45149 51714 52443 45742 50224 46241
18268D6241n147L044k911j11J1962K925j270q636p249n403r41q597q542m003K002
$$ 46241 41094 44138 41227 41116 53078 56003 54733 46097 38848 33445 32504 23907 15365 11362 13364
18253A3364N592P951L812r2m966l263Q18N522J096l59J652n29N457J0880n170
$$ 13364 18956 26907 30719 30627 25661 22398 23216 28738 29834 29475 31127 30598 36055 46935 41765
18238D1765k82K09J368k83n984J138m459l240K391j741O420N456m150l695k216
$$ 41765 41483 41692 43060 42777 36793 37931 33472 30232 32623 30882 37302 42758 38608 34913 32697
18223C2697j4352j2177L813M352M501L875n621k381n074j81M485J858m199j0163
$$ 32697 18345 6168 9981 14333 18834 22709 17088 14707 9633 9452 13937 15795 11596 1433
18209A433l747J464J3927k861j68P299R049q186r250L698J1263K27l454J938L660
$$ 1433 -2314 -850 13077 10216 10048 17347 26396 18210 8960 12658 23921 24148 20694 22632 26292
18194B6292l611J0281N505p728n787r039m419J0448J217J908L966J1801P442N823
$$ 26292 22681 32962 38467 30739 24952 15913 11494 21942 23159 25067 29033 40834 48276 54099
18180E4099J553j773o71O945J5417J8055J6278O663j0009k8816j8689p467l753
$$ 54099 55652 53879 53208 60153 75570 93625 109903 116566 106557 77741 59052 51585 47832
18167D7832o099m592N697P915J3329J6794J8871J4390R59j6191j3564j8265j8394
$$ 47832 41733 37141 42838 50753 64082 80876 99747 114137 115096 98905 85341 67076 48682
18154D8682j2890j877K777J197k389k703M882Q346J702l570j306k388k518K181
$$ 48682 35792 33915 36692 37889 35500 32797 37679 46025 47727 44157 42851 40463 37945 40126
18140D0126M879R062P248L058J740N816O045P465J0104L734R609K4189K9647J9318
$$ 40126 45005 54067 61315 64373 66113 71929 77974 85439 95543 99277 108886 133075 162722 182040
18126A82040J6793K7300N1184N7691P3360J00873J16234J20383J33236J68172
$$ 182040 198833 226133 277317 335008 408368 509241 625475 745858 879094 1047266
18116A047266K43514L49573N22043Q46983J324148J765369K002908K102215J060635
$$ 1047266 1290780 1640353 2162396 3009379 4333527 6098896 8101804 10204019 11264654
18107A1264654j530334l022327k385359j459222q85141n63762l81070k61777j81923
$$ 11264654 9734320 6711993 4326634 2867412 1982271 1418509 1037439 775662 593739
18098E93739j19714r4793p5993m5938l3043j7625j9999k2318k7276j7954j1875
$$ 593739 474025 379232 303239 257301 224258 206633 186634 164316 137040 119086 107211
18087A07211q146J08l633j1161p526n415q965J122q893p786n250L329L888L213
$$ 107211 99065 99173 95540 84379 76853 71438 62473 63595 54702 46916 41666 44995 48883 52096
18073E2096n017L817O109n805o836p249l465o924r456R084L134O737l779K00K322
$$ 52096 47079 50896 57005 51200 44364 37115 33650 26726 17270 26354 29488 36225 32446 32646 34968
18058C4968j0055q108K450J153M939P494P658m906p599j0783l857j744k288j835
$$ 34968 24913 16805 19255 20408 25347 32841 40499 35593 27994 17211 13354 11610 9322 7487
18044G487k998j625k799P77k550M085P845J412n347l636K830J323q88m487l719
$$ 7487 4489 2864 65 842 -1708 2377 10222 11634 6287 2651 5481 6804 5916 1429 -2290
18029b290L632M635O313M898p011k898M298L176L364J973m055m282l304n971J028
$$ -2290 1342 5977 12290 17188 10177 7279 11577 14753 18117 20090 16035 11753 8449 2478 3506
18014C506K943L420L850j652R38n48j3360q618N704J5170R335j559r654q855r79
$$ 3506 6449 9869 13719 12067 13005 12457 -903 -9521 -3817 11353 20688 19129 9475 620 -359
17999c59L947N455N940J215r65j275o310L8J243K26l341L436L555P14o214k085
$$ -359 3588 9043 14983 16198 15233 13958 7648 7686 8929 9155 5814 9250 12805 13519 7305 5220
17983E220P007k457J776Q500j66o377l716j19k953L311O514N447p279l927l229
$$ 5220 12227 9770 11546 20046 19880 13503 9787 9668 6715 10026 16540 21987 14708 10781 7552
17968G552j326J436o55l623n666q369O063K911l122P07R94J956M260n891M22J311
$$ 7552 6226 7662 7007 3384 -2282 -10651 -4588 -1677 -4799 -4092 -3098 -1142 3118 -2773 -2351 -1040
17952a040k774l983m786Q12J1725R200r929m696O484N688m003j133q90L14l258
$$ -1040 -3814 -7797 -12583 -11771 -46 9154 -775 -5471 1013 6701 2698 1565 675 989 -2269
17937b269m163M073O015m39K173L823o846r326L199L557N59l114J799K839O430
$$ -2269 -6432 -2359 3656 3217 5390 9213 2367 -6959 -3760 -203 356 -2758 -959 1880 8310
17922H310l91l96O494K876q279l812n745j356n138M101P670j648l328k158L399
$$ 8310 7919 7523 14017 16893 8614 4802 -943 -2299 -7437 -3336 4334 2686 -642 -2800 599
17907E99N599j58n421j322J259K387P275J1350J897R24K251N348Q853P596K0633
$$ 599 6198 6040 619 -703 556 2943 10218 21568 23465 24389 26640 31988 40841 48437 69070
17892F9070K2109K0876L6961N2017N2183N6089J1470n3849p8403n7456k8958l111
$$ 69070 91179 112055 149016 201033 253216 309305 320775 266926 188523 131067 102109 98998
17880I8998N911K080Q857K4347M2867M9610M8198K7586l5118p2798o8864m5112
$$ 98998 104909 106989 115846 140193 183060 232670 280868 308454 273336 200538 131674 86562
17868H6562k4340p931r653n123r522o038o739o219J376L613j526o45k249j1442
$$ 86562 62222 54291 44638 39515 29993 23955 17216 10997 12373 15986 14460 13815 11566 124
17854A24q301K657P450O356n92j298k119o307N077N914J347o95J12J203K345o33
$$ 124 -8177 -5520 1930 8286 7694 6396 4277 -2030 3047 8961 10308 9613 9725 10928 13273 12640
17838A2640r304K237J58k725l286N448M407R80m338n530N14k565M899J1250K308
$$ 12640 3336 5573 5731 3006 -280 5168 9575 10555 6217 687 1201 -1364 3535 14785 17093
17823A7093L912o84p457n019m49N492O592j0577r930n477O275N678k225l734m779
$$ 17093 21005 20321 12864 7845 7396 12888 19480 8903 -1027 -6504 -229 5449 3224 -510 -5289
17808e289M880K820Q077P382J353r198l249L86r294l319k595R2q3R919o624r169
$$ -5289 -409 2411 10488 17870 19223 10025 6776 7162 -2132 -5451 -8046 -7954 -8037 1882 -4742 -13911
17792a3911P806O920p87p974M246N23J463K368L449m11j384K346O781N81k163
$$ -13911 -6105 815 28 -7946 -3700 -3177 -1714 654 4103 3692 2308 4654 11435 12016 9853
17777I853L85J947L726n442m882k661m947M82K43q529n931o022M775P235m57j0173
$$ 9853 10238 12185 15911 10469 5587 2926 -2021 -1539 -1296 -9825 -15756 -21778 -17003 -9768 -10225 -20398
17761b0398J670O204J4585Q661K503o824m653L278p01o059L123j786j785j523
$$ -20398 -18728 -12524 2061 10722 13225 6401 1748 5026 4325 -1734 1389 -397 -2182 -3705
17747c705k309r26J740N103n301r535M054L052J440p86L067j334J286J69J0259
$$ -3705 -6014 -6940 -5200 -97 -5398 -14933 -10879 -7827 -6387 -7173 -4106 -5440 -4154 -3985 6274
17732F274N90K227L023m804k367L218L273Q369O667P828L684p717L270J1913J2714
$$ 6274 6864 9091 12114 7310 4943 8161 11434 19803 26470 34298 37982 30265 33535 45448 58162
17717E8162J2078K2433L9793M5636M7154N1504J9004l6396p1154m8954k6641k4065
$$ 58162 70240 92673 132466 178102 225256 276760 295764 259368 188214 139260 112619 88554
17705H8554p824J3898J6086K6473M2565M3979M6443L7746j2320n6170p1582n4349
$$ 88554 80730 94628 110714 137187 179752 223731 270174 307920 295600 239430 167848 113499
17693A13499l1308k0595j5517j6428j562K560n580o044o336q606n98N604L777
$$ 113499 82191 61596 46079 29651 28089 30649 25069 19025 12689 4083 3485 9089 12866
17680A2866P25m802j3666l791J3765K421l80Q708k880k358O138m777r167o427
$$ 12866 13591 8789 -4877 -8668 5097 7518 7138 15846 12966 10608 16746 11969 2802 -3625
17666c625L693R394Q530k974q67k269l23l635m676L084P01n73l719j832L357Q253
$$ -3625 68 9462 17992 15018 14151 11882 11559 7924 3248 6332 7033 6460 2741 909 4266 12519
17650A2519J1480P987p136J126J162N721n61p495r315q156j340l010O567J463
$$ 12519 23999 31986 24850 25976 27138 32859 32298 24803 15488 7332 5992 2982 9549 11012
17636A1012j356M062L661L142J692L905k592j215k08j4935j1328J595j899L10
$$ 11012 9656 13718 17379 20521 22213 26118 23526 22311 22103 7168 -4160 -2565 -4464 -4154
17622d154P258N576k550m858l995M223Q82k469J165m751P78K379K424L108K195
$$ -4154 3104 8680 6130 1272 -2723 1500 2382 -87 1078 -3673 -2895 -516 1908 5016 7211
17607G211k019k384l151O340k606j5K845J553j0983N253J5467O860j573r071j1846
$$ 7211 5192 2808 -343 5997 3391 3376 6221 7774 -3209 2044 17511 24371 22798 13727 1881
17592A881k405J580M065M72L78J372m867n158j859k048J0476N799N21M430K788
$$ 1881 -524 1056 5121 5593 5971 7343 2476 -2682 -4541 -6589 3887 9686 10207 14637 17425
17577A7425K458o98j417m926p946M006J0332K744O87j440J666Q632j606p711r036
$$ 17425 19883 19185 17768 12842 4896 8902 19234 21978 22665 21225 22891 31523 29917 22206 13170
17562A3170m211K735L332l160L434J1707J1933R809M671N33K172q700j2022j5926
$$ 13170 8959 11694 15026 11866 15300 27007 38940 48749 53420 53953 56125 47425 35403 19477
17548A9477j0500k961Jj733J182j526L521O260J315q631m088L178K612M030L490
$$ 19477 8977 6016 6017 4284 5466 3940 7461 13721 15036 6405 2317 5495 8107 12137 15627
17533A5627q86L736O81M781j012j0017J365pj595K826K878j482K076K140j3923
$$ 15627 14741 18477 19158 23939 22927 12910 14275 14268 12673 15499 18377 16895 18971 21111 7188
17518G188q475j737L548O339Q875L361K092k910J480K984j052P04J196k751o158
$$ 7188 -1287 -3024 524 6863 15738 19099 21191 18281 19761 22745 21693 22397 23593 20842 14684
17503A4684j3815J028M468M072k5O56j276k192j35Q49L472q09j588k031N799j210
$$ 14684 869 1897 6365 10437 10412 11068 9792 7600 7465 8314 11786 10977 9389 7358 13157 11947
17487A1947j45n013o286J777j929M913J2507K661K384n628j211L574O20l069J612
$$ 11947 11802 6789 503 2280 351 5264 17771 20432 22816 17188 15977 19551 20171 17102 18714
17472A8714O42O5P361K134n058q400J59O936L560o51j949n36n0r83o654M697R105
$$ 18714 19356 19421 26782 28916 23858 15458 15617 22553 26113 25462 23513 22977 22927 21944 15290 19987 29092
17455B9092n318K657l881j834P153p526M312J1231R726L684M036J796J3790J3169
$$ 29092 23774 26431 22550 20716 27869 20343 24655 35886 45612 49296 53332 55128 68918 82087
17441H2087K701l322p035j3236o093J637M772L81j902k767k129p346N824M736
$$ 82087 84788 81466 74431 61195 55102 56739 61511 61892 59990 57223 55094 47748 53572 58308
17427E8308q70M079l694o661q673M726j086k62J23J132M389n450j1471q978k269
$$ 58308 57438 61517 57823 51162 42489 47215 46129 45867 45990 47122 51511 46061 34590 25612 23343
17412B3343O343P940J475M384M547L601k802j154R956K587P19L504K146N083k206
$$ 23343 29686 37626 39101 43485 48032 51633 48831 47677 57633 60220 60939 64443 66589 71672 69466
17397F9466J657P435J250N688R35j219k003j788P128L387M337r62K97N360l72
$$ 69466 71123 78558 79808 85496 86431 85212 83209 81421 88549 91936 96273 95311 95608 100968 100596
17382A00596M598j171l146j893j3248o965j793O621R359j237N33J1429J1379P834
$$ 100596 105194 104023 100877 98984 85736 78771 76978 83599 92958 91721 92254 103683 115062 122896
17368A22896J4955J3915J4036R594m383J297R068M626r75r58J0056J7204J2662
$$ 122896 137851 151766 165802 175396 171013 172310 181378 186004 185029 184071 194127 211331 223993
17355B23993K2331L0428K0584K4677L4475M2512M9688N8954P1790R1947J08891
$$ 223993 246324 276752 297336 322013 356488 399000 448688 507642 579432 671379 780270
17344G80270J24211R0317K9145k9055o4237m5502j04M4568P8238J10554J41201
$$ 780270 904481 994798 1023943 994888 930651 885149 885045 929613 1007851 1118405 1259606
17333A259606J72738K11916K91988L50785L85079M32752M96868N56658O43572
$$ 1259606 1432344 1644260 1936248 2287033 2672112 3104864 3601732 4158390 4801962
17324D801962Q10770J079116J456636K075809L198379N164438P629929R418220
$$ 4801962 5612732 6691848 8148484 10224293 13422672 18587110 26217039 35635259
17316C5635259J0407413R801517J436713j0781453j3568457r124965n106077k622950
$$ 35635259 46042672 55844189 57280902 46499449 32930992 23806027 18699950 16077000
17308A6077000r02076O97224K677560N224330P548641Q829757R542305O136819
$$ 16077000 15174924 15872148 18549708 23774038 31322679 40152436 49694741 55831560
17300E5831560n246895j4179048j2366018p800038m798042l116975k077384j386614
$$ 55831560 50584665 36405617 24039599 16239561 11441519 8324544 6247160 4860546
17292D860546r06154o27813n16941m20021k78360k07580k19119j97870j38384
$$ 4860546 3954392 3326579 2809638 2389617 2111257 1903677 1684558 1486688 1348304
17283A348304q4183n4486n3583q2926r9023p5447l8544j3842l873j9932p4550
$$ 1348304 1264121 1209635 1156052 1073126 974103 898656 860112 846270 842397 822465 747915
17272G47915q8821o1227j7944l94J5994j377n4901q1554o4937m9465l2388k9351
$$ 747915 659094 597867 579923 579529 595523 594146 539245 457691 392754 343289 310901 281550
17260B81550k6272j0599q208j1374j0928j1007k3636k4334q454r65k032n377m399
$$ 281550 255278 244679 236471 225097 214169 203162 179526 155192 146738 145773 143741 138364 133965
17247A33965L233R00k727K555O10r847k723m557j3877r660n743r582n505J543
$$ 133965 137198 138098 135371 137926 138536 128689 125966 121409 107532 97872 92129 82547 77042 78585
17233G8585L368l111n550M07L58k048L68l396J420K673j956o971p456O654L296
$$ 78585 81953 78842 73292 73699 74057 72009 72377 68981 70401 73074 71118 64147 56691 63345 66641
17218F6641k92j353l006m041J496l285k911J0701N504J4138J3769J3031K524j0630
$$ 66641 66349 64996 61990 57949 59445 56160 53249 63950 69454 83592 97361 110392 112916 102286
17204A02286j8006j4142k820m700p463j0253j0760n874k428M016J911N278K669
$$ 102286 84280 70138 67318 62618 55155 44902 34142 28268 25840 29856 31767 37045 39714
17191C9714m943J44j943n768L590K098L057p398q338Q610L992p041J201L492J802
$$ 39714 34771 34915 32972 27204 30794 32892 35949 28551 20213 28823 32815 25774 26975 30467 32269
17176C2269j471L721M048k817K727J161n725j1418l224L559J985l266Q47p12o114
$$ 32269 30798 34519 38567 35750 38477 39638 33913 22495 19271 22830 24815 21549 22396 21684 15570
17161A5570J236o04p139n512l651M812O808k119J311P50l29l289j054o160p747
$$ 15570 16806 16202 9063 3551 -100 4712 11520 9401 10712 11462 11133 7844 6790 630 -7117
17146g117m949k011l082Q730N020L595O069J266n454m223N95J728O30Q555N629
$$ -7117 -12066 -14077 -17159 -8429 -3409 186 6255 7521 2067 -2156 -1561 167 797 9352 14981
17131A4981J785O128J215l356k417k861n585L625J416p894m687P557P213m052
$$ 14981 16766 22894 24109 20753 18336 15475 9890 13515 14931 7037 2350 9907 17120 13068
17117A3068m174J828P441l899j016o617p604L386L024n429j152r21Q217J0253
$$ 13068 8894 10722 18163 14264 13248 6631 -973 2413 5437 8 -1144 -2065 6152 16405
17103A6405k047m848Q06O928l7q168o45N509K314n237j878m672Q00N367k911n529
$$ 16405 14358 9510 10316 17244 17207 9039 8394 13903 16217 10980 9102 4430 5230 10597 7686 2157
17087B157L418N257M455J018p488l642P368l964m872p55n772q594K676Q700J746
$$ 2157 5575 10832 15287 16305 8817 5175 12543 8579 3707 2952 -2820 -11414 -8738 -38 1708
17072A708m591N103M395l169K982M563o542p778P344N644j77o911m702R50l771
$$ 1708 -2883 2220 6615 3446 6428 10991 4449 -3329 4015 9659 9482 2571 -2131 -1181 -4952
17057d952Q7n619L172J609L305K462L476m21o575P363K730O75M558M168p635N452
$$ -4952 -4865 -10484 -7312 -5703 -2398 64 3540 3119 -3456 3907 6637 7312 11870 16038 8403 13855
17041A3855K384m270J912J090K990l807j977J262m109l11l637j871N376L064j226
$$ 13855 16239 11969 13881 14971 17961 14154 12177 13439 9330 9019 5382 3511 8887 11951 10725
17026A0725j188p779r011j034l17p43K340j323j128O156K903K794N892j736L507
$$ 10725 9537 1758 -7253 -8287 -8604 -9347 -7007 -8330 -9458 -3302 -399 2395 8287 6551 10058
17011A0058l158r998p007L301L121J944Q034R381m310o426K236O087L163J339
$$ 10058 6900 -3098 -10105 -6804 -3683 -1739 6295 15676 11366 4940 7176 13263 16426 17765
16997A7765n770K776j779M383M79j573l592q20n179l717J686M068j573n621K449
$$ 17765 11995 14771 12992 17375 17854 16281 12689 11869 6690 2973 4659 8727 7154 1533 3982
16982C982p494o462m714J694R041O125J496J1288K1021J9874K2002K1506o087
$$ 3982 -3512 -9974 -14688 -12994 -3953 2172 3668 14956 35977 55851 77853 99359 93272
16969I3272j9780j0879j3506j9703j3144n221J70k996m373j042J96r68j309K657
$$ 93272 73492 62613 49107 29404 16260 11039 11209 8213 3840 2798 2994 2026 717 3374
16955C374k09j415k111k52n12l634O85R650l392j0187k299K524l245l247P479
$$ 3374 3165 1750 -361 -613 -1125 -4759 -4074 5576 2184 -8003 -10302 -7778 -11023 -14270 -6791
16940f791P894k979J221j53R33l525n984l460k845O39O675L784j362N777O844
$$ -6791 1103 -1876 -655 -808 125 -3400 -9384 -12844 -15689 -15050 -8375 -4591 -5953 -176 6668
16925F668K51m39q541J297L296K361l773K462N501p526j052k05o28j138l422J874
$$ 6668 6919 6480 -2061 -764 2532 4893 1120 3582 9083 1557 505 300 -328 -1466 -4888 -3014
16909c014P949N220n312l154K097j048N178Q68K77m105k904N608K387j740j42
$$ -3014 4935 10155 4843 1689 3786 2738 7916 8784 9061 4956 2052 7660 10047 8307 8165
16894H165M0j0992J53k065q844O950Q736J306L584p80j667m035n637o812O05k025
$$ 8165 8205 -2787 -2634 -4699 -13543 -6593 2143 3449 7033 6253 4586 551 -5086 -11898 -11293 -13318
16878a3318n869k24K134K674O433K193o483q094l486N650R807o504j901J627O523
$$ -13318 -19187 -19411 -17277 -14603 -8170 -5977 -12460 -20554 -24040 -18390 -8583 -15087 -16988 -15361 -8838
16863h838R828L985r77l102m020K402l548n439p569k274l619J462Q019P319O175
$$ -8838 990 4975 3998 896 -3124 -722 -4270 -9709 -17278 -19552 -23171 -21709 -13690 -6371 -196
16848a96k596k879J366n08r953l864k969j569n47M324J0878J0643n073r224M113
$$ -196 -2792 -5671 -4305 -4813 -14766 -18630 -21599 -23168 -23715 -19391 -8513 2130 -2943 -12167 -8054
16833h054J75K186o075l544O168L707K487J359J914J517j328j363L652L170l497
$$ -8054 -7879 -5693 -11768 -15312 -9144 -5437 -2950 -1591 323 1840 512 -851 2801 5971 2474
16818B474j082o589m221J747J862m527l068L432K137Q350j729p178L008J233Q45
$$ 2474 1392 -5197 -9418 -7671 -5809 -10336 -13404 -9972 -7835 515 -1214 -8392 -5384 -4151 -3306
16803c306j094p170O154p18j082M948K44J004k776j933p550J131M338m971l598
$$ -3306 -4400 -11570 -5416 -6134 -7216 -2268 -2024 -1020 -3796 -5729 -13279 -12148 -7810 -12781 -16379
16788a6379L308K998k620r262M367P701K305R19M344L402n883p59l085j557O19
$$ -16379 -13071 -10073 -12693 -21955 -17588 -9887 -7582 -6663 -2319 1083 -4800 -5559 -8644 -10201 -9582
16773i582N832P808J071n371p905O26O599l853j194M327N75J061l366k057N033
$$ -9582 -3750 4058 5129 -242 -8147 -7521 -922 -4775 -5969 -1642 -1067 -6 -3372 -5429 -396
16758c96M129m46M320O745k272n699m089j95K970J261L058J2108J5364l970m291
$$ -396 3733 3287 7607 14352 12080 6381 2292 2097 5067 6328 9386 21494 36858 32888 28597
16743B8597M829J7406L0667L3286M6141N2271N3850L8357k2065o7238n6744l6403
$$ 28597 33426 50832 81499 114785 160926 213197 267047 305404 283339 216101 159357 122954
16731A22954k5626j3285r5J2859J3710K8964L6058M6424M9592J1744m8640o8746
$$ 122954 97328 84043 83948 96807 110517 139481 175539 221963 271555 283299 234659 165913
16719A65913n8658m4869j9318j5366r922j240p074N438n498o701j853K054j325
$$ 165913 107255 62386 43068 27702 17780 16540 9466 14904 9406 2705 852 2906 1581
16706A581K442L737p76n561n747p763Q949L333j290m03j238N046J737m995m17
$$ 1581 4023 7760 6984 1423 -4324 -12087 -3138 195 -1095 -1498 -2736 2310 4047 -948 -1365
16691a365M894K418k349n085K291O173l007o187L126J142m700l296K9O632j004
$$ -1365 3529 5947 3598 -1487 804 6977 3970 -2217 909 2051 -2649 -5945 -5916 716 -288
16676b88L144L252L360m201p027l3J357o4O950K884o67l965K684p35K808M469
$$ -288 2856 6108 9468 5267 -1760 -1793 -436 -500 6450 9334 8667 4702 7386 6651 9459 13928
16660A3928R37k321k504l631m097n128j659k304O656L428j911p163k397Q63q828
$$ 13928 14865 12544 10040 6409 2312 -2816 -4475 -6779 -123 3305 1394 -5769 -8166 -7303 -16131
16645a6131L510k483L588P984O117k340l915m325oR796N627m590M222J255p07
$$ -16131 -12621 -15104 -11516 -3532 2585 245 -3670 -7995 -8001 1795 7422 2832 7054 8309 7602
16630G602K145k91K306l938m05J33K365j45o739O99j824l746o753l194O293J381
$$ 7602 9747 9456 11762 7824 7419 7552 9917 9772 3033 3732 1908 -1838 -8591 -11785 -5492 -4111
16614d111M185J540K181L775p479j425j071k271k212k823J0687L230n181J649
$$ -4111 74 1614 3795 7570 91 -1334 -2405 -4676 -6888 -9711 976 4206 -975 674
16600F74j340M83K160M485L331N577n0l364k088K546j07n384n505j239m179K385
$$ 674 -666 -183 1977 6462 9793 15370 15320 11956 9868 12414 12307 6923 1418 179 -4000 -1615
16584a615N072k146J473l957m367j136L996J798q44k705M643O391K912J56l566
$$ -1615 3457 1311 2784 -1173 -5540 -6676 -2680 -882 -1726 -4431 212 6603 9515 9671 6105
16569F105o291q633k991O062N181O200k953o989n653n389M214M537L696K623j0381
$$ 6105 -186 -8819 -11810 -5748 -567 5633 2680 -4309 -9962 -15351 -11137 -6600 -2904 -281 -10662
16554a0662l347Q377L813Q158M190m267k229p521o345k813P23J077N096P993K820
$$ -10662 -14009 -5632 -1819 6339 10529 6262 4033 -3488 -9833 -12646 -11923 -10846 -5750 2243 5063
16539E063L88k053k912k730j176O31m34J986L167k612Q241K653m790l228K212
$$ 5063 5451 3398 486 -2244 -3420 -2789 -3223 -1237 1930 -682 7559 10212 5422 2194 4406
16524D406Q71k13l124j747n870l379m09j912o92J13K81N852J1820k789n319j106
$$ 4406 5277 5064 1940 193 -5677 -9056 -9465 -11377 -12069 -11956 -11675 -5823 5997 3208 -2111 -3217
16508c217l666p945P61L179K247o55N978N136k070m196k233L505N777P21p030
$$ -3217 -6883 -14828 -14067 -10888 -8641 -9296 -3318 1818 -252 -4448 -6681 -3176 2601 3322 -3708
16493c708m801N729K18n60J133P22l84m612L25n48J450o37O73K271q78m126l585
$$ -3708 -8509 -2780 -2562 -3122 -1989 -1267 -1651 -6263 -5938 -6486 -5036 -5673 -5000 -2729 -3607 -7733 -11318
16476a1318J005L574m611o301J646L859r31N73l207L390O786K332L685l617J096
$$ -11318 -10313 -6739 -11350 -17651 -16005 -12146 -13077 -12504 -15711 -12321 -5535 -3203 482 -3135 -2039
16461b039m864m386q885k026P781L202K880o112l683O101J0929k623j181P100
$$ -2039 -6903 -11289 -20174 -22200 -14419 -11217 -8337 -14449 -18132 -12031 -1102 -3725 -4906 2194
16447B194j882L067q891q548K142j31m839J124K632L565N922K55K150L125N59
$$ 2194 312 3379 -5512 -14060 -11918 -12049 -16888 -15764 -13132 -9567 -3645 -3390 -1240 1885 2444
16432B444l386O91N175K176k860k310m789k07P22k092o1K046K162J553L456O290
$$ 2444 -942 -251 4924 7100 4240 1930 -2859 -3066 -2344 -4436 -4497 -2451 -289 1264 4720 11010
16416A1010r875j940m032m614j812l897P645J1336j298p819j792M970M897O324
$$ 11010 1135 -805 -4837 -9451 -11263 -15160 -7515 3821 2523 -5296 -7088 -2118 2779 9103
16402I103j14m589j2017m312O66j71M741R67l639P674l418n773J539M103K176
$$ 9103 8989 4400 -7617 -11929 -11263 -11434 -6693 -5726 -9365 -1691 -5109 -10882 -9343 -5240 -3064
16387c064m226k296m107L100k162P94Q779L024l305j003Q444J46J168N347K653
$$ -3064 -7290 -9586 -13693 -10593 -12755 -11961 -3182 -158 -3463 -4466 3978 4124 5292 10639 13292
16372A3292j46r328l347o785J521p041o6k477j426J4666O810N62l185l500l044
$$ 13292 13146 3818 471 -6314 -4793 -11834 -11900 -14377 -15803 -1137 5673 6235 3050 -450 -3494
16357c494l818j333Q970O03p279r276K383R989M0m573l175m986q090o170P753
$$ -3494 -7312 -8645 325 928 -6351 -15627 -13244 -3255 -3215 -7788 -10963 -15949 -24039 -30209 -22456
16342b2456N420j688K375J956n131K269J942N743L937R242J838J249m13l615n656
$$ -22456 -17036 -18724 -16349 -14393 -19524 -17255 -15313 -9570 -5633 3609 5447 6696 6283 2668 -2988
16327b988o095M726L953k70l494j935J294K926n417N58J373m050n032p58J4k656
$$ -2988 -9083 -4357 -404 -674 -4168 -6103 -4809 -1883 -7300 -6742 -5369 -9419 -14451 -15209 -15195 -17851
16311a7851l149k210l184K010M068P408Q488O571P06m135k233K384l76j276p509
$$ -17851 -21000 -23210 -26394 -24384 -20316 -12908 -4420 2151 2857 -1278 -3511 -1127 -1503 -2779 -10288
16296a0288R9K591l22n96J260l320J226O617K034k807K82J096K239m49J767n30
$$ -10288 -10189 -7598 -7920 -8516 -7256 -10576 -9350 -2733 -699 -3506 -3224 -2128 111 -338 1429 899
16280H99q98r183n409L265K83j778J386J518j718O325n0N645j412j876n461n444
$$ 899 1 -9182 -14591 -11326 -11043 -12821 -11435 -9917 -11635 -5310 -5360 285 -1127 -3003 -8464 -13908
16264a3908J109l166J699j428O064M240K009m785N572l021j922N807P800J786
$$ -13908 -12799 -15965 -14266 -15694 -9630 -5390 -3381 -8166 -2594 -5615 -7537 -1730 6070 7856
16250G856p727q976J466m748l605p441P205J856L824l165m64L814m71O062J835
$$ 7856 129 -8847 -7381 -12129 -15734 -23175 -15970 -14114 -10290 -13455 -13919 -10105 -10576 -4514 -2679
16235b679n622M99O966N69l23M865N429o328o763m355j192n23L923J24M638m55
$$ -2679 -8301 -7802 -836 -267 -590 4275 9704 3376 -3387 -7742 -8934 -9457 -5534 -5410 -772 -1227
16219a227j176p6K656m53J343k214P61j728j906j942N099L362n854m874n512P459
$$ -1227 -2403 -2479 177 -276 1067 -1147 -386 -2114 -4020 -5962 -863 2499 -3355 -8229 -13741 -6282
16203f282p27m367L228O09m672O208N006L371K016l2N89j418k586J724k985l221
$$ -6282 -7009 -11376 -8148 -7539 -12211 -6003 -997 2374 4390 4358 4947 3529 943 2667 -318 -3539
16187c539o205j751K158P061J096m435K367M369j38l42m14J229j26L921M797k777
$$ -3539 -9744 -11495 -9337 -2276 -1180 -5615 -3248 1121 983 641 227 1456 1330 5251 10048 7271
16171G271o275p47j580j206N278n294m721k59N523N864J512l82N69j609J286M624
$$ 7271 996 249 -1331 -2537 2741 -2553 -7274 -7533 -2010 3854 5366 4984 5553 3944 5230 9854
16155I854m74n360j503R051q899j2825j642K430N84L745M404K270k255l595P189
$$ 9854 9380 4020 2517 11568 2669 -10156 -11798 -9368 -8784 -5039 -635 1635 -620 -4215 2974
16140B974m188l041m692L003J60J531k126j489l245j977Q452L71K590R781m196
$$ 2974 -1214 -4255 -8947 -5944 -5784 -4253 -6379 -7868 -11113 -13090 -4638 -4267 -1677 8104 3908
16125C908o54j248Q29K457L111k701k165K404l927o078L356L990p672j0146O090
$$ 3908 3254 2006 2835 5292 8403 5702 3537 5941 2014 -4064 -708 3282 -4390 -14536 -8446
16110h446K651L409N964J734p680j0597O91J074N344J701j244M512J683o511m52
$$ -8446 -5795 -2386 3578 5312 -2368 -12965 -12274 -11200 -5856 -4155 -5399 -887 796 -5715 -6167
16095f167O03j75l48m403M7k99l884J945K234q631K502Q297J588l008L00L673
$$ -6167 -5564 -5739 -6087 -10490 -10443 -10742 -14626 -12681 -10447 -19078 -16576 -8279 -6691 -9699 -9399 -5726
16079e726r71K19J744p878J626O724O246K502m485n849j781L294j090J716J70
$$ -5726 -6697 -6478 -4734 -12612 -10986 -4262 1984 4486 1 -5848 -7629 -4335 -5425 -3709 -3539
16064c539j607k227K987L258R96k442l424j734m16m13j285l604n57K559J1534
$$ -3539 -5146 -7373 -4386 -1128 -132 -2574 -5998 -7732 -8148 -8561 -9846 -13450 -14007 -11448 86
16049H6J653k740K991J125k763n049J595K747r230p296J0670l2k924K451Q849
$$ 86 1739 -1001 1990 3115 352 -4697 -3102 -355 -9585 -16881 -6211 -6243 -9167 -6716 2133
16034B133M525r9j328M994N67n090p917o011n076J018M012J827j098o186r748
$$ 2133 6658 6559 5231 10225 10792 5702 -2215 -8226 -13302 -12284 -8272 -6445 -7543 -13729 -23477
16019b3477M363N542M711J954L455Q142k446l787L173M297m965l09j557K759K341
$$ -23477 -19114 -13572 -8861 -6907 -3452 4690 2244 -1543 1630 5927 962 653 -904 1855 4196
16004D196R6J644o387L270O140m495O99L961o583j3498j700L983j81N05L600L499
$$ 4196 4292 5936 -451 2819 8959 4464 5163 9124 2541 -10957 -12657 -8674 -8855 -8350 -4750 -1251
15988a251M030K946o98J171j3082J233Q940k649m974P29O96M69n312K2K927M174
$$ -1251 2779 5725 5027 6198 -6884 -5651 3289 640 -4334 -3605 -2909 -2440 -7752 -7730 -4803 -629
15972f29j201J45p22j711J089L690l779l942L159K715J583L188N703l626l145
$$ -629 -1830 -1685 -2407 -4118 -3029 661 -3118 -7060 -3901 -1186 397 3585 9288 5662 2517
15957B517M203M127l22l982j280m179J013J621L824m413o962m418L828M776k395
$$ 2517 6720 10847 10525 6543 5263 1084 2097 3718 7542 3129 -3833 -8251 -4423 353 -2042
15942b042m164L311Qk86N804p430k161N188N774N477J9p849o305l632O93N890
$$ -2042 -6206 -2895 -2887 -3173 2631 -4799 -6960 -1772 4002 9479 9498 1649 -4656 -8288 -7595 -1705
15926a705K790o26p462J856N218K360l116m653K598J908l708K572l5l937l105
$$ -1705 1085 459 -7003 -5147 71 2431 -685 -5338 -2740 -832 -4540 -1968 -2003 -5940 -9045
15911i045m703K770Q979L742j739K309L032k245l263P96n112q486n012O580N838
$$ -9045 -13748 -10978 -1999 1743 4 2313 5345 3100 -163 633 -4479 -12965 -17977 -11397 -5559
15896e559R463n553n253Q197M636m658j0139K643j214j532m333K426J1221J1913
$$ -5559 3904 -1649 -6902 1295 5931 1273 -8866 -6223 -7437 -8969 -13302 -10876 345 12258
15882A2258l671j3456l509n461m52Q58K615K331L518N34j28l721Q30J0177R82
$$ 12258 8587 -4869 -8378 -13839 -14291 -13433 -10818 -8487 -4969 -4435 -4563 -8284 -7454 2723 3705
15867C705j171p481m004J946o80M696o514l618M447N424N71j500k643k785N786
$$ 3705 2534 -4947 -8951 -7005 -7685 -2989 -9503 -13121 -8674 -3250 -2679 -4179 -6822 -9607 -3821
15852c821N115J681p67l306K985p153N10Q382P766m30p952n837M469J0194k419
$$ -3821 1294 2975 2208 -1098 1887 -5266 -4756 3626 11392 10962 3010 -2827 1642 11836 9417
15837I417r174K911L841j532r519k910K876L937o40N91k104l684p96N248J187
$$ 9417 243 3154 6995 5463 -4056 -6966 -4090 -153 -793 -202 -2306 -5990 -6786 -1538 -351
15822c51p133j739N215p805L354N215K639o745l226O623j460l788Q32K538J73
$$ -351 -7484 -9223 -4008 -11813 -8459 -3244 -605 -7350 -10576 -3953 -5413 -9201 -8369 -5831 -5658
15807e658J189O34K223L599j2439o652n648R456K839l262P0J0877P529Q781k413
$$ -5658 -4469 -3835 -1612 1987 -10452 -17104 -22752 -13296 -10457 -13719 -13649 -2772 4757 13538 11125
15792A1125m067K165k495r088O548O421o996o856j469m835Q764L643L840K171
$$ 11125 7058 9223 6728 -2360 4188 10609 3613 -3243 -4712 -9547 -783 2860 6700 8871
15778H871l228j5022m415O597K677l626N536O339J84O634l625m679L405q27m302
$$ 8871 5643 -9379 -13794 -7197 -4520 -8146 -2610 3729 3913 10547 6922 2243 5648 4821 519
15763E19J357J02l351N9L766j194o572j24M106P795m42J66L245p894j0070q833
$$ 519 1876 1978 -1373 -1314 2452 1258 -5314 -5438 -1332 6463 6021 6187 9432 1538 -8532 -17365
15747a7365j261M385O631r238L591N039k05N953L438l677M15l968O7K34M001K463
$$ -17365 -18626 -14241 -7610 -16848 -13257 -8218 -8423 -2470 968 -2709 -2294 -6262 -6195 -5961 -1960 503
15731E03O998J489r008M96O260k730p784p59j46n27J531l952J508n68K89K016
$$ 503 7501 8990 -18 478 6738 4008 -3776 -4535 -4681 -5208 -3677 -7629 -6121 -6689 -6400 -4384
15715d384J944O145k647l729k274o944K146K712Q59m284j436k012L736M745L235
$$ -4384 -2440 3705 1058 -2671 -4945 -11889 -9743 -7031 -6172 -10456 -11892 -13904 -10168 -5423 -2188
15700b188k210L853L85l007L197J517k539k264k66k692k749m951j473K307M131
$$ -2188 -4398 -545 -160 -3167 30 1547 -992 -3256 -3522 -6214 -8963 -13914 -15387 -13080 -8949
15685h949P671N544n766J988R96l638m03j50K750k325P55k61r778r691k849P340
$$ -8949 -1278 4266 -1500 488 1484 -2154 -2557 -2707 43 -2282 -1527 -1788 -11566 -21257 -24106 -16766
15669a6766O332L48L668P993M287m313l818k001M530N112K611k269n26o23n449
$$ -16766 -10434 -10086 -6418 1575 5862 1549 -2269 -4270 260 5372 7983 5714 5188 4565 -884
15654h84o783m002j683M892J2373N182k263k846l763n913K469j603k299L954N27
$$ -884 -7667 -11669 -13352 -8460 3913 9095 6832 3986 223 -5690 -3221 -4824 -7123 -3169 -2642
15639b642Nl995M457J458k240l445q658M703J1603k750j594m211k571k041p33
$$ -2642 -2637 -6632 -2175 -717 -2957 -6402 -15060 -10357 1246 -1504 -3098 -7309 -9880 -11921 -12654
15624a2654J1391J469l256Q814Q030N498j2111j863m553m294R40K837K126r5p651
$$ -12654 -1263 206 -3050 5764 13794 19292 7181 5318 765 -3529 -2589 248 2374 2279 -5372
15609e372J420K431l352K935L800j986R53j268m874M917O591l318l05p943R40
$$ -5372 -3952 -1521 -4873 -1938 1862 -124 829 -439 -5313 -396 6195 2877 2572 -5371 -4431
15594d431J443n385J296J080O836l547p7n670k57n003J320N278o459m884K428
$$ -4431 -2988 -8373 -7077 -5997 839 -2708 -2785 -8455 -8712 -13715 -12395 -7117 -13576 -18460 -16032
15579a6032M064J1287J1796l036r089k884r30Q230Q71Q22l233k540O097O957k982
$$ -16032 -11968 -681 11115 8079 -1010 -3894 -4824 3406 4277 5099 1866 -674 5423 12380 9398
15564I398r581l451j050J219K064J0092k980q516J153N901n620Q65k940m58k65
$$ 9398 -183 -3634 -4684 -3465 -1401 8691 5711 -2805 -1652 4249 -1371 -506 -3446 -3904 -4169
15549d169k790j939L346K148n597j925M558K461J872k433k158k05n515k02M392
$$ -4169 -6959 -8898 -5552 -3404 -9001 -10926 -6368 -3907 -2035 -4468 -6626 -6831 -12346 -12548 -8156
15534h156n359N657P756J696L497L036J757l17K690l465j710r094k112L594Q48
$$ -8156 -13515 -7858 -102 1594 5091 8127 9884 9567 12257 8792 7082 -2012 -4124 -530 318
15519C18P32N40o319K506j286l811j402J886r17l30J848j685n287N389J3454L005
$$ 318 1050 1590 -4729 -2223 -3509 -7320 -8722 -6836 -7753 -8083 -6235 -7920 -13207 -7818 5636 8641
15503H641n415j135q66Q73j720k337k097K470N779m418k598j240m23K81N196L658
$$ 8641 3226 2091 1225 2098 378 -1959 -4056 -1586 4193 -225 -2823 -4063 -4486 -4205 991 4649
15487D649p555M15L291m595o428M733J2852p192j0517p70J1915O788m960m682
$$ 4649 -2906 -2491 800 -3795 -10223 -5490 7362 170 -10347 -11117 798 7586 2626 -2056
15473b056J139m78M055j992J70k584m661p57P732K314o3L285m467j0766M86O392
$$ -2056 -917 -1395 2660 668 838 -1746 -6407 -7164 568 2882 2819 6104 1637 -9129 -8643 -2251
15457b251L858K465k849r23J212k291L17l231l429j207Q375j611l978k217M473
$$ -2251 1607 4072 1223 300 1512 -779 -462 -3693 -7122 -8329 46 -1565 -5543 -7760 -3287
15442c287P626m293J115L657m901q945J137J0078j60j157K594n16j814P38k001
$$ -3287 4339 46 1161 4818 -83 -9028 -7891 2187 2027 870 3464 2948 1134 1872 -129
15427a29K58K678n54q114k323O928l358L252N568K051j0143l241M530M75k127
$$ -129 129 2807 2253 -5861 -8184 -1256 -4614 -1362 4206 6257 -3886 -7127 -2597 -2122 -4249
15412d249R95k248Q769O420p419l485K004O89l272m794P762J117l994m257n658
$$ -4249 -3254 -5502 3267 9687 2268 -1217 787 1476 -1796 -6590 1172 2289 -1705 -5962 -11620
15397a1620M857N430L730L953q1k487q912p375L586N766O478M355L887n017m476
$$ -11620 -6763 -1333 2397 6350 6269 3782 -5130 -12505 -8919 -3153 3325 7680 11567 6550 2074
15382B074m653K679O21L572m388n957K591M055k149j290m852Q523O652m416l347
$$ 2074 -2579 100 721 4293 -95 -6052 -3461 594 -1555 -2845 -7697 826 7478 3062 -285
15367b85l480o473N962L746P90m136l97L698N403j921M912p484j489j485j324
$$ -285 -3765 -10238 -4276 -530 260 -3876 -4273 -575 4828 2907 7819 335 -1154 -2639 -3963
15352c963K434J887N729J597l548k21m468K887r61n451k350L810M498Q98M166
$$ -3963 -1529 358 6087 7684 4136 3915 -553 2334 1373 -4078 -6428 -2618 1880 2778 6944
15337F944l342o811l744K561q48K383R683J653j4439K628N052O67n139J123o088
$$ 6944 3602 -3209 -6953 -4392 -5240 -2857 6826 8479 -5960 -3332 1720 2387 -2752 -1629 -7717
15322g717n569K381k411m683j91J997mR971N804p80m349j914L639j578l136m203
$$ -7717 -13286 -10905 -13316 -17999 -18190 -16193 -16197 -6226 -422 -1202 -5551 -7465 -3826 -5404 -8540 -12743
15306a2743Q31J0476M842l195n051N59N125N670k438k328L490o26o852o703j006
$$ -12743 -11912 -1436 3406 211 -4840 -4281 844 6514 4076 1748 5238 4612 -2240 -8943 -9949
15291i949L694J403N08m492N273r98K265m02M318l70j121n505J587Q63l978j982
$$ -9949 -6255 -4852 -4344 -8836 -3563 -4561 -2296 -2698 1620 1250 129 -5376 -3789 -2926 -6904 -8886
15275h886M117K220J522N616k775r449N506N916l813o954n206q77j256L340J327
$$ -8886 -4769 -2549 -1027 4589 1814 -7635 -2129 3787 -26 -6980 -12186 -13063 -14319 -10979 -9652
15260i652J507N348j408n401m052J129J433lQ000M224l882k32o615j451M414m949
$$ -9652 -8145 -2797 -4205 -9606 -13658 -12529 -11096 -11099 -3099 1125 -2757 -2989 -9604 -11055 -6641 -11590
15244a1590P259K525j461J432j762L201j080m279O27J671M420J628K280k207k753
$$ -11590 -4331 -1806 -3267 -1835 -3597 -396 -1476 -5755 -5128 -3457 963 2591 4871 2664 -89
15229h9j508k599K25j449J534O285L231K589q42L463P357L686n336o393k432r561
$$ -89 -1597 -4196 -3971 -5420 -3886 2399 5630 8219 7377 10840 18197 21883 16547 10154 7722 -1839
15213a839J198m62J653N441o076l168l62K840n48O25k640Q207O364O477K481j1584
$$ -1839 -641 -1103 550 5991 -85 -3253 -3615 -775 -1323 -698 -3338 4869 11233 17710 20191 8607
15197H607o296k60L053M870m127l203P168L48N338J476n377m860m868p506m479
$$ 8607 2311 2051 5104 9974 5847 2644 9812 10160 15498 16974 11597 6737 1869 -5637 -10116
15182a0116k032L234p511j656J0847P356l154j842K33M20O432J838k342k660p771
$$ -10116 -12148 -8914 -16425 -18081 -7234 122 -3032 -4874 -4641 -4221 2211 4049 1707 -953 -8724
15167h724J719j685J139m818K82O412M010M696j947n053l306p20P263J6n652M819
$$ -8724 -7005 -8690 -7551 -12369 -12087 -5675 -1665 3031 1084 -3969 -7275 -7995 -732 -716 -6368 -1549
15151a549R686J489n673K791N249r304m604k356M771N36n800l03N172k118o674
$$ -1549 8137 9626 3953 6744 11993 2689 -1915 -4271 500 1036 -4764 -5067 105 -2013 -8687
15136h687Q1N056k397K274J0340M892j030l582j0608o572j999J0492N763p894
$$ -8687 -8606 -3550 -5947 -3673 6667 11559 10529 6947 -3661 -10233 -12232 -1740 4023 -3871
15122c871o640Q79L189L504P856q817k494L720R022P053k967P72L202k625p461
$$ -3871 -10511 -9632 -6443 -2939 4917 -3900 -6394 -2674 6348 13401 10434 11206 14408 11783 4322
15107D322p59p12m489p459L818J0289L007k963P643m9j4788l567L032l112L711
$$ 4322 3563 2851 -1638 -9097 -5279 5010 8017 5054 12697 12648 -2140 -5707 -2675 -5787 -2076
15092b076J83p177Q6L11L908R100j448j1631m868K617J402M536M395J214n147
$$ -2076 -1893 -9070 -8984 -8673 -4765 4335 2887 -8744 -13612 -10995 -9593 -5057 -662 552 -4595
15077d595l412m35M530l370m260N374M564m281q81J2503K493m140R70K75j0108
$$ -4595 -8007 -8442 -3912 -7282 -11542 -6168 -1604 -5885 -6766 5737 8230 4090 5060 5335 -4773
15062d773J333l51J999P297Q677k040r573k870l677K174M860l553J924j453L995
$$ -4773 -3440 -3791 -1792 5505 14182 12142 2569 -301 -3978 -1804 3056 -497 1427 -26 3969
15047C969P58L04K187j601j786j07l272Q95q85J473J910P745j450j0197R21n06
$$ 3969 4727 5031 7218 5617 3831 3724 452 1347 462 1935 3845 11590 10140 -57 864 358
15031C58M530k427m3p445r69L437K813K440q48n227K430j416k123N236J306N934
$$ 358 4888 2461 2418 -5027 -5996 -2559 254 2694 1846 -3381 -951 -2367 -4490 746 2052 7986
15015G986r512r568K593J0216O139R2L228o614L97l834j528K876l781j068l645
$$ 7986 -1526 -11094 -8501 1715 7854 7946 11174 4560 4957 1123 -405 2471 -1310 -2378 -6023
15000f023J455P017L080O193Q461N164n383n836m349k179K23j0531k115P696n130
$$ -6023 -4568 2449 5529 11722 20183 25347 19964 14128 9779 7600 7823 -2708 -4823 2873 -2257
14985b257p404M891N679m697o576K814K18n70r19N068M708L065L479j968n538
$$ -2257 -9661 -4770 909 -3788 -10364 -7550 -7332 -7902 -8821 -3753 955 4020 7499 5531 -7
14970gl397M943j710o654J1253Q762k158l7P50o881j0114m397P263Q753k033n747
$$ -7 -3404 1539 -171 -6825 4428 13190 11032 10995 11745 4864 -5250 -9647 -2384 6369 4336 -1411
14954a411l2p29K208m885m194K474Q646L577n522m300j62K171k728l375Q767J2025
$$ -1411 -1443 -2172 36 -4849 -9043 -6569 2077 5654 132 -4168 -4330 -2159 -4887 -8262 505 12530
14938A2530l36n217j0491o677J689L960m647q353k990J1642J5805K948j0768j331
$$ 12530 12194 6977 -3514 -10191 -8502 -4542 -9189 -17542 -20532 -8890 6915 9863 -905 -2236
14924b236J714Q255O439q176k7K435p205o35j373n48Q50K827J158K595j096j549
$$ -2236 -522 7733 14172 5996 5969 8404 1199 564 -809 -1357 -507 2320 3478 6073 4977 3428
14908C428P227n291p403N78J0141o273p179M355J919m901l871o4j849J0213K060
$$ 3428 10655 5364 -2039 -1461 8680 2407 -4772 -417 1502 -3399 -7270 -7334 -9183 1030 3090
14893C090n567r221R73j614K171K32j978K722R464K63r579M527J151j794P57M804
$$ 3090 -2477 -11698 -10725 -12339 -10168 -9936 -11914 -9192 272 535 -9044 -4517 -3366 -5160 -4403 401
14877D01M693J280J907N91m577j554k892k647M745K565n495l9l863k906M254j866
$$ 401 5094 6374 8281 8872 4295 2741 -151 -2798 1947 4512 -983 -1022 -4885 -7791 -3537 -5403
14861e403l731N271j251P087j889j0431q476M820J2472m223j868J2642O287m712
$$ -5403 -9134 -3863 -5114 1973 84 -10347 -18823 -14003 -1531 -5754 -7622 5020 11307 6595
14847F595J416m451k483q64L781K246j0017J287J725k551K222j449J260l073k300
$$ 6595 8011 3560 1077 213 3994 6240 -3777 -2490 -765 -3316 -1094 -2543 -1283 -4356 -6656
14832f656r66K14r5p43j858L359L662Q859L734o899k612l993m593J557P675K748
$$ -6656 -7622 -7408 -7503 -8246 -10104 -6745 -3083 5776 9510 2611 -1 -3994 -8587 -7030 645 3393
14816C393L546R69k527m04K667J587l126q372p727k468L496R349P546n453n499
$$ 3393 6939 7908 5381 4977 7644 9231 6105 -2267 -9994 -12462 -8966 383 7929 2476 -3023
14801c023k893M193l430m146K86J0P215K43K768l36L505M479m088j2760N874J264
$$ -3023 -5916 -1723 -5153 -9299 -9013 -9003 -1788 -1545 1223 887 4392 8871 4783 -7977 -2103 -839
14785h39m441N985R130K476p516k966L74j417o066K337J3668K12l909R40m200
$$ -839 -5280 705 9835 12311 4795 1829 2203 786 -5280 -2943 10725 10937 7028 7968 3768
14770C768k20p555N32L886j210k20J511L86J193k98q698q741J867J091k910N745
$$ 3768 3548 -4007 -3475 411 -799 -1019 492 878 2071 1773 -6925 -15666 -13799 -12708 -15618 -9873
14754i873J1206K52k182Q893j780j382m296p340M401J712m910j147J105K208J167
$$ -9873 1333 1585 -597 8296 6516 5134 838 -6502 -2101 -389 -5299 -6446 -5341 -3133 -1966
14739a966N93P182l003o528K408R97k24j748j640q24j246k561q317k79L986L624
$$ -1966 -1373 5809 2806 -3722 -1314 -317 -541 -2289 -3929 -4753 -5999 -8560 -16877 -17156 -13170 -9546
14723i546k090l56L480M525O604L8n778k048J034n302l883L126P232j886K463
$$ -9546 -11636 -11992 -8512 -3987 2617 2655 -3123 -5171 -4137 -9439 -13322 -10196 -2964 -4850 -2387
14708b387L196P131l140n072K425j055o832j1783O67K130O97N148O248L2r018
$$ -2387 809 7940 4800 -272 2153 1098 -5734 -17517 -16850 -14720 -14023 -8875 -2627 -2595 -11613
14693a1613m707O461L409k861N565j984n989L164l494o937L630R966R9r3k863
$$ -11613 -16320 -9859 -6450 -9311 -3746 -5730 -11719 -8555 -12049 -18986 -15356 -5390 -5291 -5384 -8247
14678h247L102L172j741r162K847Q89n814K692J066j807j147K939J336N137L29
$$ -8247 -5145 -1973 -3714 -12876 -10029 -9140 -14954 -12262 -11196 -13003 -14150 -11211 -9875 -4738 -4409
14663d409j974n272L118K867m137K508P169k167J235L971k81l443k495O90k800
$$ -4409 -6383 -11655 -8537 -5670 -9807 -7299 -130 -2297 -1062 2909 2628 -815 -3310 -2620 -5420
14648e420K634j747k074o663k657K590L092N083O11k103n028L596K854J976j792
$$ -5420 -2786 -4533 -6607 -13270 -15927 -13337 -10245 -5162 -4551 -6654 -11682 -8086 -5232 -3256 -5048
14633e048L865J66J333K030o265k389N020n159N796k598o2L42J784L274Q04n806
$$ -5048 -1183 -1017 316 2346 -3919 -6308 -1288 -6447 -651 -3249 -3311 -2969 -1185 2089 2893 -2913
14617b913k199L49k594J819P733k629j0351j947N849K345J074J2151L895k692
$$ -2913 -5112 -4763 -7357 -5538 2195 -434 -10785 -12732 -6883 -4538 -3464 8687 12582 9890
14603I890m531K386k267o681o510m975J87P474L672m108n969r973J442R059J1203
$$ 9890 5359 7745 5478 -1203 -7713 -12688 -12501 -5027 -1355 -5463 -11432 -21405 -19963 -10904 299
14588B99J391m116J843q188j208L262L064L354N518O115n730l452L03m115l071
$$ 299 1690 -2426 -583 -8771 -9979 -6717 -3653 -299 5219 11334 5604 2152 2455 -1660 -4731
14573d731k175j376k596M977L270l799n158J048J1053K385J466K483o035k684
$$ -4731 -6906 -8282 -10878 -5901 -2631 -6430 -11588 -10540 513 2898 4364 6847 812 -1872
14559a872K835K587M055m845q87m338m012N729J0787k100J84j345m901p796k781
$$ -1872 963 3550 7605 2760 1873 -2465 -6477 -748 10039 7939 8123 6778 1877 -5919 -8700
14544h700O304R432M350q001J94J354J0076m084m849m302p168O290O197j38k230
$$ -8700 -2396 7036 11386 3385 3579 4933 15009 10925 6076 1774 -5394 896 7093 6955 4725
14529D725k619K794L535q340L214l418k004J927m29o11l552n881n4J580J414m723
$$ 4725 2106 4900 8435 95 3309 -109 -2113 -186 -615 -1226 -4778 -10659 -10713 -9133 -7719 -12442
14513a2442r66J668o81r050J018J8910Q675j1160L756K46k085L855j021l197j943
$$ -12442 -13408 -11740 -12421 -21471 -20453 -1543 7132 -4028 -272 -26 -2111 1744 723 -2474 -4417
14498d417l153n247Q708O414K227m370l559j706N356L503k627j786m639M41p69
$$ -4417 -7570 -12817 -4109 2305 4532 162 -3397 -5103 253 3756 1129 -657 -5296 -4855 -5624
14483e624k558m409M965N263O38M44j317o04q744l301k581L946L982M678n65N667
$$ -5624 -8182 -12591 -7626 -2363 -1725 -1281 -2598 -3202 -11946 -15247 -17828 -13882 -9900 -5222 -5787 -120
14467a20J199n55m208k245k511J793O083K150n225l998K02o558L88N242J162K252
$$ -120 1079 524 -3684 -5929 -8440 -6647 -564 1586 -3639 -7637 -7435 -13993 -13605 -8363 -7201 -4949
14451d949J690K779J304J432m255l269j913Q580L865r097m617M208N402O623n828
$$ -4949 -3259 -480 824 2256 -1999 -5268 -7181 1399 5264 -3833 -8450 -4242 1160 7783 1955
14436A955o780o119J135J250m85L261L707P55M915L462O141J558j0633r415q434
$$ 1955 -4825 -10944 -9809 -8559 -9044 -5783 -2076 -1321 3594 7056 13197 14755 4122 -5293 -13727
14421a3727N83M191m65N170M067l397l394Q139l39k204M30o09m655N14N03k163
$$ -13727 -13144 -8953 -9418 -4248 -181 -3578 -6972 1167 828 -1376 -946 -1555 -6210 -5696 -5193 -7356
14405g356L906p24N747P650O764o140q457l889l398p56L518l951j454O183L493
$$ -7356 -3450 -4174 1573 9223 15987 9847 1390 -2499 -5897 -6653 -3135 -7086 -8540 -2357 1136
14390A136r75J819K673L753k950Q04k313j0671Q62J660l405j275m60O766J0528
$$ 1136 161 1980 4653 8406 5456 6260 3947 -6724 -5862 -4202 -7607 -8882 -9342 -2576 7952
14375G952L291N152m974m012m943L89J315m91L627n150m369J275O074L854l843
$$ 7952 11243 16395 11421 7409 2466 2855 4170 3679 7306 2156 -2213 -938 5136 8990 5147
14360E147o345J639Q53M52O762N008o959j1592k641K969N41m31o61L701K787M111
$$ 5147 -1198 441 1294 1746 8508 13516 6557 -5035 -7676 -4707 -4166 -4597 -5258 -1557 1230 5341
14344E341m99J013N425N42l584l155j477k929m569l128L911J022M10K720l415
$$ 5341 4842 5855 11280 11822 8238 5083 3606 677 -3892 -7020 -3109 -2087 -1677 1043 -2372
14329b372m351q934o02R463M422J379M943J573p62N08j861m671J0950M141o447
$$ -2372 -6723 -15657 -16259 -6796 -2374 -995 3948 5521 4759 5267 3406 -1265 9685 13826 7379
14314G379k677q01k266l514k148l016o71M47J520J33n61l677J0488J422l524L511
$$ 7379 4702 3901 1635 -1879 -4027 -7043 -7714 -7267 -5747 -5614 -6175 -9852 636 2058 -1466 2045
14298B045j010K252N802r52o087J0123r00r16l578o858j196P49K48k203o581k175
$$ 2045 1035 3287 9089 8137 2050 12173 11273 10357 6779 -79 -1275 -526 -278 -2481 -9062 -11237
14282a1237M79M673N044O863n97J898o31k980n580j1853k892J1064N981o630j653
$$ -11237 -10758 -6085 -1041 5822 5225 7123 6492 3512 -2068 -13921 -16813 -5749 232 -6398 -8051
14267h051n1K396O590O622n367J922M432q579o252m354K871K630m038M456J0591
$$ -8051 -8102 -5706 884 7506 2139 4061 8493 -86 -6338 -10692 -7821 -5191 -9229 -4773 5818
14252E818l501k534Q62n46k25q103l483Q755P380j458k948P233N01l460O93O05
$$ 5818 2317 -217 645 99 -126 -8229 -11712 -2957 4423 2965 17 7250 7751 4291 4984 5589
14236E589l785L292p226n566J794k247o07N096l109K801Q447L868R12n264J15
$$ 5589 1804 5096 -2130 -7696 -5902 -8149 -8756 -3660 -6769 -3968 4479 8347 9259 3995 4110
14221D110m180q27O206N53p138r950n034O623O565m773N108M38p472L502K189
$$ 4110 -70 -897 5309 5862 -1276 -11226 -16260 -9637 -3072 -7845 -2737 -2299 -9771 -6269 -4080
14206d080O387j173P130P630p176k388J467J573j078P35p633j334K779O064P306
$$ -4080 2307 1134 8264 15894 8718 6330 7797 9370 8292 9027 1394 60 2839 8903 16209
14191A6209N128n859q524l497n814k87K910j167m384r81k484n300k356k132L540
$$ 16209 21337 15478 6954 3457 -2357 -2644 266 -901 -5285 -6266 -8750 -14050 -16406 -18538 -14998
14176a4998J931K962l532L658N720r241n067K819O509M166l334l634P026R439
$$ -14998 -13067 -10105 -13637 -9979 -4259 -13500 -18567 -15748 -9239 -5073 -8407 -12041 -5015 4424
14162D424m610j454K26L581J0388n484n64P61l847l381J696j318P24J657j0107
$$ 4424 -186 -1640 -1414 2167 12555 7071 6507 7268 3421 40 1736 418 1142 2799 -7308
14147g308p675N696J0317r18l579K74j575j233q126J411R311L616M744K820K744
$$ -7308 -14983 -9287 1030 112 -3467 -3193 -4768 -6001 -14127 -12716 -3405 211 4955 7775 10519
14132A0519J968m419J927N93M627n864q37j94n525K895M672n270n234m708l716
$$ 10519 12487 8068 9995 10588 15215 9351 8514 8320 2795 5690 10362 5092 -142 -4850 -8566
14117h566P495N536O787j674l903o15J465q085n611l361J161k26M770l74l9j324
$$ -8566 -1071 4465 11252 9578 5675 5060 6525 -1560 -7171 -10532 -9371 -9597 -4827 -5201 -5240 -6564
14101f564L183J664j547J35M620M642K286q434K441k298l307k582k361L680p69
$$ -6564 -3381 -1717 -3264 -3129 1491 6133 8419 -15 2426 128 -3179 -5761 -8122 -4442 -5211
14086e211o753N947q09M41L86j965l658M942R418M34L797R80j15m014l845j518
$$ -5211 -11964 -6017 -6826 -6385 -5999 -7964 -11622 -6680 2738 3172 6969 7949 7834 3820 -25 -1543
14070a543m629k245J050k540m622N056M209j555L929k361n660J2679P825r754
$$ -1543 -6172 -8417 -7367 -9907 -14529 -9473 -5264 -6819 -2890 -5251 -10911 1768 9593 -161
14056a61m908L941j608k963N83J956N061l786n043p336m533p36L715Q948P761
$$ -161 -5069 -1128 -2736 -5699 -5116 -3160 1901 -1885 -6928 -14264 -18797 -19533 -15818 -6870 891
14041H91J66m866L813L152K378k29o60m602j561M906K46J858k914m902o67m23
$$ 891 1057 -3809 4 3156 5534 5305 4645 43 -1518 3388 3634 5492 2578 -2324 -2991 -3414
14025c414K811M071J229k335o711k380M585M867K64J98P227L454k403j141r06
$$ -3414 -603 3468 4697 2362 -4349 -6729 -2144 2723 2987 3185 10412 13866 11463 10322 9416
14010I416J085l994n716K74L406k251n903k218p18M236O795l399k719L033k246
$$ 9416 10501 6507 791 1065 4471 2220 -3683 -5901 -6619 -2383 4412 1013 -1706 1327 -919
13995i19o276p966O931K816J35l383k874L468l66O474n290J447R167K965n773
$$ -919 -7195 -15161 -8230 -5414 -5279 -8662 -11536 -8068 -8434 -1960 -7250 -5803 3364 6329 556
13980E56j688K738N442o85L928k296r330k021m27k247k680M055Q050o199m626
$$ 556 -1132 1606 7048 6363 10291 7995 -1335 -3356 -3783 -6030 -8710 -4655 3395 -2804 -7430
13965g430k010k747O796q3P713J730l813l149K490N547J007J700O830k81m915
$$ -7430 -9440 -12187 -5391 -5474 2239 3969 156 -2993 -503 5044 6051 7751 14581 14300 9385
13950I385K13M328N952J23m309r499r019L384M15M998j048J944K229k054k481
$$ 9385 9598 13926 19878 20001 15692 6193 -2826 558 973 5971 4923 6867 9096 7042 4561
13935D561Q88N120M43m689l916j615K975P340n421q14K52M993k538J304N89n088
$$ 4561 5449 10569 11012 6323 2407 792 3767 11107 5686 4872 5124 10117 7579 8883 9472 4384
13919D384j0317p040J972j221p62j851N029J874L041P34l775J773M619O237L341
$$ 4384 -5933 -12973 -11001 -12222 -12984 -14835 -9806 -7932 -4891 -4157 -7932 -6159 -1540 4697 8038
13904H038o423k281o8N62M917n124q687l557J1249P459n399n768M191j37k285
$$ 8038 1615 -666 -734 -172 4745 -379 -9066 -12623 -1374 6085 686 -5082 -891 -1028 -3313
13889c313k66K616J847Q823l391o676J82k354o133K254m22M967j2m896K635K661
$$ -3313 -3579 -963 884 9707 6316 -360 -178 -2532 -8665 -6411 -6833 -1866 -1878 -6774 -4139 -1478
13873a478n006M234M558N192N392M47n419K079j166l324J303P63r41j780L670
$$ -1478 -6484 -2250 2308 7500 12892 13339 7920 9999 8833 5509 6812 7575 6634 4854 8524
13858H524l517j292K35m530L151K499l100P220O687K900k059p247j966m032J186
$$ 8524 5007 3715 3950 -580 2571 5070 1970 9190 15877 18777 16718 9471 7505 3473 4659
13843D659q38m938o36L264L182L861J832O01K856M725n68r559p416Q734k853n295
$$ 4659 3821 -1117 -1753 1511 4693 8554 10386 10987 13843 18568 18000 8441 1025 9759 6906 1611
13827A611n466M955K895N05k135L035m1k202l775J0342P446m465r499k038M57
$$ 1611 -3855 1100 3995 4500 2365 5400 5359 3157 -618 9724 17170 12705 3206 1168 1625
13812A625j075L512L781l253n85j29l631L63j995N565M71k11k246N10Q75J379
$$ 1625 550 4062 7843 4590 4005 3876 245 608 -1387 4178 4649 4438 2192 2702 3577 4956
13796D956l007q476K719N168L612N99Q15M714K503m475r689m805p350K350k301
$$ 4956 1949 -6527 -3808 1360 4972 5571 6386 11100 13603 9128 -561 -5366 -12716 -10366 -12667
13781a2667J563J0433L104k853K300O796O844m581p478j374P041M81J782j861
$$ -12667 -11104 -671 2433 -420 1880 8676 15520 10939 3461 2087 9128 9609 11391 9530
13767I530m857n894l935k579P8N178K013L900j970r94J774K211J712r99L588o514
$$ 9530 4673 -1221 -5156 -7735 -7657 -2479 -466 3434 1464 470 2244 4455 6167 5168 8756 2242
13751B242n387o169M929L764K203J485k782k377j369k067L325J0933k52k097m457
$$ 2242 -3145 -9314 -4385 -621 1582 3067 285 -2092 -3461 -5528 -2203 8730 8478 6381 1924
13736A924k596L641K51o078O405m428o239J0477M537O23k990p221n135J452N701
$$ 1924 -672 2969 3220 -2858 3547 -881 -7120 3357 7894 8517 5527 -1694 -6829 -5377 324
13721C24m661j320N866L349k934m849K653K443M18P738O034K968k141l902n279
$$ 324 -4337 -5657 209 3558 624 -4225 -1572 871 1289 9027 15061 18029 15888 11986 6707
13706F707p3M583P151o159j0322N221N06k885M53l043j628j025K956N212N66p861
$$ 6707 6634 11217 18368 12209 1887 7108 7614 4729 5182 2139 511 -514 2442 7654 8220 359
13690C59P18K467k411l096q51J936M756J432J685N996M247m026l154O825p307
$$ 359 1077 3544 1133 -1963 -2814 -878 3878 5310 6995 12991 17238 13212 10058 16883 9576
13675I576j3802k144K375P46j288J621R163N097j0891j2090L045L68jk355o66
$$ 9576 -4226 -6370 -3995 -3249 -4537 -2916 6247 11344 453 -11637 -8592 -8224 -8225 -10580 -11246
13660a1246M046P828j030k872R76J1617J784k427l740j024k401m773J955O752
$$ -11246 -7200 628 -402 -3274 -2298 9319 11103 8676 4936 3912 1511 -3262 -1307 5445
13646E445l066l119l749j225n718M052N062J011k976K687O040m024K805N12j729
$$ 5445 2379 -740 -4489 -5714 -11432 -7380 -2318 -1307 -4283 -1596 4444 420 3225 3737 2008
13631B008l422M571k477m053n571J090Q199j46m143O585R317n835L259N758M123
$$ 2008 -1414 3157 680 -3373 -8944 -7854 345 199 -3944 2641 11958 6123 9382 15140 19263
13616A9263L349p517n138j0134K2l658m026P80L031k185P039j090j065M551m341
$$ 19263 22612 15095 9957 -177 -155 -3813 -7839 -7059 -4028 -6213 826 -264 -1329 3222 -1119
13601a119k368M678J566K507L844j799m383L264J788k582k668j728l963m999j767
$$ -1119 -3487 1191 2757 5264 9108 7309 2926 6190 7978 5396 2728 1000 -2963 -7962 -9729
13586i729M941J1474K743k869k919K461J0032K71J351M49p480j2954K10J360o54
$$ -9729 -4788 6686 9429 6560 3641 6102 16134 16405 17756 18205 10725 -2229 -2019 -659 -1313
13571a313M705L550J026n58l118N668k67k957m4K331k658q748J954k617l848l505
$$ -1313 3392 6942 7968 7410 4292 9960 9693 6736 6692 9023 6365 -2383 -429 -3046 -6894 -10399
13555a0399Q471j878o886O40P086N122j207M60l032o38J224J724j9p60l218m380
$$ -10399 -1928 -3806 -10692 -10052 -2966 2156 949 1409 -1623 -2261 -1037 687 668 -92 -3310 -7690
13539g690l437K302k234J0278M690J340r01n118K9J4112k382q286J109k081p54
$$ -7690 -11127 -8825 -11059 -781 3909 5249 4348 -770 -741 13371 10989 2703 3812 1731 977
13524I77P060j935n145N22p392K351N094M936j055R6m124o967j711M64K530K963
$$ 977 8037 6102 957 1479 -5913 -3562 1532 6468 5413 5509 1385 -5582 -7293 -6829 -4299 -1336
13508a336N581L906N027n352K690o93N317O567o633j4136J837O98j054J309K408
$$ -1336 4245 8151 13178 7826 10516 9823 15140 21707 15074 938 2775 3473 2419 3728 6136
13493F136J224k13k216j0686l066P127K897K841L221n529J86M331o183m95J148
$$ 6136 7360 7147 4931 -5755 -8821 -1694 1203 4044 7265 1736 1922 6253 70 -425 723
13478G23k835j212L590L301l498n549J840O775O472j3442j715J113m619o421L962
$$ 723 -2112 -3324 266 3567 69 -5480 -3640 3135 9607 -3835 -5550 -4437 -9056 -15477 -11515
13463a1515J5548P199k347n91P604j522p393k998k10L608j0371J269L064j054
$$ -11515 4033 11232 8885 8294 15898 14376 6983 3985 3775 7383 -2988 -1719 1345 291
13449B91L499j996j502N0k00L433K41J307K878k802q222l857L818K160M14P317
$$ 291 3790 1794 292 342 142 3575 3816 5123 8001 5199 -3023 -6880 -3062 -902 -488 6829
13433F829N24n760j0733J44R092p629M874l603l436j032l33K63M607O00k771m875
$$ 6829 7353 1593 -9140 -8996 96 -7533 -2659 -6262 -9698 -10730 -11063 -10800 -6193 -5593 -8364 -13239
13417a3239L652j010N305Q987l450j151r56l260J570J2020R81l203l274J756L303
$$ -13239 -9587 -10597 -5292 3695 245 -906 -1862 -5122 -3552 8468 9449 6246 2972 4728 8031
13402H031k750n87J548j79j445J398N61J790j243k529l423j0118l118N625l106
$$ 8031 5281 4694 6242 6063 4618 6016 6577 8367 7124 4595 1172 -8946 -12064 -6439 -9545
13387i545L52N135P825q258l751O87N308J480N907K465K473o266j864N625K168
$$ -9545 -9193 -4058 3767 -4491 -8242 -7555 -2247 -767 5140 7605 10078 3812 1948 7573 9741
13372I741J457k870k805k130J783r80o88J511p09J769n207k796J612N43j256l055
$$ 9741 11198 8328 5523 3393 5176 4196 3508 5019 4310 6079 872 -1924 -312 231 -1025 -4080
13356d080Q97p767M444P073O208J457J915k035n568n336M770L548l19m427M720
$$ -4080 -3183 -10950 -6506 567 6775 8232 10147 8112 2544 -2792 1978 5526 5207 780 5500
13341E500J0075m312k606K320J421N79n445p577m21j087k689L687P882R479M081
$$ 5500 15575 11263 8657 10977 12398 12977 7532 -45 -466 -1553 -4242 -555 7327 16806 20887
13326B0887J448l157l936k116k570L589J716l219j003P159M603o377q177N50j458
$$ 20887 22335 19178 15242 13126 10556 14145 15861 12642 11639 18798 23401 17024 8847 9397 7939
13311G939k079Q395M465n505n826r918M868M024j614J739P157M296K531K333m646
$$ 7939 5860 14255 18720 13215 7389 -2529 2339 6363 4749 6488 13645 17941 20472 22805 18159
13296A8159L34J45n706n95L434j591m371M227j229j936J641j4k191M014O89k878
$$ 18159 18493 18638 12932 12337 15771 14180 9809 14036 12807 10871 12512 12498 10307 14321 15010 12132
13280A2132o131n108j366J854M432N084J695J891K049L864p370k839O409k877
$$ 12132 6001 893 -473 1381 5813 10897 12592 14483 16532 20396 13026 10187 16596 13719
13266A3719M46O71J64k850m849r732M90O593P842K845L393k460j732n626j610
$$ 13719 14165 14836 15000 12150 7301 -2431 -1941 4652 12494 15339 18732 16272 14540 8914 7304
13251G304p35K02o583L676O779J0019K319j301j611p130k895L331K236L430l034
$$ 7304 6569 6771 188 3864 10643 20662 22981 21680 20069 12939 10044 13375 15611 19041 16007
13236A6007K66k85q984l052N556K431j395N421r79j733K700Q125n662k457M349
$$ 16007 16273 15988 7004 3952 9508 11939 10544 15965 14986 13253 15953 24078 18416 15959 20308
13221B0308M751J278j889j750j881J062o54n899l993j124j892k818o158k848p775
$$ 20308 25059 26337 24448 22698 20817 21879 21225 15326 11333 10209 8317 5499 -659 -3507 -11282
13206a1282N70J0633O50q58Q598J2818O040j785p230l979J617J2016O503K126
$$ -11282 -10712 -79 571 -287 8311 21129 27169 25384 18154 14175 15792 27808 34311 36437
13192C6437J4506J9855J5055Q825P380J7340J6759J8776K8581M6288N9448Q5978
$$ 36437 50943 70798 85853 94678 102058 119398 136157 154933 183514 229802 289250 375228
13180C75228J35620K05094K73281L16235L17200J58472j99533m26889l74087k48957
$$ 375228 510848 715942 989223 1305458 1622658 1781130 1581597 1154708 780621 531664
13170E31664j58059r5768o6559n1544l3485k1232j2309m950p742r532j4066r642
$$ 531664 373605 277837 211278 159734 126249 105017 92708 87758 80016 70484 56418 46776
13158D6776p828o702q471n986R71L350k259j4570l842Q279j785o728j249O412
$$ 46776 38948 32246 23775 17789 18760 22110 19851 5281 1439 9718 7933 1205 -44 6368
13144F368O786J08j030O335K397k643K099Q44r708p071R083K780j048l465o553
$$ 6368 13154 13262 12232 18567 20964 18321 20420 21264 11556 4485 13568 16348 15300 11835 5282
13129E282m359k696M486N693L183k111n04N388N177J842n905K831L118j314m165
$$ 5282 923 -1773 2713 8406 11589 9478 8974 14362 19539 21381 15476 18307 21425 20111 15946
13114A5946j99Q29o935r115n015L45R876J831l312J625J781J0037N869n640m035
$$ 15946 15747 16576 9641 526 -4489 -4144 5732 7563 4251 5876 7657 17694 23563 17923 13888
13099A3888J455L403q87p609n840L263m809R3J924J410l59q49j20j932N783Q766
$$ 13888 15343 18746 17859 10250 4410 7673 2864 2957 4881 6291 5932 5083 4963 3031 8814 17580
13083A7580m57j980K444p835n813P565Q089K892p20l545P9p587o616j282N227
$$ 17580 17123 15143 17587 9752 3939 11504 19593 22485 21765 18220 18299 10712 4096 2814 8041
13068H041P758M169r326p098k097M651k987l678m527r93J0654O481J2438J0205
$$ 8041 15799 19968 10642 3544 1447 6098 3111 -567 -5094 -6087 4567 11048 23486 33691
13054C3691L554n966o467m67k151l608L153l994n175l019j263M047q85R841P330
$$ 33691 37245 31279 24812 24345 22194 18586 21739 17745 12570 9551 8288 12335 11450 21291 28621
13039B8621k109l487j350k32l426k477q670o893M457j792J805k774j375n49j0480
$$ 28621 26512 23025 21675 21443 18017 15540 6870 -23 4434 2642 4447 1673 298 -251 -10731
13024a0731r577J2743Q109r79j4722j7305j4112j1558q624R320O469P639J0888
$$ -10731 -20308 -7565 544 -435 -15157 -32462 -46574 -58132 -66756 -57436 -50967 -43328 -32440
13011c2440J1470K0514J5297J0048L365N948P306K621q929j5496j8802J873m509
$$ -32440 -20970 -456 14841 24889 28254 34202 41508 44129 35200 19704 902 2775 -1734
12998a734j054L018P110p045m747M07N296P202J568n700o13M085L245N409K253
$$ -1734 -2788 230 7340 295 -4452 -4045 1251 8453 10021 4321 3708 7793 11038 16447 18700
12983A8700n05o978n573M598K725O090J373l481J655L737N619J6439J1786K4294
$$ 18700 18195 11217 5644 10242 12967 19057 20430 16949 18604 22341 27960 44399 56185 80479
12969H0479L4585M1962N4070J8772j3912l5561l8556k5878j9523j9774j1777j3451
$$ 80479 115064 157026 211096 229868 215956 180395 141839 115961 96438 76664 64887 51436
12957E1436j3825p56K632l288m528k770k523N579M842o016j706j168q461q771
$$ 51436 37611 36855 39487 36199 31671 28901 26378 31957 36799 30783 29077 27909 19448 10677
12943A0677L539Q154J0713L010J60M025k492q147J432j227L636r696m049M126
$$ 10677 14216 22370 33083 36093 36253 40278 37786 29639 31071 29844 33480 23784 19735 23861
12929B3861O462q96r333o380L894L859M389O696M899O234M297K08m326l373p099
$$ 23861 30323 29427 20094 13714 17608 21467 25856 32552 37451 43685 47982 48190 43864 40491 33392
12914C3392j3126o074n76n140o407J492O319P551N039P608k623m334p266l845
$$ 33392 20266 14192 13616 8476 2069 3561 9880 17431 22470 30078 27455 23121 15855 12010
12900A2010j5500j2732l570o98Q395J4423J1484M746K930J190M78m540l006P541
$$ 12010 -3490 -16222 -19792 -20490 -12095 2328 13812 18558 21488 22678 23156 18616 15610 23151
12886B3151O363L549J637K251J0535J2991j497o042O811J2575J2706k139n160
$$ 23151 29514 33063 34700 36951 47486 60477 58980 52938 59749 72324 85030 82891 77731
12873G7731K410J2384J9033K0699K6354P346j9211j8926j8437l0238k4114q453
$$ 77731 80141 92525 111558 132257 158611 165957 146746 127820 109383 79145 55031 46578
12861D6578n642J542L894j0977l0762j8577k172K942P020J2080J1291R110J2108
$$ 46578 40936 42478 46372 35395 4633 -13944 -16116 -13174 -6154 5926 17217 26327 38435
12848C8435J3137J0958J7578J3736J4066J647m257J5095K9566J9355L1358m756
$$ 38435 51572 62530 80108 93844 107910 109557 105300 120395 149961 169316 200674 195918
12836A95918k0034j1998o631m929o998o439k912J491Q122l071m152l81p133J43
$$ 195918 175884 163886 157255 152326 145328 138889 135977 137468 145590 142519 138367 137986 130853 130996
12822A30996L106M211P677k656k076j1254q178M065K937l51K805P485O394L360
$$ 130996 134102 138313 145990 143334 141258 130004 121826 125891 128828 128477 131282 138767 145161 148521
12808A48521L036J602K959J2741J7324K630j08Q079J1902J5091J4546k966q945
$$ 148521 151557 153159 156118 168859 186183 188813 188705 196784 208686 223777 238323 235357 226412
12795B26412q95J702J3954J6971K641k389J1457Q368o114m274R150L0358L4739
$$ 226412 225517 227219 241173 258144 260785 258396 269853 278221 272107 267833 276983 307341 342080
12782C42080K5607K1010J7608O913m490q079m307m436k2726m6399m1970q834J1432
$$ 342080 367687 388697 406305 413218 408728 400649 396342 391906 369180 322781 280811 271977 283409
12769B83409L1752L9289N2669N8012N4156N1451O1073N2795L1392K4329K2109
$$ 283409 315161 354450 407119 465131 519287 570738 631811 684606 715998 740327 762436
12758G62436J7660J6410K2298M4959K4103J2463K233K7270O4280R5022J29372
$$ 762436 780096 796506 818804 863763 887866 900329 902562 929832 994112 1089134 1218506
12747A218506J38822J38046J10618R1615J18623J50938J62879J59414J82141K46729
$$ 1218506 1357328 1495374 1605992 1697607 1816230 1967168 2130047 2289461 2471602 2718331
12737B718331L13412L55623M32822M77002N08680N95607P46293J023814J447082
$$ 2718331 3031743 3387366 3820188 4297190 4805870 5401477 6147770 7171584 8618666
12728H618666J980911K543025L122995L553504L572827L674981M583166O443731
$$ 8618666 10599577 13142602 16265597 19819101 23391928 27066909 31650075 38093806
12720C8093806R291301J3649051K1089646L2990009M6382533N4833771N7890564
$$ 38093806 47385107 61034158 82123804 115113813 161496346 216330117 274220681
12713B74220681M7587106m186370o7321884p8754403n5997545l5237165k2580434
$$ 274220681 321807787 317621417 250299533 171545130 115547585 80310420 57729986
12706E7729986j5079833j0317382p110222m924910l542423k581451j778758j392408
$$ 57729986 42650153 32332771 25222549 20297639 16755216 14173765 12395007 11002599
12698A1002599j433407j388065j162289r46671p91998o94591n82140m13289k73416
$$ 11002599 9569192 8181127 7018838 6072167 5280169 4585578 4003438 3590149 3316733
12689C316733k13344k23726k18677k14546j93050j58508j41831j33770j15629
$$ 3316733 3103389 2879663 2660986 2446440 2253390 2094882 1953051 1819281 1703652
12680A703652p4053m2204j7424k794k4679q4118j16435j10183j13601r8393p5742
$$ 1703652 1629599 1587395 1569971 1567177 1542498 1458380 1341945 1231762 1118161 1019768 944026
12669I44026n4824m0628m0067n4561m8845k6284k862P401J0177R090M298J4843
$$ 944026 889202 848574 808507 753946 705101 678817 675955 683356 693533 702623 706921 721764
12657G21764K4943J4576q294k1653l7440m6258n4895n9132l4982l6776m8019k8601
$$ 721764 746707 761283 752989 731336 693896 647638 592743 533611 498629 461853 413834 385233
12645C85233j398n425m231M619J423l734j1776j1481j6126k0619o091n681n553
$$ 385233 383835 378410 374179 378798 380221 376487 364711 353230 337104 316485 310394 304713 299160
12632B99160O543j168j7606k8643j8852m999J018O790P390m672J959m177m910
$$ 299160 305703 304535 286929 258286 239434 234435 235453 242243 249633 244961 246920 242743 237833
12619B37833r299m784j594j770n70k282j2001q228l173l041j909m01j4227q627
$$ 237833 228534 223750 222156 220386 219816 217534 205533 197305 194132 191091 189182 188781 174554 165927
12605A65927n655o608M382p23l956p351m068p718l142l195L683J1018L396n497
$$ 165927 160272 153664 158046 157323 153367 146016 141948 134230 131088 127893 131576 142594 145990 140493
12591A40493n179n150J0057m330l621J2476J2590N765N570R029n796j1836J33
$$ 140493 135314 130164 140221 135891 132270 144746 157336 163101 168671 177700 171904 160068 160201
12578A60201K910L849M105K136P499L798P608K889j3367j3481j4462j8270j4247
$$ 160201 163111 166960 171065 173201 180700 184498 192106 194995 181628 168147 153685 135415 121168
12565A21168j625o520j2664r538k1460k6222k6457j8641q401J7397L2544J3558
$$ 121168 119543 113023 100359 90821 69361 43139 16682 -1959 -10360 7037 39581 53139
12553E3139M362L609J2005J3577j522l848M23k130n377J1060Q765k699L757J1502
$$ 53139 57501 61110 73115 86692 85170 81322 81745 79615 74238 85298 94063 91364 95121 106623
12539A06623J6303J2178J0333Q493p496j5383q082J955N780J0334J0566M867j977
$$ 106623 122926 135104 145437 153930 146434 131051 122969 124924 130704 141038 151604 156471 154494
12526A54494j826k1480j9116q456M166P203K518J992O025M743M326j0324j3224
$$ 154494 152668 131188 112072 103616 107782 114985 117503 119495 125520 130263 134589 124265 111041
12513A11041j6657j1405j3875q444j0301r242n564o732m338Q685J1489J5030L120
$$ 111041 94384 82979 69104 60660 50359 41117 35553 28821 24483 33168 44657 59687 62807
12500F2807N793K797j1959p654p70L814J084q431j0682j30r29n680r09L816K173
$$ 62807 68600 71397 59438 51784 51014 54828 55912 47481 36799 36669 35740 30060 29151 32967 35140
12485C5140O289Q543P868J1088n34l880o758n279j2056k19N261l129l100r196
$$ 35140 41429 49972 57840 68928 68394 64514 57756 52477 40421 40202 45463 42334 39234 30038
12471C0038l311R82J564m45k706O90l294J1916J0194j53J540J541P651M011J483
$$ 30038 26727 27709 29273 28828 26122 26812 23518 35434 45628 45475 47015 48556 56207 60218 61701
12456F1701k036k325M556J622pp486m166O126Q61l556p209o508N925K813M195
$$ 61701 59665 57340 61896 63518 63511 56025 51859 57985 58846 55290 48081 41573 47498 50311 54506
12441E4506J827l756j0092m578q137n127O839P026K173j0122o959K717L573J083
$$ 54506 56333 52577 42485 37907 29770 24643 31482 38508 40681 30559 23600 26317 29890 30973
12427C0973N292k159o86J90o703o871o593p660n09P462R083J2429J4939p12J0125
$$ 30973 36265 34106 33420 33610 26907 20036 13443 5783 5274 12736 21819 34248 49187 48475 58600
12412E8600J6843J6655N519J002k0011j0950m263n862p245k66Q462O923K157q856
$$ 58600 75443 92098 97617 98619 78608 67658 63395 57533 50288 50022 58484 65407 67564 58708
12398E8708p340n108k441m51r67r867n96M716P595p460j3653o880l752l048O36
$$ 58708 51368 46260 43819 43368 42401 32534 31938 36654 44249 36789 23136 16256 12504 9456 10092
12383A0092L943L736j94p224n84M944m3n707O78O597L580M764Q819J2623J3740
$$ 10092 14035 17771 17577 10353 9769 14713 14670 8963 9641 16238 19818 24582 33401 46024 59764
12368E9764J6423J3946R88j6648j9642j2057k479m104j315k980o992l007M714
$$ 59764 76187 90133 91121 74473 54831 42774 40295 36191 34876 31896 24904 21897 26611
12355B6611L572l874r364j0284J868M409j666r33K594K163P299L196m669l368
$$ 26611 30183 26309 16945 6661 8529 12938 11272 10339 12933 15096 22395 25591 20922 17554
12341A7554K984Q514M461L664J12j0071o848K673O029k620r332r215l704K971
$$ 17554 20538 29052 33513 37177 37289 27218 20370 23043 29072 26452 17120 7905 4201 7172
12327G172O184o18j273Q448L587L088m349k605N8k226m752J514N479J651P316
$$ 7172 13356 12738 11465 19913 23500 26588 22239 19634 19692 17466 12714 14228 19707 21358 28674
12312B8674j084o182K339N425N86L091k917j1648q916N44m8l344j485q91M546
$$ 28674 27590 21408 23747 29172 29758 32849 29932 18284 9368 9912 9864 6520 5035 4144 8690
12297H690K916P071j849J531K447m385O940L574j335l281n262K574P129R141J743
$$ 8690 11606 18677 16828 18359 20806 16421 23361 26935 25600 22319 17057 19631 26760 35901 37644
12282C7644l92L14k39K446k068n179L2K060R47l603m747l398J197L394M540K35
$$ 37644 37252 37566 37327 39773 37705 32526 32558 34618 35565 31962 27215 23817 25014 28408 32948 33183
12266C3183l464n148K479L738M853K566J154J1929J2614J7545J4706Q963J5993
$$ 33183 29719 24571 27050 30788 35641 38207 39361 51290 63904 81449 96155 105118 121111
12253A21111K1795K0032K0589M1936O7343R9032J46139K15831K83452L11050L00341
$$ 121111 142906 162938 183527 225463 292806 391838 537977 753808 1037260 1348310 1648651
12242A648651J12799k55210m40185l60296k26488j43109r1880n7553l1214j9143
$$ 1648651 1761450 1506240 1066055 705759 479271 336162 244282 186729 155515 136372
12232A36372k0634j8475j2395r906n485j3545o530n055P677p46r027j833k510
$$ 136372 115738 97263 84868 74962 69477 55932 49402 44347 52024 51278 42251 40418 37908
12219C7908o285k048J417K107M120P81l145n227k307j818L995J266m568p024l980
$$ 37908 31623 29575 30992 33099 37219 38000 34855 29628 27321 25503 29498 30764 26196 19172 15192
12204A5192M922k166j684J570j124M167n76O140m410l294J074k617p561m066N191
$$ 15192 20114 17948 16264 17834 16710 20877 20301 26441 22031 18737 19811 17194 9633 5567 10758
12189A0758K810m31m482N623L387k113m038l543k138n621j404j383q03J648J4147
$$ 10758 13568 13137 8655 14278 17665 15552 11514 7971 5833 212 -1192 -2575 -3378 -1730 12417
12174A2417N435M293O030R57L696L209J0605Q275K566r335j6345j3132q349k612
$$ 12417 17852 22145 28175 29132 32828 36037 46642 54917 57483 48148 31803 18671 10322 7710
12160G710j732j21r67m54l805J510M659k868Q708L801P26J572K111j811n451L521
$$ 7710 5978 5857 4890 4436 631 2141 6800 3932 12640 16441 17167 18739 20850 19039 13588 17109
12144A7109J862k385n929m549J493k551n35m87J0280J508p254k093k619N37O777
$$ 17109 18971 16586 10657 6108 7601 5050 4515 4028 14308 15816 8562 6469 3850 4387 11164
12129A1164k309m341L238m673l721k478M445N932q62n692K177j849k221L756L072
$$ 11164 8855 4514 7752 3079 -642 -3120 1325 7257 6395 703 2880 1031 -1190 2566 5638
12114E638K325Q516P63m792m040L859L499J175j426o463P131J3148n213j0327
$$ 5638 7963 16479 17242 12450 8410 12269 15768 16943 15517 9054 16185 29333 24120 13793
12100A3793p057j424M016m66j920m312r79N310M814L939O662J2621Q629J1023
$$ 13793 6736 5312 9328 8862 6942 2630 1651 6961 11775 15714 22376 34997 43626 54649
12086E4649n31j667j2467p786q564j1327o857o518o375P087O058K559n197J932
$$ 54649 54118 52451 39984 32198 23634 12307 5450 -1068 -7443 -356 5702 8261 3064 4996
12072D996M266L701l371j528n708N49N591P555l218o159m048J273K616O306m84
$$ 4996 9262 12963 9592 8064 2356 2905 8496 16051 12833 6674 2626 3899 6515 12821 12337
12057A2337n184j494J2901J5309J439J0721P201O444p887j0198q001r787j0202
$$ 12337 7153 5659 18560 33869 35308 46029 53230 59674 51787 41589 33588 23801 13599
12044A3599o259L416r7q111m581n260R912N106k916M619j05p084J658M194M209
$$ 13599 7340 10756 10659 2548 -2033 -7293 2619 7725 4809 9428 9323 2239 3897 8091 12300
12029A2300l705p562k18L630k809L883j553q470r198J095J753J250k965K759K952
$$ 12300 8595 1033 815 4445 1636 5519 3966 -4504 -13702 -12607 -10854 -9604 -12569 -9810 -6858
12014f858R493L785O079J970L805K136j0235n106o773k98P501L684O803J6138
$$ -6858 2635 6420 12499 14469 18274 20410 10175 5069 -1704 -2002 5499 9183 15986 32124
12000C2124J4091J4338O301j5815j8789q802q403p595m640m561J543M594L640
$$ 32124 46215 60553 66854 51039 32250 23448 15045 7450 2810 -1751 -208 4386 8026
11987H026J111k440n835K66O923J760k705j0319k389l828p047k263O70N221J2302
$$ 8026 9137 6697 862 1128 8051 9811 7106 -3213 -5602 -9430 -16477 -18740 -18070 -12849 -547
11972e47K192J313j423J676j359n432P828L985l452m424J998N540K967M068j1184
$$ -547 1645 2958 1535 3211 1852 -3580 4248 8233 4781 357 2355 7895 10862 14930 3746
11957C746p633p164J740K647P693O202p117J057J002M638K663q52j961k475o185
$$ 3746 -3887 -11051 -9311 -6664 1029 7231 114 1171 2173 6811 9474 8622 6661 4186 -1999
11942a999K136O914p0j257p95j786K007l232m027j009Q774M756O044J601n34j12
$$ -1999 137 7051 6981 5724 4929 3143 5150 1918 -2109 -3118 5656 10412 16456 18057 17523 17411
11926A7411l894n170j841O269o36o898K337L583r191o564L616P160k460P794N259
$$ 17411 13517 8347 6506 12775 12139 5241 7578 11161 1970 -4594 -978 6182 3722 11516 16775
11911A6775m993m721k411n078p482R483M813K605j232K864k289m167L234q56J962
$$ 16775 11782 7061 4650 -428 -7910 1573 6386 8991 7759 10623 8334 4167 7401 6545 8507
11896H507Q464N909lq817j0152O702N053L073O13n92J0750R025q87p932n277p413
$$ 8507 16971 22880 22877 14060 3908 10610 15663 18736 19349 18757 29507 38532 37645 29713 24436 17023
11880A7023q624n921J006K084l575J1495J730l983o625j152J436M51Q123K181
$$ 17023 8399 2478 3484 5568 1993 13488 15218 11235 4610 3458 4894 5345 13468 15649
11866A5649j468j2273J984M652Q53k045j972J523r96J666j774l599j293M70O37
$$ 15649 14181 1908 3892 8544 9397 7352 5380 6903 5907 7573 5799 2200 907 1377 2014
11851B014m042J21L149J100O486K564j720L796J331o090m420L898q27k248J105
$$ 2014 -2028 -1907 1242 2342 8828 11392 9672 13468 14799 8709 4289 8187 7360 5112 6217
11836F217J765k675m216L175k16o83R03m39k824K386J957k507o27L790m31k124
$$ 6217 7982 5307 1091 4266 4050 3367 4270 3831 1007 3393 5350 2843 2216 6006 5575 3451
11820C451p888P083O464r16M820k1j0159p538l685l739j739M595J3769R226O30
$$ 3451 -4437 2646 9110 8194 13014 12993 2834 -4704 -8389 -12128 -13867 -9272 4497 13723 14353
11805A4353M149l787l520k949l676J560K715n68k48J134k641r82O00q34p0R28
$$ 14353 18502 14715 11195 8246 4570 6130 8845 8277 8029 9163 6522 5540 6140 5306 5236 6164
11789F164m705n339r18j614L179N150Q73o191J161l817p55R904K391q775n314
$$ 6164 1459 -3880 -4798 -6412 -3233 1917 2790 -3401 -2240 -6057 -6812 3092 5483 -3292 -8606
11774h606M201R49L238o012o466P769R519k269j658L46n903M140J0856L960R99
$$ -8606 -4405 -3456 -218 -6230 -12696 -4927 4592 2323 665 1011 -4892 -752 10104 14064 15063
11759A5063k214o132P97m200q647L358L543j774N02M860l090l853P428M445J055
$$ 15063 12849 6717 7514 3314 -5333 -1975 1568 -206 296 5156 2066 -1787 5641 10086 11141
11744A1141m704j3625l085J1143J768P51N935j247n005N88Q543L375O474l890
$$ 11141 6437 -7188 -10273 870 2638 3389 9324 8077 3072 3660 12203 15578 22052 18162
11730A8162j576J412n192o41J992L88K813K429p222m157L787K346j375m113o959
$$ 18162 16586 17998 12806 12165 14157 14545 17358 19787 12565 8408 12195 14541 13166 9053 2094
11715B094l03k418J779J0418J958p450l296L32r34o363p537L298R643J504n098
$$ 2094 1791 -627 1152 11570 13528 6078 2782 3114 2180 -4183 -11720 -8422 1221 2725 -2373
11700b373l957J138K193l846l881l864J504N274Q521p13Mj382j119J313o516K573
$$ -2373 -6330 -5192 -2999 -6845 -10726 -14590 -13086 -7812 709 -4 0 -1382 -2501 -1188 -7704 -5131
11684e131j634J342O229J581j865K861J641k00N709r095m585P0N99K474L267L264
$$ -5131 -6765 -5423 806 2387 522 3383 5024 4824 10533 1438 -3147 -3077 -2478 -4 3263 6527
11668F527o877p562k499P81j722l274P370R23J67K061l137K574J409J0077N4l606
$$ 6527 -350 -7912 -10411 -9630 -11352 -14626 -7256 -6333 -6166 -4105 -7242 -4668 -3259 6818 6872 3266
11652C266n934r168K79l195j742J1126J3261K676o105k585P585N204l050q950
$$ 3266 -2668 -11836 -11557 -14752 -16494 -5368 7893 10569 4464 1879 9464 14668 11618 2668
11638B668m188j455K866k971L161P95o022q52J675N401N220J188j146k520o305
$$ 2668 -1520 -2975 -109 -3080 81 876 -5146 -5998 -4323 1078 6298 7486 6340 3820 -2485
11623b485k342k534P88L672J818k751M135K221k7P645M292l538j365P94Q753j301
$$ -2485 -4827 -7361 -6573 -2901 -1083 -3834 301 2522 2495 10140 14432 10894 9529 10323 19076 17775
11607A7775j0458m675o50r789n115L157L305P315M48O948Q136k153q551R22J224
$$ 17775 7317 2642 1992 -7797 -12912 -9755 -6450 865 1313 8261 16397 14244 5693 6615 7839
11592G839m708o466L037Q841M352l585j68l809O2L724k209N61k145p608K978M882
$$ 7839 3131 -3335 -298 8543 12895 9310 9142 5333 5395 9119 6910 7471 5326 -2282 696 5578
11576E578L633J682m379J086n584o361O123N591J132M480J346L869n519j1485
$$ 5578 9211 10893 6514 7600 2016 -4345 1778 7369 8501 12981 14327 18196 12677 1192
11562A192n710k139M815O087o57P839K532k527j0242n021P10j8m632K756K906
$$ 1192 -4518 -6657 -1842 4245 3588 11427 13959 11432 1190 -3831 -3121 -3139 -7771 -5015 -2109
11547b109L395n331n226J915J571j325L374P600L581l857n697o003q285O042M370
$$ -2109 1286 -4045 -9271 -7356 -5785 -7110 -3736 3864 7445 3588 -2109 -8112 -16397 -10355 -5985
11532e985M576l83k090q33N743j381Q620k514o44n35j630M50N388M087N57q750
$$ -5985 -1409 -1792 -3882 -4715 1028 -353 8267 5753 5109 4574 2944 3394 8782 12869 13426 4676
11516D676k446L866O514k544o592q958l874l886J202j416M895p56j71j33j39Q95
$$ 4676 2230 6096 12610 10066 3474 -5484 -9358 -13244 -12042 -13458 -8563 -9319 -9490 -9623 -9762 -8867
11500h867N742M578k346j1291l498P670P440K441j165K042K310m516j898n283
$$ -8867 -3125 1453 -893 -12184 -15682 -8012 -572 1869 704 2746 5056 540 -1358 -6641
11486f641M013k477k51n980j458N91k450o767Q324P885O701Q107L227P914K283
$$ -6641 -2628 -5105 -5356 -11336 -12794 -12203 -14653 -21420 -13096 -5211 1490 9597 12824 20738 23021
11471B3021k066j872p893m494K4m02j33N229M198n388J036R822K68K927P0n181
$$ 23021 20955 19083 11190 6696 6720 6318 6185 11414 15612 10224 11260 21082 21350 24277 24347 19166
11455A9166n210k995p937l454K972k580r78Q30j507j825k598O490N831P6J00q167
$$ 19166 13956 10961 3024 -430 2542 -38 -1016 -186 -1693 -3518 -6116 374 6205 6281 6381 -1786
11439a786M522M897K08l503l929o890K105Q786N231k806l15m42j1007l552J750
$$ -1786 2736 7633 7841 4338 409 -6481 -4376 4410 9641 6835 6520 6078 -4929 -8481 -6731
11424f731O295M473K30k323n28L403J498p741j732M09L604K511n92k381p628M237
$$ -6731 -436 4037 4267 1944 1416 4819 6317 -1424 -3156 -2747 857 3368 2776 395 -7233 -2996
11408b996L300k301l357J870L484J1137J275k553M30p196l220L706n576N813N879
$$ -2996 304 -1997 -5354 -3484 0 11137 12412 9859 10289 3093 -127 3579 -1997 3816 9695
11393I695m656O60l140k658n032R596L898q714j3877k296K691M994M177M966M417
$$ 9695 5039 5699 2559 -99 -5131 4465 8363 -351 -14228 -16524 -13833 -8839 -4662 304 4721
11378D721q541l727R055N417J166o307j1172r893j867J546O094J75p50P068O831
$$ 4721 -3820 -7547 1508 6925 8091 1784 -9388 -19281 -21148 -19602 -13508 -13333 -14083 -7015 -184
11363a84O929J15j224L85K586R52O13Q50k191o59N375o792o484j811K670j516
$$ -184 6745 6860 5636 6021 8607 9559 10172 11022 8831 8172 13547 6755 271 -1540 1130 -386
11347c86k082k17K030K107J5m86k63K388J714M907l544l480j0291r554O41O603
$$ -386 -2468 -2685 -655 1452 1467 981 718 3106 4820 9727 6183 2703 -7588 -17142 -16501 -9898
11331i898O855R658k358k633l846J795L425J492Q703K807m685R71j0600r059K412
$$ -9898 -3043 6615 4257 1624 -2222 -427 2998 4490 13193 16000 11315 12286 1686 -7373 -4961
11316d961l518j263K575M666K950J673L967k591r503K743k112J132O876J720M485
$$ -4961 -8479 -9742 -7167 -2501 449 2122 6089 3498 -6005 -3262 -5374 -4242 2634 4354 8839
11301H839J2613J634j0569r154o810j480J500K986J541k238M785r098j5782J651
$$ 8839 21452 23086 12517 3363 -3447 -4927 -3427 -441 1100 -1138 3647 -5451 -21233 -19582
11287a9582R76N355J4243L113k560m915n679q710O126KK993N393l541K326N808
$$ -19582 -18606 -13251 992 4105 1545 -3370 -9049 -17759 -11633 -11631 -8638 -3245 -6786 -4460 1348
11272A348m548k598Q414K45j09M074K073j331n881j0607K722N791P089K92P585
$$ 1348 -3200 -5798 2616 2861 2752 6826 8899 7568 1687 -8920 -6198 -407 6682 6974 14559
11257A4559K046m907r588p196j003l972P284j662k784O87L09L994K662N117m036
$$ 14559 16605 11698 2110 -5086 -6089 -10061 -2777 -4439 -7223 -6536 -6227 -2233 429 5546 1510
11242A510m258j878O337Q512K064r331k924M408m436L780M362K505k792p971o832
$$ 1510 -2748 -4626 1711 10223 12287 2956 32 4440 4 3784 8146 10651 7859 -112 -6944
11227f944K647K69P97O37Q408Q768j660j1596l614j92J008J88J0738J179k849
$$ -6944 -4297 -4028 -3231 -2594 5814 14582 12922 1326 -2288 -2480 -1472 -1284 9454 10633 7784
11212G784N939l893n917M850j809l385M064m680m904N001j251k972J1224M249
$$ 7784 13723 9830 3913 8763 6954 3569 7633 2953 -1951 3050 1799 -1173 10051 14300
11198A4300l607n428m83j719k84n783k134K67k526R243M769M77n188o647l507
$$ 14300 10693 5265 4782 3063 2779 -3004 -5138 -4871 -7397 1846 6615 7092 1904 -4743 -8250
11183h250j975O218N417p077q07r69L736J885J206k927J179N340l64m519p445
$$ -8250 -10225 -4007 1410 -5667 -6474 -7443 -3707 -1822 -616 -3543 -2364 2976 2612 -1907 -9352
11168i352L288N362L589n454j363j88k235P95K982k860N075p26K045k641k939
$$ -9352 -6064 -702 2887 -2567 -3930 -4118 -6353 -5558 -2576 -5436 -361 -1087 958 -1683 -4622
11153d622K053P155J15l999J812P168j896p050N948n379q820Q49N244J265j437
$$ -4622 -2569 4586 4701 702 2514 9682 7786 736 6684 1305 -7515 -6666 -1422 -157 -1594
11138a594M603o912l049N450L027L918k834N746O67m497l738p080m890J144Q646
$$ -1594 3009 -3903 -6952 -1502 1525 5443 2609 8355 9022 4525 787 -6293 -11183 -10039 -1393
11123a393O267J532p38J662o129m300p59N703Q72j293o589K356P441p155j288
$$ -1393 4874 6406 5668 7330 1201 -3099 -3858 1845 2717 1424 -5165 -2809 4632 -2523 -3811
11108c811O721l002k29M035Q547q365m097N991k007m018M836n37k917k321l741
$$ -3811 2910 -92 -321 3714 12261 3896 -201 5790 3783 -235 4601 4064 1147 -1174 -4915
11093d915K446K943O420k342l078n22m535k311K180O104o808J624L818j864m99
$$ -4915 -2469 474 6894 4552 1474 952 -3583 -5894 -3714 2390 -4418 -2794 1024 -840 -1339
11078a339N800O227j294n492N135J807p038l510J708r987j1171q380J0102J4538
$$ -1339 4461 10688 9394 3902 9037 10844 3806 296 2004 -7983 -19154 -27534 -17432 -2894
11064b894P801k860p282k937m20M144k327p09n206j454K004l044R97j622j870
$$ -2894 4907 2047 -5235 -8172 -8592 -4448 -6775 -7484 -12690 -14144 -12140 -15184 -14187 -15809 -17679
11049a7679M598Q655J43l240J499O040J122l635n490J474N570r75n677O291M186
$$ -17679 -13081 -4426 -4283 -7523 -6024 16 1138 -2497 -7987 -6513 -943 -1918 -7595 -1304 2882
11034B882k310M843K948l69m778m447k992R68k27m478R990M623n005r78J524j522
$$ 2882 572 5415 8363 7994 3216 -1231 -4223 -3255 -3482 -7960 2030 6653 1648 670 2194 672
11018F72N414k099q960l241o133K669L619n72Q303N28J1770J2901k750n241r285
$$ 672 6086 3987 -4973 -8214 -14347 -11678 -8059 -8631 -328 200 11970 24871 22121 16880 7595
11003G595k756q199l595m922J0132N157K635j719N041j207p036k325j900K783
$$ 7595 4839 -3360 -6955 -11877 -1745 3412 6047 4328 9369 8162 1126 -1199 -3099 -316
10989c16L058L998J0009N565q337o920r010m361o13M067j78l164N169J2507J773
$$ -316 2742 6740 16749 22314 13977 7057 -1953 -6314 -6927 -2860 -3038 -6202 -1033 11474 13247
10974A3247p029J436O589o203p323r701j847P83M681L026j101l392J290M822K268
$$ 13247 6218 7654 14243 8040 717 -8984 -10831 -10048 -5367 -2341 -3442 -6834 -5544 -722 1546
10959A546J729L082J408L149L941m150j716m337j505l256K56J835J188L55q36
$$ 1546 3275 6357 7765 10914 14855 10705 8989 4652 3147 -109 147 1982 3170 3525 2689
10944B689m115j305l309l301K165L835p16O852m472j030n163m734L204L106L884
$$ 2689 -1426 -2731 -6040 -9341 -7176 -3341 -4057 2795 -1677 -2707 -7870 -12604 -9400 -6294 -2410
10929b410Q73m734m31J001m203O846N935J565l485r220j417M73N063n362r014
$$ -2410 -1537 -6271 -6702 -5701 -9904 -3058 2877 4442 957 -8263 -9680 -9207 -4144 -9506 -18520
10914a8520O031Q639R999k852r05J081J221K331L008M190n409j0149l918n619
$$ -18520 -12489 -3850 6149 3297 2392 3473 4694 7025 10033 14223 8814 -1335 -5253 -10872
10900a0872k221P837J302l972l206Q572O412j968k553L542n07j675o52M507m965
$$ -10872 -13093 -5256 -3954 -7926 -11132 -2560 3852 1884 -669 2873 2366 691 39 4546 -419
10885d19l721J375m37l150n070m685r59J891J6243P038n014m239j597l301R672
$$ -419 -4140 -2765 -3202 -6352 -11422 -16107 -17066 -15175 1068 8106 3092 -1147 -2744 -6045 3627
10870C627J0852j751j0644j0274O702M728k649J842o892m664K166Q152M914o292
$$ 3627 14479 12728 2084 -8190 -1488 3240 591 2433 -4459 -9123 -6957 1195 6109 -183
10856a83J678j821l004K863R44j969K955j21N420J281q488o329R47o27L928L003
$$ -183 1495 -326 -3330 -467 477 -1492 1463 1342 6762 8043 -445 -6774 -5827 -6454 -2526 477
10840D77J952Q798K584p011K298K69p208K137l586n29j21P246M294r204n311N150
$$ 477 2429 11227 13811 6800 9098 9367 2159 4296 710 181 60 7306 11600 2396 -2915 2235
10824B235m28k871p336m502K40L799j46J255K057K25K837M601J064l865J39L106
$$ 2235 1807 -1064 -8400 -12902 -12662 -8863 -9009 -7754 -5697 -5472 -2635 1966 3030 -835 -696 2410
10808B410M514m894l154q267K720l104k764l756K663m678k53J1432Q963m230M44
$$ 2410 6924 2030 -1124 -9391 -6671 -9775 -12539 -16295 -13632 -18310 -18563 -7131 1832 -2398 -1954
10793a954K948N622P486j067o165o538n48K544j493J441M162l422j775J891P706
$$ -1954 994 6616 14102 13035 6870 332 -216 2328 835 2276 6438 3016 1241 3132 10838
10778A0838K740q356k598o53q446n595L541P39N223q593m175P222M006M089j229
$$ 10838 13578 5222 2624 1971 -6475 -12070 -8529 -7790 -2567 -11160 -15335 -8113 -4107 -18 -1247
10763a247J922l092k036j0574o979M189L717R042Q914J0149k155n768L084P92
$$ -1247 675 -2417 -4453 -15027 -22006 -17817 -14100 -5058 3856 14005 11850 6082 9166 9958
10749I958q340m463J658J606P333j066M338N114n731j115L369J625p252r853m116
$$ 9958 1618 -2845 -1187 419 7752 6686 11024 16138 10407 9292 12661 14286 7034 -2819 -6935
10734f935O573O456J518K653l790J478o022r890M30J475N538J547k546m670N021
$$ -6935 -362 6094 7612 10265 6475 7953 1931 -7959 -7529 -6054 -516 1031 -1515 -6185 -1164
10719a164j52p384M88R26p078Q549P553j328R13P27L993J451j178o381k681K357
$$ -1164 -1316 -8700 -8212 -7286 -14364 -5815 1738 410 1323 2050 6043 7494 6316 -65 -2746 -389
10703c89k121o29M624L097K052o825j362O056m807l62o02r33L786n480k105J551
$$ -389 -2510 -3139 1485 4582 6634 -191 -1553 4503 -304 -666 -1268 -2201 1585 -3895 -6000 -4449
10687d449P566K606K661n057K050N868k786r034p476O50K965J000K068O820J296
$$ -4449 3117 5723 8384 3327 5377 11245 8459 -575 -8051 -7401 -4436 -3436 -1368 5452 6748
10672F748m211M828L692K174O68O00m699j1280l27L010r69q504m232j60J529j99
$$ 6748 2537 7365 11057 13231 13899 14499 9800 -1480 -1807 1203 234 -8270 -12502 -12662 -11133 -11332
10656a1332N331P971p032m127J671J888N084L891L301j763m354M672K683k183
$$ -11332 -6001 1970 -5062 -9189 -7518 -5630 -546 3345 6646 4883 529 5201 7884 5701
10642E701j1528o16M039M385J072M23k006l176K35L678K822k856M362L161r87
$$ 5701 -5827 -6443 -2404 1981 3053 3476 1470 -1706 -1471 2207 5029 2173 6535 9696 8709
10627H709k172N700k975k557j052j965n688k878J843M337k728k619j634n880L190
$$ 8709 6537 12237 9262 6705 5653 3688 -2000 -4878 -3035 1302 -1426 -4045 -5679 -11559 -8369
10612h369J0717P248m348l860M550n104q950J592J889r38m089l350j562N875M609
$$ -8369 2348 9596 5248 1388 5938 834 -8116 -6524 -4635 -5573 -9662 -13012 -14574 -8699 -4090
10597d090K356J776K29P80K132L498m035o815l378Q570P84k904L741O627L480
$$ -4090 -1734 42 271 1051 3183 6681 2646 -4169 -7547 1023 1807 -1097 2644 9271 12751
10582A2751m412k081J36k894P24j530K447j99r27J169O077l271L69O363l147j323
$$ 12751 8339 6258 6394 3500 4224 2694 5141 4942 4015 5184 11261 7990 8359 14722 11575 10252
10566A0252n405J69K699R50j0007j686o070J948N530M881m79p771n689J169O708
$$ 10252 4847 5016 7715 8665 -1342 -3028 -9098 -7150 -1620 3261 2782 -4989 -10678 -9509 -2801
10551b801j17k142K437N405K287J320o391o420O893P001M096Q237j729q396k010
$$ -2801 -2918 -5060 -2623 2782 5069 6389 -2 -6422 471 7472 11568 19805 18076 9680 7670
10536G670n553k948R076M83j17L335K917j0776r542p730M365J2563M857k473l040
$$ 7670 2117 -831 8245 8728 8611 11946 14863 4087 -5455 -13185 -8820 3743 8600 6127 3087
10521C087j503j1032M226J4024J731p597l621M936K45L363q204P37P197P49l793
$$ 3087 1584 -9448 -5222 8802 10533 2936 -685 4251 4496 7859 -345 392 7589 8338 4545
10506D545j1556J289R027M785l268m140K472k380q9p81j043L846m42M148N924
$$ 4545 -7011 -5722 3305 8090 4822 682 3154 774 685 -96 -1139 2707 2265 6413 12337
10491A2337k541p284L874K894l508m852m339K986K867k943m382k48N720M756k89
$$ 12337 9796 2512 6386 9280 5772 920 -3419 -433 2434 -509 -4891 -5139 581 5337 5048
10476E048P879M85p381r518r149O257J0140K029k486P81O294n117p429j77L78
$$ 5048 12927 13412 6031 -3487 -12636 -6379 3761 5790 3304 4085 10379 5262 -2167 -2344 -1966
10461a966m868j10k837M436K548j488m605j430P749M734O335p29k213m796j169
$$ -1966 -6834 -6944 -9781 -5345 -2797 -4285 -8890 -10320 -2571 2163 8498 7769 5556 760 -409
10446d09k86J125O729j745o318l780R132O455m031l168k44p38j834K307J494J150
$$ -409 -695 430 7159 5414 -904 -4684 4448 10903 6872 3704 3460 2722 888 3195 4689 5839
10430E839j192o476q358J111M205k106O710J0222K869l674P37P967j169k536j1040
$$ 5839 4647 -1829 -10187 -9076 -4871 -6977 -267 9955 12824 9150 9887 17854 16685 14149 3109
10415C109k286O68K291L187K586l198LK119Q635k113j0445m366m719O30J2040
$$ 3109 823 1491 3782 6969 9555 6357 6360 8479 17114 15001 4556 190 -4529 -3899 8141
10400H141M802J571K02K495m724n742o155m442J474K144K203N469N594m614k404
$$ 8141 12943 14514 14716 17211 12487 6745 590 -3852 -2378 -234 1969 7438 13032 8418 6014
10385F014N139r07R42o114q79N789M279P97p84P751n721j1219j899l053o173N658
$$ 6014 11153 10246 11188 5074 4195 9984 14263 15060 14276 22027 16306 5087 3188 135 -6038 -380
10369c80P085L000O083n86m555r152m434o60j23O794K785K296N526j650j868k465
$$ -380 6705 9705 15788 15202 10647 1495 -2939 -3599 -3722 3072 5857 8153 13679 12029 10161 7696
10353G696p190n242L952m77m723j737n494L188P802O705k19m827l03l235J250
$$ 7696 506 -4736 -784 -1261 -5984 -7721 -13215 -10027 -2225 4480 4261 -566 -869 -4104 -2854
10338b854M210K517l339j369o63m232R034J031J260l002m505M302J827j927n724
$$ -2854 1356 3873 534 -835 -1498 -5730 3304 4335 5595 2593 -1912 2390 4217 2290 -3434
10323c434P989M993r922o503N09j044m945K248N919P222L982J771O467J21L719
$$ -3434 4555 9548 -374 -6877 -6368 -7412 -12357 -10109 -4190 3032 7014 8785 15252 15373 19092
10308A9092q25o007k710k470l225M860j706l543L611o018k462j761o995R79Q356
$$ 19092 18267 12260 9550 7080 3855 8715 7009 3466 7077 1059 -1403 -3164 -10159 -9180 -824
10293h24m8N608k283o615k227K132n709J445O259O157P379N255N02l328o876j0182
$$ -824 -872 4736 2453 -4162 -6389 -4257 -9966 -8521 -2262 3895 11274 16529 17031 13703 6827 -3355
10277c355q36J626j770j991N387K099j089l676Q317N764L572j803p088m234O450
$$ -3355 -4191 -2565 -4335 -6326 -939 1160 71 -3605 4712 10476 14048 12245 5157 923 7373
10262G373r7O67K7J1750l679o309p702j800j588K992L498N007K888k89k863p583
$$ 7373 7276 7943 7970 19720 16041 9732 2030 230 -1358 1634 5132 10139 13027 12738 9875 2292
10246B292k179p863k032O40k369k049P727Q796J169j459m974J794n04M045K754
$$ 2292 113 -7750 -9782 -9142 -11511 -13560 -5833 2963 4132 2673 -2301 -507 -1011 3034 5788
10231E788K041L629n57o367q809l756O510k308k74M141K022L140K216Rj366m179
$$ 5788 7829 11458 10901 4534 -4275 -8031 -1521 -3829 -4103 38 2060 5200 7416 7425 6059 1880
10215A880l798j859N61O042K141k261l640M221N31r583K897O671N491L671p611
$$ 1880 -1918 -3777 -3216 2826 4967 2706 -934 3287 3818 -5765 -2868 3803 9294 12965 5354
10200E354m935N313O247J645k567l003r88J478j817P417j299o867K184p281J891
$$ 5354 419 5732 11979 13624 11057 8054 7066 8544 6727 14144 12845 5978 8162 881 2772
10185B772M503L574M181j158j0282q645K68J103K524r375O65K398M853K423k52
$$ 2772 7275 10849 15030 13872 3590 -5055 -4787 -3684 -1160 -10535 -9870 -7472 -2619 -196 -448
10170d48M07M887O864Q14P492m418l912p285n737M225Q966J461K439m177m443
$$ -448 -41 4846 11710 12524 20016 15598 11686 4401 -1336 2889 11855 13316 15755 11578 7135
10155G135J36J17j252K234k867k523N915J184n782k990q129j123m56M524M807
$$ 7135 7271 7388 6136 8370 5503 2980 8895 10079 4297 1307 -6822 -7945 -8401 -3877 930
10140I30q14p027m502K763J368n696Q660Q006M933K215k947q400K438m774m455
$$ 930 116 -6911 -11413 -8650 -7282 -12978 -4318 3688 8621 10836 7889 -511 1927 -2847 -7302
10125g302Q678J885j1870o05j587O600M823j219Q29n77L985K688M20K801l843
$$ -7302 1376 3261 -8609 -9214 -10801 -4201 622 -597 232 -345 3640 6328 6748 9549 5706
10110E706n043l30l462L492m990m211k602L584K846J895O879n331p916n306k158
$$ 5706 663 333 -3129 363 -4627 -8838 -11440 -7856 -5010 -3115 3764 -1567 -9483 -14789 -16947
10095a6947Q038M620O82j450L678N548l2l398k864K064K203p55J727M194J569
$$ -16947 -8909 -4289 -3607 -5057 -1379 4169 4137 739 -2125 -61 2142 1387 3114 7308 8877
10080H877j2396r07R21L273j148l331j447J919k508J341J810k526L992K897J784
$$ 8877 -3519 -4426 -3505 -232 -1380 -4711 -6158 -4239 -6747 -5406 -3596 -6122 -2130 767 2551
10065B551M628K067n4o977o039L461M859J480n733n202O484O005M224N4Q980m439
$$ 2551 7179 9246 9192 2215 -3824 -363 4496 5976 243 -4959 1525 7530 11754 11808 20788 16349
10049A6349o481r172R1q90l81j311K672K811l393P52N063j882j3693P456O100
$$ 16349 9868 696 787 -103 -484 -1795 877 3688 295 1047 6110 4228 -9465 -2009 4091
10034D091m480J652O000l92p615J750M488j234p670N394N310p51m842o326R64
$$ 4091 -389 1263 7263 6871 -744 1006 5494 4260 -3410 1984 7294 6543 1701 -4625 -3661
10019c661J0350O596l964o778k030k17L928K954r27j564J330n484o248m232k971
$$ -3661 6689 13285 9321 2543 513 296 4224 7178 6251 4687 6017 533 -5715 -9947 -12918
10004a2918M427J413m734K751k482N452J034j676N619J690j267K182p902M9J1525
$$ -12918 -8491 -7078 -11812 -9061 -11543 -6091 -5057 -6733 -1114 576 -691 1491 -6411 -6362 5163
9989E163K970k578L684j758l728r6l915K02N529J890l412r62K8m076M803M07l406
$$ 5163 8133 5555 9239 7481 3753 3657 -258 -56 5473 7363 3951 2989 3017 -1059 3744 4151 745
9972G45M203N642j63p120n034j301K106L127Q776P457l195q279n990l449J866
$$ 745 4948 10590 10427 3307 -1727 -3028 -922 2205 10981 18438 15243 6964 974 -2475 -609
9957f09j926p625m794K608J923Q14n031O401P861L497j118M155Q403J40r550m353
$$ -609 -2535 -10160 -14954 -12346 -10423 -9609 -14640 -8239 -378 3119 2001 6156 14559 14699 5149 796
9941G96J725K910J0704K295r417K023n353l559k284j738k531J35J901J763Q57
$$ 796 2521 5431 16135 18430 9013 11036 5683 2124 -160 -1898 -4429 -4294 -2393 -630 227
9926B27o95q098k046M711J037J289N19L758n069L250M761k792Q65M070J006L381
$$ 227 -468 -8566 -10612 -5901 -4864 -3575 -3056 702 -4367 -1117 3644 852 1717 5787 6793 10174
9910A0174O412k377j871o181l481k213j193K791P10j658l487N17L386k772l486
$$ 10174 16586 14209 12338 6157 2676 463 -730 2061 2771 1113 -2374 -1857 1529 -1243 -4729
9895d729o172K898J1540Q592j416o726l286k396K704K918K505K107o22J881L186
$$ -4729 -10901 -8003 3537 12129 10713 3987 701 -1695 1009 3927 6432 8539 7917 9798 12984
9880A2984l000l275r920n552P09q46K855l735P11N415Q723J842J089R43n618p98
$$ 12984 9984 6709 -3211 -8763 -8054 -8900 -6045 -9780 -9069 -3654 5069 6911 8000 8943 3325 2527
9864B527m247o067M760P363l496l279Q325J14k899O462M684l432m085L687J096
$$ 2527 -1720 -7787 -3027 4336 840 -2439 5886 6000 3101 9563 14247 10815 6730 10417 11513
9849A1513p730r767l012m80p971j920J3190K929Q423o31l121n7k404l352K669
$$ 11513 3783 -5984 -8996 -9476 -17447 -19367 -6177 -3248 5175 4544 1423 1366 -1038 -4390 -1721
9834a721O443K983j3817o228L223R0K174Q694Q778M221J258n64L40r886j1314
$$ -1721 4722 7705 -6112 -12340 -9117 -9027 -6853 1841 10619 14840 16098 15534 15874 5988 -5326
9819e326J68Q577M071k517j58o825R54L912L688q59O155j129o54J14O122j877
$$ -5326 -5158 3419 7490 4973 4815 -2010 -1056 2856 6544 5685 11840 10711 10057 10171 16293 14416
9803A4416r204j32K942m476k844R364K558o864m244k437L878J0042m385q416l167
$$ 14416 5212 5080 8022 3546 702 10066 12624 5760 1516 -921 2957 12999 8614 198 -2969
9788b969L886j058J993n228l434K886M411J950K701n358j2193N74K023P749J857
$$ -2969 917 -141 1852 -3376 -6810 -3924 487 2437 5138 -220 -12413 -11839 -9816 -2067 -210
9773b10n366q049O162J3397k006N919L429l816l430m083o709K326O139Q610j2
$$ -210 -5576 -13625 -7463 5934 3928 9847 13276 9460 6030 1947 -4762 -2436 3703 12313 12301
9758A2301o158L181K342L708K39m550j2845j159l343O355K313M729O550n752m725
$$ 12301 6143 9324 11666 15374 15613 11063 -1782 -2941 -6284 71 2384 7113 13663 7911 3186
9743C186m933O88K465N15l742k435k256k898n535J768R846M927O499j516m50R09
$$ 3186 -1747 -1059 1406 1921 -1821 -4256 -6512 -9410 -14945 -13177 -3331 1596 8095 6579 6129 7038
9727G038o955J641L181m253l389k432q58L423J008m911q61l256l550j155P934
$$ 7038 83 1724 4905 652 -2737 -5169 -6027 -2604 -1596 -6507 -7368 -10624 -14174 -15329 -7395
9712g395M833j024n367j691O127M610J432J324l339P98M113Q36j43l548L848n639
$$ -7395 -2562 -3586 -8953 -10644 -4517 93 1525 2849 -490 308 4421 5257 5114 1566 5414 -225
9696b25l303K052k894L282J573l891M336j199r64k105K351K48k382j97K816N884
$$ -225 -3528 -1476 -4370 -1088 485 -3406 930 -269 -1233 -3338 -987 -739 -3121 -3318 -502 5382
9680E382N9n866L659M502K471K66l317k890l331l132m365l152M058n40O137O941
$$ 5382 5441 -425 3234 7736 10207 10473 7156 4266 935 -2197 -6562 -9714 -5656 -6196 -59 6882
9664F882j885m236l342N929N582r636n783O465N013J795p492r608O170K109L741
$$ 6882 4997 761 -2581 3348 8930 -706 -6489 -24 4989 6784 -708 -10316 -4146 -2037 1704
9649A704M165n82j117Q20P026k403j077M01l874p458o183N042J1155l87j324O23
$$ 1704 5869 5287 4170 4990 12016 9613 8536 8937 5063 -2395 -8578 -3536 7619 7232 5908 6531
9633F531K622l893m851K648N76O306l355k388P065K217n879q685N820P495m633
$$ 6531 9153 5260 409 3057 3633 9939 6584 4196 11261 13478 7599 -1086 4734 12229 7596
9618G596m383P324j031m914p224l139M359N517k313j238P087L375n297Q03J815
$$ 7596 3213 10537 9506 4592 -2632 -5771 -1412 4105 1792 554 7641 11016 5719 6522 8337
9603H337J435j934j170L145n000p178L19j65k245O539K192L467K715m270n890
$$ 8337 9772 7838 6668 9813 4813 -2365 -2046 -2211 -4456 2083 4275 7742 10457 6187 297
9588B97L759M449n124j462K224N21n339O669O760L725k357k812N744k658l676
$$ 297 4056 8505 3381 1919 4143 4664 -675 5994 12754 16479 14122 11310 17054 14396 10720
9573A0720k510J964K698o540P81K990l519P739P306r093j746J1883L365r94j2558
$$ 10720 8210 10174 12872 6332 7113 10103 6584 14323 21629 12536 10790 22673 26038 25044 12486
9558A2486m035j625O859J3696j659j0882n352K9m786k02M075M24L889O372o449
$$ 12486 8451 6826 13685 27381 25722 14840 9488 9517 4731 4529 8604 9028 12917 19289 12840
9543A2840m340n266J240q93J689L152M233K551j322J249p47J24k933K535k359
$$ 12840 8500 3234 4474 3581 5270 8422 12655 15206 13884 15133 14386 14510 11577 14112 11753
9528A1753K049j415l859l398m727K29L737n41O991N424n395j2485n36L913qk164
$$ 11753 13802 12387 8528 5130 403 632 4369 3828 10819 16243 10848 -1637 -2173 1740 1732 -432
9512d32Q100K543q262L209J0656N704q28j1457o080j495Q801P975K199o708p167
$$ -432 7668 10211 1949 5158 15814 21518 20690 9233 3153 1658 10459 18434 20633 13925 6758
9497F758k60j691K273p45N54M951j370m905K568L49L671m595j41l100l220N644
$$ 6758 6498 4807 7080 6335 6889 11840 10470 5565 8133 8482 12153 7558 7417 4317 1097 6741
9481F741l769j899l119M833L485M908N862o053j407J432r94M642n356l154Q93
$$ 6741 2972 1073 -2046 2787 6272 11180 17042 10989 9582 11014 10020 14662 9306 6152 7045
9466G045n95M990P018l406j4376m373O311N019L746K770j599r842O60ol737m9
$$ 7045 6450 11440 18458 15052 676 -3697 2614 7633 11379 14149 12550 2708 3368 3362 -375 -424
9450d24J0601o50m704M864R599J408o17p327l135l38p30k915J418j146j711k360
$$ -424 10177 9527 4823 9687 19286 20694 20077 12750 9615 9277 8547 5632 7050 5904 4193 1833
9434A833J932J214J876L572L31k199N14K296j57j776l029k948l865M055j91q360
$$ 1833 3765 4979 6855 10427 10758 8559 9073 11369 11212 9436 6407 3459 -406 3649 3458 -4902
9418d902p585K282n424M339O562j15M035M725J551n18o095J114j043M865R089
$$ -4902 -12487 -10205 -15629 -11290 -4728 -4843 -808 3917 5468 4950 -1145 -31 -1074 3791 12880
9403A2880K439L4p093j652k101l399K170L147N171N464m7j424o552j301k953l279
$$ 12880 15319 15353 8260 6608 4507 1108 3278 6425 11596 17060 17013 15589 9037 7736 4783 1504
9387A504L025m388N06K832k21L647L575L343o323p885P350J1098n268l362N861
$$ 1504 4529 141 647 3479 3258 6905 10480 13823 7500 -385 6965 18063 12795 9433 15294
9372A5294l795p52K584N08k64k360K765k838k904P44P557o277p537k263K972O769
$$ 15294 11499 10747 13331 13839 13575 11215 13980 11142 8238 8982 16539 10262 2725 462 3434 10203
9356A0203L860L79N625M824p136l463k82Q507J02l529l580n050q96l068m085M021
$$ 10203 14063 14442 20067 24891 17755 14292 14010 22517 22619 19090 15510 10460 9564 6496 2411 6432
9340F432P431J370l253k543J0797j678n280j048K90J915p112j783N093N311j944
$$ 6432 13863 15233 11980 9437 20234 18556 13276 12228 12518 14433 7321 5538 10631 15942 13998
9325A3998r294j294R58j1085l456L841P495J0822m705j0609M972J2711J149K872
$$ 13998 4704 3410 4368 -6717 -10173 -6332 1163 11985 7280 -3329 1643 14354 15503 18375
9311A8375k619k337J06m477N726o781l588L19l287k078m88N702K512K844p481
$$ 18375 15756 13419 13525 9048 14774 7993 4405 4724 1437 -641 -1129 4573 7085 9929 2448
9296B448m290O269N38k43j737p133j789M698j669O13L590L154J1580k090n306
$$ 2448 -1842 4427 4965 4722 2985 -4148 -5937 -1239 -2908 -2295 1295 4449 16029 13939 8633
9281H633k674l163j280M712L11n375N955k228p091k410M397N417J968L21J950
$$ 8633 5959 2796 1516 6228 6539 1164 7119 4891 -2200 -4610 -213 5204 7172 7493 9443
9266I443L833L757m668m240K510L717K331o628K381K327j501M667N323p315l921
$$ 9443 13276 17033 12365 8125 10635 14352 16683 10055 12436 14763 13262 17929 23252 15937 12016
9251A2016P71J687j732J911O905k015j781J548n075j672L783K890j737M06j26
$$ 12016 12787 14474 12742 14653 21558 19543 17762 19310 14235 12563 16346 19236 17499 17905 17779
9236A7779O539k73l753k950j382R31J912j376J951j890J908N280N626K795o877
$$ 17779 24318 24045 20292 17342 15960 16891 18803 17427 19378 17488 19396 24676 30302 33097 26220
9221B6220k914N942J881m157l507R911j768o523m915m735Q657P519K158J663J192
$$ 26220 23306 29248 31129 26972 23465 33376 31608 25085 20170 15435 24092 31611 33769 35432 36624
9206C6624M367k182M1K107P052P343K23q11R910J4908J8380K1837K9715L0225
$$ 36624 40991 38809 38850 40957 48009 55352 55575 54764 64674 79582 97962 119799 149514 179739
9192A79739K5911L3082N6262Q1641J12635J72962K76895L98240N08712N60544
$$ 179739 205650 238732 294994 376635 489270 662232 939127 1337367 1846079 2406623
9182B406623N17774M9627o23017p74972n28126l26289k06348j33305r1443o0851
$$ 2406623 2924397 2974024 2351007 1576035 1047909 721620 515272 381967 290524 229673
9172B29673m1758l4533k6524k6462j6268j2785k283j477r491K181j0358p514J255
$$ 229673 187915 153382 126858 100396 84128 71343 69060 67583 58092 60273 49915 42401 43656
9159D3656l044o601j066m336m954J963J3000r84n970m203L997L67o882m087O214
$$ 43656 40612 34011 32945 28609 23655 25618 38618 37634 31664 27461 31458 31825 24943 20856 27070
9144B7070R676Q99l057m496p528p99M413l910M363j0039j833O254P650L852k041
$$ 27070 36746 37645 34588 30092 22564 21765 26178 22268 26631 16592 14759 21013 28663 32515 30474
9129C0474l857p921r680m094N351P460M622m583L591P59k315l424L801K582k704
$$ 30474 26617 18696 9016 4922 10273 17733 22355 17772 21363 22122 19807 16383 20184 22766 20062
9114B0062k075P589O191q38M089O53k482k464K518O970o820p485J897n07o957
$$ 20062 17987 25576 31767 30929 35018 35671 33189 30725 33243 40213 33393 25908 27805 27298 20341
9099B0341n603P015m507n811J062M106O675j890n637K152N942M033O132M081L223
$$ 20341 14738 21753 17246 11435 12497 16603 23278 21388 15751 17903 23845 27878 34010 38091 41314
9084D1314o146k426k576p075o720j533N114O008j054m459k704L590Ln581J514
$$ 41314 35168 32742 30166 23091 16371 14838 19952 25960 24906 20447 17743 21333 21336 15755 17269
9069A7269N109k491r89N530K799l027J574K097P834J29r270m503m755J42K199
$$ 17269 22378 19887 18898 24428 27227 24200 25774 27871 35705 35834 26564 22061 17306 17448 19647
9054A9647L747M680M288O262m075n916K540L443l138n394J939m88n67j835k025
$$ 19647 23394 28074 32362 38624 34549 28633 31173 34616 31478 26084 28023 27535 26968 25133 23108
9039B3108j309j766J04r154r80j595O056J078L372M598k167n248J913j466q596
$$ 23108 21799 20033 20137 10983 10003 8408 14464 15542 18914 23512 21345 16097 18010 16544 7948
9024G948Q195K923N352j067L241l365k903k424k13P2M302j755k3l262k665L499
$$ 7948 16143 19066 24418 23351 26592 23227 20324 17900 17687 17759 22061 20306 20283 17021 14356 17855
9008A7855k511j227K063j746K837Q008L27m238n506o95n276K696l169p023L334
$$ 17855 15344 14117 16180 14434 17271 25279 25606 21368 15862 15167 9891 12587 9418 2395 5729
8993E729k103M255L957J204J70O804K36l838m557r36o735k246O667M204Q48k658
$$ 5729 3626 7881 11838 13042 13212 20016 20252 16414 11857 10921 4186 1940 8607 12811 13659 11001
8977A1001M946M771K88l016J748j440j212n400J299O482l161k469q085k10J414
$$ 11001 15947 20718 21006 17990 19738 18298 17086 11686 12985 19467 16306 13837 5752 5542 6956
8962F956K307O587k797j2391j1053M541P111J949K053N173M53m29K370J978J85
$$ 6956 9263 15850 13053 662 -10391 -5850 1261 3210 5263 10436 10889 10460 12830 14808 14993
8947A4993r814p391N264O014M994j886k213L00J675K68M567N928J810p114n676
$$ 14993 5179 -2212 3052 9066 14060 12174 9961 10261 11936 12204 16771 22699 24509 17395 11719
8932A1719q073j601L721J056L137M062m021K5K74N252k86J277m447m581k767O5
$$ 11719 3646 2045 5766 6822 9959 14021 10000 10025 10299 15551 15265 16542 12095 7514 4747 4812
8916D812k431p94l52k801k633M63O298J979M567k094M864j21j306J72j807o815
$$ 4812 2381 1587 1235 -1566 -4199 -3736 2562 4541 9108 7014 11878 11757 10451 10623 8816 2001
8900B001j0098j259Q204n00N40K973J590M018L960P165N618n58m342O01l469r694
$$ 2001 -8097 -9356 -1152 -1652 -1112 1861 3451 7469 11429 18594 24212 23654 19312 19913 16444 6750
8884F750j665K537N045j387J757K44O819K86l266k992M217N76J606N706K372k003
$$ 6750 5085 7622 12667 11280 13037 13281 20100 20386 17120 14128 18345 18921 20527 26233 28605 26602
8868B6602L756J297j51J7829K7768J3932J4527J0291n153l0002k5144p969p516
$$ 26602 30358 31655 31504 49333 77101 91033 105560 115851 110698 80696 55552 47583 40067
8855D0067p872o251j0160n264o35m135l385L931N278l188k250L076m019K957p16
$$ 40067 32195 25944 15784 10520 9885 5750 2365 6296 11574 8386 6136 9212 5193 8150 7434
8840G434l167L376j908n495Q32L542l040O451N052k348l413n520p134j590N026
$$ 7434 4267 7643 5735 240 1072 4614 1574 8025 13077 10729 7316 1796 -5338 -6928 -1902
8825a902M329j464M456M352J1656N579j4163q001j673n27K105j480n381k677K511
$$ -1902 2427 963 5419 9771 21427 27006 12843 4842 3169 2642 4747 3267 -2114 -4791 -2280
8810b280J40K909m756L505O164r266m795N841J056L258R030J921l44M9l749O31
$$ -2280 -2140 769 -3987 -482 5682 -3584 -8379 -2538 -1482 1776 10806 12727 12383 12432 8683 9314
8794I314m362r736o256M031M069L445N629j795k042k561R03j300r86O792K767
$$ 9314 4952 -4784 -11040 -7009 -2940 505 6134 4339 2297 -264 639 -661 -1647 5145 7912
8779G912p500l580j587j091K730K516n44O803M235m137L018L393p21L780L070
$$ 7912 412 -3168 -4755 -5846 -3116 -600 -1144 5659 9894 5757 8775 12168 11447 15227 18297
8764A8297m941j558r901k545J441K425j162j784L903M525K327k704m263n409p084
$$ 18297 13356 11798 1897 -648 793 3218 2056 272 4175 8700 11027 8323 4060 -1349 -8433
8749h433N180l221J520R51J19O658Q874Q179p577j766n240R53o307N921O578j170
$$ -8433 -3253 -6474 -4954 -4003 -3884 2774 11648 19827 12250 10484 5244 6197 -110 5811 12389 11219
8733A1219k896k350J386J150J071K223n324j218k367O55J260K50J980l997r860
$$ 11219 8323 5973 7359 8509 9580 11803 6479 5261 2894 3549 4809 5059 7039 3042 -6818
8718f818k262J0616k945J187m53K028M705n650l542k124M069R39M669P559K792
$$ -6818 -9080 1536 -1409 -222 -675 1353 6058 408 -3134 -5258 -1189 -250 4419 11978 14770
8703A4770m274n375N881m40q979j0883Q3L964J850k438k095L058N785M162r96
$$ 14770 10496 5121 11002 10562 1583 -9300 -9217 -5253 -3403 -5841 -7936 -4878 907 5069 4073
8688D073j053M176J644j834j119P23l10r553M529N662l042N611M621M398j930
$$ 4073 3020 7196 8840 7006 5887 6610 6300 -3253 1276 6938 3896 9507 14128 18526 16596
8673A6596K85l793j839k605j143P815k150q856J406n827m314L38J612L248K664
$$ 16596 16881 13088 11249 8644 7501 15316 13166 4310 5716 -111 -4425 -4087 -2475 773 3437
8658C437M49K602q679P96l157l613O254M572j044L828J67J165N178l725o155P279
$$ 3437 3886 6488 -2191 -1395 -4552 -8165 -1911 2661 1617 5445 5612 6777 11955 8230 2075 9354
8642I354L608J085m286n106K561k16l78L046l052J587p56j637M36J92o087J384
$$ 9354 12962 14047 9761 4655 7216 7000 6622 9668 6616 8203 7447 5810 6246 6438 351 1735
8626A735m34K999N083k481K151K048j114l615l414L748K883q780l698J02M179
$$ 1735 1301 4300 9383 6902 9053 11101 9987 6372 2958 6706 9589 809 -2889 -2787 1392
8611A392K721l461q89K563j648q05K934M925Q94p405l876L784R25k108N96Q326
$$ 1392 4113 652 -237 2326 678 -127 2807 7732 8626 1221 -2655 1129 2054 -54 542 8868
8595H868j726n012l93o198N457J0632Q19n524m106k122N238K746j948O267N788
$$ 8868 7142 2130 1737 -4461 996 11628 12447 6923 2817 695 5933 8679 6731 12998 18786
8580A8786L699L783m725o456K826j206l893o000Q79l272p549J739L610M187J590
$$ 18786 22485 26268 21543 15087 17913 16707 12814 6814 7693 4421 -3128 -1389 2221 6408 7998
8565G998J730L102k142m086J195n893k030o65J709m14K405O209k437m749j214
$$ 7998 9728 12830 10688 6602 7797 1904 -126 -791 918 504 2909 9118 6681 1932 718
8550G18P112P211K694k169p92j89j4670k31R307K502l652m239P59q90J611r1q652
$$ 718 7830 15041 17735 15566 14774 14585 -85 -316 8991 11493 7841 3602 4361 3471 5082 4991 -3661
8533c661m076j859L461k492J375K064K336N09m436Q94L013P9P566M236l187m626
$$ -3661 -7737 -9596 -6135 -8627 -7252 -5188 -2852 -2343 -6779 -5885 -2872 -2793 4773 9009 5822 1196
8517A196O04L71K362r39L498m597K555P320R880m022q343n004k415R45K314k525
$$ 1196 1800 2171 4533 3594 7092 2495 5050 12370 22250 18228 9885 4881 2466 3411 5725 3200
8501C200o220o884k119R230P164M852J713j776k305K498k933l627j272Q765O425
$$ 3200 -3020 -9904 -12023 -2793 4371 9223 10936 9160 6855 9353 6420 2793 1521 10286 16711
8486A6711J047n871j0802K883O255M838j02n607K099n154m006M37j833m048M09
$$ 16711 17758 11887 1085 3968 10223 15061 14959 9352 11451 6297 2291 2728 895 -3153 -2744
8471b744l285P021O743Q698m84m853L531K933P46l379m384L910P282M063q386
$$ -2744 -6029 992 7735 16433 15949 11096 14627 17560 18306 14927 10543 14453 21735 25798 17412
8456A7412q112n644o124O427P8j486P063Q53L27k190O600J695j158k085k548O22
$$ 17412 9300 3656 -2468 3959 4037 2551 9614 10467 10794 8604 15204 16899 15741 13656 11108 11730
8440A1730n296m209l522P72P563L725P18l077l717K216n986j002j0780K54N875
$$ 11730 6434 2225 -1297 -525 7038 10763 11481 8404 4687 6903 917 -85 -10865 -10611 -4736
8425d736L713N330L10L609K364P409k136j0950l402K300J594L755j271q03j309
$$ -4736 -1023 4307 4617 8226 10590 17999 15863 4913 1511 3811 5405 9160 7889 7086 5777
8410E777l595o65j083K432R119R01m878J276m44m677N80M569m682J518Q137M413
$$ 5777 2182 1517 434 2866 11985 12886 8008 9284 8840 4163 4743 9312 4630 6148 14285 18698
8394A8698L247j507q456n624j697J242m52J489l195o208k077O715M214j303k026
$$ 18698 21945 20438 11982 6358 4661 5903 5451 6940 3745 -2463 -4540 2175 6389 5086 3060
8379C060j126L419N694O54p295l849k412R99P106J306k513O308k673Q87L63qk554
$$ 3060 1934 5353 11047 11701 4406 557 -1855 -856 6250 7556 5043 11351 8678 9565 9928 9920 7366
8362G366N627Q341m075o886l585o15K30L506R064J101m835J09n834p569M1n05
$$ 7366 12993 21334 17259 10373 6788 6173 6403 9909 18973 20074 15239 15348 9514 1945 1986 1481
8346A481L900j19m56o633n283m580l269M887N191N536J0118K941p22L42l02M463
$$ 1481 5381 5262 4806 -1827 -7110 -11690 -14959 -10072 -4881 655 10773 13714 12992 13334 13032 17495
8330A7495n476q951k439R24M088k812n255l514K536N467K532K369l235L095k299
$$ 17495 12019 3068 629 1553 5641 2829 -2426 -5940 -3404 2063 4595 6964 3729 6824 4525
8315D525n391q060l79J0464J849p053q945j155L356M889R208l912o739l193Q362
$$ 4525 -866 -8926 -9305 1159 3008 -4045 -12990 -14145 -10789 -5900 3308 -604 -7343 -10536 -2174
8300b174O950n775J98r54j27n339m994j421l887N229J5151l551o514n012J982
$$ -2174 4776 -999 -801 -1755 -1882 -7221 -12215 -13636 -17523 -12294 2857 -694 -7208 -12220 -10238
8285a0238J2897L422k519n688q516L503N758P31O313L454n80N933j950p907n631
$$ -10238 2659 6081 3562 -2126 -10642 -7139 -1381 -650 5663 9117 8537 14470 12520 4613 -1018
8270a018L488o409L072K555n0k51n526j479M132J427n078o834L316M866j028L753
$$ -1018 2470 -3939 -867 1688 1638 1387 -4139 -5618 -1486 -59 -5137 -11971 -8655 -3789 -4817 -1064
8254a064P568O269O41l105j1876j427N170m648k065K589L470L113j752j868J671
$$ -1064 6504 12773 13414 10309 -1567 -2994 2176 -2472 -4537 -1948 1522 4635 2883 1015 2686
8239B686N61m693j617L001k026q70j279J506j522k588m332q835K956P285N940
$$ 2686 3247 -1446 -3063 -62 -2088 -2958 -4237 -2731 -4253 -6841 -11173 -20008 -17052 -9767 -3827
8224c827J211k419o758K061J815k083L419j393L050M964L188l044O261j1283j290
$$ -3827 -2616 -5035 -11793 -9732 -7917 -10000 -6581 -7974 -4924 40 3228 184 6445 -4838 -6128
8209f128N314J152o55M61l121L079J315K144p1K98r856l315l264N03P246J1598
$$ -6128 -814 338 -317 144 -2977 102 1417 3561 3490 3788 -6068 -9383 -12647 -12144 -4898 6700
8193F700j359j1103l005J715N78K814M240K543j0952K602l234p393P225J4147
$$ 6700 5341 -5762 -8767 -7052 -6474 -3660 580 3123 -7829 -5227 -8461 -15854 -8629 5518
8179E518J968L992q107r258M623K795l988j560K255l487P11K936l960N95J055
$$ 5518 7486 11478 3371 -5887 -1264 1531 -2457 -4017 -1762 -5249 -4538 -1602 -5562 -4967 -3912
8164c912m828R785N51n750m038p982M154J6708O350J00j3333L845K392O06m074
$$ -3912 -8740 1045 1596 -4154 -8192 -16174 -12020 4688 11038 11138 -2195 1650 4042 4648 574
8149E74L365p08m779L54k148O05N203q33L375j513k705k919K004O213K972p87
$$ 574 3939 3231 -1548 -1194 -3342 -2737 2466 1633 5008 3495 790 -2129 -125 6088 9060 8273
8133H273q618j881P56j047O137O984j0146o2L126M939l835j3886j512M655L435
$$ 8273 -345 -2226 -1470 -2517 3620 10604 458 396 3522 8461 4626 -9260 -10772 -6117 -2682
8118b682M122l14j552J44K661k585P847K613n799j3784j364M413J0750J509j382
$$ -2682 1440 1126 -426 -282 2379 -206 7641 10254 4455 -9329 -10693 -6280 4470 5979 4597
8103D597l881m782l014m890J546m14K907o40k547M565l016j983j369O45M472O170
$$ 4597 716 -4066 -7080 -11970 -10424 -10838 -7931 -8571 -11118 -6553 -9569 -11552 -12921 -12276 -7804 -1634
8087a634K184l015j0261j405J1319L680o62L135P881M596k815j1185m883j727
$$ -1634 550 -2465 -12726 -14131 -2812 868 206 3341 11222 15818 13003 1818 -3065 -4792
8073d792m308M344L371j94j361k061P712J098o917k497P278j514L428P841K211
$$ -4792 -9100 -4756 -1385 -1579 -2940 -5001 2711 3809 -3108 -5605 1673 159 3587 11428 13639
8058A3639j147m996q966k3j575l444J069O157N946k263j70N805k467o022o560
$$ 13639 12492 7496 -1470 -1493 -3068 -6512 -5443 714 6660 4397 4227 10032 7565 1543 -5017
8043e017L909r71l235j324J203L570K546K288n111r959K149P022N317J716J052
$$ -5017 -1108 -2079 -5314 -6638 -5435 -1865 681 2969 -2142 -12101 -9952 -2930 2387 4103 5155
8028E155p114j145N028j646n786L620l206k74n408R31J752J960L333o67N456j989
$$ 5155 -1959 -3104 1924 278 -5508 -1888 -5094 -5368 -10776 -9845 -8093 -6133 -2800 -3467 1989 0
8012@o178O866N602j022n504J609K562l097k670K630m747L229R16l404M762n064
$$ 0 -6178 688 6290 5268 -236 1373 3935 838 -1832 798 -3949 -720 196 -3208 1554 -3510
7996c510l221L626K318L720P39r934O208L125j735o368n59R74j859k495J019K047
$$ -3510 -6731 -3105 -787 2933 3672 -6262 -54 3071 1336 -5032 -5591 -4617 -6476 -8971 -7952 -5905
7980e905K891p1n592M534n0o514N378Q489n985q065m779j284R375l05p65M728
$$ -5905 -3014 -3085 -8677 -4143 -4193 -10707 -5329 3160 -2825 -10890 -15669 -16953 -7578 -7883 -8648 -3920
7964c920O443K350k907n261J592N749k363j305n745n218m46l847L968O940Q780
$$ -3920 2523 4873 1966 -3295 -1703 4046 1683 378 -5367 -10585 -11031 -14878 -10910 -3970 4810
7949D810M016l129K453K90j134o629P3Q253j970k797J534n045R22N700n013q939
$$ 4810 8826 5697 8150 8440 7306 677 750 9003 7033 4236 5770 725 1647 7347 2334 -6605
7933f605l449m823M960L149J819k393J0032K76L398M124O124n162k227N558J078
$$ -6605 -10054 -14877 -9917 -6768 -4949 -7342 2690 2966 6364 10488 16612 11450 9223 14781 15859
7918A5859j922r757o45O830m35l947K47J345q441M897O624j1260n585j677J03
$$ 15859 13937 4180 3535 10365 9930 5983 6230 7575 -866 4031 10655 -605 -6190 -7867 -7764
7903g764K667k2P169N833j4021n818M638J535L683O847J130m383k272O051M021
$$ -7764 -5097 -5119 2050 7883 -6138 -11956 -7318 -5783 -2100 4747 5877 1494 -778 5273 9294
7888I294p788o969J010N904p478q81M201j757M149M351k668k263j067p204L10
$$ 9294 1506 -5463 -4453 1451 -6027 -6908 -2707 -4464 -315 4036 1368 -895 -1962 -9166 -8856
7873h856P120R927M352j259m997n608M044P010K271N595O003p392p747k118l595
$$ -8856 -1736 8191 12543 11284 6287 679 4723 11733 14004 19599 25602 18210 10463 8345 4750
7858D750j778K017K085o407R522N977m871m707m155K41q328k486L973K173M532
$$ 4750 2972 4989 7074 667 10189 16166 11295 6588 2433 2674 -5654 -8140 -4167 -1994 2538
7843B538O959M0K797l630m958Q593L027k461K663p308j833P346j464n215J051
$$ 2538 9497 9537 12334 8704 3746 12339 15366 12905 15568 8260 6427 13773 12309 7094 8145
7828H145M511N881n707j3268r143m787L28Q349K361j321K581L327J146p168j820
$$ 8145 12656 18537 12830 -438 -9581 -14368 -14040 -5691 -3330 -4651 -2070 1257 2403 -4765 -6585
7813f585J92K934l374j224k675J327P335J0697M103n652j320L937M974l951q840
$$ -6585 -6393 -3459 -6833 -8057 -10732 -9405 -2070 8627 12730 7078 5758 9695 14669 10718 1878
7798A878m442K631m9o591n995J770Q20L351n883q874K133R097J2840R546n63k02
$$ 1878 -2564 67 18 -6573 -12568 -10798 -9978 -6627 -12510 -21384 -19251 -10154 2686 12232 11669 11467
7782A1467j511K062q787j0629k474N180K553J281K880M173n325j960l273L110
$$ 11467 9956 12018 3231 -7398 -9872 -4692 -2139 -858 2022 6195 870 -1090 -4363 -1253
7768a253P952M058j438J022N952N30o119r462l681J266l670O807N284n549m514
$$ -1253 6699 10757 9319 10341 16293 16823 10704 1242 -2439 -1173 -4843 1964 7248 1699 -2815
7753b815K555R651l078n307o233K394n253k467N427l71RJ372L884P113k019j0576
$$ -2815 -260 9391 6313 1006 -5227 -2833 -8086 -10553 -5126 -5497 -5488 -4116 -232 6881 4862 -5714
7737e714K040J3978j20j3859o45P936m793k36M21q809j1039L412J1070j635j317
$$ -5714 -3674 10304 10184 -3675 -4320 3616 -1177 -1413 -992 -9801 -20840 -17428 -6358 -7993 -9310
7722i310Q491Q149l107M792L431p148j95L193k431o183m387l868k571O10N46J619
$$ -9310 -819 7330 4223 9015 12446 5298 5103 8296 5865 -318 -4705 -8573 -11144 -10534 -9988 -8369
7706h369K812R718L786o455j950l933j371K224J83K258M150l043m813k643L559
$$ -8369 -5557 4161 7947 1492 -458 -4391 -5762 -3538 -3355 -1097 3053 10 -4803 -7446 -3887
7691c887p35P35N481J585J042p076o614o40L866j858j072l31o659L190O850l308
$$ -3887 -4622 -3887 1594 3179 4221 -2855 -9469 -10109 -6243 -8101 -9173 -9504 -16163 -12973 -6123 -9431
7675i431j570K658R65j444N936M099J985k841j6555o63P298K548m327n600O014
$$ -9431 -11001 -8343 -7378 -8822 -2886 1213 3198 357 -16198 -16861 -9563 -7015 -11342 -16942 -10928
7660a0928M252j247N785P901o030r615n935N137N205K702j240J536k255j406K153
$$ -10928 -6676 -7923 -2138 5763 -267 -9882 -15817 -10680 -5475 -2773 -4013 -2477 -4732 -6138 -3985
7645c985o08L465K713K532m126r503N45L294n44j958j466n18L833O852L746l30
$$ -3985 -4593 -1128 1585 4117 -9 -9512 -8967 -5673 -6217 -8175 -9641 -10159 -6326 526 4272 3942
7629C942j723n431M102L408r89N548L470o966K17m878m263O63L14M185l510n813
$$ 3942 2219 -3212 890 4298 3309 8857 12327 5361 5578 700 -3563 -2900 -2586 1599 -1911 -7724
7613g724k048J0217J6559R61q153j1134k544j304J449L691j460l384l509Q34P819
$$ -7724 -9772 445 17004 17965 9812 -1322 -3866 -5170 -3721 -30 -1490 -4874 -8383 -7549 270
7598B70O650n891k621N540k21o933o287M030K094m364M861J1238m675n164J362
$$ 270 6920 1029 -1592 3948 3727 -3206 -9493 -5463 -3369 -7733 -2872 8366 3691 -1473 -111
7583a11M776L613q93j932m730r374n243j871M40O002k841Q2k95N256L936L986
$$ -111 4665 8278 7385 5453 723 -8651 -13894 -15765 -15325 -9323 -12164 -12082 -12377 -7121 -3185 801
7567H01j906P57m057L404N780J742l128m707p608P4l197l784j275L612Q312l806
$$ 801 -1105 -348 -4405 -1001 4779 6521 3393 -1314 -8922 -8848 -12045 -15829 -17104 -13492 -5180 -8986
7551h986P05j669Q29L751K884K047K191n648k936l863L059J810J143O31l129J804
$$ -8986 -8281 -9950 -9121 -5370 -2486 -439 1752 -3896 -6832 -10695 -7636 -5826 -4683 -4052 -7181 -5377
7535e377q52r98l574K20N12M656N2n237n071J331L774K697K314R80L88k572j336
$$ -5377 -6229 -7227 -10801 -10581 -10069 -5413 -5361 -10598 -15669 -14338 -10564 -7867 -5553 -4573 -4185 -6757 -8093
7518h093K933n076j020J854L606n610J187Q123M85m542n400J868O064L482l339
$$ -8093 -5160 -10236 -11256 -9402 -5796 -11406 -10219 -2096 -1611 -6153 -11553 -9685 -3621 -139 -3478
7503c478Q10O776J149q779Q25M944K759K606j0938o239K436K401l592J790M854
$$ -3478 -2668 4108 5257 -3522 -2697 2247 5006 7612 -3326 -9565 -7129 -4728 -8320 -6530 -1676
7488a676P50k066J370N87j778m86r72Q46N590R28K939J701o527k267j667J958
$$ -1676 -926 -2992 -1622 -1035 -2813 -3299 -4271 -3425 2165 3093 6032 7733 1206 -1061 -2728 -770
7472g70R361Q894N944l122j1116k163L595M57M47k333o173j844j945o14M177k675
$$ -770 8591 17485 23429 20307 9191 7028 10623 11080 11527 9194 3021 1177 -768 -1382 2795 120
7456A20M60O837J781n213l521M873P165K219o603l839J0299k595o391Q28r73k046
$$ 120 580 7417 9198 3985 464 5337 12502 14721 8118 4279 14578 11983 5592 6420 5447 3401
7440C401o865j642L678Q875l573l452Q123K191J621q847p801m27P028K499j231
$$ 3401 -3464 -5106 -1428 7447 3874 422 8545 10736 12357 3510 -4291 -4718 2310 4809 3578
7425C578o149M669k793r14M138J170m034l660m729j119n39O036K165r16m685O302
$$ 3578 -2571 2098 -695 -1609 2529 3699 -335 -3995 -8724 -9843 -10382 -4346 -2181 -3097 -7782 -1480
7409a480O161O283p703m199m407J332k592L061L4m68K668m94j10m26j780m818
$$ -1480 4681 10964 3261 -938 -5345 -4013 -6605 -3544 -3510 -3978 -1310 -1804 -1914 -2340 -4120 -8938
7393h938J069n975J810M6L064J0581R204j356o130k742j6952p455O921O732M933
$$ -8938 -7869 -13844 -12034 -11988 -8924 1657 10861 9505 3375 633 -16319 -23774 -16853 -10121 -5188
7378e188l145k396K037L834J174j047M877p6q736l466K206O587l340L029L571
$$ -5188 -8333 -10729 -8692 -4858 -3684 -4731 146 70 -8666 -12132 -9926 -3339 -6679 -3650 -79
7363g9j582j837m045j965L91M756p59K422p891k045K308l616J278N551O489j13
$$ -79 -1661 -3498 -7543 -9508 -9117 -4361 -5120 -2698 -10589 -12634 -10326 -13942 -12664 -7113 -624 -737
7347g37P029L65o505o183j942q392m79J1114j954j897n027k04L079M231J509N341
$$ -737 6292 6657 152 -6031 -7973 -16365 -16844 -5730 -7684 -9581 -14608 -14812 -11733 -7502 -5993 -652
7331f52j90l879R93J540k041r367n452J653O766K997K491N500k757p453p11l783
$$ -652 -842 -4721 -3728 -2188 -4229 -13596 -19048 -17395 -10629 -7632 -5141 359 -2398 -9851 -10562 -14345
7315a4345j711Q173L511J533N29L818j707l808p412l579O060j633m728K192L018
$$ -14345 -16056 -7883 -4372 -2839 -2310 1508 -199 -4007 -11419 -14998 -8938 -10571 -15299 -13107 -10089
7300a0089K935j1194K33L911K930L494O861J13q83o552l59K287n700L959Q92N312
$$ -10089 -7154 -18348 -18115 -14204 -11274 -7780 -919 -806 -1689 -8241 -8600 -6313 -12013 -8054 -7162 -1850
7284a850J2850O117o54m685j0635p933P9p71k327n90n771l523m568J184R428N773
$$ -1850 11000 17117 16463 11778 1143 -6790 -6711 -7482 -9809 -10399 -16170 -19693 -24261 -23077 -13649 -7876
7268g876k396K892N617P97N375L667l416K609L126p315r874K33R11m909M213J980
$$ -7876 -10272 -7380 -1763 -966 4409 8076 4660 7269 10395 3080 -6794 -6561 -5650 -10559 -6346 -4366
7252d366k839l606J204J949N916M423P965K767m712q599r003p164J0088K049O28
$$ -4366 -7205 -10811 -9607 -7658 -1742 2681 10646 13413 8701 102 -8901 -16065 -5977 -3928 -3300
7237c300k8k51K585p641k171m495K079P05L023J12n206k318n92K089p57n085K46
$$ -3300 -3328 -3579 -994 -8635 -10806 -15301 -13222 -12517 -9494 -9382 -14588 -16906 -17498 -15409 -16166 -21251 -21005
7220b1005J1081k318n983l87M114O940N086l089j395P473l156l670M797l324J089
$$ -21005 -9924 -12242 -18225 -18612 -14498 -7558 -2472 -5561 -6956 517 -2639 -6309 -1512 -4836 -3747
7205c747k068N61q57n156M756k732m87j416O599J637m407p264K039K860k08K929
$$ -3747 -5815 -5254 -6111 -11267 -6511 -9243 -9730 -11146 -4547 -2910 -7317 -14581 -12542 -9682 -9890 -6961
7189f961n11j55M93P79k806Q99J6M23m145l13P325j136j641j314j234j078R76
$$ -6961 -7472 -7627 -7134 -6355 -9161 -8262 -8246 -7823 -11968 -12281 -4956 -6092 -7733 -9047 -10281 -11359 -10383
7172a0383J589L384J247P46K615j624P987L718m327j2925K260O462p123K85K775
$$ -10383 -8794 -5410 -4163 -3417 -802 -2426 5561 9279 4952 -7973 -5713 749 -6374 -6089 -3314
7157c314M60k068j667N375K936K190p273k3O918j030p337m657K321R180L88N0
$$ -3314 -2854 -4922 -6589 -1214 1722 3912 -3361 -3384 3534 2504 -4833 -9490 -7169 2011 2399 2449
7141B449k618m260K603M74P00N65K705j809K838l275k457P158O338k836o381J49
$$ 2449 -169 -4429 -1826 -1352 -652 -87 2618 809 3647 372 -2085 5073 11411 8575 2194 2343
7125B343m473M892j1766m660L380R516k512J76K224k966m94N58m791q127j479
$$ 2343 -2130 2762 -9004 -13664 -10284 -768 -3280 -3104 -880 -3846 -4340 -3782 -8573 -16700 -18179
7110a8179N528L754P600J934m754m092N427Q663O354J625r39l650n442j416p187
$$ -18179 -12651 -8897 -1297 637 -4117 -8209 -2782 5881 12235 13860 12921 9271 3829 2413 -4774
7095d774M652K344q306n329K275K377m420j914P504N710j013r92N502L885L381
$$ -4774 -122 2222 -6084 -11413 -9138 -6761 -11181 -13095 -5591 119 -894 -1886 3616 7501 10882
7080A0882j576n254J069m567r782J830M381N044l615p958J054L760N054N486n7
$$ 10882 9306 4052 5121 554 -9228 -7398 -3017 2027 -1588 -9546 -8492 -4732 322 5808 5751
7065E751o046J695O832Q200n507r962o337n518m053n264L329K952N262K900r2
$$ 5751 -295 1400 8232 16432 10925 963 -5374 -10892 -14945 -20209 -16880 -13928 -8666 -5766 -5858
7050e858M339N584L969L328q437j0015j401J690M429M846M014R40m585L022p397
$$ -5858 -1519 4065 8034 11362 2925 -7090 -8491 -6801 -2372 2474 6488 7428 2843 5865 -1532
7035a532j1382J684P804N606n213j556l611O459n90N673l578M30r95J015P00R54
$$ -1532 -12914 -11230 -3426 2180 -3033 -4589 -8200 -1741 -2331 3342 -236 194 -801 214 914 1868
7019A868M350L434l943m394j188q98j970K65n012p286n36R16J256k437N439L547
$$ 1868 6218 9652 5709 1315 127 -771 -2741 -2476 -7488 -14774 -15310 -14394 -13138 -15575 -10136 -6589
7003f589Q743K149k786j554J32O211j4842j1763M039Q347N235k693m369J659J436
$$ -6589 2154 4303 1517 -37 95 6306 -8536 -20299 -16260 -7913 -2678 -5371 -9740 -8081 -6645
6988f645L614J420l551p147R35M702m937K980R706L093l061n162m120l334l858
$$ -6645 -3031 -1611 -5162 -12309 -11374 -6672 -11609 -8629 1077 4170 1109 -4053 -8173 -11507 -15365
6973a5365O764P594O946J533O18j904q034K692J704J011k902M867m447n095J987
$$ -15365 -8601 -1007 5939 7472 8090 6186 -1848 844 2548 3559 657 5524 1077 -4018 -2031
6958b031p010m152N077J3396K607j0283l589k073N100O613N496j078n32o666r39
$$ -2031 -9041 -13193 -8116 5280 7887 -2396 -5985 -8058 -2958 3655 9151 8073 7541 875 -64
6943f4r62K283k968o004l067J940M36j986k507K774Q60l033K026M405j567P594
$$ -64 -1026 1257 -1711 -7715 -10782 -8842 -8406 -10392 -12899 -10125 -9265 -12298 -10272 -5867 -7434 160
6927A60k675j498N506k817l07o274N3k538o80K064M470J751J654m550O75P116
$$ 160 -2515 -4013 1493 -1324 -1631 -7905 -7852 -10390 -11070 -9006 -4536 -2785 -1131 -5681 -5006 2110
6911B110l532m485R71l202j627K952J341K582N305j377l903K939o782r082K267
$$ 2110 -1422 -5907 -4936 -8138 -9765 -6813 -5472 -2890 2415 1038 -2865 74 -6708 -15790 -13523
6896a3523J3872N224k045q373l259o55J090L313j852m640N579O404L322j854N863
$$ -13523 349 5573 3528 -4845 -8104 -8759 -7669 -4356 -6208 -10848 -5269 1135 4457 2603 8466
6881H466j551p349q28o766k487M341K169K278l507l137m72J424J221O313N869
$$ 8466 6915 -434 -1262 -8028 -10515 -6174 -4005 -1727 -5234 -8371 -8843 -7419 -6198 115 5984
6866E984R74M255J151n806l815r15K072k345p864n79L43j740K588R74M193J265
$$ 5984 6958 11213 12364 6558 2743 1828 3900 1555 -6309 -6888 -6545 -8285 -5697 -4723 -530 735
6850G35o55N600M170j366n275p328J343M77p870m838K047l345P601Q192K066L100
$$ 735 80 5680 9850 8484 3209 -4119 -2776 -2299 -10169 -15007 -12960 -16305 -8704 -512 1554 4654
6834D654n794p517q060L177r10K662J618L151L470P214l802L377m623j5355n03
$$ 4654 -1140 -8657 -16717 -13540 -14450 -11788 -10170 -7019 -3549 3665 -137 3240 -1383 -16738 -17241
6819a7241M773k02j980N913k918l926j1O618J523j528M057P122m157K429K915
$$ -17241 -12468 -12670 -14650 -8737 -11655 -15581 -15592 -8974 -7451 -8979 -4922 2200 -1957 472 3387
6804C387n656m404j228j305K846P938j79J081k765N127K950r658j800o551l300
$$ 3387 -2269 -6673 -7901 -9206 -6360 1578 1399 2480 -285 4842 7792 -1866 -3666 -10217 -13517
6789a3517M370L189M62j469K387O528k000l0J309j071M377n196l4k244l629K304
$$ -13517 -9147 -5958 -5496 -6965 -4578 1950 -50 -80 1229 158 4535 -661 -695 -2939 -6568 -4264
6773d264m93L792L420o914o72J506L622L137k511k938k885K558o229M95J065R
$$ -4264 -4757 -965 2455 -4459 -5131 -3625 -3 3134 623 -2315 -5200 -2642 -8871 -8376 -7311 -7302
6757g302l755M211M627J010m335RQ356K979k031K794r62q751J395N863Q27j91
$$ -7302 -11057 -6846 -2219 -1209 -5544 -5535 2821 5800 3769 6563 5601 -3150 -1755 4108 4935 4744
6741D744j870l770R95J50K483L102N496k244K672Q380k459m003K702o7R64M456
$$ 4744 2874 -896 99 249 2732 5834 11330 9086 11758 20138 17679 13676 16378 16311 17275 21731
6725B1731n496k1l002n860K38j238m33Q417n961p140J237K118L994p900K546K858
$$ 21731 16235 16214 13212 7352 7590 6352 5919 14336 8375 1235 2472 4590 8584 684 3230 6088
6709F088M405J634o339m599J630k262m302N919l15j683Q096K953m633O031P59
$$ 6088 10493 12127 5788 1189 2819 557 -3745 2174 1859 176 8272 11225 6592 12623 13382
6694A3382o169j289L43K96N524O310l645j696j983l851p86K95n437l916N220l704
$$ 13382 7213 5924 6267 6563 12087 18397 14752 13056 11073 7222 6436 6731 1294 -2622 2598 -1106
6678a106o366K120N790K875L80j52k978r55K47N044k481m794R22o024L109j300
$$ -1106 -7472 -5352 438 3313 3693 3541 563 -392 -145 4899 2418 -2376 -1454 -7478 -4369 -5669
6662e669r55r02k19N307N252o922n253L656k976k303M285o350k708L084k547j622
$$ -5669 -6624 -7526 -7745 -2438 2814 -4108 -9361 -5705 -8681 -10984 -6699 -13049 -15757 -12673 -15220 -16842
6646a6842M0M535K932M133K801L611n009o5m4N533m32M600j006k492m292K335
$$ -16842 -16802 -12267 -9335 -5202 -2401 1210 -3799 -3864 -3908 1625 1193 5793 4787 2295 -1997 338
6630C38K420L19J296O107q1R95Q442o690k901m895j958J052m550j0933l352Q328
$$ 338 2758 3077 4373 10480 10399 11394 19836 13146 10245 5350 3392 4444 -106 -11039 -14391 -6063
6614f063Q834K130p576l920K245k346l475L994M850j396K341j256l692J540M489
$$ -6063 2771 4901 -2675 -6595 -4350 -6696 -10171 -6177 -1327 -2723 -382 -1638 -5330 -3790 699
6599F99r06o76J646K832k580m921j953n242P701j830l950o038l929N62L666R008
$$ 699 -207 -883 763 3595 1015 -3906 -5859 -11101 -3400 -5230 -9180 -15218 -19147 -18585 -14919 -5911
6583e911L743p293n074M143O913L403l193K526j919j482K425J085k021l385O85
$$ -5911 -2168 -9461 -14535 -10392 -3479 -76 -3269 -743 -2662 -4144 -1719 -634 -2655 -6040 -5355
6568e355l50J65J1848M241j839q757j0719M123Q864L794l167o47J490l243j219
$$ -5355 -5705 -5540 6308 10549 8710 -47 -10766 -6643 2221 6015 2848 2201 3691 448 -771
6553g71l165q51J451N058q169j0268J416j300K107N116L661M221P758L681o205
$$ -771 -3936 -4787 -3336 1722 -6447 -16715 -15299 -16599 -14492 -9376 -5715 -1494 6264 9945 3740
6538C740p07J549Q925k432j0070k471L252J683O72p557n470k53L408o04k173J806
$$ 3740 3033 4582 13507 11075 1005 -1466 1786 3469 4141 -3416 -8886 -9139 -5731 -6335 -8508 -6702
6522f702l88M296l18m575l952r19P789M351n188k44l269J280Q98q124n263P00
$$ -6702 -7090 -2794 -3112 -7687 -11639 -12558 -4769 -418 -5606 -5850 -9119 -7839 -6941 -15065 -20328 -19628
6506a9628J0687M279o711m599N803j35q239L498J3656O186r83j2278l749P948
$$ -19628 -8941 -4662 -11373 -15972 -10169 -10304 -18543 -15045 -1389 4797 3814 -8464 -12213 -4265
6492d265k821k863K520N377M033k909j1256L0N037M672M563r505m470n714j94
$$ -4265 -7086 -9949 -7429 -2052 1981 -928 -12184 -12154 -7117 -2445 2118 -7387 -11857 -17571 -17765
6477a7765R481N157N410M859L01l343l267l09J306N079k377n041l786n079L620
$$ -17765 -8284 -3127 2283 7142 7443 4100 833 524 1830 6909 4532 -509 -4295 -9374 -5754
6462e754N180o34l631o86l70k026p215N471Q244O597L792p14j232j3760o527O773
$$ -5754 -574 -1208 -4839 -5525 -5895 -7921 -15136 -9665 -1421 5176 8968 8254 7022 -6738 -13265 -6492
6446f492K966k65m428n568L217m5N661j027r35J53K205J578O377j740r74q887
$$ -6492 -3526 -3791 -8219 -13787 -10570 -10615 -4954 -5981 -6916 -6763 -4558 -2980 3397 1657 683 -8204
6430h204o126n99M998K417m15M32o954K25K108j30M218P940J053J504m38j410
$$ -8204 -14330 -14929 -9931 -7514 -7929 -7497 -14451 -14226 -12118 -12248 -8030 -90 963 2467 2029 619
6414F19j87l856L704P228Q714k559r688l744q58j990j72l549o316p464k670M533
$$ 619 432 -3424 280 7508 16222 13663 3975 231 -627 -2617 -2789 -6338 -12654 -20118 -22788 -18255
6398a8255L274N615P850L235o569o867L029P321O206m695m418j451n35q43J961
$$ -18255 -14981 -9366 -1516 1719 -4850 -11717 -8688 -1367 4839 144 -4274 -5725 -6260 -7103 -5142
6383e142Q058Q31o477R280J396k210O749L833r042m661L754J060j952N251l399
$$ -5142 2916 3747 -2730 6550 7946 5736 12485 16318 7276 2615 6369 7429 5477 10728 7329
6368G329p538m551k389j954L161N247L693l607q665K2L592L242K583o274q721
$$ 7329 -209 -4760 -7149 -9103 -5942 -695 2998 -609 -9274 -9252 -5660 -2418 165 -6109 -14830
6353a4830K235P246O932J964M635k2o943j4058Q627J0489L147m347r035J438P564
$$ -14830 -12595 -5349 1583 3547 8182 8160 1217 -12841 -4214 6275 9422 5075 -3960 -2522 5042
6338E042m81k465M234l532K6M143m516o242L313q89m087k818n12l249k808M310
$$ 5042 4561 2096 6330 2798 2824 6967 2451 -3791 -478 -1367 -5454 -8272 -8784 -12033 -14841 -10531
6322a0531O841l406m523N979O492L201Q344K051r863m925k314R649N37k689k769
$$ -10531 -3690 -7096 -11619 -5640 852 4053 12397 14448 4585 -340 -2654 6995 7532 4843 2074
6307B074O24m4m441L510n124q470K154M182J702r70j024N83q01l391k126J0567
$$ 2074 2698 2654 -1787 1723 -3401 -11871 -9717 -5535 -3833 -4803 -5827 -5244 -6045 -9436 -11562 -995
6291i95O041m454m183K544L848l429o521j21l175L517R065k585m791q071L997
$$ -995 5046 592 -3591 -1047 2801 -628 -7149 -7270 -10445 -6928 2137 -448 -5239 -13310 -9313
6276i313J966N853J842m021r368J061Q070N837l86J0515m597n031p933L815K072
$$ -9313 -7347 -1494 348 -3673 -13041 -11980 -3910 1927 1541 12056 7459 2428 -5505 -1690 382
6261C82Q77p16P63m366k798n897K35M007k001K559O742oj407q449r89M231L246
$$ 382 1259 543 1306 -3060 -5858 -11755 -11520 -7513 -9514 -6955 -213 -219 -1626 -10075 -11064 -6833 -3587
6244c587O386Q33k214l088L510J379M12l363n568k760L546k240o542r91r00k327
$$ -3587 2799 3632 1418 -1670 1840 3219 3631 268 -5300 -8060 -4514 -6754 -13296 -14287 -15187 -17514
6228a7514J591P497O065k290k123L564q303m839L158R971n788K809J1129P52l526
$$ -17514 -15923 -8426 -2361 -4651 -6774 -3210 -11513 -16352 -13194 -3223 -9011 -6202 4927 5679 2153
6213B153m909l654j217P604J521J419k555M186j126n784k754O300n243o40n020
$$ 2153 -2756 -6410 -7627 -23 1498 2917 362 4548 3422 -2362 -5116 1184 -4059 -4699 -9719
6198i719L494M852l27m7r46Q267M611k255p167j307O672J558N15K341k163l187
$$ -9719 -6225 -1373 -1700 -1747 -2693 5574 10185 7930 763 -544 6128 7686 8201 10542 8379 5192
6182E192o859r627L747N443K020n724q635r11Q875R460k053l949O67m85K914k588
$$ 5192 -1667 -11294 -7547 -2104 -84 -5808 -14443 -15354 -6479 2981 928 -3021 -2354 -2839 75 -2513
6166b513N934L215j0550J394m879k706J644P411p90O47L109P853j354m372o318
$$ -2513 3421 6636 -3914 -2520 -7399 -10105 -8461 -1050 -1840 -1193 1916 9769 8415 4043 -2275
6151b275n965n60L437J602N813J510k517qQ836m593K421o377o206K481N846l95
$$ -2275 -8240 -8800 -5363 -3761 2052 3562 1045 1037 9873 5280 7701 1324 -4882 -2401 3445 3050
6135C050o145J509N83N70k852l257K860j517k677o51n517M266J482N271P436O833
$$ 3050 -3095 -1586 -1003 -433 -3285 -6542 -3682 -5199 -7876 -8527 -14044 -9778 -8296 -3025 4411 11244
6119A1244k753j1935l824M931k832l185K188J167P128M62M088K736R215m759q627
$$ 11244 8491 -3444 -7268 -2337 -5169 -8354 -6166 -4999 2129 2591 6679 9415 18630 13871 5244
6104E244j326N132k189l575q923n547M355M271Q82K334Q59J97J183l868m300m683
$$ 5244 3918 9050 6861 3286 -5637 -11184 -6829 -2558 -1676 658 1517 1714 2897 -971 -5271 -9954
6088i954L29K810M005M624n317J435N099m409L095l739p649J521K258M664m216
$$ -9954 -9625 -6815 -2810 1814 -3503 -2068 3031 -1378 1717 -2022 -9671 -8150 -5892 -1228 -5444
6073e444n601J423p08R702O131J074J109o566R4J081q202l037M884M387j206O254
$$ -5444 -11045 -9622 -10330 -628 5503 6577 7686 1120 1214 2295 -5907 -8944 -4060 327 -879 5375
6057E375M476P85l624l512o567r099O441P506J3110n178k393m304q997l516l93
$$ 5375 9851 10636 7012 3500 -3067 -12166 -5725 1781 14891 9713 7320 3016 -5981 -9497 -9890
6042i890j308k92P84O306K992J381K502J160R82n989J19O783j951q090m288R15
$$ -9890 -11198 -11490 -10706 -4400 -1408 -27 2475 3635 4617 -1372 -1253 5530 3579 -4511 -8799 -7884
6026g884m629K003N913l652k575J106M154L339p45k236j048K61K146J656L734
$$ -7884 -12513 -10510 -4597 -8249 -10824 -9718 -5564 -2225 -2970 -5206 -6254 -5993 -3847 -2191 1543
6011A543L541p263j326R96O214j505l624m463M015j271k648n9K925O692k894o178
$$ 1543 5084 -2179 -3505 -2509 3705 2200 -1424 -5887 -1872 -3143 -5791 -5850 -2925 3767 873 -5305
5995e305P407L826k332q403o916Q59L818O501k627p398j1674O767P740k166O787
$$ -5305 2102 5928 3596 -4807 -11723 -10864 -7046 -545 -3172 -10570 -22244 -15477 -7737 -9903 -3116
5980c116R815j551m033n154J296L06l288P342O205q006j464J35j23p89l514m276
$$ -3116 6699 5148 1115 -4039 -2743 -2437 -5725 1617 7822 -184 -1648 -1513 -1636 -2425 -5939 -10215
5964a0215N59Q571J842m843Q539J0817o496K069R00J02l114j1050p589M131P863
$$ -10215 -9656 -1085 757 -4086 4453 15270 8774 10843 11743 11845 8731 -2319 -9908 -5777 2086
5949B086P3q469N16Q086l206q098Q349N011L084R9j858n100l654p214m461M160
$$ 2086 2159 -6310 -5794 2292 -914 -9012 -663 4348 7432 7531 5673 573 -3081 -10295 -14756 -10596
5933a0596O477j644p804q285J813P272M604Q413J831o8p435k788L304J046o82
$$ -10596 -4119 -5763 -13567 -21852 -20039 -12767 -8163 250 2081 2013 -5422 -8210 -4906 -3860 -4542
5918d542M460L952K334M177n783n729r068P08k209J800k40q70M661L312J555K050
$$ -4542 -82 3870 6204 10381 4598 -1131 -10199 -9491 -11700 -9900 -10140 -11010 -6349 -3037 -1482 568
5902E68m33J465R97l869K244L644l959l60J977J887m88p680j907k138n883l327
$$ 568 135 1600 2597 -1272 972 4616 657 297 2274 4161 3673 -4007 -5914 -8052 -13935 -17262
5886a7262N875J025K394r76N103m40l222j062m748M845J1230O339N328q583o176
$$ -17262 -11387 -10362 -7968 -8944 -3841 -4281 -7503 -8565 -13313 -8468 2762 9101 14429 5846 -330
5871c30p94M94O61o62L526O083j296n372q27o622j783m855L379J1914J589J360
$$ -330 -1124 -630 31 -631 2895 8978 7682 2310 1483 -5139 -6922 -11777 -8398 3516 5105 6465
5855F465K210M970o204p107M009N798M979L889j253r066j0169n369n287j847L599
$$ 6465 8675 13645 7441 334 4343 10141 15120 19009 17756 8690 -1479 -6848 -12135 -13982 -10383
5840a0383P179K363J437l265o905L705O677l618O596n474j367j42k438j722J335
$$ -10383 -3204 -841 596 -2669 -9574 -5869 808 -2810 3786 -1688 -3055 -3197 -5635 -7357 -6022
5825f022M47K614n29L079M91l726M152l564k477K584L63k452P205m191o059J52
$$ -6022 -5575 -2961 -3490 -411 80 -3646 506 -3058 -5535 -2951 -2588 -5040 2165 -2026 -8085 -7933
5809g933M59J889l163R835k864l977N342M528N422K14n070k411o167q787m487
$$ -7933 -7474 -5585 -8748 1087 -1777 -5754 -412 4116 9538 9752 4682 2271 -3896 -12683 -17170
5794a7170Q098N148L254L26m18l825m91l059o54P103J950L87r12J171K555k45
$$ -17170 -9072 -3924 -670 -344 -762 -4587 -5078 -8137 -8791 -1688 262 649 -263 908 3463 3218
5778C218Q64k759n150o436J458J007O834j545m469k263O835J0637n91o99M770
$$ 3218 4082 1323 -3827 -10263 -8805 -7798 -964 -2509 -6978 -9241 -2406 8231 7640 6941 11711
5763A1711J576J193p310n154N21J937q347j334K347q292m76Q003K029j123L119
$$ 11711 13287 14480 7170 2016 2537 4474 -3873 -5207 -2860 -11152 -11628 -3625 -1596 -2719 400
5748D00P08l442J768L674o554n91N193O5p82n053M203q09o99K689m844M16M307
$$ 400 1108 -2334 -566 3108 -3446 -4037 1156 1221 439 -4614 -411 -1220 -1919 770 -4074 -3658 649
5731F49K904J713k464p019m370m90O848Q038n782L54N010J82P475O94j1616m755
$$ 649 3553 5266 2802 -4217 -8587 -9077 -2229 5809 27 381 5391 5573 13048 13742 2126 -2629
5715b629q478j135m413l747l367R408N462k767L893j41l390L306M969j330M908
$$ -2629 -11107 -12242 -16655 -20402 -23769 -14361 -8899 -11666 -7773 -7914 -11304 -7998 -3029 -4359 549
5700E49m326n046J681L920R88k223r511l53J589N177L471J988Q2K502R06j197
$$ 549 -3777 -8823 -7142 -3222 -2234 -4457 -13968 -14321 -12732 -7555 -4084 -2096 -2014 488 1394 197
5684A97N54N22R42j360k307K699J0r247n887r4M396O766P416K894q594o247M149
$$ 197 751 1273 2215 855 -1452 1247 1257 -7990 -13877 -13971 -9575 -2809 4607 7501 -1093 -7340 -3191
5667c191M156L363K996n792m607j57J172j490m583K369R566N240K246k219l452
$$ -3191 965 4328 7324 1532 -3075 -3232 -2060 -3550 -8133 -5764 3802 9042 11288 9069 5617
$$ [...]
##END NTUPLES=NMR SPECTRUM
##END=
