##TITLE=Analysis number 328977
Compound Code cc 64796
Book Reference 508/104
Project Code adrs
Chemist Name antons
##JCAMPDX= 6.0         $$ Bruker NMR JCAMP-DX V2.0
##DATA TYPE= NMR SPECTRUM
##DATA CLASS= NTUPLES
##ORIGIN= Bruker BioSpin GmbH
##OWNER= nmr
$$ XWIN-NMR		Version 3.5
$$ Fri Jul 20 14:05:39 2007 GMT Daylight Time (UT+1h)  MAYBRIDGE\nmr@NMR_250MHZ
##.OBSERVE FREQUENCY= 250.131544655141
##.OBSERVE NUCLEUS= ^1H
##.ACQUISITION MODE= SIMULTANEOUS (DQD)
##.ACQUISITION SCHEME= undefined
##.AVERAGES= 16
##.DIGITISER RES= 18
##SPECTROMETER/DATA SYSTEM= dpx250
##.PULSE SEQUENCE= zg30
##.SOLVENT NAME= DMSO
##.SHIFT REFERENCE= (INTERNAL, DMSO, 0, 16.522)
##AUDIT TRAIL= $$ (NUMBER, WHEN, WHO, WHERE, WHAT)
$$ ##TITLE= Audit trail, XWIN-NMR		Version 3.5
$$ ##JCAMPDX= 5.01
$$ ##ORIGIN= Bruker BioSpin GmbH
$$ ##OWNER= nmr
$$ C:\u/data/dgb/nmr/ADRS/1300/pdata/1/auditp.txt
$$ ##AUDIT TRAIL=  $$ (NUMBER, WHEN, WHO, WHERE, WHAT)
(   1,<2007-07-20 14:04:53.52 +100>,<MAYBRIDGE\nmr>,<NMR_250MHZ>,
      <created by zg, POWCHK disabled, PULCHK disabled
       configuration hash MD5:
       76 6E 9A 78 1E 09 19 81 EC 84 63 8F B0 6A 59 2D
       data hash MD5: 64K
       CD F3 82 07 15 8C FD 89 5B 7E DB 82 42 C7 0E 7E>)
(   2,<2007-07-20 14:05:19.99 +100>,<MAYBRIDGE\nmr>,<NMR_250MHZ>,
      <Start of raw data processing
       ef LB = 0.3 FT_mod = 6 PKNL = 1 SI = 32K 
       data hash MD5: 32K
       3D DE 79 BF CF 29 7D 0E 65 38 5A 2C B2 FE 7F FF>)
(   3,<2007-07-20 14:05:22.29 +100>,<MAYBRIDGE\nmr>,<NMR_250MHZ>,
      <apk 
       data hash MD5: 32K
       38 B2 E6 EC 61 AD 52 84 3E 7D 24 90 9E D0 A3 15>)
(   4,<2007-07-20 14:05:23.41 +100>,<MAYBRIDGE\nmr>,<NMR_250MHZ>,
      <abs ABSG = 5 
       data hash MD5: 32K
       A0 1F D7 AA 2B 6B F5 24 E7 84 E6 4C 71 93 FE EE>)
$$ ##END=
$$ 
$$ hash MD5
$$ 53 95 24 24 8C C7 9D 44 FA 93 52 DC 85 59 41 C6
##$RELAX= 
##$RELAX= 
##$RELAX= 
##$RELAX= 
##$RELAX= 
##$RELAX= 
##$RELAX= 
$$ Bruker specific parameters
$$ --------------------------
##$DU= <C:\u>
##$EXPNO= 1300
##$NAME= <ADRS>
##$PROCNO= 1
##$TYPE= <nmr>
##$USER= <dgb>
##$AMP= (0..31)
100 100 100 100 100 100 100 100 100 100 100 100 100 100 100 100 100 100 
100 100 100 100 100 100 100 100 100 100 100 100 100 100 
##$AQSEQ= 0
##$AQ_mod= 3
##$AUNM= <au_zg>
##$AUTOPOS= <13 >
##$BF1= 250.13
##$BF2= 250.13
##$BF3= 250.13
##$BF4= 250.13
##$BF5= 500.13
##$BF6= 500.13
##$BF7= 500.13
##$BF8= 500.13
##$BYTORDA= 1
##$CFDGTYP= 0
##$CFRGTYP= 5
##$CHEMSTR= <none>
##$CNST= (0..31)
1 1 145 1 1 1 1 1 1 1 1 1 1 1 1 1 1 1 1 1 1 1 1 1 1 1 1 1 1 1 1 1 
##$CPDPRG= <>
##$CPDPRG1= <>
##$CPDPRG2= <>
##$CPDPRG3= <>
##$CPDPRG4= <mlev>
##$CPDPRG5= <mlev>
##$CPDPRG6= <mlev>
##$CPDPRG7= <mlev>
##$CPDPRG8= <mlev>
##$CPDPRGB= <>
##$CPDPRGT= <>
##$D= (0..31)
0 1 0 0 0 0 0 0 0 0.06 0 0 0 0 0 0 0.0002 0 0 0 0 0 0 0 0 0 0 0 0 0 0 
0 
##$DATE= 1184936689
##$DBL= (0..7)
120 120 120 120 120 120 120 120 
##$DBP= (0..7)
150 150 150 150 150 150 150 150 
##$DBP07= 0
##$DBPNAM0= <>
##$DBPNAM1= <>
$$ [...]
##$SUBNAM6= <"">
##$SUBNAM7= <"">
##$SUBNAM8= <"">
##$SUBNAM9= <"">
##$SW= 20.6930455092707
##$SWIBOX= (0..15)
0 0 3 0 0 0 0 0 0 0 0 0 0 0 0 0 
##$SW_h= 5175.983436853
##$TD= 65536
##$TD0= 1
##$TE= 296.16
##$TE2= 300
##$TE3= 300
##$TEG= 300
##$TL= (0..7)
0 120 120 120 120 120 120 120 
##$TP= (0..7)
150 150 150 150 150 150 150 150 
##$TP07= 0
##$TPNAME0= <>
##$TPNAME1= <>
##$TPNAME2= <>
##$TPNAME3= <>
##$TPNAME4= <>
##$TPNAME5= <>
##$TPNAME6= <>
##$TPNAME7= <>
##$TPOAL= (0..7)
0.5 0.5 0.5 0.5 0.5 0.5 0.5 0.5 
##$TPOFFS= (0..7)
0 0 0 0 0 0 0 0 
##$TUNHIN= 0
##$TUNHOUT= 0
##$TUNXOUT= 0
##$USERA1= <user>
##$USERA2= <user>
##$USERA3= <user>
##$USERA4= <user>
##$USERA5= <user>
##$V9= 5
##$VALIST= <valist>
##$VCLIST= <CCCCCCCCCCCCCCC>
##$VD= 0
##$VDLIST= <DDDDDDDDDDDDDDD>
##$VPLIST= <PPPPPPPPPPPPPPP>
##$VTLIST= <TTTTTTTTTTTTTTT>
##$WBST= 1024
##$WBSW= 4
##$XGAIN= (0..3)
0 0 0 0 
##$XL= 0
##$YL= 0
##$YMAX_a= 342604
##$YMIN_a= -344831
##$ZGOPTNS= <>
##$ZL1= 120
##$ZL2= 120
##$ZL3= 120
##$ZL4= 120
##$ABSF1= 16.522
##$ABSF2= -4.171173
##$ABSG= 5
##$ABSL= 3
##$ALPHA= 0
##$AQORDER= 0
##$ASSFAC= 0
##$ASSFACI= 0
##$ASSFACX= 0
##$ASSWID= 0
##$AUNMP= <proc_1d>
##$AZFE= 0.1
##$AZFW= 0.1
##$BCFW= 0
##$BC_mod= 0
##$BYTORDP= 0
##$COROFFS= 0
##$CY= 12.5
##$DATMOD= 1
##$DC= 0
##$DFILT= <>
##$DTYPP= 0
##$F1P= 14.0000005364418
##$F2P= -0.99999901652339
##$FCOR= 0.5
##$FTSIZE= 32768
##$FT_mod= 6
##$GAMMA= 0
##$GB= 0
##$INTBC= 1
##$INTSCL= 1
##$ISEN= 128
##$LB= 0.3
##$LEV0= 0
##$LPBIN= 0
##$MAXI= 10000
##$MC2= 0
##$MEAN= 0
##$ME_mod= 0
##$MI= 0
##$NCOEF= 0
##$NC_proc= -4
##$NLEV= 6
##$NOISF1= 0
##$NOISF2= 0
##$NSP= 0
##$NTH_PI= 0
##$NZP= 0
##$OFFSET= 16.522
##$PC= 1
##$PHC0= -63.2229
##$PHC1= 6.24779
##$PH_mod= 1
##$PKNL= yes
##$PPARMOD= 0
##$PSCAL= 4
##$PSIGN= 0
##$REVERSE= no
##$SF= 250.13
##$SI= 32768
##$SIGF1= 0
##$SIGF2= 0
##$SINO= 400
##$SIOLD= 32768
##$SREGLST= <1H.DMSO>
##$SSB= 0
##$STSI= 32768
##$STSR= 0
##$SW_p= 5175.98343685301
##$SYMM= 0
##$S_DEV= 0
##$TDeff= 65536
##$TDoff= 0
##$TI= <Analysis number 999999
Compound Code 99
Book Reference 9
Project Code 9>
##$TILT= no
##$TM1= 0
##$TM2= 0
##$TOPLEV= 0
##$USERP1= <user>
##$USERP2= <user>
##$USERP3= <user>
##$USERP4= <user>
##$USERP5= <user>
##$WDW= 1
##$XDIM= 32768
##$YMAX_p= 401573853
##$YMIN_p= -172011
$$ End of Bruker specific parameters
$$ ---------------------------------
##NTUPLES= NMR SPECTRUM
##VAR_NAME=  FREQUENCY,     SPECTRUM/REAL,   SPECTRUM/IMAG
##SYMBOL=    X,             R,               I
##VAR_TYPE=  INDEPENDENT,   DEPENDENT,       DEPENDENT
##VAR_FORM=  AFFN,          ASDF,            ASDF
##VAR_DIM=   32768,         32768,           32768
##UNITS=     HZ,            ARBITRARY UNITS, ARBITRARY UNITS
##FACTOR=    0.157963299565203, 1,           1
##FIRST=     4132.6476996994, 0,             0
##LAST=      -1043.33573715361, 0,           0
##MIN=       -1043.33573715361, -172011,     0
##MAX=       4132.6476996994, 401573853,     0
$$ Real data points
##PAGE= N=1
##DATA TABLE= (X++(R..R)), XYDATA
$$ [...]
20619 27386 47463 25771 23962 24889 4430 -10056 -15364 1333 21652 10339 -11985 37234
20607 37234 51203 38830 14689 29951 4265 3320 -26915 -32597 -19048 10663 28449 8850
20595 8850 -3708 3007 16842 -8059 -33337 -25453 -8863 6966 36886 54994 33233 20124
20583 20124 47794 77051 99058 100576 101023 85787 60226 43300 16234 9909 11500 -39085 -54888
20570 -54888 -2633 38290 32237 30 -12698 -797 -19422 9999 65462 87933 87251 42113
20558 42113 19952 29817 57771 34939 -43701 -43120 -20438 -16987 -52040 -43672 18710 24488 35627
20545 35627 25483 46181 53250 67970 41863 -21669 -32201 -14905 -187 -31878 -48072 -26659
20533 -26659 -22571 -9506 -5383 1461 -16189 13889 47137 47264 55594 59572 66504 46592 -10885
20520 -10885 13389 31184 47235 25016 34389 38053 56621 53274 35210 30811 2950 -27068
20508 -27068 -39002 -15200 -17085 -22555 -35721 -48328 -28938 -40689 -56721 -39046 -12399 -21561
20496 -21561 -44251 -42701 -28436 -33740 -39672 -36779 -38006 -28273 -8414 -43343 -39176 9817 52264
20483 52264 63908 43775 23288 22365 51289 47510 36225 19998 9274 2318 16454 26003 20269
20470 20269 52970 39402 13068 30707 37653 5805 -9203 -15142 -13739 -10273 -2545 -233 616
20457 616 -2941 7646 -11190 -12264 -24269 -23705 2932 10934 6504 29037 34340 24588 10592 -14050
20443 -14050 -15397 -9874 -1547 -22959 14581 39294 10802 -22471 -8038 -11949 25260 15548 -19298
20430 -19298 -36240 -20446 -15280 -37834 -16451 -11231 -51534 -47252 -21295 -26759 -18688 -5843 6397
20417 6397 45013 69060 86028 63301 32198 26591 60610 76253 42737 33280 3346 18112
20405 18112 40750 32314 37229 35105 28735 14488 10642 24583 63938 56691 33342 25384 11978
20392 11978 -746 10538 29221 -2163 -32619 -25831 -32877 10574 12881 -41910 -44381 1759
20380 1759 -5391 2390 39657 72099 87550 57239 28758 3206 -4722 -14475 -64 -9831 12523
20367 12523 16893 248 -4648 -41509 -58421 -78383 -66518 -19680 -4625 -8203 18793 8305
20355 8305 2203 50992 38880 17632 14127 3555 1046 1843 -7139 2658 -17802 -22621 -16584 987
20341 987 7813 -25559 -34447 -66315 -42075 -12273 23461 47070 32720 46452 19259 -8185
20329 -8185 14756 17569 -3334 -46149 -41896 -48327 -66832 -63200 -64252 -35681 -6297 -16002 -1767
20316 -1767 22005 33031 -2227 -30330 -14335 -12006 15282 13604 -13674 -34173 -5546 2965
20304 2965 -47811 -29422 -33129 -27344 -42660 -37838 -31109 -35308 -67675 -65874 -34550 1248 -10150
20291 -10150 -25067 17711 17253 40562 14326 -24491 -29443 -14852 -38194 -59514 -93459 -86675
20279 -86675 -61816 -29023 -21572 30397 31869 16885 17349 -37738 -66548 -66631 -39442 5819 -5979
20266 -5979 -64627 -60555 -28896 -35765 -18387 -15841 12152 1290 -14236 -42807 -16464 -20605 -20894
20253 -20894 167 -7375 -1130 -16734 -33760 -7970 707 -32500 18691 55041 34479 15486
20241 15486 -4620 -19813 -40327 -27248 -34656 -43967 -41251 -46815 2151 12390 8729 -42885 -54065
20228 -54065 -14075 47878 42203 1027 -9692 -5049 9810 -2185 -26711 21660 14104 19009
20216 19009 14305 -26016 -33382 -36267 -56566 -59145 -29354 -3819 -33245 -38483 925 43579 65932
20203 65932 55848 3901 -17878 -32538 -675 51358 38701 38103 21517 8691 22094 49087
20191 49087 75089 77045 63948 53644 38753 68223 58580 15372 -14686 -843 -8518 -42101
20179 -42101 -20514 -50730 -40214 5097 -10704 -9098 -5376 -24859 -44459 -60384 -58546 -32611
20167 -32611 -12689 -38896 -71039 -74173 -74186 -44675 -38541 -50201 -7830 17732 8029 19376 20697
20154 20697 10191 6699 -19671 -36346 -52329 -30745 -27710 -66624 -89512 -78483 -54411 -19227
20142 -19227 14991 2559 -21173 -60566 -13431 21626 7731 -2812 -10912 -38515 -28707 -267
20130 -267 10319 -12245 19859 7151 -4043 -9293 -10363 4711 -8103 -26962 -3219 -15764
20118 -15764 -9128 -275 -6271 -22709 -13457 -30047 -21103 -3387 20502 -7442 -16230 -5342 14215
20105 14215 9665 5531 6868 -15904 5485 13578 19437 28483 9725 2768 16476 26454 12633
20092 12633 12296 12028 13171 11932 -23735 -17435 14441 36301 9317 -19066 -29183 3898 16466
20079 16466 39124 45131 15596 32302 1782 -1527 362 21141 954 9900 -1042 431 -10668
20066 -10668 -17244 -4199 -8844 -4033 -16441 -28453 -24855 -23340 -27637 -5486 13823 -26579 -50489
20053 -50489 -60446 -42032 -14329 6272 -13806 -28248 -93 -419 -35231 -40122 -77737 -64680
20041 -64680 -21413 -37195 -57702 -69875 -63021 -48712 -63347 -34236 -15959 -12126 -12825 -2572
20029 -2572 -24324 -5741 26375 -36013 -37871 -2773 5420 3305 -38601 -59457 -80471 -76984 -74596
20016 -74596 -69869 -70100 -61806 -25978 -961 -13440 1847 198 15483 13888 -2337 23593 39115
20003 39115 40127 34973 14667 5983 -47157 -42236 -27 20986 9626 44309 14399 16060 -4169
19990 -4169 -31283 -16130 -25345 -24758 -31876 -39531 -16384 -2037 -31256 -71234 -68753 -76609 -79641
19977 -79641 -77562 -70011 -55327 -14882 2823 -2494 -18873 -41547 -45105 1283 8797 -53504 -62258
19964 -62258 -51983 -23749 35018 72889 51927 9652 -22821 -29348 -51399 -69787 -41622 -7868
19952 -7868 7123 6277 15970 -16474 -30972 -63709 -84564 -93197 -55864 -34836 -35220 -40443 -4928
19939 -4928 -8594 -24730 -8047 -10784 -47780 -43333 -65235 -51856 -3859 -10860 -44946 -31631 -56103
19926 -56103 -53150 -75690 -68666 -68282 -67847 -46954 -4428 26048 15853 44275 71132 77090 32034
19913 32034 19810 38929 40326 8721 -1907 17664 35461 55930 60783 24761 10294 11972
19901 11972 27373 2312 -40010 -43079 -45974 -58153 -38912 -32032 -51351 -41221 -26733 -22687
19889 -22687 -27986 -13285 -12714 -38240 -29109 -22917 -7047 -20104 -11795 -60038 -101599 -125136 -84616
19876 -84616 -67580 -68317 -76547 -85464 -87401 -76265 -94475 -91236 -42432 -32264 -38533 -30954 -21867
19863 -21867 -29380 -22873 -32952 -28392 -27393 -30421 3634 47484 30103 -18115 -16979 3148 4897
19850 4897 42207 58278 40990 -5366 -28199 -6541 -18689 -37993 -44937 -53478 -29989 -2322
19838 -2322 -37422 -90311 -116275 -90065 -56150 -727 16100 -36182 -79046 -28480 -21234 -76873
19826 -76873 -70003 -40830 -21593 -11587 -16067 -19322 10401 -3425 -13669 -5246 25627 31741 11122
19813 11122 -10019 159 16137 754 -19296 -53687 -65520 -68979 -57347 -16579 6400 -23948
19801 -23948 -5518 21130 5803 -9936 -2278 18736 36981 -3996 -1831 -6608 16073 38434
19789 38434 48787 28239 48993 94654 67518 60430 69725 21117 40674 97176 118034 119891
19777 119891 128618 139301 146484 150136 169848 204152 256040 339447 444685 519567 561243 588462
19765 588462 615296 602228 571781 488463 389922 344773 335503 340303 341170 392344 502723 610012
19753 610012 675050 653501 632061 571366 494224 408044 313125 260101 225725 161796 139330
19742 139330 112815 89015 98699 75335 54615 34762 9206 14612 29802 40098 -2291 -10249
19730 -10249 21523 33275 50206 81576 71973 23944 13089 -5386 -11830 -1071 50065 82799
19718 82799 46410 37662 -4323 -18631 23033 -286 -37418 -56154 -61611 -38825 22982 40936
19706 40936 28365 43187 22908 -30329 -61768 -25285 10476 9545 -34888 -41788 -18268 -12772
19694 -12772 -8624 -3514 9731 17657 7579 -11441 -24199 -20073 -39708 -52254 -33719 7653
19682 7653 14342 -26956 -27943 -3772 498 17952 27318 21931 15122 2356 -4799 -1111 -21398 -47654
19668 -47654 -62949 -61479 -26596 -11464 -24954 -7157 -6301 -17825 -23424 -54921 -40759 -35762 -20837
19655 -20837 -43730 -63014 -19449 18856 4738 -18046 -12728 -15089 2600 12516 31899 51583
19643 51583 16070 -5170 -2377 30771 41794 58208 57014 40622 36942 9410 -6659 -14512
19631 -14512 23507 18380 -22410 -23370 -3824 24396 20028 10933 -24345 -58968 -87993 -88068 -73091
19618 -73091 -40540 -21824 -30306 5426 -1877 -16168 -31261 -11723 -12236 -21633 -32370 -22713 -11955
19605 -11955 6394 37201 65104 35133 15061 26966 7759 -12255 -22050 -21139 2806 14289
19593 14289 20421 2404 24885 24587 38569 38293 38677 -12566 -18770 -9884 -10168 -24608 -32791 -48776
19579 -48776 -41236 -27221 -24415 -29133 -24311 -17066 -28382 -50806 -48585 -31423 -16916 -19773 6948
19566 6948 8311 -14261 -3555 -20613 -29111 -43372 -56470 -59404 -61544 -95946 -105552 -85347 -61081
19553 -61081 -34944 -51050 -65836 -44623 -21197 28213 46760 7772 -23754 -51432 -50435 16903
19541 16903 33965 37032 16015 -15705 -47786 -45479 -51824 -55465 -53736 -29143 -34314 -29892 -19272
19528 -19272 5174 -6669 -36231 -32963 -17042 -42541 -21859 -46877 -59864 -45385 -30636 -36148
19516 -36148 -62722 -80363 -61445 -62515 -58173 -68928 -48831 -26724 -33540 -54811 -42246 -22388
19504 -22388 -15232 -24806 -16459 10020 -26242 -20986 -32093 -22701 -1462 27168 27676 -7739 -4116
19491 -4116 -9934 -12947 -9972 -16853 -22409 -10251 -491 8314 34645 27386 -4031 -35419 -61441
19478 -61441 -113374 -133085 -94677 -60958 -65389 -24810 -4230 -1393 -7529 -45153 -61771 -56477
19466 -56477 -43462 -12863 11473 16873 46409 44872 42920 33453 12256 -12108 -47402 -45559 -10518
19453 -10518 -23447 -28453 -39934 -29854 -15913 -25509 -37680 -58741 -48143 -22137 3599 14575
19441 14575 5323 2628 -16644 -27744 -50082 -66229 -58727 -44972 -51734 -28439 -16207 -18221 -9769
19428 -9769 -3167 976 -44069 -53239 -60018 -46927 -14543 46808 69267 42500 -19694 -23876 -42461
19415 -42461 -35587 -62329 -75613 -53080 -45096 -42676 -38219 -13995 645 -10470 -7100 -22458 -16819
19402 -16819 27907 37637 26501 -6114 -2200 7543 21324 12085 -971 4257 23435 10992 18395
19389 18395 2510 -27380 -11604 3752 6716 13384 4178 -1879 33904 61515 78793 31258
19377 31258 -470 45026 62231 62673 90167 53874 56647 50941 -2181 34502 44740 61243
19365 61243 56100 1637 20708 58485 52746 35840 35744 49988 34387 49534 43369 6462 -2954
19352 -2954 30803 92429 130731 127320 100729 61603 37964 48764 30996 41315 65644 57260
19340 57260 49684 60342 84332 59947 46655 41359 17222 -1619 5443 14795 -19388 -33557
19328 -33557 -43098 -21480 2315 -9634 -51915 -67911 -59594 -71620 -112055 -116737 -70708 -2377
19316 -2377 -2979 13314 -2238 -6622 -22109 -17468 -15526 11756 -18480 -52136 -54743 -49926 -56449
19303 -56449 -58878 -35374 -6125 -52983 -46195 -44229 -35903 -12516 -32133 -70781 -69625 -50165 -24106
19290 -24106 21249 24980 26176 55098 34207 49016 65900 56444 28581 29228 50805 49691 26132
19277 26132 4046 21425 1364 16130 18090 5047 3347 18498 -38841 -81661 -74209 -65964
19265 -65964 -49142 -30961 -24299 -35202 -51997 -46937 -25647 16441 38519 3246 -32314 -38152
19253 -38152 -39972 -16178 5682 2940 24007 42774 39591 -26800 -59646 -71927 -36296 8101
19241 8101 62806 116800 110912 114513 131994 78729 16063 -19010 -4714 38159 98830 187526
19229 187526 247862 342238 367447 358937 368366 339889 262853 184836 165897 160602 169351 154745
19217 154745 160828 219688 282693 308004 319545 347026 339175 334630 274108 244604 255727 237568
19205 237568 216920 221071 240379 247780 258371 255184 243396 238801 263928 308276 329219 328781 346550
19192 346550 365983 357801 340241 320628 328833 287918 288569 342673 395162 450325 443054 473297
19180 473297 534978 537834 577997 607006 650555 692560 705642 749078 833669 957636 1020208
19169 1020208 1112300 1204574 1330258 1452776 1560606 1661790 1767356 1860909 1964199 2105586
19159 2105586 2204143 2264084 2314980 2339309 2391744 2387822 2376783 2398064 2500369 2577620 2614158
19148 2614158 2732660 2818353 2890781 2958257 2957463 2884056 2744909 2616291 2489293 2369836 2259762
19137 2259762 2254520 2316574 2433418 2586931 2801565 3003694 3199385 3280795 3285927 3229364 3205183
19126 3205183 3266222 3440810 3733080 4016860 4306116 4620101 4963524 5404240 6003264 6742105
19116 6742105 7675696 8933084 10684259 13325962 17395569 23704963 33395276 47799445
19108 47799445 67680212 92312788 118609731 140297383 148458926 141799941 123966470
19101 123966470 99267018 77287170 61711411 53166021 52039924 58327084 72042210
19094 72042210 92426065 116657950 139504602 152197496 148809688 132928690 107306663
19087 107306663 80287288 58356288 41956779 30532766 22988959 18010850 14678576
19080 14678576 12385914 10766187 9599521 8657595 7891761 7244833 6655236 6076302 5506812
19071 5506812 5051910 4650535 4318038 4061974 3940054 3928897 3963743 3984898 3942629 3785542
19061 3785542 3503956 3171463 2852335 2529384 2322014 2145928 1955310 1851132 1782911 1737272
19051 1737272 1733634 1742957 1754439 1721108 1645424 1505472 1376037 1233318 1076180 942112 829113
19040 829113 763033 708520 662855 657807 601353 551696 543898 510144 469185 437708 421415 419420
19028 419420 415707 402761 405273 407889 356643 330554 331767 324386 302936 289416 242333 224275
19016 224275 237787 245354 236399 227711 196231 161655 192490 236825 229030 213968 150439 131366
19004 131366 148558 179543 192526 179661 183244 227916 215256 177792 172447 135587 132130 131429
18992 131429 116191 95859 105876 140713 121822 96174 70355 60561 9135 11094 54605 54551
18980 54551 35501 71137 107484 139170 207831 225440 229356 197385 141759 89004 46230 -15719
18968 -15719 -61187 -11785 55888 77125 144837 227399 268032 300499 323014 294629 228642 133925
18956 133925 101150 91322 107883 113480 147273 129677 169372 181784 168299 197942 229081 299177
18944 299177 288395 269732 320660 344653 325780 311920 292222 270442 236564 199489 177614
18933 177614 177091 186920 192692 245555 299824 293667 288681 283575 234873 172950 130250 133957 140200
18920 140200 140021 128720 120220 117897 83238 78830 71277 105940 170679 192002 177862 126431 92105
18907 92105 67810 69351 89817 59322 28637 21622 48176 73992 87830 68003 99196 126210
18895 126210 103030 92966 71542 49906 37328 40168 10210 6113 22173 45186 65566 77128
18883 77128 68575 31561 23727 12813 22740 70434 80604 94819 86258 94442 80748 54336 3705
18870 3705 4680 8475 27138 49607 62433 80081 103571 108975 71716 34904 40964 67677 80166
18857 80166 63675 32226 50694 83151 105285 70015 30812 37705 38120 46721 36106 42051 24075
18844 24075 15727 28196 11164 -18279 11436 15647 33748 60709 55610 39610 71400 48076
18832 48076 32520 66287 96224 63885 31902 20643 37079 27059 41403 47244 37217 71535
18820 71535 73798 59705 43505 7070 759 16221 78137 81931 38356 19685 30102 5235
18808 5235 -22484 5662 28979 45478 95263 107165 80421 71741 90137 80853 85132 48786
18796 48786 8991 4815 4947 9859 24258 33854 2020 2141 16312 25575 57856 58475 25651 5647
18782 5647 19834 13912 24791 52405 68364 53791 15978 13416 35521 37129 46979 66993 42494
18769 42494 20493 54952 30932 1374 30823 41892 34434 34813 26151 35876 37357 34208 60865
18756 60865 74403 68666 61226 56917 29905 14823 32649 -2721 -7980 9016 -5797 -43242
18744 -43242 -26981 -21255 -8672 22955 36406 33773 55922 61497 59671 10603 2691 37687 54561
18731 54561 69709 62703 9076 -2056 -7249 -18817 -27463 -31779 -53043 -11894 -17106 -22091 -16554
18718 -16554 -42655 -2524 71266 111434 71708 50916 38181 30408 54526 40425 26477 37652
18706 37652 18740 19303 35036 32322 57126 32694 -12651 -21065 -14593 -21917 -10177 -2188 -7129
18693 -7129 -11314 -33292 -14388 9426 7985 15245 11814 -6681 -295 -29706 -44916 -23588 2914
18680 2914 23203 -6054 -69648 -56889 -1002 -10729 -62370 -75409 -72263 -47929 -57561 -73235
18668 -73235 -40767 -1457 17752 -12053 -54173 -28491 -11013 -7653 -6321 -14541 -29071 -71048
18656 -71048 -80199 -62647 -77845 -72386 -47994 -8843 -33580 -77968 -85992 -61612 -23797 -30460
18644 -30460 -24560 2528 -54549 -39264 7251 20187 33348 62979 70938 13000 -1332 19468
18632 19468 32232 20125 22670 14736 -19322 -14307 -3827 1255 10137 40377 -4451 8805 37785
18619 37785 22108 -23081 -21094 15656 69570 74051 67738 95715 94284 50334 44507 57521 51861
18606 51861 59472 59586 8444 -42098 -42312 -65837 -81047 -58072 -56653 -36597 -24475 22652 5829
18593 5829 -21450 -2033 12441 -4432 -24101 -17217 -14601 -36188 -22517 -8259 -14601 -45239
18581 -45239 -19205 -34925 -10182 -16271 -8126 18343 28461 22167 20558 5907 -8968 -26033
18569 -26033 -40807 -22533 -54399 -26926 13621 -20185 8481 6090 -10419 -72851 -128556 -120925
18557 -120925 -61925 -33256 14264 25363 577 -39144 -23691 32272 53292 17774 -12327
18546 -12327 -23184 -31291 3129 33544 9546 -46303 -49449 -2354 -3619 -37561 -52477 -48453
18534 -48453 -106106 -120275 -98340 -58307 -36298 -20234 -18549 -22129 -23073 -30578 -21632 -33679 -28099
18521 -28099 -19413 -8134 -38149 -68643 -111965 -99497 -76681 -82594 -49333 -7025 -13347 -8596
18509 -8596 37063 52036 41369 30431 19991 816 -9401 -44524 -31334 -17267 -9974 -29715
18497 -29715 -37940 -45809 -8100 20363 -3154 -5427 -751 34766 51160 50987 45880 27179 13999
18484 13999 8492 2828 17527 6014 -7076 -22928 -8508 1277 21311 44163 73240 48364
18472 48364 28354 59243 47780 27044 27855 28084 34732 32512 19838 12828 4277 -10810 -2383
18459 -2383 11114 26483 29870 32848 11683 76140 100374 72365 39589 6825 36638 70460
18447 70460 63796 49869 35001 41966 62536 120475 159067 216955 279052 312361 389852 500299
18435 500299 590814 637996 661617 662022 596193 489209 413424 370235 329744 336679 406101 477360
18423 477360 532317 568728 606970 652729 692224 667284 582775 479575 379640 303438 242736
18412 242736 168594 105796 77038 78331 66660 71646 83965 81055 79406 44294 51649 20492
18400 20492 -12117 5589 -6539 -47339 -31616 -16558 -23114 -9960 -22192 -14350 -13121 -23605
18388 -23605 -16076 307 39740 53165 7438 956 15181 29803 31948 18022 -16369 -19859
18376 -19859 -5656 -38132 -51571 -43888 -65806 -48462 -39340 -22636 12395 51421 91683 59980
18364 59980 1994 -15715 -45345 -38963 -7982 -14337 -28866 -15048 7695 18473 -613 1713
18352 1713 -639 10176 20730 23767 10400 7718 -13952 -39577 -58554 -19325 -6067 26883
18340 26883 59471 31818 15537 4891 -39037 -41047 -750 -15893 -28567 2949 -8432 -50951
18328 -50951 -49130 -14006 352 -4701 -36765 -78150 -52671 -21220 -7491 -58567 -88081 -56072
18316 -56072 -17227 23219 15062 -8090 11257 37789 -4514 -41640 -43549 -11041 -13669 6335
18304 6335 40000 18009 9497 -12563 -24624 -40133 -53195 -55667 -28386 17920 14469 -24161
18292 -24161 -46994 -49522 -10563 23725 34212 9810 20867 11475 -23804 -25418 -77728 -99186
18280 -99186 -50874 10578 -856 -31826 -48290 -55790 -79965 -66571 -64727 -72566 -87380 -67562
18268 -67562 -18795 10538 23519 13199 -19010 -36317 -19130 15637 1211 -37355 -41694 -1947
18256 -1947 9328 22202 -1432 -15103 3257 -21497 -30863 -20628 -19507 -16654 -46277 -83400
18244 -83400 -54302 -23231 -55372 -64016 -26876 -32044 -54181 -31793 -15932 -49544 -36949 30753
18232 30753 76538 33108 8456 3000 11102 3919 -6147 14027 31690 35225 24718 3464
18220 3464 -14018 -18488 -4389 49259 57475 59613 73617 76859 77842 100507 84413 45694 43413
18207 43413 44232 87718 102038 134386 158310 148774 163213 228158 278298 363490 480592 591091
18195 591091 652000 673018 648305 579609 474030 370606 317473 287870 303026 351354 413517
18184 413517 451063 537392 616242 676887 692039 638442 544173 433008 345972 271797 196366
18173 196366 137449 128539 90341 70540 68959 46073 48967 28542 -6439 3817 30634 11675
18161 11675 2259 18259 93 -32364 -23636 -33166 6057 31198 47048 25214 8514 45285
18149 45285 53698 52878 61440 43314 -28931 -49114 -42795 -36689 3426 33289 34084 21629 19467
18136 19467 8637 -24582 -28451 -25145 -30457 7105 35531 28198 36964 15618 -14235 -28430 -24075
18123 -24075 -19582 -19267 -30235 -654 -3484 -20617 -35958 -46311 -42894 -28997 -27209 -37410 -40097
18110 -40097 -37773 -37660 -20921 -2677 -5255 1677 -1738 -18674 -12320 -5851 -24894 -30100 -29243 -11538
18096 -11538 -6020 7734 11806 991 1504 -4490 -35162 -50910 -54951 -31446 -50118 -50419 -51940
18083 -51940 -72355 -65209 -61826 -42122 -20781 -18116 -3030 16245 -29417 -2360 -6451 5814
18071 5814 54170 43466 -19870 -54123 -69915 -61481 -35385 -34568 -12738 -2653 -668 5348 1704
18058 1704 16375 656 -5251 -1390 22703 33727 -19065 -48450 -40178 -45846 -54985 -31589 6744
18045 6744 14416 22061 38323 42052 4136 -12774 10730 35475 70160 43659 2770 4964 7589
18032 7589 7464 36886 43842 34864 -19855 -33371 -12576 22141 70687 47321 47859 29197 4423
18019 4423 19866 37294 49704 32412 17367 -2855 -23481 -48883 -7788 21715 5727 -23361
18007 -23361 -29705 -38095 -23239 -2955 340 3902 23693 4012 33840 61713 77574 96602
17995 96602 86294 67288 39640 34473 39912 2021 -12500 -12136 -22022 -14667 -13734 -1785 -2841
17982 -2841 -4260 21864 -11258 -20375 -18797 -11102 20854 30523 9397 -16107 25534 43481 47914
17969 47914 50590 38134 40940 34593 12428 11674 11354 40362 59086 92745 73260 45120 20542
17956 20542 37224 61742 61918 75136 119917 85362 58452 58522 53279 82649 87596 36283 41869
17943 41869 39175 25926 30707 46393 77794 51865 13830 -18688 -41427 -24530 -16424 9192
17931 9192 5449 -12942 -24993 -20895 -13844 21597 37278 26779 10410 40384 47059 30151 6405
17918 6405 27884 65992 70550 28929 1981 -1898 18811 38258 86580 82684 62493 75957
17906 75957 36241 46332 59140 79781 85220 71795 85459 81538 87727 83778 100291 126919
17894 126919 135235 123360 94202 61148 60497 95980 141198 156308 128152 177350 193368 175035
17882 175035 184428 209073 225672 219479 248987 235059 268370 297573 308212 300100 242074 204700
17870 204700 221935 260342 231761 208842 205407 251765 260259 270307 267514 295981 329908 295958
17858 295958 307998 327486 337339 324011 294718 293567 312969 343274 337950 323683 348845 342130
17846 342130 329369 334712 356867 373582 398500 436884 489154 536023 553851 533263 486266 476038
17834 476038 483244 500654 507778 489901 523180 560275 564256 540333 583007 610321 561190 546330
17822 546330 589310 584147 534498 560257 619222 632268 646121 639377 633622 658780 646604 622628
17810 622628 601021 617154 574746 511207 498540 503611 490664 495142 531102 508894 492192 511836
17798 511836 524272 510943 498123 507194 516194 506876 474170 447366 428694 436566 380055 376308
17786 376308 354496 358891 337425 327698 286020 294109 290530 339372 362032 332283 307736 314149
17774 314149 295803 256713 263042 242115 226194 244691 276705 314614 380588 413086 411506 358326
17762 358326 327402 256742 187673 149046 140258 239828 322063 400264 481040 529901 549787 564618
17750 564618 536729 419780 291652 239059 202273 240718 276092 337481 410579 484784 523044
17739 523044 526686 525233 483733 481867 449155 396352 361483 328892 302495 268204 258822 267114
17727 267114 283697 314640 310108 286962 318319 322569 318214 312576 329244 317256 303659 309593
17715 309593 297273 266194 241872 293418 265429 241282 250393 286422 294080 307406 322181 313101
17703 313101 299693 331817 348743 346743 392370 396977 411460 406018 442568 469392 458129 459658
17691 459658 481078 509259 526669 505049 472583 441211 440358 448080 497050 525990 524658 557417
17679 557417 577997 601447 647563 655821 649097 645044 643983 630777 618431 653218 735766 819259
17667 819259 927980 1026227 1109964 1253946 1485690 1802179 2120678 2429403 2615106 2637002
17657 2637002 2559908 2403233 2300806 2310981 2420554 2594317 2834143 3141701 3597270 4197302
17647 4197302 4833571 5471171 6066874 6580322 7193431 7982704 9031009 10423895 12435056
17638 12435056 15477114 20020395 27084107 38191331 55048541 78650792 107586184
17631 107586184 136454988 156060653 158137548 144306554 118616649 90611866 69080352
17624 69080352 55652396 49953214 51477743 60368388 77196189 101201431 128425239
17617 128425239 151020246 159086009 149575859 126624465 96140281 68967062 48877924
17610 48877924 35239907 26402986 20678957 16859162 14318362 12498242 11064470 9907777
17602 9907777 8978994 8154313 7428520 6771555 6206723 5696311 5290187 4939770 4552237
17593 4552237 4247235 4037557 3851981 3749770 3693522 3657959 3561783 3428490 3290226 3048621
17583 3048621 2864468 2682311 2488231 2309452 2062611 1813157 1632235 1490132 1396868 1319238
17573 1319238 1225379 1130249 1034853 970518 930176 859162 768893 749709 734655 676817 631258
17562 631258 561020 516989 500344 502571 501436 493340 437407 415167 455239 434402 388788 361558
17550 361558 354044 354791 396432 427740 395359 340696 328562 322994 303536 257336 242818 268675
17538 268675 265989 273375 276106 256668 252208 256440 213825 212713 207139 193915 176902 178901 167801
17525 167801 158331 150714 121048 91411 106926 125682 115493 143043 153205 160331 159538 122827
17513 122827 97625 93719 70226 47383 12786 888 18244 51986 116633 178098 206849 243084
17501 243084 239465 237310 227304 174714 136506 100557 47372 -24371 -29551 32572 82080 123127
17489 123127 176655 246201 261692 284655 270809 269519 243746 177652 153640 171198 182721 169735
17477 169735 185961 206778 212343 210871 166122 161587 143449 154002 134570 120508 128110 158254
17465 158254 192923 196718 185633 162325 120934 102880 116108 142760 128196 116828 138682 172524
17453 172524 158247 141405 144934 127288 133676 119556 82140 77258 96730 123768 132722 154106
17441 154106 147940 134290 147891 140229 161985 148428 130272 125330 119129 74780 12235 60150
17429 60150 114295 94931 106423 128269 161847 165415 165459 152215 157825 136394 118279 109045 91541
17416 91541 94553 91026 68679 66716 81776 97471 88566 81785 69040 62931 70576 61391 38198
17403 38198 90190 100363 66856 53805 84972 89175 59230 35394 25261 -16860 -47274 -16587
17391 -16587 20796 7698 -8781 50262 64856 48537 42422 19778 23382 43546 70833 79123
17379 79123 74736 70411 61367 52493 30963 44313 86945 78147 72407 17585 -18694 -26313 -31359
17366 -31359 -27713 -3778 28735 22751 40335 34342 32798 46198 29033 29401 38488 34879 37094
17353 37094 17547 38614 87569 68472 -14833 -15150 37841 66471 49220 27539 39677 35211
17341 35211 21109 21397 20991 22905 8220 -19144 5925 36980 64136 71984 45696 51035 61888
17328 61888 83310 114065 124669 113487 89409 88353 73217 69375 72739 87732 56084 58573
17316 58573 89012 95440 105792 65182 24811 20771 7773 -9389 -3799 4469 49165 50126 48451
17303 48451 47168 27417 41283 62568 53824 31986 47150 61666 46503 35777 42158 82754
17291 82754 104915 83928 53395 16986 19040 39733 63248 68389 40760 30097 36483 46196
17279 46196 21586 16359 26819 29268 18114 20825 11690 -3248 1121 23651 41507 28102 15188
17266 15188 48540 75582 31258 -26383 -44860 -23913 -14855 -754 -21810 -26896 -13671 7880
17254 7880 29928 4038 -12124 -17390 -34796 -65993 -53181 -28791 -16734 5798 15123 22462
17242 22462 24139 22875 6161 12592 21058 40674 11666 5453 10847 14530 32043 50298 44109
17229 44109 29283 11639 4756 -57274 -65799 -40605 -33687 7470 94 -12980 -40791 -78224
17217 -78224 -61669 -34795 -46525 -2136 55312 18468 -19096 -31930 -37306 -29639 -43310 -34495
17205 -34495 -33992 -23098 21495 50044 10917 -26441 5920 13014 -24311 -39036 -12371 32516
17193 32516 59185 58290 22652 27028 37943 48531 61737 61752 50376 38586 1160 -31025 -65075
17180 -65075 -67429 -32132 -27821 -27851 -53999 -28923 -12415 -1924 6347 -19639 -13083 676 -12962
17167 -12962 -26846 -25492 -12660 -23134 -38084 26008 94341 96588 46276 26350 -28874 -63869
17155 -63869 -61365 -26373 5754 16139 26029 31913 36996 25298 -6097 -35420 -9092 8367
17143 8367 -11887 14432 53674 49092 28750 46015 62446 19793 -35261 -31316 -20179 -16200
17131 -16200 -16971 4473 -9711 -5369 -16430 -17071 -37329 -26012 14061 35831 27559 49379 58545
17118 58545 65842 46536 16130 -3668 19205 -2818 -43906 -13047 -14001 6179 -12303 -28480
17106 -28480 -35022 -14127 14517 49722 43288 18661 9447 -24854 -50463 -25187 -44334 -42606
17094 -42606 -11704 19744 46960 32048 24014 22850 60717 80185 37780 49448 50728 16427
17082 16427 33299 66479 66894 60519 50158 18082 55836 79786 75864 24363 -910 15685
17070 15685 45464 75812 75899 86835 123569 171158 172737 225265 320698 450564 582629 640884
17058 640884 675455 695862 672091 585175 468814 395848 382010 345635 351506 420658 512144
17047 512144 579764 652108 691832 665942 628483 526928 345532 242636 201713 190981 151612
17036 151612 123223 82905 71531 81402 63471 14075 27374 60286 62358 49204 14036 14423
17024 14423 20047 -28185 -24127 -20961 -38273 -36454 -19503 -7550 12138 43298 57814 49991 59197
17011 59197 54878 28651 24475 26411 46383 59451 41177 29451 7227 -4210 10444 9355
16999 9355 -3909 5665 6554 773 -23877 16282 17757 6579 -21324 -20664 2463 36870 8253
16986 8253 -2497 -27724 -34879 -30835 -34444 -53003 4429 -18450 -30320 5120 -16436 -22046 -38278
16973 -38278 -60842 -43548 -14545 -18615 -44395 -68590 -19449 2963 21151 22726 -38294 -31600
16961 -31600 -5901 -17378 -3837 9210 21656 -25818 -32221 -26579 -27512 -20253 -7689 -22275 -13917
16948 -13917 -11681 -27848 -13101 2239 -22859 -36111 -36495 -11810 15388 19802 25027 13153 -23440
16935 -23440 -38022 -39730 -40773 -35260 -27492 23667 16152 14158 5574 -2220 -34160 -47118 -28369
16922 -28369 -48076 -22999 -13383 9926 33802 18176 772 -5796 2204 10240 -3988 2345 -32224
16909 -32224 -39777 -31473 -3784 13519 30007 22052 37220 41123 6747 -18227 110 -3708 14613
16896 14613 16006 11835 -26 -34390 16094 43808 27432 -18450 -48441 -61928 -44163 4128
16884 4128 18651 22545 32148 27189 5040 4041 -8149 -58710 -43330 -44397 -44350 -20423 -39787 -55982
16870 -55982 -78964 -118541 -102227 -56278 -26285 -38687 -33640 -10224 22248 28808 44571 56429
16858 56429 55485 37595 -4124 -53862 -62949 -59653 -55491 -77788 -76555 -36916 11018 7430 15208
16845 15208 36296 39300 17508 -24985 -65177 -54829 -26733 -10603 2917 -32248 -35885 18375
16833 18375 21206 -13613 -47993 -36065 -29330 -37350 -7640 -11155 -15406 -25727 -58100 -58017 -22967
16820 -22967 -6126 -39178 -25449 -13438 8187 -10312 -28527 -57363 -65793 -51325 -65610 -53973
16808 -53973 -34370 -14256 -5161 2683 12127 17594 -15105 -33560 -51781 -51902 -71673 -101459 -69359
16795 -69359 -37733 -57700 -78159 -90029 -76138 -17732 -6647 -26090 -42806 -32388 -41998 -44763
16783 -44763 -30931 -12029 15364 9130 -6939 19840 17336 -807 16269 -8079 -5094 -43345
16771 -43345 -94706 -63877 -46214 -52688 -52573 -36807 -23379 -32425 -66935 -67812 -76554 -78542 -25050
16758 -25050 -12704 -29503 -25123 -41579 -72355 -99077 -93934 -96651 -63436 -17912 24631 48002
16746 48002 62124 65058 71873 51264 50314 48837 42461 -16601 -38925 -35280 -8556 -10786 -121
16733 -121 -1282 427 22853 9400 -8158 -18557 4142 438 -276 -3803 -27557 -64306 -95512
16720 -95512 -98167 -89813 -70711 -36134 -26709 -41197 -32105 -34609 -31699 -1835 7161 -15674 -27791
16707 -27791 -25584 -16520 -38826 -40456 -52883 -85637 -130524 -108980 -94043 -80824 -37799 -394
16695 -394 7210 4941 -18409 -72067 -78865 -27413 -32320 -39327 -31073 14244 48867 44383 5699
16682 5699 -373 -5282 42002 20521 -6130 30031 36448 16076 21643 49809 30524 5049 -20855
16669 -20855 -40461 -38652 -12297 7979 32729 43561 2693 21495 17472 -25941 -37838 -52302
16657 -52302 -34914 -62127 -29142 22697 72290 73107 25689 40606 24475 -6915 -13641 -10760
16645 -10760 -31689 -6001 -7155 -21110 -26854 -19167 -72624 -84076 -73034 -73262 -71324 -74124 -68884
16632 -68884 -48456 -26875 -560 10649 12722 21591 193 -1991 10542 -20942 -5158 21595
16620 21595 77761 80658 48679 36013 1973 6643 56642 103276 112502 72048 29001 -7543
16608 -7543 -41553 -55218 -59077 -42443 -14932 -30715 -36156 -21308 -8638 -12827 -24725 -52898
16596 -52898 -52779 -50658 -66375 -96146 -70843 -36821 -41905 -69952 -83520 -82989 -94128 -89552 -48301
16583 -48301 -16934 -11378 -17273 -46888 -27737 -25631 -30143 -7143 -4680 -1039 -11304 -46429 -53451
16570 -53451 -52385 -94167 -79353 -16101 281 -23060 -11174 15649 -23061 -96294 -136848 -125073
16558 -125073 -68655 -47409 -16383 14052 -24044 -53073 -15795 -46108 -84357 -52953 -26776
16547 -26776 -40167 -26975 41767 58596 21330 3731 -7268 -43103 -38808 -53027 -55709 -21148
16535 -21148 -5937 -38772 -38991 -9645 22233 13974 -50141 -57996 -47223 -33525 -21902 14065
16523 14065 -3387 -24763 -26568 -2753 25375 -14157 -29900 -13997 2530 14428 11527 -649
16511 -649 -26196 -42855 -16928 -15841 -17715 6328 31780 44891 48147 -18939 -27938 4134 -15132
16498 -15132 -24938 -43012 -71091 -57881 -56752 -49257 -56383 -9871 17683 18277 28115 8978 12266
16485 12266 -34674 -14621 4546 13135 42496 3592 -29597 -43138 -18738 -17349 -17811 -28273
16473 -28273 -13714 4377 18699 17485 -14683 -2043 20309 33493 24351 435 -28554 -7523
16461 -7523 7754 12315 19645 26917 11070 -15266 15427 1511 -29738 -22605 -35083 7228 51253
16448 51253 66798 43533 3065 -20457 -47965 -48466 -28322 -8505 -5367 -29500 -45068 -17167
16436 -17167 -843 -39921 -68461 -39136 -29104 16080 24919 19648 -5530 -16101 -33449 -21243
16424 -21243 -12944 -11052 20069 6613 -40634 -43222 -49562 -26758 -7591 -23842 -62282 -63491 -56731
16411 -56731 -54154 -62782 -73110 -45703 -32669 -19514 -3910 -5863 -24810 -48256 -68623 -131992
16399 -131992 -140850 -65118 7908 8694 25023 49246 34597 -32661 -72619 -62418 -62826 -44503
16387 -44503 -2396 31806 24719 13334 -25487 -44783 -20460 5758 32239 30479 -18549 -22407
16375 -22407 -15829 -25720 -47713 -53420 -54237 -27352 -28213 -1335 15213 11573 -16655 5836 19117
16362 19117 23538 -6199 -37232 -25132 -21837 -9888 4241 2276 -13737 3726 4948 -25090
16350 -25090 -28309 -64005 -78151 -60210 -86887 -48052 -21205 -39679 -59660 -83888 -50901 -18598
16338 -18598 -32779 -50109 -22334 -6613 -27154 1881 14409 -46821 -64190 -23840 9158 24966
16326 24966 15358 -22381 -20851 13671 3943 -18551 7297 -4257 -42408 -53580 -37330 -44008
16314 -44008 -25688 6834 830 -32412 -48156 -36819 -26572 -31944 -40462 -47813 -41125 -30066 -35923
16301 -35923 -61447 -59855 -19213 17928 -19004 -37839 -21942 5759 -8047 -34456 -63277 -89751
16289 -89751 -72405 -63980 -60340 -54905 -29569 2367 11454 31284 20420 853 -16005 -31768
16277 -31768 -29213 -36201 -53367 -48041 -52683 -34946 -29561 -21929 -28573 -35891 -35295 -74843 -104696 -101097
16263 -101097 -117369 -58972 -39729 -38287 -48243 -42480 -17154 -35543 -44526 -27475 -40659 -26778
16251 -26778 41177 55939 43956 22290 27562 15763 724 -12316 -6828 4588 -32581 -57716
16239 -57716 -66106 -63250 -70709 -99325 -123444 -124368 -106172 -96832 -67455 -27238 -15089 -98 -25216
16226 -25216 -26165 -36402 -81809 -52673 -61400 -57601 -87700 -78850 -47844 -43315 -36305 -47326 -60044
16213 -60044 -58609 -43843 -59902 -11224 27271 -836 -11459 -15325 -8905 -4935 6805 10636 -11654
16200 -11654 -4436 860 -14757 -8945 3712 -21883 -23700 -42255 -51527 -13630 16400 15356 13625
16187 13625 7466 15244 30694 46818 22870 -16904 -39428 -33012 -20762 -9097 3070 8035
16175 8035 1265 -34194 -72211 -71265 -26559 -14618 -21912 -40371 -52249 -59813 -87371 -66453 -69170
16162 -69170 -87783 -16152 6555 -34355 -24513 15347 54204 35557 -66705 -103772 -96804 -86893
16150 -86893 -141807 -165118 -172011 -139589 -86971 -36345 -2575 13680 14866 -9784 -20366 3321
16138 3321 -25912 -78341 -122249 -109322 -93098 -75763 -27176 11315 39040 61633 35611 3690
16126 3690 -22869 -36648 -57362 -64116 -33098 -2211 -18149 -40556 -65673 -92122 -58652 -49719
16114 -49719 -33774 -7809 51457 30326 17177 16115 32504 26530 -7449 -2537 17137 -15808
16102 -15808 9714 34207 38170 35974 14006 -32089 -63505 -51616 -11220 558 -7537 -25327
16090 -25327 -23127 11958 23677 27544 3890 37087 51010 5919 13019 26422 30251 29871 38504
16077 38504 23208 23868 24645 34793 30370 20184 6425 -39731 -47677 -32290 -19869 -38360 -2922
16064 -2922 46622 36894 31011 -33294 -75850 -35523 -19805 -5530 7232 -4588 -39073 -61561
16052 -61561 -46718 -21255 -10811 -18344 -43339 -50692 -29644 -29416 -22908 -47470 -67267 -49516 -32727
16039 -32727 -45501 -9583 2835 -23743 -9525 14738 8033 1766 -20364 -49986 -48358 -62640
16027 -62640 -74226 -63497 -28603 8894 44222 32531 21194 -12011 -8075 -3803 -13501 -41206
16015 -41206 -37028 -37998 -22376 -42755 -52844 -56092 -24734 -15148 -41915 -48767 -31767 -67552 -97308
16002 -97308 -51847 -14903 -1957 -33219 -51662 -42208 -55125 -55098 -41248 -34702 -4696 -11495 -12959
15989 -12959 -20791 -46102 -55731 -42444 -20188 -4953 10281 6544 39655 62191 31267 18401
15977 18401 11596 -7250 -38518 -98507 -94285 -45270 -6969 1220 -5506 -2821 -48489 -64794 -51446
15964 -51446 -38277 -17917 -33868 -45121 -56609 -80125 -45748 -32236 19227 35314 -196 -21992
15952 -21992 -9711 -10714 -18497 -38470 -50443 -34790 -36203 -42384 -41208 -43627 -39855 -46559 -49063
15939 -49063 -48689 -16850 -8265 4097 18801 2610 -39386 -27825 -14648 -27137 -50278 -70522
15927 -70522 -81756 -77266 -32324 -38261 -22892 -9562 -20053 -33146 -36087 -58703 -39740 -21856
15915 -21856 -39981 -19637 14800 -4544 -16979 -48815 -58478 -77124 -72325 -87403 -84803 -50149
15903 -50149 -24343 -29739 -27661 -24638 -35850 -26111 -35174 -53228 -54168 -73443 -112168 -127474 -113460
15890 -113460 -95259 -120428 -109285 -66658 -30364 -15176 -31847 -76252 -62584 -58104 -79525 -91339
15878 -91339 -121142 -124401 -58891 -46840 -52135 -34176 -21386 -54631 -51058 -56417 -75173 -55780
15866 -55780 -24691 -60980 -43619 -8533 -34900 -3834 -11252 -42069 -59211 -27442 5593 1725
15854 1725 -9401 -49937 -65400 -48322 -64572 -62826 -49006 -58826 -33557 -52474 -62266 -58695 -53556
15841 -53556 -24807 -677 -46863 -42123 -38823 -12194 -9318 -14093 -40297 -54365 -75411 -83182 -69824
15828 -69824 -45931 -19982 -23539 -46217 -78196 -83526 -39593 -16853 -19748 1921 -7037 -36000
15816 -36000 -56336 -82162 -62524 -58687 -39458 -24495 -36930 -61652 -46158 5188 -4582 5248
15804 5248 -19678 -25202 -11117 15431 36052 40863 27337 14964 -16051 -27552 -48048 -39211
15792 -39211 -17503 -19307 -46640 -45067 -48587 -44469 -48867 -38225 8858 -13949 -35526 14768 31503
15779 31503 -16393 -22281 -48652 -92766 -81644 -61375 5712 10239 3294 -5158 -28008 -13365
15767 -13365 -20749 -39819 -36465 -47505 -31940 -19898 -33622 -43061 -54337 -33989 1666 -9985
15755 -9985 -36374 -33724 -2969 -8249 -33004 -25264 -5700 -28660 -54170 -82081 -89776 -65258 -43811
15742 -43811 -35241 -30374 -14488 -27306 -23088 -25579 -68390 -62011 -48799 -29702 -18158 -40120 -41728
15729 -41728 -45067 -64485 -72171 -87718 -67612 -50625 -19395 -26344 -60711 -63477 -32663 2664
15717 2664 -23302 -22318 -4029 8754 -9573 -8065 -4064 31399 44834 61595 22413 -32283 -21333
15704 -21333 -7104 -4310 -9122 -7347 -148 -25820 -50149 -19393 -19549 -36347 -29443 -39038 -51997
15691 -51997 -83039 -60949 -65699 -110764 -100339 -72540 -48707 -46833 -50119 -69424 -61406 -32727
15679 -32727 -27884 -37944 -49241 -32186 -15828 -4168 9794 -9844 -30714 -53444 -27975 -17272
15667 -17272 -14520 484 -24044 -39480 4233 1051 -42658 -8639 9635 -17688 -16584 -23156
15655 -23156 6649 27715 -6784 -29942 -1870 31987 30843 6341 -6785 -9044 -12698 -25298
15643 -25298 -30838 -11583 -18246 -22885 -24258 -30505 -27823 -40231 -46710 -64040 -76153 -49844 -36361
15630 -36361 -24590 -6069 -40601 -69490 -92983 -104000 -76260 -66446 -81019 -33886 -5990 6111
15618 6111 -133 -25898 -33781 -24778 -43760 -24106 -5810 -2654 -21094 -20979 -8473 -13602 -70146
15605 -70146 -96616 -58768 -11368 -30058 -32539 -47483 -40115 -36640 -41940 -40042 -26519 -6692 -13139
15592 -13139 -63744 -83869 -60219 -46495 -44960 -28310 -6619 8327 -36970 -89783 -65453 -49641
15580 -49641 -43162 -35394 -44382 -59965 -53431 -1047 75700 77456 41979 25359 5779 -30067 -51749
15567 -51749 -55050 -59898 -37442 -31401 -32255 -44047 -64427 -61646 -45313 -19660 -2440 -9090 -48422
15554 -48422 -51953 1940 -3547 -18097 -32309 -25186 -37358 -38767 1034 11490 605 -7796 -16806
15541 -16806 -10987 -27755 -10393 14526 259 -20288 -18123 -15621 -19085 -28067 -5411 -40132 -52772
15528 -52772 -33929 -42459 -39276 -6509 7996 -29889 -48214 -48894 -62719 -34916 -36783 -45636 -20684
15515 -20684 -19049 -41029 -41922 -43692 -38538 -44183 -71675 -66011 -64807 -71945 -73334 -84607 -38176 -22453
15501 -22453 -42099 -46394 -32694 -35255 -74006 -83107 -63154 -42778 -76241 -56842 -24845 -31879
15489 -31879 -62503 -51290 -13935 -6710 -28474 -60517 -53719 -57272 -42532 -18125 -20638 -23192 -9204
15476 -9204 -14186 -32473 -30044 -7785 -16862 -42059 -621 -36351 -44884 -18213 -18564 18892 3530
15463 3530 -47830 -53482 -34634 -28025 -31009 -31764 -43904 -52958 -57883 -51276 -30293 -8410 -22121
15450 -22121 -21491 -11658 -17331 -13639 -11029 -16113 -45200 -68014 -47673 -44054 -94753 -82074 -40388
15437 -40388 -46951 -67567 -78770 -53877 -48516 -55621 -38699 -3993 -4948 -41907 -19963 -15587 -21608
15424 -21608 -22023 -78693 -88739 -47574 -49237 -91084 -84193 -39675 -57333 -62932 -31799 -31234 -40873
15411 -40873 -19907 4734 -15721 -5455 -13529 -37628 -42288 15001 26528 2403 -11670 -17435
15399 -17435 -13283 22527 -2237 -24134 -25089 -33782 -46071 -22494 -4951 -6056 14059 32158 -12448
15386 -12448 -14692 -14238 31970 37245 30831 16142 -837 -20915 -23583 -23699 -30190 -63418 -84388
15373 -84388 -81702 -56255 -45116 -48732 -61399 -69079 -93782 -125619 -106934 -96297 -68487 -63231
15361 -63231 -44344 -45272 -65730 -70203 -32968 -4585 15398 409 -10748 -3429 43079 42963 48606
15348 48606 41662 17789 -18350 -54577 -90401 -109860 -118651 -116584 -64147 -19270 -30283 -64622
15336 -64622 -34494 -3104 25824 8545 -1961 -17867 -23059 -13505 -24268 -41504 8050 46410
15324 46410 37295 34914 25670 -3531 -56355 -81994 -52355 -10520 14421 44135 24406 -31200
15312 -31200 -51338 -13900 -23999 -17890 -16063 -41198 -54861 -59097 -30429 -15438 -44569 -36101
15300 -36101 -8225 -4623 -14385 -53224 -67996 -34586 -44655 -65334 -57146 -54195 -22434 -53587
15288 -53587 -66645 -51749 -46159 -38730 14629 8044 -32760 -33529 -9583 20363 35437 39524 20241
15275 20241 -2282 -11529 -8376 -23636 -24093 6568 37733 33997 57701 73627 42751 114 -26987
15262 -26987 -39474 -41584 1508 17742 -787 -28798 6691 59890 19592 14166 38516 12870
15250 12870 -18202 -5419 -19669 -55119 -58714 -77108 -84199 -71723 -38905 -18277 -39203 -37760
15238 -37760 -28436 -3060 -17113 -32544 -54445 -67675 -45638 -43041 -44801 -299 6352 -5819
15226 -5819 5773 43382 -17235 -69208 -95720 -90732 -78740 -74879 -67174 -58854 -37024 -39311 -37681
15213 -37681 -9555 -32911 -26492 -9476 -8173 -22754 -40560 -67356 -63775 -33736 -13682 -24946
15201 -24946 -16443 -35263 -38562 -28399 -4208 4435 -24741 -92 23528 10735 220 23324
15189 23324 40734 44290 26202 8316 7466 -31020 -55158 -41200 -9869 -37932 -54871 -48507
15177 -48507 -21218 -2908 15134 12381 -25541 -7663 -13409 -50240 -64517 -90813 -117669 -109798
15165 -109798 -105972 -120040 -98236 -52464 -62308 -77962 -72310 -66088 -63627 -33713 -9296 -5763 42270
15152 42270 34731 9238 -30090 -31213 -15662 -5783 -7631 -15305 -14014 3411 -558 8312 649
15139 649 -6461 -34100 -31663 9694 28269 42216 34324 10672 -57873 -44266 -12169 9838 38161
15126 38161 2467 -42803 -46123 3360 13690 18183 16543 20360 892 -33927 -42237 -60379 -61774
15113 -61774 -73633 -73658 -81983 -99469 -62830 -45679 12694 43922 7658 -30778 -11698 -12938 -42049
15100 -42049 -80573 -78095 -45689 -60935 -49769 -42457 -10865 -27686 -18107 9630 34736 53318
15088 53318 56318 -2537 -26667 9391 4037 -9755 -11514 -27777 -40582 -52994 -57369 -58744 -48885
15075 -48885 -38556 -71178 -45123 -7303 -12292 -25931 -25142 -41237 -44007 -22865 -24743 -12170 -7023
15062 -7023 -56074 -59668 -60013 -33100 -32617 -33584 -15998 -16521 -28354 -38448 -51066 -78306 -71780 -50478
15048 -50478 -71196 -55650 -23635 -21808 -36025 -59490 -68176 -51066 -27236 -17395 -41278 -27854
15036 -27854 5485 34863 45277 8830 -1823 -980 2876 -14518 -40446 -81058 -70781 -47734
15024 -47734 -17736 -23977 -42608 -55803 -8815 23053 6332 -15517 -949 18542 12085 -22528
15012 -22528 -23428 -20845 -34116 -67733 -54125 -61037 -64042 -32315 -4933 13028 19084 36816 23482
14999 23482 32673 39431 29389 33616 14047 -42301 -63116 -35415 -5260 -496 -2307 -10369 -27067
14986 -27067 -10838 3296 -4855 -18396 -19692 18399 38936 22050 -34686 -83773 -67741 -64903
14974 -64903 -66675 -46455 -46211 -36949 -25226 -62089 -63407 -41974 -24592 -31540 -43660 -56694 -85550
14961 -85550 -65434 -35857 -36192 -59598 -66455 -69694 -76968 -57603 18380 -3379 -9220 -11713 -2408
14948 -2408 -16619 -49176 13623 86017 90766 36220 15456 -9715 -34730 -25593 -31650 -29274 -52328
14935 -52328 -30716 -29892 -49968 -25166 -8680 -24491 -14645 -24497 -68341 -74922 -83859 -64073 -34659
14922 -34659 -37037 -34223 -37345 -1937 -23187 -55436 -71691 -56945 -52543 -35372 1774 39406
14910 39406 25989 -6188 -36609 -56531 -23783 -20218 16218 -12509 -81534 -89045 -62228 -29525
14898 -29525 -42922 -27954 -39339 -48843 16486 37245 29131 13438 -14122 -27953 -8290 27087
14886 27087 62383 80408 72716 80288 68087 52360 9181 -18960 -34380 -31392 -31531 -31399 -22895
14873 -22895 -15655 -47954 -69908 -80034 -83956 -54251 -46803 -28793 -7171 -13049 -30983 -21959 -21454
14860 -21454 -19304 -30676 -18181 -35349 -29873 -26199 -37107 -66015 -63014 -38581 -36263 -40993 -24998
14847 -24998 -4253 3457 -1800 19087 26479 38259 27245 32173 3754 -43517 -40473 1462 -1492
14834 -1492 -17116 -43047 -64165 -41611 7450 48762 12710 -27931 -16070 -19853 -28329 3365
14822 3365 35227 10373 29005 13573 -4818 -6096 4428 30916 27956 10508 9288 58246
14810 58246 59111 29738 24309 -20252 -30931 -35788 -56394 -86999 -59251 -57705 -44139 -34551 -15907
14797 -15907 -14519 -34846 -44230 -65555 -61283 -74755 -62097 -20761 -5207 -18429 -49608 -41990
14785 -41990 -53867 -90410 -69089 -6220 12348 -27312 -23764 -16576 -6962 15073 7090 21 31468
14772 31468 14623 -4524 -2018 21419 39383 55060 28280 -4676 -30695 -93931 -121198 -105600
14760 -105600 -111425 -101467 -26359 12262 -29306 -76013 -76208 -82169 -63404 -52098 -45981 -70426 -57885
14747 -57885 -52683 -56965 -49911 -35019 -68274 -42593 14013 44771 -7847 -92169 -112429 -71166
14735 -71166 -25281 -9164 11931 14607 -550 -4019 -14630 -21568 531 -15901 -30541 -34840
14723 -34840 3795 34806 10867 -24317 -15878 -13783 1021 -20629 -54548 -82143 -66435 -54066
14711 -54066 -40252 -29443 -21670 -57203 -48084 -44584 -65359 -48525 -20669 -50406 -56421 -2043
14699 -2043 13031 23018 -14548 -50511 -18383 -10790 -20108 -4468 1293 7479 -12591 -62892 -31473
14686 -31473 -6567 14514 1191 -29964 -30836 -30425 -10413 -23968 -26134 -3636 4505 12338 10062
14673 10062 16307 35431 11479 -14991 6550 -2884 -11728 -26024 -7636 571 -29937 -55031
14661 -55031 -25326 -4841 41447 17789 -28563 -43864 -26065 26932 15008 -16214 -33432 -18799
14649 -18799 -9634 -19141 -3103 20603 3536 -25793 -19006 -19808 -14544 2720 1099 -20240 -34621
14636 -34621 -17048 -29450 -31090 -11030 15993 47528 36972 15447 -37952 -16287 12229 -14651
14624 -14651 -39603 -40945 -52608 -14279 27201 50123 57484 45082 35059 21711 28527 22849
14612 22849 -16105 -37236 10781 47318 19326 4945 16759 15078 11949 24938 -19365 -24777
14600 -24777 -46823 -59690 -28575 1432 -5064 -44501 -57871 -57598 -55396 -19260 -11546 -12367 -6485
14587 -6485 -1294 -2464 -15570 -31388 -13791 17988 -221 5832 2713 13141 50699 54543 47461
14574 47461 12739 2997 -15398 -2625 14994 33313 58079 63713 68140 48321 20905 -8395
14562 -8395 -2096 8264 46177 85917 89347 84870 53343 39313 41234 62837 72081 46099 16554
14549 16554 3855 -20403 -53689 -40315 -32134 -27047 -15433 17441 45488 65749 46673 29367
14537 29367 33604 52236 60634 68481 38739 18572 113 -3429 29740 33852 -11508 -14508 -10813
14524 -10813 -13370 -21251 -9950 -12349 -32549 -52416 -50043 -26633 -29854 9390 -4888 -45461 -72493
14511 -72493 -64358 -31442 -20760 17408 -3910 -38148 -53942 -88684 -54832 2273 11371 13510
14499 13510 -19155 -17223 -23496 -6556 23258 37468 -12957 -29580 -21603 -34747 -14227 -30086
14487 -30086 -24451 2200 -2978 -12835 -40424 -33047 -26651 -17437 338 5723 -21153 -48097 -16798
14474 -16798 -49422 -29406 -21201 -18134 -26023 -32457 -15116 17398 12350 -15878 -41736 -44591 -42664
14461 -42664 -16446 3534 -24592 -8165 32827 13241 -21441 -16045 -3030 -9093 15644 33606
14449 33606 -4278 -26486 8414 15848 -18002 -24654 -34287 10904 20055 27371 10057 -19851 -20688
14436 -20688 40904 17265 -31193 -47153 -55272 -59864 -57672 -69171 -50810 -22966 10500 22701
14424 22701 15506 -23664 -8949 -18892 -19869 1474 21239 -3284 -27918 -52920 -53957 -46066 -46863
14411 -46863 -36943 -12434 -6919 28992 29099 29145 6897 -15337 16338 22603 4671 21031 54673
14398 54673 82317 96143 79136 43605 36155 46443 53437 86850 35606 -13507 -64224 -57965
14386 -57965 -8089 -1145 -12894 -51683 -91886 -87541 -53660 -11431 -3480 -21818 -54175 -42065
14374 -42065 -50602 -15675 9805 -20463 -49980 -72922 -50828 -36223 -35081 -24813 -6434 -11549
14362 -11549 -41830 -51888 -55011 -46347 -23172 -52575 -76798 -32486 -5117 26739 4147 -9361
14350 -9361 -3914 9068 38040 11635 10862 34535 42117 37838 33163 -15693 -13091 -11697 32776
14337 32776 57157 4022 -24858 -4748 9767 5899 1800 21221 17138 13573 -20201 -24253 -12668
14324 -12668 17827 4491 7141 18369 5464 -15569 -14833 -4401 11521 10110 -5345 -3108 -2356
14311 -2356 85 -1328 5413 3618 17785 31899 9721 -24537 -37383 -25397 -56167 -90602 -94701
14298 -94701 -64730 -35677 3001 11217 19024 31581 38073 19663 15979 -6575 1952 6537 13393
14285 13393 28787 12977 -2076 13260 11114 10729 59736 60275 46582 19290 -2050 -4553 6986
14272 6986 5232 -8588 -18660 -49617 -49409 -4033 4034 -19579 -27172 -29111 -12044 -17620 -30203
14259 -30203 -22930 -15945 -17069 -39280 -39598 -31451 -25140 26234 44360 26467 -30626 -44120 -30530
14246 -30530 1668 13035 6333 3393 8446 11423 -23230 -24383 -146 32454 29547 21616 37899
14233 37899 7042 -10826 -16374 -47105 -66274 -47901 -18790 17760 47092 39173 26062 5715
14221 5715 21643 41468 67820 70125 39490 24121 11258 -7194 -10181 -6072 -2514 -18903 -11408
14208 -11408 -12094 -13951 5265 16731 -36847 -67534 -35660 -36643 -14665 32973 54070 68420 67962
14195 67962 51642 58692 81570 79556 78857 65383 31024 -7722 -42188 -26833 41063 50015 49463
14182 49463 54133 43167 -7930 -54515 -65237 -34157 -10382 7391 -2653 -30069 -26552 -22226
14170 -22226 -23072 -15085 5602 -6886 -7357 4457 7187 3042 -11681 -18060 -11538 -10947 5769 11408
14156 11408 15151 18266 33390 37318 14277 -6035 -22585 -26575 -27060 -36418 -9194 -21577 -4248
14143 -4248 14447 14107 2285 15758 35254 21327 18773 33507 43464 31934 20668 -7359 -32988
14130 -32988 -47953 -28026 18958 47270 64755 61990 58009 32570 6455 10229 22382 19618
14118 19618 25218 30446 9591 -24203 -25457 -4804 -22006 -43459 -50385 -62604 -53322 -31916 -12141
14105 -12141 -6586 -3518 28566 47794 40619 32133 41865 21055 9939 -1024 -16943 -35684 -9641
14092 -9641 7855 11982 11821 7978 31772 55250 34381 16105 5567 11434 7646 -7882 5144
14079 5144 -15181 -89895 -77933 -30218 -22974 -36120 -48610 -14089 16314 11615 -19603 2495
14067 2495 2893 -27775 -18783 -13728 -27105 -35192 -42173 -57510 -66586 -59674 -56999 -72755 -32970 -6351
14053 -6351 -9819 -61157 -96898 -103645 -87150 -46056 -18414 -16213 11035 15950 18663 5390 -2980
14040 -2980 -21297 -32675 3152 26488 13329 -10697 -53850 -63417 -10575 21584 22475 31501 -13138
14027 -13138 -22768 414 -11506 -14419 1362 5498 13280 17482 -328 -3270 3068 -54225 -66216
14014 -66216 -23672 -7882 9909 -13695 -22545 10820 21152 -3708 2165 34982 39614 2517
14002 2517 -27321 -31262 1054 37092 31789 4567 5215 -19889 -45351 -27219 9082 -12998 -37892
13989 -37892 -34692 -3105 -3942 -10600 4682 -786 19573 27652 50038 91056 115561 100034 52634
13976 52634 31603 35383 40824 95502 65223 22409 17097 -10870 -23023 -1780 19821 29571
13964 29571 11944 9212 -1467 17136 39961 47680 55478 39773 20548 3385 33133 45843
13952 45843 67457 75070 49972 15563 -15105 -33394 -50156 -81578 -69347 -3605 57982 90288
13940 90288 78737 74425 106611 68219 20684 17495 34645 37219 4540 2960 46802 46925 66961
13927 66961 102321 107669 96343 87308 61201 11260 16615 41293 55223 63168 40035 41481 85669
13914 85669 88523 43590 5254 27517 33546 8399 -12185 -12956 -2193 11140 26356 6148
13902 6148 -34690 -60533 -32032 7769 27734 47581 66577 64973 29280 33350 12005 -5076
13890 -5076 19337 58758 125352 116419 81729 61546 46070 65302 35534 29433 38778 23265
13878 23265 17792 40884 29703 30425 -18433 -41515 -61488 -69130 -39068 -2926 5928 14171 25839
13865 25839 31221 34716 47763 67554 73605 86549 53924 52608 102635 88463 70191 69685 78146
13852 78146 74900 45215 76653 75358 33835 -7764 680 3633 22458 59815 94748 120150
13840 120150 116869 75329 56527 63578 61665 41256 36568 35412 45749 65555 22101 23947 20208
13827 20208 7938 24255 20584 32471 63461 85202 84999 72575 72567 68258 64092 42791 38981 42709
13813 42709 57922 56231 45451 14284 4565 47470 74046 47691 27969 15235 41598 41056
13801 41056 49262 55781 50579 33192 29075 39080 29359 -5401 1668 5207 29332 49092 34887
13788 34887 26884 6643 33364 115146 139670 102182 66918 62014 60119 51254 58617 92386 109132
13775 109132 76777 69676 50327 44674 38361 37828 66831 77422 48958 22326 19502 28992 25702
13762 25702 54774 77745 108330 91791 104267 83127 55545 50592 59747 53650 22286 50096
13750 50096 45835 69486 84157 52373 102721 111543 78996 72280 48293 73110 79633 69673 75680
13737 75680 90627 66281 77376 84896 99609 87772 86845 101229 94432 77190 58664 81694
13725 81694 114634 98755 68347 42224 101045 120997 69280 83425 139115 139386 171090 119422
13713 119422 75947 39563 47909 76150 66766 41629 42411 64780 94597 88185 75772 69630 66406
13700 66406 79903 94346 114645 95072 61120 76695 89019 88557 79360 89595 81984 95674
13688 95674 76567 70477 27414 6196 49066 96072 123923 79892 57647 51540 73878 95657
13676 95657 68749 65251 116022 114247 85577 96107 99201 80928 94323 108361 105822 103022 107922
13663 107922 154349 143877 134560 80043 57988 78338 76878 52507 80673 69353 70168 75302
13651 75302 85626 76426 94509 98054 110879 111562 127721 132276 98886 79148 48172 47334 51169
13638 51169 51508 63618 52415 42968 96447 128117 114976 80330 37973 25786 34524 25077 13887
13625 13887 13579 48506 66168 76103 76697 45247 85358 95203 88130 110883 103795 82658 72230
13612 72230 50484 40674 12252 46041 55105 26014 42252 40849 61202 121677 119000 86766
13600 86766 91241 91654 116202 115146 104218 96903 86211 65542 45505 82255 78833 73040 113862
13587 113862 130792 145284 143249 109707 112182 132111 124112 125962 109249 119108 151401 161715
13575 161715 133735 130220 157775 140467 146628 114299 96623 83563 104304 112790 109599 116813
13563 116813 141553 137611 124501 126883 165242 156825 120516 125117 99573 94750 116480 112531 120771
13550 120771 133740 100340 101825 90605 84681 106413 112390 113639 101779 104917 117990 151396
13538 151396 165869 168446 171726 184952 195733 171940 124700 82286 88122 59991 60584 88413
13526 88413 86711 71510 79635 119110 135549 154312 197454 205336 156664 144794 140016 127542
13514 127542 139197 152244 129022 124662 126450 96804 78409 71762 108315 113849 109904 131308
13502 131308 133755 112714 138255 142941 118792 106163 118004 146011 151564 150438 123209 56067
13490 56067 42898 76795 105156 100659 85441 32225 61411 163887 182500 139057 132068 122705
13478 122705 130522 108363 113094 119691 91690 39531 55513 68403 107043 121803 123662 124193 111867
13465 111867 105550 124434 87976 75580 103686 145150 136252 116495 62160 57589 85121 95891
13453 95891 80609 85556 99591 114495 142461 126087 95545 109421 141110 148586 128516 96269
13441 96269 63261 49583 53184 69124 113301 129363 141252 160973 156964 153484 144978 110744
13429 110744 86096 68039 77601 68223 67783 78263 104450 121817 141565 171903 184742 198194
13417 198194 169611 135947 117035 75394 83791 139595 146837 135721 143042 123081 130606 123845
13405 123845 90449 82015 125591 156027 121963 90241 124433 124199 131258 142529 108380 95128
13393 95128 109877 106602 125405 125407 136307 123620 120028 124068 121918 89867 67565 63200 96222
13380 96222 117403 110427 112804 105683 127622 129977 106874 61774 69038 60852 73393 92601 35102
13367 35102 40997 74226 107626 84754 90797 124256 138176 175698 153699 135613 147974 110857
13355 110857 106173 157821 166240 151578 118066 102406 122996 136313 120498 98425 90911 141020
13343 141020 149914 155639 147341 161425 165514 172444 175242 181474 195324 162769 141314 181507 183088
13330 183088 188080 189788 165245 156591 187923 189821 197504 214643 204846 173511 181407 196667 198289
13317 198289 182334 208093 200635 173204 146322 115385 129404 122633 152859 181454 170228 143544
13305 143544 155951 194930 179587 152935 177134 208407 199645 234704 256553 228296 236409 235874
13293 235874 182541 161426 193058 216214 213082 219482 200238 192953 236538 235899 244747 248186 250735
13280 250735 234664 248992 246434 277141 291401 286412 291777 268559 299880 314416 321660 358712
13268 358712 360061 323644 269015 238551 244686 292473 310268 332856 358872 339716 306576 276325
13256 276325 300036 338480 311519 293245 327537 359762 369740 369913 372190 370985 334076 342387 363973
13243 363973 339841 328782 329466 305487 278811 288250 289444 291669 307418 305498 302657 325641 366260
13230 366260 386591 420029 412131 417177 407044 375568 347273 347304 343100 356037 368577 396903 413858
13217 413858 419839 435013 472954 460435 456080 472127 498135 495776 523344 534239 536678 543730
13205 543730 538063 580264 618441 679256 705428 736361 772870 805217 796282 856043 937310 969135
13193 969135 1031811 1104428 1195278 1276236 1348917 1362152 1362083 1388643 1421111 1420473 1370603 1344147
13181 1344147 1302753 1283812 1261399 1188787 1118531 1066504 1029554 984651 922387 855242 829179
13170 829179 847345 834678 821616 810890 759453 724326 707420 675926 635433 613868 637805
13159 637805 656729 670448 679295 667539 639188 642372 641017 627923 657093 634113 597287 581515
13147 581515 553822 550541 549361 591513 620242 625455 603622 563771 540559 572628 553224 527551
13135 527551 495640 512825 522052 497573 473664 460024 465034 496133 495747 499007 522620 502880
13123 502880 472618 495474 518418 529715 501318 449612 418999 447052 460236 452743 409851 389580
13111 389580 396059 419109 457092 461777 407027 400112 399510 386779 442247 451046 430645 411050 392706
13098 392706 370476 387252 410848 399178 410592 396123 410927 431650 469148 440949 405582
13087 405582 436628 441633 401086 413386 445399 466225 475746 484283 451580 474086 496185 466096
13075 466096 447049 420778 421469 445646 486502 536617 520567 495450 515180 520782 497770 495399
13063 495399 492699 455392 418645 439887 458608 489448 514028 539154 535003 498138 486738 467160
13051 467160 462960 475735 490571 504229 499997 474435 491542 504916 512255 524328 516579 526147
13039 526147 527256 534746 550760 551970 553528 574572 591859 611766 658032 693733 696051 712381
13027 712381 744718 732216 709558 725150 727603 705193 698072 701435 676578 646120 640339 651070
13015 651070 637046 600424 568546 548838 539715 542395 567982 604244 597242 578853 559489 528601
13003 528601 532806 589361 592134 582183 529874 528549 562242 595269 601633 633103 668150 647913
12991 647913 608348 579489 577846 587052 562736 581875 627902 598906 567076 586904 590490 563761
12979 563761 570932 559802 563619 565992 545183 526421 558937 563002 535605 539336 532083 560593 552779
12966 552779 540540 520211 548438 564741 529230 486083 492555 509185 500214 479091 496730 481483
12954 481483 468760 476177 469774 446269 448095 443217 455638 423023 417413 412527 415027 478802 483431
12941 483431 489033 487224 472495 438979 453868 451006 456798 450413 519492 506786 496020 507410
12929 507410 511064 517444 514546 514643 518518 512703 489293 482862 479661 502494 518326 505897 506402 490431
12915 490431 487120 496946 507261 506158 518563 511613 525697 515270 468477 443640 481501 478886
12903 478886 466261 467165 455528 448935 477858 543822 517363 485163 514702 516821 492730 508888
12891 508888 542182 571131 588711 562228 586158 587288 604557 628548 656322 647575 613827 609219
12879 609219 641107 662713 679708 688936 724389 731683 733889 777105 806238 846428 907017 930052
12867 930052 933301 909954 955846 974162 973901 984164 987342 1024244 1068054 1109321 1128698 1157217
12855 1157217 1163102 1184980 1254439 1297213 1287796 1274417 1252267 1226051 1221297 1236892 1242370 1242905
12843 1242905 1286470 1302851 1330759 1338284 1352840 1347566 1408485 1449702 1462811 1519493 1541081 1559710
12831 1559710 1562893 1595747 1621612 1638572 1687660 1724578 1764438 1794483 1810920 1842110 1915691
12820 1915691 1974902 1993706 2066911 2103766 2125683 2188236 2302493 2357870 2417526 2484241 2545773
12809 2545773 2612279 2705422 2835829 2905639 2930488 3026441 3112008 3195995 3293744 3410977 3519912
12798 3519912 3646309 3792352 3938209 4067025 4171604 4274280 4466685 4664115 4856108
12789 4856108 5011828 5214953 5399706 5614939 5810772 6004387 6258689 6512029 6731517
12780 6731517 6997686 7277126 7584537 7950795 8302852 8677411 9143032 9548575 10022042
12771 10022042 10583749 11210288 11858785 12563313 13318461 14138994 15050785 16065306 17121407
12762 17121407 18282945 19611377 21110688 22711834 24487510 26461625 28656792 31045897
12754 31045897 33650142 36595043 39830682 43383545 47355446 51824363 56860854 62574934
12746 62574934 69028109 76311358 84597039 93952061 104381761 115845793 128278882 141384354
12738 141384354 154749125 167720604 179576415 189562474 196890078 200930570 201393335 198263687
12730 198263687 191787560 182572599 171341578 158915555 145984506 133232471 121036984
12723 121036984 109663382 99272967 89931544 81554745 74115236 67514897 61685105 56491057
12715 56491057 51868261 47741646 44032905 40711908 37694888 34977115 32488350 30179383
12707 30179383 28094127 26204919 24468465 22873214 21424482 20107055 18921714 17821316
12699 17821316 16808379 15836488 14967882 14171654 13414388 12723601 12073431 11454555 10904705
12690 10904705 10419067 9928301 9480044 9015800 8540541 8146288 7802602 7449113 7107432
12681 7107432 6819151 6548112 6273507 6007392 5747578 5502893 5253520 5033427 4857209
12672 4857209 4723626 4581409 4426220 4300444 4165525 4007040 3843940 3711254 3606572
12663 3606572 3480975 3367766 3286339 3163130 3029303 2892207 2797066 2703184 2602611 2543884
12653 2543884 2471351 2419309 2356937 2293599 2248198 2200090 2137238 2109521 2054983 2050857 2033149
12642 2033149 1985539 1867786 1767095 1718573 1692084 1679784 1644495 1591360 1548817 1519756 1507832
12631 1507832 1453073 1413580 1401020 1388028 1363252 1353654 1313219 1253526 1190857 1161870 1150117
12620 1150117 1117815 1085122 1102354 1080478 1035676 972545 978008 995878 975023 953598 938266
12609 938266 914051 928016 957628 970539 964944 948771 924453 946540 984744 966789 955257 900643
12597 900643 877976 871170 848950 813524 817587 850987 862983 825508 820148 825551 811017 793808
12585 793808 827528 839343 815671 801693 797705 818243 823651 820797 790137 758415 734446 708476
12573 708476 695541 675108 666096 684973 699284 707674 689284 678471 661739 641826 625907 609864
12561 609864 610238 634975 623345 592287 586167 571579 583221 553637 558691 562992 571062 569691 546107
12548 546107 531750 514574 521312 548436 516486 504061 486695 475900 482345 489645 473093 466718
12536 466718 474948 516738 501229 456365 438588 465638 484841 489323 479568 447904 457156 423558
12524 423558 397234 403583 418392 419275 413991 411945 408048 418450 394959 406393 426418 420896 399747
12511 399747 375230 386974 407651 399214 387213 378311 346325 295925 324229 326035 329276 283178
12499 283178 275422 328412 357960 372983 409302 422782 374228 366266 370262 369063 344183 324074
12487 324074 316560 267077 219679 245023 258510 283695 321031 309371 302374 311813 340951 359970
12475 359970 335912 328718 297506 280178 303974 316677 296564 324486 348659 352017 335334 330075
12463 330075 323993 312828 310424 296179 280399 251869 250360 266487 259728 252294 265603 275057 271875
12450 271875 254786 255004 275708 264521 232176 230068 259353 259783 258173 262206 242549 279332 311960
12437 311960 315554 287529 249921 265250 264711 235556 223300 219014 237340 258767 227218 212517
12425 212517 253417 266304 264864 263672 282538 268993 256172 283766 251151 255474 256495 269063
12413 269063 265832 279657 296245 269781 263174 254600 263875 265188 262095 268766 270364 297725 292201
12400 292201 269480 261271 259267 240173 226154 235960 247454 230803 227799 233575 205389 205860 228610
12387 228610 268317 260862 243985 262365 248331 208551 203900 211532 224037 205182 209696 256181
12375 256181 229215 201324 202024 227058 222610 232822 252645 232169 226942 240171 222441 170111
12363 170111 166213 187689 173742 172755 204153 240015 250359 239667 229324 201032 178987 181926
12351 181926 156714 166544 195115 202333 180521 152709 183853 196049 175468 203230 225315 212135
12339 212135 187523 179749 198752 219265 254574 271563 224229 212199 191583 192337 198446 174466
12327 174466 131789 144145 193920 232681 231070 194234 183081 190954 202721 236552 222804 217897
12315 217897 210328 215524 227409 223670 234322 260572 287963 289834 267327 263437 275082 301768
12303 301768 289739 268946 269680 277062 265628 266005 311750 303057 292486 309555 372478 379280 401138
12290 401138 427443 469259 515826 502304 531018 606768 648798 691731 717878 755048 822778
12279 822778 885699 984654 1072944 1114112 1146483 1189729 1244501 1215950 1162625 1155803 1130440 1084067
12267 1084067 1036141 978084 952994 903843 832145 799333 764111 716726 668961 629599 587553
12256 587553 524044 477119 477041 476741 441448 413828 393539 390533 450357 460658 406346 369780 386836
12243 386836 426803 423403 381008 342362 330979 314604 297251 309568 307269 282761 298921 343031
12231 343031 335862 273227 247842 280376 299902 287992 271409 279016 274707 270268 297932 315965
12219 315965 318301 325423 288615 299226 312751 333681 355572 357094 361174 317947 282384 250326
12207 250326 254359 252460 246303 287933 320289 336923 313929 259217 225217 246314 256700 265745
12195 265745 287084 258756 246266 255304 267914 286299 301242 307171 321550 320784 292450 271860
12183 271860 254202 229988 251915 250286 295664 317855 319774 350717 331695 294229 271216 266156
12171 266156 274504 287121 290927 319232 326269 307860 279361 263803 282028 290287 270633 284877
12159 284877 287054 305371 319418 316428 329998 342174 366230 387825 401509 423224 425261 410532
12147 410532 363872 361211 388525 384300 381747 423923 439510 469042 531945 589072 625660 658787
12135 658787 784730 961373 1195268 1467130 1703534 1832895 1826135 1663118 1406538 1149233
12125 1149233 942399 830702 748547 686111 610399 604684 597329 586110 583506 610767 597909
12114 597909 598583 584580 578971 566694 590225 612581 634957 637048 631046 666423 661542 625856 598488
12101 598488 638424 679621 709430 773409 857728 983280 1071881 1159102 1254514 1465802 1776434
12090 1776434 2211096 2876308 3716859 4539507 5117563 5213306 4796334 4047814 3224207 2561538
12080 2561538 2105785 1786898 1553527 1393187 1284188 1212950 1128075 1055629 1019090 1039714
12070 1039714 1032089 1075928 1110720 1111031 1088473 1086383 1084137 1063854 1078571 1086428 1108497 1152937
12058 1152937 1186674 1207846 1237329 1320984 1417399 1479218 1573232 1661649 1737833 1850761 2030823
12047 2030823 2284183 2693530 3295819 4061248 4968069 5771273 6123350 5874213 5179883
12038 5179883 4298342 3505741 2951630 2609614 2408515 2252306 2163458 2110948 2076559 2094473
12028 2094473 2137787 2144545 2133716 2149033 2127068 2120457 2189390 2260042 2351195 2439511 2486801 2526447
12016 2526447 2587134 2649821 2735638 2786310 2865994 2974461 3084106 3197570 3304168 3416579
12006 3416579 3553908 3751094 3916439 4127820 4433733 4795630 5193164 5637418 6080271
11997 6080271 6405276 6539436 6577908 6557542 6516463 6556402 6704989 6874025 7143239 7447892
11987 7447892 7760907 8165221 8572429 9030883 9481816 9986259 10597670 11232280 11862185
11978 11862185 12569027 13297242 14051568 14917876 15831637 16780646 17815306 18838202 19914939
11969 19914939 21059692 22247706 23428172 24652041 25836662 26916803 27932313 28845643
11961 28845643 29636578 30275827 30746565 31071974 31172375 31012245 30658257 30123533 29392416
11952 29392416 28548049 27568410 26471956 25338322 24195537 23005734 21832862 20688492
11944 20688492 19550899 18447603 17421628 16422337 15489173 14602423 13779418 13015878 12283607
11935 12283607 11621598 10989625 10394214 9825957 9269722 8816307 8389281 7979261 7585817
11926 7585817 7225734 6876985 6595615 6305963 6010586 5703556 5456130 5223846 4991821
11917 4991821 4780781 4588460 4419800 4275397 4134041 3965097 3796061 3644447 3512727
11908 3512727 3366711 3222291 3120788 3034137 2911418 2774187 2682866 2607166 2552708 2454761
11898 2454761 2384957 2318204 2243358 2155693 2049111 1978470 1957723 1921617 1827708 1734790 1682277
11887 1682277 1643220 1587424 1570605 1550566 1485685 1441347 1428196 1402668 1381247 1333556 1279825
11876 1279825 1257240 1247226 1218589 1183335 1146537 1091374 1070830 1071651 1053059 1019584 1012905 996781
11864 996781 995684 973874 938516 923098 919944 934049 924815 905004 901188 865134 812101 777142
11852 777142 759704 724306 680992 653639 683752 648670 604229 588478 625767 629615 612851 625348
11840 625348 605560 623838 623522 621692 595636 564732 554198 553429 531847 519323 536291 547634
11828 547634 560522 557878 557386 573926 543065 484293 455395 425310 408072 386764 390060 398553
11816 398553 388613 393040 422638 422698 409651 435609 456157 412981 398966 422499 447387 427071
11804 427071 402302 376891 369330 373762 371873 386723 398300 409601 403458 370146 357220 371877
11792 371877 338071 325932 306258 311512 332933 318329 310504 326066 339410 327450 303498 310207
11780 310207 302596 297692 270444 271673 263634 238413 217477 223188 249082 275370 269260 291270 280332
11767 280332 269443 259555 234138 233760 266212 225008 223412 227597 230921 269589 266843 236966 229497
11754 229497 236514 189843 165068 190231 224373 182684 172705 190266 197587 177773 179807 206377
11742 206377 249121 276664 265177 254260 232971 205659 192084 188214 175238 156479 164509 159502
11730 159502 150204 136568 111687 133848 159787 151159 173748 166769 180876 214014 215469 182400
11718 182400 173003 208138 237387 261165 242529 177410 149447 146874 133993 128345 131667 131790 137077
11705 137077 79287 109752 134407 152530 121198 141841 178209 168016 188886 180795 184542 169727
11693 169727 133038 101140 97928 117091 133975 142936 172201 178320 190772 169436 185711 147454
11681 147454 127967 141952 144007 150782 151425 140044 130373 125496 122996 110852 105963 130433 96356
11668 96356 60175 98196 149160 123879 129587 156022 135476 126860 147093 129382 109076 124939
11656 124939 144770 148751 146941 115240 117785 124046 159296 196495 198661 210122 218129 168572 149387
11643 149387 192177 250543 269015 274134 284030 330431 381899 439133 560030 761279 1070608
11632 1070608 1484347 1925613 2165522 2138584 1906149 1496463 1056165 775287 608100 525204
11622 525204 451308 352897 302330 232822 184289 136110 127091 142360 143634 143372 135954 131462 138704
11609 138704 173204 138231 103927 124237 165194 166149 129830 124413 91485 100136 125304 153998
11597 153998 187234 169338 116712 77852 89231 144689 136013 111606 88236 81936 79254 70600
11585 70600 53511 71668 103940 95295 104407 144447 171162 151128 148280 126752 93859 92886 83216
11572 83216 93021 120337 125932 114120 102350 147676 186397 142069 100347 121082 103265 83393
11560 83393 84872 71958 62817 63524 63415 54949 44149 38033 61683 60586 61914 26187 14117 5335
11546 5335 28813 42121 67697 89280 116370 110715 61002 24041 64613 57186 64721 41641
11534 41641 45485 56378 30562 22510 34566 59803 87262 78057 73265 71154 25062 19251 33744
11521 33744 38910 44736 21400 32882 30449 34290 70715 41941 14370 8468 20557 44376 74501
11508 74501 67644 88948 93670 52478 18477 6359 -1660 26325 40142 43532 25282 18058 30541
11495 30541 45993 57969 51532 70300 69244 77815 86008 52568 33768 65576 79319 62814
11483 62814 60380 56160 35950 53678 117823 105645 77431 62530 66763 77065 38196 34377
11471 34377 23226 53087 65959 56913 40946 68114 84864 41683 10169 12758 24874 36803
11459 36803 69432 128439 124519 64993 70817 65859 8177 -11634 38537 58113 61808 38571
11447 38571 18611 31086 38227 60818 62918 67369 69454 62877 49075 34322 56165 61322 43550
11434 43550 31021 6851 29624 27427 4976 10794 29045 -2215 6233 1965 1698 -7512 -35538
11421 -35538 -5611 14984 -17538 -53724 -45938 8631 59059 66046 19565 -32400 -73863 -76310
11409 -76310 -68703 -90199 -90820 -20471 9377 20781 45522 8526 1003 18923 2975 -5101 -9096
11396 -9096 7134 21830 19144 19482 17285 11995 31722 48238 88989 109856 85311 81263 63056
11383 63056 51068 57362 69923 87776 87887 92295 84997 60118 40122 26857 50693 102906 108843
11370 108843 89655 83870 85221 89389 96721 91077 73564 94259 72969 81181 61015 34686 11013
11357 11013 1032 8309 -14407 3883 31191 3758 5541 17180 -32150 -14828 -13378 10320
11345 10320 18479 -4430 -30362 -48203 2041 29866 -1790 24526 26343 15825 13963 8038
11333 8038 7438 29519 14792 16901 34296 28093 -3698 -5201 35386 45019 37419 27321 37288
11320 37288 60696 33236 24621 12282 4708 5892 2643 913 17049 13833 -36387 -28655 -797
11307 -797 34247 42714 10393 -6077 24009 34981 67670 36697 9662 16240 31105 37709 20110
11294 20110 23125 34065 66458 75017 55834 64794 62141 30494 16110 14550 18206 51004 63450
11281 63450 68328 88772 79755 85438 92636 69380 43405 22840 10337 3698 1913 2334 19815
11268 19815 20563 17029 972 -17190 -42102 -47193 -33908 -27324 -17488 -35869 -36553 -7421 15595
11255 15595 1391 -24881 -30687 -9282 18730 14883 -18894 -17288 13466 4121 10096 21301 25167
11242 25167 25289 38093 62905 57231 60116 44813 62367 81981 56453 50360 60194 46674 29977
11229 29977 61695 87332 101230 78122 55439 69925 62553 38756 38824 60883 111821 150465
11217 150465 127985 117646 126296 150266 137434 118211 73999 64845 66660 68555 64051 73955 60211
11204 60211 108384 137879 106780 102546 135979 129024 105730 70014 36655 54427 44409 47932
11192 47932 42057 35674 73615 94000 82745 85336 91543 66160 55081 57104 34256 49177 69950
11179 69950 59269 59403 63017 83223 78145 60848 83002 83254 59469 70786 106097 74903 33594
11166 33594 36247 68352 92835 77871 49467 30707 63471 80860 95385 69239 48752 56380
11154 56380 60813 59310 50274 78955 80766 51098 42018 60631 84001 90423 93339 92903 76439
11141 76439 57673 31910 17725 13974 16918 44327 54012 90411 78331 72296 65440 75297 54976
11128 54976 13059 -2084 22372 5877 4995 13206 47980 72252 79551 84956 75139 103206 123811
11115 123811 111726 69328 46974 53295 52906 61661 24209 -22597 -34985 -35514 -31638 -18952 33336
11102 33336 35644 6171 -502 36175 104447 93564 85249 95358 75795 54954 72816 64872
11090 64872 18428 17598 42808 69905 63257 77594 87202 95568 112443 140397 110232 103527 124847
11077 124847 100778 64195 49626 94150 80722 87272 103270 67042 77554 84978 69530 121954
11065 121954 136817 149981 139335 149451 172435 170798 156587 143014 86583 96369 150041 143588
11053 143588 148057 145277 159634 215176 252925 289226 316741 329914 311885 325430 352941 382042
11041 382042 449135 508199 577696 650461 724350 792015 866033 970896 1110505 1250370 1363585
11030 1363585 1492700 1621816 1719415 1843593 1940662 2017656 2092269 2096822 2074247 1971282 1820131
11019 1820131 1684930 1565487 1403583 1215552 1125003 1040554 937300 885728 816393 748284
11009 748284 696385 632212 568915 496333 470545 431908 354853 307050 310674 317901 293829 291451
10997 291451 278664 257871 253378 238096 266796 255513 215762 202476 215050 212470 215135 209031
10985 209031 213616 199980 199799 130220 127917 139323 150824 164002 161320 149110 153911 162323 153675
10972 153675 140532 125920 72923 87359 120399 118395 119009 113891 115055 105069 122707 113383 125543
10959 125543 127577 108324 103851 118891 129595 112450 81061 68071 58781 89235 98702 81127
10947 81127 65250 79178 135402 166194 199675 206802 161466 140544 116716 94525 122911 111340
10935 111340 60761 51506 80148 115684 120055 79526 58324 77318 57458 41584 39050 17525
10923 17525 41599 36750 26306 38295 67384 84211 86631 40536 17210 29714 49327 55650
10911 55650 86767 86989 68610 97526 106951 86491 131310 139617 130063 114730 110998 110985 110444 125956
10897 125956 106644 137531 203206 221026 198444 174848 157034 147010 162343 163693 240524 282900
10885 282900 270265 327610 422504 504228 544525 515288 470833 438765 398659 375023 325701
10874 325701 293625 273004 227987 209294 192535 200527 224341 222885 212703 205661 189294 176539
10862 176539 156207 141575 186947 169798 141087 181149 208193 216350 232182 229759 204365 192420
10850 192420 214244 230783 243180 297195 352570 357244 352884 342697 360312 384836 349912 319292
10838 319292 374047 378624 351498 357838 359486 378917 409362 393132 394807 410894 437343 451924
10826 451924 416501 409468 411601 412905 406415 420041 426559 380407 361975 370103 372218 377099 353689
10813 353689 279343 254156 248316 247015 224338 224191 206823 194257 259667 257285 310886 342331
10801 342331 370179 404047 394669 367712 344760 319967 283574 308932 322036 297574 276832 275363
10789 275363 307921 282584 272776 270872 262105 276722 299584 337583 343390 330814 357241 379060
10777 379060 406906 434374 463003 458367 456729 480268 463266 435468 471625 489841 521719 490145
10765 490145 464988 484150 491644 524659 562750 591205 640926 634700 599077 602634 621264 626640
10753 626640 641896 666496 682866 701600 732542 760433 770242 777457 792142 813489 845079 851670
10741 851670 854999 868048 919326 956832 963226 971394 995602 978274 1015100 1044337 1045901 1050153
10729 1050153 1087382 1127634 1166179 1269581 1287310 1329979 1408793 1468061 1478267 1446986 1451909
10718 1451909 1525031 1625925 1725464 1756002 1802196 1859860 1889512 1898105 1851591 1838363 1888850
10707 1888850 1928349 2001064 2110938 2207253 2311945 2374057 2436388 2466877 2444261 2439583 2457397
10696 2457397 2487474 2453528 2419355 2436251 2414092 2376334 2380835 2390686 2367550 2359498 2376831 2374515
10684 2374515 2382064 2413085 2436862 2450162 2453871 2463449 2447349 2470841 2500351 2503235 2523913 2563315
10672 2563315 2608922 2649403 2687795 2732215 2762274 2809912 2888430 2959966 3015324 3042308 3118859
10661 3118859 3200289 3268617 3313984 3396835 3466496 3494465 3567520 3686083 3818997 3916854 3974471
10650 3974471 4049695 4149332 4272239 4399299 4550721 4754036 4872551 4982090 5143826 5276100
10640 5276100 5448974 5637236 5815238 6013601 6235781 6505543 6808509 7094974 7401842
10631 7401842 7718554 8058034 8427563 8835563 9277086 9764467 10261262 10844712 11558971
10622 11558971 12439828 13498781 14859361 16581115 18747347 21347206 24211123 27007075
10614 27007075 29322693 30917239 31804621 32319384 32967921 34137900 36181560 39303711
10606 39303711 43691983 49311012 55626606 61765348 66666871 69769172 71371621 72368337
10598 72368337 73988024 77213024 82473182 90081204 100140784 112522323 126573759 141040731
10590 141040731 154595996 166897512 178877591 192191193 208716046 229644490 255113907
10583 255113907 284311824 315632180 346605292 373727548 393145844 401573853 397567428
10576 397567428 382059931 357676095 328067629 296733973 266148449 237814370 212459782
10569 212459782 190316618 171034963 154003241 138531629 124270245 111080996 99163697
10562 99163697 88669504 79588229 71806419 65133709 59342948 54298071 49917646 46058317
10554 46058317 42591279 39494575 36747078 34281519 32062495 30011351 28099658 26370549
10546 26370549 24828984 23441303 22149025 20953366 19845544 18813941 17823892 16905081
10538 16905081 16053662 15254546 14504340 13802177 13167512 12571632 12007887 11417981 10857559
10529 10857559 10337421 9847879 9407112 9023806 8643098 8272419 7923574 7577155 7255433
10520 7255433 6975117 6658530 6397509 6192022 6007242 5764269 5573571 5358561 5193418
10511 5193418 5049036 4874066 4692527 4515966 4376186 4249885 4128190 3994309 3859938
10502 3859938 3741531 3640100 3521839 3387987 3315856 3198368 3095039 3011526 2889909 2801877
10492 2801877 2776298 2737045 2665430 2581440 2511399 2448835 2400095 2348536 2277199 2225650 2163450
10481 2163450 2129336 2068888 2020879 1973123 1925067 1860685 1822849 1780165 1752528 1722371 1692677
10470 1692677 1649880 1626513 1592920 1525530 1490919 1454205 1430519 1420387 1389508 1350389 1316550
10459 1316550 1295020 1269188 1238863 1216314 1210643 1246879 1299809 1308953 1315256 1376594 1409756 1369312
10447 1369312 1367063 1371207 1305378 1275520 1243826 1275929 1241038 1201715 1147312 1136386 1122211 1110165
10435 1110165 1132147 1123691 1086228 1066850 1041595 1052026 1033665 1022089 1033985 1048092 1034129
10424 1034129 1028564 1062357 1089532 1032197 968136 927062 944004 941532 911748 908281 966828 927198
10412 927198 864977 852397 852843 830917 824192 814033 790789 758255 731938 719786 733633 769186
10400 769186 758760 733073 723273 750703 752777 760523 753940 730703 708129 673097 624025 625971
10388 625971 625954 662018 679312 669917 668996 643392 630544 638606 620839 614827 613044 588502 598017
10375 598017 613539 640940 604825 603613 612437 567045 520210 492687 482508 462761 486086 523145
10363 523145 548096 518742 490078 456483 474662 478942 486560 485338 448846 418877 414877 458153
10351 458153 468421 441320 453909 459746 446178 371236 393806 426709 439088 448285 449380 429150
10339 429150 420984 396938 411924 419384 416956 382850 351594 329999 340677 368508 387643 371524
10327 371524 343748 340249 353968 324451 307871 327833 331582 336273 335062 316290 320755 318281 313668
10314 313668 302956 304886 280579 298588 308037 303777 307151 318142 310528 302045 341022 357643 338106
10301 338106 316092 320806 346031 327056 295622 324822 351883 374806 387066 394574 370208 322548
10289 322548 317268 318133 294117 307030 288379 302859 295082 295368 318899 349978 351129 338521 346944
10276 346944 316721 288093 309370 323695 309424 337341 312375 280987 278500 279319 306878 322571
10264 322571 296971 294809 306698 285144 279130 284987 300048 260280 275414 265551 255580 252417 253566
10251 253566 245773 263810 294827 285423 269781 253250 249186 255537 283016 312885 299753 246866
10239 246866 247589 275030 280458 286846 289008 290908 284481 284439 263492 195602 201718 227410 217926 222770
10225 222770 223558 185461 190414 227174 226749 175577 170247 193058 251440 269616 217763 217142 226729
10212 226729 228295 205347 158990 163150 156874 188837 217153 214967 238324 247353 203733 169500
10200 169500 164320 151336 140817 125303 105473 140466 147918 156971 172227 170983 172492 146420
10188 146420 188249 236709 238340 219238 204232 204786 223100 202597 216129 230954 213294 235624
10176 235624 260571 270415 270067 262436 270571 305031 299756 284160 297449 334375 370764 391665 387996
10163 387996 369981 346670 318818 330482 373709 386196 418794 441944 445483 469277 505138 517398
10151 517398 509745 470885 446978 419563 424896 467805 492488 544368 597314 619320 660272 674293
10139 674293 716714 754699 781536 824002 883679 972135 1071582 1204803 1319312 1425584 1541954
10128 1541954 1659925 1826259 1929704 1991895 2015901 1969992 1892247 1766025 1667416 1573866
10118 1573866 1466935 1343016 1236135 1125510 999111 907407 826356 784781 757826 691164
10108 691164 593563 515236 444656 404802 393901 381469 398447 407473 365498 323941 309262 301037
10096 301037 308532 273908 229496 210496 242885 252838 247343 218158 223158 228622 210185 172847
10084 172847 168892 221653 239721 243912 247764 216730 182897 182432 196721 194733 236754 259410 217845
10071 217845 173064 162910 175937 189612 195643 206537 196492 172580 157537 157017 158261 150286
10059 150286 119745 103674 133373 169450 164992 138728 152029 137304 131578 122219 134861 104306
10047 104306 80661 58391 44589 45408 64610 54308 38506 52659 61250 73003 94376 97525
10035 97525 77308 64572 53635 64374 86304 76099 92456 115855 129075 128027 120124 153996
10023 153996 164294 139638 106438 119585 142160 125226 95403 72215 82006 119953 120043 76984
10011 76984 60145 94464 40292 40521 32147 52644 55763 99262 136143 140515 127004 114109 115273
9998 115273 122194 109195 143966 141482 122047 100517 110950 108813 131873 127771 100654 112373
9986 112373 105979 65115 64068 80104 76882 83083 76932 87889 89098 79951 53100 64202 68425
9973 68425 63260 44010 46240 67698 93020 73155 56315 34786 10562 4934 25319 25828 19584
9960 19584 51345 81181 59703 60569 63184 56420 52193 72536 94935 71884 50422 69187 72683
9947 72683 59207 63381 87913 112897 109256 125916 123773 111812 82073 75964 116155 148117 124564
9934 124564 69611 77785 107721 103219 105708 126471 121240 126543 139635 131664 115829 81008 112565
9921 112565 114516 109314 110811 85653 64701 69389 57604 74733 46659 40558 71030 96845 165295
9908 165295 177116 122167 121246 129295 121661 127632 117537 105589 108944 117129 73835 44966 40387
9895 40387 30212 34605 35688 52529 87320 85301 87977 71671 52147 10299 2550 -58 713
9882 713 34960 83992 120118 111498 69556 66263 103110 82664 86475 113454 140923 136834 115757
9869 115757 91382 89629 104376 109872 108737 76952 91126 83014 67345 92054 104085 131675
9857 131675 135471 139187 134406 104889 92854 94917 86438 111389 166635 175248 135350 92031 122380
9844 122380 124564 90248 73581 87046 130413 109297 61245 47089 75184 74679 79235 76873 89315
9831 89315 96028 38792 24632 64695 86061 80103 77649 67196 78218 78165 77062 69645 77594 80260
9817 80260 75957 70806 76384 93919 116951 96539 58650 33527 42471 67930 101621 121465 119516
9804 119516 151312 140953 79380 67931 44423 63380 18711 -23928 21892 95502 105040 104895
9792 104895 54406 34647 68587 79408 32384 -13279 10454 39656 48218 20880 3569 -4391
9780 -4391 -5697 -10662 9152 31357 20647 43345 53716 59962 60281 48574 67784 76400 63179
9767 63179 50056 60748 68792 64168 57518 48758 51440 95248 125365 159490 140833 105631 94411
9754 94411 89291 86821 103275 91626 73315 88370 55868 53785 98214 112480 107004 81170 34924
9741 34924 38887 74274 45487 48467 29895 19927 35626 23986 45454 56157 67833 79053
9729 79053 68026 75223 84902 98026 101650 64857 10630 -4708 8105 6004 20151 10753 16037
9716 16037 39498 64568 69568 66484 46022 75742 80026 88893 88995 61422 54487 18922 -2841
9703 -2841 12779 30108 29962 10387 43240 72190 87009 47387 42864 50513 55053 58475 25842
9690 25842 3101 -17963 -7766 -8071 31255 56981 41130 38703 46709 53761 39330 56242 92376
9677 92376 99833 106586 78035 48586 65545 47485 35069 13540 16661 33265 58056 71169
9665 71169 78888 64363 74925 75865 61762 75275 56019 28288 20492 13705 11445 54855 103284
9652 103284 81996 91692 101829 139874 179198 189000 158060 141915 147931 128789 98251 87367
9640 87367 89102 59437 74279 78555 45808 21893 56522 48860 6595 9746 52804 66645 65306
9627 65306 70887 78101 90323 122570 133390 115778 94512 102143 80134 27236 11026 42573
9615 42573 37401 12855 37740 77489 117773 80813 84386 89974 84261 100504 143755 104807 88920
9602 88920 59207 4632 -10956 25568 40420 50601 45606 65406 71402 51715 31464 21198
9590 21198 9770 25522 48741 96399 65595 13500 -21153 -15991 27172 75085 89603 97657
9578 97657 95450 121293 137547 112864 92514 68716 56685 77444 33056 -10776 15335 17057
9566 17057 1824 -5550 37771 44029 43031 51186 18774 13654 10629 49846 74299 90341 58049
9553 58049 59026 72387 79299 77700 52399 13077 45986 61287 53632 32248 -60353 -67411 -10392
9540 -10392 19318 11675 -25938 -11719 31560 45448 65372 62618 76894 76058 48260 37709 84809
9527 84809 127361 93455 42884 1514 -39281 -31817 492 25684 -7088 -26796 11034 48096
9515 48096 57782 34796 27073 46247 66166 55748 65423 35726 -7498 1692 32019 17232 -503
9502 -503 13149 9079 41412 9864 -19554 -15855 -41603 -78490 -36647 14190 42822 12225 11250
9489 11250 18229 18950 73440 96798 66720 46015 45399 58335 70095 70739 74989 71342 79646 69561
9475 69561 66035 24209 15671 23247 24423 53699 77880 88143 75751 88944 113242 92488 60203
9462 60203 48915 39510 32945 43118 41303 32171 39109 47899 30019 37581 35157 22297 38803
9449 38803 57521 9586 -2128 28065 26734 8874 20143 29244 72227 82102 89365 84559 68576
9436 68576 53610 32279 -5824 -12623 23357 31762 71948 78253 44425 31859 44735 55195
9424 55195 31217 16122 21362 7447 19209 11997 13834 20779 -555 71176 57326 -13557 -18539
9411 -18539 12406 42034 46378 45124 55500 63685 47782 34038 43892 46225 25466 40083 80042
9398 80042 91472 60636 61147 72979 76603 38833 16380 32343 40487 1559 -34223 -12079 -653
9385 -653 -8045 17840 3928 952 26087 50204 55240 67695 49109 48760 27705 45179 27233
9372 27233 31544 53782 12439 4537 17441 41807 81612 97501 39149 -9046 1787 22508
9360 22508 52973 70823 93594 48833 21338 39755 50033 7660 -17104 -7905 33853 58294
9348 58294 57356 54279 60620 64989 25415 -13122 15510 45039 63846 45368 24431 -403 15591
9335 15591 43389 111273 109296 68607 54220 56864 53879 76344 69569 68626 47263 15015 335
9322 335 24807 68306 18744 -15236 -58133 -90479 -85945 -52847 17529 15927 -6114 14422 11438
9309 11438 -3742 141 4479 9355 44645 50984 55267 22472 -251 20638 44006 24051 -12826
9296 -12826 -12739 3355 26223 23515 6462 18235 13363 18183 30460 11411 7403 15412 3497
9283 3497 22498 65388 78097 62589 80366 82006 61829 53609 53352 49230 58753 41918 23354
9270 23354 43414 32800 -4284 -14143 -6356 17819 17249 34139 19876 13907 5858 -4377 835
9257 835 -12412 15170 11734 18696 40530 51181 63704 68673 86909 78241 55850 53526 21038
9244 21038 1511 -18356 -14009 9308 -2581 -3854 -38750 -32236 -6275 12436 27347 21092 47577
9231 47577 85359 79706 38151 8921 -29867 -48108 -11638 43291 56180 64407 61411 49003
9219 49003 49577 12819 4214 18498 42279 42357 72089 81179 56832 43231 3982 -8738 9835
9206 9835 37857 302 3180 -1612 -16669 -14524 16280 59249 82905 88685 69281 34314 -16462
9193 -16462 -3392 42011 58401 60938 45516 9865 30719 44671 59942 67724 18785 -25238
9181 -25238 -14381 2219 6699 -4780 -5592 3386 -1715 -2130 2152 31471 19555 15195 32983 30566
9167 30566 50012 57704 56746 13253 -2911 14399 67866 70074 74487 104636 59742 30456 16771
9154 16771 -4920 11913 33951 17626 7073 -3972 -33554 -44242 -48679 -51471 -25648 -16331
9142 -16331 -876 33968 28446 39656 32106 49194 52206 41173 -21413 -73115 -87410 -28090
9130 -28090 17052 18811 8891 15269 30022 42069 28974 -13606 -38202 -24241 27980 61168
9118 61168 39863 682 15589 20499 21060 44012 75348 75064 38505 30687 37307 49658 5492
9105 5492 30752 63994 71420 68327 95741 85068 65802 19303 -353 36142 71903 68296 48217
9092 48217 23112 16321 774 -24183 -11251 -14305 2290 4371 39329 45953 55901 54537 56975
9079 56975 29210 -26414 -68160 -5641 50396 36232 -14749 -20409 21277 40485 3140 -23839
9067 -23839 -16893 16780 27496 9866 44249 64929 49631 28197 33299 16086 -33300 -31058
9055 -31058 5962 20042 10147 33443 77749 34978 35246 36916 69363 121341 129695 102501 63636
9042 63636 35113 2766 -30748 -27309 18870 40508 14953 -7094 2815 39287 27895 16360
9030 16360 48429 26304 19922 18192 29158 41487 4402 -26458 -50385 -42211 -4771 3797 17375
9017 17375 41520 32347 16449 18867 6790 6940 -3941 788 -7078 8137 17581 24666 23834 16364
9003 16364 14567 45665 58864 45396 4209 22055 27139 60217 58179 1890 -52544 -50134 -18663
8990 -18663 -9143 -24867 -18194 8888 46154 38397 6949 38707 27316 53602 100827 98229 68427
8977 68427 41969 48720 29359 42316 39233 27256 5584 10585 -3516 2309 33469 21643 39380
8964 39380 40155 62542 85660 76826 68494 42375 1785 -4921 19954 24050 14085 54047 115456
8951 115456 74678 28010 26548 34933 22776 23882 31996 31764 9713 905 36686 37187 9321
8938 9321 -4391 -16341 7370 18255 13565 48577 38002 -30467 -31201 33386 47639 17515 -47280
8925 -47280 -70417 -35376 4727 38287 52832 38548 15288 16172 52245 60767 33700 15504
8913 15504 40141 50449 44001 74972 80010 54628 56341 31114 21755 26151 30169 26998 -19342
8900 -19342 -36627 2460 -16057 -25857 -18079 -8869 13574 30617 20026 31417 38487 21147 4140
8887 4140 -20318 11114 2473 418 -10398 15947 26887 -19935 -14083 -4612 26347 10214 15784
8874 15784 11510 21529 37768 54977 57347 63189 64863 69372 52089 35522 52724 28428 15648
8861 15648 -4728 1163 -14897 -3754 31515 -194 413 -15657 -22589 -35828 -4656 11995 -35733
8848 -35733 -54125 -21233 -8633 1955 18488 33679 32157 4342 18367 65074 63266 63139 26074
8835 26074 399 16642 30157 62737 34298 20892 17632 -3652 -9891 -1264 -37750 -25538
8823 -25538 -10641 10220 24935 61370 51295 26193 30784 24442 17634 -4510 -6596 -22390 17295
8810 17295 8694 -12152 -1197 36238 54170 61661 31243 16881 55491 82907 74487 45234
8798 45234 43531 41409 21172 17270 -18380 4189 31457 57884 42747 -2183 -20709 -8595
8786 -8595 22270 49132 2400 -20509 -22616 -29924 -22620 -13231 7479 -8556 -16607 13101 47151
8773 47151 83829 107884 124271 98204 56933 37542 63189 58897 55565 81364 84591 65777
8761 65777 51115 35494 36000 36530 29561 15416 7775 -11150 -45620 -40779 -619 13673 17887
8748 17887 -13421 -25497 -29778 -14899 -11317 -4482 16923 39221 -7675 -32867 -16701 -34717
8736 -34717 -23946 -10587 -24998 -44145 -17093 16497 21839 3183 -13918 -25394 -36720 -3567
8724 -3567 35655 47945 37753 11253 1495 -5768 -41426 -61981 -64377 -61764 -18232 13495 57638
8711 57638 36960 32069 4714 14647 36946 56185 71543 47432 22497 2472 -8968 -16485
8699 -16485 23519 25952 33762 50332 83205 84803 97811 67358 13970 18656 -19540 -48940 -55868
8686 -55868 -61773 -36836 20669 30384 -1606 2733 49557 77824 75553 67626 38715 47356 33163
8673 33163 41199 43172 12393 23467 13636 6151 58399 73967 67590 49151 46759 40807 66052
8660 66052 72451 58179 45407 24894 29698 38922 45157 18071 11670 32779 19755 -17281 -39281
8647 -39281 -3243 58142 62215 76074 27141 -5243 15082 32498 46686 37727 57401 120624
8635 120624 127727 98705 71933 43153 55883 24669 -2096 16021 31847 57385 67989 66939
8623 66939 42392 42298 63932 67656 48466 19739 -39466 -49503 -5989 -15176 -29188 2349 -4177
8610 -4177 -12190 -30238 -27477 -56844 -52214 -36837 -32054 957 -20189 -25170 -27768 18310 42567
8597 42567 26279 28185 34482 1624 -4142 3995 -22034 -9148 333 37663 47519 49748 21329
8584 21329 -11214 -3680 18863 45285 27906 -24432 -49243 -33513 -32355 -19501 -30501 -53909
8572 -53909 -53048 3008 26049 8928 8854 6572 -1439 11005 40156 62399 13835 -15545 -12461
8559 -12461 6402 19487 50101 80109 51543 40280 14935 9669 -19495 -6025 44861 54963
8547 54963 23986 -20955 -34076 1505 -15418 -21889 35908 39510 14409 19042 16359 -2822 21636
8534 21636 53266 68045 47283 23192 29219 30121 40199 90850 106759 89273 43434 19651
8522 19651 -5299 -30670 -38354 -35496 -30904 -25784 -9970 15914 5201 -18969 -13252 -8849 -1440
8509 -1440 2353 -17108 -5121 6158 23090 29807 31940 58729 29299 17424 10304 -16015 -14300
8496 -14300 -17685 -2063 42890 56231 38796 17795 7770 -17219 -21004 -39017 -88640 -59294
8484 -59294 -30290 5222 -15970 -15604 14201 13434 35097 15920 19836 6590 12317 -10297 22171
8471 22171 32489 37067 34232 52367 66084 114296 119274 79504 53430 49083 59960 33693 52245
8458 52245 69711 54585 57311 26895 16507 -15336 -37648 -16160 16772 16668 18284 13653 15379
8445 15379 30981 44149 44248 13495 29768 25137 4523 361 14094 72787 77323 49983 78355
8432 78355 71533 78457 73559 60645 66317 112514 102263 68684 45927 46695 56813 43055 33626
8419 33626 39708 21099 15052 37148 70391 41938 1901 -7692 -35236 14481 27987 -14884
8407 -14884 -40521 -30893 -36133 -43740 3407 28972 25279 42974 53107 81222 80999 52083 -3491
8394 -3491 1340 14151 12480 20060 71201 79183 40871 9666 -3830 -20050 -23675 -18738 -5101
8381 -5101 -4739 818 38029 42045 29456 23940 -432 -21082 10619 31771 45113 38815 30273
8368 30273 58900 46263 15633 -5461 -13242 15867 16499 35393 68512 73876 73083 89955 120264
8355 120264 157426 106029 95517 118845 128773 126021 172590 233614 218799 224055 217362 217767 270680
8342 270680 297141 336884 419674 497792 636517 873293 1352846 2164455 3367429 4780625
8332 4780625 5815757 5882237 5160846 3808368 2405186 1547140 1099536 827249 627070
8323 627070 521715 428422 373834 333335 265142 276670 265055 268667 263528 262213 309408 289851
8311 289851 278372 253189 227604 206934 225038 252173 233806 202250 252504 317635 338135 359487
8299 359487 377222 439458 540036 666033 871130 1128086 1577286 2359183 3749848 5963116
8289 5963116 8793372 11271609 11799169 10664470 8119700 5112036 3174778 2153116
8281 2153116 1573695 1220390 960053 792091 663536 570825 503946 485039 431357 381313
8271 381313 353474 329089 310371 295532 266738 251476 230227 208950 222518 239478 244304 242421
8259 242421 247394 271116 238423 221255 240837 312297 372441 416577 516659 621805 789697
8248 789697 1117944 1679741 2620761 3926630 5176452 5714826 5323840 4345660 2943549
8239 2943549 1827200 1169419 815623 604566 494837 429745 371346 357010 303927 248302
8229 248302 198371 157681 148853 164374 177551 166272 134009 82925 77734 55858 43942 16765
8217 16765 13604 30255 58918 99090 112205 65876 40383 55909 65917 65807 60266 77335 126434
8204 126434 97919 62246 54200 39036 34672 35704 83339 86025 36999 -3090 -3720 12802 34512
8191 34512 73841 59563 36679 26105 46 8985 35513 56166 68465 54534 80518 64039
8179 64039 76813 71082 38636 56123 46146 18500 5951 18984 23482 32273 34468 -4706 -33318
8166 -33318 -16946 -10591 -24880 -46645 -38634 -22698 4357 72443 103599 87118 71288 56739
8154 56739 44612 59080 62870 56385 64374 53122 291 2355 39711 29944 10277 -26402 -6351
8141 -6351 35887 32312 41219 45261 4123 -274 48196 81706 58059 52004 33761 860 -19747
8128 -19747 -12410 3122 23900 5485 -15101 -12441 -30013 -42382 -7413 46543 67705 59869
8116 59869 9457 -3589 14336 9001 1941 23027 39668 72789 114199 100930 67160 46572
8104 46572 40296 58457 39091 33950 37032 23229 12671 21964 7398 -24626 29284 37293 32164
8091 32164 41068 -9525 -20077 8624 52624 55603 22681 14597 -5046 4445 13193 43313 42349
8078 42349 39190 20674 13694 29954 29195 22527 56909 49972 -10689 -18035 -4639 10723 18942
8065 18942 48216 39204 23907 10070 -4814 -16589 11822 39883 88104 49428 21273 -451
8053 -451 -34551 -36400 -30825 -36467 -25139 10635 52307 42624 19646 13191 5252 -29386 -69283
8040 -69283 -33883 24463 61212 49490 -7864 -21967 -9097 -1737 10130 14277 29553 13377
8028 13377 33020 18594 -39488 -72641 -71388 -49029 -5322 32501 36771 11484 13696 23585 55337
8015 55337 54199 53779 35947 1293 21548 -10330 -25634 13320 21177 37184 26820 8061 -25879
8002 -25879 -382 22321 27487 24623 -902 -1261 27633 20948 9083 14559 14440 11062 8610 -9894
7988 -9894 -13897 13006 27297 -1370 -17529 -38325 -43704 -26623 -42743 -65761 -33538 -33360 -22610
7975 -22610 14108 -2434 -10740 15111 -12055 -25338 -35270 -40698 -24629 -4413 -3341 -12881 -6290
7962 -6290 14219 -9021 -22035 -20011 14285 30886 -6213 -14605 -28663 -11327 14111 15578 9712
7949 9712 7624 -6242 -6301 -662 -15511 14488 29958 48014 81863 69670 51194 59945 52317
7936 52317 50094 42985 53989 58915 34391 8260 -11205 8596 32559 71904 113368 91579
7924 91579 11260 -27899 -27893 -4892 24914 10763 -17348 -30810 -18047 -30471 -26603 -5490 5117
7911 5117 8148 20795 11821 -15239 -2636 -25756 -20791 -10537 -10784 38174 65430 41807 35255
7898 35255 45307 33758 39111 21391 -36911 -16866 16631 54353 110434 148478 133452 73063
7886 73063 30585 39261 6662 2620 3521 -17217 -41665 -32026 7173 -7382 -19755 -10108 21603
7873 21603 49367 36839 26802 18714 15775 1402 28943 39497 26054 7577 -2487 29856
7861 29856 38911 41769 24013 38594 75581 43235 27299 46318 33874 17752 13289 876
7849 876 -8698 18284 63443 56214 50702 68504 62713 45597 13935 -1818 -13637 -8228 -5075
7836 -5075 16691 -5129 -18972 11714 14509 -25630 -58409 -39422 -21861 -4932 -6927 -21709
7824 -21709 -10054 -21078 -12863 10304 31255 51313 20982 4088 49230 21049 -47336 -61333
7812 -61333 -22249 13589 24340 1950 -8587 -31332 -23643 -45416 -83067 -54980 -55011 -39173 -15901
7799 -15901 -22237 -31930 -11217 7317 3084 15637 11560 -3139 -15660 -13887 -28304 -50479 -61661
7786 -61661 -8480 867 -26698 -58112 -48808 -48351 -51135 -50190 -36313 -17298 18301 16021 30944
7773 30944 5701 -702 29512 -2421 -28841 -43754 -14713 -11570 -66858 -52957 -2679 24167
7761 24167 39564 48502 86481 59375 29339 37098 45962 35637 -6806 -28639 -56296 -34843
7749 -34843 446 -6808 -22895 -14081 -27823 -39017 -4399 10696 32452 22332 -10650 1063
7737 1063 28557 47176 57549 31083 23605 46849 65599 55590 33148 -14772 -45563 -31017
7725 -31017 21491 24582 -2427 -16382 -16377 -50335 -46375 27136 54550 43224 10460 -2949 -25076
7712 -25076 -23796 -26903 -38258 -27491 -31778 -38733 -10282 982 44280 56227 25432 3899 13328
7699 13328 28204 22854 20299 53356 70973 59463 57427 57984 24312 -4166 -8211 -936 -18735
7686 -18735 8690 7539 -18984 -15204 -8458 13894 18555 34112 1012 -38139 -49258 -4663 -6914
7673 -6914 -28799 8199 39586 -3018 -18461 25056 25594 11613 6867 -447 -1036 16355 14680
7660 14680 -2658 4263 34584 21499 -15829 -10996 430 -19657 -9263 -5542 9033 43098
7648 43098 48801 10595 5547 -9318 -5487 -33802 -8525 -38201 -86436 -86352 -91172 -106357 -122066
7635 -122066 -111563 -107773 -96123 -75488 -39058 -57219 -60445 -54617 -81802 -61568 -18088 40488
7623 40488 69210 50033 20441 11031 12408 20582 20015 42605 30346 -18780 -57438 -38524 -61820
7610 -61820 -55050 -34252 -18393 22796 14454 -3994 6603 -125 -8220 -2544 6987 30929 19102
7597 19102 -3418 -5165 -7109 -19496 -26392 -30964 11667 35258 76688 76632 61700 14434 -2539
7584 -2539 32666 52216 20202 10803 3555 -2591 27762 42788 33057 54926 61203 48508 18710
7571 18710 -7834 -30177 -48347 -57934 -57109 -40402 -6087 15131 41103 36055 41091 69308 34800
7558 34800 29349 24087 3169 -6785 -10333 30080 74083 73683 6409 -32209 -36010 -6720 20540
7545 20540 38469 40120 65256 53893 20213 49533 29497 -6694 -13990 -9576 -16509 -29725 -26489
7532 -26489 -21295 -27568 -10456 18704 63515 58975 54433 49742 33846 -1315 -19198 -6531 33730
7519 33730 43150 35177 27606 40147 30504 -3998 -35795 -55938 -50136 -32435 -14291 -33201 -34910
7506 -34910 -31681 -79978 -78551 -13878 -30584 -63713 -58906 -34688 -20803 -16465 32225 40621 22095
7493 22095 -17678 -14056 -22011 48 24330 22322 8856 4865 27050 46789 22636 25080 46250
7480 46250 29742 32047 38175 23614 11921 -3098 2616 -22151 -62269 -48013 -19121 -26208 -20631
7467 -20631 -11834 -5365 1090 -21619 -600 20427 14052 -40462 -80250 -53723 2387 28797 18390
7454 18390 16450 13824 -6233 -3586 10207 39599 63090 77931 56075 38327 32617 60567 44383
7441 44383 28326 -37274 -45153 -34665 -28277 -62446 -44939 -54951 -46930 -37879 -45400 -46985 -18679
7428 -18679 -6972 5679 1018 28498 44465 27256 51140 35410 -11684 -3273 17604 45129
7416 45129 66496 34616 45898 26022 10268 13227 9218 -13105 -26738 -20037 -23161 -55139 -56892
7403 -56892 -28265 -14058 7216 9559 -12712 -42573 -45752 -39393 -25536 -47822 -60458 -40682
7391 -40682 -31056 -32117 -31853 -18032 -1852 21966 41112 37433 -1334 -24405 -18179 6181 33157
7378 33157 7129 17093 25222 -6506 -39040 -5435 22477 31851 35640 60636 21338 -3250 -54118
7365 -54118 -69631 -45342 -43907 -4291 6313 24628 11136 13260 22889 -4137 -23753 -13305
7353 -13305 30897 26389 32873 32450 14786 18748 -1072 28336 52272 45225 35943 15793 -18888
7340 -18888 -48610 -56040 -46073 -35620 -4939 -67 15011 -13760 -17211 -34671 -59673 -66934 -30844
7327 -30844 15664 28808 49388 38023 50351 11488 -19371 -31985 -15600 12439 28485 12623
7315 12623 -10293 -13902 -23357 -23488 -22596 2286 26234 36382 60397 33782 11027 5444 23616
7302 23616 21800 905 1207 23055 -8754 -45706 4032 -161 11164 14703 225 -928 8673
7289 8673 10758 -14612 -23817 -28622 -21045 5152 18248 18011 37633 45531 1803 -24774 -62493
7276 -62493 -50100 -33385 -29235 -26752 -22731 -33749 -59250 -71646 -79026 -86282 -77884 -79658 -61724
7263 -61724 6977 16186 29203 33487 46581 52268 37929 11364 -810 24332 37542 31789 7137
7250 7137 -10735 -27036 -19601 -14217 4041 -17004 -6632 -23846 -17087 -20727 -18321 -19092 -22819 -12341
7236 -12341 10771 33105 21417 15492 -16797 -35946 -34913 -15448 5437 23965 8551 17859
7224 17859 18438 -10459 -40337 -27761 -29626 -37476 6855 50734 46448 876 -24239 -28766 -6148
7211 -6148 20897 48797 59416 47703 18408 16568 23863 13712 5363 14601 24467 47394 66664
7198 66664 45557 27212 21780 23582 19550 -10075 -24120 -5289 48183 64436 63086 38612 11077
7185 11077 -6325 -11090 -6467 7103 3644 4710 -16220 -8981 -16508 -31733 -8223 11419 -15833
7172 -15833 -8699 -6265 23253 9644 -10116 -28014 -20263 -9137 -8031 -12782 -36415 -45910 -40277
7159 -40277 -38107 -27155 -15166 -14957 4160 14988 29530 17420 2691 -6255 12682 31517 37290
7146 37290 -7424 -21488 5150 29718 51608 28357 -4424 -24152 -36600 -21695 11675 29142
7134 29142 25229 19488 6337 -1946 -20828 -49727 -61217 -23964 -13885 4842 -8815 -23246
7122 -23246 -12864 -32757 -4138 27093 8858 3667 4345 -3966 -16917 -26181 -14224 7569 44512
7109 44512 55426 32477 63343 78464 69809 55085 11441 -5462 -17959 918 1486 -3354 9870
7096 9870 -15293 -36618 20857 67406 57797 35309 24659 27761 26030 34550 -3788 -16160 8800
7083 8800 -8104 -33054 -14994 15633 21084 -14746 -40369 -60106 -41241 -48067 -57365 -41196 14990
7070 14990 11139 21986 26431 14248 12119 -34423 -38386 -21151 -29005 -14848 7023 -28398 -83316
7057 -83316 -70364 -68229 -83403 -78873 -92231 -72277 -60209 -39976 -59535 -74918 -92091 -69507
7045 -69507 -46925 -49049 -55054 -52040 -50977 -45283 -27410 -38105 -46215 -19911 -8414 13681 -9543
7032 -9543 -19988 -21431 -32398 -32844 -18261 -23628 -6128 22572 27761 27509 5219 -32974 -19456
7019 -19456 21314 33007 48992 -5503 -35061 -15892 46237 39563 33705 39837 38554 -1561 -3748
7006 -3748 17760 24203 20235 6428 15286 30636 49659 39623 44841 59134 40589 22348 20985
6993 20985 -3661 -29696 -26876 10257 2984 -5000 -17492 -26108 -17475 12474 43487 25364 -13658
6980 -13658 -39428 -46525 -57088 -71364 -72182 -29678 -25037 -16728 -21056 -21254 -49516 -56676 -32922 -18512
6966 -18512 2599 19936 64027 47171 -1126 -3565 2511 -55089 -54644 -25117 -23092 -22428 -8683
6953 -8683 13637 -21665 -77635 -77723 -35142 -110 -12724 -64436 -99384 -82993 -66591 -40779 -3619
6940 -3619 6358 -18881 -13172 9856 7425 4800 -683 -5411 -29930 -41972 -35239 -52697 -43707 -36369
6926 -36369 389 15709 -25585 -31055 -10553 -4879 -14434 -10915 -3866 7497 -2209 23778 11987
6913 11987 -7688 -16939 -58377 -86653 -69637 -33795 -2626 -6159 32344 43796 26912 21526
6901 21526 31484 8406 -30401 -39545 -7171 35386 7444 5151 31307 3761 -13648 -43896
6889 -43896 -80673 -83571 -42071 -30322 -46685 -65457 -74865 -41021 -47199 -55565 -44071 430 3088
6876 3088 -11007 -27606 -60170 -41893 -48489 -25185 5811 11741 11928 21115 20013 33996 2939
6863 2939 -7476 10364 35667 20920 417 -16889 -2384 4459 17735 1256 -26529 -26925 -57840
6850 -57840 -55257 -8079 19940 22799 32902 14329 -24328 -47072 -63072 -71279 -49810 -28839
6838 -28839 -16527 -18923 -24921 -15752 -9706 27282 7379 72 -6604 -22031 -11274 -30097 -49587
6825 -49587 -34113 -14724 -13530 866 26048 68801 46849 52850 36815 -1811 7501 28055
6813 28055 -5169 -40821 -11430 41458 44518 10420 -4090 -28983 -29841 -29620 -34541 -43390 -40971
6800 -40971 -24574 -17915 -23280 -46314 -68932 -39808 -49942 -66840 -68371 -59878 -54537 -25395 -24578
6787 -24578 -10358 -2998 -12515 -32404 -27979 -6471 13383 7587 31641 34250 12771 22363 17066
6774 17066 35796 26749 224 -17087 -28981 -11696 -16324 6795 37643 -26289 -33742 -55630
6762 -55630 -51382 -8960 -1055 -42809 -37565 12425 35083 11061 -31877 -10357 18450 29232
6750 29232 57911 10759 -22687 -50767 -97247 -85181 -75104 -41905 -17540 -30441 -15248 -26897
6738 -26897 -28864 -27413 -56501 -46414 -21101 2034 56314 88503 36760 -3721 -7110 25186
6726 25186 51794 61518 65097 30866 16594 -10490 -30632 -28884 -41540 -38506 -7177 14905 5427
6713 5427 -15533 -39441 -11515 -13079 -34567 -35929 -39854 -13173 7260 42552 43713 22005 6563
6700 6563 -10189 -18453 -39098 -66943 -45402 -44530 -79726 -62746 -47829 -9300 23259 -23210 -43317
6687 -43317 -12787 -1607 -13320 -2014 2932 -8136 -65953 -76382 -66757 -62231 -33913 -14978
6675 -14978 -38918 -71443 -89454 -107810 -104791 -75620 -55135 -46890 -35139 -13531 19540 -3055
6663 -3055 -49790 -38245 -45098 -55495 -41414 -16375 -18699 -24786 -17436 -26148 -19974 -10462 -42429
6650 -42429 -52943 -56873 -37127 -26219 -24427 -51525 -93449 -118561 -126062 -71104 -28148 -13056
6638 -13056 15057 23082 32934 17279 -26881 -49022 -30309 -44976 -35028 4660 19449 6804
6626 6804 -26343 -30884 -14795 5690 -6090 5056 32676 46975 65347 63503 32597 208
6614 208 -44262 -53093 -27837 -7776 -11952 2857 11749 -15501 -17022 3608 -11752 -9638 30755
6601 30755 23747 -11823 -34483 -28226 -24832 -34726 -28153 -24334 28220 62111 98262 60914 15874
6588 15874 16334 27653 32485 29455 9901 -13485 -39783 -62079 -45246 -11882 -11249 -24956 26072
6575 26072 28587 49123 46658 56720 53345 47245 5150 -24432 -42232 -16313 33983 47921 40760
6562 40760 31652 5524 11655 23756 10809 19896 25381 31983 57647 39959 21625 3562 35093
6549 35093 11247 10432 2008 -32263 -33536 -11026 -35474 -41136 -33290 -74634 -57654 -31288 -38828
6536 -38828 -51942 -13684 42246 46210 38402 21593 25960 32303 67613 111207 55348 24799 26770
6523 26770 7455 -655 -6676 -16248 10648 38061 47247 61569 29046 -6435 -20476 -23243 -17570
6510 -17570 6023 18669 19211 -13999 -50116 -53499 -38121 -20681 24751 -11615 -68353 -42848
6498 -42848 -28099 -440 2146 -25155 -37649 -70616 -68598 -38621 48729 81023 48106 53317
6486 53317 58590 71544 72457 49495 43692 -2096 -11981 -5076 3663 22751 27628 10228 1098 39386
6472 39386 70675 35296 33252 55053 35775 45427 42823 6994 13297 25084 57295 45014 -1881
6459 -1881 -44477 -47205 -28756 1978 -15157 -19452 10336 34573 29282 31325 14732 -28507 -590
6446 -590 4209 20184 -3516 -17678 -13411 12000 -21817 -31434 -27505 -54817 -36538 -18071 15305
6433 15305 15507 21749 34087 -41819 -85518 -72769 -47404 -35606 -26474 3636 9837 -7337 -7168
6420 -7168 9512 4615 1186 -26353 -25876 -35047 -16723 -22855 -21926 -12750 -15732 7502 33938 30406
6406 30406 33582 15547 -1764 -14172 -30933 -44804 -44464 -84855 -75069 -52471 -61557 -34417 -7408
6393 -7408 -15653 -28407 -23683 -32782 -29342 -19724 -21732 -49977 -56066 -34885 -28519 -19628 -25291 31554
6379 31554 53716 66851 46379 5661 18640 -9664 -19023 4584 10282 14302 -1588 -45877
6367 -45877 -36052 -12369 -324 -20733 -21589 3213 40942 67191 79372 78355 78579 33460 29483
6354 29483 5399 -27133 -51865 -22554 21546 23819 -24824 -64319 -82188 -74188 -33683 -17787
6342 -17787 -37708 -56647 -78073 -62464 -58240 -32297 -22505 -5099 2424 -28277 -2808 -21401
6330 -21401 -26143 -37221 -30702 -73287 -75306 -33030 -43404 -54559 -35792 -38444 -45607 -42097 -42377
6317 -42377 -60159 -83588 -59717 -10839 -31683 -48476 -26175 -9020 -33652 -21206 -1057 -13891
6305 -13891 -36506 -21690 -6502 5328 -4037 25868 46624 23680 15461 42043 51309 21074
6293 21074 24557 44318 41581 9579 -18853 12813 60573 75487 42097 -70 -6950 -19521
6281 -19521 3967 3997 -8933 -30532 -25154 18802 3289 -17764 -38713 -45646 -27651 -29094 3773
6268 3773 49147 8889 -22772 -42197 -45709 313 17931 29453 12775 -9358 -3544 -1360 -18902
6255 -18902 -2244 17041 7897 -30137 -19429 7655 22885 8483 6582 7104 -15177 -25608 -30027
6242 -30027 -19034 3015 14154 -2594 4988 25127 34282 -7307 -23304 -9775 22346 53238
6230 53238 52431 40411 38728 15511 25837 26178 16074 25982 28764 28844 38375 10344 -30340 -30801
6216 -30801 -44443 -45967 -28526 -7644 28987 25764 769 -10654 2641 23868 25882 26643 4538
6203 4538 9323 9254 21007 16964 -4068 6883 21709 -3177 -13871 -11606 -10141 -16566 -7722 -36070
6189 -36070 -78066 -69302 -6033 -1034 10254 8647 -13769 -17245 -9169 22800 49625 42424 -17837
6176 -17837 -30266 -25297 -55853 -63033 -52870 -38513 -36613 -24757 9044 19779 37100 39312 -15571
6163 -15571 -66300 -62686 -11248 -395 27341 64177 76342 77180 44278 18022 -18017 -40291
6151 -40291 -37696 -31981 -34787 -54629 -12518 1063 -28188 -42486 -8964 16185 39733 15926
6139 15926 -20234 -13299 3159 45067 19715 -2847 -28516 15716 16148 3228 30751 52952
6127 52952 39114 7526 -12359 -21454 -21876 -30324 -47903 -21301 -2249 2220 -29550 -75739 -68845
6114 -68845 -69604 -81656 -29964 -13256 -17044 9774 37990 37750 -1704 -8917 -29140 -25429 -36775
6101 -36775 -40170 -51577 -38084 40838 61089 17951 -17748 -16255 8915 -1677 -20429 -26506
6089 -26506 846 4879 726 -25936 -24504 -24245 -5146 16641 13462 -41413 -56038 -43314 -21049
6076 -21049 1913 -20341 -1931 37127 71502 38993 16093 21309 -7290 -16437 2860 21756
6064 21756 30230 14017 -24283 -11000 -24275 -14192 -20685 -34282 -41801 -16879 1452 14657
6052 14657 40321 45934 10566 19654 29751 35208 -2385 21739 32599 26720 51666 40511 24263
6039 24263 -9620 -13061 -9253 15316 17165 24685 16303 24002 39822 37792 -7687 -13701 -20954 -27830
6025 -27830 -20928 1615 7938 4048 -26510 -34549 -62624 -72498 -75183 -65772 -17620 16308 30589
6012 30589 25676 20715 37160 16738 -4163 4910 7885 -8731 -7525 -20867 -31932 -18964 -4320
5999 -4320 -1493 9738 15367 18435 9982 -11593 -43768 -17069 -6420 -25998 -73024 -97119 -78324
5986 -78324 -66132 -79131 -67197 -38805 -56422 -36264 -73685 -117477 -116361 -89050 -38152 -19594
5974 -19594 -7761 -19427 -42054 -57970 -63777 -33554 -2045 -16471 -48254 -33012 -31684 -39136
5962 -39136 -56761 -69918 -41654 -43045 -51683 -52812 -22164 41898 44292 -1338 3093 18106 46368
5949 46368 14367 -22623 -43825 4357 24184 6641 2459 3995 -14297 -35955 -75746 -35514
5937 -35514 -2559 7429 -23002 -24579 -29080 -40195 -47955 -23700 -6725 5688 15840 -1348 -44
5924 -44 11578 31428 3451 -27767 -16601 -32893 -19153 4392 14541 -27432 -50468 -22861
5912 -22861 -17116 -15712 1922 36532 70580 24148 -4743 -22823 -7509 -5482 -9141 -1458 34331
5899 34331 -1064 7749 15 -8448 9428 30942 56976 57398 18869 4973 40036 17905 -17189
5886 -17189 29405 47754 26187 51348 68589 57177 -10319 -49200 -46926 -50557 -43691 -61497
5874 -61497 -37636 -11638 29894 18358 20854 51612 54308 22231 24419 14505 21949 26415 -11884
5861 -11884 -10571 20835 27960 23215 9742 1318 -11249 -34208 2286 39739 37901 -15015 -29810
5848 -29810 -10128 -1928 -12370 -19955 979 -4161 -27439 -36606 -22432 25186 36354 21866 16648
5835 16648 -1925 27506 6374 -26508 -31758 -60849 -81551 -56028 -31127 14975 49197 -13195
5823 -13195 -8380 16627 3439 -2905 9681 -21999 369 21760 2972 -21617 -3645 2648
5811 2648 43215 65042 40956 57831 53513 34331 -20168 -54935 -42766 -11345 -13986 -4978 55385
5798 55385 35702 -25264 -51570 -49746 -19730 2145 -9759 -23627 -30633 -30425 -26684 -15904 -21258
5785 -21258 30733 50824 72918 79904 79863 121961 146041 102218 32882 -3182 -1316 -22960 -15720
5772 -15720 21181 39873 28886 75697 83993 54474 79754 54520 26085 37773 21680 -20468
5760 -20468 -80367 -53394 -23237 -13445 -40994 -69152 -78718 -65028 -41578 5108 6903 -44146
5748 -44146 -73321 -69674 -90414 -98846 -54014 -14617 -16624 -18181 -15141 -25131 -33914 -35396 -8207
5735 -8207 -6746 -57672 -63782 -36501 -24195 -37035 -20990 2616 -7619 -1786 28 14152 2917
5722 2917 -46745 -24335 22267 41935 13894 -38434 -59432 -63776 -82790 -80710 -27043 -10732
5710 -10732 -5743 -12505 -15684 -36821 -7887 13840 13797 -27421 -59293 -56047 -42491 -40074 -1255
5697 -1255 26678 5411 -7737 31612 63962 46121 32791 29688 -5547 6548 56816 20224
5685 20224 -28842 -36898 -6493 -3628 -2468 -9281 -20656 6606 31341 -19178 -31429 -19521 -24751
5672 -24751 -14964 -4355 -5944 -41745 -36869 -22471 -24085 -21900 -11089 -9774 2199 52080 39351
5659 39351 -25127 -55909 -52175 -60114 -61863 -59620 -52529 -37529 -26224 -7723 -10272 -53551 -57650
5646 -57650 -52517 -47582 -6653 24478 13814 6526 6775 16157 39271 9368 -25234 -34612 -40834
5633 -40834 -4232 14367 26322 15731 -33354 -44656 -33010 -22253 -34740 -8764 -21188 -38760
5621 -38760 -38041 -70205 -27172 -23439 1725 23236 28507 30358 16634 -732 12059 13285 16734
5608 16734 5495 -9297 -4818 5811 -24625 -56990 -36468 -2937 1365 -12394 -16047 6988
5596 6988 -17143 -49828 -21285 -18793 19110 3985 3924 6162 -24134 -46036 -26611 -48445 -29417
5583 -29417 -19951 21768 29485 -8045 -31301 -27329 15402 20688 8545 10499 3906 -12881 -15170
5570 -15170 -28620 -77507 -76488 -38676 -38450 11753 -10053 -16671 -22784 -33578 -24979 -12610 -15012
5557 -15012 -39858 -34111 -14967 19861 47678 49233 48466 31862 -20768 -62564 -53917 -26094 -20723
5544 -20723 -23610 -15719 -24053 -27667 2981 43704 43731 -9755 -36486 -48234 -52018 -100262 -102366 -87686
5530 -87686 -74114 -61350 -41648 -41267 -34375 -27294 -10590 4186 -9553 7187 -5659 -28492 -42416
5517 -42416 -14007 -2898 -3514 10516 1393 -11020 -13953 -25888 -24287 -6068 2440 20110 13091
5504 13091 35136 48381 -14184 -69382 -82917 -59936 -50622 -33888 -8471 -30407 -65183 -90225
5492 -90225 -81565 -59091 -39218 -28210 39508 55052 42338 33179 34185 8909 -57199 -83923
5480 -83923 -33144 -25196 -89758 -116700 -77935 -44089 -50850 -49964 -23948 -6854 30789 22381 32697
5467 32697 34164 19530 -2995 6594 14490 27328 11922 15832 46141 39030 25979 12962 7436
5454 7436 -8388 -8868 6403 -43700 -52675 -21563 -7346 -19227 -9428 25343 24473 10232 -30855
5441 -30855 -31064 -36377 -78942 -84145 -40928 -13080 -27871 -53126 -42804 -43747 -30733 4067 18219
5428 18219 16455 22881 12068 -25579 -17556 -45022 -47093 -56063 -53332 -47968 -29029 -35201 -34818 -39798
5414 -39798 -19475 -14908 -56024 -68926 -64502 -84571 -99066 -74240 -65412 -63767 -56763 -59752 -13816
5401 -13816 -537 -15057 11405 17213 13756 18250 32950 29835 45317 51487 11388 -8578 -2439
5388 -2439 -22798 -52690 -54738 -58533 -70056 -45766 -42121 -47394 -24265 -36527 -31471 -9572 3832
5375 3832 -17926 -39658 -6365 -2035 -14177 -33623 -39029 -57607 -83340 -79969 -80699 -87965 -64033
5362 -64033 -2397 -14769 -22161 -11551 -35493 -81292 -82507 -27058 23232 44008 21547 13437
5350 13437 -23215 4149 7994 3562 10386 676 -15383 -15337 -6980 -22995 15574 13120 -1977 -1322
5336 -1322 18139 18849 25358 41883 15319 16290 -19142 -34759 -40597 -32778 -21888 -38787 -26691
5323 -26691 -47089 -7878 57093 55668 31274 17512 -4513 -3070 -2507 -17640 -43449 -64520 -58793
5310 -58793 -86587 -104766 -89882 -49454 -64964 -54805 -56595 -22345 12551 25363 -28726 -85083
5298 -85083 -98563 -87346 -75653 -33463 2862 31050 49926 19986 15144 39281 30538 2578
5286 2578 -1147 -4019 -2357 4294 5263 24905 19455 5045 -12618 -19103 -44938 -43703 5697 29548
5272 29548 -12006 14035 33892 50295 21598 -21166 -43664 -5871 17424 48979 69949 40791
5260 40791 58049 89783 80797 47041 46746 535 -34143 -37233 -18398 9997 -9636 -36356 -32472
5247 -32472 -9872 24802 21782 34988 45260 39979 14825 -32224 -48819 -42700 -44768 -58658 -47297
5234 -47297 -65973 -58717 -47028 -24392 -12034 9049 23530 10788 -8181 -1043 -43707 -47374
5222 -47374 -34818 -11290 -33567 -47694 -30430 -33199 -32083 -16519 4873 10235 24418 4911
5210 4911 -1291 22880 12870 -3156 -7054 -10042 -1067 13871 -25940 -29877 -10834 29801 44624
5197 44624 28894 35796 72003 48388 45903 -3787 -6221 -23888 -2837 63050 78555 36009
5185 36009 4537 43966 29337 4053 -5848 19282 51727 88343 48740 22792 26794 19627
5173 19627 -7475 -42289 -17249 31793 21602 -5063 -43306 -29397 -22657 -57704 -48593 -20818
5161 -20818 -28420 -27051 -7532 32043 24344 3022 -10983 -19718 -15259 14701 8710 -11194 -33280
5148 -33280 -37377 -49444 -46373 -54058 -37307 -34098 -34230 -51335 -53124 -55149 -41894 -21901 -29865 -43835
5134 -43835 -47878 -7755 -8145 -22825 -10742 -11535 -2729 38216 47616 43050 -5653 -6235 -22569 -27387
5120 -27387 -7340 -36384 -70050 -51889 -56597 -44192 -40121 -45760 -43997 -21966 -9345 -15218 -7591
5107 -7591 -19192 -41211 -52118 -44312 -26839 -30553 -1090 39963 26241 -12951 -30304 -5770
5095 -5770 -11697 -17219 -47554 -55177 -70069 -50900 -23208 -23337 -16295 10287 19843 38255 75770
5082 75770 108966 111717 102001 92681 74926 72664 43487 -6403 -12222 -2822 -13261 6378 36869
5069 36869 21884 15206 21543 -3898 -10145 -35761 -49227 -34019 -46451 -37628 -37494 -50929 -38514
5056 -38514 -44687 -20754 41807 51624 16034 -8423 -9146 -18171 -44963 -19751 14972 1347 -7191
5043 -7191 -11653 -32979 -30803 1386 -2584 -25916 8471 -3462 7874 63708 67432 20086 8760
5030 8760 31690 25427 13757 11949 -17164 -6698 33475 44779 60767 35330 11695 -4609
5018 -4609 27603 25442 -18707 -38020 -43673 -27320 13481 11624 -7145 -118 -2461 -2313 898 8372
5004 8372 13298 -21639 -38799 -48454 -47814 -50733 -29959 -28428 -8602 -15703 -51390 -53473 -55024 -62467
4990 -62467 -51223 -18229 -28438 -18745 -13498 -26896 -8370 -6920 37532 42030 16119 -1553 -4785
4977 -4785 -33842 -25069 -3915 41586 52088 60399 63119 25528 -5850 -37190 -45614 -18850 -36109
4964 -36109 -14734 11252 26540 53984 31769 24793 27883 10079 -34325 -49695 -7698 28080
4952 28080 3291 4120 7580 24557 53827 24462 -4456 4375 -15144 -31420 11836 8843 3403
4939 3403 -43599 -84637 -48355 -46929 -31278 -20154 -31784 -23540 -27005 -3316 23004 36627 43021
4926 43021 46534 32986 26587 28976 29686 4559 5077 -499 14630 30007 41216 36240 32010 847
4912 847 -29765 -37352 -41061 -56599 -44781 -3336 3440 -22903 -33060 -51516 -57112 -36917 -48415
4899 -48415 -48564 -57915 -35348 -39092 -48517 -41626 -34496 -22741 2017 37111 43615 23026 393
4886 393 -13066 -51424 -33347 -18795 -58265 -59086 -39441 -26108 -29352 -20763 1774 24031 48112
4873 48112 34788 19168 13810 -10445 -22034 -22851 -52977 -20781 12178 34325 22396 -30521
4861 -30521 -58885 -22941 -31589 -42524 -42942 -54658 -34816 -13210 24578 41938 15089 -31018
4849 -31018 -27582 -34291 -25613 -34441 -23041 12601 19790 -3362 -4212 -21832 -20133 -17315 -2040 -20390
4835 -20390 -44489 -76820 -106188 -97650 -60631 -50215 -17912 2215 11835 17637 -683 -3638 -2981
4822 -2981 -6083 -26293 -61933 -52517 -19766 -21538 -26785 2946 25556 35819 61163 5889 -24826
4809 -24826 7891 47969 35447 -853 -18352 13208 9871 -35015 -33177 7963 35822 45120
4797 45120 32865 -7064 -8903 21497 34243 41397 20789 -12724 -63585 -69343 -53966 -52852 -22362
4784 -22362 13708 33504 26542 19676 22750 4498 -13972 -49391 -76262 -54393 -39691 -4635
4772 -4635 20261 7897 10540 -1510 -27200 -37475 -46452 -29982 -13129 -20959 1085 5372 -22333
4759 -22333 -36609 -11121 35911 30138 13030 9492 1616 12820 16072 6795 -4288 -47637 -81758
4746 -81758 -56217 -29009 -31198 -49061 -64468 -33790 -9759 11303 1795 7461 -45784 -64433
4734 -64433 -60749 -48007 -36898 -51656 -73126 -96809 -97087 -63936 5726 27783 10013 -25551
4722 -25551 -51721 -36487 -31917 -21830 -34702 -31595 -51497 -40123 -9514 -15913 -27127 -14995
4710 -14995 -3440 -28025 -21095 -25717 -30177 -16160 -23341 -16467 -2237 -10551 -14153 -9673 -30166
4697 -30166 -86419 -100655 -94647 -68344 -62556 -69400 -53446 -16189 6553 39717 36626 10821 972
4684 972 -7206 1404 25165 40466 71610 58133 33672 33371 31010 10920 11448 14247 10121 -3775
4670 -3775 -12256 -39651 -32884 -44579 -21118 972 42627 33970 -21652 -56384 -25190 -9814 4905
4657 4905 -2483 40521 59000 36650 45768 30645 21110 11722 4597 -2167 -2302 -11369 -3436 18921
4643 18921 36701 41009 64997 44875 -7750 -32480 -34252 -11409 -713 -10896 -25205 -25569 -51193
4630 -51193 -60211 -50283 -42185 -6645 37172 43480 -408 22170 27154 36088 39451 43053 18568
4617 18568 -9212 -16833 -4286 26524 20560 6783 9205 6517 7142 -6819 -25885 -84402 -79126
4604 -79126 -46517 -27190 -17284 15823 60987 60405 22115 -15709 -33015 -28714 -4491 -6049 5006
4591 5006 -1429 -26041 -36030 -12546 -11514 -49778 -49356 -18768 -31919 -47513 -30780 4206 -27594
4578 -27594 -69103 -71045 -34131 -63475 -91476 -88781 -55580 -20972 -31918 -47712 -26815 -32533
4566 -32533 -57816 -53812 -36831 22133 5518 -2066 -4433 22379 42970 23168 -17826 -49223
4554 -49223 -42335 -10644 11153 -6188 -21252 -12193 -27359 -42927 -62082 -51432 -17789 -6684
4542 -6684 -22088 -28836 -40685 -15919 -31859 -49875 -33566 -13775 -24603 -51260 -72285 -51358
4530 -51358 -50222 -51611 -70243 -54038 -19000 57 -5574 16110 18067 5936 18269 -120 -4294
4517 -4294 -17964 -33558 -29464 -21475 5874 11719 -10488 -13193 31705 57732 5663 -25800 -41428
4504 -41428 -32344 -23188 8449 54876 61855 55561 16590 16323 -1161 -17060 -17792 -25516 -55304 -46241
4490 -46241 -66264 -64037 -77137 -83098 -69892 -58646 -69457 -89315 -76897 -90290 -84521 -70204
4478 -70204 -55891 -81652 -66596 -32134 -39968 -37654 102 20130 16320 25209 16592 -20661 -48248
4465 -48248 -26133 -7652 14735 21122 -7155 -44687 -8525 23281 -18634 -48119 -35843 -22426
4453 -22426 -17197 11848 1894 -13201 -9479 4945 32154 18118 7382 30799 25183 19966 1759
4440 1759 27034 -1211 -24659 7219 43116 43438 11657 -25987 -27751 3952 -13399 -35048 -4529
4427 -4529 32673 50834 34735 11732 17020 32428 33143 -1704 -42231 -68712 -24159 -2589 -9669
4414 -9669 -22955 -20338 46675 62835 22862 27526 55695 31121 27701 49436 4248 -39808 -41522
4401 -41522 -45466 -21833 7624 -4781 -7134 13575 26272 3128 -6456 -42979 -59034 -24398
4389 -24398 26761 42640 104495 101191 29713 -19893 -24922 -14184 -1342 48760 66640 58979
4377 58979 48529 35233 15017 -4626 17766 38866 23677 11846 -7923 11854 18044 28360
4365 28360 29687 17241 16703 27385 863 -35195 -27014 19295 37251 19337 22413 34755 49757
4352 49757 66477 4064 -17678 28935 45731 74733 80485 13508 -5225 -3783 -24103 -7823
4340 -7823 -12296 -3888 -10684 -29437 -19011 2269 3249 17155 29639 10874 -34602 -62478 -66008
4327 -66008 -28101 -21078 17406 37237 24233 -6136 -28482 -54787 -66581 -64822 -38905 -9203
4315 -9203 -493 8814 10848 -43121 -51956 -53054 -21647 6676 15906 36223 32592 39476 30919 6749
4301 6749 29233 32205 1351 -26603 -27189 -16841 -19493 1409 61218 69183 40204 17313 -24633
4288 -24633 -37956 -17441 -27585 -15373 -2385 25538 13643 9504 22721 39565 21581 -10019
4276 -10019 -35548 3608 5912 4672 9427 -3446 -22325 -35473 -5294 35397 27048 -32309 -56619
4263 -56619 -64486 -65989 -29069 -34710 -33240 -47179 -71063 -74370 -45559 -59786 -27946 -26102 -47439
4250 -47439 -30827 -8306 -21521 -56030 -28117 13132 19493 35405 34840 -44302 -73117 -28247
4238 -28247 -25080 -39640 -16345 -11245 -50349 -57771 -39298 -26018 -19660 -40160 -32477 -4994 -17772
4225 -17772 -15537 -22910 13930 43713 2466 23628 51783 8428 -28162 -40054 25754 49119
4213 49119 16042 7490 3052 -17249 -24308 -7050 6098 11449 27586 34295 40384 17346 1759
4200 1759 -37764 -76374 -74551 -72517 -54544 -43035 -56920 -92560 -97241 -74478 -34720 -9596 14111
4187 14111 23673 -33182 -74365 -48460 -10613 18387 31675 11442 -2420 18709 33410 29042
4175 29042 44673 23037 15195 12332 -31481 -1783 29444 11358 -2617 1287 9264 -22209 -58692
4162 -58692 -63078 -56665 -24241 -42798 -47482 -30563 -52374 -22648 -9443 13446 53784 50194 -795
4149 -795 -27130 -17288 5019 -12033 -30311 -65618 -86338 -21428 -16791 -25534 -30145 -25052 -14075
4136 -14075 -10986 2241 13650 -18160 -51318 -55893 -29231 -46257 -15113 -403 -9912 10014
4124 10014 7045 -2184 -45481 -63958 -63756 -70541 -3739 21562 -2452 -19205 -12344 -10219 12763
4111 12763 -5790 -26938 -23852 -4865 -6709 42 4611 27619 12840 17052 12412 3445 -11034
4098 -11034 -20951 -22069 2656 42975 52401 60877 48047 21743 13986 18941 17983 -18321 -6630
4085 -6630 -5267 9163 6008 -14882 -17953 -18296 17070 17419 693 -30005 -9173 11435 -39312
4072 -39312 -43977 -17649 3968 -19830 -12402 -23910 -44906 -25225 -8882 -15215 20871 9737
4060 9737 -15005 -34102 -34278 -1194 -18252 -34773 -53332 -55205 -44032 -28441 -55171 -29355 21533
4047 21533 14053 10876 17798 21993 10591 -1314 -9547 -26183 -39874 -26987 -50063 -66237 -60326
4034 -60326 -26707 -10020 -20474 -26694 13457 49453 45149 23071 19866 31053 9589 -7392
4022 -7392 2198 -5244 -4154 -21690 -25918 -26553 -29213 -47220 -51008 -51643 -30991 -22428 -38935 -47031
4008 -47031 8900 60812 51980 17712 15033 5688 11427 44892 36661 -11177 -39215 -44076 -32526
3995 -32526 -26629 -19895 -15887 -6840 3065 34791 41766 20391 -29030 -42683 -37068 -21837 -4594
3982 -4594 10187 -10796 9164 14034 38634 25825 -20059 -32351 -13407 9135 39480 45277
3970 45277 29097 -18977 -37360 -29240 -20700 -36779 -47336 -31767 -6078 -11056 -23417 7235
3958 7235 110 -10120 18708 33634 39323 19148 33410 67010 54110 31871 20260 10036
3946 10036 11494 516 3792 -48985 -87448 -67578 -65138 -49794 -13725 22446 53356 57933 67043
3933 67043 41809 27415 23663 -865 -37900 -54099 -37584 -25961 -7910 13690 16592 56100
3921 56100 35938 9014 19710 15260 -3005 -35333 -30996 -42191 -43529 -35104 20384 37330 59885
3908 59885 67365 44397 58242 30684 44195 50390 35597 45726 54553 45710 36951 44156 -8369
3895 -8369 2168 -16329 -37437 -10842 11204 -27279 -60106 -24079 -16108 -30374 -49974 -51149
3883 -51149 -14631 4877 -19280 -26831 -39918 -14487 18536 28656 21179 44041 30414 -2555
3871 -2555 -32424 -51789 -38223 -22925 -11823 1427 -2123 -13267 -30759 -31729 -20475 -25057 -20417
3858 -20417 -14788 -26049 -44446 -41783 -54626 -58239 -67336 -48683 -24424 -19610 -17428 34649 45879
3845 45879 9907 -24637 -18765 -8503 -18015 -42662 -33153 -16847 -21531 -12346 -22109 -39814 -35953
3832 -35953 -36611 -22690 -26664 -32285 -47418 -57031 -39168 -31192 -19048 24052 53684 58367 27526
3819 27526 15800 11509 5445 -15458 26963 32499 27307 32563 31786 44856 17652 36956 18701
3806 18701 -9896 -18340 3001 -27849 -29212 -35825 -17016 273 -6993 -20094 -25978 -41063 1706
3793 1706 26268 44610 -9019 -36966 -51656 -14486 816 -36583 -24294 -25890 -63225 -62072
3781 -62072 -62730 -68495 -54113 -38669 -17960 -32639 -69930 -83648 -30068 4560 -18156 -19395 2624
3768 2624 -7251 30803 30366 24391 -7849 -9310 139 -26116 -38106 -28589 -58004 -73053 -72995 -43779
3754 -43779 -5668 5261 -38289 -80733 -40964 3492 22780 -6561 15577 40562 27976 24069
3742 24069 -1244 -40563 -65513 -61912 -49008 -39251 -52860 -67255 -64290 -65973 -58764 -39290 -36097
3729 -36097 -29938 22566 39302 6807 -33049 -53167 -65428 -64696 -32005 -7708 -43845 -56554
3717 -56554 -31174 -940 766 31177 23455 -50 -18109 -49495 -19630 -21946 -3963 31616
3705 31616 38989 50178 17878 -17260 -330 15658 6211 -1894 -554 -29430 -47012 -28366 -60339
3692 -60339 -43543 -21663 -15556 -35078 -57422 -79201 -50821 -60686 -80710 -73789 -31379 -31493 -24412
3679 -24412 -40792 -52766 -63413 -40402 -23589 -23911 -25809 -26828 -14187 -29297 -42141 -14855 -13569
3666 -13569 -31107 -36801 -8488 18513 -645 -41255 -18359 -9229 2115 -21713 -25461 -11662
3654 -11662 4332 43092 78477 75688 46744 22940 25482 12082 14702 -2352 18480 25895 18302
3641 18302 -8034 -9482 -29193 -29061 -23760 -52794 -60594 -25495 -16762 -23205 -26765 -59425 -48720
3628 -48720 -47312 -10994 7597 25379 11932 7677 -20220 -28792 -40982 -49417 -41600 -15611 8155
3615 8155 1862 -19736 -49685 -50875 -22233 -11578 -10133 -27459 -13918 -8292 2074 6324 -16773
3602 -16773 -18557 35882 45153 31270 13343 -29985 -12606 -10443 -47583 -60773 -34032 -20169
3590 -20169 -15594 16576 3747 -16256 1859 11661 1947 19493 15423 -10440 23905 50347 26832
3577 26832 31585 28117 38204 58647 32846 44267 44953 77078 73130 -5969 -32181 298 16669
3564 16669 16562 -35411 -52450 -59721 -37519 -15341 -21567 -16148 -11211 2010 -17646 -19947 -35416
3551 -35416 -61187 -78905 -48170 -8091 -139 1312 -6730 -9197 10028 24093 19130 24732 19881
3538 19881 27482 -139 -24589 -21984 2514 40831 9578 11001 2658 -4668 -29191 -31011 -11355
3525 -11355 -12574 -21118 -2947 20434 40588 39125 44085 42036 55667 75954 48905 24650 36915
3512 36915 12697 -20660 -22448 -34470 -32784 -14498 -16245 3211 46712 19476 -4303 3765 -12834
3499 -12834 -22584 -8008 -15482 6210 8473 39135 33384 14050 18538 -6246 -64253 -89449 -91653
3486 -91653 -88685 -66718 -54178 -56953 -34219 -4669 15947 44342 54717 33943 8110 -11279
3474 -11279 9805 7653 7106 -11190 2696 -12239 -40975 -74775 -40875 3575 23151 8466
3462 8466 -10074 -15993 -20476 -46986 -29074 -36745 -33168 -51835 -84087 -54019 -11611 12939 -27885
3449 -27885 8758 31585 27758 26869 22780 9266 -7992 -45483 -62046 -41107 -6041 -16660 -62554
3436 -62554 -68344 -51855 -37945 1413 28025 6298 15238 7877 -12252 -29218 -38275 -47557 -55342
3423 -55342 -44489 -40263 -59467 -67998 -34487 -4914 -8417 -18 11458 -10544 -14194 -346 -13880
3410 -13880 -23629 -3797 -18033 -27131 -18676 -39878 -39531 -33240 -37070 -50312 7555 35423 5065
3397 5065 -23526 -17300 6079 -373 32959 38420 -23556 -58408 -50644 -1961 -28485 -66688 -60814
3384 -60814 -40296 -31307 -9650 -9732 -4733 -6919 -3148 -21288 -44761 -39924 -83605 -71018 -74956 -76838
3370 -76838 -76837 -59935 -42898 -39967 -21622 -19888 -21941 -25943 -12601 21964 45441 25331 29990 9577
3356 9577 -30070 -47993 -35642 -30630 -25194 -49467 -34469 -15005 -1785 7459 23921 13708 2624
3343 2624 -3825 3553 -5437 -23744 -14059 35602 1552 -24211 -41578 -15179 -18971 -51692 -53696
3330 -53696 -53298 -55636 -45250 -24632 -24671 13936 23063 -13725 -4980 1970 11855 32851 22174 30315
3316 30315 21900 -6275 4844 -9650 5556 48411 59314 27927 6022 9499 10619 18985 -18012
3303 -18012 -43744 -63113 -86049 -79691 -57585 -6194 -8245 -27565 -41600 -32170 -30721 -29582 -12226
3290 -12226 -5534 -493 20526 61560 56163 42961 7369 -596 11809 -24817 -44750 -59411 -58407
3277 -58407 -65765 -49758 -40047 -61666 -52634 -37267 -9233 -19431 -56505 -101494 -100102 -45888 2103
3264 2103 4879 -25469 -34839 -58509 -26588 16986 12356 -17413 -49427 -30761 -957 19283 15641
3251 15641 -20164 -9284 18036 39702 21615 -7465 -11663 15173 -2755 -17091 -32498 -77473
3239 -77473 -98669 -58424 7025 52547 63600 72926 66701 36778 27428 25912 16579 12669 11319
3226 11319 5965 5770 12493 14738 -1198 -16335 -17019 -22539 -39356 -48091 -1749 31264 59605 57899
3212 57899 6805 -16532 -7916 -9350 -32059 -47081 -46152 -48801 -42167 -15616 -7329 -25621 -3552
3199 -3552 12500 9959 23550 -7220 -28237 -18339 11059 10376 14548 -4990 17269 33621 14552
3186 14552 12774 -2825 -5283 31146 46301 33726 6467 8347 866 -41410 -48331 -53095 -56815
3173 -56815 -49007 -17793 -752 -229 -17092 -42255 -70724 -69987 -44558 -22651 -7720 -6799 5347
3160 5347 18222 31738 27449 -18230 -26432 -9086 -6950 7474 26142 -123 -32462 -61849 -47108
3147 -47108 -21875 14276 13346 -15995 -25338 -40443 -29592 -7199 7117 1045 28781 26589 4404
3134 4404 5764 31871 35119 7991 7459 21466 10968 -7656 -10623 -479 -9251 -48352 -29031
3121 -29031 -29276 -54385 -54558 -31775 -2917 -19289 -3977 -5 -3462 -19297 -20145 -10757 -17500 4598
3107 4598 1376 -21021 -20527 -5460 -9283 29651 15304 27134 21402 25201 46789 13023 -31109
3094 -31109 -33856 -25375 -23395 -27499 -12765 100 -11741 -19806 -40349 -55918 -45927 -47128 -5219
3081 -5219 16006 6897 12206 12296 42787 12818 -430 -14978 -25005 -16394 -43625 -34696 -21302
3068 -21302 -9849 -10264 -57994 -47014 -54553 -89099 -62647 -48573 -28026 -43360 -59328 -38085
3056 -38085 7572 -19234 -48493 -32825 -10069 -26422 -49665 -37462 -33620 -53997 -6996 -6513
3044 -6513 -10199 -1652 -18802 -28480 -33796 -30118 -7991 -25356 -19588 -39025 -38569 -23714 -9614 6407
3030 6407 10724 2966 -2267 8437 -24647 -32343 -23478 -35122 -51618 -37978 -26974 -40158 -30167
3017 -30167 -3009 34567 11757 32075 -6496 -31623 7791 8844 -9427 714 45973 17258
3005 17258 -417 -11386 -25165 -11586 20738 16806 11781 2952 -18034 -47298 -91593 -90423 -59929
2992 -59929 -60042 -45780 -39801 -33304 9720 26161 9768 -12450 -27953 -34781 -5705 14577 906
2979 906 10717 21641 33355 54640 10518 13827 18997 4695 -3140 -29101 -15715 17234 11252
2966 11252 -15272 -41984 -72702 -60514 -38949 -40137 -47007 2030 2648 -19720 -39642 9719 63522
2953 63522 73523 56613 18619 -37215 -4843 4781 4823 20303 18084 36740 62453 68424 27659
2940 27659 3411 -424 16751 30051 37249 55733 42541 4627 21841 18296 -2814 1896 49647
2927 49647 50839 -25200 -45580 -41414 -58383 -60132 -27456 -2877 13104 28273 11274 -23794
2915 -23794 -60895 -62093 -38997 1923 -7283 -26832 -153 39322 45121 26950 45820 37868 36695
2902 36695 29007 6762 12845 14798 -15565 -34402 -17228 -28468 -51911 -33268 -9444 -28246
2890 -28246 -53992 -47338 -54555 -16440 17670 22156 20097 13554 -3417 19971 39533 22988 15251
2877 15251 1485 12719 27375 42084 35439 50390 22501 -8477 23570 -2394 -12917 19011
2865 19011 43858 16129 14540 11029 21752 21986 11504 8430 -15794 -32495 -25928 -8027 18744
2852 18744 -11652 -18932 -69538 -54830 -63389 -50405 -62749 -64799 -50401 1880 -19933 2826
2840 2826 10392 4474 -11066 -4751 -9036 -8358 6567 57911 832 -23071 -13380 -30560 -52126
2827 -52126 -38706 -4021 6913 18983 -1208 -2602 -12549 -31541 -15832 -19305 -30493 -55718
2815 -55718 -76373 -45828 -22492 -22344 -32649 11908 790 -29793 -61804 -54442 -50981 -32228 -62621
2802 -62621 -58037 -33193 -44982 -48661 -35328 -27686 12064 -10995 -48084 -44726 1445 23894 -16229
2789 -16229 -35060 -46550 -41162 -26760 -4783 -33095 -62958 -57952 -34684 -18083 -31972 -71230
2777 -71230 -78414 -70722 -52354 -41978 -38375 9417 15349 29867 31480 23225 30912 -16959 -49106
2764 -49106 -27445 -46412 -27243 -25356 -33878 -8616 -49253 -72197 -49406 -38921 -20638 -15331
2752 -15331 -3594 12472 19289 -2971 29250 72348 61991 48149 7611 -7901 23597 40154
2740 40154 59232 46747 26578 3121 -1335 -27988 -46062 -20167 28649 73479 57423 9196
2728 9196 -16540 -30688 -41449 -4038 33853 26316 30594 48119 -5 -19188 20745 11154 4149
2715 4149 -17418 -43626 9680 26591 14524 11638 -11494 -24860 -19485 -11611 -4826 6797 5831
2702 5831 19977 -39603 -47287 -36849 -65121 -62777 -1268 674 -1128 13323 -40233 -50778 -60180
2689 -60180 -57267 -23795 -17548 -10078 -18875 -27677 -7435 -10973 2586 14969 -31352 -83147 -105173
2676 -105173 -86515 -60095 -42587 -29310 -5524 11076 -3246 -11223 -24573 -14482 -337 25861
2664 25861 20567 14441 6261 -20119 -43660 -33470 -47590 -52373 -25249 -36390 -33239 10518 47425
2651 47425 59661 52751 11601 7274 11174 -3817 -3634 12454 -11488 -15406 -9231 -4403 4338 14383
2637 14383 3493 6696 -6147 -10524 -33220 -29960 -57672 -55557 -20034 5514 -8254 -8432 19923
2624 19923 23142 -21076 -14559 -2432 -34355 -54218 -77607 -63157 -13327 -7432 -12149 -501 -13088
2611 -13088 -8063 -41701 -50697 -38203 -30379 -10281 3625 -7465 -9484 -23017 -15224 47821 65911
2598 65911 30910 5833 21904 13781 31646 30418 2967 -7529 -25399 -11398 -11010 -20351 -9609
2585 -9609 12263 -9587 -57762 -75440 -113215 -118425 -71992 -36954 -49998 -46185 -50593 -55969 -36647
2572 -36647 -14771 1454 -21132 -52917 -25212 -9184 -4934 -23604 -2633 33137 63275 78642
2560 78642 53174 -11749 -41746 -53426 -54768 -55074 -34006 -22639 -44500 -65745 -9509 -23477
2548 -23477 -8858 7132 -7619 -52297 -32580 -14893 -53640 -52480 -3160 23340 5877 7394
2536 7394 16893 38690 62348 46312 11915 -37979 -46581 -17342 -7998 -21256 -43041 -30626 -27312
2523 -27312 -17714 -14968 -7196 22197 62124 30667 20233 18901 22777 26500 54359 57179 54749
2510 54749 11574 -616 19359 30447 -18557 -28186 2601 77720 85880 48076 9983 26116
2498 26116 37765 11819 -25195 -29320 10738 33025 54598 33970 -9518 -23752 -4814 29147
2486 29147 29941 16617 33378 7870 20477 61613 46876 31658 21695 22929 18061 57741 63353
2473 63353 29499 -3309 -22588 11066 26448 27229 20702 21482 -1161 -9094 -41324 -18016 1076
2460 1076 1458 -4438 35197 35394 15788 -6579 -23115 -20092 4821 55408 43111 27633 18172
2447 18172 1412 -29297 -86488 -89544 -88427 -75873 -60774 -48349 -83852 -87241 -83058 -67088 -62743
2434 -62743 -46181 -45676 -4042 21739 25857 -17472 -47324 -30582 -33153 2111 25609 -1248 22819
2421 22819 39486 6505 -3452 -1845 10809 3758 9848 25308 18791 -8169 -22607 -13473 14978
2408 14978 50729 40704 28309 2401 -16244 -22071 -37109 -16790 -3123 -12822 1414 -12257
2396 -12257 -1253 -13493 -43080 -46322 13778 30853 3545 -27308 -12521 13944 29971 33445
2384 33445 24258 -704 15103 2758 37185 12733 -23667 24233 46016 39541 92789 61074
2372 61074 51687 53801 59091 50071 17490 15299 7094 3865 1717 27064 30653 19282 17447 48334
2358 48334 23470 7671 31516 53495 26805 -4798 5347 -594 -33711 -50476 -57942 -9749
2346 -9749 -5321 -5634 -18138 -41386 -20816 14858 17230 -36627 -78514 -87560 -80803 -39706 -38197
2333 -38197 -67582 -73083 -37762 -19700 -40374 -36362 -20812 -22751 -22705 11167 20543 14431 11528 41007
2319 41007 71429 66017 65922 82040 48700 18928 44900 42562 53834 51545 13169 10159 25589
2306 25589 9491 21768 -20742 -54084 -56702 -29108 32519 30317 154 -19481 -13996 9944
2294 9944 -1099 -24182 -30019 -21878 13154 -1086 -20840 -47399 -38807 -17017 -37544 7160 39305
2281 39305 27318 32965 37978 8669 -31129 -30815 -1439 3111 18428 44095 62440 56341 65440
2268 65440 70871 53136 28920 46702 27322 7185 8245 5765 -1526 9908 27322 57269 54688
2255 54688 23963 -11080 -45525 -49788 -56779 -50463 -17267 39272 28662 39472 52224 51582 14576
2242 14576 -219 44308 67465 65603 73855 9290 -12601 -19707 25440 41555 48684 76096 68579
2229 68579 32060 51696 95842 86663 83765 85340 42929 31233 13933 17937 37361 37637 23945
2216 23945 -3862 -24587 -33176 -24297 -3484 20353 16345 -862 -17483 26202 26919 14166 28348
2203 28348 51840 29156 6639 -6766 -33730 -12011 -18275 2255 14461 5455 -26658 -28502
2191 -28502 1685 1019 -600 -26644 -72948 -33026 -19581 -12195 -30936 -52335 -56591 -20510 11642
2178 11642 27089 35481 15227 19152 11439 4088 7748 8635 -39525 -36942 23000 44162 31167
2165 31167 54686 33079 -7156 -12769 -34039 -6278 -22191 1273 32626 56132 40618 -2508
2153 -2508 -14340 -17424 -4370 -23604 -16328 -15618 -13467 -152 10477 -27381 -63686 -70435 -20895
2140 -20895 -7387 -8108 -20407 -10205 5146 10387 20312 3501 -30303 -23161 34171 41593 5714
2127 5714 -42081 -60754 -31380 -7487 85750 80757 44510 17029 35990 56158 34756 40949
2115 40949 38477 -11372 -25357 4909 20682 -15594 -30117 -47591 -59913 -63849 -23398 3618
2103 3618 32377 -2518 923 64181 51680 5495 -29662 -42019 -6598 21577 7268 -8166
2091 -8166 6320 56945 77557 57389 37638 32942 47991 29355 -45557 -34065 17269 38951
2079 38951 21367 -25849 -17157 25158 31711 30755 36251 33747 8865 2512 22676 40063 60073
2066 60073 38237 14953 9947 12970 34301 50878 29028 2719 -13661 -2289 -3488 -8869 4955
2053 4955 232 -664 -18399 18693 37781 -10523 -63395 -62906 -37893 -11095 4989 992 -3896
2040 -3896 -28376 -56770 -69809 -57303 -76192 -97399 -83646 -32589 -11962 12483 15167 -32770
2028 -32770 -73703 -53604 -7023 -7734 -5057 -7254 -19336 -29431 -27029 -31307 -13897 -15121 -29495
2015 -29495 -53396 -46400 -52563 -48706 -21686 14136 47665 20148 4006 -6278 -29158 -11252
2003 -11252 1025 -23250 -27660 -37376 -41203 -20527 -9297 -18977 -45157 -56098 -5122 8499 1973
1990 1973 20451 8642 -16426 -30767 -38613 -16932 -16017 -3299 12436 71569 76602 36615 29887
1977 29887 36643 45705 77254 48605 13637 -3986 -23821 -13921 -22269 -29987 -2469 24669 26004
1964 26004 9917 18142 10539 -18300 -20302 -41007 -28817 -4342 -24884 -25228 -31327 -39017 -27715
1951 -27715 12510 18186 39655 55724 9846 75 13055 26828 56752 53076 62780 98765 101852
1938 101852 57357 14438 -26663 -52004 -41271 -43732 -68004 -46197 -12445 20970 14843 13019
1926 13019 20045 23966 17026 39049 32407 32633 11417 40125 55264 49215 13001 -27791 -50590
1913 -50590 -56269 -21173 -2368 6776 -3874 -6099 18951 23316 51678 56846 33109 38502 10797
1900 10797 12061 -2946 27267 55081 72824 60385 12587 -20450 -2701 8538 25585 59281
1888 59281 72982 29215 -17435 -21583 1400 18725 2080 -8606 1370 5008 21613 37735
1876 37735 40216 9426 1031 -32157 -51557 -76216 -48836 -9858 -12194 -10482 1297 39017 27238
1863 27238 1689 -26398 -35758 -5351 9748 26416 -4476 -1325 -25123 -21535 26861 46572
1851 46572 48598 34958 27779 2137 -3305 15047 23956 54595 62998 15879 23272 39071 15561
1838 15561 -52661 -51089 -3783 22814 41293 21949 5637 872 -5060 -12683 -20165 -19589 14039
1825 14039 50261 32545 -16887 -45151 -56154 -35310 -18713 -34332 -17269 -5236 -10184 -48163
1813 -48163 -54327 -39046 -28911 -36366 -35207 -53643 -20192 -12658 -18529 -9541 23515 34236 4111
1800 4111 19129 16149 2 -9239 -16724 2915 40754 70749 68317 89235 82023 14981 -23518
1787 -23518 -21211 9576 5925 26390 29733 -7195 26065 48850 57501 47095 24028 5714 25381
1774 25381 74272 50592 412 1617 51575 90410 35893 22297 8937 -3011 -14787 -18871
1762 -18871 6357 29240 21688 40661 50486 60122 71630 81462 65589 30199 48023 67961 44000
1749 44000 12526 -6392 3223 32365 33402 12840 11737 27087 19117 33086 21282 11441 781
1736 781 -31002 -26544 -5950 35146 32593 -7657 -9023 53114 99145 73816 41590 26547 15741
1723 15741 12425 16390 56625 91280 40618 -724 -4917 -45095 -74934 -67568 -28676 25652 35535
1710 35535 956 -33357 -10933 10229 -27698 -101215 -76806 -85429 -42208 -17143 -29913 -25338
1698 -25338 -31078 -24979 -32563 13227 60137 76404 84228 50621 37816 38265 58751 29498 17533
1685 17533 23100 -13827 -19527 -30397 1880 32187 28397 45457 68806 38078 20470 30373 50368
1672 50368 37338 20856 35010 50096 36136 18030 -26631 -11402 -30717 -20424 20309 38844
1660 38844 31888 25248 17280 4396 -15561 -24421 -27925 11647 32596 59888 74249 49542 30244
1647 30244 49273 63237 42971 2439 -12825 27212 55641 68227 50250 54758 30409 9641
1635 9641 2462 22780 11439 23275 46228 40827 33035 30915 8043 53143 75658 53433 15880
1622 15880 414 -8147 21990 50153 38646 -7636 -31376 -8630 12982 25375 -6086 -35213
1610 -35213 -15958 -29789 -35197 -17011 16113 20952 13957 6759 24643 29990 30395 56743 94626
1597 94626 71586 50190 31314 26902 25738 21023 50448 63947 57932 36671 33863 -3889 -25354
1584 -25354 -9180 271 2732 27041 54043 76587 14324 -26385 -35120 -10627 4855 10805 -4940
1571 -4940 -41234 -34423 -29026 2052 -11506 -25725 -51187 -59121 -64084 -37136 -18716 -9302 -6365
1558 -6365 31360 578 -33880 -5917 17458 24848 31735 26085 27254 24487 62620 53412 25380
1545 25380 20712 9096 23181 66991 78594 71023 61844 38520 28599 12541 -12512 -21722 -33922
1532 -33922 -49718 -65808 -90639 -42715 -76960 -116972 -84714 -51782 -62580 -33887 -8549 22798
1520 22798 42309 25316 7547 -19597 -35082 -4592 34896 12773 -6884 4141 39281 18499
1508 18499 14506 2111 9537 -9284 -27700 -10186 886 -20532 -34116 -36653 -55283 -54049 -10929
1495 -10929 -9348 -11116 4894 32653 21299 48151 62239 79541 91527 69597 55199 80547
1483 80547 54077 5186 -7730 -10104 10460 26995 39527 64943 70856 43685 -26496 -20083
1471 -20083 -47795 -66753 -65580 -58395 -33972 -22125 -25336 10389 16106 5786 2819 30114 47944
1458 47944 29606 17369 51192 75396 14510 1686 22629 35154 65205 60825 54836 71347
1446 71347 82057 52038 -15755 -63009 -51096 -19719 40512 54968 34340 16124 29168 41390
1434 41390 50595 42905 32185 32209 12221 34451 42607 13270 12155 1188 -16146 20918 7037
1421 7037 20932 33053 25491 32321 57846 50587 21978 58840 57917 76907 90957 105209 83586
1408 83586 32383 29144 55862 20563 20718 43720 22568 21376 22830 4881 -7814 -4626 15924
1395 15924 25126 3640 -13606 4112 5403 -32110 -69994 -54339 -36300 -28931 -2499 -4777 -63404
1382 -63404 -23912 -16921 -19496 -60982 -56089 -38352 -44243 -37719 -27732 -14456 -20364 -18583 -7815
1369 -7815 -14606 6617 -2819 7419 33767 26431 3706 7722 21668 3002 -15133 5026 9269
1356 9269 37838 33432 64111 78834 30413 20008 2660 -5100 18289 38091 6796 -24358
1344 -24358 -9473 10645 28612 9450 15595 -2712 -145 27085 13173 64411 112254 100128
1332 100128 89228 59234 8265 -18338 -39794 -16649 17470 58706 59590 27202 10278 7511
1320 7511 32966 76672 44193 25828 47143 45127 24746 22865 44769 40898 57248 64855 32827
1307 32827 17157 -16435 -40602 -18688 21969 42804 911 -18400 -10135 13309 -25343 -27489
1295 -27489 14437 -4577 -29109 -24178 -37768 -37768 -56501 -34666 -19014 -10410 2005 18189 22489
1282 22489 8137 -17313 -14605 -33356 -31093 -41095 -24905 -17855 8552 -15674 -24171 291 -18
1269 -18 2101 -13956 13707 58879 63731 64649 28766 30752 63234 73461 84709 87497 62140 26802
1255 26802 41307 78183 64448 45293 65261 98904 102477 96542 83766 21974 -34131 -51716
1243 -51716 -40555 -2810 2716 -17449 -39681 -13271 7856 9812 -2268 -11544 3969 15845
1231 15845 34839 1788 -4442 20972 35851 34170 23323 4925 19368 13624 18627 -8445 -37767
1218 -37767 -12034 6632 36367 46523 37572 -16199 -32740 -15529 -20009 -13069 6203 27880
1206 27880 38432 30478 24863 20789 -9941 -32954 -28625 -45685 -1121 69590 69162 33496 1181
1193 1181 -5492 3830 32366 361 -5937 -13731 -264 16860 51213 34418 22897 16571 27666
1180 27666 60301 26140 -11441 -3595 -14164 16228 27597 41849 35162 6045 25612 33168
1168 33168 21668 2890 23401 67228 89100 99878 97471 53221 46330 62662 50875 38764
1156 38764 47149 58281 70594 77703 55333 38704 40070 61580 68019 73275 40667 19909 -11748
1143 -11748 -32786 -22197 -1043 12624 7836 -922 -46877 -37787 -6006 -2821 -21645 428 11239
1130 11239 20736 48093 44902 48637 46698 703 -35673 -61760 -58794 -28104 -43074 -9838 19638
1117 19638 -18339 -46415 -44739 -22976 -32685 -37848 -44507 -48755 -58162 -23696 -20264 -17572 -9506 30041
1103 30041 63151 57540 70597 81065 47332 36526 10059 9225 13250 30246 22668 42928 43688
1090 43688 2151 -11495 -21456 -8149 5173 9145 8644 13011 10720 -3820 -11682 14739 -11375
1077 -11375 -26428 15929 28374 36349 31588 8021 -27077 -6607 9619 24081 20337 13655 -3400
1064 -3400 9306 -593 -19864 7033 -599 -10687 3537 34143 9600 -15418 -10116 10587 -11796
1051 -11796 -23331 31826 48096 45860 16785 38713 40738 43663 17493 9737 16135 27339 11592
1038 11592 10641 21596 36245 19579 24887 -16271 -2112 -21060 -28954 15490 6314 -1968 10234
1025 10234 2996 -14034 21493 34246 6702 -15840 -2761 -17444 -10171 15182 3669 11196
1013 11196 8549 48 24152 17605 25936 15510 19390 32566 12639 -49285 -57991 -41645 -67943
1000 -67943 -87278 -40177 14870 40229 34657 -1858 20509 37778 1527 63878 80509 61791
988 61791 56944 38526 20038 20437 37991 11078 -72115 -85900 -39957 22031 37393 49193 51168
975 51168 35667 27578 21354 26103 -16061 -4498 22623 4955 -6417 -7774 43112 86245 63184
962 63184 23585 19361 34982 14691 30164 74199 93945 89966 68094 38693 49550 50769 40526
949 40526 22692 5985 -8099 -4835 10400 7567 10694 -3278 -24527 -62234 -59333 -20846 30109
936 30109 48396 40876 34647 21056 14368 5760 -3183 -32170 -3898 42596 73529 60462 32307
923 32307 2580 -8299 -550 22585 34669 48263 31006 13667 15173 39265 41061 50225 59302
910 59302 53708 52443 -8368 -25905 -17778 -21769 -7503 25418 18135 49037 37631 -4143 15331
897 15331 74366 64240 60127 62690 47161 17570 10010 -15017 -41626 -5830 17073 19817 47064
884 47064 83317 78144 79600 34722 -20460 -5836 22372 17103 -1286 5635 -2156 -12231 -9672
871 -9672 -10884 -31835 -37678 -17387 34758 82712 93633 90311 94793 44950 46962 52173 40988
858 40988 53342 28119 25504 39063 58222 49589 21978 4056 37563 39248 36956 59444 43367
845 43367 62707 57542 23286 10010 -1704 8199 8355 6888 -15437 -20418 -39950 -80602 -88820
832 -88820 -88731 -74462 -98277 -74620 -25947 3134 -6177 -14961 -34627 -16558 -7421 -23381 -39585
819 -39585 18831 64137 58037 18905 47263 60341 40705 35274 61958 46768 69934 77944 75283
806 75283 38251 48734 19307 467 -2872 42984 67311 83434 105232 98726 102773 70005 28300
793 28300 30620 35988 37668 438 19607 31698 26243 6101 -19308 -2012 17885 -3193 -13423
780 -13423 9807 41579 4176 51 27323 52244 61450 38300 20184 17488 5185 -8589 -23718
767 -23718 -22306 -16374 -6557 9133 24941 31343 32430 56995 68269 68978 63037 83795 85092 48741
753 48741 37720 50880 69620 52937 55228 41175 54453 50345 32553 16151 56680 61862 15119
740 15119 -5415 -28486 -12250 8972 32063 34528 24749 43181 51133 58671 58579 30440 39777 35846
726 35846 40512 26962 34297 37165 -16603 -37996 -37483 3336 51458 28597 7232 3991 1163
713 1163 -35079 -63001 -51336 14543 41804 26399 -10888 7407 79729 79096 80723 106859 99687
700 99687 75458 89158 101258 82819 64925 34399 42819 35130 37615 671 4187 -2920 -33998
687 -33998 -43578 -18389 -6963 12140 57426 119212 82848 68934 66517 62921 29000 16643 18987
674 18987 -7990 -2416 1486 14310 17338 -3130 24157 48255 72515 93084 73763 35583 28233
661 28233 16394 -12301 -25235 15185 37232 -14547 29448 27265 51592 77723 98063 110032
649 110032 56643 19728 -17043 -20246 -9551 -10622 20853 49004 50277 25476 18709 52096 48789
636 48789 17023 22293 8635 -9145 -23797 -3389 7199 -588 -28063 -4400 23035 22374 1491
623 1491 7933 40390 29804 60720 86484 119231 98767 43002 46204 91567 91259 101751 126784
610 126784 79398 41640 32009 6754 3787 8085 -105 33803 56846 76127 70727 57247 39143
597 39143 46726 81898 59187 16965 19748 23081 27694 50051 43856 31893 38283 32483 32389 9786
583 9786 14884 36023 55373 50069 19249 54260 82098 99598 101548 117771 72600 42448 42807
570 42807 33799 28762 54405 48564 40540 57932 100957 101936 85068 73777 49572 52631 80073
557 80073 67125 22470 13604 34702 18521 42810 84679 91807 73954 29085 39300 47168 77594
544 77594 59910 21044 7424 6219 2246 -14292 29077 45957 40279 45718 19531 42506 71568
531 71568 58261 46616 10916 28222 25246 21965 31366 14983 21842 52637 56058 49585 59374
518 59374 56919 64928 71342 9832 -25760 -32806 -40356 2030 27746 23137 22925 21104 18993 39087
504 39087 30319 47557 80483 72509 56432 43841 53376 52385 13786 14719 4629 -2141 22982 33531
490 33531 32042 37038 28504 29927 -2207 -6060 21932 31489 -39450 -44138 -13984 2879 -5294 28272
476 28272 41441 58998 39841 18575 35062 25255 1771 34989 66905 70178 56504 77788
464 77788 56678 -509 9899 22802 39463 52842 85178 68940 22547 9079 19417 28455
452 28455 63504 77841 39886 40488 39286 9157 21143 40884 40386 46398 64122 67665 90516
439 90516 63511 47148 40708 14870 38110 59993 70580 76929 53301 90570 73622 33681
427 33681 8771 6808 13315 -17702 15002 38800 39493 40495 49680 40864 58119 66074 87213 71211
413 71211 37350 14446 -325 -16582 -4199 666 26174 50361 63765 87262 59194 49756
401 49756 80547 98001 50780 17263 24815 29786 66009 80470 65859 53617 19646 29378 19187
388 19187 33679 37646 24120 53247 82765 55112 14750 -13565 -13331 -13797 -794 -7601 -24950
375 -24950 2590 -5336 -2288 -10298 -6209 -4817 11365 12802 26102 57756 84936 90923 62356
362 62356 17469 -10903 -34888 -15359 -20665 16506 23440 52010 99621 94983 80106 72405 70502
349 70502 66998 74979 70842 63899 15693 -32693 -19161 47323 53720 21082 3103 12164 21691
336 21691 15947 29577 38839 8330 13439 13532 -81 -11477 -23945 1796 27037 -1187 -5315
323 -5315 10355 27037 38073 12938 9825 27307 14890 20901 51515 61267 42603 7135 11182
310 11182 6944 21625 44200 32187 35909 46433 12784 9180 26015 49420 68338 25925 6826
297 6826 32547 37745 39591 54526 46557 33215 38167 22362 4898 19940 47410 39576 15708
284 15708 -3791 20887 42459 56125 48788 47483 62910 60783 53200 31592 19584 23071 50794
271 50794 45010 50955 80929 69077 20501 -212 21886 -20328 -41568 -31043 -29128 14563 61129
258 61129 100429 86005 46479 37307 32049 38390 2609 9823 40804 69707 45638 44836 46027
245 46027 37234 63360 64391 30346 16559 841 27767 64802 56036 31308 32383 40507 35567
232 35567 24669 39234 48528 78765 89772 110604 106288 90090 64789 59680 51495 42419 29922
219 29922 38283 70539 66506 37589 44504 55808 66042 67469 67418 93271 98851 91658 64616 53368
205 53368 40940 15047 38609 64776 51755 48398 62132 43207 40493 56185 46183 61973
193 61973 57055 20707 50945 71962 25885 15072 29439 48027 19887 9759 20200 20763 39533
180 39533 44079 47508 31682 16572 10915 1986 19909 44031 15726 4010 16454 46854 66465
167 66465 42468 44466 83885 68207 63148 45826 63461 84123 63921 10917 -41679 -19442
155 -19442 24799 36088 28011 34985 73140 97583 70366 41919 41618 15636 5274 501 23469
142 23469 16587 -5996 -6750 -690 36395 48904 27702 47463 55766 21947 14067 32187 55318
129 55318 18632 -5915 9917 42901 31754 39345 42423 31549 33405 25493 8839 20029 40756
116 40756 70002 57203 28232 31823 44960 27687 46753 39518 59661 73748 71374 41326 14704
103 14704 10692 17068 32720 16227 11088 10884 -5355 10842 -1397 27183 48456 49289 57407 17445
89 17445 -4858 11074 36738 60832 58935 39076 45911 74746 69698 39523 45878 32786 22681
76 22681 37365 28251 17545 24657 46225 75269 86040 78533 42681 37030 37097 20042 26340 27429
62 27429 10175 14817 35106 48442 69142 67226 72667 60620 65228 62722 45960 34152 32374
49 32374 26293 11480 2866 18452 46677 41091 22771 29311 24148 17823 40566 46004 49136 51764
35 51764 63165 37517 15706 58221 82686 55815 30846 42074 61011 53663 23252 11813
$$ [...]
##END NTUPLES=NMR SPECTRUM
##END=
