##TITLE=Analysis number 329463
Compound Code cc 64801
Book Reference 511/194
Project Code adrs
Chemist Name stevem
##JCAMPDX= 6.0         $$ Bruker NMR JCAMP-DX V2.0
##DATA TYPE= NMR SPECTRUM
##DATA CLASS= NTUPLES
##ORIGIN= Bruker BioSpin GmbH
##OWNER= nmr
$$ XWIN-NMR		Version 3.5
$$ Tue Sep  4 11:18:05 2007 GMT Daylight Time (UT+1h)  MAYBRIDGE\nmr@NMR_250MHZ
##.OBSERVE FREQUENCY= 250.131544655141
##.OBSERVE NUCLEUS= ^1H
##.ACQUISITION MODE= SIMULTANEOUS (DQD)
##.ACQUISITION SCHEME= undefined
##.AVERAGES= 16
##.DIGITISER RES= 18
##SPECTROMETER/DATA SYSTEM= dpx250
##.PULSE SEQUENCE= zg30
##.SOLVENT NAME= DMSO
##.SHIFT REFERENCE= (INTERNAL, DMSO, 0, 16.522)
##AUDIT TRAIL= $$ (NUMBER, WHEN, WHO, WHERE, WHAT)
$$ ##TITLE= Audit trail, XWIN-NMR		Version 3.5
$$ ##JCAMPDX= 5.01
$$ ##ORIGIN= Bruker BioSpin GmbH
$$ ##OWNER= nmr
$$ C:\u/data/dgb/nmr/ADRS/170/pdata/1/auditp.txt
$$ ##AUDIT TRAIL=  $$ (NUMBER, WHEN, WHO, WHERE, WHAT)
(   1,<2007-09-04 11:17:45.68 +100>,<MAYBRIDGE\nmr>,<NMR_250MHZ>,
      <created by zg, POWCHK disabled, PULCHK disabled
       configuration hash MD5:
       76 6E 9A 78 1E 09 19 81 EC 84 63 8F B0 6A 59 2D
       data hash MD5: 64K
       01 75 01 12 E0 B9 D2 B3 7C 11 6B B2 F7 8F 3C E3>)
(   2,<2007-09-04 11:17:56.61 +100>,<MAYBRIDGE\nmr>,<NMR_250MHZ>,
      <Start of raw data processing
       ef LB = 0.3 FT_mod = 6 PKNL = 1 SI = 32K 
       data hash MD5: 32K
       19 AE 0A C6 28 23 EB A2 DD 6B 20 B1 72 38 92 14>)
(   3,<2007-09-04 11:17:58.18 +100>,<MAYBRIDGE\nmr>,<NMR_250MHZ>,
      <apk 
       data hash MD5: 32K
       DE B1 61 34 18 78 E0 B5 10 1E 70 95 28 98 4B AA>)
(   4,<2007-09-04 11:17:58.94 +100>,<MAYBRIDGE\nmr>,<NMR_250MHZ>,
      <abs ABSG = 5 
       data hash MD5: 32K
       4A A5 A3 8B 52 B8 35 E9 AE 7D 53 E5 77 3A 9A 6F>)
$$ ##END=
$$ 
$$ hash MD5
$$ 8A AF 4C 05 C1 7D F7 7D B8 AE 46 17 72 0B 75 4F
##$RELAX= 
##$RELAX= 
##$RELAX= 
##$RELAX= 
##$RELAX= 
##$RELAX= 
##$RELAX= 
$$ Bruker specific parameters
$$ --------------------------
##$DU= <C:\u>
##$EXPNO= 170
##$NAME= <ADRS>
##$PROCNO= 1
##$TYPE= <nmr>
##$USER= <dgb>
##$AMP= (0..31)
100 100 100 100 100 100 100 100 100 100 100 100 100 100 100 100 100 100 
100 100 100 100 100 100 100 100 100 100 100 100 100 100 
##$AQSEQ= 0
##$AQ_mod= 3
##$AUNM= <au_zg>
##$AUTOPOS= <56 >
##$BF1= 250.13
##$BF2= 250.13
##$BF3= 250.13
##$BF4= 250.13
##$BF5= 500.13
##$BF6= 500.13
##$BF7= 500.13
##$BF8= 500.13
##$BYTORDA= 1
##$CFDGTYP= 0
##$CFRGTYP= 5
##$CHEMSTR= <none>
##$CNST= (0..31)
1 1 145 1 1 1 1 1 1 1 1 1 1 1 1 1 1 1 1 1 1 1 1 1 1 1 1 1 1 1 1 1 
##$CPDPRG= <>
##$CPDPRG1= <>
##$CPDPRG2= <>
##$CPDPRG3= <>
##$CPDPRG4= <mlev>
##$CPDPRG5= <mlev>
##$CPDPRG6= <mlev>
##$CPDPRG7= <mlev>
##$CPDPRG8= <mlev>
##$CPDPRGB= <>
##$CPDPRGT= <>
##$D= (0..31)
0 1 0 0 0 0 0 0 0 0.06 0 0 0 0 0 0 0.0002 0 0 0 0 0 0 0 0 0 0 0 0 0 0 
0 
##$DATE= 1188901064
##$DBL= (0..7)
120 120 120 120 120 120 120 120 
##$DBP= (0..7)
150 150 150 150 150 150 150 150 
##$DBP07= 0
##$DBPNAM0= <>
##$DBPNAM1= <>
$$ [...]
##$SUBNAM7= <"">
##$SUBNAM8= <"">
##$SUBNAM9= <"">
##$SW= 20.6930455092707
##$SWIBOX= (0..15)
0 0 3 0 0 0 0 0 0 0 0 0 0 0 0 0 
##$SW_h= 5175.983436853
##$TD= 65536
##$TD0= 1
##$TE= 296.16
##$TE2= 300
##$TE3= 300
##$TEG= 300
##$TL= (0..7)
0 120 120 120 120 120 120 120 
##$TP= (0..7)
150 150 150 150 150 150 150 150 
##$TP07= 0
##$TPNAME0= <>
##$TPNAME1= <>
##$TPNAME2= <>
##$TPNAME3= <>
##$TPNAME4= <>
##$TPNAME5= <>
##$TPNAME6= <>
##$TPNAME7= <>
##$TPOAL= (0..7)
0.5 0.5 0.5 0.5 0.5 0.5 0.5 0.5 
##$TPOFFS= (0..7)
0 0 0 0 0 0 0 0 
##$TUNHIN= 0
##$TUNHOUT= 0
##$TUNXOUT= 0
##$USERA1= <user>
##$USERA2= <user>
##$USERA3= <user>
##$USERA4= <user>
##$USERA5= <user>
##$V9= 5
##$VALIST= <valist>
##$VCLIST= <CCCCCCCCCCCCCCC>
##$VD= 0
##$VDLIST= <DDDDDDDDDDDDDDD>
##$VPLIST= <PPPPPPPPPPPPPPP>
##$VTLIST= <TTTTTTTTTTTTTTT>
##$WBST= 1024
##$WBSW= 4
##$XGAIN= (0..3)
0 0 0 0 
##$XL= 0
##$YL= 0
##$YMAX_a= 275533
##$YMIN_a= -205410
##$ZGOPTNS= <>
##$ZL1= 120
##$ZL2= 120
##$ZL3= 120
##$ZL4= 120
##$ABSF1= 16.522
##$ABSF2= -4.171173
##$ABSG= 5
##$ABSL= 3
##$ALPHA= 0
##$AQORDER= 0
##$ASSFAC= 0
##$ASSFACI= 0
##$ASSFACX= 0
##$ASSWID= 0
##$AUNMP= <proc_1d>
##$AZFE= 0.1
##$AZFW= 0.1
##$BCFW= 0
##$BC_mod= 0
##$BYTORDP= 0
##$COROFFS= 0
##$CY= 12.5
##$DATMOD= 1
##$DC= 0
##$DFILT= <>
##$DTYPP= 0
##$F1P= 14.0000005364418
##$F2P= -0.99999901652339
##$FCOR= 0.5
##$FTSIZE= 32768
##$FT_mod= 6
##$GAMMA= 0
##$GB= 0
##$INTBC= 1
##$INTSCL= 1
##$ISEN= 128
##$LB= 0.3
##$LEV0= 0
##$LPBIN= 0
##$MAXI= 10000
##$MC2= 0
##$MEAN= 0
##$ME_mod= 0
##$MI= 0
##$NCOEF= 0
##$NC_proc= -5
##$NLEV= 6
##$NOISF1= 0
##$NOISF2= 0
##$NSP= 0
##$NTH_PI= 0
##$NZP= 0
##$OFFSET= 16.522
##$PC= 1
##$PHC0= -48.59699
##$PHC1= 9.037354
##$PH_mod= 1
##$PKNL= yes
##$PPARMOD= 0
##$PSCAL= 4
##$PSIGN= 0
##$REVERSE= no
##$SF= 250.13
##$SI= 32768
##$SIGF1= 0
##$SIGF2= 0
##$SINO= 400
##$SIOLD= 32768
##$SREGLST= <1H.DMSO>
##$SSB= 0
##$STSI= 32768
##$STSR= 0
##$SW_p= 5175.98343685301
##$SYMM= 0
##$S_DEV= 0
##$TDeff= 65536
##$TDoff= 0
##$TI= <Analysis number 999999
Compound Code 99
Book Reference 9
Project Code 9>
##$TILT= no
##$TM1= 0
##$TM2= 0
##$TOPLEV= 0
##$USERP1= <user>
##$USERP2= <user>
##$USERP3= <user>
##$USERP4= <user>
##$USERP5= <user>
##$WDW= 1
##$XDIM= 32768
##$YMAX_p= 587321583
##$YMIN_p= -652206
$$ End of Bruker specific parameters
$$ ---------------------------------
##NTUPLES= NMR SPECTRUM
##VAR_NAME=  FREQUENCY,     SPECTRUM/REAL,   SPECTRUM/IMAG
##SYMBOL=    X,             R,               I
##VAR_TYPE=  INDEPENDENT,   DEPENDENT,       DEPENDENT
##VAR_FORM=  AFFN,          ASDF,            ASDF
##VAR_DIM=   32768,         32768,           32768
##UNITS=     HZ,            ARBITRARY UNITS, ARBITRARY UNITS
##FACTOR=    0.157963299565203, 1,           1
##FIRST=     4132.6476996994, 0,             0
##LAST=      -1043.33573715361, 0,           0
##MIN=       -1043.33573715361, -652206,     0
##MAX=       4132.6476996994, 587321583,     0
$$ Real data points
##PAGE= N=1
##DATA TABLE= (X++(R..R)), XYDATA
$$ [...]
17766A554070N2424J23080K80504M2061q0715J08953J12360J36090K97207J66369
17756B792403J23991L97759M27403L23206M53467N95293O82441O62128Q40099
17747G298190J181975J596982K371851L692878M953370M456548K865817J315811
17739B9733422n43178j406871r73631L57364L007088O320010J0936371J5923226
17731F3353801J9892189K2869354J8751355M072105q325604j0369393k019667
17724A08224140J3899914K9095686K6126404J310856j8618185k3470785j7377836
17717A19190194j2070665j2650830j5445286j5256792j2395187p879812l360941
17710D0130681L78133K894418K320172j523120n616246p127809o427269m666195
$$ y = [1554070, 1606494, 1729574, 2010078, 2052139, 1971424, 2080377, 2192737, 2328827, 2626034, 2792403, 2916394, 3314153, 3741556, 4064762, 4518229, 5113522, 5795963, 6458091, 7298190, 8480165, 10077147, 12448998, 16141876, 21095246, 25551794, 28417611, 29733422, 29190244, 27783373, 26809742, 27167106, 30174194, 36494204, 47430575, 63353801, 83245990, 106115344, 124866699, 128938804, 120613200, 110243807, 108224140, 122124054, 151219740, 177346144, 178657000, 160038815, 136568030, 119190194, 107119529, 94468699, 79023413, 63766621, 51371434, 43491622, 40130681, 40508814, 43403232, 45723404, 44200284, 38584038, 31456229, 25028960, 20362765]
17702B0362765l234034k192813j308386q64885p90414o47530l00036J10614L53813
17693A1489094M57210R79854J708421K834278M264127O324345Q187000P518956
17685D3763285M500634K835869M603880Q592658R637632L433294l721329n831624
17677F7814299j904433P191332J9177577K7231390J8446243K498643q112637j0956315
17669A21386099l416661N689741M933560q590639k0647726k3734589j9323784
17662E6296001j2169928o599442m359874m844657n013923m275589l306537k354963
17654A3371088j570903q47629k96437L66309J141503R37573j02457j299928k028951
17645I670168k023282j449590r39693o92824m38600n49275m74603l05639l04951
$$ y = [20362765, 17128731, 14935918, 13627532, 12762647, 11972233, 11324703, 11024667, 11135281, 11489094, 11946304, 12926158, 14634579, 17468857, 21732984, 28057329, 36244329, 43763285, 48263919, 51099788, 55703668, 64296326, 73933958, 77367252, 73645923, 67814299, 65909866, 73101198, 92278775, 119510165, 137956408, 140455051, 132342414, 121386099, 117969438, 123659179, 128592739, 120002100, 99354374, 75619785, 56296001, 44126073, 37526631, 33166757, 28322100, 23308177, 19032588, 15726051, 13371088, 11800185, 10952556, 10656119, 11022428, 12163931, 13101504, 12999047, 11699119, 9670168, 7646886, 6197296, 5257603, 4564779, 4126179, 3576904, 3102301, 2796662, 2491711]
17636B491711k30890j97168k63649p1866o3374K7013p9754l5208n5958P4834o2079
17625A533612q3599p1549l1242k42947M6537N1195m9780k2192o764j54913j84391
17614G83967m6848o1784q0670L189J64272Q1636N2810M4225n0608k18089n085
17603F67015P4750j9153j4635q478K6872j31173l4061k3629q8156j31958l4099
17592B83295J56049P839m0939j91973m8077j0777P3098j16830M1913J14969p839
17581B60728o5498K1719J21074L1407n3780j21454J043P5234L3887M7589L1473
17570C83422o5392j42361J4093k70N3974L9561j11890j6744P7796J86544J51007
17559E69740K6300l1470q7978k1616r1989j60821n4546j38356J18872J30108L6645
$$ y = [2491711, 2260821, 2063653, 1800004, 1728138, 1664764, 1691777, 1612023, 1576815, 1520857, 1595691, 1533612, 1450013, 1378464, 1347222, 1104275, 1150812, 1202007, 1152227, 1130035, 1123271, 968358, 783967, 737119, 675335, 594665, 597854, 762126, 843762, 896572, 940797, 890189, 672100, 667015, 741765, 722612, 707977, 699499, 726371, 595198, 561137, 537508, 449352, 317394, 283295, 439344, 447183, 406244, 214271, 166194, 155417, 228515, 111685, 153598, 268567, 260728, 195230, 216949, 338023, 369430, 315650, 194196, 195239, 270473, 304360, 351949, 383422, 318030, 175669, 189762, 189492, 243466, 283027, 171137, 154393, 232189, 418733, 569740, 596040, 564570, 476592, 454976, 362987, 202166, 147620, 9264, 128136, 258244, 294889]
17548B94889M1554o0305j25971j80267O2709J64450j6868j47318N4844K3301j10149
17537H69N3022Q4688p187n1947m4802j92705q6633L2836J49308R6072m3129j12353
17525a21961l2905J9446K998j09792r1433k1360J70326K05461J78531m4408j00074
17514E4829l0193K3235p7980M143O6508R9653o3624j01007l0181O8674k07146
17503a93089N1157J55765M1273J0283O3613J531J10696N109o5867N2327P4698
17492C07496k5073r3591R2588J59236n8102j08118j06171l2662k3014n1882r3405
17481c2698Q7647R2873n4886M2144n0385j22982Q3923j0460k8568j8948N3203
17470D0863j47422l453N5594n2171o7215o8587Q2572P7473J18353o0838o9049
$$ y = [294889, 336443, 276138, 150167, -30100, 32609, 197059, 180191, 32873, 87717, 111018, 869, 53891, 138579, 131392, 79445, 34643, -158062, -244695, -211859, -62551, 33521, -9608, -121961, -154866, -135420, -132422, -242214, -333647, -355007, -184681, 20780, 199311, 154903, 54829, 24636, 47871, -30109, -25966, 40542, 140195, 76571, -24436, -54617, 14057, -193089, -141932, 13833, 55106, 65389, 129002, 130533, 241229, 246338, 180471, 232798, 307496, 282423, 188832, 281420, 440656, 382554, 274436, 168265, 135603, 112589, 60707, -32698, 54949, 147822, 92936, 135080, 84695, -38287, 45636, 35176, 6608, -12340, 40863, -106559, -110012, -54418, -106589, -173804, -242391, -159819, -82346, 36007, -24831, -93880]
17459i3880J27056L59383l3094o2858l0472M8227Q5335q30j53293J3475L0595
17448B89644J08524M1610j18706r5368o8311n6302P8713m2265j07278M493J19562
17437A54316j65736l615J61888K1531q7157q6985n8907o2497Q1827O445J0372
17426b8518J02442O8599k20686k19301J14070J73419m9872o467J6451r8946l1842
17415a80651J77648j7260o3058o8385K799Q6053K14834n7406k17542Q5808J60966
17404A23806l045j56653k0479O0037J58864J56127k802j3983j54006j35482R7701
17393A10085k1946q7311P251q0401q644J43995j18567m3083o2139N6884Q7309
17382a6567P8528l7153k5734o1317M9290R3294m4072r7480K4449K9748J44730
$$ y = [-93880, 33176, 392559, 359465, 296607, 266135, 314362, 399697, 398867, 245574, 259049, 289644, 398168, 439778, 321072, 225704, 157393, 101091, 179804, 137539, 30261, 34754, 154316, -11420, -15035, 146853, 168384, 81227, -5758, -64665, -127162, -45335, -38890, -28518, 73924, 142523, -78163, -297464, -183394, -9975, -59847, -66314, -49863, -148809, -180651, -3003, -20263, -83321, -151706, -148907, -62854, 151980, 94574, -122968, -37160, 123806, 120761, -35892, -56371, 3666, 162530, 318657, 315855, 301872, 147866, 12384, 110085, 88139, 828, 8079, -72322, -80966, 63029, -55538, -98621, -160760, -103876, -16567, 61961, 24808, -926, -62243, -12953, 80341, 36269, -61211, -36762, -7014, 137716]
17371A37716j7957j6236J430P7568k7995l3442L1650l3915r1996P3035J18293
17360B18151k17722j11527K5591n0909J68268N8566q5152k64844j8480K08074
17350f9984n1154O6715P8760Q939n1867l3983j80013j55165R3382J66016k7095
17339a55449K304j07615j28236J2851J71127J70848m2522r8273J03981J30404
17329E9420j9486l0984r1689p0228n7082P0968k94l0415j3972q082J14920P6579
17317c45k40081M3817j72832J3945J73152R5623M8185L10455l5230m12718k20776
17306c96805R8315J43680j4352M2279N7983O7892P2540j95250j1671j00764K5470
17295b10683K1769L7569p6023k5146J45933O4625L9034O7499J75240O8835r533
$$ y = [137716, 119759, 103523, 104953, 182521, 154526, 121084, 152734, 118819, 26823, 99858, 218151, 429, -111098, -85507, -136416, 31852, 90418, 5266, -259578, -278058, -69984, -121138, -54423, 24337, 33276, -18591, -52574, -232587, -387752, -294370, -128354, -155449, -153145, -260760, -388996, -376145, -205018, -34170, -76692, -174965, -70984, 59420, 39934, 8950, -82739, -152967, -210049, -139081, -139375, -169790, -183762, -191844, -76924, -345, -240426, -196609, -369441, -355496, -182344, -86721, -38536, 271919, 236689, -176029, -396805, -298490, -154810, -169162, -126883, -68900, -1008, 71532, -123718, -135389, -236153, -210683, -188914, -151345, -227368, -252514, -106581, -41956, -2922, 64577, 239817, 308652, 299119]
17284B99119m1920r1692o8747n9048O6368N0138j00414m2373j15076P615k5190
17273a21220j14715K715J52858j94450O0842j6732J8502O6812M2130K6147K4295
17262e2816J14746k4712J7209R64m4412n6413N1292o5341j64753N0451j93270
17251c67055o1880N5229j3680k453K164Q1427J32327l7999j09290J00167J51590
17240f9453J10648n8116j65033J33896J38832k1397m6043O9254Q6509j12376r5589
17229b8868L3630J46390K05080P1752j87046l6047J44736K12141l3389l0413j9939
17218D78027n3418J11935p6980j83675r312M646m535j03390p3503J50730R5599
17207C36124K6351J08458j32853o1770n8975L9821J16755K97443J0101k20964
$$ y = [299119, 257199, 165507, 96760, 37712, 104080, 154218, 53804, 11431, -103645, -96030, -121220, -235935, -233220, -80362, -274812, -213970, -230702, -212200, -145388, -103258, -77111, -52816, 61930, 37218, 54427, 55391, 10979, -45434, 5858, -59483, -224236, -173785, -367055, -428935, -373706, -387386, -389839, -387675, -306248, -173921, -211920, -321210, -221043, -69453, 41195, -16921, -181954, -48058, 90774, 69377, 23334, 92588, 179097, 66721, -28868, 4762, 151152, 356232, 427984, 240938, 204891, 349627, 561768, 528379, 497966, 478027, 424609, 536544, 459564, 275889, 266577, 271223, 266688, 163298, 89795, 240525, 336124, 362475, 470933, 338080, 276310, 217335, 257156, 373911, 671354, 681455, 460491]
17197D60491n7722l4774k05325j68218N8132j4850J14605J895J5626j71533N835
17186D162J85608N5352k48919o6158n6594m9558J86154R2622k5692j965J44164
17175B19176J37023N6073o8273J28838J09494O1869K0535R8695O4664n9821m2908
17164G25365j26347j38118K0378J2313o3003j15283l9680N3815Q8713J18568P6643
17153F13364l0161j46235l2462Q3064K9327r5005o4126n8325J08596r3341l3604
17142B81092j32471J29233Q9742L8999o4789q0424k31601Q471j6024o0734N2494
17131A3988o4944O8137P1339r9686J1851P7080O9841o429j19428L070p7325j87874
17119b40380L6794j58710R8054M1580J76525K8416j8851N4109L806l1422J85221
$$ y = [460491, 402769, 367995, 162670, -5548, 52584, 37734, 152339, 154234, 169860, -1673, 4162, 189770, 245122, -3797, -69955, -126549, -176107, 10047, 102669, 76977, 75012, 219176, 356199, 412272, 343999, 472837, 582331, 644200, 664735, 763430, 828094, 768273, 725365, 599018, 460900, 481278, 493591, 430588, 315305, 275625, 329440, 418153, 536721, 613364, 583203, 436968, 404506, 487570, 516897, 421892, 357766, 299441, 408037, 314696, 281092, 148621, 277854, 367596, 406595, 341806, 261382, 29781, 38252, 22228, -38506, 13988, -50956, 17181, 88520, -11166, 685, 77765, 147606, 141177, 21749, 24819, -52506, -240380, -203586, -362296, -264242, -222662, -46137, -17721, -36572, 17537, 21343, -10079, 175142]
17108A75142J46497Q8500j03049l06595N6969l0496K7611K7158j27409m7768N6708
17097c6732J92020p1897n9535m5174l9990K1176K36827n9375j70412r8630M3704
17086h8018J10901l5376N3010k10877J17377j04729j17636N2751o0822Q6332J96397
17075f90M4194P6791j33107O292j20747p6057R2569R015j59958J07924J00417
17064e3357J73018Q6106L2279k00097j85969j902J21295K37817J49038l4909j57606
17053A65713j08702O855J3930K3127L9680j31835J27668o6059n2149J4313Q6443
17042A18984j98254k43964Q9537L3390q096J38580O9416r10L8529k7794J00801
17031A10219J9340p5367J18841N3173j1685o2639j86476n8841l4586p7968M6860
$$ y = [175142, 321639, 410139, 307090, 495, 57464, 26968, 54579, 81737, -45672, -93440, -36732, 155288, 83391, 23856, -21318, -61308, -40132, 196695, 137320, -33092, -131722, -88018, 22883, -12493, 40517, -170360, -52983, -157712, -275348, -222597, -283419, -197087, -690, 43504, 120295, -12812, -6520, -127267, -203324, -110755, -101740, -261698, -153774, -53357, 119661, 205767, 238046, 37949, -148020, -149922, -28627, 209190, 358228, 323319, 165713, 57011, 63866, 77796, 100923, 140603, 8768, 136436, 70377, 18228, 32541, 118984, -79270, -323234, -233697, -200307, -208403, -69823, -407, -1317, 37212, 9418, 110219, 129559, 54192, 173033, 226206, 214521, 151882, -34594, -93435, -128021, -205989, -159129]
17020a59129q7659K0857J10345l9967J2106K6961P126L2029k3352p4365o3813
17009b38861k0978q5699J32120J35183K7738M1137r7141r8559p5836n0860k3413
16998c55169j14903l5454Q8126J14630J37493N0971L7841J75278J32597p9085
16988A52325l7858o7155o6743J62664k50656j12863J64949O5419J00559j025J41625
16977B51241r375j82111P6077M9147m0593L7192k625o3646j70441k75123j1337
16966c41594J42137K69849K11545k07052m7445Q860q9858L7408n2524l8199j26891
16955b33764k010J0095o25J77898J22247n29n3060l3427J45506K7066k3635J3384
16943A49146j30722j46779N1634m3916j48526j06730Q1764J86612J97866Q000
$$ y = [-159129, -246788, -225931, -115586, -155553, -143447, -116486, -109360, -77331, -100683, -175048, -238861, -259839, -345538, -213418, -78235, -50497, -9360, -106501, -205060, -280896, -331756, -355169, -470072, -505526, -417400, -302770, -165277, -114306, -76465, 98813, 231410, 152325, 114467, 47312, -19431, 143233, -107423, -220286, -55337, 10082, 110641, 109616, 251241, 241866, 59755, 135832, 184979, 144386, 181578, 178953, 115307, -55134, -330257, -341594, -199457, 70392, 281937, 74885, 27440, 36300, -53558, -16150, -68674, -106873, -233764, -235774, -225679, -226304, -48406, 73841, 73312, 20252, -13175, 132331, 159397, 135762, 149146, 18424, -128355, -76721, -120637, -269163, -375893, -294129, -107517, 90349, 98349]
16933I8349k38662m1558N1514K9931O1684P2953j21420J0430J37723j0698r3971
16922d3725j01088l2529J50929l8120k0696K8029J58237j17738o746J40140J71180
16911B87873j88283k86533j08509J52367j15371k3858l2430J65875N6128M8545
16901d4196n2191n1999k9572O7564l0727P5171j5706M8618M8416R0922j18672
16890a2372N585o2035o6396J11291J41677q6779k57651p1696j9233J23715r016
16879b02910O1004L951J47684J67548k0403p1603R8151p5478k1747p8438j43456
16868a35697l4008L321k7426N9706J22057q9572j04108J05546K04716Q64l6036
16857F9363p4203j1279J20652k2575j08987j59486K29918O6990j57663j34928
$$ y = [98349, -140313, -181871, -130357, -100426, -38742, 34211, -87209, -76779, 60944, 50246, -43725, -144813, -177342, -26413, -64533, -85229, -57200, 101037, -16701, -23447, 116693, 287873, 99590, -186943, -295452, -143085, -258456, -282314, -314744, -148869, -92741, -44196, -96387, -148386, -177958, -110394, -141121, -65950, -81656, -33038, 15378, 106300, -12372, -6787, -68822, -135218, -23927, 117750, 30971, -226680, -298376, -317609, -193894, -202910, -141906, -137955, 9729, 177277, 156874, 85271, 183422, 107944, 86197, 7759, -135697, -169705, -166384, -193810, -134104, -12047, -101619, -205727, -100181, 104535, 105399, 69363, -4840, -16119, 104533, 81958, -27029, -186515, 43403, 110393, -47270, -182198]
16847a82198M4564J80354k64553j30233R2961R9492O2738k0118o6929l0602N5513
16836a59011O6115J93448r6713j08717J11889J0491P2895M3031J10239m0729k79484
16825g6546l3936J02285m5362J13386r5143k08454J45923O5530k4764p1016l091
16814a31188N4311R551K8301q714l2556J27979M1322m475k46435j5049J25004
16803e1949O0832j70094N0246J74907O5554j08837K1020n6510r1021R2156J75445
16792A61749L5920k1640k86770o5270K86055M7649j72687R5276l5693J3815O1145
16781A19549M1892k4126j63413l0195m941J19230n2093P3366J77115j46638k79439
16770a69693J0754Q2075J31583k7545p5605j19861L3703J2178k4678J44162r7735
$$ y = [-182198, -137634, 42720, -221833, -352066, -259105, -159613, -96875, -116993, -183922, -214524, -159011, -92896, 100552, 3839, -104878, 7011, 17502, 90397, 133428, 243667, 202938, -76546, -110482, -8197, -53559, 59827, -35316, -243770, -97847, -32317, -57081, -128097, -131188, -76877, -67326, -39025, -47739, -80295, 47684, 89006, 84531, -161904, -176953, -51949, 8883, -161211, -110965, 63942, 129496, 20659, 41679, -14831, -105852, -13696, 161749, 197669, 176029, -110741, -176011, 110044, 157693, -14994, 80282, 44589, 58404, 119549, 161441, 137315, -26098, -56293, -61234, 57996, 5903, 79269, 256384, 109746, -169693, -158939, -76864, 54719, 27174, -48431, -168292, -134589, -122411, -147089, -2927, -100662]
16759a00662m0286J37719Q5768j68795m7512Q196P0739J1133K9134Q4348m8663
16748B1119l9420J04550N9866R534j4024N844r3817p2731J72421Q1684j32924
16737A02102j33726o1288m8288R490j45378J17186O0255J31183M3200j42236k8023
16726i5523K3217M3880J42845j0437j54151o1370N1204Q6699n0730j46642R76
16715a70032J47586l021L0242k8500J882J1910L789j50302J15829J12776j21912
16704d9753p5451J00761P9043r4586r0383j36087J716J54330J35193O7578k30459
16693a38098O6508r2261k78270M6269K1951J10095R1331L3150m9265o3423O0797
16682a91216K50035O3930l4961l3971j57453j20946j4303Q2650n0852o3154L0653
$$ y = [-100662, -140948, -3229, 82539, -86256, -133768, -125572, -54833, -43700, -14566, 69782, 21119, -18301, 86249, 146115, 155649, 141625, 147469, 53652, -19079, 153342, 235026, 102102, -31624, -92912, -141200, -131710, -277088, -159902, -99647, 31536, 74736, -67500, -95523, -72306, -28426, 114419, 103982, -50169, -111539, -60335, 26364, -24366, -171008, -170032, -22446, -25467, 4775, -23725, -21843, -9933, -6144, -156446, -40617, 72159, -49753, -125204, -24443, 54600, -39986, -130369, -266456, -264740, -110410, 24783, 92361, -138098, -71590, -163851, -442121, -395852, -373901, -263806, -172475, -139325, -188590, -252013, -191216, 58819, 122749, 87788, 53817, -103636, -224582, -238885, -156235, -207087, -270241, -239588]
16671b39588J14512J11157N5610J5820K1897j41694n8480j8540P224J25974P1730
16660F5622l3605m0104Q8615k6852K19043n0030j91324j22484J4912R1037j04197
16649h9367k1475j58180r5041P1788J67204J52682k3192N5850r9222O5338j24245
16638i7860k17076o3763J10056J50827P9592k812q4492r2552k1216R9018J64431
16627B4153J87239K8532o6647L2541j03351j38147j1142k10658m4534J38458R6342
16616f7214o2617j37463Q5560q0148n2411J83014J04008q0477R7914O325k0257
16605b3766m7839r6142n8177J14308J2921l3927Q190j25002m7616M2851P6468
16594a77731K871L2407R2699r816J31719p3779L948l6524m267o5327o9025k0047
$$ y = [-239588, -125076, -13919, 41691, 57511, 79408, -62286, -120766, -139306, -132082, -6108, 65622, 32017, -8087, 80528, 53676, 272719, 222689, 31365, -91119, -76207, 14830, -89367, -110842, -269022, -364063, -292275, -125071, 27611, 4419, 60269, -38953, 26385, -97860, -314936, -378699, -268643, -117816, -38224, -41036, -125528, -218080, -239296, -140278, 24153, 211392, 239924, 173277, 205818, 102467, -35680, -46822, -257480, -302014, -163556, -67214, -129831, -267294, -181734, -261882, -314293, -131279, -27271, -107748, -9834, -3509, -23766, -71605, -167747, -225924, -111616, -98695, -132622, -124432, -249434, -297050, -254199, -177731, -174860, -142453, -49754, -59570, 72149, -1630, 2318, -34206, -38473, -103800, -172825, -192872]
16582a92872J00608J10070Q4914n5135Q7872J64802j01506j76338j40974K7153
16572i1406O4408N5907J03650n817j20878N4842P379m1951J4031j50550q0841
16561a91226J34230M506k22848j14451P5804P497n9905J5949R3132M7702j2744
16550b22354j3659m5210l6844j7778p3950J79993K18178O3866r3710l5538m0476
16539a17482M9882N0320m0940j1049j64609n6546J96919Q1136J737J7846j53367
16528a46153M7105J48857Q903j11093M7645J11914j05023j61124J1948R4501J68920
16517A16400K367j06743K0654J01891k7435j33971J37468K5679j19928r7898L0503
16506e1013j0872O6686n7800j1147R9812Q889j72106O0208Q9159j44202j00562
$$ y = [-192872, -92264, 17806, 102720, 47585, 135457, 300259, 198753, 22415, -118559, -91406, -26998, 28909, 132559, 126742, 5864, 60706, 68085, 26134, 40165, -110385, -191226, -56996, -52490, -275338, -389789, -313985, -306488, -366393, -350444, -257312, -209610, -222354, -236013, -281223, -318067, -335845, -409795, -229802, -11624, 52242, -41468, -77006, -117482, -67600, -17280, -58220, -69269, -233878, -290424, -93505, -12369, -10632, 7214, -146153, -99048, 49809, 58712, -52381, -4736, 107178, 2155, -158969, -147021, -52520, 116400, 118767, 12024, 32678, 134569, 107134, -26837, 110631, 136310, 16382, -81516, -51013, -61885, 4801, -52999, -64146, 35666, 44555, -127551, -67343, 21816, -122386, -222948]
16495b22948l1618K62898n5867q0402J06319J38425L0036j76672j67976P7500
16485a20305L8071k9111P6040L4987l3599l4568J06146K15847j9764j2651l5259
16474A85834M1876Q541j25725L2821j63079k6845k997p8339j50125J720l539k2241
16462c02098J04686N1398p206M8620K9443l5701J30607p408j73832q1365J18933
16451a23923P1078m9789q4797l5738L2616m7114j29578j19484P7080L17145K02098
16440A09594q1367j10877P9714J5945o600j3194R7217j83898N842m826L1366M633
16428e6451o4043J7418J07128K12403M6605j49097j10210j69799Q5052q6712N7631
16417a10075J96956j9847k15405J84187O3225r3855j25666p327p109n871N9938
$$ y = [-222948, -254566, 8332, -47535, -127937, -21618, 116807, 146843, -29829, -197805, -120305, -82234, -111345, -35305, -318, -33917, -68485, 37661, 253508, 233744, 221093, 185834, 227710, 236251, 110526, 143347, -19732, -46577, -49574, -127913, -278038, -276318, -279857, -302098, -197412, -146014, -153220, -104600, -75157, -110858, 19749, 12341, -161491, -242856, -123923, -52845, -102634, -187431, -223169, -190553, -237667, -367245, -486729, -409649, -92504, 109594, 28227, -82650, -2936, 13009, 6409, -6785, 90432, -93466, -87624, -92450, -61084, -56451, -120494, -103076, 4052, 216455, 263060, 113963, 3753, -166046, -80994, -167706, -110075, 86881, 67034, -148371, 35816, 99041, 5186, -120480, -127807, -134916, -140787, -80849]
16406h0849J13530l4104O6000Q6088K4697k8825k67665o4230m4860K4995J79866
16395b5357R6683j01712j53963l8486L5086N67J51808K9324k3090J4039m3528
16384e8629j79069n4753J52350Q5816M1144j7096l8706Q6667R0357K6837J28480
16373B63398k6018n1927o7045k7101j40103k5174K6599J33061k0928k28916k0397
16362a84551J51341K830n95m4019N4131l6502m1320J03493j32825m7967l8862
16351b14846J1010N8883J64664J04149M5924J26861r1813L2279j41500j14844
16341a9233J40971J22834P0932k09674j25069l0648J18950J79417o3539j64397
16331B0544k2428M2672m469O975n5364N2665J37495j17669o6178N0348k2986L5884
$$ y = [-80849, 32681, -1423, 64577, 150665, 175362, 146537, -121128, -185358, -230218, -205223, -25357, 71326, -30386, -184349, -222835, -187749, -187182, -35374, -6050, -29140, -15101, -58629, -237698, -292451, -140101, -54285, -13141, -30237, -68943, 17724, 108081, 134918, 263398, 237380, 185453, 118408, 91307, -48796, -73970, -47371, 85690, 64762, -164154, -184551, -33210, -30380, -30975, -74994, -20863, -57365, -98685, 4808, -128017, -175984, -214846, -203836, -144953, 19711, 123860, 169784, 296645, 204832, 237111, 95611, -19233, 121738, 244572, 315504, 105830, -19239, -49887, 69063, 248480, 184941, 20544, -1884, 40788, 36319, 43294, -12070, 40595, 178090, 60421, -5757, 44591, 21605, 57489]
16319E7489q5107l9982J28330O0902p5305l3331M8907j08842K703J19905K2670
16308I8339r2171k4211m9477j29191R462K15686l0837j31493K4728m4746j9494
16297a73405N9100o3342r2016J638J15674n1062n5924J32824R1000J45445N8725
16286A68657r2871j04650j05150r052j5393n6470J5564R020k1670J0248j9413
16275b21180q8207K61123J17585j94968j76557L443P1649J18721O9356O7518J40720
16264A69203p9120m621j68628o3253J5158J03810q2634j05801J13560J8411m5773
16253a29688L0202J00593K8225p3949j5362l5266m3323j11964J37958L55072o555
16242B35943p5304j59304j672L9091j16536j5335L0165J5674l8735j62194K3887
$$ y = [57489, -27618, -67600, 60730, 121632, 46327, 12996, 61903, -46939, -44236, 75669, 98339, 6168, -18043, -67520, -196711, -187249, 28437, -2400, -133893, -109165, -153911, -173405, -114305, -177647, -269663, -268025, -152351, -203413, -259337, -126513, -35513, 109932, 168657, 75786, -28864, -134014, -143066, -158459, -214929, -199365, -190345, -212015, -201767, -221180, -309387, -48264, 69321, -125647, -302204, -298761, -227112, -108391, -39035, 28483, 169203, 90083, 85462, -83166, -146419, -131261, -27451, -110085, -215886, -102326, -83915, -129688, -99486, 1107, 29332, -44617, -59979, -95245, -138568, -250532, -112574, 242498, 235943, 160639, 1335, -337, 38754, -77782, -93117, -62952, -47278, -86013, -248207, -224320]
16231b24320J59974j6939p9229l3199P140J5336N6850J44554o1156P9627k9897
16220A8741k7191j78188l3604j30150k3570K21316J38609j2021J13078k9632r2497
16209c5109P2836K1028M6918L3316P3104o8849P2131n0983j13084M3622o1308
16198C3622q2783j22321k26187R4379K02577K645P1014m5305j7429J4395o6464
16187a41857p6648M9885m4987L8637L1475n7346M9372P121R028O3581M7134J24079
16175I9474q3370k8531r7003R12k4531N0719n6778j5286q2656p9626j07091n2307
16163d76074p174R8375J67124L52546K3853j47714l9673P5125k7049J4048J9809
16152E3196N4300j05859o4006N9510q2262J3483M7353j84950j42762L7833K7024
$$ y = [-224320, -64346, -81285, -160514, -193713, -186573, -171237, -114387, 30167, -30989, 48638, 18741, -8450, -186638, -220242, -350392, -373962, -152646, -14037, -26058, 87020, 57388, -35109, 37727, 58755, 105673, 138989, 212093, 143244, 215375, 164392, 51308, 94930, 33622, -49161, -171482, -397669, -303290, -100713, -98068, -27054, -72359, -89788, -75393, -141857, -218505, -168620, -213607, -174970, -143495, -200841, -151469, -144348, -135320, -71739, -24605, 99474, 16104, -12427, -109430, -108518, -133049, -82330, -139108, -154394, -237050, -316676, -423767, -476074, -483248, -384873, -217749, 134797, 158650, 10936, -28737, 46388, 19339, 33387, 53196, 107496, 1637, -62369, -2859, -85121, -71638, -24285, -209235, -351997, -314164, -287140]
16141b87140J34227L4792r0681q2379n2393K2181K2825Q3441Q4592O6568n1418
16130a15385j63345o9421Q7509J38252k8512j06148p3755M5673J01962J50869
16120c2301O3404j71220J8542L1313p9717o4651O0669K4030R4409j39777k09643
16109d04942J9087J09975n7802J38559K08543Q6993r6511J7190J0488j71490l1977
16098a71887J27999J92482o9016k29971j69159m7577J68078q1024O4288l6289
16088b52076J679Q4547J03789k2482n1171K1505P1307k2151p2431P4113j51152
16077b14523j17764l4516P0231J07575L2861K14466r6886j35193J6412J48995
16067h342Q6718j9127o904Q6385n578P8742Q3884l8799r2698o1211r8062m3006
$$ y = [-287140, -152913, -118121, -208802, -291181, -343574, -321393, -298568, -215127, -130535, -63967, -115385, -278730, -348151, -260642, -122390, -150902, -257050, -330805, -285132, -183170, -32301, 31103, -140117, -121575, -90262, -169979, -234630, -173961, -149931, -55522, -195299, -404942, -385855, -275880, -333682, -195123, 13420, 100413, 3902, 21092, 31580, -139910, -171887, -43888, 148594, 79578, -150393, -319552, -367129, -199051, -280075, -215787, -252076, -250397, -165850, -62061, -84543, -135714, -114209, -42902, -65053, -137484, -63371, -214523, -332287, -366803, -296572, -188997, -156136, 58330, -38556, -173749, -157337, -8342, 78376, 59249, 52345, 138730, 133152, 211894, 295778, 256979, 164281, 103070, 5008, -37998]
16055c7998Q8238p251r3537l9844R2383P2735M7493j24189r6653J08219j47903
16044a38307r9048J0759L246K5499K7550L6102Q5132o6476Q5145J022l3837J77617
16032A14404Q4420p5545j77775R6775M6000j83345k43323O29O7302J40899j04186
16021b33745J91003J23448k57254j84034m6044J60898Q1615J7420J7656K00542
16011G1505J64831J02022j36359j70839J771K01159M8341j93769n5501k070K3911
16000E5002K792R6705m0264j2390j01918j15287M8538Q8280p9366n2014j4826
15989a24748L0360L4344j1202J90432p3684r2744J6909L7201P611r6224q0255
15978a62000L3996r990O8750J32360r8291r3930o7930l3981n2730J16533N8263
$$ y = [-37998, 50240, 42989, -50548, -90392, 1991, 74726, 122219, -1970, -98623, 9596, -138307, -237355, -226596, -223350, -197851, -170301, -134199, -49067, -115543, -30398, -29376, -63213, 114404, 198824, 123279, -54496, 42279, 88279, -95066, -338389, -337760, -270458, -129559, -233745, -42742, 80706, -176548, -360582, -406626, -245728, -164113, -146693, -129037, 71505, 236336, 338358, 201999, 31160, 32931, 234090, 282431, 88662, 33161, 31091, 55002, 57794, 154499, 114235, 101845, -73, -115360, -66822, 21458, -57908, -109922, -124748, -94388, -60044, -71246, 119186, 45502, -47242, -30333, 6868, 14479, -81745, -162000, -128004, -137994, -69244, 63116, -35175, -129105, -197035, -231016, -283746, -167213, -108950]
15967a08950L728k06537N8592Q9301J21298q0307p9182M4599J47846J95929K39686
15956D26003o6729l33239j03497j4329l7446r6860K6220N9859K0024J35660j09680
15945i4014K0462J26921O269j16299R686J58559j19945L7699J3927J1294r5367
15934d0808Q2658O1348k3102p7592j03927m0686j1986j6741J89807J50041M886
15923A73898M7515j3441o8517j5533j0272J3557M3353j58462j37748J30013R4593
15912I8956J45818J46974m0998j89435r0725j05951R2502p0324K8870m9176Q6897
15901E3408J84411j9813j44466j69517q1561P7258k5469j41955q6987j0065J18580
15890b46176J8143R0714J50924K80745O5568k97284j76855M3954k4703Q1398j08762
$$ y = [-108950, -105222, -311759, -253167, -163866, -42568, -122875, -202057, -157458, -9612, 186317, 426003, 359274, 26035, -77462, -91791, -129237, -226097, -199877, -140018, -119994, 15666, -94014, -73552, 53369, 59638, -56661, -46975, 111584, -8361, 29338, 43265, 54559, -40808, 41850, 103198, 80096, 2504, -101423, -142109, -154095, -170836, 18971, 169012, 173898, 221413, 207972, 139455, 123922, 113650, 127207, 170560, 12098, -125650, 4363, 98956, 244774, 391748, 350750, 161315, 70590, -35361, 57141, -13183, 15687, -33489, 53408, 237819, 218006, 73540, -95977, -177538, -100280, -125749, -267704, -354691, -364756, -246176, -228033, -137319, 13605, 294350, 359918, 62634, -114221, -70267, -94970, -13572, -122334]
15879a22334M7603J07073q1353O057O0244K0459j41893q2449j32670O8187J21100
15868a29976j47608p9836R4425J61080J79209l9500k2156J16707K0967n0164O5917
15857A69065r2331j38257j50732m9626J38218J4009K00060Q5691j87769j09739
15847a21411R391K2041n5N1796O3612L6219k05022J6136l4010j17656j7922Q3757
15835b13124J21540Q330M8175J5093N2258J42738P1669r1586o0596L239R8359
15824A96095j27526j02991j59923K9315O6097N8086J9142K3394l4660l6731l009
15813g2711p7260K3751J90685K9501m7507r781j65013q2472J49024j8094r2564
15802a72441O2678J31945J9755J9259j8850j2368j07699n6618K2091J52798k4889
$$ y = [-122334, -74731, 32342, -49011, -42954, 17290, 37749, -104144, -186593, -319263, -251076, -129976, -277584, -357420, -262995, -101915, 77294, 37794, 15638, 132345, 153312, 103148, 169065, 76734, -61523, -212255, -261881, -123663, -109654, 90406, 176097, -11672, -121411, -112020, -89979, -90034, -38238, 25374, 61593, -143429, -127293, -161303, -278959, -296881, -213124, -91584, -83254, -35079, -19986, 32272, 175010, 246679, 155093, 94497, 97736, 196095, 68569, -34422, -194345, -165030, -98933, -40847, -21705, 1689, -32971, -69702, -72711, -149971, -126220, 64465, 93966, 46459, 36678, -128335, -210807, -61783, -79877, -172441, -109763, 22182, 41937, 61196, 42346, 29978, -77721, -134339, -112248, 40550, 15661]
15791A5661k5944J00950n2619m612J17889j37445q3481J876M9663L9276p7523
15780e6309j12830R0483J03080J00908R65l0103K5612j21035O6065J38228l9635
15769A65429q5912j97365q8825R6389J21888k1906P595O0348n2202j90456J05685
15758g9332j3947o3641n9734J67699p3792Q2700J25364l183j0750j67314j4611
15747a10541n4884j39316K75786J33639j1438n4221M4121p5993J8634p8571o8300
15736a21084L14429J57163j42757k50942j43673K3981Q7823K1505q2561j04351
15726b40467m2513J91373k7125r1223M2443P4936j58602r2883J44794p0085l8463
15715c07815L4599o806J29289L6636l8828J6198L1680L7869k11861m2780K02995
$$ y = [15661, -10283, 90667, 38048, 33436, 151325, 13880, -69601, -67725, -18062, 21214, -56309, -169139, -78656, 24424, 125332, 126297, 96194, 121806, 771, 66836, 205064, 165429, 79517, -117848, -206673, -110284, 11604, -10302, -2707, 57641, 5439, -185017, -79332, -93279, -156920, -216654, -48955, -122747, -40047, 85317, 82134, 71384, -95930, -110541, -165425, -304741, -28955, 104684, 93246, 39025, 83146, 7153, 25787, -52784, -121084, 193345, 350508, 207751, -43191, -186864, -162883, -75060, -53555, -136116, -240467, -282980, -91607, -118732, -209955, -167512, -92576, -251178, -344061, -199267, -269352, -307815, -273216, -280022, -150733, -114097, -152925, -136727, -105047, -67178, -279039, -321819, -118824]
15704a18824N8606k0979k31484k44044J5618q1856k9243L25297K02375J48713
15694B4179j67998n7001J79938O6481J14834L1007p7021k85748j0695l9585j25431
15683c47040P8062J31145r4256J668O4547L5726P5840J2589l4077m2473k4408
15672a42677M6271n2257o6435J12005M2621Q0463J69173K6913O555j80582q8312
15661d6262M2515q322k2305J532j3584N3233L7210n6273j9095m7973M9070k697
15649c2951j05912o458P2953j7706O546J41274m5138j52264O9261o9984j80720
15638c21099M7525K71686N4750m9820j42842L9919K3499N3462p2905q3649J3027
15627a66447J78529j7750N4606M2265p2974N9434j11836L3965J6401o9798N1879
$$ y = [-118824, -60218, -81197, -312681, -556725, -541107, -622963, -652206, -326909, -124534, 24179, -143819, -200820, -20882, 45599, 160433, 191440, 114419, -171329, -182024, -221609, -347040, -268978, -137833, -232089, -230421, -165874, -130148, -54308, -41719, -75796, -118269, -142677, -96406, -148663, -215098, -103093, -60472, 19991, 189164, 216077, 222632, 42050, -46262, -3747, -12069, -34374, -32842, -46426, 6807, 44017, -12256, -31351, -79324, -30254, -32951, -138863, -145321, -72368, -90074, -83528, 57746, 12608, -139656, -70395, -140379, -321099, -273574, -1888, 52862, 3042, -139800, -99881, -76382, -22920, -95825, -179474, -166447, 12082, -5668, 48938, 91203, 18229, 77663, -34173, -208, 16193, -53605, -1726]
15616a726J40490K04585q0832o4018K7079j33898n28k0154J14911Q9841Q460o1106
15604B23104n7092M3233O0225J09913j7916q5123p3059K9857l7556j26489o7980
15593A117r421K25369q7909k39698j53166J7289j3216j2978J52786J1620j9904
15582a28111m0806j9578o4178K6155K070J30448K50963J59938k05404l1692N4767
15571A34572P7761m0168j56065q957N6728j6438r6544j1779J04253j8868J13133
15560A37628k19523j66592L0224J51753J01621k8869o1848j9476Q6115m6942P0163
15549C4254J0124O9288m2728n0479L7888k7151k150j02158p3441J1196J9172L0682
15537h5503o3757J05327Q0842p1924q9918O1680P1703o8366J05586q368j93251
$$ y = [-1726, 138764, 343349, 262517, 198499, 225578, 91680, 91152, 70998, 185909, 275750, 284210, 223104, 166012, 209245, 269470, 379383, 361467, 276344, 203285, 233142, 195586, 69097, 1117, -8304, 217065, 129156, -110542, -263708, -246419, -259635, -272613, -119827, -108207, -128111, -168917, -188495, -252673, -226518, -224448, -94000, 156963, 316901, 111497, 79805, 134572, 212333, 172165, 16100, 7143, 63871, 47433, -49111, -60890, 43363, 24495, 137628, -81895, -248487, -218263, -66510, 35111, 6242, -55606, -75082, 11033, -35909, 34254, 44378, 113666, 70938, 20459, 58347, 31196, 29046, -73112, -146553, -135357, -116185, -85503, -149260, -43933, 36909, -35015, -124933, -63253, 8450, -59916, 45670, 37302, -155949]
15526a55949Q3972j12531j14101J095o5414K00024K86189M9319m2015N9500m7828
15515A42261p8778p9672L254o2971J11539M7675p1471q9943j62171R2672K43682
15504I6077J3004l5686n6533J5557N4091N0150p4881j145k3109m9264L0748R7453
15492A16462o9386K9616n9596R0278k5441n0371J10687j93609l87315J0981J57449
15481b70245J62509o5692o9364P962Q1352J05346J17016M9285o0809r0411J01883
15470F8832M3490j47427j70622m2475O9874M5302j01908j73106J16831J85226
15460a05983M2060J01464m5472L9168K10209m7661j53132j8023O9066j29354m2587
15449h0245l9266O3584p9974P5535m4636L664N1444J287p2742k1638j03981P3802
$$ y = [-155949, -71977, -184508, -298609, -297514, -362928, -162904, 123285, 172604, 130589, 190089, 142261, 63483, -16189, -12935, -75906, 35633, 83308, 11837, -78106, -240277, -147605, 96077, 109081, 73395, 16862, 32419, 86510, 136660, 61779, 60634, 37525, -11739, 19009, 116462, 47076, 76692, 17096, 107374, 81933, 31562, 142249, -51360, -438675, -427694, -270245, -107736, -173428, -242792, -234830, -153478, -48132, 68884, 118169, 57360, -33051, 68832, 112322, -35105, -205727, -248202, -178328, -133026, -234934, -408040, -291209, -105983, -63923, 37541, -7931, 31237, 241446, 193785, 40653, 22630, 91696, -37658, -80245, -119511, -55927, -135901, -60366, -105002, -101338, -49894, -48607, -121349, -142987, -246968, -173166]
15437a73166J30889q341k7115n968P4914Q0925j03156K4256K37173R5340n0171
15426B75580o2154n4426J80559l0067K766p1200J43284m3098k28226j27723n90
15415a5295K9767L2561p8247N0049j00126J5952M0748N6914Q1603j08773p9471
15404g4318l9798j00441N1709L20206p828m3474j36878k00589J72181n8757o8987
15393a86974J5525M4116Q6334P9796J29326O9088j64055M2706J89724O0112j13136
15382B52562j85133r9826j53286P7033k4151o789J43440m1318o8747N7657M0004
15371h554O3070J20866L1253L5662q0949p1253k0856j0839n0700p2084Q471n5726
15359a11639j13035m8613J14333n3367J48452P0289P1672k395J25417K6088j03528
$$ y = [-173166, -42277, -50618, -77733, -83701, -8787, 72138, -31018, -6762, 230411, 325751, 275580, 213426, 159000, 339559, 309492, 312258, 241058, 384342, 341244, 113018, -14705, -15295, 14472, 47033, -31214, 18835, -81291, -65339, -24591, 32323, 113926, 5153, -74318, -114116, -214557, -162848, 157358, 149530, 106056, -30822, -231411, -59230, -117987, -186974, -171449, -127333, -40999, 38797, 168123, 237211, 73156, 115862, 305586, 365698, 252562, 67429, -32397, -185683, -108650, -132801, -139590, 3850, -37468, -106215, -48558, -8554, 54516, 175382, 206635, 242297, 161348, 90095, 69239, 58400, 7700, -64384, -55913, -111639, -224674, -273287, -158954, -212321, -63869, 6420, 78092, 75697, 201114, 227202, 123674]
15348A23674q8570L160R3720j06319P086P2188p4847N7625N1491j31736j00748
15337i3276q0922K8790J02091O3890K3189N9140p1309j45191j3787P0776N2879
15326c730j5944r5257K51963P6958p0875j30734j3328M2868M9896N6910k1701
15315A27026K1484j3600m3354m3826k02657R9873J18583J10186L2002k46501l11795
15304c52579j53905P8302J22137n3851Q5349m290J61588P0586k45741j4281J71807
15293a34878J03289K7289o1612j6673l7036J05812O8409j19806o6543n6312k17280
15282d05341j63935R6284R0860Q5090Q9828Q0266J60535P5981M6631M2676Q5049
15271B83924p3357O8412j15250k13627o164l1531K7538M7132l5698q1645K6736
$$ y = [123674, 35104, 38264, 131984, 25665, 32751, 104939, 30092, 87717, 139208, 7472, -93276, -174198, -145408, -43317, 20573, 43762, 102902, 31593, -113598, -127385, -56609, -3730, -19674, -114931, 137032, 213990, 143115, 12381, -947, 41921, 91817, 148727, 127026, 148510, 134910, 91556, 47730, -154927, -55054, 63529, 173715, 205717, -40784, -352579, -506484, -428182, -306045, -359896, -274547, -278837, -117249, -46663, -292404, -306685, -134878, -31589, -4300, -65912, -82585, -119621, -13809, 54600, -65206, -131749, -188061, -405341, -569276, -472992, -382132, -297042, -207214, -126948, 33587, 109568, 156199, 198875, 283924, 210567, 278979, 163729, -49898, -56062, -87593, -60055, -12923, -48621, -130266, -103530]
15260a03530R0313m2924r5980q0711L9879O0P1899O422Q3623P4642Q2467J4566
15248A40726j38222O5395n3174O166J58601K1775J00586r9627n0639j5077o6558
15237F9952n1838O7654k62365O6092L5708P4475Q5449M6289q1195r948K9934K1724
15225I1931J7132r9481j9391O2755J15166o9772n7965L2034J01806J10292j49579
15214A34928j32271R715J39052M4187k57855j49921m2270r4701J1161R3283Q6229
15203a58463l8935k6340m9300J04375L6987r2843R6026l1417j9238J34603K7273
15192a7272R3799p400N5332p9759J22930p9983k07224O959J0672j03896L2376
15181a73466r1532N9662P862j2501M3459q0432R4642J42418J64864j79121r2485
$$ y = [-103530, -13217, -56141, -152121, -232832, -192953, -192893, -120994, -114572, -30949, 43693, 126160, 140726, 2504, 67899, 14725, 20891, 179492, 201267, 301853, 202226, 151587, 136510, 69952, 18114, 85768, -176597, -110505, -74797, -322, 85127, 131416, 50221, 40273, 70207, 91931, 109063, 9582, -9809, 52946, 168112, 98340, 40375, 72409, 174215, 284507, 134928, 2657, 12372, 151424, 195611, -62244, -212165, -254435, -349136, -337975, -244692, -158463, -197398, -223738, -273038, -168663, -131676, -224519, -128493, -159910, -179148, -44545, -17272, 76527, 69127, 124459, 44700, 167630, 87647, -119577, -112618, -101946, -205842, -173466, -264998, -205336, -197474, -209975, -166516, -246948, -152306, -9888, 154976, -24145, -116630]
15170a16630n822l0871Q0576J58398P8383l8491j8907J07696m1320o7544J3210
15159A18678N8616l8298j69402j73968j4317j4962m866J85999J79036q5967n8643
15148a8094k16509L7345J02950J68681m8292j83934j27788O6861K7265J00822
15138i0693M3748J975k3230L5762p2173Q5267Q3102q917Q262m8894M7260p7874
15126a6405K642J34634K1748N6969O6635N6320n9702m8255M8625n7808j10204
15115I5199L6528K4639j63472j551j7906q7073O3783J5621J00107P1543j9924
15104A17494J16546Q386k28412q2317K9953Q8608J62894O2099j51806k44560j35564
15093b56679K57099K21216p4016j27093K22205o3951j66104J47701K0929r4844
$$ y = [-116630, -122452, -153323, -72747, 85651, 164034, 125543, 106636, 214332, 173012, 105468, 118678, 177294, 138996, -30406, -204374, -218691, -233653, -238519, -52520, 126516, 40549, -18094, -234603, -197258, -94308, 74373, 26081, -157853, -285641, -218780, -191515, -90693, -46945, -44970, -68200, -32438, -104611, -19344, 63758, 54841, 63103, 14209, 61469, -16405, -13763, 120871, 142619, 199588, 266223, 322543, 262841, 214586, 263211, 205403, 95199, 131727, 156366, -7106, -8657, -26563, -113636, -49853, -34232, 65875, 137418, 117494, 234040, 242426, 14014, -68303, -38350, 50258, 213152, 275251, 123445, -121115, -256679, 420, 221636, 147620, 20527, 242732, 178781, 12677, 160378, 181307, 86463]
15083H6463J0529j1959j42883J9335j8117k924m8857m6559n2042K1763R9412L5948
15071d9891j54691k4455M6906q9913J57464K5086k8038K4409J53073r9287p016
15060d6353j6468J53355j772j77265l7673N2241R0194J19999J13119j1732k9229
15049B08416j65005o7263J28783K8599M9186L7391o2126n1645k05945j79625j24074
15038d03308J32555K78091j33949r6546J87724N1896K6156M2112J57907l7037
15028B05601p4081j91435J4811J73290k8895k33007Q4401J78555J1699l1676N4793
15017A64056M6545n3462p0550r777j37397n410J36791L3140r941J6172r4530j90244
15005a74607j6408J30501l7844q1983p9833R9036P9337O4861N0815j31792r4065
$$ y = [86463, 96992, 85033, -57850, -38515, -56632, -59556, -108413, -154972, -207014, -185251, -85839, -49891, -204582, -229037, -182131, -272044, -114580, -89494, -117532, -93123, 59950, -39337, -46353, -62821, 90534, 88762, -88503, -126176, -73935, 16259, 136258, 249377, 237645, 208416, 43411, -23852, 104931, 133530, 182716, 220107, 157981, 106336, -99609, -279234, -403308, -270753, 7338, -126611, -223157, -35433, 16463, 42619, 84731, 242638, 205601, 131520, -59915, -45104, 128186, 99291, -133716, -49315, 129240, 140939, 109263, 164056, 210601, 157139, 86589, 76812, -60585, -65995, 70796, 103936, 93995, 110167, 15637, -174607, -191015, -60514, -98358, -180341, -260174, -161138, -81801, -16940, 33875, -97917, -191982]
14994a91982N1981j18438K0702N8041J28486L8025j46655J16634J95580K7838
14984A80212j4150J3782o7634K8006J34760j80358r87q3554J1420r9134n636Q0282
14972b991j9440J8151Q2570p4627j52043J9545k3481Q1851j7552L8649J37748
14961H8380o8254l6319j45022P8281J28921J34039q6699k70881J17152N4318k26556
14950b32640k2216J88131K2392o4962q7576L499O6753J25859J86893j58914l08491
14939b81272p6646J30859J08048J08533J02181R044j05718N3261J5258J06399
14929A69947J3223j78963k60155q6050R0988J30681q894L4362k9290r8099J53931
14918f8319J36925L251q2695j06552n4497j98738o582J40550L00928L1970j02494
$$ y = [-191982, -140001, -258439, -237737, -179696, -51210, -13185, -159840, -43206, 152374, 180212, 166062, 179844, 112210, 140216, 274976, 94618, 93631, 10077, 21497, -77637, -83273, -2991, -22431, -4280, 78290, 3663, -148380, -128835, -152316, -70465, -88017, -49368, 88380, 20126, -16193, -161215, -82934, 45987, 180026, 93327, -177554, -60402, -6084, -232640, -254856, -66725, -44333, -109295, -196871, -193372, -126619, -760, 186133, 27219, -281272, -357918, -227059, -119011, -10478, 91703, 100747, -4971, 48290, 63548, 169947, 183170, 4207, -255948, -341998, -251010, -120329, -129223, -94861, -124151, -222250, -68319, 68606, 71857, -10838, -117390, -171887, -370625, -377207, -236657, 64271, 96241, -6253]
14907f253m0798P8915k70980M8343K25962R6601J46789q2117q3777n8405q4323
14896c0043k98026j41518P478J18485K35441J26687j62990m325J53197j9010k029
14885a6653Q4704l8151l0219R7811N2427L0652r6222k03363L0147N1616P9317
14874D2066j3376o7413p4842K66722l6522j15265m1812J59954M9114J9110Q9122
14863B76858K33869k7124k28350k71576j07672m3202P0555n9702n7531l6963J34007
14852a16831J68824M102k1649q5321K10853k346l5199k997M0811j01408M7030
14841A05869N0296J04282J6073J7426j06052m6248j18186j53153j40085K538J09530
14830a57710r5021N5141o4541N6970P0009O9733J1479Q7624j36650j357Q6085
$$ y = [-6253, -47051, 31864, -239116, -190773, 35189, 131790, 278579, 196462, 112685, 54280, -30043, -328069, -469587, -462109, -343624, -108183, 18504, -144486, -148811, 4386, -14624, -16653, 68051, 29900, -319, 97492, 149919, 180571, 84349, -119014, -88867, -37251, 42066, 28690, -38723, -113565, 153157, 116635, 1370, -40442, 119512, 168626, 187736, 276858, 510727, 483603, 255253, -16323, -123995, -167197, -96642, -156344, -213875, -250838, -116831, 51993, 56095, 34446, -50875, 159978, 157632, 122433, 119436, 160247, 58839, 105869, 156165, 260447, 276520, 293946, 187894, 141646, 23460, -129693, -269778, -267240, -157710, -252731, -197590, -262131, -205161, -135152, -65419, -53940, 33684, -102966, -104323, -18238]
14819a8238Q945N7073j6352o1581J8148M9929J379j40932J61J27897J8581j40030
14807i5020J3038J26007n7057p2313P3859N2521K7406j2679J39110J06276Q6619
14796C87767N088n2322N2813P1969j08135k65344n4694J4478j8430K6189j39171
14785g9792n8206J39698R7201N6867q7974p0354m4431N140j29441M3060K19240
14774I1008K4506p6214r310N1948j10488j16739J7120M8483n8152K8474J28267
14763A8903J00799R434J03517R6096P4175j02038j63701K4125p4129j05246J0844
14752g221J09216J2118j78914k8662K9167k74380K3199K33784J50135j21398j67145
14741b20101K37894q0058o8127r488O0406J24062j48139J93J54944K5075R875
$$ y = [-18238, -9293, 47780, 31428, -30153, -12005, 37924, 39303, -101629, -101468, 26429, 45010, -95020, -81982, 44025, -13032, -85345, -11486, 41035, 68441, 55762, 194872, 301148, 387767, 392855, 340533, 393346, 465315, 357180, 91836, 37142, 51620, 33190, 59379, -79792, -137998, 1700, 98901, 155768, 67794, -2560, -46991, -41851, -171292, -128232, 91008, 115514, 39300, 29990, 81938, -28550, -145289, -128169, -79686, -137838, -109364, 18903, 119702, 129136, 232653, 328749, 402924, 300886, 137185, 161310, 87181, -18065, -7221, 101995, 114113, -64801, -93463, -64296, -338676, -315477, -81693, 68442, -52956, -220101, 17793, -62265, -130392, -139880, -79474, 44588, -103551, -103358, 51586, 76661, 86536]
14730H6536j4036j10524o8787J24112O6845M3128p6288J7156m2798n4256j1829
14719d0741q3530O1367N70K4924r9337N4285J7038j16185M2548P6327K0375J14682
14707G2323n7551N5968l5611j25480l2762o0246K17305K01058J9663j61862p4514
14696A8291o1553J57237O0426J0345J25090q8718r2428j408l3906l7055p0199
14685a3878j13916j37240J1267N1978K5533P3873M3532R2443k5049P2313J09004
14674A89860j07683j02379m3924N9009j15465R0174J4116p4468j433J8972j0452
14663h3673M2594m7028Q5435r6754l4062l2302n819J2779L5628L8091j7634J58334
14651E5589p5428m7546O9385J08460J4591q2370m2800L6441K729r1728R2371N2776
$$ y = [86536, 72500, -38024, -106811, 17301, 84146, 127274, 50986, 68142, 25344, -28912, -40741, -124271, -62904, -62334, -37410, -136747, -82462, -65424, -181609, -139061, -62734, -42359, 72323, 14772, 70740, 35129, -90351, -123113, -183359, 33946, 235004, 254667, 92805, 18291, -43262, 113975, 174401, 184746, 309836, 221118, 128690, 127282, 93376, 56321, -13878, -127794, -265034, -253767, -201789, -176256, -102383, -58851, 33592, 8543, 80856, 189860, 82177, -20202, -64126, -5117, -120582, -30408, -16292, -90760, -92193, -73221, -83673, -41079, -88107, -2672, -99426, -133488, -165790, -171609, -158830, -123202, -85111, -102745, 55589, -19839, -67385, 2000, 110460, 125051, 42681, -119, 36322, 39051, -52677, 39694, 92470]
14639I2470Q5302J19740J28114O2026k18178k34978q69j9920J43940J5968j49848
14628B3767J5620j33525l6162R2754P8074J12932R5648J7281k8018k18860p1223
14617e1712J27384n7115J29326Q0398p7371p0319K3480L2688k8078p6457j05902
14606g3678J25695o1680K855n2909n8490m7082J19007J03369k25072j53832m747
14595c26564M408r9613l6960J22459L5858J49190J04275m8109N8431m1089j17442
14584a95156K3445K8414Q8374Q8410M2002j47038J47048N9764m9899J04850m7540
14573A42674k36182j02427J018N9537J6860M0123r484J2578O0261M1608m7633
14562b1067l9679J45888M6325o5035m1278L2842o2064k7291R9569K0271n7040
$$ y = [92470, 177772, 297512, 425626, 487652, 269474, 34496, 33627, 13707, 157647, 173615, 23767, 39387, -94138, -130300, -37546, 40528, 153460, 249108, 266389, 238371, 19511, -51712, 75672, 18557, 147883, 228281, 150910, 80591, 104071, 136759, 108681, 32224, -73678, 52017, -9663, -6808, -59717, -118207, -165289, -46282, 57087, -167985, -321817, -326564, -322156, -421769, -458729, -336270, -300412, -151222, -46947, -95056, -36625, -77714, -195156, -171711, -143297, -54923, 33487, 75489, -71549, 75499, 135263, 85364, 190214, 142674, -93508, -195935, -194917, -135380, -118520, -78397, -87881, -75303, -15042, 26566, -21067, -60746, 85142, 131467, 66432, 25154, 57996, -4068, -31359, 68210, 88481, 31441]
14551C1441r8293l830J97856J14636j91586j38411J30504N1609m2819n1326j50615
14540a50834j03028J57945J12834N0628o4574l8328P400j82839m5246J19035m2266
14529a79273k0269J14260j29819N1891K56552m4577j76500K01495J29194j88372
14519A4582j46591j02132J76044N6945j26441J42661k2448q5440O0531K8094N0781
14508D6586M5814N9937m7033K1286N0852J08569Q7203k44876m4437k14304j23764
14497b54167l3058J39706P140J38837P6273r5290Q0403J11654M47j04929k24949
14486a57933o2481P2136K13488l4408k574n9660n4412N0264n5387P4875L0461
14475A4369m9821p8760J5268J37404o0091N5077J2204k5215j02689k3440m1657
$$ y = [31441, -66852, -70682, 127174, 241810, 50224, -88187, 42317, 93926, 51107, -219, -150834, -253862, -95917, 16917, 67545, 2971, -35357, -27957, -210796, -256042, -137007, -179273, -199542, -85282, -215101, -163210, 93342, 48765, -127735, 73760, 202954, 14582, -132009, -234141, -58097, -1152, -127593, 15068, -7380, -92820, -32289, -4195, 46586, 92400, 152337, 105304, 126590, 177442, 286011, 373214, 128338, 83901, -130403, -254167, -287225, -147519, -140379, -1542, 74731, -20559, 59844, 171498, 171945, 67016, -157933, -220414, -148278, 65210, 30802, 28228, -31432, -85844, -35580, -90967, -16092, 14369, -35452, -114212, -98944, 38460, -21631, 33446, 45650, 20435, -82254, -105694, -147351]
14464a47351m0767J35267p2384n8238J07386P3490O2517J27462J03999o9843o6114
14453A55424k6281l3906j27117K9494q0334r6869k8453J48677R8369O568j06140
14442f0568r0359J35270J72443o2002j39862j58700M2610Q5867J9113l9338q5259
14431a80785J67108J21031L7675j7537j36423k24292l1308J37555M3636J73376
14421I0036j15263k48287N8292L9280J92482K4557j29997J55803n412m2824j03231
14410h4564J2120j7471k0141J00008J03528J6718m6148O8076P4805o0865N5290
14399B01356j57902j51079j03834P7500J13306L825j191R7248M3309m246j15202
14388C090n6512M9118n6890M2545R1679j35588j03832q8208m7678Q2832J05489
$$ y = [-147351, -188118, -52851, -125235, -183473, -76087, -2597, 59920, 187382, 291381, 221538, 155424, 129143, 95237, -31880, -2386, -82720, -179589, -208042, -59365, 39004, 45572, -60568, -150927, -15657, 156786, 94784, -45078, -203778, -161168, -75301, -56188, -95526, -180785, -13677, 107354, 145029, 127492, -8931, -233223, -264531, -126976, -83340, 90036, -25227, -273514, -215222, -175942, 16540, 41097, -88900, 66903, 61491, 18667, -84564, -72444, -89915, -110056, -10048, 93480, 110198, 64050, 132126, 206931, 146066, 201356, 43454, -107625, -211459, -133959, -20653, -16828, -18019, 79229, 122538, 118292, 3090, -53422, -4304, -61194, -18649, 73030, -62558, -166390, -254598, -302276, -219444, -113955]
14377a13955N2670r5963J37858J46170r690J13542o1439j84271j25670n0838Q2006
14366a09580J02201P434j35457j752J13274q5294L1536k9643Q5214j8395J52753
14355A12291J48222m0341j14301r6809j58105J05635J68547o6502j27726Q7533
14345A8444J67520M478l4996P7621P5458k01943p1595O7358P3146m6296m0713
14334H8482j87757j05562k3624K8087n73J04089M6461p9348P0435R4025L483N2033
14322I0231k01056P7716k0460R7353n9536p9652j3590l5571L896k5601q4842n8804
14310c09916M8791Q4758K9381J9646K60427m9513k91581R0399K27251J39771r0448
14299A58966j75458K5158J4616O2061o1824k39283k9892J06399r0801L5480J91652
$$ y = [-113955, -61285, -157248, -19390, 126780, 117090, 230632, 169193, -15078, -140748, -191586, -109580, -7379, 55, -135402, -137154, -23880, -109174, -77638, -107281, -22067, -40462, 112291, 260513, 220172, 105871, 9062, -149043, -43408, 125139, 58637, -69089, 18444, 185964, 190442, 155446, 233067, 308525, 106582, 34987, 102345, 175491, 129195, 88482, -99275, -204837, -228461, -200374, -200947, -96858, -50397, -129745, -59310, 34715, 38198, 90231, -110825, -33109, -53569, 43784, -15752, -95404, -108994, -144565, -140669, -166270, -251112, -309916, -261125, -176367, -146986, -127340, 133087, 83574, -208007, -117608, 109643, 249414, 158966, -16492, 8666, 23282, 85343, 23519, -215764, -245656, -139257, -230058, -194578, -2926]
14288b926J23945j23543m7031J29279j15612k04881l7602J8009Q4151J78636q48
14277A577N5302k7191p0285o262m4682Q0236J28836Q6780K0480j68660j75966
14266a19835p4547j8653Q8387Q432J31235J72930p9169q2949r4075P4637O9023
14255G5416J00851M8331j03844l983j09717q9915K5044J65349p0078j04417j2036
14244g8999J10012K04934K21162j2365n3019j33698m9016o5424j62830q5641J03909
14233i75M7469j35497n0941J72156L3582K2957j515q0859k0057J2658j08253L4107
14221g5168J02707j6881m7129R226p5091M3286j98229j55504n1464L9453J27636
14210b97158J82379k4361J52545j05906j16611Q7057J97921j42916j65117q2544
$$ y = [-2926, 121019, -2524, -49555, 79724, -35888, -240769, -278371, -260362, -176211, 2425, 1577, 56879, 29688, -40597, -46859, -91541, -11305, 117531, 204311, 224791, 56131, -119835, -194382, -213035, -124648, -116216, 15019, 187949, 108780, 25831, -68244, 6393, 75416, 176267, 224598, 120754, 116771, 7054, -82861, -57817, 107532, 37454, -66963, -78999, 31013, 235947, 457109, 444744, 391725, 258027, 209011, 143587, -19243, -104884, -975, 46494, -89003, -139944, 32212, 65794, 88751, 87236, 6377, -13680, -1022, -109275, -75168, 27539, 10658, -36471, -27245, -102336, -59050, -257279, -412783, -464247, -424794, -297158, -114779, -139140, 13405, -92501, -209112, -122055, 75866, -67050, -232167, -314711]
14200c14711o994J1049J4691J49857O7501J14398N3399K2245J5418j2081J10233
14189B25005J3199j36529k48502L1219M2552k5978J26319J77895r8252J86512
14179B93440j48019k24672Q548k7462N9906O9163J02208j18696j24356k1603J31549
14168Fj47805j92130K9284J60878j43481k73289q786J65861J65062Q3965J03464
14157e6971l705m1391K1127M5101J31080K87o8574J03887N3244m2599o6963R8799
14145A73322p3620k9883L6960q5541P1837r495l1269l4772k1008k0355p4363J0854
14133h7333j13290J13554R3788j5793k9508j0025M9991l9221K2240L8743k0084
14122C062j1163M3047j5371r3284p5967K5666n650J50285p179O7305J41644o5238
$$ y = [-314711, -321705, -310656, -295965, -146108, -78607, 35791, 89190, 111435, 126853, 114772, 225005, 238204, 101675, -146827, -115608, -73056, -99034, 27285, 205180, 106928, 293440, 145421, -79251, -70703, -98165, -38259, 30904, 133112, 14416, -109940, -131543, 6, -147799, -339929, -310645, -149767, -293248, -566537, -575323, -409462, -244400, -160435, -56971, -60676, -102067, -80940, -35839, 95241, 95528, 26954, 130841, 184085, 141486, 74523, 173322, 99702, 69819, 106779, 21238, 93075, 83580, 52311, 17539, -3469, -23824, -98187, -87333, -200623, -87069, 6719, -9074, -38582, -48607, 1384, -37837, -15597, 23146, 3062, -8101, 34946, 19575, -73709, -149676, -124010, -129660, 20625, 13446, 80751, 222395, 157157]
14110A57157n8389j4275L2975L575J22378N59j70002j38660J01473n595K3452
14099E4648n6707j13926m7711R7295L666J7905l3904r0995P7627K6073M1443P4987
14087E0401M5755J12383P9158l5969K1035n2036J7532j91105k35891p4658J61624
14076a01771m5469O7721J31231j0163p0844M6893j22706j84880M6815R4077K15359
14065F6263O7301r5637K7019k999j06775j37702J16073l8886l8251j2452m0991
14054a97037K78039O2379j40562j20907Q4723L4028q3319m5530J33076K36223
14044B41113L7384r7084j47027Q619R537Q940K279m7849j7820J97815p4347j49315
14032b7755o2357K612P121n7207L8418O8063p1188o6892N1773o9945o6871J01544
$$ y = [157157, 98768, 84493, 117468, 121043, 243421, 243980, 73978, -64682, 36791, 31196, 54648, -2059, -115985, -163696, -66401, -62735, -44830, -78734, -169729, -92102, -66029, -24586, 50401, 96156, 208539, 287697, 251728, 272763, 220727, 238259, 47154, -188737, -263395, -101771, -147240, -79519, 51712, 41549, -29295, 17598, -105108, -289988, -243173, -149096, 66263, 133564, 37927, 64946, 61947, -44828, -182530, -66457, -105343, -143594, -156046, -197037, 81002, 143381, 2819, -118088, -33365, 663, -82656, -128186, 4890, 241113, 278497, 181413, 34386, 43005, 52542, 61482, 63761, 15912, -1908, 195907, 121560, -27755, -90112, -87500, -80379, -137586, -99168, -31105, -102293, -169185, -117412, -187357, -254228, -152684]
14020a52684K2191L6932Q8001J0203j23502k2423K37647J12475q4137j12933k06022
14009a94252j00177L8185J56476J48861R3868j32220k1586K59980M912k47832
13999F215N4539J42990r2289k9587j19612J0350P7430q9671k3574R3357J64351
13988A94499j58446j19713M1285m5090l9070J5408r1024N0149J8798q1025O7025
13977a47204L6286r3724K3513J63453j18242p9284P0726K48706L0613o8583j39276
13966g3016N6879M0693P9123j0676O8278O7824q3726j95476j98028L0322J29970
13955h7833n3315P3471J07994j34392Q322m7354j67759R3755J15054M1546M1935
13944h576P7430M7743k8665n7298r1387K1696M7655j06973M8068m7551p8886R4620
$$ y = [-152684, -130493, -93561, -5560, 4643, -118859, -141282, 96365, 208840, 124703, 11770, -194252, -294429, -256244, -99768, 49093, 142961, 10741, -10845, 249135, 254047, 6215, 60754, 203744, 111455, 81868, -37744, -27394, 50036, -39635, -63209, 30148, 194499, 36053, -83660, -42375, -87465, -126535, -111127, -202151, -152002, -133204, -214229, -147204, -110918, -204642, -181129, -17676, -135918, -215202, -144476, 104230, 134843, 66260, -73016, -16137, 24556, 103679, 93003, 161281, 229105, 145379, -50097, -248125, -217803, -87833, -141148, -67677, 40317, -94075, -85753, -133107, -300866, -207111, -92057, -50511, -8576, 68854, 116597, 87932, 30634, -60753, -39057, 8598, -98375, -50307, -97858, -176744, -82124]
13932h2124J50547J67946j71647k95396J33801k7597P4037O6041R3401P0248j11982
13921F7275Q5813J30100r3067j77648n2221o0225r0709J50406N3815j50268J22723
13910a4006J75963J31062l2607j46846l19931o5064Q9150k8303J18407q8933J02455
13899g8653Q8546J12471Q8640J26746N2631j96310j74923J8583J42249J17514
13889B97494O0663Q2j48973j45806O2734n55j84840j7446L100M796R234J17238
13877E7721L9208k62076k34260r9395l0250K05030J25999J71884K1187L6444j66319
13866a34827j66023o3331k8033O0146J39612m0345J95374J53263r780n208j76128
13855g5280l3158R3525K52524J2859j43260j11299l4357K29013N6563m5592p0692
$$ y = [-82124, 68423, 236369, 64722, -230674, -96873, -124470, -50433, 15608, 109009, 179257, 67275, 153088, 283188, 190121, 12473, -39748, -99973, -190682, -40276, 13539, -136729, -14006, 161957, 293019, 260412, 113566, -206365, -271429, -182279, -210582, -92175, -181108, -78653, 9893, 122364, 211004, 337750, 390381, 194071, 19148, 37731, 179980, 297494, 358157, 358239, 209266, 63460, 126194, 125639, -59201, -76647, -73547, -68751, -59517, 57721, 96929, -165147, -399407, -498802, -529052, -324022, -198023, -26139, -4952, 31492, -134827, -300850, -364181, -392214, -332068, -192456, -232801, -37427, 115836, 106056, 100848, -75280, -108438, -14913, 237611, 250470, 107210, -4089, -38446, 190567, 247130, 201538, 130846]
13844A30846j69111r2473K311R0657Q2068N6299r9981J07098N8596o2842P1248
13833A74716J31349j71431k82498L749n3634o4493p9250O5594J8790J46075q238
13822a19271l0948M3378O9479J20574p9108j7488O8173m7362l1081j3140J4501
13811b2293l7m0506K3859n8295L5706M9914j08527M4752N9698J41347O9095K6044
13799B20757p4609j80912L1058k8076l6165l6694j45638p2983J61742O809N8242
13788i6469J36325J47234o8312j44502K5345q2981o2706J80296K7244l0623N9265
13777I0116Q491r3176o8379J54N1244j12995n7542O7547p0819M9397M2518o8726
13765a62170l6800J844J62466M9575j10118j70109J25107M8617J9528J2453K9328
$$ y = [130846, -38265, -130738, -128427, -37770, 44298, 100597, 616, 107714, 166310, 103468, 174716, 306065, 134634, -147864, -144115, -197749, -262242, -341492, -275898, -257108, -111033, -119271, -150219, -106841, -37362, 83212, 4104, -13384, 54789, 7427, -23654, -36794, -22293, -22330, -62836, -38977, -97272, -61566, -11652, -120179, -75427, -15729, 125618, 194713, 220757, 146148, -34764, -3706, -31782, -67947, -104641, -250279, -323262, -161520, -154711, -96469, 39856, 187090, 118778, -25724, -379, -83360, -146066, 34230, 61474, 30851, 90116, 98607, 5431, -62948, -62794, -11550, -124545, -182087, -114540, -185359, -135962, -93444, -162170, -198970, -197126, -34660, 14915, -95203, -265312, -140205, -91588, -72060, -59607, -30279]
13754c0279N5901M7388j58615j24538j92537m5334K96297J49512J94347J3242
13744B05384o1029k48253J9155J72240j42424j36842J1258O8433K7000K1398o2934
13733a26614k6193k5429q6706J39030J42283j29236q0150N7763J04189n2870R2096
13722H163J47375l8016j10887Q681l5228J68930J6869l8608j15491j28234K0499
13711i5947J02426J6641J27833j50482k8622j9722M1654K5497J46297o6297m6495
13700E2783k83519r9039J24841O8940r7165O4673J30274J24317q6014j54415N6431
13689i7893q2847K413J41963j31206l9373R145L8647M3057J06529n3384j37996
13678b00945r3510K4240P0444J03272P3059J1741l6161o2716j64757R2111L1509
$$ y = [-30279, 25622, 73010, -85605, -210143, -402680, -448014, -151717, -2205, 192142, 205384, 144355, -103898, -84743, 87497, -54927, -191769, -180511, -112078, -85078, -63680, -126614, -152807, -178236, -264942, -125912, 16371, -112865, -193015, -135252, -31063, -83933, 8163, 155538, 117522, 6635, 15316, -19912, 149018, 165887, 127279, 11788, -116446, -95947, 6479, 23120, 150953, 471, -28151, -47873, -6219, 19278, 165575, 99278, 52783, -230736, -329775, -204934, -135994, -233159, -168486, -38212, 86105, 91, -154324, -97893, -180740, -178327, -36364, -167570, -206943, -197798, -159151, -116094, -9565, -62949, -200945, -294455, -270215, -199771, -96499, -23440, -11699, -47860, -110576, -275333, -183222, -151713]
13667a51713j6842j40744j1069J94050K06748K9716J7239m6940Q7037R182j17994
13656E8670j69217n8925J10594N8829J5074j3144j06339J8428j14988J44997L8839
13645a7182P610N4105j22235R2110J69902j33539p538R8626k59558P0443K39237
13634A91981J43399J2732j84379L0403j01800l9899j04382q7470J16093J08932
13624H5610O23q5802o0807R3472J73850o5826k2329K62598j22138j14016j10145
13613C5090P9971R7234j42366j54068j3607K31792Q281q0946J699L4857K3501
13602A21438n5108j82887q8259Q6833J30403J4277p6456R2254r9804J22704o8976
13591c581o6734O0495j11082j57528O5436J45355M9892j1929k00355M7229Q1071
$$ y = [-151713, -168555, -309299, -320368, -126318, 80430, 110146, 127385, 80445, 167482, 176664, 58670, -110547, -169472, -58878, -49, 15025, 1881, -104458, -86030, -201018, -56021, -17182, -9572, 44533, -77702, 14408, 184310, 50771, 43233, 141859, -117699, -47256, 191981, 335380, 348112, 163733, 194136, 92336, 52437, -51945, -139415, -23322, 85610, 86233, 431, -60376, 33096, 206946, 141120, 118791, 381389, 259251, 145235, 35090, 115061, 212295, 69929, -84139, -97746, 134046, 142327, 61381, 63080, 97937, 121438, 66330, -116557, -204816, -117983, 12420, 26697, -49759, 42495, -57309, 65395, -3581, -70315, -9820, -120902, -278430, -212994, -67639, -17747, -29676, -230031, -182802, -101731]
13580a01731J06573p9404j52201q5961j2613J46259K06559M6445R5610k2920j98655
13569e2039p9022J10781o095J5417o9014n702p9079J15944J35681p6314L7004
13558D7562R8635j01029o2491L4397J8229j20869k85833j36832K57710J48938
13548a01583l6848k0238R5838R775M5702K9361n3882J8109m317K9396j9039k5646
13536c3372j07589m1429J29002K52293r7349j18403l9942N7353P5332J09207J47093
13525C32196r9720p9296p607j97844N377j36235J4766N9216J23135r4615n579
13514h6206K3895l7776P2224Q4982N105J41222o1551m3281J02352P8332j63456
13503A15842N9761J88683j10794j23290O3894j6356r7453l8738n355l4438O3545
$$ y = [-101731, 4842, -74562, -226763, -312724, -325337, -179078, 27481, 73926, 169536, 146616, -52039, -131061, -20280, -26375, -10958, -79972, -85674, -164753, -48809, 86872, 10558, 47562, 146197, 45168, -17323, 17074, 35303, -85566, -371399, -508231, -250521, -101583, -138431, -158669, -62831, -53056, -7354, 22007, -31875, -13766, -18083, 11313, -7726, -33372, -140961, -182390, -53388, 198905, 101556, -16847, -56789, 564, 75896, 185103, 332196, 232476, 153180, 145573, -52271, -46894, -183129, -168363, -109147, 13988, -80627, -86206, -62311, -100087, -27863, 57119, 62224, 203446, 141895, 98614, 200966, 279298, 115842, 175603, 364286, 253492, 130202, 194096, 177740, 80287, 41549, 36194, 1756, 65301]
13492F5301o7555K3969L7052j10386j30647l2947N0261m0184n0421L1999J67877
13481e5681J02342Q3712J833k2267j23498p6161N4036Q0647j54563l8375K92496
13470A44521J19082j05141j02366j07325j93849Q5344J87435l4916n3716J8495
13460d2436O3221p873J30490r3202o2703J03921N9091j0375j09146j35440j20159
13449b24611K4665P4460L5825J17095J15644j12857m559j5951o3338P0676M4963
13438F2012J9370L2522L1749R7689Q0708j06131k0766j31085j39068j32850J45762
13427f0088J28661m7779P2669J86318K1236k02339n7130p8435j2535N3782l2452
13416b8092K7636J38662J4095J88306k3772j67748k34529M3726K1942J00888j29331
$$ y = [65301, -2254, 21715, 58767, -51619, -182266, -215213, -164952, -205136, -255557, -223558, -55681, 46661, 130373, 132206, 109939, -13559, -89720, -35684, 44963, -109600, -147975, 144521, 263603, 158462, 56096, -51229, -245078, -159734, 27701, -7215, -60931, -42436, 20785, 12912, 143402, 50200, -12503, 91418, 150509, 140134, 30988, -104452, -224611, -199946, -125486, -89661, 27434, 143078, 30221, 25662, 9711, -53627, 17049, 62012, 81382, 113904, 145653, 243342, 324050, 217919, 197153, 66068, -73000, -205850, -60088, 68573, 20794, 93463, 279781, 301017, 98678, 41548, -36887, -49422, 4360, -28092, -456, 138206, 152301, 340607, 316835, 149087, -85442, -41716, -19774, 81114, -48217]
13405d8217k92115J53090K69148J46814P9255n5631l3736k33499q4240o9435J41952
13394b6614J05113j28413p7684J67418r001j01263n390J7793k4855k432J35507
13383E0179K8656j21817J4813m2492m1049l124J28256J28724j37364M959k3383
13372a3642J4084m2565m6279p825m6110J68871J51711r5553q6824L8527k10885
13361a76490J42120K41540j9449J18510K549j19341p018Q8907n8931j33591l5750
13350D3056r3818J01778J31090P4038j16601j38311N5739j95312l74398l9618
13340e52357K75983L77867L08892J50445k4872j58040k45167r5764K5338Q7834
13330A50159Q4370J14495n7770n3505l4431k5688j38286j96251K0609J02125O8697
$$ y = [-48217, -340332, -187242, 81906, 228720, 307975, 252344, 218608, -14891, -99131, -168566, -26614, 78499, -49914, -127598, 39820, 30819, -70444, -75834, -58041, -82896, -85328, 50179, 78835, -42982, -28169, -70661, -111710, -114834, 13422, 142146, 4782, 9741, -13642, 442, -42123, -88402, -96227, -142337, 26534, 178245, 82692, -4132, 34395, -176490, -34370, 207170, 187721, 306231, 308780, 189439, 182421, 271328, 212397, 78806, 43056, -50762, 51016, 182106, 256144, 139543, 1232, 56971, -138341, -512739, -552357, -276374, 101493, 410385, 560830, 535958, 377918, 132751, 36987, 62325, 150159, 234529, 349024, 291254, 237749, 203318, 177630, 39344, -156907, -136298, -34173, 34524]
13319C4524K06497O0827j74612k09594N5213J03580M1954J31358N7616k21343
13309H6020J291o4511p8835N7550Q6639Q56J769j1957J361l4077j46342q6551
13297a86787J89570Q3781Q7916J4639n7339l3977j6405l8393j01227K84498p0892
13286A55384r2651K9276N7857j9391l6563k2528l2149Q4812P5565P1656Q1496
13275C52764p4415J2176R8131j0463l6955j01821r7013r1179l3019J15408L7713
13264A71327O059R8532J7188J4802J67885j02790M9817j37188j10122N6040p1950
13253A59600j02100R4314R9829j07046o7619Q5097K2376J08163j08329J13J07099
13242B91497m9699p4814o3420j00302j09319Q0180J18174J82255k3740j31667
$$ y = [34524, 241021, 301848, 127236, -82358, -27145, 76435, 118389, 249747, 307363, 86020, 87311, 22800, -56035, 1515, 88154, 89010, 90779, 78822, 80183, 46106, -100236, -186787, 2783, 86564, 174480, 189119, 131780, 97803, 81398, 43005, -58222, 226276, 155384, 62733, 92009, 149866, 130475, 93912, 71384, 39235, 124047, 199612, 271268, 352764, 278349, 290525, 388656, 378193, 341238, 239417, 142404, 51225, 18206, 133614, 171327, 177386, 275918, 293106, 307908, 475793, 373003, 422820, 285632, 175510, 231550, 159600, 57500, 151814, 251643, 144597, 76978, 162075, 184451, 292614, 184285, 184398, 291497, 241798, 166984, 103564, 3262, -106057, -25877, 92297, 274552, 250812, 119145]
13232A19145J1942k6646j65690J77177J05058Q1084q6768l919J27227J57526j80554
13221C15582j51388Q6380m6502j3102j4547J19558r8346j37941p8741J83918n6014
13210A08857j50435R690R4201J20286K24847j9668k06179k16383J36122J25208
13200B26546Q434j28141k46624O6911J88605l0193m6615n7519Q4535Q9944j92701
13189c6818j27142M4736J19847M2665L6651q2705q7252K27310q6886n9791l5877
13178d5262m1677O3950J39238J30873P9076o0703j35665k31875J4959J58084J25938
13167A96936L3377k0526j26880j00404J11006L1058q8732j90272r1171j8838O4598
13156a99848J84324J17971m6902J6485J4474K9264J22209j44786J8413J90869
$$ y = [119145, 131087, 104441, -61249, 115928, 220986, 302070, 215302, 211383, 338610, 496136, 315582, 164194, 250574, 204072, 190970, 176423, 295981, 197635, 59694, -19047, 164871, 108857, -41578, -31888, 62313, 182599, 407446, 387778, 181599, -34784, 101338, 226546, 234980, 106839, -139785, -72874, 115731, 85538, 38923, -18596, 65939, 155883, -36818, -163960, -119224, 623, 43288, 79939, -2766, -90018, 137292, 50406, -9385, -45262, -86939, -22989, 116249, 247122, 326198, 265495, 129830, -102045, -87086, 70998, 196936, 230313, 209787, 82907, -17497, 93509, 124567, 35835, -154437, -245608, -264446, -199848, -15524, 102447, 55545, 72030, 86504, 115768, 237977, 93191, 111604, 302473]
13146C02473p6845j38598q0209p634L3816p3687k49222j2253K39403Q2459L2758
13135E2461j15815J37608J18195J1377J18907P7517m4425j40933j27293m9679
13125C7920k123j44554l0514Q5204Q759N6874R4417m9773j37306n1334R349L2482
13113i0599m9140j02401J3975M5273O0528K41878N6273j62871j77075o5904J51239
13102g8824Q1595J69652j43136k1219p5628j20375O5324O5128j2749Q2327m6047
13091c3952k1883J36839L0457o4658L1970q2530N9390n7658l7198O3550k9480
13080e153k0082P286J05256M8905j12626j15056j61073M5325R4410j31995j2482
13069b57285K45604P5862K7274j54654j41104R1057R0892J04898L8562k52250
$$ y = [302473, 225628, 87030, 6821, -813, 33003, -40684, -289906, -302159, -62756, 19703, 52461, -63354, 74254, 192449, 203826, 322733, 400250, 355825, 214892, 87599, 37920, 35797, -108757, -139271, -54067, -45308, 11566, 105983, 56210, -81096, -132430, -123081, -90599, -139739, -242140, -228165, -182892, -122364, 119514, 175787, 12916, -164159, -230063, -78824, 2771, 172423, 29287, 8068, -67560, -187935, -122611, -57483, -70232, 12095, -33952, -55835, 81004, 111461, 46803, 78773, -3757, 55633, -2025, -39223, 24327, -5153, -25235, -17949, 87307, 136212, 23586, -91470, -252543, -207218, -112808, -244803, -257285, -11681, 64181, 91455, -63199, -204303, -113246, -22354, 82544, 121106, -131144]
13059a31144r9026J20469O6764m1346m3266K01528J46218J61033k05189n1681
13049A24360m447l6473r9022j08936J00672P6241q2049j49542Q4934n8082J27061
13038b5283J17958q981M8212n1192q309k2108J3098O8m9944K7837j03226j38702
13026b00572J64001J70220K13363k8586j38979k9785j9089l2529J19760j7023
13016B00781l08747m9130N9152O6676m5906O8706J84976j51407j4497K0333o0711
13005b9774J25847K3101o4051j33441j56526n4170M5736K25312P2054j13820m6747
12994a06479M3003P0100J46571j48432o5646k8637R5533M5183r4364L8315K27756
12983B22903J38094l3555J9174p1580O1651J83221R561m8374j1588o8966K00009
$$ y = [-131144, -230170, -109701, -42937, -84283, -127549, 73979, 220197, 381230, 176041, 124360, 119913, 83440, -15582, -124518, -23846, 52395, -29654, -179196, -94262, -152344, -25283, 92675, 83694, 131906, 80714, 72405, 50297, 63395, 63463, 13519, 41356, -61870, -200572, -36571, 133649, 347012, 318426, 179447, 149662, 130573, 98044, 217804, 200781, -107966, -157096, -97944, -31268, -77174, -8468, 176508, 25101, 10604, 30937, -29774, 96073, 119174, 55123, -78318, -234844, -289014, -243278, -17966, 54088, -59732, -106479, -63476, 6624, 153195, 4763, -60883, -89520, 6013, 51196, -43168, -4853, 222903, 360997, 327442, 346616, 275036, 336687, 519908, 529469, 481095, 469507, 400541, 600550]
12972F00550J70238L05267L36044K41674L09848M41530J14405J8086J41467k983
12962B676126r0107p3006k57723m68383l52569k50714l16666j61988j61822p9376
12952D63772n5562M1080p5480J9339L8657J29737K85266j04342k44904k01987
12942B95576j63383j55475J15171N9439O1340N84k9760m3382k5363j7555Q3906
12931A81098j58734q3264r4093q8581r2930J76476J77176j3224l0468O3843o4466
12920b7167N399L6965l4328j04350J25081j10908k6527p2141L6031J2355J1758
12909a47832L16139m4144l1614o298Q4087L1368O9715j34458l7971l0715p3826
12898e549O7995N3940k048j6781J021J75781Q5539r8639M3084j4843q2460m5432
$$ y = [600550, 770788, 1076055, 1412099, 1653773, 1963621, 2405151, 2519556, 2537642, 2679109, 2676126, 2586019, 2513013, 2255290, 1786907, 1434338, 1183624, 866958, 704970, 543148, 463772, 408210, 449290, 373810, 393149, 431806, 561543, 846809, 742467, 497563, 295576, 132193, -23282, 91889, 151328, 212668, 213252, 183492, 140110, 114747, 97192, 181098, 22364, -60900, -154993, -243574, -336504, -160028, 17148, 3924, -26544, 37299, -27167, -21768, 15197, -19131, -123481, 1600, -109308, -135835, -207976, -171945, -159590, -147832, 168307, 124163, 92549, 86251, 170338, 201706, 271421, 136963, 98992, 68277, -5549, 62446, 116386, 114338, 97557, 98578, 274359, 359898, 261259, 304343, 289500, 207040, 161608]
12886A61608L398m159N12M9302R7458J07795j44110k96742o4176M8788K0406R440
12874a0480P0545j8534j03212j43494J04683K20902O3198j06299k59654n5466
12864b37811K12777K5646p3288p8888j9416M5152j62174q5292J81089J11669j2273
12853i2809m008K5484J51514O4705j43659m9952J19293J63294J44374j7170l6603
12842C24463j91098p7956N7109N0798n441K8202r3284j79456j06448q370j02105
12831c03586m8203K8348n0601L10147K19335j6852k60231m8957J31905P5903o9330
12820c2122m6461J12134O5911J89914L04312O8078j82507o8303P6190L3275n9293
12809D61128l2634j12012j85019n6015j46052M7616J38277P7170J29378J2229
$$ y = [161608, 165006, 160847, 161359, 210661, 308119, 415914, 271804, -24938, -89114, -40326, -19920, -10480, 60065, 41531, -61681, -205175, -100492, 120410, 183608, 77309, -182345, -237811, -25034, 612, -72676, -151564, -170980, -125828, -288002, -373294, -192205, -80536, -92809, -96817, -71333, 80181, 144886, 1227, -48725, 70568, 233862, 378236, 361066, 324463, 133365, 55409, 112518, 163316, 157875, 186077, 92793, -86663, -193111, -201481, -303586, -351789, -323441, -374042, -63895, 155440, 138588, -121643, -170600, -38695, 37208, -32122, -78583, 33551, 99462, 289376, 593688, 661766, 479259, 410956, 487146, 520421, 461128, 428494, 316482, 131463, 75448, -70604, -22988, 115289, 192459, 321837, 334066]
12799C34066P055j45544j15105J32475q6265n3573j0521o7800Q8813K6469r13
12788A09157J03946j8717M5748Q9125M2565N9706N9365k8127K8719r2082m365
12777C95040j93163j07576q9735J10301K88503P5566q3619L2897O7912O6902n3073
12766E09955k49067j32441J7764l1485q7000j04979L0902Q3827R1411O791o858
12755A28820K6432K88747p9995j42530j43919q7966n5694N5692m0885j1896K24824
12744A61630O4646o3759j1887N1643P0915M4386j9047q8128j0173m36q3289j59682
12732d3181J33566J66993J28901L6098J9603j33193n6886n5181K6153n7279j08000
12721E7594j23529R8219P0253J11601q80R550m2916J59847J62810k2215J21252
$$ y = [334066, 341121, 195577, 80472, 212947, 126682, 73109, 62588, -5212, 83601, 110070, 109157, 213103, 194386, 240134, 329259, 371824, 431530, 490895, 462768, 491487, 399405, 395040, 201877, 94301, 4566, 114867, 403370, 478936, 395317, 428214, 496126, 563028, 509955, 260888, 128447, 146211, 114726, 27726, -77253, -46351, 37476, 128887, 135678, 128820, 155252, 443999, 364004, 221474, 77555, -10411, -66105, -10413, -51298, -63194, 161630, 226276, 162517, 150630, 202273, 273188, 317574, 298527, 210399, 200226, 199790, 116501, -43181, 90385, 257378, 386279, 422377, 441980, 308787, 251901, 196720, 222873, 165594, 57594, -65935, 32284, 102537, 214138, 213258, 222808, 179892, 339739, 502549, 480334, 601586]
12710F01586k0219j98435k86778M4939r5883j5748O3588m474M0842J58637n4344
12699B33711m4215R7610O7960l1930r3218M9404r433Q2826O1853m6183R0651j46331
12687C12705K6110k13975p3789J00397R2692J0198N4218J14629m0103r3713n8227
12676B31142P7575J25065p1354M6118Q2217J36136L8249r2543j30354L1509J15199
12665E88959J5995p3546J43050j4268j05982P5685k7979J66865M9445j17548r5672
12654F05004j1835k7652L8595J69133K64302R0408j6930L1157K45981J98547R2716
12643A679426m8108j97570k14355m59163j32113L1768j6839j17212k38793k95215
12633h174k03409Q0801N4922J69058Q3420J22160N2808l9808j55642m9628M7234
$$ y = [601586, 581367, 382932, 96154, 141093, 45210, 29462, 93050, 88576, 129418, 288055, 233711, 189496, 287106, 355066, 323136, 229918, 279322, 269889, 352715, 414568, 368385, 459036, 312705, 338815, 124840, 51051, 151448, 244140, 254338, 308556, 423185, 383082, 289369, 231142, 308717, 433782, 362428, 408546, 490763, 626899, 665148, 572605, 442251, 473760, 588959, 604954, 531408, 674458, 660190, 554208, 629893, 601914, 768779, 818224, 700676, 605004, 593169, 565517, 604112, 773245, 1037547, 1127955, 1111025, 1142182, 1388163, 1586710, 1679426, 1631318, 1433748, 1219393, 760230, 628117, 659885, 643046, 525834, 287041, -8174, -211583, -130782, -75860, 93198, 176618, 298778, 351586, 311778, 156136, 106508, 153742]
12622A53742l0341K40215Q2677J4871R4397J98743m9711j83833K7289K43483j44341
12611F47191j42250m5047Q0573J32577k1180K17299j6581p227K0246j4391Q391
12600H59601K78389K3851P3276K0290J8192j13945j13554m3195J62190K44840
12590A409935L9812j19551L314P7844k9620j24556P170J06455P7061R0849M9387
12579A588100K9642R6824P2340P2517J73163j6616o8114K30924J83675m5558J8452
12568B335349O033Q7535J93443J84796L5191J75680L73542J07301K63280K47065
12558D009215K16631J36915J59148O0855J45575J74896L74965N97560M86700K85179
12548F647639L43409O51520P39508N92548N17480O54770Q14657J001189J183061
$$ y = [153742, 123401, 363616, 446293, 461164, 555561, 754304, 704593, 520760, 548049, 791532, 647191, 504941, 459894, 540467, 673044, 651864, 869163, 852582, 845355, 865601, 851210, 859601, 1137990, 1161841, 1235117, 1255407, 1273599, 1159654, 1046100, 1002905, 1165095, 1409935, 1449747, 1330196, 1333510, 1411354, 1381734, 1257178, 1264348, 1370803, 1447864, 1538713, 1588100, 1617742, 1714566, 1786906, 1859423, 2032586, 2015970, 1947856, 2178780, 2362455, 2316897, 2335349, 2341382, 2428917, 2622360, 2807156, 2842347, 3018027, 3391569, 3498870, 3762150, 4009215, 4225846, 4362761, 4521909, 4582764, 4728339, 4903235, 5278200, 5875760, 6362460, 6647639, 6991048, 7642568, 8382076, 8974624, 9492104, 10146874, 10961531, 11962720, 13145781]
12539A3145781J130171J386151J557735J741698K211926K597666L416592L884583
12531C1072303M851089N857083P559940R563942J2387449J6236873K1413804K8627343
12523A37569826L7992641M9107752O0464140P0072111P5298624P0575496N1468868
12516E52549458K7878308O893817j7937846m5090630o1892137o6751422o5206702
12509C30442846o0345643n2923456m3974953l4572703k6212323k0048163j5319363
12502G7046242j1901079r466409p869062o273938m878788m254124l514252k988955
12494B5899635k613712k110857j912952j607586j475847j269283r96023p84744
12486A3128631q20302q98534n26925o21165m56520n17142m96560l19701l19142
$$ y = [13145781, 14275952, 15662103, 17219838, 18961536, 21173462, 23771128, 27187720, 31072303, 35923392, 41780475, 49340415, 58904357, 71291806, 87528679, 108942483, 137569826, 175562467, 224670219, 285134359, 355206470, 430505094, 501080590, 552549458, 580427766, 587321583, 569383737, 524293107, 462400970, 395649548, 330442846, 270097203, 217173747, 173198794, 138626091, 112413768, 92365605, 77046242, 65145163, 55678754, 47809692, 41535754, 36656966, 32402842, 28888590, 25899635, 23285923, 21175066, 19262114, 17654528, 16178681, 14909398, 13913375, 13128631, 12308329, 11409795, 10882870, 10261705, 9805185, 9288043, 8791483, 8471782, 8152640]
12477H152640n15209m67944l79466m59634l01520j54733j21500k78568k21452
12468E252614j69562j31380k68938k15149k15221j7156j79672j06630J039n9887
12458C890058j72529k08629J13849M5779j27057o5887k09556k81170j25840R4136
12448B953154l2467l1609R8481j48189j86946n5367q437K4109r7643P1453j71399
12437B415140k03478j63284j20189P7138J29104n8926j3444j52107j90220K0874
12427A740608R0796N5746q440J68181q9539O8730K05768J40009J30251J14372
12417B616482K18394J64869q475Q2176L7635j87339j85770q4263q8881j73517
12407B391311j10513k68785j34914k22497j07959Q5072Q7362O3202l4645p4351
$$ y = [8152640, 7637431, 7169487, 6790021, 6330387, 6028867, 5874134, 5752634, 5474066, 5252614, 5083052, 4951672, 4682734, 4467585, 4252364, 4235208, 4055536, 3948906, 3949945, 3890058, 3717529, 3508900, 3622749, 3668528, 3541471, 3475584, 3266028, 2984858, 2859018, 2953154, 2920687, 2889078, 2987559, 2839370, 2652424, 2597057, 2588620, 2612729, 2515086, 2586539, 2415140, 2211662, 2048378, 1928189, 2005327, 2134431, 2075505, 2062061, 1909954, 1719734, 1740608, 1831404, 1887150, 1878710, 2046891, 1957352, 2026082, 2231850, 2371859, 2502110, 2616482, 2834876, 2999745, 2991270, 3073446, 3111081, 2923742, 2737972, 2653709, 2564828, 2391311, 2280798, 2012013, 1877099, 1654602, 1546643, 1631715, 1719077, 1782279, 1747634, 1673283]
12397A673283k1153m4243j3463O9942j13370j12608p0242j05590k6371p2562n6189
12386A107434k03890k76921r435P7698j3281L6809j3301n0323k31664k1429J91523
12375E93220L5461r444J08762j06716p9542O2730j41629r0061J17174L3784N9041
12364E82780q04M3326j3451m2989j73154n8221J38411J7425K3069k0218r0483
12353D05691L5124o4710N6641Q8193K03113K73380l9528j79239p3979M3040J4687
12342G62413m3664j20228N2068J3383j9511j0978J02915O2878L1070K8818q1706
12331G77458q4626J56336j10782j9919L4051p1934J1548q4348O2935O5492o6016
12320F70195J1986k6021o6009j02784j64620j65926M7913J05961J01356K2085
$$ y = [1673283, 1652130, 1607887, 1594424, 1664366, 1550996, 1438388, 1368146, 1262556, 1236185, 1163623, 1107434, 903544, 626623, 617188, 694886, 681605, 718414, 705113, 654790, 423126, 401697, 593220, 628681, 619237, 727999, 621283, 541741, 604471, 462842, 372781, 489955, 523739, 582780, 581976, 625302, 611851, 568862, 395708, 337487, 475898, 493323, 516392, 496174, 405691, 440815, 376105, 432746, 520939, 724052, 997432, 957904, 778665, 704686, 747726, 762413, 718749, 598521, 650589, 663972, 644461, 633483, 736398, 799276, 830346, 859164, 777458, 692832, 849168, 738386, 718467, 752518, 680584, 692132, 607784, 670719, 736211, 670195, 682181, 656160, 590151, 487367, 322747, 156821, 204734, 310695, 412051, 434136]
12310D34136j9945n9891n2603J00849N7004J9781p8130j00359k9116L91096J13805
12299G76627j9144o8027j58513p415J20044O6842j014M5404K41711j07515j45931
12288G43069j6192n8921n0362k9537m2226J6044L9016m1114k8443L8414j02822
12277D66926J13730K8213M0457k5322j7002Q111k01171l2377j22775j23360Q1601
12266B17031K46282r2797j7441P5180J47659J31478l07039j44655Q9841K01253
12256E46792n7307m3000p5924Q166O7066O3661P3384j15068p6060N204N1256j0412
12244D37758K9185P1862Q7434n2228j4025O2538J00687o2393r6428J9180L9376
12233F22946m5776L742r7499L5532J21721L4744n1718l3608m6222j31350j350
$$ y = [434136, 414191, 354300, 301697, 402546, 459550, 479331, 401201, 300842, 271726, 662822, 776627, 757483, 689456, 530943, 523528, 643572, 710414, 709400, 754804, 996515, 889000, 743069, 726877, 667956, 617594, 588057, 545831, 561875, 600891, 559777, 531334, 569748, 466926, 580656, 608869, 649326, 624004, 607002, 615113, 413942, 381565, 258790, 135430, 217031, 463313, 370516, 353075, 428255, 575914, 707392, 400353, 255698, 345539, 546792, 489485, 446485, 370561, 378727, 445793, 509454, 582838, 467770, 391710, 396914, 448170, 437758, 466943, 538805, 626239, 574011, 559986, 622524, 723211, 660818, 564390, 583570, 622946, 577170, 580912, 483413, 518945, 640666, 675410, 623692, 590084, 543862, 412512, 411162]
12222D11162j30228l4507K22069J94415l8241M5913j12517L573R1466N7570j2350
12211F98325k3999q1063k2872Q4251o3013M3274J56183J60372m7011j13752l8405
12200G52290K7302m7228j8635j2766J15003L0904M6706J17475O6826r4133j38895
12189H44849J68207M3243r3884k7620j25084l6193O2102J67368p0536j05598o4421
12178G62433M9809N2839J01355j3797j29379l4147j2759j57938o8456P2806J36865
12167G59631L7284J03049P4472k5856m4390J06462J29253l5002j22359q1904R3962
12156I94602P6708O7246o6153m6520r986q7240j91580K9588J7880j5697J81501
12145I50349P4589J16173J35883j20669j55923j63501P0121o677K71228J50721
$$ y = [411162, 280934, 246427, 468496, 662911, 624670, 670583, 558066, 561639, 653105, 710675, 698325, 674326, 593263, 570391, 654642, 591629, 634903, 791086, 951458, 904447, 790695, 752290, 779592, 732364, 713729, 700963, 815966, 846870, 893576, 1011051, 1077877, 983744, 844849, 1013056, 1056299, 962415, 934795, 809711, 773518, 835620, 1002988, 932452, 826854, 762433, 812242, 865081, 966436, 952639, 823260, 789113, 776354, 618416, 549960, 622766, 759631, 796915, 899964, 974436, 948580, 904190, 1010652, 1139905, 1104903, 982544, 900640, 994602, 1071310, 1138556, 1072403, 1025883, 1015897, 928657, 737077, 766665, 784545, 768848, 950349, 1024938, 1141111, 1276994, 1156325, 1000402, 836901, 907022, 900345, 1171573, 1322294]
12135A322294j53833K9398q9699m5302m1633k05607j77064J89425R7834J49682
12125A075495J54931l815j5493J09772J7566k7185J2158p3226m6072p488J83788
12114A380431K5516N3681q9154J01116O0845R336j08613k22757m2160N432K50150
12103A423823P0055K2289j24185j08720p2144m2393J13927J72540K73542o7132
12093A661602j2990j1961j49741L5800K13158K17683l3505j01592j4727J26980
12083A930707P8289J968N2091L8940J88551J25454N30j05538J0180R3808L6086
12072B451066j2424J13033J97428J42281n990K35170L16002K14220M25938N02625
12062D579349L91750K66756L4856j13536j85553k49119k80814j45901k15985j59371
$$ y = [1322294, 1168461, 1197859, 1108160, 1062858, 1021225, 815618, 638554, 827979, 925813, 1075495, 1230426, 1226611, 1211118, 1320890, 1338456, 1311271, 1323429, 1250203, 1204131, 1196643, 1380431, 1405947, 1459628, 1370474, 1471590, 1532435, 1541771, 1433158, 1210401, 1168241, 1173673, 1423823, 1493878, 1516167, 1391982, 1283262, 1211118, 1168725, 1282652, 1455192, 1728734, 1661602, 1648612, 1636651, 1486910, 1522710, 1735868, 1953551, 1920046, 1818454, 1803727, 1930707, 2008996, 2010964, 2063055, 2101995, 2290546, 2416000, 2416530, 2310992, 2321172, 2414980, 2451066, 2438642, 2551675, 2749103, 2891384, 2885394, 3120564, 3436566, 3650786, 4076724, 4579349, 4971099, 5237855, 5272711, 5159175, 4973622, 4724503, 4443689, 4297788, 4081803, 3922432]
12052C922432j78054p4594j25079r9932o7890j1890j63688q5809k0355N7486j9596
12041C133031q6932M3945R4934m6565r21J16883m959o3968N4574j18425O874J70081
12029C298552J33891J13385M7993q3120j25516J9611R6351P8750k0661J09521
12019C668757J84054K06029q5990N6442J53358P7124N1908L18792J62417O5066
12009D857957n1786J20106L6099P8500q2340M1367J84254o8734Q2178K7838K93459
11998E518898K24883R8175Q4250K18213K07261J31492n2222K22764K30899k2967
11988F861646J91343L23934J64318K42602J62808M39824L75193J34141R6180o2843
11978H929146L00268L54618L69706K36124L09027M30396L08383K83853K18639
$$ y = [3922432, 3744378, 3669784, 3544705, 3444773, 3376883, 3364993, 3201305, 3115496, 3095141, 3152627, 3133031, 3046099, 3090044, 3184978, 3138413, 3137492, 3254375, 3249416, 3185448, 3240022, 3121597, 3128471, 3298552, 3432443, 3545828, 3593821, 3510701, 3385185, 3404796, 3501147, 3579897, 3559236, 3668757, 3852811, 4058840, 3972850, 4029292, 4182650, 4259774, 4311682, 4630474, 4792891, 4857957, 4806171, 4926277, 4962376, 5040876, 4958536, 4999903, 5184157, 5115423, 5197601, 5225439, 5518898, 5743781, 5841956, 5926206, 6144419, 6351680, 6483172, 6430950, 6653714, 6884613, 6861646, 7052989, 7376923, 7541241, 7783843, 7946651, 8386475, 8761668, 8895809, 8991989, 8929146, 9229414, 9584032, 9953738, 10189862, 10498889, 10929285, 11237668, 11521521, 11740160]
11969A1740160M24846M56075M04772M75380N62209L10634M62561N51199O47895
11960A6035731O44997K99315N53761J041599Q22661P46579P70430P40048Q28685
11951B2483806Q26501O90524J029554J153929J168800J218543J186370J217855
11943C0975882J394728J413588J630762J745120J724477J780380J893525K085914
11935D4644376K149980K280621K563255K570372K806311K791345L016367L041568
11927F5864195K903849L244136L445148L533180L540584L604019L505010L327230
11919I2967351L250195L052697K984198K491999K209182K069310J407634R70503
11911A11403069M86249r2444k45445o93687j132815j723583k080414k538631k730948
$$ y = [11740160, 12165006, 12621081, 13025853, 13501233, 14063442, 14374076, 14836637, 15387836, 16035731, 16680728, 16980043, 17533804, 18575403, 19398064, 20144643, 20915073, 21655121, 22483806, 23310307, 24000831, 25030385, 26184314, 27353114, 28571657, 29758027, 30975882, 32370610, 33784198, 35414960, 37160080, 38884557, 40664937, 42558462, 44644376, 46794356, 49074977, 51638232, 54208604, 57014915, 59806260, 62822627, 65864195, 68768044, 72012180, 75457328, 78990508, 82531092, 86135111, 89640121, 92967351, 96217546, 99270243, 102254441, 104746440, 106955622, 109024932, 110432566, 111403069, 111889318, 111796874, 111551429, 110857742, 109724927, 108001344, 105920930, 103382299, 100651351]
11902A00651351k795426k918028l282613l388142l377028l256369l212006l315171
11894G5106568l269983k970116k752463k640174k837934k795735k610476k323734
11886E2905953k017822k141619k169733j962995j975786j896739j660750j572482
11878C7508027j552337j433665j197175j250708j176246j272776j148471j084886
11870B7391763j176168j044980r08510p51820p94092r05752o14946n16192o24849
11861B0054454o04420p23311p62564p29144m37619l48650m86560o17295o15425
11852A4729466m32844l53621k62403l92090n21272k64130k25412m26610m14844
11843A1436240k92251j34415k78891l82901l82840k21614k38825k79408k71489
$$ y = [100651351, 97855925, 94937897, 91655284, 88267142, 84890114, 81633745, 78421739, 75106568, 71836585, 68866469, 66114006, 63473832, 60635898, 57840163, 55229687, 52905953, 50888131, 48746512, 46576779, 44613784, 42637998, 40741259, 39080509, 37508027, 35955690, 34522025, 33324850, 32074142, 30897896, 29625120, 28476649, 27391763, 26215595, 25170615, 24262105, 23510285, 22716193, 21810441, 21195495, 20679303, 20054454, 19450034, 18726723, 17964159, 17235015, 16797396, 16448746, 15962186, 15344891, 14729466, 14296622, 13943001, 13680598, 13288508, 12767236, 12503106, 12277694, 11851084, 11436240, 11143989, 11009574, 10730683, 10347782, 9964942, 9743328, 9504503, 9225095, 8953606]
11834H953606k67312j75324k6050k37340l21026r1382m450k92837l14585l78370
11824F844930j5400R7709n2537q7802k48365k02232j20277j18370j98727j90126
11814E708803l8538o468j45477k69844j80808o6636o4540K9641L7102l5291P441
11803D975385j32567j71968J19283m8750k06772m5494J86355j28733k02698l6500
11793D307541o844j13269j62268l8058k1398k27921k48065j33146l1119J24240
11783C449693j1923J8140Q3525j26430k27010r1149j07424q2309o4358j60903
11773B679852Q8219p153m8154Q2000q6066j06629o0257j32571r5149N7594k607
11762B369079r0400o6885J60925J30944l6088j13982m6816k11075N601j14826
$$ y = [8953606, 8686294, 8510970, 8484920, 8247580, 7926554, 7835172, 7830722, 7537885, 7223300, 6844930, 6829530, 6927239, 6874702, 6786900, 6538535, 6336303, 6216026, 6097656, 5898929, 5708803, 5670265, 5663797, 5518320, 5248476, 5067668, 5001032, 4936492, 4966133, 5003235, 4967944, 4975385, 4842818, 4670850, 4790133, 4741383, 4534611, 4489117, 4675472, 4546739, 4344041, 4307541, 4300697, 4187428, 4025160, 3987102, 3965704, 3737783, 3489718, 3356572, 3325453, 3449693, 3437770, 3455910, 3539435, 3413005, 3185995, 3094846, 2987422, 2905113, 2840755, 2679852, 2768071, 2760918, 2712764, 2794764, 2708698, 2602069, 2541812, 2409241, 2314092, 2371686, 2369079, 2278679, 2211794, 2372719, 2503663, 2467575, 2353593, 2306777, 2095702, 2101303, 1986477]
11752A986477k9411k4643m3709P8897N6423J1139j82351l1327R9930j50053r9802
11741A671570J07875P3026q3676j1631j14909k39833j9180J70531J0986n4389
11731A510370M1353P8281m7862j62504L7646Q5426J12125j33076p1071K6508J90505
11720A667701P8004l0261j93600k7607m1042j9673k607J15806o2364l72991j03139
11709A008227m6571L1330j46993K50402J75915L1029L0359k1212j33601o3175
11699A115710l5604m3850K71897K07969j49225j67088L5621o7224j1997K8834
11689A185043l8356K1644j09775j61026M6711J3201M356N4957J23493k805j35549
11678A001894l29984j17719M5904K5908Q3090K14464J47136J35751J417j08233
$$ y = [1986477, 1957066, 1932423, 1888714, 1967611, 2024034, 2035173, 1852822, 1821495, 1921425, 1771372, 1671570, 1779445, 1852471, 1768795, 1757164, 1642255, 1402422, 1383242, 1553773, 1564759, 1510370, 1551723, 1630004, 1582142, 1419638, 1457284, 1542710, 1654835, 1521759, 1450688, 1477196, 1667701, 1745705, 1715444, 1521844, 1494237, 1453195, 1433522, 1430915, 1546721, 1484357, 1111366, 1008227, 961656, 992986, 845993, 1096395, 1272310, 1303339, 1333698, 1312486, 1178885, 1115710, 1080106, 1036256, 1308153, 1516122, 1366897, 1199809, 1235430, 1168206, 1156209, 1185043, 1146687, 1168331, 1058556, 897530, 944241, 957442, 961798, 1016755, 1140248, 1137443, 1001894, 671910, 554191, 600095, 626003, 709093, 923557, 1070693, 1206444, 1207861, 1099628]
11668A099628j48497m8027J40736q2849p5068L3005l031O2975M1412O5118p576
11657A077826L2656l5700n3595j07147r3955q2168J35p727j46492K4413P5578
11646F83824J69292L9660N0087J69096r4191j76156j95215k00642k0121J28559
11636E54193J73221Q1896j26242k36899L320j5146R2264k1450J09746K50396j69488
11625F95811j14561j03770o7541R2713k7724p7779j30934J27134K8635k8445p5545
11614C17994k59109J03779J26625J32136j01006R5536K42429m0r1437j77876R5421
11603D84452P6137J0667l3410m2338L402j54672R4222k2672J37093J39352j23788
11592E68445k10878j06327m7306n2512J63339J69649J6102m457j31667N101N6365
$$ y = [1099628, 951131, 903104, 1043840, 960991, 885923, 918928, 915897, 978872, 1020284, 1085402, 1077826, 1110482, 1074782, 1021187, 914040, 820085, 737917, 738052, 730325, 583833, 608246, 683824, 853116, 892776, 942863, 1111959, 1017768, 841612, 646397, 445755, 425634, 554193, 727414, 809310, 683068, 446169, 449489, 434343, 526607, 505157, 614903, 865299, 695811, 581250, 477480, 409939, 502652, 474928, 397149, 266215, 393349, 421984, 393539, 317994, 58885, 162664, 289289, 421425, 320419, 415955, 658384, 658344, 566907, 389031, 484452, 560589, 571256, 537846, 495508, 498910, 344238, 438460, 415788, 552881, 692233, 568445, 357567, 251240, 203934, 151422, 314761, 484410, 500512, 496055, 364388, 369489, 425854]
11581D25854R154j20430J84334K94311j6268j50629j47847l8296n0684Q5108n785
11570D68822j31749J9198K3956j14403M8334P1604Q235j28611j13557J0897N6217
11559B18943N3794n9490j04885J20371K30874k7001L9948J58004j47604n7586
11549D25368k9751J39925L2993j24251o0190Q284j7633r0065l7123P420J42216
11538C97193J31349r150N06J64722J35544k15733k41269k64339k039N8263J75786
11527C30833J00565q3911J76104J13005j72520j27030l9741L1598J54044p1565
11517D11382j35012m4128n2770J47804o70J28972J53268o0185q2912P8900Q0250
11506F24899j78470j16965K03823Q0227o8466O7935j38591n4096L460M1931P4400
$$ y = [425854, 435008, 314578, 498912, 793223, 776955, 626326, 478479, 440183, 389499, 474607, 468822, 337073, 356271, 380227, 265824, 314158, 385762, 393997, 265386, 151829, 162726, 218943, 272737, 213247, 108362, 228733, 459607, 432606, 472554, 630558, 482954, 425368, 395617, 535542, 568535, 444284, 384094, 392378, 374745, 284680, 247557, 254977, 397193, 528542, 519392, 519898, 684620, 820164, 604431, 363162, 98823, 96784, 155047, 330833, 431398, 347487, 523591, 636596, 464076, 337046, 297305, 328903, 482947, 411382, 276370, 232242, 179472, 327276, 326606, 455578, 608846, 548661, 465749, 544649, 624899, 446429, 329464, 533287, 613514, 545048, 612983, 474392, 420296, 423756, 465687, 540087]
11495E40087p1482L1213n9497j7942J30785l6939N093L0146P1975P5194j85281
11484E13352k40320m7642m7674r4626R7977K85227n7335N220p4205j8560j04681
11473B16733K1203J51206L7293M8614J00263r3515o7953k49683j73088N0410Q3387
11462A24870R1998L4490l2554j1638K9601J09596O4802K8597q730r3730k00105
11451A37197N9715l1538o2055k1321q2959J4612L5459J2415q351N512J00011Q2142
11439B40839J19819J69064L4514r1347k23423j61520p5538J5709J89864L7928
11429B55909j34274j47091L307J37246J44257p4565M6445P5013O0139Q395j49625
11418B25156k45442J6310N6553O9456R0324Q9966M3371o3j06103N502k3409r1351
$$ y = [540087, 468605, 499818, 440321, 422379, 553164, 516225, 521318, 551464, 623439, 698633, 513352, 273032, 225390, 177716, 83090, 181067, 466294, 408959, 414179, 339974, 321414, 216733, 237936, 389142, 426435, 475049, 575312, 481797, 413844, 164161, -8927, 41483, 124870, 216868, 251358, 218804, 207166, 236767, 346363, 411165, 439762, 431032, 337302, 137197, 196912, 165374, 103319, 81998, -961, 13651, 49110, 61525, 53174, 58686, 158697, 240839, 360658, 529722, 564236, 472889, 249466, 87946, 12408, 28117, 217981, 255909, 121635, -25456, -22149, 115097, 259354, 184789, 231234, 306247, 366386, 374781, 225156, -20286, -3976, 52577, 122033, 212357, 302323, 345694, 345631, 239528, 245030, 221621, 130270]
11406A30270M5334o5883j54940M7457J18897M4045j0207j15145o4176l9785q7891
11395a52024J33145J23143R381Q2527J73493k9338j58702L5057k835p6087j77138
11384c9378M3732J58626J30520J227k56899j23323J38230O354P2441p1727j60068
11373a00265L7215o9585n8570O7635K17341J07225K2518j32280p9343n4960p9528
11362a22597J25267J49743n5396J5009P4329k9564n7974j03964J97819M1844q5866
11351A48650j27037J069K0738R4228J03149j12340J61156J83918j92936J4901
11341B95496m4793l8765J79494P3673k47266j16923L9240J73794J7663j7659k66878
11330D7076P6259J86940P5280N9711P0540k775L5523j32518r8219j03445j25501
$$ y = [130270, 175604, 109721, -45219, 2238, 121135, 165180, 154973, 39828, -24348, -64133, -152024, -18879, 104264, 113645, 196172, 369665, 340327, 181625, 216682, 213847, 137760, -39378, 4354, 162980, 293500, 294727, 37828, -85495, 52735, 59089, 131530, 59803, -100265, -63050, -132635, -191205, -123570, 93771, 200996, 223514, 91234, 11891, -43069, -122597, 2670, 152413, 97017, 112026, 186355, 156791, 98817, -5147, 192672, 234516, 148650, 21613, 22682, 43420, 137648, 240797, 128457, 289613, 473531, 280595, 295496, 250703, 211938, 391432, 465105, 217839, 100916, 140156, 313950, 331613, 313954, 47076, 123335, 310275, 385555, 445266, 515806, 513031, 548554, 416036, 317817, 214372, 88871]
11319H8871k0953J18128l3216j74182n3134J13688J72353J05781p8476k7110k41242
11308b9492m1761J29955J0651j69114r9647P4480R3989M3400M0903J17197m5765
11297A24796j03143l6287n3719R9637l5762l4580K9480n2692j02733l370L3495
11286a34878K12795J42942p6751j16813J39242j6147j11052j50907n1530N3321
11276a09778M2259j9920R182M4764J88735O026Q9223k6566k57772r7789O9227
11265f2409R1071M0452N4791Q5957L3113j49163k19280o6828Q5005J50496j0718
11254C2487p8672O4704Q5147p5466j4555R9991R2608J06414P410o3526P327L075
11242B66944j9150l1161j56099m7766P1860k26911l12753K43803K69434j6336
$$ y = [88871, 67918, 186046, 152830, -21352, -74486, 39202, 211555, 317336, 238860, 211750, -29492, -71253, 58702, 69353, -99761, -199408, -124928, -30939, 12461, 53364, 170561, 124796, 21653, -14634, -68353, 31284, -4478, -39058, -9578, -62270, -165003, -168373, -134878, 77917, 220859, 144108, 27295, 166537, 150390, 39338, -111569, -163099, -109778, -67519, -87439, -78257, -33493, 155242, 161268, 250491, 223925, -33847, -131636, -62409, 28662, 69114, 123905, 209862, 242975, 93812, -125468, -192296, -107291, 43205, 32487, -46185, 18519, 103666, 28200, 13645, 113636, 206244, 312658, 320068, 256542, 263869, 266944, 247794, 216633, 60534, 12768, 84628, -142283, -455036, -211233, 58201, 41865]
11232D1865j0138m6960K7402J01947k2201J3289k603p5549k04566q9238P4979
11221a91773P8401j25963r1749J05441R5989K4285J99180J16971j44391L1998
11211I8389k55291m2475R0425K03579J16714L9712j01350J1804J0741r0905L3357
11200A14700M0198j46910j92936M8976K04248P8929l0512m7560j06842J16148
11190G8439Q7020n3871L8347j07309j08402l0984j5095o6912J65990J49885K59890
11179C96998q012n5419j62392k18878J78371J42806j20089j47591M4539P8299
11169A28632K10523M532k02188q0249Q3006J9495o7578q7508j19429Q410P9725
11158b2629p9389N1305M8791p0664O9021J35236O5525j26381p7209k3832l0578
$$ y = [41865, 31727, -15233, 12169, 114116, 91915, 105204, 102601, 27052, -177514, -266752, -191773, -113372, -239335, -331084, -225643, -129654, -105369, 93811, 210782, 66391, 98389, -156902, -199377, -108952, 94627, 211341, 251053, 149703, 161507, 172248, 81343, 114700, 154898, 7988, -184948, -135972, 68276, 147205, 116693, 69133, -37709, 78439, 165459, 111588, 149935, 42626, -65776, -96760, -111855, -178767, -12777, 137108, 396998, 388986, 333567, 171175, -47703, 130668, 273474, 153385, 5794, 50333, 128632, 339155, 343687, 141499, 61250, 144256, 163751, 96173, 8665, -110764, -102354, -22629, -102018, -50713, -1922, -72586, -3565, 131671, 197196, 70815, -6394, -30226, -60804]
11147f0804L4613l4832K2020M5816j74251N1226J00256j37304J9402l2135J62647
11136c346Q259p7536J162K6437J68972j45715n4294n2199K9930M1667M0436K08817
11124A92590q9749J08188O3034l3611j04108j40649J51919K4044k69350K9421
11114f8271L23835R8664n7780j5738m4735o4834j92717j4764P4879K08238R5030
11103C41807R5140j55084j56231m8685Q49r8348R8090j2971j46321l2930K1942
11092i2742j64040j04608K12663M6715L6613N3098j8149J90240R8871j01450J43453
11081C00664O8085j97670j98347m4692J8404P7564O1886J74428K0958j14151q7779
11070G9350o2767Q9394k3149o5442M2141J56107k4883j07161k0454j71875N0433
$$ y = [-60804, -26191, -61023, -39003, 6813, -167438, -116212, -15956, -153260, -133858, -165993, -3346, 4913, -72623, -71461, -45024, 123948, -21767, -76061, -128260, -98330, -56663, -16227, 192590, 102841, 211029, 274063, 240452, 136344, -4305, 147614, 171658, -97692, -68271, 255564, 354228, 296448, 280710, 235975, 171141, -21576, -36340, 38539, 246777, 341807, 436947, 281863, 125632, 76947, 77796, -20552, 77538, 64567, -81754, -114684, -92742, -256782, -361390, -148727, -102012, -65399, -12301, -30450, 159790, 258661, 157211, 300664, 368749, 171079, -27268, -71960, -53556, 24008, 85894, 260322, 281280, 167129, 79350, 16583, 105977, 82828, 17386, 59527, 215634, 190751, 83590, 63136, -108739, -58306]
11059e8306M4408M4833j60725p7733J05223J41840P4946n9058L3503J23771n7778
11048A54924r1480J0573J31151O4356M6673k3264p858L3907L05064J87483j30925
11037F80604l0164q14q3239J82321K44947J67134P0690j30569k30207j600k54164
11026F14939j75349R6349J05543M64690L53482J84998J6600r6735q8591n6595
11016A419331k76113p2176q2909j03798K9939K93045K26464j48546q3734k10623
11006I90880k16477j69827q4666L1479m4336r7151N9660N3070P8344J11657m7587
10995F65046j00144j58166k19981J8734j9948n7882m5126j09776J5314K5224j14372
10984a01077J14740L6475j12686j45414P9143R8831k638J52136R7151P7792J0224
$$ y = [-58306, -13898, 30935, -129790, -207523, -102300, 39540, 114486, 55428, 88931, 212702, 154924, 63444, 74017, 205168, 269524, 316197, 292933, 285075, 318982, 624046, 811529, 680604, 650440, 649626, 566387, 748708, 993655, 1160789, 1231479, 1100910, 870703, 869103, 614939, 439590, 535939, 641482, 1106172, 1459654, 1644652, 1661252, 1564517, 1475926, 1419331, 1143218, 1071042, 988133, 884335, 914274, 1207319, 1433783, 1285237, 1201503, 990880, 774403, 604576, 519910, 551389, 507053, 409902, 469562, 522632, 600976, 712633, 665046, 564902, 406736, 186755, 205489, 185541, 127659, 82533, -27243, -11929, 13295, -101077, 13663, 50138, -62548, -207962, -128819, -29988, -32626, 119510, 216661, 294453, 304677]
10973C04677j32798j17919L0251m2736J0084l2574k05220p694l395J94013J97998
10962A94687k1969j00857L2140J40157Q2825m4362k11864N6979M2776m8421O2579
10951A84670M5326j58240j14935k1344P8681k18679j8928R2349J18265m2940J10732
10940E4957L3128n642j53631p3422J0473K35939J35669O2549p8063r9156m8254
10929G4547j90602L2944J33436j4990o481K5451J58124K474o1017K8503Q420P9134
10917B69943J7472l4608j30751M1583p5441j38826k3397J2522J88817J09885n0872
10906A86327j57804j44787j44758J75049K79631N7100j1080J2690l4155l0926
10896A87287p1184R6820k8130j69130j12205M9625K1896r0031k8688n5013O5305
$$ y = [304677, 171879, 53960, 84211, 41475, 51559, 18985, -186235, -193929, -197324, -3311, 194687, 172718, 71861, 104001, 244158, 326983, 282621, 70757, 127736, 170512, 122091, 184670, 229996, 71756, -43179, -64523, 14158, -204521, -223449, -131100, -12835, -55775, 54957, 88085, 82443, -71188, -144610, -134137, 101802, 237471, 300020, 221957, 122801, 74547, -116055, -83111, 50325, 35335, 28854, 54305, 212429, 214903, 153886, 182389, 190809, 269943, 287415, 252807, 122056, 163639, 88198, -50628, -74025, -61503, 127314, 237199, 186327, 28523, -116264, -261022, -85973, 193658, 250758, 239678, 252368, 218213, 187287, 116103, 212923, 184793, 15663, -96542, -46917, -25021, -115052, -143740, -198753, -133448]
10885a33448K35677j174p501P9103p316K7838o554m9394j61631K0652K2828j6696
10873B384l3658j05240l131J7834K7585L027J88383J00947j5779J4916j01090
10862I6178k29826p7702n0372J86579J74746K0956J338N7691J7380k5794k75745
10851a04571J9914P392j123k8928N232R3825J20604L2921k4074J01279O3958j65245
10839A21184k44603j73687J39619j10101k4758R6584J57324K42271L2788j03642
10829A32979j34936m6150M0141o2080k20470j28768p552K31746J90199Q8639q2657
10818A091r5567j3381L4195P8709r5538n3466q7249l1157N9894n1199J27100K15074
10806H8506P4904J4982o7073q293o0121J86350J13825j53599p3057p897k4400
$$ y = [-133448, 102229, 101055, 93554, 172657, 165341, 193179, 186625, 137231, -24400, -3748, 19080, 2384, -31274, -136514, -139645, -121811, -94226, -91199, 97184, 198131, 182352, 197268, 96178, -133648, -211350, -261722, -75143, 99603, 120559, 121897, 179588, 196968, 171174, -104571, -84657, -77265, -78388, -107316, -102084, -8259, 112345, 145266, 121192, 222471, 286429, 121184, -123419, -297106, -157487, -267588, -292346, -195762, -38438, 203833, 236621, 132979, -1957, -48107, -7966, -70046, -290516, -419284, -426836, -195090, -4891, 83748, 1091, -94476, -107857, -73662, 5047, -90491, -143957, -231206, -262363, -202469, -253668, -126568, 88506, 163410, 178392, 111319, 103026, 42905, 229255, 343080, 189481, 116424, 108527, 84127]
10795H4127J3576l3654L8060R0071O5631p5662J31517l8964j19577m764q2314
10784F8047n1526J64406K39886Q8131j54577k36194P4446N8278j71103j35300
10774e5506J42478O6763k688J0945l333J68111k2712o3346l783k7632O091q0407
10762A34981j14501j46893Q2276J66029M0437J3376K7362k9047j07803p7229J06235
10751I5223R2797N6461j8456l2493j30754K282O9671J45253J10913O3078q7975
10740C66000L1907j26986J41707O712n264q8615p8998J38176J53442J65251M2493
10729G45825l18543k64250J6527J44526J4491Q5570O6847O0060n3877P6692l4282
10718E39586Q3141n6328j89039j58798j30645q3129J1963N500k8518J725K00423
$$ y = [84127, 97703, 64049, 102109, 192180, 257811, 182149, 313666, 274702, 155125, 150361, 68047, 16521, 180927, 420813, 508944, 354367, 118173, 192619, 250897, 79794, -55506, 86972, 153735, 151047, 161992, 158659, 326770, 304058, 240712, 236929, 209297, 215388, 134981, 20480, -126413, -44137, 121892, 162329, 175705, 203067, 174020, 66217, -11012, 95223, 188020, 244481, 226025, 193532, 62778, 65060, 134731, 279984, 390897, 453975, 366000, 397907, 270921, 412628, 419340, 414076, 325461, 246463, 384639, 538081, 703332, 745825, 427282, 163032, 179559, 324085, 338576, 424146, 490993, 551053, 497176, 573868, 539586, 622727, 566399, 377360, 218562, 87917, 4788, 16751, 22251, -6267, -4542, 195881]
10707A95881J22214j17393j27384J26463M0848j07791o0593m7454j9214n6726
10697e1149r8187q5970L0094M4490P7674q3503q5351m4169N7439o5146P1940K02715
10685b9123K03155j24227j0198O274j18918L0801r86j8688N5483R0036m1182J4772
10673E7199K7108j3632P4814P6236l6237k39544O9354K3469l4797j17391R3744
10662a9677M4898J06033L7836K58094L52423J52815p4488j0605l75j54798p7539
10651F14617K4689J05914Q6j98101R5859J77332J89542k5922p450K07722N441
10640A189729p1299P4176K97955K46424K83186M84049K49662M60515O89295N67223
10630D470915L71747L97784L96895O25248Q73713J076058J345314J911402K550299
$$ y = [195881, 318095, 200702, 73318, 199781, 240629, 132838, 72245, 24791, 5577, -51149, -149336, -235306, -205212, -160722, -83048, -166551, -251902, -296071, -238632, -303778, -231838, -29123, 174032, 49805, 39607, 45881, -73037, -42236, -43222, -61910, -6427, 83609, 42427, 57199, 84307, 70675, 145489, 221725, 185488, -54056, 15298, 38767, 3970, -113421, -19677, 25221, 131254, 169090, 427184, 779607, 932422, 857934, 847329, 846954, 692156, 614617, 639306, 745220, 745306, 547205, 643064, 820396, 1009938, 984016, 976566, 1184288, 1189729, 1118430, 1192606, 1490561, 1736985, 2020171, 2504220, 2753882, 3214397, 3903692, 4470915, 4842662, 5240446, 5637341, 6262589, 7136302, 8212360, 9557674, 11469076, 14019375]
10621A4019375L649969M872498O910708R649654J3102555J6053753J6560387J2811338
10613I7630237N037132k176527o075981n658527k645439K142091Q147717J5854844
10605A12255547K4969786L3092780L3986635K2196707K112234j5031390k2458673
10598A91123626k0205703j2429623k555496Q373782K0446721L3529171M3319177
10591B61601655M1559092K1257259r165127l3007130m1534505l6961189k6193076
10584A77556979j4409895l309178P684960J7443477K3435978K0886706N951917
10577B35240944j4613229k9276210l3020775k8218220k0062121j2062788n230403
10570I2757198J39067M383610O466731M554641k039616r724613j5078133j6250031
$$ y = [14019375, 17669344, 22541842, 29452550, 39102204, 52204759, 68258512, 84818899, 97630237, 102667369, 100490842, 94414861, 88756334, 86110895, 88252986, 96400703, 112255547, 137225333, 170318113, 204304748, 226501455, 228613689, 213582299, 191123626, 170917923, 158488300, 155932804, 164306586, 184753307, 218282478, 261601655, 303160747, 324418006, 315252879, 282245749, 240711244, 203750055, 177556979, 163147084, 159837906, 167522866, 184966343, 208402321, 229289027, 235240944, 220627715, 191351505, 158330730, 130112510, 110050389, 97987601, 92757198, 92896265, 97279875, 103746606, 108301247, 106261631, 96537018, 81458885, 65208854]
10562F5208854j4241274j1288560q383085n870024m308217l211992k527295j978782
10554A3399625j649770j297122j034522q55308p88459o33609n17889n71234l71236
10545E680476l85683m03544k72574j87999l89179l02495k40717k70241l4672k72020
10535B921352k48887K8154J45359p6091j24538Q796k7161j53147j22709j41620
10525B209508r3781P3079o3336p0039L9440r8148k21110j33522p3474J36630J00071
10514A805318m9846q1098j4692J7004L2880K8591k21665k88944k1385J61170J57725
10503A525058L8307j38292q7913j19393j26342K633J81486M9225j07980p3896
10493A142893R0111o4867k0214J0641j10839j23027P957N966J32488R5218K5379
$$ y = [65208854, 50967580, 39679020, 31295935, 25425911, 21117694, 17905702, 15378407, 13399625, 11749855, 10452733, 9418211, 8562903, 7774444, 7140835, 6622946, 6051712, 5680476, 5294793, 4891249, 4618675, 4430676, 4041497, 3739002, 3498285, 3228044, 3193372, 2921352, 2672465, 2700619, 2845978, 2769887, 2645349, 2654145, 2626984, 2473837, 2351128, 2209508, 2115727, 2188806, 2125470, 2055431, 2094871, 1996723, 1775613, 1642091, 1568617, 1705247, 1805318, 1755472, 1674374, 1659682, 1676686, 1709566, 1738157, 1516492, 1227548, 1206163, 1367333, 1525058, 1563365, 1425073, 1337160, 1217767, 1091425, 1094058, 1275544, 1324769, 1216789, 1142893, 1233004, 1168137, 1147923, 1158564, 1047725, 924698, 932655, 938621, 1071109, 1166327, 1191706]
10482A191706j04798m5505l0375k3268j4370J9811j0297R8346l9905j48482r1653
10471H01210R6892l1251J13058L7027o9623p8857o982K2033p5269j88326r9689
10460E20223j35582J1697Q044n8152n4393N893j2782J02096N9698k7190j8809
10449D00743m8411q2381m1961j50067N4421k3069r7759O2224J15699J27292m254
10438C12477j56225p0722m9894j12096q4922M9705J86239J36687N0995J36129
10428C98373Q9389p6339k6581J51832j29393r4867P3100O4810k6219j2464j26847
10417B84794J05559Q8454o1851j89912q2709N4452Q6832j54629k20195J05729
10407A6524J71064j6230p0075O5471L9750n9648J81233j2980J1719P5180q9046
$$ y = [1191706, 1086908, 1041403, 1011028, 987760, 973390, 993201, 982904, 1081250, 1041345, 892863, 801210, 898102, 866851, 979909, 1016936, 947313, 868456, 861474, 883507, 808238, 619912, 520223, 384641, 396338, 404382, 346230, 291837, 297730, 284948, 387044, 446742, 419552, 400743, 352332, 269951, 227990, 77923, 132344, 109275, 11516, 73740, 189439, 316731, 312477, 156252, 85530, 35636, -76460, -161382, -111677, 74562, 211249, 262244, 398373, 487762, 411423, 384842, 536674, 407281, 312414, 385514, 450324, 424105, 411641, 284794, 390353, 478807, 416956, 227044, 144335, 198787, 285619, 130990, -89205, 16524, 187588, 171358, 101283, 166754, 206504, 146856, 328089, 315109, 326828, 402008, 312962]
10396C12962m264m6979K8556P5168J5023p9410j34357k5K481n3951N4678O8461
10384B38343M7989j4458J24716Q5144k2948R8131J10790n3202r6372k62329m5814
10373B09990k4353J18980j6239r9166l4259q649j42423j42966o745M1600J06737
10362B507J63121R5298K6351l7070j19041L7692R5379q2738j69961j04852p235
10351a00549J48656J1001j53874K7815k5011J00400R8387q3417p9783o13Q2277
10340B5289P1999L3880L120R387K9427k8942J01166K7928l4245m6043K9125J84977
10328D07068j33410j52569O7102J77087J48748j32830o3324j78480Q5861K9885
10318B55138j0054K4336J11845q707k05791j12035j97931l9765J61191J4707K5338
$$ y = [312962, 308698, 261719, 290275, 365443, 380466, 301056, 166699, 166674, 169155, 115204, 169882, 238343, 286332, 271874, 396590, 481734, 458786, 556917, 667707, 614505, 518133, 255804, 209990, 185637, 304617, 288378, 189212, 154953, 146304, 3881, -139085, -145830, -104230, 2507, 165628, 260926, 287277, 250207, 131166, 168858, 264237, 181499, 11538, -93314, -100549, 48107, 59108, -94766, -66951, -91962, 8438, 106825, 23408, -56375, -56988, 25289, 97288, 131168, 134288, 143675, 173102, 144160, 245326, 273254, 239009, 192966, 222091, 407068, 273658, 121089, 188191, 365278, 514026, 381196, 317872, 139392, 225253, 255138, 245084, 269420, 381265, 372558, 166767, 54732, -143199, -182964, -21773, -7066, 18272]
10307A8272k3397n786j09575P727r699J01798J14410n5584K3956l2494J40713
10296A70341N1518L7190k2438l4877l1102p816o804j00239J4296O1874J10731
10285B42674M9650r949P4152o1962n7772j61055l6076J21579p0905J32793J22165
10274C45294K3477n1278j17444j04833O490K51464J74608l5531o6561j31943j13262
10263A80481j14129j69542j0924Q8551L150J35634k3187n5239P7765R9766J5337
10252B27663q9786J047n8735O3579L5928J20910O0619j24302q2301j59469j01759
10241a06606J42872J20188J02978O8636q0373j0889K6052M8991r3685j42443J6253
10230I1974l5444k5129J36559p9313N900R709J26809m8776o3037J503j34032J575
$$ y = [18272, -5125, -10911, -120486, -112759, -122458, -20660, 93750, 38166, 62122, 29628, 170341, 221859, 259049, 236611, 201734, 170632, 162816, 156012, 55773, 70069, 131943, 242674, 292324, 282375, 356527, 294565, 236793, 75738, 39662, 161241, 90336, 223129, 345294, 368771, 317493, 200049, 95216, 101706, 353170, 527778, 492247, 425686, 293743, 180481, 66352, -103190, -114114, -25563, -22413, 113221, 90034, 34795, 112560, 212326, 227663, 137877, 138924, 80189, 143768, 179696, 300606, 361225, 236923, 154622, -4847, -106606, 36266, 156454, 259432, 328068, 247695, 236806, 262858, 311849, 218164, 75721, 91974, 56530, 31401, 167960, 88647, 94547, 104256, 231065, 182289, 119252, 120755, -13277, -11702]
10218a1702K9352j32552m7059N8009K66098j36505j21067K3189J13460R0428M5634
10207A77285n223n9600q691o3434M800K088L7202K1052J5837J5750M8433L8711
10195B24210J7562J21083l7800j34811j72445m9994N3396N3137m4255j29047k3375
10184a22339J32142J47303J23969J06029O9434M6308j0239K30588M4091j39433
10174F27853j54891k1604l3213k48797r1782J38077K80003L98075L93367M6000
10164A333088K6483j50554j57139j45424o8656J22056J75552J13795N3133J33520
10154A435854K80080J09962j22729j21345j00756k04192k6919j0219N7733N298
10144A302767M4748J73382J5251k6707j2618j93002k02905p024j98740k80560
$$ y = [-11702, 17650, -114902, -161961, -103952, 162146, 25641, -95426, -72237, 41223, 131651, 177285, 172062, 112462, 103771, 40337, 45137, 47225, 84427, 105479, 121316, 137066, 185499, 224210, 241772, 362855, 325055, 190244, 17799, -32195, 21201, 74338, 30083, -98964, -122339, 9803, 157106, 281075, 387104, 456538, 502846, 492607, 723195, 767286, 627853, 472962, 451358, 418145, 169348, 77566, 215643, 495646, 893721, 1287088, 1333088, 1359571, 1209017, 1051878, 906454, 837798, 959854, 1135406, 1249201, 1302334, 1435854, 1715934, 1825896, 1703167, 1581822, 1481066, 1276874, 1249955, 1239736, 1297469, 1302767, 1347515, 1520897, 1536148, 1509441, 1496823, 1303821, 1100916, 1093892, 895152, 614592]
10134F14592k06331n9313J37018K75504K06705k23669k55111J2314Q7822o4276
10124E25255j05445n7448j01202K481L9691M0859k0183J4999j3300k49044j19001
10113d2338n1555k9548J18141K0142k8043p164l7994N645Q2473J75129N3871r2522
10101A66237R1363p6626N0469O7959K7704R8120J6978j79252k65086p8616j15715
10090a96465J09025J07080J30114p83M0202M3252O3902q1490P7986j2407p7303
10079B03113k20508O0693J35544O0927o1415O2647m0164l21909j29311j2584J60564
10068a02403P6883o7931n8711j83101J28041k705j09188k23082J07909L20863
10058a13425K56549m6321k1730J04891j5387j2273j13128J164j16706l3556J04512
$$ y = [614592, 408261, 348948, 485966, 761470, 968175, 744506, 489395, 501709, 589531, 525255, 419810, 362362, 261160, 263641, 303332, 344191, 324008, 339007, 325707, 76663, -42338, -93893, -123441, -5300, 14842, -13201, -20365, -58359, -52714, 29759, 204888, 258759, 166237, 257600, 180974, 231443, 299402, 327106, 425226, 442204, 262952, -2134, -80750, -196465, -87440, 19640, 149754, 148971, 189173, 232425, 296327, 214837, 292823, 280416, 203113, -17395, 43298, 178842, 239769, 178354, 241001, 200837, -121072, -250383, -262967, -102403, -25520, -93451, -152162, -335263, -207222, -209927, -319115, -542197, -434288, -113425, 143124, 96803, 75073, 179964, 164577, 152304, 39176, 40340, -76366, -109922, -5410]
10047e410j9641K0138K49530P4190j52012q9640k6301j94802j55672O9647R4816
10036a35157J12814J22306j49666k68874n293L08384J91596r5034p2435l2829
10026b4188j26503J16567K4709K50632J8490k92254M6235P8885k1984j18500l873
10015e1784J73967P086p1228q2747n7102J01053K48579N9003j39173k82255j68386
10004b62987J14538J24361j9511q211J188J02533N2866j12480J80079p1310l4242
9993F6824Q2306j8372j16127J43661P4684l7429k2875p3758K0897J3667m050J34988
9981B64416J8845j58311j50057p2940J64272J22961N3341L2539n4168k7028m4177
9970A49693j30846j6918M2296n1212j16472j11460J2195J2241J72110k946J05422
$$ y = [-5410, -25051, -4913, 244617, 318807, 166795, 77155, 50854, -143948, -299620, -229973, -135157, -22343, 99963, -49703, -318577, -323870, -15486, 176110, 81076, 8641, -24188, -150691, -34124, -9415, 241217, 259707, -32547, 13688, 92573, 70589, -47911, -51784, 122183, 129269, 58041, -24706, -81808, 19245, 267824, 326827, 187654, -94601, -262987, -148449, -24088, -43599, -51810, -50622, 51911, 104777, -7703, 172376, 101066, 66824, 149130, 130758, 14631, 158292, 232976, 195547, 172672, 98914, 119811, 133478, 129428, 264416, 283261, 124950, -25107, -98047, 66225, 189186, 242527, 275066, 220898, 193870, 149693, 18847, 1929, 44225, -6987, -123459, -234919, -222724, -210483, -38373, -41319, 64103]
9959F4103J3619J0690J656n7870K302J9585Q273L1206R3720N6830n7115j45630
9947D1369o9311j52696j48718R4329o3589J7324J22593O8548R8744J31067j45403
9936e743j16300O3211R3915o804j8860q6516o6565K23688J64846k7236j85560
9925C2076L9921J33408j22403q9348j36308M198J65923J15087P2249q732l5220
9914A70851n7008k11980j24483P4882J60285j1072J9948k017P301l7954O3283
9903E2036o5947o747r0436q5850r7349M4520J55034K61911o3787j49137j13723
9892a59475Q5115K16514J77195q4205j09243j19477O8383K9765P0199l958j39301
9881C1512n982n8072j26275o0613n3493J601O7152J28937Q7058p1221o5013Q2389
$$ y = [64103, 77722, 88412, 90068, 32198, 34500, 54085, 62358, 93564, 187284, 244114, 186999, 41369, -27942, -180638, -329356, -235027, -298616, -281292, -158699, -90151, 8593, 139660, -5743, -122043, -58832, 35083, 28279, 9419, -77097, -143662, 80026, 244872, 217636, 32076, 71997, 205405, 83002, -6346, -142654, -138456, 27467, 142554, 214803, 206071, 170851, 113843, -98137, -222620, -147738, 12547, 1475, 21423, 19406, 26707, -11247, 52036, -13911, -20658, -111094, -196944, -294293, -249773, -94739, 167172, 103385, -45752, -159475, -74360, 142154, 319349, 235144, 125901, 6424, 74807, 104572, 174771, 170813, 31512, 25530, -32542, -158817, -219430, -272923, -271322, -204170, -75233, 11825, -59396, -124409, -42020]
9869d2020l5965q0182J6408k508R044K46960L5138J62502N9543j96853m7227j0902
9857A13938k6799q8424q5110O1419J40446j18129o3788j8154p0028J5598j6235
9846a55266J13500j04867j36845J03386J43101j31576j7199O1950J68327j2935
9836C1576m6294J01169N326r9883l7613n1530j05994j82805O0277P6480J41733
9825a07558R8487J86677J61803L2709k15821j53088l9022j86805R51J06598j400
9814a16469M8756J77009K6172p4202K481j16866m1120J09614p0679N0476N8596
9803E3768O7074K5618q2503p3110j12653j23721j0269J79768k1020J22533J6018
9792D1503N8492P309Q9663N6796n8314j89766L4121r3414j9663j44743L0186L29609
$$ y = [-42020, -77985, -158167, -141759, -144267, -135223, 111737, 146875, 309377, 368920, 172067, 124840, 113938, 87139, -1285, -86395, -24976, 115470, -2659, -66447, -84601, -154629, -139031, -155266, -41766, -146633, -283478, -180092, -36991, -168567, -185766, -123816, 44511, 31576, -14718, 86451, 91777, -8106, -45719, -97249, -203243, -386048, -325771, -249291, -107558, -9071, 177606, 339409, 372118, 156297, 3209, -35813, -222618, -221667, -115069, -116469, -67713, 109296, 135468, 61266, 63747, -53119, -94239, 15375, -55304, -4828, 53768, 120842, 146460, 63957, -9153, -121806, -245527, -255796, -76028, -97048, 25485, 41503, 99995, 107304, 196967, 253763, 195449, 5683, 39804, -53610, -73273, -218016, -187830, 141779]
9780A41779K9559L8918m1425j1680Q7028J42693n1435j8360j50324l0694R0814
9769B26873L5593j04177p974O6476j02453j30862r5956P8261M9090p9204k0072
9758h4405O0564l2546m4324P4208q9192q6302j3934P1526J37595m425L0513l4811
9746a5533L1312n3372k18102l6978K91536J00743j61036R9951R1176n3170P1083
9735A47610j3357k29790j23515l6313M1951m0925P6278J09558Q2610q9022j0565
9724h5480p7476p691N0441J50788J33507m603m3545j65660l3922R0002J43334
9713A49695K15878J41485j05854j36187j37704l8390M5330K5609R389L7219K4749
9702B31219k09685j75194n7154J55517J52755m4805J6515M2430O1423o6713q3501
$$ y = [141779, 171338, 210256, 168831, 157151, 244179, 386872, 335437, 317077, 166753, 136059, 226873, 262466, 158289, 150315, 216791, 114338, -16524, -112480, -34219, 14871, -64333, -84405, -23841, -56387, -100711, -26503, -115695, -201997, -215931, -144405, -6810, -11235, 19278, -15533, 15779, -37593, -255695, -292673, -1137, 99606, -61430, 38521, 129697, 76527, 147610, 134253, -95537, -219052, -255365, -213414, -254339, -178061, -68503, 14107, -74915, -85480, -162956, -170647, -120206, 30582, 164089, 159486, 115941, -49719, -83641, 6361, 149695, 365573, 507058, 401204, 265017, 127313, 88923, 134253, 159862, 169251, 206470, 231219, 21534, -153660, -210814, -55297, 97458, 52653, 69168, 111598, 173021, 106308, 22807]
9691B2807j60714q9122n78R2088J26183J15825j64933j17182m2296l3156j5921
9680b66999J12130J62443j2272j12210m3219J4985N6043J43310R373m7959j22277
9669a06652q0780O4457r4058N4372K6434Q9898K0585N1478l9088j21424j56295
9658b91073O2123K52874K21071Q2836K47958L78348N28665K37355k56999m41504
9648A021654n46212k72696p9568Q7953J9202j4458j61001n7941m9672j87455j68387
9637d08581J46151J92307M1308L6227n682k33537P1960O6343J87932J28221j98952
9626B3697j48789J8238J62138M3571M2308j64888j86004Q9117Q5843O071J23070
9615I4372j1887j54323M2319K58358l3941j74677j94857k06536j97405P0277J75689
$$ y = [22807, -137907, -227029, -227607, -135519, -9336, 106489, -58444, -175626, -217922, -251078, -266999, -154869, 7574, -4698, -116908, -160127, -145142, -89099, 54211, 63584, 15625, -106652, -187432, -122975, -217033, -162661, -136227, -46329, -25744, 25734, -13354, -134778, -291073, -228950, 23924, 244995, 327831, 575789, 954137, 1482802, 1720157, 1463158, 1021654, 475442, 202746, 123178, 211131, 230333, 215875, 54874, -3067, -52739, -240194, -408581, -262430, -70123, -28815, 7412, 1730, -231807, -159847, -93504, 94428, 222649, 23697, -125092, -106854, 55284, 98855, 141163, -23725, -209729, -120612, -34769, -28698, 94372, 82485, -71838, -29519, 228839, 194898, 20221, -174636, -381172, -578577, -508300, -332611]
9604c32611J50226J91032K70000M6244k48145m5109P5452m7827L1501O7943j6948
9593A41758j34316j02326Q4517J28039N6524l427k12856l09147q993K84008J92520
9582A16301r4919l5711K4794m8055n2229K17663J18417j30359l8481o5350j53281
9571a41210n7570J31221n1409K7436j3448j95478Q9847M7360m5703N5233N5614
9560i8107O2109Q3569J45926l1812J7097k00237o7606J16985J15648j35394r9808
9549i1630o5465J83456J36655n5402l757j21793J07327Q818m2228o8617L9380
9538B6744k8418j44513q394J42130O9543j22963j5364N7222J83626Q1962o219
9527B35356j07276o4737Q7458L2396j62795j43604J70988Q8972k0984n4284k06317
$$ y = [-332611, -182385, 8647, 278647, 324891, 76746, 31637, 107089, 59262, 90763, 158706, 141758, 7442, -94884, -10367, 117672, 174196, 170769, -42087, -351234, -360227, -76219, 116301, 21382, -14329, 10465, -37590, -89819, 127844, 246261, 115902, 77421, 12071, -141210, -198780, -67559, -118968, -91532, -104980, -300458, -210611, -163251, -208954, -153721, -98107, -35998, 47571, 193497, 161685, 178782, -21455, -89061, 27924, 143572, 8178, -91630, -157095, 26361, 163016, 107614, 103857, -17936, 89391, 98209, 55981, -12636, 26744, -1674, -146187, -154581, -12451, 57092, -65871, -81235, -24013, 159613, 241575, 235356, 128080, 63343, 150801, 183197, 20402, -123202, 47786, 136758, 115774, 61490, -144827]
9516a44827j96445Q2689J98097J68343J70080p8538j10928M4843J26730J887p0862
9505A91069j61857j09812J91791O8433P8960j2142j75812O5542J0037Q2752k14997
9494A3964k14233o8644L982O1812J87151P9574q9846j48633L94R8990j3474J1076
9482g7887N040O8626J53277j54562r2714J73724N8924j27373o0606K0091l7934
9471g1394p7111J69867m3616q4083n6217L8476O1920K25779j27324q5520l3738
9460h2961p0679o2916R0555J11830o228p1533N3143J9172M9527j12117J33685
9449E1478K53566j8161j43777j69259K0581j3369j29750n6695R4537J08320K42514
9438B39985K3451j36824j89126J4829l0441N6414j31387p0592p2218M3405L2665
$$ y = [-144827, -341272, -258583, -60486, 107857, 277937, 199399, 88471, 133314, 260044, 261931, 191069, 29212, -80600, 111191, 179624, 258584, 246442, 70630, 136172, 146209, 228961, 13964, -200269, -268913, -264931, -203119, -15968, 63606, -26240, -174873, -174479, -75489, -88963, -77887, -72847, -4221, 149056, -5506, -98220, 75504, 134428, 7055, -53551, -33460, -71394, -148505, 21362, -22254, -106337, -162554, -124078, -62158, 163621, 36297, -49223, -82961, -153640, -216556, -126001, -14171, -20399, -91932, -38789, -19617, 29910, -82207, 51478, 305044, 286883, 143106, -26153, -5572, -18941, -148691, -205386, -110849, -2529, 239985, 263436, 126612, -62514, -47685, -78126, -21712, -153099, -223691, -295909, -252504, -219839]
9427b19839O766l8174l5272J53198J84522Q9168r6106j12421J9069J32253J43962
9416B27126j27947r426J08033K9233l2725P6893p8261J2252j01120k15100m3858
9405a54900M0965J11591N6907L9559j7424j9903J16087p9569n570l6264j3411
9394C8068J39849j17489k13074p517K22269J24129l04578r1474j0541L4929O0435
9383a24994j8558J6312k1588K28292J25230l8282k63208K1135K75965J93246p8384
9372C15166k37805K4300O97r3041K4956k84657J28334J20454J3974M3987O5437
9361A21802N9299J33999J49278o3011l756j9566r9954o7281KK01171r7369l00746
9349A3868j01043J19617R9374M9461o4334q4818J15591j81333L8607K09760n1374
$$ y = [-219839, -213073, -251247, -286519, -133321, 51201, 140369, 44263, -68158, -49089, 83164, 227126, 99179, 89753, 197786, 227019, 194294, 271187, 192926, 205178, 104058, -111042, -154900, -113935, -2344, 54563, 94122, 76698, 56795, 172882, 93313, 87743, 51479, 38068, 177917, 60428, -152646, -160163, 62106, 186235, -118343, -209817, -220358, -185429, -124994, -143552, -127240, -148828, 79464, 204694, 166412, -96796, -75661, 200304, 393550, 315166, 77361, 101661, 102358, 9317, 34273, -250384, -122050, -1596, 12378, 56365, 121802, 181101, 315100, 464378, 401367, 397611, 378045, 278091, 210810, 210812, 411983, 314614, 13868, -87175, 32442, 131816, 181277, 116943, 32125, 147716, -33617, 4990, 214750, 163376]
9338A63376j14684k2626M5628p8938M4235Q3060j43705k04533n8728R8513L1695
9327a56707R6323o9418k4595o9241J68733L16505O1198k01330l5743P4175j35603
9316B4297j02274k0057l0311K6032j17702O299L8517P9074o9599J02540O5548
9305B364m7186J6887M4038m6326m2663L3096M2329m0402J60575N1938R691j31522
9293E2819j43448j54295j3784m9102J99731L4243k8127K5194m3603P4306R8267
9282E2201O9632R739r3555n1453J85014J07186k00484N5003J56243m579O9883
9271C54830L3286k00872j43134j4102M9149j6384Q0969P5275Q1795J174K2013
9260C23999j38330L0497k10517q2909P780J54197Q8288k8121K797O7368l356j04059
$$ y = [163376, 48692, 26066, 71694, -7244, 36991, 120051, -23654, -228187, -286915, -188402, -156707, -60384, -129802, -154397, -223638, -54905, 261600, 322798, 121468, 85725, 159900, 24297, -77977, -98034, -128345, -102313, -220015, -213716, -175199, -96125, -165724, -63184, 2364, -44822, -27935, 16103, -30223, -72886, -39790, 2539, -37863, 122712, 174650, 184341, 52819, -90629, -244924, -258708, -307810, -108079, -73836, -101963, -76769, -120372, -46066, 52201, 121833, 131572, 38017, -13436, 171578, 278764, 78280, 133283, 289526, 284947, 354830, 388116, 187244, 44110, 30008, 79157, 62773, 143742, 219017, 300812, 301986, 323999, 185669, 216166, 5649, -77260, -69480, 84717, 173005, 144884, 147681, 215049, 211693, 107634]
9248A07634j20616J53432O0488j4552j1053n8915J75755p121j40261R8884o3945
9237A79730J01538q9098k13196q9224J96145J28235Q5122n4751l019J5165l2678
9226B23969m7111m8447J18464J47191n6997m7719n5344p4135J127o5526j23243
9215b7771j68097R8182k2608M348N5755R1424J26768Q3856j55340l0062J00532
9204A56987J30085j28994p3349Q7313J3821p4543L0218j60302r1521o2741K24119
9193E1093K14476j12173j90591N249O5421R532M3854K25841j84849n9666l7462
9182C0725m7550J57081J65618j08149k901q9370l5212Q851k18111r5213J48604
9171h5627K36187L4363j27491p1635L595r0222J8087P3277J48807P0162J05544
$$ y = [107634, -12982, 140450, 200938, 186386, 175333, 116418, 292173, 285052, 144791, 243675, 179730, 281268, 192170, -21026, -110250, 85895, 214130, 299252, 244501, 241482, 256647, 223969, 176858, 128411, 246875, 394066, 337069, 289350, 234006, 159871, 160998, 95472, -27771, -195868, -97686, -120294, -115946, -60191, 31233, 158001, 241857, 86517, 56455, 156987, 287072, 158078, 84729, 172042, 185863, 111320, 141538, -18764, -110285, -173026, 51093, 265569, 153396, -37195, -31946, 33475, 43007, 86861, 312702, 127853, 68187, 30725, -16825, 140256, 305874, 197725, 194824, 105454, 70242, 79093, -139018, -234231, -85627, 150560, 184923, 57432, -14203, -10608, -100830, -82743, -9466, 139341, 209503, 315047]
9160C15047k3050j01218n9378j45138n9001J17337J29011q1045J8580J31379J5449
9149B57973j40561K6736J16078m5153M4067L2339j8853l9285j63132j45044R091
9138f5744K16235O3367j65008k17631P8999K49192M4310n3180n8537l0529L8390
9127I9864O4855j40167l2154P5054r3205J14273K91520L9450p291j54088k56646
9116A465k86944J32173J68371J00549k7862p9353n3664O4667Q1494P9199q0629
9105I9466j6117L2767O5339j07897j56649q3291j3041j8180J5885j8683P6874
9094a23527J67124K9001p8645q1679Q7781k2804J4837J02572n7573J38673J57497
9083C33257k2607j11191r7557l385r9169n4422M4277r587o2396j0285m7580q3290
$$ y = [315047, 291997, 190779, 131401, -13737, -72738, 44599, 173610, 92565, 111145, 242524, 257973, 117412, 144148, 260226, 215073, 259140, 291479, 272626, 233341, 70209, -74835, -65744, 150491, 213858, 48850, -168781, -89782, 159410, 203720, 150540, 92003, 61474, 99864, 164719, 24552, -7602, 67452, -25753, 88520, 380040, 419490, 412199, 258111, 1465, -285479, -153306, 15065, 115614, 87752, 8399, -45265, 19402, 100896, 180095, 99466, 83349, 116116, 181455, 73558, -83091, -166382, -179423, -197603, -181718, -200401, -123527, 43597, 72598, -6047, -87726, 55, -22749, -7912, 94660, 37087, 175760, 333257, 310650, 199459, 101902, 98517, -652, -55074, -10797, -20384, -82780, -93065, -140645, -223935]
9071b23935O5688O2557Q2074J52944o4507q9216J9464J17848J08467k9062j03063
9060I9259Q0153O1910o4372P4059K03876p6483k83191p6463O1976j7716p8875
9049a5867K4825J30401k2248O765J9329K1453M5146K4368L962m8287O4106Q3039
9037C36992j07634k19871M9508J40529m9710r5586m4139l4380j4761O0012k9238
9026h278p1465n8291J11484n9718J63600m3645L4649P5406l3342j29505n3431
9015g2536p5779n3428P700R5635Q8346J07233M4164L1688j23401k3509L2609Q3127
9003A41849J06787l1763k8031J04867p4474k8543J06539m6749o6032J22460m0513
8992B66397p8876J1917j2152O531p924J6511j45913J03322M839m6650n6425j17400
$$ y = [-223935, -158247, -95690, -13616, 139328, 74821, -14395, 5069, 122917, 231384, 202322, 99259, 179412, 241322, 176950, 251009, 454885, 378402, 95211, 18748, 80724, 63008, -15867, 8958, 139359, 117111, 123876, 143205, 164658, 209804, 234172, 238134, 189847, 253953, 336992, 229358, 9487, 58995, 199524, 149814, 54228, 10089, -24291, -39052, 20960, -8278, -79743, -138034, -26550, -86268, 77332, 33687, 68336, 143742, 110400, -19105, -72536, -148315, -201743, -194043, -98408, -10062, 97171, 141335, 173023, 49622, 26113, 58722, 141849, 248636, 216873, 188842, 293709, 219235, 190692, 297231, 250482, 184450, 306910, 266397, 187521, 199438, 187286, 193817, 185893, 202404, 56491, 159813, 164652, 118002, 61577, -55823]
8980e5823K09233M1478j02847L1170o5544m0715J2426K016l906J71697K9088k66909
8968c8636k33548K053R5946J43943J2133Q5698N4948P2779J39867j37141j17969
8957H0073o9056O1689J11357p2215k7148N7392P9453k5307r2957R957n19j01065
8945A1654J3105Q1009o5191N73J00471r8534O9104k0672j485R2202Q5438j5588
8933B52086k7952k42411N290k3456J02824J1193j25880j7375j2452n3708L9143
8922i2698M5912n1561O9176K11676M2615r829j99320j39591q2232M4996J05515
8911e5341P9099L6705J37079K0234n2568J22957J59233k06445o5098j53247k24660
8900b02052J21353R6324m8012j1205j6143J79346l7014j20045J5017l4833j9291
$$ y = [-55823, 153410, 194888, 92041, 123211, 57667, 16952, 29378, 31394, 27488, 199185, 228273, -38636, -272184, -270131, -174185, -30242, -18109, 67589, 122537, 195316, 335183, 198042, 80073, 11017, 72706, 184063, 111848, 84700, 142092, 221545, 196238, 103281, 113238, 112719, 11654, 24759, 105768, 40577, 41150, 141621, 43087, 112191, 91519, 90034, 182236, 267674, 252086, 224134, -18277, -12987, -36443, 66381, 77574, -48306, -65681, -78133, -131841, -92698, -46786, -98347, -29171, 182505, 225120, 215291, 15971, -123620, -205852, -160856, -55341, 23758, 60463, 197542, 217776, 165208, 288165, 447398, 240953, 175855, 22608, -202052, -80699, 15625, -32387, -43592, -59735, 119611, 82597, -37448, -22431, -57264, -76555]
8889g6555j80066m8522R7694J78949J12367O661l514J19855l3923q3920m2299
8878D6727J12431J23863l8242n3629k07408k582o8317Q4531K3851j26136M3027
8867f1884L0917J9538p3440k05139k0544J59871R737m3019O9461K31894Q1609
8856A99001n8751j21300J3170P0464l849q234l41547j19656J72257R4117P3992
8845c0336L6348J75627Q3419J8193j142J09906J13523r5586q3781j37361j28535
8834F0275r2604j8526N0528j0566J00124K5896j01176Q641J60355j930j86214
8823e197k00M8827j31044q8312n1139J74820J18711J08696J65132k6867j10997
8812B02430j93313J57282J71325J36384m1805j61594q7939j74340k6090l4121
$$ y = [-76555, -256621, -305143, -207449, -28500, 83867, 90528, 87014, 206869, 172946, 89026, 46727, 159158, 283021, 244779, 191150, -16258, -18840, -87157, -2626, 21225, -104911, -61884, -30967, -11429, -84869, -290008, -310552, -150681, -140944, -183963, -114502, 117392, 199001, 140250, 18950, 32120, 102584, 98735, 90501, -251046, -370702, -198445, -104328, -30336, 6012, 181639, 265058, 283251, 282109, 392015, 505538, 409952, 326171, 188810, 60275, -32329, -50855, -327, -10893, 89231, 115127, 13951, 22592, 182947, 181017, -5197, -5397, 43430, -87614, -175926, -227065, -52245, 66466, 175162, 340294, 313427, 202430, 9117, 166399, 337724, 474108, 432303, 270709, 182770, 8430, -17660, -51781]
8802e1781n4291o6252J35043J12255N5339M8187J40618q798j19798N0685k7876
8791B13331L0446j86459o1955M4829k2299m9978L03228R9662J1500J46428J17668
8780F46401m4368j17037j2247q0908j35994K6452J21815j54021r7424l3621J20703
8769B39751k5624j50136k5793J4015L3756M4210M9196j15069j88398R8155J692
8758b4245j4429O4942O9060J90285K2702j94437o7921J58850q0292n6411J73266
8747B41370j03291r5712q0393l4405J11410j7013k6840N7959j1288O384L4982
8736H3163L8726k0952o9086J33652M0713q5230j02272N3256P3527R1195J3939
8725B50631L7708n105l3546M9003n7536M8143j49874J709m6665J33645m433L9682
$$ y = [-51781, -106072, -172324, -37281, 74974, 130313, 178500, 319118, 310320, 190522, 241207, 213331, 243777, 57318, -4637, 40192, 17893, -32085, 271143, 370805, 382305, 528733, 646401, 602033, 484996, 472749, 391841, 255847, 282299, 404114, 250093, 152669, 119048, 239751, 214127, 63991, 38198, 52213, 85969, 130179, 179375, 64306, -124092, -25937, -24245, -38674, 26268, 95328, 285613, 308315, 113878, 45957, 204807, 124515, 68104, 241370, 138079, 42367, -38026, -72431, 38979, 21966, -4874, 53085, 41797, 48181, 83163, 121889, 100937, 31851, 165503, 206216, 120986, 18714, 71970, 145497, 236692, 250631, 288339, 283234, 249688, 298691, 241155, 289298, 139424, 141133, 94468, 228113, 223680, 263362]
8713B63362J57646L2824j61119r976r4957r8314o7579j10705J61923J70922q9221
8702A54806p1363r7267l5852R1737O0205M9561j929N6350j2331k7783J63343j9002
8690C10475M1707P817J27959l1124j40465J01339K2342L6693L1295l2872p1198
8679D03968k2339J68064J22002k31050j76775k216m3110l438p713M3658Q7338
8668C38389j1328Q6181J68175O4522J04749J19223K0825n7675j57913j05601l0278
8657E39269n4765p958j10249K7497R8248n3003j31957J83454J73221K3070j57769
8646E29058k54571N6807O0102j7202k8356J57216R5501J85761K9265r5013l22082
8635C96486p5307J36231R6940R4325J62645R4514J22036k58477k14857J370L6656
$$ y = [263362, 421008, 453832, 292713, 282737, 187780, 89466, 21887, -88818, 73105, 244027, 154806, 83443, -13824, -49676, 42061, 102266, 151827, 149898, 206248, 193917, 166134, 329477, 310475, 352182, 359999, 487958, 456834, 316369, 417708, 440050, 476743, 508038, 475166, 403968, 381629, 549693, 671695, 440645, 263870, 261654, 218544, 215106, 207393, 251051, 338389, 327061, 413242, 581417, 645939, 750688, 869911, 890736, 833061, 675148, 569547, 539269, 484504, 476546, 366297, 393794, 492042, 439039, 307082, 490536, 663757, 686827, 529058, 274487, 331294, 391396, 374194, 345838, 503054, 598555, 784316, 813581, 718568, 396486, 321179, 457410, 554350, 648675, 811320, 905834, 1027870, 769393, 554536, 555906, 592562]
8624E92562P1342J87378R627j20611j24772P8470K15764J0550n4948q7775j43052
8613F34535J31565O5201j22061n5896J47601K03824J06356j22350p614K20976
8603A202137O0198j59844M7036K84489K79304L840J18331J10495L15203J70313
8593B431502J31041M38324M35258K14112L66574M49141O12837N69428K74572k9598
8583E893191J30580N0349l03020l69067o42508n34562l93000k53292l18801m09372
8573B850498k42020l13712k62000j87840j43179j17523r5599j57973j82754p9839
8563A068059n0751r6911K1509o0249O7682j4346k25100J01399J4579j35499k2882
8552F67490J29330N4699n6132j60691j78625j6225Q0536j9379l6959K25031J57011
$$ y = [592562, 663904, 851282, 860909, 740298, 615526, 693996, 909760, 920310, 865362, 777587, 634535, 766100, 831301, 709240, 653344, 800945, 1004769, 1111125, 988775, 981161, 1202137, 1262335, 1102491, 1149527, 1434016, 1713320, 1717160, 1835491, 1945986, 2261189, 2431502, 2562543, 3000867, 3436125, 3650237, 4016811, 4465952, 5078789, 5648217, 5922789, 5893191, 6023771, 6074120, 5771100, 5402033, 4759525, 4224963, 3831963, 3578671, 3259870, 2850498, 2608478, 2294766, 2032766, 1844926, 1701747, 1584224, 1488625, 1330652, 1147898, 1068059, 1017308, 920397, 941906, 881657, 949339, 934993, 709893, 811292, 825871, 690372, 667490, 796820, 851519, 795387, 634696, 456071, 439846, 520382, 501003, 464044, 689075, 846086]
8541H46086j13360j23697j56706J4594r5554Q8834K27758k9367k90105j55393
8531B13090q6410J59784N0134L0451J37579k3334k09380p4011J46572J06140r6798
8520C53817j23995J8369m9265K8628J12636R6544K9365k3258p32J8728q5877P3481
8508D48441r5824J01884K9101N801J11396q1358j07666r225j95629j65921j8015
8497B2985p9428Q7583J72638J13677J76876Q0865j13138r6486r2213M4361J5902
8486C33622m5857l0543j80256p8640O4516R5949o693N1033m1736N6403j21150
8475I6648q2573L3527o113r3885J58193K81445R5416k6544k39731M979Q0798o3929
8463B38231n6445O0073J29230J86429P2219k1697n3329L5780l9861k41297j42186
$$ y = [846086, 732726, 609029, 452323, 466917, 371363, 460197, 687955, 658588, 368483, 213090, 126680, 286464, 336598, 367049, 504628, 481294, 271914, 197903, 344475, 450615, 353817, 229822, 248191, 198926, 227554, 340190, 436734, 466099, 442841, 442109, 460837, 374960, 448441, 352617, 454501, 483602, 489403, 600799, 519441, 411775, 402550, 206921, 41000, 22985, -56443, 31140, 203778, 317455, 494331, 575196, 462058, 365572, 273359, 317720, 333622, 287765, 257222, 76966, -1674, 62842, 158791, 152098, 203131, 161395, 217798, 96648, 14075, 47602, 41489, -52396, 105797, 387242, 482658, 456114, 216383, 221362, 302160, 238231, 181786, 241859, 371089, 557518, 629737, 608040, 554711, 590491, 550630, 309333, 167147]
8452A67147Q9207n7557j43068L919J29030O7350o2677L1147K6617N2486l5409
8441B68192o2866M769K5282Q2081n9207m0942o5340j12102Q0163Q5462K2793q9561
8429A38724p3494M0039N214J63301J68150M0439J19197k52354j49178K63011J88338
8418F51387p7194k00920M7354q5237m7025M0158J47243O3199l6410r4106j53592
8407B54857k35500O5892J04830j00297j29305r33R4665J1151M1575m618q7700
8396A4617j22154M785N7615K6067m6560P8400R7301m0898j09843J5114J33066
8385A07510O8681J24309j5200r9256l8256j02257j07965J9927J88340K25447m0294
8374C30986n9521M1513N2913o5465p3591k0623J20997j22471k02640r0171k450
$$ y = [167147, 256354, 198797, 55729, 59648, 188678, 256028, 193351, 224498, 251115, 303601, 268192, 205326, 210095, 235377, 317458, 258251, 217309, 151969, 39867, 120030, 205492, 228285, 138724, 65230, 105269, 110483, 273784, 441934, 482373, 601570, 349216, 200038, 463049, 651387, 574193, 373273, 420627, 335390, 288365, 328523, 475766, 538965, 502555, 408449, 254857, 19357, 85249, 190079, 89782, -39523, -40456, 54209, 65360, 106935, 102317, 14617, -107537, -102752, -45137, -19070, -65630, 12770, 110071, 69173, -40670, -25556, 107510, 176191, 300500, 285300, 186044, 147788, 45531, -62434, -42507, 145833, 371280, 330986, 271465, 312978, 365891, 300426, 226835, 206212, 327209, 204738, 2098, -88073, -90523]
8363i0523J64630R231J01618J6173J96741j2792j92008k16879j15485J60222J91978
8352B12906J5123O9281o5574j36074J7233J11471l7162j8413J3388m7254k14364
8341g9439r8168J11142J90809p804k04197j42941J36508J69316L7388P958N4717
8330A75289J7850r2733l2212J7764k3898j28144L1668K9521J69887J48947J24869
8319D38808j17429o7547m281l9348M2181R227r3250k68771K5292J73507n8819
8308C9570N6540j01600o3834K755p1825P6236J06728q121j23816J21591l1405
8297B819j44885J98317J70677L7006n4094J12969j78686j21582R3621K24421r668
8286C30915j44305l2567M1712p375N4263j887j83304M4029q4164J2890J78770
$$ y = [-90523, 74107, 83338, 184956, 201129, 397870, 385078, 193070, -23809, -139294, 20928, 212906, 228029, 297310, 231736, 95662, 112895, 224366, 187204, 168791, 182179, 134925, -79439, -177607, -66465, 124344, 116540, -87657, -230598, -94090, 75226, 112614, 120572, 175289, 193139, 100406, 68194, 85958, 62060, -66084, -34416, -4895, 164992, 313939, 438808, 321379, 253832, 249551, 210203, 252384, 261611, 168361, -100410, -75118, 98389, 39570, 96110, -5490, -69324, -66569, -138394, -62158, 44570, 36449, -87367, 34224, 2819, -142066, 56251, 226928, 263934, 209840, 322809, 144123, 22541, 116162, 340583, 330915, 186610, 154043, 195755, 188380, 242643, 240756, 57452, 101481, 17317, 30207, 208977]
8275B08977n1264j76815K8940J94536N1875Q9142l308j65428p3418Q7872J39532
8264C30641K112N3072q7289q8996k7637J7286k6443Q8470q1064j93303j02697
8253a15848O4298L7228R9002K4728k4789m7591r3029L2312P3954M009J04545n8496
8241A00323J43397l734r6715L0547r0196k57834M3787K70428J93303j16979j24808
8230I1519m0133J45783K9213p1153p3365q6198N6018K6255P6352J35141L158q8535
8218B04055j30088o0841j93696P0940K4629K7095Q560R9772o1110j77928J1809
8207a76803q0305j31556j5082O7697j43648N3139J52520J29308P3392m7118n2031
8196a70487k8909J16192J08683J00080j58097j1448n7615L370J46153R3035K6667
$$ y = [208977, 157713, -19102, 9838, 204374, 256249, 345391, 342083, 176655, 103237, 191109, 330641, 332753, 385825, 298536, 209540, 181903, 199189, 172746, 261216, 180152, -13151, -115848, -51550, -14322, 84680, 109408, 84619, 37028, -56001, -23689, 50265, 54274, 158819, 100323, 243720, 239986, 143271, 173818, 83622, -174212, -130425, 140003, 333306, 216327, 91519, 51386, 197169, 226382, 155229, 81864, -4334, 51684, 77939, 154291, 289432, 292590, 204055, 73967, 13126, -180570, -109630, -85001, -57906, -49346, 50426, -10684, -188612, -176803, -257108, -388664, -403746, -336049, -479697, -426558, -274038, -144730, -71338, -118456, -170487, -199396, -83204, 25479, 125559, -32538, -43986, -101601, -98231, 47922, 140957, 167624]
8185A67624N1067n5845n9131p8023n2799k74043j52673R3238J36159K44606Q1067
8174A01247n206m3955J3490r2181M7126R4006j45212n3774j25772P6092j9706
8163a53845m1820O0648J39208L4062n4941N7847q0613r2468M7491p0248J75891
8152B1212n7670q8605R5185q7734r4497J14413o1171j22935J38651K29443L3246
8141A19538q4133j29919n6082j4782M9803J15057J4067l7002p0372K1072K8296
8130d4457Q6953J8613O4542J01440j28898r2860q7534L7052J20376p3462O3743
8119F5508K07619l1070O6704N9032n9586r5570k8941L1912P312J2096j56959l7230
8107D0827l4219K03719k390j74096m8645N6421K40983j28291j54673n5930J00930
$$ y = [167624, 218691, 162846, 103715, 25692, -27107, -301150, -453823, -360585, -224426, 20180, 101247, 96041, 52086, 65576, -26605, 20521, 114527, -30685, -84459, -210231, -134139, -153845, -195665, -135017, 4191, 38253, -16688, 41159, -39454, -131922, -84431, -154679, 21212, -36458, -125063, -29878, -117612, -212109, -97696, -158867, -281802, -143151, 86292, 119538, 35405, -94514, -150596, -165378, -115575, -518, 13549, -23453, -93825, -72753, -44457, 42496, 61109, 125651, 227091, 98193, 5333, -82201, -45149, 75227, 1765, 65508, 273127, 242057, 308761, 367793, 308207, 212637, 183696, 215608, 222920, 235016, 78057, 40827, 6608, 210327, 207937, 33841, -14804, 41617, 282600, 154309, -364, -56294, 44636]
8096D4636Q78n6685K7513J32866L6674j22038K5422J28999j58291Q7846N4279
8085B02099j60320j21636J60110M0210k8578N4283N6312j22915K8468O6017N7020
8074B31070j81987j96940N3876J26712k5902P4910q6990O4784J64331j12116m6406
8063F5342Q6510O6544k0360q9555P3152p827j16039R5074J41979K7308k4354j97557
8051A00217j32754j18442k9212n178M9171K4456J7133J1409o8188J67184R2923
8040A08719J4827J01757N1857r5255N7815j1418J5408j1202K17368M3144j09567
8029C83453j1611p5959o7178J10364J14639K4255J06752j2986r2179K2359O3426
8018E65335Q1677k16251P9187J00252J7607j03723m4493N1175p8668j38114J16856
$$ y = [44636, 45514, -11171, 16342, 149208, 185882, 63844, 89266, 218265, 59974, 147820, 202099, 41779, -79857, 80253, 120463, 91885, 146168, 202480, 79565, 108033, 174050, 231070, 49083, -147857, -93981, 32731, 6829, 81739, -5251, 59533, 223864, 111748, 65342, 151852, 218396, 198036, 108481, 181633, 173806, 57767, 152841, 294820, 322128, 297774, 100217, -32537, -150979, -180191, -185369, -136198, -111742, -94609, -83200, -151388, 15796, 108719, 123546, 225303, 277160, 181905, 239720, 228302, 243710, 232508, 449876, 493020, 383453, 371842, 295883, 228705, 339069, 453708, 477963, 584715, 571729, 479550, 501909, 565335, 647012, 430761, 509948, 610200, 627807, 524084, 479591, 530766, 452098, 313984, 430840]
8007D30840N0516L2965j2897m0686k80248O7456J48427J37596N8457n3277J5169
7996E54318R2305k6814J35562J92824j28762j99952l338N9734m9177m700P0008
7985F92008L135p730J72522Q2271j0784J15090J11961r8976q8065j07954j64283
7974F99195q2127m345n7636m9963K6212J30772q9190j32551l068J59340J94283
7963G90922j57314O1235J90074j38762k43326J06105N8411p4353o6844r4967J45887
7952E77068L270j3660k9545K20640k4198L7391J86921J44373j01961q6830n0015
7941H63454J45764J22567J7091j68375M8914o1479l8439q1895J36977L3733j73196
7930H45116k13906j83556o5520J32057j12495j13351J9211Q5565l3049J03148
$$ y = [430840, 481356, 514321, 501424, 460738, 180490, 247946, 396373, 533969, 592426, 539149, 554318, 646623, 619809, 755371, 948195, 819433, 619481, 616143, 675877, 626700, 622000, 692008, 695143, 687413, 859935, 942206, 931422, 1046512, 1158473, 1059497, 971432, 863478, 699195, 617068, 612723, 555087, 505124, 531336, 662108, 572918, 440367, 437299, 596639, 790922, 633608, 694843, 884917, 746155, 502829, 608934, 667345, 592992, 526148, 431181, 577068, 580338, 566678, 537133, 757773, 733575, 770966, 957887, 1102260, 1000299, 913469, 863454, 1009218, 1131785, 1148876, 980501, 1029415, 967936, 929497, 847602, 984579, 1018312, 845116, 631210, 447654, 382134, 514191, 401696, 288345, 307556, 393121, 360072, 463220]
7920D63220k8234j12422J3274Q8999K579J3516L5431J38001l162r8098q7852p0269
7908C54983R3834J67706K5710J45919K6921k08192J02126o8002j19371o8444p5443
7897C77747j35032M1637K2817Q07m0843M3418j02829q1043L7709K50463p0515
7886C44336p2423R8210p8838K2489j08808p1121j7253q928R9393J1442M8612J44550
7874D11661l8948j42474M5423J6784o823j34112L0066j79q7272j7199M1308r010
7862A09225o7853P8781l3363J17877K02686k2079n5663r5829j21823k1652r2861
7851b554l5143K6016j7850m3743J56765J19538o4633j11589p0617P117J8781L9365
7839B1453O7749J48049j05524j79145R3654L3429m5506Q8698J60951J16819m1084
$$ y = [463220, 434986, 322564, 335838, 424837, 427416, 440932, 476363, 614364, 611202, 513104, 425252, 354983, 448817, 616523, 642233, 788152, 815073, 606881, 709007, 641005, 521634, 453190, 377747, 242715, 284352, 307169, 307976, 267133, 310551, 207722, 126679, 164388, 414851, 344336, 271913, 370123, 291285, 313774, 204966, 133845, 116592, 107664, 207057, 218499, 267111, 411661, 372713, 230239, 275662, 292446, 285623, 151511, 181577, 181398, 94126, 76927, 118235, 109225, 41372, 120153, 86790, 204667, 407353, 385274, 329611, 233782, 111959, 90307, -2554, -37697, -11681, -29531, -73274, 83491, 203029, 138396, 26807, -43810, -36693, -17912, 21453, 89202, 237251, 131727, -47418, 46236, 79665, 34159, 122857, 283808, 400627, 359543]
7828C59543j81033j18984L6866j8855J46227M8438r9272j49478l3741L7820r4608
7817f7077m7949J60282P753J21721j62799N5669K66529P42j17853k4936m3747
7806A48335O064J06963N499l8120Q9163j72253j7501n4162r6667m1085o8879q484
7794a41127M9881J4523M9387J14882O2625r1741q2087j2106j12879O3419J22240
7783C7017J14699j28255q697m7568j91968j20815J33223k0846K9629P4929L4360
7772i4292r5905J0214n3712J7340J25838q3203r3871O3608K25974J31582m7124
7761A06449K6941J46463j5748k6123j46516j21025O8962L8517j09394L215R1387
7750F3128l8338q9141j17140l9092p1409J11668J35865K1609r2033j82893N9545
$$ y = [359543, 178510, 59526, 96392, 77537, 223764, 272202, 172930, 23452, -10289, 27531, -67077, -115026, 45256, 53009, 174730, 11931, 67600, 334129, 334871, 217018, 192082, 148335, 154399, 261362, 266861, 228741, 317904, 145651, 128150, 73988, -22679, -63764, -132643, -141127, -91246, -76723, -27336, 87546, 150171, 58430, -23657, -35763, -148642, -85223, 37017, 151716, 23461, 14764, -32804, -224772, -345587, -212364, -233210, -203581, -128652, -94292, -190197, -179983, -233695, -216355, -90517, -173720, -267591, -203983, 21991, 153573, 106449, 133390, 279853, 264105, 237982, 91466, -29559, 39403, 77920, -31474, -28259, 63128, 24790, -64351, -181491, -220583, -291992, -180324, -44459, -22850, -114883, -297776, -238231]
7739b38231L02417R9018q659j18662Q5393j79201j48160J37722k9044j4279L4651
7728g7035J07323J78820m8548m0844o0608r8267J42810J01773j44216j4505K6117
7717G2820j06335r1405M285Q0358J57546N2898m8740j40513Q731L7427J6778m2732
7705A118N8944r2866J8877M9253r335m4640L859J5046o5656j7506K4040j21058
7693a79924J52093l6637l7292k669N8809L8733J15803o6078m5170m9632p1646
7682a23610n2500J48563M7255j22365p8242N6014J32051N4097J999q5104j24079
7671a45921l0240j32007o622O9204j02134o5681J1176M5666Q631J53873K61843
7660F7788L5928r7234j05478J54754J16533k7866j85112m8327J45659R3545M2147
$$ y = [-238231, 64186, 163204, 154545, 35883, 121276, -57925, -206085, -68363, -97407, -111686, -77035, 30288, 209108, 160560, 119716, 59108, -39159, 103651, 205424, 61208, 46703, 72820, -33515, -124920, -120635, -40277, 117269, 170167, 121427, -19086, -10355, 27072, 43850, 1118, 60062, -32804, -13927, 35326, 25991, -18649, -14790, 256, -65400, -82906, -58866, -179924, -27831, -64468, -101760, -104429, -45620, -6887, 108916, 42838, -2332, -51964, -123610, -176110, -27547, 19708, -102657, -180899, -124885, 7166, 61263, 63262, -21842, -145921, -176161, -308168, -314790, -245586, -347720, -413401, -402225, -356559, -347928, -194055, 67788, 103716, 6482, -98996, 55758, 172291, 144425, -40687, -89014, 56645, 150190, 192337]
7649A92337j38676R269l3236q8573k1186J63372J41884r1012j78768j67113L9762
7638a71940P999O0535N3487R3576p6332o8703n9984r1025O3947j2051K0404R4671
7626h5416j56058L6310Q279p2914O595L34142k7098o434J2602o2325m9156K8291
7614c3182k3824p2699J27905J08058r9902M6269j03359M0496O7629J6904j2780
7603F1515j069p4468q7187j46355j74697K00245Q7002J82104J30612l9949j34914
7592B839r3407m8063O8396J20018J39221q2278P399n8502j30699L571j72796N5397
7580a88904J37534J79616K2180l4564n9350j64527M0554N1061K24406K05618o9955
7569C43669j28599l45476j31921R1638J5202p4832Q292K4879P073J30567l8411
$$ y = [192337, 53661, 62930, 29694, -58879, -80065, 83307, 225191, 134179, -44589, -211702, -171940, -163941, -103406, -49919, 43657, -32675, -101378, -161362, -252387, -188440, -200491, -180087, -85416, -241474, -205164, -196885, -269799, -263204, 70938, 43840, 37406, 50008, -12317, -61473, -33182, -57006, -129705, -1800, 106258, 6356, 52625, -50734, -10238, 57391, 74295, 61515, 60446, -14022, -101209, -247564, -422261, -222016, -135014, 47090, 177702, 137753, 2839, -90568, -138631, -70235, 49783, 189004, 106726, 114125, 55623, -75076, -71505, -244301, -188904, -51370, 128246, 150426, 115862, 56512, -108015, -67461, -16400, 208006, 413624, 343669, 215070, -130406, -262327, -170689, -155487, -230319, -222027, -197148, -190075, -59508, -97919]
7558i7919M4757l6980J12120J6149j47959k14949n0990K98775J19864q602o2609
7547b8343j96704r543m2766J01872J7054J60902j58223J4200O3474J5217O3801
7536I41n0087j4869K1667N6413j23457j20829P2412J96984O1248Q735j60947p1400
7524a23189J17543j44586l9839J2608J31834l7374K4313J7109J96944n1584K4975
7513A28754r240o5030j3371k7000P3463j47817m7642k392Q6090j05958q8944j45091
7501c64178K53313J41938j06677j53016j39096m1722Q7099Q1589J73793m7728
7491a14685Q051P6377j78668J20079K2291j91144k5727P0241J50768k2789m7814
7480a33020j35191l2613j321m817M7313p4227N9183K29223L5452l4177k9497l5556
$$ y = [-97919, -53162, -90142, 21978, 38127, -109832, -324781, -375771, -76996, 42868, 34266, -28343, -225047, -234590, -277356, -175484, -158430, 2472, -155751, -141551, -78077, -62860, 941, -49146, -64015, -42348, 14065, -109392, -230221, -157809, 39175, 100423, 109158, -51789, -123189, -5646, -150232, -190071, -177463, -45629, -83003, -58690, -41581, 155363, 103779, 128754, 119514, 54484, 41113, 14113, 87576, -60241, -107883, -110275, -24185, -130143, -219087, -364178, -110865, 31073, -75604, -228620, -367716, -409438, -322339, -240750, -66957, -114685, -106634, -30257, -208925, -88846, -66555, -257699, -283426, -213185, -62417, -85206, -133020, -268211, -300824, -302145, -306962, -259649, -333876, -274693, -45470, -10018, -44195, -73692, -109248]
7468a09248m6125J34760L9642k09166j13765N7519N272n7977P6872K983J44352
7457g4881K23571P7003k12875j19470p8657j00535R0051Q4945n6722n1020M3155
7446a75435k0882K66822N4223p9677m2099q4816k8743L3016O8407p8554N317j34414
7434b16835j16698o0311Q9924m0583N6433p8782j04509J40653J39544J22924L4751
7423c3489O3879o3218q971q0117k0737N8037J09706N0313l3834j83303J21211
7412b0523O8498p5871k56654j99883K00395J48300K5093j4022L6986j1091p7434
7401a76206N2604K56369P7120P7115M8479q8890q061m7935j60291n1303q3138
7390a04137m266Q5532J86082J66746p3348j88547P3503N0122O9807n8259k02500
$$ y = [-109248, -155373, -20613, 19029, -190137, -303902, -246383, -241111, -299088, -222216, -219233, -74881, 148690, 225693, 12818, -106652, -185309, -285844, -195793, -110848, -167570, -218590, -175435, -196317, 70505, 124728, 45051, 2952, -81864, -110607, -77591, -9184, -87738, -82421, -216835, -333533, -393844, -303920, -344503, -288070, -366852, -471361, -330708, -191164, -68240, -33489, 30390, -32828, -41799, -121916, -142653, -84616, 25090, 75403, 41569, -141734, -20523, 47975, -27896, -284550, -484433, -284038, -135738, -110645, -124667, -87681, -98772, -176206, -123602, 132767, 209887, 287002, 335481, 246591, 238530, 190595, 30304, -20999, -104137, -108403, -22871, 163211, 329957, 256609, 68062, 141565, 191687, 261494, 203235, 735]
7379G35k32648n2117J09009l9041O3737O3228n4034j3083k2036p0894K01997n5063
7367a00210q623P2516J08900L5429j13474k17461o8579p1074L7916J17912L6527
7356a70221J57388O7445j08136j88223J34369k4776q9053J09952J38695J22080
7346A49520m1347j00767j72612J71054J60804j38907l547k5634n6603N667J33680
7335H1308k8031j38397K344Q1854P4713M6882K376k8838k6755J61929M5945m043
7323B71287j21121j05791k54867j164m5906K9726J30066K4889p903n6858o4768
7312b02410J8028M6800o3738J09452l4395r8022k5952J08642m6001p5234k6289
$$ y = [735, -231913, -284030, -175021, -214062, -150325, -87097, -141131, -154214, -176250, -247144, -45147, -100210, -108833, -36317, 72583, 108012, -5462, -222923, -291502, -362576, -324660, -206748, -170221, -12833, 54612, -53524, -241747, -107378, -132154, -221207, -111255, 27440, 149520, 108173, 7406, -165206, 5848, 166652, 27745, 24198, -1436, -58039, -52372, 81308, 53277, -85120, -82776, -922, 73791, 120673, 123049, 94211, 67456, 229385, 275330, 271287, 150166, 44375, -210492, -211656, -257562, -227836, -97770, -72881, -80784, -137642, -202410, -184382, -137582, -201320, -91868, -126263, -224285, -250237, -141595, -187596, -262830, -289119]
$$ [...]
##END NTUPLES=NMR SPECTRUM
##END=
