##TITLE=Analysis number 329648
Compound Code cc 64802
Book Reference 552/4
Project Code adrs
Chemist Name stevem
##JCAMPDX= 6.0         $$ Bruker NMR JCAMP-DX V2.0
##DATA TYPE= NMR SPECTRUM
##DATA CLASS= NTUPLES
##ORIGIN= Bruker BioSpin GmbH
##OWNER= nmr
$$ XWIN-NMR		Version 3.5
$$ Thu Sep 20 11:01:18 2007 GMT Daylight Time (UT+1h)  MAYBRIDGE\nmr@NMR_250MHZ
##.OBSERVE FREQUENCY= 250.131544655141
##.OBSERVE NUCLEUS= ^1H
##.ACQUISITION MODE= SIMULTANEOUS (DQD)
##.ACQUISITION SCHEME= undefined
##.AVERAGES= 16
##.DIGITISER RES= 18
##SPECTROMETER/DATA SYSTEM= dpx250
##.PULSE SEQUENCE= zg30
##.SOLVENT NAME= CDCl3
##.SHIFT REFERENCE= (INTERNAL, CDCl3, 0, 16.4471)
##AUDIT TRAIL= $$ (NUMBER, WHEN, WHO, WHERE, WHAT)
$$ ##TITLE= Audit trail, XWIN-NMR		Version 3.5
$$ ##JCAMPDX= 5.01
$$ ##ORIGIN= Bruker BioSpin GmbH
$$ ##OWNER= nmr
$$ C:\u/data/dgb/nmr/ADRS/2050/pdata/1/auditp.txt
$$ ##AUDIT TRAIL=  $$ (NUMBER, WHEN, WHO, WHERE, WHAT)
(   1,<2007-09-20 11:00:57.35 +100>,<MAYBRIDGE\nmr>,<NMR_250MHZ>,
      <created by zg, POWCHK disabled, PULCHK disabled
       configuration hash MD5:
       76 6E 9A 78 1E 09 19 81 EC 84 63 8F B0 6A 59 2D
       data hash MD5: 64K
       8C 7B A9 AF D4 BB A0 6D C4 5D 10 8D FC 8F 26 7B>)
(   2,<2007-09-20 11:01:09.25 +100>,<MAYBRIDGE\nmr>,<NMR_250MHZ>,
      <Start of raw data processing
       ef LB = 0.3 FT_mod = 6 PKNL = 1 SI = 32K 
       data hash MD5: 32K
       EE 7E 73 8B 5B BB D9 12 40 9D 1E 5D D9 75 24 10>)
(   3,<2007-09-20 11:01:10.82 +100>,<MAYBRIDGE\nmr>,<NMR_250MHZ>,
      <apk 
       data hash MD5: 32K
       91 86 B1 85 48 CF 5E DB F4 05 37 6B 2E 3E 1B F9>)
(   4,<2007-09-20 11:01:11.50 +100>,<MAYBRIDGE\nmr>,<NMR_250MHZ>,
      <abs ABSG = 5 
       data hash MD5: 32K
       D2 FD 02 9E 61 A4 7B 43 DD BE 76 52 F6 E1 35 89>)
$$ ##END=
$$ 
$$ hash MD5
$$ 80 22 03 26 7E 80 AC 29 56 04 86 71 69 D4 3A 7E
##$RELAX= 
##$RELAX= 
##$RELAX= 
##$RELAX= 
##$RELAX= 
##$RELAX= 
##$RELAX= 
$$ Bruker specific parameters
$$ --------------------------
##$DU= <C:\u>
##$EXPNO= 2050
##$NAME= <ADRS>
##$PROCNO= 1
##$TYPE= <nmr>
##$USER= <dgb>
##$AMP= (0..31)
100 100 100 100 100 100 100 100 100 100 100 100 100 100 100 100 100 100 
100 100 100 100 100 100 100 100 100 100 100 100 100 100 
##$AQSEQ= 0
##$AQ_mod= 3
##$AUNM= <au_zg>
##$AUTOPOS= <20 >
##$BF1= 250.13
##$BF2= 250.13
##$BF3= 250.13
##$BF4= 250.13
##$BF5= 500.13
##$BF6= 500.13
##$BF7= 500.13
##$BF8= 500.13
##$BYTORDA= 1
##$CFDGTYP= 0
##$CFRGTYP= 5
##$CHEMSTR= <none>
##$CNST= (0..31)
1 1 145 1 1 1 1 1 1 1 1 1 1 1 1 1 1 1 1 1 1 1 1 1 1 1 1 1 1 1 1 1 
##$CPDPRG= <>
##$CPDPRG1= <>
##$CPDPRG2= <>
##$CPDPRG3= <>
##$CPDPRG4= <mlev>
##$CPDPRG5= <mlev>
##$CPDPRG6= <mlev>
##$CPDPRG7= <mlev>
##$CPDPRG8= <mlev>
##$CPDPRGB= <>
##$CPDPRGT= <>
##$D= (0..31)
0 1 0 0 0 0 0 0 0 0.06 0 0 0 0 0 0 0.0002 0 0 0 0 0 0 0 0 0 0 0 0 0 0 
0 
##$DATE= 1190282456
##$DBL= (0..7)
120 120 120 120 120 120 120 120 
##$DBP= (0..7)
150 150 150 150 150 150 150 150 
##$DBP07= 0
##$DBPNAM0= <>
##$DBPNAM1= <>
$$ [...]
##$SUBNAM7= <"">
##$SUBNAM8= <"">
##$SUBNAM9= <"">
##$SW= 20.6930455092707
##$SWIBOX= (0..15)
0 0 3 0 0 0 0 0 0 0 0 0 0 0 0 0 
##$SW_h= 5175.983436853
##$TD= 65536
##$TD0= 1
##$TE= 296.16
##$TE2= 300
##$TE3= 300
##$TEG= 300
##$TL= (0..7)
0 120 120 120 120 120 120 120 
##$TP= (0..7)
150 150 150 150 150 150 150 150 
##$TP07= 0
##$TPNAME0= <>
##$TPNAME1= <>
##$TPNAME2= <>
##$TPNAME3= <>
##$TPNAME4= <>
##$TPNAME5= <>
##$TPNAME6= <>
##$TPNAME7= <>
##$TPOAL= (0..7)
0.5 0.5 0.5 0.5 0.5 0.5 0.5 0.5 
##$TPOFFS= (0..7)
0 0 0 0 0 0 0 0 
##$TUNHIN= 0
##$TUNHOUT= 0
##$TUNXOUT= 0
##$USERA1= <user>
##$USERA2= <user>
##$USERA3= <user>
##$USERA4= <user>
##$USERA5= <user>
##$V9= 5
##$VALIST= <valist>
##$VCLIST= <CCCCCCCCCCCCCCC>
##$VD= 0
##$VDLIST= <DDDDDDDDDDDDDDD>
##$VPLIST= <PPPPPPPPPPPPPPP>
##$VTLIST= <TTTTTTTTTTTTTTT>
##$WBST= 1024
##$WBSW= 4
##$XGAIN= (0..3)
0 0 0 0 
##$XL= 0
##$YL= 0
##$YMAX_a= 292854
##$YMIN_a= -457174
##$ZGOPTNS= <>
##$ZL1= 120
##$ZL2= 120
##$ZL3= 120
##$ZL4= 120
##$ABSF1= 16.44711
##$ABSF2= -4.246063
##$ABSG= 5
##$ABSL= 3
##$ALPHA= 0
##$AQORDER= 0
##$ASSFAC= 0
##$ASSFACI= 0
##$ASSFACX= 0
##$ASSWID= 0
##$AUNMP= <proc_1d>
##$AZFE= 0.1
##$AZFW= 0.1
##$BCFW= 0
##$BC_mod= 0
##$BYTORDP= 0
##$COROFFS= 0
##$CY= 12.5
##$DATMOD= 1
##$DC= 0
##$DFILT= <>
##$DTYPP= 0
##$F1P= 14.0000005364418
##$F2P= -0.99999901652339
##$FCOR= 0.5
##$FTSIZE= 32768
##$FT_mod= 6
##$GAMMA= 0
##$GB= 0
##$INTBC= 1
##$INTSCL= 1
##$ISEN= 128
##$LB= 0.3
##$LEV0= 0
##$LPBIN= 0
##$MAXI= 10000
##$MC2= 0
##$MEAN= 0
##$ME_mod= 0
##$MI= 0
##$NCOEF= 0
##$NC_proc= -3
##$NLEV= 6
##$NOISF1= 0
##$NOISF2= 0
##$NSP= 0
##$NTH_PI= 0
##$NZP= 0
##$OFFSET= 16.44711
##$PC= 1
##$PHC0= 157.153
##$PHC1= 8.271105
##$PH_mod= 1
##$PKNL= yes
##$PPARMOD= 0
##$PSCAL= 4
##$PSIGN= 0
##$REVERSE= no
##$SF= 250.130018730769
##$SI= 32768
##$SIGF1= 0
##$SIGF2= 0
##$SINO= 400
##$SIOLD= 32768
##$SREGLST= <1H.CDCl3>
##$SSB= 0
##$STSI= 32768
##$STSR= 0
##$SW_p= 5175.98343685301
##$SYMM= 0
##$S_DEV= 0
##$TDeff= 65536
##$TDoff= 0
##$TI= <Analysis number 999999
Compound Code 99
Book Reference 9
Project Code 9>
##$TILT= no
##$TM1= 0
##$TM2= 0
##$TOPLEV= 0
##$USERP1= <user>
##$USERP2= <user>
##$USERP3= <user>
##$USERP4= <user>
##$USERP5= <user>
##$WDW= 1
##$XDIM= 32768
##$YMAX_p= 407958203
##$YMIN_p= -248548
$$ End of Bruker specific parameters
$$ ---------------------------------
##NTUPLES= NMR SPECTRUM
##VAR_NAME=  FREQUENCY,     SPECTRUM/REAL,   SPECTRUM/IMAG
##SYMBOL=    X,             R,               I
##VAR_TYPE=  INDEPENDENT,   DEPENDENT,       DEPENDENT
##VAR_FORM=  AFFN,          ASDF,            ASDF
##VAR_DIM=   32768,         32768,           32768
##UNITS=     HZ,            ARBITRARY UNITS, ARBITRARY UNITS
##FACTOR=    0.157963299565203, 1,           1
##FIRST=     4113.91573786894, 0,            0
##LAST=      -1062.06769898407, 0,           0
##MIN=       -1062.06769898407, -248548,     0
##MAX=       4113.91573786894, 407958203,    0
$$ Real data points
##PAGE= N=1
##DATA TABLE= (X++(R..R)), XYDATA
$$ [...]
$$ plain form
18222 432792 454423 466367 462083 419544 422861 418835 384992 381364 342377 312715 279117 346872
18210 346872 361837 274402 239823 310036 281360 209346 177229 165106 127268 139675 203199
18199 203199 237493 237238 210197 240155 235488 225929 215255 229678 191352 182797 231387 253871
18187 253871 243680 277566 289994 314484 335985 371209 347821 290080 248380 249709 232071 247107
18175 247107 301322 273514 225570 219853 143959 137161 156901 115928 141636 193922 180617 224114
18163 224114 290721 292106 237418 267969 273804 270110 280072 311794 350900 350082 382585 376181 324514
18150 324514 304210 342211 351393 305647 366031 409457 356221 378113 385739 391468 436636 500386
18138 500386 514797 533561 543276 621835 652173 703439 748905 830129 865483 911987 1027298
$$ packed form
18222D32792K1631J1944m284m2539L317m026l3843l628l8987k9662l3598O7755
18210C46872J4965q7435l4579P0213k8676p2014l2117j2123l7838J2407O3524
18199B03199L4294k55k7041K9958m667r559j0674J4423l8326q555M8590K2484
18187B53871j0191L3886J2428K4490K1501L5224k3388n7741m1700J329j7638J5036
18175B47107N4215k7808m7944n717p5894o798J9740m0973K5708N2286j3305M3497
18163B24114O6607J385n4688L0551N835l694R962L1722L9106q18L2503o404n1667
18150C24514k0304L8001R182m5746O0384M3426n3236K1892P626N729M5168O3750
18138E00386J4411J8764R715P8559L0338N1266M5466Q1224L5354M6504J15311
$$ plain form
18127 1027298 1190280 1273191 1392254 1565533 1752161 1999810 2306927 2744657 3318035 4086888
18117 4086888 5208930 6998586 9726671 14338235 22846803 38209554 64841253 95691714
18109 95691714 102283880 84956614 65537383 47398169 30242569 19057793 13003594
18102 13003594 9622536 7585840 6267402 5396351 4830203 4368467 3920037 3422835 3055679
18093 3055679 2771267 2529564 2314668 2110360 1991217 1897274 1788217 1776892 1826978 1883702
18083 1883702 1942610 1950312 2020032 2169164 2356489 2437328 2515503 2796146 3218044 3893905
18073 3893905 5040762 6903519 9931805 14173916 17740105 18874189 18457586 18604880
18065 18604880 20275169 24624364 31281590 35279400 33639837 29240444 25185986 22188750
$$ packed form
18127A027298J62982Q2911J19063J73279J86628K47649L07117M37730N73378P68853
18117D086888J122042J789656K728085M611564Q508568J5362751K6631699L0850461
18109I5691714O592166j7327266j9419231j8139214j7155600j1184776o054199
18102A3003594l381058k036696j318438q71051n66148m61736m48430m97202l67156
18093C055679k84412k41703k14896k04308j19143r3943j09057j1325N0086N6724
18083A883702N8908P702O9720J49132J87325Q0839P8175K80643M21898O75861
18073C893905J146857J862757L028286M242111L566189J134084m16603J47294
18065A8604880J670289M349195O657226L997810j639563m399393m054458k997236
$$ plain form
18057 22188750 21438316 22471090 22075435 19160853 15484841 12119635 9074927 6737064
18049 6737064 5323098 4455429 3834593 3400312 3180700 3033204 2882555 2745803 2671785
18040 2671785 2641456 2629997 2603807 2671652 2745904 2738116 2778898 2967622 3269525 3687470 4351077
18029 4351077 5488116 7310753 10106529 13541328 15735889 15896210 15600617 16100323 17965531
18020 17965531 22088775 28359347 35348236 42141599 48014857 51496139 51557114 48335018
18012 48335018 41946828 33706036 26091150 20323893 16586108 14989958 15261881 15990243
18004 15990243 15300807 13169677 10733943 8484001 6535045 5131249 4181307 3523525
17996 3523525 3003946 2729126 2566218 2429733 2335515 2261170 2209186 2141803 2118824 2046343
$$ packed form
18057B2188750p50434J032774l95655k914582l676012l365206l044708k337863
18049F737064j413966q67669o20836m34281k19612j47496j50649j36752p4018
18040B671785l0329j1459k6190O7845P4252p788M0782J88724L01903M17945O63607
18029D351077J137039J822637K795776L434799K194561J60321k95593M99706J865208
18020A7965531M123244O270572O988889O793363N873258L481282O0975l222096
18012D8335018o388190q240792p614886n767257l737785j596150K71923P28362
18004A5990243o89436k131130k435734k249942j948956j403796r49942o57782
17996C523525n19579k74820j62908j36485r4218p4345n1984o7383k2979p2481
$$ plain form
17986 2046343 1999105 1980474 1978753 2021391 2256084 2522132 2898085 3549235 4651119 6534734
17976 6534734 9196040 11277407 11654808 11170626 11096381 11890197 14442406 18213178 19911986
17967 19911986 18363712 15732573 13435076 11717310 11462603 11904569 11218305 9394576
17959 9394576 7483239 5716591 4178886 3050514 2336667 1876535 1495273 1224096 1057592
17950 1057592 1013950 997980 905075 875331 786722 712479 659448 638103 676676 644471 565481
17939 565481 555021 556089 536997 489571 439242 354886 279466 227583 208675 250852 240581 213918
17927 213918 230823 254094 251898 273413 255287 255879 251833 167906 146530 144339 146961 173866 185026
17914 185026 118356 152627 162302 156739 151139 194751 173842 154932 181513 73006 58714 117505
$$ packed form
17986B046343m7238j8631j721M2638K34693K66048L75953O51150J101884J883615
17976F534734K661306K081367L77401m84182p4245P93816K552209L770772J698808
17967A9911986j548274k631139k297497j717766k54707M41966o86264j823729
17959I394576j911337j766648j537705j128372p13847m60132l81262k71177j66504
17950A057592m3642j5970r2905k9744q8609p4243n3031k1345L8573l2205p8990
17939E65481j0460J068j9092m7426n0329q4356p5420n1883j8908M2177j0271k6663
17927B13918J6905K3271k196K1515j8126N92m046q3927k1376k191K622K6905J1160
17914A85026o6670L4271R675n563n600M3612k0909j8910K6581j08507j4292N8791
$$ plain form
17902 117505 96682 79829 82690 66799 60898 120125 97572 126950 149876 138046 172899 138745
17890 138745 126115 77575 49479 82985 154387 182426 209441 169282 114840 93347 91150 59607
17878 59607 -5557 34091 30872 56114 185931 202859 190475 231781 206145 178538 211036 224423
17866 224423 204929 235484 243430 257525 226736 196066 173721 104414 6271 -878 2592 42319
17854 42319 1579 -28122 -5804 35955 44438 10841 53297 102647 102425 100715 111165 112912 97767
17841 97767 93048 107611 96957 117982 86301 103615 86142 100652 130163 110782 141513 129226
17829 129226 157728 188162 266802 300114 338390 350337 263365 213456 218468 177918 223197 291334
17817 291334 322941 366177 359980 406470 404406 336927 289564 294307 269920 262053 284251 268790
$$ packed form
17902A17505k0823j6853K861j5891n901N9227k2553K9378K2926j1830L4853l4154
17890A38745j2630m8540k8096L3506P1402K8039K7015m0159n4442k1493k197l1543
17878E9607o5164L9648l219K5242J29817J6928j2384M1306k5636k7607L2498J3387
17866B24423j9494L0555P946J4095l0789l0670k2345o9307r8143p149L470L9727
17854D2319m0740k9701K2318M1759Q483l3597M2456M9350k22j710J0450J747j5145
17841I7767m719J4563j0654K1025l1681J7314j7473J4510K9511j9381L0731j2287
17829A29226K8502L0434P8640L3312L8276J1947q6972m9909N012m0550M5279O8137
17817B91334L1607M3236o197M6490k064o7479m7363M743k4387p867K2198j5461
$$ plain form
17805 268790 283687 287565 279755 221180 156689 162949 134066 52141 48165 64443 84149 125315
17793 125315 141974 106032 108116 108689 86675 75252 107656 157071 224104 238793 269478 275435
17781 275435 238813 221892 236498 261524 199693 217446 187820 193609 207733 177719 183747 230610
17769 230610 231911 208842 205488 183410 163573 136605 137087 145908 200483 152078 180946 215338
17757 215338 174843 95622 111266 134881 156191 193696 209620 247469 246781 186974 144809 150606
17745 150606 136091 212795 224124 169605 127591 155229 174704 116802 76570 101212 92002 57275
17733 57275 16382 8168 -37845 -13412 46338 40061 88450 127311 83339 78221 133918 141552
17721 141552 87825 37909 31851 55642 66743 38293 65422 103007 124013 106907 138594 175769
$$ packed form
17805B68790J4897L878p810n8575o4491O260k8883q1925l976J6278J9706M1166
17793A25315J6659l5942K084N73k2014j1423L2404M9415O7033J4689L0685N957
17781B75435l6622j6921J4606K5026o1831J7753k9626N789J4124l0014O028M6863
17769B30610J301k3069l354k2078j9837k6968M82Q821N4575m8405K8868L4392
17757B15338m0495p9221J5644K3615K1310L7505J5924L7849o88n9807m2165N797
17745A50606j4515P6704J1329n4519m2014K7638J9475n7902m0232K4642r210l4727
17733E7275m0893q214m6013K4433N9750o277M8389L8861m3972n118N5697P634
17721A41552n3727m9916o058K3791J1101k8450K7129L7585K1006j7106L1687L7175
$$ plain form
17709 175769 159317 187016 187646 175538 187620 182048 156471 182611 205045 168625 123899 182073
17697 182073 162953 167709 189192 247145 328818 371348 314243 288387 301865 254024 215758 245549
17685 245549 268555 285865 254686 190375 188377 207157 230194 201413 171749 139013 118143 169065
17673 169065 132918 114599 141091 161219 139445 97898 127979 119809 183707 195254 178121 224679
17661 224679 290155 296161 238737 237499 238315 198660 213338 229446 228558 255084 296675 278624 280045
17648 280045 291537 326315 295996 264812 284419 307028 326994 280155 278566 315505 344865 360917
17636 360917 372306 417144 467960 469659 454574 522951 562531 552548 532181 580921 623184 630594
17624 630594 660144 696093 689325 686835 666812 728725 773609 770004 736568 799078 854718 934888
$$ packed form
17709A75769j6452K7699O30j2108J2082n572k5577K6140K2434l6420m4726N8174
17697A82073j9120M756K1483N7953Q1673M2530n7105k5856J3478m7841l8266K9791
17685B45549K3006J7310l1179o4311j998J8780K3037k8781k9664l2736k0870N0922
17673A69065l6147j8319K6492K0128k1774m1547L0081q170O3898J1547j7133M6558
17661B24679O5476O006n7424j238Q16l9655J4678J6108q88K6526M1591j8051J421
17648B80045J1492L4778l0319l1184J9607K2609J9966m6839j589L6939K9360J6052
17636C60917J1389M4838N0816J699j5085O8377L9580r983k0367M8740M2263P410
17624F30594K9550L5949o768k490k0023O1913M4884l605l3436O2510N5640Q0170
$$ plain form
17612 934888 1082608 1241137 1399211 1600074 1822640 2068838 2326148 2549211 2771264 3133118
17602 3133118 3654338 4500773 5805038 7922360 10904298 13920244 15750487 15889742 14909577
17593 14909577 13624999 12924470 13350706 15410672 19751149 26591975 35166127 46121311
17585 46121311 59248074 66446937 63786462 57960903 54859191 56483976 66371363 82350946
17577 82350946 91580767 88088466 79581731 71911842 63943179 54927960 45450010 36668716
17569 36668716 29394000 24027779 20882747 20052359 21255643 23539740 24313814 22350974
17561 22350974 18999811 15466670 12287245 9887929 8287660 7305662 6666697 6239789
17553 6239789 5955857 5761691 5657178 5650314 5763277 5963961 6506684 7500613 9025684 11580643
$$ packed form
17612I34888J47720J58529J58074K00863K22566K46198K57310K23063K22053L61854
17602C133118N21220Q46435J304265K117322K981938L015946J830243J39255r80165
17593A4909577j284578p00529M26236K059966M340477O840826Q574152J0955184
17585D6121311J3126763P198863k660475n825559l101712J624785R887387J5979583
17577H2350946R229821l492301q506735p669889p968663r015219r477950q781294
17569C6668716p274716n366221l145032q30388J203284K284097P74074j962840
17561B2350974l351163l533141l179425k399316j600269r81998o38965m26908
17553F239789k83932j94166j04513o864J12963K00684N42723R93929J525071K554959
$$ plain form
17543 11580643 15484301 20447897 24338292 26365451 28464015 32447256 37722287 40517749
17535 40517749 38928480 35667365 33662068 34210011 39712462 51690580 64585365 69839390
17527 69839390 69150636 67528123 65716641 66779879 71030227 70610526 61637289 49616627
17519 49616627 38955166 29990161 23741078 19558233 16081269 13155708 10809395 8892871
17511 8892871 7403313 6456687 5842120 5477302 5518498 6017388 6815487 7317993 6987686
17502 6987686 6025805 5010933 4071333 3282545 2719571 2336964 1977743 1635859 1354697
17493 1354697 1137477 1020386 920272 847278 790619 675400 557624 491853 460888 415794
17483 415794 356609 367289 416064 403386 361882 294043 254566 288651 311985 286015 234351
$$ packed form
17543A1580643L903658M963596L890395K027159K098564L983241N275031K795462
17535D0517749j589269l261115k005297N47943N502451J1978118J2894785N254025
17527F9839390o88754j622513j811482J063238M250348m19701q973237j2020662
17519D9616627j0661461q965005o249083m182845l476964k925561k346313j916524
17511H892871j489558r46626o14567l64818M1196M98890P98099N02506l30307
17502F987686r61881j014872r39600p88788n62974l82607l59221l41884k81162
17493A354697k17220j17091j00114p2994n6659j15219j17776o5771l0965m5094
17483D15794n9185J0680M8775j2678m1504o7839l9477L4085K3334k5970n1664
$$ plain form
17472 234351 212921 191020 202500 210493 179199 115027 82865 137767 171397 139151 150380 134121
17460 134121 136285 184994 251921 209705 202485 204884 197306 180206 146250 96997 85680 137760
17448 137760 180762 227164 233305 392840 566284 632800 489298 360264 297536 257381 226713
17437 226713 157227 56560 -34375 27132 40589 89696 45805 7493 20184 14992 37520
17426 37520 104868 97573 68404 60706 71184 42665 45317 32513 67407 54323 35844 7403
17414 7403 -33121 -86807 -105220 -118146 -103041 -109792 -66613 -30253 -24061 -14513 74460 108175
17402 108175 -3234 -35900 18532 39305 5415 -18001 -58543 -50343 -10103 52589 -8579
17391 -8579 -62581 -14807 7433 5663 4891 -13464 -13796 -15584 11399 12396 -2275 -33212 -70905
$$ packed form
17472B34351k1430k1901J1480P993l1294o4172l2162N4902L3630l2246J1229j6259
17460A34121K164M8709O6927m2216p220K399p578j7100l3956m9253j1317N2080
17448A37760M3002M6402O141J59535J73444O6516j43502j29034o2728m0155l0668
17437B26713o9486j00667r0935O1507J3457M9107m3891l8312J2691n192K2528
17426C7520O7348p295k9169p698J0478k8519K652j2804L4894j3084j8479k8441
17414G403m0524n3686j8413j2926J5105o751M3179L6360O192R548Q8973L3715
17402A08175j11409l2666N4432K0773l3890k3416m0542Q200M0240O2692o1168
17391h579n4002M7774K2240j770p72j8355l32j788K6983R97j4671l0937l7693
$$ plain form
17378 -70905 -55893 37255 52768 -21332 -81781 -59114 -21145 -70787 -92990 -55711 -22130 -60293
17366 -60293 -101517 -109709 -78268 -59260 -24331 -23495 -77533 -65740 -55448 -107628 -115790 -53611
17354 -53611 5515 15255 -44770 -111290 -83986 -28206 -17520 -58581 -101965 -55004 -29042 -69682
17342 -69682 -105384 -92244 -79268 -75131 -82971 -81726 -58973 -59051 -61912 -77072 -31423 -40918 -88067
17329 -88067 -76886 -135140 -195421 -126335 -93319 -40965 -10568 8901 9995 -6315 -46126 -50541
17317 -50541 -68438 -65455 -37185 -19747 -41363 -18961 -21888 -18701 -53119 -34778 -76689 -116786
17305 -116786 -83230 -36091 22243 6981 9549 31900 39825 42820 12923 20821 63271 28470
17293 28470 19672 13072 37037 26915 -2981 -74507 -66336 -42708 -42813 -11454 17414 31122 13515
$$ packed form
17378g0905J5012R3148J5513p4100o0449K2667L7969m9642k2203L7279L3581l8163
17366f0293m1224q192L1441J9008L4929Q36n4038J1793J0292n2180q162O2179
17354e3611N9126R740o0025o6520K7304N5780J0686m1061m3384M6961K5962m0640
17342f9682l5702J3140J2976M137p840J245K2753p8k861j5160M5649r495m7149
17329h8067J1181n8254o0281O9086L3016N2354L0397J9469J094j6310l9811m415
17317e0541j7897K983K8270J7438k1616K2402k927L187l4418J8341m1911m0097
17305a16786L3556M7139N8334j5262K568K2351P925K995k9897P898M2450l4801
17293B8470q798o600K3965j0122k9896p1526Q171K3628j05L1359K8868J3708j7607
$$ plain form
17280 13515 -30376 -75468 -55387 -57291 -58177 -5798 779 -37157 -77475 -98144 -93974 -96664 -62254
17267 -62254 -49932 -49508 -77768 -63841 -37295 -35999 5537 -70552 -98743 -29823 -64659 -91616
17255 -91616 -104087 -157660 -123786 -75040 -41710 -22694 -7887 -32737 -18087 28675 53088 10140
17243 10140 -21216 -62762 -72079 -31547 -13056 -27429 -72075 -64415 -58939 758 21332 -8414
17231 -8414 -3593 48562 -35137 -64514 -47481 -8164 -14080 -84411 -82549 -48535 -59265 -61040 -35810
17218 -35810 -50259 -68661 -131785 -172178 -155210 -120095 -60904 -32617 16521 8363 -17994 -17341
17206 -17341 -30481 -103855 -159728 -113955 -78951 -77766 -91976 -84015 -85707 -64948 -49850 -8227
17194 -8227 11110 -28803 -138388 -121489 -120432 -73175 14443 60146 50855 68582 97926 50990
$$ packed form
17280A3515m3891m5092K0081j904q86N2379O577l7936m0318k0669M170k690L4410
17267f2254J2322M24k8260J3927K6546J296M1536p6089k8191O8920l4836k6957
17255i1616j2471n3573L3874M8746L3330J9016J4807k4850J4650M6762K4413m2948
17243A0140l1356m1546r317M0532J8491j4373m4646P660N476N9697K0574k9746
17231h414M821N2155q3699k9377J7033L9317n916p0331J862L4014j0730j775K5230
17218c5810j4449j8402o3124m0393J6968L5115N9191K8287M9138q158k6357O53
17206a7341j3140p3374n5873M5773L5004J185j4210P961j692K0759J5098M1623
17194h227J9337l9913j09585J6899J057M7257Q7618M5703r291J7727K9344m6936
$$ plain form
17182 50990 -43331 -101946 -106622 -47844 -13456 -24733 -15751 -16333 -44312 -19150 -8372 -72124
17170 -72124 -76761 -97665 -104781 -122814 -117053 -107489 -73276 -51507 -61538 -26746 -13756 -86
17158 -86 -30519 -49503 -70260 -108140 -149765 -176560 -104725 -110491 -91758 -77519 -93653 -153862
17146 -153862 -153635 -122375 -88586 -94053 -52969 -64994 -87480 -95429 -74068 -64834 -108769 -101781 -149428
17133 -149428 -154322 -123753 -155630 -156312 -145484 -50300 -25593 -77512 -108749 -144077 -108158 -58021
17121 -58021 -48644 -109237 -145359 -109470 -59792 -77709 -45413 -16507 -19687 775 -43329 -20050
17109 -20050 40346 -18168 -53307 -35774 -49139 -55673 -79367 -22689 311 12990 48516 12140
17097 12140 10434 -13308 -17195 -56305 -97427 -86092 -27286 -22179 -52456 -33107 -14051 12630
$$ packed form
17182E0990r4321n8615m676N8778L4388j1277Q982n82k7979K5162J0778o3752
17170g2124m637k0904p116j8033N761R564L4213K1769j0031L4792J2990J3670
17158h6l0433j8984k0757l7880m1625k6795P1835n766J8733J4239j6134o0209
17146a53862K27L1260L3789n467M1084j2025k2486p949K1361R234m3935O988m7647
17133a49428m894L0569l1877o82J0828R5184K4707n1919l1237l5328L5919N0137
17121e8021R377o0593l6122L5889M9678j7917L2296K8906l180K0462m4104K3279
17109b0050O0396n8514l5139J7533j3365o534k3694N6678K3000J2679L5526l6376
17097A2140j706k3742l887l9110m1122J1335N8806N107l0277J9349J9056K6681
$$ plain form
17085 12630 3240 15833 71934 112752 111823 124434 128068 139703 203431 246494 238116 198751 158254
17072 158254 134152 131833 189209 262411 285646 312040 276016 242247 231157 221366 202784 173595
17060 173595 120234 141838 181433 168064 145664 110534 61594 72102 60198 15421 79689
17049 79689 88357 84433 83844 114336 54520 -2450 3233 -5118 49504 85779 69896 92857 72725
17036 72725 32176 22965 2005 21937 -25306 -25765 71617 145070 126078 141351 199593 217383
17024 217383 241905 236297 249874 229116 218307 152751 115542 105493 136660 95598 81666 142406
17012 142406 62772 13073 62425 141789 185104 197845 175178 116078 161151 156274 118419 65944
17000 65944 70464 154985 187688 166046 133658 120946 119111 95627 -14082 -70797 -45230 -29398
$$ packed form
17085A2630r390J2593N6101M0818r29J2611L634J1635O3728M3063q378l9365m0497
17072A58254k4102k319N7376P3202K3235K6394l6024l3769j1090r791j8582k9189
17060A73595n3361K1604L9595j3369k2400l5130m8940J0508j1904m4777O4268
17049G9689Q668l924n89L0492n9816n6970N683q351N4622L6275j5883K2961k0132
17036G2725m0549r211k0960J9932m7243m59R7382P3453j8992J5273N8242J7790
17024B17383K4522n608J3577k0758j0809o5556l7209j0049L1167m1062j3932O0740
17012A42406p9634m9699M9352P9364M3315J2741k2667n9100M5073m877l7855n2475
17000F5944M520Q4521L2703k1642l2388j2712j835k3484j09709n6715K5567J5832
$$ plain form
16988 -29398 -33119 -20197 -5126 -28151 -32799 -48362 -30368 -84647 -142073 -96288 -90133 -31344
16976 -31344 11563 5837 -9841 -39819 -92079 -130636 -118323 -65511 -57778 -58664 -48775 -68321 -131548
16963 -131548 -112548 -67728 -42460 -28684 -27428 -4339 -18308 12436 -30888 -104215 -105125 -46627
16951 -46627 -64043 -49714 -109057 -98888 -141582 -55402 40711 64253 -16765 -43015 -85171 -117775
16939 -117775 -101372 -89277 -38105 21571 -54370 -99358 -74054 -83199 -81488 -22528 -25954 -24181
16927 -24181 -32532 -64846 -57077 -32318 -26708 -60590 -107621 -118627 -60973 -26067 -46781 -74600
16915 -74600 -120458 -111754 -79865 -54807 -103936 -168856 -150965 -86830 -42719 -55219 -93226 -85876
16903 -85876 -101379 -88337 -137853 -99253 -64247 -50833 -69818 -70911 -125247 -89933 -86027 -34135
$$ packed form
16988b9398l721J2922J5071k3025m648j5563J7994n4279n7426M5785O155N8789
16976c1344M2907n726j5678k9978n2260l8557J2313N2812P733q86R889j9546o3227
16963a31548J9000M4820K5268J3776J256K3089j3969L0744m3324p3327r10N8498
16951d6627j7416J4329n9343J0169m2694Q6180R6113K3542q1018k6250m2156l2604
16939a17775J6403J2095N1172N9676p5941m4988K5304r145J711N8960l426J773
16927b4181q351l2314P769K4759N610l3882m7031j1006N7654L4906k0714k7819
16915g4600m5858Q704L1889K5058m9129o4920J7891O4135M4111j2500l8007P350
16903h5876j5503J3042m9516L8600L5006J3414j8985j093n4336L5314L906N1892
$$ plain form
16891 -34135 23177 -9010 -55781 -3324 22341 5005 6948 44057 11661 15247 19299 -41855
16879 -41855 -105980 -67785 17102 114035 88688 37114 5117 27489 -5413 -47765 -53536 -68069
16867 -68069 -97972 -99996 -91318 -67298 -86507 -19551 96427 99485 57297 57209 67375 19232 14854
16854 14854 31148 23571 6794 -76157 -103810 -31650 -15522 -29978 -55236 -34423 -63402 -65239
16842 -65239 -49853 -26284 8078 -2328 -10172 40354 27017 5889 -33679 -98017 -138047 -95507
16830 -95507 -17323 16503 19234 -19270 -62891 -99919 -76964 -39754 -22637 11610 -9672 -19897
16818 -19897 -23021 -25802 -32111 27378 6580 37131 92951 97145 42643 1705 -38300 -69747
16806 -69747 -33047 -18062 15379 43924 61171 49020 -23211 -101033 -117248 -84628 -66385 7676
$$ packed form
16891c4135N7312l2187m6771N2457K5665j7336J943L7109l2396L586M052o1154
16879d1855o4125L8195Q4887R6933k5347n1574l1997K2372l2902m2352n771j4533
16867f8069k9903k024Q678K4020j9209O6956J15978L058m2188q8J0166m8143m378
16854A4854J6294p577j6777q2951k7653P2160J6128j4456k5258K0813k8979j837
16842f5239J5386K3569L4362j0406p844N0526j3337k1128l9568o4338m0030M2540
16830i5507P8184L3826K731l8504m3621l7028K2955L7210J7117L4247k1282j0225
16818a9897l124k781o309N9489k0798L0551N5820M194n4502m0938m0005l1447
16806f9747L6700J4985L3441K8545J7247j2151p2231p7822j6215L2620J8243P4061
$$ plain form
16794 7676 66421 95086 37615 -10526 6711 12743 -31444 -76090 -95598 -121511 -108703 -70224
16782 -70224 -41267 -42322 -72022 -37129 -76745 -127265 -132862 -173665 -228703 -220830 -129606 -92425
16770 -92425 -137565 -200150 -171142 -147843 -130123 -58472 37034 10333 -40782 -84156 -22746 -15495
16758 -15495 -76558 -147827 -92425 -38243 9438 47595 14668 12747 -19221 -97098 -117287 -93790
16746 -93790 -86439 -96432 -81356 -16870 36868 92741 18511 -29539 -3299 25485 -7015 -70723
16734 -70723 -142683 -160501 -128942 -103515 -69585 -59507 -18304 31233 4353 1367 -25755 -26480
16722 -26480 20252 14085 52386 43566 17763 -20695 -63888 -29799 -44190 -35258 21506 2328
16710 2328 16108 24015 6504 -12622 -56049 -81663 -105679 -63637 6880 33871 9307 15470
$$ packed form
16794G676N8745K8665n7471m8141J7237O032m4187m4646j9508k5913J2808L8479
16782g0224K8957j055k9700L4893l9616n0520n597m0803n5038P873R1224L7181
16770i2425m5140o2585K9008K3299J7720P1651R5506k6701n1115m3374O1410P251
16758a5495o1063p1269N5402N4182M7681L8157l2927j921l1968p7877k0189K3497
16746i3790P351r993J5076O4486N3738N5873p4230m8050K6240K8784l2500o3708
16734g0723p1960j7818L1559K5427L3930J0078M1203M9537k6880k986k7122p25
16722b6480M6732o167L8301q820k5803l8458m3193L4089j4391Q932N6764j9178
16710B328J3780P907j7511j9126m3427k5614k4016M2042P0517K6991k4564O163
$$ plain form
16698 15470 38323 -23403 -36841 -75770 -102200 -101644 -38064 -83687 -126337 -86960 -98051 -65313
16686 -65313 -53558 -91801 -35978 -35097 -51278 -75876 -75565 -87959 -65807 -74084 -85904 -32094 -3722
16673 -3722 -47974 -67529 -112627 -90297 -75315 -39708 -57537 -102795 -103108 -90776 -60415 -53064
16661 -53064 -62994 -36203 3283 19576 24214 64339 54113 63363 731 -47714 -37606 -55357
16649 -55357 -70446 -72593 -110298 -99978 -93141 -76441 -63067 -13042 6032 5777 39788 -169
16637 -169 -25022 -74269 -72147 -65212 -84573 -95670 -5360 22595 -12125 30184 46720 -44388
16625 -44388 -43114 17716 -20238 -87134 -91038 -92431 -120741 -102611 -42663 -28813 -75358 -122490
16613 -122490 -81411 -38752 -16417 17880 -3774 -40718 -38742 -37962 -88682 -101147 -75189 -35058
$$ packed form
16698A5470K2853o1726j3438l8929k6430N56O3580m5623m2650L9377j1091L2738
16686f5313J1755l8243N5823Q81j6181k4598L11j2394K2152q277j1820N3810K8372
16673c722m4252j9555m5098K2330J4982L5607j7829m5258l13J2332L0361P351
16661e3064r930K6791L9486J6293M638M0125j0226R250o2632m8445J0108j7751
16649e5357j5089k147l7705J0320O837J6700J3374N0025J9074k55L4011l9957
16637a69k4853m9247K122O935j9361j1097R0310K7955l4720M2309J6536r1108
16625d4388J274O0830l7954o6896l904j393k8310J8130N9948J3850m6545m7132
16613a22490M1079M2659K2335L4297k1654l6944J976P80n0720j2465K5958M0131
$$ plain form
16601 -35058 -75047 -95855 -154243 -214778 -183342 -128949 -75866 -40024 19157 -5403 16157 21094
16589 21094 35484 68381 64978 19474 -22145 -18946 -37845 -43406 -60818 45 79632 52831
16577 52831 61641 4243 -39480 -80805 -83895 -65349 -14705 -3688 -15337 26003 33343 16937
16565 16937 7543 40503 -15597 -13553 61002 70422 25488 -8761 61041 76031 17035 -13038
16553 -13038 -36260 -40228 -37750 -26302 16528 56999 49858 25682 -26773 -70190 -26870 -4461
16541 -4461 -12425 17471 33265 -22326 -25162 22347 86136 102675 117377 36931 -52999 -56729
16529 -56729 -116823 -81151 -26866 -49811 -84286 -49743 -9696 -11451 -29048 -67096 -128675 -143667
16517 -143667 -168598 -134609 -142611 -133271 -45768 10076 49800 23707 42067 -38778 -145454 -161151
$$ packed form
16601c5058l9989k0808n8388o0535L1436N4393N3083L5842N9181k4560K1560M937
16589B1094J4390L2897l403m5504m1619L199j8899n561j7412O0863P9587k6801
16577E2831Q810n7398m3723m1325l090J8546N0644J1017j1649M1340P340j6406
16565A6937r394L2960n6100K044P4555R420m4934l4249O9802J4990n8996l0073
16553a3038k3222l968K478J1448M2830M0471p141k4176n2455m3417M3320K2409
16541d461p964K9896J5794n5591k836M7509O3789J6539J4702q0446q9930l730
16529e6729o0094L5672N4285k2945l4475L4543M0047j755j7597l8048o1579j4992
16517a43667k4931L3989q002R340Q7503N5844L9724k6093J8360q0845j06676j5697
$$ plain form
16505 -161151 -95032 -43375 2390 -16017 -12453 -24673 -92030 -95365 -74442 -99251 -112037 -104095
16493 -104095 -106023 -56390 -21044 -61282 -69216 -43901 67806 77683 50054 -22900 -56461 -67894
16481 -67894 -46752 -47356 -57838 -58161 -61757 -69820 -136510 -133683 -74242 -38997 -42289 -49581 -39738 -44685
16467 -44685 -56938 -47876 -28417 -7913 11946 -12366 -11826 -28983 -62616 -53366 29909 18796
16455 18796 6509 10939 -861 -1582 -12663 -77904 -69491 -54801 -44864 -33270 -35248 -31796 -2876
16442 -2876 36271 35052 51035 18651 -57635 -38247 -68600 -51370 -23625 -5046 3881 12086
16430 12086 26901 -224 -12215 -45567 -101509 -30263 68816 70343 3276 -88860 -13965 49042
16418 49042 1268 -20853 -22828 -19261 -43296 -19756 -5545 -19917 -18630 12359 23701 56668
$$ packed form
16505a61151O6119N1657M5765j8407L564j2220o7357l335K0923k4809j2786P942
16493a04095j928M9633L5346m0238p934K5315J11707R877k7629p2954l3561j1433
16481f7894K1142o04j0482l23l596q063o6690K827N9441L5245l292p292R843m947
16467d4685j2253R062J9459K0504J9859k4312N40j7157l3633R250Q3275j1113
16455A8796j2287M430j1800p21j1081o5241Q413J4690R937J1594j978L452K8920
16442b876L9147j219J5983l2384p6286J9388l0353J7230K7745J8579Q927Q205
16430A2086J4815k7125j1991l3352n5942P1246R9079J527o7067r2136P4895O3007
16418D9042m7774k2121j975L567k4035K3540J4211j4372J287L0989J1342L2967
$$ plain form
16406 56668 35689 -1122 7262 -3349 -37799 -86583 -27079 -11086 -38701 7035 42114 26291
16394 26291 3848 -10290 -23815 -4767 3056 55774 31505 -1357 -4524 28703 114288 140432
16382 140432 51593 -10869 -31237 -41979 -21823 -39475 -72795 -92716 -76021 -29905 -39014 -45031
16370 -45031 -39604 -47766 -97547 -85914 -58504 -50158 -65308 -23361 19065 -55246 -24158 28480
16358 28480 -22983 -12416 -473 -6849 -69151 -47567 -22407 28002 11572 -30340 -44583 -31512
16346 -31512 -64967 -80336 -90795 -63292 16914 53669 46483 -301 -41372 -40366 -82764 -132530
16334 -132530 -100809 -60794 -29663 -32827 -27082 66849 104547 29326 -16293 -7493 138 -22686
16322 -22686 -3429 23041 40820 26616 47300 42031 40762 24975 3540 -38489 -70091 -48465
$$ packed form
16406E6668k0979l6811Q384j0611l4450m8784N9504J5993k7615M5736L5079j5823
16394B6291k2443j4138j3525J9048P823N2718k4269l2862l167L3227Q5585K6144
16382A40432q8839o2462k0368j0742K0156j7652l3320j9921J6695M6116r109o017
16370d5031N427q162m9781J1633K7410Q346j5150M1947M2426p4311L1088N2638
16358B8480n1463J0567J1943o376o2302K1584K5160N0409j6430m1912j4243J3071
16346c1512l3455j5369j0459K7503Q0206L6755p186m6784m1071J006m2398m9766
16334a32530L1721M0015L1131l164N745R3931L7698p5221m5619Q800P631k2824
16322b2686J9257K6470J7779j4204K0684n269j269j5787k1435m2029l1602K1626
$$ plain form
16310 -48465 -60578 -117763 -172293 -183048 -165905 -159298 -147922 -104882 -112799 -131291 -157303 -188255
16298 -188255 -160479 -137354 -50875 -82057 -101009 -73153 -62862 -18927 12123 50955 27216
16287 27216 39306 15668 23654 50021 46872 72658 79998 16182 5021 -13647 -37233 -48398
16275 -48398 -76964 -53199 -36908 3458 -45026 -58615 -76996 -45441 -42452 -5437 -23643 -26488
16263 -26488 -15291 27730 23902 35697 19026 2352 -4259 -2699 -34129 -35092 25115 18513 26833
16250 26833 -1588 -1683 807 7360 -2389 4605 20896 82253 48324 22725 73910 104992 21321
16237 21321 15149 1687 -30075 -17827 -33337 -21116 10998 56991 49785 22114 10328 24632
16225 24632 45048 4479 27948 7749 -18013 -13101 -32380 -29293 -41882 -86697 -27522 -12788
$$ packed form
16310d8465j2113n7185n4530j0755J7143O607J1376M3040p917j8492k6012l0952
16298a88255K7776K3125Q6479l1182j8952K7856J0291M3935L1050L8832k3739
16287B7216J2090k3638P986K6367l149K5786P340o3816j1161j8668k3586j1165
16275d8398k8566K3765J6291M0366m8484j3589j8381L1555K989L7015j8206k845
16263b6488J1197M3021l828J1795j6671j6674o611J560l1430r63O0207o602Q320
16250B6833k8421r5K490O553r749O994J6291O1357l3929k5599N1185L1082q3671
16237B1321o172j3462l1762J2248j5510J2221L2114M5993p206k7671j1786J4304
16225B4632K0416m0569K3469k0199k5762M912j9279L087j2589m4815N9175J4734
$$ plain form
16213 -12788 -48200 -47393 -23457 2821 42399 -2878 -46819 -83134 -79701 -70706 -51832 -54843 -67763
16200 -67763 -65695 -123995 -89349 -81119 -69458 -23541 17799 -9980 -39822 -29132 -9367 19133
16188 19133 18015 36866 135403 170020 120961 74677 10003 12659 -38756 -94563 -42079 -13834
16176 -13834 -28345 -78661 -114906 -145145 -153309 -178270 -168420 -141876 -113159 -91818 -79488 -109240
16164 -109240 -90052 -45800 -38761 -68653 15892 -4797 -68683 -61618 -80603 -75631 -36962 -14981
16152 -14981 7891 -48805 -41133 18993 -13807 -40378 -110622 -163452 -124618 -103499 -73101 2940
16140 2940 35617 11373 14176 63086 85244 84556 67485 40242 -18798 5648 8309 -18434 -59287
16127 -59287 -42117 -9682 -4074 -19267 -47302 -27534 -10563 2242 -14635 -65005 -59359 12097
$$ packed form
16213a2788l5412Q07K3936K6278L9578m5277m3941l6315L433Q995J8874l011j2920
16200f7763K068n8300L4646Q230J1661M5917M1340k7779k9842J0690J9765K8500
16188A9133j118J8851R8537L4617m9059m6284o4674K656n1415n5807N2484K8245
16176a3834j4511n0316l6245l0239q164k4961R850K6544K8717K1341J2330k9752
16164a09240J9188M4252P039k9892Q4545k0689o3886P065j8985M972L8669K1981
16152a4981K2872n6696P672O0126l2800k6571p0244n2830L8834K1119L0398P6041
16140B940L2677k4244K803M8910K2158o88j7071k7243n9040K4446K661k6743m0853
16127e9287J7170L2435N608j5193k8035J9768J6971J2805j6877n0370N646P1456
$$ plain form
16115 12097 18596 29144 -39326 -23208 -55184 -28685 -36149 -9508 46683 3938 -43040 -49151
16103 -49151 -45237 -37730 -80880 -69255 -68565 280 21171 -9487 -34712 -37388 -34688 16124 24932
16090 24932 4830 8956 -16461 3001 29025 8616 -6241 -45272 -19428 7984 31522 39681
16078 39681 38596 44599 38438 -44237 -40050 -12134 12224 32140 15327 45627 50288 33418 21738
16065 21738 -29368 -75035 -33455 -56152 -78370 -2526 -6026 -42068 -26540 -59315 -19630 -56792
16053 -56792 -65773 -26794 -3404 7430 33548 45673 7059 -15514 -42815 -45853 44787 43153
16041 43153 -62818 -73914 -8674 -6365 -12757 28470 6662 -18613 -30839 -63843 -97588 -96722
16029 -96722 -20481 -41267 -60811 -46891 -7912 -4028 -33964 -17124 80712 79354 49751 10476
$$ packed form
16115A2097O499J0548o8470J6118l1976K6499p464K6641N6191m2745m6978o111
16103d9151L914P507m3150J1625O90O8845K0891l0658k5225k676K700N0812Q808
16090B4932k0102M126k5417J9462K6024k0409j4857l9031K5844K7412K3538Q159
16078C9681j085O003o161q2675M187K7916K4358J9916j6813L0300M661j6870j1680
16065B1738n1106m5667M1580k2697k2218P5844l500l6042J5528l2775L9685l7162
16053e6792q981L8979K3390J0834K6118J2125l8614k2573k7301l038R0640j634
16041D3153j05971j1096O5240K309o392M1227k1808k5275j2226l3004l3745Q66
16029i6722P6241k0786j9544J3920L8979L884k9936J6840R7836j358k9603l9275
$$ plain form
16017 10476 23705 -6180 -67858 -69607 -35717 -71352 -81033 -63635 -40959 644 -22676 -48286
16005 -48286 -57055 32573 46299 40335 36496 7843 31756 7431 -64348 -88976 -83098 -38385
15993 -38385 -32100 -115078 -71653 -35535 -56358 -115776 -105542 13350 28316 22245 29482 77770
15981 77770 38930 13245 29409 44732 22639 -14060 2423 38123 28459 -5764 -6857 -2730
15969 -2730 37901 -4062 -10613 36810 10877 -45790 -38175 -43496 -53781 -31273 -12329 22865
15957 22865 36073 2009 5099 -14591 256 19594 13850 58644 29883 -53855 -1881 -10612
15945 -10612 -90262 -138483 -122212 -105124 -64327 -32061 -19736 17297 42726 30260 6266 -10121
15933 -10121 18190 24449 -25858 -82499 -108771 -69004 -56774 -48870 -58740 -62350 -30353 -25429 -29710
$$ packed form
16017A0476J3229k9885o1678j749L3890l5635r681J7398K2676M1603k3320k5610
16005d8286q769Q9628J3726n964l839k8653K3913k4325p1779k4628N878M4713
15993c8385O285q2978M3425L6118k0823n9418J0234J18892J4966o071P237M8288
15981G7770l8840k5685J6164J5323k2093l6699J6483L5700r664l4223j093M127
15969b730M0631m1963o551M7423k5933n6667P615n321j0285K2508J8944L5194
15957B2865J3208l4064L090j9690J4847J9338n744M4794k8761q3738N1974q731
15945a0612p9650m8221J6271J7088M0797L2266J2325L7033K5429j2466k3994j6387
15933a0121K8311O259n0307n6641k6272L9767J2230P904r870l610L1997M924m281
$$ plain form
15920 -29710 -43213 -25687 -46295 -69978 12732 95546 119266 86935 70809 37161 10438 -51216
15908 -51216 -76759 5413 48639 5752 -92179 -74524 -44380 -61931 -79496 -47198 -26286 -66212
15896 -66212 -79240 -58625 -18619 -2847 14305 734 8713 4541 -49289 -48625 6665 69689
15884 69689 30669 -19933 10412 11062 -4707 51552 94486 96259 101054 43097 23781 13791 11364
15871 11364 30831 43756 7788 -66135 -20828 -28173 -51227 -2231 -58826 -83341 -95876 -70587
15859 -70587 -67791 -51878 -30944 3890 54568 16766 -4027 -60558 -66359 5647 -3512 -41227
15847 -41227 -76706 -41394 -4151 358 12312 39277 15926 18855 46368 33407 23225 -4850
15835 -4850 -19704 30783 61472 33022 7926 -2038 -14393 -62915 -82141 -80356 -106649 -122138
$$ packed form
15920b9710j3503J7526k0608k3683Q2710Q2814K3720l2331j6126l3648k6723o1654
15908e1216k5543Q2172M3226m2887r7931J7655L0144j7551j7565L2298K0912l9926
15896f6212j3028K0615M0006J5772J7152j3571P979m172n3830O64N5290O3024
15884F9689l9020n0602L0345O50j5769N6259M2934J773M795n7957j9316r990k427
15871A1364J9467J2925l5968p3923M5307p345k3054M8996n6595k4515j2535K5289
15859g0587K796J5913K0934L4834N0678l7802k0793n6531n801P2006r159l7715
15847d1227l5479L5312L7243M509J1954K6965k3351K929K7513j2961j0182k8075
15835d850j4854N0487L0689k8450k5096r964j2355m8522j9226J785k6293j5489
$$ plain form
15823 -122138 -82312 -102711 -144935 -136258 -92422 -137320 -185487 -182101 -122509 -80841 -98777 -151442
15811 -151442 -146822 -127955 -139966 -117610 -84830 -63854 -24486 -10725 -985 39924 37559 -43950
15799 -43950 -45448 -19110 13549 27292 58640 37099 2382 -19121 -45385 -54423 -72714 -71090
15787 -71090 -47269 -38019 13528 28604 54893 39362 -7855 -44951 -55462 -69579 -83464 -23415
15775 -23415 44465 57567 11990 -9201 4808 4248 4219 -41160 -70307 -50086 -24597 -9080 -10874
15762 -10874 -89944 -66968 -40923 -70128 -69940 -73709 -88728 -27121 -12809 -5493 2118 -4504 -38818
15749 -38818 -75966 15208 129046 108482 36355 -550 -22737 -35692 -82422 -127918 -33090
15738 -33090 43926 33216 8315 -7957 19163 26185 -34656 -95560 -90749 -92077 -75517 -30543
$$ packed form
15823a22138L9826k0399m2224Q677M3836m4898m8167L386N9592M1668j7936n2665
15811a51442M620J8867j2011K2356L2780K0976L9368J3761R740M0909k365q1509
15799d3950j498K6338L2659J3743L1348k1541l4717k1503k6264r038j8291J624
15787g1090K3821R250N1547J5076K6289j5531m7217l7096j0511j4117j3885O0049
15775b3415O7880J3102m5577k1191J4009n60k9m5379k9147K0221K5489J5517j794
15762a0874p9070K2976K6045k9205J88l769j5019O1607J4312P316P611o622l4314
15749c8818l7148R1174J13838k0564p2127l6905k2187j2955m6730m5496R4828
15738c3090P7016j0710k4901j6272K7120P022o0841o0904M811j328J6560M4974
$$ plain form
15726 -30543 -73371 -114140 -141163 -115112 -90178 -93090 -97827 -47457 -55972 -66314 -23230 -18280
15714 -18280 -27248 -67643 -49053 6073 20906 27966 -8179 8891 21076 -147 19430 16571
15702 16571 8052 40760 25632 50191 25534 12182 -12545 -34653 -14506 18737 44637 35167
15690 35167 40532 50268 15429 -27188 4362 33231 -9042 -75839 -32014 25422 82724 18861
15678 18861 9372 15259 -6760 -4034 14186 -4731 -13394 -12226 19467 38729 82172 64462 87194
15665 87194 156244 105793 101157 70632 66638 -20860 -50357 -42218 -72802 -111188 -129267 -128844 -89585
15652 -89585 -117559 -122308 -75412 -23947 -26547 -67509 -72896 -72596 -80691 -78124 -27191 -4779 -34693
15639 -34693 21763 88319 86627 30453 -103875 -118115 -52874 16749 -24154 -43595 -60630 -70485
$$ packed form
15726c0543m2828m0769k7023K6051K4934k912m737N0370q515j0342M3084M950
15714a8280q968m0395J8590N5126J4833P060l6145J7070J2185k1223J9577k859
15702A6571q519L2708j5128K4559k4657j3352k4727k2108K0147L3243K5900r470
15690C5167N365R736l4839m2617L1550K8869m2273o6797M3825N7436N7302o3863
15678A8861r489N887k2019K726J8220j8917q663J168L1693J9262M3443j7710K2732
15665H7194O9050n0451m636l0525l994q7498k9497Q139l0584l8386j8079M23L9259
15652h9585k7974m749M6896N1465k600m0962n387L00q095K567N0933K2412k9914
15639c4693N6456O6556j692n6174j34328j4240O5241O9623m0903j9441j7035r855
$$ plain form
15627 -70485 -50944 971 70448 45058 -3722 -30566 -61484 -37659 -52501 -102122 -152108 -149845
15615 -149845 -145350 -133665 -55412 -19143 -2206 -24067 -74271 -83590 -68704 -73107 -65112 2073
15603 2073 68705 93571 81433 29533 -24752 -67912 -3933 27672 19499 55836 10798 -19693
15591 -19693 46770 117955 115265 15691 -14122 -9317 -3918 19682 37731 63590 22073 -6009
15579 -6009 -27147 -35937 -46654 -82523 -105817 -77190 -19622 8604 -8912 -13325 -4330 34871
15567 34871 60486 19791 -28817 -3993 -2275 -3942 -70480 -59721 -31212 -44648 -20993 -53142
15555 -53142 -142070 -114674 -51437 -54985 -112169 -107570 -103659 -68140 -11631 18741 21449 25939 47296
15542 47296 16965 18940 49022 26365 17934 -21781 -62588 -56310 -16872 29725 45705 17195
$$ packed form
15627g0485J9541N1915O9477k5390m8780k6844l0918K3825j4842m9621m9986K263
15615a49845M495J1685P8253L6269J6937k1861n0204r319J4886m403P995O7185
15603B073O6632K4866j2138n1900n4285m3160O3979L1605q173L6337m5038l0491
15591a9693O6463P1185k690r9574k9813M805N399K3600J8049K5859m1517k8082
15579f009k1138q790j0717l5869k3294K8627N7568K8226j7516m413Q995L9201
15567C4871K5615m0695m8608K4824J718j667o6538J0759K8509j3436K3655l2149
15555e3142q8928K7396O3237l548n7184M599L911L5519N6509L0372K708M490K1357
15542D7296l0331J975L0082k2657q431l9715m0807O278L9438M6597J5980k8510
$$ plain form
15530 17195 -32916 -26151 -25124 30632 53062 5872 -30205 -17100 36481 42681 15018 -76867
15518 -76867 -107261 -89091 -89891 -28228 -38331 -30823 -28602 -62733 -30930 2233 36947 50787
15506 50787 15548 -21825 -68728 -76212 -25875 213 59837 62927 25193 12584 57647 23758
15494 23758 45550 66779 13511 -45442 -69308 -81464 -60773 7090 47962 33330 17205 34542
15482 34542 41391 60839 40826 -373 -17884 -35601 -43177 -7282 -23311 -67568 -63888 -41518
15470 -41518 -73324 -100049 -65715 -88798 -78903 -10475 23480 25241 -60767 -106467 -124678 -49169
15458 -49169 -57152 -71694 -50631 -32487 1724 -6095 7895 -15808 -26332 -63325 -21034 20395
15446 20395 -22590 -103464 -85800 -54364 -66812 -95973 -67223 -28589 -4199 33899 56291 42230
$$ packed form
15530A7195n0111O765J027N5756K2430m7190l6077J3105N3581O200k7663r1885
15518g6867l0394J8170q00O1663j0103P508K221l4131L1803L3163L4714J3840
15506E0787l5239l7373m6903p484N0337K6088N9624L090l7734j2609M5063l3889
15494B3758K1792K1229n3268n8953k3866j2156K0691O7863M0872j4632j6125J7337
15482C4542O849J9448k0013m1199j7511j7717p576L5895j6029m4257L680K2370
15470d1518l1806k6725L4334k3083R895O8428L3955J761q6008m5700j8211P5509
15458d9169p983j4542K1063J8144L4211p819J3990k3703j0524l6993M2291M1429
15446B0395m2985q0874J7664L1436j2448k9161K8750L8634K4390L8098K2392j4061
$$ plain form
15434 42230 35393 71369 49798 28949 7322 -25360 -45796 -83531 -42898 -25747 -32494 -16720
15422 -16720 6740 -34080 21154 53593 16231 15431 16255 -26802 -43078 4346 12922 19538 12555
15409 12555 1014 31521 61840 17016 16851 -7992 -48377 -67777 -62888 -61607 -60381 -54351 -4100
15396 -4100 30649 58894 52676 25908 -33484 4435 14153 -50753 -91159 -107841 -87942 -4323
15384 -4323 50575 57980 40691 48125 27052 18573 -19348 -22260 -11336 -17066 -9699 -23781 -54521
15371 -54521 -72685 -58035 -75308 -92418 -19163 47816 41569 58184 57847 27965 52707 106997
15359 106997 49060 8187 -25435 -58952 -70628 -33480 -20531 -40163 -57610 -47714 -65240 -66253
15347 -66253 -43333 -33553 1723 28751 4108 -8871 1338 15067 53775 12021 -47755 -26795
$$ packed form
15434D2230o837L5976k1571k0849k1627l2682k0436l7735M0633J7151o747J5774
15422a6720K3460m0820N5234L2439l7362q00Q24m3057j6276M7424Q576O616o983
15409A2555j1541L0507L0319m4824j65k4843m0385j9400M889J281J226O030N0251
15396d100L4749K8245o218k6768n9392L7919R718o4906m0406j6682J9899Q3619
15384d323N4898P405j7289P434k1073q479l7921k912J0924n730P367j4082l0740
15371e4521j8164J4650j7273j7110P3255O6979o247J6615l37k9882K4742N4290
15359A06997n7937m0873l3622l3517j1676L7148J2949j9632j7447R896j7526j013
15347f6253K2920R780L5276K7028k4643j2979J0209J3729L8708m1754n9776K0960
$$ plain form
15335 -26795 4027 -13098 -56603 -71999 -83058 -46872 -4317 -13704 -76377 -39767 44164 107827
15323 107827 86491 65581 39010 -16217 -48381 -47222 -67877 -72643 -68727 -62006 -54209 -65496
15311 -65496 -38136 -1725 -6430 -25587 -32107 -63350 -26530 5113 19220 30842 4500 -28605
15299 -28605 -15787 21455 13783 33048 38731 -9321 -46393 -88187 -21871 5076 50482 95195
15287 95195 77603 41888 -14816 -48493 -66452 22291 41663 29468 4894 -27646 -55448 -33331
15275 -33331 -18447 -17726 -11852 32408 66069 72662 47746 -11602 -57731 -62764 3788 49983 76125
15262 76125 109650 96363 71315 41376 12443 13334 8220 -17301 -31922 -2880 -13328 10000
15250 10000 38349 4499 5360 1840 -31196 -24221 17000 34041 -23436 -23617 -5769 -14932 -16770
$$ packed form
15335b6795L0822j7125m3505j5396j1059L6186M2555r387o2673L6610Q3931O3663
15323A07827k1336k0910k6571n5227l2164J159k0655m766L916O721P797j1287
15311f5496K7360L6411m705j9157o520l1243L6820L1643J4107J1622k6342l3105
15299b8605J2818L7242p672J9265N683m8052l7072m1794O6316K6947M5406M4713
15287I5195j7592l5715n6704l3677j7959Q8743J9372j2195k4574l2540k7802K2117
15275c3331J4884P21N874M4260L3661O593k4916n9348m6129n033O6552M6195K6142
15262G6125L3525j3287k5048k9939k8933Q91n114k5521j4621K9042j0448K3328
15250A0000K8349l3850Q61l520l3036O975M1221J7041n7477j81J7848r163j838
$$ plain form
15237 -16770 -10156 -46982 -90211 -116505 -123125 -64139 -7508 -60106 -72395 -115987 -51298 -12147
15225 -12147 2406 4199 36099 58449 82744 58047 89181 38558 -47132 -53564 -60657 -38876
15213 -38876 -23865 4627 45462 31038 38602 106044 99931 100816 82047 73756 78478 63084 48581
15200 48581 37517 92184 71869 8208 34338 47267 28321 -29903 -2804 -24792 -55910 -50598
15188 -50598 -77480 -71562 2914 -25883 -44385 -58514 -69445 -27306 8281 -47667 -92097 -104064
15176 -104064 -75853 -25681 24345 40033 4532 40686 2506 -27195 36944 57916 23623
15165 23623 -16491 -57190 -59783 -48116 -35113 -60897 -39313 1123 16580 44820 40364 2032
15153 2032 4900 -1863 4750 -66179 -68947 3572 50502 35310 -7401 52736 66436 10403 -1329
$$ packed form
15237a6770O614l6826m3229k6294o620N8986N6631n2598j2289m3592O4689L9151
15225a2147J4553J793L1900K2350K4295k4697L1134n0623q5690o432p093K1781
15213c8876J5011K8492M0835j4424P564O7442o113Q85j8769q291M722j5394j4503
15200D8581j1064N4667k0315o3661K6130J2929j8946n8224K7099k1988l1118N312
15188e0598k6882N918P4476k8797j8502j4129j0931M2139L5587n5948m4430j1967
15176a04064K8211N0172N0026J5688l5501L6154l8180k9701O4139K0972l4293
15165B3623m0114m0699k593J1667J3003k5784K1584M0436J5457K8240m456l8332
15153B032K868o763O613p0929k768P2519M6930j5192m2711O0137J3700n6033j1732
$$ plain form
15140 -1329 46677 63225 65738 -16516 -7088 -6061 4142 -22687 9073 11675 20141 27005 46511
15127 46511 -650 2552 -29596 -35984 -1760 88199 79038 54843 35527 -2398 -32630 -56956
15115 -56956 -70365 -65046 -64086 -17704 -14683 46499 1031 -14658 -29716 -56252 -63982 -36369 16870
15102 16870 7879 16285 13915 -10265 -32013 14177 50128 89289 82113 56048 10008 -17776
15090 -17776 -28490 -40698 12601 22826 34577 62188 54140 50324 48026 20338 -43517 -34771
15078 -34771 -47729 -69317 -41391 1012 20881 37158 35165 22246 -39506 -13569 15556 15157
15066 15157 -4751 -51885 -81540 -37871 -16385 -29122 -31652 -27012 -45988 19542 42936 33875
15054 33875 67202 68883 129325 136433 85858 47950 62764 59902 51810 36917 99794 92811 -7155
$$ packed form
15140a329M8006J6548K513q2254R428J027J0203k6829L1760K602Q466O864J9506
15127D6511m7161L202l2148o388L4224Q9959r161k4195j9316l7925l0232k4326
15115e6956j3409N319R60M6382L021O1182m5468j5689j5058k6536p730K7613N3239
15102A6870q991Q406k370k4180k1748M6190L5951L9161p176k6065m6040k7784
15090a7776j0714j2208N3299J0225J1751K7611q048l816k298k7688o3855Q746
15078c4771j2958k1588K7926M2403J9869J6277j993j2919o1752K5937K9125l99
15066A5157j9908m7134k9655M3669K1486j2737k530M640j8976O5530K3394r061
15054C3875L3327J681O0442P108n0575l7908J4814k862q092j4893O2877o983r9966
$$ plain form
15041 -7155 -53292 -58308 -37030 -22764 -38269 -38851 -1631 27526 70506 -11397 -79675 -82883 -86244
15028 -86244 -81429 -33982 -55397 -15970 -11513 -27168 173 -4322 25472 -12828 -30595 6068
15016 6068 21000 -24866 -32200 -46766 -107481 -74710 -47778 -54326 -51846 -106626 -143422 -60007
15004 -60007 -21172 39988 55454 38891 -23498 -24262 21272 77618 66814 121252 137406 96897
14992 96897 77264 102132 67034 9958 22828 14474 5410 26858 -14146 -48501 -24635 -26507
14980 -26507 -34190 -37767 -8035 -8281 -46707 -101082 -103293 -55345 29065 35277 9996 -57833 -82785
14967 -82785 -118498 -108278 -61540 -24741 -49256 2958 36336 18291 42611 -641 -6635 19217
14955 19217 44511 44093 94515 116630 81863 117119 114364 129572 65267 15878 -1456 -33067
$$ packed form
15041g155m6137n016K1278J4266j5505n82L7220K9157M2980q1903o8278l208l361
15028h6244M815M7447k1415L9427M457j5655K7341m495K9794l8300j7767L6663
15016F068J4932m5866p334j4566o0715L2771K6932o548K480n4780l6796Q3415
15004f0007L8835O1160J5466j6563o2389p64M5534N6346j0804N4438J6154m0509
14992I6897j9633K4868l5098n7076J2870q354r064K1448m1004l4355K3866j872
14980b6507p683l577K9732k46l8426n4375k211M7948Q4410O212k5281o7829k4952
14967h2785l5713J0220M6738L6799k4515N2214L3378j8045K4320m3252n994K5852
14955A9217K5294m18N0422K2115l4767L5256k755J5208o4305m9389j7334l1611
$$ plain form
14943 -33067 -30968 -18900 2381 44197 -1101 -19093 -28498 -13688 -6516 15395 41360 62739
14931 62739 -8134 35085 88810 62955 79092 47459 56808 61274 34512 10181 22453 8367
14919 8367 1080 -10471 -16720 8481 26335 67351 -9955 -63870 -69179 -47735 -29583 29798
14907 29798 73196 75260 92465 60724 93485 97271 106871 88743 39425 37828 74880 54906
14895 54906 -6575 -7661 -8146 -32449 -10283 -7289 3752 747 8350 70552 112556 53190 -5809
14882 -5809 12963 8892 -7001 -13380 9554 18297 4661 -20462 -70358 -79526 -104346 -61911 -20579
14869 -20579 -26022 -26567 -44083 -70938 -82237 -34327 -90153 -70514 -32504 -13159 23888 16822
14857 16822 47991 3637 -15719 5361 -37222 15478 71131 63092 23397 -18695 -44378 -57783
$$ packed form
14943c3067K099J2068K1281M1816m5298j7992r405J4810P172K1911K5965K1379
14931F2739p0873M3219N3725k5855J6137l1633R349M466k6762k4331J2272j4086
14919H367p287j1551o249K5201J7854M1016p7306n3915n309K1444J8152N9381
14907B9798M3398K064J7205l1741L2761L786R600j8128m9318j597L7052j9974
14895E4906o1481j086m85k4303K2166K994J1041l005P603O2202M2004n9366n8999
14882e809J8772m071j5893o379K2934Q743j3636k5123m9896r168k4820M2435M1332
14869b0579n443n45j7516k6855j1299M7910n5826J9639L8010J9345L7047p066
14857A6822L1169m4354j9356K1080m2583N2700N5653q039l9695m2092k5683j3405
$$ plain form
14845 -57783 -46505 7145 5935 -7625 -224 -91 -36237 -83026 -53271 -55358 -45806 -47953 -39003
14832 -39003 -21246 -6074 -51505 -73507 -80652 -75312 -55337 -72798 -41959 14039 39127 29585
14820 29585 22600 32525 -14667 11080 -17201 -34406 -12724 20755 -28283 -33232 18227 60433
14808 60433 50699 63199 25960 4259 12674 10886 49838 86556 87943 88306 49964 -13364 -67301
14795 -67301 -64560 5188 34874 -8102 1891 57832 104271 111327 59216 35860 23527 15894
14783 15894 -27198 -56201 -50159 -86480 -78754 -22902 7877 21303 -10800 -11512 29085 19948 13410
14770 13410 24959 -975 -78522 -102199 -34318 21703 25553 27152 -16003 -11505 44113 78009
14758 78009 84669 102257 50674 46543 24069 -19614 -85761 -61883 -116711 -120354 -114941 -81677
$$ packed form
14845e7783J1278N3650j210j3560P401J33l6146m6789K9755k087R552k147Q950
14832c9003J7757J5172m5431k2002p145N340J9975j7461L0839N5998K5088r542
14820B9585o985R925m7192K5747k8281j7205K1682L3479m9038m949N1459M2206
14808F0433r734J2500l7239k1701Q415j788L8952L6718J387L63l8342o3328n3937
14795f7301K741O9748K9686m2976R993N5941M6439P056n2111k3356j2333p633
14783A5894m3092k9003O042l6321P726N5852L0779J3426l2103p12M0597r137o538
14770A3410J1549k5934p7547k3677O7881N6021L850J599m3155M498N5618L3896
14758G8009O660J7588n1583m131k2474m3683o6147K3878n4828l643N413L3264
$$ plain form
14746 -81677 -40504 -64503 -105567 -59273 -5552 30398 86477 58069 109974 109122 71109 96705
14734 96705 107736 27813 21318 29500 77907 42849 29327 83398 107859 63581 49268 53517
14722 53517 2479 74572 80546 25019 37812 26622 15790 5402 28578 71787 57912 72488
14710 72488 90054 104206 85370 73664 17958 21564 48684 -5330 -19570 758 -13040 -39544
14698 -39544 -15700 -2493 24104 -31662 -30955 292 18905 50733 49302 -11155 -59236 -67810
14686 -67810 -4577 -38890 -18679 27751 -7842 -8856 -53616 -63729 -12727 -12877 19939 -20900
14674 -20900 -32240 -46542 -29194 16681 36075 -353 12249 20778 81594 74994 103611 99977
14662 99977 46728 20303 9363 -9006 -19836 46674 73535 34398 -620 -13034 21212 933
$$ packed form
14746h1677M1173k3999m1064M6294N3721L5950N6079k8408N1905q52l8013K5596
14734I6705J1031p9923o495Q182M8407l5058j3522N4071K4461m4278j4313M249
14722E3517n1038P2093N974n5527J2793j1190j0832j0388K3176M3209j3875J4576
14710G2488J7566J4152j8836j1706n5706L606K7120n4014j4240K0328j3798k6504
14698c9544K3844J3207K6597n5766P07L1247J8613L1828j431o0457m8081q574
14686f7810O3233l4313K0211M6430l5593j014m4760j0113N1002j50L2816m0839
14674b0900j1340j4302J7348M5875J9394l6428J2602Q529O0816o600K8617l634
14662I9977n3249k6425j0940j8369j0830O6510K6861l9137l5018j2414L4246k0279
$$ plain form
14650 933 20254 16218 18415 38490 37311 10561 -71979 -77089 -51272 -41212 -3804 19455 -8532
14637 -8532 -76472 -68282 -20595 4324 31337 -4354 -18750 4865 93810 90690 61864 20488
14625 20488 27262 28998 14475 -25720 422 -8577 -982 -19820 -42092 -17406 -147 -27319
14613 -27319 -55155 -26999 -41079 -70941 -34256 96 3597 -25083 -14982 -2462 8222 13019
14601 13019 18770 -100 18727 12453 -36383 2190 47356 51913 23735 -62415 -118576 -118293 -83554
14588 -83554 -63964 -40081 -75727 -577 8528 -6829 -5202 42409 45472 98680 76431 41798
14576 41798 -7050 -36721 12939 29769 68273 75461 86580 67033 34915 -12472 -9937 51471
14564 51471 94352 67063 51230 64632 95502 76066 94697 102966 70973 29735 20693 14855
$$ packed form
14650I33J9321m036K197K0075j179k6750q2540n110K5817J0060L7408K3259k7987
14637h532o7940Q190M7687K4919K7013l5691j4396K3615Q8945l120k8826m1376
14625B0488O774J736j4523m0195K6142q999P595j8838k2272K4686J7259k7172
14613b7319k7836K8156j4080k9862L6685L4352L501k8680J0101J2520J0684M797
14601A3019N751j8870J8827o274m8836L8573M5166M557k8178q6150n6161K83L4739
14588h3554J9590K3883l5646P5150R105j5357J627M7611L063N3208k2249l4633
14576D1798m8848k9671M9660J6830L8504P188J1119j9547l2118m7387K535O1408
14564E1471M2881k7289j5833J3402L0870j9436J8631Q269l1993m1238r042n838
$$ plain form
14552 14855 25300 3016 38925 54493 40081 29136 34449 42715 694 52298 100378 55172
14540 55172 22264 2114 -6096 -37792 -102451 -91749 -19723 31228 46963 1710 -48636 -48373
14528 -48373 10459 35040 -672 -53236 -33252 16806 -12098 -48308 -47980 -26530 -10044 -28536
14516 -28536 -19375 12405 -36618 -102662 -88177 -44220 -14998 10793 -25730 -44352 -59842 -47341
14504 -47341 -6375 100186 68962 9561 -1014 66919 118239 74959 39328 65694 10604
14493 10604 -3020 -76682 -85007 -19772 -22548 -6378 -3955 -28575 -20216 24072 15339 -6144 -24991
14480 -24991 -65205 -48734 26395 71965 48728 51154 95417 91338 49933 -19716 -57023 -20414
14468 -20414 9590 9160 8674 1824 -7981 8547 -35208 -79022 -55473 -48101 -28225 -12406 -18777
$$ packed form
14552A4855J0445k2284L5909J5568j4412j0945N313Q266m2021N1604M8080m5206
14540E5172l2908k0150q210l1696o4659J0702P2026N0951J5735m5253n0346K63
14528d8373N8832K4581l5712n2564J9984N0058k8904l6210L28K1450J6486j8492
14516b8536R161L1780m9023o6044J4485M3957K9222K5791l6523j8622j5490J2501
14504d7341M0966J06561l1224n9401j0575O7933N1320m3280l5631K6366n5090
14493A0604j3624p3662q325O5235k776J6170K423k4620Q359M4288q733k1483j8847
14480b4991m0214J6471P5129M5570k3237K426M4263m079m1405o9649l7307L6609
14468b0414L0004m30m86o850r805J6528m3755m3814K3549P372J9876J5819o371
$$ plain form
14455 -18777 42769 47001 2443 -50225 -56002 -28117 16070 14457 -10932 20283 36745 -6469
14443 -6469 -53417 -23927 17894 -132 -25990 -11266 23699 12307 -19803 -66817 -113513 -98134
14431 -98134 -66952 -30897 -31033 -70994 -57725 -57654 -87106 -25960 -40535 -48472 -24905 -4800 -5668
14418 -5668 -22200 -26785 -45467 -22522 -98812 -144617 -88986 -52309 -24156 16733 -22606 -11723
14406 -11723 30840 21527 -25168 -20907 -9766 -18258 -10561 -13672 12642 67020 125018 115695 107437
14393 107437 111224 70517 48788 42938 24066 -11317 -26294 -19941 9577 41023 83314 72879
14381 72879 51701 21731 2616 22205 29517 45117 42844 29849 21062 -35649 -45149 -26704
14369 -26704 -59268 -90212 -93298 -81485 -50887 -23002 -44563 -22057 11128 12585 30061 68861
$$ packed form
14455a8777O1546M232m4558n2668n777K7885M4187j613k5389L1215J6462m3214
14443f469m6948K9490M1821j8026k5858J4724L4965j1392l2110m7014m6696J5379
14431i8134L1182L6055j36l9961J3269P1k9452O1146j4575p937K3567K0105q68
14418e668j6532m585j8682K2945p6290m5805N5631L6677K8153M0889l9339J0883
14406a1723M2563r313m6695M261J1141q492P697l111K6314N4378N7998r323q258
14393A07437L787m0707k1729n850j8872l5383j4977O353K9518L1446M2291j0435
14381G2879k1178k9970j9115J9589P312J5600k273j2995q787n6711r500J8445
14369b6704l2564l0944l086J1813L0598K7885k1561K2506L3185J457J7476L8800
$$ plain form
14357 68861 65272 45387 30272 -11143 -2953 -9400 33691 42217 27204 -14261 -8684 50044 53385
14344 53385 -29927 10379 55839 48147 35222 17511 76478 101015 99390 110555 74768 19681
14332 19681 22975 38072 56666 74543 81471 96125 108428 69004 13789 26236 -20985 -31886
14320 -31886 -13274 -32071 3302 38996 52157 34282 23080 14547 65717 37407 6526 57240
14308 57240 68482 76885 71246 94966 18395 -2760 -44811 -69232 -37312 25949 53531 80292
14296 80292 87588 41790 35365 58822 59204 -4883 30213 52090 24610 22984 -15424 -37664 -12889
14283 -12889 26837 66562 79283 2480 -32216 24390 -10102 -40922 -41297 -62876 -49900 -24990
14271 -24990 -16695 3426 39562 79787 32834 -46895 -78621 3138 60397 35915 -52695 -68812
$$ packed form
14357F8861l589j9885j5115m1415Q190o447M3091Q526j5013m1465N577N8728L341
14344E3385q3312M0306M5460p692j2925j7711N8967K4537j625J1165l5787n5087
14332A9681L294J5097J8594J7877O928J4654J2303l9424n5215J2447m7221j0901
14320c1886J8612j8797L5373L5694J3161j7875j1202q533N1170k8310l0881N0714
14308E7240J1242Q403n639K3720p6571k1155m2051k4421L1920O3261K7582K6761
14296H0292P296m5798o425K3457L82o4087L5096K1877k7480j626l8408k2240K4775
14283a2889L9726L9725J2721p6803l4696N6606l4492l0820l75k1579J2976K4910
14271b4990Q295K0121L6136M0225m6953p9729l1726Q1759N7259k4482q8610j6117
$$ plain form
14259 -68812 -62719 -56378 -52837 -90010 -31173 15127 20269 18368 -3838 -40673 -91370 -57128 24424
14246 24424 -5852 -56908 -83973 -48417 9456 26241 74335 56590 70512 71976 44471 25362
14234 25362 6825 -53429 -26227 -3408 -11002 -14931 -3580 38741 42675 20535 8596 -2355
14222 -2355 -41638 -68797 -99328 -72639 -80624 -82236 -57575 -79735 -54625 -19995 4412 20228
14210 20228 43927 16172 -44296 -45530 -3364 12727 -208 -27220 8521 76206 41005 -12002
14198 -12002 -24920 -8388 44655 42665 83551 65604 33012 38999 92989 60210 77694 73971
14186 73971 9370 27148 14468 -27410 -46243 -32391 -70550 -55825 -53727 -58767 -1130 9962
14174 9962 41579 104990 96493 84487 38098 19696 -6552 -24651 -44998 -51869 -46815 -72537
$$ packed form
14259f8812O093O341L541l7173N8837M6300N142j901k2206l6835n0697L4242Q1552
14246B4424l0276n1056k7065L5556N7873J6785M8094j7745J3922J464k7505j9109
14234B5362j8537o0254K7202K2819p594l929J1351M2321L934k2140j1939j0951
14222b355l9283k7159l0531K6689p985j612K4661k2160K5110L4630K4407J5816
14210B0228K3699k7755o0468j234M2166J6091j2935k7012L5741O7685l5201n3007
14198a2002j2918J6532N3043j990M0886j7947l2592N987N3990l2779J7484l723
14186G3971o4601J7778j2680m1878j8833J3852l8159J4725K098n040N7637J1092
14174I962L1617O3411q497j2006m6389j8402k6248j8099k0347o871N054k5722
$$ plain form
14162 -72537 -118943 -76099 -39448 11478 36283 47775 30178 -25230 -41188 -50150 -30039 7269
14150 7269 14972 -45018 -75462 -32843 59931 34211 8286 -14862 -7130 22263 26800 -8786
14138 -8786 -39166 -48882 -5022 -21675 9482 35006 27562 22165 29196 49539 -16628 -38901 -15279
14125 -15279 -29200 -376 29682 27673 17018 -40936 -58 22191 -52435 -30556 -27074 -12047
14113 -12047 -26637 -22487 13980 38023 8496 -26060 -856 21559 22602 -8371 -63546 -88701
14101 -88701 -93163 -70082 -33950 5460 15046 6331 -31100 -46762 10698 53950 65186 74774
14089 74774 58388 -33361 -64531 -68134 -28185 -10044 -10364 -56717 -96429 -91278 -104779 -69611
14077 -69611 -23282 -29390 -15498 6482 9064 68522 53543 23840 18677 38715 14890 25389
$$ packed form
14162g2537m6406M2844L6651N0926K4805J1492j7597n5408j5958q962K0111L7308
14150G269P703n9990l0444M2619R2774k5720k5925k3148P732K9393M537l5586
14138h786l0380r716M3860j6653L1157K5524p444n397P031K0343o6167k2273K3622
14125a5279j3921K8824L0058k009j0655n7954M0878K2249p4626K1879L482J5027
14113a2047j4590M150L6467K4043k9527l4556K5204K2415J043l0973n5175k5155
14101h8701m462K3081L6132L9410R586q715l7431j5662N7460M3252J1236R588
14089G4774j6386r1749l1170l603L9949J8141l20m6353l9712N151j3501L5168
14077f9611M6329o108J3892K1980K582N9458j4979k9703n163K0038k3825J0499
$$ plain form
14065 25389 48506 52408 24514 -31215 -92718 -101251 -57350 -14009 11597 46890 63715 5451
14053 5451 -55725 -49511 -58466 -77785 -21891 8433 -9032 23572 81389 66512 59096 3010
14041 3010 5591 56156 46393 22572 37986 -14902 -11343 33722 53643 39294 84394 82808 34391
14028 34391 93412 135156 157393 110506 49433 59429 48547 -11614 -50879 -10545 21934 -43135
14016 -43135 -29754 4888 14657 31291 11927 -38309 -47414 -25988 -55581 -50069 26368 57253
14004 57253 76526 122743 97124 46590 -50230 -14516 42034 34355 -34043 -86671 -118690 -123473
13992 -123473 -74918 -21915 64518 66223 34373 46308 2350 -37451 -80588 20884 22368 -50770
13980 -50770 -137408 -139411 -96204 -51092 -73513 -68953 -45920 -13810 -8619 -40659 -8186 -49426
$$ packed form
14065B5389K3117L902k7894n5729o1503q533M3901M3341K5606L5293J6825n8264
14053E451o1176O214q955j9319N5894L0324j7465L2604N7817j4877p416n6086
14041C010K581N0565r763k3821J5414n2888L559M5065J9921j4349M5100j586m8417
14028C4391N9021M1744K2237m6887o1073R996j0882o0161l9265M0334L2479o5069
14016d3135J3381L4642R769J6634j9364n0236r105K1426k9593N512P6437L0885
14004E7253J9273M6217k5619n0534r6820L5714N6550p679o8398n2628l2019m783
13992a23473M8555N3003Q6433J705l1850J1935m3958l9801m3137J01472J484p3138
13980e0770q6638k003M3207M5112k2421M560K3033L2110N191l2040L2473m1240
$$ plain form
13968 -49426 -20498 -14387 -33830 -15325 -15529 -110372 -103723 -55560 26482 82602 71637 76845 60630
13955 60630 41555 -10985 -22758 -40831 -46738 -44035 -96861 -61597 -13347 15439 42293 43320
13943 43320 11121 -8991 -16207 -39276 -34197 -46780 -100045 -89038 -3796 -8136 -30617 -25908
13931 -25908 -51660 -53656 -36078 -67272 -118242 -142440 -49208 4360 -2356 -6314 -48976 -82653
13919 -82653 -51947 -15297 3441 -12056 -33418 -38986 30864 66346 11887 -19865 37146 29843
13907 29843 58216 77504 50871 23659 119541 167428 82715 11595 11188 -10708 -76076 -4641
13895 -4641 -5455 5883 27325 12361 -12720 -26481 -41756 -54343 -39788 -32742 -42746 -20849
13883 -20849 16281 17891 -24138 -83081 -100516 -95590 -73000 -99438 -55388 14705 35865 -22879
$$ packed form
13968d9426K8928O111j9443J8505k04r4843O649M8163Q2042N6120j0965N208j6215
13955F0630j9075n2540j1773j8073n907K703n2826L5264M8250K8786K6854J027
13943D3320l2199k0112p216k3069N079j2583n3265J1007Q5242m340k2481M709
13931b5908k5752j996J7578l1194n0970k4198R3232N3568o716l958m2662l3677
13919h2653L0706L6650J8738j5497k1362n568O9850L5482n4459l1752N7011p303
13907B9843K8373J9288k6633k7212R5882M7887q4713p1120m07k1896o5368P1435
13895d641q14J1338K1442j4964k5081j3761j5275j2587J4555P046j0004K1897
13883b0849L7130J610m2029n8943j7435M926K2590k6438M4050P0093K1160n8744
$$ plain form
13871 -22879 -83979 -75886 -53034 -46820 -35610 -19063 -30756 -31355 18398 96500 95341 86844 99760
13858 99760 70610 55773 1289 -71092 -50315 -26176 -71095 -67425 -32807 12265 41882 67062
13846 67062 36949 27510 -17915 -86056 -72486 38997 66251 51128 2082 -6675 34393 57334
13834 57334 43182 -20243 -25161 -17130 20945 105794 103854 54656 13397 -22072 -55349 25
13822 25 72127 52744 88888 89585 32212 -8008 -13968 -61199 -12807 70909 160206 165721 143368
13809 143368 166549 91475 42714 16275 -69437 -70259 -56309 -19707 16272 -6588 -16980 42844
13797 42844 16091 -15141 -2036 -2942 -21002 -47598 -40392 -73049 -16349 76270 88900 85473
13785 85473 59826 17559 -37412 -61703 -21948 53407 54060 76911 78380 86995 62028 39611
$$ packed form
13871b2879o1100Q093K2852O214J1210J6547j1693n99M9753P8102j159q497J2916
13858I9760k9150j4837n4484p2381K0777K4139m4919L670L4618M5072K9617K5180
13846F7062l0113r439m5425o8141J3570J11483K7254j5123m9046q757M1068K2941
13834E7334j4152o3425m918Q031L8075Q4849j940m9198m1259l5469l3277N5374
13822B5P2102j9383L6144O97n7373m0220n960m7231M8392Q3716Q9297N515k2353
13809A43368K3181p5074m8761k6439q5712q22J3950L6602L5979k2860j0392N9824
13797D2844k6753l1232J3105r06j8060k6596P206l2657N6700R2619J2630l427
13785H5473k5647m2267n4971k4291L9755P5355O53K2851J469Q615k4967k2417
$$ plain form
13773 39611 -42717 -84727 -90111 -38113 37997 27971 32125 18587 -5306 -43982 -1785 36285
13761 36285 17503 -3305 21394 38067 98905 56093 1349 -72033 -140988 -105985 -75120 -76511
13749 -76511 -91830 -55197 -23038 -70692 -32326 32912 -21769 -12947 -3216 -41419 -36674 -42868
13737 -42868 -57070 -50215 -70227 -78649 -47987 5137 -25299 -13522 -45127 -23744 -59209 -35069
13725 -35069 -8628 -44310 -7817 13848 92975 128940 102981 105401 66223 31940 -23387 -58484
13713 -58484 35793 81002 50040 -34947 -95728 -107180 -137253 -150457 -75885 -30650 -26280 -13212
13701 -13212 -29443 -62673 -49386 -24296 -12287 -53267 -68304 -70310 -11078 26237 70965 102961
13689 102961 64738 26453 41157 92955 85293 52549 13645 -35202 -61279 -66005 -95751 -43771
$$ packed form
13773C9611q2328m2010n384N1998P6110j0026M154j3538k3893l8676M2197L8070
13761C6285j8782k0808K4699J6673O0838m2812n4744p3382o8955L5003L0865j391
13749g6511j5319L6633L2159m7654L8366O5238n4681Q822R731l8203M745o194
13737d2868j4202O855k0012q422L0662N3124l0436J1777l1605K1383l5465K4140
13725c5069K6441l5682L6493K1665P9127L5965k5959K420l9178l4283n5327l5097
13713e8484R4277M5209l0962q4987o0781j1452l0073j3204P4572M5235M370J3068
13701a3212j6231l3230J3287K5090J2009m0980j5037k006N9232L7315M4728L1996
13689A02961l8223l8285J4704N1798p662l2744l8904m8847k6077m726k9746N1980
$$ plain form
13677 -43771 1528 -16186 -15675 32050 14906 -18468 -3209 -16931 -75956 -66401 -31580 -1391
13665 -1391 14424 3797 13460 20699 21241 8544 -6538 5552 34230 -14672 -42744 6508 -20078
13652 -20078 -24556 -10748 -17697 -15749 28148 25875 57569 77747 79482 64515 86965 47763 52681
13639 52681 36253 -31311 -20510 26330 32784 11275 20284 31170 -3255 -44426 10244 85369
13627 85369 49508 12942 -42159 -46848 -25783 -7060 19107 34353 51246 50189 43205 22111
13615 22111 -46461 -10914 59863 96095 95309 65337 70302 65580 28599 -28589 -50905 -15879
13603 -15879 -9671 34237 52381 69279 9008 -35186 -22885 -25456 6689 3946 -10682 -32033
13591 -32033 -18851 -23267 -8720 70288 76572 23894 8564 54752 93765 97768 -2183 43577
$$ packed form
13677d3771M5299j7714N11M7725j7144l3374J5259j3722n9025R555L4821L0189
13665a391J5815j0627R663P239N42j2697j5082J2090K8678m8902k8072M9252k6586
13652b0078m478J3808o949J948M3897k273L1694K0178J735j4967K2450l9202M918
13639E2681j6428o7564J0801M6840O454k1509R009J0886l4425m1171N4670P5125
13627H5369l5861l6566n5101m689K1065J8723K6167J5246J6893j057o984k1094
13615B2111o8572L5547P0777L6232p86k9972M965m722l6981n7188k2316L5026
13603a5879O208M3908J8144J6898o0271m4194J2301k571L2145k743j4628k1351
13591c2033J3182m416J4547P9008O284n2678j5330M6188L9013M003r9951M5760
$$ plain form
13579 43577 82196 82823 122846 135975 69502 19953 -23488 1394 7077 -2603 5151 67871 64673
13566 64673 98953 49961 445 20416 53495 55505 37822 46348 43367 3880 -10151 -35382
13554 -35382 9756 -61855 -124433 -65799 -39608 -8473 41669 83365 87459 44261 93477 91892
13542 91892 27265 52075 5683 -100755 -113062 -38333 25392 24738 -4433 20840 2144 -35534
13530 -35534 25 54153 62641 101302 99178 77990 73759 24497 43052 46055 39389 -8015 -14816
13517 -14816 19685 95931 54886 22902 -17686 -67325 -102858 -80973 -38358 -56957 -49717 8462
13505 8462 27496 29713 42727 78322 56554 21914 52837 143800 245535 300499 339834 372551
13493 372551 416832 430018 430764 405343 477888 455455 315311 208366 225668 159759 110381
$$ packed form
13579D3577L8619O27M0023J3129o6473m9549m3441K4882N683r680P754O2720l198
13566F4673L4280m8992m9516J9971L3079K010j7683Q526k981l9487j4031k5231
13554c5382M5138p1611o2578N8634K6191L1135N0142M1696M094m3198M9216j585
13542I1892o4627K4810m6392j06438j2307P4729O3725o54k9171K5273j8696l7678
13530c5534L5559N4128Q488L8661k124k1188m231m9262J8555L003o666m7404o801
13517a4816L4501P6246m1045l1984m0588m9639l5533K1885M2615j8599P240N8179
13505H462J9034K217J3014L5595k1768l4640L0923R0963J01735N4964L9335L2717
13493C72551M4281J3186P46k5421P2545k2433j40144j06945J7302o5909m9378
$$ plain form
13482 110381 64635 76512 90213 93396 103986 34370 -38514 -13518 23350 -29081 -55722 18762
13470 18762 12177 -14852 -57528 -28687 2562 52979 80828 80462 31365 -21472 -40718 -1155
13458 -1155 49003 84004 40209 -10985 -90169 8912 56727 34968 -26475 -34136 -1311 6345
13446 6345 29251 30069 12140 9581 97093 185991 223750 201046 161245 79172 39408 76766
13434 76766 78398 41053 43108 49769 35463 -22336 -39850 -29047 -8131 20978 32958 61010
13422 61010 -3269 -69973 -24148 -43727 -10682 62219 89554 42026 -13487 -49095 -49753 -101134
13410 -101134 -131516 -92696 -75489 -42361 -65668 -59097 -7396 27315 37998 15101 -18819 -20372
13398 -20372 -10788 -7548 -8089 -29023 -35907 -24904 -11818 -11382 1266 19462 5341 49396 3627
$$ packed form
13482A10381m5746J1877J3701L183J0590o9616p2884K4996L6868n2431k6641P4484
13470A8762o585k7029m2676K8841L1249N0417K7849l66m9097n2837j9246L9563
13458a155N0158L5001m3795n1194p9184R9081M7815k1759o1443p661L2825P656
13446F345K2906Q18j7929k559Q7512Q8898L7759k2704l9801q2073l9764L7358
13434G6766J632l7345K055O661j4306n7799j7514J0803K0916K9109J1980K8052
13422F1010o4279o6704M5825j9579L3045P2901K7335m7528n5513l5608o58n1381
13410a01134l0382L8820J7207L3128k3307O571N1701L4711J0683k2897l3920j553
13398b0372R584L240n41k0934o884J1003J3086M36J2648J8196j4121M4055m5769
$$ plain form
13385 3627 -31727 -89253 -103431 -45878 10789 87461 69908 85646 71465 77845 51832 47261
13373 47261 70545 14002 -15448 49002 79552 68035 59800 87098 91711 63315 50346 18277
13361 18277 -24636 42687 80758 -7818 -33264 -39393 -53669 -32170 -35996 -71970 -13242 33153
13349 33153 95847 77735 73352 120967 128053 44441 1404 7420 50807 70953 10308 6020
13337 6020 27069 18737 60387 53767 22737 35627 55048 53665 -3543 -57287 -45136 -47760 -28859
13324 -28859 16298 -46115 -20727 21341 21693 18168 84444 81518 54327 20348 -62773 -59938 47549
13311 47549 72700 30681 -13359 -33308 -47589 -7559 33256 97554 134271 132955 68489 -765
13299 -765 35217 67836 84020 16215 -468 30306 19470 -25872 5818 49914 48398 34240
$$ packed form
13385C627l5354n7526j4178N7553N6667P6672j7553J5738j4181O380k6013m571
13373D7261K3284n6543k9450O4450L0550j1517q235K7298M613k8396j2969l2069
13361A8277m2913O7323L8071q8576k5446o129j4276K1499l826l5974N8728M6395
13349C3153O2694j8112m383M7615P086q3612m3037O016M3387K0146o0645m288
13337F020K1049q332M1650o620l1030J2890J9421j383n7208n3744J2151k624J8901
13324b8859M5157o2413K5388M2068L52l525O6276k926k7191l3979q3121K835J07487
13311D7549K5151m2019m4040j9949j4281M0030M0815O4298L6717j316o4466o9254
13299g65L5982L2619J6184o7805j6683L0774j0836m5342L1690M4096j516j4158
$$ plain form
13287 34240 47448 47810 9250 498 -29952 -39032 18965 24182 53387 -6406 -12900 4719 25373
13274 25373 13181 33556 43994 54165 4372 -20522 14477 10882 41383 47967 39819 47432
13262 47432 76899 117573 147382 86676 60768 99197 106191 119757 87202 100560 48821 -307
13250 -307 24401 63245 47645 23241 -11172 12012 60707 59787 67941 24973 16825 -11381 14932
13237 14932 -12320 45838 104648 88301 71090 68598 42772 1579 -18328 -10718 -24575 -5805
13225 -5805 2253 45562 52088 14407 -46742 -74623 -54478 -12261 -17509 -17259 -26558 -20828 -6734
13212 -6734 -22545 -50233 -43342 32228 36498 -5052 8656 39931 64243 87628 124208 104601
13200 104601 91760 79961 87390 68624 67857 85788 110207 65178 -9998 -7981 58881 47504
$$ packed form
13287C4240J3208L62l8560q752l0450r080N7997N217K9205n9793o494J7619K0654
13274B5373j2192K0375J0438J0171m9793k4894L4999l595L0501O584q148P613
13262D7432K9467M0674K9809o0706k5908L8429O994J3566l2555J3358n1739m9128
13250c07K4708L8844j5600k4404l4413K3184M8695r20Q154m2968q148k8206K6313
13237A4932k7252N8158N8810j6347j7211k492k5826m1193j9907P610j3857J8770
13225e805Q058M3309O526l7681o1149k7881K0145M2217n248K50r299N730J4094
13212f734j5811k7688O891P5570M270m1550J3708L1275K4312K3385L6580j9607
13200A04601j2841j1799P429j8766p67J7931K4419m5029p5176K017O6862j1377
$$ plain form
13188 47504 33818 52753 30923 17569 57551 95401 152258 119941 55325 50791 40223 79758
13176 79758 74214 46419 -21577 -46918 -11373 -33843 -28750 -11624 -25317 -22323 -66537 -44993
13164 -44993 -53556 -57748 -88503 -15049 -843 -9085 -20311 -15060 -25928 -61758 -46700 -10725
13152 -10725 -57011 -60089 -23445 -9720 15167 14566 12900 -11307 -561 -6955 -2692 -5708 59085
13139 59085 51920 9509 -7795 -17469 41182 56020 68190 82104 76703 -10597 -26062 -7410
13127 -7410 -1296 75689 131665 80553 -2532 -13644 20752 85833 13862 23512 -891 -7629
13115 -7629 -29835 11086 30838 42951 41936 35423 25612 6880 48703 99080 102775 49507 20322
13102 20322 -1706 1575 -16503 -72714 -91943 -118795 -133435 -66743 -23635 -40564 -50038 -57838
$$ packed form
13188D7504j3686J8935k1830j3354L9982L7850N6857l2317o4616m534j0568L9535
13176G9758n544k7795o7996k5341L5545k2470N093J7126j3693K994m4214K1544
13164d4993q563m192l0755P3454J4206q242j1226N251j0868l5830J5058L5975
13152a0725m6286l078L6644J3725K4887o01j666k4207J0746o394M263l016O4793
13139E9085p165m2411j7304r674N8651J4838J2170J3914n401q7300j5465J8652
13127g410O114P6985N5976n1112q3085j1112L4396O5081p1971R650k4403o738
13115g629k2206M0921J9752J2113j015o513r811j8732M1823N0377L695n3268k9185
13102B0322k2028L281j8078n6211j9229k6852j4640O6692M3108j6929r474p800
$$ plain form
13090 -57838 20715 57138 60537 68035 34546 20169 -31181 -25923 16080 2069 -48420 -86818
13078 -86818 -55693 -8569 -43094 -35582 21073 47014 54486 55070 -29110 -75401 -67236 -107034 -70634
13065 -70634 -78685 -24563 -19425 -38679 -10217 63493 111036 149610 110419 88265 83095 70787
13053 70787 108303 156243 119126 53379 15781 14517 95496 99086 26009 -13551 -43419 -83502
13041 -83502 -63890 -45663 -16571 27198 76637 70873 66120 166678 169605 131706 131437 144308
13029 144308 163842 121845 20671 -51888 -52759 27613 -5927 -12372 -5212 15407 42396 18096
13017 18096 54221 113290 72575 1180 7140 7336 87305 92065 73318 59970 74768 4041
13005 4041 -7469 9580 24091 31097 30810 53084 121605 255349 356988 525242 817247 1038875
$$ packed form
13090e7838P8553L6423L399P498l3489j4377n1350N258M2003j4011n0489l8398
13078h6818L1125M7124l4525P512N6655K5941P472N84q4180m6291Q165l9798L6400
13065g0634q051N4122N138j9254K8462P3710M7543L8574l9191k2154n170j2308
13053G0787L7516M7940l7117o5747l7598j264Q0979L590p3077l9560k9868m0083
13041h3502J9612J8227K9092M3769M9439n764m753J00558K927l7899k69J2871
13029A44308J9534m1997j01174p2559q71Q0372l3540o445P160K0619K6989k4300
13017A8096L6125N9069m0715p1395N960J96P9969M760j8747j3348J4798p0727
13005D041j1510J7049J4511P006k87K2274O8521J33744J01639J68254K92005K21628
$$ plain form
12993 1038875 1366210 1698850 1977713 2113941 2114787 2040243 1841986 1549078 1254529 975065
12983 975065 783044 610302 513521 458814 378474 254368 163460 167790 155814 104172 81045
12972 81045 84658 88235 74376 65294 65984 16573 -19418 -25367 -6733 23217 43126 44689 -17248
12959 -17248 -15477 22476 39587 28301 25417 56565 105810 107581 71614 58543 58863 57450 4370
12946 4370 -16734 39741 21276 -23798 -77582 -74081 59060 92806 108657 109335 -2651 -39536
12934 -39536 -50450 -6044 51036 56531 61698 99250 77311 66442 21795 -19459 7044 42707
12922 42707 11127 17473 9918 41380 80800 111498 96573 108702 110379 143027 147829 80080
12910 80080 43722 106147 118537 107785 92959 46914 7904 11771 45217 72977 53669 64483
$$ packed form
12993A038875L27335L32640K78863J36228Q46p4544j98257k92908k94549k79464
12983I75065j92021j72742r6781n4707q0340j24106r0908M330j1976n1642k3127
12972H1045L613L577j3859r082O90m9411l5991n949J8634K9950J9909J563o1937
12959a7248J771L7953J7111j1286k884L1148M9245J771l5967j3071L20j413n3080
12946D370k1104N6475j8465m5074n3784L501J33141L3746J5851O78j11986l6885
12934c9536j0914M4406N7080N495N167L7552k1939j0869m4647m1254K6503L5663
12922D2707l1580O346p555L1462L9420L0698j4925J2129J677L2648M802o7749
12910H0080l6358O2425J2390j0752j4826m6045l9010L867L3446K7760j9308J0814
$$ plain form
12898 64483 70863 58170 73346 41812 -25734 -75577 -101070 -33485 34660 74040 48783 63249
12886 63249 17431 16648 -15993 52426 95849 -7508 -28813 -7671 33785 78210 107999 90813
12874 90813 119854 86477 29171 14557 60778 104904 67730 50837 71813 38564 25148 9632
12862 9632 41225 79418 118300 81961 79402 113298 57938 -9685 50197 52119 38097 40193
12850 40193 -24531 -62428 -27838 24303 36951 22321 -8129 -1168 15261 66556 67519 6361
12838 6361 24289 -12195 -68749 -39291 -30722 12966 22962 3454 63631 84500 98750 162486
12826 162486 195014 203349 180784 105997 26705 25318 68325 95945 113994 81796 58217 75097
12814 75097 72265 79061 46266 45329 15244 -3413 -8523 23308 30151 -41279 -36722 63102 132446
$$ packed form
12898F4483O380j2693J5176l1534o7546m9843k5493O7585O8145L9380k5257J4466
12886F3249m5818p83l2641O8419M3423j03357k1305K1142M1456M4425K9789j7186
12874I0813K9041l3377n7306j4614M6221M4126l7174j6893K0976l3249j3416j5516
12862I632L1593L8193L8882l6339k559L3896n5360o7623N9882J922j4022K096
12850D0193o4724l7897L4590N2141J2648j4630l0450O961J6429N1295R63o1158
12838F361J7928l6484n6554K9458Q569M3688R996j9508O0177K0869J4250O3736
12826A62486L2528Q335k2565p4787p9292j387M3007K7620J8049l2198k3579J6880
12814G5097k832O796l2795r37l0085j8657n110L1831O843p1430M557R9824O9344
$$ plain form
12801 132446 174280 202265 219708 256849 285437 353164 340233 366985 380506 352925 283986
12790 283986 216907 207239 164872 156675 143667 165996 127883 129803 137290 183380 145880 97252
12778 97252 84046 97648 88678 100137 51826 3876 -4393 15360 41469 82165 86279 13697
12766 13697 -4637 1388 7794 28379 27408 48230 62093 114800 140346 132123 119043 43656 57031
12753 57031 118948 165413 122973 98165 99656 146310 130048 65534 46040 40471 66428 31587
12741 31587 22753 40790 52836 89193 79713 61259 -11690 -1389 39386 78813 49902 48194
12729 48194 84422 169654 243988 264035 186471 135634 164716 208992 213134 199338 218849 181617
12717 181617 108856 136164 133779 172525 223532 186332 155260 148785 116651 159475 191716 170120
$$ packed form
12801A32446M1834K7985J7443L7141K8588O7727j2931K6752J3521k7581o8939
12790B83986o7079r668m2367q197j3008K2329l8113J920P487M6090l7500m8628
12778I7252j3206J3602q970J1459m8311m7950q269J9753K6109M0696M114p2582
12766A3697j8334O025O406K0585r71K0822J3863N2707K5546q223j3080p5387J3375
12753E7031O1917M6465m2440k4808J491M6654j6262o4514j9494n569K5957l4841
12741C1587q834J8037J2046L6357r480j8454p2949J0301M0775L9427k8911j708
12729D8194L6228Q5232P4334K0047p7564n0837K9082M4276M142j3796J9511l7232
12717A81617p2761K7308k385L8746N1007l7200l1072o475l2134M2824L2241k1596
$$ plain form
12705 170120 216297 265206 211197 110059 94255 88639 30727 69903 150744 200305 164813
12694 164813 126430 137331 193862 181848 143819 75337 62330 98610 152062 168584 148121
12683 148121 203704 138375 151421 150794 182560 226707 201077 202594 272314 317914 266628 190702
12671 190702 197271 221974 254776 223812 210399 250419 315746 299627 332394 418710 430082 415441
12659 415441 400693 338555 290783 338599 420661 406267 375485 406827 431060 427266 436664 431980
12647 431980 404439 382869 402199 375192 365442 369185 402903 429836 418512 362679 343494 412274
12635 412274 498753 562432 561721 515850 462718 406602 379164 400855 412199 406499 417474 424159
12623 424159 429609 412518 425620 458666 473899 542601 607565 666231 732224 668542 666421 707511
$$ packed form
12705A70120M6177M8909n4009j01138j5804n616n7912L9176Q0841M9561l5492
12694A64813l8383J0901N6531j2014l8029o8482j3007L6280N3452J6522k0463
12683A48121N5583o5329J3046o27L1766M4147k5630J517O9720M5600n1286p5926
12671A90702O569K4703L2802l0964j3413M0020O5327j6119L2767Q6316J1372j4641
12659D15441j4748o2138m7772M7816Q2062j4394l0782L1342K4233l794R398m684
12647D31980k7541k1570J9330k7007r750L743L3718K6933j1324n5833j9185O8780
12635D12274Q6479O3679p11m5871n3132n6116k7438K1691J1344n700J0975O685
12623D24159N450j7091J3102L3046J5233O8702O4964N8666O5993o3682k121M1090
$$ plain form
12611 707511 785801 743669 748050 758364 687761 577088 534588 506535 490602 498311 477414 454396
12599 454396 562448 622630 664226 685269 745186 870402 898789 922496 1007002 1079181 1117785
12588 1117785 1234308 1332848 1332818 1379073 1503109 1529747 1539671 1601200 1750900 1857768 2032017
12577 2032017 2186074 2274710 2385195 2477102 2494901 2533015 2578885 2575456 2618585 2825929 3132604
12566 3132604 3431310 3771148 4175018 4624805 5074218 5650287 6329861 7160049 8232955
12557 8232955 9435144 10884578 12831423 15419922 18835915 23514922 30037594 39502375
12549 39502375 53752724 75626778 108896790 155031934 211524989 277058138 341066314
12542 341066314 384309089 407069586 407958203 375361711 322698345 266835157 208537824
$$ packed form
12611G07511P8290m2132M381J0314p0603j10673m2500k8053j5933P709k0897k3018
12599D54396J08052O0182M1596K1043N9917J25216K8387K3707Q4506P2179L8604
12588A117785J16523R8540l0M6255J24036K6638R924O1529J49700J06868J74249
12577B032017J54057Q8636J10485R1907J7799L8114M5870l429M3129K07344L06675
12566C132604K98706L39838M03870M49787M49413N76069O79574Q30188J072906
12557H232955J202189J449434J946845K588499L415993M679007O522672R464781
12549C9502375J4250349K1874054L3270012M6135144N6493055O5533149O4008176
12542C41066314M3242775K2760497Q88617l2596492n2663366n5863188n8297333
$$ plain form
12535 208537824 155361587 114763156 85097293 63985682 49516486 39584402 32466247
12528 32466247 26992121 22756744 19349049 16588369 14310882 12467850 10928166 9644267
12520 9644267 8541672 7591731 6769672 6117191 5589844 5127895 4725490 4350144 4011363
12511 4011363 3757619 3519330 3270489 3054488 2854072 2658116 2447592 2298929 2139548
12502 2139548 2042376 1923898 1762753 1595758 1483018 1424300 1329618 1292616 1223250 1161183
12492 1161183 1076360 1098197 1046672 984100 966580 974794 1025060 1076388 1101332 1144177 1179747
12481 1179747 1180049 1166179 1204960 1278187 1304285 1286328 1217604 1074238 953951 912137 866330
12470 866330 776091 674245 557970 519525 494676 427218 397202 369705 339915 372554 350424
$$ packed form
12535B08537824n3176237m0598431k9665863k1111611j4469196r932084p118155
12528C2466247n474126m235377l407695k760680k277487j843032j539684j283899
12520I644267j102595r49941q22059o52481n27347m61949m02405l75346l38781
12511D011363k53744k38289k48841k16001k00416j95956k10524j48663j59381
12502B139548r7172j18478j61145j66995j12740n8718r4682l7002o9366o2067
12492A161183q4823K1837n1525o2572j7520Q214N0266N1328K4944M2845L5570
12481A179747L02j3870L8781P3227K6098j7957o8724j43366j20287m1814m5807
12470H66330r0239j01846j16275l8445k4849o7458l0016k7497k9790L2639k2130
$$ plain form
12459 350424 328760 290359 241065 259663 250054 223265 191033 202709 249556 266431 215042 229466
12447 229466 191432 150715 217348 199892 137730 107218 144338 170052 166883 85665 44129 27003
12435 27003 84226 77757 61848 111494 158945 166260 140411 104563 84676 120024 156248 255409
12423 255409 229261 186194 197625 199105 95054 96435 111884 163884 135887 114942 160905 193929
12411 193929 185815 155693 141734 177241 192973 197910 193282 125276 118209 124621 200187 227493
12399 227493 211113 183463 133764 118128 100544 116431 120881 140001 127539 52064 9226 13688
12387 13688 61505 127186 143803 180229 170013 155179 148713 134895 102317 79449 57593 60714
12375 60714 56123 55008 11683 -38341 -28931 -55649 -13934 5777 34335 48298 114057 100309
$$ packed form
12459C50424k1664l8401m9294J8598r609k6789l2232J1676M6847J6875n1389J4424
12447B29466l8034m0717O6633j7456o2162l0512L7120K5714l169q1218m1536j7126
12435B7003N7223o469j5909M9646M7451P315k5849l5848j9887L5348L6224R9161
12423B55409k6148m3067J1431J480j04051J381J5449N2000k7997k0945M5963L3024
12411A93929q114l0122j3959L5507J5732M937m628o8006p067O412P5566K7306
12399B27493j6380k7650m9699j5636j7584J5887M450J9120j2462p5475m2838M462
12387A3688M7817O5681J6617L6426j0216j4834o466j3818l2578k2868k1856L121
12375F0714m591j115m3325n0024R410k6718M1715J9711K8558J3963O5759j3748
$$ plain form
12363 100309 58471 35731 40984 39264 95953 115315 144121 152378 149389 138937 100071 67434
12351 67434 78259 67437 61037 100348 119159 131724 107836 124881 120879 109199 111884 147284
12339 147284 163386 155968 171117 115403 38412 24355 39025 68558 89457 80639 73653 13482
12327 13482 -1653 -4669 26979 75060 94244 75226 15604 -21615 -33480 -15700 -13273 -16696
12315 -16696 -2780 -4925 -10078 3242 30517 33941 1205 -9617 -19534 63032 82437 46784
12303 46784 -4026 -50906 -7212 11486 51160 93842 86309 77101 35316 72265 48871 26200
12291 26200 61382 37438 35094 91357 84906 55058 63665 20667 53763 92901 75492 40604
12279 40604 30622 -17843 -37231 -15804 15085 24510 -39753 -150976 -179804 -113888 -34619 -21547
$$ packed form
12363A00309m1838k2740N253j720N6689J9362K8806Q257k989j0452l8866l2637
12351F7434J0825j0822o400L9311J8811J2565k3888J7045m002j1680K685L5400
12339A47284J6102p418J5149n5714p6991j4057J4670K9533K0899q818o986o0171
12327A3482j5135l016L1648M8081J9184j9018n9622l7219j1865J7780K427l423
12315a6696J3916k145n153J3320K7275L424l2736j0822r917Q2566J9405l5653
12303D6784n0810m6880M3694J8698L9674M2682p533r208m1785L6949k3394k2671
12291B6200L5182k3944k344N6263o451k9848Q607m2998L3096L9138j7409l4888
12279D0604r982m8465j9388K1427L0889R425o4263j11223k8828O5916P9269J3072
$$ plain form
12267 -21547 -7311 -11701 -31602 -296 33995 -16687 -24496 -4387 6142 -14530 -11773 31053
12255 31053 39703 37965 -621 8124 59639 36309 -16595 -91150 -176644 -127654 -69704 -2404
12243 -2404 18700 47638 113840 56701 -53674 -32551 -10732 1551 19280 -1236 -4635 -20278
12231 -20278 -12458 -34570 -42312 -73641 -90481 -95334 -171225 -177253 -71708 18288 -31313 -64244
12219 -64244 -22175 48443 14349 29044 31716 -15610 -104738 -35927 -47885 -33925 25911 16300
12207 16300 -24025 -39078 -19886 -7694 -22180 -40905 -26539 716 34316 11527 22934 44528
12195 44528 -4231 -2571 10028 8774 -55461 -54280 -62363 -66245 -56262 -24804 -31119 -44009 17932
12182 17932 25681 -7104 2634 -10501 -167 32729 65789 32260 7707 -51073 -56395 -94439
$$ packed form
12267b1547J4236m390j9901L1306L4291n0682p809K0109J0529k0672K757M2826
12255C1053Q650j738l8586Q745N1515k3330n2904p4555q5494M8990N7950O7300
12243b404K1104K8938O6202n7139j10375K1123K1819J2283J7729k0516l399j5643
12231b0278P820k2112p742l1329j6840m853p5891o028J05545Q9996m9601l2931
12219f4244M2069P0618l4094J4695K672m7326q9128O8811j1958J3960N9836r611
12207A6300m0325j5053J9192J2192j4486j8725J4366K7255L3600k2789J1407K1594
12195D4528m8759J660J2599j254o4235J181q083l882R983L1458o315j2890O1941
12182A7932P749l2785R738j3135J0334L2896L3060l3529k4553n8780n322l8044
$$ plain form
12170 -94439 -71964 -42716 -4939 9900 4833 15924 18833 -8017 23545 13427 -40643 -45152
12158 -45152 -26442 29625 117119 142216 104496 55757 53317 2252 28732 80244 70239 -1500
12146 -1500 1580 3545 27523 72270 87742 15993 1747 -47046 -78219 -23137 6567 80402
12134 80402 28432 -27948 -56371 -90397 -85167 -28932 -22801 -37996 485 25439 52149 82233
12122 82233 115142 206011 216035 155412 67698 64001 18374 -11537 24277 61548 104496 46612
12110 46612 20697 26576 7340 -6219 20397 44521 56872 102162 102365 64273 56473 113042
12098 113042 93778 102681 159256 155993 163725 236223 390974 625610 802849 1041730 1347097
12087 1347097 1673734 1918409 2066888 2064771 1890821 1696235 1445219 1110617 853322 691477
$$ packed form
12170i4439K2475K9248L7777J4839n067J1091K909k6850L1562j0118n4070m509
12158d5152J8710N6067Q7494K5097l7720m8739k440n1065K6480N1512j0005p1739
12146a500L080J965K3978M4747J5472p1749j4246m8793l1173N5082K9704P3835
12134H0402n1970n6380k8423l4026N230N6235O131j5195L8481K4954K6710L0084
12122H2233L2909R0869J0024o0623q7714l697m5627k9911L5814L7271M2948n7884
12110D6612k5915N879j9236j3559K6616K4124J2351M5290K03l8092p800N6569
12098A13042j9264Q903N6575l263P732P2498J54751K34636J77239K38881L05367
12087A347097L26637K44675J48479k117j73950j94586k51016l34602k57295j61845
$$ plain form
12077 691477 470862 333083 233181 149273 112459 104202 99770 81766 105390 12910 15577 51350
12065 51350 102106 127340 74109 68875 56562 57926 70308 96221 74957 32792 10119 -35079
12053 -35079 -17254 -36234 28184 36383 -13512 16299 43612 27021 35176 13573 8754 30291
12041 30291 -34586 -65311 -20134 -29650 -65081 -69231 -67119 -49310 -48157 -48227 -60148 -78115 -102323
12028 -102323 -78864 -28299 -18245 4550 15345 -39059 -78686 -66373 -85758 -63931 -44950
12017 -44950 -50384 -64813 -49075 -53527 -83614 -42504 36082 63624 27002 -12490 -35340 -59704
12005 -59704 -46254 8001 91508 84759 18000 55076 99908 66154 -6112 -17561 -45303 -96681
11993 -96681 -171343 -152494 -57984 -78207 -97359 -142667 -132969 -163720 -138670 -105843 -98915 -155900
$$ packed form
12077F91477k20615j37779r9902q3908l6814q257m432j8004K3624r2480K667L5773
12065E1350N0756K5234n3231n234j2313J364J2382K5913k1264m2165k2673m5198
12053c5079J7825j8980O4418Q199m9895K9811K7313j6591Q155k1603m819K1537
12041C0291o4877l0725M5177r516l5431m150K112J7809J153p0j1921j7967k4208
12028a02323K3459N0565J0054K2795J0795n4404l9627J2313j9385K1827J8981
12017d4950n434j4429J5738m452l0087M1110P8586K7542l6622l9492k2850k4364
12005e9704J3450N4255Q3507o749o6759L7076M4832l3754p2266j1449k7742n1378
11993i6681p4662J8849R4510k0223j9152m5308R698l0751K5050L2827O928n6985
$$ plain form
11981 -155900 -151805 -130973 -100212 -55664 -76543 -57420 -42042 -70372 -111555 -123204 -125685 -176892
11969 -176892 -193386 -101188 -71071 -90392 -79324 -29971 -5213 -12380 61861 57271 -3576 -2903
11957 -2903 -43744 -20009 -19282 -32296 -97554 -157517 -95506 -55230 -16880 10679 -21785 -59316
11945 -59316 -22500 -38319 2274 51451 60947 103281 99220 58015 31992 7334 25094 41032
11933 41032 87266 79799 70110 56213 58285 70058 37708 -3614 -59498 3213 -13245 -28760
11921 -28760 4221 25588 76 -16367 -62363 -41905 -46004 -12102 29853 96979 77085 2610
11909 2610 -40891 -58102 -29086 -35030 43267 46372 -29321 16071 67369 62590 28619 3772
11897 3772 4790 -6198 12101 14887 -30417 -84783 -110372 -116107 -196658 -165553 -107040 -115629 -56282
$$ packed form
11981a55900M095K0832L0761M4548k0879J9123J5378k8330m1183j1649k481n1207
11969a76892j6494R2198L0117j9321J1068M9353K4758p167P4241m590o0847O73
11957b903m0841K3735P27j3014o5258n9963O2011M0276L8350K7559l2464l7531
11945e9316L6816j5819M0593M9177R496M2334m061m1205k6023k4658J7760J5938
11933D1032M6234p467r689j3897K072J1773l2350m1322n5884O2711j6458j5515
11921b8760L2981K1367k5512j6443m5996K0458m099L3902M1955O7126j9894p4475
11909B610m3501j7211K9016n944P8297L105p5693M5392N1298m779l3971k4847
11897C772J018j0988J8299K786m5304n4366k5589n735q0551L1105N8513q589N9347
$$ plain form
11884 -56282 516 11989 -20915 -7300 31756 10578 -42739 -38349 -43711 -37705 1447 16574
11872 16574 -57742 -84904 -154942 -85687 -69576 -70477 -1959 -5736 15346 -16758 -41384 -82300
11860 -82300 -119073 -68112 11566 57169 77053 46943 7822 28073 96327 107322 66051 45013
11848 45013 -24778 -26369 58503 89718 53812 -13709 -50671 -60323 -25046 22529 30415 -3240
11836 -3240 -34675 -25223 -37774 -12008 -32755 -59213 -50900 -4321 47454 57514 61993 76762
11824 76762 56442 31240 18091 -55177 -69032 -73203 -74513 -46559 -87676 -69902 -76217 -58225
11812 -58225 -13731 38287 45295 42312 39472 9121 -39249 -46362 -89947 -130708 -151277 -160316 -90947
11799 -90947 -25117 -12063 20749 69 -3323 38798 19042 -65677 -45095 -15683 17038 1443
$$ packed form
11884e6282N6798J1473l2904J3615L9056k1178n3317M390n362O006L9152J5127
11872A6574p4316k7162p0038O9255J6111r01O8518l777K1082l2104k4626m0916
11860h2300l6773N0961P9678M5603J9884l0110l9121K0251O8254J0995m1271k1038
11848D5013o9791j591Q4872L1215l5906o7521l6962r652L5277M7575P886l3655
11836c240l1435R452j2551K5766k0747k6458Q313M6579N1775J0060M479J4769
11824G6762k0320k5202j3149p3268j3855m171j310K7954m1117J7774o315J7992
11812e8225M4494N2018P008k983k840l0351m8370p113m3585m0761k0569r039O9369
11799i0947O5830J3054L2812k0680l392M2121j9756q4719K0582K9412L2721j5595
$$ plain form
11787 1443 12551 -23873 -19715 -39984 -117219 -131088 -148573 -92838 -62176 -48470 -52956 -8638
11775 -8638 -150 60 -65740 -134796 -106919 -93502 -73712 -69239 -48836 -51830 -19276 26731 -10508
11762 -10508 -17379 1643 47757 66070 141887 175618 104400 24847 7827 2542 -42225 -101519
11750 -101519 -159609 -151226 -67807 -27860 -35748 -50705 -99545 -109971 -64371 -45836 27804 50377
11738 50377 76121 31667 -31560 -80270 -80703 -78838 -78098 -87817 -114462 -31810 -28241 -53456 -112903
11725 -112903 -98043 -86961 -83748 -69329 -21322 48926 62816 63306 70773 19113 -26551 -72387
11713 -72387 -3780 62296 75381 66843 22290 50789 26211 -82590 -101426 -70397 -49971 -67840
11701 -67840 -32891 -28826 -73713 -143776 -127283 -85776 -105624 -91746 -70183 -45857 -43620 -30414
$$ packed form
11787A443J1108l6424M158k0269p7235j3869j7485N5735L0662J3706m486M4318
11775h638Q488K10o5800o9056K7877J3417J9790M473K0403k994L2554M6007l7239
11762a0508o871J9022M6114J8313P5817L3731p1218p9553j7020n285m4767n9294
11750a01519n8090Q383Q3419L9947p888j4957m8840j0426M5600J8535P3640K2573
11738E0377K5744m4454o3227m8710m33J865P40r719k6645Q2652L569k5215n9447
11725a12903J4860J1082L213J4419M8007P0248J3890M90P467n1660m5664m5836
11713g2387O8607O6076J3085q538m4553K8499k4578j08801j8836L1029K0426j7869
11701f7840L4949M065m4887p0063J6493M1507j9848J3878K1563K4326K237J3206
$$ plain form
11689 -30414 31027 65791 78245 20151 13752 50561 31832 8101 4483 -35109 -68815 -81306
11677 -81306 -93663 -102124 -74782 40740 121892 141427 120375 56207 -3057 7947 14947 27934
11665 27934 2239 -29645 -12321 22220 82242 64679 72916 88308 38755 -4586 -7377 -26745
11653 -26745 -13416 -25579 -67581 -106741 -97981 -76379 -71263 -62549 -53584 -72891 -92716 -99062 -66114
11640 -66114 -71007 -91567 -54834 -31012 -23334 -27092 -42523 -54608 -29582 1217 16828 96714
11628 96714 84615 48420 62553 115794 86752 674 -73838 -101453 -50780 7447 26592 62958
11616 62958 82315 75138 135664 177919 240512 241858 193754 152800 135289 87769 85573 76350
11604 76350 76789 101634 107069 85471 74580 51859 21247 21827 51438 62107 55097 34220 14840
$$ packed form
11689c0414O1441L4764J2454n8094o399L6809j8729k3731l618l9592l3706j2491
11677h1306j2357q461K7342J15522Q1152J9535k1052o4168n9264J1004P000J2987
11665B7934k5695l1884J7324L4541O0022j7563Q237J5392m9553m3341k791j9368
11653b6745J3329j2163m2002l9160Q760K1602N116Q714Q965j9307j9825o346L2948
11640f6114m893k0560L6733K3822P678l758j5431j2085K5026L0799J5611P9886
11628I6714j2099l6195J4133N3241k9042q6078p4512k7615N0673N8227J9145L6366
11616F2958J9357p177O0526M2255O2593J346m8104m0954j7511m7520k196r223
11604G6350M39K4845N435k1598j0891k2721l0612N80K9611J0669p010k0877j9380
$$ plain form
11591 14840 -41639 -38611 -68507 -84154 -48165 -8037 -20596 -41940 -36336 -63977 -13248 16627
11579 16627 24502 38371 1109 -4978 -30259 7708 84733 127399 110222 29807 13592 34736
11567 34736 11915 28592 4840 -42943 -20784 -4457 26538 25233 1255 -10752 -34592 -20997
11555 -20997 23184 -10030 -9955 -32959 -18809 630 -12684 15511 3981 -17091 -22982 9476
11543 9476 37376 17506 -11894 -23316 17240 35721 68541 14481 -46892 -25107 -4552 76215
11531 76215 83392 66947 -19541 -46378 -42369 -87955 -65195 -19224 -30301 -21838 -80006 -110693
11519 -110693 -80731 -79239 -43361 -25489 -40944 -52936 -66180 -65139 -86350 -72054 -34963 -11042
11507 -11042 -40106 -70030 -42800 38675 29446 52784 106975 106454 106322 89137 92338 43969 -54147
$$ packed form
11591A4840n6479L028k9896j5647L5989M0128j2559k1344N604k7641N0729K9875
11579A6627P875J3869l7262o087k5281L7967P7025M2666j7177q0415j6215K1144
11567C4736k2821J6677k3752m7783K2159J6327L0995j305k3978j2007k3840J3595
11555b0997M4181l3214P5k3004J4150J9439j3314K8195j1530k1072n891L2458
11543I476K7900j9870k9400j1422M0556J8481L2820n4060o1373K1785K0555Q0767
11531G6215P177j6445q6488k6837M009m5586K2760M5971j1077Q463n8168l0687
11519a10693K9962J492L5878J7872j5455j1992j3244J041k1211J4296L7091K3921
11507a1042k9064k9924K7230Q1475r229K3338N4191n21j32j7185L201m8369r8116
$$ plain form
11494 -54147 -103579 -70002 -64506 -59747 -30210 -18604 -21256 -38168 -52349 -21823 2114 38729
11482 38729 -12541 -2094 -46676 -146978 -196195 -162745 -106664 -66890 -35782 15892 59045
11471 59045 87630 168087 147767 136400 168493 154535 207634 202748 184192 134706 49369 1545
11459 1545 -70014 -97060 -38268 -7909 -31188 -72969 -81815 -79162 -34013 -33566 2231 16914 -22521
11446 -22521 -17864 -6230 -30964 12749 36263 20047 -7682 -42812 -103146 -138162 -114719 -118648
11434 -118648 -69278 -115677 -135044 -96095 -68472 -45143 -4080 25481 -7033 -24928 56550
11423 56550 53438 17740 -4759 -41468 -117341 -134496 -56444 5611 -13563 -34970 -36793 -51705
11411 -51705 -89642 -57250 -22218 4664 -20777 -16734 3306 62128 34153 -25536 -60273 -81080
$$ packed form
11494e4147m9432L3577N496M759K9537J1606k652j6912j4181L0526K3937L6615
11482C8729n1270J0447m4582j00302m9217L3450N6081L9774L1108N1674M3153
11471E9045K8585Q0457k0320j1367L2093j3958N3099m886j8556m9486q5337m7824
11459A545p1559k7046N8792L0359k3279m1781q846K653M5149M47L5797J4683l9435
11446b2521M657J1634k4734M3713K3514j6216k7729l5130o0334l5016K3443l929
11434a18648M9370m6399j9367L8949K7623K3329M1063K9561l2514j7895Q1478
11423E6550l112l5698k2499l6709p5873j7155P8052O2055j9174k1407j823j4912
11411e1705l7937L2392L5032K6882k5441M043K0040N8822k7975n9689l4737k0807
$$ plain form
11399 -81080 -70769 -52599 -28699 913 33947 55989 76546 79945 71291 72575 106987 83811
11387 83811 -6814 -43923 648 -22287 -42793 2580 46493 35960 -13437 -79482 -62483 -10742
11375 -10742 3941 29322 40788 -3807 -3595 -34857 -57133 -16375 40185 19242 -11216 -16517
11363 -16517 -65292 -94544 -62820 -26601 -53639 -68249 -71266 -60132 -77392 -54397 -32987 -33198
11351 -33198 -26993 -65611 -104305 -121894 -77981 -51349 -75935 -44615 -17943 -6643 49693 35346
11339 35346 -15589 401 -35599 -4080 -8620 -5473 8944 4694 -30325 -26496 -36519 -75070
11327 -75070 -91973 -30329 147 25503 8421 44566 74560 110709 95820 117108 121084 44601
11315 44601 -4874 -1465 11237 12834 607 -5471 9603 6027 -39007 -65730 -29543 -25594 -64789
$$ packed form
11399h1080J0311J8170K3900K9612L3034K2042K0557L399q654J284L4412k3176
11387H3811r0625l7109M4571k2935k0506M5373M3913j0533m9397o6045J6999N1741
11375a0742J4683K5381J1466m4595K12l1262k2276M0758N6560k0943l0458n301
11363a6517m8775k9252L1724L6219k7038j4610l017J1134j7260K2995K1410k11
11351c3198O205l8618l8694j7589M3913K6632k4586L1320K6672J1300N6336j4347
11339C5346n0935J5990l6000L1519m540L147J4417m250l5019L829j0023l8551
11327g5070j6903O1644L0476K5356j7082L6145K9994L6149j4889K1288L976p6483
11315D4601m9475L409J2702J597j2227o078J5074l576m5034k6723L6187L949l9195
$$ plain form
11302 -64789 -132712 -199667 -211149 -153404 -32422 53366 46158 48154 43881 67232 68902 35303
11290 35303 19032 47014 164517 175856 117075 60143 55321 40580 -23603 25337 78656 75968
11278 75968 67762 57176 105794 73904 16042 20788 -1117 -11878 46087 112208 124544 82154
11266 82154 74712 79832 78956 90230 89600 36968 32218 67288 30821 -41473 42026 14552 -25326
11253 -25326 49416 81162 85742 29849 22331 65652 87725 90101 90433 89614 33073 32963 63750
11240 63750 30978 -80409 -61295 -9894 806 11239 -34451 -51948 -71706 -47440 13820
11229 13820 13722 524 24641 14183 60523 33457 17375 57585 21980 24572 19139 -23478 15069
11216 15069 14969 42601 39111 41052 61527 89628 256 -6290 3076 17317 26685 51414 17013
$$ packed form
11302f4789o7923o6955j1482N7745J20982Q5788p208J996m273K3351J670l3599
11290C5303j6271K7982J17503J1339n8781n6932m822j4741o4183M8940N3319k688
11278G5968q206j0586M8618l1890n7862M746k1905j0761N7965O6121J2336m2390
11266H2154p442N120q76J1274o30n2632m750L5070l6467p2294Q3499k7474l9878
11253b5326P4742L1746M580n5893p518M3321K2073K376L32q19n6541j10L0787
11240F3750l2772j11387J9114N1401J0700J0433m5690j7497j9758K4266O1260
11229A3820r8j3198K4117j0458M6340k7066j6082M0210l5605K592n433m2617L8547
11216A5069j00K7632l490J941K0475K8101q9372o546R366J4241R368K4729l4401
$$ plain form
11203 17013 -17152 -39913 -49274 -56087 -34469 25946 43103 -8970 -44185 -46785 -12401 -25327
11191 -25327 -48878 -75330 -28533 1280 -4553 25821 -3251 -34246 -20045 9552 53471 50782
11179 50782 49420 57971 45788 17099 24139 47185 34448 43730 56592 19893 15717 17266 15740
11166 15740 -1040 -34581 -37177 -7085 -1685 8715 -31446 -73372 -177896 -196812 -109428 -12581
11154 -12581 11790 12391 6696 -13214 -67712 -111805 -90063 -52326 -100075 -86134 -68070 -21377
11142 -21377 50597 26364 482 -9907 9993 -12362 -15191 -26571 -35548 -10121 -31448 -19885
11130 -19885 -3029 -34605 -1575 31118 56267 46719 15891 -31004 -24560 14408 18645 -3066
11118 -3066 -12806 61600 127486 132554 155614 204092 198446 161565 187409 162936 108373 61706
$$ packed form
11203A7013l4165k2761r361o813K1618O0415J7157n2073l5215k600L4384j2926
11191b5327k3551k6452M6797K9813n833L0374k9072l0995J4201K9597M3919k689
11179E0782j362Q551j2183k8689P040K3046j2737R282J2862l6699m176J549j526
11166A5740j6780l3541k596L0092N400J0400m0161m1926j04524j8916Q7384R6847
11154a2581K4371O01n695j9910n4498m4093K1742L7737m7749J3941J8064M6693
11142b1377P1974k4233k5882j0389J9900k2355k829j1380q977K5427k1327J1563
11130a9885J6856l1576L3030L2693K5149r548l0828m6895O444L8968M237k1711
11118c066r740P4406O5886N068K3060M8478n646l6881K5844k4473n4563m6667
$$ plain form
11106 61706 93250 131743 129298 90737 86452 29251 948 57578 122177 106922 84005 74303
11094 74303 62695 24261 20149 64055 99533 106902 80993 58027 27078 5510 31437 51763
11082 51763 21613 -25579 3945 66290 71260 37588 50028 47520 50889 6349 -28518 -57528
11070 -57528 -13481 -61778 -67004 -74144 -74054 -15764 33077 90965 52823 40397 32352 8270 -62265
11057 -62265 -107624 -90547 -47864 -74180 -83434 -58295 -54850 -48807 -67079 -42777 -15945 -17301
11045 -17301 -66508 -98716 -134733 -88068 -11447 26004 51344 26903 17804 -4401 -52201 -93789
11033 -93789 -131826 -188183 -139573 -60084 -16979 -28775 11901 73835 112632 48585 43980 7023
11021 7023 -8078 36640 -26644 3373 6955 17422 -17191 -46366 -5635 -10593 -13470 19183
$$ packed form
11106F1706L1544L8493k445l8561m285n7201k8303N6630O4599j5255k2917r702
11094G4303j1608l8434m112M3906L5478P369k5909k2966l0949k1568K5927K0326
11082E1763l0150m7192K9524O2345M970l3672J2440k508L369m4540l4867k9010
11070e7528M4047m8297n226p140R0N8290M8841N7888l8142j2426q045k4082p0535
11057f2265m5359J7077M2683k6316r254K5139L445O043j8272K4302K6832j356
11045a7301m9207l2208l6017M6665P6621L7451K5340k4441r099k2205m7800m1588
11033i3789l8037n6357M8610P9489M3105j1796M0676O1934L8797o4047m605l6957
11021G023j5101M4718o3284L0017L582J0467l4613k9175M0731m958k877L2653
$$ plain form
11009 19183 8691 -59046 -58816 20013 58549 62802 87805 64299 65722 40341 61700 27933
10997 27933 52011 65995 63676 91138 60633 -28550 -121706 -83097 -49124 -4190 -18013 -41122
10985 -41122 -27279 -50614 -71533 -42296 -22494 2028 42245 66525 21853 -16937 -33204 -2730
10973 -2730 -31541 11045 67265 114921 148328 138215 134308 137933 161808 92964 88479 146951
10961 146951 102125 -18956 -57486 -54186 -52993 -24499 43660 55583 3628 -23848 -49748 -99863
10949 -99863 -102423 -106373 -110717 -76375 -59806 -82648 -99895 -34492 -20512 -10826 42019 29624
10937 29624 -31418 2405 50203 86920 42158 -69175 -88414 -99703 -25216 11141 -25232
10926 -25232 -22646 -37061 -20391 1602 23450 60546 31915 -45044 -80590 -43428 -20885 -26337
$$ packed form
11009A9183j0492o7737K30P8829L8536M253K5003k3506J423k5381K1359l3767
10997B7933K4078J3984k319K7462l0505q9183r3156L8609L3973M4934j3823k3109
10985d1122J3843k3335k0919K9237J9802K4522M0217K4280m4672l8790j6267L0474
10973b730k8811M2586N6220M7656L3407j0113l907L625K3875o8844m485N8472
10961A46951m4826j21081l8530L300J193K8494O8159J1923n1955k7476k5900n0115
10949i9863k560l950m344L4342J6569k2842j7247O5403J3980R686N2845j2395
10937B9624o1042L3823M7798L6717m4762j11333j9239j1289P4487L6357l6373
10926b5232K586j4415J6670K1993K1848L7096k8631p6959l5546L7162K2543n452
$$ plain form
10914 -26337 -31603 -49085 -67335 -85914 -92371 -63472 -28326 -50657 -58537 -46524 -42642 -49437 -25564
10901 -25564 -17117 -9963 -38900 -51567 -24375 -26634 -48207 -31669 -5930 8131 12169 -14954
10889 -14954 550 14876 -16270 -53370 -24672 -1382 21493 8972 43541 53362 27355 25487
10877 25487 6811 -13643 -27042 -50904 -84358 -39433 -43324 -68825 -10161 11076 18775 -33774
10865 -33774 -53086 -31805 1467 -1058 -19451 6289 67245 71820 72115 44853 32451 34012 8814
10852 8814 -21598 -52715 8178 56104 -9663 -41303 -59951 -20818 -7040 8081 10193 -16860
10840 -16860 3896 -15801 -26053 -34915 -45834 -108383 -76607 -9159 52896 69318 34509 21606
10828 21606 22264 -13164 38249 70563 95702 20236 -37686 -61134 -54108 -38896 -2239 27006
$$ packed form
10914b6337n266j7482j8250j8579o457K8899L5146k2331p880J2013L882o795K3873
10901b5564Q447P154k8937j2667K7192k259k1573J6538K5739J4061M038k7123
10889a4954J5504J4326l1146l7100K8698K3290K2875j2521L4569R821k6007j868
10877B5487j8676k0454j3399k3862l3454M4925l891k5501N8664K1237P699n2549
10865c3774j9312K1281L3272k525j8393K5740O0956M575K95k7262j2402J561k5198
10852H814l0412l1117O0893M7926o5767l1640j8648L9133J3778J5121K112k7053
10840a6860K0756j9697j0252q862j0919o2549L1776O7448O2055J6422l4809j2903
10828B1606O58l5428N1413L2314K5139p5466n7922k3448P026J5212L6657K9245
$$ plain form
10816 27006 21522 20204 55313 67699 73907 -3069 7652 -56382 -81726 -7969 7831 13015
10804 13015 -35507 -8892 -13930 -21777 -12946 10950 11017 -45150 -54729 -48615 -26290 -6477 9554
10791 9554 -2090 35335 35826 -7556 -60645 -39164 -321 17506 -9160 62915 38101 36988
10779 36988 99786 119922 91796 2015 -62484 -67076 -49157 -75105 -46220 -22110 -6542 -15862
10767 -15862 -46698 -74003 -98737 -106293 -109217 -139989 -95837 -11126 41014 -4759 -14015 -7218
10755 -7218 20996 26033 -17450 -3152 62430 52291 59377 53346 26860 46534 34439 43188 28186
10742 28186 12633 -77420 -49109 -40366 -72115 -55194 -11794 50106 21865 2870 39229 41933
10730 41933 21441 28447 26420 -22286 -40794 16681 11237 -46797 -30468 3776 5169 -77508
$$ packed form
10816B7006n484j318L5109J2386O208p6976J0721o4034k5344P3757J5800N184
10804A3015m8522K6615n038p847Q831K3896O7n6167r579O114K2325J9813J6031
10791I554j1644L7425M91m3382n3089K1481L8843J7827k6666P2075k4814j113
10779C6988O2798K0136k8126q9781o4499m592J7919k5948K8885K4110J5568r320
10767a5862l0836k7305k4734p556k924l0772M4152Q4711N2140m5773r256O797
10755g218K8214N037m3483J4298O5582j0139P086o031k6486J9674j2095Q749j5002
10742B8186j5553r0053K8311Q743l1749J6921M3400O1900k8241j8995L6359K704
10730D1933k0492P006k027m8706j8508N7475n444n8034J6329L4244J393q2677
$$ plain form
10718 -77508 -99204 -34944 8234 -8728 -4314 -7306 -30029 -64218 -109315 -74502 11004 -35943
10706 -35943 -68380 -62599 -49562 -48296 -15821 -31104 -38279 -78921 -89689 -46840 -8145 -47715
10694 -47715 -76468 -118776 -176858 -180683 -103291 -21492 -10401 -17469 24842 64478 89057 105812
10682 105812 68002 78124 44666 -7945 -60562 -52689 -74230 -52382 -54137 -74413 -8810 43962
10670 43962 72142 25268 43858 101235 93242 80613 87786 97114 65501 17362 7839 -12954
10658 -12954 -53785 -39079 29056 16152 7947 -55131 -94600 -21443 3860 14028 -19462 -44977
10646 -44977 -15494 -3760 -6124 58255 79844 56831 100896 128225 150566 73567 32848 19164
10634 19164 4186 35665 18540 27246 66640 113458 124669 101288 61076 21397 48917 38719
$$ packed form
10718g7508k1696O4260M3178j6962M414k992k2723l4189m5097L4813Q5506m6947
10706c5943l2437N781J3037J266L2475j5283p175m0642j0768M2849L8695l9570
10694d7715k8753m2308n8082l825P7392Q1799J1091p068M2311L9636K4579J6755
10682A05812l7810J0122l3458n2611n2617P873k1541K1848j755k0276O5603N2772
10670D3962K8180m6874J8590N7377p993j2629P173R328l1613m8139r523k0793
10658a2954m0831J4706O8135j2904q205o3078l9469P3157K5303J0168l3490k5515
10646d4977K9483J1734k364O4379K1589k3013M4065K7329K2341p6999m0719j3684
10634A9164j4978L1479j7125Q706L9394M6818J1211k3381m0212l9679K7520j0198
$$ plain form
10622 38719 24796 17450 12637 -17429 24618 39606 51058 63586 42040 24444 -11125 -36882
10610 -36882 -26445 3999 13522 53 31497 -1425 17501 13123 -1673 30425 89466 17713
10598 17713 -30920 13264 78577 48250 46368 67207 121149 146073 101764 63455 72247 68898
10586 68898 35786 99 -1529 8036 40283 60743 62443 48407 7411 -38416 -46434 -46695 -45689
10573 -45689 -1890 -33861 -41427 -6302 37584 60159 96132 118052 100092 83429 -6572 -10939
10561 -10939 -13151 -20885 -10983 -46896 -50527 -44364 -22396 33412 36022 -20897 -56471 -53601 28480
10548 28480 36706 -5671 -43250 -108691 -83707 23722 94831 86691 76875 50488 -10412 -12847
10536 -12847 33443 60463 57661 44727 70221 103159 94270 117087 84697 97756 74090 -3182
$$ packed form
10622C8719j3923p346m813l0066M2047J4988J1452J2528k1546j7596l5569k5757
10610c6882J0437L0444R523j3469L1444l2922J8926m378j4796L2098N9041p1753
10598A7713m8633M4184O5313l0327j882K0839N3942K4924m4309l8309Q792l349
10586F8898l3112l5687j628R565L2247K0460J700j4036m0996m5827q018k61J006
10573d5689M3799l1971p566L5125M3886K2575L5973K1920j7960j6663r0001m367
10561a0939k212p734R902l5913l631O163K1968N5808K610n6919l5574K870Q2081
10548B8480Q226m2377l7579o5441K4984J07429P1109q140r816k6387o0900k435
10536a2847M6290K7020k802j2934K5494L2938q889K2817l2390J3059k3666p7272
$$ plain form
10524 -3182 -769 -32215 -14871 -49312 -86735 -74100 -26651 -9852 -33229 -55409 -48908 -12712
10512 -12712 -1556 62251 71145 47298 33300 38403 30292 -13299 -34783 -79629 13925 59795
10500 59795 30480 17183 56523 16196 17320 -14871 -12724 -3138 40171 74752 58143 32666
10488 32666 40733 54355 69018 44493 64275 49333 36055 32605 21902 -23197 -85183 -104909
10476 -104909 -115051 -87544 -34944 49628 117632 155173 96676 56536 -7756 -9389 26363 33518
10464 33518 57245 49474 37144 92381 50101 -12200 15518 43309 46638 29378 59180 67254
10452 67254 48479 100587 137552 112126 66143 66166 56012 51850 57175 27175 28429 18146 8764
10439 8764 32077 35692 30804 82494 99075 99264 83749 21655 12806 -9414 -5056 93339 108637
$$ packed form
10524c182K413l1446J7344l4441l7423J2635M7449J6799k3377k2180O501L6196
10512a2712J1156O3807Q894k3847j3998N103q111m3591k1484m4846R3554M5870
10500E9795k9315j3297L9340m0327J124l2191K147R586M3309L4581j6609k5477
10488C2666Q067J3622J4663k4525J9782j4942j3278l450j0703m5099o1986j9726
10476a04909j0142K7507N2600Q4572O8004L7541n8497m0140o4292j633L5752P155
10464C3518K3727p771j2330N5237m2280o2301K7718K7791L329j7260K9802Q074
10452F7254j8775N2108L6965k5426m5983K3j0154m162N325l0000J254j0283r382
10439H764K3313L615m888N1690J6581J89j5515o2094q849k2220M358R8395J5298
$$ plain form
10426 108637 77313 48903 59432 56583 -1327 630 34840 -8161 -17223 10068 -15542 12205
10414 12205 45959 87721 40836 -4170 -26073 -65250 -47930 -48343 -58734 -18672 -3445 -34378
10402 -34378 -69930 3324 -2459 -58482 -17496 21721 2818 27114 77906 33283 47783 80292
10390 80292 57346 20960 -5115 61464 78677 101909 86939 4326 -16321 -24749 23638 27626
10378 27626 -19441 -52875 -68847 -112636 -92579 -46248 -5777 28593 -20137 -28917 14511 52124
10366 52124 35110 101880 71071 20748 32130 60250 68898 117850 170247 125675 112393 152073
10354 152073 214352 200030 204214 223587 191757 153779 98963 85051 174979 219404 236032 247273
10342 247273 262246 228173 198207 138924 131296 118004 120023 170873 199634 190982 110056 72240
$$ packed form
10426A08637l1324k8410J0529k849n7910J957L4210m3001r062K7291k5610K7747
10414A2205L3754M1762m6885m5006k1903l9177J7320m13j0391M0062J5227l0933
10402c4378l5552P3254n783n6023M0986L9217j8903K4296N0792m4623J4500L2509
10390H0292k2946l6386k6075O6579J7213K3232j4970q2613k0647q428M8387L988
10378B7626m7067l3434j5972m3789K0057M6331M0471L4370m8730q780M3428L7613
10366E2124j7014O6770l0809n0323J1382K8120Q648M8952N2397m4572j3282L9680
10354A52073O2279j4322M184J9373l1830l7978n4816j3912Q9928M4425J6628J1241
10342B47273J4973l4073k9966n9283p628j3292K019N0850K8761q652q0926l7816
$$ plain form
10330 72240 51701 62414 51775 35319 71401 54296 -16149 -31703 -4707 16824 -23787 -35936
10318 -35936 9041 -2586 -31228 -65120 -67710 -50254 -3425 39670 49574 51078 36984 44106
10306 44106 83642 89903 77090 59092 49568 5372 -61415 -86351 -94786 -55716 41720 27833
10294 27833 55569 55990 69560 61218 10022 6587 6178 81633 55754 -16686 -23742 -25082 -14628
10281 -14628 23994 40432 34411 47932 32837 -2354 -29405 24723 33946 -5154 42871 22299
10269 22299 -9462 3764 60035 60656 32677 12757 316 -43696 -41796 40529 97279 73208
10257 73208 32672 26088 46026 29382 29046 50501 26272 -11623 16264 39898 -5845 -16006
10245 -16006 1951 9925 37848 94384 46332 14926 -11973 -5115 16115 77323 102024 85089
$$ packed form
10330G2240k0539J0713j0639j6456L6082j7105p0445j5554K6996K1531m0611j2149
10318c5936M4977j1627k8642l3892k590J7456M6829M3095R904J504j4094P122
10306D4106L9536O261j2813j7998r524m4196o6787k4936q435L9070R7436j3887
10294B7833K7736M21J3570q342n1196l435m09P5455k5879p2440p056j340J0454
10281a4628L8622J6438o021J3521j5095l5191k7051N4128R223l9100M8025k0572
10269B2299l1761J3226N6271O21k7979j9920j2441m4012J900Q2325N6750k4071
10257G3208m0536o584J9938j6644l36K1455k4229l7895K7887K3634m5743j0161
10245a6006J7957P974K7923N6536m8052l1406k6899O858K1230O1208K4701j6935
$$ plain form
10233 85089 34574 -34210 -43011 37460 102840 62930 60179 82221 49917 40537 29640 13641
10221 13641 16258 48028 69569 91727 81877 15640 -5565 6394 35627 13934 -28690 -13451
10209 -13451 4303 4820 3546 4870 40820 -17996 -40441 -105664 -67046 -20300 -14905 -35039 -65086
10196 -65086 27567 59795 29713 -35901 -83209 -74507 -54433 -34048 -28907 12962 -16944 -32603
10184 -32603 -13470 18888 32821 64289 31722 -28786 -49457 -51265 -11685 -24392 -21945 -8568
10172 -8568 54884 80235 44229 27675 17295 -18138 22040 40643 59554 54750 -10279 49921
10160 49921 16833 -25670 -31609 -15884 44616 35285 -43808 -30594 -35774 17989 41182 -26599
10148 -26599 -44550 -8237 -1867 -24226 -54265 -53067 -40382 -8972 32394 -11422 -26125 46748
$$ packed form
10233H5089n0515o8784q801Q0471O5380l9910k751K2042l2304r380j0897j5999
10221A3641K617L1770K1541K2158r850o6237k1205J1959K9233k1693m2624J5239
10209a3451J7754N17j274J324L5950n8816k2445o5223L8618M6746N395k0134l0047
10196f5086R2653L2228l0082o5614m7308Q702K0074K0385N141M1869k9906j5659
10184c2603J9133L2358J3933L1468l2567o0508k0671j808L9580j2707K447J3377
10172h568O3452K5351l6006j6554j0380l5433M0178J8603J8911m804o5029O0200
10160D9921l3088m2503n939J5725O0500r331p9093J3214n180N3763K3193o7781
10148b6599j7951L6313O370k2359l0039J198J2685L1410M1366m3816j4703P2873
$$ plain form
10136 46748 44819 -998 -11297 -24279 13433 -5358 -78292 -72873 -42243 21309 19775 -45502
10124 -45502 -3195 24206 -16174 39934 67236 92140 82330 107791 71878 56100 93163 99497
10112 99497 89160 90158 18464 10885 44273 37202 9638 23784 11818 7043 38837 105238 179968
10099 179968 113952 63293 135861 96130 38929 39642 55455 84279 46370 20351 43229 51680
10087 51680 17370 61040 45896 -5489 -26888 -5939 5673 7312 -35377 -86927 -95246 -83331
10075 -83331 10400 80405 45328 34217 33906 36918 45912 28616 18493 32223 12291 -6996
10063 -6996 -32522 -95220 -78252 -74877 -137324 -155258 -135108 -71338 -2466 76670 95732 37286
10051 37286 14412 57763 84390 35253 42371 64764 79127 136989 80027 17011 40145 98492
$$ packed form
10136D6748j929m5817j0299j2982L7712j8791p2934N419L0630O3552j534o5277
10124d5502M2307K7401m0380N6108K7302K4904r810K5461l5913j5778L7063O334
10112I9497j0337R98p1694p579L3388p071k7564J4146j1966m775L1794O6401P4730
10099A79968o6016n0659P2568l9731n7201P13J5813K8824l7909k6019K2878Q451
10087E1680l4310M3670j5144n1385k1399K0949J1612J639m2689n1550q319J1915
10075h3331R3731P0005l5077j1111l11L012Q994j7296j0123J3730j9932j9287
10063f996k5526o2698J6968L375o2447j7934K0150O3770O8872P9136J9062n8446
10051C7286k2874M3351K6627m9137P118K2393J4363N7862n6962o3016K3134N8347
$$ plain form
10039 98492 87649 64911 20943 63816 92330 76981 11068 34745 12704 -11908 -10405 4887
10027 4887 6718 -6683 46154 63660 -2279 -6742 51519 33548 22921 31763 13010 39975
10015 39975 15926 -42440 -58796 -49740 3208 -32311 -48934 10446 78791 156540 178762 122204
10003 122204 73151 76523 40677 60169 44037 45218 41135 14197 -23137 -37465 -83274 -30617
9991 -30617 -8649 -44218 -73194 -70959 -27052 17590 55967 63534 62523 65189 39487 -35055 -35564
9978 -35564 3730 9728 -5969 871 -26497 12350 30984 -4437 -17583 -81835 -84646 20221
9966 20221 53759 74404 62775 63934 37506 -8184 -62532 -119571 -137108 -130161 -82302 -54611
9954 -54611 -49344 18452 22955 30348 30329 46508 44527 34765 30665 23898 -4360 -26001 -1471 24072
$$ packed form
10039I8492j0843k2738m3968M2873K8514j5349o5913K3677k2041k4612J503J5292
10027D887J831j3401N2837J7506o5939m463N8261j7971j0627Q842j8753K6965
10015C9975k4049n8366j6356R056N2948l5519j6623N9380O8345P7749K2222n6558
10003A22204m9053L372l5846J9492j6132J181m083k6938l7334j4328m5809N2657
9991c0617K1968l5569k8976K235M3907M4642L8377P567j011K666k5702p4542n09
9978c5564L9294N998j5697O840k7368L8847J8634l5421j3146o4252k811J04867
9966B0221L3538K0645j1629J159k6428m5690n4348n7039j7537O947M7859K7691
9954e4611N267O7796M503P393j9J6179j981r762m100o767k8258k1641K4530K5543
$$ plain form
9940 24072 39084 19250 44982 64524 21446 -44053 -55134 -68604 -107639 -142381 -99939 -20411
9928 -20411 17982 -16596 -90012 -90154 -80797 -86976 -76425 -69132 -108509 -89427 -60603 -88582 -44446
9915 -44446 -1342 -13284 -8458 15982 10187 -1852 -50338 -25565 -50178 -63719 -2461 -84016
9903 -84016 -82747 -48580 -14332 56324 99279 75297 4175 -11478 7902 1596 -29315 -19584
9891 -19584 -17738 42262 17004 -22741 -10482 76855 85737 99013 108114 88851 123232 135450
9879 135450 95031 56135 27600 -22703 22455 81721 65830 44965 11603 -9317 -14480 -1534
9867 -1534 12243 -24142 -70827 -61347 -45414 9135 -51628 -110150 -134629 -80141 28825 125088
9855 125088 149140 95433 40059 -16550 -68111 -28777 -22572 17169 80784 50485 -27517 -11964
$$ packed form
9940B4072J5012j9834K5732J9542m3078o5499j1081j3470l9035l4742M2442P9528
9928b0411L8393l4578p3416j42R357o179J0551P293l9377J9082K8824k7979M4136
9915d4446M3104j1942M826K4440n795j2039m8486K4773k4613j3541O1258q1555
9903h4016J269L4167L4248P0656M2955k3982p1122j5653J9380o306l0911R731
9891a9584J846O0000k5258l9745J2259Q7337Q882J3276R101j9263L4381J2218
9879A35450m0419l8896k8535n0303M5158N9266j5891k0865l3362k0920n163J2946
9867a534J3777l6385m6685R480J5933N4549o0763n8522k4479N4488J08966R6263
9855A25088K4052n3707n5374n6609n1561L9334O205L9741O3615l0299p8002J5553
$$ plain form
9843 -11964 -6888 35232 112292 98989 35134 9848 13255 56143 56505 90719 35386 -67654
9831 -67654 -81861 -73504 -68142 -39583 12414 70708 117596 88439 72699 67437 -25775 -52943
9819 -52943 -7714 50169 -16336 -15460 -26837 -24210 2538 42652 9390 26671 39734 43457 12185
9806 12185 10100 64287 58903 -6871 -6747 -10139 -39954 -15184 14946 1308 -28655 -3957 -8729
9793 -8729 -60852 -28228 -6753 -20371 22342 -4520 18839 48500 49412 -6793 -32287 17091
9781 17091 34882 3401 10285 62228 49556 42792 76332 110666 103548 103712 77080 26055 1585
9768 1585 23333 64516 109815 155151 140059 132339 129672 100961 54379 26362 37170 -4547
9756 -4547 13438 19818 23860 30275 21154 76744 93507 31597 -32068 -26201 32059 74253 49046
$$ packed form
9843a1964N076M2120P7060j3303o3855k5286L407M2888L62L4214n5333j03040
9831f7654j4207Q357N362K8559N1997N8294M6888k9157j5740n262r3212k7168
9819e2943M5229N7883o6505Q76j1377K627K6748M0114l3262J7281J3063L723l1272
9806A2185k085N4187n384o5774J24l392k9815K4770L0130j3638k9963K4698m772
9793h729n2123L2624K1475j3618M2713k6862K3359K9661R12n6205k5494M9378
9781A7091J7791l1481O884N1943j2672o764L3540L4334p118J64k6632n1025k4470
9768A585K1748M1183M5299M5336j5092p720k667k8711m6582k8017J0808m1717
9756d547J7985O380M042O415r121N5590J6763o1910o3665N867N8260M2194k5207
$$ plain form
9743 49046 -3719 32362 93861 50216 46115 80125 97800 72536 20380 -47999 -97529 -80047
9731 -80047 -40733 24593 45459 9977 37814 25967 32267 58516 66160 86388 104892 51325
9719 51325 32256 41770 42190 36846 40748 24866 36150 47889 23330 56637 164622 177677 98683
9706 98683 24622 10524 3587 83211 107740 92330 124979 122363 21556 -3841 26613 -2734
9694 -2734 41996 51381 49633 108554 122790 47086 74383 111228 134342 97275 54656 25432
9682 25432 40262 33733 35736 74240 155885 156656 115160 63258 30386 60881 126755 159526 149755
9669 149755 98332 23765 -41622 -58417 -14925 -4262 -31830 -71162 -39495 -784 5822 -40091
9657 -40091 -71706 7105 51849 70054 63360 15633 25379 13072 44554 9451 -18699 -29129
$$ packed form
9743D9046n2765L6081O1499m3645m101L4010J7675k5264n2156o8379m9530J7482
9731h0047L9314O5326K0866l5482K7837j1847O300K6249P644K0228J8504n3567
9719E1325j9069R514M20n344L902j5882J1284J1739k4559L3307J07985J3055p8994
9706I8683p4061j4098o937P9624K4529j5410L2649k616j00807k5397L0454k9347
9694b734M4730R385j748N8921J4236p5704K7297L6845K3114l7067m2619k9224
9682B5432J4830o529K003L8504Q1645P71m1496n1902l2872L0495O5874L2771r771
9669A49755n1423p4567o5387j6795M3492J0663k7568l9332L1667L8711O606m5913
9657d0091l1615P8811M4744J8205o694m7727R746j2307L1482l5103k8150j0430
$$ plain form
9645 -29129 3093 18315 -4857 -23061 -7075 -25544 39487 88839 82873 8628 43568 94805
9633 94805 53869 26525 42810 92669 80659 67456 55160 37130 -6343 2363 38871 83072
9621 83072 44836 17538 8203 -21383 -3308 11886 -5776 1745 -41369 -90944 -99002 -90450 -59402
9608 -59402 -6570 7671 -40457 -16671 26566 -46645 -97356 -79832 -51285 17633 18695 37840
9596 37840 70313 109298 126055 107919 156105 124607 14303 77925 100223 112198 103825 53715
9584 53715 96362 158927 128158 109043 112586 38657 17610 56877 80120 70591 64776 62167 32618
9571 32618 18626 24161 30251 79263 77869 56522 50510 39653 49416 -13523 -69591 -19547 31019
9558 31019 36142 68542 18109 21341 52028 125337 164450 167299 117036 80561 114276 105578 100517
$$ packed form
9645b9129L2222J5222k3172j8204J5986j8469O5031M9352n966p4245L4940N1237
9633I4805m0936k7344J6285M9859j2010j3203j2296j8030m3473Q706L6508M4201
9621H3072l8236k7298r335k9586J8075J5194j7662P521m3114m9575q058Q552L1048
9608e9402N2832J4241m8128K3786M3237p3211n0711J7524K8547O8918J062J9145
9596C7840L2473L8985J6757j8136M8186l1498j10304O3622K2298J1975q373n0110
9584E3715M2647O2565l0769j9115L543p3929k1047L9267K3243r529n815k609k9549
9571C2618j3992N535O090M9012j394k1347o012j0857R763o2939n6068N0044N0566
9558C1019N123L2400n0433L232L0687P3309L9113K849n0263l6475L3715q698n061
$$ plain form
9545 100517 62265 39516 -9675 21242 62060 3990 34560 59503 85175 25101 59753 86941
9533 86941 60258 85911 103908 71103 2294 -4253 29598 -7521 37939 113037 118009 156753
9521 156753 164966 126238 123281 102414 127144 103232 56321 49744 59179 31315 33347 42582 44801
9508 44801 93283 128821 99823 69637 118685 152760 141319 147099 74984 -22310 -68461 -26880
9496 -26880 -32192 -1311 67610 144146 184534 131533 130700 102711 61247 15530 -39168 -50827
9484 -50827 5939 31762 72626 191464 207534 111662 42944 40906 103036 167745 116026 75466
9472 75466 83976 45542 93208 94655 72821 48450 29279 30175 65153 71891 47360 62737 87452
9459 87452 133234 118992 61151 35167 69724 88501 32399 15880 52571 73473 92631 131953
$$ packed form
9545A00517l8252k2749m9191L0917M0818n8070L0570K4943K5672o0074L4652K7188
9533H6941k6683K5653J7997l2805o8809o547L3851l7119M5460P5098M972L8744
9521A56753Q213l8728k957k0867K4730k3912m6911o577R435k7864K032R235K219
9508D4801M8482L5538k8998l0186M9048L4075j1441N780p2115r7294m6151M1581
9496b6880n312L0881O8921P6536M0388n3001q33k7989m1464m5717n4698j1659
9484e0827N6766K5823M0864J18838J6070r5872o8718k038O2130O4709n1719m0560
9472G5466Q510l8434M7666J447k1834k4371j9171Q96L4978O738k4531J5377K4715
9459H7452M5782j4242n7841k5984L4557J8777n6102j6519L6691K0902J9158L9322
$$ plain form
9447 131953 154993 106225 118673 116605 98746 106403 119004 100761 67068 78667 105925 120190
9435 120190 141906 91777 112309 140611 155286 110936 106240 115995 122351 82102 47973 51242
9423 51242 94417 105535 97789 101403 74862 51835 72352 152205 192506 169670 108935 61806
9411 61806 12461 -8720 83960 124977 71976 13721 35824 97400 77994 93727 90740 67472
9399 67472 95076 104747 115200 106607 91191 127066 147891 163125 123887 91851 109065 76992
9387 76992 30305 47921 92446 107570 57144 49955 117355 109620 68645 70745 60715 16349
9375 16349 20487 85240 105308 89809 81389 84315 50207 42844 75725 93620 106461 100534 82045
9362 82045 60950 59369 124685 89448 74053 79940 110111 34908 18788 73191 121432 121513 92986
$$ packed form
9447A31953K3040m8768J2448k068j7859P657J2601j8243l3693J1599K7258J4265
9435A20190K1716n0129K0532K8302J4675m4350m696R755O356m0249l4129L269
9423E1242M3175J1118p746L614k6541k3027K0517P9853M0301k2836o0735m7129
9411F1806m9345k1181R2680M1017n3001n8255K2103O1576j9406J5733k987k3268
9399F7472K7604R671J0453q593j5416L5875K0825J5234l9238l2036J7214l2073
9387G6992m6687J7616M4525J5124n0426p189O7400p735m0975K100j0030m4366
9375A6349M138O4753K0068j5499q420K926l4108p363L2881J7895J2841n927j8489
9362H2045k1095j581O5316l5237j5395N887L0171p5203j6120N4403M8241Q1k8527
$$ plain form
9349 92986 100149 63306 26014 35428 39839 34597 49280 87891 92117 112460 91572 42077 -7739
9336 -7739 1593 -3611 -2565 46820 74170 100579 93054 144574 146719 116073 86977 99948 132526
9323 132526 144720 172311 226902 264162 218260 203598 238687 259128 194698 131005 103590 122968
9311 122968 111930 105924 173648 253135 257675 203291 183346 150023 152911 151198 128022 98938
9299 98938 112731 171030 183577 148287 156995 149700 100100 122259 188123 183927 180384 113743 79114
9286 79114 85634 148156 181290 151799 131240 171158 228716 237512 178022 167683 184953 201237
9274 201237 195767 198870 183424 135384 171446 184037 169502 169524 148424 100546 89508 118563 153151
9261 153151 187103 205276 184056 179451 109332 139141 183650 180679 148799 149215 169368 137845
$$ packed form
9349I2986P163l6843l7292R414M411n242J4683L8611M226K0343k0888m9495m9816
9336g739R332n204J046M9385K7350K6409p525N1520K145l0646k9096J2971L2578
9323A32526J2194K7591N4591L7260m5902j4662L5089K0441o4430o3693k7415J9378
9311A22968j1038o006O7724P9487M540n4384j9945l3323K888j713k3176k9084
9299I8938J3793N8299J2547l5290Q708p295m9600K2159O5864m196l543o6641l4629
9286G9114O520O2522L3134k9491k0559L9918N7558Q796n9490j0339J7270J6284
9274B01237n470L103j5446m8040L6062J2591j4535K2k1100m7878j1038K9055L4588
9261A53151L3952J8173k1220m605p0119K9809M4509k971l1880M16K0153l1523
$$ plain form
9249 137845 78590 108699 185147 202629 113811 179842 239815 231411 212865 225804 200305 139247
9237 139247 175168 173068 198460 261652 267874 235298 226845 246598 248732 238005 247095 264816 274478
9224 274478 206822 254727 230827 212542 187360 205046 202313 152077 131738 199737 235031 222543
9212 222543 197340 204028 255484 283147 224886 237234 234130 222220 226549 236676 276828 274418
9200 274418 281316 291440 312180 260137 217663 215002 209530 192035 245953 243761 263239 216184
9188 216184 193520 224044 235598 188243 221926 257753 232971 240905 245511 268263 275320 306291
9176 306291 344469 359519 376203 401015 345065 296945 291928 268694 340597 384443 398620 397937
9164 397937 411549 452694 466866 405602 439626 455926 477052 497838 563447 596613 595306 539296
$$ packed form
9249A37845n9255L0109P6448J7482q8818O6031N9973q404j8546J2939k5499o1058
9237A39247L5921k100K5392O3192O222l2576q453J9753K134j0727R090J7721R662
9224B74478o7656M7905k3900j8285k5182J7686k733n0236k0339O7999L5294j2488
9212B22543k5203O688N1456K7663n8261J2348l104j1910M329J0127M0152k410
9200B74418O898J0124K0740n2043m2474k661n472j7495N3918k192J9478m7055
9188B16184k2664L0524J1554m7355L3683L5827k4782P934M606K2752P057L0971
9176C06291L8178J5050J6684K4812n5950m8120n017k3234P1903M3846J4177o83
9164C97937J3612M1145J4172o1264L4024J6300K1126K0786O5609L3166j307n6010
$$ plain form
9152 539296 520613 497458 577035 594731 519802 547439 520396 499689 531624 548268 586773 564260
9140 564260 536227 542032 575418 559831 631184 650771 650892 673253 669408 681821 701765 691421
9128 691421 708249 743704 732478 714942 747591 786468 831976 869391 929395 975028 1044149 1073038
9116 1073038 1115012 1079404 1126384 1190962 1217523 1249229 1289876 1285447 1276907 1312121 1376128 1436184
9104 1436184 1455808 1500060 1556256 1630685 1777687 1881821 1930540 2024115 2121481 2240286 2342759
9093 2342759 2456665 2608167 2763058 2873832 2957119 3151473 3418776 3645122 3817213 3990116
9083 3990116 4196996 4384486 4643442 4933196 5175111 5354364 5497738 5696523 5902612 6098879
9073 6098879 6198892 6321958 6389163 6366390 6346453 6341305 6315602 6196675 6110353 5964716 5780466
$$ packed form
9152E39296j8683k3155P9577J7696p4929K7637k7043k0707L1935J6644L8505k2513
9140E64260k8033N805L3386j5587P1353J9587J21K2361l845J2413J9944j0344
9128F91421J6828L5455j1226j7536L2649L8877M5508L7415O0004M5633O9121K8889
9116A073038M1974l5608M6980O4578K6561L1706M0647m429q540L5214O4007O0056
9104A436184J9624M4252N6196P4429J47002J04134M8719R3575R7366J18805J02473
9093B342759J13906J51502J54891J10774Q3287J94354K67303K26346J72091J72903
9083C990116K06880J87490K58956K89754K41915J79253J43374J98785K06089J96267
9073F098879J00013J23066O7205k2773j9937n148k5703j18927q6322j45637j84250
$$ plain form
9062 5780466 5587993 5364158 5149670 4944514 4731580 4555956 4373638 4197098 4030901 3818133
9052 3818133 3599787 3399701 3218710 3031728 2882309 2773429 2714373 2630513 2493335 2361052
9042 2361052 2202945 2102046 2005798 1918561 1826777 1722982 1645124 1565415 1503668 1482251 1388905
9031 1388905 1276616 1247171 1237964 1267838 1209191 1158624 1092510 1049046 1011932 979647 911442
9020 911442 834878 880236 907603 889885 855620 808405 740802 717987 726942 714060 681793 657002
9008 657002 613587 602683 613679 615645 585467 545775 524455 496658 504601 508360 516336 497203
8996 497203 498500 550562 567834 542219 538345 555944 528886 501138 475546 455955 450832 414985
8984 414985 373519 377494 455746 538270 523793 499846 528537 470387 401163 436361 469569 413602
$$ packed form
9062E780466j92473k23835k14488k05156k12934j75624j82318j76540j66197k12768
9052C818133k18346k00086j80991j86982j49419j08880n9056q3860j37178j32283
9042B361052j58107j00899r6248q7237r1784j03795p7858p9709o1747k1417r3346
9031A388905j12289k9445r207K9874n8647n0567o6114m3464l7114l2285o8205
9020I11442p6564M5358K7367j7718l4265m7215o7603k2815Q955j2882l2267k4791
9008F57002m3415j0904J0996J966l0178l9692k1320k7797P943L759P976j9133
8996D97203J297N2062J7272k5615l874J7599k7058k7748k5592j9591n123l5847
8984D14985m1466L975P8252Q2524j4477k3947K8691n8150o9224L5198L3208n5967
$$ plain form
8972 413602 329166 277881 282999 293182 294106 302694 344580 340255 316275 346428 305697 323745 295049
8959 295049 307430 338476 329495 265867 220573 183877 251707 269805 249523 310233 312519 306926
8947 306926 320991 286262 227438 259219 237937 223689 161595 142313 130745 163805 187525 112490
8935 112490 96899 144275 176577 202734 184165 162626 141854 162091 217576 182313 144518 136056
8923 136056 153252 160740 124924 39836 82048 224009 262348 181770 86464 41372 76071 127980
8911 127980 130545 141067 130976 117787 131571 154987 188564 201346 167015 154968 148402 130984
8899 130984 140411 190542 233094 247684 224798 199735 180370 159547 84804 100364 130835 88904
8887 88904 96723 124165 145594 145208 140670 117858 77933 156346 179934 226785 239329 238719 187318
$$ packed form
8972D13602q4436n1285N118J0183R24Q588M1886m325k3980L0153m0731J8048k8696
8959B95049J2381L1046q981o3628m5294l6696O7830J8098k0282O0710K286n593
8947C06926J4065l4729n8824L1781k1282j4248o2094j9282j1568L3060K3720p5035
8935A12490j5591M7376L2302K6157j8569k1539k0772K0237N5485l5263l7795q462
8923A36056J7196P488l5816q5088M2212J41961L8339q0578r5306m5092L4699N1909
8911A27980K565J0522j0091j3189J3784K3416L3577J2782l4331j2047o566j7418
8899A30984R427N0131M2552J4590k2886k5063j9365k0823p4743J5560L0471m1931
8887H8904P819K7442K1429l86m538k2812l9925P8413K3588M6851J2544o10n1401
$$ plain form
8874 187318 151016 131605 145697 171245 151195 203450 211456 150515 131780 189362 199108 196684
8862 196684 195572 214952 258103 177073 176895 168210 132618 120788 118212 121737 128592 86910 56838
8849 56838 76798 43744 30693 65571 83835 96428 135571 119058 146842 187697 157226 71590
8837 71590 108296 87832 46226 133998 149159 131992 167501 179216 196926 222649 207118 163274
8825 163274 101625 99727 92098 47257 61747 93693 70595 49463 30778 4008 33315 88015
8813 88015 134505 129428 102422 65680 87338 85821 45997 60610 44823 -4323 1232 47266
8801 47266 97704 117144 135349 95974 93822 108940 100168 121360 139158 107635 108848 54374
8789 54374 62799 42338 120782 236600 263193 229649 170565 169952 139119 69801 78794 77038 79944
$$ packed form
8874A87318l6302j9411J4092K5548k0050N2255Q006o0941j8735N7582R746k424
8862A96684j112J9380M3151q1030j78q685l5592j1830k576L525O855m1682l0072
8849E6838J9960l3054j3051L4878J8264J2593L9143j6513K7784M0855l0471q5636
8837G1590L6706k0464m1606Q7772J5161j7167L5509J1715J7710K5723j5531m3844
8825A63274o1649j898p629m4841J4490L1946k3098k1132j8685k6770K9307N4700
8813H8015M6490n077k7006l6742K1658j517l9824J4613j5787m9146N555M6034
8801D7266N0438J9440J8205l9375k152J5118q772K1192J7798l1523J213n4474
8789E4374Q425k0461P8444J15818K6593l3544n9084o13l0833o9318Q993j756K906
$$ plain form
8776 79944 91526 128087 129400 129654 143905 49068 36879 63701 72987 82535 118322 161765 174069
8763 174069 174946 193314 240148 222255 205856 216194 204016 146501 128064 149209 130427 99682
8751 99682 109220 173795 88559 70439 130480 93993 60707 97270 78212 41684 76242 117102
8739 117102 89237 80976 67258 47336 70129 88989 114907 104574 58946 73227 84750 96032
8727 96032 165347 140898 98438 164703 163526 99828 71160 118818 208023 188269 178076 169340
8715 169340 158489 131195 168842 179434 156689 61132 55845 109465 99851 164401 220483 208301
8703 208301 163832 130106 138739 165677 165335 119331 126489 131504 185459 208551 195293 204182 211749
8690 211749 183381 137543 118221 160511 140793 178997 178437 214522 237876 228918 207703 238428
$$ packed form
8776G9944J1582L6561J313K54J4251r4837j2189K6822R286R548L5787M3443J2304
8763A74069Q77J8368M6834j7893j6399J0338j2178n7515j8437K1145j8782l0745
8751I9682R538O4575q5236j8120O0041l6487l3286L6563j9058l6528L4558M0860
8739A17102k7865q261j3718j9922K2793J8860K5918j0333m5628J4281J1523J1282
8727I6032O9315k4449m2460O6265j177o3698k8668M7658Q9205j9754j0193q736
8715A69340j0851k7294L7647J0592k2745r5557n287N3620r614O4550N6082j2182
8703B08301m4469l3726Q633K6938l42m6004P158N015N3955K3092j3258Q889P567
8690B11749k8368m5838j9322M2290j9718L8204n60L6085K3354q958k1215L0725
$$ plain form
8678 238428 263270 189840 144481 132884 199256 227429 210473 169686 172809 230292 255247 256179
8666 256179 268421 253869 244480 278845 256332 271370 264627 270641 295853 288749 280487 252831 184226
8653 184226 165239 151253 151427 179052 235259 280520 268634 272939 282610 268154 297801 262583
8641 262583 286631 328254 348312 302291 249869 286297 320680 378912 431280 455163 455272 408854
8629 408854 361191 369711 377550 353393 439722 473027 441078 465944 519482 543859 547405 599136
8617 599136 654640 640424 669132 752806 854434 883259 905376 986788 1076481 1151850 1229772
8606 1229772 1359123 1532975 1665299 1793191 1872163 1914893 1982472 1962491 1846518 1747171
8596 1747171 1662341 1534580 1375919 1226900 1089663 977212 860266 835534 754848 662138
$$ packed form
8678B38428K4842p3430m5359j1597O6372K8173j6956m0787L123N7483K4955R32
8666B56179J2242j4552r389L4365k2513J5038o743O014K5212p104q262k7656o8605
8653A84226j8987j3986J74K7625N6207M5261j1886M305R671j4456K9647l5218
8641B62583K4048M1623K0058m6021n2422L6428L4383N8232N2368K3883J09m6418
8629D08854m7663Q520P839k4157Q6329L3305l1949K4866N3538K4377L546N1731
8617E99136N5504j4216K8708Q3674J01628K8825K2117Q1412Q9693P5369P7922
8606A229772J29351J73852J32324J27892P8972M2730O7579j9981j15973r9347
8596A747171q4830j27761j58661j49019j37237j12451j16946k4732q0686r2710
$$ plain form
8586 662138 625330 576515 550529 552031 562008 531842 458525 454311 451617 410814 331247 306267
8574 306267 343788 312667 310739 297194 296472 305484 333594 352417 334340 303290 278494 254518
8562 254518 273083 300576 306661 290936 309225 295023 272100 281037 287138 324022 311760 215811
8550 215811 195409 186120 200040 234810 225417 201093 216250 216909 138799 103410 123537 157406
8538 157406 170734 217830 196498 171198 207602 142676 87634 77498 63162 123786 218858 213152
8526 213152 211757 194187 163672 197227 224817 273115 209151 124946 133478 189214 170184 116741
8514 116741 119981 151417 174415 200301 194634 172676 162160 193225 203442 225059 190415 190665
8502 190665 259560 224141 155684 166275 215037 213142 203789 243002 192714 171635 190490 217352
$$ packed form
8586F62138l6808m8815k5986J502R977l0166p3317m214k694m0803p9567k4980
8574C06267L7521l1121j928j3545p22R012K8110J8823j8077l1050k4796k3976
8562B54518J8565K7493O085j5725J8289j4202k2923Q937O101L6884j2262r5949
8550B15811k0402r289J3920L4770r393k4324J5157O59p8110l5389K0127L3869
8538A57406J3328M7096k1332k5300L6404o4926n5042j0136j4336O0624R5072n706
8526B13152j395j7570l0515L3555K7590M8298o3964q4205Q532N5736j9030n3443
8514A16741L240L1436K2998K5886n667k1958j0516L1065J0217K1617l4644K50
8502A90665O8895l5419o8457J0591M8762j895r353L9213n0288k1079J8855K6862
$$ plain form
8490 217352 226565 254846 252900 160847 140094 156453 214286 223236 155144 123180 172534 173647
8478 173647 163852 146372 94779 95688 107074 105645 129617 107948 97441 122841 98843 87107
8466 87107 120415 140788 176652 222429 273074 307432 285296 253256 163379 112845 124448 146404
8454 146404 219251 180873 198553 200815 124942 128846 159466 150761 133587 84958 88741 94454 68347
8441 68347 106060 171859 170741 104258 79480 86744 129498 61165 29937 98382 146576 89659
8429 89659 3018 -23036 2086 27469 51619 54307 65566 131370 178899 136250 126194 125245
8417 125245 125665 118237 140505 178542 125870 93411 115669 163716 170715 185060 136076 108537
8405 108537 119081 182635 186136 166168 161041 152912 101545 -2154 35349 114416 137142 87915
$$ packed form
8490B17352R213K8281j946r2053k0753J6359N7833Q950o8092l1964M9354J113
8478A73647r795j7480n1593R09J1386j429K3972k1669j0507K5400k3998j1736
8466H7107L3308K0373L5864M5777N0645L4358k2136l2040q9877n0534J1603K1956
8454A46404P2847l8378J7680K262p5873L904L0620q705j7174m8629L783N713k6107
8441F8347L7713O5799j118o6483k4778P264M2754o8333l1228O8445M8194n6917
8429H9659q6641k6054K5122K5383K4150K688J1259O5804M7529m2649j0056r49
8417A25245M20p428K2268L8037n2672l2459K2258M8047O999J4345m8984k7539
8405A08537J0544O3554L501j9968n127q129n1367j03699L7503P9067K2726m9227
$$ plain form
8393 87915 50443 65237 35861 27996 18804 76528 89068 96043 152123 160291 78598 39664 17357
8380 17357 18678 -13385 4749 21288 36864 94908 131651 148812 132447 91855 39332 73358
8368 73358 72407 90312 64783 37333 66178 88788 60368 13700 -8900 63448 109200 68047
8356 68047 54569 97236 67845 43519 53201 54941 65927 60233 390 45195 111244 118483 111025
8343 111025 92668 62831 51851 17352 24100 -24286 -58353 -17842 27916 58647 137106 162594
8331 162594 120219 48050 -18618 -22496 -16832 -71065 -29593 10150 -12129 22153 54824 94966
8319 94966 124411 98613 114471 85030 5052 -55363 -23268 -10196 -47425 -28733 19806 59638
8307 59638 74107 112148 42168 -54462 -70848 -15344 34456 82692 107999 104630 50895 13513
$$ packed form
8393H7915l7472J4794k9376p865r192N7724J2540O975N6080Q168q1693l8934k2307
8380A7357J321l2063J8134J6539J5576N8044L6743J7161j6365m0592n2523L4026
8368G3358r51J7905k5529k7450K8845K2610k8420m6668k2600P2348M5752m1153
8356F8047j3478M2667k9391k4326R682J740J0986n694n9843M4805O6049P239p458
8343A11025j8357k9837j0980l4499O748m8386l4067M0511M5758L0731P8459K5488
8331A62594m2375p2169o6668l878N664n4233M1472L9743k2279L4282L2671M0142
8319I4966K9445k5798J5858k9441p9978o0415L2095J3072l7229J8692M8539L9832
8307E9638J4469L8041o9980r6630j6386N5504M9800M8236K5307l369n3735l7382
$$ plain form
8295 13513 -28409 -42091 -20114 -26667 6166 50207 36938 14276 4384 2504 -5329 16611 57460
8282 57460 60497 52072 -729 -37636 -16455 -7441 16371 45711 73700 81285 71311 89925 51898
8269 51898 21192 37120 -40026 -49762 14917 22915 -2274 26020 80034 67389 137181 217729
8257 217729 194967 113052 55060 87151 75753 34190 -13114 -3753 6124 4659 14043 7436 -13365
8244 -13365 -27428 3222 -5551 48415 61338 59665 41367 -19825 2337 52685 28359 -11063
8232 -11063 32190 44230 52309 55027 38703 22120 1150 59899 107331 144382 128029 95205
8220 95205 114794 91741 140452 108617 77681 61486 54075 50167 60923 69843 100417 104511 53916
8207 53916 -811 40360 44209 -4401 30025 34310 32319 64711 54750 67712 45193 -5898 -21837
$$ packed form
8295A3513m1922j3682K1977o553L2833M4041j3269k2662r892j880p833K1940M0849
8282E7460L037q425n2801l6907K1181R014K3812K9340K7989P585r974J8614l8027
8269E1898l0706J5928p7146r736O4679P998k5189K8294N4014j2645O9792Q0548
8257B17729k2762q1915n7992L2091j1398m1563m7304R361R877j465R384o607k0801
8244a3365j4063L0650q773N3966J2923j673j8298o1192K2162N0348k4326l9422
8232a1063M3253J2040Q079K718j6324j6583k0970N8749M7432L7051j6353l2824
8220I5205J9589k3053M8711l1835l0936j6195p411l908J0756Q920L0574M094n0595
8207E3916n4727M1171L849m8610L4426M285j991L2392r961J2962k2519n1091j5939
$$ plain form
8194 -21837 -25949 -32250 -12387 -14671 22285 13674 -14235 -21359 38553 72552 98202 56003 12324
8181 12324 65073 66560 95598 117063 78733 25202 1333 -42710 16691 71622 101342 106268
8169 106268 149112 166082 90803 32464 33713 103812 125862 96122 83357 70740 86041 63123
8157 63123 20383 -6199 42367 40225 7549 20064 -2807 22241 -18680 -5186 23245 12899
8145 12899 92508 74843 58354 99789 93657 28928 34294 56505 47620 91067 135775 133823 103733
8132 103733 109784 130954 127215 95410 56116 37641 14275 -17654 31514 43714 23714 29296
8120 29296 28856 430 3673 62178 98514 103095 86536 129508 136663 124692 98618 85406 76840
8107 76840 83492 82953 53209 83162 116285 86904 74853 85185 132322 143058 61273 62163 120615
$$ packed form
8194b1837m112o301J9863k284L6956q611k7909p124N9912L3999K5650m2199m3679
8181A2324N2749J487K9038K1465l8330n3531k3869m4043N9401N4931K9720M926
8169A06268M2844J6970p5279n8339J249P0099K2050k9740j2765j2617J5301k2918
8157F3123m2740k6582M8566k142l2676J2515k2871K5048m0921J3494K8431j0346
8145A2899P9609j7665j6489M1435o132o4729N366K2211q885M3447M4708j952l0090
8132A03733O051K1170l739l1805l9294j8475k3366l1929M9168J2200k0000N582
8120B9296m40k8426L243N8505L6336M581j6559M2972P155j1971k6074j3212q566
8107G6840O652n39k9744K9953L3123k9381j2051J0332M7137J0736q1785Q90N8452
$$ plain form
8094 120615 52676 -8806 -19432 -958 9758 24664 66818 43729 45932 52818 94883 67048
8082 67048 -40087 -26655 15787 29845 82155 80828 87641 68563 92190 102100 83175 102363
8070 102363 89158 62280 50420 113543 81309 58464 -11951 36600 130112 135845 156091 150479
8058 150479 99814 64970 94095 57112 32823 39181 20127 5115 40467 85982 150729 220892
8046 220892 190355 142048 119574 154693 197912 223882 228937 238807 238427 277159 237383 190599
8034 190599 159687 170215 242543 222784 212571 238736 222181 205757 152792 69564 93080 151599
8022 151599 230639 304764 297578 262609 281025 297944 343518 342908 342535 337979 355045 361282 413391
8009 413391 437662 491374 445991 447126 441530 463749 427931 449306 448955 370584 364576 328410 305354
$$ packed form
8094A20615o7939o1482j0626J8474J0716J4906M2154k3089K203O886M2065k7835
8082F7048j07135J3432M2442J4058N2310j327O813j9078K3627R910j8925J9188
8070A02363j3205k6878j1860O3123l2234k2845p0415M8551R3512N733K0246n612
8058A50479n0665l4844K9125l6983k4289O358j9054j5012L5352M5515O4747P0163
8046B20892l0537m8307k2474L5119M3219K5970N055R870l80L8732l9776m6784
8034A90599l0912J0528P2328j9759j0213K6165j6555j6424n2965q3228K3516N8519
8022A51599P9040P4125p186l4969J8416J6919M5574o10l73m556J7066O237N2109
8009D13391K4271N3712m5383J135n596K2219l5818K1375l51p8371o008l6166k3056
$$ plain form
7996 305354 349893 380959 416305 392556 383607 319888 209256 225961 283310 274926 180230 176864
7984 176864 172615 152991 146224 160875 198393 192852 216559 259727 251458 226312 242190 273447
7972 273447 307946 388803 377865 355219 467596 479234 448219 503366 540966 503725 472905
7961 472905 423565 391641 415053 388417 379806 345824 334118 319339 328248 315175 263683 210523
7949 210523 223043 211160 135588 120254 140545 127278 135131 149965 134901 95399 49786 100857
7937 100857 131421 168590 139895 173976 176257 192451 215995 175074 160454 249402 226021 197263
7925 197263 190545 212161 272835 262349 207688 183843 170852 157016 267094 343580 285720 301042
7913 301042 304229 285751 311731 276419 210227 203072 167990 162941 160411 132895 124122 84680 93172
$$ packed form
7996C05354M4539L1066L5346k3749q949o3719j10632J6705N7349q384r4696l366
7984A76864m249j9624o767J4651L7518n541K3707M3168q269k5146J5878L1257
7972B73447L4499Q0857j0938k2646J12377J1638l1015N5147L7600l7241l0820
7961D72905m9340l1924K3412k6636q611l3982j1706j4779Q909j3073n1492n3160
7949B10523J2520j1883p5572j5334K0291j3267P853J4834j5064l9502m5613N1071
7937A00857L0564L7169k8695L4081K281J6194K3544m0921j4620Q8948k3381k8758
7925A97263o718K1616O0674j0486n4661k3845j2991j3836J10078P6486n7860J5322
7913C01042L187j8478K5980l5312o6192p155l5082n049k530k7516q773l9442Q492
$$ plain form
7900 93172 101833 135102 147870 179459 156382 127691 169338 158125 111924 123374 78677 51665
7888 51665 51504 95446 130056 148653 147068 83994 45771 45269 103402 105635 71327 17539 -20477
7875 -20477 -11613 -16388 72070 115187 30801 -23153 -34822 -20481 47410 136179 145706 135786 95045
7862 95045 77966 21412 -35306 -16637 -2192 -25428 -53239 -20983 -29596 -38625 16781 50891
7850 50891 97099 108059 15781 -52805 -71953 -29854 -1137 -54190 -95627 -36263 -65315 -24781
7838 -24781 -8777 -4982 -26877 -69407 -49106 4496 -2215 -60345 -49122 3950 19156 18730 52792
7825 52792 89274 54213 -4154 -3406 -8994 -6944 -17339 -19745 14692 -12602 7055 51417 40729
7812 40729 -300 -50204 -73831 -72338 -8685 -6793 -36669 -6443 49844 90062 69501 21825
$$ packed form
7900I3172Q661L3269J2768L1589k3077k8691M1647j1213m6201J1450m4697k7012
7888E1665j61M3942L4610J8597j585o3074l8223n02N8133K233l4308n3788l8016
7875b0477Q864m775Q8458M3117q4386n3954j1669J4341O7891Q8769R527r920m0741
7862I5045j7079n6554n6718J8669J4445k3236k7811L2256q613r029N5406L4110
7850E0891M6208J0960r2278o8586j9148M2099K8717n3053m1437N9364k9052M0534
7838b4781J6004L795k1895m2530K0301N3602o711n8130J1223N3072J5206m26L4062
7825E2792L6482l5061n8367P48n588K050j0395k406L4437k7294J9657M4362j0688
7812D0729m1029m9904k3627J493O3653J892k9876L0226N6287M0218k0561m7676
$$ plain form
7800 21825 -63101 -127446 -93888 -35714 -14226 55762 108582 106866 32021 44445 95094 54129
7788 54129 4342 24820 34357 -18848 -47016 -81618 -109312 -73613 -100532 -106238 -44319 -26896
7776 -26896 32830 65271 -4287 -15149 -54049 -28077 -43635 -112938 -87089 10000 38028 24699
7764 24699 9328 15987 26613 81488 128026 156645 75787 50732 78944 51130 61503 36654
7752 36654 9378 48729 81626 56175 31946 36873 3892 -9392 -22180 8732 46983 89453
7740 89453 107524 47892 -5822 -1890 -12087 -18806 6702 75001 31466 32229 106171 146990 104026
7727 104026 20738 476 -14153 -22868 4515 -9575 10022 25334 11014 -10520 -20787 7888
7715 7888 -26646 -110378 -130869 -74131 -10328 -2740 -59489 -81002 -23165 -9768 10269 36317
$$ packed form
7800B1825q4926o4345L3558N8174K1488O9988N2820j716p4845J2424N0649m0965
7788E4129m9787K0478R537n3205k8168l4602k7694L5699k6919n706O1919J7423
7776b6896N9726L2441o9558j0862l8900K5972j5558o9303K5849R7089K8028j3329
7764B4699j5371O659J0626N4875M6538K8619q0858k5055K8212k7814J0373k4849
7752C6654k7276L9351L2897k5451k4229M927l2981j3284j2788L0912L8251M2470
7740H9453J8071n9632n3714L932j0197o719K5508O8299m3535P63P3942M0819m2964
7727A04026q3288k0262j4629q715K7383j4090J9597J5312j4320k1534j0267K8675
7715G888l4534q3732k0491N6738O3803P588n6749k1513N7837J3397K0037K6048
$$ plain form
7703 36317 5281 -32555 -102493 -114857 -84519 -22158 -9657 -10098 -7006 -70284 -89332 -71294
7691 -71294 -78788 -85680 -81569 -82742 -51102 -14854 -38571 -49423 -90138 -142712 -194038 -139468 -109498
7678 -109498 -72959 -23470 4532 -7726 -30441 -57376 -82786 -98508 -130249 -116427 -45540 13096
7666 13096 -42559 -69502 -75149 -5472 12446 -51898 -64073 -73670 -63395 -24634 11011 -21836
7654 -21836 -85133 -92649 -80063 -2997 20120 5859 4762 7599 -28060 14647 14775 27999 58828
7641 58828 -20937 -48124 -58288 -50409 -35679 -95342 -20679 60579 38648 27961 -3218 19540
7629 19540 53437 61079 46825 30450 47757 26276 7334 5667 5590 -4652 -12844 -71576 -60828
7616 -60828 16382 24619 -1855 -47673 -68100 -114485 -144236 -126781 -95812 -143679 -118220 -10867
$$ packed form
7703C6317l1036l7836o9938j2364L0338O2361J2501m41L092o3278j9048J8038
7691g1294p494o892M111j173L1640L6248k3717j0852m0715n2574n1326N4570K9970
7678a09498L6539M9489K8002j2258k2715k6935k5410j5722l1741J3822P0887N8636
7666A3096n5655k6943n647O9677J7918o4344j2175r597J0275L8761L5645l2847
7654b1836o3297p516J2586P7066K3117j4261j097K837l5659M2707J28J3224L0829
7641E8828p9765k7187j0164P879J4730n9663P4663Q1258k1931j0687l1179K2758
7629A9540L3897P642j4254j6375J7307k1481j8942j667p7j0242q192n8732J0748
7616f0828P7210Q237k6474m5818k0427m6385k9751J7455L0969m7867K5459J07353
$$ plain form
7604 -10867 18611 -10962 -60901 -52819 -87484 -63087 27464 21897 14615 1953 -9292 -32221
7592 -32221 -34299 -10888 -41751 -13320 -10762 4211 37001 30306 3023 -31810 -11937 -12486 19266
7579 19266 -6284 9735 16140 51716 26166 36694 42809 1271 -17275 41034 43485 7012
7567 7012 -10500 27232 20173 28954 16457 -19018 -23430 -40312 -53726 -68353 -51088 -204 64092
7554 64092 59775 -19421 -57888 -64334 -81691 -120419 -167009 -151070 -94092 -29816 -50265 -58745
7542 -58745 -53118 -114192 -130821 -87262 3961 -3906 -7844 38558 19782 19382 74414 30987 11936
7529 11936 52127 36557 16814 -11303 -63925 -127289 -141796 -45070 12003 20989 20248 -11967
7517 -11967 -32664 -19984 -16145 -21135 22762 65587 66859 -26483 -67795 -9842 28455 9768
$$ packed form
7604a0867K9478k9573m9939Q082l4665K4397R0551n567p282j2662j1245k2929
7592c2221k078K3411l0863K8431K558J4973L2790o695k7283l4833J9873n49L1752
7579A9266k5550J6019O405L5576k5550J0528O115m1538j8546N8309K451l6473
7567G012j7512L7732p059Q781j2497l5475m412j6882j3414j4627J7265N0884O4296
7554F4092m317p9196l8467o446j7357l8728m6590J5939N6978O4276k0449q480
7542e8745N627o1074j6629M3559R1223p867l938M6402j8776m00N5032m3427j9051
7529A1936M0191j5570j9743k8117n2622o3364j4507R6726N7073Q986p41l2215
7517a1967k0697J2680L839m990M3897M2825J272r3342m1312N7953L8297j8687
$$ plain form
7505 9768 23602 -11599 -62590 -88988 -52804 -61026 -53813 -15831 -42189 -72745 -98343 -132308
7493 -132308 -113807 -115747 -97513 -59279 -34293 -12714 -8183 38558 39502 42496 45419 62877 12250
7480 12250 14710 7226 3781 -20790 -49548 -14815 27608 -412 -26380 -72069 -59996 -31696
7468 -31696 -39922 -62093 -27903 1356 -51856 -54750 -57071 -19195 -23145 -51096 -52599 -13357 -9469
7455 -9469 -5807 -35642 -17340 -71727 -108401 -16847 16316 -25576 -71899 -8957 -16463 -28562
7443 -28562 13261 22889 -42334 -26151 8099 -29404 -3794 -12507 -58316 -91871 -129650 -101597
7431 -101597 -61748 -21588 -20517 -53133 -91932 -127649 -89296 -91136 -70328 -18942 10592 -27041
7419 -27041 -132406 -133012 -52347 -4198 7071 22993 33527 -8936 -50765 -75777 -45214 -49494
$$ packed form
7505I768J3834l5201n0991k6398L6184q222P213L7982k6358l0556k5598l3965
7493a32308J8501j940J8234L8234K4986K1579M531M6741R44K994K923J7458n0627
7480A2250K460p484l445k4571k8758L4733M2423k8020k5968m5689J2073K8300
7468c1696q226k2171L4190K9259n3212k894k321L7876l950k7951j503L9242L888
7455i469L662k9835J8302n4387l6674R1554L3163m1892m6323O2942p506j2099
7443b8562M1823R628o5223J6183L4250l7503K5610q713m5809l3555l7779K8053
7431a01597L9849M0160J071l2616l8799l5717L8353j840K0808N1386K9534l7633
7419b7041j05365o06Q0665M8149J1269J5922J0534m2463m1829k5012L0563m280
$$ plain form
7407 -49494 -59661 -78284 -34558 8518 -1853 6884 -30032 -56356 -89781 -178396 -169461 -119559
7395 -119559 -36204 -58209 -128983 -55206 -2769 -39053 -54488 -64021 -76865 -67942 -73742 -107799
7383 -107799 -101263 -113014 -114301 -98081 -88246 -29393 -23434 -46643 -71210 -69069 -43968 7566 -17384
7370 -17384 -54645 -93374 -173336 -149995 -68246 -80586 -48997 -49404 -71221 -10986 48239 20768
7358 20768 67666 24416 -30988 -11591 -3360 12821 -20256 -20857 26203 -31361 -40331 -70556 -26391
7345 -26391 8660 4060 6195 16112 -28227 -31387 -16832 -1914 9803 272 -30833 13584 40522
7332 40522 1807 -67690 -78028 -30558 -28252 -2519 4089 -26016 -46972 -20549 -31285 -107212
7320 -107212 -116322 -114230 -112288 -95955 -79777 -92341 -84878 -85606 -50241 -58828 -55476 -76612 -139693
$$ packed form
7407d9494j0167j8623M3726M3076j0371Q737l6916k6324l3425q8615Q935M9902
7395a19559Q3355k2005p0774P3777N2437l6284j5435r533j2844Q923n800l4057
7383a07799O536j1751j287J6220R835N8853N959k3209k4567K141K5101N1534k4950
7370a7384l7261l8729p9962K3341Q1749j2340L1589m07k1817O0235N9225k7471
7358B0768M6898m3250n5404J9397Q231J6181l3077o01M7060n7564q970l0225M4165
7345b6391L5051m600K135R917m4339l160J4555J4918J1717r531l1105M4417K6938
7332D0522l8715o9497j0338M7470K306K5733O608l0105k0956K6423j0736p5927
7320a07212r110K092J942J6333J6178j2564P463p28L5365q587L352k1136o3081
$$ plain form
7307 -139693 -117633 -80287 -28359 -31003 -53864 -47001 -46172 -66840 -64797 -30817 -21826 -42090 -58666
7294 -58666 -6998 48011 35466 2813 -34204 -63721 -54881 -44235 -34886 -44127 -61815 -86805
7282 -86805 -97692 -58609 -23446 19562 15368 -17699 9390 -3583 -8784 -5814 -49140 -71549
7270 -71549 -41768 -56111 -11692 51684 98253 138451 84531 12689 -45887 -51222 -70546 -85105
7258 -85105 -46902 -2586 24646 66292 95162 72349 20168 -19539 -45 47027 44995 63839
7246 63839 47991 28872 36531 44628 19589 2374 17139 91209 113106 48824 -31067 -94537
7234 -94537 -123140 -71821 -67966 -74423 -87227 -33505 -46265 -72121 -68015 -16715 5036 -57563
7222 -57563 -55975 -37665 8723 24364 -37384 -9723 -43707 -59027 -76013 -57864 2444 42503
$$ packed form
7307a39693K2060L7346N1928k644k2861O863Q29k0668K043L3980Q991k0264j6576
7294e8666N1668N5009j2545l2653l7017k9517Q840J0646R349r241j7688k4990
7282h6805j0887L9083L5163M3008m194l3067K7089j2973n201K970m3326k2409
7270g1549K9781j4343M4419O3376M6569M0198n3920p1842n8576n335j9324j4559
7258h5105L8203M4316K7232M1646K8870k2813n2181l9707J9494M7072k032J8844
7246F3839j5848j9119P659Q097k5039j7215J4765P4070K1897o4282p9891o3470
7234i4537k8603N1319L855o457j2804N3722j2760k5856M106N1300K1751o2599
7222e7563J588J8310M6388J5641o1748K7661l3984j5320j6986J8149O0308M0059
$$ plain form
7210 42503 59412 88065 70947 47423 29776 7927 15787 -32646 -36895 10756 -11530 -40871
7198 -40871 -86632 -77895 -86386 -98348 -59115 38670 57672 3121 -23122 -1899 -9786 3681
7186 3681 -1451 4859 14621 25104 5427 29191 -11995 9878 14160 42434 34859 -27073 -74761
7173 -74761 -60741 -85408 -109470 -75878 -10316 -39995 -66055 -66570 -58741 11150 -20746 -71012
7161 -71012 -107197 -77428 -73793 -96191 -78355 -59789 -55282 -79665 -67978 -31575 19331 17428
7149 17428 36139 72597 23731 -30251 -43872 -85374 -54854 -58678 -62823 -30281 -5632 28900
7137 28900 47623 14905 14795 -4714 -24508 -15625 9498 52613 -4154 -18374 -48705 -34142
7125 -34142 16923 39551 22726 54930 67842 5143 -5655 -16058 -20067 -1375 -19912 -33972
$$ packed form
7210D2503J6909K8653j7118k3524j7647k1849P860m8433m249M7651k2286k9341
7198d0871m5761Q737q491j1962L9233R7785J9002n4551k6243K1223p887J3467
7186C681n132O310R762J0483j9677K3764m1186K1873M282K8274p575o1932m7688
7173g4761J4020k4667k4062L3592O5562k9679k6060n15P829O9891l1896n0266
7161g1012l6185K9769L635k2398J7836J8566M507k4383J1687L6403N0906j903
7149A7428J8711L6458m8866n3982j3621m1502L0520l824m145L2542K4649L4532
7137B8900J8723l2718j10j9509j9794Q883K5123M3115n6767j4220l0331J4563
7125c4142N1065K2628j6825L2204J2912o2699j0798j0403m009J8692j8537j4060
$$ plain form
7113 -33972 -46124 -87 50654 47603 38040 19082 -17027 -36495 -28082 -40977 -61317 -57024 -20604
7100 -20604 -33460 -62284 -98064 -122028 -110818 -61728 4160 55584 46886 -2180 -10537 14177
7088 14177 -57011 -59649 -31961 371 -19159 -49952 -36741 -12109 -2268 28874 17705 2492
7076 2492 62474 48912 23464 73732 52914 -16670 -9088 -43347 -115277 -122252 -133921 -115614
7064 -115614 -59185 -65485 -96006 -82436 -28593 -50390 -33764 -38185 -54108 -4981 40120 34657
7052 34657 39464 -3505 11817 39444 48179 12652 37445 51490 43147 16395 -8966 -32662
7040 -32662 -41789 1514 12874 -40975 -100075 -102911 -59401 -40326 8896 32670 17105 7427
7028 7427 -47736 -75759 -72625 -70936 -40285 -60974 -115615 -111355 -91969 -64077 -53186 -73289 -19603
$$ packed form
7113c3972j2152M6037N0741l051r563j8958l6109j9468Q413j2895k0340M293L6420
7100b0604j2856k8824l5780k3964J1210M9090O5888N1424q698m9066q357K4714
7088A4177p1188k638K7688L2332j9530l0793J3211K4632R841L1142j1169j5213
7076B492N9982j3562k5448N0268k0818o9584P582l4259p1930o975j1669J8307
7064a15614N6429o300l0521J3570N3843k1797J6626m421j5923M9127M5101n463
7052C4657M807m2969J5322K7627Q735l5527K4793J4045q343k6752k5361k3696
7040c2662r127M3303J1360n3849n9100k836M3510J9075M9222K3774j5565r678
7028G427n5163k8023L134J689L0651k0689n4641M260J9386K7892J0891k0103N3686
$$ plain form
7015 -19603 -2397 9104 440 -9436 -9727 -203 13863 -75716 -111088 -77668 -104217 -81067 -43446
7002 -43446 -21064 26052 31045 31813 49057 -37570 -104299 -116125 -55409 23946 524 -31507
6990 -31507 -10599 30058 48189 -23080 5738 3012 -15230 31744 59791 37964 43048 44391
6978 44391 53376 70469 78534 64796 61159 43114 45881 55303 23122 39869 -11981 -75145 -73001
6965 -73001 -109242 -78551 -10341 31213 -20669 -55727 -57337 -37628 -9620 -13178 -1492 2880
6953 2880 48912 49597 42216 40577 65446 87768 126797 84173 56016 14386 43287 89823 81809
6940 81809 76570 57739 25966 658 -15439 -9339 -42373 -50730 -68634 -36288 -15566 -8827 -11782
6927 -11782 45476 53014 31472 -18387 -50991 -56931 -33610 -3694 -25273 -19385 -58052 -23099
$$ packed form
7015a9603J7206J1501q664r876k91R524J4066q9579l5372L3420k6549K3150L7621
7002d3446K2382M7116M993P68J7244q6627o6729j1826O0716P9355k3422l2031
6990c1507K0908M0657J8131p1269K8818k726j8242M6974K8047k1827N084J343
6978D4391Q985J7093Q065j3738l637j8045K767R422l2181J6747n1850o3164K144
6965g3001l6241L0691O8210M1554n1882l5058j610J9709K8008l558J1686M372
6953B880M6032O85p381j639K4869K2322L9029m2624k8157m1630K8901M6536q014
6940H1809n239j8831l1773k5308j6097O100l3034q357j7904L2346K0722O739k955
6927a1782N7258P538k1542m9859l2604n940K3321K9916k1579N888l8667L4953
$$ plain form
6915 -23099 22598 13499 24171 -4716 -56649 -51175 -52105 -59443 8984 78770 75615 28123 -12049
6902 -12049 2479 20146 41327 28918 66239 64912 85799 38134 -13679 -34938 -34269 -56168
6890 -56168 -56662 -33443 -22815 -5992 13875 -69007 -62169 -1471 395 -24850 -36956 32459 17056
6877 17056 -51083 -102980 -100811 -52427 -14214 3014 11808 37200 41316 43747 63229 71514 91838
6864 91838 39253 -12121 43798 54182 9893 -3967 -39610 -26182 -21624 -5103 -9082 -32778
6852 -32778 46305 79664 20130 -49644 -46279 15435 18490 -18253 -56177 -20276 -25533 972
6840 972 -17134 -47078 -50356 -63107 -53135 -67701 -102536 -50827 7575 61221 37558 14047 39637
6827 39637 -10729 -6802 18578 49626 43728 32609 6565 -74301 -119389 -95902 -32175 -43580
$$ packed form
6915b3099M5697r099J0672k8887n1933N474r30p338O8427O9786l155m7492m0172
6902a2049J4528J7667K1181j2409L7321j327K0887m7665n1813k1259O69k1899
6890e6168m94K3219J0628J6823J9867q2882O838O0698J866k5245j2106O9415j5403
6877A7056o8139n1897K169M8384L8213J7228Q794K5392M116K431J9482Q285K0324
6864I1838n2585n1374N5919J0384m4289j3860l5643J3428M558J6521l979k3696
6852c2778P9083L3359n9534o9774L365O1714L055l6743l7924L5901n257K6505
6840I72j8106k9944l278j2751R972j4566l4835N1709N8402N3646k3663k3511K5590
6827C9637n0366L927K5380L1048n898j1119k6044q0866m5088K3487O3727j1405
$$ plain form
6815 -43580 -18895 32497 1341 -82355 -25994 54829 76204 27330 -11692 -27945 8116 57343
6803 57343 11652 -42599 -77617 -61551 -34988 -22685 -68143 -76776 -153367 -123771 -65148 -42848
6791 -42848 -5252 -27219 -50790 -48093 -28407 -61152 -46427 53857 63652 1482 -23023 -25231
6779 -25231 -1113 -19918 -38978 -36032 -24736 -63317 -11806 -46455 -105590 -87840 -49867 4319
6767 4319 1460 -75326 -54322 -29128 1476 -7810 -18344 -6154 -16079 -3401 -36023 -48507 -62087
6754 -62087 -100281 -61833 724 -1656 22870 40998 42117 59034 20116 -16474 -7010 29920
6742 29920 54023 60500 22863 9858 46786 58688 61616 96568 23946 -28274 -14385 -19553
$$ packed form
6815d3580K4685N1392l1156q3696N6361Q0823K1375m8874l9022j6253L6061M9227
6803E7343m5691n4251l5018J6066K6563J2303m5458q633p6591K9596N8623K2300
6791d2848L7596k1967k3571K697J9686l2745J4725J00284R795o2170k4505k208
6779b5231K4118j8805j9060K946J1296l8581N1511l4649n9135J7750L7973N4186
6767D319k859p6786K1004K5194L0604r286j0534J2190r925J2678l2622j2484j3580
6754f2087l8194L8448O2557k380K4526J8128J119J6917l8918l6590R464L6930
6742B9920K4103O477l7637j3005L6928J1902K928L4952p2622n2220J3889n168
$$ [...]
##END NTUPLES=NMR SPECTRUM
##END=
