##TITLE=Analysis number 329222
Compound Code cc 64804
Book Reference 511/180
Project Code adrs
Chemist Name stevem
##JCAMPDX= 6.0         $$ Bruker NMR JCAMP-DX V2.0
##DATA TYPE= NMR SPECTRUM
##DATA CLASS= NTUPLES
##ORIGIN= Bruker BioSpin GmbH
##OWNER= nmr
$$ XWIN-NMR		Version 3.5
$$ Mon Aug 13 11:26:10 2007 GMT Daylight Time (UT+1h)  MAYBRIDGE\nmr@NMR_250MHZ
##.OBSERVE FREQUENCY= 250.131544655141
##.OBSERVE NUCLEUS= ^1H
##.ACQUISITION MODE= SIMULTANEOUS (DQD)
##.ACQUISITION SCHEME= undefined
##.AVERAGES= 16
##.DIGITISER RES= 18
##SPECTROMETER/DATA SYSTEM= dpx250
##.PULSE SEQUENCE= zg30
##.SOLVENT NAME= CDCl3
##.SHIFT REFERENCE= (INTERNAL, CDCl3, 0, 16.522)
##AUDIT TRAIL= $$ (NUMBER, WHEN, WHO, WHERE, WHAT)
$$ ##TITLE= Audit trail, XWIN-NMR		Version 3.5
$$ ##JCAMPDX= 5.01
$$ ##ORIGIN= Bruker BioSpin GmbH
$$ ##OWNER= nmr
$$ C:\u/data/dgb/nmr/ADRS/490/pdata/1/auditp.txt
$$ ##AUDIT TRAIL=  $$ (NUMBER, WHEN, WHO, WHERE, WHAT)
(   1,<2007-08-13 11:25:49.09 +100>,<MAYBRIDGE\nmr>,<NMR_250MHZ>,
      <created by zg, POWCHK disabled, PULCHK disabled
       configuration hash MD5:
       76 6E 9A 78 1E 09 19 81 EC 84 63 8F B0 6A 59 2D
       data hash MD5: 64K
       15 A6 BA D7 52 D4 7A 80 59 92 BE 33 84 BB CA 22>)
(   2,<2007-08-13 11:26:00.48 +100>,<MAYBRIDGE\nmr>,<NMR_250MHZ>,
      <Start of raw data processing
       ef LB = 0.3 FT_mod = 6 PKNL = 1 SI = 32K 
       data hash MD5: 32K
       8C FC 4E 31 1D D5 FC 73 50 A3 C9 45 E5 DC FA E5>)
(   3,<2007-08-13 11:26:02.09 +100>,<MAYBRIDGE\nmr>,<NMR_250MHZ>,
      <apk 
       data hash MD5: 32K
       FC E9 98 ED 63 A6 6A DA BC 9B 83 04 E6 BA 18 5C>)
(   4,<2007-08-13 11:26:02.78 +100>,<MAYBRIDGE\nmr>,<NMR_250MHZ>,
      <abs ABSG = 5 
       data hash MD5: 32K
       64 3E 29 9C 6F 58 74 CB 92 94 AF 14 11 CC 89 CC>)
$$ ##END=
$$ 
$$ hash MD5
$$ 90 FD A3 C8 CB 4D AA 80 76 9C 53 AE 8E 53 A2 11
##$RELAX= 
##$RELAX= 
##$RELAX= 
##$RELAX= 
##$RELAX= 
##$RELAX= 
##$RELAX= 
$$ Bruker specific parameters
$$ --------------------------
##$DU= <C:\u>
##$EXPNO= 490
##$NAME= <ADRS>
##$PROCNO= 1
##$TYPE= <nmr>
##$USER= <dgb>
##$AMP= (0..31)
100 100 100 100 100 100 100 100 100 100 100 100 100 100 100 100 100 100 
100 100 100 100 100 100 100 100 100 100 100 100 100 100 
##$AQSEQ= 0
##$AQ_mod= 3
##$AUNM= <au_zg>
##$AUTOPOS= <15 >
##$BF1= 250.13
##$BF2= 250.13
##$BF3= 250.13
##$BF4= 250.13
##$BF5= 500.13
##$BF6= 500.13
##$BF7= 500.13
##$BF8= 500.13
##$BYTORDA= 1
##$CFDGTYP= 0
##$CFRGTYP= 5
##$CHEMSTR= <none>
##$CNST= (0..31)
1 1 145 1 1 1 1 1 1 1 1 1 1 1 1 1 1 1 1 1 1 1 1 1 1 1 1 1 1 1 1 1 
##$CPDPRG= <>
##$CPDPRG1= <>
##$CPDPRG2= <>
##$CPDPRG3= <>
##$CPDPRG4= <mlev>
##$CPDPRG5= <mlev>
##$CPDPRG6= <mlev>
##$CPDPRG7= <mlev>
##$CPDPRG8= <mlev>
##$CPDPRGB= <>
##$CPDPRGT= <>
##$D= (0..31)
0 1 0 0 0 0 0 0 0 0.06 0 0 0 0 0 0 0.0002 0 0 0 0 0 0 0 0 0 0 0 0 0 0 
0 
##$DATE= 1187000747
##$DBL= (0..7)
120 120 120 120 120 120 120 120 
##$DBP= (0..7)
150 150 150 150 150 150 150 150 
##$DBP07= 0
##$DBPNAM0= <>
##$DBPNAM1= <>
$$ [...]
##$SUBNAM7= <"">
##$SUBNAM8= <"">
##$SUBNAM9= <"">
##$SW= 20.6930455092707
##$SWIBOX= (0..15)
0 0 3 0 0 0 0 0 0 0 0 0 0 0 0 0 
##$SW_h= 5175.983436853
##$TD= 65536
##$TD0= 1
##$TE= 296.16
##$TE2= 300
##$TE3= 300
##$TEG= 300
##$TL= (0..7)
0 120 120 120 120 120 120 120 
##$TP= (0..7)
150 150 150 150 150 150 150 150 
##$TP07= 0
##$TPNAME0= <>
##$TPNAME1= <>
##$TPNAME2= <>
##$TPNAME3= <>
##$TPNAME4= <>
##$TPNAME5= <>
##$TPNAME6= <>
##$TPNAME7= <>
##$TPOAL= (0..7)
0.5 0.5 0.5 0.5 0.5 0.5 0.5 0.5 
##$TPOFFS= (0..7)
0 0 0 0 0 0 0 0 
##$TUNHIN= 0
##$TUNHOUT= 0
##$TUNXOUT= 0
##$USERA1= <user>
##$USERA2= <user>
##$USERA3= <user>
##$USERA4= <user>
##$USERA5= <user>
##$V9= 5
##$VALIST= <valist>
##$VCLIST= <CCCCCCCCCCCCCCC>
##$VD= 0
##$VDLIST= <DDDDDDDDDDDDDDD>
##$VPLIST= <PPPPPPPPPPPPPPP>
##$VTLIST= <TTTTTTTTTTTTTTT>
##$WBST= 1024
##$WBSW= 4
##$XGAIN= (0..3)
0 0 0 0 
##$XL= 0
##$YL= 0
##$YMAX_a= 540509
##$YMIN_a= -387384
##$ZGOPTNS= <>
##$ZL1= 120
##$ZL2= 120
##$ZL3= 120
##$ZL4= 120
##$ABSF1= 16.522
##$ABSF2= -4.171173
##$ABSG= 5
##$ABSL= 3
##$ALPHA= 0
##$AQORDER= 0
##$ASSFAC= 0
##$ASSFACI= 0
##$ASSFACX= 0
##$ASSWID= 0
##$AUNMP= <proc_1d>
##$AZFE= 0.1
##$AZFW= 0.1
##$BCFW= 0
##$BC_mod= 0
##$BYTORDP= 0
##$COROFFS= 0
##$CY= 12.5
##$DATMOD= 1
##$DC= 0
##$DFILT= <>
##$DTYPP= 0
##$F1P= 14.0000005364418
##$F2P= -0.99999901652339
##$FCOR= 0.5
##$FTSIZE= 32768
##$FT_mod= 6
##$GAMMA= 0
##$GB= 0
##$INTBC= 1
##$INTSCL= 1
##$ISEN= 128
##$LB= 0.3
##$LEV0= 0
##$LPBIN= 0
##$MAXI= 10000
##$MC2= 0
##$MEAN= 0
##$ME_mod= 0
##$MI= 0
##$NCOEF= 0
##$NC_proc= -3
##$NLEV= 6
##$NOISF1= 0
##$NOISF2= 0
##$NSP= 0
##$NTH_PI= 0
##$NZP= 0
##$OFFSET= 16.522
##$PC= 1
##$PHC0= -44.94564
##$PHC1= 6.181511
##$PH_mod= 1
##$PKNL= yes
##$PPARMOD= 0
##$PSCAL= 4
##$PSIGN= 0
##$REVERSE= no
##$SF= 250.13
##$SI= 32768
##$SIGF1= 0
##$SIGF2= 0
##$SINO= 400
##$SIOLD= 32768
##$SREGLST= <1H.CDCl3>
##$SSB= 0
##$STSI= 32768
##$STSR= 0
##$SW_p= 5175.98343685301
##$SYMM= 0
##$S_DEV= 0
##$TDeff= 65536
##$TDoff= 0
##$TI= <Analysis number 999999
Compound Code 99
Book Reference 9
Project Code 9>
##$TILT= no
##$TM1= 0
##$TM2= 0
##$TOPLEV= 0
##$USERP1= <user>
##$USERP2= <user>
##$USERP3= <user>
##$USERP4= <user>
##$USERP5= <user>
##$WDW= 1
##$XDIM= 32768
##$YMAX_p= 470173614
##$YMIN_p= -89815
$$ End of Bruker specific parameters
$$ ---------------------------------
##NTUPLES= NMR SPECTRUM
##VAR_NAME=  FREQUENCY,     SPECTRUM/REAL,   SPECTRUM/IMAG
##SYMBOL=    X,             R,               I
##VAR_TYPE=  INDEPENDENT,   DEPENDENT,       DEPENDENT
##VAR_FORM=  AFFN,          ASDF,            ASDF
##VAR_DIM=   32768,         32768,           32768
##UNITS=     HZ,            ARBITRARY UNITS, ARBITRARY UNITS
##FACTOR=    0.157963299565203, 1,           1
##FIRST=     4132.6476996994, 0,             0
##LAST=      -1043.33573715361, 0,           0
##MIN=       -1043.33573715361, -89815,      0
##MAX=       4132.6476996994, 470173614,     0
$$ Real data points
##PAGE= N=1
##DATA TABLE= (X++(R..R)), XYDATA
$$ [...]
18507A34966J9593J507k8402j0769K2072r888k5135J5792P516j1787j2572Q540
18495A11433J6566J1414K2623K4634m746L8962M3862J5124l851j2172J3744L1559
18483C09152N2212L7192K441k9459m5307n6908j9421L7394K2463j4064l8914l3069
18471B23712j5782q635k9288l6977k218j7086n895K790J1713q217J0594j4239
18459A10472p828K9743m161j1542K97j6300J2846j0311R242j1810K598P059K0291
18446A30596Q93J0937n799L0846K9558O948J7758l23J9743P14q497J4628L6508
18433B84510K743J4750J500r737j5188K2281j2714j698o797J1363J1046j0086
18421B91973j3642P5J694R795R601J4173n259k3392k3486Q223L3270L223r067
$$ plain form
18507 134966 154559 156066 127664 116895 138967 129079 103944 119736 127252 115465 102893 111433
18495 111433 127999 139413 162036 186670 181924 220886 264748 279872 276021 263849 277593 309152
18483 309152 361364 398556 400997 371538 326231 269323 249902 287296 309759 295695 256781 223712
18471 223712 207930 199295 170007 133030 130812 113726 107831 110621 122334 114117 124711 110472
18459 110472 102644 132387 128226 116684 116981 100681 113527 103216 112458 100648 103246 110305 130596
18446 130596 131489 142426 136627 167473 197031 203979 221737 221414 241157 241871 233374 248002 284510
18433 284510 287253 302003 303503 293766 278578 300859 288145 286447 279650 291013 302059 291973
18421 291973 278331 278406 280100 289895 299496 313669 308410 285018 261532 269755 303025 306248 297181
18408B97181J1660J3399K4130M5476k859j907K586K6686J7468L1048K7281N1763
18396E43912L9363M3400P8130P9614R7691Q7402P5703M9430L2522P684j1288K936
18384A126499L9065M8211O9559J14010J55779K09907K06897J98415L06607M78497
18374B953446Q18433J380632J990722J470722l84556j350214j058790m68189K4456
18365E376662M71788R51456J594005K684046M688862P903248J0426724P291340
18357D1388131J407534p68996J598701J617556l717455n118451l355724n065198
18349B7986098o619064n143073k818859r92614N89258K328494M156115L857150
18341B3343505o98143m679362m764186l226096j941088j150562o54115l01260
$$ plain form
18408 297181 308841 322240 346370 391846 388987 387080 389666 416352 433820 464868 492149 543912
18396 543912 583275 626675 704805 784419 882110 969512 1045215 1094645 1127167 1134851 1123563 1126499
18384 1126499 1165564 1213775 1283334 1397344 1553123 1763030 1969927 2168342 2474949 2953446
18374 2953446 3771879 5152511 7143233 8613955 8229399 6879185 5820395 5352206 5376662
18365 5376662 5848450 6799906 8393911 11077957 15766819 23670067 34096791 41388131
18357 41388131 42795665 42026669 43625370 45242926 41525471 36407020 33051296 27986098
18349 27986098 21367034 16223961 13405102 12412488 13001746 15330240 19486355 23343505
18341 23343505 22645362 17966000 13201814 9975718 8034630 6884068 6229953 5928693
18333E928693j34076k6671R5435L37173P20393J405089K192529J808602j92963
18324A2134204j346010r22475j32511O19220J360459K445461M139731O234052
18316B4532131O601747L313860J283781M458779J1567231J8004689J5550493P151541
18308I2464252k38225n047772m922328j371673L333943j222921q942175o586917
18300F7466184P39949M360784N45127o682113j2345638j3837072j1035030p261388
18292B1950803m458376k714418j424938k73338R64416J660733M0812k431375k933580
18283A0380739k078988j224961o67090l21505r0620P7252K16916K86607L21267
18274F899617M74203Q02445J375252K183511L444624N526572P923516O596674
$$ plain form
18333 5928693 5794617 5767946 5863381 6200554 6920947 8326036 10518565 12327167 12134204
18324 12134204 10788194 9865719 9733208 10352428 11712887 14158348 18298079 24532131
18316 24532131 31133878 34447738 35731519 40190298 51757529 69762218 85312711 92464252
18308 92464252 92226027 87178255 82255927 80884254 84218197 82995276 74053101 67466184
18300 67466184 68206133 72566917 73112044 66429931 54084293 40247221 29212191 21950803
18292 21950803 17492427 14778009 13353071 13079733 14044149 15704882 15745694 13314319 10380739
18283 10380739 8301751 7076790 6409700 6088195 5997575 6074827 6291743 6578350 6899617
18274 6899617 7373820 8176265 9551517 11735028 15179652 20706224 28629740 35226414
18266C5226414l40436n302683m650404j460978K236451O347137Q353095N154148
18258D5562744L832038R190621J3331784Q793968M044905j70754j0611800j9029469
18250E4944037j7362052j1592565p140159m490639k957515j976481j297900p57801
18242G368925k54643K86829J080832K092950K135618l29187k584075k631694j776880
18233E388675j089840p01832n13319l71835k12114j43999j47586j69989j31157
18224A907004p5992j089m526O319o3167j27031j22703r7583m8833n1921n3102
18213A267376q7739o7897n6621J3253P6522O0403n174j06280j21117r2481n7025
18202H23220l8145K50J1167L0418J0971k9054J2692M5483Q853r283o185L1147
$$ plain form
18266 35226414 34885978 29583295 24932891 23471913 25708364 32055501 40408596 45562744
18258 45562744 49394782 58585403 71917187 80711155 84756060 84585306 73973506 54944037
18250 54944037 37581985 25989420 18849261 14358622 11401107 9424626 8126726 7368925
18242 7368925 7114282 7401111 8481943 10574893 12710511 12381324 9797249 7165555 5388675
18233 5388675 4298835 3597003 3083684 2711849 2499735 2355736 2208150 2038161 1907004
18224 1907004 1831012 1829923 1825397 1831716 1768549 1641518 1518815 1421232 1372399 1320478 1267376
18213 1267376 1179637 1111740 1055119 1068372 1144894 1205297 1200123 1093843 972726 880245 823220
18202 823220 785075 785325 796492 826910 837881 808827 821519 867002 875855 866572 860387 891534
18190H91534M1124l7313r2067o1992n710j460j4722l7528l2517m0874l4309l4665
18178E39501l8724m405M981k387j2895j2910j5558K0339K2961M478l3038k9159
18166D43184k14J9864L5205K9070L9305k503k9536j6282l3226l7850k3287K3395
18154D47125K9097L6536N9049M7595K0474j4711k0898K5763J5048K5997J7656
18143F88731N2350J7952P918m61k4548n9877K482K936K4284R772K5342J5995M968
18130G67844K4467J1655k2404m961L6954N4101M2677M5301P2086J02226J53053
18119A282999K32053K89041L37195M08686N98026R11606J353285K181796L757950
18110A1352637P160241J4082101K0603234N588013j5570149j7203405j0312145
$$ plain form
18190 891534 932658 895345 803278 741286 735576 734116 719394 681866 649349 608475 574166 539501
18178 539501 500777 496372 501353 498966 486071 473161 457603 477942 500903 505381 472343 443184
18166 443184 442970 462834 498039 527109 566414 563911 534375 518093 484867 447017 423730 447125
18154 447125 476222 512758 571807 619402 639876 625165 604267 630030 645078 671075 688731
18143 688731 741081 759033 766951 766490 741942 682065 684547 687483 711767 721539 746881 762876 767844
18130 767844 792311 803966 781562 776601 813555 867656 910333 955634 1027720 1129946 1282999
18119 1282999 1515052 1804093 2141288 2549974 3148000 4059606 5412891 7594687 11352637
18110 11352637 18512878 32594979 53198213 58786226 43216077 26012672 15700527
18103A5700527n516139l099970j845592j180983p93466n65586l57625k18745j83203
18094A939218j63482j36421j19469q0258l871M758J1480o2947m6328j8125Q724
18083A333279N4780J00497J10880O1842M7996m385j0609K0002Q1203J90610K57289
18072B243384K50845L06578M67042O63515R43215J396859K248196L861088O060410
18063A8441132O226011J346099k764993k089149J148756N582220J0667849J0417602
18055D8975527r48232j0168494r402126m749618k53661L522729L458673k710727
18047B7724071p064018o282992m014289k486712j631991j095687p10535m49972
18039C987875k78378j60795q3917q0622m5307p425l4463n935O6138P3268K5096
$$ plain form
18103 15700527 10184388 7084418 5238826 4057843 3264377 2698791 2341166 2122421 1939218
18094 1939218 1775736 1639315 1519846 1439588 1435717 1440475 1451955 1389008 1342680 1324555 1333279
18083 1333279 1388059 1488556 1599436 1661278 1709274 1704889 1694280 1714282 1795485 1986095 2243384
18072 2243384 2494229 2800807 3267849 3931364 4874579 6271438 8519634 12380722 18441132
18063 18441132 24667143 26013242 23248249 21159100 22307856 27890076 38557925 48975527
18055 48975527 48027295 37858801 28456675 23707057 23453396 26976125 30434798 27724071
18047 27724071 20660053 14377061 10362772 7876060 6244069 5148382 4437847 3987875
18039 3987875 3709497 3548702 3464785 3384163 3338856 3331431 3296968 3291033 3357171 3430439 3455535
18028C455535O3790J92357L99955O74278J015259J502139K409868M029007N291690
18019A9033878K729295j573600k347545k94821K457840N546826Q925556J0376945
18011D4854374R229181O829550M453977M42474m077013q976260j2763157j1489559
18003B8503567p502146m058099j559311N54598K391134K013936j695983m344237
17995A4303459l997307k646265j619644j050840p53134n11663l35799k47920k05044
17986B935843j32039m5999j9658n1071p9419r0089n7180k9315K3358Q8218K11609
17975B754258L74641N36887P85920J365087K383195L812085L463451n6369k194331
17966A3224824j300241R11612L665286O366112M598383k581863o177770m681781
$$ plain form
18028 3455535 3519325 3711682 4111637 4785915 5801174 7303313 9713181 13742188 19033878
18019 19033878 21763173 20189573 17842028 17547207 20005047 25551873 34477429 44854374
18011 44854374 54083555 60913105 65367082 65809556 61732543 52756283 39993126 28503567
18003 28503567 21001421 16943322 15384011 15938609 18329743 20343679 18647696 14303459
17995 14303459 10306152 7659887 6040243 4989403 4236269 3724606 3388807 3140887 2935843
17986 2935843 2803804 2757805 2738147 2687076 2607657 2517568 2460388 2431073 2454431 2542649 2754258
17975 2754258 3128899 3665786 4451706 5816793 8199988 12012073 15475524 15419155 13224824
17966 13224824 11924583 12836195 16501481 22867593 27465976 24884113 18706343 14024562
17958A4024562k021871L41501J967542P89189k510178l655531k767578j705459
17950D462177j048239p01342n02116l68538k45320j58732j02157o7723r8491r8474
17940A071045q0683o3822l2201q235j9088m2717q2347n6618l4155j9923j4664
17929F16592m0418l7501k6226j8494m4115m4179j9605m497r699N40p665m4256
17917C20477l0649k634K4376K3064l5161n856k9378j483J7776L275n535P044K1092
17904C06408K0404J7297K0814L360j0927r74j0261l166L560K0497R019J858o989
17891C70900K224k4904l2377n0202l9073n03N0069J1513q777j3287j9184N649
17879B52048J3307l1061j7593J91r86p659P571O997P584m693p813L0126J3253
$$ plain form
17958 14024562 12002691 12344192 14311734 15100923 12590745 8935214 6167636 4462177
17950 4462177 3413938 2712596 2210480 1841942 1596622 1437890 1335733 1268010 1169519 1071045
17940 1071045 990362 926540 894339 886104 867016 824299 741952 685334 651179 631256 616592
17929 616592 576174 538673 512447 493953 449838 405659 386054 381557 371858 372398 364733 320477
17917 320477 289828 287194 311570 334634 299473 293617 264239 262756 280532 283807 278272 285316 306408
17904 306408 326812 344109 364923 368283 357356 356382 346121 342955 346515 367012 376031 377889 370900
17891 370900 373124 348220 315843 265641 226568 226065 276134 287647 278870 265583 246399 252048
17879 252048 265355 234294 216701 216892 215906 208247 215818 222815 230399 225706 217893 248019 261272
17866B61272Q724r586L258j2515m0047k8247J686L1235J8758j5385N300p720k858
17853B13875j874r374M681n047L4553N5099Q5218L8080r46n3565m2810k304J4752
17840C30338J8768L5090L0881J4295n641k2820l5760l0530k2921j0857j3853j1554
17828B75436J0629m752P925K3167N0198M4986L4235K6307k0447k6633n6349k1054
17816C43648O564j2290j8808J492k0166j3757k3808k2495N815J4410j28J7004
17804B77481L0279M4106N1974P1631J6566o788r947j6127j2046J2567M0183Q3256
17792E83135P9033L8469j3804o2336q3334q3272m2815l3666M714K9667N0173R0409
17780E56373J07291N2368j8337k7744l3365j7115j4352m6311l8226q939k0789
$$ plain form
17866 261272 269996 260410 263668 251153 211106 182859 184545 215780 234538 219153 224453 216733 213875
17853 213875 212001 202627 207308 202261 236814 291913 377131 415211 414265 360700 317890 315586 330338
17840 330338 349106 384196 415077 429372 423731 400911 365151 334621 311700 300843 286990 275436
17828 275436 286065 281313 289238 312405 362603 407589 441824 468131 447684 421051 364702 343648
17816 343648 350212 337922 319114 320606 300440 286683 262875 240380 246195 260605 260477 277481
17804 277481 307760 351866 403840 475471 492037 485249 475302 459175 447129 459696 499879 583135
17792 583135 662168 700637 686833 624497 541163 457891 415076 381410 386124 415791 465964 556373
17780 556373 663664 716032 697695 669951 636586 619471 605119 558808 520582 511643 490854
17769D90854o120J2283O990J9563O557L141o561k0427J93P13k1408J8144K5013
17756E28935L0965L8514N8960K9719K833K9398L5034N1360J7799L8699P3649M5208
17744I81073j5525k1002k809k1524q064K9998O1852N9354R8062J33532J26988
17733A421935P2058M6092R0365O3453P9613J62179K09089K52975L01868L09300
17723C008927K64472K44077L31295M90590P06131R80065J446267K348168L839673
17714A3659665N172290L892424L58743k566385k900263j295401P83129L128284
17706B0232486O214398R719288J1504800J3908324J9556386J2803394p969902
17699H5969174j6322286r492768J753129J4771966K7549386K2737737m186680
$$ plain form
17769 490854 484734 497017 504007 523570 530127 533268 526707 506280 506473 507186 485778 503922 528935
17756 528935 559900 598414 657374 687093 689926 719324 754358 805718 823517 862216 935865 981073
17744 981073 965548 944546 941737 920213 912149 942147 1003999 1063353 1161415 1294947 1421935
17733 1421935 1493993 1540085 1630450 1693903 1773516 1935695 2144784 2397759 2699627 3008927
17723 3008927 3273399 3517476 3848771 4339361 5045492 6025557 7471824 9819992 13659665
17714 13659665 18831955 22724379 23083122 20516737 17616474 16321073 17104202 20232486
17706 20232486 26446884 36166172 47670972 61579296 81135682 93939076 85969174
17699 85969174 69646888 60154120 61907249 76679215 104228601 126966338 122779658
17692A22779658k0808331j6180676q605606r220444j3481567j3699708r986493
17685C0796833n904587k714789j17704K436897M536354L491002k110260o243760
17677B4169986o050828m214997k670851j626192r49934n51083l58498k88460k17548
17668G241595j13714M9361K84206M85974P54652J209299J962680L298420N487382
17659B0659855P565023N773638J141823N60942M896612R066911N149815m384298
17651E0430321p935004m525892J479499R302857J9164134K0664358L805683p365236
17643H5020720o183880l236530K546029Q681086L445054j3811030k1229988j5886684
17635C9344777q658063m507924m202007m723329l931577k667304j719302j103733
$$ plain form
17692 122779658 101971327 85790651 77185045 67964601 54483034 40783326 30796833
17685 30796833 24892246 22177457 22059753 24496650 29033004 32524006 30413746 24169986
17677 24169986 18119158 13904161 11233310 9607118 8657184 8106101 7747603 7459143 7241595
17668 7241595 7127881 7177242 7461448 7947422 8702074 9911373 11874053 15172473 20659855
17659 20659855 28224878 33998516 35140339 35701281 40597893 49664804 54814619 50430321
17651 50430321 42495317 37969425 39448924 48751781 67915915 88580273 92385956 85020720
17643 85020720 78836840 75600310 78146339 86827425 90272479 76461449 55231461 39344777
17635 39344777 30686714 26178790 21976783 17253454 13321877 10654573 8935271 7831538
17627G831538p39381n00317l15518P6772P06218J304405J077823n35311j815770
17618G090459j726423j131389p23873n43732m45914l50601k67628j86626j33961
17609A580312j41722j01638o9656m7931n3200o3382o4272n8100k2743l5951m2501
17598H79216n7739n3908o5482l0705j8353j8926k5289p497k9639k7058j6863o582
17586E21175k3853l2753q116j1405J5037o344j8758k5937r791q247k3414j5053
17574C52541P343O832p564K4185j8163k8444J4032J418q572j779L2427j2720l1290
17561C30246n519j1792m535n635J5280J1299j7605j1555n065k424l568L461L8581
17548C31169K6855k457m026q703L2454L7493J9266P675n6566n0412j2157k877
$$ plain form
17627 7831538 7092157 6591840 6276322 6353094 7059312 8363717 9441540 8906229 7090459
17618 7090459 5364036 4232647 3508774 2965042 2519128 2168527 1900899 1714273 1580312
17609 1580312 1438590 1336952 1267296 1219365 1166165 1102783 1038511 980411 957668 921717 879216
17598 879216 821477 767569 702087 671382 653029 634103 608814 601317 571678 544620 527757 521175
17586 521175 497322 464569 456453 445048 460085 453741 434983 409046 399255 391008 367594 352541
17574 352541 359884 366716 359152 383337 365174 336730 350762 352180 343608 341829 374256 361536 330246
17561 330246 324727 312935 308400 302765 318045 329344 311739 300184 295119 292695 289127 292588 331169
17548 331169 358024 355567 351541 342838 375292 412785 432051 439726 383160 332748 320591 317714
17536C17714j7627L1523L246j3137j1368k6060k3275j4517k2510k9556j5154L0776
17524B10055M3094m200l1720k4692j1314L9734J0693j2115P874p016k3158J8202
17512B15437J5034K7863k5038l4628N876J3262Q259K01N0125L4501J6676K3792
17500C51360q711O295L6206J4078M0918N9705r70o8809q9905n0456o647K0166
17488C03230P621l3194l1469k3110k5328k774k5949k0090m39j5928J817N359j3855
17475A25891o031j003k6942j0001k1153N754J0694L25j3340R740J1946J2304J5104
17462A13288K7569j1283j7126j655J3699M819J4947K0906p565j4049L580K5226
17450A72356j39K0709K0121J5226j9661j3392J1313O9015J37293J10894m8865
$$ plain form
17536 317714 300087 331610 334856 321719 310351 284291 261016 246499 223989 194433 179279 210055
17524 210055 253149 248949 217229 192537 181223 220957 231650 219535 227409 220393 197235 215437
17512 215437 230471 258334 233296 198668 204544 217806 226065 226266 276391 310892 327568 351360
17500 351360 342649 348944 385150 399228 440146 499851 498881 430072 340167 289711 283064 303230
17488 303230 310851 277657 246188 223078 197750 194976 169027 148937 148498 132570 134387 139746 125891
17475 125891 119860 118857 91915 81914 60761 66515 77209 77534 64194 73934 85880 98184 113288
17462 113288 140857 129574 112448 110793 124492 129311 144258 165164 157599 143550 147130 172356
17450 172356 172217 192926 213047 228273 208612 195220 206533 275548 412841 523735 474870
17439D74870j42403j39758m7739j6671r566r54j0684l5610j3821J3651J3175J5863
17427A00353k04j0309j0206k5985n567K955k649K2849J9902j0664k259j4885r573
17414E3758k275k2356j1024J4331L7559R153Q286r234k3480k78K2022K6524j2333
17401I0653m1482j7223K57J7088K3038n381j7076j518m629m404o709p985M38j9827
17387E240J7360N196J8868L293q557j2275K2980J8275K1464O510l0431k0256J0563
17374E8230K3754N367n988J254l814O725P698j0261R0n184j7823J5370P623j769
17360H1272l103O818J1501p714p625j9756j2948m79K205l695P822o13R177j1416
17346E1446j3898J4311n676j4810o649K5867J5283k2202j5463n561J376J4283
$$ plain form
17439 474870 332467 192709 144970 128299 118733 117779 107095 71485 57664 71315 84490 100353
17427 100353 100149 89840 79634 53649 48082 51037 48388 71237 91139 80475 78216 63331 53758
17414 53758 51483 29127 18103 32434 69993 79146 87432 78198 54718 54440 76462 102986 90653
17401 90653 49171 31948 32205 49293 72331 66950 49874 48356 43727 39323 32614 24629 25067 5240
17387 5240 22600 27796 46664 49957 41400 29125 52105 70380 91844 98354 67923 47667 58230
17374 58230 81984 87351 81363 82617 78803 85528 93226 82965 83055 77871 60048 75418 83041 81272
17360 81272 78169 84987 96488 88774 81149 61393 48445 47966 50171 46476 54298 53685 62862 51446
17346 51446 37548 51859 46183 31373 24724 50591 65874 43672 28209 22648 24024 38307
17334C8307J3279n704j955J1154J3665m350K886j6313j6553n975P742P494J9819
17321F3496l305J5583J8186J3970j6652k6528m363P00j695O125J7723P656J513
17308I2409j2082m4580l3116P597K1281o224M664J9197j4684j7798k981J6973
17296C0656O14M290J3792J0343q845j0868J3559P373k3348m0358n297K3410L0847
17283D6168j8842k7304m364j0399P908j6604O380M6607R515l1303J625j398P165
17270A5154K70O10N755k1390j7470j6982J3884R167J3067L248J6720j5214k1230
17257a4411J1750J1275m791q625k2150q643K0693L4681j5873j1532l29J3080J353
17244F478o318o103r941J371j5684n203M752O489J3641m2k2132j5783N313k811
$$ plain form
17334 38307 51586 45882 43927 55081 68746 64396 67282 50969 34416 28441 36183 43677 63496
17321 63496 60191 75774 93960 107930 91278 64750 60387 61087 59392 65517 83240 90896 92409
17308 92409 80327 35747 2631 10228 31509 25285 29949 49146 34462 16664 13683 30656
17296 30656 31270 35560 49352 59695 50850 39982 53541 60914 37566 -2792 -8089 15321 46168
17283 46168 27326 22 -4342 -14741 -6833 -23437 -17057 29550 39065 7762 9387 7989 15154
17270 15154 15424 16034 21789 399 -17071 -34053 -20169 -11002 2065 5313 22033 6819 -14411
17257 -14411 -2661 8614 3823 -4802 -26952 -35595 -14902 19779 3906 -7626 -7955 5125 6478
17244 6478 160 -5943 -15884 -14513 -30197 -35400 -30648 -24159 -10518 -10560 -32692 -48475 -43162 -45973
17230d5973J4826N0384L2560j5919n923j783l159J6012j192j1904k2078n58L3342
17217C8635J8558j717k1110j5274r013K1019J0040J1205J8361P386l693j361K981
17204G6017l545Q132K3016J3326K2261J3930K4624P1451M1482K0198J7644L0692
17192C59228P803K085L44j8837p9533l2310L685N1258L5993k1869m6149k5775
17180B35923N3751R0708N0399j5621l1445j5956L769j5903k5850n9594q3291n4359
17168A32531k7484o698J5678l0700k421j2502l168q482q104j5764O643L3034K9155
17155A01718J0453p019Q999M34J185J4505j3709l458K6616N3415P1665N3948J3297
17142C32049Q295M8926J6347o3318n5333l6003L345K7613K5951k6397l1296o1542
$$ plain form
17230 -45973 -31147 19237 51797 35878 29955 28172 25013 41025 39833 27929 5851 5293 38635
17217 38635 57193 55476 34366 19092 10079 31098 41138 52343 70704 78090 74397 73036 76017
17204 76017 72472 80604 103620 116946 139207 153137 177761 249212 290694 310892 328536 359228
17192 359228 367031 369116 369460 350623 271090 238780 242465 293723 329716 307847 261698 235923
17180 235923 289674 380382 430781 415160 383715 367759 371528 355625 329775 270181 186890 132531
17168 132531 105047 98349 114027 83327 80906 68404 65236 56754 48650 32886 39529 72563 101718
17155 101718 112171 105152 114151 114585 115770 130275 116566 113108 139724 193139 264804 318752 332049
17142 332049 340344 389270 405617 342299 286966 250963 254308 281921 307872 281475 250179 188637
17130A88637n5053o448R892L7636O2282O1499N5894R878n0632m0100m3548m296
17118B25641o143L5365L5312k0431m3723l3700l3180k1610l1725j2634q940k6443
17106E7789l0921k9896O700L1877r850m403K893o990J0988o574R2N731J62q888
17092A8710j1514j382R28J5712J6877o654j6770j3608M599q93J0430k9076n878
17079a8519j4039j4002K337J7785J4781J9844M66m786K2560j248j0931Q212J0192
17066C2652j2083j6301j7362q203n123K1134O121L557J0266K9202J0052p561p822
17053C8529k6655q721K1352J4941k2287k348N310j7225o01J8793J0881J394p801
17040B5562k5600k1874K4835K6333Q713m1907j3084p312O735Q515r705j255M072
$$ plain form
17130 188637 133584 127136 137028 174664 236946 298445 354339 364217 313585 273485 229937 225641
17118 225641 219498 254863 290175 269744 226021 192321 159141 137531 105806 93172 84232 57789
17106 57789 26868 -3028 3672 35549 25699 21296 24189 17199 28187 21613 21705 27436 27598 18710
17092 18710 7196 5814 6742 22454 39331 32677 15907 2299 6898 6005 16435 -12641 -18519
17079 -18519 -32558 -46560 -44223 -26438 -11657 8187 8653 3867 26427 25179 14248 22460 32652
17066 32652 20569 4268 -13094 -21297 -26420 -5286 835 4392 14658 43860 53912 46351 38529
17053 38529 11874 3153 24505 39446 17159 14811 20121 2896 2295 21088 31969 33363 25562
17040 25562 -38 -21912 2923 29256 37969 -3938 -17022 -24334 -17599 -9084 -18789 -20044 -15972
17027a5972j8408n319J1677O76j3593o670J5055R143N757N855M1444Q108l2761
17014D992j71q199j9622l6592R281J5711L796l436p26k0896k899L6776J0682K3801
17000A2498j0519k4405p425J9920K2782J9026j7631k8958J1495O568m292k2401
16988b3342j1208J2190p358r079J0984K5981K4730p027j7496N180n143K998M543
16975E953k996p1j1029k4982p558L7059J5436J5124m352j7843k0013K280P058
16962e934J9194M020J3054q400k0076n995O45j1810J551O378P132J1013l122O236
16948A3886J6376j930k3216o272K3039j1401k0770j2494k1872n86K1900J3061
16936a0279k512j358J0426K8075K6333k0404j5409j8878j0345P958P439J3185
$$ plain form
17027 -15972 -34380 -39699 -28022 -27346 -40939 -47609 -32554 -23411 -17654 -11799 29645 37753 4992
17014 4992 4821 -3378 -23000 -59592 -50311 -34600 -30804 -34240 -34966 -55862 -58761 -21985 -11303 12498
17000 12498 1979 -22426 -29851 -9931 12851 31877 14246 -14712 -3217 3351 -941 -23342
16988 -23342 -34550 -22360 -29718 -38797 -27813 -1832 22898 15871 -1625 3555 -1588 1410 5953
16975 5953 2957 2886 -8143 -33125 -40683 -3624 11812 26936 22584 4741 -15272 -12992 -5934
16962 -5934 13260 17280 30334 21934 1858 -4137 -3492 -15302 -13751 -7373 -241 10772 7650 13886
16948 13886 30262 28332 5116 -1156 21883 10482 -10288 -22782 -44654 -45240 -23340 -10279
16936 -10279 -12791 -14149 -3723 24352 50685 30281 14872 -4006 -14351 -6393 1046 14231
16924A4231l2429K704L787J3020j696l1420K156J5660r730O395P71R75J5439M194
16910D057J8595K8070K602l0247j1831j6892k061J4241L515K574j3174j9617o009
16897b6177Q199J0032O981O909Q867n075J3680j1314J185j9404j8778K7684R177
16884A1966R29l1j4729J4429J3556R764j6877k0365K275K8515R97r546j0676L725
16870A3932J9883q795j5266j6270k3559k8444J1889K3759K1998j8451o115P231
16858a8208P315P160j258k7818n841O930j666O361K396M464n918J15O0n53K0167
16843f294K851j222l1122J636j15J365K4727J5573J0856K852J5063k478k2249
16830A1443j4785k801L538o600N765J3442J3563q320J0928j1751k3418j4492J3491
$$ plain form
16924 14231 -18198 -15494 -11707 1313 -383 -31803 -29647 -13987 -23717 -17322 -16551 -15576 -137 4057
16910 4057 22652 50722 53324 23077 11246 -5646 -7707 6534 10049 12623 -551 -20168 -26177
16897 -26177 -17978 -7946 -965 5944 14811 9736 23416 12102 13287 -6117 -24895 2789 11966
16884 11966 12895 12864 -1865 12564 26120 35884 19007 -1358 917 29432 30429 20883 10207 13932
16870 13932 33815 25020 9754 -6516 -30075 -58519 -46630 -22871 -873 -19324 -25439 -18208
16858 -18208 -10893 -3733 -4991 -32809 -38650 -31720 -33386 -27025 -24629 -20165 -26083 -25968 -25908 -26461 -6294
16843 -6294 -3443 -4665 -35787 -34151 -34266 -32901 -8174 7399 18255 21107 36170 33692 11443
16830 11443 -3342 -6143 -2605 -9205 -3440 10002 23565 15245 26173 14422 -8996 -23488 -9997
16817i997J7700M989p658K765n421j5742J0403J3331j491n198Q797R102K729J9005
16803D3314Q057p01n552j6986k3521P884P430k341j3451M790j1459k4706o432
16790c3674j5505k2953j1191N568J7147N465N146J5744k549j62N447r991R391
16777c2117K8064J2962q86m300K7597O257J628K5108p586m000Q513q607l71j0544
16763D1718k1581k2871r860K5608N359p662j1962J0087J9121M655P307k4178j0017
16750E724n111K7355p008n123J766J2594r405Q88j3601q03r101m498l66O355J158
16735H24R14K1688L8095r49j7871m0431O833K579k4174J5920K1486m566j8103
16722B245N714J0229k7580j6463K2315P540R35o160M94J524j678o607j0691m898
$$ plain form
16817 -9997 7703 12692 5034 7799 2378 -13364 -2961 10370 8879 3681 12478 21580 24309 43314
16803 43314 51371 50670 45118 28132 4611 12495 19925 17584 4133 8923 -2536 -27242 -33674
16790 -33674 -49179 -72132 -83323 -77755 -60608 -55143 -49997 -34253 -36802 -36964 -31517 -41508 -32117
16777 -32117 -4053 8909 8023 3723 31320 37577 39205 64313 56727 52727 61240 52633 52262 41718
16763 41718 20137 -2734 -12594 13014 18373 10711 -1251 8836 27957 32612 39919 15741 5724
16750 5724 613 27968 20960 15837 17603 30197 20792 21680 8079 7276 -1825 -6323 -6689 -334 824
16735 824 1738 23426 61521 60572 42701 2270 9103 11682 -12492 3428 24914 20348 2245
16722 2245 7959 18188 -9392 -25855 -3540 4000 4935 -1225 -731 793 -885 -7492 -18183 -23081
16708b3081o071J4641J783k895J1446R47M808K3224j3242j7019Q98j230r547k4686
16694d0024p754J3824J2120l178P062P09J9740M432r358q837J2104m552J5724
16681A2012o256l3680M508K9224J839k1323j3940O615m157L0793J8541m747J2309
16668C1738J3482N686j0181n837R968l5593j2924J6064j643j0150Q565M220J4264
16655B7659l475o723k75L830Q287j2829o605j1647k1840l240K4332n476l985J630
16641a0357J9518j0746k584K893m061j6186O151M440j2884m144K6793O158j5226
16628a0235J5485j631l8062q319P721L1565O199k0264L048L1213l178j0600J890
16615D832N069j1068j7062j562M4291K591k6249k8754l212J1631r035j2088K3506
$$ plain form
16708 -23081 -29152 -14511 -12728 -15623 -4177 -3230 1578 24802 11560 -5459 -4561 -5791 -15338 -40024
16694 -40024 -47778 -33954 -21834 -25012 -17950 -17241 2499 6931 -2427 -11264 840 -3712 12012
16681 12012 5756 -27924 -23416 5808 7647 -13676 -27616 -21001 -25158 5635 24176 19429 31738
16668 31738 45220 50906 40725 34888 44856 9263 -3661 12403 10760 610 9175 13395 27659
16655 27659 24184 17461 17186 21016 29303 16474 9869 -1778 -23618 -26858 -2526 -8002 -11987 -10357
16641 -10357 9161 -1585 -4169 -1276 -5337 -21523 -15372 -10932 -23816 -27960 -1167 4991 -10235
16628 -10235 5250 3619 -34443 -42762 -35041 -3476 2723 -17541 -14493 16720 13542 2942 4832
16615 4832 9901 -1167 -18229 -19791 24500 27091 842 -27912 -31124 -19493 -28528 -40616 -17110
16602a7110K5926n098R05p084j4840Q731K2676L004o80l3911j9375N043J6726
16589a5087Q408m772q565P03M1050j320k5750p911k0320m813m310R060m618K3086
16575a5159K3585j6837k4089o090L164J1099J466P907j7339k4281j7914J0969
16563f3519J597K9608J3780j6192m410J042M96J1452Q452J7437Q019j3062r961
16550a5261R85R088l144M029k930k091J1043P393j1237j9950J0507L181J5819
16537G432j0812q745J4831n461q438N937J9632R257j6184L09K936j7070j0151
16524a6527j5219j088m055R56J1809j9092k1965N817L5540K181K821R503P758
16511a561P898O656q43m232O977j1551L420q795Q154k2397q168n637R274l1l85
$$ plain form
16602 -17110 8816 3718 4623 -2461 -17301 -8570 14106 17110 16430 -17481 -36856 -31813 -15087
16589 -15087 -6679 -11451 -20016 -19313 21737 20417 -5333 -13244 -33564 -38377 -42687 -33627 -38245 -15159
16575 -15159 8426 -8411 -32500 -38590 -35426 -24327 -22861 -14954 -32293 -56574 -74488 -63519
16563 -63519 -61922 -32314 -18534 -34726 -39136 -38094 -37598 -26146 -17694 -257 7762 -5300 -15261
16550 -15261 -14276 -5188 -8332 -4303 -7233 -9324 1719 9112 -2125 -22075 -11568 -8387 7432
16537 7432 -3380 -12125 2706 -2755 -11193 -5256 14376 23633 7449 7758 10694 -6376 -16527
16524 -16527 -31746 -32834 -36889 -35933 -24124 -43216 -65181 -59364 -23824 -21643 -18822 -9319 -1561
16511 -1561 6337 12993 12150 7918 14895 3344 6764 -2031 6123 -16274 -24442 -30079 -20805 -20836 -21221
16496b1221j5297n571P039r683Q320M2279r59k9572K4307M655K4n178j9618J6452
16482d023L782Q798J3812r314j6416Q576k0711n801Q165K2601O124J0602J1163
16469C7358j2113k1934j3067J2163N727j6015K865P813m816K8275J0558o908k1721
16456H185q242l117Q946K4689p334n046N940n523J3022m412j6984q171N63j2445
16442i929l361j242m978R456K1060R336J5936j0249k8254l1587J2306L4984O62
16429A4140k246k1064n039J5145o90k3584O82j2444k0365j7478O934L5438p252
16416c7823J93K1342K7082J0914m6j0646k3089q775k253J142J928R026N877j8739
16402b3867J0027J9717R10l8948K199Q041J911M686J0900j1935m767j1757n50
$$ plain form
16496 -21221 -36518 -42089 -35050 -44733 -36413 5866 4907 -24665 -358 4297 4321 -857 -20475 -4023
16482 -4023 -241 8557 22369 13055 -3361 5215 -15496 -21297 -13132 9469 15593 26195 37358
16469 37358 25245 3311 -9756 2407 8134 -7881 -5016 2797 -2019 26256 36814 29906 8185
16456 8185 -57 -3174 5772 30461 23127 18081 24021 18498 31520 27108 10124 1953 2516 -9929
16442 -9929 -13290 -14532 -19510 -10054 11006 20342 36278 26029 -2225 -33812 -21506 13478 14140
16429 14140 11894 -9170 -14209 936 246 -23338 -22656 -35100 -55465 -72943 -66009 -30571 -37823
16416 -37823 -37630 -16288 10794 21708 21662 11016 -12073 -20848 -23101 -21959 -20031 -11005 -5128 -23867
16402 -23867 -13840 5877 6787 -32161 -29962 -21921 -20010 -15324 -4424 -16359 -21126 -32883 -33433
16389c3433K777K966r200K2673K1886k5992j1840K2742K3204P338K4133M18j2364
16376C5308l7340l9763j4151K3037J6966O342j0157q602K0605L058J5302L973
16364A4578j8751j4626Q568m201j1071L3636L427j5572M409P321p947m311k3385
16351b7925l309Q565Q140K3105l899k3700j6240K605N787J2349P830J7619j8749
16338g822j3194k60K87P26M110Q720J4360m846j6276j4978J4538O532J3188J4322
16324A9407l5691j1595J493n297m592J7232K7902J0566L120j837j198K1391m483
16311C6418j0742k1090j5224j2416j1288J2649J6559p2j1068K1486J49o642l128
16298d409N149j2354j586N092J10R569j0396k3902J8122J1667K1412P781l389
$$ plain form
16389 -33433 -30656 -27690 -36890 -14217 7669 -18323 -30163 -7421 15783 23121 47254 47672 35308
16376 35308 -2032 -41795 -55946 -32909 -15943 -9601 -19758 -28360 -7755 -4697 10605 14578
16364 14578 -4173 -18799 -10231 -14432 -25503 8133 11560 -4012 397 7718 -229 -4540 -27925
16351 -27925 -31234 -22669 -14529 8576 4677 -19023 -35263 -32658 -26871 -14522 -6692 10927 -7822
16338 -7822 -21016 -21276 -20989 -20263 -16153 -7433 6927 2081 -14195 -29173 -14635 -8103 5085 19407
16324 19407 -16284 -27879 -26386 -31683 -36275 -19043 8859 19425 22545 20708 19510 40901 36418
16311 36418 25676 4586 -10638 -23054 -34342 -21693 -5134 -5206 -16274 5212 5361 -1281 -4409
16298 -4409 740 -11614 -13200 -8108 -7998 1571 -8825 -32727 -14605 -2938 18474 26255 22866
16285B2866n184k5774K363N012Q584J6664k755k994l150J8254j2105j0724k5431
16272a4374n731L91K40k793J772m791J7126M041m447N24L4433N110j3935j4171
16258C395r360q895l530K50q109J5670J3261O969p799j9791j4108K7308J9284
16245A4545J0452j5165k4307K526R305J7928K9330n044l8833k9803n402O288J1138
16232a7042J0853j2111j7006M761J1389J2728n021o810k0281j1703K6251K4777
16220G85m147l1875J7150J9867K7707n83o423q200m864k3211L668k558o214J1833
16206g065J8171J3590K5622j0063k4348k6373q403l465J9200O987N239K1665N721
16193C6478k76j067j4898K902p805j1567n888j0631J3291J4169j4992N320J2434
$$ plain form
16285 22866 17682 -8092 -5729 -717 7867 24531 21776 18782 15632 33886 21781 11057 -14374
16272 -14374 -20105 -19714 -19474 -22267 -20495 -25286 -8160 -4119 -8566 -8042 26391 31501 17566 3395
16258 3395 -5965 -14860 -18390 -18140 -26249 -10579 2682 9651 1852 -17939 -32047 -4739 14545
16245 14545 24997 9832 -14475 -11949 -2644 15284 44614 39570 737 -29066 -34468 -28180 -17042
16232 -17042 -6189 -18300 -35306 -30545 -19156 -6428 -11449 -18259 -38540 -50243 -23992 785
16220 785 -3362 -35237 -18087 1780 29487 28904 22481 14281 9417 -13794 -10126 -12684 -18898 -7065
16206 -7065 11106 24696 50318 40255 15907 -10466 -18869 -22334 -3134 3853 9092 30757 36478
16193 36478 36202 35135 20237 23139 15334 3767 -2121 -12752 539 14708 -284 5036 17470
16180A7470j4444j7447J4566L1723J3287j8825j2206m073o909P182J2422m481
16168A8265q53j0578p517j9103q389J8747J3207j2042K7076K0514j4513l1915
16156g101q393p615L845Q468M30r535N625R066j2865P184R918K773L530J5160
16142B0490n839l0401j9131J9068N24J7863J0101Q102M035j0343j4788q400P761
16129i58j217O252j1387J987p571l2994K535O247P023k69J6622R714K5894L49
16115B2227j437r288j858P038Q795m162K570j0912j6800k5350J1815L2798P309
16102B2745j5974k6123o224J4016R673K6512J1054k420k6563n071k2877O881J6336
16089A965P245Q883q525K635q677P166J1841q725p597j0783p440k120L1579j1647
$$ plain form
16180 17470 3026 -14421 145 31868 45155 26330 14124 10051 3142 10324 22746 18265
16168 18265 17412 6834 -683 -19786 -28175 -9428 3779 -8263 18813 39327 24814 -7101
16156 -7101 -15494 -23109 -19264 -10796 -10366 -19901 -14276 -5210 -18075 -10891 -973 1800 5330 20490
16142 20490 14651 -15750 -34881 -15813 -15289 2574 12675 20777 24812 14469 -319 -8719 -958
16129 -958 -2175 4077 -7310 -5323 -12894 -45888 -43353 -37106 -30083 -30352 -13730 -4016 21878 22227
16115 22227 20790 11502 9644 16682 25477 21315 23885 12973 -3827 -29177 -17362 15436 22745
16102 22745 6771 -19352 -25576 -11560 -1887 24625 35679 33259 6696 1625 -21252 -14371 1965
16089 1965 9210 18093 9568 12203 3526 10692 22533 13808 6211 -4572 -12012 -14132 17447 5800
16075E800J5897J4712k2873k3827j1790L978o388q786N128J8460O249r860j0924
16062b4224K708j8385L968K6543N747o286L0495l824j8913l8586l0074N140J5871
16049d9820L1357K0660N923L307K0816q618j4712j4831N371J2847R655P787m685
16036B5057j5293j2546K2726K9506J914j0209l2506p580M467j628J663O253j4536
16023b712k1177P265J3060q330j7589n256L1564K3305p274r684j3663R278J5167
16010A3954P325p181K757P387k5261m9410r962J6897J3080j6438l614P957K7045
15997a5464j2544r265K1178K2132J2464k298j8585r693j3070J890K1024n010j4098
15984b1339R100j511P271J5709o222k3208J83l174L361j3049O887J8297P662Q464
$$ plain form
16075 5800 21697 36409 13536 -10291 -22081 -18103 -24491 -33277 -28149 -9689 -3440 -13300 -24224
16062 -24224 -21516 -39901 -35933 -9390 -3643 -9929 20566 16742 -2171 -40757 -70831 -65691 -49820
16049 -49820 -18463 2197 8120 11427 32243 23625 8913 -5918 -547 12300 21955 29742 25057
16036 25057 9764 -2782 19944 49450 51364 41155 8649 1069 5536 3908 5571 11824 -2712
16023 -2712 -23889 -16624 -3564 -11894 -29483 -34739 -3175 20130 12856 3172 -10491 -1213 13954
16010 13954 21279 14098 16855 24242 -1019 -50429 -60391 -43494 -30414 -46852 -50466 -42509 -15464
15997 -15464 -28008 -37273 -16095 6037 18501 16203 -2382 -12075 -25145 -23255 -2231 -7241 -21339
15984 -21339 -12239 -13750 -6479 9230 3008 -20200 -20017 -23191 -19830 -32879 -25992 -7695 -33 8431
15970H431J6643N065M132j0614J0903j4209K1580n114L833p183j9609j2785j1987
15957a0914J1949K142j9545k9684J4658J5507R34o730k0841p241R405O632R973
15944b3755L976N921j770J0437j7208J340J0538J5069J9532O298j1065r058N122
15931A5377k0709j7920K0976J7936R335l410l602k3521j8774L0720J0722k160
15919A4970j2931j4670o267N508N445j3408Q556K568J0185k781P74n692J3617
15906E874L461k1837J6355K1022l0271l8197j8474J0482K1747K1930K0467j0549
15894B010O421J2441o678k9929M463J0411k5063j0460K3313K0050Q881j2085j3105
15881i330K3312n170k010L765j0313J1687k244Q259O785q325j6078r64J4631L4289
$$ plain form
15970 8431 25074 30139 34271 23657 34560 20351 41931 36817 40650 33467 13858 1073 -10914
15957 -10914 1035 3177 -16368 -46052 -31394 -15887 -14953 -21683 -42524 -49765 -40360 -33728 -23755
15944 -23755 -19779 -13858 -15628 -5191 -22399 -21059 -10521 4548 24080 30378 19313 10255 15377
15931 15377 -5332 -23252 -2276 15660 24995 21585 17983 -5538 -24312 6408 17130 14970
15919 14970 2039 -12631 -18898 -13390 -7945 -21353 -12797 -10229 -44 -2825 -2051 -7743 5874
15906 5874 9335 -12502 3853 24875 -5396 -43593 -62067 -51585 -29838 -7908 12559 2010
15894 2010 8431 20872 14194 -15735 -11272 -861 -25924 -36384 -13071 6979 15860 3775 -9330
15881 -9330 13982 8812 6802 10567 254 11941 9697 17956 24741 16416 338 -626 14005 48294
15867D8294L7805L5122P540j539K678O504k382j5293k7465j3849j9224r659k5692
15854B2840j4468L138R685R700r337k2995l76K0481j9096k4918Q587J936j950
15841a6773J0818K3020j80q824j6334m940m316J182l491j0563R620J2401J5367
15828F987j1415l965R710k436q843P805N579j9697O05K3584J32O76q90L146J871
15813A2849k4119k9148R081J8656J6943q798L368l512M734j2964r319n078J9165
15800h142J2509l87j2393k0137j3129N528K5186L594O427q686R837J061l628K6199
15786B3839r545p344J3951k2717L134J6878k0337j1935M019N327m569o312M404
15773a1207J2655Q069p778K050K0303q970k2591Q417r303j2563q17K306J0315
$$ plain form
15867 48294 86099 121221 128761 127222 129900 136404 134022 118729 91264 77415 58191 48532 22840
15854 22840 8372 11510 21195 30895 21558 -1437 -1813 18668 -428 -25346 -16759 -14823 -16773
15841 -16773 -5955 17065 16885 8061 -8273 -13213 -17529 -16347 -19838 -30401 -20781 -8380 6987
15828 6987 -4428 -8393 1317 -1119 -9962 -2157 3422 -16275 -15670 7914 8046 8722 7832 10978 12849
15813 12849 -11270 -40418 -31337 -12681 4262 -4536 -1168 -4680 54 -12910 -22229 -27307 -8142
15800 -8142 4367 3980 -8413 -28550 -41679 -36151 -10965 -7371 -944 -9630 207 1268 -2360 23839
15786 23839 14294 6950 20901 -1816 1318 18196 -2141 -14076 -10057 -4730 -9299 -15611 -11207
15773 -11207 1448 9517 1739 3789 24092 15122 -7469 948 -8355 -20918 -21735 -19429 -9114
15760i114n725m574j9736J4998P046N7O462J7111K9023N110j8991j9563J0076
15747A2180K3157k9145q174K1927K1212M937k0921o292J3557J2721J0417r364
15735D6212k5867j5374k898J2324j1979k1726K7023K982j4171l331J6096O544
15723A5835j1737k3204J6346M876J2109J9878j055r106J176j3817j6880j8922
15711b4501Q030K8076J0299j2048K320j5999o761j4425P244J3152r325K40k969
15698a6667j304K3371l710k3956m347K1399M577l0994L041K3422J2470o457m766
15685c921j1293l350L635q54P448N610q077n620K5614J5964O483n138q208P492
15671B5785J6260k972j9607l3339n216J227R813P303r55N189k0690j9312N134
$$ plain form
15760 -9114 -14839 -19413 -39149 -24151 -17105 -17048 -10586 6525 35548 40658 21667 2104 12180
15747 12180 35337 6192 -1982 19945 41157 46094 25173 18881 32438 45159 55576 46212
15735 46212 20345 4971 2073 14397 2418 -19308 7715 10697 -3474 -6805 9291 15835
15723 15835 4098 -19106 -2760 2116 14225 34103 33048 23942 25118 11301 -5579 -24501
15711 -24501 -16471 11605 21904 9856 12176 -3823 -10584 -25009 -17765 -4613 -13938 -13698 -16667
15698 -16667 -17971 5400 1690 -22266 -26613 -5214 -637 -31631 -28590 -5168 7302 845 -3921
15685 -3921 -15214 -18564 -14929 -15783 -8335 -2725 -10802 -16422 9192 25156 31639 26501 18293 25785
15671 25785 42045 39073 19466 -13873 -19089 -17862 -8049 -746 -1701 3488 -17202 -36514 -31380
15658c1380J4886l668r57J0207l819q789J8062j1070O721K3215j138p342Q780
15645A3708j3342o456r282O201p458N943J7669J0644j5952J089j7673J7617J6887
15632A9595n88p706q503j1354l232P452n030j5713j0392r034l244M5334J9806
15619A7391J0284R047m179j0999K507J455j3712j65N610k9479O799J0648M237
15606I444j2577o80l5561j937K3457j3477o861j0393r719J5166K1598N267R273
15593g000Q950J2743j8166o512q443K5364L000K717k67J3600K7252J6981j1025
15580E9194k6504k0989j4670J7024J2993P941J0169k6619j2380k2160n739N112
15568a6628K725k4554K349K3086J3129j593j715J0786k1216k3806J5661J3326
$$ plain form
15658 -31380 -16494 -20162 -21119 -10912 -14731 -23520 -5458 -16528 -9807 13408 12270 4928 13708
15645 13708 366 -6090 -15372 -9171 -16629 -10686 6983 17627 1675 2764 -14909 2708 19595
15632 19595 19007 11301 2798 -8556 -11788 -4336 -9366 -25079 -35471 -44505 -47749 -2415 17391
15619 17391 27675 36722 32543 21544 24051 25506 11794 11629 17239 -12240 -5441 5207 9444
15606 9444 -3133 -3813 -39374 -41311 -17854 -31331 -38192 -48585 -58304 -43138 -21540 -16273 -7000
15593 -7000 1950 14693 -3473 -9985 -18428 6936 9936 12653 12386 25986 53238 70219 59194
15580 59194 32690 11701 -2969 14055 27048 34989 45158 18539 6159 -16001 -21740 -16628
15568 -16628 -13903 -38457 -36108 -13022 107 -1486 -3201 7585 -13631 -37437 -21776 -8450
15556h450Q485P784r999n931j0347k841Q886J1462J2999j1751M519j575l135p34
15542f28j2930O890r977k579n398O942O803O467M0222J8717k9078L667l777M779
15528C0120J9427R378J0220j5135j4859p010j6498k3097L490K9332m190j1343
15516I835j6270K312j1275N350L573j2457R490O053K1785K789k8239j0992j863
15503a9909q637l2146L09J5756R118K302l272J1464M1759J9519l0264k2477Q288
15490h190Q643R238Q235K4235r473j5237k2721J4873j8276k2181n26K1531P563
15477b286o779r276J650J6095j6011j6649Q808J1023o478j1148Q382J6030K355
15464d284J3205J6637k667P102j1836k4432k1001N824r898r518J7166J8350r538
$$ plain form
15556 -8450 35 7819 -2180 -8111 -18458 -21299 -12413 -951 12048 297 4816 3241 106 -628
15542 -628 -13558 -6668 -16645 -19224 -24622 -17680 -10877 -4410 35812 54529 25451 29118 25341 30120
15528 30120 49547 58925 69145 54010 39151 32141 15643 -7454 -3964 25368 21178 9835
15516 9835 -6435 -4123 -15398 -10048 -6475 -18932 -9442 -3389 18396 21185 -7054 -18046 -19909
15503 -19909 -28546 -60692 -60383 -44627 -35509 -33207 -36479 -25015 16744 36263 5999 -16478 -8190
15490 -8190 453 9691 17926 42161 32688 17451 -5270 9603 -8673 -30854 -31380 -9849 -2286
15477 -2286 -9065 -18341 -16691 -596 -16607 -33256 -24448 -13425 -19903 -31051 -22669 -6639 -4284
15464 -4284 8921 25558 22891 29993 18157 -6275 -27276 -21452 -31350 -40868 -23702 -5352 -14890
15451a4890O385q271j3016P398J9503O972K1820p741k7867O275L066R813q503
15438I44k4119r942k397R795J0235J3774J420K190j2503r847N594n183L898J2915
15424c226M981j7040j1787o093J2155K5450J420O41l128k1615j228K2917l181
15411B66j3419N212l845K1445K1973K836j9428r688K1117K374q861J0970L030
15398C3982l647l6386j0287o898j8592Q610J0420K616j8787j0606l682n856J1042
15385d8071k805J4061L7962J0353q11l799o119R144R430J7329j7452O98R009P029
15371C5958J537J3598j1676m1609j2345m698k857J435K424j9219l629k155N60
15358d2676P18k311j8898k0535K6972N3615J234j4172j2498l905J3736M029m547
$$ plain form
15451 -14890 -8505 -16776 -29792 -22394 -2891 4081 25901 18160 -9707 -3432 -366 9447 944
15438 944 -23175 -33117 -35514 -25719 -15484 -1710 -290 1900 -10603 -20450 -14856 -20039 -16141 -3226
15424 -3226 1755 -15285 -27072 -33165 -21010 4440 5860 6501 3373 -18242 -19470 3447 266
15411 266 -13153 -7941 -11786 9659 31632 34468 15040 5352 26469 28843 19982 30952 33982
15398 33982 30335 -6051 -16338 -23236 -41828 -33218 -22798 -20182 -38969 -49575 -53257 -59113 -48071
15385 -48071 -50876 -36815 1147 11500 10689 6890 771 9915 19345 36674 19222 19920 28929 35958
15371 35958 37495 51093 39417 -2192 -14537 -19235 -22092 -20657 -18233 -37452 -41081 -43236 -42676
15358 -42676 -41958 -44269 -63167 -83702 -56730 -3115 -1881 -16053 -28551 -32456 -18720 -14691 -19238
15345a9238J3197M720j0741j783J2582n942l314K0270q081k2300K076J3291R211
15332C948K815k4772p124K0297k5627L536K8709N347k1165J3817m51K1248J4145
15319C4723j662l075K061r17k0049o678j1555n205j0311K909L259J1343l198o732
15305a5087k3055L927J1263Q796J5372K5731O115p266j161J6114j0768k3697j8325
15292a2041Q455j3646k995K0132l331j6397P551R373J9590j483r125n598M892
15279E377p146m1154k1548K6799O554R985J2040K8547k932o376j1485J4090P119
15266A9870J758j5593L816o602P18k617m486J3919J9499J3674M708j179j520l245
15252D2720m1448j7253J1487O410k205K3198J686k1016o800j1419j244Q365j1472
$$ plain form
15345 -19238 -6041 -1321 -12062 -13845 -1263 -7205 -10519 9751 1670 -20630 -18554 -5263 3948
15332 3948 6763 -18009 -25133 -4836 -30463 -26927 1782 7129 -14036 -219 -670 20578 34723
15319 34723 33061 29986 32047 31130 11081 4403 -7152 -12357 -22668 -19759 -16500 -5157 -8355 -15087
15305 -15087 -38142 -34215 -22952 -14156 1216 26947 33062 25796 24635 40749 29981 6284 -12041
15292 -12041 -3586 -17232 -20227 -95 -3426 -19823 -12272 -2899 16691 15208 6083 485 5377
15279 5377 -1769 -42923 -64471 -37672 -31118 -21133 -9093 19454 16522 10146 -1339 12751 19870
15266 19870 21628 6035 9851 3249 3967 1350 -3136 10783 30282 43956 48664 47485 45965 42720
15252 42720 1272 -15981 -4494 1916 -289 22909 24595 3579 -3221 -14640 -15884 -7519 -18991
15239a8991j5647P13J9722L954q018j3412j5343k0400J613O981N200K4187j1693
15226d1134l641O880n485J663K0764J9409j7907j0732n27K451Q744p007J8038
15213h484J2426o998j087j0289j874P695L04n589m405j4793J5413M2538M334q051
15199B1140Q630p75l67j7519Q05R435L568k8995j2043J4533q639p383Q458O216
15185b936J1812J4178p790L808j7704k0928m748n078N643J886J0521L894r814
15172a7256J8303J2657k7966j4453R823j7708p761K9600O045p118j571j1671j044
15159c0120J7872J687K735P586l632P798j2555R562l346l3106j12K3122j3303
15146b5812l835P719J5000L1068M488J969j7454J3957j1642j678k4082k4825j4983
$$ plain form
15239 -18991 -34638 -33925 -14203 -10249 -18267 -31679 -47022 -67422 -65809 -58828 -53628 -29441 -41134
15226 -41134 -44775 -37895 -43380 -41717 -20953 -1544 -19451 -30183 -30710 -28259 -19515 -26522 -8484
15213 -8484 3942 -3056 -4143 -14432 -16306 -8611 -8307 -13896 -18301 -33094 -17681 24857 29191 21140
15199 21140 29770 28995 28628 11109 11914 21349 24917 -4078 -16121 -1588 -10227 -17610 -9152 -2936
15185 -2936 8876 23054 15264 19072 1368 -19560 -24308 -29386 -23743 -21857 -11336 -7442 -17256
15172 -17256 1047 13704 -14262 -28715 -18892 -36600 -44361 -14761 -8716 -15834 -17405 -29076 -30120
15159 -30120 -12248 -10561 -7826 -240 -3872 3926 -8629 933 -2413 -35519 -35631 -12509 -25812
15146 -25812 -29647 -21928 -6928 24140 28628 30597 13143 27100 15458 13780 -10302 -35127 -50110
15133e0110r088N403R431J6598K3039P425M44n712J3961R802J694K622k1544J1239
15119A5204N66j4165N887p112j6168J3303J5284Q899K572O70J030j2659Q821J5240
15105C7372j1525l6888k8228K5742j3475L397K5768K0523Q213j3375j9235m946
15093f657J3565P956R821N815k3471n870k320J8004j7620r597M350P751J6941
15080A8668q984M711j313J2080k3387l3131K4756K1673L299m994k4537k3242K0282
15067a4119P186j1050J0150O829l591j1554j7479J3334j68j3662O447L525k4219
15054d8371J7372m279J4870L1956N154j7396j2001k2940J5216J2252J1952j2871
15042i086K839J4133j1043k9028L0218J3086k2121k0651R919J3306P130k992j8769
$$ plain form
15133 -50110 -59198 -53795 -44364 -27766 -4727 2698 3142 -2570 11391 21193 22887 25509 3965 15204
15119 15204 15770 1605 7492 380 -15788 -2485 12799 21698 24270 24940 25970 13311 22132 37372
15105 37372 25847 -11041 -39269 -13527 -27002 -23605 2163 22686 30899 17524 -1711 -6657
15093 -6657 6908 14864 24685 30500 7029 1159 -1161 16843 -777 -10374 -6024 1727 18668
15080 18668 9684 14395 13082 25162 1775 -31356 -6600 15073 18372 13378 -11159 -34401 -14119
15067 -14119 -6933 -17983 -7833 -1004 -4595 -16149 -33628 -20294 -20462 -34124 -27677 -24152 -48371
15054 -48371 -30999 -35278 -20408 11548 16702 -694 -12695 -35635 -20419 -8167 3785 -9086
15042 -9086 -6247 7886 -3157 -32185 -1967 11119 -11002 -31653 -21734 -8428 -1298 -4290 -23059
15029b3059O114K5761L141M345j0424j1669j9635Q573R891j7083k477K2093r263
15016a3692J0116J6619j1472j052L93N210j491n885J6710q861j2517j716J3837
15003F199k52J2457J127q992N060q283P802J5543N645j5551M070J7686j4815L44
14989B8040J4045J1516l1633m350j7637N774K4335l539p734l8327k1102j4070
14977e4682j1866N390J1209K7183J4438j0261k252N536P835J9403j4446l0000
14965c2513K56j839J2118K3458J2910J0961m186j9183o894L82j304K800Q812m064
14951A714n688o970k2650L376J3229J8524J2454l407J1793K8346j7363k2630n375
14938E353l0680N680j5162r288K0568p459K1988L1354k9362k8013j481o371k391
$$ plain form
15029 -23059 -16945 8816 11957 16302 5878 -5791 -25426 -16853 -6962 -24045 -26522 -4429 -13692
15016 -13692 -3576 13043 1571 519 912 6122 4631 -1254 15456 6595 -5922 -7638 6199
15003 6199 5947 18404 19531 10539 15599 7316 15118 30661 36306 20755 24825 42511 27696 28040
14989 28040 42085 53601 21968 17618 -19 5755 30090 26551 18817 -19510 -40612 -54682
14977 -54682 -66548 -61158 -49949 -22766 -8328 -18589 -20841 -15305 -7470 11933 -2513 -32513
14965 -32513 -32257 -34096 -21978 1480 14390 25351 21165 1982 -4912 -4530 -5834 -3034 5778 1714
14951 1714 -3974 -10944 -33594 -30218 -16989 1535 13989 10582 22375 50721 33358 10728 5353
14938 5353 -25327 -19647 -34809 -44097 -23529 -30988 -9000 22354 -7008 -35021 -36502 -42873 -45264
14925d5264P727J9695n132o874P887N345k156K5502j1403Q207K1263Q863o120
14912B7540Q677j1165p906j8080K766J6730k2280p78l456r605j2190K7350p306
14899i703k1963R82R530j3984l37J2553J2237K5574O919j1381Q903k1069j6681
14886a8420J095m879K4450R716K0472O581P538l9294j7641j375l580j0099j1225
14873c6661K0102j2800R693K0095N762j0552P896J0688j1520j5750j1553r537
14861c4137P693K9530J7428L391J613o534j1617L404R629m063l1382k7069K233
14848c9881L1421K1700R993p377N574m4238j0708K331J7929J7520k703k2722j4075
14835c5236J6745K3811J2387k695l898M454r621L461j8979o016J4772J8905k4237
$$ plain form
14925 -45264 -37537 -17842 -22974 -29848 -21961 -16616 -18772 6730 -4673 3534 24797 33660 27540
14912 27540 36217 25052 17146 -934 1832 18562 -3718 -4496 -7952 -17557 -29747 -2397 -9703
14899 -9703 -31666 -30684 -21154 -35138 -35475 -22922 -10685 14889 21808 10427 19330 -1739 -18420
14886 -18420 -17325 -22204 2246 11962 32434 39015 46553 7259 -10382 -11757 -15337 -25436 -36661
14873 -36661 -16559 -29359 -19666 429 6191 -4361 3535 14223 2703 -13047 -24600 -34137
14861 -34137 -26444 3086 20514 23905 25518 18984 7367 10771 20400 16337 -15045 -42114 -39881
14848 -39881 -8460 13240 23233 15856 21430 -22808 -33516 -31185 -13256 4264 1561 -21161 -35236
14835 -35236 -18491 5320 17707 15012 11114 15568 5947 9408 -9571 -15587 -815 18090 -6147
14822f147k927Q264K3532J4600J3367N561k465J5583j3686j4066k0965Q21m490
14809A6982o651q336j2603j3336M829J5765J331M121J6640l849R850K2774L3731
14796H1248m502m7583j2413k272j9680k411J0117K6667p2k226K6412R549n716
14783E7118L117j3942k5700N1j3834j8378k749J5330J414k439Q645M786k673p626
14769C120l0999N992K3102J7444q024n965J1379r611J2703j1398k3800o491L0488
14756G940q099j9462R324N396R140J9344L222J3825m029m730j2589o256k0104
14743g078j9950J4616j1116k185k129m727O358J7400j9556j4398K6473K539k216
14730a5969M065k335O363q497J4550J1342m050Q090J4955j8926O191r798p039
$$ plain form
14822 -6147 -9074 -810 22722 37322 50689 56250 53785 69368 55682 41616 20651 21472 16982
14809 16982 10331 1995 -10608 -23944 -19115 -3350 -2019 2102 18742 14893 24743 47517 81248
14796 81248 76746 29163 16750 14478 -5202 -7613 2504 29171 29099 26873 53285 62834 57118
14783 57118 60235 46293 20593 20644 6810 -11568 -14317 1013 2427 -12 8633 13419 10746 3120
14769 3120 -27879 -21887 1215 18659 10635 4670 16049 6438 19141 7743 -16057 -22548 7940
14756 7940 -159 -19621 -10297 -4901 4239 23583 26805 40630 36601 31871 19282 13026 -7078
14743 -7078 -27028 -12412 -23528 -25713 -27842 -32569 -26211 -8811 -28367 -42765 -16292 -13753 -15969
14730 -15969 -11904 -14239 -7876 -16373 -1823 9519 5469 13559 28514 9588 15779 5981 -1058
14717a058p997p765J1085Q595p656J9383l586k0799k01P630o658n84r830n308
14703b4749J6689J3231r952r963L267N218n485j35J8036J1726K0050K284L359
14690D3576j2656m540L573k0601j1952R995q792k3382m599J1327j4171l747L2010
14677c959K0729J6218J6016j6794k3117o667j2837j8171J1132K1585J9632J455
14665B5222k438k6499j376l993j7067j1267K1204J852O103k582j825J106O085
14652e475j0767P057L2044J5456j3535j3703j0510L06O136P103O339j482j4017
14639D952j9355M439J4464o982o61J5493j983Q654j2249j7147P677N768L35Q823
14625A2228o961J270K7595J9063J1049K526k8918l3152k7991p005J618L7939m389
$$ plain form
14717 -1058 -9055 -16820 -5735 2860 -4796 14587 11001 -9798 -9999 -2369 -9027 -9611 -19441 -24749
14703 -24749 -8060 5171 -4781 -14744 -11477 -6259 -11744 -11879 6157 17883 37933 40217 43576
14690 43576 30920 26380 29953 9352 -2600 7395 -1397 -24779 -29378 -18051 -32222 -35969 -3959
14677 -3959 16770 32988 49004 32210 9093 2426 -10411 -28582 -17450 4135 23767 25222
14665 25222 22784 -3715 -5091 -9084 -26151 -37418 -16214 -14362 -8259 -10841 -12666 -11560 -5475
14652 -5475 -16242 -9185 22859 38315 24780 11077 567 873 7009 14112 20451 18969 4952
14639 4952 -14403 -9964 4500 -2482 -3143 12350 10367 19021 6772 -10375 -2698 3070 3405 12228
14625 12228 5267 6537 34132 53195 64244 66770 37852 4700 -23291 -30296 -28678 9261 4872
14612D872o212J4159r839j7053k9401Q191J7534J6028j017j037j59J5112j2469
14599a291J2718j834n46j3829m994R455o732j658R050J3185L449n85j0981k0391
14585a4984k4544J0455J275P789M572Q444j8649L550K0471P61j1334o077N178
14572a3093J0287M685p487j9681r679J2827K009o624m567j919k0649k4456m943
14559h3290K2482J1583M0046K2247K236M559n86j2181j3558l0775M811K1356J5423
14546D353J544j0357j6221J1467K1169j491l2058J3542L2290K2364o167m0544
14534a09l5882j3238J6779J9715R159J7697l4m314m873k6033J0524k765j7296
14521c0670o851J3135K3187j4725k2752O818l550j1176O174K4578J9370r430k960
$$ plain form
14612 4872 -1340 12819 2980 -14073 -43474 -35283 -17749 -1721 -2738 -3775 -3934 11178 -1291
14599 -1291 11427 9593 9047 -4782 -9776 -321 -7053 -8711 339 13524 16973 16388 5407 -14984
14585 -14984 -39528 -29073 -27798 -20009 -15437 -6993 -25642 -22092 -1621 -860 -12194 -18271 -13093
14572 -13093 -2806 1879 -5608 -25289 -34968 -22141 -20132 -26756 -31323 -33242 -53891 -78347 -83290
14559 -83290 -60808 -49225 -9179 13068 15304 19863 19277 7096 -6462 -37237 -32426 -11070 4353
14546 4353 5897 -4460 -20681 -9214 11955 10464 -21594 -8052 24238 46602 40435 -109
14534 -109 -35991 -49229 -32450 -12735 -3576 14121 14087 9773 4900 -21133 -10609 -13374 -30670
14521 -30670 -37521 -24386 -1199 -15924 -38676 -31858 -35408 -46584 -40410 -15832 3538 -5892 -8852
14508h852J3652K5554N441l222j3852k1231k4965J0640L3862L6720k2352k0259
14496A1136J1929J7257j8435l239p81r560L889k3609j3863J1197m714K4053K0674
14483B5934j5272j722m502J3292j8926j7442K485J5705P25R845J0182L301j579
14470B2026j5292P7J6172J9448p028l1005j8961m225R871l023J811K3735J6752
14457C0358l206j1741K091J3766P053j2429j5528p160K4630J6416r85l494j1164
14444B8607j7004j6213j6250O621n705j0780K4224K283m251K5931R842L026j3127
14431A7204P980J163j3689n906J0085R508O4P158m826K385o840k566p260K8972
14417D3432J1409j0120P531k1921l0322j0481Q378K0689j7010j8695p280J7059
$$ plain form
14508 -8852 4800 30354 35795 32573 18721 -2510 -27475 -16835 17027 53747 31395 11136
14496 11136 23065 40322 21887 18648 17867 8307 12196 -11413 -25276 -14079 -18793 5260 25934
14483 25934 10662 8940 4438 17730 -1196 -18638 -16153 -448 277 10122 20304 23605 22026
14470 22026 6734 6811 22983 42431 35403 4398 -14563 -18788 -8917 -11940 -10129 13606 30358
14457 30358 27152 15411 17502 31268 38321 25892 10364 3204 27834 44250 43265 39771 28607
14444 28607 11603 -4610 -20860 -14239 -19944 -30724 -6500 -4217 -8468 17463 27305 30331 17204
14431 17204 25184 26347 12658 6752 16837 26345 26409 33567 28741 31126 24286 21720 14460 43432
14417 43432 54841 44721 52252 30331 9 -10472 -2094 18595 1585 -17110 -24390 -7331
14405g331P561k3912l0243o627J584J6760N612J0518p379j0464K7817Q488J825
14392e791L646J591L5693j3816k9208k452J1514j4575o924K3785J1923N03k626
14379A3263j6621k6125k9551J0820J9954k451J0582J0606p074R718K4461J0085
14367B7667l4410k9135P515K7191K264l639j1120j3088J2650J1994Q037K642j0747
14354b179M34o942J3140L3250M732k5943M222J4814O896p418K6619r410l2482
14341A9733j4877j8371p362Q344L629j5442l260m797M919J5792K2638j7475N607
14328i22l647r190j200K0192R866l85J1177k9690l0403K1875K735l82p79M752
14314f001l848O26j286N421J5105J754j6903j6496r653l292R913J5827l921k278
$$ plain form
14405 -7331 230 -23682 -53925 -60552 -58968 -42208 -36596 -26078 -33457 -43921 -16104 -7616 -5791
14392 -5791 -2145 -554 35139 21323 -7885 -10337 1177 -13398 -20322 3463 15386 15889 13263
14379 13263 -3358 -29483 -59034 -48214 -28260 -30711 -20129 -9523 -16597 -6879 17582 27667
14367 27667 -6743 -35878 -28363 -1172 1092 -2547 -13667 -26755 -14105 -2111 5926 8568 -2179
14354 -2179 -1745 -8687 4453 37703 42435 16492 20714 35528 42424 35006 61625 52215 19733
14341 19733 4856 -13515 -20877 -12533 -8904 -24346 -27606 -32403 -27484 -11692 10946 -6529 -922
14328 -922 -4569 -13759 -14959 5233 15099 14714 25891 -3799 -34202 -12327 -9592 -9974 -10753 -6001
14314 -6001 -9849 -9223 -10509 -5088 10017 11771 -5132 -21628 -31281 -34573 -24660 -8833 -12754 -15032
14300a5032J6912p881j828R520O090J1437J9869k6782r287J2312J1902P310J9347
14287E3889q41j1777k3417k7277m031K4758J5501o598j4651n319j1587M54J1583
14274F87K007N589P335K188j0559j0670R178L18o473o308j8841m51n961Q739K23
14259b2999J289K0064j471j4389O822J9756J3901p756L102J7934O680r565k7969
14246E399M332k120k6199q4P389m7r835j0444J640J298Q525K5633K4769J905l539
14231B8622k687J5226P701l0226n578J766q725P316R286j7302p219Q596k037j2348
14217g609K457O63r633k4234q130J6770J3837M656k1592R474J486O916O149R197
14203D07p38P758l896j2589J1984j6068K2354J5468j8260l916j7006N358J6446
$$ plain form
14300 -15032 1880 -6001 -7829 1691 7781 19218 39087 12305 3018 15330 27232 34542 53889
14287 53889 53048 41271 17854 -9423 -13454 11304 26805 20207 5556 237 -11350 -10896 687
14274 687 2694 8283 15618 17806 7247 -3423 5755 6073 -400 -6708 -25549 -26000 -31961 -23222 -22999
14259 -22999 -21710 -1646 -3117 -17506 -10684 9072 22973 15217 18319 36253 42933 33368 5399
14246 5399 9731 7611 -18588 -18672 -11283 -11330 -21165 -31609 -29969 -28671 -20146 5487 30256 32161 28622
14231 28622 25935 41161 48862 18636 13058 14824 6099 13415 22701 5399 -1820 6776 4739 -7609
14217 -7609 -5152 -4489 -14122 -38356 -46486 -29716 -15879 -11223 -32815 -23341 -21855 -14939 -8790 407
14203 407 -331 7427 3531 -9058 2926 -13142 9212 24680 6420 2504 -14502 -9144 7302
14190G302K6382N605q229j8015j3124n687K2511k921j7451m124j0996j921K1281
14177F13K5441k1360j8375J3600J499N293J7127K4092r336l384l1034J3805j388
14164A6593O107q570q589l018J4051J5543j9958O276Q809K350j2926k3638L710
14151c260P299p840K7531K0144l893j7825j7935j9940R559M749J6748k0226j221
14138f110L1891Q846J5523L706K2148J8016J5518M801L0844o13l653p076n768
14125A28073k2831J154j6342J4357j3713j5900k0048r493K4196j6032m0509k0979
14113h067m228J408m605J2060K3223K227k565p775r355O894K0432j760N384q079
14099B5194O90J5007J803m408j3502O564j815q726j5338j5996p778J4605M370
$$ plain form
14190 7302 33684 39289 31060 13045 -79 -5766 16745 13824 -3627 -7751 -18747 -20668 613
14177 613 26054 4694 -13681 -81 1418 6711 23838 47930 38594 35210 4176 17981 16593
14164 16593 22700 14130 5541 2523 16574 32117 12159 18435 27244 29594 16668 -6970 -3260
14151 -3260 4039 -3801 23730 43874 39981 22156 4221 -15719 -6160 -1411 15337 -4889 -6110
14138 -6110 25781 34627 50150 53856 76004 94020 109538 114339 145183 144570 140917 133841 128073
14125 128073 105242 106396 90054 104411 90698 74798 54750 45257 69453 53421 12912 -8067
14113 -8067 -12295 -10887 -15492 -3432 19791 22018 19453 11678 2323 9217 29649 27889 33273 25194
14099 25194 25884 40891 42694 38286 24784 31348 29533 20807 5469 -10527 -18305 -3700 670
14086F70l570K1240m98j4563K467J4775K5375j3570k3554M994N412J1095j1573
14073A8700k3512Q87K3787R035J0515j3860j7793K369J3260K8009J4675j8650
14061D7422k8439j9861N916J3275k2997L237K3629K6857J398l0085k4663r572
14049a3883L2713K0120n160j5713O664j4718n736M868K830n960j5178R71J4484
14036F302J4632J6849k220k6978k0400N481k8444K6058K0273q537l1543j4354
14024d2881L718K767r913j2126J5723R333J5921N321J2217k4298m528K4405J6371
14011A2030L302j5557l7006r81J6925J8117P433J532j920O995O599m581J0012
13998B2900N214p241k6088L76K0106J1216n266J260K866r460L385J1565r411l3304
$$ plain form
14086 670 -2900 18340 17842 3279 5746 20521 45896 32326 8772 13766 19178 30273 18700
14073 18700 -4812 -3925 19862 28897 39412 25552 7759 10128 23388 51397 66072 47422
14061 47422 18983 -878 5038 18313 -4684 -1447 22182 49039 50437 20352 -4311 -13883
14049 -13883 18830 38950 33790 18077 24741 10023 4287 9155 11985 6025 -9153 -8182 6302
14036 6302 20934 37783 35563 8585 -11815 -6334 -34778 -8720 11553 3016 -28527 -42881
14024 -42881 -39163 -36396 -46309 -58435 -42712 -33379 -17458 -12137 80 -24218 -28746 -4341 12030
14011 12030 15332 -225 -37231 -38212 -21287 -3170 4263 5795 3875 10870 17469 12888 22900
13998 22900 28114 20873 -5215 -4839 15267 26483 21217 22477 25343 15883 19268 30833 21422 -11882
13984a1882K0728n508q029N546J7723M188P104j5280p333j818m173r835M602p47
13970d714J8978J3922j3104N647L356n080l1027M325p839q040J6214K7643k6332
13957f051j6856R734J7307L7N057j2570O739P995j369k6719j7861K3526K0597
13944I566l375q991k4334q565J8110M216K2449J5547n704q077m763J1781M4j2634
13930E270r468j2334L978J8585p26J4356L5844J3623j1843k3218j4651j2826l4724
13917b8134L55K0688k0797j3531J1206K2852j760L28J2568P049m028j3240O607
13904A63r354J546J4400J5762m58j0810j1918L380Q185J2369K1310j3565l0089
13891I21J239J1425P53o741l931j8006k303K2861K2538J8136q796k8332o262K4498
$$ plain form
13984 -11882 8846 3338 -4691 855 18578 22766 29870 14590 7257 5439 1266 -8569 -3967 -4714
13970 -4714 14264 28186 15082 20729 24085 19005 -12022 -7697 -15536 -23576 -7362 20281 -6051
13957 -6051 -22907 -13173 4134 4171 9228 -3342 3397 11392 10023 -16696 -34557 -11031 9566
13944 9566 6191 -2800 -27134 -35699 -17589 -13373 9076 24623 18919 10842 6079 17860 17904 5270
13930 5270 -4198 -16532 -12554 6031 5305 19661 55505 69128 57285 34067 19416 6590 -28134
13917 -28134 -27779 -7091 -27888 -41419 -30213 -7361 -9121 -8793 3775 10824 6796 -6444 163
13904 163 -9191 -7645 6755 22517 22059 11249 -669 2711 10896 23265 44575 31010 921
13891 921 2160 13585 14338 7597 3666 -14340 -16643 6218 28756 46892 38096 9764 3502 28000
13877B8000J9579j0936j7554k2230P006N421q552l0923k085K8368K3577P903j9030
13864H544n364k0472j3083K3420J4105n317o623K1702K5273K990k4972j9747M892
13851E348L7058j826k5959q730k233J1181o95p862o919k0996J0209J6755N267
13838A0598j2828j2662P060J9158O251o45j2417n997J4137O756j4678J8872j2586
13825A1019k5565J8840K3125M011k323k8124k784K549l638J7331q729j0516o549
13812a1353j5158O728Q569Q480J0645k50n579J5196J5059P949k9299j9067j0835
13799a8915R731l327m825o033N358q803j313J5151J4951M923l7611P612J0871
13786a2230M21n151j682M66k6264M774K3408J9950P815O868N750L4O034j2546
$$ plain form
13877 28000 47579 36643 19089 -3141 3865 9286 734 -30189 -32274 -3906 19671 27574 8544
13864 8544 3180 -17292 -30375 -6955 7150 1833 -4790 16912 42185 45175 20203 456 5348
13851 5348 42406 40580 14621 5891 3658 14839 14144 6282 -637 -21633 -11424 5331 10598
13838 10598 -2230 -14892 -7832 11326 17577 16932 4515 -1482 12655 19411 4733 23605 11019
13825 11019 -14546 4294 27419 31430 29107 983 -1801 748 -2890 14441 5712 -4804 -11353
13812 -11353 -26511 -19783 -11214 -2734 7911 7661 2082 17278 32337 40286 10987 -8080 -18915
13799 -18915 -9184 -12511 -17336 -23369 -18011 -26814 -28127 -12976 1975 6898 -30713 -23101 -12230
13786 -12230 -11809 -16960 -18642 -18176 -44440 -39666 -16258 3692 11507 18375 24125 24159 30193 17647
13772A7647j7023q639J9872J9518l31j7239J9394J6675L378K124j7340n619j5113
13759A7304l0570k133P714J2447j859k6111J452R657l4776R175P637p27J5813
13746a4977N687q412K271O11P426L2355J6945Q351j5909l2814p050J0325j5427
13733a0618q223j6901l462J3281J0697o46M148J9917J3170p539J3043M317j8739
13720A2445j8848j7922L537K4425K984k0380q1o460j2357J4882P160P899J749
13707i67n606j8816J2841N066q144o590K7177m21r147m032J382L851l505q286
13693a5197J8100J1338k0035j0645R485P128J9460j7999q433K6075J3264j8236
13681A4305j2684J9118J8414J2204k07k9233j9100L924R697j8816n256m471k048
$$ plain form
13772 17647 624 -8015 11857 31375 31044 13805 33199 49874 53252 55376 38036 32417 17304
13759 17304 -13266 -15399 -7685 4762 2903 -23208 -21756 -12099 -46875 -37700 -30063 -30790 -14977
13746 -14977 -9290 -17702 -15431 -14820 -7394 24961 41906 50257 34348 1534 -5516 4809 -10618
13733 -10618 -18841 -35742 -39204 -25923 -15226 -15872 -11724 8193 21363 13824 26867 31184 12445
13720 12445 -6403 -24325 -20788 3637 6621 -13759 -13840 -20300 -32657 -17775 -10615 -2716 -967
13707 -967 -6573 -25389 -12548 -7482 -15626 -22216 4961 4540 -4607 -8639 -7257 -3406 -6911 -15197
13693 -15197 2903 14241 -5794 -16439 -6954 174 19634 1635 -6798 19277 32541 14305
13681 14305 1621 20739 39153 51357 51150 21917 2817 6741 16438 -2378 -7634 -12105 -14153
13668a4153J5345k151n577M953P545N949k008o032m956m460K732K1701K2707q589
13654C3006k2100j0955r706k7175l0360J3470M6474n401l1780K1537K5891J4707
13642A7608n639l180k2350N990K0629j7729n12K6470J1804k257j5098N391l18
13629B0809K0072M678k9027k4353R276K2887J7093j1985j4234q858K907N309j0878
13616C696n410l223j2070p731Q580K2775J1017k1708m426j979J0752j079m505
13603e311J0116M475q695K1017m314j0960J9368J2296o285K431j9965k0615K3234
13590A6792j7414j7194n181M010J9001O908M732k2909J737J2956j0614k324p25
13577a0225j5526K793J2961K884k2791J2787J5837K729k7186J833K374n851k83
$$ plain form
13668 -14153 1192 -959 -6536 -1583 5962 11911 9903 3871 -1085 -5545 -2813 18888 41595 33006
13654 33006 10906 -49 -9755 -36930 -67290 -53820 -7346 -12747 -44527 -22990 2901 17608
13642 17608 11969 8789 -13561 -7571 13058 -4671 -5183 21287 33091 30834 15736 21127 20809
13629 20809 40881 45559 16532 -7821 1455 24342 41435 29450 15216 6358 9265 14574 3696
13616 3696 -1714 -4937 -17007 -24738 -16158 6617 17634 -4074 -8500 -10479 273 -806 -5311
13603 -5311 4805 9280 585 21602 17288 6328 25696 37992 31707 34138 14173 -6442 16792
13590 16792 -622 -17816 -22997 -18987 14 6922 11654 -11255 -9518 3438 -7176 -9500 -10225
13577 -10225 -25751 -22958 -9997 -7113 -29904 -17117 -1280 1449 -25737 -23904 -21530 -27381 -27664
13564b7664Q342Q360J0867J8565j2850P942j805j5217j9989M760J9654j907K0481
13551A9539j3899k0440j5988J0682J8720L827j8836j7486J0488J897K1636j635
13539a495K4189P915n914j9540k7910N562J0567N768K2374j6569q678p591N81
13526a0741J3455m51n786p242O927P311j6948k3331j5251K6345K8253j402R616
13513A0755p403o032L81n941r264P950j3493q597q796m284K3410K0782j571J0149
13499H046j161r978n236O426L657R882j3162n915Q700K7687J8596r043j7668r095
13485A1736k1248o367P480K744K105P728K3318n980j6726M053K0268l76k0669
13472H066r244k4355j5436J0750K8119k009j4151K8464J1965J930L149R70J0282
$$ plain form
13564 -27664 -19322 -10962 -95 18470 5620 13562 11757 -3460 -23449 -18689 965 -942 19539
13551 19539 5640 -14800 -30788 -20106 -1386 2441 -16395 -33881 -23393 -21496 140 -1495
13539 -1495 22694 30609 24695 5155 -22755 -17193 -6626 -858 21516 4947 -3731 -11322 -10741
13526 -10741 2714 2263 -3523 -10765 -3838 3473 -13475 -36806 -52057 -25712 2541 1139 10755
13513 10755 3352 -2680 -2299 -8240 -17504 -9554 -23047 -31644 -40440 -44724 -21314 -532 -2103 8046
13499 8046 6885 -3093 -8329 -1903 1754 11636 -1526 -7441 1259 28946 47542 38499 20831 11736
13485 11736 -9512 -15879 -8399 -5655 -3550 4178 27496 21516 4790 8843 29111 28735 8066
13472 8066 -1178 -25533 -40969 -30219 -2100 -4109 -18260 10204 22169 24099 27248 28218 38500
13459C8500j9293m853n933j589M961M202j4966j2884J9700J1295p921K935K575
13446A6729m252J6130O671l400j9524k676L4259J6476J3115k2552m1117J8257
13434B8116M443r072j8018n889o294K4098K1892M690j0600l444k0004j241K2687
13421C1364K089j2267o552k6474m0119p168J2232N4293P083j8686q545R744J6952
13408A3946Q878o74q235q562p42K2071J112L98j5785l2717K612R749J0883K4847
13394B7781P878K487j1131j581R57r119L05k163l0257J264K2316O609j140j701
13380A2505K4479J8216j7791j8821j6768R119K6126j680j0555J4207L462L8k1827
13367B0710l877q464k2867m749k390K4288K6131j97k4781l7906N982K9390Q439
$$ plain form
13459 38500 19207 14354 8421 6832 11793 15995 1029 -11855 7845 19140 11219 14154 16729
13446 16729 12477 28607 35278 31878 12354 9678 43937 60413 73528 50976 9859 28116
13434 28116 32559 23487 5469 -420 -6714 17384 39276 43966 33366 29922 9918 8677 31364
13421 31364 33453 21186 14634 -11840 -51959 -59127 -46895 7398 14481 -4205 -12750 -3006 13946
13408 13946 22824 22150 13915 5353 4611 26682 27794 28192 12407 -20310 -17698 -7949 2934 27781
13394 27781 35659 38146 27015 25434 26391 17272 17577 15414 -14843 -13579 8737 15346 14206 12505
13380 12505 36984 55200 37409 18588 1820 10939 37065 35385 24830 39037 42499 42537 20710
13367 20710 16833 8369 -14498 -19247 -21637 2651 28782 28585 3804 -34102 -28120 1270 9709
13354I709n651k642J4491O454q612j4725O685m563K379Q554p342j5234M078K5906
13340A9487K6539J5078j6241j4946j0429o467R567r502M216J6225n519j4316K919
13327A6611k965K3271p298N717r67k5145j4120K3886J7322L046k0283q918r608
13314E49q938J8685L5289L807l4147j9468J6685q83j6037k0115J587o19P223J9638
13300C256J150j0940j2709J5064l053O842j2590O24K7675J1126R292K692j3111
13287B5318l9132J0220L600K0318Q383j5815l5176J5599L4858K1198J829k4596
13275B6604N205j9754j3745l227l882N094K027N364K2565l707N621p166L790O547
13261C1336J8441N287p702k7598j2667P063J2572p401J808J771M922J7225j1292
$$ plain form
13354 9709 4058 1416 15907 22361 13749 -976 5709 1146 3525 12079 4737 -10497 -6419 19487
13340 19487 46026 61104 44863 29917 19488 13021 22588 13086 17302 33527 28008 13692 16611
13327 16611 13646 36917 29619 35336 34369 9224 -4896 18990 36312 39358 19075 10157 549
13314 549 -8389 10296 45585 49392 15245 -4223 12462 11579 -4458 -24573 -22986 -23605 -16382 3256
13300 3256 4406 -6534 -19243 -4179 -7232 -390 -12980 -12356 15319 26445 35737 38429 25318
13287 25318 -13814 -3594 6 20324 28707 12892 -22284 -6685 28173 49371 51200 26604
13275 26604 31809 12055 -1690 -4917 -8799 -3705 -1678 3686 26251 22544 28165 20999 24789 31336
13261 31336 49777 55064 47362 19764 7097 14160 26732 19331 21139 22910 27832 45057 33765
13248C3765j275J8385k522m474j886j8595k5167j1623L2391J576n733k0128Q261
13235B975J1304K457j7857J1237O456n975J6093J7581N391l344j0333j718O743
13222D1010j0771k2174J303r504N510K3435J945k7729l531L2883J1972o85j5399
13209B8265q084L182k2498j4027m779K065o066K6625P39r503j484k4878N018K9517
13195D092L0081j2878o758j880O827J2700n163j2126L675R418j9003j1907j1076
13182a3998j839J5776m007J9324P783j9133j0617p380K9246P543k2813r11K4273
13169B3247L346n623K4042r741j636j0464j387J3772j5651M083K669J1032j363
13156C6326K521j4115J6572Q240n911j737j6524j6760n44N832j0070j2244M377
$$ plain form
13248 33765 32490 50875 48353 43879 41993 23398 -1769 -13392 18999 20575 14842 -5286 2975
13235 2975 14279 16736 -1121 10116 16572 10597 26690 44271 49662 46318 35985 34267 41010
13222 41010 30239 8065 9368 -136 5374 28809 30754 3025 -506 32377 44349 43664 28265
13209 28265 20181 23363 865 -13162 -17941 -15876 -21942 4683 5422 -4081 -5565 -30443 -25425 4092
13195 4092 34173 21295 14537 12657 19484 32184 27021 14895 18570 27988 8985 -2922 -13998
13182 -13998 -15837 -61 -4068 15256 23039 3906 -6711 -14091 15155 22698 -115 -1026 23247
13169 23247 26593 20970 45012 35271 33635 23171 21784 35556 19905 23988 26657 37689 36326
13156 36326 38847 24732 41304 49544 43633 41896 25372 8612 8068 13900 3830 -8414 -4037
13143d037K165K3442n213R722J5545J5571j4381k6476l052P666L342Q87p062M590
13129B2709p820J1362K125m633J6279n768l4345R642J8084J8527j2603j6506k8
13116A7025K0016K0067o753j0642m437L670j2876M835R668M796J9312j7762l9006
13103G913l43J5046k638K822r890K494l808k1620M20K3293N930P536K6749O692
13089F0596j068J8174r97j7973k3833J7613L1380L9061J0568J5527L157o896J0268
13076A55577J9759N3256N2264P8253J23621J89279K90683L25206L66706M00210
13066B054814L17328J48039J8165l3807k17545l75790l73504k92971k85398k56051
13056G03280j80086r6313q4443q3546o5163k1938K746j0584j4340j1357k7316
$$ plain form
13143 -4037 -1872 21570 16357 26079 41624 57195 42814 16338 13286 20952 24294 25181 18119 22709
13129 22709 14889 26251 28376 23743 40022 34254 -91 9551 27635 46162 33559 17053 17025
13116 17025 37041 57108 50355 39713 35276 38946 26070 30905 40573 45369 64681 46919 7913
13103 7913 7570 22616 19978 22800 12910 15404 11596 -10024 -9604 13689 19619 27155 53904 60596
13089 60596 59528 77702 76705 58732 34899 52512 83892 122953 133521 149048 152205 145309 155577
13076 155577 175336 228592 280856 359109 482730 672009 962692 1287898 1654604 2054814
13066 2054814 2372142 2520181 2538346 2504539 2286994 1911204 1537700 1244729 959331 703280
13056 703280 523194 426881 342438 258892 193729 171791 174537 163953 149613 138256 110940
13045A10940l7602j9387L1857K5959j3559k2581r591j9516N390K6340O384n576
13033G9058K3443J4565j4646l3267m612n601k3986J2343R922K8790j7004j9196
13021D9809o965l065m704r65P301J2647L785k9104j5921J8164J1071J2202j6813
13008C7442j5423j8709l313q89J4848P52j8692M530j0691M568J8943O988N323
12995B5677O966l991j0749J2522P268k2605J764M346n046N851l63M639N407L0106
12981F1792L9j4369p576r62l986q72k0822n317J8316m154l578n926o600M719K3422
12966C4126j0066k5923L1993M0200J491j9614m086L165k3705J597p912j2416K1804
12953C0654J9223J7162o33J1819J820L691k4647l0695J4685M263k241J5378J1432
$$ plain form
13045 110940 73338 53951 85808 111767 98208 75627 66036 46520 51910 78250 84634 79058
13033 79058 102501 117066 102420 69153 64541 58940 34954 47297 57219 86009 69005 49809
13021 49809 42844 39779 35075 34110 41411 54058 57843 28739 12818 30982 42053 54255 37442
13008 37442 22019 3310 -3 -892 13956 14708 -3984 546 -10145 -5577 13366 20354 25677
12995 25677 32643 28652 17903 30425 37693 15088 16852 21198 16152 22003 21640 26279 31686 61792
12981 61792 61831 47462 39886 38924 34938 34066 13244 7927 26243 22089 18511 12585 5985 10704 34126
12966 34126 24060 -1863 30130 70330 71821 52207 48121 51286 27581 29178 21266 8850 30654
12953 30654 49877 67039 66406 78225 80045 83736 59089 28394 43079 47342 45101 60479 71911
12940G1911j9060r754k0287j177j4524K9486r48j0379M77l112k489o137J0418
12927B4425j2513p192M274J7422K1647K3565j8993j0631R702J2224R384K0018
12915I3332L985j6750k8776R001l445j8094j2384j290m954j6717q999O893Q77
12902B679K5931J9101J2188N636k3774L369k613j161J1818p699o822P035K6508
12889G2196K1579K554K751j4658j4478M090K056Q212J8180J142L0841K2995M4869
12876B02329L5262L1292L9841K7298k564j0814J133m310N847J5023p501j3266
12864C19570j1612J0311l5936m2407k0136J3200j3577o6786l3094j1112k0217
12853H8204J4544K4697m557R38P096P150J7272P155k8669j8036j1090L6051J9472
$$ plain form
12940 71911 52851 43097 22810 21633 7109 36595 35647 25268 25745 22633 20144 14007 24425
12927 24425 11912 4720 8994 26416 48063 71628 52635 42004 51706 63930 73314 93332
12915 93332 97317 80567 51791 60792 57347 39253 26869 25579 20625 3908 -5091 1802 2679
12902 2679 28610 47711 59899 65535 41761 45130 42517 41356 53174 45475 38653 45688 72196
12889 72196 93775 96329 99080 84422 69944 74034 76090 84302 102482 103624 134465 157460 202329
12876 202329 237591 268883 308724 336022 333458 322644 323777 319467 325314 340337 332836 319570
12864 319570 307958 318269 282333 239926 219790 232990 219413 152627 119533 108421 88204
12853 88204 102748 127445 122888 123826 130922 138072 155344 162499 133830 115794 104704 140755 160227
12840A60227n569k595O537k3331l9743n499l393J5082J3795l903j2078o116q481
12827H4933l3422k496K152j8323K0488L4186K925n412R996N681j6438j4263O27
12814G0634K489J1211L660l2153j0055k1270J2596J4762M3559K2098K2757n758
12802A34530j6195K551K049j0170J6396K4661J119L754J6691m943l100j1451j4672
12789A41220l0161j5631J3779J3976K6686K2211J2260k253k1418r349l4202r099
12777A08019J4116M115k5761q156j549M418p35o257K984k1921r479J4925m857
12764F9862n5981k4370K5970J4680k9004m258L9749J4454J5755K2328J6663L5109
12752A40957L4266K6250M4783O8555J02105Q3895O0042O4743Q1142Q5121M1347
$$ plain form
12840 160227 154658 152063 158600 135269 95526 90027 86634 101716 115511 111608 99530 93414 84933
12827 84933 51511 49015 51167 32844 53332 87518 90443 85031 95027 100708 84270 70007 70634
12814 70634 73123 84334 87994 55841 45786 24516 37112 51874 95433 117531 140288 134530
12802 134530 118335 120886 122935 112765 129161 153822 154941 158695 175386 170443 167343 155892 141220
12789 141220 111059 95428 109207 123183 149869 172080 184340 182087 160669 151320 117118 108019
12777 108019 122135 126250 100489 92333 90784 95202 94467 88210 91194 69273 59794 74719 69862
12764 69862 13881 -10489 15481 30161 1157 -3101 36648 51102 66857 89185 105848 140957
12752 140957 175223 201473 246256 314811 416916 500811 560853 625596 706738 791859 833206
12741H33206N413L0492k1186p1259l3747m3966o6406q7209p0310o5075k1255k2399
12729C66299q246j2794L0959M175k1622P11J4080P102m756J9870J7964J3325K9247
12716D56314J2842Q302K075j0449M787P607j7212Q256J7666Q802n888j2018p531
12703D73553L052M698K7031L2012J6554J6086J3627J5625J4798j9272J7476k17
12691F15023J0485L3902K5177L0522L5448M5020M2980L5690K3460K3367K9650
12680I50724L0859R019K3742N5210K1269O191J017O968J3636L1468L3284L6064
12668A219451K3510P4817J02207P0691P4700P6486P8725P3982Q2001J26422R1924
12657B094916R4432J11824J28356J18903J23172J94943K01623J98290K28755K61880
$$ plain form
12741 833206 838619 869111 847925 776666 742919 698953 632547 545338 475028 409953 388698 366299
12729 366299 358053 345259 376218 380393 358771 359482 373562 380664 375908 395778 413742 427067 456314
12716 456314 469156 477458 479533 469084 473871 481478 464266 472522 490188 498990 493102 481084 473553
12703 473553 476605 481303 508334 540346 556900 572986 586613 602238 617036 597764 615240 615023
12691 615023 625508 659410 684587 715109 750557 795577 838557 874247 897707 921074 950724
12680 950724 981583 990602 1014344 1069554 1090823 1097014 1098031 1104999 1118635 1150103 1183387 1219451
12668 1219451 1242961 1317778 1419985 1490676 1565376 1641862 1720587 1794569 1876570 2002992 2094916
12657 2094916 2189348 2301172 2429528 2548431 2671603 2866546 3068169 3266459 3495214 3757094
12647C757094L21805L58431L70176M00238N07172N25292N35496N64767N99851
12638G940322O72510P50458Q45565J010424J242888J538145J955548K515878L387087
12629B1858825M543959O019830Q239638J1693564J6981499K5530677L8762350
12622A33630342N3177558O0064078O5333947P6156526O0113809J7747170L950184
12615D70173614l969432m6483222p2625153o4494379n8833591n7350456m6542649
12608A19874732l1933822k1093577j4511464j0275390p487475n739615m504923
12601B4328466l578634k863969k327523j897866j607261j346394j087859r30597
12593H688363q46439o83581n77937m87818m50123l93760l29476k99666k57989
$$ plain form
12647 3757094 4078899 4437330 4807506 5207744 5714916 6240208 6775704 7340471 7940322
12638 7940322 8612832 9363290 10208855 11219279 12462167 14000312 15955860 18471738 21858825
12629 21858825 26402784 32422614 40662252 52355816 69337315 94867992 133630342
12622 133630342 186807900 246871978 312205925 388362451 448476260 466223430 470173614
12615 470173614 466204182 419720960 347095807 282601428 223767837 166417381 119874732
12608 119874732 87940910 66847333 52335869 42060479 34573004 28833389 24328466
12601 24328466 20749832 17885863 15558340 13660474 12053213 10706819 9618960 8688363
12593 8688363 7841924 7158343 6580406 6092588 5642465 5248705 4919229 4619563 4361574
12584D361574k39957k25063j99901j69926j62104j81284j73379j74627j59035
12575B676298j21316j32950j35514q5571p1543r1348o5789q4174o7891n9491o9362
12564A691349n2713m4384n2129o6173p3414p2829p5020n2005n0966m4132k6422
12553A081162l9880k4952p996k3958l9962j9407l1106l6528k6839q917j3948j5905
12541G91764l1671l2844m55K104j0405j0192k4217k6361j5384j5137k034J9386
12529F44554j4830k8268j6334k7814m4541k4650k8347k7210k263l2198J856J9965
12517D19920n574m636j5122L186K028j1023L0630m196k0817J5603J8410r163K1560
12504D40806K8059j1854R814L76L3258N7124M8621M1281L6032J5859o981j6058
$$ plain form
12584 4361574 4121617 3896554 3696653 3526727 3364623 3183339 3009960 2835333 2676298
12575 2676298 2554982 2422032 2286518 2200947 2129404 2038056 1972267 1888093 1820202 1760711 1691349
12564 1691349 1638636 1594252 1542123 1475950 1402536 1329707 1254687 1202682 1151716 1107584 1081162
12553 1081162 1041282 1016330 1008334 984376 944414 925007 893901 857373 830534 821617 807669 791764
12541 791764 760093 727249 726794 728898 718493 708301 684084 657723 642339 627202 625168 644554
12529 644554 629724 601456 585122 557308 512767 488117 459770 432560 430297 398099 399955 419920
12517 419920 414346 409710 394588 397774 399802 388779 419409 415213 394396 409999 428409 419246 440806
12504 440806 468865 457011 466825 467201 500459 557583 606204 647485 683517 699376 692395 676337
12492F76337l1071j5342j0840k2666n4835l6631n919j0937o766o186K5869K466
12480E03479p510k69M245l6605k4936R409J2458r419Q539j0226j7444p453p385
12467D16883j6478l8459k3768n150l224k7988J5293J4341J2516L797j101J1040
12455C57702l9874P85K620j2534o848P141J6851j9395k8214m3727L800J1857l6549
12442B13615j8051j94j3028J0682J1751J53M944J4362q704n806p877j9174o396
12429A76277J963n156q33O483m325j1218p761L0959J2006j5231m172j2755j8875
12416A47362J2571Q731J734P13o313J2184J1766J334j3538j0182q699l579k2848
12403A31236K763P091j0959j5975j6061j1194L136J6768M719n2148m3842l931
$$ plain form
12492 676337 645266 629924 619084 596418 541583 504952 499033 488096 481330 475144 501013 503479
12480 503479 495969 495700 499945 463340 438404 447813 460271 450852 459391 449165 431721 424268 416883
12467 416883 400405 361946 338178 333028 329804 301816 317109 331450 343966 347763 346662 357702
12455 357702 317828 318613 321233 308699 301851 308992 325843 306448 278234 234507 238307 250164 213615
12442 213615 195564 195370 182342 193024 204775 204928 209872 224234 215530 209724 201847 182673 176277
12429 176277 178240 173084 172251 178734 174409 163191 155430 186389 198395 183164 178992 166237 147362
12416 147362 159933 168664 170398 171111 164798 176982 188748 190082 176544 166362 157663 154084 131236
12403 131236 133999 141090 130131 114156 98095 86901 90037 106805 111524 59376 15534 11603
12391A1603l598k619R366j2958p064K9906K3338K9213K1207J3148k485J303M48
12378A10808p319J2102o479J3606N507j844j0463p416j5760p355p650O776M422
12365H8935L811J2901k2095k9598j0300l2502K6822M1476K1878K903O952J3836
12353A25019J9034Q844j8217r913J3752K020N410r120j8765k5125j1063J5120
12341I6996Q776o183K674J012j3906J810P783Q22l524k5705O031K4507K0384L779
12327A25256k4949j4437J3103J6720j6558q754k2728k954j4748j121k64L3028
12315H1594k1235j2669n273j6986L2447K0287J9572j256j938K5813O908m098m067
12302A19099j0621q773j220J481k8461k4045J426O89o587Q991Q872J2607o842
$$ plain form
12391 11603 8005 5386 14752 1794 -5270 24636 47974 77187 98394 111542 109057 110360 110808
12378 110808 103489 115591 109112 122718 128225 126381 115918 108502 92742 85387 77737 84513 88935
12365 88935 92746 105647 83552 53954 43654 11152 37974 79450 101328 104231 111183 125019
12353 125019 144053 152897 134680 124767 138519 140539 145949 136829 118064 92939 81876 96996
12341 96996 105772 99589 102263 103275 89369 91179 98962 99784 96260 70555 76586 101093 121477 125256
12327 125256 100307 85870 98973 115693 99135 90381 67653 64699 49951 48830 48566 81594
12315 81594 60359 47690 42417 25431 57878 78165 97737 96481 94543 120356 127264 123166 119099
12302 119099 108478 99705 98485 99966 71505 47460 48886 49575 42988 51979 60851 73458 66616
12289F6616J1821k1708j6872J0756O995r807j394J4862q774j0637m227Q9K8115
12276F5835p353j9254J0952L167q911k6005Q033K6033J9868k4928j1943J7414
12264E2908K7244r044j3308m741j8521p434r030J6832j4957j9501J7789Q844R968
12251C7049j9446j2170L1291J4981j1965m076R551P290n931N887L540j679N420
12238E9742j3252j287R653l151M15J1088N594O555p813j3048M102k4384j2434
12225B1780R866o727K0342K2823o921j3538K0093K4489j3223k6532k9197j3764
12213I491J5873N757j2629J0862J2883M37j2936j2741J5001L964j4363K6304J3549
12200F1452J7471N976l325k1350j3912k3226m097j973P074L2206o166j0988j0192
$$ plain form
12289 66616 78437 56729 39857 50613 57608 47801 46407 61269 52495 41858 37631 37720 65835
12276 65835 58482 39228 50180 53347 44436 18431 26464 52497 72365 47437 35494 52908
12264 52908 80152 71108 57800 53059 34538 27104 18074 34906 19949 448 18237 27081 37049
12251 37049 17603 5433 36724 51705 39740 35664 45215 52505 46574 52461 56001 54322 59742
12238 59742 46490 45203 54856 51705 52120 63208 68802 75357 67544 54496 58598 34214 21780
12225 21780 31646 24919 45261 68084 61163 47625 67718 92207 78984 52452 23255 9491
12213 9491 25364 31121 18492 29354 42237 42674 29738 16997 31998 35962 21599 47903 61452
12200 61452 78923 84899 81574 60224 46312 23086 18989 17016 24090 56296 50130 39142 28950
12187B8950R592l356K549L655P45K579n494L2295J5752j1037j2590M438J167M0730
12173A09975L1166Q1328J03378O7264J22522K03454K67363L18879L78182M02594
12163B086105K60339J15138M6902n0779k78670l65083l15072l00800l01733k11855
12153F84492j22226r9145r5650o6650m4238l0299k3907l2754j3166m0046k9943
12142H6468L944L267N555j9914n874J763k9303p315Q353Q605Q119n800M977O63
12128F3508J4176L3189j6092k7863j5777M268o268l2104Q643l130R232J4208K6203
12115G2193m949k5263m341j0356Q468J4008j5936l51J6596m657k6253J8197J9181
12102E6537K726r261O592k4420j2559P188L499M618r60n258K4514K8572p11j2676
$$ plain form
12187 28950 38542 35186 37735 41390 42135 44714 39220 71515 87267 76230 63640 68078 69245 109975
12173 109975 141141 222469 325847 393111 515633 719087 986450 1305329 1683511 2086105
12163 2086105 2346444 2461582 2508484 2457705 2179035 1813952 1498880 1198080 896347 684492
12153 684492 562266 463121 367471 300821 256583 226284 202377 169623 156457 116411 86468
12142 86468 90412 93679 99234 79320 73446 75209 45906 38591 46944 55549 63668 57868 62845 63508
12128 63508 77684 110873 94781 66918 51141 55409 49141 17037 25680 22550 31782 45990 72193
12115 72193 67244 41981 37640 27284 35752 49760 33824 33473 50069 45412 19159 37356 56537
12102 56537 59263 50002 56594 32174 19615 26803 30302 34920 33960 28702 53216 81788 81077 68401
12088F8401j909j0761j970P081j7566o101Q201J7590m832k0680r771J438J7323
12075D6444O627r32M942j9246k9623j930K1445J9464j0570r228j442P085J0785
12062D3821j7694j3907j1128P565J3348R052O039Q26j3149k03Q829J7269j8151
12049C2517k0494j2889R358j9146M605N866M2687J4611r174j4338k4021l998K1414
12036B6998p305j5460K0124N368O245k283j9904j4598J0892K2098l471J754j4527
12023A5931q057j326j546J3123J5493j9451r199K7333m971n802J2533j028N653
12010C8686N213q920K2026r290k1470l956Q740n720J4680n825J775L0098j3158
11997E2879j0990k264l1714M504L229r344J3k2542k1976m805K6559J0805k070
$$ plain form
12088 68401 66492 55731 53761 60842 43276 37175 45376 62966 58134 37454 27683 29121 46444
12075 46444 53071 52139 57081 37835 8212 6282 27727 47191 36621 27393 25951 33036 43821
12062 43821 26127 12220 1092 8657 22005 31057 37096 37922 24773 24570 33399 50668 32517
12049 32517 12023 -866 8492 -10654 -6049 -183 42504 57115 47941 33603 9582 5584 26998
12036 26998 19693 4233 24357 29725 35970 33687 13783 -815 10077 32175 28704 30458 15931
12023 15931 7874 6548 5002 18125 33618 14167 4968 32301 27330 21528 34061 33033 38686
12010 38686 43899 34979 57005 47715 26245 22289 31029 25309 39989 34164 35939 66037 52879
11997 52879 41889 39625 7911 12415 15644 6300 6313 -16229 -38205 -43010 -16451 -5646 -7716
11984g716J5558J1539j9991j6662q478K2376J8660q462j8126J9326r0j0959n183
11971h208J4155N860k2866n866L4420L0295k252k3505k2802m055m799m808O342
11958h089o395j2670J1800J6788r578k7398j7232J6393K8476J1170m678J0355
11946H942J7556J9747j3261j3534p806j3043N680l314O276J2287p448m6946j294
11933c6158J2918J2979K084J4456N501J6412j0085l4219p605K8943L1141J4316
11921E0683N068o619l1390j1692r912k2145k0000J855J4566J5996J7317j3335
11909i608j7417j5743k663J3685k450J76J7337j3295M255K9352J4720j4326j1679
11896g656j0826j1237J101K027N981K8826n424k0458m810J3501L4065P975Q449
$$ plain form
11984 -7716 7842 19381 -610 -17272 -25750 -3374 15286 6824 -11302 8024 7934 -3025 -8208
11971 -8208 5947 11807 -11059 -16925 17495 47790 45538 22033 -769 -4824 -9623 -14431 -8089
11958 -8089 -14484 -27154 -15354 1434 -8144 -35542 -52774 -36381 -7905 3265 -1413 8942
11946 8942 26498 46245 32984 19450 11644 -1399 4281 967 7243 19530 12082 -34864 -36158
11933 -36158 -23240 -10261 -8177 6279 11780 28192 18107 -16112 -23717 5226 36367 50683
11921 50683 55751 49132 17742 6050 -3862 -26007 -46007 -44152 -29586 -13590 3727 -9608
11909 -9608 -27025 -42768 -45431 -31746 -34196 -34020 -16683 -29978 -25723 3629 18349 4023 -7656
11896 -7656 -18482 -29719 -28618 -26591 -20610 8216 2792 -17666 -22476 -8975 25090 33065 41514
11883D1514P141k489j6487j7943k550l5566r632J2384l326j3050L789J0860J7945
11870g410L8894M333k1134j6013m740k246Q410M153j6912l161K5994L683j1597
11857B254j5545R917j3631J0059k1700N179J9087L0950k900j1556r200P216j6010
11844e880j1761n288m86O060Q00J3247o388K2230J6003M462J3132N450k5385l8585
11830a2389j0294K6613K7255l266O923r998j9996J4159J4809k1382J951L17n333
11817I369K867Q596J9536p162L625m854k973q179J725r445n574m80j6185J312
11803g822J3325p375k3812J0826J7943O081P26j0040j6615Q156R703j9571p998
11790b6473L2730P020K947L559n020o679q617q416J2181j2522J2119J495N357
$$ plain form
11883 41514 48655 46166 29679 11736 9186 -26380 -36012 -23628 -26954 -40004 -36215 -25355 -7410
11870 -7410 31484 35817 14683 -1330 -6070 -8316 94 4247 -12665 -15826 10168 13851 2254
11857 2254 -13291 -3374 -17005 -6946 -28646 -23467 -4380 26570 23670 12114 2914 10130 -5880
11844 -5880 -17641 -22929 -23415 -17355 -16555 -3308 -9696 12534 28537 32999 46131 51581 26196 -12389
11830 -12389 -22683 3930 31185 27919 34842 24844 4848 19007 33816 12434 14385 14702 9369
11817 9369 12236 20832 40368 33206 36831 31977 29004 20825 22550 13105 7531 7051 -9134 -7822
11803 -7822 5503 -1872 -25684 -14858 3085 9166 9892 -148 -16763 -8607 1096 -18475 -26473
11790 -26473 6257 13277 16224 19783 14763 8084 -533 -8949 3232 -9290 2829 4324 9681
11777I681L950K443j3714n086J764j5620r453j627J904o776J9676L548Q116K7455
11763B6261n465j527P317j2803k6517J3918O670k2329J5382r15r502K6202K0253
11750C6945q196l0387k523j129k9586j4308J2346L292K4602J6644O726N940J3793
11737C4159q595R047k2469k4658Q641N016O935J2061m289m971m167q461K1489
11724A9738J706j6903N123K5554n903l440j2015j0668j875M105j1637M165J9710
11711A7660l447j2666q76J3129M153q726m413j6690l2005J5864K2275k0969N388
11698b1323L1466P523j1449J9769J0208N006k7101l9696r954M124L77n326m699
11685d1075J9155J3231K484l874N94J440J650j6343k0962K4418n839O586J8889
$$ plain form
11777 9681 13631 16074 2360 -2726 -962 -16582 -26035 -27662 -25758 -32534 -12858 -9310 -1194 26261
11763 26261 20796 19269 26586 13783 -12734 1184 7854 -14475 907 -8 -9510 16692 36945
11750 36945 28749 -1638 -4161 -5290 -34876 -49184 -36838 -33546 -8944 7700 14426 20366 34159
11737 34159 25564 34611 12142 -12516 -3875 1141 8076 20137 15848 10877 6710 -1751 19738
11724 19738 21444 4541 9664 35218 29315 25875 13860 3192 1317 5422 -6215 -2050 17660
11711 17660 14213 1547 671 13800 17953 9227 4814 -11876 -43881 -28017 -5742 -26711 -21323
11698 -21323 10143 17666 6217 25986 36194 41200 14099 -25597 -35551 -31427 -31050 -36376 -41075
11685 -41075 -21920 -8689 -6205 -10079 -9485 -8045 -6395 -22738 -43700 -19282 -25121 -18535 354
11672C54R426o109M321j4847Q475M652j3402k030p590N909K7942Q721J1782j519
11658C6085q933l265J6552L627j0831k599n052M304q749l0513r24O946m898k8616
11644c6866J7575J2607J792N979O685j4954j1760o35j0593J1600q060k0931M099
11631d3462M494J7864J359Q088J2780O254j9040l3834m102K767J6496J9592k3536
11618c4280N721m0J4321m156r177K2995J851p885P3P842p983r355K0887M237l5055
11603c0004j5463L1642R293k7364Q41O517j5723K8425K4507N573J1320l879p358
11590A8327q61k6056J0121J1109k042J918j3271j8341j5800l124K0117J3838l522
11577g587m771k894N663p900R016J3236R784j8907k9743N795K7076P154j8193
$$ plain form
11672 354 9780 3671 7992 -6855 1620 6272 -7130 -9160 -16750 -10841 17101 25822 37604 36085
11658 36085 27152 23887 40439 44066 33235 30636 25584 29888 21139 -9374 -10298 -3352 -8250 -36866
11644 -36866 -19291 -6684 -4892 1087 7772 -7182 -18942 -19577 -30170 -18570 -26630 -47561 -43462
11631 -43462 -38968 -21104 -19745 -11657 1123 7377 -11663 -45497 -49599 -46832 -30336 -10744 -34280
11618 -34280 -28559 -28599 -14278 -18434 -27611 -4616 -2765 -10650 -10577 -2735 -10718 -20073 814 5051 -30004
11603 -30004 -45467 -13825 -4532 -31896 -31055 -24538 -40261 -11836 12671 18244 29564 25685 18327
11590 18327 17466 -8590 1531 12640 10598 12516 -755 -19096 -34896 -38020 -17903 -4065 -7587
11577 -7587 -12358 -15252 -9589 -17489 -8473 4763 14547 -4360 -34103 -28308 -1232 5922 -12271
11564a2271J1365J7642q975p834O665r869j0034J0720j8738M149p655P669m832
11551b1998j5318N517J7362R786L29K248m909l4741L04Q353J0447J7090j0810
11538a6340k0985O351J0754R454m87N155J4685J2866L208r266k023M916l625j550
11524A3113n75R851K822j4722J5525O801j8195j9288K2745P871L356j5210k2850
11511h756m258j7697K5294J695P805q181n098N229o402L385l374N190j1297q974
11497b5439q561J8268J3636q49L3566j904j0784j1748j8068q980j1356J458K4181
11484f580R191J5155J0565r893k8753J7647M0294j9810k2979L999j3499K42K613
11471a808J4116K7288o810J476K339o87j1353r506J3919J9949l3184j5014k4586
$$ plain form
11564 -12271 -906 16736 7761 -73 6592 -3277 -13311 -2591 -21329 -17180 -24835 -17166 -21998
11551 -21998 -37316 -31799 -14437 -4651 -4322 -2074 -6983 -41724 -41420 -33067 -22620 -5530 -16340
11538 -16340 -37325 -30974 -20220 -10766 -11253 -6098 8587 21453 24661 15395 13372 18288 14663 13113
11524 13113 12538 22389 25211 10489 26014 32815 14620 -4668 18077 25948 29304 14094 -8756
11511 -8756 -13014 -30711 -5417 -3722 4083 -4098 -9196 -3967 -10369 -6984 -10358 -5168 -16465 -25439
11497 -25439 -34000 -15732 -2096 -2945 30621 28717 17933 6185 -11883 -20863 -32219 -30761 -6580
11484 -6580 2611 17766 28331 18438 -10315 7332 47626 27816 4837 8836 -4663 -4421 -1808
11471 -1808 12308 39596 32786 34262 36601 35914 24561 15055 28974 48923 15739 725 -23861
11458b3861q036r127N309L6318K859k6745J4828L4207J7919j7695j2894k3612
11446a0530k6223J0779K4272O05m768J9359K3920k484q207P958k0098L64o894
11433H053l083j9136j1221j8017L837J7121K0120j3829N63K4087r711J4105q1
11420A2808k027J1833q408k9311k1163Q232K2360J9933n638J2564j0123j493k150
11407G417j3983l447K656j1655P682O862J2617P390O207J73j1256k402p2J621
11393I810q807j1895o0r000j8943N918Q55P292n58M143O115Q441j5240Q894J9050
11378F015J1969K0318j2070l2720p730J0543J3677q726q485J0657n448R04R559
11365H463K535R261j834k1938j392J4387r830K936j1870j3640r247K0055K2780
$$ plain form
11458 -23861 -31897 -41024 -35715 603 3462 -23283 -8455 25752 43671 25976 13082 -10530
11446 -10530 -36753 -25974 -1702 -1097 -5865 13494 37414 34930 26723 34681 14583 14947 8053
11433 8053 4970 -14166 -25387 -43404 -39567 -22446 -2326 -16155 -15592 8495 -1216 12889 12808
11420 12808 10781 22614 14206 -15105 -36268 -28036 -5676 14257 8619 21183 11060 9567 7417
11407 7417 -6566 -10013 -7357 -19012 -11330 -4468 8149 15539 21746 21919 10663 8261 8189 9810
11393 9810 1003 -10892 -10952 -19952 -38895 -32977 -32122 -24830 -25388 -21245 -15130 -6689 -21929 -13035 6015
11378 6015 17984 38302 26232 -6488 -14218 -3675 10002 1276 -7209 3448 -2000 -1096 8463
11365 8463 10998 20259 18425 -3513 -4905 9482 -348 2588 -9282 -22922 -32169 -12114 10666
11352A0666P300Q573m305j7947O669J0447r331K240j3390j2253J8735O797J4366
11339B8567q662j6223O080j6123j8804r713rJ2198L464K1407J7879o711l922Q252
11325A7680n134n498l331n189m736j6488L017k010r869M1672R742J8027J7093
11312E4976n719J6524j5852j0582l343l2206q862n914J030L4252J0085j9892M296
11299A8793m109o202L8439R919J4015J2806M1704K3313M8325P0431R7880Q5327
11287D50641K9464K6698j4457j05804j03909p4687n7207n0748l2109j2104j8462
11276C7316K957m380l1331K6532n963k3441n335J421m339k1164n106k778r47j4348
11262e0906R35K8181n704O087J212O233M073j766Q110J5520k5698J203L288n061
$$ plain form
11352 10666 17966 26539 22234 4287 10956 21403 12072 14312 922 -11331 7404 14201 28567
11339 28567 19905 3682 9762 -6361 -25165 -34878 -34887 -22689 -19225 2182 20061 13350 9428 17680
11325 17680 12546 7048 3717 -1472 -6208 -22696 -19679 -21689 -31558 10114 19856 37883 54976
11312 54976 49257 65781 49929 39347 36004 3798 -5064 -10978 -9948 24304 34389 14497 18793
11299 18793 14684 8482 46921 56840 70855 83661 125365 148678 197003 267434 365314 450641
11287 450641 480105 506803 492346 386542 282633 207946 150739 99991 67882 55778 37316
11276 37316 40273 35893 4562 31094 25131 1690 -3645 -2224 -6563 -27727 -32833 -35611 -36558 -50906
11262 -50906 -49971 -21790 -27494 -21407 -20195 -13962 -9889 -11655 -3545 11975 -13723 -12520 -9232 -14293
11248a4293l353P681R184n227j2796J9871J2102j0320j5171J4577K1066q294l2634
11235a7607q123N045j2195M634J4332k72m133q484k233Q108J5469m956l055K562
11221a0908j0346k322J7652k751J6519o904L2351J9861O38j7922k4642j8432k660
11208i866K2060J656j6489N960L1260l336o467q182J1325j2664j0388K1627Q861
11195C5357j8485m399M127p231J5616L0703r152k9576k9427J3114k686k2743R141
11182a5641r887J3368L4811K3505J5545M3772M1046N4106J06611J19424O4513
11171D91173Q8600O8873J8195o8333j41266j33418j04721r4445l1028j6830k6443
11160E0357P270p087k0552k3637r347K3092K6990n457j8246j0833n418k7205j3799
$$ plain form
11248 -14293 -17646 -9965 -781 -6008 -18804 1067 13169 2849 -12322 2255 23321 15027 -17607
11235 -17607 -25730 -20685 -32880 -28246 -13914 -14186 -18319 -26803 -29036 -20928 -5459 -10415 -13470 -10908
11221 -10908 -21254 -23576 -5924 -8675 7844 940 33291 53152 53790 35868 11226 -7206 -9866
11208 -9866 12194 13850 -2639 3321 34581 31245 24778 16596 27921 15257 4869 26496 35357
11195 35357 16872 12473 16600 9369 24985 55688 46536 16960 -12467 647 -2039 -24782 -15641
11182 -15641 -25528 -12160 22651 46156 61701 105473 146519 200625 307236 426660 491173
11171 491173 579773 648646 666841 598508 457242 323824 219103 124658 93630 76800 50357
11160 50357 57627 50540 29988 6351 -2996 20096 47086 41629 23383 12550 7132 -20073 -33872
11147c3872J8434K710N472J3645n370j1736j664K1457J3642k1561r359q921l1117
11134d8240O406J2897K401k3498K6861K3786K3838J7040k9949k8467R748J6339
11122I162Q174n567o740J5219J7623J027j0552k1925j7130n209J0854J7057n753
11109F240j7626r135O52K021j7889k03O004j4063N016K2189K2135q9j0311k9234
11095c4293J1989K5112j3725k285Q353r73L241k3745j663L9480J2212j7606j7324
11082a1227l0372k616L3849L3311N934k8507j9792K802K975p968r941K0027M3437
11069C1912R006J1750j1827j8636j2815l2608j3777K248O0M713Q479P552J0303
11056c640o07L353M523j377j4458J9442L1198P626k6309j8255P663m719r335R855
$$ plain form
11147 -33872 -15438 -12728 -7256 6389 1019 -10717 -12381 9076 22718 1157 -8202 -17123 -48240
11134 -48240 -41834 -28937 -26536 -50034 -23173 613 24451 41491 11542 -16925 -7177 9162
11122 9162 17336 11769 5029 20248 37871 38898 28346 6421 -10709 -15918 -5064 11993 6240
11109 6240 -11386 -20521 -19869 -17848 -35737 -35940 -29936 -43999 -38983 -16794 5341 5252 -5059 -34293
11095 -34293 -22304 2808 -10917 -13202 -4849 -5822 -2581 -26326 -27989 11491 23703 6097 -11227
11082 -11227 -41599 -44215 -10366 22945 28879 372 -19420 -16618 -13643 -21611 -31552 -11525 31912
11069 31912 40918 52668 40841 22205 9390 -23218 -36995 -34747 -34687 -29974 -21495 -13943 -3640
11056 -3640 -4247 -894 3629 2252 -12206 7236 38434 46060 19751 1496 9159 4440 -4895 4960
11042D960J5241J4843j3898k306j0873L279J0161j8207o424j6501l893J0973J7553
11029D908K763N678K6322R963j4791m7271l6052K6267K4556M938q496q773j6524
11016b6512J767J157K715o067J9961P962k4439j8361o891J7700R544N410Q6J0136
11002e832j3774j7768o881J6502N159k449J068j1686j148O183L3973M165j4752
10989g240O741n301m487r700P879p035N077P47J2525J196k6297Q125n742M858
10975a8654K407K785R30L7084J0430j8253M958k659j7611l12P500l1668l423K1808
10961d678K7139P979j7944o523R821k362J1228L120j0419N396j25p559j3323k098
10947c48j4155M795Q806n685J0689P146j7596j1473R126P481J052O361K0162J8190
$$ plain form
11042 4960 20201 35044 21146 18840 7967 11246 21407 3200 -3224 -19725 -23618 -12645 4908
11029 4908 7671 13349 39671 49634 34843 -12428 -48480 -22213 2343 7281 -1215 -9988 -26512
11016 -26512 -24745 -23588 -20873 -26940 -6979 983 -23456 -41817 -48708 -31008 -21464 -16054 -15968 -5832
11002 -5832 -19606 -37374 -44255 -27753 -22594 -25043 -23975 -35661 -36809 -30626 3347 7512 -7240
10989 -7240 -499 -5800 -10287 -19987 -12108 -19143 -14066 -13319 -794 402 -25895 -17770 -23512 -18654
10975 -18654 -16247 -13462 -12532 24552 34982 16729 21687 19028 1417 1105 8605 -23063 -26486 -4678
10961 -4678 22461 30440 12496 5973 15794 13432 24660 27780 17361 22757 22632 15073 1750 -348
10947 -348 -14503 -9708 -902 -6587 4102 11248 -6348 -17821 -8695 -1214 -162 6199 26361 44551
10933D4551J0305q044m7016j9031J2157O40k74Q961j454q894J744o497P110P313
10919A571k2934k9212k812j1680k4354J6881J9505J5543J0564k3077J147K3989
10907b4869J9229j5562J6898J4378j1141j1992O667Q047J0310k9356l5096o401
10895e8888J0200J1850O416j4768k521j65P196K8641J3570j4013k3485K0889K0828
10882E750j3979j5770M151R223K5313j3670k2988L0134J6189j2732R570N090o057
10869B0224j5596j5312j1225J1763n356J418j1804J136R039J1926J221K2836R974
10856C0244j7788r412r756j4763M869p292J6752J6966M54k7574N988j4624P387
10843a8549K28J775M926J0001m364j8427j2108p18N284K9436J8035j3720l245
$$ plain form
10933 44551 54856 46812 -204 -19235 -7078 -6438 -6712 2249 795 -8099 -6355 -12852 -5742 1571
10919 1571 -21363 -50575 -53387 -65067 -89421 -72540 -53035 -37492 -26928 -50005 -48858 -24869
10907 -24869 -5640 -21202 -4304 10074 -1067 -13059 -6392 1655 11965 -17391 -52487 -58888
10895 -58888 -48688 -36838 -30422 -45190 -47711 -47876 -40680 -12039 1531 -12482 -35967 -15078 5750
10882 5750 -8229 -23999 -19848 -10625 14688 1018 -21970 8164 24353 11621 21191 26281 20224
10869 20224 4628 -10684 -21909 -10146 -15502 -14084 -25888 -24752 -15713 -3787 -2566 20270 30244
10856 30244 12456 3044 -6712 -21475 -16606 -23898 -7146 9820 10274 -17300 -11312 -25936 -18549
10843 -18549 -18321 -16546 -11620 -1619 -5983 -24410 -36518 -37236 -31952 -2516 15519 1799 -1446
10830a446j7918j74L6415n084Q487K0359m974r510j7142q605k1127j2394Q562
10817b4551K4850O085k3237n029P34k2312j811P067K1131J4940M806J0060j2077
10804F56j4767R077K2199J3093J5818R807k2487J466R419n471q50l9248j3818
10791a5106J1864K166l567j3464R226K3766j150n052j1312k0827j479l433K0882
10778g486J1403r71J8761K4110j4232N669l2776m345J3172n456J814J1726j6004
10765E385j2238j0401O792j269K4472j5450l7431M261K449J2480J7209N083m266
10752b924j3003q236O316n749K6046L435j4132J6091q413j3181J2114q20m907
10739g363j2432j7844K535J1665J2255j3734O519K93J045L1029k1409l0962R419
$$ plain form
10830 -1446 -19364 -19538 16877 11793 20280 40639 35665 26155 9013 408 -20719 -33113 -24551
10817 -24551 299 6384 -16853 -21882 -21148 -43460 -45271 -38204 -17073 -2133 2673 12733 656
10804 656 -14111 -5034 17165 30258 46076 55883 33396 34862 44281 38810 37960 -1288 -15106
10791 -15106 -3242 -1076 -4643 -18107 -8881 14885 13735 8683 -2629 -23456 -24935 -28368 -7486
10778 -7486 3917 2946 21707 45817 31585 37254 4478 133 13305 7849 9663 21389 5385
10765 5385 -6853 -17254 -10462 -11731 12741 -2709 -40140 -35879 -33430 -20950 -3741 1342 -2924
10752 -2924 -15927 -24163 -17847 -23596 2450 5885 -8247 7844 -569 -13750 -1636 -2456 -7363
10739 -7363 -19795 -37639 -35104 -23439 -11184 -24918 -18399 -18106 -17061 13968 -7441 -38403 -28984
10726b8984k344m47Q194J8814J9749q662l0494q963j4522J5108K0434R627M517
10713B027M407j5786j6018N35K4827J0938j6845r359M423k1235J82N891L980L773
10699a8260J174j1418j4803r104L8560M501k3284J1855L6706M839p42Q720N019
10686C3763j3491j1427m386Q53R811k1267p886L8523J1248o080p28J675n576o988
10672A8044N30j829j9646j0433j1890r585k878L594m406K0046R561J844J8719
10659A1671M910P512j2197k5196k743R084o968q978N46j371N224J9812J1775j1998
10645A083J2508O733j1295j1412j0289p573k1434o02J2306N57M55J1950K8610
10632A1597n081k0446l154K64J3999K30J5854k473j8321k3995R736j3985j5073
$$ plain form
10726 -28984 -31328 -31775 -23581 -4767 14982 6320 -24174 -33137 -47659 -32551 -12117 -2490 2027
10713 2027 6434 -9352 -25370 -24835 -8 10930 -5915 -15274 -10851 -32086 -31904 -26013 -22033 -18260
10699 -18260 -17086 -28504 -43307 -52411 -13851 -9350 -32634 -20779 15927 20766 20024 28744 33763
10686 33763 20272 8845 4459 5312 15123 -6144 -14030 24493 35741 29661 28933 30608 25032 18044
10672 18044 18574 16745 -2901 -13334 -25224 -34809 -37687 -34093 -38499 -18453 -8892 -7048 11671
10659 11671 16581 24093 11896 -13300 -16043 -6959 -13927 -22905 -22359 -23730 -18506 1306 13081 1083
10645 1083 13591 20324 9029 -2383 -12672 -20245 -41679 -42281 -29975 -29418 -28963 -17013 11597
10632 11597 6516 -13930 -17084 -16820 -2821 -2591 13263 10790 -7531 -31526 -21790 -35775 -50848
10619e0848Q188J0685J1774k32O852L6512K5078j5617n050n18r340k1177k4894
10606b8587J4021Q267j7707L0958R074M704m491l2000R833J5385J266J2272j1178
10593A1817J8323J3422k4220l1730j4085J4778L7444j5314j2654j82k23j1204
10581a3828J4879L046J3786R154j5011l0277k492O955P547o258k16k819K509o478
10567a9503k751j59j4789K257J9209l959j148J2033o939o154r668j8649M865J8742
10553b6613k718L01K4631n225J5904p61N025N761j7305k4218q490J086K734k636
10539c2524K797r531j29L436Q173K4854n504j0381j7893O31J0952k020N479R993
10525a1667j3762k4234r744K6354L0728j1371n18K3913j988j9315q622l107O862
$$ plain form
10619 -50848 -42660 -31975 -20201 -20433 -13581 22931 48009 32392 27342 26824 17484 -3693 -28587
10606 -28587 -14566 -6299 -24006 6952 16026 20730 16239 -15761 -5928 9457 10723 22995 11817
10593 11817 30140 43562 19342 -12388 -26473 -11695 25749 10435 -2219 -2401 -2624 -13828
10581 -13828 1051 4097 17883 27037 12026 -18251 -20743 -13788 -6241 -12499 -12715 -15534 -13025 -19503
10567 -19503 -22254 -22413 -37202 -34945 -15736 -19695 -20843 -8810 -15749 -21903 -31571 -50220 -45355 -26613
10553 -26613 -29331 -29030 -4399 -9624 6280 5519 10544 16305 -1000 -25218 -33708 -32622 -29888 -32524
10539 -32524 -29727 -39258 -39387 -35951 -27778 -2924 -8428 -18809 -36702 -36071 -25119 -27139 -21660 -11667
10525 -11667 -25429 -49663 -59407 -33053 -2325 -13696 -14214 9699 7711 -11604 -20226 -23333 -16471
10512a6471P415K489j3363K5062l969q986k84k6731J394k509M837L35K1148K2785
10498A3152j0666k3317J043Q387N302o295r094J5647L2059M235k7166n293k8325
10485c0331R997N623K7440M107M180j6486n285J7462J9512j556r235P503J807
10472C4738r560o466J4152J5250J8824q49l662j1426j9813R287j4818j5313r430
10459I14P111J8707J9926J9568j9461j7247K644o826J1895N006P304l4245j3980
10446A316j7287J4813j677K1796K7928J3411j4134J2764J7373k0835l0185J9366
10434D4649L525j7713j9307J7391m143j7286r178P728k4559k3244P589J0042J8131
10421f375k06K0380K6608k99p647k1517j3362j0610Q268N942K0804q757k7904
$$ plain form
10512 -16471 -9056 -6567 -19930 5132 1163 -7823 -8107 -34838 -33444 -35953 -31116 -30781 -9633 13152
10498 13152 2486 -20831 -19788 -11401 -6099 -12394 -21488 -5841 26218 30453 3287 -2006 -30331
10485 -30331 -20334 -14711 12729 16836 21016 4530 -755 16707 36219 34663 25428 32931 34738
10472 34738 25178 18712 32864 48114 66938 66089 62427 51001 31188 40475 25657 10344 914
10459 914 8025 26732 46658 66226 46765 29518 32162 25336 37231 42237 49541 15296 1316
10446 1316 -15971 -1158 -2835 18961 46889 60300 46166 58930 76303 55468 25283 44649
10434 44649 48174 30461 11154 28545 24402 7116 -2062 5666 -18893 -42137 -34548 -24506 -6375
10421 -6375 -6581 13799 40407 40108 32461 10944 -2418 -13028 -4760 1182 21986 13229 -14675
10408a4675j3241M58O56J4443r746j0291N600Q117J3412L243l749l946P909K689
10394H79k068J2219K7806j6349l2425j2826j4330p518K5771J6523L799Q794J0265
10381B0540j4129M243j2136q635O708j2511j3673j9655M701O956J1288J3715L934
10368h654J445M909q426k119P836p332J0011J5093N311j9806j5579n390Q571j2496
10354b6626k258Q458K3796J1923l975k1135j7823K1106J3068J0085j2580j5085
10342a1046j5521L086K1424J6911R960K044O244n044J1k84M98l1926l3821J0090
10328b7374L0597J3910j4694o266N020K1562N388k9294j2155j5087L216J6067
10316i110K242q259n362j2047R419K7830j8800J5504L0057n047j8564q150l7820
$$ plain form
10408 -14675 -27916 -27458 -26802 -12359 -22105 -32396 -26796 -18679 -5267 -2024 -5773 -9719 -1810 879
10394 879 -1189 11030 38836 22487 -9938 -22764 -37094 -44612 -18841 -2318 1481 10275 20540
10381 20540 6411 10654 -1482 -10117 -3409 -15920 -29593 -49248 -44547 -37591 -26303 -12588 -8654
10368 -8654 -7209 -2300 -10726 -12845 -5009 -12341 -2330 12763 18074 -1732 -17311 -22701 -14130 -26626
10354 -26626 -28884 -20426 3370 15293 11318 -9817 -27640 -6534 6534 16619 4039 -11046
10342 -11046 -26567 -23481 -2057 14854 24814 26858 33102 28058 28069 27785 28283 -3643 -37464 -27374
10328 -27374 3223 17133 2439 -3827 1193 22755 28143 -1151 -13306 -28393 -25177 -9110
10316 -9110 -6868 -15127 -20489 -32536 -23117 4713 -14087 1417 31474 26427 7863 -287 -38107
10303c8107l0907K4893K9861K0234j5879o587J192K579j185n656j2575J4122j4719
10290c2734L709J9738n215J1106L194k0876j69p676J0792K5529l003r566K910
10277b261J5283p497j0743N617o165m073K8077P497j705l979J2701J4317L635
10264E0704l2641j4K3958L990R043k9218j3839N257P304J8426j0605j5123P13
10251A7955p586q355p588m762K2307n339q227j5381K775K0793q28L359J5174m33
10237B3864j6396k4628j316j4220O891m261J692J4804l123N705O469j5525j2867
10224c2911K8945K6246Q162r976K689Q916j5505j6639k369R25L676j970m628R349
10210D910j146l946J4259K2997M517l8940j2271J1317k1449k5593K9174K8046
$$ plain form
10303 -38107 -69014 -44121 -14260 5974 -9905 -16492 -15300 -12721 -13906 -19562 -32137 -18015 -32734
10290 -32734 -29025 -9287 -14502 -3396 -202 -21078 -21247 -28923 -18131 7398 4395 -5171 -2261
10277 -2261 13022 5525 -5218 399 -5766 -9839 18238 25735 24030 20051 32752 47069 50704
10264 50704 18063 18049 42007 45997 55040 25822 11983 17240 24544 42970 32365 17242 17955
10251 17955 10369 2014 -5574 -10336 11971 6632 -1595 -16976 -14201 6592 5764 9123 24297 23864
10237 23864 7468 -17160 -18476 -32696 -25805 -30066 -28374 -13570 -16693 -10988 -4519 -20044 -32911
10224 -32911 -3966 22280 30442 20466 23155 32071 16566 -73 -2442 -1517 2159 189 -4439 4910
10210 4910 3764 -182 14077 37074 41591 2651 -9620 1697 -19752 -45345 -16171 11875
10198A1875j423j5407j5784r369L2932R294q513L521j5357j2985p380J4326j257
10185a5527J6130m554K415J2629q747j0027K7905K733P151Q186K1799L088k9067
10172C4114k0553K735K925K068K3912r372j302J2242j3739j9809j8617o456K2030
10159A0178j257l6990j2348J2891q769L46j435J8119J9913j671k1739j7245j68
10146d0175O19J7764J376P40L548K760j9539o554J0981Q861L0370R110k1381L550
10132B030M640m648n832j9775j2277j2007J6168l717J2450J8944L174Q572M775
10119A2497J909n596k3677j6637P679j637K7384K8996j5967J3350Q302j1058O077
10106C1622j0986Q440l1967k2596K927J5221O708P277K799L076j925Q721M45j0332
$$ plain form
10198 11875 10452 -4955 -20739 -30108 2824 12118 3605 7126 -8231 -21216 -28596 -14270 -15527
10185 -15527 603 -3951 -1536 11093 2346 -7681 20224 22957 30108 38294 60093 63181 34114
10172 34114 13561 16296 19221 21289 45201 35829 34527 46769 33030 13221 -5396 -11852 10178
10159 10178 8921 -28069 -40417 -27526 -36295 -35949 -37384 -19265 648 -1023 -22762 -40007 -40175
10146 -40175 -39556 -21792 -20416 -19676 -16128 -13368 -32907 -39461 -28480 -19619 10751 19861 -1520 2030
10132 2030 6670 2022 -3810 -23585 -35862 -47869 -31701 -35418 -22968 -4024 -850 7722 12497
10119 12497 14406 8810 -14867 -31504 -23825 -25462 1922 30918 14951 28301 36603 25545 31622
10106 31622 20636 29076 -2891 -25487 -22560 -7339 -631 6646 9445 12521 10596 19317 19762 9430
10092I430j947J257l924R077j2777j7855j3784N316R285P798j7558P046K8501
10079I865N961k0439j1164j2626k4881K0258J795J1405K2253J0672J9042P479
10067C9620l221m775k1321J2540K2864q708K3030j425l3281j3123K5650L7379
10055G5229K4486L7325M2411M4148M7084N9988Q8591J48454K70703M47011R16538
10044B201968J741334J719534n12085j801023j374698p76824m22104k29010j40989
10035D06103r9554q2912o6164j1203m33k8164j5393k9629j9806j9473k018K1037
10023E2391q249m03j5593r77O204k9009p271J4225J2265L0642J1661j7110j0510
10010C8266o978o958j9524j7342o985K1141K9664k0845k5103J2337r59j715J7008
$$ plain form
10092 9430 7483 8740 4816 13893 1116 -16739 -30523 -25207 -15922 -8124 -25682 -18636 9865
10079 9865 15826 -4613 -15777 -28403 -53284 -33026 -31231 -19826 2427 13099 32141 39620
10067 39620 36399 31624 10303 22843 45707 36999 60029 58604 25323 12200 37850 75229
10055 75229 99715 137040 179451 223599 270683 330671 419262 567716 838419 1285430 2201968
10044 2201968 3943302 5662836 5150751 3349728 1975030 1198206 776102 547092 406103
10035 406103 306549 223637 157473 146270 145837 117673 102280 72651 52845 33372 31354 52391
10023 52391 44142 43739 28146 27169 33373 4364 -2907 11318 23583 54225 65886 48776 38266
10010 38266 31288 24330 4806 -12536 -19521 1620 31284 10439 -14664 -2327 -3286 -5001 12007
9997A2007J2352J1829j0586p777N601K2848J8918j1778k5741n170j0355k9771
9985a7623m830K3217J5861k641o253j5017M243L1371M128N115l3918r886J0101
9972C868k0791l698J3125K7127K673j2681k0080K5369M679j593k1469j376K3936
9959A9089J0907q680j5979j4288j0631K0121K9750M602j0455J5393J9279q058
9947E1050k1841j4499j5113j2074k352j3517O6p371j2340J0076J9550J4416J2563
9934H614m477j7344l691l719q982J8334L1127r153p150k1600l2174J9853J7421
9921a2941J7483K1408k9784k9057Q59N352J5420N059o633j4069l878J4726q688
9908b4743L451K5565M089o596j2627j98J0967k352j8808P044Q482q529P034J2701
$$ plain form
9997 12007 24359 36188 25602 17825 23426 46274 65192 53414 27673 22503 12148 -17623
9985 -17623 -22453 764 16625 13984 7731 -7286 -3043 28328 32456 37571 3653 -6233 3868
9972 3868 -16923 -20621 -7496 19631 22304 9623 -10457 14912 19591 17998 -3471 -4847 19089
9959 19089 29996 21316 5337 -8951 -19582 539 30289 34891 24436 39829 59108 51050
9947 51050 29209 14710 -403 -12477 -14829 -28346 -28280 -35651 -47991 -37915 -18365 -3949 8614
9934 8614 4137 -13207 -16898 -20617 -29599 -11265 19862 10709 3559 -18041 -50215 -30362 -12941
9921 -12941 4542 25950 -3834 -32891 -32032 -26680 -11260 -6201 -12834 -26903 -30781 -16055 -24743
9908 -24743 -21292 4273 8362 1766 -10861 -11059 -92 -2444 -21252 -14208 -5726 -14255 -7221 5480
9894E480J1168r206l062M642K9888k105K021k0070j9837j6607j7646J831K6809
9881f694O041j0458l448J3111l212J646K1419j1204M536k737j7873O548K4472
9868B2147p96j9442j0531p02K1471l1420J2794M672k4070K4757J8732o488j5792
9855d668l2404M602Q976J5524J1358J4480k1685j5290K439Q094j8510J5060L013
9842i011j7456n846R135K1003m551j6807M791j197J4269j3526L383P574k495Q351
9828b383L8926q877k8654J0314j6297l6126J1914M5372m055q978K5220J7411j0642
9815C3145j558K9097j3360j4115j719k3836p777l861q928k0410P462M834K4307
9802C281L2130j2423j6765j2180Q115N338q684k7903p520k975j0447M4481L3668
$$ plain form
9894 5480 16648 7442 4380 9022 38910 36805 38826 18756 -1081 -17688 -35334 -33503 -6694
9881 -6694 -653 -11111 -14559 -1448 -4660 -3014 18405 7201 11737 9000 -8873 -2325 22147
9868 22147 21351 1909 -8622 -9324 12147 -19273 -6479 -1807 -25877 -1120 17612 11124 -4668
9855 -4668 -37072 -32470 -23494 -7970 3388 17868 -3817 -19107 -16668 -8574 -27084 -12024 -9011
9842 -9011 -26467 -32313 -23178 -2175 -6726 -23533 -18742 -19939 -5670 -19196 -15813 -8239 -10734 -2383
9828 -2383 36543 27666 -988 9326 -6971 -43097 -31183 14189 10134 1156 26376 43787 33145
9815 33145 31587 60684 47324 33209 31490 7654 -123 -3984 -12912 -33322 -25860 -21026 3281
9802 3281 35411 22988 6223 -5957 2158 7496 -1188 -29091 -36611 -39586 -50033 -5552 28116
9789B8116k3810p388J8406m072r728j8231j383J4820J4936j1023K843k754n507
9776d775k0447K0519J6319O507P530J8499j074j7242k1153j0312o981j889j1489
9763b5988J5094K1288r193j1883J3157J2213K0903l959k159J1435r857N754J0081
9750D6886k8614k1114k1379J3456K3082q897R014J5786J4280n571j4150k7779
9738e000p32j4144k9860K2718M3555M0j8626o153n134J1010J1346J6497N339q974
9724B1882J370M502l6034M487M245L873N882p327K037K8426K523m344k5066J3868
9710B0324J7317j2939j8917j8135k123L368J4684K093k0912m2117K765J4034J6098
9697b4460Q916l080J4902L8141M45k4106k4342j6044K4013J4536j8822j267J9086
$$ plain form
9789 28116 4306 -3082 15324 11252 1524 -16707 -18090 -3270 11666 643 3486 732 -4775
9776 -4775 -25222 -4703 11616 18123 25653 44152 43078 25836 4683 -5629 -12610 -14499 -25988
9763 -25988 -10894 10394 1201 -10682 2475 14688 35591 31632 29473 40908 31051 36805 46886
9750 46886 18272 -2842 -24221 -10765 12317 3420 12434 28220 42500 36929 22779 -5000
9738 -5000 -5732 -19876 -49736 -27018 16537 16577 -2049 -8202 -13336 -2326 9020 25517 30856 21882
9724 21882 23252 27754 -8280 -3793 452 4325 10207 2880 4917 33343 35866 31522 6456 20324
9710 20324 37641 24702 5785 -12350 -14473 -11105 3579 5672 -15240 -57357 -54592 -40558 -24460
9697 -24460 -15544 -18624 -3722 34419 34864 10758 -13584 -29628 -5615 8921 -9901 -11168 7918
9684G918J4058o372j4500j8349o483K492j5724J3338J0500J6905j1101p964P018
9671h264K308J007j025J1314J8828P126k5142l6500N519J4332L3490J8350l7214
9658D129j4992k8815l761P968j1217J971K0960K0394j832m518k0680k7242J2569
9645d5066L6313Q997l1107l188L1537O564J1976R941J0135m738n730Q611J0929
9632D5174j9329k2298J1280m591O477L111r7M69k6478k5509l567K4453R721Q344
9618G160m238p372L083l45R655M228j4924k378p00j0064J8529m804j8500q683
9604b9353Q556j8334R247K0889m062k8949J0367J1843m860p284p741k140j945
9591d3766k1920j3752P166J0269L1164K6123R167j0224K937j761R295j0915j2814
$$ plain form
9684 7918 21976 15604 1104 -17245 -23728 -21236 -36960 -23622 -13122 3783 -7318 -15282 -8264
9671 -8264 -5956 -4949 -5974 5340 24168 31294 6152 -30348 -24829 -10497 22993 41343 4129
9658 4129 -10863 -39678 -43439 -35471 -46688 -44717 -23757 -3363 -5195 -9713 -30393 -57635 -45066
9645 -45066 -8753 244 -30863 -34051 -2514 4050 16026 25967 36102 31364 25634 34245 45174
9632 45174 25845 3547 14827 10236 16713 19824 19727 20196 -6282 -31791 -35358 -10905 -1184 7160
9618 7160 2922 -4450 -1367 -1712 7943 12171 -2753 -5131 -5831 -15895 2634 -2170 -20670 -29353
9604 -29353 -20797 -39131 -29884 -8995 -13057 -42006 -31639 -19796 -24656 -31940 -39681 -41821 -43766
9591 -43766 -65686 -79438 -72272 -62003 -30839 -4716 4451 -5773 -2836 -4597 4698 -6217 -19031
9578a9031R702J0956J4595J2706j5935k8023p186K0566m099j0977r114J204O596
9565a8040K0375J3344J736j0444j467k1388J0304rL222O342k1911l426K7342J225
9551G205p902J0119M613J006R231j6149j629P488j6790J5626K2528J52n370j4808
9537A5320l6455K446L8576K601l6346J6541P599j0145j929Q35J9357R490p081
9524B0809r856J7074J404L236m571N767k7891j9439K0873m436j9786o410N187
9511a8039M854m259l0634m483K3348M2295J6574n433l806k6539J2143J6294j1048
9498A1267o016n545m864j965L518j5952J5062J0365J3935l390j2140Q861j943
9485A1193L243q34J4041k6290L501J8283j5640P549L6020j3013q056L27l0974
$$ plain form
9578 -19031 -9329 1627 16222 28928 12993 -15030 -22216 -1650 -5749 -16726 -25840 -24636 -18040
9565 -18040 2335 15679 17415 6971 5504 -15884 -5580 -5589 -2367 3975 -17936 -21362 5980 7205
9551 7205 -697 9422 14035 15041 24272 8123 6494 13982 -2808 12818 35346 35498 30128 15320
9537 15320 -21135 -18689 19887 22488 -13858 2683 10282 137 -1792 -957 18400 27890 20809
9524 20809 10953 28027 29431 32667 28096 33863 5972 -13467 7406 2970 -16816 -23226 -18039
9511 -18039 -13185 -17444 -48078 -52561 -29213 13082 29656 24223 20417 -6122 6021 22315 11267
9498 11267 5251 -294 -5158 -7123 -3605 -19557 -4495 5870 19805 16415 4275 13136 11193
9485 11193 14436 13602 27643 1353 4854 23137 7497 15046 51066 38053 29997 30324 -650
9472f50j4252m207P828m088J5222N438O208l645j0015k2984j847r263j807m87
9458c8549J2673K4917M819M894N782R259j4977q369J2506L45k0050j3069n026
9445b4845P650j0282Q965P771Q867J5310J59j760k0124j3015K6620R515J1436
9432B6267j180K666p926R443L518r701k480j7606n682J8028o264n231J5131J2389
9418C1372o292J445k940P099o743r994q431j0417J0902O829J3071j7111O230k4351
9404i331J2274K7933J7639N733j4866k6444o808J6640K7485j5539j8015K0280
9392C6981k3548j6738J5397R737q51j1846J3198J6562R903O467O693k4077k7277
9379A0601j495j1384J2656l213O457J9063J2656J8479m629j1009k6771L917O096
$$ plain form
9472 -650 -14902 -19109 -11281 -15369 -147 5291 11499 7854 -2161 -25145 -26992 -36255 -38062 -38549
9458 -38549 -25876 -959 3860 8754 14536 23795 8818 449 12955 13300 -6750 -19819 -24845
9445 -24845 -17195 -27477 -18512 -10741 -1874 13436 13595 11835 -8289 -21304 5316 14831 26267
9432 26267 25087 27753 19827 29270 32788 23087 20607 3001 -2681 15347 9083 3852 18983 31372
9418 31372 25080 26525 23585 30684 23941 13947 5516 -4901 6001 12830 25901 8790 15020 -9331
9404 -9331 2943 30876 48515 54248 39382 12938 6130 22770 50255 34716 16701 36981
9392 36981 13433 -3305 12092 21829 20978 9132 22330 38892 48795 55262 61955 37878 10601
9379 10601 9106 -2278 10378 7165 13622 32685 45341 63820 59191 48182 21411 25328 31424
9366C1424O947N670j0709q698L15q637p843j1486J935J7197N706j3286J3203O225
9352B7963p539J433K7186J7762j8358J536k5614j0039J7499j5974n922P041j6307
9339F67R472J0577K489q871q082J3552L107j1719J5249J9080j1475J0781r623
9326C5204k2898L533J1867n111Q442J9737p141J8564j320j4550k256o726j7771
9313A9574L616j1380J160J7223N630J5892J1742P366K0873o310k6241j1257l22
9300D7566l946o890l736r00m069L0427k6075k0134Q335n411p723L2446J7333J0980
9286F8203j1773l162J2107J9854R002K172N885J4661q734j4532q263j0564J5847
9273I0703J138m805L159J6766r661K4346o232o194J1657k8229j0835J316J9337
$$ plain form
9366 31424 38371 44041 33332 24634 24949 16312 8469 -3017 -1082 16115 21821 8535 21738 27963
9352 27963 20424 21857 49043 66805 48447 49983 24369 14330 31829 15855 9933 16974 667
9339 667 10139 20716 23205 14334 6252 19804 22911 11192 26441 45521 34046 44827 35204
9326 35204 12306 15839 27706 22595 31037 50774 43633 62197 60877 46327 44071 37345 19574
9313 19574 23190 11810 12970 30193 35823 51715 63457 70823 91696 85386 59145 47888 47566
9300 47566 43620 36730 32994 32094 28025 58452 32377 12243 20578 15167 7444 39890 57223 68203
9286 68203 56430 53268 65375 85229 94231 96403 102288 116949 108215 93683 85420 74856 90703
9273 90703 91841 87036 90195 106961 97300 121646 115414 109220 120877 92648 81813 83129 102466
9260A02466J9584P622J7042R372K401P616j7991j4977Q86J0191m820J8110l448
9247A54054j042J6920o438q372j797J3043q486r866J5063R560L4115o861R806
9234B09699K4484m318k2233M384K1383R203J8174k0327j2649j0026j2614J1257
9222B16417o462K1144J7173L1789q12J5122l33l4134j2138j73L5927L9767J3355
9209C36642L428o537J8645M1979N138J7890J046K1906M1393Q590q8L0712J7805
9196E38549J6858J8328J8903L6304J9520K7889L0330L2938M7125L0989L8224O2133
9184I18090O3778K9941M1108L2002P7350R7772R3939R5880J30325R5174J14683
9173A790042R5552J26618J57991J79976J47149J91634K02643K27972K54612K75462
$$ plain form
9260 102466 122050 129672 146714 156086 158487 166103 148112 133135 134021 144212 139392 157502 154054
9247 154054 153012 169932 163494 155122 153325 166368 157882 148016 163079 172639 206754 199893 209699
9234 209699 234183 229865 207632 212016 233399 242602 260776 240449 227800 217774 205160 216417
9222 216417 209955 231099 248272 280061 279249 294371 294038 259904 247766 247593 283520 323287 336642
9209 336642 340070 333533 352178 394157 399295 417185 418231 440137 481530 490120 490032 520744 538549
9196 538549 555407 573735 592638 628942 648462 676351 706681 739619 786744 817733 855957 918090
9184 918090 981868 1011809 1052917 1084919 1162269 1260041 1353980 1449860 1580185 1675359 1790042
9173 1790042 1885594 2012212 2170203 2350179 2497328 2688962 2891605 3119577 3374189 3649651
9163C649651K66138K82837K91659K63228L09475L12783K99460K55468K02096J44007
9153F276802R6608L2132n4658j23894j91482k21096k47103k87238l00948l05859
9143D673264l17400l18852k72873k61616k21815k47034k48838j70450j59883j65540
9133B288963j44272j40031j37861j33515j27988j14713p4847p1296o8574n9399
9123A216467m9210q2884n7234k8754k2898n3131o9809m1925l2171m1947k8303
9112G08201l9063k0505k5794l2921R1l0496k2429p595k3735j6347j063o417k0081
9099D61846j9854l5093j6943M029r833q355k0860l0711j1020j950k6075O086k4
9086B91243q550j7898j3080k8877r454k39J4962K988j0548k8514k159L5251k39
$$ plain form
9163 3649651 3915789 4198626 4490285 4753513 5062988 5375771 5675231 5930699 6132795 6276802
9153 6276802 6373410 6405542 6350884 6226990 6035508 5814412 5567309 5280071 4979123 4673264
9143 4673264 4355864 4037012 3764139 3502523 3280708 3033674 2784836 2614386 2454503 2288963
9133 2288963 2144691 2004660 1866799 1733284 1605296 1490583 1415736 1344440 1275866 1216467
9123 1216467 1167257 1084373 1027139 998385 975487 922356 852547 810622 778451 736504 708201
9112 708201 669138 648633 622839 589918 590009 559513 537084 529489 505754 489407 488344 481927 461846
9099 461846 441992 406899 389956 393985 384152 375797 354937 324226 313206 311256 285181 291267 291243
9086 291243 282693 264795 251715 222838 213384 213145 228107 231095 220547 192033 189874 225125 224886
9073B24886L673Q111n642n0956k3555j9236j0086K944Q859p245m43r089N507J6635
9059A44363k6646j6098J0479K8520J1316L2642K0170l6139k5194K846k3493p931
9047A14835R778j376J1837k224l3578k0642k624P870p473J8861N107J4652J8367
9034A33390j5720k4246L511K388L595J7051K7782k9569l5629L334J2054J8572
9022A16513K893j9220j8424K3595P487k571J3977m678K203N512p113K777l823
9009A19128l211O030k205j7529l5424R94J2837j2938j8969M414J0692L1536j0828
8996H4527k6633O754P658j4668j4457j6028k376K4755l074k5570M032p780K8748
8983D5888J2997J3o652L370K2361J514P321j3134k1621k6577n340j7142q395n05
$$ plain form
9073 224886 228559 236670 231028 180072 156517 137281 127195 130139 138998 131753 131310 122221 127728 144363
9059 144363 117717 101619 112098 140618 151934 184576 204746 168607 143413 146259 122766 114835
9047 114835 124613 123237 135074 132850 99272 78630 76006 83876 76403 95264 100371 115023 133390
9034 133390 117670 93424 96935 99323 102918 119969 147751 118182 82553 85887 97941 116513
9022 116513 119406 100186 81762 105357 112844 110273 124250 119572 121775 127287 120174 122951 119128
9009 119128 115917 121947 119742 102213 66789 67783 80620 67682 48713 53127 63819 95355 84527
8996 84527 57894 64648 72306 57638 43181 27153 24777 49532 46458 20888 24920 17140 45888
8983 45888 58885 58898 52246 55616 77977 79491 86812 73678 52057 25480 20140 2998 -5397 -5902
8969e902Q384J5230r915l584R344M4j0045j8031K4522J6998J5971Q790K701o222
8955D8285O188r12J0256r872o356J725k3405l167J25j2568O799q886K5993L4667
8941F8872N827j3913O118p518j8120j2866n653j034J0041j67M181k8745j4470
8928g447K3090J0872J7682J3990J050o052k5348j8173P337r040J3167n160k8749
8915a2781p149J6890P761L288l67N807L188L160r871K0311o051K6011j6258J214
8901C5153J3544k0449k7118J2315K4000J5459k0576j6306K0841O123l561q912
8889C0513p571M198n655O036K928R080j0697O81P499j211m266k938K1261p186
8875D2672P231j9587r186j4880K3551o294n486O361n258J1730Q884Q552O135N118
$$ plain form
8969 -5902 2482 17712 7797 4213 13557 13601 3556 -14475 10047 27045 43016 51806 54507 48285
8955 48285 54473 53561 63817 53945 47589 49314 25909 22742 22867 10299 17098 8212 34205 68872
8941 68872 74699 60786 66904 59386 41266 28400 22747 21713 31754 31587 35768 7023 -7447
8928 -7447 15643 26515 44197 58187 59237 53185 27837 9664 17001 7961 21128 15968 -12781
8915 -12781 -19930 -3040 4721 8009 7642 13449 16637 19797 9926 30237 24186 50197 33939 35153
8901 35153 48697 28248 1130 13445 37445 52904 32328 16022 36863 42986 39425 30513
8889 30513 22942 27140 21485 27521 30449 39529 28832 29513 37012 35801 31535 28597 49858 42672
8875 42672 49903 30316 21130 6250 29801 23507 18021 24382 19124 30854 39738 48290 54425 59543
8861E9543j7792k4975L333J1887j0803j0909o809L1928K3560k398N383j9302j4563
8848B8083n176J7479K0183n488m1550j3066K4730k37j8661o332P542l651j3263
8835i407J2508J0436k324l695o567J011J2272K466N415J027j1617O552P027l937
8821B1167n458J0852k609q304L7004J7615j9097J952J3329r014J433R740J3563
8808H2173k4943j718R406j8034j7159J924R011L279J8890k240j5638N969j5999
8795C4921j6863J5786J8381n740l5437j7872J878l015Q598K5122J967Q747K918
8782C9391K1601j6838k5108k0808J1660m975n68J8365l855o983J3173j733l066
8769B0256j2267J7151n037j1994J7909J1395m4727j6165J3357J4941Q239J4561
$$ plain form
8861 59543 41751 16776 20109 31996 21193 10284 3475 35403 58963 56565 61948 42646 28083
8848 28083 22907 40386 60569 55081 13531 465 25195 24958 6297 -35 7507 3856 -9407
8835 -9407 3101 13537 11213 7518 951 1962 14234 16700 22115 23142 11525 18077 25104 21167
8821 21167 15709 26561 23952 15648 52652 70267 51170 53122 66451 57437 58870 68610 82173
8808 82173 57230 55512 64918 46884 29725 31649 40660 43939 62829 60589 44951 50920 34921
8795 34921 18058 33844 52225 46485 11048 -6824 -4946 -7961 637 25759 27726 36473 39391
8782 39391 60992 44154 19046 -1762 9898 4923 4355 22720 18865 11882 25055 23322 20256
8769 20256 7989 25140 20103 8109 26018 37413 -7314 -23479 -10122 4819 13058 27619
8757B7619j1840l2464K461J0773n315J3291J7644J3131J1690j9840L81l374q262
8744A5895k796j3636n66J6023L196M847k996P679j1706j1258j4506n292K906J0936
8730a274m229J2442J5006P094m747m538L2899Q050N020q416Q07P983r128j1360
8716D5609P940m2100l2519L753r365L1853J0549j6855j6845j1647K9473M125l73
8703C598J0432P037J454K5892M861q88r430n082j4514K672J3085j3038m226R87
8689B2840k900M918K0457N727k8295M777J2249p373P059J9400R894j8178l2053
8676A8522p979J7320J949j7379K7340J7544J0432n125P507K975k0411K46J2964
8663F5905P088l385k0461k8870l815J2287J9862M612l775J5606o072k036o499
$$ plain form
8757 27619 15779 -16685 -14224 -3451 -8766 4525 22169 35300 46990 27150 27531 24157 15895
8744 15895 13099 -537 -1103 14920 18116 22963 19967 27646 15940 4682 -9824 -15116 -12210 -1274
8730 -1274 -5503 6939 21945 29039 24292 19754 52653 60703 65723 57307 58114 66097 56969 45609
8716 45609 53549 11449 -21070 -17317 -26682 5171 15720 -1135 -17980 -29627 -154 3971 3598
8703 3598 14030 21067 22521 48413 53274 52386 42956 37874 23360 26032 39117 26079 21853 22840
8689 22840 19940 24858 45315 51042 22747 27524 39773 32400 39459 58859 68753 50575 18522
8676 18522 10543 27863 29812 12433 39773 57317 67749 62624 70131 73106 52695 52941 65905
8663 65905 72993 69608 49147 20277 16462 28749 48611 53223 49448 65054 58982 56946 50447
8650E0447L348l150K4975R564l5005j7263M6064K4284j2294j0940P720j1041l2156
8637D4553Q579J7809k3461O740m918J2318J0528K840o53L107k189J0560k38J3784
8623I9359j3674l421K0650r36Q70j7160j2088M0552K3777Q306J07J5171K0777
8610A82290K0344M2438K7613m427J1477r46J5042L9983K145J4376J8252L5069
8598D03656n804J1598p790l7605l2717k8420l2062j3910l2286l3235j5612j5002
8586A60811j2198j2518P79J1416p716M202p823r668l1910n377O326l3449j1419
8573E1456J3980K0048M812j9896J65J8746j7897n469M748P629r106J9732r545
8560G9403k2459j1038K6244J1176m307Q914J3026k2191k4350O016O19P380L754
$$ plain form
8650 50447 53795 50645 75620 85184 50179 32916 78980 103264 90970 80030 87750 76709 44553
8637 44553 53132 70941 47480 54220 49302 61620 72148 74988 74335 77442 75253 85813 85575 99359
8623 99359 85685 82264 102914 101978 102848 85688 73600 114152 137929 146235 146342 161513 182290
8610 182290 202634 245072 272685 268258 279735 278789 293831 333814 335959 350335 368587 403656
8598 403656 397852 409450 401660 364055 331338 302918 270856 256946 224660 191425 175813 160811
8586 160811 148613 136095 136874 148290 140574 144776 136953 127285 95375 89998 96324 62875 51456
8573 51456 65436 85484 90296 70400 70565 89311 71414 65945 70693 78322 69216 88948 79403
8560 79403 56944 45906 72150 83326 79019 87933 100959 78768 54418 60434 61053 68433 72187
8547G2187K001K549j4648L333L21N092j2969O902J8918k9169k3829j7841o223
8534F624r406n235K1575K5813P419j610N892o387K95j2785k7767L337J8419Q425
8520C4609P701Q595k3425k3038j4236n106K5580K8793n9K2352k2190k3297J1028
8507B7307J8386K231l122r396m528N269J5897p744k5089J468Q170j4310M543p987
8493A1095k3822L0176L4998j0248O999l110J3486j3136q935m343j1473l052P907
8480B6542N704J4218j341J4344K147j62k6957L046J0513k353k6473j0943Q834
8467A7119m5P711q817j6906j0761k184Q112J8966M585p537L651p32Q882M857j3280
8452A3621j5265K5369K731Q26N416Q084N710Q884L654o113l0009k0023J6929J1867
$$ plain form
8547 72187 74188 76737 62089 65422 65743 70835 57866 64768 83686 54517 30688 12847 6624
8534 6624 -2782 -8017 13558 39371 46790 45180 51072 44685 44980 32195 4428 7765 26184 34609
8520 34609 42310 50905 27480 4442 -9794 -14900 10680 39473 39414 61766 39576 16279 27307
8507 27307 45693 47924 44802 35406 30878 36147 52044 44300 19211 20679 28849 14539 19082 11095
8493 11095 -12727 17449 52447 42199 49198 46088 59574 46438 37503 33160 21687 18635 26542
8480 26542 32246 46464 45123 59467 61614 61452 34495 37541 48054 45701 19228 8285 17119
8467 17119 17074 24785 15968 -938 -11699 -13883 -5771 13195 17780 10243 13894 13162 22044 26901 13621
8452 13621 -1644 23725 26456 27282 32698 40782 46492 55376 59030 52917 22908 2885 19814 31681
8438C1681k2710q433j0427j1449K0175r55M931J6063k490J2935J4332K532l1715
8425A4470q86N609j8819j7747J4162K1584Q529J16o008m638Q288j5264k4492L267
8411a1829m646r105J4535R139K1582J6219K5256J2271j3697k2366k3076J6912
8399C1195K4035k2954j8314l976L472j806j0333l88N839N490J312k32j2480j803
8385i43k386P884k2572j7341J2874n104j6673J1073L2659j2112j4571J9382L5649
8372B7819K1277J1039p579n731Q645O457j2898k5223K929J868j0161Q40l556J5051
8358C0777R922r355M120N058k5708j9487r332N671J8334J48k1279j475J5779O801
8344I974j3268k1884Q89J2042j497J5265R326Q048R068K1366j7349j4828Q396
$$ plain form
8438 31681 8971 538 -9889 -21338 -1163 -2118 2813 18876 16386 29321 43653 46185 14470
8425 14470 13584 19193 374 -17373 -3211 18373 26902 27018 21010 16372 24660 9396 -15096 -11829
8411 -11829 -16475 -25580 -11045 -1906 19676 35895 61151 73422 59725 37359 14283 31195
8399 31195 55230 32276 13962 9986 13458 11652 1319 931 6770 12260 13572 13340 860 -943
8385 -943 -3329 4555 -18017 -35358 -22484 -27588 -44261 -33188 -529 -12641 -27212 -7830 27819
8372 27819 49096 60135 52556 46825 55470 61927 49029 23806 26735 28603 18442 19282 15726 30777
8358 30777 40699 31344 35464 40522 14814 -4673 -14005 -8334 10000 10148 -11131 -12606 3173 9974
8344 9974 -3294 -25178 -24289 -12247 -13744 1521 10847 18895 27963 49329 31980 17152 25548
8331B5548j2186R171J4242P19r212j6048r778k1858j0049P597j085J0036n231
8318a8134J0109M5790k465j0992N725m809k5936k4952j7016L1201K8002N952M052
8305B6527J1070J3606k4603o428M847M619n324j3633j7753n275J748J1536J3057
8292A3994J8666Q354j3200J5699K4287P358j3361j9876j7986J7496K2009k2247
8280D1193k823p64m429K510K980j3081k1551j1723l305J6016N47q750j0436j4782
8266b8398l653K0391J5353M472M08n864l713O611K537J2266J1252M69j3162p151
8252A1818K7821J4282O38M763M616l8314j2867j0676J3407j350N596p607q94m33
8238A0800k5363j3670k018J5831M739k573r375j9289P118O966K2353j139K0905
$$ plain form
8331 25548 13362 22533 36775 37494 28282 12234 2456 -19402 -29451 -21854 -22939 -12903 -18134
8318 -18134 -8025 37765 35300 24308 30033 25224 -712 -25664 -42680 -11479 16523 22475 26527
8305 26527 37597 51203 26600 20172 25019 29638 24314 10681 -7072 -12347 -10599 937 13994
8292 13994 32660 41014 27814 43513 67800 75158 61797 41921 23935 41431 63440 41193
8280 41193 38370 37606 33177 35687 38667 25586 4035 -7688 -10993 5023 5570 -3180 -13616 -28398
8266 -28398 -32051 -11660 3693 8165 8573 2709 -1004 5607 8144 20410 31662 32131 18969 11818
8252 11818 39639 53921 54559 59322 63938 25624 12757 2081 15488 14138 19734 12127 11233 10800
8238 10800 -14563 -28233 -30251 -14420 -9681 -12254 -21629 -40918 -33800 -26834 -4481 -5620 15285
8225A5285K4000P564P0P172J7916k7411l4165J0224j2742k0204J402k9101j1187
8212e1177J4707J5553j2742l216j5558K3863K9686q691o471l042j1358J8423m907
8199a4930J9028L8773j735j1728j9614r546Q141j9073j3918j3113K756N001J4615
8186a5343R996k0628k1419P236J1639K3858K0316N481j0591l1687p794K0855R641
8173A560J4993j4902n273R089L928K7721N756j864j3214l2937j5968k019j000
8160b4130M282J7969P427j2609K609K4266Q172l977k139j7253l00J8728J0074
8147C3119J8397j3379k9908n618O596K431K96o862n298q510j839R501o121O076
8133a119m357L53j0200q249J6859P186p246o172j8106K9697K8215k263k1490J228
$$ plain form
8225 15285 39285 46849 46919 54091 72007 44596 10431 20655 7913 -12291 -10889 -39990 -51177
8212 -51177 -36470 -20917 -33659 -36875 -52433 -28570 1116 -7575 -14046 -17088 -28446 -10023 -14930
8199 -14930 4098 42871 41136 29408 9794 248 8389 -10684 -24602 -37715 -34959 -29958 -15343
8186 -15343 -5347 -25975 -47394 -40158 -28519 -4661 15655 21136 10545 -21142 -28936 -8081 1560
8173 1560 16553 1651 -3622 5467 9395 37116 42872 41008 27794 -5143 -21111 -23130 -24130
8160 -24130 -19848 -1879 5548 -7061 -4452 19814 27986 24009 21870 4617 4317 23045 33119
8147 33119 51516 38137 8229 2611 9207 11638 11934 5072 -226 -8736 -10575 -1074 -7195 -1119
8133 -1119 -5476 -5123 -15323 -23572 -6713 473 -6773 -12945 -31051 -1354 26861 24598 3108 4336
8119D336K2757n376J331J3994o966l238j1433j6905J1806K3943k933n676l276
8106B2364k2292k8565N157j2353r148K8285l113j5086K5465o458L398J3856L083
8093D593q388o061J6743J0444J3742j5632J8936J190M164P683j3267l2011j0934
8080h798J8566Q014j4754J5229J098p586J1970l557P574k792j14J9262J5110l1636
8066B7586J3958k0290j1840O111K5239R523j3039k2433k0350N922K2029J6998
8054C9414n286o778j8404K3448K4739M188m502Q928p229J254j4446r963J5404
8041E0767R97k454m324J0752K8652k4469L320N894j9258j1223J353M494J2296
8028E6797J1880J5716j8266j7773j0443m549j3510K8369L6117J4411J1845j6252
$$ plain form
8119 4336 27093 21717 23048 37042 30076 26838 15405 -1500 10306 34249 31316 25640 22364
8106 22364 72 -28493 -23336 -35689 -44837 -16552 -19665 -34751 -9286 -15744 -12346 1510 4593
8093 4593 -3795 -9856 6887 17331 31073 15441 34377 35567 39731 47414 34147 2136 -8798
8080 -8798 9768 17782 3028 18257 19355 11769 23739 20182 27756 24964 24850 44112 59222 27586
8066 27586 41544 21254 9414 15525 40764 50287 37248 14815 -5535 387 22416 39414
8054 39414 34128 27350 8946 32394 57133 61321 56819 65747 58518 59772 45326 35363 50767
8041 50767 51764 49310 44986 55738 84390 59921 63241 69135 49877 38654 40007 44501 56797
8028 56797 68677 84393 66127 48354 37911 33362 19852 48221 84338 98749 110594 94342
8016I4342k6787j6165j947Q857P642l878J042O600K6676P924l367q608l840n32
8002H7959J6215K5119j5560n147n375R945J0310j1661l6641l6552k9408j5970
7990f766K0186J3586q08J3092K1056J0187r57l7415j6417K2636Q239m291k71R366
7976E1423K2226L674j9145j2865L0232K1616p064l280J0892J625l470j2206N29
7963H4187J7891N769k770M510P14J765p419O987j4913P829n34J0296k2292k3518
7949F8502J5103J2234k4640l5324j9183o975K223R68J6076K441J1749O98J4420
7936E8292L57k7350l919k3862L098k957o321n535J2922K7909N068K7859J9905
7923H5466q586k1444K080K3972J9691n817j6735l5519p134K3886J2206p634k0640
$$ plain form
8016 94342 67555 51390 49443 58300 65942 62064 63106 69706 96382 104306 100939 92331 88491 87959
8002 87959 104174 129293 113733 108586 103211 113156 123466 111805 75164 38612 9204 -6766
7990 -6766 13420 27006 26198 39290 60346 70533 69576 32161 15744 38380 46619 42328 42057 51423
7976 51423 73649 77323 58178 45313 75545 97161 90097 86817 97709 99334 95864 83658 84187
7963 84187 102078 107847 105077 109587 110301 112066 104647 111634 96721 104550 104016 114312 92020 68502
7949 68502 83605 95839 71199 35875 16692 9717 11940 12908 28984 31425 43174 43872 58292
7936 58292 58649 31299 27380 3518 6616 3659 -2662 -8197 4725 32634 37702 65561 85466
7923 85466 76880 55436 57516 81488 101179 95362 78627 43108 35974 59860 72066 64432 43792
7910D3792j3934O359J2615L2657J0999k194j0757l2630k1317k5950k6869K305
7898b4924J2466L521k6k3j4171M907Q907J1570J2152J424mk3976m457L0898O816
7883B5080j9061K406m55J4701L2341j9901M164n801k966P594J1220j4288l42j4389
7869B0303k3489M723j0247N228J5845O001r226j2715m623J8647j295J8880J8152
7856D6184k5586J6196K6393J2529J7566k0137l2379j6868p319j0163k5814M904
7844a4494L8696J840r331n04N431j4023m498N622n114j8134j1342N30K048j0184
7830c3457O62J9022L6629R744Q589j1675k0999L550r7J0042L177r964k2507M195
7816c089P50j270r089J0957J3753J2030m985o891j955j0747r468J7345j6162n670
$$ plain form
7910 43792 29858 36217 48832 81489 92488 90294 79537 46907 25590 -360 -27229 -24924
7898 -24924 -12458 -8937 -8963 -8986 -23157 -18250 -9343 2227 14379 15803 15799 -8177 -12634 18264 25080
7883 25080 6019 8425 7970 22671 55012 35111 39275 33474 30508 38102 49322 35034 34692 20303
7869 20303 -3186 1537 -8710 -3482 12363 18364 9138 -3577 -8200 10447 9152 28032 46184
7856 46184 20598 36794 63187 75716 93282 73145 40766 23898 16579 6416 -19398 -14494
7844 -14494 24202 26042 16711 16207 21638 7615 3117 8739 3625 -14509 -25851 -25321 -23273 -33457
7830 -33457 -32795 -13773 22856 32600 41189 29514 8515 12065 11968 22010 25187 15223 -7284 -3089
7816 -3089 -2339 -3609 -12698 -1741 12012 24042 19057 12166 10211 -536 -10004 7341 -8821 -14491
7802a4491l298M180J0409j0647J3821L3893J0742k788k5820k5279M010K166j3072
7789a6174N109m072J386J9029m288J3032K7926k896r392J9190l822k2920j0325
7776A1783j0122j5918K4542R497r140k285j2275j5728l3479O725J9017J6050K1689
7763A0356n683j6977l029M28k3369k9494J867Q900R746L466L357J1503k931q066
7749c9926J3418J2540o008K1854J8634j0809J2177R310k4500L019K159q782O393
7736I479J901j5159K901j5967j9456P115j3939k6895J0509K0780J0894P731K216
7723a7890J719K0355q540l28j1629l3607j4130L0424K6224J0897p618M613K2448
7710B2938N221k0759j1045J1306R585k752J303k6483j2744j949j6686K1258l343
$$ plain form
7802 -14491 -17789 -13609 -3200 -13847 -26 33867 44609 41821 16001 -9278 -5268 -3102 -16174
7789 -16174 -11065 -15137 -13751 5278 990 14022 41948 39052 29660 48850 45028 22108 11783
7776 11783 1661 -14257 10285 19782 10642 8357 -3918 -19646 -53125 -46400 -27383 -11333 10356
7763 10356 4673 -12304 -15333 -14905 -38274 -67768 -65901 -57001 -47255 -43789 -40432 -28929 -31860 -39926
7749 -39926 -26508 -13968 -19976 1878 20512 9703 21880 31190 6690 9709 11868 3086 9479
7736 9479 11380 -3779 -878 -16845 -36301 -29186 -43125 -70020 -59511 -38731 -27837 -20106 -17890
7723 -17890 -16171 4184 -4356 -4684 -16313 -49920 -64050 -33626 -7402 3495 -4123 490 22938
7710 22938 28159 7400 -3645 7661 17246 14494 15797 -10686 -23430 -25379 -42065 -20807 -24150
7697b4150j1849J0145L1228M591r825o975j0044k5402J7507L7841J3532M488j3126
7684A7961j3917J690j9984m175Q94J5811j2606k137o389j244J7917j4042J0697
7671i524Q252N504n844j0576q147m037P917K8053O781k4910o124n211k2589k274
7657d2729K4224J3850p671j3556M44m204K9253J5901l477J1409q272k0143J02
7644d869o858L320M988O200j9245q439J0659k089K707J9724r262R776L613k3592
7630a3367k545l914q390J1597o494k8260m841K4056L4406o288O692J1318N354
7617A9324q665K051l34k5191j525K2751j0343k9209p508j806m636N700K1560K7486
7603I655l8946j5101J5797N994J7210R18k0604K782K2532m966k3140j527J5464
$$ plain form
7697 -24150 -35999 -25854 5374 9965 140 -6835 -16879 -42281 -24774 13067 26599 31087 17961
7684 17961 4044 5734 -14250 -18425 -17531 -1720 -14326 -16463 -22852 -24096 -6179 -20221 -9524
7671 -9524 -1272 4232 -1612 -12188 -20335 -24372 -16455 11598 18379 -6531 -12655 -17866 -40455 -42729
7657 -42729 -18505 -4655 -12326 -25882 -25438 -29642 -389 15512 12035 23444 15172 -4971 -4869
7644 -4869 -11727 -8407 -3419 2781 -16464 -24903 -14244 -16333 -13626 6098 -3164 6612 10225 -13367
7630 -13367 -15912 -19826 -28216 -16619 -23113 -51373 -56214 -32158 2248 -4040 2652 13970 19324
7617 19324 10659 12710 12376 -12815 -14340 8411 -1932 -31141 -38649 -40455 -45091 -39391 -17831 9655
7603 9655 -29291 -44392 -28595 -22601 -5391 -4473 -25077 -22295 237 -4729 -27869 -29396 -13932
7590a3932K3868j159J1495j041j4096j9549m437K7279J8288J2803k5175j1580
7578B764Q153O241k7027j1179n287j6545m959j0515K2897M586q421Q388M257J6583
7564a0064J1077J3606p221J7716j341k2521k5329j8540J0917j237l96o982j2533
7551e2848J967O416J5605p14k1312n986K8293K9760k1369k71J0581j4157J2070
7538a1965P126J1051O014j6186M965O0222M354k6458k3681M254j431k2269j8718
7525b2722j690N521K1700J7338M341j8743o084R778k17k0802j3346J0629j485
7512a5782j1476J1600N110m733R279r7J5079O475j6451l1930j6934O293J8626
7499b4941J5213J4472L0625K3m0605R444P901j6025r363P01J7446K5914Q640j4590
$$ plain form
7590 -13932 9936 8777 20272 19231 5135 -14414 -18851 8428 26716 39519 14344 2764
7578 2764 10917 17158 -9869 -21048 -26335 -42880 -47839 -58354 -35457 -30871 -39292 -30904 -26647 -10064
7564 -10064 1013 14619 7398 25114 23773 1252 -24077 -42617 -31700 -32937 -33333 -40315 -52848
7551 -52848 -50881 -44465 -28860 -29574 -50886 -56872 -28579 1181 -20188 -20459 -9878 -24035 -11965
7538 -11965 -4839 6212 12226 -3960 1005 61227 65581 39123 15442 19696 18265 -4004 -22722
7525 -22722 -24412 -18891 2809 20147 24488 5745 -339 9439 9222 -11580 -24926 -14297 -15782
7512 -15782 -27258 -15658 -10548 -15281 -6002 -6099 8980 15455 -996 -32926 -49860 -43567 -24941
7499 -24941 -9728 4744 35369 35392 -5213 4231 12132 -3893 -13256 -12555 4891 30805 39445 24855
7485B4855j7051j8381M082j85j646q072j2213r086O07o862N961J3621K2739J4077
7471A2446N712l7633l1866Q838L5149P496N451j0384P231L985J8082o92k8647
7458d832l8586q084K0119P843J8745K371j7776n872j7626o169J8322K8237J2833
7445I525N609k3146L298Q938N360Q024k6177k3651r70J2843J6123j7750k9177
7432e1151J4113J3007K823P614L94r533Q38m964k109j0599k0755j2334L1480K2128
7418a9048J2226N152J7371O822k0343j4142j3631q226O78J0768j966K7424O784
7405I869j6634k341J2659J3763J0087m319j5224k9533J3598l04J1755m01R918
7392A2893J0351j4893j9724L055J4815R120J0392o71j2095j2866J1701J6746j5794
$$ plain form
7485 24855 7804 -10577 -6495 -6680 -8326 -16398 -28611 -37697 -37090 -43952 -37991 -24370 -1631 12446
7471 12446 18158 -19475 -51341 -42503 -7354 142 5593 -4791 2440 6425 24507 23815 -4832
7458 -4832 -43418 -51502 -31383 -23540 -4795 -2424 -20200 -26072 -43698 -49867 -31545 -3308 9525
7445 9525 15134 -8012 -4714 4224 9584 17608 -8569 -32220 -33190 -20347 -4224 -21974 -51151
7432 -51151 -37038 -24031 -21208 -13594 -13200 -22733 -21895 -26859 -28968 -39567 -60322 -72656 -41176 -19048
7418 -19048 -6822 -1670 15701 22523 2180 -11962 -25593 -33819 -33141 -22373 -24339 3085 9869
7405 9869 -6765 -9106 3553 17316 27403 23084 7860 -21673 -8075 -8379 3376 2975 12893
7392 12893 23244 8351 -11373 -8318 6497 15617 26009 25338 13243 377 12078 28824 13030
7379A3030j1788k4533j5637J3425L2874M006J518J0965m774P482K764m813k1639
7366B880k1915l17K1413k820M491q301j6039K1596J8647j4145l970J992R117k7160
7352a4531j6141l6972K431N2149L1019L11j4122m500j7932J4670J2111J6507M398
7339B9398l8116m3008J1110K0491L1443j2800j0318k1763J7N770k2030L438J7379
7326b8989j2639J4160K3402J901j1781j728r386q810K3805l782r555L565P715
7313a2122J1242k6310j8647o157P34K097qR842N001M690K0833J0132o219O941
7299B049l465N106N149M724Q348k622N407j2967j5237l563K6811J5045L55k2091
7285A3049k4588l13j4278m966q384n048q79K6435K4913j8593q273o370M953m365
$$ plain form
7379 13030 1242 -23291 -38928 -25503 7371 11377 12895 23860 19086 26568 29332 24519 2880
7366 2880 -19035 -19352 2061 -759 3732 -4569 -20608 988 19635 5490 1520 3512 12629 -14531
7352 -14531 -30672 -67644 -65213 -13064 17955 18266 4144 -356 -18288 -3618 8493 25000 29398
7339 29398 -8718 -51726 -40616 -20125 11318 -1482 -11800 -33563 -33546 -27776 -49806 -46368 -28989
7326 -28989 -41628 -27468 -4066 -2165 -13946 -15674 -25060 -33870 -10065 -13847 -23402 -19837 -12122
7313 -12122 -880 -27190 -45837 -51994 -51260 -49163 -49171 -39329 -34328 -29638 -8805 1327 -4892 2049
7299 2049 -1416 3690 8839 13563 21911 19289 24696 11729 -3508 -7071 19740 34785 35140 13049
7285 13049 -11539 -11852 -26130 -31096 -39480 -44528 -45407 -18972 5941 -12652 -20925 -27295 -22342 -26707
7271b6707j986R797k4153m260K1099Q595L708k6322j2784K5071j0365j2160R459
7258d1008J5096o410J1897L0836R645k5234j4508J1067P522k7954p492p455l888
7245d7886Q616K0456m512k1522m04J3938j7411m450L8658K7884J6991k134k7716
7232E08l0996n488l860m498J8058K2776K2834K608j3549L259j0712q453Q426J5320
7218A6233q18J4950j787j5624j4220K1445j7662j3032J4626N063l166k3786r415
7205b7193K6662p36j0533k298q8J0418K9738J4161k6984r756M829j4785J9821
7192A3256j8912R662n969m430K4195O985K73n593J2226O32J61j7012j3358J8181
7178B0297m598k219N33k9803o704J3092j619j7026q779L726J6634P176o269k3316
$$ plain form
7271 -26707 -28693 -18896 -43049 -47309 -26210 -17615 -13907 -40229 -53013 -27942 -38307 -50467 -41008
7258 -41008 -25912 -32322 -20425 10411 20056 -5178 -19686 -8619 -1097 -29051 -36543 -43998 -47886
7245 -47886 -39270 -18814 -23326 -44848 -45252 -31314 -48725 -53175 -14517 13367 30358 28224 508
7232 508 -30488 -35976 -39836 -44334 -26276 -3500 19334 21942 8393 11652 940 -7513 913 16233
7218 16233 15415 30365 28578 12954 -1266 20179 2517 -10515 4111 9174 6008 -17778 -27193
7205 -27193 -531 -1267 -11800 -14098 -14186 -3768 25970 40131 13147 3391 8220 -6565 13256
7192 13256 -5656 4006 -1963 -6393 17802 24787 25060 19467 31693 32325 32486 15474 2116 20297
7178 20297 15699 13480 14013 -15790 -22494 -9402 -11021 -28047 -36826 -33100 -16466 -9290 -15559 -38875
7164c8875J8974J1084K5893k0157k0740k8927J084J453O170J0598k365k099K5396
7151a2511J0144J8105r878l1988K505N744k2409k2418J2729M0197J1737J4170
7139A6127J518o546p046J1002r45K4297k3755k4816O587j670Q841O138J686J6498
7125B7916R102o455l945o318m4303k391K4838r0l3617o451J1307n04J132J1480
7111a8299L840o991k374p443J2301J1269n425J0369J9293P018j2901j3941j4041
7098a7325J1118m468o178J9640N669q25q877K1137k043o258q943R511K977R395
7084B4530P732Q655k2896l0237J3659J0620M842K285k4003j4104L8498K3272k365
7071D0488l5480j1271O360J6937j0419n149M547j9126k5153K0767l988l7343j5998
$$ plain form
7164 -38875 -19901 -8817 17076 -3081 -23821 -52748 -51664 -50211 -44041 -33443 -35808 -37907 -12511
7151 -12511 -2367 15738 5860 -26128 -23623 -17879 -40288 -62706 -49977 -9780 1957 16127
7139 16127 17645 11099 4053 15055 14110 38407 14652 -10164 -3577 -5247 3594 9732 11418 27916
7125 27916 37018 30563 26618 20300 -24003 -26394 -1556 -1646 -35263 -41714 -30407 -30911 -29779 -18299
7111 -18299 -14459 -21450 -23824 -31267 -18966 -7697 -13122 -2753 16540 23558 10657 -3284 -17325
7098 -17325 -6207 -10675 -16853 2787 8456 7631 -1246 19891 17848 11590 2647 12158 15135 24530
7084 24530 32262 40917 18021 -12216 1443 12063 16905 19190 -4813 -18917 19581 42853 40488
7071 40488 5008 -6263 97 17034 6615 1466 6013 -13113 -38266 -17499 -21487 -58830 -74828
7058g4828N299K5000K1991J5017J4174j6657j0990j2997k741L2776P054J914J8416
7045B3428n98p897l492K1599k0510l6973m629O638J103p647N738L0871k465k8360
7031b3194k2539J4993J7405j4242K1032j8068j0081M435Q855J7156j3341k6594
7019d4183j528J2841J0985K0141J1117l854j4818j035r307p982J52m1753L1225
7006c7999L3893O54p437j4075K732K3003j129j7793j8467K883K3754n02j0188
6993b0671k6732k2198K3932N0232R200j6058J4471j2912k354k3851j4006M178
6981c6769J3897J1386O571J1908m093j190j3781j9662N681L8167J4923j4865j1934
6968B39l991p070j487j0533j0633J3406L2425J6054k9187N845J8785L117k2694
$$ plain form
7058 -74828 -69529 -44529 -22538 -7521 6653 -10004 -20994 -33991 -36732 -3956 3098 5012 23428
7045 23428 22830 14933 11441 33040 12530 -24443 -29072 -22434 -21331 -28978 -23240 7631 5166 -23194
7031 -23194 -45733 -30740 -13335 -27577 -6545 -24613 -34694 -30259 -21404 -4248 -17589 -44183
7019 -44183 -45711 -32870 -21885 -1744 9373 5519 -9299 -10334 -19641 -27623 -27471 -69224 -37999
7006 -37999 -4106 -3452 -10889 -24964 -22232 771 -358 -18151 -36618 -33735 -9981 -10483 -20671
6993 -20671 -47403 -69601 -45669 4563 13763 -2295 12176 -736 -3090 -26941 -40947 -36769
6981 -36769 -22872 -11486 -4915 6993 2900 1710 -12071 -31733 -26052 12115 27038 12173 239
6968 239 -3752 -10822 -12309 -22842 -33475 -20069 12356 28410 -777 5068 23853 26970 4276
6955D276k624p034j2772J0422j3491p94m809r014p551K2181K2141k2655N678L973
6941a2073N93j5230m249J2582L2745K2628K201k7542j9522K488K0766Q318l023
6928B0682Q33J2868m803k0294M092L971j3186j8464n94l241p057q93J781J2236
6914a2069R935K521K1242R891J6884j2839j0958j9513k6899O590L7755J0769j6554
6901A6755j2921q377l290q592K873J41k036J9051J849n59r890j4781r907M888
6887b4796L7248Q980k5126K643k1086K3718J7437j9571J4723j2276o816j0161
6875a5083M534j5686J0042m447m757j9204Q729N35k5858J9022L3174Q381p415
6862h033K078n541j7345K5891J1180M331J6654l0964l5713J6641K9387Q708j5112
$$ plain form
6955 4276 1652 -5382 -18154 -7732 -21223 -22017 -26826 -35840 -43391 -21210 931 -21724 -16046 -12073
6941 -12073 -11480 -26710 -30959 -18377 14368 36996 39197 11655 -7867 -5379 15387 23705 20682
6928 20682 21515 34383 29580 9286 13378 17349 4163 -14301 -14895 -18136 -25193 -26086 -24305 -12069
6914 -12069 -2134 387 21629 31520 48404 35565 24607 5094 -21805 -15215 22540 33309 16755
6901 16755 3834 -4543 -7833 -16425 -13552 -13411 -15447 3604 5453 4894 -4996 -19777 -29684 -24796
6887 -24796 12452 21432 -3694 -1051 -22137 1581 19018 -553 14170 1894 -4922 -15083
6875 -15083 -10549 -26235 -16193 -20640 -25397 -44601 -35872 -35337 -61195 -42173 -8999 -618 -8033
6862 -8033 -5955 -11496 -28841 -2950 8230 12561 29215 -1749 -37462 -20821 8566 17274 2162
6849B162N087J0820J7100k1588q872j7387J1560o529p757J7640K7576J1197o8
6836D0941L580j9537k9910Q500O591r934K3228k632p124k0205J623p807j3315
6823b6001m764J6454k142o372k3182J0146J6505J241J270J3093N141K352o986
6810c245q570J5924j3679j0622j6931j0122J3096R760j750N734K9340J291l0634
6797b0408P757J1957J6349l0974j5651k100Q442j0495K0246L3407J3512N082k4312
6784A2812q473q881j1659n284J2705J0162j3567j8691q419j4956R579O226J8594
6771a9852O520j5362j058j1898q621J8816J9406k749j2776Q425K5674M595j2013
6758h93K456j2984j047J3901J2008r567k539J0168L604k0315p471J6197M727r901
$$ plain form
6849 2162 7249 18069 35169 13581 4709 -12678 -1118 -7647 -15404 2236 29812 41009 40941
6836 40941 44521 24984 -4926 3574 10165 231 23459 20827 13703 -6502 -4879 -12686 -26001
6823 -26001 -30765 -14311 -16453 -22825 -46007 -35861 -19356 -18115 -16845 -3752 1389 3741 -3245
6810 -3245 -11815 4109 -9570 -20192 -37123 -47245 -34149 -24389 -26139 -20405 8935 10226 -20408
6797 -20408 -12651 -694 15655 -15319 -30970 -33070 -24628 -35123 -14877 18530 32042 37124 12812
6784 12812 4339 -4542 -16201 -21485 -8780 1382 -12185 -30876 -39295 -54251 -44672 -38446 -19852
6771 -19852 -13332 -28694 -29752 -41650 -50271 -31455 -12049 -14798 -27574 -19149 6525 11120 -893
6758 -893 1563 -11421 -12468 1433 13441 3874 1335 11503 15107 -5208 -12679 3518 8245 -1656
6744a656p38j507J3559j9900n527K4595L015k8922P182K4056P897l453q346o235
6730D020j1427M217j1370l005k1652K0041K6096J4329m508N313k020n699m840
6717I495K5180K810o867j7903j7148J1948l711j381J3328k2126m587J3164P992
6704A0194J8646k1839j7916j232R390J1199J8454l095l1005j4762n472J8653J1627
6691B842O043k2813j7732J3981K2301Q452l406p242J850J6566K3176L182k4205
6678B2995l2010q862q833m224K1629J9906K973J931k812j6588m077K704K508L14
6664b446j405j1824j5910Q820J7068J1273L243O63j277p93k6994j3478j9615J1614
6650d1061K70L170J9482K167k4120J5838K0q67J6727J9486M461l405N919j169
$$ plain form
6744 -1656 -2394 -3901 9658 -10242 -15769 8826 11841 -17081 -9899 14157 22054 18601 10255 4020
6730 4020 -7407 -3190 -14560 -17565 -39217 -19176 6920 21249 16741 22054 20034 14335 9495
6717 9495 34675 37485 30618 12715 -4433 7515 3804 2423 15751 -6375 -10962 2202 10194
6704 10194 28840 7001 -10915 -12147 -2757 8442 26896 23801 -7204 -21966 -27438 -8785 2842
6691 2842 8885 -13928 -31660 -17679 4622 13074 9668 2426 4276 20842 44018 47200 22995
6678 22995 -9015 -17877 -26710 -30934 -9305 10601 13574 15505 12693 -3895 -7972 -5268 -2760 -2446
6664 -2446 -3851 -15675 -31585 -22765 -5697 5576 8819 9482 8205 7412 -19582 -33060 -52675 -41061
6650 -41061 -40791 -37621 -18139 -15972 -40092 -24254 -24234 -25101 -8374 11112 15573 12168 18087 16918
6636A6918m395k4665p767J167j2483k1449O917J7304L3654n878O923J6957J1361
6623C4564m816k8125j2046l881r863N65J7766K3680K415j1069k8143j290J6308
6610c935k226j4504J951j774j0034J7814L0556K8613M280k3802p760k0778M008
6597B409M345n400P918Q903m354l0031j3053J1214J0954P39j0885j0231m184J6368
6583a5288M1636J2062j9758k6244r414L441j730j2175L636J6571j3017J1106O994
6570b180j378r080j5845l056j6753K0962J2119j0077j753L4626J8908p400j5416
6557C677j2277j2020Q300j0465o796J0984O034M667O760L616J424j0018J827K484
6543a803r058q212j0291o222K1398K8267l425J261k2204m032p523l7889M50L5712
$$ plain form
6636 16918 12523 -12142 -19909 -18742 -31225 -52674 -45757 -28453 5201 -677 6246 23203 34564
6623 34564 29748 1623 -10423 -14304 -24167 -23602 -5836 17844 20259 9190 -18953 -20243 -3935
6610 -3935 -6161 -20665 -18714 -20488 -30522 -12708 17848 46461 50741 26939 19179 -1599 2409
6597 2409 6754 1354 9272 18175 13821 -16210 -29263 -18049 -7095 -6356 -17241 -27472 -31656 -15288
6583 -15288 26348 38410 18652 -7592 -17006 -13565 -15295 -27470 -23834 -7263 -20280 -9174 -2180
6570 -2180 -3558 -12638 -28483 -31539 -48292 -27330 -15211 -25288 -27041 7585 26493 19093 3677
6557 3677 -8600 -20620 -12320 -22785 -29581 -18597 -12563 -7896 -1136 2480 3904 -6114 -4287 -1803
6543 -1803 -10861 -19073 -29364 -35586 -14188 14079 10654 11915 -10289 -14321 -21844 -59733 -59283 -23571
6529b3571K2244M878k169Q837O716q675l0263Q556K6886Q07L269q330j4759j6737
6515b2311J9309K3873r442R013j3576j1377J5712l46k5988j5944q570j118K1743
6502a9022M685K0634j3925k5870j721k532J5185P571L072j613p12m14Q013K4945
6488A8296k523j0112j4911m47m733R979K1676J729m807q133l6205m190R682j225
6474b5924L56Q11j0762l89R975j1391J5856L9394l080j7216j0219q510l907N224
6460a9782L93k210k0828L1920K2088k005Q669j3560J8557K0543O08L334j5980
6447C1747L012j049J2704J520l592l3302l3065n825L1943J4648K336m250l3541
6434a6714m4928J5596K1671J6050J1833L257j8188R545O331r154j30J2967K054
$$ plain form
6529 -23571 -1327 3551 1382 10219 16935 8260 -22003 -13447 13439 14246 17515 9185 -5574 -22311
6515 -22311 -3002 20871 11429 20442 6866 -4511 11201 10855 -15133 -31077 -39647 -40765 -19022
6502 -19022 -14337 6297 -7628 -33498 -35219 -37751 -22566 -14995 -11923 -13536 -14248 -14662 -6649 18296
6488 18296 15773 5661 -9250 -9697 -14430 -4451 17225 18954 14147 6014 -30191 -34381 -24699 -25924
6474 -25924 -25568 -24757 -35519 -35908 -25933 -37324 -21468 17926 14846 -2370 -12589 -21099 -25006 -19782
6460 -19782 -19389 -21599 -42427 -10507 11581 9576 18245 4685 23242 43785 44393 47727 31747
6447 31747 34759 33710 46414 47934 44342 11040 -22025 -27850 4093 18741 21077 16827 -16714
6434 -16714 -61642 -46046 -24375 -8325 3508 6765 -11423 -1878 4453 -4701 -4831 8136 10190
6421A0190k3386M493K5907P235j1670l0347q715l094J7953K0103k5620j8496J0022
$$ plain form
6421 10190 -13196 -8703 17204 24439 12769 -17578 -26293 -29387 -11434 8669 -16951 -35447 -25425
$$ [...]
##END NTUPLES=NMR SPECTRUM
##END=
