##TITLE=Analysis number 329517
Compound Code cc 64808
Book Reference 552/2
Project Code adrs
Chemist Name stevem
##JCAMPDX= 6.0         $$ Bruker NMR JCAMP-DX V2.0
##DATA TYPE= NMR SPECTRUM
##DATA CLASS= NTUPLES
##ORIGIN= Bruker BioSpin GmbH
##OWNER= nmr
$$ XWIN-NMR		Version 3.5
$$ Mon Sep 10 11:23:16 2007 GMT Daylight Time (UT+1h)  MAYBRIDGE\nmr@NMR_250MHZ
##.OBSERVE FREQUENCY= 250.131544655141
##.OBSERVE NUCLEUS= ^1H
##.ACQUISITION MODE= SIMULTANEOUS (DQD)
##.ACQUISITION SCHEME= undefined
##.AVERAGES= 16
##.DIGITISER RES= 18
##SPECTROMETER/DATA SYSTEM= dpx250
##.PULSE SEQUENCE= zg30
##.SOLVENT NAME= CDCl3
##.SHIFT REFERENCE= (INTERNAL, CDCl3, 0, 16.522)
##AUDIT TRAIL= $$ (NUMBER, WHEN, WHO, WHERE, WHAT)
$$ ##TITLE= Audit trail, XWIN-NMR		Version 3.5
$$ ##JCAMPDX= 5.01
$$ ##ORIGIN= Bruker BioSpin GmbH
$$ ##OWNER= nmr
$$ C:\u/data/dgb/nmr/ADRS/450/pdata/1/auditp.txt
$$ ##AUDIT TRAIL=  $$ (NUMBER, WHEN, WHO, WHERE, WHAT)
(   1,<2007-09-10 11:22:50.75 +100>,<MAYBRIDGE\nmr>,<NMR_250MHZ>,
      <created by zg, POWCHK disabled, PULCHK disabled
       configuration hash MD5:
       76 6E 9A 78 1E 09 19 81 EC 84 63 8F B0 6A 59 2D
       data hash MD5: 64K
       A3 B8 24 E1 93 A4 C3 78 27 79 40 28 7A 6E E1 CD>)
(   2,<2007-09-10 11:23:04.59 +100>,<MAYBRIDGE\nmr>,<NMR_250MHZ>,
      <Start of raw data processing
       ef LB = 0.3 FT_mod = 6 PKNL = 1 SI = 32K 
       data hash MD5: 32K
       1B B8 53 DA AA AC B3 D6 62 35 C0 6A 4E 23 D5 5E>)
(   3,<2007-09-10 11:23:06.17 +100>,<MAYBRIDGE\nmr>,<NMR_250MHZ>,
      <apk 
       data hash MD5: 32K
       35 59 DC 71 43 A5 66 EA 8D 23 37 50 CF E5 F5 00>)
(   4,<2007-09-10 11:23:06.91 +100>,<MAYBRIDGE\nmr>,<NMR_250MHZ>,
      <abs ABSG = 5 
       data hash MD5: 32K
       44 29 87 81 15 B1 D5 4E 2B 9F 50 D4 5A 95 EF B4>)
$$ ##END=
$$ 
$$ hash MD5
$$ FC CA 20 89 2D 45 D0 45 3A 1D F6 12 38 6C 5C BC
##$RELAX= 
##$RELAX= 
##$RELAX= 
##$RELAX= 
##$RELAX= 
##$RELAX= 
##$RELAX= 
$$ Bruker specific parameters
$$ --------------------------
##$DU= <C:\u>
##$EXPNO= 450
##$NAME= <ADRS>
##$PROCNO= 1
##$TYPE= <nmr>
##$USER= <dgb>
##$AMP= (0..31)
100 100 100 100 100 100 100 100 100 100 100 100 100 100 100 100 100 100 
100 100 100 100 100 100 100 100 100 100 100 100 100 100 
##$AQSEQ= 0
##$AQ_mod= 3
##$AUNM= <au_zg>
##$AUTOPOS= <22 >
##$BF1= 250.13
##$BF2= 250.13
##$BF3= 250.13
##$BF4= 250.13
##$BF5= 500.13
##$BF6= 500.13
##$BF7= 500.13
##$BF8= 500.13
##$BYTORDA= 1
##$CFDGTYP= 0
##$CFRGTYP= 5
##$CHEMSTR= <none>
##$CNST= (0..31)
1 1 145 1 1 1 1 1 1 1 1 1 1 1 1 1 1 1 1 1 1 1 1 1 1 1 1 1 1 1 1 1 
##$CPDPRG= <>
##$CPDPRG1= <>
##$CPDPRG2= <>
##$CPDPRG3= <>
##$CPDPRG4= <mlev>
##$CPDPRG5= <mlev>
##$CPDPRG6= <mlev>
##$CPDPRG7= <mlev>
##$CPDPRG8= <mlev>
##$CPDPRGB= <>
##$CPDPRGT= <>
##$D= (0..31)
0 1 0 0 0 0 0 0 0 0.06 0 0 0 0 0 0 0.0002 0 0 0 0 0 0 0 0 0 0 0 0 0 0 
0 
##$DATE= 1189419769
##$DBL= (0..7)
120 120 120 120 120 120 120 120 
##$DBP= (0..7)
150 150 150 150 150 150 150 150 
##$DBP07= 0
##$DBPNAM0= <>
##$DBPNAM1= <>
$$ [...]
##$SUBNAM7= <"">
##$SUBNAM8= <"">
##$SUBNAM9= <"">
##$SW= 20.6930455092707
##$SWIBOX= (0..15)
0 0 3 0 0 0 0 0 0 0 0 0 0 0 0 0 
##$SW_h= 5175.983436853
##$TD= 65536
##$TD0= 1
##$TE= 298.16
##$TE2= 300
##$TE3= 300
##$TEG= 300
##$TL= (0..7)
0 120 120 120 120 120 120 120 
##$TP= (0..7)
150 150 150 150 150 150 150 150 
##$TP07= 0
##$TPNAME0= <>
##$TPNAME1= <>
##$TPNAME2= <>
##$TPNAME3= <>
##$TPNAME4= <>
##$TPNAME5= <>
##$TPNAME6= <>
##$TPNAME7= <>
##$TPOAL= (0..7)
0.5 0.5 0.5 0.5 0.5 0.5 0.5 0.5 
##$TPOFFS= (0..7)
0 0 0 0 0 0 0 0 
##$TUNHIN= 0
##$TUNHOUT= 0
##$TUNXOUT= 0
##$USERA1= <user>
##$USERA2= <user>
##$USERA3= <user>
##$USERA4= <user>
##$USERA5= <user>
##$V9= 5
##$VALIST= <valist>
##$VCLIST= <CCCCCCCCCCCCCCC>
##$VD= 0
##$VDLIST= <DDDDDDDDDDDDDDD>
##$VPLIST= <PPPPPPPPPPPPPPP>
##$VTLIST= <TTTTTTTTTTTTTTT>
##$WBST= 1024
##$WBSW= 4
##$XGAIN= (0..3)
0 0 0 0 
##$XL= 0
##$YL= 0
##$YMAX_a= 330352
##$YMIN_a= -258936
##$ZGOPTNS= <>
##$ZL1= 120
##$ZL2= 120
##$ZL3= 120
##$ZL4= 120
##$ABSF1= 16.522
##$ABSF2= -4.171173
##$ABSG= 5
##$ABSL= 3
##$ALPHA= 0
##$AQORDER= 0
##$ASSFAC= 0
##$ASSFACI= 0
##$ASSFACX= 0
##$ASSWID= 0
##$AUNMP= <proc_1d>
##$AZFE= 0.1
##$AZFW= 0.1
##$BCFW= 0
##$BC_mod= 0
##$BYTORDP= 0
##$COROFFS= 0
##$CY= 12.5
##$DATMOD= 1
##$DC= 0
##$DFILT= <>
##$DTYPP= 0
##$F1P= 14.0000005364418
##$F2P= -0.99999901652339
##$FCOR= 0.5
##$FTSIZE= 32768
##$FT_mod= 6
##$GAMMA= 0
##$GB= 0
##$INTBC= 1
##$INTSCL= 1
##$ISEN= 128
##$LB= 0.3
##$LEV0= 0
##$LPBIN= 0
##$MAXI= 10000
##$MC2= 0
##$MEAN= 0
##$ME_mod= 0
##$MI= 0
##$NCOEF= 0
##$NC_proc= -3
##$NLEV= 6
##$NOISF1= 0
##$NOISF2= 0
##$NSP= 0
##$NTH_PI= 0
##$NZP= 0
##$OFFSET= 16.522
##$PC= 1
##$PHC0= -63.79764
##$PHC1= 5.689093
##$PH_mod= 1
##$PKNL= yes
##$PPARMOD= 0
##$PSCAL= 4
##$PSIGN= 0
##$REVERSE= no
##$SF= 250.13
##$SI= 32768
##$SIGF1= 0
##$SIGF2= 0
##$SINO= 400
##$SIOLD= 32768
##$SREGLST= <1H.CDCl3>
##$SSB= 0
##$STSI= 32768
##$STSR= 0
##$SW_p= 5175.98343685301
##$SYMM= 0
##$S_DEV= 0
##$TDeff= 65536
##$TDoff= 0
##$TI= <Analysis number 999999
Compound Code 99
Book Reference 9
Project Code 9>
##$TILT= no
##$TM1= 0
##$TM2= 0
##$TOPLEV= 0
##$USERP1= <user>
##$USERP2= <user>
##$USERP3= <user>
##$USERP4= <user>
##$USERP5= <user>
##$WDW= 1
##$XDIM= 32768
##$YMAX_p= 269242011
##$YMIN_p= -123792
$$ End of Bruker specific parameters
$$ ---------------------------------
##NTUPLES= NMR SPECTRUM
##VAR_NAME=  FREQUENCY,     SPECTRUM/REAL,   SPECTRUM/IMAG
##SYMBOL=    X,             R,               I
##VAR_TYPE=  INDEPENDENT,   DEPENDENT,       DEPENDENT
##VAR_FORM=  AFFN,          ASDF,            ASDF
##VAR_DIM=   32768,         32768,           32768
##UNITS=     HZ,            ARBITRARY UNITS, ARBITRARY UNITS
##FACTOR=    0.157963299565203, 1,           1
##FIRST=     4132.6476996994, 0,             0
##LAST=      -1043.33573715361, 0,           0
##MIN=       -1043.33573715361, -123792,     0
##MAX=       4132.6476996994, 269242011,     0
$$ Real data points
##PAGE= N=1
##DATA TABLE= (X++(R..R)), XYDATA
$$ [...]
22854 -44523 -53557 -53410 -41239 -10300 -5084 18323 7538 4684 16828 7935 15258 14868 -6339
22841 -6339 593 13879 20049 37385 26902 13470 -21407 -86166 -75157 -31336 -913 -23135
22829 -23135 -37796 7299 3587 3751 -18884 -4327 -24617 -34906 -31673 -29280 -8109 298 8547
22816 8547 25378 27787 65491 79477 61575 22106 12857 10299 639 -5188 3862 7085 12634
22803 12634 20840 42808 42758 -6422 -14696 -7694 -35784 -45518 -36283 -41281 -37884 -16721 23018 15460
22789 15460 -11631 -28343 -25786 -31054 -26219 -16063 -51000 -26614 -2113 -1418 689 4887 27619
22776 27619 45063 36301 29921 23456 -5249 -10 8765 -7221 2576 16717 6130 -21702 -31815
22763 -31815 -17285 11793 32223 22820 -10353 -57210 -40042 -9352 -7442 1564 3454 -17024
22751 -17024 -6150 -11969 -3372 -4172 -13463 -3793 -12826 -32510 -43943 -37797 -41727 -48336 -37663 -46916
22737 -46916 -45129 -52573 -29767 -1803 22874 50910 42155 22568 4577 -12797 -11661 -17259 10718
22724 10718 421 -20877 -18242 -3919 5597 3125 14899 35172 34825 11470 -751 -12209 -11281
22711 -11281 -7971 11947 2719 -12389 10286 7797 -4533 -21058 -21779 2114 3554 24786 26773
22698 26773 4778 13558 16654 5624 8138 22090 24083 5944 18672 14688 -443 -5779 -27963
22685 -27963 -4955 -9751 -46898 -44002 -17847 -496 803 -26199 -28750 -36317 -15455 -8717 -2680
22672 -2680 17286 -6057 -694 14575 -2994 -2500 -2929 4202 -11808 -4465 8845 -11018 -34786
22659 -34786 -11737 112 -11046 -16106 -16258 -10892 -4677 -23893 -42446 -30417 5941 16382 16054
22646 16054 21682 9966 -10747 -42417 -47867 -29448 -6838 590 -9321 11961 18637 10147 7534
22633 7534 -7349 -13551 -6898 -20951 -13237 -34650 -50249 -30091 -15136 -8952 -8505 -8687 2682
22620 2682 723 -21108 -24468 12090 823 -384 -35012 -41984 -28991 11373 14243 6697 10523
22607 10523 -1409 -8799 3966 5907 23616 27247 19332 25851 47133 37462 22856 16956 19486
22594 19486 24300 44859 40970 9563 -32133 -69844 -64352 61 4342 -11814 -28857 24403
22582 24403 30164 7715 -15059 -14134 2553 -7876 -12152 -8300 -15025 -31377 -26047 -25915 -15622
22569 -15622 -10395 217 -22944 -6526 4716 6314 34601 26626 4206 2032 -1838 3684 8109
22556 8109 1224 25803 24858 40513 30689 20724 22822 24170 3005 -15985 -26436 -30213 -18729
22543 -18729 -32787 -35134 -43854 -50514 -35356 -2397 12971 -11180 -47784 -25385 2301 8688
22531 8688 -1823 -2896 -26717 -38700 -10113 5574 40589 36438 25149 6011 -26759 -26886 -20348
22518 -20348 -10899 -2571 -8506 -29923 -49569 -22852 3574 6657 22140 -3710 -18152 -24076 -15066
22505 -15066 -18629 -19591 -17458 -45626 -39622 -9170 4402 -10961 -13515 -14505 -9138 -22710 -5571
22492 -5571 25085 27071 10422 -8040 -7326 13424 -2178 -9793 -11589 -11667 17030 34513 27700 23747
22478 23747 14811 -15677 -20465 -4914 -23885 5772 7633 -22784 -20877 -21599 1167 9945 9287
22465 9287 24651 36082 52705 57902 36632 36624 29432 7197 2093 16593 22991 2208 8939 25909
22451 25909 44887 47696 65887 83887 73908 44820 23001 22239 8060 -9065 -31630 -43082
22439 -43082 -65890 -66251 -83153 -64069 -46089 -18113 -39736 -65972 -54688 -28937 12363 10589
22427 10589 6133 -1968 -25108 -25384 -8543 -11759 -17852 -28063 -23242 -31583 -54538 -43277 -25503
22414 -25503 -1601 15315 34270 3013 -22019 -44362 -68948 -77217 -57197 -33193 5514 31814
22402 31814 17935 7410 -11253 -2346 1324 4725 28492 49134 28142 -26881 -47973 -73315
22390 -73315 -94370 -64428 -56045 -47699 -38241 -33821 -29897 -37863 -50594 -44231 -34662 -29290 -14096
22377 -14096 9400 13036 13263 54516 65089 1486 -40841 -75045 -47979 -26311 -14567 7162
22365 7162 27543 2893 -10056 -12738 -12579 10981 22962 8586 -3589 -17632 -24527 -1189 8244
22352 8244 14068 6213 2661 1067 -7302 -5044 -20360 -6968 -4306 -3283 -13710 -11267 12836 1735
22338 1735 -23851 -25950 -12660 30326 10912 -9421 1493 20594 9813 -174 4590 -21936
22326 -21936 -30377 1715 21589 15971 17136 29208 30033 20449 8778 -2680 -5927 3084 -6963
22313 -6963 -33633 -21960 -31717 -31971 -28714 -16728 1345 1905 -24113 -806 5402 9857 -14632
22300 -14632 -19272 -37652 -43201 -46945 -36972 -37833 -34878 -18560 -1146 -44 9711 11411 -12792 -21505
22286 -21505 -21544 -17227 -32873 -40862 -27115 -17275 -3564 -1271 27529 7939 -18688 -27824 -9947
22273 -9947 16617 25524 14135 18354 10653 -6286 4311 -1626 -5676 -31613 -58766 -39225 -27990
22260 -27990 -36293 -26226 -33782 -51480 -31497 -12328 3613 -9045 -26655 -20632 -18846 8402
22248 8402 23982 18935 -188 13999 13581 2515 4555 8267 2554 4611 626 1718 1170 -34075
22234 -34075 -42364 -10217 -23028 5902 -7060 -12963 3674 5507 21988 35617 47131 20402
22222 20402 20051 8892 8048 1541 -16809 -27656 -21921 -21274 16213 37006 18970 13224 3070
22209 3070 -5827 -28071 1286 3651 568 -7285 5324 26437 37811 31458 22634 16172 12673
22196 12673 20324 5905 -30598 -43777 -35363 -226 14820 13104 17293 12165 7127 -6983 -896
22183 -896 160 3195 -5142 -1902 -13278 -39279 -49025 -33624 10230 57541 61354 16419 6663
22170 6663 7473 6389 9972 -11005 -8259 -15189 7427 -3974 -13929 -4122 -10036 -6187 2847 -11993
22156 -11993 -41973 -15790 -195 31068 21986 141 -16755 -16457 -8529 5209 -18309 -820
22144 -820 -10383 -14760 -29127 -23657 7736 23990 7103 -12945 -7829 -1531 -13120 -21754 -16737
22131 -16737 -21822 -4279 36318 63266 55473 24886 46277 36468 10704 25236 41113 26916
22119 26916 4675 -21277 -22154 -27791 -5035 13663 24347 20532 6332 30430 39403 24026 30118
22106 30118 31319 12139 4439 6110 -11756 -20426 -21484 -19982 -6725 4271 -27516 -34764 -12004
22093 -12004 18980 26217 -9432 -14961 -15609 -1715 8565 6296 -2410 -11919 -13394 5686 9469
22080 9469 26864 26722 8506 -16931 -50532 -69364 -59869 -19712 12162 23381 36358 35976 24507
22067 24507 14443 1481 -38396 -43702 -8445 -6490 -2063 -14816 -20448 8501 33620 12515
22055 12515 30791 41785 -3193 -20664 -9852 21123 23950 9490 3727 -6013 -10981 -14159 -20216
22042 -20216 -21917 -15816 -21373 -34123 -19729 14023 -2753 -7326 -8576 -4895 4168 719 8316
22029 8316 3304 -11792 -23595 -44779 -21215 -8910 -9081 5154 -6627 -16518 -3608 -15584 20952
22016 20952 34233 29693 5102 18706 8574 -1726 309 -22125 -8753 -11629 -33680 -48003
22004 -48003 -57958 -62168 -39893 -13294 -8173 -24351 -23920 -5856 6526 -5654 -21084 -23425 2820
21991 2820 -3543 -16713 -27890 -36134 -39676 -31684 -45848 -51428 -42682 -35122 -18204 -12609 -30765
21978 -30765 -23984 3099 21050 27246 28436 29508 23826 21419 8198 -23032 -22550 -38440 -27942
21965 -27942 -8964 3426 15358 12399 1842 18346 15424 3166 23841 21764 24095 8192
21953 8192 -19139 -7516 17534 22013 25849 11710 -2012 -9033 -23391 -25636 -31341 -33489 -18280
21940 -18280 -40166 -34189 -14877 -18988 284 25394 22573 15967 26251 24055 -16520 -43033 -26591
21927 -26591 -44472 -32248 13036 10075 14302 30408 25188 5614 -2675 17843 13970 4452 28167
21914 28167 31017 32470 6903 -16177 -42971 -61902 -53822 -12881 2513 -2887 -19413 -24984 -3117
21901 -3117 -2298 -9005 -11509 -4985 -4995 -8914 17629 41813 41917 33427 -3876 -28794 -4814 -409
21887 -409 -1015 -2678 -8156 4010 16780 19260 21546 1776 -11871 -27196 -49078 -40317 -23932
21874 -23932 -16576 -18424 -16806 -1334 1120 3347 217 -4836 1447 5903 -4737 -22635 -34069
21861 -34069 -44016 -26144 22622 52209 54053 56998 45716 11743 1052 8165 15791 38682 52410
21848 52410 66001 51577 34566 12554 -23210 -44118 -40591 -27277 -25613 -20003 -29454 -20598 4040
21835 4040 -17160 -6840 -2237 7707 3959 23791 35695 5655 4471 -383 -6902 -15716 -12029
21822 -12029 -6560 4152 -20175 -46186 -44090 -39968 -58937 -70538 -49001 -38946 -37093 -35228 -25310
21809 -25310 -9949 26122 32739 25700 15699 35984 42168 21103 14984 30130 19459 25618 53080
21796 53080 40272 26953 55313 38085 2015 -19248 -896 -2520 19995 8246 -2616 18757
21784 18757 1264 -21394 12082 30746 48134 38424 16730 3553 -199 -3180 -9495 8132
21772 8132 2576 -11865 -16990 1879 6265 846 25122 35347 -5470 -19943 -10289 -14134 -44747
21759 -44747 -51545 -17361 -16337 -18148 -35807 -25792 480 -8120 -13979 8207 15642 -9087 -26531
21746 -26531 -25410 -17861 -19574 -37133 -7398 13012 -7051 -14646 -13241 -11124 43110 35896 12418
21733 12418 -8844 -5387 -8838 8474 23234 17621 -17773 -26955 -31381 -23275 -177 -6971 -3105
21720 -3105 -1570 1986 -91 -8769 -11916 -5769 1665 -12392 -31069 -27392 -25599 -32712 -35876 -39195
21706 -39195 -62118 -60984 -38414 2186 31241 -6765 -31686 -4127 23336 17516 -14344 -17159
21694 -17159 -2546 -16788 -23100 -7396 -5833 -1616 -5679 -1349 8312 1782 -3610 31372 13791
21681 13791 -4702 20649 33244 -426 -32216 -39207 -22359 5311 13977 10505 8030 -15962
21669 -15962 -16216 -4399 -2557 -14344 7918 4773 -17092 -493 11376 6708 -7820 -16568 -18090
21656 -18090 -29149 15025 30621 35779 8619 -11470 -19325 -18034 -503 24627 34024 9744
21644 9744 -992 -10454 -7366 -493 36454 31104 3825 -22375 -7236 -34398 -24211 -5103 -2335
21631 -2335 -24810 -33698 -49233 -18926 -13748 -14951 25770 23673 33678 31875 21676 10777 -6430
21618 -6430 -1860 9162 -12065 4017 9162 -9401 5782 18106 11808 -8170 -50829 -57690 -21519
21605 -21519 24612 20132 24574 46970 49691 26669 39136 76187 56975 26628 -3776 -15688
21593 -15688 -3143 8086 39576 41434 23189 7792 11486 11518 13576 31917 36435 39113 25949
21580 25949 8572 -18358 -19482 -18914 -17313 -24521 -21786 -2259 -3874 -1539 15072 13870 7610 18316
21566 18316 6264 1733 -17981 -8433 -17246 5064 16817 -7640 -9251 -4068 -1680 21199 13887
21553 13887 -13327 -26004 -12201 -28633 -23346 -52265 -51163 -33285 -15832 -30882 -21873 -2364
21541 -2364 -1140 -6424 -9692 -9162 -1680 1484 -8647 -8988 2328 12904 23921 21431 -3437 -9099
21527 -9099 -2438 -1815 -5327 -24867 -13517 4427 7955 6911 32705 46693 36141 31571 8970
21514 8970 -8603 -5094 -21250 -53736 -64590 -71576 -59337 -42188 -20428 29982 32217 14179
21502 14179 20661 11450 8188 26820 29872 25376 6149 -18694 -13118 -23144 -22966 -11861 -20126
21489 -20126 -30117 -29231 -16510 -599 -1527 21974 42890 35095 14975 6212 1053 -4277 924 13570
21475 13570 39530 20202 17265 26443 26499 30587 10130 1052 2961 15263 15022 -14108 -7787 4506
21461 4506 -7585 -37233 -9054 7253 6332 21854 27284 7229 4137 17207 8064 5902 13305
21448 13305 37755 11913 -2819 -12278 -44208 -58807 -89356 -82603 -38861 -9982 -29253 -12455
21436 -12455 31526 57778 50240 38242 22685 6700 -8028 -913 -5840 -20804 -52696 -70880
21424 -70880 -39697 -24851 -7824 -4335 -36775 -45108 -14041 15496 34942 27504 15528 1441
21412 1441 -13195 12591 32608 37089 23279 10576 -1594 -6424 10245 3093 26066 30523 -625
21399 -625 -7494 -21787 -28281 -32164 -19441 -42830 -22866 11483 29364 -144 -17012 -28026 -7823
21386 -7823 33705 21285 23650 36933 22551 10117 5836 -24773 -42330 -39534 -21924 17250
21374 17250 25694 22539 44242 48295 18898 -6961 -46320 -52217 -57537 -30979 -7474 -4557 -16908
21361 -16908 -34529 -42597 -53669 -49470 -12389 -8088 -1817 -7291 -20227 -40629 -46191 -48624 -21715
21348 -21715 -2784 25030 31923 33760 26424 -10429 -17184 -8249 17856 34226 43382 8953 3893
21335 3893 3432 3591 20036 11514 -13677 -31597 -39116 -7228 42585 9589 -16482 -3063 12537
21322 12537 -17616 -24688 -24530 -30581 -33599 -28586 -30273 -27129 -6086 5996 5111 6264 -8103 -39085
21308 -39085 -26560 17457 4918 -21175 -23818 -27778 -37969 -41604 -42178 -37533 -37259 -33104 -18196
21295 -18196 -13881 -12439 -52168 -69071 -45948 -24948 -16961 -1432 -214 -16487 -24632 -14624 -4863
21282 -4863 -12673 -1157 -6872 -10054 -28032 -36250 -66100 -55041 -29112 -30977 -51933 -45618 2809
21269 2809 -23482 -40961 -16327 -26637 -82873 -89790 -64525 -39626 -2289 -2967 -5507 -11321 -16139
21256 -16139 580 -3571 11765 914 -26959 -29620 -36232 -60652 -103838 -106948 -59012 -21178
21244 -21178 -35920 -9836 18384 13035 9 6524 13232 -15475 550 5652 -9398 -19996
21232 -19996 -23534 -13354 2532 19422 37396 11226 -18042 -5438 3244 19430 13654 13081 3086
21219 3086 2305 -12626 -2725 -15903 -21952 -33196 -28167 -24715 -38986 -24053 -18593 697 8018
21206 8018 -19634 -43251 -41980 -41430 -42783 -17899 19724 11745 -746 13176 -8940 -13183 31453
21193 31453 44876 58741 50955 19390 -16034 -21752 -19294 -15105 -14028 -39151 -39464 -23616 -18647
21180 -18647 -57236 -41196 -36461 -9226 -1856 5211 1761 -680 13469 13617 31255 47381 21761
21167 21761 -12780 3470 22270 48846 42770 29012 3671 -26958 -56566 -52915 -62178 -61692 -35480
21154 -35480 -16779 -35877 -26601 -13617 -14223 -27617 -6775 8870 19834 16432 1837 -15058
21142 -15058 -38620 -47573 -55122 -56369 -58834 -52878 -2811 51704 43200 35423 21338 30976 13155
21129 13155 -11172 -14900 -25316 -36676 -65514 -55019 -7604 -15959 -37779 -18165 9083 10319
21117 10319 -15187 -20204 -23526 -22035 -356 23346 20387 652 -5153 4623 -2691 -9647 -10667
21104 -10667 -537 14374 4768 17005 23490 37732 70487 56838 23605 2537 -484 -3883
21092 -3883 -29195 -36117 904 1504 -20401 -35559 -31031 604 18806 11374 12691 9525 -5011
21079 -5011 -32227 -56550 -48000 -23100 -18923 -12853 5711 24760 30037 26172 12383 3602 26594
21066 26594 52158 71766 65822 38814 8411 14035 7662 -16749 733 13114 39246 21600
21054 21600 -15625 -29991 -29023 -19925 -7837 -11680 12329 -3330 -31986 -48585 -15695 -1280
21042 -1280 -19975 -15132 -7352 -15954 -19283 4012 6730 -7885 1212 9384 9543 26148 20708 10942
21028 10942 -24390 -40635 -29659 -41375 -33848 -25450 -9654 -19114 -35916 -40024 -44339 -25130 -2063
21015 -2063 -11871 -23020 -15589 4524 21353 -565 -19919 -36401 -33046 -9555 -13657 -17415 -1744
21002 -1744 7708 24636 548 -3862 -13578 -37812 -51113 -38490 -23719 -51867 -60903 -35134 -44099
20989 -44099 -61627 -36480 -15086 -6683 4446 1810 -3209 1314 29752 34685 14482 10825 19841
20976 19841 42363 44769 19426 -788 14700 -429 -22530 -3186 22773 -6303 -51437 -68524
20964 -68524 -48172 -43619 -47833 -37411 -20358 -10175 -33921 -51050 -23192 7031 3061 1669
20952 1669 -13859 -11082 2719 -8322 -17736 -18805 -35413 -37185 -40931 -44012 -48269 -45159 -47859 -27614
20938 -27614 7412 18151 31115 33703 14381 6860 24123 32664 7946 -18957 -44656 -35405
20926 -35405 -28960 -37179 -39452 -56788 -80538 -61653 -33474 -22417 -17581 -32370 -19342 11541
20914 11541 17804 21850 27134 25800 9742 -4818 -3251 -2437 -1810 14610 11111 -6079 25816 30350
20900 30350 11825 23998 53204 39803 7386 9578 -3631 -14775 4563 5303 -15776 -43876
20888 -43876 -66725 -57815 -41815 -27122 -16392 -924 3737 -6644 -21213 -19087 -10484 -34723
20876 -34723 -44213 -56497 -60140 -40476 -26008 -7747 4347 -14081 -30102 -4371 -4665 -30319
20864 -30319 -58544 -52936 -23594 -6853 -7038 -51920 -46140 -34781 -49817 -33926 813 23573
20852 23573 15732 -3063 -22000 -27160 -22993 -446 5156 20753 33813 25141 10638 10929 23681
20839 23681 29320 21883 -5928 -18884 -22765 -3663 8470 17137 37599 53053 60469 46845 29075
20826 29075 18168 -907 5969 12705 -17300 -49623 -36207 -17166 -49628 -41260 -41213 -15132 -25528
20813 -25528 -12613 6835 -15662 -26136 -17537 -28312 -14004 -12651 -27171 -16790 -26091 -15816
20801 -15816 -12560 -11367 -4644 13471 6732 24913 7250 3659 -4842 -10062 -24003 -17727 -41428
20788 -41428 -40582 -19949 -25300 -36073 -36755 -16997 -2202 2134 37824 61773 32104 -1176 -10502
20775 -10502 9611 17377 12675 -6320 -14264 -14779 -8366 13776 39572 27893 17080 4148 -1015
20762 -1015 -16789 -3990 17998 19097 38413 30765 38842 34017 27583 -5022 -22130 -13587 -28625
20749 -28625 -27349 -12538 -6932 -1741 2448 6276 25289 30354 24150 43116 25868 -4089 22385
20736 22385 21459 3812 -30507 -36988 29796 10830 -23281 -14928 -32123 -45239 -13982 3428
20724 3428 -7091 -5663 3188 24509 9553 18512 7847 -17376 -22195 -32687 -58016 -57256 -52049
20711 -52049 -38268 -49030 -47730 -34055 -34628 -29124 -35317 -28714 -4547 20992 15931 -11916 -10214
20698 -10214 1458 -12265 3923 9484 -17663 -12455 3372 12836 13056 -7665 3390 12628 -41890
20685 -41890 -43559 -13167 15382 -1402 -21862 -19726 -214 -8946 -18652 -41183 -39250 -38506 -16521
20672 -16521 -37006 -65264 -44821 -40255 -17529 18523 -6576 -35939 -32974 -23728 -29633 -19302
20660 -19302 -33243 -30002 17278 41953 37160 35101 14611 17608 -3267 -64936 -48293 -8060
20648 -8060 -36666 -26288 -2505 -18000 -10356 -20679 -10617 -5188 7644 -24261 -21464 -16882 -21535
20635 -21535 -10975 -40494 -56076 -23626 -18720 -612 20104 20833 24682 33552 22083 17831 17023
20622 17023 22321 19092 652 -20281 -47643 -56450 -58924 -38090 -34388 -35507 -54171 -39542 -16072
20609 -16072 12369 5305 7811 -10034 -12878 -22737 -19646 -6064 -10340 -2831 -6706 -4741 5276
20596 5276 -13530 -7851 39068 51370 36274 -5266 -35230 -15934 613 -24666 -42753 -20777
20584 -20777 6633 11591 33421 49820 7719 9235 20058 17646 24277 18860 36058 27936 6404
20571 6404 6325 -7880 -21803 15532 28840 20246 10938 28992 47480 55156 59621 54838 52078 46138
20557 46138 39089 29314 -6241 3667 32888 46080 -1830 -36003 -6103 10519 -8423 -36076
20545 -36076 -43165 -33680 -23048 -3436 -5138 -20496 -21824 -14742 -19338 -26770 -15294 -28619 -21092
20532 -21092 -12418 -5600 1725 503 14421 20854 41107 9793 -18383 -2110 13787 18889 24164
20519 24164 26227 9467 17422 12650 -7572 -7660 -4593 -37562 -44629 -49146 -33399 -11497 -2329 35621
20505 35621 16896 -4823 11795 4365 -33950 -52231 -25040 -13026 -9415 22333 63726 71008
20493 71008 34224 18385 25702 16108 -29472 -46044 -29652 -2791 -7731 -1416 57006 45593
20481 45593 5849 -19590 -14676 -6508 20352 28681 12960 -2746 -14616 -23585 -44918 -18491
20469 -18491 -16626 -11733 18583 -14376 -23765 -48295 -48033 -13379 9006 -11007 -44410 -50560 -31167
20456 -31167 8386 12934 12383 15159 5212 -16283 -2999 12542 -6885 -20044 -47685 -37093 -28763
20443 -28763 -21747 -32943 -43474 -24765 -21141 5051 34271 42283 15363 -16938 -36253 -33300
20431 -33300 -18084 -28210 -24764 -4542 -23262 -45991 -21540 -23975 -55921 -57633 -31504 4032
20419 4032 13142 -1944 -2978 1873 12832 24712 7872 -10679 -27489 -32732 -35361 -45489 -43258
20406 -43258 -15432 -25140 -43942 -6283 -2419 -12290 -10160 7319 -1718 4837 27041 55470 30645
20393 30645 -3369 -40151 -38052 -33808 -60015 -60377 -50997 -46344 -32751 -28092 -31757 -28035 -45312
20380 -45312 -17589 14130 19230 8337 -2338 16417 -8896 -18173 27367 58664 55051 22738
20368 22738 32964 32065 29836 16642 27098 15614 -3540 -42746 -60065 -44242 -49006 -50053 -33524
20355 -33524 6232 3661 2137 -20962 -2425 15297 13908 1327 27524 19214 1906 20566
20343 20566 8482 -22486 -32658 -42197 -41821 -12996 15948 21349 18248 26778 36472 48613 32639
20330 32639 15501 27961 24037 10300 2217 10278 -8056 -34916 -32574 -30841 10300 27524 24047
20317 24047 -1520 1069 35723 24138 4357 6575 -720 3452 -27967 -42526 -18809 5524
20305 5524 15055 20010 -10978 -29871 -41152 -42374 -32018 131 8069 -21949 -59116 -60070 -38048
20292 -38048 -36087 -21856 -20837 -35402 -52568 -58424 -54841 -46916 -13547 10785 11698 5262 21006
20279 21006 14002 13086 6509 221 1185 19648 36115 32329 44431 42696 -958 -9509 -9508 -33675
20265 -33675 -49067 -47827 -41780 -23272 -2260 -15674 -18719 -5420 -15033 -29649 -54394 -60110 -53340
20252 -53340 -30181 -1184 16186 -18150 -40601 -30417 -35754 -18282 -18531 -44642 -45755 -29987
20240 -29987 -41486 -56248 -32501 -12462 -4792 459 6822 12121 20776 10883 -5471 -22528 -38636
20227 -38636 -18545 -5651 3779 11687 -5021 -23711 -29975 -63603 -12244 23645 6883 5147
20215 5147 -15624 -70152 -87704 -63087 -54694 -36734 -3833 -4722 -14103 -38140 -38609 -24152 -12350
20202 -12350 -16494 -7339 -16426 14591 4789 -10190 4438 28938 34798 27859 6490 -4316 -2765
20189 -2765 -6710 3388 5810 25228 37092 22482 -12723 -15763 -28282 -27555 -18418 -26558 -17747
20176 -17747 -5362 -21688 -23050 -19279 847 45681 41635 3801 -2376 -8404 -20493 -2168 4729
20163 4729 -6421 11559 18234 9183 17358 4071 -12170 -25830 -40051 -13511 9219 7702 7878
20150 7878 31556 69199 34088 27407 22803 14188 2534 -14447 -28287 -22313 -37560 -27509 -25168
20137 -25168 -29636 -35098 -23275 707 -591 -28937 -45665 -42976 -23454 2207 3911 1228 -29535
20124 -29535 -16788 -13132 1705 26120 20167 36665 16559 -13415 -45879 -43269 -8107 8331
20112 8331 -16274 -33428 -30006 -43995 -34066 -34021 -14167 -22632 -17344 -12299 -21039 -27239 -30802 -49740
20098 -49740 -29477 -22035 -23585 -15489 1198 -29945 -53269 -29740 -14762 -18775 -28946 -24578 -27158
20085 -27158 18456 46012 -1988 -29223 -22605 1321 14962 25953 -7653 -2603 -18301 -63793
20073 -63793 -91618 -56659 -44940 -39769 -598 30700 14631 10360 15257 7113 -2147 -15155 -20399
20060 -20399 -10278 -20972 -10132 -13909 -7260 1695 -9240 -28034 -25955 -13920 -1314 -518 -4712
20047 -4712 -12055 6924 33126 20807 37465 30053 24781 8044 -7148 4231 -7527 9181
20035 9181 20534 15073 6595 -26736 -43521 -69350 -63307 -27435 -8137 -4971 4867 -5572 6691
20022 6691 21047 563 -1692 14182 1742 -7259 -3286 -6775 30941 42445 21095 -3651 10014
20009 10014 42545 52615 25976 11830 3831 -7572 2269 14610 16557 34345 36205 40702 33963
19996 33963 49288 51634 56463 57404 68557 69345 44028 12260 19456 31508 45759 29109 -4694
19983 -4694 -16043 -32812 -11585 -8012 -7985 -8322 -18859 -13001 -24628 -30195 -46016 -46390 -55534 -39892
19969 -39892 -4019 10013 9896 10996 10676 6058 7063 30619 18457 -22544 -9371 -21661 -10643
19956 -10643 -19851 -22855 -12380 -6159 -6307 11143 11276 -12617 -61498 -54877 -26715 -23385 -25734 -11399
19942 -11399 19589 14944 -10247 10210 7217 -1913 -3676 -3878 -17712 -54327 -34546 -9985 9328
19929 9328 7838 1407 12655 -632 3042 34726 32161 30403 28268 27409 34773 24438 11960 27465
19915 27465 3320 -17923 -13549 20916 24928 21662 24447 29005 22944 12948 7561 18829 8507
19902 8507 -30221 -53041 -24595 -17518 -24897 -47412 -38511 -27434 -36127 -66167 -52936 -27888 -28123
19889 -28123 -37718 -23685 -36725 -32540 -31653 -33499 427 32944 17286 -9052 -7423 -21078 -38246
19876 -38246 -10344 -13482 -35986 -41648 -36922 -18679 -22081 -16845 -4724 22979 31833 10221 -36513
19863 -36513 -29856 -15822 -41523 -51382 -54813 -47908 -45809 -45718 -40859 -17016 -24129 -33845 -20860 -12488
19849 -12488 -14787 17889 18017 23097 31365 46858 55444 63605 32927 11256 1440 -24224 -14626
19836 -14626 -4238 -31214 -34300 -52732 -72679 -77367 -65144 -30143 -32497 -36716 -26579 -33883 -36995
19823 -36995 -34434 -74001 -76521 -70487 -45287 -48314 -49808 -39818 -11014 -16592 -3402 2138 -22640
19810 -22640 -26901 3172 20741 24603 1657 -6685 -8218 -9706 -28241 -40881 -36611 -35009 -48997
19797 -48997 -28334 -2246 21339 1240 -40150 -24325 -14942 -20881 -19046 -31123 -45503 -41979
19785 -41979 -51550 -75404 -43874 -4063 9779 -12911 -29229 -23169 -18046 -25399 -34092 -57431 -46769
19772 -46769 -45128 -34424 -24199 -35293 -21960 -5489 -87 -23689 -20033 -8248 -16187 -36204
19760 -36204 -50752 -13555 -32738 -49077 -61778 -77331 -66847 -48347 -29560 -33283 215 4470
19748 4470 -22660 -14300 1645 -52849 -81606 -75706 -44900 -32847 -36412 -31235 -29342 -10625 -5558
19735 -5558 -15246 -23670 -28887 -33886 -31479 -23975 -19335 -20867 -21270 -20810 -37679 -29643 -7734 7370
19721 7370 15264 18585 13841 -4897 -5596 -22308 -20298 -10561 -1854 -28802 -56429 -29379 -3520
19708 -3520 -4156 -26722 -30191 -10481 -27688 -53098 -11467 3981 -2136 -28306 -26051 -15681 -47224
19695 -47224 -57636 -43810 -35173 -5852 12142 10310 -24489 -48324 -25768 -43226 -42089 -27970
19683 -27970 -33433 -59491 -70447 -68081 -53750 -21481 -7013 -6304 -5749 -5562 -30677 -53126 -40054
19670 -40054 -19073 -17690 -21612 -36459 -37855 -52308 -56234 -50526 -44434 -37525 -30630 -44807 -66396
19657 -66396 -78745 -55941 -28592 -21001 -4836 24483 7749 14647 23727 9666 2316 -7144 -15714
19644 -15714 24746 36583 24721 11420 20737 14909 25287 13090 4267 5287 24418 21232 17446
19631 17446 30220 33279 2995 -6910 15876 -4069 -36967 -45990 -34228 -13684 4306 -21538
19619 -21538 -34433 -33019 -29595 -13842 15273 -2356 -1697 2764 -2135 5703 17445 -16039 -39233
19606 -39233 -34342 -65523 -85907 -55016 -22881 9763 29433 9727 -5629 -5873 -13185 -29497
19594 -29497 -53865 -45324 -71039 -50049 -8789 7467 -121 1025 -13280 -22965 -24059 -20727 3140
19581 3140 -511 -30519 -20217 9129 -9594 -9743 -17454 -14202 -15910 2728 -3191 -12810 -3761 -2009
19567 -2009 26986 39271 40066 40947 22061 -8849 -46523 -49707 -67453 -78340 -68650 -67733 -49316
19554 -49316 -35813 -28833 -31028 -35826 -36100 -33150 -23808 1169 -513 7504 4467 45229 17377 -12736
19540 -12736 -11026 3202 13559 -9497 -8203 -1949 -3761 15639 23850 15448 -4489 -54049 -38945
19527 -38945 -31067 -45841 -41630 -42557 -39909 -35335 -12273 23696 11226 4138 16338 23711 24476 -3693
19513 -3693 -10785 4345 10829 -8096 -13546 -35616 -34878 -33728 -12694 -5666 41 24513 29041 20890
19499 20890 6864 -15469 -11029 15628 21280 7146 -3810 -15131 -37909 -12474 -3416 -11574
19487 -11574 -28501 -25587 -22831 -22739 -55227 -34551 -10839 9579 61349 55448 53389 19798 -7434
19474 -7434 -18696 -29188 -16719 4659 -4788 -16566 -8507 -13203 -41270 -21291 -21585 -20584 -19195
19461 -19195 -31160 -45284 -48451 -35291 -21778 -10875 -1528 18093 9956 24836 39411 26040
19449 26040 41567 56950 26981 -626 82 16785 17431 19213 16011 -7277 -21155 -38801 -42309
19436 -42309 -44238 -30514 -33271 -29455 -9543 -23778 -64742 -54369 -26730 -4551 9933 8346
19424 8346 10113 1604 7190 -654 -7453 5529 30766 26240 6270 -28207 -48504 -62314 -65227
19411 -65227 -96872 -92700 -76806 -41267 -36944 -3124 33885 8298 -5520 -18414 -31835 -26466
19399 -26466 -17108 14955 12794 -19120 -17544 -2970 -15806 -34762 -50072 -58872 -44456 -11566
19387 -11566 -3967 8802 -8000 -9148 -1187 17602 23162 -5508 -12278 -16373 -14798 12651 27337
19374 27337 35722 54885 40083 28103 16355 19886 16751 -1753 -25951 -12434 -20670 -43433
19362 -43433 -55873 -28767 11487 798 -221 13541 21049 24153 9527 -6539 4032 126
19350 126 -9731 -14483 -31485 -35524 -38629 -30617 -35720 -28463 -40987 -77706 -76872 -79001 -69361 -56813
19336 -56813 -9373 6035 -23254 -16280 -5618 -5715 -22682 -24624 -12276 1383 4709 -6722 -306
19323 -306 -13732 -38137 -28763 -26320 -35803 -19983 1479 9006 6438 18245 5060 24838 38398
19310 38398 -6518 -45161 -54503 -53363 -15439 23175 21619 11442 -7545 -9529 -31961 -45693
19298 -45693 -55327 -65431 -68298 -66047 -53032 -48949 -32855 -39761 -55380 -56627 -28687 -47042 -47500
19285 -47500 -28345 -12563 -11665 -5729 -32868 -19338 14887 27109 20865 -19943 -38751 -54576
19273 -54576 -39827 -24980 -31089 -29531 -41782 -32408 -15361 -34577 -44915 -46896 -65273 -40831
19261 -40831 -27462 -19252 3367 22339 23592 -20262 -35680 -22140 -28387 -32815 -32143 -67004 -55925
19248 -55925 -37624 -10910 2453 -4272 1040 -3980 10256 13567 1145 -7359 -18543 -67630 -69732
19235 -69732 -26301 -13390 -11167 -7076 24784 29634 33733 30037 -23600 -40531 -25817 -7337 12717
19222 12717 16128 18547 16172 10611 9801 34177 34636 6724 6007 9076 -7906 -23312 -9546 8140
19208 8140 20749 19787 -653 3957 10794 4178 2642 24408 26775 16657 11605 9243 324 -4385
19194 -4385 13986 -7575 -39094 -47453 -79068 -77303 -45058 -27215 -42699 -35319 -14066 1533
19182 1533 17278 20557 9856 -25199 -26479 -36467 -22112 8842 44283 37534 19051 2678 -7123
19169 -7123 -8922 -6102 13344 36331 25905 3907 12160 33328 4067 2462 9760 -18006 -46688
19156 -46688 -48225 -15115 -37739 -48012 -24445 -8858 -3632 -26958 -19690 -5374 -15072 -21107 -15027
19143 -15027 12197 7503 -23785 -50506 -42973 -43946 -37171 -43057 -38836 -30385 -10998 13077 40608
19130 40608 13438 -6407 20676 26932 19225 16951 10445 7418 -7244 21885 38122 34004 39540
19117 39540 56932 46453 23865 10905 -26489 -22302 -48504 -83553 -67121 -37137 -25943 -21331
19105 -21331 -28150 -17798 -20343 -17865 -15819 -5188 -16879 -5390 18776 8883 16508 -10099 -13371
19092 -13371 -20270 -36180 -35522 -48140 -49384 -41156 -38135 -24841 -37613 -29808 -15978 -1313 50968
19079 50968 59673 47152 22589 -16739 -5854 15802 -5911 1010 -9820 -50961 -47316 -66380
19067 -66380 -61081 -56369 -55546 -60905 -44587 -23173 -17026 -34001 -32424 -38956 -15282 -15395 -40759 -51455
19053 -51455 -67948 -53637 -38651 -37176 -42218 -14094 -16387 -50440 -48790 -27283 -32024 -30615 -14970
19040 -14970 -14228 -5347 8525 -1755 -13466 16 -1458 -4211 -5700 19008 30705 34334 30422
19027 30422 22657 16153 -26694 -41970 1673 44693 29824 6598 -4298 8802 7093 -1805
19015 -1805 6114 4927 -8135 -29510 -47716 -72309 -54261 -43249 -51518 -71900 -81094 -58894 -50422
19002 -50422 -47046 -51717 -33875 3603 37821 24665 -23838 -34318 -27924 -32573 -12411 -5926 -23140
18989 -23140 -11560 2682 3075 -4784 -14656 -34654 -23162 -29668 -32399 -23429 -24482 -43535 -30748
18976 -30748 -28272 -36004 -30846 -18938 37833 42859 36854 24004 675 -21587 -33007 -17586 -21103
18963 -21103 -27176 -9689 -23056 -24928 -35331 -41748 -61225 -61580 -42093 -30313 -21778 -26982 -50641
18950 -50641 -75818 -62804 -43823 -45542 -23125 -4823 7771 13031 -15303 -10184 8411 -7681
18938 -7681 -15021 -35565 -36154 -42435 -41013 -26002 -40685 -35932 -42587 -42659 -20366 -25431 -21321 -7311
18924 -7311 1695 6073 25866 36406 22604 11657 3960 4504 2790 8440 -7166 -3689 -31329
18911 -31329 -55512 -30967 5433 28204 12330 -13420 -13674 -855 4751 -2964 -4744 -3756 -51517
18898 -51517 -46034 -10045 -11649 -8916 -19789 -21363 -49085 -47570 -14621 12862 -566 -410 16712
18885 16712 -2489 -13329 -1841 -27574 -42319 -50798 -37481 -6579 17452 59220 72767 46318
18873 46318 37794 23115 33550 43893 70104 101182 124051 91134 75834 87388 97242 140269
18861 140269 167740 161230 160977 192787 206671 186779 141106 87062 60287 11870 11843 30125 51206
18848 51206 64545 78902 75536 78042 51804 15723 37674 72660 83734 50610 3772 37274
18836 37274 54794 48909 42774 29863 31392 43603 35158 37382 61693 80293 76970 62946 88465
18823 88465 143501 174771 174082 178586 185587 173044 145630 123575 126760 159541 215096 288215 313838
18810 313838 290081 255540 224963 168357 137197 130517 127456 131212 151454 181817 185469 153138
18798 153138 115329 71592 44330 47713 50803 26325 10965 24127 47816 62014 63295 60115
18786 60115 32798 8678 -378 22588 43921 53087 28896 50095 75622 78751 68417 49340
18774 49340 22043 21557 35949 65611 84100 136711 273234 459294 516876 405642 295758
18763 295758 237710 173947 129660 108393 110730 128838 134511 151491 149237 127684 92144 73950
18751 73950 79740 76789 92414 87638 69177 82059 88194 56470 23804 -1715 -5384 15297 13970
18738 13970 -6080 -10092 -18756 -31023 -13479 24650 8166 1200 16615 10645 -2234 -17886
18726 -17886 -11838 -4814 -54500 -41509 -26002 760 26776 21505 7725 -9278 -48461 -54673
18714 -54673 -51851 -17583 -11125 1794 6747 -11711 -7566 -8534 847 14600 9812 -12969 -48601
18701 -48601 -59290 -68384 -66922 -68639 -66214 -27611 -4585 7124 15099 -5913 -10010 4602 -2139
18688 -2139 -12032 -25354 -30657 -40515 -33523 -24697 -28380 -19867 -17002 -10234 -4130 -1152 9447 -536
18674 -536 -2583 5915 9505 5589 -6369 -20913 -31962 -48393 -16134 9397 22444 -7302 -14519
18661 -14519 -5411 -27640 -21478 -732 8774 -5420 -22218 -59600 -36802 -9637 5403 -999
18649 -999 24443 35807 40554 57094 30459 19757 49842 48908 11234 -16326 -3434 3397 22882
18636 22882 16767 -5216 -2097 2216 -36914 -12095 10832 25337 33122 14828 -21845 -34731
18624 -34731 -35493 -3979 44105 28803 -10824 -42169 -42693 -39495 -23521 -16764 1837 16906 26895
18611 26895 15050 15696 3851 -15075 -9964 -18892 -18406 -29465 -17050 -28777 -20844 -22233 -35063
18598 -35063 -27008 -12642 -5999 12421 15493 20240 4511 4567 1875 -8104 -17245 -14193 31147 53741
18584 53741 66976 100939 108850 88995 89707 56735 1695 -33082 -23009 -10033 -8019 -12744 -33948
18571 -33948 -6444 -3046 7295 -7650 4064 -35637 -49600 -21225 -1848 11559 26944 37691
18559 37691 52455 58556 39271 27136 38008 63491 93636 139135 130574 107466 80578 39568
18547 39568 41215 43389 26194 16871 10631 12790 17197 12865 5716 3543 18861 38960 5678
18534 5678 -16384 -5738 23974 18868 -1009 4035 22168 15764 16648 17460 21719 11065 1067 16325
18520 16325 38370 94797 84096 41834 23613 31053 45308 54591 88893 110080 112593 109395
18508 109395 147162 200583 241327 245169 217499 158796 101731 69319 59083 64770 46234 48852
18496 48852 21161 12705 38847 37112 30062 22025 55115 44940 64855 70959 63999 60733 75876
18483 75876 54369 64045 70747 57547 49872 54331 43370 42069 32756 23930 14069 13396 30609 46951
18469 46951 66287 79764 58781 51210 31736 47837 71044 81819 116486 155883 165121 145759
18457 145759 115062 109722 125645 104810 118989 132997 130933 119781 90454 35171 28922 12109
18445 12109 14927 17720 843 1914 4729 32094 19260 19811 49583 42063 62462 86150 92262
18432 92262 71204 72935 59010 50347 51344 46738 39288 39301 62358 70125 88545 89601 68949 67567
18418 67567 40218 -6871 8826 43594 40640 67627 83952 64095 58115 59120 56251 50150 59232
18405 59232 60514 84051 103091 100333 116897 130182 150159 160200 177411 196835 204177 202289
18393 202289 233056 285555 363118 430917 482937 500730 492040 491959 465229 443646 427338 459525
18381 459525 525127 593131 681966 764683 823043 905973 1090598 1420331 1975520 2932605 4224298
18370 4224298 5084378 4556242 3552643 2931551 2672758 2660927 2916392 3425008 4373934
18361 4373934 6048131 9013131 14017896 21064903 26558905 27411644 26709544 27707093 27872232
18352 27872232 23795144 20332704 19100869 16308748 12014119 8975010 7492273 7108845
18344 7108845 7765304 9597724 12490211 14751421 13387791 9814192 6961297 5259746
18336 5259746 4243742 3642201 3294924 3098805 3034916 3043733 3083006 3244834 3688823 4583882
18326 4583882 5962587 7155505 6887741 5820190 5198179 5090867 5408495 6208573 7787001
18317 7787001 10438105 14347730 18578880 20457327 20823339 23846060 31810764 44073439
18309 44073439 53947127 56816756 54836392 50280240 47132685 46349461 49642239 50763441
18301 50763441 45394153 41910405 43582904 46051430 43986933 38083615 30147054 21797278
18293 21797278 15675420 11900679 9619191 8262339 7607273 7674346 8511886 9684441 9565905
18284 9565905 7672603 5791178 4603963 3976587 3613464 3476320 3434547 3450500 3508626
18275 3508626 3632222 3754413 4000192 4488447 5367593 6861210 9241952 12977275 18105628
18266 18105628 21777449 20196907 16069222 13435384 13115082 15112789 19501354 24675394
18258 24675394 26900967 28771942 35300523 44942504 50733855 52761874 51712638 42679020
18250 42679020 29365053 19429555 13566934 10055398 7786134 6277167 5262584 4628184
18242 4628184 4307873 4298860 4653401 5538566 7024564 8194001 7340555 5353184 3856564
18233 3856564 2978398 2442034 2063529 1771494 1567811 1487969 1444789 1346727 1248215 1197175
18223 1197175 1170574 1189749 1218678 1258480 1240995 1120706 1017590 899622 802325 744703 751290
18212 751290 800518 820093 815112 738995 633449 593613 556587 545524 577445 603651 605806 573056
18200 573056 537742 540274 574609 569355 552726 544740 560880 566738 564499 530871 503713 480077
18188 480077 451604 429879 404617 351755 313780 300310 289607 251551 225158 224258 209464 212721
18176 212721 236856 237509 229739 203476 212586 226923 236898 263262 288564 310762 337421 356523
18164 356523 357887 352055 344997 350411 322787 294079 285541 292111 312870 348042 363568 318855 298668
18151 298668 324695 350539 347007 398532 442333 474945 471286 432106 387484 354651 323406 328126
18139 328126 333979 353835 366400 347233 340201 343271 356377 383564 424853 456936 486023 518122
18127 518122 537531 563121 648504 745064 830882 944631 1090935 1294712 1546825 1860892
18117 1860892 2293850 2923648 3881042 5433140 8294414 13808487 24321217 43681631
18109 43681631 70753838 73809215 46744497 25894397 15594184 10333652 7317844
18102 7317844 5376477 4117298 3269852 2657513 2242410 1929272 1665294 1437796 1266204
18093 1266204 1114294 1038903 986282 875973 782003 695318 634706 586400 559469 544433 503746
18082 503746 470769 464346 463958 467141 448672 414180 394975 393957 401340 393015 411584 441735 444111
18069 444111 423304 461998 523625 554826 543173 515727 488543 522751 579403 635456 675393
18058 675393 715724 716927 705700 700497 775802 849008 917463 1043756 1174966 1313940 1529438
18047 1529438 1881510 2385720 3156538 4506118 6815032 10500903 14650880 15547818 13213073
18038 13213073 11675417 12480663 16051728 22723783 29846034 29409005 21993541 15983047
18030 15983047 13377250 13521729 15877769 18514415 16912475 11985776 8080177 5792281
18022 5792281 4421722 3487257 2827706 2402093 2152207 2016838 1948096 1885112 1820392 1763069
18012 1763069 1767463 1781574 1764816 1796429 1832412 1788231 1770417 1858045 2042199 2368975 2917044
18001 2917044 3753235 5120792 7397745 10686770 13265587 12471466 10539239 10195608 11804396
17992 11804396 15451678 20927543 26758546 32349607 37334896 40385563 40174149 36642236
17984 36642236 31525341 24327050 17120621 12519666 10246636 9634588 10415530 12162503
17976 12162503 12936571 10794563 7656910 5424986 4118883 3338950 2794449 2375095 2083057
17967 2083057 1941848 1849627 1719013 1621782 1601488 1615394 1615993 1556217 1479997 1412125 1385130
17956 1385130 1384276 1416625 1530720 1752659 2100147 2618372 3522087 5152167 7658157 9926604
17946 9926604 9487331 7683614 6910906 7715747 10330736 14688426 17853244 15418212 10837062
17937 10837062 8004331 7047754 7562575 9065396 9712882 7729873 5174863 3521675
17929 3521675 2569505 1962577 1537077 1282737 1126852 972225 879276 856576 823095 716417
17919 716417 640102 607591 556180 561278 591658 544750 488282 442236 391152 365296 365352 338550
17907 338550 312397 306303 282880 270162 252239 256661 246962 242898 236169 223025 219590 185706 174761
17894 174761 171544 193113 228050 220848 238285 216411 188892 186979 170076 160392 163132 161279 160485
17881 160485 134072 118724 131032 158415 170541 167183 176371 164643 140695 151907 166918 153524
17869 153524 147387 137590 150100 158411 140397 115478 96586 88199 80241 68600 75403 96799 103282
17856 103282 127378 131461 117434 107652 152796 181149 177311 178455 191502 179590 179886 148311 141232
17843 141232 156315 168840 173508 173882 228797 265841 261105 243804 235489 204423 182814 184627 204203
17830 204203 190194 151765 161084 173381 182957 198904 217081 221279 222460 236014 229040 201805
17818 201805 167868 128210 137710 138160 115087 76241 79305 114022 131934 114429 83947 52836
17806 52836 35900 45703 93860 154248 193203 199429 204638 200741 150630 146907 164067 202631 274534
17793 274534 338132 348254 360587 364312 306348 261196 217540 222742 218311 214294 239773 257315
17781 257315 307996 359749 395238 363487 329498 322204 309250 300790 291163 242636 187436 162400
17769 162400 152252 154796 133839 120047 126352 142815 158038 149705 121051 102883 118102 140290
17757 140290 152089 179611 219257 251526 293863 268182 253469 244455 279794 323854 358850 374958
17745 374958 406145 389985 354598 365904 354679 383574 379904 396117 463223 550702 664466
17734 664466 753849 806248 896516 1003209 1099968 1205575 1375130 1528754 1645635 1780922
17724 1780922 1971353 2238817 2666478 3362409 4489123 6353617 9264930 12133402 13143070
17715 13143070 12461291 10562293 8938786 8549592 9486671 12009692 16697974 23928230
17707 23928230 32360123 42612493 55302077 57597296 46134628 36273335 33999320 39544934
17699 39544934 53681925 73275153 80725258 67725099 53089544 46711852 43767640
17692 43767640 37801922 28739202 20867904 16031242 13579104 12896735 13706035 16034662
17684 16034662 19056429 19842606 16463920 12109094 9018282 7061921 5857171 5150853
17676 5150853 4762024 4539070 4322243 4113199 3988342 3965906 4015117 4186719 4462803 4956487
17666 4956487 5865456 7450216 10095639 14239390 18911244 20743726 20098495 21231301
17658 21231301 25886767 31961274 32837740 27484701 22600828 21534824 24872049 33740483
17650 33740483 48339333 58658801 54766074 48770610 45169652 43979942 48460337 55348392
17642 55348392 53536482 39697815 26763632 19532414 16180849 14453135 12074175 9200656
17634 9200656 7124782 5876024 5087494 4568669 4195940 3962896 3902897 4211653 4986273
17625 4986273 5919343 5987333 4817090 3549359 2764641 2319304 2016372 1790235 1550425
17616 1550425 1339736 1179972 1068633 985235 913978 866440 801176 752962 746203 739397 715115
17605 715115 661739 605673 593617 589472 540297 485527 449105 431208 432187 432520 437463 437595 403796
17592 403796 365480 344656 344479 349711 329903 314298 334709 332685 307532 309520 311301 287415 272115
17579 272115 258183 240227 231438 216840 220471 245893 238833 200466 198427 217068 205860 210884
17567 210884 227266 214171 205393 195292 197828 176808 196323 212512 221351 228984 229399 213347 188426
17554 188426 182916 181938 162626 156182 148318 126179 144395 147164 135533 134959 115349 156767 197200
17541 197200 209062 188351 175654 169165 168122 172321 184107 194931 185274 157783 201030 266540
17529 266540 268419 247757 251136 251959 240097 207767 163828 152795 164669 209040 238271 218759
17517 218759 213343 182670 148777 149707 170802 154050 128924 135217 121096 94360 101554 87059
17505 87059 101414 111254 82857 73756 88220 111240 104560 89464 91207 119737 120820 89211 112585
17492 112585 142690 188479 189784 165674 152137 139007 137571 84044 80565 101094 153032 206472
17480 206472 214376 208836 192941 171033 182046 243359 298855 300724 294539 234068 193759 193589 177583
17467 177583 177251 167777 170689 161869 145983 118775 88077 92558 70833 60369 47350 44940 51307
17454 51307 48624 78063 106338 101689 78967 82352 112076 141447 164881 211615 301737 416976
17442 416976 459615 337453 197418 132897 117801 128656 149277 147980 129347 115783 115627 110678
17430 110678 101765 105883 110592 130742 123280 107409 85098 55213 37052 40984 42346 68055 93970
17417 93970 95770 57589 53877 55421 44008 23570 13352 4224 6423 4448 12714 30856 44138
17404 44138 35002 34728 27557 52234 59593 52983 92843 106513 115194 79772 64836 53842 52266
17391 52266 64909 80780 69018 65236 58956 40844 40971 50904 60801 72391 73965 78656 70809
17378 70809 49072 17284 8955 39268 57842 59075 57117 80241 89362 89211 55670 23231 40931
17365 40931 42858 52727 51917 46961 46328 32810 20386 26400 17768 12276 15882 26052 28985 35511
17351 35511 54767 65320 56225 29172 9124 274 1383 -10099 -4783 -4771 5958 23743 51449
17338 51449 56287 58604 31995 15185 594 25806 43073 44073 36614 23126 59746 78204
17326 78204 52815 15814 7065 12554 7666 8239 9686 11436 22718 17367 13249 16937 22755 13513
17312 13513 4507 -6605 3712 30169 29751 35590 56545 62400 40539 25675 23298 31479 14412
17299 14412 29538 16601 14715 13173 14764 1745 5400 -5520 -3931 -6464 -3394 -20115 -9581
17286 -9581 36491 17588 -17983 -20134 -22314 -26781 -49161 -41897 -10887 -1388 27485 35386 52262
17273 52262 67251 73651 52022 32935 9622 16991 8495 -12337 63 12344 -4809 -23510
17261 -23510 -2524 19304 17620 35814 17518 25259 14270 2648 6873 29502 27712 8232
17249 8232 -6469 -39762 -17914 6134 11491 23377 7316 17209 31441 3249 -9171 -23867
17237 -23867 -22867 -8072 -6478 -24232 -6589 40350 35966 34173 26802 16211 12613 3605 -11579
17224 -11579 -10254 -2770 -17800 -7782 14556 13699 -10112 16366 16226 17434 43346 29890 15119
17211 15119 10385 20351 10913 18533 23804 1246 -11481 -4036 30381 99826 192022 205547 200067
17198 200067 205867 227842 246589 241544 212116 216422 203149 202714 204887 199918 184084 191610 183177
17185 183177 165685 172500 242200 275589 272171 252813 269523 277547 235480 214799 172668 134562
17173 134562 96218 48208 33270 18539 13129 27430 30407 34394 33277 40367 44569 45025 51122
17160 51122 58866 62706 53193 61489 64709 85487 84648 109418 102309 120237 178997 203349 217893
17147 217893 222949 212133 231877 249951 245286 198881 159975 158437 177359 201839 200890 165318
17135 165318 175045 163763 130262 113585 104903 110519 137929 173181 172779 140264 85334 63242
17123 63242 83054 121563 176570 184391 154896 131134 145093 123177 84931 58707 49458 19877
17111 19877 18700 31875 42486 18927 23101 36501 20144 6228 7581 50963 56050 54043 24659
17098 24659 31962 48338 35409 13086 30929 44013 41167 40292 19335 9952 7313 11693 11410
17085 11410 5235 1982 12346 30139 31278 38892 32038 29302 48663 34591 7831 -15968 -28992
17072 -28992 -39507 -44653 9738 19770 10100 3855 3455 18751 24991 20423 -4917 -24699 -45739
17059 -45739 -36612 -2804 3354 -28524 -34117 -1667 -18304 -8115 -8341 -4285 -1188 -32523 -34285
17046 -34285 935 -4404 -12765 -8683 5288 38074 17583 -13346 -4313 -2284 -1910 12978 30150
17033 30150 39320 43405 26258 21946 19383 11206 7395 17659 20515 35536 11001 13481 32117
17020 32117 37360 37961 32314 42192 44158 4783 8722 16782 41400 4809 -2774 15578 35445
17007 35445 41724 28039 24607 29838 19853 -936 -25144 -4841 10656 -2830 -16922 -3526
16995 -3526 -10030 -27215 -18941 -18107 -44951 -20807 3094 19959 45411 37332 45997 44922 26499
16982 26499 6502 -7451 -1761 -5206 -6243 -2342 12351 9567 19321 36324 19175 3625 12146
16969 12146 35294 19865 8576 -5349 -3535 2250 31581 54680 55571 19282 6805 11085 8450
16956 8450 7736 -19087 -53248 -57660 -26804 -1850 2084 -9041 -7725 7507 2006 -22819 -2259
16943 -2259 15409 24995 8191 -10552 -14019 358 -13571 1615 10136 8471 -8881 606 -163
16930 -163 8659 29255 14970 14108 -28515 -8097 16399 33550 35820 43198 18352 13837 -6218
16917 -6218 -14238 -28397 -34368 -40729 -46758 -23750 -36339 -20166 -2134 -12215 -19092 -38268 -64363
16904 -64363 -59989 -27162 -4329 15940 9449 16128 28261 46691 55745 44266 17682 -12691
16892 -12691 -11923 -27602 -30630 -11123 -36878 -55262 -56744 -43956 -20197 -14107 -24922 -31253 -22103
16879 -22103 -10630 -14804 -11951 -2412 20322 3726 22086 53088 34044 10274 -9265 -9339 -4840
16866 -4840 10349 2792 -11079 -24176 -8377 -4769 -11865 -40723 -26091 13551 42267 57200
16854 57200 59071 17978 10630 21408 27618 37641 36774 7010 -2308 -15010 -10923 -18376 -16516
16841 -16516 -30476 -9478 -8261 -28664 -46268 -58288 -42508 -18804 2098 9645 -7718 -1611
16829 -1611 2367 16222 4462 -1343 40996 28756 -7001 -16939 -11377 17866 24646 14654 6920
16816 6920 -2077 -5056 -7262 21558 9124 -2014 5072 7114 -7104 -23660 -7553 4799 48456
16803 48456 73731 91473 75964 40501 33257 21606 52779 43649 22059 13922 4240 18525
16791 18525 -2148 -10600 -2332 4660 1407 -4490 4602 -20166 -38105 -21738 17693 30391 33698
16778 33698 31679 13275 -3103 12650 -859 -4691 27749 18432 12508 2230 16071 5930
16766 5930 17914 24019 16633 -1584 117 -4805 -29645 -20179 -28694 -35858 -55317 -70521 -49672
16753 -49672 -28891 3280 13595 19479 41118 17391 4376 -24910 -70747 -79934 -74658 -63221
16741 -63221 -22385 7776 -7656 -21213 -20855 -12333 -7045 -15606 -15803 -668 16351 18851 6471
16728 6471 13256 17384 21266 13279 -742 -18542 -28996 -15759 6210 -23459 -74709 -110593 -81760
16715 -81760 -47992 -52087 -41443 -29043 -39202 -27657 -19863 -9537 -3788 13215 10625 1153 10784
16702 10784 13148 7753 -26439 -47316 -40622 -27421 -18674 18103 34600 42695 41442 9605 -29184
16689 -29184 -27203 -34166 -38268 -13743 5084 -25814 -38047 -42995 -25903 -12123 -25974 -18879 -4163
16676 -4163 22156 -2337 -23658 -20860 11494 5274 -27294 -51964 -36144 -25727 -30022 -19148
16664 -19148 -21634 -14753 -12355 -10319 -31131 -28126 -28462 -2012 28232 1336 -14607 -19646 -15731
16651 -15731 -17123 -21867 -13547 -14374 -18505 -5192 4194 -6572 8071 14929 10753 42227 21940
16638 21940 303 -16239 -18620 -13460 5971 4842 31352 36343 12824 1002 10612 19343 16792
16625 16792 18536 -10410 -17878 -43793 -44932 -29965 -4269 35387 24817 -6272 -29847 -35621
16613 -35621 -44277 -27513 -30211 -64912 -80263 -71585 -97836 -98062 -49795 -15114 -11810 -2901 -4285
16600 -4285 -10718 -37261 -56011 -36268 -17204 2200 -12012 -38295 -54142 -53006 -47953 -51290 -15815
16587 -15815 9949 13744 12657 22219 27186 226 -19105 -450 23089 48229 84884 63369
16575 63369 19454 -7536 -47944 -30107 19808 -14606 -64613 -52349 -20791 3939 10407 -136
16563 -136 -14945 -33256 -38369 -27563 -28785 -20806 -9599 -6278 -20246 -23672 -43816 -51445 -28877
16550 -28877 -46796 -39106 -10151 6721 9467 85 -1285 7883 19962 36275 27730 25177 8719
16537 8719 6572 -11712 9301 5119 -8228 -13361 -4423 -3953 6795 12912 -4286 -20245 -15753
16524 -15753 8592 -14803 -26677 8818 5205 251 -2744 4326 44819 68623 33118 17264
16512 17264 20714 4606 -99 -14799 -17171 -22263 25835 41120 20188 2669 -8346 -5911 18350
16499 18350 35156 40666 16178 -24522 -26081 -790 2613 6057 6801 -268 -2038 -21787 -18582
16486 -18582 2127 -6971 -1113 -6556 -25557 -15535 -8084 9371 8601 -18966 -28470 -28489 -19598 -21658
16472 -21658 -58799 -83934 -44285 -30079 -41826 -44953 -38005 -8871 31582 31567 33879 55487 30252
16459 30252 -7922 -21157 -3366 24782 30818 30144 21140 -4245 -9764 -1248 34617 33792 -3019
16446 -3019 -15163 5843 18958 20844 18736 9834 33112 51131 56205 39173 17627 27266 25976
16433 25976 39940 46457 52310 49353 29101 16499 14196 -4535 -32263 -39992 -25831 -15072 -28759
16420 -28759 -27433 -40365 -29682 -12563 -7539 -12833 -9241 -24319 -20864 -30427 -27203 -14880 4612
16407 4612 11997 27215 22120 -5805 -7791 4659 6267 5524 -15995 -32274 -6298 -871 -11182
16394 -11182 -1576 3685 5933 5377 -4749 -16705 -45385 -24147 -8722 -7493 -7276 157 -2225 -15914
16380 -15914 4263 20795 13988 -13008 -22234 -33811 -49771 -55451 -36737 -42835 -35555 -33417 -26911
16367 -26911 -36817 -22485 -21691 -32898 -31043 -33557 -35000 -46525 -37736 -8218 17245 27313 34392
16354 34392 5422 -8449 -2974 12360 34804 40207 27553 30138 -750 7602 -6368 -28779
16342 -28779 -10341 -4735 -3421 -2572 -36394 -52222 -46768 -10882 8077 -11554 -16342 2862 27156
16329 27156 5768 -48613 -62610 -39669 -32474 -30412 -28677 -56326 -61395 -36042 -18501 -3800
16317 -3800 16297 17402 25806 8789 36428 31823 20398 28742 52554 37453 23874 20930 18973
16304 18973 28410 3674 -14656 -33163 -53136 -49479 -29916 -23186 -22012 -16052 -3344 25858 32697
16291 32697 35376 26668 2956 -3652 -17002 -39371 -43817 -45882 -41767 -27377 -37460 -48438 -48852
16278 -48852 -59012 -58531 -42388 -10884 -22442 -34687 -25092 -9946 42440 22285 16635 26205 23014
16265 23014 14876 14231 -4880 5572 -7890 4400 32848 41917 19361 2709 20782 14677 -17640
16252 -17640 10768 27038 21753 13408 10893 17481 22793 6328 -511 12740 22003 23565 40695
16239 40695 16157 23922 7257 10663 12338 -1420 -7833 -22054 -7486 15145 21939 34140 34308
16226 34308 39203 38690 34591 -2367 -8902 16024 25582 16765 -1123 -21124 -22149 15873 1822
16213 1822 -2153 14050 18186 181 11587 -1190 -5459 -9441 -7076 -23520 -13138 15913 695
16200 695 -3676 -20789 -68421 -62029 -1272 33248 24921 1280 -10045 -3456 31339 30583 21978
16187 21978 -10844 -13813 7564 23103 20069 9049 9189 11192 10831 -5124 -30517 -41496 -60826
16174 -60826 -74370 -44053 -17810 -35911 -25206 -34202 -26784 -26684 -21216 -23206 -29684 -27105 -24241
16161 -24241 -33538 -56868 -72190 -75043 -52078 7378 33008 26691 14766 16591 17871 9514 -9601
16148 -9601 1959 -24475 -48760 -38152 -65203 -78949 -76832 -96602 -123792 -98937 -47722 -35480
16136 -35480 -14127 -15510 -12740 -26328 -25518 -4934 2150 6928 -13884 13099 34939 12684 19314
16123 19314 22731 13968 9642 8758 -7510 -4238 763 24322 16050 7708 647 44683 31356 -6669
16109 -6669 -7629 -17678 12578 47038 26572 -9003 -4971 6080 15076 46836 64968 58153 20852
16096 20852 -23290 -4833 27099 26891 10609 10312 16334 40067 66657 88592 87518 42786 -13778
16083 -13778 -28981 -36704 -21530 -6662 31253 18102 -8746 -14487 5209 1309 -10079 -19060
16071 -19060 -18001 -31620 -49833 -16438 15748 -3655 -24592 -48193 -50319 -60679 -70775 -13199
16059 -13199 8125 7572 -13292 -14801 -2505 -17645 -6490 14204 8257 6765 -42150 -68984 -67760
16046 -67760 -48103 -26673 -32482 -14308 5816 30159 21136 -4738 -13659 -25935 -21584 -14230 7557
16033 7557 16892 -9710 -20551 -7473 -26581 -27077 -40197 -25733 -3795 5934 -197 12331 -12117
16020 -12117 -52678 -57659 -41284 -40259 -32822 -3928 18371 26170 40458 33305 12372 -10546 -14454
16007 -14454 -3886 -511 32859 41887 28925 21936 -14728 -39705 -56344 -47245 -23872 1479
15995 1479 24031 33879 31978 -9848 6912 -5391 -20665 -44927 -36153 -30984 -28552 -16826 6043
15982 6043 -14048 -32803 -43625 -53061 -11066 6658 17073 31766 32532 19529 23009 14772 12782
15969 12782 21339 8907 38666 49531 7994 -5847 -2452 8739 21334 28407 30794 8830
15957 8830 -26354 -43935 -12197 10354 20329 13041 13036 -14135 -23380 -13005 -5929 -39159 -66117
15944 -66117 -68312 -51006 -40132 -19500 10005 27637 21150 14714 -2420 -37721 -33105 -29570 -35555
15931 -35555 -23494 -21213 -34499 -31586 -28949 -18006 13719 44545 30927 21819 19191 36377 52131
15918 52131 57186 29812 -6817 -31640 -45900 546 6222 18545 13395 4562 -783 22107 25493
15905 25493 1476 22110 2486 -540 13104 -12418 -18257 -8032 11256 9902 270 7757 3298
15892 3298 4817 7547 -18188 -27344 -15021 -38375 -67148 -51499 -33646 -31483 -21440 -29352 -34480
15879 -34480 9185 713 -47539 -39567 -28342 -6318 359 20763 24932 38857 38896 29409 48817
15866 48817 68858 80305 67868 49268 38461 35540 59499 31064 19223 2248 -14435 -22779
15854 -22779 -22295 -9317 -35679 -46659 -22897 10619 24035 33792 50142 53733 48992 38812 20399
15841 20399 13973 8225 8096 -16085 -24513 -32620 -22528 -33785 -40721 -55436 -54844 -43777 -31839
15828 -31839 -26641 -17094 360 1049 -8426 -12946 -31546 -14942 -11939 -20745 -27253 -34732 -55608 -40466
15814 -40466 -3412 -34012 -25099 1664 18070 23817 32210 11293 27664 34112 12587 -32691
15802 -32691 -34710 -36947 -41031 -31359 -27401 -18483 -35673 -43582 -32386 -21973 -15439 -19827 -35562
15789 -35562 -32913 -23065 11309 10801 -19654 -25615 -9084 20557 -5800 -23682 -21295 -18504 -20640
15776 -20640 -24566 -39359 -16384 17324 20950 14282 31365 30534 18058 1890 26529 36689 21027
15763 21027 9273 -24192 -7752 -2519 203 -193 7330 -8962 -36086 -25724 -9255 -21794 -27408
15750 -27408 -39931 -50682 -10232 955 -30222 -32610 -38084 -3427 29828 35499 12215 15508
15738 15508 2156 -21734 -29650 -30042 -20313 -31585 -3195 21336 571 -29982 -21966 11378 2610
15725 2610 -19369 -20574 -19701 -60294 -26542 19375 -9974 -53033 -69377 -67322 -70026 -60392 -48541
15712 -48541 -40059 -64377 -84096 -60504 -14112 -2664 -7836 5907 1596 -15826 -18489 -30653
15700 -30653 -22107 -13221 -19114 246 33885 18628 -15921 -25239 2906 14190 32083 28470 7345
15687 7345 20148 24808 19887 15233 19313 46512 43837 14394 6345 -16647 -30253 -14674 -21308
15674 -21308 -19966 -23057 -21603 -31632 -31933 -35038 -40948 -27734 -11745 -5076 -8346 -21047 -29311 -30688
15660 -30688 -2213 -4059 -13949 18356 49278 52332 46388 42601 29746 2031 -20369 -26521 14454
15647 14454 25468 12928 -4018 11653 28287 18095 17261 6638 23721 13871 5679 -17354
15635 -17354 -66742 -47269 -35922 -49567 -45548 9197 13997 11499 8666 -144 9668 9636 10186 15071
15621 15071 26617 33045 35201 34650 26888 -19089 -46988 -78270 -46512 -34135 -25480 -36057 -23730
15608 -23730 -16014 -4374 -34762 -36062 -4553 18265 11659 -7716 17438 16851 18865 -2722 -9598
15595 -9598 -23245 -22879 -12493 -7608 -3592 -1071 -25965 -16981 11769 11378 -12053 -29375 -33489 -27792
15581 -27792 -21191 -10767 -19825 -13786 -10393 -14967 9915 12205 17925 12411 19474 7917 -233 -14507
15567 -14507 -25165 -23605 -25332 -33455 -16765 -5015 3771 10370 20338 7339 24471 14248 -891
15554 -891 28862 27646 22110 33432 31314 97 -29416 -35647 -13919 -6715 -12755 11177 23301
15541 23301 12629 30169 62087 80870 102483 86860 58201 31698 41450 56298 23108 30067
15529 30067 19098 -25265 -36581 -35745 -26693 -45295 -39598 -30618 -18181 -1347 5659 22073 42617
15516 42617 54195 50970 45792 15152 12728 4962 -17053 14792 13236 -8440 -1282 -4478 -6274
15503 -6274 -12137 -16568 -21142 -32831 -13685 1118 8846 5356 7299 20433 6640 26205 2977
15490 2977 2143 51450 81518 52217 27191 47648 73866 83886 71949 36888 2540 -27570
15478 -27570 -20535 -19886 -18551 -5615 7157 153 -12229 -31219 -9531 15544 -7883 -18281 -18788
15465 -18788 8437 -1965 -31057 -23805 -16931 2865 -19720 -16355 -2380 28567 37555 28307 26021
15452 26021 16687 28608 36011 23855 -4460 -934 30533 33912 76912 80683 45322 11019 -8604
15439 -8604 726 18147 11649 9680 -13394 20476 54836 47873 6927 -27532 -20751 -10906 -1972
15426 -1972 26156 39471 51177 43286 53497 48556 -1778 -19243 -15416 -13986 5241 27328 41362
15413 41362 -594 -14997 -34630 -32874 -9799 1015 13040 18614 53408 42097 10831 -3400
15401 -3400 10790 -5537 -6087 -2976 -17358 -42168 -48198 -37785 -1269 2909 442 7018 -11612
15388 -11612 -39181 -20558 3694 -16038 -54957 -33903 -23436 -10673 -18680 154 27178 23894
15376 23894 16325 24188 30890 30824 40681 33450 13551 803 10200 -25521 -44191 -33734 -20358
15363 -20358 9980 6006 -10529 -3989 -7389 -11296 25045 41876 17613 12619 -4505 -27841 -22490
15350 -22490 -14239 1649 7568 -335 687 13395 4861 8582 2394 -19591 6045 36431 59643
15337 59643 57204 48981 20198 -11692 3973 29906 28206 53305 43529 1376 -32697 -70758
15325 -70758 -55475 -59857 -46006 -30128 -22215 -27564 -30381 -7757 -12884 -37052 -45336 -40515 -9962
15312 -9962 -18128 -59926 -64462 -40069 -31298 -22156 -17698 -13671 -39019 -66658 -55610 -28570 -26960
15299 -26960 -13817 -8744 -24167 -21272 -39608 -33353 -4625 13497 35765 27519 -19144 -55600
15287 -55600 -34020 -161 8064 13912 11492 -7085 10796 42439 32785 36049 17282 30657 23872
15274 23872 16712 -4372 -15733 -24501 -19974 7300 3783 97 21329 9799 -8489 -5935 16381
15261 16381 22246 9005 11675 7417 -34774 -54386 -52011 -37462 -37865 -49257 -26911 -403 8960
15248 8960 13133 21471 16378 34404 56918 51598 49161 38748 35257 38160 23965 31763 29673 -4384
15234 -4384 5108 26182 13237 6356 -7182 -14747 -18745 3265 13473 8478 -19751 -32107 -53897
15221 -53897 -22302 28134 -776 -7872 15306 10648 5582 4672 -24017 -17439 -21170 -14947 -14949 -22765
15207 -22765 -29673 -29504 -16161 -43868 -48902 -24760 -6832 6215 14680 -1082 -28533 -23770 -6132
15194 -6132 43157 55764 32187 25340 24016 26353 26132 -6293 -23893 -28041 -8299 18931 27582
15181 27582 41584 45975 21771 18041 3220 12603 22902 23283 24577 32336 -4022 -31510 -40979
15168 -40979 -15048 9546 32839 14988 -2510 -15799 -2140 25622 14478 18672 -10851 -29361
15156 -29361 -21819 -19067 -1455 2333 221 31745 36764 19584 32623 22392 18082 9363 1979
15143 1979 -15491 -16260 14418 28627 10509 438 9671 14467 20334 4865 -27888 -36080 -39677
15130 -39677 -44548 -10290 6220 -9716 4489 -42554 -67176 -52626 -56618 -51211 -38177 -4089
15118 -4089 -25019 -27409 -11555 -3909 6075 -15892 -23969 -23194 -16033 -14269 -29177 -18617 -8757 -2548
15104 -2548 -19139 -5330 22965 15156 -15206 -31775 -21083 -11083 -31783 -29551 -20332 -25306 -11716
15091 -11716 -19275 -15816 -1107 11344 29770 29132 37542 12991 1998 12272 -13980 -18677 -33104
15078 -33104 -29364 -32815 -33517 -22412 14928 21 6275 8120 16273 8278 -6727 -19716 -25316
15065 -25316 -21692 -14445 -18347 -21746 -25148 -9352 30988 33870 25489 15526 -1473 21153 44479
15052 44479 17948 -6795 13248 -10954 -44730 -35803 -4420 2315 -23137 -10087 27100 24656
15040 24656 -4150 -21469 -20092 11679 34219 41765 45079 42055 15832 4908 6311 -905 2398
15027 2398 4687 20157 11250 -1625 -12405 -32588 -11628 20954 19955 27252 32057 1168 -25979
15014 -25979 -43158 -58480 -57679 -26583 -21041 -15136 38501 56971 47219 76312 95438 200634
15002 200634 455232 612494 426265 232996 142599 115857 71046 46964 51856 55983 45548
14991 45548 38711 31006 52438 45492 52367 61731 64398 40558 15265 15542 35335 11116 19719
14978 19719 33632 24262 22633 27788 30348 27175 -8662 -31082 -23004 -58890 -77830 -65421 -44117
14965 -44117 -17351 445 20496 38737 40739 33613 34440 26047 23233 7378 1798 19387 4393
14952 4393 642 6618 -8804 -2450 -2241 -13677 1625 11093 -16296 -31500 -21825 -36200 -34660
14939 -34660 -29469 -4534 -5357 9331 19560 25580 14257 -12279 -35045 -50470 -32946 -30488 -11117
14926 -11117 -4715 10197 -8844 8918 21514 4968 -1177 -15499 -23792 -6121 -8292 -7041 -27430
14913 -27430 -30961 -21357 -13885 1701 -937 -7206 8811 13742 -15519 -39510 -59497 -63563 -44314
14900 -44314 -2788 16975 6872 -3248 -4017 24133 -1787 -2539 5104 29120 41857 41796 32491
14887 32491 12658 17485 15563 4509 847 -2238 2088 -11741 -114 -2440 -8698 -3875 7733
14874 7733 39048 29377 3410 -4927 -25459 -33911 -10946 -16517 4077 11582 13081 5751 -147
14861 -147 -950 -3845 -2838 11742 17190 -4874 -39608 -32053 20063 -5215 -14723 9593 7120 18125
14847 18125 12748 18682 12719 -5671 -26733 -364 44404 54390 18006 -26400 -39960 -20197
14835 -20197 -19534 -11395 8578 -19737 -51341 -52999 -27766 10634 10697 -19901 -16502 -11368 -14544 -26697
14821 -26697 -36678 -33747 -52979 -67627 -37088 7512 21502 11744 32281 36043 37570 62103 40035
14808 40035 28534 8187 73 -43428 -43690 -37447 -60770 -29211 -24415 -22119 -16390 -36000 -26229
14795 -26229 -6803 -9569 -27586 -64060 -63002 -44745 -52119 -39146 -22753 -21739 -15428 8680 17452
14782 17452 17396 16854 5451 -10136 20041 8598 6788 21989 40104 23985 20801 26012 1651
14769 1651 -18951 -11822 12434 19455 12198 -5749 -6037 -3453 -22759 -57675 -52572 -61511 -39506
14756 -39506 -1121 1511 8972 -5848 6858 -7681 -12716 -10732 -26773 -37902 -33079 -34385 -30065
14743 -30065 4015 24337 19613 6406 -4819 -941 -396 -4836 3232 10373 45831 41357 44846
14730 44846 29220 10905 -28563 -34012 -1862 18090 32174 43521 20979 -9783 -2695 27890
14718 27890 14911 11636 21074 29392 219 -15297 -18481 2032 13421 19323 4904 -10298 12212
14705 12212 15359 31671 29152 28622 31094 32203 28258 -3320 -5752 12990 17817 -12775 -2420
14692 -2420 28631 37738 52171 60766 62448 49238 13617 -8007 -22246 -21464 -21555 -19826 -31363 -26415
14678 -26415 -10747 6690 -3284 -91 16401 -6292 -33221 -56485 -57350 -29553 -30293 -43170 -40695
14665 -40695 -9696 13068 15206 14730 3617 -16658 -53111 -50815 -22890 -17083 -23929 7879 51225
14652 51225 46141 21900 -16908 -31672 -38006 -31939 -24127 -5478 -3173 -2320 -41 -17433 -34999
14639 -34999 -40518 -47326 -40829 -22574 -41626 -32888 -7525 -3518 14170 8127 23496 -15853 -47429
14626 -47429 -53622 -22800 -14220 -27633 -44803 -37611 -39805 -23418 37020 65401 76338 52754
14614 52754 17069 -1063 -14326 -18564 -9723 -12405 -10994 -50951 -36471 -31271 -895 18024 6206
14601 6206 -7945 -18860 -18351 7176 -22720 -31706 -6058 9938 -9630 -30847 -18618 -16686 -2176
14588 -2176 4752 10057 8467 -12579 -28150 -13599 -3957 -3458 -23334 -34552 -37038 67 18325
14575 18325 -21262 -51810 -58571 -35279 -36802 -38673 -25413 -33981 -68894 -60593 -35630 -8128 2163
14562 2163 11977 38558 40659 9508 10692 -8347 -27423 -35594 -39665 -38320 -18618 -816 -7843
14549 -7843 -27673 -24171 -10015 8605 23674 17239 30357 53357 78851 95776 58723 21959
14537 21959 17527 26914 24731 53661 68952 59510 44230 41167 47078 55826 48522 33249 51250
14524 51250 39716 29971 32613 18170 -37540 -46449 -30800 -10049 250 -448 -6198 -29107 -41366
14511 -41366 -78808 -80538 -57606 -38480 -13836 -16148 -5038 -7926 -3978 -7289 -22347 -40576 -28858
14498 -28858 -23018 -26912 -18171 -6216 -6599 -4905 -2367 17649 -9041 -25391 -3550 8260 16737
14485 16737 10400 356 5600 -1233 7916 -9347 -9316 -9857 -22906 -70331 -65893 -37934 -35447 -11586
14471 -11586 18939 23877 -5163 -9193 -29103 -45588 -46878 -43227 -52124 -24784 17134 25665 23778
14458 23778 25101 49522 68939 57644 23620 10568 10977 12700 27697 43880 30908 9821
14446 9821 -7540 -24046 -24399 2907 11646 19532 51889 32803 11347 -3335 -3634 13214 19118
14433 19118 19723 30596 39048 31011 12314 -14430 -40988 -40493 -48023 -36631 -7446 -2397 -14698
14420 -14698 -14196 -30273 -48256 -40327 -23943 -13907 458 16252 12049 33987 27501 16714 7814
14407 7814 -1247 21118 32087 29347 20306 11575 12765 3623 4645 -26923 -42910 -23797 -30961
14394 -30961 -21501 -15016 -18575 -20348 -27138 -10409 -1099 1459 -29712 -27350 -17065 -31680 -44467
14381 -44467 -27612 1342 -593 -12879 -21269 -26128 -26452 -41857 -44813 -48637 -33138 -1013 34036
14368 34036 30004 19747 28104 52822 56535 48381 42041 19061 2365 6722 3745 8425 19372
14355 19372 5651 -6081 13282 9538 8164 20283 32253 21221 5466 -6648 -24109 -41045
14343 -41045 -29515 -5724 -8783 -41973 -33009 -10227 -14110 -17269 -5422 659 23234 41782 71487
14330 71487 47009 51751 44685 40415 17054 -13886 -7919 10028 8776 -11346 2992 -7464 -688
14317 -688 -10610 -21121 6130 25502 14015 -7516 -32436 -45142 -36760 9865 15371 35223 54466
14304 54466 42582 -210 -7677 -16468 -10717 -5284 30027 48117 709 -28943 -31817 -45460 -21149
14291 -21149 -18837 -49422 -34177 -6852 30231 58668 53254 24707 -2211 -30144 -30519 -14963
14279 -14963 -10646 12020 24036 33896 32515 22454 -18822 -40066 -35040 4403 30560 12029
14267 12029 -1850 2041 7802 -2283 -10978 12695 27785 21661 32551 29454 40040 52002 48497
14254 48497 60526 64516 40991 21673 13177 27440 51949 55461 32886 14168 34274 44041
14242 44041 7150 -4368 16864 27249 17842 30433 1073 -13743 4696 -2885 -1747 5576
14230 5576 6651 -11659 -31983 2881 43255 25967 17501 16615 11498 4679 -24098 -19730 886
14217 886 -5813 -12770 8051 5758 -35642 -43931 -55356 -72345 -71872 -40336 -6485 -25281 -41388
14204 -41388 -42260 -11120 9336 21395 8340 -24337 -6830 17902 28729 9246 -39066 -43668
14192 -43668 -2270 25362 14725 -9642 -28967 -33348 -29328 -21349 -2430 20037 8362 -650
14180 -650 -9792 -39009 -64207 -49301 -13796 -10744 -8061 -9453 2643 -6222 -13600 4673 -10771
14167 -10771 -10703 -19389 -37793 -8314 10898 11726 12591 28946 29799 34169 43695 48525 62998 28635
14153 28635 24215 15382 2507 18026 41381 26824 -2823 -5798 -25876 -50000 -40169 -11941
14141 -11941 -1561 -10993 24746 2013 -12428 -17523 -22528 5029 4159 -5871 1255 -32965 -47764
14128 -47764 -41515 -22050 -18993 -15452 -1346 1951 7667 -5634 8693 10412 11288 49675 79414
14115 79414 73226 61452 53762 967 -32815 -29291 -18437 -26547 -19076 13132 41540 6318 -20953
14102 -20953 -20072 -33776 -20046 -3854 12007 23402 3052 -31498 -42458 -41751 -22899 -7631
14090 -7631 7908 402 9100 -11085 -23827 -27785 -1950 22463 -1000 1736 6965 -10077 -27912
14077 -27912 -14667 8909 19758 33704 35692 10269 -8566 -18519 -24933 -21664 -18694 -2883 -12418
14064 -12418 -1702 -406 -13987 6605 3935 4885 14603 13962 3324 6858 18732 26424 37308
14051 37308 15949 -9815 -9674 -19781 -29945 -60268 -47824 -5446 2170 -13852 -37726 -11496
14039 -11496 -10868 -18682 -27427 -11111 -6362 -12706 6567 29145 10516 -5820 -5564 -1329 7091 -3027
14025 -3027 -2593 -32915 -7936 -5369 -29669 -23111 -59881 -77311 -60393 -31664 -54468 -60187 -36586
14012 -36586 -33832 -24560 -52587 -67524 -47542 -10167 24297 21234 -18621 -36465 -24387 -23844 9896
13999 9896 8948 -12767 3473 31628 42909 25356 31108 5519 -9114 4512 -4677 -5359 13521
13986 13521 15367 8900 17323 16351 10081 16136 10050 4433 15548 17490 14463 -16800 -22243 13508
13972 13508 17657 -28196 -36652 -34160 -50430 -46895 -35261 -22501 -27814 -29522 -40221 -23723 -22279
13959 -22279 -21917 -10803 6001 15714 1196 -38960 -31105 -25519 -45698 -65899 -40706 -30906 -67418
13946 -67418 -41696 5012 33623 32845 32392 39018 49384 40846 41800 36454 -6307 -34136 4561
13933 4561 19011 41875 23817 15325 -20358 8462 38534 39707 32593 28178 8466 -10436 -4293
13920 -4293 -8879 -11444 4816 -9485 5638 18154 3481 7194 -6970 -22105 -39815 -56742
13908 -56742 -34324 -38048 -58665 -66130 -71109 -54781 -3056 31093 -2727 3897 28338 37681 22162
13895 22162 3792 539 -1330 -14882 -1625 856 -841 4699 21619 11853 -144 -16793 -17933
13882 -17933 -9884 14157 17988 -86 -11124 6380 23005 24740 32093 52662 54250 25404 19398
13869 19398 -16303 -30722 -58363 -47747 -27022 -27600 -22188 -1771 6073 -16363 -59029 -62635 -48435
13856 -48435 -36313 -16994 -9695 11691 26891 25432 -4028 -26345 -17047 4070 13881 47825
13844 47825 21252 6778 10932 26319 26886 40606 23056 -3378 15149 21288 19939 15112 28566
13831 28566 26620 -4537 -33869 -38247 8124 37120 48581 62722 56354 55672 36297 18901 20136
13818 20136 11549 8360 10720 16265 37375 51709 18216 9313 1884 -302 9728 14954 31240
13805 31240 49141 45714 32090 37138 49141 54218 53662 99052 108897 105688 122938 164201 199982
13792 199982 266593 318976 428214 526970 620833 726524 793311 806822 817102 821196 783830
13781 783830 677429 547262 440106 364485 314354 235139 176907 165002 146801 99184 89619
13770 89619 79088 54479 62655 59217 79997 71133 80388 87980 65273 42000 44590 33209 20715
13757 20715 17154 142 43455 49723 54799 59070 37700 23052 -15485 -7798 6030 10028 39056
13744 39056 48511 30572 27622 55228 47544 56225 57098 59334 47212 41231 36644 59773 69678 16719
13730 16719 6241 27427 21633 23104 18611 9300 10619 26719 38764 40327 -9966 -43500 1089
13717 1089 -76 1274 623 -774 6864 24730 16815 4416 -4879 -5980 -818 -5378 -5849 -3473 3706
13702 3706 6714 13238 -3969 -3767 -26701 -50672 -43146 -17918 7530 51314 61172 47319 24259
13689 24259 16687 8910 -6866 6363 -3807 16084 14296 10298 14503 2978 715 3872 24768
13676 24768 7029 23817 23557 19452 20921 21419 -10605 -49965 -51619 -27739 14450 23310 10502
13663 10502 14391 15439 5042 -5523 20517 31476 18598 30145 20931 -6781 -26859 -38753
13651 -38753 -40021 -16578 17807 38945 26822 -6837 -40364 -26928 -14279 -14176 -36353 -79400
13639 -79400 -78191 -47034 -12121 17697 15233 2311 -10913 -28063 -18670 13331 13804 -12351 -21858
13626 -21858 -25521 -37389 -44124 -36644 -2740 19182 38506 15579 752 8965 9683 16150 17004
13613 17004 11378 6415 2059 6202 12978 8604 -42164 -56104 -34092 -44587 -39294 -47150 -44416
13600 -44416 -37769 -30858 -30141 -16173 -28535 -26200 16534 34278 22830 38015 49818 69101 37870
13587 37870 27155 32545 58403 54313 24247 19243 29719 35477 53180 76196 104950 95953 87450
13574 87450 86517 87631 88551 72762 53593 22777 29870 19033 19058 14360 -2809 14059 17236 13629
13560 13629 26928 31112 37040 47721 66260 89755 69171 53445 86447 66608 49099 57194
13548 57194 102710 133087 146524 121525 94298 86005 97726 82896 45093 7196 753 17738
13536 17738 25499 32505 13380 -3452 -2986 -27688 -21540 -20617 -6494 12501 29744 36712 5995
13523 5995 -4692 4 4533 20778 -1656 -21470 -22326 -6180 -10237 -12800 3438 9108 -6406
13510 -6406 25722 14392 -24491 7766 9169 -9334 -18736 16332 26059 -537 -35130 -78057
13498 -78057 -76034 -53522 -22770 2610 24916 63448 73029 29919 5739 22169 56061 70207
13486 70207 90995 76048 62630 42813 31360 25083 25595 29932 24821 6397 -15173 17429 64220
13473 64220 62163 54336 41407 22078 32282 50572 24625 5775 22328 20085 -5418 9168
13461 9168 12475 8927 26970 29251 60443 67235 37170 28845 17183 25392 54801 46324 28231
13448 28231 2480 8587 9973 -24271 -12894 12745 18505 15225 3908 17706 15235 1901 17607
13435 17607 38581 28877 16197 38842 64661 64434 82647 130790 142761 131702 131547 125028 147467
13422 147467 170728 193498 217426 214615 202231 175753 156509 119763 86520 82189 89103 102528
13410 102528 55045 33148 44930 34325 27829 46651 43354 53620 90548 78522 50799 45902
13398 45902 24299 26304 39217 36223 58499 79230 96183 108085 111822 102511 69454 55910
13386 55910 58240 68105 82301 72386 93377 101615 80103 79946 73028 84673 84600 99681 124284 159906
13372 159906 143368 133474 119356 116315 148082 150932 125776 108201 123320 161076 178403 214695
13360 214695 233633 220669 209143 208123 216906 258217 286342 284162 286323 318377 319531 305403
13348 305403 319445 361984 402642 420483 449726 472876 506488 522067 558921 569372 578312 596909
13336 596909 646907 698947 763217 821325 847590 920142 980734 1068658 1131758 1169392 1251949
13325 1251949 1376011 1483316 1628068 1766309 1966522 2225795 2521021 2873234 3277801
13316 3277801 3750302 4341556 4989353 5622858 6338591 7228335 8165390 9136587 10259038
13307 10259038 11769828 13916121 16978697 21704277 29112753 40449882 56363563 74935432
13299 74935432 93478323 114747581 141193292 161660333 164439586 162388863 165761658
13292 165761658 160913492 137946976 112170166 93479228 76725943 58635640 42986369
13285 42986369 31985574 24810238 20113546 16947731 14624381 12820995 11490421 10368847
13277 10368847 9221465 8165307 7316378 6538179 5747990 5041670 4472084 3963289 3535932
13268 3535932 3175720 2852981 2604291 2413141 2256794 2095992 1929004 1798158 1692317
13259 1692317 1577272 1502250 1411564 1327654 1287246 1239470 1181994 1140922 1093867 1031056 981662
13248 981662 943465 921222 881069 833103 815909 787385 765372 748046 738725 725189 689481 651251
13236 651251 629847 606329 598331 575666 538213 529665 528537 512320 534874 540652 544437 550715 541450
13223 541450 536445 542279 535229 516225 438105 385312 379200 366513 345893 353087 349596 328559 340148
13210 340148 304445 286947 279371 287834 291613 264783 244776 260681 269865 257008 261475 263161 260722
13197 260722 261540 242881 213910 214564 256127 261451 245031 231818 217998 217153 229910 222615 204991
13184 204991 194731 208723 202811 173636 152454 149307 131931 105319 111761 96401 81932 78560
13172 78560 71834 48793 57548 70873 75031 59972 53178 62873 63252 94938 95680 79650 102166
13159 102166 113417 101885 126978 128662 122024 135631 138890 127351 115308 111107 102962 107228 116294
13146 116294 124882 120604 88631 99940 113372 110959 120251 149083 161699 150953 148538 130033
13134 130033 115531 104897 59824 44718 56303 92695 66270 51793 54513 90774 83086 61535
13122 61535 70028 73570 60631 61650 69203 62465 54070 82572 91108 76352 88343 76781 52334
13109 52334 50424 59440 46393 19644 13223 -287 -16177 17608 55614 55335 62664 50454 49537
13096 49537 48458 59018 29432 35679 45408 47818 69769 66143 45439 65344 80400 76861 100534
13083 100534 91978 70600 32505 -4539 -28224 -24529 -12210 14431 16031 27051 44854 61514
13071 61514 66643 49378 40034 52858 51668 54848 32127 34925 21348 5206 16670 24124 24490
13058 24490 43304 53958 70155 58790 52493 66360 68862 46113 38141 30759 56100 62230 33869
13045 33869 45589 61520 29152 8084 26981 44019 53160 48258 37729 33634 52208 65522
13033 65522 50901 54501 73588 83709 89075 128152 143107 123734 115303 124459 127791 92615 93794
13020 93794 125242 126339 95028 94045 75593 33242 9962 -2265 2778 25285 33083 38712 26411
13007 26411 -125 7974 -2933 -2066 5341 7023 12234 40374 38091 27400 26933 36547 11143 5889
12993 5889 22366 40911 50947 47005 38623 51357 79568 68416 79012 95881 88788 83142 88345
12980 88345 91014 66614 71250 53180 41796 49493 28889 36351 46626 62149 87979 92995 78612
12967 78612 73164 72291 59567 58527 46389 60435 56891 33192 65590 75390 69325 54988 43862
12954 43862 33249 46433 57653 73445 99244 85734 52980 33135 -1691 -1246 7203 22364
12942 22364 26717 24745 27524 36006 45287 57147 54798 56913 60443 79968 91257 83440 89059 96144
12928 96144 112264 117117 154251 264383 385056 508436 659876 804321 938278 1173325
12918 1173325 1359085 1376234 1381571 1438864 1341345 1115611 909100 769523 626316 503170
12908 503170 395729 305162 220356 154543 118460 110890 87921 99277 74490 51018 62350
12897 62350 61074 41631 25663 50238 67299 49925 29334 40210 27838 24476 45261 24854
12885 24854 15324 26815 28611 35933 38302 -5387 -30892 -2853 15133 18951 35667 28650 20994
12872 20994 638 -23125 -23606 16448 51088 24280 6130 16695 33267 50349 68673 58905
12860 58905 20322 13306 1703 20160 21949 20157 15372 9560 15916 18215 -13020 -15370 -14653 -22089
12846 -22089 1650 29242 7460 -10402 -7754 -1284 -2127 2479 19454 9926 27932 38053 28767
12833 28767 64877 87166 87791 68541 57311 30971 5736 10103 -16640 -19994 11541 30248
12821 30248 22252 3186 41650 84214 85343 81847 74628 62919 80506 95839 110433 103199 123168
12808 123168 150381 186094 210535 239801 309656 365407 419783 532965 667619 772066 823991
12797 823991 833459 865566 893836 879090 791166 670586 596295 520088 415282 289672 198701
12786 198701 166373 132439 117768 72818 15746 8934 -301 -8776 44928 69978 73495 56769
12774 56769 64124 67810 74021 54123 35589 29633 31114 43728 37288 51082 49270 41332 45612
12761 45612 36855 35278 42181 59356 40256 31089 48962 64352 66589 35040 29692 55191 65703
12748 65703 55852 37318 19480 7497 10695 -3592 16378 33098 52772 53098 50812 42853 27039
12735 27039 40420 70071 69525 66546 98451 134170 146063 184343 220758 213688 229246 228335 224989
12722 224989 242611 218213 186211 171907 160757 106262 96993 64034 34640 38477 23606 12351
12710 12351 62 3758 36056 36577 22943 17731 21711 22809 11935 43310 48650 30945 5439
12697 5439 19481 28342 30742 28352 13939 -6520 1552 -22443 -5184 23676 42062 50350 59408
12684 59408 58098 34484 27054 7472 8553 10083 -30216 -44630 -38904 -57259 -62985 -54685 -35651
12671 -35651 -36216 -32842 -12820 8427 10477 11547 3663 11936 28670 78164 100423 71001 65611
12658 65611 68649 50511 33094 -15524 -16992 -3941 -1952 52847 93862 106206 117579 119278
12646 119278 114630 106169 93942 89365 56003 45726 34143 21578 36836 62863 80798 49242
12634 49242 27667 40890 68908 65915 75284 79535 74629 79358 77232 57048 81280 103502 97203
12621 97203 65999 45152 35897 15237 27364 33327 40751 46044 36887 11964 13418 7686 32032
12608 32032 56602 53655 60847 85819 106756 161338 206208 259687 299748 308869 309424 296596 336214
12595 336214 310272 254745 221641 215550 185652 146862 126068 128216 137126 123067 104493 83714
12583 83714 63228 61319 67220 84101 86347 99616 98880 84475 99342 111132 101576 89993 94755
12570 94755 121011 143405 116918 92357 80731 124101 143363 123396 103287 113790 128083 159323
12558 159323 167757 162036 137308 150584 160683 181427 204896 212516 211941 240029 249284 227363 169444
12545 169444 156203 163258 139946 139610 165764 177389 196448 207750 198362 201143 215205 215524 239283
12532 239283 280383 292377 288157 294058 346242 399011 421951 433492 432421 436859 475166 491213
12520 491213 545022 579429 586368 621931 682819 719026 741030 778556 846110 913086 1001340 1091855
12508 1091855 1177031 1248118 1303368 1365500 1479649 1582525 1677445 1760164 1901734 2054403
12498 2054403 2194262 2361517 2608425 2860126 3102748 3427714 3802147 4241672 4739673
12489 4739673 5360172 6142229 7070765 8243907 9809695 11914048 14733865 18617057 24282653
12480 24282653 32934643 46355930 66865154 95784196 128461366 160196235 199306821
12473 199306821 245906296 268615952 262886505 264814447 269242011 239981108 192314501
12466 192314501 157723593 130246630 98795750 70391602 50876648 38205612 29657387
12459 29657387 23793506 19608521 16330383 13807855 11897934 10352073 9054432 8021995
12451 8021995 7176362 6434417 5803234 5259435 4784814 4386504 4051614 3760931 3494474
12442 3494474 3264917 3047165 2859314 2655621 2496699 2379867 2257185 2105712 2002247
12433 2002247 1900414 1779051 1708353 1630144 1577793 1548006 1478424 1403002 1327978 1255572 1222954
12422 1222954 1182690 1159546 1127731 1089804 1076784 1050158 1044075 1033726 1023055 1019094 1020735 1047902
12410 1047902 1070788 1060892 1010593 951859 866002 846464 839376 774627 737045 737613 735953 714671
12398 714671 701368 649445 623292 591798 560804 533748 498229 505589 471486 469659 495812 512535
12386 512535 498280 487802 474911 459941 417269 384293 379424 374749 398037 377879 343949 329113
12374 329113 352876 327652 312845 316905 319705 318184 333734 345204 322952 321899 339604 323315
12362 323315 298784 292264 300077 289623 285636 288703 268852 269353 273671 260035 224968 204890 176435
12349 176435 140948 154447 131459 87949 69473 82375 60475 23354 26257 51653 88227 88322
12337 88322 65372 70642 101430 144240 121011 95346 101061 129978 178894 196573 205814 213992
12325 213992 198737 179543 175540 168202 138731 119173 104144 119003 127026 142236 161931 157871
12313 157871 145081 151496 139255 128358 112176 113387 97063 121992 117309 90205 86716 95270
12301 95270 99211 101192 109693 93240 88976 70451 91767 122145 140943 150782 174837 193565 163623
12288 163623 147112 122967 116119 109773 103929 104200 138061 103478 71901 56296 57663 34749 52815
12275 52815 91389 87344 89492 114229 125558 150284 161398 161252 146541 129921 118421 112772 116572
12262 116572 138805 119190 88595 72040 48926 24828 25410 32434 44175 39393 30004 32633 52850
12249 52850 32735 24375 36556 49202 50613 7052 18385 61779 69572 62758 46389 27262
12237 27262 25847 34425 57764 70125 83081 88676 76753 46711 38206 42259 43374 44437 16168
12224 16168 27834 35042 71055 72889 73367 58128 49685 59461 56003 36179 30368 35840 70092
12211 70092 100745 83002 66224 37402 19862 14371 15267 12987 20209 24593 39479 45889 30476
12198 30476 26735 33342 61744 56140 62413 53741 15393 -10461 12426 32727 28304 36514 33231
12185 33231 -12392 -17188 -10522 -24381 -29821 988 43287 27919 -1352 -3256 -1114 38700 56183
12172 56183 25995 31777 44019 36204 40137 59698 62960 33664 36614 59459 86485 78865 104778
12159 104778 108861 127374 154576 109584 79785 98944 102817 68503 82921 90978 88373 55611
12147 55611 38221 62725 61751 23798 10494 15610 46256 47969 13512 11403 30786 64116 46914
12134 46914 12722 13401 33480 24869 9367 13255 2154 17726 21798 -8234 -19680 -14442 -19054
12121 -19054 19084 45765 70812 78106 58368 35582 6790 16912 38197 47152 41936 29038
12109 29038 16938 45042 68336 68461 52923 46781 34428 16576 38075 41580 33636 38208 53713
12096 53713 49363 24780 21797 25711 40757 47658 45713 33160 41983 -1692 -6816 18276 35902
12083 35902 9407 -11120 -21986 2158 19198 18511 19107 3454 669 34627 47561 39050 31927
12070 31927 15496 9667 19132 45396 41998 22725 19627 26699 673 -7484 -9463 1887 -21079
12057 -21079 1246 14444 -17016 -28007 2191 11015 21802 32086 32533 30112 67382 73732 42630
12044 42630 23807 27797 61316 81493 79500 115520 118256 91130 49600 49980 76701 94302 81288
12031 81288 104995 130713 169384 193445 211168 299168 427622 601355 768386 947751 1166982
12020 1166982 1384038 1449599 1401220 1427402 1422525 1236011 1010889 868331 723134 533257
12010 533257 345550 226887 186067 150928 137944 117362 102500 86604 74244 59817 90797
11999 90797 115787 115568 99280 71418 22363 14847 28021 19216 28740 46228 38766 29243 33131
11986 33131 33654 28000 37592 24938 11865 2285 378 3327 3926 14765 56749 64795 53160 30655
11972 30655 971 -6205 3655 -7779 6629 -839 -12378 -33090 -35058 -22678 -25626 -2173 -1854
11959 -1854 12053 -3275 -16814 -23382 -31432 -3393 265 -4744 9874 24502 20082 14765 27275
11946 27275 38241 17686 -8685 -28241 -30036 -34415 -32028 -25231 -34273 -18293 1268 17713 29923
11933 29923 27707 34819 20723 18470 19508 18216 27069 27876 11866 5342 -2028 9406 3193 -6367
11919 -6367 17780 44712 17513 5278 28474 35381 25917 52613 47482 -1292 27655 41800
11907 41800 36070 36598 2287 -713 12570 18324 13253 26664 42349 10493 -16516 33466 31236
11894 31236 27465 46702 29669 23252 29130 29383 36577 33730 -9015 -28712 -40523 -2546 10373
11881 10373 -23282 -40524 -22744 10229 -182 -16377 -8240 -5343 3850 6149 7770 -6636 -1250
11868 -1250 -3884 -13671 6681 32450 29836 12106 8983 43616 67627 52697 38548 53657 47950
11855 47950 9880 -20006 7627 9564 -7244 17071 45088 45450 35007 34855 3471 -9555 -20917
11842 -20917 2543 7183 -7320 -10805 6039 25943 19185 -22393 16506 38801 52538 42272
11830 42272 22453 20083 15651 -418 -3071 14277 26490 12301 -204 -11882 11033 -8934
11818 -8934 -865 -7481 38599 54048 46161 11427 -30590 -39127 -32895 -44506 -35440 -11544 7357
11805 7357 16513 8970 7061 20547 6063 -7921 -965 -624 -12261 16045 44144 32743 10048
11792 10048 -9833 -25566 -58478 -52099 -29462 4033 21280 -2269 -7751 -3306 22174 34341
11780 34341 48204 61036 60594 79934 75547 64558 45034 28734 26938 22872 14849 21186 26854
11767 26854 28363 32882 32799 60161 63843 49958 27715 22082 2295 -20918 -22639 -7954 26139
11754 26139 37009 15885 12880 6285 25673 8415 -1589 210 -4499 -4728 1311 -2431 -13490
11741 -13490 -19272 -2918 20283 42379 38840 24230 11160 -13106 -14943 -16933 -24948 -22242 -18979
11728 -18979 -45554 -18163 3371 -6100 2988 6986 -20766 -9074 4538 12623 13607 -5717 -46544
11715 -46544 -27764 3516 -7806 -27687 -44393 -44531 4992 34539 29043 17456 17459 7658 -7762
11702 -7762 -5790 -36510 -57912 -50196 -50258 -36266 -3807 -19539 -56358 -47512 -9449 -1631 -43605
11689 -43605 -46365 -23887 -17573 3702 23766 26285 9008 1513 -445 -899 -24841 -27558 9300
11676 9300 7543 -7458 -24990 -36787 -18894 12064 2732 -15899 -3106 -2415 12381 14335 25640
11663 25640 32934 34550 13960 -12973 -10052 13489 3998 -2855 -10621 7253 21446 24788 28413
11650 28413 38913 42450 70344 75217 69572 107704 132826 87832 49300 59931 58594 20795
11638 20795 -8258 -13497 1141 32129 54384 59955 36885 -1585 -33581 -23946 -37545 -64778
11626 -64778 -46981 -40384 -12844 -2607 912 -18207 -11227 34011 45423 43478 21071 3284
11614 3284 -7002 -22532 -26751 -7938 10927 12032 608 12588 -292 -20517 -1633 5877
11602 5877 12972 7748 25639 11589 -11159 -6747 -7134 -26744 -4046 -12275 -13808 -30901 -44557
11589 -44557 -45129 -67685 -32330 -8092 21510 28935 11579 1183 13690 2869 -32657 -32393 -23391
11576 -23391 -281 35688 39041 20990 11648 4057 7895 19994 22473 7052 14344 18820 4233
11563 4233 19893 12009 13384 30277 25862 898 -484 43269 53903 34881 20194 -7607 -19230
11550 -19230 -8947 -30049 -18894 -10623 11667 1862 4796 25085 -7419 -56184 -56429 -34630 -1059
11537 -1059 68 -20105 -14315 2315 1452 -11655 -9979 5588 27652 43466 21790 31792 32050
11524 32050 22715 13311 6712 13186 35275 20626 21658 12010 12455 -2563 -28525 -34391 -35767 -31593
11510 -31593 -21457 -25067 -47371 -60957 -62218 -50288 -38476 -43165 -26708 -34790 -43133 -57633 -21272
11497 -21272 -442 3694 35186 29010 -19145 -42396 -45772 -58136 -39562 -19571 1954 3496
11485 3496 5407 -14915 -41498 -16484 2768 -20433 -22286 22362 47973 32793 29919 4110
11473 4110 9944 6149 9515 -2956 -26811 -34099 7974 30332 18364 1187 24766 43009 21320
11460 21320 -4469 -22080 -26097 -17884 -26533 -33584 -1797 14348 5946 25348 48525 19999 -23338
11447 -23338 -57201 -61089 -49782 -47106 -45451 -34310 -46257 -26077 -2298 5241 21021 19431 1294
11434 1294 -11810 5299 2615 12313 27317 19309 -10501 -18948 -25377 1989 -3747 16479 24842
11421 24842 3901 -16320 -2546 -24199 -56676 -71465 -54975 -50540 -55331 -45450 -27661 5870
11409 5870 35030 42034 29014 9863 -1808 6682 -29181 -60791 -22760 11996 -6173 -4909
11397 -4909 -19680 -45529 -71784 -52326 -36686 -12679 215 38548 47399 25837 -8973 -30251
11385 -30251 -19234 -15294 7934 1961 7887 21962 29806 18927 41288 48601 35829 34757 15897
11372 15897 3117 12148 18648 13718 26970 22999 16791 -20765 -27745 -12026 5211 -6197 9464
11359 9464 8243 -31378 -31103 -34785 -49772 -72757 -57593 -50250 -24539 -14616 -16922 5904 22977
11346 22977 19344 20637 36571 7508 -28650 -40568 -28114 -44421 -21988 -2276 -17351 -8433
11334 -8433 -3470 -18564 -18028 -11346 -17299 -16435 -27433 -49855 -59265 -68640 -64438 -52077 -19417 -15010
11320 -15010 -15599 -5952 17865 27327 -19059 -30492 -10204 6575 1909 9077 8041 -6027 -2570
11307 -2570 20377 28275 3964 1011 -10081 -36049 -1546 15124 -5439 -17686 -32008 -16429
11295 -16429 39221 22221 2541 1310 -13635 -29650 -36260 -35813 -36039 -14770 -9885 814 4670
11282 4670 7798 -15035 -40012 -38737 -14883 -13543 -13255 14146 14705 13061 -1142 -6372 -17675 -35433
11268 -35433 -52260 -44016 -29353 -35017 -37807 -42533 -40160 -36098 -37357 -24244 -15931 -29057 -10131
11255 -10131 12923 30409 -11566 -45472 -52286 -21519 1986 7170 14470 -4640 -21556 -23906
11243 -23906 -16244 11938 22088 545 -6215 -16907 -43080 -37499 -13969 -31009 -35057 -44972 -27899
11230 -27899 -20092 -6923 2995 29786 26088 18563 20043 -2988 -4088 -8865 7126 12239 32248
11217 32248 44586 26711 17707 22563 2329 -3047 6456 -5542 -27031 -36468 -23257 -11194 -20096
11204 -20096 -54169 -40720 -6446 -2731 16902 12263 3048 -2979 -37486 -59075 -55124 -42972 -25443
11191 -25443 7288 15837 94 35494 61100 47941 14575 33121 40317 5897 -24271 -11395
11179 -11395 3844 2207 3353 17164 27967 22418 28398 57730 30021 5704 -14338 -35771
11167 -35771 -20906 -6736 -11729 -9612 -23747 -26623 -8317 -12445 -11229 -2667 -8340 -2795 10651
11154 10651 17869 6405 6218 27644 5654 -9515 -9925 5685 24980 14388 19627 17193 33063
11141 33063 9169 10411 9316 -14422 -36100 -54859 -76862 -73132 -29030 -33569 -45685 -25642
11129 -25642 -12290 27927 39187 30582 44181 36699 28952 21098 12183 20938 35363 21201 8879
11116 8879 33108 22103 -11520 -44603 -38901 -53347 -67922 -43420 -14479 1732 20481 21562
11104 21562 -4715 -28302 -27739 -15390 -55883 -30789 -19450 -20006 -16231 -6136 8648 21452 25380
11091 25380 -6445 -26041 -21176 -4694 22339 18475 15827 20032 32123 42033 9284 -10152 2959
11078 2959 3581 -11188 -12726 12025 -3225 1538 -9114 -11746 -28033 -31950 -47890 -44690 -19094
11065 -19094 -9997 -29100 -28266 -36678 -41900 -31140 8598 17641 815 -18965 -29886 -22993 -683
11052 -683 29347 26815 16235 18413 7463 3435 -15371 -17955 1641 -4350 -14471 -46691 -52780
11039 -52780 -3720 -2158 -48307 -43348 1713 26764 27584 10775 15743 4152 -24704 -35257 -2273
11026 -2273 17175 -16709 -71898 -87539 -80362 -75980 -48429 -31930 -20222 -37801 -53683 -31358
11014 -31358 -14671 -24150 -3851 -5612 -19081 25542 24958 16303 5320 -10884 -3437 -6119 -6320
11001 -6320 -2939 -2491 2108 -9010 6595 19247 23257 8149 24631 33760 8379 -18038 -12910
10988 -12910 -21648 -3416 -856 -22380 -39694 -52567 -53744 -42387 -15366 -22381 -43163 -7685
10976 -7685 -11054 -11698 13029 18297 21329 5119 -4207 -7202 -15481 3988 15434 16554 -5679 7887
10962 7887 26128 56685 43384 13340 18011 4651 -3918 16256 19310 -4575 1836 34478 40205
10949 40205 18629 -5683 -23543 -20742 -3934 -11178 -19119 -19563 -32263 -13826 1658 2800 5745
10936 5745 15508 -9994 -50201 -21012 3876 5047 -30123 -39222 -28159 -56230 -56525 -19042 11241
10923 11241 27507 24724 1757 967 -6442 -22676 -32659 -14653 -26799 -21098 -20940 -40845 -25366
10910 -25366 -10723 21677 4470 -45798 -52275 -26777 -9221 18315 39635 47931 45307 34041
10898 34041 -9130 -51610 -39199 -22502 9992 43476 54550 37443 4686 -32771 -70913 -62376
10886 -62376 -39627 -26673 -43951 -51510 -14220 -2095 8142 10215 9515 3998 -23225 -20962 -4395
10873 -4395 9625 41695 6555 -18921 -10755 20100 30423 22900 17459 -27659 -45290 -61749
10861 -61749 -53289 -46456 -29070 -5913 -3289 -25032 -11602 -3818 -3911 -23614 -45999 -38813 -12066
10848 -12066 -17009 -11743 13967 6912 1342 23297 19647 30017 28982 14133 9206 4492 -7147
10835 -7147 -40461 -51273 -33013 -26853 -25336 -14331 -3176 -14881 -27482 -30819 -47552 -54187 -52799
10822 -52799 -55913 -37836 -38351 -35001 -42502 -32737 -6816 31185 49923 44252 30432 15710 46363
10809 46363 64794 54691 17710 -35431 -55282 -27361 984 -3072 -5524 7798 17425 35753
10797 35753 11092 28561 47577 55963 29141 7373 -623 -28216 -45778 -67740 -90576 -85149
10785 -85149 -57182 -21692 -1196 -25874 1476 17328 39465 24451 -5099 -19053 -27973 -7725
10773 -7725 12158 38167 31241 15920 12921 39675 53200 31317 16900 17392 36354 45853 58555
10760 58555 62650 50202 32811 44150 8914 -30292 -42256 -57253 -43997 -27984 -25695 8569
10748 8569 63264 61255 9062 -10967 20570 6189 -11999 12587 45585 55235 18647 32726
10736 32726 55557 48048 44653 37714 32421 8910 -9005 -10769 -16212 -35015 -17428 -13214 -24253
10723 -24253 -64205 -86852 -55148 -25727 -35901 -54814 -47263 -39125 -28535 -2455 7264 23024
10711 23024 50717 43480 30467 -754 -16005 -14809 -8033 4642 31048 44040 28343 11210
10699 11210 20911 19344 9596 24157 41696 57642 70226 66881 38495 63250 58684 25169 26294
10686 26294 8421 13501 14337 23894 31237 38293 7547 -15057 -15973 -20824 9435 -13769 -33935
10673 -33935 -18763 -14540 -17160 -38522 -35577 -14205 24145 7267 -7890 -4644 -10128 -30456 -12472
10660 -12472 -8968 -28040 -21359 9232 871 27563 35723 14490 1146 -783 483 104 13886
10647 13886 23898 304 -32652 -31861 -28644 -33847 -25222 -18247 -27910 -31417 10715 21683 21127 -6272
10633 -6272 -14576 -19640 -62227 -33874 -19296 -21125 -21782 -22919 -8570 12619 13797 -2180 -42974
10620 -42974 -54626 -50313 -29738 3022 19120 -464 5181 1646 -7029 -23078 -18630 -19556 -11805
10607 -11805 41109 56475 38194 32695 25918 12124 22382 33753 43293 8800 -14250 -29125
10595 -29125 -38319 -7537 40207 39807 9582 5049 -22337 -32185 1394 6797 3532 2048 13912
10582 13912 8542 6674 6538 -10937 2222 -16830 -53591 -83813 -67175 -60578 -22361 22469 23527
10569 23527 13008 4785 5413 8004 10279 -5751 -30533 -1065 17541 10464 1328 1865 4390 5855
10555 5855 -18207 -38519 -27813 -14266 -19615 -25177 -28205 -4966 -2932 -43507 -38671 -20303 3394
10542 3394 14478 5619 -9865 -8477 -5094 -2754 -6669 7366 11353 17450 33591 39891 43562 12908
10528 12908 997 -5445 2152 22268 30038 20405 28930 35689 41640 35477 19029 24231 31441 26242
10514 26242 5231 9403 2915 -1552 5834 23816 18231 11999 -15134 -7107 22481 45821 45267
10501 45267 5341 -15814 2533 2662 -26002 -35179 -36736 -35074 -43749 -53149 -49158 -52001 -54041 -39608
10487 -39608 -25347 -20395 -2620 15775 61469 36095 35118 48063 37536 28149 25798 7020 -18558
10474 -18558 -20416 -1224 -17670 -32457 -16589 -15911 -9371 -29063 -33835 -19499 -7724 -22883 -7383
10461 -7383 -15478 -29575 5938 25712 13451 5564 -17939 -38801 -27436 -28959 -14563 -25345
10449 -25345 -16005 -22333 -29938 -2916 43337 31640 1602 19345 22843 10494 6716 -16087 -54760
10436 -54760 -49796 -48046 -35207 -23265 -11507 -1129 8985 -14304 -19182 -13235 -5487 7901 35171
10423 35171 31746 31043 13519 6952 6038 -21386 -34722 162 12015 -3439 -5131 1986 15883
10410 15883 2165 -17656 -14570 -4720 -3823 1489 20597 34566 19930 29359 13847 5579 6552
10397 6552 8972 -26981 -34702 -31630 -2766 17108 15278 25879 13005 13068 32660 21283 -11829
10384 -11829 12727 8495 -8275 4874 1016 -18531 -12197 -7527 -29725 -11652 -11511 5606 -114
10371 -114 3715 15455 -10178 7471 7690 -2630 -5038 -14119 -2436 23211 745 -15258 10859
10358 10859 22053 33896 19957 -10754 -30248 -43208 -10670 -11880 -15795 -18661 -10610 -13589 -6636
10345 -6636 21462 38171 6859 -5381 9347 20539 7676 6461 1938 -11727 -41799 -45182
10333 -45182 -32868 695 14685 -10371 1217 24558 26557 6991 18428 20316 727 -17140
10321 -17140 -19733 -14254 -15458 -20956 -5588 -5164 5648 15685 32838 17603 -14698 -25448 -6182
10308 -6182 11127 22549 29084 32219 41529 48021 42424 12101 -448 5883 12347 38375 45550
10295 45550 54989 13019 27105 48371 41559 34945 29195 16642 14807 13339 23361 5552 -29673
10282 -29673 -43538 -19999 -2823 -3565 2086 31 -19766 -21595 -39913 -28799 -2965 28837 33996
10269 33996 5776 -14184 -18686 -32293 -13321 10655 16794 51232 71149 48817 32110 27477
10257 27477 6712 14953 13881 11393 -4395 -13136 17430 23465 7735 12444 -3396 -18036 -49651
10244 -49651 -59099 -43302 -27045 -27207 -19993 -27241 -23841 -41 27236 4201 -5655 11669 639
10231 639 -14240 4623 13862 2049 -5840 -20313 -34571 -33289 -29538 4969 30454 35944 26719
10218 26719 4581 938 3195 2507 8245 27727 13914 12618 22139 14353 -8734 -10489 -10722 -38220
10204 -38220 -51831 -57874 -38929 -1114 -4758 -5199 -7069 3421 -8525 8931 32232 47023 45269
10191 45269 65167 49519 33383 32241 45261 45211 22009 13889 20009 20140 39382 49097 49452 44480
10177 44480 50913 46536 36568 24885 10484 -14403 -686 -11175 14172 12610 11482 30021 53851
10164 53851 32201 2663 -19479 -2932 45587 48146 -2985 -15807 -25665 -18691 -21934 -3849
10152 -3849 -10779 -24634 -29378 -18495 -4079 -2868 4091 -12375 -13956 -7100 -13964 -13543 -19526 -14766
10138 -14766 -27159 -15821 -33292 -26925 -19528 -11791 12557 -18631 -36901 -32102 -6877 7686
10126 7686 19311 7578 17727 40965 38759 42862 56951 34114 -4105 -14023 -26094 -42758
10114 -42758 -33292 -35532 -42914 -26152 -1326 11664 6731 9459 -7314 -13153 -11701 -20941 -41862
10101 -41862 -53692 -39146 -25153 -34973 -44327 -17907 -1050 -18464 -20832 -5079 12992 -2124
10089 -2124 -10303 -2752 -9343 -28156 -60349 -39061 5113 32937 49676 20819 14600 36823 46531
10076 46531 15527 11777 22129 -2735 -10014 -22316 -21854 -43003 -28701 -6456 -2837 12964 1624
10063 1624 -19853 11190 26454 46233 25657 23909 18203 8606 -27275 -55644 -29775 8594
10051 8594 6107 11152 20038 25776 31630 14213 459 -20673 -28117 -6170 10342 -1118 -22963
10038 -22963 -31163 -23179 10939 13397 1303 -2853 1194 10057 21018 16662 -3874 -12205 -23642
10025 -23642 -22717 -22527 -17342 -2237 -1029 -3860 -17066 -45189 -4261 15628 -326 -44488 -52385
10012 -52385 -46477 -22464 -18276 -30353 -40050 -31470 3722 23094 14097 3698 8589 19042 26012
9999 26012 31143 37989 -4227 -7126 5163 -9055 -10333 -23384 2140 6671 21059 34397 42626
9986 42626 34709 9339 -4746 -2643 3914 -3006 -14121 -15084 -18126 -19215 -16718 4354 -490 -21057
9972 -21057 4107 25886 19711 30307 21919 22688 17950 8947 11951 13157 15719 -2054 -21345 -1964
9958 -1964 -1721 14715 28134 16738 20794 39943 47455 40650 37272 14792 10674 25824 36888
9945 36888 22131 16532 10719 -7530 -27786 -18418 -13842 -16585 1160 20004 9912 3047 -6357
9932 -6357 7552 -8693 -16446 -7668 -26352 -27334 7392 41320 55259 18994 20777 -139 5230
9919 5230 10415 22057 51505 39534 -3528 2067 19046 8585 -17157 -28787 -36885 -27346 -20264
9906 -20264 -25816 -26829 -13834 -3276 3463 23512 -1680 7993 29836 79832 66172 53476 63210
9893 63210 22624 13219 -12504 -10558 -4194 -4201 8442 9923 -1342 1418 5832 4635 -6729 -9518
9879 -9518 -1030 2414 -3698 -5935 12439 16551 28757 41052 44946 23024 -696 -16500 1136
9866 1136 10272 10094 10049 27768 29136 42375 50472 70306 66778 50799 34663 9599 -751 -2467
9852 -2467 -8615 -18819 -29021 -42155 -28897 -9496 -12047 -21267 -23030 -29142 -49628 -17331 -11959
9839 -11959 -23179 -26503 -8377 -14954 -16294 -31756 -53581 -47157 -7661 5357 3296 7064 12996
9826 12996 12300 11062 44359 52828 37399 42349 -10618 -13003 11732 -24839 -42064 -20244 -19694
9813 -19694 -33663 -12330 -3139 3048 24992 5529 5128 -2572 8489 38383 13317 -8930 -11955
9800 -11955 27634 61190 49495 16125 -7879 2177 17224 28453 18528 9237 -6872 -3673
9788 -3673 12873 -10149 -8311 26409 59100 50021 19990 -1599 8314 6499 -8181 8925 34085
9775 34085 23168 21703 23722 26036 39831 48880 23151 -16827 -23732 311 24912 49349 33738
9762 33738 10461 1937 364 -36164 -18594 22506 3893 1868 31766 35567 29146 20126 -837
9749 -837 -13186 -20588 -41244 -51651 -37838 -26864 -21395 -24223 -4894 2129 23611 26843 21440
9736 21440 12127 24898 25513 -10089 -711 9240 25998 34981 37996 38553 25523 9619 23368 22427
9722 22427 16503 -26808 -41075 -21749 2010 -17237 -12856 39556 55768 70536 51814 18287
9710 18287 12150 7770 -6397 8539 39061 56189 60590 52677 14632 10096 45680 19423 8230
9697 8230 23637 3358 3151 5362 8922 -31719 -28491 -33648 -36696 -19513 -6306 17874 24966 2088
9683 2088 -15152 -13261 24008 25782 6762 2019 19421 45032 44371 29466 31781 20234 30550
9670 30550 18496 -31965 -10922 9436 -15327 650 11916 -9705 -3669 38858 78144 88678
9658 88678 84753 81986 57313 36687 57780 92660 93268 87120 63034 47999 25585 1683 7759
9645 7759 9861 13954 26747 20236 -8786 -2637 11686 7495 2243 13063 25310 8490 -7840
9632 -7840 9984 36252 -2723 -16329 14306 33438 55299 63010 41556 37049 44219 55955 53269
9619 53269 34081 30720 43866 21187 18223 33975 31367 26091 17183 6789 10112 110 -5468
9606 -5468 -100 2131 -4180 -2895 -4799 305 -15216 -16266 -1054 24694 28485 26289 7033 21040
9592 21040 27206 9981 -11201 -4185 27680 44960 27893 -10949 -17933 -5503 7824 -2411
9580 -2411 9071 9492 24306 25111 358 -3499 2602 12682 51482 65331 35183 16678 25112
9567 25112 45516 57975 39137 45455 69489 36708 23592 6206 -7396 25068 30308 14427
9555 14427 26485 38173 57773 38833 61102 35821 17314 18858 30872 62272 49549 35056
9543 35056 26179 42784 59758 62445 33426 3723 -19990 7335 1818 1997 -5831 668 -4878
9530 -4878 8378 52823 55227 51399 44821 8087 -12495 -10835 6118 1744 4666 43623 47835
9517 47835 31443 16998 18993 46619 81239 81763 46353 37337 56555 59389 65225 55307 50934
9504 50934 50733 29550 35098 28826 20746 19557 31067 34345 62393 62949 29281 37329 25021 26996
9490 26996 35387 41337 39389 26293 30750 36973 28734 25709 33187 24974 20914 38313 59925 61720
9476 61720 50323 46703 35450 47827 56113 42071 20931 11594 16557 45293 55999 58907 46684
9463 46684 53517 72382 49110 4211 22134 36526 27664 10587 24029 48983 58903 60481 57863
9450 57863 43233 25517 53225 49367 32536 26400 27901 46829 41521 31339 41150 46644 43795
9437 43795 39284 17107 22045 36876 68903 81124 52406 38432 40484 33704 8493 -6987 6982
9424 6982 28418 36477 48209 39826 41411 30783 62028 68586 55200 44267 46687 78232 59911
9411 59911 59198 53321 50424 49749 40231 15772 34538 10677 24826 31479 45679 57240 53819 41566
9397 41566 44331 53817 66824 72138 80911 58398 30612 13840 30519 38094 40713 51223 63900
9384 63900 52458 38662 55005 62008 55544 70080 76026 69728 82678 84218 31781 -6394 17225
9371 17225 60396 80715 74998 53439 39111 34841 36541 38622 16476 20983 38723 17757 27088
9358 27088 19508 17037 20435 1589 7857 19597 40131 70321 33831 -3066 46176 69582 62220
9345 62220 59455 46482 60374 18431 -781 16897 35354 41929 90711 110214 98582 81926
9333 81926 76536 99342 112046 68764 53362 75089 59429 42282 43650 64265 69233 74037 62760
9320 62760 51869 46250 55478 66243 58284 80988 87381 63961 52487 27452 26395 15258 14926
9307 14926 23133 46722 60248 64760 79941 59459 58774 50460 44048 41645 70260 82704 95275
9294 95275 97968 76224 66525 80565 62482 38870 24469 6999 24407 57885 85795 79209
9282 79209 72699 102064 136997 135488 110484 106524 101175 99433 98592 86462 102481 86177 70390
9269 70390 87849 109991 119111 102692 84236 97485 88847 71495 81986 50579 55497 68548
9257 68548 50619 52091 71681 87689 110925 101567 109148 133800 137548 133385 152647 127398 101475
9244 101475 82311 101665 95407 104126 110083 103049 131645 132529 164707 145585 137167 123667 117893
9231 117893 117639 143954 148352 152033 181606 196366 220852 219242 193627 139297 99415 131672 143700
9218 143700 151772 176878 187375 196322 180002 145983 138574 130434 129192 127927 105098 95389 104633
9205 104633 144963 172693 165914 137521 130943 162388 178962 167905 173760 196952 195903 201644 217873
9192 217873 218095 235900 218411 243498 234682 213047 231912 254467 249941 232954 232631 230755 255828
9179 255828 266617 279162 250395 258093 280895 297742 312530 313996 324775 346478 367239 400699
9167 400699 428526 463573 461415 452530 461962 481492 536787 584352 600773 590374 621005 666341
9155 666341 713145 767243 798098 826253 887022 938307 995380 1038299 1060483 1132523 1204735 1315432
9143 1315432 1445065 1573819 1704817 1849879 2013594 2208456 2408702 2589989 2819703 3101469
9133 3101469 3389289 3704156 4035058 4395961 4789067 5109470 5388036 5621147 5794433 5838689
9123 5838689 5764400 5607585 5411358 5130349 4821041 4494529 4171098 3821949 3487378 3206976
9113 3206976 2947743 2705358 2496400 2295102 2089986 1932210 1791838 1694275 1584653 1448400
9103 1448400 1341474 1270324 1176182 1122817 1065407 1002204 902393 835017 827934 838199 774247
9092 774247 716856 688232 625976 575984 586553 558417 524542 527962 480016 440690 456040 464811
9080 464811 461097 455286 457876 417461 413445 391896 357662 385843 397945 363715 364466 366429 327537
9067 327537 320552 341509 327239 311797 304008 311580 297080 261634 259102 262330 245072 224045 225480
9054 225480 248655 284023 270762 264945 249514 246020 270999 282784 290826 273917 237431 194159
9042 194159 176974 165302 171907 179224 156106 177965 187214 187811 178012 176227 164652 149928 135281
9029 135281 139969 139087 133836 145504 151191 146117 170321 196094 172047 150713 126204 132819 139632
9016 139632 151429 136666 133287 124048 119077 123843 100685 68598 64090 87662 106223 127834 132411
9003 132411 119086 119387 139122 122060 97798 100601 112502 117627 137965 123375 98425 100844 117938
8990 117938 130721 118386 113257 128899 123339 96059 55703 62085 81216 72041 89367 100002
8978 100002 88663 79193 56466 65361 60777 56550 48463 53602 92691 95165 59554 57971 66098
8965 66098 100635 117470 110867 73580 80635 111925 120072 112505 94573 78933 87291 76040 69852
8952 69852 62143 83079 70150 55682 27737 8127 32435 68893 92007 90331 80620 68628
8940 68628 93992 81592 47148 62819 74229 88166 88057 61874 38736 37894 50847 64706 82306
8927 82306 87819 77311 66508 84567 77031 59787 56967 56331 44128 47558 52848 76108 40175
8914 40175 -2170 21389 28482 7044 33787 50207 55538 83646 63476 51328 51529 68068 56471
8901 56471 37049 34521 28257 33713 44242 55502 59774 80725 76041 35513 46313 66555 80966
8888 80966 81311 64789 66545 97097 116890 128461 156730 201863 186114 138050 96254 52681
8876 52681 47757 23588 45737 68114 58645 63892 85692 96404 83143 50805 30898 40500 38860
8863 38860 58715 57109 63469 81595 49167 54458 53038 40847 49885 54245 34997 24166 32556
8850 32556 48886 27921 19047 29041 46617 34758 44075 41212 47317 50447 51480 46285 23262
8837 23262 42022 54535 51968 46892 54537 33677 56918 84837 59629 45661 29631 875
8825 875 -4445 9794 12796 13615 18555 35450 27099 29683 48768 64232 70778 59163 48864 59005
8811 59005 50104 50036 40493 48576 59777 60875 68930 51813 33345 48382 51201 31627 28313 37389
8797 37389 60069 78765 41439 12909 54217 63146 38364 17137 19308 34011 47812 46846 39978
8784 39978 57300 65374 38783 -4702 -127 25130 25655 32766 65760 64337 32140 46655 43429
8771 43429 27625 16566 21152 13233 -17301 -16907 -22384 -18784 14120 33547 14722 -8355 -3350
8758 -3350 -2613 38837 31239 19897 8307 -28331 -14004 -23152 -463 28736 23522 29688 37959
8745 37959 70756 54181 55142 55239 64328 41722 50306 45871 39189 35758 47471 75957 56736 42347
8731 42347 48169 43400 38244 68332 62862 54874 38503 46310 64947 71037 54560 23755 945
8718 945 24691 26854 15914 20001 34178 49854 56899 32893 43761 57636 61700 26849 14712
8705 14712 18670 36433 29733 6740 13544 57854 61038 43849 18209 54753 64110 39149 36064
8692 36064 54879 85086 53177 59767 67689 70891 58710 58300 38402 47198 81240 83419 67817
8679 67817 35541 55734 23765 -3310 18353 37158 41034 38183 52131 51686 70849 45566 22046
8666 22046 15881 20549 34184 45138 47964 36472 61738 81711 80029 79180 45641 49245 49277 50958
8652 50958 25077 16577 50303 56746 49076 41677 29750 53940 87744 74147 77605 72938 44857
8639 44857 52169 71387 83000 90337 98580 113395 91050 84799 76488 80161 92468 101789 118551
8626 118551 106448 106282 132271 149418 169676 156997 132448 137114 149714 163830 169982 200778
8614 200778 253126 275910 295702 296141 304314 328368 389298 438897 462389 458107 472194 457028
8602 457028 427607 386035 337293 320146 312085 265674 227642 213200 198179 190836 186869 165594
8590 165594 171641 154254 148885 126305 108070 88300 71756 116794 98534 70887 69513 106182
8578 106182 105018 93487 66609 69384 87307 75082 61267 70572 81506 89151 81580 77004 78107
8565 78107 58606 65341 85423 88047 59265 54794 46627 29731 47783 68815 84999 70372 50729
8552 50729 43448 71760 83942 48571 20939 54572 68010 74147 85225 103402 115862 88820
8540 88820 67516 70074 58135 50224 58759 42772 41448 37994 51474 74912 63091 49098 35756
8527 35756 42848 39800 60897 71401 48088 37232 54576 74145 95196 91342 78310 63451
8515 63451 72953 47295 37518 84950 97679 72487 62662 76377 84013 77919 55537 5563 -7234
8502 -7234 -10099 3250 38885 41235 34729 43753 63400 34579 27209 26921 34982 33051 44002 86166
8488 86166 122341 88094 78588 75434 77070 60522 22344 17620 28603 6591 -7016 21558 35873
8475 35873 47030 41806 38327 68571 42962 25457 51025 60399 79919 85801 69464 55035 30732
8462 30732 10528 -1208 8027 15909 8354 48009 71689 45671 56678 72264 48409 23352
8450 23352 4767 -1284 7720 35964 35812 48521 64826 50503 39391 38505 45034 18927 -739
8437 -739 27615 60839 76027 58765 47489 37725 37081 31148 29067 29234 61424 52288 39891 56224
8423 56224 58577 53537 57798 52217 32654 35965 24778 21575 44717 72763 72806 73574 47316 43316
8409 43316 43220 47137 37573 13395 4860 1090 -31355 -14343 12886 -7643 -6240 8687 -12779
8396 -12779 6428 -4214 -11569 -12667 3447 16358 20158 38449 57506 46234 35068 11624
8384 11624 26178 9927 16586 13620 27217 68575 80296 66484 72944 48369 52707 76857 72876
8371 72876 57022 40519 44008 45909 12518 -8588 -7862 6487 27313 37210 57934 36911 11917
8358 11917 37538 30777 11201 12722 28446 40220 37168 10743 16983 49893 53589 36240 43355
8345 43355 34055 48835 58928 61119 46976 28230 17974 9546 14437 24421 19359 14691 8275
8332 8275 42410 46366 21435 13841 21006 27259 15389 39942 31703 134 -25507 -41871 -25755
8319 -25755 -11817 -21205 9997 26100 36268 14101 13267 8191 -13586 -16242 10259 28376 -4259
8306 -4259 -9877 -7472 12583 45085 51272 49947 53638 41235 9702 9568 -2162 -35840 -31405 -12764
8292 -12764 -11910 -10152 824 7323 1861 -6160 -3781 3332 -12408 -12921 -14642 9819 23585 29929
8278 29929 25218 35818 5025 -916 8062 26906 21819 2130 17804 36768 45430 10849 -751
8265 -751 7156 -9517 -13752 14135 20405 40463 41444 16823 -5025 -19394 -15977 16618 29236
8252 29236 19911 26094 42362 54375 43017 36756 11366 -9120 -5754 -4710 -9370 -1583 14295
8239 14295 26496 39897 50191 58753 64353 44370 22943 21675 48238 35411 -5678 -3082 9313
8226 9313 34124 63591 82828 71292 85936 80846 79826 69140 14764 -10162 -39575 -64534
8214 -64534 -53975 -16051 1603 -10 10486 20933 40038 49164 55090 18960 141 33905
8202 33905 54094 40287 29505 5071 -2344 1285 -32625 -37280 -14923 4932 14795 33922 43813
8189 43813 63039 60198 46632 18975 24293 5823 -28760 -8167 -1144 11617 35132 41002 58434
8176 58434 71571 36831 12702 -15824 -50617 -43861 -14990 6403 5400 12580 18536 2678 -27939
8163 -27939 14158 25938 32731 30300 23759 23397 31065 26596 21208 14408 41245 30539 15189 1802
8149 1802 -752 7392 26422 44216 9522 18727 13420 24751 -29 -21147 -34156 -5861 31433
8136 31433 48527 53029 40242 39121 16545 -10562 -26616 -10747 -370 -5394 -1114 26928 51081
8123 51081 45690 24361 4849 21371 35204 13115 6174 20629 -2419 -22072 -15683 -15710 -27524
8110 -27524 -12031 -1063 -11778 -6208 -2795 -31392 -56058 -54599 -59364 -25482 -17000 -38991 -30873
8097 -30873 -39946 -59084 -49820 -35744 -40987 -17321 -4794 4472 5597 1245 -6137 4534 23639
8084 23639 15677 -3 33499 51565 68562 34055 -2724 -30463 -10479 9859 29982 4848
8072 4848 -6726 5171 9033 4712 15607 10925 9337 52369 51952 20836 -3713 -1702 9608
8059 9608 16472 11167 -10531 -34823 -36368 -12102 25000 52555 43811 46929 33025 16555 30424
8046 30424 22875 29409 23903 21976 18989 21375 33338 32782 39396 23389 10432 24935 25984 41733
8032 41733 66711 47611 17043 19592 32308 68604 76016 17393 5596 34918 74524 86918
8020 86918 92321 104299 92499 92446 103036 125628 106998 109508 103528 111426 123015 88317 68915
8007 68915 67348 83972 70167 77957 93678 96193 78245 41160 43961 68053 85879 56310 48182
7994 48182 73278 87476 95614 80649 66521 64684 69481 71553 82262 82659 90909 88600 69192
7981 69192 74846 70380 54299 66084 63805 72302 87507 87221 76963 93878 102032 69224 67995
7968 67995 66330 77551 108205 106779 111505 80380 85805 103078 71127 71304 103583 99501 103182
7955 103182 83361 42487 16798 17554 30163 34743 26819 21034 50473 69201 86044 99967 99710
7942 99710 95156 94314 67317 59602 63452 67743 63580 49747 51771 54553 42034 41191 64410 64414 62439
7927 62439 91904 103496 86897 39358 35500 26221 1879 18322 19184 24458 27331 22061 25812
7914 25812 17442 6909 54151 65220 54139 55036 72335 57706 45635 18280 917 -17881
7902 -17881 -35305 -22049 -2938 44444 50482 19474 17242 4022 -3306 -14918 -11261 15185 30674
7889 30674 33357 25009 -3932 -11791 19706 -23715 -20219 -21914 -453 12803 18688 22411 5372
7876 5372 -22147 -21125 -9955 12779 15221 -5672 -3292 -18271 -34547 -11175 -6089 -23357 -6654
7863 -6654 15937 29349 34031 14958 26372 27378 29055 20005 42304 39342 -4480 -14291 16200
7850 16200 39228 34939 22692 28140 27478 7368 3325 25094 41031 22837 16019 37944 37492
7837 37492 2261 -11486 23125 32317 47659 35259 7638 15745 19446 -94 12316 24126
7825 24126 33333 37694 39375 27936 36477 34417 1545 5445 6686 18309 4444 -10527 -7704
7812 -7704 -10520 16019 -408 -8886 -5078 -5401 6779 14649 -8817 -19745 -20183 -7885 10145 22399
7798 22399 33913 22464 34326 13515 3919 -8229 -16492 -11148 -14930 -20154 796 35078 30910
7785 30910 -10038 -41269 -38693 -27233 -26322 -12964 -6484 -1020 42366 36333 11298 17725 -21573
7772 -21573 -62575 -69014 -74443 -38657 -12596 13158 7393 -3559 7879 2013 3728 25858 10034
7759 10034 19185 14010 20059 -1515 -11695 -21637 -22039 -7758 -16092 -22474 -28666 -28301 -14453 5798
7745 5798 3498 -27442 -39137 -12747 -14660 -24639 -18098 -23198 -41842 -52348 -38988 -38397 -45620 -31647
7731 -31647 -39414 5287 44184 16351 -34316 -42626 -31426 -30077 -25724 -13796 -6188 10524 15404
7718 15404 14382 -36058 -27423 1302 -11167 -28410 -14077 19984 15925 -22672 -44109 -47961 -3518
7705 -3518 -9674 1941 12798 -19161 -30179 -4738 -26088 -48028 -26315 -2506 -14851 -11487
7693 -11487 5495 10289 14161 -928 -9939 -163 19325 -51 -51871 -52890 -66311 -72198 -63791
7680 -63791 -58660 -18642 -11556 -23136 -34323 -10444 -2346 -9238 -2533 14181 47756 44373 25056
7667 25056 24282 24753 -8108 -2566 -13251 -19679 -32576 -33195 -28374 -30765 -31216 -16427 -11850 -10308 23213
7652 23213 50741 23502 14762 21569 15462 9097 -2782 17051 13453 -23718 -22778 -14605 -10595 -15110
7638 -15110 -11541 4483 22961 8523 -6281 898 -2879 1425 278 -4037 -5179 -16594 -4925
7625 -4925 -13073 -46672 -57245 -43691 -56702 -48546 -23461 -7061 -8264 -15775 -14353 -59565 -76416
7612 -76416 -57062 -55877 -40269 -17079 3890 1312 -31945 -14445 -30297 -34123 -7464 -7711 -17706
7599 -17706 -27433 -47397 -23789 8135 12697 29590 52644 49538 52492 54662 57120 51366 56136
7586 56136 47532 30340 7995 10918 2506 -29606 -38863 -12960 -889 16497 3231 -9225 -24958
7573 -24958 -3375 4173 -7671 -7318 -19735 -26946 -13333 -971 -15949 -13300 13418 11260 4134
7560 4134 8578 -5925 -2234 29578 31295 27823 10409 7854 3137 -7991 -8078 -7970 -26633 -22529
7546 -22529 -8299 23944 25249 14177 9216 11925 -4191 -11609 -3939 -3154 8102 14387 -3266
7533 -3266 -34746 -38338 -15911 -35080 -60870 -33258 -35635 -36107 -36394 -24491 8209 31602 5156
7520 5156 -1675 -7475 -11410 -9166 -8975 -33684 -41551 -55857 -30665 10592 -11767 -22499 -27058 -850
7506 -850 9286 1690 -27150 -47199 -1262 -1628 -14139 -18908 6504 -13390 -15194 -14456 -4183 -14856
7492 -14856 -18506 -14046 -48876 -58679 -32606 -19669 -17609 -36255 -43076 -26807 -8714 -15828 -47889
7479 -47889 -68297 -60035 -32287 -16800 -8957 -8922 -36948 -56365 -73352 -44301 -9154 3382 25834
7466 25834 42870 58159 39405 5769 317 16366 18115 7464 -33142 -35628 -25609 -51332
7454 -51332 -25581 4576 2064 12745 -16272 -14811 -16651 -663 -785 15935 -13174 -6633 44580
7441 44580 35187 8989 -17508 -57233 -30588 -12292 -2585 -12191 -35017 -33185 -19902 -18667 -10044
7428 -10044 15687 20657 -8031 -47512 -34099 -8547 -8520 9584 17688 23144 37093 42409 22205
7415 22205 36417 41501 33159 -2524 -18233 -9924 -23445 -36342 -54244 -59827 -52596 -45033 -24614
7402 -24614 -21635 -9269 -13724 -30689 -21879 -17064 -15741 9214 20796 -3268 -21818 -15774 -36052
7389 -36052 -30980 -25252 -35474 -62760 -77541 -79486 -45988 -35910 -12061 17702 7626 -27096
7377 -27096 -37876 -20713 11660 29344 35672 39679 11266 -8826 -35211 -46578 -37330 -26234
7365 -26234 -18187 -19837 -43344 -32359 -37121 -57269 -65783 -41193 -29764 -52060 -21003 -18342 -16471
7352 -16471 -7770 544 -15737 -18813 -17920 -2718 -11336 -7518 -1018 -34196 -43849 -29329 -29008 -48458
7338 -48458 -63746 -40849 -1544 6910 -15263 -29699 -62978 -46297 -3069 -11635 -28989 -25311
7326 -25311 -26780 -13804 -33070 -24753 -7329 -3251 -18805 -26624 -48393 -46010 -20889 16730 373
7313 373 -24505 -36867 -46139 -32850 4175 26735 12405 -19912 -23612 -43520 -47598 -21074 -11057
7300 -11057 8441 43661 26427 -2303 -21089 -19125 -22316 -11554 -24662 -48753 -61145 -54134
7288 -54134 -64264 -50754 -46453 -45132 -21541 -36876 -28245 -19802 -17882 22880 48867 22181 -21211
7275 -21211 -42183 -10898 10357 1534 -10383 -9164 -18124 -45564 -28461 -7728 -759 -12144 -2476
7262 -2476 7948 17202 38691 35091 -12164 -25044 -3374 -20027 -40833 -22267 -17204 -1401 -14466
7249 -14466 -7333 657 -10013 -21539 -66424 -71926 -60278 -72505 -89447 -54989 -35159 -1672
7237 -1672 -16803 1134 19824 -19048 -36260 -9772 18926 45058 52325 14643 16574 21270 27275
7224 27275 46271 29179 -9244 -11945 -1536 7126 8774 -9930 -21903 -24392 -3807 9336 9820
7211 9820 -8628 -12547 -11255 11139 24670 11592 -19294 -16333 7585 -1988 -3795 30314 21140
7198 21140 13552 3167 -35986 -90819 -89022 -61054 -39004 -49026 -47425 -36076 -19214 -12453 -1369
7185 -1369 3581 22773 46627 39408 15403 -10631 5019 25203 12891 12205 2001 -14982 -45525
7172 -45525 -23808 11638 7453 20120 29853 25827 28320 28314 29247 21802 7639 5293 -15277 16653
7158 16653 34393 11071 -12354 -19771 -26602 -47396 -44278 -4838 10726 -7809 -19395 -42800
7146 -42800 -60888 -40828 -27422 -10997 -32394 -58190 -40323 -4526 18048 3552 -19004 -20907
7134 -20907 -19824 -11066 -8968 -21540 -48904 -48134 -30835 2217 -15803 -23251 -4009 -17662 12012
7121 12012 30590 44781 37794 -9667 -38015 -23722 -8339 -20610 -30315 -51943 -45588 -40379 -54686
7108 -54686 -42216 -25076 -17853 -17393 -1612 -9241 -22632 -15955 -23189 -25553 -13889 -18426 -10964 -1642
7094 -1642 -11372 -7211 -25290 -34175 -6473 -7414 -47565 -60663 -43519 -30234 -44096 -40657 -23705
7081 -23705 -26088 -26495 -42623 -71104 -89781 -74298 -41271 -42685 -63949 -51336 -18877 -1713 19460
7068 19460 -2520 -21313 -21315 -19275 -8367 4973 15417 15742 -5269 -1503 24777 37723 38481 44429
7054 44429 23112 6362 -42549 -72177 -69051 -68135 -43450 -35107 -51360 -14242 -15811 -11867 -7244
7041 -7244 7109 29534 15111 -28984 -25442 -3791 -21188 -58070 -51801 6290 41519 48528 44806
7028 44806 22234 13678 10421 -1524 -12716 -33905 -43930 -66305 -39845 -35950 -29806 -14351 11633
7015 11633 14899 7194 9437 6797 18564 22464 23356 31060 3428 -27599 -57115 -53605 -17004 -554
7001 -554 -1537 -22895 -11121 -33586 -43278 -31920 -30914 -18605 -2184 -21420 -35025 -59139 -71462
6988 -71462 -68186 -45298 -42383 -35463 -15397 2763 -7722 -23405 -19679 -9917 -6884 3142 -991
6975 -991 -14374 -7306 -23583 -18545 -13557 -8035 7630 8425 17398 6285 -13051 -26125 -44640 -24840
6961 -24840 20141 20788 -14941 -21206 13915 30674 19726 22039 -1850 -12423 -14303 2674 -6281
6948 -6281 -20884 -23952 -21652 -31359 -30495 -41480 -44894 -36183 -12493 -22137 -27743 -17336 -961 10799
6934 10799 22631 16446 3817 -2903 -33287 -36699 -27789 -12653 -28592 -16712 -5054 -31892 -29289
6921 -29289 -22759 -20125 -30094 -45486 -13034 7680 -12525 15509 35177 19971 2323 -16395
6909 -16395 -35198 -58658 -38387 -29017 -21491 -11525 -24839 -22737 -13084 -20960 -15485 -25981 -37227
6896 -37227 -41374 -20611 -21650 -31937 -12003 14769 11062 1486 -1386 -27238 -31729 -33197 -48610
6883 -48610 -68815 -61963 -58602 -75718 -70671 -98607 -117954 -100339 -96003 -78054 -53511 -45875 -11937
6870 -11937 24253 36068 26023 13488 -21054 -43557 -24513 -21968 -42092 -27246 -27439 -26093 -25799
6857 -25799 -42802 -51539 -48480 -45454 -47521 -38939 -33647 -27060 -38738 -34112 -17908 -13888 -16380 -22938
6843 -22938 15862 20280 -287 -16820 -34497 -25870 -17009 -15552 -15559 -24228 -43668 -61149 -49031 -35943
6829 -35943 -27123 -68006 -69651 -50766 -41033 -15767 -9810 5748 4310 -8457 -3293 -1229 -673 35217
6815 35217 56514 33341 18162 -23106 -19992 -6695 13749 14796 7315 1382 -22864 -49236 -57704
6802 -57704 -61834 -18577 -13520 3533 23696 16052 15917 -2107 4771 33431 34080 24216 24313 283
6788 283 -31432 -41648 -56267 -49028 -272 -859 -7300 -19939 -27011 14539 6375 -10141 -43579
6775 -43579 -38349 -31307 -5833 11779 5949 -7705 -25639 -3142 4033 -18669 -41245 -12280 9183
6762 9183 31467 -4337 -24581 -50364 -47621 14439 31394 43810 24594 -9912 -915 -17726
6750 -17726 -30007 -25725 -4289 -17384 -25887 -36531 -60545 -53623 -38511 -19834 -13616 -14316 276
6737 276 19465 40088 42905 16219 -6910 -5030 6148 -10234 -14340 -24136 -10665 18461 33569
6724 33569 29353 33194 59685 37196 29960 -6388 -20073 -11210 -13021 334 -4856 4683 -19559
6711 -19559 -32831 -23718 -14662 3356 -18311 -39652 -6724 23359 2966 -25552 -46396 -8787
6699 -8787 -1256 -19942 -11061 -10477 -28707 -3877 6312 3272 -6625 -12421 -391 24557 18820 572
6685 572 -30014 -41872 -14987 -8671 -6500 -27198 -61149 -66282 -65237 -50689 -33548 -18794 -9948
6672 -9948 -3621 -3383 -28794 -48578 -32324 -32266 -49789 -54012 -58274 -34165 -39157 -44010 -26582 -29000
6658 -29000 -3358 2282 23787 46215 14604 7451 29168 29674 1357 -13577 -2358 -1891 -35977
6645 -35977 -41349 -41514 -18550 6561 4863 12652 5883 663 -1267 1516 1212 -10789 -11409 3631
6631 3631 18520 37521 26543 23671 10706 -1576 -5203 6863 17409 24612 15768 -3649 -20780
6618 -20780 -39075 -44192 -21630 -5475 -16990 -27515 -41788 -37705 -40359 -48295 -47668 -40190 -14626
6605 -14626 -4263 12200 23699 7819 -24619 4047 1440 -20118 -27562 -3179 -12719 -29653
6593 -29653 -49251 -81534 -59876 -33882 -30388 -12325 -16769 -26269 2820 7637 11980 19862 28288
6580 28288 17931 -5262 -6134 -19269 -45204 -48184 -32006 -8651 97 -38706 -44894 -11070 22788
6567 22788 17504 18976 15752 23002 14035 821 -1745 -10236 -28100 -7331 16416 24460 6261
6554 6261 12362 12985 9450 -10497 -3228 40403 39397 32868 -4292 -247 12070 -5408 -9384 859
6540 859 -10324 -22071 -17743 -15108 -29968 8681 57495 12924 -5222 19319 18809 8232 21447
6527 21447 52597 59375 54091 34136 5242 -12334 -23157 -10320 20254 22026 24292 14870 -17627
6514 -17627 -52460 -74097 -61841 -61243 -49320 -15843 -358 -20755 -13637 4457 20562 32980
6502 32980 30647 44245 68629 38321 2815 18236 21114 12500 24920 22973 2100 -4090 -5010
6489 -5010 14930 14542 -3389 -2192 17770 14666 -29360 -37650 -51964 -29452 -4931 -20095 -34411
6476 -34411 -48959 -31463 2122 20428 9236 8734 -766 -9487 -14682 -26164 -18507 1046 -5350
6463 -5350 -30649 -33890 -28996 -19242 -10409 -12959 -16557 -25841 -36642 -18761 3811 2839 -48510 -50248
6449 -50248 5108 7825 1414 -26552 -42219 -42937 -20083 -11823 -28408 1269 -7799 -34741 -40250
6436 -40250 -37421 -56923 -41785 -31652 -15492 -10598 -1671 -4718 -19812 -19389 -8702 -15961 -6861
6423 -6861 956 -8299 -19481 -26429 -13269 -1286 -9344 -31964 -11251 -27921 -30021 -24863 -1439
6410 -1439 -8799 -44311 -51439 -27797 -9638 -20104 -13785 9237 -5328 -26949 -17575 -23014 -1897
6397 -1897 18211 14548 -1214 -32210 -38837 -29077 -41422 -67473 -37384 -25381 -49762 -47110 -47372
6384 -47372 -78156 -58539 -41108 -23878 -23726 -10480 13355 16246 6457 5341 12158 43733 51110
6371 51110 51140 21183 -6186 10328 31819 16634 -7055 -1500 3867 -9282 -21535 -5588 12097
6358 12097 36 5331 -959 -10788 -16568 -5332 -7136 -35381 -22836 16104 21105 30742 9353
6345 9353 25481 17368 -19291 -15116 29903 56889 57674 50457 38587 23060 -1819 6162 -9062
6332 -9062 -19639 3742 26519 6988 -2940 -10986 -7847 -15643 -25144 -2324 8038 -17415 -27186
6319 -27186 -27502 -20969 -30147 -13865 -16313 27532 56328 38641 9636 -9014 -40472 -33766 -24897
6306 -24897 -30075 -36900 -27211 -26625 -35052 -41919 -52023 -45530 -72489 -77240 -30154 -6287 -21504 -47189
6292 -47189 -46573 -58399 -53857 -64819 -67922 -40385 -28025 -672 25581 41408 40788 3554 -3053
6279 -3053 10391 9911 -24276 -73882 -57124 -28449 -39076 -17235 -9728 -17025 -38715 -30716 -8235
6266 -8235 -32013 -5029 4157 8643 18205 10474 5915 17904 34689 18547 -26673 -54046 -21582
6253 -21582 -789 -13237 -20734 -10096 1819 -10167 -17957 4151 -18436 -24657 1354 17313
6241 17313 -13679 -17880 -5845 -896 -10260 -21754 -19914 -15416 11873 15520 -18362 -7584 7565
6228 7565 88 -20560 -23375 -39086 -62471 -46504 -5242 -6247 -23969 -31011 -35669 -36480 -59206
6215 -59206 -59662 -29695 16807 39511 39270 34979 2706 -29498 -36367 -52428 -45356 -45547 -31739 -3024
6201 -3024 11049 5499 -10702 -15021 -12343 -11926 3750 -7278 -6061 13227 -11411 -12224 -20380 -21682
6187 -21682 -35784 -24446 -4207 34805 46679 38044 30354 21291 17828 -7681 -21048 -13771 13383
6174 13383 5304 -6801 13792 32777 29393 54293 25059 13361 -22975 -10785 76 -12872
6162 -12872 -30041 -25999 -20292 -24133 -19500 -4982 -10900 -15174 -2273 -1240 -26555 -16250 -8685
6149 -8685 12125 29665 9617 20209 24687 -16514 -53120 -52440 -15221 14951 14467 -6546 -19249
6136 -19249 9608 -22553 -48287 -33803 -54204 -87982 -76340 -69047 -37714 -19066 -42476 -56222
6124 -56222 -46073 -21928 364 2917 6869 -17951 -5848 19311 38585 -6225 -30212 -27033
6112 -27033 -50394 -60331 -66430 -44187 -45884 -57878 -49128 -25074 -5758 -1198 10866 5405 -2490
6099 -2490 -26945 -42548 -40338 -20805 -23049 -22682 -27890 -16631 -6494 -15624 -52251 -68685 -60949
6086 -60949 -65984 -81231 -95382 -67086 -54907 -51818 -32279 -9961 -21834 -18281 -13512 1652 -9865
6073 -9865 -29393 -9408 14587 21908 7197 -1095 -18374 -29282 -28824 -29080 -19425 -13216 -11887 -18204
6059 -18204 -42514 -29731 -29725 -18927 -1615 44833 49337 24899 19686 5626 -19886 -25922 -34435
6046 -34435 -11571 -12112 -9509 6841 28486 24002 35716 10127 12962 13403 -11213 -23719 -13133
6033 -13133 8336 22811 22020 -6569 -25694 -38403 -44461 -11172 -15819 -16219 -9369 -20373 -26052
6020 -26052 -11750 471 12620 8300 301 3996 28226 22121 5999 -11835 -32189 -28380 -33998
6007 -33998 -36683 -13826 -7120 5674 19621 -30260 -51056 -20911 -12623 -42428 -26989 -11217
5995 -11217 -19450 -18140 -18319 -12530 -19211 -28232 -43017 -66157 -40927 -20619 -34667 -47443 -46441
5982 -46441 -16010 3956 -19146 -33930 -55513 -49375 -21190 -8999 12234 10099 -16842 -36631
5970 -36631 -43831 -34749 -1095 5917 -832 14703 853 17284 22240 9051 3380 4750 -1786
5957 -1786 -6966 -48890 -39060 -9041 -5308 -15478 10121 49824 41759 -1442 -38828 -63956 -51580
5944 -51580 -35950 -4424 -3643 -746 -4987 2181 32183 23690 6759 -38962 -60924 -43962 -15142
5931 -15142 -4024 -11317 -17951 -22485 -44464 -60892 -77097 -74339 -77411 -79474 -67432 -47999 -68354
5918 -68354 -56223 -44732 -41735 -41667 -46522 -55816 -84816 -43356 -28004 -40501 -14392 2141 -11761
5905 -11761 250 45420 29165 6176 -27279 -35702 -22467 -16830 -13021 -375 10523 29541
5893 29541 30571 30301 11677 -35490 -51236 -35339 -22846 -26380 -26628 -9554 -28811 -39950 -22178
5880 -22178 -19706 -818 11547 18256 23119 7140 -10951 -18593 -6492 10672 -25861 -45272 -48150
5867 -48150 -32723 -2497 -10113 -13632 -20284 -25812 -4682 -4095 -1478 5662 -16127 -21982 -26477 -12600
5853 -12600 3140 -435 -13181 -39054 -47707 -42188 -3344 14269 7513 -35569 -28157 -1231 -6301
5840 -6301 -30278 -29894 -53838 -42750 -46639 -53785 -32178 -1373 9453 -9850 -12074 -10589 -12370
5827 -12370 -28489 -32489 -38908 -17633 -5281 -16209 -59712 -79905 -57739 -57955 -45307 -47695 -41507
5814 -41507 -23762 -27857 -42344 -27147 -19885 -32684 -12282 -22640 -29646 -40487 -12960 -9908 -31106
5801 -31106 -36233 -36253 -24929 -38475 -39660 -57966 -39524 11044 41139 19696 10325 7004 17501
5788 17501 -7221 13754 18553 14010 2774 4029 13388 13020 -4973 -32451 -46526 -50418 -47221
5775 -47221 -31688 -4972 -5529 -20946 -21162 -20067 -1219 9475 2194 -9438 -3135 8419 -8677
5762 -8677 3951 -17330 -48493 -38426 -40064 -39943 -67173 -77881 -43869 -6560 -6008 -7115 -38469
5749 -38469 -62654 -48614 -12795 -5655 -6229 4273 -127 13832 -5639 -16157 -9892 -17798 -17880 -18323
5735 -18323 -26372 -15036 -32708 -36305 -54193 -40200 -15225 -7821 -15418 -5516 7398 8311 -14797
5722 -14797 -26567 -26164 -42902 -59003 -60628 -57571 -80568 -53410 -61357 -65966 -19529 23308 21155
5709 21155 -432 -24555 -3994 -2537 -13846 -34901 -37606 -25510 -23024 -8715 -3885 -46992 -50083
5696 -50083 -20249 -21120 -18166 1334 9952 -1550 -3464 -4903 -10500 -17549 -15796 -6612 10350 3829
5682 3829 -19868 -33961 -25048 -15899 3005 -2520 -33030 -26757 -6409 26580 33524 26847 31174
5669 31174 25087 24471 -5316 -18082 -12418 9250 -13859 -40441 -17478 27438 3139 -40752 -40044
5656 -40044 -25382 21770 36631 16911 -2552 -25412 -34493 -38232 -41134 -43218 -8303 -3463 -1361
5643 -1361 24480 20240 3351 -4460 -5599 -17335 -25561 -37812 -35544 -25507 -14505 8997 21630
5630 21630 22822 31999 39005 53476 70017 40086 11261 21435 24939 25168 45978 46701 39167 46934
5616 46934 23417 44369 54430 49924 39378 28529 10587 30948 41188 54913 47681 11451
5604 11451 -43707 -15801 -12977 -31679 -25451 -41718 -50871 -26765 9819 6835 -7257 -3990 18147
5591 18147 11004 8199 9465 -17855 -37515 -35161 -13561 7396 19823 26381 46057 28117 20219
5578 20219 20885 12975 23306 2351 -30962 -57461 -50908 -35945 -45970 -23504 -2812 -22526 -9099
5565 -9099 25818 22350 19284 2443 9355 31712 40324 12308 -13586 15825 26159 21580 -18846
5552 -18846 -51316 -39371 -27145 6791 17594 4860 2537 4443 4008 -7836 -25410 -24452 -30622
5539 -30622 -52443 -34944 -18183 -18414 -41516 -61517 -86459 -64441 -41806 -49743 -54480 -34431 -23352
5526 -23352 -29209 -44827 -24810 13436 31763 8087 -6074 -21063 -11184 -2277 -6224 4478 21110
5513 21110 41680 42179 18835 4387 -355 1052 4907 2094 -4786 2288 534 5912 2463 -38008
5499 -38008 -60807 -55319 -46820 -61742 -51139 -20068 -34423 -27208 -35110 -21926 -23583 -16915 -28596
5486 -28596 -48045 -22757 -23068 -55561 -75827 -54488 -35134 -45172 -47009 -63048 -64192 -44812 -37506
5473 -37506 -24729 -4465 -7317 -9829 -32376 -39693 8534 27346 24154 15084 -1356 -14683 -260
5460 -260 20410 44425 32527 10920 -4224 -36263 -23042 -386 -6996 -2875 -2437 -3541 17570
5447 17570 21584 -6252 -16610 -62475 -54875 -55382 -30885 -21990 4964 12580 6147 6028 -9797 -42869
5433 -42869 -57347 -42878 -33755 10567 34791 5079 -17698 -27346 -4220 15143 5694 10221 9116
5420 9116 -7705 -8271 9537 40930 48060 14611 -19503 -14356 -8846 -5517 -22676 -36598 -33262
5407 -33262 -19979 -31090 -31825 -27872 -43708 -48841 -48226 -30480 -19942 -19733 -24472 -33600 2088 28201
5393 28201 14979 8131 29476 35785 19276 -8287 1234 26348 13811 -7435 -23899 -18696 -2436
5380 -2436 -10647 -18298 -2546 9995 -15036 -28087 -32947 -45749 -31943 -31462 -20419 -11750 -11586 2496
5366 2496 -7134 -16089 -7105 -2573 -32014 -19825 -3243 15295 2546 -15291 -11073 7652 -12041
5353 -12041 -43441 -60161 -46660 -34912 -7830 -4490 -29366 -17268 -17400 -30025 -33778 -8054 -9371
5340 -9371 -17878 14496 23481 17269 17770 18388 30351 36268 17155 -19536 -19340 -16996 -34379 -47573
5326 -47573 -45365 -28476 -28877 -11795 -38471 -40502 -4455 -7388 -20651 -21725 -8754 -3451 14526
5313 14526 42494 32521 17704 22584 17571 -1254 -28761 -28252 -16092 -30218 -39604 -28208 -35925
5300 -35925 -4545 8819 15102 -12167 -19461 -12467 -1158 -15453 -18773 -15873 -17545 -4558 -658
5287 -658 -7994 3679 10604 8567 -18013 -22424 -31065 -12097 12005 27986 10028 -25160 -36505
5274 -36505 -23227 -9837 -13989 -15912 7099 18233 26307 13804 13388 27323 18760 8374 10408
5261 10408 -23242 -30546 -47557 -29103 -28063 -11972 12363 14521 -901 -8903 7362 6347 12191
5248 12191 29104 22219 -7518 13042 10956 6349 23644 4596 -30751 -47861 -36998 -19697
5236 -19697 -22773 -27712 -19874 -12499 8766 9823 8526 13640 12126 -9858 -18678 -18172 -26126 -40456
5222 -40456 -28556 -15927 9234 10485 -6345 -12639 -23676 2283 24810 9004 12540 15400 25936
5209 25936 29504 -13353 -31855 -47382 -66591 -60295 -42446 -54246 -45043 -52107 -38801 -49359 -63395
5196 -63395 -34837 12870 19990 23601 40842 62789 25541 -2136 -14828 -1941 16566 1931
5184 1931 -1972 -10762 23975 51069 14189 -35573 -54951 -90559 -84273 -83645 -90817 -72824 -54245
5171 -54245 -24626 3246 20519 18555 12925 46697 55417 56464 28075 -1522 14071 6036 -1437
5158 -1437 1615 -32762 -74199 -74436 -35386 2000 21171 36573 16001 -9754 -56868 -65129 -64147
5145 -64147 -51989 -7800 16022 38290 38627 18909 3531 20734 16313 11209 6409 -5267 3949
5132 3949 23922 10516 1007 -25755 -58651 -45714 -21500 4801 35660 31996 24196 20802 12021
5119 12021 -465 12921 19787 21522 10866 -10579 -21985 -28343 -32725 -43898 -40871 -8071 5428
5106 5428 20349 33028 41416 14736 9884 18374 -4076 -25775 -24182 -2420 -16071 -28908 8085
5093 8085 -10056 -23889 -22492 -10756 465 227 4592 21627 -1853 19757 35068 27542 21523
5080 21523 2188 -39130 -66579 -32846 -20973 -29111 -31157 -7225 22480 -11284 -23920 -22711
5068 -22711 -16512 -10834 -7130 9354 13236 3788 -2371 11588 -389 -15098 -16257 -17086 3549 20773
5054 20773 7656 177 -13917 -8433 -2312 -95 -6374 -19509 17639 65238 65897 41489 25781
5041 25781 2823 368 -25214 -32579 -19447 -1906 10800 12021 35137 52288 29322 30558 17087
5028 17087 5705 -4117 -7617 -22116 -11801 -9216 -22035 3497 20887 30150 3621 -13766 -16896
5015 -16896 -19481 2430 9582 -14752 -21924 5109 17818 1426 -12393 -11952 -15643 -12609 10599
5002 10599 32263 46959 34191 39471 22723 10593 -5075 -35524 -36533 -19445 -16180 -2817
4990 -2817 -14470 -728 31248 53536 39209 22495 10464 18780 13670 -23232 -45567 -70967
4978 -70967 -51934 -50909 -61632 -40678 -17100 -21906 -25218 -23294 -8445 -9808 -23268 -30658 -40343
4965 -40343 -26221 4952 -13287 -34885 -23187 -5706 8918 1750 -807 9624 10760 -34800
4953 -34800 -39138 -34641 -38921 -31898 -26874 -50490 -33996 -16454 -44580 -50713 -22080 22587 60745
4940 60745 49023 44913 45048 35744 34219 26587 768 -22818 -598 26995 13296 21390 18460
4927 18460 21959 23217 5994 -1970 7808 -3551 -3385 9421 -17008 -9508 198 -20411 -40549
4914 -40549 -29736 10500 26093 7820 5287 -15846 -5553 8615 -5787 7080 2501 5735
4902 5735 -17054 -13983 -1442 10935 12396 16635 3846 11275 24423 4673 -13181 -42192 -66810
4889 -66810 -46024 -43074 -28259 -28053 -56011 -60555 -62185 -68719 -64533 -58736 -33707 -15518 -4993
4876 -4993 13259 19795 39397 59210 53719 42621 42183 62178 56722 53895 73490 51928 9965
4863 9965 42069 71208 60613 44845 42518 37264 7379 16086 -5607 -6343 -1474 4735 25348
4850 25348 13968 15465 11450 -16213 -16163 9237 45460 22423 23332 11201 23524 38426 35574
4837 35574 22779 40543 20225 -934 17667 57993 53109 37982 1667 -7014 -11462 -13685 -25595
4824 -25595 -59461 -58773 -44963 -47262 -41609 -33665 -12713 2372 13374 24398 20394 -4781 -32451
4811 -32451 -46288 -39036 -35274 -17653 -17800 -13069 26161 27143 14492 27782 16236 7476 5843 1122
4797 1122 -20879 5803 2900 -29779 -39822 -38906 -38277 -40956 -50668 -18695 -17370 -30771 -34859 -41790
4783 -41790 -22202 -6116 15700 1815 1741 -1632 -23402 -14079 2686 17839 -12934 -8267 2279
4770 2279 -13004 -34913 -29625 -28150 -9291 -36674 -24204 -3280 17383 13587 12545 5073 -16017
4757 -16017 -2216 19951 -1067 -22612 -61564 -59640 -40374 -26787 -21467 -38137 -40520 -22389
4745 -22389 -11008 -1334 -4486 11684 31978 47786 48581 36329 29696 35838 29156 26954 321
4732 321 -37244 -18848 -8028 -19034 -17238 -16130 -33868 -60978 -53544 -19235 13079 25282 -4411
4719 -4411 -13194 -39818 -32620 1462 33786 17456 -8625 -27863 -27146 -39735 -30509 -29163 -29174 -10479
4705 -10479 -15970 -10944 -5161 -25199 -2371 -12727 -19744 -10579 -13730 -9947 6657 4931 -14961
4692 -14961 -28486 -50421 -23478 6542 -7812 -27314 -25878 -26574 -20587 -28725 -7971 1947 -45055
4679 -45055 -67958 -52881 -37191 -15774 9721 -8032 -1979 6438 -9950 -17494 -18452 -48889 -66201
4666 -66201 -57056 -29144 377 7902 19697 22178 26541 32894 -9169 -19846 8621 1637 20755
4653 20755 46011 49036 36727 10334 -10390 2009 31042 46244 25316 -934 -20197 -7460
4641 -7460 17632 30234 22618 10631 -10667 -3487 24217 26219 51143 61339 31343 26233 35238
4628 35238 74321 69286 13535 17008 31724 6756 -23350 -31026 -12738 2192 -21423 -32486
4616 -32486 -24195 -835 -12063 -32094 -54071 634 33034 44472 48182 55583 33536 35768 23552
4603 23552 40087 36907 11783 -8084 -30958 -17844 9331 -1606 3010 -6547 2694 15080 9647
4590 9647 48438 50887 17889 15968 12165 653 -22054 -26709 -29940 -8929 -5144 -8575 -20664
4577 -20664 -16681 -11332 946 -19422 -14719 6155 -17170 -25338 -28995 -28053 -4688 -9275 3245
4564 3245 21941 32678 42389 -1763 -40319 -48138 -37754 -22679 7867 15184 1359 -8256 4022
4551 4022 9030 11906 27082 -923 12156 12445 -14038 -27969 -7498 1949 -14977 -24641 -12341
4538 -12341 -23374 -25941 -1609 -6033 -34154 -25545 -14005 -4332 -11361 -21186 -23372 -41002 -58412
4525 -58412 -27270 -21674 -18280 -20022 -35607 -8522 574 5413 12236 41037 17479 -9393 -26053
4512 -26053 -21819 -11998 -14916 -2281 28843 16733 6625 -15213 -33303 -16136 -36985 -58040
4500 -58040 -18330 -23691 -47044 -62161 -22171 3152 -9354 -17664 -29659 -15776 -11017 -9103 7020
4487 7020 14600 16968 -6931 -12036 -4537 1970 8857 2000 -437 19691 33266 19535 3733 -15345
4473 -15345 -37837 -27934 -11798 -3083 4739 -22110 -31932 -27452 -26697 -39080 -45796 -17585 10629
4460 10629 2445 -21324 -21951 -12280 -26799 -22520 -7797 -16532 -19431 -23673 -24620 -25532 -9224 14980
4446 14980 38245 38191 12541 -28106 -14742 -21620 -29938 -28688 -35393 -43700 -36058 -20022 -3876 2400
4432 2400 10233 15470 16613 10262 -11546 -12466 -3920 1428 13535 10829 20676 31364 4472 984
4418 984 5345 11522 33751 26802 -1113 -3189 -3215 3132 10692 3887 -5934 -15979 -18144 -22154 -2697
4403 -2697 27360 10886 2598 -12573 -27094 -59755 -67972 -65834 -18242 -15597 -28778 -19563 -1249
4390 -1249 10950 12429 43507 23627 -21021 -60998 -67895 -42761 -27105 -14582 -5989 -5835 -10036
4377 -10036 15479 4220 -7512 -8043 -13829 -20025 -38830 -53459 -36987 -35118 -41767 -25641 -22855
4364 -22855 -14072 -25832 -35863 -32487 -30011 -36006 -25178 -3122 11602 35710 27073 9610 -12587
4351 -12587 -9260 7724 13650 -6536 -21900 -19314 -6481 9927 35259 30036 -14635 -35228 -16883
4338 -16883 -13357 -8227 33951 34144 -10016 -18275 6639 17082 6954 -23623 -3436 11509 4481
4325 4481 -5783 -31534 -44654 -48547 -15459 -15719 -29838 -7109 6853 -15940 -43155 -62266 -51518
4312 -51518 -54121 -56337 -21319 -39506 -45952 -24367 -12657 -9106 3652 -496 -1285 8924 -3362
4299 -3362 -3309 -8475 -25397 9157 14635 21598 26306 41196 64037 46914 13639 -16439 775
4286 775 29485 46843 38976 23131 445 240 8337 6922 -6300 -9132 -37248 -46730 -28845 27522
4272 27522 58995 37923 2084 -6046 1244 19689 16751 10979 -5212 -30419 -27616 -33874 -41746
4259 -41746 -36520 -10054 -17380 -14553 4460 35164 47058 36344 19018 -8347 -16217 -6758 -31998
4246 -31998 -25624 -10483 -7308 -24021 -36074 -38275 -15283 -16057 -13438 -5151 19458 25960 8270
4233 8270 -19671 -19277 -11192 1621 -19415 -38504 -61508 -42908 -17054 -29574 -30709 -48726 -74271
4220 -74271 -81539 -54537 -53860 -40847 -21796 5134 -5302 -11179 -4765 -4787 -521 13493 9876 26189
4206 26189 35660 32160 23624 -6382 -25868 -36108 -29716 -2841 16942 25969 24749 26356 19955
4193 19955 9546 -2320 -36 -13607 -15671 -23093 -43592 -8456 13215 21706 32409 30256 -6728
4180 -6728 -18950 -32373 -20087 -9889 -12585 -15629 -28574 -35002 -45394 -43461 -34168 -34076 -58599 -41413
4166 -41413 -2571 15208 10626 26122 34087 8059 -3672 -15299 -2388 2593 -1483 -3953 23964
4153 23964 37907 18803 19567 27268 29282 12259 4383 -531 11709 28559 29377 -5835 -45146
4140 -45146 -41528 -47569 -60336 -40335 -46071 -38769 -25151 -5991 5872 -16196 -28114 -3584 21932
4127 21932 6992 7107 -1795 -4527 19301 5361 2585 17225 37350 40769 33859 12984 -151
4114 -151 -7723 16831 35239 20297 -19773 -13051 -1621 -10218 -16122 4880 -14245 9601 35176
4101 35176 14285 1739 -1864 15320 29720 -924 -23807 -18856 -16083 -18273 -30618 -42012 -34344
4088 -34344 -19108 2114 4801 -12443 -20949 -9920 -301 9671 10822 -15763 -10971 9794 26669
4075 26669 31455 36869 31950 33419 41046 4931 -4814 1397 5176 16255 -8722 -14852 -19283 -49561
4061 -49561 -35001 -19577 -26133 8912 45801 58274 32213 1873 -3502 -37595 -42484 -45592 -34713
4048 -34713 -16876 9037 -10789 -58581 -83484 -48238 285 6488 1490 14698 13162 -15586
4036 -15586 -37307 -5685 13677 4710 -23222 -48955 -47682 -32172 -3681 -8869 -22558 -3665
4024 -3665 -35747 -38027 -32767 -5542 -10506 -6339 2201 -17907 -28374 -27972 -23437 -14930 -12973 -8634
4010 -8634 -7929 31296 20550 30501 44730 20428 4604 -3112 -7424 202 5276 5261 -28978 -35094
3996 -35094 -49748 -66048 -76765 -62407 -35584 -6197 -13125 -16326 -13948 -30482 -54513 -36974
3984 -36974 -6698 -33127 -30868 -7303 -2297 -5210 -21511 -51671 -68425 -43197 -17569 -6094
3972 -6094 -10527 -13615 -9183 -5595 -1577 -19369 -14351 -13898 -23168 -34937 -19211 13386 22049 39678
3958 39678 36480 21032 35382 59922 46022 40957 17559 -19109 -30220 -31288 -23274 -4943 5987
3945 5987 -15580 -38896 -32877 -36681 -56492 -69451 -52470 -31983 -27422 -6844 6022 6454 6973
3932 6973 23868 15697 -1529 -11687 -35490 -35600 -35872 -34935 -40977 -31316 -14833 -33506 -33768 -25066
3918 -25066 -20305 -53079 -34010 -22303 15673 34069 907 -10669 -18378 -48022 -37032 -47986
3906 -47986 -49927 -22742 -1293 -4323 -17942 -27855 -11201 -11667 -15911 -17432 -7347 11991 8718
3893 8718 3689 29049 31395 42209 28031 -20223 -46084 -32816 -34821 -24941 -40517 -4922 14358
3880 14358 -14190 -25197 -38978 -19658 16987 23938 41059 36901 34689 19666 11053 20974 19669
3867 19669 -1681 -43750 -33082 -4959 12865 6815 -32676 -47230 -34923 -13818 -3087 -8305
3855 -8305 9298 21228 15692 3631 -20088 -28336 -39980 -17513 -6763 10561 3687 -20597 -50499
3842 -50499 -47858 -22016 9079 48625 48144 45411 21746 2773 -14966 -13784 -23323 -24429 -33729
3829 -33729 -30766 -21900 -15738 -7642 -31346 -25513 -18027 -6025 -16412 -18214 13062 41120 40862 11379
3815 11379 1204 -11232 -15330 -3563 901 28244 5377 -21883 -24103 -11444 -5999 -15116 -21577
3802 -21577 -25735 -21618 -21524 -23192 -4462 -9053 -7434 -7976 5300 -11360 -4222 30015 46384 22038
3788 22038 24894 26648 25210 426 4059 42357 31858 37861 22647 4852 -4239 -12156 22102
3775 22102 45068 35310 10926 -7116 -19590 -12427 -24647 -11174 -3159 -9333 -7866 -22962 11373
3762 11373 28086 12349 -676 -12075 -12658 -12331 2331 3091 -18271 -26114 -9451 6166 -4767
3749 -4767 22389 -5673 -21300 -5723 -4203 -527 -10987 -53853 -72370 -59059 -21517 -31494 -45810
3736 -45810 -64591 -39440 -22460 -16933 3219 -7322 -1120 9828 -13506 -18413 -18730 -37602 -38611
3723 -38611 -53384 -42111 -30553 -9785 6450 -21554 -32531 -16149 -26836 -15509 7158 -2407
3711 -2407 -32232 -22750 -10389 -3341 -7916 13103 21300 18654 2600 -7014 1325 -22450 -32166 -29660
3697 -29660 883 10829 -6898 15209 27128 2394 -16808 -30039 -34611 -48652 -51559 -47171 -37378
3684 -37378 -26953 10989 45635 29888 20859 -9726 -32631 -25961 -1591 6477 -18846 242
3672 242 6575 -2138 -15444 -20486 -1816 8005 23991 16022 24269 25886 21547 7395 -26562 -37060
3658 -37060 -35002 -38440 -30918 -50762 -63246 -28304 8712 47174 37377 16843 15310 -12977 -6351
3645 -6351 -7880 18303 18948 -23597 -34028 -38706 -41405 -11577 -12880 -15516 -6136 4994 27538 44694
3631 44694 37724 4306 -14038 -8960 -16827 -23644 -19347 -8956 4163 29658 49691 22727 -5379
3618 -5379 14405 5850 -26088 -21566 -5936 29921 65518 45994 23279 18194 -9671 -16674 8626
3605 8626 26350 20718 -13635 -17798 -33862 -29610 -51570 -75263 -73940 -16175 -5157 -25024 -56416
3592 -56416 -54192 -42023 -39228 -26388 6471 15118 -4095 -5786 1710 8340 -22981 -45627 -28512
3579 -28512 7898 -6382 -19321 831 15533 15638 -4350 -27443 -20902 -21852 -27937 -23043 653
3566 653 8898 -6768 -17344 -9868 13993 31754 27040 29270 53134 45614 14367 -17791 -23569
3553 -23569 -15453 -1038 10772 -19980 -24290 14392 21196 17309 8928 -4458 -6912 -9676 8762
3540 8762 -1002 -1017 -1949 -5397 -13562 4040 12484 -11404 -11385 -28901 -16539 -4815 5874 21262
3526 21262 14079 377 -7372 -21443 -30878 -38279 -27819 -2360 22021 57424 48554 11157 14152
3513 14152 12508 -40 -382 -33707 -48960 -31563 -19131 -16225 12602 22105 6428 5496 -5008
3500 -5008 -19579 13688 33979 39037 34648 31751 38230 42248 26108 11819 33869 20626 18748
3487 18748 11773 -9547 -36727 -18780 -10470 -31492 -21447 -13911 -21944 -7503 33725 19773 1140
3474 1140 16334 27734 9458 13265 12069 -7544 -17676 46 -6099 -27153 -38135 -26852 -29407
3461 -29407 -31095 -22508 -14704 -42556 -36928 9359 4166 -4268 25919 8888 -15810 -30504 -39857
3448 -39857 -38185 -38100 -15532 -15582 13431 6269 -21835 -14036 -18180 -10238 8739 -1700 -19354 -18464
3434 -18464 -14872 -20798 2605 -681 -24253 -56717 -38763 -2431 3525 7899 -13756 -22384 5021
3421 5021 11865 4174 -21066 -43288 -60753 -25220 -729 -5111 -21550 -35102 -39742 -58802 -73029
3408 -73029 -74124 -48105 -33213 -40042 -25732 -15103 9456 32743 23812 117 22525 39185
3396 39185 20357 16386 -16927 -28861 -20140 -7961 -16186 -8818 -2043 -642 23605 5093 3442
3383 3442 2296 5423 9029 -488 -18327 -28998 -22878 -2767 5998 1932 2469 30452 27264 17384
3369 17384 1200 -25316 -22779 13416 10782 -7401 -122 -2077 -417 -27566 -13703 25481 36392
3356 36392 36782 26033 42874 28430 16476 -5557 -8133 15637 19165 15226 -44365 -68364 -38704
3343 -38704 1985 16505 -7739 -25337 -11040 -2551 -326 -12116 -5301 1902 13401 -10781 -12568
3330 -12568 -20466 -52575 -36207 -11441 9780 -5222 -14482 863 -1946 5446 24247 36176 62747
3317 62747 54530 39112 45280 32359 21707 35478 33487 25501 30563 25461 16310 12729 39173
3304 39173 31250 -9940 -28237 -778 -5533 -7673 2515 -2731 3475 17181 15054 22726 44858
3291 44858 39123 -2116 -8798 14210 734 7684 10865 28858 24483 22932 21768 -8854 -13310
3278 -13310 2382 -4298 -12185 -15206 -21573 -28281 -32085 -19748 -19471 160 -738 -28109 -6392 21771
3264 21771 5737 -20718 3384 20182 27279 20709 6104 11730 32484 51243 37368 13709
3252 13709 -3883 -11813 -25920 -25753 -1701 -4428 -16514 -22180 -62654 -61047 -28214 -16283 -10494
3239 -10494 -5509 430 -3090 10597 4981 -9188 -5532 -37881 -30058 -8834 -31980 -38218 -7993
3226 -7993 -4077 3194 -7936 -14125 -27064 -5695 50482 40917 38847 15315 5658 7957 -26271
3213 -26271 -11369 11585 21249 1383 -13262 -17268 -20896 -11490 12561 23514 17208 3872 3306
3200 3306 17312 30068 27994 41056 58517 30441 12166 12046 48697 31646 17089 21508 25740
3187 25740 -3239 -55991 -61716 -56904 -38564 -14670 -10695 -38550 -76809 -64065 -2531 3242 -12634
3174 -12634 56 -20764 -42501 -20842 15909 24990 19851 15818 16995 37621 46251 44699 34360
3161 34360 27969 18377 8219 5279 -12257 -14084 -12763 -47500 -67320 -39091 14314 40540 50903
3148 50903 69788 50155 3912 -3352 30793 39537 32021 3570 6886 4619 24887 22279 -10134
3135 -10134 2269 19678 -1140 2886 -29633 -35209 -4261 15661 5960 -10796 1669 1183 -1422
3122 -1422 7530 24003 4951 2030 -34897 -43529 -19493 26479 29580 25366 14296 -10335 -9047
3109 -9047 -23338 3169 46401 31572 -4778 -25001 -15037 -8271 6394 16194 21438 20503 1224
3096 1224 7462 -10838 -19761 -11847 -2676 5358 23329 2648 -9657 -11750 233 7574 2763 14807
3082 14807 5573 -4252 363 -24661 -18663 -9524 -12157 -10573 -11777 25648 54052 45142 11442 -21857
3068 -21857 -40051 -36119 -36672 -12076 -2394 -21666 -38349 -4901 16933 11814 18709 -2123 -7262
3055 -7262 16935 43752 21091 5774 17972 19277 -5320 1237 1972 -5206 6632 -3174 -10457
3042 -10457 200 13696 -9606 -21898 -16899 15388 23667 11267 28716 24077 349 12278
3030 12278 26021 -13339 -37062 -32866 -14449 -25412 -36247 -44395 -70155 -63184 -55573 -62021 -56963
3017 -56963 -56865 -55113 -22244 -3086 12244 -7314 -12110 -20956 -5113 -14392 -7106 42583 25298
3004 25298 569 -18660 -15770 -50264 -74054 -63534 -76981 -71450 -48561 -29344 -12473 -15396
2992 -15396 -38817 -51308 -70773 -36715 -22032 -13867 -3509 -5083 -28556 -20021 -13916 -9531 -9436
2979 -9436 -4991 3589 1990 -26377 -58467 -43993 -34921 -36161 -11745 -9035 20959 43095 16233
2966 16233 -18190 -13428 -7498 -15330 -2110 44036 73555 37894 15044 29850 36521 36715 45104
2953 45104 26443 18140 26156 14361 35429 60639 68599 50081 39086 29556 40012 31510 33767
2940 33767 11274 20631 16521 -11950 -20287 14215 -296 -26499 -2391 12275 -484 -28693
2928 -28693 4706 -13925 -38864 -31341 -12119 -26060 -35604 -36515 -14761 -4783 -5943 -25728 -26013
2915 -26013 -24199 -11146 3709 -13200 6386 -3367 21778 24509 20604 39665 17444 4772 -12147
2902 -12147 -44410 -17132 -328 -18068 -40718 -25574 1316 -17716 -47070 -24619 -8804 -10919
2890 -10919 -17785 9222 13248 -30399 -42099 -60335 -71982 -55798 -50776 -38113 -33662 -8602 2061
2877 2061 -4376 8346 27673 36248 75949 78433 38119 22835 10787 6737 -3787 -13125 -23418
2864 -23418 -6411 -22664 -33023 -21789 -2122 -12812 -39889 -20717 8380 46086 27593 30144
2852 30144 20323 -20753 -18354 -15941 -1654 36402 36520 26131 18209 16903 33738 41908 25378
2839 25378 13116 22298 32545 14536 12650 3290 4782 21242 24180 -6607 -37111 -15816 -1017
2826 -1017 -7744 26603 40097 48579 44677 36092 19936 36593 3727 -8964 -14500 -22350 7382
2813 7382 11408 12951 59060 60581 24004 3643 -41694 -54138 -52283 -52774 -45615 -24528 -13204
2800 -13204 16794 21752 23649 56694 40130 25626 -5515 -14557 -23457 8487 3256 -38449 -41306
2787 -41306 -31350 -18942 9951 52401 55552 26908 -1718 -1711 -21501 -27964 -32710 -42398 -42523 -11847
2773 -11847 -12930 -4261 1980 -18337 -15697 -5416 -6974 20961 9295 -11911 -29824 -15150 21814
2760 21814 16229 -2773 9875 14440 20151 35405 1072 -28247 -19935 -26637 4897 23409 -1496
2747 -1496 -8534 724 2256 19149 40202 51116 37912 27182 17432 -1715 -15514 -14728 -30532
2734 -30532 -31427 -11117 5577 -4525 -15054 8738 14574 13298 -577 -18998 -24508 -11125 -5252
2721 -5252 24494 7899 -351 -7949 15517 50926 30870 10639 20597 15746 -15459 -14915 470
2708 470 -33722 -48387 -32844 13612 12801 4255 26575 22213 9405 15243 -5903 -24675 357
2695 357 -3728 -22631 -6233 -5319 19474 41565 13598 -15836 -32165 -38089 -52547 -32274 -39748
2682 -39748 -25004 -13184 3069 -2341 -16842 5372 45665 73363 74934 67137 37704 14459
2670 14459 32513 27859 -5795 12236 41388 35747 29267 39710 39299 24433 3979 -5927 -13457
2657 -13457 -24692 -30312 -23822 -15546 6603 4052 -15263 -28364 -47215 -53310 -12308 12186 16141
2644 16141 -5447 -1250 -13279 7178 44894 91818 89229 63617 39123 24471 23387 -1976
2632 -1976 -1024 26168 15877 8196 4699 29636 51606 32333 11702 28453 53239 14319 -5150
2619 -5150 2558 19582 536 1862 -2465 -26576 -37634 -30699 -14254 -21325 -27085 -22194 -41519
2606 -41519 -68046 -51026 -15541 9213 -94 -35816 -38158 -20020 -26256 -7958 -24120 -16385 -22
2593 -22 -1010 -9220 -24647 -14498 21254 14078 -2145 -211 7613 1614 14211 5304 21407 18189
2579 18189 12716 -9702 -8014 -21477 -35335 -21893 17629 23322 19326 27303 23120 5042 19681
2566 19681 22252 36156 46161 30569 22266 11948 24887 17220 4206 14099 -5796 -29319 -55678
2553 -55678 -80384 -73070 -40784 -20370 -4203 -18646 -37612 -59732 -47687 -9551 33116 46874
2541 46874 41406 4505 7592 16913 -2649 -23011 -21025 -1307 1615 34958 45100 26806 28754
2528 28754 41318 30639 -9357 -29221 -4506 10379 21837 8916 -4378 -26335 -19770 -6268
2516 -6268 11119 29790 50682 40700 -7519 -36857 -58188 -28744 14754 13848 20042 40247 44806
2503 44806 40328 36753 45069 67894 38498 7553 22756 4045 7187 20256 5571 -21409 -30215
2490 -30215 -23792 2977 35646 67593 58692 15916 -10184 5361 23942 -512 4189 12184 13924
2477 13924 16272 21794 3039 16119 2609 -15687 -11678 5296 12574 21279 40156 61860 51558
2464 51558 31673 27142 21788 16695 29795 41272 61998 86543 89480 78155 75213 78598 56523
2451 56523 54394 38216 8143 15122 7312 13048 -7405 -40068 -52336 -44076 -41511 -13054 -12186
2438 -12186 -14286 -32440 -55420 -43512 -19356 -29555 -55394 -48994 -31551 -15400 -7124 15948
2426 15948 22122 16999 37036 44386 25027 13751 38722 31316 36354 13685 -1596 16247 9841
2413 9841 3996 26741 15892 15975 30652 66343 70528 42964 29463 21615 3320 -20234 -25941
2400 -25941 -18717 -2062 10922 18807 -7634 -13217 1899 -16037 -50309 -61601 -37635 -25495
2388 -25495 14514 20486 6829 24590 27365 -7756 -18049 8715 14381 24002 26365 22039 12342
2375 12342 -1822 -29104 -46428 -38284 -18478 -13610 3689 21797 16555 -19170 -11586 19917 56057
2362 56057 69713 52909 42355 32028 35137 20434 37532 46918 27291 15759 14360 9108 33510
2349 33510 53077 65111 70753 58393 20508 25139 58497 32526 5984 -5109 3967 0 -13609
2336 -13609 -43558 -62770 -80784 -57825 -47891 -81136 -88225 -54113 -40539 -19078 -7758 -19324
2324 -19324 -32776 -33344 -24791 -1038 8736 -10339 -39266 -70218 -61535 -20643 9958 -6074 -41570
2311 -41570 -31545 -10130 -6903 -1974 -8625 -15695 -31973 -6077 -4619 15241 34884 41801 56223
2298 56223 65479 54521 46808 45765 34641 43252 30002 680 5943 10591 -7935 -13620 19093
2285 19093 9781 27939 26872 1690 -3111 -11706 -36896 -4229 909 7471 -2306 -29344 -13146
2272 -13146 1400 11952 3022 -4880 -20673 -1200 26061 35394 10198 17131 13847 -19945 -3418
2259 -3418 15199 39508 53363 61653 72780 82274 54855 23204 25793 16623 -878 17394 38623
2246 38623 42621 42744 17143 15549 38567 35974 18099 -1233 -6003 -13335 -26273 -28494 -18711 -8004
2232 -8004 -25816 -39348 -31230 18937 47739 51373 24484 51370 80949 73025 23046 3462 13445
2219 13445 38745 42589 32851 22012 23930 45224 60261 21358 -18452 -43518 -10567 -4332 -24500
2206 -24500 -18272 3377 16966 30401 9610 526 -2403 21259 58222 60718 55874 41316 4927
2193 4927 4864 -5098 -12088 -11668 -7798 -8018 -23503 -36024 -16451 -21862 -38063 -42997 -8572 -1119 13946
2178 13946 44605 31790 15809 6388 -13256 -18640 -16917 -33705 -7828 -20758 -36172 -10421
2166 -10421 -2463 15808 33351 17003 3620 -26650 -31645 -28328 -1063 4456 8599 33532 57347
2153 57347 58863 48068 -1881 -9379 -8250 -14057 -32269 -33864 -29256 -16220 5464 -6746 10496
2140 10496 9552 6026 -2649 -6905 -540 11149 42965 24619 -4565 -191 27634 15276 -15340
2127 -15340 -7002 17917 15223 7972 -12619 -15427 -9697 -35782 -21333 -3541 20242 31373 29424
2114 29424 35549 29139 19747 7295 8186 -22725 -28619 -7744 14754 43798 56353 40684 -1258
2101 -1258 -12501 1846 11015 21428 36694 26054 31246 32034 16805 -12969 -19418 -5468 14358
2088 14358 4719 9839 45476 51625 29109 50001 81782 49164 38030 35487 10159 24497 28987
2075 28987 32332 31915 6646 -12955 1978 -8738 18227 21972 14222 15567 37822 22403 14710
2062 14710 18840 33620 63325 42474 12901 11800 36399 50356 21009 -24902 -21482 13899
2050 13899 25725 17216 14270 15476 10844 1612 -5985 6060 17030 16865 15556 29813 18342 -8641
2036 -8641 -22958 -34198 -24545 -10101 -13723 -28306 -4837 8090 17390 -2181 -2866 21629 -22084
2023 -22084 -28163 -35533 -36797 -4679 -7723 5742 34866 37986 35088 22454 26511 43608 48670
2010 48670 41685 21366 24408 20711 16940 -10970 3454 7845 -18258 -9609 25685 3779 -25123
1997 -25123 -37849 -58850 -46295 -37449 -14026 -6435 -22209 -33731 -22511 -12550 4960 21023
1985 21023 28004 23473 -735 -9658 -2449 -449 -19058 5507 18040 27275 13734 -9546 -33093
1972 -33093 -25218 -20267 -28702 -3051 22487 14089 7524 8383 -2787 2880 9280 -16232 -11408 12011
1958 12011 -5712 7967 21968 3549 -5065 -12825 -9801 24834 44725 45357 12849 24381 18661
1945 18661 14031 17577 35574 21817 4781 3483 8720 10580 26884 30474 15835 19439 -24206
1932 -24206 -36719 -38444 -63795 -33617 11547 12040 12711 23371 16551 33797 45094 26322 27941
1919 27941 14691 24918 48507 62314 61525 28559 21128 17282 17463 16552 6353 9995 14918 19494
1905 19494 31758 16223 2281 -1775 3319 -6664 -26417 -6572 18295 22526 13051 20862 30931
1892 30931 10880 -16274 7599 35524 19172 32860 25634 1665 -27471 -21791 934 8073
1880 8073 6792 27502 31945 22338 16706 -17116 -32561 -18734 -7048 42338 56156 23274 18386
1867 18386 17348 5741 16725 31043 28976 16688 -4252 6435 45771 14013 -6843 -13067
1855 -13067 -15565 6211 -15269 -15315 -2277 2234 5327 -14048 -33119 -35418 -27099 -15751 -23985 -30543
1841 -30543 -22879 -4873 2103 -4810 22696 75886 67236 39796 26328 37903 22275 28099 50387
1828 50387 36330 -7592 -16932 13368 10662 7670 27182 12562 17788 19634 15898 2838 8401
1815 8401 10036 4464 -193 29 -10221 -11833 -9968 -4024 -4396 3412 3268 3737 14208 -3495 673
1800 673 3441 35562 49683 29981 -6466 5508 12849 31299 36630 44513 74906 53916 25756
1787 25756 33200 35078 33544 7022 -19995 -11735 -839 12165 34727 12783 -4203 9003 21933
1774 21933 30291 40520 42202 37306 33841 37525 26929 23652 -807 -12132 -20282 -24234 -19184 15474
1760 15474 1650 -26356 -17982 8871 1618 210 -15396 -29090 -29743 -27315 11891 8675 477
1747 477 9173 38061 37966 18908 14369 -1441 6957 2102 24634 12437 27057 22494 29898 -346
1733 -346 3464 7762 -5199 -2882 -7888 -28962 -70696 -54965 -40693 -20961 810 19738 17170
1720 17170 808 -5364 15999 21417 224 -20711 -1593 26875 187 -8503 -13729 -23075 -43881
$$ [...]
##END NTUPLES=NMR SPECTRUM
##END=
