##TITLE=Analysis number 329448
Compound Code cc 64809
Book Reference 511/196
Project Code adrs
Chemist Name stevem
##JCAMPDX= 6.0         $$ Bruker NMR JCAMP-DX V2.0
##DATA TYPE= NMR SPECTRUM
##DATA CLASS= NTUPLES
##ORIGIN= Bruker BioSpin GmbH
##OWNER= nmr
$$ XWIN-NMR		Version 3.5
$$ Mon Sep  3 14:47:08 2007 GMT Daylight Time (UT+1h)  MAYBRIDGE\nmr@NMR_250MHZ
##.OBSERVE FREQUENCY= 250.131544655141
##.OBSERVE NUCLEUS= ^1H
##.ACQUISITION MODE= SIMULTANEOUS (DQD)
##.ACQUISITION SCHEME= undefined
##.AVERAGES= 16
##.DIGITISER RES= 18
##SPECTROMETER/DATA SYSTEM= dpx250
##.PULSE SEQUENCE= zg30
##.SOLVENT NAME= CDCl3
##.SHIFT REFERENCE= (INTERNAL, CDCl3, 0, 16.522)
##AUDIT TRAIL= $$ (NUMBER, WHEN, WHO, WHERE, WHAT)
$$ ##TITLE= Audit trail, XWIN-NMR		Version 3.5
$$ ##JCAMPDX= 5.01
$$ ##ORIGIN= Bruker BioSpin GmbH
$$ ##OWNER= nmr
$$ C:\u/data/dgb/nmr/ADRS/40/pdata/1/auditp.txt
$$ ##AUDIT TRAIL=  $$ (NUMBER, WHEN, WHO, WHERE, WHAT)
(   1,<2007-09-03 14:45:50.03 +100>,<MAYBRIDGE\nmr>,<NMR_250MHZ>,
      <created by zg, POWCHK disabled, PULCHK disabled
       configuration hash MD5:
       76 6E 9A 78 1E 09 19 81 EC 84 63 8F B0 6A 59 2D
       data hash MD5: 64K
       0C AB EF B0 77 1F 43 1D 7F 36 74 31 E9 1D EC C6>)
(   2,<2007-09-03 14:46:25.28 +100>,<MAYBRIDGE\nmr>,<NMR_250MHZ>,
      <Start of raw data processing
       ef LB = 0.3 FT_mod = 6 PKNL = 1 SI = 32K 
       data hash MD5: 32K
       84 E3 50 73 7C B5 5F 42 25 69 49 A1 79 22 D5 2F>)
(   3,<2007-09-03 14:46:30.71 +100>,<MAYBRIDGE\nmr>,<NMR_250MHZ>,
      <apk 
       data hash MD5: 32K
       41 F3 3C 16 6B 25 72 EA 08 B8 95 7D 42 47 77 47>)
(   4,<2007-09-03 14:46:36.07 +100>,<MAYBRIDGE\nmr>,<NMR_250MHZ>,
      <abs ABSG = 5 
       data hash MD5: 32K
       11 0F 2F D1 E1 37 BC 2A 61 17 68 28 E9 8B 6E 66>)
$$ ##END=
$$ 
$$ hash MD5
$$ 76 23 86 57 6B E4 F7 BD 47 7D 16 83 5E BF D0 90
##$RELAX= 
##$RELAX= 
##$RELAX= 
##$RELAX= 
##$RELAX= 
##$RELAX= 
##$RELAX= 
$$ Bruker specific parameters
$$ --------------------------
##$DU= <C:\u>
##$EXPNO= 40
##$NAME= <ADRS>
##$PROCNO= 1
##$TYPE= <nmr>
##$USER= <dgb>
##$AMP= (0..31)
100 100 100 100 100 100 100 100 100 100 100 100 100 100 100 100 100 100 
100 100 100 100 100 100 100 100 100 100 100 100 100 100 
##$AQSEQ= 0
##$AQ_mod= 3
##$AUNM= <au_zg>
##$AUTOPOS= <30 >
##$BF1= 250.13
##$BF2= 250.13
##$BF3= 250.13
##$BF4= 250.13
##$BF5= 500.13
##$BF6= 500.13
##$BF7= 500.13
##$BF8= 500.13
##$BYTORDA= 1
##$CFDGTYP= 0
##$CFRGTYP= 5
##$CHEMSTR= <none>
##$CNST= (0..31)
1 1 145 1 1 1 1 1 1 1 1 1 1 1 1 1 1 1 1 1 1 1 1 1 1 1 1 1 1 1 1 1 
##$CPDPRG= <>
##$CPDPRG1= <>
##$CPDPRG2= <>
##$CPDPRG3= <>
##$CPDPRG4= <mlev>
##$CPDPRG5= <mlev>
##$CPDPRG6= <mlev>
##$CPDPRG7= <mlev>
##$CPDPRG8= <mlev>
##$CPDPRGB= <>
##$CPDPRGT= <>
##$D= (0..31)
0 1 0 0 0 0 0 0 0 0.06 0 0 0 0 0 0 0.0002 0 0 0 0 0 0 0 0 0 0 0 0 0 0 
0 
##$DATE= 1188827145
##$DBL= (0..7)
120 120 120 120 120 120 120 120 
##$DBP= (0..7)
150 150 150 150 150 150 150 150 
##$DBP07= 0
##$DBPNAM0= <>
##$DBPNAM1= <>
$$ [...]
##$SUBNAM6= <"">
##$SUBNAM7= <"">
##$SUBNAM8= <"">
##$SUBNAM9= <"">
##$SW= 20.6930455092707
##$SWIBOX= (0..15)
0 0 3 0 0 0 0 0 0 0 0 0 0 0 0 0 
##$SW_h= 5175.983436853
##$TD= 65536
##$TD0= 1
##$TE= 297.16
##$TE2= 300
##$TE3= 300
##$TEG= 300
##$TL= (0..7)
0 120 120 120 120 120 120 120 
##$TP= (0..7)
150 150 150 150 150 150 150 150 
##$TP07= 0
##$TPNAME0= <>
##$TPNAME1= <>
##$TPNAME2= <>
##$TPNAME3= <>
##$TPNAME4= <>
##$TPNAME5= <>
##$TPNAME6= <>
##$TPNAME7= <>
##$TPOAL= (0..7)
0.5 0.5 0.5 0.5 0.5 0.5 0.5 0.5 
##$TPOFFS= (0..7)
0 0 0 0 0 0 0 0 
##$TUNHIN= 0
##$TUNHOUT= 0
##$TUNXOUT= 0
##$USERA1= <user>
##$USERA2= <user>
##$USERA3= <user>
##$USERA4= <user>
##$USERA5= <user>
##$V9= 5
##$VALIST= <valist>
##$VCLIST= <CCCCCCCCCCCCCCC>
##$VD= 0
##$VDLIST= <DDDDDDDDDDDDDDD>
##$VPLIST= <PPPPPPPPPPPPPPP>
##$VTLIST= <TTTTTTTTTTTTTTT>
##$WBST= 1024
##$WBSW= 4
##$XGAIN= (0..3)
0 0 0 0 
##$XL= 0
##$YL= 0
##$YMAX_a= 464775
##$YMIN_a= -288451
##$ZGOPTNS= <>
##$ZL1= 120
##$ZL2= 120
##$ZL3= 120
##$ZL4= 120
##$ABSF1= 16.522
##$ABSF2= -4.171173
##$ABSG= 5
##$ABSL= 3
##$ALPHA= 0
##$AQORDER= 0
##$ASSFAC= 0
##$ASSFACI= 0
##$ASSFACX= 0
##$ASSWID= 0
##$AUNMP= <proc_1d>
##$AZFE= 0.1
##$AZFW= 0.1
##$BCFW= 0
##$BC_mod= 0
##$BYTORDP= 0
##$COROFFS= 0
##$CY= 12.5
##$DATMOD= 1
##$DC= 0
##$DFILT= <>
##$DTYPP= 0
##$F1P= 14.0000005364418
##$F2P= -0.99999901652339
##$FCOR= 0.5
##$FTSIZE= 32768
##$FT_mod= 6
##$GAMMA= 0
##$GB= 0
##$INTBC= 1
##$INTSCL= 1
##$ISEN= 128
##$LB= 0.3
##$LEV0= 0
##$LPBIN= 0
##$MAXI= 10000
##$MC2= 0
##$MEAN= 0
##$ME_mod= 0
##$MI= 0
##$NCOEF= 0
##$NC_proc= -3
##$NLEV= 6
##$NOISF1= 0
##$NOISF2= 0
##$NSP= 0
##$NTH_PI= 0
##$NZP= 0
##$OFFSET= 16.522
##$PC= 1
##$PHC0= -42.694
##$PHC1= 5.195442
##$PH_mod= 1
##$PKNL= yes
##$PPARMOD= 0
##$PSCAL= 4
##$PSIGN= 0
##$REVERSE= no
##$SF= 250.13
##$SI= 32768
##$SIGF1= 0
##$SIGF2= 0
##$SINO= 400
##$SIOLD= 32768
##$SREGLST= <1H.CDCl3>
##$SSB= 0
##$STSI= 32768
##$STSR= 0
##$SW_p= 5175.98343685301
##$SYMM= 0
##$S_DEV= 0
##$TDeff= 65536
##$TDoff= 0
##$TI= <Analysis number 999999
Compound Code 99
Book Reference 9
Project Code 9>
##$TILT= no
##$TM1= 0
##$TM2= 0
##$TOPLEV= 0
##$USERP1= <user>
##$USERP2= <user>
##$USERP3= <user>
##$USERP4= <user>
##$USERP5= <user>
##$WDW= 1
##$XDIM= 32768
##$YMAX_p= 295194768
##$YMIN_p= -81056
$$ End of Bruker specific parameters
$$ ---------------------------------
##NTUPLES= NMR SPECTRUM
##VAR_NAME=  FREQUENCY,     SPECTRUM/REAL,   SPECTRUM/IMAG
##SYMBOL=    X,             R,               I
##VAR_TYPE=  INDEPENDENT,   DEPENDENT,       DEPENDENT
##VAR_FORM=  AFFN,          ASDF,            ASDF
##VAR_DIM=   32768,         32768,           32768
##UNITS=     HZ,            ARBITRARY UNITS, ARBITRARY UNITS
##FACTOR=    0.157963299565203, 1,           1
##FIRST=     4132.6476996994, 0,             0
##LAST=      -1043.33573715361, 0,           0
##MIN=       -1043.33573715361, -81056,      0
##MAX=       4132.6476996994, 295194768,     0
$$ Real data points
##PAGE= N=1
##DATA TABLE= (X++(R..R)), XYDATA
$$ [...]
18375C00385k584j2666P887N011j560q310l655R482J1906Q398L1565K8873j1156
$$ 300385 297801 285135 293022 298033 296473 288163 284508 293990 305896 314294 345859 374732 363576
18362C63576J9852K8904p390L512J7890N5907N0902K8185J2965J4236K6783L7204
$$ 363576 383428 412332 404942 408454 426344 482251 533153 561338 574303 588539 615322 652526
18350F52526O0758R2705J05345O9885L5887L3075K832p145J0468N1968O2596P8519
$$ 652526 713284 805989 911334 981219 1017106 1050181 1053013 1045868 1056336 1108304 1170900 1249419
18338A249419J08825J42997J74462J64629K00436L64469N36320Q42571J248095
$$ 1249419 1358244 1501241 1675703 1840332 2040768 2405237 2941557 3784128 5032223
18329E032223J250592L18449p11036q38533m38316k7849K70811N57593R55958
$$ 5032223 6282815 6601264 5890228 5051695 4613379 4585530 4856341 5413934 6369892
18320F369892J562581K590955M338440O566424P242299M307186O58271P0313J3159
$$ 6369892 7932473 10523428 14861868 21428292 28670591 32977777 33636048 33706361 33719520
18311C3719520k717716m359273k705949k162718l693125m041700k662265j154758
$$ 33719520 31001804 26642531 23936582 21773864 18080739 14039039 11376774 10222016
18303A0222016N5455J248887K437849K675913L67332k667709l504498k562142
$$ 10222016 10277471 11526358 13964207 16640120 17007452 14339743 10835245 8273103
18295H273103j539869r00070n11270k90048j27924o914N4832J51635M07305P89889
$$ 8273103 6733234 5833164 5321894 5031846 4903922 4897008 4951840 5103475 5510780 6300669
18285F300669J270503J508216P30591m66175p58634k25762L08410Q06946J443965
$$ 6300669 7571172 9079388 9809979 9343804 8585170 8359408 8667818 9474764 10918729
18276A0918729K415763L744604M824944M116258K099510K183652N809188J0803459
$$ 10918729 13334492 17079096 21904040 26020298 28119808 30303460 36112648 46916107
18268D6916107J2132900P371087N98719l804228m415937k420623J001166K592110
$$ 46916107 59049007 66420094 67018813 63214585 58798648 56378025 57379191 59971301
18260E9971301j130103m165458j556789J299105p93409m944954p786766q975388
$$ 59971301 58841198 54675740 53118951 54418056 53624647 48679693 40892927 31917539
18252C1917539q180038n804320l679207k280673j343826n18629L02969R40474
$$ 31917539 23737501 17933181 14253974 11973301 10629475 10110846 10413815 11354289
18244A1354289N90912r12065j953673j742449j102782o15802l11731j19835K5561
$$ 11354289 11945201 11033136 9079463 7337014 6234232 5618430 5306699 5186864 5212425
18235E212425J28951J83477K27196L57705N71673Q89537J396902K161071L365133
$$ 5212425 5341376 5524853 5752049 6109754 6681427 7570964 8967866 11128937 14494070
18226A4494070M797999M847105J464407k609543l466764j567367R01534L464386
$$ 14494070 19292069 24139174 25603581 22994038 19527274 17959907 18861441 22325827
18218B2325827N287953M256013K447065M232113Q425418Q632738M794284N13760
$$ 22325827 27613780 31869793 34316858 38548971 46974389 55607127 60401411 60915171
18210F0915171n698600j2234731j3039288r212187n616229l477958k322055j564315
$$ 60915171 55216571 42981840 29942552 20730365 15114136 11636178 9314123 7749808
18202G749808j055923o83202l24329J05801O24620J215728J336692R3315j516455
$$ 7749808 6693885 6010683 5686354 5792155 6416775 7632503 8969195 9062510 7546055
18193G546055j866568j319659p91432n01942l89172k71618j72846j22725j41103
$$ 7546055 5679487 4359828 3568396 3066454 2677282 2405664 2232818 2110093 1968990
18184A968990j74440j19563n8026k2612j6299j9381p1706j18888j24853j01965
$$ 1968990 1794550 1674987 1616961 1594349 1578050 1558669 1486963 1368075 1243222 1141257
18174A141257q2946m4193K1450L3358K1561Q265m4760n2693l2990j3616K4653
$$ 1141257 1058311 1014118 1035568 1068926 1090487 1098752 1053992 1001299 968309 954693 979346
18163I79346O9047Q484o6672q4863n1158l1191l5068l26N60J4983R685k2786o939
$$ 979346 1048393 1056877 990205 905342 854184 822993 787925 787599 788159 803142 812827 790041 783102
18150G83102L3700K5671k3122O322M8184L1327j5506k3541k7244J643K3804J0696
$$ 783102 816802 842473 819351 825673 873857 905184 889678 866137 838893 840536 864340 875036
18138H75036q754m0745m9339j0716j763k2114j6975M4987P1754Q395k0306L2173
$$ 875036 866282 825537 776198 765482 763719 741605 724630 769617 841371 849766 829460 861633
18126H61633P7420P6624O2974M5405M6740J11010J47311J86833K13494K56310
$$ 861633 939053 1015677 1078651 1124056 1170796 1281806 1429117 1615950 1829444 2085754
18116B085754L58808M59655O48160R65218J523849K638451M913490Q893883J2817114
$$ 2085754 2444562 2904217 3552377 4517595 6041444 8679895 13593385 22487268 35304382
18107C5304382N903149p959814j2744948q132025m222229k344239j442484r65449
$$ 35304382 41207531 33247717 20502769 12370744 8148515 5804276 4361792 3396343
18099C396343o45771m28869l39405k90717k11599j72798j35700q4203q7907p4313
$$ 3396343 2750572 2321703 1982298 1691581 1479982 1307184 1171484 1087281 999374 925061
18089I25061o3480m1812m4827m5785o1142l1563l2332m6532m0899m1632m1685
$$ 925061 861581 819769 774942 729157 668015 636452 604120 557588 516689 475057 433372
18078D33372k6085l5775k0699P006R355K475j3578M880m929o84j8537p029q214
$$ 433372 407287 371512 350813 357819 367174 369649 356071 360951 356022 355338 336801 329772 321558
18065C21558J1173m564j8958j4043j1587J533J7976J1349o301J161M349m522N697
$$ 321558 332731 328167 309209 295166 283579 285112 303088 314437 308136 309297 313646 309124 314821
18052C14821M436O529r853j7278n940J345q808J2269J5234k09j9768j3116L575
$$ 314821 319257 325786 315933 298655 292715 294060 285252 297521 312755 312546 292778 279662 283237
18039B83237L1796J0531k5432J0539R293p052L451L173J3069K4216K367n174M403
$$ 283237 315033 325564 300132 310671 319964 312912 316363 319536 332605 356821 359188 354014 358417
18026C58417m210K423J1106J1333L432J8346O000J8300K1151K7649L4230L3967
$$ 358417 354207 356630 367736 379069 382501 400847 406847 425147 446298 473947 508177 542144
18014E42144J3414J6912N1615O9056N4232K5837K1950M8038M9059R7941J23131
$$ 542144 555558 572470 624085 693141 747373 773210 795160 843198 892257 990198 1113329
18003A113329Q7424M2050K4727L0627O1757R0375J45716K13844K42008K50161
$$ 1113329 1200753 1242803 1267530 1298157 1359914 1450289 1596005 1809849 2051857 2302018
17993B302018L22637M75419O53004Q96865J374802K231798L494048M257224K327170
$$ 2302018 2624655 3100074 3753078 4649943 6024745 8256543 11750591 16007815 18334985
17984A8334985q57682j720575M5472K797912N848784P080194K267397m900977
$$ 18334985 17477303 15756728 15802200 18600112 24448896 31529090 33796487 28895510
17976B8895510o962069m281745j058957J489964K353601l42757l999072m668533
$$ 28895510 21933441 17651696 16592739 18082703 20436304 20093547 16094475 11425942
17968A1425942l209904j975767j255383q28622n36427l50518k40588j47725n2430
$$ 11425942 8216038 6240271 4984888 4156266 3619839 3269321 3028733 2881008 2828578
17959B828578k1118k0424k9017j9725k318N5489J21204R8910O0827J39125K95531
$$ 2828578 2807460 2787036 2758019 2738294 2735976 2791465 2912669 3011579 3072406 3211531 3507062
17948C507062M52788O33723R11610J352530K137742L199308L291786J062872j085760
$$ 3507062 3959850 4593573 5505183 6857713 8995455 12194763 15486549 16549421 15463661
17939A5463661p11144J232999L411203N244106N860528N939284N748397M193522
$$ 15463661 14752517 15985516 19396719 24640825 30501353 36440637 42189034 46382556
17931D6382556O31259l159514n306310o661264p424076o196116l683489j476952
$$ 46382556 47013815 43854301 38547991 31886727 24462651 18266535 14583046 13106094
17923A3106094K47230J317187N27584j840315l215920k709269j730681j070541
$$ 13106094 13353324 14670511 15198095 13357780 10141860 7432591 5701910 4631369
17915D631369p16877n08295l42683k39110j63748j59602j21723m5033J236N307
$$ 4631369 3914492 3406197 3063514 2824404 2660656 2501054 2379331 2334298 2335534 2340841
17905B340841n6000o2535m5236j4544L7332P6245J76132K76099M16840N74512
$$ 2340841 2284841 2222306 2177070 2162526 2199858 2276103 2452235 2728334 3145174 3719686
17895C719686R31092J574216K475854K522515O02677j268237j088918M11667K249995
$$ 3719686 4650778 6224994 8700848 11223363 11826040 10557803 9468885 9880552 12130547
17886A2130547L995964L533247o03216m109613l766489j809201o8143J123946
$$ 12130547 16126511 19659758 19056542 14946929 11180440 9371239 9303096 10427042
17878A0427042P68732j237067k598071k220659j402530q62386n99611m18737k57610
$$ 10427042 11195774 9958707 7360636 5139977 3737447 2875061 2275450 1856713 1599103
17869A599103j92715j35564j00924o2400q2731p2808o2243n8541k3854J2278J6492
$$ 1599103 1406388 1270824 1169900 1107500 1024769 951961 889718 831177 807323 819601 836093
17858H36093m3011n9762m2540l7426j3747j396k0634m9208m8010k1902j6001l8295
$$ 836093 793082 733320 690780 653354 639607 638211 617577 568369 520359 498457 482456 444161
17846D44161j0166J6989J845j696n90j6266l8489m9728j3148K2965J8575o707
$$ 444161 433995 450984 452829 451133 450543 434277 395788 346060 332912 355877 374452 367745
17834C67745j0864j3239n83k1813k924j2726j3127j8573k5961p272J0044k539
$$ 367745 356881 343642 343059 321246 318322 305596 292469 273896 247935 240663 250707 248168
17822B48168L118J503m161l440m935L466J6642J6147j5396p975K016J2642K0557
$$ 248168 251286 252789 248628 245188 240253 243719 260361 276508 261112 253137 255153 267795 288352
17809B88352J6086j314O356L8661K7938J8760Q375l5018j1282o061l292J6053
$$ 288352 304438 303124 309480 348141 376079 394839 403214 368196 356914 350853 347561 363614
17797C63614R787Q002o849o602m597k6915j2291k6846K018k3080j9646J2704J1942
$$ 363614 373401 381403 374554 367952 363355 336440 324149 297303 299321 276241 256595 269299 281241
17784B81241j0128R626J5046L819l226o500J523j3946k8599p073J2974R888r759
$$ 281241 271113 280739 295785 299604 296378 289878 291401 277455 248856 241783 254757 264645 254886
17771B54886k514k34m782k325J2662L0822Q85p527K6223L8859K5079K5286N3642
$$ 254886 252372 252138 247356 245031 257693 288515 289400 281873 308096 346955 372034 397320 450962
17758D50962J6819k1868j3329r609K412P317J6697M3310L7385N278l4401o0776
$$ 450962 467781 445913 432584 422975 425387 432704 449401 492711 530096 535374 500973 440197
17746D40197m7619l8420j4879J2709K0504L4554O2788N4623L9348q753l1339m2709
$$ 440197 392578 354158 339279 351988 372492 407046 469834 524457 563805 555052 523713 481004
17734D81004m861L57j2968j7480l1300k4534k0670L802K278K3550J0491K445L017
$$ 481004 476143 476500 463532 446052 414752 390218 369548 373350 375628 399178 409669 412114 415131
17721D15131J1108J0575J8211K6839J8114M622O328J0597K5225K2821K5442J531
$$ 415131 426239 436814 455025 481864 499978 504600 510928 521525 546750 569571 595013 596544
17709E96544K1674M3545M8872K9088J9064K7155K0412K064R124M925J7708J7019
$$ 596544 618218 661763 710635 739723 758787 785942 806354 808418 817542 822467 840175 857194
17697H57194Q133N6315R4072R1161P3095L9899N2054N5547O3781O9601N3770P6706
$$ 857194 865327 921642 1015714 1106875 1179970 1219869 1271923 1327470 1391251 1460852 1514622 1591328
17685A591328R4598J12652J61387K22935K80402K71048K56443K29194K51818L24172
$$ 1591328 1685926 1798578 1959965 2182900 2463302 2734350 2990793 3219987 3471805 3795977
17675C795977M83557O84389R99987J449681K215644L051116K743230J293029k19222
$$ 3795977 4279534 4963923 5963910 7413591 9629235 12680351 15423581 16716610 16497388
17666A6497388j266343j315421j97552J320187L054088N296034P860034R691011
$$ 16497388 15231045 13915624 13718072 15038259 18092347 23388381 31248415 40939426
17658D0939426J1730669J1846125K535625q818338r809764k828499N720623J4497309
$$ 40939426 52670095 64516220 67051845 58233507 48423743 45595244 51315867 65813176
17650F5813176J8103246O422423j0749975j4989549q433339m383636o191792r076988
$$ 65813176 83916422 90338845 79588870 64599321 56165982 51782346 45590554 36513566
17642C6513566q715746n948623l276751j220085N78024K190436K641304L65571
$$ 36513566 27797820 21849197 18572446 17352361 17930385 20120821 22762125 23127696
17634B3127696l119199m492498l571457k274406j365861q26738m81616k73629
$$ 23127696 20008497 15515999 11944542 9670136 8304275 7477537 6995921 6722292
17626F722292k05636j82428j26070j0485J03236K78649N30940Q27453J237151
$$ 6722292 6516656 6334228 6208158 6197673 6300909 6579558 7110498 7937951 9175102
17617I175102J942727L096922M537664M763788K370836J96915J315762M519657
$$ 9175102 11117829 14214751 18752415 23516203 25887039 26083954 27399716 31919373
17609C1919373N915975J890185l743600m761349j417415L418662R264570J4272731
$$ 31919373 37835348 39725533 35981933 31220584 29803169 33221831 42486401 56759132
17601E6759132J0104638p23330o038068m944402j707013L629164N787761j933268
$$ 56759132 66863770 66140440 60102372 55157970 53450957 57080121 62867882 60934614
17593F0934614j2271205j4134953r262146m791938k574077k562942l025000k601197
$$ 60934614 48663409 34528456 25266310 20474372 17900295 15337353 12312353 9711156
17585I711156j777187j165016p52965m76349l02063n0349L16790P37308Q04331
$$ 9711156 7933969 6768953 6015988 5539639 5237576 5187227 5504017 6241325 7045656
17576G045656n9821j110622j340232r46594n81793l98213l28571l00893k56364
$$ 7045656 6985835 5875213 4534981 3588387 3006594 2608381 2279810 1978917 1722553
17567A722553j76901j38361j05559q8741q1328o2698n7265m4732m4970n5659k4684
$$ 1722553 1545652 1407291 1301732 1212991 1131663 1068965 1011700 966968 921998 866339 841655
17556H41655k4654l0769k7680m0463m0238l0135j0192Q583j6441j5733n827j9775
$$ 841655 817001 786232 758552 718089 677851 647716 637524 646107 629666 613933 608106 588331
17544E88331k4847k6553q893P646k943k9326k2994k4249k3696J3026K7092J1254
$$ 588331 563484 536931 528038 535684 532741 503415 480421 456172 432476 445502 472594 483848
17532D83848l408N808p413k0447j341k7876k4042P050M341j0885p654J2462j0147
$$ 483848 480440 486248 478835 458388 457047 429171 405129 412179 416520 405635 397981 410443 400296
17519D00296J1631j3861m7911j9951j9063j6483m648J9346j1203j1881J467q22
$$ 400296 411927 398066 350155 330204 311141 294658 290010 309356 298153 286272 287739 286917
17507B86917j9247k1518M71K287N196L719L413K2314N603j4349m2481k0072j2424
$$ 286917 267670 246152 246623 248910 254106 257825 261238 283552 289155 274806 232325 212253 199829
17494A99829J0456K7155Q423j0674j5025j7062j1693j7583K717M998K2558N458
$$ 199829 210285 237440 245863 235189 220164 203102 191409 173826 176543 181541 204099 209557
17482B09557o355j5555j43K1068Q257J256M064j2758r683K1178L7477K9831K1953
$$ 209557 203202 187647 187504 208572 216829 218085 222149 209391 199708 220886 258363 288194 310147
17469C10147l7117j5185J8945P406p34o713k8031k9522o017R560m048o480j8023
$$ 310147 273030 257845 276790 284196 283462 276749 248718 219196 213179 222739 218691 212211 194188
17456A94188k2237j9712j8966j6328m939p165J4291j1272k751J6942K0860K0904
$$ 194188 171951 152239 133273 116945 112006 104841 119132 107860 105109 122051 142911 163815
17444A63815J8396J5117O2354M5673q615n0875l1993l7448k0135l0599o408j0054
$$ 163815 182211 197328 259682 305355 296740 245865 213872 176424 156289 125690 119282 109228
17432A09228j3017J170R189J141K5223K3638K0147K6097L6199l396k5465P507
$$ 109228 96211 97381 106570 107711 132934 156572 176719 202816 239015 235619 210154 217661
17420B17661J1701M4759L8764R227k7940o0349l8285M378l946q720j3868k4744
$$ 217661 229362 274121 312885 322112 294172 233823 195538 199916 195970 187250 173382 148638
17408A48638j0347Q673J0033k6512o123k5911r371j6011k2862o220J8297p05M285
$$ 148638 138291 146964 156997 130485 124362 98451 89080 73069 50207 43987 62284 61579 65864
17395F5864L928p0k2134m569j1055N481R570J0714j2395O280j4863O294O380J1146
$$ 65864 69792 69722 47588 43019 31964 37445 47015 57729 45334 51614 36751 43045 49425 60571
17381F0571K944j835J520K5937J1293J2649j195K596j7560m37J1426l161j7890
$$ 60571 63515 61680 63200 89137 100430 113079 111884 114480 96920 96483 107909 104748 86858
17368H6858L615j0515j698J2872J9558J1284j3154k0671l035p124j5776j7545
$$ 86858 90473 79958 78260 91132 110690 121974 108820 88149 85114 77990 62214 44669
17356D4669L789O336K392j3966j3728o198J421J4991Q345J3586J8862m517j4770
$$ 44669 48458 54794 57186 43220 29492 23294 24715 39706 48051 61637 80499 75982 61212
17343F1212j6409L428J4629k546p477j6950j3076l341K388J7334n401j482m391
$$ 61212 44803 48231 62860 60314 52837 35887 22811 19470 21858 39192 33791 32309 27918
17330B7918p514j0614N302J1915J8804P834j2556p43l1374r929K432n611l417
$$ 27918 20404 9790 15092 27007 45811 53645 41089 40346 8972 -957 1475 -4136 -7553
17317g553K392L304n599J5851J0971m726J309Q452J6600J2588r679q337Q328m299
$$ -7553 -5161 -1857 -7456 8395 19366 14640 15949 24401 41001 53589 43910 35573 43901 39602
17303C9602K482l958l671P117J0246r682j1313p697P394j215k354k0139j9079
$$ 39602 42084 38126 34455 41572 51818 42136 30823 23126 30520 29305 26951 6812 -12267
17290a2267K7953J9413k9082J818J0984K990n375M163N153l093p747K033l608
$$ -12267 15686 35099 6017 7835 18819 21809 16434 20597 25750 22657 14910 16943 13335
17277A3335p119M490M278n205M403Q865J0826j609k088J4355j4296J0417J4048
$$ 13335 6216 10706 14984 9779 14182 23047 33873 32264 30176 44531 30235 40652 54700
17264E4700j4417k356M715j0480n507M152K310J2151O463j6333o729J002k83N564
$$ 54700 40283 37927 42642 32162 26655 30807 33117 45268 51731 35398 28669 29671 29388 34952
17250C4952O607K652r484r519j8259j1112M424J4706J5148q892J2600R07r821
$$ 34952 41559 44211 34727 25208 6949 -4163 261 14967 30115 21223 33823 34730 24909
17237B4909k0571J335j6647J3394J6537k689J0502r280j693J6456J7383j465q113
$$ 24909 4338 5673 -10974 2420 18957 16268 26770 17490 15797 32253 49636 48171 40058
17224D0058j2866k0696j2317l054J8105M206m391q57n048P850Q670l251o27l560
$$ 40058 27192 6496 -5821 -8875 9230 13436 9045 8188 3140 10990 19660 16409 15782 12222
17210A2222j4359O565p683l022P059J5647l094M345N807j8242Q767J7013n365
$$ 12222 -2137 4428 -3255 -6277 782 16429 13335 17680 23487 5245 14012 31025 25660
17197B5660L395J3322j0047k0094L548J5867P249j3093j4388J1781J2304J6813
$$ 25660 29055 42377 32330 12236 15784 31651 38900 25807 11419 23200 35504 52317
17185E2317N331l0717N271K2953r49j6342N052q664l761J5444L21k2113j7138
$$ 52317 57648 26931 32202 55155 54206 37864 42916 34252 30491 45935 46256 24143 7005
17172G005m684m864L120J8119m592l983Q16q44J2009P350K693o530Q853K3613
$$ 7005 2321 -2543 577 18696 14104 10121 10937 10093 22102 29452 32145 25615 34468 58081
17158E8081R204K1223L4046J8335L0459L5263K3825J9816Q245J6684q032J4367
$$ 58081 67285 88508 122554 140889 171348 206611 230436 250252 258497 275181 267149 281516
17146B81516L778j7848l4329j3451n857j152n537k056k2217Q415N2553M4943K7739
$$ 281516 285294 267446 233117 219666 213809 212657 207120 205064 182847 191262 243815 288758 316497
17133C16497k4731k0801k073k4280k4802m380k1356m0052j8826j8377k2360k5827
$$ 316497 291766 270965 268892 244612 219810 215430 194074 154022 135196 116819 94459 68632
17121F8632j0857j1083j4456j7915R69R332J7049J6692J1502J2684j869m420J0160
$$ 68632 57775 46692 32236 14321 15290 24622 41671 58363 69865 82549 80680 76260 86420
17108H6420j6929m438J6727K5121K0093K6874K9165L6776K7763J7800q61K5984
$$ 86420 69491 65053 81780 106901 126994 153868 183033 219809 247572 265372 264511 290495
17096B90495j301k9375k4497j8098k7370M938J4341k2000p712j5656m0172k0637
$$ 290495 289194 259819 235322 217224 189854 194792 209133 187133 179421 163765 123593 102956
17084A02956J8750K3803K4865M0688K0157k1203m1198k6323j1750P568K8114L4201
$$ 102956 121706 145509 170374 211062 231219 210016 168818 142495 130745 138313 166427 200628
17072B00628m604j9733l8409l2861l1269j6769M366j4020p199J758L878o149j6136
$$ 200628 196024 176291 137882 105021 73752 56983 61349 47329 40130 41888 45766 39617 23481
17059B3481M464j213r662j9830J6311Q339p719k7532j2009K0195K1409J0306Q765
$$ 23481 27945 26732 17070 -2760 13551 21890 14171 -13361 -25370 -5175 16234 26540 35305
17046C5305o662n047k846N725J1685j1431j1396n959n185O552L790P086j3987
$$ 35305 28643 23596 20750 26475 38160 26729 15333 9374 4189 10741 14531 21617 7630
17033G630j5139J2517J5906k7138j0412J1713J4492J3457j6930L69Q411O616J6284
$$ 7630 -7509 5008 20914 -6224 -16636 -4923 9569 23026 6096 6465 14876 21492 37776
17020C7776n863j736l285j7431p800J6518J801n677j1685j0837N820J0617K012
$$ 37776 31913 30177 26892 9461 1661 18179 19980 14303 2618 -8219 -2399 8218 10230
17007A0230p304l960J9970J2833j6377j9137K503K1311J7180o826j8738k11K421
$$ 10230 2926 -1034 18936 31769 15392 -3745 -1242 20069 37249 30423 11685 11474 13895
16994A3895Q261N353j625R415j776P332j0892k102Q990j5879j3376R250q753M093
$$ 13895 22156 27509 25884 35299 33523 40855 29963 27861 36851 20972 7596 16846 8093 12186
16980A2186o259r588k006P183L0583l441j4060j7704o797j4690K622J5705Q255
$$ 12186 5927 -3661 -5667 1516 32099 28658 14598 -3106 -9903 -24593 -21971 -6266 1989
16967A989l664j3463R494J4125l30k021j0903J221J5516M305Q326J5608j3796
$$ 1989 -1675 -15138 -5644 8481 8151 6130 -4773 -3552 11964 16269 24595 40203 26407
16954B6407L825J8678j7717k3326R455M685J9212o154m091R412j4295j4048n931
$$ 26407 30232 48910 31193 7867 17322 22007 41219 35065 30974 40386 26091 12043 6112
16941F112J5378K235J1716L770k267Q794J2261j2207l306j6210j4887j5781j0747
$$ 6112 21490 23725 35441 39211 36944 45738 57999 45792 42486 26276 11389 -4392 -15139
16928a5139L29O086J3535J6103N502l225n789r940o522L396k5171O902J2814J1443
$$ -15139 -14810 -8724 4811 20914 26416 23191 17402 7462 940 4336 -20835 -13933 -1119 10324
16914A0324p72Q007l450r374j6335p649J4150J3193k070q358J0275l002l447O345
$$ 10324 9552 17559 14109 4735 -11600 -19249 -5099 8094 6024 -2334 7941 4939 1492 7837
16900G837J6441r357k6486k51K855J311O053O642r713j47P743r872o511m871p676
$$ 7837 24278 14921 -11565 -11816 -8961 -7650 -1597 5045 -4668 -4815 2928 -6944 -13455 -18326 -26002
16885b6002O720l527r863O859n376K2977L7384J5408j3383r729k2422L40J1784
$$ -26002 -19282 -22809 -32672 -25813 -31189 -8212 29172 44580 31197 21468 -954 -614 11170
16872A1170j703J2246q585k2202r797J5020J8702m136k0879K5112J9164j788P404
$$ 11170 9467 21713 13128 -9074 -18871 -3851 14851 10715 -10164 14948 34112 32324 39728
16859C9728j1372n225q496P073k14k581j1744j6268J4059J4590o429p963J2452
$$ 39728 28356 23131 14635 21708 21494 18913 7169 -9099 4960 19550 13121 5158 17610
16846A7610K447j6694r614L927N450O11m11j6981m732K0933J0908o577M517R517
$$ 17610 20057 3363 -6251 -2324 3126 3737 3326 -13655 -18387 2546 13454 6877 11394 20911
16832B0911j3391l389J6556J3294Q407k2214k246O323j3029j7221K2264O080J0991
$$ 20911 7520 4131 20687 33981 42388 20174 17928 24251 11222 -5999 16265 22345 33336
16819C3336J5086j7363j9065L045J5578k776J1849j8142j1106o611p541p218j9372
$$ 33336 48422 31059 11994 15039 30617 27841 39690 21548 10442 3831 -3710 -10928 -30300
16806c0300k2574J1698L5056L2530l279j8642j5155k4611M895K2497J6102j0395
$$ -30300 -52874 -41176 -6120 26410 23131 4489 -10666 -35277 -30382 -7885 8217 -2178
16794b178q104j28R443N778K702k952N738j553P06L423N22O648K380q712r422
$$ -2178 -10282 -10410 -967 4811 7513 4561 10299 8746 9452 12875 13397 20045 22425 13713 4291
16779D291n358O001J3271k0894J1906Q511j25j6837L96r172j9795J6225L1496
$$ 4291 -1067 4934 18205 -2689 9217 17728 17603 766 1162 -8010 -27805 -11580 19916
16766A9916N986j2191j4247O32J6364k0542k0433j710K274K997O583q007k4930
$$ 19916 25902 13711 -536 96 16460 -4082 -24515 -26225 -23951 -20954 -14371 -22378 -47308
16753d7308j7952J4094Q018R255L399N146K0878L779J4334Q332J1104N562k3299
$$ -47308 -65260 -51166 -43148 -33893 -30494 -25348 -4470 -691 13643 21975 33079 38641 15342
16740A5342j1402M87O064q818m896N046N255q131j4912p791K031O327J2758L132
$$ 15342 3940 4427 10491 1673 -3223 1823 7078 -1053 -15965 -23756 -21725 -15398 -2640 492
16726D92j835o059o684M060l152j31P53m107l970K2882j192k3588J0965P386p133
$$ 492 -1343 -7402 -14086 -10026 -13178 -13309 -12556 -16663 -20633 2249 1057 -22531 -11566 -4180 -11313
16711a1313R579J7964j2486k869J755n028K054j2541j045j5266o332J4878J3823
$$ -11313 -1734 16230 3744 875 2630 -2398 -344 -12885 -13930 -29196 -35528 -20650 -6827
16698f827J6947j742q051L040P88j5409p172k719M339K571n765k3849k586J3777
$$ -6827 10120 8378 327 3367 4155 -11254 -18426 -21145 -16806 -14235 -20000 -43849 -46435 -32658
16684c2658K0515p249j6184L068P946k5974J6582J5640j1262N197j641J456K2304
$$ -32658 -12143 -19392 -35576 -32508 -24562 -50536 -33954 -18314 -29576 -24379 -26020 -24564 -2260
16671b260J8355O680j3250j8366j1497L317p217p108J729J9828J1883J3418P597
$$ -2260 16095 22775 9525 -8841 -20338 -17021 -24238 -31346 -29617 -9789 2094 15512 23109
16658B3109J6759J9757k0537l5701j3903N519P040M610J2859k164J1427M391j3464
$$ 23109 39868 59625 39088 3387 -10516 -4997 2043 6653 19512 17348 28775 33166 19702
16645A9702l0156p548J2197J7698K819j6688r376K069Q290J6017P392l041n10
$$ 19702 -10454 -18002 -5805 11893 14712 -1976 -11352 -9283 -993 15024 22416 19375 18865
16632A8865k952N47n437P231j754l845j8070j8730K23P860J250j3556L968q681
$$ 18865 15913 16460 11023 18254 16500 12655 -5415 -24145 -23922 -16062 -14812 -28368 -24400 -33081
16618c3081q890L8293o61R977M068l7955L848K0360j7407j4395N935J0236J5171
$$ -33081 -41971 -3678 -4339 5638 9706 -28249 -24401 -4041 -21448 -35843 -29908 -19672 -4501
16605d501j0998j4156Q470J4316P564k297M508L457R57Q577j2623k9116j5773
$$ -4501 -15499 -29655 -21185 -6869 695 -1602 2906 6363 7320 15897 3274 -25842 -41615
16592d1615K919K3029P753J0043k2500O072Q772P984j3807j0959k654J0409J3069
$$ -41615 -38696 -15667 -7914 2129 -20371 -14299 -5527 2457 -11350 -22309 -24963 -14554 -1485
16579a485p114K397L3297o953j6702j8752J6311J2581j1613J418O386k254M11
$$ -1485 -8599 -6202 27095 20142 3440 -15312 999 13580 1967 3385 9771 7517 7928
16566G928o480q327k23R079J0574k3617j1780P102K2207j02j923n180L998j5718
$$ 7928 1448 -6879 -7102 1977 12551 -11066 -22846 -15744 6463 6361 4438 -742 3256 -12462
16552a2462O049J5766K041p004q769Q035K1105p944J315J2316k1328j0529J3331
$$ -12462 -6413 9353 11394 4390 -4379 3656 24761 16817 18132 30448 9120 -1409 11922
16539A1922J310k0771P862J0822o218L186K1126l317q083p25N711l122j683j3985
$$ 11922 13232 -7539 323 11145 4927 8113 29239 25922 17839 17114 22825 19703 18020 4035
16525D035K705M515J644o087p447k1416m881J6297N132j112Q084Q906J8590l383
$$ 4035 6740 11255 12899 6812 -635 -22051 -26932 -10635 -5503 -6615 1469 10375 28965 25582
16511B5582k8244J7238R700k3866k1028o2k908K0561L818l805K184l901j153L322
$$ 25582 -2662 14576 24276 410 -20618 -20680 -23588 -3027 791 -3014 -830 -4731 -5884 -2562
16497b562m856k65o39L15N205K798K595N428J51j2813j3245N881R663P099q911
$$ -2562 -7418 -7683 -8322 -8007 -2802 -4 2591 8019 8170 -4643 -17888 -12007 -2344 4755 -4156
16482d156o877P566M483r129k6644j387Q374O385M681J934l906j5029j8297j0659
$$ -4156 -11033 -3467 1016 -8113 -34757 -36144 -27770 -21385 -16704 -14770 -18676 -33705 -52002 -62661
16468f2661R121K4700J4810O597j4420j883K8453j664k014j54J2608M137K048
$$ -62661 -53540 -28840 -14030 -7433 -21853 -23736 4717 3053 1039 885 13493 17630 19678
16455A9678j5695j0497j210L628p172j7672p970M0262P555Q270m69j8546j8015
$$ 19678 3983 -6514 -7724 -4096 -11268 -28940 -36910 3352 10907 19177 18708 162 -17853
16442a7853j7367J854J5610R05K552K315N40J3061J110o039o769P949r88L991
$$ -17853 -35220 -33366 -17756 -16851 -14299 -11984 -11444 1617 2727 -3312 -10081 -2132 -3120 871
16428H71K111j3129o161Q777j007O927K0166l46k9188L703O63M642K0006j3093
$$ 871 2982 -10147 -16308 -7531 -8538 -1611 18555 18209 -10979 -7276 -6613 -1971 18035 4942
16414D942j0264P301L269J407n439n830q524Q780P106j8052k1997l417J6169K722
$$ 4942 -5322 1979 5248 6655 1216 -4614 -13138 -4358 2748 -15304 -37301 -40718 -24549 -21827
16400b1827k348j2427N356J513O280K795O724J9312P185j1622P80j0482n878m560
$$ -21827 -24175 -36602 -31246 -29733 -23453 -20658 -13934 5378 12563 941 1721 -8761 -14639 -19199
16386a9199J2181J265P45j634P293Q01J8412M362j5089j5758K5842M76k185m414
$$ -19199 -7018 -5753 -5008 -6642 651 1452 19864 24226 9137 -6621 19221 19697 17512 13098
16372A3098m957k2488M21J4583N829R602k130Q134j648p068J785J0680q868K06
$$ 13098 8141 -14347 -13926 657 6486 16088 13958 22092 20444 13376 15161 25841 16973 17179
16358A7179M619j9216j312J8943j979O342j0330k6855M53N384J8090n984n186
$$ 17179 21798 2582 1270 20213 18234 24576 14246 -12609 -12156 -6772 11318 5334 148
16345A48l932K300O363K170L464K096p030m765j9174q09K5535K3760L56N422k0407
$$ 148 -3784 -1484 4879 7049 10513 12609 5579 814 -18360 -19169 6366 30126 30482 35904 15497
16330A5497j0349j1041L59L939o635k527N065r050q548J7251K868j9954M576J3888
$$ 15497 5148 -5893 -5534 -1595 -8230 -10757 -5692 -14742 -23290 -6039 -3171 -23125 -18549 -4661
16316d661N331j7637J6714R16k0780q747K068p003O17k462l843r760N91O392J3966
$$ -4661 670 -16967 -253 663 -20117 -28864 -26796 -33799 -33182 -35644 -39487 -49247 -48656 -42264 -28298
16301b8298K051J8159n510k51K8351J0540j7327J054j287j4473j1378O159J6570
$$ -28298 -26247 -8088 -13598 -13849 14502 25042 7715 8769 7482 -6991 -18369 -12210 4360
16288D360Q394M281k4083M802J539K983j4816k8638J371Q656m914Q49K294l753
$$ 4360 12754 17035 -7048 -2246 -707 2276 -12540 -41178 -39807 -31151 -36065 -35216 -32922 -36675
16274c6675o25J694J3635O342R913L740j6894Q642K0516J4286j7284j7304J0412
$$ -36675 -37300 -35606 -21971 -15629 -5716 -1976 -18870 -10228 10288 24574 7290 -10014 398
16261C98J1896n031j7824m489Q749O404O595J226R337m023k1258j2580J3197K992
$$ 398 12294 7263 -10561 -15050 -6301 103 6698 7924 17261 13238 -8020 -20600 -7403 -4411
16247d411j0714m222l468O769J831n529K0628k113P86J2552R652q460r159l747
$$ -4411 -15125 -19347 -22815 -16046 -14215 -19744 884 -1229 -443 12109 21761 13301 4142 395
16233C95j3632j4512N217J4391N328j8249K672K21Q565o99J828J1797o064j2872
$$ 395 -13237 -27749 -22532 -8141 -2813 -21062 -18390 -18169 -9604 -10303 -8475 3322 -2742 -15614
16219a5614R989N972k338j51J719o743q257j0480J6508m188L0K055L283L690L627
$$ -15614 -5625 347 -1991 -2142 -423 -7166 -15423 -25903 -9395 -13583 -13553 -11498 -8215 -4525 -898
16204h98Q871j0118k1302L874J5068m596q92J274J3785L0949m556j1644j731j6825
$$ -898 7973 -2145 -23447 -19573 -4505 -9101 -9993 -8719 5066 36015 31459 19815 18084 1259
16190A259m109k387k6500j3597K2928L8535M078j1986j7050r371M974Q897P899
$$ 1259 -2850 -5237 -31737 -45334 -22406 16129 20207 8221 -8829 -18200 -13226 -4329 3570
16177C570j9355J6453K0838o376J3133j3384n014J2530K497J6915r504j6421q377
$$ 3570 -15785 668 21506 15130 28263 14879 9865 22395 24892 41807 32303 15882 7505
16164G505P293j611N225j1326q163m483O23j2693k627J0927J2036l783j2475K130
$$ 7505 14798 13187 18412 7086 -1077 -5560 -4937 -17630 -20257 -9330 2706 -1077 -13552 -11422
16150a1422l560j6005J671K7694J262n031J186r27n777L894N117j8822j2166L592
$$ -11422 -14982 -30987 -29316 -1622 -360 -5391 -4205 -5132 -10909 -7015 -1898 -20720 -32886 -29294
16136b9294m01J8539j952k956l295j1627j3453j02N266Q709J609P953r654J3329
$$ -29294 -29695 -11156 -13108 -16064 -19359 -30986 -44439 -44541 -39275 -30566 -28957 -21004 -30658 -17329
16122a7329L3052J863j6206k116P749r62p425Q002o571k1334j8392J974K5284
$$ -17329 15723 17586 1380 -736 7013 6051 -1374 6628 57 -21277 -39669 -37695 -12411
16109a2411p235j69L657K408J5137J0258j5929k8853k528N499N800P933j7344
$$ -12411 -19646 -19815 -16158 -13750 1387 11645 -4284 -33137 -35665 -30166 -24366 -16433 -33777
16096c3777J2596K3731l451K0440J1601k03k6091j4238q486P766Q931L264J6859
$$ -33777 -21181 2550 -901 19539 31140 30937 4846 -9392 -17878 -10112 -1181 2083 18942
16083A8942m76k72j2271j0747k0760J0779K1848M180M670j0130k9023k8233J5082
$$ 18942 18466 18194 5923 -4824 -25584 -14805 7043 11223 15893 5763 -23260 -51493 -36411
16070c6411J0919M534j9157k64J6367j3735K618K576P024J611j1203m786J7362
$$ -36411 -25492 -20958 -40115 -40379 -24012 -37747 -35129 -32553 -25529 -23918 -35121 -39907 -22545
16057b2545Q796J2324r946p622r715J4674K6362p938P00K0415j0108l646p103
$$ -22545 -13749 -1425 -11371 -18993 -28708 -14034 12328 4390 5090 25505 15397 11751 4648
16044D648r683P261Q603l655J0248j2682l3589q506O295r386J6990J1721K508
$$ 4648 -5035 2226 10829 7174 17422 4740 -28849 -37355 -31060 -40446 -23456 -11735 -9227
16031i227o982M263N314j5543L622M037Q381P60M344J2466N123n663j2414M621
$$ -9227 -16209 -11946 -6632 -22175 -18553 -14516 -6135 -5375 -1031 11435 16558 10895 -1519 3102
16017C102M470n440J5966N044j1905j1740j3344k1313j656J1394R898J2535j709
$$ 3102 7572 2132 18098 23142 11237 -503 -13847 -35160 -36816 -25422 -15524 -2989 -4698
16004d698q112P737o257j310k735N53j0700l459J1543k251P196M630M552l456
$$ -4698 -12810 -5073 -11330 -12640 -15375 -14822 -25522 -28981 -17438 -19689 -12493 -7863 -3311 -6767
15990f767r701r476J6448J0360L0785J4943j7879j0409k1053n45J998l26J5110
$$ -6767 -16468 -25944 -9496 864 31649 46592 28713 18304 -2749 -3294 -1296 -1622 13488
15977A3488p055r076r950N963R78J0937J4643N801P897N077M336j4898j2285k0811
$$ 13488 6433 -2643 -12593 -6630 -5652 5285 19928 25729 33626 38703 43039 28141 15856 -4955
15963d955M135K266j5489R249K2400j283q806l755R71K736J577k0814j2016r583
$$ -4955 -820 1446 -14043 -4794 17606 16323 7517 3762 4733 7469 9046 -11768 -23784 -33367
15949c3367N162N900j3099J5149K1674R981j2471j01j2613L424K3031J4077m593
$$ -33367 -28205 -22305 -35404 -20255 1419 11400 -1071 -1172 -13785 -10361 12670 26747 22154
15936B2154J073j8062j5065j0525j375K1897Q77L134J4998k300j954l1749l2242
$$ 22154 23227 5165 -9900 -20425 -21800 97 974 4108 19106 16806 14852 -16897 -49139
15923d9139o409J6477O800K7027J466j2222j0537j1563J8746L840J1368J0141
$$ -49139 -55548 -39071 -32271 -5244 -3778 -16000 -26537 -38100 -19354 -15514 -4146 5995
15911E995m450p198k068m980O713l90K363j3908K1959K4193j0128L6j1626q01
$$ 5995 1545 -5653 -7721 -12701 -5988 -6378 -4015 -17923 4036 28229 18101 18137 6511 5710
15897E710n01k5634L19P608K2386L115k3590k588J4234J5189O583o44J0081n075
$$ 5710 5209 -20425 -20106 -12498 9888 13003 -10587 -13175 1059 16248 22831 22187 32268 27193
15883B7193l0309l8367N005J7939J2991K056J2357J5009q909j819J2113k6273
$$ 27193 -3116 -41483 -36478 -18539 -5548 -3492 8865 23874 14965 13146 25259 -1014
15871a014k6605K35K1483J2842J3247l754J8462J9581n971o887j0852o449L264
$$ -1014 -27619 -27384 -5901 6941 20188 16434 34896 54477 48506 41619 30767 24318 27582
15858B7582k2626j6100N689k1149L445M271J8893N823l891m90j2901J023O600
$$ 27582 4956 -11144 -5455 -26604 -23159 -18888 5 5828 1937 1447 -11454 -10431 -3831
15845c831r97n148J4847r360j4995r106K2115J2672j0843p146J1292K877j2216
$$ -3831 -4828 -9976 4871 -4489 -19484 -28590 -6475 6197 -4646 -11792 -500 2377 -9839
15832i839o09O674q742r14R85n356o035M347K649P583j1703L575k362J1073j013
$$ -9839 -10448 -3774 -12516 -13430 -12445 -17801 -23836 -19489 -16840 -9257 -20960 -17385 -19747 -8674 -9687
15817i687j5271k634N689L4535K2935j1168l162l236J1773o905r828r631j986
$$ -9687 -24958 -27592 -21903 12632 35567 24399 21237 18001 29774 22869 13041 3410 1424
15804A424j2005J7798k95j6047j429R117J467J0398j483m020j0447J3729Q47k3563
$$ 1424 -10581 7217 6922 -9125 -10554 -1437 30 10428 8945 4925 -5522 8207 9054 -14509
15790a4509Kn5j1181L770J2266J0496j0880M854J4037J1010k276j0568j3295k0287
$$ -14509 -14507 -14562 -25743 -21973 -9707 789 -10091 -5237 8800 19810 17534 6966 -6329 -26616
15776b6616j9736O682K2668J5771O063N111R240J1791j1086j0863q063N92J2769
$$ -26616 -46352 -39670 -17002 -1231 4832 9943 19183 30974 19888 9025 962 1554 14323
15763A4323K642j7594P086p948q59o593j7813J3668J6780j0055k319j7281l96
$$ 14323 16965 -629 6457 -1491 -2350 -8943 -26756 -13088 3692 -6363 -8682 -25963 -26359
15750b6359O752K886L1086L094j0068L389N09j754J3611j3252j5454j7052J7678
$$ -26359 -19607 -16721 14365 17459 7391 10780 11289 9535 23146 9894 -5560 -22612 -4934
15737d934J8502L311n81m720k771j1800j0440J7445m31l213j8345n537n415l52
$$ -4934 13568 16879 16298 11578 8807 -2993 -13433 4012 3581 368 -17977 -23514 -28929 -29281
15723b9281J7374J3182k6188o214N227l187J953L9663O922k105j465r380j4037
$$ -29281 -11907 1275 -24913 -31127 -25900 -29087 -27134 12529 19451 17346 15881 6501 -7536
15710g536Q924J2517k719k2615L013K854m822J948j3248q373j450J1962O008N448
$$ -7536 1388 13905 11186 -11429 -8416 -5562 -10384 -8436 -21684 -30057 -31507 -19545 -13537 -8089
15696h089M047L636J549j7093O617j1649M272k717L988k882J0748P685Q369J1434
$$ -8089 -4042 -406 1143 -15950 -9333 -20982 -16710 -19427 -15439 -18321 -7573 112 8481 19915
15682A9915j4758j9206m975L109j3336N597P362j1477N211J4058N055k664m377
$$ 19915 5157 -14049 -19024 -15915 -29251 -23654 -16292 -27769 -22558 -8500 -3445 -6109 -10486
15669a0486J3780j0665o421O141M688N126J44J2754j4626k2689M62J711Q712J2338
$$ -10486 3294 -7371 -13792 -7651 -2963 2163 2307 15061 435 -22254 -21792 -20081 -11369 969
15655I69J0322o409K254j720r349p99P751p429o485j545J7697L0697O147k2976
$$ 969 11291 4882 7136 5416 -3933 -4732 3019 -4410 -10895 -12440 5257 35954 42101 19125
15641A9125l7178j663J0495J2910r923J3974j2541o529j4455L330J8431J0013
$$ 19125 -18053 -19716 -9221 3689 -6234 7740 -4801 -11330 -25785 -22455 -4024 5989
15629E989J0549o506o790J1545p369j5207k1483j448O911k35O763n239L024j1650
$$ 5989 16538 10032 3242 14787 7418 -7789 -29272 -30720 -23809 -24044 -17281 -22520 -19496 -31146
15615c1146r442K0197J4695N51p136J1199j644N079j9893Q241J6300j2614j7262
$$ -31146 -40588 -20391 -5696 -5145 -12281 -1082 -2726 2353 -17540 -9299 7001 -5613 -22875
15602b2875j0989M761J2801K3711J7j3571J886K1609j0047m42J6181j2119j739
$$ -22875 -33864 -29103 -16302 7409 7426 -6145 -4259 17350 7303 6861 23042 10923 9184
15589I184r309j9256J4373l56m590L922J4567O750j5261m139k712R594k501j0680
$$ 9184 -125 -19381 -5008 -5364 -9954 -6032 8535 15285 24 -4115 -6827 2767 266 -10414
15575a0414j756k8Q439j358L190j833M766J2560O912J1196M597k1699k2958O936
$$ -10414 -12170 -12198 -3759 -5117 -1927 -3760 1006 13566 20478 31674 36271 14572 -8386 -1450
15561a450P963k6323o239R720J1054J7621N607N011J6843m69Q80p547m242M784
$$ -1450 6513 -19810 -26049 -16329 -5275 12346 17953 22964 39807 39338 40218 32671 28429 33213
15547C3213j3057M206p814j1674j0444n14K024J4055q583m921J349p759q477J5190
$$ 33213 20156 24362 16548 4874 -5570 -6084 -4060 9995 1412 -3509 -2160 -9919 -18396 -3206
15533c206J1956Q694q87l081k1438o295J498J9528J888j5108J0381p157k149K821
$$ -3206 8750 17444 16557 13476 -7962 -14257 -12759 6769 8657 -6451 3930 -3227 -5376 -2555
15519b555K385J1471L829J608N461j299J00q09r494K5173n037j4858Q049J6629
$$ -2555 -170 11301 15130 16738 22199 20900 21000 20191 10697 35870 30833 15975 24024 40653
15505D0653q843j1104l4021o245J1191J9724L421q971L551m299j192M652j6870
$$ 40653 31810 20706 -13315 -19560 -8369 11355 14776 5805 9356 5057 3865 8517 -8353
15492h353L703k41J4755l796K1479j9503j218L521o965l567j475m685M877L07
$$ -8353 -4650 -4891 9864 6068 27547 8044 6826 10347 3382 -185 -1660 -6345 -1468 -1161
15478a161j7196k8606K417J8462K3114J945m430J2289j282j0149j875n881m857
$$ -1161 -18357 -46963 -44546 -26084 -2970 -1025 -5455 6834 5552 -4597 -6472 -12353 -17210
15465a7210k2619P222J1944m644M403l466j548J8295J5848r600n171k734J0746
$$ -17210 -39829 -32607 -20663 -25307 -20904 -24370 -25918 -7623 8225 -1375 -6546 -9280 1466
15452A466J2223j0323j4289O752K0197j571J286j1574q275r597O980R718k539
$$ 1466 13689 3366 -10923 -4171 16026 14455 15741 4167 -4108 -13705 -6725 2993 454
15439D54q350n063R818K2134k66j535j395m433p098N931J46L127p476j0479J1342
$$ 454 -7896 -12959 -3141 18993 18727 17192 15797 11364 4266 10197 10343 13470 5994 -4485 6857
15424F857J2435j4275M019L34k923J8787j1551k4651k2397J5568J3002r699j024
$$ 6857 19292 5017 9036 9370 6447 25234 13683 -10968 -33365 -17797 -4795 -14494 -15518
15411a5518j2668M12O212O016r87m73j877n169K8700J0133k632k061j3147K580
$$ -15518 -28186 -27774 -21562 -15546 -16533 -17006 -18883 -24052 4648 14781 12149 10088 -3059 -479
15397d79q307k393L96n920r370L321j1893j9126K1206K0508Q297J3192J9904M059
$$ -479 -8786 -11179 -10783 -16703 -26073 -22752 -34645 -53771 -32565 -12057 -3760 9432 29336 33395
15383C3395j8867j2833N036O653J3156O031o277j7979k9528j2317J1086N510m76
$$ 33395 14528 1695 6731 13384 26540 32571 26294 8315 -21213 -33530 -22444 -16934 -17410
15370a7410k769R044m914J677j62j2914J1308J1719J899J986j483L216j909j0703
$$ -17410 -20179 -11135 -16049 -14372 -14534 -27448 -16140 -4421 -2522 -536 -2019 1197 -712 -11415
15356a1415n280J3276O294q302n58j015M791J5200J1273j0738P361J6272j5965
$$ -11415 -16695 -3419 2875 -5427 -5985 -7000 -2209 12991 24264 13526 20887 37159 21194
15343B1194j5927n499k681J5J6918N37j5148j9211q591l973m40R682L6811K2743
$$ 21194 5267 -232 -2913 -2898 14020 14557 -591 -19802 -28393 -32366 -32806 -23124 13687 36430
15329C6430J6059o702k3092j7745j0079q404J5411M114r38p339K378p255L587
$$ 36430 52489 45787 22695 4950 -5129 -13533 1878 5992 5054 -2285 93 -7162 -3575
15316c575m276k1466J1908M177j346J5871J4209O081j1469k785j5720l181j3373
$$ -3575 -7851 -29317 -17409 -13232 -14578 1293 15502 21583 10114 7329 -8391 -11572 -24945
15303b4945L022J1685P346j6437j5680K6823K3692J2440j3023k8167J137K0504
$$ -24945 -21923 -10238 -2892 -19329 -35009 -8186 15506 27946 14923 -13244 -12107 8397
15291H397K1860k043l977R3q794r666J6720k716Q163m567j2037M251L507j943
$$ 8397 30257 28214 24237 24330 15536 5870 22590 19874 28037 23470 11433 15684 19191 17248
15277A7248r912j2793P423J8224J2752j8826k1882j55J9547L68k4406j6753j6531
$$ 17248 7336 -5457 1966 20190 32942 14116 -7766 -7921 11626 11994 -12412 -29165 -45696
15264d5696j7259J1323Q099J6202L088P196J0408L298k238l449n16J6732J0143
$$ -45696 -62955 -51632 -43533 -27331 -24243 -17047 -6639 -3341 -5579 -9028 -9544 7188 17331
15251A7331j2100J9362m947j3158P164n692Q284Q932J88r176r268j317j1795O792
$$ 17331 5231 24593 19646 6488 13652 7960 16244 25176 25364 16188 6920 5603 -6192 600
15237F00L388J4539J0705k0195j1037J2886J80j726j7714J2674J3441J0675J3868
$$ 600 3988 18527 29232 9037 -2000 10886 11066 9340 -8374 4300 17741 28416 42284
15224D2284j2859j1457J050L667j3919j2905o951J2541N153j8378r886P021J8336
$$ 42284 29425 17968 19018 22685 8766 -4139 -11090 1451 6604 -11774 -21660 -14639 3697
15211C697J8918j2083j0978j5141k1269P992J5876Q890o199r031K583K532J775
$$ 3697 22615 10532 -446 -15587 -36856 -28864 -12988 -4098 -10297 -19328 -16745 -14213 -12438
15198a2438p865k31o310J3731K4764j0778l1206Q97J4771P834O507j1814m723
$$ -12438 -20303 -20534 -26844 -13113 11651 873 -30333 -29436 -14665 -6831 -324 -12138 -16861
15185a6861M809n181j3408K2986O663M584M351N310j485j6149l373j942O480m598
$$ -16861 -12052 -17233 -30641 -7655 -992 3592 7943 13253 11768 -4381 -7754 -9696 -3216 -7814
15171g814P827N512j2795M081K9056m774p340Q900P986R972k4274L618j1734o483
$$ -7814 13 5525 -7270 -3189 25867 21093 13753 22653 30639 40611 16337 19955 8221 1738
15157A738J49k524l002L007J2117J88p480Q76j2114R880O170j3010O828p095p295
$$ 1738 1887 -637 -3639 -632 11485 11673 4193 5069 -7045 2835 9005 -4005 2823 -4272 -11567
15142a1567p50r992P735Q127n126k326k804j6899O537K0497q254m277K793m148
$$ -11567 -12317 -22309 -14574 -6447 -11573 -13899 -16703 -33602 -27065 -6568 -14822 -19099 -16306 -20454
15128b0454J4454l79M787l20l755j844K319K285P830l294L92K1971l257j9491
$$ -20454 -6000 -6379 -1592 -1912 -5667 -7511 -5192 -2907 4923 1629 2021 23992 20735 1244
15114A244l055K7922N900m251j7164n534J2380J5124m60p363k0657j3078J3192
$$ 1244 -1811 26111 32011 27760 10596 5062 17442 32566 32106 24743 4086 -8992 4200
15101D200j6029k0955J3884J7747l367j2851l416K0308P005J0411J1291q505Q27
$$ 4200 -11829 -32784 -18900 -1153 -4520 -17371 -20787 -479 6526 16937 28228 19723 20550
15088B0550P043o314M463N310m28j2579n167K115L698j2785l624J4456J2239m227
$$ 20550 27593 21279 25742 31052 30624 18045 12878 14993 18691 5906 2282 16738 28977 24750
15074B4750N713K825j4945r852k0954L060J4227N849P563J7802J4924j4491P33
$$ 24750 30463 33288 18343 8491 -12463 -9403 4824 10673 18236 36038 50962 36471 37204
15061C7204n909j3462q719L570j3930n690K1542J1139q12p207j9900l415J8731
$$ 37204 31295 17833 9114 12684 -1246 -6936 14606 25745 24933 17726 -2174 -5589 13142
15048A3142j7063j1249J5763P810j0048k766m964p003R66j6995j3985P537K5312
$$ 13142 -3921 -15170 593 8403 -1645 -4411 -9375 -16378 -15412 -32407 -46392 -38855 -13543
15035a3543K349j0611J675P482J361l210O77k785J4261M076J0144J1278m446M16
$$ -13543 -11194 -21805 -20130 -12648 -11287 -14497 -13820 -16605 -2344 1732 11876 23154 18708 19124
15021A9124J021l1903J567O001j12r287K846p424P597J4575L623M671j1495k091
$$ 19124 20145 -11758 -10191 -4190 -4302 -13589 -10743 -18167 -10570 4005 7628 12299 804 -1287
15007a287J3118p288m609K7612n313k0783j3422j0280J2354j5262j0371n271P810
$$ -1287 11831 4543 -66 27546 22233 1450 -11972 -22252 -9898 -25160 -35531 -40802 -32992
14994c2992J0399J2284J3967J072O789Q697q08N540l9j450M485O49n23j3753k1284
$$ -32992 -22593 -10309 3658 4730 11519 20216 19408 24948 24909 23459 27944 28593 28070 14317 -6967
14979f967J8179n326l8658J3606L0964k6360j5253J2816K6486O573j5109j0070
$$ -6967 11212 5886 -32772 -19166 11798 -14562 -29815 -16999 9487 16060 951 -9119
14967i119k0481R131J524J989J0118P979J4102j4941l981M605l796k415O992N574
$$ -9119 -29600 -20469 -18945 -16956 -6838 1141 15243 302 -3679 926 -2870 -5285 1707 7281
14953G281J1341N261q262j148l810J2971N64k3814j8755r290R158J861R426M810
$$ 7281 18622 23883 15621 14473 10663 23634 24198 384 -18371 -27661 -18503 -16642 -7216 -2406
14939b406j1021J282K0354J1443l0166L246J2496j1832O517j1872n061O831N983
$$ -2406 -13427 -12145 8209 19652 -10514 -7268 5228 -6604 -87 -11959 -17020 -10189 -4206
14926d206R063j473k1151m185K5058J9865j347J181M109j3128L507J320J229m670
$$ -4206 4857 3384 -17767 -21952 3106 22971 21624 22805 26914 13786 17293 18613 19842 15172
14912A5172j4263j9896L01K9263J2457k4021j6429q257m11J8570J3886o432k662
$$ 15172 909 -18987 -18686 10577 23034 -987 -17416 -25673 -26084 -7514 6372 -60 -2722
14899b722L967p43m920n180o486j6190m445j386J9018K743j0959j3059J747R612
$$ -2722 1245 502 -4418 -9598 -16084 -32274 -36719 -38105 -19087 -16344 -27303 -40362 -38615 -29003
14885b9003K6351P543M633j7258q905j448O765J5588O542j695j0181p441J4315
$$ -29003 -2652 4891 9524 -7734 -16639 -18087 -11322 4266 10808 9113 -1068 -8509 5806
14872E806M647L12L486j0342j9538j6620K8552J7208J597k921o504P7j0244R00
$$ 5806 10453 10765 14251 3909 -15629 -32249 -3697 13511 15108 12187 5683 5760 -4484 -3584
14858c584L612j7642N417J6335J2637q142p383K93l939m711L730J1315p461r247
$$ -3584 28 -17614 -12197 4138 16775 8633 1250 1543 -2396 -7107 -3377 7938 477 -8770
14844h770P996J3210K376k451j3850j456P131J4222r859J1671M423k9556m937
$$ -8770 -774 12436 14812 12361 -1489 -2945 4186 18408 8549 20220 24643 -4913 -9850
14831i850J2721p903J0199J5738l608q693q613j0021J4933k0885j6606K1192K1390
$$ -9850 2871 -5032 5167 20905 17297 8604 -9 -10030 4903 -15982 -32588 -11396 9994
14818I994Q610k356j2616k5852J9842j1335N35o562m745J2973P420P161j0580
$$ 9994 18604 16248 3632 -22220 -2378 -13713 -13178 -19740 -24485 -11512 -4092 3069 -7511
14805g511k7591o166K5513K0533Q909l938k130J5444j2968j7854K874K961K15
$$ -7511 -35102 -41268 -15755 4778 13687 9749 7619 23063 10095 -7759 -4885 -1924 -1709
14792a709r259m083O457j3511p349J2894P806J0832J075M483J8669j303M62n509
$$ -1709 -10968 -15051 -8594 -22105 -29454 -16560 -8754 2078 3153 7636 26305 25002 25464 19955
14778A9955k8J1883Q94j1245j7895Q427J676r702O475R450j1912r809k282l35
$$ 19955 19927 31810 32704 21459 3564 11991 13667 3965 10440 19890 7978 -1831 -4113 -4448
14764d448j0376q638J9166J5816J5342L62j8136k1226l56K037O833J6661Q592
$$ -4448 -14824 -23462 -4296 11520 26862 27224 9088 -12138 -12494 -10457 -3624 13037 21629
14751B1629M794q080K719r622q38N655p911m134N487J9672J8312l2362j2745l833
$$ 21629 26423 18343 21062 11440 10602 16257 8346 4212 9699 29371 47683 15321 2576 -1257
14737a257o77n070J6912L736k164N565k2732M34K947J0486J2384n945j2736k129
$$ -1257 -1934 -7004 9908 13644 11480 17045 -5687 -5253 -2306 8180 20564 14619 1883 -246
14723b46J5598N024n983k656O083L07o381r205J7929J5801o411j1153k524r746
$$ -246 15352 20376 14393 11737 17820 18127 11746 2541 20470 36271 29860 18707 16183 6437
14709F437j2027J6112O389J1600o153j7006P337o062N402K4254K650k5222j7910
$$ 6437 -5590 10522 16911 28511 22358 5352 12689 6627 12029 36283 38933 13711 -4199
14696d199L651J5525J4047j3105l038J9780j992j5834j7653k3599j7518J5658
$$ -4199 -548 14977 29024 15919 12881 32661 30669 14835 -2818 -26417 -43935 -28277
14684b8277R831J3961J0421q613K1725J0695O28n395R338k865p028m66l0028J798
$$ -28277 -18446 -4485 5936 -2677 19048 29743 30371 24976 34314 31449 24421 23955 -6073 -4275
14670d275l068P117K1364K5183j1448N226o239j2224j5849j758q339O60J8122
$$ -4275 -7343 -226 21138 46321 34873 40099 33860 21636 5787 4029 -4310 -3650 14472
14657A4472P833P162j6526n879l787J7027M633q985j6981R288q03k860J3871j557
$$ 14472 22305 29467 12941 7062 3275 20302 24935 15950 -1031 8257 7454 4594 18465 16908
14643A6908M760O720l480m977O92k011j8205l508j001J3068J633P18j472o764
$$ 16908 21668 28388 24908 19931 20623 18612 407 -3101 -4102 8966 10599 11317 9845 3081
14629C081L598J9119K763j8764k0261j0457J0826K656J874M290P209J6061j6619
$$ 3081 6679 25798 28561 9797 -10464 -20921 -10095 -7439 -5565 -1275 5934 21995 5376
14616E376k376l681m467j688J2338q906k925J4899R988r616j241K378J7701J0205
$$ 5376 3000 -681 -5148 -6836 5502 -3404 -6329 8570 18558 8942 7701 10079 27780 37985
14602C7985o551J2105L415K818n059m573r598j8135J031O750l645N583k0277n276
$$ 37985 31434 43539 46954 49772 44713 40140 30542 12407 13438 20188 16543 22126 1849 -3427
14588c427M386l05l402j3149l73J3118p485J6649J4724P627m157J4537j7110k8936
$$ -3427 959 654 -2748 -15897 -16270 -3152 -10637 6012 20736 28363 24206 38743 21633 -7303
14574g303r724K8170J7192R44k486J952j6168l332K26j5127n823J1659n110N077
$$ -7303 -17027 11143 28335 29279 26793 28745 12577 9245 9471 -5656 -11479 180 -4930 147
14560A47M18j4258J41M116J2210j1013l477Q804J0549J0731Q308J2689J1219j0088
$$ 147 565 -13693 -13552 -9436 2774 -8239 -11716 -2912 7637 18368 26676 39365 50584 40496
14546D0496o195J182q715l1260M373K26Q799J930J3169J4302j3953r560K761k3044
$$ 40496 34301 35483 26768 -4492 -119 107 8906 10836 24005 38307 24354 14794 17555 -5489
14532e489j1769J0401Q411P414P774j2985m780o442O304K1914j1863n773j2671
$$ -5489 -17258 -6857 1554 8968 16742 3757 -1023 -7465 -1161 20753 8890 3117 -9554
14519i554j263L233J1843J0592j444J978q226o788N902K555o235l845j1028r222
$$ -9554 -10817 -7584 4259 14851 13407 15385 7159 371 6273 8828 2593 -1252 -12280 -21502
14505b1502K5478P437K372j7648K555m813O307O720J185j649P655N679j0514r627
$$ -21502 3976 11413 13785 -3863 -1308 -6121 186 6906 8091 6442 14097 19776 9262 -365
14491c65m929Q47K821m292m733Q37q725J3349k84j5059k711P318J9841M927j9245
$$ -365 -5294 -4447 -1626 -5918 -10651 -9814 -18539 -5190 -5474 -20533 -23244 -15926 3915 8842 -10403
14476a0403j8503M895J5250J5977J565p25J0778l16J3224N368j172j2933O195
$$ -10403 -28906 -24011 -8761 7216 8781 8056 18834 18518 31742 37110 35938 23005 29200
14463B9200k238j294r569J242k3335L115J536K8816K2831L275n542K121o197M731
$$ 29200 26962 25668 16099 17341 -5994 -2879 -1343 27473 50304 53579 48037 50158 43961 48692
14449D8692l543j7842n532p89J6972L56n478O648K9338J7748J9439n208P385j263
$$ 48692 45149 27307 21775 20986 37958 38314 32836 39484 68822 86570 106009 100801 108186 106923
14435A06923K5109M828m381j4338m0087k3787o968j7892k1080J478O734J3298
$$ 106923 132032 136860 132479 118141 78054 54267 47299 29407 8327 9805 16539 29837
14423B9837K890j2023j2165P117m617l867j57o470K614j6567m529J6168k119J2094
$$ 29837 32727 20704 8539 15656 11039 7172 7015 545 3159 -13408 -17937 -1769 -3888 8206
14409H206J1763q45j2265j2960J1691j520k033P365J3896P737n092P229o180j3950
$$ 8206 19969 19124 6859 -6101 5590 4070 2037 9402 23298 31035 25943 33172 26992 13042
14395A3042P775O075Q293j7890j2158p237L69J803n71R809j3230j3095J1456J9160
$$ 13042 20817 26892 35185 17295 5137 -2100 -1731 72 -499 9310 -3920 -17015 -5559 13601
14381A3601K2580j2632M580j2892R026J3018k748j0813p804Q541j050j2210m90
$$ 13601 36181 23549 28129 15237 24263 37281 34533 23720 15916 24457 23407 11197 10707
14368A0707j991n766J6989j8157r877J06Q680J2355k141q874J1756o49k1338n438
$$ 10707 8716 2950 19939 1782 -8095 -7989 691 13046 10905 2031 13787 13138 -8200 -13638
14354a3638Q537O417K3674J5326k1233m37N082P07J2284K555j7431K469j55l226
$$ -13638 -5101 1316 24990 40316 19083 18646 23728 24435 36719 39274 21843 24312 24157 20931
14340B0931J4248L901Q440l412j4446j2242J089p628n180j7778j4970J1212K2098
$$ 20931 35179 39080 47520 44108 29662 17420 18509 10881 5701 -12077 -27047 -15835 6263
14327F263l688P76K6441Q48j7464r991O249q696j1914n146J267K0290J6585n914
$$ 6263 2575 3351 29792 30640 13176 3185 9434 738 -11176 -16322 -15055 5235 21820 15906
14313A5906J2535K3193o315n240M429m176p977k84j2407j9497j3832l371j331
$$ 15906 28441 51634 45319 40079 44508 40332 32355 32071 19664 167 -13665 -17036 -18367
14300a8367J4775J293j1521J4660P962l49r41J5648J7910j6084q997j303O483
$$ -18367 -3592 -2299 -13820 840 8802 8453 7512 23160 41070 24986 15989 14686 21169
14287B1169J2101k4110j4560O055K9180j0900k4771L257K6300l048j4363p148
$$ 21169 33270 9160 -5400 655 29835 18935 -5836 -2579 23721 20673 6310 -838
14275h38J946J7879N593J4926k2306j8317p442m326P827K3078M000j5194o644
$$ -838 1108 18987 24580 39506 17200 -1117 -8559 -12885 -5058 18020 22020 6826 182
14262A82L608J245J2787r977k03Q270K539k6933J0825O692m90j540p74J643J569
$$ 182 3790 5035 17822 7845 7642 15912 18451 -8482 2343 9035 8545 7005 6231 7874 9443
14247I443K994J0490r145N098J129L213n843R46M021j539q35J8349j551k4315
$$ 9443 12437 22927 13782 18880 20009 23222 17379 18325 22346 20807 19972 38321 36770 12455
14233A2455j8894Q265N901q229j492J0833n58r329q373L946O773L0433J8587r321
$$ 12455 -6439 1826 7727 -502 -1994 8839 8281 -1048 -9421 -5475 1298 31731 50318 40997
14219D0997r357M368N48j9478r036P504n040Q405k379K310j230p945J443J428
$$ 40997 31640 36008 36556 17078 8042 15546 10506 18911 16532 18842 17612 9667 11110 12538
14205A2538j2425r707J2389J8196q4j2104J8152J7417j1960j6806j0778n839j630
$$ 12538 113 -9594 2795 20991 20907 8803 26955 44372 32412 15606 4828 -1011 -2641
14192b641N090J3747P532J3701o784O762Q609j0732m516N525O660m260p579m363
$$ -2641 2449 16196 23728 37429 30645 37407 46016 35284 30768 36293 42953 38693 31114 26751
14178B6751P250M547j3888L11k15L711J2640L221K554L231j170j9976j9159L609
$$ 26751 34001 38548 24660 24971 24756 28467 41107 44328 46882 50113 48943 28967 9808 13417
14164A3417l388K713J0797M644j6300O134J3230k1078q834k354J0592P61M202
$$ 13417 10029 12742 23539 28183 11883 18017 31247 10169 1335 -1019 9573 10334 14536
14151A4536J2657j4563j2637R962L732Q427J6625p794r775j0847k0873L667J2715
$$ 14536 27193 12630 -7 9955 13687 22114 38739 30945 21170 10323 -10550 -6883 5832
14138E832k435j090K3498R609o836k984O115J1713J9534L194N28p185j4910O917
$$ 5832 3397 2307 25805 35414 28578 25594 31709 43422 62956 66150 66678 59493 44583 51500
14124E1500m604J930p472j429r916k260l055K051j271J3672K556j72l196p15p169
$$ 51500 46896 48826 41354 39925 30009 27749 24694 26745 25474 39146 41702 41530 38334 37619 30450
14109C0450p777m256K5973o487j1729J2043K043j3848m652M073J2914J3444j6857
$$ 30450 22673 18417 44390 37903 26174 38217 40260 26412 21760 25833 38747 52191 35334
14096C5334M372J35j7806Q789J0357Q336N684J2081P739o555K301J94J2184J3024
$$ 35334 39706 39841 22035 30824 41181 49517 55201 67282 75021 68466 70767 70961 83145 96169
14082I6169Q638J0516K2615L366L0173P696K8559L5644J1067k0602k309J4621
$$ 96169 104807 115323 137938 141304 171477 179173 207732 243376 254443 233841 231532 246153
14070B46153K1798L9129K818o455j925q692m639k73p246q760k551j7659p583j6874
$$ 246153 267951 307080 309898 303443 301518 292826 288187 287914 280668 271908 269357 251698 244115 227241
14056B27241Q90Q564r159j1414J3460J2669O089Q231j5683j72K831r124p826K4119
$$ 227241 228131 236695 227536 216122 229582 242251 248340 256571 240888 240716 243547 234423 226597 250716
14042B50716L0436K5403q60q637j0937j2447m074j8060l92l812j6863j0881L034
$$ 250716 281152 306555 305695 297058 286121 273674 269600 251540 251148 247336 230473 219592 222626
14029B22626p395j0613j9159l9362r779J2921j3241j218L362k1208o170k2517
$$ 222626 215231 204618 185459 146097 136318 149239 135998 134780 138142 116934 110764 88247
14017H8247j0323p175j5887p716K532L621M67K2815K585r517q896j2562J3808
$$ 88247 77924 70749 54862 47146 49678 53299 53766 76581 79166 69649 60753 48191 61999
14004F1999R931k0595j0924M559o714j792p532J7442L24O57j2247j4580O736J4263
$$ 61999 71930 51335 40411 44970 38256 36464 28932 46374 46698 47355 35108 20528 27264 41527
13990D1527R647J6411J2728Q164j3082q964J752L814L762O010j3845j6994J3941
$$ 41527 51174 67585 80313 88477 75395 66431 68183 71997 75759 81769 67924 50930 64871
13977F4871r166j2914k0099j6755K0668Q696L300J3266k1960n851J2344J3910
$$ 64871 55705 42791 22692 5937 26605 35301 38601 51867 29907 24056 36400 50310
13965E0310J5137k2140k3669o784J6379Q160K373L96M487J586Q255K163j3497
$$ 50310 65447 43307 19638 12854 29233 37393 39766 40162 44649 46235 54490 56653 43156
13952D3156L574R648j0455J220j6041j040K2938J9009J1620k007l199j479j1073
$$ 43156 46730 56378 45923 47143 31102 30062 53000 72009 83629 81622 78423 76944 65871
13939F5871J4919M806l283k2546k2757l813J9941J4988j8754j0191p257K690K498
$$ 65871 80790 85596 82313 59767 37010 33197 53138 68126 49372 39181 31924 34614 37112
13926C7112J1543Q587nm683J921J7909n006m278p572L109j265J877J6485O706
$$ 37112 48655 57242 57237 52554 54475 72384 67378 63100 55528 58637 57372 59249 75734 82440
13912H2440J2336m266k2363k7111K932K0171J0643R025P151m447K598p284j55
$$ 82440 94776 90510 68147 41036 43968 64139 74782 83807 90958 86511 89109 81825 81670
13899H1670O277m331k1320p432N254K1318m95M321k568L473j1724j1750j101J4014
$$ 81670 87947 83616 62296 54864 60118 81436 80941 85262 82694 86167 74443 62693 61592 75606
13885G5606R808o505O161k900K3397J7735N126j717j3777j4465j1355j467m98
$$ 75606 85414 78909 85070 82170 105567 123302 128428 126711 112934 98469 87114 85647 85149
13872H5149J678R154J8550O492m265J6208m761m987R989J915l704k846N888l955
$$ 85149 86827 95981 114531 121023 116758 132966 128205 123218 133207 135122 131418 128572 134460 130505
13858A30505q824j0991M507J3814K8699J6612O415j7783j9293m690m862j9519
$$ 130505 121681 110690 115197 129011 157710 174322 180737 162954 143661 138971 134109 114590
13846A14590J1002J3073O984j6465j3220j2455J6153J5454J260K2132J5836j4070
$$ 114590 125592 138665 145649 129184 115964 103509 119662 135116 136376 158508 174344 160274
13834A60274j5427k9134l286J8376J3808R20J476P385J6828N527l635k0951k7863
$$ 160274 144847 115713 112427 130803 144611 145531 147007 154392 171220 176747 173112 152161 124298
13821A24298J0749J0929j3273L008m437K444K3073J6437J255J320j7588j8735
$$ 124298 135047 145976 132703 135711 131274 133718 156791 173228 174483 175803 158215 139480
13809A39480j4765l213j0873j5315P386R564m116Q155J4461L0886Q133j7000P22
$$ 139480 124715 121502 110629 95314 102700 112264 108148 116303 130764 161650 169783 152783 153505
13796A53505r769n383j0789j5395K03Q591J394O384M920K3004n450j8256L371
$$ 153505 143736 138353 127564 112169 112372 120963 122357 128741 133661 156665 151215 132959 136330
13783A36330n68k918J2351j256J4019o348m548Q354r29k2204r463K8982J9324
$$ 136330 135762 132844 145195 143939 157958 151610 147062 155416 154487 132283 122820 151802 171126
13770A71126k225j7717J473j7104j1600K303J0049J2846Q279j2391j8693l5980
$$ 171126 168901 151184 152657 135553 123953 126256 136305 149151 157430 145039 126346 90366
13758I0366k790K2887K0959q824K045L494j2325K0033J0819O142p055o62k5241
$$ 90366 87576 110463 131422 122598 124643 128137 115812 135845 146664 152806 145751 145089 119848
13745A19848o330J0060L9929J705k3572L408J3286K789M509O049j5546o62J2739
$$ 119848 113518 123578 163507 165212 141640 145048 158334 161123 165632 171681 156135 155473 168212
13732A68212J7593J6311j6039j9435J0469N27R592k500J774J3067L0831J5527
$$ 168212 185805 202116 186077 166642 177111 177638 187230 184730 186504 199571 230402 245929
13720B45929N739K2686J5585P947p548j2918J4214K2774k0203j1308K30J5644
$$ 245929 251668 274354 289939 297886 290338 277420 291634 314408 294205 282897 283127 298771
13708B98771P679m788q58K3154J7073J3836J458n984L535J6765J2561K6810J0743
$$ 298771 306450 301662 300804 323958 341031 354867 356325 350341 353876 370641 383202 410012 420755
13695D20755J7542O935p617j3288M193J9606J9551l971l673R967K6403K5093J0585
$$ 420755 438297 445232 437615 424327 428520 448126 467677 463706 460033 470000 496403 521496 532081
13682E32081l277K3520J7707L817Q495L0400M4041L2009J479J8894K2247J8357
$$ 532081 528804 552324 570031 573848 582343 612743 656784 688793 690272 709166 731413 749770
13670G49770K1278M7359M5922M8821N0641M3409N0048M5504K4570N2433N6688
$$ 749770 771048 818407 864329 913150 963791 1007200 1057248 1102752 1127322 1179755 1236443
13659A236443N9295O9502N6294M9584Q5328R3017R1923Q4779R2655J30629J33209
$$ 1236443 1295738 1365240 1421534 1471118 1556446 1649463 1741386 1826165 1918820 2049449 2182658
13648B182658J50638J50302J60962K01921K22980K44253K64632K78851L17628
$$ 2182658 2333296 2483598 2644560 2846481 3069461 3313714 3578346 3857197 4174825
13639D174825L80830M09648M52720N03856N91075O84822P46126Q49300R76092
$$ 4174825 4555655 4965303 5418023 5921879 6512954 7197776 7943902 8793202 9769294
13630I769294J098263J254803J422183J623266J836992K077950K315036K552314
$$ 9769294 10867557 12122360 13544543 15167809 17004801 19082751 21397787 23950101
13622B3950101K771247K940901L111889L188205L173339L072743K822576K493423
$$ 23950101 26721348 29662249 32774138 35962343 39135682 42208425 45031001 47524424
13614D7524424K082667J610579J086868N81314Q9097l58429o97783r72060j175841
$$ 47524424 49607091 51217670 52304538 52885852 52974949 52616520 51918737 50946677 49770836
13605D9770836j310001j338407j307153j197369j041223q79888o84838m92046
$$ 49770836 48460835 47122428 45815275 44617906 43576683 42696795 42011957 41519911
13597D1519911k98543j30952P1317K88773M78283O83349Q51114J026818J173292
$$ 41519911 41221368 41090416 41161733 41450506 41928789 42612138 43463252 44490070 45663362
13588D5663362J277890J344168J324762J263086J078535Q11494M58097N0001m43981
$$ 45663362 46941252 48285420 49610182 50873268 51951803 52763297 53221394 53271395 52827414
13579E2827414r58164j468882j937352k372838k758036l021557l167816l198433
$$ 52827414 51869250 50400368 48463016 46090178 43332142 40310585 37142769 33944336
13571C3944336l173502l063468k870994k643755k424203k178891j911248j678234
$$ 33944336 30770834 27707366 24836372 22192617 19768414 17589523 15678275 14000041
13563A4000041j490775j312468j138569r85690q73147p76418p17286o21229n40747
$$ 14000041 12509266 11196798 10058229 9072539 8199392 7422974 6705688 6084459 5543712
13554E543712m61031m25965l86393l34669l02256k82703k31613k10995k02014
$$ 5543712 5082681 4656716 4270323 3935654 3633398 3350695 3119082 2908087 2706073
13545B706073j83200j58392j57496j35244j11233j01296p3701j01142q8598q3755
$$ 2706073 2522873 2364481 2206985 2071741 1960508 1859212 1785511 1684369 1595771 1512016
13535A512016p0575p5982q8213n8460l3043m5933n3602m4811l9908k3225l8779
$$ 1512016 1441441 1365459 1277246 1218786 1185743 1139810 1086208 1041397 1001489 978264 939485
13524I39485k6497j9323j5706n2436k8357k0345k0977k2608k0417j3419k1047
$$ 939485 912988 893665 877959 825523 797166 776821 755844 733236 712819 699400 678353
13513F78353l9569k4368l4300o485R529j9325k3983j4425k0283j6003p509k3576
$$ 678353 638784 614416 580116 573631 583160 563835 539852 525427 505144 489141 481632 458056
13501D58056N72k2022j1749k019j6699k676O472K066J6777K5493j2987l7138k2341
$$ 458056 458628 436606 424857 422838 406139 403463 409935 412001 428778 454271 441284 404146 381805
13488C81805N035m497Q281q505r731K3247n802j4375j5080j877j2726K3927O846
$$ 381805 386840 382343 390624 382119 372388 395635 389833 375458 360378 358501 345775 369702 376548
13475C76548k6369m2819j4266o710q290m494J2389J5428M064n355N068K146N631
$$ 376548 350179 307360 293094 286384 278094 273600 285989 301417 305481 300126 305194 307340 312971
13462C12971o314r605j3993R820L372J4342N571n904j0241l3308j3161J6540M558
$$ 312971 306657 297052 283059 292879 296251 310593 316164 310260 300019 266711 253550 270090 274648
13449B74648k0651k411j3227J5409L128l015k6293j2156q811r692j3184j5330
$$ 274648 253997 251586 238359 253768 256896 253881 227588 215432 206621 196929 183745 168415
13437A68415r232j0499J1807R460P455K374o219j3049o504L254k7j9639m917k328
$$ 168415 159183 148684 160491 169951 177406 179780 173561 160512 154008 157262 157235 137596 132679 130351
13423A30351j2073J4063P532j5430k5078m725N652R65j2310k4441l239J2162q069
$$ 130351 118278 132341 139873 124443 99365 94640 100292 101257 88947 64506 61267 73429 65360
13410F5360j1152o081K831J6110J6859p728k511J3621j0871n082J373m639o685
$$ 65360 54208 48127 50958 67068 83927 76199 73688 87309 76438 71356 72729 68090 61405
13397F1405o867P430Q623Q856j0948J564N381j3717J880o596J3101q302r484k0037
$$ 61405 54538 61968 70591 79447 68499 70063 75444 61727 63607 57011 70112 61810 52326 32289
13383C2289n05Q023K591O724p038j0330L297J0215p469m604p910p411l078j1075
$$ 32289 31784 39807 42398 49122 42084 31754 35051 45266 37797 33193 25283 17872 14794 3719
13369C719j3263P271L723J8061P016p845K0432K994j6171o614J1204j6339J3639
$$ 3719 -9544 -2273 1450 19511 26527 18682 39114 42108 25937 19323 30527 14188 27827
13356B7827j154J1812o994k4245L930L4395j204o761J4128j1217o24K711L849
$$ 27827 26673 38485 31491 7246 11176 45571 44367 37606 51734 40517 39893 42604 46453
13343D6453O649p044r64M553J0489P477r412r995q004O190J4658j1440j1253q918
$$ 46453 53102 46058 45094 49647 60136 67613 58201 48206 40202 46392 61050 49610 38357 29439
13329B9439J0976m77J372n921L241M736l182m875o600J430O670R480p05O789n022
$$ 29439 40415 39938 41310 35389 38630 43366 40184 35309 28709 30139 36809 46289 45584 52373 47351
13314D7351q524R043q212o464q092Q145P652j1750m075K5898L248r358j085j6891
$$ 47351 38827 47870 39658 33194 25102 33247 40899 29149 25074 50972 54220 44862 43777 26886
13300B6886j114K941L969M023J7914k204j6474J3812J5555k0517r05J1853N731
$$ 26886 25772 28713 32682 36705 54619 52415 35941 49753 65308 44791 43886 55739 61470
13287F1470J9087M200q108P252L179j6479R536J8171j1454j8661J0341P911k7277
$$ 61470 80557 84757 76649 83901 87080 70601 80137 98308 86854 68193 78534 86445 59168
13274E9168k2795N662p391r406l645O335L229m98k327p136R025J5357m968K626
$$ 59168 36373 42035 34644 25238 21593 27928 31157 30659 28332 21196 30221 45578 40610 43236
13260D3236J2939j6209j7180L167l827R211L804j2937p765M2126O006J0436M420
$$ 43236 56175 39966 22786 25953 22126 31337 35141 22204 14439 56565 62571 73007 77427
13247G7427r564j9454o297k2355n988K314R876K746o489K716n158J1352J1743
$$ 77427 67863 48409 42112 19757 13769 16083 25959 28705 22216 24932 19774 31126 42869
13234D2869K729J0208J2073j1418n189l384O914n277k8932j5742r542Q047J9315
$$ 42869 45598 55806 67879 56461 51272 47888 54802 49525 20593 4851 -4691 3356 22671
13221B2671O461m661J5571J5964j8469k3723L167K0029r107p663o069P325K2726
$$ 22671 29132 24471 40042 56006 37537 13814 16981 37010 27903 20240 14171 21496 44222
13208D4222l239o531M029r770m83p58q8Q93o834J1632J1147J2810R753k41J729
$$ 44222 40983 34452 38481 28711 28228 27470 27382 28275 21441 33073 44220 57030 66783 66542 68271
13193F8271j8286j1341p653J1673P989l075J2479P59J77j3737j3898Q21J6719
$$ 68271 49985 38644 30991 42664 50653 47578 60057 60816 60993 47256 33358 34179 50898
13180E0898n622j2007j1435O98J1041N346R929P775j1859J288L169J5106J3878
$$ 50898 45276 33269 21834 22532 33573 38919 48848 56623 44764 46052 49221 64327 78205
13167G8205K5364Q07k532J3679K6506M522j202P977K8025K820Q501N829K9163
$$ 78205 103569 104376 101844 115523 142029 146551 145349 153326 181351 184171 192672 198501 227664
13154B27664O758n808J8331L3359N910J3945K2274J0492k1495p869r871n661J757
$$ 227664 234422 228614 246945 280304 286214 300159 322433 332925 311430 303561 293690 288029 289786
13141B89786n230j644K5622J3622q220l7354k3026o033J0270l844j4132L304J2617
$$ 289786 284556 282912 308534 322156 313936 276582 253556 247523 257793 253949 239817 243121 255738
13128B55738p15K725j230J4479l094m742M812J0986N958O183M53n192l27K985
$$ 255738 255023 257748 256518 270997 267903 263161 267973 278959 284917 291100 291553 286361 286034 289019
13114B89019k22l5524k8801j1981n014j0484l1295j4081l172j4116n891p55m290
$$ 289019 288797 253273 224472 212491 207477 196993 165698 151617 148445 134329 128438 127683 123393
13101A23393j1298j0867k6900m04k0808J885n012kL429k368J1878j3160j803n498
$$ 123393 112095 101228 74328 73924 53116 55001 49989 49987 53416 51048 62926 49766 47963 42465
13087D2465J1576Q669j2981k4471j5030J0323J0820j3606j7689K0673K5960n122
$$ 42465 54041 62710 49729 25258 10228 20551 31371 17765 76 20749 46709 41587
13075D1587L213J2J2584k09J7578K1891j3973k4697k1094L796J903n471j8820
$$ 41587 44800 44812 57396 57187 74765 96656 82683 57986 36892 40688 42591 37120 18300
13062A8300J5K3065J1394n575p244j948P007j0040p489M92O272j4334n310L027
$$ 18300 18315 41380 52774 47199 39955 38007 45014 34974 27485 27977 34249 19915 14605 17632
13048A7632m058K712J7123J7810q338j1667k939M056J0301J4370r717k6553k8348
$$ 17632 13574 16286 33409 51219 42881 31214 28275 32331 42632 57002 47285 20732 -7616
13035g616j2087J4633O626p627J311k550J371j303j1128K1750L2037K730j106
$$ -7616 -19703 -5070 1556 -6071 -4760 -7310 -5939 -7242 -18370 3380 35417 38147 37041
13022C7041J390j5855R779O778n596k4292j0363K155J2747N079P561K219o301
$$ 37041 38431 22576 32355 39133 33537 9245 -1118 1037 13784 18863 26424 28643 22342
13009B2342n839q740P476J2533M858j4603j2323j6237L377M076j0948m525K5553
$$ 22342 16503 7763 15239 27772 32630 18027 5704 -10533 -7156 -3080 -14028 -18553 7000
12996G000J6729Q962n729r005J4925L770k8400k8828m987K0361J1217K2367K010
$$ 7000 23729 32691 26962 17957 32882 36652 8252 -20576 -25563 -5202 6015 28382 30392
12983C0392k1844l968M473J421K924p155J1935R844n821J0906Q864k791k677N933
$$ 30392 8548 4580 9053 10474 13398 6243 18178 28022 22201 33107 41971 39180 36503 42436
12969D2436J3745M512p842k1688Q405J1302k216j0061j4310K489k309R332L0654
$$ 42436 56181 60693 52851 31163 39568 50870 48654 38593 24283 26772 24463 33795 64449
12956F4449K369M385K0651P401j3341o735N182j2635J865R14j1802J3709J3142
$$ 64449 66818 71203 91854 99255 85914 79179 84361 71726 73591 74505 62703 76412 89554
12943H9554o264r479o729K118K116K297m115r492N779R386j4289j5699J3601J6909
$$ 89554 83290 73811 67082 69200 71316 73613 69498 60006 65785 75171 60882 45183 58784 75693
12929G5693K9451L0422K5278K1672M7937N4280N1818R5164J32788J48189J65370
$$ 75693 105144 135566 160844 182516 230453 284733 336551 431715 564503 712692 878062
12918H78062J97643K18613K20429Q4344l9362r474n010j11134k10865j82585j47877
$$ 878062 1075705 1294318 1514747 1599091 1559729 1550255 1545245 1434111 1223246 1040661 892784
12907H92784j62840j58618j48490j12513o6848m5965k9133j2516n387k2854k4670
$$ 892784 729944 571326 422836 310323 243475 197510 168377 155861 150474 127620 102950
12896A02950J53J296p047j2007j3320j1842O204q3j0509k773R96M530j9202k2209
$$ 102950 103103 104399 97352 85345 72025 60183 66387 66304 55795 53022 54018 58548 39346 17137
12882A7137j1972K8118K7029l220k0554j2367Q897J5734J7043j567J962j8561
$$ 17137 5165 33283 60312 57092 36538 24171 33068 48802 65845 64278 66240 47679
12870D7679j2586l841n222q004k739J0549P597J4324j0485l437M192O257J9156
$$ 47679 35093 31252 26030 18026 15287 25836 33433 47757 37272 33835 38027 44284 63440
12857F3440k326q179j4011l810L201J0509J8592j1822j1372K609J21J3116J0547
$$ 63440 61114 52935 38924 35114 38315 48824 67416 55594 44222 46831 46952 60068 70615
12844G0615K111j7049j0431J5432K6753j3109j04K4363N658L905l5596p137J1581
$$ 70615 72726 55677 45246 60678 87431 74322 74218 98581 104239 108144 72548 65411 76992
12831G6992m669p868r17M225o88p294J466L721j0471R91N546p372k308J3131r11
$$ 76992 72323 64455 63538 67763 67075 59781 61247 64968 54497 55488 61034 53662 51354 64485 63574
12816F3574J2389K646j2780q140J5194K8293L1706N464n154o647J0052J9812K1399
$$ 63574 75963 78609 65829 57689 72883 101176 132882 138346 133192 126545 136597 156409 177808
12803A77808K0485L7906L1332p660l285K3595p762n4324m1508j2488j1301j2635
$$ 177808 198293 236199 267531 259871 256586 280181 272419 218095 176587 164099 152798 140163
12791A40163l3718j0337n839j2370k3710j0657J580R251P402k552K351J450J7946
$$ 140163 106445 96108 90269 77899 54189 43532 45112 54363 61765 59213 61564 63014 80960
12778H0960l01M822J6397J6476J1258J6001J8054J4707Q438K7527r462k1733P558
$$ 80960 80659 85481 101878 118354 129612 145613 163667 178374 186812 214339 204877 183144 190702
12765A90702j8985j0371n62o764q794R801r861J006Q465n601r437J7581m889j0028
$$ 190702 171717 161346 160784 154020 145226 155027 145166 146172 154637 149036 139599 157180 152291 142263
12751A42263j0110P15J1724O496Q471o49k373N65R624J7969Q033Q17j2190j1443
$$ 142263 132153 132868 144592 151088 159559 158910 156537 157102 166726 184695 192728 193545 181355 169912
12737A69912j110K560M511J7769j345J0545J4739O642J0726L481J158k228J0009
$$ 169912 168802 171362 175873 193642 192297 202842 217581 224223 234949 238430 239588 237360 247369
12724B47369j1651q141J598J0279Q488J2135M866k1161j4360o47Q389K134M535
$$ 247369 235718 227577 229175 239454 247942 260077 264943 243782 229422 228775 237164 239298 243833
12711B43833K917m44m439j2521o816q013j3634r255j2678J5155r328p749M172
$$ 243833 246750 246306 241867 229346 222530 214517 200883 191628 178950 194105 184777 177028 181200
12698A81200K2493K744k840j8604j7188n741M614n599R749P236o629j0174j3501
$$ 181200 203693 206437 203597 184993 167805 162064 166678 161079 170828 178064 171435 161261 147760
12685A47760M666N494j243k207P850K752p71J0613K4242K3574L0771J0828l904
$$ 147760 152426 157920 156677 154470 162320 165072 164301 174914 199156 222730 253501 264329 260425
12672B60425o289q784J7177L27K249j8818o461J3890Q66l980N350K910j8078j5497
$$ 260425 254136 245352 262529 262856 265105 246287 239826 253716 254582 250602 255952 258862 240784 225287
12658B25287J70K01j404o118j1335r759j2602k3526K3880q146l2843M274J1255
$$ 225287 225457 225658 224254 218136 206801 197042 184440 160914 184794 176648 143805 148079 159334
12645A59334j7014K316J2001J8503p257M713L0769J5487J19j130K1748J4593n857
$$ 159334 142320 144636 156637 175140 167883 172596 203365 218852 218971 217841 239589 254182 248325
12632B48325O207K078q005l2242j8667k4422k133k0984k6956k9825l8946n157
$$ 248325 254532 256610 248605 216363 197696 173274 171141 150157 123201 93376 54430 49273
12620D9273J1694N75k3381k269J5073J5493J4251K3598K4819K1525J9827M533
$$ 49273 60967 61542 38161 35892 50965 66458 80709 104307 129126 150651 170478 175011
12608A75011K2429P370j3622J0596J7734K040L606j22O1m060j4884J4954N5271
$$ 175011 197440 204810 191188 201784 219518 221558 225164 225042 225103 221043 206159 221113 276384
12595B76384M1661K7268K5545L2279J8237P476m647k8956j8027J8001Q458K639
$$ 276384 318045 345313 370858 403137 421374 428850 424203 395247 377220 395221 403679 406318
12583D06318q02P190R603N158J2385L895o894q287j1073j1166o201P083P000J8176
$$ 406318 405516 412706 422309 427467 439852 443747 436853 428566 417493 406327 400126 407209 414209 432385
12569D32385j356l764m343J6816J1738O350J2462J6096K1096J6595L2619q6J599
$$ 432385 431029 427265 422922 439738 451476 457826 470288 486384 507480 524075 556694 556608 558207
12556E58207J3299R368O855K884J4265J9086R88R465R458J6492n068L3691K5703
$$ 558207 571506 580874 587729 590613 604878 623964 624952 634417 643875 660367 655299 688990 714693
12543G14693K8908K1760P309K3924J1952j2741R414K2187L5546L4629K7807K6338
$$ 714693 743601 765361 772670 796594 808546 795805 805219 827406 862952 897581 925388 951726
12531I51726L9226M1419M0491L9805N2415L0150M1774M2293L0680M1699P1951
$$ 951726 990952 1032371 1072862 1112667 1165082 1195232 1237006 1279299 1309979 1351678 1423629
12520A423629P2242N6850N9695O8056Q5378J02883Q1024Q0949R6963R5948J11174
$$ 1423629 1495871 1552721 1612416 1680472 1765850 1868733 1949757 2030706 2127669 2223617 2334791
12509B334791J28129J43341J44208J48568J62625K00857K33786K15521K21221
$$ 2334791 2462920 2606261 2750469 2899037 3061662 3262519 3496305 3711826 3933047
12500C933047K58668K67842K62698L13427L67111L90781M29076M92541N83403
$$ 3933047 4191715 4459557 4722255 5035682 5402793 5793574 6222650 6715191 7298594
12491G298594O72268P96744R37780J092615J280498J529014J846944K297224K895337
$$ 7298594 7970862 8767606 9705386 10798001 12078499 13607513 15454457 17751681 20647018
12482B0647018L703740M837617O490376R167900J3409570J9543504K6808134L1304069
$$ 20647018 24350758 29188375 35678751 44846651 58256221 77799725 104607859 135911928
12474A35911928L1048231L3521763M2504298L9154911J3053637n215160J982674
$$ 135911928 166960159 200481922 242986220 282141131 295194768 289979608 291962282
12467B91962282J708913k4899718m5182328l9047462k9028600k9720419l0900438
$$ 291962282 293671195 268771477 223589149 184541687 155513087 125792668 94892230
12460I4892230k5192656j7470332j1801705q192716n892862m421889l417908k650659
$$ 94892230 69699574 52229242 40427537 32234821 26341959 21920070 18502162 15851503
12452A5851503k100786j672556j355335j123541r26551p84570o94603o30835n61641
$$ 15851503 13750717 12078161 10722826 9599285 8672734 7888164 7193561 6562726 6001085
12443F001085n08069m43002l84837l51677l31879k76813k39562j97065j67755
$$ 6001085 5493016 5050014 4665177 4313500 3981621 3704808 3465246 3268181 3100426
12434C100426j43171j48888j33442j25977j10620r1474j12472q3581q4688q9804
$$ 3100426 2957255 2808367 2674925 2548948 2438328 2346854 2234382 2150801 2066113 1976309
12424A976309n9902q0686n5517n3120n4509m7054p4784o6931m8354l6369l6461
$$ 1976309 1916407 1835721 1780204 1727084 1672575 1625521 1550737 1483806 1435452 1399083 1362622
12413A362622l3082k2608k5624l4191m6154m2196l9782m0079k1841l2142l6897
$$ 1362622 1329540 1306932 1281308 1247117 1200963 1158767 1118985 1078906 1057065 1024923 988026
12402I88026l6479j0671j9419n9057l8244j7352j2662j0157j103l7714l0404k9786
$$ 988026 951547 940876 921457 862400 824156 806804 794142 783985 782882 745168 714764 684978
12390F84978n945k2314m1249r255l890j6070o631j7570l3437j9892j1265O195
$$ 684978 679033 656719 615470 606215 602325 586255 579624 562054 528617 508725 497460 503655
12378E03655l931l0977l0107Q105L391o138J4087j3507k615J1147j7551q636q375
$$ 503655 499724 468747 438640 446745 450136 443998 458085 444578 441963 453110 435559 426923 418548
12365D18548K08j9384m0678l0268j6737j5704j8576M990m404K0748R975K0078
$$ 418548 418756 399372 358694 328426 311689 295985 277409 282399 277995 298743 308718 328796
12353C28796L5875L2161K4314J5638L3982P734L3733L7600M9581M2513P732J036
$$ 328796 364671 396832 421146 436784 470766 478500 512233 549833 599414 641927 649659 650695
12341F50695K4593K525k7294k9184r968o829m2525q0524l8955j7948l5268j3898
$$ 650695 675288 677813 650519 621335 611367 604538 562013 481489 442534 424586 389318 375420
12329C75420k1747l0404J0872L3781Q023j8178k630K1266m028k0994o589j3538
$$ 375420 353673 323269 334141 367922 375945 357767 355137 376403 372375 351381 344792 331254
12317C31254j6041m403j0558k2416r055o725n027k5528l3590l3419J678L47k5512
$$ 331254 315213 310810 300252 277836 268781 262056 257029 231501 197911 164492 166170 166517 141005
12304A41005k4831p166P538J8266l424j8725Q966J4757J1862O525N026J3798k5845
$$ 141005 116174 109008 116546 134812 131388 112663 121629 136386 148248 154773 159799 173597 147752
12291A47752j8539j22R277k3909k7774m309K476j7620l2382j6786J1992J3556
$$ 147752 129213 129091 138368 114459 86685 82376 84852 67232 34850 18064 30056 43612
12279D3612j3734o570k1686j7849j746M942j6554L498J8713J0344k183r525K7069
$$ 43612 29878 23308 1622 -16227 -17973 -13031 -29585 -26087 -7374 2970 787 -8738 18331
12266A8331P945j4350M935o628P611R040N146L6394L944r433J2746j3793j1729
$$ 18331 26276 11926 16861 10233 17844 26884 32030 68424 72368 62935 75681 61888 50159
12253E0159q54J6161n441Q614J6669n791r736j6790j3828Q923J3729J1325r257
$$ 50159 49305 65466 60025 68639 85308 79517 69781 52991 39163 48086 61815 73140 63883
12240F3883j7430N085j6089j1490m799K808J43j034o992j3138j5040j4633N893
$$ 63883 46453 51538 35449 23959 19160 21968 22111 21077 14085 947 -14093 -28726 -22833
12227b2833L5285K0928j944j5467K8831J7357j7018j166R45j0421j5219j1874
$$ -22833 12452 33380 31436 15969 44800 62157 45139 43973 44918 34497 19278 7404
12215G404M646j9248N185L3358J1266j919Q46L751J1913L265M56j5682p088k15
$$ 7404 12050 -7198 -2013 31345 42611 40692 41538 45289 57202 60467 60923 45241 38153 37938
12201C7938n163j2151k3121j2013N79R356R740Q280J1221j6528K420N38O21M410
$$ 37938 32775 20624 -2497 -14510 -13931 -4575 5165 13445 24666 8138 10558 11096 11717 16127
12187A6127K378O991m278l769Q351P394o492J246k734r935P283j288l6015j2772
$$ 16127 18505 25496 21218 17449 25800 33194 26702 27948 25214 15279 22562 21274 -14741 -27513
12173b7513P697K1307O227j1925K348L047J4238L3563N630N118J0911M454J8955
$$ -27513 -19816 1491 7718 -4207 -1859 1188 15426 48989 54619 59737 70648 75102 94057
12160I4057k932j3264j2734k1978q235M400O897J7095p637M473k85K049n829R461
$$ 94057 91125 77861 65127 43149 34914 39314 46211 63306 55669 60142 59857 61906 56077 65538
12146F5538R002j1973q926J3947P061N284j9735k098M043j0841j9175K912j617
$$ 65538 74540 62567 53641 67588 74649 79933 60198 58100 62143 51302 32127 35039 33422
12133C3422j555J1484j0374l739K5932r885j0777J2474R638J2475j2883P546r264
$$ 33422 31867 43351 32977 29238 55170 45285 34508 46982 56620 69095 56212 63758 54494
12120E4494j2871k1464J6927J8151k091p343j21N437j8844j8531M1o326L4385
$$ 54494 41623 20159 37086 55237 53146 45803 45682 51119 32275 13744 13785 7459 41844
12107D1844P956k6749j3160p381J4759K611k0437j927L994O981J9135Q36j753
$$ 41844 49800 23051 9891 2510 17269 19880 -557 -2484 1510 8491 27626 28462 26709
12094B6709m916m1Q750J204j801M31J214J1928K0392j1883q645J1432j2813k0022
$$ 26709 21793 21752 30502 31706 29905 30336 31550 43478 63870 51987 43342 54774 41961 21939
12080B1939O39L433j654p273J0997N296k234j1766o423j6499J013K1670M709R071
$$ 21939 22578 26011 24357 17084 28081 33377 31143 19377 12954 -3545 -2532 19138 23847 32918
12066C2918J443n548j0183q630J2314L2486J6533j4371k753L112P873J1456L555
$$ 32918 34361 28813 18630 10000 22314 54800 71333 56962 54209 57321 65194 76650 80205
12053H0205j9735p760m024L721M745r809k059j1400k43Q694P468J8870l795j0048
$$ 80205 60470 52710 48686 52407 57152 47343 45284 33884 33641 42335 49803 68673 64878 54830
12039E4830J3901K7030M867P874j0060q686M992J8374l688K5667K6606K9560L3267
$$ 54830 68731 95761 100628 108502 98442 89756 94748 113122 109434 135101 161707 191267 224534
12026B24534P7819J23030J48523J71864J70305J79897K16283K06137P6716j7739
$$ 224534 302353 425383 573906 745770 916075 1095972 1312255 1518392 1595108 1577369
12016A577369J6845O317j33901k44453k20215j68026j54064j52846j45366j21248
$$ 1577369 1594214 1600531 1466630 1222177 1001962 833936 679872 527026 381660 260412
12006B60412o4179n2542j4069k8886l1196q873m597j0818j8125m299j2578p578
$$ 260412 196233 143691 129622 100736 69540 60667 56070 45252 27127 22828 10250 2672
11994B672j8595k73O00J5094J7826L348J3368K0982l143j0630k1252j5028j8469
$$ 2672 -15923 -16196 -15596 -502 17324 20672 34040 55022 51879 41249 19997 4969 -13500
11981a3500m2K6448J978j0698J4273k690J0010p614k598J8070J7256m621L871
$$ -13500 -13542 12906 14884 4186 18459 15769 25779 18165 15567 33637 50893 46272 50143
11968E0143j633j68o458m1Q294J506j2635M064K8183k928k5765k5892j5320j863
$$ 50143 48510 48342 41884 41843 50137 51643 39008 43072 71255 68327 42562 16670 1350 -513
11954e13n956k612p143p947Q583K0054j6594j0290N021L2531J5667j0144R53J4513
$$ -513 -6469 -9081 -16224 -24171 -15588 4466 -12128 -22418 -17397 15134 30801 20657 21610 36123
11940C6123R344j2273k2662j969Q830j1129j6484P778l942M967J773J3837O32
$$ 36123 45467 33194 10532 8563 17393 6264 -10220 -2442 -6384 -1417 356 14193 14825
11927A4825j425N413k200m505m72j2281k3394O126K0172J8506J3050m249j4218
$$ 14825 13400 18813 16613 12108 11636 -645 -24039 -17913 2259 20765 33815 29566 15348
11914A5348j7939J713M778O922n498J1926R638j5713R190J5758R05m082j5304
$$ 15348 -2591 -878 3900 10822 5324 17250 26888 11175 20365 36123 37028 32946 17642
11901A7642j4537l112j5590Q985j526P215L035j5441j0136R012J5395p224k4451
$$ 17642 3105 -7 -15597 -6612 -8138 -923 2112 -13329 -23465 -14453 942 -6282 -30733
11888c0733R853R906J5465P456j2694j4952O514Q09n99J7015J5244j2949j5259
$$ -30733 -20880 -10974 4491 11947 -747 -15699 -9185 -8376 -8975 8040 23284 10335 -4924
11875d924p329J4692P870j0112j5653r731J4297O584m942j5140j2431P805K7112
$$ -4924 -12253 2439 10309 197 -15456 -25187 -10890 -4306 -9248 -24388 -36819 -29014 -1902
11862a902K4114l50r523J015j8779J8876j3869J6492J6923k703j1765j0006j5139
$$ -1902 22212 21862 12339 13354 -5425 13451 -418 16074 32997 30294 18529 8523 -6616
11849f616l001L2748j553k4949P555M88p56J0991J1168M181O912J5709P832j0853
$$ -6616 -9617 23131 21578 -3371 4184 4672 3916 14907 26075 30256 37168 52877 60709 49856
11835D9856K47j1342r871j8935L635o139j931k108n982m866Q101k4221k0964J336
$$ 49856 50103 38761 28890 9955 13590 7451 5520 3412 -2570 -7436 665 -23556 -44520 -43184
11821d3184J5603k340J064J7274Q581n355r873N382J1976K14Q023N367j2920L258
$$ -43184 -27581 -29921 -28857 -11583 -3002 -8357 -18230 -12848 -872 -658 7365 12732 -188 3070
11807C070O818q22J0909K4677r995j2365j6698j4329m300k00p878j6559j2556
$$ 3070 9888 9066 19975 44652 34657 22292 5594 -8735 -13035 -13235 -21113 -37672 -50228
11794e0228l9J3082K6926K1403n052q770J2429j0903j1743n171J5645K3519m046
$$ -50228 -50267 -37185 -10259 11144 6092 -2678 9751 -1152 -12895 -18066 -2421 21098 17052
11781A7052j3760n21R238n471o68K36P754J4246k406J247j663j1177j8457j8684
$$ 17052 3292 2771 12009 6538 5870 6106 13860 28106 25700 26947 25284 14107 -4350 -23034
11767b3034J2447J74m262j6697R094J3954L208J8076L901J2584p323j2509j2410
$$ -23034 -10587 -10413 -14675 -31372 -22278 -8324 -5116 12960 16861 29445 22122 9613 -2797
11754b797j0304J3887P763J0432K848n172j2438P786l963k2731j554M043J2952
$$ -2797 -13101 786 8549 18981 21829 16657 4219 12005 8042 -14689 -16243 -12200 752
11741G52J6307N08k483j8228j0579O368J6294p145j677K099k3919l045K806j4716
$$ 752 17059 17567 15084 -3144 -13723 -7355 8939 1794 117 2216 -21703 -24748 -21942 -36658
11727c6658J9974K7665n736j2931k253N00J8933P846j7800p478q616Q542J1290
$$ -36658 -16684 10981 5245 -7686 -9939 -9439 9494 17340 -460 -7938 -16554 -8012 3278
11714C278R971o740L414O765k780k769j1612L66j0509q97J9541p400N59k548m446
$$ 3278 13249 6509 9923 16688 13908 11139 -473 -107 -10616 -11513 8028 628 1187 -1361 -5807
11699e807N951j737o589k3859J6907L763n024J1700q882K487Q487R86M542M040
$$ -5807 144 -1593 -8182 -32041 -15134 -11371 -16395 -4695 -13577 -11090 -2603 -1617 2925 6965
11685F965k4792N229k179M044L757m144R936J6989j072j8318J2507J8446P429
$$ 6965 -17827 -12598 -14777 -10733 -6976 -11120 -1184 15805 14733 -3585 8922 27368 34797
11672C4797k612k0006j3043j4847q922J3775J1144m117n152o97r725J0651L245
$$ 34797 32185 12179 -864 -15711 -24633 -10858 286 -3831 -8983 -9680 -19405 -8754 -5509
11659e509K4732R093j2174q341j1493J3528k3002j0522J7295j155P923O789l160
$$ -5509 19223 28316 16142 7801 -3692 9836 -13166 -23688 -6393 -7548 375 7164 4004
11646D004J216K340n373N411k1325q805J2884J0563L884k097L762J3768J196j0000
$$ 4004 5220 7560 2187 7598 -13727 -22532 -9648 915 4799 2702 6464 20232 21428 11428
11632A1428n965R356j2982r195J8596j424Q254m87L580j5079j8437N100P582k097
$$ 11428 5463 14819 1837 -7358 11238 9814 18068 17581 21161 6082 -12355 -7255 327 -1770
11618a770m432r612l0206j6051Q561J7936o7k3025J0952J7921J8678o288M189
$$ -1770 -6202 -15814 -46020 -62071 -53510 -35574 -35641 -58666 -47714 -29793 -11115 -17403 -13214
11605a3214j8526r939R826Q588P222N429L07M699j3895p45J8314o984r673j353
$$ -13214 -31740 -41679 -31853 -23265 -16043 -10614 -10307 -5608 -19503 -20248 -1934 -8918 -18591 -19944
11591a9944j625o388J2369P453m88P384q75P179k656k0949O421J1970J3195j3391
$$ -19944 -21569 -27957 -15588 -8135 -8623 -1239 -2114 5065 2409 -18540 -12119 -149 13046 -345
11577c45j533k2p955N446K1052M447l3377K913L0112r132j986m601l862j8213
$$ -345 -1878 -1900 -9855 -4409 16643 21090 -12287 -9374 20738 11606 9620 5019 1157 -17056
11563a7056k8620k0039J0624K3701N748J0159m407j2555K3511K5036j6520o263
$$ -17056 -45676 -65715 -55091 -31390 -25642 -15483 -19890 -32445 -8934 16102 -418 -6681
11551f681k655K86L635l089j529q105q867q369k252Q768K0686M483l180N97j633
$$ -6681 -9336 -9050 -5415 -8504 -10033 -18138 -27005 -35374 -37626 -28858 -8172 -3689 -6869 -6272 -7905
11536g905K3729n855j7741k5502o361O993N05j556j9415K2922J5909L160m124
$$ -7905 15824 9969 -7772 -33274 -39635 -32642 -32137 -33693 -53108 -30186 -14277 -11117 -15241
11523a5241K47J0450K679j2915q258r168Q156O794N957K0520j721j0806k2678
$$ -15241 -14994 -4544 -1865 -14780 -23038 -32206 -24050 -17256 -11299 9221 7500 -3306 -25984
11510b5984q379J3645P796L541k054j873J6005J0360k755r433r353O574J4625
$$ -25984 -34363 -20718 -12922 -9381 -11435 -13308 2697 13057 10302 869 -8484 -1910 12715
11497A2715k202j5874k7645J6450J6355J7367K0292L99j7498k2950j9224N755
$$ 12715 10513 -5361 -33006 -16556 -201 17166 37458 37857 20359 -2591 -21815 -16060
11485a6060J7799k966K978N432L429J1005o950J1401j0832l1961J503K3408K6143
$$ -16060 1739 -1227 1751 7183 10612 21617 14667 26068 15236 -16725 -15222 8186 34329
11472C4329j4025k0286k3574K2600O508n180J798N363L015L010r965l777k0167
$$ 34329 20304 18 -23556 -956 5552 372 2170 7533 10548 13558 3593 -184 -20351
11459b0351o834n566P388J9590J5859j5672j3538M016K6762l735j1113j0162J2493
$$ -20351 -27185 -32751 -25363 -5773 10086 -5586 -19124 -15108 11654 7919 -3194 -13356 -863
11446h63j662r219J5744O238j3888l909k956M837R04j032j9201J589L0335K329
$$ -863 -2525 -11744 4000 10238 -3650 -7559 -10515 -5678 -4774 -5806 -25007 -23418 6917 9246
11432I246n857j2621L768J7250k199j0502k370K523j5994L756J8332K709J2375
$$ 9246 3389 -9232 -5464 11786 9587 -915 -3285 -762 -16756 -13000 5332 8041 20416
11419B0416P53j2933k0352q069P884P618j2612j5948l697N002J8780n760j1808
$$ 20416 21169 8236 -12116 -20185 -12301 -4683 -17295 -33243 -36940 -31938 -13158 -18918 -30726
11406c0726o328m843J0135J4456N936M97p155j1371K000J0344j14q691K0692M526
$$ -30726 -37054 -41897 -31762 -17306 -11370 -10873 -18028 -29399 -27399 -17055 -17169 -25860 -5168 -642
11392f42k555j5995j1417K1446K3877r032o343J688J7592n634j2151j0334j5925
$$ -642 -3197 -19192 -30609 -9163 14714 5682 -661 1027 18619 12985 834 -9500 -25425
11379b5425K30P262J0761j4127R682J8530J0600j1438K916M244J818l1875K635
$$ -25425 -25195 -17933 -7172 -21299 -11617 6913 17513 6075 8991 13235 15053 -16822 -14187
11366a4187j032K064J6461p62R992k424M524J4521R266j1940j9803j5380N036
$$ -14187 -15219 -13155 3306 2544 12536 10112 14636 29157 38423 26483 6680 -8700 -3664
11353c664O426N721J6437j678j1771k8397o151N815K2255Q246O878L930j3499
$$ -3664 2762 8483 24920 23242 11471 -16926 -23077 -17262 4993 13239 20117 24047 10548
11340A0548m0015K379J8355R433J8083R657j020J0811j3665j35M336j4880j4319
$$ 10548 -29467 -27088 -8733 700 18783 28440 27420 38231 24566 24431 28767 13887 -432
11327d32j2198J1004J3746j535j8773J7767Q425Q674n022j5462J485p16k0134
$$ -432 -12630 -1626 12120 10585 -8188 9579 18004 26678 21656 6194 7679 6963 -13171
11314a3171M739J415q539j547k0463K967J7539J1122N730o832K2557J1222k3509
$$ -13171 -8432 -7017 -15556 -17103 -37566 -34599 -17060 -5938 -208 -7040 15517 26739 3230
11301C230J0734j1214L010P491j172l194R108L3215j767o00J1288O962K688L0333
$$ 3230 13964 2750 5760 13251 12079 8885 17993 51208 49441 48841 60129 67091 69779 100112
11287A00112M2953L1125M3622Q4337J51357K41019K92457K16938O5026k3124r2514
$$ 100112 143065 174190 217812 302149 453506 694525 986982 1203920 1268946 1245822 1153308
11276A153308k25790l10271k41575j27310p7227l4646k5909j6420n802j4364j4186
$$ 1153308 927518 617247 375672 248362 171135 136489 110580 94160 88358 73994 59808
11265E9808j7678q102K83p973j8245Q549J066j0692K988o848K3150J8023j0317
$$ 59808 42130 34028 34311 26338 8093 16642 17708 7016 10004 3156 26306 44329 34012
11252C4012O169n801k4159M920J1504q989O985m429q969l155J1043J2760j6514
$$ 34012 40181 34380 10221 15141 26645 17656 24641 20212 11243 8088 19131 31891 15377
11239A5377j5336J1224K145Q468K416j5965k0148J0020k754n185J133P482J4585
$$ 15377 41 11265 13410 21878 24294 8329 -11819 -1799 -4553 -9738 -8605 -1123 13462
11226A3462R3k874j176j1476J6499K5804j3006j8318q350l290r729j960L79j675
$$ 13462 13555 10681 9505 -1971 14528 40332 27326 9008 658 -2632 -12361 -14321 -13942 -15617
11212a5617k1615K564R893J4132q790p351r955N019J8124M157j207N716Mk542
$$ -15617 -37232 -34668 -24775 -10643 -19433 -26784 -36739 -31720 -13596 -9439 -10646 -4930 -4926 -7468
11198g468J1143J0582n026O4O566j2156j9714Q909K6514K733j0907N600R981O471
$$ -7468 3675 14257 9231 9295 15861 3705 -16009 -7100 19414 22147 11240 16840 26821 33292
11184C3292r483p230L983P106j0786j2271q39j2623P872P836J1884m130P359J36
$$ 33292 23809 16579 20562 27668 16882 4611 3772 -8851 -979 6857 18741 14611 21970 22106
11170B2106R26J2049J2812L2266M109N51J3525L4649O6379J17799K14314K90929
$$ 22106 23032 35081 47893 80159 84268 84819 98344 132993 199372 317171 531485 822414
11158H22414J86802M1037n2799J6373L6469r2899k50961k52366j58018r8487l9720
$$ 822414 1009216 1050253 997454 1013827 1050296 957397 706436 454070 296052 197565 157845
11147A57845k6030l4858N633l826k4645j4170l122q392k5593l2600l253J8458
$$ 157845 131815 96957 102590 98764 74119 59949 56827 48435 22842 -9758 -13011 5447
11135E447L072R956K1040j478j9528q026J0135p715j2043n587o711J7098N0028
$$ 5447 8519 18475 39515 38037 18509 10483 20618 12903 860 -4727 -11438 5660 55688
11122E5688L9788K3936N3393O1225k016n0937m8823n3505l0223j961o078k1478
$$ 55688 95476 119412 172805 234030 232014 181077 132254 78749 48526 46565 40487 19009
11110A9009L458m720k9553j3137k139J1520P24P957M267J501j3231J1366J1523
$$ 19009 22467 17747 -11806 -24943 -27082 -15562 -14838 -6881 -2614 -1113 -14344 -2978 8545
11097H545l894j2137j169O115K257m387J1951L080N187j3779r642q09M667J5519
$$ 8545 4651 -7486 -8655 -2540 -283 -4670 7281 10361 15548 1769 -7873 -8682 -4015 11504
11083A1504j046j2527j159k63R342q902j7696j8364p236O809q77r136N258J4421
$$ 11504 10458 -2069 -3228 -3491 5851 -3051 -20747 -39111 -46347 -39538 -40415 -49551 -44293 -29872
11069b9872K7946q23n787m800O149j0342o418M763R498J1776L888j1451p766J6836
$$ -29872 -1926 -2749 -8536 -13336 -7187 -17529 -23947 -19184 -9686 2090 5978 -5473 -13239 3597
11055C597R912L577l167o785J000p510o327N081M102K791j726j1126l583K467
$$ 3597 13509 17086 13919 7134 8134 624 -5703 -622 3480 6271 4545 -6581 -10164 -7697
11041g697J095K644j509L48N276p074O644O875N922m935o283r697P675J0840N643
$$ -7697 -6602 -3958 -5467 -5119 157 -6917 -273 6602 12524 7589 1306 -8391 -716 10124 15767
11026A5767o384r319J8596o027k4714l387J856j8521J1855J5477q538j1068n69
$$ 15767 9383 64 18660 12633 -12081 -15468 -13612 -32133 -20278 -4801 -13339 -24407 -24976
11013b4976J6034L417J0099Q891j123r244r198K995J0917p768O07j0075j877R224
$$ -24976 -8942 -5525 4574 13465 12342 3098 -6100 -3105 7812 44 651 -9424 -11301 -2077
10999b077j3460k3812k278K0983K2803J307o12P343M472O922r924r689J987Q899
$$ -2077 -15537 -39349 -41627 -20644 2159 3466 2854 10197 14669 21591 11667 1978 3965 12864
10985A2864K810k7423j6064J6148O969J4655J8187K89j4454j5839k5292r349j5404
$$ 12864 15674 -11749 -27813 -11665 -4696 9959 28146 28435 13981 -1858 -27150 -36499 -51903
10972e1903K5128J3838n947J0528J0420O260L514J7262o965j6787p163M87j2862
$$ -51903 -26775 -12937 -18884 -8356 2064 8324 11838 29100 22135 5348 -1815 -1328 -14190
10959a4190R690k488R090M11j4011k1154J4292P576k020N395J7162M004j5871
$$ -14190 -4500 -6988 2102 2513 -11498 -32652 -18360 -10784 -12804 -7409 9753 13757 -2114
10946b114N210M857j007l495m873j9210r827J6071M979o277q723O677j488Q44
$$ -2114 3096 7953 6946 3451 -1422 -20632 -30459 -14388 -9409 -15686 -24409 -17732 -19220 -18376
10932a8376p42j2150J3929J5779N188L40q704m410K443r27j162J5211P999r781
$$ -18376 -19118 -31268 -17339 -1560 3628 3968 -4736 -9146 -6703 -7630 -8792 6419 14418 4637
10918D637j9687J3107K5801j839k0230R302N353J985k686m26n710M040J2486J033
$$ 4637 -15050 -1943 23858 22019 1789 11091 16444 18429 15743 15317 9607 13647 26133 27166
10904B7166j1297j0793J935P341j3480j1579k272O658j484j1230n359L708J3522
$$ 27166 15869 5076 7011 14352 872 -10707 -12979 -6321 -7805 -19035 -24394 -20686 -7164
10891g164j130J9535q52j1787J2107j3973o033Q989K12L241j9233P830J2076L648
$$ -7164 -8294 11241 10389 -1398 10709 -3264 -9297 -308 -96 3145 -16088 -8258 3818 7466
10877G466O446k2027j5222j152J5940R300q064k984k044q63R094o696j3394J923
$$ 7466 13912 -8115 -23337 -24489 -8549 751 -7313 -10297 -12341 -13204 -4110 -10806 -24200 -22277
10863b2277N496n402J6963k7j7303n079L233j2598o970K0828O792j0770O451J088
$$ -22277 -16781 -22183 -5220 -5247 -22550 -27629 -24396 -36994 -43964 -23136 -16344 -27114 -20663 -19575
10849a9575j253K296l010K027Q273p83M379K5861l031r21J6590l155j1716j0051
$$ -19575 -20828 -18532 -21542 -19515 -11242 -12025 -7646 18215 15184 14263 30853 27698 15982 5931
10835E931j2501p238q566j512R917J3439K801K461k480q716J087m475o548j12
$$ 5931 -6570 -13808 -22374 -23886 -13969 -530 2271 4732 2252 -6464 -5377 -9852 -16400 -16512
10821a6512p23j0868K9R011J172Q837J5166o78k128j3071k8568J145J0495J404
$$ -16512 -17235 -28103 -28074 -19063 -17891 -9054 6112 5434 3306 -9765 -38333 -37188 -26693 -25289
10807b5289q08M623n015P688Q433p455m330K2897L264k5596l498J6478J0341j3743
$$ -25289 -26097 -21474 -26489 -18801 -10368 -17823 -22153 744 4008 -21588 -25086 -8608 1733 -12010
10793a2010j4176N207k821o4O356L635k860j8873r347J7584N230J13k255P701
$$ -12010 -26186 -20979 -23800 -23864 -17508 -13873 -16733 -35606 -44953 -27369 -22139 -22026 -24281 -16580
10779a6580R982R65j3405J2974K6853j9905k956M185n607k485p95L243J4302l085
$$ -16580 -6598 -5633 -19038 -6064 20789 884 -2072 2113 -3494 -5979 -6774 -3531 10771 7686
10765G686j3333o159J826j9550k0559J9918J1064Q279j365J349m592l88j1204
$$ 7686 -5647 -11806 -9980 -29530 -50089 -30171 -19107 -10828 -12193 -10844 -15436 -15824 -27028
10752b7028k920J7868J0957p230J916p500m666O913P182N984J0669M570n480j0370
$$ -27028 -29948 -12080 -1123 -8353 -6437 -13937 -18603 -11690 -4508 1476 12145 16715 11235 865
10738H65P757j3168j7187K230j0696j0961m90J8796R573J949k737J2974N287q125
$$ 865 8622 -4546 -21733 -19503 -30199 -41160 -41650 -22854 -13281 -11332 -14069 -1095 4192 -3933
10724c933k291o031j2499J5190L7919M263k2441p427j6413Q107Q646j0810n760
$$ -3933 -6224 -12255 -24754 -9564 28355 32618 10177 2750 -13663 -5556 3090 -7720 -13480
10711a3480j064J5092j862p376l522J2968m376k0978N910k667j0249J3297M286
$$ -13480 -14544 548 -1314 -8690 -12212 756 -3620 -24598 -18688 -21355 -31604 -18307 -14021
10698a4021k31J6184K790K227q963j6791m869J0814k457m860J5545K2146m077
$$ -14021 -14252 1932 4722 6949 -2014 -18805 -23674 -12860 -15317 -20177 -4632 17514 13437
10685A3437k2267k2669O076L2J7842P842j3400o027j0638o51J2253K4389p734
$$ 13437 -8830 -31499 -25423 -25391 -7549 293 -13107 -19134 -29772 -30423 -18170 6219 -1515
10672a515l0573J051M273J0114J7789Q444k4669N049J3114k173r312j1323P298
$$ -1515 -32088 -31037 -26764 -16650 1139 9583 -15086 -10037 3077 904 -8408 -19731 -12433
10659a2433p028N562K0125l279k1632j90J8332j3219r061m767J6197J3817p91
$$ -12433 -19461 -13899 6226 2947 -18685 -18875 -543 -13762 -22823 -27590 -11393 2424 1633
10646A633R07p387o735j0880J8538o989J4811J4926J144m815j5739L712M847j8991
$$ 1633 2540 -4847 -11582 -22462 -3924 -10913 3898 18824 19968 15153 -586 3126 7973 -11018
10632a1018l192R903N934J3866K333n955o013J738j0063j448K739Q794q336L317
$$ -11018 -14210 -4307 1627 15493 17826 11871 5858 7596 -2467 -3915 -1176 7618 -718 2599
10618B599Q388J2751p752k4333j4169M457O757J1644K335J621o735J3998Q8j5956
$$ 2599 10987 23738 15986 -8347 -22516 -18059 -11302 342 2677 4298 -2437 11561 11649 -4307
10604d307q091L085R586J5262O56l3453k123K1133Q590j2186j8612q904J3073
$$ -4307 -12398 -9313 273 15535 16191 -17262 -19385 1748 10338 -1848 -20460 -29364 -16291
10591a6291m556j7524j1877q821J3387K9302J0155q70j7026k15K7997j6001k705
$$ -16291 -20847 -38371 -50248 -59069 -45682 -16380 -6225 -7095 -24121 -24336 3661 -12340 -15045
10578a5045K7357O397q408j1930K555N265j9638j557R611R872N114k6402j1548
$$ -15045 12312 18709 10301 -1629 926 6191 -13447 -15004 -5393 4479 9593 -16809 -28357
10565b8357p28K1721o824M131K0163o649j7510J652J1925q681m048n940j0770
$$ -28357 -29085 -7364 -14188 -10057 10106 3457 -14053 -12401 -476 -9157 -13205 -19145 -29915
10552b9915n738K0419k516k891J2707q501N387r213k4025O244J514J4726P04J2064
$$ -29915 -35653 -15234 -17750 -20641 -7934 -16435 -11048 -20261 -44286 -38042 -36528 -21802 -21098 -9034
10538i034j847m091J0742J4774l0258j8343l737p67Q066J373P936p983Q381J6028
$$ -9034 -10881 -14972 -4230 10544 -19714 -38057 -41794 -42561 -34495 -33122 -25186 -33169 -24788 -8760
10524h760J6967k494j4153Q148l321Q075r35j4595n426N183J286r44l792J0231
$$ -8760 8207 5713 -8440 -292 -3613 4462 3527 -11068 -16494 -11311 -10025 -10969 -14761 -4530
10510d530N103O944M87L527M961L274n441n954j5854J0467K5181q714j2646j7295
$$ -4530 573 7517 8004 11531 16492 19766 14325 8371 -7483 2984 28165 19451 6805 -10490
10496a0490j7701J4173l041L865K693l480J865J4848J6267m409k8847J425o268
$$ -10490 -28191 -14018 -17059 -13194 -10501 -13981 -12116 2732 18999 14590 -14257 -12832 -19100
10483a9100j4768O993J9517O960N718n031k045L76r803K1403K6015j8203k0347
$$ -19100 -33868 -26875 -7358 -398 5320 289 -1756 -1380 -11183 10220 36235 18032 -2315
10470b315k396J2845l823n820k002N156j702j0392Q088o012j4459J4359l7M17
$$ -2315 -4711 8134 4311 -1509 -3511 1645 -57 -10449 -2361 -8373 -22832 -8473 -8510 -8093
10456h093K6K405j7490l929m702R688K0890J5758j7027j1154K4607j907k0603
$$ -8093 -8067 -5662 -23152 -27081 -31783 -22095 -1205 14553 -2474 -13628 10979 9072 -11531
10443a1531p056K799n631j028P681N878K1731R692L653j4203m454k041j2262q567
$$ -11531 -18587 -15788 -21419 -22447 -14766 -8888 12843 22535 26188 11985 7531 5490 -6772 -15339
10429a5339r003L462O569p057k485J3984J0323J6943p027m549N20j302N621j3114
$$ -15339 -24342 -20880 -14311 -21368 -23853 -9869 454 17397 10370 5821 6341 5039 10660 -2454
10415b454Q154J3720J276j3717r764p393J0997Q959j752J3471o494M241k0651
$$ -2454 5700 19420 20696 6979 -2785 -10178 819 9778 8026 21497 15003 19244 -1407
10402a407j8624k56J9266J6076J7216j6309o090j2414j0114M152l005l17q22j4129
$$ -1407 -20031 -20287 -1021 15055 32271 15962 9872 -2542 -12656 -8504 -11509 -11826 -12648 -26777
10388b6777j646K1110P390r644J730M575j7684j0906M075Q92L4156k209k608P681
$$ -26777 -28423 -7313 77 -9567 -7837 -3262 -20946 -31852 -27777 -26885 7271 5062 2454 10135
10374A0135l406j1949q381r34Q499R386j6195N425J4037j0679J052k933J6218
$$ 10135 6729 -5220 -13601 -14535 -6036 3350 -12845 -7420 6617 -4062 -3010 -5943 10275
10361A0275N246j1875M528O389n805O206O266q399j9642q953q53J3074J1189k0533
$$ 10275 15521 3646 8174 14563 8758 14964 21230 12831 -6811 -15764 -16617 -3543 7646 -12887
10347a2887k2121p126J7295L573k370O19p624J5218J0616J873R646j135j2832
$$ -12887 -35008 -42134 -24839 -21266 -23636 -23017 -30641 -15423 -4807 -2934 6712 5577 -7255
10334g255K874Q121j8178j0065J6263K1007J1258j229J3995j8849K05j1712m806
$$ -7255 -4381 3740 -14438 -24503 -8240 12767 24025 22796 36791 17942 18147 6435 1629
10321A629K967m405J0208k179k695P531o130r629o131J7541j861k0334j7339M311
$$ 1629 4596 191 10399 8220 5525 13056 6926 -2703 -8834 8707 6846 -13488 -30827 -26516
10307b6516q66N56J8544N384j118K352J1934N783j2084l0897K62K3811Q795Q222
$$ -26516 -27382 -26826 -8282 -2898 -4016 -1664 10270 16053 3969 -26928 -26666 -2855 5940 14162
10293A4162j0029j7082p558N537K4952O044l934q167J0612l549l856J3616J246
$$ 14162 4133 -12949 -20507 -14970 9982 16026 12092 3925 14537 10988 7132 20748 21994
10280B1994j8563J3229J3320O362J2094j1614j4368r605R19M83m263j483q194
$$ 21994 3431 16660 29980 36342 48436 36822 22454 12849 13768 14251 9988 8505 311
10267C11j0280P519Q149j738r876J1316J3279j1168n242m457K0410L524N613Q06
$$ 311 -9969 -2450 5699 3961 -5915 5401 18680 7512 2270 -2187 18223 21747 27360 28166
10253B8166n712m87J8217q334o534j7121j6525K746J6761N177n687J507Q459p265
$$ 28166 22454 21967 40184 31850 25316 8195 -8330 -5584 11177 16354 10667 12174 20633 13368
10239A3368J8160j8381rj1534M268R161j5250j0319M949P122l074n567n200o1
$$ 13368 31528 13147 13138 1604 5872 15033 -217 -10536 -5587 1535 -1539 -7106 -12306 -12367
10225a2367j4858j2397o322l060k911m950J9692J3935K2020K5152O377J42m579
$$ -12367 -27225 -39622 -45944 -49004 -51915 -56865 -37173 -23238 -1218 23934 30311 30453 25874
10212B5874J7050P073j0138k2533k5710J6064J8989j77O59K2654Q469j0394l2820
$$ 25874 42924 49997 39859 17326 -8384 7680 26669 26492 27151 49805 58274 47880 15060
10199A5060j8469r782l0041J8769K2871M304N027P031Q577M487j4555j1004R439
$$ 15060 -3409 -13191 -43232 -24463 -1592 2712 7739 14770 23347 27834 13279 2275 11714
10186A1714j540R578Q054j3592q814R294j4382j4551P305r057p529K1488J8295
$$ 11714 10174 19752 27806 14214 5400 14694 312 -14239 -6934 -15991 -23520 -2032 16263
10173A6263Q082j0317j0203j4598j886q23J4167r999M442K495n87L734Q932J3151
$$ 16263 24345 14028 3825 -10773 -12659 -13482 685 -9314 -4872 -2377 -2964 770 9702 22853
10159B2853r815k9664j109J9175P31K032J5077L942p474r370q253M512J1465K206
$$ 22853 13038 -16626 -17735 1440 2171 4203 19280 23222 15748 6378 -1875 2637 14102 16308
10145A6308K914K431K27j6312j0723q221K690P465l546J1615J3315R575m550Q177
$$ 16308 19222 21653 21880 5568 -5155 -13376 -10686 -3221 -6767 4848 18163 27738 23188 31365
10131C1365j7920j5067o290P083J590m046Q056J0090l520m878N213R832P301j4628
$$ 31365 13445 -1622 -7912 -829 761 -3285 4771 14861 11341 6463 11676 21508 28809 14181
10117A4181m687N653k037j5344o38k2849j3472J8719J5831P898j4578j8778j7047
$$ 14181 9494 15147 13110 -2234 -2872 -25721 -39193 -20474 -4643 3255 -11323 -30101 -47148
10104d7148M422K5772O643O263K7935O52j0398n472n989O509j757j5547j5154
$$ -47148 -42726 -16954 -10311 -4048 23887 24539 14141 8669 2680 9189 7432 -8115 -23269
10091b3269k2454L804J8318K8015J7620J0236j1513k0529J853j768o692M150N117
$$ -23269 -45723 -41919 -23601 4414 22034 32270 20757 228 2081 313 -6379 -2229 2888
10078B888j7026k036K214K461q75J5659m154p066j1324Q285j15K0685l126j4719
$$ 2888 -14138 -16174 -13960 -11499 -12374 3285 -869 -7935 -19259 -10974 -11089 9596 6470 -8249
10064h249Q905k258j1420M008R572n997L893l667j712J5008j619k0986j6467j2507
$$ -8249 656 -1602 -13022 -9014 558 -5439 -1546 -5213 -6925 8083 6464 -14522 -30989 -43496
10050d3496J4376P119q538P889J3020L561k0795j5000K8832K5695n72R681K3891
$$ -43496 -29120 -22001 -30539 -22650 -9630 -6069 -26864 -41864 -13032 12663 12091 21772 45663
10037D5663j666l0176k0011n310k991Q672j2001J0637K6462k403J1154J7960j0947
$$ 45663 43997 13821 -6190 -11500 -14491 -5819 -17820 -7183 19279 16876 28030 45990 35043
10024C5043j5591q708l046j3802k0592q011J1746Q143l475j1268K0045L775j3872
$$ 35043 19452 10744 7698 -6104 -26696 -34707 -22961 -14818 -18293 -29561 -9516 -5741 -19613
10011a9613L932K1362r157q318K5510K7762q780p966j0413j0037o591J3762O883
$$ -19613 -15681 5681 -3476 -11794 13716 41478 32698 24732 14319 4282 -2309 11453 18336
9998A8336k0816j5378j2254j4849j574Q132J0172n047J5533J3656J042j1135M111
$$ 18336 -2480 -17858 -30112 -44961 -46535 -38403 -28231 -33278 -17745 -4089 -3047 -14182 -10071
9985a0071K6310J3883l572k0857P64K104q715p613L910J9870K1344k880j4997
$$ -10071 16239 30122 26550 5693 6457 8561 -154 -7767 -3857 16013 37357 34477 19480
9972A9480j7578j5420Q60J5099J2228M559r384p866r317P902L345P649j625M226
$$ 19480 1902 -13518 -12658 2441 14669 19228 9844 1978 -7339 563 3908 11557 9932 14158
9958A4158k1788J2882J7086q098o050l469L390l048K634NJ535j0810j7869j3558
$$ 14158 -7630 5252 22338 14240 8190 4721 8111 5063 7697 7702 9237 -1573 -19442 -33000
9944c3000J5536M36J3370O426P803q567M586Q002n520j7160k42n131J4804J3508
$$ -33000 -17464 -17028 -3658 2768 10571 2004 6590 14592 9072 -8088 -8330 -13461 1343 14851
9930A4851j585j1964p049M577m243L385J0171l369K548k342J006O508j274J7719
$$ 14851 13266 1302 -5747 -1170 -5413 -2028 8143 4774 7322 4980 5986 12494 11220 28939
9916B8939n709q371j0225j2266L538P961j2199J802M071N068q194L150J7900p81
$$ 28939 23230 14859 4634 -7632 -4094 3867 -8332 -6530 -2459 2609 -5585 -2435 15465 14684
9902A4684N059n49J09j2370O4K981Q851J3166J9919r724k8575m983J0867J7152
$$ 14684 19743 19194 19303 6933 6997 9978 18829 31995 51914 42190 13615 8632 19499 36651
9888C6651k1053j1538J4077Q201j09o201j3762j3519n04l64J5450j351j536J532
$$ 36651 15598 4060 18137 26338 26229 20028 6266 -7253 -7757 -8121 7329 5978 4442 5974
9874E974J0189j3106j7066n735j0953J550J64K563o99J4567J6402m587k210k41
$$ 5974 16163 3057 -14009 -19744 -30697 -29147 -28983 -26420 -27119 -12552 3850 -737 -2947 -3188
9860c188J919k697K012k747k130J394j386o35J7309J0399p776J2944K4397M022
$$ -3188 -1269 -3966 -1954 -4701 -6831 -5437 -6823 -7458 9851 20250 12474 25418 49815 53837
9846E3837j5835j4568j0415n688j1800j1401N406R892L708n346N199R857J4408
$$ 53837 38002 23434 13019 7331 -4469 -15870 -10464 -572 3136 -2210 2989 12846 27254
9833B7254O70j3026K307j668j4466j245J5875J170m677k514j0083O543l581n304
$$ 27254 27924 14898 17205 15537 1071 -174 15701 16871 12194 9680 -403 6140 2559 -2745
9819b745P859J2900J280K708k2002j3152k18O316J1608J725J4735J7103p079l152
$$ -2745 5114 18014 19294 22002 0 -13152 -13370 -7054 4554 6279 21014 38117 31038 27886
9805B7886r240k787n007K0065O538j070Q190q261L240J060R56q917p150J422J8337
$$ 27886 18646 15859 10852 30917 37455 36385 44575 36314 39554 40614 41570 32653 25503 26925 45262
9790D5262K2357J1393r03J4166K5260M1563K9892L6634Q2290J25553J84950L30293
$$ 45262 67619 79012 78109 92275 117535 159098 188990 225624 307914 433467 618417 948710
9778I48710N88055Q10724L27593n59357q21033n17603k57621j34600j07518o4621
$$ 948710 1536765 2347489 2675082 2115725 1294692 777089 519468 384868 277350 212729
9768B12729l1203k9471l5450k3589j7888k2508J2580J7129j5350j1675n436M425
$$ 212729 181526 152055 116605 93016 75128 52620 65200 82329 66979 55304 49868 54293
9756E4293j3899k1663j380q56q733M553l444N771k290M064Q814J9481J4012j2292
$$ 54293 40394 18731 17351 16495 7762 12315 8871 14642 12352 16416 25230 44711 58723 46431
9742D6431k7275j5819n598J3469K909j3272N661L78l86j0955K615l740j8220J2779
$$ 46431 19156 3337 -2261 11208 14117 845 6506 6884 6498 -4457 -1842 -5582 -23802 -11023
9728a1023N762m184L258J4311j1522p542M799j3335L63J7338N843J8924L161j7185
$$ -11023 -5261 -9445 -6187 8124 -3398 -10940 -6141 -19476 -19113 -1775 4068 22992 26153 8968
9714H968j2932l100J4048o6j1036j7868j4964j4980k867K2202L2632K4696q087
$$ 8968 -3964 -7064 6984 6918 -4118 -21986 -36950 -51930 -54797 -32595 37 24733 16646
9701A6646N438L750L733j2085j8433J2874P211l010l788K1837J676m859k8666
$$ 16646 22084 25834 29567 17482 -951 11923 19134 16124 12336 34173 35849 30990 2324
9688B324k5358P607O295k706j6685K6139K0039K244K15k139L317Q64j3414j6515
$$ 2324 -23034 -15427 -9132 -11838 -28523 -2384 17655 19899 20114 17975 21292 22156 8742 -7773
9674g773l796k459j763k67O393L791m412J3069k87M974K0585J254k1005j2638
$$ -7773 -11569 -14028 -15791 -16058 -9665 -5874 -10286 2783 2496 7470 28055 29309 8304 -4334
9660d334q795Q551K430j6506o477j1269K3951K6870O542J0186m713K015m665k2894
$$ -4334 -13129 -4578 -2148 -18654 -25131 -36400 -12449 14421 20963 31149 26436 28451 23786 892
9646H92j5802j39L3722J8394j9141k8103j4776Q801q403N824Q776J1864J595J61
$$ 892 -14910 -15049 18673 37067 17926 -10177 -24953 -16152 -24555 -18731 -9955 1909 3504 3665
9632C665m317j2432p823q21J428Q755P697J5154K5511q144j3437j1471k964m389
$$ 3665 -652 -13084 -20907 -21728 -20300 -11545 -3848 11306 36817 28673 15236 3765 801 -3588
9618c588k286J7982O073L009K590p824m827J86J0187n898k222j0608j9229R98
$$ -3588 -5874 12108 18181 21190 23780 15956 11129 11315 21502 15604 13382 2774 -16455 -15457
9604a5457O720k1455O229J8231J9099j050j6262P397M34l56r436k0470L011P469
$$ -15457 -8737 -30192 -23963 -5732 13367 12317 -3945 3452 3886 3530 -5906 -26376 -23365 -15896
9590a5896R705m023j0639l669M355j1089Q310J3382O349K1604J5383j208r159
$$ -15896 -6191 -10214 -20853 -24522 -20167 -31256 -22946 -9564 -3215 18389 33772 32564 23405
9577B3405j3941L530Q88j8011K333J9723k71j0623J1563P97J5361j8161j4550
$$ 23405 9464 12994 13882 -4129 -1796 17927 17656 7033 18596 19393 34754 16593 2043
9564B043J5456k855P717J0518J1095Q286L348j6228j2881j2261M869r140j0194
$$ 2043 17499 14644 22361 32879 43974 52260 55608 39380 26499 14238 19107 9967 -227
9551b27J3678L179j7816j9929o600J5080M534n951J17k190J1779J651j726j0465
$$ -227 13451 16630 -1186 -21115 -27715 -12635 -8101 -14052 -13935 -16125 -4346 -2695 -4421 -14886
9537a4886J2290n802J3020M702j3705j158P660k904o449l745J2248J5015j952
$$ -14886 -2596 -8398 4622 9324 -4381 -5539 2121 -783 -7232 -10977 1271 16286 14334
9524A4334q447j2358j0907L124Q898j8622J5833n96o773N938J4781J7728J4717
$$ 14334 5887 -6471 -17378 -14254 -5356 -23978 -8145 -8741 -15514 -9576 5205 22933 37650
9511C7650M962j6341j2154n207J0641K1399q658k7772M289L0603p201j6749j7904
$$ 37650 42612 26271 14117 8910 19551 40950 32292 4520 8809 39412 32211 15462 -2442
9498b442P330R269l46N264M480j7069l45J2268R340j772j3879q417J4722K2699
$$ -2442 4888 14157 13811 19075 23555 6486 6141 18409 27749 25977 12098 3681 18403 41102
9484D1102k480k432k4272k3489J2913QJ6057J2728k7082j3915o568J2608J6443
$$ 41102 38622 36190 11918 -11571 1342 1350 17407 30135 3053 -10862 -17430 -4822 11621
9471A1621J9515J61j2961j5319M310J2725K1752K3538q746k0462k269m941J7256
$$ 11621 31136 31297 18336 3017 7327 20052 41804 65342 56596 36134 33865 28924 46180
9458D6180N205j420j3404k2044R96R042M653J364R967M656M896q983J0963q130
$$ 46180 51385 49965 36561 14517 15513 24555 29208 30572 40539 45195 50091 41108 52071 43941
9444D3941m116j9100j4294p772L724J3005K1604J6706m211k112o664j2170q147
$$ 43941 39825 20725 6431 -1341 2383 15388 36992 53698 49487 47375 40711 28541 20394
9431B0394j470p826j1594J0700J799Q040j215r557M180M895k872n917o204K8616
$$ 20394 18924 11098 -496 10204 12003 20043 18828 9271 13451 18346 15474 9557 3353 31969
9417C1969L922L876M521P907j5366j2606j488p661L1590K8949o601j1382q455
$$ 31969 35891 39767 44288 52195 36829 24223 22735 15074 46664 75613 69012 57630 49175
9404D9175m331M657Q213N939j7855k7291K101J4578K0367K8522O210k2913p32
$$ 49175 44844 49501 57714 63653 45798 18507 20608 35186 55553 84075 90285 67372 66640
9391F6640j0162j4996J2271M230j0113l4287j15R023J9045J2013P788J0201j1017
$$ 66640 56478 41482 53753 57983 47870 13583 13468 22491 41536 53549 61337 71538 60521
9378F0521q213J7661N11j9032j6450L046k283K411J6295J4443J10o603J585J1976
$$ 60521 52308 69969 70480 51448 34998 38044 35761 38172 54467 68910 69020 62417 64002 75978
9364G5978m431n664J3620O534k028j4549k2113r95m04J3582K5013L351l130J4926
$$ 75978 71547 65883 79503 86037 84009 69460 47347 46352 45948 59530 84543 87894 84764 99690
9350I9690j3143n627O838m360j7934k369R076r91k681O212O833j2254k04N838
$$ 99690 86547 80920 87758 83398 65464 63095 72171 71180 68499 74711 81544 69290 69086 74924
9336G4924J542p589M194K699J1588M137O380P242J6631j38j3708j3285n216O156
$$ 74924 76466 68877 73071 75770 87358 91495 97875 105117 121748 121610 107902 94617 89401 95557
9322I5557R609J922p336r113J1469n852j9929m27J2868J4196J8857j6498l688
$$ 95557 105166 107088 99752 90639 102108 96256 76327 75900 88768 102964 121821 105323 101635
9309A01635J422j726j438P222r082l452J4764N205J3849J335J7749j0399M728
$$ 101635 103057 101331 99893 107115 98033 94581 109345 114550 128399 129734 147483 137084 141812
9296A41812J4005K6179q95j6470k857l121K563J0631P65J6806L204Q009J8185
$$ 141812 155817 181996 181101 164631 161774 158653 161216 171847 172612 189418 192622 200631 218816
9283B18816m179q525J4263Q794j4206m232j4856K227K9344K4737J7540J2525J4615
$$ 218816 214637 206112 220375 229169 214963 210731 195875 198102 227446 252183 269723 282248 296863
9270B96863L675k940N925o738J9922R596k411O098J8256J0263J2926L5897J2701
$$ 296863 300538 297598 303523 296785 316707 326303 323892 329990 348246 358509 371435 407332 420033
9257D20033J6707L6912K5992N833J7355J6257K9081L4268K5579K3153K7075L2002
$$ 420033 436740 473652 499644 505477 522832 539089 568170 602438 628017 651170 678245 710247
9245G10247L7848N1224N3695M6938N1581N0616O9079N2959O6686N2512M7156N7418
$$ 710247 748095 799319 853014 899952 951533 1002149 1071228 1124187 1190873 1243385 1290541 1347959
9233A347959P0529R4170J07417Q5659N2941N5861Q9058R0017O7963N2104P9274
$$ 1347959 1418488 1512658 1620075 1705734 1758675 1814536 1903594 1993611 2061574 2113678 2192952
9222B192952P2955O0998L5381M2484K4474J0410J641l35j156j7400k2851k0699
$$ 2192952 2265907 2326905 2362286 2404770 2429244 2439654 2441295 2440960 2439804 2422404 2399553 2378854
9210B378854m9859l5298j9570l8516o2400n6247m1134k2322l8489m9057k7612
$$ 2378854 2328995 2293697 2274127 2235611 2173211 2116964 2075830 2053508 2015019 1965962 1938350
9199A938350l4231n1941m0215m6405m8262m4296k1321p569m524n766l9635j2926
$$ 1938350 1904119 1852178 1811963 1765558 1717296 1673000 1651679 1644110 1639586 1633820 1594185 1581259
9187A581259O49j6271m1893k7484R175J4935q721j239j0438q251J2203J3864j2
$$ 1581259 1581908 1565637 1523744 1496260 1505435 1520370 1511649 1510410 1499972 1491721 1503924 1517788 1517776
9174A517776K906l29J6214L2728J9393J2890J7841O1979N1805L4841K8610N5472
$$ 1517776 1520682 1520353 1536567 1569295 1588688 1601578 1619419 1681398 1733203 1768044 1796654 1852126
9162A852126P0958O8498O4101P1412P1104Q1973J20803J14226J18119R7202J23460
$$ 1852126 1923084 1991582 2055683 2127095 2198199 2280172 2400975 2515201 2633320 2730522 2853982
9151B853982J78550J90224J91248K09136K25616K59831K75352L27447L53413L65843
$$ 2853982 3032532 3222756 3414004 3623140 3848756 4108587 4383939 4711386 5064799 5430642
9141E430642L99611M46251M72740M97898N21612N34138N39093N39644N30109M54313
$$ 5430642 5830253 6276504 6749244 7247142 7768754 8302892 8841985 9381629 9911738 10366051
9131A0366051M05268L55681L05902K18183J26516P2323L0604j9802p4738p8223
$$ 10366051 10771319 11127000 11432902 11651085 11777601 11849924 11880528 11860726 11785988 11707765
9121A1707765p2933r2741n7592m7763l2098P38Q0390J09398J64027J91425K68143
$$ 11707765 11634832 11542091 11484499 11436736 11404638 11405376 11485766 11595164 11759191 11950616 12218759
9110A2218759L31736L87443M70952N48426O50306P47953Q39792R56894J076064
$$ 12218759 12550495 12937938 13408890 13957316 14607622 15355575 16195367 17152261 18228325
9101A8228325J144690J213009J295720J354243J292238J179964J001415P32039
$$ 18228325 19373015 20586024 21881744 23235987 24528225 25708189 26709604 27441643
9093B7441643L49760n3543m36829p65247j063617j262036j370298j414022j393915
$$ 27441643 27791403 27737860 27301031 26535784 25472167 24210131 22839833 21425811 20031896
9084B0031896j340335j269553j137619j009265q83143p79016o80374n82986n03766
$$ 20031896 18691561 17422008 16284389 15275124 14391981 13612965 12932591 12349605 11845839
9075A1845839m23849l60340k77807k27792j76560j26186r1003p4167k5828J1545
$$ 11845839 11421990 11061650 10783843 10556051 10379491 10253305 10162302 10088135 10062307 10073852
9065A0073852M6495N0069M7378M5080L5685J2156m2893n8138j06415j82054k51838
$$ 10073852 10120347 10170416 10217794 10262874 10298559 10310715 10267822 10209684 10103269 9921215 9669377
9054I669377l10980l82762m34631m81518n05789m87135n09713n10510m66624m30014
$$ 9669377 9358397 8975635 8541004 8059486 7553697 7066562 6556849 6046339 5579715 5149701
9044E149701m11093m00938l54293l37538l05378k79081k55573k17127j90737j92986
$$ 5149701 4738608 4337670 3983377 3645839 3340461 3061380 2805807 2588680 2397943 2204957
9034B204957j83774j41999j05919j24082j26769r9750q7506r2715q1159p0484
$$ 2204957 2021183 1879184 1773265 1649183 1522414 1422664 1335158 1242443 1161284 1090800
9024A090800m4407n4809p9193l7433l8608n0372m3676k6429k7024m0276k9520
$$ 1090800 1046393 991584 912391 874958 836350 785978 742302 715873 688849 648573 619053
9013F19053l7550k0799k2334k0037k9929k5353k5250J246J683j0878r760p770
$$ 619053 581503 560704 538370 518333 488404 463051 437801 439047 440730 429852 420092 412322
9001D12322K982p190l5907k2395j8846k3061j2889k8683j2998O403J0084p36j0617
$$ 412322 415304 408114 372207 349812 330966 307905 295016 266333 253335 259738 269822 269086 258469
8988B58469r824j2995J292m188P617P647p124M359J0436q039l1093j686n09p270
$$ 258469 248645 235650 236942 232754 240371 248018 240894 245253 255689 247650 216557 214871 214362 207092
8974B07092j3615Q890J8908j0531r226m308l224k461j8062j5187o678R800P048
$$ 207092 193477 202367 221275 210744 201518 197210 193986 191525 173463 158276 151598 161398 168446
8961A68446O77k154m997P23l265J48k051j3906k359J0132J0274j4569o886M106
$$ 168446 169123 166969 161972 162695 159430 159578 157527 143621 141262 151394 161668 147099 140213 144319
8947A44319o588k9085p965L8174K250j2183j1728j0156p154r850k219J9125r508
$$ 144319 137731 108646 100681 138855 141105 128922 117194 107038 99884 90034 87815 106940 97432
8934I7432j2600J6708J872j5237j8539J0039M260J966L488r814L778O160n864
$$ 97432 84832 101540 103412 88175 69636 79675 83935 85901 89389 79575 83353 89513 83649
8921H3649k0550j3590O65K27L0770k523n327N339L144K662j8404j5093k518K0099
$$ 83649 63099 49509 50174 50401 81171 78648 73321 78660 81804 84466 66062 50969 48451 68550
8907F8550J0473k7991m712N764m496P910N886O312N265p356k3009k2852j707l473
$$ 68550 79023 51032 46320 52084 47588 55498 61384 67696 72961 65605 42596 19744 18037 14564
8893A4564J0326J3939J19p533j195o36m085j260j4619l244J4378O100j4088j189
$$ 14564 24890 38829 38948 31415 30220 29584 25499 24239 9620 6376 20754 26854 12766 11577
8879A1577K378J276N630k615k314O273J1031J2608p68m422K119J993l3324l209
$$ 11577 13955 15231 20861 18246 15932 22205 33236 45844 45076 40654 42773 44766 11442 8233
8865H233J4945R078M459L100q023R344O600m708m574N730j5102k666k068n40Q378
$$ 8233 23178 32256 36715 39815 31792 41136 47736 43028 38454 44184 29082 26416 24348 23808 32186
8850C2186R574k1539l631N162p202j5610J4662P369n174J2170j373k1328j1192
$$ 32186 41760 20221 16590 21752 14550 -1060 13602 20971 15797 27967 26594 5266 -5926
8837e926L581J7544Q324j7600j3762N680J8707P95J49N102j2462J6985L036r063
$$ -5926 -2345 15199 23523 5923 -7839 -2159 16548 17343 17492 22594 10132 27117 30153 21090
8823B1090j226o167J3743J0278o157j7958k783M10K350m2r087j7190n068J4300
$$ 21090 19864 13697 27440 37718 31561 13603 10820 11230 13580 13538 4451 -12739 -17807 -3507
8809c507J0470q534J179J5909M424k374q974K200l120m418O865J0851Q737r534
$$ -3507 6963 -1571 -392 15517 19941 17567 8593 10793 7673 3255 10120 20971 29708 20174
8795B0174k759l943J6210r240k0191J8040p647j4976q464q60m343J9916J5382
$$ 20174 17415 13472 29682 20442 251 18291 10644 -4332 -12796 -13656 -17999 1917 17299
8782A7299N698k42j957m287M584J0324j6482P021J2734j844k4862n974M134J2538
$$ 17299 22997 22755 20798 16511 21095 31419 14937 21958 34692 32848 7986 2012 6146 18684
8768A8684k11j0339l173J4352Q726J645M917j2206L42n917Q61K6014M642j6173
$$ 18684 18473 8134 4961 19313 28039 29684 34601 22395 22737 16820 17681 43695 48337 32164
8754C2164j0785O127J3032J6807J6655p906j1635r928Q327m423j0496r567r39
$$ 32164 21379 27506 40538 57345 74000 66094 54459 44531 52858 48435 37939 28372 27433
8741B7433K217j0057k889O150J4839K9197O56j9110j03k935J2089J971j1125j0271
$$ 27433 29650 19593 16704 22854 37693 66890 67546 48436 48333 45398 57487 59458 48333 38062
8727C8062m349l721N235L03k569p155O251Q209O214N929Q26j2448L09k842M980
$$ 38062 33713 29992 35227 35530 32961 25806 32057 40266 46480 52409 53235 40787 41096 38254 43234
8712D3234K34r948q906n772o094P984O555M865n991J2788J6711J2459J1280r23
$$ 43234 43468 33520 24614 18842 12748 20732 27287 32152 26161 38949 55660 68119 79399 78476
8698G8476j0983j2668l0139K193p346L379N160O893P130N534q347J2260J8675
$$ 78476 67493 54825 24686 26879 19533 22912 28072 34965 42095 47629 39282 51542 70217
8685G0217j969j524j7523J776l384R721j3495O039J30j0065J8766J9244J8167
$$ 70217 68248 66724 49201 50977 47593 57314 43819 49858 49988 39923 58689 77933 96100
8672I6100k305m883j3318o382l839o498j0888O274o452j4005K573P620R092L866
$$ 96100 93795 88912 75594 69212 65373 58875 47987 54261 47809 33804 36377 43997 53089 56955
8658E6955l703m384J9949j8j3430M699o705L273J1340R463q477K554J1633k74
$$ 56955 53252 48868 68817 68799 55369 60068 53363 56636 67976 77439 68962 71516 83149 82875
8644H2875K323L21J6938Q707m051k321k2436O487O403j4296k3695K571K1271Q626
$$ 82875 85198 85519 102457 111164 107113 104792 82356 88843 95246 80950 57255 59826 81097 89723
8630H9723j1917j7755R698K896Q661K1923K613n665J6628O99J959Q886J8983k073
$$ 89723 77806 60051 69749 72645 81306 103229 105842 100177 116805 117504 119463 128349 147332 145259
8616A45259N97p091O467J7266K7093J1771J6416K3297J4802J1523J1911l467J2074
$$ 145259 145856 138765 145232 162498 189591 201362 217778 241075 255877 267400 279311 275844 287918
8603B87918L7609L3977R687K239K2145J8151J4175j5972k1128n6007n5430l1980
$$ 287918 325527 359504 369191 371430 393575 411726 425901 409929 388801 332794 277364 245384
8591B45384l3837j2511m619p634k1306k5404j9660R666R156j2147n159P635j2456
$$ 245384 211547 199036 194417 186783 165477 140073 120413 130079 139235 127088 121929 129564 117108
8578A17108j5706j4291N173n422j1040l439P16K594l470K2183p290k0222j2015
$$ 117108 101402 87111 92284 86862 75822 72383 73099 75693 72223 94406 87116 66894 54879
8565E4879J9872J6348K955j1360K580k4027j4669J360j1176p193L473J8070r809
$$ 54879 74751 91099 94054 82694 85274 61247 46578 47938 36762 29569 33042 51112 41303
8552D1303j6360m248K2172J6635N50j2154P824M776m856q374J7224j2795j2157
$$ 41303 24943 20695 42867 59502 60052 47898 55722 60498 55642 47268 64492 51697 39540
8539C9540N902n07l902p560j464K0470N339K814q947p156K229k4123o446k997
$$ 39540 45442 44935 41033 33473 32009 52479 57818 60632 51685 44529 46758 22635 16189 13192
8525A3192M369L741Q298K22P08r177L650O080J1660P946k518O099k357K095N363
$$ 13192 17561 21302 29600 29822 30530 21353 25003 31083 42743 50689 48171 54270 51913 54008 59371
8510E9371J528l677k457p779j6239O39R642p349M288R103L783j1886j043j0333
$$ 59371 60899 57222 54765 46986 30747 31386 41028 33679 37967 47070 50853 38967 37924 27591
8496B7591j723L613k022J2620p178o551j0409J3865P059o668q014n635j639j1119
$$ 27591 25868 29481 27459 40079 32901 26350 15941 29806 36865 30197 22183 16548 14909 3790
8482C790p489R332J1475J3752K79m968L414m811P266L423J1667J0685q826j6623
$$ 3790 -3699 5633 17108 30860 31139 26171 29585 24774 32040 35463 47130 57815 48989 32366
8468C2366J94J5121Q996l576j0572j6659Q77L954J3861j718j2765m677k030l891
$$ 32366 32560 47681 56677 53101 42529 25870 26747 30701 44562 42844 30079 25402 23372 19481
8454A9481r83J6967J6749J773p488m757r391N750p108r963m936k995L753j3831
$$ 19481 18498 35465 52214 53987 46499 41742 32351 38101 30993 21030 16094 13099 16852 3021
8440C021K1172O584j3579K731R452R787L124m227j6250j3352L052J6087K0761
$$ 3021 24193 30777 17198 19929 29381 39168 42292 38065 21815 8463 11515 27602 48363
8427D8363M317j0458j3315j2848n491P037J9800O473m486j1337j1144R537K584
$$ 48363 52680 42222 28907 16059 10568 17605 37405 43878 39392 28055 16911 26448 29032
8414B9032J342J3650L09r175j0027P096K770K1297j1802l3185j0894J1453P172
$$ 29032 30374 44024 44333 35158 25131 32227 34997 56294 44492 11307 413 11866 19038
8401A9038j1818m482J1832J1168l672n675l929K0574J3757k1039R888P876J0410
$$ 19038 7220 2738 14570 25738 22066 16391 12462 33036 46793 25754 35642 43518 53928
8388E3928j020p999k4598Q243L903J4819J29j2031j2361J0817o315j3537M002
$$ 53928 52908 44909 20311 28554 32457 47276 47405 35374 23013 33830 27515 13978 17980
8375A7980L387j6609K009l958l709j7368J0515J5949p815l02R384J9676J0620
$$ 17980 21367 4758 6767 2809 -900 -18268 -7753 8196 381 79 9463 29139 39759
8362C9759K378J45j4984m174j0515o819J742K61K5221J7553k593j6943r830N811
$$ 39759 42137 42282 27298 23124 12609 5790 7532 7793 33014 50567 47974 31031 21201 27012
8348B7012K0157r944k9471k5203k075M805j803m803J2856J3330Q433j6519n058
$$ 27012 47169 37225 7754 -17449 -19524 -14719 -16522 -21325 -8469 4861 13294 -3225 -8283
8335h283k0404R033P712K40r275K4069J5183l914j1118M499p895j6336o491L5112
$$ -8283 -28687 -19654 -11942 -11702 -20977 3092 18275 14361 3243 7742 -153 -16489 -22980 12132
8321A2132R803P591m295K95J2073R53m270n192n968J0232j0259m098p379M135
$$ 12132 21935 29526 25231 25526 37599 38552 34282 29090 23122 33354 23095 18997 11618 15753
8307A5753K4625l290j6697m116K5538J557n805o114j0365m112P582o401p574m122
$$ 15753 40378 37088 20391 16275 41813 43370 37565 31451 21086 16974 24556 18155 10581 6459
8293F459l328R867M576O76l529j5026p953P920J758J0814J0700J1086l718l528
$$ 6459 3131 12998 17574 18250 14721 -305 -8258 -338 1420 12234 22934 34020 30302 26774
8279B6774j619o731k549J0930m702l078j5889n740p1j337J7990J5457K258j5195
$$ 26774 25155 18424 15875 26805 22103 19025 3136 -2604 -2675 -4012 13978 29435 31693 16498
8265A6498L092R068j626j180J9661M724j6170n973j00p040j7453K48J8010N708
$$ 16498 19590 28658 27032 25852 45513 50237 34067 28094 27994 20954 3501 3749 21759 27467
8251B7467r591q454j925O613L537M162j8565N921Q479K20K168J474j0069j4534
$$ 27467 17876 9422 7497 14110 17647 21809 3244 9165 17644 17864 20032 21506 11437 -3097
8237c097L206J6047O026J0989L908n991l493L10P58k1655p648N467J316k242r354
$$ -3097 109 16156 22182 33171 37079 31088 27595 27905 28663 7008 -640 4827 6143 3901 -5453
8222e453o107P403k041o829J1702K2777L128p122N072J6672n154j1739K128q889
$$ -5453 -11560 -4157 -6198 -13027 -1325 21452 24580 17458 22530 39202 34048 22309 24437 15548
8208A5548j1227J4557R176k3286j1088P187J2695K3956N807J3895k2707l5754
$$ 15548 4321 18878 28054 4768 -6320 867 13562 37518 43325 57220 34513 -1241
8196a241l727P004J2875j4175l538M904n890j371J0008j3559J1854J4109K211
$$ -1241 -4968 2036 14911 736 -2802 2102 -3788 -5159 4849 -8710 3144 17253 19464
8183A9464m603K956r0J5738O504k1222k1221j7317J469J0663J4016K396m203J8005
$$ 19464 14861 17817 17727 33465 39969 18747 -2474 -19791 -18322 -7659 6357 8753 4550 22555
8169B2555J0505N043M467l073k7534o427J3623J7110j7618o339J0897o857q118
$$ 22555 33060 38103 42570 39497 11963 5536 19159 36269 18651 12312 23209 16352 8234
8156H234p398L229k460j0583O231O250K788q26R692K2872O013k2728j5771J5912
$$ 8234 836 4065 1605 -8978 -2747 3503 6291 5465 15157 38029 44042 21314 5543 21455
8142B1455j0110k0985K255J9350K0009N338m229j3748j5185J7316l116o089p005
$$ 21455 11345 -9640 -7385 11965 31974 37312 33083 19335 4150 21466 18350 12261 5256
8129E256k754n107j845r33K611K922J0093l831P669K392J3710q143p346k358j2911
$$ 5256 2502 -2605 -4450 -5383 -2772 150 10243 6412 14081 16473 30183 22040 14694 12336 -575
8114e75L416K8828N97j7223j6750N511J6140j8171K593j4555J71k765N827J1255
$$ -575 2841 31669 32266 15043 -1707 3804 19944 1773 4366 -10189 -10018 -12783 -6956 4299
8100D299P061L627j2652r462O198J1078p506L653O653k803J566j6487m926o220
$$ 4299 11360 14987 2335 -7127 -929 10149 2643 6296 12949 10146 11712 -4775 -9701 -15921
8086a5921m266q564K452J9698J9105R337O660K6r625j1894L160J242j9186L328
$$ -15921 -20187 -28751 -26299 -6601 12504 21841 28501 28527 18902 7008 10168 11410 -7776 -4448
8072d448L96O413J1329j0185Q069P909J975J0384q070j3487J2541P73J633J0023
$$ -4448 -4052 2361 13690 3505 11574 19483 21458 31842 23772 10285 22826 23599 25232 35255
8058C5255j4810j700J6020P547m371J3042N984J439m50q279j0982M770j2360r185
$$ 35255 20445 18745 34765 42312 37941 50983 56967 58406 57956 49677 38695 43465 31105 21920
8044B1920k263J9521K2690o828j0555r684L724j03J884J0233J6302m852R900K927
$$ 21920 19657 39178 61868 55040 44485 34801 38525 38422 40306 50539 66841 61989 71889 74816
8030G4816r056o115M654K1569l019j7683k916p521l307J5543J9045J920o658J0547
$$ 74816 65760 59645 64299 85868 82849 65166 62250 54729 51422 66965 86010 87930 81272 91819
8016I1819O280m054k580j2324Q284R781n85J4993J2186q24k3566k1947M298J5787
$$ 91819 98099 94045 91465 79141 87425 97206 96621 111614 123800 122976 99410 77463 81761 97548
8002I7548n204K6777J3998j4230j9710K5369P035k0768p332k557K530p556j446
$$ 97548 92344 119121 133119 118889 99179 124548 131583 110815 103483 100926 103456 95900 94454
7989I4454j0169j2943o820O357O143k305j9851j8767J0095J1686J532Q041O657
$$ 94454 84285 71342 64522 70879 77022 74717 54866 36099 46194 57880 59412 67453 74110
7976G4110l854q095n457R553K820Q714J6988K0815j5257L058J7499n018j9991
$$ 74110 70256 62161 56704 66257 69077 77791 94779 115594 100337 103395 120894 115876 95885
7963I5885j9461k135L1485J0293J231M71p739j9536j2915Q883K1639j254j6792
$$ 95885 76424 74289 105774 116067 117298 117769 110030 90494 77579 86462 108101 106847 90055
7950I0055j3350k9666k4458N960J4248M042K542q935m726n760O614Q542j680M012
$$ 90055 76705 47039 22581 28541 42789 46831 49373 40438 35712 29952 36566 45108 43428 47440
7936D7440r409J3427P764k1220K764o322R975J5345K1447k362n999p023j3706
$$ 47440 38031 51458 59222 38002 40766 34444 44419 59764 81211 78849 72850 65827 52121
7923E2121k0930O36N406J6639J5235j1422j1630J4564Q74k0891L149J8484p190
$$ 52121 31191 31827 37233 53872 69107 57685 46055 60619 61493 40602 43751 62235 55045
7910E5045j8087j4165O835R209j358L28k632n210J6486L242m890J0806j0723j0202
$$ 55045 36958 22793 29628 38837 37479 37807 35175 29965 46451 49693 44803 55609 44886 34684
7896C4684K297J1873J2649o805p641r082j7341p719L871P057O862J1696j0354
$$ 34684 36981 48854 61503 54698 47057 37975 20634 12915 16786 23843 30705 42401 32047
7883C2047Q548j0541j6443k2881k793K5276K7027n213j7961m708p450Q757j0408
$$ 32047 40595 30054 13611 -9270 -12063 13213 40240 35027 17066 12358 4908 13665 3257
7870C257j0820p89R040Q848N964M877P309J5539k725m925k2980q561k586J5726
$$ 3257 -7563 -8352 688 9536 15500 20377 27686 43225 40500 35575 12595 4034 1448 17174
7856A7174R744l723n952p814o84K17R337P270r036l636j4308j8980K337J0301
$$ 17174 26918 23195 17243 9429 8745 8962 18299 25569 16533 12897 -1411 -20391 -18054 -7753
7842g753p673P533K1966J9069J3203p070j008j8468j2488o50j1610R68R91k527
$$ -7753 -15426 -7893 14073 33142 46345 39275 38267 19799 7311 6661 -4949 -3981 -2990 -5517
7828e517j5493N163J273N110Q407J4492N585l275Q114J4567k0527k1019P162J3535
$$ -5517 -21010 -15847 -14574 -9464 -1057 13435 19020 15745 23859 38426 17899 -3120 4042 17577
7814A7577J346j5473n935r57L863J8264q237n927o762n118L001n741l279L43J4394
$$ 17577 18923 3450 -2485 -3442 421 18685 10448 4521 -2241 -7359 -4358 -10099 -13378 -13035 1359
7799A359P575m093n020p337M615O295k264K553qP337M104K56o454O011l158J779
$$ 1359 8934 4841 -179 -7516 -2901 3394 1130 3683 3675 11012 15116 15372 8918 14929 11771 13550
7783A3550r269q878R878j6859o869p117O646J4079J2185Q214k59J074Q95K507
$$ 13550 4281 -4597 5281 -11578 -18447 -25564 -18918 -4839 7346 15560 15301 16375 17270 19777
7769A9777k0968k1346k759K390J5310J5925N121j3314J9388L972k1046J0265K2275
$$ 19777 -1191 -22537 -25296 -22906 -7596 8329 13450 136 19524 23496 2450 12715 34990
7756C4990R168k5439m6385P555J7393N162j8927j9388K17k949J7411J7128O940
$$ 34990 44158 18719 -27666 -20111 -2718 2444 -16483 -35871 -35654 -38603 -21192 -4064 2876
7743B876L500j5419j2202l378M90r360J6807j256L890r4K3467P085Q9j8365m330
$$ 2876 6376 -9043 -21245 -24623 -24133 -33493 -16686 -17942 -14052 -14146 9321 16406 16495 -1870 -6200
7728f200n512J6915R825L131j4240k0196k3858K5508J1004m408J3186P334j7857
$$ -6200 -11712 5203 15028 18159 3919 -16277 -40135 -14627 -3623 -8031 5155 12489 -5368
7715e368j8661L495J5778r850o698J1333N499k0558M191L856J2540R048O546l286
$$ -5368 -24029 -20534 -4756 -14606 -21304 -9971 -4472 -25030 -20839 -16983 -4443 4605 11151 7865
7701G865j0721O209p466l975P76l795Q412k054j6040N617J1711K3256r16j3959
$$ 7865 -2856 3353 -4113 -8088 -7312 -11107 -2695 -4749 -20789 -15172 -3461 19795 18879 4920
7687D920K404p640o875m357j1169M390j2273K3198r966n937R22J7051J2305o691
$$ 4920 7324 -316 -7191 -11548 -22717 -18327 -30600 -7402 -17368 -23305 -22383 -5332 6973 282
7673B82J757R291o46K98J0042j403k314j4494k317J622o646l170j0007l007l2
$$ 282 2039 11330 10684 10982 21024 19621 17307 2813 496 2118 -4528 -7698 -17705 -20712 -20744
7658b0744K802p241m868m364R107l732Q629J2401j7905j2212q802J0628J7143
$$ -20744 -17942 -25183 -30051 -34415 -25308 -29040 -20411 -8010 -25915 -38127 -46929 -36301 -19158
7645a9158p614J6306L613k100l432L976k487J730J4543j778J1149O683j4630k2986
$$ -19158 -26772 -10466 -6853 -8953 -12385 -8409 -10896 -9166 5377 3599 14748 21431 6801 -16185
7631a6185j1933J2844L794j299o720k735L448K0345j1225J122j788n178O66r410
$$ -16185 -28118 -15274 -11480 -12779 -19499 -22234 -18786 1559 -9666 -8544 -10332 -15510 -14844 -24254
7617b4254j059K0898j0792j3891J8746J7507j3580j5480O479N530J2553Q566o900
$$ -24254 -25313 -4415 -15207 -29098 -10352 7155 -6425 -21905 -15426 -9896 2657 11223 4323
7604D323P129L258k7118k8464k793J5749L1031K3097J827k228j2326q094l169
$$ 4323 11452 14710 -12408 -40872 -43665 -27916 3115 26212 28039 25811 13485 5391 2222
7591B222L763J0537N326o712j3103k237o27J7516n155K148K159n316k724M205
$$ 2222 5985 16522 21848 15136 2033 -204 -831 16685 11530 13678 15837 10521 7797 12002
7577A2002N524p39o097o853o38K5868K201r356l1912j7029k723K1886N980o283
$$ 12002 17526 16787 10690 3837 3199 29067 31268 21912 -10000 -27029 -29752 -7866 -1886 -8169
7563h169J1409L155j3169J1792N816O169j2396j0838J2826J879J0676n42j2332
$$ -8169 3240 6395 -6774 5018 10834 17003 4607 -6231 6595 8474 19150 18608 6276
7550F276o576J243p79J132J9762m711J4660r711l4927j2126J1910P640o218k928
$$ 6276 -300 943 164 1296 21058 16347 31007 21296 -13631 -25757 -13847 -6207 -12425 -15353
7536a5353K1116J165k90m02k3599p285N469K347Q414K196j601k13j1803j2028
$$ -15353 5763 6928 6638 6236 -17363 -24648 -19179 -16832 -8418 -6222 -7823 -8036 -19839 -31867
7522c1867J0686P158J4785j3382j7281M486j1341R487Q951Q332J2930j4922p823
$$ -31867 -21181 -14023 762 -12620 -29901 -25415 -36756 -27269 -18318 -9986 2944 -11978 -19801
7509a9801O076L064J5140L197n641j4277L65m517P621K1066j550j190p502n657
$$ -19801 -13725 -10661 4479 7676 2035 -12242 -11877 -16394 -8773 12293 10743 9553 2051 -3606
7495c606o800m858l145J1753q544L765O465p79j4730J524j0843l575Q115K396
$$ -3606 -10406 -15264 -18409 -6656 -15200 -11435 -4970 -5749 -20479 -18955 -29798 -33373 -25258 -22862
7481b2862M769J9038K724k887o577R023o723k2640p217J9472J2997L904m232K082
$$ -22862 -18093 945 3669 782 -5795 3228 -3495 -26135 -33352 -13880 -883 3021 -1211 871
7467H71K478j9761j3742J3139J1006p2k6214l271K5680J3676j015q94P926k036
$$ 871 3349 -16412 -30154 -17015 -6009 -6081 -32295 -35566 -9886 3790 2775 1881 9807 7771
7453G771j4860m406O192j526k873K557r860p579P689J759n991j2071K2793J0715
$$ 7771 -7089 -11495 -5303 -6829 -9702 -7145 -17005 -24584 -16895 -15136 -21127 -33198 -10405 310
7439C10m819Q241Q776k6819j5601K201J7533j403j6923r844J971j6875Q501R705
$$ 310 -4509 3732 12508 -14311 -29912 -27711 -10178 -11581 -28504 -38348 -36377 -53252 -44751 -35046
7425c5046m175J7962L2185o056j5298o498J1657J8685q343J748l043l0744j0298
$$ -35046 -39221 -21259 10926 4870 -10428 -16926 -5269 13416 5073 6821 3778 -26966 -37264
7412c7264R364J5778J9801l209j898j0105N661j0573L046m174j0520J2370o656
$$ -37264 -27900 -12122 7679 4470 2572 -7533 -1872 -12445 -9399 -13573 -24093 -11723 -18379
7399a8379J3022J9218O013j0231n062n785m905R073J560j4553j2678j0033Q510
$$ -18379 -5357 13861 19874 9643 4581 -1204 -6109 2964 4524 -10029 -22707 -32740 -24230
7386b4230j913k243m201j0979J5610K6988k501l231Q172j326p338j0768j6371
$$ -24230 -26143 -28386 -32587 -43566 -27956 -968 -3469 -6700 1472 146 -7192 -17960 -34331
7373c4331m844J6202J4901O889n847j1646k2355Q828J5772J6117L569j2854m591
$$ -34331 -39175 -22973 -8072 -1183 -7030 -18676 -41031 -32203 -16431 -314 3255 -9599 -14190
7360a4190P87l84p805K597o804J327M588O657q355J1342N704o845j6058K683K3034
$$ -14190 -13403 -13787 -21592 -18995 -25799 -24472 -19884 -13227 -21582 -10240 -4536 -11381 -27439 -24756 -1722
7345a722o596m454J4408L1507J394j3457L184J849m432j1540K396J0590L954L761
$$ -1722 -8318 -12772 1636 33143 34537 21080 24264 26113 21681 10141 12537 23127 27081 30842
7331C0842J684k0234j4996Q389K7693O027j1731j4036n437J5202j0621k8569j638
$$ 30842 32526 12292 -2704 5685 33378 39405 27674 13638 8201 23403 12782 -15787 -17425
7318a7425J7131R89j351R66j0512l639K2496K3490j495j8087k1648L527j0865
$$ -17425 -294 695 -656 310 -10202 -13841 8655 32145 30650 12563 -9085 -5558 -16423
7305a6423R658o677J1217J2279k4265j1933J6409p331k72K588K545J0632j289
$$ -16423 -6765 -13442 -2225 10054 -14211 -26144 -9735 -17066 -17338 -14750 -12205 -1573 -2862
7292b862J9241K593j6363j8819R806J6817J1398j0462r121L747k436Q447Q370
$$ -2862 16379 18972 2609 -16210 -6404 10413 21811 11349 2228 5975 3539 11986 20356
7279B0356O132j4036j4181J565J1594k0813o970K075M009P729P773j3901j9404
$$ 20356 26488 12452 -1729 -164 11430 -9383 -16353 -14278 -10269 -2540 5233 -8668 -28072
7266b8072o002Q258K1035j74l712q867m629j0367J1544O224K358J078r671J70
$$ -28072 -34074 -25816 -4781 -4955 -8667 -17534 -22163 -32530 -20986 -14762 -12404 -11326 -20997 -20827
7252b0827M86J3925Q436J1575Q326P836l724o340j9341l631l917q640J1588J0152
$$ -20827 -20341 -6416 2020 13595 21921 29757 26033 19693 352 -3279 -7196 -15836 -4248 5904
7238E904R644l246r702O652Q893l5501j9982J0647J9503J3739k353q321M749o284
$$ 5904 15548 12302 2600 9252 18145 -17356 -37338 -26691 -7188 6551 4198 -4123 626 -5658
7224e658J4759J818j570j0852r328n047j1567M653M308M730J5013Q134j9905q979
$$ -5658 9101 10919 9349 -1503 -10831 -15878 -27445 -22792 -18484 -13754 1259 9393 -10512 -19491
7210a9491j509P111o562p908m911P151L8j5016P00Q76R494L349j03J1367J0494
$$ -19491 -21000 -13889 -20451 -28359 -33270 -26119 -26081 -41097 -40397 -39521 -30027 -26678 -26781 -15414 -4920
7195d920R647j8805j6579J5616m300L391K135j0070J1039K1154j8464k7882J6043
$$ -4920 4727 -14078 -30657 -15041 -19341 -15950 -13815 -23885 -12846 8308 -10156 -38038 -21995
7182b1995N44k2048K5207L1140M444j2862O834r335j259q539j2678J2694r301
$$ -21995 -21451 -43499 -18292 12848 17292 4430 11264 1929 670 -7869 -20547 -7853 -17154
7169a7154P640r33j5564q964r966J4998J0053p82J6091O708k0035J768K3552Q480
$$ -17154 -9514 -10447 -26011 -34975 -44941 -29943 -19890 -20672 -4581 2127 -17908 -16140 7412 15892
7155A5892L497j0240k8269k3275J5913M167M270M643q800R996J0071q767M095
$$ 15892 19389 9149 -19120 -42395 -26482 -22315 -18045 -13402 -22202 -12206 -2135 -10902 -6807
7142f807Q634j80j442r171J4111J0824o760j7584m261K1196L2132Q861k0035k9906
$$ -6807 1827 1647 205 -8966 5145 15969 9209 -8375 -12636 8560 40692 49553 29518 -388
7128c88j9363q994L322K6602Q516j1776J974j6110j546N460J0628j866j8642N848
$$ -388 -19751 -28745 -25423 1179 9695 -2081 -107 -16217 -17763 -12303 -1675 -3541 -22183 -16335
7114a6335J3149j3655j2322N043r457q127K2880J9389j7926M208J131L273O863
$$ -16335 -3186 -16841 -29163 -24120 -33577 -41704 -18824 565 -17361 -13153 -12022 -8749 -1886
7101a886P272N840j637J1756j1576k6550J0453J7985J0962o612j2745J515j1188
$$ -1886 5386 11226 9589 21345 9769 -16781 -6328 11657 22619 16007 3262 4777 -6411
7088f411j0811J705O067J2185r050K689Jj4143m28J1415q255l729L1116r719j6217
$$ -6411 -17222 -15517 -9450 2735 -6315 -3626 -3625 -17768 -18196 -6781 -15036 -18765 12351 2632 -13585
7073a3585R891J1148j8067j13O42J9082j1993p472K657j2533Q117J054o895J833
$$ -13585 -3694 7454 -10613 -10726 -10084 8998 -2995 -10467 -7810 -20343 -12226 -11172 -18067 -16234
7059a6234k875O088P570K5209l028j3191n880j452j879K919Q61m423N05J4634
$$ -16234 -19109 -13021 -5451 19758 16730 3539 -2341 -3793 -5672 -2753 -1892 -6315 -5810 8824
7045H824l206j6048j0532P184J1273N698j2909j0781R67J6039o398J283j2683
$$ 8824 5618 -10430 -20962 -13778 -2505 3193 -9716 -20497 -19530 -3491 -9889 -8606 -21289
7032b1289j4763p781N748K3300M63k0346j0384J2295J4283N347J4384J9742K2711
$$ -21289 -36052 -43833 -38085 -14785 -14322 -34668 -45052 -32757 -18474 -13127 1257 20999 43710
7019D3710j3080k9809j5551M721J7010k765o945o010o095P014K1539J4000L112
$$ 43710 30630 821 -14730 -10009 7001 4236 -2709 -8719 -14814 -7800 13739 27739 30851
7006C0851r235j3456l551J2605J0637r870j1201j2703L198j0705M271L307J2215
$$ 30851 21616 8160 4609 17214 27851 17981 6780 -5923 -2725 -13430 -9159 -5852 6363
6993F363k2444k1803R582J8518p020J0978M184L627O541p705L775P064L168K907
$$ 6363 -16081 -37884 -28302 -9784 -16804 -5826 -1642 1985 8526 821 4596 11660 14828 17735
6979A7735j1977j7678L724Q443Q199r042j329k287J0008l877q280P891m192q490
$$ 17735 5758 -11920 -8196 247 8446 -596 -1925 -4212 5796 1919 -6361 1530 -2662 -11152
6965a1152O747j2773k368Q174N673r72J8084K1629q47j9432r791k0290o775j9676
$$ -11152 -4405 -17178 -19546 -11372 -5699 -6671 11413 33042 32195 12763 2972 -17318 -24093 -43769
6951d3769r955J1365K3095J5722L605k4964k209L839J5442O33N488m330m881r29
$$ -43769 -53724 -42359 -19264 -3542 63 -24901 -27110 -23271 -7829 -7196 -1708 -6038 -10919 -11848
6937a1848Q498l921J5220n446o475l202j0113M205k73J6274k402J789m696k3176
$$ -11848 -3350 -7271 7949 2503 -3972 -7174 -17287 -13082 -13355 2919 517 2306 -2390 -25566
6923b5566M421J2099J0421J6659L346m791J0829K525o575l2174j5153R259q02
$$ -25566 -21145 -9046 1375 18034 21380 16589 27418 29943 23368 -8806 -23959 -14700 -15502
6910a5502J325J7288l668j8829j710J235j1074k463K766p126J1422q203j8430
$$ -15502 -14177 3111 -557 -19386 -21096 -19861 -30935 -33398 -30632 -37758 -26336 -34539 -52969
6897e2969p264J6491L3173J8363P517m569j6202K265p514j2733k004j1759J9278
$$ -52969 -60233 -43742 -10569 7794 15311 10742 -5460 -3195 -10709 -23442 -25446 -37205 -17927
6884a7927K1318J0501J9327M011o476k902o660j4945N984j5550j1170O360o045
$$ -17927 3391 13892 33219 37230 30754 27852 21192 6247 12231 -3319 -14489 -8129 -14174
6871a4174j2524k416M505Q415J8094J7905o242K064K1097l347N084J000o879j142
$$ -14174 -26698 -29114 -24609 -16194 1900 19805 13563 15627 36724 33377 38461 39461 32582 31440
6857C1440j8739R818k964n174J4321q083j9671M939J6895o794k8246n133M955
$$ 31440 12701 22519 19555 14381 28702 20619 948 5887 22782 15988 -12258 -17391 -12436
6844a2436l814K207m658J806J987J1611J8185K0138k63l7744j0359R544J9551
$$ -12436 -16250 -14043 -18701 -16895 -14908 -3297 14888 35026 34763 -2981 -13340 -3796 15755
6831A5755J2300j2377m5K134L013P716k1931k2654K153Q142K737n949O352j50
$$ 15755 28055 15678 15633 17767 20780 28496 6565 -16089 -13936 -5794 -3057 -9006 -2654 -2804
6817b804n26L14n496o344q369Q536J6999l731j89J1893L683K038p732p247m405
$$ -2804 -3330 -3016 -8512 -14856 -23225 -14689 2310 -1421 -1610 10283 13966 16004 8272 1025 -3380
6802c380j2152K871L72q932P730K287l364L708K3171n241j0907J2925n183k5363
$$ -3380 -15532 -12661 -12289 -21221 -13491 -11204 -14568 -10860 12311 7070 -3837 9088 3905 -21458
6788b1458k0343K955J4092L557J266O666j6295m233Q117n913j1950M911K9782
$$ -21458 -41801 -38846 -24754 -21197 -19931 -13265 -29560 -33793 -25676 -31589 -43539 -38628 -8846
6775h846J4218M579Q848k614P422j7579o464p411m430J3535K953j1200j422M000
$$ -8846 5372 9951 18799 16185 23607 6028 -436 -7847 -12277 1258 4211 -6989 -8411 -4411
6761d411J0078K431O38M09r841j4034k157N688J7171M301K195K285J7209J830
$$ -4411 5667 8098 8736 9145 -696 -14730 -16887 -11199 5972 10273 12468 14753 31962 33792
6747C3792k6621q480l393q664j0697k592K3287N170L227K36j7190j1619J8231
$$ 33792 7171 -1309 -4702 -13366 -24063 -26655 -3368 1802 5029 5265 -11925 -23544 -5313
6734e313K661j944l375j3493K6391J9693J4540J035p012p63j375J0944j088j5971
$$ -5313 -2652 -4596 -7971 -21464 4927 24620 39160 40195 33183 32420 31045 41989 40901 24930
6720B4930j8572j1017j7964k34P438J4210j0249J840p503m109R267Q363j2071
$$ 24930 6358 -4659 -22623 -22857 -15419 -1209 -11458 -9618 -17121 -21230 -11963 -3600 -15671
6707a5671j635j6857M651J0749J6885J1747n505O483J0332k1845k9676L553J5028
$$ -15671 -17306 -34163 -29512 -18763 -1878 9869 4364 10847 21179 -666 -30342 -26789 -11761
6694a1761q411o014K0889R161l850r829J623n267j420P215R075M414q798n903
$$ -11761 -20172 -26186 -5297 3864 14 -9815 -8192 -13459 -14879 -7664 1411 5825 -2973 -8876
6680h876K0235m325j3397K794k516q796j1619j5518J1664J4468N755K182p799
$$ -8876 11359 7034 -6363 -3569 -6085 -14881 -26500 -42018 -30354 -15886 -10131 -7949 -15748
6667a5748J750J3028m71k9091j785J1891j407K91L530j363k324J21O785Q887Q009
$$ -15748 -13998 -970 -1441 -30532 -32317 -20426 -21833 -21542 -18012 -19375 -21699 -21578 -14793 -5906 2103
6652B103N151J0091k534o113k539l219k1081k174M854L1028J6520r26o115l878
$$ 2103 7254 17345 14811 8698 6159 2940 -18141 -20315 -15461 15567 32087 31161 25046 21168
6638B1168j4897n293N417p691R577O81j1308l915O341J362j2793K1865J6606q147
$$ 21168 6271 978 6395 -1296 8281 8962 -2346 -6261 80 1442 -11351 10514 27120 18973
6624A8973k2679q191L389l133K825k257j0737P519m984j1925r404O850k761K3675
$$ 18973 -3706 -11897 -8508 -11641 -8816 -11073 -21810 -14291 -19275 -31200 -40604 -33754 -36515 -12840
6610a2840M102j0130O057P792l453j9101k1471q08K3220N865M473N204J0193l20
$$ -12840 -8738 -18868 -12811 -5019 -8472 -27573 -49044 -49852 -26632 -20767 -16294 -11090 -897 -1217
6596a217O666l416J1030J3066l248k2114j9729L294k759j5082r258K1634K6789
$$ -1217 5449 2033 13063 26129 22881 767 -18962 -15668 -18427 -33509 -42767 -21133 5656
6583E656O885j3878q028k806r51N989j1507j9659P529J6179K627R881J1271r252
$$ 5656 12541 -1337 -9365 -12171 -13122 -7133 -18640 -38299 -30770 -14591 -11964 -2083 9188 -64
6569f4j5623j3260j877L1497L76k4290p456O466K0935R332R127j4061M953j8763
$$ -64 -15687 -28947 -30824 673 1049 -23241 -30697 -24231 -3296 6036 15163 1102 6055 -12708
6555a2708j816q702J2687K1300M86r890o159l8678r897L698P602J4262R186N047
$$ -12708 -14524 -23226 -10539 10761 11247 1357 -4802 -43480 -53377 -49679 -42077 -27815 -18629 -13582
6541a3582J8027m402p775N740k470j1956M602N965J5595j1447k0313P664j5192
$$ -13582 4445 43 -7732 -1992 -4462 -16418 -11816 -5851 9744 -1703 -22016 -14352 -29544
6528b9544j812J0003J4214l881M771N792j5029p533j0776M754J5545K6573K3720
$$ -29544 -31356 -21353 -7139 -11020 -6249 -457 -15486 -23019 -33795 -29041 -13496 13077 36797
6515C6797j2633q588p324k727j851m230l434q595j4150K2883J9250k520j356j5254
$$ 36797 24164 15576 8252 5525 3674 -556 -3990 -12585 -26735 -3852 15398 12878 11522 -3732
6501c732J3508L541o511j5868j3510K457P421J3495r391p032J0421R849J5274
$$ -3732 9776 13317 6806 -9062 -22572 -20115 -12694 801 -8590 -15622 -5201 4648 19922
6488A9922j0316k0831m793J4463N166M013J9270J3564k4413q234J4739j6140k6313
$$ 19922 9606 -11225 -16018 -1555 3611 7624 26894 40458 16045 7811 22550 6410 -19903
6475a9903l271O857j797k1627M783J5381M408M598P636p325J2148J5695J3614
$$ -19903 -23174 -16317 -18114 -39741 -34958 -19577 -15169 -10571 -2935 -10260 1888 17583 31197
6462C1197J63j5078j9090L73P657k243j4233R09o182l911K177J1438m839k1995
$$ 31197 31360 16282 -2808 -2435 5222 2979 -11254 -10345 -16527 -20438 -18261 -6823 -11662 -33657
6448c3657q238N063R308K0287N170j6769r948R257j899K7773J5905Q840m988j6577
$$ -33657 -41895 -36832 -27524 -7237 -2067 -18836 -28784 -19527 -21426 6347 22252 31092 26104 9527
6434I527n197k8380L079J9454K6J4467R148j2701j2907J930p280p034O020J487
$$ 9527 4330 -24050 -20971 -1517 -1491 12976 22124 9423 -3484 -1554 -8834 -15868 -9848 -8361
6420h361o11K390j8993Q655p718p794j4749j058K5958J5428J0242n769q875J3351
$$ -8361 -8972 -6582 -25575 -16920 -24638 -32432 -47181 -48239 -22281 -6853 3389 -2380 -11255 2096
6406B096k1642l968n47O979J0133Q220N060j538j0748r995M680l416p36q14k333
$$ 2096 -19546 -23514 -24061 -17082 -6949 1271 6331 4793 -5955 -15950 -11270 -14686 -15422 -16236 -18569
6391a8569k872O526J5773P28j4819O759r080j221J1849r453q188K387p423M686
$$ -18569 -21441 -14915 858 1586 -13233 -6474 -15554 -16775 -4926 -14379 -22567 -20180 -27603 -22917
6377b2917j1926M091Q434p86n297l672R827Q901J3822M478o792M401Q25N338N639
$$ -22917 -34843 -30752 -22318 -23104 -28401 -32073 -22246 -13345 477 4955 -1837 2564 3389 8727 14366
6362A4366j501P187p926r517j125M022j166K2382j3750l3990o782m736O972R475
$$ 14366 12865 20052 12126 2609 1484 5506 4340 26722 12972 -21018 -27800 -32536 -25564 -16089
6348a6089m922Q24J3868J464Q744Q163P980q883l367k522M351N351n612l548P254
$$ -16089 -21011 -20187 -6319 -4855 3889 12052 20032 11149 7782 5260 9611 14962 9350 5802 13056
6333A3056j2189n610O797J0899L815j385k910j4824j00L544o139j4490r59J5163
$$ 13056 867 -4743 2054 12953 16768 15383 12473 -2351 -2451 1093 -5046 -19536 -20495 -5332
6319e332r079j8057K757J0772P961J833J4963J2552n005k7769p881j2502J8029
$$ -5332 -14411 -32468 -29711 -18939 -10978 -9145 5818 18370 13365 -14404 -22285 -34787 -16758
6306a6758K4204M617O499j0851j4752m025O282k212q333P047o574j6353j2641
$$ -16758 7446 12063 18562 7711 -7041 -11066 -4784 -6996 -15329 -8282 -14856 -31209 -43850
6293d3850n825K6274K5225L603n881p998l256J4610m537J1139j6240k1393N227
$$ -43850 -49675 -23401 1824 5427 -454 -8452 -11708 2902 -1635 9504 -6736 -28129 -22902
6280b2902K3176k1260k3948K7932M0727o917j0402K637Q577r732k3790j1530N23
$$ -22902 274 -20986 -44934 -17002 23725 16808 6406 9043 17620 7888 -15902 -27432 -26909
6267b6909J5313J1044N216R257P164j6550k4183K376n535j3620J7031O727P216
$$ -26909 -11596 -552 4664 13921 21085 4535 -19648 -17272 -22807 -36427 -19396 -12669 -5453
6254e453J1571j205M010J284j7436l961j2367q900K42L411K4983J3406l050K5894
$$ -5453 6118 4913 8923 10207 -7229 -11190 -23557 -32457 -32215 -28804 -3821 9585 6535 32429
6240C2429m099q453l65l16j010P735Q869j1206p552j0531m255J6105j6815p289
$$ 32429 28330 19877 19512 19196 18186 25921 34790 23584 16032 5501 1246 17351 536 -6753
6226f753J1368j4576j008K2351j7290O006P055n71q819k4394j3578J1636N771
$$ -6753 4615 -9961 -10969 11382 -5908 98 7153 6582 -2237 -26631 -40209 -28573 -22802
6213b2802P560L65L958o022j154k311J5579J1748k093k6029K022J9445J735J1527
$$ -22802 -15242 -14877 -10919 -16941 -18095 -20406 -4827 6921 4828 -21201 -19179 266 2001 13528
6199A3528K0896k909j8086j3213M528k425k013j3745m377J0342J6481Q509j271
$$ 13528 34424 31515 13429 216 4744 2319 306 -13439 -17816 -7474 9007 17516 16245
$$ [...]
##END NTUPLES=NMR SPECTRUM
##END=
