##TITLE=Analysis number 329308
Compound Code cc 64846
Book Reference 511/186
Project Code adrs
Chemist Name stevem
##JCAMPDX= 6.0         $$ Bruker NMR JCAMP-DX V2.0
##DATA TYPE= NMR SPECTRUM
##DATA CLASS= NTUPLES
##ORIGIN= Bruker BioSpin GmbH
##OWNER= nmr
$$ XWIN-NMR		Version 3.5
$$ Mon Aug 20 10:50:39 2007 GMT Daylight Time (UT+1h)  MAYBRIDGE\nmr@NMR_250MHZ
##.OBSERVE FREQUENCY= 250.131544655141
##.OBSERVE NUCLEUS= ^1H
##.ACQUISITION MODE= SIMULTANEOUS (DQD)
##.ACQUISITION SCHEME= undefined
##.AVERAGES= 16
##.DIGITISER RES= 18
##SPECTROMETER/DATA SYSTEM= dpx250
##.PULSE SEQUENCE= zg30
##.SOLVENT NAME= CDCl3
##.SHIFT REFERENCE= (INTERNAL, CDCl3, 0, 16.522)
##AUDIT TRAIL= $$ (NUMBER, WHEN, WHO, WHERE, WHAT)
$$ ##TITLE= Audit trail, XWIN-NMR		Version 3.5
$$ ##JCAMPDX= 5.01
$$ ##ORIGIN= Bruker BioSpin GmbH
$$ ##OWNER= nmr
$$ C:\u/data/dgb/nmr/ADRS/860/pdata/1/auditp.txt
$$ ##AUDIT TRAIL=  $$ (NUMBER, WHEN, WHO, WHERE, WHAT)
(   1,<2007-08-20 10:49:23.42 +100>,<MAYBRIDGE\nmr>,<NMR_250MHZ>,
      <created by zg, POWCHK disabled, PULCHK disabled
       configuration hash MD5:
       76 6E 9A 78 1E 09 19 81 EC 84 63 8F B0 6A 59 2D
       data hash MD5: 64K
       52 EF 9C 74 F3 3B 29 E3 4A 76 A8 39 24 0D C8 30>)
(   2,<2007-08-20 10:49:49.72 +100>,<MAYBRIDGE\nmr>,<NMR_250MHZ>,
      <Start of raw data processing
       ef LB = 0.3 FT_mod = 6 PKNL = 1 SI = 32K 
       data hash MD5: 32K
       2D 18 E2 CB 51 51 DA 0A 85 8B 6C 2E 58 9A 40 34>)
(   3,<2007-08-20 10:49:55.13 +100>,<MAYBRIDGE\nmr>,<NMR_250MHZ>,
      <apk 
       data hash MD5: 32K
       50 29 BF BA 91 8B D6 7A 7E D0 F8 7F D4 0C 3A 85>)
(   4,<2007-08-20 10:50:00.25 +100>,<MAYBRIDGE\nmr>,<NMR_250MHZ>,
      <abs ABSG = 5 
       data hash MD5: 32K
       BC A3 A3 E9 B9 70 D7 D0 73 9A F8 59 BC DC 9D CF>)
$$ ##END=
$$ 
$$ hash MD5
$$ B3 98 98 E2 FC 94 5B 6E F0 2A BB 94 46 7D 7C 64
##$RELAX= 
##$RELAX= 
##$RELAX= 
##$RELAX= 
##$RELAX= 
##$RELAX= 
##$RELAX= 
$$ Bruker specific parameters
$$ --------------------------
##$DU= <C:\u>
##$EXPNO= 860
##$NAME= <ADRS>
##$PROCNO= 1
##$TYPE= <nmr>
##$USER= <dgb>
##$AMP= (0..31)
100 100 100 100 100 100 100 100 100 100 100 100 100 100 100 100 100 100 
100 100 100 100 100 100 100 100 100 100 100 100 100 100 
##$AQSEQ= 0
##$AQ_mod= 3
##$AUNM= <au_zg>
##$AUTOPOS= <52 >
##$BF1= 250.13
##$BF2= 250.13
##$BF3= 250.13
##$BF4= 250.13
##$BF5= 500.13
##$BF6= 500.13
##$BF7= 500.13
##$BF8= 500.13
##$BYTORDA= 1
##$CFDGTYP= 0
##$CFRGTYP= 5
##$CHEMSTR= <none>
##$CNST= (0..31)
1 1 145 1 1 1 1 1 1 1 1 1 1 1 1 1 1 1 1 1 1 1 1 1 1 1 1 1 1 1 1 1 
##$CPDPRG= <>
##$CPDPRG1= <>
##$CPDPRG2= <>
##$CPDPRG3= <>
##$CPDPRG4= <mlev>
##$CPDPRG5= <mlev>
##$CPDPRG6= <mlev>
##$CPDPRG7= <mlev>
##$CPDPRG8= <mlev>
##$CPDPRGB= <>
##$CPDPRGT= <>
##$D= (0..31)
0 1 0 0 0 0 0 0 0 0.06 0 0 0 0 0 0 0.0002 0 0 0 0 0 0 0 0 0 0 0 0 0 0 
0 
##$DATE= 1187603360
##$DBL= (0..7)
120 120 120 120 120 120 120 120 
##$DBP= (0..7)
150 150 150 150 150 150 150 150 
##$DBP07= 0
##$DBPNAM0= <>
##$DBPNAM1= <>
$$ [...]
##$SUBNAM7= <"">
##$SUBNAM8= <"">
##$SUBNAM9= <"">
##$SW= 20.6930455092707
##$SWIBOX= (0..15)
0 0 3 0 0 0 0 0 0 0 0 0 0 0 0 0 
##$SW_h= 5175.983436853
##$TD= 65536
##$TD0= 1
##$TE= 296.16
##$TE2= 300
##$TE3= 300
##$TEG= 300
##$TL= (0..7)
0 120 120 120 120 120 120 120 
##$TP= (0..7)
150 150 150 150 150 150 150 150 
##$TP07= 0
##$TPNAME0= <>
##$TPNAME1= <>
##$TPNAME2= <>
##$TPNAME3= <>
##$TPNAME4= <>
##$TPNAME5= <>
##$TPNAME6= <>
##$TPNAME7= <>
##$TPOAL= (0..7)
0.5 0.5 0.5 0.5 0.5 0.5 0.5 0.5 
##$TPOFFS= (0..7)
0 0 0 0 0 0 0 0 
##$TUNHIN= 0
##$TUNHOUT= 0
##$TUNXOUT= 0
##$USERA1= <user>
##$USERA2= <user>
##$USERA3= <user>
##$USERA4= <user>
##$USERA5= <user>
##$V9= 5
##$VALIST= <valist>
##$VCLIST= <CCCCCCCCCCCCCCC>
##$VD= 0
##$VDLIST= <DDDDDDDDDDDDDDD>
##$VPLIST= <PPPPPPPPPPPPPPP>
##$VTLIST= <TTTTTTTTTTTTTTT>
##$WBST= 1024
##$WBSW= 4
##$XGAIN= (0..3)
0 0 0 0 
##$XL= 0
##$YL= 0
##$YMAX_a= 441111
##$YMIN_a= -374060
##$ZGOPTNS= <>
##$ZL1= 120
##$ZL2= 120
##$ZL3= 120
##$ZL4= 120
##$ABSF1= 16.522
##$ABSF2= -4.171173
##$ABSG= 5
##$ABSL= 3
##$ALPHA= 0
##$AQORDER= 0
##$ASSFAC= 0
##$ASSFACI= 0
##$ASSFACX= 0
##$ASSWID= 0
##$AUNMP= <proc_1d>
##$AZFE= 0.1
##$AZFW= 0.1
##$BCFW= 0
##$BC_mod= 0
##$BYTORDP= 0
##$COROFFS= 0
##$CY= 12.5
##$DATMOD= 1
##$DC= 0
##$DFILT= <>
##$DTYPP= 0
##$F1P= 14.0000005364418
##$F2P= -0.99999901652339
##$FCOR= 0.5
##$FTSIZE= 32768
##$FT_mod= 6
##$GAMMA= 0
##$GB= 0
##$INTBC= 1
##$INTSCL= 1
##$ISEN= 128
##$LB= 0.3
##$LEV0= 0
##$LPBIN= 0
##$MAXI= 10000
##$MC2= 0
##$MEAN= 0
##$ME_mod= 0
##$MI= 0
##$NCOEF= 0
##$NC_proc= -4
##$NLEV= 6
##$NOISF1= 0
##$NOISF2= 0
##$NSP= 0
##$NTH_PI= 0
##$NZP= 0
##$OFFSET= 16.522
##$PC= 1
##$PHC0= -45.5753
##$PHC1= 8.40302
##$PH_mod= 1
##$PKNL= yes
##$PPARMOD= 0
##$PSCAL= 4
##$PSIGN= 0
##$REVERSE= no
##$SF= 250.13
##$SI= 32768
##$SIGF1= 0
##$SIGF2= 0
##$SINO= 400
##$SIOLD= 32768
##$SREGLST= <1H.CDCl3>
##$SSB= 0
##$STSI= 32768
##$STSR= 0
##$SW_p= 5175.98343685301
##$SYMM= 0
##$S_DEV= 0
##$TDeff= 65536
##$TDoff= 0
##$TI= <Analysis number 999999
Compound Code 99
Book Reference 9
Project Code 9>
##$TILT= no
##$TM1= 0
##$TM2= 0
##$TOPLEV= 0
##$USERP1= <user>
##$USERP2= <user>
##$USERP3= <user>
##$USERP4= <user>
##$USERP5= <user>
##$WDW= 1
##$XDIM= 32768
##$YMAX_p= 379226544
##$YMIN_p= -152634
$$ End of Bruker specific parameters
$$ ---------------------------------
##NTUPLES= NMR SPECTRUM
##VAR_NAME=  FREQUENCY,     SPECTRUM/REAL,   SPECTRUM/IMAG
##SYMBOL=    X,             R,               I
##VAR_TYPE=  INDEPENDENT,   DEPENDENT,       DEPENDENT
##VAR_FORM=  AFFN,          ASDF,            ASDF
##VAR_DIM=   32768,         32768,           32768
##UNITS=     HZ,            ARBITRARY UNITS, ARBITRARY UNITS
##FACTOR=    0.157963299565203, 1,           1
##FIRST=     4132.6476996994, 0,             0
##LAST=      -1043.33573715361, 0,           0
##MIN=       -1043.33573715361, -152634,     0
##MAX=       4132.6476996994, 379226544,     0
$$ Real data points
##PAGE= N=1
##DATA TABLE= (X++(R..R)), XYDATA
$$ [...]
19928 -14556 -10303 -9826 -22339 -53285 -59615 -26672 -33181 -77496 -44024 18571 58842 49550 38250
19915 38250 13857 -5022 -4418 10647 28872 82179 91106 70443 59328 60973 47585 -17787
19903 -17787 -34848 -48048 -32570 16062 -6319 -20300 -43019 11396 46637 42463 50032 69445
19891 69445 46609 48956 55656 52972 20874 30651 31958 45276 84812 112606 75337 9119 -31521
19878 -31521 -31224 -20558 -23264 -19501 -6558 -4322 -10673 2955 3897 8998 -5764 8763 45381
19865 45381 69281 71395 45396 60823 51873 -15268 -15280 -15821 -11642 18588 46308 45075 64141
19852 64141 39478 29929 4895 3405 38443 70964 51092 40118 46257 56778 46483 4265
19840 4265 -9690 -23739 -43812 -58275 -33469 9718 -6894 7704 51015 51713 36976 24467
19828 24467 40261 58588 47870 -14283 -29227 8551 9057 12099 34723 23762 14570 -3425
19816 -3425 1107 -664 -32081 -69115 -94566 -66793 -18001 -7356 -68747 -66429 -68260 -21477 57419
19803 57419 84323 112429 101882 80915 38388 30897 21921 47662 38660 -4988 18873 16440
19791 16440 -1254 -2141 -4495 2177 33681 53581 47456 -4046 -19710 24316 26916 23784 5855
19778 5855 -26851 -23836 -15721 -15145 -26409 -48426 -22870 -21245 -6733 -11854 -23079 -7497 1605
19765 1605 6063 -2980 -6291 2721 50180 48459 57913 68763 87334 92820 50360 10453 16922
19752 16922 25921 7334 -548 8705 32291 35977 60613 16760 -5115 -1777 194 -14662 -1897
19739 -1897 28652 16200 14675 9634 3008 -11854 4885 24924 18469 32260 28303 -15413 -17411
19726 -17411 11431 5716 -1896 -12389 -49351 -513 29836 15362 35016 31425 -2517 8054
19714 8054 8811 15025 -17259 -40052 -39591 -27879 29635 78044 42085 9195 34049 21760 -28854
19701 -28854 -1899 25840 35437 26041 -22107 -12524 16229 409 -10437 -38849 -37818 -6526
19689 -6526 39194 4642 -33218 -75213 -60970 -20140 29265 17305 31227 53196 48809 41068
19677 41068 24456 5568 2926 29725 18049 42513 54937 12900 6335 -2857 -17806 -56592
19665 -56592 -37161 5841 8231 -44854 -60805 -29448 -32177 -26854 -8931 -30947 -12802 11259
19653 11259 29131 16726 3286 -1282 17683 24109 60287 108405 134086 94431 72169 88521
19641 88521 116048 96218 74786 91533 102975 71285 77353 112408 97999 68237 57971 43304
19629 43304 38032 1857 38052 13714 -28748 -43003 -2892 32715 37304 28782 13444 13555 -2230
19616 -2230 4041 3023 10867 12508 13435 -10102 -44692 -23493 12873 43527 34401 27479 63850
19603 63850 87260 66087 27303 2544 11145 6223 20231 30047 44682 68635 59154 87222
19591 87222 50395 31312 34851 30794 6023 -5230 40471 48435 2793 -30339 -22228 -24704 -41410
19578 -41410 -38431 -8909 -11221 -34712 -35822 -34073 -37057 -5608 20512 27159 66172 79686 43678
19565 43678 33905 35519 20945 -462 15834 35611 24784 38950 68906 85882 60320 25150
19553 25150 30991 21211 34297 39974 26033 12339 -4913 -13 26741 12255 14554 64765 65010
19540 65010 59563 15051 1980 20136 1512 -27183 -5638 10248 1743 -2087 -1479 -10017 17417
19527 17417 28358 5692 -25068 -23444 -6352 -7861 -9493 -53639 -38519 -4240 33806 57177
19515 57177 39679 11042 1440 18755 -2702 10215 2446 726 6537 6933 52521 45308 47372
19502 47372 43810 47098 49212 40647 46119 53984 23986 14693 -1640 8145 -16322 -9220 6712
19489 6712 36025 41342 74416 73235 66711 55466 67638 71338 86558 103595 116770 111240 88898
19476 88898 62852 39313 13614 273 -49323 -45705 7836 57677 92020 60925 36684 11523
19464 11523 37050 67224 49663 67675 61694 72122 53100 11350 27593 28972 32902 63569
19452 63569 84586 82061 59629 62457 71456 53597 26418 14426 18941 8350 5321 2746 -1823
19439 -1823 -9107 -13028 -19965 -9997 -17787 -7026 30030 41433 64781 74332 87944 95429 99182
19426 99182 99697 55570 24435 9523 59676 52356 80047 45474 -4226 12608 61035 70131
19414 70131 79823 113077 120144 119185 117669 96534 69686 60381 39099 35075 41548 -722 8151
19401 8151 15635 15613 49419 48376 58614 83490 63522 41346 50838 53852 58085 41835 39295 62733
19387 62733 83580 82474 62452 75934 112863 123584 88618 44078 29580 28660 24606 21908 5033
19374 5033 3919 28557 52420 88156 111479 90523 32689 -55466 -111958 -89039 -35583 15259
19362 15259 38329 56405 59802 31657 14910 -6353 -20276 30982 77974 55867 27684 35049
19350 35049 -10384 -46708 -12788 11471 29859 23781 -4935 -3550 28051 16780 -32017 -47015
19338 -47015 -35410 -18889 -46096 -57155 2094 6825 -21227 -46011 -8068 28421 40340 35147
19326 35147 -3078 -52972 -73844 -52167 -17247 43088 30970 9016 10050 9144 38321 25411
19314 25411 9604 4460 -6297 -11681 -15401 -15827 -39013 4754 22814 27897 47852 8880 -24223
19301 -24223 -11311 1619 22239 5354 7021 54486 87438 90273 66264 62459 62212 49875 77679
19288 77679 71446 40745 54009 67289 53764 57506 32683 32034 31028 64778 70566 16599 38327
19275 38327 70834 66099 87992 103967 106566 91133 60458 91704 66844 37618 30977 27822
19263 27822 62684 76672 85025 70059 33925 16696 35356 6320 3095 22266 39366 22493
19251 22493 29906 14788 24864 60488 85684 92925 63733 28464 11731 32694 43190 28353
19239 28353 20383 37652 65018 87386 85250 116062 112556 49522 44726 22782 22306 15147 -17782
19226 -17782 -4973 -5559 -7394 23623 45315 63217 97834 106502 100700 91805 85600 95570 50506
19213 50506 54173 86274 79648 54945 22361 51056 52598 40368 -2891 31907 61216 32735
19201 32735 7996 23433 18090 -19018 -27956 -24866 26804 32493 30587 12380 1298 14822 15933
19188 15933 17860 5982 24610 14379 21275 28413 938 -22789 3953 41140 19644 586
19176 586 28104 17891 22628 39572 73848 84655 46435 22496 40406 52792 54176 40657
19164 40657 37115 54605 77888 102376 93018 58360 29165 24200 56354 55142 40259 29200
19152 29200 20740 4801 14221 25727 -2476 -22061 -39192 -79886 -76895 -23313 -3614 6914
19140 6914 -4760 24120 12916 -20341 12828 26910 5078 -37846 4593 63784 51479 30041
19128 30041 35174 34196 57309 63292 27478 9373 -22 -776 35917 23842 69127 69864 63437 44882
19114 44882 44446 4086 -17980 -16888 -14292 -21492 -15628 8873 19799 28245 69074 66350 45656
19101 45656 27345 23599 -5060 11980 24283 35678 32463 22487 7430 407 2722 37189 35020
19088 35020 36524 61375 60331 80434 73337 87007 105040 71449 56090 63212 97421 121237
19076 121237 86988 68533 75189 88243 77586 71116 70200 66128 69763 85955 71812 56488 51663
19063 51663 44921 -1272 22036 37511 34699 26910 19621 15212 13857 -4969 17279 33802 39988
19050 39988 38099 32097 18127 35099 5672 44797 70346 113030 117343 104329 80935 90133
19038 90133 97744 89959 91648 95006 101749 98690 127391 125143 92764 78444 76804 80050 43333
19025 43333 45531 60093 47114 21722 21520 44557 55222 20768 -22564 -3822 40222 72362
19013 72362 73531 81634 101713 104597 88558 42961 38234 50519 69967 63210 76011 50175 -13896
19000 -13896 -18669 49272 40373 45385 65783 98652 91676 82761 73157 43720 12497 19382 54113
18987 54113 89096 40312 25284 44682 56556 54160 70281 52167 29318 23015 33097 32526
18975 32526 35910 81480 81822 54656 52920 52560 48212 2664 -24184 7963 20513 30258 48378
18962 48378 70412 54195 15243 47833 118208 126044 134710 141356 128748 62777 31952 55889
18950 55889 64501 70040 46531 75487 97162 110541 122603 95953 95991 104694 104262 79758 65425
18937 65425 71072 56770 53063 58434 62767 17376 -767 12550 14762 9779 38280 48937 71856
18924 71856 66734 39265 24156 48149 60788 47338 58676 114047 103884 72793 88790 117909
18912 117909 84400 58037 58235 23580 23969 31824 59289 101004 158297 170775 106463 47605
18900 47605 21190 54097 93483 92630 82409 85654 83060 84603 79356 56343 17271 23653 35618
18887 35618 22551 13990 39798 83733 104070 99244 92632 70915 100268 110030 110557 121560 97332
18874 97332 76280 93440 136826 125081 95896 81918 71532 76176 33905 70182 62126 52453
18862 52453 50930 73800 96713 75699 60638 58765 107561 127829 133090 108015 110151 94982
18850 94982 90685 77152 54560 66893 86675 68128 96495 112695 114652 103550 100691 100316 68291
18837 68291 54292 88918 125924 74785 43444 58785 54520 42306 35651 13023 58637 60314
18825 60314 81390 115442 153389 172238 194816 237972 238301 210344 200302 145990 146123 185251
18813 185251 206106 227649 256929 290368 328725 342827 300897 244872 253610 287244 283620 298115
18801 298115 339551 311335 292942 297279 298594 233897 229894 237485 244883 241958 243071 245850 227790
18788 227790 215794 197754 231610 260224 252082 265685 224681 192956 165944 184166 195724 197350
18776 197350 216696 254253 249599 258553 255965 291828 340364 392054 445404 487450 537102 615151
18764 615151 659614 635654 583343 561044 514761 454063 455411 467472 463903 499131 557651 549486
18752 549486 526221 514173 449704 420401 399105 384996 382039 386128 399966 365199 359170 368098
18740 368098 356189 346026 317476 310105 291821 274740 251452 271109 267877 271567 264213 218169
18728 218169 218792 233228 233683 247362 254950 273055 268354 286104 317779 334072 332652 316972 300066
18715 300066 300965 291475 247444 254465 239624 224536 272137 268532 278514 291500 273902 288839 276808
18702 276808 295802 286077 280211 274458 273020 276913 285820 280078 259783 225393 203094 193226 185222
18689 185222 189053 168744 177927 156689 149436 169692 114761 107592 129031 144459 142767 131013
18677 131013 139309 149283 174961 151608 168210 153051 104681 93637 113372 113306 136410 177227
18665 177227 171069 120740 90329 70960 69736 100698 101229 101474 68579 88589 135025 180953 199069
18652 199069 156010 135576 135515 108771 122152 198261 245910 209182 176988 146806 142088 116408
18640 116408 106949 106522 108896 102293 127329 99474 74284 106558 172970 185399 142629 126442
18628 126442 126318 122109 118723 95761 122524 152431 177092 150929 159620 151006 137411 175875 156387
18615 156387 129730 123365 140098 123235 136578 139046 168648 176370 151423 171176 190093 201864
18603 201864 180351 167741 186529 205464 208997 195006 194374 205290 218870 225144 228512 208409
18591 208409 202309 197515 164620 153504 148094 159225 195455 223307 223844 182537 179074 217404 165742
18578 165742 112840 93865 99184 173649 200903 169975 150716 121402 143637 156877 176851 185525
18566 185525 151699 147338 173672 218278 222562 203736 194982 185820 215035 192309 176855 205623
18554 205623 200357 205556 211437 260669 268347 269176 263701 231687 201143 177102 196375 227045 254548
18541 254548 245158 259648 277110 275483 258260 316632 324697 320016 314763 326063 314298 279228
18529 279228 258910 284775 268553 247692 245510 242222 247134 243758 248265 271933 285849 218687
18517 218687 213609 218584 257453 278607 264786 275175 297104 301320 294612 317727 319603 332855
18505 332855 331044 302468 332722 349313 357039 383271 375657 382597 383163 353548 383668 396654 361223
18492 361223 366679 361334 394315 422901 427589 388521 375725 391207 455680 510748 485149 480842
18480 480842 468565 424573 389890 353075 333342 364457 375520 365081 371807 386348 362095 358001
18468 358001 380560 373005 371342 377887 402887 435166 435081 396248 378855 377420 382625 396411 397201
18455 397201 406145 445714 461388 459728 470996 469098 489506 506641 510567 529860 543176 562852
18443 562852 553813 565513 602856 574142 565787 571888 602623 617511 633342 635514 610869 628391
18431 628391 661023 709562 711298 704411 685994 685477 675377 633954 579893 562823 527698 546636
18419 546636 531029 460388 470304 490843 536742 569320 589978 585611 564444 532466 513468 509434
18407 509434 542538 523963 556878 609635 633913 647872 680178 671325 670232 670259 687756 703638
18395 703638 752515 771853 781654 836966 889595 949155 1009414 1082854 1121533 1189180 1245719 1273495
18383 1273495 1304119 1345766 1409988 1418622 1371881 1395588 1434273 1507184 1569222 1663887 1818375
18372 1818375 1950519 2073301 2200566 2277497 2320853 2299247 2259076 2194855 2119045 2012574
18362 2012574 1905509 1829370 1776929 1704294 1674688 1665405 1706106 1760576 1757888 1771999 1773216 1802716
18350 1802716 1799809 1770840 1766151 1811327 1842957 1888339 1952631 2046481 2134931 2207641 2326033
18339 2326033 2466893 2572174 2713245 2850294 3015476 3160674 3334518 3522046 3749054
18330 3749054 4027100 4315979 4621353 4973070 5355764 5738922 6146482 6621946 7111645
18321 7111645 7687663 8332383 8974715 9663931 10355524 11051201 11743541 12448733 13186171
18312 13186171 13869097 14412734 14773302 15156490 15799291 16839594 18448358 20696951 23538054
18303 23538054 26715536 29979740 33260432 36399264 39123488 40740315 40628180 39191140
18295 39191140 37165335 34454170 31049699 28002392 25750271 23799515 22101389 20988550
18287 20988550 20563249 20438406 20424680 20467893 20550267 20208512 19016906 17435422 16088842
18278 16088842 15208846 14828177 14761865 14940121 15336127 16022602 16944832 18017551 19199782
18269 19199782 20363955 21614999 22998679 24412078 25649334 26869840 28523842 30758131
18261 30758131 33462903 36590123 40284711 44734016 50057840 56043946 61709147 66564973
18253 66564973 70984333 75397669 79724976 82731997 83375296 81793163 79092544 76567104
18245 76567104 74693389 73422317 71412598 67686335 63175764 58864803 54333791 48876014
18237 48876014 42865941 36928624 31678264 27724576 25079324 23457185 22425971 21701564
18229 21701564 21101677 20665581 20225253 19579576 18601168 17644697 17012887 16696717 16684926
18220 16684926 16854659 17251170 17809149 18603633 19708920 21199345 23127477 25335722 27628541
18211 27628541 29814471 31872900 33900897 35908520 37618684 38540347 39145638 40275966
18203 40275966 42432864 45767833 50022274 54233696 57307064 58980702 59723157 59499605
18195 59499605 57415632 53271138 47292668 39579246 31572298 25061618 20529661 17627705
18187 17627705 15801171 14608807 13937311 13629358 13501338 13340586 13185167 13011630 12783641
18178 12783641 12341280 11385375 10158812 9042919 8148235 7432591 6838481 6330895 5889465
18169 5889465 5538610 5252093 4978664 4717057 4499006 4309076 4167390 3972683 3757165
18160 3757165 3557522 3381758 3233960 3118494 3000205 2847376 2741510 2655319 2636278 2556596
18150 2556596 2480352 2419872 2381710 2350059 2323743 2295530 2246812 2267109 2238835 2213539 2201879
18139 2201879 2244110 2265843 2247458 2262527 2352505 2418412 2475034 2555678 2677924 2826390 2994487
18128 2994487 3197723 3421753 3713075 4034153 4392705 4763152 5165331 5632157 6207582
18119 6207582 6861411 7591586 8490281 9580102 10915453 12617257 14869078 18017331 22258978
18110 22258978 26893845 30643617 33118951 34730873 36183896 37481988 34601301 26735558
18102 26735558 18746437 13169007 9891400 8019648 6836868 6000314 5390860 4934641
18094 4934641 4594016 4372912 4221530 4106163 4056608 4024983 4035272 4003352 3886396 3699794
18084 3699794 3512189 3347650 3144728 2939772 2802855 2660773 2539895 2433021 2317480
18075 2317480 2242850 2225882 2188030 2137026 2094207 2087721 2120311 2155383 2177337 2230101 2272197
18064 2272197 2268182 2223099 2209204 2222591 2231906 2250643 2254182 2173321 2022774 1897552 1845910
18053 1845910 1809924 1756668 1705958 1560554 1456456 1422735 1387067 1353701 1331993 1290907 1259898
18042 1259898 1237510 1280110 1341698 1359406 1348112 1361235 1357904 1356123 1425748 1472378 1504643 1519074
18030 1519074 1571091 1640959 1671033 1673746 1685817 1716931 1772383 1855481 1934662 2012149 2066106
18019 2066106 2151211 2290634 2437829 2578993 2652845 2693155 2741053 2708115 2564385 2394393
18009 2394393 2227401 2062664 1933229 1807387 1734051 1692945 1704743 1680302 1658963 1670007
17999 1670007 1660737 1647925 1629283 1681899 1703236 1745547 1797290 1882728 2005311 2128002 2264298
17988 2264298 2408857 2532991 2666627 2819927 2978422 3180494 3401535 3640618 3893322
17979 3893322 4237002 4618708 5031173 5499455 6021689 6634179 7389995 8217981 9151040
17970 9151040 10258088 11582330 13242345 15212544 17214031 19126839 20978459 22908649
17962 22908649 25073686 27256791 28769657 29548813 29999627 30476549 31172477 31989953 31910591
17953 31910591 29870936 26732498 23819153 21726813 20375584 19411694 17990710 15721550
17945 15721550 13179925 11100313 9744291 8937587 8383795 8081098 7962579 7941541 7975168
17936 7975168 8025460 8152030 8333569 8552795 8804503 9180123 9686245 10247740 10943505 11797328
17926 11797328 12814240 14063853 15609508 17409948 19303234 21214157 23276201 25532246
17918 25532246 28066656 30542976 32649194 34880921 37674055 40939821 44237614 46820388
17910 46820388 48340462 48675754 47594313 44948709 40845011 36168112 31588779 27366682
17902 27366682 23802044 21118369 19265398 17998392 17055147 16063145 14542368 12731415
17894 12731415 11124302 9951619 9177992 8671737 8309494 8024213 7764820 7593403 7407947
17885 7407947 7228900 7106076 7073571 7101392 7176123 7269398 7396419 7661654 8022979 8539320
17875 8539320 9223152 10149019 11220906 12277325 13245483 14207396 15315834 16579055 17626811
17866 17626811 18066162 18184946 18246325 18422600 18759474 19009780 18309687 16560301 14523982
17857 14523982 12882682 11762004 11046511 10366632 9274327 7779505 6412181 5356323
17849 5356323 4682118 4236405 3876297 3620085 3450724 3284910 3116253 2936901 2831127
17840 2831127 2748722 2637806 2536346 2437685 2333116 2266869 2179539 2077225 1980120 1839493
17830 1839493 1723513 1605270 1494087 1400856 1334211 1288849 1221921 1115772 1044310 1017752
17820 1017752 1036842 1013517 1008653 975471 961737 971063 913227 870243 864611 865190 852124 864921
17808 864921 883021 880952 841028 817493 803510 795736 808622 821961 831994 851981 816790 738860
17796 738860 754901 806804 816524 800370 805515 808688 812572 826158 836870 831393 784671 769407
17784 769407 747631 753739 811004 824733 823330 782491 746734 706244 676161 647797 655070 621788
17772 621788 584178 550568 556489 547007 537777 542472 510139 530942 535165 526794 524873 562209 554858
17759 554858 538683 506341 495617 537662 545186 525846 488843 494342 525023 498191 512790 578635
17747 578635 613365 621898 674693 689324 717925 748830 750621 755740 778269 780626 796667 839566
17735 839566 881467 913543 910140 890243 871654 852464 803187 769157 750836 744468 753579 787858
17723 787858 813968 832586 818374 817779 803551 775572 725643 691689 691465 706534 671114 661246
17711 661246 653468 609890 561646 575013 615934 615645 604388 575467 569408 584634 571880 585770
17699 585770 600758 625355 649411 700310 760141 748045 758232 783035 763345 752658 789562
17688 789562 813098 830843 833009 846132 854376 857169 868734 880623 898915 957413 985509 1010531
17676 1010531 1058121 1132003 1184207 1155390 1124674 1119024 1100622 1137712 1157650 1124083 1091394
17665 1091394 1102662 1176564 1238133 1292475 1286512 1315310 1373454 1440840 1511493 1572816 1589076
17654 1589076 1649216 1735544 1792056 1829278 1912047 1989438 2112032 2255336 2382686 2519936
17644 2519936 2631402 2781001 2939394 3061682 3126232 3171351 3218134 3284825 3325343 3417345
17634 3417345 3494998 3468033 3409281 3392259 3373398 3426350 3540006 3651913 3775896 3953373
17624 3953373 4143013 4397593 4630176 4936704 5320030 5733371 6157135 6637149 7249901
17615 7249901 7888339 8616867 9426715 10363028 11455365 12762406 14362691 16256354 18308955
17606 18308955 20440250 22637579 24863231 27218498 29484785 31482836 33536295 35950798
17598 35950798 39006670 43143097 48513267 54665210 60819503 66440843 71376118 75762068
17590 75762068 80203233 83392151 83980277 83432361 83234567 83970374 85608216 87326920 85589253
17581 85589253 78185859 68428236 59976875 53564479 48043422 42781675 38413272 35369554
17573 35369554 33476592 32378332 31642193 31033977 30330253 29128183 27155245 24911134
17565 24911134 23003418 21732716 20950484 20599489 20574444 20806390 21196446 21786658 22598301
17556 22598301 23694107 25110084 26939853 29203438 31783469 34543676 37463028 40657662
17548 40657662 44293027 48072549 50912001 52383399 53497752 55136393 57594666 60150694
17540 60150694 62043635 63758665 65822983 68550740 71847669 75838018 78886475 78413546
17532 78413546 75096152 70477949 65700417 61681740 58247447 53320054 45682335 37478579
17524 37478579 30927174 26473935 23500735 21263975 19289030 17607927 16384256 15604340
17516 15604340 15189386 14918290 14703490 14451398 14210466 13918462 13528045 12918519 11952732
17507 11952732 10913875 10057587 9359500 8756292 8277878 7900915 7613792 7406026 7265901
17498 7265901 7086073 6741923 6376225 6038288 5708104 5434082 5162072 4818385 4341165
17489 4341165 3895222 3543698 3311167 3115303 2942019 2763447 2610572 2470674 2338645
17480 2338645 2279933 2224240 2144965 2045676 1988472 1919635 1840001 1754813 1663504 1594520 1529778
17469 1529778 1456680 1396081 1346843 1295550 1263633 1232708 1182672 1152915 1117212 1074014 1018667
17458 1018667 996049 1013274 1011596 983885 946014 937840 948981 923523 922411 915166 880721 877747
17446 877747 911641 904469 913009 959281 949016 937662 947800 963773 949269 915406 866421 844030
17434 844030 810721 766185 735169 709358 693757 695059 635872 617582 609154 642743 646765 624432
17422 624432 587173 539479 573377 611820 611682 593853 599801 592691 590716 576365 593653 588357 547795
17409 547795 535838 575922 643047 659507 624225 579854 580968 582580 551631 553433 538164 501022
17397 501022 471711 450769 476540 511698 507913 500705 476953 449824 453189 433786 394907 364205
17385 364205 357872 336695 359628 332244 324126 319094 315522 311816 286757 296208 303797 295091 253053
17372 253053 233055 252345 283691 296260 326572 332120 340588 339932 292975 293087 307893 309343 310501
17359 310501 301194 308902 339899 352399 342100 318203 296526 300289 338647 340350 344845 302561
17347 302561 284190 238135 209108 192509 195891 163474 143499 131902 107279 88824 96335 97101
17335 97101 132406 118252 109503 117724 105327 75579 42819 68232 100361 158499 192648 155667
17323 155667 104417 93651 129378 115420 97135 111006 124710 89133 86249 111856 85021 51613
17311 51613 56189 60087 51311 26821 18812 41231 29190 28054 33407 49488 78188 100262 94748
17298 94748 70676 64497 54849 59364 50515 70726 71476 50203 70913 75381 33400 26510 46464
17285 46464 44958 59563 82907 121314 123831 105295 92684 88567 84573 98317 134769 129769 84906
17272 84906 15759 20225 12944 11475 32557 32245 44379 23635 -9412 -23829 -15288 15355 21187
17259 21187 -2104 40939 71865 39393 55795 79076 78476 92318 95866 71055 44850 37073
17247 37073 7339 -5030 42288 80381 59021 58139 66004 80394 46512 54095 50030 19710 9244
17234 9244 7560 -15701 -19367 -8895 -25827 -11525 27926 -1253 -30674 15079 43633 39241
17222 39241 4508 14605 3747 5290 -413 19999 52874 14143 20347 54728 58107 51159 68755
17209 68755 95045 93856 95787 46517 22423 10071 28043 48077 45921 58475 19683 24476
17197 24476 40839 59664 100181 120044 120823 105065 50225 27472 31356 64560 70983 49487
17185 49487 46489 39792 34013 51310 58568 50203 16473 9644 15478 23792 25090 45452 33607
17172 33607 -10612 -30587 -22764 -33484 -975 -4975 -37003 -2098 8488 -5574 967 17575
17160 17575 1175 16166 21656 14024 1397 -10139 -3135 32971 19724 -19029 -20586 -2559
17148 -2559 -3380 -14422 -66426 -94699 -85233 -32953 -35156 -41188 -7609 19901 -2428 -844 7626
17135 7626 21335 30260 22704 61323 57407 25959 22693 29323 47713 55045 34317 34453 40685 78205
17121 78205 75832 62448 54995 30723 3103 22865 24333 23903 20019 27463 6618 11609 -25929
17108 -25929 -8028 5177 1818 57758 48960 38188 28340 49067 107393 83817 46696 51146
17096 51146 26067 8147 18954 61457 109621 162277 210199 276341 291287 332835 335398 347710
17084 347710 363903 340886 314648 300674 295336 296676 293666 299226 271168 260065 283460 335638
17072 335638 311894 315806 341037 355045 388394 383436 324895 267145 230032 188639 157868 139572
17060 139572 175574 189949 186048 169872 151507 139955 123068 121834 133341 135441 107626 128918
17048 128918 130821 131924 123842 122163 117237 151976 144544 149141 194729 194718 210707 252170 303502
17035 303502 326514 335960 326656 311790 306136 306757 308479 299397 261734 250405 263407 288856 295858
17022 295858 267914 256972 235413 202936 192763 256744 284882 246411 246074 256104 253402 263981
17010 263981 235514 218990 211699 231979 200142 169204 138609 113877 110013 74396 26049 33665
16998 33665 61810 77635 47345 18716 13038 67848 69917 75116 65244 22731 56562 57031 15634
16985 15634 -8904 1897 86216 148072 138466 130296 94136 90800 90885 80121 75739 64951 28184
16972 28184 22878 28904 -12600 -42571 -62671 -43112 -8848 -21900 12956 2124 -4181 -22416
16960 -22416 -56967 -58823 -78734 -81687 -55659 -32142 -4810 -9275 -14406 -8784 -9419 6764 3168
16947 3168 -24305 -47776 -39281 -17157 6446 22664 -15869 -37948 -32722 -20649 -39308 -21886
16935 -21886 -25478 -51385 -51875 -43408 -42701 -45799 4812 36787 36117 27016 -50922 -38598 4747 4126
16921 4126 -15347 -40725 -53742 -103208 -75382 -26418 -16754 -39333 -49446 -60587 -75107 -97416
16909 -97416 -68505 -48986 -53341 -25757 -59947 -117253 -67572 -5840 2829 -13391 -21184 -66805
16897 -66805 -89594 -72241 -71811 -97511 -89853 -67793 -25234 -51690 -47439 -12239 -28219 -38815
16885 -38815 -11136 26284 30321 -24766 -44455 -65291 -69646 -65287 -46542 -41242 -38995 -46832 -49943
16872 -49943 -33682 -16156 -27488 -40180 -12065 -31845 -80166 -102253 -90359 -105993 -68913 -20941
16860 -20941 -23487 -23288 -35294 -36687 -33381 -39009 -41300 -36061 -40129 -83092 -70039 -45566 -26055
16847 -26055 -23395 -24594 -48687 -55709 -78440 -76318 -69015 -75173 -58309 -55045 -18611 -16399 3691
16834 3691 22797 11341 -35833 -38754 -3498 22001 33309 43745 26243 14454 7930 -61529
16822 -61529 -75268 -44802 -35194 -29020 4531 -14014 -19251 4835 -5710 14821 25468 -14790
16810 -14790 -75398 -95390 -93019 -78458 -75916 -35888 1573 11943 225 -48924 -22152 654
16798 654 -2864 -9775 -5923 -27347 -21200 -44180 -41093 3786 -17718 -82533 -94097 -81151 -109288
16785 -109288 -87349 -70465 -53621 -25571 -16705 -21312 -32723 -76976 -102031 -113333 -94423 -67375
16773 -67375 -83667 -101562 -130381 -96250 -27289 -10068 5063 8419 -26484 -45173 -24187 9224
16761 9224 17336 4906 -21707 -31988 3829 21611 50240 20740 -3057 23288 13652 -39193
16749 -39193 -24258 -27479 -47758 -29364 -4133 3014 23462 76538 67650 38528 38440 57902 51844
16736 51844 31074 53738 59514 33268 13674 19572 4451 -18772 -51597 -46629 -98931 -128737
16724 -128737 -83077 -13997 -610 4199 46880 65319 51215 32225 12009 -10935 -52062 -61981
16712 -61981 -62349 -53773 -18760 -34211 -49191 -56668 -86602 -57593 429 17609 -20351 -57635
16700 -57635 -54081 -58701 -61941 -63342 -41296 -23823 -33853 -71584 -102428 -60919 -12124 -14592 -9382
16687 -9382 -39196 -82531 -71570 -65242 -90223 -77903 -43348 -61861 -102638 -140376 -141356 -106942
16675 -106942 -62115 -45431 -30413 -66456 -84502 -72028 -50901 -24309 -30287 -39214 -50900 -44018
16663 -44018 -63132 -69671 -104518 -133874 -129344 -67901 -2923 10466 -20760 -57783 -45896 -13274
16651 -13274 -31691 -21030 1276 2598 -6457 10680 7315 -19064 -24285 28909 79122 45817
16639 45817 6113 -46614 -37325 8470 -6218 8713 27423 42661 35522 39913 63909 16791
16627 16791 -9988 14257 -21008 -54878 -35660 10895 12668 23488 19299 5292 -46313 -53873
16615 -53873 -16758 -2458 -56061 -111743 -82115 -59442 -47524 -40847 -56483 -106091 -129508 -112427
16603 -112427 -68099 -19966 -32198 -63445 -76000 -24509 -11299 2351 3872 -4838 24940 13922
16591 13922 21566 10123 -52307 -45037 -58696 -80918 -82036 -92276 -65805 -5537 -13732 -32353
16579 -32353 -44627 -42644 -46965 -77218 -92623 -103577 -122180 -114553 -94069 -81521 -58373 -61583
16567 -61583 -63667 -62371 -48163 -56849 -65559 -65441 -72290 -74166 -8580 19895 15650 11833 -4813 -8217
16553 -8217 5522 497 -13644 -34400 -28444 -66981 -8764 37711 11019 21122 36348 4866
16541 4866 -28571 -48874 -13878 -2629 -8875 -21141 -6612 2658 -3614 -17851 -3070 34984
16529 34984 66360 18029 20373 -7780 -35808 -29298 -2813 -1954 -1988 -5474 -41324 -8634 35762
16516 35762 29330 -8281 -35056 -25386 -49714 -37982 -20998 -8557 1592 -30634 -61837 -87325
16504 -87325 -80858 -37221 -39130 -58872 -52884 -30318 -45704 -38510 -9448 -29204 -68899 -77668 -67867
16491 -67867 -66423 -81708 -89475 -60465 -56299 -19614 7395 14328 -3832 -26013 12342 10921 -5683
16478 -5683 -38889 -65638 -48774 -15335 -2059 12358 -18186 -49230 -49083 -30834 13977 41007
16466 41007 2123 -10304 33752 -10552 -21306 9707 18149 -739 -3223 11768 -19914 -55992
16454 -55992 -80307 -71145 -58501 -13699 22881 -5847 -15007 -12031 13103 17126 -4754 -397 -22123
16441 -22123 -52493 -39821 -4877 -33044 -67094 -68403 -42874 -35038 -52890 -70805 -67803 -74415
16429 -74415 -105706 -67614 -65393 -92678 -73316 -21936 9803 -18 -20325 -47643 -36649 -34638
16417 -34638 -39169 -17718 -3943 -34047 -42705 -69174 -35549 -13780 -31652 -51669 -70737 -69370
16405 -69370 -81521 -54648 -26280 -26040 -38699 -53258 -37424 -17536 -11963 -52290 -37146 -4835
16393 -4835 10787 11470 -22561 -37903 -8849 1399 15682 37715 9960 -7803 -7458 -32408 -32158
16380 -32158 -13849 32781 26098 13843 10569 36766 -2384 -7372 18501 42599 84347 58943
16368 58943 13567 -31741 -70014 -57935 -78148 -60102 -14360 -102 -18122 -19190 -45976 -78784
16356 -78784 -60380 -22535 -4342 12062 -572 -1329 -14009 -32393 -28533 -13583 816 -44576
16344 -44576 -65705 -50056 -29006 -12355 -10189 -71503 -56817 -9012 34428 30217 22166 16678
16332 16678 -3648 -17995 -48082 -70783 -40089 6067 -25380 -8660 47998 53222 28596 33578
16320 33578 22299 -40471 -17180 4931 -5802 -18051 -18870 -74463 -103526 -86067 -11233 3472
16308 3472 -22437 -40214 -47909 -51059 -43001 -76013 -39193 27811 62607 70844 29619 35474 28452
16295 28452 298 -1603 -32068 -53371 -76597 -82126 -47068 -65093 -54006 -38569 -38748 -42805 -37151
16282 -37151 -27202 -44353 -82662 -55215 -30229 -52038 -45734 -56332 -56802 -37547 -8486 -28500
16270 -28500 -15088 8623 -28571 -46329 -61847 -58119 -34773 -38444 -26553 -10983 18933 47124
16258 47124 42995 13370 -1330 -40296 -84989 -47796 4287 12749 -37340 -52290 -66921 -66338
16246 -66338 -33663 -17932 325 -3177 6000 -19328 -486 -18083 -39542 -4939 14810 -4225
16234 -4225 -12669 -1095 -37516 -50755 -74237 -38795 -31059 -19379 -23562 19927 -11226 -20212 -485
16221 -485 14263 38874 76191 91799 53991 39608 35500 41205 29307 11631 1398 946 -10771
16208 -10771 -12424 -1819 5369 6569 -16353 -38995 -40721 -22954 -13580 -154 7375 -9096 3286
16195 3286 -41379 -54115 -48875 -40813 -35904 -32559 -35729 -36693 -43775 -37695 -35493 -37628 -39122 -51036
16181 -51036 -67434 -50302 -57054 -46688 -42101 -90112 -84445 -67895 -54882 -30336 -14424 -18225
16169 -18225 -14761 -40541 -23343 7121 -42146 -51881 -24712 -29570 -40249 -93136 -98395 -78356
16157 -78356 -50993 -76127 -108146 -65753 -43955 -52847 -27292 -14740 -14950 -15994 -32193 -38527 -13086
16144 -13086 -10008 -33204 -16089 -9729 -24151 -45688 -17003 -20735 -37145 -42879 -46792 -60622 -41755
16131 -41755 -49787 -57544 -36300 -58778 -101557 -94733 -63773 -62959 -23258 -21119 -30621 -55360 -48488
16118 -48488 -59775 -28639 -33429 -30103 -42312 -42220 -34836 -14307 -34090 6421 -4515 983 -27942
16105 -27942 -46950 -42800 -16057 -25399 -13434 10219 3435 -10211 -17496 -10549 -200 15619 13545
16092 13545 24180 10047 -19058 -26127 -47936 -39213 -7913 27286 19769 -1263 -25944 -40037
16080 -40037 -39780 -37582 -45054 14725 54660 34344 13194 -6955 -30417 -23548 -48762 -18390 -9560
16067 -9560 -16806 10417 3445 11408 -9648 -28460 -21101 -21381 -10829 -1929 11157 -1380 -28793
16054 -28793 -41678 -11758 -16540 -36522 -19779 -15504 -12337 -5071 -42231 -35189 164 31038 14263
16041 14263 -37631 -28203 4476 22081 23536 -6727 3160 7219 -11482 -15811 -18265 -27240 -37556
16028 -37556 -47565 -56804 -54318 -49503 -2147 23509 -12037 -43569 -35067 -44415 -37369 -8494 6466
16015 6466 49483 38916 -7723 -59400 -76505 -40216 9335 52909 59823 25414 -7852 -20108
16003 -20108 -11057 -26224 -39162 -38164 -49752 -80592 -61508 -32768 -22235 8120 42686 54565
15991 54565 31077 -11847 -14289 -6209 17819 10006 26533 66913 82717 38865 27895 10633
15979 10633 21096 -4091 19253 13639 -22729 -7796 -37430 -72115 -44948 -1147 -29409 -42827
15967 -42827 -37851 -10522 -13703 -41622 -27917 10841 -5463 -55808 -65668 -57401 -61909 -43023 -71873
15954 -71873 -52822 -49162 -55557 -34157 -19423 -17913 -10184 15662 41342 33909 37309 3094 -45715
15941 -45715 -14012 -3599 -2403 3059 11644 10945 -2442 10080 -1585 -13439 -29059 -11509 -25468
15928 -25468 3737 14523 32898 20927 -12928 -28555 -29269 -22743 -26721 -11023 10681 10214 -10379
15915 -10379 -3663 -3201 6019 16343 23791 -25151 -47369 -60618 -41489 -27008 -63580 -81868 -75438
15902 -75438 -27273 -48637 -36903 -29667 -14763 -4741 21088 -11881 1963 17901 -18041 -13140
15890 -13140 -10748 -12226 -37777 -42683 -4519 18592 49842 84497 79435 58882 26865 -18755
15878 -18755 -65921 -66061 -42254 -81553 -83600 -36073 -12901 5715 -2381 8685 24659 18053 23317
15865 23317 36224 75140 92414 94559 89693 59044 75585 126462 148814 115043 86500 85541
15853 85541 98735 64685 47990 73433 71416 44707 54363 32566 20872 30236 43728 26445
15841 26445 -808 -34983 -63314 -69739 -58021 -51693 -46303 -30285 -33830 4535 4863 -13424 -47479
15828 -47479 -58191 -39265 -59171 -77214 -53168 -14293 11480 -3816 -37322 -39081 -42381 -58129
15816 -58129 -39342 -52589 -56240 -14281 -1430 -5147 -18002 -26795 -15385 -10628 22146 15044 14085
15803 14085 -2768 -55523 -81100 -97029 -48740 -52019 -60327 -53984 -59033 -48645 -50205 -51000 -57993
15790 -57993 -11995 8452 -3256 -21760 3959 15206 29373 1055 -26150 -6194 12557 6898
15778 6898 16479 20328 2270 -18227 -32956 -55129 -46294 -24516 -17119 10087 27358 41495 39474
15765 39474 12444 -57912 -66281 -26994 -35657 -8994 -9599 -29162 -39922 -17202 -26975 -48831 -58489
15752 -58489 -3104 27596 6183 -31828 -27036 -21525 13877 17050 -3532 -25907 -19110 -15167 -20121
15739 -20121 -53118 -41687 -31645 -48749 -36211 -34699 16090 25020 27768 56593 26829 -25576
15727 -25576 -14154 -3949 -15089 11612 6600 47 -6165 -3236 -2515 -22559 2288 14052 -7651
15714 -7651 -10970 -13228 -5282 5063 1804 -7531 7632 -20975 -20388 798 -1648 42272 14750
15701 14750 -8372 -19495 -19678 22385 47967 52833 51839 49030 32661 17744 -24623 -43177 -40514
15688 -40514 -15482 -9714 18171 21109 16465 164 -21192 -9717 -21498 -22011 -25201 -31828 -4837
15675 -4837 -12748 12209 -11856 -65153 -50556 -46634 -33561 -66240 -42085 -39904 -19767 -15937 -43679
15662 -43679 -61373 -67943 -79602 -94675 -99906 -94822 -69896 -21586 9834 -18442 -4074 -26247
15650 -26247 -36231 -19772 -2455 -8033 -7294 -47443 -54038 -55230 -56073 -70933 -41033 -43193 -30784
15637 -30784 5224 -12461 -9850 24657 11188 -29286 -40118 -24110 -22640 -31619 -25871 -72916
15625 -72916 -76911 -63958 -9476 -28839 -50004 -50735 -21619 -5728 -5461 -39319 -55473 -47475 -44632
15612 -44632 -50213 -13523 3714 -13905 -15741 -27343 -20466 14325 6145 18104 20556 10143 -33954
15599 -33954 -32710 2920 9239 -12067 -42307 -32016 -21306 -9633 -31803 -71674 -44370 -8770
15587 -8770 -7058 -9198 -39730 -3468 15299 -13199 -54159 -12723 33850 18220 -12294 1286
15575 1286 5930 -1850 9307 -5713 7698 13684 34237 8238 -5426 2365 51845 1743 -20798
15562 -20798 -22202 -27054 -67965 -104545 -99760 -52474 18935 18991 -19030 -21393 -18820 -31927 -58856
15549 -58856 -28300 17173 -11164 -55352 -76309 -69061 -35347 -26399 -60497 -85191 -82594 -75751
15537 -75751 -50741 -37043 -35638 -61031 -52821 -37979 -35291 -7945 -8 -12713 -16867 -32191 -42749
15524 -42749 -56741 -70692 -61836 -44661 -42849 -86419 -66328 -49906 -45163 -34753 -16996 26983
15512 26983 14634 29394 5593 -31520 -60478 -72674 -38962 5742 15355 4852 -12916 -18775
15500 -18775 -66758 -64599 -49615 -39289 -18042 25464 25739 -7761 -17992 -13399 6681 -3445
15488 -3445 -10909 1050 38458 46756 3247 -10704 -32133 -53774 -78414 -84909 -52327 -36830
15476 -36830 -33955 -45435 -80561 -91778 -91843 -44570 -21062 -3790 9538 -58153 -82047 -31297
15464 -31297 1975 28515 16996 -9619 -7163 -34256 -35368 -20563 -35235 -4534 12427 -34828
15452 -34828 -41556 -35590 -24978 19085 20719 -5387 -21424 -6380 19474 -6668 -38124 -40711
15440 -40711 -16930 23690 38006 38012 -5773 16634 64714 59721 21123 -21006 -30892 -30799 -27216 -8714
15426 -8714 -44217 -60482 -92847 -78987 -29605 -134 -8774 -1256 21932 1859 3549 -34576
15414 -34576 -21589 -43665 -53034 -41043 -16827 29732 33640 -10368 -30749 -45886 -28466 -5079
15402 -5079 11353 40456 30866 -10691 -32156 -29605 -28376 -9389 -20839 -54764 -30498 -37856 -43186
15389 -43186 -28638 -50782 -66607 -40682 -27894 -31772 -26327 -27941 -27027 -27338 -45035 -15153 -17766
15376 -17766 -22620 -20511 -27369 15643 60579 15093 4744 12915 606 -9089 -28593 -41237 -52439
15363 -52439 -15163 -9005 1445 11202 1935 -34229 -1906 21974 36297 43966 63650 44494
15351 44494 34938 14585 10601 34276 22404 25030 802 -14052 -4847 41615 37310 6852 24278
15338 24278 12987 16182 39838 37463 42109 44197 -10567 -27366 -34425 -27491 -7255 -7146 -18728
15325 -18728 -18155 -50807 -53862 -65053 -37678 -48364 -62181 -34023 1 -15409 -45593 -52541
15313 -52541 -11934 22141 -8383 959 29362 10072 -7451 4053 34128 40198 13560 17849
15301 17849 5161 -19616 -13001 28464 24006 -4920 -17175 -1675 -58966 -55652 -43033 -55301
15289 -55301 -55889 -44456 -68110 -55905 -75820 -66959 -41833 -57072 -42213 -47588 -78275 -49673
15277 -49673 -14832 -24748 919 34037 15429 -26209 -20099 -23979 29107 41703 14371 -21440
15265 -21440 -23292 -19085 -51136 -78933 -59634 -22189 -2713 14126 -4460 -40307 -46709 -17003
15253 -17003 11628 9690 7583 -21630 -8441 8143 -8538 -3171 18649 6220 11889 18444 -20408
15240 -20408 -48652 -42358 -45920 -37321 -14950 -36298 -40782 -38996 -53743 -32234 -30556 -49048 -35751
15227 -35751 -7276 24517 39827 14585 -3167 -30478 -15324 -12719 -1606 -10710 -35617 -45780
15215 -45780 -67386 -71904 -23307 -24499 -44068 -30756 54 -6296 4618 16016 -16745 -38176
15203 -38176 -39218 -52874 -77565 -48518 -20817 -17612 -46193 -21026 1739 23004 26223 -33051
15191 -33051 -47159 -24351 -20632 -26109 -35110 -23685 -44326 -60027 -43856 -19502 -51070 -61912
15179 -61912 -103864 -84536 -61124 -80615 -80125 -71817 -57275 -56482 -44067 -15879 -7926 -10111 -10466
15166 -10466 -18505 -17605 -42015 -49366 -89460 -77664 -45805 -47542 -82721 -82972 -67452 -54846 -43594
15153 -43594 -58242 -77402 -39528 -27842 -81836 -55145 -22785 1879 -18701 -26701 -63824 -52857
15141 -52857 -38190 -11305 -19476 -30603 -42996 -41238 -8648 -8147 14966 7795 -32306 -64915 -78140
15128 -78140 -44169 -6216 -18966 -35936 -36625 -38370 -36183 -38085 -47587 -23578 -11333 -1494 -1839
15115 -1839 -27918 -19035 12681 23774 8071 5049 17098 29587 33497 37673 55063 42378 40005
15102 40005 31387 13385 29904 19266 -5272 -2212 -21597 -49948 -53849 -42652 -35146 -62998
15090 -62998 -5563 -55800 -46301 -43436 -77914 -40565 -20425 -35106 -66785 -49694 -10030 31435
15078 31435 29716 17693 16685 19051 -18138 -27609 -26119 -16832 51371 64249 23984 13057 41103
15065 41103 19213 -44126 -53903 -49330 -31666 -13809 2850 11810 36135 19646 4337 7764
15053 7764 -1408 33756 56966 42754 23248 333 -18552 43322 69461 51005 58037 67676
15041 67676 39325 28481 42516 46965 11133 -15683 -8960 17663 16177 21233 22273 17069 -20263
15028 -20263 -20915 23884 43049 11637 2902 41374 45192 49031 34839 41745 102324 115809 115295
15015 115295 116391 117601 106800 74193 77456 74859 120474 153735 187128 210695 243854 281081
15003 281081 341133 371606 390465 453309 521135 616199 713768 825641 957579 1164624 1485251
14992 1485251 1812678 2057085 2202241 2267301 2349381 2410848 2254366 1740381 1176796 792177
14982 792177 572511 438856 352323 308092 268883 271085 259218 225801 194986 203389 234064
14971 234064 202800 165001 191366 188228 166311 161740 136432 153598 132461 98522 76014 71127
14959 71127 71398 77706 84440 126286 164707 164295 128586 97111 62984 81953 52942 30222 30918
14946 30918 28969 -6730 -28758 -48732 -28261 -20625 19923 66806 52526 7130 -12397 -12320 5675
14933 5675 26765 -3115 -18384 -35623 22848 39970 50032 43724 84672 70336 51026 29181
14921 29181 7830 -25846 -59793 -51651 -4175 6040 37852 57557 7250 -39356 -47182 -28332
14909 -28332 -26693 -67876 -60992 -29064 2805 6639 -11731 -30526 -2221 28840 24955 4813
14897 4813 45613 71305 85845 89732 75892 64627 35415 15392 10960 -14762 -28368 -49067
14885 -49067 -66210 -56033 -48472 -26385 -7228 17021 24988 5149 24134 18206 6982 9095
14873 9095 14337 -12419 -51206 -25619 32345 54785 41387 37886 30644 30832 -5707 -20158 -12065
14860 -12065 17602 48747 21497 -6368 7164 -44309 -63218 -42561 -17864 4975 837 -45157
14848 -45157 -45463 -46738 -38327 -36981 -57631 -59670 -71095 -56442 -50526 -50640 -72969 -92574 -72675
14835 -72675 -9822 -3078 -26908 -59983 -57157 -15786 -31221 -14151 12491 14287 6511 15425 30707
14822 30707 41401 68638 68191 24650 28416 19852 33480 45506 51735 65114 77902 77168 38551
14809 38551 -293 24848 21805 27986 -15 -2034 14809 1161 -59583 -61830 -50985 -54032 -39303
14796 -39303 -20897 -3826 -11405 -8708 37007 54762 30297 27374 18483 3240 -35632 -82017
14784 -82017 -67724 -12055 31212 35566 28113 43192 57979 41183 21588 -16242 -56682 -50268
14772 -50268 -57304 -43613 -32670 -23600 16416 17630 -7469 2008 6043 -6372 -1108 -22850 -52191
14759 -52191 -44449 11015 65922 38118 5388 -2972 -11348 -29763 -34474 -25642 -8330 -12711 1813
14746 1813 487 18544 -29540 8162 32703 -84 -10360 -29289 -52545 -96167 -86370 -31426
14734 -31426 20897 47857 46266 40563 3056 -9416 21992 80849 60726 726 -11633 -1035
14722 -1035 8900 796 -3986 2112 17600 17197 35601 24430 34525 -1378 -39265 -38260 -33940
14709 -33940 -2083 -3613 -76538 -108907 -71617 -74329 -56015 -40916 -35630 -4589 -22622 -42634
14697 -42634 -17775 1452 -122 -22106 -38050 -76849 -91033 -60314 -46633 -28326 -39728 -22673
14685 -22673 12660 19392 -15428 -40971 -12040 -14638 -16805 -21488 -10394 -20116 5535 -6654 -13357
14672 -13357 -43850 -75150 -50553 -34094 -7792 32503 79424 108262 82987 94067 46158 17168
14660 17168 20796 44720 27913 27085 6754 -8842 -14686 -25352 -40499 -27776 -33439 -43954 12518
14647 12518 7270 -10662 -27655 -14134 14435 27812 19094 -7748 -7603 -61456 -75023 -36559
14635 -36559 -18851 -28392 -25160 -28496 -42993 -30144 -47634 -17849 1239 -2652 -46579 -48303 -18634
14622 -18634 -11386 -7143 -8344 -45758 -46910 -17484 3968 -308 -5578 -31292 -49666 -20292 -8386
14609 -8386 -53719 -78809 -69143 -60389 -26707 -29910 -28039 8688 41351 13344 -27583 -10601 -18364
14596 -18364 -64131 -83485 -29116 -366 18879 -31887 -55390 -55414 -24139 12981 15995 -34836
14584 -34836 -48925 -33914 -44785 -52387 6914 14612 -30977 -35301 -13160 -7080 -27354 -15610
14572 -15610 3254 22534 9160 -5370 -5288 3613 9522 -2399 7188 51290 57232 44901 29768
14559 29768 12266 2906 29075 20196 733 -14090 14983 32061 6329 -48420 -7830 -86
14547 -86 -16952 4101 18793 11999 -23750 -9070 8999 10098 -36927 -38976 -22313 -27062 -30654
14534 -30654 -14781 3169 10675 6786 -9559 -14799 -8417 -17847 -36866 -71912 -86468 -79438 -88768
14521 -88768 -124586 -81263 -51878 -17073 6468 -22607 -28607 36832 22167 -50874 -34214 -1526
14509 -1526 -19358 -30906 -26120 -42214 -74804 -44142 -927 25411 25902 7062 -23483 -57497
14497 -57497 -16834 30678 69930 66270 24411 -9360 -32354 -46847 -45270 -21174 -19932 -11110
14485 -11110 -7467 3617 3180 365 -21886 -43002 -25734 -17241 -625 -3888 47056 56959 31380
14472 31380 7813 20067 -4326 -50974 -42514 -56475 -110999 -89943 -16119 3837 -27163 -44369
14460 -44369 -53750 -40426 -59707 -32077 -20014 -37017 -67278 -29978 -2059 -11042 -38157 -58475
14448 -58475 -15593 1452 -47517 -68977 -75294 -21367 16346 17263 20072 22707 24545 -447 -22048
14435 -22048 -20966 -35035 -56362 -42542 -40458 -11177 33842 47347 20401 -18730 -43835 -16790
14423 -16790 -11194 -12774 6705 14855 27029 36737 12888 15094 17298 -7552 -6302 -8316 -9728
14410 -9728 -6855 -14866 -23295 -24357 -65339 -71009 -38496 -53220 -64121 -31132 -16256 -34738 -22191
14397 -22191 30715 32192 16043 -4965 -31057 -36426 -27583 -15631 -24759 -49988 -40950 -68997 -71223
14384 -71223 -45939 -42199 -46388 -39447 -19691 -3239 -6179 -870 21184 23118 13065 14350 31608
14371 31608 22638 -3041 -13701 -36076 -58163 -87989 -59917 5729 22752 74028 106529 83960
14359 83960 44496 66697 39422 45379 116295 134721 63117 52927 34765 23171 21837 50690
14347 50690 21221 4148 24834 21683 -326 -42804 -66857 -83003 -69983 -51668 -13648 6303
14335 6303 6775 -426 40333 38916 -20610 -30466 -17835 -44426 -68119 -75607 -78121 -13468 -1265
14322 -1265 -20900 -3014 31449 10346 -6030 4979 -10051 -18957 -22722 -13137 12685 -619
14310 -619 -33629 -20934 -17244 14395 62515 43112 3676 12204 20251 29552 -8109 -51748 -68959
14297 -68959 -28505 25849 54228 55503 31920 37024 24583 12379 8530 5206 -10144 21980
14285 21980 23218 52014 56975 20285 -4339 26576 28987 18507 8648 -378 14100 21992 -5679
14272 -5679 -3842 -337 -20755 -21730 32271 45676 16312 21510 23783 5026 -4235 3576 16603
14259 16603 -2210 16459 22721 -16632 -23868 -2317 -15562 -26915 -23567 -10285 3047 6664
14247 6664 -793 6867 -3496 9667 35294 4211 -14234 -33042 -12967 355 -107 -22194 -18657
14234 -18657 15616 -1489 -16262 1943 41389 36157 9193 19219 14205 18994 11255 775
14222 775 2619 16375 14347 16913 25604 -10790 -7742 -21156 -30003 -36726 -35068 -35292 -15921 -39054
14208 -39054 -56474 -41944 -4533 -1948 -34584 -34439 -53977 -41886 -3408 26695 18551 -9778
14196 -9778 -24497 -64515 -32757 2875 12941 -54965 -46566 -25916 -19771 9421 -3910 -17583
14184 -17583 8594 21875 4691 2019 -6903 -26028 -53529 -30062 4799 24388 59141 32926
14172 32926 22869 4655 -26320 -38102 -51114 -46916 -8906 1054 -8131 -7414 -3286 26106 22113
14159 22113 27443 68661 98973 87087 66117 38318 68000 80139 56149 39176 1229 -23266
14147 -23266 -29617 -38087 -24125 -42341 -57306 -8865 15048 15564 33158 71097 83474 55052
14135 55052 -14845 -58658 -62757 -49166 4869 15398 30189 44750 57720 67510 105380 114745
14123 114745 107967 129795 139588 157695 163873 142737 133936 142732 118138 108891 70311 53695 50310
14110 50310 54558 31119 24723 -14612 -13559 32155 64802 83696 83156 73890 44108 34640 67881
14097 67881 64069 23720 8206 37485 37704 16997 40066 67836 41395 -25829 -27401 -25235 -16417
14084 -16417 1357 -1863 -3965 -33744 -59169 -31098 -9099 2520 -8995 -17258 -14230 -35729
14072 -35729 -36686 -60056 -20739 32487 56897 49895 29696 -12482 -33491 -61320 -36666 31
14060 31 -36957 -45610 -8561 -9780 -23085 -6078 -46283 -61924 -37432 3986 29634 1798 -40533
14047 -40533 -52212 -43242 -19188 5978 19987 25398 46587 55135 52431 54075 14898 -60123 -46577
14034 -46577 -30065 14826 63069 76853 47108 6428 -2879 -34347 -22916 3122 -2753 5626
14022 5626 33038 51824 33727 -2338 -29574 11503 26699 26099 18997 10479 35654 16738 9702
14009 9702 17262 27299 54040 53404 54498 36250 24589 41305 95259 67976 15752 -6505 10842
13996 10842 5922 9064 16418 33713 45555 33424 19037 14646 -3121 -6616 -4006 46152 51544
13983 51544 21559 17533 1591 -59159 -82504 -32984 -17987 14112 44631 57218 17644 676
13971 676 19106 44531 58479 67049 69292 58212 53372 27221 5731 17464 3643 -36635 193
13958 193 44889 42592 -11423 -36629 -45796 -32886 14996 38992 34816 38689 35769 37555 29417
13945 29417 41843 24008 -2869 19939 27400 11064 -10346 1788 37196 30905 45238 63440
13933 63440 36934 25062 48615 33232 8320 34482 41788 33804 64917 87426 125276 142721
13921 142721 168319 158023 137168 135865 165456 183087 150421 118236 85617 52475 55275 38583
13909 38583 41644 61026 35495 34100 18424 50639 70432 61583 54638 61066 53670 42118 -7293
13896 -7293 -43416 -71046 -10554 15572 12859 16743 -4774 -35550 -15693 19703 30733 8440
13884 8440 -36 11748 15503 65942 70187 38445 8701 12595 50195 -5689 23823 51449 25479
13871 25479 52485 48178 66437 48304 63843 79008 56513 38124 38433 9760 -5321 -39969
13859 -39969 -32893 -45839 -11060 7924 22613 32192 44018 26290 -1818 23160 47527 31875
13847 31875 25057 -46453 -86994 -80645 -47278 -30964 -34211 -36385 -54328 -61072 -11906 -14987 -28875
13834 -28875 -29459 -24309 -7353 -21160 11979 -3481 -22129 -47355 -7342 42607 6718 839
13822 839 9638 34156 55376 44032 30409 37666 29550 51186 99828 136395 128976 65216 36486
13809 36486 34671 63032 62821 71410 71289 40833 11848 -7639 -3755 20987 16262 11769 7174 14793
13795 14793 -4255 4860 38047 26467 -10267 -29886 -24398 -9596 -13368 -37438 -29655 -9882
13783 -9882 -1242 26597 59086 95040 78062 61256 33358 26586 65394 78974 37636 -16931
13771 -16931 -38976 -35539 -14220 15377 40300 54464 55156 23451 27821 6493 -12104 13329
13759 13329 15995 35134 32697 37676 40525 44375 38154 30248 24849 14197 1263 9346 54623
13746 54623 58153 31369 31960 43301 56627 37923 -2027 2507 7213 22436 17490 11275 -882
13733 -882 -11051 -15664 -27749 -48853 -28704 -21953 -8293 6081 -28418 -15224 26386 63207
13721 63207 55896 51085 15466 -19308 -1675 -18649 -45124 -47010 -47367 -40204 -36455 -37608 -57955
13708 -57955 -68635 -40479 9038 31519 42746 19302 23700 5051 -8898 5499 -34347 -24162
13696 -24162 -4327 -10374 17791 -5504 -18959 -13705 15968 68317 95164 91996 65659 88612
13684 88612 53927 20622 38216 71503 55211 32608 45597 52095 42943 31730 24512 28750
13672 28750 61924 85952 83408 41747 27595 25468 -39599 -4102 38485 49574 54113 53745 60825
13659 60825 70054 70004 67307 68065 42238 -991 14446 19549 42964 81151 68034 61828 61106 68150
13645 68150 42153 32183 19412 63743 83160 47614 54585 54304 67699 86664 56532 50051 74067
13632 74067 74085 82952 75196 87959 160940 146189 110053 96868 69621 37103 33291 67344 84349
13619 84349 126403 166349 174704 170232 148165 141946 127780 160331 172172 150372 156477 158123 153207
13606 153207 145981 109483 127702 157178 177894 219073 208521 231968 262451 298248 288442 292668
13594 292668 335834 350422 367179 431177 524056 570584 675150 746614 808549 889268 978625
13583 978625 1121570 1268122 1382550 1540211 1768287 2022629 2254357 2480696 2713738 2918577
13573 2918577 3081886 3134553 3117918 3005319 2881160 2728307 2521901 2275229 2026104 1807721
13563 1807721 1555915 1351114 1138134 929477 804127 730163 676625 621928 572210 537533
13553 537533 510244 482198 468584 442821 419840 395982 352297 309190 282631 284813 298973 249665
13541 249665 218957 217014 222008 209475 195688 171363 171886 167599 136525 148671 220069 223432 199137
13528 199137 161935 153848 171880 194703 155577 124419 127573 133933 144464 144889 131087 94523
13516 94523 64209 76406 116206 140624 139043 137209 136428 134817 148932 181834 187162 174310 186425
13503 186425 188621 151079 129706 147951 158104 132240 105203 118725 135937 112953 100106 100759
13491 100759 155529 186723 156541 163598 162395 131601 113257 119043 130806 125985 104933 105670 138515
13478 138515 117031 66778 73047 88765 127116 171582 177283 200078 229080 225042 164714 76907
13466 76907 73243 95279 120339 118077 126748 132811 119949 99574 100933 127600 112065 93008 106917
13453 106917 119095 92717 109701 114374 131758 131509 172387 184220 167112 154387 131659 145069
13441 145069 148846 128747 127042 123050 85707 88365 110495 124694 122730 119474 116586 127608 136200
13428 136200 148785 95580 86739 141361 190342 187529 151597 134194 111559 84707 86693 92153
13416 92153 100452 112863 137956 103766 114899 151227 132534 94221 85458 101425 75461 20902
13404 20902 13064 16988 42528 62371 76271 99886 112739 119516 143477 130961 116319 108418
13392 108418 91850 53019 44434 65658 42750 56579 75530 64322 35638 36413 50941 71377
13380 71377 65910 32624 12275 -17662 -31520 -9214 -26114 -19321 2428 18823 65510 75906
13368 75906 69512 52380 48263 50980 42557 14086 18197 37545 24420 29320 44818 41204 37343
13355 37343 26658 37987 78347 123519 120022 87789 72812 58536 45639 9317 -2303 12642
13343 12642 5216 42005 61635 48599 21951 29377 28440 -725 21814 40816 21586 -2792
13331 -2792 -693 -7222 -7061 14899 28068 61644 82248 66433 83745 33757 25086 42352 29668
13318 29668 22862 27228 79380 80467 76043 32317 161 23165 55919 97794 109125 96409
13306 96409 62542 55018 47518 44755 41880 24979 11824 27789 70548 88792 77859 62716
13294 62716 95291 121236 112045 70346 25794 34106 52254 12170 -3851 30424 37186 64378
13282 64378 33989 40341 69868 101073 138370 147897 127599 120088 126534 83233 37585 25615
13270 25615 41236 32573 26315 37903 72953 78343 112509 100641 79153 39032 39168 69174 76035
13257 76035 54436 64173 63866 117 -11778 47688 61551 17418 14466 6503 17345 71197 91963
13244 91963 41079 13705 -18902 -17386 22338 47447 55080 33871 554 -17568 4192 -2670
13232 -2670 -3208 42691 35977 16772 29805 36965 69713 44326 35299 12715 60191 98111 122254
13219 122254 89327 58971 53609 52859 31405 55956 105871 73229 24566 59298 90503 124292
13207 124292 133344 112853 46996 19213 44576 34824 49885 43568 30068 44127 37034 29680
13195 29680 65966 92139 80574 59792 35615 49968 57549 77453 121725 131001 120169 71384
13183 71384 24367 29035 6729 3224 8529 48852 50563 30520 51868 80718 69435 52370
13171 52370 44531 33400 8877 14397 39392 32079 38195 56783 62285 53982 33301 18173 -5644
13158 -5644 25370 64301 53572 11583 -36845 -544 50589 48518 45378 33853 -8358 -37500
13146 -37500 13224 78232 87331 49135 15905 15843 19321 43334 75376 73670 64409 59647 55844
13133 55844 90903 116210 92723 58480 52952 17949 51913 47004 9910 -12247 -2810 5495
13121 5495 35443 72358 118988 123352 131197 118130 116766 120652 97398 45490 -9732 -35315 28874
13108 28874 122061 139438 110467 87807 66092 79738 71855 88812 121230 118910 90065 55172
13096 55172 36161 51940 91541 81783 75502 80547 56986 59982 76954 49139 22767 58089
13084 58089 106114 106190 77468 90599 93701 115680 93030 65714 86397 111562 107505 122222 99178
13071 99178 87300 111795 85549 39231 35499 92293 141205 152891 144771 112379 109454 94441
13059 94441 53034 118002 137552 155394 164293 176177 216375 217326 191196 170948 210093 281087
13047 281087 343979 387061 393926 385784 430252 445461 356485 260801 219454 189901 205497 212111
13035 212111 190040 160964 166719 142030 120738 133975 165617 158455 129932 102796 117524 146114
13023 146114 176076 194805 167387 141036 126006 128368 128400 140267 172196 210470 186765 169696
13011 169696 139651 129650 114873 96265 102349 113418 117671 142587 98428 61776 99370 111326
12999 111326 131482 155634 161526 172388 184146 149102 163759 186458 202530 186959 180999 172625
12987 172625 175043 139170 153523 165279 132204 125978 112744 118908 131925 135602 146229 133227
12975 133227 155012 197207 167639 169015 198055 223741 236487 242707 291528 286666 258518 270352
12963 270352 300049 282983 268973 313222 311547 305251 303424 311762 306757 274659 264240 241545
12951 241545 232751 263119 256581 209510 245025 260601 261317 265474 267420 260216 263202 288416 295395
12938 295395 337908 377116 351690 326912 330033 364947 378592 385939 397830 376540 395602 456904
12926 456904 457779 520826 581582 624173 638847 668430 696277 735633 768863 789992 847462 909924
12914 909924 926408 975992 1041701 1092676 1158027 1198564 1241902 1299471 1347811 1385677 1456866
12903 1456866 1568973 1630646 1686853 1750177 1811858 1892070 1945153 2084877 2203261 2250123 2268881
12892 2268881 2342015 2351700 2316914 2261042 2154964 2039824 1889075 1697555 1503257 1323283
12882 1323283 1179516 1052699 911771 816874 762647 725975 674662 634599 593808 542373 530173
12871 530173 546498 512065 491315 505807 496090 471444 454425 475700 414372 376669 420628 465506
12859 465506 467739 431354 444022 438049 464852 485472 474068 414909 429920 475558 522222 531994
12847 531994 514579 571988 592013 570978 552077 602037 664222 703319 784990 856592 903941
12836 903941 951823 1017155 1076372 1137883 1211813 1278482 1308716 1319486 1331620 1341376 1341560 1373310
12824 1373310 1358799 1316534 1323665 1300266 1257270 1211319 1170756 1094024 1060828 1025394 999784
12813 999784 973335 953550 936226 879061 824932 783041 764389 723452 704498 666198 655900
12802 655900 614195 592562 585233 536636 497715 473527 450811 454544 486378 467791 443042 431493
12790 431493 478668 477393 437905 418739 429004 444485 443613 466280 455408 427794 424461 407472
12778 407472 398434 432392 445431 420406 419031 431161 430743 418686 394451 359676 360301 335482 339526
12765 339526 351496 356207 360467 332725 302048 295982 315299 365336 402650 382244 361931 354491
12753 354491 355286 372041 430138 431217 420728 433304 434830 396612 422519 455605 460168 464876 466408
12740 466408 495574 476236 467236 464557 481184 500325 490188 466126 458150 418132 350050 309748
12728 309748 294576 341358 382685 399805 388897 374950 363875 385991 391354 384535 405042 396934
12716 396934 392152 387142 394582 397928 382056 434869 483279 510861 497355 451948 472499 493459
12704 493459 528631 566588 547240 499352 527247 535904 538254 569237 620628 637030 597769 594119
12692 594119 626366 618373 613043 623002 618296 600047 591869 576476 571351 566191 576411 568578 545044
12679 545044 554641 532754 517435 482437 503720 519732 522035 529469 525529 506245 491740 475232
12667 475232 459371 481662 507741 518324 532044 550907 594863 624425 621574 614017 628506 646537
12655 646537 719017 754141 753027 751640 755374 729159 741315 775839 770750 787898 824005 810618
12643 810618 801483 807590 848077 862114 887268 893134 895632 907228 947673 1004351 994826 912998
12631 912998 858021 846582 825652 806300 796392 773415 776734 784545 778971 768384 745817 748108
12619 748108 757289 756645 756309 779820 821330 856377 883998 879046 840613 841727 842307 819217 806235
12606 806235 776592 762479 746887 729203 718247 730054 779151 855655 888038 915728 926060
12595 926060 934152 996485 1076210 1126627 1157701 1191529 1235167 1315414 1403835 1476406 1523886 1578094
12583 1578094 1663548 1732185 1753888 1788242 1843185 1852052 1882345 1948572 1987021 1997911 2034449
12572 2034449 2094577 2193999 2301683 2373424 2416383 2458077 2501120 2544935 2558780 2547001 2596106
12561 2596106 2633270 2684811 2725178 2783460 2876915 2985754 3086552 3237605 3368977 3509307
12551 3509307 3662703 3774784 3877204 3910891 3871164 3835956 3833263 3784806 3718379 3597357 3492213
12540 3492213 3509906 3550851 3646706 3770851 3895448 4098531 4408573 4755523 5166043 5659116
12530 5659116 6243932 6895335 7681898 8602874 9606928 10700603 11771148 12734277 13540312
12521 13540312 14221368 14650269 14634879 14156098 13445185 12670931 11666783 10390223 9183497
12512 9183497 8204758 7401963 6715559 6167086 5768690 5530564 5380431 5337949 5269326 5234695
12502 5234695 5274094 5313584 5375535 5503905 5585797 5674432 5815368 5926326 6055039 6169810
12492 6169810 6249188 6401394 6560803 6787764 7036911 7277981 7558098 7848158 8218717 8650352
12482 8650352 9146183 9675020 10255570 10849095 11580388 12449397 13427986 14507201 15782478
12473 15782478 17301709 19082795 21136787 23454660 26096592 29097873 32531067 36384229
12465 36384229 40587281 45218961 50343421 56030716 62347349 69393831 77523997 87206794
12457 87206794 98762219 112609530 129050985 148036939 169647257 194273938 221230422
12450 221230422 248314157 272568662 292816659 309465620 322203772 325719980 315875902
12443 315875902 297833868 278408759 255866618 225483550 191345018 160747115 135320004
12436 135320004 112955015 93378412 77689132 66101986 57921840 52083801 47802737
12429 47802737 44459495 41760448 39476043 37447577 35544571 33717331 31874594 30050516
12421 30050516 28212781 26391036 24593539 22893610 21283581 19813275 18459930 17231084
12413 17231084 16140643 15138356 14196248 13378129 12626794 11923390 11318315 10748137 10189480
12404 10189480 9657562 9225949 8872024 8517474 8165948 7874379 7645408 7411243 7170489
12395 7170489 6974211 6817310 6619086 6440392 6307494 6181165 6017631 5843044 5631288
12386 5631288 5436099 5232452 5028289 4819527 4640026 4460299 4313797 4129331 3960887
12377 3960887 3790344 3620507 3505510 3373531 3272091 3234922 3203050 3087909 2986876 2921853
12367 2921853 2855099 2820140 2764503 2734883 2635383 2588984 2555573 2487039 2469490 2462280 2431485
12356 2431485 2349150 2313326 2282840 2271329 2237999 2172113 2147003 2117320 2088114 2115311 2095897
12345 2095897 2092335 2088036 2076751 2055918 2051413 2027376 1987284 1938094 1881508 1848880 1830374 1816138
12333 1816138 1804558 1817879 1819502 1769806 1743023 1738520 1683432 1605374 1524987 1456466 1459398 1445305
12321 1445305 1424577 1434685 1424379 1325453 1243017 1199062 1189470 1116737 1048050 1035219 969903
12310 969903 943387 928608 918168 891713 888898 882055 888792 927263 950889 994020 1034661 1073656
12298 1073656 1049094 1068157 1080335 1057586 1068039 1107386 1097980 1101359 1129239 1147166 1135036 1132617
12286 1132617 1134938 1122136 1137306 1181695 1182253 1187899 1214922 1237174 1229741 1243279 1244245 1259804 1267048
12273 1267048 1254436 1288428 1311507 1301684 1257095 1243476 1247553 1268311 1284805 1257031 1185473 1157591
12261 1157591 1167617 1164487 1174383 1146081 1159844 1168922 1103386 1062099 1086281 1095547 1076190 991384
12249 991384 957625 976735 998763 989955 985647 966952 945920 965396 976666 990749 1021967 1053011
12237 1053011 1052461 1058481 1104802 1158411 1192228 1217477 1246036 1272512 1268304 1286614 1300066 1312187
12225 1312187 1365870 1355168 1399371 1436141 1441222 1478767 1483276 1503792 1539869 1566135 1619675 1635010
12213 1635010 1688278 1720125 1784793 1830280 1871142 1885012 1928607 1955412 1981316 2073689 2156486
12202 2156486 2206410 2248996 2287523 2347302 2407359 2460900 2541949 2627998 2699901 2785579 2863264
12191 2863264 2947955 3029225 3151336 3264200 3402332 3556786 3690671 3837827 3989803 4131323
12181 4131323 4299744 4472698 4676056 4913081 5149167 5415506 5692841 6008176 6369842
12172 6369842 6780248 7189814 7659458 8201358 8792544 9489954 10260558 11143382 12187313
12163 12187313 13400565 14760981 16296367 18034179 19979515 22167756 24669803 27445431
12155 27445431 30511116 33910206 37728735 42083395 46978494 52550802 58997126 66532472
12147 66532472 75246504 85151964 96210223 108429563 121742175 135613477 148944835
12140 148944835 160730346 170762797 179177515 185364603 187484003 184399632 177279143 168283950
12132 168283950 157943759 145260798 129978679 113837461 98946132 86030251 74687047
12125 74687047 64579810 55920749 48949536 43562389 39508610 36372902 33789855 31639813
12117 31639813 29720899 27967437 26273052 24646689 23045361 21497453 20062236 18682552
12109 18682552 17395367 16212541 15100356 14083875 13124537 12290440 11494033 10804851 10165679
12100 10165679 9591800 9083395 8602526 8142396 7721872 7339726 6985373 6706808 6406886
12091 6406886 6126434 5870693 5629998 5420008 5235248 5092305 4965201 4864840 4815579 4677059
12081 4677059 4530483 4418034 4289228 4177874 4040532 3869440 3745056 3643292 3577870 3551031
12071 3551031 3556680 3500887 3407402 3382529 3367909 3387565 3428171 3424044 3386370 3363060 3355343 3311136
12059 3311136 3275974 3223055 3205339 3180401 3082328 3011315 2958558 2899731 2823322 2728864 2657938
12048 2657938 2575184 2496792 2461170 2402604 2347879 2328873 2307480 2261708 2218990 2183249 2141886
12037 2141886 2099484 2063812 2017602 1980684 1950116 1893288 1834523 1799787 1743874 1728605 1720880
12026 1720880 1680698 1614919 1609431 1620733 1621988 1585983 1590219 1594273 1557642 1549465 1514205 1506516
12014 1506516 1472727 1480742 1456378 1465235 1495772 1538427 1554034 1590051 1612126 1661467 1723639 1805459
12002 1805459 1906171 1987575 2119035 2272172 2376258 2469861 2575659 2646166 2713356 2718842
11992 2718842 2653310 2542444 2394141 2227539 2111389 1962710 1850897 1732916 1619054 1562102
11982 1562102 1556821 1525944 1490675 1525361 1559430 1599657 1635771 1693227 1763551 1777608 1754988
11971 1754988 1702937 1659765 1633013 1576408 1497954 1442847 1344314 1199730 1106675 1041284 967176
11960 967176 897156 821670 764580 757101 758284 732687 703157 709384 714497 660834 622673 637989
11948 637989 661225 629048 610919 599476 563778 568098 596264 598833 585356 537410 504124 505115
11936 505115 520572 501209 480133 454015 406273 406476 440733 484409 477119 470600 487947 477305
11924 477305 468948 491826 498598 500948 505313 503563 494991 535592 528618 537531 601199 627824 654032
11911 654032 734301 743777 724769 699254 692478 646423 622197 577564 531094 514851 441729 386529
11899 386529 401533 401679 381772 351836 312281 289024 255505 244222 256616 262485 262044 253006 254468
11886 254468 229497 248740 230146 217548 240888 274219 247485 227520 227313 251095 252295 244429
11874 244429 285126 304421 300950 242571 176351 166314 202967 229585 248595 228437 242882 217685
11862 217685 206704 238966 255604 235887 174314 115562 111196 103409 97869 125970 168645 133244
11850 133244 102130 140324 184781 184115 144836 160282 181231 177650 154762 141443 176693 203270
11838 203270 207092 186133 137263 113938 151487 210669 232462 205951 202839 249919 215367 198830
11826 198830 175505 142672 142383 136534 185422 191974 170046 200261 217354 211708 207483 182734 165549
11813 165549 194051 188044 142212 129839 133818 124904 111002 129082 141753 154838 142845 128273
11801 128273 120474 127503 98161 100991 120903 127451 140510 158878 190603 162145 116420 131531
11789 131531 136604 178068 175397 125040 114194 118107 129481 147767 171929 167869 160673 137438
11777 137438 147662 146117 137271 137393 122897 118476 100437 97047 120252 129274 108358 85230 124306
11764 124306 168530 145111 123408 71099 55745 54146 93244 128374 116656 106434 105718 104238
11752 104238 85482 119831 172129 161261 159010 112789 88011 96115 125930 124969 86147 62314
11740 62314 82440 103711 83517 93312 126082 134643 148496 168452 181286 216224 258240 270533
11728 270533 260903 243031 217920 215208 210931 211170 218687 229062 262058 259887 303077 350268 396804
11715 396804 384079 406378 452071 495651 548414 611790 684275 720141 740116 796432 867806
11704 867806 927362 1021373 1057658 1058363 1032732 1001253 953307 914145 820456 750074 691776 656349
11692 656349 583908 485467 427784 385513 356712 312971 290141 267944 234859 229206 234640 253119
11680 253119 247789 231363 190962 181054 195755 182780 139351 173982 178034 176670 153591 138701
11668 138701 124429 77742 79203 75132 67375 50214 36841 37286 48170 98201 93519 38436 51545
11655 51545 75172 70897 103676 96851 76008 88937 87644 80095 105415 126174 116192 89993 67411
11642 67411 95780 86640 61502 28586 49880 69573 86370 120125 134796 121436 126103 112287
11630 112287 97471 132566 173313 164805 153415 139310 126219 119004 167994 220547 236246 233445
11618 233445 209429 184923 154863 169695 185376 187267 207520 166231 135565 97103 113728 142591
11606 142591 136481 127239 109098 84669 82622 115665 130627 118436 131796 140707 168887 182240
11594 182240 198399 189155 214853 211558 201586 187758 159915 132753 133135 118052 93637 56674
11582 56674 49616 55261 49728 51304 25061 46388 61420 59664 62652 22302 22549 57927 65700
11569 65700 51071 75912 79238 84294 98380 95266 77643 64863 61517 50947 28372 -16887
11557 -16887 -20276 -7349 -5175 66170 95757 75272 93792 89849 57072 43154 58994 61690
11545 61690 30144 14312 19298 23682 67676 62954 30274 -1009 49562 60683 43744 21718
11533 21718 31925 29690 33605 35322 -5437 882 16180 27274 12983 -2773 25246 66177
11521 66177 73403 67421 73390 78548 75293 79018 57839 31842 37012 10638 -8584 -12176 5806
11508 5806 22376 26223 29346 33771 56633 68108 54594 47011 37894 70117 77015 70537 82668
11495 82668 119197 86422 57004 29979 4652 4590 61273 101215 88601 64424 60498 1458
11483 1458 -10822 -4094 3808 18206 20944 48372 46325 31853 13974 17312 60919 62274 83694
11470 83694 48052 13512 -2286 -16263 9490 47654 67239 73971 54993 8725 -11006 -16143
11458 -16143 -1664 9515 11133 15288 55572 72610 52348 38655 20604 15155 47487 52428
11446 52428 40592 15254 21073 42827 63362 64585 33582 -5776 -11828 -34807 -3605 2075
11434 2075 -3154 13002 41851 86362 99215 91831 110941 89660 71094 101712 93026 75069
11422 75069 67075 43365 48207 54822 57424 86632 100723 122162 116830 105699 72647 37741 33293
11409 33293 32748 78854 89384 73418 28337 43564 83189 70752 47697 32732 45764 98904
11397 98904 116769 79517 108827 108789 103669 91932 86850 95533 47452 40162 45391 42670 39210 9129
11383 9129 6140 -4079 4350 15075 9306 3128 -28137 -39372 -5015 11440 44065 67658 27642
11370 27642 8291 31812 41214 41905 24699 9925 37154 57408 21972 -19159 -18269 -26899 -22471
11357 -22471 42765 78859 73754 78620 81162 119145 106693 99774 88905 36430 26693 26267 -1442
11344 -1442 -33173 -38656 -18355 -21718 -17518 -17452 -23733 8679 20268 33227 36253 59330 85195
11331 85195 121012 125993 88710 44672 46836 28245 34241 54998 56789 41144 14396 19143 22928
11318 22928 57327 79320 49142 45521 52410 30104 -13626 -9650 24368 39227 43426 59992
11306 59992 48039 -13167 -31699 1013 -20 -2622 8091 18973 26329 29235 7853 -4229
11294 -4229 -5075 -3861 29955 16078 21303 23402 41752 74141 107507 159414 184838 193169 187882
11281 187882 164911 171758 153152 125086 112592 106108 132992 157171 155248 110713 41218 38758
11269 38758 58176 58099 54363 60782 70029 12941 20200 67460 91000 48976 35365 42833 69700
11256 69700 70372 56244 23861 -4613 9986 3791 6330 7441 6048 1857 51958 57091 52990
11243 52990 55356 19505 -4495 4606 33472 28129 59121 57581 42050 1116 23832 34238
11231 34238 21212 33935 49734 41463 -3402 -27375 -83 40458 55972 39811 52866 44742
11219 44742 56101 67398 34173 -2925 21256 51364 81867 78744 76986 54154 47416 40183
11207 40183 11495 46635 62652 74930 73480 61907 54854 53577 47640 80439 53467 48057 57194
11194 57194 57423 80391 85617 53221 82020 117924 105493 98659 81897 41832 42504 77050 101801
11181 101801 82210 67487 61627 71785 85106 71433 69623 97340 72954 89139 142317 149881
11169 149881 161095 164430 156611 129139 67139 78703 72833 88536 121503 142150 146270 107691
11157 107691 71950 89070 72124 74636 93091 66175 39163 33778 39412 60622 87660 112865
11145 112865 82816 56550 26782 28529 46242 71625 86639 107117 118400 132862 160287 152124
11133 152124 130917 138882 151589 163118 209078 216014 231570 246702 237317 230329 184549 125729
11121 125729 127027 167131 153134 161997 185091 251851 269821 267862 275958 301459 330839 301155
11109 301155 290797 344197 386110 424695 463298 515220 591080 638316 714297 762875 803961
11098 803961 853332 934902 984404 1046235 1071935 1047237 1002879 938762 876853 804927 740137
11087 740137 630500 589565 595032 577065 576811 567312 528283 551362 577483 622424 613431 612303
11075 612303 607011 652689 653633 642893 648361 683547 718038 752086 759922 784712 779821 766008 819609
11062 819609 873696 902753 890527 885302 904958 890834 830370 775165 679318 594028 510431 478103
11050 478103 406492 313828 269581 256999 225615 250602 254712 211096 160619 170752 167117 179949
11038 179949 190738 182432 173682 156129 157930 176260 176795 161432 166705 189378 176038 135404 135617
11025 135617 140507 153661 160094 137143 126766 116918 112434 99541 123721 173620 142528 73311
11013 73311 72264 101631 120548 106462 101452 114666 129171 144285 115677 130435 136953 137999
11001 137999 142662 134630 85621 62443 37920 23573 64030 86474 91950 99902 113540 115207
10989 115207 95480 76391 76012 69305 67304 39925 20842 40829 67974 101950 67795 39069
10977 39069 16468 33938 56311 82638 60916 85717 114233 94368 75970 40467 29831 85789
10965 85789 97588 110679 84392 101228 111887 66003 48295 67133 74859 64355 54204 64638
10953 64638 99966 117976 104004 90573 81912 74561 81567 57705 42798 11750 16055 35648
10941 35648 59794 53478 19439 29532 61065 48243 40320 68457 52846 58358 64179 60639 76840
10928 76840 80958 71509 53225 44970 73023 95116 111862 73184 72584 65268 101272 100632 110746
10915 110746 102013 118653 74716 45607 32152 51674 101313 87612 48769 -3792 -533 29472
10903 29472 58486 34815 37205 57680 97748 73425 39368 5455 25544 42806 62680 71988
10891 71988 77476 46940 1742 -12485 -4125 37733 56211 58828 44304 31558 24515 88096
10879 88096 155708 185794 177638 178369 165022 155656 169275 179605 185317 177921 194212 207518 185461
10866 185461 136300 121228 86578 73715 90349 71758 85264 104251 66701 72997 81663 76184
10854 76184 104471 122083 150051 125616 122056 96569 102164 121065 132242 115116 108324 87968
10842 87968 76200 64153 74340 94078 103362 153462 173680 163236 140084 120803 107525 107062
10830 107062 175413 227995 194400 166870 195047 193824 196868 206954 201044 184862 172207 162679
10818 162679 176724 181754 173135 118892 82528 84632 73745 57238 80747 83312 89256 96285 95423
10805 95423 89789 86503 99966 102779 93179 64291 52565 97115 90081 67792 84229 91824 99970
10792 99970 105031 125843 153848 153675 131735 128066 104164 133432 154742 149601 124425 77424 97578
10779 97578 91492 90650 82837 91395 78080 84982 108067 133402 136234 149659 173483 166644 128531
10766 128531 132853 129270 115527 98954 84877 82878 63612 51773 49349 69128 118953 145245
10754 145245 162429 140145 111688 93066 85631 121018 155454 149219 63780 46276 78346 111518
10742 111518 126175 113840 123709 125652 146120 215821 241663 230219 204467 218836 260241 279673
10730 279673 293387 242201 249279 256781 237948 241472 274857 261530 257459 311418 348108 334112
10718 334112 325721 334544 355798 364121 428581 482050 451582 438864 467250 514136 563883 634998
10706 634998 652244 673637 719952 807829 867704 910517 999196 1098866 1266601 1407470 1519986
10695 1519986 1607552 1724481 1809519 1837427 1847823 1826904 1769804 1673835 1568646 1457188 1364928
10684 1364928 1249342 1130577 1049515 1002754 969072 948315 952102 940305 922029 947620 965501
10673 965501 974517 971922 1037155 1062536 1146511 1273048 1350733 1402270 1519025 1631642 1749333
10662 1749333 1866713 2043357 2295525 2521949 2747171 3013768 3303506 3630158 3942050
10653 3942050 4291557 4612675 4813459 4938535 4972221 4842531 4600176 4274988 3854621 3387075
10643 3387075 2897383 2486770 2129459 1861217 1671095 1519450 1403169 1298028 1261514 1221788
10633 1221788 1172290 1166135 1161577 1164693 1166375 1131496 1083381 1077811 1118498 1083173 1094745 1147974
10621 1147974 1216149 1276288 1322382 1397143 1462562 1480562 1583338 1674878 1691390 1719886 1730818
10610 1730818 1724752 1679954 1596571 1471869 1338950 1207689 1095888 1012982 952052 878858 798365
10599 798365 712858 653747 596655 550760 526344 535277 516019 503587 483232 450692 427743 395582
10587 395582 390710 372113 335376 314298 336874 345064 347273 345186 317039 330288 351779 339381
10575 339381 343989 336903 343389 354581 354230 333900 284011 280701 273762 290891 317496 293698 249414
10562 249414 225710 190510 217284 253845 219966 203123 195678 201143 181131 140417 131067 154512
10550 154512 160510 167797 211737 236146 236250 260027 266051 263388 278002 328889 362155 341181 291342
10537 291342 258167 244847 251591 287412 321918 323167 301935 304459 313647 334893 322504 310982
10525 310982 284443 285273 252748 247948 249198 257188 235289 251236 249789 268661 309876 339190 374321
10512 374321 413947 424560 343027 333083 349117 340900 330508 351460 390288 407164 411510 421958
10500 421958 398371 429007 453595 477029 504878 567427 576948 584056 594924 648130 736436 777508
10488 777508 793609 814100 866240 832192 821246 831280 814343 751608 746453 748635 726758 706794
10476 706794 673805 645008 631311 618802 647153 647883 651603 651742 666796 619698 610713 622827 678041
10463 678041 681526 657060 672466 702600 712617 723962 719388 726272 755074 735773 751482 789213
10451 789213 832249 917279 952258 1001939 1079159 1105541 1114758 1119843 1127475 1167508 1203568 1267275
10439 1267275 1348291 1423992 1511137 1620438 1719811 1840160 1924355 2062248 2224437 2399226
10429 2399226 2623431 2853024 3087970 3369230 3718828 4055777 4413694 4785346 5187205
10420 5187205 5558348 5895971 6167349 6441951 6683304 6839018 6909011 6842244 6665339 6477729
10410 6477729 6173604 5748318 5210756 4712548 4300326 4028188 3862144 3756684 3739754 3723743
10400 3723743 3670539 3708407 3767003 3795735 3808439 3871865 3964548 4020320 4095412 4174444 4303028
10389 4303028 4451108 4629476 4807465 4951490 5102134 5185383 5280990 5235924 5113041 4943885
10379 4943885 4695053 4365804 4056313 3714065 3362486 3068136 2864664 2678457 2534215
10370 2534215 2400705 2359215 2310670 2228237 2192486 2137832 2078973 2039687 2003839 1956311 1887903
10359 1887903 1772104 1652712 1554317 1489405 1414404 1360583 1370758 1393111 1383616 1330646 1215597
10348 1215597 1127733 1099085 1107931 1123721 1121824 1093647 1071881 1112502 1143993 1131508 1134656 1098227
10336 1098227 1085801 1095714 1112050 1123132 1136701 1145234 1127776 1133023 1119023 1149718 1185616 1224557
10324 1224557 1249878 1282680 1299022 1317346 1330962 1334567 1371063 1429475 1481807 1564020 1558316 1588692
10312 1588692 1596794 1600712 1618578 1682374 1740630 1799111 1865710 1949491 2019633 2054720 2092988 2173940
10300 2173940 2218028 2262400 2255201 2308035 2374693 2440130 2546186 2691912 2790650 2861814 2976382
10289 2976382 3097374 3173398 3230855 3353712 3474512 3602682 3733639 3826692 3951083 4136097
10279 4136097 4328600 4477478 4653603 4864710 5072218 5290934 5542279 5790726 6088468
10270 6088468 6392755 6712841 7042751 7432539 7890492 8363531 8874041 9492524 10128191
10261 10128191 10840154 11691617 12662439 13730579 15006112 16407487 17962490 19837438
10253 19837438 22045694 24599230 27487295 30768580 34496259 38615553 43125092 48102088
10245 48102088 53449111 59369255 66087053 73847524 82947060 93714911 106588721 122247137
10237 122247137 141646027 165877424 195795878 231183708 269644993 306896324 338888013
10230 338888013 363117994 377807442 379226544 361649498 322876446 269268749 213138033
10223 213138033 164858715 128499261 102885921 85176516 72738560 63750213 57178129
10216 57178129 52360647 48771164 46137115 44159009 42666734 41411161 40126520 38577158
10208 38577158 36683029 34489734 32082664 29646044 27272075 25091722 23146534 21376686
10200 21376686 19806316 18391647 17140711 15999288 14943232 14040103 13208374 12420415
10192 12420415 11684902 11035310 10403956 9815624 9297985 8841126 8384468 7956490 7549332
10183 7549332 7197655 6877215 6577049 6215766 5938929 5728339 5485462 5263378 5038103
10174 5038103 4817495 4650470 4521343 4381349 4270721 4127767 4010629 3903169 3775876
10165 3775876 3648883 3525433 3426520 3336935 3243268 3158073 3016729 2910688 2829546 2813284
10155 2813284 2725287 2647731 2611933 2522049 2467920 2438118 2386239 2319811 2279334 2236482 2234439
10144 2234439 2185418 2122267 2115094 2074141 2020067 2002758 1971579 1940450 1928301 1926799 1892439 1856316
10132 1856316 1799646 1766831 1727234 1705920 1658844 1612702 1578887 1526221 1539938 1572159 1577959
10121 1577959 1584749 1568059 1549718 1541203 1564554 1542777 1486985 1482816 1481708 1464553 1454138 1376030
10109 1376030 1309822 1270887 1236178 1219552 1236605 1215478 1149855 1095752 1066310 1043532 996912
10098 996912 908346 834855 765592 735830 734237 720751 735503 729514 728247 741095 709637 719285
10086 719285 782682 838443 882189 855276 871120 878399 892724 942320 995180 1011194 980882 983036
10074 983036 949564 897549 869544 881707 829333 797005 818278 814835 805903 815982 806675 770018
10062 770018 720225 698846 733127 730982 702004 720604 698598 659742 648746 675103 710624 697490
10050 697490 672070 644406 623717 640133 645212 657550 636886 638765 640922 623412 613415 571738
10038 571738 529365 543719 530787 516142 487735 479909 502071 497020 446456 400935 384947 397007
10026 397007 403701 420914 438969 433931 427993 403197 388046 414241 419458 428489 446227 470696
10014 470696 508239 559591 568666 533816 523663 539429 488010 470822 480272 468524 467146 484511
10002 484511 458792 447166 436626 411017 426381 447088 448916 454515 487141 501750 487396 464306
9990 464306 495714 535576 536139 562094 552029 520228 513806 525946 551744 610401 615259 649401
9978 649401 690228 703687 725136 739098 798680 844839 851047 906681 928074 922023 939256 911919
9966 911919 853854 787372 679116 624984 615372 596522 535563 483519 495042 534318 517669 523940
9954 523940 518547 523447 518716 499356 492181 485075 437327 446654 471041 495775 484280 419624 405941
9941 405941 395715 407658 414744 427503 422642 422657 410348 419723 432930 422694 414514 402256 408817
9928 408817 435426 427848 431927 496353 593484 581934 541482 525465 487125 463379 436343 453607
9916 453607 480246 509331 524960 491889 449973 432539 455332 447050 418255 426664 405256 415842
9904 415842 415032 376206 355738 359352 382661 382434 378061 350953 343757 358361 360406 407264 408850
9891 408850 392106 349786 369518 393614 388942 420025 441268 456847 455113 393424 378869 413808
9879 413808 418604 410020 365388 368036 359206 338874 335636 363194 394647 371620 366183 363026 353529
9866 353529 374880 403170 398589 370504 362718 417480 438550 462315 436287 388988 368109 376657
9854 376657 410131 433093 470563 449117 415335 385456 415848 449149 407790 414619 384655 383258
9842 383258 420098 368937 322735 336868 352734 337981 352771 363197 384492 432769 431628 394719
9830 394719 419610 436296 470468 502773 524336 540827 560861 582839 598793 619953 642056 672342
9818 672342 706296 739439 777483 815889 876388 932108 1026081 1145966 1274892 1455460 1650895
9807 1650895 1818512 1991310 2171889 2269351 2291904 2221869 2069168 1830476 1556065 1310756
9797 1310756 1145457 991921 864888 784278 716422 665100 627895 598815 555478 593678 571814
9786 571814 558144 531554 530838 528881 510507 485889 461857 462122 457806 427914 391492 401478 411781
9773 411781 395834 394066 417393 433339 406814 379384 381430 413080 410483 415854 424868 417699 392114
9760 392114 361599 330630 310312 323741 334421 339258 344759 329196 312117 315361 309633 289443
9748 289443 316773 337775 370186 386855 342388 311310 290716 265939 313648 347169 384488 385879
9736 385879 409442 427094 397082 360879 333658 327245 341143 340551 339243 343903 393932 406577 381995
9723 381995 354990 348571 380924 388708 360969 338590 322817 337643 314284 316585 384378 431009
9711 431009 407686 420396 378235 317664 354994 389059 386378 381130 383780 352330 348381 346898 372676
9698 372676 383145 384382 375714 335467 304940 344069 360615 352520 378150 395599 366828 359914
9686 359914 371966 354386 327853 286895 309951 363587 376454 364203 384495 413232 419824 450748
9674 450748 472627 417650 380981 411440 432523 405766 398110 391764 406662 394661 376834 370668
9662 370668 384581 390342 411747 444477 419784 432000 473153 505450 541578 561147 571095 586069
9650 586069 589893 604939 646055 659410 627882 594105 572275 538252 507344 480932 459103 467269
9638 467269 466019 479365 431953 402722 420866 407892 400846 418705 430457 398471 401868 388892
9626 388892 374714 384532 374575 364690 391959 421861 394810 352493 378120 394375 370233 327703
9614 327703 304961 305676 335453 352582 341426 358825 364987 354397 350371 372010 407568 398417 373872
9601 373872 368125 361063 348029 351295 343175 331781 356368 349502 356927 380384 404087 387229 401290
9588 401290 420460 445716 460860 431054 434781 406031 385793 383088 374559 345292 382096 403942
9576 403942 438194 422977 402183 391119 414854 438421 434534 420651 386918 389388 416804 459122
9564 459122 449703 414515 371375 365959 327025 353656 377540 366749 364732 378820 393779 379405
9552 379405 366965 337471 314541 328610 373947 437728 441337 446711 460618 468608 445689 430705
9540 430705 440893 473209 479229 502375 483111 431817 431099 417490 430335 415429 403680 404500 363045
9527 363045 370779 402131 411948 423325 456991 508194 519953 486241 458488 461103 459848 455812 438662
9514 438662 469789 485469 514765 518322 490436 474316 461514 492504 463257 441542 425088 422214
9502 422214 449925 460092 441173 474204 513427 502463 481749 452794 434764 442717 442158 438173
9490 438173 472772 493452 467891 443210 440937 460014 461762 462895 479391 497332 503160 495637 501030
9477 501030 497698 472055 484519 488109 501935 520353 464729 464990 470817 471364 474545 474750 491785 492385
9463 492385 480287 446653 417348 422672 436656 425499 442851 488224 548691 558285 519403 470587
9451 470587 445562 474546 533906 569991 518028 498325 508841 546022 548356 526369 513363 532306
9439 532306 514198 480264 457862 470450 501738 535083 553896 546957 568906 562812 500332 494302
9427 494302 520414 540569 557012 564447 552377 545883 561864 551730 576894 613340 632508 621696
9415 621696 599254 608377 576280 561242 592962 565814 555946 556928 591922 600969 588599 588782 575459
9402 575459 579024 592313 616376 618601 585713 596109 621883 647668 622048 615208 647762 671086
9390 671086 665916 669737 665978 644346 608132 573691 571742 594811 605704 608287 606551 614741 597077
9377 597077 606050 634761 636558 623761 619028 607548 616666 652070 680895 664980 633166 646570
9365 646570 647641 615330 614004 616724 617057 599612 571611 579393 581109 590739 585992 614835 646972
9352 646972 665207 602683 594748 628407 598356 617631 644468 641152 596510 583583 616889 612223
9340 612223 597521 597932 617526 603845 582565 577020 601426 613163 579348 565580 592829 627747
9328 627747 609549 595026 592376 625174 636330 601310 573978 551367 574376 610187 664215 670040
9316 670040 657245 677712 681155 694769 708801 713935 677853 655803 653648 641040 623080 656319
9304 656319 707786 676769 663670 691826 664730 601968 610664 638818 594933 605037 606377 626148
9292 626148 647814 653621 656227 653088 628120 640904 621510 633234 631685 600529 579485 581568 600036
9279 600036 621406 626237 615866 641214 677108 670215 649419 642752 652636 653044 627801 615189 622698
9266 622698 619670 648029 652495 621638 612568 622254 591123 577985 586191 624114 665058 682815 670007
9253 670007 651028 652753 624416 614006 635207 650016 658428 667327 669021 691567 699078 682885 656265
9240 656265 629190 621518 595644 600830 651606 702657 693783 689370 663516 675345 703610 697754 679262
9227 679262 686612 682532 642843 668148 673109 679732 700563 685793 712749 716313 674024 667451 655953
9214 655953 665820 698813 728731 693792 679308 688469 678687 669413 719984 751705 754332 705054 687909
9201 687909 673577 672949 689682 749417 781523 783265 737118 698688 727335 762893 729854 727501
9189 727501 694177 669052 694764 708133 683471 727194 754505 772344 750437 696543 735067 744935
9177 744935 745456 795590 790487 794435 764196 736634 745723 759948 752373 737224 740269 738534 750243
9164 750243 775520 793075 781012 839159 839728 854820 836087 808723 811471 814370 816835 795314 778602
9151 778602 767277 777458 743266 725661 742915 775044 792462 828153 839350 831831 794931 748491
9139 748491 742849 763381 799411 830993 850062 823854 792880 773712 742497 732243 745485 747163
9127 747163 781281 836031 875427 928563 942177 937799 901998 890432 874304 873868 890470 888339
9115 888339 867242 895188 941760 948888 959522 959329 947419 940281 917011 886942 888078 899936 933469
9102 933469 921986 921026 972341 991602 926392 882184 913553 969076 967364 964345 975161 1001096
9090 1001096 1005340 958250 941172 966903 991203 980839 995519 975839 965133 967713 987971 1021672
9078 1021672 1011773 974979 973015 989379 1003715 988216 947544 966654 976205 958789 964147 1003098
9066 1003098 991584 988303 1015235 1032075 1008398 1000839 1005508 1028084 1049528 1025606 979852 1000061
9054 1000061 1060394 1070445 1039935 1040881 1017835 1010928 1029941 1040487 1069418 1060814 1049105 1035167
9042 1035167 1055190 1099475 1108543 1097110 1093275 1084672 1075829 1071606 1073063 1081684 1116040 1105162 1084276
9029 1084276 1101053 1119024 1111298 1131914 1185350 1176159 1145013 1161364 1140678 1136845 1107137 1104109
9017 1104109 1130221 1142065 1182204 1197657 1213104 1178634 1190591 1211676 1241492 1235191 1274608 1282183
9005 1282183 1271287 1251246 1244589 1276442 1289647 1257110 1232522 1247019 1257397 1287769 1337566 1313047
8993 1313047 1324281 1357978 1371981 1359648 1298240 1290592 1329181 1334195 1346189 1350086 1361825 1368144
8981 1368144 1383412 1393059 1392520 1371060 1374555 1382996 1411341 1420561 1420536 1442535 1489501 1460007 1474097
8968 1474097 1497803 1464445 1436468 1435893 1448696 1453200 1458982 1476607 1485747 1477341 1499090 1530406 1531991
8955 1531991 1548798 1566354 1555061 1569308 1587602 1614328 1621035 1600081 1620167 1648101 1702670 1705942
8943 1705942 1691535 1722720 1678128 1662765 1643119 1643929 1650267 1656382 1672436 1662991 1696049 1747839
8931 1747839 1762280 1755567 1746227 1753133 1744420 1732888 1747485 1826327 1875248 1869069 1877317 1896445 1889576
8918 1889576 1874372 1826221 1811099 1835977 1902307 1953702 1981741 1999498 1994010 2015140 2028409 2020762
8906 2020762 1997712 2004114 2004551 2028335 2058350 2023360 2033644 2054218 2047958 2092454 2128995 2139575
8894 2139575 2124345 2130076 2150949 2161924 2170972 2211833 2263502 2308455 2287563 2267306 2277155 2306582
8882 2306582 2336087 2360723 2381565 2389942 2417733 2456964 2457520 2432794 2418655 2446782 2490327 2496576
8870 2496576 2525003 2526613 2540294 2560551 2580020 2569595 2560774 2580230 2577214 2551068 2573976 2620408
8858 2620408 2670987 2711178 2737535 2738858 2771889 2810821 2794447 2834981 2893204 2888690 2847879 2863938
8846 2863938 2878330 2943728 2956789 2958073 2941167 2950263 2977635 3023867 3024074 3041783 3083504 3094497
8834 3094497 3127515 3131489 3180791 3206587 3214226 3262318 3296406 3292310 3291816 3303239 3349861 3435756
8822 3435756 3432810 3446723 3468003 3490499 3507488 3514270 3560949 3603637 3637791 3659510 3716962 3728834
8810 3728834 3700093 3702659 3722308 3786978 3832375 3884863 3950454 3951525 3947989 3942983 3960720 3968837
8798 3968837 3997107 4059652 4157298 4192616 4247792 4308637 4326320 4311748 4299161 4294200 4319722 4377977
8786 4377977 4411683 4427414 4413452 4454162 4470374 4527006 4590061 4613301 4635750 4675999 4714293
8775 4714293 4752163 4829908 4872811 4940972 4972710 5000011 5028032 5060058 5071332 5095574 5174915
8764 5174915 5235058 5234571 5243616 5271344 5329724 5393342 5441770 5504861 5546309 5589115 5636250 5674641
8752 5674641 5714540 5782173 5837259 5862795 5885573 5894315 5922352 5985145 6036342 6084368 6157807 6208029
8740 6208029 6267579 6316404 6338826 6403640 6469843 6506244 6545749 6578183 6617840 6654178 6700127
8729 6700127 6798815 6828415 6881749 6888155 6937414 6988246 7049271 7067844 7108903 7179448 7245976 7341295
8717 7341295 7374227 7381489 7439125 7519332 7583623 7646305 7659503 7687085 7710928 7747301 7783848 7812559
8705 7812559 7869084 7915282 7989170 8016328 8067409 8138212 8156301 8174472 8237979 8338438 8401935
8694 8401935 8404027 8450653 8493253 8489489 8539481 8608897 8674312 8732739 8773914 8814808 8851955 8862126
8682 8862126 8921145 8962541 9028399 9039846 9072863 9111682 9145156 9180337 9191623 9222190 9259498
8671 9259498 9299823 9301968 9311583 9316068 9403188 9418963 9428017 9452164 9471862 9513383 9547080 9610382
8659 9610382 9613760 9604177 9631218 9645255 9629121 9665849 9691978 9703280 9716951 9732835 9768536 9809749
8647 9809749 9795693 9775276 9745076 9738102 9790519 9798437 9783815 9802554 9822743 9818948 9805530 9799900
8635 9799900 9755939 9707485 9670800 9678127 9683867 9683124 9699309 9703954 9681073 9649712 9601650 9565488
8623 9565488 9540520 9554369 9546859 9537927 9523840 9489799 9440920 9402616 9358663 9328549 9289750 9301052
8611 9301052 9288318 9275217 9283503 9275414 9240631 9188720 9165991 9165771 9152889 9129516 9083670 9047155
8599 9047155 9007871 9003723 8962126 8907761 8899143 8909370 8928879 8906180 8877023 8889488 8861952 8867820
8587 8867820 8852777 8828703 8762381 8608523 8479676 8418937 8352772 8264425 8158686 8067782 7977151
8576 7977151 7900401 7845586 7760035 7668879 7625503 7605041 7543972 7472843 7397284 7324940 7271136
8565 7271136 7232054 7162834 7141824 7083152 7035801 6986569 6940099 6891014 6846373 6810170 6743092
8554 6743092 6685610 6643956 6556979 6460392 6435332 6399659 6374645 6335048 6304418 6263678 6185073
8543 6185073 6142809 6121061 6084563 6076107 6045072 5985952 5960227 5961246 5894192 5833870 5771384 5720041
8531 5720041 5676855 5643058 5651753 5636093 5613172 5650235 5694767 5687928 5666997 5626222 5623417 5597863
8519 5597863 5519007 5398794 5205520 5060717 4981580 4961395 4902794 4824961 4782138 4755840 4731583
8508 4731583 4695372 4681064 4657736 4602504 4537522 4529200 4560464 4529012 4492628 4453349 4427101 4408817
8496 4408817 4370445 4346093 4315720 4293750 4268534 4268718 4258216 4248753 4287453 4340510 4345016 4323426
8484 4323426 4316197 4323229 4306104 4242134 4146004 4029315 3900560 3779037 3695707 3675444 3681301
8473 3681301 3659875 3634858 3592437 3564027 3552788 3485381 3426360 3382997 3350208 3312112 3333002
8462 3333002 3326373 3309985 3312078 3271946 3246632 3242708 3230168 3226992 3208595 3145719 3100153 3087365
8450 3087365 3071307 3076229 3058086 3059384 3048725 3026621 2966957 2919641 2863496 2820221 2812930 2786733
8438 2786733 2779284 2755623 2744976 2754919 2731392 2682542 2669024 2693896 2644814 2590689 2542234 2505114
8426 2505114 2518716 2515685 2515059 2521011 2545531 2560209 2526223 2484868 2483576 2477342 2462803 2473388 2463493
8413 2463493 2418819 2391699 2382362 2387470 2392046 2346767 2326076 2317007 2320956 2312329 2276909 2256102 2240136
8400 2240136 2188918 2139152 2106658 2078033 2107187 2087286 2062622 2066213 2066267 2057796 2045239 2037492 2028763
8387 2028763 2031075 1996891 1976112 1937046 1927149 1956256 1982174 1988430 1947073 1939334 1928867 1914499
8375 1914499 1902767 1896296 1907725 1894369 1879589 1821675 1793280 1801559 1805011 1791173 1799838 1774724
8363 1774724 1775249 1773310 1798248 1803020 1754480 1711576 1712119 1656792 1647834 1666350 1659753 1608182 1573828
8350 1573828 1607332 1597834 1591088 1604981 1641704 1654038 1605476 1593323 1614749 1590973 1576182 1559484
8338 1559484 1552464 1565383 1575923 1588941 1629293 1630973 1608657 1571352 1539201 1529138 1518224 1533352
8326 1533352 1516836 1460384 1428259 1410412 1423699 1436615 1415252 1394480 1370719 1371694 1393775 1361030
8314 1361030 1353744 1334301 1323316 1324956 1323628 1333914 1374426 1370725 1348564 1323122 1338429 1363718
8302 1363718 1369835 1401951 1417712 1375982 1356524 1309389 1281769 1242760 1239544 1219874 1193149 1209341
8290 1209341 1232080 1220666 1214619 1174333 1145562 1116811 1093566 1117329 1143387 1180346 1205548 1184987
8278 1184987 1194631 1220291 1214669 1198410 1171582 1130629 1091630 1067606 1091326 1070669 1094061 1117010
8266 1117010 1115472 1124703 1115106 1059382 1080609 1099481 1088391 1060083 1050512 1021415 1041219 1061521
8254 1061521 1074017 1077817 1058032 1030885 1026589 1004345 1004819 1003289 1035209 1006713 990764 1004422
8242 1004422 992965 964204 967240 981927 1008034 990640 986018 961456 939017 931146 952978 943743
8230 943743 953705 919375 926743 907789 882691 892213 912872 935383 979081 998983 998313 1005767 995972
8217 995972 986573 987885 976256 991821 980920 965879 915986 915436 909402 901551 929661 907744 883316
8204 883316 873310 897205 897362 920814 904285 899505 906830 905311 897470 876756 882292 881942 840629
8191 840629 816502 829301 872314 865188 863187 880852 886019 889504 848302 832465 815750 808074 815137
8178 815137 822085 815619 837546 908373 912185 894345 861163 821322 817131 828439 791755 784843 798022
8165 798022 824121 813382 806391 829081 808584 815914 830975 795664 790799 797454 758530 743161
8153 743161 753460 732674 762322 776972 806368 805808 778766 733569 696271 672943 695758 706213
8141 706213 735360 723517 695104 718257 729287 710889 701498 694811 691210 673665 636393 608311
8129 608311 641144 681901 657203 639989 626360 661257 676296 664214 640002 696979 690901 658681
8117 658681 661654 646203 621717 630793 677680 689229 650117 609842 591591 629076 609382 590852
8105 590852 588316 583459 618055 634212 622848 588780 564965 574431 607395 619664 644733 605570
8093 605570 568940 590456 630606 641342 630257 631518 598266 587393 566996 586165 595575 599191
8081 599191 590396 581823 620207 643881 644927 635257 598791 556110 567908 559349 525887 508361 550301
8068 550301 563170 525446 511944 506464 512014 546395 552173 549225 546154 577315 606527 592371 562860
8055 562860 545442 561132 581706 565184 544446 513453 480588 494646 498180 467766 436780 470589
8043 470589 479637 492409 498452 539437 542149 550211 525874 521567 533485 547239 543601 543240 512544
8030 512544 495582 489680 516372 499549 525855 532901 539678 520441 452100 460625 488151 517765
8018 517765 524998 536935 560461 604283 628634 596365 546476 491197 502727 543350 539747 527247
8006 527247 495177 488395 494808 492151 483867 469509 486519 556939 560623 551000 547668 545899 570295
7993 570295 579778 547147 546965 539004 560428 587350 606894 599829 569043 532374 502032 486970 517507
7980 517507 531433 500616 452341 435694 458563 475610 508476 528444 492841 472288 484686 512869
7968 512869 528497 547701 546625 511730 497823 479530 480645 494614 492234 466562 465714 467827 496142
7955 496142 489116 480226 487563 520030 501505 462059 503355 541013 536960 546810 526312 494748 476715
7942 476715 464066 466059 481726 483434 498367 500552 468642 461297 442227 411998 385342 392225 416918
7929 416918 408748 426575 447647 432423 429578 438321 459570 472633 453583 424248 404233 399885
7917 399885 352311 373462 400660 433067 440275 449089 410905 360611 345485 376843 387461 386017
7905 386017 401192 374469 403394 418723 388689 368301 388431 389093 362684 356113 353160 339147
7893 339147 357979 395904 354379 296376 321479 350968 359580 347556 345918 333799 308719 343958
7881 343958 366370 379470 362009 296398 259364 283701 347119 337857 320299 309019 309436 299812
7869 299812 292715 267763 255601 291022 322741 303074 269557 275605 285526 249387 269962 271634
7857 271634 253626 238297 230420 279570 282592 305003 300648 296511 299950 306816 324121 354561 358213
7844 358213 337429 304269 303353 269296 239179 257481 264060 259987 269762 304852 319156 326128 290036
7831 290036 235759 225824 265007 259834 245190 273164 292526 286980 258236 235608 265395 276137
7819 276137 296846 270945 208240 193144 205775 214158 210258 217326 237687 234116 197659 216874
7807 216874 218433 223928 214357 191342 191261 207295 237650 231394 241875 240483 230428 233709 209047
7794 209047 204966 205728 203116 229134 211058 200970 217933 246722 247160 251787 245151 282202 293359
7781 293359 291069 267778 263072 274994 260676 213104 196184 182794 137635 138135 166089 173819 209095
7768 209095 241096 237954 202479 171900 188066 176346 196399 234606 187962 157139 147031 176605
7756 176605 209977 202993 198174 232521 197461 181755 221892 243634 242084 199467 142875 110312
7744 110312 114564 107903 120418 163093 165543 195321 226247 237576 197537 133718 139466 187679
7732 187679 228867 215313 211603 150369 126877 188524 199180 181024 168785 140689 138357 177241
7720 177241 196024 188097 207647 163182 127564 120948 127540 121740 117096 127339 144450 157840 147726
7707 147726 96931 89420 120048 136366 160211 135155 142508 156386 138689 125287 137374 148718
7695 148718 174872 206885 210131 184953 203323 244933 226882 202297 179057 102605 96837 122414
7683 122414 150320 174564 166943 162322 180432 161078 160073 210298 204834 170237 167693 171736 179887
7670 179887 158280 155751 171770 162832 182186 183835 146557 153844 169275 148079 138918 137057 137713
7657 137713 168809 174590 184984 167808 157828 169243 181533 184840 162824 144185 123205 94517
7645 94517 103750 123700 120189 107570 133324 152985 155055 140487 149417 145277 134932 123228 111938
7632 111938 105452 144241 131082 127586 133600 157374 161879 138246 116547 112845 104553 95265 75753
7619 75753 76384 91777 91191 67219 90222 117462 156064 196734 189804 207169 144457 82303 67248
7606 67248 93782 95510 102407 57458 5503 -24332 -10898 22710 83838 124344 144237 162020
7594 162020 111641 100776 114139 103148 122447 116673 126120 143405 126750 86302 100252 137275
7582 137275 142714 129158 134410 151400 150194 130651 129731 124446 119866 132763 165914 161125 129669
7569 129669 140404 175486 177732 136880 111994 128572 151303 139502 105501 68430 100058 157676
7557 157676 162079 175600 147188 130929 125886 104946 65179 48656 86465 112367 112255 82838
7545 82838 88539 103525 104623 142419 117301 75446 49963 63992 93893 79697 84266 83606 70485
7532 70485 62475 81912 69942 61566 54148 62452 55422 77658 90020 79914 84298 76284 29256
7519 29256 66235 88451 80350 70864 86159 72737 57942 98601 113619 103470 67838 72195
7507 72195 100991 110073 112403 150390 127550 122903 96378 69423 81463 83564 81433 119499 118878
7494 118878 104967 103474 122079 105948 89378 92496 108580 106154 100043 94200 43639 95475 92135
7481 92135 80895 112614 112440 51600 -26548 25285 42244 32479 34826 55880 61966 72191 107307
7468 107307 159816 150674 124447 93468 76555 101300 110475 135851 155676 130014 126728 128445
7456 128445 146164 153904 137147 107723 107350 110177 136930 140125 107577 61531 18309 30351 69455
7443 69455 79929 74407 90829 118331 97111 40601 33112 46293 81792 106338 71374 64013
7431 64013 35374 18581 19462 41082 67342 73413 41734 65144 71356 79569 104770 94232 34872
7418 34872 17978 73215 79023 56864 43137 23729 49687 123104 128725 142515 130005 69854
7406 69854 58169 73114 69604 32779 53337 54210 33227 68783 102622 113085 123978 105999
7394 105999 84924 81630 72830 91111 77099 61321 47710 64607 90481 119789 149040 132021
7382 132021 138998 101303 63094 41903 31143 48653 64962 56593 45013 70514 106034 112919
7370 112919 102534 85959 72491 103263 122943 113422 93271 106565 94345 76867 88043 94465
7358 94465 74081 61937 69702 111328 94392 48675 45098 71058 46666 54637 45714 28973 52829
7345 52829 73092 50287 17185 19837 58077 95477 88727 99833 58970 42634 56368 97222
7333 97222 71036 7057 11897 55733 58913 5257 -22946 -6947 40196 60603 35048 48331
7321 48331 65365 78040 83805 61504 61184 87390 129519 129493 140789 168423 182246 182844 118368
7308 118368 88211 90574 112936 89563 59380 46482 6164 1298 11091 34827 51882 81083
7296 81083 74020 98763 77883 64448 35195 25765 22041 16144 -16185 23508 60309 54730 17911
7283 17911 27053 50699 42344 11893 5662 21913 65870 64630 80295 68588 27273 18863 34235
7270 34235 60499 84340 93981 101300 88333 57178 27396 24174 59399 60253 31869 23267 22846
7257 22846 14087 -4725 31263 33082 33434 16223 11136 26331 82619 99115 45524 18635 71280
7244 71280 93559 75816 47190 66458 62477 66636 24662 -12899 2785 35544 52534 79457
7232 79457 69183 51749 87200 122496 144751 86952 12049 5258 -11145 7846 36946 38656
7220 38656 -3724 -29501 13576 23002 42596 66592 67642 49543 55173 44627 -25927 -61257
7208 -61257 -9249 12532 -6228 18226 28918 29879 21601 44073 48287 82818 77814 31258 21304
7195 21304 26414 53830 91581 101425 107967 98786 91900 79755 58451 38622 39228 58775 88901
7182 88901 128141 119374 81157 61405 84595 90803 77625 69309 75354 77104 78726 110519 96728
7169 96728 68891 55580 72001 68780 38287 34254 34891 47792 78082 82014 66539 72139 81278
7156 81278 64704 46432 19893 64102 92955 97826 83888 99399 88681 80960 64855 44927
7144 44927 37046 12433 -15589 17431 53777 34681 77290 117023 104651 90356 86848 76858
7132 76858 58920 48277 54463 66584 38032 23478 38388 52743 34252 14745 17223 12766
7120 12766 3642 45850 115777 118192 125976 102658 76306 43773 5947 -12416 -8072 22873 52025
7107 52025 56737 48927 38189 62578 40339 21877 50583 87981 84992 82797 52333 39327 37367
7094 37367 5177 25584 53430 30640 20543 -4853 -31100 -36472 20577 28840 41975 64622
7082 64622 25627 -3024 27161 55703 37319 63217 120789 147937 114220 107688 112444 85122
7070 85122 62504 63339 19406 -7850 13368 34262 55542 74756 81332 87941 87235 80522 80932 84273
7056 84273 56406 28976 35998 35834 -2815 -3415 46135 57006 28513 32203 21485 33234 49817
7043 49817 31901 26166 41581 81880 92973 107747 77669 19406 21445 47193 61805 66215
7031 66215 50304 10667 28964 16026 -17257 -48191 -42556 20056 49401 48891 7807 -9018
7019 -9018 22301 41834 42807 48983 54830 70392 87438 45648 45721 27139 23555 36243 36640 20134
7005 20134 23342 25154 6709 18356 56382 65701 53441 53013 35082 15283 52915 83615 109615
6992 109615 98742 76173 102613 71606 75250 83772 62570 42546 30173 63699 35042 29276
6980 29276 -637 -15391 26474 11550 47994 86384 92082 99976 80510 39653 59196 61024
6968 61024 57039 58007 31606 3743 2733 5092 8215 -5465 -3783 -9988 -44908 -45148 16881 51089
6954 51089 81456 68413 67838 45283 49078 43000 27478 46157 26884 5681 -29628 -23028 27954
6941 27954 -28459 -51901 -45591 -46741 -496 31817 33808 42903 24032 -1982 9393 11001 -9302
6928 -9302 -18584 -45041 -38383 -18656 -51662 -58861 -38153 -40794 -12853 922 -18084 -18894 -19138 -22002
6914 -22002 -10574 35313 80458 87246 69030 36941 64967 101052 88989 26411 5077 -5425
6902 -5425 2178 -4590 6434 -877 -34224 26510 87433 81561 69346 67306 14725 -24256 -22165
6889 -22165 -22916 4294 5490 10847 27624 51893 -2385 3426 -7157 -21003 -3442 36899 19329
6876 19329 8667 27380 63757 31785 28800 36888 9089 43995 76209 69763 37499 14081
6864 14081 17117 25112 53753 78044 74370 91031 117232 104871 77704 45983 23616 -2297
6852 -2297 39941 42892 64856 69090 28029 3756 373 12218 14208 -18675 -15277 -14160 -43098
6839 -43098 -32292 31267 24260 2580 24268 76345 70464 78658 94987 69345 75725 102297 97940
6826 97940 63256 12296 2640 31356 32546 20249 16693 56199 59756 60778 68948 83128 36156
6813 36156 20831 8668 52730 77373 63932 62663 79557 50555 27357 62916 78885 43808
6801 43808 20263 335 8687 30332 15725 -19230 -17600 -49888 -64722 -26493 -17521 -40331
6789 -40331 -23418 15911 58636 40357 15628 15018 17138 -14771 -17700 -12565 -7729 22647 30760
6776 30760 19845 9516 21351 23621 11157 -10805 34011 45740 39854 36271 -29073 -46365
6764 -46365 1386 32318 25659 45307 53193 24622 28243 28437 39669 47769 64743 79568 25043
6751 25043 -1197 14458 34957 54176 41532 64067 62697 25607 6172 13321 41842 57036
6739 57036 66811 43750 34978 40914 55135 81880 104310 131155 111251 86525 88645 79833 96238
6726 96238 104092 127242 160842 166368 145284 163533 220225 235745 228380 213439 207422 242837 270381
6713 270381 273747 211916 186555 154364 126524 135642 152773 98417 87959 45685 14408 54751
6701 54751 63390 43924 27592 11884 5025 3067 44965 57375 50476 29540 13933 32450 29702
6688 29702 38831 66489 36938 52428 59821 42589 83862 92806 87829 102808 101435 93444 77158
6675 77158 52080 -3570 -44370 -59679 -10959 -6484 -12906 -7835 -47347 -39117 -25325 7146 15561
6662 15561 26134 48644 74403 66598 35137 30065 -20345 -30403 -27858 2274 -4567 -6137 12855
6649 12855 24820 1421 -20546 5346 3442 11657 48382 44259 5178 -950 8139 8885 27352
6636 27352 894 -14916 19796 77850 78254 39969 16589 4880 6801 -9774 7504 4862 -13843
6623 -13843 -40044 -30068 -27723 -107 37050 30501 5345 2439 -608 -468 -14533 27708 -1897
6610 -1897 -40450 -16861 39348 25634 49093 71914 48129 38608 39708 35693 26211 52336 71635
6597 71635 64309 25930 -36014 2850 53300 45586 55049 59844 77388 41758 34816 55677 57699
6584 57699 72826 62263 83968 69816 36626 18013 18523 24321 28256 55798 69893 27743 27927
6571 27927 5358 5241 27148 22369 20940 820 42907 105086 83070 44962 23755 61618 51949
6558 51949 6274 3988 7733 16397 3308 14458 9514 -5965 -13324 5390 27946 -6910 12781
6545 12781 23174 42770 33385 18381 26849 9277 5954 -5177 24518 35258 21902 -2530
6533 -2530 -2992 3338 35032 72249 73885 58668 18540 8254 18320 15124 28071 10817 13993
6520 13993 6800 4847 34110 35984 3770 -3808 19770 43143 54780 47768 30411 9801 8710
6507 8710 14616 -2647 -14851 -8296 15899 20781 8507 30937 59603 45304 6757 15151 13868
6494 13868 -19777 -13882 14384 29670 28419 5650 -5698 -15267 5296 28355 26098 28295 23932
6481 23932 31319 50349 52167 -7484 -20971 2393 -1263 41975 67680 73713 50539 19207 12070
6468 12070 -2689 -267 -10648 -31680 -26054 -5183 -22200 3625 12534 9535 1126 15436 7725
6455 7725 -3824 -19413 -8344 23354 25653 12102 11642 7874 -15313 8121 36031 39876 30377
6442 30377 7623 1788 26442 30901 11499 -19169 -13531 -16030 17569 22769 177 2335 51324
6429 51324 76259 62043 45771 50957 36662 16024 -7243 20352 25838 16592 17299 -49445 -65138
6416 -65138 -72067 -68409 -449 18845 11060 3094 30804 62619 48849 43589 -717 -44278 -34061
6403 -34061 -17163 13793 -24954 28632 23060 -15528 -23282 -7487 16389 -12176 -11901 -36333 -19842
6390 -19842 26481 28421 20749 16395 9780 4988 10389 13715 6047 -9205 -5850 -3879 -14273 -74785
6376 -74785 -93825 -71543 -24825 -6644 -12220 -28691 -38687 -7848 -32989 -69666 -48821 -33916
6364 -33916 -29019 -44294 -29707 -54626 -60814 -13808 26259 14196 32355 22448 0 27983
6352 27983 34260 23788 3413 9444 15652 41252 54653 54352 66941 55044 13143 18525 44371
6339 44371 42946 55603 73977 84203 98813 96183 114970 88478 9443 3562 10883 -14116 6831
6326 6831 12178 45097 62457 39094 -5785 -22879 -21525 2674 9762 21391 49248 17584 30825
6313 30825 5284 -25131 -29519 -21733 1217 -15345 -28522 -13780 -4448 13503 34562 14838
6301 14838 8383 4705 48572 86333 64987 35150 -1709 -20818 -20700 14519 30829 37834 35829
6288 35829 23073 7598 16929 35356 41627 46606 31901 1282 -32211 -52341 -28285 26475
6276 26475 9295 29779 21905 -7272 -32095 -31185 1030 6623 -17328 -36266 -2531 17837 38866
6263 38866 41667 36374 38881 50216 55880 34760 19753 22617 19199 35986 22006 -8444 -39326
6250 -39326 -17753 -27822 -29958 8156 2316 -11530 10460 57242 41324 54380 52231 13361
6238 13361 -7266 8554 -1444 14570 8816 14285 10689 28716 57947 31618 -8506 -18172 19531
6225 19531 11656 -33614 -85340 -88864 -36662 -30618 -43149 -5201 -7672 -35638 -36912 -7487 30773
6212 30773 39574 20042 8195 -35045 -6062 -15922 -50799 -54458 -34717 -8619 4804 -2812 520
6199 520 -12783 -41149 4929 -19414 -64256 -48762 -20972 -10847 -7519 -4429 -46005 -59891 -24831
6186 -24831 13837 20325 2999 5480 14674 46821 68289 68346 60206 42251 47961 20959 1655
6173 1655 -17949 -29776 -30192 -18746 -1979 22455 33405 -23409 -104418 -105072 -51007 -15673 -9791
6160 -9791 -18543 11564 65688 57606 41106 27340 55008 76654 59200 30130 19687 319
6148 319 1741 -1095 -21991 -39237 -31065 -46670 -28468 -1256 1501 1668 5646 -4764 -16672 -8417
6134 -8417 -15976 -26756 -294 5130 546 -5404 4137 -13723 25786 35292 -721 -7670 24021
6121 24021 23520 36373 37888 34118 -17798 -41489 -59147 -37900 16921 41840 9766 3678 12745
6108 12745 -23038 -49494 -52665 -20759 12312 -41484 -71852 -23775 16344 27873 51291 63457
6096 63457 83103 65567 58989 91785 85085 18356 -7718 25850 1730 -47029 -28342 18641
6084 18641 18295 -6444 -1898 -8133 -33208 11434 26625 18793 28770 46016 29366 13829 -14380
6071 -14380 -19463 10662 40247 44256 45980 11646 -679 3859 22062 23548 -10802 -13483 22923
6058 22923 67655 49124 6503 -28539 -28980 -19228 -7867 -37493 -69868 -64938 195 63441 62955
6045 62955 40337 27033 26235 13254 4671 25209 63404 72368 20589 -5261 271 -27341 -32916
6032 -32916 -30484 -18574 18862 6689 -28319 -37780 -41621 -13460 54119 50865 15133 3405 4631
6019 4631 -33703 -38996 -8342 -12710 -43788 -74803 -68759 -48367 -20835 4940 26060 -10271 -39549
6006 -39549 -15701 23556 16405 -2151 1601 2470 -13205 -6408 -2805 -26162 -4015 52750 52063
5993 52063 41666 33745 44185 45552 34976 5700 1810 -3877 -23952 -13572 -43918 -26078 25351
5980 25351 40681 43404 9763 -5886 -5293 1252 -1152 -19069 -36597 -46727 -22617 -3197 21561
5967 21561 39435 16988 10013 6281 18517 -1449 -11841 -20150 -53557 -36790 5917 27418
5955 27418 41660 25032 9051 17078 11866 1913 7454 32551 52543 43628 45881 12367 -16197
5942 -16197 -14356 6641 4065 28207 4051 -61068 -78379 -58839 -20043 -28477 -3960 193 -12065
5929 -12065 -6489 17389 64422 53637 46731 17085 -15908 -37103 -37958 10173 14898 -15569 -63264
5916 -63264 -98562 -60320 -31317 -45451 -38916 -58514 -42076 -25685 17066 7754 -8360 -10668
5904 -10668 -30636 -39614 -65943 -105522 -79123 -10804 -3369 6159 2696 -25970 -56898 -58955 -52865
5891 -52865 -78888 -51990 6640 -13099 -45957 -47591 -81811 -90487 -58431 -49322 -15660 20007
5879 20007 62262 94350 119654 102835 34176 -39302 -2265 1819 41664 59603 74396 71846
5867 71846 58621 20174 26199 39813 16536 -2371 -7666 -11535 -1332 -33027 -44751 -17294
5855 -17294 16541 47944 47973 26607 -10733 -3323 1818 -20709 -45990 -60795 -74252 -86401 -76947
5842 -76947 -21521 2228 -49320 -45637 -12554 11738 51973 20356 -14587 -45499 -44151 -32681
5830 -32681 -29860 -3954 20672 33906 57620 23129 18932 -4157 -15149 -1566 8567 39648
5818 39648 16360 20754 22211 -9803 -4892 2748 -7620 -14783 -16617 -34522 -39648 -14647 26053
5805 26053 23311 -7647 -33320 -1820 6244 17463 2516 1322 -18598 -47177 -51593 -35106 -14878
5792 -14878 -10230 -30720 -4928 -31025 -31753 -7892 -6017 -18950 -12014 -35115 -83486 -134746 -117114
5779 -117114 -72069 -41526 -20810 -8772 -47025 -28348 -32367 -63366 -35721 -20542 25521 49393
5767 49393 33159 -1213 8747 10142 15488 24862 -8222 -21536 -32888 -37079 -21474 10146 36762
5754 36762 33001 -1495 1699 28876 28923 14048 7338 12419 19197 20409 534 -28333 -27525 -18706
5740 -18706 -10072 -31691 -51745 -23364 -16523 -47031 -39056 13820 36607 -23774 -52650 -24444
5728 -24444 15693 32162 29764 30703 9390 8751 1891 -5960 -15003 -12817 13544 21671 31263 14437
5714 14437 25195 51205 49221 14824 13292 11130 -18907 -17418 -6010 -46018 -26300 -28041 -21117
5701 -21117 -28540 -23502 -9499 -9432 -17114 -11473 -925 -11722 -2074 28802 14206 -12328 -8130 -33474
5687 -33474 -56903 -66851 -35308 -32178 -24087 -32620 -19386 -4457 -27800 1190 3574 11870 -7630
5674 -7630 -44120 -32704 3293 18813 28566 41295 32709 56933 28564 2804 24445 4651
5662 4651 -18725 -8800 -21437 -22583 5869 51848 52034 15135 -2779 -14996 -48133 -26942 14539
5649 14539 36963 33667 26548 31014 13509 5008 -8860 -16330 -25951 -15910 -8212 37121 33989
5636 33989 36333 21350 6929 3766 837 -17625 -29689 -4676 8678 11887 8257 -13368 -22326
5623 -22326 -22305 -13443 11248 13155 29659 9667 -7685 -9258 1782 -3589 5112 -28873 -43915
5610 -43915 -15480 9030 11721 11476 -6815 -21401 -57564 -73755 -62099 -86551 -65525 -16890
5598 -16890 11038 27161 9846 -25889 -37637 -64447 -69407 -54232 -37991 -12788 12605 -6818
5586 -6818 -20103 -12376 -32880 -46023 -46690 -57374 -71328 -97548 -88095 -55102 -42029 -32376 -36229
5573 -36229 -6383 4396 -20539 -15013 -390 5266 43699 48162 25027 -2429 8764 2519 -10650
5560 -10650 -14020 -12693 -29932 -20501 -6620 17819 7305 -23724 21785 32146 -1140 396 -7320
5547 -7320 -38848 -27286 -6661 -15444 13787 4344 -2172 15356 33341 50673 43912 13868 12418
5534 12418 2768 -11180 -4107 -27243 -62334 -67683 -41649 -3759 17293 -19006 -50571 -36268
5522 -36268 -27135 -26919 -13300 -2283 17117 -5484 -17918 3721 -11100 -24393 -3414 -29235
5510 -29235 -23611 -24223 -52349 -31208 -22706 -44139 -54094 -40124 -31940 -57614 -41599 -49243 -34835
5497 -34835 -26208 -38038 -18391 -9557 -3490 -19273 -19725 -16931 36092 63644 51883 30739 -11139
5484 -11139 -33236 -42333 -65557 -46251 -4481 -19392 18074 22936 -31901 -66047 -81423 -79569
5472 -79569 -78969 -77728 -54725 -29834 3807 3198 -15027 -21159 -8922 -2323 27435 -610 -15982
5459 -15982 -18440 -26435 -7799 -4071 -13529 -10887 -48205 -94454 -110271 -57058 -15547 -35616 -34364
5446 -34364 -14906 -8570 15858 6752 -41412 -47668 -58769 -63570 -54347 -38424 -32509 -49470 -68444
5433 -68444 -59469 -50058 -23464 -39068 -28156 12353 -7370 -37952 -39690 -39911 -31219 -54113 -24413
5420 -24413 18274 19876 29899 19929 10618 -5800 -7651 -21270 10375 20323 3619 -3878 -5018
5407 -5018 3772 -4966 -11531 3406 22461 42550 43032 -3036 -27222 -135 -17447 9224 16426
5394 16426 9960 11134 -14508 -6208 -3345 -7601 -29339 -16446 2305 -31180 -50209 -39835 -45291
5381 -45291 -36277 -25688 -1364 -4675 17142 10914 -18776 -23962 -2090 -17115 -20255 1576 1898
5368 1898 -8760 -33511 -29387 -6280 -34363 -34173 -20101 -18325 -8967 -14562 -15480 -2972 -20083 -20993
5354 -20993 -9374 -16833 -27288 21811 67840 11541 -19310 20242 18806 16267 13089 8023 15601
5341 15601 14388 -1726 -24815 -18723 -43421 -53782 -30235 9694 13589 16322 -22599 -27623 -7744
5328 -7744 -6612 -33408 -76370 -104843 -96662 -57066 3118 10237 -60380 -44884 -20018 -38183 -1419
5315 -1419 5353 -21686 4410 41725 17695 12301 20314 -3528 -19451 -52666 -48837 -7413 -8850
5302 -8850 -39218 -11600 -9277 -13037 -8311 -15542 -9208 -2004 -24049 -14198 5021 4397 34297 19055
5288 19055 -29750 -62582 -54818 -27702 -9318 -35360 -42013 -28033 -13591 -2159 31873 50914
5276 50914 38638 16217 -13927 -45112 -59090 -66749 -56990 -42689 -25029 -13522 314 -7802
5264 -7802 -2349 26069 19749 6072 592 16357 40618 24898 5695 -2652 -17399 26693 40485
5251 40485 9534 -21643 -18363 -13633 -36813 -51922 -75093 -61581 -49948 -21337 5638 28250
5239 28250 19547 29277 5846 -7698 10877 35780 34857 14777 470 6990 19845 3593 -3971
5226 -3971 2620 -4001 11255 22604 -13448 -55677 -45300 -44774 -43905 -56805 -63539 -72234 -30872 -40712
5212 -40712 -17508 -1774 -9524 -4896 -5896 -14094 -53376 -92978 -96887 -32968 -22029 -42042 -42597
5199 -42597 -36163 -43410 -88465 -80033 -71753 -24775 -9300 -27871 -52563 -66363 -25001 -4897 16482
5186 16482 35631 4763 -3507 -544 -112 6178 -15682 -23802 -33983 -42651 -60243 -67620 -39438
5173 -39438 1749 8159 -28002 -52451 -36555 -44590 -28549 -11139 -186 726 -18587 -85149 -62959
5160 -62959 -32694 -68651 -70878 -7739 -339 -4483 -3187 -29092 -25760 6375 2810 3503 12339 14829
5146 14829 12252 26128 47635 40886 41843 34784 23156 -5925 -27020 -52074 -71213 -61666 454
5133 454 6906 -24097 -10693 3130 -26280 -57187 -49919 -39956 -16104 -2278 30841 72111 67776
5120 67776 71936 26043 7755 4196 8231 -8817 -29171 -53381 -56976 -52823 -31202 -59402 -51908
5107 -51908 -54764 -46211 -57807 -63337 -48694 -33119 -28720 -77370 -95819 -53286 -6845 -16569 4583
5094 4583 42791 48454 22937 -12297 -6534 41230 74249 96729 74514 28784 2483 21548
5082 21548 34796 -3063 -19792 -68421 -65141 -21550 12061 -30594 -51974 -15697 27157 46693
5070 46693 5380 10779 19244 4910 -24813 -45561 -39742 -47761 -51121 -29006 -5149 -36448 -53172
5057 -53172 -5953 -8195 -30877 -46478 -27525 -6251 -23084 -34828 -8093 -5490 -35441 -35080 -14133
5044 -14133 -7068 -4026 325 21657 21878 26575 30820 47859 33207 -20647 -21559 -48825 -74803 -71918
5030 -71918 -86411 -93318 -81934 -48927 -34190 -57157 -72660 -59934 -47445 15258 35361 35398 23251
5017 23251 15972 2183 12173 36857 11684 -50807 -69285 -59413 -36144 -21245 -21210 -29095 -45029
5004 -45029 -49427 -40397 -50120 -34267 -9644 -29739 -48396 -32125 -29303 -67141 -46343 -15476 -14934
4991 -14934 -34415 -44105 -20489 -40588 -57911 -37631 -48122 -45786 1972 22852 52397 35239
4979 35239 30204 50189 77920 92997 36031 -2202 -35549 -68755 -40412 -24708 -33980 -5306
4967 -5306 7861 -30482 -40745 -12633 -5192 -7528 5519 14500 -996 -10154 -20712 -27189 -12666
4954 -12666 -11659 -25344 -54036 -55046 -42617 -38314 -47506 -70788 -36009 11088 13039 24964 60724
4941 60724 30799 -18217 -69126 -68564 -43409 -26325 -36173 -1156 13509 13 -31831 -24704 -1575
4928 -1575 -20110 -755 -1494 -5915 10048 1475 -21320 -67255 -57060 3999 15319 -14893 -10147
4915 -10147 -7341 22256 5859 9993 -17784 -59458 -34556 -48317 -39308 -67115 -49039 -38657
4903 -38657 -19542 13746 49518 47766 -11001 -17164 37618 60835 36013 17523 -11719 -43939
4891 -43939 -57840 -86973 -102600 -75225 -49741 -53510 -71768 -64018 -27361 38921 52868 34322
4879 34322 35112 67470 81263 48399 1193 -18186 -32491 -4986 3754 -5314 -12522 -3739 3455
4866 3455 -18952 13323 8761 4352 24629 52704 84877 79556 50674 24837 54758 73046 58273
4853 58273 13398 -18291 7008 12348 -165 622 24305 32662 40212 -13218 -29720 -25663 12533
4840 12533 37234 26901 -16127 -7408 -10346 -20512 -24485 -22351 -15223 2520 17656 -17365 -43768
4827 -43768 -10343 9425 2511 -12418 -14283 14179 9036 -21344 -46645 -5564 12716 37916
4815 37916 66011 44727 75699 45286 21441 16060 -40708 -84234 -67206 -38734 -38853 -31432 -836
4802 -836 -27756 -73134 -88352 -105355 -69305 -22842 -4371 -3678 15208 20652 43679 44822 2539
4789 2539 -4604 -7645 -7817 -15252 -8483 22703 70548 57408 39763 -10089 -99932 -110455 -60220
4776 -60220 -17466 -5411 -2131 15645 -15325 -8162 -2707 -8101 -6520 -1280 38832 59957 45680
4763 45680 47959 34700 15880 -12827 -19657 2619 -18053 -30904 -31847 -18632 -2114 -7362 -18081
4750 -18081 -20681 -48291 -49161 -29565 -32626 -58877 -50109 -37565 -28403 -30916 -21157 -14768 -36013 -28466
4736 -28466 -23441 -16067 -1030 23959 4883 6899 -16061 -41168 -24261 7543 27074 21908 -22355
4723 -22355 -48312 -39152 -43822 -20147 -16176 -38019 -25475 -12753 -15836 -18641 -19987 -22767 -2185
4710 -2185 339 -22594 -67293 -41294 3181 -7825 -17656 -20080 -13385 -10864 26373 46356 57778
4697 57778 39158 15003 23079 -17672 -14348 -3533 2075 -8720 1646 -7099 -43049 -28371 -7902
4684 -7902 -41359 -65213 -66222 -50894 -4813 25802 -10666 -48160 -32296 -50556 -76394 -70828
4672 -70828 -10768 18300 12795 -3331 -34169 -51051 -46407 -48305 -20603 -6651 10093 9392 45698
4659 45698 47797 10903 -30685 -19388 22570 54036 55474 31245 9848 14574 -5015 -23873
4647 -23873 -26378 -13875 6937 21239 48468 42286 36086 30737 16947 20726 -17131 -14841 -30190
4634 -30190 -41696 -52844 -56776 -28427 5802 9034 -7836 -17217 5780 27983 78220 75159 53491
4621 53491 32401 9523 -27481 -62180 -26763 -21591 23957 50233 46552 23745 11533 26704
4609 26704 50501 49859 65310 37968 41747 48021 47322 75297 57823 5837 -17708 -34622 -36842
4596 -36842 -13512 -16581 -8278 1248 -800 1837 -17291 -5403 4591 22916 41638 32770 9881
4583 9881 -546 29418 56750 44493 32741 -46877 -76236 -65443 -57418 -40038 -35869 -40633 -37899
4570 -37899 -35115 -3888 -16657 -8559 1181 -40316 -47117 -25569 18334 39130 10391 3809 2259
4557 2259 -8094 -18579 -46903 -56418 -38166 -15531 18939 33894 48641 53153 13881 -33400
4545 -33400 -59019 -64826 -48682 -45612 -18286 -26098 -36527 -37327 -31844 -21596 -8256 -46615 -87700
4532 -87700 -61405 -45413 -33490 -20435 -29257 -4613 -19072 -11187 -9477 -10687 20165 64733 56564
4519 56564 40730 18124 17996 36315 4778 -27857 -8530 -11050 1703 -10340 -9604 23686 22491
4506 22491 -37005 -56347 -27387 -28504 -54682 -60455 -66372 -39840 -28676 -60602 -61506 -39855 -22104
4493 -22104 -24893 -41990 -78812 -85687 -48771 -16348 -14344 8261 -3243 -408 18653 11406 12894
4480 12894 16835 3173 -32099 -50637 -83321 -76282 -26651 -29969 -7361 -8176 -1052 -36459 -88463
4467 -88463 -59251 -17097 -6133 -23016 -11004 -17420 -10799 -20595 -38995 -37151 -26773 -30233 -28654
4454 -28654 -24850 -34421 -19487 13377 26495 30709 45521 4796 -9440 -3862 -9049 -40274 -62688
4441 -62688 -50360 -31329 -23165 -27656 -31895 -34054 -42952 -31618 -21083 -51401 -55323 -38315 -44653
4428 -44653 -25173 -30318 -57417 -50613 -13569 11444 39580 16386 -15880 -43820 -62648 -30059
4416 -30059 -48812 -57267 -71734 -55445 -26539 -10384 4448 12392 -45610 -63559 7398 22630
4404 22630 23577 -12754 -52440 -93925 -90303 -49217 -31962 -61772 -84974 -71439 -60943 -36010
4392 -36010 -54009 -39204 -2295 -10987 -17531 -65212 -95506 -79401 -73812 -36656 -34972 -5030 -18326
4379 -18326 -7043 -5765 -45517 -48649 -29292 -54382 -70866 -34034 -26586 -22225 7770 28477 47752
4366 47752 57824 16883 9821 31648 5933 -7334 -24045 -39243 -47847 377 22516 -15942
4354 -15942 -36149 -21155 -26485 -22513 -16406 -48210 -8803 32537 28502 9502 3076 32552 19419
4341 19419 -14519 -39409 -85967 -47079 -8916 -4602 -28432 -15654 20152 30750 18900 19489
4329 19489 22975 37525 40058 13312 -23993 -13391 -30983 -33887 -7619 845 31697 59025 44363
4316 44363 26123 32973 27697 6332 25881 28089 28442 24431 -6616 17735 33396 44707 12565
4303 12565 -4822 -5210 -17554 -26604 -40591 -30095 -39479 -27132 -2468 37537 59714 20595 -21474
4290 -21474 -42639 -77017 -47651 -55434 -35812 -17855 -16875 -24286 -42265 -22857 -3687 -22469 5272
4277 5272 -4733 -67021 -74275 -56104 -21256 -16125 -57370 -33088 -17625 -36242 -8165 -18057 -6329
4264 -6329 -32755 12057 33232 -7315 6986 -26460 -58327 -15950 -837 -9184 -36805 -35373
4252 -35373 -49285 -31314 -19314 -6905 15974 18 -36119 -46202 -40409 346 -5385 -15537
4240 -15537 18545 39718 22239 -27201 -2587 -2133 -4954 1460 -26697 -7465 40280 96747 73210
4227 73210 19400 36648 34041 40228 -20062 -27324 -8162 -32243 -28825 -43635 -73833 -49167 -4206
4214 -4206 -28084 -31382 -14810 -11417 -12476 19912 -4131 -6988 -39502 -58609 -32743 -12594 9927
4201 9927 7065 22981 -5694 -25398 -14506 -2176 -15404 -32026 -24715 -38085 -21595 -17351 -10233
4188 -10233 -31860 -36792 -37044 -49251 -63999 -48564 -34588 -2594 -19738 -24041 -7657 39711 59154
4175 59154 12637 -4606 -24643 -24118 -40873 -51153 -83935 -90080 -106467 -70464 -35334 -11444
4163 -11444 2253 -8762 -17116 -14575 -39423 -46867 -52743 -32090 -22942 -4534 -46290 -80558 -78684
4150 -78684 -53300 -66752 -66972 -29432 9122 -7299 2483 13513 -9600 -190 16475 31355 28589
4137 28589 12430 45167 28633 10289 10166 -4913 -19175 -12788 -19473 -23362 -22214 -34495 -17756
4124 -17756 -28158 -26538 -6830 -362 -16289 -6136 12838 26451 33515 38317 21591 -15448 -92746
4111 -92746 -93423 -77582 -53293 -2775 32497 11107 -27695 -75483 -61492 -47846 -59147 -77695
4099 -77695 -82740 -96097 -98150 -93490 -91376 -83903 -80599 -119804 -151599 -96582 -47867 -31755 -58194
4086 -58194 -93716 -57828 -62527 -54792 1933 3579 34038 30931 6188 -6179 20844 10837 -8155
4073 -8155 -23054 -3435 30111 42635 22765 32193 36738 40612 30199 33761 18566 18290 23016
4060 23016 21645 51554 56302 31702 27141 7108 -20207 -60684 -86640 -40342 966 -18775
4048 -18775 -13739 -9033 -53250 -58551 -53653 -32542 -14659 -17349 15680 13964 -14551 -14648 -15085 -27042
4034 -27042 -15456 -2063 5582 -47766 -105866 -78693 -27695 3600 -20714 -26820 -18901 -60462
4022 -60462 -94927 -65664 -54745 -80001 -61700 -52505 -15069 -29316 -19234 -16970 -17501 5422 12642
4009 12642 20448 -14010 -20909 25312 21825 -15749 -37861 -28027 -19714 -2799 11392 -2382 -8542
3996 -8542 -22497 -6526 30485 35593 50163 81079 90054 77454 42354 39321 17011 -35316 -47764
3983 -47764 -38759 -14675 -15065 -656 -3630 -3427 -9102 10217 27905 16666 -28009 -28437 -18908 11920
3969 11920 7303 -33626 -19896 -5528 -36726 -59408 -54643 1747 -8720 -6470 -18758 -47309
3957 -47309 -32803 -6323 7617 -7894 -1941 -26039 -21582 -14814 -4666 -36794 -50904 -38620
3945 -38620 -35234 -9180 -2484 -9692 6687 6770 -24687 -57043 -59103 -54932 -32176 -30384 -30140 -68929
3931 -68929 -36318 -15643 -19293 -2340 -2551 -2158 22405 47891 30137 21327 35418 22763 -15609
3918 -15609 -44590 -17020 2069 3734 -10742 -4826 -29463 -32577 -25762 -48830 -27737 -42995 -42287
3905 -42287 -61893 -35227 15366 10907 -11390 -30364 6501 -15108 -44786 -48360 -22251 49393
3893 49393 56727 34668 32096 38866 37961 24840 32611 10834 -11446 -22466 -53271 -36976 -27632
3880 -27632 -54056 -59059 -43723 -55093 -34284 -35132 -41658 -25874 -1633 30799 29707 23792 13128
3867 13128 -19090 -28029 -8387 43624 26676 5478 19750 34296 9759 21385 5318 24211
3855 24211 27992 -18433 -83541 -60162 -35597 -61541 -77613 -92118 -52105 1039 -12102 -32772
3843 -32772 712 38473 30239 -22431 -35924 -22587 19781 37832 14698 18277 25198 23040 38278
3830 38278 17955 -4080 -1987 38975 82994 73502 47146 47893 28425 -824 2163 2141 20070
3817 20070 54720 51970 63275 9306 20940 14989 17992 2157 -3858 -51039 -51094 -55753 -54644 5993
3803 5993 61637 14253 31630 67235 37836 6265 -42769 -23396 8540 -19890 -28618 -41875
3791 -41875 -60416 -73980 -39313 1492 302 2305 -2190 3939 20657 14674 522 -33753 -31070
3778 -31070 -26611 -52210 -76548 -71182 -33289 -26122 -20963 -41535 -42083 -44988 -34518 -29927 815
3765 815 17025 -11179 8738 11203 7453 -20854 -40949 -8935 10387 -24209 -27589 -42656 -66778
3752 -66778 -57404 -13384 7731 -14052 5315 11874 -173 4696 -1805 -3539 -21517 -33503 -38482
3739 -38482 1917 23897 1858 -16055 -17798 -18082 -16125 -14061 519 2556 -4759 10434 -28414
3726 -28414 -5328 -5727 -39069 -80332 -100263 -73098 -34418 -6505 7246 -16798 -10898 -2148 -182
3713 -182 18849 15896 -18874 -44485 -86830 -62398 -28200 -3117 -63845 -78049 -64673 -18089
3701 -18089 -8312 -15483 -5009 -24690 -4638 -5374 -25252 -25742 -59870 -92288 -104831 -121332 -97517
3688 -97517 -50911 -46208 -67621 -62910 -34189 -16841 -21469 -59124 -61364 -74285 -56578 12515 45159
3675 45159 19874 4251 -1059 -16225 -39019 -55726 -43437 -72935 -81648 -63139 -29439 -5988
3663 -5988 -29288 -39863 -57302 -49484 -19573 12913 31707 18232 -3947 -16629 -1780 46474
3651 46474 75656 8248 -34511 -23439 -22234 5591 52160 69210 71456 32989 19091 18649 18652
3638 18652 -6645 -20300 -27100 -47934 -38789 -36664 -43655 -73126 -60639 -54685 -34001 -11493 484
3625 484 -16526 -63793 -16649 -8544 1388 14115 4059 11763 2494 18106 15099 -130 7732
3612 7732 14395 13086 -15598 -22649 -827 47918 79360 82225 41246 14346 -2655 -62079 -115395
3599 -115395 -111410 -75385 -43686 -13359 -4194 -29405 -32866 -2459 8335 -8357 -28633 -73307
3587 -73307 -83601 -277 30578 -4250 -22228 -3956 16149 24786 47971 30464 -2986 -5207
3575 -5207 19168 1073 -52148 -55184 -39746 -27533 -43182 -18084 -1516 -12476 -2625 -3879 -1561
3562 -1561 -5240 18668 16750 -4442 14499 36198 41016 43441 32326 -15413 -3907 45382 7512
3549 7512 28776 42756 17107 11771 -28373 -33460 -63197 -84208 -63811 92 -827 -13549 -39551
3536 -39551 -71187 -113430 -99705 -36989 -19781 -52 14636 16298 60582 75100 115155 122303
3524 122303 54075 41518 48380 39577 13255 4298 -1578 3520 24870 47867 11114 5738 -10969
3511 -10969 18781 6327 -14538 9295 69378 28237 1422 -27573 12363 -14195 -27073 17048
3499 17048 48130 24853 7224 7204 21967 -3691 -23831 -39700 -785 24058 -17066 -945
3487 -945 -1261 -17566 18749 29372 -22822 -48618 -16310 4809 -10860 -10628 12296 -5336 20518
3474 20518 20401 -33144 -30853 -37522 -40715 -27773 1975 30831 44987 55138 3127 -35653 -23446
3461 -23446 6781 5280 -25209 6906 17787 9826 5474 -1477 -9003 -17438 -27422 -9523 -29116
3448 -29116 -51303 -50617 -53927 -56653 -80951 -85939 -49012 -59278 -41477 -39776 -41886 -28036 -23388
3435 -23388 -29248 -27744 8938 48612 77265 79478 54210 47748 56694 9854 -42218 -56768 -71991
3422 -71991 -108484 -73760 -48587 -30554 -23643 -29422 1288 29544 -22314 -67016 -48988 -4880
3410 -4880 -9968 -26121 10185 -16155 -33738 -42172 -19119 -35225 -7497 11942 29542 7815
3398 7815 -15724 -17124 -18772 -10181 -32310 3062 -984 -5659 6113 -327 -7252 -21868 -9650
3385 -9650 23964 32100 1934 -21710 -39118 -375 24877 15108 3018 -15934 -4467 -46074
3373 -46074 -48105 12076 33594 12872 -4442 14284 7879 -22772 -26031 1055 28677 17480
3361 17480 29360 -19028 -29363 -25538 -14413 30962 53315 57354 33036 39840 25990 37408
3349 37408 22708 34101 9863 -7777 -17288 -14308 -12566 -36910 -30228 -15662 15937 -6450 -39149
3336 -39149 -25611 -31437 -28882 -35562 10540 35580 38888 44092 43595 56115 11559 -753 -14653
3323 -14653 6389 3260 -41893 -7738 -13431 -15331 -43895 -53986 -47372 -28660 -11497 10827 13060
3310 13060 30700 37339 50863 22547 -46534 -78333 -72810 -44337 14318 3190 -35486 -21767
3298 -21767 1517 28507 -9708 -4616 21376 8615 -4406 -52857 -86863 -107874 -95353 -84671
3286 -84671 -53354 -5247 26617 44950 37428 36181 37837 42077 66980 63168 53619 26942 -5559
3273 -5559 -6826 -6974 -18501 7426 -6574 -46837 -43987 -6514 -6620 -11274 15942 20048 29900 25775
3259 25775 33008 34707 20417 -9029 -26208 -15050 -11956 819 -5218 -66419 -78892 -45954 -11429
3246 -11429 -31485 -57766 -44152 -29966 -5462 13757 41690 48101 8110 -2587 -27988 -45779
3234 -45779 -27232 8079 8351 12723 22181 18636 -26243 -37673 -29911 -47493 -94144 -78334 -15489
3221 -15489 -6957 -22642 -33793 -39816 -32323 -39238 -55365 4942 42848 -6960 -24477 -21125 -15647
3208 -15647 7741 7670 -1921 -10388 20836 43004 45539 36849 38189 11973 20605 18662 -7247 11847
3194 11847 11268 3160 37158 6997 -27205 -31999 -45627 -70184 -45367 -13706 -866 -28061 -26048
3181 -26048 -77046 -89592 -28040 -15077 -4882 228 15647 45182 61675 15548 12038 -1374
3169 -1374 8037 19227 6083 -8641 -21557 -7718 18928 20240 -33415 -28853 -8821 13713 -2921
3156 -2921 9463 40230 47671 57576 41470 48852 43865 41982 39252 26879 67213 69455 41941
3143 41941 28241 52958 54646 36704 37541 45628 3346 -16360 4155 9344 -9078 24298 66993
3130 66993 61122 38077 24596 44512 28662 20489 44526 51334 19389 -12497 35031 67807
3118 67807 68992 76196 76545 55833 56320 69062 36858 -6163 -48592 -50625 -25590 -9819 -31707
3105 -31707 -4500 44511 62567 41128 37084 65244 29178 22500 30543 -121 7914 1724 7520
3092 7520 -2232 -6230 -17162 -10335 3821 -16082 13052 20152 -8044 -44819 -28903 -12581 -35557
3079 -35557 -48661 -56500 -47243 -48124 -79750 -71135 -49389 22829 10868 -7608 27467 25379 5905
3066 5905 -3475 2542 32795 20960 19474 32033 -11173 -34889 -20278 -47089 -26060 28465 16170
3053 16170 -1043 37639 37801 11706 1216 -23372 -35787 -53118 -28028 21324 18920 15288 6949
3040 6949 -30735 -43289 -18619 -13764 -31607 -21331 -34338 -27552 -10303 -16162 15745 13835 16002
3027 16002 -14481 -1921 -11536 -68764 -30911 -20742 -64375 -73434 -19740 18396 -2382 -26193
3015 -26193 -5120 11517 9285 -36752 -39336 10110 33097 44056 48311 1597 3263 2353 -14093
3002 -14093 1420 -18065 -41747 -48459 -60341 -70785 -65975 -26877 -16944 -37296 -15040 -9638 -6234
2989 -6234 9134 2401 -6946 2273 7858 12829 5202 -39429 -45542 -16249 -1000 -14750 -13539 -25734
2975 -25734 -26734 -17487 -12946 -2100 -7712 -19798 -21863 -12149 -11325 -2370 40782 33210 -4172 -18436
2961 -18436 -15720 -27426 -6534 35898 52740 101340 91600 23021 -8475 24226 3527 -4572
2949 -4572 -8492 -15440 -5453 -1893 -6631 -2673 -13077 -22936 -22459 -15634 -31020 -22228 -20670 -12887 -13294
2934 -13294 -8107 -3232 4899 15041 -5700 19089 30643 17929 6176 -15604 -31234 -14223
2922 -14223 17418 6168 -13076 12095 22623 2386 -15101 -8390 -11611 -1326 2963 -12159
2910 -12159 12270 20361 3886 -6822 47703 60854 34406 -2450 2221 1478 -8487 -9997 12476
2897 12476 35863 46439 9128 7854 16947 -9183 -30565 -35490 -43365 -27411 -19697 -22465 8961
2884 8961 77691 93917 57984 -5075 -61120 -29300 -12233 20425 3224 14366 40855 3637
2872 3637 -20697 -50273 -33593 12439 45396 34667 17193 -7399 -26194 2320 29186 55182
2860 55182 49924 36202 6690 -5015 3724 16890 25552 7748 -11405 -28776 -10030 -4133 -28459
2847 -28459 -17318 -855 -8488 344 24043 20087 -13214 -20554 -27558 -15260 -22519 -16613 -114
2834 -114 -1279 -25215 -66399 -82346 -78219 -57347 -38482 -59789 -91221 -85272 -64866 -55486 -75660
2821 -75660 -74579 -33050 -11549 32656 38311 55727 39889 -14961 1026 12828 -2619 6192
2809 6192 -15510 -12119 -5665 -16735 -52302 -62599 -26736 -10050 -15387 -32660 -20647 -26448 -8712
2796 -8712 -20549 -24036 -30614 -20862 28895 38978 18120 643 11926 -3016 2601 29069 71664
2783 71664 99596 97803 55551 46155 16683 -35930 -38871 -13150 -7791 -1749 6023 8216 42595
2770 42595 63165 35589 29151 2910 1523 14517 52344 53244 -3439 -23729 -61070 -53122 -11194
2757 -11194 29139 39697 13581 -8643 -3363 17009 -28072 -50972 -65666 -29821 -8500 6348
2745 6348 12027 -2876 -8699 -11439 -48402 -50888 -20644 18624 27197 -27559 -49643 -10975 34963
2732 34963 49464 37307 10563 23729 3993 34384 39233 53982 57413 46963 24282 -35969
2720 -35969 -17569 -3986 -11874 -3407 3218 -4137 5205 -621 7950 4490 23153 55417 46741 44856
2706 44856 13679 -21943 -30008 -43816 -77350 -73259 -81143 -44693 -4793 5941 -29851 -43207
2694 -43207 -24305 -20296 7859 -8963 -29019 -7723 4562 9731 35702 45074 38041 21466 -49361
2681 -49361 -90745 -39898 -2459 -5315 -5120 6620 -26098 -61058 -58932 -46695 -46740 -50958 -24806
2668 -24806 -9529 -51352 -41180 -33307 -194 -10340 -20173 -20130 -46825 -91669 -83417 -45507 34163
2655 34163 22916 10240 957 1986 -3758 -10636 -19419 1576 25249 34592 41320 15239 3810
2642 3810 -14029 -13910 55881 72722 63265 28678 -6458 -12830 -41751 -61381 -47397 12067 46502
2629 46502 43462 17847 853 5623 34248 51367 15639 -31238 -14396 -20623 -23193 36076 50833
2616 50833 29962 4528 -32918 -42099 -65500 -80474 -14058 35247 44342 46444 37710 10105 13319
2603 13319 -17817 -9852 -3022 -19594 -44817 -52946 -24220 2332 -4269 -25952 -4997 1603 -20180
2590 -20180 -8913 -10732 -4098 -4287 -5128 32431 18590 44533 52288 42628 8736 14813 8727 31797
2576 31797 -1100 -31045 -43647 3641 -848 12023 32929 13544 -22355 -21521 -13290 -2309 3428
2563 3428 -1142 -26390 6160 34166 8633 -11207 -34190 -36092 -16452 8851 31664 1499
2551 1499 14127 43164 71390 57351 54309 56855 81620 78348 60082 -3941 -32001 -21664 7385
2538 7385 21625 24572 12365 -3337 -11201 -23125 -41336 -46348 -70886 -51878 -36326 -9632 -12093
2525 -12093 -19297 -15675 -8199 18603 13625 -9191 20076 65426 40150 34985 12721 -13777 -29391
2512 -29391 3454 16409 56930 103661 98112 85063 58611 17368 -15283 -1065 -11957 -46901
2500 -46901 -25523 -8343 -16585 -28619 27870 36111 -13623 9648 76648 68418 46824 21056
2488 21056 3433 -14913 -5316 1946 -6479 -26238 -37589 -15951 535 -17456 -29644 -26885 -13320
2475 -13320 -60988 -75676 -83736 -57045 -21993 -6305 3479 31945 14710 -34240 -45011 -42897
2463 -42897 6006 49097 44596 12658 27299 14299 -20283 -41276 -28421 -13864 -11620 15605
2451 15605 5162 -19477 -13539 -27316 -53329 -12602 21207 2150 -33029 -60961 -30890 -11692
2439 -11692 -56365 -47215 -57964 -48747 -6903 -5835 -11615 -34912 -39070 -25184 5624 38111 36424
2426 36424 37998 44528 73906 61696 -224 -6694 -16958 -24984 -21714 -27057 -38248 -34802 -39165
2413 -39165 -60444 -79499 -99591 -80068 -68202 -22473 -2877 -35270 -51233 -74735 -41734 15258
2401 15258 20187 5085 11185 27465 16044 2022 15982 34052 46439 47501 20110 -13580
2389 -13580 -21569 -29740 2319 36290 42641 -7954 539 60698 40136 645 -1924 3111 18951
2376 18951 38533 13879 -12074 -8487 15377 24067 29823 -6862 -23010 -2660 24826 11531
2364 11531 -18128 -41316 -32174 -7936 -1647 -3843 12109 -54057 -68038 -49804 -7489 8768
2352 8768 13705 -3844 -23991 -16190 13527 54663 46596 12856 -19303 -19587 -28653 -32331 -19416
2339 -19416 5001 23472 18141 -9805 -22193 -45847 -17730 -33745 -40815 -17411 -11212 -53402
2327 -53402 -53134 -24135 23880 7042 49474 74144 93896 93517 59791 36728 30503 31395 23703
2314 23703 38828 21918 -17958 -46219 -33534 7678 -1703 -34838 -25152 -12944 -9708 -4878 2377
2301 2377 10444 -5552 -56813 -44638 -35141 199 21069 49943 69731 62680 56391 39624 32450
2288 32450 4384 4054 -370 -21207 2610 16009 19279 46023 27775 50745 60943 61029 62182
2275 62182 52064 22497 23248 36344 44713 27551 1759 -23832 6837 45716 49181 75504 55034
2262 55034 39453 66860 64156 24377 11092 -3437 -27569 -2774 45048 25950 -8781 9627
2250 9627 5326 2360 10383 13319 28610 37314 6992 -52665 -44614 -57142 -60501 -46361 -49499 -12173
2236 -12173 8425 11942 40465 6516 -29491 8003 6385 13824 40890 30038 -8094 739 6732
2223 6732 23801 -3490 -37924 -33970 -48545 -33914 -46111 -30466 -6512 16238 26999 17506
2211 17506 5044 -40488 -83318 -113175 -84099 -62856 -36628 -17392 -22534 -16728 -16337 -8619 -33439
2198 -33439 -34148 7626 36004 63560 30835 -8879 -10773 -5233 22604 41270 -9562 2590 7800
2185 7800 -17529 -20946 -8106 8463 19449 8840 19261 63387 70759 28463 -1124 803 190
2172 190 -13403 -35610 -38592 -32684 -33013 -7136 -10493 9688 35126 59263 10013 -60390 -49057
2159 -49057 -7398 27524 42513 40666 38239 31696 -17641 -39796 -12729 17616 50486 41546 -5372
2146 -5372 17663 26703 20372 26771 7370 -9837 15488 35451 53811 67818 59294 48681 38549
2133 38549 6682 -38623 -49592 -9619 16940 14330 36060 46701 41267 6026 -39666 -55321
2121 -55321 -46197 -38898 -58953 -42688 1257 18520 24777 32698 24071 8129 -8975 -23696 -5024
2108 -5024 -14770 17144 42559 49785 46552 39152 63830 92657 57151 1081 -36097 -28219 10566
2095 10566 7121 38435 31568 -24826 -73470 -82325 -66650 -25561 157 1077 -16265 21150 57642
2082 57642 20044 -20861 -15125 12068 22281 45679 71690 58401 46072 66350 59808 20359
2070 20359 -31526 -13625 5466 -6604 -7855 1900 10644 25497 33978 42145 35933 20018 -13756
2057 -13756 -25197 -10939 21071 38978 11367 -28969 -44388 -17093 10068 13349 43060 45898
2045 45898 31359 32777 -973 -21131 9718 25874 39291 14699 5071 15341 7874 31588
2033 31588 7210 16996 2611 -453 457 -24365 -26188 -6002 11046 27663 76543 56103 23785
2020 23785 -10855 -9848 -1000 2695 7802 17533 -8036 1909 23918 6901 -7218 -7584 11728
2007 11728 37028 15620 3400 42701 73826 44465 31006 10125 17243 9502 18823 5222
1995 5222 34116 58316 85982 70055 49109 33934 62365 59324 60307 79120 97638 81096 16008
1982 16008 -61284 -62020 -30685 -34134 -62110 -35853 33942 56141 45957 38005 1446 -66395 -56094
1969 -56094 -54520 -56518 -34063 -39090 -45275 -53362 -43178 -7075 -18946 -35155 -55976 -57728 -30712
1956 -30712 -51441 -36960 -3783 -15634 -35073 -43127 -40542 -2585 20761 23509 -2739 -12803
1944 -12803 -25824 -9926 -22034 -33661 -22366 16813 15484 28807 55236 26321 531 -30094
1932 -30094 -10904 -36824 -32617 -22321 -22518 -19352 -27988 -14907 19856 24938 25743 25668 -3312 -3584
1918 -3584 -22409 -16160 -1549 -4443 -26466 -68064 -91175 -74812 -63308 -49411 -45219 -48611 -60270
1905 -60270 -66742 -101504 -67195 -42056 -18656 -8035 -29813 -29581 -32105 -23085 8453 31042 43525
1892 43525 18092 16045 1057 -20243 -87439 -97309 -99850 -105184 -71046 -82447 -39386 17448 61383
1879 61383 75308 49476 16525 -5538 -25165 -25592 -30736 -47235 -11032 7871 24929 12973
1867 12973 -2234 4018 -7231 -9514 11056 28880 8608 -24190 -54754 -68875 -53790 -8106
1855 -8106 -20949 -33636 -11021 13500 11793 -30165 -34633 -35286 -15804 21580 19398 -39 -18056
1842 -18056 -22221 -10198 -13954 -11826 27367 34525 38831 76692 64419 31384 -23796 -48296 -17811
1829 -17811 -21798 -41614 -53988 -16037 5982 36083 50422 27776 23658 -2795 -19211 -33207
1817 -33207 -42015 -18867 -11593 -43294 -45167 -34870 -45350 -42843 -39254 -9294 -11814 -19738 -8717
1804 -8717 -2208 -20533 -12253 43745 53818 35679 32335 16618 33196 59391 68045 57339 26693
1791 26693 -14485 -8080 8264 6802 16223 50965 71972 47771 35373 34922 21828 -21531 -41411
1778 -41411 -5539 1361 12522 31899 23429 39979 39966 28710 11521 -15092 -35208 -18868 -8345
1765 -8345 -24823 -35961 -34420 2096 -2751 46463 20476 -5717 -24932 -37949 -34563 -20631 -2439
1752 -2439 16771 29836 36833 586 -11475 -27613 -61983 -69058 -43908 -32448 -9106 -176 11137
1739 11137 -697 -33613 -35842 3458 20806 -7362 -27074 -23618 -43166 -41304 -12614 -24592
1727 -24592 -49782 -53358 -54641 -12588 1918 -11625 13015 -1063 -5224 8186 35984 48206
1715 48206 1352 -13651 -993 24943 25392 -3199 -10801 -23974 -20408 -6496 -15292 -7084 6
1702 6 -9504 -34770 -49340 -32067 -19180 -3348 -3855 27054 38151 -4165 -25137 -19505 10555
1689 10555 19064 27417 61027 57561 38139 47411 15383 19563 46792 57417 56706 36594 -15054
1676 -15054 -18072 -16451 300 28848 36737 27566 12662 11647 20392 50347 44000 -17131 -8670
1663 -8670 25936 23299 15772 -20672 -6629 -38292 -17330 -16965 -14076 5249 43046 43526 41189 -18729
1649 -18729 -18285 -16271 -8136 198 988 -12227 355 -4477 -11250 -27920 -26566 -48919 -78734 -56080
1635 -56080 -36946 29102 67052 75071 44858 40550 55233 63685 36792 -8444 7195 29066
1623 29066 38425 35184 11908 -21811 -37963 -31045 -33336 -18949 -13894 23876 21816 27222 12878
1610 12878 32135 39428 27631 37704 35971 58673 44483 -809 18768 21342 32457 28903 3915
1597 3915 4978 45344 75081 67634 54363 8927 -19295 -16309 -8015 -15167 -14696 -9287 -8184 -40804
1583 -40804 -79530 -57639 -24039 -20749 7707 -18828 -76131 -79917 -68617 -59978 -37739 -31216 -13159
1570 -13159 26208 33622 12678 160 15838 38740 9871 16921 18910 34517 13904 -38279
1558 -38279 -55271 -8932 57562 63220 16752 4695 19056 15937 4227 -2556 -10782 -26128 10279
1545 10279 28090 3635 -13780 11956 38991 35589 29480 22786 6747 -1330 25455 47381 73880
1532 73880 64596 6244 36713 67879 39566 9418 -26238 1080 45981 53911 72089 51542
1520 51542 63907 52019 -3705 -12878 -25388 -5517 28702 18267 12094 81 -16283 -9935
1508 -9935 3381 18060 35849 7662 12221 14858 5540 -6195 9949 7445 -23274 -71840 -61959
1495 -61959 -34750 825 -464 31564 30147 2267 44099 52221 25641 23713 20407 -27113 -33540
1482 -33540 -8248 -14708 8799 35283 52586 77484 70833 40059 1941 -8488 -55634 -50561
1470 -50561 -51133 -5427 16293 -9929 -2919 -22039 -33802 -15147 -7251 -11587 -4968 15104 22692
1457 22692 583 -9562 -41780 -32727 -21281 -44655 -40978 -39819 -22193 -22747 2807 -6935 6218
1444 6218 37538 16889 15301 22231 19029 6516 13720 10179 -388 14296 32252 3707 -10841
1431 -10841 24322 7812 -27242 -10107 30116 34676 57238 36594 25107 -15706 -273 -9312
1419 -9312 7658 15430 42280 14085 -27100 -46850 -25646 -26933 -24792 1307 5571 -1463 -7928
1406 -7928 -19018 -26510 -27400 -24495 -10912 15423 -9431 -41444 -7569 40197 13865 -14215 -24600
1393 -24600 12876 36990 18140 16949 11848 -946 -31718 -31344 -1230 14741 31238 34151 22600
1380 22600 -6897 -16182 9960 -1623 11590 12305 11077 -8920 -35533 -46490 7032 12368 3917
1367 3917 51527 67693 79570 79803 98859 79106 70027 81848 118146 119040 71467 30606 15497
1354 15497 -4482 8051 23630 23257 19898 20925 30731 28415 13213 17242 39576 25592 -10856
1341 -10856 -5756 2753 33853 57592 53101 27749 -7931 -21373 -4337 6706 23024 55813
1329 55813 108792 115268 49643 65893 15776 -26351 -23621 -38316 -58345 -48867 -3723 57609
1317 57609 35354 14379 -5673 -4678 -18711 2948 -19197 -43869 -3208 10335 4183 -22906
1305 -22906 -20903 -12859 -18738 -39023 -49824 27930 113405 66076 46151 56669 72649 17809
1293 17809 -13771 -10226 -22093 -7457 34883 49596 36843 54623 62029 95589 74206 57169
1281 57169 71360 55293 31824 43995 35213 23894 39047 53849 75948 48082 27745 46394
1269 46394 32882 -1643 -43805 -77770 -60763 -30871 -16004 21768 51057 65622 81029 77819
1257 77819 80814 48756 30394 5509 12421 26318 27028 3613 11511 -18607 -17649 23744 16629
1244 16629 3355 -19592 -26827 -3476 41294 64019 46564 20932 -12883 -10853 -10531 -26237 -7068
1231 -7068 -12335 20174 56928 31088 22941 39310 15442 -21178 -4154 -4937 -33212 -59967 -26473
1218 -26473 11818 2167 -6097 -19438 -22990 -31775 12784 24793 39472 5346 -36287 -12126 12206
1205 12206 49279 61137 81204 83077 79657 43219 48618 15230 53953 53662 57373 54415 59480
1192 59480 71182 41966 -13949 -37274 5434 7313 23515 26396 970 27787 46853 35289
1180 35289 34574 25029 8297 11587 19621 14645 36592 47466 32552 20057 30604 59144 85459
1167 85459 69220 20569 -18519 -32208 -22997 -28756 -6925 27498 46034 51694 44124 57907 61912
1154 61912 7759 -16483 15208 24823 46553 61252 38966 4792 -19655 -34291 -18982 -10842
1142 -10842 -19649 -13480 -17168 -50189 -30818 -27619 12460 66081 91555 71395 59861 52712 15402
1129 15402 24631 -828 -41483 -95928 -114681 -54390 -4093 9451 -10048 8178 17216 9815
1117 9815 20367 4554 30543 1818 -56675 -47767 -7471 3159 12163 -18408 -35255 -39987 -35526
1104 -35526 -23409 -26243 -47716 -21836 -13411 -37332 -40650 -48681 -51209 -65193 -90427 -64152 -51589
1091 -51589 -11728 26405 19398 24293 16023 1550 5427 5374 -3344 -45016 -47735 -57413 -49895 -20354
1077 -20354 94 -5888 7530 -1699 -14369 -29680 5593 34182 36492 5704 638 15188 -1327
1064 -1327 9526 38627 29231 -3626 -8662 -17473 -37847 -55124 -17166 15288 10896 12377 19485
1051 19485 23129 23092 66177 29471 -22900 -8601 10617 12499 -13878 -18838 -10637 21903 5734
1038 5734 18786 14329 11343 28106 45147 42312 42348 35045 31876 10940 18767 23523 30082 52125
1024 52125 33453 -10933 3945 36013 46518 55328 87595 69803 43985 23722 46954 93320
1012 93320 97277 90215 90117 60867 65503 42174 33174 47389 31822 36614 37768 -8220 -45242 -15693
998 -15693 -20011 -51459 -26562 -26 16623 58634 48160 35463 14009 28526 51100 66356
986 66356 45631 23992 -8850 -15267 -3919 -7810 -21714 -24025 -5032 -648 -5918 16092 11423
973 11423 -10248 7232 33406 43358 13153 11974 4882 3523 7913 20824 35186 38060 30758
960 30758 59472 71875 18257 -29987 -25159 -20775 8231 21711 34815 57153 15952 -795
948 -795 -30117 -45004 -37425 -28560 -19784 -5558 -8550 -57330 -36887 -21439 -28981 -18229 -18908 -27924
934 -27924 -18226 6621 17961 5990 50375 62071 66587 63421 66738 60980 4299 21198 2017
921 2017 -19034 -33929 -32979 -70970 -82605 -92222 -47450 31158 37801 40599 13225 15288 28851
908 28851 69521 64646 11220 24146 64756 49196 7111 -14419 -24926 -21575 -14140 12538 35859
895 35859 31169 -4814 -22521 -42358 -40534 -34077 -31667 -46118 -44795 -24384 35235 70029 51769
882 51769 62925 73843 31351 -21589 7113 32791 -28530 -64012 -35947 35307 93034 64108
870 64108 33451 34765 -28966 -84028 -80053 -32242 -2487 -13528 -23663 -24439 -28335 11274 67249
857 67249 47440 26238 36934 34456 60139 60031 32722 20259 8416 -8926 -16761 5233 26829
844 26829 22818 32506 23617 39464 28490 -828 -5056 3849 18527 21734 8578 23172 39099
831 39099 14223 -22705 -36655 -26950 1862 15792 9135 -339 15150 27958 -2762 -23773 -22161
818 -22161 -20920 -20778 -5309 -8343 -25912 -339 -721 7175 8193 -6118 -4657 -8997 17363 -8116
804 -8116 5115 16084 11618 -7077 -7246 24062 59401 57325 57028 49913 67164 43559 14864 15168
790 15168 7204 1926 -37887 -43626 24548 65098 45607 5060 4447 32330 39129 55356 42811
777 42811 -23337 -50619 -21058 18313 -6170 -28277 -13664 7107 6669 4325 -545 12295 5939
764 5939 3243 36859 60079 57625 69586 45996 -4623 -21278 -26837 -12777 52104 52210 17882
751 17882 19514 20341 -20036 19011 11317 6688 30550 41943 63615 79947 70267 90092 125234
738 125234 102940 73480 69356 79332 50279 29184 12491 -8648 -49073 -47363 -6768 -834 -31599
725 -31599 -47881 -34227 8417 14142 12699 22746 13611 2575 -31584 -27104 -1203 3180 -18492
712 -18492 -34394 -22317 -14587 7613 17757 5766 39738 37084 26001 17494 10263 51916 95852
699 95852 107193 98720 81979 48632 47067 63768 41903 12438 12133 18741 -10279 -43447 -58656
686 -58656 -42492 -19950 -24673 828 49876 112114 74515 24404 13681 44312 42764 21412
674 21412 16704 996 23460 43987 48175 39631 68918 51472 15975 4909 23259 24184 11177
661 11177 3218 -2317 -27185 -58417 -38897 -6853 21841 23290 33802 6338 -5563 16794 -7497
648 -7497 -40691 -63920 -48113 -26015 -21747 -22175 -17686 -7276 -27930 2543 24024 45461 17378
635 17378 -42795 -65103 -26471 -2076 29931 33096 28090 1544 -38088 -28025 31307 33878 18016
622 18016 17340 -12346 -26970 -20878 -17167 -31348 -36844 -10838 -10564 -40788 -59374 -45812 -45649 -34052
608 -34052 10417 45549 65868 88717 62173 36960 42913 38163 50912 102716 96045 80614 53939
595 53939 44331 4632 -29408 -5389 14047 -1327 18180 34681 17078 50168 79747 102845
583 102845 82386 9480 -13912 -14927 44121 76416 82622 72863 68468 35698 -8028 -42666 -27487
570 -27487 -3337 7112 -21680 -18478 -14212 -15825 -22289 -23721 7147 40253 48218 10089 489
557 489 -10284 36876 56407 63182 21585 28993 15272 3291 -21775 -16753 1675 7191 -1411
544 -1411 -39209 -33286 -15727 -55484 -19216 25457 50666 47992 32120 42234 45600 44025 54223
531 54223 46189 59200 18020 4038 -8078 -13884 22066 18755 37122 21398 13824 -8060 -8481
518 -8481 -9192 -11814 20 19825 15441 10092 15791 13504 -5956 -43348 -33311 -37455 -34624 -25669
504 -25669 -26116 2226 20477 34746 43045 11019 -28660 -13760 3230 30790 47369 21287 22931
491 22931 44185 25077 21447 25807 2542 12380 9409 22982 44454 37977 38469 22401 -4562
478 -4562 12926 7693 87 9782 -4224 1126 67818 41087 2696 19065 48912 56966 45666
465 45666 29858 29507 27814 -6075 16700 72217 71582 103142 51835 -2282 -23030 -2749 -14865
452 -14865 14519 -4533 -16378 6930 33994 25551 38069 -10950 -41096 -56626 -24753 -26915
440 -26915 -9821 -7433 7204 44111 23313 35129 81378 53904 37589 34943 -11902 -35836
428 -35836 -32289 -17044 17340 2541 16928 -13588 -14702 -17768 -40942 -79277 -79586 -17200 6069
415 6069 4417 18851 61318 48889 40833 31763 13250 1785 -23194 -17931 -35265 -16923 7561
402 7561 10878 368 37808 73030 3652 -25626 8743 32857 12911 -16767 -55743 -40062
390 -40062 -27113 -32184 -5304 41804 39527 21480 32132 33121 27621 17536 21387 27843 13241
377 13241 -3863 -8508 -27883 -16780 -3131 -1968 16635 45178 22810 29227 66403 70290 36965
364 36965 14992 33736 24773 20083 10796 2418 8523 -12711 13140 1842 13209 40403 38784
351 38784 34680 60866 58263 67142 77013 86506 60457 64134 71572 33175 15936 5184 -4011 33989
337 33989 13769 -27732 -14168 16426 24585 21113 6721 -13563 -16513 -631 31834 61563 42540
324 42540 13361 -27570 -16912 -18518 -28725 3999 36485 44444 60138 49001 35779 51125
312 51125 58872 41222 45723 14962 21613 14698 -9874 10065 23224 50711 77894 77601 45413
299 45413 156 23773 69818 62267 30779 24300 31150 48752 32163 7726 16010 8499 -12580
286 -12580 -49825 -55750 -37988 -27182 -21459 -13009 -24307 -36314 -46610 -37124 5093 22860 17974
273 17974 20545 5414 12618 -22392 21527 54498 49931 37303 20767 27129 15170 -15808 -25501
260 -25501 -19849 -12373 1086 -2858 8962 39352 34681 28286 26797 25248 16438 2534 293 15029
246 15029 66492 49198 10474 -7426 -20294 15267 49520 45241 31848 19664 -3834 17050
234 17050 24330 3719 -2728 -11760 19609 19729 -3529 -14026 -10621 -7951 4184 15094 11634 -979
220 -979 -19453 -23371 -30247 -3010 -13128 -43625 -31478 -14399 -5294 1197 9922 37585 24702
207 24702 27602 18772 7872 -6200 -22319 -24652 -7945 -5207 9829 26764 6107 -20205 -37286
194 -37286 -5422 5046 12374 26143 62969 51007 21986 24488 44057 11226 414 10582
182 10582 16080 14188 4224 -19603 -34867 -15363 23146 26178 28774 -1989 9196 41905 27957
169 27957 10995 40484 33951 46238 47764 2250 4712 -9729 11810 53963 47846 34645 42349
156 42349 52623 18645 3276 -7834 -32876 -14423 18112 28862 23844 42129 70468 73464
144 73464 38542 33657 33357 34038 33875 14439 16844 25407 14335 32303 44315 42143 7568 -2518
130 -2518 24998 38095 49675 59064 59083 56441 36028 11960 -7324 -39119 -33864 -21193 -15721 -21026
116 -21026 -6578 -6366 -8328 -9396 -25872 -33764 -27001 2359 45627 30327 28516 36040 57082 27984
102 27984 -5975 -1198 14135 33956 33812 24998 21581 33532 40126 45704 29650 39091 34985 29935
88 29935 21414 -11042 -37835 -60797 -42621 -53648 -51259 -50677 -45732 -31944 627 14031 40665
75 40665 51790 34545 24945 18016 31917 11224 -4646 -24354 -20963 -6456 9078 9947 -5157
62 -5157 -15633 4046 3869 -3949 16780 51759 50727 38172 46296 42307 18054 14673 4742 5085
48 5085 8576 4212 30959 45233 9085 5584 34975 30976 22304 18416 14824 3560 17731 38294
34 38294 30102 26266 27485 19292 8879 -15852 -33794 -43732 -46840 -32157 12950 33320 10707
21 10707 6877 765 -18326 12127 19641 12038 -1043 -5805 32862 36807 41338 53450 37999 12294
7 12294 -814 6103 14497 38131 52758 48837 23014
0 23014
$$ Imaginary data points
##PAGE= N=2
##DATA TABLE= (X++(I..I)), XYDATA
32767 148190 157427 146046 168022 181222 201057 206623 192841 190119 192232 185340 164967 152888
32755 152888 173717 187772 202395 198822 199395 173416 185528 230564 222817 220957 251658 243335 219301
32742 219301 206706 211003 217942 239786 257455 243339 225315 201226 213862 239581 241047 233327
32730 233327 235700 225865 280978 312613 277960 271975 270924 269588 238152 209859 204146 190792 184988
32717 184988 192079 247311 249145 270543 250939 246306 249147 264830 279789 290096 295374 289183 265506
32704 265506 265323 281966 274737 279997 262709 233837 233877 217413 238770 263847 290873 312578 306717
32691 306717 315667 292932 301977 318443 301506 299887 292387 265491 263578 293418 305904 322055
32679 322055 329251 324516 342723 361270 359988 348247 317597 296517 293875 304820 326729 313054
$$ [...]
##END NTUPLES=NMR SPECTRUM
##END=
