##TITLE=Analysis number 328837
Compound Code cc 65006
Book Reference 464/158/4
Project Code adrs
Chemist Name chrisr
##JCAMPDX= 6.0         $$ Bruker NMR JCAMP-DX V2.0
##DATA TYPE= NMR SPECTRUM
##DATA CLASS= NTUPLES
##ORIGIN= Bruker BioSpin GmbH
##OWNER= nmr
$$ XWIN-NMR		Version 3.5
$$ Mon Jul  9 10:34:29 2007 GMT Daylight Time (UT+1h)  MAYBRIDGE\nmr@NMR_250MHZ
##.OBSERVE FREQUENCY= 250.131544655141
##.OBSERVE NUCLEUS= ^1H
##.ACQUISITION MODE= SIMULTANEOUS (DQD)
##.ACQUISITION SCHEME= undefined
##.AVERAGES= 16
##.DIGITISER RES= 18
##SPECTROMETER/DATA SYSTEM= dpx250
##.PULSE SEQUENCE= zg30
##.SOLVENT NAME= CDCl3
##.SHIFT REFERENCE= (INTERNAL, CDCl3, 0, 16.522)
##AUDIT TRAIL= $$ (NUMBER, WHEN, WHO, WHERE, WHAT)
$$ ##TITLE= Audit trail, XWIN-NMR		Version 3.5
$$ ##JCAMPDX= 5.01
$$ ##ORIGIN= Bruker BioSpin GmbH
$$ ##OWNER= nmr
$$ C:\u/data/dgb/nmr/ADRS/600/pdata/1/auditp.txt
$$ ##AUDIT TRAIL=  $$ (NUMBER, WHEN, WHO, WHERE, WHAT)
(   1,<2007-07-09 10:34:05.77 +100>,<MAYBRIDGE\nmr>,<NMR_250MHZ>,
      <created by zg, POWCHK disabled, PULCHK disabled
       configuration hash MD5:
       76 6E 9A 78 1E 09 19 81 EC 84 63 8F B0 6A 59 2D
       data hash MD5: 64K
       0E AF D1 7F B5 F8 47 9C B7 26 0A 46 9F 3D E0 3B>)
(   2,<2007-07-09 10:34:21.11 +100>,<MAYBRIDGE\nmr>,<NMR_250MHZ>,
      <Start of raw data processing
       ef LB = 0.3 FT_mod = 6 PKNL = 1 SI = 32K 
       data hash MD5: 32K
       78 D8 5E FE C2 4D C8 F7 CF 66 1B 36 B8 19 F1 93>)
(   3,<2007-07-09 10:34:22.73 +100>,<MAYBRIDGE\nmr>,<NMR_250MHZ>,
      <apk 
       data hash MD5: 32K
       B4 9B CE 88 84 AC F9 E2 9C CF 28 07 44 F5 AA 99>)
(   4,<2007-07-09 10:34:23.45 +100>,<MAYBRIDGE\nmr>,<NMR_250MHZ>,
      <abs ABSG = 5 
       data hash MD5: 32K
       64 B8 8C 3A BA D3 F7 B0 95 B1 1C 9C 2D 06 D0 F3>)
$$ ##END=
$$ 
$$ hash MD5
$$ DF 40 AB 48 E3 B9 26 51 B5 85 E4 7E 3F E4 46 47
##$RELAX= 
##$RELAX= 
##$RELAX= 
##$RELAX= 
##$RELAX= 
##$RELAX= 
##$RELAX= 
$$ Bruker specific parameters
$$ --------------------------
##$DU= <C:\u>
##$EXPNO= 600
##$NAME= <ADRS>
##$PROCNO= 1
##$TYPE= <nmr>
##$USER= <dgb>
##$AMP= (0..31)
100 100 100 100 100 100 100 100 100 100 100 100 100 100 100 100 100 100 
100 100 100 100 100 100 100 100 100 100 100 100 100 100 
##$AQSEQ= 0
##$AQ_mod= 3
##$AUNM= <au_zg>
##$AUTOPOS= <27 >
##$BF1= 250.13
##$BF2= 250.13
##$BF3= 250.13
##$BF4= 250.13
##$BF5= 500.13
##$BF6= 500.13
##$BF7= 500.13
##$BF8= 500.13
##$BYTORDA= 1
##$CFDGTYP= 0
##$CFRGTYP= 5
##$CHEMSTR= <none>
##$CNST= (0..31)
1 1 145 1 1 1 1 1 1 1 1 1 1 1 1 1 1 1 1 1 1 1 1 1 1 1 1 1 1 1 1 1 
##$CPDPRG= <>
##$CPDPRG1= <>
##$CPDPRG2= <>
##$CPDPRG3= <>
##$CPDPRG4= <mlev>
##$CPDPRG5= <mlev>
##$CPDPRG6= <mlev>
##$CPDPRG7= <mlev>
##$CPDPRG8= <mlev>
##$CPDPRGB= <>
##$CPDPRGT= <>
##$D= (0..31)
0 1 0 0 0 0 0 0 0 0.06 0 0 0 0 0 0 0.0002 0 0 0 0 0 0 0 0 0 0 0 0 0 0 
0 
##$DATE= 1183973644
##$DBL= (0..7)
120 120 120 120 120 120 120 120 
##$DBP= (0..7)
150 150 150 150 150 150 150 150 
##$DBP07= 0
##$DBPNAM0= <>
##$DBPNAM1= <>
$$ [...]
##$SUBNAM7= <"">
##$SUBNAM8= <"">
##$SUBNAM9= <"">
##$SW= 20.6930455092707
##$SWIBOX= (0..15)
0 0 3 0 0 0 0 0 0 0 0 0 0 0 0 0 
##$SW_h= 5175.983436853
##$TD= 65536
##$TD0= 1
##$TE= 296.16
##$TE2= 300
##$TE3= 300
##$TEG= 300
##$TL= (0..7)
0 120 120 120 120 120 120 120 
##$TP= (0..7)
150 150 150 150 150 150 150 150 
##$TP07= 0
##$TPNAME0= <>
##$TPNAME1= <>
##$TPNAME2= <>
##$TPNAME3= <>
##$TPNAME4= <>
##$TPNAME5= <>
##$TPNAME6= <>
##$TPNAME7= <>
##$TPOAL= (0..7)
0.5 0.5 0.5 0.5 0.5 0.5 0.5 0.5 
##$TPOFFS= (0..7)
0 0 0 0 0 0 0 0 
##$TUNHIN= 0
##$TUNHOUT= 0
##$TUNXOUT= 0
##$USERA1= <user>
##$USERA2= <user>
##$USERA3= <user>
##$USERA4= <user>
##$USERA5= <user>
##$V9= 5
##$VALIST= <valist>
##$VCLIST= <CCCCCCCCCCCCCCC>
##$VD= 0
##$VDLIST= <DDDDDDDDDDDDDDD>
##$VPLIST= <PPPPPPPPPPPPPPP>
##$VTLIST= <TTTTTTTTTTTTTTT>
##$WBST= 1024
##$WBSW= 4
##$XGAIN= (0..3)
0 0 0 0 
##$XL= 0
##$YL= 0
##$YMAX_a= 448752
##$YMIN_a= -436427
##$ZGOPTNS= <>
##$ZL1= 120
##$ZL2= 120
##$ZL3= 120
##$ZL4= 120
##$ABSF1= 16.522
##$ABSF2= -4.171173
##$ABSG= 5
##$ABSL= 3
##$ALPHA= 0
##$AQORDER= 0
##$ASSFAC= 0
##$ASSFACI= 0
##$ASSFACX= 0
##$ASSWID= 0
##$AUNMP= <proc_1d>
##$AZFE= 0.1
##$AZFW= 0.1
##$BCFW= 0
##$BC_mod= 0
##$BYTORDP= 0
##$COROFFS= 0
##$CY= 12.5
##$DATMOD= 1
##$DC= 0
##$DFILT= <>
##$DTYPP= 0
##$F1P= 14.0000005364418
##$F2P= -0.99999901652339
##$FCOR= 0.5
##$FTSIZE= 32768
##$FT_mod= 6
##$GAMMA= 0
##$GB= 0
##$INTBC= 1
##$INTSCL= 1
##$ISEN= 128
##$LB= 0.3
##$LEV0= 0
##$LPBIN= 0
##$MAXI= 10000
##$MC2= 0
##$MEAN= 0
##$ME_mod= 0
##$MI= 0
##$NCOEF= 0
##$NC_proc= -2
##$NLEV= 6
##$NOISF1= 0
##$NOISF2= 0
##$NSP= 0
##$NTH_PI= 0
##$NZP= 0
##$OFFSET= 16.522
##$PC= 1
##$PHC0= -48.66688
##$PHC1= 5.645204
##$PH_mod= 1
##$PKNL= yes
##$PPARMOD= 0
##$PSCAL= 4
##$PSIGN= 0
##$REVERSE= no
##$SF= 250.13
##$SI= 32768
##$SIGF1= 0
##$SIGF2= 0
##$SINO= 400
##$SIOLD= 32768
##$SREGLST= <1H.CDCl3>
##$SSB= 0
##$STSI= 32768
##$STSR= 0
##$SW_p= 5175.98343685301
##$SYMM= 0
##$S_DEV= 0
##$TDeff= 65536
##$TDoff= 0
##$TI= <Analysis number 999999
Compound Code 99
Book Reference 9
Project Code 9>
##$TILT= no
##$TM1= 0
##$TM2= 0
##$TOPLEV= 0
##$USERP1= <user>
##$USERP2= <user>
##$USERP3= <user>
##$USERP4= <user>
##$USERP5= <user>
##$WDW= 1
##$XDIM= 32768
##$YMAX_p= 355657231
##$YMIN_p= -62783
$$ End of Bruker specific parameters
$$ ---------------------------------
##NTUPLES= NMR SPECTRUM
##VAR_NAME=  FREQUENCY,     SPECTRUM/REAL,   SPECTRUM/IMAG
##SYMBOL=    X,             R,               I
##VAR_TYPE=  INDEPENDENT,   DEPENDENT,       DEPENDENT
##VAR_FORM=  AFFN,          ASDF,            ASDF
##VAR_DIM=   32768,         32768,           32768
##UNITS=     HZ,            ARBITRARY UNITS, ARBITRARY UNITS
##FACTOR=    0.157963299565203, 1,           1
##FIRST=     4132.6476996994, 0,             0
##LAST=      -1043.33573715361, 0,           0
##MIN=       -1043.33573715361, -62783,      0
##MAX=       4132.6476996994, 355657231,     0
$$ Real data points
##PAGE= N=1
##DATA TABLE= (X++(R..R)), XYDATA
$$ [...]
16849A6787003n200916k535903j023154k72279j76717k52822j21281R2817L93964
16840G690712P74398J199666J685845K517683L866324O047413R942876J7209322
16832E0934239K9165046M2619726M5915515J6640785k9009938m0241638k6991987
16825H9031748j7672041j0202362l45573J0578769J5198914p57835j6546817j4054054
16817E5230749l806837O552470J3895368M448076j4234418j7754838j1078675
16810C3251895m775818k02158J702793j833078n950416n684812l389068j718181
16802A1401157r41057k26232Q80916K385361L203105M48439k647327k232752r5002
16793A2176608K211841M125749J988734l349752m712581k889831j042536L00085
$$ y = [16787003, 11586087, 9050184, 8027030, 7754751, 7578034, 7325212, 7203931, 7296748, 7690712, 8465110, 9664776, 11350621, 13868304, 17734628, 23782041, 33724917, 50934239, 80099285, 122719011, 168634526, 185275311, 156265373, 116023735, 89031748, 71359707, 61157345, 60811772, 71390541, 86589455, 85831620, 69284803, 55230749, 51423912, 57976382, 71871750, 76319826, 62085408, 44330570, 33251895, 28476077, 28273919, 29976712, 28143634, 22193218, 16508406, 13119338, 11401157, 10460100, 10233868, 11114784, 13500145, 16703250, 17151689, 14504362, 12271610, 12176608, 14388449, 18514198, 20502932, 17153180, 12440599, 9550768, 8508232, 8808317]
16785H808317R44147k59650j955354k070956j330276p69063n33209l99466k86635
16776B147855k06198j89637j35567n4489j06483j65656j27723r2779r1285m9560
16766I28478q765l2061o2731p7871n8806l5585o224K797K1882K1515k5139m5964
16754F21526l4337j4483r261N585K0050P687l8637n8669m6878k1808o71J3655
16742D43759O033l0053k8013l4776j4941m926J015j8726j8986j0218n721N36m068
16729B80915N815Q775j097k2764k1227j2108l319K919R714M226j4737J691q1j2816
16715B25906K113m519p476k3916j8853j7534j3236j624J8151L3256L5264M403
16703B31935j3085j3230L61n171j0756N276Q378m837q53m946k91j5559p865L035
$$ y = [8808317, 9752464, 9492814, 7537460, 5466504, 4136228, 3367165, 2833956, 2434490, 2147855, 1941657, 1752020, 1616453, 1561964, 1455481, 1289825, 1162102, 1069323, 978038, 928478, 919713, 887652, 824921, 747050, 688244, 652659, 646435, 649232, 671114, 692629, 667490, 621526, 587189, 572706, 563445, 569030, 589080, 596767, 558130, 499461, 452583, 430775, 430104, 443759, 449792, 419739, 391726, 356950, 342009, 337083, 338098, 319372, 300386, 290168, 284447, 284983, 280915, 286730, 295505, 294408, 271644, 250417, 238309, 234990, 237909, 247623, 251849, 237112, 238803, 238722, 225906, 228019, 223500, 216024, 192108, 173255, 155721, 142485, 140861, 159012, 192268, 227532, 231935, 218850, 205620, 205981, 200810, 190054, 195330, 203708, 198871, 198018, 193072, 192781, 177222, 169357, 172392]
16689A72392J5715O604j825M514j5054q819M650p600L291p111q735J3154L915
16676A75091j3532j5994r138K492L536l366J1483N779p627k203m711q821j505
16663A31484Q679n690j0951k386o683j1857j5019j531R574L504l23q815j7701
16650G2285K732J0831J1259n636J0995K1091J4903K800j0247m049O620m109p350
16637A22125J464m920M61j670q325O392J3843p24q75n875J151j1975j5795l481
16623I1796M513k948p969j7554J0317O327q232j0931r836J839N109R155K750m176
16609G0160Q152r90O66k42j488M758k634r113J40R567l986J48m710P20m279J2282
16593G9151k837j1687j0635N963R591n311j152K897p63k580L771j615j3691n421
$$ y = [172392, 188107, 194711, 192886, 197400, 182346, 173527, 178177, 170577, 173868, 166757, 158022, 171176, 175091, 161559, 145565, 136427, 138919, 142455, 139089, 150572, 156351, 148724, 146521, 141810, 132989, 131484, 140163, 134473, 123522, 121136, 114453, 102596, 87577, 86046, 95620, 99124, 98801, 89986, 72285, 75017, 85848, 97107, 91471, 102466, 123557, 138460, 141260, 131013, 126964, 133584, 129475, 122125, 123589, 118669, 119130, 117460, 109135, 115527, 129370, 128646, 127771, 121896, 123047, 111072, 95277, 91796, 96309, 93361, 85392, 67838, 78155, 84482, 76250, 65319, 55483, 57322, 62431, 71586, 74336, 70160, 78312, 77322, 77988, 77746, 76258, 81016, 78382, 69269, 69409, 78976, 74990, 75138, 70428, 71148, 66869, 79151, 76314, 64627, 53992, 59955, 69546, 64235, 63083, 65980, 65217, 62637, 66408, 64793, 51102, 45681]
16579D5681M002J725l070J4845J3357k139L303N502j1699r477k2o580J391P656
16565F4475O172m770j5577K350K36J1395J9807q31J994k6121q911P659P256L417
16551F8551l216j914J591Q811j1176n194J816O515j4698r300J681k366Q863J0813
16537F0777P335p206k2269p812M230J2515M433N358Q22K865L344p788l233o087
16523D7284p863o937R906J2675j2749o209J278J0478K546r261j3025j1248q314
16510H561J0874R858j1824j6929J7768J3521P813O6j3854j2818n323Q039J0874
16497B6626J2491O566k456m28j1782L051K001m356R794p081j1882J7591L907k1451
16483B2591j1234O714j07J0390j048q532J951J8738O157j518J4072q704p108q952
$$ y = [45681, 49683, 51408, 48338, 63183, 76540, 74401, 77704, 83206, 71507, 62030, 62008, 55428, 56819, 64475, 70647, 65877, 50300, 52650, 52886, 64281, 84088, 83257, 85251, 59130, 50219, 57878, 65134, 68551, 65335, 63421, 65012, 73823, 62647, 57453, 59269, 65784, 51086, 41786, 43467, 41101, 49964, 60777, 68112, 60906, 38637, 30825, 35055, 47570, 52003, 57361, 58183, 61048, 64392, 56604, 53371, 47284, 39421, 32484, 42390, 55065, 42316, 36107, 37385, 47863, 50409, 41148, 28123, 16875, 8561, 19435, 29293, 17469, 540, 18308, 31829, 39642, 39708, 25854, 13036, 7713, 15752, 26626, 39117, 45683, 43227, 42799, 31017, 34068, 36069, 31713, 41507, 34426, 22544, 40135, 44042, 22591, 11357, 18071, 17964, 28354, 27306, 18774, 20725, 39463, 45620, 44102, 58174, 49470, 42362, 33410]
16469C3410j1786o697p48q54Q240L69M480J8634J576j9212n51K739l246J980J1815
16454D0149n419p677n980j2673P392L507O59J3879M910N150l668j4826j610j0209
16440A3584j1190R016R892k563k1787K347J3262M839j2796m219j393O781r737
16427c964l780J143J2520K5884R412n907j0690q398J1032R940k682j6374j0437
16414G699O722m30Q707l00m864j2855q82R850N918k087O05r403J2315O506j0160
16399A7341p77Q125j0345q286p35R787J8494J5542n180q084n680m744q906m242
16385A2310J5591O159n392P85j801q235J1753J0692j0267j8594N96P332K2566
16372D3495N441l65m556J92l270j2677N400n050l172n220J5044K784j2948p636
$$ y = [33410, 21624, 14927, 14179, 13325, 21565, 21934, 26414, 45048, 46624, 27412, 26861, 29600, 26354, 28334, 40149, 34730, 27053, 21073, 8400, 15792, 19299, 19958, 33837, 38747, 43897, 40229, 25403, 23793, 13584, 2394, 11410, 21302, 18739, -3048, -701, 12561, 17400, 4604, 385, -1008, 5773, -3964, -7744, -6601, 5919, 31803, 41215, 35308, 24618, 16220, 27252, 37192, 34510, 18136, 7699, 14421, 13991, 22698, 22398, 17534, 4679, 3797, 13647, 19565, 17478, 18083, 8680, 20995, 27501, 17341, 16564, 24689, 14344, 6058, 5323, 15110, 33604, 49146, 43966, 35882, 30202, 25458, 16552, 12310, 27901, 34060, 28668, 29453, 27652, 19417, 31170, 41862, 31595, 13001, 13597, 20929, 43495, 48936, 48571, 44015, 44207, 40937, 28260, 33660, 28610, 25438, 20218, 35262, 38046, 25098, 17462]
16358A7462n96K820J1689J0222j0871m635n316J0754n891j582J6045M367m047
16345D0421j1178J220P778m419m678p301j5664l213N698k651q5l221J5087J8115
16331C5909j1084o498j0551j6884R317J1542K242O149P660J3038N423P567K565
16318E6395K0860M099R741L3596O6319R5564Q1304O3130K9075K976n6080p6288
16306C30691o4813n6838n2657j2715J5473L930j6008j4552N996K5691L7732O8115
16294B70045M7295j687l7551K707O0295R6814J20239R5472R693j02544j33254
16283D27524j01938o8362j8030q266N562k2780l0623l1368j5715J9159K2990M9656
16271B27809L9521l5381o1911k8436j1144J5776M2619M9826R955l2355m6671m3538
$$ y = [17462, 16866, 19686, 31375, 41597, 30726, 26091, 20775, 31529, 25638, 24056, 40101, 44468, 40421, 29243, 30463, 38241, 33822, 29144, 21843, 6179, 2966, 8664, 6013, 5928, 2707, 17794, 35909, 24825, 18327, 7776, -9108, 209, 11751, 13993, 20142, 27802, 40840, 46263, 53830, 56395, 77255, 81354, 91095, 124691, 191010, 286574, 367878, 431008, 460083, 463059, 406979, 330691, 265878, 209040, 156383, 143668, 159141, 163071, 147063, 132511, 138507, 164198, 201930, 270045, 317340, 315653, 278102, 280809, 341104, 437918, 558157, 653629, 663322, 560778, 427524, 325586, 257224, 239194, 230928, 236490, 213710, 183087, 151719, 136004, 155163, 178153, 227809, 267330, 231949, 170038, 141602, 130458, 146234, 188853, 238679, 248634, 216279, 169608, 126070]
16259A26070k7654o278m40J3942o144k0879j3829j4895j1733q246p461l527m935
16246A3991n113J737J1368L608K63j000J6417l860k57J123o651j1622l587j654
16232A4763O5m586p483j2788J0914N823l890L467J6083Q964o064j9087p463j3414
16218a4696p326o785R676J6474J1101k499j9069O71J088J510P387O533j396K0283
16204B2952J1840m471R24r543j8858m349J4609R015l776j0425M132K116q009M954
16190A1111k608p886M155R679l069r552l40M700p448J23J0031Q185M188q259j6403
16175c393j1774L409j682R064N654J379j192P74j406M491P761M837p777j4919
16161d774j1773Q054N32l087K670J4860q599K238J1979K025j5847j704j959P536
$$ y = [126070, 98416, 92138, 91698, 105640, 99496, 78617, 64788, 49893, 38160, 29914, 22453, 18926, 13991, 8878, 10615, 21983, 25591, 25854, 24854, 41271, 37411, 37154, 38277, 31626, 20004, 16417, 14763, 14828, 10242, 2759, -10029, 885, 6708, 2818, 6285, 22368, 31332, 25268, 6181, -1282, -14696, -22022, -28807, -19131, -2657, 8444, 5945, -13124, -12453, -11365, -9855, -2468, 4065, 2669, 22952, 34792, 30321, 31245, 21702, 2844, -1505, 13104, 22119, 18343, 7918, 12050, 14166, 6157, 11111, 8503, 617, 4772, 14451, 11382, 1830, 1490, 6190, -1258, -1135, 8896, 17081, 21269, 13010, -3393, -15167, -11758, -13440, -4376, 1278, 2657, 1465, 2239, 833, 5324, 13085, 17922, 10145, -4774, -16547, -8493, -7961, -11048, -8378, 6482, -2117, 121, 12100, 14125, -1722, -3426, -5385, 2151]
16147B151J3513J4830j2340j0473J1379M904j7912q201K185R254K935r480q713
16134e968m149P906n625j074P802M458k820j3857J3195J2466q049j0750O248r57
16120a174j0976M39N786J0753J3940j9622k337J3138n965J1247j289R749n364
16107A8325n772m681j477j3599j8320k334M386P505Q123k306m89M70L919k978
16093i228L600N435J5037O823M490j266r028o740j7240p242L318N050J366P356
16079A731p815L130Q395J781j2270m893M724m131K018o628p879j643M507Q749
16065a0224J425L818N827L376J2213j0960k2951j1540R772R976O873L681J0671
16052A1957K269N078o867l444p346j0317M72j725k256N122J0487L76J3389o905
$$ y = [2151, 15664, 30494, 18154, 7681, 19060, 23964, 6052, -2149, 36, 9290, 12225, 2745, -5968, -10117, -2211, -7836, -8910, -1108, 3350, 530, -13327, -132, 12334, 4285, -6465, -217, -1174, -12150, -11711, -5925, 4828, 18768, -854, -3191, 9947, 3982, 15229, 13940, 23689, 18325, 12553, 7872, 6395, -7204, -25524, -27858, -23472, -15967, -7844, -10150, -10639, -10169, -6250, -9228, -5628, -193, 14844, 21667, 26157, 24891, 15863, 9123, -8117, -15359, -12041, -6991, -5625, 1731, -6084, -2954, 5441, 7222, -5048, -9941, -5217, -9348, -7330, -13958, -21837, -23480, -18973, -10224, -8799, -4981, 846, 4222, 16435, 5475, -17476, -29016, -19244, -9268, -2395, 1286, 11957, 14226, 19304, 12437, 8993, 1647, -8670, -8198, -9923, -12179, -7057, 3430, 3806, 17195, 10290]
16038A0290k332j189p401j3747O810j979p812R454J9067q426n222L428O486L410
16024A0837j581M665J403n29L27q33P24j040o10J493L157k071K673J4927l648
16009B9894j2463r293l331p126K764m440L46P033q296l112N19p014Q986P451O830
15994H748M987j591n560L230L032Q369j3656j1846N163J1439m10n181N069J0019
15980B1812j447o240K399j1481p828n889K457J6518j599j3198L920L646P921J2730
15966B3721K472j1621K488P330J2696p102m113m57q337o676p89k74j226l066L207
15951H253j0858j834K746j759m577N432O464P359J8538Q487K87j1889J41l764
15937B3026j2028q406J3534J0105O759j1700q559m262J1799R816j123p208j9474
$$ y = [10290, 7958, 6769, -632, -14379, -7569, -9548, -17360, -7906, 11161, 2735, -2487, 941, 7427, 10837, 9256, 13921, 15324, 14795, 15122, 14289, 15013, 13973, 13363, 14856, 18013, 15942, 18615, 33542, 29894, 17431, 8138, 4807, -2319, 445, -3995, -3649, 3384, -4912, -8024, -7505, -14519, -5533, 1918, 8748, 13735, 12144, 6584, 9814, 12846, 21215, 7559, -4287, 876, 12315, 11905, 6724, 11793, 21812, 20365, 14125, 16524, 5043, -2785, -8674, -6217, 10301, 8702, -4496, -576, 3070, 10991, 23721, 26193, 14572, 17060, 24390, 37086, 29984, 25871, 25414, 17077, 10401, 9612, 9338, 8112, 5046, 8253, -2605, -4439, -1693, -3452, -8029, -2597, 3867, 11226, 29764, 38251, 38538, 26649, 26790, 23026, 10998, 2592, 16126, 26231, 32990, 21290, 12731, 8469, 20268, 30084, 28961, 21753, 2279]
15924B279j0593J135O15J1460j844j052J2081P588M864p409n743J570l717K007
15910A3241J487K020j0238k1516Q19N333K26J8822m385j2761p40j476q31r303
15896a9302N26J7394J6122J2132K350j0473l735j1632o507k843j143L140l251
15883g222M295m08L000N422j004m28N497Q217q588K05L480n008j6010P281L76
15868h95N407j7277q188L104O458N8j659P023R812Q24M419L026k55J5934k854
15853B4937j7671k1833K992J734P647J3437Q57Q359M161m176Q823L035m423r772
15839A8107j0704L065q02j2304L513J7190l151o950o999p203M899k868P56J148
15825b303O233M183j547q205p129K122l729l459k495k722n033J5013J2124M171
$$ y = [2279, -8314, -7179, -6564, 4896, 3052, 2000, 14081, 21669, 26533, 19124, 13381, 14951, 11234, 13241, 14728, 16748, 6510, -15006, -14187, -8854, -8628, 10194, 5809, -6952, -7692, -9168, -9999, -19302, -18776, -1382, 14740, 26872, 29222, 18749, 15014, 3382, -3125, -5968, -7111, -3971, -7222, -2927, -3335, -335, 5087, 4083, 3655, 9152, 17369, 8781, 8986, 12466, 7458, -8552, -1271, -895, 4512, -12765, -20953, -17849, -11391, -11333, -12992, -5969, 3843, 4667, 9086, 12112, 11857, 27791, 24937, 7266, -14567, -11575, -9841, -2194, 11243, 12100, 20459, 24620, 20444, 29267, 32302, 27879, 18107, 7403, 10468, 9666, -2638, 875, 18065, 14914, 7964, 965, -6238, -1339, -4207, -3451, -2303, 3930, 8113, 6566, -1639, -8768, -6646, -10375, -13834, -16329, -19051, -24084, -9071, 3053, 7224]
15811G224p017l485o33P235N602Q480p689k2720P198K1882m41j3449K8796N686
15797C6669j5761m956R127o056q481j2799n868K924J8077k503l065j8964n775
15784a7431M500J0312L687M113P996P293L919l744K606l899q27k884O52R053j785
15769B3561k769j4996j6208L175J2253l665j331l411j833M948N819j2127j5980
15756b2564J09P073N818O56o65o343q861J220J3937J9995L412l510j0490J2238
15742A2025k225P091P073j972l916M830o768j6317j772O573N227J1157l916J956
15728A9046P147N912q011l097l702k42l118J0717j6431n951M96n498L41J4303
15714A1912K182o076m704J635k345n790m495P055J70j981J5063J6482l351j4476
$$ y = [7224, 207, -3278, -3911, 3324, 8926, 17406, 9717, -13003, -5805, 16077, 15636, 2187, 30983, 36669, 20908, 15952, 25079, 19023, 10542, -2257, -8125, -5201, 12876, 10373, 7308, -11656, -17431, -12931, -2619, 1068, 5181, 13177, 20470, 24389, 20645, 23251, 19352, 18525, 15641, 16293, 25346, 23561, 20792, 5796, -10412, -7237, 5016, 1351, 20, -3391, -5224, -276, 5543, -6584, -22564, -22455, -15382, -9564, -8908, -9573, -15916, -24777, -23557, -9620, 10375, 13787, 10277, -213, 12025, 9800, 16891, 23964, 21992, 18076, 22906, 16138, -179, -1951, 4622, 9849, 21006, 17090, 19046, 26193, 32105, 24094, 20997, 17295, 17053, 13935, 24652, 8221, 2270, 2766, -2732, -2391, 11912, 14094, 8018, 3314, 4949, 2604, -3186, -7681, -626, -456, -2437, 12626, 29108, 25757, 11281]
15700A1281l11J533j199O275q523j0281K3L936J4452J0951k0155L96K102M891
15686A5371j0125n12p495P346m616p185O610Q43l474Q857M607K459M441k350l951
15671A0826o295n820j1120J7746K1418P179J313l269j3405n246K963n111Q313
15658A9492l810j1800j6488N415R944K2691R176l0513j7152R369J6345q388j2806
15645h525k405m246Q543o944J501R360J6373O796L02l300j1062j535N260n836
15631D282q663M743L116M092O072j3440j9146o105J2664J1883j069K908n078q246
15617a1987K607J1533O802L943n853j0486l563J893k496M976P095r628K294R947
15603G077K161L459L123n296m69M19j0018j2900N872l878P868J6670P315m935
$$ y = [11281, 10970, 12503, 11304, 17579, 9056, -1225, -1202, 2734, 17186, 28137, 7982, 8378, 10480, 15371, 5246, 4734, -2761, 4585, -31, -7216, -606, 237, -3237, 5620, 10227, 12686, 17127, 14777, 10826, 4531, -1289, -12409, 5337, 26755, 33934, 35247, 31978, 18573, 13327, 16290, 11179, 19492, 15682, 3882, -12606, -7191, 2753, 25444, 34620, 4107, -13045, -3676, 12669, 4281, -8525, -10930, -15176, -6633, -13577, -12076, -2716, 13657, 20453, 20755, 17455, 6393, 4858, 10118, 4282, -4381, 362, 3478, 7570, 13642, 202, -18944, -25049, -12385, -502, -1571, 1337, -3741, -11987, -9380, 2153, 8955, 12898, 7045, -3441, -7004, -5111, -7607, -2631, 4464, -5164, -2870, 7077, 9238, 12697, 15820, 10524, 10055, 10474, 456, -12444, -6572, -10450, -2582, 14088, 21403, 16468]
15589A6468P07o911j1703l493j875P157P554j831j1326P75n724k8J2026J454J616
15574D866m473l321j0799l698J232P735O34K452M042J263J026j937j2176O633
15560f521O174O020o262K179p442J32k650l500K1469P056l7r404j2628l676j2356
15545b1446L091J3936J4432j55J634M291L506J891j7287J119N932q727J105k614
15531G08m828R003J0502p323j574l143o48J2136k612m976p317J0888J3742L63
15517B4921l686N2j3299q223M775J9347p26j0358k2777M92M37O485n540j270j0164
15502a9534P521J2452l57r17o517P881Q770j4721l001L688J1683L593J6211L431
15488C0183k903j1239j4782o835P681N651p585j324K590l758m603L05J1021J420
$$ y = [16468, 17175, 10264, -1439, -4932, -6807, 350, 7904, 6073, -5253, -4478, -10202, -10230, 1796, 3250, 4866, 393, -2928, -13727, -17425, -16193, -8458, -7824, -5372, -1330, -67, 959, -978, -13154, -6521, -347, 5673, -589, 1590, -5852, -5720, -8370, -11870, 9599, 16655, 16618, 7214, -5414, -9090, -21446, -18355, -4419, 10013, 9858, 11492, 15783, 19289, 21180, 3893, 5012, 10944, 2217, 3322, 708, -4120, 4883, 15385, 8062, 6488, 3345, 2697, 14833, 12221, 7245, -72, 10816, 24558, 24921, 21235, 21287, 7988, -235, 4540, 23887, 23161, 12803, -9974, -9482, -9045, -2560, -8100, -9370, -19534, -12013, 439, 82, -835, -7352, 529, 9299, -5422, -8423, -4735, 6948, 10541, 26752, 30183, 27280, 16041, 1259, -5576, 2105, 7756, 171, -1153, 1437, -2321, -6924, -6619, 4402, 5822]
15474E822j321M23j2867J3285N691J727k897p439j0885O040P460q121J1923Q083
15460A6924M432l5j4453R800m658K232q670O82J219L344r188q941P628K766j205
15445A877j1465k292P452R657M3m704J374k022l126J0134R707o644p827m094J629
15430c01J0112m055k687P903k879j6483P540P225M848L46m780m10J2532m846j2542
15415A523l967R811O9M19J621n080J963J444J6097R809o223j2798o081N734N490
15400A9831J728p95j642n992p144q817R524K341J4856P646j191j1147m219j2981
15386A998M768M880O056L515J7543Q108j2112r914r119r072L481O508Q246n139
15372A9747j0667P4j0606j0299J086j372J353R515J3410p986p152L635j541j682
$$ y = [5822, 4501, 4924, -7943, 5342, 11033, 12760, 9863, 2424, -8461, -2421, 5039, -3082, 8841, 16924, 21356, 21321, 6868, 16668, 12010, 14242, 5572, 6254, 7473, 10817, 1629, -7312, 316, 3082, 1877, -9588, -11880, -4428, 5229, 5272, 568, 1942, -80, -3206, 6928, 16635, 9991, 2164, -1930, -301, 9811, 5756, 3069, 10972, 8093, -8390, -850, 6375, 11223, 11569, 6789, 6379, 18911, 14065, 1523, -2444, 7367, 7436, 7855, 9476, 4396, 6359, 7803, 23900, 33709, 27486, 14688, 8607, 14341, 19831, 21559, 20764, 19122, 13130, 5986, -2831, 6693, 9034, 23890, 31536, 30345, 19198, 14979, 1998, 6766, 11646, 17702, 21217, 38760, 46868, 34756, 24842, 15723, 6651, 10132, 16640, 24886, 19747, 9080, 9154, -1452, -11751, -10665, -12037, -10684, -1169, 12241, 4255, -2897, 738, -803, -2485]
15358b485J4475p581k073J520n894q408J1421L754m351J2455l375L62P666o564
15344A0922l278L242j390p96j0252L81J2970j356j923J3261j1738k8108j786J2044
15330g807J4737n202r209k855M297R980J001K22k012M88N490j360J978l66J639
15315A1021J048j1375K559J447m079n26M963K5857M714q567k0703j1481k447R000
15301A431J1233j1170p56J3578J3435k026p912J545k427p574j5659N32j0501k051
15287a8322P185N988n266n968M748q093R26O399o596J026M309J3784l25J4331
15273A4126P869j925j3984j0199J496R02j534K92n994k847Q067m975Q33m675J208
15258a1340J4763m263M89L692j7122Q133J9539j3686o643R769L780R515M188n175
$$ y = [-2485, 11990, 4409, 2336, 3856, -2038, -10446, 975, 4729, 378, 12833, 9458, 9820, 17486, 10922, 7644, 10886, 9496, 8700, -1552, -1171, 11799, 10443, 8520, 21781, 10043, -18065, -19851, -7807, 6930, 1728, -7481, -10336, -6039, 3941, 4942, 5164, 3152, 3640, 9130, 7770, 9748, 9382, 11021, 12069, 694, 3253, 4700, 621, 95, 5058, 30915, 35629, 27062, 6359, -5122, -7569, 1431, 12664, 1494, 738, 14316, 27751, 25725, 17813, 19358, 16931, 9357, -6302, -5770, -16271, -18322, -11137, -5149, -10415, -16383, -11635, -19728, -18802, -12403, -18999, -17973, -13664, 120, -205, 14126, 21995, 20070, 6086, -4113, -2617, -1715, -3249, -2957, -8951, -11798, -3731, -8706, -7873, -12548, -11340, 3423, -840, -351, 3341, -13781, -5648, 13891, 205, -6438, 3331, 7111, 16626, 20814, 15639]
15244A5639j0790n825J572Q565n857L241R111k69J768K1662M656p077j6073r467
15230A0856K075m619r460R136O497M767P035R421j4606j0794q475K620J2034j6964
15216d77j8648P379N084o97L735q339J311J5578N215n718J0324j5504l964O538
15202A817K23L235J2819J5542K865k0897p119o994O607M668l171P559J5238m951
15188B7441k2259j1756q33J214K1252L578r433N94Q222J456m00j5422J206L856
15174H716j2317o028J3418n900j0565L55P087n38q752j278K185P499L250P946
15160E078j696M218j0474m791J1784O221n494j3479m715J1405J4469m302q34O351
15146A3741r089Q184p059j596l697O84J1546Q629k454j1117j0372J2775N988j2943
$$ y = [15639, 4849, -976, 596, 9161, 3304, 6545, 15656, 15387, 17155, 38817, 43473, 36396, 20323, 10856, 12931, 8312, -1148, 7988, 14485, 19252, 26287, 35708, 21102, 10308, 1833, 4453, 16487, -477, -19125, -11746, -6662, -7359, -3624, -11963, -10652, 4926, 10141, 4423, 14747, -757, -4721, 1817, 2040, 5275, 18094, 33636, 36501, 15604, 8485, 1491, 8098, 12766, 9595, 17154, 32392, 27441, 5182, -6574, -7407, -6193, 15059, 18637, 9204, 9798, 18020, 19476, 19076, 3654, 4860, 8716, -3601, -9629, 3789, -2111, -12676, -12321, -5234, -5772, -14524, -15802, -13617, -6118, -2868, 5078, 3382, 7600, -2874, -7665, 4119, 10340, 4846, -8633, -13348, -1943, 12526, 8224, 7390, 13741, 4652, 12836, 5777, 4181, 484, 1168, 12714, 21343, 18889, 7772, -2600, 10175, 16163, 3220]
15132C220j8570m819J3034l608k755J7367M043q52o907Q136K040m871j2938j016
15118h496j0559O571J4440J5864m450O23k039l085N760P819j1313p760m833K788
15104A330J1240J0835M727k492n421q126M553p723m359n201j6067o683J2619O757
15090d011L942M786n299n578J2398O381j6403P716M886m912J1823O038l17p199
15076A4251q905m365O381J0192L309p887p229O129O915p362j6212j1760j1236
15063b7779P951K5179J3509p979n391r817R25o574P355K805k267n918Q046J6011
15049A6056o355Q39K2517J1775j9707j2621r172L840J615j3438J200J0648O36
15036G833P834r496j0334K751j667n275p700N334J0187O205R202p675r026J0068
$$ y = [3220, -15350, -20169, -7135, -10743, -13498, 3869, 7912, 7060, 153, 8289, 10329, 5458, -7480, -8496, -19055, -12484, 1956, 17820, 13370, 13993, 11954, 8869, 14629, 22448, 11135, 3375, -1458, 1330, 12570, 23405, 28132, 25640, 20219, 12093, 16646, 8923, 4564, -637, -16704, -23387, -10768, -4011, -69, 4717, -582, -6160, 6238, 12619, -3784, 3932, 8818, 3906, 15729, 21767, 21450, 14251, 5346, 981, 7362, 17554, 20863, 12976, 5747, 11876, 18791, 11429, -4783, -16543, -27779, -19828, 5351, 18860, 10881, 5490, -4327, -3402, -9976, -2621, 184, -2083, -8001, 45, 16056, 9701, 10540, 33057, 44832, 25125, 12504, 3332, 7172, 8787, -4651, -3451, 7197, 7833, 15667, 6171, -4163, -1412, -3079, -8354, -16054, -10720, -533, 5672, 14874, 7199, -1827, 8241]
15022H241L738N296Q407k553o448q532p570m568j695n786J2393P596K069K95m953
15007E930J1324O046j458j550q33o498j1131j1450L342m16M397J0647m517n838
14993b005M469Q609j7308m483R307O099J0578j5240j5281j2713O803P729N809
14980g627q698J1463L977L735P507j2689M256J2121j377J2345p323j567J3956
14967C0079j3058j9668R46L11M867N108K653j69J397p537J659k15o783p591K19
14952g782l120n006J9304J1262n036r746M917N112N804K510R19K58k0430p016
14938h050J34N361o83Q648j603j02K807k300J762N318k672l466M246l498P258
14923A3160O299l971Q57n951l391r550l205j491q050N930l727N134O617k464o575
$$ y = [8241, 11979, 17275, 25682, 23129, 16681, 8149, 579, -3989, -5684, -11470, 923, 8519, 10588, 10883, 5930, 17254, 23300, 21842, 20292, 19459, 12961, 1830, -9620, -6278, -6694, -2297, 8350, 3833, -2005, 2464, 11073, -6235, -10718, -1411, 4688, 15266, 26, -15255, -27968, -21165, -13436, -7627, -16325, -4862, -885, 2850, 10357, -2332, 1924, 14045, 12668, 25013, 17690, 16123, 30079, 17021, -2647, -1701, -1390, 3477, 8585, 11238, 11069, 12466, 4929, 6588, 6373, -410, -8001, -7782, -10902, -15908, 3396, 14658, 9622, -124, 4793, 9905, 15709, 18219, 19138, 19396, -1034, -8050, -7916, -2555, -3238, 5410, 3807, 3705, 6512, 4212, 5974, 11292, 8620, 5154, 9400, 5902, 13160, 19459, 15488, 16345, 10394, 7003, -2547, -5752, -7243, -15293, -9363, -13090, -7956, -1339, -3803, -10378]
14908a0378k299o084K633L595o921M158J2634P318q031Q34K902J1412l43r482
14894A948j6365j496L324Q953R675n886j3009J237j032N888J0677Q799j0670r972
14880g929j041L631p737M124Q259k568J0402Q974j709o176p063P764P273o691
14866I513o518q205J2387k171k437n050K0006J4034j5864p041r264m528n546L473
14852g211j353l220K533P982l444n88K039J0928J0795q850o151q809n630r063
14838b0042P674P39q162J3501J4572K636j8883j7551q466J5800P386M732N054
14825a010J269p418J465k897k243J2192J0081j1357j283J258N457j038J714j0450
14811d260p579J5434J429j079j732j26m866m532M893M757L700l393K572K912N748
$$ y = [-10378, -12677, -18761, -16128, -12533, -19454, -15296, -2662, 4656, -3375, -2541, 361, 11773, 11430, 1948, -14417, -15913, -12589, -3636, 6039, 153, -12856, -11619, -12651, -6763, 3914, 12713, 2043, -7929, -8970, -5339, -13076, -8952, -693, -3261, 7141, 16115, 14406, 8230, 1167, 8931, 16204, 9513, 2995, -5210, 7177, 5006, 2569, -2481, 17525, 31559, 15695, 8654, -610, -5138, -10684, -7211, -8564, -11784, -9251, -1269, -4713, -5301, -3262, 7666, 18461, 9611, 3460, -5349, -10979, -20042, -12368, -11629, -19791, -6290, 8282, 10918, -7965, -25516, -33982, -18182, -10796, -6064, -1010, 259, -7159, -5694, -8591, -10834, 1358, 11439, 82, -1201, 57, 5514, 4476, 6190, -4260, -11839, 3595, 5024, 3945, 2213, 2087, -2779, -7311, -2418, 2339, 6039, 2646, 5218, 8130, 13878]
14796A3878m753o633J0998L311j2513m842k714m757Q001R869q170p808n68N419
14782a282R379M944P599k414n379o037n478k61L286J4218j2953j0246N471J1896
14768A2743M950j6870p159K977o6J531m405m035r44J565M148j1439R968P370P472
14753G806j099K983R561j5107r342o82k828Q002r299p731l997K0114J482j0250
14739a0387R687M490j7075l243o46J0080R495k495R11P260q082k1725Q018K947
14725a0765k812j366k237J0537K840P43k486O184N091R029Q462N485j4229j1955
14711B521P2j2646m910K3160J7665p995j4956Q253J3693l585k0684j4582k488
14698a6482J6347N731L357j0809K090Q632n728j283j4963K868J3081K706N951
$$ y = [13878, 9125, 2492, 13490, 16801, 4288, -554, -3268, -8025, -24, 9845, 1675, -6133, -6701, -1282, 8097, 13041, 20640, 18226, 12847, 6810, 1332, 1071, 4357, 18575, 5622, -4624, 847, 12743, 17693, 823, -6336, -3359, -3425, -1894, -6299, -10334, -11278, -9713, -5565, -17004, -7036, 334, 7806, 6707, 9690, 19251, 4144, -5198, -5880, -8708, -706, -10005, -17736, -21733, -1619, -137, -10387, -700, 3790, -13285, -16528, -17174, -7094, 2401, -94, 817, 8077, -5, -21730, -13712, -10765, -13577, -14943, -17180, -6643, -3803, -3060, -5546, 638, 5729, 14758, 23220, 28705, 14476, 2521, 2593, -10053, -14963, 8197, 25862, 17867, 2911, 11164, 24857, 21272, 588, -13994, -16482, -135, 5596, 8953, -1856, 234, 8866, 3138, 1855, -13108, -10240, 2841, 5547, 11498]
14685A1498O33k984P121k949j2069J006J3014L628k3113m34P436L976K719n17
14671H965Q3J130N505K620j235j7995P111j586n813K786L138K748R754M683j04
14656B1790M4k665M411j084n811P984j934m625j199q128k718j1615O044M258q645
14641c893J340R866J1780P328N53j1687j8774r511j482J3952R220J258o981R42
14627C911N495O963K880n78l917o118m156M348m429O781j2061j0369p774k599
14613b1623M978P24L66n94o677J0387N600M641p787M33J3266R081k841N897l536
14598A2315J0824m291K160J815k3958j113J8984R008N871j1472n580R10p587M878
14584A2764p136L872K140n148j213j1258K674l054K308O306l915j004k657P258
$$ y = [11498, 12131, 9147, 16268, 13319, 1250, 2256, 15270, 18898, -4215, -4649, 2787, 6763, 9482, 8965, 9048, 10178, 15683, 18303, 17068, -927, 6184, 4598, -1215, 1571, 4709, 7457, 17211, 21894, 21790, 21834, 19169, 23580, 22496, 16685, 24669, 22735, 18110, 16911, 8783, 6065, -5550, 494, 4752, -3893, -2553, 7313, 19093, 26421, 26974, 15287, -3487, -12998, -14480, -528, 8692, 9950, 2969, 3911, 9406, 16369, 19249, 18671, 14754, 8636, 4480, 8828, 4399, 11180, -881, -11250, -19024, -21623, -16645, -15921, -15555, -16149, -22826, -12439, -6839, -2198, -9985, -9552, 3714, 12795, 9954, 15851, 12315, 23139, 18848, 21008, 22823, -1135, -2248, 16736, 25744, 31615, 20143, 14563, 15473, 7886, 12764, 5628, 9500, 11640, 6492, 5279, -5979, -3305, -6359, -4051, 2255, -1660, -2664, -5321, 1937]
14570A937p77Q47N380J3603k172r594j7119q706M418J1913L550L596j4021j308
14556h453j360j3410J1048K3861J4602L205j544j4911j7387J4265J4486o357N37
14543A8582j4096j0271L303J966j1819q060L743J1606k515j0994K505J3781k56
14530b525j1483R018J4907K922n250J2183L03j4810m789j0753M489K512j668K037
14516b907R286j9207j1070Q859l267j4176J5452P458n847P972R547r493p245n644
14502b0282P566P772j4251j6370J8275K2063J3808J6670j3453O884N101l622j0221
14489A9940k2787K707l727O349K267M667j988L038J0999o674j0155p25J852R329
14475A5092J6058J3283p955N248k1659k854N814p555O345k358n48k0272j4445
$$ y = [1937, 1160, 2007, 7387, 20990, 18818, 9224, -7895, -16601, -12183, -270, 3280, 6876, -7145, -8453, -9813, -23223, -12175, 11686, 26288, 29493, 27949, 13038, -4349, 9916, 24402, 18045, 18582, 4486, -5785, -2482, -516, -12335, -20395, -16652, -5046, -7561, -18555, -16050, -2269, -2525, -14008, -4990, 9917, 12839, 7589, 19772, 20075, 5265, 476, -10277, -5788, -3276, -4944, -2907, 6379, -12828, -23898, -15039, -18306, -32482, -17030, -9572, -15419, -7447, 2100, -7393, -14638, -20282, -12716, -4944, -19195, -35565, -17290, 4773, 18581, 35251, 21798, 28682, 33783, 30161, 19940, -2847, -140, -3867, 2482, 4749, 9416, 7428, 10466, 21465, 14791, 4636, 3911, 5763, 15092, 31150, 44433, 36478, 41726, 20067, 17213, 23027, 15472, 21817, 19459, 18911, -1361, -15806]
14462a5806l487R132J5817l268R03L234L99o474P44Q440m741m006L900k303m571
14447b087R499o376Q545j0139r422m737q633P523J2481M202o320L849Q002n346
14433A041K097N356j5253P814q36n455J0895P629j1458j6552p59J3393j846p684
14419a1618l816J1127J5397l506J88n949m216q082j3125J0208J2770j106j106
14406b834q207k683L426L481l361J2763m12q702j2742K589J3800J0297O989n728
14392H676j8005M328J4340j495q676k614P724q705J7806N299J426L20K133o782
14378A5775j4274j25K24O7m939m308m678J756J630J861J3679J4119n797J703M67
14363A7160J704r817n216K956L094N896j2792j5574N434L418P6M769J5339l380
$$ y = [-15806, -19293, -10161, 5656, 2388, 3291, 6525, 6924, 450, 1194, 9634, 4893, 887, 4787, 2484, -2087, 7412, 1036, 9581, -558, -9980, -14717, -23350, -15827, -3346, 856, -5464, -1615, 6387, 1041, 3138, 8494, -6759, 1055, 219, -5236, 5659, 13288, 1830, -14722, -15481, -2088, -3934, -11618, -15434, -4307, 11090, 7584, 7772, 1823, -2393, -10475, -23600, -13392, -622, -1728, -2834, -11041, -13724, -10298, -6817, -10178, 2585, 2173, -6529, -19271, -16682, -2882, 7415, 14404, 8676, -9329, -5001, 9339, 7844, -832, -3446, 4278, -4427, 13379, 18678, 20104, 20424, 22557, 15775, 1501, 1376, 1600, 1667, -3272, -7580, -12258, -10502, -8872, -7011, 6668, 20787, 14990, 16693, 17160, 18864, 9047, 3831, 6787, 9881, 15777, 2985, -12589, -7155, -3737, -3661, 1108, 16447, 13067]
14349A3067P830J196j3548j2050m939J050J905k411P255J2882J0140o867p398
14336H112j3454l614j638N305J6055J6806L765p335j4003j7236q687J2282m109
14323g751J283K0258r44k4287n393k049l630Q166M586o749J118R405J1369K264
14309G646m300m22M526l138Q78R403r647l824r97J047O366o952M883J5622O31
14294B1722m559p897j404j5786j0283J2813O888N591l187p331q940q220r560R011
14280b1142J0584J825J7339J2149K1460L189k5337m320P102n71p494j0505R93
14267E272j2829J3920J0801n33L884L877o636J521P36L140j2314j1627l144o315
14253a0247J3936Q138q872q844R87r33n165j559Q116Q214L144k285r547j277J1164
$$ y = [13067, 20897, 22093, 8545, -3505, -8444, -7394, -5489, -7900, -645, 12237, 22377, 15510, 8112, -5342, -8956, -10594, -5289, 10766, 27572, 31337, 24002, 9999, -7237, -15924, -3642, -7751, -6468, 13790, 12846, -11441, -16834, -18883, -22513, -14347, -9761, -16510, -15392, -5987, 5382, 7646, 3346, 2924, 7450, 4312, 5190, 14593, 4946, 1122, 125, 1172, 7538, 586, 5469, 21091, 21722, 17163, 9266, 7862, -7924, -18207, -5394, 1494, 7085, 3898, -3433, -12373, -20593, -30153, -21142, -10558, -8733, 8606, 20755, 42215, 45404, 20067, 15747, 22849, 22278, 14784, 4279, 5272, -7557, 6363, 17164, 16631, 20515, 24392, 17756, 19277, 20013, 23153, 10839, -788, -3932, -10247, 3689, 11827, 2955, -5889, -4902, -5835, -11000, -12559, -4443, 3771, 6915, 4630, -4917, -6194, 4970]
14238D970K872K195j0156J615N735M829J2928M674j5530k3749O654N295J167P935
14224A1434Jj878p059j051Q729j4125k815Q078Q398r822l294j0690J566J9389
14210F861N129M073j046n201j5628m261l545l567R554J5503m109N679J626p212
14196C856N973r131J4J0285Q036k924J371r447k0267N112M048M307K178K511j3180
14181g258j840Q075N573j3118l679J3496J1122r89p625j2249N477j360J7133K079
14167A4837j4300l886O605Q881L586n624k613P45R60M071Q524j686j7869k16j120
14152H95O750N231j338n510q074Q784P373L320l658j6627j3209J654K887k1023
14138c2545L571J6675o102K0772M231L128j843j3309M3j1413L439p914J029P387
$$ y = [4970, 7842, 10037, -119, 1496, 7231, 12060, 24988, 29662, 14132, -9617, -2963, 2332, 3499, 11434, 11435, 9557, 2498, 1447, 10176, -3949, -6764, 1314, 9712, -110, -3404, -14094, -12528, 6861, 11990, 16063, 15017, 9816, -5812, -10073, -13618, -17185, -7631, 7872, 3763, 9442, 11068, 3856, 9829, 698, 712, 10997, 19033, 16109, 17480, 8033, -12234, -7122, -3074, 1233, 3411, 5922, -7258, -9098, -1023, 4550, -8568, -12247, 1249, 12371, 11382, 3757, -8492, -3015, -4375, 12758, 14837, 537, -3349, 3256, 12137, 15723, 10099, 7486, 8231, 9191, 13262, 21786, 20100, 2231, 2015, 895, 7645, 12876, 11538, 6028, -2046, 6738, 14111, 17431, 13773, -2854, -16063, -14409, -11522, -32545, -28974, -12299, -18401, 2371, 6602, 9730, 7887, -5422, -5379, -16792, -13353, -21267, -20238, -12851]
14124a2851J7801Q370N713m555n252j116p86O678k699K426J181o002N684J627
14110A6219J405o034o269J869l901n492l525J6131K130N28j4711O768O824o038
14096E904r775M520M253O726N900l230j3662j0120r39L01M34p807j877J2477M826
14081b069q363R187j6138m930P841m618k96R178k578j1447k316R212N046L757
14067h534j83J210L033r724r710R810J0018J1227N065J6562K479j2650o082l849
14053H672J344p667J425M518q98j1059J206J0286N285K967j428j0636j755l179
14039i19j2130J830l632L80M947J8969N360k898l381m037j44j6388j2733J4212
14025a0564j009P52j722O155Q642p066O148J0052r347o252k018q087M48l045k764
$$ y = [-12851, 4950, 13320, 19033, 14478, 9226, 8110, 7324, 14002, 11303, 13729, 14910, 8908, 14592, 16219, 17624, 11590, 5321, 7190, 3289, -2203, -5728, 10403, 12533, 13061, -1650, 5118, 11942, 5904, -3871, 649, 4902, 11628, 17528, 14298, 636, -9484, -10423, -10122, -9688, -17495, -19372, -6895, -2069, -10432, -1245, -17383, -22313, -14472, -19090, -19386, -10208, -12786, -24233, -26549, -17337, -12291, -8534, -8717, -7507, -4474, -14198, -23908, -14098, -4080, 7147, 12212, 28774, 31253, 18603, 12521, 8672, 10016, 2349, 3774, 8292, 7394, -3665, -2459, 7827, 13112, 16079, 14651, 4015, 2260, -919, -13049, -11219, -14851, -14471, -9524, 9445, 14805, 11907, 8526, 4489, 4345, -12043, -24776, -10564, -11573, -10821, -12543, -6388, 2254, -4812, 1336, 11388, 2041, -4211, -6229, -14316, -13868, -16913, -19677]
14010a9677J3462J2051O516P636K374j1159q546j266Q805N220j1L323k0468n998
13996g738J290p937L630K155k2323m51K1847J2126m600j4976m036n431P247R670
13982i527P290N805L852k810M765m933O650R305k2231l797L101L744Q922J1506
13968B1642P589M125j6170r033l796J683M82q38l873L409P53q765o438o925J4491
13953a664J0257K204j2652m856n202N247J6719M599K136L53r657k400L288Q084
13939A6456J5694n953j3584K5p392l835J6133j941r832M670k660p99k685P797
13925A2094j338N697O15k360M223P813l143m839j6207M396k522o626O490J0476
13911A4769k076j4759j5122k982J1744R508j228k504j2877Q599J9020l258j1977
$$ y = [-19677, -6215, 5836, 12352, 19988, 22362, 11203, 2657, 1391, 10196, 15416, 15405, 18728, -1740, -7738, -6448, -14385, -10755, -8600, -30923, -31374, -9527, 2599, -2001, -16977, -21013, -26444, -19197, -9527, -2237, 3568, 7420, 4610, 9375, 4442, 11092, 20397, -1834, -5631, -2530, 1214, 10136, 21642, 29231, 33356, 17186, 8153, 4357, 6040, 6522, 5684, 1811, 5220, 5973, -2792, -9230, -16155, -1664, 8593, 10797, -1855, -6711, -11913, -6666, 10053, 14652, 16788, 17141, 7484, 5084, 8372, 16456, 32150, 26197, 12613, 12638, 5246, 1411, 17544, 15603, 5771, 10441, 7781, 6982, 4297, 12094, 10756, 16453, 17068, 14708, 18931, 26744, 23601, 18762, 2555, 6951, 4429, -2197, 4293, 14769, 12693, -2066, -17188, -20170, -8426, 1082, -146, -2650, -15527, -6928, 12092, 8834, -3143]
13898c143M770R978M138j2331K120j065r117k653L67O068J0378O416N906r357
13884A2475k174M598m37M528k532k88j1059k034L685l112j7348l702J1299J0497
13870D396n736o9J5791k848J454K967N004l916j3153j0758q500K032O916R852
13856C432m364j57p760M07L226m359n384N296L258O694J0592J2882k935j0538
13842A0290j5564q174J3930L983L815n283m655j1440q433O623L387P086P837r086
13828e684m510o257l53K4081J0149l357j472K0109k078j4482j6776o167j0299
13815a7096P515Q980M289q452k763l298N300K0337m73j102n306M881J3491k200
13801B4103j9200j1300N938P318o184M187k544J7249M404j3482j1735m442J2376
$$ y = [-3143, 1627, 11605, 15743, 3412, 5532, 4467, -4650, -7303, -6936, -868, 9510, 15926, 21832, 12475, 10301, 14899, 14462, 18990, 16458, 16170, 5111, 3077, 6762, 3650, -13698, -17400, -6101, 4396, -1340, -1409, 14382, 11534, 12988, 15955, 20959, 17043, 3890, -6868, -15368, -13336, -6420, 3432, -932, -1089, -8849, -8442, -5216, -9575, -14959, -9663, -6405, 289, 10881, 23763, 20828, 10290, -5274, -13448, 482, 4465, 8280, 2997, -1658, -13098, -21531, -14908, -11521, -4435, 3402, -5684, -10194, -16451, -16804, 7277, 17426, 14069, 12597, 32706, 30628, 16146, -630, -6797, -17096, -9581, -601, 3688, -4764, -7527, -10825, -5525, 14812, 14339, 13237, 7931, 12812, 26303, 24103, 4903, -6397, -459, 6859, 675, 4862, 2318, 19567, 23971, 10489, -1246, -5688, 6688]
13788F688o688j6592j032J4974K1160k3990j1568j0047l89J4116J0329j074O813
13775B700N790p16m066R495J1793p175j4050R271J2705j2579j9560L743n04j205
13761d358N080O521j1020j4750J836J908j739O611Q479m705m054m07n007J977
13747a3628j190p758m12J815l013K5993J2507n071o779j629K229J89J98l012J341
13732A780o456j1631J092j0229M586m005m409N671J1795O835K968J7659l238n803
13718F615O15L126R109N755j1348j6104J1099o062j2668p258J6752J6883j0909
13705E605j891P10p318j4142m454Q870q908n93J8990L652n522n397P931j5986
13691a8453P229L555M571J273j124O754k3J966o643j0032O111K511J0754q635
$$ y = [6688, 0, -16592, -17624, -2650, 18510, -5480, -17048, -27095, -27484, -13368, -3039, -4113, 2700, 8490, 7774, 3708, 13203, 24996, 17821, 3771, 13042, 25747, 13168, -6392, -2649, -3153, -4358, 722, 7243, -3777, -18527, -16691, -14783, -16522, -9911, -1432, -6137, -10191, -10598, -15605, -13628, -14818, -22576, -22988, -21173, -24186, 1807, 14314, 9243, 2464, 835, 3064, 3253, 3451, 439, 1780, -4676, -16307, -15215, -25444, -20858, -24863, -29272, -23601, -11806, -4971, -2003, 15656, 12418, 6615, 7230, 10356, 19465, 25220, 13872, -2232, 8867, 2805, -9863, -17121, -369, 16514, 5605, 3714, 4424, -2894, -17036, -21490, -12620, -21528, -22121, -3131, 521, -5001, -10398, -2467, -18453, -11224, -7669, -3098, -1825, -2949, 3805, 3782, 5748, -895, -10927, -4816, -2305, 8449, -186]
13677a86j0485p329p025M58j392j429K0021K0157R74k923J775m192K290q813M06
13662B307j5608k429o067P216j904P777q960j731J0032J6495j036l044m624n673
13648g249J1164n642j0308N045M090L868k091o115l097p981k175j822J0622J4253
13634B562P7q732O777L442L488p290m769j126P828M797O024J2664l954m225K535
13619B0098j0816j8840o092O384J3630j6625m681L096K0055K1201K805m697q681
13606A6837j0596j591K962k984j0919L788j0435q269k005J356J4738L450k855
13593f523Q63l808Q675R734L468p694j9239R452k446N955J356p941j1936k112
13579b2196J7559J4742O9L900Q402p087l599j101j2128q298P00K0140J3388R943
$$ y = [-186, -10671, -18000, -25025, -24567, -25959, -27388, -7367, 12790, 13764, 10841, 12616, 8424, 10714, 1901, 2307, -13301, -15730, -21797, -14581, -16485, -8708, -17668, -19399, -9367, 7128, 6092, 3048, -1576, -7249, 3915, -1727, -12035, -6990, -2900, 968, -1123, -7238, -10335, -18316, -20491, -22313, -11691, 2562, 2639, -6093, 684, 4126, 7614, 324, -4445, -5571, 2257, 7054, 13078, 25742, 21788, 17563, 20098, 9282, -9558, -15650, -9266, 4364, -12261, -16942, -13846, 6209, 27410, 30215, 25518, 16837, 6241, 4650, 7612, 4628, -6291, -2503, -12938, -21207, -23212, -21856, -7118, -3668, -6523, -5660, -9468, -793, 8941, 12409, 4715, -14524, -5072, -7518, -1563, -207, -8148, -20084, -22196, -4637, 10105, 10174, 14074, 22476, 15389, 11790, 10689, -1439, -9737, -9037, 11103, 24491, 34434]
13565C4434L275M273j2613j1211o391m587O15Q49k192r747K383m178j2074j588
13551a8752J6532J9124j5689j3118J34Q100j0467n965J2798J3645k3410j0096
13539b7164j6178M218J981J2162K474j884J6855Q843q617M609N258o373m348k479
13525a0643J5452P054k574K136M396j411q596J774M400Q679J1474p771j2709j0530
13511A131Q194L930K687r382k317J3536K101k1055j4002J1135l27k936q03o751
13497a4859N413J8885M193n471p440p001L98o356N950L309J571O935J0659L745
13483A9931P238N008n770m465r094l418j0959m719j428J927j434j136J0019P688
13469I388j2318k218k40J2300j747Q401J98m950n852q340n65P968K822m138k9197
$$ y = [34434, 37709, 41982, 29369, 18158, 11767, 7180, 7795, 8644, 6452, -3295, -912, -5090, -17164, -18752, -2220, 16904, 1215, -11903, -11769, -3669, -14136, -20101, -7303, 6342, -17068, -27164, -43342, -39124, -37143, -24981, -22507, -24391, -7536, 1307, -7310, -2701, 2557, -3816, -8164, -10643, 4809, 11863, 9289, 11425, 15821, 14410, 5814, 7588, 11988, 20667, 32141, 24370, 11661, 1131, 9325, 13255, 15942, 6560, 4243, 17779, 19880, -1175, -15177, -4042, -4369, -7305, -8108, -14859, -9446, 9439, 13632, 8161, 721, -6280, -5882, -12238, -6288, -2979, -1408, 5527, 16186, 19931, 27169, 32177, 26407, 21942, 12848, 9430, -1529, -6248, -7676, -5749, -7183, -8319, 1700, 9388, -2930, -5148, -5388, 6912, 5165, 13566, 13764, 8814, 2962, -5378, -5943, 2025, 4847, 709, -28488]
13454b8488j488K1991K949J5619Q949N821Q083l959j0690r5o404n257k226p7j4102
13439i374K068P050j955L18M474N358j388j3634J505j425J3729K00k002N023p19
13424I228j0328o594j873n24J874p315k220k226N988N851O401r792l668P490j548
13409i256j4366M444O199N564O241O93l19j229R577n394o344k782K146o671L407
13394h090J3164N0j3402K624J4245r016o190R739J2011j4585p889q11l38J4700
13380F212J1183M87j0237l13q631l83Q51N67p69L415J967k373j8796m088J6046
13365d862J1800J1484j1964M124Q600J880j690j3275l341p343j1918j995K872
13352a5628J663M037k745J8839K676p459J620P880L091K989k149j3163p325J921
$$ y = [-28488, -29976, -7985, -5036, 10583, 19532, 25353, 33436, 29477, 18787, 18692, 12288, 7031, 4805, 4728, -9374, -7306, -256, -2211, -1893, 2581, 7939, 6551, -7083, -5578, -7003, 6726, 6926, 4924, 9947, 9228, -1100, -7694, -9567, -10091, -8217, -15532, -17752, -19978, -13990, -8139, -1738, -11530, -15198, -7708, -9256, -23622, -19178, -12979, -7415, -1174, -481, -800, -2029, 7548, 2154, -4190, -6972, -4826, -11497, -8090, 5074, 5124, -8278, -5654, 8591, -425, -6615, 3124, 15135, 550, -7339, -8150, -8488, 6212, 17395, 17882, 7645, 7332, -1299, -1682, -831, -264, -1033, 2382, 4349, 1976, -16820, -20908, -4862, 6938, 18422, 6458, 10582, 19182, 21062, 19372, 6097, 2756, -4587, -16505, -18500, -15628, -13965, -9928, -12673, 6166, 8842, 1383, 3003, 10883, 13974, 16963, 14814, 1651, -5674, -3753]
13338c753R272N118J002j136j4562q654l621L592r20K370K533K389j0912l658
13324b0940J7627j944q806l063N417m354Q794J8927R145r757j5131k915n924j3453
13310b6377M127J2927O308l774K438N473l910o769N942K1524k729j1060j1339
13297g219R209j382p069Q013J2745j7817p459M499R782M754k484j371L80q092
13283c511n91N504M458q791m474R315r892M342J3064P559r134O9j959j662Q733
13268A3030k844j0398j3385o890J359P597n544j1491P139J0808J80Q768l136j2590
13254a7397N079N641K438k969o42J026p714j9010k078J2291J1862p039M964J3250
13240b98J3084k99j0349j5522M292R024Q358k011n979m155J1049m529j7520M116
$$ y = [-3753, 5519, 10637, 11639, 10503, -4059, -12713, -16334, -12742, -13662, -11292, -8759, -6370, -17282, -20940, -3313, -5257, -14063, -17126, -11709, -16063, -7269, 11658, 20803, 11046, -4085, -7000, -12924, -26377, -22250, -9323, -3015, -6789, -4351, 1122, -2788, -9557, -3615, 17909, 15180, 4120, -7219, 1990, 608, -6461, 1552, 14297, -3520, -10979, -6480, 3302, 8056, 5572, 4201, 4581, -3511, -4102, 1402, 5860, -2931, -7405, 1910, -7982, -3640, 9424, 16983, 7849, 7918, 5959, 4297, 13030, 10186, -212, -13597, -20487, -19128, -11531, -17075, -28566, -21427, -10619, -10439, -1671, -4807, -17397, -12318, -6677, -4239, -7208, -7850, -6824, -14538, -33548, -35626, -23335, -11473, -18512, -13548, -298, 12786, 12487, 2138, -13384, -9092, -68, 8290, 6279, 300, -3855, 7194, 2665, -14855, -10739]
13226a0739J2008O594o242K118l031m523m013Q573K313r505n671l108J1721J0820
13212G315j4624n517L185N933J2043q696j0373n752L945J9923l235Q149l467p078
13198A751L703O015O706j5432j7570M34N163n505P989M437J653O461j1161r198
13184a4554O259O082J300N580J5897L220r370j1200m27K841l203j1745j1298P972
13170a2646J7071J345j8992n273J2155J1550l006j823j3053j1300L018Q320Q347
13157d287N740M905l772q758J012k577n989k708J0828n930j6241Q485J1167O174
13143a951o26M81M569p410J368j2132l678R098J0402M863J717n501j2682l153
13129a4635J6956M272m244mL87J861M81j9641K48Q768K883n308j621Q535j874
$$ y = [-10739, 1269, 7863, 1621, 3739, 708, -3815, -7828, 745, 3058, -6447, -12118, -15226, -3505, 7315, -7309, -12826, -9641, -3708, 8335, -361, -10734, -16486, -12541, 7382, 4147, 12296, 8829, 1751, 5454, 11469, 18175, 2743, -14827, -14393, -9230, -14735, -6746, -2309, -656, 5805, -5356, -14554, -8295, -2213, -913, 4667, 20564, 23784, 14414, 3214, 2787, 5628, 2425, -9320, -20618, -12646, 4425, 5770, -13222, -18495, -6340, 5210, 2204, 381, -12672, -23972, -20954, -12634, -4287, 1453, 6358, 2586, -6172, -5160, -7737, -13726, -16434, -5606, -11536, -27777, -19292, -8125, -1951, -2577, -2096, 2473, -4937, -3569, -15701, -19379, -10281, 121, 4984, 6701, 1200, -11482, -14635, 2321, 6593, 2349, 2345, 2732, 4593, 5074, -14567, -14319, -5551, -2668, -7976, -9597, -1062, -2936]
13114b936j942Q23j735J1868o629j8842l241O871R661l37K100l557j0724J6569
13100b051L174j237Q391j1030j1415K5718n429r800n478r45m461p20J2284J2425
13086I426R140r95n502O583q725j861Q52K788o574j5612j8455K5630J6278R100
13072B2073j4131j457M360o327L61L962j6855k091O921k910R142k466k564N301
13058C319L171o303L795p992M588R340j0651p894J483J702M370j940k381O038
13044F45L306p556n487K797j953O976N570N813L265J849j0117m640m993J032K724
13029g69j118O372J5714n900j1037k733n917M551o92Q480M778j0866J1522J1759
13015B4144l318p787j4008j0714n579l961M437l718o757m095R790O240j8123k825
$$ y = [-2936, -4878, -4055, -5790, 6078, -551, -19393, -22634, -15763, -6102, -6439, -4339, -7896, -18620, -2051, 1123, -114, 8277, -2753, -14168, 11550, 6121, -3679, -9157, -10102, -14563, -15283, -2999, 9426, 18566, 17571, 12069, 18652, 9927, 8066, 8918, 11706, 5132, -10480, -28935, -3305, 12973, 22073, 7942, 6485, 10845, 4518, 4879, 8841, -8014, -10105, -3184, -6094, 3048, 582, -1982, 3319, 6490, 187, 3982, -4010, 578, 9918, -733, -8627, -7144, -5442, -1072, -3012, -5393, 645, 3951, -3605, -9092, -6295, -8248, -1272, 4298, 10111, 13376, 15225, 5108, 468, -4525, -3493, -769, -1887, 4485, 20199, 14299, 3262, 529, -5388, -837, -1529, 6951, 11729, 863, 12385, 24144, 20826, 13039, -969, -11683, -17262, -21223, -16786, -20504, -27261, -31356, -21566, -15326, -33449, -36274]
13001c6274q77K735J3122J2998M182n392J136R205O963N727n138n179n657l550
12987e999L370J654O48k142j3628J0979J9358l740j53r845m252m698m607p569
12973b0624k063J1101O518K2443p55j8482o194O770M502K136J215j8356o599Q566
12959i822J9J777o759j0352P059Q057j566o123J072L469j74O247Q336k239M98
12944e01L785j1269j0896n617K2194J4907p232r897n033O09J623M698J0607M422
12930A2400p092r048P337M467J5875k974P293o374j0314m253N458n504j0633J622
12916a740m989p415m705k386l691K213N767J3590L736M32q754L098j2917J275
12902a6486K265M391K256J4801Q107Q599j4095j3870N305p909m591N058P927J1396
$$ y = [-36274, -37151, -34416, -21294, -8296, -4114, -9506, -8370, 835, 7798, 13525, 8387, 3208, -2449, -5999, -2629, -975, -327, -2469, -16097, -5118, 14240, 10500, 10347, 502, -3750, -8448, -13055, -20624, -22687, -11586, -5068, 17375, 16620, -1862, -8056, -1286, 3216, 5352, 6567, -11789, -18388, -9822, -9803, -8026, -14785, -25137, -18078, -10021, -11587, -17710, -16638, -13169, -13343, -7096, 1240, -999, -501, 3284, -7985, -18881, -24498, -2304, 12603, 5371, -4526, -9559, -8950, -7327, -2629, 7978, 12400, 5308, -3740, 3597, 8064, 23939, 20965, 28258, 21884, 11570, 7317, 12775, 7271, -3362, -1740, -6729, -14144, -18849, -21235, -24926, -22713, -16946, -3356, 380, 812, -7942, -4844, -17761, -16486, -14221, -9830, -7574, 7227, 15334, 23933, 9838, -4032, 1273, -6636, -11227, -6169, 1758, 13154]
12888A3154l064o382l80J066j0661r024K715P821O282N439j6899P76P137r259
12874a1279q554J3703J137q370k667R972M153o482j1216J1187O147l204n956l673
12860a5102j900J8203J1870M262J775q492j0168l721k526L219m110j3798l470
12847b3958P103J7927q039j1341n007K2299J6364j1646o529K348K17Q213m093
12834C858p989j1663m682M702L853j729j0887J687P949M406r28m269J1649J0047
12820F004j6696j6175o202M172j101K877J0372J2827J0044K894m868L086M645
12807A1879m058k623J3192P661j0331p928m152m315K464j0175j6683n209J0685
12794a9593j584l588L084M588l998L046J4504R405r788j6358o906J3621R831Q071
$$ y = [13154, 10090, 3708, 3328, 4394, -6267, -15291, -12576, -4755, 1527, 6966, -9933, -9157, -2020, -11279, -19833, -6130, -4993, -13363, -16030, -6058, -1905, -8387, -19603, -8416, -2269, -5473, -11429, -15102, -17002, 1201, 13071, 17333, 19108, 10616, 448, -3273, -5799, -2580, -6690, -20488, -23958, -16855, 1072, -6967, -18308, -23315, -1016, 15348, 3702, -2827, -479, -262, 7951, 3858, -4131, -15794, -20476, -15774, -11921, -13650, -24537, -22850, -14901, -10495, -11423, -15692, -4043, 6004, -10692, -26867, -33069, -28897, -29998, -27121, -16749, -3922, 6122, 9016, 4148, 7234, 11879, 7821, 5198, 18390, 26051, 15720, 7792, 3640, -675, 1789, -8386, -25069, -30278, -19593, -21177, -24765, -21681, -17093, -21091, -18045, -3541, 5864, -3924, -20282, -27188, -13567, -3736, 4335]
12780D335n069Q982K350N234r979m888j2909r259M980J0902k725m622m252L034
12766a3886Q42j666L187O95k914P24n693M4J0358j140m877M057M969O550J1069
12751A2319n523j3574l157J3126l462O808m446p309J5789Q309L046j8733L064
12738F257Q888j3034L585M167P383P625j0895l705j1657j3428j3073L772M46O412
12724a7257J3740R319n368m289J0690k47O19j3238j3034Q036M948r952j1334N076
12710b2291J3125O508J4226K063J353M193O44k469j3254n609j171P665J4569J7008
12696C6560j7330j9936P064K86l038p093l959J2045K655q145j6498j2490Q008
12683b1871J2903q450j4461m641J396J390J6808R806L030K311j0095k026J575
$$ y = [4335, -734, 8248, 10598, 15832, 5853, 965, -11944, -21203, -16223, -5321, -8046, -12668, -16920, -13886, -13044, -14710, -11523, -10828, -13742, -13018, -18711, -18667, -8309, -9449, -14326, -10269, -5300, 1250, 12319, 6796, -6778, -9935, 3191, -271, 6537, 2091, -5218, 10571, 18880, 21926, 3193, 6257, 15145, 2111, 5696, 9863, 17246, 24871, 13976, 10271, -1386, -14814, -27887, -24115, -23669, -17257, -3517, 5802, 434, -3855, 6835, 6588, 7207, -6031, -19065, -11029, -6081, -16033, -27367, -22291, -9166, -2658, 11568, 13631, 14984, 19177, 19821, 17352, 4098, -1511, -2682, 4983, 19552, 36560, 19230, -706, 6358, 6644, 3606, -3487, -7446, 4599, 7254, -891, -17389, -29879, -21871, -8968, -17418, -31879, -36520, -35124, -33734, -16926, -7120, -4090, -1779, -11874, -13900, -12325]
12670a2325O745O850J5071J0293j5723j4893k193P446j407k301o360j4348p029
12657c0174J0829R038Q583r330k0877K301M489P495J4202L58j561o026J681O844
12643b148j3188j2825J4318K695p191j692l062J2479O621l011m49k2806M782J2052
12629a3425O455P336r96r11O457n260N671J723j4834J297J0172K264j2741K206
12615d586Q149j570j025r586j431p107O177K622K664L688p719l102K307J1446
12601I27L574M322P327m131O876r491M185j9538j1161m993J0051K1151Q866J928
12587A9893L045k628j4858j2456O673Q701m11J0865J59m699j0371M496J1149n217
12573A4341K80K139m683r136r119K131M766K773q162M78R741K780l324j9665N368
$$ y = [-12325, -5580, 1270, 16341, 26634, 10911, -3982, -6175, 1271, -136, -2437, -8797, -23145, -30174, -19345, -10307, -1724, -11054, -31931, -29630, -25141, -17646, -3444, -3086, -4647, -10673, -8992, -2148, -15336, -28161, -13843, -11148, -18339, -20031, -23093, -10614, -3993, -7004, -7453, -30259, -25477, -13425, -6970, 366, -630, -1541, 4916, -344, 5327, 7050, -7784, -6487, 3685, 5949, -6792, -4586, 3563, 1993, 968, -8618, -10049, -17156, -10979, -8357, -5693, -2005, -9724, -12826, -10519, 927, 4501, 8823, 16150, 12019, 18895, 9404, 13589, -5949, -17110, -22103, -12052, 9099, 17965, 19893, 22938, 20310, 5452, -7004, -331, 8370, 7959, 18824, 18983, 14284, 3913, 8409, 19558, 14341, 14621, 16760, 12077, 2941, -6178, -4047, 719, 3492, -4670, -4192, 5549, 8329, 5005, -14660, -9292]
12558i292J8271J2368J419n250j2125j4368K321m015j129L374n445P419Q342j377
12544E13m109m28m41J200p870m712r786J1038J9892J2849j672m824p428k375n948
12529d101j0361r592J9186J6399m354j6734L003p889M385O728q385m12J1984P241
12515G098R652J366p148K36o074J265j4037j3479N144J2118M450K630M197n134
12501B284n377J588j2439J656J84l949N817K408J3947R831l171j4381p810o96
12487a0108N682m46j8523P64J2043q042o335l766K766J983K857J0433J9282R70
12473I560j3656qO268J0850p962j0674k6504n99P070l368K521R797K176k811Q846
12458h494J59j106M37L091l996n703p740J6907j875j5439J5060O505o411l189
$$ y = [-9292, 8979, 21347, 22766, 17516, 5391, -8977, -6656, -10671, -11800, -8426, -13871, -6452, 1890, 513, -3596, -4024, -4465, -3265, -11135, -15847, -25633, -14595, 5297, 18146, 16474, 11650, 4222, 1847, -4101, -14462, -24054, -4868, 11531, 7177, -9557, -6554, -14443, -10058, -3330, -11715, -12127, -143, 7098, 16750, 18116, 10968, 11204, 5130, 6395, -7642, -21121, -15977, -3859, 591, 3221, 7418, 2284, -3093, -1505, -13944, -12288, -12104, -16053, -10236, -7828, 6119, 15950, 12779, -1602, -9412, -10108, -4426, -4872, -23395, -22631, -10588, -18630, -24965, -28731, -25965, -23982, -21125, -10692, 8590, 9560, -4096, -4104, 2164, 13014, 5052, -5622, -32126, -32725, -25655, -29023, -26502, -16705, -14529, -17340, -8494, -8335, -9441, -9004, -5913, -9909, -15612, -23352, -6445, -8320, -23759, -8699, -2194, -8605, -11794]
12444a1794q943O889O815M585l995k814n749m255Q4J571r455m908j758O490O660
12429b0577O979P610J2075k357m341j0152J1075J1517K792R013j6099l769R876
12416A3642r7P18j0228p629N080J1248L973R263K224k5277j008L272j387j0914
12402g120j695m9l682l839L508J1602J4387l442r984k566n396k996P881J2126
12388H735M388j0553j6355p379P837J0933N93k201Q393M795K759p4j4628j7651
12374b0408j522L685n220k741Q634L493N524P926K119K557m334m975N314L379
12360C431n053N709J5350J3024o806k0155K50P717K3298l630j4358p09j82j2797
12346E089k804P324l328J062l414j3090j4916M67J5299M494L033K418m473M622
$$ y = [-11794, -20737, -13848, -7033, -2448, -6443, -9257, -15006, -19261, -19177, -17606, -27061, -31969, -33727, -27237, -20577, -13598, -5988, 6087, 3730, -611, -10763, 312, 11829, 14621, 23634, 7535, 3766, 13642, 13545, 14263, 4035, -3594, 1486, 12734, 16707, 25970, 28194, 2917, 1909, 5181, 3794, -7120, -8815, -8864, -12546, -16385, -12877, -1275, 13112, 9670, -314, -2880, -8276, -11272, -3391, 8735, 13123, 2570, -13785, -21164, -13327, -2394, -1801, -4002, 4391, 9186, 11945, 11871, -2757, -20408, -21930, -18245, -23465, -26206, -17572, -14079, -8555, -629, 1490, 4047, -287, -5262, 52, 3431, -1622, 4087, 19437, 32461, 25655, 5500, 5750, 13467, 36765, 33135, 18777, 18068, 17886, 5089, 2285, 9609, 6281, 7343, 3929, -9161, -24077, -23610, -8311, -3817, -784, 1634, -2839, 1783]
12332A783o410o830r712m21J1821J0032N267K466l915q331P537J4463K407n488
12318A4669Q845P206N523k276k6429j5641N349k358k735K116R478l933N274R809
12304A4897j2797k0303j3527K719Q49J2677M09k370R859O570o535K351M913n687
12290e975o783j220N265J0147O270l107n543o177o313M044P038J2019J626j304
12276I987j6215j7542L689K0875K576K741m680k1585p948P984J267J1752M730
12263b369p478o942k166P590K4042J1477j5100p923j424j324m116J973K472q008
12249i296j0206N910R224P764m425k014j0733k189m569q615j8051M667J4756R321
12235a8456j561r30L295J0204J196J657M331l933j384j2474k919j492l252j465
$$ y = [1783, -4627, -11457, -21169, -21590, -9769, 263, 5530, 7996, 4081, -4250, 3287, 17750, 20157, 14669, 23514, 30720, 36243, 33967, 7538, -8103, -2754, -5112, -7847, -5731, 3747, -186, 5088, 14897, 2100, -18203, -31730, -29011, -28162, -15485, -15076, -17446, -7587, -1017, -7552, -5201, -288, -5975, -12758, -13978, -8713, 1434, 7704, 4597, -946, -7123, -13436, -9392, -2354, 9665, 11291, 9987, -6228, -23770, -20081, 794, 3370, 6111, 1431, -20154, -28102, -20118, -18851, -7099, -2369, -9847, -16789, -18955, -11365, 12677, 24154, 9054, 1131, -293, -1617, -5733, -3760, -1288, -9296, -19502, -13592, -4368, 3396, -1029, -3043, -13776, -15965, -20534, -29149, -47200, -42533, -27777, -18456, -20017, -20947, -17652, -7448, -6252, -4595, -264, -4197, -5581, -18055, -20974, -22466, -25718, -27183]
12221b7183Q075R641N11o298M164O851J40k674k236M181J1963J1680r897j0926
12207b008j0072o919K215p813k361J7960j196k594J966M052m39L536R21k62M239
12192A225R273j0492o428j6401P1J784k258J1197J4975p27j106n99L846L043n496
12177A907j563m261l624q226l705j424j5600P279N961m13q759O611O874o56j932
12162b1531M063n733o5K3680J7918M039r680j7342j5452j239K48J436M471Q093
12148g094M411L472n41L585N086k469j2585n582n82M81l221J6762J0873m589j1983
12133c976P520M433J824m170j2961j1234m195l762J5201J7451J9121M695j1224
12120A8723k5411j2516J1551J2355P678L351L504K163m620o813o196m85O39k842
$$ y = [-27183, -19108, -9467, -8956, -15254, -11090, -4239, -4099, -6773, -9009, -4828, 7135, 18815, 8918, -2008, -12080, -18999, -16784, -24597, -26958, -8998, -10194, -12788, -10822, -6770, -7209, -3673, -2752, -3014, 1225, 10498, 6, -6422, -22823, -22752, -20968, -23226, -12029, 2946, 2219, 1113, 514, 4360, 7403, 1907, 344, -3917, -7541, -15767, -19472, -20896, -36496, -29217, -23256, -23669, -32428, -25817, -18943, -19599, -21531, -17468, -23201, -23266, 414, 18332, 22371, 12691, -4651, -20103, -21342, -21094, -19658, -15187, -7094, -2683, 789, 248, 3833, 8919, 6450, -6135, -11717, -12299, -11818, -15039, 1723, 12596, 8007, -3976, 3544, 7977, 9801, 5631, -7330, -18564, -22759, -26521, -11320, 6131, 25252, 29947, 18723, -6688, -19204, -7653, 4702, 12380, 15731, 19235, 21398, 16778, 9965, 3769, 3284, 3923, 1081]
12106A081n468L178m086O822j520l386r154J477R797Q882o963j8811j1206L045
12092b6312J4361r66J759j447K357L638j4391j2161J760J6040M088O664j634j5651
12078b1895j0568J0112K883M646l820P234Q158Q909N192P51p652J977J6427J700
12064B4054o398o398j7586j664P042j057M758R590n026Q51o735o982j064k88n47
12049g450p457L401J797R70l079p444M662J5429l90j1246q693K860O486J1229
12035A075o912j0119k377N429P184q066o166M92n070M14N534L501q450M044K2829
12020C342N726j418j0823j7662n448N165K1762J858j902o169N409J464k250J366
12006D20p556o737o727J671M473R723M502L187n850J820J0186K886l168j6772
$$ y = [1081, -4387, -1209, -5295, 1527, 7, -3379, -12533, -11056, -1259, 7623, 660, -18151, -29357, -26312, -11951, -12917, -11158, -12605, -10248, -6610, -21001, -33162, -31402, -15362, -11274, -4610, -6244, -21895, -32463, -22351, -19468, -14822, -18642, -11408, -3250, 5659, 10851, 11602, 3950, 5927, 22354, 24054, 17656, 11258, -6328, -7992, -950, -2007, 2751, 12341, 7315, 8166, 1431, -5551, -6615, -6903, -7450, -14907, -11506, -9709, -8739, -11818, -19262, -14600, 829, 439, -10807, -19500, -16640, -10154, 1075, -5837, -15956, -18333, -12904, -5720, -13786, -19952, -19460, -24530, -24116, -18582, -15081, -23531, -19487, 3342, 9068, 7650, -3173, -20835, -26283, -21118, 644, 2502, 600, -5569, -160, 1304, -946, 420, -7136, -13873, -20600, -18929, -14456, -4733, -231, 2956, -2894, -1074, 9112, 11998, 8830, -7942]
11992g942j3378p226j0314O346L226J2117N958P923O351m077m297K368L015j5490
11978a5420o327R86Q421K632n826p671j454j799N920P681O01m388l249j439P739
11963a3593J8285J3332l818r042o708k965o38k488J515k725J824M287K103O817
11949F186R829j4882r703M77m333n695J3522K565m962m660M66J0595L058M039
11935F502J9639o368Q785O041j8002j7698k666J6880N122L175M493j1407o741
11922G755j2327r429q893N494O696p875N061P413M390j684p894O563o098P71J5733
11907E676n90m918m60K351l590N11p199M281J361P306J502N04o222k089N285J0931
11891A4640K151M082j4342l540M473l386j2053m296k361R743L558M941j4116n208
$$ y = [-7942, -21320, -28546, -38860, -32514, -29288, -17171, -11213, -3290, 3061, -1016, -5313, -2945, 70, -15420, -21747, -20761, -12340, -9708, -15534, -23205, -24659, -26458, -20538, -12857, -12256, -16644, -19893, -21332, -13593, 4692, 18024, 14206, 5164, -1544, -4509, -5147, -7635, -6120, -8845, -7021, -2734, -631, 6186, 16015, 1133, -8570, -8093, -12426, -18121, -4599, -2034, -6996, -11656, -11190, -595, 2463, 6502, 26141, 19773, 28558, 34599, 16597, -1101, -3767, 13113, 18235, 21410, 25903, 14496, 7755, -4572, -14001, -22894, -17400, -10704, -18579, -13518, -6105, -1715, -3399, -11293, -4730, -10828, -10057, 5676, 5086, 168, -292, 2059, -1531, -1020, -8219, -3938, -2577, 4729, 6231, 6735, 513, -1576, 3709, 14640, 16791, 20873, 6531, 2991, 7464, 4078, -7975, -12271, -14632, -4889, -1331, 3610, -10506, -15714]
11877a5714l725P686O969Q099N16r20J735P494k909j1863j1699O693k652r041
11863a9331M356Q893P171O037r174l409J341o055n913J3011M260p66k027N858
11849D252p82K90J7373J0672K649j45k2692j6321J4434J4432o406q403K530N061
11835A6944j723j532Q47q832j0483O449m430j0223m414Q311o06R092j6921o917
11821b4438P098O348P985P998N392J771o725j2411O336m122l271k377M834J563
11807d019M138q320j504p064J0129n030j484N633J732j0469M573R832J3295L103
11793A4545r582j425l480p41q181P178O797p795j6428r513Q58K1567K1672M288
11779A9760o475j0616j0990m056J774L692q32J338P041k503P546l430l504l728
$$ y = [-15714, -19439, -11753, -4784, 3315, 3831, 2911, 4646, 12140, 9231, -2632, -14331, -7638, -10290, -19331, -14975, -6082, 1089, 7126, -2048, -5457, -4116, -10171, -16084, -3073, 1187, 421, -1606, 4252, 3470, 3760, 21133, 31805, 34454, 34309, 11617, -4704, 9730, 24162, 17756, 9353, 11883, 16944, 15221, 13689, 14536, 5704, -4779, 1670, -2760, -12983, -17397, -9086, -9692, -600, -17521, -24438, -17340, -10992, -3007, 4991, 10383, 12154, 5429, -6982, -646, -4768, -8039, -10416, -5582, -4019, 119, -8201, -9705, -16769, -6640, -11670, -13154, -7521, -5789, -16258, -11685, -1853, 11442, 14545, 4963, 3538, 58, -683, -8864, -1686, 5111, -2684, -19112, -28625, -27767, -6200, 15472, 19760, 13285, 2669, -8321, -12377, -10603, -6911, -7743, -6405, 636, -1867, 5679, 2249, -1255, -4983]
11765d983j2844k700j2062l462N995K0012O922J331J110L893j2600j170l879O562
11751g875J2497k792k093K485k898j2255j3232J7281P527R801J2141o064K027
11738A6550j556j0102m415P102l474k853J128P918p803j1051r84M810p610j959
11724a4299J3865M059j865o122l590l835k585L574J5998p705J458J4992l307R964
11710B0602M733n686m750j4640j2635n434P213l185j4242N710Q777n7j732j1384
11696b6710K0409J723r557Q445M743j931J0575M613o597r151q004n889J1674J432
11682d225K387n75J818J0311r836p015q148P539j0398o820J0448J317K744J5816
11668E363R643R884M692l240O940o487p641p452l058L748p504j0788J0853N178
$$ y = [-4983, -17827, -20527, -32589, -36051, -30056, -10044, -3122, -1791, -681, 3212, -9388, -10558, -14437, -7875, 4622, 1830, -263, 2222, -676, -12931, -26163, -8882, -1355, 8446, 20587, 14523, 16550, 14994, 4892, 477, 7579, 4105, 1252, 2380, 10298, 2495, -8556, -9540, -4730, -12340, -14299, -434, 3625, 1760, -4362, -7952, -11787, -14372, -10798, 5200, -2505, -1047, 13945, 10638, 20602, 25335, 19649, 14899, 259, -12376, -17810, -10597, -13782, -28024, -22314, -13537, -13594, -15326, -26710, -6301, -4578, -14135, -5690, -947, -2878, 7697, 12310, 5713, -3438, -11442, -17331, -5657, -4225, -1838, -2413, -595, 9716, -120, -7135, -15283, -7744, -18142, -24962, -14514, -13197, -10453, 5363, 15006, 24890, 29582, 26342, 33282, 26795, 19154, 11702, 8644, 12392, 4888, -5900, 4953, 10131]
11654A0131j0954L799P726Q435k683l644q75k466r105l68j1595J599J2673J8475
11640B1148K476j2043k341L181j3926k730l177k7856J4924J7785k876K967J3362
11627A0894q171k218q361N052J9687l52l605j0092p657k317l593j986N539L857
11613c323l53j263Q202J2591j2114k0930o524n203K035K1397N282j6873j0588
11600b7664J4941j026n344j486N652l76q897N938k347J433J7358O401k898p735
11586f050n929K349r633o416M013Q875J1845J627j897k748K617J812L550N261
11572I276j6480k0797J1103J0505N720j552m115P195n960p2j381r830J1662P401
11558B675J930P038j278N798r266N40m399l196l025q938Q376J300q043q675L752
$$ y = [10131, -823, 2976, 10702, 19137, 16454, 12810, 11935, 9469, 364, -4, -11599, -10000, 2673, 21148, 23624, 11581, 9240, 12421, -1505, -4235, -7412, -35268, -20344, -2559, -5435, -2468, 10894, 2723, 505, -7856, -2804, 16883, 16531, 12926, 2834, -4823, -7140, -10733, -12719, -7180, -3323, -3676, -4939, 3263, 15854, 3740, -17190, -23714, -28917, -26882, -5485, -203, -17076, -27664, -12723, -13749, -19093, -20579, -14927, -15303, -24200, -18262, -20609, -19176, -1818, 4583, 1685, -6050, -11979, -9630, -19263, -25679, -21666, -12791, -946, 681, -1216, -3964, -1347, 465, 4015, 9276, -7204, -28001, -16898, -6393, -673, -2225, -6340, 855, -5105, -5177, -6558, -16388, -4726, 2675, 4605, 11643, 10365, 16163, 6897, 7437, 3038, -158, -3183, -12121, -3745, -2445, -10488, -19163, -15411]
11543a5411J8805M803o852p083R156O597r345j242r568m079j950R69J0529Q034
11529C363J2246M850l447j3968J245M206j2919l938M968l268J845J5622j917O186
11515A5074J036l472k694j2507q427O526l729J1039l886N652j900m994O619m443
11501a06r777M717l212P788N722p590l011M774Q179Q297K532r01q724p652p637
11486f601l918J1731J7559m31l281j0155k919J0113n280l092m626N719j1937j3916
11472b1034m530J0085J7339j707j3035j723m145N213M130m246M116N919N250j151
11458D81r936K63P772J905r18k1407j956J2584R085N627J069n67j2571j78Q806
11443E9P193l131n181j4416r753K134m997m142L289L302P536J4587J5057J4442
$$ y = [-15411, 3394, 8197, 1345, -5738, 3418, 10015, 670, -572, -10140, -14219, -16169, -15200, -4671, 3363, 15609, 20459, 17012, 3044, 4289, 8495, -4424, -8362, -3394, -6662, -4817, 10805, 8888, 15074, 16110, 12638, 9944, -2563, -10990, -4464, -8193, 2846, -1040, 4612, 2712, -2282, 4337, -106, -9883, -5166, -8378, -590, 5132, -2458, -5469, -695, 7484, 15781, 18313, 17412, 8688, 1036, -6601, -10519, 1212, 18771, 18340, 15059, 4904, 1985, 12098, 6818, 3726, -900, 4819, -7118, -21034, -25564, -15479, 1860, 153, -12882, -14605, -18750, -13537, -9407, -13653, -9537, -3618, 1632, 481, -9455, -9192, -1420, 485, -433, -21840, -23796, -11212, -2127, 3500, 4569, 4002, -8569, -8747, 59, 7252, 4121, -1060, -15476, -25229, -23095, -28092, -32234, -28945, -25643, -18107, -3520, 11537, 25979]
11429B5979k1923k9649j1714j389M56O579O324k734N724R194N58O207l303n950
11415a5641J0299N01J486N172m415O389n935k1570M143J0416Q371l041m352M78
11401g699J8867P135j2392j5926n540k946N678O298l174j274P768J4229P60M453
11387A6237J597j5897j0116L309l994K11n005l761J578P431j30Q058M291m674
11373h65j0819j2454m65O696K0464O66p87O906M585j3389j077l703L937Q756r883
11358a432o799m75J5442J0169n77o835p359l296J4299N082j1431j1346O900K0042
11344B2384o724l032N474j5161n381J1595J0630m525M128N608j0689j0477k492
11331A338p538J8713m248J080p94j2378m410l430j975m100K227J6415P991k908
$$ y = [25979, 4056, -25593, -37307, -38696, -38240, -31661, -25337, -28071, -22347, -13153, -12595, -6388, -9691, -15641, -5342, -4841, -3355, 1817, -2598, 3791, -2144, -23714, -19571, -9155, -784, -3825, -8177, -7699, 11168, 18303, 5911, -10015, -15555, -18501, -12823, -6525, -9699, -10973, -3205, 11024, 11784, 16237, 17834, 1937, -8179, -4870, -8864, -8653, -13658, -17419, -15841, -8410, -8540, -482, 3809, -865, -11684, -24138, -24603, -17907, 2557, 3223, 2436, 9342, 13927, 538, -539, -4242, -305, 8451, -1432, -8231, -8706, 6736, 16905, 16328, 9493, 2134, -1162, 13137, 18219, 6788, -4558, 2342, 22384, 15660, 12628, 18102, 2941, -2440, 9155, 19785, 15260, 19388, 24996, 14307, 3830, 1338, -6200, 12513, 8265, 9345, 8551, -3827, -8237, -11667, -13642, -17742, -15515, 900, 8891, 5983]
11317E983r176k376l103Q901J13p510O257l645j2904L111K794L349l887j1778
11303b3871J0621K6127K1284N523k044n747K638J5279n342j7938n159k0295j6503
11290a5427O571M870J121L97P762P990r608j2517n254M746N58n073j1629m888
11276c0381J0358n157R857J4023J60J41J1752n617l105m770p951q295J0892O394
11262a699J483J411n423j3709O318J0887J2760m11j9077j1587l912P995J1494
11249c470l230J066p984J422J2256J110o244r589K659k903J0138Q154q488o11
11235e714j4880r307N819J0041J651l378J0561l635j0233N607K433J9548J2026
11222B0539j5398r342J926K811j3795j1058R741R379M988M248O81m813j4155j3209
$$ y = [5983, -3193, -5569, -8672, 229, 342, -7168, -911, -4556, -17460, -14349, -11555, -8206, -12093, -23871, -13250, 12877, 34161, 39684, 37640, 31893, 34531, 49810, 44468, 26530, 21371, 1076, -15427, -8856, -3986, -2865, -2468, 5294, 13284, 3676, -8841, -14095, -9349, -8791, -13864, -25493, -30381, -20023, -25180, -15323, -1300, -1140, -999, 10753, 5136, 2031, -2739, -10690, -18985, -8093, -1699, -216, 1195, -4228, -17937, -11619, -732, 12028, 11617, -7460, -19047, -22959, -14964, -3470, -6700, -5634, -13618, -12196, 60, 1170, -5074, -14663, -12004, -14907, -4769, 3385, -5103, -5714, -20594, -29901, -24082, -14041, -12390, -15768, -5207, -8842, -19075, -13468, -11035, 8513, 20539, 5141, -4201, -2275, 536, -13259, -24317, -14576, -5197, -209, 4039, 4720, -93, -14248, -27457]
11208b7457J795j407j5333P056J4464K190O493r230r664m909J5943J8577J759
11195B77p435p062k262J952P486L0021J1115r968j2353K584J8351J1257j8022
11182B5941j9914k583q561q026J2649J0142n40j1703r235p034K677J3301J8573
11169A5687M938j3008j0247K128P139r477M60l18M050K8320m371r221k1312p911
11155a3143m804K090J7642J4204J0226p070n989k751m591q915O602p274j9044
11142b2817L308m700J717j660O35M660m981K499O885J1075q192o278r714M928
11128b2635J0003R015J2777J0140O47r310J942N856m84j13k842l17o20j4500J5343
11113A4902M504j9008j6463Q08L707J493l910J2301M293r502J479J1918J299m586
$$ y = [-27457, -25662, -27069, -42402, -35346, -20882, -18692, -12199, -21429, -31093, -36002, -20059, -1482, 277, -7158, -14220, -16482, -14530, -7044, 22977, 34092, 24124, 11771, 14355, 32706, 43963, 25941, 6027, 3444, -5117, -13143, -494, 9648, 9108, -2595, -11830, -18864, -16187, -2886, 15687, 20625, 7617, -2630, -502, 6637, -2840, -2380, -2698, 1352, 29672, 25301, 16080, -5232, -13143, -17947, -15857, 1785, 15989, 26215, 19145, 13156, 10405, 5814, -3101, 3501, -3773, -22817, -19509, -24209, -22492, -24152, -23517, -18857, -23838, -21339, -14454, -3379, -11571, -17849, -27563, -22635, -12632, -3617, 9160, 19300, 19947, 10637, 12579, 18435, 17951, 17838, 14996, 14679, 14059, -441, 14902, 19406, 398, -16065, -15257, -11550, -10057, -13967, -1666, 2627, -6875, -5396, 6522, 7821, 3235]
11099C235L961o121j3927p390J1738L895l271k18k714J693m324J27Q521P644m266
11084a417N732p14O200j4310q69L757P103P140N58j1643N467J509j3054J3694
11070I153P93j0356j1022k227P788K009m221j57J30N489O071M167o661j4366J404
11055a2006m549k081J0188J0773O978l82N603j2045l729Q782j0755j8641Q985
11042a2879K4001J1774O360L912j0866o727j8601k224Q330N31N745L548O128j6884
11028B148j0694k445j004L054n975r92p563j665l107J3517Q60j3088k2J5183K0656
11013H863R498j786k2946q251R030M769q759j1596K082J515m779j510L323J7247
10999c300Q850m9M957Q344k198l484r374m37o142j4995m495J9655P913p298k3372
$$ y = [3235, 7196, 1075, -12852, -20242, -8504, -4609, -7880, -8098, -10812, -9119, -13443, -13316, -4795, 2849, -1417, 4315, 3601, 9801, -4509, -5378, -1621, 5482, 12622, 13180, 1537, 7004, 8513, -4541, 9153, 9946, -410, -11432, -13659, -5871, -3862, -8083, -8240, -8110, -2621, 3450, 7617, 956, -13410, -12006, -16555, -18636, -8448, 2325, 9303, 8921, 14524, 2479, -1250, 7532, -3223, -21864, -12879, 11122, 22896, 29256, 33168, 22302, 15575, -3026, -5250, 3080, 3611, 9356, 12904, 19032, 2148, -8546, -10991, -11995, -8941, -14916, -15908, -23471, -25136, -28243, -14726, -13866, -26954, -26976, -11793, 8863, 18361, 16575, -6371, -14622, -5592, -823, -9582, -21178, -19096, -17581, -22360, -23870, -20547, -3300, 5550, 5501, 10458, 18802, 16604, 13120, 3746, 3309, -2833, -17828, -22323, -2668, 5245, -2053, -25425]
10984b5425j4165O679j472K484m443O962o967R699P773J828M786m921N974J0758
10970d50p164j1233J6466J2010M824L260l653l180n877j0585r846K45J3000L773
10956A590m179j90l416L247R45Q367k700r54L49n845j623p93P183k882J103P664
10940G866n176K08K608r366N773n640o793K298R074Q216J525M450j421j001N030
10925A7651j799n507j5030l491M903O491j175j0415j3112O754L53N204j240J4673
10911D260j507j0398n091o754J5524N287O824O200L550p347j4267j0625j3906
10898b8250k204J2140Q439M613J3782M244R78Q972J1379N675k0746j1668R8k344
10884E108M530J4342R884j0894m398o043j2150j1657q046O146L2181R277r357
$$ y = [-25425, -39590, -32911, -34383, -31899, -36342, -29380, -36347, -26648, -18875, -17047, -12261, -17182, -11208, -450, -7614, -18847, -2381, 9629, 14453, 17713, 14060, 10880, 5003, -5582, -15428, -15183, -2183, 1590, -2589, -2779, -6195, -2948, -2003, 6364, 3664, 2710, 3059, -2786, -4409, -5202, 1981, -901, 202, 7866, 2690, 2898, 5506, -3860, 1913, -3727, -10520, -8222, 852, 9068, 10593, 15043, 13622, 12621, 17651, 15852, 10345, -4685, -8176, -3273, 3218, 2043, -8372, -21484, -14730, -14377, -9173, -10413, 4260, 2753, -7645, -12736, -19490, -3966, 1321, 8145, 14345, 17895, 10548, -3719, -14344, -28250, -30454, -18314, -9875, -5262, 8520, 12764, 13742, 22714, 34093, 39768, 19022, 7354, 7452, 5108, 9638, 23980, 33864, 22970, 18572, 12529, 379, -11278, -19324, -13178, 19003, 28280, 18923]
10871A8923J573L204k586n418R786L206q620j2412p749K0462J4720j4068k0434
10858E87O656Q952j924q371Q049J91m221K169O132o779M986L788P818j160q9K775
10842B9559J0667Q980N462o22o913J0212J2081k369L443j225j0706o856P797J4760
10828G4270J0277l482j4996p304J0868j225J129K1227K8277L1319K3519O3708
10816B37587J00453J27188K03511L55641N20573M00863q4265k70841p3753K01007
10806A717964K49684j34859n00812m54074k88236j80984j10252o3068m3140k0183
10796A72040l4823l5273k891j1860j2912n488j204j8104K821r779j2829j7650
10784A2048K733J5045J6119O836K624p010j6308j6414l684Q296K6238N004p706
$$ y = [18923, 20496, 23700, 21114, 15696, 25482, 28688, 20068, 7656, -93, 20369, 35089, 21021, 587, 7243, 16195, 14271, 5900, 13949, 14140, 9919, 12088, 18220, 11441, 16427, 20215, 28033, 26873, 26784, 29559, 40226, 49206, 54668, 54046, 47133, 57345, 69426, 67057, 70500, 69275, 58569, 51713, 59510, 74270, 84547, 81065, 66069, 58765, 69633, 68408, 69537, 90764, 119041, 150360, 173879, 237587, 338040, 465228, 668739, 1024380, 1544953, 1945816, 1861551, 1590710, 1516957, 1717964, 1967648, 1832789, 1331977, 877903, 589667, 408683, 298431, 235363, 192223, 172040, 137217, 101944, 99053, 87193, 74281, 68793, 67589, 49485, 52306, 42527, 29698, 12048, 14781, 29826, 45945, 52781, 55405, 48395, 32087, 15673, 11989, 20285, 46523, 51527, 43821]
10771D3821j0716m709k3069N017K1861K488N16n558p658J6524Q728M994o996j519
10757D3724K612N113q295j6048m755J766j0230j2382j2284q602P817K945K942
10744e677J6590O160j423Q41K70j6120O006J1345M479n147K227R927J2026k407
10730C9097J0734K6144J6442J3066M714N511j6725j0686o471l649L949m077o762
10717G1287j2875j6085j4164j5741L804K6268J462j4239k5525M04Q518N154J508
10704A9776n733n974j5744L787Q952q15Q366J069l701n351k605J3505r158q894
10690b520O270Q633R899M193o360j1032o918l393j796P862k43O650k758L947R810
10675B2244P930Q11j232o327j8084K253N668P010J6844N105J0842J7364P922J8464
$$ y = [43821, 33105, 28396, 5327, 10344, 32205, 34693, 35209, 29651, 21993, 38517, 47245, 52239, 45243, 43724, 46336, 51449, 43154, 27106, 22351, 24117, 13887, 1505, -10779, -19381, -11564, -8619, -5677, 10913, 17073, 15650, 16491, 16761, 641, 6647, 17992, 22471, 17324, 19551, 29478, 41504, 39097, 49831, 75975, 92417, 105483, 110197, 115708, 98983, 88297, 81826, 78177, 82126, 78049, 71287, 58412, 42327, 28163, 12422, 16226, 42494, 43956, 29717, 4192, 4596, 13114, 18268, 19776, 14043, 8069, -7675, -3888, 5064, 4249, 12615, 13684, 9983, 4632, 2027, 15532, 6374, -2520, 3750, 12383, 22282, 26475, 20115, 9083, 2165, -1228, -3024, 4838, 4595, 11245, 8487, 12434, 22244, 30174, 30985, 29753, 23426, 5342, 7595, 13263, 20273, 37117, 42222, 53064, 70428, 78350, 96814]
10661I6814M1191M9828M4847Pl4135j0002M557K1935K4847r074m8213l5893k4341
10648A22368l7900q687K546L897n318j0188j220o155J8485j853P167L778Q810
10635I5730J7031J8084L2100K9488O882m325j0374L903j4313M692K0706J2959
10623B12563q27j2455l7769l5516j5486m751j2716N609L780o261R475n756j6257
10610H3633j0643N234n072k3986j0088k3662j2844k041J017j59J234n560N58J884
10596d95N430j4079j3395M262K38k2372k2372J0128L0680J8370O488J9609K9435
10583E1927K0142K4095O562P196J5277K0169J1222J9125N967j2893k3900r052
10571A35837K988R705O674K9438O3160P9361J25455J77060J97365J55431N8764
$$ y = [96814, 138005, 187833, 232680, 232687, 198552, 188550, 193107, 215042, 239889, 230815, 182602, 146709, 122368, 84468, 75781, 78327, 82224, 76906, 66718, 65498, 59343, 77828, 75975, 83142, 86920, 95730, 112761, 130845, 162945, 192433, 199315, 194990, 184616, 188519, 174206, 178898, 199604, 212563, 211736, 199281, 161512, 125996, 110510, 105759, 93043, 98652, 102432, 96171, 105646, 99890, 83633, 72990, 78224, 73152, 49166, 39078, 15416, 2572, 531, 1548, 1389, 2623, -2937, -2379, -495, 4935, -9144, -22539, -18277, -18039, -40411, -62783, -52655, -21975, -3605, 2883, 22492, 51927, 72069, 96164, 102726, 109922, 125199, 145368, 156590, 175715, 181682, 168789, 144889, 135837, 138825, 148530, 155204, 184642, 247802, 327163, 452618, 629678, 827043, 982474, 1041238]
10560A041238n3933r6212n6225L1447R6525O3914k9209j20900j89910j71954j32225
10549C82556r1174n2617j7558j3560j5408l149l494k4770j9366k563k649r983
10537A26265j2069Q593P823M2082Q2469J18031P3255m3762m3490J3434O1521J06718
10525E40870M8456p3677q9647o0886l8241k4721k9220j9770j5540j9032j8988
10514A99604j256K6884K3364J4898l677j5613M218J8009J3995k1643k8023j5526
10502B15234j882K0457J9092J2875l088j5836j1104j1666k2474j7274k244J4616
10490A96706M0191K0194j2938k8305j7449L486O382J2064k726R10O602j3307k1723
10477A90087K9347M5494O4719M1003J7789J5570M5550N1430N4960O9486M2213
$$ y = [1041238, 987305, 891093, 834868, 866315, 962840, 1026754, 997545, 876645, 686735, 514781, 382556, 291382, 238765, 221207, 207647, 192239, 189090, 185596, 160826, 141460, 138897, 136248, 126265, 114196, 122789, 130612, 172694, 255163, 373194, 446449, 402687, 359197, 372631, 434152, 540870, 589326, 515649, 426002, 365116, 326875, 302154, 272934, 253164, 237624, 218592, 199604, 198348, 225232, 248596, 263494, 259817, 244204, 248422, 266431, 280426, 258783, 230760, 215234, 213352, 233809, 252901, 265776, 262688, 246852, 235748, 224082, 201608, 184334, 182090, 196706, 236897, 257091, 244153, 215848, 198399, 201885, 208267, 220331, 217605, 218515, 225117, 211810, 190087, 219434, 264928, 329647, 370650, 388439, 404009, 449559, 500989, 555949, 625435, 667648]
10466F67648K7287K6644L3326L3398K3775Q222J2252J6633J3586j4435k8446j1519
10454H08371J9437O4932P6983K8683K1946M2745N6267R5561J36287J02080L8225
10443A491517P945N2839J29002K19659K95047L22036K08345N0712P4908K03590
10433C055600L52235M44460M47457L57664L29229M85073P55269Q58646N66463
10424G652096N52309Q53669R62626Q34693K78569j8504M39027J281319K132165
10415A4967969K639170L251036M559042O683943J0317202J6585593K7482047M7049071
10407A33535073P7374682R6202046M8545430m2962225o8399754k6509643K9834778
10400B47620387P0190286L6411771n1531504r3751072p5270732m5170751k5916913
$$ y = [667648, 694935, 721579, 754905, 788303, 812078, 820300, 832552, 849185, 862771, 848336, 819890, 808371, 827808, 892740, 969723, 998406, 1020352, 1063097, 1119364, 1214925, 1351212, 1453292, 1491517, 1499462, 1552301, 1681303, 1900962, 2196009, 2518045, 2726390, 2777102, 2852010, 3055600, 3407835, 3852295, 4299752, 4657416, 4986645, 5471718, 6226987, 7085633, 7652096, 8204405, 9058074, 10020700, 10855393, 11133962, 11115458, 11554485, 12835804, 14967969, 17607139, 20858175, 25417217, 32101160, 42418362, 59003955, 86486002, 133535073, 210909755, 307111801, 355657231, 312695006, 244295252, 217785609, 247620387, 317810673, 354222444, 302690940, 208939868, 133669136, 88498385, 62581472]
10393F2581472j5801958j0375764o954621n004516l918468k962709k304585j806758
10385A3452093j188891n50531l39575o38551j026312j253307j104643o43464j69101
10376F537718o8463k72903n55259p08630o34172m38916k83876j56106o5602j33926
10366C219865k80059k73395j89004j47134j36707j38877j37694j26871r5393o9579
10356A625152o3152p6027p3781m2434l6097j8393j5733o3332r5310q0772n3028
10345A007093l3136m8120p0752o5999n0021k7516j2366j0936j8512k2450R302
10334F56587K1672Q021J3465J1853j6563n10N922K1574l289l2504k6429k9389
10322F30410l4844j1751J3739P112j5826m3651n7721l8041N998K4273J3547r314
$$ y = [62581472, 46779514, 36403750, 29449129, 24444613, 20526145, 17563436, 15258851, 13452093, 12263202, 11712671, 11373096, 10734545, 9708233, 8454926, 7350283, 6706819, 6537718, 6469255, 6196352, 5641093, 4932463, 4298291, 3859375, 3575499, 3419393, 3353791, 3219865, 2939806, 2666411, 2477407, 2330273, 2193566, 2054689, 1916995, 1790124, 1694731, 1625152, 1562000, 1485973, 1412192, 1369758, 1333661, 1315268, 1299535, 1236203, 1140893, 1060121, 1007093, 973957, 925837, 855085, 789086, 739065, 711549, 699183, 688247, 669735, 647285, 656587, 678259, 686280, 699745, 711598, 695035, 694525, 700447, 722021, 718732, 686228, 659799, 630410, 595566, 583815, 597554, 604666, 588840, 545189, 487468, 449427, 455425, 479698, 493245, 483931]
10310D83931k7738n997m289L036J636k971R215J3127j2242j8857l9710k7096k330
10297C69715L330j382k4058l5683k3297o504o95J1672k681k8031k4443K061j1526
10284B28478r923k182L0231N1038K7525j7690j455R779J6538L8638L5625j2481
10272C94121k2022j612k2321k5492l0165m5632j9763q387M10J764l229r624P938
10259B15986P676O393J4193m88m976K71p991j1645j3954p312L158J4346L796j1035
10245B08418r259k2149k913K4942J4011p307j9411j1134N851o131j6380j1415
10233A47123p181J656l577j4836r845p117j4815l1N571Q280J6405J1661K0221
10220A53515J8574q35J66J82K0309K5164p32j0333j0529q980P882J3230K166j1184
$$ y = [483931, 456193, 450196, 445907, 448943, 450579, 447608, 456823, 469950, 457708, 438851, 399141, 372045, 369715, 373045, 371663, 347605, 311922, 288625, 282121, 281426, 293098, 290417, 262386, 237943, 240004, 228478, 218555, 216373, 246604, 297642, 325167, 307477, 306022, 315801, 332339, 370977, 406602, 394121, 372099, 370487, 348166, 322674, 292509, 246877, 227114, 218727, 219137, 220901, 217672, 208048, 215986, 223662, 230055, 244248, 243760, 238784, 239055, 231064, 219419, 205465, 198153, 201311, 215657, 219453, 208418, 199159, 177010, 174097, 199039, 213050, 205743, 186332, 175198, 181049, 174918, 158538, 147123, 139942, 141598, 138021, 123185, 113340, 106223, 91408, 91377, 96948, 105228, 121633, 133294, 153515, 172089, 171254, 171420, 171602, 191911, 217075, 216343, 206010, 195481, 186501, 194383, 207613, 209779, 198595]
10206A98595n962m818K065l489j4849p617R653j1634j290j5479l2088j9826o826
10193H6435L489l023m671j7528j6930Q168K916J3493J876l341J016K1043K0950
10180A13893L470j2452j483M070O060J0488P620j344j0578m924J989k1997j6050
10167G8762J1330J024j2180M528J840J784J2889n617o912P448M690P564N997O873
10153A20020n397j2097m173J7674J3125K059k241j6844k753O765J659l158l172
10140A11467r152q682j0378p162P43l802k966L571O574m020j4882j724J0979K1831
10126I2397J0780J675m695N963K641l838p160P140j2701o414r4j7529j703J9204
10112H5666J8193l587r266k0317o597J1857O822k400r70M355j3634q704J2615
$$ y = [198595, 192633, 187815, 189880, 186391, 171542, 163925, 173578, 161944, 160654, 145175, 113087, 93261, 86435, 89924, 86901, 82230, 64702, 47772, 55940, 58856, 72349, 74225, 70884, 71900, 92943, 113893, 117363, 104911, 103428, 107498, 113558, 124046, 131666, 130322, 119744, 114820, 116809, 94812, 78762, 90092, 91116, 78936, 83464, 85304, 87088, 99977, 94360, 87448, 94896, 99586, 107150, 113147, 120020, 114623, 102526, 98353, 116027, 129152, 131211, 128970, 112126, 109373, 116138, 117797, 114639, 111467, 102315, 93633, 83255, 76093, 76836, 73034, 70068, 73639, 80213, 76193, 61311, 59587, 70566, 92397, 103177, 104852, 100157, 106120, 108761, 104923, 97763, 104903, 92202, 85788, 85694, 68165, 66462, 85666, 103859, 100272, 91006, 70689, 64092, 75949, 82771, 80371, 79401, 83756, 70122, 61418, 74033]
10099G4033j745r338K0899J9647K3079R021O668K0173K6878K714j6589l1233m2280
10086A01927j4089O461L411q639k5157j3035p355o52J654j0803r945l769k733
10073A7276J8833J3656J7774J4017P247M351Q386J0260J0869M1169P3697L6052
10061B73587j1702K880K2327J9790R154j1842k1813k2732k0509n8007p2362k7106
10049H1665j0510J4898j6418k4683j5443m591L878M478Q773n726o187L788J5503
10036D9425k612J538Q068J3337L956P200M899l527J2041l199j1794l054q162J3815
10022H1931L262j6863J903L486n661m299J4637q042j0587M548j636k102o150M980
10008E9407J6627J4142l255l062J1974K6280K1407K1832N9851P0315R7763J67885
$$ y = [74033, 72288, 62950, 83849, 103496, 126575, 135596, 142264, 162437, 189315, 192029, 175440, 144207, 101927, 87838, 94299, 97710, 89071, 63914, 50879, 43524, 42872, 44526, 33723, 23778, 20009, 17276, 36109, 49765, 67539, 81556, 88803, 93154, 101540, 111800, 122669, 163838, 237535, 273587, 261885, 264765, 287092, 306882, 316036, 304194, 282381, 259649, 239140, 181133, 108771, 81665, 71155, 86053, 69635, 44952, 29509, 24918, 28796, 33274, 42047, 36321, 30134, 33922, 49425, 46813, 48351, 56419, 69756, 73712, 80912, 85811, 82284, 94325, 91126, 79332, 76278, 68116, 81931, 85193, 68330, 70233, 73719, 68058, 63759, 78396, 70354, 59767, 64315, 62679, 60577, 54427, 59407, 76034, 90176, 86921, 83859, 95833, 122113, 143520, 165352, 225203, 295518, 393281, 561166]
9996E61166L21766M73464M07876N4640k97080l21924r6511J89042L40656J84374
9986A817469j93959m42181l99822k54109j61567r9344n3431l4512j9598j9932
9976A39014j5890j5131r931k5911m031J331p878m928J0808J0304r937o337m152
9963E7331J739L116l653O97n114l928l590p527N542N09o07j767J594l737k807
9948C7798N611O696N649l751p355l550l726r423q953J3721j687r382o902K64N476
9933B0486M3L330j2130j2588J579L890L303p672j2667j0631N950K7746J6721R008
9919C6368M66K293k063K256j1737j7200r047o851R701O289M619J3277K482m774
9905B6079J5150L619j679p149p545o536K189L30j905l241J378o434M862O715Q750
$$ y = [561166, 882932, 1356396, 1764272, 1818912, 1521832, 1199908, 1103397, 1292439, 1633095, 1817469, 1623510, 1181329, 781507, 527398, 365831, 266487, 213056, 178544, 158946, 139014, 123124, 107993, 98062, 72151, 68120, 69451, 61573, 56645, 67453, 77757, 67820, 61483, 57331, 59070, 62186, 58533, 59230, 54116, 50188, 46598, 39071, 44613, 45122, 44515, 42748, 44342, 40605, 37798, 43409, 50105, 55754, 52003, 44648, 41098, 37372, 27949, 18996, 32717, 31030, 21648, 14746, 15010, 20486, 20529, 23859, 11729, -859, 720, 4610, 7913, 241, -12426, -23057, -17107, 10639, 27360, 36368, 36834, 39127, 37064, 39320, 27583, 10383, 1336, -5515, 4186, 10475, 15094, 28371, 30853, 26079, 41229, 44848, 43169, 36020, 28475, 21939, 24128, 24458, 22553, 19312, 20690, 14256, 19118, 25833, 34583]
9890C4583r091j563Q616o601j3922k985n46j342n82l889j2515J2901O784o213
9876C635K262J3911R961Q098K850j2519L722N645m364M270J2348Q805m276p842
9862D6506m748j8402L311l22J5811J0992j3095k7670j0377M242Q971l508M71q87
9848A1295j5502q59R000p287p50J3066p336R492J0363L605J1405N419m150q713
9834B9048o684j221m948j092J4857J3382n162j9964J83o65q235j1711Q56M291
9820B935J3142J0317M621L202j329k515p318M54j3145j6337J42J0719R850M9K256
9805A7043m894J146N40n585o439L779j2265J545J7749j675o651J8084J202j2993
9791A0586O133J72o844r083M426o905k705R610N931L343k834R150m478K56j3282
$$ y = [34583, 25492, 23929, 32545, 25944, 12022, 9037, 8491, 7149, 6567, 2678, -9837, 3064, 9848, 3635, 5897, 19808, 29769, 37867, 40717, 28198, 31920, 37565, 33201, 37471, 49819, 58624, 54348, 46506, 41758, 23356, 26667, 26345, 42156, 53148, 40053, 12383, 2006, 6248, 15219, 11711, 12182, 11295, -4207, -5066, 3934, -3353, -4103, 8963, 1627, 11119, 21482, 25087, 36492, 41911, 37761, 29048, 22364, 21143, 16195, 15103, 29960, 43342, 38180, 18216, 18399, 17734, 9499, -2212, -1356, 2935, 16077, 26394, 31015, 34217, 32888, 30373, 23055, 23509, 10364, -5973, -5831, 4888, 14738, 14787, 17043, 12149, 13295, 13835, 8250, 1811, 5590, -6675, -5130, 12619, 10944, 4293, 22377, 23579, 10586, 16719, 16891, 10047, 964, 5390, -1515, -4220, 5390, 11321, 14664, 11830, 20980, 16502, 16758, 3476]
9776C476n461J314J9196O730O455O978j5287p091q801L504m728k217r606l03J2673
9761F832P679k83m557L925j0595L858P172j418R535J205N370K768q636J56M387
9746B7398N825L931j2094j0197j887N069Q17q16j3509j780L226m527Q647P782
9732A7885J2961M003j7439l463l879r944J1326J6524J868m97O38P906n421p773
9718B4695j3560j0071O423J1458J6346k851j4625j0238J749l781m37n538p316
9705g746L654N135J682K1022J2741J114q484K466k97p925p238L04l284K088K074
9690A7306q2j602k0312q340p67J3218R338N272j3926o879J688l480k906Q507N818
9675B853R472K3442J2605k5808n470m933q176J3194r506p16J1194q214q673k270
$$ y = [3476, -1985, -671, 18525, 25255, 31710, 38688, 23401, 16310, 7509, 11013, 6285, 4068, -5538, -5841, 6832, 14511, 14228, 9671, 13596, 3001, 6859, 14031, 12613, 22148, 23353, 28723, 31491, 22855, 23011, 27398, 33223, 37154, 25060, 14863, 12976, 18045, 18862, 18046, 4537, 2757, 5983, 1456, 10103, 17885, 30846, 34849, 17410, 13947, 10068, 124, 11450, 27974, 29842, 29345, 29983, 37889, 32468, 24695, 11135, 1064, 7487, 18945, 35291, 32440, 17815, 7577, 9326, 5545, 5108, -430, -7746, -4092, 1043, 2725, 23747, 36488, 37602, 29118, 31584, 31287, 23362, 16124, 16428, 13144, 15232, 17306, 17224, 15622, -4690, -13030, -13797, -579, 8759, 14031, 105, -6774, -5086, -8566, -11472, -2965, 2853, 12325, 35767, 48372, 22564, 17094, 12161, 3985, 17179, 7673, 6957, 18151, 9937, 1264, -1006]
9661a006o80O999M803J0920m959o177K559J976O710n608o900J766N80M936m125
9646A1794o675O194J311j248K339L948N517j3255r640J6703R227J2742J2243j9642
9632C1558j7642q518k300J1070P4p819j1587j3634J210J0813J1735p372J960n297
9618e749k910M935J0097N131n369p90m497j289j0620m383N252J9072J3691l608
9604A8963p870J1270K511j97k421m570N831O571K5669r782k0322o641J536l010
9590A7538P255J4568K920j2598L336m692q8l784L826j230m000N454k28j0690l416
9575A4171J225o090O386J3428j922m752o728m950O64O459j3980j8336r793J0057
9561a4161P555j6271L734J6803L71l549J9080J495j1949j0723O182J692m104l737
$$ y = [-1006, -1686, 5313, 10116, 21036, 16077, 9900, 12459, 14435, 21145, 15537, 8637, 10403, 10983, 15919, 11794, 5119, 11313, 12624, 11376, 13715, 17663, 23180, 9925, 285, 16988, 26215, 38957, 51200, 31558, 13916, 5398, 3098, 14168, 14242, 6423, -5164, -18798, -17588, -6775, 4960, -2412, -452, -5749, -8659, -3724, 6373, 11504, 6135, 5345, 848, -441, -11061, -15444, -10192, 8880, 22571, 18963, 11093, 22363, 24874, 24677, 22256, 17686, 23517, 30088, 55757, 45975, 25653, 19012, 20548, 17538, 24793, 39361, 42281, 29683, 33019, 28327, 28239, 24455, 28281, 27051, 23051, 28505, 28277, 17587, 14171, 15396, 9306, 15692, 29120, 27198, 22446, 15718, 10768, 11432, 17891, 3911, -14425, -24218, -14161, -6606, -22877, -19143, -2340, -1969, -5518, 13562, 15057, 3108, -7615, -1433, 259, -3845, -7582]
9547g582n92O815J4964m431n250P752L308p394J970N364p292p955J3126o689L873
9532I987r136n577P794N534j02l860j2839J3152J3883j5858j3332J130J1450L135
9518E361q822j7063M523Q630k080n022l781P456o37j0861o233R005Q034M554K636
9503d300o424j1919Q532N609k315L301j0174o519K210P907Q590p243O561R003
9489B819j3877k237J7767J0230K433j0682l230j0826j9005R427J0652O189p111
9476g451j304J4744J6976L242q125j693O404O325K960p098P583L656j4997j4386
9462F836j3442P432N919Q48J774J589o712k40n375M196n755o22L685n653O420
9447I00Q473o39j617r828r2J489J361L033j1198p897j262K257J95M804j844P314
$$ y = [-7582, -8174, -1359, 13605, 9174, 3924, 11676, 14984, 7590, 9560, 14924, 7632, -323, 12803, 6114, 9987, 851, -4726, 3068, 8602, 8500, 4640, -8199, 4953, 18836, 2978, -10354, -9224, 2226, 5361, -3461, -20524, -16001, -7371, -9451, -14473, -18254, -10798, -11435, -22296, -28529, -19524, -11490, -6936, -4300, -10724, -22643, -14111, -8502, -10817, -7516, -17690, -24209, -21999, -14092, -5502, -12745, -6184, 2819, -11058, -13295, 4472, 14702, 17135, 6453, 3223, -7603, -26608, -17181, -6529, -340, -7451, -8755, 5989, 22965, 26207, 18082, 16389, 22793, 29118, 32078, 24980, 32563, 36219, 21222, 6836, -6606, 826, 6745, 7593, 9367, 10956, 4244, 4004, -1371, 2825, -2930, -3552, 133, -5520, 900, 9373, 8734, 7117, -2711, -2803, -1314, 47, 3080, -8118, -16015, -17277, -15020, -14825, -10021, -11865, -4551]
9431d551R748m567q547K758r968N39J8518J1216R208n258k1352j2857k317M590
9417a2840R337N277N262O335n909j623j4614j2121p2J3464Q720J2607K992j3874
9403B941j179p111j1845O287J9635P011p493p466k4048p604J6334K410k414J0661
9389c881L840O117R571L390n948j6743j4147J3302K0763J3275J245o841o092j6886
9375I65j3577P32R118J3396M032j662n356j243M771l879q925M995n464k966J1323
9360F260j0924R200n915q211O09K130j860O093M013M227L59j824l510Q308l521
9345E434N312j704k175M159N490J917r464j288m977P418j0236J854L671l90j7498
9330a2477r89O044J3511K0716m389k0735l433m266r589K113L567O557M192Q273
$$ y = [-4551, 5197, 630, -7917, -5159, -15127, -14588, 3930, 15146, 24354, 19096, -2256, -15113, -17430, -12840, -3503, 1774, 7036, 13371, 7462, 5839, -8775, -20896, -20968, -7504, 1216, 13823, 16815, 2941, 1762, -5349, -17194, -10907, 8728, 15739, 8246, 780, -23268, -30872, -14538, -12128, -14542, -3881, -41, 6076, 15647, 19037, 13089, -3654, -17801, -4499, 16264, 29539, 30784, 23943, 17851, 965, -12612, -11880, -2762, 10634, 14666, 13004, 7648, 6405, 11176, 7297, -1628, 3367, -2097, -5063, 6260, -4664, 4536, -1379, -9590, -8981, -6851, -8711, -2618, 1395, 5622, 5981, 4157, 647, 8955, 5434, 10746, 9042, 6867, 11026, 16516, 18433, 8969, 7681, 2704, 10122, -114, 1740, 5411, 5021, -12477, -13466, -7422, 6089, 26805, 22416, 1681, -1752, -6018, -15607, -13494, -9927, -3370, 822, 9095]
9316I095Q504j1389L600J4858P33n04m094j1027j2552j0714o085J0323K2384o853
9302F279n919O815l519J299P801q424k127M238O555K337K910m276j3896M879r532
9287d580m342L340N889P117o857j566J5478Q42L034M412M678r347l232j0566n922
9272a622j1693j2860J3420k928n40K141J0055P228n43l268o884Q66k725k796k57
9257a2406L837J1808n865n839N850r39J481J2327L238P962N036j0975P267j875
9243B0907n677l929j1492j014M081n979r670N853R991l104o243L421Q313J6193
9229B1651r942o457Q413J678q892q833P478K076r334k746J0041J3574O455j258
9215B3904k2107n837N382n444j1087j500Q597P248P848n893p309l159l543J4803
$$ y = [9095, 17599, 6210, 9810, 24668, 25401, 24897, 20803, 9776, -2776, -13490, -19575, -9252, 13132, 6279, 360, 7175, 3656, 4955, 12756, 4332, 2205, 6443, 12998, 15335, 18245, 13969, 73, 4952, -4580, -8922, -5582, 307, 7424, 567, -999, 14479, 15321, 18355, 22767, 27445, 18098, 14866, 4300, -1622, -13315, -26175, -12755, -15683, -16223, -14082, -4027, 3201, 2658, -610, -7494, -6628, -9353, -12149, -12406, -8569, 3239, -2626, -8465, -2615, -3554, -2073, 10254, 13492, 21454, 26490, 15515, 22782, 20907, 15230, 11301, -191, -1205, 2876, -3103, -12773, -6920, 3071, -33, -6276, -2855, 5458, 21651, 11709, 5252, 13665, 15343, 6451, -2382, 5096, 7172, -2162, -4908, 5133, 18707, 25162, 23904, 1797, -4040, 1342, -4102, -15189, -16689, -8092, -844, 7004, 1111, -6198, -9357, -12900, 1903]
9201A903L67L008n701Q041J2207m360M4M570j3174j1062J248J0248q217J0873
9187I995P819J3406k837j939N503j0328r985K521k195q429M919N377m950j2895
9173d018m464L836J381L742J3157q376k2758J115Q200J0003J3510O425Q839P13
9159C1305j0396r492J3269N087o874K956m728n358j776L680L142p257p057j3046
9145f545J0659l658j3654j2225J0114J2711j873J1590K593J394P062L653j9726
9132B095k3475L483J6226L194K952P131M962K196J3462O459j322n597l482j239
9118B7045q754m172j1090J846R504J044m83m927p294J1899J841L711j791q297
9104A0082Q615P314o421Q709J2333J7022o675j4645j7293m211M522P330M592P760
$$ y = [1903, 2270, 5278, -423, 7618, 19825, 15465, 15509, 20079, 6905, -4157, -2909, 7339, -878, 9995, 17814, 31220, 28383, 26444, 31947, 21619, 11634, 14155, 11960, 3531, 8450, 13827, 8877, -4018, -8482, -4646, -3265, 477, 13634, 5258, -17500, -16385, -8185, 1818, 15328, 21753, 30592, 31305, 20909, 11417, 24686, 29773, 22899, 25855, 21127, 15769, 13993, 17673, 20815, 13558, 6501, -6545, 4114, 456, -13198, -25423, -15309, -2598, -4471, 7119, 9712, 11106, 18168, 21821, 2095, -21380, -17897, -1671, 1523, 4475, 11606, 16568, 18764, 32226, 38685, 37363, 31766, 28284, 27045, 18291, 14119, 3029, 4875, 14379, 15423, 14940, 10013, 2719, 14618, 16459, 20170, 18379, 10082, 18697, 26011, 19590, 28299, 40632, 57654, 50979, 36334, 19041, 14830, 19352, 26682, 31274, 39034]
9090C9034O282N40J0421N136L275N307K738J7387L779n81N467M458M528J3275
9076A21046K0737K2031L3012K7563K2925J4925K6668O6323R2992R9527J43432
9065F91181K26500L56716N33463R50896J803088L399981N816786M442079l130417
9056A5090273n983455l868233j998680j067159o04882l80779k50255j80143j44740
9047F11947j00722p5059o4214m9585n5299k9028j4192j6018l3813j9706l829j1038
9035A39444j893p197r052k2332j1662N817j5358j6409m228n07q741M476l910k566
9021D5882O871j382k0028P880J4137j3714p944Q640j2069j4048Q930Q823o350
9008B5628n96J3147j373l251l161j408j0536n329k942P737j317M733L656Q568
$$ y = [39034, 45316, 45856, 56277, 61413, 64688, 69995, 72733, 90120, 93899, 93318, 98785, 103243, 107771, 121046, 141783, 163814, 196826, 224389, 247314, 262239, 288907, 355230, 448222, 547749, 691181, 917681, 1274397, 1807860, 2758756, 4561844, 7961825, 13778611, 18220690, 15090273, 9106818, 5238585, 3239905, 2172746, 1567864, 1187085, 936830, 756687, 611947, 511225, 436166, 371952, 322367, 267068, 238040, 223848, 207830, 174017, 154311, 150482, 139444, 137551, 130354, 121302, 98970, 87308, 93125, 77767, 61358, 57130, 56623, 47882, 52358, 48448, 45882, 52753, 51371, 31343, 39223, 53360, 39646, 31702, 40342, 28273, 14225, 23155, 31978, 25628, 25032, 38179, 36806, 33555, 30394, 28986, 18450, 13121, 10179, 17916, 16599, 21332, 24988, 33556]
8994C3556r585k1157n073j840R939P883l088R966R418K4423k653j2596p552m810
8980B6831O899K729r964j3710j5181j649o174P492J1920J2759P211J112j0413
8967A9862n513J40K324J3227q28j3500j4654P848J4214l78p273n973l669J0917
8953A6744n516o081M346J376k893L495P424n339j743J485O87p735l138r60J0893
8938A3045p25J0407k916K310P551J451j2126j1247J5145J790p86n827M762j2664
8924A0170j1091J2807l162n360o679l801k344j3393K980N272L808J5138J3269
8911A7614j0509j1667j1965K062J5388M949J0432R781m014r303j317n598P28P664
8897A4245L559n47K911k539j3116k528K623k138K063M098J3646M02q316Q483j299
$$ y = [33556, 23971, 2814, -2259, -4099, 5840, 13723, 10635, 20601, 30019, 54442, 51789, 39193, 31641, 26831, 33730, 36459, 26495, 12785, -2396, -4045, -10219, -2727, 9193, 21952, 29163, 30275, 19862, 14349, 14489, 16813, 30040, 29212, 15712, 1058, 8906, 23120, 22742, 15469, 9496, 5827, 16744, 11228, 5147, 9493, 10869, 7976, 11471, 18895, 13556, 11813, 13298, 13985, 6250, 3112, 2152, 13045, 12320, 22727, 19811, 22121, 29672, 31123, 18997, 7750, 22895, 24685, 23899, 18072, 22834, 10170, -921, 11886, 8724, 3364, -3315, -7116, -9460, -22853, -19873, -14601, -10793, 4345, 17614, 7105, -4562, -16527, -14465, 923, 5872, 16304, 26085, 22071, 12768, 11451, 5853, 6581, 14245, 17804, 17257, 20168, 17629, 4513, 1985, 4608, 2470, 4533, 8631, 22277, 22679, 14363, 22846, 21547]
8882B1547k3221p892J3311P239j7330k59J7425J1687L652m366n364J626J98j2544
8868E709o454p318j9906K2020K5201L189j0818N699n84p968l690q979k0253J412
8854b2740J6218P419o51q139k807N902J3048Q860j1560r944l95R764J62n472k342
8839b677K46j57Q864J0352J402L20o018K188n645P234M337l215R326R002K1407
8824E6966K5132P075P18K0950M8151Q0057Q5505N2692l9172q5125p3880n5574
8812A23495k6713j9283k0027l229j7032j3196r22j5295j305j271j023R39k274
8799B864p88J5952Q259m108M824o260k1571j3341J1986J1717o619l927J6930R015
8785B4933j4754j5982j043Q593J21k02j1701j8783q49J2617K2244O192j2355j5969
$$ y = [21547, -1674, -9566, 3745, 10984, -6346, -6605, 10820, 22507, 26159, 21793, 16429, 18055, 18253, 5709, -745, -8063, -27969, -5949, 19252, 22441, 11623, 17322, 16738, 8770, 5080, -3899, -24152, -22740, -6522, 897, 246, -7893, -10700, -4798, 8250, 17110, 5550, -4394, -4789, 4975, 5137, -335, -2677, -2431, -2588, 6276, 16628, 18030, 18350, 12332, 14520, 8875, 16109, 20446, 17231, 26557, 35559, 56966, 82098, 89173, 89891, 110841, 158992, 239049, 324554, 377246, 338074, 252949, 179069, 123495, 96782, 77499, 57472, 54243, 37211, 24015, 23093, 7798, 6493, 5222, 4199, 5138, 2864, 2076, 18028, 26287, 22179, 27003, 20743, -828, -14169, -2183, 9534, 2915, -1012, 15918, 24933, 10179, -5803, -6846, 1747, 1868, 1666, -10035, -28818, -29667, -17050, 5194, 11386, -969, -16938]
8771a6938R082m752n362N843K102J2524R685N024p332j2718N770J059P654j3330
8757a689K081L724O17L143o458j2495p93J7679R853O067q375k239K096L167j4540
8742A838R056P934j879o325L361J0716j0527o096P141p706R55k576q452L993J374
8727B807q93j3827J854J5476J1092o923K205j811J572j2197p057j1468P497J5817
8713D144O762p342k967M004L820q954m055K788N379J1782l932J36J431j595O070
8698A7471j2793o883N361J0631J2209j4736j0607J765R588L71k942m594K756o919
8684F78n595J5849L183j4794k531k704o427J0722J5438L914j7583k318l426O444
8670H50L060J2746L322r337j0791k708J514M42p569J320Q751N667o38L358n683
$$ y = [-16938, -7856, -12608, -17970, -12127, -10025, 2499, 12184, 17208, 9876, -2842, 2928, 3987, 11641, -1689, 392, 4116, 4733, 7876, 1418, -11077, -11870, 5809, 15662, 21729, 13354, 11115, 13211, 16378, 1838, 10894, 18828, 16949, 10624, 13985, 24701, 14174, 8078, 15219, 7513, 8468, 5892, -2560, 1433, 2807, 1914, -11913, -10059, 5417, 16509, 9586, 11791, 9980, 11552, -645, -7702, -19170, -11673, 4144, 10906, 3564, 597, 4601, 8421, -533, -4588, -1800, 3579, 15361, 11429, 11565, 12996, 11401, 17471, 4678, -2205, 3156, 13787, 25996, 11260, 653, 2418, 12006, 12377, 9435, 4841, 7597, 678, -4917, 10932, 14115, -679, -3210, -5914, -12341, -1619, 13819, 17733, 150, -2168, -5594, 850, 3910, 16656, 19978, 10641, -150, -2858, -1344, -902, -8471, -7151, 1600, 7267, 6629, 9987, 4304]
8655D304M543R227J3752m278q788J217j6734q835K560L807n404O36o32j789o636
8640a3050M569Q57l350J7352J5246k564o562J1298o554j6540j650R829J8579N907
8626C3367k2J284l0K858q341J3169p57J289m384k758P117j1816r155L39j0524
8611A1636j0356j2684l212J4646K547j7923Q18P142J0117P136j879J611L051j0379
8597B271J89j638K421J2958Q960P37L533o889j1356l361Q756R723k90l463p12
8582B1839n225l515J0909L068k695j7018o505l157j0466m208M280J8063P803L224
8568A6397p584r097j3944r033Q35J6624K4303m292r341L110L031j0313N252J5074
8554B1022o84j9282N411o629q519Q928q104q865K582R371M997O56q46Q590K901
$$ y = [4304, 8847, 18074, 31826, 27548, 18760, 19977, 3243, -5592, -3032, 775, -4629, -3993, -4625, -6414, -13050, -8481, -7624, -10974, 6378, 21624, 19060, 12498, 23796, 17242, 702, -948, 8881, 27460, 33367, 33345, 34629, 34599, 37457, 29116, 42285, 41528, 42817, 38433, 35675, 42792, 30976, 21821, 22160, 11636, 1280, -11404, -14616, 30, 2577, -15346, -14528, -7386, 2731, 9867, 7988, 9599, 12650, 2271, 2460, 822, 3243, 16201, 25161, 25898, 29431, 22542, 11186, 7825, 16581, 26304, 26014, 22551, 21839, 16614, 13099, 24008, 27076, 24381, 7363, 858, -2299, -12765, -16973, -12693, 5370, 13173, 16397, 8813, -284, -14228, -23261, -22426, -5802, 18501, 14209, 4868, 7978, 11009, 696, 5948, 21022, 20338, 1056, 6467, -162, -8681, 247, -7857, -16722, -14140, -4769, 228, 884, 38, 8628, 11529]
8539A1529N274J9109K488N66j4171j3806k1285J0440K0175n310o112o065p909
8526e077P743N311Q332J530R64M203j0266j0955n842j2484J135J1357R657j0432
8512d824k215K750m020J0584J17q02o135J324l028p38R631J2933J0787l056l968
8497A9340q409n410o430l132Q857K437q401k558p36p587l786J3936O412J0756
8483A5289O860Q92l979j4650m820K350O844m951R806j538j0262M673J7662l237
8469B0939q040n178n839m909j4033Q924Q596j0861L723Q791O92l58K371p436Q227
8454E609J1916q16j9530o932k858M575J5248O028n428L776n131l049o739k2933
8440b6264l433Q941J2128J3998J156k0811j3122J9146J9233M522j4201k800J6815
$$ y = [11529, 16803, 35912, 38400, 38966, 24795, 10989, -10296, 144, 20319, 15009, 8897, 2832, -5077, 2666, 7977, 16309, 17839, 18803, 23006, 12740, 1785, -4057, -16541, -15406, -4049, 5608, -4824, -7039, -4289, -8309, 2275, 2392, 1590, -4545, -3221, -6249, -6987, 2644, 15577, 26364, 23308, 19340, 10931, 5521, -909, -4041, 4816, 7253, -1148, -3706, -4442, -12029, -15815, -1879, 4533, 15289, 22149, 23041, 19062, 4412, -408, 1942, 8786, 3835, 13641, 12103, 1841, 6514, 24176, 20939, 12899, 7721, 1882, -3027, -17060, -8136, 460, -10401, -6678, 2113, 2805, 2447, 4818, -2618, 5609, 17525, 16709, -2821, -9753, -12611, -8036, 7212, 13240, 7812, 11588, 6457, 3408, -3331, -26264, -29697, -20756, -8628, 5370, 6526, -14285, -27407, -8261, 10972, 15494, 1293, -1507, 15308]
8427A5308o446j2579M93N482l066M440J0016j5620r586m825J8865K1097K861n706
8413B0734o809r194k1806M734N916J4559j984j2837k717m175L33J7156M048J165
8399I123n746p001o534j0884j2175l425M334M672J325l35N427j76J0361O146L763
8384a125M286R814l114j0659O108K1169L014k2342l70K041l139m435r18L532J2562
8369A6424N41M91l409n140O389M705p648j0355j3780J4225M016r91K098K291j5105
8354e248R002N022p151L148O267j46q489q930J0402R321J5063O678j0487j3156
8340A1296j6381n840K073P88n221N254K834o360P093R966j0572R143M914N132
8326A4119M594j875r463p946J691n208k456p0M618r185r963k404J825M592Q766
$$ y = [15308, 8862, -3717, -3224, 2258, -808, 3632, 13648, -1972, -11558, -16383, 2482, 23579, 26440, 20734, 13925, 4731, -17075, -12341, -6425, 8134, 6150, -6687, -9404, -13579, -13246, 3910, 7958, 9123, 3377, -3624, -10158, -21042, -33217, -36642, -32308, -27636, -26311, -26646, -21219, -21395, -11034, -4888, -1125, 3161, 12975, 9861, -798, 5310, 26479, 29493, 7151, 6781, 8822, 5683, 1248, 330, 3862, 16424, 16965, 17456, 14047, 8907, 15296, 20001, 12353, 1998, -11782, 2443, 6459, 5468, 7566, 9857, -5248, 3754, 8776, 1625, 4773, 11040, 10894, 2405, -6525, 3877, 13198, 28261, 34939, 24452, 11296, -5085, -10925, -8852, -8064, -13285, -8031, -5197, -11557, -4464, 5502, -5070, 4073, 8987, 14119, 18713, 16838, 7375, -571, 1120, -4088, -6544, -6614, -1996, -11181, -21144, -23548, -21723, -17131, -8365]
8311h365L867j0729p031P898M559m528o054N634N384P852L426N299J1875Q483
8297B7570l623p325j0428p916l400r280j117J594O130P378M442Q127J5845m891
8283B3106j7120o256l561Q752J4100q935j2920q069J8273L922P46r242o904L259
8269h49Q746r21m279o12p71M092j626J420M173O456O901p247l344R961m654o73
8253A6773l133r430J002L095j117l352o132k423m376O382L070j76n010j214P065
8238A024q397m265P483J637J622O419o239J1371J0811p616o588M807k582J0171
8224A9658J0869k4077q989j599J85K32J8916N63p678m732p692q411m24l50R010
8209d519Q654n168m711k836k49p787N09j1307Q114O697J49K522k710K055J3188
$$ y = [-8365, -4498, -15227, -22258, -14360, -9801, -14329, -20383, -14749, -9365, -1513, 1913, 7212, 19087, 27570, 23947, 16622, 6194, -1722, -5122, -14402, -15519, -13925, -7795, -417, 4025, 12152, 27997, 23106, 5986, -270, -3831, 4921, 19021, 10086, -2834, -10903, 7370, 11292, 12038, 2796, -4108, -849, 7897, 6976, 2697, 2085, 1314, 5406, 3780, 5200, 9373, 15829, 22730, 15483, 12139, 22100, 17446, 16773, 13640, 4210, 5212, 8307, 7190, 3838, -2294, -4717, -9093, -2711, 359, 183, -4827, -6041, 1024, -7373, -11638, -4155, -2518, -896, 5523, -716, 10655, 21466, 13850, 7262, 12069, 9487, 19658, 30527, 6450, -2539, -4138, -3953, -3721, 15195, 15758, 8080, 3348, -4344, -12755, -13179, -13529, -4519, 4135, -1033, -5744, -8580, -8829, -16616, -16107, -27414, -19300, -12603, -12454, -9932, -12642, -10587, 2601]
8194B601O338P586l243J978k551j6979l975k488M577L742j5393R458J1212j459
8180A404j889K062N235Q4P974R964K875p716j6286j1022J406l840M526J6187p37
8165A0227l782o165o791L001O355N164J5835k056k2114n561q65n03J5517m436
8151C826j8590N934J4936m427k510j369m022K005k375R67j316R367L211k107k764
8136G66R141O448O998m340l393j9621n439P568M80J7067J2819k758m517J882q139
8121A4962m932Q411O389j9102m664J6447o267j0525m908j0458R180O200Q722J6249
8107B5704l845j4224j2653K496m834L530m854j326J2121N922J3731l953j934K595
8093A8476j6213p436n077R01o581P814N932O620O417l034N326j2073M375k398
$$ y = [2601, 8939, 16525, 13282, 15260, 12709, -4270, -8245, -10733, -6156, -2414, -17807, -8349, 2863, 1404, -485, 1577, 6812, 6896, 14870, 24834, 27709, 19993, 3707, -7315, -5909, -9749, -5223, 10964, 10227, 6445, 280, -6511, -3510, 2845, 8009, 23844, 21788, -326, -5887, -6752, -7255, 8262, 3826, -14764, -8830, 6106, 1679, -831, -2200, -6222, -4217, -6592, -5625, -6941, 2426, 5637, 3530, 766, 9907, 16355, 23353, 19013, 15620, -4001, -9440, -1872, -1392, 15675, 28494, 25736, 21219, 23101, 14962, 10030, 18441, 24830, 5728, 1064, 17511, 11244, 719, -4189, -14647, -5467, 733, 9455, 25704, 21859, 7635, -5018, -2522, -7356, -3826, -8680, -10006, 2115, 8037, 21768, 17815, 15881, 18476, 2263, -5173, -10250, -9349, -15930, -8116, -2184, 4436, 10853, 7819, 13145, 1072, 5447, 3049]
8079C049J6224O656q275j4126J479J014j4527N737P412j706M668k750j730o098
8065b973l906J431K873Q747L630O32R454m379q990r925P49M538j2135p877J8959
8050H28N251j6363R441q759J839J2699k819q771m570p158J871J0464J862J2613
8036H428j985k403P815p25j798J277j1546j5211k706J8614Q742M451M911J120
8022A8984j4844j683K108J693K718J0476L785j1800O355R103j0340m511O878O122
8008B5044j3369q622j0511j2131l824p662J0630O001m475O515J6205J3842R507
7995B7150p54N95j1041o483n538q202m077j736j6176r77P967L252N809N317O855
7980A961K1988N806Q899O95m839o832k750m25j5269L296P10r493j0442R835N697
$$ y = [3049, 19273, 25929, 17654, 3528, 5007, 6021, -8506, -2769, 4643, 2937, 7605, 4855, 3125, -2973, -6879, -5448, -2575, 6172, 9802, 10434, 19888, 15509, 6519, -3406, -2657, 1881, -10254, -18131, 828, 6079, -10284, -843, -9602, -7763, 4936, 2117, -6654, -11224, -18382, -16511, -6047, -4185, 8428, 6443, 4040, 11855, 11130, 9332, 10609, -937, -16148, -18854, -240, 8502, 12953, 17864, 18984, 4140, 2457, 4565, 6258, 8976, 19452, 23237, 11437, 17792, 26895, 16555, 12044, 18922, 25044, 11675, 3053, -7458, -19589, -23413, -31075, -20445, -14444, -18919, -12404, 3801, 17643, 27150, 26396, 26991, 15950, 9467, 3929, -4273, -8350, -10086, -26262, -27239, -19272, -16020, -10211, -4894, 1961, 23949, 29755, 38654, 39349, 34510, 27678, 24928, 24503, 9234, 12530, 13240, 3747, -6695, 3140, 8837]
7965H837o649M975l064j2431M153O601k365J074O14J338M310o363M571l831l532
7950a762J0627J5517O114n589j0845L280L76n984o687o408l569J169R131J0376
7936A5746J884n209j837j3391j1036j838m213P307J6607P947N021N41m218m079
7922I232m446M374N948Q962Q330K014j49k027r959k99j3043l413N981l123l528
7907D854J1810m229p994J670r817r165J4369J2496J0695j2o502p376K45n778R41
7892F207j399q184R962P926o514j9213j0895J1731L3146L902r296J609l702j2349
7878B931k868O062j52Q658j76p978o013o801l33P39Q192k768m938J0827N894j5200
7862c924J2366o76k4665j066p25K961L872J3860J4272J099j4155j2253J2033Q931
$$ y = [8837, 2188, 7163, 4099, -8332, -4179, 2422, 57, 1131, 1745, 3083, 7393, 1030, 5601, 1770, -1762, 8865, 24382, 30496, 24907, 14062, 17342, 17718, 11734, 5047, -1361, -4930, -3761, 5370, 15746, 17630, 12421, 10584, -2807, -13843, -15681, -19894, -12587, 4020, 11967, 16988, 17529, 13311, 9232, 4786, 9160, 15108, 24070, 32400, 34414, 34265, 32238, 22279, 21980, 8937, 5524, 11505, 8382, 4854, 16664, 12435, 4441, 6111, -3706, -12871, 1498, 13994, 24689, 24677, 18175, 10799, 11044, 5266, 6207, 4808, -3376, 6586, 14512, 7998, -11215, -22110, -10379, 22767, 26669, 17373, 18982, 15280, 2931, 63, 6125, 5973, 14631, 14455, 6477, 464, -6337, -6670, -5931, 2261, -507, -5445, 5382, 11276, -3924, 8442, 7766, -16899, -17965, -18690, -15729, -11857, 2003, 16275, 17374, 3219, -9034, 2999, 11930]
7848A1930r078j7849j5645P482P148Q189J1493j0863j4433j701J2828J5535Q500
7835A3536N214j0232p995j267R814K506k100k706J583J1066K697k0833r965J3259
7821D577J0834j0926N72k342o070k735Q085j822o039r521o676r9r279m572J4957
7806b1056O555Q776R414l794r494K089P155N254j3334j4627R26P163J5433L905
7792D365m368P24N252j852m023N981Q146J3426j3687k2938j2983Q68J4348k613
7778i354j4000q472Q859O030K523R199N621R557J481p603q073j3949R682Q996
7764D97M40k351L594l111P876O81o414o673Q47p07K99j0119M923J9106m42j96
7748H250m845k580k660k600J0416l10J7124M583j3337o302M447o08l030P640O19
$$ y = [11930, 2852, -14997, -30642, -23160, -16012, -7823, 3670, -7193, -21626, -23327, -10499, 5036, 13536, 18750, 8518, 523, -744, 9070, 11576, 9476, 6770, 8353, 19419, 22116, 1283, -8682, 4577, 15411, 4485, 5057, 2715, -3355, -6090, 1995, 173, -5866, -15387, -22063, -22162, -31441, -36013, -21056, -14501, -5725, 3689, -105, -9599, -7510, -355, 4899, -8435, -23062, -22136, -14973, 460, 4365, -3, 721, 5973, 4121, 98, 6079, 14225, 27651, 13964, -8974, -21957, -21089, -6741, -9354, -23354, -31826, -22967, -16937, -14414, -5215, 406, 9963, 11444, 3841, -4232, -18181, -8499, 497, 937, -1414, 2180, -931, 6945, 7626, 1212, -5461, -4614, -5321, -5022, -15141, -10218, 8888, 8446, 8250, 3405, 825, -1835, -4435, 5981, 5671, 22795, 27378, 14041, 7739, 12186, 11578, 8548, 16188, 16807]
7733A6807j0726j8139m929L216J1603J51Q123J1817l116K170Q636m116l3541q294
7719b0338J4227p114n922j769P780J0634L845q594j509N006j1548j6406N538N702
7705b0468j790j277M765J3279R900m07p988O987L630p746j0839M272J2437L249
7691H004M826j2228n221j591K807L22p062n417j4771J6788J7322n33J2000J718
7677A6964p213M621N781k19M071m883j8528J054Q436O081m303l246r253Q365Q033
7662A5761O275m624j1613q712M499O578J3493j01j6358l108M611O4N759M141j0730
7647E935j4003J7112J9708k083q402Q34n125j1461p755L07J433J1630J1073o149
7633A3054j5663p533R978m097K802J4200o162O683L730J1327m255m36k0627j1221
$$ y = [16807, 6081, -12058, -16987, -13771, -2168, -2017, 6106, 17923, 14807, 16977, 25613, 21497, -12044, -20338, -6111, -13225, -19147, -20916, -13136, -2502, 1343, -7251, -8760, -3754, -15302, -31708, -26170, -20468, -22258, -23535, -18770, -5491, 4409, 4002, -3986, 3001, 6631, -1115, -11954, -7682, 4755, 8004, 12830, 602, -4619, -6210, -3403, -3081, -10143, -15560, -30331, -13543, 3779, 3246, 15246, 16964, 9751, 14372, 20153, 19934, 24005, 19122, 594, 1648, 10084, 16165, 11862, 8616, -637, 7728, 15761, 22036, 17412, 5799, -2913, 1586, 8164, 21657, 21556, 5198, 2090, 6701, 6765, 12524, 16665, 5935, -8068, 9044, 28752, 26669, 18267, 19101, 13976, 2515, -5240, -4933, -3500, 8130, 19203, 13054, -2609, -10142, -164, -4261, -1459, 12741, 6579, 13262, 16992, 28319, 24064, 23628, 3001, -8220]
7619h220J557M714J450o107L205M958l292j4412p995M00j608L556N359Q635N164
7604b636J0542O806m920J844j0276j391L095J2085n807J792j4032j8253M449J4979
7590a723O623Q326r30L374N040l453o533l810l18L217q991K85N210k841m015r2
7574f31K289M228p999j3623P567R761k110j2968K012J717J6492o381j1757p889
7560a9292q906J4186K1897l654j7275r101L917M682K2155M126J347j2194p136
7547e248j876j6480J6353K1400R893j3644j7568j642R660M943L282j397n701r445
7533g470P345n798O05N433L216k146o106o109p145m127Q458J2780O668j3440j705
7518i541R411M74p086l608k588j623Q146P661N99r126K773j0349K662m351k943
$$ y = [-8220, -6663, -1949, -499, -6606, -3401, 1557, -1735, -16147, -24142, -23742, -25350, -21794, -16435, -7800, -2636, 7906, 14712, 9792, 11636, 1360, -31, 3064, 15149, 9342, 11134, -2898, -21151, -16702, -1723, 4900, 13226, 12296, 15670, 20710, 17257, 10724, 6914, 6596, 9813, 822, 1107, 6317, 3476, -539, -631, 1658, 5886, -2113, -15736, -8169, 1592, -518, -13486, -11474, -9757, 6735, 354, -11403, -19292, -28198, -14012, 7885, 4231, -13044, -22145, -18228, -13546, 8609, 12735, 14082, 1888, -5248, -7124, -23604, -7251, 14149, 24042, 10398, -7170, -8812, 848, 5791, 9073, 7676, 1975, -7470, -125, -5923, -5318, 115, 3331, 1185, -4921, -11030, -18175, -22302, -13844, -1064, 5604, -7836, -9541, -130, 344, -6742, -10350, -12938, -14561, -6415, 1246, 1845, -7281, -4508, -14857, -12195, -16546, -19489]
7503a9489J0922J0991K564J059j5212K006N90J1146N559m441j3515N11L26K407
7489d576p01J2473M415j0371o985l614Q538m432q010N726P916J6061m554j7582
7475e696q879K491K042K619R008o566j1224J0951M324K450O602N483m249m204
7461E152P989J331n891l611k126l46j683r22m230l30k117O59J2798O349j738m525
7445F759M922O386J733j2385j7114j1243J2585J630j5233O004J9160M275r086
7432a607J766L02NN209J453K169n511M8m622L30J6858N07o702j327m798Q044r31
7415A1193R313O939O008q654p953j3168j1379p352N018l711K976o914q08J0768
7401g724Q27M60M737o061j3201r053Q984Q256p731O51K0852J72l258l276j1887
$$ y = [-19489, -8567, 2424, 4988, 6047, -9165, -7159, -6569, 4577, 10136, 5695, -7820, -7309, -6983, -4576, -5277, 7196, 11611, 1240, -5745, -9359, -821, -5253, -13263, -7537, 379, 16440, 11886, -5696, -14575, -12084, -10042, -7423, 1585, -4981, -16205, -5254, -930, 1520, 8122, 13605, 9356, 5152, 13141, 14472, 8581, 4970, 2844, 2498, 815, -107, -4337, -4667, -6784, -6125, 6673, 13022, 11284, 6759, 11681, 18067, 19800, 7415, -9699, -20942, -8357, -6727, -21960, -15956, 3204, 7479, -1607, 159, 461, 466, 5675, 7128, 9297, 3786, 3834, -788, -458, 16400, 16907, 10205, 8878, 4080, 12124, 11193, 20506, 27445, 33453, 24799, 16846, 3678, -7701, -15053, -10035, -13746, -10770, -17684, -18492, -7724, -6897, -6437, -1700, -7761, -20962, -30015, -21031, -12775, -20506, -19855, 997, 1169, -2089, -5365, -17252]
7386a7252j711O812P613M986L269r486n514M150O628L468J471n955j4170P99n66
7371a5458P094J8704k55K736Q786J317j2241j7427k327R467M104k171j1950M875
7357d746O472k106p172P30K214j1837Q626J6501o948M149k938j708l152J1212
7343I297K307n863Q981l963l975m835q365N573j713j4980q49J0205J008n83J000
7328f755l587q181j720K370l25Q036O49m610J7253p028p212Q150N708j486o30
7313F32j1420j3823L228J0788R873L857J041P493n890n109K632M502p546p75R289
7298H772M187m242l144j0615k841Q53J4618P678q434p109j239k345n786R898O938
7283G189K295n128k894j0618j828O735l990J416R301O278j3699j309O525J0147
$$ y = [-17252, -18963, -12151, -4538, 448, 3717, -5769, -11283, -7133, -505, 2963, 4434, -1521, -15691, -14892, -15458, -8364, 10340, 10085, 12821, 21607, 22924, 10683, -6744, -9071, 396, 4500, 2329, -9621, -4746, 1726, -380, -7552, -6822, -4608, -16445, -7819, 8682, 1734, 5883, 2945, 1237, -1915, 9297, 11604, 5741, 14722, 10759, 6784, 1949, -6416, -843, -2556, -17536, -18385, -8180, -7172, -7755, -6755, -10342, -18523, -20243, -17873, -18198, -10162, -9513, -14123, 3130, -3898, -11110, -2960, 2748, 1262, 632, -10788, -24611, -21383, -10595, -722, 3135, 4176, 11669, 5779, 670, 3302, 7804, 258, -517, 8772, 12959, 8717, 5573, -5042, -7883, -7030, 7588, 15266, 6832, -277, -1516, -3861, -9647, 251, 7189, 9484, 4356, 1462, -9156, -10984, -4249, -8239, -6823, 2478, 8756, -4943, -6252, 273, 10420]
7269A0420q842j1412n356J0408R114p246L951J6565m534j4491j0965p03J2068
7256a023K836l539q621K221J259j68M564Q757r580m533m758l942L31K907K996
7241a0293k39N118J6771L914r676R036m438J116P616m361K382K559P636r919o052
7226A1170j1718p799m308K083J2700n050l483o331J002J2779k206L457j830j531
7212a065o680l410l332J055J625l391J0645R342r477j0024m108l224P674K6922
7198A2552k943j5174J2103J5646k438k506q330j6073q546M565k323O249l056p793
7184a8067q2L104L476L146K228N908k436m717L642P057J3348J4358K711j7904
7170A5772j2535o247J1004O357Q332n927j1943m367j838N264j6443j2949n076
$$ y = [10420, 1578, -9834, -15190, -4782, 4332, -2914, 1037, 17602, 13068, -1423, -12388, -13091, -1023, 1813, -1726, -10347, -8126, -6867, -7035, -2471, 6286, -3294, -7827, -12585, -16527, -16196, -13289, -10293, -10532, -5414, 11357, 15271, 5595, 14631, 10193, 11309, 18925, 14564, 16946, 19505, 27141, 17222, 11170, -548, -8347, -12655, -10572, 2128, -2922, -6405, -12736, -11734, 1045, -1161, 2296, 466, -1065, -7745, -11155, -14487, -13432, -11807, -15198, -4553, 4789, -4688, -14712, -18820, -22044, -14370, 12552, 9609, -5565, 6538, 22184, 19746, 17240, 8910, -7163, -15709, -11144, -13467, -7218, -10274, -18067, -18149, -15045, -11569, -8423, -6195, -287, -2723, -7440, -3798, 3259, 16607, 30965, 33676, 15772, 3237, -3010, 7994, 14351, 22683, 16756, 4813, 446, -1392, 3872, -12571, -25520, -30596]
7157c0596P688J8436N354L291o946k26K36o980p40P319m140M031l513j3906Q298
7142a2394q890K755j715N759N518J1081J0196J8149R179k2250j6983j3604l532
7129a6731N836J9295j717m671O126o284l289k021m276K3j589K969Q577k296n569
7114e617L870j128N237Q79k744N828Q558Q4j5959j8038r184J7110K083q814j167
7099a9002Q964M352R424N39r413k812P987J7205j0837j0895R949J3530L36O055
7085B5382K973J896o989k226R743j1855j0623n290K497J6639o012l589r421J741
7071D866k353n793m037L933N427j1118m597J2275o914o241L117L019k103l292
7057a3811q446j6935R832O132J269M397J692J1112N992k29O080j3929K994M16
$$ y = [-30596, -22908, -4472, 882, 4173, -2773, -2999, -2763, -9743, -10483, -3164, -7304, -3273, -6786, -20692, -12394, -21284, -18529, -20244, -14485, -8967, 2114, 12310, 30459, 39638, 17388, 405, -13199, -16731, -10895, 8400, 6683, 2012, 8138, 1854, -1435, -3456, -7732, -7709, -9298, -6329, 2248, -48, -5617, -1747, -2875, 2362, 3241, 497, 6325, 14883, 14967, -992, -19030, -28214, -11104, -9021, -17835, -19002, -10038, -5686, 3738, 4277, -5136, -7948, 39, 17244, 6407, -4488, 5461, 18991, 19327, 25382, 28355, 30251, 23262, 21036, 30779, 18924, 8301, 3011, 5508, 22147, 16135, 12546, 3125, 4866, 2513, -3280, -7317, -3384, 2043, -9075, -13672, -1397, -8311, -14552, -11435, -8416, -10519, -13811, -22257, -39192, -29360, -23228, -21959, -17562, -15870, -4758, 1234, 1005, 7085, -6844, -3850, -3434]
7043c434j689M44j0215r150L462K249R479R211Q546p672N794K844o109j3520R553
7028b07J461q91k320o441J0302k805L843k933o308J1542J535k378O528L637J008
7013A5573j289j3138n753N18N643j922o237J735O032j2919N587j962j0880J726
6999a7286Q466P095n642N020O418k675n995N31l185k0912Q8J3351K42J0974M950
6984A440N999j544j1637l622P287L059j575n039p151J488K003K317M920q151k464
6969a2670P395J095j1985k120j3667N47Q144N514K695O474k472L435R203J261
6955B849Q043p080k986J16q797r396L923J6683r33j040P533p142O827k702m173
6940A725o619K197M149J6210q639j4772Q68K837K176j154K891Q367j0400j0720
$$ y = [-3434, -5123, -4679, -14894, -24044, -20582, -18333, -8854, 357, 8903, 1231, 7025, 9869, 3760, -9760, -207, 1254, 363, -1957, -8398, 1904, -901, 2942, 9, -6299, 5243, 6778, 4400, 10928, 14565, 15573, 14284, 1146, -4607, -4089, 1554, -368, -6605, -4870, 1162, -11757, -6170, -8132, -19012, -17286, -8820, -1725, -7367, -2347, 4071, 1396, -4599, -4068, -7253, -28165, -28077, -14726, -14484, -3510, 1440, 7439, 5895, -5742, -9364, -2077, 982, -593, -5632, -12783, -11295, -9292, -6975, -2055, -10206, -12670, -5275, -4180, -16165, -18285, -31952, -31405, -23261, -17747, -15052, -8578, -11050, -7615, 1588, 2849, 10892, 3812, 826, 942, -7855, -17251, -13328, 3355, 2422, 1382, 8915, 1773, 8600, 5898, 1725, -4894, -2697, 1452, 17662, 9023, -5749, -4881, -2044, 132, -1022, 1869, 10236, -164, -10884]
6926a0884j2409k307J1104K0853J6187K045K767j6094k087j871o401K103l509
6913e03j923N749P971m898K809k246j212j6312j3180l58J4910N391Q400L153m01
6898G350n358r674K334k597j473O386K2075m511j1348o115k594r831K0850J536
6884G030R122L174q584j078p954j2218K082K1n258K242j213L788J344n797J944
6869a1355j305k797J2508J7097p408j0031o019K796J1495K162j2486p205J1917
6856f31R305N733j8055n162R081r707M077J5086R441j4993j4001m31N031J5685
6842A0459L409j6584k4938m37J6944R516Q490Q63l852l716j1548j872L747p76
6828a0295J989J5555J650J5386o094q612O463j1832q103K204J2756J5615m841
$$ y = [-10884, -23293, -25600, -14496, 6357, 22544, 24589, 27356, 11262, 9175, 7304, 903, 3006, -503, -2426, 3323, 11294, 6396, 9205, 6959, 5747, -10565, -23745, -24103, -9193, -3802, 4598, 7751, 7350, 1992, -7682, -5348, -7945, -9418, -3032, 19043, 14532, 3184, -2931, -5525, -15356, 5494, 7030, 16152, 19326, 10742, 9664, 1710, -10508, -8426, -8405, -13663, -11421, -12634, -8846, -7502, -13299, -11355, -12660, -15457, -2949, 14148, 6740, -3291, -9310, -6514, 4981, 7143, -5343, -12548, -631, 8674, 14407, -3648, -8810, 271, -9436, -5359, 9727, 19168, 4175, -9826, -10257, -5226, 10459, 13868, -2716, -27654, -28091, -11147, -1631, 6859, 7722, 3870, 154, -11394, -13266, -9519, -10295, -8306, 7249, 8899, 24285, 18191, 9579, 16042, 4210, -3893, -1689, 11067, 26682, 21841]
6815B1841j9065k2862J1487J5768k496r791J045O360O024J0815O794K211j2245
6802A5886r615n243j530j8473p502P411Q146K225M335o7J2439M722J180k0777
6788f863p501J4208N421K785m560P239M149L579o287o841P375O885k975j0594
6774F020j1081j144K217K915P707o85N001k457K045J531l378P012J0286j1683
6760A4306j1289l853l904R6J4656O629l831j301J1119j3716o575M481J0848Q454
6746B6120k224R336J1262j995r035M84j2482j8284o729k541K523L125J0926R176
6732A9662l370K288J0167m194j0588j0719l150p646mr726P35N414j153N333R285
6717B334O621J835K049j6499j1714o473P041m49L460K76l016R599q59r692o335
$$ y = [21841, 2776, -20086, -8599, 7169, 4673, -5118, -4073, 2287, 8311, 19126, 25920, 28131, 15886, 6271, 1028, -502, -18975, -26477, -19066, -10920, -8695, -4360, -4427, 8012, 12734, 13914, -6863, -14364, -156, 5265, 8050, 3490, 10729, 14878, 18457, 12170, 5329, 12704, 19589, 16614, 6020, -5061, -6205, -3988, -1073, 6634, 5949, 10950, 8493, 10538, 12069, 8691, 15703, 25989, 14306, 3017, -836, -4740, -4644, 10012, 16641, 12810, 11509, 22628, 8912, 2337, 6818, 17666, 26120, 23896, 33232, 44494, 42499, 33464, 33948, 21466, 3182, -3547, -6088, -3565, -440, 10486, 19662, 16292, 18580, 28747, 24553, 13965, 3246, 96, -7550, -7554, -17280, -16545, -11131, -12284, -6951, 2334, 8955, 10790, 12839, -3660, -15374, -21847, -14806, -15255, -11795, -11519, -14535, -4936, -5795, -15487, -21822]
6702b1822M428j178l835J8653O569O69m148k336j0865R32l849k298J0449J8578
6688I947n087q956m773m904J1767J981K660q344N911R135N648q331M531O111J988
6673A9284m080n895k1117j1949m516P549J7388N39m254j0904q987J628J3222J568
6659a0524o965m790R189J7999N404j0417j541K138R748k510n915j356O4K382O554
6644I460o083p667K401j080j0200O723j918n240L95J567J3762M383j0881k510
6630f888P906Q485o201P476j2033r872Pj815k096j894o769J1248J0432p207l447
6615a2668N86o452P908O310J3043J6112P331q217L67Q242m711q767m848o169r493
6600a426j0904J909J1383l417J651J3221Q958l767j052J191m970P522p721J0651
$$ y = [-21822, -17394, -18572, -22407, -3754, 2815, 3484, -664, -3000, -13865, -12933, -16782, -19080, -8631, 9947, 4860, -4096, -8869, -13773, -2006, -25, 2635, -5709, 202, 9337, 14985, 6654, 11185, 17296, 19284, 15204, 9309, -11808, -23757, -28273, -20724, -3336, -2797, -7051, -17955, -26942, -25314, -12092, -10524, -17489, -22279, -13090, 4909, 10313, -104, -1645, 493, 10241, 7731, 1816, 460, 524, 2906, 9460, 3377, -4290, -1889, -2969, -13169, -6446, -8364, -13604, -13209, -11642, 2120, 6503, -4378, -6888, 1018, 9503, 3302, 10778, -1255, -11127, -11120, -12935, -15031, -16925, -23694, -12446, -2014, -9221, -12668, -12082, -18534, -10626, -4316, 8727, 24839, 32170, 23953, 24320, 32562, 27851, 19084, 14236, 8067, -1426, -12330, -10421, 962, -2455, -804, 12417, 21375, 17608, 16556, 17747, 12777, 20299, 12578, 23229]
6586B3229R112K755j0349j5469k201N976J484N673J929q256m639k84J2084o259
6572A4785j8731n025j799J0843P07J245j956j0160j3154J3176J3753N66M626j2055
6558c179j1444j0705m126m364P8j211O672J7138Q948O689l200l961M905j2650
6544a0410O30n602O664J8446R394j2047k0676J103J0705N642O78M56M570j116
6530H437P351R424r528q047j2547m296M781n1J755P858O933k404j3024j1811n982
6515b1151O606J2615O194o946j0695m436L307L363r11j624J211P984J077j2928
6501a6334L894J0244Q205l552n168m097N125j411r787K15P646Q017O794N656j6349
6486i02r885o227Q223J3346p504q894K43l322l284n631L498J5136N421L720q458
$$ y = [23229, 32341, 35096, 24747, 9278, 7077, 13053, 14537, 20210, 22139, 13883, 9244, 8960, 21044, 14785, -3946, -8971, -10770, 73, 780, 2025, 69, -10091, -23245, -10069, 3684, 4250, 8876, -3179, -14623, -25328, -29454, -33818, -33740, -34951, -28279, -11141, -2193, 4496, 1296, -2665, 2240, -10410, -9780, -15382, -8718, 9728, 19122, 7075, -13601, -12498, -1793, 3849, 4527, 4983, 9553, 8437, 15788, 25212, 15684, 7637, -4910, -9206, -4425, -4476, -2721, 5137, 12070, 9666, -3358, -15169, -21151, -14545, -1930, 4264, -2682, -13377, -17813, -14506, -11143, -12054, -13678, -12467, -4483, -3406, -16334, -12440, -2196, 6009, 2457, -2711, -6808, -1683, -3094, -12881, -12666, -5020, 2997, 9791, 15447, -902, -10787, -17014, -8791, 4555, -2949, -11843, -11600, -14922, -18206, -23837, -20339, -5203, 218, 3938, -4520]
6471d520l570R166M227j4812q587J599L076k553O261M950q183j0855L839O995
6457a2967j062k452j0355n2Q053J8551N229P48k386p506N466p053o12k984J0326
6442I44J0150k809L097M489n226m979J678j2746j1021n950J9261k8o017j675L81
6427a0451O603m738J7882J3850j2426j2437n98J07o387L372K1942J0547j2993
6414A4273j6318o007M199O777j053j7128m682k031K019K337J708j903n461N446
6400a7824j658J1504J1454K332o945k314j5811r953P950J4251Q2j662n140K389
6386a1345J0504J2234M123j8164l114M123O681O56j4470m324N897Q797P740l176
6372F162j2758J2737L729k8P920m461j4552n199q240j4029M392N707R380n79l81
$$ y = [-4520, -8090, 1076, 5303, -9509, -18096, -16497, -13421, -15974, -9713, -4763, -12946, -23801, -19962, -12967, -14029, -16481, -26836, -26888, -18835, -284, 4945, 5693, 3307, -4199, 1267, -5786, -6398, -9382, 944, 11094, 8285, 11382, 15871, 10645, 5666, 7344, -5402, -16423, -22373, -3112, -3140, -9157, -10832, -10451, -3848, -8586, 9296, 23146, 10720, -1717, -2315, -2208, -8595, -5223, 16719, 27266, 14273, -2045, -8052, -3853, 2924, 1871, -15257, -19939, -21970, -19951, -17614, -15906, -17809, -23270, -17824, -19482, -7978, 3476, 5808, -1137, -3451, -19262, -29215, -21265, -7014, -6932, -8594, -13734, -11345, -841, 11393, 15516, -2648, -5762, -1639, 5042, 5698, -8772, -13096, -7199, 1598, 9338, 6162, -6596, 6141, 9870, 9842, 17762, 13301, -1251, -6450, -14690, -28719, -24327, -18620, -9240, -9819, -10200]
6357a0200P761L517Q819J189l928p111j306N530J2896R917p428j5745J995M034
6343I940j903j700Q240m071O178m570j1248j1494J3473l794n850j1988J8056J5926
6329A5195M58q650l015M103r677p66P530M730J948k496k9M50n561j22p630J1729
6313H197K442j257j0578j8007L75k490Q9N922K0715L165p289K127J1873R720r507
6298A5497k5358m104J6372m534L815J2973P586j4172l233N037p115j059R720k682
6284H743o723J132N742k320q088j1586K67J1886J0685R735k206j3465p062R030
6270E770j5426j1707K910R821j782M769J7934N131N016O558n990O868p976j0864
6256A1032J890L962M495j0204J179k763m079n851M386K775P124q796j3367j910
$$ y = [-10200, -2439, 1078, 9897, 11086, 7158, 47, -1259, 4271, 17167, 27084, 19656, 3911, 5906, 9940, 8037, 6337, 14577, 10506, 16684, 12114, 866, -10628, 2845, -949, -6799, -18787, -731, 15195, 15653, 7003, 3988, 8091, -1586, -2352, 5178, 9908, 11856, 9360, 9331, 9781, 4220, 4098, -3532, 8197, 10639, 9382, -1196, -19203, -18828, -21318, -21229, -15307, 5408, 8573, 1284, 3411, 15284, 25004, 15497, -9861, -13965, 2407, -2127, 1688, 14661, 22247, 8075, 4842, 9879, 2764, 1705, 11425, 8743, 2020, 3152, 8894, 6574, -1514, -13100, -12833, -947, 9738, 19473, 17267, 3802, -3260, 5770, -9656, -21363, -18453, -8632, -10414, -5645, 12289, 17420, 22436, 28994, 23004, 29872, 21896, 11032, 12922, 16884, 21379, 11175, 12354, 9591, 5512, -339, 4047, 6822, 13946, 5150, -8217, -10127]
6242a0127P271n819q520L692J2855n824j3296m229N316J3044o415q399J4942R385
6228C876J1444l339j3522j052j4275q089J1578k220o760L221N494j629j165L813
6214a2625R49N114J7711m704k392P342j871o239l039M736J0695J658k757j1323
6200C255j8332p205Q368L564J2960M963j2726M436M630K475n100N460N779n647
6186F880n351q495j126O127n016J690K855j9921p678J1331O39j996K1354J6862
6172A8155q320q798j532q57l945J5721R122j7092j5375P66K627j1125r080O003
6158b3730R80q175J5975R674J56N745J3934n88l110j0820L100j388Q255L008J775
6143A4791J293j61K947k2926k463N067j7536o517k821l446J1394J9929J8135o55
$$ y = [-10127, -2856, -8675, -17195, -13503, -648, -6472, -19768, -23997, -18681, -5637, -12052, -20451, -5509, 3876, 15320, 11981, -1541, -2593, -16868, -24957, -13379, -15599, -22359, -19138, -13644, -15273, -16438, -12625, -11676, -6562, 11149, 6445, 4053, 11395, 9524, 3285, 246, 4982, 15677, 17335, 14578, 3255, -15077, -22282, -13914, -10350, 2610, 7573, -5153, -717, 3913, 6388, 1288, 6748, 12527, 6880, 1529, -6966, -8092, -1965, -6981, -5291, -2436, -22357, -30035, -18704, -18065, -20061, 1293, 18155, 9835, 1037, -495, -1352, -5297, 10424, 19546, 2454, -12921, -12155, -9528, -20653, -29733, -23730, -22750, -30925, -14950, -5276, -5120, 625, 14559, 13971, 10861, 41, 3141, 1753, 10008, 13016, 14791, 16084, 15923, 18870, -4056, -6519, -1452, -18988, -25505, -28326, -31772, -20378, -449, 17686, 17031]
6129A7031m974M078Q480k3420j2094J1774O983p002l435q639k428K3582N733J2660
6115B8329Q387k3609j5599J088o335Q218O220l362r3M604l245o102n89j7075j3512
6100c2675O676K2817R474m712j388j90J1041p267k490o67q971J954O55l727j0041
6085a9511j210J2047n028J2241J1292J1299j0108j4949j6423R445J5024M278m469
6072C928j17o410L181l526L300K301l545K681p157j174m757p475R58m833O052
6057a6593K470j1718J5164K1344k559M71n555M716R101j084k942l728L24j505
6043G906m272J010J2103m433j2000J0713N199P934o648k1891k060o41M880k075
6029d275K737J348q647n292p771J3132O137r348N267N844J1429K540j2636N796
$$ y = [17031, 12057, 16135, 24615, 1195, -10899, 875, 7858, 856, -2579, -11218, -13646, 9936, 15669, 28329, 36716, 13107, -2492, -1404, -7739, 479, 6699, 3337, 3244, 7848, 4603, -1499, -2088, -19163, -32675, -25999, -3182, 6292, 1580, 192, 2, 11043, 3776, 1286, 619, -8352, -6398, -5743, -9470, -19511, -20721, -8674, -13702, -1461, 9831, 21130, 11022, -3927, -20350, -10905, 4119, 8397, 3928, 3811, -2599, 582, -2944, 356, 2657, -888, 1793, -5364, -6538, -11295, -18770, -17812, -22645, -16593, -14123, -25841, -10677, 10667, 8108, 8579, 3024, 7740, 16841, 15757, 12815, 9087, 9411, 7906, 3634, 4644, 16747, 12314, 314, 11027, 16226, 24160, 17512, -4379, -6439, -7080, -2200, -4275, -1538, -190, -8837, -14129, -21900, -8768, -2631, -11979, -6712, -868, 10561, 13101, 465, 6261]
6015F261j0558k6154L152L01J3690Q338j1710j3850P454J1777J1022j882M946
6002B787p840j1014o381L65N545O373Q285L229j304r491r583m543J910P618J1049
5987b995l496l290O764Q201o034o351M890k636O872j797n312K641j6470O70k305
5972b0648J4473J925L445P131o160n419j690K043L219m264j87l585q567L376N822
5957i086P839J4798p790r899K1123r391j725R901q259q033J1147M744r526p452
5943a609J523L961J7755l813k105k365j867Q557o246j6078j866j2995j2585k157
5929c1890O093Q93M997l20M211J3105P904M167p482l560L663j2168k1402L581
5915b8208N221J959J3325J0556L88k735l443J480J861n999j6468J1304K2767r567
$$ y = [6261, -4297, -30451, -27299, -26998, -13308, -4970, -16680, -30530, -23076, -11299, -277, -2159, 2787, -5053, -16067, -22448, -22083, -16538, -10165, -1880, 1349, 45, -9446, -19029, -23572, -21662, -14044, -2995, -6491, -9781, -3017, 5184, -850, -7201, -2311, -4947, 1925, 128, -5184, -2543, -19013, -18343, -20648, -6175, -4250, -805, 6326, 166, -5253, -6943, -4900, -1681, -5945, -6132, -9717, -18284, -14908, -9086, -1247, 13551, 5761, -4138, 16985, 7594, 5869, 15770, 7511, -522, 10625, 15369, 5843, -1609, -86, 3875, 21630, 17817, 15712, 13347, 11480, 20037, 13791, -2287, -4153, -17148, -29733, -31890, -25797, -24904, -19907, -20227, -16016, -2911, 4993, 9160, 1678, -1882, 1781, -10387, -31789, -28208, -22987, -21028, -7703, 2853, 3241, 506, -2937, -1457, 404, -5595, -22063, -10759, 12008, 2441]
5901B441j6359J248r104J471R724J5236l326n136k244J627M472k139N568O503
5887I982N02j583p500k678N983N925q694j5445r064J2601K914j6834j404K1001
5873d294K5873R640j1989j5334j106k408J2081l755m774O881q954m288J341Q533
5859G447n026o983N640L582J3l940O333K448n230j6845j5l663J457Q8J0065J2750
5843H121M748o195k118K047P794j972m471j932k531r061Q06o040M14Q126K825
5828E61K852k524l832k959J4269K586m780o950m30j528r875k986L418n373q351
5813b5902R241P740p03K103N571J178L738M727K922n563q602l628p189j3445n993
5798c3805K524J8183J3400m296j2383M442N1L484P763L83n074K991j0321Q071
$$ y = [2441, -13918, -12670, -21774, -20303, -10579, 4657, 1331, -3805, -6049, -4422, 50, -2089, 3479, 9982, 10484, 8901, 1401, -1277, 4706, 10631, 1937, -13508, -22572, -9971, -7057, -23891, -25295, -4294, 21579, 31219, 19230, 3896, 2790, 382, 12463, 8708, 3934, 10815, 1861, -2427, -1086, 7447, 2421, -4562, 1078, 4660, 4673, 733, 7066, 9514, 4284, -12561, -12576, -16239, -14782, -14694, -4629, 8121, 12869, 6674, 4556, 6603, 14397, 12425, 7954, 6022, 3491, -5570, -4764, -10804, -10390, -2264, 561, 3413, 889, -2943, -5902, 8367, 10953, 6173, -777, -1207, -2735, -12610, -15596, -12178, -17551, -25902, -16661, -8921, -9624, -7521, -1950, -772, 2966, 7693, 10615, 5052, -3550, -7178, -14367, -27812, -33805, -31281, -13098, 302, -3994, -16377, -11935, -11884, -8400, -637, -254, -5328, -2337, -12658, -4587]
5784d587J0123r360Q266l474r391K208o825L815j1396J561N765l375k734L035
5770a6369j0532J642J1346J4304j530j0150l046L948Q058L890n707l409l023o667
5756a7245q141P767M939o722p200q133K972J401Q249R775M41k033k748k64m816
5741b1758N803O124J2418j5441J818J2711P19j5546j6795J5224J0829m07P090
5728B789Q521k1103m330Q865Q817j0561Q573K430J0528O176l102K345l114O712
5714B3546m867j198j061k0532j7545j1643J5232J4524J0385k941K423L871L430
5701A3624p056p262Q699J3128o282j2307R355K369l579m296n381k037l087L982
5687a30l282l563K513J3623J692j3237M019m054r183p097N616J0390J1054J4349
$$ y = [-4587, 5536, -3824, 4442, 968, -8423, -6215, -13040, -9225, -20621, -19060, -13295, -16670, -19404, -16369, -26901, -25259, -13913, 391, -1139, -11289, -14335, -10387, -2329, 1561, -4146, -7555, -10578, -17245, -25386, -17619, -12680, -19402, -26602, -34735, -31763, -30362, -22113, -12338, -11897, -13930, -16678, -16942, -21758, -15955, -9831, 2587, -12854, -11036, 1675, 2394, -13152, -29947, -14723, -3894, -4301, 2789, 11310, -9793, -14123, -5258, 3559, -7002, 1571, 4001, 14529, 20705, 17603, 19948, 16834, 23546, 18679, 17481, 16420, -4112, -21657, -33300, -18068, -3544, 6841, 3900, 6323, 10194, 13624, 6568, -694, 8005, 21133, 14851, 2544, 11899, 14268, 10689, 6393, 1012, -1025, -4112, -130, -3412, -6975, -4462, 9161, 10853, -2384, 1635, -2419, -11602, -18699, -13083, -2693, 8361, 22710]
5673B2710o294o092l703q153r816L380j0070p631J0205L283n815L060Q696N563
5659f77l871K410K060r208o932R945J892p058l46q028K534K0214J4418j0144l504
5644C705n473l059J4281R594p91n078k387k99l201J152k040J5304j15n929n286
5629A0378l277q778q791Q493Q979j0324k1204K012P843J1148M536r60j8762p750
5615b6457M506J3560K573l192J2108P41j270L73K503j0043l35J3615L469k700
5601I451J7500j6025j0976j908R528J36K183M08p280l959P531r027m471M877R655
5586G623r287N221M426q294L17K020N737O134j000O35l304p0o442q166o461l789
5570a4700r745k267Q208R235k301P768J5296K028o511q74j3200j619O621J030
$$ y = [22710, 16416, 10324, 6621, -1532, -11348, -7968, -18038, -25669, -15464, -12181, -17996, -14936, -6240, -677, -4548, -2138, -78, -9286, -16218, -6273, -4381, -11439, -11785, -19813, -17279, 2935, 17353, 7209, 3705, -1768, -4827, 9454, 19048, 18257, 13179, 10792, 10493, 7292, 8444, 6404, 21708, 21593, 15664, 10378, 7101, -1677, -10468, -1975, 7004, -3320, -24524, -22512, -14669, -3521, 1015, 55, -18707, -26457, -21951, -8391, -5818, -9010, 3098, 3839, 2569, 2942, 5445, -4598, -4933, 8682, 12151, 9451, 26951, 10926, -50, -1958, 7570, 7706, 9889, 10297, 3017, -942, 6589, -2438, -6909, -2032, 7623, -1664, 3557, 7983, -311, 6, 2026, 7763, 13897, 12897, 13532, 10228, 10158, 3716, -4450, -10911, -14700, -24445, -26712, -18504, -9269, -11570, -3802, 11494, 13522, 7011, 6137, -7063, -8682, -2061, -1031]
5556a031m184o201K611J6140P582j5377k025J0556O901N13J0884o928n423R475
5542B3493J242j2279k4705m135J4861j540j925P655o305m222m90j1302K684M729
5528a2239J5624P795r650k724l042l466Q245K4568m110k2509M102J6321m139j2010
5514B766L382j4559K292L316M031k605j1355J0499K026j4309j4056O150J4171
5501h251L244l369o802j0818p366J2668Q559P453j0247j1466Q115J0201Q986L31
5487A238R033J6504Q73J517j1753j4290q553j1314r698J396J584L250J0071J492
5473h650k196r90Q200J0186M079L542m239N460j2906k3593N095k452M418J1139
5459b907K1064K152N067L030j8882j0279Q570Q843k496j7847lR440r04j285N148
$$ y = [-1031, -5215, -11416, -8805, 7335, 14917, -460, -2485, 8071, 14972, 15485, 26369, 19441, 14018, 23493, 24735, 12456, -12249, -16384, -1523, -3063, -4988, 2667, -3638, -7860, -8350, -19652, -16968, -12239, 3385, 11180, 1530, -1194, -4236, -7702, 543, 25111, 21001, -1508, 2594, 18915, 14776, 2766, 6148, -8411, -6119, -2803, 1228, -1377, -12732, -2233, -207, -14516, -28572, -22422, -8251, -5007, -8376, -15178, -25996, -33362, -20694, -12135, -4682, -14929, -26395, -18280, -8079, 907, 1238, 10271, 26775, 27648, 29165, 17412, 3122, -5431, -16745, -26443, -25047, -23463, -20213, -10142, -8650, -10846, -11836, -3636, 6550, 10629, 14171, 9932, 15392, 2486, -21107, -16012, -18464, -14046, -2907, 18157, 20309, 25376, 28406, 9524, -755, 7815, 16658, 14162, -3685, -3688, 5752, 4848, 3563, 8711]
5444H711j3805j0594q32l773k804J0971K4654o153m982k483m355l444P177P463
5430E751j0708j3042L495N326M04K714L981k300J0181j94k814Q925n14p448o543
5415b786L064p120j1791Q779J1913J4j6667j224K775J444J2598K0276k907q81
5401A7487M564q604O00o431j0757P017J4512j3282j1263p888k203j681P661P549
5387b719N350J473k484l913K439O731j3783j8804j216M43J3624J1714O509j8349
5373a2985j8540J6609P354P051m322p436k950K226M261J9095P704q356j5415j0527
5359a6231J8439N340N81n357k232r334l570o84N560m13P817K677l033Q668M77
5344H705n763j3065j6614l257J4179p152K611n402K813Q774n527p429N98j0167
$$ y = [8711, -5094, -15688, -16520, -20293, -23097, -12126, 12528, 6375, 1393, -1090, -5445, -8889, -1712, 5751, -4957, -17999, -14504, -9178, -8774, -6060, -2079, -4379, 5802, 5608, 2794, 11719, 11205, 3757, -2786, 278, -6842, -18633, -9854, 2059, 2073, -14594, -15818, -13043, -11599, 999, 21275, 18368, 17487, 22051, 13447, 14047, 7616, -3141, 3876, 18388, 5106, -6157, -14045, -16248, -17929, -10268, -2719, 2631, 4104, 1620, -2293, 146, 6877, -6906, -25710, -26926, -26483, -12859, -1145, 5364, -12985, -31525, -14916, -7562, -511, -4833, -12269, -15219, -12993, -8732, 10363, 18067, 9711, -5704, -16231, 2208, 7548, 8129, 2772, 540, -8794, -12364, -13048, -7488, -7901, -84, 2593, -440, 8228, 8705, 2942, -10123, -26737, -29994, -15815, -22967, -20356, -25758, -22945, -14171, -19698, -27127, -26529, -36696]
5330c6696J6520J8185N233k782k329m492j835m423j3616K2936q13q401j666J9482
5316E303O053m866o50l810J570J0744j815j6208p8j2903k791j556l605P224n199
5301b2587O232K369K78J334O783N623R284J66k2952q05P689L849M921r031n515
5286a2362O931m623o75M530K109M631R811n878j0559O62j093R07M929O94j1090
5271a1076m057J7170O143p361k221J946P054N505q976j1265J591K846N53j416
5257c564m030O655R581p497r911L943K0162P1M49l804j1194n521J2575M301m087
5242H129K064j009O095J002j0141j7753j1027m559K714J1885J0581j4400n088
5229b1507m78L700p14p715J7498O456k593j2442m950P299Q797J1035N769q143
$$ y = [-36696, -20176, -1991, 3242, 460, -1869, -6361, -8196, -12619, -26235, -3299, -4112, -12513, -14179, 5303, 11356, 6490, 5840, 2030, 3600, 14344, 12529, -3679, -3757, -16660, -19451, -21007, -24612, -17388, -22587, -16355, -13986, -13708, -12374, -5591, 32, 9316, 9482, -13470, -14275, -6586, -2737, 2184, -6847, -12362, -5431, -10054, -10729, -6199, -4090, 541, 10352, 4474, -6085, -5423, -6516, -5609, -680, 14, -11076, -15133, 2037, 8180, 819, -1402, 544, 7598, 13103, 4127, -7138, -5547, -2701, -2148, -3564, -7594, -939, 8642, 1145, -8766, -4823, 15339, 15410, 15859, 12055, 861, -4660, 7915, 12216, 8129, 10193, 9184, 15279, 16281, 6140, -11613, -22640, -27199, -24485, -12600, -2019, -16419, -21507, -21985, -18285, -18999, -26714, -9216, -2760, -5353, -17795, -22745, -15446, -6649, 4386, 10155, 2012]
5215B012p035P990J3744K581j2857k8988N814M502l079N030M462P728q952O655
5201c93j515m389l036j171O109J8536k152r067K919M09J418j97o937j3013J578
5186a0901J2581R564J958j4116k489k311P394J7030Q40q086L031j2463j3675P670
5172c973J0340N385j4055n802J0548J5271q206l531j05o412q916L851o864N555
5158f914J2412L338j9677L320J2641p64o267O442O051j596K146l036j2059N626
5144A663N757m715J1329R171k7687j8296Q93j536R62Q909N541M800l841j344O42
5129g752K238J0909k481O329n48N028P811m875j2787l533J3388N243k425j5709
5115H36j819J4474O52n289k053n77n398j412K278O230n49j332n240r746N746K992
$$ y = [2012, -5023, 2967, 16711, 19292, 6435, -22553, -16739, -12237, -15316, -10286, -5824, 1904, -7048, -393, -1908, -6297, -9333, -10504, -4395, 14141, 11989, 2922, 5841, 6250, 7668, 7471, 534, -12479, -10901, 1680, 11244, 13202, -914, -3403, -5714, 1680, 18710, 19550, 11464, 14495, 2032, -11643, -3973, 6367, 11752, -2303, -8105, 2443, 17714, 9508, 5977, 5872, -540, -9456, -5605, -12469, -6914, 5498, 8836, -10841, -7521, 5120, 4356, -1911, 4531, 10582, 8986, 11132, 8096, -3963, 1663, 7420, 2705, 14034, 23205, -4482, -22778, -21885, -23421, -22459, -13550, -8009, -3209, -7050, -8394, -7752, -5514, 5395, 2914, 9243, 8695, 13723, 21534, 16659, 3872, 339, 13727, 18970, 16545, 836, -983, 13491, 14143, 8854, 6801, 6224, 826, -586, 1692, 7922, 7373, 6041, 801, -8945, -3199, -207]
5099b07K41Q69k953N047K687l5r776j2561q668L543R219O370R726Q000k084m395
5083E023Q652p280M632j2300K100J665q06J40m205O792M949J6386J90k925Q453
5068C1466R014j4904k2898m469k887m030K942R025J0129j6587j6169k162J0874
5055a0656J3434M718n884j0L201M847M390P216N471l399L015m927k3117r50k263
5040d914j3367j2450o26Q118R843l256k767J3983k423j438J2903N198j3680J5896
5026A1020J0178M858p049o991J950j2450r755L772J0261j3167o114J3233P942
5013G688J7515L544l5738j6316j290J2920J5341p760j7712Q496M57O586J0990
5000D721j270J564j5100Q991J9509J576j4308k2050n844M608L866J949L297M696
$$ y = [-207, 34, 903, -2050, 2997, 5684, 5649, -4127, -16688, -25356, -21813, -12594, -6224, 3502, 11502, 9418, 5023, 13675, 6395, 11027, -1273, 827, 2492, 1686, 1826, -2379, 4413, 9362, 25748, 25938, 23013, 31466, 40480, 25576, 2678, -1791, -4678, -8708, -5766, 3259, 13388, -3199, -19368, -21530, -10656, 2778, 7496, 1612, 1602, 4803, 9650, 14040, 21256, 26727, 23328, 26343, 21416, -1701, -2651, -4914, -18281, -30731, -31357, -23239, -13396, -16652, -19419, -5436, -7859, -9297, 3606, 8804, -4876, 11020, 21198, 26056, 19007, 12016, 13966, 1516, -8239, -4467, 5794, -7373, -13487, -254, 7688, 25203, 28747, -6991, -23307, -24597, -11677, 3664, -4096, -21808, -13312, -12855, -6269, 4721, 3451, 5015, -10085, -1094, 18415, 19991, 5683, -16367, -22211, -17603, -13737, -11788, -8491, -3795]
4986c795J563k404K475J1089k547r715M617R227j9287j0965o343J0321R635O710
4972E81J533k235m214J1686r63o508p256J6364R263M303j3393o607M833j0206
4958b819L67k795l287K500q185m408K595P138N331j1743N070p249M42K358p055
4943b1740K259l394M062l178q166J5671J0163K466o542j1853o19R384Q527k365
4929e325P383N612p631j1463K249o207J230k79J1955O318k409J0380M547j4526
4915A834j0823j3124J630J5046K719M876l209l40r04j9455m922J0732J5039J3704
4901A2803Q196r685M3o339o835j5139J2682J0754n361n993l31j2312j653J2187
4887f983P105K053p863K595Q273R049r833q766l716o541J1263R000n207m133m099
$$ y = [-3795, -2232, -4636, -2161, 8928, 6381, -3334, 1283, 10510, -8777, -19742, -26085, -15764, -6129, 581, 2114, -121, -4335, 7351, 6388, -120, -7376, 8988, 18251, 22554, 9161, 2554, 7387, -2819, -2452, -5247, -8534, -6034, -14219, -18627, -16032, -8894, -3563, -15306, -10236, -17485, -17043, -14685, -21740, -19481, -22875, -18813, -21991, -30157, -14486, -4323, -1857, -8399, -20252, -20871, -11487, -2960, -5325, 2058, 7670, 39, -11424, -9175, -15382, -14152, -14431, -2476, 3842, 1433, 11813, 16360, 1834, -8989, -22113, -20483, -5437, -2718, 2158, -1051, -1391, -2295, -21750, -26672, -15940, -901, 12803, 20999, 11314, 11357, 5018, -1817, -16956, -4274, 6480, 1119, -4874, -5205, -17517, -19170, -6983, 122, 2175, -5688, -3093, 5180, 14229, 4396, -4370, -8086, -14627, -3364, 5636, 429, -3704, -7803]
4872g803o892P296J4692O503J2609m346q528r592K174N529Q712J5044K214j4192
4858B3420n47K087K066q909q891O896K629j1255m109o153k992J6729M239R408
4844B4618r635o083J774j5549j0399l50R587J3537l757p525K738J5427K210l089
4830A3504j2185Q790J0089L565n288m339j7298r848P077J2075Q722k748o053M698
4816A0761N155M307o298j795r96m025P113J7843m764j5941N708j3769j712P589
4802I176j7035j0973O080j518N068n417j7360R195K0553J4032O769M199j198m395
4788A7176j1272k559j0662j366P590N170r828O50Q662P695l508j0577l000l664
4774i493m057j1418n817J975R323J5036O492r54n543R28N853k036l144R037q12
$$ y = [-7803, -14695, -7399, 7293, 13796, 26405, 22059, 13531, 3939, 6113, 11642, 20354, 35398, 37612, 23420, 22873, 24960, 27026, 18117, 9226, 16122, 18751, 7496, 3387, -2766, -5758, 10971, 15210, 24618, 14983, 8900, 10674, -4875, -15274, -15624, -6037, 7500, 3743, -3782, -1044, 14383, 16593, 13504, 1319, 10109, 20198, 23763, 18475, 14136, -3162, -13010, -5933, 6142, 14864, 12116, 6063, 10761, 15916, 20223, 13925, 12130, 11134, 7109, 14222, 32065, 27301, 11360, 17068, 3299, 1587, 9176, -7859, -18832, -12752, -14270, -9202, -14619, -31979, -22784, -2231, 11801, 18570, 22769, 21571, 17176, 5904, 3345, -7317, -8683, -1093, 4077, -5751, -5101, 3561, 11256, 7748, -2829, -5829, -9493, -13550, -24968, -30785, -28810, -19487, -4451, 2041, 1087, -4456, -3528, 2325, 289, -2855, 6182, 5370]
4759E370j0100o858o169J5275J4185R836l603j7371r672m520P796j032M742P198
4745E077p99j510M256O914j0701m296O633M933N118r520Q78J641j4831K203J688
4730b316n643r445J127J0816J2409Q487p905j722l955P65j324J438o967R335O220
4715A1320M305N022n804j1380Q28j6m984j0960N640Q340r558j261k538Q751R283
4700F988j1674k3020L34K2801n601l317O031m884k618N040J1740O884Q35l148
4686F391j285r429m507K697M138n631p764j2035P247O912R854J2058O861L01q627
4671G181o125p758J166P206J8000p099j5055k0772P46Q763K782N617j464O510
4657c02K411M671L120N3M013P30j9295M648J416j3028n874l646L677R11K68J6258
$$ y = [5370, -4730, -11588, -17757, -2482, 11703, 21539, 17936, 565, -9107, -13627, -5831, -6863, -2121, 5077, 4278, 2768, 7024, 13938, 3237, -1059, 5574, 10507, 15625, 6105, 6983, 8624, -6207, -4004, -2316, -7959, -17404, -16277, -5461, 6948, 15435, 7530, 5808, 1853, 2618, 1294, 2732, -4235, 5100, 11320, 15625, 20647, 14843, 3463, 4291, 4275, -709, -11669, -6029, 2311, -7247, -8508, -11046, -2295, 6988, -4686, -27706, -27372, -4571, -10172, -13489, -7458, -12342, -14960, -9920, 1820, 8704, 9539, 6391, 5106, -4323, -8830, -6133, -1995, -7626, -15390, -27425, -20178, -13266, -3412, 8646, 15507, 15808, 7181, 1056, -6702, -5536, 1670, 19670, 12571, -2484, -23256, -22510, -13747, -10965, -5348, -6812, -302, 2109, 6780, 9900, 9953, 13966, 14696, -4599, 49, 1465, -11563, -17437, -21083, -17406, -16495, -16227, 31]
4641C1K3016Q069j5467j9981o601M222R73K52O200j561j275K565r994j367m655
4626a5573R332K509j4397K35J2648J396q084j753j575Q17Q332J403q734K800Q768
4611a876j0975J73q698k4J5638J2334k4730l666N490R836Q01J116O312K808j387
4596C152p336J0506k516L890j1073j1918O937J2879l593L516l490n606m953L62
4582i243m526j668R895J4559o563j0024P196O610j5581l293p80o18j3630J7015
4568a0651K2280q460K30M261J001j128m492O965k716m887j0861k16J5172K789
4554I287j8891j1991q096O031J9661J4743k147j086l379q435q213J885r27M859
4540f699r08k385j461Q629p399q858J1862O504n179o804m055N904N556p506j931
$$ y = [31, 23047, 31116, 15649, -4332, -10933, -6711, -5738, -5486, 714, -847, -2122, 443, -9551, -10918, -15573, -6241, -3732, -18129, -17894, -5246, -3850, -11934, -13687, -15262, -14445, -6113, -4710, -13444, -10644, -1876, -12851, -12678, -21376, -21400, -5762, 6572, -18158, -21824, -16334, -6498, -5697, -4581, 1731, 4539, 3152, -4184, 6322, 3806, 7696, -3377, -15295, -8358, 4521, 928, 4444, 954, -4652, -9605, -9243, -13769, -15437, -5542, 9017, 2454, -7570, -374, 6236, -9345, -12638, -13418, -14036, -27666, -10651, 11629, 3169, 3399, 7660, 8661, 7533, 3041, 10006, 7290, 2403, -8458, -8674, 6498, 9287, -9604, -21595, -29691, -23660, -3999, 10744, 8597, 7511, 4132, -4303, -12516, -10631, -11558, -6699, -7607, -9992, -11453, -2824, -10223, -19081, -7219, -715, -5894, -12698, -16753, -10849, -5293, -12799, -14730]
4525a4730J7398J3893J135j357j3791m385m88R805O580q345q352L514N998o08
4511F267o930j073j5616M668j25j765r603O499J4066J330n20O347n447p983l84
4496a0269J2663N375l907j2233j1103j789L468Q997l486M466l565l964J537K6850
4482A3040O363n227M781r757j3003L497J1106M259p490r86P400R49j6018j05j271
4467b462J9646J475l53n658j1273J887m819L010R663j877n76O958r169p154r697
4452a0399j7508O925J7874o639k604J5487K80J1026J4612j0916o324r591j3056
4439a0833N820j3617k0219n282o930J2685J1179Q275Q177R461o477j5965j0217
4426c3943Q647J6443j595k422P542Q79l281J1317J1867n803j1556P736P734j2563
$$ y = [-14730, 2668, 16561, 17696, 16339, 2548, -1837, -2325, 7480, 14060, 5715, -2637, 877, 6875, 6267, -663, -1736, -17352, -12684, -12809, -14574, -24177, -17678, -3612, -2282, -2802, 3545, -1902, -9885, -10269, 2394, 7769, 3862, -8371, -19474, -21263, -17795, -8798, -12284, -7818, -11383, -15347, -13810, 13040, 19403, 14176, 18957, 9200, -3803, -306, 10800, 15059, 7569, 6583, 13983, 14932, -1086, -1191, -2462, 17184, 18659, 18306, 12648, 1375, 3262, -1557, 1453, 11116, 9239, 8663, 15621, 6452, -702, -10399, -27907, -20982, -3108, -9747, -12351, 3136, 3416, 14442, 29054, 18138, 11814, 2223, -10833, -5013, -18630, -38849, -44131, -51061, -38376, -27197, -18922, -10745, -1284, -7761, -23726, -33943, -25296, -8853, -10448, -12870, -5328, -4449, -7730, 3587, 15454, 9651, -1905, 5831, 13565, 1002]
4412A002q227R773M171K977j1867j4084l545K1041j31L266k687o895P501N566
4398G861Q19q814k687L602k807J066R645o864M192q597m049J882p091q390j8488
4383c8720l153J2901R163j94P557P400r26R91m695L274J2141Q836j3648j2753
4369a1826p383q430R689P55J5083L36j1062R436j41n875o627J1891J3920m602
4355E164j85L453m347l767q195k932l657q304m9L712K0592J6766r446j5612m599
4340a1406j134l351J81J530J7215k453k078M746l75K340o982k3812n930J102N769
4325b4638j513J3169J140P218Mm247j557N311P189k332j0507j3406K915J5913
4311e341J6946J4329q748j3864j112j2148l660L755J446n98R147L101L275j5079
$$ y = [1002, -7225, 2548, 6719, 9696, -2171, -16255, -19800, 1241, 1110, 4376, 1689, -5206, 2295, 7861, 8680, -134, -2821, 781, -2026, -960, 8685, 1821, 6013, -2584, -6633, -4751, -11842, -20232, -38720, -41873, -28972, -19809, -20003, -12446, -5046, -5972, -4981, -9676, -6402, 5739, 14575, 927, -11826, -19209, -27639, -17950, -17195, -2112, -1776, -12838, -3402, -3543, -9418, -16045, -4154, 9766, 5164, 4979, 8432, 4085, 318, -7877, -10809, -14466, -22770, -22819, -19107, 1485, 18251, 8805, -6807, -11406, -12540, -15891, -15710, -14180, 3035, 582, -1496, 3250, 2875, 5215, -1767, -25579, -31509, -30407, -24638, -26151, -12982, -11842, -4624, -4620, -8867, -10424, -5113, 2076, -256, -10763, -24169, -21254, -5341, 11605, 25934, 17186, 3322, 2210, -9938, -13598, -9843, -8397, -8995, 152, 3253, 6528, -8551]
4297h551j4142N871J8875j7384j4577K0098Q434k0864l766J3187J1320K09R62
4284c28j3434j2545M612J486P178J1927j228j3306Q38J5124O660M931N790J70
4270A7875J966J561j835j4003m774O435k650n413q43J4329J978n355m525N269
4256A0015o769j6715o732m839r432j370J9562R124k864j911j64J789O170J202
4242b934J1319N844j9872j9097r933L580J9514Q476j3481L877R611M489O766J327
4228I486J063K958n53J2230j6933o710k144J773j2204m665L647k280K611M756
4214f965j183q205N189J669l814K540P972O240r10l473p869N171q598M166L211
4199d859l337n019j4056Q716L263K816Q305n0j1309o707P407M51P105J7279m88
$$ y = [-8551, -22693, -16822, 2053, -15331, -29908, -9810, -1376, -22240, -26006, -12819, -1499, -1290, -328, -13762, -26307, -21695, -20209, -13031, -1104, -2332, -15638, -14800, 324, 6984, 11915, 17705, 17875, 19841, 21402, 19567, 5564, 790, 7225, 4575, -838, -1681, 12648, 14626, 9271, 4746, 10015, 3246, -13469, -20201, -25040, -34472, -35842, -16280, -7156, -10020, -11931, -12095, -10306, -4136, -2934, 8385, 14229, -5643, -24740, -34673, -31093, -11579, -3103, -16584, -12707, -3096, 1393, 8159, 9486, 10549, 13507, 12954, 25184, 8251, 1541, -603, 1170, -11034, -15699, -12052, -14332, -11721, -6965, -8148, -16353, -11164, -9495, -13309, -10769, -2797, 3443, 2533, -940, -8809, -3638, -12236, -8070, -4859, -8196, -13215, -27271, -18555, -15292, -12476, -4171, -4221, -15530, -22237, -14830, -14379, -7274, 10005, 9517]
4184I517j0088J338k039j4869K85l052Q636J449r645P53M000R379P868J1618j398
4169A3752j466n085R065j455r047j426k759n224L045J1563l715L687j5486o140
4155a0691N013Q795N122M294j499J567m657n351p491j2217Q735J5137Q536q540
4141F753n774O213M714J3392R046j8927j1770m18j1349o577k501R750O745o796
4127g499Q96L965n157Q899J2309l23k1559j7255K71J1928K0305P032M656q716
4113I752Q38J164q40j6468o230j212J4323J8084j4175m595j1033p214K508J2724
4099b374j37N123J1951j852n046o274l460j0287j3988j0772K8109J9496m288j4630
4085h429n910J4495Q620P82J1363Q971m095q467j041k190o918j708n656o573j2912
$$ y = [9517, -571, 767, -1272, -16141, -15856, -18908, -10272, -8823, -18468, -17715, -13715, -4336, 3532, 15150, 13752, 12286, 7201, 16266, 14811, 5764, 4338, 1579, -3645, -600, 10963, 7248, 10935, -4551, -10691, -5678, 3117, 8239, 12533, 11034, 12601, 7944, 2593, -4898, -17115, -8380, 6757, 15293, 6753, 979, 7192, 11906, 25298, 34344, 15417, 3647, 3229, -8120, -14697, -17198, -7448, -703, -7499, -6603, -2638, -7795, 1104, 13413, 13090, -8469, -25724, -25453, -13525, 6780, 13812, 18468, 9752, 10590, 11754, 10914, -5554, -11784, -12996, 1327, 19411, 5236, 641, -10392, -17606, -15098, -2374, -2511, 2612, 14563, 12711, 7665, 1391, -2069, -12356, -26344, -37116, -9007, 10489, 6201, -8429, -14339, 156, 8776, 9558, 20921, 29892, 25797, 17330, 16289, 14099, 7181, 5473, -183, -6756, -19668]
4070a9668N933Q328O24N955O080J7947J0947M69M506j5062q772m187Q785q272
4056A3613j7335j7024J4054J2392m459j590k368m429o969k95r091M098J1524k856
4042a0735j34P178l271n689p986L44P948j101n83P588J5064J2160K880j422q184
4027A4057O867J4097R798k4089k1482J4274r49r287q212l222M393j737L342n203
4013g353M919Q860O75L637O723l802O559o738p314j1222p999k23k062J0319L753
3998a268o301J1022O162o549N508O507J3092M021j2510j9572j7856k91O673J1186
3984a76J4344j1764p435n100K922L094J0891J1397J1100O821j5514j6068j0411
3971e899r290k494L190j0315J1334j642j9073j7359O635J8576J299R917N902k518
$$ y = [-19668, -13735, -5407, -4783, 1172, 7252, 25199, 36146, 36615, 41121, 26059, 17287, 13100, 21885, 13613, -3722, -20746, -6692, 5700, 1241, -349, -2717, -7146, -14115, -14410, -23501, -19403, -7879, -10735, -10869, -3691, -6962, -12651, -20637, -20293, -12345, -13446, -14029, -6441, 8623, 20783, 23663, 22241, 14057, 20924, 35021, 44819, 20730, -752, 13522, 12573, 3286, -4926, -8148, -3755, -5492, -2150, -7353, -2434, 6426, 7101, 10738, 17461, 13659, 20218, 13480, 6166, -5056, -13055, -13278, -15340, -5021, -1268, -7569, 3453, 9615, 3066, 8574, 15081, 28173, 32194, 19684, 112, -17744, -18035, -11362, -176, 14168, 2404, -5031, -10131, -7209, -4115, 6776, 18173, 29273, 36094, 20580, 4512, -5899, -15189, -17683, -14493, -24808, -13474, -15116, -34189, -51548, -44913, -26337, -25038, -15121, -9219, -11737]
3957a1737N417J3738r7l621j573J3085r44j1721j7649L15O635Q614J037n372K552
3942a321k937o845L806L718j3320R10J3334P944oQ51j068k596j0697m991J2850
3927c68J6528j1532r519N037q087p076l136R925J6510j1557q855J1416P91O594
3913F671r07j044P626m19q416l755R81p34j0205N426J087J5413l022j1292r322
3898a1912l579O517N455l576R086J0565M853k554n292p754r360J59l273k11l403
3883a4279L992N67n531M344K085n978j8519R868J7587J984R881o113L038l514
3869e88q750j53K962j600k199k211L90J289N17o901k070J8827p50M117q446n080
3853a0646O018N434K175m514L95Q244P503j1006P235l359k1406j429J8957J4923
$$ y = [-11737, -6320, 7418, 7321, 3700, 2127, 15212, 14268, 2547, -15102, -14787, -8152, 462, 1499, -3873, -1321, -4258, -11103, -7297, -3579, -16899, -15989, -2655, 5289, 5283, 6134, 5066, 2470, -8227, -13218, -368, 16160, 4628, -4891, 146, -7941, -15017, -18153, -8228, 8282, -3275, -12130, -714, 77, 6671, 5764, 4720, 12346, 11927, 3511, -244, 737, 3, -10202, -4776, -3689, 11724, 8702, -2590, -11912, -15491, -8974, -3519, -7095, 1991, 12556, 17409, 14855, 9563, 1809, -7551, -7392, -10665, -10876, -14279, -10287, -9720, -15251, -10907, -8822, -14800, -33319, -23451, -5864, -3880, 6001, -112, 2926, -588, -9338, -9491, -6529, -8129, -10328, -12539, -12149, -10860, -10343, -17244, -19314, -487, -1237, 2880, -5566, -10646, -4628, 806, 2981, -1533, -1138, 7106, 14609, 3603, 10838, 7479, -13927, -15356, 3601, 18524]
3839A8524k437j0947O779l971L071P986R960r264j3046R98o458p400J1495J2166
3825A7456R780j2388l564n952L444m568p814j7390O40J685L312J3794J3559J130
3811A3124k487l564l869O812k80o574J209m803l583p480Q290J7726L532L264r321
3796A1996J370p245j4238Q020J1808j9825j3204O001n436M851N319J4807o154
3783a930j7061o161K348Q397P882j0266M634J5562K796r729L789R940J685r160
3769B726J086m865k572k547j5445M705Q910L377o968N711O497J428j0144M614
3755c487O315j8328n314J5261J447Q205M966o881K051j052q885J17j435L059j190
$$ y = [18524, 16087, 5140, 11919, 7948, 11019, 19005, 28965, 19701, 6655, 7653, 1195, -6205, 5290, 17456, 27236, 14848, 11284, 5332, 8776, 4208, -3606, -20996, -20356, -18671, -15359, -1565, 11994, 13124, 10637, 7073, 3204, 10016, 9736, 3162, 4371, -432, -4015, -11495, -3205, 14521, 18053, 21317, 11996, 13366, 6121, -8117, -97, 11711, -8114, -21318, -15317, -20753, -15902, -10583, 4224, -1930, -18991, -25152, -22804, -14407, -6525, -16791, -12157, 3405, 6201, -3528, 261, 10201, 11886, 2726, 3812, -1053, -3625, -6172, -21617, -16912, -8002, -4625, -11593, -5882, 615, 2043, -8101, -3487, 2828, -15500, -20814, -5553, -4106, 4099, 9065, 2184, 4235, 3183, -5702, -5585, -7020, -3961, -5151]
$$ [...]
##END NTUPLES=NMR SPECTRUM
##END=
