##TITLE=Analysis number 328802
Compound Code cc 66301
Book Reference 464/162/1
Project Code adrs
Chemist Name chrisr
##JCAMPDX= 6.0         $$ Bruker NMR JCAMP-DX V2.0
##DATA TYPE= NMR SPECTRUM
##DATA CLASS= NTUPLES
##ORIGIN= Bruker BioSpin GmbH
##OWNER= nmr
$$ XWIN-NMR		Version 3.5
$$ Thu Jul  5 09:02:13 2007 GMT Daylight Time (UT+1h)  MAYBRIDGE\nmr@NMR_250MHZ
##.OBSERVE FREQUENCY= 250.131544655141
##.OBSERVE NUCLEUS= ^1H
##.ACQUISITION MODE= SIMULTANEOUS (DQD)
##.ACQUISITION SCHEME= undefined
##.AVERAGES= 16
##.DIGITISER RES= 18
##SPECTROMETER/DATA SYSTEM= dpx250
##.PULSE SEQUENCE= zg30
##.SOLVENT NAME= DMSO
##.SHIFT REFERENCE= (INTERNAL, DMSO, 0, 16.522)
##AUDIT TRAIL= $$ (NUMBER, WHEN, WHO, WHERE, WHAT)
$$ ##TITLE= Audit trail, XWIN-NMR		Version 3.5
$$ ##JCAMPDX= 5.01
$$ ##ORIGIN= Bruker BioSpin GmbH
$$ ##OWNER= nmr
$$ C:\u/data/dgb/nmr/ADRS/420/pdata/1/auditp.txt
$$ ##AUDIT TRAIL=  $$ (NUMBER, WHEN, WHO, WHERE, WHAT)
(   1,<2007-07-05 09:01:45.58 +100>,<MAYBRIDGE\nmr>,<NMR_250MHZ>,
      <created by zg, POWCHK disabled, PULCHK disabled
       configuration hash MD5:
       76 6E 9A 78 1E 09 19 81 EC 84 63 8F B0 6A 59 2D
       data hash MD5: 64K
       8A 53 CB 6D CD 4C 76 D2 5A 6C AD FB 7F 27 B9 63>)
(   2,<2007-07-05 09:02:02.60 +100>,<MAYBRIDGE\nmr>,<NMR_250MHZ>,
      <Start of raw data processing
       ef LB = 0.3 FT_mod = 6 PKNL = 1 SI = 32K 
       data hash MD5: 32K
       4F DF BD F7 B1 6D 25 E6 44 A7 38 05 16 E1 78 28>)
(   3,<2007-07-05 09:02:04.87 +100>,<MAYBRIDGE\nmr>,<NMR_250MHZ>,
      <apk 
       data hash MD5: 32K
       AE F1 5C F3 2E AB E9 C1 8A CE B9 2D A7 42 05 06>)
(   4,<2007-07-05 09:02:05.69 +100>,<MAYBRIDGE\nmr>,<NMR_250MHZ>,
      <abs ABSG = 5 
       data hash MD5: 32K
       21 C8 EF C5 0F CE CC 1C 54 59 0A 5E 5B 97 18 B0>)
$$ ##END=
$$ 
$$ hash MD5
$$ 53 1D 8C 4A B1 11 95 6D AD 06 AC 53 72 07 EB D2
##$RELAX= 
##$RELAX= 
##$RELAX= 
##$RELAX= 
##$RELAX= 
##$RELAX= 
##$RELAX= 
$$ Bruker specific parameters
$$ --------------------------
##$DU= <C:\u>
##$EXPNO= 420
##$NAME= <ADRS>
##$PROCNO= 1
##$TYPE= <nmr>
##$USER= <dgb>
##$AMP= (0..31)
100 100 100 100 100 100 100 100 100 100 100 100 100 100 100 100 100 100 
100 100 100 100 100 100 100 100 100 100 100 100 100 100 
##$AQSEQ= 0
##$AQ_mod= 3
##$AUNM= <au_zg>
##$AUTOPOS= <2 >
##$BF1= 250.13
##$BF2= 250.13
##$BF3= 250.13
##$BF4= 250.13
##$BF5= 500.13
##$BF6= 500.13
##$BF7= 500.13
##$BF8= 500.13
##$BYTORDA= 1
##$CFDGTYP= 0
##$CFRGTYP= 5
##$CHEMSTR= <none>
##$CNST= (0..31)
1 1 145 1 1 1 1 1 1 1 1 1 1 1 1 1 1 1 1 1 1 1 1 1 1 1 1 1 1 1 1 1 
##$CPDPRG= <>
##$CPDPRG1= <>
##$CPDPRG2= <>
##$CPDPRG3= <>
##$CPDPRG4= <mlev>
##$CPDPRG5= <mlev>
##$CPDPRG6= <mlev>
##$CPDPRG7= <mlev>
##$CPDPRG8= <mlev>
##$CPDPRGB= <>
##$CPDPRGT= <>
##$D= (0..31)
0 1 0 0 0 0 0 0 0 0.06 0 0 0 0 0 0 0.0002 0 0 0 0 0 0 0 0 0 0 0 0 0 0 
0 
##$DATE= 1183622504
##$DBL= (0..7)
120 120 120 120 120 120 120 120 
##$DBP= (0..7)
150 150 150 150 150 150 150 150 
##$DBP07= 0
##$DBPNAM0= <>
##$DBPNAM1= <>
$$ [...]
##$SUBNAM7= <"">
##$SUBNAM8= <"">
##$SUBNAM9= <"">
##$SW= 20.6930455092707
##$SWIBOX= (0..15)
0 0 3 0 0 0 0 0 0 0 0 0 0 0 0 0 
##$SW_h= 5175.983436853
##$TD= 65536
##$TD0= 1
##$TE= 296.16
##$TE2= 300
##$TE3= 300
##$TEG= 300
##$TL= (0..7)
0 120 120 120 120 120 120 120 
##$TP= (0..7)
150 150 150 150 150 150 150 150 
##$TP07= 0
##$TPNAME0= <>
##$TPNAME1= <>
##$TPNAME2= <>
##$TPNAME3= <>
##$TPNAME4= <>
##$TPNAME5= <>
##$TPNAME6= <>
##$TPNAME7= <>
##$TPOAL= (0..7)
0.5 0.5 0.5 0.5 0.5 0.5 0.5 0.5 
##$TPOFFS= (0..7)
0 0 0 0 0 0 0 0 
##$TUNHIN= 0
##$TUNHOUT= 0
##$TUNXOUT= 0
##$USERA1= <user>
##$USERA2= <user>
##$USERA3= <user>
##$USERA4= <user>
##$USERA5= <user>
##$V9= 5
##$VALIST= <valist>
##$VCLIST= <CCCCCCCCCCCCCCC>
##$VD= 0
##$VDLIST= <DDDDDDDDDDDDDDD>
##$VPLIST= <PPPPPPPPPPPPPPP>
##$VTLIST= <TTTTTTTTTTTTTTT>
##$WBST= 1024
##$WBSW= 4
##$XGAIN= (0..3)
0 0 0 0 
##$XL= 0
##$YL= 0
##$YMAX_a= 280003
##$YMIN_a= -196670
##$ZGOPTNS= <>
##$ZL1= 120
##$ZL2= 120
##$ZL3= 120
##$ZL4= 120
##$ABSF1= 16.522
##$ABSF2= -4.171173
##$ABSG= 5
##$ABSL= 3
##$ALPHA= 0
##$AQORDER= 0
##$ASSFAC= 0
##$ASSFACI= 0
##$ASSFACX= 0
##$ASSWID= 0
##$AUNMP= <proc_1d>
##$AZFE= 0.1
##$AZFW= 0.1
##$BCFW= 0
##$BC_mod= 0
##$BYTORDP= 0
##$COROFFS= 0
##$CY= 12.5
##$DATMOD= 1
##$DC= 0
##$DFILT= <>
##$DTYPP= 0
##$F1P= 14.0000005364418
##$F2P= -0.99999901652339
##$FCOR= 0.5
##$FTSIZE= 32768
##$FT_mod= 6
##$GAMMA= 0
##$GB= 0
##$INTBC= 1
##$INTSCL= 1
##$ISEN= 128
##$LB= 0.3
##$LEV0= 0
##$LPBIN= 0
##$MAXI= 10000
##$MC2= 0
##$MEAN= 0
##$ME_mod= 0
##$MI= 0
##$NCOEF= 0
##$NC_proc= -4
##$NLEV= 6
##$NOISF1= 0
##$NOISF2= 0
##$NSP= 0
##$NTH_PI= 0
##$NZP= 0
##$OFFSET= 16.522
##$PC= 1
##$PHC0= -60.92239
##$PHC1= 13.81032
##$PH_mod= 1
##$PKNL= yes
##$PPARMOD= 0
##$PSCAL= 4
##$PSIGN= 0
##$REVERSE= no
##$SF= 250.13
##$SI= 32768
##$SIGF1= 0
##$SIGF2= 0
##$SINO= 400
##$SIOLD= 32768
##$SREGLST= <1H.DMSO>
##$SSB= 0
##$STSI= 32768
##$STSR= 0
##$SW_p= 5175.98343685301
##$SYMM= 0
##$S_DEV= 0
##$TDeff= 65536
##$TDoff= 0
##$TI= <Analysis number 999999
Compound Code 99
Book Reference 9
Project Code 9>
##$TILT= no
##$TM1= 0
##$TM2= 0
##$TOPLEV= 0
##$USERP1= <user>
##$USERP2= <user>
##$USERP3= <user>
##$USERP4= <user>
##$USERP5= <user>
##$WDW= 1
##$XDIM= 32768
##$YMAX_p= 522548191
##$YMIN_p= -686366
$$ End of Bruker specific parameters
$$ ---------------------------------
##NTUPLES= NMR SPECTRUM
##VAR_NAME=  FREQUENCY,     SPECTRUM/REAL,   SPECTRUM/IMAG
##SYMBOL=    X,             R,               I
##VAR_TYPE=  INDEPENDENT,   DEPENDENT,       DEPENDENT
##VAR_FORM=  AFFN,          ASDF,            ASDF
##VAR_DIM=   32768,         32768,           32768
##UNITS=     HZ,            ARBITRARY UNITS, ARBITRARY UNITS
##FACTOR=    0.157963299565203, 1,           1
##FIRST=     4132.6476996994, 0,             0
##LAST=      -1043.33573715361, 0,           0
##MIN=       -1043.33573715361, -686366,     0
##MAX=       4132.6476996994, 522548191,     0
$$ Real data points
##PAGE= N=1
##DATA TABLE= (X++(R..R)), XYDATA
$$ [...]
##PAGE= N=2
##DATA TABLE= (X++(I..I)), XYDATA
$$ plain form
26362 635563 726082 714020 762981 766850 739745 725588 727015 718380 705861 702560 695646 697194 678422
26349 678422 653983 722775 820087 795626 770009 737468 719716 792821 789916 725465 703924 647930
26337 647930 633219 699435 657813 629209 687957 657573 637647 648507 650818 619430 596065 653727
26325 653727 693764 690750 680451 669337 628262 667518 696754 737625 714520 660834 635623 720442
26313 720442 817820 778861 698976 571869 642090 684122 664465 661700 639748 662616 645314
26302 645314 630177 668215 742518 720323 649582 637156 702247 711999 647847 581057 514049 588199
26290 588199 726444 679038 674183 585331 606990 665605 684656 745928 777774 727775 715117
26279 715117 686384 746833 729289 657980 704912 786551 766571 754079 780940 791169 867924
$$ packed form
26362F35563R0519j2062M8961L869k7105j4157J427q635j2519l301o914J548j8772
26349F78422k4439O8792R7312k4461k5617l2541j7752P3105k905o4451k1541n5994
26337F47930j4711O6216m1622k8604N8748l0384j9926J0860K311l1388k3365N7662
26325F53727M0037l014j0299j1114m1075L9256K9236M0871k3105n3686k5211Q4819
26313G20442R7378l8959p9885j27107P0221M2032j9657k765k1952K2868j7302
26302F45314j5137L8038P4303k2195p0741j2426O5091R752o4152o6790o7008P4150
26290E88199J38245m7406m855q8852K1659N8615J9051O1272L1846m9999j2658
26279G15117k8733O0449j7544p1309M6932Q1639j9980j2492K6861J0229P6755
$$ plain form
26268 867924 809840 675969 536965 556356 606986 600982 602072 621696 592356 612011 731286
26257 731286 735474 629334 624209 668864 717797 733405 717600 763898 881153 844002 722260
26246 722260 691451 719263 728288 757628 793178 778773 772198 748166 730906 623427 603524 681015
26234 681015 752858 758473 772447 782671 788220 850184 789155 726802 683045 686732 671424 596597
26222 596597 688787 714568 715733 685585 700945 668923 720836 751420 681587 678190 747583 782781
26210 782781 785487 771843 744891 763609 727699 635119 699645 774316 890225 878927 822806
26199 822806 811535 771662 831562 759327 735530 737399 687979 790061 813177 774016 708444
26188 708444 589424 643305 641089 635854 665753 741871 803739 847254 857511 832247 800271 836210
$$ packed form
26268H67924n8084j33871j39004J9391N0630o004J090J9624k9340J9655J19275
26257G31286M188j06140n125M4655M8933J5608j5805M6298J17255l7151j21742
26246G22260l0809K7812R025K9340L5550j4405o575k4032j7260j07479j9903P7491
26234F81015P1843N615J3974J0224N549O1964o1029o2353m3757L687j5308p4827
26222E96597R2190K5781J165l0148J5360l2022N1913L0584o9833l397O9393L5198
26210G82781K706j3644k6952J8718l5910r2580O4526P4671J15909j1298n6121
26199H22806j1271l9873N9900p2235k3797J869m9420J02082K3116l9161o5572
26188G08444j19020N3881k216n235K9899P6118O1868M3515J0257k5264l1976L5939
$$ plain form
26176 836210 822252 761093 750346 805965 764169 778900 798586 794991 720578 664264 612873 668001
26164 668001 668355 733821 799024 773438 755564 675191 660787 707734 714274 763580 741931 774607
26152 774607 742277 834659 913742 867141 839099 869391 923969 893327 883598 816464 828142 927092
26140 927092 890632 836303 846859 864399 805105 812403 836024 810080 732936 742424 751316 783365
26128 783365 774618 817632 909939 917970 900234 850969 740505 633668 558908 599277 636705
26117 636705 597840 645219 755055 765672 750119 847031 939995 869352 836318 863012 794182
26106 794182 743999 737107 730433 765983 754578 780892 817141 763730 724105 716091 710555 681729
26094 681729 734129 758188 773278 753716 735600 717549 746535 810570 801737 839987 800930 781032
$$ packed form
26176H36210j3958o1159j0747N5619m1796J4731J9686l595p4413n6314n1391N5128
26164F68001L54O5466O5203k5586j7874q0373j4404M6947O540M9306k1649L2676
26152G74607l2330R2382P9083m6601k8042L0292N4578l0642r729o7134J1678R8950
26140I27092l6460n4329J0556J7540n9294P298K3621k5944p7144R488Q892L2049
26128G83365q747M3014R2307Q031j7736m9265j10464j06837p4760M0369L7428
26117F36705l8865M7379J09836J0617j5553R6912R2964p0643l3034K6694o8830
26106G94182n0183o892o674L5550j1405K6314L6249n3411l9625q014n536k8826
26094F81729N2400K4059J5090j9562j8116j8051K8986O4035q833L8250l9057j9898
$$ plain form
26082 781032 833286 971424 871612 796514 728984 761485 817503 796923 776892 693683 640952
26071 640952 659219 692835 675620 600459 621847 639628 674838 711648 761715 787746 711773
26060 711773 716004 788822 770132 759225 763603 796480 797931 696593 767616 880382 829309 697752
26048 697752 622667 670618 811115 845307 911363 908676 859431 846749 738642 682359 724193
26037 724193 734046 694206 723237 756934 805928 866149 821597 766274 826298 775076 821330 895227
26025 895227 936290 949586 926406 824155 803711 880601 926744 851470 727813 634497 648957
26014 648957 640987 623469 685295 735390 814751 813095 845950 872652 823688 866347 917756 859034
26002 859034 762304 771675 734317 737495 750235 800723 819457 814567 829575 809636 759891 850417
$$ packed form
26082G81032N2254J38138r9812p5098o7530L2501N6018k0580k0031q3209n2731
26071F40952J8267L3616j7215p5161K1388J7781L5210L6810N0067K6031p5973
26060G11773M231P2818j8690j0907M378L2877J451j01338P1023J12766n1073j31557
26048F97752p5085M7951J40497L4192O6056k687m9245j2682j08107n6283M1834
26037G24193R853l9840K9031L3697M8994O0221m4552n5323O0024n1222M6254P3897
26025H95227M1063J3296k3180j02251k0444P6890M6143p5274j23657r3316J4460
26014F48957p970j7518O1826N0095P9361j656L2855K6702m8964M2659N1409n8722
26002H59034r6730R371l7358L178J2740N0488J8734m890J5008j9939m9745R0526
$$ plain form
25990 850417 945330 950760 912413 859435 893017 867406 849746 857354 863542 812538 784431 734625
25978 734625 672549 615812 638536 678847 725560 769507 753698 785316 833276 812952 774285
25967 774285 726634 767148 794938 811016 822228 843633 797397 775113 815545 753934 722372
25956 722372 769269 819422 797043 816572 853636 778784 710357 738554 814991 921172 884319
25945 884319 874429 810357 734166 718923 723679 693285 688897 656736 611153 573683 650720 793194
25933 793194 825848 765019 763981 789477 781860 792481 832046 848451 809220 742998 721281 687974
25921 687974 712324 747727 650819 693306 765699 714709 688085 687152 684587 679940 725800 721209
25909 721209 753523 730835 722108 758281 647021 628456 681859 736577 823892 842112 849604 841258
$$ packed form
25990H50417R4913N430l8347n2978L3582k5611j7660P608O188n1004k8107m9806
25978G34625o2076n6737K2724M0311M6713M3947j5809L1618M7960k0324l8667
25967G74285m7651M0514K7790J6078J1212K1405m6236k2284M0432o1611l1562
25956G22372M6897N0153k2379J9529L7064p4852o8427K8197P6437J06181l6853
25945H84319r890o4072p6191j5243M756l0394m388l2161m5583l7470P7037J42474
25933G93194L2654o0829j038K5496p617J0621L9565J6405l9231o6222k1717l3307
25921F87974K4350L5403r6908M2487P2393n0990k6624r33k565m647M5860m591
25909G21209L2314k2688q727L6173j11260j8565N3403N4718Q7315J8220P492q346
$$ plain form
25897 841258 808333 828818 814251 867892 840864 826310 773199 724799 775083 871792 954487
25886 954487 911118 865117 836595 865222 788153 735808 759691 782406 754954 787519 815397
25875 815397 845144 888694 823548 759426 811342 858747 886931 923747 874104 904505 929771
25864 929771 871992 879492 825991 718278 739455 829522 849992 775551 727199 747205 767378
25853 767378 812146 773237 669195 706148 781616 779534 782169 723771 750435 723733 569226
25842 569226 566950 631311 685597 626127 691534 781090 802922 885867 946647 852441 821263 816859
25830 816859 788112 823127 800422 808029 816591 868797 867806 826581 821733 859303 864862 819942 780130
25817 780130 813006 886273 904704 806397 792530 881701 888035 825774 861807 889154 803078 755895
$$ packed form
25897H41258l2925K0485j4567N3641k7028j4554n3111m8400N0284R6709Q2695
25886I54487m3369m6001k8522K8627p7069n2345K3883K2715k7452L2565K7878
25875H15397K9747M3550o5146o4122N1916M7405K8184L6816m9643L0401K5266
25864I29771n7779P500n3501j07713K1177R0067K0470p4441m8352K0006K0173
25853G67378M4768l8909j04042L6953P5468k082K635n8398K6664k6702j54507
25842E69226k276O4361N4286n9470O5407Q9556K1832Q2945O0780r4206l1178m404
25830H16859k8747L5015k2705P607Q562N2206r91m1225m848L7570N559m4920l9812
25817G80130L2876P3267J8431r8307j3867Q9171O334o2261L6033K7347q6076m7183
$$ plain form
25805 755895 834899 927516 974374 968811 974676 944022 794883 654797 652411 745901 844144 797697
25793 797697 700122 673170 674116 684521 706552 640810 600530 665630 692576 718853 819241 784113
25781 784113 730679 836780 861182 795435 792023 711650 704075 699039 703490 856615 928800 929637
25769 929637 846946 788169 815208 854178 801451 800079 801360 803572 784939 781560 759553 701726
25757 701726 764596 820243 825789 826370 831698 891607 898742 960543 924950 868515 796786 790533 800625
25744 800625 804856 813531 838418 806868 720054 748748 776143 828725 840855 847395 824497 786806
25732 786806 797588 757488 800418 836328 847243 757116 669172 704878 719007 754634 876944
25721 876944 898240 876200 883427 816111 806284 885304 979629 939580 890248 880195 850533 839726
$$ packed form
25805G55895P9004R2617M6858n563N865l0654j49139j40086k386R3490R8243m6447
25793G97697r7575k6952R46J0405K2031o5742m0280O5100K6946K6277J00388l5128
25781G84113n3434J06101K4402o5747l412q0373p575n036M451J53125P2185Q37
25769I29637q2691n8777K7039L8970n2727j372J281K212j8633l379k2007n7827
25757G01726O2870N5647N546N81N328N9909P135O1801l5593n6435p1729o253J0092
25744H00625M231Q675K4887l1550q6814K8694K7395N2582J2130O540k2898l7691
25732G86806J0782m0100M2930L5910J0915r0127q7944L5706J4129L5627J22310
25721H76944K1296k2040P227o7316r827P9020R4325m0049m9332j0053k9662j0807
$$ plain form
25709 839726 802347 812355 786601 788361 852702 824245 833880 883475 918376 869781 824917 854856
25697 854856 878231 851186 975049 969303 912936 794831 758221 767578 793849 749089 808211
25686 808211 894118 908300 906071 958276 1022995 945772 857999 833157 818326 845000 926166 969228
25674 969228 1005836 921333 837953 810133 764039 720932 766831 766213 822156 817250 840589 921426
25662 921426 865014 855910 880033 902605 936197 887351 874008 831266 845878 813244 823157 820419
25650 820419 785943 813839 847912 858001 940653 916666 836997 836559 814068 762818 731480 696308
25638 696308 838603 940019 904282 891592 821756 765980 803002 888133 934011 951677 875735
25627 875735 861012 849870 938226 994699 995497 943290 880749 825158 771655 773277 796749 759002
$$ packed form
25709H39726l7379J0008k5754J760O4341k8457R635M9595L4901m8595m4864K9939
25697H54856K3375k7045J23863n746n6367j18105l6610R357K6271m4760N9122
25686H08211Q5907J4182k229N2205O4719p7223q7773k4842j4831K6674Q1166M3062
25674I69228L6608q4503q3380k7820m6094m3107M5899o18N5943m906K3339Q0837
25662I21426n6412r104K4123K2572L3592m8846j3343m2742J4612l2634R913k738
25650H20419l4476K7896L4073J0089Q2652k3987p9669m38k2491n1250l1338l5172
25638F96308J42295J01416l5737j2690o9836n5776L7022Q5131M5878J7666p5942
25627H75735j4723j1142Q8356N6473P98n2207o2541n5591n3503J622K3472l7747
$$ plain form
25615 759002 714024 739659 726446 754890 798475 794233 821040 888938 860117 818370 823755 871821
25603 871821 940106 962787 873405 837448 776448 735713 756522 755981 821974 947701 990373 921601
25591 921601 808813 818063 871303 948046 908194 912254 877875 914393 994185 997687 897753 755235
25579 755235 730544 790937 757185 801969 855245 848421 842149 887136 905712 923483 978674 955246
25567 955246 934900 972314 968089 844449 844977 908301 929416 863481 893500 965859 924488 937064
25555 937064 1012408 991003 940940 931647 914520 922684 900992 821493 859874 886007 863700 809109
25543 809109 743854 767700 831627 841098 793539 717934 665884 706556 783990 835496 917303 888552
25531 888552 901344 957036 897188 804435 758990 739061 755316 832084 802226 778486 709573
$$ packed form
25615G59002m4978K5635j3213K8444M3585m242K6807O7898k8821m1747N385M8066
25603H71821O8285K2681q9382l5957o1000m0735K0809n41O5993J25727M2672o8772
25591I21601j12788R250N3240P6743l9852M060l4379L6518P9792L502r9934j42518
25579G55235k4691O0393l3752M4784N3276o824o272M4987J8576J7771N5191k3428
25567I55246k0346L7414m225j23640N28O3324K1115o5935L0019P2359m1371J2576
25555I37064P5344k1405n0063r293j7127Q164k1692p9499L8381K6133k2307n4591
25543H09109o5255K3846O3927R471m7559p5605n2050M0672P7434N1506Q1807k8751
25531H88552J2792N5692n9848r2753m5445j9929J6255P6768k9858k3740o8913
$$ plain form
25520 709573 708647 832842 846840 859647 878802 771310 783425 773998 801655 873686 859884 906707
25508 906707 1007933 1028559 939499 894631 893875 879939 948124 958986 938966 956736 919850 913114
25496 913114 882448 806951 731481 736105 876110 916150 862781 794958 735863 758419 856423
25485 856423 876094 842610 885863 953783 1006288 997845 967969 986172 985829 1002306 1031667 996046
25473 996046 923147 898107 937935 896472 892062 827391 878203 926446 883206 861461 870049 915629
25461 915629 900865 900048 943716 936834 826039 768474 844356 849142 899086 898282 953840 981850
25449 981850 879729 811315 832822 899808 903523 968543 970559 928346 914399 876315 885919 858286
25437 858286 825628 843805 882262 825879 875612 915576 926515 934317 917057 939245 990382 971732
$$ packed form
25520G09573r26J24195J3998J2807J9155j07492J2115r427K7657P2031j3802M6823
25508I06707J01226K0626q9060m4868p56j3936O8185J0862k0020J7770l6886o736
25496I13114l0666p5497p5470M624J40005M0040n3369o7823n9095K2556R8004
25485H56423J9671l3484M3253O7920N2505q443k9876J8203l43J6477K9361l5621
25473I96046p2899k5040L9828m1463m410o4671N0812M8243m3240k1745Q588M5580
25461I15629j4764q17M3668o882j10795n7565P5882M786M9944q04N5558K8010
25449I81850j02121o8414K1507O6986L715O5020K016m2213j3947l8084R604k7633
25437H58286l2658J8177L8457n6383M9733L9964J0939P802j7260K2188N1137j8650
$$ plain form
25425 971732 829506 859212 884036 858689 847296 835992 852162 879897 963490 975881 910882
25414 910882 883119 868698 838873 855499 880066 816665 740041 707722 789340 884400 848750
25403 848750 800821 782074 785557 832820 814965 795564 831772 882368 899280 937222 956807 896859
25391 896859 912696 861243 884702 932217 940787 911186 949101 912589 925693 1030236 1060240
25380 1060240 1048567 932392 881784 865488 829481 763970 817157 895407 990497 1004034 879607
25369 879607 906066 924808 913890 838701 833102 846887 868172 913381 921646 884010 876336 833436
25357 833436 804212 787530 794993 829573 828212 862072 796246 799887 854694 910006 995551 936428
25345 936428 920943 882422 821098 832323 850297 904197 924406 925608 925638 993378 1022975 999163
$$ packed form
25425I71732j42226K9706K4824k5347j1393j1304J6170K7735Q3593J2391o4999
25414I10882k7763j4421k9825J6626K4567o3401p6624l2319Q1618R5060l5650
25403H48750m7929j8747L483M7263j7855j9401L6208N0596J6912L7942J9585n9948
25391H96859J5837n1453K3459M7515Q570k9601L7915l6512J3104J04543L0004
25380A060240j1673j16175n0608j6296l6007o5511N3187P8250R5090J3537j24427
25369H79607K6459J8742j0918p5189n599J3785K1285M5209Q265l7636p674m2900
25357H33436k9224j6682P463L4580j361L3860o5826L641N4807N5312Q5545n9123
25345I36428j5485l8521o1324J1225J7974N3900K0209J202L0O7740K9597k3812
$$ plain form
25333 999163 991646 957443 934706 892586 872647 823582 806268 830053 824983 887973 915293 859091
25321 859091 941759 989113 906265 894735 924686 978130 886535 776356 795705 865840 863596
25310 863596 853799 868652 832404 873010 808011 722614 739299 841262 880886 943234 894861
25299 894861 819557 871348 981493 1016426 913371 809392 831599 945137 992515 1037154 1102801
25288 1102801 1019286 955982 877080 896412 862502 877493 906919 963115 1006166 1074257 1141715
25277 1141715 1055832 927456 933668 1009538 968041 957149 901442 922974 944748 976048 1015673
25266 1015673 961094 971945 940907 915683 890409 971772 1004463 945536 935511 954575 966044
25255 966044 932126 964552 948896 941784 976874 1003058 1021818 978823 981882 964412 963699 941736
$$ packed form
25333I99163p517l4203k2737m2120j9939m9065j7314K3785n070O2990K7320n6202
25321H59091Q2668M7354q2848j1530K9951N3444r1595j10179J9349P0135k244
25310H63596r797J4853l6248M0606o4999q5397J6685J01963L9624O2348m8373
25299H94861p5304N1791J10145L4933j03055j03979K2207J13538M7378M4639O5647
25288A102801q3515o3304p8902J9332l3910J4991K9426N6196M3051O8091O7458
25277A141715q5883j28376O212P5870m1497j0892n5707K1532K1774L1300L9625
25266A015673n4579J0851l1038k5224k5274Q1363L2691n8927j0025J9064J1469
25255I66044l3918L2426j5656p112L5090K6184J8760m2995L059j7470p13k1963
$$ plain form
25243 941736 942587 950780 928407 949422 953280 970341 989791 937983 868206 930881 1026249 1020533
25231 1020533 963922 1024891 1087944 1069402 1089794 995474 929181 910255 915845 970217 1041981
25220 1041981 1036975 1053946 965951 915103 954656 877192 866028 990321 1016706 1058879 1106867
25209 1106867 1046834 1029692 982696 954122 934851 913429 815781 803361 830883 855258 931367
25198 931367 1008658 1034308 1128881 1215188 1180722 1076308 996352 1066151 1049293 943616 862790
25187 862790 841456 911861 957046 982746 1017533 1004811 983226 1055124 990741 968723 952465
25176 952465 955890 943557 940342 956467 944126 943422 891211 864075 890273 911197 987585 1069398
25164 1069398 1136804 1091944 1014503 986463 919467 830008 853776 927149 896916 917004 953710
$$ packed form
25243I41736Q51Q193k2373K1015L858J7061J9450n1808o9777O2675R5368n716
25231A020533n6611O0969O3053j8542K0392r4320o6293j8926N590N4372P1764
25220A041981n006J6971q7995n0848L9553p7464j1164J24293K6385M2173M7988
25209A106867o0033j7142m6996k8574j9271k1422r7648j2420K7522K4375P6109
25198I31367P7291K5650R4573Q6307l4466j04414p9956O9799j6858j05677q0826
25187H62790k1334P0405M5185K5700L4787j2722k1585P1898o4383k2018j6258
25176I52465L425j2333l215J6125j2341p04n2211k7136K6198K0924P6388Q1813
25164A069398O7406m4860p7441k8040o6996q9459K3768P3373l0233K0088L6706
$$ plain form
25153 953710 1016808 980452 1000594 1031033 1050009 1097959 1104989 1084281 969106 966985 960979 958828
25141 958828 867522 863544 958422 1031060 1022529 911732 904659 930704 934551 989193 922278 921707
25129 921707 938929 872782 859009 856207 879644 898704 949614 1020855 997001 903508 903201 908742
25117 908742 908455 938669 998287 1060590 991962 997855 973330 949118 977035 986437 993061 997134 979483
25104 979483 948718 970052 982396 1032312 978061 895342 918665 1015374 1059089 976290 928514
25093 928514 951917 970145 917609 830491 886836 955075 1011127 1022172 1028057 1063986 1049049 955141
25081 955141 959276 948924 952761 1018346 1058065 1075037 1051573 1037432 1092292 1045929 1005614 1007500
25069 1007500 1040636 922762 850493 904582 952545 913360 999479 1047145 1096828 1101267 1011144
$$ packed form
25153I53710O3098l6356K0142L0439J8976M7950P030k0708j15175k121o006k151
25141I58828r1306l978R4878P2638q531j10797p073K6045L847N4642o6915n71
25129I21707J7222o6147j3773k802K3437J9060N0910P1241k3854r3493l07N541
25117I08742k87L0214N9618O2303o8628N893k4525k4212K7917R402O624M073j7651
25104I79483l0765K1334J2344M9916n4251q2719K3323R6709M3715q2799m7776
25093I28514K3403J8228n2536q7118N6345O8239N6052J1045N885L5929j4937r3908
25081I55141M135j0352L837O5585L9719J6972k3464j4141N4860m6363m0315J886
25069A007500L3136j17874p2269N4089M7963l9185Q6119M7666M9683M439r0123
$$ plain form
25058 1011144 1053148 1084620 984130 938135 892911 915723 955583 981116 925815 907251 923459
25047 923459 887532 924845 988637 1019269 997571 935148 924090 893365 897634 978337 1011090 1078460
25035 1078460 1044880 929190 867155 879403 932670 898184 904472 947942 932805 894233 895376
25024 895376 916599 1020752 987541 971666 1063872 1148495 1127404 1101594 992571 963048 967022
25013 967022 893577 879011 860519 849652 972793 1074417 1123370 1173216 1046085 944422 964317
25002 964317 959713 957307 990366 1030651 1087760 1020689 922177 939899 1041597 1069057 1013967 921940
24990 921940 903724 1023771 1006964 965172 989147 935053 891229 945850 1037871 973332 937973
24979 937973 944449 947728 1007749 934765 869104 869736 893544 921150 962016 964580 943169 978833
$$ packed form
25058A011144M2004L1472j00490m5995m5224K2812L9860K5533n5301j8564J6208
25047I23459l5927L7313O3792L0632k1698o2423j1058l0725M269Q0703L2753O7370
25035A078460l3580j15690o2035J2248N3267l4486O288M3470j5137l8572J143
25024H95376K1223J04153l3211j5875R2206Q4623k1091k5810j09023k9523L974
25013I67022p3445j4566j8492j0867J23141J01624M8953M9846j27131j01663J9895
25002I64317m604k406L3059M0285N7109o7071r8512J7722J01698K7460n5090r2027
24990I21940j8216J20047j6807m1792K3975n4094m3824N4621R2021o4539l5359
24979I37973O476L279O0021p2984o5661O32K3808K7606M0866K564k1411L5664
$$ plain form
24967 978833 963738 934474 958944 994395 995752 972644 922408 1039928 1108223 1028226 1015855
24956 1015855 1036448 1087203 993831 941576 1021166 1104444 1132319 1112403 1044914 959594 1084434
24945 1084434 1104149 989457 945490 1013324 1078468 1094017 1054617 934440 947054 970563 956325
24934 956325 951957 978709 981623 1043256 1035140 1083307 1019407 920855 981086 1166826 1170995 1080765
24922 1080765 1005374 1038714 995135 997660 1059233 1105563 1038040 978812 989485 909640 846465
24911 846465 887652 991063 983715 1008811 1057754 1090771 1077530 1044239 1011561 1031615 1041091 1047575
24899 1047575 1061430 999235 967228 985233 1015898 1079759 1014304 953693 1018752 1093748 1080269
24888 1080269 982040 934222 975810 996787 1030536 1029291 1003171 929539 899881 963929 1017254
$$ packed form
24967I78833j5095k9264K4470L5451J357k3108n0236J17520O8295p9997j2371
24956A015855K0593N0755r3372n2255P9590Q3278K7875j9916o7489q5320J24840
24945A084434J9715j14692m3967O7834O5144J5549l9400j20177J2614K3509j4238
24934I56325m368K6752K914O1633q116M8167o3900r8552O0231J85740M169r0230
24922A080765p5391L3340m3579K525O1573M6330o7523n9228J0673p9845o3175
24911H46465M1187J03411p348K5096M8943L3017j3241l3291l2678K0054R476O484
24899A047575J3855o2195l2007J8005L0665O3861o5455o0611O5059P4996j3479
24888A080269r8229m7818M1588K0977L3749j245k6120p3632k9658O4048N3325
$$ plain form
24877 1017254 996697 957641 969291 1000983 1027091 1013833 908074 918109 945278 993253 1018537
24866 1018537 1001845 930657 918476 929308 916632 974777 1004464 1001085 1013168 979445 972786 1029154
24854 1029154 1088837 1097410 965740 962817 1003431 943890 899649 890307 949646 1069814 1166645
24843 1166645 1131121 1025265 911958 952128 1004855 993732 1015188 940232 970500 976357 975250
24832 975250 1064806 1087417 1064859 1139165 1104212 1094956 1104678 1079510 1114804 1098835 1116483 1078433
24820 1078433 1062502 1023584 954135 956988 1010669 1016273 1035722 1045127 1050433 1035779 1049176 1044071
24808 1044071 1016675 1031704 1020789 1089431 1073698 1071846 1071660 1043598 1042002 1106959 1103471 1021746
24796 1021746 1010323 984282 949160 1015531 1047392 997182 987784 996845 973915 1089994 1196972
$$ packed form
24877A017254k0557l9056J1650L1692K6108j3258j05759J0035K7169M7975K5284
24866A018537j6692p1188j2181J0832j2676N8145K9687l379J2083l3723o659N6368
24854A029154N9683Q573j31670k923M0614n9541m4241r342N9339J20168R6831
24843A166645l5524j05856j13307M0170N2727j1123K1456p4956L0268N857j107
24832I75250Q9556K2611k2558P4306l4953r256R722k5168L5294j5969J7648l8050
24820A078433j5931l8918o9449K853N3681N604J9449R405N306j4654J3397n105
24808A044071k7396J5029j0915O8642j5733j852j86k8062j596O4957l488q1725
24796A021746j1423k6041l5122O6371L1861n0210r398R061k2930J16079J06978
$$ plain form
24785 1196972 1265434 1244613 1222622 1190276 1140569 1073713 1050774 1053526 1037519 1000630 997783 1009855
24773 1009855 986294 915245 931366 949336 998397 993425 963691 999295 989862 1031466 1095227 1011154
24761 1011154 959004 944386 960111 1074868 1052081 1036465 982381 946814 1011632 1124189 1161335
24750 1161335 1144387 1161731 1076226 998749 1045821 1186120 1165520 1069695 1008201 1007120 972834
24739 972834 915373 918945 911457 955385 947098 964339 1145925 1199434 1106630 1102665 1132854 1130779
24727 1130779 1142626 1150349 1131663 1120196 1092729 1031202 955498 940842 934144 995930 1052441 994853
24715 994853 875959 798104 907899 1037656 1014855 1047268 1100257 1148599 1087161 1038590 1030164
24704 1030164 1055857 1063079 1058273 953791 906153 1016536 1094936 1038676 984770 1020721 1070403
$$ packed form
24785A196972O8462k0821k1991l2346m9707o6856k2939K752j6007l6889k847J2072
24773A009855k3561p1049J6121J7970M9061m972k9734L5604r433M1604O3761q4073
24761A011154n2150j4618J5725J14757k2787j5616n4084l5567O4818J12557L7146
24750A161335j6948J7344q5505p7477M7072J40299k0600r5825o1494j081l4286
24739I72834n7461L572p488M3928q287J7241J81586N3509r2804l965L0189k075
24727A130779J1847P723j8686j1467k7467o1527p5704j4656o698O1786N6511n7588
24715I94853j18894p7855J09795J29757k2801L2413N2989M8342o1438m8571q426
24704A030164K5693P222m806j04482m7638J10383P8400n6260n3906L5951M9682
$$ plain form
24693 1070403 1180429 1190190 1186228 1145974 1170026 1175036 1088637 1043362 1087754 1047171 1036089 1056322
24681 1056322 1142672 1193271 1149440 1145841 1173104 1153440 1079866 1022494 1001163 927439 939054
24670 939054 930139 962938 1027013 983699 1012374 996583 1088573 1153435 1106100 1137027 1134767 1104554
24658 1104554 1060318 1112633 1161038 1102312 1008989 986756 1066044 1068672 1070906 1061833 1074473 1062705
24646 1062705 1087729 1136172 1119647 1086087 1165399 1168416 1135859 1091607 1018264 962706 983611
24635 983611 1036798 1019673 1035075 1031840 988520 1080685 1057480 1124618 1137207 1077666 1042325 1045840
24623 1045840 1117953 1120484 1138203 1122993 1020865 1041152 1171568 1172845 1153714 1123132 1158921
24612 1158921 1116834 1119506 1090780 1068535 1088939 1118238 1109166 1079932 1020290 1007331 1039075 1104514
$$ packed form
24693A070403J10026R761l962m0254K4052N010q6399m5275M4392m0583j1082K0233
24681A056322Q6350N0599m3831l599K7263j9664p3574n7372k1331p3724J1615
24670I39054q915L2799O4075m3314K8675j5791R1990O4862m7335L0927k260l0213
24658A104554m4236N2315M8405n8726r3323k2233P9288K628K234r073J2640j1768
24646A062705K5024M8443j6525l3560P9312L017l2557m4252p3343n5558K0905
24635I83611N3187j7125J5402l235m3320R2165k3205O7138J2589n9541l5341L515
24623A045840P2113K531J7719j5210j02128K0287J30416J277j9131l0582L5789
24612A158921m2087K672k8726k2245K0404K9299r072k9234n9642j2959L1744O5439
$$ plain form
24600 1104514 1173788 1120815 1029104 947133 961363 1029709 1062866 1028562 1123595 1227703 1221352
24589 1221352 1154209 1090879 1155973 1179037 1107564 1080347 1100825 1082503 1103432 1058005 951886
24578 951886 953098 1000281 981066 938971 984033 1007230 1021579 993292 1034174 1112222 1156824 1087614
24566 1087614 1058034 1127232 1136975 1189340 1204807 1143992 1067611 1090127 1165503 1152708 1131571
24555 1131571 1109808 1224704 1260690 1225881 1182832 1131668 1157795 1147512 1094696 1125173 1215515
24544 1215515 1206339 1085917 1024707 1041647 1067970 1166629 1177746 1170126 1132473 1033504 938544
24533 938544 949483 906222 895831 964847 1064699 1062802 959966 864504 909269 945140 905961
24522 905961 954977 1019209 1028535 1000373 1096205 1165188 1128626 1050860 1051659 1049819 1066861 1048846
$$ packed form
24600A104514O9274n2973r1711q1971J4230O8346L3157l4304R5033J04108o351
24589A221352o7143o3330O5094K3064p1473k7217K0478j8322K0929m5427j06119
24578I51886J212M7183j9215m2095M5062K3197J4349k8287M0882P8048M4602o9210
24566A087614k9580O9198R743N2365J5467o0815p6381K2516P5376j2795k1137
24555A131571k1763J14896L5986l4809m3049n1164K6127j0283n2816L0477R0342
24544A215515r176j20422o1210J6940K6323R8659J1117p620l7653r8969r4960
24533I38544J0939m3261j0391O9016R9852j897j02836r5462M4765L5871l9179
24522I05961M9016O4232R326k8162R5832O8983l6562p7766P99j840J7042j8015
$$ plain form
24510 1048846 1095981 1098487 1019829 965892 1037290 1036057 1111751 1198920 1199283 1107617 1080241 1105904
24498 1105904 1192980 1231489 1277312 1351876 1326233 1305185 1291468 1265231 1218327 1177146 1180563
24487 1180563 1103247 1109143 1206512 1174605 1123647 1090009 1110985 1118169 1109786 1147949 1072902 1083333
24475 1083333 1089569 1028943 950719 941797 1000777 1051354 1093755 1059808 1038434 1032175 1057213 1168977
24463 1168977 1234359 1193173 1120434 1126256 1082803 1063573 1077320 1083512 1062674 1099155 1091049 1077958
24451 1077958 1038467 1055176 1014427 1058521 1084801 1098535 1205277 1260678 1299163 1297589 1196908
24440 1196908 1136843 1075038 1058470 1052959 1078305 1132614 1195885 1294112 1261851 1163296 1084837
24429 1084837 1001090 964000 994427 1127154 1220693 1208519 1188697 1170430 1170276 1144345 1014345
$$ packed form
24510A048846M7135K506p8658n3937P1398j233P5694Q7169L63r1666k7376K5663
24498A105904Q7076L8509M5823P4564k5643k1048j3717k6237m6904m1181L417
24487A180563p7316N896R7369l1907n0958l3638K0976P184q383L8163p5047J0431
24475A083333O236o0626p8224q922N8980N0577M2401l3947k1374o259K5038J11764
24463A168977O5382m1186p2739N822m3453j9230J3747O192k0838L6481q106j3091
24451A077958l9491J6709m0749M4094K6280J3734J06742N5401L8485j574j00681
24440A196908o0065o1805j6568n511K5346N4309O3271R8227l2261r8555p8459
24429A084837q3747l7090L0427J32727R3539j2174j9822j8267j54k5931j30000
$$ plain form
24418 1014345 973090 1026633 1050955 1069296 1077716 1066217 1101650 1080903 1091283 1192605 1187979
24407 1187979 1156817 1099566 1095076 1055296 1082673 1121575 1083759 1100092 1113954 1168266 1076665
24396 1076665 1054404 1125218 1188854 1165193 1077792 1062036 1069783 1121372 1231369 1297404 1243850
24385 1243850 1214452 1231590 1216697 1219656 1266388 1294513 1230648 1112495 1096094 1118312 1204475
24374 1204475 1226967 1215468 1161083 1105082 1159781 1214716 1186862 1170555 1161262 1098025 1126267
24363 1126267 1115791 1101173 1158131 1132747 1143607 1132629 1110419 1112870 1129225 1050555 1096974
24352 1096974 1159860 1259734 1232424 1178281 1091919 1012147 1052137 1122228 1236202 1301327 1274523
24341 1274523 1227801 1145181 1165139 1136087 1154380 1147627 1066030 1060676 1063772 1042618 1107251 1077098
$$ packed form
24418A014345m1255N3543K4322J8341Q420j1499L5433k0747J0380J01322m626
24407A187979l1162n7251m490l9780K7377L8902l7816J6333J3862N4312r1601
24396A076665k2261P0814O3636k3661q7401j5756P747N1589J09997O6035n3554
24385A243850k9398J7138j4893K959M6732K8125o3865j18153j6401K2218Q6163
24374A204475K2492j1499n4385n6001N4699N4935k7854j6307r293o3237K8242
24363A126267j0476j4618N6958k5384J0860j0978k2210K451J6355p8670M6419
24352A096974O2886R9874k7310n4143q6362p9772L9990P0091J13974O5125k6804
24341A274523m6722q2620J9958k9052J8293o753q1597n354L096k1154O4633l0153
$$ plain form
24329 1077098 1089581 1156482 1170883 1225466 1289676 1224242 1167847 1119378 1084493 1175688 1246704
24318 1246704 1193247 1142702 1134451 1123941 1116861 1183654 1173166 1121613 1152141 1159348 1132393 1099140
24306 1099140 1073409 1092427 1162677 1090407 1098357 1175835 1181387 1233272 1266409 1170191 1141463 1169049
24294 1169049 1188287 1162243 1137223 1124846 1109867 1130970 1198837 1185304 1151105 1169258 1267409
24283 1267409 1344520 1294379 1142261 1014462 1047106 1133120 1162148 1180133 1191988 1097337 1048274
24272 1048274 1027972 1113437 1131803 1121365 1209855 1262114 1278910 1236182 1194253 1203832 1194861 1127450
24260 1127450 1184890 1235071 1181021 1194601 1299236 1343763 1318114 1327387 1274041 1245760 1312830
24249 1312830 1255579 1165003 1106928 1150003 1217611 1253382 1253640 1172874 1160471 1185449 1276055 1218057
$$ packed form
24329A077098J2483O6901J4401N4583O4210o5434n6395m8469l4885R1195P1016
24318A246704n3457n0545q251j0510p080O6793j0488n1553L0528P207k6955l3253
24306A099140k5731J9018P0250p2270P950P7478N552N1885L3137r6218k8728K7586
24294A169049J9238k6044k5020j2377j4979K1103O7867j3533l4199J8153R8151
24283A267409P7111n0141j52118j27799L2644Q6014K9028J7985J1855r4651m9063
24272A048274k0302Q5465J8366j0438Q8490N2259J6796m2728m1929R579q971o7411
24260A127450N7440N0181n4050J3580J04635M4527k5649R273n3346k8281O7070
24249A312830n7251r0576n8075M3075O7608L5771K58q0766j2403K4978R0606n7998
$$ plain form
24237 1218057 1255447 1227285 1139934 1090355 1157865 1187409 1206248 1244503 1230418 1293817 1338543
24226 1338543 1268552 1200770 1081629 1044143 1064005 1159281 1174169 1151661 1208532 1203732 1211206
24215 1211206 1126798 1122461 1162421 1150404 1094036 1095146 1137282 1165606 1199594 1227392 1201616 1196745
24203 1196745 1249326 1329069 1344308 1318708 1289425 1184467 1174956 1262701 1220767 1142880 1107908
24192 1107908 1227619 1365152 1342238 1331189 1330056 1284861 1277807 1299486 1299615 1255091 1199515 1326913
24180 1326913 1290687 1266105 1280778 1233702 1191162 1177397 1099134 1153483 1237313 1182177 1187890
24169 1187890 1148177 1079314 1144653 1222128 1175810 1159232 1124729 1115573 1192036 1209516 1152121
24158 1152121 1192651 1227577 1205115 1214901 1243546 1321177 1241684 1220507 1239171 1247026 1278456 1288360
$$ packed form
24237A218057L7390k8162q7351m9579O7510K9544J8839L8255j4085O3399M4726
24226A338543o9991o7782j19141l7486J9862R5276J4888k2508N6871m800P474
24215A211206q4408m337L9960j2017n6368J110M2136K8324L3988K7798k5776m871
24203A196745N2581P9743J5239k5600k9283j04958r511Q7745m1934p7887l4972
24192A107908J19711J37533k2914j1049j133m5195p054K1679J29m4524n5576J27398
24180A326913l6226k4582J4673m7076m2540j3765p8263N4349Q3830n5136N713
24169A187890l9713o8863O5339P7475m6318j6578l4503r156P6463J7480n7395
24158A152121M0530L4926k2462R786K8645P7631p9493k1177J8664P855L1430R904
$$ plain form
24146 1288360 1329090 1366504 1358814 1329754 1296600 1244669 1310471 1351222 1285671 1227281 1209884
24135 1209884 1186035 1235841 1276882 1288980 1306212 1235465 1307837 1264155 1192780 1184521 1178237 1214044
24123 1214044 1283644 1319312 1357957 1297316 1333585 1439425 1409641 1348940 1295180 1263671 1199881
24112 1199881 1238916 1256205 1305999 1331649 1377855 1301006 1230466 1213806 1215604 1283827 1190572
24101 1190572 1153184 1207318 1221361 1263543 1202780 1225639 1237844 1236062 1218000 1249492 1275271
24090 1275271 1291161 1321520 1316317 1326120 1339300 1317354 1331665 1303537 1263141 1242221 1186174 1200313
24078 1200313 1227457 1317208 1308664 1268533 1250055 1218584 1224339 1264213 1227976 1211928 1247466 1184644
24066 1184644 1195088 1166255 1168826 1188611 1199444 1284750 1296843 1384038 1450256 1468604 1423256
$$ packed form
24146A288360M0730L7414p690k9060l3154n1931O5802M0751o5551n8390j7397
24135A209884k3849M9806M1041J2098J7232p0747P2372m3682p1375q259o284L5807
24123A214044O9600L5668L8645o0641L6269J05840k9784o0701n3760l1509o3790
24112A199881L9035J7289M9794K5650M6206p6849p0540j6660J798O8223r3255
24101A190572l7388N4134J4043M2182o0763K2859J2205j782j8062L1492K5779
24090A275271J5890L0359n203R803J3180k1946J4311k8128m0396k0920n6047J4139
24078A200313K7144Q9751q544m0131j8478l1471N755L9874l6237j6048L5538o2822
24066A184644J0444k8833K571J9785J0833Q5306J2093Q7195O6218J8348m5348
$$ plain form
24055 1423256 1400098 1329102 1339348 1374674 1434055 1461388 1446952 1401120 1359527 1251321 1307378
24044 1307378 1333001 1325305 1282594 1208513 1251335 1294864 1324624 1336254 1251668 1186233 1243261
24033 1243261 1279808 1187474 1214296 1249303 1205834 1234782 1215711 1246581 1262283 1206858 1171166
24022 1171166 1270867 1350621 1374660 1345387 1407043 1423542 1408854 1396522 1420703 1346256 1296716
24011 1296716 1337535 1275160 1282096 1305241 1267252 1249685 1264871 1259853 1199015 1199486 1185535 1276657
23999 1276657 1297167 1303251 1238660 1222077 1285763 1251779 1184837 1277150 1218140 1195322 1205236 1212977
23987 1212977 1204489 1186076 1219843 1267376 1272491 1264155 1221046 1297526 1331867 1257103 1254720 1280173
23975 1280173 1283577 1305954 1305568 1272550 1337583 1314996 1277255 1319602 1323476 1330009 1343057 1366334
$$ packed form
24055A423256k3158p0996J0246L5326N9381K7333j4436m5832m1593j08206N6057
24044A307378K5623p696m2711p4081M2822M3529K9760J1630q4586o5435N7028
24033A243261L6547r2334K6822L5007m3469K8948j9071L0870J5702n5425l5692
24022A171166R9701P9754K4039k9273O1656J6499j4688j2332K4181p4447m9540
24011A296716M0819o2375O936K3145l7989j7567J5186n018o0838M71j3951R1122
23999A276657K0510O084o4591j6583O3686l3984o6942R2313n9010k2818R914P741
23987A212977q488j8413L3767M7533N115q336m3109P6480L4341p4764k383K5453
23975A280173L404K2377l86l3018O5033k2587l7741M2347L874O533J3048K3277
$$ plain form
23963 1366334 1287211 1218979 1182797 1219854 1208664 1276728 1280241 1217893 1104703 1072062 1140698
23952 1140698 1147965 1255782 1298034 1244726 1185917 1232383 1194931 1242470 1311281 1269074 1232671
23941 1232671 1231083 1199423 1220694 1243942 1167233 1093507 1082459 1183586 1221792 1273538 1252487
23930 1252487 1245414 1356926 1422012 1375183 1359877 1387397 1367805 1317515 1305198 1316126 1260838
23919 1260838 1269457 1235817 1242252 1359988 1330834 1322477 1405082 1373381 1321252 1304290 1232053 1205553
23907 1205553 1165103 1190693 1246069 1290375 1240285 1254694 1282150 1301057 1307055 1271405 1290519
23896 1290519 1319975 1268250 1256658 1280157 1329342 1343186 1323559 1326088 1269041 1253215 1282645
23885 1282645 1311339 1268998 1378283 1428565 1326802 1377321 1426891 1328357 1324137 1355283 1370147
$$ packed form
23963A366334p9123o8232l6182L7057j1190O8064L513o2348j13190l2641O8636
23952A140698P267J07817M2252n3308n8809M6466l7452M7539O8811m2207l6403
23941A232671j588l1660K1271K3248p6709p3726j1048J01127L8206N1746k1051
23930A252487p073J11512O5086m6829j5306K7520j9592n0290j2317J0928n5288
23919A260838Q619l3640O435J17736k9154q357Q2605l1701n2129j6962p2237k6500
23907A205553m0450K5590N5376M4306n0090J4409K7456J8907N998l5650J9114
23896A290519K9456n1725j1592K3499M9185J3844j9627K529n7047j5826K9430
23885A282645K8694m2341J09285N0282j01763N0519M9570r8534m220L1146J4864
$$ plain form
23874 1370147 1396801 1361884 1280599 1267363 1267152 1242490 1281389 1277140 1304183 1308050 1300234 1275051
23862 1275051 1268022 1367578 1401836 1378068 1301244 1250045 1221228 1186118 1209320 1224450 1392667
23851 1392667 1476639 1406577 1399737 1429391 1395940 1249634 1198055 1193723 1224047 1229102 1285608 1368943
23839 1368943 1374750 1394681 1466801 1459745 1367626 1399170 1536637 1530693 1494320 1475379 1413839 1381913
23827 1381913 1348285 1304189 1277859 1362472 1415778 1410624 1334811 1264686 1265849 1301825 1245380 1121212
23815 1121212 1157985 1227167 1216834 1197969 1224793 1204291 1180246 1284043 1347947 1307563 1294067
23804 1294067 1364128 1330569 1319899 1316096 1335676 1403869 1438479 1476202 1349378 1234210 1142212
23793 1142212 1222709 1269818 1302537 1390924 1342197 1334391 1391826 1402859 1379388 1449034 1528874
$$ packed form
23874A370147K6654l4917q1285j3236k11k4662L8899m249K7043L867p816k5183
23862A275051p029R9556L4258k3768p6824n1199k8817l5110K3202J5130J68217
23851A392667Q3972p0062o840K9654l3451j46306n1579m332L0324N055N6506Q3335
23839A368943N807J9931P2120p056r2119L1544J37467n944l6373j8941o1540l1926
23827A381913l3628m4096k6330Q4613N3306n154p5813p0125J163L5976n6445j24168
23815A121212L6773O9182j0333j8865K6824k0502k4045J03797O3904m0384j3496
23804A294067P0061l3559j0670l803J9580O8193L4610L7723j26824j15168r1998
23793A142212Q0497M7109L2719Q8387m8727p806N7435J1033k3471O9646P9840
$$ plain form
23782 1528874 1561161 1511980 1461060 1406866 1402225 1438185 1422640 1452778 1377802 1384806 1457396 1450889
23770 1450889 1368768 1387212 1390768 1313568 1344938 1387314 1362786 1352137 1379498 1341809 1340251 1323477
23758 1323477 1283356 1339038 1360217 1309171 1371719 1347924 1310350 1344667 1328821 1302759 1305381
23747 1305381 1359981 1425038 1424337 1332936 1324603 1323499 1296251 1301467 1339566 1352799 1328213 1389335
23735 1389335 1418181 1340261 1332557 1417641 1463948 1535308 1456236 1374335 1359396 1393528 1382704
23724 1382704 1346931 1361502 1343316 1332712 1328578 1322672 1373521 1356566 1348680 1414392 1390984 1455947
23712 1455947 1473027 1473462 1383617 1339330 1466314 1468039 1424659 1472134 1486964 1452733 1346048
23701 1346048 1386012 1454075 1435034 1435888 1544714 1562078 1375719 1357343 1302571 1271054 1328249
$$ packed form
23782A528874L2287m9181n0920n4194m641L5960j5545L0138p4976P004P2590o507
23770A450889q2121J8444L556p7200L1370M2376k4528j0649K7361l7689j558j6774
23758A323477m0121N5682K1179n1046O2548k3795l7574L4317j5846k6062K622
23747A305381N4600O5057p01r1401q333j104k7248N216L8099J3233k4586O1122
23735A389335K8846p7920p704Q5084M6307P1360p9072q1901j4939L4132j0824
23724A382704l5773J4571j8186j0604m134n906N0849j6955p886O5712k3408O4963
23712A455947J7080M35q9845m4287J26984J725m3380M7475J4830l4231j06685
23701A346048L9964O8063j9041Q54J08826J7364j86359j8376n4772l1517N7195
$$ plain form
23690 1328249 1306856 1298563 1356835 1409776 1395908 1387745 1376073 1324531 1342025 1351297 1379490 1416284
23678 1416284 1420988 1400319 1416625 1439306 1401330 1343950 1298123 1333492 1414274 1421817 1427477 1407030
23666 1407030 1368734 1390894 1369270 1353455 1373766 1306452 1279272 1321257 1365574 1381814 1424844
23655 1424844 1369668 1356624 1391715 1397512 1314448 1305615 1288816 1347926 1405844 1463889 1466128 1454198
23643 1454198 1431244 1407291 1472581 1460088 1439807 1454548 1405295 1414930 1442435 1340953 1255028
23632 1255028 1261921 1359645 1470298 1452590 1460163 1498258 1494244 1403186 1422535 1432292 1441598 1376869
23620 1376869 1351997 1341816 1422009 1474915 1390243 1388207 1366126 1396527 1347074 1296470 1340846
23609 1340846 1431686 1427409 1342387 1331214 1421887 1464431 1383227 1276595 1274569 1293778 1279591
$$ packed form
23690A328249k1393q293N8272N2941j3868q163j1672n1542J7494R272K8193L6794
23678A416284M704k0669J6306K2681l7976n7380m5827L5369Q0782P543N660k0447
23666A407030l8296K2160k1624j5815K0311o7314k7180M1985M4317J6240M3030
23655A424844n5176j3044L5091N797q3064q833j6799N9110N7918N8045K239j1930
23643A454198k2954k3953O5290j2493k0281J4741m9253R635K7505j01482q5925
23632A255028O893R7724J10653j7708P573L8095m014r1058J9349R757R306o4729
23620A376869k4872j0181Q0193N2906q4672k036k2081L0401m9453n0604M4376
23609A340846R0840m277q5022j1173R0673M2544q1204j06632k026J9209j4187
$$ plain form
23598 1279591 1330731 1387578 1399078 1391392 1418572 1489704 1465189 1383985 1449736 1469684 1405866
23587 1405866 1406936 1418688 1439688 1439128 1354869 1298572 1283552 1276228 1303833 1361475 1319442 1423517
23575 1423517 1480682 1384507 1344066 1395389 1443917 1442978 1423604 1468663 1466109 1402178 1428033 1488424
23563 1488424 1487978 1445676 1358839 1347889 1301849 1266571 1306976 1374319 1415539 1466260 1344233
23552 1344233 1223323 1248220 1360911 1428155 1410807 1361990 1358622 1340900 1322681 1372471 1328010
23541 1328010 1374086 1411027 1402130 1519990 1556255 1539791 1503507 1531588 1553100 1534239 1492588
23530 1492588 1468138 1441979 1435661 1444912 1441834 1479887 1489177 1496209 1470101 1455528 1445968 1488904
23518 1488904 1571595 1533983 1481377 1531587 1569880 1555424 1507019 1500027 1400143 1376999 1400055
$$ packed form
23598A279591N1140N6847J1500p686K7180P1132k4515q1204O5751J9948o3818
23587A405866J070J1752K1000n60q4259n6297j5020p324K7605N7642m2033J04075
23575A423517N7165r6175m0441N1323M8528r39j9374M5059k554o3931K5855O0391
23563A488424m46m2302q6837j0950m6040l5278M0405O7343M1220N0721j22027
23552A344233j20910K4897J12691O7244j7348m8817l368j7722j8219M9790m4461
23541A328010M6076L6941q897J17860L6265j6464l6284K8081K1512j8861m1651
23530A492588k4450k6159o318R251l078L8053R290P032k6108j4573r560M2936
23518A488904Q2691l7612n2606N0210L8293j4456m8405o992r9884k3144K3056
$$ plain form
23507 1400055 1441446 1468511 1489400 1469904 1453508 1450227 1445664 1427347 1425163 1380463 1317885 1302404
23495 1302404 1384580 1391725 1318627 1448600 1530126 1504753 1540435 1589897 1656421 1600311 1501137
23484 1501137 1475963 1511414 1487936 1503055 1444695 1411002 1351588 1420164 1541135 1567484 1547618
23473 1547618 1513303 1481172 1506752 1519896 1494672 1521385 1543618 1545223 1434535 1378420 1357221
23462 1357221 1445142 1489998 1465844 1439936 1466176 1484155 1398601 1407582 1452925 1508142 1517508 1558901
23450 1558901 1590556 1535625 1472567 1482783 1460292 1473534 1445867 1496477 1494177 1427567 1454865
23439 1454865 1500210 1524582 1543809 1587946 1447618 1290036 1318171 1383505 1342780 1360029 1436005
23428 1436005 1454584 1485070 1457978 1471021 1553857 1586936 1514689 1513199 1513620 1428815 1421425 1485311
$$ packed form
23507A400055M1391K7065K0889j9496j6396l281m563j8317k184m4700o2578j5481
23495A302404Q2176P145p3098J29973Q1526k5373L5682M9462O6524n6110r9174
23484A501137k5174L5451k3478J5119n8360l3693n9414O8576J20971K6349j9866
23473A547618l4315l2131K5580J3144k5224K6713K2233J605j10688n6115k1199
23462A357221Q7921M4856k4154k5908K6240J7979q5554Q981M5343N5217R366M1393
23450A558901L1655n4931o3058J0216k2491J3242k7667N0610k300o6610K7298
23439A454865M5345K4372J9227M4137j40328j57582K8135O5334m0725J7249P5976
23428A436005J8579L0486k7092J3043Q2836L3079p2247j490M21q4805p390O3886
$$ plain form
23416 1485311 1500520 1535041 1566801 1573764 1574688 1574856 1521693 1516021 1550555 1558511 1588293 1544469 1488342
23403 1488342 1424380 1396349 1451185 1544834 1655514 1677125 1555235 1572497 1561211 1552337 1494407
23392 1494407 1426656 1488959 1466271 1462788 1397333 1432003 1460154 1514835 1478640 1418072 1330384
23381 1330384 1448634 1511360 1548481 1505895 1439371 1513324 1580906 1633319 1588592 1590188 1588567
23370 1588567 1599101 1625307 1618568 1656782 1610302 1560779 1538950 1489348 1412225 1393950 1434167
23359 1434167 1460199 1480417 1504220 1574258 1635031 1627354 1671160 1728476 1750704 1741550 1678657 1669043
23347 1669043 1727413 1691890 1571410 1488935 1546463 1535148 1504652 1408575 1405816 1513287 1484818
23336 1484818 1513206 1627518 1653170 1581679 1610309 1613340 1610957 1626060 1655228 1602635 1576836
$$ packed form
23416A485311J5209L4521L1760O963R24J68n3163n672L4534P956K9782m3824n6127
23403A488342o3962k8031N4836R3649J10680K1611j21890J7262j1286q874n7930
23392A494407o7751O2303k2688l483o5455L4670K8151N4681l6195o0568q7688
23381A330384J18250O2726L7121m2586o6524P3953O7582N2413m4727J596j621
23370A588567J0534K6206o739L8214m6480m9523k1829m9602p7123j8275M0217
23359A434167K6032K0218K3803P0038O0773p677M3806N7316K2228r154o2893r614
23347A669043N8370l5523j20480q2475N7528j1315l0496r6077k759J07471k8469
23336A484818K8388J14312K5652p1491K8630L031k383J5103K9168n2593k5799
$$ plain form
23325 1576836 1521751 1500576 1506621 1488883 1431553 1482657 1557938 1541619 1538696 1666012 1645589
23314 1645589 1602943 1610275 1648950 1648082 1606635 1563854 1547208 1510849 1541325 1598784 1618027 1540347
23302 1540347 1462642 1534652 1563108 1627699 1635199 1548716 1530559 1488723 1516140 1582644 1641092
23291 1641092 1701757 1727862 1700465 1621677 1638250 1677380 1596623 1520852 1467351 1495186 1505174
23280 1505174 1585251 1696164 1706904 1679804 1614186 1606833 1614890 1626574 1581234 1597171 1599093 1670361
23268 1670361 1792606 1763460 1691801 1651074 1633860 1492738 1568805 1618299 1582570 1586860 1518714
23257 1518714 1456509 1430345 1435392 1510431 1599510 1628835 1630088 1597255 1613586 1613243 1600453 1524008
23245 1524008 1454794 1560386 1631842 1592500 1571922 1538684 1610262 1639699 1551398 1627784 1625225
$$ packed form
23325A576836n5085k1175O045j7738n7330N1104P5281j6319k923J27316k0423
23314A645589m2646P332L8675q68m1447m2781j6646l6359L0476N7459J9243p7680
23302A540347p7705P2010K8456O4591P500q6483j8157m1836K7417O6504N8448
23291A641092O0665K6105k7397p8788J6573L9130q0757p5771n3501K7835R988
23280A505174Q0077J10913J0740k7100o5618p353Q057J1684m5340J5937J922P1268
23268A670361J22245k9146p1659m0727j7214j41122P6067M9494l5729M290o8146
23257A518714o2205k6164N047P5039Q9079K9325J253l2833J6331l43j2790p6445
23245A524008o9214J05592P1456l9342k0578l3238P1578K9437q8301P6386k559
$$ plain form
23234 1625225 1573262 1609758 1702133 1694350 1603403 1627852 1567112 1587648 1505306 1495037 1598485
23223 1598485 1711856 1715411 1667797 1657460 1664122 1592869 1550451 1513446 1560013 1645724 1715422
23212 1715422 1750442 1765860 1741755 1689667 1667502 1685057 1672940 1610127 1530608 1570013 1621371
23201 1621371 1560455 1564148 1628938 1680797 1677634 1651308 1641123 1666197 1720125 1755488 1765290 1857696
23189 1857696 1850364 1792248 1881134 1847747 1767743 1752140 1650797 1621936 1631110 1615474 1643002
23178 1643002 1607152 1626744 1667014 1680590 1690035 1724258 1726284 1716131 1704727 1661108 1699498 1677912
23166 1677912 1620319 1556577 1620022 1701752 1734156 1716738 1705353 1726463 1747554 1696498 1636559
23155 1636559 1617141 1542169 1512626 1572069 1587037 1583539 1626009 1584494 1532316 1573853 1642528
$$ packed form
23234A625225n1963L6496R2375p783r0947K4449o0740K0536q2342j0269J03448
23223A598485J13371L555m7614j0337O662p1253m2418l7005M6567Q5711O9698
23212A715422L5020J5418k4105n2088k2165J7555j2117o2813p9519L9405N1358
23201A621371o0916L693O4790N1859l163k6326j0185K5074N3928L5363R802R2406
23189A857696p332n8116Q8886l3387q0004j5603j01343k8861R174j5636K7528
23178A643002l5850J9592M0270J3576R445L4223K026j0153j1404m3619L8390k1586
23166A677912n7593o3742O3445Q1730L2404j7418j1385K1110K1091n1056n9939
23155A636559j9418p4972k9543N9443J4968l498M2470m1515n2178M1537O8675
$$ plain form
23144 1642528 1580514 1675834 1630576 1596784 1634249 1660933 1692052 1656842 1623695 1617294 1555966
23133 1555966 1508001 1521957 1609713 1578561 1550101 1543104 1650421 1768839 1781464 1767989 1722169
23122 1722169 1641272 1592517 1590019 1572787 1548498 1560944 1563320 1575182 1547066 1669669 1727151
23111 1727151 1744077 1744680 1780031 1786741 1803557 1781810 1726683 1694225 1704951 1689903 1696680 1694406
23099 1694406 1670215 1646054 1690853 1693335 1735550 1731286 1682444 1723521 1715788 1695986 1655670 1704563
23087 1704563 1677914 1644485 1744034 1811259 1796435 1751985 1750184 1742679 1739639 1730781 1734694 1697227
23075 1697227 1593032 1646480 1670938 1744248 1666755 1624719 1599089 1635324 1660807 1632698 1632645 1692361
23063 1692361 1719458 1690665 1723865 1683153 1614928 1568621 1604046 1597854 1538732 1445999 1457041
$$ packed form
23144A642528o2014R5320m5258l3792L7465K6684L1119l5210l3147o401o1328
23133A555966m7965J3956Q7756l1152k8460o997J07317J18418J2625j3475m5820
23122A722169q0897m8755k498j7232k4289J2446K376J1862k8116J22603N7482
23111A727151J6926O03L5351O710J6816k1747n5127l2458J0726j5048O777k274
23099A694406k4191k4161M4799K482M2215m264m8842M1077p733j9802m0316M8893
23087A704563k6649l3429R9549O7225j4824m4450j801p505l040q858L913l7467
23075A697227j04195N3448K4458P3310p7493m2036k5630L6235K5483k8109n3N9716
23063A692361K7097k8793L3200m0712o8225m6307L5425o192n9122r2733J1042
$$ plain form
23052 1457041 1478337 1570448 1656188 1675482 1682643 1736680 1821189 1831115 1830997 1702366 1685921 1719235
23040 1719235 1721031 1693675 1735138 1722384 1788453 1829152 1801937 1814260 1756448 1653727 1582759
23029 1582759 1648558 1705885 1624668 1613569 1736163 1804824 1714526 1661057 1649423 1643044 1696511
23018 1696511 1710418 1634701 1589860 1548641 1582267 1598989 1647438 1744152 1748399 1757515 1766730 1693147
23006 1693147 1600934 1633878 1609285 1591195 1607617 1645335 1720490 1804614 1893680 1876881 1768911
22995 1768911 1792846 1846618 1826529 1834843 1817292 1852791 1786045 1732475 1690916 1668764 1712532
22984 1712532 1792612 1790067 1805105 1718421 1660219 1625917 1618691 1650778 1719325 1674388 1677975 1743582
22972 1743582 1713068 1663137 1647539 1631798 1654514 1659349 1709227 1768331 1788021 1837641 1820928
$$ packed form
23052A457041K1296R2111Q5740J9294P161N4037Q4509R926j18j28631j6445L3314
23040A719235J796k7356M1463j2754O6069M0699k7215J2323n7812j02721p0968
23029A582759O5799N7327q1217j1099J22594O8661r0298n3469j1634o379N3467
23018A696511J3907p5717m4841m1219L3626J6722M8449R6714M247R116R215p3583
23006A693147r2213L2944k4593j8090J6422L7718P5155Q4124Q9066j6799j07970
22995A768911K3935N3772k0089Q314j7551L5499o6746n3570m1559k2152M3768
22984A712532Q0080k545J5038q6684n8202l4302p226L2087O8547m4937L587O5607
22972A743582l0514m9931j5598j5741K2716M835M9878N9104J9690M9620j6713
$$ plain form
22961 1820928 1815150 1775583 1765557 1787464 1835130 1871631 1819785 1801780 1951129 1937530 1886030
22950 1886030 1841837 1754407 1745640 1818110 1874573 1892964 1937648 1895287 1799015 1867102 1904561
22939 1904561 1896720 1814027 1769885 1828318 1879640 1865032 1825712 1883059 1899800 1867635 1860980 1823131
22927 1823131 1732585 1691350 1755575 1788462 1841412 1848330 1890749 1941038 1889411 1856845 1945816
22916 1945816 1950832 1882453 1830035 1791871 1775334 1803469 1730912 1717632 1736378 1754591 1811147
22905 1811147 1845501 1800500 1769408 1784544 1799633 1754013 1629259 1595650 1696655 1699990 1725718
22894 1725718 1742931 1735489 1737192 1695328 1656247 1623643 1654785 1783272 1852764 1910780 1993087
22883 1993087 1945203 1906021 1919260 1911154 1904595 1996088 1961451 1832431 1771285 1731786 1803306
$$ packed form
22961A820928n778l9567j0026K1907M7666L6501n1846j8005J49349j3599n1500
22950A886030m4193q7430q767P2470N6463J8391M4684m2361r6272O8087L7459
22939A904561p841q2693m4142N8433N1322j4608l9320N7347J6741l2165o655l7849
22927A823131r0546m1235O4225L2887N2950O918M2419N0289n1627l2566Q8971
22916A945816N016o8379n2418l8164j6537K8135p2557j3280J8746J8213N6556
22905A811147L4354m5001l1092J5136J5089m5620j24754l3609J01005L335K5728
22894A725718J7213p442J703m1864l9081l2604L1142J28487O9492N8016Q2307
22883A993087m7884l9182J3239q106o559R1493l4637j29020o1146l9499P1520
$$ plain form
22872 1803306 1858281 1861502 1972228 1956297 1888430 1853506 1816181 1824865 1853236 1839695 1845216 1842512
22860 1842512 1788658 1798962 1827903 1821845 1882329 1902393 1821075 1842112 1875136 1856650 1829340
22849 1829340 1884823 1924498 1966332 1951902 1856892 1802765 1777888 1756338 1789588 1839970 1832722
22838 1832722 1783814 1773773 1833111 1949691 1944098 1915744 1929116 1881406 1930780 1968359 1941691
22827 1941691 2022614 1985374 1922244 1965984 1998851 1982629 1970831 2001872 2003327 1958025 1893796
22816 1893796 1915220 1966068 1940987 1969348 1979526 1985931 1948463 1968076 1989801 1917199 1954635
22805 1954635 1951495 1841372 1795014 1927464 1934399 1940522 1916397 1941226 1964124 1893384 1898358 1876348
22793 1876348 1821078 1855825 1900345 1972117 2048313 2041948 2122372 2108532 1985714 1954529 1872849
$$ packed form
22872A803306N4975L221J10726j5931o7867l4924l7325Q684K8371j3541N521k704
22860A842512n3854J0304K8941o058O0484K0064q1318K1037L3024j8486k7310
22849A829340N5483L9675M1834j4430r5010n4127k4877k1550L3250N0382p248
22838A832722m8908j0041N9338J16580n593k8354J3372m7710M9374L7579k6668
22827A941691Q0923l7240o3130M3740L2867j6222j1798L1041J455m5302o4229
22816A893796K1424N0848k5081K8361J0178O405l7468J9613K1725p2602L7436
22805A954635l140j10123m6358J32450O935O123k4125K4829K2898p0740M974k2010
22793A876348n5270L4747M4520P1772P6196o365Q0424j3840j22818l1185q1680
$$ plain form
22782 1872849 1894170 1963432 1962300 2058841 2064732 2104083 2111710 2064988 1996617 1849038 1801389 1881652
22770 1881652 1945374 1943372 1982795 1904583 1809693 1779862 1820770 1850895 1970072 1917550 1980109
22759 1980109 2053612 2097751 2072873 2082762 2043222 1964844 2017462 2041877 2063783 2010748 2001272 1993299
22747 1993299 2056994 2050047 1976130 1956939 1974498 1963226 2032117 2044201 2000629 1967530 1891208
22736 1891208 1859165 1873784 1805095 1783982 1725362 1707193 1790576 1842999 1942800 1947327 1853318
22725 1853318 1808131 1873095 1922491 1972698 1983029 1909873 1933223 1949061 1992187 1956247 1995800
22714 1995800 1935403 1898461 1989286 2008856 1985518 1975493 2046829 2072151 1988691 1959250 1960778
22703 1960778 2021459 2034523 2052571 2077521 2078483 2032105 2024072 1968464 1961712 2049261 2090711 1994449
$$ packed form
22782A872849K1321O9262j132R6541N891L9351P627m6722o8371j47579m7649Q0263
22770A881652O3722k002L9423p8212r4890k9831M0908L0125J19177n2522O2559
22759A980109P3503M4139k4878R889l9540p8378N2618K4415K1906n3035r476p973
22747A993299O3695o947p3917j9191J7559j1272O8891J2084m3572l3099p6322
22736A891208l2043J4619o8689k1113n8620j8169Q3383N2423R9801M527r4009
22725A853318m5187O4964M9396N0207J0331p3156K3350J5838M3126l5940L9553
22714A995800o0397l6942R0825J9570k3338j0025P1336K5322q3460k9441J528
22703A960778O0681J3064J8048K4950R62m6378q033n5608o752Q7549M1450r6262
$$ plain form
22691 1994449 1996254 2025850 2075438 2049082 1997980 2011623 2069326 2067222 2063909 2090201 1990901 1930456
22679 1930456 1948690 2010765 2109388 2165080 2177982 2129371 2058863 2013502 1964311 2023627 2069595
22668 2069595 2059494 2075512 2085372 2096998 2111251 2050363 2060783 2020601 2067130 2085482 2002136
22657 2002136 1938057 1812201 1857196 1996745 2039565 2027496 2014581 1989760 2021850 2156781 2238738
22646 2238738 2176930 2203066 2128934 2130181 2179249 2152145 2040284 2009235 1981077 1974213 1980742 2043433
22634 2043433 2141868 2200930 2138624 2153306 2185684 2176634 2146979 2062006 1991793 2004113 2139751
22623 2139751 2176528 2259418 2281221 2254136 2182320 2094910 2023767 2088924 2056970 1979222 2033239
22612 2033239 2019538 2020270 1997681 2003650 1992640 1971884 1893772 1894107 1871043 1875813 1989415 2078222
$$ packed form
22691A994449J805K9596M9588k6356n1102J3643N7703k104l313K6292r9300o0445
22679A930456J8234O2075R8623N5692J2902m8611p0508m5361m9191N9316M5968
22668B069595j0101J6018R860J1626J4253o0888J0420m0182M6529J8352q3346
22657B002136o4079j25856M4995J39549M2820j2069j2915k4821L2090J34931Q1957
22646B238738o1808K6136p4132J247M9068k7104j11861l1049k8158o864O529O2691
22634B043433R8435N9062o2306J4682L2378r050k9655q4973p0213J2320J35638
22623B139751L6777Q2890K1803k7085p1816q7410p1143O5157l1954p7748N4017
22612B033239j3701P32k2589N969j1010k0756p8112L35k3064M770J13602Q8807
$$ plain form
22600 2078222 2199541 2274605 2310958 2287382 2281245 2314695 2358577 2280171 2114968 2025406 2090382
22589 2090382 2120942 2170782 2169146 2097402 2122734 2154695 2044378 2083727 2173734 2194371 2149886
22578 2149886 2074673 2114192 2126973 2083537 2153326 2197330 2247622 2175219 2165395 2175729 2114492
22567 2114492 2074116 2010541 2055885 2113619 2128132 2183615 2209460 2264192 2287680 2240757 2203712
22556 2203712 2234917 2242276 2219554 2203849 2214152 2181984 2119599 2119337 2122259 2096089 2097349 2131692
22544 2131692 2142371 2125811 2142705 2195171 2230040 2237995 2222194 2199478 2134870 2092737 2025795
22533 2025795 2046613 2148370 2312976 2318177 2266739 2187311 2106241 2083069 2175211 2268594 2279461
22522 2279461 2221804 2157481 2160574 2184204 2233294 2265888 2301272 2214568 2105822 2020676 2018290
$$ packed form
22600B078222J21319P5064L6353k3576o137L3450M3882p8406j65203q9562O4976
22589B090382L0560M9840j636p1744K5332L1961j10317L9349R0007K0637m4485
22578B149886p5213L9519J2781m3436O9789M4004N0292p2403r824J0334o1237
22567B114492m0376o3575M5344N7734J4513N5483K5845N4732K3488m6923l7045
22556B203712L1205P359k2722j5705J0303l2168o2385k62K922k6170J260L4343
22544B131692J0679j6560J6894N2466L4869P955j5801k2716o4608m2133o6942
22533B025795K0818J01757J64606N201n1438p9428q1070k3172R2142R3383J0867
22522B279461n7657o4323L093K3630M9090L2594L5384q6704j08746q5146k386
$$ plain form
22511 2018290 2058729 2025341 2019927 2032486 2089852 2164276 2202773 2256556 2259415 2307742 2260418 2231780
22499 2231780 2182095 2139299 2198446 2254036 2313443 2319326 2356859 2362946 2342820 2298413 2236987 2225214
22487 2225214 2280785 2232482 2189241 2189375 2238921 2158229 2189585 2287460 2296962 2384755 2379343 2350240
22475 2350240 2372869 2402529 2389150 2440741 2384140 2290630 2261506 2297744 2303641 2331668 2340893 2234079
22463 2234079 2152211 2209218 2255261 2250336 2247386 2253921 2205774 2239591 2351147 2364960 2353114 2273905
22451 2273905 2235705 2263407 2264016 2266013 2269759 2229790 2205140 2258527 2286710 2231705 2247074 2276714
22439 2276714 2328006 2296215 2358365 2413889 2388569 2333085 2264867 2226667 2245307 2216435 2212809
22428 2212809 2275760 2316088 2325187 2307396 2291654 2265342 2219991 2242071 2284170 2285352 2287204 2254207
$$ packed form
22511B018290M0439l3388n414J2559N7366P4424L8497N3783K859M8327m7324k8638
22499B231780m9685m2796N9147N5590N9407N883L7533O087k0126m4407o1426j1773
22487B225214N5571m8303m3241J34M9546q0692L1356R7875R502Q7793n412k9103
22475B350240K2629K9660j3379N1591n6601r3510k9124L6238N897K8027R225j06814
22463B234079q1868N7007M6043m925k950O535m8147L3817J11556J3813j1846p9209
22451B273905l8200K7702O09J997L746l9969k4650N3387K8183n5005J5369K9640
22439B276714N1292l1791O2150N5524k5320n5484o8218l8200J8640k8872l626
22428B212809O2951M0328R099j7791j5742k6312m5351K2080M2099J182J852l2997
$$ plain form
22416 2254207 2252501 2251701 2251464 2256286 2274243 2337106 2347253 2256639 2176173 2208134 2276909 2328940
22404 2328940 2380529 2366771 2294341 2203605 2154398 2120553 2187323 2233906 2300187 2372741 2345932
22393 2345932 2251258 2312035 2347513 2339901 2333259 2344782 2315245 2332142 2306523 2362225 2413906 2345081
22381 2345081 2327741 2373279 2416017 2365100 2299094 2352666 2458225 2464549 2426463 2382407 2422124
22370 2422124 2483582 2465996 2418982 2356054 2413468 2468009 2450854 2393831 2353002 2365105 2439675
22359 2439675 2479705 2411705 2357450 2372835 2457228 2471398 2459508 2478614 2489132 2510190 2503101
22348 2503101 2455793 2497329 2422319 2460997 2556974 2510529 2502837 2473137 2395211 2349504 2343338 2360753
22336 2360753 2385700 2353624 2392541 2391367 2457268 2508914 2543900 2570473 2548951 2570005 2563461 2538009
$$ packed form
22416B254207j706q00k37M822J7957O2863J0147r0614q0466L1961O8775N2031
22404B328940N1589j3758p2430r0736m9207l3845O6770M6583O6281P2554k6809
22393B345932r4674O0777L5478p612o642J1523k9537J6897k5619N5702N1681o8825
22381B345081j7340M5538M2738n0917o6006N3572J05559O324l8086m4056L9717
22370B422124O1458j7586m7014o2928N7414N4541j7155n7023m0829J2103P4570
22359B439675M0030o8000n4255J5385Q4393J4170j1890J9106J0518K1058p089
22348B503101m7308M1536p5010L8678R5977m6445p692k9700p7926m5707o166J7415
22336B360753K4947l2076L8917j174O5901N1646L4986K6573k1522K1054o544k5452
$$ plain form
22324 2538009 2450287 2391184 2390553 2294787 2316067 2372559 2434783 2530390 2529826 2459045 2459083 2515166 2528423
22311 2528423 2509014 2575283 2564019 2512542 2482292 2556771 2511846 2510445 2551131 2516004 2522936 2512628
22299 2512628 2466804 2534565 2488081 2411407 2337551 2330374 2361664 2326304 2344907 2417568 2452590
22288 2452590 2480527 2521574 2557686 2560258 2646009 2648067 2602336 2627767 2634755 2544843 2533685 2538494
22276 2538494 2513883 2614071 2668178 2622018 2550609 2509850 2543651 2583165 2552147 2498554 2550808
22265 2550808 2656337 2658215 2588409 2582545 2600797 2623080 2639816 2557919 2429563 2426155 2486020
22254 2486020 2554039 2611788 2653752 2602563 2557070 2560386 2584668 2496740 2608575 2622267 2519282
22243 2519282 2594910 2660039 2684859 2694211 2668037 2695701 2746776 2721394 2646448 2572030 2621747
$$ packed form
22324B538009q7722n9103o31r5766K1280N6492O2224R5607n64p0781L8N6083J3257
22311B528423j9409O6269j1264n1477l0250P4479m4925j401M0686l5127O932j0308
22299B512628m5824O7761m6484p6674p3856p177L1290l5360J8603P2661L5022
22288B452590K7937M1047L6112K572Q5751K058m5731K5431O988q9912j1158M809
22276B538494k4611J00188N4107m6160p1409m0759L3801L9514l1018n3593N2254
22265B550808J05529J878o9806n864J8252K2283J6736q1897j28356l408N9865
22254B486020O8019N7749M1964n1189m5493L316K4282q7928J11835J3692j02985
22243B519282P5628O5129K4820R352k6174K7664N1075k5382p4946p4418M9717
$$ plain form
22232 2621747 2544851 2482728 2482497 2486314 2577048 2663680 2612943 2625909 2626462 2668669 2645184 2658127
22220 2658127 2659603 2617978 2654847 2599003 2630592 2670489 2757004 2746703 2694246 2644237 2686290
22209 2686290 2691936 2606468 2602735 2654306 2724946 2664082 2689213 2666309 2676032 2696446 2689239 2769459
22197 2769459 2774603 2695879 2657170 2687805 2650432 2724741 2763281 2685761 2747732 2752776 2730885 2703051
22185 2703051 2660226 2632623 2623188 2686712 2681228 2673467 2661054 2661840 2738393 2819905 2830198 2872542
22173 2872542 2904898 2869231 2822644 2834260 2797143 2660105 2700612 2735327 2747029 2668970 2629022
22162 2629022 2672839 2724976 2727172 2808863 2861897 2876450 2851120 2796802 2777182 2786262 2843108 2897642
22150 2897642 2939890 2938562 2920517 2853125 2855508 2858353 2898654 2865674 2727927 2780642 2857656 2810424
$$ packed form
22232B621747p6896o2123k31L817R0734Q6632n0737J2966N53M2207k3485J2943
22220B658127J476m1625L6869n5844L1589L9897Q6515j0301n2457n0009M2053
22209B686290N646q5468l733N1571P0640o0864K5131k2904R723K0414p207Q0220
22197B769459N144p8724l8709L0635l7373P4309L8540p7520O1971N044k1891k7834
22185B703051m2825k7603r435O3524n484p761j2413P86P6553Q1512J0293M2344
22173B872542L2356l5667m6587J1616l7117j37038M0507L4715J1702p8059l9948
22162B629022M3817N2137K196Q1691N3034J4553k5330n4318j9620R080N6846N4534
22150B897642M2248j328j8045o7392K383K845M0301l2980j37747N2715P7014m7232
$$ plain form
22138 2810424 2776201 2766677 2830944 2830722 2809563 2832636 2894433 2908601 2949100 2990690 2965415 2802295
22126 2802295 2877441 2926654 2860468 2799182 2812064 2862428 2849293 2889982 2942080 2816826 2754194
22115 2754194 2819844 2734387 2746616 2813433 2844844 2840594 2770303 2758816 2800644 2793942 2874669 2970549
22103 2970549 2969558 2975267 2997393 2949420 2941908 2966858 2907998 2897613 2928164 2859635 2861321 2917751
22091 2917751 2964407 3051576 3144484 3011197 3018488 3008646 2994697 2962335 2871686 2936481 2970173
22080 2970173 2926645 2968629 3065918 3031197 3026775 3102637 3036931 2946304 2933257 2925719 2903671 2966370
22068 2966370 2980231 2941943 2940253 3030531 3082664 3065713 3034446 2922376 2961512 3031259 3034994
22057 3034994 3051895 3086122 3179174 3219685 3218298 3209920 3165899 3098813 3016316 2984627 3092268
$$ packed form
22138B810424l4223r524O4267k22k1159K3073O1797J4168M0499M1590k5275j63120
22126B802295P5146M9213o6186o1286J2882N0364j3135M0689N2098j25254o2632
22115B754194O5650q5457J2229O6817L1411m250p0291j1487M1828o702Q0727R5880
22103B970549r91N709K2126m7973p512K4950n8860j0385L0551o8529J686N6430
22091B917751M6656Q7169R2908j33287P291r842j3949l2362r0649O4795L3692
22080B970173m3528M1984R7289l4721m422P5862o5706r0627j3047p538k2048O2699
22068B966370J3861l8288j690R0278N2133j6951l1267j12070L9136O9747L735
22057C034994J6901L4227R3052M0511j387q378m4021o7086q2497l1689J07641
$$ plain form
22046 3092268 3127248 3034905 3038580 3105168 3016379 3009242 3112233 3176423 3190728 3162266 3095505
22035 3095505 3071617 3102273 3147261 3229502 3273547 3183303 3108760 3010928 3005865 3051465 3105430
22024 3105430 3120469 3141054 3152679 3175392 3154310 3145758 3150850 3174796 3201703 3158066 3129575 3067403
22012 3067403 3049093 3057040 3056506 3091025 3158694 3185253 3162805 3225578 3197331 3150905 3141479 3234999
22000 3234999 3269141 3332125 3320821 3329777 3342474 3291039 3249681 3275996 3292790 3256088 3311924
21989 3311924 3386063 3359630 3430173 3437795 3470199 3453495 3454383 3468830 3436048 3449891 3387121 3326443
21977 3326443 3388802 3361722 3298491 3344278 3316864 3354847 3483924 3544309 3487473 3437883 3472688
21966 3472688 3492195 3532234 3588635 3614477 3608636 3704617 3746620 3684203 3585877 3550318 3546130 3638042
$$ packed form
22046C092268L4980r2343L675O6588q8789p137J02991O4190J4305k8462o6761
22035C095505k3888L0656M4988Q2241M4045r0244p4543r7832n063M5600N3965
22024C105430J5039K0585J1625K2713k1082q552N092K3946K6907m3637k8491o2172
22012C067403j8310P947n34L4519O7669K6559k2448O2773k8247m6426r426R3520
22000C234999L4142O2984j1304Q956J2697n1435m1358K6315J6794l6702N5836
21989C311924P4139k6433P0543P622L2404j6704Q88J4447l2782J3843o2770o0678
21977C326443O2359k7080o3231M5787k7414L7983J29077O0385n6836m9590L4805
21966C472688J9507M0039N6401K5842n841R5981M2003o2417r8326l5559m188R1912
$$ plain form
21954 3638042 3645357 3605521 3594252 3660765 3761987 3861728 3963377 3969998 3909385 3951377 3982222
21943 3982222 4021607 3973442 3949560 3747458 3376307 3088530 3074742 3067624 3123009 3227378 3343272
21932 3343272 3393805 3493298 3623126 3647333 3710067 3772480 3835803 3856226 3927772 3834612 3519845
21921 3519845 3060744 2848460 2769279 2770220 2830738 2833145 2885509 3087652 3198556 3143951 3129980
21910 3129980 3171353 3235822 3279285 3352137 3406298 3395360 3327718 3290678 3215460 3246172 3319769
21899 3319769 3366935 3318363 3370348 3352126 3326909 3324950 3381802 3336904 3344026 3370898 3422247 3435434
21887 3435434 3420141 3433211 3523853 3594965 3547425 3522210 3501169 3425882 3483823 3555035 3572373
21876 3572373 3553364 3554558 3603759 3652128 3632567 3608807 3668843 3688558 3683614 3732390 3735816 3736893
$$ packed form
21954C638042P315l9836j1269O6513J01222R9741J01649O621o0613M1992L0845
21943C982222L9385m8165k3882k02102l71151k87777j3788p118N5385J04369J15894
21932C343272N0533R9493J29828K4207O2734O2413O3323K0423P1546r3160l14767
21921C519845m59101k12284p9181R41O0518K407N2364K02143J10904n4605j3971
21910C129980M1373O4469M3463P2852N4161j0938o7642l7040p5218L0712P3597
21899C319769M7166m8572N1985j8222k5217j959N6852m4898P122K6872N1349J3187
21887C435434j5293J3070R0642P1112m7540k5215k1041p5287N7941P1212J7338
21876C572373j9009J194M9201M8369j9561k3760O0036J9715m944M8776L426J077
$$ plain form
21864 3736893 3693328 3657845 3581823 3533487 3572213 3661715 3666974 3629273 3572317 3589411 3642167
21853 3642167 3686223 3728693 3687910 3579599 3558330 3605578 3671767 3699059 3748558 3751482 3742128
21842 3742128 3702006 3658839 3678608 3617930 3578866 3710431 3818768 3759848 3733402 3725268 3693473
21831 3693473 3757973 3841876 3839231 3838427 3865325 3841235 3851320 3914586 3868339 3823634 3870039 3864584
21819 3864584 3823783 3794841 3800085 3861373 3958433 3893432 3888810 4013904 4046991 3985331 3912924
21808 3912924 3815777 3841445 3824146 3853326 3978497 3997944 3925288 3982347 3980627 3983445 4042639
21797 4042639 4059149 4060719 4100373 4086996 4033609 3940481 3955223 3970434 4048035 4108941 4149394
21786 4149394 4082098 4062600 4048551 3991175 3980730 3994701 4112346 4148312 4138921 4191172 4223864
$$ packed form
21864C736893m3565l5483p6022m8336L8726Q9502N259l7701n6956J7094N2756
21853C642167M4056M2470m0783j08311k1269M7248O6189K7292M9499K924r354
21842C742128m0122m3167J9769o0678l9064J31565J08337n8920k6446q134l1795
21831C693473O4500Q3903k645q04K6898k4090J0085O3266m6247m4705M6405n455
21819C864584m0801k8942N244O1288R7060o5001m622J25094L3087o1660p2407
21808C912924r7147K5668j7299K9180J25171J9447p2656N7059j720K818N9194
21797D042639J6510J570L9654j3377n3387r3128J4742J5211P7601O0906M0453
21786D149394o7296j9498j4049n7376j0445J3971J17645L5966r391N2251L2692
$$ plain form
21775 4223864 4263837 4303453 4239245 4158188 4124810 4067586 4173568 4221563 4248634 4245661 4244203
21764 4244203 4222860 4216247 4169229 4246790 4288583 4377935 4369755 4224019 4199348 4239748 4317361
21753 4317361 4319915 4275348 4325481 4438423 4487131 4390006 4375694 4451036 4545417 4590265 4616214
21742 4616214 4576099 4607506 4602532 4529027 4548874 4572586 4536844 4383801 4328013 4359272 4444338
21731 4444338 4556713 4537210 4530394 4520446 4501959 4494808 4523947 4521012 4542689 4543730 4564511 4616684
21719 4616684 4698921 4765977 4716073 4745787 4729382 4685597 4646167 4636903 4714617 4842663 4874979
21708 4874979 4841734 4802335 4797423 4709448 4708580 4806790 4849906 4855115 4742863 4809808 4873253 4875069
21696 4875069 4910771 4826482 4748470 4779825 4864527 4913254 5023845 5084670 5103701 5054645 4995076
$$ packed form
21775D223864L9973L9616o4208q1057l3378n7224J05982M7995K7071k973j458
21764D244203k1343o613m7018P7561M1793Q9352q180j45736k4671M0400P7613
21753D317361K554m4567N0133J12942M8708r7125j4312P5342R4381M4848K5949
21742D616214m0115L1407m974p3505J9847K3712l5742j53043n5788L1259Q5066
21731D444338J12375j9503o816r948j8487p151K9139k935K1677J041K0781N2173
21719D616684Q2237O7056m9904K9714j6405m3785l9430r264P7714J28046L2316
21708D874979l3245l9399m912q7975q68R8210M3116N209j12252O6945O3445J816
21696D875069L5702q4289p8012L1355Q4702M8727J10591O0825J9031m9056n9569
$$ plain form
21685 4995076 4909939 4962208 5013529 4966653 4939572 4975473 4981288 4994831 4983567 5078741 5039294
21674 5039294 4974301 4988803 5001670 5050692 5087227 5061510 5060236 5082291 5067944 5133387 5178857
21663 5178857 5183541 5162750 5236830 5400659 5476467 5409651 5440885 5451978 5398782 5363343 5389348
21652 5389348 5418342 5435620 5362493 5283816 5265766 5355325 5393485 5474370 5517356 5576505 5672113
21641 5672113 5624443 5583548 5502587 5561540 5684802 5730357 5711163 5608995 5517738 5547792 5591748
21630 5591748 5645354 5577015 5518378 5543215 5472251 5440148 5530735 5587165 5689107 5749041 5764414
21619 5764414 5854091 5894558 5977377 5992176 5936065 5914467 5880079 5938104 5962573 5995079 5995471 5957569
21607 5957569 6011168 6069291 6085068 6088788 6147757 6154926 6119692 6075360 6118627 6121124 6088908 6057519
$$ packed form
21685D995076q5137N2269N1321m6876k7081L5901N815J3543j1264R5174l9447
21674E039294o4993J4502J2867M9022L6535k5717j274K2055j4347O5443M5470
21663E178857M684k0791P4080J63829P5808o6816L1234J1093n3196l5439K6005
21652E389348K8994J7278p3127p8677j8050Q9559L8160Q0885M2986N9149R5608
21641E672113m7670m0895q0961N8953J23262M5555j9194j02168r1257L0054M3956
21630E591748N3606o8339n8637K4837p0964l2103R0587N6430J01942N9934J5373
21619E764414Q9677M0467Q2819J4799n6111k1598l4388N8025K4469L2506L92l7902
21607E957569N3599N8123J5777L720N8969P169l5234m4332M3267K497l2216l1389
$$ plain form
21595 6057519 6057697 6073085 6072745 6126885 6202262 6226310 6180108 6223331 6236477 6276414 6197837 6235869
21583 6235869 6349941 6448732 6435812 6468391 6519767 6520963 6476779 6416060 6452092 6459278 6526039
21572 6526039 6576368 6625019 6657015 6666167 6696678 6741538 6753972 6754604 6750674 6765498 6746089 6788898
21560 6788898 6833331 6901583 6851158 6831483 6818209 6740491 6906477 7028936 7082371 7120019 7138220
21549 7138220 7173731 7236452 7284549 7275885 7361414 7364013 7391641 7488061 7561769 7652535 7715613 7734918
21537 7734918 7737159 7833181 7887745 7899307 7803772 7782900 7799261 7933333 7940389 7881107 7924784
21526 7924784 7872534 7887683 8049779 8094550 8081742 8175712 8271384 8338289 8373540 8404364 8426621
21515 8426621 8534197 8675741 8677321 8707862 8798230 8737381 8675472 8726758 8852241 8988626 8976404
$$ packed form
21595F057519J78J5388l40N4140P5377K4048m6202M3223J3146L9937p8577L8032
21583F235869J14072R8791j2920L2579N1376J196m4184o0719L6032P186O6761
21572F526039N0329M8651L1996R152L0511M4860J2434O32l930J4824j9409M2809
21560F788898M4433O8252n0425j9675j3274p7718J65986J22459N3435L7648J8201
21549G138220L5511O2721M8097q664Q5529K599K7628R6420P3708R0766O3078J9305
21537G734918K241R6022N4564J1562r5535k0872J6361J34072P056n9282M3677
21526G924784n2250J5149J62096M4771j2808R3970R5672O6905L5251L0824K2257
21515H426621J07576J41544J580L0541R0368o0849o1909N1286J25483J36385j2222
$$ plain form
21504 8976404 8990449 9034971 9072716 9133125 9290430 9373206 9425304 9402892 9211636 9036455 8968203
21493 8968203 8961448 9086581 9102292 9108168 9458874 10016346 10397353 10693188 10669036 10345804
21483 10345804 10105187 9902853 9703983 9691434 9693508 9652381 9845831 10157271 10344760 10413197
21473 10413197 10446865 10512993 10631420 10858389 10946932 10986102 11031965 11047659 11042493 11149607 11430418
21462 11430418 11587994 11697306 11679225 11788997 11925440 12055107 12152964 12208670 12317873 12385907
21452 12385907 12439648 12499617 12615579 12676945 12810370 12874672 13084158 13260066 13413146 13576470
21442 13576470 13688763 13694608 13683651 13829562 14000906 14223754 14354602 14502034 14698373 14805739
21432 14805739 14867800 14951913 15170230 15324209 15432364 15615727 15786097 15945166 16098436 16401378
$$ packed form
21504H976404J4045M4522L7745O0409J57305Q2776N2098k2412j91256j75181o8252
21493H968203o755J25133J5711N876L50706N57472L81007K95835k4152l23232
21483A0345804k40617k02334j98870j2549K074m1127J93450L11440J87489O8437
21473A0413197L3668O6128J18427K26969Q8543L9170M5863J5694n166J07114K80811
21462A1430418J57576J09312j8081J09772J36443J29667R7857N5706J09203O8034
21452A2385907N3741N9969J15962O1366J33425O4302K09486J75908J53080J63324
21442A3576470J12293N845j0957J45911J71344K22848J30848J47432J96339J07366
21432A4805739O2061Q4113K18317J53979J08155J83363J70370J59069J53270L02942
$$ plain form
21422 16401378 16694689 16905046 17173668 17307953 17514035 17723808 17916639 18113821 18315099
21413 18315099 18600311 18920190 19132670 19357001 19673409 19901124 20152951 20498849 20848284
21404 20848284 21225579 21554656 21848031 22209766 22665548 23145781 23568663 24008208 24413438
21395 24413438 24822820 25327679 25759538 26316565 26852275 27386551 27943411 28557212 29297060
21386 29297060 30142753 31057861 31995138 32938772 33886067 34788984 35596847 35717631 35548371
21377 35548371 36169212 37403894 38906173 40442405 41866081 43275397 44979344 46960168
21369 46960168 48983842 51021737 53100273 55512358 58353847 61483032 64339616 66979921
21361 66979921 70460019 75260730 80914292 87423342 95094865 104153765 114966009 127970124
$$ packed form
21422A6401378K93311K10357K68622J34285K06082K09773J92831J97182K01278
21413A8315099K85212L19879K12480K24331L16408K27715K51827L45898L49435
21404B0848284L77295L29077K93375L61735M55782M80233M22882M39545M05230
21395B4413438M09382N04859M31859N57027N35710N34276N56860O13801P39848
21386B9297060Q45693R15108R37277R43634R47295R02917Q07863J20784j69260
21377C5548371O20841J234682J502279J536232J423676J409316J703947J980824
21369D6960168K023674K037895K078536K412085K841489L129185K856584K640305
21361F6979921L480098M800711N653562O509050P671523R058900J0812244J3004115
$$ plain form
21353 127970124 143616634 162104740 184411879 209757819 232184600 245430365 240666006
21346 240666006 145712115 -96693097 -256777973 -273717964 -241491087 -204991561 -175677180
21339 -175677180 -153812164 -136887529 -122634838 -110595760 -100443374 -91867648 -84508471
21332 -84508471 -78081692 -72393591 -67505951 -63173143 -59514979 -57021606 -55023437 -52748274
21324 -52748274 -50406240 -48267847 -46164927 -44014391 -41986206 -40026266 -38150071 -36486485
21316 -36486485 -35175828 -34119127 -32937751 -31929067 -31657490 -31922882 -31575460 -30580768 -29457041
21307 -29457041 -28422442 -27525653 -26769251 -26014772 -25277637 -24617165 -24013298 -23420040 -22787584
21298 -22787584 -22188424 -21741936 -21366958 -21023040 -20513273 -20019606 -19488615 -19081060 -18672270
$$ packed form
21353A27970124J5646510J8488106K2307139K5345940K2426781J3245765m764359
21346B40666006r4953891k42405212j60084876j6939991L2226877L6499526K9314381
21339a75677180K1865016J6924635J4252691J2039078J0152386Q575726P359177
21332h4508471O426779N688101M887640M332808L658164K493373J998169K275163
21324e2748274K342034K138393K102920K150536K028185J959940J876195J663586
21316c6486485J310657J056701J181376J008684K71577k65392L47422R94692J123727
21307b9457041J034599Q96789P56402P54479P37135O60472O03867N93258O32456
21298b2787584N99160M46488L74978L43918N09767M93667N30991M07555M08790
$$ plain form
21289 -18672270 -18256168 -17927360 -17576226 -17257307 -16922052 -16521376 -16200895 -15945047 -15750063
21280 -15750063 -15406652 -15061679 -14767912 -14550834 -14368044 -14099262 -13845731 -13594895 -13314970
21271 -13314970 -13099591 -12988355 -12930874 -12771829 -12471012 -12203441 -12077330 -11992576 -11942671 -11808581
21261 -11808581 -11611055 -11373497 -11173060 -11075653 -10929768 -10704772 -10490306 -10349205 -10255495 -10126365
21251 -10126365 -10008913 -9905345 -9803871 -9636344 -9507223 -9460336 -9420454 -9332280 -9188366 -9059064
21241 -9059064 -8985507 -8843663 -8671859 -8509575 -8347098 -8240086 -8212047 -8112033 -8032327 -7933734
21231 -7933734 -7797746 -7647551 -7534750 -7484331 -7550959 -7545916 -7413209 -7245881 -7122931 -7037108
21221 -7037108 -7020936 -6875926 -6755711 -6747037 -6709218 -6664086 -6803368 -6930322 -7115605 -7083569
$$ packed form
21289a8672270M16102L28808L51134L18919L35255M00676L20481K55848J94984
21280a5750063L43411L44973K93767K17078J82790K68782K53531K50836K79925
21271a3314970K15379J11236N7481J59045L00817K67571J26111Q4754M9905J34090
21261a1808581J97526K37558K00437R7407J45885K24996K14466J41101R3710J29130
21251a0126365J17452J03568J01474J67527J29121M6887L9882Q8174J43914J29302
21241i059064P3557J41844J71804J62284J62477J07012K8039J00014P9706R8593
21231g933734J35988J50195J12801N0419o6628N043J32707J67328J22950Q5823
21221g037108J6172J45010J20215Q674L7819M5132j39282j26954j85283L2036
$$ plain form
21211 -7083569 -6854401 -6706253 -6661079 -6367375 -6039246 -5658409 -5266203 -5115525 -5288892 -5674663
21201 -5674663 -6050756 -6184600 -6122324 -6060861 -5989432 -5763228 -5356939 -5076847 -4995793 -4998303
21191 -4998303 -4981674 -4954546 -5099235 -5111952 -5052900 -5004047 -5032200 -5025821 -4957358 -4912053 -4893173
21180 -4893173 -4855370 -4793164 -4751520 -4640051 -4545040 -4460601 -4394692 -4357696 -4279579 -4271024 -4322753
21169 -4322753 -4323806 -4206793 -4187707 -4218506 -4180935 -4087914 -4055509 -4026473 -4031953 -4024070 -3865442
21158 -3865442 -3749041 -3669098 -3759073 -3843770 -3844304 -3855916 -3775560 -3752156 -3727994 -3605752 -3501396
21147 -3501396 -3446052 -3428921 -3480664 -3533531 -3524995 -3493566 -3534619 -3484320 -3378675 -3345659 -3347072
21136 -3347072 -3314610 -3262873 -3251991 -3172323 -3144850 -3144591 -3128983 -3085598 -3043679 -3040693 -3009405 -2989824
$$ packed form
21211g083569K29168J48148M5174K93704L28129L80837L92206J50678j73367l85771
21201e674663l76093j33844O2276O1463P1429K26204M06289K80092Q1054k510
21191d998303J6629K7128j44689j2717N9052M8853k8153O379O8463M5305J8880
21180d893173L7803O2206M1644J11469R5011Q4439O5909L6996P8117Q555n1729
21169d322753j053J17013J9086l0799L7571R3021L2405K9036n480P883J58628
21158c865442J16401P9943q9975q4697n34j1612Q0356K3404K4162J22242J04356
21147c501396N5344J7131n1743n2867Q536L1429m1053N0299J05645L3016j413
21136c347072L2462N1737J0882P9668K7473K59J5608M3385M1919K986L1288J9581
$$ plain form
21124 -2989824 -2994952 -2955745 -2902552 -2873005 -2829377 -2842784 -2938181 -2864589 -2802404 -2717548 -2719390 -2767445
21112 -2767445 -2732521 -2633569 -2582385 -2631454 -2598467 -2449666 -2401200 -2528940 -2526126 -2449739 -2430707
21101 -2430707 -2451781 -2459204 -2418493 -2396068 -2412945 -2410195 -2383530 -2344949 -2254043 -2235958 -2206923 -2173547
21089 -2173547 -2081577 -2104205 -2218219 -2300908 -2301884 -2264236 -2230624 -2218104 -2199413 -2086265 -2034211
21078 -2034211 -2127234 -2112050 -2005186 -1835973 -1905374 -1958392 -1942509 -1867636 -1774701 -1733879 -1645245
21067 -1645245 -1648220 -1778178 -1874626 -1827736 -1775731 -1781904 -1785006 -1787137 -1675290 -1612297 -1548285 -1473539
21055 -1473539 -1505396 -1513711 -1505574 -1592038 -1597138 -1614110 -1583067 -1558097 -1535734 -1581222 -1595774 -1457675
21043 -1457675 -1352874 -1302840 -1337861 -1424176 -1460247 -1550761 -1568209 -1476025 -1345897 -1247982 -1306754
$$ packed form
21124b989824n128L9207N3193K9547M3628j3407r5397P3592O2185Q4856j842m8055
21112b767445L4924R8952N1184m9069L2987J48801M8466j27740K814P6387J9032
21101b430707k1074p423M0711K2425j6877K750K6665L8581R0906J8085K9035L3376
21089b173547R1970k2628j14014q2689r76L7648L3612J2520J8691J13148N2054
21078b034211r3023J5184J06864J69213o9401n3018J5883P4873R2935M0822Q8634
21067a645245k975j29958r6448M6890N2005o173l102k131J11847O2993O4012P4746
21055a473539l1857q315Q137q6464n100j6972L1043K4970K2363m5488j4552J38099
21043a457675J04801N0034l5021q6315l6071r0514j7448R2184J30128R7915n8772
$$ plain form
21032 -1306754 -1449021 -1415602 -1320504 -1201959 -1086352 -1009520 -1001121 -1069502 -1068661 -1059802 -1177684
21021 -1177684 -1221964 -1210884 -1219858 -1191128 -1142162 -1134397 -1103280 -1002358 -1001126 -1010976 -1005281 -976755
21009 -976755 -886449 -854803 -936339 -992728 -905951 -879283 -923704 -917868 -1000523 -1005246 -951643 -965193
20997 -965193 -973214 -1006657 -942365 -859413 -766029 -726717 -814540 -776061 -769030 -788898 -747442 -772748
20985 -772748 -833442 -777328 -760905 -751472 -802301 -824762 -833510 -771401 -688820 -727541 -748759 -773849
20973 -773849 -711804 -696461 -705413 -676325 -578488 -571123 -593092 -544109 -573350 -636025 -577685 -500307
20961 -500307 -504238 -526674 -500259 -475442 -460689 -440074 -455595 -439169 -459376 -440060 -333936
20950 -333936 -343556 -382464 -329943 -263564 -303114 -265914 -369766 -359444 -376294 -408875 -355645
$$ packed form
21032a306754j42267L3419R5098J18545J15607P6832Q399o8381Q41Q859j17882
21021a177684m4280J1080q974K8730M8966P765L1117J00922J232r850N695K8526
21009i76755R0306L1646q1536n6389Q6777K6668m4421N836q2655m723N3603j3550
20997i65193q021l3443O4292Q2952R3384L9312q7823L8479P031j9868M1456k5306
20985g72748o0694N6114J6423R433n0829k2461q748O2109Q2581l8721k1218k5090
20973g73849O2045J5343q952K9088R7837P365k1969M8983k9241o2675N8340P7378
20961e00307l931k2436K6415K4817J4753K0615j5521J6426k0207J9316J06124
20950c33936r620l8908N2521O6379l9550L7200j03852J0322j6850l2581N3230
$$ plain form
20939 -355645 -301510 -303522 -269664 -382264 -374286 -341847 -271036 -314955 -301009 -202095 -168841 -227684
20927 -227684 -199858 -179107 -252224 -232747 -219338 -182166 -130031 -141018 -100974 -72224 -74078 -140645
20915 -140645 -227735 -220838 -152943 -138256 -158613 -228145 -133368 13278 63490 32360 19006
20904 19006 28027 -12615 -45582 -120078 -120110 -136998 -26331 94625 126845 104783 110903 163062
20892 163062 129698 119960 89385 101787 94460 85472 37606 47415 59179 65721 75746 129763
20880 129763 159715 116699 34264 132535 268166 380340 336473 232481 205238 283193 293682
20869 293682 319153 306982 315981 316420 319551 323294 334450 396344 394907 305940 307768 337932 333390
20856 333390 285214 281652 355024 343608 385790 477907 553688 574794 521195 476410 445535 449834
$$ packed form
20939c55645N4135k012L3858j12600P978L2439P0811m3919J3946R8914L3254n8843
20927b27684K7826K0751p3117J9477J3409L7172N2135j0987M0044K8750j854o6567
20915a40645q7090O897O7895J4687k0357o9532R4777J46646N0212l1130j3354
20904A9006R021m0642l2967p4496l2j6888J10667J20956L2220k2062O120N2159
20892A63062l3364r738l0575J2402p327q988m7866R809J1764O542J0025N4017
20880A29763K9952m3016q2435R8271J35631J12174m3867j03992k7243P7955J0489
20869B93682K5471j2171Q999M39L131L743J1156O1894j437q8967J828L0164m542
20856C33390m8176l562P3372j1416M2182R2117P5781K1106n3599m4785l0875M299
$$ plain form
20844 449834 407105 402703 457670 481773 446015 383529 473571 618124 613306 540687 496111 502330
20832 502330 469693 493907 474871 449394 525395 568555 614201 624866 525232 586580 637216
20821 637216 651024 628108 610900 671982 603670 626856 733753 789459 779350 843446 790644
20810 790644 651985 685398 671317 680535 705849 715648 792884 849109 748747 670612 730648
20799 730648 724373 758786 822981 837462 782079 812120 876074 946960 995314 944903 1002218 955623
20787 955623 953999 965463 952149 1029404 1119934 1139128 1144771 1132292 1106808 1079357 1032428 1088026
20775 1088026 1137131 1174646 1195688 1207724 1250419 1257276 1328864 1434319 1396171 1413394 1457876
20764 1457876 1420208 1370871 1204577 884239 615878 548133 647720 736554 735785 812289 851694
$$ packed form
20844D49834m2729m402N4967K4103l5758o2486R0042J44553m818p2619m4576O219
20832E02330l2637K4214j9036k5477P6001M3160M5646J0665r9634O1348N0636
20821F37216J3808k2916j7208O1082o8312K3186J06897N5706j0109O4096n2802
20810G90644j38659L3413j4081R218K5314R799P7236N6225j00362p8135O0036
20799G30648o275L4413O4195J4481n5383L0041O3954P0886M8354n0411N7315m6595
20787I55623j624J1464j3314P7255R0530J9194N643j2479k5484k7451m6929N5598
20775A088026M9105L7515K1042J2036M2695O857P1588J05455l8148J7223M4482
20764A457876l7668m9337j66294l20338k68361o7745R9587Q8834p69P6504L9405
$$ plain form
20753 851694 1013010 1162741 1232592 1224743 1267988 1340462 1321665 1392492 1417010 1106409 725690
20742 725690 488496 401362 381817 477498 531736 523891 557560 628843 593572 602721 717618
20731 717618 872298 890778 843355 762015 778444 868395 933046 909120 975318 976202 1014078 1011042
20719 1011042 998207 1034211 1013150 1028853 1027991 1097734 1167281 1196990 1135144 1049357 1073588 1110631
20707 1110631 1121032 1170796 1212020 1256361 1210799 1198718 1229607 1153151 1128736 1125485 1193686
20696 1193686 1235516 1288786 1310125 1268328 1204696 1258479 1355665 1393852 1305038 1243916 1241892
20685 1241892 1289793 1295894 1341841 1381101 1430560 1386005 1362645 1452832 1519793 1549155 1512106
20674 1512106 1420513 1386966 1409188 1423915 1412356 1384611 1327342 1316308 1482593 1581341 1561805
$$ packed form
20753H51694J61316J49731O9851p849M3245P2474j8797P0827K4518l10601l80719
20742G25690k37194q7134j9545R5681N4238p845L3669P1283l5271R149J14897
20731G17618J54680J8480m7423q1340J6429Q9951O4651k3926O6198Q84L7876l036
20719A011042j2835L6004k1061J5703q62O9743O9547K9709o1846q5787K4231L7043
20707A110631J0401M9764M1224M4341m5562j2081L0889p6456k4415l251O8201
20696A193686M1830N3270K1339m1797o3632N3783R7186L8187q8814o1122k024
20685A241892M7901O101M5947L9260M9459m4555k3360R0187O6961K9362l7049
20674A512106r1593l3547K2222J4727j1559k7745n7269j1034J66285R8748j9536
$$ plain form
20663 1561805 1594571 1632345 1641419 1664150 1710828 1674514 1594405 1563195 1631582 1644426 1551685
20652 1551685 1543944 1500341 1508005 1534520 1542272 1515682 1531179 1531271 1555419 1566655 1636580 1698145
20640 1698145 1650127 1646296 1687686 1795995 1876250 1858656 1869392 1799098 1776605 1706398 1709763
20629 1709763 1734795 1713288 1809441 1824525 1818349 1771015 1853391 1904254 1952963 1880536 1740880
20618 1740880 1777424 1881205 1869355 1834558 1855993 1796456 1797404 1846624 1828276 1857795 1891807
20607 1891807 1955264 1974572 1947397 1955308 1953726 1920582 1879526 1967225 2112820 2201726 2177782
20596 2177782 2095272 2126534 2185945 2125156 2159314 2203738 2228568 2190661 2187892 2167826 2123355
20585 2123355 2065806 2081003 2105658 2192037 2230764 2271164 2284999 2269108 2158837 2096776 2118399
$$ packed form
20663A561805L2766L7774R074K2731M6678l6314q0109l1210O8387J2844r2741
20652A551685p741m3603P664K6515P752k6590J5497R2K4148J1236O9925O1565
20640A698145m8018l831M1390J08309Q0255j7594J0736p0294k2493p0207L365
20629A709763K5032k1507R6153J5084o176m7334Q2376N0863M8709p2427j39656
20618A740880L6544J03781j1850l4797K1435n9537R48M9220j8348K9519L4012
20607A891807O3457J9308k7175P911j582l3144m1056Q7699J45595Q8906k3944
20596B177782q2510L1262N9411o0789L4158M4424K4830l7907k769k0066m4471
20585B123355n7549J5197K4655Q6379L8727M0400J3835j5891j10271o2061K1623
$$ plain form
20574 2118399 2172714 2161827 2103026 2028979 1987997 1994523 1970731 2048039 2167624 2198390 2142355
20563 2142355 2106470 2138728 2200867 2174365 2145448 2157977 2168674 2180974 2137381 2061766 2068297
20552 2068297 2087051 2165923 2193775 2135377 2072839 2064229 2184238 2267027 2285053 2322275 2423686
20541 2423686 2466777 2507862 2461225 2486035 2471550 2461662 2434824 2507462 2508989 2479581 2466972 2463464
20529 2463464 2407273 2364595 2333581 2363896 2317893 2241598 2157987 2190778 2223423 2259345 2279858
20518 2279858 2275662 2231839 2190231 2169848 2156797 2109676 2063669 2128987 2167546 2146167 2233334
20507 2233334 2342175 2366334 2366446 2300909 2243506 2276453 2397274 2432352 2441027 2432096 2442656 2436258
20495 2436258 2498776 2487079 2446122 2403315 2448834 2589312 2679398 2728909 2655056 2617285 2611951
$$ packed form
20574B118399N4315j0887n8801p4047m0982O526k3792P7308J19585L0766n6035
20563B142355l5885L2258O2139k6502k8917J2529J0697J2300m3593p5615O531
20552B068297J8754P8872K7852n8398o2538q610J20009Q2789J8026L7222J01411
20541B423686M3091M1085m6637K4810j4485r888k6838P2638J527k9408j2609l508
20529B463464n6191m2678l1014L0315m6003p6295q3611L2791L2645L5922K0513
20518B279858m196m3823m1608k0383j3051m7121m6007O5318L8559k1379Q7167
20507B233334J08841K4159J12o5537n7403L2947J20821L5078Q675q931J0560o398
20495B436258O2518j1697m0957m2807M5519J40478R0086M9511p3853l7771n334
$$ plain form
20484 2611951 2584131 2625673 2604278 2575747 2558501 2614049 2692833 2831186 2867420 2817779 2749518
20473 2749518 2679898 2636958 2633432 2706216 2689444 2670289 2794180 2874076 2873956 2892477 2897896 2928448
20461 2928448 2896556 2901774 2890503 2908810 2916206 2870614 2818100 2734260 2724144 2804878 2859273 3035669
20449 3035669 3145131 3147745 3106534 3064908 2984864 2976524 3004857 3043189 3103125 3103987 3113655 3095963
20437 3095963 3135231 3205961 3172265 3223971 3326947 3318965 3304150 3211225 3185458 3130151 3052658
20426 3052658 3041682 3061818 3126187 3173279 3187790 3235288 3306671 3264173 3164648 3127870 3166008
20415 3166008 3200975 3199800 3187705 3229681 3282174 3258144 3263511 3213791 3222109 3202915 3156375 3166106
20403 3166106 3283183 3341469 3386359 3443884 3447978 3477485 3622926 3632959 3715482 3723478 3672978
$$ packed form
20484B611951k7820M1542k1395k8531j7246N5548P8784J38353L6234m9641o8261
20473B749518o9620m2940l526P2784j6772j9155J23891P9896j20J8521N419L0552
20461B928448l1892N218j1271J8307P396m5592n2514q3840j0116Q0734N4395J76396
20449C035669J09462K614m1211m1626q0044q340K8333L8332N9936Q62R668j7692
20437C095963L9268P0730l3696N1706J02976p982j4815r2925k5767n5307p7493
20426C052658j0976K0136O4369M7092J4511M7498P1383m2498r9525l6778L8138
20415C166008L4967j175j2095M1976N2493k4030N367m9720Q318j9194m6540R731
20403C166106J17077N8286M4890N7525M094K9507J45441J0033Q2523P996n0500
$$ plain form
20392 3672978 3670452 3648546 3667600 3599978 3583200 3558056 3612066 3715540 3777636 3890892 3929188
20381 3929188 3889411 3865487 3843789 3724171 3679749 3677172 3680840 3566495 3507341 3500451 3596883
20370 3596883 3717258 3779928 3686627 3574849 3616026 3671290 3620732 3615658 3637936 3680318 3643842
20359 3643842 3699403 3771996 3761468 3832139 3935059 3936682 3883895 3849525 3900335 3888323 3884464
20348 3884464 4010814 4055988 4085518 4167762 4196662 4170879 4173484 4208665 4209754 4238481 4316115
20337 4316115 4266266 4241607 4217141 4170809 4221210 4246070 4297671 4281850 4262547 4273887 4354506
20326 4354506 4404488 4369774 4341972 4358279 4367615 4336277 4305968 4420703 4581099 4612178 4583422
20315 4583422 4612013 4656799 4675111 4719943 4695126 4664932 4727493 4866778 4948060 4925277 4765516
$$ packed form
20392C672978k526k1906J9054o7622j6778k5144N4010J03474O2096J13256L8296
20381C929188l9777k3924k1698j19618m4422k577L668j14345n9154o890R6432
20370C596883J20375O2670r3301j11778M1177N5264n0558n074K2278M2382l6476
20359C643842N5561P2593j0528P0671J02920J623n2787l4370N0810j2012l859
20348C884464J26350M5174K9530Q2244K8900k5783K605L5181J089K8727P7634
20337D316115m9849k4659k4466m6332N0401K4860N1601j5821j9303J1340Q0619
20326D354506M9982l4714k7802J6307R336l1338l0309J14735J60396L1079k8756
20315D583422K8591M4786J8312M4832k4817l0194O2561J39285Q1282k2783j59761
$$ plain form
20304 4765516 4651300 4729550 4764612 4696442 4717564 4796995 4900757 4935520 4985185 5019966 4915353
20293 4915353 4877751 4981084 5051307 4975602 4980723 4991966 4991593 4967244 5027070 5160756 5209682
20282 5209682 5228264 5243966 5288110 5264578 5278183 5252100 5252166 5314281 5397161 5526125 5549942 5567505
20270 5567505 5509414 5520191 5603636 5556645 5628158 5714503 5672341 5603475 5635618 5761245 5853899
20259 5853899 5859252 5877748 5883165 5854318 5806743 5841608 5842762 5870021 5898478 6011631 6106234 6127070
20247 6127070 6208872 6268016 6338248 6359649 6369367 6372311 6364520 6274179 6343709 6384189 6477092 6470571
20235 6470571 6487203 6539490 6594680 6581198 6596557 6599070 6673093 6808221 6916027 6978421 7040276
20224 7040276 7059034 7115389 6968410 6957666 6889926 6935452 7037957 7107023 7213264 7298840 7454968
$$ packed form
20304D765516j14216P8250L5062o8170K1122P9431J03762L4763M9665L4781j04613
20293D915353l7602J03333P0223p5705N121J1243l73k4349N9826J33686M8926
20282E209682J8582J5702M4144k3532J3605k6083O6O2115Q2880J28964K3817J7563
20270E567505n8091J0777Q3445m6991P1513Q6345m2162o8866L2143J25627R2654
20259E853899N353J8496N417k8847m7575L4865J154K7259K8457J13153R4603K0836
20247F127070Q1802N9144P0232K1401R718K944p791r0341O9530M0480R2903o521
20235F470571J6632N2287N5190j3482J5359K513P4023J35128J07806O2394O1855
20224G040276J8758N6355j46979j0744o7740M5526J02505O9066J06241Q5576J56128
$$ plain form
20213 7454968 7507454 7531446 7622282 7642634 7661153 7630193 7596702 7597112 7597910 7665573 7734628 7866031
20201 7866031 8081397 8229612 8338499 8358241 8322500 8268449 8218008 8298631 8349899 8410578 8480526
20190 8480526 8577438 8617056 8659556 8747658 8781038 8815427 8881818 8991506 9020405 8987948 9026718
20179 9026718 9166516 9340043 9482445 9517241 9528749 9568916 9618863 9613680 9733188 9806475 9805067
20168 9805067 9865388 10038439 10175806 10272101 10431653 10482664 10576475 10684832 10777172 10743800
20158 10743800 10816547 10881917 11015190 11107052 11272209 11355205 11447087 11627026 11882896 11996137
20148 11996137 12108559 12180499 12229995 12267833 12279585 12365930 12570574 12809957 13000695 13175664
20138 13175664 13398676 13597743 13778558 13968753 14088716 14197303 14300608 14360254 14467805
$$ packed form
20213G454968N2486K3992R0836K0352J8519l0960l3491M10P98O7663O9055J31403
20201G866031K15366J48215J08887J9742l5741n4051n0441Q0623N1268O0679O9948
20190H480526R6912L9618M2500Q8102L3380L4389O6391J09688K8899l2457L8770
20179I026718J39798J73527J42402L4796J1508M0167M9947n183J19508P3287j408
20168I805067O0321J73051J37367R6295J59552N1011R3811J08357R2340l3372
20158A0743800P2747O5370J33273R1862J65157Q2996R1882J79939K55870J13241
20148A1996137J12422P1940M9496L7838J1752Q6345K04644K39383J90738J74969
20138A3175664K23012J99067J80815J90195J19963J08587J03305N9646J07551
$$ plain form
20129 14467805 14527752 14701565 14974274 15336230 15666572 15973011 16209352 16411095 16638301
20120 16638301 16898093 17280309 17663742 17956342 18246225 18491952 18598516 18537731 18377144
20111 18377144 18422610 18807263 19253491 19740161 20204074 20592308 21097840 21575739 21889597
20102 21889597 22353960 22905496 23451264 24199580 24981454 25676827 26393615 27248606 28134013
20093 28134013 28874957 29592539 30027820 29950172 29652893 29618909 30380098 31631223 32895097
20084 32895097 34083687 35125232 36172271 37825496 40154647 42985804 46364352 50206695
20076 50206695 54125162 58098620 61579553 63327197 61046673 51264765 32843221 15734573
20068 15734573 9443692 11677129 17689010 24788903 31863029 38084414 42182874 41463712
$$ packed form
20129A4467805N9947J73813K72709L61956L30342L06439K36341K01743K27206
20120A6638301K59792L82216L83433K92600K89883K45727J06564o0785j60587
20111A8377144M5466L84653M46228M86670M63913L88234N05532M77899L13858
20102B1889597M64363N51536N45768P48316P81874O95373P16788Q54991Q85407
20093B8134013P40944P17582M35281p7648k97279l3984P61189J251125J263874
20084C2895097J188590J041545J047039J653225K329151K831157L378548L842343
20076E0206695L918467L973458L480933J747644k280524r781908j8421544j7108648
20068A5734573o290881K233437O011881P099893P074126O221385M098460p19162
$$ plain form
20060 41463712 31368035 12472691 -6383684 -17207893 -20621692 -20143162 -16972962 -12196292
20052 -12196292 -6884904 -1716290 2629074 5205090 5291884 3392920 502279 -1280027
20044 -1280027 129623 3215534 5373869 4436742 2021187 1951220 3967936 5825908 5881967
20035 5881967 4812703 5140914 7687541 11458123 15377502 17832528 16852882 12815257
20027 12815257 8039373 2601114 -2602034 -7704519 -11893059 -14433650 -17111901 -19517500
20019 -19517500 -19261843 -16368914 -12666699 -9774048 -7542500 -4099479 276010 3337746
20011 3337746 2051306 -4110823 -15991841 -36490989 -57354862 -66377928 -65257948 -60507976
20003 -60507976 -55620753 -51835580 -48762136 -45853970 -43484949 -42458656 -42420709 -41645630
$$ packed form
20060D1463712j0095677j8895344j8856375j0824209l413799M78530L170200M776670
20052a2196292N311388N168614M345364K576016Q6794j898964k890641j782306
20044a280027J409650L085911K158335r37127k415555o9967K016716J857972N6059
20035E881967j069264L28211K546627L770582L919379K455026r79646m037625
20027A2815257m775884n438259n203148n102485m188540k540591k678251k405599
20019a9517500K55657K892929L702215K892651K231548L443021M375489L061736
20011C337746j286440o162129j1881018k0499148k0863873r023066J119980M749972
20003f0507976M887223L785173L073444K908166K369021J026293L7947P75079
$$ plain form
19995 -41645630 -39911816 -37925573 -35875701 -33996034 -32351540 -30936471 -29728786 -28967318
19987 -28967318 -28640173 -28483939 -28070508 -27255582 -26426330 -25636856 -24695626 -23906879 -23187478
19978 -23187478 -22446348 -21834979 -21197143 -20577202 -20063576 -19504141 -19073231 -18809264 -18667417
19969 -18667417 -18754681 -18865935 -18798231 -18424015 -18061689 -17744082 -17233911 -16729942 -16330078 -15952372
19959 -15952372 -15695779 -15372856 -15148619 -14917220 -14732130 -14734530 -14542909 -14345258 -14178940 -13988272
19949 -13988272 -13768887 -13489601 -13413528 -13326641 -13157895 -13014562 -12862640 -12722582 -12490018 -12329363
19939 -12329363 -12118338 -11943850 -11783369 -11630206 -11502374 -11368361 -11144789 -10970325 -10748249
19930 -10748249 -10562893 -10462691 -10319582 -10315847 -10233504 -10101630 -10002427 -9857535 -9797989 -9790707
$$ packed form
19995d1645630J733814J986243K049872J879667J644494J415069J207685P61468
19987b8967318L27145J56234M13431Q14926Q29252P89474R41230P88747P19401
19978b3187478P41130O11369O37836O19941N13626N59435M30910K63967J41847
19969a8667417q7264j11254O7704L74216L62326L17607N10171N03969L99864L77706
19959a5952372K56593L22923K24237K31399J85090k400J91621J97651J66318J90668
19949a3988272K19385K79286P6073Q6887J68746J43333J51922J40058K32564J60655
19939a2329363K11025J74488J60481J53163J27832J34013K23572J74464K22076
19930a0748249J85356J00202J43109L735Q2343J31874R9203J44892N9546P282
$$ plain form
19920 -9790707 -9633050 -9438011 -9362557 -9236104 -9041611 -8999667 -8959820 -8892469 -8881197 -8816122
19910 -8816122 -8742216 -8650569 -8524314 -8378429 -8286100 -8163144 -8069741 -8007632 -7992181 -7926442 -7822089
19899 -7822089 -7698766 -7682474 -7702895 -7680178 -7625334 -7547962 -7445089 -7409650 -7387942 -7284648 -7193299
19888 -7193299 -7080864 -6979897 -6948400 -6931291 -6941249 -6841779 -6815869 -6719655 -6651310 -6613942 -6627533
19877 -6627533 -6576308 -6534912 -6479083 -6469226 -6522295 -6461333 -6166068 -6138201 -6175659 -6165303 -6124804
19866 -6124804 -6080650 -6073906 -6072795 -6054079 -5991575 -5869920 -5728557 -5578975 -5531271 -5577307 -5610644
19855 -5610644 -5571015 -5486733 -5403432 -5355294 -5385064 -5352923 -5297348 -5284795 -5274961 -5214054 -5211831 -5222313
19843 -5222313 -5170442 -5075354 -4986298 -4923532 -4890459 -4952546 -4980062 -4841622 -4708972 -4713367 -4704205
$$ packed form
19920i790707J57657J95039P5454J26453J94493M1944L9847O7351J1272O5075
19910h816122P3906R1647J26255J45885R2329J22956R3403O2109J5451O5739J04353
19899g822089J23323J6292k0421K2717N4844P7372J02873L5439K1708J03294R1349
19888g193299J12435J00967L1497J7109r958R9470K5910R6214O8345L7368j3591
19877f627533N1225M1396N5829R857n3069O0962K95265K7867l7458J0356M0499
19866f124804M4154O744J111J8716O2504J21655J41363J49582M7704m6036l3337
19855e610644L9629Q4282Q3301M8138k9770L2141N5575J2553R834O0907K223j0482
19843e222313N1871R5088Q9056O2766L3073o2087k7516J38440J32650m395R162
$$ plain form
19832 -4704205 -4747741 -4724962 -4638400 -4595276 -4557674 -4466482 -4390848 -4423644 -4383490 -4298734 -4282411
19821 -4282411 -4368991 -4450126 -4401822 -4324998 -4232978 -4185533 -4253988 -4300768 -4276232 -4234891 -4212202
19810 -4212202 -4253932 -4196526 -4149543 -4127639 -4103860 -3997853 -3975450 -4020981 -4034487 -4052650 -4070364
19799 -4070364 -4030705 -4020023 -3976404 -3967561 -3917287 -3861157 -3839537 -3750677 -3697731 -3666384 -3647169
19788 -3647169 -3609879 -3614189 -3560564 -3481021 -3442991 -3438340 -3440192 -3438164 -3393613 -3354102 -3317401 -3280138
19776 -3280138 -3276712 -3293754 -3261153 -3287981 -3294591 -3239243 -3339634 -3407139 -3346051 -3345538 -3290278 -3238601
19764 -3238601 -3189695 -3129273 -3148605 -3160593 -3193515 -3101489 -3047473 -3130620 -3162748 -3120869 -3070897
19753 -3070897 -3075101 -3202329 -3184694 -3079729 -3141502 -3076924 -2978223 -2995860 -2894329 -2817949 -2814733
$$ packed form
19832d704205m3536K2779Q6562M3124L7602R1192P5634l2796M0154Q4756J6323
19821d282411q6580q1135M8304P6824R2020M7445o8455m6780K4536M1341K2689
19810d212202m1730N7406M6983K1904K3779J06007K2403m5531j3506j8163j7714
19799d070364L9659J0682M3619Q843N0274N6130K1620Q8860N2946L1347J9215
19788c647169L7290m310N3625P9543L8030M651j852K028M4551L9511L6701L7263
19776c280138L426j7042L2601k6828o610N5348j00391o7505O1088N13N5260N1677
19764c238601M8906O0422j9332j1988l2922R2026N4016q3147l2128M1879M9972
19753c070897m204j27228J7635J04965o1773O4578R8701j7637J01531P6380L216
$$ plain form
19742 -2814733 -2866044 -2813805 -2743852 -2791464 -2758498 -2751704 -2787379 -2789745 -2708036 -2674137 -2614319 -2650974
19730 -2650974 -2599380 -2574463 -2680232 -2666856 -2587523 -2572394 -2493919 -2403609 -2468601 -2455270 -2494592
19719 -2494592 -2557677 -2510932 -2435910 -2423394 -2380045 -2404245 -2559817 -2566552 -2514057 -2391129 -2422056
19708 -2422056 -2384488 -2379820 -2380042 -2311327 -2234286 -2181752 -2136282 -2167206 -2219054 -2354498 -2329299 -2251841
19696 -2251841 -2295065 -2232171 -2116278 -2013503 -2115543 -2157628 -2143193 -2061805 -2019127 -2038243 -2032736
19685 -2032736 -2024477 -2024807 -2026665 -2049710 -1960970 -1894743 -1920597 -1873748 -2000673 -2072649 -2013509 -1953577
19673 -1953577 -2025349 -1938404 -1869532 -1871161 -1757998 -1766098 -1782700 -1758333 -1811708 -1869959 -1823872
19662 -1823872 -1775683 -1778843 -1809297 -1787710 -1787221 -1699429 -1590688 -1531428 -1609277 -1660565 -1633725 -1665462
$$ packed form
19742b814733n1311N2239O9953m7612L2966O794l5675k366Q1709L3899N9818l6655
19730b650974N1594K4917j05769J3376P9333J5129P8475R0310o4992J3331l9322
19719b494592o3085M6745P5022J2516M3349k4200j55572o735N2495J22928l0927
19708b422056L7568M668k22O8715P7041N2534M5470l0924n1848j35444K5199P7458
19696b251841m3224O2894J15893J02775j02040m2085J4435Q1388M2678j9116N507
19685b032736Q259l30j858k3045Q8740O6227k5854M6849j26925p1976N9140N9932
19673a953577p1772Q6945O8872j629J13163q100j6602K4367n3375n8251M6087
19662a823872M8189l160l0454K1587M89Q7792J08741N9260p7849n1288K6840l1737
$$ plain form
19650 -1665462 -1663398 -1625405 -1663471 -1609170 -1590727 -1639070 -1575537 -1543902 -1560326 -1516031 -1487193
19639 -1487193 -1501461 -1590141 -1562649 -1457983 -1388028 -1424101 -1441861 -1420917 -1431737 -1465742 -1523917
19628 -1523917 -1482188 -1321959 -1277893 -1244497 -1237814 -1316180 -1379031 -1415879 -1365995 -1238813 -1149678
19617 -1149678 -1175638 -1246253 -1310442 -1324369 -1306964 -1265527 -1256133 -1276744 -1261971 -1263080 -1324857 -1333429
19605 -1333429 -1315602 -1299912 -1253663 -1190275 -1154421 -1168847 -1152338 -1135373 -1093998 -1098806 -1089233 -1075851
19593 -1075851 -968788 -1023372 -1082646 -1121421 -1060963 -1015729 -929260 -937863 -951663 -896616 -859784
19582 -859784 -834891 -890519 -891805 -974890 -941546 -854208 -873381 -861618 -811488 -817382 -793865 -832172
19570 -832172 -935879 -884408 -897621 -867176 -785442 -786282 -728802 -642219 -612391 -712887 -750807
$$ packed form
19650a665462K064L7993l8066N4301J8443m8343O3533L1635j6424M4295K8838
19639a487193j4268q8680K7492J04666O9955l6073j7760K0944j0820l4005n8175
19628a523917M1729J60229M4066L3396O683p8366o2851l6848M9884J27182Q9135
19617a149678k5960p0615o4189j3927J7405M1437R394k0611J4773j109o1777q572
19605a333429J7827J5690M6249O3388L5854j4426J6509J6965M1375m808R573J3382
19593a075851J07063n4584n9274l8775O0458M5234Q6469q603j3800N5047L6832
19582h59784K4893n5628j286q3085L3344Q7338j9173J1763N0130n894K3517l8307
19570h32172j03707N1471j3213L0445Q1734q40N7480Q6583K9828j00496l7920
$$ plain form
19559 -750807 -703752 -667829 -690076 -655959 -652852 -682591 -738417 -663910 -589465 -530791 -557225 -660746
19547 -660746 -663872 -685807 -735458 -763555 -763171 -722651 -608149 -538622 -541998 -630075 -655250 -619277
19535 -619277 -561056 -598345 -547822 -534612 -562296 -614434 -657931 -661177 -581534 -572686 -650246 -662676
19523 -662676 -591532 -551924 -599990 -638438 -617982 -652533 -721405 -675187 -665552 -694261 -642039 -516361
19511 -516361 -511528 -539278 -512299 -542548 -575085 -548381 -467209 -464808 -545357 -577827 -547440 -532258
19499 -532258 -448274 -506849 -454696 -527136 -540174 -478648 -501539 -506884 -447289 -416411 -438452 -480552
19487 -480552 -485259 -500758 -504631 -462531 -448248 -452675 -498922 -535402 -589501 -545813 -488950 -403769
19475 -403769 -398025 -414045 -409470 -388869 -287285 -201715 -211228 -180787 -214562 -233929 -237073 -212813
$$ packed form
19559g50807M7055L5923k2247L4117L107k9739n5826P4507P4445N8674k6434j03521
19547f60746l126k1935m9651k8097L84M0520J14502O9527l376q8077k5175L5973
19535f19277N8221l7289N0523J3210k7684n2138m3497l246P9643Q848p7560j2430
19523f62676P1144L9608m8066l8448K0456l4551o8872M6218R635k8709N2222J25678
19511e16361M833k7750K6979l0249l2537K6704Q1172K401q0549l2470L0387J5182
19499e32258Q3984n8575N2153p2440j3038O1526k2891n345N9595L0878k2041m2100
19487d80552m707j5499l873M2100J4283m427m6247l6480n4099M3688N6863Q5181
19475d03769N744j6020M575K0601J01584Q5570r513L0441l3775j9367l144K4260
$$ plain form
19463 -212813 -135467 -59476 -94394 -178538 -94490 -102423 -121048 -186759 -143196 -47312 -113470 -149660
19451 -149660 -186496 -209890 -153558 -95588 -162612 -174860 -171822 -162586 -104083 -78536 -28208 -36430
19439 -36430 -44872 -2857 -24355 -123654 -153019 -57068 30307 51620 -10987 -60380 1963 26511
19427 26511 -4046 23818 -32575 22092 127725 100432 129931 76860 46539 70904 61678 79224
19415 79224 104405 116943 53014 69921 141684 201799 197940 146113 85191 13670 30095 85836
19403 85836 104307 125456 119880 127791 96665 87945 161940 266875 295809 283660 352159 452658
19391 452658 474864 426354 366581 276609 125438 134764 214627 315537 396294 411826 375153
19380 375153 384099 349999 359094 358566 424390 388762 365145 429711 423424 429385 439566 470954 435610
$$ packed form
19463b12813P7346P5991l4918q4144Q4048p933j8625o5711M3563R5884o6158l6190
19451a49660l6836k3394N6332N7970o7024j2248L038R236N8503K5547N0328q222
19439c6430q442M2015k1498r9299k9365R5951Q7375K1313o2607m9393O2343K4548
19427B6511l0557K7864n6393N4667J05633k7293K9499n3071l0321K4365r226J7546
19415G9224K5181J2538o3929J6907P1763O0115l859n1827o0922p1521J6425N5741
19403H5836J8471K1149n576P911l1126q720P3995J04935K8934j2149O8499J00499
19391D52658K2206m8510n9773q9972j51171R326P9863J00910Q0757J5532l6673
19380C75153Q946l4100R095n28O5824l5628k3617O4566o287N961J0181L1388l5344
$$ plain form
19367 435610 478419 445094 419963 480247 554203 614668 584086 564955 532617 529152 534953 552148
19355 552148 476403 400197 476078 576582 646903 589709 533605 538535 528268 492263 492419 462234
19343 462234 442084 525619 587747 596682 639625 645374 654009 651361 637912 695478 754756 655393
19331 655393 612243 599655 579710 664757 676187 680478 727248 840583 914744 948871 955283 949432
19319 949432 881822 796045 814611 874621 917171 865171 838519 827377 884076 840803 735004
19308 735004 775462 827368 764727 744828 736675 711918 748426 807734 851165 850311 891362 908329
19296 908329 906214 977002 1005600 928005 854924 915294 996440 936457 921577 915174 928091 946143
19284 946143 993163 1037855 1066590 1046084 1115834 1160105 1186158 1155214 1113814 1161285 1179369
$$ packed form
19367D35610M2809l3325k5131O0284P3956O0465l0582j9131l2338l465N801J7195
19355E52148p5745p6206P5881J00504P0321n7194n6104M930j0267l6005J56l0185
19343D62234k0150Q3535O2128Q935M2943N749Q635k648j3449N7566N9278r9363
19331F55393m3150j2588j9945Q5047J1430M291M6770J13335P4161L4127O412n851
19319I49432o7610q5777J8566O0010M2550n2000k6652j1142N6699m3273j05799
19308G35004M0458N1906o2641j9899q153k4757L6508N9308M3431q54M1051J6967
19296I08329k115P0788K8598p7595p3081O0370Q1146n9983j4880o403J2917J8052
19284I46143M7020M4692K8735k0506O9750M4271K6053l0944m1400M7471J8084
$$ plain form
19273 1179369 1163386 1176845 1152515 1158831 1136662 1111887 1040488 1139954 1229601 1178256 1235869
19262 1235869 1348132 1348113 1251604 1222602 1243314 1280603 1224932 1205453 1243095 1206082 1194719 1230806
19250 1230806 1322146 1355437 1399681 1423870 1349477 1331846 1289536 1329696 1357561 1306748 1265805
19239 1265805 1312526 1460955 1522869 1472964 1517968 1587044 1613622 1549702 1528795 1550795 1521680
19228 1521680 1517929 1531270 1473978 1461404 1487476 1487301 1530560 1580256 1596884 1662670 1660980 1621812
19216 1621812 1670788 1726832 1684080 1710674 1741406 1704164 1644358 1655519 1674380 1738353 1760186
19205 1760186 1804788 1837540 1907003 1850175 1750025 1706767 1709196 1707910 1753219 1877779 1910582
19194 1910582 1923746 1884114 1899828 1977973 2010027 1989065 1921826 1835765 1881573 1879054 1775979
$$ packed form
19273A179369j5983J3459k4330O316k2169k4775p1399R9466Q9647n1345N7613
19262A235869J12263j9r6509k9002K0712L7289n5671j9479L7642l7013j1363L6087
19250A230806R1340L3291M4244K4189p4393j7631m2310M0160K7865n0813m0943
19239A265805M6721J48429O1914m9905M5004O9076K6578o3920k0907K2000k9115
19228A521680l751J3341n7292j2574K6072j75M3259M9696J6628O5786j690l9168
19216A621812M8976N6044m2752K6594L0732l7242n9806J1161J8861O3973K1833
19205A760186M4602L2752O9463n6828j00150m3258K429j286M5309J24560L2803
19194A910582J3164l9632J5714P8145L2054k0962o7239q6061M5808k519j03075
$$ plain form
19183 1775979 1690125 1737299 1810334 1752262 1755359 1771962 1841562 1818871 1785946 1689132 1619219
19172 1619219 1602954 1620579 1676449 1720761 1731640 1772337 1794847 1835178 1857408 1846257 1940542
19161 1940542 1972603 1876190 1892827 1960907 1997209 2017517 1971219 1952435 1922345 1952453 1934893
19150 1934893 1879970 1922657 1946468 2027525 2077187 2084026 2064457 1981869 1943303 2008674 2114283
19139 2114283 2142789 2186663 2225676 2236641 2253850 2273245 2263469 2342099 2304630 2179347 2081995
19128 2081995 2035791 1932745 1935155 2047791 2184472 2124771 2062581 1994140 2012905 2004070 1990712
19117 1990712 1971188 1998912 2030455 2085763 2090944 2163007 2256271 2275680 2227662 2184103 2090046
19106 2090046 2047513 2158708 2177845 2074229 2124976 2245571 2206385 2215308 2264913 2282127 2349760
$$ packed form
19183A775979q5854M7174P3035n8072L097J6603O9600k2691l2925r6814o9913
19172A619219j6265J7625N5870M4312J0879M0697K2510M0331K2230j1151R4285
19161A940542L2061r6413J6637O8080L6302K0308m6298j8784l0090L0108j7560
19150A934893n4923M2687K3811Q1057M9662O839j9569q2588l8566O5371J05609
19139B114283K8506M3874L9013J0965J7209J9395r776P8630l7469j25283r7352
19128B081995m6204j03046K410J12636J36681n9701o2190o8441J8765q835j3358
19117A990712j9524K7724L1543N5308N181P2063R3264J9409m8018m3559r4057
19106B090046m2533J11195J9137j03616N0747J20595l9186Q923M9605J7214O7633
$$ plain form
19095 2349760 2362442 2398218 2483518 2485598 2438494 2459792 2552371 2552765 2487798 2493180 2492072 2510306
19083 2510306 2525411 2581977 2605069 2549410 2545799 2566264 2541654 2617588 2682926 2585604 2534353
19072 2534353 2549054 2607900 2633585 2647614 2646891 2563562 2581021 2663470 2706708 2629996 2622320 2680965
19060 2680965 2745638 2783067 2790063 2833504 2884513 2943949 2968822 2791011 2793503 2925464 2991806
19049 2991806 2989836 2977149 2981010 2988225 2912740 2880492 2966362 3021480 3106110 3145970 3138079 3054284
19037 3054284 3050340 3048662 3159822 3187889 3187876 3264129 3272335 3263481 3290299 3264069 3249317 3231133
19025 3231133 3212324 3242745 3251168 3304645 3399479 3404749 3334396 3307266 3342798 3423143 3481648 3548751
19013 3548751 3523231 3459721 3415971 3359152 3256517 3306932 3448599 3480437 3466334 3534712 3514210
$$ packed form
19095B349760J2682L5776Q5300K080m7104K1298R2579L94o4967N382j108J8234
19083B510306J5105N6566K3092n5659l611K0465k4610P5934O5338r7322n1251
19072B534353J4701N8846K5685J4029p23q3329J7459Q2449M3238p6712p676N8645
19060B680965O4673L7429O996M3441N1009N9436K4873j77811K492J31961O6342
19049B991806j970j2687L861P215p5485l2248Q5870N5118Q4630L9860p891q3795
19037C054284l944j678J11160K8067j3P6253Q206q854K6818k6230j4752j8184
19025C231133j8809L0421Q423N3477R4834N270p0353k7130L5532Q0345N8505O7103
19013C548751k5520o3510m3750n6819j02635N0415J41667L1838j4103O8378k0502
$$ plain form
19002 3514210 3598870 3631754 3641675 3645694 3704876 3742544 3711490 3673020 3731026 3661050 3673660 3721939
18990 3721939 3787973 3826436 3872763 3867078 3826402 3838257 3886134 3920939 3910622 3868425 3826338
18979 3826338 3933935 3929487 3915968 4009737 4065970 4099419 4098395 4188299 4276426 4265633 4228477
18968 4228477 4223790 4275599 4335318 4325099 4256697 4302061 4334419 4358836 4318362 4418378 4532279
18957 4532279 4518601 4492284 4446777 4431857 4441649 4491581 4515125 4460606 4533755 4597660 4710471
18946 4710471 4782426 4718515 4639863 4536113 4531391 4621961 4702916 4750017 4796018 4774227 4820989
18935 4820989 4868249 4969371 4981074 4970186 5039123 5064987 5062228 5122653 5144715 5083511 5118796
18924 5118796 5260460 5325617 5366716 5355535 5337538 5362821 5382644 5335344 5271354 5270157 5290211
$$ packed form
19002C514210Q4660L2884R921M019N9182L7668l1054l8470N8006o9976J2610M8279
18990C721939O6034L8463M6327n685m0676J1855M7877L4805j0317m2197m2087
18979C826338J07597m448j3519R3769N6233L3449j024Q9904Q8127j0793l7156
18968D228477m687N1809N9719j0219o8402M5364L2358K4417m0474J00016J13901
18957D532279j3678k6317m5507j4920R792M9932K3544n4519P3149O3905J12811
18946D710471P1955o3911p8652j03750m722R0570Q0955M7101M6001k1791M6762
18935D820989M7260J01122J1703j0888O8937K5864k759O0425K2062o1204L5285
18924E118796J41664O5157M1099j1181j7997K5283J9823m7300o3990j197K0054
$$ plain form
18913 5290211 5268516 5292385 5354703 5400451 5521803 5523947 5552568 5620114 5595848 5535787 5614176
18902 5614176 5635452 5615760 5754181 5779639 5855992 5881649 5857952 5809912 5879572 6009507 6057930
18891 6057930 6028117 6023648 6012066 6032500 6028696 6142209 6215778 6279128 6289988 6369053 6340310
18880 6340310 6275479 6266365 6287963 6334158 6293629 6338151 6416482 6453303 6460220 6530953 6680688
18869 6680688 6682325 6652180 6740677 6788825 6869164 6871264 6841995 6949392 7100644 7081195 7127896
18858 7127896 7272116 7357587 7404529 7484666 7457134 7497163 7572507 7659198 7674601 7639972 7716401
18847 7716401 7807615 7859060 7872873 7939242 7988431 7983480 8056504 8098935 8169740 8225460 8254442
18836 8254442 8286452 8366337 8543547 8562062 8499165 8468802 8441831 8499546 8586759 8689171 8768586
$$ packed form
18913E290211k1695K3869O2318M5748J21352K144K8621O7546k4266o0061P8389
18902E614176K1276j9692J38421K5458P6353K5657k3697m8040O9660J29935M8423
18891F057930k9813m469j1582K0434l804J13513P3569O3350J0860P9065k8743
18880F340310o4831r114K1598M6195m0529M4522P8331L6821O917P0733J49735
18869F680688J637l0145Q8497M8148Q0339K100k9269J07397J51252j9449M6701
18858G127896J44220Q5471M6942Q0137k7532M0029P5344Q6691J5403l4629P6429
18847G716401R1214N1445J3813O6369M9189m951P3024M2431P0805N5720K8982
18836H254442L2010P9885J77210J8515o2897l0363k6971N7715Q7213J02412P9415
$$ plain form
18825 8768586 8766797 8821520 8888383 8964164 8993024 9072781 9140101 9229262 9235362 9236737 9320756 9357716
18813 9357716 9356690 9372271 9434966 9567332 9658430 9738282 9695920 9756058 9842282 9888840 9990402
18802 9990402 10090440 10161873 10286457 10399968 10518400 10675321 10739557 10716108 10709157 10864391
18792 10864391 10985091 11071364 11264855 11377424 11486862 11565379 11606534 11699481 11848731 11969239
18782 11969239 11928511 11924497 11956496 12106557 12242655 12444053 12572003 12708501 12868346 12937566
18772 12937566 12979236 13051490 13151101 13236823 13318061 13459812 13637991 13740265 13849382 13936536
18762 13936536 14080437 14340033 14527362 14626487 14797662 14998146 15250268 15508781 15637229
18753 15637229 15827856 16087845 16315487 16550779 16710783 17000125 17378701 17685960 17959926
$$ packed form
18825H768586j789N4723O6863P5781K8860P9757O7320Q9161O100J375Q4019L6960
18813I357716j026J5581O2695J32366R1098P9852m2362O0138Q6224M6558J01562
18802I990402J00038P1433J24584J13511J18432J56921O4236k3449o951J55234
18792A0864391J20700Q6273J93491J12569J09438P8517M1155R2947J49250J20508
18782A1969239m0728m014L1999J50061J36098K01398J27950J36498J59845O9220
18772A2937566M1670P2254R9611Q5722Q1238J41751J78179J02274J09117Q7154
18762A3936536J43901K59596J87329R9125J71175K00484K52122K58513J28448
18753A5637229J90627K59989K27642K35292J60004K89342L78576L07259K73966
$$ plain form
18744 17959926 18177668 18391060 18577776 18610021 18665546 18808123 19057021 19502115 20069926 20420219
18734 20420219 20834456 21147209 21263613 20898528 19989251 19355535 19383786 19897068 20471608
18725 20471608 20856770 21220939 21709273 22304211 22700637 22588609 21851966 21027133 20896970
18716 20896970 21365547 22003306 22588013 23250320 24030804 24793820 25383820 26007231 26732443
18707 26732443 27453680 28201627 29000574 29817792 30658137 31578122 32519229 33590642 34675105
18698 34675105 35784925 37079771 38543798 40295011 41953570 43415356 44472767 44225008
18690 44225008 41448903 38166385 37587217 39273536 41858571 44675998 47303699 49389414
18682 49389414 49899943 48552113 47141820 46388150 44582915 41336080 39083076 38850016
$$ packed form
18744A7959926K17742K13392J86716L2245N5525J42577K48898M45094N67811L50293
18734B0420219M14237L12753J16404l65085r09277o33716K8251N13282N74540
18725B0471608L85162L64169M88334N94938L96426j12028p36643q24833j30163
18716B0896970M68577O37759N84707O62307P80484P63016N90000O23411P25212
18707B6732443P21237P47947P98947Q17218Q40345R19985R41107J071413J084463
18698C4675105J109820J294846J464027J751213J658559J461786J057411k47759
18690D4225008k776105l282518n79168J686319K585035K817427K627701K085715
18682D9389414N10529j347830j410293p53670j805235l246835k253004k33060
$$ plain form
18674 38850016 40550407 43718511 47830503 52654946 58020779 63886034 70468582 77698027
18666 77698027 85274860 92807993 99545353 103177241 99555025 87624608 73613732 58412858
18658 58412858 38778567 18247024 3348399 -613064 5326742 15107177 23502375 25516847
18650 25516847 15072527 -7398988 -30916314 -44395854 -47504014 -45889834 -45199913 -47752757
18642 -47752757 -50495542 -51374164 -51143286 -48598595 -43072143 -36389445 -30016932 -24869462
18634 -24869462 -21713198 -22556812 -27813981 -32045413 -31346768 -27176233 -21929475 -17142563
18626 -17142563 -13616803 -10654616 -7733128 -6060047 -7002494 -9161580 -9904193 -9742320
18618 -9742320 -10478255 -10360384 -9896454 -11828311 -14569009 -16430180 -21077084 -30707603 -40442471
$$ packed form
18674C8850016J700391L168104M111992M824443N365833N865255O582548P229445
18666G7698027P576833P533133O737360L631888l622216j1930417j4010876j5200874
18658E8412858j9634291k0531543j4898625l961463N939806R780435Q395198K014472
18650B5516847j0444320k2471515k3517326j3479540l108160J614180O89921k552844
18642d7752757k742785q78622K30878K544691N526452O682698O372513N147470
18634b4869462L156264q43614n257169m231432O98645M170535N246758M786912
18626a7142563L525760K962187K921488J673081r42447k159086p42613J61873
18618i742320p35935J17871M63930j931857k740698j861171m646904r630519r734868
$$ plain form
18609 -40442471 -47700922 -55474790 -62986902 -66605736 -67209702 -66353432 -63674528 -59677304
18601 -59677304 -55453560 -51378482 -47521857 -43979950 -40881629 -38033213 -35739933 -33991618
18593 -33991618 -32348312 -30861425 -29863877 -30452844 -32899151 -35032651 -35223645 -33844713
18585 -33844713 -31689282 -29278186 -27091413 -25408315 -24229613 -24644543 -28468096 -33677381
18577 -33677381 -36094630 -36270013 -36166951 -35704211 -34453799 -32839582 -31215339 -29643678
18569 -29643678 -28274195 -26977535 -25978958 -25623928 -26493912 -27468495 -27375639 -26433867 -25123263
18560 -25123263 -23840323 -22748678 -22098012 -22233407 -23230383 -24452316 -26085163 -28232495
18552 -28232495 -29445820 -29294615 -28510008 -27472323 -26655291 -25937567 -25311137 -24786067 -24219515
$$ packed form
18609d0442471p258451p773868p512112l618834o03966Q56270K678904L997224
18601e9677304M223744M075078L856625L541907L098321K848416K293280J748315
18593c3991618J643306J486887R97548n88967k446307k133500j90994J378932
18585c3844713K155431K411096K186773J683098J178702m14930l823553n209285
18577c3677381k417249j75383J03062M62740J250412J614217J624243J571661
18569b9643678J369483J296660R98577L55030q69984r74583R2856R41772J310604
18560b5123263J282940J091645O50666j35395r96976j221933j632847k147332
18552b8232495j213325J51205P84607J037685Q17032P17724O26430N25070N66552
$$ plain form
18543 -24219515 -23673690 -23116147 -22576159 -22112699 -21741435 -21294700 -20919549 -20571049 -20321600
18534 -20321600 -20258216 -20188354 -20196180 -20042478 -19683237 -19362815 -19156909 -19001101 -18735531 -18424413
18524 -18424413 -18146376 -17901392 -17728690 -17423075 -17193413 -17031161 -16884634 -16763067 -16644736
18515 -16644736 -16571395 -16488104 -16316309 -16124921 -15961107 -15769240 -15540863 -15311965 -15154097 -15032464
18505 -15032464 -14923833 -14811705 -14663458 -14556166 -14411082 -14373229 -14370861 -14293004 -14193000 -14042280
18495 -14042280 -13880134 -13749224 -13650895 -13541712 -13407261 -13415304 -13363727 -13207756 -13031255 -12945459
18485 -12945459 -12845952 -12803880 -12785664 -12729420 -12635560 -12580542 -12462925 -12354499 -12287793 -12263849 -12202309
18474 -12202309 -12124246 -12023701 -11883662 -11794000 -11716311 -11616230 -11550675 -11501282 -11494280 -11446272 -11347484
$$ packed form
18543b4219515N45825N57543N39988M63460L71264M46735L75151L48500K49449
18534b0321600O3384O9862p826J53702L59241L20422K05906J55808K65570L11118
18524a8424413K78037K44984J72702L05615K29662J62252J46527J21567J18331
18515a6644736P3341Q3291J71795J91388J63814J91867K28377K28898J57868J21633
18505a5032464J08631J12128J48247J07292J45084L7853K368P7857J00004J50720
18495a4042280J62146J30910R8329J09183J34451q043N1577J55971J76501Q5796
18485a2945459R9507M2072J8216N6244R3860N5018J17617J08426O6706K3944O1540
18474a2202309P8063J00545J40039Q9662P7689J00081O5555M9393P002M8008R8788
$$ plain form
18463 -11347484 -11296641 -11245320 -11173945 -11064150 -10959928 -10891995 -10854996 -10785616 -10746073 -10682347 -10648676
18452 -10648676 -10563585 -10497967 -10512849 -10460096 -10458775 -10377796 -10280049 -10183921 -10100333 -10104486 -10083123
18441 -10083123 -10087554 -10068712 -9910955 -9844744 -9855564 -9770099 -9739186 -9699998 -9604127 -9609031 -9638575
18430 -9638575 -9570238 -9479246 -9467482 -9409434 -9322701 -9183001 -9165195 -9087271 -9061414 -9044431 -9020816
18419 -9020816 -9010172 -8976623 -8924034 -8896531 -8857070 -8799797 -8749378 -8668071 -8619790 -8544554 -8586162
18408 -8586162 -8554729 -8494147 -8447570 -8374306 -8316629 -8323908 -8285665 -8232198 -8222052 -8152343 -8193642
18397 -8193642 -8205549 -8204837 -8198145 -8141103 -8152527 -8139262 -8005266 -7959000 -7999868 -7994026 -7945404 -7905145
18385 -7905145 -7845549 -7754494 -7629298 -7546998 -7550791 -7574041 -7560740 -7453428 -7395562 -7389459 -7426683
$$ packed form
18463a1347484N0843N1321P1375J09795J04222O7933L6999O9380L9543O3726L3671
18452a0648676Q5091O5618j4882N2753J321Q0979R7747R6128Q3588m153K1363
18441a0083123m431J8842J57757O6211j0820Q5465L0913L9188R5871m904k9544
18430i638575O8337R0992J1764N8048Q6733J39700J7806P7924K5857J6983K3615
18419i020816J0644L3549N2589K7503L9461N7273N0419Q1307M8281P5236m1608
18408h586162L1433O0582M6577P3264N7677p279L8243N3467J0146O9709m1299
18397h193642j1907P12O692N7042j1424J3265J33996M6266m0868N842M8622M0259
18385g905145N9596R1055J25196Q2300l793k3250J3301J07312N7866O103l7224
$$ plain form
18374 -7426683 -7436244 -7370955 -7336175 -7299247 -7174183 -7182888 -7227389 -7183681 -7215731 -7251412 -7173444
18363 -7173444 -7196784 -7233986 -7131261 -7163370 -7080734 -7034549 -7094465 -7055805 -6984265 -6919010 -6879182
18352 -6879182 -6854524 -6881849 -6854992 -6850396 -6862661 -6767030 -6769401 -6804874 -6864749 -6889231 -6770193
18341 -6770193 -6676397 -6640511 -6656348 -6644252 -6621905 -6576901 -6611496 -6599246 -6533329 -6566306 -6531908
18330 -6531908 -6454663 -6379848 -6286444 -6288640 -6275377 -6218198 -6204238 -6207362 -6186085 -6196982 -6159241 -6135345
18318 -6135345 -6139055 -6193709 -6178547 -6104286 -6115699 -6122469 -6163941 -6147856 -6034654 -6006897 -6035628
18307 -6035628 -6047432 -6073541 -6047486 -6014647 -5988105 -6000834 -6052272 -6028633 -5965188 -5957212 -6017997
18296 -6017997 -5995541 -5888639 -5790511 -5726410 -5731689 -5842008 -5872211 -5741917 -5680907 -5754898 -5840691
$$ packed form
18374g426683r561O5289L4780L6928J25064q705m4501M3708l2050l5681P7968
18363g173444k3340l7202J02725l2109Q2636M6185n9916L8660P1540O5255L9828
18352f879182K4658k7325K6857M596j2265R5631k371l5473n9875k4482J19038
18341f770193R3796L5886j5837J2096K2347M5004l4595J2250O5917l2977L4398
18330f531908P7245P4815R3404k196J3263N7179J3960l124K1277j0897L7741K3896
18318f135345l710n4654J5162P4261j1413o770m1472J6085J13202K7757k8731
18307f035628j1804k6109K6055L2839K6542j2729n1438K3639O3445P976o0785
18296f017997K2456J06902R8128O4101n279j10319l0203J30294O1010p3991q5793
$$ plain form
18285 -5840691 -5866914 -5796015 -5699188 -5618817 -5684730 -5681850 -5661998 -5585638 -5485992 -5463065 -5473722
18274 -5473722 -5499729 -5506705 -5474065 -5491790 -5429806 -5397301 -5430697 -5375764 -5337603 -5342353 -5435125 -5442323
18262 -5442323 -5361602 -5255679 -5276639 -5253107 -5223550 -5169480 -5088183 -5056353 -5141831 -5203950 -5306741
18251 -5306741 -5330866 -5277659 -5176502 -5174779 -5166932 -5173083 -5200136 -5274241 -5229328 -5148246 -5155967 -5096098
18239 -5096098 -5030588 -4975362 -4949357 -4919329 -4980383 -4964207 -4895056 -4840399 -4828669 -4868876 -4901808
18228 -4901808 -4926145 -4906050 -4871723 -4870326 -4897766 -4892313 -4878704 -4902901 -4904993 -4929259 -4917701 -4862293
18216 -4862293 -4869005 -4887885 -4787146 -4769535 -4759034 -4732038 -4694319 -4666527 -4654489 -4663749 -4666308 -4824674
18204 -4824674 -4875670 -4787186 -4693425 -4651057 -4648510 -4562873 -4533970 -4470126 -4437288 -4394128 -4422937
$$ packed form
18285e840691k6223P0899R6827Q0371o5913K880J9852P6360R9646K2927j0657
18274e473722k6007o976L2640j7725O1984L2505l3396N4933L8161m750r2772p198
18262e442323Q0721J05923k0960K3532K9557N4070Q1297L1830q5478o2119j02791
18251e306741k4125N3207J01157J723P847o151k7053p4105M4913Q1082p721N9869
18239e096098O5510N5226K6005L0028o1054J6176O9151N4657J1730m0207l2932
18228d901808k4337K0095L4327J397k7440N453J3609k4197k092k4266J1558N5408
18216d862293o712j8880J00739J7611J0501K6996L7719K7792J2038r260k559j58366
18204d824674n0996Q8484R3761M2368K547Q5637K8903O3844L2838M3160k8809
$$ plain form
18193 -4422937 -4406617 -4394817 -4390971 -4461463 -4505823 -4519609 -4517773 -4438471 -4366660 -4467254 -4447935
18182 -4447935 -4409467 -4359450 -4331526 -4343884 -4316162 -4349724 -4368545 -4328414 -4369110 -4344968 -4304959
18171 -4304959 -4216904 -4131132 -4086101 -4125039 -4172481 -4066638 -4044802 -4049920 -4007409 -4070599 -4147906
18160 -4147906 -4191527 -4189184 -4164130 -4174384 -4225075 -4278001 -4270900 -4368362 -4341527 -4309587 -4371691 -4293781
18148 -4293781 -4247040 -4342591 -4402807 -4448201 -4349563 -4325634 -4379123 -4386054 -4310756 -4282328 -4248281
18137 -4248281 -4192285 -4110842 -4084936 -4146492 -4207601 -4271517 -4270036 -4235654 -4104240 -4002509 -3936931
18126 -3936931 -3914239 -3853471 -3815457 -3814002 -3862916 -3859527 -3838655 -3827205 -3842874 -3846961 -3815925 -3698248
18114 -3698248 -3687230 -3741010 -3776694 -3816719 -3913047 -3990417 -4020664 -4088894 -4152820 -4098352 -4019997
$$ packed form
18193d422937J6320J1800L846p0492m4360j3786J836P9302P1811j00594J9319
18182d447935L8468N0017K7924j2358K7722l3562j8821M0131m0696K4142M0009
18171d304959Q8055Q5772M5031l8938m7442J05843K1836n118M2511o3190p7307
18160d147906m3621K343K5054j0254n0691n2926P101r7462K6835L1940o2104P7910
18148d293781M6741r5551o0216m5394R8638K3929n3489o931P5298K8428L4047
18137d248281N5996Q1443K5906o1556o1109o3916J481L4382J31414J01731O5578
18126c936931K2692O0768L8014J455m8914L389K0872J1450j5669m087L1036J17677
18114c698248J1018n3780l5684m0025r6328p7370l0247o8230o3926N4468P8355
$$ plain form
18103 -4019997 -4029224 -4033832 -4031607 -3997332 -4053851 -4167376 -4145482 -4072585 -3984782 -4052629 -4157201
18092 -4157201 -4185192 -4118598 -4107921 -4068717 -4050089 -4134703 -4056266 -3956812 -3972661 -3916893 -3834160
18081 -3834160 -3837869 -3831251 -3876266 -3884944 -3813914 -3820226 -3821274 -3809423 -3820626 -3845288 -3868592 -3816930
18069 -3816930 -3698851 -3634201 -3635402 -3654291 -3663613 -3678838 -3666334 -3711788 -3699157 -3665067 -3671592 -3657475
18057 -3657475 -3563620 -3559331 -3597368 -3658389 -3766214 -3850708 -3876681 -3932697 -3886168 -3903387 -3871361
18046 -3871361 -3825748 -3852527 -3877641 -3746005 -3739657 -3695068 -3599043 -3687467 -3714648 -3741280 -3811731
18035 -3811731 -3762424 -3673965 -3712368 -3702968 -3649870 -3617708 -3559225 -3543104 -3573211 -3608137 -3642225
18024 -3642225 -3610099 -3581980 -3505800 -3448703 -3446923 -3459118 -3438493 -3496725 -3566358 -3507479 -3503329 -3458413
$$ packed form
18103d019997r227m608K225L4275n6519j13525K1894P2897Q7803o7847j04572
18092d157201k7991O6594J0677L9204J8628q4614P8437R9454j5849N5768Q2733
18081c834160l709O618m5015q678P1030o312j048J1851j1203k4662k3304N1662
18069c816930J18079O4650j201j8889r322j5225J2504m5454J2631L4090o525J4117
18057c657475R3855M289l8037o1021j07825q4494k5973n6016M6529j7219L2026
18046c871361M5613k6779k5114J31636O348M4589R6025q8424k7181k6632p0451
18035c811731M9307Q8459l8403R400N3098L2162N8483J6121l0107l4926l4088
18024c642225L2126K8119P6180N7097J780j2195K0625n8232o9633N8879M150M4916
$$ plain form
18012 -3458413 -3428288 -3449642 -3440833 -3470306 -3472578 -3547889 -3546402 -3408888 -3371073 -3417970 -3460697 -3445386
18000 -3445386 -3358731 -3346909 -3325828 -3285201 -3290037 -3276361 -3185511 -3159543 -3198516 -3292557 -3344207
17989 -3344207 -3369837 -3410043 -3402026 -3267693 -3201260 -3269658 -3321265 -3326425 -3346132 -3260002 -3245161
17978 -3245161 -3326171 -3334090 -3308265 -3219664 -3114262 -3236260 -3314825 -3306723 -3336848 -3389653 -3372700
17967 -3372700 -3279933 -3187099 -3214523 -3131172 -3221954 -3285281 -3227336 -3164711 -3186764 -3246449 -3336434
17956 -3336434 -3318438 -3293332 -3202325 -3116279 -3041027 -3094632 -3162595 -3183048 -3122969 -3158645 -3101814
17945 -3101814 -3101171 -3087264 -3070498 -3171709 -3228598 -3239653 -3232080 -3208553 -3126740 -3038171 -3002339 -3117516
17933 -3117516 -3134681 -3089253 -3092150 -3005007 -3009987 -3073734 -3135983 -3127777 -3095976 -3162860 -3171793 -3216116
$$ packed form
18012c458413L0125k1354Q809k9473k272p5311J487J37514L7815m6897m2727J5311
18000c445386Q6655J1822K1081M0627m836J3676R0850K5968l8973r4041n1650
17989c344207k5630m0206Q017J34333O6433o8398n1607n160j9707Q6130J4841
17978c245161q1010p919K5825Q8601J05402j21998p8565Q102l0125n2805J6953
17967c372700R2767R2834k7424Q3351r0782o3327N7945O2625k2053n9685q9985
17956c336434J7996K5106R1007Q6046P5252n3605o7963k0453O0079l5676N6831
17945c101814O43J3907J6766j01211n6889j1055P573K3527Q1813Q8569L5832j15177
17933c117516j7165M5428k897Q7143m980o3747o2249Q206L1801o6884q933m4323
$$ plain form
17921 -3216116 -3200009 -3161852 -3088231 -2959435 -2946348 -3052079 -3141788 -3121582 -3084293 -3037604 -3076796
17910 -3076796 -3164740 -3135473 -3069144 -2988968 -3043218 -3075310 -3058830 -2979668 -2852526 -2811805 -2795024
17899 -2795024 -2808980 -2843670 -2821347 -2859428 -2937486 -2900428 -2840619 -2831737 -2869872 -2746949 -2683184
17888 -2683184 -2767298 -2797479 -2813301 -2860195 -2852357 -2788213 -2830424 -2870202 -2851634 -2828195 -2757879
17877 -2757879 -2698440 -2736440 -2746063 -2738123 -2798475 -2878384 -2906027 -2869634 -2808680 -2788244 -2835713 -2937210
17865 -2937210 -2911610 -2929070 -3013382 -3017898 -2924080 -2857326 -2893804 -2894624 -2879709 -2805267 -2716601 -2743076
17853 -2743076 -2734652 -2784244 -2848934 -2868036 -2788607 -2756810 -2833451 -2850997 -2824902 -2764521 -2764981 -2754839
17841 -2754839 -2759488 -2766265 -2788125 -2766900 -2792524 -2899530 -2968268 -2839859 -2708039 -2684709 -2629740
$$ packed form
17921c216116J6107L8157P3621J28796J3087j05731q9709K0206L7289M6689l9192
17910c076796q7944K9267O6329Q0176n4250l2092J6480P9162J27142M0721J6781
17899b795024j3956l4690K2323l8081p8058L7058N9809Q882l8135J22923O3765
17888b683184q4114l0181j5822m6894P838O4144m2211l9778J8568K3439P0316
17877b757879N9439l8000r623P940o0352p9909k7643L6393O0954K0436m7469j01497
17865b937210K5600j7460q4312m516R3818O6754l6478q20J4915P4442Q8666k6475
17853b743076Q424m9592o4690j9102P9429L1797p6641j7546K6095O0381m60J0142
17841b754839m649o777k1860K1225k5624j07006o8738J28409J31820K3330N4969
$$ plain form
17830 -2629740 -2616383 -2599643 -2521417 -2549245 -2598900 -2633682 -2718102 -2711812 -2738017 -2697887 -2614569
17819 -2614569 -2540172 -2564104 -2604804 -2703342 -2696358 -2688335 -2684186 -2700699 -2747570 -2750390 -2806108 -2803688
17807 -2803688 -2700838 -2651894 -2616188 -2572251 -2600359 -2676914 -2677181 -2637975 -2556570 -2488972 -2489422 -2524770
17795 -2524770 -2464326 -2462260 -2499509 -2526959 -2530509 -2679530 -2726556 -2729080 -2686579 -2688175 -2663769 -2571981
17783 -2571981 -2519811 -2402364 -2361244 -2389027 -2460634 -2439052 -2417535 -2401893 -2451445 -2511872 -2506525
17772 -2506525 -2546810 -2484782 -2498436 -2445449 -2432602 -2442174 -2458227 -2401666 -2369570 -2411380 -2511965
17761 -2511965 -2506921 -2440940 -2451758 -2484254 -2493942 -2522971 -2520823 -2553083 -2552496 -2519833 -2477476 -2434152
17749 -2434152 -2368530 -2373902 -2467642 -2450435 -2341823 -2319812 -2379449 -2471020 -2444448 -2380019 -2417387
$$ packed form
17830b629740J3357J6740P8226k7828m9655l4782q4420O290k6205M0130Q3318
17819b614569P4397k3932m0700r8538O984Q023M149j6513m6871k820n5718K420
17807b803688J02850M8944L5706M3937k8108p6555k67L9206Q1405O7598m50l5348
17795b524770O0444K066l7249k7450l550j49021m7026k524M2501j596K4406R1788
17783b571981N2170J17447M1120k7783p1607K1582K1517J5642m9552o0427N347
17772b506525m0285O2028j3654N2987J2847r572j6053N6561L2096m1810j00585
17761b511965N044O5981j0818l2496r688k9029K148l2260N87L2663M2357M3324
17749b434152O5622n372r3740J7207J08612K2011n9637r1571K6572O4429l7368
$$ plain form
17738 -2417387 -2514039 -2535413 -2572669 -2469287 -2439919 -2441476 -2347072 -2313671 -2284521 -2230412 -2139562
17727 -2139562 -2179939 -2253170 -2290542 -2349003 -2389394 -2365833 -2375579 -2473980 -2524088 -2520353 -2485839 -2471409
17715 -2471409 -2538920 -2512729 -2511682 -2490687 -2426413 -2352327 -2341855 -2343881 -2350965 -2260536 -2248310 -2244108
17703 -2244108 -2315810 -2302116 -2310478 -2321114 -2286152 -2274267 -2278847 -2257555 -2258210 -2182745 -2211996 -2221740
17691 -2221740 -2160366 -2209805 -2243041 -2261955 -2214698 -2252358 -2254492 -2289169 -2283592 -2236522 -2224376 -2203534
17679 -2203534 -2207928 -2271619 -2283724 -2271278 -2183216 -2211579 -2156494 -2082795 -2133320 -2210650 -2181104
17668 -2181104 -2138970 -2101097 -2060226 -2180422 -2192117 -2144703 -2170572 -2243207 -2203568 -2171025 -2224217
17657 -2224217 -2306785 -2262811 -2111844 -1998961 -2075635 -2172299 -2199694 -2200417 -2145374 -2118778 -2145205
$$ packed form
17738b417387r6652k1374l7256J03382K9368j557R4404L3401K9150N4109R0850
17727b139562m0377p3231l7372n8461m0391K3561r746r8401n0108L735L4514J4430
17715b471409o7511K6191J047K0995O4274P4086J0472k026p084R0429J2226M202
17703b244108p1702J3694q362j0636L4962J1885m580K1292o55P5465k9251r744
17691b221740O1374m9439l3236j8914M7257l7660k134l4677N577M7070J2146K0842
17679b203534m394o3691j2105J2446Q8062k8363N5085P3699n0525p7330K9546
17668b181104M2134L7873M0871j20196j1695M7414k5869p2635L9639L2543n3192
17657b224217q2568M3974J50967J12883p6674r6664k7395p23N5043K6596k6427
$$ plain form
17646 -2145205 -2155684 -2210249 -2293526 -2279708 -2183327 -2184835 -2248448 -2248945 -2158382 -2078528 -2121956 -2155257
17634 -2155257 -2260738 -2311747 -2263509 -2213683 -2182663 -2089962 -2011865 -2120097 -2229854 -2177248 -2135644
17623 -2135644 -2128591 -2104429 -2058597 -2153963 -2109643 -2096403 -2149966 -2088211 -2027024 -2089454 -2100919
17612 -2100919 -2097908 -2070746 -2105046 -2042801 -2000470 -1949756 -1937940 -1985457 -2096620 -2140822 -2088393
17601 -2088393 -2035048 -2071436 -2118561 -2141678 -2206240 -2178487 -2190558 -2256927 -2256809 -2208800 -2291638 -2305978
17589 -2305978 -2186618 -2078319 -2049355 -2016312 -2014631 -2116958 -2181847 -2207489 -2181133 -2157064 -2136840
17578 -2136840 -2019910 -1997699 -2118362 -2144329 -2117019 -2105143 -2072054 -2052777 -2051104 -2047087 -2105257
17567 -2105257 -2170865 -2185108 -2161904 -2140826 -2122779 -2084385 -2070320 -2108220 -2122719 -2134849 -2072716
$$ packed form
17646b145205j0479n4565q3277J3818R6381j508o3613m97R0563P9854m3428l3301
17634b155257j05481n1009M8238M9826L1020R2701P8097j08232j09757N2606M1604
17623b135644P053K4162M5832r5366M4320J3240n3563O1755O1187o2430j1465
17612b100919L011K7162l4300O2245M2331N0714J1816m7517j11163m4202N2429
17601b088393N3345l6388m7125k3117o4562K7753j2071o6369J18M8009q2838j4340
17589b305978J19360J08299K8964L3043J681j02327o4889k5642K6356K4069K0224
17578b136840J16930K2211j20663k5967K7310J1876L3089J9277J673M017n8170
17567b105257o5608j4243K3204K1078J8047L8394J4065l7900j4499j2130O2133
$$ plain form
17556 -2072716 -2065876 -2057294 -2085101 -2031780 -1961118 -1961194 -1931242 -1989806 -2136526 -2174377 -2078782 -2062426
17544 -2062426 -2094758 -2104841 -2133842 -2123632 -2080091 -1989028 -1998494 -2029840 -2065891 -2022297 -1935362
17533 -1935362 -1858445 -1858191 -1923866 -1970556 -1995588 -1993015 -2068065 -2091036 -2119720 -2097187 -2014786 -1985480
17521 -1985480 -2009737 -2070559 -2032659 -1971739 -1930036 -1967539 -2012561 -2001175 -1938476 -1941452 -1939536 -1966479
17509 -1966479 -1998118 -1981632 -1961918 -1977311 -1915690 -1992142 -2046360 -2056216 -1977490 -1913366 -1946054
17498 -1946054 -1935485 -1876853 -1821866 -1811552 -1864901 -1907842 -1969671 -1976830 -1933560 -2013941 -2036941
17487 -2036941 -2024463 -2027968 -2060078 -1952273 -1871056 -1914130 -1949308 -1894066 -1900108 -1928182 -1944168
17476 -1944168 -1951005 -1988763 -1976022 -1956578 -1954592 -1961577 -1902550 -1952823 -1932949 -1940961 -1924051 -1850951
$$ packed form
17556b072716O840Q582k7807N3321P0662p6K9952n8564j46720l7851R5595J6356
17544b062426l2332j0083k9001J0210M3541R1063r466l1346l6051M3594Q6935
17533a935362P6917K54o5675m6690k5032K573p5050k2971k8684K2533Q2401K9306
17521a985480k4257o0822L7900O0920M1703l7503m5022J1386O2699k976J916k6943
17509a966479l1639J6486J9714j5393O1621p6452n4218r856P8726O4124l2688
17498a946054J0569N8632N4987J0314n3349m2941o1829p159M3270q0381k3000
17487b036941J2478l505l2110J07805Q1217m3074l5178N5242o042k8074j5986
17476a944168o837l7758J2741J9444J986o985N9027n0273J9874q012J6910P3100
$$ plain form
17464 -1850951 -1835238 -1835629 -1914914 -1909378 -1900764 -1898846 -1883574 -1786752 -1806900 -1896595 -1957254 -1914564
17452 -1914564 -1918312 -1994113 -1959907 -1854463 -1822600 -1711460 -1724260 -1812921 -1872957 -1800783 -1694416
17441 -1694416 -1699258 -1813501 -1909794 -1932110 -1874757 -1802510 -1751202 -1731482 -1724225 -1706149 -1673959
17430 -1673959 -1612173 -1631077 -1710930 -1819576 -1897306 -1819861 -1778956 -1848808 -1839228 -1847532 -1857514 -1817255
17418 -1817255 -1692596 -1615596 -1613319 -1610115 -1614521 -1588105 -1589073 -1613385 -1680163 -1693765 -1699412 -1795906
17406 -1795906 -1837834 -1798716 -1733785 -1864642 -1929152 -1847633 -1725451 -1674863 -1739765 -1840109 -1923943
17395 -1923943 -1890580 -1843135 -1832668 -1854600 -1903058 -1842638 -1784860 -1710931 -1647547 -1645426 -1641057 -1549069
17383 -1549069 -1535871 -1606902 -1594867 -1621216 -1691504 -1723580 -1703955 -1715973 -1745896 -1736477 -1686931
$$ packed form
17464a850951J5713l91p9285N536Q614J918J5272R6822k0148q9695o0659M2690
17452a914564l748p5801L4206J05444L1863J11140j2800q8661o0036P2174J06367
17441a694416m842j14243r6293k2316N7353P2247N1308J9720P257J8076L2190
17430a673959O1786j8904p9853j08646p7730P7445M0905o9852R580q304r982M0259
17418a817255J24659P7000K277L204m406K6416r68k4312o6778j3602n647r6494
17406a795906m1928L9118O4931j30857o4510Q1519J22182N0588o4902j00344q3834
17395a923943L3363M7445J0467k1932m8458O0420N7778P3929O3384K121M369R1988
17383a549069J3198p1031J2035k6349p0288l2076J9625j2018k9923R419M9546
$$ plain form
17372 -1686931 -1671410 -1734323 -1744268 -1667706 -1701125 -1730003 -1731607 -1712848 -1677097 -1619809 -1625257 -1652820
17360 -1652820 -1668749 -1705410 -1765350 -1828283 -1804827 -1795665 -1711946 -1593881 -1537088 -1544009 -1573874
17349 -1573874 -1725815 -1708285 -1626121 -1669591 -1718665 -1733285 -1707512 -1700780 -1741959 -1718697 -1694541
17338 -1694541 -1616420 -1633419 -1625823 -1747768 -1710264 -1615287 -1715225 -1672937 -1541580 -1579691 -1618341
17327 -1618341 -1666518 -1697362 -1698045 -1737767 -1779030 -1816327 -1769689 -1767592 -1730332 -1686809 -1666397 -1718963
17315 -1718963 -1710837 -1743733 -1765206 -1741990 -1700008 -1663966 -1632995 -1710613 -1732321 -1690995 -1609884
17304 -1609884 -1620972 -1700515 -1725909 -1668419 -1684161 -1623073 -1585178 -1577996 -1595028 -1599667 -1613086 -1649766
17292 -1649766 -1709182 -1701282 -1666992 -1714615 -1681627 -1624757 -1600133 -1574952 -1537503 -1585668 -1645565
$$ packed form
17372a686931J5521o2913r945P6562l3419k8878j604J8759L5751N7288n448k7563
17360a652820j5929l6661n9940o2933K3456R162Q3719J18065N6793o921k9865
17349a573874j51941J7530Q2164m3470m9074j4620K5773O732m1179K3262K4156
17338a694541P8121j6999P596j21945L7504R4977r9938M2288J31357l8111l8650
17327a618341m8177l0844o83l9722m1263l7297M6638K097L7260M3523K0412n2566
17315a718963Q126l2896k1473K3216M1982L6042L0971p7618k1708M1326Q1111
17304a609884j1088p9543k5394N7490j5742O1088L7895P182j7032m639j3419l6680
17292a649766n9416P900L4290m7623L2988N6870K4624K5181L7449m8165n9897
$$ plain form
17281 -1645565 -1604984 -1529448 -1496509 -1565582 -1660937 -1642327 -1555324 -1564348 -1562390 -1602643 -1618037 -1605486
17269 -1605486 -1544691 -1529685 -1542452 -1580308 -1514503 -1543741 -1535736 -1593533 -1595713 -1600833 -1621466 -1606934
17257 -1606934 -1594809 -1643050 -1601968 -1602516 -1577225 -1515333 -1425043 -1458537 -1519889 -1510483 -1538753 -1590153
17245 -1590153 -1630230 -1631035 -1575863 -1553219 -1561084 -1612877 -1653740 -1565108 -1558577 -1534109 -1434589 -1382035
17233 -1382035 -1388915 -1446546 -1407594 -1413009 -1430639 -1368744 -1458538 -1489960 -1561988 -1565995 -1534783 -1469897
17221 -1469897 -1457405 -1479852 -1529030 -1619529 -1666831 -1597264 -1579217 -1603025 -1647433 -1674566 -1660437
17210 -1660437 -1485056 -1337096 -1435551 -1415987 -1372547 -1297488 -1307544 -1375763 -1403988 -1348661 -1332161
17199 -1332161 -1407620 -1453435 -1421985 -1354058 -1423208 -1523691 -1477267 -1387288 -1424523 -1495937 -1465317
$$ packed form
17281a645565M0581P5536L2939o9073r5355J8610Q7003r024J958m0253j5394J2551
17269a605486O0795J5006j2767l7856O5805k9238Q005n7797k180n120k0633J4532
17257a606934J2125m8241M1082n48K5291O1892R0290l3494o1352R406k8270n1400
17245a590153m0077q05N5172K2644p865n1793m0863Q8632O531K4468R9520N2554
17233a382035o880n7631L8952n415j7630O1895q9794l1422p2028m007L1212O4886
17221a469897J2492k2447m9178r0499m7302O9567J8047k3808m4408k7133J4129
17210a660437J75381J47960r8455J9564M3440P5059j0056o8219k8225N5327J6500
17199a332161p5459m5815L1450O7927o9150j00483M6424Q9979l7235p1414L0620
$$ plain form
17188 -1465317 -1487339 -1511564 -1556578 -1488141 -1440701 -1399869 -1371321 -1392608 -1384118 -1397851 -1367916
17177 -1367916 -1317991 -1259689 -1309566 -1357453 -1406054 -1401731 -1297764 -1303868 -1376019 -1374932 -1316700 -1389011
17165 -1389011 -1472507 -1563214 -1508584 -1413602 -1364738 -1409435 -1466883 -1439938 -1453986 -1433580 -1382988
17154 -1382988 -1300670 -1386258 -1385892 -1399764 -1396152 -1413900 -1458284 -1527905 -1464396 -1371768 -1323248 -1304503
17142 -1304503 -1338957 -1364592 -1436734 -1496228 -1558972 -1611052 -1565681 -1506226 -1409295 -1321345 -1341791
17131 -1341791 -1371571 -1436732 -1444678 -1470143 -1463035 -1485051 -1469325 -1443275 -1399196 -1272235 -1178611
17120 -1178611 -1149823 -1242555 -1371453 -1467508 -1505621 -1519404 -1494456 -1413905 -1419115 -1381517 -1411203
17109 -1411203 -1450592 -1462927 -1463081 -1375055 -1327728 -1382151 -1324449 -1386243 -1389141 -1403625 -1289789 -1266724
$$ packed form
17188a465317k2022k4225m5014O8437M7440M0832K8548k1287Q490j3733K9935
17177a367916M9925N8302m9877m7887m8601M323J03967o104p2151J087N8232p2311
17165a389011q3496r0707N4630R4982M8864m4697n7448K6945j4048K0406N0592
17154a382988Q2318q5588L66j3872L612j7748m4384o9621O3509R2628M8520J8745
17142a304503l4454k5635p2142n9494o2744n2080M5371N9455R6931Q7950k0446
17131a341791k9780o5161p946k5465P108k2016J5726K6050M4079J26961R3624
17120a178611K8788r2732j28898r6055l8113j3783K4948Q0551n210L7598k9686
17109a411203l9389j2335j54Q8026M7327n4423N7702o1794k898j4484J13836K3065
$$ plain form
17097 -1266724 -1307945 -1329935 -1280287 -1303477 -1358201 -1388048 -1337802 -1276949 -1318080 -1409176 -1449545
17086 -1449545 -1404282 -1455801 -1430192 -1316306 -1260221 -1237250 -1269798 -1311746 -1311520 -1295045 -1333127
17075 -1333127 -1373564 -1252269 -1209081 -1224047 -1225384 -1241817 -1284728 -1245574 -1232246 -1284086 -1307234
17064 -1307234 -1398336 -1464565 -1432896 -1350092 -1285198 -1345048 -1465653 -1453518 -1508385 -1509500 -1511720
17053 -1511720 -1453410 -1396630 -1305195 -1309230 -1351951 -1349085 -1339547 -1229161 -1242981 -1337117 -1262226 -1227237
17041 -1227237 -1295158 -1309024 -1334585 -1448492 -1411665 -1331949 -1245589 -1173504 -1173660 -1193996 -1165969
17030 -1165969 -1157269 -1275320 -1422798 -1355301 -1320715 -1188255 -1162978 -1192515 -1174327 -1205267 -1287805
17019 -1287805 -1312712 -1283624 -1241263 -1285683 -1393899 -1323308 -1400785 -1389056 -1380944 -1373505 -1396286
$$ packed form
17097a266724m1221k1990M9648k3190n4724k9847N0246O0853m1131r1096m0369
17086a449545M5263n1519K5609J13886N6085K2971l2548m1948K26J6475l8082
17075a333127m0437J21295M3188j4966j337j6433m2911L9154J3328n1840k3148
17064a307234r1102o6229L1669Q2804O4894n9850j20605J2135n4867j115k220
17053a511720N8310N6780R1435m035m2721K866R538J10386j3820r4136P4891L4989
17041a227237o7921j3866k5561j13907L6827P9716Q6360P2085j56k0336K8027
17030a165969Q700j18051j47478O7497L4586J32460K5277k9537J8188l0940q2538
17019a287805k4907K9088M2361m4420j08216P0591p7477J1729Q112P439k2781
$$ plain form
17008 -1396286 -1368561 -1332777 -1365739 -1387447 -1347139 -1373959 -1406272 -1343335 -1265378 -1263426 -1204854
16997 -1204854 -1171257 -1127233 -1169135 -1266421 -1334911 -1240078 -1184191 -1208109 -1176994 -1183279 -1204586
16986 -1204586 -1226484 -1306776 -1382725 -1303607 -1210359 -1206567 -1174840 -1250387 -1334419 -1330220 -1348183 -1342758
16974 -1342758 -1285973 -1248288 -1245403 -1258369 -1205473 -1195166 -1218339 -1257229 -1243038 -1244190 -1276329 -1269849
16962 -1269849 -1181134 -1189885 -1206310 -1190907 -1178136 -1224443 -1252269 -1261175 -1117794 -1078805 -1156911
16951 -1156911 -1155105 -1125019 -1114913 -1149423 -1240218 -1266732 -1264953 -1192174 -1155129 -1195481 -1197633 -1194647
16939 -1194647 -1168156 -1163227 -1128228 -1213271 -1191724 -1049086 -1010565 -1018611 -1076506 -1116410 -1083860
16928 -1083860 -1152562 -1127861 -1061776 -1017606 -1077768 -1173752 -1227577 -1145276 -1143765 -1156881 -1116676
$$ packed form
17008a396286K7725L5784l2962k1708M0308k6820l2313O2937P7957J952N8572
16997a204854L3597M4024m1902r7286o8490R4833N5887k3918L1115o285k1307
16986a204586k1898q0292p5949P9118R3248L792L1727p5547q4032M199j7963N425
16974a342758N6785L7685K885j2966N2896J0307k3173l8890J4191j152l2139O480
16962a269849Q8715q751j6425J5403J2771m6307k7826q906J43381L8989p8106
16951a156911J806L0086J0106l4510r0795k6514J779P2779L7045m0352k152K986
16939a194647K6491M929L4999q5043K1547J42638L8521q046n7895l9904L2550
16928a083860o8702K4701O6085M4170o0162r5984n3825Q2301J511j3116M0205
$$ plain form
16917 -1116676 -1022995 -1043983 -1162522 -1238832 -1219460 -1256182 -1199999 -1226811 -1211018 -1141077 -1085481
16906 -1085481 -1088045 -1101453 -1093068 -1099358 -1140525 -1211836 -1211931 -1144759 -1112259 -1189230 -1227793 -1169373
16894 -1169373 -1062198 -1036040 -1097166 -1065004 -1061724 -1130957 -1139571 -1165501 -1227221 -1248265 -1275004
16883 -1275004 -1249147 -1221472 -1181908 -1167594 -1184015 -1181646 -1148264 -1140191 -1140111 -1166661 -1236790 -1233301
16871 -1233301 -1189264 -1184881 -1192667 -1301168 -1344517 -1297151 -1228217 -1159303 -1120459 -1107089 -1201089
16860 -1201089 -1183766 -1260880 -1281593 -1248750 -1153419 -1142809 -1119876 -1114218 -1050456 -1077781 -1128111
16849 -1128111 -1144876 -1136973 -1061709 -1043769 -1113685 -1199345 -1305064 -1300194 -1256280 -1221581 -1136519
16838 -1136519 -1102281 -1186717 -1257757 -1264077 -1198334 -1143084 -1184792 -1249011 -1282681 -1188432 -1250409
$$ packed form
16917a116676R3681k0988j18539p6310J9372l6722N6183k6812J5793O9941N5596
16906a085481k564j3408Q385o290m1167p1311r5O7172L2500p6971l8563N8420
16894a169373J07175K6158o1126L2162L280o9233q614k5930o1720k1044k6739
16883a275004K5857K7675L9564J4314j6421K369L3382Q073Q0k6550p0129L489
16871a233301M4037M383p786j08501m3349M7366O8934O8914L8844J3370r4000
16860a201089J7323p7114k0713L2843R5331J0610K2933N658O3762k7325n0330
16849a128111j6765P903P5264J7940o9916q5660j05719M870M3914L4699Q5062
16838a136519L4238q4436p1040o320O5743N5250m1708o4219l3670R4249o1977
$$ plain form
16827 -1250409 -1344723 -1303073 -1308646 -1314454 -1289637 -1188490 -1123982 -1117471 -1167732 -1128774 -1119228 -1110224
16815 -1110224 -1096394 -1106094 -1046781 -1009423 -1070061 -1099558 -1099428 -1070080 -1118951 -1196298 -1193985 -1257062
16803 -1257062 -1251705 -1214926 -1144056 -1164028 -1235917 -1224434 -1245742 -1207991 -1115001 -1017067 -942182
16792 -942182 -916330 -966412 -1084779 -1145358 -1125068 -1094816 -1119917 -1136900 -1052024 -1012375 -1032701
16781 -1032701 -1109070 -1128331 -1223823 -1196533 -1049968 -1019990 -1047688 -1072672 -1144003 -1099495 -1074622
16770 -1074622 -1066925 -1072871 -1039223 -992302 -1064522 -1078760 -1074459 -1031752 -1070874 -1072277 -1098069 -1105091
16758 -1105091 -1120935 -1087107 -1110789 -1141404 -1090368 -1109845 -1144543 -1121217 -1109499 -1144410 -1112734
16747 -1112734 -1111899 -1054259 -1069088 -1164049 -1160644 -1140016 -1159037 -1052083 -939489 -970692 -1071276
$$ packed form
16827a250409r4314M1650n573n808K4817J01147O4508O511n0261L8958R546R004
16815a110224J3830r700N9313L7358o0638k9497J30K9348m8871p7347K313o3077
16803a257062N357L6779P0870j9972p1889J1483k1308L7751R2990R7934P4885
16792i42182K5852n0082j18367o0579K0290L0252k5101j6983Q4876L9649k0326
16781a032701p6369j9261r5492K7290J46565K9978k7698k4984p1331M4508K4873
16770a074622P697n946L3648M6921p2220j4238M301M2707l9122j403k5792p022
16758a105091j5844L3828k3682l0615N1036j9477l4698K3326J1718l4911L1676
16747a112734Q35N7640j4829r4961L405K0628j9021J06954J12594l1203j00584
$$ plain form
16736 -1071276 -1097215 -987768 -917446 -1038681 -1146826 -1233922 -1218481 -1221243 -1146220 -1073773 -975185
16725 -975185 -911873 -909349 -988414 -973125 -963632 -988353 -946783 -956752 -1028732 -1143232 -1166155 -1076136
16713 -1076136 -978487 -915635 -911339 -890080 -951278 -955070 -1054162 -1226276 -1251973 -1151444 -1100313
16702 -1100313 -1105135 -1105213 -1105649 -1075171 -1024496 -1051011 -1094593 -1081276 -1056043 -1117645 -1100889 -1067643
16690 -1067643 -1013891 -1006545 -1044399 -1076914 -1050310 -1010109 -1034104 -1016945 -960093 -891238 -860636
16679 -860636 -927766 -1007780 -1081974 -1040847 -1044975 -1057558 -986718 -937865 -919226 -891169 -940398 -1054205
16667 -1054205 -1045094 -1038492 -962486 -949442 -971130 -1016708 -1034421 -980186 -910378 -975787 -1064687 -1138342
16655 -1138342 -1114887 -1062978 -1038135 -991543 -993609 -1024166 -1008455 -1039028 -1073612 -1087555 -1117790
$$ packed form
16736a071276k5939J09447P0322j21235j08145q7096J5441k762P5023P2447R8588
16725i75185O3312K524p9065J5289R493k4721M1570r969p1980j14500k2923R0019
16713a076136R7649O2852M296K1259o1198l792r9092j72114k5697J00529N1131
16702a100313m822p8m36L0478N0675k6515m3582J3317K5233o1602J6756L3246
16690a067643N3752P346l7854l2515K6604M0201k3995J7159N6852O8855L0602
16679h60636o7130q0014p4194M1127m128j2583P0840M8853J8639K8057m9229j13807
16667a054205R111O602P6006J3044k1688m5578j7713N4235O9808o5409q8900p3655
16655a138342K3455N1909K4843M6592k066l0557J5711l0573l4584j3943l0235
$$ plain form
16644 -1117790 -1083599 -999159 -938518 -961839 -918804 -934015 -928026 -901689 -884524 -859648 -857404 -918846
16632 -918846 -957524 -916779 -925087 -947657 -945546 -1012767 -1071179 -1099912 -1098625 -1074646 -1027581 -1024443
16620 -1024443 -1087412 -1084023 -1007106 -969474 -963546 -963907 -984602 -951270 -863341 -830151 -847459 -934658
16608 -934658 -980188 -979797 -1025356 -1115533 -1084957 -944010 -928305 -959639 -955940 -988301 -1054164 -1033296
16596 -1033296 -1015343 -1021519 -942974 -869549 -902501 -914072 -909452 -886841 -856277 -933115 -979143 -1019443
16584 -1019443 -1067477 -1046391 -1010221 -992187 -991839 -994524 -1004885 -959982 -918340 -908642 -918773 -926159
16572 -926159 -913882 -956335 -1030942 -992774 -1003136 -1038062 -1075428 -1046470 -987538 -977695 -966677 -1043426
16560 -1043426 -1095339 -1037170 -1007917 -1004392 -913745 -947389 -998500 -1036369 -1013683 -941796 -854511
$$ packed form
16644a117790L4191Q4440O0641k3321M3035j5211N989K6337J7165K4876K244o1442
16632i18846l8678M0745q308k2570K111o7221n8412k8733J287K3979M7065L138
16620a024443o2969L389P6917L7632N928l61k0695L3332Q7929L3190j7308q7199
16608i34658m5530L91m5559r0177L0576J40947J5705l1334L699l2361o5863K0868
16596a033296J7953o176P8545P3425l2952j1571M620K2611L0564p6838m6028m0300
16584a019443m8034K1086L6170J8034L48k685j0361M4903M1642R698j0131p386
16572i26159J2277m2453p4607L8168j0362l4926l7366K8958N8932R843J1018p6749
16560a043426n1913N8169K9253L525R0647l3644n1111l7869K2686P1887Q7285
$$ plain form
16549 -854511 -832544 -903224 -924640 -946480 -934641 -909864 -849742 -902095 -952442 -874854 -793772
16538 -793772 -874747 -892414 -877562 -899631 -901851 -883520 -913633 -834905 -843247 -880073 -912404 -937416
16526 -937416 -943052 -966516 -872503 -846428 -933464 -962708 -968869 -858868 -831514 -869509 -915017 -906293
16514 -906293 -931144 -938649 -861907 -867943 -895687 -920074 -974478 -949033 -846996 -852133 -829807 -836193
$$ packed form
16549h54511K1967p0680k1416k1840J1839K4777O0122n2353n0347P7588Q1082
16538g93772q0975j7667J4852k2069k220J8331l0113P8728q342l6826l2331k5012
16526i37416n636k3464R4013K6075q7036k9244o161J10001K7354l7995m5508Q724
16514i06293k4851p505P6742o036k7744k4387n4404K5445J02037n137K2326o386
$$ [...]
##END NTUPLES=NMR SPECTRUM
##END=
