##TITLE=Analysis number 328855
Compound Code cc 66302
Book Reference 464/170/1
Project Code adrs
Chemist Name chrisr
##JCAMPDX= 6.0         $$ Bruker NMR JCAMP-DX V2.0
##DATA TYPE= NMR SPECTRUM
##DATA CLASS= NTUPLES
##ORIGIN= Bruker BioSpin GmbH
##OWNER= nmr
$$ XWIN-NMR		Version 3.5
$$ Tue Jul 10 11:32:22 2007 GMT Daylight Time (UT+1h)  MAYBRIDGE\nmr@NMR_250MHZ
##.OBSERVE FREQUENCY= 250.131544655141
##.OBSERVE NUCLEUS= ^1H
##.ACQUISITION MODE= SIMULTANEOUS (DQD)
##.ACQUISITION SCHEME= undefined
##.AVERAGES= 16
##.DIGITISER RES= 18
##SPECTROMETER/DATA SYSTEM= dpx250
##.PULSE SEQUENCE= zg30
##.SOLVENT NAME= CDCl3
##.SHIFT REFERENCE= (INTERNAL, CDCl3, 0, 16.522)
##AUDIT TRAIL= $$ (NUMBER, WHEN, WHO, WHERE, WHAT)
$$ ##TITLE= Audit trail, XWIN-NMR		Version 3.5
$$ ##JCAMPDX= 5.01
$$ ##ORIGIN= Bruker BioSpin GmbH
$$ ##OWNER= nmr
$$ C:\u/data/dgb/nmr/ADRS/720/pdata/1/auditp.txt
$$ ##AUDIT TRAIL=  $$ (NUMBER, WHEN, WHO, WHERE, WHAT)
(   1,<2007-07-10 11:32:00.13 +100>,<MAYBRIDGE\nmr>,<NMR_250MHZ>,
      <created by zg, POWCHK disabled, PULCHK disabled
       configuration hash MD5:
       76 6E 9A 78 1E 09 19 81 EC 84 63 8F B0 6A 59 2D
       data hash MD5: 64K
       D4 62 C4 D9 DD 19 AF E5 D4 EF 70 74 23 9C B8 AD>)
(   2,<2007-07-10 11:32:12.79 +100>,<MAYBRIDGE\nmr>,<NMR_250MHZ>,
      <Start of raw data processing
       ef LB = 0.3 FT_mod = 6 PKNL = 1 SI = 32K 
       data hash MD5: 32K
       06 99 EF 5E 23 D4 B5 54 A5 48 3C F5 7B 06 4F BC>)
(   3,<2007-07-10 11:32:14.40 +100>,<MAYBRIDGE\nmr>,<NMR_250MHZ>,
      <apk 
       data hash MD5: 32K
       E8 6C F3 AA 81 C2 B7 5D 5D 95 E4 30 AF A9 19 C7>)
(   4,<2007-07-10 11:32:15.12 +100>,<MAYBRIDGE\nmr>,<NMR_250MHZ>,
      <abs ABSG = 5 
       data hash MD5: 32K
       83 7B 55 23 5F F2 2A 6C FD 9B 2E F6 54 CD 67 C4>)
$$ ##END=
$$ 
$$ hash MD5
$$ DD 94 56 57 5D EF 13 6F A6 65 98 6F A8 C3 32 FA
##$RELAX= 
##$RELAX= 
##$RELAX= 
##$RELAX= 
##$RELAX= 
##$RELAX= 
##$RELAX= 
$$ Bruker specific parameters
$$ --------------------------
##$DU= <C:\u>
##$EXPNO= 720
##$NAME= <ADRS>
##$PROCNO= 1
##$TYPE= <nmr>
##$USER= <dgb>
##$AMP= (0..31)
100 100 100 100 100 100 100 100 100 100 100 100 100 100 100 100 100 100 
100 100 100 100 100 100 100 100 100 100 100 100 100 100 
##$AQSEQ= 0
##$AQ_mod= 3
##$AUNM= <au_zg>
##$AUTOPOS= <8 >
##$BF1= 250.13
##$BF2= 250.13
##$BF3= 250.13
##$BF4= 250.13
##$BF5= 500.13
##$BF6= 500.13
##$BF7= 500.13
##$BF8= 500.13
##$BYTORDA= 1
##$CFDGTYP= 0
##$CFRGTYP= 5
##$CHEMSTR= <none>
##$CNST= (0..31)
1 1 145 1 1 1 1 1 1 1 1 1 1 1 1 1 1 1 1 1 1 1 1 1 1 1 1 1 1 1 1 1 
##$CPDPRG= <>
##$CPDPRG1= <>
##$CPDPRG2= <>
##$CPDPRG3= <>
##$CPDPRG4= <mlev>
##$CPDPRG5= <mlev>
##$CPDPRG6= <mlev>
##$CPDPRG7= <mlev>
##$CPDPRG8= <mlev>
##$CPDPRGB= <>
##$CPDPRGT= <>
##$D= (0..31)
0 1 0 0 0 0 0 0 0 0.06 0 0 0 0 0 0 0.0002 0 0 0 0 0 0 0 0 0 0 0 0 0 0 
0 
##$DATE= 1184063518
##$DBL= (0..7)
120 120 120 120 120 120 120 120 
##$DBP= (0..7)
150 150 150 150 150 150 150 150 
##$DBP07= 0
##$DBPNAM0= <>
##$DBPNAM1= <>
$$ [...]
##$SUBNAM7= <"">
##$SUBNAM8= <"">
##$SUBNAM9= <"">
##$SW= 20.6930455092707
##$SWIBOX= (0..15)
0 0 3 0 0 0 0 0 0 0 0 0 0 0 0 0 
##$SW_h= 5175.983436853
##$TD= 65536
##$TD0= 1
##$TE= 296.16
##$TE2= 300
##$TE3= 300
##$TEG= 300
##$TL= (0..7)
0 120 120 120 120 120 120 120 
##$TP= (0..7)
150 150 150 150 150 150 150 150 
##$TP07= 0
##$TPNAME0= <>
##$TPNAME1= <>
##$TPNAME2= <>
##$TPNAME3= <>
##$TPNAME4= <>
##$TPNAME5= <>
##$TPNAME6= <>
##$TPNAME7= <>
##$TPOAL= (0..7)
0.5 0.5 0.5 0.5 0.5 0.5 0.5 0.5 
##$TPOFFS= (0..7)
0 0 0 0 0 0 0 0 
##$TUNHIN= 0
##$TUNHOUT= 0
##$TUNXOUT= 0
##$USERA1= <user>
##$USERA2= <user>
##$USERA3= <user>
##$USERA4= <user>
##$USERA5= <user>
##$V9= 5
##$VALIST= <valist>
##$VCLIST= <CCCCCCCCCCCCCCC>
##$VD= 0
##$VDLIST= <DDDDDDDDDDDDDDD>
##$VPLIST= <PPPPPPPPPPPPPPP>
##$VTLIST= <TTTTTTTTTTTTTTT>
##$WBST= 1024
##$WBSW= 4
##$XGAIN= (0..3)
0 0 0 0 
##$XL= 0
##$YL= 0
##$YMAX_a= 363710
##$YMIN_a= -273399
##$ZGOPTNS= <>
##$ZL1= 120
##$ZL2= 120
##$ZL3= 120
##$ZL4= 120
##$ABSF1= 16.522
##$ABSF2= -4.171173
##$ABSG= 5
##$ABSL= 3
##$ALPHA= 0
##$AQORDER= 0
##$ASSFAC= 0
##$ASSFACI= 0
##$ASSFACX= 0
##$ASSWID= 0
##$AUNMP= <proc_1d>
##$AZFE= 0.1
##$AZFW= 0.1
##$BCFW= 0
##$BC_mod= 0
##$BYTORDP= 0
##$COROFFS= 0
##$CY= 12.5
##$DATMOD= 1
##$DC= 0
##$DFILT= <>
##$DTYPP= 0
##$F1P= 14.0000005364418
##$F2P= -0.99999901652339
##$FCOR= 0.5
##$FTSIZE= 32768
##$FT_mod= 6
##$GAMMA= 0
##$GB= 0
##$INTBC= 1
##$INTSCL= 1
##$ISEN= 128
##$LB= 0.3
##$LEV0= 0
##$LPBIN= 0
##$MAXI= 10000
##$MC2= 0
##$MEAN= 0
##$ME_mod= 0
##$MI= 0
##$NCOEF= 0
##$NC_proc= -3
##$NLEV= 6
##$NOISF1= 0
##$NOISF2= 0
##$NSP= 0
##$NTH_PI= 0
##$NZP= 0
##$OFFSET= 16.522
##$PC= 1
##$PHC0= -47.94012
##$PHC1= 16.25471
##$PH_mod= 1
##$PKNL= yes
##$PPARMOD= 0
##$PSCAL= 4
##$PSIGN= 0
##$REVERSE= no
##$SF= 250.13
##$SI= 32768
##$SIGF1= 0
##$SIGF2= 0
##$SINO= 400
##$SIOLD= 32768
##$SREGLST= <1H.CDCl3>
##$SSB= 0
##$STSI= 32768
##$STSR= 0
##$SW_p= 5175.98343685301
##$SYMM= 0
##$S_DEV= 0
##$TDeff= 65536
##$TDoff= 0
##$TI= <Analysis number 999999
Compound Code 99
Book Reference 9
Project Code 9>
##$TILT= no
##$TM1= 0
##$TM2= 0
##$TOPLEV= 0
##$USERP1= <user>
##$USERP2= <user>
##$USERP3= <user>
##$USERP4= <user>
##$USERP5= <user>
##$WDW= 1
##$XDIM= 32768
##$YMAX_p= 351843375
##$YMIN_p= -266026
$$ End of Bruker specific parameters
$$ ---------------------------------
##NTUPLES= NMR SPECTRUM
##VAR_NAME=  FREQUENCY,     SPECTRUM/REAL,   SPECTRUM/IMAG
##SYMBOL=    X,             R,               I
##VAR_TYPE=  INDEPENDENT,   DEPENDENT,       DEPENDENT
##VAR_FORM=  AFFN,          ASDF,            ASDF
##VAR_DIM=   32768,         32768,           32768
##UNITS=     HZ,            ARBITRARY UNITS, ARBITRARY UNITS
##FACTOR=    0.157963299565203, 1,           1
##FIRST=     4132.6476996994, 0,             0
##LAST=      -1043.33573715361, 0,           0
##MIN=       -1043.33573715361, -266026,     0
##MAX=       4132.6476996994, 351843375,     0
$$ Real data points
##PAGE= N=1
##DATA TABLE= (X++(R..R)), XYDATA
$$ [...]
$$ plain form
27431 -39882 -23762 38601 52380 30964 18518 8123 -8950 -32893 -35341 -1173 10811 -40480
27419 -40480 -70130 -43426 3415 14998 16148 5120 35306 25034 -14224 -15467 -20208 -35400
27407 -35400 17398 -36613 -66880 -58916 -16255 -19333 -45211 -2167 -4566 -3221 14913 39999
27395 39999 31913 2726 -2133 -3331 -45877 -3025 47253 55793 -5840 -35125 -16800 21017
27383 21017 24454 49936 50880 22454 28952 28317 5641 -16709 -35450 -32862 -36632 -626 15807
27370 15807 14056 -23387 -48803 -65996 -64619 -73796 -42834 -42581 -56970 -72307 -87058 -78330 -55641
27357 -55641 -6361 28899 28969 31486 44844 7873 57078 44042 42464 39677 22531 54554 88278
27344 88278 53396 32177 16577 52238 98031 109234 60611 39065 65543 69356 43400 -5738
$$ packed form
27431c9882J6120O2363J3779k1416j2446j0395j7073k3943k448L4168J1984n1291
27419d0480k9650K6704M6841J1583J150j1028L0186j0272l9258j243m741j5192
27407c5400N2798n4011l0267P964M2661l078k5878M3044k399J345J8134K5086
27395C9999q086k9187m859j198m2546M2852N0278Q540o1633k9285J8325L7817
27383B1017L437K5482R44k8426O498o35k2676k2350j8741K588l770L6006J6433
27370A5807j751l7443k5416j7193J377r177L0962K53j4389j5337j4751Q728K2689
27357e5641M9280L5260P0K517J3358l6971M9205j3036j578k787j7146L2023L3724
27344H8278l4882k1219j5600L5661M5793J1203m8623k1546K6478L813k5956m9138
$$ plain form
27332 -5738 -15470 -20910 3857 32590 -17182 -36370 -63431 -62813 -23404 -39432 -29854 -9573 8241
27319 8241 2654 7640 -33763 -52316 -61669 -15836 -26693 -9101 22637 42834 38909 34090 -26475
27306 -26475 -42149 -23277 -27629 -16528 6717 46861 43813 32655 26812 38722 95628 78209
27294 78209 46943 14626 31604 24927 33163 65869 81639 69827 22167 -8240 3605 8059
27282 8059 35374 4744 11393 28671 34365 33604 38359 23885 -49495 -83897 -88421 -67899 -20112
27269 -20112 -3715 24071 67207 40638 -6735 -42999 -22073 4454 19263 23234 9256 -1453
27257 -1453 -7416 46222 42525 -267 30798 48498 36876 6234 -12526 -5734 -6153 45071 49747
27244 49747 -3589 6816 -14175 -13639 33907 55222 47279 47778 55154 32558 43265 37143 35374
$$ packed form
27332e738r732n440K4767K8733m9772j9188k7061O18L9409j6028R578K0281J7814
27319H241n587M986m1403j8553r353M5833j0857J7592L1738K0197l925m819o0565
27306b6475j5674J8872m352J1101K3245M0144l048j1158n843J1910N6906j7419
27294G8209l1266l2317J6978o677Q236L2706J5770j1812m7660l0407J1845M454
27282H059K7315l0630O649J7278N694p61M755j4474p3380l4402m524K0522M7787
27269b0112J6397K7786M3136k6569m7373l6264K0926K6527J4809L971j3978j0709
27257a453n963N3638l697m2792L1065J7700j1622l0642j8760O792m19N1224M676
27244D9747n3336J0405k0991N36M7546K1315p943M99P376k2596J0707o122j769
$$ plain form
27231 35374 11085 1444 -4078 -7869 -12035 -9880 -35861 -54150 -67914 -56249 -10647 -5164 -15519
27218 -15519 925 -757 14617 24593 14540 -4599 3660 16642 -1442 -39020 -24599 3626
27206 3626 39693 66546 75640 61761 57053 36537 52112 51160 20679 37202 43957 10718 -15638
27193 -15638 -6812 -21408 -59993 -55693 -28962 -30660 -35862 4482 -7729 -58529 -70567 -38003
27181 -38003 -30465 -17360 8240 -21750 -53554 -39710 -43158 -44494 -19068 19268 -3468 10029
27169 10029 46700 5720 -19658 -41532 -55314 -67269 -81760 -5768 41900 30566 38331 27893
27157 27893 -19090 -24058 -16946 912 16952 -5580 -18476 -28969 9544 8745 -8339 -14090 -18805
27144 -18805 15279 35101 20740 33239 62029 70005 33248 -9600 -32433 -15479 -34064 -29389
$$ packed form
27231C5374k4289r641n522l791m166K155k5981j8289j3764J1665M5602N483j0355
27218a5519J6444j682J5374R976j0053j9139Q259J2982j8084l7578J4421K8225
27206C626L6067K6853R094j3879m708k0516J5575r52l0481J6523O755l3239k6356
27193a5638Q826j4596l8585M300K6731j698n202M0344j2211n0800j2038L2564
27181c8003P538J3105K5600k9990l1804J3844l448j336K5426L8336k2736J3497
27169A0029L6671m0980k5378k1874j3782j1955j4491P5992M7668j1334P765j0438
27157B7893m6983m968P112J7858J6040k2532j2896j0493L8513p99j7084n751m715
27144a8805L4084J9822j4361J2499K8790P976l6757m2848k2833J6954j8585M675
$$ plain form
27132 -29389 6892 9292 30625 11733 -10133 -28331 769 49141 32578 21485 -5713 -37630
27120 -37630 -43867 -66594 -54309 42319 74820 33581 32653 38280 17577 26101 20591 15774 33238
27107 33238 20142 37021 14832 5343 30238 43433 7313 -15034 -30823 -27961 -27684 -39602
27095 -39602 -67499 -69197 -39618 -24598 3183 -1399 -22670 -46069 1355 18584 16161 177
27083 177 -13076 5343 30772 23229 41948 44050 11336 -37240 -57549 -31929 18928 40269
27071 40269 -11021 -63253 -90093 -43443 -44000 -65981 -27942 5841 21977 45034 31889 44142
27059 44142 21290 33285 71677 64408 38960 3690 -43966 -45060 -46744 -45706 -33688 -46210
27047 -46210 5825 71244 60525 16783 17000 31878 13251 5440 -26637 -14136 -27493 4351
$$ packed form
27132b9389L6281K400K1333j8892k1866j8198K9100M8372j6563j1093k7198l1917
27120c7630o237k2727J2285R6628L2501m1239r28N627k0703Q524n510m817J7464
27107C3238j3096J6879k2189r489K4895J3195l6120k2347j5789K862K77j1918
27095c9602k7897j698K9579J5020K7781m582k1271k3399M7424J7229k423j5984
27083A77j3253J8419K5429p543J8719K102l2714m8576k0309K5620N0857K1341
27071D0269n1290n2232k6840M6650n57k1981L8039L3783J6136K3057j3145J2253
27059D4142k2852J1995L8392p269k5448l5270m7656j094j684J038J2018j2522
27047d6210N2035O5419j0719m3742K17J4878j8627p811l2077J2501j3357L1844
$$ plain form
27035 4351 7652 28052 13097 -11061 -629 6126 13468 23656 18975 -34598 -43557 -20869 1761
27022 1761 6483 3032 -1124 18508 21460 -6948 -8399 -14363 -11342 -12362 21398 -10035 -19464 6401
27008 6401 19603 53870 46631 46832 35598 -7089 -11138 -27908 -24626 -22139 -33079 -45938 -18607
26995 -18607 11230 46315 28714 37156 52085 27046 -4334 -56330 -78273 -17049 12607 2011
26983 2011 -40900 -35432 -8645 -793 635 -6952 -52350 -65274 -80729 -62542 -48350 -31102 -13571
26970 -13571 21075 9145 -6184 -6420 -19658 1528 19722 30307 10860 15422 -8318 -39783
26958 -39783 -47209 -13133 9116 -6492 -23106 30081 76249 99853 57517 71045 15811 -42042
26946 -42042 -39338 -3906 19067 28950 -4571 -28022 8734 4891 33148 -59 -14120 -50130
$$ packed form
27035D351L301K0400j4955k4158J0432O755P342J0188m681n3573q959K2688K2630
27022A761M722l451m156J9632K952k8408j451n964L021j020L3760l1433r429K5865
27008F401J3202L4267p239K01j1234m2687m049j6770L282K487j0940j2859K7331
26995a8607K9837L5085j7601Q442J4929k5039l1380n1996k1943O1224K9656j0596
26983B011m2911N468K6787P852J428p587m5398j2924j5455J8187J4192J7248J7531
26970a3571L4646j1930j5329k36j3238K1186J8194J0585j9447M562k3740l1465
26958c9783p426L4076K2249j5608j6614N3187M6168K3604m2336J3528n5234n7853
26946d2042K704L5432K2973R883l3521k3451L6756l843K8257l3207j4061l6010
$$ plain form
26934 -50130 -50825 -15423 -1633 7933 -4082 -34 -1871 -10345 -34027 -18746 -1191 24979 65720
26921 65720 70970 18795 32126 75145 38927 29044 27823 2662 36970 27437 13574 14111 30348
26908 30348 3156 -7096 -10359 -67027 -74441 -37456 -31069 -31466 -34238 -48484 -31322 -14620 -64376
26895 -64376 -85661 -26838 16404 10398 40107 64301 5343 -31181 -5716 2306 -2870 -17204
26883 -17204 -21685 -52982 -57017 -27018 -20816 -17964 -15201 23879 24265 10921 19318 8479 30403
26870 30403 26249 29007 8035 42529 28240 24016 26628 -15425 -79764 -46708 -36928 -31018 -25262
26857 -25262 -72647 -114642 -63016 -45033 -5799 13836 10914 -22545 -18 22265 26533 25421
26845 25421 8514 19916 46250 60444 61070 45387 19543 3188 3320 -57921 -57815 14025 -9313
$$ packed form
26934e0130o95L5402J3790R566j2015M048j837q474k3682J5281J7555K6170M0741
26921F5720N250n2175J3331M3019l6218r883j221k5161L4308r533j3863N37J6237
26908C0348k7192j0252l263n6668p414L6985O387l97k772j4246J7162J6702m9756
26895f4376k1285N8823M3242o006K9709K4194n8958l6524K5465Q022n176j4334
26883a7204m481l1297m035K9999O202K852K763L9080L86j3344Q397j0839K1924
26870C0403m154K758k0972L4494j4289m224K612m2053o4339L3056R780N910N756
26857b5262m7385m1995N1626J7983L9234J9635k922l3459K2527K2283M268j112
26845B5421j6907J1402K6334J4194O26j5683k5844j6355J32o1241J06P1840k3338
$$ plain form
26832 -9313 -64954 -67342 -57243 -37239 -14058 22938 41310 22162 42545 51201 49836 22039
26820 22039 -29265 -41848 -45092 -63898 -73649 -63583 -75495 -43576 108 5188 5597 -27701 -35627
26807 -35627 -27017 -8953 -43715 -49837 2520 -13621 -51866 -15019 11609 26169 40029 16464
26795 16464 -42946 -31062 6605 32322 48923 52613 70343 68619 58179 51366 19422 -31043
26783 -31043 -64800 25037 14020 2793 -33564 -65935 -39802 -23924 -21983 16527 -9730 -25106
26771 -25106 -22345 -29317 -42086 -43113 -45643 -9062 -16854 -32360 -17374 23613 -2840 -13631 -13559
26758 -13559 -3158 -20400 9569 17890 -44569 -40047 -15640 5863 30853 46984 16622 16417
26746 16417 35785 28168 7984 58883 74186 11457 11446 17213 -10579 7891 64936 70681 22064
$$ packed form
26832i313n5641k388J0099K0004K3181L6996J8372j9148K0383Q656j365k7797
26820B2039n1304j2583l244j8806r751J0066j1912L1919M3684N080M09l3298p926
26807c5627Q610J8064l4762o122N2357j6141l8245L6847K6628J4560J3860k3565
26795A6464n9410J1884L7667K5717J6601L690J7730j724j0440o813l1944n0465
26783c1043l3757Q9837j1017j1227l6357l2371K6133J5878J941L8510k6257j5376
26771b5106K761o972j2769j027k530L6581p792j5506J4986M0987k6453j0791P2
26758a3559J0401j7242K9969Q321o2459M522K4407K1503K4990J6131l0362k05
26746A6417J9368p617k0184N0899J5303o2729j1N767k7792J8470N7045N745m8617
$$ plain form
26733 22064 30981 23761 -1773 16894 53956 71422 81569 47594 -22912 -43010 -16673 3890
26721 3890 -22697 -47116 -19746 28037 16640 12767 53344 44214 9836 34950 40165 50418
26709 50418 47359 5305 -10777 -14686 -21535 -43951 -69314 -86400 -80900 -31033 -8552 -13044 -35527
26696 -35527 24555 32152 18186 20496 3665 20931 32356 -1907 -39501 -29666 23194 27613
26684 27613 37108 -12142 -65869 -68929 -31476 6203 -137 -11617 -3188 -32122 -43622 -41138 -52360
26671 -52360 -49604 -17598 -22598 -20987 601 -19586 -8068 -24456 912 8182 24578 6642
26659 6642 -16093 6232 -45802 -49390 -46759 -21650 43235 57956 48980 69623 55485 43511
26647 43511 5378 -6280 -2755 4758 19616 53667 48083 789 -27001 7679 -121 12704
$$ packed form
26733B2064Q917p220k5534J8667L7062J7466J0147l3975p0506k0098K6337K0563
26721C890k6587k4419K7370M7783j1397l873M0577r130l4378K5114N215J0253
26709E0418l059m2054j6082l909o849k2416k5363j7086N500M9867K2481m492k2483
26696c5527O0082P597j3966K310j6831J7266J1425l4263l7594R835N2860M419
26684B7613R495m9250n3727l060L7453L7679o340j1480Q429k8934j1500K484j1222
26671e2360K756L2006n000J611K1588k0187J1518j6388K5368P270J6396j7936
26659F642k2735K2325n2034l588K631K5109O4885J4721q976K0643j4138j1974
26647D3511l8133j1658L525P513J4858L4051n584m7294k7790L4680p800J2825
$$ plain form
26635 12704 33747 26322 25633 70355 59627 53811 25849 -8751 -20064 -15404 -8265 33696 51655
26622 51655 80856 57562 3274 -1626 -16061 -19618 -18948 23611 -1213 12835 32540 35310 18172
26609 18172 5096 13516 1371 -842 -15548 -4903 3707 -10387 -31036 -27930 19665 69840
26597 69840 10047 -20296 -19996 -42552 -69918 -83387 -56041 -57861 -65954 -84752 -78920 -47487 -16040
26584 -16040 -20556 -32605 22813 84341 90980 80272 77624 51234 -7988 -21998 -16874 -10329 1938
26571 1938 -14928 -10786 15754 28144 8026 -21915 -6997 7520 -26162 -42835 -28465 -72135
26559 -72135 -72066 -46721 -21938 -20820 -37099 -14415 -4554 -19674 9206 6976 13140 77422 60232
26546 60232 45697 46934 49714 74613 74368 50571 50977 30525 47059 28597 -31868 -56270 -72387
$$ packed form
26635A2704K1043p425o89M4722j0728n816k7962l4600j1313M660P139M1961J7959
26622E1655K9201k3294n4288m900j4435l557O70M2559k4824J4048J9705K770j7138
26609A8172j3076Q420j2145k213j4706J0645Q610j4094k0649L106M7595N0175
26597F9840n9793l0343L00k2556k7366j3469K7346j820q093j8798N832L1433L1447
26584a6040m516j2049N5418O1528O639j0708k648k6390n9222j4010N124O545J2267
26571A938j6866M142K6540J2390k0118k9941J4918J4517l3682j6673J4370m3670
26559g2135O9K5345K4783J118j6279K2684R861j5120K8880k230O164O4282j7190
26546F0232j4535J237K780K4899k45k3797M06k0452J6534j8462o0465k4402j6117
$$ plain form
26533 -72387 -75836 -47804 -50492 -52448 -47232 -24902 -23060 -1991 27055 60194 49348 24609 38610
26520 38610 -3951 -11119 -35731 -43514 -51516 -9885 -8639 17961 64073 99425 64923 12287
26508 12287 -3767 -12004 1094 -1010 -29934 -41101 -37313 -46363 -52131 -47795 -43196 -53713 -19045
26495 -19045 29938 46609 75445 66913 44939 5612 21356 19000 52722 26543 -14470 -25751
26483 -25751 -57895 -35345 -11656 6978 10939 4914 11857 39471 37536 30424 31871 63548 26869
26470 26869 28928 14417 -2482 30221 37345 40412 54771 32891 -14347 -2911 24980 -5081
26458 -5081 -17785 14867 39434 28892 6906 -7889 3916 34832 -1846 -14095 -30752 -39225
26446 -39225 -59218 -19821 -18020 -41862 -41921 -43545 -47836 -42601 -58101 -60420 -40187 -23976 -18733
$$ packed form
26533g2387l449K8032k688j956N216K2330J842K1069K9046L3139j0846k4739J4001
26520C8610m2561p168k4612p783q002M1631J246K6600M6112L5352l4502n2636
26508A2287j6054q237J3098k104k8924j1167L788r050n768M336M599j0517L4668
26495a9045M8983J6671K8836q532k1974l9327J5744k356L3722k6179m1013j1281
26483b5751l2144K2550K3689J8634L961o025O943K7614j935p112J447L1677l6679
26470B6869K059j4511j6899L2703P124L067J4359k1880m7238J1436K7891l0061
26458e081j2704L2652K4567j0542k1986j4795J1805L0916l6678j2249j6657q473
26446c9225j9993L9397J801k3842n9j624m291N235j5500k319K0233J6211N243
$$ plain form
26433 -18733 -13396 -16312 23589 21860 -12529 -3431 -23113 -29910 28805 22948 1683 -1291 -4845
26420 -4845 -1493 -17214 -59876 -55643 -31065 -15358 7058 10731 -6985 -6114 27826 13709 -7728
26407 -7728 55421 80805 32918 -17502 -46787 -35095 -18774 -180 19380 57072 52021 50335
26395 50335 48884 38910 15507 -3921 -7342 -17942 -48231 -45546 -29426 -5811 29976 46378
26383 46378 41873 25059 50257 27431 44560 111803 106370 64305 6267 -2940 -10028 8833
26371 8833 -18845 -28084 -35806 -28659 -8249 24640 37063 11467 10887 8314 6347 20827 -1453
26358 -1453 6582 37572 5561 -7436 15755 380 -30919 -63550 -60755 -25376 -25786 -46125 -29590
26345 -29590 -8966 -26306 -17657 5676 6437 5003 7808 1727 -9034 -59554 -42777 -28420 -28974
$$ packed form
26433a8733N337k916L9901j729l4389R098j9682o797N8715n857k1265k974l554
26420d845L352j5721m2662M233K4578J5707K2416L673j7716Q71L3940j4117k1437
26407g728O3149K5384m7887n0420k9285J1692J6321J8594J9560L7692n051j686
26395E0335j451r974k3403j9428l421j0600l0289K685J6120K3615L5787J6402
26383D6378m505j6814K5198k2826J7129O7243n433m2065n8038r207p088J8861
26371H833k7678r239p722P147K0410L2889J2423k5596n80k573j967J4480k2280
26358a453Q035L0990l2011j2997K3191j5375l1299l2631K795L5379m10k0339J6535
26345b9590K0624j7340Q649K3333P61j434K805o081j0761n0520J6777J4357n54
$$ plain form
26332 -28974 -24011 -35203 -46933 -42926 -52303 -45191 -29393 -9412 -34940 -50622 -17188 -16285 -18133
26319 -18133 -2611 -14741 -41149 -37874 1753 3514 -55534 -85111 -24158 -1358 -16194 -82808
26307 -82808 -112708 -95943 -68899 -41736 -19503 -31408 -51047 -69588 -101562 -97251 -44832 -30242
26295 -30242 -46245 -33222 -63900 -66400 -72858 -39805 3986 10420 -17036 -34560 -43080 -45951 -39715
26282 -39715 -49215 -55599 -32141 -24279 -31644 -38691 -54699 -37549 -7618 11406 16589 48133 32744
26269 32744 13367 19242 24390 -2695 -14074 -10457 -60499 -51929 -34519 -40245 -33385 -4967 -8776
26256 -8776 -16803 3540 46530 48233 66988 57285 17600 -30486 -18151 -12409 -45872 -62119 -6077
26243 -6077 -19429 -74240 -49177 -41633 -30457 8827 39543 6466 -29375 -11900 -3366 -2815 -24775
$$ packed form
26332b8974M963j1192j1730M007r377P112J5798J9981k5528j5682L3434R03j848
26319a8133J5522j2130k6408L275L9627J761n9048k9577O0953K2800j4836o6614
26307h2808k9900J6765K7044K7163K2233j1905j9639j8541l1974M311N2419J4590
26295c0242j6003J3023l0678k500o458L3053M3791O434k7456j7524q520k871O236
26282c9715r500o384K3458P862p365p047j6008J7150K9931J9024N183L1544j5389
26269C2744j9377N875N148k7085j1379L617n0042Q570J7410n726O860K8418l809
26256h776q027K0343M2990J703J8755r703l9685m8086J2335N742l3463j6247N6042
26243f077j3352n4811K5063P544J1176L9284L0716l3077l5841J7475Q534N51k1960
$$ plain form
26230 -24775 -21579 -41347 -22445 24257 52607 25723 17911 -5880 -25167 6784 38408 14115
26218 14115 -27677 -43501 -17751 912 21140 19091 -7675 25293 34839 16842 -34047 -37064
26206 -37064 -19184 -22166 -47900 -6636 -18897 -34952 -40397 -794 44438 13899 -9186 -6691
26194 -6691 28255 42773 20298 9387 29002 20541 35154 53332 110203 89357 43613 7746
26182 7746 1553 17779 10679 -5129 -1328 22256 5553 6704 21798 24647 3586 -12372 -37385
26169 -37385 -53980 -9144 40117 5626 -15960 -35761 -35251 -39781 -38517 -22007 -2178 -30145
26157 -30145 -44764 -33719 -22263 -19466 5345 -57 -13295 -20512 -23752 -32825 -19745 24842 36962
26144 36962 34070 43851 -7417 -20074 -70904 -80173 -45572 32665 36656 9952 12475 15114 22681
$$ packed form
26230b4775L196j9768J8902M6702K8350k6884p812k3791j9287L1951L1624k4293
26218A4115m1792j5824K5750J8663K0228k049k6766L2968R546j7997n0889l017
26206c7064J7880k982k5734M1264j2261j6055n445L9603M5232l0539k3085K495
26194f691L4946J4518k2475j0911J9615q461J4613J8178N6871k0846m5744l5867
26182G746o193J6226p100j5808L801K3584j6703J151J5094K849k1061j5958k5013
26169c7385j6595M4836M9261l4491k1586j9801N10m530J264J6510J9829k7967
26157c0145j4619J1045J1456K797K4811n402j3238p217l240r073J3080M4587J2120
26144C6962k892R781n1268j2657n0830r269L4601P8237L991k6704K523K639P567
$$ plain form
26131 22681 21122 30423 18268 -17193 -31936 -57208 -40340 -27665 -12073 -22829 -25356 35268
26119 35268 46428 19137 15568 53128 67012 82500 31961 -16802 -37073 8102 44022 22405
26107 22405 -3397 19366 58417 90246 71016 48074 26248 20974 10828 -34747 -77031 -67217
26095 -67217 -24967 -19537 -35832 -33117 -9527 -21314 -15696 -16691 -13765 25980 12824 184 36668
26082 36668 40381 12142 -37266 -88781 -68045 -32175 -48440 -28030 -9469 10122 12533 -34172
26070 -34172 -43251 -68036 -88008 -76360 -77173 -74800 -54642 -37953 -17464 -18850 -2773 -39572 -44246
26057 -44246 -59409 -32218 -28200 -18624 35457 41523 17861 962 26914 23984 23150 63025 100771
26044 100771 89496 82057 87010 63064 59972 44199 54840 27467 37209 73376 80538 80589 17272
$$ packed form
26131B2681j559R301j2155l5461j4743k5272J6868J2675J5592j0756k527O0624
26119C5268J1160k7291l569L7560J3884J5488n0539m8763k0271M5175L5920k1617
26107B2405k5802K2763L9051L1829j9230k2942k1826n274j0146m5575m2284R814
26095f7217M2250N430j6295K715K3590j1787N618r95K926L9745j3156j2640L6484
26082C6668L713k8239m9408n1515K0736L5870j6265K0410J8561J9591K411m6705
26070c4172r079k4785j9972J1648q13K373K0158J6689K0489j386J6077l6799m674
26057d4246j5163K7191M018R576N4081O066k3662j6899K5952k930q34L9875L7746
26044A00771j1275p439M953k3946l092j5773J0641k7373R742L6167P162N1o3317
$$ plain form
26031 17272 25665 5822 -9450 40073 43105 -12715 -46019 -17239 9744 30639 17345 7542
26019 7542 -23194 -33458 -41503 -22886 -23072 5094 -9255 -40207 -21888 -40416 -60468 -65106 -68615
26006 -68615 -43847 -19930 7637 25146 -5759 -17848 -27623 -20611 -41780 -34607 -15860 24222
25994 24222 32946 29128 37855 38470 -21107 -23939 3215 -1314 9518 17985 -2436 -27879 -14893
25981 -14893 23199 45087 40907 83640 98808 58963 23131 -16242 -8756 36433 39647 31690
25969 31690 23113 24688 2816 -49487 -13605 -3449 3235 28882 43747 37986 -18888 -30740
25957 -30740 699 30262 36577 -603 -48583 -6770 -6253 8156 27106 52832 46333 -18474
25945 -18474 2781 -3299 -42037 -27229 -8274 3903 -13073 -31449 -44498 -486 53930 70874
$$ packed form
26031A7272Q393j9843j5272M9523L032n5820l3304K8780K6983K0895j3294r803
26019G542l0736j0264q045J8617j86K8166j4349l0952J8319j8528k0052m638l509
26006f8615K4768K3917K7567J7509l0905j2089r775P012k1169P173J8747M0082
25994B4222Q724l818Q727O15n9577k832K7154m529J0832Q467k0421k5443J2986
25981a4893L8092K1888m180M2733J5168l9845l5832l9373P486M5189L214p957
25969C1690q577J575k1872n2303L5882J0156O684K5647J4865n761n6874j1852
25957c0740L1439K9563O315l7180m7980M1813N17J4409J8950K5726o499o4807
25945a8474K1255o080l8738J4808J8955J2177j6976j8376j3049M4012N4416J6944
$$ plain form
25933 70874 43783 35520 27095 -35116 -71853 -53909 -27236 -15947 3027 -1324 753 -8165 -10007
25920 -10007 4830 10427 34334 38931 33656 59469 39586 -29362 -40961 -13623 -16555 -54963
25908 -54963 -32090 -4927 7759 10799 15474 15057 49158 48815 24860 -24510 29630 50971 9314
25895 9314 -35777 -8916 -31267 -51370 -23872 7880 17049 19144 8916 -336 -18766 20241
25883 20241 88268 68611 37124 12779 137 31182 57742 28568 35789 -18145 -35179 4991
25871 4991 -35361 -53677 -15544 -19198 -18771 -37345 -13951 6106 43284 69923 17913 -17117
25859 -17117 -18797 -8443 -12211 -5452 -18124 12755 -4761 -16467 -27940 -7702 17012 60255
25847 60255 31855 -21590 -29746 -37048 -46632 -32920 -18760 -7955 -14323 -11584 -17874 -30831 11308
$$ packed form
25933G0874k7091q263q425o2211l6737J7944K6673J1289J8974m351K077q918j842
25920a0007J4837N597K3907M597n275K5813j9883o8948j1599K7338k932l8408
25908e4963K2873K7163J2686L040M675m17L4101l43k3955m9370N4140K1341m1657
25895I314m5091K6861k2351k0103K7498L1752R169K095j0228r252j8430L9007
25883B0241O8027j9657l1487k4345j2642L1045K6560k9174P221n3934j7034M0170
25871D991m0352j8316L8133l654M27j8574K3394K0057L7178K6639n2010l5030
25859a7117j680J0354l768O759j2672L0879j7516j1706j1473K0238K4714M3243
25847F0255k8400n3445q156p302r584J3712J4160J0805o368K739o290j2957M2139
$$ plain form
25834 11308 12614 -29417 -17923 -7558 6522 -7209 -1199 40382 48182 -16778 -81331 -108577
25822 -108577 -84908 -27539 -9165 37705 38167 -2879 21151 36286 38682 59049 37409 -2586
25810 -2586 3421 32204 36335 51232 10479 -15491 -13107 -30069 -21099 15479 4472 -18447 -5599
25797 -5599 21356 15771 51553 37474 -5398 -40027 -84840 -72914 -52305 -10086 31587 27476
25785 27476 17663 12008 -1221 23049 53393 55948 51336 47129 45628 19212 12373 19422 35750
25772 35750 71822 54423 26532 -10187 -31675 -36415 -4755 -40178 -85107 -62400 -24015 -23912
25760 -23912 4570 7198 35223 50934 25428 -22716 -62442 -12255 25080 12887 -20564 -35115
25748 -35115 -9176 -16694 -43974 -49121 -29371 -4624 -7190 -23719 -47946 -58476 -5273 34974
$$ packed form
25834A1308J306m2031J1494J0365J4080j3731O010M1581P800o4960o4553k7246
25822a08577K3669N7369J8374M6870M62m1046K4030J5135K396K0367k1640l9995
25810b586O007K8783M131J4897m0753k5970K384j6962Q970L6578j1007k2919J2848
25797e599K6955n585L5782j4079m2872l4629m4813J1926K0609M2219M1673m111
25785B7476r813n655j3229K4270L0344K555m612m207j501k6416o839P049J6328
25772C5750L6072j7399k7891l6719k1488m740L1660l5423m4929K2707L8385J03
25760b3912K8482K628K8025J5711k5506m8144l9726N0187L7335j2193l3451j4551
25748c5115K5939p518k7280n147J9750K4747k566j6529k4227j0530N3203M0247
$$ plain form
25736 34974 18558 5472 37326 3043 -20777 -4096 4890 -7844 19945 -12405 -41100 -36957
25724 -36957 -608 -479 19317 -794 -20493 -17086 -20689 -986 21420 36368 9374 1956 55194
25711 55194 66610 99320 59196 -22030 -26186 -2447 12434 -8190 -43437 -27473 -446 18493
25699 18493 11295 -9355 -7994 1264 6740 44758 40273 40939 17831 -11993 -10220 27486 47248
25686 47248 24757 46783 56910 46703 48566 83530 56049 39194 48872 30336 4344 -23805
25674 -23805 -57316 -104280 -96573 -35255 -30372 -45271 -8948 -13884 -14188 32860 52490 44901 49163
25661 49163 48474 23510 4423 45142 81047 66456 58728 68935 65975 28595 43957 28656
25649 28656 16845 7217 2869 -5718 17249 31176 -5259 -6599 2960 23172 33552 49863 -2577
$$ packed form
25736C4974j6416j3086L1854l4283k3820J6681Q986j2734K7789l2350k8695M143
25724c6957L6349J29J9796k0111j9699L407l603J9703K2406J4948k6994p418N3238
25711E5194J1416L2710m0124q1226m156K3739J4881k0624l5247J5964K7027J8939
25699A8493p198k0650J361R258N476L8018m485O66k3108k9824J773L7706J9762
25686D7248k2491K2026J0127j0207J863L4964k7481j6855R678j8536k5992k8149
25674b3805l3511m6964P707O1318M883j4899L6323m936l04M7048J9630p589M262
25661D9163o89k4964j9087M0719L5905j4591p728J0207k960l7380J5362j5301
25649B8656j1811r628m348q587K2967J3927l6435j340R559K0212J0380J6311n2440
$$ plain form
25636 -2577 6718 -8957 -15476 -19596 -18319 -25015 -4365 -5184 12741 43603 24771 28069 47968
25623 47968 44606 22887 -22717 -9591 -26964 -35196 -28260 -39774 21238 52599 32282 -1347
25611 -1347 -28491 -38717 -54695 -47162 -15331 19592 16862 13590 34697 46386 41838 61455 51445
25598 51445 67490 41745 18051 40405 88663 77819 60041 5243 -33446 -38615 -29650 12881
25586 12881 22525 -12337 -6607 -1713 11266 24241 35586 50377 96276 89488 58439 75827
25574 75827 72765 11504 54223 90051 57162 12940 -25113 -39696 -69754 -124512 -117212 -56375
25562 -56375 -22348 -13972 -27265 -18066 -14212 -6262 -19257 -57129 -63825 -52619 -62621 -92230 -83375
25549 -83375 -70176 -56690 -45077 -36153 -28632 -53685 -38731 -34181 -24270 1496 33388 49219
$$ packed form
25636b577R295j5675o519m120J277o696K0650q19J7925L0862j8832L298J9899
25623D7968l362k1719m5604J3126j7373q232O936j1514O1012L1361k0317l3629
25611a347k7144j0226j5978P533L1831L4923k730l272K1107J1689m548J9617j0010
25598E1445J6045k5745k3694K2354M8258j0844j7778n4798l8689n169Q965M2531
25586A2881R644l4862N730M894J2979J2975J1345J4791M5899o788l1049J7388
25574G5827l062o1261M2719L5828l2889m4222l8053j4583l0058n4758P300O0837
25562e6375L4027Q376j3293R199L854P950j2995l7872o696J1206j0002k9609Q855
25549h3375J3199J3486J1613Q924P521k5053J4954M550R911K5766L1892J5831
$$ plain form
25537 49219 27957 43618 59640 64201 77568 66430 43829 34997 41581 21040 6456 -868
25525 -868 -5788 -37190 -40270 -39202 -28798 12272 9783 -19294 -29389 -44648 -40074 -18708 19738
25512 19738 7742 1641 -6204 13623 16624 31738 2234 -25956 -33764 -2320 17657 50146
25500 50146 -3698 -4493 -1341 4625 4289 2856 -17632 -61819 -56350 -38755 77 19143 -49270
25487 -49270 -58096 -45234 -14492 61921 73855 27463 10392 18109 30380 24953 35642 73674
25475 73674 71631 40666 -7548 -22184 5286 6351 -9244 37695 16712 -7109 -6150 -16669
25463 -16669 4682 43164 46542 40508 -20025 -47297 -47518 -35668 -15887 -12933 -36598 -479 7092
25450 7092 5856 45238 46692 14556 -42117 -78983 -40797 -24343 -43093 -33291 -14431 -51987
$$ packed form
25537D9219k1262J5661J6022M561J3367j1138k2601q832O584k0541j4584p324
25525h68m920l1402l080J068J0404M1070k489k9077j0095j5259M574K1366L8446
25512A9738j1996o101p845J9827L001J5114k9504k8190p808L1444J9977L2489
25500E0146n3844p95L152N966l36j433k0488m4187N469J7595L8832J9066o8413
25487d9270q826J2862L0742P6413J1934m6392j7071P717J2271n427J0689L8032
25475G3674k043l0965m8214j4636K7470J065j5595M6939k0983k3821R59j0519
25463a6669K1351L8482L378o034o0533k7272k21J1850J9781K954k3665L6119P571
25450G092j236L9382J454l2136n6673l6866L8186J6454j8750R802J8860l7556
$$ plain form
25438 -51987 -60042 -30410 21120 46258 21182 4429 -28437 -59443 -53609 -48294 -22212 3079
25426 3079 44059 45663 -10473 -38290 -6966 -16993 -10547 -2430 -2172 2211 11959 25555 17749
25413 17749 16350 3009 -9096 -21946 -32535 -22672 -15589 2827 -4465 6608 4908 -56787 -62382
25400 -62382 -9937 32957 47758 21881 36769 -1981 -53216 -1902 7023 12993 20610 -5381
25388 -5381 -43895 -58955 -33534 22031 30545 15452 33770 -4952 -28061 -22090 -61371 -86303
25376 -86303 -95743 -106858 -141051 -118843 -67832 -15285 3803 -21339 -27287 -41736 -12833 -1753
25364 -1753 20626 30547 -10541 -22360 7222 5500 -7861 -4075 -15648 -7239 35075 47130 -24765
25351 -24765 -70157 -35836 -1575 -25963 -23267 -12027 -46897 -58268 -66646 -63045 -47225 -31300
$$ packed form
25438e1987q055K9632N1530K5138k5076j6753l2866l1006N834N315K6082K5291
25426C079M0980J604n6136k7817L1324j0027O446Q117K58M383R748J3596p806
25413A7749j399j3341j2105j2850j0589R863P083J8416p292J1073j700o1695n595
25400f2382N2445M2894J4801k5877J4888l8750n1235N1314Q925N970P617k5991
25388e381l8514j5060K5421N5565Q514j5093J8318l8722k3109N971l9281k4932
25376h6303r440j1115l4193K2208N1011N2547J9088k5142n948j4449K8903J1080
25364a753K2379R921m1088j1819K9582j722j3361L786j1573Q409M2314J2055p1895
25351b4765m5392L4321L4261k4388K696J1240l4870j1371q378L601J5820J5925
$$ plain form
25339 -31300 -13590 1108 -19899 -43769 -7954 -24700 -49121 -30602 -19730 35529 74213 38218
25327 38218 7829 2085 -32885 -30332 -16863 -28454 -37964 -72026 -70002 -21356 -25616 5768 17923
25314 17923 -1840 3930 19401 13372 31394 13205 -2872 -15041 -30056 -35295 -28791 -11111
25302 -11111 -16799 -15382 16436 43476 64519 12074 -20901 -13567 -3091 54882 49828 -15640
25290 -15640 -27347 -54710 -87789 -105255 -74298 -18334 -18277 -35853 -40668 -37545 -56 9367 4852
25277 4852 -40981 -40809 7470 -7552 -34168 7758 42645 441 -7094 14349 22940 53742 67990
25264 67990 100431 113909 63106 30199 4357 -58452 -59007 -10704 4848 -12441 13027 7488
25252 7488 -40744 -31082 28268 42009 21533 25579 21953 -22825 -57691 -95859 -108768 -115512 -69830
$$ packed form
25339c1300J7710J4698k1007k3870L5815j6746k4421J8519J0872N5259L8684l5995
25327C8218l0389n744l4970K553J3469j1591r510l4062K024M8646m260L1384J2155
25314A7923j9763N770J5471o029J8022j8189j6077j2169j5015n239O504J7680
25302a1111n688J417L1818K7040K1043n2445l2975P334J0476N7973n054o5468
25290a5640j1707k7363l3079j7466L0957N5964N7j7576m815L123L7489R423m515
25277D852m5833J72M8279j5022k6616M1926L4887m2204p535K1443Q591L0802J4248
25264F7990L2441J3478n0803l2907k5842o2809n55M8303J5552j7289K5468n539
25252G488m8232R662N9350J3741k0476M046l626m4778l4866l8168j2909o744M5682
$$ plain form
25239 -69830 -74486 -49809 -17476 11886 -1782 7111 12614 -52606 -68388 -32741 -32371 -15014 16874
25226 16874 -759 74 5278 4774 24713 48959 27891 37081 31690 29145 58755 22276 -18983
25213 -18983 -12707 16370 45684 55751 77653 36546 38453 49949 44155 11305 -30750 -33080
25201 -33080 30245 49783 45203 36595 4916 11503 -6408 -697 5097 24655 -10541 -59391 -72428
25188 -72428 -61171 -51113 -1555 9271 -29385 -69896 -24609 49951 44257 38448 19213 64537
25176 64537 63059 58085 50159 27444 -9214 -10827 -17421 -16516 -34505 -34623 -21699 -12345 -22229 -30671
25162 -30671 -23669 -6033 -17046 -4314 33540 57468 34694 -504 -15146 -38095 4517 13384
25150 13384 27139 -5165 3739 34471 35672 17789 7681 27576 31666 -8646 11488 -2095
$$ packed form
25239f9830m656K4677L2333K9362j3668Q893N503o5220j5782L5647L70J7357L1888
25226A6874j7633Q33N204n04J9939K4246k1068R190n391k545K9610l6479m1259
25213a8983O276K9077K9314J0067K1902m1107J907J1496n794l2850m2055k330
25201c3080O3325J9538m580q608l1679O587j7911N711N794J9558l5196m8850j3037
25188g2428J1257J0058M9558J0826l8656m0511M5287P4560n694n809j9235M5324
25176F4537j478m974p926k2715l6658j613o594R05j7989j18J2924R354r884q442
25162c0671P002J7636j1013J2732L7854K3928k2774l5198j4642k2949M2612Q867
25150A3384J3755l2304Q904L0732J201j7883j0108J9895M090m0312K0134j3583
$$ plain form
25138 -2095 -13842 -25286 -35181 -8609 645 -16921 -3021 17981 42109 56394 30279 -8419
25126 -8419 -27007 -29679 4416 9397 -17033 -64971 -113987 -92827 -47453 -18506 -32679 -35089
25114 -35089 -8636 -21572 -3659 8369 -2361 -31717 -45252 -24839 5609 35876 28035 -19480
25102 -19480 -26412 3084 -31134 -44691 -59926 -37727 -43646 -18005 66 -34105 -24791 -28160
25090 -28160 -37194 -59111 -78067 -45858 12915 403 21545 10022 -44382 -22634 24937 49444
25078 49444 40186 63813 67540 47297 48971 58887 58946 79424 86827 28108 -18815 -56958 -68435
25065 -68435 -1978 12554 7173 1853 -28765 -54510 -42914 -7041 17432 -10922 -9733 -15084
25053 -15084 -8183 -22640 -31660 -57770 -49606 -26593 31611 78343 84029 50240 -664 2364 -24490
$$ packed form
25138b095j1747j1444r895K6572R254j7566J3900K1002K4128J4285k6115l8698
25126h419j8588k672L4095M981k6430m7938m9016K1160M5374K8947j4173k410
25114c5089K6453j2936J7913J2028j0730k9356j3535K0413L0448L0267p841m7515
25102a9480o932K9496l4218j3557j5235K2199n919K5641J8071l4171R314l369
25090b8160r034k1917j8956L2209N8773j2512K1142j1523n4404K1748M7571K4507
25078D9444r258K3627L727k0243J674R916N9K0478P403n8719m6923l8143j1477
25065f8435O6457J4532n381n320l0618k5745J1596L5873K4473k8354J189n351
25053a5084O901j4457r020k6110Q164K3013N8204M6732N686l3789n0904L028k6854
$$ plain form
25040 -24490 -40306 -53471 -53918 -53161 -29769 4624 -36739 -49779 -29961 -14347 -70154 -74559 -31128
25027 -31128 2813 -12010 -9008 5072 37680 62697 40185 3262 -16066 -23194 -45266 -52273
25015 -52273 -40245 32361 78258 66846 78845 35827 8005 9418 8709 -24355 -38113 -23994
25003 -23994 -3148 -29753 -52393 5773 41635 454 -39813 -44636 -23356 -21951 -36010 -4084
24991 -4084 32572 20973 -1016 6171 -11690 -18735 40549 89849 36937 21937 42138 18070
24979 18070 56036 84840 45446 61149 89738 103902 82347 65982 82026 69346 47149 66641
24967 66641 26262 -4983 13459 7957 8420 24634 17630 -31159 -93441 -102764 -120440 -115565 -58880
24954 -58880 -20421 8581 -11595 -8175 10173 10677 20279 44399 25396 59078 71595 48676
$$ packed form
25040b4490j5816j3165m47P57K3392L4393m1363j3040J9818J5614n5807m405M3431
25027c1128L3941j4823L002J4080L2608K5017k2512l6923j9328p128k2072p007
25015e2273J2028P2606M5897j1412J1999m3018k7822J413p09l3064j3758J4119
25003b3994K0846k6605k2640N8166L5862m1181m0267m823K1280J405j4059L1926
24991d084L6656j1599k1989P187j7861p045N9284M9300n2912j5000K0201k4068
24979A8070L7966K8804l9394J5703K8589J4164k1555j6365J6044j2680k2197J9492
24967F6641m0379l1245J8442n502M63J6214p004m8789o2282r323j7676M875N6685
24954e8880L8459K9002k0176L420J8348N04R602K4120j9003L3682J2517k2919
$$ plain form
24942 48676 40658 60811 88701 91325 54752 -9145 -43719 -29890 8511 -3329 -441 18272
24930 18272 -21598 -35166 -42122 -29317 -12354 15696 -3758 -56546 -51125 -29749 -22533 -20649
24918 -20649 -21132 -10709 -54691 -90734 -84205 -71625 -49797 -62135 -9510 53964 58651 12977
24906 12977 3648 1938 -18759 -8153 -1898 -1579 10738 10755 4818 61099 78144 29238 22585 46346
24892 46346 29834 17878 33551 16003 375 3398 78069 105709 47775 -6588 -16506 19108
24880 19108 16110 11210 8356 -5679 -39759 -51573 -17560 -10796 6974 -9663 829 -19756
24868 -19756 -94565 -96104 -20531 39275 39509 -3344 -26566 36465 22239 -24922 -24996 -29972 -37860
24855 -37860 -55275 -18091 -19530 10784 18713 20540 25323 -25039 -48044 -29149 -40143 -25265
$$ packed form
24942D8676q018K0153K7890K624l6573o3897l4574J3829L8401j1840K888J8713
24930A8272l9870j3568o956J2805J6963K8050j9454n2788N421K1376P216J884
24918b0649m83J0423m3982l6043O529J2580K1828j2338N2625O3474M687m5674
24906A2977r329j710k0697J0606O255L19J2317J7n937N6281J7045m8906o653K3761
24892D6346j6512j1956J5673j7548j5628L023P4671K7640n7934n4363r918L5614
24880A9108k998m900k854j4035l4080j1814L4013O764J7770j6637J0492k0585
24868a9756p4809j539P5573N9806K34m2853k3222O3031j4226m7161p4m976p888
24855c7860j7415L7184j439L0314P929J827M783n0362k3005J8895j0994J4878
$$ plain form
24843 -25265 10768 -5417 -6611 -14867 -76022 -45853 -23412 -2209 719 22986 34878 6932
24831 6932 9643 -41898 -55792 -34455 -12310 -20582 -2144 46220 71134 122188 142468 109159
24819 109159 95467 67085 76812 65838 54288 40669 39632 31602 -3777 -21831 24830 23135
24807 23135 8685 7221 21806 52124 57604 36544 33777 62991 67945 37516 19261 35768
24795 35768 51018 68705 32255 18186 16055 69388 110365 123478 109378 67718 46628 52709
24783 52709 39593 34955 7215 14103 18309 -14133 -7478 18225 12470 12743 45039 20663 -11199
24770 -11199 7373 25654 17366 24459 9389 -10284 -3707 -41864 -51530 -21459 11173 22111
24758 22111 20044 17634 -28597 -21121 -1177 -12831 -3093 8141 -20537 -9679 -3191 -10790 -43045
$$ packed form
24843b5265L6033j6185j194q256o1155L0169K2441K1203K928K2267J1892k7946
24831F932K711n1541j3894K1337K2145q272J8438M8364K4914N1054K0280l3309
24819A09159j3692k8382R727j0974j1550j3619j037q030l5379j8054M6661j695
24807B3135j4450j464J4585L0318N480k1060k767K9214M954l0429j8255J6507
24795C5768J5250J7687l6450j4069k131N3333M0977J3113j4100m1660k1090O081
24783E2709j3116m638k7740O888M206l2442O655K5703n755K73L2296k4376l1862
24770a1199J8572J8281q288P093j5070j9673O577l8157r666L0071L2632J0938
24758B2111k067k410m6231P476J9944j1654R738J1234k8678J0858O488p599l2255
$$ plain form
24745 -43045 10465 61362 71912 93441 70621 37789 55512 36620 2092 -71 466 19820
24733 19820 43005 18566 -25848 -22811 12176 4637 -11688 22904 60532 75444 48739 -1239
24721 -1239 -57680 -103339 -74266 -36174 -25977 -25567 -36072 -37225 -53239 -65150 -46244 -8831
24709 -8831 36878 70348 56835 32137 -7630 -8569 -30535 -47809 923 -14576 -15680 4397
24697 4397 36358 58606 48167 32990 -8018 9722 10141 -5134 17355 11962 5566 -35193 -60398
24684 -60398 -24382 819 -2883 -47729 -38027 -30679 -71567 -85464 -29746 5971 22347 7520
24672 7520 -4531 28068 66676 68710 62202 45311 34526 62457 57948 29634 12636 -35341
24660 -35341 -49854 -2855 22918 33386 -11675 20896 69142 42923 24147 23130 -19065 -26717
$$ packed form
24745d3045N3510N0897J0550K1529k2820l2832J7723j8892l4528k163N37J9354
24733A9820K3185k4439m4414L037L4987p539j6325L4592L7628J4912k6705m9978
24721a239n6441m5659K9073L8092J0197M10j0505j153j6014j1911J8906L7413
24709h831M5709L3470j3513k4698l9767r39k1966j7274M8732j5499j104K0077
24697D397L1961K2248j0439j5177m1008J7740M19j5275K2489n393o396m0759k5205
24684f0398L6016K5201l702m4846R702P348m0888j3897N5718L5717J6376j4827
24672G520j2051L2599L8608K034o508j6891j0785K7931m509k8314j6998m7977
24660c5341j4513M6999K5773J0468m5061L2571M8246k6219j8776j017m2195p652
$$ plain form
24648 -26717 -45058 -53020 44258 49643 54938 97796 99506 68532 48397 34873 41319 54684 57771
24635 57771 73125 31385 58492 57258 65207 90517 19518 -42935 -56257 -79452 -115541 -135772
24623 -135772 -97380 -72864 -32172 -31550 -14858 -5893 -19369 -4723 -10940 -32455 -56046 -23849
24611 -23849 10911 17301 -9828 9615 3493 14476 29466 11188 -16377 -52006 -40242 -41211
24599 -41211 -79495 -73528 -58541 -34279 -40567 -32222 -6594 15432 294 29150 39475 2065
24587 2065 -17301 518 17546 19805 -898 -23359 -7375 38885 64879 65427 60881 4119 -32282
24574 -32282 -11769 -39719 -76758 -61590 -81662 -82633 -65857 -30584 -74076 -86065 -70486 -56728
24562 -56728 -11284 4185 42003 55556 17008 -17916 -1715 -12277 -49738 -34280 7534 -4086
$$ packed form
24648b6717j8341p962R7278N385N295M2858J710l0974k0135j3524O446J3365L087
24635E7771J5354m1740K7107j234P949K5310p0999o2453j3322k3195l6089k0231
24623a35772L8392K4516M0692O22J6692Q965j3476J4646o217k1515k3591L2197
24611b3849L4760O390k7129J9443o122J0983J4990j8278k7565l5629J1764r69
24599d1211l8284N967J4987K4262o288Q345K5628K2026j5138K8856J0325l7410
24587B065j9366J7819J7028K259k0703k2461J5984M6260K5994N48m546n6762l6401
24574c2282K0513k7950l7039J5168k0072r71J6776L5273m3492j1989J5579J3758
24562e6728M5444J5469L7818J3553l8548l4924J6201j0562l7461J5458M1814j1620
$$ plain form
24550 -4086 -34305 -9346 31378 29805 9756 -35248 -41898 -46406 -33010 13816 40923 17121
24538 17121 -20975 -32277 -36419 -56928 -74895 -70466 -49734 -78396 -86818 -75935 -36336 -11453
24526 -11453 -8698 5877 34070 40934 2001 -1924 33564 8031 -16565 -48826 -35194 22448
24514 22448 51522 46251 28588 15761 -8633 -23838 -11033 7075 19041 36470 8158 3670
24502 3670 23042 -7830 -5738 15247 20476 16897 -2992 -6873 -27655 -58927 -86350 -71607 -48601
24489 -48601 -38331 18266 4798 -28544 -41029 -11841 -28835 -58218 -43601 -12366 1141 -5023
24477 -5023 -22388 -24748 4653 6087 -9974 -6467 -31095 -48182 -38335 -27089 -45883 -51747 -43617
24464 -43617 -31289 -20842 -3299 -2800 36408 34449 744 -8903 40158 124892 119936 48694 64821
$$ packed form
24550d086l0219K4959M0724j573k0049m5004o650m508J3396M6826K7107k3802
24538A7121l8096j1302m142k0509j7967M429K0732k8662q422J0883L9599K4883
24526a1453K755J4575K8193O864l8933l925L5488k5533k4596l2261J3632N7642
24514B2448K9074n271j7663j2827k4394j5205J2805J8108J1966J7429k8312m488
24502C670J9372l0872K092K0985N229l579j9889l881k0782l1272k7423J4743K3006
24489d8601J0270N6597j3468l3342j2485K9188j6994k9383J4617L1235J3507o164
24477e023j7365k360K9401J434j6061L507k4628j7087R847J1246j8794n864Q130
24464d3617J2328J0447J7543M99L9208j959l3705r647M9061Q4734m956p1242J6127
$$ plain form
24451 64821 40133 19430 40742 50846 18721 -16972 -46598 -12702 19271 53307 74548 59690
24439 59690 52726 72572 18680 2880 3836 -13097 -29665 -36486 -33885 -27211 -13544 -45297 -59920
24426 -59920 -33296 12791 15511 7040 24588 12182 26513 50993 41707 30241 37669 43378 46251
24413 46251 27265 28988 170 22057 42649 88251 80651 32280 -292 13925 37973 14150
24401 14150 -17503 -45752 -1421 24713 10036 32809 3014 -20020 -17345 -2470 12302 6440
24389 6440 26489 -7987 4285 -37101 -46357 4330 45642 53097 22067 -10863 -34702 -7955
24377 -7955 4164 -42789 -73918 -47998 -34103 1782 36522 16148 -8410 -34137 -59072 -81352
24365 -81352 -70536 -56461 -59013 -60880 -29157 25337 32068 12365 6701 -17192 -63245 -71348 -77085
$$ packed form
24451F4821k4688k0703K1312J0104l2125l5693k9626L3896L1973L4036K1241j4858
24439E9690o964J9846n3892j5800R56j6933j6568o821K601O674J3667l1753j4623
24426e9920K6624M6087K720q471J7548j2406J4331K4480r286j1466P428N709K873
24413D6251j8986J723k8818K1887K0592M5602p600m8371l2572J4217K4048k3823
24401A4150l1653k8249M4331K6134j4677K2773k9795k3034K675J4875J4772n862
24389F440K0049l4476J2272m1386r256N0687M1312P455l1030l2930k3839K6747
24377g955J2119m6953l1129K5920J3895L5885L4740k0374k4558k5727k4935k2280
24365h1352J0816J4075k552j867L1723N4494O731j9703n664k3893m6053q103n737
$$ plain form
24352 -77085 -69227 -43145 -52180 -50876 -16075 -62814 -64954 -74672 -61684 -33934 -65280 -94839 -111214
24339 -111214 -111599 -41640 5424 49935 5921 -36489 -48636 -50735 -25125 10146 28058 -1526
24327 -1526 -30558 -52845 -39015 -16066 15684 32444 39725 56803 29389 5807 -8264 -7338
24315 -7338 38066 46487 52335 35823 36836 19660 -26033 -27701 38984 45532 -1884 -38147 -42734
24302 -42734 12099 31958 -2220 -523 18238 40976 28351 -14717 4015 11552 13793 7753
24290 7753 27494 21296 -53542 -25810 -8798 -55113 -54816 -27417 -49222 -79277 -78921 -66954 -75578
24277 -75578 -62545 -9877 -17061 -25036 -28608 -42133 2439 33764 54666 1573 -47937 -14282
24265 -14282 20195 22299 21864 12325 -15420 -30075 -12496 13674 10935 -13092 -39449 -43851 -39770
$$ packed form
24352g7085P858K6082r035J304L4801m6739k140r718J2988K7750l1346k9559j6375
24339a11214l85O9959M7064M4511m4014m2410j2147k099K5610L5271J7912k9584
24327a526k9032k2287J3830K2949L1750J6760P281J7078k7414k3582j4071R26
24315g338M5404Q421N848j6512J013j7176m5693j668O6685O548m7416l6263m587
24302d2734N4833J9859l4178J697J8761K2738j2625m3068J8732P537K241o040
24290G753J9741o198p4838K7732J7012m6315K97K7399k1805l0055L56J1967q624
24277g5578J3033N2668p184p975l572j3525M4572L1325K0902n3093m9510L3655
24265a4282L4477K104m35r539k7745j4655J7579K6170k739k4027k6357m402M081
$$ plain form
24252 -39770 -35287 -46360 -58139 -2657 31001 15621 -11636 -12936 -21406 -16583 14728 51274
24240 51274 37188 -4487 -27771 -43893 -40029 -37454 -17216 -19396 -6572 -31311 -98115 -117750
24228 -117750 -112377 -79096 -53785 -37735 -52803 -100527 -146884 -146570 -113605 -80923 -52545 -56097
24216 -56097 -49861 -25362 1789 -10758 -20642 -34503 -20583 9954 -4977 6600 35862 -9980
24204 -9980 -44843 -10299 33160 68901 42585 69672 75537 38875 27563 36959 65404 60503
24192 60503 18028 21960 -12634 -18828 42182 76604 65487 39247 27422 49446 19697 -23940
24180 -23940 -58708 -72081 -54748 -60784 -45208 -7577 -3042 -20833 10466 41754 9503 -8767
24168 -8767 16617 3034 -3782 42055 41946 20889 -16809 -53675 -64630 -89030 -82716 -30492 -37413
$$ packed form
24252c9770M483j1073j1779N5482L3658j5380k7257j300q470M823L1311L6546
24240E1274j4086m1675k3284j6122L864K575K0238k180J2824k4739o6804j9635
24228a17750N373L3281K5311J6050j5068m7724m6357L14L2965L2682K8378l552
24216e6097O236K4499K7151j2547r884j3861J3920L0537j4931J1577K9262m5842
24204i980l4863L4544M3459L5741k6316K7087N865l6662j1312R396K8445m901
24192F0503m2475L932l4594o194O1010L4422j1117k6240j1825K2024k9749m3637
24180b3940l4768j3373J7333o036J5576L7631M535j7791L1299L1288l2251j8270
24168h767K5384j3583o816M5837j09k1057l7698l6866j0955k4400O314N2224o921
$$ plain form
24155 -37413 -33332 -54157 -41239 -34300 -50806 -28550 -17969 -37632 -41167 -7848 11749 -20344
24143 -20344 -13749 -8006 -26749 -31967 -50031 -52842 46 6649 -11790 -37186 -71541 -67805 -32250
24130 -32250 -8162 -15902 -24486 -23853 3966 53932 42787 14529 -6243 28259 27170 495 28164
24117 28164 43451 12383 72101 76697 29917 -27776 -44518 4170 -3546 -6042 623 2544 -34929
24104 -34929 -88967 -54096 -2393 -13475 -75135 -79066 -56530 -71440 -47116 -1968 -12996 -51791
24092 -51791 -55496 -11048 31415 32624 -21225 -69981 -72027 -27688 -1965 29148 8665 -36719
24080 -36719 -49012 -70982 -52061 -39517 -5735 38013 37407 6129 -6811 11553 16281 -1880
24068 -1880 12963 -27354 -61912 -43343 -11296 -2430 -12137 -4630 -20972 -25856 21958 33550 17027
$$ packed form
24155c7413M081k0825J2918O939j6506K2256J0581j9663l535L3319J9597l2093
24143b0344O595N743j8743n218j8064k811N2888O603j8439k5396l4355L736L5555
24130c2250K4088p740q584O33K7819M9966j1145k8258k0772L4502j089k6675K7669
24117B8164J5287l1068N9718M596m6780n7693j6742M8688p716k496O665J921l7473
24104c4929n4038L4871N1703j1082o1660l931K2536j4910K4324M5148j1028l8795
24092e1791l705M4448M2463J209n3849m8756k046M4339K5723L1113k0483m5384
24080c6719j2293k1970J8921J2544L3782M3748o06l1278j2940J8364M728j8161
24068a880J4843m0317l4558J8569L2047Q866r707P507j6342m884M7814J1592j6523
$$ plain form
24055 17027 -40381 -39056 -42445 -39583 -16424 -29962 -83117 -103482 -71208 -29675 -17938 -39258
24043 -39258 -25212 -19866 -40881 -12628 21634 -21512 -66861 -36651 -38323 -68437 -46291 25776
24031 25776 95687 78257 46434 -5231 -26867 -39900 -22517 11052 -36498 -34306 -44844 -40150
24019 -40150 -31958 -16346 -2213 -10022 2935 18674 5591 -25152 -27799 11890 -7191 -61646
24007 -61646 -37397 -44415 -37314 -22561 1939 -3003 -44486 -75684 -26773 12129 13629 -21109
23995 -21109 -54308 -69776 -42618 -29459 -25566 -42133 -22262 -14432 -51455 -67058 -68508 -10397
23983 -10397 -5122 -26202 -19731 4777 45730 31417 38185 31191 7019 1347 -20239 -50088 -42354
23970 -42354 -37508 -35829 -30612 -56515 -76716 -70383 -67844 -33435 -16425 5025 34422 64776 38240
$$ packed form
24055A7027n7408J325l389K862K3159j3538n3155k0365L2274M1533J1737k1320
24043c9258J4046N346k1015K8253L4262m3146m5349L0210j672l0114K2146P2067
24031B5776O9911j7430l1823n1665k1636j3033J7383L3569m7550K192j0538M694
24019d0150Q192J5612J4133p809J2957J5739j3083l0743k647L9689j9081n4455
24007f1646K4249p018P101J4753K4500m942m1483l1198M8911L8902J500l4738
23995b1109l3199j5468K7158J3159L893j6567J9871P830l7023j5603j450N8111
23983a0397N275k1080O471K4508M0953j4313O768o994k4172n672k1586k9849P734
23970d2354M846J679N217k5903k0201O333K539L4409J7010K1450K9397L0354k6536
$$ plain form
23957 38240 21862 46980 97966 36927 -12681 -7029 -19605 -30961 19874 46694 59609 22616
23945 22616 -985 35289 36130 44910 12029 22393 25584 -27797 -23669 -5750 -40672 -90340 -86479
23932 -86479 -63582 -85353 -68548 -74514 -70286 -32238 -36204 -34592 -35187 -38732 -58979 -50757 -15368
23919 -15368 -12156 -36607 -57873 -16704 -17645 -36785 -27136 -5751 -48535 -45530 -14604 -65018 -104143
23906 -104143 -127457 -100802 -61178 -53091 -27852 -28305 -24777 -47496 -32877 -38764 -18768 -6574
23894 -6574 5491 -11055 -1510 -5791 -17117 -29932 -11175 -6543 -20444 -6266 43511 66545
23882 66545 12414 24236 60468 71272 67481 55937 40463 53120 72404 37943 42085 45079
23870 45079 29779 -10069 -21147 -25068 -1283 4967 18437 17548 21793 -2987 15121 40992 38991
$$ packed form
23957C8240j6378K5118N0986o1039m9608N652j2576j1356N0835K6820J2915l6993
23945B2616k3601L6274Q41Q780l2881J0364L191n3381M128J7919l4922m9668L861
23932h6479K2897k1771J6805n966M228L8048l966J612n95l545k0247Q222L5389
23919a5368L212k4451k1266M1169r41j9140R649K1385m2784L005L0926n0414l9125
23906a04143k3314K6655L9624Q087K5239m53L528k2719J4619n887J9996J2194
23894f574J2065j6546R545m281j1326j2815J8757M632j3901J4178M9777K3034
23882F6545n4131J1822L6232J0804l791j1544j5474J2657J9284l4461M142K994
23870D5079j5300l9848j1078l921K3785O250J3470q89M245k4780J8108K5871k001
$$ plain form
23857 38991 31662 24143 21246 24208 51695 82130 52990 39055 10276 -15111 -25097 -30884 -37830
23844 -37830 -50401 -94094 -80431 -15374 -9541 22084 72438 60635 -2556 -9832 -43956 -58437
23832 -58437 -51101 -14569 12903 -4784 -18613 5917 1201 -23741 -27583 5475 33118 8909
23820 8909 9788 47636 47570 4733 -26987 -28151 19307 1496 -23684 -34168 -5933 -19356 -13439
23807 -13439 -17371 -11154 18358 26923 8177 -32341 -881 -21075 -20656 -40341 -36636 -6333 -2129
23794 -2129 -6025 10657 38089 13791 33688 26565 32112 17813 16415 4323 12646 -9582 28027
23781 28027 79473 67421 67540 60705 62543 41993 13070 20178 4344 -1314 -10629 -283 21625
23768 21625 21255 13654 4643 -25410 -44121 -74299 -71515 -96011 -94999 -35189 30478 6228 3625
$$ packed form
23857C8991p329p519k897K962K7487L0435k9140j3935k8779k5387r986n787o946
23844c7830j2571m3693J3663O5057N833L1625N0354j1803o3191p276l4124j4481
23832e8437P336L6532K7472j7687j3829K4530m716k4942l842L3058K7643k4209
23820H909Q79L7848o6m2837l1720j164M7458j7811k5180j0484K8235j3423N917
23807a3439l932O217K9512Q565j8746m0518L1460k0194M19j9685L705L0303M204
23794b129l896J6682K7432k4298J9897p123N547j4299j398j2092Q323k2228L7609
23781B8027N1446j2052J19o835J838k0550k8923P108j5834n658r315J0346K1908
23768B1625l70p601r011l0053j8711l0178K784k4496J012N9810O5667k4250k603
$$ plain form
23755 3625 -13542 -28321 -24297 14363 24440 -2580 -1078 -39243 -79229 -98043 -98057 -74026 -77104
23742 -77104 -89006 -110442 -122288 -104561 -88900 -64183 -38270 -26986 -30710 -16542 -3020 -22759
23730 -22759 -28421 -36687 -36866 -51173 -39532 -5599 37220 39202 9311 7604 18572 -6679 -28776
23717 -28776 1640 61349 42907 54658 48161 -6154 -22143 -56859 -58019 -79033 -111682 -75500
23705 -75500 -51381 -19668 8341 21978 -2927 -21662 -50179 -40898 -31634 6805 7491 -18166
23693 -18166 -30542 -43049 6290 53019 16204 -19472 -31537 -28563 8882 39689 18546 -43130
23681 -43130 -57831 -32272 -25654 -31859 -47193 -23216 12546 42491 45223 15532 -29950 -44278
23669 -44278 -56939 -56110 -31249 -25573 -25201 27957 76546 86043 49603 -11016 -13505 6880 52938
$$ packed form
23755C625j7167j4779M024L8660J0077k7020J502l8165l9986j8814j4K4031l078
23742g7104j1902k1436j1846J7727J5661K4717K5913J1284l724J4168J3522j9739
23730b2759n662q266j79j4307J1641L3933M2819J982k9891j707J0968k5251k2097
23717b8776L0416N9709j8442J1751o497n4315j5989l4716j160k1014l2649L6182
23705g5500K4119L1713K8009J3637k4905j8735k8517R281R264L8439O86k5657
23693a8166j2376j2507M9339M6729l6815l5676j2065K974L7445L0807k1143o1676
23681d3130j4701K5559O618o205j5334K3977L5762K9945K732k9691m5482j4328
23669d4278j2661Q29K4861N676L72N3158M8589R497l6440o0619k489K0385M6058
$$ plain form
23656 52938 67356 82562 85122 32113 19323 28340 2454 -16859 -65665 -32451 -32071 -28819 115
23643 115 4303 7410 8915 -40258 -44366 -12740 -13119 -2730 -25623 -3532 31070 67591 71169
23630 71169 34552 16448 14898 -1775 -80471 -59052 -83809 -64891 -15489 -49910 -39289 3160
23618 3160 -15689 -31091 -25497 -8033 5464 -13928 -29839 -50683 -38546 -24436 -58510 -20480
23606 -20480 17214 12328 -1070 -15797 -24234 -12375 -16529 -11497 -11847 -5681 34818 46763 -20767
23593 -20767 -103991 -95792 -63277 -65887 -89129 -54484 -4405 -8790 16223 18285 16895 4905 23780
23580 23780 11824 22991 29061 14136 37897 44796 -1894 4650 38887 34051 -16993 6855
23568 6855 13507 -14187 -12441 -12765 -60919 -68770 -25995 -9393 -24476 4630 36487 54115 18874
$$ packed form
23656E2938J4418J5206K560n3009j2790R017k5886j9313m8806L3214L80L252K8934
23643A15M188L107J505m9173m108L1626l79J0389k2893K2091L4602L6521L578
23630G1169l6617j8104j550j6673p8696K1419k4757J8918M9402l4421J0621M2449
23618C160j8849j5402N594J7464J3497j9392j5911k0844J2137J4110l4074L8030
23606b0480L7694m886j3398j4727q437J1859m154N032l50O166M0499J1945o7530
23593b0767q3224Q199L2515k610k3242L4645N0079m385K5013K062j390j1990J8875
23580B3780j1956J1167O070j4925K3761O899m6690O544L4237m836n1044K3848
23568F855O652k7694J746l24m8154p851M2775J6602j5083K9106L1857J7628l5241
$$ plain form
23555 18874 1495 -5390 -33715 -51454 -21608 12520 -26223 -26131 6848 13873 -1065 18687 13763
23542 13763 -2978 -67264 -69347 -69847 -62740 -27793 -44680 -43834 -35639 -25503 27454 14028 -9828
23529 -9828 -28829 24534 47429 10129 -16011 -27414 -7710 2339 -6611 -31275 -64744 -90278
23517 -90278 -62406 -46318 -55070 -42253 -34351 -1554 2461 -9432 -10063 6810 -5662 -34499 -47222
23504 -47222 -48002 -41575 -55034 -56183 -43496 -32599 -43492 -49210 -65172 -73113 -87836 -95913 -91492
23491 -91492 -45060 -11031 33913 65677 35157 4777 5115 18297 8731 -26408 -79955 -78337
23479 -78337 -47172 -9352 -14910 -36296 -58076 -60946 -31012 4624 9455 -4529 16345 -9008
23467 -9008 -33608 -28526 763 -2018 22075 2964 -42159 -27978 -45729 -81832 -105258 -38698
$$ packed form
23555A8874j7379o885k8325j7739K9846L4128l8743R2L2979P025j4938J9752m924
23542A3763j6741o4286k083n00P107L4947j6887Q46Q195J0136N2957j3426k3856
23529i828j9001N3363K2895l7300k6140j1403J9704J0049q950k4664l3469k5534
23517i0278K7872J6088q752J2817P902L2797M015j1893o31J6873j2472k8837j2723
23504d7222p80O427j3459j149J2687J0897j0893n718j5962p941j4723q077M421
23491i1492M6432L4029M4944L1764l0520l0380L38J3182r566l5139n3547J618
23479g8337L1165L7820n558k1386k1780k870K9934L5636M831j3984K0874k5353
23467i008k4600N082K9289k781K4093j9111m5123J4181j7751l6103k3426O6560
$$ plain form
23455 -38698 13031 28383 13198 -22432 -23973 140 -4374 -14931 -10683 -10347 -32122 -25269 -66154
23442 -66154 -56366 -30363 -50818 -79861 -37491 -54445 -25368 -6689 -2027 30399 25962 28199
23430 28199 -6093 -43500 -43867 -61488 -69497 -41824 -4866 5511 3840 -14599 -39341 -41553 -64335
23417 -64335 -77727 -61372 -27689 -2366 13405 9854 -1884 -14239 -39635 -14459 -21806 -28806
23405 -28806 -12775 -28712 -66588 -48305 -32423 -20515 20739 65555 88355 54239 30977 13263
23393 13263 11559 9020 -18303 -15537 19062 5875 15371 125 22752 16837 -12094 -24990 -24435
23380 -24435 -37418 -41117 -12845 -7429 -24060 -41521 -65192 -70888 -69951 -73007 -63755 -19392 -20234
23367 -20234 -35165 -45573 -62071 -85091 -91888 -34005 -30794 -9116 -7315 -24712 -15399 4123
$$ packed form
23455c8698N1729J5352j5185l5630j541K4113m514j0557M248L36k1775O853m0885
23442f6154R788K6003k0455k9043M2370j6954K9077J8679M662L2426m437K237
23430B8199l4292l7407l67j7621q009K7673L6958J0377j671j8439k4742k212k2782
23417f4335j3392J6355L3683K5323J5771l551j1738j2355k5396K5176p347p000
23405b8806J6031j5937l7876J8283J5882J1908M1254M4816K2800l4116k3262j7714
23393A3263j704k539k7323K766L4599j3187R496j5246K2627n915k8931j2896N55
23380b4435j2983l699K8272N416j6631j7461k3671n696R37l056R252M4363q42
23367b0234j4931j0408j6498k3020o797N7883L211K1678J801j7397R313J9522
$$ plain form
23355 4123 -29912 -41206 -48509 -76872 -109920 -113254 -66691 -33518 -16866 -61864 -47842 -28195
23343 -28195 -38653 -12839 36597 30008 761 17016 19613 -6631 -11726 -54739 -48885 -32507
23331 -32507 -23912 -35841 -33885 -3371 39255 53066 32088 22995 4270 -31882 -25583 -31601 -78022
23318 -78022 -85133 -59704 -88223 -76994 -48965 -55042 -61071 -63037 -19151 56254 111907 115721 68545
23305 68545 19744 15902 53623 64660 22465 12343 -9252 -18441 -42666 -80124 -66666 -11032
23293 -11032 -25971 -45408 -22400 -7834 31777 81113 32751 -21376 -4390 6603 -3645 -44624
23281 -44624 -48074 -67771 -30707 -8926 -3552 27909 8253 -19120 -29197 -42309 -19232 -22051
23269 -22051 -563 -12761 -51395 -55938 -18728 -8247 8415 65559 79575 45793 37125 58037
$$ packed form
23355D123l4035j1294p303k8363l3048l334M6563L3173J6652m4998J4022J9647
23343b8195j0458K5814M9436o589k9247J6255K597k6244n095m3013N854J6378
23331c2507Q595j1929J956L0514M2626J3811k0978r093j8725l6152O299o018m6421
23318g8022p111K5429k8519J1229K8029o077o029j966M3886P5405N5653L814m7176
23305F8545m8801l842L7721J1037m2195j0122k1595r189k4225l7458J3458N5634
23293a1032j4939j9437K3008J4566L9611M9336m8362n4127J6986J0993j0248m0979
23281d4624l450j9697L7064K1781N374L1461j9656k7373j0077j3112K3077k819
23269b2051K1488j2198l8634m543L7210J0481J6662N7144J4016l3782q668K0912
$$ plain form
23257 58037 29403 12813 14242 19681 33205 42703 27415 -1622 -49296 -28890 -16222 22746
23245 22746 10084 -5282 -7466 -20494 -24398 16013 39685 -4262 -8708 -19783 10435 -270
23233 -270 -31408 -29291 -34896 -86120 -100043 -66271 -31431 9411 68269 27068 -8157 -39431
23221 -39431 1776 -3976 -656 34469 -1351 -23522 -41519 -53555 -40650 -71877 -92430 -57580
23209 -57580 -24692 -11856 43249 64799 80615 87828 51146 10212 -5356 57 3742 8956
23197 8956 42932 49093 28555 -3553 -9251 -18520 -36223 -40273 -27645 -22746 2477 -27360 -38393
23184 -38393 -13056 -27215 -20612 -1672 5632 52354 69178 74278 57046 54554 58648 30666 24901
23171 24901 21547 22913 -8476 -45280 -1775 41096 201 -10196 5665 5384 -27204 -23284 -13153
$$ packed form
23257E8037k8634j6590J429N439J3524R498j5288k9037m7674K0406J2668L8968
23245B2746j2662j5366k184j3028l904M0411K3672m3947m446j1075L0218j0705
23233b70l1138K117n605n1224j3923L3772L4840M0842N8858m1201l5225l1274
23221c9431M1207n752L320L5125l5820k2171j7997j2036J2905l1227k0553L4850
23209e7580L2888J2836N5105K1550J5816P213l6682m0934j5568N413L685N214
23197H956L3976O161k0538l2108n698r269j7703m050J2628M899K5223k9837j1033
23184c8393K5337j4159O603J8940P304M6722J6824N100j7232k492M094k7982n765
23171B4901l354J366l1389l6804M3505M2871m0895j0397J5861k81l2588L920J0131
$$ plain form
23158 -13153 5577 17199 28141 48232 46133 57345 72899 55634 39913 19523 25062 28175
23146 28175 -828 -6349 23623 27970 32579 -7097 3716 47420 33158 32017 50262 56312 34119
23133 34119 48551 47676 33006 19601 -72 25371 22290 22284 23760 42602 2280 -42882 -32646
23120 -32646 6365 1703 13197 14406 700 2256 -53792 -133644 -132818 -104254 -115919 -95350 -61408
23107 -61408 9452 35584 27943 -9792 -14728 17201 25958 51468 32540 22284 22449 15829 -27186
23094 -27186 -30986 -2216 24951 -3170 -17647 4951 845 18688 19533 -14271 -28967 -31083 -4181
23081 -4181 -38559 -86574 -92296 -89138 -57487 -16886 -638 -17633 -3414 -4924 -9630 8605 52329
23068 52329 50984 28984 45363 33682 -6526 -27584 27987 38904 32431 14429 -6928 -420
$$ packed form
23158a3153J8730J1622J0942K0091k099J1212J5554j7265j5721k0390N539L113
23146B8175k9003n521K9972M347M609l9676J0813M3704j4262j141J8245O050k2193
23133C4119J4432q75j4670j3405j9673K5443l081oJ476J8842m0322m5162J0236
23120c2646L9011m662J1494J209j3706J556n6048p9852Q26K8564j1665K0569L3942
23107f1408P0860K6132p641l7735m936L1929Q757K5510j8928j0256J65o620m3015
23094b7186l800K8770K7167k8121j4477K2598m106J7843Q45l3804j4696k116K6902
23081d181l4378m8015n722L158L1651M0601J6248j6995J4219j510m706J8235M3724
23068E2329j345k2000J6379j1681m0208k1058N5571J0917o473j8002k1357O508
$$ plain form
23056 -420 10272 -8426 -27894 -53122 -60439 -27555 -24439 -27940 -19397 -11590 -2106 -18732 -34796
23043 -34796 -41324 -53227 -58425 -19820 -24822 -31510 -20207 5192 -4782 -8192 -11168 -3659 35810
23030 35810 8303 1423 19886 32666 2863 -3153 32355 21569 4518 4817 -2505 -1324 -3328
23017 -3328 29398 2084 3898 5455 -25246 -69491 -96796 -74304 -20875 -25409 -60492 -42612
23005 -42612 -21557 3464 -54611 -68646 -28078 -2152 17014 -411 -16199 -37997 -53727 -17644
22993 -17644 -20680 -22481 -53687 -75180 -89410 -43660 -12360 -13676 -63050 -83296 -88646 -67989
22981 -67989 -44314 33589 57882 42808 13361 -17519 -38545 -26461 -30364 -29966 -46861 -18133
22969 -18133 10407 3447 15585 5038 -229 -27918 -40411 -69475 -86145 -85825 -122560 -93974
$$ packed form
23056d20J0692j8698j9468k5228p317L2884L116l501Q543P807R484j6626j6064
23043c4796o528j1903n198L8605n002o688J1303K5399r974l410k976P509L9469
23030C5810k7507o880J8463J2780k9803o016L5508j0786j7051K99p322J181k004
23017c328L2726k7314J814J557l0701m4245k7305K2492N3429m534l5083J7880
23005d2612K1055K5021n8075j4035M0568K5926J9166j7425j5788k1798j5730L6083
22993a7644l036j801l1206k1493j4230M5750L1300j316m9374k0246n350K0657
22981f7989K3675P7903K4293j5074k9447l0880k1026J2084l903L98j6895K8728
22969a8133K8540o960J2138j0547n267k7689j2493k9064j6670L20l6735K8586
$$ plain form
22957 -93974 -77003 -44987 -15227 20365 6552 -19260 168 27089 3834 -56533 -72504 -70582
22945 -70582 -69809 -36086 1354 2128 -43814 -62573 -32347 -23067 -13576 -13621 11575 11613 9160 31937
22931 31937 53727 50888 29742 2701 -15636 12990 80944 110610 106918 38042 -9976 -26490
22919 -26490 -38783 -32200 -20985 15640 56512 43455 21619 -5642 12956 29356 1675 -29297
22907 -29297 -27144 -14455 5415 -15654 -34304 -47157 -63994 -28879 16462 15491 22854 -22714
22895 -22714 -47134 -31061 -14765 15438 52900 60308 56292 5559 -4288 -2458 5884 -3421 -2698
22882 -2698 18864 27134 14181 9801 32423 47633 53798 12071 4179 46579 79637 52250 9371
22869 9371 -14046 2736 4222 37590 17482 -2081 18635 5506 19286 44403 67952 55084
$$ packed form
22957i3974J6971L2016K9760L5592j3813k5812J9428K6921k3255o0367j5971J922
22945g0582P73L3723L7440P74m5942j8759L0226R280R491m5K5196L8k453K2777
22931C1937K1790k839k1146k7041j8337K8626O7954K9666l692o8876m8018j6514
22919b6490j2293O583J1215L6625M0872j3057k1836k7261J8598J6400k7681l0972
22907b9297K153J2689J9870k1069j8650j2853j6837L5115M5341r71P363m5568
22895b2714k4420J6073J6296L0203L7462P408m016n0733r847J830Q342r305P23
22882b698K1562Q270j2953m380K2622J5210O165m1727p892M2400L3058k7387m2879
22869I371k3417J6782J486L3368k0108j9563K0716j3129J3780K5117K3549j2868
$$ plain form
22857 55084 43384 47049 19096 9015 11820 -3977 -3393 -1070 2578 1389 -16098 2793 9215
22844 9215 8621 13557 38777 22531 -32254 -22860 -4092 -4632 -2542 -17395 4355 18938 21161
22831 21161 11732 37379 57909 62528 79752 45328 38505 43682 13482 32971 11518 -16218
22819 -16218 -43857 -42068 -41009 -40212 -27955 12080 26926 46772 64812 97620 91159 43952 -1473
22806 -1473 -16079 -46796 -86189 -63343 -57726 -33357 48999 120212 124363 63746 46083 30734
22794 30734 4721 -34363 -42929 -34224 -42512 -26335 -6001 -15015 6331 54225 91608 94557 102287
22781 102287 102380 56043 4348 -11780 -8906 510 -64066 -73737 -25237 -26106 -40076 -72350 -54394
22768 -54394 -18834 665 3098 1558 0 45388 49910 58318 56831 56615 52579 32671 -5684
$$ packed form
22857E5084j1700L665k7953j0081K805j5797N84K323L648j189j7487J8891O422
22844I215n94M936K5220j6246n4785R394J8768n40K090j4853K1750J4583K223
22831B1161r429K5647K0530M619J7224l4424o823N177l0200J9489k1453k7736
22819a6218k7639J789J059P97J2257M0035J4846J9846J8040L2808o461m7207m5425
22806a473j4606l0717l9393K2846N617K4369Q2356P1213M151o0617j7663j5349
22794C0734k6013l9084q566Q705q288J6177K0334r014K1346M7894L7383K949P730
22781A02287R3m6337n1695j6128K874R416o4576r671M8500q69j3970l2274J7956
22768e4394L5560J9499K433j540j558M5388M522Q408j487k16m036j9908l8355
$$ plain form
22755 -5684 -16476 -1801 -52686 -69713 -50558 -5995 3905 21727 74924 35764 -12404 -3709
22743 -3709 2431 13301 13665 24266 18465 -3484 -29828 -73699 -107703 -78112 -30961 -30858 -45634
22730 -45634 -84291 -71644 -75027 -91848 -68996 -91855 -97932 -77859 -34602 25947 28969 22388
22718 22388 -1846 -64705 -102896 -85934 -85265 -68789 -59148 -30507 -40243 -46604 -14220 16871 14458
22705 14458 16759 28726 43143 13132 -16257 -60181 -88801 -33576 -34141 -32624 -6428 -1764 3239
22692 3239 -18160 -18180 -5863 -15940 -81093 -60200 -44374 -40351 -2100 31686 13486 -15941 -33145
22679 -33145 -67572 -47584 -57360 -61588 -56100 -44019 -44253 -23518 -24102 -31175 -19882 5744 39833
22666 39833 39873 36111 41100 46126 31381 -39714 -78695 -93426 -62664 -28276 513 7187 -14116
$$ packed form
22755e684j0792J4675n0885j7027J9155M4563R900J7822N3197l9160m8168Q695
22743c709O140J0870L64J0601n801k1949k6344m3871l4004K9591M7151J03j4776
22730d5634l8657J2647l383j6821K2852k2859o077K0073M3257O0549L022o581
22718B2388k4234o2859l8191J6962O69J6476R641K8641r736o361L2384L1091k413
22705A4458K301J1967J4417l0011k9389m3924k8620N5225n65J517K6196M664N003
22692C239k1399k0J2317j0077o5153K0893J5826M023L8251L3786j8200k9427j7204
22679c3145l4427J9988r776m228N488J2081k34K0735n84p073J1293K5626L4089
22666C9833M0l762M989N026j4745p1095l8981j4731L0762L4388K8789O674k1303
$$ plain form
22653 -14116 -4893 -10908 -25482 11556 -17636 -48710 -35480 -12400 -46545 -67263 -11741 -5310
22641 -5310 -44590 -41779 22122 35906 4775 -24185 -1481 -4053 -49250 -29134 10953 67248
22629 67248 47191 733 -7466 -35345 -67791 -72400 -65777 -36670 18819 33824 5350 -7642
22617 -7642 -3959 -9880 4071 46353 71534 56042 -21007 -51259 -38842 -38211 26354 78568 69654
22604 69654 -10355 -46477 -58813 -60440 -37741 -19160 12352 -27762 -41387 -79158 -77086 -30804
22592 -30804 -2395 12679 26560 16751 -7088 -2707 -15156 -46127 -49149 -60321 -55360 -37641
22580 -37641 -14053 18907 48774 45397 6576 -24803 -42137 -37433 -19267 20902 16511 -56717
22568 -56717 -92411 -75223 -79748 -40195 -10176 -9443 -31894 -2735 -9444 -2265 4666 22059 1949
$$ packed form
22653a4116R223o015j4574L7038k9192l1074J3230K3080l4145k0718N5522O431
22641e310l9280K811O3901J3784l1131k8960K2704k572m5197K0116M0087N6295
22629F7248k0057m6458q199k7879l2446m609O623K9107N5489J5005k8474j2992
22617g642L683n921J3951M2282K5181j5492p7049l0252J2417O31O4565N2214q914
22604F9654q0009l6122j2336j627K2699J8581L1512m0114j3625l7771K072M6282
22592c0804K8409J5074J3881r809k3839M381j2449l0971l022j1172M961J7719
22580c7641K3588L2960K9867l377l8821l1379j7334M704J8166M0169m391p3228
22568e6717l5694J7188m525L9553L0019P33k2451K9159o709P179O931J7393k0110
$$ plain form
22555 1949 -26909 -15073 -23140 -31761 -34635 -19626 18838 49509 4205 15791 41657 30953
22543 30953 8899 -17210 -16502 -27060 -33332 -48337 -64574 -3787 -8698 -41755 -32254 -20600 -18706
22530 -18706 4328 18185 32362 17476 5336 -4670 -27046 -52200 -28245 -35409 -56143 -13479
22518 -13479 19072 25245 9637 14843 33748 72913 78972 58471 37474 22710 37960 24643
22506 24643 -28900 -41718 -32696 -41561 -54344 -26938 11499 15070 -10262 -29777 -20580 23429
22494 23429 62791 59906 50900 21549 16490 7320 31259 34150 36665 -22507 4058 9898 3828
22481 3828 17213 44502 47892 49161 45669 68491 71667 50647 53719 63290 60528 108073 101290
22468 101290 89106 80601 51932 20829 17816 189 -4071 -15922 -17812 -43671 -58427 -31135
$$ packed form
22555A949k8858J1836q067q621k874J5009L8464L0671m5304J1586K5866j0704
22543C0953k2054k6109P08j0558o272j5005j6237O0787m911l3057R501J1654J894
22530a8706K3034J3857J4177j4886j2140j0006k2376k5154K3955p164k0734M2664
22518a3479L2551O173j5608N206J8905L9165O059k0501k0997j4764J5250j3317
22506B4643n3543j2818R022q865j2783K7406L8437L571k5332j9515R197M4009
22494B3429L9362k885r006k9351n059r170K3939K891K515n9172K6565N840o070
22481C828J3385K7289L390J269l492K2822L176k1020L072R571k762M7545o783
22468A01290j2184q505k8669l1103l013j7627m260j1851j890k5859j4756K7292
$$ plain form
22456 -31135 -12395 7904 15304 4588 -1274 -16420 -51799 -56440 -52637 -27023 -38488 -59171
22444 -59171 -37949 -44311 -67722 -105913 -81663 -43749 825 6242 -2493 5761 3117 -9885 3714
22431 3714 49859 56920 31313 -13728 -3485 -32018 -83490 -86362 -54533 -63436 -37330 -6576
22419 -6576 30651 2071 19835 51899 41636 22485 10734 -20657 -15745 -30985 -17780 -12859
22407 -12859 -25588 -35180 -57699 -47859 -9895 14631 4517 3515 -28453 -32493 -16693 -32937
22395 -32937 -22952 44943 63741 42815 36936 24391 25692 62692 99418 88409 70729 59353
22383 59353 56916 57163 21106 -11119 -29919 -35340 -42616 -41544 -45215 -10490 34908 25903 3724
22370 3724 21439 22057 7492 -9257 -14287 12384 -11572 -13719 11592 57290 75072 75510 35540
$$ packed form
22456c1135J8740K0299P400j0716n862j5146l5379m641L803K5614j1465k0683
22444e9171K1222o362k3411l8191K4250L7914M4574N417q735Q254k644j3002J3599
22431C714M6145P061k5607m5041J0243k8533n1472k872L1829q903K6106L0754
22419f576L7227k8580J7764L2064j0263j9151j1751l1391M912j5240J3205M921
22407a2859j2729r592k2519R840L7964K4526j0114j002l1968m040J5800j6244
22395c2937R985O7895J8798k0926n879j2545J301L7000L6726j1009j7680j1376
22383E9353k437K47l6057l2225j8800n421p276J072l671L4725M5398r005k2179
22370C724J7715O18j4565j6749n030K6671k3956k147K5311M5698J7782M38l9970
$$ plain form
22357 35540 9692 -39625 -61091 -54884 -23594 7542 927 49675 28264 17404 16565 7612 13522
22344 13522 10663 -6628 -40122 -41948 -25575 -10384 -11022 -30469 -16393 -37917 -51011 -9378
22332 -9378 63245 22621 14587 -7789 -33328 -13239 54310 100923 107838 85652 60962 32724
22320 32724 31611 39855 7030 -15811 -15988 -52333 -48969 -32049 9792 55219 82914 78714 90529
22307 90529 69149 40485 45900 64265 57066 81156 40032 -33348 -67609 -73428 -17404 31763
22295 31763 50209 61065 87219 109814 101378 44933 -11339 -11334 -3560 -13740 -15201 9815 2591
22282 2591 21936 27622 -5961 -21692 -18131 -38942 -10671 7381 26988 28500 -655 -43001
22270 -43001 -56444 -41559 3129 20844 12496 23912 -793 -36878 -3234 8449 -24674 -68261
$$ packed form
22357C5540k5848m9317k1466O207L1290L1136o615M8748k1411j0860q39q953N910
22344A3522k859j7291l3494j826J6373J5191o38j9447J4076k1524j3094M1633
22332i378P2623m0624q034k2376k5539K0089O7549M6613O915k2186k4690k8238
22320C2724j113Q244l2825k2841j77l6345L364J6920M1841M5427K7695m200J1815
22307I0529k1380k8664N415J8365p199K4090m1124p3380l4261n819N6024M9167
22295C1763J8446J0856K6154K2595q436n6445n6272NP774j0180j461K5016p224
22282B591J9345N686l3583j5731L561k0811K8271J8052J9607J512k9155m2346
22270d3001j3443J4885M4688J7715q348J1416k4705l6085L3644J1683l3123m3587
$$ plain form
22258 -68261 -12962 63674 46434 25727 37108 13646 34818 71825 48267 -16443 -19219 -5382
22246 -5382 -17840 -21630 1001 26542 -22152 -40381 -50124 -23645 23840 49881 73062 10788
22234 10788 -17537 3282 37216 26392 4059 -6179 -51583 -97848 -106386 -79794 -34330 9212
22222 9212 22832 34236 59154 38582 20082 39134 41357 17188 -7995 -47657 -77963 -98914
22210 -98914 -77202 -52789 -72257 -98347 -93956 -29884 16666 -5664 20059 30896 27100 4446
22198 4446 4890 14127 -42145 -84422 -82430 -47635 26536 36762 21368 -29029 -41773 -42241 -43190
22185 -43190 -59235 -41861 18454 64591 -2685 -102350 -102624 -64411 -41263 -58045 -43272 -11304
22173 -11304 34990 48511 29719 8509 16759 10179 30455 55488 44064 59517 97713 103064
$$ packed form
22258f8261N5299P6636j7240k0707J1381k3462K1172L7007k3558o4710k776J3837
22246e382j2458l790K2631K5541m8694j8229r743K6479M7485K6041K3181o2274
22234A0788k8325K0819L3934j0824k2333j0238m5404m6265q538K6592M5464M3542
22222I212J3620J1404K4918k0572j8500J9052K223k4169k5183l9662l0306k0951
22210i8914K1712K4413j9468k6090M391O4072M6550k2330K5723J0837l796k2654
22198D446M44R237n6272m2277J992L4795P4171J0226j5394n0397j2744m68r49
22185d3190j6045J7374O0315M6137o7276r9665k74L8213K3148j6782J4773L1968
22173a1304M6294J3521j8792k1210Q250o580K0276K5033j1424J5453L8196N351
$$ plain form
22161 103064 89730 70415 40679 49072 40969 -2883 -27758 -10176 -16341 -14331 -7050 -17701
22149 -17701 -13913 -3565 23061 20191 15022 24688 32790 45396 45095 62312 43435 21439 -23611
22136 -23611 -25396 31699 35429 38764 26394 12629 -2729 -31580 -45961 -55256 -36158 5215
22124 5215 38175 29461 38792 31231 10116 9643 35101 24380 -4415 -62494 -34616 -14920 -16652
22111 -16652 -2861 10728 4327 6862 18064 83057 123883 41767 15735 17513 30207 32674
22099 32674 17705 43001 47287 21040 4865 -25506 -19507 13934 15983 47542 18645 -8054
22087 -8054 -21924 27827 33865 35174 19613 -22451 -14150 -1800 16067 93177 90658 104075 97339
22074 97339 89782 108243 101088 110267 118688 146411 208666 328522 535889 778964 921991 914508
$$ packed form
22161A03064j3334j9315k9736Q393q103m3852k4875J7582o165K010P281j0651
22149a7701L788J0348K6626k870n169R666Q102J2606l01J7217j8877k1996m5050
22136b3611j785N7095L730L335j2370j3765j5358k8851j4381r295J9098M1373
22124E215L2960q714R331p561k1115m73K5458j0721k8795n8079K7878J9696j732
22111a6652J3791J3589o401K535J1202O4993M0826q2116k6032J778J2694K467
22099C2674j4969K5296M286k6247j6175l0371N999L3441K049L1559k8897k6699
22087h054j3870M9751O038J309j5561m2064Q301J2350J7867P7110k519J3417o736
22074I7339p557J8461p155R179Q421K7723O2255J19856K07367K43075J43027p483
$$ plain form
22062 914508 759903 538916 407230 265709 183873 202835 211214 212602 204951 160469 146039
22051 146039 175110 247259 307475 444117 602301 801323 944105 909508 717316 506969
22041 506969 359586 247641 156738 99263 62943 74816 94239 79648 74913 84141 58869
22030 58869 55470 57875 45156 31088 11802 8887 19041 35521 -1905 -5201 13516 12261 -12731
22017 -12731 -28608 -47654 -64097 -46643 -2229 -1501 -2240 842 7784 -4352 2176 -16325 -69116
22004 -69116 -53634 21758 55484 57193 -11751 -55402 -22733 33456 9004 19608 39533 52169
21992 52169 35298 15737 4910 -30652 -13507 2909 3189 -9301 -9637 219 -22610 -9769 -588
21979 -588 4229 30297 23966 28358 36846 36091 -22109 -25015 -7113 33318 19000 -4920 1411 30463
$$ packed form
22062I14508j54605k20987j31686j41521q1836J8962Q379J388p651m4482j4430
22051A46039K9071P2149O0216J36642J58184J99022J42782l4597j92192k10347
22041E06969j47383j11945r0903n7475l6320J1873J9423j4591m735R228k5272
22030E8869l399K405j2719j4068j9286k915J0154J6480l7426l296J8717j255k4992
22017a2731j5877j9046j6443J7454M4414P28p39L082O942j2136O528j8501n2791
22004f9116J5482P5392L3726J709o8944m3651L2669N6189k4452J0604J9925J2636
21992E2169j6871j9561j0827l5562J7145J6416K80j2490l36R856k2829J2841R181
21979e88M817K6068o331M392Q488p55n8200k906J7902M0431j4318k3920O331K9052
$$ plain form
21965 30463 3310 -23679 -21956 -21879 -33235 6877 863 19950 48463 38869 14978 9597 11728
21952 11728 38064 33499 -23573 -46878 -31127 10936 60087 57260 30259 20020 38672 18932
21940 18932 30570 40819 69738 92983 102843 95627 44535 14815 34530 23232 33504 39365
21928 39365 48089 27468 -23159 -34172 -46685 -7533 25574 30575 -23694 -32700 -12946 11309
21916 11309 40796 48457 55583 46790 21946 31241 29992 2778 18804 21097 -36362 -29497 -13746
21903 -13746 -26382 -20977 -8314 57156 74774 62806 62636 64586 98351 94514 43889 21383 3509
21890 3509 -32662 -12097 34452 23384 21301 70996 95777 66785 52106 67144 84484 74554
21878 74554 76193 45117 65047 68605 69130 46296 45638 30667 4790 -10246 8381 26288 33245
$$ packed form
21965C0463k7153k6989J723P7j1356M0112o014J9087K8513r594k3891n381K131
21952A1728K6336m565n7072k3305J5751M2063M9151k827k7001j0239J8652j9740
21940A8932J1638J0249K8919K3245R860p216n1092k9720J9715j1298J0272N861
21928C9365Q724k0621n0627j1013j2513L9152L3107N001n4269r006J9754K4255
21916A1309K9487P661P126q793k4844R295j249k7214J6026K293n7459O865J5751
21903a3746j2636N405J2663O5470J7618j1968j70J950L3765l837n0625k2506j7874
21890C509l6171K0565M6549j1068k083M9695K4781k8992j4679J5038J7340r930
21878G4554J639l1076J9930L558N25k2834o58j4971k5877j5036J8627J7907O957
$$ plain form
21865 33245 23124 20059 -6945 -5971 -21343 -22608 32505 10102 23603 19345 22272 37489 65911
21852 65911 58350 54912 69186 25796 31237 38198 24195 7584 -1644 -7839 -29328 -35518 -10205
21839 -10205 14914 20184 50066 23025 -29111 -18605 -11902 -18303 -12845 -2897 -17174 -10347 9785
21826 9785 29465 57148 70472 52202 24763 12213 -13751 23923 28281 21714 -23397 -38369
21814 -38369 -53234 -36846 -23421 -68182 -87639 -62488 -29819 -32117 -31822 -51641 -42786 -4506
21802 -4506 12563 38958 55690 91142 56806 -2363 22364 22201 51359 97497 142080 130703
21790 130703 96967 88375 43620 18639 28752 16183 -6767 34512 22643 8574 23370 33791
21778 33791 23108 20347 40501 75419 62357 14933 13289 23478 41263 31435 33325 1883
$$ packed form
21865C3245j0121l065k7004R74j5372j265N5113k2403J3501m258K927J5217K8422
21852F5911p561l438J4274m3390N441O961j4003j6611r228o195k1489o190K5313
21839a0205K5119N270K9882k7041n2136J0506O703o401N458R948j4277O827K0132
21826I785J9680K7683J3324j8270k7439j2550k5964L7674M358o567m5111j4972
21814c8369j4865J6388J3425m4761j9457K5151L2669k298K95j9819Q855L8280
21802d506J7069K6395J6732L5452l4336n9169K4727j63K9158M6138M4583j1377
21790A30703l3736q592m4755k4981J0113j2569k2950M1279j1869j4069J4796J0421
21778C3791j0683k761K0154L4918j3062m7424j644J0189J7785r828J890l1442
$$ plain form
21766 1883 -40841 -22396 3308 64079 42237 -3256 24722 65877 74576 27375 -4198 -796
21754 -796 22978 16292 18224 -3418 -52835 -66388 -59916 -44652 -7889 46743 82323 55387 4155
21741 4155 -23884 23753 24760 26548 30858 4193 -27871 -23786 10967 40682 27769 -25586 -67860
21728 -67860 -19929 31042 87293 93234 89136 133149 156689 190081 195206 239370 279824 300242
21716 300242 246410 188335 154338 102239 80096 82296 54616 77636 133161 126645 80113 52739
21704 52739 31829 48248 83897 133572 76930 34756 36089 28789 25888 41175 61300 83137
21692 83137 89442 79492 93072 113881 112640 80639 107826 89426 27780 -17195 8422 57495
21680 57495 99274 93180 97287 91160 49581 41179 65241 99249 77200 38714 58531 40968
$$ packed form
21766A883m2724J8445K5704O0771k1842m5493K7978M1155Q699m7201l1573L402
21754g96K3774o686J932k1642m9417j3553O472J5264L6763N4632L5580k6936n1232
21741D155k8039M7637J007J788M310k6665l2064M085L4753K9715j2913n3355m2274
21728f7860M7931N0971N6251N941m098M4013K3540L3392N125M4164M0454K0418
21716C00242n3832n8075l3997n2099k2143K200k7680K3020N5525o516m6532k7374
21704E2739k0910J6419L5649M9675n6642m2174J333p300k901J5287K0125K1837
21692H3137O305r950J3580K0809j241l2001K7187j8400o1646m4975K5617M9073
21680E7495M1779o094M107o127m1579q402K4062L4008k2049l8486J9817j7563
$$ plain form
21668 40968 5210 -9522 8554 37050 32728 34388 57990 36625 1942 -46775 -22564 30232
21656 30232 22884 12780 8574 6393 59312 61863 61348 81504 85750 85550 105724 74598 64473
21643 64473 38751 39705 60615 73064 55995 30712 53856 67477 53910 52436 21153 21970 43804
21630 43804 52143 62185 72607 87292 99082 100707 83909 72421 55379 20085 28378 80791
21618 80791 111824 102805 95093 58382 48694 55666 45571 27405 13489 48776 91014 93372 75553
21605 75553 55374 47045 55311 70028 62026 7436 5158 -53484 -117178 -147982 -203069 -266026
21593 -266026 -240283 -124611 170833 440917 562915 617017 559195 456316 419962 401751
21583 401751 394011 348932 298806 292922 314630 331555 382403 397262 389383 406926 431272 435990
$$ packed form
21668D0968l5758j4732J8076K8496m322J660K3602k1365l4683m8717K4211N2796
21656C0232p348j0104m206k181N2919K551n15K0156M246k00K0174l1126j0125
21643F4473k5722R54K0910J2449j7069k5283K3144J3621j3567j474l1283Q17K1834
21630D3804Q339J0042J0422J4685J1790J625j6798j1488j7042l5294Q293N2413
21618H0791L1033r019p712l6711r688O972j0095j8166j3916L5287M2238K358j7819
21605G5553k0179q329Q266J4717q002n4590k278n8642o3694l0804n5087o2957
21593b66026K5743J15672K95444K70084J21998N4102n7822j02879l6354j8211
21583D01751p740m5079n0126n884K1708J6925N0848J4859p879J7543K4346M718
$$ plain form
21571 435990 405129 351862 295625 303055 303500 326670 339954 338336 371933 351945 341872 342422 357112
21558 357112 335060 300411 296227 314012 324396 330121 380869 387532 361615 328832 360896 359606
21546 359606 346691 344506 337233 343035 303137 255404 237232 303472 392890 427377 394983 401527
21534 401527 475851 565052 589941 620106 617944 623871 632115 614545 628947 645046 655830 692535
21522 692535 732641 711686 719796 712953 789523 836080 872265 940234 1002464 1074026 1170560 1243696
21510 1243696 1285063 1260859 1258727 1285006 1358087 1484305 1642696 1829057 2023886 2300693
21500 2300693 2819454 3478730 3934906 3846387 3535468 3275119 3266837 3398374 3615886 3888494
21490 3888494 4110088 4309216 4635605 5114218 5594197 5982864 6438243 7172195 8056807
$$ packed form
21571D35990l0861n3267n6237P430M45K3170J3284j618L3597j9988j0073N50J4690
21558C57112k2052l4649m184J7785J0384N725N0748O663k5917l2783L2064j290
21546C59606j2915k185p273N802l9898m7733j8172O6240Q9418L4487l2394O544
21534D01527P4324Q9201K4889L0165k162N927Q244j7570J4402J6099J0784L6705
21522F92535M0106k0955Q110o843P6570M6557L6185O7969O2230P1562R6534P3136
21510A243696M1367k4204k132K6279P3081J26218J58391J86361J94829K76807
21500B300693N18761O59276M56176q8519l10919k60349q282J31537K17512K72608
21490C888494K21594J99128L26389M78613M79979L88667M55379P33952Q84612
$$ plain form
21481 8056807 8841612 9425918 10038641 10929403 12258477 14183771 16907470 20552465 25238252
21472 25238252 31254738 39531572 51980910 71986069 105409532 160609318 243009593
21465 243009593 328193785 351843375 294050247 205589121 136215009 92818313 66447334
21458 66447334 50076718 39562701 32168223 26434979 21855844 18348810 15691143 13707940
21450 13707940 12249881 11251748 10506899 9836493 8966494 7933205 6971905 6149602 5424989
21441 5424989 4746258 4191720 3776418 3487152 3404832 3380757 3293503 3216193 3301671 3511278
21431 3511278 3649559 3431844 2872333 2333813 1963349 1703828 1531545 1407988 1344834 1300740
21421 1300740 1281681 1198823 1078740 1037923 1061241 1058014 974040 850927 750635 713786 695500
$$ packed form
21481H056807P84805N84306O12723Q90762J329074J925294K723699L644995M685787
21472B5238252O016486Q276834J2449338K0005159L3423463N5199786Q2400275
21465B43009593Q5184192K3649590n7793128q8461126o9374112m3396696k6370979
21458F6447334j6370616j0514017p394478n733244m579135l507034k657667j983203
21450A3707940j458059r98133p44849o70406q69999j033289r61300q22303p24613
21441E424989o78731n54538m15302k89266q2320k4075q7254p7310Q5478K09607
21431C511278J38281k17715n59511n38520l70464k59521j72283j23557o3154m4094
21421A300740j9059q2858j20083m0817K3318l227q3974j23113j00292l6849j8286
$$ plain form
21410 695500 709544 674808 643866 601807 544606 490843 433847 375402 347387 348707 325887 323306
21398 323306 336320 307263 269677 258986 257430 250167 227988 207542 235139 269391 288039 301316
21386 301316 294502 268485 264638 280569 265163 252456 236945 185937 154557 168305 160742 135696
21374 135696 117734 130697 124835 142542 189128 173095 149932 142018 145845 161413 161842 105919
21362 105919 70102 128065 163972 92155 18167 15264 15843 -33654 -43602 -43478 -6114 -12259 -34412
21349 -34412 -79663 -81019 -71018 -41773 10569 -14332 -53380 -42412 -60940 -54643 51769 235490
21337 235490 430047 546548 569931 459537 356814 338133 362475 356429 315730 282177 256313
21326 256313 251957 244603 207160 225213 245986 276152 218593 170699 150103 165833 144216 118643
$$ packed form
21410F95500J4044l4736l0942m2059n7201n3763n6996n8445k8015J320k2820k581
21398C23306J3014k9057l7586j0691j556p263k2179k0446K7597L4252J8648J3277
21386C01316o814k6017l847J5931j5406j2707j5511n1008l1380J3748p563k5046
21374A35696j7962J2963n862J7707M6586j6033k3163p914L827J5568M29n5923
21362A05919l5817N7963L5907p1817p3988k903N79m9497r948J24L7364o145k2153
21349c4412m5251j356J0001K9245N2342k4901l9048J0968j8528O297J06412J83721
21337B35490J94557J16501K3383j10394j02723j8681K4342o046m0699l3553k5864
21326B56313m356p354l7443J8053K0773L0166n7559m7894k0596J5730k1617k5573
$$ plain form
21314 118643 89235 67010 86525 109325 141337 147007 100107 91546 48133 1758 46590 45440
21302 45440 38266 59701 81543 88113 113369 124135 88239 64028 29692 12509 2499 7898
21290 7898 11307 42751 52904 33768 3547 7142 41388 53655 47202 41274 26279 94398 144893
21277 144893 129468 126451 108439 104921 66464 79390 122402 110909 87464 74032 19242 -55366
21265 -55366 -71834 -104911 -55441 4273 38791 50834 17143 -26315 -29695 28341 81060 117504
21253 117504 88432 35663 -9411 -23073 -32063 -21199 -600 39164 8597 1717 14801 47594
21241 47594 50590 -4346 -12251 34972 22878 39646 51231 47971 10022 -150 -7441 -36704
21229 -36704 -29350 -30847 -16984 34199 45971 13668 13794 78094 71114 48922 42118 38860 34638
$$ packed form
21314A18643k9408k2225J9515K2800L2012N670m6900q561m3413m6375M4832j150
21302D5440p174K1435K1842O570K5256J0766l5896k4211l4336j7183j0010N399
21290G898L409L1444J0153j9136l0221L595L4246J2267o453n928j4995O8119N0495
21277A44893j5425l017j8012l518l8457J2926M3012j1493k3445j3432n4790p4608
21265e5366j6468l3077M9470N9714L4518J2043l3691m3458l380N8036N2719L6444
21253A17504k9072n2769m5074j3662q990J0864K0599L9764l0567o880J3084L2793
21241D7594K996n4936p905M7223j2094J6768J1585l260l7949j0172p291k9263
21229c6704P354j497J3863N1183J1772l2303J26O4300o980k2192o804l258m222
$$ plain form
21216 34638 14509 12447 33946 46486 69733 71704 40840 -52398 -103435 -97855 -35001 7426
21204 7426 23792 16235 -52588 -48530 -36042 -18935 -771 -27612 -60057 -52817 -10948 37079
21192 37079 55192 47262 17172 17824 13643 21432 2385 -15987 -20893 6907 -16010 -13921 7765
21179 7765 32813 9985 10230 6313 25893 43739 49581 50109 62739 45504 19615 19459 20067 839
21165 839 -2796 -19164 -1622 -7604 12559 4265 -16347 -56133 -74186 -101387 -51098 -10903 4819
21152 4819 19370 18779 -45770 -82246 -53105 8029 40868 41051 990 -35584 -79141 -114919 -115914
21139 -115914 -80979 -40717 -50803 -56019 -30227 19429 36102 44022 44576 9781 4546 16683
21127 16683 -25525 -52482 -31369 5252 47012 38201 1685 43050 51802 48570 37939 36192
$$ packed form
21216C4638k0129k062K1499J2540K3247J971l0864r3238n1037N580O2854M2427
21204G426J6366p557o8823M058J2488J7107J8164k6841l2445P240M1869M8027
21192C7079J8113p930l0090O52m181P789j9047j8372m906K7800k2917K089K1686
21179G765K5048k2828K45l917J9580J7846N842N28J2630j7235k5889j56O08j9228
21165H39l635j6368J7542n982K0163q294k0612l9786j8053k7201N0289M0195J5722
21152D819J4551n91o4549l6476K9141O1134L2839J83m0061l6574m3557l5778r95
21139a15914L4935M0262j0086n216K5792M9656J6673P920N54l4795n235J2137
21127A6683m2208k6957K1113L6621M1760q811l6516M1365Q752l232j0631j747
$$ plain form
21115 36192 38843 -24683 -49863 30085 45740 34503 47362 55727 28322 66981 107052 130821
21103 130821 121675 103958 115073 118193 75386 37055 43628 32249 47058 49346 21114 17296
21091 17296 26390 20390 -9521 -22799 -34201 -54033 -88718 -66058 -14861 -53491 -69987 -90703
21079 -90703 -64278 -36041 -42267 -81661 -67032 -26967 -20781 -23055 -42902 -33536 -15344 -63560
21067 -63560 -71907 -53549 -8580 9769 -3101 -21767 -6291 -46552 -61937 -63402 -66469 -30249
21055 -30249 -15943 -531 -29154 -20007 6954 -16382 -41051 9816 61904 79159 73563 66167
21043 66167 30515 38739 11962 -4724 -52549 -116435 -113701 -65672 -44899 -26196 -16922 -8120
21031 -8120 -39129 -48221 -14081 -2183 -7417 9207 40833 10289 -56789 -55722 -21383 6439
$$ packed form
21115C6192K651o3526k5180P9948J5655j1237J2859Q365k7405L8659M0071K3769
21103A30821r146j7717J1115L120m2807l8331O573j1379J4809K288k8232l818
21091A7296R094o000k9911j3278j1402j9832l4685K2660N1197l8630j6496k0716
21079i0703K6425K8237o226l9394J4629M0065O186k274j9847R366J8192m8216
21067f3560q347J8358M4969J8349j2870j8666J5476m0261j5385j465l067L6220
21055c0249J4306J5412k8623R147K6961k3336k4669N0867N2088J7255n596p396
21043F6167l5652Q224k6777j6686m7825o3886K734M8029K0773J8703R274Q802
21031h120l1009r092L4140J1898n234J6624L1626l0544o7078J067L4339K7822
$$ plain form
21019 6439 -25789 -44847 -57009 -45291 -14910 3548 -17825 16112 2580 22081 23781 18415
21007 18415 -11597 -5824 19513 -10407 -39460 -60025 -58349 -27508 -20033 -6705 -14431 -42000
20995 -42000 -22279 -52860 -63336 -48874 -52812 -48020 -25508 1129 -3968 -35885 -49485 6400
20983 6400 -993 -10814 -46979 -65465 -54920 -63675 -62450 -49540 -29235 -11976 18265 33834 17008
20970 17008 -14104 8453 22616 47041 49446 7723 -36443 -5483 16387 27940 -11047 -28773
20958 -28773 -6681 -26113 -41784 -6129 -7790 -33154 -21050 -2006 -4652 4041 26989 -5705
20946 -5705 -21142 9460 53608 60557 23262 -5054 -25470 -39053 -21079 -55718 -79855 -54083
20934 -54083 -26921 -13959 -23818 -14318 -22396 -57775 -63192 -14339 -16790 -73457 -41145 -43953 -59740
$$ packed form
21019F439l2228j9058j2162J1718L0381J8458k1373L3937j3532J9501J700n366
21007A8415l0012N773K5337k9920k9053k0565J676L0841P475J3328p726k7569
20995d2000J9721l0581j0476J4462l938M792K2512K6637n097l1917j3600N5885
20983F400p393r821l6165j8486J0545q755J225J2910K0305J7259L0241J5569j6826
20970A7008l1112K2557J4163K4425K405m1723m4166L0960K1870J1553l8987j7726
20958b8773K2092j9432j5671L5655j661k5364J2104J9044k646Q693K2948l2694
20946e705j5437L0602M4148O949l7295k8316k0416j3583J7974l4639k4137K5772
20934e4083K7162J2962r859R500q078l5379n417M8853k451n6667L2312k808j5787
$$ plain form
20921 -59740 -42678 44203 64907 39071 27066 18147 49932 52675 39560 -2498 -35229 -53412
20909 -53412 -39509 -21750 8473 23437 -18153 -60487 -386 11419 5771 28976 45321 19814
20897 19814 48251 45798 17624 50936 34343 30861 34159 52831 60237 73785 59540 74247
20885 74247 120603 109242 149389 202295 289479 355872 455481 669544 830838 860676 715353
20874 715353 492977 340507 270619 234347 171716 116629 91236 62362 65927 43493 49751
20863 49751 93424 169555 249913 383508 589606 749521 789291 681819 485617 314091
20853 314091 166291 87795 30628 38235 19390 -30859 -18212 -7997 -10072 -13020 -16703 -14619
20841 -14619 42589 70784 59814 32017 1361 11762 44929 17661 -11836 101 15210 -5277
$$ packed form
20921e9740J7062Q6881K0704k5836j2005q919L1785K743j3115m2058l2731j8183
20909e3412J3903J7759L0223J4964m1590m2334O0101J1805n648K3205J6345k5507
20897A9814K8437k453k8174L3312j6593l482L298J8672P406J3548j4245J4707
20885G4247M6356j1361M0147N2906Q7184O6393R9609K14063J61294K9838j45323
20874G15353k22376j52470o9888l6272o2631n5087k5393k8874L565k2434O258
20863D9751M3673P6131Q0358J33595K06098J59915L9770j07472j96202j71526
20853C14091j47800p8496n7167P607j8845n0249J2647J0215k075k948l683K084
20841a4619N7208K8195j0970k7797l0656J0401L3167k7268k9497J1937J5109k0487
$$ plain form
20829 -5277 -32238 -27108 -25391 -32455 -20585 8946 64522 52207 21136 49953 31221 -8536
20817 -8536 -31710 -23117 8881 23248 31192 -32831 -56142 -44409 -29848 -43954 -68065 -46512
20805 -46512 -42574 -31966 -88871 -106910 -100172 -75733 -25148 16987 26285 3812 6793 30438
20793 30438 35358 8586 -13889 -30647 -11238 3615 7131 3194 -10003 -21232 -529 -37409
20781 -37409 -36624 -13069 -45806 -43821 -39827 -25372 -38606 -67668 -72969 -81415 -62066 -3408 14708
20768 14708 -16936 -17196 9416 -2374 -53500 5453 23828 22672 16461 10365 -1397 1764 5582
20755 5582 -3703 -35388 -12376 2446 -21563 -35105 -39262 -40468 -16506 -60377 -89384 -39927
20743 -39927 -23625 11674 41314 28476 7859 8346 56821 105310 65523 39568 45185 76364
$$ packed form
20829e277k6961N130J717p064J1870K9531N5576j2315l1071K8817j8732l9757
20817h536k3174Q593L1998J4367P944o4023k3311J1733J4561j4106k4111K1553
20805d6512L938J0608n6905j8039O738K4439N0585M2135R298k2473K981K3645
20793C0438M920k6772k2475j6758J9409J4853L516l937j3197j1229K0703l6880
20781c7409P85K3555l2737J985L994J4455j3234k9062n301q446J9349N8658J8116
20768A4708l1644k60K6612j1790n1126N8953J8375j156o211o096j1762L161L818
20755E582r285l1685K3012J4822k4009j3542m157j206K3962m3871k9007M9457
20743c9927J6302L5299K9640j2838k0617M87M8475M8489l9787k5955N617L1179
$$ plain form
20731 76364 165559 195749 169535 165853 147213 161145 145670 118316 137134 141372 134782 177061
20719 177061 187935 273319 356822 410264 481279 613066 808560 1022638 1265248 1319108 1124774
20708 1124774 887409 704906 561707 426780 358123 280260 237876 273225 215244 154176
20698 154176 121480 104611 83239 61588 49617 65922 95179 113050 116021 143042 126495 96182
20686 96182 83853 81528 70547 78004 110822 96468 88720 135842 142757 134807 163109 181516 212308
20673 212308 209474 215885 233334 281853 306728 299503 300056 313167 333730 314288 263206 190034
20661 190034 151180 159179 201895 262518 252812 224915 269265 263531 234456 231486 163396 103298
20649 103298 83055 71816 49516 -15815 -32220 82 23071 30602 33049 11616 -3235 -39164
$$ packed form
20731G6364Q9195L0190k6214l682j8640J3932j5475k7354J8818M238o590M2279
20719A77061J0874Q5384Q3503N3442P1015J31787J95494K14078K42610N3860j94334
20708A124774k37365j82503j43199j34927o8657p7863m2384L5349n7981o1068
20698A54176l2696j6869k1372k1651j1971J6305K9257J7871K971K7021j6547l0313
20686I6182j2329k325j0981P457L2818j4354p748M7122O915p950K8302J8407L0792
20673B12308k834O411J7449M8519K4875p225N53J3111K0563j9442n1082p3172
20661A90034l8854P999M2716O0623r706k7897M4350n734k9075k970o8090o0098
20649A03298k0243j1239k2300o5331j6405L2302K2989P531K447k1433j4851l5929
$$ plain form
20637 -39164 -49557 -34505 -33340 -16639 -1278 -6625 -41760 -49032 -65402 -51920 -24927 8589
20625 8589 16422 15427 8206 -18705 -25374 -24518 -14451 5821 34278 66372 52707 33548 16853
20612 16853 -14585 -22140 -36051 -24375 11863 40780 -14456 -33111 -44766 -42265 -56760 -74770
20600 -74770 -41514 31596 34764 32949 44074 -1159 -36259 -11953 12055 -34852 -48941 -16578
20588 -16578 1263 19902 55238 47892 18461 13098 51564 52784 36603 36116 29150 26170 -8098
20575 -8098 -46587 -49048 -50689 -38484 -65401 -40113 -58573 -56714 -71096 -44133 -13427 -38753
20563 -38753 -70391 -64116 -3222 46307 12903 20621 14031 15145 7272 34477 139 -73948 -59596
20550 -59596 -12232 8501 -3396 45679 46236 45223 43157 25147 3022 -20331 -17898 11241 17149
$$ packed form
20637c9164j0393J5052J165J6701J5361n347l5135p272j6370J3482K6993L3516
20625H589P833r95p221k6911o669Q56J0067K0272K8457L2094j3665j9159j6695
20612A6853l1438p555j3911J1676L6238K8917n5236j8655j1655K501j4495j8010
20600g4770L3256P3110L168j815J1125m5233l5100K4306K4008m6907j4089L2363
20588a6578J7841J8639L5336p346k9431n363L8466J220j6181m87o966k980l4268
20575h098l8489k461j641J2205k6917K5288j8460J859j4382K6963L0706k5326
20563c8753l1638O275O0894M9529l3404P718o590J114p873K7205l4338p4087J4352
20550e9596M7364K0733j1897M9075N57j013k066j8010k2125k3353K433K9139N908
$$ plain form
20537 17149 4657 11535 8918 24407 24116 40598 71403 74034 73509 75794 72250 59164 29689
20524 29689 3065 34756 26247 37804 27718 -15046 -36360 -26125 11674 20556 16501 32188
20512 32188 1250 -3805 34243 33278 19696 15265 20153 30155 -18419 -16054 -17633 -57014 -78217
20499 -78217 -36256 26218 24138 -8251 -9294 10353 2240 17033 72958 95422 81418 32837
20487 32837 45308 43526 11250 -17024 -35184 -7655 18584 24704 38792 67040 44730 27863
20475 27863 19237 25070 45064 54610 41146 51734 81667 54725 42483 60521 68066 50554
20463 50554 43388 45893 67822 73925 32333 -14944 12794 44812 75935 53986 53793 68916 75317
20450 75317 77210 55357 64810 32434 -23647 -62689 -59043 -33658 -13356 -7928 15737 29449
$$ packed form
20537A7149j2492O878k617J5489k91J6482L0805K631n25K285l544j3086k9475
20524B9689k6624L1691q509J1557j0086m2764k1314J0235L7799Q882m055J5687
20512C2188l0938n055L8048r65j3582m431M888J0002m8574K365j579l9381k1203
20499g8217M1961O2474k080l2389j043J9647q113J4793N5925K2464j4004m8581
20487C2837J2471j782l2276k8274j8160K7529K6239O120J4088K8248k2310j6867
20475B7863q626N833J9994R546j3464J0588K9933k6942j2242J8038P545j7512
20463E0554p166K505K1929O103m1592m7277K7738L2018L1123k1949j93J5123O401
20450G5317J893k1853R453l2376n6081l9042L646K5385K0302N428K3665J3712
$$ plain form
20438 29449 19983 -31068 -41900 -36232 -11081 -17824 -29759 -44832 -61900 -45125 -29136 -25850
20426 -25850 -16443 -28152 -55226 -74546 -67528 -41572 -8191 42870 43368 27562 16135 42978
20414 42978 88499 99188 116025 92173 81177 96968 110672 112132 107319 99758 95035 61497
20402 61497 49870 40869 -711 -38829 -15359 7915 21368 37622 51805 33305 14306 21524
20390 21524 50719 50443 47098 27320 9724 39581 50094 36402 37064 42301 29807 -4442 -17446
20377 -17446 -43401 -19458 21142 52100 47521 39962 78058 93374 117632 104459 98509 103075
20365 103075 93708 106255 122253 111837 125541 139340 113838 81778 83061 108915 92835 50034
20353 50034 79799 55136 59004 94920 88259 73468 54023 64348 112160 96332 65343 45174
$$ packed form
20438B9449r466n1051j0832N668K5151o743j1935j5073j7068J6775J5989L286
20426b5850R407j1709k7074j9320P018K5956L3381N1061M98j5806j1427K6843
20414D2978M5521J0689J6837k3852j0996J5791J3704J460m813p561m723l3538
20402F1497j1627r001m1580l8118K3470K3274J3453J6254J4183j8500j8999P218
20390B1524K9195k76l345j9778j7596K9857J0513j3692O62N237j2494l4249j3004
20377a7446k5955K3943M0600L0958m579p559L8096J5316K4258j3173n950M566
20365A03075r367J2547J5998j0416J3704J3799k5502l2060J283K5854j6080m2801
20353E0034K9765k4663L868L5916o661j4791j9445J0325M7812j5828l0989k0169
$$ plain form
20341 45174 48932 38993 -7231 -55046 -107702 -89780 -1704 69982 88298 90820 69883 88554
20329 88554 50743 23252 42928 103810 184427 177061 176739 199427 239376 250564 229423 191404
20317 191404 147575 122493 111070 174902 231415 238630 232183 265392 230538 240171 280885 267507
20305 267507 197678 194827 193613 221164 262892 286947 267851 250362 267285 268100 207022 177398
20293 177398 138076 88789 83498 127603 113338 148368 190574 166749 183620 224321 255898 317380
20281 317380 384806 414025 399086 362095 342671 331600 317828 319783 398008 520980 613054
20270 613054 643226 596079 508694 465825 425612 396461 391964 445071 440045 464392 536630 583008
20258 583008 585470 542248 506534 492001 506103 555055 530692 557761 600692 640851 709903 746565
$$ packed form
20341D5174L758r939m6224m7815n2656J7922Q8076P1686J8316K522k0937J8671
20329H8554l7811k7491J9676O0882Q0617p366l22K2688L9949J1188k1141l8019
20317A91404m3829k5082j1423O3832N6513P215o447L3209l4854R633M0714j3378
20305B67507o9829k851j214K7551M1728K4055j9096j7489J6923Q15o1078k9624
20293A77398l9322m9287n291M4105j4265L5030M2206k3825J6871M0701L1577O1482
20281C17380O7426K9219j4939l6991j9424j1071j3772J955P8225J22972R2074
20270F13054L0172m7147q7385m2869m0213k9151m497N3107n026K4347P2238M6378
20258E83008K462m3222l5714j4533J4102M8952k4363K7069M2931M0159O9052L6662
$$ plain form
20246 746565 812420 969983 1175680 1293287 1246683 1133378 1071652 1059104 1092249 1143934 1240055
20235 1240055 1406970 1631451 1801122 1925870 2062579 2446058 3073367 4005538 5339090
20226 5339090 6689689 7114235 6488593 5632326 5049658 4773871 4697740 4872430 5286075
20217 5286075 5940617 6971095 8567749 11050558 15020996 21594019 32375758 47456497
20209 47456497 60435342 62640276 54925491 44510811 36436035 32621629 33935587 40848106
20201 40848106 52357595 64761258 70129467 64321370 54077897 47612660 44831893 41427706
20193 41427706 35791981 30103875 27010223 27222096 29008148 30093825 30234144 29039733
20185 29039733 25287876 19915246 15203840 12119577 10288804 9252049 8804194 8821617
$$ packed form
20246G46565O5855J57563K05697J17607m6604j13305o1726j2548L3145N1685R6121
20235A240055J66915K24481J69671J24748J36709L83479O27309R32171J333552
20226E339090J350599M24546o25642q56267n82668k75787p6131J74690M13645
20217E286075O54542J030478J596654K482809L970438O573023J0781739J5080739
20209D7456497J2978845K204934p714785j0414680q074776l814406J313958O912519
20201D0848106J1509489J2403663N368209n808097j0243473o465237k780767l404187
20193D1427706n635725n688106l093652K11873J786052J085677J40319j194411
20185B9039733l751857n372630m711406l084263j830773j036755m47855J7423
$$ plain form
20177 8821617 9303550 10348989 12234530 15341744 19429439 22594618 22636725 19991035 17186480
20168 17186480 15637766 15671582 17465161 21619802 28539895 37468817 46208296 53193312
20160 53193312 59346280 65141484 66999482 61997033 52608940 43175988 36724126 34574520
20152 34574520 35595236 37024592 38703469 43869042 55299951 68387246 70375180 58299868
20144 58299868 42830081 32819290 28287972 25670345 21902295 16966735 12648032 9656140
20136 9656140 7678281 6448651 5625597 4915563 4275229 3781385 3423673 3101499 2781514
20127 2781514 2517841 2289246 2127515 2014627 1907475 1827540 1725293 1581377 1378205 1211793
20117 1211793 1135957 1085377 1009993 937524 873200 861125 833416 834132 841189 864496 956697 1021050
$$ packed form
20177H821617M81933J045439J885541L107214M087695L165179M2107k645690k804555
20168A7186480j548714L3816J793579M154641O920093Q928922Q739479O985016
20160E3193312O152968N795204J857998n002449r388093r432952o451862k149606
20152C4574520J020716J429356J678877N165573J1430909J3087295J987934j2075312
20144E8299868j5469787j0010791m531318k617627l768050m935560m318703k991892
20136I656140j977859j229630q23054p10034o40334m93844l57712l22174l19985
20127B781514k63673k28595j61731j12888j07152p9935j02247j43916k03172j66412
20117A211793p5836n0580p5384p2469o4324j2075k7709P16P057K3307R2201O4353
$$ plain form
20105 1021050 1131422 1212004 1112502 941950 789063 647338 589601 581853 505906 483793 481865
20094 481865 456693 496880 555823 639462 713487 805192 807145 680892 607097 488555 408158
20083 408158 406649 450742 486631 456302 432846 426290 373275 324240 303172 314507 342429 366449
20071 366449 422797 434882 460966 490102 536712 563531 646500 703675 680021 584389 491266
20060 491266 455930 432064 396233 285811 243722 272708 248961 236715 234118 263968 333563
20049 333563 371090 365344 332255 281560 295306 286204 296474 296185 226255 225119 213069 213096 184241
20036 184241 159179 184757 226905 250141 283270 329407 331384 341994 305568 277627 232805 229457
20024 229457 275174 291659 280749 232275 282387 323994 337718 302207 249685 264754 283875
$$ packed form
20105A021050J10372Q0582r9502j70552j52887j41725n7737p748p5947k2113j928
20094D81865k5172M0187N8943Q3639P4025R1705J953j26253p3795j18542q0397
20083D08158j509M4093L5889l0329k3456o556n3015m9035k1068J1335K7922K4020
20071C66449N6348J2085K6084K9136M6610K6819Q2969N7175k3654r5632r3123
20060D91266l5336k3866l5831j10422m2089K8986k3747j2246k597K9850O9595
20049C33563L7527n746l3089n0695J3746r102J0270k89o9930j136j2050K7k8855
20036A84241k5062K5578M2148K3236L3129M6137J977J0610l6426k7941m4822l348
20024B29457M5717J6485j0910m8474N0112M1607J3724l5511n2522J5069J9121
$$ plain form
20013 283875 247736 234566 212459 219104 222666 237499 257970 240977 222914 200839 197025 235741
20001 235741 248484 250837 214888 213765 217369 188901 155099 148870 109525 89254 81796 105510
19989 105510 60265 64643 85873 72568 74098 62708 69284 50335 34927 81139 81473 55901
19977 55901 60001 68385 36546 51971 87268 75503 38962 34952 53170 32613 20964 -2022
19965 -2022 -4011 -3124 -28963 -21785 34786 68806 50327 45275 57271 29738 18271 32633 28835
19952 28835 23761 22410 37089 13498 8107 37463 12111 14033 20487 31147 52471 43369 47940
19939 47940 85901 57420 50118 65543 78016 69821 14830 27704 44342 52791 3813 -2182
19927 -2182 13541 37748 61882 16975 3253 -24497 29217 61164 26065 27906 74010 62634
$$ packed form
20013B83875l6139j3170k2107O645L562J4833K0471j6993j8063k2075l814L8716
20001B35741J2743K353l5949j123L604k8468l3802o229l9345k0271p458K3714
19989A05510m5245M378K1230j3305J530j1390O576j8949j5408M6212L34k5572
19977E5901M100Q384l1839J5425L5297j1765l6541m010J8218k0557j1649k2986
19965b022j989Q87k5839P178N6571L4020j8479n052J1996k7533j1467J4362l798
19952B8835n074j351J4679k3591n391K9356k5352J922O454J0660K1324r102M571
19939D7940L7961k8481p302J5425J2473q195n4991J2874J6638Q449m8978n995
19927b182J5723K4207K4134m4907j3722k7750N3714L1947l5099J841M6104j1376
$$ plain form
19915 62634 75590 28368 -5504 -15173 29650 46712 45996 54379 53938 49585 27476 -379 -19920
19902 -19920 -8968 -3924 -12294 5581 3066 38059 36117 3923 9974 22197 12228 53789 54768
19889 54768 18631 -21638 -25744 -20629 -10458 -7307 8873 18896 26401 25409 17854 35514 57624
19876 57624 41484 9757 48531 53453 49022 -2677 -16403 28912 51938 91349 110611 105199
19864 105199 45350 45162 48369 92808 130323 92971 86117 92477 61654 77815 91039 109161
19852 109161 72047 56544 57700 60713 17994 -14722 5190 -26169 17062 35676 29538 -35802
19840 -35802 -54733 -46884 -50707 -73654 -40855 -14398 11750 37961 51953 44526 41373 23969
19828 23969 -33178 -50711 -12048 3187 -15636 -12161 -23196 5146 35015 -10159 -45683 -29282
$$ packed form
19915F2634J2956m7222l3872r669M4823J7062p16Q383m41m353k2109k7855j9541
19902a9920J0952N044q370J7875k515L4993j942l2194O051J2223r969M1561R79
19889E4768l6137m0269m106N115J0171L151J6180J0023P505r92p555J7660K2110
19876E7624j6140l1727L8774M922m431n1699j3726M5315K3026L9411J9262n412
19864A05199n9849j88L207M4439L7515l7352o854O360l0823J6161J3224J8122
19852A09161l7114j5503J156L013m2719l2716J9912l1359M3231J8614o138o5340
19840c5802j8931P849l823k2947L2799K6457K6148K6211J3992p427l153j7404
19828B3969n7147j7533L8663J5235j8823L475j1035K8342K9869m5174l5524J6401
$$ plain form
19816 -29282 -77729 -66236 -36946 -9162 21261 48045 16432 12364 -4952 -17040 7410 22150
19804 22150 9223 -9599 -16940 -3583 -13530 -32406 -50185 -70487 -89858 -57565 -16886 -44215
19792 -44215 -93477 -86910 -66276 -35108 -17885 -27031 -22946 -1107 23735 19398 18304 38674 46550
19779 46550 33944 45722 52993 13066 -7382 5832 -8413 -42721 -82160 -82883 -26764 9538
19767 9538 -27974 -48188 -58871 -47674 -60881 -40954 -14313 9485 -15950 -25393 7194 12132
19755 12132 42220 92034 91399 30192 5993 -7683 25873 37529 31558 16138 -48573 -89576
19743 -89576 -49708 -5773 -3871 9534 12403 48007 63619 58454 34119 -13842 -35967 -61510
19731 -61510 -36086 -10250 9096 9912 -5656 -23313 -34981 -21684 -12783 -3638 38616 55883
$$ packed form
19816b9282m8447J1493K9290K7784L0423K6784l1613m068j7316j2088K4450J4740
19804B2150j2927j8822p341J3357r947j8876j7779k0302j9371L2293M0679k7329
19792d4215m9262O567K0634L1168J7223r146M085K1839K4842m337j094K0370P876
19779D6550j2606J1778P271l9927k0448J3214j4245l4308l9439p23N6119L6302
19767I538l7512k0214j0683J1197j3207J9927K6641K3798k5435r443L2587M938
19755A2132L0088M9814o35o1207k4199j3676L3556J1656n971j5420o4711m1003
19743h9576L9868M3935J902J3405K869L5604J5612n165k4335m7961k2125k5543
19731f1510K5424K5836J9346Q16j5568j7657j1668J3297Q901R145M2254J7267
$$ plain form
19719 55883 92747 79264 36883 37200 86059 91079 38089 36916 50538 7130 -9997 -6204 -10894
19706 -10894 -36460 -44447 -26144 -42617 -7306 -4165 24571 34006 111719 159134 155489 145914 133810
19693 133810 166878 170170 161563 108166 144744 259883 351533 371803 347269 318144 294179 217808
19681 217808 137864 94881 97579 96328 108848 141468 196246 211245 241629 255199 239870 257392
19669 257392 237745 203730 143415 97337 77048 43139 55813 65954 53885 9310 15705 43231
19657 43231 88913 127958 121586 140175 127133 147601 153750 167398 156471 152526 238563 306561
19645 306561 315031 254114 168065 107981 96434 74516 78522 123406 147507 174841 237345 277434
19633 277434 237334 162018 126746 129259 150813 172752 212053 230300 231357 214146 194639 206615
$$ packed form
19719E5883L6864j3483m2381L17M8859N020n2990j173J3622m3408j7127L793m690
19706a0894k5566p987J8303j6473L5311L141K8736R435P7713M7415l645r575j2104
19693A33810L3068L292q607n3397L6578J15139R1650K0270k4534k9125k3965p6371
19681B17808p9944m2983K698j251J2520L2620N4778J4999L0384J3570j5329J7522
19669B57392j9647l4015o0315m6078k0289l3909J2674J0141j2069m4575O395K7526
19657D3231M5682L9045o372J8589j3042K0468O149J3648j0927l945Q6037O7998
19645C06561Q470o0917q6049o0084j1547k1918M006M4884K4101K7334O2504M0089
19633B77434m0100p5316l5272K513K1554K1939L9301J8247J057j7211j9507J1976
$$ plain form
19621 206615 224469 190962 135341 51815 -20790 -10484 3052 -16270 11959 1296 2606 26530
19609 26530 12001 6721 3117 43009 90700 86407 77223 39623 36127 59412 42352 40143 25435
19596 25435 12189 21700 15104 43877 46542 2212 -31825 32389 57519 -222 -49368 -51237
19584 -51237 -63558 -46338 5331 13890 12373 -13294 -58191 -68434 11096 9991 14516 38356
19572 38356 40294 6605 -33840 -44573 -41973 -43931 -33220 -7130 -10468 4160 -3529 -39356 -47834
19559 -47834 -65871 -57600 -24118 -9908 -33468 -14462 -6926 -13522 -57509 -86805 -61300 -89306
19547 -89306 -69266 -69181 -66632 -9649 10096 -13667 -10858 -21257 -63577 -62290 -30309 -22638 4933
19534 4933 -1579 -22557 20719 52291 29962 -2089 -2531 -30336 -1066 -33538 -50752 -30950
$$ packed form
19621B06615J7854l3507n5621q3526p2605J0306J3536j9322K8229j0663J310K3924
19609B6530j4529n280l604L9892M7691m293r184l7600l496K3285j7060k209j4708
19596B5435j3246R511o596K8773K665m4330l4037O4214K5130n7741m9146j869
19584e1237j2321J7220N1669Q559j517k5667m4897j0243P9530j105M525K3840
19572C8356J938l3689m0445j0733K600j958J0711K6090l338J4628p689l5827q478
19559d7834j8037Q271L3482J4210k3560J9006P536o596m3987k9296K5505k8006
19547h9306K0040Q5K549N6983J9745k3763K809j0399m2320J287L1981P671K7571
19534D933o512k0978M3276L1572k2329l2051m42k7805K9270l2472j7214J9802
$$ plain form
19522 -30950 12919 17131 -24448 -53693 -76155 -63595 -14748 -20162 -42547 -52022 -30108 -29336 -42749
19509 -42749 -5401 -18328 -17871 26651 27711 10173 5714 10229 -36174 -27570 -12705 -20353 -20672
19496 -20672 -32434 -53741 -38017 -12626 -12439 -37323 -31862 -36498 -58234 -62792 -83829 -93151 -67687
19483 -67687 -54221 -73253 -66020 -52016 -67215 -81109 -50325 -9668 23434 -10844 -57483 -53127
19471 -53127 -45696 -21509 6803 28674 38652 11433 -18729 -61848 -94277 -76117 -16002 21686
19459 21686 5868 -24179 -8290 968 3022 2141 -12063 -38534 -39072 -71243 -100446 -93976 -120096
19446 -120096 -98840 -37837 -23796 -20717 -22172 -1210 15542 24239 1840 -23238 -81022 -89434
19434 -89434 -88943 -63025 -38471 -36791 -34876 -44804 -82338 -63594 -8721 -28854 -25706 -22614 -60031
$$ packed form
19522c0950M3869M212m1579k9245k2462J2560M8847n414k2385r475K1914P72j3413
19509d2749L7348j2927M57M4522J060j7538m459M515m6403Q604J4865p648l19
19496b0672j1762k1307J5724K5391J87k4884N461m636k1736m558k1037r322K5464
19483f7687J3466j9032P233J4004j5199j3894L0784M0657L3102l4278m6639M356
19471e3127P431K4187K8312K1871R978k7219l0162m3119l2429J8160O0115L7688
19459B1686j5818l0047J5889R258K054q81j4204k6471n38l2171k9203O470k6120
19446a20096K1256O1003J4041L079j455K0962J6752Q697k2399k5078n7784q412
19434h9434M91K5918K4554J680J915r928l7534J8744N4873k0133L148L092l7417
$$ plain form
19421 -60031 -57346 -54417 -67790 -49090 -42157 -47334 -23375 12609 44584 -43656 -44872 11652 13360
19408 13360 14580 -13977 -14498 -20029 -20462 14510 -4110 -52927 -62464 -55165 -46395 3205 26184
19395 26184 6182 -25334 -34798 -45693 -52027 -33489 -12525 13736 -14906 12596 50760 -22216
19383 -22216 -75667 -55714 -10708 16084 39861 45659 29837 -1014 -31662 -19684 2081 -11315
19371 -11315 7693 -21596 -22143 9104 -1721 -38784 -41245 1684 29641 -5936 -33199 -59308
19359 -59308 -51266 -34931 -49203 -40159 -21159 -41163 -43506 -25932 -14832 9085 -7737 12291
19347 12291 41558 -4094 -81135 -49765 -28122 -39432 -87340 -60654 -40362 -82524 -71817 -60838
19335 -60838 -98189 -89363 -87390 -60248 -11368 -14386 -18478 -26447 -21068 181 -4036 35586 23916
$$ packed form
19421f0031K685K929j3373J8700O933n177K3959L5984L1975q8240j216N6524J708
19408A3360J220k8557n21n531m33L4972j8620m8817r537P299Q770M9600K2979
19395B6184k0002l1516r464j0895o334J8538K0964K6261k8642K7502L8164p2976
19383b2216n3451J9953M5006K6792K3777N798j5822l0851l0648J1978K1765j3396
19371a1315J9008k9289n47L1247j0825l7063k461M2929K7957l5577k7263k6109
19359e9308Q042J6335j4272R044J9000k0004k343J7574J1100K3917j6822K0028
19347A2291K9267m5652p7041L1370K1643j1310m7908K6686K0292m2162J0707J0979
19335f0838l7351Q826J973K7142M8880l018m092p969N379K1249m217L9622j1670
$$ plain form
19322 23916 50068 92994 100776 57053 18833 9820 -13527 -29629 -570 8612 3043 -13485
19310 -13485 -30900 -53461 -48246 -56074 -48308 -29569 -39820 -48489 -48891 -54561 -96964 -92316 -48164
19297 -48164 -22292 -20222 -2976 49302 55922 34955 1835 -5095 -40399 -54052 -6236 10810
19285 10810 18166 8354 -1286 -42934 -19243 -28830 -23244 -28833 20724 65046 20804 -3085 -10018
19272 -10018 -8931 -21187 -22979 -37245 -42538 -50713 -31323 -9713 33641 67978 70952 48272 58876
19259 58876 61496 38380 42887 26197 17554 -11066 -71825 -111087 -79033 -73927 -38023 -67947
19247 -67947 -56972 -26892 5122 31884 24513 -9996 20940 49520 41031 47084 3202 -40498
19235 -40498 -22512 -732 5974 -4402 -28030 4285 1635 -23791 -29373 -21547 -20208 -24707 -46504
$$ packed form
19322B3916K6152M2926P782m3723l8220r013k3347j6102K9059R182n569j6528
19310a3485j7415k2561N215p828P766J8739j0251q669m02n670m2403M648M4152
19297d8164K5872K070J7246N2278O620k0967l3120o930l5304j3653M7816J7046
19285A0810P356r812r640m1648K3691r587N586n589M9557M4322m4242k3889o933
19272a0018J087j2256j792j4266n293q175J9390K1610M3354L4337K974k2680J0604
19259E8876K620k3116M507j6690q643k8620o0759l9262L2054N106L5904k9924
19247f7947J0975L0080L2014K6762p371l4509L0936K8580q489O053m3882m3700
19235d0498J7986K1780O706j0376k3628L2315k650k5426n582P826J339m499k1797
$$ plain form
19222 -46504 -61756 -64262 -90283 -111055 -73404 -58454 -47723 -36285 -45286 -89664 -91269 -105106
19210 -105106 -88690 -57268 -41711 -52851 -38343 -1859 -11757 -50520 -47878 -50735 -49409 -41343
19198 -41343 10020 41879 46932 71973 83293 84654 120639 124339 122970 112474 81617 44454
19186 44454 36754 -4544 -25769 -2495 74493 71314 -3985 3973 5528 9421 11084 -742 17470
19173 17470 -22626 -28123 -47958 -63960 -36515 -68980 -90835 -52546 -60184 -99130 -103675 -55030
19161 -55030 -25019 -4143 26312 32556 4298 -53914 -22640 25660 61208 54740 50823 62116
19149 62116 92103 123463 120335 123611 171770 212991 230562 261509 241578 193853 144156 100946
19137 100946 53972 65435 25895 14331 64964 95082 71302 40336 36787 41942 24543 11030
$$ packed form
19222d6504j5252k506k6021k0772L7651J4950J0731J1438r001m4378j605j3837
19210a05106J6416L1422J5557j1140J4508L6484r898l8763K642k857J326Q066
19198d1343N1363L1859N053K5041J1320J361L5985L700j369j0496l0857l7163
19186D4454p700m1298k1225K3274P6988l179p5299P958J555L893J663j1826J8212
19173A7470m0096n497j9835j6002K7445l2465k1855L8289p638l8946m545M8645
19161e5030L0011K0876L0455O244k8258n8212L1274M8300L5548o468l917J1293
19149F2116K9987L1360l128L276M8159M1221J7571L0947j9931m7725m9697m3210
19137A00946m6974J1463l9540j1564N0633L0118k3780l0966l549N155j7399j3513
$$ plain form
19125 11030 35018 25268 42190 44148 100577 160361 166710 133586 105531 102909 123622 100740
19113 100740 46798 48598 99672 136446 147400 143287 136246 138707 196245 282512 290369 272665
19101 272665 224042 140444 101199 129444 135238 158081 153512 127554 110592 106894 113032 98208
19089 98208 61027 95583 94898 123872 174605 171012 178806 229198 257994 270046 284774 240900
19077 240900 205672 162582 184755 166333 167915 160987 116640 99940 111696 156509 182055 220660
19065 220660 278209 309246 325417 286312 234806 240122 211516 184677 230311 281672 281952 252311
19053 252311 218106 162532 98374 89345 108597 120135 79607 65404 76559 45793 5993 -11249
19041 -11249 -9434 -250 954 -7885 -47809 -70328 -59308 -44515 -11380 -47249 -60727 -36096
$$ packed form
19125A1030K3988r750J6922J958N6429N9784O349l3124k8055k622K0713k2882
19113A00740n3942J800N1074L6774J0954m113p041K461N7538Q6267P857j7704
19101B72665m8623q3598l9245K8245N794K2843m569k5958j6962l698O138j4824
19089I8208l7181L4556o85K8974N0733l593P794N0392K8796J2052J4728m3874
19077B40900l5228m3090K2173j8422J582o928m4347j6700J1756M4813K5546L8605
19065B20660N7549L1037J6171l9105n1506N316k8606k6839M5634N1361K80k9641
19053B52311l4205n5574o4158r029J9252J1538m0528j4203J1155l0766l9800j7242
19041a1249J815R184J204q839l9924k2519J1020J4793L3135l5869j3478K4631
$$ plain form
19029 -36096 -603 18681 47233 81929 81490 47319 50773 99740 116502 124599 137866 136336 113680
19016 113680 80050 53351 72091 53053 79728 127124 135047 121990 97384 42891 33710 75081
19004 75081 65901 47565 12592 -45354 -51064 -21585 -46095 -79244 -21611 -15546 -26092 -53479
18992 -53479 -54790 -50266 -47456 -49064 -41771 -673 10859 -16621 -29856 -17490 44557 66751 64513
18979 64513 60734 31045 9288 2293 -4306 -15944 -10585 6409 17454 -9376 -7340 -855 -12942
18966 -12942 -82365 -77505 -53554 -56571 -27847 26279 14070 -45408 -34200 -12590 -4324 -1695
18954 -1695 -26481 -67435 -62207 -44730 -15586 -38898 -55627 -65573 -30619 -24511 -41585 -4069
18942 -4069 7610 -3522 -34829 -8783 1523 25911 3795 -49829 -44480 -14414 -61137 -82035
$$ packed form
19029c6096L5493J9284K8552L4696m39l4171L454M8967J6762Q097J3267j530k2656
19016A13680l3630k6699J8740j9038K6675M7396P923j3057k4606n4493r181M1371
19004G5081r180j8336l4973n7946n710K9479k4510l3149N7633O065j0546k7387
18992e3479j311M524K810j608P293M1098J1532k7480j3235J2366O2047K2194k238
18979F4513l779k9689k1757o995o599j1638N359J6994J1045k6830K036O485j2087
18966a2942o9423M860K3951l017K8724N4126j2209n9478J1208K1610Q266K629
18954a695k4786m0954N228J7477K9144k3312j6729r946L4954O108j7074L7516
18942d069J1679j1132l1307K6046J0306K4388k2116n3624N349L0066m6723k0898
$$ plain form
18930 -82035 -69372 -62671 -51939 -55433 -32637 -55383 -100038 -60269 -874 -23874 -18522 -6659
18918 -6659 -16837 1999 12156 -14840 -51261 -70065 -58652 -89033 -81533 -71435 -33959 -5026
18906 -5026 8424 -34316 -34616 -66 3405 -20502 -11256 -1928 -2083 -32144 -42754 -45836 -52102 -54227
18892 -54227 -87864 -93162 -45841 -14260 -64284 -95913 -48099 -40382 -12064 11160 29055 24111
18880 24111 -11738 -21302 -26967 -30721 -64764 -39235 -24536 19745 31265 12690 -970 -8479
18868 -8479 -2935 982 -3266 -37366 -41801 -706 20225 30050 55185 40253 14663 -23917 -22654
18855 -22654 -33177 5704 9260 -5781 -15766 -20885 -33807 -28967 -42668 -8926 5079 11687 38729
18842 38729 35807 43518 10826 -6986 20639 38337 29389 64127 40105 2170 -4375 -23593
$$ packed form
18930h2035J2663O701J0732l494K2796k2746m4655L9769N9395k3000N352J1863
18918f659j0178J8836J0157k6996l6421j8804J1413l0381P500J0098L7476K8933
18906e026J3450m2740l00L4550L471k3907R246R328j55l0061j0610l082o266k125
18892e4227l3637n298M7321L1581n0024l1629M7814P717K8318K3224J7895m944
18880B4111l5849r564n665l754l4043K5529J4699M4281J1520j8575j3660p509
18868h479N544L917m248l4100m435M1095K0931R825K5135j4932k5590l8580J263
18855b2654j0523L8881L556j5041r985n119j2922M840j3701L3742J4005O608K7042
18842C8729k922P711l2692j7812K7625J7698q948L4738k4022l7935o545j9218
$$ plain form
18830 -23593 1411 -10829 24415 71898 35348 -14629 1927 6048 -12210 -23210 -61833 -39562
18818 -39562 -19226 12690 -12850 11193 -2903 -7529 -12441 -14633 -23274 -10238 -15402 1312 45129
18805 45129 57210 14308 1448 25617 26642 5809 34901 76830 55565 37925 34772 36942
18793 36942 -22515 -31706 -45108 -25161 1079 -25 -5481 -1086 14308 16309 45981 81147 93288
18780 93288 108559 106459 107192 113887 145930 140009 103940 97914 102361 132376 166337 175561 264818
18767 264818 463911 579450 550839 392465 250786 209785 159888 82264 48666 104007 143806
18756 143806 116851 88121 127364 131785 108044 107509 69024 47914 52185 89127 91245 44325
18744 44325 39691 78054 109769 144571 139500 117645 103534 95575 103466 117995 108110 135803 207254
$$ packed form
18830b3593K5004j2240L5244M7483l6550m9977J6556M121j8258j1000l8623K2271
18818c9562K0336L1916k5540K4043j4096m626m912k192q641J3036n164J6714M3817
18805D5129J2081m2902j2860K4169J025k0833K9092M1929k1265j7640l153K170
18793C6942n9457r191j3402J9947K6240j104n456M395J5394K001K9672L5166J2141
18780I3288J5271k100P33O695L2043n921l6069o026M447L0015L3961R224Q9257
18767B64818J99093J15539k8611j58374j41679m1001m9897p7624l3598N5341L9799
18756A43806k6955k8730L9243M421k3741n35l8485k1110M271L6942K118m6920
18744D4325m634L8363L1715L4802n071k1855j4111p959P891J4529r885K7693P1451
$$ plain form
18731 207254 225733 237661 229458 225891 223803 215928 249182 201178 177179 280801 348605 397813
18719 397813 448883 454342 442469 438218 409659 382174 441556 538359 613331 661955 705193 865214
18707 865214 1146451 1594356 2298559 3031058 3310281 3002021 2462114 2129842 2170470 2552356
18697 2552356 3271960 4514334 6322858 7686095 7415782 5897165 4351785 3371696 2824774
18688 2824774 2702066 2971718 3683534 4848008 5853766 5706237 4645752 3590450 3037730
18679 3037730 3009593 3422624 4127610 4593535 4311149 3528608 2818415 2376431 2082967 1929138
18669 1929138 1823303 1773216 1766977 1754085 1742528 1806753 1930586 2060780 2289589 2697700
18659 2697700 3380996 4387917 5723401 7166038 8396662 9488718 11438178 15144871
$$ packed form
18731B07254J8479J1928q203l567k088p875L3254m8004k3999J03622O7804M9208
18719C97813N1070N459j1873m251k8559k7485N9382R6803P4972M8624M3238J60021
18707H65214K81237M47905P04203P32499K79223l08260n39907l32272M0628L81886
18697B552356P19604J242374J808524J363237k70313j518617j545380r80089n46922
18688B824774j22708K69652P11816J164474J005758j47529j060485j055302n52720
18679C037730k8137M13031P04986M65925k82386p82541p10193m41984k93464j53829
18669A929138j05835n0087o239j2892j1557O4225J23833J30194K28809M08111
18659B697700O83296J006921J335484J442637J230624J092056J949460L706693
$$ plain form
18651 15144871 20319916 24273472 24561327 22704458 22187650 24730646 28140722 27775367
18643 27775367 22681223 16328348 11635706 8825861 7219263 6365196 5904270 5658183
18635 5658183 5532467 5569777 5912236 6737484 8351104 11005044 14218364 15888150 14748685
18626 14748685 12203051 10175308 9258383 9403531 10576816 13106609 17595339 24665887
18618 24665887 32617646 36404592 33926682 29022751 26093132 25632228 25937099 26561129
18610 26561129 29019653 35437490 46911419 60751231 68175855 64497457 55636404 50113049
18602 50113049 51268514 58778358 68903096 76060178 80621112 87180707 93600115 94477008
18594 94477008 90157624 81287328 67632705 52940075 42068582 36430012 35382246 37807178
$$ packed form
18651A5144871N175045L953556K87855j856869n16808K542996L410076l65355
18643B7775367n094144o352875m692642k809845j606598q54067m60926k46087
18635E658183j25716L7310L42459Q25248J613620K653940L213320J669786j139465
18626A4748685k545634k027743r16925J45148J173285K529793M488730P070548
18618B4665887P951759L786946k477910m903931k929619m60904L04871O24030
18610B6561129K458524O417837J1473929J3839812P424624l678398q861053n523355
18602E0113049J155465P509844J0124738P157082M560934O559595O419408Q76893
18594I4477008m319384q870296j3654623j4692630j0871493n638570j047766K424932
$$ plain form
18586 37807178 40702075 39512336 33442704 25834117 19754519 15618966 12923394 11210844
18578 11210844 10115315 9376094 8964452 8904617 9212794 9936408 11230570 13527022 17152131
18569 17152131 21008476 22097354 19997102 17451740 16594896 17531546 19386310 21300568
18561 21300568 23872235 28002355 31841190 32332967 29885731 27848322 28898643 33926208
18553 33926208 42354049 51932642 60673931 68209538 72387021 70566454 64788447 59693369
18545 59693369 54558538 46310475 36529049 29254540 24788737 21058833 17544668 14974486
18537 14974486 13629630 12894909 12217612 11711841 11822653 12028772 11335445 9822895 8285662
18528 8285662 7221700 6611614 6332246 6460205 7041084 8337493 10363715 12323161 12642798
$$ packed form
18586C7807178K894897j189739o069632p608587o079598m135553k695572j712550
18578A1210844j095529p39221m11642n9835L08177P23614J294162K296452L625109
18569A7152131L856345J088878k100252k545362q56844R36650J854764J914258
18561B1300568K571667M130120L838835M91777k447236k037409J050321N027565
18553C3926208Q427841R578593Q741289P535607M177483j820567n778007n095078
18545E9693369n134831q248063r781426p274509m465803l729904l514165k570182
18537A4974486j344856p34721o77297n05771J10812K06119o93327j512550j537233
18528H285662j063962o10086k79368J27959N80879J296409K026222J959446L19637
$$ plain form
18519 12642798 11153894 9215817 7876057 7380494 7727857 8959168 11428964 15487442
18511 15487442 19882117 21459619 19750769 17336432 15609955 14489531 14168138 13757784
18503 13757784 12074138 9645239 7704495 6577197 6177074 6482363 7630714 9949930
18495 9949930 13659602 17229793 17368328 13914865 9671566 6660279 4829086 3698446
18487 3698446 2964336 2521077 2179657 1906527 1731317 1630620 1536930 1394071 1270261 1156137
18477 1156137 1075344 1018669 950839 960598 1006213 989771 945559 909245 837557 832434 839287 823819
18465 823819 755134 711024 708400 648108 592824 589322 589679 628934 607516 587009 594403 601134 604939
18452 604939 634580 646594 650908 596473 533830 487223 440477 402006 407999 390841 366789 348613
$$ packed form
18519A2642798j488904j938077j339760m95563L47363J231311K469796M058478
18511A5487442M394675J577502j708850k414337j726477j120424l21393m10354
18503A3757784j683646k428899j940744j127298m00123L05289J148351K319216
18495I949930L709672L570191J38535l453463m243299l011287j831193j130640
18487C698446p34110m43259l41420k73130j75210j00697r3690j42859j23810j14124
18477A156137q0793n6675o7830R759M5615j6442m4212l6314p1688n123O853j5468
18465H23819o8685m4110k624o0292n5284l502L57L9255k1418k0507P394O731L805
18452F04939K9641J2014M314n4435o2643m6607m6746l8471N993j7158k4052j8176
$$ plain form
18440 348613 375005 369920 358703 362982 339684 310888 286778 286702 303211 298917 286642 320738 345646
18427 345646 360612 328885 332956 362838 382708 373274 388701 392232 384482 363822 412997 446446
18415 446446 419633 376377 364569 334496 321379 324706 326847 316265 341002 333657 334406 279389
18403 279389 229181 222086 212462 219539 233713 191116 129851 171696 238415 265692 238556 252117
18391 252117 278464 220951 205338 186856 180356 162153 190006 238292 238228 197814 157934 118859
18379 118859 91997 123650 140777 143205 187093 198639 150014 162866 192986 166020 183154 171541
18367 171541 189541 200281 205532 197379 226298 294114 284944 270697 195429 189863 202329 200863
18355 200863 205224 227951 195097 149690 150640 151242 139782 146397 102699 121570 131961 125197 93283
$$ packed form
18440C48613K6392n085j1217M279k3298k8796k4110p6J6509m294j2275L4096K4908
18427C45646J4966l1727M071K9882J9870r434J5427L531p750k0660M9175L3449
18415D46446k6813m3256j1808l0073j3117L327K141j0582K4737p345P49n5017
18403B79389n0208p095r624P077J4174m2597o1265M1845O6719K7277k7136J3561
18391B52117K6347n7513j5613j8482o500j8203K7853M8286o4m0414l9880l9075
18379A18859k6862L1653J7127K428M3888J1546m8625J2852L0120k6966J7134j1613
18367A71541J8000J0740N251q153K8919O7816r170j4247p5268n566J2466j466
18355B00863M361K2727l2854m5407R50O02j1460O615m3698J8871J0391o764l1914
$$ plain form
18342 93283 116150 116648 171200 171078 125543 121774 158048 128437 106682 126598 118185 135936 154403
18329 154403 128993 152314 147751 175319 137344 135250 139067 143185 129975 150931 130916 126033
18317 126033 126281 126183 142753 120743 40971 52524 22031 29182 98281 80871 91909 123577 126099
18304 126099 93335 52175 17562 8777 48265 122520 160033 131288 110743 118759 128831 115346
18292 115346 59104 24586 34164 49472 76647 82182 89318 106820 87443 45370 71415 106942
18280 106942 130451 128673 102456 59505 69363 96533 143589 130819 96572 100413 84491 64044
18268 64044 48657 45527 43708 31321 -13501 9846 14047 -13014 15945 35875 75075 68145
18256 68145 67001 57528 54474 43267 58773 70772 38091 22276 31383 20282 29409 39006 26519
$$ packed form
18342I3283K2867M98N4552j22m5535l769L6274k9611k1755J9916q413J7751J8467
18329A54403k5410K3321m563K7568l7975k094L817M118j3210K0956k0015m883
18317A26033K48r8J6570k2010p9772J1553l0493P151O9099j7410J1038L1668K522
18304A26099l2764m1160l4613q785L9488P4255L7513k8745k0545Q016J0072j3485
18292A15346n6242l4518R578J5308K7175N535P136J7502j9377m2073K6045L5527
18280A06942K3509j778k6217m2951R858K7170M7056j2770l4247L841j5922k0447
18268F4044j5387l130j819j2387m4822K3347M201k7061K8959J9930L9200o930
18256F8145j144r473l054j1207J5506J1999l2681j5815R107j1101R127R597j2487
$$ plain form
18243 26519 4690 8182 -34298 -69148 -77285 -76431 -47028 -68039 -40550 71739 214031 231534
18231 231534 213107 213399 177770 175372 170921 168710 146030 141159 158902 141332 92413 73561 38562
18218 38562 72489 67680 61235 85969 97038 72901 71665 114497 95099 67362 30612 38736
18206 38736 69097 105827 118101 106621 144472 135758 128070 121304 113720 90922 116937 127270
18194 127270 149011 134364 113263 99155 124926 137636 136435 121409 162571 127738 70935 48121
18182 48121 63960 63773 86857 103176 114511 118626 98778 73645 146318 197436 242133 267937
18170 267937 245066 191147 177345 189575 182029 193964 192956 173161 185635 198963 204792 234314
18158 234314 200331 171733 179232 173941 152484 121245 94811 91685 119023 112893 74067 70402
$$ packed form
18243B6519k1829L492m2480l4850q137Q54K9403k1011K7489J12289J42292J7503
18231B31534j8427K92l5629k398m451k211k2680m871J7743j7570m8919j8852l4999
18218C8562L3927m809o445K4734J1069k4137j236M2832j9398k7737l6750Q124
18206C8736L0361L6730J2274j1480L7851q714p688o766p584k2798K6015J0333
18194A27270K1741j4647k1101j4108K5771J2710j201j5026M1162l4833n6803k2814
18182D8121J5839j87K3084J6319J1335M115j9848k5133P2673N1118M4697K5804
18170B67937k2871n3919j3802J2230p546J1935j008j9795J2474J3328N829K9522
18158B34314l3983k8598P499n291k1457l1239k6434l126K7338o130l8826l665
$$ plain form
18146 70402 123742 163391 165561 211671 248207 258004 276720 292730 283308 300390 325745 397393
18134 397393 444580 511749 585853 637255 712730 780066 846289 885884 936025 1091661 1226873
18123 1226873 1379429 1525927 1616323 1827028 2167894 2637572 3204244 4030029 5147281
18114 5147281 6821772 9464952 13919279 22103073 37177008 62106638 86288961 86207329
18106 86207329 63490447 39236379 24446635 16303660 11535637 8658537 6834528 5583024
18098 5583024 4651860 3983726 3468709 3015471 2594919 2243918 1992154 1775101 1673968
18089 1673968 1561239 1414737 1272401 1145977 995360 929518 833977 745267 699395 684806
18079 684806 652974 602323 591970 578484 547752 515395 470450 419488 391467 390778 377979 352141
$$ packed form
18146G0402N3340L9649K170M6110L6536R797J8716J6010r422J7082K5355P1648
18134C97393M7187O7169P4104N1402P5475O7336O6223L9595N0141J55636J35212
18123A226873J52556J46498R0396K10705L40866M69678N66672Q25785J117252
18114E147281J674491K643180M454327Q183794J5073935K4929630K4182323q1632
18106H6207329k2716882k4254068j4789744q142975m768023k877100j824009j251504
18098E583024r31164o68134n15017m53238m20552l51001k51764k17053j01133
18089A673968j12729j46502j42336j26424j50617o5842r5541q8710m5872j4589
18079F84806l1832n0651j0353j3486l0732l2357m4945n0962k8021o89j2799k5838
$$ plain form
18067 352141 353971 362829 349312 346914 339223 328106 340739 303796 288872 329733 373258 379741
18055 379741 433809 488056 529587 494952 477814 483194 500404 449195 443819 471996 498086 540181
18043 540181 593197 552018 462537 407732 376066 377042 387943 326911 312894 286337 311267 316210
18031 316210 289418 256539 221870 218008 185232 161626 149328 136318 126662 158165 212000 216413
18019 216413 189874 169436 126326 104976 76502 61943 86116 87994 63091 100026 172501 246951
18007 246951 272905 292343 295730 277686 278638 256543 211974 214033 224393 217435 236391 301175
17995 301175 321670 289630 261463 256700 259905 289793 329169 345033 315283 271994 246955 228762
17983 228762 158265 126491 168194 251347 260161 260422 273997 242706 208928 156635 108206 92406
$$ packed form
18067C52141J830Q858j3517k398p691j1117J2633l6943j4924M0861M3525O483
18055C79741N4068N4247M1531l4635j7138N380J7210n1209n376K8177K6090M2095
18043E40181N3016m1179q9481n4805l1666R76J0901o1032j4017k6557K4930M943
18031C16210k6792l2879l4669l862l2776k3606j2298j3010r656L1503N3835M413
18019B16413k6539k0438m3110k1350k8474j4559K4173J878k4903L6935P2475P4450
18007B46951K5954J9438L387j8044R52k2095m4569K059J0360o958J8956O4784
17995C01175K0495l2040k8167m763L205K9888L9376J5864k9750m3289k5039j8193
17983B28762p0497l1774M1703Q3153Q814K61J3575l1291l3778n2293m8429j5800
$$ plain form
17971 92406 113427 135112 142412 147071 153977 121376 106104 148624 158316 182351 172991 133122 82991
17958 82991 80047 107028 123823 149300 147777 102045 107102 153673 174144 194744 194578 196790 173710
17945 173710 150993 140304 150118 185619 184219 107932 64773 83705 86780 68652 86979 70885
17933 70885 88991 65709 44328 21671 19455 19249 25569 43353 81457 118738 118920 122174 126535
17920 126535 131451 79591 29184 57392 75625 84526 45690 48974 102959 92140 53684 32647
17908 32647 26048 20434 56869 78436 73728 69914 58137 32782 39234 70904 91852 108948 91098
17895 91098 65084 85562 89602 109858 119253 110828 121308 90821 72524 35328 46536 53555
17883 53555 71237 57842 14210 15531 18900 33507 42475 72126 72247 45970 89600 63538 70683
$$ packed form
17971I2406K1021K1685P300M659O906l2601j5272M2520R692K4035r360l9869n0131
17958H2991k944K6981J6795K5477j523m5732N057M6571K0471K0600j66K212k3080
17945A73710k2717j0689R814L5501j400p6287m3159J8932L075j8128J8327j6094
17933G0885J8106k3282k1381k2657k216k06O320J7784L8104L7281J82L254M361
17920A26535M916n1860n0407K8208J8233Q901l8836L284N3985j0819l8456k1037
17908C2647o599n614L6435K1567m708l814j1777k5355O452L1670K0948J7096j7850
17895I1098k6014K0478M040K0256R395q425J0480l0487j8297l7196J1208P019
17883E3555J7682j3395m3632J321L369J4607Q968K9651J21k6277M3630k6062P145
$$ plain form
17870 70683 79413 43273 48608 75235 70303 68897 61273 27826 37011 32212 35001 27912 28580 29411
17856 29411 38877 46293 67115 41304 57557 65702 31638 18913 21656 67816 87125 117150
17844 117150 88500 43451 29434 81931 44280 -29009 -12143 19415 25563 11814 -25215 -37334
17832 -37334 -16437 32076 35738 28023 -14528 5893 41008 48600 39181 27471 9417 48303
17820 48303 74528 56650 30751 27961 44680 51166 15980 25508 13332 18599 2293 -24271
17808 -24271 -25996 -15180 -17053 -2877 24136 44568 27250 39389 78542 84511 43273 -8143
17796 -8143 -18536 -11784 -10267 -4965 448 -4881 -13001 -15041 -40104 -13325 13834 31463 14962
17783 14962 23483 41622 26810 16859 38873 55846 14003 -20387 -18173 2671 58356 78948
$$ packed form
17870G0683Q730l6140N335K6627m932j406p624l3447R185m799K789p089O68Q31
17856B9411R466P416K0822k5811J6253Q145l4064j2725K743M6160J9309L0025
17844A17150k8650m5049j4017N2497l7651p3289J6866L1558O148j3749l7029j2119
17832c7334K0897M8513L662p715m2551K0421L5115P592r419j1710j8054L8886
17820D8303K6225j7878k5899k790J6719O486l5186R528j2176N267j6306k6564
17808b4271j725J0816j873J4176K7013K0432j7318J2139L9153N969m1238n1416
17796h143j0393O752J517N302N413n329q120k040k5063K6779K7159J7629j6501
17783A4962Q521J8139j4812r951K2014J6973m1843l4390K214K0844N5685K0592
$$ plain form
17771 78948 92680 59961 40755 67744 51374 48477 57239 20656 26871 6655 6096 22898 27227
17758 27227 12282 28711 49226 4644 7474 25524 33785 75156 73709 40780 50156 36150
17746 36150 54520 46811 27138 -1047 -6596 -2851 15084 11258 17078 15442 11829 43124 48201
17733 48201 32163 19234 -11719 -58889 -14656 21981 1337 5543 12669 12102 -29842 -15941
17721 -15941 -28136 -30832 21531 22139 -10449 342 3300 12646 27943 8908 17946 45482 21189
17708 21189 16049 37818 49069 -9783 -754 3214 -19939 14787 56074 34519 12438 4909
17696 4909 8458 -215 -5250 -12820 -5320 26843 29042 2648 2116 24731 63423 83219 46517
17683 46517 -33325 -28028 -25196 -43587 -32149 -14748 -23220 -39976 -61812 -44267 12797 19746
$$ packed form
17771G8948J3732l2719j9206K6989j6370k897Q762l6583O215k0216n59J6802M329
17758B7227j4945J6429K0515m4582K830J8050Q261M1371j447l2929R376j4006
17746C6150J8370p709j9673k8185n549L745J7935l826N820j636l613L1295N077
17733D8201j6038j2929l0953m7170M4233L6637k0644M206P126n67m1944J3901
17721a5941j2195k696N2363O08l2588J0791K958R346J5297j9035R038K7536k4293
17708B1189n140K1769J1251n8852R029L968k3153L4726M1287k1555k2081p529
17696D909L549q673n035p570P500L2163K199k6394n32K2615L8692J9796l6702
17683D6517p9842N297K832j8391J1438J7401q472j6756k1836J7545N7064O949
$$ plain form
17671 19746 30624 27836 49586 49986 82779 75330 91291 125189 89292 67990 55872 61453 32548
17658 32548 -17590 -71072 -22415 23524 28721 40701 27404 -32284 -27612 13446 -1918 -47675
17646 -47675 -47648 -60794 -3086 33878 16390 -15521 -47635 -45218 -4828 -4277 11220 70347 39600
17633 39600 11370 14404 -7923 21587 22870 5091 14787 69300 107691 106729 27628 -21121 -8242
17620 -8242 -1151 -27003 7670 7839 -8578 -15783 -43829 -62952 -45201 -31618 -14181 -21528 -36074
17607 -36074 24638 54843 58559 28517 16861 19174 -16428 -39898 3186 57207 62154 34126
17595 34126 48726 60940 51856 44950 49207 31705 38794 7466 -7305 19268 5014 -6501
17583 -6501 -22658 -13039 30341 15677 158 17774 50799 22117 -18912 8945 46431 69565
$$ packed form
17671A9746J0878k788K1750M00L2793p449J5961L3898l5897k1302j2118N581k8905
17658C2548n0138n3482M8657M5939N197J1980j3297n9688M672M1058j5364m5757
17646d7675K7j3146N7708L6964j7488l1911l2114K417M0390N51J5497N9127l0747
17633C9600k8230L034k2327K9510J283j7779R696N4513L8391r62p9101m8749J2879
17620h242P091k5852L4673J69j6417p205k8046j9123J7751J3583J7437p347j4546
17607c6074O0712L0205L716l0042j1656K313l5602k3470M3084N4021M947k8028
17595C4126J4600J2214r084o906M257j7502P089l1328j4771K6573j4254j1515
17583f501j6157R619M3380j4664j5519J7616L3025k8682m1029K7857L7486K3134
$$ plain form
17571 69565 56054 55435 42978 31659 8081 -16067 -17381 14656 35127 36804 21576 35585
17559 35585 56536 86750 27686 -51288 -25065 8344 42443 5912 -17535 -5111 -7720 -18247
17547 -18247 -8750 5854 -8376 15840 29104 21595 42097 32474 -5368 -14277 -40565 -30154
17535 -30154 -50424 -62108 -45119 -70291 -37460 101 -14681 -19180 19102 43438 8643 38399
17523 38399 63060 45904 31551 35513 52179 50725 44139 28968 41273 38460 24175 32339 46961
17510 46961 23133 -21338 -46430 -70175 -85062 -85035 -78132 -59089 -25578 -12948 -4048 -10095 -23502
17497 -23502 -32969 -16220 25390 -8127 15816 16497 -8721 9800 11982 35436 76275 105932
17485 105932 94515 62212 40920 71519 65117 8319 -6506 -9056 -30628 -34223 -18750 -16506
$$ packed form
17571F9565j3511o19j2457j1319k3578k4148j314L2037K0471J677j5228J4009
17559C5585K0951L0214n9064p8974K6223L3409L4099l6531k3447J2424k609j0527
17547a8247R497J4604j4230K4216J3264p509K0502r623l7842q909k6288J0411
17535c0154k0270j1684J6989k5172L2831L7561j4782m499L8282K4336l4795K9756
17523C8399K4661j7156j4353L962J6666j454o586j5171J2305k813j4285Q164J4622
17510D6961k3828m4471k5092k3745j4887K7O903J9043L3511J2630Q900o047j3407
17497b3502r467J6749M1610l3517K3943O81k5218J8521K182K3454M0839K9657
17485A05932j1417l2303k1292L0599o402n6798j4825k550k1572l595J5473K244
$$ plain form
17473 -16506 -43260 -26027 -19243 -37503 -51253 -38813 20331 76881 94441 73223 25509 -60176
17461 -60176 -55686 -3915 19891 6559 -5054 -17262 -32710 1551 18423 10361 1845 15600
17449 15600 37255 93062 156056 120121 110710 153742 287376 448905 490088 397162 214608
17438 214608 131075 120801 101163 131861 145945 144426 97576 47922 44886 34971 47845 55042
17426 55042 64873 65801 37626 50436 37251 46425 17283 35594 35144 32121 53628 32535 -8109
17413 -8109 -4823 7075 -20723 12305 44851 11278 -28878 -22347 -20829 -4711 22274 15568 -68282
17400 -68282 -70324 -49996 -29286 -31207 -2069 33372 65169 84520 81175 40210 10960 -4337
17388 -4337 6595 28341 8766 -9918 2911 22572 17328 61946 80302 78581 53123 -7239
$$ packed form
17473a6506k6754J7233O784j8260j3750J2440N9144N6550J7560k1218m7714q5685
17461f0176M490N1771K3806j3332j1613j2208j5448L4261J6872q062q516J3755
17449A5600K1655N5807O2994l5935r411M3032J33634J61529M1183r2926j82554
17438B14608q3533j0274j9638L0698J4084j519m6850m9654l036r915J2874P197
17426E5042R831R28k8175J2810j3185R174k9142J8311m50l023K1507k1093m0644
17413h109L286J1898k7798L3028L2546l3573m0156O531J518J6118K6985o706q3850
17400f8282k042K0328K0710j921K9138L5441L1797J9351l345m0965k9250j5297
17388d337J0932K1746j9575j8684J2829J9661n244M4618J8356j721k5458o0362
$$ plain form
17376 -7239 19484 49715 51707 8828 -15938 15123 51265 38731 27648 57930 55487 -7590
17364 -7590 -22203 -25122 -35196 -39678 -21233 -47876 -52662 -39726 -43931 -32114 -55467 -80276 -31227
17351 -31227 18016 40014 38321 76676 78222 22849 -20151 -30333 10019 41197 21110 31233
17339 31233 82239 72620 47622 30587 18328 6821 16857 15070 32862 13678 36425 46405
17327 46405 -2020 -4058 23274 8699 -720 37495 -13318 -3867 37008 56005 47130 -17724
17315 -17724 -16524 -4861 8526 -4974 -1512 16023 28343 9139 -7763 -1192 -11414 9652
17303 9652 25661 10356 -36852 -51186 -34855 -22508 -7729 5541 62472 34790 -2973 -4835
17291 -4835 -14870 -1137 11434 8870 13892 53047 74480 37106 -12121 -1807 52031 37269
$$ packed form
17376g239K6723L0231J992m2879k4766L1061L6142j2534j1083L0282k443o3077
17364g590j4613k919j0074m482J8445k6643m786J2936m205J1817k3353k4809M9049
17351c1227M9243K1998j693L8355J546n5373m3000j0182M0352L1178k0087J0123
17339C1233N1006r619k4998j7035j2259j1507J0036j787J7792j9184K2747R980
17327D6405m8425k038K7332j4575r419L8215n0813R451M0875J8997q875o4854
17315a7724J200J1663J3387j3500L462J7535J2320j9204j6902O571j0222K1066
17303I652J6009j5305m7208j4334J6331J2347J4779J3270N6931k7682l7763j862
17291d835j0035J3733J2571k564N022L9155K1433l7374m9227J0314N3838j4762
$$ plain form
17279 37269 16781 37539 32875 31311 31150 22589 16354 14526 52748 57947 59339 50718 30081 -8604
17265 -8604 2066 30412 5687 -30837 -59754 -27936 7559 23965 -12601 -33032 -13939 -14565
17253 -14565 -5901 -7520 -14155 169 9164 -18841 -33743 7383 23148 1137 -30764 -22847 -24934
17240 -24934 -45747 -59321 -64716 -35112 8201 18928 26127 -9011 -29166 619 37005 47113
17228 47113 47660 -7236 7923 32300 76327 40125 36520 59110 62096 62628 43875 23939 52270
17215 52270 68942 110963 97065 59050 49574 95656 72170 33176 29424 32398 18564 57907
17203 57907 58297 49570 63654 55970 58198 2786 -40965 -29294 -26268 -47686 -54217 -4708 34014
17190 34014 28153 4932 -27412 -30396 -19910 5548 63882 106106 67345 44322 50915 23754
$$ packed form
17279C7269k0488K0758m664j564j61q561o235j828L8222N199J392q621k0637l8685
17265h604J0670K8346k4725l6524k8917L1818L5495J6406l6566k0431J9093o26
17253a4565Q664j619o635J4324Q995k8005j4902M1126J5765k2011l1901P917k087
17240b4934k0813j3574n395K9604M3313J0727P199l5138k0155K9785L6386J0108
17228D7113N47n4896J5159K4377M4027l6202l605K2590K986N32j8753j9936K8331
17215E2270J6672M2021j3898l8015r476M6082k3486l8994l752K974j3834L9343
17203E7907L90q727J4084p684K228n5412m3751J1671L026k1418o531M9509L8722
17190C4014n861k3221l2344k984J0486K5458N8334M2224l8761k3023O593k7161
$$ plain form
17178 23754 19298 9713 9001 20744 32855 44624 58130 45131 24087 3951 -632 -12461 10313
17165 10313 9848 -19386 -26457 -19137 -32160 -45277 -59299 -51624 -60603 -23811 -36777 -44319 -56071
17152 -56071 -1828 38585 40512 27113 16498 -14091 -11204 -25457 14825 23407 11905 -902
17140 -902 22805 21474 51337 72667 49653 33550 7965 9898 -7211 11237 31519 3669
17128 3669 -36336 -30319 -11501 -45126 -90261 -67826 -23650 -5269 -15567 -23641 -24945 18812
17116 18812 46127 50066 62784 50662 14131 -2455 -57481 -56176 -37121 -33436 -36100 -31434 -22174
17103 -22174 -11898 -12506 25890 18499 -3998 -32876 -17777 -24512 -10147 11415 45117 86619
17091 86619 61834 12167 -1343 -18157 -6139 -10694 -15272 5319 32941 -20615 -45545 -54362
$$ packed form
17178B3754m456r585p12J1743J2111J1769J3506j2999k1044k0136m583j1829K2774
17165A0313m65k9234p071P320j3023j3117j4022P675q979L6792j2966p542j1752
17152e6071N4243M0413J927j3399j0615l0589K887j4253M0282Q582j1502j2807
17140i02K3707j331K9863K1330k3014j6103k5585J933j7109J8448K0282k7850
17128C669m0005O017J8818l3625m5135K2435M4176J8381j0298q074j304M3757
17116A8812K7315L939J2718j2122l6531j6586n5026J305J9055L685k664M666R260
17103b2174J0276o08L8396p391k2497k8878J5099o735J4365K1562L3702M1502
17091H6619k4785m9667j3510j6814J2018m555m578K0591K7622n3556k4930q817
$$ plain form
17079 -54362 -88497 -113366 -107448 -76417 -24439 -31899 -47122 -56542 -73942 -63407 -81794 -64677
17067 -64677 12575 52643 33364 3144 -17434 -47785 -60424 -7940 -4627 41719 44007 6817
17055 6817 7167 7386 -3312 -29312 -14933 65 19115 -9086 -13037 -16625 -28591 -19446 -7476
17042 -7476 -20052 5879 31047 23416 5327 -50746 -93340 -102699 -132668 -146239 -121158 -86772
17030 -86772 -56804 -58021 -34523 -6262 -13358 -23199 19126 53948 52351 9950 -10448 5925
17018 5925 -37363 -52820 -10861 2635 4902 25132 7380 13171 398 -37020 -31741 16183
17006 16183 59697 70614 12975 -217 44843 59474 58715 35378 20034 4693 -2253 -43843
16994 -43843 -58352 -18535 -59230 -67291 4568 43802 40868 -2574 -56024 -79562 -84675 -53602
$$ packed form
17079e4362l4135k4869N918L1031N1978p460j5223r420j7400J0535j8387J7117
17067f4677P7252M0068j9279l0220k0578l0351j2639N2484L313M6346K288l7190
17055F817L50K19j0698k6000J4379J4998J9050k8201l951l588j1966R145J1970
17042g476j2576K5931K5168p631j8089n6073m2594r359k9969j3571K5081L4386
17030h6772K9968j217K3498K8261p096r841M2325L4822j597m2401k0398J6373
17018E925m3288j5457M1959J3496K267K0230j7752N791j2773l7418N279M7924
17006A6183M3514J0917n7639j3192M5060J4631p59k3337j5344j5341o946m1590
16994d3843j4509L9817m0695q061P1859L9234k934m3442n3450k3538n113L1073
$$ plain form
16982 -53602 -53166 -21684 6985 3060 38311 58333 55016 -2872 -21877 7876 1129 25556 9417
16969 9417 -47611 -67879 -30854 16633 51783 46771 24823 12926 -49162 -40842 1333 23895
16957 23895 -7019 -12304 38657 76996 84809 78606 73637 67587 38495 28409 72014 60715 20652
16944 20652 -33248 9943 57193 53344 78659 103390 59551 27109 27556 24976 52315 108294
16932 108294 123422 74804 49230 17842 24457 45220 -1595 -12273 -10000 34312 80943 41351
16920 41351 56596 45819 43167 -9856 -21206 -50451 -70064 -39631 -55827 -44009 1 14267
16908 14267 -46259 -115506 -110208 -68596 -56273 -91454 -74044 -60967 -59353 -67420 -37106 -56111
16896 -56111 -60362 -28033 -17701 -14630 18844 -15826 -55042 -17998 9634 54305 8978 189
$$ packed form
16982e3602M36L1482K8669l925L5251K0022l317n7888j9005K9753o747K4427j6139
16969I417n7028k0268L7025M7487L5150n012k1948j1897o2088Q320M2175K2562
16957B3895l0914n285N0961L8339P813o203m969o050k9092j0086M3605j1299m0063
16944B0652n3900M3191M7250l849K5315K4731m3839l2442M47k580K7339N5979
16932A08294J5128m8618k5574l1388O615K0763m6815j0678K273M4312M6631l9592
16920D1351J5245j0777k652n3023j1350k9245j9613L0433j6196J1818M4010J4266
16908A4267o0526o9247N298M1612J2323l5181J7410J3077J614q067L0314j9005
16896e6111m251L2329J0332L071L3474l4670l9216L7044K7632M4671m5327q789
$$ plain form
16884 189 43843 54716 5043 18475 18 -38421 -40552 -26589 5696 42069 18821 23997
16872 23997 18614 15195 31535 41042 48109 40955 22902 25855 19979 34398 54319 72923 55920
16859 55920 20994 6963 -16396 -498 23718 14329 30103 33065 -17446 -56454 -66095 -54561
16847 -54561 -15021 3769 32346 38238 32054 13010 2428 17900 -5392 -32084 -22061 -18566
16835 -18566 -72247 -102663 -86800 -65090 -40868 -42691 -61106 -43420 -8999 12714 3361 -16780
16823 -16780 -12454 2111 -32912 -31007 -23360 -9218 -5213 -41978 -61937 -31108 -9802 -28430
16811 -28430 -34119 -21821 -37904 -69854 -80914 -49682 16772 42274 1130 6070 4144 -4057
16799 -4057 5465 -5435 -4112 22097 80297 43155 8948 -10950 -5390 16090 24141 -21133 -73703
$$ packed form
16884A89M3654J0873m9673J3432j8457l8439k131J3963L2285L6373k3248N176
16872B3997n383l419J6340R507P067p154j8053K953n876J4419J9921J8604j7003
16859E5920l4926j4031k3359J5898K4216r389J5774K962n0511l9008r641J1534
16847e4561L9540J8790K8577N892o184j9044j0582J5472k3292k6692J0023L495
16835a8566n3681l0416J5863K1710K4222j823j8415J7686L4421K1713r353k0141
16823a6780M326J4565l5023J905P647J4142M005l6765j9959L0829K1306j8628
16811b8430n689J2298j6083l1950j1060L1232O6454K5502m1144M940j926q201
16799d057R522j0900J323K6209N8200l7142l4207j9898N560K1480Q051m5274n2570
$$ plain form
16786 -73703 -83598 -54043 -12392 -19782 -51833 -48583 -37170 -31178 -20610 -12633 6594 33557 28442
16773 28442 -19497 16114 55001 60886 22032 -12427 -14154 -37297 -64750 -3444 58739 61385
16761 61385 57093 19714 32326 41357 8750 -8271 15880 40473 58649 95822 58966 43875
16749 43875 68380 71021 54024 13422 -17861 28035 31902 59494 74854 62031 33054 43300
16737 43300 60003 53523 63891 47295 7075 -37682 -58971 -64705 -17421 15979 27529 41348
16725 41348 23680 3281 -22078 -20746 -25082 -12617 -30484 -22992 17120 53521 118144 109063
16713 109063 60347 35722 10086 11613 30583 36009 54247 68573 78369 72094 49130 57640
16701 57640 47509 16708 -7767 12645 39896 60909 66929 91800 60533 16377 42694 59595
$$ packed form
16786g3703r895K9555M1651p390l2051L250J1413N992J0568P977J9227K6963n115
16773B8442m7939L5611L8887N885l8854l4459j727k3143k7453O1306O2183K646
16761F1385m292l7379J2612R031l2607j7021K4151K4593J8176L7173l6856j5091
16749D3875K4505K641j6997m0602l1283M5896L867K7592J5360j2823k8977J0246
16737D3300J6703o480J0368j6596m0220m4757k1289n734M7284L3400J1550J3819
16725D1348j7668k0399k5359J332m336J2465j7867P492M0112L6401O4623r081
16713A09063m8716k4625k5636J527J8970N426J8238J4326R796o275k2964Q510
16701E7640j0131l0801k4475K0412K7251K1013O020K4871l1267m4156K6317J6901
$$ plain form
16689 59595 38212 42793 1744 -49055 -64766 -75631 -86216 -44243 9714 30239 15871 -1818
16677 -1818 -17969 -36846 15702 48391 74736 48228 2410 16078 -1690 -15170 6639 19615
16665 19615 46409 30817 44441 -10400 -68297 -64311 -31213 -27408 -39480 -83277 -76304 -20919
16653 -20919 -23153 -65319 -69586 -84266 -52016 19246 55836 39995 -5734 -47233 -39539 8064
16641 8064 -463 -34832 -45364 -31846 -25393 -67257 -71931 -34149 7241 14515 6302 -33050 -26633
16628 -26633 -3587 17627 42963 12932 -8424 6998 32015 73983 66751 66415 13499 -34650
16616 -34650 -10084 21309 24228 39373 32698 13232 31261 40235 3748 -33879 -21051 28356
16604 28356 36503 34976 -13365 -10196 -23607 -45595 -11248 20567 47766 55088 47064 54428 62179
$$ packed form
16689E9595k1383M581m1049n0799j5711j0865j0585M1973N3957K0525j4368j7689
16677a818j6151j8877N2548L2689K6345k6508m5818J3668j7768j3480K1809J2976
16665A9615K6794j5592J3624n4841n7897L986L3098L805j2072m3797O973N5385
16653b0919k234m2166m267j4680L2250P1262L6590j5841m5729m1499P694M7603
16641H064q527l4369j0532J3518O453m1864m674L7782M1390P274q213l9352O417
16628b6633K3046K1214K5336l0031k1356J5422K5017M1968p232l36n2916m8149
16616c4650K4566L1393K919J5145o675j9466J8029Q974l6487l7627J2828M9407
16604B8356Q147j527m8341L169j3411k1988L4347L1815K7199P322q024P364P751
$$ plain form
16591 62179 46691 15965 -21875 -28124 -33336 -37910 14194 4748 2285 5903 -6309 -32073 -60066
16578 -60066 -69824 -78416 -88477 -65012 -51634 -32596 -6650 18644 23198 6885 -20805 -44575
16566 -44575 -32535 33776 24506 9271 -9095 -27030 -32395 -40298 -43628 -65704 -72326 -44406 -26940
16553 -26940 19896 22708 9622 17968 21568 2310 -6232 -52979 -71596 -75178 -68974 -44284 -41837
16540 -41837 -60973 -45522 -15121 15321 600 13487 19396 -15506 5944 18520 -16951 -41384
16528 -41384 -48705 -80333 -59157 -19006 -7493 -18713 -35490 2042 1619 26667 52272 86168
16516 86168 71150 61935 63107 7436 -19116 12049 33844 49155 21247 47950 66946 18597
16504 18597 -19143 -7139 8279 13931 8183 4681 8696 4776 16063 8385 -14094 -1505 -8421
$$ packed form
16591F2179j5488l0726l7840o249n212m574N2104r446k463L618j2212k5764k7993
16578f0066r758q592j0061K3465J3378J9038K5946K5294M554j6313k7690k3770
16566d4575J2040O6311r270j5235j8366j7935n365p903l330k2076o622K7920J7466
16553b6940M6836K812j3086Q346L600j9258q542m6747j8617l582O204K4690K447
16540d1837j9136J5451L0401L0442j4721J2887N909l4902K1450J2576l5471k4433
16528d1384p321l1628K1176M0151J1513j1220j6777L7532m23K5048K5605L3896
16516H6168j5018r215J172n5671k6552L1165K1795J5311k7908K6703J8996m8349
16504A8597l7740J2004J5418N652n748l502M015l920J1287p678k2479J2589o916
$$ plain form
16491 -8421 -39660 -1766 878 -13158 -40 -7620 -6891 -5711 -10187 -11262 -5940 -7307 -8118 -14505
16477 -14505 -14239 893 9727 2597 27044 7078 -12889 -25871 10187 13703 34494 18319 13901
16464 13901 45435 35926 4489 43794 28284 -4673 -54767 -54490 -15904 28072 57437 80673
16452 80673 54389 50355 40356 11628 -15844 -26507 -28855 -30336 14857 28325 22126 37380 10946
16439 10946 -6453 10118 -12879 -2782 5934 2796 18833 11057 -15447 40938 84819 79746
16427 79746 63407 91837 67782 24461 -1074 -7832 -4497 -25229 -29813 -6024 11434 20546
16415 20546 37687 59799 16714 -6651 22205 56312 49765 40473 3769 -10431 8280 -7501
16403 -7501 -32957 -35570 -28607 -7511 4440 -44206 -51114 -29829 -59840 -72175 -40327 -22129
$$ packed form
16491h421l1239L7894K644j4036J3118p580P29J180m476j075N322j367q11o387
16477a4505K66J5132Q834p130K4447j9966j9967j2982L6058L516K0791j6175m418
16464A3901L1534r509l1437L9305j5510l2957n0094K77L8586M3976K9365K3236
16452H0673k6284m034r999k8728k7472j0663k348j481M5193J3468o199J5254k6434
16439A0946j7399J6571k2997J0097Q716l138J6037p776k6504N6385M3881n073
16427G9746j6339K8430k4055m3321k5535o758L335k0732m584K3789J7458R112
16415B0546J7141K2112m3085k3365K8856L4107o547r292l6704j4200J8711j5781
16403g501k5456k613O963K1096J1951m8646o908K1285l0011j2335L1848J8198
$$ plain form
16391 -22129 17479 36551 9525 61609 104639 71143 38645 12309 -24206 -12835 -2269 11012
16379 11012 52450 75375 83644 45877 -7673 7806 -13355 -34365 -39748 -25441 -6299 -37243
16367 -37243 26019 64214 53817 31542 45045 29641 42152 51976 22307 10 13954 21490
16355 21490 -5263 -9083 4484 -15385 29994 48932 27599 -12568 -14379 -1221 26712 13860
16343 13860 -54020 -92720 -26799 -14431 -3082 15495 10898 27896 52637 47976 42383 61997
16331 61997 26572 23528 40536 16025 -4227 10376 17886 12687 9716 9795 17312 20709 30829
16318 30829 13304 50144 29270 -9199 -13954 -19474 -10490 -3979 -25430 -76896 -55931 -15374
16306 -15374 -2712 -15207 -13777 -16372 17112 14400 -22580 -52437 -114820 -118779 -95104 -84852
$$ packed form
16391b2129L9608J9072k7026N2084M3030l3496l2498k6336l6515J1371J0566J3281
16379A1012M1438K2925Q269l7767n3550J5479k1161k1010n383J4307J9142l0944
16367c7243O3262L8195j0397k2275J3503j5404J2511R824k9669k2297J3944P536
16355B1490k6753l820J3567j9869M5379J8938k1333m0167j811J3158K7933j2852
16343A3860o7880l8700O5921J2368J1349J8577m597J6998K4741m661n593J9614
16331F1997l5425l044J7008k4511k0252J4603P510n199k971P9P517L397J0120
16318C0829j7525L6840k0874l8469m755n520Q984O511k1451n1466K0965M0557
16306a5374J2662j2495J430k595L3484k712l6980k9857o2383l959K3675J0252
$$ plain form
16294 -84852 -59460 -36735 -31884 -1762 11984 -16852 -18292 -15193 40003 57975 79572 113522
16282 113522 117642 140539 109166 55718 6046 -16063 43360 56358 10197 -30747 -16762 24044
16270 24044 40100 53525 30081 28825 11413 -3155 27440 61826 40031 18105 -10482 -41689
16258 -41689 -76084 -25027 21263 41187 8990 -9371 -26065 -29932 -24236 -45707 -52196 -18469
16246 -18469 21175 355 -15987 -19329 -24275 16470 15255 40962 48410 90884 100553 71396 56014
16233 56014 -8682 -32604 -24624 -7494 21281 -18039 -14782 -22354 6358 15860 7951 16067 14407
16220 14407 -18697 -27584 -12407 -44809 -19246 817 25758 68941 48662 15953 41140 71362
16208 71362 63571 28118 4497 36309 51524 46188 32265 85625 119718 110555 66520 29775
$$ packed form
16294h4852K5392K2725M851L0122J3746k8836j440L099N5196J7972K1597L3950
16282A13522M120K2897l1373n3448m9672k2109N9423J2998m6161m0944J3985M0806
16270B4044J6056J3425k3444j256j7412j4568L0595L4386k1795k1926k8587l1207
16258d1689l4395N1057M6290J9924l2197j8361j6694l867N696k1471o489L3727
16246a8469L9644k0820j6342l342m946M0745j215K5707P448M2474R669k9157j5382
16233E6014o4696k3922P980J7130K8775l9320L257p572K8712R502p909Q116j660
16220A4407l3104q887J5177l2402K5563K0063K4941M3183k0279l2709K5187L0222
16208G1362p791l5453k3621L1812J5215n336j3923N3360L4093r163m4035l6745
$$ plain form
16196 29775 -11400 -55428 -67777 -51461 -61152 -73924 -67974 -61171 -58543 -14667 52252 76570
16184 76570 45475 47404 41761 21093 29441 53910 11696 -23141 -8482 1640 4557 -797 -15578
16171 -15578 1499 11156 7283 -8874 -48795 -34277 -23707 4469 29728 54261 50165 49455 37578
16158 37578 19839 8805 371 -56348 -84528 -51022 -31479 -25923 7789 5074 -2202 -20994
16146 -20994 -17349 -41140 -31517 2192 -4062 3209 -21695 -1231 34923 43608 13622 -68379 -81893
16133 -81893 -59520 -84680 -43766 -1062 5910 473 -14810 -37870 -72197 -72765 -61795 -75542
16121 -75542 -49485 14796 17489 2481 5327 22584 43192 16841 10835 37652 52135 40372
16109 40372 -2626 42535 56220 35812 -26133 -16450 -4238 9678 50397 45201 47132 46089
$$ packed form
16196B9775m1175m4028j2349J6316r691j2772N950O803K628M3876O6919K4318
16184G6570l1095J929n643k0668Q348K4469m2214l4837J4659J0122K917n354j4781
16171a5578J7077R657l873j6157l9921J4518J0570K8176K5259K4533m096p10j1877
16158C7578j7739j1034q434n6719k8180L3506J9543N556L3712k715p276j8792
16146b0994L645k3791R623L3709o254P271k4904K0464L6154Q685k9986q2001j3514
16133h1893K2373k5160M0914M2704O972n437j5283k3060l4327n68J0970j3747
16121g5542K6057O4281K693j5008K846J7257K0608k6351o006K6817J4483j1763
16109D0372m2998M5161J3685k0408o1945R683J2212J3916M0719n196J931j043
$$ plain form
16097 46089 36442 41982 47804 69828 22519 -12884 -12742 2082 -40901 -92155 -37418 22727 48714
16084 48714 62539 31158 -1093 -7487 -34485 -25424 25234 50846 53928 76283 91762 95203
16072 95203 66158 33987 -12943 -42532 -66362 -81419 -73367 -18466 41548 29012 -4591 -23100
16060 -23100 -13297 34011 4547 -35912 -65555 -55093 -58543 -44782 -65676 -27518 16233 5610
16048 5610 -10427 32201 -13598 -71179 -44858 -34100 29709 72734 23244 5834 14703 52722
16036 52722 56378 67168 30908 13746 39356 85803 55920 10726 -20713 -62503 -89043 -59046
16024 -59046 -25444 10685 20202 42334 8719 -47207 -53943 -40254 16254 45719 60230 37700
16012 37700 -6069 -33493 -16898 -34066 -41613 -54594 -81853 -93552 -106825 -101301 -80931 -44060
$$ packed form
16097D6089r647N540N822K2024m7309l5403J42J4824m2983n1254N4737O0145K5987
16084D8714J3825l1381l2251o394k6998R061N0658K5612L082K2355J5479L441
16072I5203k9045l2171m6930k9589k3830j5057Q052N4901O0014j2536l3603j8509
16060b3100R803M7308k9464m0459k9643J0462l450J3761k0894L8158M3751j0623
16048E610j6037M2628m5799n7581K6321J0758O3809M3025m9490j7410Q869L8019
16036E2722L656J0790l6260j7162K5610M6447k9883m5194l1439m1790k6540K9997
16024e9046L3602L6129R517K2132l3615n5926o736J3689N6508K9465J4511k2530
16012C7700m3769k7424J6595j7168p547j2981k7259j1699j3273N524K0370L6871
$$ plain form
16000 -44060 -44720 -19498 -13300 9308 6298 -1427 -16999 -43805 -5163 35651 22403 27197 22418
15987 22418 25890 1912 -11917 -6365 7795 -15860 -16216 -23040 -18529 -35111 -16354 13019 11385
15974 11385 7455 41819 55629 60388 46013 62276 46931 -1395 -33268 -69393 -41931 -37276
15962 -37276 -29713 -37381 -65988 -71954 -40492 -8302 -17524 -5988 17138 42311 62101 76260
15950 76260 60813 14645 -17251 8640 -17923 -13185 -49572 -54734 -49511 -26078 -11035 4283
15938 4283 15050 21317 8164 10983 -21578 -41538 -20851 -4606 -2102 15805 57753 68035
15926 68035 42959 52721 -19125 -41595 -59187 -29503 -18533 28993 4223 -39257 -26348 -14453
15914 -14453 -19694 -52852 -54161 -29397 -5669 6782 13775 21561 44567 57853 52934 18524 19663
$$ packed form
16000d4060o60K5222O198K2608l010p725j5572k6806L8642M0814j3248M794m779
15987B2418L472k3978j3829N552J4160k3655l56o824M511j6582J8757K9373j634
15974A1385l930L4364J3810M759j4375J6263j5345m8326l1873l6125K7462M655
15962c7276P563p668k8607n966L1462L2190r222J1536K3126K5173J9790J4159
15950G6260j5447m6168l1896K5891k6563M738l6387n162N223K3433J5043J5318
15938D283J0767O267j3153K819l2561j9960K0687J6245K504J7907M1948J0282
15926F8035k5076R762p1846k2470j7592K9684J0970M7526k4770m3480J2909J1895
15914a4453n241l3158j309K4764K3728J2451O993P786K3006J3286m919l4410J139
$$ plain form
15901 19663 39740 34342 18129 15747 34973 56798 29530 25855 7175 -17197 -9684 8663
15889 8663 -9222 -2530 -2963 27717 54216 37857 18349 23780 -8892 -17141 -2680 -2011 -23817
15876 -23817 -42869 -25187 9763 -3313 -41437 -52264 -28603 -41582 -37690 1804 -16519 -52039
15864 -52039 -43680 -32618 -43169 -44013 -16404 -4390 -23163 -8603 7429 1345 -22901 9982
15852 9982 20751 3885 46801 57362 31458 34853 52200 13186 -16373 -4407 4724 39446
15840 39446 22087 12472 56494 55816 12903 -27586 -71698 -100700 -97719 -41039 10133 40304
15828 40304 44358 2962 -36259 -45862 -67497 -78901 -83483 -150230 -97983 -42900 -48185 -86604
15816 -86604 -94103 -78033 -59703 -58009 -5632 31858 -9499 -25191 41926 51876 13767 12677
$$ packed form
15901A9663K0077n398j6213k382J9226K1825k7268l675j8680k4372P513J8347
15889H663j7885O692m33L0680K6499j6359j9508N431l2672q249J4461O69k1806
15876b3817j9052J7682L4950j3076l8124j0827K3661j2979L892L9494j8323l5520
15864e2039Q359J1062j0551q44K7609J2014j8773J4560J6032o084k4246L2883
15852I982J0769j6866M2916J0561k5904L395J7347l9014k9559J1966R131L4722
15840C9446j7359r615M4022o78m2913m0489m4112k9002K981N6680N1172L0171
15828D0304M054m1396l9221r603k1635j1404m582o6747N2247N5083n285l8419
15816h6604p499J6070J8330J694N2377L7490m1357j5692O7117R950l8109j090
$$ plain form
15804 12677 -12620 -5629 15931 14421 1367 15883 37817 8055 -15520 13993 53176 23825
15792 23825 6517 232 7761 -1921 -23773 -36990 -28946 -72160 -56017 -29018 -68125 -50489
15780 -50489 -3550 8164 -5754 -6698 -48820 -18765 8581 17278 46163 26187 32812 22578
15768 22578 47816 20255 15585 27175 -19452 -31241 -50043 -7954 17569 23449 -15283 -38992
15756 -38992 19539 6800 -8991 -35224 -64480 -24541 -22152 -17139 28352 61194 43880 3921
$$ packed form
15804A2677k5297O991K1560j510j3054J4516K1934k9762k3575K9513L9183k9351
15792B3825j7308o285P529r682k1852j3217Q044m3214J6143K6999l9107J7636
15780e0489M6939J1714j3918r44m2122L0055K7346Q697K8885j9976O625j0234
15768B2578K5238k7561m670J1590m6627j1789j8802M2089K5523N880l8732k3709
15756c8992N8531j2739j5791k6233k9256L9939K389N013M5491L2842j7314l9959
$$ [...]
##END NTUPLES=NMR SPECTRUM
##END=
