##TITLE=Analysis number 329518
Compound Code cc 66304
Book Reference 464/178/4
Project Code adrs
Chemist Name chrisr
##JCAMPDX= 6.0         $$ Bruker NMR JCAMP-DX V2.0
##DATA TYPE= NMR SPECTRUM
##DATA CLASS= NTUPLES
##ORIGIN= Bruker BioSpin GmbH
##OWNER= nmr
$$ XWIN-NMR		Version 3.5
$$ Mon Sep 10 11:30:36 2007 GMT Daylight Time (UT+1h)  MAYBRIDGE\nmr@NMR_250MHZ
##.OBSERVE FREQUENCY= 250.131544655141
##.OBSERVE NUCLEUS= ^1H
##.ACQUISITION MODE= SIMULTANEOUS (DQD)
##.ACQUISITION SCHEME= undefined
##.AVERAGES= 16
##.DIGITISER RES= 18
##SPECTROMETER/DATA SYSTEM= dpx250
##.PULSE SEQUENCE= zg30
##.SOLVENT NAME= CDCl3
##.SHIFT REFERENCE= (INTERNAL, CDCl3, 0, 16.522)
##AUDIT TRAIL= $$ (NUMBER, WHEN, WHO, WHERE, WHAT)
$$ ##TITLE= Audit trail, XWIN-NMR		Version 3.5
$$ ##JCAMPDX= 5.01
$$ ##ORIGIN= Bruker BioSpin GmbH
$$ ##OWNER= nmr
$$ C:\u/data/dgb/nmr/ADRS/460/pdata/1/auditp.txt
$$ ##AUDIT TRAIL=  $$ (NUMBER, WHEN, WHO, WHERE, WHAT)
(   1,<2007-09-10 11:30:13.08 +100>,<MAYBRIDGE\nmr>,<NMR_250MHZ>,
      <created by zg, POWCHK disabled, PULCHK disabled
       configuration hash MD5:
       76 6E 9A 78 1E 09 19 81 EC 84 63 8F B0 6A 59 2D
       data hash MD5: 64K
       07 58 EB 1E 1F 72 AC A9 C5 41 03 EF 36 6E F7 1D>)
(   2,<2007-09-10 11:30:26.67 +100>,<MAYBRIDGE\nmr>,<NMR_250MHZ>,
      <Start of raw data processing
       ef LB = 0.3 FT_mod = 6 PKNL = 1 SI = 32K 
       data hash MD5: 32K
       93 0A 74 C7 2C 39 EB 06 E3 B0 70 2A CB A4 2F F0>)
(   3,<2007-09-10 11:30:28.23 +100>,<MAYBRIDGE\nmr>,<NMR_250MHZ>,
      <apk 
       data hash MD5: 32K
       60 38 14 94 E5 41 C9 B0 C2 5F 8D CF 0A D3 98 20>)
(   4,<2007-09-10 11:30:28.97 +100>,<MAYBRIDGE\nmr>,<NMR_250MHZ>,
      <abs ABSG = 5 
       data hash MD5: 32K
       FD D6 90 04 77 64 10 95 87 C5 91 60 A6 F0 C3 11>)
$$ ##END=
$$ 
$$ hash MD5
$$ 99 9E E1 21 F3 24 86 E3 23 30 AE 41 00 23 D9 61
##$RELAX= 
##$RELAX= 
##$RELAX= 
##$RELAX= 
##$RELAX= 
##$RELAX= 
##$RELAX= 
$$ Bruker specific parameters
$$ --------------------------
##$DU= <C:\u>
##$EXPNO= 460
##$NAME= <ADRS>
##$PROCNO= 1
##$TYPE= <nmr>
##$USER= <dgb>
##$AMP= (0..31)
100 100 100 100 100 100 100 100 100 100 100 100 100 100 100 100 100 100 
100 100 100 100 100 100 100 100 100 100 100 100 100 100 
##$AQSEQ= 0
##$AQ_mod= 3
##$AUNM= <au_zg>
##$AUTOPOS= <23 >
##$BF1= 250.13
##$BF2= 250.13
##$BF3= 250.13
##$BF4= 250.13
##$BF5= 500.13
##$BF6= 500.13
##$BF7= 500.13
##$BF8= 500.13
##$BYTORDA= 1
##$CFDGTYP= 0
##$CFRGTYP= 5
##$CHEMSTR= <none>
##$CNST= (0..31)
1 1 145 1 1 1 1 1 1 1 1 1 1 1 1 1 1 1 1 1 1 1 1 1 1 1 1 1 1 1 1 1 
##$CPDPRG= <>
##$CPDPRG1= <>
##$CPDPRG2= <>
##$CPDPRG3= <>
##$CPDPRG4= <mlev>
##$CPDPRG5= <mlev>
##$CPDPRG6= <mlev>
##$CPDPRG7= <mlev>
##$CPDPRG8= <mlev>
##$CPDPRGB= <>
##$CPDPRGT= <>
##$D= (0..31)
0 1 0 0 0 0 0 0 0 0.06 0 0 0 0 0 0 0.0002 0 0 0 0 0 0 0 0 0 0 0 0 0 0 
0 
##$DATE= 1189420212
##$DBL= (0..7)
120 120 120 120 120 120 120 120 
##$DBP= (0..7)
150 150 150 150 150 150 150 150 
##$DBP07= 0
##$DBPNAM0= <>
##$DBPNAM1= <>
$$ [...]
##$SUBNAM7= <"">
##$SUBNAM8= <"">
##$SUBNAM9= <"">
##$SW= 20.6930455092707
##$SWIBOX= (0..15)
0 0 3 0 0 0 0 0 0 0 0 0 0 0 0 0 
##$SW_h= 5175.983436853
##$TD= 65536
##$TD0= 1
##$TE= 298.16
##$TE2= 300
##$TE3= 300
##$TEG= 300
##$TL= (0..7)
0 120 120 120 120 120 120 120 
##$TP= (0..7)
150 150 150 150 150 150 150 150 
##$TP07= 0
##$TPNAME0= <>
##$TPNAME1= <>
##$TPNAME2= <>
##$TPNAME3= <>
##$TPNAME4= <>
##$TPNAME5= <>
##$TPNAME6= <>
##$TPNAME7= <>
##$TPOAL= (0..7)
0.5 0.5 0.5 0.5 0.5 0.5 0.5 0.5 
##$TPOFFS= (0..7)
0 0 0 0 0 0 0 0 
##$TUNHIN= 0
##$TUNHOUT= 0
##$TUNXOUT= 0
##$USERA1= <user>
##$USERA2= <user>
##$USERA3= <user>
##$USERA4= <user>
##$USERA5= <user>
##$V9= 5
##$VALIST= <valist>
##$VCLIST= <CCCCCCCCCCCCCCC>
##$VD= 0
##$VDLIST= <DDDDDDDDDDDDDDD>
##$VPLIST= <PPPPPPPPPPPPPPP>
##$VTLIST= <TTTTTTTTTTTTTTT>
##$WBST= 1024
##$WBSW= 4
##$XGAIN= (0..3)
0 0 0 0 
##$XL= 0
##$YL= 0
##$YMAX_a= 263671
##$YMIN_a= -180517
##$ZGOPTNS= <>
##$ZL1= 120
##$ZL2= 120
##$ZL3= 120
##$ZL4= 120
##$ABSF1= 16.522
##$ABSF2= -4.171173
##$ABSG= 5
##$ABSL= 3
##$ALPHA= 0
##$AQORDER= 0
##$ASSFAC= 0
##$ASSFACI= 0
##$ASSFACX= 0
##$ASSWID= 0
##$AUNMP= <proc_1d>
##$AZFE= 0.1
##$AZFW= 0.1
##$BCFW= 0
##$BC_mod= 0
##$BYTORDP= 0
##$COROFFS= 0
##$CY= 12.5
##$DATMOD= 1
##$DC= 0
##$DFILT= <>
##$DTYPP= 0
##$F1P= 14.0000005364418
##$F2P= -0.99999901652339
##$FCOR= 0.5
##$FTSIZE= 32768
##$FT_mod= 6
##$GAMMA= 0
##$GB= 0
##$INTBC= 1
##$INTSCL= 1
##$ISEN= 128
##$LB= 0.3
##$LEV0= 0
##$LPBIN= 0
##$MAXI= 10000
##$MC2= 0
##$MEAN= 0
##$ME_mod= 0
##$MI= 0
##$NCOEF= 0
##$NC_proc= -4
##$NLEV= 6
##$NOISF1= 0
##$NOISF2= 0
##$NSP= 0
##$NTH_PI= 0
##$NZP= 0
##$OFFSET= 16.522
##$PC= 1
##$PHC0= -59.76603
##$PHC1= 6.645314
##$PH_mod= 1
##$PKNL= yes
##$PPARMOD= 0
##$PSCAL= 4
##$PSIGN= 0
##$REVERSE= no
##$SF= 250.13
##$SI= 32768
##$SIGF1= 0
##$SIGF2= 0
##$SINO= 400
##$SIOLD= 32768
##$SREGLST= <1H.CDCl3>
##$SSB= 0
##$STSI= 32768
##$STSR= 0
##$SW_p= 5175.98343685301
##$SYMM= 0
##$S_DEV= 0
##$TDeff= 65536
##$TDoff= 0
##$TI= <Analysis number 999999
Compound Code 99
Book Reference 9
Project Code 9>
##$TILT= no
##$TM1= 0
##$TM2= 0
##$TOPLEV= 0
##$USERP1= <user>
##$USERP2= <user>
##$USERP3= <user>
##$USERP4= <user>
##$USERP5= <user>
##$WDW= 1
##$XDIM= 32768
##$YMAX_p= 432892798
##$YMIN_p= -300672
$$ End of Bruker specific parameters
$$ ---------------------------------
##NTUPLES= NMR SPECTRUM
##VAR_NAME=  FREQUENCY,     SPECTRUM/REAL,   SPECTRUM/IMAG
##SYMBOL=    X,             R,               I
##VAR_TYPE=  INDEPENDENT,   DEPENDENT,       DEPENDENT
##VAR_FORM=  AFFN,          ASDF,            ASDF
##VAR_DIM=   32768,         32768,           32768
##UNITS=     HZ,            ARBITRARY UNITS, ARBITRARY UNITS
##FACTOR=    0.157963299565203, 1,           1
##FIRST=     4132.6476996994, 0,             0
##LAST=      -1043.33573715361, 0,           0
##MIN=       -1043.33573715361, -300672,     0
##MAX=       4132.6476996994, 432892798,     0
$$ Real data points
##PAGE= N=1
##DATA TABLE= (X++(R..R)), XYDATA
$$ [...]
##PAGE= N=2
##DATA TABLE= (X++(I..I)), XYDATA
29552 633513 597333 579298 621649 657503 734045 816038 795426 828748 780715 632294 608471
29541 608471 662462 718901 694016 733504 644927 663729 719674 708235 690013 752391 823941
29530 823941 773558 748429 765266 733881 671785 623701 645469 654659 646667 627191 670221 611018
29518 611018 560923 564063 622715 658580 664095 615520 531143 589913 601223 594697 655186 632016
29506 632016 611471 637733 714391 850867 918835 857637 737341 687806 620255 576238 568074
29495 568074 618978 737560 810830 785237 734842 686258 638292 685845 808450 769886 738654
29484 738654 705808 646466 633154 665055 647757 571571 574951 648115 690757 612710 615074 680712
29472 680712 769370 820106 791246 788816 745344 639588 554852 634796 681218 681421 697509 788445
29460 788445 802027 763311 717966 687721 763717 747628 739814 698980 568370 508107 552141
29449 552141 577065 538829 533756 585127 617140 657671 614488 570531 541535 628627 643594 615878
29437 615878 595553 566011 551516 601559 666824 795221 796533 724974 748351 739116 737395 687428
29425 687428 724195 784433 845058 783969 713188 647042 665537 665505 621658 570591 608908 681403
29413 681403 676883 704290 689082 769466 750130 752512 671525 628605 604228 666224 711436 746543
29401 746543 699177 545342 514938 546895 525977 578696 579270 593180 556890 503966 529203 550142
29389 550142 679044 711184 623552 612122 655997 631339 634551 664184 653534 617730 578498
29378 578498 602360 682890 699496 697817 744435 776801 794931 845215 742671 659984 651063 554997
29366 554997 437985 417651 524748 675917 827868 721773 576557 577424 588732 664015 710329
29355 710329 697930 614940 574738 634978 593274 520014 511823 553620 531991 523685 549833 644212
29343 644212 685107 715045 635607 642541 712977 711728 662125 605580 582529 596587 689057 668904
29331 668904 644451 627828 591562 618569 612678 515395 454476 481883 565272 658965 695814 777943
29319 777943 725157 658827 624018 650646 685078 654128 641635 631161 702599 755277 702951
29308 702951 646642 613308 629721 565966 576730 666518 793834 763907 658780 594604 548685
29297 548685 561016 613728 654530 665901 654224 627052 601497 694172 716298 738239 744730 708204
29285 708204 665291 686619 722282 670680 624335 661242 714832 726783 763064 756108 652946
29274 652946 615005 701727 814923 782197 751618 727532 682591 653684 634910 631642 692397
29263 692397 685256 666243 638956 664139 660708 705215 714361 730235 711861 662424 570891 587765
29251 587765 675763 745808 783573 786755 725333 677019 656440 740842 804142 749276 793784 792575
29239 792575 680482 677035 665109 687808 666851 683171 628123 581399 556521 619301 626697 661764
29227 661764 687517 701102 699512 761178 828311 810103 788045 746151 705212 674600 587768 571528
29215 571528 666905 735927 702901 675797 754330 760812 797229 782149 638286 576655 649430
29204 649430 668046 575399 558388 550324 557679 626193 650224 574951 499306 565668 631330 622240
29192 622240 699404 657137 638730 615319 716148 732064 735167 687052 587809 557076 564313 600003
29180 600003 686300 664273 654275 690681 669615 652278 642817 618086 587441 557135 566715 660957
29168 660957 759280 744397 693846 707401 617050 577414 570347 578017 564082 591841 625711 647944
29156 647944 712027 712268 643288 639999 616738 612451 716556 775847 706897 606044 612432 592463
29144 592463 579451 652800 611215 624585 685752 751470 832850 786154 731654 816654 837496
29133 837496 774732 686784 620763 574748 671580 700342 606820 727042 792466 815311 895879
29122 895879 901870 849667 853558 743679 770204 762059 685325 695477 698798 681380 707443 751950
29110 751950 689957 589174 513652 536750 605831 654881 649775 687130 734141 688965 714849
29099 714849 787897 737751 657490 599823 566800 607862 624125 691200 663067 655662 635178 676461
29087 676461 736400 738935 702331 674461 701300 704543 723398 712645 637517 642845 663388 655900
29075 655900 721057 854722 856243 822978 789576 747754 830087 831460 735897 646746 616014 650851
29063 650851 643774 747846 783624 714124 635778 648923 673221 621838 623678 654912 630771 640785
29051 640785 683135 704816 674414 630785 567883 546869 638938 650521 581709 564964 583227
29040 583227 618697 636026 695997 691790 665149 636130 586659 568241 514398 517220 604069 662108
29028 662108 679643 613149 549852 527743 590797 667304 698948 669924 656827 722887 719168 661035
29016 661035 722576 758051 781946 783205 696911 701687 751076 712101 687421 707079 668577 636925
29004 636925 671744 657550 631087 732067 731230 749459 717023 705496 716853 758461 740901 688026
28992 688026 716957 700072 662766 600049 617409 643787 667828 651223 703661 738540 768178
28981 768178 771080 785755 776715 745091 724320 720144 687597 702984 660495 643882 710922 858396
28969 858396 872879 761063 749318 749682 676709 747383 833995 826151 817963 725231 749389 871357
28957 871357 808018 715448 715430 724811 726490 774692 752543 726458 700153 696314 701074 719469 726226
28944 726226 733080 707994 664594 688843 761984 791763 809601 805682 742275 658198 609751 598862
28932 598862 548275 582370 667318 650932 590556 516379 509067 564979 665709 689619 734165
28921 734165 835732 802111 867216 850023 684233 640533 726775 776587 777817 737146 723315
28910 723315 678068 711908 730379 673260 765642 783415 742678 729817 695095 620004 574341
28899 574341 548949 524141 561280 566710 592088 609673 610301 614991 562953 518761 626626 761297
28887 761297 752644 763317 748345 691993 611806 614173 665712 640231 618839 652442 686869 657281
28875 657281 595951 644280 641671 745700 718611 697373 692760 622687 611920 590292 613763 653766
28863 653766 687219 673666 740110 806365 746651 733403 736747 730099 590527 593936 693557 678492
28851 678492 632728 651830 727660 741899 729075 690187 666221 593268 570013 592440 674145
28840 674145 691949 706815 708273 711231 755356 822660 779405 728760 773653 760791 826133 849649
28828 849649 794334 775732 745085 684460 703619 697364 634540 700449 713576 668821 579974 526971
28816 526971 572067 572776 609948 646956 735476 791821 802030 770897 762549 746999 720494 753922
28804 753922 859605 782762 758373 769398 740962 819343 850329 796400 742924 758983 727655
28793 727655 741833 727818 706312 679107 595012 619577 736195 812179 810637 797385 761809
28782 761809 705254 610032 595084 619541 625032 688524 704636 699906 705008 677176 703466 736698
28770 736698 680695 531320 512805 599156 617628 588539 603727 649912 685590 731866 851211
28759 851211 852734 907446 914814 799329 713887 662737 640976 628804 647326 685012 747400 766147
28747 766147 757627 761108 823756 767836 702086 713324 723544 622623 650804 708398 750126 767468
28735 767468 732455 742577 760874 763694 747901 793672 694022 571413 592053 589660 562555 570526
28723 570526 666876 719811 628912 552479 644430 695383 723680 732745 704226 788748 773797 771487
28711 771487 757479 663618 705777 779627 728042 759951 736995 637443 627162 659657 566470
28700 566470 558961 623430 713242 717857 690881 640756 591720 563624 599206 649624 675844 619384
28688 619384 632194 700962 756617 788550 768816 741365 714485 732455 782322 827406 823695 714635
28676 714635 678195 754121 897767 870303 823490 793712 754413 723336 707491 723072 732695
28665 732695 735363 695253 653200 647956 735652 728169 664049 678011 686660 763637 770456 783597
28653 783597 778548 731187 760698 711617 662226 752380 815986 798188 740070 699773 645255 609914
28641 609914 679180 713772 680290 696446 724303 710212 717101 635800 546590 681940 640293
28630 640293 608628 703092 807921 824402 800588 816139 778399 769014 730117 725315 764799 748394
28618 748394 731792 661053 652517 680086 676360 691052 737907 727273 731245 722482 775004 824743
28606 824743 893009 823917 809731 863453 869130 754162 755325 747485 661477 645032 645120 579912
28594 579912 582862 681010 717886 748814 711617 710684 663144 677689 702648 767153 735133 702509
28582 702509 723168 639274 630975 689538 708222 700517 675895 689945 708753 693609 730860 743952
28570 743952 758467 673700 620148 605993 610361 679428 681316 642851 663793 740934 706175 685015
28558 685015 693270 683625 649185 665520 666855 692688 683918 714492 790773 809609 723973 660162
28546 660162 740874 824430 819976 758302 730043 717745 698537 640703 673521 698701 693101 723990
28534 723990 702585 684157 682948 705209 801812 777536 749763 704659 686450 752610 813973 813275
28522 813275 821503 817359 899479 871738 852485 816095 809674 790659 784178 724919 691925 789265
28510 789265 774200 745362 766585 756932 742048 794296 810260 798969 751262 805549 807742 762836
28498 762836 729271 722396 772892 796967 826717 833130 780173 723695 759851 807574 840428 755657
28486 755657 745021 761238 705180 689183 757271 798720 824122 850182 867925 808694 881596
28475 881596 869325 764160 741785 809387 828482 806921 730319 726789 726705 750229 756164 780733
28463 780733 787143 883360 867940 730868 654988 630679 683152 796725 821861 787306 675310
28452 675310 705258 726478 691375 628846 668671 669052 696360 729618 617869 632837 730812 744071
28440 744071 769857 822067 806127 766949 744499 679656 626523 571048 575544 604755 614502 518563
28428 518563 644962 774586 755611 738018 711955 709129 753124 778014 704182 764259 729153
28417 729153 728476 762562 813864 802522 812836 757027 750034 756112 796635 834270 825561 792764
28405 792764 761490 737633 749968 800826 865323 798432 731348 682593 552549 516565 544542
28394 544542 601656 714518 772310 780434 789233 684802 686149 621925 551399 654121 720684
28383 720684 806052 866810 752180 756690 777459 771817 838710 836071 781467 747081 688918 593094
28371 593094 537124 595884 641455 674865 670083 641832 690381 744923 707033 633963 716299 880806
28359 880806 942258 834490 757363 759292 712710 616105 650780 682613 703270 741787 823922
28348 823922 853402 873840 809238 814284 886062 872209 824523 823643 779842 787687 674208 691261
28336 691261 712420 754435 842452 866693 784537 769200 716328 706988 729268 674214 654649 699627
28324 699627 715286 749663 843607 897580 916208 891817 871264 846325 795232 830788 827649 803123
28312 803123 786637 818483 814602 830595 849962 866184 856104 838802 811558 771855 761375 774206
28300 774206 766264 762547 747812 765165 775601 839763 778578 771187 764857 778123 812378 810116
28288 810116 842935 774286 753473 747297 777113 723936 742806 730439 847247 892843 853050
28277 853050 785538 821101 739823 612678 526380 619836 621903 612950 611476 611316 614842 609729 680479
28264 680479 779831 896167 903600 870590 843642 847327 882979 720929 676870 674865 739874 781998
28252 781998 813881 852556 840994 815074 822743 855647 885115 878571 842461 877437 834213 773907
28240 773907 717536 661592 732461 787665 785602 773531 831932 865086 847704 793993 806101 766477
28228 766477 726220 713279 708967 753734 846038 812294 689766 727917 825251 774024 798187
28217 798187 787042 796798 730006 684548 705263 712893 664087 617978 563589 636597 657989 727210
28205 727210 759304 763250 719286 803003 854981 899127 843739 754341 696521 713623 806105 883883
28193 883883 898414 858512 883302 845258 870186 902013 939909 852465 829643 785818 804014
28182 804014 756348 711436 660299 841697 899333 770681 697939 699143 720506 738079 704764
28171 704764 625728 693712 739028 731021 810883 845531 893138 820578 731373 783634 789144 800359
28159 800359 798426 828941 903227 874472 768005 757600 790554 782908 701011 689801 767347 810041
28147 810041 760181 748283 784500 861552 953302 968320 889526 831248 843565 852593 895013 878611
28135 878611 805688 790256 767785 755361 813535 766294 775328 789458 801944 849850 832879 826454
28123 826454 853905 899823 909370 856575 836285 864434 794079 735007 781974 767833 738141 750932
28111 750932 698109 662086 773257 807328 822560 803516 797408 814600 892825 824724 752492
28100 752492 709452 825273 892562 830206 769331 801546 743819 740402 849619 822431 802523
28089 802523 756198 780241 881172 863014 853008 856539 871449 856608 926742 939084 851973
28078 851973 833520 891175 874269 793653 773389 800357 812220 865923 816426 869569 921385
28067 921385 912667 923661 858427 850767 831036 748675 744532 780477 825854 761018 757615 839233
28055 839233 846694 748234 690228 735629 815003 787273 769491 687359 679734 828599 909908 885171
28043 885171 769083 727371 710429 770521 759465 778051 760748 805331 822342 857475 876010
28032 876010 910163 933984 882352 830301 820855 790217 695229 691620 706759 677529 654384 789463
28020 789463 864419 809569 808757 830814 880724 889587 891663 918609 834685 673478 606147 617068
28008 617068 612404 680584 857353 894163 818502 812904 844430 793137 751868 729601 762961 769616
27996 769616 695913 741861 813680 895403 936047 897379 846669 879846 864544 796533 812881
27985 812881 881226 932998 925060 885561 842707 832993 807036 850445 801719 780825 763935 753827
27973 753827 798360 863503 827670 792300 699874 644429 743445 769571 775995 791292 772923 763164
27961 763164 834467 806244 804938 751672 682184 724249 738410 742541 728868 677768 688737 733141
27949 733141 760168 773063 757997 780990 783647 752761 746635 763830 758428 764716 782760 767888
27937 767888 783817 788474 803753 793387 783091 772644 784402 745662 742724 736857 796683 733996
27925 733996 756640 777689 811788 826449 809635 830129 755510 660918 733922 798878 737847
27914 737847 712940 749557 775856 794429 782675 755950 815161 911832 911924 803473 702675 634400
27902 634400 628503 694531 832386 874575 854470 797426 749329 771744 796235 800358 761557 745860
27890 745860 741527 748150 726360 724296 794021 791738 801763 882228 923019 838282 714280 645074
27878 645074 663292 720467 767779 756132 718307 707535 751814 754399 661777 654308 681102 745629
27866 745629 852692 944617 937746 919680 837680 802025 789283 755469 775380 802523 786994
27855 786994 817860 892332 834329 845636 805913 713004 679747 636152 642101 622761 649055 737298
27843 737298 796715 832621 817236 888296 881622 884086 790711 739026 733862 787392 802317 748613
27831 748613 774586 800690 824673 809718 798639 799084 856578 829632 865794 851394 798351 797779
27819 797779 716918 645067 707380 860231 902466 818439 750692 793270 774752 710207 721684
27808 721684 773119 800318 795748 781448 735108 772706 747911 727021 852342 891170 823072
27797 823072 744794 745218 753946 752515 703475 718664 668921 691433 730635 776335 765217 754506
27785 754506 760901 831077 828997 779916 737382 730951 673511 667151 715910 677629 758140 783225
27773 783225 806304 848925 865237 936645 970023 971297 923020 862805 784153 791122 812412 930902
27761 930902 991545 981229 916704 951739 972837 945162 936255 916532 875259 948300 904517 794150
27749 794150 825598 815173 768255 735193 712010 793316 779888 763165 813108 804724 791309 766292
27737 766292 696100 782689 804979 737113 818850 846497 706751 726379 779409 855198 824995
27726 824995 713205 742662 739548 745878 780659 870093 913124 917366 917086 998176 987114 1009922
27714 1009922 949229 835534 787810 801040 826948 828935 684389 677511 695266 658748 734086
27703 734086 781222 747138 735502 717112 781035 804204 850026 886385 956649 979996 839843
27692 839843 798237 872844 925925 958353 987126 900060 805281 761821 711340 736756 736556 697538
27680 697538 671010 722480 771258 750389 746949 818110 755204 731424 721527 812100 865339 896863
27668 896863 855644 873096 875550 925236 958599 1016865 975659 946175 854113 791569 777403 765845
27656 765845 745774 711336 793950 737770 666296 738398 755343 764538 870709 860549 782435
27645 782435 741706 819243 887047 813348 750922 797597 921079 881663 789369 729366 709017
27634 709017 730147 823771 794075 698680 752083 805417 708585 603207 771931 852908 791945
27623 791945 676988 663567 681236 618268 701063 739406 771127 720825 715069 743643 782281
27612 782281 816283 859418 891734 863718 749887 772152 827508 820244 830014 808120 826966 834281
27600 834281 726615 664116 661049 709642 728331 767337 772209 833464 918087 853564 798881 743637
27588 743637 737669 684205 723051 714997 761361 836270 803164 828107 802632 869675 901783 866207
27576 866207 925608 979005 929712 815589 844926 924508 899302 832268 748614 822994 886540
27565 886540 935501 882417 829057 730955 696589 743866 799908 826708 831050 873405 901756 851336
27553 851336 807843 812526 783128 774519 778542 763211 790573 764719 705049 697371 721087 704402
27541 704402 717392 820024 827337 840026 837805 820992 830361 775925 763184 756361 795403 808728
27529 808728 772718 775961 712944 695850 737966 793250 844147 899993 892385 894248 864317 815643
27517 815643 844244 794483 804324 756508 756859 728300 610477 609671 659238 742168 807766 797981
27505 797981 713482 688930 668210 717594 905176 925798 822928 834687 907968 893463 829257
27494 829257 803326 815249 792370 825035 820902 726161 653456 688299 730571 810899 812717 863592
27482 863592 900473 847843 795678 781722 752504 732969 819154 922912 947322 929084 861682
27471 861682 787348 823601 854026 878433 847575 820789 745063 707676 748552 763623 735998
27460 735998 721015 739308 854920 874921 894709 806157 742254 800615 764766 688722 729428
27449 729428 756156 755136 785400 767814 771635 734238 762322 802032 793793 841211 841222 823751 872226
27436 872226 858114 858267 901706 891871 831629 820096 875210 873391 824099 845128 802285 823900
27424 823900 805433 835456 884922 932523 848662 878621 906738 915711 867682 876744 873021 851599
27412 851599 867344 740100 744446 789969 793645 804960 893293 887489 870911 917123 961618 1003077
27400 1003077 960878 897116 883935 949023 929476 948470 947822 863802 859120 842948 841214 829666
27388 829666 874542 867189 812520 785448 862908 784242 725418 760066 786100 779885 744129 760977
27376 760977 788187 822451 857630 879850 856418 865276 797733 873752 900939 936372 836853 761405
27364 761405 763060 686613 707305 779889 823353 829341 833788 810487 806170 776469 723104 727843
27352 727843 789478 758904 761632 799888 922798 985367 1018627 922824 861602 842942 911625
27341 911625 972765 998579 952472 936441 875114 813739 865277 893954 936362 980019 905478
27330 905478 799684 700433 816585 856705 810339 754010 726454 734194 704428 828638 834784
27319 834784 786343 681559 622782 734942 758540 764087 710640 635607 700953 779428 805985
27308 805985 805783 853636 932626 982288 969762 892669 876072 886298 900603 886491 892301 898262
27296 898262 889332 886391 927316 881780 821259 839807 817662 912736 934009 918689 774333 800137
27284 800137 874100 955228 949080 917018 999277 961463 950449 941934 896990 901434 908764 914658
27272 914658 839576 751983 812973 841122 833797 822271 847285 932227 994331 1020218 886179
27261 886179 888349 908246 892510 837306 781447 833220 939285 965450 934646 881600 876676 845520
27249 845520 915161 913148 839883 886320 921327 846242 834693 851251 845848 799918 740563 728143
27237 728143 771286 801582 802559 779424 729248 812567 975747 1047170 1011710 915767 863069 924011
27225 924011 956087 926978 863556 820609 809777 905983 888590 896310 935943 912369 828048 783416
27213 783416 809333 797387 790341 720152 754472 774095 767886 821370 803626 867107 850588 818164
27201 818164 870647 836553 887630 972666 1039480 1052767 1037014 941664 817807 773153 731948
27190 731948 747914 750862 700861 779479 863774 851968 844059 883574 871466 810665 792576 837533
27178 837533 791512 817699 848883 826480 795885 804092 850198 886950 887100 883570 851697 835161
27166 835161 847726 922405 908697 834197 808893 744588 681729 758996 772241 730050 685191
27155 685191 664350 617453 707968 881508 913770 852485 885096 923207 914679 837735 779279
27144 779279 695754 690754 797311 864655 861904 870985 869472 861678 837648 819618 851351 799885
27132 799885 751808 742515 757523 762224 827572 831024 866972 892026 826916 811487 849729 906952
27120 906952 928586 851524 826188 797976 783021 776980 863248 839504 777683 814220 785431 753990
27108 753990 798513 802651 775562 742905 716287 846771 834014 854639 883933 934466 854718
27097 854718 802379 818556 791034 871264 889508 884456 985443 978097 925355 859255 885762 944615
27085 944615 1000313 981740 916464 881597 895552 919450 969895 842707 661015 669091 689913
27074 689913 800007 877333 932414 978970 999890 926209 911205 878715 848006 886946 946494
27063 946494 930128 919678 816041 736507 703210 773603 731942 803120 891659 757730 740772
27052 740772 764521 817882 869597 874399 776232 765132 824717 776193 780410 894250 938421 882101
27040 882101 906385 1002206 1024039 864696 736262 736197 716170 797607 907714 903773 917975 888880
27028 888880 880166 957763 1006629 992718 961905 940698 949831 935266 863174 795847 812271 832579
27016 832579 815458 742755 818555 825975 862258 923724 845540 870373 890432 883308 935700 920505
27004 920505 899379 839528 835994 927177 992979 1001922 1017287 998152 945587 942968 962077 895185
26992 895185 897305 855641 787323 800362 839849 896649 837030 755141 756055 796284 845951 935304
26980 935304 936609 885015 835978 813559 820152 887577 878976 885563 878374 896272 923155 896635
26968 896635 896813 864741 854716 883064 954257 982599 955577 987749 934102 921768 879258 812014
26956 812014 842885 834148 915063 990532 992150 920665 896611 823422 788029 764227 737696 757180
26944 757180 782856 853381 878161 838609 887090 968916 974434 843426 812537 846682 849773 840245
26932 840245 835481 793382 816328 786307 775116 759208 743309 808594 937601 994394 987379 1000101
26920 1000101 946702 860037 760171 828331 891108 952951 973803 921109 863622 890094 882080
26909 882080 843501 887645 965844 1019482 1013305 987996 941809 877990 886816 927947 959689 888712
26897 888712 806342 898733 968911 882444 869454 957144 997215 1008883 995654 929178 886497
26886 886497 903732 915416 896909 894384 857592 763709 807296 785882 741810 731354 786126 805278
26874 805278 875614 921795 927407 929646 959433 1074127 1093245 1041997 1092178 1112544 982321
26863 982321 943496 993453 980662 934063 841265 844289 788185 767412 827974 834956 795460 860069
26851 860069 946289 874706 878116 917423 918929 874692 853066 870808 867848 878686 852882 847000
26839 847000 908807 862249 869666 909444 957953 910541 881807 859474 847122 806065 798465 785823
26827 785823 784262 743114 727461 747746 793803 794481 791489 783927 817952 796230 881136 829153
26815 829153 829757 891906 920295 897360 798548 751656 776794 825895 793658 713984 699497 790635
26803 790635 863980 886250 861022 836585 805577 717000 761041 862033 948528 920580 866082
26792 866082 897064 927869 970084 1005082 902526 892331 993565 959660 872777 845505 860219
26781 860219 927332 1024170 1012380 941808 857358 883047 950496 921034 896401 898919 913103 885417
26769 885417 855690 812979 844149 857568 879833 893256 878921 844474 823335 870818 805650
26758 805650 821373 932071 998471 995972 963333 949919 946927 931532 887191 866488 910784 902800
26746 902800 843836 934249 976308 923752 876015 913251 952948 923269 966143 994770 1027362
26735 1027362 1055454 1019870 977796 980082 1029146 988324 1044060 1003554 954948 976105 912361
26724 912361 921517 926938 932052 935232 965699 1037648 1019289 979112 912350 891678 916568 950933
26712 950933 962570 1033033 1043461 1055556 1043814 1043779 1062387 1001798 876169 836166 865325 894005
26700 894005 870388 809878 796724 775880 828101 900700 1006166 975283 924532 879825 876366
26689 876366 987676 958994 839662 776135 804223 844292 820722 859519 938939 1027525 984778
26678 984778 1002780 950122 857445 840688 860292 955001 960551 916571 901955 887587 921581 844063
26666 844063 806864 836638 926073 1037592 1021103 973807 1027616 1041613 1010964 986644 932532
26655 932532 820893 779934 829191 905214 933692 891213 940310 955215 960381 948579 888536
26644 888536 833427 825218 869530 842185 910848 938117 893620 926193 949898 882231 830717 808045
26632 808045 768276 767218 813306 838609 868702 938004 919001 826016 828437 913490 938247 881152
26620 881152 845080 873987 813001 791938 825921 858692 924572 921452 810025 797272 901936
26609 901936 968530 977444 994707 957574 951918 924941 926353 927085 945477 968023 934272 889383
26597 889383 891560 980436 1075951 1027686 938426 882681 939582 947349 874054 820743 899576 963379
26585 963379 818098 809398 873817 897392 874834 814754 940089 1070882 1051314 965343 951765
26574 951765 1032538 1011010 1035357 1013207 948731 824767 824593 816978 862231 954938 986427 1010449
26562 1010449 987119 979141 1000904 887470 903620 928571 955767 995650 1077779 1040339 1054775
26551 1054775 1044454 1115119 1108416 977583 874562 888830 959869 997397 931119 950875 969983
26540 969983 976316 975095 868564 842873 799625 846001 898338 868292 850782 953326 1027611
26529 1027611 1003359 1050061 1036062 1067137 986688 980694 1007094 980286 915665 914979 942576 976745
26517 976745 1002962 982599 993666 965264 940324 942454 951626 900034 885886 910826 939748 930265
26505 930265 935957 958128 960955 933478 903421 965289 948771 920536 893274 879065 967327 1034000
26493 1034000 1027426 992158 996490 960532 927706 972506 929750 874383 950037 968517 1016741 975537
26481 975537 944049 975363 998227 1018621 1029821 1047728 1036201 924062 928066 902115 878585
26470 878585 998444 1014629 916748 895024 905161 919343 959849 946856 945076 953721 927489 884503
26458 884503 897505 821280 760383 806137 916586 906432 844536 840817 859678 914227 903429
26447 903429 920203 899596 912567 906974 922949 949380 1002221 979010 924265 865474 878869 972430
26435 972430 1015481 1008444 1016712 1029768 1014130 1009061 959417 881621 836964 782761 855529 935776
26423 935776 938475 953884 1036407 1030899 966127 969344 1061011 1039028 937565 956100 927155 926132
26411 926132 953646 928834 874414 809537 812292 885488 948464 917517 906970 898606 909190 931428
26399 931428 939779 937282 899067 886800 881217 876011 856909 927086 1022425 974598 949836 983324
26387 983324 957784 951246 907226 902580 954475 999026 937676 972348 1013412 1026587 1034786 1019527
26375 1019527 1051040 1051430 945589 935471 957425 961307 1049557 1164916 1179110 1190636 1164341
26364 1164341 1113907 1052969 1009510 1073643 1114289 1186012 1068766 1012070 1060994 1111202 1090734
26353 1090734 1026764 992961 985511 954218 976440 1090200 1109944 1104613 1082278 1064307 1058875 1040007
26341 1040007 1012754 979256 998194 969938 970868 937236 930258 978589 1069714 1008627 942522 930238
26329 930238 974722 1008094 1050660 1048534 1123075 1120651 1066757 1040476 1039361 1002386 995911 1025996
26317 1025996 968709 900756 882153 875243 868601 874941 867659 828962 837861 914342 963176 1024021
26305 1024021 1000916 1002988 1030070 932320 942000 978534 1032659 985974 971363 1036637 1087391 1008297
26293 1008297 1020331 969260 971199 987041 942282 973509 1035322 1114459 1033749 956057 1016358
26282 1016358 1056641 982109 975091 992244 1032798 1032584 970018 948193 894900 846991 853643 797445
26270 797445 838212 891827 899008 924296 927836 928426 919223 938882 945015 942424 1039611 1070633 1019469
26257 1019469 999189 968249 897994 956895 965008 949067 988882 932842 883563 934653 970068
26246 970068 961326 927591 904595 889368 904965 949526 969609 983199 943739 904472 883564 928992
26234 928992 929753 915443 869540 915601 962088 995396 960653 960239 975500 970932 897070 839729
26222 839729 881120 901531 882390 938188 975346 1019196 982212 967596 1034700 1052480 956581
26211 956581 997079 1086494 1070347 1004725 952370 961480 983156 1006381 1025090 956542 956941 907817
26199 907817 974855 1040277 1007388 1051627 1151227 1106520 1030589 954914 1005998 1065346 1021951
26188 1021951 986757 1010196 974829 952210 982799 1010351 1069930 1026556 978091 909375 961353
26177 961353 943419 863172 882392 973565 1003773 1040746 1137767 1054089 1083525 1016992 1042765
26166 1042765 1011152 843686 719863 713030 859204 871062 882305 928134 962335 1039247 1012821
26155 1012821 982439 902319 895425 928975 909621 881144 868182 972044 1030503 1035775 1015149
26144 1015149 969809 988181 1007020 998487 1066275 1174306 1142529 1092507 1018078 1032713 1107432
26133 1107432 1103546 1068853 1064583 1070652 1106489 1063371 1035113 1060915 1034226 1084500 1177442 1212823
26121 1212823 1236764 1186014 1051659 1069535 1102930 1016776 967480 968082 990345 1077601 1085770 1091326
26109 1091326 1084297 1044491 1008748 1004872 1017603 1028046 1123368 1143173 1100357 1066626 1137405 1090122
26097 1090122 1003892 976457 978044 890062 899985 892676 940286 970451 1021221 1060749 1038451 978791
26085 978791 964337 929244 951852 963340 956209 984998 1021147 1040694 1024974 966983 894887 942289
26073 942289 1007007 1028917 1010499 928519 890337 901261 936134 977396 1071743 1020617 952757
26062 952757 982631 974837 999928 953636 949563 1042259 1104543 1007049 968990 952115 1021927 1187848
26050 1187848 1286001 1298068 1213451 1102300 1031442 1022028 1032959 1059380 1026597 1014672 1053718
26039 1053718 1048591 994072 1013296 1006249 1027641 1047866 984128 1016392 1056382 997312 935087 930556
26027 930556 1002227 1002919 1030871 1094957 1072776 1083916 1044508 1045009 980125 969529 1001581 1039374
26015 1039374 1065252 1063725 964377 912753 799414 845990 925230 1004727 1036827 1034622 1080332
26004 1080332 1109129 1049712 1073188 1053158 1030709 1001332 965506 1009305 1036569 974549 962353
25993 962353 1035617 1025222 961725 1011745 1048894 1051037 1078039 1133186 1098493 1113191 1044678 1026590
25981 1026590 992002 999921 993850 983447 864184 869483 986423 1023649 995343 978565 943163
25970 943163 928362 916337 913511 995780 986091 963733 1026328 1049349 1018236 986391 995237 1014283
25958 1014283 974808 977648 988716 1026968 933305 893299 921534 956627 987538 936456 921280
25947 921280 892319 904172 1009697 1102333 1122030 1058329 1040245 1059599 1079490 1072641 1065453 1011040
25935 1011040 1014988 1095388 1103026 1040708 1035884 980726 996722 985134 1005813 1033535 984559 1000107
25923 1000107 1012050 1012615 1051780 1038741 1006530 1044852 993116 942951 939087 915528 968031 1000038
25911 1000038 1021498 1017811 1059876 1018635 976944 1060772 1134224 1060470 977583 933743 986125
25900 986125 1127816 1096009 1101863 1161794 1224388 1193194 1145007 1058556 1073675 1040656 1076547
25889 1076547 1160885 1190708 1183076 1102999 984213 959319 928406 944711 986200 1053130 1076225
25878 1076225 1118835 1143473 1158997 1111592 1047384 1037166 1028276 1112034 1107314 1059684 1073218 1060446
25866 1060446 1112236 1190375 1165673 1088773 1009394 987648 1016606 1026795 1073312 1075726 1098020
25855 1098020 1172475 1184402 1052344 1004532 939974 952781 1042762 1103580 1152172 1220847 1191506
25844 1191506 1116968 1037888 1004863 937028 910251 836512 909616 1026283 1044603 1129694 1157506
25833 1157506 1072188 1012721 1031771 997267 992635 1020694 1141084 1109226 1020716 933580 989329
25822 989329 1028689 1051721 1005404 1031503 1090017 1089335 1109889 1102831 1094477 1082956 1186070 1220719
25810 1220719 1137032 1091201 1107520 1117552 1167040 1184928 1157619 1199986 1210909 1202914 1152159
25799 1152159 1109702 1070872 1058612 1043141 1049853 1026784 1058843 1114197 1073983 1152419 1132843
25788 1132843 1074272 1116106 1105345 1098594 1198650 1233646 1156551 1078577 1081587 1132015 1080987
25777 1080987 1066266 1008639 979172 1023451 1045587 990227 1012413 1078301 1050646 1003003 1008179
25766 1008179 1071658 1095882 1096623 1080849 1120074 1159772 1183741 1129662 1008524 956708 891257
25755 891257 910700 1001720 1062584 1104512 1114716 1133782 1159632 1077295 1012406 993094 1012614
25744 1012614 1052808 1006069 967082 1082996 1110551 1030224 1042885 1077359 1082071 1079112 967770
25733 967770 905029 857042 888282 990417 1057388 1017252 925558 907021 947430 1023061 1034468
25722 1034468 986035 988036 1051651 1052819 1058090 996100 963087 906509 943579 1039242 1027057 976467
25710 976467 987886 1064685 1125799 1111165 1118966 1200021 1208207 1123609 1109342 965371 909522 1012276
25698 1012276 1027840 1044502 1057786 996893 1017862 1086440 1090401 1092519 1113690 1137420 1131078 1139433
25686 1139433 1084519 1005234 1018257 1063550 1092830 1102602 1000732 989418 1093292 1177734 1132259
25675 1132259 1065954 1090944 1134226 1105843 1079783 1038039 979508 992541 1088119 1103228 1094694
25664 1094694 1078160 1083148 1034339 1046539 974535 1014214 1052504 1134535 1102563 1149949 1105447
25653 1105447 924300 910891 1029665 1037860 981830 974055 1031097 1137271 1073413 967329 966315
25642 966315 1043179 1140294 1156167 1090924 991728 964394 988574 1024886 1034547 1028151 1098945 1142317
25630 1142317 1138966 1106995 1098093 1102123 1062241 1024922 1122767 1112111 1117100 1216899 1194939 1119808
25618 1119808 1102147 1141293 1207292 1252830 1295478 1292615 1198517 1186834 1166964 1184658 1193770 1130652
25606 1130652 1117284 1159375 1191883 1242166 1147825 1111357 1056314 1069519 1109746 1074881 993034
25595 993034 1027003 1011090 1023875 1064528 1130004 1156755 1115481 1136901 1151150 1142527 1201853 1255412
25583 1255412 1176747 1094890 1055392 1107034 1179094 1200068 1210310 1141199 1051891 1034550 1102549
25572 1102549 1160208 1166322 1124789 1157285 1080738 1054162 1073260 1073120 1100746 1133386 1128279 1123532
25560 1123532 1105489 1060882 1006521 1010470 1085047 1137038 1100341 1024244 1003615 961351 956709 945200
25548 945200 981986 1064773 1137077 1223636 1229174 1255122 1272990 1146504 1045868 1025555 1144026
25537 1144026 1177940 1129072 1052486 991547 1008325 1131735 1193351 1228970 1173211 1221369 1206143
25526 1206143 1168470 1092996 1048742 1133171 1168679 1192820 1284150 1331856 1257690 1157228 1106914
25515 1106914 1089197 1071454 1105367 1157230 1101407 1047935 1011881 1152211 1211468 1199447 1213308
25504 1213308 1234983 1207770 1215707 1225769 1233679 1238598 1191288 1103716 1109290 1147933 1106794 1123167
25492 1123167 1196020 1234810 1204971 1176808 1075418 1075439 1114439 1153726 1274271 1284192 1163224
25481 1163224 1104944 1076337 1014631 1057896 1105274 1104976 1058147 1128304 1229550 1233196 1175295 1182151
25469 1182151 1205056 1233755 1150945 1142386 1144037 1164578 1174693 1177206 1323824 1431983 1314794
25458 1314794 1284052 1350604 1374256 1336186 1209158 1206689 1160628 1164976 1217272 1314816 1342367
25447 1342367 1259576 1178663 1112581 1078928 1171193 1175458 1147246 1147891 1105045 1116727 1095963 1041323
25435 1041323 1067557 1176902 1239346 1213102 1206844 1208819 1209468 1202289 1144641 1047691 936649 993985
25423 993985 1060621 1083705 1026378 1095038 1165709 1155560 1170303 1171312 1113314 1116489 1154791 1197497
25411 1197497 1218659 1155111 1153776 1148470 1106491 1177205 1181627 1123440 1157641 1187879 1131152 1027678
25399 1027678 1051425 1012913 950627 1022054 992780 971537 1024396 1104978 1173163 1212261 1202340
25388 1202340 1173339 1238717 1216888 1186828 1159039 1183050 1152759 1074002 1088823 1128473 1125843
25377 1125843 1173788 1200132 1176170 1123757 1056778 1039436 1084117 1186291 1095600 1075993 1183365
25366 1183365 1243060 1204699 1162710 1121566 1077821 1127831 1125098 1135904 1182650 1153620 1156492 1134493
25354 1134493 1163203 1180563 1125317 1125400 1085669 1072548 1046515 1064994 1099742 1098042 1090584 1058221
25342 1058221 1065483 1127198 1115980 1049123 953783 976836 998435 1084611 1122019 1072461 1125473
25331 1125473 1146425 1123010 1095748 1063154 1108296 1161495 1124569 1150994 1166191 1090866 1065770
25320 1065770 1054069 1060025 1162108 1170444 1106066 989565 1054184 1095535 1084253 1121079 1083996
25309 1083996 1064127 1070277 1050219 990892 1055611 1102499 1069689 1094666 1078207 1176402 1194143
25298 1194143 1198361 1151526 1085544 1150652 1238343 1238970 1204286 1225173 1204139 1226573 1204030 1188933
25286 1188933 1139298 1072676 1119348 1222103 1269069 1249535 1232213 1235410 1259485 1220193 1236758
25275 1236758 1239127 1164718 1121327 1160679 1175832 1234600 1186774 1212633 1251615 1210986 1147310
25264 1147310 1137871 1205385 1243255 1224280 1167573 1108557 1064806 1054408 1087973 1118734 1178285
25253 1178285 1176649 1110425 1086401 1114472 1160330 1219686 1188829 1191147 1167101 1152859 1198993 1226745
25241 1226745 1207218 1163145 1093252 1130830 1276362 1295301 1291485 1225746 1122719 1116717 1132578
25230 1132578 1066575 987908 970218 1054272 1193036 1182686 1188728 1142084 1126827 1204705 1257055
25219 1257055 1241693 1237173 1260741 1309349 1325056 1274744 1256056 1204355 1148847 1160341 1139218
25208 1139218 1143079 1192276 1156987 1104383 1111621 1155839 1129802 1159586 1147784 1182431 1257732 1273227
25196 1273227 1264407 1193272 1121806 1208054 1243030 1263549 1227841 1156619 1137637 1099552 1091800 1143293
25184 1143293 1231566 1191233 1164198 1137636 1188320 1271523 1277622 1301557 1386883 1417183 1359203
25173 1359203 1257384 1248501 1312916 1403763 1443425 1361616 1267340 1271616 1293934 1292043 1224330 1230810
25161 1230810 1197268 1246395 1197195 1221020 1202193 1188363 1201876 1236805 1181289 1122329 1175600
25150 1175600 1254511 1216722 1241339 1224595 1206728 1216193 1248794 1282585 1291993 1211306 1167174 1180549
25138 1180549 1235901 1273549 1210259 1203730 1224043 1212762 1205816 1250929 1224213 1168184 1268032 1305216
25126 1305216 1314629 1349202 1288635 1257097 1244580 1255898 1159532 1078856 1116003 1179535 1187236 1164939
25114 1164939 1191719 1203834 1272908 1235416 1186166 1226930 1244469 1228684 1215964 1146735 1180540
25103 1180540 1173469 1223717 1271521 1276324 1269916 1277352 1308255 1251493 1180165 1218640 1169336 1153518
25091 1153518 1058089 945018 955771 1026238 1093927 1077108 1155412 1220736 1185943 1157830 1237173
25080 1237173 1179703 1170425 1253837 1268924 1201939 1190652 1148897 1175840 1245500 1253372 1230579 1160483
25068 1160483 1189239 1286852 1407541 1367757 1318150 1281755 1340536 1361935 1423775 1417037 1401614
25057 1401614 1215947 1125898 1111976 1188893 1257273 1317435 1326036 1211330 1185867 1205794 1218702
25046 1218702 1256610 1300030 1304845 1275545 1159311 1070040 1031827 1092486 1134998 1198377 1199273 1186259
25034 1186259 1305476 1389538 1469388 1511328 1416522 1404994 1291983 1224988 1179670 1237864 1312194
25023 1312194 1274765 1221901 1256785 1299483 1263432 1217034 1190838 1223969 1179489 1087576 1103695
25012 1103695 1191998 1237536 1217291 1201426 1265964 1287477 1340554 1328878 1382816 1328939 1258035
25001 1258035 1199487 1214942 1218847 1218189 1258394 1353830 1339524 1333874 1338118 1240054 1196006 1176819
24989 1176819 1221300 1234810 1237656 1218455 1216309 1218715 1245117 1262179 1352957 1278289 1175189 1122531
24977 1122531 1129923 1147898 1138737 1111845 1113765 1136284 1206972 1232038 1199858 1243743 1314801 1327114
24965 1327114 1308739 1218645 1188264 1165562 1190701 1235996 1245399 1264679 1254865 1180332 1137381 1168816
24953 1168816 1227968 1255446 1233887 1275355 1344427 1390715 1307586 1286229 1305477 1311505 1351144
24942 1351144 1314705 1242396 1260243 1263185 1210531 1213866 1146716 1083614 1151413 1189904 1157047 1109504
24930 1109504 1150590 1119560 1136629 1165342 1183805 1235431 1315343 1313994 1259852 1285968 1327812
24919 1327812 1283886 1273746 1338432 1401828 1385271 1287841 1276135 1303188 1262978 1193752 1131009
24908 1131009 1158772 1217894 1174336 1210327 1246970 1251888 1260239 1342973 1362918 1292921 1380441 1463146
24896 1463146 1387757 1344445 1359199 1346169 1319677 1405068 1455781 1371192 1297537 1246403 1246519 1285712
24884 1285712 1336282 1380358 1341355 1304265 1250322 1253384 1298991 1236866 1249461 1208446 1114525
24873 1114525 1121305 1189340 1234907 1185959 1232917 1226421 1247786 1337388 1369512 1320501 1339368 1345311
24861 1345311 1329653 1302936 1336981 1351118 1270748 1226320 1165667 1222240 1247846 1274715 1264106
24850 1264106 1283276 1363235 1393619 1428012 1336607 1310975 1327705 1348501 1357180 1280746 1225316
24839 1225316 1235365 1254874 1240151 1238526 1235776 1299396 1368306 1395401 1323826 1259867 1377112
24828 1377112 1409086 1422893 1435285 1460023 1439494 1435247 1341007 1289380 1255476 1180056 1176214 1157888
24816 1157888 1121800 1201462 1260959 1240664 1240060 1322542 1496749 1494844 1405621 1379398 1390814 1344191
24804 1344191 1390065 1364004 1289231 1258568 1314527 1394968 1325564 1343895 1343652 1304431 1356674 1442139
24792 1442139 1473362 1446868 1412966 1425962 1409541 1366854 1297674 1311953 1281458 1225099 1232066
24781 1232066 1253831 1269829 1260428 1260273 1249796 1359973 1357043 1368036 1340188 1361282 1373720 1311652
24769 1311652 1233405 1225574 1238916 1266817 1304022 1344493 1339581 1399555 1427646 1385963 1349586 1297685
24757 1297685 1228090 1194034 1250826 1336926 1297123 1339863 1345832 1245516 1234556 1339617 1414227
24746 1414227 1475455 1451812 1428887 1395008 1476449 1462612 1415087 1368995 1328477 1304889 1327757
24735 1327757 1346130 1324190 1255976 1227591 1330308 1383628 1412530 1482314 1414501 1369353 1397800
24724 1397800 1378725 1356711 1297088 1268325 1262091 1301481 1381382 1340448 1233907 1223718 1189368
24713 1189368 1256017 1272444 1354105 1424995 1513049 1535992 1463609 1425090 1436399 1455922 1391149
24702 1391149 1420397 1449231 1444937 1357878 1232076 1284951 1336408 1375329 1370282 1334817 1300328
24691 1300328 1275564 1292170 1436488 1454305 1429682 1362949 1358372 1342254 1275222 1228029 1254953
24680 1254953 1301965 1269157 1241600 1277414 1286486 1243971 1181911 1157586 1120130 1193804 1276726
24669 1276726 1284572 1313857 1340231 1377638 1350287 1433383 1492832 1447057 1471986 1493956 1464068
24658 1464068 1432757 1429817 1412134 1473570 1422918 1333271 1360120 1366565 1301562 1341243 1445258
24647 1445258 1379006 1367044 1306550 1303605 1269925 1317074 1367337 1332461 1297356 1321246 1277375
24636 1277375 1311184 1374625 1345394 1297404 1260397 1319256 1335131 1349460 1339315 1362214 1349839
24625 1349839 1400331 1379747 1309982 1394753 1497129 1471761 1443991 1375152 1403387 1377156 1333938
24614 1333938 1344127 1321472 1431583 1512435 1424504 1456259 1416134 1358430 1331555 1313990 1321355
24603 1321355 1408377 1393924 1347879 1346064 1255125 1306761 1404430 1436272 1420252 1355073 1319628
24592 1319628 1305884 1327914 1310709 1334683 1386121 1438046 1349625 1397706 1497638 1453371 1413888
24581 1413888 1404452 1378620 1375705 1370222 1391304 1456614 1493679 1543191 1533511 1439413 1388859 1359454
24569 1359454 1382946 1426403 1505184 1504318 1455876 1420210 1365356 1345732 1354895 1370962 1428867 1458716
24557 1458716 1375786 1272830 1292108 1365783 1410347 1388878 1457341 1621063 1546816 1396975 1403711
24546 1403711 1424274 1480344 1495337 1500007 1540944 1500166 1341871 1320297 1332685 1322115 1318568
24535 1318568 1363103 1405503 1441093 1519936 1480110 1358325 1307100 1360627 1435054 1482018 1456941
24524 1456941 1455316 1427058 1420288 1411731 1436283 1426739 1430300 1454383 1537677 1617790 1602143 1501693
24512 1501693 1496926 1543417 1535068 1457141 1379721 1416971 1478282 1474078 1528519 1511110 1568027 1618562
24500 1618562 1602017 1555683 1513278 1482895 1423707 1426357 1488390 1536593 1516496 1487649 1368824
24489 1368824 1279172 1301166 1341902 1363861 1333366 1383867 1477646 1506560 1427147 1386291 1389436
24478 1389436 1382065 1391111 1438708 1422149 1323001 1355198 1409824 1454931 1422671 1441369 1509021 1505403
24466 1505403 1477792 1512864 1534168 1567622 1542386 1478269 1425696 1329599 1362962 1449929 1453114
24455 1453114 1470712 1534957 1468269 1491315 1528779 1525019 1496754 1508760 1477857 1451932 1409296
24444 1409296 1464450 1517242 1418692 1345730 1351466 1387125 1381295 1473511 1483811 1452164 1416897 1454823
24432 1454823 1457009 1403938 1262913 1240051 1310613 1345124 1409039 1392164 1393482 1396964 1450477 1489953
24420 1489953 1524028 1566198 1578831 1646592 1620010 1528924 1467409 1452020 1478984 1493433 1501739
24409 1501739 1500151 1523761 1560984 1595218 1604920 1539699 1441675 1469460 1522504 1464726 1398701 1410726
24397 1410726 1379178 1358246 1464322 1480978 1476570 1487808 1507071 1416067 1305596 1330180 1437901
24386 1437901 1509605 1492567 1474464 1460553 1451289 1535658 1521945 1449001 1441226 1414585 1353305 1313527
24374 1313527 1359588 1377112 1380217 1390137 1436517 1461869 1491290 1466081 1475023 1414490 1468182 1494969
24362 1494969 1554644 1629097 1654064 1680496 1658940 1503454 1490116 1498265 1484358 1484346 1497907 1507938
24350 1507938 1573157 1601754 1596738 1521924 1491438 1405017 1402206 1438683 1498994 1549360 1560943 1484594
24338 1484594 1347482 1346935 1404821 1466852 1449627 1406511 1465195 1548397 1534340 1510629 1550047
24327 1550047 1551052 1581202 1553466 1602676 1606267 1503586 1458747 1415283 1328770 1376862 1432932
24316 1432932 1405997 1400531 1472102 1469106 1483677 1466894 1472820 1439777 1518245 1507128 1465323 1447247
24304 1447247 1507222 1591268 1585484 1561430 1623924 1612033 1584226 1533200 1511589 1533402 1570113
24293 1570113 1590655 1566254 1531866 1563669 1545290 1512864 1518969 1493048 1488869 1515603 1528622 1584525
24281 1584525 1604782 1576649 1493984 1454122 1499245 1532446 1500264 1458644 1413376 1478196 1547794
24270 1547794 1485674 1426325 1498602 1468495 1465191 1512823 1494798 1440462 1516437 1561415 1536301
24259 1536301 1570626 1555692 1525242 1513665 1568514 1650542 1626911 1529369 1551293 1551694 1528239 1496135
24247 1496135 1419419 1352447 1403136 1551005 1673528 1705439 1725274 1672908 1637000 1605184 1586410
24236 1586410 1524283 1597758 1561530 1576772 1600812 1599623 1683938 1712355 1714162 1671505 1704341 1642471
24224 1642471 1596739 1544086 1472454 1442788 1579128 1619972 1593626 1570489 1550346 1507969 1478645
24213 1478645 1494952 1484394 1540687 1536023 1567331 1587196 1605996 1545233 1520687 1566735 1555958
24202 1555958 1552338 1567113 1591670 1603335 1577947 1410371 1456634 1522246 1554155 1565780 1453304
24191 1453304 1440129 1481387 1485856 1484861 1470615 1458993 1473975 1476449 1515798 1510307 1537123 1599886
24179 1599886 1604439 1553660 1560746 1620579 1660741 1682406 1728877 1688961 1655255 1657739 1606124 1569591
24167 1569591 1606477 1579329 1561202 1625558 1660957 1647869 1676460 1568969 1523705 1587208 1590628
24156 1590628 1559412 1663855 1724234 1698780 1619584 1563274 1612367 1677044 1632641 1530726 1498547
24145 1498547 1504903 1581395 1535172 1634878 1768062 1802330 1750291 1706424 1649424 1577639 1555363
24134 1555363 1515860 1512046 1521813 1530429 1572548 1610782 1586339 1608416 1603090 1597090 1642444 1648497
24122 1648497 1611491 1615125 1603309 1573564 1619180 1566365 1561013 1635025 1658587 1600601 1522016 1499788
24110 1499788 1519873 1510248 1520960 1476746 1461782 1451169 1538782 1601437 1540524 1520818 1548563
24099 1548563 1564695 1550248 1599489 1674088 1639676 1691633 1638141 1596746 1589564 1558175 1527221
24088 1527221 1530413 1520487 1583581 1593018 1599497 1634909 1577445 1517158 1531090 1478497 1467348 1533517
24076 1533517 1601151 1605205 1612927 1599720 1580736 1583806 1590102 1612291 1688282 1772669 1778668 1662143
24064 1662143 1591301 1638030 1613198 1576105 1596034 1622936 1704525 1650532 1594842 1613976 1626612
24053 1626612 1648995 1583444 1616883 1665284 1721801 1845956 1876909 1769218 1774518 1824377 1894870
24042 1894870 1870279 1772598 1639686 1605660 1620610 1649371 1614234 1588389 1552444 1589468 1649081
24031 1649081 1590957 1532926 1580351 1557486 1613855 1694652 1696190 1679501 1676447 1761586 1783742 1726257
24019 1726257 1679830 1702682 1596290 1471407 1535715 1625004 1607268 1563809 1524987 1521739 1541875
24008 1541875 1647679 1751619 1789696 1649221 1606224 1632252 1654521 1572063 1589806 1700898
23998 1700898 1691281 1642880 1691283 1649954 1663256 1663808 1665947 1562695 1596095 1673645 1691030 1694781
23986 1694781 1700224 1697086 1678852 1594685 1554798 1616616 1580678 1582564 1600353 1586494 1544156 1554423
23974 1554423 1639454 1572984 1498366 1496617 1503487 1549884 1628358 1606575 1599527 1643815 1628511 1575554
23962 1575554 1601619 1719840 1755502 1698503 1685282 1669764 1727525 1671800 1578318 1560226 1584661
23951 1584661 1541875 1549558 1587818 1615169 1651057 1651051 1627208 1613558 1540831 1507273 1543445 1599098
23939 1599098 1679552 1669549 1643761 1684163 1649520 1555129 1507715 1580524 1597426 1555373 1630781
23928 1630781 1670390 1621413 1575909 1623685 1641337 1594502 1645532 1772959 1822704 1809900 1857249
23917 1857249 1859682 1771148 1788408 1777555 1743136 1683165 1587102 1662035 1701859 1685153 1723161
23906 1723161 1730751 1709659 1670530 1664592 1644932 1636247 1723149 1834470 1882739 1892369 1776246 1723398
23894 1723398 1704782 1748569 1766340 1813161 1818016 1744789 1672537 1679278 1664737 1620763 1723375
23883 1723375 1724322 1789635 1865731 1900901 1853818 1735831 1698533 1680412 1726129 1826017 1833814 1814905
23871 1814905 1793268 1794903 1750402 1747403 1744643 1754142 1702816 1788747 1817347 1750259 1749786 1741842 1747656
23858 1747656 1774291 1731284 1687300 1604897 1586564 1593908 1591093 1603553 1694500 1805613 1808573 1804396
23846 1804396 1754504 1700556 1692727 1643233 1551869 1613296 1658681 1719090 1794943 1823156 1849006
23835 1849006 1726651 1682386 1747946 1856703 1843976 1802227 1800697 1778477 1751962 1776646 1749610
23824 1749610 1795379 1808668 1774650 1676743 1584642 1663308 1701908 1693656 1726007 1786993 1838160
23813 1838160 1855607 1889847 1805670 1753496 1774362 1754118 1840665 1891549 1911657 1823032 1793383
23802 1793383 1845000 1881456 1802373 1773458 1845304 1803616 1775431 1757333 1804093 1787856 1824537
23791 1824537 1856519 1842577 1796010 1857433 1939091 1952993 1827608 1790565 1879656 1934231 1898285
23780 1898285 1964762 2013101 1949321 1905159 1923272 1794721 1701506 1696809 1693676 1717870 1732554
23769 1732554 1744901 1778021 1818378 1829846 1819246 1777187 1750956 1755106 1750919 1799817 1841908 1828482
23757 1828482 1863348 1933509 1956728 1946913 1913806 1897254 1849884 1780556 1759050 1838241 1959583
23746 1959583 2055000 2007503 1972389 1938746 1921211 1907665 1934987 2017079 1995404 1931333 1882065
23735 1882065 1894495 1904107 1913429 1882888 1818835 1756366 1853057 1937343 1914292 1901340 1907908 1865896
23723 1865896 1885979 1783921 1796305 1833677 1936165 1917434 1869060 1873723 1867114 1893843 1966424
23712 1966424 1975048 1963595 1935948 1894498 1924953 1920141 1999243 2053580 2040470 1919397 1870275
23701 1870275 1822295 1802501 1893085 1889314 1882412 1936600 1882546 1807349 1806852 1800572 1849607 1864422
23689 1864422 1836372 1865449 1833599 1848691 1868033 1810732 1801614 1862127 1894465 1864788 1904776
23678 1904776 1900850 1866414 1911812 1958761 1944375 1877441 1871594 1846018 1875064 1941087 1964534 1979911
23666 1979911 1942400 1909145 2008559 2068494 2018942 2060857 2067225 2007782 2019364 1965547 1948721
23655 1948721 1936044 1932882 1941724 1882961 1805571 1778673 1827979 1983143 2055161 2019164 2091629
23644 2091629 2054697 1995633 2018418 2041558 2082213 2080956 1998824 2030471 2029363 1978370 1959346 2002997
23632 2002997 2031119 2050089 2041461 2076628 2097742 2084184 2115859 2056941 1963818 1904231 1851850
23621 1851850 1907665 1900129 1863100 1819444 1872614 1927977 1943280 1920804 1936054 1949281 1909705
23610 1909705 1875628 1849376 1853358 1888598 2009851 2009093 2038349 2073813 2045497 2032217 1966876 1967490
23598 1967490 2073899 2116986 2108447 2005512 1884697 1987308 2071678 2071621 2038551 2039566 2054307
23587 2054307 2031175 1976662 2041967 2125436 2162295 2099253 1986941 1904324 1910248 1905053 1944740
23576 1944740 2022340 2114939 2205089 2176177 2063973 1991402 2015980 2012118 1976147 1932927 1956154
23565 1956154 1937440 1906349 1981458 1985239 1968838 1983539 1967005 2062909 2066812 2086997 2140584 2127789
23553 2127789 2125173 2104694 2079984 2066205 2067281 2066458 2012712 2118295 2176068 2093974 2049684 2061386
23541 2061386 2079450 2022564 1983419 2033976 2175946 2170892 2116485 2099577 2061909 2000978 2045090
23530 2045090 2023516 2033668 2010157 1925883 1880864 1937946 1991968 2107863 2106599 2079551 1998895
23519 1998895 1944940 1982049 1917083 1933683 2082236 2104849 2107393 2001586 2036154 2144555 2212472
23508 2212472 2257166 2229602 2167530 2085816 2096524 2087550 2013105 2040631 2065984 2120493 2149378
23497 2149378 2137266 2150227 2201644 2304777 2283422 2257498 2135114 2114346 2057630 2162704 2166222
23486 2166222 2117854 2142995 2103891 2031868 2019692 1993037 1985405 2067331 2071114 2095160 2182437 2192290
23474 2192290 2178002 2151594 2090390 2097624 2136420 2107242 2103925 2082957 2082484 2068256 2064252 2126473
23462 2126473 2194990 2236696 2348206 2313560 2307146 2278436 2274252 2239300 2197143 2169773 2192695
23451 2192695 2170965 2231817 2291688 2249193 2301154 2369810 2265045 2296935 2357885 2410451 2417977
23440 2417977 2422503 2445737 2391550 2300422 2216696 2199881 2194298 2192771 2195581 2212542 2280233 2334722
23428 2334722 2367490 2319929 2207865 2156455 2092779 2173719 2211206 2193130 2250109 2240968 2191174
23417 2191174 2171497 2224342 2301941 2229808 2189494 2221290 2181252 2196702 2248699 2192487 2160613
23406 2160613 2234920 2374064 2310915 2281888 2267511 2262947 2227040 2222286 2233634 2182676 2233257
23395 2233257 2222407 2218095 2268701 2327605 2381759 2367858 2352613 2395046 2375283 2346196 2418686
23384 2418686 2407464 2393625 2382721 2357373 2323470 2339422 2377478 2416807 2413803 2395802 2354780
23373 2354780 2324033 2259771 2189862 2243796 2312169 2367314 2371220 2312342 2351249 2333441 2321708
23362 2321708 2359099 2382866 2339462 2375069 2435911 2432172 2433697 2458873 2449840 2533608 2512685 2431169
23350 2431169 2457771 2358339 2288842 2353430 2402908 2450503 2523256 2479922 2477040 2346265 2339440
23339 2339440 2292311 2255876 2275539 2347030 2372826 2370040 2380752 2394291 2348936 2349347 2361497 2315402
23327 2315402 2362662 2440685 2434779 2448966 2474162 2471906 2477074 2521278 2520530 2460006 2431182 2494992
23315 2494992 2575283 2578422 2527263 2409678 2335932 2334456 2308458 2322370 2416101 2429496 2422333 2409662
23303 2409662 2462277 2533893 2536968 2537559 2475859 2465059 2474211 2573691 2619167 2589268 2522933 2521954
23291 2521954 2526129 2600480 2656713 2663354 2635903 2628833 2620252 2698764 2700716 2637215 2640128 2564473
23279 2564473 2500748 2607113 2662134 2634697 2658587 2747149 2730721 2636695 2705748 2746758 2770891
23268 2770891 2790300 2769435 2791054 2865739 2832157 2758667 2834241 2946657 3028034 3023844 3080267
23257 3080267 3144053 3220579 3171116 2935394 2456073 2065647 1849340 1772256 1895810 1987327
23247 1987327 1958199 2065625 2121067 2152040 2170758 2237373 2315618 2329251 2397884 2445551 2404768
23236 2404768 2359411 2312235 2272892 2278164 2327956 2312693 2283913 2345954 2486565 2477227 2396709
23225 2396709 2286581 2309544 2382377 2438131 2441756 2414866 2494811 2508386 2484153 2514119 2535487
23214 2535487 2532203 2489185 2442378 2431952 2383804 2465728 2569354 2617504 2623823 2571094 2468073
23203 2468073 2499809 2491970 2466348 2495647 2520671 2508719 2565888 2532380 2537716 2597173 2561946 2518470
23191 2518470 2551134 2532884 2522309 2497018 2538209 2609323 2722696 2691215 2709896 2728344 2733319
23180 2733319 2711638 2696635 2710188 2741302 2663249 2649056 2693173 2735147 2623271 2545158 2548391
23169 2548391 2539050 2600464 2675367 2638118 2644491 2763228 2808964 2735488 2758706 2828702 2814126
23158 2814126 2762588 2693691 2721873 2691635 2714547 2754994 2759717 2779119 2788386 2804979 2849779 2856383
23146 2856383 2834896 2824862 2772597 2697803 2735390 2762655 2815024 2827631 2896174 2905510 2913837 2975788
23134 2975788 2947464 2864265 2866969 2843839 2849848 2832540 2802888 2858495 2917419 2845482 2813528 2870474
23122 2870474 2956099 2976672 2936212 2845473 2908030 2850354 2771931 2816763 2800377 2808443 2915511
23111 2915511 2931869 2944408 2891336 2887750 2966005 2988113 2963847 2965641 2998019 2984936 2981374 2952045
23099 2952045 2947724 2929007 2933974 2902029 2879321 2850549 2932365 2932561 2945441 2939032 2943189 3030073
23087 3030073 3012919 3007186 2995829 3010676 3148378 3223869 3223721 3224979 3201665 3125034 3108887 3067408
23075 3067408 3041019 3001336 3003559 3062078 3143867 3106424 3031939 2995208 2985050 2958680 2992881
23064 2992881 3016816 2994178 2949925 3053578 3173147 3164449 3173706 3203982 3250592 3193123 3110832
23053 3110832 3079620 3147655 3193509 3194205 3173990 3216995 3204868 3100596 3130397 3213371 3336143
23042 3336143 3300308 3252959 3277535 3277877 3208304 3192112 3260306 3346773 3353271 3310242 3202116 3194872
23030 3194872 3337667 3364413 3318698 3288855 3299770 3271332 3266235 3265729 3243472 3261789 3292258 3243568
23018 3243568 3315899 3386196 3319313 3275193 3311752 3377565 3339177 3273295 3283536 3296997 3315960
23007 3315960 3391411 3446877 3364244 3374016 3399525 3446918 3475239 3463231 3402458 3353149 3425765
22996 3425765 3540925 3543206 3603638 3569240 3621301 3681541 3633218 3594273 3481025 3518798 3592117
22985 3592117 3611568 3611624 3526037 3500820 3543213 3639190 3666387 3701278 3692337 3658250 3742934 3720207
22973 3720207 3709865 3749805 3679115 3736673 3719562 3639685 3668093 3713161 3741398 3726081 3731983
22962 3731983 3809009 3890723 3841175 3871748 3889593 3924202 3942206 3928623 3899417 3954527 3896401
22951 3896401 3880183 3884458 3890841 3838787 3880354 3880715 3829474 3833876 3773847 3765545 3825175 3864272
22939 3864272 3929967 4001150 3962889 3925191 3929931 3934291 3948244 3991923 4003106 4089701 4066991 4030166
22927 4030166 3976987 3980304 4072129 4163160 4124611 4031467 4020586 4059204 4130174 4212518 4302911
22916 4302911 4298188 4285699 4319985 4334896 4296403 4336162 4322039 4414375 4445927 4440839 4433573 4455957
22904 4455957 4457461 4452577 4425702 4417071 4442342 4375150 4336308 4320874 4396831 4423045 4426836 4490798
22892 4490798 4578914 4652911 4640874 4648629 4686518 4684429 4732127 4773848 4792907 4762857 4675620 4688746
22880 4688746 4833125 4859236 4871977 4853772 4891735 4891882 4917638 4898507 4932951 4930686 4979210 5084649
22868 5084649 5071096 5016979 4950911 4894686 4886854 4889119 4961714 5040229 5084520 5174956 5289363
22857 5289363 5133376 5079757 5090236 5081659 5194600 5245152 5335065 5381963 5307151 5280764 5355227
22846 5355227 5347501 5288156 5260721 5289468 5343285 5460615 5543738 5594272 5652108 5688882 5699844
22835 5699844 5784486 5810408 5752726 5693662 5669390 5611236 5657379 5761071 5832013 5828816 5881422
22824 5881422 6027983 6025386 6078802 6003614 5940324 5935521 5961292 6070682 6198850 6294215 6371325
22813 6371325 6471353 6619857 6640892 6647957 6679398 6714646 6729126 6686953 6744656 6818433 6902695
22802 6902695 7012476 7059845 7140753 7145613 7166206 7231163 7265161 7313628 7416663 7464146 7461646
22791 7461646 7490148 7586897 7668383 7750504 7888901 7962466 8084166 8177574 8161760 8243430 8379677
22780 8379677 8442114 8505745 8650325 8811651 8953089 9191019 9428726 9450830 9217804 8802314
22770 8802314 8478115 8353093 8380903 8536912 8906863 9177089 9259927 9482859 9552544 9541011
22760 9541011 9594225 9871539 10109713 10277740 10479844 10670741 10725956 10908108 11018095 11176652
22750 11176652 11386592 11552322 11621157 11812595 12111914 12411149 12590817 12750805 12928795
22741 12928795 13145972 13330472 13567668 13872723 14235234 14467843 14768790 15156767 15560216
22732 15560216 15889564 16220782 16590259 16966718 17411849 17880462 18289021 18724608 19245723
22723 19245723 19917473 20599537 21240699 21922268 22556247 23302291 24110086 25152019 26291126
22714 26291126 27487572 28807876 30210355 31764805 33523393 35462463 37538137 39910737
22706 39910737 42860032 46343059 50460944 55291977 60951473 67537712 75407738 85551952
22698 85551952 99367132 117266761 136364929 144145514 115439653 43364134 -49133891
22691 -49133891 -114307653 -135132765 -123571985 -104920415 -89377839 -77696683 -68882235
22684 -68882235 -61875167 -55965728 -50811714 -46453161 -42777962 -39594840 -36791242 -34354868
22676 -34354868 -32093731 -30093586 -28390075 -26887174 -25536393 -24314002 -23257378 -22224996
22668 -22224996 -21245200 -20293775 -19408776 -18577279 -17743393 -17075267 -16502111 -15913102 -15450379
22659 -15450379 -15005607 -14555669 -14045727 -13495242 -13051754 -12682575 -12254312 -11872595 -11534801
22650 -11534801 -11224792 -10937344 -10681074 -10426066 -10162117 -9887297 -9608821 -9466627 -9215739
22641 -9215739 -8980232 -8694881 -8419138 -8321464 -8235198 -8119107 -7943119 -7685917 -7511127 -7375252
22631 -7375252 -7248497 -7063738 -6870750 -6711263 -6462949 -6320943 -6265178 -6087696 -5931295 -5832767
22621 -5832767 -5725672 -5506895 -5304025 -5151330 -4957369 -4780115 -4589066 -4537728 -4738351 -5140000
22611 -5140000 -5508621 -5631332 -5513415 -5354863 -5180860 -4995362 -4872741 -4778698 -4668660 -4519148
22601 -4519148 -4351933 -4255517 -4275218 -4277680 -4230211 -4134954 -4136162 -4050969 -3863744 -3742689 -3681640
22590 -3681640 -3616187 -3597538 -3529861 -3568893 -3504908 -3404828 -3307374 -3216870 -3105249 -3021605 -2935033
22579 -2935033 -2964477 -3061916 -3091834 -2972185 -2912856 -2819440 -2733494 -2711555 -2621616 -2553021 -2648744
22568 -2648744 -2671611 -2656051 -2627677 -2680257 -2688316 -2620282 -2500290 -2353821 -2274385 -2248595 -2283199
22557 -2283199 -2300498 -2325404 -2298581 -2185016 -2072021 -2047466 -2022181 -1972214 -1890099 -1828109 -1877585
22546 -1877585 -1879708 -1853946 -1841811 -1757122 -1706791 -1759886 -1800150 -1757146 -1709229 -1648837 -1624151
22535 -1624151 -1684998 -1698826 -1721436 -1702069 -1656530 -1608668 -1514214 -1423277 -1366473 -1373596 -1376194 -1294749
22523 -1294749 -1272829 -1267932 -1270402 -1217918 -1231494 -1231924 -1168919 -1179649 -1108683 -1008458 -1047242 -1028494
22511 -1028494 -992932 -977378 -893488 -906708 -881281 -867356 -794041 -900135 -971079 -1008976 -987191
22500 -987191 -944648 -944017 -919476 -884331 -934998 -872914 -764465 -707066 -698004 -764041 -831175 -753398
22488 -753398 -754855 -778122 -801829 -780403 -714520 -648586 -624672 -685078 -660530 -587712 -657309 -631918
22476 -631918 -550368 -447971 -439228 -495681 -496862 -478138 -405176 -295928 -297084 -348864 -456821
22465 -456821 -448286 -356528 -313320 -385070 -324818 -212077 -290422 -343394 -283223 -282835 -293499 -359628
22453 -359628 -327651 -348809 -285464 -227715 -247151 -344533 -372531 -319064 -294301 -267435 -247194
22442 -247194 -187576 -75802 -2364 -21988 -120675 -163897 -143521 -79142 -31892 -79031 -148718
22431 -148718 -79701 -62371 50339 95418 92976 65151 146379 204087 220316 186194 136972
22420 136972 155461 143527 118185 20787 -141498 -128249 19216 86470 93991 34511 78915
22409 78915 153644 116893 71347 131138 180444 257856 330900 272678 239119 225503 248959 246836
22397 246836 287750 408589 384666 449723 416291 351556 362196 312022 230216 131844 43231
22386 43231 74465 175905 232548 269116 351744 371953 435287 452056 347934 272973 282969
22375 282969 374974 405331 383010 312688 403799 388316 395624 530648 630529 618728 566744
22364 566744 579757 570416 564505 469797 456183 438802 409029 396032 482581 462798 468622 507099
22352 507099 536474 561349 511214 502891 421338 413320 517189 577872 627017 577369 536728 517066
22340 517066 518692 595071 627089 639782 709328 775696 693362 632846 648717 618520 639077 721511
22328 721511 684278 661351 627650 712039 737361 724718 716030 680351 648589 651406 720213 761934
22316 761934 705447 762907 822075 826428 725006 725227 745402 794643 847251 794863 721538 713730
22304 713730 731575 742910 872192 950124 974182 967538 914410 839352 776910 826931 750840
22293 750840 724504 853988 937154 935904 968215 1023935 982769 888534 885868 867619 905602 819129
22281 819129 831762 928845 962412 962658 892359 867692 909655 943977 1014542 968182 945276 868140
22269 868140 875432 981777 1095056 1119389 1043179 950029 971422 1020741 1046995 998153 949714
22258 949714 945235 921936 1006004 1086350 1135212 1181404 1126201 1129782 1105782 1063580 1064010 1104010
22246 1104010 1125714 1047453 1014936 1072391 1159229 1199069 1282927 1273814 1269409 1244893 1252415 1226377
22234 1226377 1174311 1108645 1117241 1103791 1122916 1112449 1142864 1203345 1190330 1140689 1095895
22223 1095895 1115409 1121779 1231192 1246575 1287680 1263297 1193430 1208514 1244801 1271347 1251126
22212 1251126 1273990 1284520 1232787 1217427 1177914 1171968 1221650 1209622 1283983 1337089 1360149
22201 1360149 1339226 1288161 1257507 1359158 1457786 1462591 1497740 1433554 1396914 1439685 1446824
22190 1446824 1475670 1428559 1318800 1329743 1362421 1381820 1361945 1373563 1360909 1326207 1355613
22179 1355613 1462428 1515024 1424039 1380842 1468352 1578623 1684918 1647519 1481171 1479352 1469852
22168 1469852 1441160 1485429 1523005 1563328 1571111 1555009 1466934 1378376 1433316 1507042 1483022
22157 1483022 1394089 1429545 1582488 1631960 1596251 1647530 1658369 1573441 1450533 1378492 1354058
22146 1354058 1465306 1479678 1442330 1482274 1543769 1537864 1549839 1569916 1579916 1624521 1659617
22135 1659617 1659645 1827192 1959692 1977138 1900114 1913758 1984138 2064491 2163679 2263527 2288553
22124 2288553 2077994 1798253 1364292 1026006 872876 902639 971109 1085770 1097423 1123000
22114 1123000 1140756 1136629 1228171 1335078 1391564 1375276 1332869 1347830 1417938 1443618 1327484
22103 1327484 1285912 1379567 1440053 1467524 1561230 1566488 1558227 1518763 1517237 1542459 1568199 1516363
22091 1516363 1498920 1564772 1485673 1468094 1524278 1601164 1774077 1826537 1762658 1644558 1595418
22080 1595418 1624449 1643424 1613883 1576304 1621881 1640550 1664982 1681244 1718605 1729408 1777519
22069 1777519 1732610 1653677 1658506 1629257 1684151 1739704 1685667 1590950 1542461 1535926 1587521 1684966
22057 1684966 1839296 1896586 1872306 1953553 1878765 1804984 1738705 1667012 1624713 1725539 1685260
22046 1685260 1567649 1647750 1696883 1717073 1777109 1815888 1856391 1878199 1817825 1704453 1647322
22035 1647322 1703176 1755197 1746906 1779909 1808412 1777239 1741348 1792517 1802674 1831775 1849734
22024 1849734 1848983 1757284 1763046 1838733 1835340 1830689 1841270 1969274 2011396 1974069 1971070 1930186
22012 1930186 1965164 1898801 1839246 1888433 1866784 1872517 1943475 2001387 2006205 1937595 1944269 1917433
22000 1917433 1935865 2005091 2167457 2223926 2192645 2127565 1989233 2009648 2020607 1981593 1934496
21989 1934496 1887323 1924311 1978019 1912667 1945518 1965212 1950853 2058271 2085575 2043848 2020319
21978 2020319 1963081 1978955 2076763 2088669 2009548 1982437 2005579 2031958 2038925 2026253 2034718 2020825
21966 2020825 2104966 2197199 2111906 2085811 2065641 2080112 2045934 2074351 2128746 2121998 2135362
21955 2135362 2172659 2122488 2091483 2149088 2239418 2172795 2126291 2090865 2116172 2094228 2143614
21944 2143614 2156783 2201283 2165393 2157836 2215916 2253897 2247801 2293394 2287661 2273401 2284377 2237192
21932 2237192 2297052 2327294 2353465 2305198 2307245 2261360 2248239 2289648 2320625 2307577 2276652
21921 2276652 2248562 2240291 2335695 2436120 2377170 2333444 2392792 2465043 2443704 2348139 2311994
21910 2311994 2281054 2263618 2334458 2347128 2355930 2403810 2415478 2389413 2416693 2508679 2519453
21899 2519453 2473469 2351443 2281926 2343757 2407290 2348289 2299473 2299676 2326139 2310355 2308261 2309849
21887 2309849 2285471 2351995 2419693 2393127 2383370 2370583 2443849 2469346 2512869 2614122 2660211
21876 2660211 2665750 2653696 2547408 2482546 2515957 2602665 2565203 2533376 2480205 2478033 2548104
21865 2548104 2537160 2528172 2504547 2441155 2471254 2582961 2582295 2547115 2492861 2552956 2632631 2612907
21853 2612907 2551651 2396333 2297106 2371019 2517649 2593965 2596272 2622794 2671604 2647445 2588490
21842 2588490 2619740 2694989 2650737 2665387 2728817 2745797 2778768 2852140 2819868 2810989 2841370
21831 2841370 2873994 2862127 2782956 2713087 2667793 2685927 2726288 2755784 2830112 2938486 2990147
21820 2990147 2948484 2957074 2961351 2946780 2990122 3062121 3080918 3029373 2959755 2980403 3067998 3113647
21808 3113647 3183423 3199547 3309192 3319369 3299599 3315552 3451793 3381002 3129830 2726933
21798 2726933 2505284 2449181 2506448 2634232 2711373 2785510 2765984 2749815 2777859 2867120 2971197
21787 2971197 3039497 3089050 3162868 3269589 3295903 3134938 2748653 2368479 2232339 2212467
21777 2212467 2218209 2327050 2375954 2387687 2472143 2499626 2531272 2635822 2626681 2569628 2541407
21766 2541407 2587314 2637746 2635719 2585852 2616709 2627076 2599504 2580922 2689961 2823914 2782451
21755 2782451 2722006 2716842 2764995 2748325 2776821 2756788 2726352 2711068 2734879 2817324 2888919
21744 2888919 2851869 2840534 2815735 2761705 2779553 2863079 2829396 2817937 2851756 2868372 2899094
21733 2899094 2864285 2912382 2976652 3027938 3090641 3133884 3114545 3035740 3028975 3029116 3025462 2966553
21721 2966553 2901514 2877043 2867870 2959121 3038367 3144280 3109987 3061747 3122337 3092664 3024207
21710 3024207 3030923 3094295 3133390 3181831 3165976 3195609 3158354 3199069 3240323 3218807 3243022
21699 3243022 3258718 3226815 3200119 3190815 3187719 3188319 3253986 3358508 3398194 3279404 3245959 3250765
21687 3250765 3293707 3340663 3323770 3218067 3146589 3196088 3287737 3372493 3392738 3313127 3317801
21676 3317801 3345507 3437052 3503962 3511240 3431360 3416699 3409420 3334746 3325750 3373557 3415930 3475691
21664 3475691 3477718 3478885 3541433 3480949 3336817 3286791 3363952 3443145 3529904 3555278 3486519
21653 3486519 3498748 3569415 3569851 3613600 3581143 3651861 3689589 3658019 3639623 3670242 3682242 3555392
21641 3555392 3493282 3477002 3491114 3551927 3585298 3571430 3513698 3500611 3549416 3545472 3578669
21630 3578669 3591557 3565628 3591101 3704598 3774222 3733684 3696615 3662729 3710248 3741556 3673481
21619 3673481 3761236 3796097 3796841 3823775 3833137 3872338 3932025 4055803 4097297 4063008 4022443 3953108
21607 3953108 3873518 3892703 3878858 3974032 4048010 4032844 4014706 4009899 3985413 4032614 4025526 3929537
21595 3929537 3961884 4041898 4039880 4071023 4098601 4133072 4078366 4137846 4206817 4182038 4143143
21584 4143143 4138611 4127457 4026152 3988415 4054143 4138878 4076536 4096462 4158264 4161240 4115646
21573 4115646 4173000 4193775 4134652 4059816 4078337 4173548 4239981 4173113 4126965 4188007 4213048
21562 4213048 4279087 4445132 4522139 4474436 4472329 4397695 4342327 4300430 4294918 4308519 4393356
21551 4393356 4440983 4519743 4518443 4588337 4593468 4517027 4467392 4410217 4456934 4493919 4497182 4435866
21539 4435866 4418327 4458786 4549984 4514619 4555747 4595335 4576867 4619211 4745568 4756715 4777263
21528 4777263 4756776 4709490 4650927 4700386 4731639 4783803 4724061 4687655 4607579 4671549 4768991
21517 4768991 4800548 4897718 4928064 4957423 4942769 4950665 4982813 4985658 5010492 5041881 5059208 5070285
21505 5070285 5042802 5044800 5048259 5081045 5104423 5122536 5102773 5091948 5191726 5195808 5232629 5243366
21493 5243366 5224986 5271124 5260271 5285955 5353917 5377094 5463487 5504593 5456158 5324320 5333558
21482 5333558 5396881 5415548 5479782 5550189 5554032 5552805 5469106 5492933 5557966 5651140 5601153 5635643
21470 5635643 5718115 5759425 5683760 5613151 5594580 5611308 5662202 5622827 5582237 5611154 5692155
21459 5692155 5818976 5829314 5892738 5917586 5923246 5900319 5932875 5925980 5958859 5815038 5818679
21448 5818679 5845033 5893205 5958267 6031728 6070214 6115354 6156494 6229650 6255158 6197044 6286082
21437 6286082 6335937 6366571 6377312 6306248 6327553 6426018 6423863 6415866 6450313 6488236 6508378 6497760
21425 6497760 6525185 6508595 6530486 6563251 6605526 6705905 6637925 6684260 6757679 6706717 6701292
21414 6701292 6771332 6799115 6805115 6896995 7048400 7085524 7077464 7142997 7191286 7265948 7241471
21403 7241471 7257021 7294139 7347186 7389373 7501145 7510960 7491014 7556199 7593241 7615523 7585548
21392 7585548 7549234 7502497 7454595 7571578 7609726 7702942 7837239 7919560 7922257 7917295 7979010
21381 7979010 8050707 8064707 8183269 8202993 8251933 8323035 8322791 8308642 8420945 8509745 8463222
21370 8463222 8528605 8497033 8479369 8563689 8616684 8662774 8760835 8848815 8918264 8960907 8983480
21359 8983480 8959064 8977414 9092539 9255444 9353937 9481736 9645166 9642053 9540761 9528078
21349 9528078 9572742 9657704 9756741 9867636 9873201 9858501 9870707 9910043 9937315 10054117 10299138
21338 10299138 10433616 10468595 10504426 10612766 10735269 10806415 10819904 10923558 11076320 11180182
21328 11180182 11268903 11365071 11442687 11550293 11585024 11648094 11717477 11801611 11978238 12092034
21318 12092034 12168252 12339131 12405931 12496243 12549782 12579586 12685830 12762544 12868405 12985404
21308 12985404 13169582 13374937 13550557 13641404 13713566 13905832 14191297 14441926 14537052 14632384
21298 14632384 14771244 14862599 14958584 15189432 15418475 15719472 15918336 15990500 16135321 16358754
21288 16358754 16611547 16810333 17018922 17296138 17620428 17850322 18042959 18285444 18586491
21279 18586491 18840501 19211015 19526808 19863003 20124850 20374376 20711967 21006824 21327974
21270 21327974 21778443 22236847 22656870 23047636 23381646 23846829 24325470 24817496 25417911
21261 25417911 25925369 26494320 27018568 27493865 28149376 28844904 29558281 30327430 31153504
21252 31153504 32026159 32997827 33904531 34446071 34709546 34965840 35630923 36865422 38396897
21243 38396897 39904782 41230672 42551774 44120238 45752472 47634695 49571592 51599278
21235 51599278 53663227 55829381 58306544 61343786 65058260 69368631 74298605 80107567
21227 80107567 86655840 94085637 102436021 112118511 124046649 138888295 157312379 180160796
21219 180160796 207079825 232483116 237674487 185302612 57014206 -95544346 -199512350
21212 -199512350 -226051007 -210140544 -185268104 -162214008 -142937083 -127371457 -115036320
21205 -115036320 -105012873 -96511581 -88908857 -82117274 -76249690 -71012863 -66140963 -61793726
21197 -61793726 -57997870 -54683233 -51931739 -49975080 -48635732 -47370632 -45901926 -44039682
21189 -44039682 -42008158 -39977074 -38163152 -36650378 -35381111 -34222651 -33212130 -32696637
21181 -32696637 -32418012 -31982919 -31260491 -30324532 -29319900 -28391915 -27538884 -26652000 -25764266
21172 -25764266 -25037633 -24423441 -23799748 -23254640 -22809389 -22379841 -21904483 -21350022 -20796204
21163 -20796204 -20296842 -19921478 -19437164 -19070971 -18645486 -18197140 -17784987 -17473906 -17207440
21154 -17207440 -16846953 -16545278 -16241834 -15870955 -15614100 -15388673 -15188350 -14992026 -14746568
21145 -14746568 -14421446 -14167086 -14016721 -13888485 -13767273 -13561782 -13324532 -13022853 -12755602
21136 -12755602 -12466269 -12324555 -12191262 -11998863 -11862263 -11651686 -11478146 -11421251 -11350231 -11258774
21126 -11258774 -11081509 -10861994 -10666023 -10552229 -10432524 -10328687 -10209149 -10125160 -10023225
21117 -10023225 -9876978 -9819645 -9725525 -9526965 -9341526 -9195552 -9099339 -9004199 -8913428 -8795501
21107 -8795501 -8742818 -8688336 -8552582 -8365303 -8201939 -8093622 -7994386 -7893079 -7867634 -7797632
21097 -7797632 -7635131 -7497756 -7473338 -7392111 -7324655 -7235450 -7225380 -7153217 -7136469 -7000972 -6891917
21086 -6891917 -6843891 -6879490 -6864943 -6804189 -6727221 -6671554 -6688742 -6639973 -6514849 -6302669 -6174891
21075 -6174891 -6154014 -6193835 -6208568 -6104338 -6012477 -5962237 -5894520 -5851340 -5895454 -5776620 -5669947
21064 -5669947 -5653968 -5532064 -5492584 -5342881 -5289193 -5315157 -5253813 -5293884 -5200102 -5169570 -5219310
21053 -5219310 -5149668 -5073584 -4966331 -4902157 -4813824 -4810707 -4821886 -4778714 -4745096 -4718128 -4687233
21042 -4687233 -4615355 -4568942 -4488382 -4408879 -4278037 -4207929 -4166776 -4122688 -4104847 -4112532 -4075839
21031 -4075839 -4036144 -4031822 -4006447 -3989794 -3892752 -3830401 -3864299 -3902217 -3965144 -3908581 -3850948
21020 -3850948 -3779339 -3754835 -3787544 -3887734 -3872440 -3787725 -3781064 -3788502 -3848961 -3812166 -3648416
21009 -3648416 -3596256 -3616655 -3629965 -3582993 -3479272 -3366118 -3294632 -3252236 -3148282 -3219730 -3262285
20998 -3262285 -3216952 -3126807 -3009843 -2971323 -2962678 -2920886 -2912228 -2905241 -2993893 -3015776 -2959504 -2808417
20986 -2808417 -2735891 -2737774 -2762755 -2741281 -2724859 -2800112 -2783249 -2713030 -2584086 -2539586 -2526846
20975 -2526846 -2463508 -2459391 -2383701 -2398095 -2519797 -2534777 -2477240 -2395181 -2380372 -2344818 -2380525
20964 -2380525 -2458223 -2452214 -2417951 -2337773 -2279304 -2242631 -2191816 -2247878 -2243698 -2136410 -2062118
20953 -2062118 -2055710 -2040897 -1981434 -1983217 -1998835 -1977615 -1946741 -1985530 -2010215 -1984662 -1971501 -1913836
20941 -1913836 -1877035 -1921366 -1919235 -1933060 -1843987 -1803090 -1831126 -1831320 -1837989 -1841712 -1757913 -1705762
20929 -1705762 -1721456 -1771247 -1816912 -1783071 -1679560 -1583427 -1449772 -1383893 -1350558 -1323304 -1341502
20918 -1341502 -1407515 -1516755 -1588077 -1572339 -1561329 -1605756 -1579466 -1518289 -1489766 -1440343 -1361048
20907 -1361048 -1354892 -1317263 -1333457 -1353237 -1367742 -1378241 -1310284 -1262755 -1309847 -1277480 -1299828
20896 -1299828 -1317484 -1245362 -1203560 -1169061 -1198795 -1158790 -1111117 -1084983 -1092391 -1054829 -1013607
20885 -1013607 -1037495 -1037839 -996656 -926854 -918042 -1022745 -1111066 -1044632 -1013723 -1044882 -1068635 -1103686
20873 -1103686 -1109592 -1057397 -974963 -932510 -888507 -871826 -894135 -829303 -779369 -759457 -733612
20862 -733612 -762577 -859586 -899781 -903975 -855483 -824873 -850024 -859236 -780222 -735664 -783248 -704965
20850 -704965 -644867 -630200 -535857 -516671 -548821 -509294 -523927 -572740 -589914 -461113 -446854
20839 -446854 -499873 -553889 -493748 -374333 -385786 -445514 -423077 -428836 -354323 -380305 -412561
20828 -412561 -378476 -435001 -482063 -454195 -386377 -318248 -217909 -115653 -197761 -227862 -200158
20817 -200158 -227731 -239281 -190967 -197968 -229247 -203389 -115826 -69045 -159854 -221401 -171958 -122974
20805 -122974 -42726 -40374 -136762 -158381 -192740 -147606 -63723 -16469 47156 62532 45171 114435
20793 114435 185337 151874 130072 53810 34465 96201 42511 -5161 55135 110538 29534
20782 29534 50236 23658 81157 165901 163936 178541 229548 292609 300639 271036 198867 110171
20770 110171 92917 89778 93744 195205 282050 279937 317225 341203 350595 319521 265328 281271
20758 281271 417525 485637 508365 483940 472888 423899 349603 352839 407100 374901 344814
20747 344814 366146 411586 450636 498743 503662 464736 414408 341480 323236 439316 509921
20736 509921 527726 504644 528985 587482 640798 754034 823359 735164 745572 688327 657422
20725 657422 597191 542449 556008 633163 665463 718540 779556 849210 925439 955192 952930 956242
20713 956242 1012151 1021650 921460 863269 818453 752721 802063 934322 981219 946114 921198
20702 921198 1024722 1037995 999573 984545 903925 817764 823060 885228 951670 1019990 1096709
20691 1096709 1111400 1050510 936968 878091 874251 918001 960767 937411 917192 965573 987964
20680 987964 975220 890761 857379 855824 916362 1089661 1078601 1090003 1098970 1061917 1099594 1187695
20668 1187695 1211220 1214160 1212015 1210770 1275198 1347349 1369037 1337148 1347294 1413924 1478053 1510862
20656 1510862 1536584 1507660 1545685 1595246 1606371 1614687 1531091 1414065 1419305 1461298 1542343
20645 1542343 1750880 1943641 2040197 1979804 1630620 1186557 864738 720321 696863 741614
20635 741614 761224 794399 882162 893053 985075 1089219 1190308 1338556 1415888 1578643 1651913
20624 1651913 1625052 1465102 1145292 807234 622195 565600 634275 643494 640304 666357 786625
20613 786625 883619 990198 1142985 1160199 1222506 1206889 1173053 1193857 1212638 1260858 1265616
20602 1265616 1280637 1282297 1205606 1170139 1187347 1199220 1252941 1346598 1390929 1388883 1367781 1451428
20590 1451428 1560479 1613503 1574920 1544145 1597651 1662036 1752000 1708666 1666276 1660577 1570086
20579 1570086 1643358 1761510 1811756 1807651 1836673 1794803 1808181 1766343 1763405 1692911 1579400
20568 1579400 1537366 1595130 1664870 1711969 1832160 1834585 1740709 1713560 1705542 1782623 1916530
20557 1916530 1948513 1965966 1963695 1899633 1868044 1896475 1904600 1996274 2069450 2011424 1900013
20546 1900013 1919954 1936744 1927193 1950965 2089688 2126803 2110597 2129194 2161427 2235834 2318225
20535 2318225 2355868 2386662 2352336 2338515 2284292 2252756 2248048 2210505 2148454 2179347 2239852
20524 2239852 2287587 2376339 2372336 2290711 2285460 2394128 2510010 2565637 2499225 2516033 2506774
20513 2506774 2499413 2473273 2435683 2428735 2373741 2413841 2480523 2548972 2521723 2498584 2516209 2585823
20501 2585823 2621690 2658147 2755174 2837680 2895617 2900586 2840625 2887346 2908319 2829804 2781168
20490 2781168 2837702 2806652 2796915 2833706 2776811 2861920 2906196 2895591 2992805 3040353 3018977
20479 3018977 2985249 2964471 2965383 2976380 2972299 2914364 2883643 2940878 2979069 3076435 3008896 3018115
20467 3018115 3062751 3171909 3203590 3191424 3244700 3327826 3296564 3207548 3183256 3100925 3134409
20456 3134409 3195052 3271616 3317489 3408027 3401544 3400800 3372283 3361656 3480415 3466744 3349205
20445 3349205 3363818 3458135 3479484 3495182 3564053 3588224 3653724 3692080 3678373 3635314 3603705
20434 3603705 3638573 3707864 3681285 3569599 3521504 3597579 3643490 3620972 3695532 3652956 3542733
20423 3542733 3639778 3810871 3943732 3973320 3934965 4003073 4057018 4095455 4061595 4046672 4142958
20412 4142958 4258274 4251257 4132379 4119819 4089766 4162677 4237893 4246418 4260292 4306289 4345274
20401 4345274 4363827 4402268 4398156 4364870 4387853 4402593 4502908 4430518 4364926 4499653 4555319
20390 4555319 4622144 4646422 4645793 4636524 4660366 4722305 4676706 4605854 4605816 4628976 4747516 4857038
20378 4857038 4957375 4958812 4913925 4889185 5028319 5050602 4946708 4884987 5011155 5110307 5245130
20367 5245130 5379052 5386688 5385518 5419285 5372557 5414828 5448608 5415120 5438658 5458628 5533405
20356 5533405 5606923 5594198 5590011 5635607 5690979 5738288 5736687 5717520 5807016 5824607 5869169 5922713
20344 5922713 5892076 5883865 5949455 5946562 5937280 6101626 6228593 6340213 6271983 6279895 6331973
20333 6331973 6373426 6471847 6555207 6621264 6690652 6671314 6668620 6609106 6567188 6702918 6804103
20322 6804103 6829135 6873530 6929761 7013794 7137708 7203889 7144263 7193427 7293719 7356103 7436294
20311 7436294 7439858 7439225 7549321 7582555 7648460 7711280 7781143 7853245 7915659 8111162 8220518
20300 8220518 8152050 8186138 8340276 8414196 8428187 8555669 8667089 8748414 8717079 8737823 8770628
20289 8770628 8839515 8968211 9087571 9133320 9210679 9315489 9475863 9639239 9647484 9743655
20279 9743655 9840581 9999017 10138418 10161035 10269393 10428994 10567136 10714029 10819342 10885815
20269 10885815 10972174 11093737 11197401 11309625 11434443 11663783 11877044 12042630 12090366 12106615
20259 12106615 12144194 12299629 12457046 12680495 12865201 13068527 13239745 13353542 13588049
20250 13588049 13879456 14172740 14427899 14694323 14940440 15182583 15393346 15526698 15670101
20241 15670101 15892321 15902050 15725839 15711386 15923562 16404242 16916750 17232194 17654146 18080941
20231 18080941 18406227 18705628 18861300 19070663 19398364 19894919 20470721 21152603 21761156
20222 21761156 22412370 23106936 23915750 24695782 25371226 26100277 27116963 28371841 29502558
20213 29502558 30193212 29751845 28124259 26868468 26767250 27703392 29168070 30861942 32690050
20204 32690050 34757381 37246767 40009423 43389228 47203044 51640976 56987863 63617788
20196 63617788 70870713 75675461 69951499 43210602 10374718 -1221363 3051565 11600668
20188 11600668 21095657 31071910 41183407 49276945 49388680 32472139 4346227 -15360150
20180 -15360150 -20730229 -21622704 -22302697 -19219673 -12803552 -5410948 1407666 5699325
20172 5699325 3253387 -6380948 -11768218 -9028008 -3889399 -665773 -2258169 -7520034
20164 -7520034 -8908754 -5373571 -315932 4842551 9268654 11312510 8996230 3926857
20156 3926857 1931412 4498004 9641651 16076359 22877631 28049146 27704364 19418761
20148 19418761 9750428 5338394 1966205 -5240650 -13155450 -20914912 -25606931 -23941675
20140 -23941675 -19625044 -16945507 -14655819 -9009359 -672405 8231200 14232479 10332782
20132 10332782 -5605045 -29227632 -58232693 -72863862 -70198512 -62714330 -56115697
20125 -56115697 -51874048 -49154295 -46796589 -46107600 -46824740 -45904146 -43470494 -41001312
20117 -41001312 -38770033 -36653686 -34665934 -33047501 -31658240 -30422026 -29306807 -28229044
20109 -28229044 -27262326 -26300876 -25372219 -24840992 -24911440 -25040653 -24692839 -24039889 -23347153
20100 -23347153 -22646849 -21957433 -21194669 -20566812 -20183090 -19743039 -19182736 -18594664 -18117708
20091 -18117708 -17626890 -17183430 -16983660 -17173542 -17579524 -17604024 -17338246 -16904580 -16562284
20082 -16562284 -16248791 -15926666 -15566144 -15219444 -14828499 -14539574 -14182449 -14006392 -13940262
20073 -13940262 -13817097 -13634558 -13508166 -13359152 -13223746 -13143260 -13042615 -12838083 -12633975
20064 -12633975 -12583069 -12495265 -12269698 -12179216 -12102790 -11982358 -11808019 -11692695 -11491485 -11222677
20054 -11222677 -11076036 -10986257 -10857178 -10762905 -10726905 -10628512 -10473285 -10373626 -10186279 -10053479
20044 -10053479 -9956656 -9915958 -9841420 -9767532 -9678044 -9563311 -9494616 -9337240 -9259326 -9187259 -9108252
20033 -9108252 -9014734 -8974984 -8889119 -8779043 -8647515 -8501691 -8457115 -8470487 -8322165 -8179292
20023 -8179292 -8059305 -8032812 -8004981 -7923696 -7880947 -7852182 -7823485 -7747012 -7676942 -7625116 -7484375
20012 -7484375 -7472353 -7497354 -7541329 -7549694 -7400470 -7317595 -7289473 -7184046 -7164271 -7077324 -6878463
20001 -6878463 -6787343 -6776964 -6790997 -6718172 -6574788 -6511462 -6423054 -6318440 -6339775 -6455693 -6459636
19990 -6459636 -6418081 -6386955 -6342309 -6309258 -6285168 -6305440 -6255510 -6182345 -6097067 -6027950 -6024219
19979 -6024219 -5957893 -5916533 -5867898 -5862156 -5911269 -5796426 -5597050 -5485190 -5517540 -5579504 -5563103
19968 -5563103 -5547040 -5498706 -5495009 -5372027 -5239520 -5233703 -5271415 -5198406 -5137037 -5122961 -5144879
19957 -5144879 -5197796 -5178071 -5039494 -4973703 -4956170 -4931774 -4920056 -4966889 -4976202 -4989829 -4942084
19946 -4942084 -4848246 -4767740 -4771477 -4769053 -4787059 -4742100 -4647264 -4628398 -4594825 -4540273 -4532592 -4479293
19934 -4479293 -4463959 -4498651 -4486808 -4407957 -4298146 -4182197 -4140767 -4189133 -4245363 -4143354 -4076479
19923 -4076479 -4116383 -4112813 -4196267 -4191462 -4141542 -4066136 -4108196 -4149884 -4117273 -4095580 -4072089 -4056619
19911 -4056619 -4067233 -3991340 -3968434 -3940077 -3923249 -3951434 -3859844 -3785210 -3773121 -3710954 -3674583
19900 -3674583 -3670241 -3663239 -3669319 -3744226 -3712337 -3648343 -3648479 -3608333 -3589337 -3601080 -3641557 -3642153 -3491370
19887 -3491370 -3378434 -3411744 -3551357 -3624206 -3614074 -3537144 -3427720 -3398920 -3351510 -3429042 -3457811
19876 -3457811 -3419259 -3342057 -3273364 -3234479 -3219497 -3267810 -3398251 -3275053 -3152900 -3115348 -3123514
19865 -3123514 -3133109 -3181757 -3158705 -3106995 -3106262 -3103689 -3117322 -3191497 -3246743 -3165530 -3080997 -3079246
19853 -3079246 -2972181 -2880683 -2843453 -2827657 -2874308 -2907503 -2827810 -2751829 -2828829 -2961980 -2950601
19842 -2950601 -2967251 -2877127 -2830234 -2784125 -2763533 -2791087 -2764199 -2694313 -2682973 -2703085 -2681349
19831 -2681349 -2703984 -2705140 -2721190 -2677410 -2619388 -2559557 -2541693 -2508901 -2588105 -2527819 -2482217
19820 -2482217 -2466650 -2471598 -2470037 -2523374 -2543021 -2514152 -2374268 -2333316 -2371158 -2425647 -2475424
19809 -2475424 -2415613 -2419160 -2445082 -2447490 -2404106 -2411753 -2450873 -2500771 -2420042 -2399008 -2432565 -2408692
19797 -2408692 -2365629 -2346915 -2317205 -2245129 -2294695 -2331650 -2302623 -2258256 -2234046 -2253842 -2223142
19786 -2223142 -2122041 -2081126 -2196449 -2266665 -2281459 -2248571 -2226524 -2266046 -2198533 -2126010 -2117940
19775 -2117940 -2176725 -2155257 -2053633 -2040126 -2041651 -2022441 -2063347 -2109420 -1971721 -1849257 -1846415
19764 -1846415 -1865129 -1887182 -1884013 -1873596 -1902276 -1921298 -1955525 -1940727 -1955036 -1940690 -1867149
19753 -1867149 -1826232 -1812273 -1778465 -1800702 -1720297 -1751130 -1739636 -1712636 -1676864 -1690408 -1808601
19742 -1808601 -1753150 -1706622 -1763016 -1895762 -1845376 -1803078 -1825679 -1800626 -1813778 -1777623 -1728272
19731 -1728272 -1796371 -1772354 -1732754 -1791048 -1777524 -1656364 -1589722 -1620008 -1669597 -1701391 -1697935
19720 -1697935 -1676630 -1624752 -1564510 -1580955 -1626573 -1588875 -1564745 -1605374 -1571201 -1509557 -1430293
19709 -1430293 -1462252 -1541544 -1465867 -1405849 -1399613 -1413019 -1434980 -1468874 -1402041 -1377565 -1345201
19698 -1345201 -1313605 -1390420 -1428694 -1452637 -1492580 -1507555 -1467801 -1307987 -1251541 -1216253 -1173212
19687 -1173212 -1146284 -1174694 -1227016 -1169777 -1143195 -1192886 -1297042 -1339590 -1274207 -1177791 -1133862
19676 -1133862 -1114555 -1128299 -1095257 -1065135 -1082966 -1127781 -1172540 -1280399 -1304650 -1322845 -1388100
19665 -1388100 -1385216 -1318881 -1294988 -1251372 -1140442 -1087582 -1042322 -988823 -1017866 -1026974 -1087148
19654 -1087148 -1064975 -982069 -995833 -1065284 -1064934 -1099606 -1082715 -998281 -933329 -957994 -1037303 -1071009
19642 -1071009 -1038005 -1020486 -988377 -926094 -1006883 -1035992 -1000100 -1034267 -1044201 -940889 -916951
19631 -916951 -936126 -981145 -984365 -1018707 -1056251 -1009158 -1005999 -982105 -987822 -937590 -945746 -1006501
19619 -1006501 -1089310 -1148659 -1178576 -1125301 -1042504 -976264 -976652 -967368 -929025 -899407 -897102 -905727
19607 -905727 -986319 -1070563 -1092641 -1101102 -1142090 -1054219 -973388 -933695 -931276 -1044792 -1084500 -1034131
19595 -1034131 -1037935 -1025974 -1023818 -1009703 -923747 -900240 -925459 -831182 -859130 -912634 -890349 -914644
19583 -914644 -915726 -931362 -969925 -983408 -970255 -971513 -1014821 -995835 -947697 -895307 -862404 -756457
19571 -756457 -760076 -750432 -706658 -756865 -738320 -649041 -543512 -567329 -597421 -628402 -650389 -662467
19559 -662467 -706889 -680679 -640656 -601873 -587500 -582404 -655267 -603802 -575793 -519030 -574570 -518505
19547 -518505 -476218 -525832 -537067 -605034 -645397 -725287 -692829 -593748 -523120 -458717 -432743
19536 -432743 -436921 -419471 -418330 -439437 -477199 -553328 -612879 -560402 -468318 -484719 -452555 -472582
19524 -472582 -414811 -466895 -519140 -476232 -436058 -463291 -462002 -401166 -374887 -317664 -337401 -387556
19512 -387556 -456180 -482683 -467460 -407883 -396573 -366803 -343371 -336051 -356012 -447220 -430583 -352821
19500 -352821 -335998 -309984 -282702 -211111 -93789 -144923 -230609 -290096 -427884 -440815 -369525
19489 -369525 -371592 -337366 -272170 -274118 -250739 -279301 -285711 -265999 -359466 -398962 -388612 -356415
19477 -356415 -333841 -267172 -211002 -193922 -214916 -204500 -190628 -271289 -209655 -140850 -102775
19466 -102775 -73143 -169413 -200825 -208891 -201303 -145060 -81241 -22496 -32963 -20894 -12754 -51290
19454 -51290 -47932 21389 2129 -48767 -82544 -110554 -119004 -21150 -62930 -53207 6150 95549
19442 95549 91624 22822 -30847 -84425 -60616 -55890 -141962 -72133 -46106 -126597 -91501 -28748
19430 -28748 25351 132638 93700 67699 114686 114996 127481 178262 148204 160007 149973 135856
19418 135856 76080 62020 28173 38549 149707 179899 123592 58720 110925 144384 160789
19407 160789 112356 143274 155526 171915 200710 216254 229150 131862 72851 187691 238516
19396 238516 231535 236860 259461 343269 356982 365865 339033 267054 259583 217515 281629 226013
19384 226013 149036 157544 220865 252716 236554 283268 367795 398433 426687 428839 464867 487199
19372 487199 437594 340750 314742 323601 356155 302112 308519 265665 286904 311486 453142 601133
19360 601133 597088 522690 497037 491235 441681 449994 485787 449406 429879 485713 470500 478960
19348 478960 501729 471166 409436 315002 266746 296088 263330 276261 349395 436970 463878
19337 463878 417759 476525 548106 559277 610642 662857 691680 734452 659841 648229 675091
19326 675091 799566 796533 793146 750824 689009 697280 661233 629000 615186 568156 576726 637938
19314 637938 736982 840149 884363 854962 810795 818935 793364 760432 659974 707904 711029
19303 711029 688792 647858 629309 612115 635672 741969 844026 822303 808381 831388 778121
19292 778121 837713 921171 954633 904714 872480 926887 955232 1006656 932519 868001 874249 960418
19280 960418 1007451 1027026 992213 909488 924723 917842 890182 923587 912669 928514 935542 1037991
19268 1037991 1095721 1020007 946470 1044704 1022961 997796 963644 952963 1047973 1048227 962516 935532
19256 935532 869329 854684 874344 827920 861199 950333 1046783 1050756 1006980 947906 1020564 1072760
19244 1072760 1089850 1095293 1074510 1055750 1106050 1184717 1093940 1103830 1247503 1208146 1082038
19233 1082038 1108584 1123388 1089229 1078234 1105287 1217805 1149651 1088173 1181295 1250999 1310063
19222 1310063 1281716 1295719 1269799 1232337 1265775 1299818 1255353 1219733 1209725 1175088 1199631
19211 1199631 1320994 1418440 1385362 1361863 1359369 1379312 1274489 1180050 1232474 1251283 1273729
19200 1273729 1316905 1286328 1196605 1189619 1222957 1285764 1427062 1460391 1413753 1433384 1479309
19189 1479309 1478991 1517306 1514259 1494817 1502977 1489668 1529296 1482862 1442041 1459237 1494623 1564873
19177 1564873 1600367 1536522 1506965 1585966 1622208 1551668 1583233 1584666 1551561 1592939 1615187
19166 1615187 1662453 1697425 1740517 1690297 1616841 1564663 1592438 1604365 1699085 1714877 1770099
19155 1770099 1784424 1718071 1686637 1628020 1556387 1554448 1580744 1605172 1627143 1704290 1763659
19144 1763659 1771417 1799602 1851732 1846534 1734635 1675804 1682876 1750154 1744907 1733947 1718755 1780413
19132 1780413 1767276 1730269 1647910 1676474 1687919 1715660 1855356 1949559 2002965 2085847 2074499
19121 2074499 2070713 2135023 2206668 2241020 2207878 2173347 2144920 2264070 2227859 2155346 2078308
19110 2078308 2139142 2188188 2179526 2134167 2079589 1857455 1832486 1879467 1981880 2105749 2112032
19099 2112032 2046402 2065118 2086377 2079178 2067349 2115227 2100013 2086778 2181969 2201842 2185321
19088 2185321 2144913 2130255 2107756 2069945 2064414 2067361 2064438 2004606 1959586 2043730 2153734 2176229
19076 2176229 2200840 2255303 2233128 2184677 2202368 2178694 2244188 2283705 2273645 2436526 2549076
19065 2549076 2569911 2436430 2356454 2386982 2426909 2409848 2298388 2279287 2253440 2237989 2357017
19054 2357017 2512747 2524929 2425079 2351803 2322031 2248538 2250170 2290748 2313415 2261447 2232511
19043 2232511 2311549 2424474 2486628 2456646 2351113 2330578 2340355 2390378 2443161 2455892 2468181
19032 2468181 2416043 2431174 2458170 2512277 2540556 2461745 2454868 2535033 2651375 2652852 2589135
19021 2589135 2531112 2523524 2558876 2634764 2695561 2672076 2776021 2741552 2733773 2615664 2529873
19010 2529873 2510984 2649740 2696890 2693159 2715171 2828105 2861298 2806384 2728755 2731274 2829934
18999 2829934 2736179 2658083 2601867 2577393 2646428 2706655 2748377 2745393 2795517 2809772 2709798
18988 2709798 2719173 2815850 2811196 2738057 2886004 2956202 2903375 2882475 2944768 2892768 2971272
18977 2971272 3012441 2951388 3005682 3093093 3109253 3042081 3074880 3189331 3157377 3129859 3178929
18966 3178929 3235356 3260170 3311059 3294531 3231961 3316906 3339020 3292843 3173892 3143449 3190271
18955 3190271 3184231 3286367 3369403 3373120 3323488 3341282 3371800 3428326 3518475 3576129 3634371
18944 3634371 3658719 3594673 3570334 3674894 3693067 3723367 3728369 3682647 3594341 3514009 3586898
18933 3586898 3732456 3756451 3746325 3774984 3752097 3710822 3765838 3854056 3884054 3855896 3814798
18922 3814798 3861710 3920813 3935450 3892521 3940758 3969288 3932986 3867639 3886298 3966950 3998311
18911 3998311 4003738 3985298 3991680 4007297 4048775 4045620 4051776 4071081 4023782 4053845 4021235 4051060
18899 4051060 4135431 4197458 4192157 4177843 4244542 4254874 4307290 4320388 4304277 4350920 4388263
18888 4388263 4381873 4497711 4524360 4563616 4546577 4542311 4624372 4603877 4686884 4723226 4707075
18877 4707075 4684831 4685439 4602113 4584357 4602079 4690481 4748710 4795216 4812134 4824230 4819390 4825358
18865 4825358 4818084 4840288 4872730 4947427 4891253 4828383 4883320 4942225 5046272 5102790 5133737
18854 5133737 5142410 5172146 5154403 5190240 5276797 5254468 5240670 5279615 5323770 5338062 5324258
18843 5324258 5322035 5348182 5491413 5735483 5768395 5797053 5797612 5725363 5640170 5649413 5646044 5719954
18831 5719954 5759414 5832304 5807524 5832464 5807349 5807635 5823101 5830022 5876440 5860121 5800401 5852391
18819 5852391 5907711 6012501 6101620 6164711 6183763 6230298 6218549 6172957 6271204 6326262 6340376
18808 6340376 6351818 6329337 6328043 6486695 6626831 6661130 6644071 6632404 6612603 6618784 6672681
18797 6672681 6692271 6664749 6682179 6810438 6851176 6911570 6944798 6944742 6850353 6805301 6838495 6939922
18785 6939922 7085367 7151130 7210800 7205068 7244659 7266174 7325285 7438976 7528874 7572291 7649548
18774 7649548 7800702 7983924 8003898 8054979 8182705 8377996 8464037 8249789 7726301 7454091
18764 7454091 7554241 7693877 7815074 7966054 8107678 8181838 8248181 8311017 8336313 8291020
18754 8291020 8345323 8476925 8555748 8606085 8666161 8700022 8777397 8920486 9066133 9108760 9099888
18743 9099888 9123697 9194628 9258505 9301337 9446058 9476691 9483079 9574575 9658603 9763665 9735130
18732 9735130 9723066 9839699 10042082 10099974 10128553 10242196 10386693 10444731 10460708 10606771
18722 10606771 10715042 10718768 10783964 10928788 11092764 11111249 11149349 11319098 11421441 11420140
18712 11420140 11495262 11552513 11643959 11683922 11789343 11952180 12057881 12183091 12333073 12344238
18702 12344238 12478990 12663201 12784702 12927847 13055193 13172124 13332529 13543419 13752612
18693 13752612 13913143 14066755 14210181 14236370 14286493 14591107 14821101 14997249 15177677 15257019
18683 15257019 15437893 15614460 15869735 16114088 16364089 16666310 16992766 17406177 17789127
18674 17789127 18069470 18304840 18284485 17909829 17626866 17824581 18344565 18899294 19535470
18665 19535470 20159276 20801775 21166950 20590158 18619267 16957162 16862585 17552603 18530329
18656 18530329 19450212 20376948 21249430 21906770 21916410 20893456 19032863 17638894 17579825
18647 17579825 18416270 19315495 20103082 20794905 21480063 22164883 22853661 23535191 24176996
18638 24176996 24880813 25482695 26124849 26867630 27659165 28482325 29421904 30406653 31421264
18629 31421264 32557090 33681225 34591133 35658930 37125441 39097345 41399895 43457738
18621 43457738 44048331 40668731 34126437 31022139 32509239 35785395 39471014 42835803
18613 42835803 44695880 42815216 37861224 32996574 27886280 25613444 27675403 31425454
18605 31425454 35436089 39477864 43425035 47013178 49083839 48757738 48563581 51478559
18597 51478559 56708004 62954327 69480127 74985211 77391956 77792064 77160110 69771274
18589 69771274 60555561 62102728 72644009 84551804 89622458 77679642 50902483
18582 50902483 27168001 14223699 14024100 15126573 2330802 -19512397 -39170517
18575 -39170517 -53433532 -56522694 -49229131 -39067049 -31416520 -31185891 -38531506 -43154259
18567 -43154259 -39287671 -30749736 -21796524 -16186412 -20300393 -37156420 -51920539 -53337030
18559 -53337030 -47985326 -41313793 -34849212 -28819287 -23228137 -17760069 -12272973 -7390304
18551 -7390304 -3835366 -1855018 934381 4132007 3773563 -2252554 -7791241 -6838157
18543 -6838157 -2550982 -271347 22631 552355 -1623738 -4372064 -7353747 -17659419
18535 -17659419 -30146248 -35620868 -41240209 -55639279 -70859345 -75385398 -71307391 -64773652
18527 -64773652 -58658153 -53271912 -48333805 -44140606 -40815013 -38817225 -37518641 -35552167
18519 -35552167 -33106715 -30538067 -28385147 -27470464 -27848745 -28092892 -27839409 -29348891 -32039191
18510 -32039191 -32637458 -30963610 -28503012 -25848242 -23057771 -20209315 -17680211 -16765011
18502 -16765011 -20427069 -28409228 -33106787 -33184153 -32986619 -32995882 -31718367 -29667280 -27539337
18493 -27539337 -25681051 -24292973 -23896335 -25524006 -27515326 -27378072 -25878667 -24190302
18485 -24190302 -22442857 -20650454 -18960739 -18089376 -18974596 -21574687 -25410216 -29413939
18477 -29413939 -30650489 -29790284 -28546025 -27299400 -26075908 -25124701 -24379267 -23712104 -23215960
18468 -23215960 -22699595 -22255759 -21742210 -21231099 -20641478 -20190142 -19880950 -19484917 -19125826
18459 -19125826 -18926765 -18737959 -18490074 -18166335 -17871708 -17778092 -17825857 -17807293 -17593350 -17365488
18449 -17365488 -17125587 -16837036 -16675146 -16420193 -16222125 -16067999 -15882045 -15653144 -15445190
18440 -15445190 -15182599 -15023636 -14873405 -14736735 -14551348 -14424566 -14283575 -14104958 -13949280
18431 -13949280 -13848534 -13712582 -13571640 -13510535 -13377716 -13223500 -13158694 -13020149 -12827064 -12657961
18421 -12657961 -12550585 -12473827 -12440128 -12444489 -12438019 -12319927 -12139459 -11964411 -11840304 -11747541
18411 -11747541 -11681460 -11590233 -11522207 -11412430 -11195708 -11132893 -11119763 -11110749 -10955042 -10784373
18401 -10784373 -10703499 -10654301 -10569384 -10499047 -10392847 -10323451 -10285202 -10222381 -10164868 -10073386 -10048572
18390 -10048572 -10035999 -9968840 -9935922 -9751948 -9578513 -9562872 -9564953 -9507603 -9471809 -9342134 -9265940
18379 -9265940 -9239194 -9185233 -9285575 -9268392 -9115721 -9005671 -8916810 -8822156 -8795281 -8752924 -8685416
18368 -8685416 -8601837 -8399357 -8273410 -8229891 -8294654 -8411557 -8358695 -8206591 -8094862 -8126370
18358 -8126370 -8120138 -8093355 -7988636 -7922348 -7949065 -7821239 -7750383 -7703400 -7599017 -7583915 -7620781
18347 -7620781 -7641593 -7529466 -7511713 -7497451 -7410123 -7317850 -7357944 -7299183 -7193230 -7148224 -7116443
18336 -7116443 -7135739 -7194623 -7135386 -7004553 -6869415 -6766321 -6719984 -6642251 -6532876 -6541239 -6502212
18325 -6502212 -6501369 -6535550 -6533157 -6395317 -6359717 -6442808 -6463783 -6479046 -6443823 -6401986 -6396656 -6261803
18313 -6261803 -6154014 -6086241 -6026335 -6037267 -6095786 -6139166 -6101071 -6014169 -5944161 -5851855 -5789384
18302 -5789384 -5710345 -5604923 -5568431 -5527468 -5480962 -5467863 -5457939 -5432044 -5402358 -5336600 -5313364
18291 -5313364 -5321306 -5275463 -5278851 -5246109 -5204845 -5135582 -5052404 -5049429 -5018978 -4902941 -4803463 -4787123
18279 -4787123 -4750444 -4659111 -4608640 -4639515 -4666303 -4608133 -4590945 -4553774 -4501742 -4441132 -4386868
18268 -4386868 -4373945 -4384181 -4437802 -4467112 -4392398 -4318631 -4283100 -4242353 -4200992 -4225250 -4147691
18257 -4147691 -4090967 -3991938 -3969166 -3919834 -3752634 -3670858 -3778818 -3840472 -3733575 -3659064 -3637810
18246 -3637810 -3662310 -3647604 -3583226 -3537034 -3587209 -3484781 -3424017 -3312011 -3215119 -3139843 -3233286
18235 -3233286 -3298525 -3173773 -3061654 -2998065 -3018955 -3039670 -3036500 -2969080 -2911312 -2832015 -2766883
18224 -2766883 -2707305 -2698235 -2715397 -2646307 -2606941 -2577289 -2540000 -2479558 -2486781 -2490338 -2395839 -2326966
18212 -2326966 -2383832 -2233008 -2113437 -2130727 -2104658 -1976659 -1895279 -1865990 -1825217 -1757632 -1700533
18201 -1700533 -1666834 -1543447 -1533246 -1485033 -1499463 -1430491 -1258671 -1120801 -1040296 -984357 -966685
18190 -966685 -964513 -927886 -823139 -715310 -710126 -680109 -601956 -562615 -450831 -369926 -246907
18179 -246907 -72764 20422 86936 200166 329207 424849 568795 712214 799856 708413
18169 708413 815321 993029 1213439 1412963 1525741 1664539 1826159 1964392 2096118 2223723
18159 2223723 2321979 2446021 2609869 2803153 3060474 3224557 3295785 3537294 3863245 4114782
18149 4114782 4336162 4559714 4767197 5026721 5319803 5611701 5942655 6254639 6581957
18140 6581957 6984321 7484139 7954471 8329160 8636025 9013670 9481359 10037902 10750444
18131 10750444 11577561 12382003 13202116 14147076 15221303 16437810 17714850 19074348 20667840
18122 20667840 22584622 24821081 27452500 30496568 34141651 38826533 44564269 51754852
18114 51754852 61095875 73750240 89825574 105509498 105573942 50529482 -58920235
18107 -58920235 -113817510 -108554959 -92138173 -78096838 -67131523 -58747840 -52181479
18100 -52181479 -47071714 -43101499 -39700127 -36744385 -34263966 -32169766 -30360673 -28735781
18092 -28735781 -27248402 -25945822 -24705332 -23696096 -22880037 -22195320 -21514616 -20777520 -20022246
18083 -20022246 -19257867 -18651778 -18151252 -17665631 -17331304 -17030387 -16731513 -16478643 -16134297
18074 -16134297 -15707786 -15340497 -15071252 -14765850 -14305498 -13881347 -13645263 -13538516 -13317827
18065 -13317827 -13067985 -12873412 -12696044 -12455458 -12147236 -11964141 -11795309 -11603291 -11501482
18056 -11501482 -11349501 -11244681 -11165527 -11093750 -10903157 -10760914 -10648847 -10519936 -10318892 -10193996
18046 -10193996 -10067442 -9920554 -9788958 -9739715 -9694369 -9718610 -9681851 -9579160 -9408381 -9344273
18036 -9344273 -9274213 -9226392 -9219553 -9288087 -9357231 -9335585 -9279291 -9163968 -9069962 -8970775 -9000532
18025 -9000532 -8945214 -8814901 -8664064 -8684491 -8709896 -8712381 -8609666 -8372888 -8305990 -8305224 -8273647
18014 -8273647 -8269571 -8217909 -8191730 -8161549 -8089184 -7997328 -7948391 -7830714 -7728253 -7615806 -7560543
18003 -7560543 -7583211 -7576919 -7462050 -7395826 -7378797 -7305648 -7226964 -7243856 -7187634 -7102363 -7020011
17992 -7020011 -6967391 -7017803 -6957202 -6958606 -7042000 -7038523 -7001676 -6950269 -6931632 -6924368 -6924156 -6921491
17980 -6921491 -6855317 -6882147 -6936623 -6966161 -6984038 -6925184 -6898343 -6929718 -6940940 -6923301 -6839011
17969 -6839011 -6781735 -6702646 -6643145 -6611387 -6546643 -6485642 -6420309 -6495174 -6502096 -6486837 -6456497
17958 -6456497 -6400828 -6341128 -6347404 -6399430 -6368234 -6278153 -6237996 -6123168 -6059943 -6049821 -5993880
17947 -5993880 -6015590 -6033356 -5962522 -5945735 -5945646 -5924450 -5889274 -5889605 -5911903 -5864133 -5869465 -5900108
17935 -5900108 -5882200 -5901744 -5895340 -5922939 -5760635 -5660978 -5626211 -5628633 -5615012 -5588497 -5582673 -5508492
17923 -5508492 -5504903 -5497995 -5449759 -5487081 -5589029 -5618150 -5522415 -5464363 -5481005 -5512521 -5507900 -5552705
17911 -5552705 -5537343 -5484507 -5422149 -5411562 -5474992 -5475728 -5424361 -5387463 -5271152 -5234438 -5222373
17900 -5222373 -5325298 -5321743 -5352899 -5415907 -5361962 -5330569 -5229054 -5111526 -5098567 -5134821 -5123439
17889 -5123439 -5072098 -5102018 -5003372 -5015022 -5052768 -5093183 -5117382 -5140294 -5097373 -5134691 -5066035
17878 -5066035 -5015399 -4921231 -4832509 -4895037 -4977024 -5042579 -5017742 -4972889 -4987287 -4954395 -4899749
17867 -4899749 -4892109 -4899113 -4936938 -4842506 -4842211 -4889033 -4886237 -4910486 -4917334 -4893581 -4875277 -4839717
17855 -4839717 -4805686 -4789837 -4815354 -4827103 -4833401 -4800661 -4820046 -4835098 -4821752 -4744167 -4744044 -4837284
17843 -4837284 -4799783 -4747110 -4701005 -4651251 -4638109 -4649107 -4576937 -4558208 -4651092 -4635592 -4613588
17832 -4613588 -4585451 -4430143 -4418351 -4446766 -4482392 -4435626 -4344817 -4293151 -4250904 -4299843 -4422930
17821 -4422930 -4466647 -4375660 -4363626 -4404497 -4372194 -4308973 -4248726 -4265417 -4314420 -4351822 -4330901
17810 -4330901 -4274779 -4212524 -4320867 -4312224 -4315999 -4224999 -4268070 -4263060 -4156489 -4286674 -4450450
17799 -4450450 -4470847 -4374835 -4324821 -4306354 -4251257 -4157319 -4120723 -4220843 -4292289 -4305814 -4331956
17788 -4331956 -4324764 -4271138 -4183149 -4140754 -4189346 -4231282 -4190172 -4106016 -4166754 -4165720 -4102383 -3989615
17776 -3989615 -4059034 -4118374 -4161382 -4205211 -4219600 -4169939 -4011547 -3920075 -3913794 -4003294 -4018880
17765 -4018880 -4011882 -3977442 -3910310 -3928079 -4043920 -4067288 -4044569 -3994720 -3972668 -3935448 -3941363
17754 -3941363 -4011170 -4038187 -3969854 -3913844 -3834356 -3870046 -3930268 -3952974 -3964828 -3948970 -3971623
17743 -3971623 -3908585 -3941643 -3973538 -3986534 -3954838 -3936943 -3889805 -3865063 -3801594 -3778725 -3915945
17732 -3915945 -3929397 -3895305 -3913747 -3913094 -3928355 -3933500 -3848081 -3800819 -3690443 -3707987 -3765290 -3725225
17720 -3725225 -3709978 -3723164 -3772651 -3854050 -3791957 -3727858 -3710752 -3768657 -3788926 -3735139 -3709950
17709 -3709950 -3621688 -3659061 -3698526 -3666054 -3677128 -3647957 -3617766 -3650258 -3684051 -3675355 -3666454 -3645893
17697 -3645893 -3765201 -3774494 -3736323 -3726853 -3664881 -3701706 -3784164 -3806976 -3756837 -3760047 -3699947 -3694953
17685 -3694953 -3682868 -3659597 -3583702 -3501603 -3542640 -3609268 -3650031 -3639012 -3546610 -3403267 -3422443
17674 -3422443 -3514126 -3579013 -3503567 -3413178 -3489363 -3618138 -3595564 -3551183 -3576873 -3610221 -3593851
17663 -3593851 -3497769 -3426514 -3393590 -3410784 -3442576 -3428937 -3363171 -3379107 -3392947 -3455118 -3506073
17652 -3506073 -3546083 -3608672 -3650203 -3583298 -3469046 -3482842 -3524762 -3483544 -3475851 -3523188 -3528342
17641 -3528342 -3522033 -3397025 -3369056 -3447383 -3430064 -3418394 -3383234 -3300243 -3299096 -3322710 -3247517
17630 -3247517 -3255329 -3393663 -3342476 -3286117 -3335174 -3364170 -3340902 -3287664 -3267529 -3291241 -3340483
17619 -3340483 -3325885 -3355512 -3348119 -3247501 -3217350 -3258169 -3233152 -3217149 -3257820 -3283483 -3229390
17608 -3229390 -3218434 -3293905 -3328141 -3283629 -3207183 -3167101 -3245981 -3278271 -3326235 -3294585 -3271109
17597 -3271109 -3300948 -3255408 -3334452 -3374602 -3303911 -3249845 -3290678 -3277925 -3251878 -3271462 -3256252
17586 -3256252 -3239744 -3229298 -3253670 -3256192 -3185556 -3145173 -3170653 -3084293 -3105387 -3171341 -3178799 -3219881
17574 -3219881 -3242651 -3221858 -3255912 -3261019 -3194217 -3242240 -3233956 -3150411 -3133152 -3144483 -3052839 -3038438
17562 -3038438 -3109862 -3129803 -3190267 -3153488 -3103091 -3097487 -3132612 -3181608 -3147247 -3057956 -3015666
17551 -3015666 -3036068 -3115731 -3077022 -3002001 -2979272 -2904525 -2927128 -3007612 -2991236 -3018936 -3089651
17540 -3089651 -3112536 -3087537 -2978741 -2933882 -2977317 -3050434 -3035598 -3042666 -3060106 -3014772 -2921539
17529 -2921539 -2873514 -2882935 -2936678 -2959374 -2948859 -2918790 -2852685 -2835200 -2910845 -2933295 -2887242
17518 -2887242 -2946580 -2988321 -2970252 -2984481 -2927140 -2796698 -2748279 -2776028 -2850767 -2925118 -2953422
17507 -2953422 -2947364 -2900036 -2913147 -2928149 -2918885 -2934392 -2958566 -2961005 -2986786 -2917173 -2899755 -2971889
17495 -2971889 -2955533 -2860772 -2801588 -2819499 -2921352 -2980621 -2976706 -2952163 -2869420 -2858669 -2927449
17484 -2927449 -2912639 -2912854 -2821403 -2773597 -2704822 -2691029 -2715824 -2752707 -2804365 -2897831 -2896540 -2753260
17472 -2753260 -2642577 -2666875 -2742641 -2811554 -2801330 -2844389 -2836603 -2869256 -2881060 -2888525 -2855983
17461 -2855983 -2816010 -2797143 -2803984 -2731781 -2771592 -2791442 -2784418 -2821817 -2748280 -2670152 -2635854 -2597565
17449 -2597565 -2528063 -2518414 -2515114 -2360332 -2203702 -2171546 -2383303 -2896406 -3284047 -3400626
17439 -3400626 -3306997 -3180583 -3171887 -3136595 -3073124 -3009094 -3023235 -3003979 -2963397 -2969021 -3000697
17428 -3000697 -2927670 -2833126 -2848888 -2835120 -2822570 -2832620 -2853303 -2803127 -2806783 -2750618 -2777416
17417 -2777416 -2841747 -2786647 -2706870 -2799254 -2794189 -2861107 -2892227 -2839589 -2878038 -2912423 -2889168
17406 -2889168 -2845109 -2827312 -2805655 -2698928 -2637510 -2619674 -2642900 -2678177 -2724420 -2702713 -2716534
17395 -2716534 -2673338 -2669064 -2645855 -2695845 -2709402 -2705081 -2771706 -2756194 -2648046 -2636818 -2694581
17384 -2694581 -2785306 -2711846 -2730845 -2737954 -2757179 -2711917 -2727343 -2727747 -2667385 -2589466 -2592356 -2635279
17372 -2635279 -2626701 -2679918 -2682702 -2765651 -2839430 -2829301 -2821160 -2811553 -2766696 -2679157 -2655040 -2629662
17360 -2629662 -2657541 -2580600 -2508683 -2512328 -2563564 -2605966 -2531395 -2477806 -2538659 -2560422 -2501269
17349 -2501269 -2472805 -2539587 -2593987 -2643749 -2656596 -2540669 -2545882 -2555088 -2591195 -2614520 -2657915
17338 -2657915 -2571859 -2558837 -2548396 -2584085 -2595674 -2614818 -2594491 -2592863 -2570068 -2586362 -2680698
17327 -2680698 -2690045 -2654609 -2642228 -2598551 -2568796 -2605463 -2586258 -2509075 -2471368 -2511450 -2555138
17316 -2555138 -2606547 -2626868 -2620457 -2611509 -2603626 -2583216 -2586464 -2494333 -2475823 -2458137 -2412793 -2364773
17304 -2364773 -2418842 -2448986 -2459763 -2444627 -2405742 -2396250 -2514399 -2555801 -2446857 -2436166 -2435056
17293 -2435056 -2439826 -2473007 -2413857 -2360796 -2386065 -2420229 -2399523 -2393341 -2439907 -2502600 -2520268 -2535338
17281 -2535338 -2565154 -2585524 -2560559 -2472704 -2500669 -2605307 -2514374 -2468504 -2439868 -2435765 -2436950
17270 -2436950 -2436179 -2418999 -2470002 -2491572 -2512299 -2479269 -2403767 -2356435 -2401021 -2420233 -2464290 -2537231
17258 -2537231 -2551077 -2520320 -2448999 -2341228 -2342434 -2389308 -2358265 -2290540 -2319279 -2374766 -2329478
17247 -2329478 -2304259 -2299003 -2345739 -2293948 -2323164 -2281887 -2251874 -2299620 -2307718 -2292947 -2327802 -2357229
17235 -2357229 -2302716 -2317953 -2300983 -2397411 -2411642 -2369577 -2354296 -2318902 -2243557 -2238528 -2290322
17224 -2290322 -2313458 -2319478 -2240118 -2222588 -2354933 -2443576 -2407574 -2344269 -2259775 -2248051 -2223556
17213 -2223556 -2256209 -2274581 -2244841 -2271100 -2326185 -2260785 -2217464 -2314555 -2358047 -2351517 -2313575
17202 -2313575 -2230645 -2196269 -2241089 -2271828 -2286651 -2343016 -2343272 -2328258 -2278498 -2273080 -2357613 -2407258
17190 -2407258 -2349542 -2277097 -2345975 -2362884 -2413633 -2404484 -2267530 -2233384 -2271702 -2328545 -2296489
17179 -2296489 -2270965 -2291559 -2316287 -2362949 -2359260 -2281357 -2307531 -2306694 -2286053 -2249638 -2231149 -2196038
17167 -2196038 -2299448 -2406391 -2412314 -2380574 -2333098 -2308197 -2322783 -2314963 -2218886 -2168789 -2095237
17156 -2095237 -2168976 -2209649 -2242121 -2237567 -2252916 -2259035 -2232198 -2207295 -2126675 -2079389 -2128463 -2103284
17144 -2103284 -2139863 -2140248 -2096874 -2131845 -2100293 -2067195 -2074561 -2074572 -2130342 -2162183 -2248903 -2213720
17132 -2213720 -2279669 -2232644 -2184289 -2136964 -2113810 -2126084 -2115123 -2147728 -2178453 -2213813 -2179599
17121 -2179599 -2221486 -2213498 -2152494 -2069035 -2057080 -2107978 -2221511 -2192061 -2092233 -2086229 -2114451
17110 -2114451 -2148196 -2169670 -2156517 -2159348 -2167526 -2145702 -2129440 -2139101 -2177797 -2206274 -2216791 -2272086
17098 -2272086 -2327632 -2258502 -2152613 -2147281 -2119927 -2159238 -2143552 -2167024 -2165448 -2101112 -2115316
17087 -2115316 -2159064 -2266725 -2251117 -2235808 -2242505 -2224833 -2216079 -2150563 -2137367 -2041040 -1926751
17076 -1926751 -1982725 -2096443 -2114045 -2125127 -2127718 -2138393 -2065541 -2044733 -2106033 -2142547 -2231051
17065 -2231051 -2173727 -2116649 -2129519 -2199645 -2241714 -2341316 -2325595 -2255785 -2153959 -2089508 -2078846
17054 -2078846 -2110902 -2157709 -2207557 -2102077 -1997563 -2028887 -2095259 -2069091 -2007910 -1954270 -1987053
17043 -1987053 -2059034 -2130061 -2192908 -2171758 -2147553 -2041698 -2069572 -2116836 -2067628 -2020964 -1994752
17032 -1994752 -2022768 -2064135 -2039879 -1991096 -1974492 -1961763 -2023967 -2088130 -2153365 -2197460 -2178570
17021 -2178570 -2152554 -2073640 -2074292 -2069895 -2049833 -2090882 -2028654 -1988815 -2003926 -2076004 -2111957 -2044140
17009 -2044140 -1940777 -1881053 -1934606 -1988948 -1987648 -1888121 -1917268 -1993066 -2020038 -2081297 -2032651
16998 -2032651 -2049584 -2101665 -2136283 -2158063 -2179855 -2139051 -2062296 -2022096 -2031542 -2112230 -2082482
16987 -2082482 -2065476 -2020549 -1958321 -1981748 -2060385 -1993442 -1940344 -1960798 -1925810 -1994408 -2054340
16976 -2054340 -2163020 -2207957 -2210794 -2142450 -2008737 -1932587 -1923065 -1931872 -2000021 -1955505 -1862882
16965 -1862882 -1879937 -1929483 -1901369 -1928603 -1938879 -1923300 -1902302 -1891224 -1832588 -1813060 -1930849
16954 -1930849 -2022569 -2034310 -2043897 -2023000 -1999171 -2003103 -2050434 -1987490 -1909199 -1891835 -1894856 -1928983
16942 -1928983 -1896011 -1900493 -1989350 -1983605 -1985076 -1986088 -1881299 -1882878 -1954992 -1993329 -1928380 -1892378
16930 -1892378 -1918155 -1960363 -1996123 -2000895 -1946249 -1930472 -1815652 -1730991 -1801747 -1864023 -1881246
16919 -1881246 -1846743 -1884146 -1953978 -1953891 -1917289 -1908845 -1884625 -1876914 -1835324 -1777042 -1838858 -1813746
16907 -1813746 -1858617 -1861035 -1932169 -1907561 -1893091 -1935662 -1930741 -1956478 -1965250 -1875486 -1859737 -1855176
16895 -1855176 -1861726 -1917936 -1986751 -1967050 -1883301 -1838866 -1805040 -1811481 -1816731 -1841120 -1900331 -1932977
16883 -1932977 -1953590 -1973960 -1909941 -1905576 -1957883 -1910425 -1801399 -1775721 -1746349 -1779113 -1763358
16872 -1763358 -1745120 -1809763 -1860340 -1829198 -1795689 -1854880 -1844046 -1816295 -1806407 -1943239 -1996975
16861 -1996975 -2026328 -1946601 -1858265 -1837295 -1853355 -1851750 -1848806 -1908414 -1833895 -1794421 -1884788 -1926042
16849 -1926042 -1990897 -1987370 -1923952 -1917766 -1899198 -1844204 -1845654 -1867034 -1845382 -1782405 -1814696 -1905184
16837 -1905184 -2014310 -2001831 -1919358 -1937664 -1900016 -1855933 -1872195 -1869994 -1896265 -1959006 -1956623
16826 -1956623 -1932031 -1897144 -1800200 -1773611 -1801177 -1853607 -1889961 -1887782 -1943166 -1943990 -1933261 -1892532
16814 -1892532 -1942526 -1896974 -1821448 -1841060 -1911790 -1934437 -1869424 -1847374 -1822035 -1849566 -1839957
16803 -1839957 -1813789 -1823772 -1778052 -1693402 -1781967 -1827988 -1832705 -1840873 -1812751 -1770544 -1862205 -1871238
16791 -1871238 -1911197 -1888444 -1907400 -1885492 -1796109 -1828623 -1865711 -1856916 -1800500 -1815362 -1925457
16780 -1925457 -1906664 -1856818 -1831299 -1859023 -1865608 -1861425 -1812376 -1804682 -1763083 -1817215 -1890086 -1871490
16768 -1871490 -1823488 -1792546 -1835465 -1828444 -1804854 -1840312 -1908428 -1915022 -1905066 -1946258 -1883681 -1845300
16756 -1845300 -1789150 -1817537 -1861554 -1875437 -1904752 -1865728 -1863815 -1920406 -1895406 -1833395 -1806185
16745 -1806185 -1778852 -1811503 -1835062 -1745534 -1711350 -1844483 -1843599 -1830083 -1712303 -1688694 -1781233
16734 -1781233 -1744325 -1709990 -1731379 -1737537 -1769344 -1748310 -1725434 -1762549 -1790378 -1771870 -1705593
16723 -1705593 -1663186 -1685657 -1661442 -1723176 -1772267 -1707377 -1714167 -1754290 -1709768 -1684311 -1671649
16712 -1671649 -1650905 -1672856 -1791856 -1756397 -1654543 -1654692 -1692684 -1662341 -1588473 -1640923 -1705631
16701 -1705631 -1688056 -1689477 -1733198 -1784740 -1805291 -1828806 -1775368 -1835083 -1875575 -1857532 -1873045
16690 -1873045 -1791135 -1762403 -1748985 -1687932 -1626048 -1563823 -1538489 -1609583 -1656092 -1679322 -1729625
16679 -1729625 -1722284 -1698748 -1714796 -1685373 -1715988 -1746772 -1795165 -1842803 -1799024 -1793769 -1704550 -1648706
16667 -1648706 -1602228 -1652811 -1688147 -1657217 -1674661 -1657603 -1667403 -1743642 -1757790 -1797812 -1869433
16656 -1869433 -1888753 -1750997 -1696715 -1661237 -1698541 -1688252 -1735063 -1732763 -1772635 -1748508 -1690470
16645 -1690470 -1664893 -1641290 -1618631 -1628089 -1628434 -1624218 -1617280 -1650478 -1683378 -1680750 -1633254 -1630052 -1628089
16632 -1628089 -1620104 -1710522 -1747307 -1776242 -1777908 -1675393 -1604299 -1617640 -1631457 -1693033 -1750946
16621 -1750946 -1793568 -1764486 -1731016 -1625589 -1668034 -1763013 -1723853 -1627577 -1646505 -1738625 -1677083
16610 -1677083 -1559908 -1462747 -1454431 -1515893 -1570955 -1561300 -1595946 -1657889 -1630990 -1648564 -1675682
16599 -1675682 -1609540 -1613360 -1614972 -1486985 -1448798 -1553017 -1548831 -1610010 -1709036 -1686912 -1704133
16588 -1704133 -1690929 -1674810 -1654564 -1729051 -1731374 -1731684 -1647389 -1618064 -1577087 -1539741 -1457847 -1448389
16576 -1448389 -1594989 -1619201 -1607909 -1608736 -1597980 -1589609 -1634232 -1645748 -1566530 -1521723 -1565390 -1598874
16564 -1598874 -1640875 -1731883 -1634555 -1605210 -1649428 -1575052 -1573706 -1584530 -1593976 -1566255 -1511195 -1549636
16552 -1549636 -1561250 -1547985 -1481306 -1473468 -1501382 -1615537 -1751755 -1774965 -1591621 -1460434 -1488366
16541 -1488366 -1555143 -1564752 -1562156 -1635137 -1719033 -1717674 -1651956 -1698647 -1746813 -1762320 -1731138 -1710603
16529 -1710603 -1659445 -1681278 -1664627 -1620824 -1624917 -1634910 -1614422 -1622382 -1642485 -1674252 -1740370 -1670619
16517 -1670619 -1558884 -1590563 -1678045 -1700288 -1734450 -1693060 -1676192 -1693094 -1720967 -1696701 -1695757
16506 -1695757 -1728323 -1567024 -1471804 -1466508 -1477027 -1472382 -1499151 -1532873 -1483750 -1438172 -1533180
16495 -1533180 -1612984 -1567728 -1598525 -1523232 -1490957 -1465216 -1414691 -1387167 -1462255 -1608066 -1580765
16484 -1580765 -1478513 -1398077 -1444496 -1529099 -1607941 -1639705 -1588398 -1571514 -1533564 -1508909 -1488129
16473 -1488129 -1504049 -1544550 -1588631 -1670814 -1687325 -1626106 -1643461 -1745021 -1688472 -1611380 -1538769
16462 -1538769 -1485444 -1447352 -1451901 -1453555 -1534826 -1651376 -1712018 -1651516 -1652709 -1627911 -1533304 -1488350
16450 -1488350 -1562685 -1585439 -1531513 -1599955 -1563530 -1514300 -1556875 -1616410 -1591207 -1638915 -1656976
16439 -1656976 -1662144 -1660321 -1648175 -1616627 -1598695 -1526586 -1474342 -1460160 -1532649 -1576831 -1606528 -1547778
16427 -1547778 -1545132 -1583402 -1557515 -1512235 -1470141 -1543505 -1570939 -1514190 -1456195 -1501441 -1474977
16416 -1474977 -1465126 -1424415 -1435290 -1484749 -1522951 -1538408 -1532582 -1502227 -1517994 -1570920 -1547669 -1480797
16404 -1480797 -1504880 -1528867 -1572666 -1652603 -1618602 -1609307 -1628861 -1616607 -1554688 -1487575 -1500388
16393 -1500388 -1523243 -1441330 -1334145 -1439210 -1535135 -1555804 -1555175 -1557022 -1498385 -1375253 -1459647
16382 -1459647 -1426860 -1359424 -1335096 -1420098 -1447967 -1472810 -1569220 -1491167 -1427641 -1376993 -1421381
16371 -1421381 -1542557 -1617112 -1615030 -1598116 -1646680 -1655674 -1640565 -1613938 -1597670 -1543444 -1545903 -1515799
16359 -1515799 -1477244 -1526388 -1488883 -1518967 -1529375 -1524780 -1533603 -1595910 -1607472 -1585206 -1575289 -1579859
16347 -1579859 -1527956 -1487684 -1402051 -1375838 -1417582 -1405322 -1393293 -1471614 -1406977 -1364365 -1364891 -1371651
16335 -1371651 -1462012 -1503711 -1470964 -1468326 -1502767 -1491299 -1552267 -1578620 -1508199 -1492402 -1494112 -1485995
16323 -1485995 -1419121 -1389016 -1384807 -1370077 -1458090 -1504596 -1564679 -1566467 -1557765 -1551497 -1580456 -1533334
16311 -1533334 -1516961 -1526954 -1543741 -1487883 -1463510 -1490328 -1485554 -1472775 -1469628 -1469323 -1475546 -1387855
16299 -1387855 -1260338 -1319270 -1362758 -1496986 -1539783 -1535214 -1455965 -1469884 -1481153 -1466336 -1508005
16288 -1508005 -1475723 -1414232 -1365196 -1296839 -1341351 -1353487 -1331869 -1273765 -1319855 -1349143 -1362029
16277 -1362029 -1415045 -1400677 -1428815 -1471034 -1496415 -1415099 -1443511 -1500666 -1554597 -1564706 -1495540
16266 -1495540 -1453910 -1423717 -1437098 -1389330 -1366684 -1332822 -1348734 -1387199 -1465539 -1438175 -1401186
16255 -1401186 -1471867 -1479653 -1455254 -1540199 -1595982 -1577834 -1551432 -1476061 -1461235 -1456888 -1467837 -1378523
16243 -1378523 -1313679 -1332762 -1332288 -1323441 -1366861 -1378420 -1302491 -1383872 -1442763 -1435532 -1438649 -1424855
16231 -1424855 -1463322 -1486119 -1520368 -1540177 -1447352 -1365941 -1362315 -1440434 -1535229 -1507860 -1494829
16220 -1494829 -1526399 -1520219 -1537282 -1446281 -1412154 -1418282 -1450960 -1508130 -1489370 -1457294 -1455050 -1392027
16208 -1392027 -1443342 -1552078 -1526755 -1430196 -1402662 -1495730 -1381124 -1298288 -1324838 -1427344 -1471811
16197 -1471811 -1495038 -1556967 -1523484 -1572880 -1566362 -1507637 -1390174 -1328723 -1361437 -1318550 -1274495
16186 -1274495 -1280753 -1292759 -1264372 -1348383 -1383754 -1456332 -1395413 -1277361 -1261938 -1275693 -1319265
16175 -1319265 -1351209 -1339676 -1338561 -1312285 -1382866 -1425392 -1314970 -1266222 -1303213 -1387927 -1362827
16164 -1362827 -1322113 -1371172 -1336820 -1276840 -1305605 -1426419 -1458248 -1352568 -1275762 -1222766 -1183652
16153 -1183652 -1264824 -1294919 -1343148 -1388534 -1272063 -1360825 -1423945 -1437435 -1428433 -1466125 -1374621
16142 -1374621 -1246966 -1326877 -1396040 -1391844 -1343758 -1403853 -1363509 -1306686 -1269974 -1319619 -1334676
16131 -1334676 -1313015 -1310024 -1272993 -1254869 -1302809 -1377859 -1403397 -1352770 -1391552 -1440510 -1419596
16120 -1419596 -1428189 -1324055 -1284189 -1341739 -1392789 -1338721 -1252191 -1215078 -1202765 -1237820 -1254232
16109 -1254232 -1221592 -1276566 -1349750 -1422953 -1486921 -1444514 -1446715 -1409454 -1359033 -1328543 -1341708
16098 -1341708 -1292289 -1308190 -1248880 -1153863 -1213516 -1253729 -1274443 -1296514 -1356964 -1383956 -1327664
16087 -1327664 -1304055 -1318694 -1346294 -1335361 -1344808 -1305634 -1269176 -1309072 -1269101 -1267308 -1258036 -1274274
16075 -1274274 -1321459 -1281033 -1227306 -1264795 -1299305 -1385462 -1378871 -1291256 -1282671 -1276129 -1245595 -1204607
16063 -1204607 -1209714 -1205792 -1221216 -1201204 -1181927 -1184858 -1168480 -1181342 -1196000 -1253595 -1236495 -1302398
16051 -1302398 -1293787 -1252469 -1365398 -1416667 -1437585 -1441190 -1399769 -1296148 -1313373 -1397316 -1425016
16040 -1425016 -1430960 -1416540 -1383794 -1355642 -1368109 -1347280 -1350834 -1346766 -1360740 -1354546 -1335947 -1290309
16028 -1290309 -1228804 -1235049 -1347066 -1347036 -1275906 -1270735 -1237552 -1269903 -1290484 -1328088 -1284440 -1221534
16016 -1221534 -1190016 -1263680 -1260818 -1270120 -1380026 -1377624 -1400963 -1365717 -1296558 -1249699 -1235716 -1218417
16004 -1218417 -1283595 -1300615 -1253107 -1255809 -1272851 -1359170 -1351311 -1336086 -1303461 -1294043 -1270511 -1336875
15992 -1336875 -1314971 -1274219 -1250131 -1297075 -1331990 -1265566 -1180110 -1159762 -1233155 -1220895 -1167125
15981 -1167125 -1208165 -1211252 -1272805 -1211133 -1200326 -1288259 -1325818 -1311497 -1359993 -1388993 -1393839 -1355754
15969 -1355754 -1258215 -1266641 -1346753 -1355059 -1319908 -1322870 -1287893 -1289943 -1260929 -1250176 -1226033 -1200777
15957 -1200777 -1141775 -1209589 -1142768 -1158956 -1256030 -1349835 -1245776 -1185412 -1182621 -1239357 -1249341
15946 -1249341 -1235889 -1244140 -1230678 -1247834 -1242904 -1211061 -1172702 -1211892 -1309945 -1297010 -1134494
15935 -1134494 -1102461 -1175421 -1192016 -1220643 -1294420 -1352961 -1284492 -1234529 -1310113 -1326271 -1271465
15924 -1271465 -1231322 -1210224 -1163933 -1165181 -1170067 -1114761 -1192381 -1233048 -1215898 -1250421 -1280873 -1220813
15912 -1220813 -1188039 -1181895 -1138961 -1186129 -1259003 -1296824 -1323909 -1354239 -1334732 -1300443 -1280752
15901 -1280752 -1272428 -1298781 -1384298 -1391575 -1307771 -1305398 -1309414 -1283682 -1270559 -1238733 -1214884 -1242247
15889 -1242247 -1252005 -1223322 -1163476 -1194232 -1238720 -1218002 -1240016 -1270921 -1282065 -1300969 -1348317
15878 -1348317 -1299310 -1245833 -1241542 -1215909 -1204964 -1233349 -1260410 -1318610 -1370477 -1275078 -1295338
15867 -1295338 -1329265 -1293927 -1241451 -1246186 -1209825 -1242509 -1342279 -1335054 -1287734 -1264177 -1242145 -1196345
15855 -1196345 -1212070 -1295352 -1271240 -1168643 -1102061 -1085700 -1148482 -1192753 -1204981 -1187454 -1215292
15844 -1215292 -1239474 -1277323 -1216391 -1126490 -1101003 -1142005 -1165916 -1157898 -1128891 -1108168 -1155916
15833 -1155916 -1231636 -1270717 -1306972 -1249689 -1225120 -1223626 -1256489 -1252808 -1258001 -1175926 -1178604 -1258849
15821 -1258849 -1247084 -1262294 -1272408 -1239416 -1262102 -1295309 -1292605 -1185975 -1098735 -1123986 -1221453
15810 -1221453 -1240567 -1233184 -1227413 -1225090 -1275886 -1254267 -1238075 -1287818 -1168552 -1141517 -1133133 -1169715
15798 -1169715 -1214420 -1289071 -1268349 -1130421 -1119850 -1182339 -1214792 -1205679 -1221907 -1155737 -1150517
15787 -1150517 -1174875 -1176628 -1233427 -1225777 -1246866 -1233028 -1125988 -1054954 -1131558 -1152822 -1160585 -1152428
15775 -1152428 -1134593 -1153746 -1149899 -1122002 -1171441 -1238922 -1250052 -1258902 -1267473 -1251747 -1199996 -1190251
15763 -1190251 -1269882 -1308916 -1230086 -1318891 -1371602 -1319550 -1346765 -1344645 -1223662 -1093109 -1133158
15752 -1133158 -1236929 -1232477 -1244049 -1248839 -1247809 -1193462 -1205678 -1275770 -1241656 -1187387 -1256384 -1285533
15740 -1285533 -1339818 -1291363 -1299887 -1324670 -1260644 -1223403 -1224932 -1176598 -1098290 -1163626 -1183813 -1097502
15728 -1097502 -1109036 -1209935 -1231365 -1246168 -1323333 -1364660 -1300239 -1275065 -1295155 -1259961 -1193707
15717 -1193707 -1157924 -1157581 -1167106 -1146064 -1071240 -1117956 -1217959 -1345572 -1327392 -1314682 -1255025
15706 -1255025 -1173717 -1103391 -1138118 -1140005 -1185504 -1149409 -1116725 -1113872 -1201708 -1240452 -1172225 -1179207
15694 -1179207 -1197661 -1184036 -1126718 -1036363 -1095121 -1145494 -1099475 -1076265 -1110088 -1079495 -1060415
15683 -1060415 -1108188 -1115051 -1080269 -1062148 -1040688 -1082459 -1126979 -1160300 -1119236 -1084172 -1131463
15672 -1131463 -1248239 -1300623 -1251749 -1212182 -1152585 -1142364 -1111962 -1147972 -1155726 -1144298 -1134342
15661 -1134342 -1135712 -1169427 -1148190 -1075313 -1150567 -1138357 -1126713 -1058352 -1067337 -1187103 -1223386
15650 -1223386 -1254711 -1180307 -1116436 -1137566 -1240322 -1202705 -1167098 -1183595 -1183983 -1190780 -1237460 -1300892
15638 -1300892 -1308015 -1283593 -1248507 -1207139 -1193348 -1101319 -1113442 -1141384 -1154028 -1134394 -1164586
15627 -1164586 -1195444 -1214568 -1151739 -1132003 -1187879 -1248140 -1265355 -1262287 -1249114 -1193281 -1106252
15616 -1106252 -1070009 -1138538 -1172060 -1217781 -1317850 -1287759 -1221000 -1232427 -1213106 -1166686 -1173296
15605 -1173296 -1192562 -1148274 -1083421 -1071629 -1087113 -1031492 -976075 -1031896 -1124993 -1051424 -943814
15594 -943814 -974782 -1104397 -1128720 -1128509 -1134467 -1116939 -1164843 -1202261 -1178389 -1162377 -1106671 -1078362
15582 -1078362 -1047190 -1068467 -1100449 -1151395 -1156188 -1190054 -1148098 -1101705 -1069808 -1165176 -1265675
15571 -1265675 -1311120 -1146404 -1091621 -1088059 -1096981 -1120983 -1156958 -1251502 -1165855 -1133971 -1163972
15560 -1163972 -1204560 -1182606 -1136419 -1088955 -1059352 -1074623 -1071766 -1106468 -1191869 -1246320 -1275719
15549 -1275719 -1168876 -1042155 -1023980 -1012518 -1089783 -1144053 -1118225 -1052443 -1013646 -1036667 -931922
15538 -931922 -930855 -1043416 -1200371 -1244140 -1211259 -1213265 -1209433 -1174871 -1222023 -1284801 -1246978 -1163733
15526 -1163733 -1102333 -1101972 -1064858 -1149219 -1248146 -1175637 -1043702 -1068416 -1114636 -1083315 -1068193
15515 -1068193 -1020550 -1025088 -1040348 -1032010 -1075049 -1154382 -1098945 -1089373 -1115709 -1118795 -1159078 -1178287
15503 -1178287 -1214929 -1198926 -1128333 -1094963 -1090591 -1074365 -1102461 -1096973 -1045101 -1048775 -1025553 -1009432
15491 -1009432 -1028413 -1044194 -996508 -998709 -1117448 -1189830 -1131039 -1144151 -1062689 -1012355 -953530
15480 -953530 -969229 -1059568 -1108590 -1045946 -1050927 -1107429 -1104816 -1120996 -1104715 -1120544 -1141195 -1129374
15468 -1129374 -1166859 -1217281 -1192431 -1252588 -1251729 -1124661 -1153968 -1079023 -1025806 -1086995 -1116745
15457 -1116745 -1063550 -1098385 -1111025 -1053001 -983551 -988033 -1011525 -1036331 -1024687 -1069092 -1055898
15446 -1055898 -1114566 -1189821 -1154164 -1073705 -1084346 -1092173 -1104734 -1075945 -1037952 -970290 -987034
15435 -987034 -1034976 -1056504 -1094646 -1136758 -1132313 -1160809 -1121849 -1039909 -1059718 -1004565 -1037418 -1100957
15423 -1100957 -1083432 -1060155 -1042652 -1018427 -1027653 -1088569 -998012 -900223 -939444 -1033070 -1030519 -1082440
15411 -1082440 -1133457 -1096808 -1069040 -1014721 -985034 -1042513 -1143382 -1185704 -1267109 -1216270 -1116875
15400 -1116875 -1023100 -1018000 -1044653 -1070193 -1036551 -941453 -986964 -1096584 -1129240 -1158061 -1134494
15389 -1134494 -1067251 -987873 -1002570 -1109864 -1142055 -1082685 -1045608 -1055163 -1086941 -1124994 -1066207
15378 -1066207 -1021103 -1133011 -1075405 -1063701 -1036923 -1022143 -1055626 -1039503 -1085294 -1146905 -1119578
15367 -1119578 -1099311 -1065327 -1079734 -1125228 -1124468 -1095566 -982089 -972098 -1007671 -1070479 -1046892 -1018040
15355 -1018040 -1071830 -1076633 -1089439 -1063728 -1047311 -1098347 -1140010 -1101641 -1037471 -1008851 -1007887 -993159
15343 -993159 -1022516 -1035869 -1027835 -1034254 -1129398 -1054937 -993132 -1025290 -990194 -888558 -888335 -953029
15331 -953029 -1010519 -1030697 -994168 -994549 -1013420 -1011721 -1067120 -1070556 -1096843 -1086017 -994968 -984845
15319 -984845 -1023968 -1043905 -965165 -867758 -838549 -932480 -1035647 -1111730 -1134519 -1064827 -987214
15308 -987214 -936303 -913000 -958321 -1021984 -1055897 -1207504 -1163005 -1060448 -1150428 -1166270 -1099971
15297 -1099971 -1003308 -918259 -975996 -985904 -959721 -927746 -963906 -987499 -986606 -991868 -1041678 -1118063
15285 -1118063 -1149153 -1073807 -1008084 -888613 -931212 -1041417 -1039164 -1017196 -1023868 -1060458 -1058774
15274 -1058774 -1074761 -1064271 -1072397 -1056974 -1091354 -1059155 -979407 -1040743 -1090312 -1078954 -1069766 -1140690
15262 -1140690 -1145026 -1118714 -1082018 -1085263 -1032001 -935835 -954495 -1041575 -1039423 -1054382 -1084516 -1113751
15250 -1113751 -1112005 -1078769 -1057765 -1062896 -1035833 -1032777 -1053809 -1005926 -997753 -1026045 -1026772 -956302
15238 -956302 -953417 -923296 -940747 -960491 -945866 -909687 -971125 -1041736 -1061135 -1117188 -1147487 -1169520
15226 -1169520 -1182783 -1106519 -1065337 -1142732 -1155352 -1091157 -1015783 -1044762 -1051069 -1010784 -1067210
15215 -1067210 -1097432 -1107778 -1139022 -1118273 -1063097 -1053007 -1050757 -1049032 -1069517 -1113158 -1072035 -1071886
15203 -1071886 -1114155 -1136036 -1049305 -1015283 -1077970 -1043790 -1099455 -1075122 -1049161 -895992 -891400
15192 -891400 -1004331 -1055094 -975021 -915943 -888949 -935693 -952741 -898272 -841079 -849397 -862969
15181 -862969 -897854 -911603 -835840 -860902 -937423 -940632 -871801 -832851 -864756 -879191 -902933 -960073
15169 -960073 -938540 -903239 -822728 -863429 -985659 -1053936 -1060184 -1121256 -1063582 -1048855 -1075770
15158 -1075770 -1103320 -1048255 -1118274 -1132188 -1100689 -1076260 -1025800 -911014 -931056 -1006968 -984084
15147 -984084 -977118 -1023375 -1021353 -1062637 -1084479 -1045184 -1045716 -1048019 -1054176 -986523 -964411 -1030571 -1097176
15134 -1097176 -1085151 -1034344 -1027554 -1090768 -1086926 -1016266 -994121 -954041 -917210 -921644 -953500 -908360
15122 -908360 -943416 -1025901 -1056809 -1094383 -1126762 -1086300 -1004264 -983557 -907395 -875939 -855563
15111 -855563 -919901 -946043 -827488 -865845 -923402 -989983 -1057797 -1064278 -1044608 -978628 -966422
15100 -966422 -1013436 -971655 -949426 -900695 -963680 -974178 -962958 -977521 -1004691 -1030057 -975552
15089 -975552 -863967 -759850 -733937 -701650 -833631 -900502 -970252 -1061705 -1017947 -913312 -918370
15078 -918370 -930245 -940996 -984720 -1004404 -1043818 -1039389 -1024188 -1082943 -987566 -929515 -902446 -977092
15066 -977092 -1041082 -1042560 -1120077 -1124633 -1077546 -1029159 -1019740 -1059637 -1013695 -1002351 -1064254 -1009477
15054 -1009477 -1062428 -987715 -957851 -1002281 -1008108 -993967 -1001115 -990285 -997588 -1030369 -1053596 -1082559
15042 -1082559 -1080721 -1069269 -991708 -1022011 -974609 -908352 -926403 -906880 -951295 -1035605 -1043725 -1101972
15030 -1101972 -1149646 -1061685 -939629 -809558 -861294 -1027334 -1115965 -1149423 -1093764 -1110318 -1024091
15019 -1024091 -991800 -1009338 -979265 -1007137 -980171 -984374 -900413 -798918 -927167 -925321 -879217
15008 -879217 -876436 -921106 -965105 -1036488 -1008474 -1006485 -991295 -976132 -995653 -1021545 -969652 -902428
14996 -902428 -893505 -992972 -1079117 -1048376 -1087693 -1044093 -997752 -994930 -1018020 -991027 -1043273 -1009117
14984 -1009117 -996214 -980983 -1005583 -1060319 -1068697 -1034070 -1011719 -935290 -812920 -808165 -822043
14973 -822043 -847227 -845173 -833388 -962262 -987784 -973083 -950065 -929113 -913432 -941750 -970217
14962 -970217 -926661 -877811 -886660 -876093 -865638 -874363 -894008 -945567 -972569 -1034936 -990648 -944243
14950 -944243 -923293 -1019894 -1076428 -1075242 -893561 -839996 -858534 -906434 -922284 -917961 -969766 -1063192
14938 -1063192 -1131158 -1113339 -1048901 -947479 -862571 -809150 -876040 -888582 -877975 -871211 -897100
14927 -897100 -1011772 -1013897 -933011 -908342 -964861 -997774 -900660 -841193 -872349 -951009 -981935
14916 -981935 -926069 -980559 -1075611 -1058944 -1023178 -1059937 -1046622 -946403 -1001388 -1101692 -1147599
14905 -1147599 -1024895 -1004059 -1027067 -944099 -831770 -756604 -781986 -815355 -867816 -888265 -889185
14894 -889185 -857866 -842495 -862421 -842434 -886881 -914522 -921304 -893035 -928858 -1010013 -897297
14883 -897297 -943125 -976110 -927505 -917287 -890530 -845512 -889190 -950818 -1024132 -1039009 -997247
14872 -997247 -979610 -968230 -928081 -937885 -985306 -978486 -929336 -801682 -824145 -977602 -1023989
14861 -1023989 -1012304 -922795 -936773 -965628 -905771 -916377 -1015649 -1074281 -1047044 -1005390 -992078
14850 -992078 -889197 -880247 -918085 -937077 -843296 -843828 -938318 -1035387 -1104423 -1114025 -1077561 -1004861
14838 -1004861 -965307 -952439 -931495 -956513 -981867 -1071573 -1123300 -1046027 -1011177 -979374 -927959
14827 -927959 -907567 -887745 -832303 -876368 -913408 -937479 -881423 -916200 -970492 -996830 -981695
14816 -981695 -924723 -915851 -965715 -994269 -993345 -981280 -949378 -875830 -891331 -964691 -1072962 -957583
14804 -957583 -921996 -978364 -988807 -955283 -1050239 -1106899 -1070561 -1033625 -984822 -955225 -953760 -996059
14792 -996059 -1007122 -1082704 -1091002 -1034090 -977158 -940654 -945998 -994152 -985714 -902819 -864296 -855771
14780 -855771 -950096 -983651 -1025454 -995202 -919038 -937083 -918000 -902604 -858643 -818081 -891468
14769 -891468 -941116 -924441 -959970 -948958 -922479 -939845 -966565 -958043 -946878 -947658 -1001239 -1011072
14757 -1011072 -998956 -964876 -954154 -930200 -978419 -1069797 -995917 -940533 -911104 -994870 -976669
14746 -976669 -981639 -935526 -840980 -878233 -845062 -899471 -954891 -1055071 -1000641 -975176 -982238 -891726
14734 -891726 -837068 -894280 -937541 -979280 -969972 -831810 -776335 -797633 -880322 -912130 -908915 -870770
14722 -870770 -838319 -820911 -792190 -740305 -720211 -761411 -752500 -798629 -896430 -934993 -942594 -963732
14710 -963732 -1017099 -952386 -936492 -975561 -1012768 -990031 -927023 -933733 -996046 -931218 -881717 -872292
14698 -872292 -854522 -929883 -929361 -864620 -935578 -926443 -908932 -921745 -1041715 -1141467 -1104249 -983275
14686 -983275 -967363 -962075 -904951 -971146 -920429 -858943 -923873 -943965 -946770 -941751 -808870 -782552
14674 -782552 -819514 -842461 -921462 -935839 -974057 -975016 -994424 -945330 -866831 -884584 -888877 -859056
14662 -859056 -917954 -956814 -940099 -915917 -906619 -940428 -898109 -849837 -873558 -998389 -999744 -1018421
14650 -1018421 -1052025 -998967 -936522 -906115 -883512 -894682 -894836 -810760 -683587 -706727 -818223
14639 -818223 -863362 -889920 -883711 -892160 -897188 -900960 -885233 -855363 -811816 -804008 -823066 -828438 -815781
14626 -815781 -835539 -913959 -906300 -825041 -805209 -861593 -838221 -821146 -810522 -811136 -842880 -872557
14614 -872557 -851668 -875607 -848360 -726963 -693442 -713918 -783554 -824439 -863381 -895197 -926858
14603 -926858 -880121 -924449 -901197 -886694 -908377 -900081 -980353 -947006 -960693 -1025909 -995857 -987553
14591 -987553 -944333 -879637 -858436 -854198 -813967 -788297 -799694 -828497 -792412 -815622 -769036 -724174
14579 -724174 -734682 -713477 -722666 -799817 -776739 -778384 -862736 -914373 -873985 -842542 -831090 -820901
14567 -820901 -815446 -818094 -841450 -948369 -1085015 -1030318 -904562 -814548 -837768 -896098 -877845
14556 -877845 -804507 -825933 -865148 -787267 -740850 -789325 -835998 -806708 -684410 -714260 -743374
14545 -743374 -811275 -888684 -931569 -968029 -904922 -827130 -852034 -896123 -921775 -935578 -985550
14534 -985550 -953613 -915846 -840529 -812386 -826379 -848931 -892227 -812846 -729253 -749625 -829958
14523 -829958 -840494 -829773 -755433 -787623 -864068 -866967 -840623 -944579 -985535 -987041 -906934 -809028
14511 -809028 -819046 -930781 -998109 -958159 -878656 -753190 -777591 -786173 -774456 -800225 -785336
14500 -785336 -788924 -832978 -886996 -979881 -1063982 -1068739 -991257 -1041197 -992836 -963323 -971813 -877656
14488 -877656 -862459 -922972 -880887 -793919 -811130 -782974 -719995 -677199 -699570 -823110 -792505
14477 -792505 -773121 -759212 -735663 -824357 -865744 -844665 -793430 -815338 -832587 -863482 -886819
14466 -886819 -805356 -798027 -925748 -921905 -884963 -926147 -918435 -924462 -953014 -896833 -861864 -811167
14454 -811167 -779132 -827559 -905652 -993683 -920905 -830629 -805869 -888983 -924505 -863258 -777270
14443 -777270 -735140 -692752 -730779 -733017 -681135 -636037 -727805 -767687 -750155 -771620 -847775 -818573
14431 -818573 -780498 -762073 -698136 -649037 -774623 -855255 -869229 -804977 -790339 -843507 -876387
14420 -876387 -848425 -829750 -854879 -856514 -808731 -814434 -921022 -870850 -797858 -805108 -780092 -716021
14408 -716021 -716653 -820503 -823965 -871687 -933776 -904998 -872781 -780567 -734975 -773693 -830276 -911714
14396 -911714 -978387 -963452 -903043 -855388 -765139 -773166 -755323 -814969 -838923 -852782 -903991 -851756
14384 -851756 -726579 -741134 -753041 -823925 -906804 -877406 -847434 -759438 -790819 -975685 -1021365
14373 -1021365 -1011762 -1010894 -939872 -951158 -921712 -931227 -907253 -875018 -893859 -810165 -756572 -764252
14361 -764252 -803783 -881465 -897591 -903932 -897298 -833898 -832977 -872784 -886876 -860298 -894450 -896711
14349 -896711 -848515 -878784 -888012 -864733 -860040 -869846 -849022 -847232 -845451 -886526 -917900 -957427
14337 -957427 -911369 -876037 -882702 -829609 -757582 -784418 -719828 -700472 -790976 -748249 -757243 -769978
14325 -769978 -817435 -806321 -673689 -661407 -677977 -687176 -701038 -685706 -693827 -723332 -726168 -729783
14313 -729783 -725504 -741708 -763947 -791699 -801872 -804486 -826381 -808742 -724619 -721786 -712497 -669318
14301 -669318 -685516 -795483 -828218 -799456 -899559 -915802 -862267 -890632 -877633 -836265 -821748
14290 -821748 -840277 -783774 -765888 -861727 -854721 -838223 -841137 -826835 -900429 -895723 -914641 -857092
14278 -857092 -827308 -777214 -821125 -876574 -844845 -883977 -895015 -804493 -740519 -755182 -774535
14267 -774535 -758450 -715469 -792492 -781325 -838865 -798357 -717800 -758869 -726094 -680615 -684088 -678778
14255 -678778 -705211 -737414 -812995 -842689 -795468 -779117 -863359 -947510 -901177 -888481 -879576 -738041
14243 -738041 -692920 -797664 -811275 -792498 -813971 -776901 -771048 -841603 -920471 -853010 -795945
14232 -795945 -792556 -763797 -795777 -772680 -732812 -741067 -759341 -756123 -672948 -572548 -690508 -819845
14220 -819845 -833280 -787426 -727440 -647182 -659484 -746157 -834321 -847496 -767185 -782222 -853161
14209 -853161 -931434 -953145 -930164 -858076 -852765 -868840 -905536 -825730 -762795 -746979 -797138 -818035
14197 -818035 -844894 -795171 -784306 -820473 -773302 -747401 -795522 -811971 -793792 -815693 -771085
14186 -771085 -697543 -742818 -856750 -896509 -936177 -892529 -881160 -859664 -849059 -892755 -974539
14175 -974539 -1016081 -978635 -922458 -935398 -880204 -779787 -723775 -735026 -850460 -863577 -827541
14164 -827541 -908424 -893627 -915061 -892717 -888299 -911051 -936271 -940150 -921350 -850663 -853186 -921160
14152 -921160 -930842 -818536 -818379 -799918 -817849 -776031 -713192 -761475 -886051 -917276 -830618 -828991
14140 -828991 -842237 -839486 -792178 -812199 -815255 -813581 -862113 -856925 -848156 -885467 -881478 -825828 -841244
14127 -841244 -855830 -841134 -696753 -640774 -684094 -716708 -777017 -794060 -819546 -885131 -842997
14116 -842997 -839545 -862155 -828642 -851238 -810033 -820760 -822665 -838845 -915551 -874887 -778608 -774045
14104 -774045 -807709 -799410 -802403 -923265 -900206 -842694 -825383 -811613 -849104 -748637 -753900 -773689
14092 -773689 -796075 -793351 -799303 -795431 -776100 -772916 -722108 -747752 -776985 -789390 -758949 -746123
14080 -746123 -712602 -712786 -723916 -812744 -855904 -818034 -776156 -711757 -793685 -909799 -918148 -888643
14068 -888643 -795019 -688656 -685520 -783068 -857158 -846948 -840756 -842168 -765807 -748623 -801123 -821028
14056 -821028 -775739 -778360 -725020 -760375 -867614 -883625 -919200 -877015 -868804 -871492 -800300 -790639
14044 -790639 -803510 -726306 -667279 -704041 -860065 -981983 -915867 -807045 -776639 -779448 -755287
14033 -755287 -823630 -823024 -764121 -641906 -668502 -755070 -792565 -803323 -753008 -735174 -726898 -712612
14021 -712612 -643079 -692552 -778660 -834405 -815061 -815335 -728701 -786257 -743240 -660775 -636982 -690088
14009 -690088 -771579 -767581 -687778 -642460 -654924 -745893 -666589 -705075 -760634 -830706 -863509 -783045
13997 -783045 -803745 -865189 -848029 -843700 -904392 -912500 -873655 -816757 -740430 -832213 -940212 -1018649
13985 -1018649 -980812 -854150 -812517 -855997 -907210 -904540 -847070 -790428 -841220 -858292 -764269
13974 -764269 -693732 -720476 -728943 -770970 -798037 -761127 -697059 -768378 -765912 -762755 -762929 -705355
13962 -705355 -646427 -628270 -668254 -693999 -637216 -656005 -729692 -709419 -744751 -738053 -711368 -735629
13950 -735629 -750583 -715311 -765655 -791177 -823601 -771503 -739420 -796791 -805850 -781742 -679370
13939 -679370 -730879 -776312 -693315 -695735 -679032 -617924 -623757 -683109 -732180 -742299 -744246 -776437
13927 -776437 -788005 -790796 -734828 -657647 -669247 -743519 -824942 -801432 -751141 -694362 -768314 -775158
13915 -775158 -740648 -762628 -825882 -837279 -781513 -737742 -731720 -753294 -781934 -731427 -647067 -571799
13903 -571799 -625349 -713684 -694131 -676542 -664014 -717813 -709107 -730668 -741317 -785547 -690203 -647684
13891 -647684 -701962 -739631 -824796 -847862 -790918 -754139 -721368 -664859 -743996 -708719 -670878
13880 -670878 -678855 -735804 -810201 -787850 -695489 -697781 -756672 -830446 -846663 -808781 -813232 -839719
13868 -839719 -859778 -788752 -730266 -847298 -814964 -744144 -715252 -648635 -660066 -676238 -760967
13857 -760967 -777913 -799788 -751533 -678789 -574068 -593251 -662353 -684217 -759857 -818569 -798656
13846 -798656 -777348 -741139 -703585 -703595 -782041 -776733 -687758 -776031 -796543 -778619 -790414 -822598
13834 -822598 -872316 -839777 -761958 -796174 -761707 -653761 -665184 -758780 -772072 -732246 -710787
13823 -710787 -700723 -711464 -707863 -738680 -722099 -657275 -687246 -713041 -671371 -703281 -767308 -796374
13811 -796374 -846095 -827168 -844894 -828811 -826252 -811121 -844045 -829975 -727953 -733173 -774169 -822454
13799 -822454 -860147 -896795 -904401 -846777 -829836 -801888 -809362 -780148 -795163 -774298 -763456 -727403
13787 -727403 -657280 -647876 -723565 -801030 -848602 -760622 -711991 -717688 -807884 -899525 -940742 -894678
13775 -894678 -795447 -785716 -788437 -804818 -834076 -764924 -686435 -716729 -759216 -769814 -838158 -816948
13763 -816948 -766421 -740057 -704962 -692119 -699439 -711992 -768668 -791420 -782031 -803515 -753965 -735873
13751 -735873 -822397 -796841 -695988 -688957 -669367 -610755 -610450 -630240 -643129 -681532 -664446 -684697
13739 -684697 -726697 -791693 -811862 -840080 -871598 -784266 -719901 -737647 -689777 -720954 -737331
13728 -737331 -724119 -736208 -795305 -819799 -742277 -677619 -672765 -672625 -652134 -653298 -738965 -782039
13716 -782039 -733903 -751550 -747973 -743964 -772578 -793997 -698375 -637418 -646197 -769946 -814411 -764618
13704 -764618 -718747 -773790 -792804 -709829 -693450 -803877 -811097 -820459 -844532 -826581 -839956 -754219
13692 -754219 -711107 -731075 -755044 -743761 -748567 -724739 -703382 -731584 -756741 -690609 -722877 -799773
13680 -799773 -786649 -720569 -689708 -690509 -672778 -617358 -611138 -597302 -565953 -599332 -684598 -688875
13668 -688875 -753601 -764360 -769694 -756432 -717033 -686776 -713801 -699426 -661880 -643403 -746329
13657 -746329 -818592 -749068 -764264 -716047 -653236 -664844 -707098 -777248 -711823 -733137 -763911
13646 -763911 -713135 -647249 -675881 -636483 -640108 -659080 -726709 -805472 -780125 -818351 -759225 -596457
13634 -596457 -561038 -598696 -658033 -621493 -607375 -645091 -656533 -574190 -613545 -636174 -680796
13623 -680796 -718521 -744264 -668276 -657253 -633229 -682364 -703871 -737508 -773978 -822707 -810028
13612 -810028 -779830 -744424 -689528 -750686 -817017 -806255 -708368 -657463 -557041 -480116 -564787
13601 -564787 -633343 -628280 -620571 -671182 -618505 -590590 -647536 -707794 -644026 -628948 -703637 -688782
13589 -688782 -712155 -711547 -690843 -760426 -795394 -781718 -825149 -811536 -736560 -681611 -653987 -644876
13577 -644876 -745815 -820480 -851476 -888041 -853544 -802237 -675479 -574630 -522293 -600405 -705253
13566 -705253 -646005 -571426 -625268 -668636 -644560 -653902 -649948 -692138 -720649 -673967 -627066 -615087
13554 -615087 -682198 -752558 -704093 -656943 -742034 -821947 -829840 -748423 -749523 -832211 -816905 -766725
13542 -766725 -675776 -601775 -576107 -621756 -735561 -706157 -671013 -690794 -720625 -772162 -813953
13531 -813953 -859389 -841025 -778445 -743344 -721977 -672515 -647699 -619870 -579742 -580849 -593399 -554446
13519 -554446 -604424 -679336 -698979 -632820 -589072 -605347 -625628 -681237 -692457 -726947 -752204
13508 -752204 -783506 -719860 -672023 -712203 -784106 -901052 -840032 -707831 -653773 -544627 -568598
13497 -568598 -653595 -701909 -707822 -698991 -743027 -735748 -663513 -691466 -699945 -709314 -709042 -760810 -678158
13484 -678158 -719152 -765851 -793347 -866241 -860794 -702712 -636553 -697938 -695507 -713061 -709879 -688394
13472 -688394 -673128 -690567 -743377 -676342 -653442 -660812 -730035 -787560 -800097 -758910 -695486 -642182
13460 -642182 -634540 -602861 -569546 -567600 -545028 -615701 -633836 -613981 -661463 -673393 -737499 -780444
13448 -780444 -784111 -752353 -649543 -619378 -635377 -650426 -660169 -655497 -575684 -617452 -700391 -743439
13436 -743439 -756245 -704586 -759959 -839487 -772226 -685073 -699396 -739733 -689746 -679595 -665214
13425 -665214 -633190 -656750 -610697 -611172 -657711 -682383 -715489 -717480 -655114 -641584 -556176 -543709
13413 -543709 -610779 -665835 -660153 -728716 -686409 -724677 -730574 -566132 -523890 -602664 -659375 -735796
13401 -735796 -734680 -717182 -715812 -750538 -690889 -650604 -691096 -643631 -631651 -692100 -730940 -712441
13389 -712441 -615786 -611845 -585083 -671211 -700973 -682920 -729159 -814488 -723615 -643021 -616903 -664597
13377 -664597 -696351 -679378 -652024 -691678 -799992 -798843 -796847 -692545 -653402 -721466 -744790
13366 -744790 -693460 -706923 -653625 -655988 -662602 -647661 -582434 -514459 -568930 -620361 -640411 -584096
13354 -584096 -525862 -598911 -657368 -569788 -606727 -613305 -642610 -661849 -709657 -677217 -667686 -658001
13342 -658001 -735205 -758037 -713740 -714812 -642907 -535822 -523434 -528710 -528172 -666711 -762066 -759830
13330 -759830 -653718 -624035 -629037 -669613 -632702 -631269 -612496 -635512 -721488 -685633 -632194 -620698
13318 -620698 -636959 -553922 -495736 -525753 -598842 -598505 -593605 -550549 -598656 -618560 -646948 -652496
13306 -652496 -644193 -620410 -571343 -563659 -689805 -749026 -724662 -716592 -746541 -775055 -760687 -731881
13294 -731881 -654176 -628705 -706438 -817100 -785847 -782086 -704860 -618749 -597181 -596095 -624705 -684643
13282 -684643 -697259 -688627 -721958 -692784 -678857 -722306 -732046 -582515 -524220 -546865 -603534 -636280
13270 -636280 -731882 -764623 -766148 -683017 -668387 -636860 -666566 -645388 -620277 -585834 -550924 -525947
13258 -525947 -556459 -643040 -669777 -598008 -643343 -635363 -615624 -468782 -527297 -577124 -659910
13247 -659910 -629674 -516383 -490473 -554176 -636859 -737592 -755315 -726734 -632282 -602100 -625990
13236 -625990 -663674 -701553 -677408 -648989 -661493 -662007 -726405 -766337 -718493 -580693 -564079 -570367
13224 -570367 -670198 -703580 -693942 -671568 -650355 -583093 -601291 -617100 -684849 -706151 -693621 -657872
13212 -657872 -661057 -669042 -655551 -635090 -672905 -726671 -762390 -793015 -831162 -833681 -738130 -676531
13200 -676531 -711190 -675756 -712214 -734392 -683171 -692114 -766066 -716545 -649070 -618059 -698247 -692580
13188 -692580 -666452 -635936 -580427 -552208 -533493 -559564 -587016 -697946 -643872 -585073 -560163
13177 -560163 -541011 -573944 -627506 -618956 -621597 -575159 -551979 -614241 -583192 -539880 -599025 -604796
13165 -604796 -542596 -433899 -368141 -396488 -474935 -664168 -870266 -945740 -923153 -916438 -883292
13154 -883292 -893085 -873245 -858520 -787130 -630636 -666845 -774853 -823592 -840565 -786406 -782142
13143 -782142 -784025 -816690 -778673 -685237 -660938 -709648 -655650 -634751 -679577 -641517 -596085 -594842
13131 -594842 -548778 -464414 -418927 -449096 -529674 -559738 -499587 -477473 -475926 -463158 -516481 -449137
13119 -449137 -402684 -403547 -477487 -478332 -642063 -858187 -913182 -871682 -876612 -852462 -823739 -846596
13107 -846596 -835022 -798914 -777026 -834129 -844870 -786405 -675336 -673755 -727634 -807534 -791018
13096 -791018 -739041 -818030 -937218 -906273 -894125 -900724 -856845 -882242 -929432 -884560 -826979
13085 -826979 -754226 -797146 -683816 -609199 -672666 -734725 -716618 -730558 -754991 -658062 -539755
$$ [...]
##END NTUPLES=NMR SPECTRUM
##END=
